{"text_format":"1","workbook":"xlsx","n_sheets":7,"sheets":["Index","Notes & Assumptions","Inputs","Calculations","Outputs|Models","Outputs|Tables","Outputs|RIN"],"not_rendered":{"charts":0,"images":0,"macros":1,"external_links":2,"defined_names":143,"comments":0,"pivot_tables":0},"unopened":[],"bounds":{"document_bytes":16777216,"sheet_cells":100000,"rows_first":2000,"rows_last":500,"rows_between":2000,"halvings":0,"cell_chars":16384,"cell_head_chars":4096},"cells_cut":0,"cells_raw":0,"read":"whole","date_system":"1900"}

{"sheet":"Index","index":0,"n_rows":21,"n_cols":11,"rows_kept":21,"cut":false,"hidden":false,"merged":[]}
["Index and File Details"]
[]
[null,"Index",null,null,null,null,null,"File Details"]
[]
[null,"Inputs",null,"Inputs / Calculations",null,"Outputs",null,null,"Model","Transgrid | Waratah Super Battery - Capex Forecast Model"]
[null,null,null,null,null,null,null,null,"Author","Transgrid"]
[null,"Notes & Assumptions",null,"Calculations",null,{"$f":"'Outputs|Models'!$A$1","v":"Outputs | Models"},null,null,"Revision","2023-06-30"]
[null,"Inputs",null,null,null,{"$f":"'Outputs|Tables'!$A$1","v":"Outputs | Tables"},null,null,"Status","Regulatory proposal"]
[null,null,null,null,null,{"$f":"'Outputs|RIN'!$A$1","v":"Outputs | RIN"}]
[]
[]
[null,"Model Checks",null,null,null,null,null,"Instructions"]
[]
[null,"Worksheet",null,null,null,null,null,null,"Input Sheets"]
[null,null,null,null,null,null,null,null,"Fill in any cells marked as input cells as seen on the right =>",null,"user input"]
[null,{"$f":"D7","v":"Calculations"},null,{"$f":"SUM(Calculations!A3:A209)","v":0},null,null,null,null,"Historical / Not applicable"]
[null,{"$f":"F7","v":"Outputs | Models"},null,{"$f":"SUM('Outputs|Models'!A2:A96)","v":0},null,null,null,null,"Cells not marked as inputs should not be modified."]
[null,{"$f":"F8","v":"Outputs | Tables"},null,{"$f":"SUM('Outputs|Tables'!A2:A101)","v":0}]
[null,{"$f":"F9","v":"Outputs | RIN"},null,{"$f":"SUM('Outputs|RIN'!A2:A113)","v":0}]
[]
{"$rows_left_out":2}
{"sheet":"Notes & Assumptions","index":1,"n_rows":11,"n_cols":5,"rows_kept":11,"cut":false,"hidden":false,"merged":[]}
["Assumptions & Notes"]
[]
[null,null,null,null,"User inputs in cells coloured like this"]
[null,null,"*",null,"1.     Financial years are recorded in the Capex Forecast Model as tax years (e.g. 2017/18 is shown as 2018, 2018/19 is shown as 2019)"]
[null,null,"*",null,"2.     Escalation is treated as follows:"]
[null,null,null,null,"a.    CPI escalation and Labour escalation are treated separately. "]
[]
[]
["Modifications"]
["Date","Version",null,"Who","Notes"]
["2023-06-30","v1.1",null,null,"Initial model development"]

{"sheet":"Inputs","index":2,"n_rows":213,"n_cols":33,"rows_kept":213,"cut":false,"hidden":false,"merged":[[5,1,5,2],[18,0,18,2],[12,0,12,2],[35,0,35,2],[35,7,35,8],[24,0,24,2],[151,0,151,2],[61,0,61,2],[119,0,119,2],[88,4,88,5],[88,0,88,2]]}
["Inputs"]
["AER amendments"]
[]
["Output Reporting Format and Year"]
["Real"]
[2024]
[]
[{"$f":" IF(Real_or_Nom=\"Real\", \"Real $\" & Report_Year, \"$ Nominal\")","v":"Real $2024"}]
[]
["Inflation and Labour Escalation"]
[]
[]
["Forecasts",null,null,null,null,null,null,null,null,null,"Rates"]
["Item","Source","Units",null,null,null,null,null,null,null,{"$f":"K20","v":2020},2021,2022,2023,2024,2025,2026,2027,2028,2029]
["Actual / Forecast Inflation ","ABS June to June / RBA Forecast","%",null,null,null,null,null,null,null,-3.4843205574912606E-3,3.8461538461538325E-2,6.1447811447811418E-2,6.3E-2,3.5999999999999997E-2,2.7498479316033997E-2,2.7498479316033997E-2,2.7498479316033997E-2,2.7498479316033997E-2,2.7498479316033997E-2,"◄ Actual June year on year inflation used for 2019 to 2022. Forecast inflation for 2023 to 2029 as per Regulatory Proposal, updated for RBAs May 2023 MPS."]
["Real labour escalation","AER Final Determination / Transgrid proposal","%",null,null,null,null,null,null,null,null,null,null,null,3.9046564755527329E-3,1.3076482545953276E-2,1.1546438954636147E-2,4.3304575862308627E-3,3.00941333753012E-3,{"$f":"AVERAGE(O16:S16)","v":7.1734897799806269E-3},"Note: Based on Final Decision values applied to both the opex and capex models with a placeholder value for 2028-29"]
[]
[]
["Cumulative Factors",null,null,null,null,null,null,null,null,null,"Cumulative factors"]
["Item","Source","Units",null,null,null,null,null,null,{"$f":"K20-1","v":2019},2020,{"$f":"K20+1","v":2021},2022,2023,2024,2025,2026,2027,2028,2029,"Nominal"]
{"$rows_left_out":194}
{"sheet":"Calculations","index":3,"n_rows":211,"n_cols":20,"rows_kept":211,"cut":false,"hidden":false,"merged":[]}
["Calculations",null,null,null,{"$f":"Inputs!$A$8","v":"Real $2024"}]
[]
[null,"Incremental Capital Expenditure (Excluding Equity Raising Costs) by Capex Category",null,null,null,null,null,null,null,null,null,null,null,null,"Total",null,"Mapping","Mapping"]
[null,"Capex category","Dollar basis","Units",{"$f":"Inputs!K$20","v":2020},{"$f":"Inputs!L$20","v":2021},{"$f":"Inputs!M$20","v":2022},{"$f":"Inputs!N$20","v":2023},{"$f":"Inputs!O$20","v":2024},{"$f":"Inputs!P$20","v":2025},{"$f":"Inputs!Q$20","v":2026},{"$f":"Inputs!R$20","v":2027},{"$f":"Inputs!S$20","v":2028},{"$f":"Inputs!T$20","v":2029},null,null,"RAB Asset Class","RIN Network and Non network"]
[]
[null,"Direct Non-Labour Costs"]
[null,{"$f":"Inputs!$A$160","v":"Transmission Lines - Transmission Towers"},{"$f":"Inputs!$A$8","v":"Real $2024"},"$Million",0,0,0,0,2.2736342652041057,4.3349443940378389,0,0,0,0,{"$f":"SUM(E7:N7)","v":6.6085786592419442},null,{"$f":"Inputs!B160","v":"Transmission Lines "},{"$f":"Inputs!C160","v":"Transmission Towers"}]
[null,{"$f":"Inputs!$A$161","v":"Transmission Lines - Transmission tower support structures"},{"$f":"Inputs!$A$8","v":"Real $2024"},"$Million",0,0,0,0,19.425190627923758,43.727576938905436,0,0,0,0,{"$f":"SUM(E8:N8)","v":63.152767566829198},null,{"$f":"Inputs!B161","v":"Transmission Lines "},{"$f":"Inputs!C161","v":"Transmission tower support structures"}]
[null,{"$f":"Inputs!$A$162","v":"Transmission Lines - Conductors"},{"$f":"Inputs!$A$8","v":"Real $2024"},"$Million",0,0,0,0,0,0,0,0,0,0,{"$f":"SUM(E9:N9)","v":0},null,{"$f":"Inputs!B162","v":"Transmission Lines "},{"$f":"Inputs!C162","v":"Conductors"}]
[null,{"$f":"Inputs!$A$163","v":"Transmission Lines - Transmission line life extension"},{"$f":"Inputs!$A$8","v":"Real $2024"},"$Million",0,0,0,0,0,0,0,0,0,0,{"$f":"SUM(E10:N10)","v":0},null,{"$f":"Inputs!B163","v":"Transmission Line Life Extension "},{"$f":"Inputs!C163","v":"Transmission cables"}]
[null,{"$f":"Inputs!$A$164","v":"Underground cables - Transmission cables"},{"$f":"Inputs!$A$8","v":"Real $2024"},"$Million",0,0,0,0,0,0,0,0,0,0,0,null,{"$f":"Inputs!B164","v":"Underground Cables "},{"$f":"Inputs!C164","v":"Transmission cables"}]
[null,{"$f":"Inputs!$A$165","v":"Substations - Substation switchbays"},{"$f":"Inputs!$A$8","v":"Real $2024"},"$Million",0,0,0,0,34.440399479539515,62.485672501394454,11.4969102559477,0,0,0,108.42298223688167,null,{"$f":"Inputs!B165","v":"Substations  "},{"$f":"Inputs!C165","v":"Substation switchbays"}]
[null,{"$f":"Inputs!$A$166","v":"Substations - Substation power transformers"},{"$f":"Inputs!$A$8","v":"Real $2024"},"$Million",0,0,0,0,0,0,0,0,0,0,0,null,{"$f":"Inputs!B166","v":"Substations  "},{"$f":"Inputs!C166","v":"Substation power transformers"}]
[null,{"$f":"Inputs!$A$167","v":"Substations - Substation reactive plant"},{"$f":"Inputs!$A$8","v":"Real $2024"},"$Million",0,0,0,0,0,0,0,0,0,0,0,null,{"$f":"Inputs!B167","v":"Substations  "},{"$f":"Inputs!C167","v":"Substation reactive plant"}]
[null,{"$f":"Inputs!$A$168","v":"Secondary Systems - Scada, network control and protection systems"},{"$f":"Inputs!$A$8","v":"Real $2024"},"$Million",0,0,0,0,0,0,0,0,0,0,0,null,{"$f":"Inputs!B168","v":"Secondary Systems "},{"$f":"Inputs!C168","v":"Scada, network control and protection systems"}]
[null,{"$f":"Inputs!$A$169","v":"Communications (short life) - Scada, network control and protection systems"},{"$f":"Inputs!$A$8","v":"Real $2024"},"$Million",0,0,0,0,0,0,0,0,0,0,0,null,{"$f":"Inputs!B169","v":"Communications (short life) "},{"$f":"Inputs!C169","v":"Scada, network control and protection systems"}]
[null,{"$f":"Inputs!$A$170","v":"SIPS Control"},{"$f":"Inputs!$A$8","v":"Real $2024"},"$Million",0,0,0,0.56603719257814422,3.1408572512660005,1.3333320000000002,0,0,0,0,{"$f":"SUM(E17:N17)","v":5.0402264438441451},null,{"$f":"Inputs!B170","v":"SIPS Control"},{"$f":"Inputs!C170","v":"Scada, network control and protection systems"}]
[null,{"$f":"Inputs!$A$171","v":"Synchronous condensers"},{"$f":"Inputs!$A$8","v":"Real $2024"},"$Million",0,0,0,0,0,0,0,0,0,0,0,null,{"$f":"Inputs!B171","v":"Synchronous Condensers "},{"$f":"Inputs!C171","v":"Other network"}]
[null,{"$f":"Inputs!$A$172","v":"Other - Leasehold land and property"},{"$f":"Inputs!$A$8","v":"Real $2024"},"$Million",0,0,0,0,0,0,0,0,0,0,0,null,{"$f":"Inputs!B172","v":"Leasehold Land and Property "},{"$f":"Inputs!C172","v":"Buildings and Property"}]
[null,{"$f":"Inputs!$A$173","v":"Other - Land and Easements"},{"$f":"Inputs!$A$8","v":"Real $2024"},"$Million",0,0,0,0,0,0,0,0,0,0,0,null,{"$f":"Inputs!B173","v":"Land and Easements  "},{"$f":"Inputs!C173","v":"Other non network"}]
{"$rows_left_out":192}
{"sheet":"Outputs|Models","index":4,"n_rows":96,"n_cols":28,"rows_kept":96,"cut":false,"hidden":false,"merged":[[25,18,26,18],[25,19,26,19]]}
["Outputs | Models"]
[]
["Outputs | PTRM"]
[]
[null,"As Incurred",null,"Dollar basis","Units",{"$f":"Inputs!K$20","v":2020},{"$f":"F5+1","v":2021},2022,2023,2024,2025,2026,2027,2028,2029,"Total"]
[null,"Capex"]
[null,{"$f":"Inputs!$A$182","v":"Transmission Lines "},null,{"$f":"Inputs!$A$8","v":"Real $2024"},"$Million",null,null,null,null,null,{"$f":"K72","v":55.99118406468191},0,0,0,0,{"$f":"SUM(F7:O7)","v":55.99118406468191}]
[null,{"$f":"Inputs!$A$183","v":"Underground Cables "},null,{"$f":"Inputs!$A$8","v":"Real $2024"},"$Million",null,null,null,null,null,0,0,0,0,0,{"$f":"SUM(F8:O8)","v":0}]
[null,{"$f":"Inputs!$A$184","v":"Substations  "},null,{"$f":"Inputs!$A$8","v":"Real $2024"},"$Million",null,null,null,null,null,72.793659038294123,13.266835399709123,0,0,0,86.060494438003246]
[null,{"$f":"Inputs!$A$185","v":"Secondary Systems "},null,{"$f":"Inputs!$A$8","v":"Real $2024"},"$Million",null,null,null,null,null,0,0,0,0,0,0]
[null,{"$f":"Inputs!$A$186","v":"Communications (short life) "},null,{"$f":"Inputs!$A$8","v":"Real $2024"},"$Million",null,null,null,null,null,0,0,0,0,0,0]
[null,{"$f":"Inputs!$A$187","v":"SIPS Control"},null,{"$f":"Inputs!$A$8","v":"Real $2024"},"$Million",null,null,null,null,null,2.451750617261836,0,0,0,0,{"$f":"SUM(F12:O12)","v":2.451750617261836}]
[null,{"$f":"Inputs!$A$188","v":"Business IT "},null,{"$f":"Inputs!$A$8","v":"Real $2024"},"$Million",null,null,null,null,null,{"$f":"K78","v":0},0,0,0,0,0]
[null,{"$f":"Inputs!$A$189","v":"Minor Plant, Motor Vehicles & Mobile Plant "},null,{"$f":"Inputs!$A$8","v":"Real $2024"},"$Million",null,null,null,null,null,0,0,0,0,0,0]
[null,{"$f":"Inputs!$A$190","v":"Transmission Line Life Extension "},null,{"$f":"Inputs!$A$8","v":"Real $2024"},"$Million",null,null,null,null,null,0,0,0,0,0,0]
[null,{"$f":"Inputs!$A$191","v":"Land and Easements  "},null,{"$f":"Inputs!$A$8","v":"Real $2024"},"$Million",null,null,null,null,null,0,0,0,0,0,0]
[null,{"$f":"Inputs!$A$192","v":"Synchronous Condensers "},null,{"$f":"Inputs!$A$8","v":"Real $2024"},"$Million",null,null,null,null,null,0,0,0,0,0,0]
[null,{"$f":"Inputs!$A$193","v":"Leasehold Land and Property "},null,{"$f":"Inputs!$A$8","v":"Real $2024"},"$Million",null,null,null,null,null,0,0,0,0,0,0]
[null,{"$f":"Inputs!$A$194","v":"Buildings - capital works "},null,{"$f":"Inputs!$A$8","v":"Real $2024"},"$Million",null,null,null,null,null,0,0,0,0,0,0]
[null,{"$f":"Inputs!$A$195","v":"In-house software "},null,{"$f":"Inputs!$A$8","v":"Real $2024"},"$Million",null,null,null,null,null,0,0,0,0,0,0]
{"$rows_left_out":77}
{"sheet":"Outputs|Tables","index":5,"n_rows":101,"n_cols":27,"rows_kept":101,"cut":false,"hidden":false,"merged":[]}
["Outputs | Tables",null,null,null,null,{"$f":"Inputs!A8","v":"Real $2024"}]
[null,"AER amendments"]
["Table 5-2: Total forecast capex for WSB ($M, Real 2023-24)"]
[]
[null,null,null,null,null,"Actuals","Estimates",null,"Forecast",null,null,null,null,"Total"]
[null,"Capex nature",null,"Dollar basis","Units","2022-23","2022-23","2023-24","2024-25","2025-26","2026-27","2027-28","2028-29","Next Period","All years"]
[null,"Augmentation- Transmission lines",null,{"$f":"Inputs!$A$8","v":"Real $2024"},"$Million",{"$f":"F42","v":0},{"$f":"G42","v":0},21.698824893127863,48.062521332943277,0,0,0,0,{"$f":"SUM(I7:M7)","v":48.062521332943277},{"$f":"SUM(F7:M7)","v":69.76134622607114}]
[null,"Augmentation- Substations",null,{"$f":"Inputs!$A$8","v":"Real $2024"},"$Million",{"$f":"F53","v":0},{"$f":"G53","v":0},34.440399479539515,62.485672501394454,11.4969102559477,0,0,0,{"$f":"SUM(I8:M8)","v":73.982582757342158},{"$f":"SUM(F8:M8)","v":108.42298223688167}]
[null,"SIPS control","Includes future paired generation costs",{"$f":"Inputs!$A$8","v":"Real $2024"},"$Million",{"$f":"F66","v":0.82476034281200006},{"$f":"G66","v":1.0697619122381585},8.7423096067411201,2.451750617261836,0,0,0,0,{"$f":"SUM(I9:M9)","v":2.451750617261836},{"$f":"SUM(F9:M9)","v":13.088582479053116}]
[null,"Labour and indirect costs","Excludes the 'SIPS Control Implementation' category mapped to SIPS control",{"$f":"Inputs!$A$8","v":"Real $2024"},"$Million",{"$f":"Inputs!N113+Inputs!N146-F61","v":3.4961008737480008},{"$f":"Inputs!N114+Inputs!N147-G61","v":6.0415564920398079},{"$f":"Inputs!O114+Inputs!O147-H61","v":27.621935514454911},{"$f":"Inputs!P114+Inputs!P147-I61","v":18.019465851536754},{"$f":"Inputs!Q114+Inputs!Q147-J61","v":1.7374029301731513},{"$f":"Inputs!R114+Inputs!R147-K61","v":0},{"$f":"Inputs!S114+Inputs!S147-L61","v":0},{"$f":"Inputs!T114+Inputs!T147-M61","v":0},{"$f":"SUM(I10:M10)","v":19.756868781709905},{"$f":"SUM(F10:M10)","v":56.916461661952631}]
[null,"Real input costs",null,{"$f":"Inputs!$A$8","v":"Real $2024"},"$Million",{"$f":"Inputs!N113*Inputs!N$22/INDEX(Inputs!$K$22:$T$22,MATCH(Inputs!$F$91,Years,0))-Inputs!N113","v":0},{"$f":"Inputs!N114*Inputs!N$22/INDEX(Inputs!$K$22:$T$22,MATCH(Inputs!$F$91,Years,0))-Inputs!N114","v":0},{"$f":"Inputs!O114*Inputs!O$22/INDEX(Inputs!$K$22:$T$22,MATCH(Inputs!$F$91,Years,0))-Inputs!O114","v":7.8721722007486505E-2},{"$f":"Inputs!P114*Inputs!P$22/INDEX(Inputs!$K$22:$T$22,MATCH(Inputs!$F$91,Years,0))-Inputs!P114","v":0.21718341710154832},{"$f":"Inputs!Q114*Inputs!Q$22/INDEX(Inputs!$K$22:$T$22,MATCH(Inputs!$F$91,Years,0))-Inputs!Q114","v":3.2522213588272786E-2},{"$f":"Inputs!R114*Inputs!R$22/INDEX(Inputs!$K$22:$T$22,MATCH(Inputs!$F$91,Years,0))-Inputs!R114","v":0},{"$f":"Inputs!S114*Inputs!S$22/INDEX(Inputs!$K$22:$T$22,MATCH(Inputs!$F$91,Years,0))-Inputs!S114","v":0},{"$f":"Inputs!T114*Inputs!T$22/INDEX(Inputs!$K$22:$T$22,MATCH(Inputs!$F$91,Years,0))-Inputs!T114","v":0},{"$f":"SUM(I11:M11)","v":0.2497056306898211},{"$f":"SUM(F11:M11)","v":0.32842735269730761}]
[null,"Total capex",null,{"$f":"Inputs!$A$8","v":"Real $2024"},"$Million",{"$f":"SUM(F7:F11)","v":4.3208612165600009},7.1113184042779665,92.582191215870893,131.23659372023786,13.266835399709123,0,0,0,144.50342911994699,248.51779995665586]
[]
[{"$f":"IF(SUM(F14:K14)=0,0,1)","v":0},"Check - As incurred",null,null,null,null,{"$f":"IF(ROUND(F12+G12-'Outputs|Models'!I86,3)=0,0,1)","v":0},{"$f":"IF(ROUND(H12-'Outputs|Models'!J86,3)=0,0,1)","v":0},{"$f":"IF(ROUND(I12-'Outputs|Models'!K86,3)=0,0,1)","v":0},{"$f":"IF(ROUND(J12-'Outputs|Models'!L86,3)=0,0,1)","v":0},{"$f":"IF(ROUND(K12-'Outputs|Models'!M86,3)=0,0,1)","v":0},{"$f":"IF(ROUND(L12-'Outputs|Models'!N86,3)=0,0,1)","v":0},{"$f":"IF(ROUND(M12-'Outputs|Models'!O86,3)=0,0,1)","v":0}]
[]
["Table 5-4: Total forecast capex for WSB by category ($M, Real 2023-24)"]
[]
[null,"Capex nature","Forecasting method","Capex $M","% of total capex"]
[{"$f":"IF(ROUND(SUM(D19:D21)-O7,3)=0,0,1)","v":0},"Augmentation- Transmission lines","Competitive ECI Design & Construct contract",{"$f":"O39","v":68.252875614684342},{"$f":"IF($D$33=0,0,D19/$D$33)","v":0.27463978687477669}]
[null,null,"Rates from our procurement panels for key equipment",{"$f":"O40","v":1.4266690873867889},{"$f":"IF($D$33=0,0,D20/$D$33)","v":5.7407118831553118E-3}]
{"$rows_left_out":82}
{"sheet":"Outputs|RIN","index":6,"n_rows":113,"n_cols":22,"rows_kept":113,"cut":false,"hidden":false,"merged":[[34,1,34,9]]}
["Outputs | RIN"]
[]
["4. Expenditure summary"]
[]
[null,"4.1 Capital costs (real $m, Jun 2024)"]
[null,null,"Total","2022-23","2023-24","2024-25","2025-26","2026-27","2027-28","2028-29"]
[]
[null,"Development and construction capital costs (as determined under the TET)"]
[null,"Capital expenditure",{"$f":"SUM(D9:J9)","v":231.65019126317139},{"$f":"Calculations!H92-D13","v":9.3236313339160226},{"$f":"Calculations!I92-E13","v":83.772369454235886},{"$f":"Calculations!J92-F13","v":125.77173203471828},{"$f":"Calculations!K92-G13","v":12.782458440301177},{"$f":"Calculations!L92-H13","v":0},{"$f":"Calculations!M92-I13","v":0},{"$f":"Calculations!N92-J13","v":0},"Note: TransGrid is defining this network expenditure excluding support costs"]
[null,"Asset disposals",{"$f":"SUM(D10:J10)","v":0},null,null,null,null,null,null,null,"Note: No asset disposals for this project"]
[null,"Depreciation",{"$f":"SUM(D11:J11)","v":0},null,null,null,null,null,null,null,"Note: Depreciation is calculated in the PTRM i.e. this row will be calculated elsewhere"]
[null,"Other capital costs"]
[null,{"$f":"B9","v":"Capital expenditure"},{"$f":"SUM(D13:J13)","v":16.867608693484478},{"$f":"D84+D90","v":2.1085482869219465},{"$f":"E84+E90","v":8.8098217616350087},5.4648616855195762,0.48437695940794545,0,0,0,"Note: This category includes network and non network support costs and labour related 'IT Hardware expenses'"]
[null,{"$f":"B10","v":"Asset disposals"},{"$f":"SUM(D14:J14)","v":0}]
[null,{"$f":"B11","v":"Depreciation"},{"$f":"SUM(D15:J15)","v":0}]
[null,"Total capital costs"]
[null,{"$f":"B9","v":"Capital expenditure"},{"$f":"C9+C13","v":248.51779995665586},11.432179620837969,92.582191215870893,131.23659372023786,13.266835399709123,0,0,0]
[null,{"$f":"B10","v":"Asset disposals"},0,0,0,0,0,0,0,0]
[null,{"$f":"B11","v":"Depreciation"},0,0,0,0,0,0,0,0]
[]
{"$rows_left_out":93}