{"text_format":"1","workbook":"xlsx","n_sheets":5,"sheets":["Index","Notes & Assumptions","Inputs","Calculations","Outputs"],"not_rendered":{"charts":0,"images":0,"macros":1,"external_links":0,"defined_names":139,"comments":0,"pivot_tables":0},"unopened":[],"bounds":{"document_bytes":16777216,"sheet_cells":100000,"rows_first":2000,"rows_last":500,"rows_between":2000,"halvings":0,"cell_chars":16384,"cell_head_chars":4096},"cells_cut":0,"cells_raw":0,"read":"whole","date_system":"1900"}

{"sheet":"Index","index":0,"n_rows":17,"n_cols":11,"rows_kept":17,"cut":false,"hidden":false,"merged":[]}
["Index and File Details"]
[]
[null,"Index",null,null,null,null,null,"File Details"]
[]
[null,"Inputs",null,"Calculations",null,"Outputs",null,null,"Model","Transgrid | WSB Non-Contestable Opex Forecast Model"]
[null,null,null,null,null,null,null,null,"Author","Transgrid"]
[null,"Notes & Assumptions",null,"Calculations",null,"Outputs",null,null,"Revision","2023-06-30"]
[null,{"$f":"Inputs!A1","v":"Inputs"},null,null,null,null,null,null,"Status","Revenue Proposal"]
[]
[]
[]
[null,null,null,null,null,null,null,"Instructions"]
[]
[null,null,null,null,null,null,null,null,"Input Sheets"]
[null,null,null,null,null,null,null,null,"Fill in any cells marked as input cells as seen on the right =>",null,"user input"]
[null,null,null,null,null,null,null,null,"Historical / Not applicable"]
[null,null,null,null,null,null,null,null,"Cells not marked as inputs should not be modified."]

{"sheet":"Notes & Assumptions","index":1,"n_rows":12,"n_cols":5,"rows_kept":12,"cut":false,"hidden":false,"merged":[]}
["Assumptions & Notes"]
[]
[null,null,null,null,"User inputs in cells coloured like this"]
[null,null,"*",null,"1.     Inputs and calculations are in $. Some outputs are $million."]
[null,null,"*",null,"2.     Financial years are recorded in the Opex Forecast Model as tax years (e.g. 2017/18 is shown as 2018, 2018/19 is shown as 2019)"]
[null,null,"*",null,"3.     Escalation is treated as follows:"]
[null,null,null,null,"a.    CPI escalation and Commodity escalation are treated separately. "]
[]
[]
["Modifications"]
["Date","Version",null,"Who","Notes"]
["2023-06-26","v1.1",null,null,"Initial model development"]

{"sheet":"Inputs","index":2,"n_rows":125,"n_cols":26,"rows_kept":125,"cut":false,"hidden":false,"merged":[[28,21,28,23],[109,14,109,19],[100,13,100,19],[118,15,118,19],[5,2,5,5],[28,15,28,19],[12,13,12,19],[18,13,18,19],[28,5,28,6],[49,5,49,6],[49,14,49,19]]}
["Inputs"]
[null,"AER amendments"]
[]
[null,"Output Reporting Format and Year"]
[null,"Real"]
[null,2024,"The Financial Year that results are reported in."]
[]
[null,{"$f":" IF(Real_or_Nom=\"Real\", \"Real $\" & Report_Year, \"$ Nominal\")","v":"Real $2024"}]
[]
[null,"Indexation and escalation"]
[]
[]
[null,"Forecasts",null,null,null,null,null,null,null,null,null,null,null,"Rates"]
[null,"Item","Source","Units",null,null,null,null,null,null,null,null,null,2023,{"$f":"N14+1","v":2024},2025,2026,2027,2028,2029]
[null,"Actual / Forecast Inflation ","ABS / RBA / PTRM","%",null,null,null,null,null,null,null,null,null,6.3E-2,3.5999999999999997E-2,2.7498479316033997E-2,2.7498479316033997E-2,2.7498479316033997E-2,2.7498479316033997E-2,2.7498479316033997E-2,null,"Note: Currently set to June to June unlagged for actual/estimates and PTRM for forecasts"]
[null,"Real labour escalation","Transgrid AER FD","%",null,null,null,null,null,null,null,null,null,null,3.9046564755527329E-3,1.3076482545953276E-2,1.1546438954636147E-2,4.3304575862308627E-3,3.00941333753012E-3,{"$f":"AVERAGE(O16:S16)","v":7.1734897799806269E-3},null,"Note: Based on Final Decision values applied to both the opex and capex models"]
[]
[]
[null,"Cumulative factors",null,null,null,null,null,null,null,null,null,null,null,"Cumulative Factors"]
[null,"Item","Source","Units",null,null,null,null,null,null,null,null,null,{"$f":"N$14","v":2023},{"$f":"O$14","v":2024},2025,2026,2027,2028,2029]
[null,"Nominal (mid year) to Real 2024 (end year)","Calculated","Factor",null,null,null,null,null,null,null,null,null,{"$f":"O21*(1+O15)^0.5*(1+N15)^0.5","v":1.0681355943886524},{"$f":"(1+O15)^0.5","v":1.0178408519999578},{"$f":"O21/(1+O15)^0.5/(1+P15)^0.5","v":0.98652797735725628},{"$f":"P21/(1+P15)^0.5/(1+Q15)^0.5","v":0.96012597314396986},{"$f":"Q21/(1+Q15)^0.5/(1+R15)^0.5","v":0.93443055388567453},{"$f":"R21/(1+R15)^0.5/(1+S15)^0.5","v":0.90942280956725985},{"$f":"S21/(1+S15)^0.5/(1+T15)^0.5","v":0.88508433625383798},null,"Note: this index converts from nominal mid year dollars for each year between 2022-23 to 2028-29 to dollars as at the end of 2023-24 (i.e., Real 2024, 30 June 2024)."]
[null,"Nominal (end year) to Real 2024 (end year)","Calculated","Factor",null,null,null,null,null,null,null,null,null,{"$f":"O22*(1+O15)","v":1.036},1,{"$f":"O22/(1+P15)","v":0.97323745010859897},{"$f":"P22/(1+Q15)","v":0.94719113429388768},{"$f":"Q22/(1+R15)","v":0.92184188430565484},{"$f":"R22/(1+S15)","v":0.8971710448849417},{"$f":"S22/(1+T15)","v":0.87316046003508807}]
[null,"Labour escalation from 2023","Calculated","Factor",null,null,null,null,null,null,null,null,null,1,{"$f":"N23*(1+O16)","v":1.0039046564755527},1.0170321981937565,1.0287752983851002,1.0332303661805189,1.0363397834252435,1.0437739562702317]
[]
[]
[]
[null,"Maintenance expenditure"]
[]
[null,"Maintenance plan requirements",null,null,null,"Conversion",null,null,null,null,null,"Defect",null,null,null,"Quantities ",null,null,null,null,null,"Rates (Real $2023)",null,null,null,"Note: unit rates are assumed to be in mid-year dollars"]
[null,"Item","Plan Component","Maintenance Activity",null,"Dollar Year","Escalation Year",null,"Asset class","Location",null,"Allowance (%)",null,null,null,{"$f":"P$20","v":2025},{"$f":"Q$20","v":2026},{"$f":"R$20","v":2027},{"$f":"S$20","v":2028},{"$f":"T$20","v":2029},null,"Code","Labour","Materials"]
[null,"Transmission lines",null,null,null,2023,2023]
[null,"Requirement 1","c-i-c","c-i-c",null,"Mid",null,null,"Transmission Lines","TL39, 3L/4, 5",null,0.8,null,null,null,"c-i-c","c-i-c","c-i-c","c-i-c","c-i-c",null,"TLELDC","c-i-c","c-i-c"]
[null,"Requirement 2","c-i-c","c-i-c",null,null,null,null,"Transmission Lines","TL39, 3L/4, 5",null,0.8,null,null,null,"c-i-c","c-i-c","c-i-c","c-i-c","c-i-c",null,"TLELDT","c-i-c","c-i-c"]
[null,"Requirement 3","c-i-c","c-i-c",null,null,null,null,"Transmission Lines","TL39, 3L/4, 5",null,0.8,null,null,null,"c-i-c","c-i-c","c-i-c","c-i-c","c-i-c",null,"TLELDC","c-i-c","c-i-c"]
[null,"Requirement 4","c-i-c","c-i-c",null,null,null,null,"Transmission Lines","TL39, 3L/4, 5",null,0.8,null,null,null,"c-i-c","c-i-c","c-i-c","c-i-c","c-i-c",null,"TLELDT","c-i-c","c-i-c"]
[null,"Substations"]
[null,"Requirement 1","c-i-c","c-i-c",null,null,null,null,"Substations","Liddell and Newcastle",null,2,null,null,null,"c-i-c","c-i-c","c-i-c","c-i-c","c-i-c",null,"S0160B","c-i-c","c-i-c"]
[null,"Requirement 2","c-i-c","c-i-c",null,null,null,null,"Substations","Northern & Southern Sites",null,2,null,null,null,"c-i-c","c-i-c","c-i-c","c-i-c","c-i-c",null,"S0955C","c-i-c","c-i-c"]
[null,"Requirement 3","c-i-c","c-i-c",null,null,null,null,"Substations","Northern & Southern Sites",null,2,null,null,null,"c-i-c","c-i-c","c-i-c","c-i-c","c-i-c",null,"S1SUBK","c-i-c","c-i-c"]
[null,"Requirement 4","c-i-c","c-i-c",null,null,null,null,"Substations","Northern & Southern Sites",null,2,null,null,null,"c-i-c","c-i-c","c-i-c","c-i-c","c-i-c",null,"S0830V","c-i-c","c-i-c"]
{"$rows_left_out":86}
{"sheet":"Calculations","index":3,"n_rows":78,"n_cols":15,"rows_kept":78,"cut":false,"hidden":false,"merged":[]}
["Calculations",null,null,null,{"$f":"Inputs!$B$8","v":"Real $2024"}]
[]
[null,{"$f":"Inputs!$B$27","v":"Maintenance expenditure"},null,null,null,null,null,null,null,null,null,"Total"]
[null,"Activity","Dollar basis","Units",{"$f":"Inputs!N$20","v":2023},{"$f":"Inputs!O$20","v":2024},{"$f":"Inputs!P$20","v":2025},{"$f":"Inputs!Q$20","v":2026},{"$f":"Inputs!R$20","v":2027},{"$f":"Inputs!S$20","v":2028},{"$f":"Inputs!T$20","v":2029}]
[]
[null,{"$f":"Inputs!B31","v":"Transmission lines"}]
[null,"Labour",{"$f":"Inputs!$B$8","v":"Real $2024"},"Dollars",null,null,0,0,61543.836677485371,73598.814995755703,0,{"$f":"SUM(E7:K7)","v":135142.65167324108}]
[null,"Labour escalation",{"$f":"Inputs!$B$8","v":"Real $2024"},"Dollars",null,null,0,0,2045.1242289468878,2674.5649973003233,0,{"$f":"SUM(E8:K8)","v":4719.6892262472111}]
[null,"Materials",{"$f":"Inputs!$B$8","v":"Real $2024"},"Dollars",null,null,0,0,169711.79205003541,202954.30801859905,0,{"$f":"SUM(E9:K9)","v":372666.10006863449}]
[null,"Sub-Total",{"$f":"Inputs!$B$8","v":"Real $2024"},"Dollars",null,null,{"$f":"SUM(G7:G9)","v":0},0,233300.75295646768,279227.68801165506,0,512528.4409681228]
[]
[null,{"$f":"Inputs!B36","v":"Substations"}]
[null,"Labour",{"$f":"Inputs!$B$8","v":"Real $2024"},"Dollars",null,null,0,0,217169.95374262251,43465.727193304985,0,{"$f":"SUM(E13:K13)","v":260635.68093592749}]
[null,"Labour escalation",{"$f":"Inputs!$B$8","v":"Real $2024"},"Dollars",null,null,0,0,7216.6370862736949,1579.5351126254186,0,{"$f":"SUM(E14:K14)","v":8796.1721988991139}]
[null,"Materials",{"$f":"Inputs!$B$8","v":"Real $2024"},"Dollars",null,null,0,0,25385.374624376378,2906.3969523315232,0,{"$f":"SUM(E15:K15)","v":28291.771576707903}]
[null,"Sub-Total",{"$f":"Inputs!$B$8","v":"Real $2024"},"Dollars",null,null,{"$f":"SUM(G13:G15)","v":0},0,249771.9654532726,47951.659258261927,0,297723.62471153447]
[]
[null,{"$f":"Inputs!B41","v":"SIPS control"}]
[null,"Labour",{"$f":"Inputs!$B$8","v":"Real $2024"},"Dollars",null,null,0,167299.94187790583,167299.94187790583,167299.94187790583,167299.94187790583,{"$f":"SUM(E19:K19)","v":669199.76751162333}]
[null,"Labour escalation",{"$f":"Inputs!$B$8","v":"Real $2024"},"Dollars",null,null,0,4814.1057473466572,5559.4383305823376,6079.6436548989177,7323.3803397757601,{"$f":"SUM(E20:K20)","v":23776.568072603673}]
[null,"Materials",{"$f":"Inputs!$B$8","v":"Real $2024"},"Dollars",null,null,0,146975.45778787855,146975.45778787855,146975.45778787855,146975.45778787855,{"$f":"SUM(E21:K21)","v":587901.8311515142}]
[null,"Sub-Total",{"$f":"Inputs!$B$8","v":"Real $2024"},"Dollars",null,null,{"$f":"SUM(G19:G21)","v":0},319089.50541313103,319834.83799636672,320355.0433206833,321598.78000556014,1280878.1667357413]
[]
[null,"Labour",{"$f":"Inputs!$B$8","v":"Real $2024"},"Dollars",{"$f":"E7+E13+E19","v":0},0,{"$f":"G7+G13+G19","v":0},167299.94187790583,446013.73229801375,284364.48406696651,167299.94187790583,{"$f":"SUM(E24:K24)","v":1064978.1001207919}]
[null,"Labour escalation",{"$f":"Inputs!$B$8","v":"Real $2024"},"Dollars",0,0,0,4814.1057473466572,14821.199645802921,10333.74376482466,7323.3803397757601,{"$f":"SUM(E25:K25)","v":37292.429497749996}]
[null,"Materials",{"$f":"Inputs!$B$8","v":"Real $2024"},"Dollars",0,0,0,146975.45778787855,342072.62446229032,352836.16275880917,146975.45778787855,{"$f":"SUM(E26:K26)","v":988859.70279685664}]
[null,"Total maintenance costs",{"$f":"Inputs!$B$8","v":"Real $2024"},"Dollars",{"$f":"SUM(E24:E26)","v":0},{"$f":"SUM(F24:F26)","v":0},{"$f":"SUM(G24:G26)","v":0},319089.50541313103,802907.55640610703,647534.39059060032,321598.78000556014,2091130.2324153986]
[]
[]
[null,{"$f":"Inputs!$B$48","v":"Operating costs"},null,null,null,null,null,null,null,null,null,"Total"]
[null,"Component","Dollar basis",null,{"$f":"Inputs!N$20","v":2023},{"$f":"Inputs!O$20","v":2024},{"$f":"Inputs!P$20","v":2025},{"$f":"Inputs!Q$20","v":2026},{"$f":"Inputs!R$20","v":2027},{"$f":"Inputs!S$20","v":2028},{"$f":"Inputs!T$20","v":2029}]
[]
[null,{"$f":"Inputs!B52","v":"Contract Management"}]
[null,"Labour",{"$f":"Inputs!$B$8","v":"Real $2024"},"Dollars",null,null,"c-i-c","c-i-c","c-i-c","c-i-c","c-i-c","c-i-c"]
[null,"Labour escalation",{"$f":"Inputs!$B$8","v":"Real $2024"},"Dollars",null,null,"c-i-c","c-i-c","c-i-c","c-i-c","c-i-c","c-i-c"]
[null,"Other",{"$f":"Inputs!$B$8","v":"Real $2024"},"Dollars",{"$f":"SUM(Inputs!N$103:N$104)*INDEX(IF(Inputs!$F$104=\"Mid\",Inputs!$N$21:$T$21,Inputs!$N$22:$T$22),MATCH(Inputs!$F$103,Inputs!$N$20:$T$20,0))","v":3108000},{"$f":"SUM(Inputs!O$103:O$104)*INDEX(IF(Inputs!$F$104=\"Mid\",Inputs!$N$21:$T$21,Inputs!$N$22:$T$22),MATCH(Inputs!$F$103,Inputs!$N$20:$T$20,0))","v":0},"c-i-c","c-i-c","c-i-c","c-i-c","c-i-c","c-i-c",null,null,"Note: This includes network operator costs and external audit costs"]
[null,"Sub-Total",{"$f":"Inputs!$B$8","v":"Real $2024"},"Dollars",{"$f":"SUM(E34:E36)","v":3108000},{"$f":"SUM(F34:F36)","v":0},1760168.2700329472,3277402.7751364596,3190192.4639892494,3197174.1598768141,3216244.1955989669,17749181.864634436]
[]
[null,{"$f":"Inputs!B68","v":"Network Planning"}]
[null,{"$f":"$B$34","v":"Labour"},{"$f":"Inputs!$B$8","v":"Real $2024"},"Dollars",null,null,{"$f":"SUMPRODUCT(Inputs!$I$69:$I$72,Inputs!P$69:P$72)*Inputs!$L$52*INDEX(IF(Inputs!$F$53=\"Mid\",Inputs!$N$21:$T$21,Inputs!$N$22:$T$22),MATCH(Inputs!$F$52,Inputs!$N$20:$T$20,0))","v":0},{"$f":"SUMPRODUCT(Inputs!$I$69:$I$72,Inputs!Q$69:Q$72)*Inputs!$L$52*INDEX(IF(Inputs!$F$53=\"Mid\",Inputs!$N$21:$T$21,Inputs!$N$22:$T$22),MATCH(Inputs!$F$52,Inputs!$N$20:$T$20,0))","v":0},{"$f":"SUMPRODUCT(Inputs!$I$69:$I$72,Inputs!R$69:R$72)*Inputs!$L$52*INDEX(IF(Inputs!$F$53=\"Mid\",Inputs!$N$21:$T$21,Inputs!$N$22:$T$22),MATCH(Inputs!$F$52,Inputs!$N$20:$T$20,0))","v":0},{"$f":"SUMPRODUCT(Inputs!$I$69:$I$72,Inputs!S$69:S$72)*Inputs!$L$52*INDEX(IF(Inputs!$F$53=\"Mid\",Inputs!$N$21:$T$21,Inputs!$N$22:$T$22),MATCH(Inputs!$F$52,Inputs!$N$20:$T$20,0))","v":0},{"$f":"SUMPRODUCT(Inputs!$I$69:$I$72,Inputs!T$69:T$72)*Inputs!$L$52*INDEX(IF(Inputs!$F$53=\"Mid\",Inputs!$N$21:$T$21,Inputs!$N$22:$T$22),MATCH(Inputs!$F$52,Inputs!$N$20:$T$20,0))","v":0},{"$f":"SUM(E40:K40)","v":0}]
{"$rows_left_out":39}
{"sheet":"Outputs","index":4,"n_rows":86,"n_cols":15,"rows_kept":86,"cut":false,"hidden":false,"merged":[]}
["Outputs",null,null,null,{"$f":"Inputs!B8","v":"Real $2024"}]
[]
[null,"PTRM and Proposal"]
[]
[null,"Operating Costs",null,null,null,null,null,null,null,null,null,"Total","Total"]
[null,"Component","Dollar basis","Units",{"$f":"Inputs!N$20","v":2023},{"$f":"Inputs!O$20","v":2024},{"$f":"Inputs!P$20","v":2025},{"$f":"Inputs!Q$20","v":2026},{"$f":"Inputs!R$20","v":2027},{"$f":"Inputs!S$20","v":2028},{"$f":"Inputs!T$20","v":2029},"Next period","All years"]
[]
[null,"Costs"]
[null,"Maintenance costs (excl labour escalation)",{"$f":"Inputs!$B$8","v":"Real $2024"},"$Million",{"$f":"(Calculations!E27-Calculations!E25)/10^6","v":0},{"$f":"(Calculations!F27-Calculations!F25)/10^6","v":0},{"$f":"(Calculations!G27-Calculations!G25)/10^6","v":0},{"$f":"(Calculations!H27-Calculations!H25)/10^6","v":0.31427539966578438},{"$f":"(Calculations!I27-Calculations!I25)/10^6","v":0.78808635676030403},{"$f":"(Calculations!J27-Calculations!J25)/10^6","v":0.6372006468257756},{"$f":"(Calculations!K27-Calculations!K25)/10^6","v":0.31427539966578438},{"$f":"SUM(G9:K9)","v":2.0538378029176485},{"$f":"SUM(E9:K9)","v":2.0538378029176485}]
[null,"Operating Costs (excl labour escalation)",{"$f":"Inputs!$B$8","v":"Real $2024"},"$Million",{"$f":"(Calculations!E60-Calculations!E58)/10^6","v":3.1080000000000001},{"$f":"(Calculations!F60-Calculations!F58)/10^6","v":0},{"$f":"(Calculations!G60-Calculations!G58)/10^6","v":2.1650957693284321},{"$f":"(Calculations!H60-Calculations!H58)/10^6","v":3.6874196857457204},{"$f":"(Calculations!I60-Calculations!I58)/10^6","v":3.5929253400084651},{"$f":"(Calculations!J60-Calculations!J58)/10^6","v":3.8042312207645317},{"$f":"(Calculations!K60-Calculations!K58)/10^6","v":3.6777614352233452},{"$f":"SUM(G10:K10)","v":16.927433451070495},{"$f":"SUM(E10:K10)","v":20.035433451070496}]
[null,"Insurance Costs",{"$f":"Inputs!$B$8","v":"Real $2024"},"$Million",{"$f":"Calculations!E68/10^6","v":0},{"$f":"Calculations!F68/10^6","v":0},{"$f":"Calculations!G68/10^6","v":0.33173193968487819},{"$f":"Calculations!H68/10^6","v":0.33173193968487819},{"$f":"Calculations!I68/10^6","v":0.33173193968487819},{"$f":"Calculations!J68/10^6","v":0.33173193968487819},{"$f":"Calculations!K68/10^6","v":0.33173193968487819},{"$f":"SUM(G11:K11)","v":1.6586596984243909},1.6586596984243909]
[null,"Real input cost escalation",{"$f":"Inputs!$B$8","v":"Real $2024"},"$Million",{"$f":"(Calculations!E25+Calculations!E58)/10^6","v":0},{"$f":"(Calculations!F25+Calculations!F58)/10^6","v":0},{"$f":"(Calculations!G25+Calculations!G58)/10^6","v":2.2054240095530839E-2},{"$f":"(Calculations!H25+Calculations!H58)/10^6","v":8.5879291809122515E-2},{"$f":"(Calculations!I25+Calculations!I58)/10^6","v":0.10529703048861479},{"$f":"(Calculations!J25+Calculations!J58)/10^6","v":0.11695434929897343},{"$f":"(Calculations!K25+Calculations!K58)/10^6","v":0.13021970087298068},{"$f":"SUM(G12:K12)","v":0.46040461256522225},0.46040461256522225]
[]
[null,"Total (excluding debt raising costs)",{"$f":"Inputs!$B$8","v":"Real $2024"},"$Million",{"$f":"SUM(E9:E12)","v":3.1080000000000001},0,2.5188819491088412,4.419306316905506,4.8180406669422613,4.8901181565741583,4.4539884754469883,{"$f":"SUM(G14:K14)","v":21.100335564977755},24.208335564977755]
[]
[null,"Debt Raising Costs",{"$f":"Inputs!$B$8","v":"Real $2024"},"$Million",{"$f":"Calculations!E74/10^6","v":0},{"$f":"Calculations!F74/10^6","v":0},{"$f":"Calculations!G74/10^6","v":5.2264505517869653E-2},{"$f":"Calculations!H74/10^6","v":0.11909008847758873},{"$f":"Calculations!I74/10^6","v":0.12364663031465638},{"$f":"Calculations!J74/10^6","v":0.11966175162812906},{"$f":"Calculations!K74/10^6","v":0.11567687294160178},{"$f":"SUM(G16:K16)","v":0.53033984887984564},0.53033984887984564]
[]
[null,"Total (including debt raising costs)",{"$f":"Inputs!$B$8","v":"Real $2024"},"$Million",{"$f":"E14+E16","v":3.1080000000000001},0,2.5711464546267111,4.5383964053830947,4.9416872972569177,5.0097799082022876,4.5696653483885896,{"$f":"SUM(G18:K18)","v":21.630675413857599},24.738675413857599]
[]
[]
[null,"RIN Template"]
[]
[null,"Table 6.1: Non-network expenditure (real $m, Jun 2024)",null,null,null,null,null,null,null,null,null,{"$f":"L$5","v":"Total"},{"$f":"M$5","v":"Total"}]
[null,null,null,null,{"$f":"E$6","v":2023},2024,2025,2026,2027,2028,2029,{"$f":"L$6","v":"Next period"},{"$f":"M$6","v":"All years"}]
[]
[null,"Costs"]
[null,"IT & Communications",{"$f":"Inputs!$B$8","v":"Real $2024"},"$Million",null,null,null,null,null,null,null,{"$f":"SUM(G27:K27)","v":0},{"$f":"SUM(E27:K27)","v":0}]
[null,"Motor Vehicles",{"$f":"Inputs!$B$8","v":"Real $2024"},"$Million",null,null,null,null,null,null,null,{"$f":"SUM(G28:K28)","v":0},{"$f":"SUM(E28:K28)","v":0}]
[null,"Buildings and Property",{"$f":"Inputs!$B$8","v":"Real $2024"},"$Million",null,null,null,null,null,null,null,{"$f":"SUM(G29:K29)","v":0},{"$f":"SUM(E29:K29)","v":0}]
[null,"Other",{"$f":"Inputs!$B$8","v":"Real $2024"},"$Million",{"$f":"E34*E35","v":0},{"$f":"F34*F35","v":0},0.38845673079852949,0.89534388828708777,0.95060972169194358,0.96550671144944944,0.89244641313037532,{"$f":"SUM(G30:K30)","v":4.0923634653573853},{"$f":"SUM(E30:K30)","v":4.0923634653573853},null,"Note: Includes opex support costs or overheads"]
[null,null,null,"$Million"]
[null,"Total non-network opex",{"$f":"Inputs!$B$8","v":"Real $2024"},"$Million",{"$f":"SUM(E27:E30)","v":0},0,0.38845673079852949,0.89534388828708777,0.95060972169194358,0.96550671144944944,0.89244641313037532,{"$f":"SUM(G32:K32)","v":4.0923634653573853},{"$f":"SUM(E32:K32)","v":4.0923634653573853}]
[]
[null,"Total labour costs","Real $2024","$Million",0,0,1.2948557693284317,2.9844796276236258,3.1686990723064787,3.2183557048314984,2.9748213771012511]
[null,"Support cost share of total labour costs","N/A","Percent",0.3,0.3,0.3,0.3,0.3,0.3,0.3]
[]
[null,"9.1 Operating and maintenance costs by category (real $, Jun 2024)",null,null,null,null,null,null,null,null,null,{"$f":"L$5","v":"Total"},{"$f":"M$5","v":"Total"}]
[null,null,null,null,{"$f":"E$6","v":2023},2024,2025,2026,2027,2028,2029,{"$f":"L$6","v":"Next period"},{"$f":"M$6","v":"All years"}]
[]
[null,"Costs"]
{"$rows_left_out":46}