{"text_format":"1","workbook":"xlsx","n_sheets":11,"sheets":["Title Page","Inputs | General","Price Cap >","Inputs | Price Cap","Calc | Price Cap","Output | Price Caps","Exit Fees >","Input | Exit Fees","Calc | Exit Fees","Output | Exit Fee price caps","LUTs and Dropdowns"],"not_rendered":{"charts":0,"images":1,"macros":1,"external_links":0,"defined_names":23,"comments":0,"pivot_tables":0},"unopened":[],"bounds":{"document_bytes":16777216,"sheet_cells":100000,"rows_first":2000,"rows_last":500,"rows_between":2000,"halvings":0,"cell_chars":16384,"cell_head_chars":4096},"cells_cut":0,"cells_raw":0,"read":"whole","date_system":"1900"}

{"sheet":"Title Page","index":0,"n_rows":30,"n_cols":8,"rows_kept":30,"cut":false,"hidden":false,"merged":[[13,1,13,23],[7,1,8,23],[32,4,32,7],[24,1,24,23],[27,4,27,7],[30,4,30,7],[31,4,31,7],[29,4,29,7],[28,4,28,7]]}
[]
[]
[]
[]
[]
[]
[]
[null,"Final Standardised Metering Pricing Model "]
[]
[null,"Version",1.02]
[null,"Date","2022-01-14"]
[]
[]
[null,"Status"]
[]
{"$rows_left_out":16}
{"sheet":"Inputs | General","index":1,"n_rows":27,"n_cols":23,"rows_kept":27,"cut":false,"hidden":false,"merged":[[23,7,23,11],[1,14,1,15],[4,1,4,6],[1,10,1,11],[1,12,1,13],[20,1,20,6]]}
[null,{"$f":"'Title Page'!B8&\" v\"&'Title Page'!$C$10","v":"Final Standardised Metering Pricing Model  v1.02"},null,null,null,null,null,null,null,null,null,null,null,null,null,null,null,null,null,null,null,"Worksheet check:",{"$f":"IF(COUNTA($X$14:$X$46)=COUNTIF($X14:$X47,\"OK\"),\"OK\",\"Check\")","v":"OK"}]
[null,{"$f":"MID(CELL(\"filename\",A1),FIND(\"]\",CELL(\"filename\",A1))+1,255)","v":"Inputs | General"},null,null,null,null,null,null,"Key:","Input","External Link",null,"Internal Link",null,"Revised Proposal Change"]
[]
[]
[null,"1. Inputs - General"]
[]
[null,null,"Inputs","Source","Input Format",null,"Value"]
[null,null,"NSP name","NSP",null,null,"Power and Water"]
[null,null,"Decision stage","NSP",null,null,"revised proposal"]
[]
[null,null,"Forecast regulatory control period, first year","NSP","YYYY-YY",null,"2024-25"]
[null,null,"Forecast regulatory control period, last year","NSP",null,null,{"$f":"LEFT(FPFirstYear,4)+4&\"-\"&RIGHT(FPFirstYear,2)+4","v":"2028-29"}]
[]
[null,null,"Regulatory Period Length, Yrs",null,null,null,{"$f":"LEFT(G12,4)-LEFT(FPFirstYear,4)+1","v":5}]
[]
{"$rows_left_out":13}
{"sheet":"Price Cap >","index":2,"n_rows":0,"n_cols":0,"rows_kept":0,"cut":false,"hidden":false,"merged":[]}

{"sheet":"Inputs | Price Cap","index":3,"n_rows":125,"n_cols":22,"rows_kept":125,"cut":false,"hidden":false,"merged":[[94,1,94,7],[1,10,1,11],[40,9,40,13],[38,1,38,7],[6,7,6,11],[4,1,4,6],[14,1,14,6],[4,9,4,11],[14,9,14,11],[1,12,1,13]]}
[null,{"$f":"'Title Page'!B8&\" v\"&'Title Page'!$C$10","v":"Final Standardised Metering Pricing Model  v1.02"},null,null,null,null,null,null,null,null,null,null,null,"DNSP:",{"$f":"IF('Inputs | General'!$G$16=\"Exit Fees (Vic)\",\"NOT USED\",NSP)","v":"Power and Water"},null,null,null,null,null,"Worksheet check:",{"$f":"IF(COUNTA($W$4:$W$71)=COUNTIF($W4:$W72,\"OK\"),\"OK\",\"Check\")","v":"OK"}]
[null,{"$f":"MID(CELL(\"filename\",A1),FIND(\"]\",CELL(\"filename\",A1))+1,255)","v":"Inputs | Price Cap"},null,null,null,null,null,"Key:","Input","External Link","Internal Link",null,"Revised Proposal Change"]
[]
[]
[null,{"$f":"LEFT('Inputs | General'!B21,1)+1&\". Linked Input -  Inflation & Discount Rates\"","v":"3. Linked Input -  Inflation & Discount Rates"},null,null,null,null,null,null,null,{"$f":"IF('Inputs | General'!$G$16=\"Exit Fees (Vic)\",\"NOT USED\",\"\")","v":""}]
[]
[null,"Linked Inputs - Discount Rates",null,null,null,null,"Base year","Regulatory period"]
[null,null,"Year",null,"Units",null,{"$f":"LEFT(H8,4)-1&\"-\"&RIGHT(H8,2)-1","v":"2023-24"},{"$f":"FPFirstYear","v":"2024-25"},{"$f":"LEFT(H8,4)+1&\"-\"&RIGHT(H8,2)+1","v":"2025-26"},{"$f":"LEFT(I8,4)+1&\"-\"&RIGHT(I8,2)+1","v":"2026-27"},"2027-28","2028-29",null,"Link from PTRM"]
[null,null,"Nominal Vanilla WACC",null,"%",null,null,5.6103917047805686E-2,5.7432329559069378E-2,5.8760742070333077E-2,6.0089154581596776E-2,6.1417567092860476E-2]
[null,null,"Cumulative Discount Index",null,"Index",null,1,{"$f":"G10*(1+H9)","v":1.0561039170478057},{"$f":"H10*(1+I9)","v":1.1167584252603193},{"$f":"I10*(1+J9)","v":1.1823799790419123},{"$f":"J10*(1+K9)","v":1.2534281923767467},{"$f":"K10*(1+L9)","v":1.3304107024781284}]
[]
[]
[]
[]
[null,{"$f":"LEFT(B5,1)+1&\". Linked Input - Building Block Revenue Requirements\"","v":"4. Linked Input - Building Block Revenue Requirements"},null,null,null,null,null,null,null,{"$f":"IF('Inputs | General'!$G$16=\"Exit Fees (Vic)\",\"NOT USED\",\"\")","v":""}]
{"$rows_left_out":111}
{"sheet":"Calc | Price Cap","index":4,"n_rows":63,"n_cols":14,"rows_kept":63,"cut":false,"hidden":false,"merged":[[7,9,7,13],[4,1,4,7],[1,10,1,11],[0,13,0,14],[1,12,1,13]]}
[null,{"$f":"'Title Page'!B8&\" v\"&'Title Page'!$C$10","v":"Final Standardised Metering Pricing Model  v1.02"},null,null,null,null,null,null,null,null,null,null,"DNSP:",{"$f":"IF('Inputs | General'!$G$16=\"Exit Fees (Vic)\",\"NOT USED\",NSP)","v":"Power and Water"}]
[null,{"$f":"MID(CELL(\"filename\",A1),FIND(\"]\",CELL(\"filename\",A1))+1,255)","v":"Calc | Price Cap"},null,null,null,null,null,"Key:","Input","External Link","Internal Link",null,"Revised Proposal Change"]
[]
[]
[null,"Annual Charges Calculations"]
[]
[null,"Annual Smoothed Revenue Calculation"]
[null,null,null,null,null,null,null,null,"Base Year Revenue","Annual Revenue"]
["▼ Table Filters",null,"Tariff #","Tariff name","Application","Tariff Code","Other designation",null,{"$f":"LEFT(J9,4)-1&\"-\"&RIGHT(J9,2)-1","v":"2023-24"},{"$f":"FPFirstYear","v":"2024-25"},{"$f":"LEFT(J9,4)+1&\"-\"&RIGHT(J9,2)+1","v":"2025-26"},{"$f":"LEFT(K9,4)+1&\"-\"&RIGHT(K9,2)+1","v":"2026-27"},"2027-28","2028-29"]
[null,null,"Tariff #","Tariff name","Application","Tariff Code","Other designation","Column1","F-RP-1","F-RP0","F-RP+1","F-RP+2","F-RP+3","F-RP+4"]
[null,null,1,{"$f":"'Inputs | Price Cap'!D44","v":"1 Phase Meters (including Prepayment)"},"Non-capital",{"$f":"'Inputs | Price Cap'!F44","v":0},{"$f":"'Inputs | Price Cap'!G44","v":0},null,{"$f":"'Output | Price Caps'!$I9*'Inputs | Price Cap'!I44","v":0},{"$f":"'Output | Price Caps'!J9*'Inputs | Price Cap'!J44","v":0},{"$f":"'Output | Price Caps'!K9*'Inputs | Price Cap'!K44","v":0},{"$f":"'Output | Price Caps'!L9*'Inputs | Price Cap'!L44","v":0},{"$f":"'Output | Price Caps'!M9*'Inputs | Price Cap'!M44","v":0},{"$f":"'Output | Price Caps'!N9*'Inputs | Price Cap'!N44","v":0}]
[null,null,1,{"$f":"'Inputs | Price Cap'!D45","v":"1 Phase Meters (including Prepayment)"},"Capital",{"$f":"'Inputs | Price Cap'!F45","v":0},{"$f":"'Inputs | Price Cap'!G45","v":0},null,{"$f":"'Output | Price Caps'!$I10*'Inputs | Price Cap'!I45","v":5660908.5894851843},{"$f":"'Output | Price Caps'!J10*'Inputs | Price Cap'!J45","v":9101754.8954563085},{"$f":"'Output | Price Caps'!K10*'Inputs | Price Cap'!K45","v":9428013.8293575142},{"$f":"'Output | Price Caps'!L10*'Inputs | Price Cap'!L45","v":9765921.2340331059},{"$f":"'Output | Price Caps'!M10*'Inputs | Price Cap'!M45","v":10114943.027660074},{"$f":"'Output | Price Caps'!N10*'Inputs | Price Cap'!N45","v":10475953.539323093}]
[null,null,1,{"$f":"'Inputs | Price Cap'!D46","v":"1 Phase Meters (including Prepayment)"},"Total",{"$f":"'Inputs | Price Cap'!F46","v":0},{"$f":"'Inputs | Price Cap'!G46","v":0},null,{"$f":"I11+I12","v":5660908.5894851843},9101754.8954563085,9428013.8293575142,9765921.2340331059,10114943.027660074,10475953.539323093]
[null,null,2,{"$f":"'Inputs | Price Cap'!D47","v":"3 Phase Meters"},"Non-capital",{"$f":"'Inputs | Price Cap'!F47","v":0},{"$f":"'Inputs | Price Cap'!G47","v":0},null,{"$f":"'Output | Price Caps'!$I12*'Inputs | Price Cap'!I47","v":0},{"$f":"'Output | Price Caps'!J12*'Inputs | Price Cap'!J47","v":0},{"$f":"'Output | Price Caps'!K12*'Inputs | Price Cap'!K47","v":0},{"$f":"'Output | Price Caps'!L12*'Inputs | Price Cap'!L47","v":0},{"$f":"'Output | Price Caps'!M12*'Inputs | Price Cap'!M47","v":0},{"$f":"'Output | Price Caps'!N12*'Inputs | Price Cap'!N47","v":0}]
[null,null,2,{"$f":"'Inputs | Price Cap'!D48","v":"3 Phase Meters"},"Capital",{"$f":"'Inputs | Price Cap'!F48","v":0},{"$f":"'Inputs | Price Cap'!G48","v":0},null,{"$f":"'Output | Price Caps'!$I13*'Inputs | Price Cap'!I48","v":1911748.1124558998},{"$f":"'Output | Price Caps'!J13*'Inputs | Price Cap'!J48","v":3070675.1765918122},{"$f":"'Output | Price Caps'!K13*'Inputs | Price Cap'!K48","v":3177754.1297282972},{"$f":"'Output | Price Caps'!L13*'Inputs | Price Cap'!L48","v":3288376.3150518402},{"$f":"'Output | Price Caps'!M13*'Inputs | Price Cap'!M48","v":3402775.4658841197},{"$f":"'Output | Price Caps'!N13*'Inputs | Price Cap'!N48","v":3521190.6291717254}]
{"$rows_left_out":49}
{"sheet":"Output | Price Caps","index":5,"n_rows":70,"n_cols":22,"rows_kept":70,"cut":false,"hidden":false,"merged":[[56,3,57,3],[65,9,65,13],[5,9,5,13],[1,10,1,11],[0,14,0,15],[1,12,1,13]]}
[null,null,{"$f":"'Title Page'!B8&\" v\"&'Title Page'!$C$10","v":"Final Standardised Metering Pricing Model  v1.02"},null,null,null,null,null,null,null,null,null,null,"DNSP:",{"$f":"IF('Inputs | General'!$G$16=\"Exit Fees (Vic)\",\"NOT USED\",NSP)","v":"Power and Water"},null,null,null,null,null,"Worksheet check:",{"$f":"IF(COUNTA($W$5:$W$52)=COUNTIF($W5:$W53,\"OK\"),\"OK\",\"Check\")","v":"OK"}]
[null,null,{"$f":"MID(CELL(\"filename\",A1),FIND(\"]\",CELL(\"filename\",A1))+1,255)","v":"Output | Price Caps"},null,null,null,null,"Key:","Input","External Link","Internal Link",null,"Revised Proposal Change"]
[]
[]
[null,"RESULT - Price Cap - Annual Charges"]
[null,null,null,null,null,null,null,null,"Base Year Charges","Price Cap - Annual Charges (nominal)"]
["▼ Table Filters",null,"Tariff #","Tariff name","Application","Tariff Code","Other designation",null,{"$f":"LEFT(J7,4)-1&\"-\"&RIGHT(J7,2)-1","v":"2023-24"},{"$f":"FPFirstYear","v":"2024-25"},{"$f":"LEFT(J7,4)+1&\"-\"&RIGHT(J7,2)+1","v":"2025-26"},{"$f":"LEFT(K7,4)+1&\"-\"&RIGHT(K7,2)+1","v":"2026-27"},"2027-28","2028-29"]
[null,null,"Tariff #","Tariff name","Application","Tariff Code","Other designation","Ca","F-RP-1","F-RP0","F-RP+1","F-RP+2","F-RP+3","F-RP+4","Column1"]
[null,null,1,{"$f":"'Inputs | Price Cap'!D44","v":"1 Phase Meters (including Prepayment)"},"Non-capital",{"$f":"'Inputs | Price Cap'!F44","v":0},{"$f":"'Inputs | Price Cap'!G44","v":0},null,{"$f":"ROUND('Inputs | Price Cap'!H44,2)","v":0},{"$f":"ROUND('Output | Price Caps'!I9*(1-'Inputs | Price Cap'!F$109)*(1+'Inputs | General'!H$26),2)","v":0},{"$f":"ROUND('Output | Price Caps'!J9*(1-'Inputs | Price Cap'!G$109)*(1+'Inputs | General'!I$26),2)","v":0},{"$f":"ROUND('Output | Price Caps'!K9*(1-'Inputs | Price Cap'!H$109)*(1+'Inputs | General'!J$26),2)","v":0},{"$f":"ROUND('Output | Price Caps'!L9*(1-'Inputs | Price Cap'!I$109)*(1+'Inputs | General'!K$26),2)","v":0},{"$f":"ROUND('Output | Price Caps'!M9*(1-'Inputs | Price Cap'!J$109)*(1+'Inputs | General'!L$26),2)","v":0}]
[null,null,1,{"$f":"'Inputs | Price Cap'!D45","v":"1 Phase Meters (including Prepayment)"},"Capital",{"$f":"'Inputs | Price Cap'!F45","v":0},{"$f":"'Inputs | Price Cap'!G45","v":0},null,{"$f":"ROUND('Inputs | Price Cap'!H45,2)","v":82.25},{"$f":"ROUND('Output | Price Caps'!I10*(1-'Inputs | Price Cap'!F$125)*(1+'Inputs | General'!H$26),2)","v":131.22999999999999},{"$f":"ROUND('Output | Price Caps'!J10*(1-'Inputs | Price Cap'!G$125)*(1+'Inputs | General'!I$26),2)","v":134.9},{"$f":"ROUND('Output | Price Caps'!K10*(1-'Inputs | Price Cap'!H$125)*(1+'Inputs | General'!J$26),2)","v":138.68},{"$f":"ROUND('Output | Price Caps'!L10*(1-'Inputs | Price Cap'!I$125)*(1+'Inputs | General'!K$26),2)","v":142.56},{"$f":"ROUND('Output | Price Caps'!M10*(1-'Inputs | Price Cap'!J$125)*(1+'Inputs | General'!L$26),2)","v":146.55000000000001}]
[null,null,1,{"$f":"'Inputs | Price Cap'!D46","v":"1 Phase Meters (including Prepayment)"},"Total",{"$f":"'Inputs | Price Cap'!F46","v":0},{"$f":"'Inputs | Price Cap'!G46","v":0},null,{"$f":"ROUND('Inputs | Price Cap'!H46,2)","v":82.25},{"$f":"J9+J10","v":131.22999999999999},{"$f":"K9+K10","v":134.9},{"$f":"L9+L10","v":138.68},{"$f":"M9+M10","v":142.56},{"$f":"N9+N10","v":146.55000000000001}]
[null,null,2,{"$f":"'Inputs | Price Cap'!D47","v":"3 Phase Meters"},"Non-capital",{"$f":"'Inputs | Price Cap'!F47","v":0},{"$f":"'Inputs | Price Cap'!G47","v":0},null,{"$f":"ROUND('Inputs | Price Cap'!H47,2)","v":0},{"$f":"ROUND('Output | Price Caps'!I12*(1-'Inputs | Price Cap'!F$109)*(1+'Inputs | General'!H$26),2)","v":0},{"$f":"ROUND('Output | Price Caps'!J12*(1-'Inputs | Price Cap'!G$109)*(1+'Inputs | General'!I$26),2)","v":0},{"$f":"ROUND('Output | Price Caps'!K12*(1-'Inputs | Price Cap'!H$109)*(1+'Inputs | General'!J$26),2)","v":0},{"$f":"ROUND('Output | Price Caps'!L12*(1-'Inputs | Price Cap'!I$109)*(1+'Inputs | General'!K$26),2)","v":0},{"$f":"ROUND('Output | Price Caps'!M12*(1-'Inputs | Price Cap'!J$109)*(1+'Inputs | General'!L$26),2)","v":0}]
[null,null,2,{"$f":"'Inputs | Price Cap'!D48","v":"3 Phase Meters"},"Capital",{"$f":"'Inputs | Price Cap'!F48","v":0},{"$f":"'Inputs | Price Cap'!G48","v":0},null,{"$f":"ROUND('Inputs | Price Cap'!H48,2)","v":108.98},{"$f":"ROUND('Output | Price Caps'!I13*(1-'Inputs | Price Cap'!F$125)*(1+'Inputs | General'!H$26),2)","v":173.88},{"$f":"ROUND('Output | Price Caps'!J13*(1-'Inputs | Price Cap'!G$125)*(1+'Inputs | General'!I$26),2)","v":178.75},{"$f":"ROUND('Output | Price Caps'!K13*(1-'Inputs | Price Cap'!H$125)*(1+'Inputs | General'!J$26),2)","v":183.75},{"$f":"ROUND('Output | Price Caps'!L13*(1-'Inputs | Price Cap'!I$125)*(1+'Inputs | General'!K$26),2)","v":188.89},{"$f":"ROUND('Output | Price Caps'!M13*(1-'Inputs | Price Cap'!J$125)*(1+'Inputs | General'!L$26),2)","v":194.18}]
[null,null,2,{"$f":"'Inputs | Price Cap'!D49","v":"3 Phase Meters"},"Total",{"$f":"'Inputs | Price Cap'!F49","v":0},{"$f":"'Inputs | Price Cap'!G49","v":0},null,{"$f":"ROUND('Inputs | Price Cap'!H49,2)","v":108.98},{"$f":"J12+J13","v":173.88},{"$f":"K12+K13","v":178.75},{"$f":"L12+L13","v":183.75},{"$f":"M12+M13","v":188.89},{"$f":"N12+N13","v":194.18}]
[null,null,3,{"$f":"'Inputs | Price Cap'!D50","v":"LV CT"},"Non-capital",{"$f":"'Inputs | Price Cap'!F50","v":0},{"$f":"'Inputs | Price Cap'!G50","v":0},null,{"$f":"ROUND('Inputs | Price Cap'!H50,2)","v":0},{"$f":"ROUND('Output | Price Caps'!I15*(1-'Inputs | Price Cap'!F$109)*(1+'Inputs | General'!H$26),2)","v":0},{"$f":"ROUND('Output | Price Caps'!J15*(1-'Inputs | Price Cap'!G$109)*(1+'Inputs | General'!I$26),2)","v":0},{"$f":"ROUND('Output | Price Caps'!K15*(1-'Inputs | Price Cap'!H$109)*(1+'Inputs | General'!J$26),2)","v":0},{"$f":"ROUND('Output | Price Caps'!L15*(1-'Inputs | Price Cap'!I$109)*(1+'Inputs | General'!K$26),2)","v":0},{"$f":"ROUND('Output | Price Caps'!M15*(1-'Inputs | Price Cap'!J$109)*(1+'Inputs | General'!L$26),2)","v":0}]
{"$rows_left_out":56}
{"sheet":"Exit Fees >","index":6,"n_rows":0,"n_cols":0,"rows_kept":0,"cut":false,"hidden":true,"merged":[]}

{"sheet":"Input | Exit Fees","index":7,"n_rows":119,"n_cols":17,"rows_kept":119,"cut":false,"hidden":true,"merged":[[94,3,94,5],[117,3,117,5],[66,9,66,14],[111,3,111,5],[112,3,112,5],[113,3,113,5],[114,3,114,5],[116,3,116,5],[115,3,115,5],[107,3,107,5],[108,3,108,5],[109,3,109,5],[110,3,110,5],[86,1,86,7],[0,13,0,14],[47,3,47,5],[4,1,4,6],[24,1,24,7],[41,1,41,7],[6,7,6,11],[4,9,4,11],[21,1,21,3]]}
[null,{"$f":"'Title Page'!B8&\" v\"&'Title Page'!$C$10","v":"Final Standardised Metering Pricing Model  v1.02"},null,null,null,null,null,null,null,null,null,null,"DNSP:",{"$f":"IF('Inputs | General'!$G$16=\"Price Cap\",\"NOT USED\",NSP)","v":"NOT USED"}]
[null,{"$f":"MID(CELL(\"filename\",A1),FIND(\"]\",CELL(\"filename\",A1))+1,255)","v":"Input | Exit Fees"},null,null,null,null,null,"Key:","Input","External Link","Internal Link"]
[]
[]
[null,{"$f":"LEFT('Inputs | General'!B21,1)+1&\". Linked Input - RAB\"","v":"3. Linked Input - RAB"},null,null,null,null,null,null,null,{"$f":"IF('Inputs | General'!$G$16=\"Price Cap\",\"NOT USED\",\"\")","v":"NOT USED"}]
[]
[null,"Linked Input - RAB Meters",null,null,null,null,"Base Year","Regulatory Period"]
[null,null,null,null,"Units",null,{"$f":"LEFT(H8,4)-1&\"-\"&RIGHT(H8,2)-1","v":"2023-24"},{"$f":"FPFirstYear","v":"2024-25"},{"$f":"LEFT(H8,4)+1&\"-\"&RIGHT(H8,2)+1","v":"2025-26"},{"$f":"LEFT(I8,4)+1&\"-\"&RIGHT(I8,2)+1","v":"2026-27"},{"$f":"LEFT(J8,4)+1&\"-\"&RIGHT(J8,2)+1","v":"2027-28"},{"$f":"LEFT(K8,4)+1&\"-\"&RIGHT(K8,2)+1","v":"2028-29"},{"$f":"LEFT(L8,4)+1&\"-\"&RIGHT(L8,2)+1","v":"2029-30"}]
[null,null,"Opening RAB",null,"$m",null,null,{"$f":"G9+G10-G11","v":0},0,0,0,0,0,"Opening balance of METERS row in PTRM inputs sheet of PTRM"]
[null,null,"Gross capital expenditure",null,"$m",null,null,null,null,null,null,null,null,"Gross capex from METERS row in ASSETS sheet of PTRM"]
[null,null,"Regulatory depreciation",null,"$m",null,null,null,null,null,null,null,null,"Depreciation from METERS row in ASSETS sheet of PTRM"]
[]
[]
[null,"Linked Input - RAB Comms & IT"]
[null,null,null,null,"Units",null,{"$f":"LEFT(H15,4)-1&\"-\"&RIGHT(H15,2)-1","v":"2023-24"},{"$f":"FPFirstYear","v":"2024-25"},{"$f":"LEFT(H15,4)+1&\"-\"&RIGHT(H15,2)+1","v":"2025-26"},{"$f":"LEFT(I15,4)+1&\"-\"&RIGHT(I15,2)+1","v":"2026-27"},{"$f":"LEFT(J15,4)+1&\"-\"&RIGHT(J15,2)+1","v":"2027-28"},{"$f":"LEFT(K15,4)+1&\"-\"&RIGHT(K15,2)+1","v":"2028-29"},{"$f":"LEFT(L15,4)+1&\"-\"&RIGHT(L15,2)+1","v":"2029-30"}]
{"$rows_left_out":105}
{"sheet":"Calc | Exit Fees","index":8,"n_rows":177,"n_cols":15,"rows_kept":177,"cut":false,"hidden":true,"merged":[[115,6,115,10],[112,1,112,7],[0,13,0,14],[4,1,4,7],[74,10,74,14],[114,6,114,10],[89,10,89,14],[58,10,58,14],[106,10,106,14],[102,1,102,7],[28,10,28,14],[43,10,43,14],[9,10,9,14]]}
[null,{"$f":"'Title Page'!B8&\" v\"&'Title Page'!$C$10","v":"Final Standardised Metering Pricing Model  v1.02"},null,null,null,null,null,null,null,null,null,null,"DNSP:",{"$f":"IF('Inputs | General'!$G$16=\"Price Cap\",\"NOT USED\",NSP)","v":"NOT USED"}]
[null,{"$f":"MID(CELL(\"filename\",A1),FIND(\"]\",CELL(\"filename\",A1))+1,255)","v":"Calc | Exit Fees"},null,null,null,null,null,"Key:","Input","External Link","Internal Link"]
[]
[]
[null,"CALCULATION | Meters"]
[]
[null,"Calculation of Allocated Meters RAB by Designated Exit Fee"]
[]
[]
[null,null,null,null,"Average number of meters (Year, Year-1)",null,null,null,null,null,"Average number of meters (Year, Year-1)"]
[null,null,null,null,null,{"$f":"'Input | Exit Fees'!H68","v":"Meter Type"},{"$f":"'Input | Exit Fees'!I68","v":"Units"},"Designated Exit Fee",null,null,{"$f":"FPFirstYear","v":"2024-25"},{"$f":"LEFT(K11,4)+1&\"-\"&RIGHT(K11,2)+1","v":"2025-26"},{"$f":"LEFT(L11,4)+1&\"-\"&RIGHT(L11,2)+1","v":"2026-27"},"2027-28","2028-29"]
[null,null,null,null,null,{"$f":"'Input | Exit Fees'!H69","v":0},"No.",{"$f":"'Input | Exit Fees'!D49","v":0},null,null,{"$f":"IFERROR(AVERAGE('Input | Exit Fees'!J69:K69),0)","v":0},{"$f":"IFERROR(AVERAGE('Input | Exit Fees'!K69:L69),0)","v":0},{"$f":"IFERROR(AVERAGE('Input | Exit Fees'!L69:M69),0)","v":0},{"$f":"IFERROR(AVERAGE('Input | Exit Fees'!M69:N69),0)","v":0},{"$f":"IFERROR(AVERAGE('Input | Exit Fees'!N69:O69),0)","v":0}]
[null,null,null,null,null,{"$f":"'Input | Exit Fees'!H70","v":0},"No.",{"$f":"'Input | Exit Fees'!D50","v":0},null,null,{"$f":"IFERROR(AVERAGE('Input | Exit Fees'!J70:K70),0)","v":0},{"$f":"IFERROR(AVERAGE('Input | Exit Fees'!K70:L70),0)","v":0},{"$f":"IFERROR(AVERAGE('Input | Exit Fees'!L70:M70),0)","v":0},{"$f":"IFERROR(AVERAGE('Input | Exit Fees'!M70:N70),0)","v":0},{"$f":"IFERROR(AVERAGE('Input | Exit Fees'!N70:O70),0)","v":0}]
[null,null,null,null,null,{"$f":"'Input | Exit Fees'!H71","v":0},"No.",{"$f":"'Input | Exit Fees'!D51","v":0},null,null,{"$f":"IFERROR(AVERAGE('Input | Exit Fees'!J71:K71),0)","v":0},{"$f":"IFERROR(AVERAGE('Input | Exit Fees'!K71:L71),0)","v":0},{"$f":"IFERROR(AVERAGE('Input | Exit Fees'!L71:M71),0)","v":0},{"$f":"IFERROR(AVERAGE('Input | Exit Fees'!M71:N71),0)","v":0},{"$f":"IFERROR(AVERAGE('Input | Exit Fees'!N71:O71),0)","v":0}]
[null,null,null,null,null,{"$f":"'Input | Exit Fees'!H72","v":0},"No.",{"$f":"'Input | Exit Fees'!D52","v":0},null,null,{"$f":"IFERROR(AVERAGE('Input | Exit Fees'!J72:K72),0)","v":0},{"$f":"IFERROR(AVERAGE('Input | Exit Fees'!K72:L72),0)","v":0},{"$f":"IFERROR(AVERAGE('Input | Exit Fees'!L72:M72),0)","v":0},{"$f":"IFERROR(AVERAGE('Input | Exit Fees'!M72:N72),0)","v":0},{"$f":"IFERROR(AVERAGE('Input | Exit Fees'!N72:O72),0)","v":0}]
{"$rows_left_out":163}
{"sheet":"Output | Exit Fee price caps","index":9,"n_rows":62,"n_cols":14,"rows_kept":62,"cut":false,"hidden":true,"merged":[[59,8,59,12],[49,3,49,4],[50,3,50,4],[51,3,51,4],[52,3,52,4],[53,3,53,4],[61,3,61,4],[48,3,48,4],[28,3,28,4],[29,3,29,4],[30,3,30,4],[31,3,31,4],[32,3,32,4],[33,3,33,4],[43,3,43,4],[44,3,44,4],[45,3,45,4],[46,3,46,4],[17,3,17,4],[60,3,60,4],[14,3,14,4],[47,3,47,4],[27,3,27,4],[0,13,0,14],[23,3,23,4],[24,3,24,4],[25,3,25,4],[26,3,26,4],[22,8,22,12],[6,8,6,12],[7,3,7,4],[8,3,8,4],[9,3,9,4],[10,3,10,4],[11,3,11,4],[12,3,12,4],[13,3,13,4],[15,3,15,4],[16,3,16,4]]}
[null,{"$f":"'Title Page'!B8&\" v\"&'Title Page'!$C$10","v":"Final Standardised Metering Pricing Model  v1.02"},null,null,null,null,null,null,null,null,null,null,"DNSP:","D"]
[null,{"$f":"MID(CELL(\"filename\",A1),FIND(\"]\",CELL(\"filename\",A1))+1,255)","v":"Output | Exit Fee price caps"},null,null,null,null,null,"Key:","Input","External Link","Internal Link"]
[]
[]
[null,null,"Applicable Exit Fees Price Caps"]
[]
[null,null,null,null,null,null,null,"Base Year","Regulatory Period"]
[null,null,null,"Exit Fee Name",null,"Units","Basis",{"$f":"LEFT(I8,4)-1&\"-\"&RIGHT(I8,2)-1","v":"2023-24"},{"$f":"FPFirstYear","v":"2024-25"},{"$f":"LEFT(I8,4)+1&\"-\"&RIGHT(I8,2)+1","v":"2025-26"},{"$f":"LEFT(J8,4)+1&\"-\"&RIGHT(J8,2)+1","v":"2026-27"},"2027-28","2028-29"]
[null,null,null,{"$f":"D25","v":0},null,"$dollars","nominal",{"$f":"ROUND(H25,2)","v":0},{"$f":"IF(I25=0,0,ROUND(H9*(1-I45)*(1+I$41),2))","v":0},0,0,0,0]
[null,null,null,{"$f":"D26","v":0},null,"$dollars","nominal",0,0,0,0,0,0]
[null,null,null,0,null,"$dollars","nominal",{"$f":"ROUND(H27,2)","v":0},{"$f":"IF(I27=0,0,ROUND(H11*(1-I47)*(1+I$41),2))","v":0},{"$f":"IF(J27=0,0,ROUND(I11*(1-J47)*(1+J$41),2))","v":0},0,0,0]
[null,null,null,0,null,"$dollars","nominal",0,0,0,0,0,0]
[null,null,null,0,null,"$dollars","nominal",0,0,0,0,0,0]
[null,null,null,0,null,"$dollars","nominal",0,0,0,0,0,0]
[null,null,null,0,null,"$dollars","nominal",0,0,0,0,0,0]
{"$rows_left_out":48}
{"sheet":"LUTs and Dropdowns","index":10,"n_rows":23,"n_cols":2,"rows_kept":23,"cut":false,"hidden":false,"merged":[]}
[null,{"$f":"'Title Page'!B8&\" v\"&'Title Page'!$C$10","v":"Final Standardised Metering Pricing Model  v1.02"}]
[null,{"$f":"MID(CELL(\"filename\",A1),FIND(\"]\",CELL(\"filename\",A1))+1,255)","v":"LUTs and Dropdowns"}]
[]
[]
[]
[]
[]
[]
[]
[]
[]
[]
[]
[null,"Model Use"]
[null,"Price Cap"]
{"$rows_left_out":8}