{"text_format":"1","workbook":"xlsx","n_sheets":17,"sheets":["Cover page","Version Control","Intro",">>General inputs","Cost Escalations","Ratios & Assumptions","Overheads",">>Volumes","ERG - Yearly volume scenarios",">>Unit Rates","ERG Unit Rates",">>Forecast capex","ERG - Forecast capex scenarios","ERG - Gross Capex ",">>Forecast opex","ERG - Opex BST","ERG - Forecast opex"],"not_rendered":{"charts":0,"images":2,"macros":1,"external_links":2,"defined_names":13,"comments":0,"pivot_tables":0},"unopened":[],"bounds":{"document_bytes":16777216,"sheet_cells":100000,"rows_first":2000,"rows_last":500,"rows_between":2000,"halvings":0,"cell_chars":16384,"cell_head_chars":4096},"cells_cut":0,"cells_raw":0,"read":"whole","date_system":"1900"}

{"sheet":"Cover page","index":0,"n_rows":3,"n_cols":1,"rows_kept":3,"cut":false,"hidden":false,"merged":[[1,0,1,5],[2,0,2,5]]}
[]
["Ergon Energy Public Lighting Capex and Opex Forecasting Model"]
["2025-30"]

{"sheet":"Version Control","index":1,"n_rows":5,"n_cols":4,"rows_kept":5,"cut":false,"hidden":false,"merged":[]}
["RDP2025 Project: Public Lighting Expenditure Analysis Model"]
[]
[]
[null,"Date","Version","Description of any updates made"]
[null,"2024-01-31","V1","Version submitted to the AER"]

{"sheet":"Intro","index":2,"n_rows":15,"n_cols":3,"rows_kept":15,"cut":false,"hidden":false,"merged":[]}
["Model developer ","Energex & Ergon Energy Network"]
[]
[]
[]
["Purpose","To provide capex and opex scenarios based on the 100% LED deployment during 2025-30 regulatory period.  "]
[]
["Colour chart","Data","Cells containing hard coded data"]
[null,null,"Cell containing formula"]
[null,null,"Cells to remain empty (non-applicable input/output)"]
[null,"Assumptions","Cells containing assumptions intended to be manipulated by model users"]
[null,"Text","Important notes providing details"]
[null,null,"Cell highlighting particular attention"]
[null,"Header 1","Fist header"]
[null,"Header 2","Second header"]
[null,"Header 3","Third hearder"]
{"$rows_left_out":1}
{"sheet":">>General inputs","index":3,"n_rows":0,"n_cols":0,"rows_kept":0,"cut":false,"hidden":false,"merged":[]}

{"sheet":"Cost Escalations","index":4,"n_rows":30,"n_cols":7,"rows_kept":30,"cut":false,"hidden":false,"merged":[]}
[null,"2019-20","2020-21","2021-22","2022-23","2023-24","2024-25"]
[null,"2020-06-01","2021-06-01","2022-06-01","2023-06-01","2024-06-01","2025-06-01"]
["Inflation",-3.4843205574912606E-3,3.8461538461538325E-2,6.1447811447811418E-2,6.25E-2,3.499999999999992E-2,2.7498479316033997E-2]
[]
["Real to Real"]
[null,"2020-06-01","2021-06-01","2022-06-01","2023-06-01","2024-06-01","2025-06-01"]
["2020-06-01",{"$f":"IF(AND($A7>B$6,ISNONTEXT($A7)),C7/(1+C$3),IF(AND($A7=B$6,B$6=B$2),1,IF(AND($A7<B$6,B$6=B$2),#REF!*(1+B$3),0)))","v":1},{"$f":"IF(AND($A7>C$6,ISNONTEXT($A7)),D7/(1+D$3),IF(AND($A7=C$6,C$6=C$2),1,IF(AND($A7<C$6,C$6=C$2),B7*(1+C$3),0)))","v":1.0384615384615383},1.1022727272727271,1.1711647727272725,1.2121555397727268,{"$f":"IF(AND($A7>G$6,ISNONTEXT($A7)),#REF!/(1+#REF!),IF(AND($A7=G$6,G$6=G$2),1,IF(AND($A7<G$6,G$6=G$2),F7*(1+G$3),0)))","v":1.2454879738109832}]
["2021-06-01",{"$f":"IF(AND($A8>B$6,ISNONTEXT($A8)),C8/(1+C$3),IF(AND($A8=B$6,B$6=B$2),1,IF(AND($A8<B$6,B$6=B$2),#REF!*(1+B$3),0)))","v":0.96296296296296313},1,1.0614478114478114,1.1277882996632997,1.1672608901515151,{"$f":"IF(AND($A8>G$6,ISNONTEXT($A8)),#REF!/(1+#REF!),IF(AND($A8=G$6,G$6=G$2),1,IF(AND($A8<G$6,G$6=G$2),F8*(1+G$3),0)))","v":1.199358789595762}]
["2022-06-01",{"$f":"IF(AND($A9>B$6,ISNONTEXT($A9)),C9/(1+C$3),IF(AND($A9=B$6,B$6=B$2),1,IF(AND($A9<B$6,B$6=B$2),#REF!*(1+B$3),0)))","v":0.90721649484536093},0.94210943695479776,1,1.0625,{"$f":"IF(AND($A9>F$6,ISNONTEXT($A9)),G9/(1+G$3),IF(AND($A9=F$6,F$6=F$2),1,IF(AND($A9<F$6,F$6=F$2),E9*(1+F$3),0)))","v":1.0996874999999999},{"$f":"IF(AND($A9>G$6,ISNONTEXT($A9)),#REF!/(1+#REF!),IF(AND($A9=G$6,G$6=G$2),1,IF(AND($A9<G$6,G$6=G$2),F9*(1+G$3),0)))","v":1.129927233972851}]
["2023-06-01",{"$f":"IF(AND($A10>B$6,ISNONTEXT($A10)),C10/(1+C$3),IF(AND($A10=B$6,B$6=B$2),1,IF(AND($A10<B$6,B$6=B$2),#REF!*(1+B$3),0)))","v":0.85385081867798673},0.8866912347809861,0.94117647058823528,1,1.0349999999999999,{"$f":"IF(AND($A10>G$6,ISNONTEXT($A10)),#REF!/(1+#REF!),IF(AND($A10=G$6,G$6=G$2),1,IF(AND($A10<G$6,G$6=G$2),F10*(1+G$3),0)))","v":1.0634609260920951}]
["2024-06-01",{"$f":"IF(AND($A11>B$6,ISNONTEXT($A11)),C11/(1+C$3),IF(AND($A11=B$6,B$6=B$2),1,IF(AND($A11<B$6,B$6=B$2),#REF!*(1+B$3),0)))","v":0.8249766364038521},0.85670650703476936,0.90934924694515495,0.96618357487922713,1,{"$f":"IF(AND($A11>G$6,ISNONTEXT($A11)),#REF!/(1+#REF!),IF(AND($A11=G$6,G$6=G$2),1,IF(AND($A11<G$6,G$6=G$2),F11*(1+G$3),0)))","v":1.027498479316034}]
["2025-06-01",{"$f":"IF(AND($A12>B$6,ISNONTEXT($A12)),C12/(1+C$3),IF(AND($A12=B$6,B$6=B$2),1,IF(AND($A12<B$6,B$6=B$2),#REF!*(1+B$3),0)))","v":0.8028981580128538},0.83377885639796345,0.88501274235507732,0.94032603875226961,0.97323745010859897,{"$f":"IF(AND($A12>G$6,ISNONTEXT($A12)),#REF!/(1+#REF!),IF(AND($A12=G$6,G$6=G$2),1,IF(AND($A12<G$6,G$6=G$2),F12*(1+G$3),0)))","v":1}]
[]
["Nominal to Real"]
[null,"2020-06-01","2021-06-01","2022-06-01","2023-06-01","2024-06-01","2025-06-01"]
{"$rows_left_out":16}
{"sheet":"Ratios & Assumptions","index":5,"n_rows":24,"n_cols":4,"rows_kept":24,"cut":false,"hidden":false,"merged":[[1,2,1,3]]}
["Table 1 - ERG ratios between major and minor roads"]
[null,null,"2025-26"]
["DNSP","Road type","Volume","Ratio"]
["Ergon","Major",{"$f":"SUMIF('ERG - Yearly volume scenarios'!$C$5:$C$12,'Ratios & Assumptions'!$B4,'ERG - Yearly volume scenarios'!$G$5:$G$12)","v":{"$error":"#REF!"}},{"$f":"C4/$C$6","v":{"$error":"#REF!"}}]
["Ergon","Minor",{"$f":"SUMIF('ERG - Yearly volume scenarios'!$C$5:$C$12,'Ratios & Assumptions'!$B5,'ERG - Yearly volume scenarios'!$G$5:$G$12)","v":{"$error":"#REF!"}},{"$f":"C5/$C$6","v":{"$error":"#REF!"}}]
["Ergon","All",{"$f":"SUM(C4:C5)","v":{"$error":"#REF!"}},{"$f":"SUM(D4:D5)","v":{"$error":"#REF!"}}]
["Notes:"]
["Allocation based on actual 2021-22 volumes"]
["Used to allocate expenditure between major and minor road types where the breakdown is not available"]
[]
["Table 2 - ERG estimated annual growth rates"]
["DNSP","Road","Rate","Rate"]
["Ergon","All ",1,2.5000000000000001E-2]
["Ergon","All ",2,1.4999999999999999E-2]
["Note:"]
{"$rows_left_out":10}
{"sheet":"Overheads","index":6,"n_rows":29,"n_cols":4,"rows_kept":29,"cut":false,"hidden":false,"merged":[]}
["Table 1 - ERG Labour Oncosts"]
["DNSP","Cost type","Cost recovery","FY2023"]
["Ergon","Labour Oncosts","Labour only",0]
["Ergon","All","All",{"$f":"SUM(D3)","v":0}]
[]
["Table 2 - ERG Material Oncosts"]
["DNSP","Cost type","Cost recovery","FY2023"]
["Ergon","Material Oncosts","Material only",7.9587700999130317E-2]
["Ergon","All","All",{"$f":"SUM(D8)","v":7.9587700999130317E-2}]
[]
["Table 3 - ERG Fleet Oncosts"]
["DNSP","Cost type","Cost recovery","FY2023"]
["Ergon","Fleet Oncost Indirects","Labour only",0.12669576075036793]
["Ergon","Fleet Oncost Depreciation","Labour only",8.4944584136218471E-2]
["Ergon","All","All",{"$f":"SUM(D13:D14)","v":0.2116403448865864}]
{"$rows_left_out":15}
{"sheet":">>Volumes","index":7,"n_rows":0,"n_cols":0,"rows_kept":0,"cut":false,"hidden":false,"merged":[]}

{"sheet":"ERG - Yearly volume scenarios","index":8,"n_rows":110,"n_cols":16,"rows_kept":110,"cut":false,"hidden":false,"merged":[[0,10,0,14],[1,5,1,9],[1,10,1,14],[93,10,93,14],[94,5,94,9],[94,10,94,14],[23,5,23,9],[36,10,36,14],[37,10,37,14],[59,10,59,14],[60,10,60,14],[49,10,49,14],[50,10,50,14],[22,10,22,14],[23,10,23,14],[97,0,97,3],[100,0,100,3],[70,10,70,14],[71,10,71,14]]}
["Table 1 - ERG Total public lighting asset base by tariffs to be converted from CONV to LED- yearly data as at 30 June",null,null,null,null,null,null,null,null,null,"100%  LED deployment by 2030"]
["1.a - Number of public lights for LED conversion",null,null,null,"Previous period","Current period",null,null,null,null,"Forthcoming period"]
[null,null,null,null,"Actual","Actual","Actual","Forecast","Forecast","Forecast","Forecast","Forecast","Forecast","Forecast","Forecast"]
["DNSP","Rate","Road type","Light type","2019-20","2020-21","2021-22","2022-23","2023-24","2024-25","2025-26","2026-27","2027-28","2028-29","2029-30"]
["Ergon Energy",1,"Major","CONV",{"$f":"#REF!","v":{"$error":"#REF!"}},{"$f":"#REF!","v":{"$error":"#REF!"}},{"$f":"#REF!","v":{"$error":"#REF!"}},23678,20420,16465,14454,10371,7077,3972,0]
["Ergon Energy",1,"Major","LED",{"$f":"#REF!","v":{"$error":"#REF!"}},{"$f":"#REF!","v":{"$error":"#REF!"}},{"$f":"#REF!","v":{"$error":"#REF!"}},5151,8457,12461,14328,18411,21705,24810,28782]
["Ergon Energy",1,"Minor","CONV",{"$f":"#REF!","v":{"$error":"#REF!"}},{"$f":"#REF!","v":{"$error":"#REF!"}},{"$f":"#REF!","v":{"$error":"#REF!"}},47430,40904,32981,28953,20775,14177,7957,0,"Removes the Nostalgia  as these are to be converted to LED (see Table 3 below)"]
["Ergon Energy",1,"Minor","LED",{"$f":"#REF!","v":{"$error":"#REF!"}},{"$f":"#REF!","v":{"$error":"#REF!"}},{"$f":"#REF!","v":{"$error":"#REF!"}},24036,30687,38737,42390,50568,57166,63386,71343]
["Ergon Energy",2,"Major","CONV",{"$f":"#REF!","v":{"$error":"#REF!"}},{"$f":"#REF!","v":{"$error":"#REF!"}},{"$f":"#REF!","v":{"$error":"#REF!"}},12445,12226,11325,9942,7134,4868,2732,0]
["Ergon Energy","2A","Major","LED",{"$f":"#REF!","v":{"$error":"#REF!"}},{"$f":"#REF!","v":{"$error":"#REF!"}},{"$f":"#REF!","v":{"$error":"#REF!"}},1194,1413,2314,3697,6505,8771,10907,13639]
["Ergon Energy",2,"Minor","CONV",{"$f":"#REF!","v":{"$error":"#REF!"}},{"$f":"#REF!","v":{"$error":"#REF!"}},{"$f":"#REF!","v":{"$error":"#REF!"}},29121,28608,26500,21781,15629,10665,5986,0,"Removes the Nostalgia  as these are to be converted to LED (see Table 3 below)"]
["Ergon Energy","2A","Minor","LED",{"$f":"#REF!","v":{"$error":"#REF!"}},{"$f":"#REF!","v":{"$error":"#REF!"}},{"$f":"#REF!","v":{"$error":"#REF!"}},7269,7782,9890,14609,20761,25725,30404,36390]
["Ergon Energy","All","All","CONV",{"$f":"E5+E7+E9+E11","v":{"$error":"#REF!"}},{"$error":"#REF!"},{"$error":"#REF!"},112674,102158,87271,75130,53909,36787,20647,0]
["Ergon Energy","All","All","LED",{"$f":"E6+E8+E10+E12","v":{"$error":"#REF!"}},{"$f":"F6+F8+F10+F12","v":{"$error":"#REF!"}},{"$error":"#REF!"},37650,48339,63402,75024,96245,113367,129507,150154]
["Ergon Energy","All","All","All",{"$f":"E13+E14","v":{"$error":"#REF!"}},{"$f":"F13+F14","v":{"$error":"#REF!"}},{"$error":"#REF!"},150324,150497,150673,{"$f":"SUM(K5:K12)","v":150154},{"$f":"SUM(L5:L12)","v":150154},{"$f":"SUM(M5:M12)","v":150154},{"$f":"SUM(N5:N12)","v":150154},{"$f":"SUM(O5:O12)","v":150154}]
{"$rows_left_out":96}
{"sheet":">>Unit Rates","index":9,"n_rows":0,"n_cols":0,"rows_kept":0,"cut":false,"hidden":false,"merged":[]}

{"sheet":"ERG Unit Rates","index":10,"n_rows":31,"n_cols":4,"rows_kept":31,"cut":false,"hidden":false,"merged":[]}
["Table 1: Ergon Energy Public Light - Unit costs per luminaire"]
[null,null,null,"Unit cost "]
["Activity type","Asset type","Cost categories","$2022-30 "]
[null,null,null,"Actual"]
["Light installation","steel underground decorative minor (typically Rate 2)","Labour","N/A"]
[null,null,"Material","N/A"]
[null,null,"Contractor","N/A"]
[null,"steel underground minor","Labour","N/A"]
[null,null,"Material","N/A"]
[null,null,"Contractor","N/A"]
[null,"Rate 1 Major LED install","Labour",14745.486098730435]
[null,null,"Material",9330.2050159722203]
[null,null,"Contractor",7769.1658993793917]
[null,"Rate 1 Minor LED install","Labour",3459.3008037554196]
[null,null,"Material",882.75971032001712]
{"$rows_left_out":17}
{"sheet":">>Forecast capex","index":11,"n_rows":0,"n_cols":0,"rows_kept":0,"cut":false,"hidden":false,"merged":[]}

{"sheet":"ERG - Forecast capex scenarios","index":12,"n_rows":141,"n_cols":11,"rows_kept":141,"cut":false,"hidden":false,"merged":[[116,5,116,9],[1,5,1,9],[28,5,28,9],[57,5,57,9],[85,5,85,9],[101,5,101,9]]}
["Table 1 - ERG Light Replacement Capex - CONV to LED"]
["Real $2022-23",null,null,null,null,"100%  LED deployment by 2030"]
[null,null,null,null,null,"Forecast","Forecast","Forecast","Forecast","Forecast"]
["DNSP","Rate","Road type","Light type","Cost category","2025-26","2026-27","2027-28","2028-29","2029-30"]
["Ergon Energy",1,"Major","LED","Labour",{"$f":"'ERG Unit Rates'!$D23*'ERG - Yearly volume scenarios'!K$41","v":0},{"$f":"'ERG Unit Rates'!$D23*'ERG - Yearly volume scenarios'!L$41","v":0},{"$f":"'ERG Unit Rates'!$D23*'ERG - Yearly volume scenarios'!M$41","v":0},{"$f":"'ERG Unit Rates'!$D23*'ERG - Yearly volume scenarios'!N$41","v":0},{"$f":"'ERG Unit Rates'!$D23*'ERG - Yearly volume scenarios'!O$41","v":0}]
[null,1,"Major","LED","Material",{"$f":"'ERG Unit Rates'!$D24*'ERG - Yearly volume scenarios'!K$41","v":1906176},{"$f":"'ERG Unit Rates'!$D24*'ERG - Yearly volume scenarios'!L$41","v":1906176},{"$f":"'ERG Unit Rates'!$D24*'ERG - Yearly volume scenarios'!M$41","v":1906176},{"$f":"'ERG Unit Rates'!$D24*'ERG - Yearly volume scenarios'!N$41","v":1906176},{"$f":"'ERG Unit Rates'!$D24*'ERG - Yearly volume scenarios'!O$41","v":1906176}]
[null,1,"Major","LED","Contractor",{"$f":"'ERG Unit Rates'!$D25*'ERG - Yearly volume scenarios'!K$41","v":408000},{"$f":"'ERG Unit Rates'!$D25*'ERG - Yearly volume scenarios'!L$41","v":408000},{"$f":"'ERG Unit Rates'!$D25*'ERG - Yearly volume scenarios'!M$41","v":408000},{"$f":"'ERG Unit Rates'!$D25*'ERG - Yearly volume scenarios'!N$41","v":408000},{"$f":"'ERG Unit Rates'!$D25*'ERG - Yearly volume scenarios'!O$41","v":408000}]
["Ergon Energy",1,"Minor","LED","Labour",{"$f":"'ERG Unit Rates'!$D26*'ERG - Yearly volume scenarios'!K$42","v":0},{"$f":"'ERG Unit Rates'!$D26*'ERG - Yearly volume scenarios'!L$42","v":0},{"$f":"'ERG Unit Rates'!$D26*'ERG - Yearly volume scenarios'!M$42","v":0},{"$f":"'ERG Unit Rates'!$D26*'ERG - Yearly volume scenarios'!N$42","v":0},{"$f":"'ERG Unit Rates'!$D26*'ERG - Yearly volume scenarios'!O$42","v":0}]
[null,1,"Minor","LED","Material",{"$f":"'ERG Unit Rates'!$D27*'ERG - Yearly volume scenarios'!K$42","v":1284637},{"$f":"'ERG Unit Rates'!$D27*'ERG - Yearly volume scenarios'!L$42","v":1284637},{"$f":"'ERG Unit Rates'!$D27*'ERG - Yearly volume scenarios'!M$42","v":1284637},{"$f":"'ERG Unit Rates'!$D27*'ERG - Yearly volume scenarios'!N$42","v":1284637},{"$f":"'ERG Unit Rates'!$D27*'ERG - Yearly volume scenarios'!O$42","v":1284637}]
[null,1,"Minor","LED","Contractor",{"$f":"'ERG Unit Rates'!$D28*'ERG - Yearly volume scenarios'!K$42","v":815125},{"$f":"'ERG Unit Rates'!$D28*'ERG - Yearly volume scenarios'!L$42","v":815125},{"$f":"'ERG Unit Rates'!$D28*'ERG - Yearly volume scenarios'!M$42","v":815125},{"$f":"'ERG Unit Rates'!$D28*'ERG - Yearly volume scenarios'!N$42","v":815125},{"$f":"'ERG Unit Rates'!$D28*'ERG - Yearly volume scenarios'!O$42","v":815125}]
["Ergon Energy","2A","Major","LED","Labour",{"$f":"'ERG Unit Rates'!$D23*'ERG - Yearly volume scenarios'!K$43","v":0},{"$f":"'ERG Unit Rates'!$D23*'ERG - Yearly volume scenarios'!L$43","v":0},{"$f":"'ERG Unit Rates'!$D23*'ERG - Yearly volume scenarios'!M$43","v":0},{"$f":"'ERG Unit Rates'!$D23*'ERG - Yearly volume scenarios'!N$43","v":0},{"$f":"'ERG Unit Rates'!$D23*'ERG - Yearly volume scenarios'!O$43","v":0}]
[null,"2A","Major","LED","Material",{"$f":"'ERG Unit Rates'!$D24*'ERG - Yearly volume scenarios'!K$43","v":1322760},{"$f":"'ERG Unit Rates'!$D24*'ERG - Yearly volume scenarios'!L$43","v":1322760},{"$f":"'ERG Unit Rates'!$D24*'ERG - Yearly volume scenarios'!M$43","v":1322760},{"$f":"'ERG Unit Rates'!$D24*'ERG - Yearly volume scenarios'!N$43","v":1322760},{"$f":"'ERG Unit Rates'!$D24*'ERG - Yearly volume scenarios'!O$43","v":1322760}]
[null,"2A","Major","LED","Contractor",{"$f":"'ERG Unit Rates'!$D25*'ERG - Yearly volume scenarios'!K$43","v":283125},{"$f":"'ERG Unit Rates'!$D25*'ERG - Yearly volume scenarios'!L$43","v":283125},{"$f":"'ERG Unit Rates'!$D25*'ERG - Yearly volume scenarios'!M$43","v":283125},{"$f":"'ERG Unit Rates'!$D25*'ERG - Yearly volume scenarios'!N$43","v":283125},{"$f":"'ERG Unit Rates'!$D25*'ERG - Yearly volume scenarios'!O$43","v":283125}]
["Ergon Energy","2A","Minor","LED","Labour",{"$f":"'ERG Unit Rates'!$D26*'ERG - Yearly volume scenarios'!K$44","v":0},{"$f":"'ERG Unit Rates'!$D26*'ERG - Yearly volume scenarios'!L$44","v":0},{"$f":"'ERG Unit Rates'!$D26*'ERG - Yearly volume scenarios'!M$44","v":0},{"$f":"'ERG Unit Rates'!$D26*'ERG - Yearly volume scenarios'!N$44","v":0},{"$f":"'ERG Unit Rates'!$D26*'ERG - Yearly volume scenarios'!O$44","v":0}]
[null,"2A","Minor","LED","Material",{"$f":"'ERG Unit Rates'!$D27*'ERG - Yearly volume scenarios'!K$44","v":1044100},{"$f":"'ERG Unit Rates'!$D27*'ERG - Yearly volume scenarios'!L$44","v":1044100},{"$f":"'ERG Unit Rates'!$D27*'ERG - Yearly volume scenarios'!M$44","v":1044100},{"$f":"'ERG Unit Rates'!$D27*'ERG - Yearly volume scenarios'!N$44","v":1044100},{"$f":"'ERG Unit Rates'!$D27*'ERG - Yearly volume scenarios'!O$44","v":1044100}]
{"$rows_left_out":127}
{"sheet":"ERG - Gross Capex ","index":13,"n_rows":96,"n_cols":10,"rows_kept":96,"cut":false,"hidden":false,"merged":[[1,1,1,5],[36,1,36,5],[66,1,66,5]]}
["1 - This tables shows the RATE 1 and RATE 2A LED capex conversions funded by Ergon"]
[null,"100%  LED deployment by 2030"]
[null,"2025-26","2026-27","2027-28","2028-29","2029-30"]
["Direct Costs ($Real 2024-25)"]
["Labour",{"$f":"'ERG - Forecast capex scenarios'!F138*'Cost Escalations'!$E$21*(1+'Cost Escalations'!B30)","v":1312417.2701361673},{"$f":"'ERG - Forecast capex scenarios'!G138*'Cost Escalations'!$E$21*(1+'Cost Escalations'!C30)","v":1347934.1023187931},{"$f":"'ERG - Forecast capex scenarios'!H138*'Cost Escalations'!$E$21*(1+'Cost Escalations'!D30)","v":1380534.3472687153},{"$f":"'ERG - Forecast capex scenarios'!I138*'Cost Escalations'!$E$21*(1+'Cost Escalations'!E30)","v":1417556.4039422425},{"$f":"'ERG - Forecast capex scenarios'!J138*'Cost Escalations'!$E$21*(1+'Cost Escalations'!F30)","v":1457296.2648310007},null,null,{"$f":"'ERG - Forecast capex scenarios'!F138*'Cost Escalations'!$E$21*(1+'Cost Escalations'!B30)","v":1312417.2701361673},{"$f":"'ERG - Forecast capex scenarios'!F138","v":1183524.1086209707}]
["Contractors",{"$f":"'ERG - Forecast capex scenarios'!F140*'Cost Escalations'!$E$21*(1+'Cost Escalations'!B26)","v":3577667.8383846618},{"$f":"'ERG - Forecast capex scenarios'!G140*'Cost Escalations'!$E$21*(1+'Cost Escalations'!C26)","v":3615802.8631479098},{"$f":"'ERG - Forecast capex scenarios'!H140*'Cost Escalations'!$E$21*(1+'Cost Escalations'!D26)","v":3650670.5185808041},{"$f":"'ERG - Forecast capex scenarios'!I140*'Cost Escalations'!$E$21*(1+'Cost Escalations'!E26)","v":3697185.8088927427},{"$f":"'ERG - Forecast capex scenarios'!J140*'Cost Escalations'!$E$21*(1+'Cost Escalations'!F26)","v":3750555.1831754656},null,null,{"$f":"'ERG - Forecast capex scenarios'!F140*'Cost Escalations'!$E$21*(1+'Cost Escalations'!B26)","v":3577667.8383846618},{"$f":"'ERG - Forecast capex scenarios'!F140","v":3229815.3339561056}]
["Materials",{"$f":"'ERG - Forecast capex scenarios'!F139*'Cost Escalations'!$E$21","v":7851253.5354828481},{"$f":"'ERG - Forecast capex scenarios'!G139*'Cost Escalations'!$E$21","v":7863416.5624435823},{"$f":"'ERG - Forecast capex scenarios'!H139*'Cost Escalations'!$E$21","v":7875579.5894043176},{"$f":"'ERG - Forecast capex scenarios'!I139*'Cost Escalations'!$E$21","v":7887742.6163650518},{"$f":"'ERG - Forecast capex scenarios'!J139*'Cost Escalations'!$E$21","v":7899905.643325788},null,null,{"$f":"'ERG - Forecast capex scenarios'!F139*'Cost Escalations'!$E$21","v":7851253.5354828481},{"$f":"'ERG - Forecast capex scenarios'!F139","v":7162308.0334298937}]
["Total",{"$f":"SUM(B5:B7)","v":12741338.644003678},12827153.527910285,12906784.455253836,13002484.829200037,13107757.091332253,null,null,{"$f":"SUM(I5:I7)","v":12741338.644003678},{"$f":"SUM(J5:J7)","v":11575647.47600697}]
[]
["Overheads & Oncosts"]
["Fleet oncost",{"$f":"B5*Overheads!$D$15","v":277760.44368673069},{"$f":"C5*Overheads!$D$15","v":285277.23829914059},{"$f":"D5*Overheads!$D$15","v":292176.7653837293},{"$f":"E5*Overheads!$D$15","v":300012.1262265254},{"$f":"F5*Overheads!$D$15","v":308422.68409076711}]
["Material oncosts",{"$f":"B7*Overheads!$D$9","v":624863.21885037376},{"$f":"C7*Overheads!$D$9","v":625831.246203369},{"$f":"D7*Overheads!$D$9","v":626799.27355636435},{"$f":"E7*Overheads!$D$9","v":627767.30090935959},{"$f":"F7*Overheads!$D$9","v":628735.32826235506}]
["Network overheads",{"$f":"(B8+B11+B12)*Overheads!$D$19","v":1575106.9269916122},{"$f":"(C8+C11+C12)*Overheads!$D$19","v":1585993.216223082},{"$f":"(D8+D11+D12)*Overheads!$D$19","v":1596094.348259239},{"$f":"(E8+E11+E12)*Overheads!$D$19","v":1608158.6295837061},{"$f":"(F8+F11+F12)*Overheads!$D$19","v":1621394.3260616281}]
["Non-network overheads",{"$f":"B5*Overheads!$D$20","v":464622.57778997114},{"$f":"C5*Overheads!$D$20","v":477196.26338457875},{"$f":"D5*Overheads!$D$20","v":488737.41739853489},{"$f":"E5*Overheads!$D$20","v":501843.98327369738},{"$f":"F5*Overheads!$D$20","v":515912.70747239218}]
["Non-network depreciation",{"$f":"B5*Overheads!$D$25","v":180876.58142648893},{"$f":"C5*Overheads!$D$25","v":185771.49048816648},{"$f":"D5*Overheads!$D$25","v":190264.43720136868},{"$f":"E5*Overheads!$D$25","v":195366.79542299631},{"$f":"F5*Overheads!$D$25","v":200843.71983376471}]
{"$rows_left_out":82}
{"sheet":">>Forecast opex","index":14,"n_rows":0,"n_cols":0,"rows_kept":0,"cut":false,"hidden":false,"merged":[]}

{"sheet":"ERG - Opex BST","index":15,"n_rows":39,"n_cols":9,"rows_kept":39,"cut":false,"hidden":false,"merged":[]}
["Ergon Energy - Factors for the Base Step Trend Approach used to derive forecast opex"]
[]
["Table 1: Forecast Volume of LED and CONV Lights"]
["Volumes","2021-22","2022-23","2024-25","2025-26","2026-27","2027-28","2028-29","2029-30"]
["Conventional",null,null,null,{"$f":"'ERG - Yearly volume scenarios'!K83","v":75130},{"$f":"'ERG - Yearly volume scenarios'!L83","v":53909},{"$f":"'ERG - Yearly volume scenarios'!M83","v":36787},{"$f":"'ERG - Yearly volume scenarios'!N83","v":20647},{"$f":"'ERG - Yearly volume scenarios'!O83","v":0}]
["LED",null,null,null,{"$f":"'ERG - Yearly volume scenarios'!K84+'ERG - Yearly volume scenarios'!K106","v":77302},{"$f":"'ERG - Yearly volume scenarios'!L84+'ERG - Yearly volume scenarios'!L106","v":98719},{"$f":"'ERG - Yearly volume scenarios'!M84+'ERG - Yearly volume scenarios'!M106","v":116041},{"$f":"'ERG - Yearly volume scenarios'!N84+'ERG - Yearly volume scenarios'!N106","v":132384},{"$f":"'ERG - Yearly volume scenarios'!O84+'ERG - Yearly volume scenarios'!O106","v":153237}]
["Total",null,null,null,{"$f":"SUM(E5:E6)","v":152432},{"$f":"SUM(F5:F6)","v":152628},{"$f":"SUM(G5:G6)","v":152828},{"$f":"SUM(H5:H6)","v":153031},{"$f":"SUM(I5:I6)","v":153237}]
[]
["Table 2: Base Step Trend approach"]
["2a: Forecast Price Change"]
["Rate","2021-22","2022-23","2024-25","2025-26","2026-27","2027-28","2028-29","2029-30"]
["Labour",null,null,null,{"$f":"'Cost Escalations'!B29","v":1.1599999999999999E-2},{"$f":"'Cost Escalations'!C29","v":8.6E-3},{"$f":"'Cost Escalations'!D29","v":6.1000000000000004E-3},{"$f":"'Cost Escalations'!E29","v":8.9999999999999993E-3},{"$f":"'Cost Escalations'!F29","v":1.0500000000000001E-2}]
["Contractor",null,null,null,{"$f":"'Cost Escalations'!B25","v":1.0500000000000001E-2},{"$f":"'Cost Escalations'!C25","v":7.1000000000000004E-3},{"$f":"'Cost Escalations'!D25","v":6.1000000000000004E-3},{"$f":"'Cost Escalations'!E25","v":9.1999999999999998E-3},{"$f":"'Cost Escalations'!F25","v":1.09E-2}]
["Materials/other",null,null,null,0,0,0,0,0]
[]
{"$rows_left_out":25}
{"sheet":"ERG - Forecast opex","index":16,"n_rows":39,"n_cols":8,"rows_kept":39,"cut":false,"hidden":false,"merged":[]}
["Table 1 - Opex Direct Costs","Actual"]
["Opex Direct Costs","2022-23","2024-25","2025-26","2026-27","2027-28","2028-29","2029-30"]
["Maintenance"]
["   Labour",68437.169999999984,{"$f":"B4*'Cost Escalations'!$E$21","v":75020.170929960601}]
["   Contractor",4774784.0299999993,{"$f":"B5*'Cost Escalations'!$E$21","v":5234072.5673525976}]
["   Materials",303078.30000000005,{"$f":"B6*'Cost Escalations'!$E$21","v":332231.53253066842}]
["   Other",458593.18,{"$f":"B7*'Cost Escalations'!$E$21","v":502705.4559812189}]
["Damage/Emergency"]
["   Labour",1332665.0599999998,{"$f":"B9*'Cost Escalations'!$E$21","v":1460854.6874978349}]
["   Contractor",331765.18000000005,{"$f":"B10*'Cost Escalations'!$E$21","v":363677.81590339221}]
["   Materials",401137.78,{"$f":"B11*'Cost Escalations'!$E$21","v":439723.3962489235}]
["  Other",52326.39,{"$f":"B12*'Cost Escalations'!$E$21","v":57359.688045951953}]
["Total direct opex",{"$f":"SUM(B4:B12)","v":7722787.089999998},{"$f":"SUM(C4:C12)","v":8465645.3144905493}]
[]
["Adjustments (material costs)"]
{"$rows_left_out":24}