{"text_format":"1","workbook":"xlsx","n_sheets":11,"sheets":["Instructions","Contents","Business & other details","4.2 Metering - Capex","4.2 Metering - ICT","7.4 Shared Assets","Change log","AER CF","AER NRs","AER lookups","AER ETL"],"not_rendered":{"charts":0,"images":2,"macros":1,"external_links":0,"defined_names":405,"comments":1,"pivot_tables":0},"unopened":[],"bounds":{"document_bytes":16777216,"sheet_cells":100000,"rows_first":2000,"rows_last":500,"rows_between":2000,"halvings":0,"cell_chars":16384,"cell_head_chars":4096},"cells_cut":0,"cells_raw":0,"read":"whole","date_system":"1900"}

{"sheet":"Instructions","index":0,"n_rows":24,"n_cols":4,"rows_kept":24,"cut":false,"hidden":false,"merged":[[1,1,1,4],[2,1,2,4],[3,1,3,4],[4,1,4,4],[5,2,5,4],[18,1,24,1],[18,2,18,4],[13,2,13,4],[16,2,16,4],[7,1,8,1],[7,2,7,3],[8,2,8,4],[10,1,11,1],[10,2,10,3],[11,2,11,4]]}
[]
[null,{"$f":"CONCATENATE(dms_Sector,\" \",dms_Segment,\" \", \"Network Service Provider\")","v":"Electricity Distribution Network Service Provider"}]
[null,"New Historical Data RIN Template"]
[null,{"$f":"CONCATENATE(\"This template is to be used by \",dms_TradingNameFull,\" to fulfil its reporting obligations to the AER.\")","v":"This template is to be used by SA Power Networks to fulfil its reporting obligations to the AER."}]
[null,"INSTRUCTIONS"]
[null,"GENERAL","Complete the Business & other details worksheet before entering data or values in any other worksheets. The Business & other details worksheet is linked to other worksheets within the workbook and automatically generates certain column headings and conditional formatting."]
[]
[null,"CONFIDENTIAL INFORMATION","\nPlease use the macro at the top of each \nworksheet to identify confidential information\nin the confidential workbook. \n\n"]
[null,null,"-Do this by selecting the cell or cells that contain confidential information and then run the CONFIDENTIAL macro. This will format the cells a specific colour that is identified by the AER's database which in turn marks that information as confidential.\n\n-To reverse this, select the cell or cells and run the NON-CONFIDENTIAL macro."]
[]
[null,"PROTECTED (SOCI) INFORMATION","\nPlease use the macro at the top of each \nworksheet to identify information in the \nconfidential workbook that is protected \ninformation under the SOCI Act. All \ninformation marked Protected (SOCI) is also \ndeemed to be confidential information."]
[null,null,"-Do this by selecting the cell or cells that contain protected information and then run the PROTECTED (SOCI) macro. This will format the cells a specific colour that is identified by the AER's database which in turn marks that information as protected..\n\n-To reverse this, select the cell or cells and run the NON-PROTECTED macro."]
[]
[null,"RESPONSES","\nPlease return four (4) files to the AER: \n\n1. A confidential version which must contain a complete set of all responses with confidential information marked using the Mark selection CONFIDENTIAL macro and which has been completed using the locked template file provided by the AER. \n\n2. An actual and an estimate version with confidential information marked using the Mark selection CONFIDENTIAL macro and which has been completed using the locked template file provided by the AER.\n\n3. A public version with confidential information either removed completely or aggregated in some form together with writtten consent to disclose the public version of the response.\n\nUse the drop down box on the Business and other details worksheet to identify the file as either confidential ('consolidated') or public. "]
[]
{"$rows_left_out":10}
{"sheet":"Contents","index":1,"n_rows":17,"n_cols":5,"rows_kept":17,"cut":false,"hidden":false,"merged":[[7,3,7,4]]}
[null,null,{"$f":"INDEX(dms_Worksheet_List,MATCH(dms_Model,dms_Model_List))","v":"NEW HISTORICAL CATEGORY ANALYSIS"}]
[null,null,{"$f":"INDEX(dms_TradingNameFull_List,MATCH(dms_TradingName,dms_TradingName_List))","v":"SA Power Networks"}]
[null,null,{"$f":"CONCATENATE(\"REGULATORY PERIOD FROM \", FRCP_y1, \" TO \", FRCP_y5)","v":"REGULATORY PERIOD FROM 2025-26 TO 2029-30"}]
[]
[]
[null,null,null,"CONTENTS"]
[]
[null,null,null,"DRAFT ONLY - DO NOT USE FOR SUBMISSION"]
[]
[null,null,null,"TEMPLATE","FINAL RIN - OCTOBER 2023"]
[]
[null,null,null,"SUBMISSION","Business & other details"]
[]
[null,null,null,"ALTERNATIVE CONTROL","4.2 Metering - Capex"]
[null,null,null,null,"4.2 Metering - ICT"]
{"$rows_left_out":3}
{"sheet":"Business & other details","index":2,"n_rows":77,"n_cols":79,"rows_kept":77,"cut":false,"hidden":false,"merged":[[0,7,2,15],[3,21,3,57],[6,21,6,75],[8,16,8,93],[18,21,18,35],[18,37,18,58],[19,21,19,35],[19,37,19,48],[25,21,25,35],[25,37,25,58],[25,60,25,66],[25,68,25,89],[10,16,10,93],[11,16,11,93],[26,21,26,35],[26,37,26,58],[26,60,26,66],[26,68,26,89],[27,21,27,35],[27,37,27,51],[27,60,27,66],[27,68,27,82],[28,21,28,35],[28,37,28,40],[28,49,28,51],[28,60,28,66],[28,68,28,71],[28,80,28,82],[34,21,34,35],[34,37,34,58],[34,60,34,66],[34,68,34,89],[35,21,35,35],[35,37,35,58],[35,60,35,66],[35,68,35,89],[36,21,36,35],[36,37,36,58],[36,60,36,66],[36,68,36,89],[44,25,44,34],[44,37,44,44],[44,46,44,53],[44,55,44,62],[44,64,44,71],[44,73,44,80],[45,37,45,44],[45,46,45,53],[45,55,45,62],[45,64,45,71],[45,73,45,80],[46,37,46,44],[46,46,46,53],[46,55,46,62],[46,64,46,71],[46,73,46,80],[48,25,48,34],[48,37,48,44],[48,46,48,53],[48,55,48,62],[48,64,48,71],[48,73,48,80],[49,37,49,44],[49,46,49,53],[49,55,49,62],[49,64,49,71],[49,73,49,80],[50,37,50,44],[50,46,50,53],[50,55,50,62],[50,64,50,71],[50,73,50,80],[52,25,52,34],[52,37,52,44],[52,46,52,53],[52,55,52,62],[52,64,52,71],[52,73,52,80],[53,37,53,44],[53,46,53,53],[53,55,53,62],[53,64,53,71],[53,73,53,80],[54,37,54,44],[54,46,54,53],[54,55,54,62],[54,64,54,71],[54,73,54,80],[56,25,56,34],[56,37,56,44],[58,25,58,34],[58,37,58,44],[64,25,64,34],[64,37,64,52],[72,25,74,34],[72,37,74,81],[76,25,76,34],[76,37,76,52],[66,25,66,34],[66,37,66,52],[68,25,68,34],[68,37,68,52],[70,25,70,34],[70,37,70,52]]}
[null,null,null,null,null,null,null,null,null,null,null,null,null,null,null,null,null,null,null,null,null,{"$f":"INDEX(dms_Worksheet_List,MATCH(dms_Model,dms_Model_List))","v":"NEW HISTORICAL CATEGORY ANALYSIS"}]
[null,null,null,null,null,null,null,null,null,null,null,null,null,null,null,null,null,null,null,null,null,{"$f":"INDEX(dms_TradingNameFull_List,MATCH(dms_TradingName,dms_TradingName_List))","v":"SA Power Networks"}]
[null,null,null,null,null,null,null,null,null,null,null,null,null,null,null,null,null,null,null,null,null,{"$f":"CONCATENATE(\"REGULATORY PERIOD FROM \", FRCP_y1, \" TO \", FRCP_y5)","v":"REGULATORY PERIOD FROM 2025-26 TO 2029-30"}]
[null,null,null,null,null,null,null,null,null,null,null,null,null,null,null,null,null,null,null,null,null,"BUSINESS & OTHER DETAILS"]
[]
[null,null,null,null,null,null,null,null,null,null,null,null,null,null,null,null,null,null,null,null,null,"INSTRUCTIONS"]
[null,null,null,null,null,null,null,null,null,null,null,null,null,null,null,null,null,null,null,null,null,"Complete the following business details regulatory template before entering data or values in any other regulatory template. This regulatory template is linked to other cells within the spreadsheet and automatically generates column headings and conditional formatting to distinguish business specific input and non-input cells. "]
[]
[null,null,null,null,null,null,null,null,null,null,null,null,null,null,null,null,"SUBMISSION PARTICULARS INPUT SHEET"]
[]
[null,null,null,null,null,null,null,null,null,null,null,null,null,null,null,null,"DRAFT TEMPLATE ONLY"]
[null,null,null,null,null,null,null,null,null,null,null,null,null,null,null,null,"DO NOT USE FOR SUBMISSIONS"]
[]
[]
[null,null,null,null,null,null,null,null,null,null,null,null,null,null,null,null,null,null,null,null,null,"ENTITY DETAILS"]
{"$rows_left_out":63}
{"sheet":"4.2 Metering - Capex","index":3,"n_rows":852,"n_cols":11,"rows_kept":852,"cut":false,"hidden":false,"merged":[[6,1,6,5]]}
[null,{"$f":"INDEX(dms_Worksheet_List,MATCH(dms_Model,dms_Model_List))","v":"NEW HISTORICAL CATEGORY ANALYSIS"}]
[null,{"$f":"INDEX(dms_TradingNameFull_List,MATCH(dms_TradingName,dms_TradingName_List))","v":"SA Power Networks"}]
[null,{"$f":"CONCATENATE(\"REGULATORY PERIOD FROM \", FRCP_y1, \" TO \", FRCP_y5)","v":"REGULATORY PERIOD FROM 2025-26 TO 2029-30"}]
[null,"4.2 METERING"]
[null," TEMPLATE DATE - OCTOBER 2023 - FINAL RIN"]
[]
[null,"Table numbering on this worksheet starts at 4.2.4.  Tables have been GROUPED for ease of navigation. There are TWO descriptor tables and THREE data tables on this worksheet. Yellow cells are input cells and may be overwritten if required."]
[]
[]
[null,"Meter type and meter code must match those reported in the Standardised Metering Capex and Opex model"]
[]
[null,"A. METER TYPES"]
[null,"METER TYPE ","METER CODE"]
[]
[]
{"$rows_left_out":838}
{"sheet":"4.2 Metering - ICT","index":4,"n_rows":133,"n_cols":11,"rows_kept":133,"cut":false,"hidden":false,"merged":[]}
[null,{"$f":"INDEX(dms_Worksheet_List,MATCH(dms_Model,dms_Model_List))","v":"NEW HISTORICAL CATEGORY ANALYSIS"}]
[null,{"$f":"INDEX(dms_TradingNameFull_List,MATCH(dms_TradingName,dms_TradingName_List))","v":"SA Power Networks"}]
[null,{"$f":"CONCATENATE(\"REGULATORY PERIOD FROM \", FRCP_y1, \" TO \", FRCP_y5)","v":"REGULATORY PERIOD FROM 2025-26 TO 2029-30"}]
[null,"4.2 METERING"]
[null," TEMPLATE DATE - OCTOBER 2023 - FINAL RIN"]
[]
[null,"Table numbering on this worksheet starts at 4.2.7. There is ONE descriptor table on this worksheet and TWO data tables. Tables have been GROUPED for ease of navigation."]
[]
[]
[null,"Equipment type must match those reported in the Standardised Metering Capex and Opex model"]
[]
[null,"EQUIPMENT TYPE"]
[null,"EQUIPMENT TYPE"]
[]
[]
{"$rows_left_out":119}
{"sheet":"7.4 Shared Assets","index":5,"n_rows":84,"n_cols":12,"rows_kept":84,"cut":false,"hidden":false,"merged":[[39,2,39,11],[40,2,40,11],[41,2,41,11],[33,2,33,11],[34,2,34,11],[35,2,35,11],[36,2,36,11],[37,2,37,11],[38,2,38,11],[7,1,8,1],[7,2,8,2],[30,2,30,11],[31,2,31,11],[32,2,32,11]]}
[null,{"$f":"IF(dms_MultiYear_ResponseFlag=\"Yes\",\"REGULATORY REPORTING STATEMENT - HISTORICAL INFORMATION\",INDEX(dms_Worksheet_List,MATCH(dms_Model,dms_Model_List)))","v":"REGULATORY REPORTING STATEMENT - HISTORICAL INFORMATION"}]
[null,{"$f":"INDEX(dms_TradingNameFull_List,MATCH(dms_TradingName,dms_TradingName_List))","v":"SA Power Networks"}]
[null,{"$f":"CONCATENATE(\"REGULATORY PERIOD FROM \", FRCP_y1, \" TO \", FRCP_y5)","v":"REGULATORY PERIOD FROM 2025-26 TO 2029-30"}]
[null,"7.4 SHARED ASSETS"]
[null," TEMPLATE DATE - OCTOBER 2023 - FINAL RIN"]
[]
[null,"7.4.1 - TOTAL UNREGULATED REVENUE EARNED WITH SHARED ASSETS "]
[null,"Name of shared asset unregulated service","Description of shared assets used to provide the service","Shared asset unregulated revenue  \n($0's, nominal)"]
[null,null,null,{"$f":"dms_y1","v":"2014-15"},{"$f":"dms_y2","v":"2015-16"},{"$f":"dms_y3","v":"2016-17"},{"$f":"dms_y4","v":"2017-18"},{"$f":"dms_y5","v":"2018-19"},{"$f":"dms_y6","v":"2019-20"},{"$f":"dms_y7","v":"2020-21"},{"$f":"dms_y8","v":"2021-22"},{"$f":"dms_y9","v":"2022-23"}]
[null,"Fibre Access","Rental of overhead and underground distribution assets for telecommunication services."]
[null,"Pole Rental","Rental of overhead and underground distribution assets for telecommunication services."]
[null,"Duct Space Rental","Rental of underground distribution assets for telecommunication services."]
[null,"Facilities Access","Facilities Access Agreements for access to other assets - e.g. towers, base stations etc"]
[null,"Property Rentals","Rental fees received for lease of properties.",156378,203885,242099,344014,320742,279642,256852,287399,284336]
[null,"Unregulated Services - Vehicle revenue","Unregulated construction and maintenance services provided to external groups, e.g. ElectraNet. Relates specifically to use of regulated heavy vehicles in undertaking work.",2238994,1777373,1425950,1630256,2267809,2927060,2972384,2887387,2962856]
{"$rows_left_out":70}
{"sheet":"Change log","index":6,"n_rows":4,"n_cols":7,"rows_kept":4,"cut":false,"hidden":true,"merged":[]}
[]
["Record of changes"]
[]
["Date change made","Worksheet","Table","Cell","Description of change","Date circulated to NSPs","Circulating email iManage #"]

{"sheet":"AER CF","index":7,"n_rows":76,"n_cols":25,"rows_kept":76,"cut":false,"hidden":true,"merged":[[41,38,41,59],[41,69,41,90],[3,1,3,22],[39,38,39,59],[39,69,39,90],[40,38,40,59],[40,69,40,90]]}
[null,"AER CONDITIONAL FORMATTING"]
[]
[null,"CELLS FLAGED \"Y\" and greyed out will be greyed out in the worksheets."]
[null,"CONDITIONAL FORMATTING MAP"]
[null,null,null,null,null,"=INDEX(dms_CF_3.6.1, MATCH(dms_TradingName,dms_CF_TradingName))=\"Y\"","=INDEX(dms_CF_3.6.5, MATCH(dms_TradingName,dms_CF_TradingName))=\"Y\"","=INDEX(dms_CF_3.6.6.1, MATCH(dms_TradingName,dms_CF_TradingName))=\"Y\"","=INDEX(dms_CF_3.6.6.2, MATCH(dms_TradingName,dms_CF_TradingName))=\"Y\"","=INDEX(dms_CF_3.6.6.3, MATCH(dms_TradingName,dms_CF_TradingName))=\"Y\"","=INDEX(dms_CF_3.6.7.1, MATCH(dms_TradingName,dms_CF_TradingName))=\"Y\"","=INDEX(dms_CF_3.6.7.2, MATCH(dms_TradingName,dms_CF_TradingName))=\"Y\"","=INDEX(dms_CF_3.6.7.3, MATCH(dms_TradingName,dms_CF_TradingName))=\"Y\"","=INDEX(dms_CF_3.6.7.4, MATCH(dms_TradingName,dms_CF_TradingName))=\"Y\"","=INDEX(dms_CF_3.6.8, MATCH(dms_TradingName,dms_CF_TradingName))=\"Y\"","=INDEX(dms_CF_4.1, MATCH(dms_TradingName,dms_CF_TradingName))=\"Y\"","=INDEX(dms_CF_6.8, MATCH(dms_TradingName,dms_CF_TradingName))=\"Y\"","=INDEX(dms_CF_7.12, MATCH(dms_TradingName,dms_CF_TradingName))=\"Y\"","=INDEX(dms_CF_8.1_A, MATCH(dms_TradingName,dms_CF_TradingName))=\"Y\"","=INDEX(dms_CF_8.1_B, MATCH(dms_TradingName,dms_CF_TradingName))=\"Y\"",{"$f":"INDEX(dms_CF_8.1_Neg, MATCH(dms_TradingName,dms_CF_TradingName))=\"Y\"","v":false},"=INDEX(dms_CF_4.4.1_Neg, MATCH(dms_TradingName,dms_CF_TradingName))=\"Y\"",null,null,"=INDEX(dms_CF_F10, MATCH(dms_TradingName,dms_CF_TradingName))=\"Y\""]
[null,"dms_CF_TradingName","JurisdictionList","Sector","Segment","dms_CF_3.6.1","dms_CF_3.6.5","dms_CF_3.6.6.1","dms_CF_3.6.6.2","dms_CF_3.6.6.3","dms_CF_3.6.7.1","dms_CF_3.6.7.2","dms_CF_3.6.7.3","dms_CF_3.6.7.4","dms_CF_3.6.8","dms_CF_4.1","dms_CF_6.8 (set from dms_MAIFI_flag)","dms_CF_7.12","dms_CF_8.1_A  (and 8.4)","dms_CF_8.1_B  (and 8.4)","dms_CF_8.1_Neg  (and 8.4)","dms_CF_4.4.1","dms_CF_MAIFI_flag (set from dms_MAIFI_flag)","9.5 TUOS (set from Jurisdiction)","dms_CF_F10"]
[null,"Amadeus","NT","Gas","Transmission","-","-","-","-","-","-","-","-","-","-","-","-","-","-","-","-","-","-","-","-"]
[null,"APA GasNet","Vic","Gas","Transmission","-","-","-","-","-","-","-","-","-","-","-","-","-","-","-","-","-","-","-","-"]
[null,"Ausgrid","NSW","Electricity","Distribution",null,"Y","N","N","N","N","N","N","Y","N","N",{"$f":"IFERROR(IF(_xlfn.SINGLE(dms_MAIFI_Flag)=\"Yes\",\"N\",\"Y\"),\"Y\")","v":"Y"},"Y","N","Y","Y","N",{"$f":"IFERROR(LEFT(_xlfn.SINGLE(dms_MAIFI_Flag)),\"N\")","v":"N"},{"$f":"IF('AER CF'!$C7=\"Vic\",\"Y\",\"N\")","v":"N"}]
[null,"Ausgrid (Tx Assets)","NSW","Electricity","Distribution",null,"Y","N","N","N","N","N","N","Y","N","N","Y","Y","N","Y","Y","N","N",{"$f":"IF('AER CF'!$C8=\"Vic\",\"Y\",\"N\")","v":"Y"}]
[null,"AusNet (D)","Vic","Electricity","Distribution",null,"N","N",null,null,"N","N","N","N","N","N","Y","N","N","N","Y","N","N",{"$f":"IF('AER CF'!$C9=\"Vic\",\"Y\",\"N\")","v":"N"}]
[null,"AusNet (T)","Vic","Electricity","Transmission",null,"N",null,null,null,"N","N","N","N","N","Y","Y","N","N","N","Y","N","N",{"$f":"IF('AER CF'!$C10=\"Vic\",\"Y\",\"N\")","v":"N"}]
[null,"Australian Distribution Co.","NSW","Electricity","Distribution","N","N","N","N",null,"N","N","N","N","N","N","Y","N","N","N","N","N","N",{"$f":"IF('AER CF'!$C13=\"Vic\",\"Y\",\"N\")","v":"N"}]
[null,"Australian Distribution Co. (Vic)","Vic","Electricity","Distribution","N","N","N","N",null,"N","N","N","N","N","N","Y","N","N","N","N","N","N",{"$f":"IF('AER CF'!$C14=\"Vic\",\"Y\",\"N\")","v":"Y"}]
[null,"CitiPower","Vic","Electricity","Distribution",null,"N","N",null,null,"N","N","N","N","N","N","Y","N","N","N","Y","N","N",{"$f":"IF('AER CF'!$C15=\"Vic\",\"Y\",\"N\")","v":"Y"}]
{"$rows_left_out":62}
{"sheet":"AER NRs","index":8,"n_rows":232,"n_cols":16,"rows_kept":232,"cut":false,"hidden":true,"merged":[[4,1,28,1],[32,1,55,1],[33,10,35,10],[33,36,33,57],[33,67,33,88],[34,36,34,57],[34,67,34,88],[35,36,35,57],[35,67,35,88],[36,10,40,10],[44,10,45,10],[65,1,78,1],[84,1,97,1],[100,1,107,1],[110,1,115,1],[118,1,132,1],[195,1,196,1],[199,1,200,1],[208,1,213,1],[135,1,150,1],[152,1,158,1],[160,1,174,1],[176,1,177,1],[179,1,184,1],[191,1,192,1]]}
[null,"AER NAMED RANGES"]
[]
[null,"DROP DOWN SELECTORS USED IN WORKBOOKS"]
[]
[null,"COVER SHEET","dms_DataQuality_List","dms_Confid_status_List"]
[null,null,"-- select --","-- select --"]
[null,null,"Actual","Public"]
[null,null,"Estimate","Confidential"]
[null,null,"Consolidated"]
[]
[]
[null,null,"For all files either AER or business needs to be able to specify the type of submission","For PTRM & RFM templates we must provide a choice in case they change their form of control - otherwise it is drawn from the business specific lookup table above."]
[null,null,"dms_SourceList","dms_FormControl_Choices"]
[null,null,"-- select --","Revenue cap"]
[null,null,"After appeal","Revenue yield"]
{"$rows_left_out":218}
{"sheet":"AER lookups","index":9,"n_rows":101,"n_cols":37,"rows_kept":101,"cut":false,"hidden":true,"merged":[[5,36,7,36],[22,1,22,4],[4,24,4,35],[5,24,5,27],[5,29,7,33],[5,34,7,34],[5,35,7,35]]}
[null,"AER LOOKUP TABLES"]
[]
[null,"Template number",5]
[]
[null,null,null,null,null,null,null,null,null,null,null,null,null,null,null,null,null,null,null,null,null,null,null,null,"FOR ELECTRICITY BUSINESSES ONLY"]
[null,null,null,null,null,null,null,null,null,null,null,null,null,null,null,null,null,null,null,null,null,null,null,null,"Feeder Types",null,null,null,"TasNetworks (D)","Feeder Names"]
[]
[null,null,null,null,null,null,null,null,null,null,null,null,null,null,null,null,null,null,null,null,null,null,null,null,"CBD","Urban","Short rural","long rural","EXTRA"]
[null,"dms_TradingName_List","dms_TradingNameFull_List","dms_ABN_List","dms_JurisdictionList","dms_Sector_List","dms_Segment_List","dms_FormControl_List","dms_RPT_List","dms_RPTMonth_List","dms_CRCPlength_List","dms_FRCPlength_List","dms_PRCPlength_List","dms_663_List","dms_Addr1_List","dms_Addr2_List","dms_Suburb_List","dms_State_List","dms_PostCode_List","dms_PAddr1_List","dms_PAddr2_List","dms_PSuburb_List","dms_PState_List","dms_PPostCode_List","dms_CBD_flag","dms_Urban_flag","dms_ShortRural_flag","dms_LongRural_flag","dms_FeederType_5_flag","dms_FeederName_1","dms_FeederName_2","dms_FeederName_3","dms_FeederName_4","dms_FeederName_5","dms_MAIFI_flag_List","dms_Public_Lighting_List","Name"]
[null,"Australian Distribution Co.","Australian Distribution Co.",11222333444,"NSW","Electricity","Distribution","Revenue cap","Financial","June",5,5,5,2,"123 Straight Street",null,"SYDNEY","NSW",2000,"PO Box 123",null,"SYDNEY","NSW",2000,"YES","YES","YES","YES","NO","CBD","Urban","Short rural","Long rural",null,"NO","YES","Australian Distribution Co."]
[null,"Australian Transmission Co.","Australian Transmission Co.",11222333444,"NSW","Electricity","Transmission","Revenue cap","Financial","June",5,5,5,5,"123 Straight Street",null,"SYDNEY","NSW",2000,"PO Box 123",null,"SYDNEY","NSW",2000,"NO","NO","NO","NO","NO","CBD","Urban","Short rural","Long rural",null,"NO","NO","Australian Transmission Co."]
[null,"Directlink","Directlink",16779340889,"Qld","Electricity","Transmission","Revenue cap","Financial","June",5,5,5,5,"Level 25","580 George Street","SYDNEY","NSW",2000,"PO Box R41",null,"ROYAL EXCHANGE","NSW",1225,"NO","NO","NO","NO","NO","CBD","Urban","Short rural","Long rural",null,"NO","NO","Directlink"]
[null,"ElectraNet","ElectraNet",41094482416,"SA","Electricity","Transmission","Revenue cap","Financial","June",5,5,5,5,"52-55 East Terrace","Rymill Park","ADELAIDE","SA",5000,"PO Box 7096","Hutt Street Post Office","ADELAIDE","SA",5000,"NO","NO","NO","NO","NO","CBD","Urban","Short rural","Long rural",null,"NO","NO","ElectraNet"]
[null,"Energex","Energex",40078849055,"Qld","Electricity","Distribution","Revenue cap","Financial","June",5,5,5,5,"26 Reddacliff Street",null,"NEWSTEAD","Qld",4006,"26 Reddacliff Street",null,"NEWSTEAD","QLD",4006,"YES","YES","YES","NO","NO","CBD","Urban","Short rural","Long rural",null,"NO","YES","Energex"]
[null,"Ergon Energy","Ergon Energy",50087646062,"Qld","Electricity","Distribution","Revenue cap","Financial","June",5,5,5,5,"22 Walker Street",null,"TOWNSVILLE","Qld",4810,"Po Box 264",null,"FORTITUDE VALLEY","QLD",4006,"NO","YES","YES","YES","NO","CBD","Urban","Short rural","Long rural",null,"NO","YES","Ergon Energy"]
{"$rows_left_out":87}
{"sheet":"AER ETL","index":10,"n_rows":152,"n_cols":10,"rows_kept":152,"cut":false,"hidden":true,"merged":[[13,0,17,0],[14,4,14,8],[16,2,16,4],[20,0,27,0],[28,0,33,0],[36,0,61,0],[36,37,36,58],[36,68,36,89],[34,37,34,58],[73,1,75,1],[34,68,34,89],[35,37,35,58],[35,68,35,89]]}
[null,"AER ETL INFORMATION"]
[]
[null,"THIS IS A NEW CA FILE - need to extract data in this file and put into individual versions of existing CA RINS - we do not ingest partial CA files"]
[]
[null,"USES NAMED RANGES FLAG","yes","dms_Defined_Names_Used"]
[]
[null,"IF THIS IS AN ABC RIN - make sure the the named range CRY is applied and the named range dms_dollar_nom_UOM is applied"]
[null,"IF THIS IS A RESET RIN - make sure the named ranges CRY and dms_dollar_nom_UOM are NOT present in the workbook"]
[null,"FOR ABC RINS THAT SPAN MULTIPLE YEARS - make sure MultiYear Flag is set and final year entered as required"]
[]
[null,"Full trading name",{"$f":"INDEX(dms_TradingNameFull_List,MATCH(dms_TradingName,dms_TradingName_List))","v":"SA Power Networks"},null,"dms_TradingNameFull"]
[null,"Trading name",{"$f":"dms_TradingName","v":"SA Power Networks"}]
["Selected here","Model / RIN","CA","dms_Model"]
["Read from Business & other details","Source","Reporting","dms_Source",{"$f":"IF(dms_Model=\"Reset\", \"Make sure you have set Reg Proposal as source\",\"\")","v":""}]
[null,"Data quality","Consolidated","For DB purposes this is always Consoldiated"]
{"$rows_left_out":137}