{"text_format":"1","workbook":"xlsx","n_sheets":7,"sheets":["NOTES","NOTES1","Model update","Prop2024-25DistTar","2024-25TarContForm","2024-25RebalContForm","ARS"],"not_rendered":{"charts":0,"images":11,"macros":0,"external_links":0,"defined_names":19,"comments":1,"pivot_tables":0},"unopened":[],"bounds":{"document_bytes":16777216,"sheet_cells":100000,"rows_first":2000,"rows_last":500,"rows_between":2000,"halvings":0,"cell_chars":16384,"cell_head_chars":4096},"cells_cut":0,"cells_raw":0,"read":"whole","date_system":"1900"}

{"sheet":"NOTES","index":0,"n_rows":22,"n_cols":5,"rows_kept":22,"cut":false,"hidden":true,"merged":[]}
[]
["The model has actual and test data to illustrate the workings of the model.",null,null,2020]
[]
["Issue","Location","Item","Comment"]
[]
[1,"'Model update'!C25","CPI",{"$f":"\"Updated June \"&D2-1&\" CPI for \"&D2","v":"Updated June 2019 CPI for 2020"},"NOTE: This worksheet is programmed to update for each year - use as checklist and note any placeholders or changes"]
[null,null,null,null,"NOTE: Worksheet names in this file are programmed to update each year once each worksheet is accessed and a cell is selected"]
[{"$f":"A6+1","v":2},"'Model update'!B34",{"$f":"\"Xt for \"&D2","v":"Xt for 2020"},{"$f":"\"Value will require updating for \"&D2&\" cost of debt \"","v":"Value will require updating for 2020 cost of debt "}]
[]
[{"$f":"A8+1","v":3},"'Model update'!B44",{"$f":"\"Pass Through Amount for \"&D2","v":"Pass Through Amount for 2020"},"NIL for 2020"]
[]
[{"$f":"A10+1","v":4},"'Model update'!H79:H83","Real Pre-tax WACC (rptw)",{"$f":"\"Updated \"&$D$2&\" value for Jemena, placeholders for others\"","v":"Updated 2020 value for Jemena, placeholders for others"}]
[]
[{"$f":"A12+1","v":5},{"$f":"\"Prop\"&D2&\"DistTar!E8:E96\"","v":"Prop2020DistTar!E8:E96"},{"$f":"D2-1&\" tariffs\"","v":"2019 tariffs"},{"$f":"\"Updated from \"&D2-1&\" model\"","v":"Updated from 2019 model"}]
[]
[{"$f":"A14+1","v":6},"ARS!B6:B12",{"$f":"D2-1&\" ARS tariffs\"","v":"2019 ARS tariffs"},{"$f":"\"Updated from \"&D2-1&\" model\"","v":"Updated from 2019 model"}]
[]
[{"$f":"A16+1","v":7},"The following is test data to illustrate the workings of the model.",null,"Input data required from DNSPs"]
[null,{"$f":"\"Prop\"&D2&\"DistTar!D8:D96\"","v":"Prop2020DistTar!D8:D96"},{"$f":"\"Proposed \"&D2&\" Tariffs\"","v":"Proposed 2020 Tariffs"}]
[null,{"$f":"\"Prop\"&D2&\"DistTar!F8:F96\"","v":"Prop2020DistTar!F8:F96"},{"$f":"\"Actual \"&D2-2&\" Volumes\"","v":"Actual 2018 Volumes"}]
[]
[null,"ARS!C6:C12",{"$f":"\"Proposed \"&D2&\" Ancillary Reference Services Charges\"","v":"Proposed 2020 Ancillary Reference Services Charges"}]

{"sheet":"NOTES1","index":1,"n_rows":57,"n_cols":7,"rows_kept":57,"cut":false,"hidden":true,"merged":[]}
[]
[null,"The model has actual and test data to illustrate the workings of the model.",null,null,"2024-25","2023-24","2022"]
[]
[null,"Issue","Location","Item","Comment"]
[]
["AER:",1,"'Model update'!B17:B22","CPI",{"$f":"\"Updated December \"&LEFT(E2,4)-1&\" CPI for \"&E2","v":"Updated December 2023 CPI for 2024-25"},"NOTE: This worksheet is programmed to update for each year - use as checklist and note any placeholders or changes"]
[null,null,null,null,null,"NOTE: Worksheet names in this file are programmed to update each year once each worksheet is accessed and a cell is selected"]
[null,{"$f":"B6+1","v":2},"'Model update'!B35:B38",{"$f":"\"Xt for \"&E2","v":"Xt for 2024-25"},{"$f":"\"Updated \"&$E$2&\" value\"","v":"Updated 2024-25 value"}]
[]
[null,{"$f":"B8+1","v":3},"'Model update'!B44:B48","Real Pre-tax WACC (rptw)",{"$f":"\"Updated \"&$E$2&\" value\"","v":"Updated 2024-25 value"}]
[]
[null,{"$f":"B10+1","v":4},"'Model update'!G18:G21",{"$f":"\"Pass Through Amount for \"&E2","v":"Pass Through Amount for 2024-25"},{"$f":"\"Updated \"&E2&\" AP(t) value\"","v":"Updated 2024-25 AP(t) value"}]
[]
[null,{"$f":"B12+1","v":5},{"$f":"\"Prop\"&E2&\"DistTar!E8:E96\"","v":"Prop2024-25DistTar!E8:E96"},{"$f":"F2&\" tariffs\"","v":"2023-24 tariffs"},{"$f":"\"Updated from \"&F2&\" model\"","v":"Updated from 2023-24 model"}]
[]
[null,{"$f":"B14+1","v":6},"ARS!B6:B12",{"$f":"F2&\" ARS tariffs\"","v":"2023-24 ARS tariffs"},{"$f":"\"Updated from \"&F2&\" model\"","v":"Updated from 2023-24 model"}]
[]
[]
["Multinet:",1,"'Model update'!F30:F34",{"$f":"\"Estimated safeguard mechanism amount for \"&F2","v":"Estimated safeguard mechanism amount for 2023-24"},{"$f":"\"Updated \"&F2&\" estimated cf(t) value, used for the cf(t-1) value for \"&E2","v":"Updated 2023-24 estimated cf(t) value, used for the cf(t-1) value for 2024-25"}]
[]
[null,{"$f":"B19+1","v":2},"'Model update'!G30:G34",{"$f":"\"Actual safeguard mechanism amount for \"&G2","v":"Actual safeguard mechanism amount for 2022"},{"$f":"\"Updated \"&G2&\" actual cf(t) value, used for the cf(t-2) value for \"&E2","v":"Updated 2022 actual cf(t) value, used for the cf(t-2) value for 2024-25"}]
[]
[null,{"$f":"B21+1","v":3},"'Model update'!F43:F47",{"$f":"\"Estimated abolishments amount for \"&F2","v":"Estimated abolishments amount for 2023-24"},{"$f":"\"Updated \"&F2&\" estimated af(t) value, used for the af(t-1) value for \"&E2","v":"Updated 2023-24 estimated af(t) value, used for the af(t-1) value for 2024-25"}]
[]
[null,{"$f":"B23+1","v":4},"'Model update'!G43:G47",{"$f":"\"Actual abolishments amount for \"&G2","v":"Actual abolishments amount for 2022"},{"$f":"\"Updated \"&G2&\" actual af(t) value, used for the af(t-2) value for \"&E2","v":"Updated 2022 actual af(t) value, used for the af(t-2) value for 2024-25"}]
[]
[null,{"$f":"B25+1","v":5},{"$f":"\"Prop\"&E2&\"DistTar!D8:D96\"","v":"Prop2024-25DistTar!D8:D96"},{"$f":"\"Proposed \"&E2&\" Tariffs\"","v":"Proposed 2024-25 Tariffs"}]
[]
[null,{"$f":"B27+1","v":6},{"$f":"\"Prop\"&E2&\"DistTar!F8:F96\"","v":"Prop2024-25DistTar!F8:F96"},{"$f":"\"Actual \"&G2&\" Volumes\"","v":"Actual 2022 Volumes"}]
[]
[null,{"$f":"B29+1","v":7},"ARS!C6:C12",{"$f":"\"Proposed \"&E2&\" Ancillary Reference Services Charges\"","v":"Proposed 2024-25 Ancillary Reference Services Charges"},"Calculated using formula"]
[]
[]
[]
[]
[]
[]
[]
["Reset",1,"Whole workbook","Colour formatting","Adjusted colour formatting away from yellow to ensure yellow can be used to clearly identify confidential material"]
[]
{"$rows_left_out":18}
{"sheet":"Model update","index":2,"n_rows":56,"n_cols":8,"rows_kept":56,"cut":false,"hidden":false,"merged":[[41,0,42,1]]}
[]
[]
["Tariff Approval Template for ","Multinet"]
[]
["Financial year","2024-25"]
[]
["t",{"$f":"B5","v":"2024-25"}]
["t-1",{"$f":"LEFT(B7,4)-1&\"-\"&RIGHT(B7,2)-1","v":"2023-24"}]
["t-2",{"$f":"LEFT(B8,4)-1&\"-\"&RIGHT(B8,2)-1","v":"2022-23"}]
["t-3","2021-22"]
[]
[]
["Update orange highlighted cells where appropriate",null,null,"Darker orange cells should be overwritten with t-1 values before changing to new year"]
[]
["CPI"]
[null,null,null,"Pass Through Amounts :  PT (t)",null,null,"AP(t)","PT'(t)"]
["CPI Index December 2021",121.3,null,{"$f":"A44","v":"2023-24"},null,null,0]
["CPI Index December 2022",130.80000000000001,null,{"$f":"A45","v":"2024-25"},null,null,0,{"$f":"G18/'2024-25TarContForm'!$G$11","v":0}]
["CPI Index December 2023",136.1,null,"2025-26",null,null,null,{"$f":"G19/'2024-25TarContForm'!$G$11","v":0}]
["CPI Index December 2024",140.08000000000001,null,"2026-27",null,null,null,{"$f":"G20/'2024-25TarContForm'!$G$11","v":0}]
["CPI Index December 2025",144.16936223498834,null,"2027-28",null,null,null,{"$f":"G21/'2024-25TarContForm'!$G$11","v":0}]
["CPI Index December 2026",148.37810542006912]
[null,null,null,{"$f":"\"Pass Through Amount for \"&B$5","v":"Pass Through Amount for 2024-25"},null,null,null,{"$f":"(1+VLOOKUP($B$5,D17:H21,5,FALSE))/(1+VLOOKUP($B$8,D17:H21,5,FALSE))-1","v":0}]
[{"$f":"\"CPI \"&A44","v":"CPI 2023-24"},{"$f":"B18/B17-1","v":7.8318219291014124E-2},null,"The Pass Through Amount is to include an amount that reflects the time value of money between incurring the costs and recovering the costs"]
[{"$f":"\"CPI \"&A45","v":"CPI 2024-25"},{"$f":"B19/B18-1","v":4.0519877675840865E-2},null,"and excludes any amounts already passed through in reference tariffs."]
["CPI 2025-26",2.924320352681864E-2]
["CPI 2026-27",2.9193048507912156E-2]
["CPI 2027-28",2.9193048507912156E-2,null,"Safeguard Mechanism Amounts :  C (t)",null,"Est. cf(t)","Act. cf(t)","C'(t)"]
[null,null,null,"2022-23",null,0,0]
[{"$f":"\"CPI \" &$B$8","v":"CPI 2023-24"},{"$f":"VLOOKUP(A30,A24:B28,2,FALSE)","v":7.8318219291014124E-2},null,{"$f":"A44","v":"2023-24"}]
[{"$f":"\"CPI \" &$B$5","v":"CPI 2024-25"},{"$f":"VLOOKUP(A31,A24:B28,2,FALSE)","v":4.0519877675840865E-2},null,{"$f":"A45","v":"2024-25"},null,null,null,{"$f":"(('Model update'!F30*(1+'Model update'!B45)*(1+'Model update'!B25))+(('Model update'!G29-'Model update'!F29)*(1+'Model update'!B44)*(1+'Model update'!B45)*(1+'Model update'!B24)*(1+'Model update'!B25)))/'2024-25TarContForm'!$G$12","v":0}]
[null,null,null,"2025-26",null,null,null,{"$f":"(('Model update'!F31*(1+'Model update'!B46)*(1+'Model update'!B26))+(('Model update'!G30-'Model update'!F30)*(1+'Model update'!B45)*(1+'Model update'!B46)*(1+'Model update'!B25)*(1+'Model update'!B26)))/'2024-25TarContForm'!$G$12","v":0}]
[null,null,null,"2026-27",null,null,null,{"$f":"(('Model update'!F32*(1+'Model update'!B47)*(1+'Model update'!B27))+(('Model update'!G31-'Model update'!F31)*(1+'Model update'!B46)*(1+'Model update'!B47)*(1+'Model update'!B26)*(1+'Model update'!B27)))/'2024-25TarContForm'!$G$12","v":0}]
[{"$f":"\"Xt for \"&B$5","v":"Xt for 2024-25"},null,null,"2027-28",null,null,null,{"$f":"(('Model update'!F33*(1+'Model update'!B48)*(1+'Model update'!B28))+(('Model update'!G32-'Model update'!F32)*(1+'Model update'!B47)*(1+'Model update'!B48)*(1+'Model update'!B27)*(1+'Model update'!B28)))/'2024-25TarContForm'!$G$12","v":0}]
["2024-25",{"$f":"C26-1.68847637347782%","v":-1.6884763734778201E-2}]
["2025-26",null,null,{"$f":"\"Safeguard Mechanism Amount for \"&B$5","v":"Safeguard Mechanism Amount for 2024-25"},null,null,null,{"$f":"(1+VLOOKUP($B$5,D30:H34,5,FALSE))/(1+VLOOKUP($B$8,D30:H34,5,FALSE))-1","v":0}]
["2026-27"]
["2027-28"]
[]
[{"$f":"\"Xt for \"&B$5","v":"Xt for 2024-25"},{"$f":"VLOOKUP(B5,A35:B38,2,FALSE)","v":-1.6884763734778201E-2}]
{"$rows_left_out":17}
{"sheet":"Prop2024-25DistTar","index":3,"n_rows":67,"n_cols":8,"rows_kept":67,"cut":false,"hidden":false,"merged":[]}
[null,"Tariff Approval - Multinet","Prop2024-25DistTar"]
[]
[null,"PROPOSED 2024-25 DISTRIBUTION TARIFFS"]
[]
[null,"Proposed tariff name","Existing name","Prop\n2024-25 Tariff","Exist\n2023-24 Tariff","Actual 2022-23 Volumes","Prop Tar\nRevenue","Exist Tar\nRevenue"]
[null,"Tariff V Residential - Multinet Metro","Tariff V Residential - Multinet Metro"]
[null,"1 July - 30 June","1 July - 30 June"]
[null,"Fixed Charge","Fixed Charge",0.1973,0.1973,692544,{"$f":"D8*$F8*365","v":49873209.887999997},{"$f":"E8*$F8*365","v":49873209.887999997}]
[null,"0 - 0.05GJ","0 - 0.05GJ",10.484999999999999,9.5922999999999998,9976671.1877689995,{"$f":"D9*$F9","v":104605397.40375796},95699223.034436569]
[null,"0.05 - 0.1GJ","0.05 - 0.1GJ",6.9756,6.4104000000000001,6219346.4981583003,43383673.432553038,39868498.791793972]
[null,"0.1 -0.15GJ","0.1 -0.15GJ",3.1078999999999999,3.1078999999999999,4439680.7561943997,13798083.822176574,13798083.822176574]
[null,"0.15 - 0.25GJ","0.15 - 0.25GJ",1.5904,1.5904,6114964.1247798,9725238.9440497942,9725238.9440497942]
[null," >0.25GJ"," >0.25GJ",1.1939,1.1933,9844173.5258403011,11752958.772500735,11747052.268385231]
[null,"Tariff V Residential - Multinet Yarra Valley Towns","Tariff V Residential - Multinet Yarra Valley Towns"]
[null,"1 July - 30 June","1 July - 30 June"]
[null,"Fixed Charge","Fixed Charge",0.1973,0.1973,16143,{"$f":"D16*$F16*365","v":1162530.0734999999},{"$f":"E16*$F16*365","v":1162530.0734999999}]
[null,"0 - 0.05GJ","0 - 0.05GJ",12.787000000000001,11.750999999999999,801632.11705109989,{"$f":"D17*$F17","v":10250469.880732415},{"$f":"E17*$F17","v":9419979.0074674748}]
[null,"0.05 - 0.1GJ","0.05 - 0.1GJ",9.6423000000000005,8.8613,1254730.0973658999,{"$f":"D18*$F18","v":12098484.017831217},11118539.811788449]
[null,"0.1 -0.15GJ","0.1 -0.15GJ",5.9367000000000001,5.9367000000000001,486011.51595689997,{"$f":"D19*$F19","v":2885304.5667813281},2885304.5667813281]
[null,"0.15 - 0.25GJ","0.15 - 0.25GJ",4.7291999999999996,4.7291999999999996,1622066.9622961001,{"$f":"D20*$F20","v":7671079.0780907162},7671079.0780907162]
[null," >0.25GJ"," >0.25GJ",4.4248000000000003,4.4244000000000003,1724381.9966786001,{"$f":"D21*$F21","v":7630045.4589034701},7629355.7061047992]
[null,"Tariff V Residential - Multinet Gippsland Towns","Tariff V Residential - Multinet Gippsland Towns"]
[null,"1 July - 30 June","1 July - 30 June"]
[null,"Fixed Charge","Fixed Charge",0.1973,0.1973,5798,{"$f":"D24*$F24*365","v":417540.071},{"$f":"E24*$F24*365","v":417540.071}]
[null,"0 - 0.05GJ","0 - 0.05GJ",13.9635,12.832100000000001,81874.416456999999,{"$f":"D25*$F25","v":1143253.4141973194},{"$f":"E25*$F25","v":1050620.6994178698}]
[null,"0.05 - 0.1GJ","0.05 - 0.1GJ",10.6134,9.7537000000000003,52783.097844199998,{"$f":"D26*$F26","v":560208.13065963227},514830.50144297356]
[null,"0.1 -0.15GJ","0.1 -0.15GJ",6.5997000000000003,6.5997000000000003,38085.5800858,{"$f":"D27*$F27","v":251353.40289225426},251353.40289225426]
[null,"0.15 - 0.25GJ","0.15 - 0.25GJ",5.3037000000000001,5.3037000000000001,50283.5100255,{"$f":"D28*$F28","v":266688.65212224436},266688.65212224436]
[null," >0.25GJ"," >0.25GJ",4.9678000000000004,4.9678000000000004,64638.117907399996,{"$f":"D29*$F29","v":321109.24214038171},321109.24214038171]
[null,"Tariff V Non-Residential - Multinet Metro","Tariff V Non-Residential - Multinet Metro"]
[null,"1 July - 30 June","1 July - 30 June"]
[null,"Fixed Charge","Fixed Charge",0.32540000000000002,0.32540000000000002,81,{"$f":"D32*$F32*365","v":9620.4510000000009},{"$f":"E32*$F32*365","v":9620.4510000000009}]
[null,"0 - 0.25GJ","0 - 0.25GJ",4.6844999999999999,4.3049999999999997,4845.8111883000001,{"$f":"D33*$F33","v":22700.202511591349},{"$f":"E33*$F33","v":20861.2171656315}]
[null,"0.25 - 1GJ","0.25 - 1GJ",2.7570999999999999,2.5337999999999998,6779.8160472,{"$f":"D34*$F34","v":18692.630823735119},17178.69790039536]
[null,"1 - 1.5GJ","1 - 1.5GJ",1.4158999999999999,1.4158999999999999,2157.5744474000003,{"$f":"D35*$F35","v":3054.9096600736602},3054.9096600736602]
[null,"1.5 - 5GJ","1.5 - 5GJ",0.82240000000000002,0.82240000000000002,8436.3274187000006,{"$f":"D36*$F36","v":6938.0356691388806},6938.0356691388806]
[null,">5GJ",">5GJ",0.25829999999999997,0.25829999999999997,9924.5671207999985,{"$f":"D37*$F37","v":2563.5156873026394},2563.5156873026394]
[null,"Tariff V Non-Residential - Multinet Yarra Valley Towns","Tariff V Non-Residential - Multinet Yarra Valley Towns"]
[null,"1 July - 30 June","1 July - 30 June"]
[null,"Fixed Charge","Fixed Charge",0.32390000000000002,0.32390000000000002,7066,{"$f":"D40*$F40*365","v":835367.25100000005},{"$f":"E40*$F40*365","v":835367.25100000005}]
{"$rows_left_out":28}
{"sheet":"2024-25TarContForm","index":4,"n_rows":26,"n_cols":7,"rows_kept":26,"cut":false,"hidden":false,"merged":[[25,1,25,3]]}
[null,"Tariff Approval - Multinet",null,null,null,"2024-25TarContForm"]
[]
[null,"2024-25  TARIFF CONTROL FORMULA"]
[]
[]
[null,"Adjustments",null,null,null,"Denominators for adjustment factors"]
[]
[]
[null,"CPI",{"$f":"'Model update'!B31","v":4.0519877675840865E-2}]
[null,"X-factor",{"$f":"'Model update'!B40","v":-1.6884763734778201E-2}]
[null,"Pass-through Amount",{"$f":"'Model update'!H23","v":0},null,null,null,{"$f":"(1+C9)*(1-C10)*C23","v":283869301.72854638}]
[null,"Safeguard Mechanism Amount",{"$f":"'Model update'!H36","v":0},null,null,null,{"$f":"(1+C9)*(1-C10)*(1+C11)*C23","v":283869301.72854638}]
[null,"Abolishment True-up Amount",{"$f":"'Model update'!H49","v":-3.6028909646301788E-3},null,null,null,{"$f":"(1+C9)*(1-C10)*(1+C11)*(1+C12)*C23","v":283869301.72854638}]
[]
[]
[]
[]
[null,"2024-25  Distribution price control"]
[]
[null,"Average price movement allowed",{"$f":"(1+C9)*(1-C10)*(1+C11)*(1+C12)*(1+C13)","v":1.0542766313585143}]
[]
[null,"Proposed distribution tariff revenue",{"$f":"IF('Prop2024-25DistTar'!G67=0,\"\",'Prop2024-25DistTar'!G67)","v":282846550.68330449}]
[null,"Existing distribution tariff revenue",{"$f":"IF('Prop2024-25DistTar'!H67=0,\"\",'Prop2024-25DistTar'!H67)","v":268284948.34580919}]
[null,"Average price movement",{"$f":"IF(C22=\"\",\"\",C22/C23)","v":1.054276627993032}]
[]
[null,{"$f":"IF(C22=\"\",\"\",IF(C20>=C24,\"DISTRIBUTION PRICE CONTROL FORMULA COMPLIANT\",\"DISTRIBUTION PRICE CONTROL FORMULA BREACHED\"))","v":"DISTRIBUTION PRICE CONTROL FORMULA COMPLIANT"}]

{"sheet":"2024-25RebalContForm","index":5,"n_rows":287,"n_cols":8,"rows_kept":287,"cut":false,"hidden":false,"merged":[[257,1,257,2],[286,1,286,2],[59,1,59,2],[89,1,89,2],[119,1,119,2],[149,1,149,2],[179,1,179,2],[209,1,209,2],[233,1,233,2]]}
[null,"Tariff Approval - Multinet",{"$f":"'Model update'!B5&\"RebalContForm\"","v":"2024-25RebalContForm"}]
[]
[null,"2024-25  REBALANCING CONTROL FORMULA"]
[]
[]
[null,"Rebalancing control"]
[]
[null,"CPI",{"$f":"'2024-25TarContForm'!C9","v":4.0519877675840865E-2}]
[null,"X-factor",{"$f":"'2024-25TarContForm'!C10","v":-1.6884763734778201E-2}]
[null,"Pass-through Amount",{"$f":"'2024-25TarContForm'!C11","v":0}]
[null,"Safeguard Mechanism Amount",{"$f":"'2024-25TarContForm'!C12","v":0}]
[null,"Abolishment True-up Amount",{"$f":"'2024-25TarContForm'!C13","v":-3.6028909646301788E-3}]
[null,"Y factor",0.02]
[]
[null,"Rebalancing control",{"$f":"(1+C8)*(1-C9)*(1+C10)*(1+C11)*(1+C13)","v":1.0792505861711725},null,null,"The abolishment true-up amount is not accounted for under the mechanism in the AA."]
[]
[]
[]
[null,"Rebalancing control summary"]
[null,null,"Existing","Proposed","Movement","Assessment"]
[null,{"$f":"B34","v":"Tariff V Residential - Multinet Metro"},{"$f":"C55","v":220711306.74884215},{"$f":"C56","v":233138562.2630381},{"$f":"IF(C21=0,0,D21/C21)","v":1.0563054774911804},{"$f":"IF(E21=0,\"\",IF($C$15<=E21,\"Breached\",\"Compliant\"))","v":"Compliant"}]
[null,{"$f":"B64","v":"Tariff V Residential - Multinet Yarra Valley Towns"},{"$f":"C85","v":39886788.243732765},{"$f":"C86","v":41697913.07583914},1.0454066349248099,{"$f":"IF(E22=0,\"\",IF($C$15<=E22,\"Breached\",\"Compliant\"))","v":"Compliant"}]
[null,{"$f":"B94","v":"Tariff V Residential - Multinet Gippsland Towns"},{"$f":"C115","v":2822142.5690157232},{"$f":"C116","v":2960152.9130118317},1.0489026831993971,"Compliant"]
[null,{"$f":"B124","v":"Tariff V Non-Residential - Multinet Metro"},{"$f":"C145","v":60216.827082542048},{"$f":"C146","v":63569.745351841651},1.0556807529015702,"Compliant"]
[null,{"$f":"B154","v":"Tariff V Non-Residential - Multinet Yarra Valley Towns"},{"$f":"C175","v":1998530.3625002028},{"$f":"C176","v":2071304.1422679464},1.0364136473146708,"Compliant"]
[null,{"$f":"B184","v":"Tariff V Non-Residential - Multinet Gippsland Towns"},{"$f":"C205","v":459209.52019819722},{"$f":"C206","v":473206.21740767302},1.0304799804747835,"Compliant"]
[null,{"$f":"B214","v":"Tariff D - Multinet"},{"$f":"C229","v":2227723.9681710009},{"$f":"C230","v":2317991.3249110011},1.0405199917178749,"Compliant"]
[null,{"$f":"B238","v":"Tariff D - Multinet South Gippsland"},{"$f":"C253","v":79427.258468999993},{"$f":"C254","v":82645.641822000005},1.0405198846722896,"Compliant"]
[null,"Tariff L - Multinet",{"$f":"C282","v":39602.847797583338},{"$f":"C283","v":41205.359654916669},1.0404645611730761,"Compliant"]
[null,null,{"$f":"SUM(C21:C29)","v":268284948.34580913},{"$f":"SUM(D21:D29)","v":282846550.68330443},1.054276627993032]
[]
[]
[]
[null,"Tariff V Residential - Multinet Metro",1,2,3,4,5,6]
[null,null,1,2,3,4,5,6]
[null,"Distribution tariff","Fixed","Blk1","Blk2","Blk3","Blk4","Blk5"]
[]
[null,"Existing (1 Jan-31 Dec): Tariff V Residential - Multinet Metro",{"$f":"INDEX('Prop2024-25DistTar'!$E$8:$E$13,C$35)","v":0.1973},{"$f":"INDEX('Prop2024-25DistTar'!$E$8:$E$13,D$35)","v":9.5922999999999998},{"$f":"INDEX('Prop2024-25DistTar'!$E$8:$E$13,E$35)","v":6.4104000000000001},{"$f":"INDEX('Prop2024-25DistTar'!$E$8:$E$13,F$35)","v":3.1078999999999999},{"$f":"INDEX('Prop2024-25DistTar'!$E$8:$E$13,G$35)","v":1.5904},{"$f":"INDEX('Prop2024-25DistTar'!$E$8:$E$13,H$35)","v":1.1933}]
[]
[null,{"$f":"\"Proposed (1 Jan-31 Dec): \"&B34","v":"Proposed (1 Jan-31 Dec): Tariff V Residential - Multinet Metro"},{"$f":"INDEX('Prop2024-25DistTar'!$D$8:$D$13,C$34)","v":0.1973},{"$f":"INDEX('Prop2024-25DistTar'!$D$8:$D$13,D$34)","v":10.484999999999999},{"$f":"INDEX('Prop2024-25DistTar'!$D$8:$D$13,E$34)","v":6.9756},{"$f":"INDEX('Prop2024-25DistTar'!$D$8:$D$13,F$34)","v":3.1078999999999999},{"$f":"INDEX('Prop2024-25DistTar'!$D$8:$D$13,G$34)","v":1.5904},{"$f":"INDEX('Prop2024-25DistTar'!$D$8:$D$13,H$34)","v":1.1939}]
{"$rows_left_out":248}
{"sheet":"ARS","index":6,"n_rows":12,"n_cols":3,"rows_kept":12,"cut":false,"hidden":false,"merged":[]}
["Tariff Approval - Multinet"]
[]
["Ancillary Reference Services (Exc GST)"]
[]
[null,"2023-24","2024-25"]
["Turn On / Reconnections",49.17,{"$f":"ROUND(B6*(1+'Model update'!$B$31),0)","v":51}]
["Meter Investigations",166.51,{"$f":"ROUND(B7*(1+'Model update'!$B$31),0)","v":173}]
["Disconnections",58.33,{"$f":"ROUND(B8*(1+'Model update'!$B$31),0)","v":61}]
["Special meter reading",7.47,{"$f":"ROUND(B9*(1+'Model update'!$B$31),1)","v":7.8}]
["Meter removals",69.680000000000007,{"$f":"ROUND(B10*(1+'Model update'!$B$31),0)","v":73}]
["Meter reinstallation",69.680000000000007,{"$f":"ROUND(B11*(1+'Model update'!$B$31),0)","v":73}]
["Service abolishment - Residential",220,{"$f":"ROUND(B12*(1+'Model update'!$B$31),0)","v":229}]