{"text_format":"1","workbook":"xlsx","n_sheets":7,"sheets":["Index","Input|Rate of return","Calc|Placeholder RfR","Calc|Rate of return","Output|Rate of return","Lookup|Tables","Check|List"],"not_rendered":{"charts":0,"images":1,"macros":0,"external_links":1,"defined_names":56,"comments":0,"pivot_tables":0},"unopened":[],"bounds":{"document_bytes":16777216,"sheet_cells":100000,"rows_first":2000,"rows_last":500,"rows_between":2000,"halvings":0,"cell_chars":16384,"cell_head_chars":4096},"cells_cut":0,"cells_raw":0,"read":"whole","date_system":"1900"}

{"sheet":"Index","index":0,"n_rows":20,"n_cols":12,"rows_kept":20,"cut":false,"hidden":false,"merged":[[0,2,0,4],[1,2,1,4]]}
[null,null,"GAAR 2020-25 JGN - Rate of Return Model",null,null,null,null,null,null,null,"Overall Check:",{"$f":"'Check|List'!$V$1","v":"OK"}]
[null,null,"Index"]
[]
[]
[null,"Copyright Jemena Limited. All rights reserved. Jemena is not liable for any loss caused by reliance on this document."]
[]
[null,"Model Index"]
[]
[null,null,"Sheet Name","Sheet Description"]
[null,null,"Index","Model index with hyperlinks"]
[null,null,"Input|Rate of return","Data for forecast inflation and bond yield"]
[null,null,"Calc|Placeholder RfR","Demonstrates the methodology for calculating the risk-free rate, using placeholder inputs"]
[null,null,"Calc|Rate of return","Estimates the rate of return and forecast inflation expectation"]
[null,null,"Output|Rate of return","Summary of the rate of return and forecast inflation expectation"]
[null,null,"Lookup|Tables","Source for named ranges used for units, basis, etc"]
[null,null,"Check|List","Check for errors"]
[]
[]
[]
[null,"End"]
{"$rows_left_out":1}
{"sheet":"Input|Rate of return","index":1,"n_rows":85,"n_cols":23,"rows_kept":85,"cut":false,"hidden":false,"merged":[[2,13,2,17],[0,2,0,4],[1,2,1,4],[2,8,2,12],[2,18,2,22]]}
[null,null,{"$f":"Index!$C$1","v":"GAAR 2020-25 JGN - Rate of Return Model"},null,null,"Back to Index",null,"Key:","Input (hard code)","External Link","Internal Link","Drop down Selection","Calculation","Unique calculation","Empty cell",null,null,"Section Check:",{"$f":"IF(COUNTA($A$8:$A$85)=COUNTIF($A$8:$A$85,\"OK\"),\"OK\",\"Check\")","v":"OK"},null,"Overall Check:",{"$f":"'Check|List'!$V$1","v":"OK"}]
[null,null,{"$f":"RIGHT(CELL(\"filename\",C1),LEN(CELL(\"filename\",C1))-FIND(\"]\",CELL(\"filename\",C1)))","v":"Input|Rate of return"}]
[null,null,null,null,null,null,null,null,"Prior",null,null,null,null,"Current Regulatory Period",null,null,null,null,"Next Regulatory Period"]
[null,null,null,"Source","Unit","Basis",null,{"$f":"+I4-1","v":2015},{"$f":"+J4-1","v":2016},{"$f":"+K4-1","v":2017},{"$f":"+L4-1","v":2018},{"$f":"+M4-1","v":2019},2020,{"$f":"+M4+1","v":2021},{"$f":"+N4+1","v":2022},2023,2024,2025,2026,2027,2028,2029,2030]
[]
[null,"Copyright Jemena Limited. All rights reserved. Jemena is not liable for any loss caused by reliance on this document."]
[]
[null,"Input | Inflation"]
[]
[null,null,"Opex Inflation (year to Jun, no lag)","Source","Unit","Basis",null,{"$f":"\"RY\"&RIGHT(H$4,2)","v":"RY15"},"RY16","RY17","RY18","RY19","RY20","RY21","RY22","RY23","RY24","RY25"]
[]
[null,null,"Actual inflation","ABS","Per cent","n/a",null,null,1.0232558139534831E-2,1.9337016574585641E-2,2.0776874435411097E-2,1.5929203539823078E-2,-3.4843205574912606E-3,3.8461538461538325E-2,6.1447811447811418E-2,6.0269627279936566E-2]
[null,null,"Forecast inflation","Placeholder","Per cent","n/a",null,null,null,null,null,null,null,null,null,null,3.3000000000000002E-2,3.1E-2]
[]
[{"$f":"IF(SUM(M15:AB15)=0,\"Ok\",\"Check\")","v":"Ok"},null,"Check: Only one active input per period",null,null,null,null,null,{"$f":"+IF(OR(COUNTBLANK(I12:I13)=2,COUNTBLANK(I12:I13)=1),0,1)","v":0},0,0,0,0,0,0,0,0,0]
[]
[null,null,"Capex Inflation (year to Dec, no lag)","Source","Unit","Basis",null,{"$f":"\"RY\"&RIGHT(H$4,2)","v":"RY15"},"RY16","RY17","RY18","RY19","RY20","RY21","RY22","RY23","RY24","RY25"]
[]
[null,null,"Actual inflation","ABS","Per cent","n/a",null,1.7175572519083859E-2,1.6885553470919357E-2,1.4760147601476037E-2,1.9090909090909047E-2,1.7841213202497874E-2,1.8404907975460238E-2,8.6058519793459354E-3,3.4982935153583528E-2,7.8318219291014124E-2,4.0519877675840865E-2]
[null,null,"Forecast inflation (Jun end from RY26)","Placeholder","Per cent","n/a",null,null,null,null,null,null,null,null,null,null,null,3.2000000000000001E-2]
{"$rows_left_out":66}
{"sheet":"Calc|Placeholder RfR","index":2,"n_rows":38,"n_cols":27,"rows_kept":38,"cut":false,"hidden":false,"merged":[[2,17,2,21],[2,22,2,26],[9,7,9,9],[9,10,9,12],[0,2,0,4],[1,2,1,4],[2,11,2,16]]}
[null,null,{"$f":"Index!$C$1","v":"GAAR 2020-25 JGN - Rate of Return Model"},null,null,"Back to Index",null,null,null,null,null,"Key:","Input (hard code)","External Link","Internal Link","Drop down Selection","Calculation","Unique calculation","Empty cell",null,null,"Section Check:",{"$f":"IF(COUNTA($A$8:$A$38)=COUNTIF($A$8:$A$38,\"OK\"),\"OK\",\"Check\")","v":"OK"},null,"Overall Check:",{"$f":"'Check|List'!$V$1","v":"OK"}]
[null,null,{"$f":"RIGHT(CELL(\"filename\",C1),LEN(CELL(\"filename\",C1))-FIND(\"]\",CELL(\"filename\",C1)))","v":"Calc|Placeholder RfR"}]
[null,null,null,null,null,null,null,null,null,null,null,"Prior",null,null,null,null,null,"Current Regulatory Period",null,null,null,null,"Next Regulatory Period"]
[null,null,null,"Source","Unit","Basis",null,null,null,null,null,{"$f":"+M4-1","v":2015},{"$f":"+N4-1","v":2016},{"$f":"+O4-1","v":2017},{"$f":"+P4-1","v":2018},{"$f":"+Q4-1","v":2019},{"$f":"+'Input|Rate of return'!$M$4","v":2020},{"$f":"Q4+1","v":2021},{"$f":"R4+1","v":2022},2023,2024,2025,2026,2027,2028,2029,2030]
[]
[null,"Copyright Jemena Limited. All rights reserved. Jemena is not liable for any loss caused by reliance on this document."]
[]
[null,"Calc | Risk-free rate (this section presents the mechanics of how the risk-free rate will be determined)"]
[null,null,"The values presented below are placeholders that will be updated based on our actual averaging period"]
[null,null,null,null,null,null,null,"PlaceholderBond1 (RBA F16)",null,null,"PlaceholderBond2 (RBA F16)",null,null,null,null,"Interpolation"]
[null,null,"Yields on government bonds",{"$f":"+D$4","v":"Source"},{"$f":"+E$4","v":"Unit"},{"$f":"+F$4","v":"Basis"},null,"Date","Yield","Weight","Date","Yield","Weight",null,"Date","Yield","Annualised"]
[]
[null,null,"2024-02-08","Placeholder",{"$f":"+Percent","v":"Per cent"},{"$f":"+Nominal","v":"Nominal"},null,"2033-11-21",3.1551131377652919E-2,{"$f":"+_xlfn.LET(\n_xlpm.futureday,O13,\n_xlpm.maturitydate_1,H13,\n_xlpm.maturitydate_2,K13,\nIF(_xlpm.futureday>=_xlpm.maturitydate_2,0,1-(_xlpm.futureday-_xlpm.maturitydate_1)/(_xlpm.maturitydate_2-_xlpm.maturitydate_1)))","v":0.56353591160220995},"2034-05-21",3.1551131377652919E-2,{"$f":"1-J13","v":0.43646408839779005},null,{"$f":"+DATE(YEAR(C13)+10,MONTH(C13),DAY(C13))","v":"2034-02-08"},{"$f":"+I13*J13+L13*M13","v":3.1551131377652919E-2},{"$f":"+(1+P13/2)^2-1","v":3.1799999850455674E-2}]
[null,null,"2024-02-09","Placeholder","Per cent","Nominal",null,"2033-11-21",3.1551131377652919E-2,0.55801104972375692,"2034-05-21",3.1551131377652919E-2,0.44198895027624308,null,"2034-02-09",3.1551131377652919E-2,3.1799999850455674E-2]
[null,null,"2024-02-12","Placeholder","Per cent","Nominal",null,"2033-11-21",3.1551131377652919E-2,0.54143646408839774,"2034-05-21",3.1551131377652919E-2,0.45856353591160226,null,"2034-02-12",3.1551131377652919E-2,3.1799999850455674E-2]
[null,null,"2024-02-13","Placeholder","Per cent","Nominal",null,"2033-11-21",3.1551131377652919E-2,0.53591160220994483,"2034-05-21",3.1551131377652919E-2,0.46408839779005517,null,"2034-02-13",3.1551131377652919E-2,3.1799999850455674E-2]
[null,null,"2024-02-14","Placeholder","Per cent","Nominal",null,"2033-11-21",3.1551131377652919E-2,0.53038674033149169,"2034-05-21",3.1551131377652919E-2,0.46961325966850831,null,"2034-02-14",3.1551131377652919E-2,3.1799999850455674E-2]
[null,null,"2024-02-15","Placeholder","Per cent","Nominal",null,"2033-11-21",3.1551131377652919E-2,0.52486187845303867,"2034-05-21",3.1551131377652919E-2,0.47513812154696133,null,"2034-02-15",3.1551131377652919E-2,3.1799999850455674E-2]
[null,null,"2024-02-16","Placeholder","Per cent","Nominal",null,"2033-11-21",3.1551131377652919E-2,0.51933701657458564,"2034-05-21",3.1551131377652919E-2,0.48066298342541436,null,"2034-02-16",3.1551131377652919E-2,3.1799999850455674E-2]
[null,null,"2024-02-19","Placeholder","Per cent","Nominal",null,"2033-11-21",3.1551131377652919E-2,0.50276243093922646,"2034-05-21",3.1551131377652919E-2,0.49723756906077354,null,"2034-02-19",3.1551131377652919E-2,3.1799999850455674E-2]
{"$rows_left_out":19}
{"sheet":"Calc|Rate of return","index":3,"n_rows":40,"n_cols":28,"rows_kept":40,"cut":false,"hidden":false,"merged":[[2,11,2,16],[0,2,0,4],[1,2,1,4],[2,17,2,21],[2,22,2,26]]}
[null,null,{"$f":"Index!$C$1","v":"GAAR 2020-25 JGN - Rate of Return Model"},null,null,"Back to Index",null,null,null,null,null,"Key:","Input (hard code)","External Link","Internal Link","Drop down Selection","Calculation","Unique calculation","Empty cell",null,null,"Section Check:",{"$f":"IF(COUNTA($A$8:$A$40)=COUNTIF($A$8:$A$40,\"OK\"),\"OK\",\"Check\")","v":"OK"},null,"Overall Check:",{"$f":"'Check|List'!$V$1","v":"OK"}]
[null,null,{"$f":"RIGHT(CELL(\"filename\",C1),LEN(CELL(\"filename\",C1))-FIND(\"]\",CELL(\"filename\",C1)))","v":"Calc|Rate of return"}]
[null,null,null,null,null,null,null,null,null,null,null,"Prior",null,null,null,null,null,"Current Regulatory Period",null,null,null,null,"Next Regulatory Period"]
[null,null,null,"Source","Unit","Basis",null,null,null,null,null,{"$f":"+M4-1","v":2015},{"$f":"+N4-1","v":2016},{"$f":"+O4-1","v":2017},{"$f":"+P4-1","v":2018},{"$f":"+Q4-1","v":2019},{"$f":"+'Input|Rate of return'!$M$4","v":2020},{"$f":"Q4+1","v":2021},{"$f":"R4+1","v":2022},2023,2024,2025,2026,2027,2028,2029,2030]
[]
[null,"Copyright Jemena Limited. All rights reserved. Jemena is not liable for any loss caused by reliance on this document."]
[]
[null,"Calc | Forecast Inflation"]
[]
[null,null,"Inflation",{"$f":"+D$4","v":"Source"},{"$f":"+E$4","v":"Unit"},{"$f":"+F$4","v":"Basis"},null,null,null,null,null,{"$f":"+\"FY\"&RIGHT(L$4,2)","v":"FY15"},"FY16","FY17","FY18","FY19","FY20","FY21","FY22","FY23","FY24","FY25","FY26","FY27","FY28","FY29","FY30"]
[]
[null,null,"Expected inflation - Glide Path","Input|Rate of Return","Per cent","n/a",null,null,null,null,null,null,null,null,null,null,null,null,null,null,null,null,{"$f":"PRODUCT(1+'Input|Rate of return'!S26:W26)^(1/COUNT('Input|Rate of return'!S26:W26))-1","v":2.7897560446280112E-2},{"$f":"+W12","v":2.7897560446280112E-2},{"$f":"+X12","v":2.7897560446280112E-2},{"$f":"+Y12","v":2.7897560446280112E-2},{"$f":"+Z12","v":2.7897560446280112E-2}]
[null,null,"Inflation (Capex)","Input|Rate of Return","Per cent","n/a",null,null,null,null,null,{"$f":"+'Input|Rate of return'!H19","v":1.7175572519083859E-2},{"$f":"+'Input|Rate of return'!I19","v":1.6885553470919357E-2},{"$f":"+'Input|Rate of return'!J19","v":1.4760147601476037E-2},{"$f":"+'Input|Rate of return'!K19","v":1.9090909090909047E-2},{"$f":"+'Input|Rate of return'!L19","v":1.7841213202497874E-2},{"$f":"+'Input|Rate of return'!M19","v":1.8404907975460238E-2},{"$f":"+'Input|Rate of return'!N19","v":8.6058519793459354E-3},{"$f":"+'Input|Rate of return'!O19","v":3.4982935153583528E-2},{"$f":"+'Input|Rate of return'!P19","v":7.8318219291014124E-2},4.0519877675840865E-2,3.2000000000000001E-2,{"$f":"+W12","v":2.7897560446280112E-2},{"$f":"+X12","v":2.7897560446280112E-2},{"$f":"+Y12","v":2.7897560446280112E-2},{"$f":"+Z12","v":2.7897560446280112E-2},{"$f":"+AA12","v":2.7897560446280112E-2}]
[null,null,"Inflation (Opex)","Input|Rate of Return","Per cent","n/a",null,null,null,null,null,null,{"$f":"+SUM('Input|Rate of return'!I12:I13)","v":1.0232558139534831E-2},{"$f":"+SUM('Input|Rate of return'!J12:J13)","v":1.9337016574585641E-2},{"$f":"+SUM('Input|Rate of return'!K12:K13)","v":2.0776874435411097E-2},{"$f":"+SUM('Input|Rate of return'!L12:L13)","v":1.5929203539823078E-2},{"$f":"+SUM('Input|Rate of return'!M12:M13)","v":-3.4843205574912606E-3},{"$f":"+SUM('Input|Rate of return'!N12:N13)","v":3.8461538461538325E-2},{"$f":"+SUM('Input|Rate of return'!O12:O13)","v":6.1447811447811418E-2},{"$f":"+SUM('Input|Rate of return'!P12:P13)","v":6.0269627279936566E-2},3.3000000000000002E-2,3.1E-2,{"$f":"+W$13","v":2.7897560446280112E-2},{"$f":"+X$13","v":2.7897560446280112E-2},{"$f":"+Y$13","v":2.7897560446280112E-2},{"$f":"+Z$13","v":2.7897560446280112E-2},{"$f":"+AA$13","v":2.7897560446280112E-2}]
[]
[null,"Calc | Return on debt"]
[]
[null,null,"Estimates","Source","Unit","Basis",null,null,null,null,null,null,{"$f":"M$4","v":2016},2017,2018,2019,2020,2021,2022,2023,2024,2025,2026,2027,2028,2029,2030]
[]
[null,null,"Observations"]
{"$rows_left_out":21}
{"sheet":"Output|Rate of return","index":4,"n_rows":37,"n_cols":25,"rows_kept":37,"cut":false,"hidden":false,"merged":[[0,2,0,4],[1,2,1,4],[2,20,2,24],[2,15,2,19],[2,9,2,14]]}
[null,null,{"$f":"Index!$C$1","v":"GAAR 2020-25 JGN - Rate of Return Model"},null,null,"Back to Index",null,null,null,"Key:","Input (hard code)","External Link","Internal Link","Drop down Selection","Calculation","Unique calculation","Empty cell",null,"Section Check:",{"$f":"IF(COUNTA($A$8:$A$37)=COUNTIF($A$8:$A$37,\"OK\"),\"OK\",\"Check\")","v":"OK"},null,"Overall Check:",{"$f":"'Check|List'!$V$1","v":"OK"}]
[null,null,{"$f":"RIGHT(CELL(\"filename\",C1),LEN(CELL(\"filename\",C1))-FIND(\"]\",CELL(\"filename\",C1)))","v":"Output|Rate of return"}]
[null,null,null,null,null,null,null,null,null,"Prior",null,null,null,null,null,"Current Regulatory Period",null,null,null,null,"Next Regulatory Period"]
[null,null,null,"Source","Unit","Basis",null,null,null,{"$f":"+K4-1","v":2015},{"$f":"+L4-1","v":2016},{"$f":"+M4-1","v":2017},{"$f":"+N4-1","v":2018},{"$f":"+O4-1","v":2019},{"$f":"+'Input|Rate of return'!$M$4","v":2020},{"$f":"O4+1","v":2021},2022,2023,2024,2025,2026,2027,2028,2029,2030]
[]
[null,"Copyright Jemena Limited. All rights reserved. Jemena is not liable for any loss caused by reliance on this document."]
[]
[null,"Outputs | PTRM inputs"]
[]
[null,null,"Rate of return","Source","Unit","Basis",null,null,null,{"$f":"\"RY\"&RIGHT(J$4,2)","v":"RY15"},"RY16","RY17","RY18","RY19","RY20","RY21","RY22","RY23","RY24","RY25",{"$f":"\"RY\"&RIGHT(U$4,2)","v":"RY26"},{"$f":"\"RY\"&RIGHT(V$4,2)","v":"RY27"},{"$f":"\"RY\"&RIGHT(W$4,2)","v":"RY28"},{"$f":"\"RY\"&RIGHT(X$4,2)","v":"RY29"},{"$f":"\"RY\"&RIGHT(Y$4,2)","v":"RY30"}]
[]
[{"$f":"IF(ISERROR(U12),\"Check\",\"Ok\")","v":"Ok"},null,"Return on equity (post-tax)","Calc|Rate of return","Per cent","Nominal",null,null,null,null,null,null,null,null,null,null,null,null,null,null,{"$f":"Cost_of_Equity","v":6.9000000000000006E-2},{"$f":"Cost_of_Equity","v":6.9000000000000006E-2},{"$f":"Cost_of_Equity","v":6.9000000000000006E-2},{"$f":"Cost_of_Equity","v":6.9000000000000006E-2},{"$f":"Cost_of_Equity","v":6.9000000000000006E-2}]
[{"$f":"IF(ISERROR(U13),\"Check\",\"Ok\")","v":"Ok"},null,"Gamma","Input|Rate of return","Per cent","Nominal",null,null,null,null,null,null,null,null,null,null,null,null,null,null,{"$f":"Gamma","v":0.56999999999999995},{"$f":"Gamma","v":0.56999999999999995},{"$f":"Gamma","v":0.56999999999999995},{"$f":"Gamma","v":0.56999999999999995},{"$f":"Gamma","v":0.56999999999999995}]
[{"$f":"IF(ISERROR(U14),\"Check\",\"Ok\")","v":"Ok"},null,"Leverage","Input|Rate of return","Per cent","Nominal",null,null,null,null,null,null,null,null,null,null,null,null,null,null,{"$f":"Leverage","v":0.6},{"$f":"Leverage","v":0.6},{"$f":"Leverage","v":0.6},{"$f":"Leverage","v":0.6},{"$f":"Leverage","v":0.6}]
[{"$f":"IF(ISERROR(U15),\"Check\",\"Ok\")","v":"Ok"},null,"Tax rate","Input|Rate of return","Per cent","Nominal",null,null,null,null,null,null,null,null,null,null,null,null,null,null,{"$f":"Tax","v":0.3},{"$f":"Tax","v":0.3},{"$f":"Tax","v":0.3},{"$f":"Tax","v":0.3},{"$f":"Tax","v":0.3}]
[{"$f":"IF(ISERROR(U16),\"Check\",\"Ok\")","v":"Ok"},null,"Return on debt (pre-tax)","Calc|Rate of return","Per cent","Nominal",null,null,null,null,null,null,null,null,null,null,null,null,null,null,{"$f":"+_xlfn.XLOOKUP(RIGHT(U$10,2),RIGHT('Calc|Rate of return'!$M$18:$AA$18,2),'Calc|Rate of return'!$M$28:$AA$28)","v":4.3832928900712054E-2},{"$f":"+_xlfn.XLOOKUP(RIGHT(V$10,2),RIGHT('Calc|Rate of return'!$M$18:$AA$18,2),'Calc|Rate of return'!$M$28:$AA$28)","v":4.19302865743163E-2},{"$f":"+_xlfn.XLOOKUP(RIGHT(W$10,2),RIGHT('Calc|Rate of return'!$M$18:$AA$18,2),'Calc|Rate of return'!$M$28:$AA$28)","v":4.0381580384167629E-2},{"$f":"+_xlfn.XLOOKUP(RIGHT(X$10,2),RIGHT('Calc|Rate of return'!$M$18:$AA$18,2),'Calc|Rate of return'!$M$28:$AA$28)","v":3.9328184149650884E-2},{"$f":"+_xlfn.XLOOKUP(RIGHT(Y$10,2),RIGHT('Calc|Rate of return'!$M$18:$AA$18,2),'Calc|Rate of return'!$M$28:$AA$28)","v":3.8328085622016235E-2}]
[]
[null,null,"Nominal vanilla WACC",null,null,null,null,null,null,null,null,null,null,null,null,null,null,null,null,null,{"$f":"U12*(1-U14)+U16*U14","v":5.3899757340427235E-2},{"$f":"V12*(1-V14)+V16*V14","v":5.2758171944589781E-2},{"$f":"W12*(1-W14)+W16*W14","v":5.1828948230500577E-2},{"$f":"X12*(1-X14)+X16*X14","v":5.1196910489790533E-2},{"$f":"Y12*(1-Y14)+Y16*Y14","v":5.0596851373209739E-2}]
[]
[null,null,"Debt and equity raising costs","Source","Unit","Basis",null,null,null,null,null,null,null,null,null,null,null,null,null,null,"Estimates"]
{"$rows_left_out":18}
{"sheet":"Lookup|Tables","index":5,"n_rows":84,"n_cols":22,"rows_kept":84,"cut":false,"hidden":false,"merged":[[0,2,0,6],[1,2,1,4]]}
[null,null,{"$f":"Index!$C$1","v":"GAAR 2020-25 JGN - Rate of Return Model"},null,null,null,null,null,null,"Back to Index",null,"Key:","Input","External Link","Internal Link",null,null,null,null,null,"Overall Check:",{"$f":"+'Check|List'!V1","v":"OK"}]
[null,null,{"$f":"RIGHT(CELL(\"filename\",C1),LEN(CELL(\"filename\",C1))-FIND(\"]\",CELL(\"filename\",C1)))","v":"Lookup|Tables"}]
[]
[]
[null,"Copyright Jemena Limited. All rights reserved. Jemena is not liable for any loss caused by reliance on this document."]
[]
[null,"Lookup table"]
[]
[null,null,"Financial Unit Denomination","Source",null,null,"Ref"]
[null,null,"Dollars","JGN",null,null,"$dollars"]
[null,null,"Thousands","JGN",null,null,"$000"]
[null,null,"Millions","JGN",null,null,"$millions"]
[]
[null,null,"Non-financial Unit Denomination"]
[null,null,"Percent","JGN",null,null,"Per cent"]
[null,null,"Unit","JGN",null,null,"unit"]
[null,null,"Number","JGN",null,null,"number"]
[null,null,"Factor","JGN",null,null,"factor"]
[null,null,"Mains","JGN",null,null,"mains"]
[null,null,"Kilometres","JGN",null,null,"kms"]
{"$rows_left_out":65}
{"sheet":"Check|List","index":6,"n_rows":15,"n_cols":22,"rows_kept":15,"cut":false,"hidden":false,"merged":[[0,2,0,6],[1,2,1,4]]}
[null,null,{"$f":"Index!$C$1","v":"GAAR 2020-25 JGN - Rate of Return Model"},null,null,null,null,null,null,"Back to Index",null,"Key:","Input","External Link","Internal Link",null,null,null,null,null,"Overall Check:",{"$f":"IF(COUNTA($G$10:$G$13)=COUNTIF($G$10:$G$13,\"OK\"),\"OK\",\"Check\")","v":"OK"}]
[null,null,{"$f":"RIGHT(CELL(\"filename\",C1),LEN(CELL(\"filename\",C1))-FIND(\"]\",CELL(\"filename\",C1)))","v":"Check|List"}]
[]
[]
[null,"Copyright Jemena Limited. All rights reserved. Jemena is not liable for any loss caused by reliance on this document."]
[]
[null,"Check List"]
[]
[null,null,"Sheet",null,null,null,"Status"]
[null,null,"Input | Rate of return",null,null,null,{"$f":"'Input|Rate of return'!$S$1","v":"OK"}]
[null,null,"Calc | Placeholder RfR",null,null,null,{"$f":"+'Calc|Rate of return'!W1","v":"OK"}]
[null,null,"Calc | Rate of return",null,null,null,{"$f":"'Calc|Rate of return'!W1","v":"OK"}]
[null,null,"Output | Rate of return",null,null,null,{"$f":"'Output|Rate of return'!T1","v":"OK"}]
[]
[null,"End"]