{"text_format":"1","workbook":"xlsx","n_sheets":28,"sheets":["Instructions","CONTENTS","Business & other details","E1. Expenditure Summary","E2. Mains Repex","E3. Mains Augex","E4. Meter replacement","E5. Connections (gas)","E6. Telemetry","E10. Overheads","E12. ICT","E13. Other capex","E17. Step changes","E20. Opex","E21. ARS","E25. Escalators","N1. Demand","N2. Network characteristics","S1. Cust. no.-by type","S1.2 Cust. no.-by tariff","S10. Supply Quality","S11. Network reliability","F3. Revenue","Additional disclosures","AER CF","AER NRs","AER lookups","AER ETL"],"not_rendered":{"charts":0,"images":2,"macros":1,"external_links":0,"defined_names":767,"comments":1,"pivot_tables":0},"unopened":[],"bounds":{"document_bytes":16777216,"sheet_cells":100000,"rows_first":2000,"rows_last":500,"rows_between":2000,"halvings":0,"cell_chars":16384,"cell_head_chars":4096},"cells_cut":0,"cells_raw":0,"read":"whole","date_system":"1900"}

{"sheet":"Instructions","index":0,"n_rows":24,"n_cols":4,"rows_kept":24,"cut":false,"hidden":false,"merged":[[18,1,24,1],[18,2,18,4],[1,1,1,4],[2,1,2,4],[3,1,3,4],[4,1,4,4],[5,2,5,4],[7,1,8,1],[7,2,7,3],[8,2,8,4],[10,1,11,1],[10,2,10,3],[11,2,11,4],[13,2,13,4],[16,2,16,4]]}
[]
[null,{"$f":"CONCATENATE(dms_Sector,\" \",dms_Segment,\" \", \"Network Service Provider\")","v":"Gas Distribution Network Service Provider"}]
[null,{"$f":"IF(dms_Model=\"Reset\",\"Regulatory Proposal RIN Template\",\"Annual Reporting RIN\")","v":"Regulatory Proposal RIN Template"}]
[null,{"$f":"CONCATENATE(\"This template is to be used by \",INDEX(dms_TradingNameFull_List,MATCH(dms_TradingName,dms_TradingName_List)),\" to fulfil its reporting obligations to the AER.\")","v":"This template is to be used by Jemena Gas Networks (NSW) Ltd to fulfil its reporting obligations to the AER."}]
[null,"INSTRUCTIONS"]
[null,"GENERAL","Complete the Business & other details worksheet before entering data or values in any other worksheets. The Business & other details worksheet is linked to other worksheets within the workbook and automatically generates certain column headings and conditional formatting."]
[]
[null,"CONFIDENTIAL INFORMATION","\nBusinesses must use the macro at the top of  \neach worksheet to identify confidential\ninformation in the confidential workbook and\nwhere confidential information has been \nremoved in the public workbook. \n\n"]
[null,null,"-Do this by selecting the cell or cells that contain confidential information and then run the CONFIDENTIAL macro. This will format the cells a specific colour that is identified by the AER's database which in turn marks that information as confidential.\n\n-To reverse this, select the cell or cells and run the NON-CONFIDENTIAL macro."]
[]
[null,"PROTECTED (SOCI) INFORMATION","\nPlease use the macro at the top of each \nworksheet to identify information in the \nconfidential workbook that is protected \ninformation under the SOCI Act. All \ninformation marked Protected (SOCI) is also \ndeemed to be confidential information."]
[null,null,"-Do this by selecting the cell or cells that contain protected information and then run the PROTECTED (SOCI) macro. This will format the cells a specific colour that is identified by the AER's database which in turn marks that information as protected..\n\n-To reverse this, select the cell or cells and run the NON-PROTECTED macro."]
[]
[null,"RESPONSES","\nPlease return two (2) files to the AER: \n\n1. A confidential version which must contain a complete set of all responses with confidential information marked using the Mark selection CONFIDENTIAL macro and which has been completed using the locked template file provided by the AER. \n\n2. A public version with confidential information redacted or aggregated.\n\nUse the drop down box on the Business and other details worksheet to identify the file as either confidential or public. "]
[]
[]
[null,"ORDER OF MAGNITUDE","\nAll amounts are to be unrounded and reported on a one for one basis: that is 1000 is to be entered as '1000'. \n\n"]
[]
[null,"INPUT / NON-INPUT CELLS"]
[null,null,null,"Yellow = Input cell (mandatory)"]
[null,null,null,"Darker yellow = input cell (mandatory)"]
[null,null,null,"Orange = input cell (if data available)"]
[null,null,null,"Grey = Not applicable/No inputs required"]
[null,null,null," PLEASE DO NOT ENTER TEXT into cells that are to contain numbers \n(including 'numbers stored as text')"]

{"sheet":"CONTENTS","index":1,"n_rows":37,"n_cols":4,"rows_kept":37,"cut":false,"hidden":false,"merged":[]}
[null,{"$f":"INDEX(dms_Worksheet_List,MATCH(dms_Model,dms_Model_List))","v":"REGULATORY REPORTING STATEMENT"}]
[null,{"$f":"dms_TradingNameFull","v":"Jemena Gas Networks (NSW) Ltd"}]
[null,{"$f":"dms_Header_Span","v":"2023-24 to 2029-30"}]
[]
[]
[]
[null,null,"CONTENTS"]
[]
[null,null,"TEMPLATE DATE","FEBRUARY 2024"]
[]
[null,null,"SUBMISSION","Business & other details"]
[]
[null,null,"EXPENDITURE","E1. Expenditure Summary"]
[null,null,null,"E2. Mains Repex"]
[null,null,null,"E3. Mains Augex"]
[null,null,null,"E4. Meter replacement"]
[null,null,null,"E5. New Connections"]
[null,null,null,"E6. Non-network"]
[null,null,null,"E10. Overheads"]
[null,null,null,"E12. ICT"]
[null,null,null,"E13. Other capex"]
[null,null,null,"E17. Step changes"]
[null,null,null,"E20. Opex"]
[null,null,null,"E21. ARS"]
[null,null,null,"E25. Escalators"]
[]
[null,null,"NETWORK","N1. Demand"]
[null,null,null,"N2. Network characteristcs"]
[]
[null,null,"SERVICE","S1. Customer numbers - by customer type"]
[null,null,null,"S1.2. Customer numbers - by tariff"]
[null,null,null,"S10. Supply Quality"]
[null,null,null,"S11. Network reliability"]
[]
[null,null,"FINANCIAL","F3. Revenue"]
[]
[null,null,"ADMIN","Additional disclosures"]

{"sheet":"Business & other details","index":2,"n_rows":73,"n_cols":79,"rows_kept":73,"cut":false,"hidden":false,"merged":[[62,25,62,34],[62,37,62,52],[70,25,70,34],[70,37,70,81],[72,25,72,34],[72,37,72,52],[64,25,64,34],[64,37,64,52],[66,25,66,34],[66,37,66,52],[68,25,68,34],[68,37,68,52],[52,37,52,44],[52,46,52,53],[52,55,52,62],[52,64,52,71],[52,73,52,80],[54,25,54,34],[54,37,54,44],[56,25,56,34],[56,37,56,44],[50,25,50,34],[50,37,50,44],[50,46,50,53],[50,55,50,62],[50,64,50,71],[50,73,50,80],[51,37,51,44],[51,46,51,53],[51,55,51,62],[51,64,51,71],[51,73,51,80],[47,37,47,44],[47,46,47,53],[47,55,47,62],[47,64,47,71],[47,73,47,80],[48,37,48,44],[48,46,48,53],[48,55,48,62],[48,64,48,71],[48,73,48,80],[42,37,42,44],[42,46,42,53],[42,55,42,62],[42,64,42,71],[42,73,42,80],[46,25,46,34],[46,37,46,44],[46,46,46,53],[46,55,46,62],[46,64,46,71],[46,73,46,80],[44,25,44,34],[40,25,40,34],[40,37,40,44],[40,46,40,53],[40,55,40,62],[40,64,40,71],[40,73,40,80],[41,37,41,44],[41,46,41,53],[41,55,41,62],[41,64,41,71],[41,73,41,80],[30,21,30,35],[30,37,30,58],[30,60,30,66],[30,68,30,89],[31,21,31,35],[31,37,31,58],[31,60,31,66],[31,68,31,89],[32,21,32,35],[32,37,32,58],[32,60,32,66],[32,68,32,89],[22,21,22,35],[22,37,22,58],[22,60,22,66],[22,68,22,89],[23,21,23,35],[23,37,23,51],[23,60,23,66],[23,68,23,82],[24,21,24,35],[24,37,24,40],[24,49,24,51],[24,60,24,66],[24,68,24,71],[24,80,24,82],[0,7,2,15],[3,21,3,57],[6,21,6,75],[8,16,8,93],[15,21,15,35],[15,37,15,58],[16,21,16,35],[16,37,16,48],[21,21,21,35],[21,37,21,58],[21,60,21,66],[21,68,21,89]]}
[null,null,null,null,null,null,null,null,null,null,null,null,null,null,null,null,null,null,null,null,null,{"$f":"INDEX(dms_Worksheet_List,MATCH(dms_Model,dms_Model_List))","v":"REGULATORY REPORTING STATEMENT"}]
[null,null,null,null,null,null,null,null,null,null,null,null,null,null,null,null,null,null,null,null,null,{"$f":"dms_TradingNameFull","v":"Jemena Gas Networks (NSW) Ltd"}]
[null,null,null,null,null,null,null,null,null,null,null,null,null,null,null,null,null,null,null,null,null,{"$f":"dms_Header_Span","v":"2023-24 to 2029-30"}]
[null,null,null,null,null,null,null,null,null,null,null,null,null,null,null,null,null,null,null,null,null,"BUSINESS & OTHER DETAILS"]
[]
[null,null,null,null,null,null,null,null,null,null,null,null,null,null,null,null,null,null,null,null,null,"INSTRUCTIONS"]
[null,null,null,null,null,null,null,null,null,null,null,null,null,null,null,null,null,null,null,null,null,"Complete the following business details regulatory template before entering data or values in any other regulatory template. This regulatory template is linked to other cells within the spreadsheet and automatically generates column headings and conditional formatting to distinguish business specific input and non-input cells. "]
[]
[null,null,null,null,null,null,null,null,null,null,null,null,null,null,null,null,"SUBMISSION PARTICULARS INPUT SHEET"]
[]
[]
[null,null,null,null,null,null,null,null,null,null,null,null,null,null,null,null,null,null,null,null,null,"ENTITY DETAILS"]
[]
[null,null,null,null,null,null,null,null,null,null,null,null,null,null,null,null,null,null,null,null,null,"Business Name"]
[]
[null,null,null,null,null,null,null,null,null,null,null,null,null,null,null,null,null,null,null,null,null,"Short name",null,null,null,null,null,null,null,null,null,null,null,null,null,null,null,"JGN"]
[null,null,null,null,null,null,null,null,null,null,null,null,null,null,null,null,null,null,null,null,null,"ACN/ABN",null,null,null,null,null,null,null,null,null,null,null,null,null,null,null,{"$f":"INDEX(dms_ABN_List,MATCH(dms_TradingName,dms_TradingName_List))","v":"003 004 322"}]
[]
[]
[null,null,null,null,null,null,null,null,null,null,null,null,null,null,null,null,null,null,null,null,null,"Business Address",null,null,null,null,null,null,null,null,null,null,null,null,null,null,null,null,null,null,null,null,null,null,null,null,null,null,null,null,null,null,null,null,null,null,null,null,null,null,null,null,null,null,null,null,null,null,"Postal Address"]
[]
[null,null,null,null,null,null,null,null,null,null,null,null,null,null,null,null,null,null,null,null,null,"Address 1",null,null,null,null,null,null,null,null,null,null,null,null,null,null,null,null,null,null,null,null,null,null,null,null,null,null,null,null,null,null,null,null,null,null,null,null,null,null,"Address 1"]
[null,null,null,null,null,null,null,null,null,null,null,null,null,null,null,null,null,null,null,null,null,"Address 2",null,null,null,null,null,null,null,null,null,null,null,null,null,null,null,{"$f":"IF(ISBLANK(INDEX(dms_Addr2_List,MATCH(dms_TradingName,dms_TradingName_List))),\"\",(INDEX(dms_Addr2_List,MATCH(dms_TradingName,dms_TradingName_List))))","v":""},null,null,null,null,null,null,null,null,null,null,null,null,null,null,null,null,null,null,null,null,null,null,"Address 2"]
[null,null,null,null,null,null,null,null,null,null,null,null,null,null,null,null,null,null,null,null,null,"Suburb",null,null,null,null,null,null,null,null,null,null,null,null,null,null,null,null,null,null,null,null,null,null,null,null,null,null,null,null,null,null,null,null,null,null,null,null,null,null,"Suburb"]
[null,null,null,null,null,null,null,null,null,null,null,null,null,null,null,null,null,null,null,null,null,"State",null,null,null,null,null,null,null,null,null,null,null,null,null,null,null,"NSW",null,null,null,null,null,null,null,null,null,"Post code",null,null,null,null,null,null,null,null,null,null,null,null,"State",null,null,null,null,null,null,null,"NSW",null,null,null,null,null,null,null,null,null,"Post code"]
[]
[null,null,null,null,null,null,null,null,null,null,null,null,null,null,null,null,null,null,null,null,null,null,null,null,null,null,null,null,null,null,null,null,null,null,null,null,null,null,null,null,null,null,null,null,null,null,null,null,null,null,null,null,"`"]
[]
[null,null,null,null,null,null,null,null,null,null,null,null,null,null,null,null,null,null,null,null,null,"Contact Names"]
[]
[null,null,null,null,null,null,null,null,null,null,null,null,null,null,null,null,null,null,null,null,null,"Name",null,null,null,null,null,null,null,null,null,null,null,null,null,null,null,null,null,null,null,null,null,null,null,null,null,null,null,null,null,null,null,null,null,null,null,null,null,null,"Name"]
[null,null,null,null,null,null,null,null,null,null,null,null,null,null,null,null,null,null,null,null,null,"Phone",null,null,null,null,null,null,null,null,null,null,null,null,null,null,null,null,null,null,null,null,null,null,null,null,null,null,null,null,null,null,null,null,null,null,null,null,null,null,"Phone"]
[null,null,null,null,null,null,null,null,null,null,null,null,null,null,null,null,null,null,null,null,null,"Email",null,null,null,null,null,null,null,null,null,null,null,null,null,null,null,null,null,null,null,null,null,null,null,null,null,null,null,null,null,null,null,null,null,null,null,null,null,null,"Email"]
[]
[]
[]
[]
[null,null,null,null,null,null,null,null,null,null,null,null,null,null,null,null,"REGULATORY CONTROL PERIODS"]
[]
[]
[null,null,null,null,null,null,null,null,null,null,null,null,null,null,null,null,null,null,null,null,null,null,null,null,null,"Forthcoming period",null,null,null,null,null,null,null,null,null,null,null,"2025-26",null,null,null,null,null,null,null,null,{"$f":"FRCP_y2","v":"2026-27"},null,null,null,null,null,null,null,null,{"$f":"FRCP_y3","v":"2027-28"},null,null,null,null,null,null,null,null,{"$f":"FRCP_y4","v":"2028-29"},null,null,null,null,null,null,null,null,{"$f":"FRCP_y5","v":"2029-30"}]
[null,null,null,null,null,null,null,null,null,null,null,null,null,null,null,null,null,null,null,null,null,null,null,null,null,null,null,null,null,null,null,null,null,null,null,null,null,{"$f":"FRCP_y6","v":"2030-31"},null,null,null,null,null,null,null,null,{"$f":"FRCP_y7","v":"2031-32"},null,null,null,null,null,null,null,null,{"$f":"FRCP_y8","v":"2032-33"},null,null,null,null,null,null,null,null,{"$f":"FRCP_y9","v":"2033-34"},null,null,null,null,null,null,null,null,{"$f":"FRCP_y10","v":"2034-35"}]
[null,null,null,null,null,null,null,null,null,null,null,null,null,null,null,null,null,null,null,null,null,null,null,null,null,null,null,null,null,null,null,null,null,null,null,null,null,{"$f":"FRCP_y11","v":"2035-36"},null,null,null,null,null,null,null,null,{"$f":"FRCP_y12","v":"2036-37"},null,null,null,null,null,null,null,null,{"$f":"FRCP_y13","v":"2037-38"},null,null,null,null,null,null,null,null,{"$f":"FRCP_y14","v":"2038-39"},null,null,null,null,null,null,null,null,{"$f":"FRCP_y15","v":{"$error":"#NAME?"}}]
[]
[]
[]
[null,null,null,null,null,null,null,null,null,null,null,null,null,null,null,null,null,null,null,null,null,null,null,"RESETS",null,"Current period",null,null,null,null,null,null,null,null,null,null,null,{"$f":"CRCP_y1","v":"2020-21"},null,null,null,null,null,null,null,null,{"$f":"CRCP_y2","v":"2021-22"},null,null,null,null,null,null,null,null,{"$f":"CRCP_y3","v":"2022-23"},null,null,null,null,null,null,null,null,{"$f":"CRCP_y4","v":"2023-24"},null,null,null,null,null,null,null,null,{"$f":"CRCP_y5","v":"2024-25"}]
[null,null,null,null,null,null,null,null,null,null,null,null,null,null,null,null,null,null,null,null,null,null,null,null,null,null,null,null,null,null,null,null,null,null,null,null,null,{"$f":"CRCP_y6","v":"2025-26"},null,null,null,null,null,null,null,null,{"$f":"CRCP_y7","v":"2026-27"},null,null,null,null,null,null,null,null,{"$f":"CRCP_y8","v":"2027-28"},null,null,null,null,null,null,null,null,{"$f":"CRCP_y9","v":"2028-29"},null,null,null,null,null,null,null,null,{"$f":"CRCP_y10","v":"2029-30"}]
[null,null,null,null,null,null,null,null,null,null,null,null,null,null,null,null,null,null,null,null,null,null,null,null,null,null,null,null,null,null,null,null,null,null,null,null,null,{"$f":"CRCP_y11","v":"2030-31"},null,null,null,null,null,null,null,null,{"$f":"CRCP_y12","v":"2031-32"},null,null,null,null,null,null,null,null,{"$f":"CRCP_y13","v":"2032-33"},null,null,null,null,null,null,null,null,{"$f":"CRCP_y14","v":"2033-34"},null,null,null,null,null,null,null,null,{"$f":"CRCP_y15","v":"2034-35"}]
[]
[null,null,null,null,null,null,null,null,null,null,null,null,null,null,null,null,null,null,null,null,null,null,null,null,null,"Previous period",null,null,null,null,null,null,null,null,null,null,null,{"$f":"PRCP_y1","v":"2015-16"},null,null,null,null,null,null,null,null,{"$f":"PRCP_y2","v":"2016-17"},null,null,null,null,null,null,null,null,{"$f":"PRCP_y3","v":"2017-18"},null,null,null,null,null,null,null,null,{"$f":"PRCP_y4","v":"2018-19"},null,null,null,null,null,null,null,null,{"$f":"PRCP_y5","v":"2019-20"}]
[null,null,null,null,null,null,null,null,null,null,null,null,null,null,null,null,null,null,null,null,null,null,null,null,null,null,null,null,null,null,null,null,null,null,null,null,null,{"$f":"PRCP_y6","v":"2020-21"},null,null,null,null,null,null,null,null,{"$f":"PRCP_y7","v":"2021-22"},null,null,null,null,null,null,null,null,{"$f":"PRCP_y8","v":"2022-23"},null,null,null,null,null,null,null,null,{"$f":"PRCP_y9","v":"2023-24"},null,null,null,null,null,null,null,null,{"$f":"PRCP_y10","v":"2024-25"}]
[null,null,null,null,null,null,null,null,null,null,null,null,null,null,null,null,null,null,null,null,null,null,null,null,null,null,null,null,null,null,null,null,null,null,null,null,null,{"$f":"PRCP_y11","v":"2025-26"},null,null,null,null,null,null,null,null,{"$f":"PRCP_y12","v":"2026-27"},null,null,null,null,null,null,null,null,{"$f":"PRCP_y13","v":"2027-28"},null,null,null,null,null,null,null,null,{"$f":"PRCP_y14","v":"2028-29"},null,null,null,null,null,null,null,null,{"$f":"PRCP_y15","v":"2029-30"}]
[]
[null,null,null,null,null,null,null,null,null,null,null,null,null,null,null,null,null,null,null,null,null,null,null,null,null,"Commencing year",null,null,null,null,null,null,null,null,null,null,null,"2025-26"]
[null,null,null,null,null,null,null,null,null,null,null,null,null,null,null,null,null,null,null,null,null,null,null,"ANNUAL RINS"]
[null,null,null,null,null,null,null,null,null,null,null,null,null,null,null,null,null,null,null,null,null,null,null,null,null,"Final year",null,null,null,null,null,null,null,null,null,null,null,"2029-30"]
[]
[]
[]
[null,null,null,null,null,null,null,null,null,null,null,null,null,null,null,null,"SUBMISSION DETAILS"]
[]
[null,null,null,null,null,null,null,null,null,null,null,null,null,null,null,null,null,null,null,null,null,null,null,null,null,"RIN type",null,null,null,null,null,null,null,null,null,null,null,{"$f":"INDIRECT(dms_Model)","v":"Regulatory Reporting (Reset)"}]
[]
[null,null,null,null,null,null,null,null,null,null,null,null,null,null,null,null,null,null,null,null,null,null,null,null,null,"Source",null,null,null,null,null,null,null,null,null,null,null,"Regulatory proposal"]
[]
[null,null,null,null,null,null,null,null,null,null,null,null,null,null,null,null,null,null,null,null,null,null,null,"THIS FILE",null,"Data Quality",null,null,null,null,null,null,null,null,null,null,null,"Consolidated"]
[]
[null,null,null,null,null,null,null,null,null,null,null,null,null,null,null,null,null,null,null,null,null,null,null,null,null,"Confidentiality Status",null,null,null,null,null,null,null,null,null,null,null,"Public"]
[]
[null,null,null,null,null,null,null,null,null,null,null,null,null,null,null,null,null,null,null,null,null,null,null,null,null,"Amendment Reason",null,null,null,null,null,null,null,null,null,null,null,"."]
[]
[null,null,null,null,null,null,null,null,null,null,null,null,null,null,null,null,null,null,null,null,null,null,null,null,null,"Submission Date",null,null,null,null,null,null,null,null,null,null,null,"dd/mm/yy",null,null,null,null,null,null,null,null,null,null,null,null,null,null,null,null,null,"Please enter date this file submitted to AER"]

{"sheet":"E1. Expenditure Summary","index":3,"n_rows":189,"n_cols":9,"rows_kept":189,"cut":false,"hidden":false,"merged":[]}
[null,{"$f":"INDEX(dms_Worksheet_List,MATCH(dms_Model,dms_Model_List))","v":"REGULATORY REPORTING STATEMENT"}]
[null,{"$f":"dms_TradingNameFull","v":"Jemena Gas Networks (NSW) Ltd"}]
[null,{"$f":"dms_Header_Span","v":"2023-24 to 2029-30"}]
[null,"E1. EXPENDITURE SUMMARY"]
[null,"FINAL RIN TEMPLATE - FEBRUARY 2024"]
[]
[]
[null,"E1.1 - CAPEX"]
[null,"E1.1.1 - REFERENCE SERVICES"]
[null,null,"EXPENDITURE"]
[null,null,{"$f":"CONCATENATE(\"$, real \",dms_DollarReal)","v":"$, real June 2025"}]
[null,null,{"$f":"dms_y1","v":"2023-24"},{"$f":"dms_y2","v":"2024-25"},{"$f":"dms_y3","v":"2025-26"},{"$f":"dms_y4","v":"2026-27"},{"$f":"dms_y5","v":"2027-28"},{"$f":"dms_y6","v":"2028-29"},{"$f":"dms_y7","v":"2029-30"}]
[null,"Connections (gas)",85287941.904698133,82014440.779441237,74016581.731135637,100656494.95857453,87072136.718968779,52325189.865185387,40779420.653084069]
[null,"Mains replacement",4729731.275944721,6628975.462780877,11962086.352453411,19183971.09559739,13901603.872127347,9929632.8230184596,7534212.7763827797]
[null,"Mains augmentation",1885275.566447278,3360075.1383233364,4860384.4607878961,3698910.9193170853,1879395.1817428193,2238407.8820498353,2447594.71931036]
[null,"Telemetry",179918.98736839188,180877.7528788468,182118.64304399121,182991.22583890948,183812.92872270357,184781.98664676573,185835.6102312603]
[null,"Meter replacement",22201514.458639022,24608904.769450568,22832126.624769691,29410247.097133271,31124452.292297952,39175391.568584204,36085086.600742012]
[null,"ICT",17488486.824944623,18805807.360553481,11605054.242506251,12779694.268164486,8380724.982743321,6356930.8397247698,5901090.71333325]
[null,"Capitalised network overheads",4254116.505143079,5218123.1860515112,5446584.012768046,5990759.3480244288,5142075.4116338575,3882854.017952444,3265911.0580942701]
[null,"Capitalised corporate overheads",0,0,0,0,0,0,0]
[null,"Other capex",29672655.205176551,57060989.494500682,60191534.30246526,37541092.33270514,33313531.63285223,22024723.529503968,18599926.299275976]
[null,"Capital contributions included in the above"]
[null,"Total (less capital contributions)"]
[]
[null,"E1.1.2 - NON-REFERENCE SERVICES"]
[null,"Non-reference services ",7718312.8821649812,12990167.159342326,684400.15767824301,21912436.375889696,9352782.2317450605,5882136.5000408106,0]
[]
[]
[]
[]
[]
[]
[]
[]
[]
[]
[]
[]
[]
[]
[]
[]
[]
[]
[]
[]
[]
[]
[]
[]
[null,"Capital contributions included in the above"]
[null,"Total",{"$f":"SUM(C26:C50)-C51","v":7718312.8821649812},12990167.159342326,684400.15767824301,21912436.375889696,9352782.2317450605,5882136.5000408106,0]
[]
[]
[null,"E1.2 - OPEX"]
[null,"E1.2.1 - REFERENCE SERVICES"]
[null,null,"EXPENDITURE"]
[null,null,{"$f":"CONCATENATE(\"$, real \",dms_DollarReal)","v":"$, real June 2025"}]
[null,null,{"$f":"dms_y1","v":"2023-24"},{"$f":"dms_y2","v":"2024-25"},{"$f":"dms_y3","v":"2025-26"},{"$f":"dms_y4","v":"2026-27"},{"$f":"dms_y5","v":"2027-28"},{"$f":"dms_y6","v":"2028-29"},{"$f":"dms_y7","v":"2029-30"}]
[null,{"$f":"'E20. Opex'!B45","v":"repairs and maintenance"},{"$f":"'E20. Opex'!F45","v":""},{"$f":"'E20. Opex'!G45","v":""},{"$f":"'E20. Opex'!H45","v":""},{"$f":"'E20. Opex'!I45","v":""},{"$f":"'E20. Opex'!J45","v":""},{"$f":"'E20. Opex'!K45","v":""},{"$f":"'E20. Opex'!L45","v":""}]
[null,{"$f":"'E20. Opex'!B46","v":"marketing and retail incentives"},{"$f":"'E20. Opex'!F46","v":""},{"$f":"'E20. Opex'!G46","v":""},{"$f":"'E20. Opex'!H46","v":""},{"$f":"'E20. Opex'!I46","v":""},{"$f":"'E20. Opex'!J46","v":""},{"$f":"'E20. Opex'!K46","v":""},{"$f":"'E20. Opex'!L46","v":""}]
[null,{"$f":"'E20. Opex'!B47","v":"debt raising"},{"$f":"'E20. Opex'!F47","v":""},{"$f":"'E20. Opex'!G47","v":""},{"$f":"'E20. Opex'!H47","v":""},{"$f":"'E20. Opex'!I47","v":""},{"$f":"'E20. Opex'!J47","v":""},{"$f":"'E20. Opex'!K47","v":""},{"$f":"'E20. Opex'!L47","v":""}]
[null,{"$f":"'E20. Opex'!B48","v":"equity raising"},{"$f":"'E20. Opex'!F48","v":""},{"$f":"'E20. Opex'!G48","v":""},{"$f":"'E20. Opex'!H48","v":""},{"$f":"'E20. Opex'!I48","v":""},{"$f":"'E20. Opex'!J48","v":""},{"$f":"'E20. Opex'!K48","v":""},{"$f":"'E20. Opex'!L48","v":""}]
[null,{"$f":"'E20. Opex'!B49","v":"unaccounted for gas"},{"$f":"'E20. Opex'!F49","v":""},{"$f":"'E20. Opex'!G49","v":""},{"$f":"'E20. Opex'!H49","v":""},{"$f":"'E20. Opex'!I49","v":""},{"$f":"'E20. Opex'!J49","v":""},{"$f":"'E20. Opex'!K49","v":""},{"$f":"'E20. Opex'!L49","v":""}]
[null,{"$f":"'E20. Opex'!B50","v":"jurisdictional charges"},{"$f":"'E20. Opex'!F50","v":""},{"$f":"'E20. Opex'!G50","v":""},{"$f":"'E20. Opex'!H50","v":""},{"$f":"'E20. Opex'!I50","v":""},{"$f":"'E20. Opex'!J50","v":""},{"$f":"'E20. Opex'!K50","v":""},{"$f":"'E20. Opex'!L50","v":""}]
[null,{"$f":"'E20. Opex'!B51","v":"GSL payments"},{"$f":"'E20. Opex'!F51","v":""},{"$f":"'E20. Opex'!G51","v":""},{"$f":"'E20. Opex'!H51","v":""},{"$f":"'E20. Opex'!I51","v":""},{"$f":"'E20. Opex'!J51","v":""},{"$f":"'E20. Opex'!K51","v":""},{"$f":"'E20. Opex'!L51","v":""}]
[null,{"$f":"'E20. Opex'!B52","v":"other opex"},{"$f":"'E20. Opex'!F52","v":""},{"$f":"'E20. Opex'!G52","v":""},{"$f":"'E20. Opex'!H52","v":""},{"$f":"'E20. Opex'!I52","v":""},{"$f":"'E20. Opex'!J52","v":""},{"$f":"'E20. Opex'!K52","v":""},{"$f":"'E20. Opex'!L52","v":""}]
[null,"Total",{"$f":"SUM(C60:C67)","v":0},0,0,0,0,0,0]
[]
[null,"E1.2.2 - NON-REFERENCE SERVICES"]
[null,{"$f":"IF(ISBLANK('E20. Opex'!B59),\"\",'E20. Opex'!B59)","v":""}]
[null,{"$f":"IF(ISBLANK('E20. Opex'!B60),\"\",'E20. Opex'!B60)","v":""}]
[null,{"$f":"IF(ISBLANK('E20. Opex'!B61),\"\",'E20. Opex'!B61)","v":""}]
[null,{"$f":"IF(ISBLANK('E20. Opex'!B62),\"\",'E20. Opex'!B62)","v":""}]
[null,{"$f":"IF(ISBLANK('E20. Opex'!B63),\"\",'E20. Opex'!B63)","v":""}]
[null,{"$f":"IF(ISBLANK('E20. Opex'!B64),\"\",'E20. Opex'!B64)","v":""}]
[null,{"$f":"IF(ISBLANK('E20. Opex'!B65),\"\",'E20. Opex'!B65)","v":""}]
[null,{"$f":"IF(ISBLANK('E20. Opex'!B66),\"\",'E20. Opex'!B66)","v":""}]
[null,{"$f":"IF(ISBLANK('E20. Opex'!B67),\"\",'E20. Opex'!B67)","v":""}]
[null,{"$f":"IF(ISBLANK('E20. Opex'!B68),\"\",'E20. Opex'!B68)","v":""}]
[null,{"$f":"IF(ISBLANK('E20. Opex'!B69),\"\",'E20. Opex'!B69)","v":""}]
[null,{"$f":"IF(ISBLANK('E20. Opex'!B70),\"\",'E20. Opex'!B70)","v":""}]
[null,{"$f":"IF(ISBLANK('E20. Opex'!B71),\"\",'E20. Opex'!B71)","v":""}]
[null,{"$f":"IF(ISBLANK('E20. Opex'!B72),\"\",'E20. Opex'!B72)","v":""}]
[null,{"$f":"IF(ISBLANK('E20. Opex'!B73),\"\",'E20. Opex'!B73)","v":""}]
[null,{"$f":"IF(ISBLANK('E20. Opex'!B74),\"\",'E20. Opex'!B74)","v":""}]
[null,{"$f":"IF(ISBLANK('E20. Opex'!B75),\"\",'E20. Opex'!B75)","v":""}]
[null,{"$f":"IF(ISBLANK('E20. Opex'!B76),\"\",'E20. Opex'!B76)","v":""}]
[null,{"$f":"IF(ISBLANK('E20. Opex'!B77),\"\",'E20. Opex'!B77)","v":""}]
[null,{"$f":"IF(ISBLANK('E20. Opex'!B78),\"\",'E20. Opex'!B78)","v":""}]
[null,{"$f":"IF(ISBLANK('E20. Opex'!B79),\"\",'E20. Opex'!B79)","v":""}]
[null,{"$f":"IF(ISBLANK('E20. Opex'!B80),\"\",'E20. Opex'!B80)","v":""}]
[null,{"$f":"IF(ISBLANK('E20. Opex'!B81),\"\",'E20. Opex'!B81)","v":""}]
[null,{"$f":"IF(ISBLANK('E20. Opex'!B82),\"\",'E20. Opex'!B82)","v":""}]
[null,{"$f":"IF(ISBLANK('E20. Opex'!B83),\"\",'E20. Opex'!B83)","v":""}]
[null,"Total",{"$f":"SUM(C71:C95)","v":0},{"$f":"SUM(D71:D95)","v":0},0,0,0,0,0]
[]
[]
[null,"E1.3 - CAPCONS"]
[null,"E1.3.1 - REFERENCE SERVICES"]
[null,null,"EXPENDITURE"]
[null,null,{"$f":"CONCATENATE(\"$, real \",dms_DollarReal)","v":"$, real June 2025"}]
[null,null,{"$f":"dms_y1","v":"2023-24"},{"$f":"dms_y2","v":"2024-25"},{"$f":"dms_y3","v":"2025-26"},{"$f":"dms_y4","v":"2026-27"},{"$f":"dms_y5","v":"2027-28"},{"$f":"dms_y6","v":"2028-29"},{"$f":"dms_y7","v":"2029-30"}]
[null,"Connections (gas)"]
[null,"Mains replacement",0,0,0,0,0,0,0]
[null,"Mains augmentation",0,0,0,0,0,0,0]
[null,"Telemetry",0,0,0,0,0,0,0]
[null,"Meter replacement",0,0,0,0,0,0,0]
[null,"ICT",0,0,0,0,0,0,0]
[null,"Capitalised network overheads"]
[null,"Capitalised corporate overheads",0,0,0,0,0,0,0]
[null,"Other capex",0,0,0,0,0,0,0]
[null,"Total"]
[]
[null,"E1.3.2 - NON-REFERENCE SERVICES"]
[null,null,"EXPENDITURE"]
[null,null,{"$f":"CONCATENATE(\"$, real \",dms_DollarReal)","v":"$, real June 2025"}]
[null,null,{"$f":"dms_y1","v":"2023-24"},{"$f":"dms_y2","v":"2024-25"},{"$f":"dms_y3","v":"2025-26"},{"$f":"dms_y4","v":"2026-27"},{"$f":"dms_y5","v":"2027-28"},{"$f":"dms_y6","v":"2028-29"},{"$f":"dms_y7","v":"2029-30"}]
[]
[]
[]
[]
[]
[]
[]
[]
[]
[]
[]
[]
[]
[]
[]
[]
[]
[]
[]
[]
[]
[]
[]
[]
[null,"Total"]
[]
[]
[null,"E1.4 - CAPITALISED OVERHEADS"]
[null,"E1.4.1 - REFERENCE SERVICES"]
[null,null,"EXPENDITURE"]
[null,null,{"$f":"CONCATENATE(\"$, real \",dms_DollarReal)","v":"$, real June 2025"}]
[null,null,{"$f":"dms_y1","v":"2023-24"},{"$f":"dms_y2","v":"2024-25"},{"$f":"dms_y3","v":"2025-26"},{"$f":"dms_y4","v":"2026-27"},{"$f":"dms_y5","v":"2027-28"},{"$f":"dms_y6","v":"2028-29"},{"$f":"dms_y7","v":"2029-30"}]
[null,"Connections (gas)",2671469.6157127391,2597237.4321532794,2377020.6149927382,3264168.0282176146,2849396.9972549565,1730570.0809789172,1364178.1546552703]
[null,"Mains replacement",148149.11829261226,209926.72808757267,384158.86269095313,622112.91114667931,454923.81171390496,328406.36647274368,252039.10005250925]
[null,"Mains augmentation",59052.385138303936,106407.02833748478,156089.80838983049,119951.1940787218,61502.372507493536,74031.679955359577,81878.437556475459]
[null,"Telemetry",0,0,0,0,0,0,0]
[null,"Meter replacement",695416.84292646812,779316.0329337283,733246.98874025396,953738.63669653353,1018533.8759874332,1295662.0077996794,1207140.4169360837]
[null,"ICT",0,0,0,0,0,0,0]
[null,"Other capex",680028.54307295731,1525235.9645394431,1796067.7379542703,1030788.5778848843,757718.35417006956,454183.88274574658,360674.94889392977]
[null,"Capital contributions included in the above",219644.51219983233,109100.95762481396,118254.9126051377,113441.1389561633,104858.67095078244,90982.821992825062,77212.483553488288]
[null,"Total (less capital contributions)",{"$f":"SUM(C151:C157)-C158","v":4034471.9929432487},5109022.2284266949,5328329.1001629084,5877318.2090682704,5037216.740683076,3791871.1959596211,3188698.5745407804]
[]
[]
[null,"E1.4.2 - NON-REFERENCE SERVICES"]
[null,null,"EXPENDITURE"]
[null,null,{"$f":"CONCATENATE(\"$, real \",dms_DollarReal)","v":"$, real June 2025"}]
[null,null,{"$f":"dms_y1","v":"2023-24"},{"$f":"dms_y2","v":"2024-25"},{"$f":"dms_y3","v":"2025-26"},{"$f":"dms_y4","v":"2026-27"},{"$f":"dms_y5","v":"2027-28"},{"$f":"dms_y6","v":"2028-29"},{"$f":"dms_y7","v":"2029-30"}]
[null,"None","","","","","","",""]
[]
[]
[]
[]
[]
[]
[]
[]
[]
[]
[]
[]
[]
[]
[]
[]
[]
[]
[]
[]
[]
[null,"Capital contributions included in the above"]
[null,"Total (less capital contributions)",{"$f":"SUM(C166:C187)-C188","v":0},0,0,0,0,0,0]

{"sheet":"E2. Mains Repex","index":4,"n_rows":746,"n_cols":10,"rows_kept":746,"cut":false,"hidden":false,"merged":[[719,3,719,9],[720,3,720,9]]}
[null,{"$f":"INDEX(dms_Worksheet_List,MATCH(dms_Model,dms_Model_List))","v":"REGULATORY REPORTING STATEMENT"}]
[null,{"$f":"dms_TradingNameFull","v":"Jemena Gas Networks (NSW) Ltd"}]
[null,{"$f":"dms_Header_Span","v":"2023-24 to 2029-30"}]
[null,"E2. MAINS REPLACEMENT"]
[null,"FINAL RIN TEMPLATE - FEBRUARY 2024"]
[]
[]
[null,"Please list all projects or categories here:"]
[null,"Newcastle MP1 30kPa Rehabilitation Stage 1 "]
[null,"Haberfield Strathfield Campsie 7kPa Rehabilitation "]
[null,"Kurri Kurri Rehabilitation Stage 2 "]
[null,"Newcastle MP1 30kPa Rehabilitation Stage 3 "]
[null,"Newcastle MP1 30kPa Rehabilitation Stage 2 "]
[null,"Strathfield CBD 7kPa Mains Rehabilitation "]
[null,"Pennant Hills Rd 350mm Steel Main Rehabilitation "]
[null,"Bankstown Chullora Greenacre 7kPa Rehabilitation "]
[null,"Matraville 2kPa and 7kPa Rehabilitation"]
[null,"Mittagong Rehabilitation"]
[null,"Bombo Bridge Main Insertion"]
[null,""]
[null,""]
[null,""]
[null,""]
[null,""]
[null,""]
[null,""]
[null,""]
[null,""]
[null,""]
[null,""]
[null,""]
[null,""]
[null,""]
[null,""]
[null,""]
[null,""]
[null,""]
[null,""]
[null,""]
[null,""]
[null,""]
[null,""]
[null,""]
[null,""]
[null,""]
[null,""]
[null,""]
[null,""]
[null,""]
[null,""]
[null,""]
[null,""]
[null,""]
[null,""]
[null,""]
[null,""]
[null,""]
[null,""]
[]
[]
[null,"E2.1 - CAPEX"]
[null,"E2.1.1 - PROACTIVE - BY PROJECT"]
[null,null,null,"EXPENDITURE"]
[null,null,null,{"$f":"CONCATENATE(\"$, real \",dms_DollarReal)","v":"$, real June 2025"}]
[null,null,null,{"$f":"dms_y1","v":"2023-24"},{"$f":"dms_y2","v":"2024-25"},{"$f":"dms_y3","v":"2025-26"},{"$f":"dms_y4","v":"2026-27"},{"$f":"dms_y5","v":"2027-28"},{"$f":"dms_y6","v":"2028-29"},{"$f":"dms_y7","v":"2029-30"}]
[null,"A. DIRECT INTERNAL LABOUR EXPENDITURE"]
[null,{"$f":"IF(ISBLANK(dms_E2_Projects_01),\"\",dms_E2_Projects_01)","v":"Newcastle MP1 30kPa Rehabilitation Stage 1 "},null,24502.918950480991,160911.91090190638,167651.49861496573,0,0,0,0]
[null,{"$f":"IF(ISBLANK(dms_E2_Projects_02),\"\",dms_E2_Projects_02)","v":"Haberfield Strathfield Campsie 7kPa Rehabilitation "},null,0,0,0,1895.4428690103975,108844.28049930972,54793.381152440088,0]
[null,{"$f":"IF(ISBLANK(dms_E2_Projects_03),\"\",dms_E2_Projects_03)","v":"Kurri Kurri Rehabilitation Stage 2 "},null,0,0,0,0,0,8343.6882984876393,87818.181757074271]
[null,{"$f":"IF(ISBLANK(dms_E2_Projects_04),\"\",dms_E2_Projects_04)","v":"Newcastle MP1 30kPa Rehabilitation Stage 3 "},null,0,6322.7162032172328,22298.759030874749,220680.35919062511,200796.78101852062,0,0]
[null,{"$f":"IF(ISBLANK(dms_E2_Projects_05),\"\",dms_E2_Projects_05)","v":"Newcastle MP1 30kPa Rehabilitation Stage 2 "},null,6551.1826498786095,22830.169131218248,219231.08652749707,190650.58361882664,0,0,0]
[null,{"$f":"IF(ISBLANK(dms_E2_Projects_06),\"\",dms_E2_Projects_06)","v":"Strathfield CBD 7kPa Mains Rehabilitation "},null,0,0,0,0,5769.7806373261574,72885.010840567978,55136.699553713464]
[null,{"$f":"IF(ISBLANK(dms_E2_Projects_07),\"\",dms_E2_Projects_07)","v":"Pennant Hills Rd 350mm Steel Main Rehabilitation "},null,0,0,0,0,0,5665.053961038715,68331.575647106205]
[null,{"$f":"IF(ISBLANK(dms_E2_Projects_08),\"\",dms_E2_Projects_08)","v":"Bankstown Chullora Greenacre 7kPa Rehabilitation "},null,0,1333.0323942643563,6624.4345023151272,137370.45874385181,646.98770994185463,0,0]
[null,{"$f":"IF(ISBLANK(dms_E2_Projects_09),\"\",dms_E2_Projects_09)","v":"Matraville 2kPa and 7kPa Rehabilitation"},null,1496.8126584568581,0,0,0,0,0,0]
[null,{"$f":"IF(ISBLANK(dms_E2_Projects_10),\"\",dms_E2_Projects_10)","v":"Mittagong Rehabilitation"},null,321.77544718300777,0,0,0,0,0,0]
[null,{"$f":"IF(ISBLANK(dms_E2_Projects_11),\"\",dms_E2_Projects_11)","v":"Bombo Bridge Main Insertion"},null,380.65302309615817,0,0,0,0,0,0]
[null,{"$f":"IF(ISBLANK(dms_E2_Projects_12),\"\",dms_E2_Projects_12)","v":""},null,"","","","","","",""]
[null,{"$f":"IF(ISBLANK(dms_E2_Projects_13),\"\",dms_E2_Projects_13)","v":""},null,"","","","","","",""]
[null,{"$f":"IF(ISBLANK(dms_E2_Projects_14),\"\",dms_E2_Projects_14)","v":""},null,"","","","","","",""]
[null,{"$f":"IF(ISBLANK(dms_E2_Projects_15),\"\",dms_E2_Projects_15)","v":""},null,"","","","","","",""]
[null,{"$f":"IF(ISBLANK(dms_E2_Projects_16),\"\",dms_E2_Projects_16)","v":""},null,"","","","","","",""]
[null,{"$f":"IF(ISBLANK(dms_E2_Projects_17),\"\",dms_E2_Projects_17)","v":""},null,"","","","","","",""]
[null,{"$f":"IF(ISBLANK(dms_E2_Projects_18),\"\",dms_E2_Projects_18)","v":""},null,"","","","","","",""]
[null,{"$f":"IF(ISBLANK(dms_E2_Projects_19),\"\",dms_E2_Projects_19)","v":""},null,"","","","","","",""]
[null,{"$f":"IF(ISBLANK(dms_E2_Projects_20),\"\",dms_E2_Projects_20)","v":""},null,"","","","","","",""]
[null,{"$f":"IF(ISBLANK(dms_E2_Projects_21),\"\",dms_E2_Projects_21)","v":""},null,"","","","","","",""]
[null,{"$f":"IF(ISBLANK(dms_E2_Projects_22),\"\",dms_E2_Projects_22)","v":""},null,"","","","","","",""]
[null,{"$f":"IF(ISBLANK(dms_E2_Projects_23),\"\",dms_E2_Projects_23)","v":""},null,"","","","","","",""]
[null,{"$f":"IF(ISBLANK(dms_E2_Projects_24),\"\",dms_E2_Projects_24)","v":""},null,"","","","","","",""]
[null,{"$f":"IF(ISBLANK(dms_E2_Projects_25),\"\",dms_E2_Projects_25)","v":""},null,"","","","","","",""]
[null,{"$f":"IF(ISBLANK(dms_E2_Projects_26),\"\",dms_E2_Projects_26)","v":""},null,"","","","","","",""]
[null,{"$f":"IF(ISBLANK(dms_E2_Projects_27),\"\",dms_E2_Projects_27)","v":""},null,"","","","","","",""]
[null,{"$f":"IF(ISBLANK(dms_E2_Projects_28),\"\",dms_E2_Projects_28)","v":""},null,"","","","","","",""]
[null,{"$f":"IF(ISBLANK(dms_E2_Projects_29),\"\",dms_E2_Projects_29)","v":""},null,"","","","","","",""]
[null,{"$f":"IF(ISBLANK(dms_E2_Projects_30),\"\",dms_E2_Projects_30)","v":""},null,"","","","","","",""]
[null,{"$f":"IF(ISBLANK(dms_E2_Projects_31),\"\",dms_E2_Projects_31)","v":""},null,"","","","","","",""]
[null,{"$f":"IF(ISBLANK(dms_E2_Projects_32),\"\",dms_E2_Projects_32)","v":""},null,"","","","","","",""]
[null,{"$f":"IF(ISBLANK(dms_E2_Projects_33),\"\",dms_E2_Projects_33)","v":""},null,"","","","","","",""]
[null,{"$f":"IF(ISBLANK(dms_E2_Projects_34),\"\",dms_E2_Projects_34)","v":""},null,"","","","","","",""]
[null,{"$f":"IF(ISBLANK(dms_E2_Projects_35),\"\",dms_E2_Projects_35)","v":""},null,"","","","","","",""]
[null,{"$f":"IF(ISBLANK(dms_E2_Projects_36),\"\",dms_E2_Projects_36)","v":""},null,"","","","","","",""]
[null,{"$f":"IF(ISBLANK(dms_E2_Projects_37),\"\",dms_E2_Projects_37)","v":""},null,"","","","","","",""]
[null,{"$f":"IF(ISBLANK(dms_E2_Projects_38),\"\",dms_E2_Projects_38)","v":""},null,"","","","","","",""]
[null,{"$f":"IF(ISBLANK(dms_E2_Projects_39),\"\",dms_E2_Projects_39)","v":""},null,"","","","","","",""]
[null,{"$f":"IF(ISBLANK(dms_E2_Projects_40),\"\",dms_E2_Projects_40)","v":""},null,"","","","","","",""]
[null,{"$f":"IF(ISBLANK(dms_E2_Projects_41),\"\",dms_E2_Projects_41)","v":""},null,"","","","","","",""]
[null,{"$f":"IF(ISBLANK(dms_E2_Projects_42),\"\",dms_E2_Projects_42)","v":""},null,"","","","","","",""]
[null,{"$f":"IF(ISBLANK(dms_E2_Projects_43),\"\",dms_E2_Projects_43)","v":""},null,"","","","","","",""]
[null,{"$f":"IF(ISBLANK(dms_E2_Projects_44),\"\",dms_E2_Projects_44)","v":""},null,"","","","","","",""]
[null,{"$f":"IF(ISBLANK(dms_E2_Projects_45),\"\",dms_E2_Projects_45)","v":""},null,"","","","","","",""]
[null,{"$f":"IF(ISBLANK(dms_E2_Projects_46),\"\",dms_E2_Projects_46)","v":""},null,"","","","","","",""]
[null,{"$f":"IF(ISBLANK(dms_E2_Projects_47),\"\",dms_E2_Projects_47)","v":""},null,"","","","","","",""]
[null,{"$f":"IF(ISBLANK(dms_E2_Projects_48),\"\",dms_E2_Projects_48)","v":""},null,"","","","","","",""]
[null,{"$f":"IF(ISBLANK(dms_E2_Projects_49),\"\",dms_E2_Projects_49)","v":""},null,"","","","","","",""]
[null,{"$f":"IF(ISBLANK(dms_E2_Projects_50),\"\",dms_E2_Projects_50)","v":""},null,"","","","","","",""]
[null,"Other projects or categories with expenditure of less than $500,000",null,0,0,0,0,0,0,18697.346005660947]
[null,null,"Total",{"$f":"SUM(D67:D117)","v":33253.342729095624},{"$f":"SUM(E67:E117)","v":191397.82863060621},{"$f":"SUM(F67:F117)","v":415805.77867565269},{"$f":"SUM(G67:G117)","v":550596.84442231397},{"$f":"SUM(H67:H117)","v":316057.82986509841},{"$f":"SUM(I67:I117)","v":141687.13425253442},{"$f":"SUM(J67:J117)","v":229983.80296355492}]
[]
[null,"B. DIRECT CONTRACTOR EXPENDITURE"]
[null,null,null,"EXPENDITURE"]
[null,null,null,{"$f":"CONCATENATE(\"$, real \",dms_DollarReal)","v":"$, real June 2025"}]
[null,null,null,{"$f":"dms_y1","v":"2023-24"},{"$f":"dms_y2","v":"2024-25"},{"$f":"dms_y3","v":"2025-26"},{"$f":"dms_y4","v":"2026-27"},{"$f":"dms_y5","v":"2027-28"},{"$f":"dms_y6","v":"2028-29"},{"$f":"dms_y7","v":"2029-30"}]
[null,{"$f":"IF(ISBLANK(dms_E2_Projects_01),\"\",dms_E2_Projects_01)","v":"Newcastle MP1 30kPa Rehabilitation Stage 1 "}]
[null,{"$f":"IF(ISBLANK(dms_E2_Projects_02),\"\",dms_E2_Projects_02)","v":"Haberfield Strathfield Campsie 7kPa Rehabilitation "}]
[null,{"$f":"IF(ISBLANK(dms_E2_Projects_03),\"\",dms_E2_Projects_03)","v":"Kurri Kurri Rehabilitation Stage 2 "}]
[null,{"$f":"IF(ISBLANK(dms_E2_Projects_04),\"\",dms_E2_Projects_04)","v":"Newcastle MP1 30kPa Rehabilitation Stage 3 "}]
[null,{"$f":"IF(ISBLANK(dms_E2_Projects_05),\"\",dms_E2_Projects_05)","v":"Newcastle MP1 30kPa Rehabilitation Stage 2 "}]
[null,{"$f":"IF(ISBLANK(dms_E2_Projects_06),\"\",dms_E2_Projects_06)","v":"Strathfield CBD 7kPa Mains Rehabilitation "}]
[null,{"$f":"IF(ISBLANK(dms_E2_Projects_07),\"\",dms_E2_Projects_07)","v":"Pennant Hills Rd 350mm Steel Main Rehabilitation "}]
[null,{"$f":"IF(ISBLANK(dms_E2_Projects_08),\"\",dms_E2_Projects_08)","v":"Bankstown Chullora Greenacre 7kPa Rehabilitation "}]
[null,{"$f":"IF(ISBLANK(dms_E2_Projects_09),\"\",dms_E2_Projects_09)","v":"Matraville 2kPa and 7kPa Rehabilitation"}]
[null,{"$f":"IF(ISBLANK(dms_E2_Projects_10),\"\",dms_E2_Projects_10)","v":"Mittagong Rehabilitation"}]
[null,{"$f":"IF(ISBLANK(dms_E2_Projects_11),\"\",dms_E2_Projects_11)","v":"Bombo Bridge Main Insertion"}]
[null,{"$f":"IF(ISBLANK(dms_E2_Projects_12),\"\",dms_E2_Projects_12)","v":""},null,"","","","","","",""]
[null,{"$f":"IF(ISBLANK(dms_E2_Projects_13),\"\",dms_E2_Projects_13)","v":""},null,"","","","","","",""]
[null,{"$f":"IF(ISBLANK(dms_E2_Projects_14),\"\",dms_E2_Projects_14)","v":""},null,"","","","","","",""]
[null,{"$f":"IF(ISBLANK(dms_E2_Projects_15),\"\",dms_E2_Projects_15)","v":""},null,"","","","","","",""]
[null,{"$f":"IF(ISBLANK(dms_E2_Projects_16),\"\",dms_E2_Projects_16)","v":""},null,"","","","","","",""]
[null,{"$f":"IF(ISBLANK(dms_E2_Projects_17),\"\",dms_E2_Projects_17)","v":""},null,"","","","","","",""]
[null,{"$f":"IF(ISBLANK(dms_E2_Projects_18),\"\",dms_E2_Projects_18)","v":""},null,"","","","","","",""]
[null,{"$f":"IF(ISBLANK(dms_E2_Projects_19),\"\",dms_E2_Projects_19)","v":""},null,"","","","","","",""]
[null,{"$f":"IF(ISBLANK(dms_E2_Projects_20),\"\",dms_E2_Projects_20)","v":""},null,"","","","","","",""]
[null,{"$f":"IF(ISBLANK(dms_E2_Projects_21),\"\",dms_E2_Projects_21)","v":""},null,"","","","","","",""]
[null,{"$f":"IF(ISBLANK(dms_E2_Projects_22),\"\",dms_E2_Projects_22)","v":""},null,"","","","","","",""]
[null,{"$f":"IF(ISBLANK(dms_E2_Projects_23),\"\",dms_E2_Projects_23)","v":""},null,"","","","","","",""]
[null,{"$f":"IF(ISBLANK(dms_E2_Projects_24),\"\",dms_E2_Projects_24)","v":""},null,"","","","","","",""]
[null,{"$f":"IF(ISBLANK(dms_E2_Projects_25),\"\",dms_E2_Projects_25)","v":""},null,"","","","","","",""]
[null,{"$f":"IF(ISBLANK(dms_E2_Projects_26),\"\",dms_E2_Projects_26)","v":""},null,"","","","","","",""]
[null,{"$f":"IF(ISBLANK(dms_E2_Projects_27),\"\",dms_E2_Projects_27)","v":""},null,"","","","","","",""]
[null,{"$f":"IF(ISBLANK(dms_E2_Projects_28),\"\",dms_E2_Projects_28)","v":""},null,"","","","","","",""]
[null,{"$f":"IF(ISBLANK(dms_E2_Projects_29),\"\",dms_E2_Projects_29)","v":""},null,"","","","","","",""]
[null,{"$f":"IF(ISBLANK(dms_E2_Projects_30),\"\",dms_E2_Projects_30)","v":""},null,"","","","","","",""]
[null,{"$f":"IF(ISBLANK(dms_E2_Projects_31),\"\",dms_E2_Projects_31)","v":""},null,"","","","","","",""]
[null,{"$f":"IF(ISBLANK(dms_E2_Projects_32),\"\",dms_E2_Projects_32)","v":""},null,"","","","","","",""]
[null,{"$f":"IF(ISBLANK(dms_E2_Projects_33),\"\",dms_E2_Projects_33)","v":""},null,"","","","","","",""]
[null,{"$f":"IF(ISBLANK(dms_E2_Projects_34),\"\",dms_E2_Projects_34)","v":""},null,"","","","","","",""]
[null,{"$f":"IF(ISBLANK(dms_E2_Projects_35),\"\",dms_E2_Projects_35)","v":""},null,"","","","","","",""]
[null,{"$f":"IF(ISBLANK(dms_E2_Projects_36),\"\",dms_E2_Projects_36)","v":""},null,"","","","","","",""]
[null,{"$f":"IF(ISBLANK(dms_E2_Projects_37),\"\",dms_E2_Projects_37)","v":""},null,"","","","","","",""]
[null,{"$f":"IF(ISBLANK(dms_E2_Projects_38),\"\",dms_E2_Projects_38)","v":""},null,"","","","","","",""]
[null,{"$f":"IF(ISBLANK(dms_E2_Projects_39),\"\",dms_E2_Projects_39)","v":""},null,"","","","","","",""]
[null,{"$f":"IF(ISBLANK(dms_E2_Projects_40),\"\",dms_E2_Projects_40)","v":""},null,"","","","","","",""]
[null,{"$f":"IF(ISBLANK(dms_E2_Projects_41),\"\",dms_E2_Projects_41)","v":""},null,"","","","","","",""]
[null,{"$f":"IF(ISBLANK(dms_E2_Projects_42),\"\",dms_E2_Projects_42)","v":""},null,"","","","","","",""]
[null,{"$f":"IF(ISBLANK(dms_E2_Projects_43),\"\",dms_E2_Projects_43)","v":""},null,"","","","","","",""]
[null,{"$f":"IF(ISBLANK(dms_E2_Projects_44),\"\",dms_E2_Projects_44)","v":""},null,"","","","","","",""]
[null,{"$f":"IF(ISBLANK(dms_E2_Projects_45),\"\",dms_E2_Projects_45)","v":""},null,"","","","","","",""]
[null,{"$f":"IF(ISBLANK(dms_E2_Projects_46),\"\",dms_E2_Projects_46)","v":""},null,"","","","","","",""]
[null,{"$f":"IF(ISBLANK(dms_E2_Projects_47),\"\",dms_E2_Projects_47)","v":""},null,"","","","","","",""]
[null,{"$f":"IF(ISBLANK(dms_E2_Projects_48),\"\",dms_E2_Projects_48)","v":""},null,"","","","","","",""]
[null,{"$f":"IF(ISBLANK(dms_E2_Projects_49),\"\",dms_E2_Projects_49)","v":""},null,"","","","","","",""]
[null,{"$f":"IF(ISBLANK(dms_E2_Projects_50),\"\",dms_E2_Projects_50)","v":""},null,"","","","","","",""]
[null,"Other projects or categories with expenditure of less than $500,000"]
[null,null,"Total"]
[]
[null,"C. DIRECT MATERIAL EXPENDITURE"]
[null,null,null,"EXPENDITURE"]
[null,null,null,{"$f":"CONCATENATE(\"$, real \",dms_DollarReal)","v":"$, real June 2025"}]
[null,null,null,{"$f":"dms_y1","v":"2023-24"},{"$f":"dms_y2","v":"2024-25"},{"$f":"dms_y3","v":"2025-26"},{"$f":"dms_y4","v":"2026-27"},{"$f":"dms_y5","v":"2027-28"},{"$f":"dms_y6","v":"2028-29"},{"$f":"dms_y7","v":"2029-30"}]
[null,{"$f":"IF(ISBLANK(dms_E2_Projects_01),\"\",dms_E2_Projects_01)","v":"Newcastle MP1 30kPa Rehabilitation Stage 1 "},null,0,0,0,0,0,0,0]
[null,{"$f":"IF(ISBLANK(dms_E2_Projects_02),\"\",dms_E2_Projects_02)","v":"Haberfield Strathfield Campsie 7kPa Rehabilitation "},null,0,0,0,0,0,0,0]
[null,{"$f":"IF(ISBLANK(dms_E2_Projects_03),\"\",dms_E2_Projects_03)","v":"Kurri Kurri Rehabilitation Stage 2 "},null,0,0,0,0,0,0,0]
[null,{"$f":"IF(ISBLANK(dms_E2_Projects_04),\"\",dms_E2_Projects_04)","v":"Newcastle MP1 30kPa Rehabilitation Stage 3 "},null,0,0,0,0,0,0,0]
[null,{"$f":"IF(ISBLANK(dms_E2_Projects_05),\"\",dms_E2_Projects_05)","v":"Newcastle MP1 30kPa Rehabilitation Stage 2 "},null,0,0,0,0,0,0,0]
[null,{"$f":"IF(ISBLANK(dms_E2_Projects_06),\"\",dms_E2_Projects_06)","v":"Strathfield CBD 7kPa Mains Rehabilitation "},null,0,0,0,0,0,0,0]
[null,{"$f":"IF(ISBLANK(dms_E2_Projects_07),\"\",dms_E2_Projects_07)","v":"Pennant Hills Rd 350mm Steel Main Rehabilitation "},null,0,0,0,0,0,7486.9067234509412,103996.27919151935]
[null,{"$f":"IF(ISBLANK(dms_E2_Projects_08),\"\",dms_E2_Projects_08)","v":"Bankstown Chullora Greenacre 7kPa Rehabilitation "},null,0,0,0,0,0,0,0]
[null,{"$f":"IF(ISBLANK(dms_E2_Projects_09),\"\",dms_E2_Projects_09)","v":"Matraville 2kPa and 7kPa Rehabilitation"},null,0,0,0,0,0,0,0]
[null,{"$f":"IF(ISBLANK(dms_E2_Projects_10),\"\",dms_E2_Projects_10)","v":"Mittagong Rehabilitation"},null,0,0,0,0,0,0,0]
[null,{"$f":"IF(ISBLANK(dms_E2_Projects_11),\"\",dms_E2_Projects_11)","v":"Bombo Bridge Main Insertion"},null,0,0,0,0,0,0,0]
[null,{"$f":"IF(ISBLANK(dms_E2_Projects_12),\"\",dms_E2_Projects_12)","v":""},null,"","","","","","",""]
[null,{"$f":"IF(ISBLANK(dms_E2_Projects_13),\"\",dms_E2_Projects_13)","v":""},null,"","","","","","",""]
[null,{"$f":"IF(ISBLANK(dms_E2_Projects_14),\"\",dms_E2_Projects_14)","v":""},null,"","","","","","",""]
[null,{"$f":"IF(ISBLANK(dms_E2_Projects_15),\"\",dms_E2_Projects_15)","v":""},null,"","","","","","",""]
[null,{"$f":"IF(ISBLANK(dms_E2_Projects_16),\"\",dms_E2_Projects_16)","v":""},null,"","","","","","",""]
[null,{"$f":"IF(ISBLANK(dms_E2_Projects_17),\"\",dms_E2_Projects_17)","v":""},null,"","","","","","",""]
[null,{"$f":"IF(ISBLANK(dms_E2_Projects_18),\"\",dms_E2_Projects_18)","v":""},null,"","","","","","",""]
[null,{"$f":"IF(ISBLANK(dms_E2_Projects_19),\"\",dms_E2_Projects_19)","v":""},null,"","","","","","",""]
[null,{"$f":"IF(ISBLANK(dms_E2_Projects_20),\"\",dms_E2_Projects_20)","v":""},null,"","","","","","",""]
[null,{"$f":"IF(ISBLANK(dms_E2_Projects_21),\"\",dms_E2_Projects_21)","v":""},null,"","","","","","",""]
[null,{"$f":"IF(ISBLANK(dms_E2_Projects_22),\"\",dms_E2_Projects_22)","v":""},null,"","","","","","",""]
[null,{"$f":"IF(ISBLANK(dms_E2_Projects_23),\"\",dms_E2_Projects_23)","v":""},null,"","","","","","",""]
[null,{"$f":"IF(ISBLANK(dms_E2_Projects_24),\"\",dms_E2_Projects_24)","v":""},null,"","","","","","",""]
[null,{"$f":"IF(ISBLANK(dms_E2_Projects_25),\"\",dms_E2_Projects_25)","v":""},null,"","","","","","",""]
[null,{"$f":"IF(ISBLANK(dms_E2_Projects_26),\"\",dms_E2_Projects_26)","v":""},null,"","","","","","",""]
[null,{"$f":"IF(ISBLANK(dms_E2_Projects_27),\"\",dms_E2_Projects_27)","v":""},null,"","","","","","",""]
[null,{"$f":"IF(ISBLANK(dms_E2_Projects_28),\"\",dms_E2_Projects_28)","v":""},null,"","","","","","",""]
[null,{"$f":"IF(ISBLANK(dms_E2_Projects_29),\"\",dms_E2_Projects_29)","v":""},null,"","","","","","",""]
[null,{"$f":"IF(ISBLANK(dms_E2_Projects_30),\"\",dms_E2_Projects_30)","v":""},null,"","","","","","",""]
[null,{"$f":"IF(ISBLANK(dms_E2_Projects_31),\"\",dms_E2_Projects_31)","v":""},null,"","","","","","",""]
[null,{"$f":"IF(ISBLANK(dms_E2_Projects_32),\"\",dms_E2_Projects_32)","v":""},null,"","","","","","",""]
[null,{"$f":"IF(ISBLANK(dms_E2_Projects_33),\"\",dms_E2_Projects_33)","v":""},null,"","","","","","",""]
[null,{"$f":"IF(ISBLANK(dms_E2_Projects_34),\"\",dms_E2_Projects_34)","v":""},null,"","","","","","",""]
[null,{"$f":"IF(ISBLANK(dms_E2_Projects_35),\"\",dms_E2_Projects_35)","v":""},null,"","","","","","",""]
[null,{"$f":"IF(ISBLANK(dms_E2_Projects_36),\"\",dms_E2_Projects_36)","v":""},null,"","","","","","",""]
[null,{"$f":"IF(ISBLANK(dms_E2_Projects_37),\"\",dms_E2_Projects_37)","v":""},null,"","","","","","",""]
[null,{"$f":"IF(ISBLANK(dms_E2_Projects_38),\"\",dms_E2_Projects_38)","v":""},null,"","","","","","",""]
[null,{"$f":"IF(ISBLANK(dms_E2_Projects_39),\"\",dms_E2_Projects_39)","v":""},null,"","","","","","",""]
[null,{"$f":"IF(ISBLANK(dms_E2_Projects_40),\"\",dms_E2_Projects_40)","v":""},null,"","","","","","",""]
[null,{"$f":"IF(ISBLANK(dms_E2_Projects_41),\"\",dms_E2_Projects_41)","v":""},null,"","","","","","",""]
[null,{"$f":"IF(ISBLANK(dms_E2_Projects_42),\"\",dms_E2_Projects_42)","v":""},null,"","","","","","",""]
[null,{"$f":"IF(ISBLANK(dms_E2_Projects_43),\"\",dms_E2_Projects_43)","v":""},null,"","","","","","",""]
[null,{"$f":"IF(ISBLANK(dms_E2_Projects_44),\"\",dms_E2_Projects_44)","v":""},null,"","","","","","",""]
[null,{"$f":"IF(ISBLANK(dms_E2_Projects_45),\"\",dms_E2_Projects_45)","v":""},null,"","","","","","",""]
[null,{"$f":"IF(ISBLANK(dms_E2_Projects_46),\"\",dms_E2_Projects_46)","v":""},null,"","","","","","",""]
[null,{"$f":"IF(ISBLANK(dms_E2_Projects_47),\"\",dms_E2_Projects_47)","v":""},null,"","","","","","",""]
[null,{"$f":"IF(ISBLANK(dms_E2_Projects_48),\"\",dms_E2_Projects_48)","v":""},null,"","","","","","",""]
[null,{"$f":"IF(ISBLANK(dms_E2_Projects_49),\"\",dms_E2_Projects_49)","v":""},null,"","","","","","",""]
[null,{"$f":"IF(ISBLANK(dms_E2_Projects_50),\"\",dms_E2_Projects_50)","v":""},null,"","","","","","",""]
[null,"Other projects or categories with expenditure of less than $500,000",null,0,0,0,0,0,0,0]
[null,null,"Total",{"$f":"SUM(D181:D231)","v":0},{"$f":"SUM(E181:E231)","v":0},0,0,0,7486.9067234509412,103996.27919151935]
[]
[null,"D. OTHER DIRECT EXPENDITURE"]
[null,null,null,"EXPENDITURE"]
[null,null,null,{"$f":"CONCATENATE(\"$, real \",dms_DollarReal)","v":"$, real June 2025"}]
[null,null,null,{"$f":"dms_y1","v":"2023-24"},{"$f":"dms_y2","v":"2024-25"},{"$f":"dms_y3","v":"2025-26"},{"$f":"dms_y4","v":"2026-27"},{"$f":"dms_y5","v":"2027-28"},{"$f":"dms_y6","v":"2028-29"},{"$f":"dms_y7","v":"2029-30"}]
[null,{"$f":"IF(ISBLANK(dms_E2_Projects_01),\"\",dms_E2_Projects_01)","v":"Newcastle MP1 30kPa Rehabilitation Stage 1 "},null,10188.388589608168,95034.448494770098,2122783.379957973,0,0,0,0]
[null,{"$f":"IF(ISBLANK(dms_E2_Projects_02),\"\",dms_E2_Projects_02)","v":"Haberfield Strathfield Campsie 7kPa Rehabilitation "},null,0,0,0,6259.1402694166491,397516.64481532283,411523.19463022845,0]
[null,{"$f":"IF(ISBLANK(dms_E2_Projects_03),\"\",dms_E2_Projects_03)","v":"Kurri Kurri Rehabilitation Stage 2 "},null,0,0,0,0,0,0,0]
[null,{"$f":"IF(ISBLANK(dms_E2_Projects_04),\"\",dms_E2_Projects_04)","v":"Newcastle MP1 30kPa Rehabilitation Stage 3 "},null,0,10113.903138668802,87041.583741120397,376282.12293844041,1011728.7521375143,0,0]
[null,{"$f":"IF(ISBLANK(dms_E2_Projects_05),\"\",dms_E2_Projects_05)","v":"Newcastle MP1 30kPa Rehabilitation Stage 2 "},null,0,112435.91344047326,39751.090193447249,1375413.7380701895,0,0,0]
[null,{"$f":"IF(ISBLANK(dms_E2_Projects_06),\"\",dms_E2_Projects_06)","v":"Strathfield CBD 7kPa Mains Rehabilitation "},null,0,0,0,0,0,13602.879414975054,470093.1518052647]
[null,{"$f":"IF(ISBLANK(dms_E2_Projects_07),\"\",dms_E2_Projects_07)","v":"Pennant Hills Rd 350mm Steel Main Rehabilitation "},null,0,0,0,0,0,61433.461771906448,635245.01730502525]
[null,{"$f":"IF(ISBLANK(dms_E2_Projects_08),\"\",dms_E2_Projects_08)","v":"Bankstown Chullora Greenacre 7kPa Rehabilitation "},null,0,7882.1631687306544,30314.234256900072,541423.47178827086,0,0,0]
[null,{"$f":"IF(ISBLANK(dms_E2_Projects_09),\"\",dms_E2_Projects_09)","v":"Matraville 2kPa and 7kPa Rehabilitation"},null,2096.472061826154,0,0,0,0,0,0]
[null,{"$f":"IF(ISBLANK(dms_E2_Projects_10),\"\",dms_E2_Projects_10)","v":"Mittagong Rehabilitation"},null,450.68648463747371,0,0,0,0,0,0]
[null,{"$f":"IF(ISBLANK(dms_E2_Projects_11),\"\",dms_E2_Projects_11)","v":"Bombo Bridge Main Insertion"},null,533.15184346014962,0,0,0,0,0,0]
[null,{"$f":"IF(ISBLANK(dms_E2_Projects_12),\"\",dms_E2_Projects_12)","v":""},null,"","","","","","",""]
[null,{"$f":"IF(ISBLANK(dms_E2_Projects_13),\"\",dms_E2_Projects_13)","v":""},null,"","","","","","",""]
[null,{"$f":"IF(ISBLANK(dms_E2_Projects_14),\"\",dms_E2_Projects_14)","v":""},null,"","","","","","",""]
[null,{"$f":"IF(ISBLANK(dms_E2_Projects_15),\"\",dms_E2_Projects_15)","v":""},null,"","","","","","",""]
[null,{"$f":"IF(ISBLANK(dms_E2_Projects_16),\"\",dms_E2_Projects_16)","v":""},null,"","","","","","",""]
[null,{"$f":"IF(ISBLANK(dms_E2_Projects_17),\"\",dms_E2_Projects_17)","v":""},null,"","","","","","",""]
[null,{"$f":"IF(ISBLANK(dms_E2_Projects_18),\"\",dms_E2_Projects_18)","v":""},null,"","","","","","",""]
[null,{"$f":"IF(ISBLANK(dms_E2_Projects_19),\"\",dms_E2_Projects_19)","v":""},null,"","","","","","",""]
[null,{"$f":"IF(ISBLANK(dms_E2_Projects_20),\"\",dms_E2_Projects_20)","v":""},null,"","","","","","",""]
[null,{"$f":"IF(ISBLANK(dms_E2_Projects_21),\"\",dms_E2_Projects_21)","v":""},null,"","","","","","",""]
[null,{"$f":"IF(ISBLANK(dms_E2_Projects_22),\"\",dms_E2_Projects_22)","v":""},null,"","","","","","",""]
[null,{"$f":"IF(ISBLANK(dms_E2_Projects_23),\"\",dms_E2_Projects_23)","v":""},null,"","","","","","",""]
[null,{"$f":"IF(ISBLANK(dms_E2_Projects_24),\"\",dms_E2_Projects_24)","v":""},null,"","","","","","",""]
[null,{"$f":"IF(ISBLANK(dms_E2_Projects_25),\"\",dms_E2_Projects_25)","v":""},null,"","","","","","",""]
[null,{"$f":"IF(ISBLANK(dms_E2_Projects_26),\"\",dms_E2_Projects_26)","v":""},null,"","","","","","",""]
[null,{"$f":"IF(ISBLANK(dms_E2_Projects_27),\"\",dms_E2_Projects_27)","v":""},null,"","","","","","",""]
[null,{"$f":"IF(ISBLANK(dms_E2_Projects_28),\"\",dms_E2_Projects_28)","v":""},null,"","","","","","",""]
[null,{"$f":"IF(ISBLANK(dms_E2_Projects_29),\"\",dms_E2_Projects_29)","v":""},null,"","","","","","",""]
[null,{"$f":"IF(ISBLANK(dms_E2_Projects_30),\"\",dms_E2_Projects_30)","v":""},null,"","","","","","",""]
[null,{"$f":"IF(ISBLANK(dms_E2_Projects_31),\"\",dms_E2_Projects_31)","v":""},null,"","","","","","",""]
[null,{"$f":"IF(ISBLANK(dms_E2_Projects_32),\"\",dms_E2_Projects_32)","v":""},null,"","","","","","",""]
[null,{"$f":"IF(ISBLANK(dms_E2_Projects_33),\"\",dms_E2_Projects_33)","v":""},null,"","","","","","",""]
[null,{"$f":"IF(ISBLANK(dms_E2_Projects_34),\"\",dms_E2_Projects_34)","v":""},null,"","","","","","",""]
[null,{"$f":"IF(ISBLANK(dms_E2_Projects_35),\"\",dms_E2_Projects_35)","v":""},null,"","","","","","",""]
[null,{"$f":"IF(ISBLANK(dms_E2_Projects_36),\"\",dms_E2_Projects_36)","v":""},null,"","","","","","",""]
[null,{"$f":"IF(ISBLANK(dms_E2_Projects_37),\"\",dms_E2_Projects_37)","v":""},null,"","","","","","",""]
[null,{"$f":"IF(ISBLANK(dms_E2_Projects_38),\"\",dms_E2_Projects_38)","v":""},null,"","","","","","",""]
[null,{"$f":"IF(ISBLANK(dms_E2_Projects_39),\"\",dms_E2_Projects_39)","v":""},null,"","","","","","",""]
[null,{"$f":"IF(ISBLANK(dms_E2_Projects_40),\"\",dms_E2_Projects_40)","v":""},null,"","","","","","",""]
[null,{"$f":"IF(ISBLANK(dms_E2_Projects_41),\"\",dms_E2_Projects_41)","v":""},null,"","","","","","",""]
[null,{"$f":"IF(ISBLANK(dms_E2_Projects_42),\"\",dms_E2_Projects_42)","v":""},null,"","","","","","",""]
[null,{"$f":"IF(ISBLANK(dms_E2_Projects_43),\"\",dms_E2_Projects_43)","v":""},null,"","","","","","",""]
[null,{"$f":"IF(ISBLANK(dms_E2_Projects_44),\"\",dms_E2_Projects_44)","v":""},null,"","","","","","",""]
[null,{"$f":"IF(ISBLANK(dms_E2_Projects_45),\"\",dms_E2_Projects_45)","v":""},null,"","","","","","",""]
[null,{"$f":"IF(ISBLANK(dms_E2_Projects_46),\"\",dms_E2_Projects_46)","v":""},null,"","","","","","",""]
[null,{"$f":"IF(ISBLANK(dms_E2_Projects_47),\"\",dms_E2_Projects_47)","v":""},null,"","","","","","",""]
[null,{"$f":"IF(ISBLANK(dms_E2_Projects_48),\"\",dms_E2_Projects_48)","v":""},null,"","","","","","",""]
[null,{"$f":"IF(ISBLANK(dms_E2_Projects_49),\"\",dms_E2_Projects_49)","v":""},null,"","","","","","",""]
[null,{"$f":"IF(ISBLANK(dms_E2_Projects_50),\"\",dms_E2_Projects_50)","v":""},null,"","","","","","",""]
[null,"Other projects or categories with expenditure of less than $500,000",null,0,0,0,0,0,0,23364.489006766118]
[null,null,"Total",{"$f":"SUM(D238:D288)","v":13268.698979531946},{"$f":"SUM(E238:E288)","v":225466.42824264281},2279890.2881494407,2299378.4730663174,1409245.3969528372,486559.53581710998,1128702.6581170561]
[]
[null,"E. RELATED PARTY MARGIN EXPENDITURE"]
[null,null,null,"EXPENDITURE"]
[null,null,null,{"$f":"CONCATENATE(\"$, real \",dms_DollarReal)","v":"$, real June 2025"}]
[null,null,null,{"$f":"dms_y1","v":"2023-24"},{"$f":"dms_y2","v":"2024-25"},{"$f":"dms_y3","v":"2025-26"},{"$f":"dms_y4","v":"2026-27"},{"$f":"dms_y5","v":"2027-28"},{"$f":"dms_y6","v":"2028-29"},{"$f":"dms_y7","v":"2029-30"}]
[null,"Total"]
[null,null,"Total"]
[]
[null,"F. CAPITAL CONTRIBUTIONS included in the above"]
[null,null,null,"EXPENDITURE"]
[null,null,null,{"$f":"CONCATENATE(\"$, real \",dms_DollarReal)","v":"$, real June 2025"}]
[null,null,null,{"$f":"dms_y1","v":"2023-24"},{"$f":"dms_y2","v":"2024-25"},{"$f":"dms_y3","v":"2025-26"},{"$f":"dms_y4","v":"2026-27"},{"$f":"dms_y5","v":"2027-28"},{"$f":"dms_y6","v":"2028-29"},{"$f":"dms_y7","v":"2029-30"}]
[null,{"$f":"IF(ISBLANK(dms_E2_Projects_01),\"\",dms_E2_Projects_01)","v":"Newcastle MP1 30kPa Rehabilitation Stage 1 "},null,0,0,0,0,0,0,0]
[null,{"$f":"IF(ISBLANK(dms_E2_Projects_02),\"\",dms_E2_Projects_02)","v":"Haberfield Strathfield Campsie 7kPa Rehabilitation "},null,0,0,0,0,0,0,0]
[null,{"$f":"IF(ISBLANK(dms_E2_Projects_03),\"\",dms_E2_Projects_03)","v":"Kurri Kurri Rehabilitation Stage 2 "},null,0,0,0,0,0,0,0]
[null,{"$f":"IF(ISBLANK(dms_E2_Projects_04),\"\",dms_E2_Projects_04)","v":"Newcastle MP1 30kPa Rehabilitation Stage 3 "},null,0,0,0,0,0,0,0]
[null,{"$f":"IF(ISBLANK(dms_E2_Projects_05),\"\",dms_E2_Projects_05)","v":"Newcastle MP1 30kPa Rehabilitation Stage 2 "},null,0,0,0,0,0,0,0]
[null,{"$f":"IF(ISBLANK(dms_E2_Projects_06),\"\",dms_E2_Projects_06)","v":"Strathfield CBD 7kPa Mains Rehabilitation "},null,0,0,0,0,0,0,0]
[null,{"$f":"IF(ISBLANK(dms_E2_Projects_07),\"\",dms_E2_Projects_07)","v":"Pennant Hills Rd 350mm Steel Main Rehabilitation "},null,0,0,0,0,0,0,0]
[null,{"$f":"IF(ISBLANK(dms_E2_Projects_08),\"\",dms_E2_Projects_08)","v":"Bankstown Chullora Greenacre 7kPa Rehabilitation "},null,0,0,0,0,0,0,0]
[null,{"$f":"IF(ISBLANK(dms_E2_Projects_09),\"\",dms_E2_Projects_09)","v":"Matraville 2kPa and 7kPa Rehabilitation"},null,0,0,0,0,0,0,0]
[null,{"$f":"IF(ISBLANK(dms_E2_Projects_10),\"\",dms_E2_Projects_10)","v":"Mittagong Rehabilitation"},null,0,0,0,0,0,0,0]
[null,{"$f":"IF(ISBLANK(dms_E2_Projects_11),\"\",dms_E2_Projects_11)","v":"Bombo Bridge Main Insertion"},null,0,0,0,0,0,0,0]
[null,{"$f":"IF(ISBLANK(dms_E2_Projects_12),\"\",dms_E2_Projects_12)","v":""},null,"","","","","","",""]
[null,{"$f":"IF(ISBLANK(dms_E2_Projects_13),\"\",dms_E2_Projects_13)","v":""},null,"","","","","","",""]
[null,{"$f":"IF(ISBLANK(dms_E2_Projects_14),\"\",dms_E2_Projects_14)","v":""},null,"","","","","","",""]
[null,{"$f":"IF(ISBLANK(dms_E2_Projects_15),\"\",dms_E2_Projects_15)","v":""},null,"","","","","","",""]
[null,{"$f":"IF(ISBLANK(dms_E2_Projects_16),\"\",dms_E2_Projects_16)","v":""},null,"","","","","","",""]
[null,{"$f":"IF(ISBLANK(dms_E2_Projects_17),\"\",dms_E2_Projects_17)","v":""},null,"","","","","","",""]
[null,{"$f":"IF(ISBLANK(dms_E2_Projects_18),\"\",dms_E2_Projects_18)","v":""},null,"","","","","","",""]
[null,{"$f":"IF(ISBLANK(dms_E2_Projects_19),\"\",dms_E2_Projects_19)","v":""},null,"","","","","","",""]
[null,{"$f":"IF(ISBLANK(dms_E2_Projects_20),\"\",dms_E2_Projects_20)","v":""},null,"","","","","","",""]
[null,{"$f":"IF(ISBLANK(dms_E2_Projects_21),\"\",dms_E2_Projects_21)","v":""},null,"","","","","","",""]
[null,{"$f":"IF(ISBLANK(dms_E2_Projects_22),\"\",dms_E2_Projects_22)","v":""},null,"","","","","","",""]
[null,{"$f":"IF(ISBLANK(dms_E2_Projects_23),\"\",dms_E2_Projects_23)","v":""},null,"","","","","","",""]
[null,{"$f":"IF(ISBLANK(dms_E2_Projects_24),\"\",dms_E2_Projects_24)","v":""},null,"","","","","","",""]
[null,{"$f":"IF(ISBLANK(dms_E2_Projects_25),\"\",dms_E2_Projects_25)","v":""},null,"","","","","","",""]
[null,{"$f":"IF(ISBLANK(dms_E2_Projects_26),\"\",dms_E2_Projects_26)","v":""},null,"","","","","","",""]
[null,{"$f":"IF(ISBLANK(dms_E2_Projects_27),\"\",dms_E2_Projects_27)","v":""},null,"","","","","","",""]
[null,{"$f":"IF(ISBLANK(dms_E2_Projects_28),\"\",dms_E2_Projects_28)","v":""},null,"","","","","","",""]
[null,{"$f":"IF(ISBLANK(dms_E2_Projects_29),\"\",dms_E2_Projects_29)","v":""},null,"","","","","","",""]
[null,{"$f":"IF(ISBLANK(dms_E2_Projects_30),\"\",dms_E2_Projects_30)","v":""},null,"","","","","","",""]
[null,{"$f":"IF(ISBLANK(dms_E2_Projects_31),\"\",dms_E2_Projects_31)","v":""},null,"","","","","","",""]
[null,{"$f":"IF(ISBLANK(dms_E2_Projects_32),\"\",dms_E2_Projects_32)","v":""},null,"","","","","","",""]
[null,{"$f":"IF(ISBLANK(dms_E2_Projects_33),\"\",dms_E2_Projects_33)","v":""},null,"","","","","","",""]
[null,{"$f":"IF(ISBLANK(dms_E2_Projects_34),\"\",dms_E2_Projects_34)","v":""},null,"","","","","","",""]
[null,{"$f":"IF(ISBLANK(dms_E2_Projects_35),\"\",dms_E2_Projects_35)","v":""},null,"","","","","","",""]
[null,{"$f":"IF(ISBLANK(dms_E2_Projects_36),\"\",dms_E2_Projects_36)","v":""},null,"","","","","","",""]
[null,{"$f":"IF(ISBLANK(dms_E2_Projects_37),\"\",dms_E2_Projects_37)","v":""},null,"","","","","","",""]
[null,{"$f":"IF(ISBLANK(dms_E2_Projects_38),\"\",dms_E2_Projects_38)","v":""},null,"","","","","","",""]
[null,{"$f":"IF(ISBLANK(dms_E2_Projects_39),\"\",dms_E2_Projects_39)","v":""},null,"","","","","","",""]
[null,{"$f":"IF(ISBLANK(dms_E2_Projects_40),\"\",dms_E2_Projects_40)","v":""},null,"","","","","","",""]
[null,{"$f":"IF(ISBLANK(dms_E2_Projects_41),\"\",dms_E2_Projects_41)","v":""},null,"","","","","","",""]
[null,{"$f":"IF(ISBLANK(dms_E2_Projects_42),\"\",dms_E2_Projects_42)","v":""},null,"","","","","","",""]
[null,{"$f":"IF(ISBLANK(dms_E2_Projects_43),\"\",dms_E2_Projects_43)","v":""},null,"","","","","","",""]
[null,{"$f":"IF(ISBLANK(dms_E2_Projects_44),\"\",dms_E2_Projects_44)","v":""},null,"","","","","","",""]
[null,{"$f":"IF(ISBLANK(dms_E2_Projects_45),\"\",dms_E2_Projects_45)","v":""},null,"","","","","","",""]
[null,{"$f":"IF(ISBLANK(dms_E2_Projects_46),\"\",dms_E2_Projects_46)","v":""},null,"","","","","","",""]
[null,{"$f":"IF(ISBLANK(dms_E2_Projects_47),\"\",dms_E2_Projects_47)","v":""},null,"","","","","","",""]
[null,{"$f":"IF(ISBLANK(dms_E2_Projects_48),\"\",dms_E2_Projects_48)","v":""},null,"","","","","","",""]
[null,{"$f":"IF(ISBLANK(dms_E2_Projects_49),\"\",dms_E2_Projects_49)","v":""},null,"","","","","","",""]
[null,{"$f":"IF(ISBLANK(dms_E2_Projects_50),\"\",dms_E2_Projects_50)","v":""},null,"","","","","","",""]
[null,"Other projects or categories with expenditure of less than $500,000",null,0,0,0,0,0,0,0]
[null,null,"Total",{"$f":"SUM(D302:D352)","v":0},{"$f":"SUM(E302:E352)","v":0},0,0,0,0,0]
[]
[]
[]
[null,"E2.1.2 - REACTIVE - BY CONNECTION TYPE"]
[null,null,null,"EXPENDITURE"]
[null,null,null,{"$f":"CONCATENATE(\"$, real \",dms_DollarReal)","v":"$, real June 2025"}]
[null,null,null,{"$f":"dms_y1","v":"2023-24"},{"$f":"dms_y2","v":"2024-25"},{"$f":"dms_y3","v":"2025-26"},{"$f":"dms_y4","v":"2026-27"},{"$f":"dms_y5","v":"2027-28"},{"$f":"dms_y6","v":"2028-29"},{"$f":"dms_y7","v":"2029-30"}]
[null,"A. DIRECT INTERNAL LABOUR EXPENDITURE"]
[null,"Mains",null,0,0,0,0,0,0,0]
[null,"Services",null,0,0,0,0,0,0,0]
[null,null,"Total",{"$f":"SUM(D362:D363)","v":0},{"$f":"SUM(E362:E363)","v":0},{"$f":"SUM(F362:F363)","v":0},{"$f":"SUM(G362:G363)","v":0},{"$f":"SUM(H362:H363)","v":0},{"$f":"SUM(I362:I363)","v":0},{"$f":"SUM(J362:J363)","v":0}]
[null,"B. DIRECT CONTRACTOR EXPENDITURE"]
[null,"Mains"]
[null,"Services"]
[null,null,"Total"]
[null,"C. DIRECT MATERIAL EXPENDITURE"]
[null,"Mains",null,0,0,0,0,0,0,0]
[null,"Services",null,0,0,0,0,0,0,0]
[null,null,"Total",{"$f":"SUM(D370:D371)","v":0},{"$f":"SUM(E370:E371)","v":0},{"$f":"SUM(F370:F371)","v":0},{"$f":"SUM(G370:G371)","v":0},{"$f":"SUM(H370:H371)","v":0},{"$f":"SUM(I370:I371)","v":0},{"$f":"SUM(J370:J371)","v":0}]
[null,"D. OTHER DIRECT EXPENDITURE"]
[null,"Mains",null,0,0,0,0,0,0,0]
[null,"Services",null,0,0,0,0,0,0,0]
[null,null,"Total",{"$f":"SUM(D374:D375)","v":0},{"$f":"SUM(E374:E375)","v":0},{"$f":"SUM(F374:F375)","v":0},{"$f":"SUM(G374:G375)","v":0},{"$f":"SUM(H374:H375)","v":0},{"$f":"SUM(I374:I375)","v":0},{"$f":"SUM(J374:J375)","v":0}]
[null,"E. RELATED PARTY MARGIN EXPENDITURE"]
[null,"Mains"]
[null,"Services"]
[null,null,"Total"]
[null,"F. CAPITAL CONTRIBUTIONS included in the above"]
[null,"Mains",null,0,0,0,0,0,0,0]
[null,"Services",null,0,0,0,0,0,0,0]
[null,null,"Total",{"$f":"SUM(D382:D383)","v":0},{"$f":"SUM(E382:E383)","v":0},{"$f":"SUM(F382:F383)","v":0},{"$f":"SUM(G382:G383)","v":0},{"$f":"SUM(H382:H383)","v":0},{"$f":"SUM(I382:I383)","v":0},{"$f":"SUM(J382:J383)","v":0}]
[null,null,"TOTAL",{"$f":"SUM(D384,D380,D376,D372,D368,D364)","v":0},{"$f":"SUM(E384,E380,E376,E372,E368,E364)","v":0},0,0,0,0,0]
[]
[]
[]
[null,"E2.2 - VOLUMES"]
[null,"E2.2.1 - PROACTIVE - BY CONNECTION TYPE - BY PROJECT"]
[null,null,null,"LENGTH"]
[null,null,null,"0s, metres"]
[null,null,null,{"$f":"dms_y1","v":"2023-24"},{"$f":"dms_y2","v":"2024-25"},{"$f":"dms_y3","v":"2025-26"},{"$f":"dms_y4","v":"2026-27"},{"$f":"dms_y5","v":"2027-28"},{"$f":"dms_y6","v":"2028-29"},{"$f":"dms_y7","v":"2029-30"}]
[null,"A. LOW PRESSURE TO HIGH PRESSURE"]
[null,{"$f":"IF(ISBLANK(dms_E2_Projects_01),\"\",dms_E2_Projects_01)","v":"Newcastle MP1 30kPa Rehabilitation Stage 1 "},null,0,0,0,0,0,0,0]
[null,{"$f":"IF(ISBLANK(dms_E2_Projects_02),\"\",dms_E2_Projects_02)","v":"Haberfield Strathfield Campsie 7kPa Rehabilitation "},null,0,0,0,0,0,0,0]
[null,{"$f":"IF(ISBLANK(dms_E2_Projects_03),\"\",dms_E2_Projects_03)","v":"Kurri Kurri Rehabilitation Stage 2 "},null,0,0,0,0,0,0,0]
[null,{"$f":"IF(ISBLANK(dms_E2_Projects_04),\"\",dms_E2_Projects_04)","v":"Newcastle MP1 30kPa Rehabilitation Stage 3 "},null,0,0,0,0,0,0,0]
[null,{"$f":"IF(ISBLANK(dms_E2_Projects_05),\"\",dms_E2_Projects_05)","v":"Newcastle MP1 30kPa Rehabilitation Stage 2 "},null,0,0,0,0,0,0,0]
[null,{"$f":"IF(ISBLANK(dms_E2_Projects_06),\"\",dms_E2_Projects_06)","v":"Strathfield CBD 7kPa Mains Rehabilitation "},null,0,0,0,0,0,0,0]
[null,{"$f":"IF(ISBLANK(dms_E2_Projects_07),\"\",dms_E2_Projects_07)","v":"Pennant Hills Rd 350mm Steel Main Rehabilitation "},null,0,0,0,0,0,0,0]
[null,{"$f":"IF(ISBLANK(dms_E2_Projects_08),\"\",dms_E2_Projects_08)","v":"Bankstown Chullora Greenacre 7kPa Rehabilitation "},null,0,0,0,0,0,0,0]
[null,{"$f":"IF(ISBLANK(dms_E2_Projects_09),\"\",dms_E2_Projects_09)","v":"Matraville 2kPa and 7kPa Rehabilitation"},null,0,0,0,0,0,0,0]
[null,{"$f":"IF(ISBLANK(dms_E2_Projects_10),\"\",dms_E2_Projects_10)","v":"Mittagong Rehabilitation"},null,0,0,0,0,0,0,0]
[null,{"$f":"IF(ISBLANK(dms_E2_Projects_11),\"\",dms_E2_Projects_11)","v":"Bombo Bridge Main Insertion"},null,0,0,0,0,0,0,0]
[null,{"$f":"IF(ISBLANK(dms_E2_Projects_12),\"\",dms_E2_Projects_12)","v":""},null,"","","","","","",""]
[null,{"$f":"IF(ISBLANK(dms_E2_Projects_13),\"\",dms_E2_Projects_13)","v":""},null,"","","","","","",""]
[null,{"$f":"IF(ISBLANK(dms_E2_Projects_14),\"\",dms_E2_Projects_14)","v":""},null,"","","","","","",""]
[null,{"$f":"IF(ISBLANK(dms_E2_Projects_15),\"\",dms_E2_Projects_15)","v":""},null,"","","","","","",""]
[null,{"$f":"IF(ISBLANK(dms_E2_Projects_16),\"\",dms_E2_Projects_16)","v":""},null,"","","","","","",""]
[null,{"$f":"IF(ISBLANK(dms_E2_Projects_17),\"\",dms_E2_Projects_17)","v":""},null,"","","","","","",""]
[null,{"$f":"IF(ISBLANK(dms_E2_Projects_18),\"\",dms_E2_Projects_18)","v":""},null,"","","","","","",""]
[null,{"$f":"IF(ISBLANK(dms_E2_Projects_19),\"\",dms_E2_Projects_19)","v":""},null,"","","","","","",""]
[null,{"$f":"IF(ISBLANK(dms_E2_Projects_20),\"\",dms_E2_Projects_20)","v":""},null,"","","","","","",""]
[null,{"$f":"IF(ISBLANK(dms_E2_Projects_21),\"\",dms_E2_Projects_21)","v":""},null,"","","","","","",""]
[null,{"$f":"IF(ISBLANK(dms_E2_Projects_22),\"\",dms_E2_Projects_22)","v":""},null,"","","","","","",""]
[null,{"$f":"IF(ISBLANK(dms_E2_Projects_23),\"\",dms_E2_Projects_23)","v":""},null,"","","","","","",""]
[null,{"$f":"IF(ISBLANK(dms_E2_Projects_24),\"\",dms_E2_Projects_24)","v":""},null,"","","","","","",""]
[null,{"$f":"IF(ISBLANK(dms_E2_Projects_25),\"\",dms_E2_Projects_25)","v":""},null,"","","","","","",""]
[null,{"$f":"IF(ISBLANK(dms_E2_Projects_26),\"\",dms_E2_Projects_26)","v":""},null,"","","","","","",""]
[null,{"$f":"IF(ISBLANK(dms_E2_Projects_27),\"\",dms_E2_Projects_27)","v":""},null,"","","","","","",""]
[null,{"$f":"IF(ISBLANK(dms_E2_Projects_28),\"\",dms_E2_Projects_28)","v":""},null,"","","","","","",""]
[null,{"$f":"IF(ISBLANK(dms_E2_Projects_29),\"\",dms_E2_Projects_29)","v":""},null,"","","","","","",""]
[null,{"$f":"IF(ISBLANK(dms_E2_Projects_30),\"\",dms_E2_Projects_30)","v":""},null,"","","","","","",""]
[null,{"$f":"IF(ISBLANK(dms_E2_Projects_31),\"\",dms_E2_Projects_31)","v":""},null,"","","","","","",""]
[null,{"$f":"IF(ISBLANK(dms_E2_Projects_32),\"\",dms_E2_Projects_32)","v":""},null,"","","","","","",""]
[null,{"$f":"IF(ISBLANK(dms_E2_Projects_33),\"\",dms_E2_Projects_33)","v":""},null,"","","","","","",""]
[null,{"$f":"IF(ISBLANK(dms_E2_Projects_34),\"\",dms_E2_Projects_34)","v":""},null,"","","","","","",""]
[null,{"$f":"IF(ISBLANK(dms_E2_Projects_35),\"\",dms_E2_Projects_35)","v":""},null,"","","","","","",""]
[null,{"$f":"IF(ISBLANK(dms_E2_Projects_36),\"\",dms_E2_Projects_36)","v":""},null,"","","","","","",""]
[null,{"$f":"IF(ISBLANK(dms_E2_Projects_37),\"\",dms_E2_Projects_37)","v":""},null,"","","","","","",""]
[null,{"$f":"IF(ISBLANK(dms_E2_Projects_38),\"\",dms_E2_Projects_38)","v":""},null,"","","","","","",""]
[null,{"$f":"IF(ISBLANK(dms_E2_Projects_39),\"\",dms_E2_Projects_39)","v":""},null,"","","","","","",""]
[null,{"$f":"IF(ISBLANK(dms_E2_Projects_40),\"\",dms_E2_Projects_40)","v":""},null,"","","","","","",""]
[null,{"$f":"IF(ISBLANK(dms_E2_Projects_41),\"\",dms_E2_Projects_41)","v":""},null,"","","","","","",""]
[null,{"$f":"IF(ISBLANK(dms_E2_Projects_42),\"\",dms_E2_Projects_42)","v":""},null,"","","","","","",""]
[null,{"$f":"IF(ISBLANK(dms_E2_Projects_43),\"\",dms_E2_Projects_43)","v":""},null,"","","","","","",""]
[null,{"$f":"IF(ISBLANK(dms_E2_Projects_44),\"\",dms_E2_Projects_44)","v":""},null,"","","","","","",""]
[null,{"$f":"IF(ISBLANK(dms_E2_Projects_45),\"\",dms_E2_Projects_45)","v":""},null,"","","","","","",""]
[null,{"$f":"IF(ISBLANK(dms_E2_Projects_46),\"\",dms_E2_Projects_46)","v":""},null,"","","","","","",""]
[null,{"$f":"IF(ISBLANK(dms_E2_Projects_47),\"\",dms_E2_Projects_47)","v":""},null,"","","","","","",""]
[null,{"$f":"IF(ISBLANK(dms_E2_Projects_48),\"\",dms_E2_Projects_48)","v":""},null,"","","","","","",""]
[null,{"$f":"IF(ISBLANK(dms_E2_Projects_49),\"\",dms_E2_Projects_49)","v":""},null,"","","","","","",""]
[null,{"$f":"IF(ISBLANK(dms_E2_Projects_50),\"\",dms_E2_Projects_50)","v":""},null,"","","","","","",""]
[null,"Aggregate of other projects or categories with total expenditure of less than $500,000",null,0,0,0,0,0,0,0]
[null,null,"Total",{"$f":"SUM(D395:D445)","v":0},{"$f":"SUM(E395:E445)","v":0},0,0,0,0,0]
[]
[null,"B. LOW PRESSURE TO MEDIUM PRESSURE"]
[null,{"$f":"IF(ISBLANK(dms_E2_Projects_01),\"\",dms_E2_Projects_01)","v":"Newcastle MP1 30kPa Rehabilitation Stage 1 "},null,0,0,0,0,0,0,0]
[null,{"$f":"IF(ISBLANK(dms_E2_Projects_02),\"\",dms_E2_Projects_02)","v":"Haberfield Strathfield Campsie 7kPa Rehabilitation "},null,0,0,0,0,0,0,0]
[null,{"$f":"IF(ISBLANK(dms_E2_Projects_03),\"\",dms_E2_Projects_03)","v":"Kurri Kurri Rehabilitation Stage 2 "},null,0,0,0,0,0,0,0]
[null,{"$f":"IF(ISBLANK(dms_E2_Projects_04),\"\",dms_E2_Projects_04)","v":"Newcastle MP1 30kPa Rehabilitation Stage 3 "},null,0,0,0,0,0,0,0]
[null,{"$f":"IF(ISBLANK(dms_E2_Projects_05),\"\",dms_E2_Projects_05)","v":"Newcastle MP1 30kPa Rehabilitation Stage 2 "},null,0,0,0,0,0,0,0]
[null,{"$f":"IF(ISBLANK(dms_E2_Projects_06),\"\",dms_E2_Projects_06)","v":"Strathfield CBD 7kPa Mains Rehabilitation "},null,0,0,0,0,0,0,0]
[null,{"$f":"IF(ISBLANK(dms_E2_Projects_07),\"\",dms_E2_Projects_07)","v":"Pennant Hills Rd 350mm Steel Main Rehabilitation "},null,0,0,0,0,0,0,0]
[null,{"$f":"IF(ISBLANK(dms_E2_Projects_08),\"\",dms_E2_Projects_08)","v":"Bankstown Chullora Greenacre 7kPa Rehabilitation "},null,0,0,0,0,0,0,0]
[null,{"$f":"IF(ISBLANK(dms_E2_Projects_09),\"\",dms_E2_Projects_09)","v":"Matraville 2kPa and 7kPa Rehabilitation"},null,45000,0,0,0,0,0,0]
[null,{"$f":"IF(ISBLANK(dms_E2_Projects_10),\"\",dms_E2_Projects_10)","v":"Mittagong Rehabilitation"},null,0,0,0,0,0,0,0]
[null,{"$f":"IF(ISBLANK(dms_E2_Projects_11),\"\",dms_E2_Projects_11)","v":"Bombo Bridge Main Insertion"},null,0,0,0,0,0,0,0]
[null,{"$f":"IF(ISBLANK(dms_E2_Projects_12),\"\",dms_E2_Projects_12)","v":""},null,"","","","","","",""]
[null,{"$f":"IF(ISBLANK(dms_E2_Projects_13),\"\",dms_E2_Projects_13)","v":""},null,"","","","","","",""]
[null,{"$f":"IF(ISBLANK(dms_E2_Projects_14),\"\",dms_E2_Projects_14)","v":""},null,"","","","","","",""]
[null,{"$f":"IF(ISBLANK(dms_E2_Projects_15),\"\",dms_E2_Projects_15)","v":""},null,"","","","","","",""]
[null,{"$f":"IF(ISBLANK(dms_E2_Projects_16),\"\",dms_E2_Projects_16)","v":""},null,"","","","","","",""]
[null,{"$f":"IF(ISBLANK(dms_E2_Projects_17),\"\",dms_E2_Projects_17)","v":""},null,"","","","","","",""]
[null,{"$f":"IF(ISBLANK(dms_E2_Projects_18),\"\",dms_E2_Projects_18)","v":""},null,"","","","","","",""]
[null,{"$f":"IF(ISBLANK(dms_E2_Projects_19),\"\",dms_E2_Projects_19)","v":""},null,"","","","","","",""]
[null,{"$f":"IF(ISBLANK(dms_E2_Projects_20),\"\",dms_E2_Projects_20)","v":""},null,"","","","","","",""]
[null,{"$f":"IF(ISBLANK(dms_E2_Projects_21),\"\",dms_E2_Projects_21)","v":""},null,"","","","","","",""]
[null,{"$f":"IF(ISBLANK(dms_E2_Projects_22),\"\",dms_E2_Projects_22)","v":""},null,"","","","","","",""]
[null,{"$f":"IF(ISBLANK(dms_E2_Projects_23),\"\",dms_E2_Projects_23)","v":""},null,"","","","","","",""]
[null,{"$f":"IF(ISBLANK(dms_E2_Projects_24),\"\",dms_E2_Projects_24)","v":""},null,"","","","","","",""]
[null,{"$f":"IF(ISBLANK(dms_E2_Projects_25),\"\",dms_E2_Projects_25)","v":""},null,"","","","","","",""]
[null,{"$f":"IF(ISBLANK(dms_E2_Projects_26),\"\",dms_E2_Projects_26)","v":""},null,"","","","","","",""]
[null,{"$f":"IF(ISBLANK(dms_E2_Projects_27),\"\",dms_E2_Projects_27)","v":""},null,"","","","","","",""]
[null,{"$f":"IF(ISBLANK(dms_E2_Projects_28),\"\",dms_E2_Projects_28)","v":""},null,"","","","","","",""]
[null,{"$f":"IF(ISBLANK(dms_E2_Projects_29),\"\",dms_E2_Projects_29)","v":""},null,"","","","","","",""]
[null,{"$f":"IF(ISBLANK(dms_E2_Projects_30),\"\",dms_E2_Projects_30)","v":""},null,"","","","","","",""]
[null,{"$f":"IF(ISBLANK(dms_E2_Projects_31),\"\",dms_E2_Projects_31)","v":""},null,"","","","","","",""]
[null,{"$f":"IF(ISBLANK(dms_E2_Projects_32),\"\",dms_E2_Projects_32)","v":""},null,"","","","","","",""]
[null,{"$f":"IF(ISBLANK(dms_E2_Projects_33),\"\",dms_E2_Projects_33)","v":""},null,"","","","","","",""]
[null,{"$f":"IF(ISBLANK(dms_E2_Projects_34),\"\",dms_E2_Projects_34)","v":""},null,"","","","","","",""]
[null,{"$f":"IF(ISBLANK(dms_E2_Projects_35),\"\",dms_E2_Projects_35)","v":""},null,"","","","","","",""]
[null,{"$f":"IF(ISBLANK(dms_E2_Projects_36),\"\",dms_E2_Projects_36)","v":""},null,"","","","","","",""]
[null,{"$f":"IF(ISBLANK(dms_E2_Projects_37),\"\",dms_E2_Projects_37)","v":""},null,"","","","","","",""]
[null,{"$f":"IF(ISBLANK(dms_E2_Projects_38),\"\",dms_E2_Projects_38)","v":""},null,"","","","","","",""]
[null,{"$f":"IF(ISBLANK(dms_E2_Projects_39),\"\",dms_E2_Projects_39)","v":""},null,"","","","","","",""]
[null,{"$f":"IF(ISBLANK(dms_E2_Projects_40),\"\",dms_E2_Projects_40)","v":""},null,"","","","","","",""]
[null,{"$f":"IF(ISBLANK(dms_E2_Projects_41),\"\",dms_E2_Projects_41)","v":""},null,"","","","","","",""]
[null,{"$f":"IF(ISBLANK(dms_E2_Projects_42),\"\",dms_E2_Projects_42)","v":""},null,"","","","","","",""]
[null,{"$f":"IF(ISBLANK(dms_E2_Projects_43),\"\",dms_E2_Projects_43)","v":""},null,"","","","","","",""]
[null,{"$f":"IF(ISBLANK(dms_E2_Projects_44),\"\",dms_E2_Projects_44)","v":""},null,"","","","","","",""]
[null,{"$f":"IF(ISBLANK(dms_E2_Projects_45),\"\",dms_E2_Projects_45)","v":""},null,"","","","","","",""]
[null,{"$f":"IF(ISBLANK(dms_E2_Projects_46),\"\",dms_E2_Projects_46)","v":""},null,"","","","","","",""]
[null,{"$f":"IF(ISBLANK(dms_E2_Projects_47),\"\",dms_E2_Projects_47)","v":""},null,"","","","","","",""]
[null,{"$f":"IF(ISBLANK(dms_E2_Projects_48),\"\",dms_E2_Projects_48)","v":""},null,"","","","","","",""]
[null,{"$f":"IF(ISBLANK(dms_E2_Projects_49),\"\",dms_E2_Projects_49)","v":""},null,"","","","","","",""]
[null,{"$f":"IF(ISBLANK(dms_E2_Projects_50),\"\",dms_E2_Projects_50)","v":""},null,"","","","","","",""]
[null,"Aggregate of other projects or categories with total expenditure of less than $500,000",null,0,0,0,0,0,0,0]
[null,null,"Total",{"$f":"SUM(D449:D499)","v":45000},{"$f":"SUM(E449:E499)","v":0},0,0,0,0,0]
[]
[null,"C. LOW PRESSURE TO LOW PRESSURE"]
[null,{"$f":"IF(ISBLANK(dms_E2_Projects_01),\"\",dms_E2_Projects_01)","v":"Newcastle MP1 30kPa Rehabilitation Stage 1 "},null,0,0,0,0,0,0,0]
[null,{"$f":"IF(ISBLANK(dms_E2_Projects_02),\"\",dms_E2_Projects_02)","v":"Haberfield Strathfield Campsie 7kPa Rehabilitation "},null,0,0,0,0,0,32000,0]
[null,{"$f":"IF(ISBLANK(dms_E2_Projects_03),\"\",dms_E2_Projects_03)","v":"Kurri Kurri Rehabilitation Stage 2 "},null,0,0,0,0,0,0,0]
[null,{"$f":"IF(ISBLANK(dms_E2_Projects_04),\"\",dms_E2_Projects_04)","v":"Newcastle MP1 30kPa Rehabilitation Stage 3 "},null,0,0,0,0,0,0,0]
[null,{"$f":"IF(ISBLANK(dms_E2_Projects_05),\"\",dms_E2_Projects_05)","v":"Newcastle MP1 30kPa Rehabilitation Stage 2 "},null,0,0,0,0,0,0,0]
[null,{"$f":"IF(ISBLANK(dms_E2_Projects_06),\"\",dms_E2_Projects_06)","v":"Strathfield CBD 7kPa Mains Rehabilitation "},null,0,0,0,0,0,0,8000]
[null,{"$f":"IF(ISBLANK(dms_E2_Projects_07),\"\",dms_E2_Projects_07)","v":"Pennant Hills Rd 350mm Steel Main Rehabilitation "},null,0,0,0,0,0,0,0]
[null,{"$f":"IF(ISBLANK(dms_E2_Projects_08),\"\",dms_E2_Projects_08)","v":"Bankstown Chullora Greenacre 7kPa Rehabilitation "},null,0,0,0,0,23000,0,0]
[null,{"$f":"IF(ISBLANK(dms_E2_Projects_09),\"\",dms_E2_Projects_09)","v":"Matraville 2kPa and 7kPa Rehabilitation"},null,0,0,0,0,0,0,0]
[null,{"$f":"IF(ISBLANK(dms_E2_Projects_10),\"\",dms_E2_Projects_10)","v":"Mittagong Rehabilitation"},null,0,0,0,0,0,0,0]
[null,{"$f":"IF(ISBLANK(dms_E2_Projects_11),\"\",dms_E2_Projects_11)","v":"Bombo Bridge Main Insertion"},null,0,0,0,0,0,0,0]
[null,{"$f":"IF(ISBLANK(dms_E2_Projects_12),\"\",dms_E2_Projects_12)","v":""},null,"","","","","","",""]
[null,{"$f":"IF(ISBLANK(dms_E2_Projects_13),\"\",dms_E2_Projects_13)","v":""},null,"","","","","","",""]
[null,{"$f":"IF(ISBLANK(dms_E2_Projects_14),\"\",dms_E2_Projects_14)","v":""},null,"","","","","","",""]
[null,{"$f":"IF(ISBLANK(dms_E2_Projects_15),\"\",dms_E2_Projects_15)","v":""},null,"","","","","","",""]
[null,{"$f":"IF(ISBLANK(dms_E2_Projects_16),\"\",dms_E2_Projects_16)","v":""},null,"","","","","","",""]
[null,{"$f":"IF(ISBLANK(dms_E2_Projects_17),\"\",dms_E2_Projects_17)","v":""},null,"","","","","","",""]
[null,{"$f":"IF(ISBLANK(dms_E2_Projects_18),\"\",dms_E2_Projects_18)","v":""},null,"","","","","","",""]
[null,{"$f":"IF(ISBLANK(dms_E2_Projects_18),\"\",dms_E2_Projects_18)","v":""},null,"","","","","","",""]
[null,{"$f":"IF(ISBLANK(dms_E2_Projects_19),\"\",dms_E2_Projects_19)","v":""},null,"","","","","","",""]
[null,{"$f":"IF(ISBLANK(dms_E2_Projects_20),\"\",dms_E2_Projects_20)","v":""},null,"","","","","","",""]
[null,{"$f":"IF(ISBLANK(dms_E2_Projects_21),\"\",dms_E2_Projects_21)","v":""},null,"","","","","","",""]
[null,{"$f":"IF(ISBLANK(dms_E2_Projects_22),\"\",dms_E2_Projects_22)","v":""},null,"","","","","","",""]
[null,{"$f":"IF(ISBLANK(dms_E2_Projects_23),\"\",dms_E2_Projects_23)","v":""},null,"","","","","","",""]
[null,{"$f":"IF(ISBLANK(dms_E2_Projects_24),\"\",dms_E2_Projects_24)","v":""},null,"","","","","","",""]
[null,{"$f":"IF(ISBLANK(dms_E2_Projects_25),\"\",dms_E2_Projects_26)","v":""},null,"","","","","","",""]
[null,{"$f":"IF(ISBLANK(dms_E2_Projects_27),\"\",dms_E2_Projects_27)","v":""},null,"","","","","","",""]
[null,{"$f":"IF(ISBLANK(dms_E2_Projects_28),\"\",dms_E2_Projects_28)","v":""},null,"","","","","","",""]
[null,{"$f":"IF(ISBLANK(dms_E2_Projects_29),\"\",dms_E2_Projects_29)","v":""},null,"","","","","","",""]
[null,{"$f":"IF(ISBLANK(dms_E2_Projects_30),\"\",dms_E2_Projects_30)","v":""},null,"","","","","","",""]
[null,{"$f":"IF(ISBLANK(dms_E2_Projects_31),\"\",dms_E2_Projects_31)","v":""},null,"","","","","","",""]
[null,{"$f":"IF(ISBLANK(dms_E2_Projects_32),\"\",dms_E2_Projects_32)","v":""},null,"","","","","","",""]
[null,{"$f":"IF(ISBLANK(dms_E2_Projects_33),\"\",dms_E2_Projects_33)","v":""},null,"","","","","","",""]
[null,{"$f":"IF(ISBLANK(dms_E2_Projects_34),\"\",dms_E2_Projects_34)","v":""},null,"","","","","","",""]
[null,{"$f":"IF(ISBLANK(dms_E2_Projects_35),\"\",dms_E2_Projects_35)","v":""},null,"","","","","","",""]
[null,{"$f":"IF(ISBLANK(dms_E2_Projects_36),\"\",dms_E2_Projects_36)","v":""},null,"","","","","","",""]
[null,{"$f":"IF(ISBLANK(dms_E2_Projects_37),\"\",dms_E2_Projects_37)","v":""},null,"","","","","","",""]
[null,{"$f":"IF(ISBLANK(dms_E2_Projects_38),\"\",dms_E2_Projects_38)","v":""},null,"","","","","","",""]
[null,{"$f":"IF(ISBLANK(dms_E2_Projects_39),\"\",dms_E2_Projects_39)","v":""},null,"","","","","","",""]
[null,{"$f":"IF(ISBLANK(dms_E2_Projects_40),\"\",dms_E2_Projects_40)","v":""},null,"","","","","","",""]
[null,{"$f":"IF(ISBLANK(dms_E2_Projects_41),\"\",dms_E2_Projects_41)","v":""},null,"","","","","","",""]
[null,{"$f":"IF(ISBLANK(dms_E2_Projects_42),\"\",dms_E2_Projects_42)","v":""},null,"","","","","","",""]
[null,{"$f":"IF(ISBLANK(dms_E2_Projects_43),\"\",dms_E2_Projects_43)","v":""},null,"","","","","","",""]
[null,{"$f":"IF(ISBLANK(dms_E2_Projects_44),\"\",dms_E2_Projects_44)","v":""},null,"","","","","","",""]
[null,{"$f":"IF(ISBLANK(dms_E2_Projects_45),\"\",dms_E2_Projects_45)","v":""},null,"","","","","","",""]
[null,{"$f":"IF(ISBLANK(dms_E2_Projects_46),\"\",dms_E2_Projects_46)","v":""},null,"","","","","","",""]
[null,{"$f":"IF(ISBLANK(dms_E2_Projects_47),\"\",dms_E2_Projects_47)","v":""},null,"","","","","","",""]
[null,{"$f":"IF(ISBLANK(dms_E2_Projects_48),\"\",dms_E2_Projects_48)","v":""},null,"","","","","","",""]
[null,{"$f":"IF(ISBLANK(dms_E2_Projects_49),\"\",dms_E2_Projects_49)","v":""},null,"","","","","","",""]
[null,{"$f":"IF(ISBLANK(dms_E2_Projects_50),\"\",dms_E2_Projects_50)","v":""},null,"","","","","","",""]
[null,"Aggregate of other projects or categories with total expenditure of less than $500,000",null,0,0,0,0,0,0,0]
[null,null,"Total",{"$f":"SUM(D503:D553)","v":0},{"$f":"SUM(E503:E553)","v":0},0,0,23000,32000,8000]
[]
[null,"D. MEDIUM PRESSURE TO MEDIUM PRESSURE"]
[null,{"$f":"IF(ISBLANK(dms_E2_Projects_01),\"\",dms_E2_Projects_01)","v":"Newcastle MP1 30kPa Rehabilitation Stage 1 "},null,0,0,9000,0,0,0,0]
[null,{"$f":"IF(ISBLANK(dms_E2_Projects_02),\"\",dms_E2_Projects_02)","v":"Haberfield Strathfield Campsie 7kPa Rehabilitation "},null,0,0,0,0,0,0,0]
[null,{"$f":"IF(ISBLANK(dms_E2_Projects_03),\"\",dms_E2_Projects_03)","v":"Kurri Kurri Rehabilitation Stage 2 "},null,0,0,0,0,0,0,24000]
[null,{"$f":"IF(ISBLANK(dms_E2_Projects_04),\"\",dms_E2_Projects_04)","v":"Newcastle MP1 30kPa Rehabilitation Stage 3 "},null,0,0,0,0,9000,0,0]
[null,{"$f":"IF(ISBLANK(dms_E2_Projects_05),\"\",dms_E2_Projects_05)","v":"Newcastle MP1 30kPa Rehabilitation Stage 2 "},null,0,0,0,9000,0,0,0]
[null,{"$f":"IF(ISBLANK(dms_E2_Projects_06),\"\",dms_E2_Projects_06)","v":"Strathfield CBD 7kPa Mains Rehabilitation "},null,0,0,0,0,0,0,0]
[null,{"$f":"IF(ISBLANK(dms_E2_Projects_07),\"\",dms_E2_Projects_07)","v":"Pennant Hills Rd 350mm Steel Main Rehabilitation "},null,0,0,0,0,0,0,5400]
[null,{"$f":"IF(ISBLANK(dms_E2_Projects_08),\"\",dms_E2_Projects_08)","v":"Bankstown Chullora Greenacre 7kPa Rehabilitation "},null,0,0,0,0,0,0,0]
[null,{"$f":"IF(ISBLANK(dms_E2_Projects_09),\"\",dms_E2_Projects_09)","v":"Matraville 2kPa and 7kPa Rehabilitation"},null,0,0,0,0,0,0,0]
[null,{"$f":"IF(ISBLANK(dms_E2_Projects_10),\"\",dms_E2_Projects_10)","v":"Mittagong Rehabilitation"},null,2300,0,0,0,0,0,0]
[null,{"$f":"IF(ISBLANK(dms_E2_Projects_11),\"\",dms_E2_Projects_11)","v":"Bombo Bridge Main Insertion"},null,200,0,0,0,0,0,0]
[null,{"$f":"IF(ISBLANK(dms_E2_Projects_12),\"\",dms_E2_Projects_12)","v":""},null,"","","","","","",""]
[null,{"$f":"IF(ISBLANK(dms_E2_Projects_13),\"\",dms_E2_Projects_13)","v":""},null,"","","","","","",""]
[null,{"$f":"IF(ISBLANK(dms_E2_Projects_14),\"\",dms_E2_Projects_14)","v":""},null,"","","","","","",""]
[null,{"$f":"IF(ISBLANK(dms_E2_Projects_15),\"\",dms_E2_Projects_15)","v":""},null,"","","","","","",""]
[null,{"$f":"IF(ISBLANK(dms_E2_Projects_16),\"\",dms_E2_Projects_16)","v":""},null,"","","","","","",""]
[null,{"$f":"IF(ISBLANK(dms_E2_Projects_17),\"\",dms_E2_Projects_17)","v":""},null,"","","","","","",""]
[null,{"$f":"IF(ISBLANK(dms_E2_Projects_18),\"\",dms_E2_Projects_18)","v":""},null,"","","","","","",""]
[null,{"$f":"IF(ISBLANK(dms_E2_Projects_19),\"\",dms_E2_Projects_19)","v":""},null,"","","","","","",""]
[null,{"$f":"IF(ISBLANK(dms_E2_Projects_20),\"\",dms_E2_Projects_20)","v":""},null,"","","","","","",""]
[null,{"$f":"IF(ISBLANK(dms_E2_Projects_21),\"\",dms_E2_Projects_21)","v":""},null,"","","","","","",""]
[null,{"$f":"IF(ISBLANK(dms_E2_Projects_22),\"\",dms_E2_Projects_22)","v":""},null,"","","","","","",""]
[null,{"$f":"IF(ISBLANK(dms_E2_Projects_23),\"\",dms_E2_Projects_23)","v":""},null,"","","","","","",""]
[null,{"$f":"IF(ISBLANK(dms_E2_Projects_24),\"\",dms_E2_Projects_24)","v":""},null,"","","","","","",""]
[null,{"$f":"IF(ISBLANK(dms_E2_Projects_25),\"\",dms_E2_Projects_25)","v":""},null,"","","","","","",""]
[null,{"$f":"IF(ISBLANK(dms_E2_Projects_26),\"\",dms_E2_Projects_26)","v":""},null,"","","","","","",""]
[null,{"$f":"IF(ISBLANK(dms_E2_Projects_27),\"\",dms_E2_Projects_27)","v":""},null,"","","","","","",""]
[null,{"$f":"IF(ISBLANK(dms_E2_Projects_28),\"\",dms_E2_Projects_28)","v":""},null,"","","","","","",""]
[null,{"$f":"IF(ISBLANK(dms_E2_Projects_29),\"\",dms_E2_Projects_29)","v":""},null,"","","","","","",""]
[null,{"$f":"IF(ISBLANK(dms_E2_Projects_30),\"\",dms_E2_Projects_30)","v":""},null,"","","","","","",""]
[null,{"$f":"IF(ISBLANK(dms_E2_Projects_31),\"\",dms_E2_Projects_31)","v":""},null,"","","","","","",""]
[null,{"$f":"IF(ISBLANK(dms_E2_Projects_32),\"\",dms_E2_Projects_32)","v":""},null,"","","","","","",""]
[null,{"$f":"IF(ISBLANK(dms_E2_Projects_33),\"\",dms_E2_Projects_33)","v":""},null,"","","","","","",""]
[null,{"$f":"IF(ISBLANK(dms_E2_Projects_34),\"\",dms_E2_Projects_34)","v":""},null,"","","","","","",""]
[null,{"$f":"IF(ISBLANK(dms_E2_Projects_35),\"\",dms_E2_Projects_35)","v":""},null,"","","","","","",""]
[null,{"$f":"IF(ISBLANK(dms_E2_Projects_36),\"\",dms_E2_Projects_36)","v":""},null,"","","","","","",""]
[null,{"$f":"IF(ISBLANK(dms_E2_Projects_37),\"\",dms_E2_Projects_37)","v":""},null,"","","","","","",""]
[null,{"$f":"IF(ISBLANK(dms_E2_Projects_38),\"\",dms_E2_Projects_38)","v":""},null,"","","","","","",""]
[null,{"$f":"IF(ISBLANK(dms_E2_Projects_39),\"\",dms_E2_Projects_39)","v":""},null,"","","","","","",""]
[null,{"$f":"IF(ISBLANK(dms_E2_Projects_40),\"\",dms_E2_Projects_40)","v":""},null,"","","","","","",""]
[null,{"$f":"IF(ISBLANK(dms_E2_Projects_41),\"\",dms_E2_Projects_41)","v":""},null,"","","","","","",""]
[null,{"$f":"IF(ISBLANK(dms_E2_Projects_42),\"\",dms_E2_Projects_42)","v":""},null,"","","","","","",""]
[null,{"$f":"IF(ISBLANK(dms_E2_Projects_43),\"\",dms_E2_Projects_43)","v":""},null,"","","","","","",""]
[null,{"$f":"IF(ISBLANK(dms_E2_Projects_44),\"\",dms_E2_Projects_44)","v":""},null,"","","","","","",""]
[null,{"$f":"IF(ISBLANK(dms_E2_Projects_45),\"\",dms_E2_Projects_45)","v":""},null,"","","","","","",""]
[null,{"$f":"IF(ISBLANK(dms_E2_Projects_46),\"\",dms_E2_Projects_46)","v":""},null,"","","","","","",""]
[null,{"$f":"IF(ISBLANK(dms_E2_Projects_47),\"\",dms_E2_Projects_47)","v":""},null,"","","","","","",""]
[null,{"$f":"IF(ISBLANK(dms_E2_Projects_48),\"\",dms_E2_Projects_48)","v":""},null,"","","","","","",""]
[null,{"$f":"IF(ISBLANK(dms_E2_Projects_49),\"\",dms_E2_Projects_49)","v":""},null,"","","","","","",""]
[null,{"$f":"IF(ISBLANK(dms_E2_Projects_50),\"\",dms_E2_Projects_50)","v":""},null,"","","","","","",""]
[null,"Aggregate of other projects or categories with total expenditure of less than $500,000",null,0,0,0,0,0,0,800]
[null,null,"Total",{"$f":"SUM(D557:D607)","v":2500},{"$f":"SUM(E557:E607)","v":0},9000,9000,9000,0,30200]
[]
[null,"E. MEDIUM PRESSURE TO HIGH PRESSURE"]
[null,{"$f":"IF(ISBLANK(dms_E2_Projects_01),\"\",dms_E2_Projects_01)","v":"Newcastle MP1 30kPa Rehabilitation Stage 1 "},null,0,0,0,0,0,0,0]
[null,{"$f":"IF(ISBLANK(dms_E2_Projects_02),\"\",dms_E2_Projects_02)","v":"Haberfield Strathfield Campsie 7kPa Rehabilitation "},null,0,0,0,0,0,0,0]
[null,{"$f":"IF(ISBLANK(dms_E2_Projects_03),\"\",dms_E2_Projects_03)","v":"Kurri Kurri Rehabilitation Stage 2 "},null,0,0,0,0,0,0,0]
[null,{"$f":"IF(ISBLANK(dms_E2_Projects_04),\"\",dms_E2_Projects_04)","v":"Newcastle MP1 30kPa Rehabilitation Stage 3 "},null,0,0,0,0,0,0,0]
[null,{"$f":"IF(ISBLANK(dms_E2_Projects_05),\"\",dms_E2_Projects_05)","v":"Newcastle MP1 30kPa Rehabilitation Stage 2 "},null,0,0,0,0,0,0,0]
[null,{"$f":"IF(ISBLANK(dms_E2_Projects_06),\"\",dms_E2_Projects_06)","v":"Strathfield CBD 7kPa Mains Rehabilitation "},null,0,0,0,0,0,0,0]
[null,{"$f":"IF(ISBLANK(dms_E2_Projects_07),\"\",dms_E2_Projects_07)","v":"Pennant Hills Rd 350mm Steel Main Rehabilitation "},null,0,0,0,0,0,0,0]
[null,{"$f":"IF(ISBLANK(dms_E2_Projects_08),\"\",dms_E2_Projects_08)","v":"Bankstown Chullora Greenacre 7kPa Rehabilitation "},null,0,0,0,0,0,0,0]
[null,{"$f":"IF(ISBLANK(dms_E2_Projects_09),\"\",dms_E2_Projects_09)","v":"Matraville 2kPa and 7kPa Rehabilitation"},null,0,0,0,0,0,0,0]
[null,{"$f":"IF(ISBLANK(dms_E2_Projects_10),\"\",dms_E2_Projects_10)","v":"Mittagong Rehabilitation"},null,0,0,0,0,0,0,0]
[null,{"$f":"IF(ISBLANK(dms_E2_Projects_11),\"\",dms_E2_Projects_11)","v":"Bombo Bridge Main Insertion"},null,0,0,0,0,0,0,0]
[null,{"$f":"IF(ISBLANK(dms_E2_Projects_12),\"\",dms_E2_Projects_12)","v":""},null,"","","","","","",""]
[null,{"$f":"IF(ISBLANK(dms_E2_Projects_13),\"\",dms_E2_Projects_13)","v":""},null,"","","","","","",""]
[null,{"$f":"IF(ISBLANK(dms_E2_Projects_14),\"\",dms_E2_Projects_14)","v":""},null,"","","","","","",""]
[null,{"$f":"IF(ISBLANK(dms_E2_Projects_15),\"\",dms_E2_Projects_15)","v":""},null,"","","","","","",""]
[null,{"$f":"IF(ISBLANK(dms_E2_Projects_16),\"\",dms_E2_Projects_16)","v":""},null,"","","","","","",""]
[null,{"$f":"IF(ISBLANK(dms_E2_Projects_17),\"\",dms_E2_Projects_17)","v":""},null,"","","","","","",""]
[null,{"$f":"IF(ISBLANK(dms_E2_Projects_18),\"\",dms_E2_Projects_18)","v":""},null,"","","","","","",""]
[null,{"$f":"IF(ISBLANK(dms_E2_Projects_19),\"\",dms_E2_Projects_19)","v":""},null,"","","","","","",""]
[null,{"$f":"IF(ISBLANK(dms_E2_Projects_20),\"\",dms_E2_Projects_20)","v":""},null,"","","","","","",""]
[null,{"$f":"IF(ISBLANK(dms_E2_Projects_21),\"\",dms_E2_Projects_21)","v":""},null,"","","","","","",""]
[null,{"$f":"IF(ISBLANK(dms_E2_Projects_22),\"\",dms_E2_Projects_22)","v":""},null,"","","","","","",""]
[null,{"$f":"IF(ISBLANK(dms_E2_Projects_23),\"\",dms_E2_Projects_23)","v":""},null,"","","","","","",""]
[null,{"$f":"IF(ISBLANK(dms_E2_Projects_24),\"\",dms_E2_Projects_24)","v":""},null,"","","","","","",""]
[null,{"$f":"IF(ISBLANK(dms_E2_Projects_25),\"\",dms_E2_Projects_25)","v":""},null,"","","","","","",""]
[null,{"$f":"IF(ISBLANK(dms_E2_Projects_26),\"\",dms_E2_Projects_26)","v":""},null,"","","","","","",""]
[null,{"$f":"IF(ISBLANK(dms_E2_Projects_27),\"\",dms_E2_Projects_27)","v":""},null,"","","","","","",""]
[null,{"$f":"IF(ISBLANK(dms_E2_Projects_28),\"\",dms_E2_Projects_28)","v":""},null,"","","","","","",""]
[null,{"$f":"IF(ISBLANK(dms_E2_Projects_29),\"\",dms_E2_Projects_29)","v":""},null,"","","","","","",""]
[null,{"$f":"IF(ISBLANK(dms_E2_Projects_30),\"\",dms_E2_Projects_30)","v":""},null,"","","","","","",""]
[null,{"$f":"IF(ISBLANK(dms_E2_Projects_31),\"\",dms_E2_Projects_31)","v":""},null,"","","","","","",""]
[null,{"$f":"IF(ISBLANK(dms_E2_Projects_32),\"\",dms_E2_Projects_32)","v":""},null,"","","","","","",""]
[null,{"$f":"IF(ISBLANK(dms_E2_Projects_33),\"\",dms_E2_Projects_33)","v":""},null,"","","","","","",""]
[null,{"$f":"IF(ISBLANK(dms_E2_Projects_34),\"\",dms_E2_Projects_34)","v":""},null,"","","","","","",""]
[null,{"$f":"IF(ISBLANK(dms_E2_Projects_35),\"\",dms_E2_Projects_35)","v":""},null,"","","","","","",""]
[null,{"$f":"IF(ISBLANK(dms_E2_Projects_36),\"\",dms_E2_Projects_36)","v":""},null,"","","","","","",""]
[null,{"$f":"IF(ISBLANK(dms_E2_Projects_37),\"\",dms_E2_Projects_37)","v":""},null,"","","","","","",""]
[null,{"$f":"IF(ISBLANK(dms_E2_Projects_38),\"\",dms_E2_Projects_38)","v":""},null,"","","","","","",""]
[null,{"$f":"IF(ISBLANK(dms_E2_Projects_39),\"\",dms_E2_Projects_39)","v":""},null,"","","","","","",""]
[null,{"$f":"IF(ISBLANK(dms_E2_Projects_40),\"\",dms_E2_Projects_40)","v":""},null,"","","","","","",""]
[null,{"$f":"IF(ISBLANK(dms_E2_Projects_41),\"\",dms_E2_Projects_41)","v":""},null,"","","","","","",""]
[null,{"$f":"IF(ISBLANK(dms_E2_Projects_42),\"\",dms_E2_Projects_42)","v":""},null,"","","","","","",""]
[null,{"$f":"IF(ISBLANK(dms_E2_Projects_43),\"\",dms_E2_Projects_43)","v":""},null,"","","","","","",""]
[null,{"$f":"IF(ISBLANK(dms_E2_Projects_44),\"\",dms_E2_Projects_44)","v":""},null,"","","","","","",""]
[null,{"$f":"IF(ISBLANK(dms_E2_Projects_45),\"\",dms_E2_Projects_45)","v":""},null,"","","","","","",""]
[null,{"$f":"IF(ISBLANK(dms_E2_Projects_46),\"\",dms_E2_Projects_46)","v":""},null,"","","","","","",""]
[null,{"$f":"IF(ISBLANK(dms_E2_Projects_47),\"\",dms_E2_Projects_47)","v":""},null,"","","","","","",""]
[null,{"$f":"IF(ISBLANK(dms_E2_Projects_48),\"\",dms_E2_Projects_48)","v":""},null,"","","","","","",""]
[null,{"$f":"IF(ISBLANK(dms_E2_Projects_49),\"\",dms_E2_Projects_49)","v":""},null,"","","","","","",""]
[null,{"$f":"IF(ISBLANK(dms_E2_Projects_50),\"\",dms_E2_Projects_50)","v":""},null,"","","","","","",""]
[null,"Aggregate of other projects or categories with total expenditure of less than $500,000",null,0,0,0,0,0,0,0]
[null,null,"Total",{"$f":"SUM(D611:D661)","v":0},{"$f":"SUM(E611:E661)","v":0},0,0,0,0,0]
[]
[null,"F. HIGH PRESSURE TO HIGH PRESSURE"]
[null,{"$f":"IF(ISBLANK(dms_E2_Projects_01),\"\",dms_E2_Projects_01)","v":"Newcastle MP1 30kPa Rehabilitation Stage 1 "},null,0,0,0,0,0,0,0]
[null,{"$f":"IF(ISBLANK(dms_E2_Projects_02),\"\",dms_E2_Projects_02)","v":"Haberfield Strathfield Campsie 7kPa Rehabilitation "},null,0,0,0,0,0,0,0]
[null,{"$f":"IF(ISBLANK(dms_E2_Projects_03),\"\",dms_E2_Projects_03)","v":"Kurri Kurri Rehabilitation Stage 2 "},null,0,0,0,0,0,0,0]
[null,{"$f":"IF(ISBLANK(dms_E2_Projects_04),\"\",dms_E2_Projects_04)","v":"Newcastle MP1 30kPa Rehabilitation Stage 3 "},null,0,0,0,0,0,0,0]
[null,{"$f":"IF(ISBLANK(dms_E2_Projects_05),\"\",dms_E2_Projects_05)","v":"Newcastle MP1 30kPa Rehabilitation Stage 2 "},null,0,0,0,0,0,0,0]
[null,{"$f":"IF(ISBLANK(dms_E2_Projects_06),\"\",dms_E2_Projects_06)","v":"Strathfield CBD 7kPa Mains Rehabilitation "},null,0,0,0,0,0,0,0]
[null,{"$f":"IF(ISBLANK(dms_E2_Projects_07),\"\",dms_E2_Projects_07)","v":"Pennant Hills Rd 350mm Steel Main Rehabilitation "},null,0,0,0,0,0,0,0]
[null,{"$f":"IF(ISBLANK(dms_E2_Projects_08),\"\",dms_E2_Projects_08)","v":"Bankstown Chullora Greenacre 7kPa Rehabilitation "},null,0,0,0,0,0,0,0]
[null,{"$f":"IF(ISBLANK(dms_E2_Projects_09),\"\",dms_E2_Projects_09)","v":"Matraville 2kPa and 7kPa Rehabilitation"},null,0,0,0,0,0,0,0]
[null,{"$f":"IF(ISBLANK(dms_E2_Projects_10),\"\",dms_E2_Projects_10)","v":"Mittagong Rehabilitation"},null,0,0,0,0,0,0,0]
[null,{"$f":"IF(ISBLANK(dms_E2_Projects_11),\"\",dms_E2_Projects_11)","v":"Bombo Bridge Main Insertion"},null,0,0,0,0,0,0,0]
[null,{"$f":"IF(ISBLANK(dms_E2_Projects_12),\"\",dms_E2_Projects_12)","v":""},null,"","","","","","",""]
[null,{"$f":"IF(ISBLANK(dms_E2_Projects_13),\"\",dms_E2_Projects_13)","v":""},null,"","","","","","",""]
[null,{"$f":"IF(ISBLANK(dms_E2_Projects_14),\"\",dms_E2_Projects_14)","v":""},null,"","","","","","",""]
[null,{"$f":"IF(ISBLANK(dms_E2_Projects_15),\"\",dms_E2_Projects_15)","v":""},null,"","","","","","",""]
[null,{"$f":"IF(ISBLANK(dms_E2_Projects_16),\"\",dms_E2_Projects_16)","v":""},null,"","","","","","",""]
[null,{"$f":"IF(ISBLANK(dms_E2_Projects_17),\"\",dms_E2_Projects_17)","v":""},null,"","","","","","",""]
[null,{"$f":"IF(ISBLANK(dms_E2_Projects_18),\"\",dms_E2_Projects_18)","v":""},null,"","","","","","",""]
[null,{"$f":"IF(ISBLANK(dms_E2_Projects_19),\"\",dms_E2_Projects_19)","v":""},null,"","","","","","",""]
[null,{"$f":"IF(ISBLANK(dms_E2_Projects_20),\"\",dms_E2_Projects_20)","v":""},null,"","","","","","",""]
[null,{"$f":"IF(ISBLANK(dms_E2_Projects_21),\"\",dms_E2_Projects_21)","v":""},null,"","","","","","",""]
[null,{"$f":"IF(ISBLANK(dms_E2_Projects_22),\"\",dms_E2_Projects_22)","v":""},null,"","","","","","",""]
[null,{"$f":"IF(ISBLANK(dms_E2_Projects_23),\"\",dms_E2_Projects_23)","v":""},null,"","","","","","",""]
[null,{"$f":"IF(ISBLANK(dms_E2_Projects_24),\"\",dms_E2_Projects_24)","v":""},null,"","","","","","",""]
[null,{"$f":"IF(ISBLANK(dms_E2_Projects_25),\"\",dms_E2_Projects_25)","v":""},null,"","","","","","",""]
[null,{"$f":"IF(ISBLANK(dms_E2_Projects_26),\"\",dms_E2_Projects_26)","v":""},null,"","","","","","",""]
[null,{"$f":"IF(ISBLANK(dms_E2_Projects_27),\"\",dms_E2_Projects_27)","v":""},null,"","","","","","",""]
[null,{"$f":"IF(ISBLANK(dms_E2_Projects_28),\"\",dms_E2_Projects_28)","v":""},null,"","","","","","",""]
[null,{"$f":"IF(ISBLANK(dms_E2_Projects_29),\"\",dms_E2_Projects_29)","v":""},null,"","","","","","",""]
[null,{"$f":"IF(ISBLANK(dms_E2_Projects_30),\"\",dms_E2_Projects_30)","v":""},null,"","","","","","",""]
[null,{"$f":"IF(ISBLANK(dms_E2_Projects_31),\"\",dms_E2_Projects_31)","v":""},null,"","","","","","",""]
[null,{"$f":"IF(ISBLANK(dms_E2_Projects_32),\"\",dms_E2_Projects_32)","v":""},null,"","","","","","",""]
[null,{"$f":"IF(ISBLANK(dms_E2_Projects_33),\"\",dms_E2_Projects_33)","v":""},null,"","","","","","",""]
[null,{"$f":"IF(ISBLANK(dms_E2_Projects_34),\"\",dms_E2_Projects_34)","v":""},null,"","","","","","",""]
[null,{"$f":"IF(ISBLANK(dms_E2_Projects_35),\"\",dms_E2_Projects_35)","v":""},null,"","","","","","",""]
[null,{"$f":"IF(ISBLANK(dms_E2_Projects_36),\"\",dms_E2_Projects_36)","v":""},null,"","","","","","",""]
[null,{"$f":"IF(ISBLANK(dms_E2_Projects_37),\"\",dms_E2_Projects_37)","v":""},null,"","","","","","",""]
[null,{"$f":"IF(ISBLANK(dms_E2_Projects_38),\"\",dms_E2_Projects_38)","v":""},null,"","","","","","",""]
[null,{"$f":"IF(ISBLANK(dms_E2_Projects_39),\"\",dms_E2_Projects_39)","v":""},null,"","","","","","",""]
[null,{"$f":"IF(ISBLANK(dms_E2_Projects_40),\"\",dms_E2_Projects_40)","v":""},null,"","","","","","",""]
[null,{"$f":"IF(ISBLANK(dms_E2_Projects_41),\"\",dms_E2_Projects_41)","v":""},null,"","","","","","",""]
[null,{"$f":"IF(ISBLANK(dms_E2_Projects_42),\"\",dms_E2_Projects_42)","v":""},null,"","","","","","",""]
[null,{"$f":"IF(ISBLANK(dms_E2_Projects_43),\"\",dms_E2_Projects_43)","v":""},null,"","","","","","",""]
[null,{"$f":"IF(ISBLANK(dms_E2_Projects_44),\"\",dms_E2_Projects_44)","v":""},null,"","","","","","",""]
[null,{"$f":"IF(ISBLANK(dms_E2_Projects_45),\"\",dms_E2_Projects_45)","v":""},null,"","","","","","",""]
[null,{"$f":"IF(ISBLANK(dms_E2_Projects_46),\"\",dms_E2_Projects_46)","v":""},null,"","","","","","",""]
[null,{"$f":"IF(ISBLANK(dms_E2_Projects_47),\"\",dms_E2_Projects_47)","v":""},null,"","","","","","",""]
[null,{"$f":"IF(ISBLANK(dms_E2_Projects_48),\"\",dms_E2_Projects_48)","v":""},null,"","","","","","",""]
[null,{"$f":"IF(ISBLANK(dms_E2_Projects_49),\"\",dms_E2_Projects_49)","v":""},null,"","","","","","",""]
[null,{"$f":"IF(ISBLANK(dms_E2_Projects_50),\"\",dms_E2_Projects_50)","v":""},null,"","","","","","",""]
[null,"Aggregate of other projects or categories with total expenditure of less than $500,000",null,0,0,0,0,0,0,0]
[null,null,"Total",{"$f":"SUM(D665:D715)","v":0},{"$f":"SUM(E665:E715)","v":0},0,0,0,0,0]
[]
[]
[null,"E2.2.2 - REACTIVE - BY CONNECTION TYPE"]
[null,null,null,"VOLUMES"]
[null,null,null,"0s"]
[null,null,null,{"$f":"dms_y1","v":"2023-24"},{"$f":"dms_y2","v":"2024-25"},{"$f":"dms_y3","v":"2025-26"},{"$f":"dms_y4","v":"2026-27"},{"$f":"dms_y5","v":"2027-28"},{"$f":"dms_y6","v":"2028-29"},{"$f":"dms_y7","v":"2029-30"}]
[null,"A. LOW PRESSURE TO HIGH PRESSURE"]
[null,"Mains","Length of mains replaced",0,0,0,0,0,0,0]
[null,"Services","Number of services replaced",0,0,0,0,0,0,0]
[null,null,"Total",{"$f":"SUM(D724:D725)","v":0},{"$f":"SUM(E724:E725)","v":0},0,0,0,0,0]
[null,"B. LOW PRESSURE TO MEDIUM PRESSURE"]
[null,"Mains","Length of mains replaced",0,0,0,0,0,0,0]
[null,"Services","Number of services replaced",0,0,0,0,0,0,0]
[null,null,"Total",{"$f":"SUM(D728:D729)","v":0},{"$f":"SUM(E728:E729)","v":0},0,0,0,0,0]
[null,"C. LOW PRESSURE TO LOW PRESSURE"]
[null,"Mains","Length of mains replaced",129.5,129.5,129.5,129.5,129.5,129.5,129.5]
[null,"Services","Number of services replaced",57.75,57.75,57.75,57.75,57.75,57.75,57.75]
[null,null,"Total",{"$f":"SUM(D732:D733)","v":187.25},{"$f":"SUM(E732:E733)","v":187.25},187.25,187.25,187.25,187.25,187.25]
[null,"D. MEDIUM PRESSURE TO MEDIUM PRESSURE"]
[null,"Mains","Length of mains replaced",523.04999999999995,523.04999999999995,523.04999999999995,523.04999999999995,523.04999999999995,523.04999999999995,523.04999999999995]
[null,"Services","Number of services replaced",196.5,196.5,196.5,196.5,196.5,196.5,196.5]
[null,null,"Total",{"$f":"SUM(D736:D737)","v":719.55},{"$f":"SUM(E736:E737)","v":719.55},719.55,719.55,719.55,719.55,719.55]
[null,"E. MEDIUM PRESSURE TO HIGH PRESSURE"]
[null,"Mains","Length of mains replaced",0,0,0,0,0,0,0]
[null,"Services","Number of services replaced",0,0,0,0,0,0,0]
[null,null,"Total",{"$f":"SUM(D740:D741)","v":0},{"$f":"SUM(E740:E741)","v":0},0,0,0,0,0]
[null,"F. HIGH PRESSURE TO HIGH PRESSURE"]
[null,"Mains","Length of mains replaced",0,0,0,0,0,0,0]
[null,"Services","Number of services replaced",0,0,0,0,0,0,0]
[null,null,"Total",{"$f":"SUM(D744:D745)","v":0},{"$f":"SUM(E744:E745)","v":0},0,0,0,0,0]

{"sheet":"E3. Mains Augex","index":5,"n_rows":697,"n_cols":9,"rows_kept":697,"cut":false,"hidden":false,"merged":[]}
[null,{"$f":"INDEX(dms_Worksheet_List,MATCH(dms_Model,dms_Model_List))","v":"REGULATORY REPORTING STATEMENT"}]
[null,{"$f":"dms_TradingNameFull","v":"Jemena Gas Networks (NSW) Ltd"}]
[null,{"$f":"dms_Header_Span","v":"2023-24 to 2029-30"}]
[null,"E3. MAINS AUGMENTATION"]
[null,"FINAL RIN TEMPLATE - FEBRUARY 2024"]
[]
[]
[null,"Please list all projects or categories here:"]
[null,"Figtree CDP - Stage 2 "]
[null,"Woolwich Low Pressure CDP "]
[null,"Box Hill CDP "]
[null,"North Sydney CDP "]
[null,"Umina Beach Low Pressure CDP "]
[null,"Auburn CDP "]
[null,"Blue Mountain Pressure Reduction Glenbrook-Springwood "]
[null,"Gymea Bay 210 kPa CDP "]
[null,"Edmondson Park Soldiers Pde steel main "]
[null,"Minor Capital - Mains Interconnect"]
[null,"Cecil Park CDP-Elizabeth Dr"]
[null,""]
[null,""]
[null,""]
[null,""]
[null,""]
[null,""]
[null,""]
[null,""]
[null,""]
[null,""]
[null,""]
[null,""]
[null,""]
[null,""]
[null,""]
[null,""]
[null,""]
[null,""]
[null,""]
[null,""]
[null,""]
[null,""]
[null,""]
[null,""]
[null,""]
[null,""]
[null,""]
[null,""]
[null,""]
[null,""]
[null,""]
[null,""]
[null,""]
[null,""]
[null,""]
[null,""]
[null,""]
[null,""]
[null,""]
[]
[]
[null,"E3.1 - CAPEX BY PROJECT"]
[null,"A. DIRECT INTERNAL LABOUR EXPENDITURE"]
[null,null,"EXPENDITURE"]
[null,null,{"$f":"CONCATENATE(\"$, real \",dms_DollarReal)","v":"$, real June 2025"}]
[null,null,{"$f":"dms_y1","v":"2023-24"},{"$f":"dms_y2","v":"2024-25"},{"$f":"dms_y3","v":"2025-26"},{"$f":"dms_y4","v":"2026-27"},{"$f":"dms_y5","v":"2027-28"},{"$f":"dms_y6","v":"2028-29"},{"$f":"dms_y7","v":"2029-30"}]
[null,{"$f":"IF(ISBLANK(dms_E3_Projects_01),\"\",dms_E3_Projects_01)","v":"Figtree CDP - Stage 2 "},0,0,0,0,0,20464.291290426074,5178.2203845597223]
[null,{"$f":"IF(ISBLANK(dms_E3_Projects_02),\"\",dms_E3_Projects_02)","v":"Woolwich Low Pressure CDP "},0,0,0,0,20793.494836126749,5110.6614025008812,0]
[null,{"$f":"IF(ISBLANK(dms_E3_Projects_03),\"\",dms_E3_Projects_03)","v":"Box Hill CDP "},0,1019.3646583646109,0,0,0,0,0]
[null,{"$f":"IF(ISBLANK(dms_E3_Projects_04),\"\",dms_E3_Projects_04)","v":"North Sydney CDP "},0,0,0,0,0,696.45685628401282,638.03246959402315]
[null,{"$f":"IF(ISBLANK(dms_E3_Projects_05),\"\",dms_E3_Projects_05)","v":"Umina Beach Low Pressure CDP "},0,0,0,1959.0237709887845,0,0,0]
[null,{"$f":"IF(ISBLANK(dms_E3_Projects_06),\"\",dms_E3_Projects_06)","v":"Auburn CDP "},0,0,1601.9191572476036,641.50100765127058,0,0,0]
[null,{"$f":"IF(ISBLANK(dms_E3_Projects_07),\"\",dms_E3_Projects_07)","v":"Blue Mountain Pressure Reduction Glenbrook-Springwood "},0,0,11767.716865883254,15978.601123840885,0,0,0]
[null,{"$f":"IF(ISBLANK(dms_E3_Projects_08),\"\",dms_E3_Projects_08)","v":"Gymea Bay 210 kPa CDP "},0,0,0,20395.400350369015,5200.5148752869709,0,0]
[null,{"$f":"IF(ISBLANK(dms_E3_Projects_09),\"\",dms_E3_Projects_09)","v":"Edmondson Park Soldiers Pde steel main "},0,41339.286440629054,85334.175658775857,0,0,0,0]
[null,{"$f":"IF(ISBLANK(dms_E3_Projects_10),\"\",dms_E3_Projects_10)","v":"Minor Capital - Mains Interconnect"},17880.718800121082,17907.156331936796,17941.373325417564,17965.434407247223,17988.092498194888,18014.813838730512,18043.867039678109]
[null,{"$f":"IF(ISBLANK(dms_E3_Projects_11),\"\",dms_E3_Projects_11)","v":"Cecil Park CDP-Elizabeth Dr"},16138.618934538354,0,0,0,0,0,0]
[null,{"$f":"IF(ISBLANK(dms_E3_Projects_12),\"\",dms_E3_Projects_12)","v":""},"","","","","","",""]
[null,{"$f":"IF(ISBLANK(dms_E3_Projects_13),\"\",dms_E3_Projects_13)","v":""},"","","","","","",""]
[null,{"$f":"IF(ISBLANK(dms_E3_Projects_14),\"\",dms_E3_Projects_14)","v":""},"","","","","","",""]
[null,{"$f":"IF(ISBLANK(dms_E3_Projects_15),\"\",dms_E3_Projects_15)","v":""},"","","","","","",""]
[null,{"$f":"IF(ISBLANK(dms_E3_Projects_16),\"\",dms_E3_Projects_16)","v":""},"","","","","","",""]
[null,{"$f":"IF(ISBLANK(dms_E3_Projects_17),\"\",dms_E3_Projects_17)","v":""},"","","","","","",""]
[null,{"$f":"IF(ISBLANK(dms_E3_Projects_18),\"\",dms_E3_Projects_18)","v":""},"","","","","","",""]
[null,{"$f":"IF(ISBLANK(dms_E3_Projects_18),\"\",dms_E3_Projects_18)","v":""},"","","","","","",""]
[null,{"$f":"IF(ISBLANK(dms_E3_Projects_19),\"\",dms_E3_Projects_19)","v":""},"","","","","","",""]
[null,{"$f":"IF(ISBLANK(dms_E3_Projects_20),\"\",dms_E3_Projects_20)","v":""},"","","","","","",""]
[null,{"$f":"IF(ISBLANK(dms_E3_Projects_21),\"\",dms_E3_Projects_21)","v":""},"","","","","","",""]
[null,{"$f":"IF(ISBLANK(dms_E3_Projects_22),\"\",dms_E3_Projects_22)","v":""},"","","","","","",""]
[null,{"$f":"IF(ISBLANK(dms_E3_Projects_23),\"\",dms_E3_Projects_23)","v":""},"","","","","","",""]
[null,{"$f":"IF(ISBLANK(dms_E3_Projects_24),\"\",dms_E3_Projects_24)","v":""},"","","","","","",""]
[null,{"$f":"IF(ISBLANK(dms_E3_Projects_25),\"\",dms_E3_Projects_26)","v":""},"","","","","","",""]
[null,{"$f":"IF(ISBLANK(dms_E3_Projects_27),\"\",dms_E3_Projects_27)","v":""},"","","","","","",""]
[null,{"$f":"IF(ISBLANK(dms_E3_Projects_28),\"\",dms_E3_Projects_28)","v":""},"","","","","","",""]
[null,{"$f":"IF(ISBLANK(dms_E3_Projects_29),\"\",dms_E3_Projects_29)","v":""},"","","","","","",""]
[null,{"$f":"IF(ISBLANK(dms_E3_Projects_30),\"\",dms_E3_Projects_30)","v":""},"","","","","","",""]
[null,{"$f":"IF(ISBLANK(dms_E3_Projects_31),\"\",dms_E3_Projects_31)","v":""},"","","","","","",""]
[null,{"$f":"IF(ISBLANK(dms_E3_Projects_32),\"\",dms_E3_Projects_32)","v":""},"","","","","","",""]
[null,{"$f":"IF(ISBLANK(dms_E3_Projects_33),\"\",dms_E3_Projects_33)","v":""},"","","","","","",""]
[null,{"$f":"IF(ISBLANK(dms_E3_Projects_34),\"\",dms_E3_Projects_34)","v":""},"","","","","","",""]
[null,{"$f":"IF(ISBLANK(dms_E3_Projects_35),\"\",dms_E3_Projects_35)","v":""},"","","","","","",""]
[null,{"$f":"IF(ISBLANK(dms_E3_Projects_36),\"\",dms_E3_Projects_36)","v":""},"","","","","","",""]
[null,{"$f":"IF(ISBLANK(dms_E3_Projects_37),\"\",dms_E3_Projects_37)","v":""},"","","","","","",""]
[null,{"$f":"IF(ISBLANK(dms_E3_Projects_38),\"\",dms_E3_Projects_38)","v":""},"","","","","","",""]
[null,{"$f":"IF(ISBLANK(dms_E3_Projects_39),\"\",dms_E3_Projects_39)","v":""},"","","","","","",""]
[null,{"$f":"IF(ISBLANK(dms_E3_Projects_40),\"\",dms_E3_Projects_40)","v":""},"","","","","","",""]
[null,{"$f":"IF(ISBLANK(dms_E3_Projects_41),\"\",dms_E3_Projects_41)","v":""},"","","","","","",""]
[null,{"$f":"IF(ISBLANK(dms_E3_Projects_42),\"\",dms_E3_Projects_42)","v":""},"","","","","","",""]
[null,{"$f":"IF(ISBLANK(dms_E3_Projects_43),\"\",dms_E3_Projects_43)","v":""},"","","","","","",""]
[null,{"$f":"IF(ISBLANK(dms_E3_Projects_44),\"\",dms_E3_Projects_44)","v":""},"","","","","","",""]
[null,{"$f":"IF(ISBLANK(dms_E3_Projects_45),\"\",dms_E3_Projects_45)","v":""},"","","","","","",""]
[null,{"$f":"IF(ISBLANK(dms_E3_Projects_46),\"\",dms_E3_Projects_46)","v":""},"","","","","","",""]
[null,{"$f":"IF(ISBLANK(dms_E3_Projects_47),\"\",dms_E3_Projects_47)","v":""},"","","","","","",""]
[null,{"$f":"IF(ISBLANK(dms_E3_Projects_48),\"\",dms_E3_Projects_48)","v":""},"","","","","","",""]
[null,{"$f":"IF(ISBLANK(dms_E3_Projects_49),\"\",dms_E3_Projects_49)","v":""},"","","","","","",""]
[null,{"$f":"IF(ISBLANK(dms_E3_Projects_50),\"\",dms_E3_Projects_50)","v":""},"","","","","","",""]
[null,"Aggregate of other projects or categories with total expenditure of less than $500,000",3034.5797331009308,10822.767978104297,20092.433014421535,5052.8917354136647,716.51782686813385,315.60862606026785,0]
[null,"Total",{"$f":"SUM(C66:C116)","v":37053.917467760366},{"$f":"SUM(D66:D116)","v":71088.575409034762},136737.61802174582,61992.852395510847,44698.620036476743,44601.832014001753,23860.119893831856]
[]
[null,"B. DIRECT CONTRACTOR EXPENDITURE"]
[null,null,"EXPENDITURE"]
[null,null,{"$f":"CONCATENATE(\"$, real \",dms_DollarReal)","v":"$, real June 2025"}]
[null,null,{"$f":"dms_y1","v":"2023-24"},{"$f":"dms_y2","v":"2024-25"},{"$f":"dms_y3","v":"2025-26"},{"$f":"dms_y4","v":"2026-27"},{"$f":"dms_y5","v":"2027-28"},{"$f":"dms_y6","v":"2028-29"},{"$f":"dms_y7","v":"2029-30"}]
[null,{"$f":"IF(ISBLANK(dms_E3_Projects_01),\"\",dms_E3_Projects_01)","v":"Figtree CDP - Stage 2 "}]
[null,{"$f":"IF(ISBLANK(dms_E3_Projects_02),\"\",dms_E3_Projects_02)","v":"Woolwich Low Pressure CDP "}]
[null,{"$f":"IF(ISBLANK(dms_E3_Projects_03),\"\",dms_E3_Projects_03)","v":"Box Hill CDP "}]
[null,{"$f":"IF(ISBLANK(dms_E3_Projects_04),\"\",dms_E3_Projects_04)","v":"North Sydney CDP "}]
[null,{"$f":"IF(ISBLANK(dms_E3_Projects_05),\"\",dms_E3_Projects_05)","v":"Umina Beach Low Pressure CDP "}]
[null,{"$f":"IF(ISBLANK(dms_E3_Projects_06),\"\",dms_E3_Projects_06)","v":"Auburn CDP "}]
[null,{"$f":"IF(ISBLANK(dms_E3_Projects_07),\"\",dms_E3_Projects_07)","v":"Blue Mountain Pressure Reduction Glenbrook-Springwood "}]
[null,{"$f":"IF(ISBLANK(dms_E3_Projects_08),\"\",dms_E3_Projects_08)","v":"Gymea Bay 210 kPa CDP "}]
[null,{"$f":"IF(ISBLANK(dms_E3_Projects_09),\"\",dms_E3_Projects_09)","v":"Edmondson Park Soldiers Pde steel main "}]
[null,{"$f":"IF(ISBLANK(dms_E3_Projects_10),\"\",dms_E3_Projects_10)","v":"Minor Capital - Mains Interconnect"}]
[null,{"$f":"IF(ISBLANK(dms_E3_Projects_11),\"\",dms_E3_Projects_11)","v":"Cecil Park CDP-Elizabeth Dr"}]
[null,{"$f":"IF(ISBLANK(dms_E3_Projects_12),\"\",dms_E3_Projects_12)","v":""},"","","","","","",""]
[null,{"$f":"IF(ISBLANK(dms_E3_Projects_13),\"\",dms_E3_Projects_13)","v":""},"","","","","","",""]
[null,{"$f":"IF(ISBLANK(dms_E3_Projects_14),\"\",dms_E3_Projects_14)","v":""},"","","","","","",""]
[null,{"$f":"IF(ISBLANK(dms_E3_Projects_15),\"\",dms_E3_Projects_15)","v":""},"","","","","","",""]
[null,{"$f":"IF(ISBLANK(dms_E3_Projects_16),\"\",dms_E3_Projects_16)","v":""},"","","","","","",""]
[null,{"$f":"IF(ISBLANK(dms_E3_Projects_17),\"\",dms_E3_Projects_17)","v":""},"","","","","","",""]
[null,{"$f":"IF(ISBLANK(dms_E3_Projects_18),\"\",dms_E3_Projects_18)","v":""},"","","","","","",""]
[null,{"$f":"IF(ISBLANK(dms_E3_Projects_18),\"\",dms_E3_Projects_18)","v":""},"","","","","","",""]
[null,{"$f":"IF(ISBLANK(dms_E3_Projects_19),\"\",dms_E3_Projects_19)","v":""},"","","","","","",""]
[null,{"$f":"IF(ISBLANK(dms_E3_Projects_20),\"\",dms_E3_Projects_20)","v":""},"","","","","","",""]
[null,{"$f":"IF(ISBLANK(dms_E3_Projects_21),\"\",dms_E3_Projects_21)","v":""},"","","","","","",""]
[null,{"$f":"IF(ISBLANK(dms_E3_Projects_22),\"\",dms_E3_Projects_22)","v":""},"","","","","","",""]
[null,{"$f":"IF(ISBLANK(dms_E3_Projects_23),\"\",dms_E3_Projects_23)","v":""},"","","","","","",""]
[null,{"$f":"IF(ISBLANK(dms_E3_Projects_24),\"\",dms_E3_Projects_24)","v":""},"","","","","","",""]
[null,{"$f":"IF(ISBLANK(dms_E3_Projects_25),\"\",dms_E3_Projects_26)","v":""},"","","","","","",""]
[null,{"$f":"IF(ISBLANK(dms_E3_Projects_27),\"\",dms_E3_Projects_27)","v":""},"","","","","","",""]
[null,{"$f":"IF(ISBLANK(dms_E3_Projects_28),\"\",dms_E3_Projects_28)","v":""},"","","","","","",""]
[null,{"$f":"IF(ISBLANK(dms_E3_Projects_29),\"\",dms_E3_Projects_29)","v":""},"","","","","","",""]
[null,{"$f":"IF(ISBLANK(dms_E3_Projects_30),\"\",dms_E3_Projects_30)","v":""},"","","","","","",""]
[null,{"$f":"IF(ISBLANK(dms_E3_Projects_31),\"\",dms_E3_Projects_31)","v":""},"","","","","","",""]
[null,{"$f":"IF(ISBLANK(dms_E3_Projects_32),\"\",dms_E3_Projects_32)","v":""},"","","","","","",""]
[null,{"$f":"IF(ISBLANK(dms_E3_Projects_33),\"\",dms_E3_Projects_33)","v":""},"","","","","","",""]
[null,{"$f":"IF(ISBLANK(dms_E3_Projects_34),\"\",dms_E3_Projects_34)","v":""},"","","","","","",""]
[null,{"$f":"IF(ISBLANK(dms_E3_Projects_35),\"\",dms_E3_Projects_35)","v":""},"","","","","","",""]
[null,{"$f":"IF(ISBLANK(dms_E3_Projects_36),\"\",dms_E3_Projects_36)","v":""},"","","","","","",""]
[null,{"$f":"IF(ISBLANK(dms_E3_Projects_37),\"\",dms_E3_Projects_37)","v":""},"","","","","","",""]
[null,{"$f":"IF(ISBLANK(dms_E3_Projects_38),\"\",dms_E3_Projects_38)","v":""},"","","","","","",""]
[null,{"$f":"IF(ISBLANK(dms_E3_Projects_39),\"\",dms_E3_Projects_39)","v":""},"","","","","","",""]
[null,{"$f":"IF(ISBLANK(dms_E3_Projects_40),\"\",dms_E3_Projects_40)","v":""},"","","","","","",""]
[null,{"$f":"IF(ISBLANK(dms_E3_Projects_41),\"\",dms_E3_Projects_41)","v":""},"","","","","","",""]
[null,{"$f":"IF(ISBLANK(dms_E3_Projects_42),\"\",dms_E3_Projects_42)","v":""},"","","","","","",""]
[null,{"$f":"IF(ISBLANK(dms_E3_Projects_43),\"\",dms_E3_Projects_43)","v":""},"","","","","","",""]
[null,{"$f":"IF(ISBLANK(dms_E3_Projects_44),\"\",dms_E3_Projects_44)","v":""},"","","","","","",""]
[null,{"$f":"IF(ISBLANK(dms_E3_Projects_45),\"\",dms_E3_Projects_45)","v":""},"","","","","","",""]
[null,{"$f":"IF(ISBLANK(dms_E3_Projects_46),\"\",dms_E3_Projects_46)","v":""},"","","","","","",""]
[null,{"$f":"IF(ISBLANK(dms_E3_Projects_47),\"\",dms_E3_Projects_47)","v":""},"","","","","","",""]
[null,{"$f":"IF(ISBLANK(dms_E3_Projects_48),\"\",dms_E3_Projects_48)","v":""},"","","","","","",""]
[null,{"$f":"IF(ISBLANK(dms_E3_Projects_49),\"\",dms_E3_Projects_49)","v":""},"","","","","","",""]
[null,{"$f":"IF(ISBLANK(dms_E3_Projects_50),\"\",dms_E3_Projects_50)","v":""},"","","","","","",""]
[null,"Aggregate of other projects or categories with total expenditure of less than $500,000"]
[null,"Total"]
[]
[null,"C. DIRECT MATERIAL EXPENDITURE"]
[null,null,"EXPENDITURE"]
[null,null,{"$f":"CONCATENATE(\"$, real \",dms_DollarReal)","v":"$, real June 2025"}]
[null,null,{"$f":"dms_y1","v":"2023-24"},{"$f":"dms_y2","v":"2024-25"},{"$f":"dms_y3","v":"2025-26"},{"$f":"dms_y4","v":"2026-27"},{"$f":"dms_y5","v":"2027-28"},{"$f":"dms_y6","v":"2028-29"},{"$f":"dms_y7","v":"2029-30"}]
[null,{"$f":"IF(ISBLANK(dms_E3_Projects_01),\"\",dms_E3_Projects_01)","v":"Figtree CDP - Stage 2 "},0,0,0,0,0,0,0]
[null,{"$f":"IF(ISBLANK(dms_E3_Projects_02),\"\",dms_E3_Projects_02)","v":"Woolwich Low Pressure CDP "},0,0,0,0,0,0,0]
[null,{"$f":"IF(ISBLANK(dms_E3_Projects_03),\"\",dms_E3_Projects_03)","v":"Box Hill CDP "},0,0,0,0,0,0,0]
[null,{"$f":"IF(ISBLANK(dms_E3_Projects_04),\"\",dms_E3_Projects_04)","v":"North Sydney CDP "},0,0,0,0,0,0,0]
[null,{"$f":"IF(ISBLANK(dms_E3_Projects_05),\"\",dms_E3_Projects_05)","v":"Umina Beach Low Pressure CDP "},0,0,0,0,0,0,0]
[null,{"$f":"IF(ISBLANK(dms_E3_Projects_06),\"\",dms_E3_Projects_06)","v":"Auburn CDP "},0,0,0,0,0,0,0]
[null,{"$f":"IF(ISBLANK(dms_E3_Projects_07),\"\",dms_E3_Projects_07)","v":"Blue Mountain Pressure Reduction Glenbrook-Springwood "},0,0,0,0,0,0,0]
[null,{"$f":"IF(ISBLANK(dms_E3_Projects_08),\"\",dms_E3_Projects_08)","v":"Gymea Bay 210 kPa CDP "},0,0,0,0,0,0,0]
[null,{"$f":"IF(ISBLANK(dms_E3_Projects_09),\"\",dms_E3_Projects_09)","v":"Edmondson Park Soldiers Pde steel main "},0,0,0,0,0,0,0]
[null,{"$f":"IF(ISBLANK(dms_E3_Projects_10),\"\",dms_E3_Projects_10)","v":"Minor Capital - Mains Interconnect"},0,0,0,0,0,0,0]
[null,{"$f":"IF(ISBLANK(dms_E3_Projects_11),\"\",dms_E3_Projects_11)","v":"Cecil Park CDP-Elizabeth Dr"},0,0,0,0,0,0,0]
[null,{"$f":"IF(ISBLANK(dms_E3_Projects_12),\"\",dms_E3_Projects_12)","v":""},"","","","","","",""]
[null,{"$f":"IF(ISBLANK(dms_E3_Projects_13),\"\",dms_E3_Projects_13)","v":""},"","","","","","",""]
[null,{"$f":"IF(ISBLANK(dms_E3_Projects_14),\"\",dms_E3_Projects_14)","v":""},"","","","","","",""]
[null,{"$f":"IF(ISBLANK(dms_E3_Projects_15),\"\",dms_E3_Projects_15)","v":""},"","","","","","",""]
[null,{"$f":"IF(ISBLANK(dms_E3_Projects_16),\"\",dms_E3_Projects_16)","v":""},"","","","","","",""]
[null,{"$f":"IF(ISBLANK(dms_E3_Projects_17),\"\",dms_E3_Projects_17)","v":""},"","","","","","",""]
[null,{"$f":"IF(ISBLANK(dms_E3_Projects_18),\"\",dms_E3_Projects_18)","v":""},"","","","","","",""]
[null,{"$f":"IF(ISBLANK(dms_E3_Projects_18),\"\",dms_E3_Projects_18)","v":""},"","","","","","",""]
[null,{"$f":"IF(ISBLANK(dms_E3_Projects_19),\"\",dms_E3_Projects_19)","v":""},"","","","","","",""]
[null,{"$f":"IF(ISBLANK(dms_E3_Projects_20),\"\",dms_E3_Projects_20)","v":""},"","","","","","",""]
[null,{"$f":"IF(ISBLANK(dms_E3_Projects_21),\"\",dms_E3_Projects_21)","v":""},"","","","","","",""]
[null,{"$f":"IF(ISBLANK(dms_E3_Projects_22),\"\",dms_E3_Projects_22)","v":""},"","","","","","",""]
[null,{"$f":"IF(ISBLANK(dms_E3_Projects_23),\"\",dms_E3_Projects_23)","v":""},"","","","","","",""]
[null,{"$f":"IF(ISBLANK(dms_E3_Projects_24),\"\",dms_E3_Projects_24)","v":""},"","","","","","",""]
[null,{"$f":"IF(ISBLANK(dms_E3_Projects_25),\"\",dms_E3_Projects_26)","v":""},"","","","","","",""]
[null,{"$f":"IF(ISBLANK(dms_E3_Projects_27),\"\",dms_E3_Projects_27)","v":""},"","","","","","",""]
[null,{"$f":"IF(ISBLANK(dms_E3_Projects_28),\"\",dms_E3_Projects_28)","v":""},"","","","","","",""]
[null,{"$f":"IF(ISBLANK(dms_E3_Projects_29),\"\",dms_E3_Projects_29)","v":""},"","","","","","",""]
[null,{"$f":"IF(ISBLANK(dms_E3_Projects_30),\"\",dms_E3_Projects_30)","v":""},"","","","","","",""]
[null,{"$f":"IF(ISBLANK(dms_E3_Projects_31),\"\",dms_E3_Projects_31)","v":""},"","","","","","",""]
[null,{"$f":"IF(ISBLANK(dms_E3_Projects_32),\"\",dms_E3_Projects_32)","v":""},"","","","","","",""]
[null,{"$f":"IF(ISBLANK(dms_E3_Projects_33),\"\",dms_E3_Projects_33)","v":""},"","","","","","",""]
[null,{"$f":"IF(ISBLANK(dms_E3_Projects_34),\"\",dms_E3_Projects_34)","v":""},"","","","","","",""]
[null,{"$f":"IF(ISBLANK(dms_E3_Projects_35),\"\",dms_E3_Projects_35)","v":""},"","","","","","",""]
[null,{"$f":"IF(ISBLANK(dms_E3_Projects_36),\"\",dms_E3_Projects_36)","v":""},"","","","","","",""]
[null,{"$f":"IF(ISBLANK(dms_E3_Projects_37),\"\",dms_E3_Projects_37)","v":""},"","","","","","",""]
[null,{"$f":"IF(ISBLANK(dms_E3_Projects_38),\"\",dms_E3_Projects_38)","v":""},"","","","","","",""]
[null,{"$f":"IF(ISBLANK(dms_E3_Projects_39),\"\",dms_E3_Projects_39)","v":""},"","","","","","",""]
[null,{"$f":"IF(ISBLANK(dms_E3_Projects_40),\"\",dms_E3_Projects_40)","v":""},"","","","","","",""]
[null,{"$f":"IF(ISBLANK(dms_E3_Projects_41),\"\",dms_E3_Projects_41)","v":""},"","","","","","",""]
[null,{"$f":"IF(ISBLANK(dms_E3_Projects_42),\"\",dms_E3_Projects_42)","v":""},"","","","","","",""]
[null,{"$f":"IF(ISBLANK(dms_E3_Projects_43),\"\",dms_E3_Projects_43)","v":""},"","","","","","",""]
[null,{"$f":"IF(ISBLANK(dms_E3_Projects_44),\"\",dms_E3_Projects_44)","v":""},"","","","","","",""]
[null,{"$f":"IF(ISBLANK(dms_E3_Projects_45),\"\",dms_E3_Projects_45)","v":""},"","","","","","",""]
[null,{"$f":"IF(ISBLANK(dms_E3_Projects_46),\"\",dms_E3_Projects_46)","v":""},"","","","","","",""]
[null,{"$f":"IF(ISBLANK(dms_E3_Projects_47),\"\",dms_E3_Projects_47)","v":""},"","","","","","",""]
[null,{"$f":"IF(ISBLANK(dms_E3_Projects_48),\"\",dms_E3_Projects_48)","v":""},"","","","","","",""]
[null,{"$f":"IF(ISBLANK(dms_E3_Projects_49),\"\",dms_E3_Projects_49)","v":""},"","","","","","",""]
[null,{"$f":"IF(ISBLANK(dms_E3_Projects_50),\"\",dms_E3_Projects_50)","v":""},"","","","","","",""]
[null,"Aggregate of other projects or categories with total expenditure of less than $500,000",0,0,0,0,0,0,0]
[null,"Total",{"$f":"SUM(C180:C230)","v":0},{"$f":"SUM(D180:D230)","v":0},0,0,0,0,0]
[]
[null,"D. OTHER DIRECT EXPENDITURE"]
[null,null,"EXPENDITURE"]
[null,null,{"$f":"CONCATENATE(\"$, real \",dms_DollarReal)","v":"$, real June 2025"}]
[null,null,{"$f":"dms_y1","v":"2023-24"},{"$f":"dms_y2","v":"2024-25"},{"$f":"dms_y3","v":"2025-26"},{"$f":"dms_y4","v":"2026-27"},{"$f":"dms_y5","v":"2027-28"},{"$f":"dms_y6","v":"2028-29"},{"$f":"dms_y7","v":"2029-30"}]
[null,{"$f":"IF(ISBLANK(dms_E3_Projects_01),\"\",dms_E3_Projects_01)","v":"Figtree CDP - Stage 2 "},0,0,0,0,0,0,58809.554977386608]
[null,{"$f":"IF(ISBLANK(dms_E3_Projects_02),\"\",dms_E3_Projects_02)","v":"Woolwich Low Pressure CDP "},0,0,0,0,0,113439.44641970417,0]
[null,{"$f":"IF(ISBLANK(dms_E3_Projects_03),\"\",dms_E3_Projects_03)","v":"Box Hill CDP "},0,0,90867.843216903086,0,0,0,0]
[null,{"$f":"IF(ISBLANK(dms_E3_Projects_04),\"\",dms_E3_Projects_04)","v":"North Sydney CDP "},0,0,0,0,0,0,377226.73845572578]
[null,{"$f":"IF(ISBLANK(dms_E3_Projects_05),\"\",dms_E3_Projects_05)","v":"Umina Beach Low Pressure CDP "},0,0,0,57482.526137131514,0,0,0]
[null,{"$f":"IF(ISBLANK(dms_E3_Projects_06),\"\",dms_E3_Projects_06)","v":"Auburn CDP "},0,0,0,119285.6747098268,0,0,0]
[null,{"$f":"IF(ISBLANK(dms_E3_Projects_07),\"\",dms_E3_Projects_07)","v":"Blue Mountain Pressure Reduction Glenbrook-Springwood "},0,0,0,45133.057701292972,0,0,0]
[null,{"$f":"IF(ISBLANK(dms_E3_Projects_08),\"\",dms_E3_Projects_08)","v":"Gymea Bay 210 kPa CDP "},0,0,0,0,80342.988593057875,0,0]
[null,{"$f":"IF(ISBLANK(dms_E3_Projects_09),\"\",dms_E3_Projects_09)","v":"Edmondson Park Soldiers Pde steel main "},0,0,0,0,0,0,0]
[null,{"$f":"IF(ISBLANK(dms_E3_Projects_10),\"\",dms_E3_Projects_10)","v":"Minor Capital - Mains Interconnect"},13666.610252716224,13686.817015509603,13712.969784822113,13731.360176802462,13748.678233280722,13769.101917060592,13791.307890902201]
[null,{"$f":"IF(ISBLANK(dms_E3_Projects_11),\"\",dms_E3_Projects_11)","v":"Cecil Park CDP-Elizabeth Dr"},12335.086607029943,0,0,0,0,0,0]
[null,{"$f":"IF(ISBLANK(dms_E3_Projects_12),\"\",dms_E3_Projects_12)","v":""},"","","","","","",""]
[null,{"$f":"IF(ISBLANK(dms_E3_Projects_13),\"\",dms_E3_Projects_13)","v":""},"","","","","","",""]
[null,{"$f":"IF(ISBLANK(dms_E3_Projects_14),\"\",dms_E3_Projects_14)","v":""},"","","","","","",""]
[null,{"$f":"IF(ISBLANK(dms_E3_Projects_15),\"\",dms_E3_Projects_15)","v":""},"","","","","","",""]
[null,{"$f":"IF(ISBLANK(dms_E3_Projects_16),\"\",dms_E3_Projects_16)","v":""},"","","","","","",""]
[null,{"$f":"IF(ISBLANK(dms_E3_Projects_17),\"\",dms_E3_Projects_17)","v":""},"","","","","","",""]
[null,{"$f":"IF(ISBLANK(dms_E3_Projects_18),\"\",dms_E3_Projects_18)","v":""},"","","","","","",""]
[null,{"$f":"IF(ISBLANK(dms_E3_Projects_18),\"\",dms_E3_Projects_18)","v":""},"","","","","","",""]
[null,{"$f":"IF(ISBLANK(dms_E3_Projects_19),\"\",dms_E3_Projects_19)","v":""},"","","","","","",""]
[null,{"$f":"IF(ISBLANK(dms_E3_Projects_20),\"\",dms_E3_Projects_20)","v":""},"","","","","","",""]
[null,{"$f":"IF(ISBLANK(dms_E3_Projects_21),\"\",dms_E3_Projects_21)","v":""},"","","","","","",""]
[null,{"$f":"IF(ISBLANK(dms_E3_Projects_22),\"\",dms_E3_Projects_22)","v":""},"","","","","","",""]
[null,{"$f":"IF(ISBLANK(dms_E3_Projects_23),\"\",dms_E3_Projects_23)","v":""},"","","","","","",""]
[null,{"$f":"IF(ISBLANK(dms_E3_Projects_24),\"\",dms_E3_Projects_24)","v":""},"","","","","","",""]
[null,{"$f":"IF(ISBLANK(dms_E3_Projects_25),\"\",dms_E3_Projects_26)","v":""},"","","","","","",""]
[null,{"$f":"IF(ISBLANK(dms_E3_Projects_27),\"\",dms_E3_Projects_27)","v":""},"","","","","","",""]
[null,{"$f":"IF(ISBLANK(dms_E3_Projects_28),\"\",dms_E3_Projects_28)","v":""},"","","","","","",""]
[null,{"$f":"IF(ISBLANK(dms_E3_Projects_29),\"\",dms_E3_Projects_29)","v":""},"","","","","","",""]
[null,{"$f":"IF(ISBLANK(dms_E3_Projects_30),\"\",dms_E3_Projects_30)","v":""},"","","","","","",""]
[null,{"$f":"IF(ISBLANK(dms_E3_Projects_31),\"\",dms_E3_Projects_31)","v":""},"","","","","","",""]
[null,{"$f":"IF(ISBLANK(dms_E3_Projects_32),\"\",dms_E3_Projects_32)","v":""},"","","","","","",""]
[null,{"$f":"IF(ISBLANK(dms_E3_Projects_33),\"\",dms_E3_Projects_33)","v":""},"","","","","","",""]
[null,{"$f":"IF(ISBLANK(dms_E3_Projects_34),\"\",dms_E3_Projects_34)","v":""},"","","","","","",""]
[null,{"$f":"IF(ISBLANK(dms_E3_Projects_35),\"\",dms_E3_Projects_35)","v":""},"","","","","","",""]
[null,{"$f":"IF(ISBLANK(dms_E3_Projects_36),\"\",dms_E3_Projects_36)","v":""},"","","","","","",""]
[null,{"$f":"IF(ISBLANK(dms_E3_Projects_37),\"\",dms_E3_Projects_37)","v":""},"","","","","","",""]
[null,{"$f":"IF(ISBLANK(dms_E3_Projects_38),\"\",dms_E3_Projects_38)","v":""},"","","","","","",""]
[null,{"$f":"IF(ISBLANK(dms_E3_Projects_39),\"\",dms_E3_Projects_39)","v":""},"","","","","","",""]
[null,{"$f":"IF(ISBLANK(dms_E3_Projects_40),\"\",dms_E3_Projects_40)","v":""},"","","","","","",""]
[null,{"$f":"IF(ISBLANK(dms_E3_Projects_41),\"\",dms_E3_Projects_41)","v":""},"","","","","","",""]
[null,{"$f":"IF(ISBLANK(dms_E3_Projects_42),\"\",dms_E3_Projects_42)","v":""},"","","","","","",""]
[null,{"$f":"IF(ISBLANK(dms_E3_Projects_43),\"\",dms_E3_Projects_43)","v":""},"","","","","","",""]
[null,{"$f":"IF(ISBLANK(dms_E3_Projects_44),\"\",dms_E3_Projects_44)","v":""},"","","","","","",""]
[null,{"$f":"IF(ISBLANK(dms_E3_Projects_45),\"\",dms_E3_Projects_45)","v":""},"","","","","","",""]
[null,{"$f":"IF(ISBLANK(dms_E3_Projects_46),\"\",dms_E3_Projects_46)","v":""},"","","","","","",""]
[null,{"$f":"IF(ISBLANK(dms_E3_Projects_47),\"\",dms_E3_Projects_47)","v":""},"","","","","","",""]
[null,{"$f":"IF(ISBLANK(dms_E3_Projects_48),\"\",dms_E3_Projects_48)","v":""},"","","","","","",""]
[null,{"$f":"IF(ISBLANK(dms_E3_Projects_49),\"\",dms_E3_Projects_49)","v":""},"","","","","","",""]
[null,{"$f":"IF(ISBLANK(dms_E3_Projects_50),\"\",dms_E3_Projects_50)","v":""},"","","","","","",""]
[null,"Aggregate of other projects or categories with total expenditure of less than $500,000",2319.3932501640411,8272.069678279795,0,27823.195707879873,0,36530.503313826906,0]
[null,"Total",{"$f":"SUM(C237:C287)","v":28321.090109910208},{"$f":"SUM(D237:D287)","v":21958.886693789398},104580.8130017252,263455.81443293364,94091.666826338595,163739.05165059166,449827.6013240146]
[]
[null,"E. RELATED PARTY MARGIN EXPENDITURE"]
[null,null,"EXPENDITURE"]
[null,null,{"$f":"CONCATENATE(\"$, real \",dms_DollarReal)","v":"$, real June 2025"}]
[null,null,{"$f":"dms_y1","v":"2023-24"},{"$f":"dms_y2","v":"2024-25"},{"$f":"dms_y3","v":"2025-26"},{"$f":"dms_y4","v":"2026-27"},{"$f":"dms_y5","v":"2027-28"},{"$f":"dms_y6","v":"2028-29"},{"$f":"dms_y7","v":"2029-30"}]
[null,"Total"]
[null,"Total"]
[]
[null,"F. CAPITAL CONTRIBUTIONS included in the above"]
[null,null,"EXPENDITURE"]
[null,null,{"$f":"CONCATENATE(\"$, real \",dms_DollarReal)","v":"$, real June 2025"}]
[null,null,{"$f":"dms_y1","v":"2023-24"},{"$f":"dms_y2","v":"2024-25"},{"$f":"dms_y3","v":"2025-26"},{"$f":"dms_y4","v":"2026-27"},{"$f":"dms_y5","v":"2027-28"},{"$f":"dms_y6","v":"2028-29"},{"$f":"dms_y7","v":"2029-30"}]
[null,{"$f":"IF(ISBLANK(dms_E3_Projects_01),\"\",dms_E3_Projects_01)","v":"Figtree CDP - Stage 2 "},0,0,0,0,0,0,0]
[null,{"$f":"IF(ISBLANK(dms_E3_Projects_02),\"\",dms_E3_Projects_02)","v":"Woolwich Low Pressure CDP "},0,0,0,0,0,0,0]
[null,{"$f":"IF(ISBLANK(dms_E3_Projects_03),\"\",dms_E3_Projects_03)","v":"Box Hill CDP "},0,0,0,0,0,0,0]
[null,{"$f":"IF(ISBLANK(dms_E3_Projects_04),\"\",dms_E3_Projects_04)","v":"North Sydney CDP "},0,0,0,0,0,0,0]
[null,{"$f":"IF(ISBLANK(dms_E3_Projects_05),\"\",dms_E3_Projects_05)","v":"Umina Beach Low Pressure CDP "},0,0,0,0,0,0,0]
[null,{"$f":"IF(ISBLANK(dms_E3_Projects_06),\"\",dms_E3_Projects_06)","v":"Auburn CDP "},0,0,0,0,0,0,0]
[null,{"$f":"IF(ISBLANK(dms_E3_Projects_07),\"\",dms_E3_Projects_07)","v":"Blue Mountain Pressure Reduction Glenbrook-Springwood "},0,0,0,0,0,0,0]
[null,{"$f":"IF(ISBLANK(dms_E3_Projects_08),\"\",dms_E3_Projects_08)","v":"Gymea Bay 210 kPa CDP "},0,0,0,0,0,0,0]
[null,{"$f":"IF(ISBLANK(dms_E3_Projects_09),\"\",dms_E3_Projects_09)","v":"Edmondson Park Soldiers Pde steel main "},0,0,0,0,0,0,0]
[null,{"$f":"IF(ISBLANK(dms_E3_Projects_10),\"\",dms_E3_Projects_10)","v":"Minor Capital - Mains Interconnect"},0,0,0,0,0,0,0]
[null,{"$f":"IF(ISBLANK(dms_E3_Projects_11),\"\",dms_E3_Projects_11)","v":"Cecil Park CDP-Elizabeth Dr"},0,0,0,0,0,0,0]
[null,{"$f":"IF(ISBLANK(dms_E3_Projects_12),\"\",dms_E3_Projects_12)","v":""},"","","","","","",""]
[null,{"$f":"IF(ISBLANK(dms_E3_Projects_13),\"\",dms_E3_Projects_13)","v":""},"","","","","","",""]
[null,{"$f":"IF(ISBLANK(dms_E3_Projects_14),\"\",dms_E3_Projects_14)","v":""},"","","","","","",""]
[null,{"$f":"IF(ISBLANK(dms_E3_Projects_15),\"\",dms_E3_Projects_15)","v":""},"","","","","","",""]
[null,{"$f":"IF(ISBLANK(dms_E3_Projects_16),\"\",dms_E3_Projects_16)","v":""},"","","","","","",""]
[null,{"$f":"IF(ISBLANK(dms_E3_Projects_17),\"\",dms_E3_Projects_17)","v":""},"","","","","","",""]
[null,{"$f":"IF(ISBLANK(dms_E3_Projects_18),\"\",dms_E3_Projects_18)","v":""},"","","","","","",""]
[null,{"$f":"IF(ISBLANK(dms_E3_Projects_18),\"\",dms_E3_Projects_18)","v":""},"","","","","","",""]
[null,{"$f":"IF(ISBLANK(dms_E3_Projects_19),\"\",dms_E3_Projects_19)","v":""},"","","","","","",""]
[null,{"$f":"IF(ISBLANK(dms_E3_Projects_20),\"\",dms_E3_Projects_20)","v":""},"","","","","","",""]
[null,{"$f":"IF(ISBLANK(dms_E3_Projects_21),\"\",dms_E3_Projects_21)","v":""},"","","","","","",""]
[null,{"$f":"IF(ISBLANK(dms_E3_Projects_22),\"\",dms_E3_Projects_22)","v":""},"","","","","","",""]
[null,{"$f":"IF(ISBLANK(dms_E3_Projects_23),\"\",dms_E3_Projects_23)","v":""},"","","","","","",""]
[null,{"$f":"IF(ISBLANK(dms_E3_Projects_24),\"\",dms_E3_Projects_24)","v":""},"","","","","","",""]
[null,{"$f":"IF(ISBLANK(dms_E3_Projects_25),\"\",dms_E3_Projects_26)","v":""},"","","","","","",""]
[null,{"$f":"IF(ISBLANK(dms_E3_Projects_27),\"\",dms_E3_Projects_27)","v":""},"","","","","","",""]
[null,{"$f":"IF(ISBLANK(dms_E3_Projects_28),\"\",dms_E3_Projects_28)","v":""},"","","","","","",""]
[null,{"$f":"IF(ISBLANK(dms_E3_Projects_29),\"\",dms_E3_Projects_29)","v":""},"","","","","","",""]
[null,{"$f":"IF(ISBLANK(dms_E3_Projects_30),\"\",dms_E3_Projects_30)","v":""},"","","","","","",""]
[null,{"$f":"IF(ISBLANK(dms_E3_Projects_31),\"\",dms_E3_Projects_31)","v":""},"","","","","","",""]
[null,{"$f":"IF(ISBLANK(dms_E3_Projects_32),\"\",dms_E3_Projects_32)","v":""},"","","","","","",""]
[null,{"$f":"IF(ISBLANK(dms_E3_Projects_33),\"\",dms_E3_Projects_33)","v":""},"","","","","","",""]
[null,{"$f":"IF(ISBLANK(dms_E3_Projects_34),\"\",dms_E3_Projects_34)","v":""},"","","","","","",""]
[null,{"$f":"IF(ISBLANK(dms_E3_Projects_35),\"\",dms_E3_Projects_35)","v":""},"","","","","","",""]
[null,{"$f":"IF(ISBLANK(dms_E3_Projects_36),\"\",dms_E3_Projects_36)","v":""},"","","","","","",""]
[null,{"$f":"IF(ISBLANK(dms_E3_Projects_37),\"\",dms_E3_Projects_37)","v":""},"","","","","","",""]
[null,{"$f":"IF(ISBLANK(dms_E3_Projects_38),\"\",dms_E3_Projects_38)","v":""},"","","","","","",""]
[null,{"$f":"IF(ISBLANK(dms_E3_Projects_39),\"\",dms_E3_Projects_39)","v":""},"","","","","","",""]
[null,{"$f":"IF(ISBLANK(dms_E3_Projects_40),\"\",dms_E3_Projects_40)","v":""},"","","","","","",""]
[null,{"$f":"IF(ISBLANK(dms_E3_Projects_41),\"\",dms_E3_Projects_41)","v":""},"","","","","","",""]
[null,{"$f":"IF(ISBLANK(dms_E3_Projects_42),\"\",dms_E3_Projects_42)","v":""},"","","","","","",""]
[null,{"$f":"IF(ISBLANK(dms_E3_Projects_43),\"\",dms_E3_Projects_43)","v":""},"","","","","","",""]
[null,{"$f":"IF(ISBLANK(dms_E3_Projects_44),\"\",dms_E3_Projects_44)","v":""},"","","","","","",""]
[null,{"$f":"IF(ISBLANK(dms_E3_Projects_45),\"\",dms_E3_Projects_45)","v":""},"","","","","","",""]
[null,{"$f":"IF(ISBLANK(dms_E3_Projects_46),\"\",dms_E3_Projects_46)","v":""},"","","","","","",""]
[null,{"$f":"IF(ISBLANK(dms_E3_Projects_47),\"\",dms_E3_Projects_47)","v":""},"","","","","","",""]
[null,{"$f":"IF(ISBLANK(dms_E3_Projects_48),\"\",dms_E3_Projects_48)","v":""},"","","","","","",""]
[null,{"$f":"IF(ISBLANK(dms_E3_Projects_49),\"\",dms_E3_Projects_49)","v":""},"","","","","","",""]
[null,{"$f":"IF(ISBLANK(dms_E3_Projects_50),\"\",dms_E3_Projects_50)","v":""},"","","","","","",""]
[null,"Aggregate of other projects or categories with total expenditure of less than $500,000",0,0,0,0,0,0,0]
[null,"Total",{"$f":"SUM(C301:C351)","v":0},{"$f":"SUM(D301:D351)","v":0},{"$f":"SUM(E301:E351)","v":0},{"$f":"SUM(F301:F351)","v":0},{"$f":"SUM(G301:G351)","v":0},{"$f":"SUM(H301:H351)","v":0},{"$f":"SUM(I301:I351)","v":0}]
[]
[]
[]
[null,"E3.2 - VOLUMES - BY PRESSURE TYPE - BY PROJECT"]
[null,"A. LOW PRESSURE TO LOW PRESSURE"]
[null,null,"LENGTH"]
[null,null,"0s, metres"]
[null,null,{"$f":"dms_y1","v":"2023-24"},{"$f":"dms_y2","v":"2024-25"},{"$f":"dms_y3","v":"2025-26"},{"$f":"dms_y4","v":"2026-27"},{"$f":"dms_y5","v":"2027-28"},{"$f":"dms_y6","v":"2028-29"},{"$f":"dms_y7","v":"2029-30"}]
[null,{"$f":"IF(ISBLANK(dms_E3_Projects_01),\"\",dms_E3_Projects_01)","v":"Figtree CDP - Stage 2 "},0,0,0,0,0,0,0]
[null,{"$f":"IF(ISBLANK(dms_E3_Projects_02),\"\",dms_E3_Projects_02)","v":"Woolwich Low Pressure CDP "},0,0,0,0,0,0,0]
[null,{"$f":"IF(ISBLANK(dms_E3_Projects_03),\"\",dms_E3_Projects_03)","v":"Box Hill CDP "},0,0,0,0,0,0,0]
[null,{"$f":"IF(ISBLANK(dms_E3_Projects_04),\"\",dms_E3_Projects_04)","v":"North Sydney CDP "},0,0,0,0,0,0,0]
[null,{"$f":"IF(ISBLANK(dms_E3_Projects_05),\"\",dms_E3_Projects_05)","v":"Umina Beach Low Pressure CDP "},0,0,0,0,0,0,0]
[null,{"$f":"IF(ISBLANK(dms_E3_Projects_06),\"\",dms_E3_Projects_06)","v":"Auburn CDP "},0,0,0,0,0,0,0]
[null,{"$f":"IF(ISBLANK(dms_E3_Projects_07),\"\",dms_E3_Projects_07)","v":"Blue Mountain Pressure Reduction Glenbrook-Springwood "},0,0,0,0,0,0,0]
[null,{"$f":"IF(ISBLANK(dms_E3_Projects_08),\"\",dms_E3_Projects_08)","v":"Gymea Bay 210 kPa CDP "},0,0,0,0,0,0,0]
[null,{"$f":"IF(ISBLANK(dms_E3_Projects_09),\"\",dms_E3_Projects_09)","v":"Edmondson Park Soldiers Pde steel main "},0,0,0,0,0,0,0]
[null,{"$f":"IF(ISBLANK(dms_E3_Projects_10),\"\",dms_E3_Projects_10)","v":"Minor Capital - Mains Interconnect"},0,0,0,0,0,0,0]
[null,{"$f":"IF(ISBLANK(dms_E3_Projects_11),\"\",dms_E3_Projects_11)","v":"Cecil Park CDP-Elizabeth Dr"},0,0,0,0,0,0,0]
[null,{"$f":"IF(ISBLANK(dms_E3_Projects_12),\"\",dms_E3_Projects_12)","v":""},"","","","","","",""]
[null,{"$f":"IF(ISBLANK(dms_E3_Projects_13),\"\",dms_E3_Projects_13)","v":""},"","","","","","",""]
[null,{"$f":"IF(ISBLANK(dms_E3_Projects_14),\"\",dms_E3_Projects_14)","v":""},"","","","","","",""]
[null,{"$f":"IF(ISBLANK(dms_E3_Projects_15),\"\",dms_E3_Projects_15)","v":""},"","","","","","",""]
[null,{"$f":"IF(ISBLANK(dms_E3_Projects_16),\"\",dms_E3_Projects_16)","v":""},"","","","","","",""]
[null,{"$f":"IF(ISBLANK(dms_E3_Projects_17),\"\",dms_E3_Projects_17)","v":""},"","","","","","",""]
[null,{"$f":"IF(ISBLANK(dms_E3_Projects_18),\"\",dms_E3_Projects_18)","v":""},"","","","","","",""]
[null,{"$f":"IF(ISBLANK(dms_E3_Projects_18),\"\",dms_E3_Projects_18)","v":""},"","","","","","",""]
[null,{"$f":"IF(ISBLANK(dms_E3_Projects_19),\"\",dms_E3_Projects_19)","v":""},"","","","","","",""]
[null,{"$f":"IF(ISBLANK(dms_E3_Projects_20),\"\",dms_E3_Projects_20)","v":""},"","","","","","",""]
[null,{"$f":"IF(ISBLANK(dms_E3_Projects_21),\"\",dms_E3_Projects_21)","v":""},"","","","","","",""]
[null,{"$f":"IF(ISBLANK(dms_E3_Projects_22),\"\",dms_E3_Projects_22)","v":""},"","","","","","",""]
[null,{"$f":"IF(ISBLANK(dms_E3_Projects_23),\"\",dms_E3_Projects_23)","v":""},"","","","","","",""]
[null,{"$f":"IF(ISBLANK(dms_E3_Projects_24),\"\",dms_E3_Projects_24)","v":""},"","","","","","",""]
[null,{"$f":"IF(ISBLANK(dms_E3_Projects_25),\"\",dms_E3_Projects_26)","v":""},"","","","","","",""]
[null,{"$f":"IF(ISBLANK(dms_E3_Projects_27),\"\",dms_E3_Projects_27)","v":""},"","","","","","",""]
[null,{"$f":"IF(ISBLANK(dms_E3_Projects_28),\"\",dms_E3_Projects_28)","v":""},"","","","","","",""]
[null,{"$f":"IF(ISBLANK(dms_E3_Projects_29),\"\",dms_E3_Projects_29)","v":""},"","","","","","",""]
[null,{"$f":"IF(ISBLANK(dms_E3_Projects_30),\"\",dms_E3_Projects_30)","v":""},"","","","","","",""]
[null,{"$f":"IF(ISBLANK(dms_E3_Projects_31),\"\",dms_E3_Projects_31)","v":""},"","","","","","",""]
[null,{"$f":"IF(ISBLANK(dms_E3_Projects_32),\"\",dms_E3_Projects_32)","v":""},"","","","","","",""]
[null,{"$f":"IF(ISBLANK(dms_E3_Projects_33),\"\",dms_E3_Projects_33)","v":""},"","","","","","",""]
[null,{"$f":"IF(ISBLANK(dms_E3_Projects_34),\"\",dms_E3_Projects_34)","v":""},"","","","","","",""]
[null,{"$f":"IF(ISBLANK(dms_E3_Projects_35),\"\",dms_E3_Projects_35)","v":""},"","","","","","",""]
[null,{"$f":"IF(ISBLANK(dms_E3_Projects_36),\"\",dms_E3_Projects_36)","v":""},"","","","","","",""]
[null,{"$f":"IF(ISBLANK(dms_E3_Projects_37),\"\",dms_E3_Projects_37)","v":""},"","","","","","",""]
[null,{"$f":"IF(ISBLANK(dms_E3_Projects_38),\"\",dms_E3_Projects_38)","v":""},"","","","","","",""]
[null,{"$f":"IF(ISBLANK(dms_E3_Projects_39),\"\",dms_E3_Projects_39)","v":""},"","","","","","",""]
[null,{"$f":"IF(ISBLANK(dms_E3_Projects_40),\"\",dms_E3_Projects_40)","v":""},"","","","","","",""]
[null,{"$f":"IF(ISBLANK(dms_E3_Projects_41),\"\",dms_E3_Projects_41)","v":""},"","","","","","",""]
[null,{"$f":"IF(ISBLANK(dms_E3_Projects_42),\"\",dms_E3_Projects_42)","v":""},"","","","","","",""]
[null,{"$f":"IF(ISBLANK(dms_E3_Projects_43),\"\",dms_E3_Projects_43)","v":""},"","","","","","",""]
[null,{"$f":"IF(ISBLANK(dms_E3_Projects_44),\"\",dms_E3_Projects_44)","v":""},"","","","","","",""]
[null,{"$f":"IF(ISBLANK(dms_E3_Projects_45),\"\",dms_E3_Projects_45)","v":""},"","","","","","",""]
[null,{"$f":"IF(ISBLANK(dms_E3_Projects_46),\"\",dms_E3_Projects_46)","v":""},"","","","","","",""]
[null,{"$f":"IF(ISBLANK(dms_E3_Projects_47),\"\",dms_E3_Projects_47)","v":""},"","","","","","",""]
[null,{"$f":"IF(ISBLANK(dms_E3_Projects_48),\"\",dms_E3_Projects_48)","v":""},"","","","","","",""]
[null,{"$f":"IF(ISBLANK(dms_E3_Projects_49),\"\",dms_E3_Projects_49)","v":""},"","","","","","",""]
[null,{"$f":"IF(ISBLANK(dms_E3_Projects_50),\"\",dms_E3_Projects_50)","v":""},"","","","","","",""]
[null,"Aggregate of other projects or categories with total expenditure of less than $500,000",0,290,0,95,0,0,0]
[null,"Total",{"$f":"SUM(C361:C411)","v":0},{"$f":"SUM(D361:D411)","v":290},{"$f":"SUM(E361:E411)","v":0},{"$f":"SUM(F361:F411)","v":95},{"$f":"SUM(G361:G411)","v":0},{"$f":"SUM(H361:H411)","v":0},{"$f":"SUM(I361:I411)","v":0}]
[]
[null,"B. LOW PRESSURE TO MEDIUM PRESSURE"]
[null,null,"LENGTH"]
[null,null,"0s, metres"]
[null,null,{"$f":"dms_y1","v":"2023-24"},{"$f":"dms_y2","v":"2024-25"},{"$f":"dms_y3","v":"2025-26"},{"$f":"dms_y4","v":"2026-27"},{"$f":"dms_y5","v":"2027-28"},{"$f":"dms_y6","v":"2028-29"},{"$f":"dms_y7","v":"2029-30"}]
[null,{"$f":"IF(ISBLANK(dms_E3_Projects_01),\"\",dms_E3_Projects_01)","v":"Figtree CDP - Stage 2 "},0,0,0,0,0,0,0]
[null,{"$f":"IF(ISBLANK(dms_E3_Projects_02),\"\",dms_E3_Projects_02)","v":"Woolwich Low Pressure CDP "},0,0,0,0,0,0,0]
[null,{"$f":"IF(ISBLANK(dms_E3_Projects_03),\"\",dms_E3_Projects_03)","v":"Box Hill CDP "},0,0,0,0,0,0,0]
[null,{"$f":"IF(ISBLANK(dms_E3_Projects_04),\"\",dms_E3_Projects_04)","v":"North Sydney CDP "},0,0,0,0,0,0,0]
[null,{"$f":"IF(ISBLANK(dms_E3_Projects_05),\"\",dms_E3_Projects_05)","v":"Umina Beach Low Pressure CDP "},0,0,0,0,0,0,0]
[null,{"$f":"IF(ISBLANK(dms_E3_Projects_06),\"\",dms_E3_Projects_06)","v":"Auburn CDP "},0,0,0,0,0,0,0]
[null,{"$f":"IF(ISBLANK(dms_E3_Projects_07),\"\",dms_E3_Projects_07)","v":"Blue Mountain Pressure Reduction Glenbrook-Springwood "},0,0,0,0,0,0,0]
[null,{"$f":"IF(ISBLANK(dms_E3_Projects_08),\"\",dms_E3_Projects_08)","v":"Gymea Bay 210 kPa CDP "},0,0,0,0,0,0,0]
[null,{"$f":"IF(ISBLANK(dms_E3_Projects_09),\"\",dms_E3_Projects_09)","v":"Edmondson Park Soldiers Pde steel main "},0,0,0,0,0,0,0]
[null,{"$f":"IF(ISBLANK(dms_E3_Projects_10),\"\",dms_E3_Projects_10)","v":"Minor Capital - Mains Interconnect"},0,0,0,0,0,0,0]
[null,{"$f":"IF(ISBLANK(dms_E3_Projects_11),\"\",dms_E3_Projects_11)","v":"Cecil Park CDP-Elizabeth Dr"},0,0,0,0,0,0,0]
[null,{"$f":"IF(ISBLANK(dms_E3_Projects_12),\"\",dms_E3_Projects_12)","v":""},"","","","","","",""]
[null,{"$f":"IF(ISBLANK(dms_E3_Projects_13),\"\",dms_E3_Projects_13)","v":""},"","","","","","",""]
[null,{"$f":"IF(ISBLANK(dms_E3_Projects_14),\"\",dms_E3_Projects_14)","v":""},"","","","","","",""]
[null,{"$f":"IF(ISBLANK(dms_E3_Projects_15),\"\",dms_E3_Projects_15)","v":""},"","","","","","",""]
[null,{"$f":"IF(ISBLANK(dms_E3_Projects_16),\"\",dms_E3_Projects_16)","v":""},"","","","","","",""]
[null,{"$f":"IF(ISBLANK(dms_E3_Projects_17),\"\",dms_E3_Projects_17)","v":""},"","","","","","",""]
[null,{"$f":"IF(ISBLANK(dms_E3_Projects_18),\"\",dms_E3_Projects_18)","v":""},"","","","","","",""]
[null,{"$f":"IF(ISBLANK(dms_E3_Projects_18),\"\",dms_E3_Projects_18)","v":""},"","","","","","",""]
[null,{"$f":"IF(ISBLANK(dms_E3_Projects_19),\"\",dms_E3_Projects_19)","v":""},"","","","","","",""]
[null,{"$f":"IF(ISBLANK(dms_E3_Projects_20),\"\",dms_E3_Projects_20)","v":""},"","","","","","",""]
[null,{"$f":"IF(ISBLANK(dms_E3_Projects_21),\"\",dms_E3_Projects_21)","v":""},"","","","","","",""]
[null,{"$f":"IF(ISBLANK(dms_E3_Projects_22),\"\",dms_E3_Projects_22)","v":""},"","","","","","",""]
[null,{"$f":"IF(ISBLANK(dms_E3_Projects_23),\"\",dms_E3_Projects_23)","v":""},"","","","","","",""]
[null,{"$f":"IF(ISBLANK(dms_E3_Projects_24),\"\",dms_E3_Projects_24)","v":""},"","","","","","",""]
[null,{"$f":"IF(ISBLANK(dms_E3_Projects_25),\"\",dms_E3_Projects_26)","v":""},"","","","","","",""]
[null,{"$f":"IF(ISBLANK(dms_E3_Projects_27),\"\",dms_E3_Projects_27)","v":""},"","","","","","",""]
[null,{"$f":"IF(ISBLANK(dms_E3_Projects_28),\"\",dms_E3_Projects_28)","v":""},"","","","","","",""]
[null,{"$f":"IF(ISBLANK(dms_E3_Projects_29),\"\",dms_E3_Projects_29)","v":""},"","","","","","",""]
[null,{"$f":"IF(ISBLANK(dms_E3_Projects_30),\"\",dms_E3_Projects_30)","v":""},"","","","","","",""]
[null,{"$f":"IF(ISBLANK(dms_E3_Projects_31),\"\",dms_E3_Projects_31)","v":""},"","","","","","",""]
[null,{"$f":"IF(ISBLANK(dms_E3_Projects_32),\"\",dms_E3_Projects_32)","v":""},"","","","","","",""]
[null,{"$f":"IF(ISBLANK(dms_E3_Projects_33),\"\",dms_E3_Projects_33)","v":""},"","","","","","",""]
[null,{"$f":"IF(ISBLANK(dms_E3_Projects_34),\"\",dms_E3_Projects_34)","v":""},"","","","","","",""]
[null,{"$f":"IF(ISBLANK(dms_E3_Projects_35),\"\",dms_E3_Projects_35)","v":""},"","","","","","",""]
[null,{"$f":"IF(ISBLANK(dms_E3_Projects_36),\"\",dms_E3_Projects_36)","v":""},"","","","","","",""]
[null,{"$f":"IF(ISBLANK(dms_E3_Projects_37),\"\",dms_E3_Projects_37)","v":""},"","","","","","",""]
[null,{"$f":"IF(ISBLANK(dms_E3_Projects_38),\"\",dms_E3_Projects_38)","v":""},"","","","","","",""]
[null,{"$f":"IF(ISBLANK(dms_E3_Projects_39),\"\",dms_E3_Projects_39)","v":""},"","","","","","",""]
[null,{"$f":"IF(ISBLANK(dms_E3_Projects_40),\"\",dms_E3_Projects_40)","v":""},"","","","","","",""]
[null,{"$f":"IF(ISBLANK(dms_E3_Projects_41),\"\",dms_E3_Projects_41)","v":""},"","","","","","",""]
[null,{"$f":"IF(ISBLANK(dms_E3_Projects_42),\"\",dms_E3_Projects_42)","v":""},"","","","","","",""]
[null,{"$f":"IF(ISBLANK(dms_E3_Projects_43),\"\",dms_E3_Projects_43)","v":""},"","","","","","",""]
[null,{"$f":"IF(ISBLANK(dms_E3_Projects_44),\"\",dms_E3_Projects_44)","v":""},"","","","","","",""]
[null,{"$f":"IF(ISBLANK(dms_E3_Projects_45),\"\",dms_E3_Projects_45)","v":""},"","","","","","",""]
[null,{"$f":"IF(ISBLANK(dms_E3_Projects_46),\"\",dms_E3_Projects_46)","v":""},"","","","","","",""]
[null,{"$f":"IF(ISBLANK(dms_E3_Projects_47),\"\",dms_E3_Projects_47)","v":""},"","","","","","",""]
[null,{"$f":"IF(ISBLANK(dms_E3_Projects_48),\"\",dms_E3_Projects_48)","v":""},"","","","","","",""]
[null,{"$f":"IF(ISBLANK(dms_E3_Projects_49),\"\",dms_E3_Projects_49)","v":""},"","","","","","",""]
[null,{"$f":"IF(ISBLANK(dms_E3_Projects_50),\"\",dms_E3_Projects_50)","v":""},"","","","","","",""]
[null,"Aggregate of other projects or categories with total expenditure of less than $500,000",0,0,0,0,0,0,0]
[null,"Total",{"$f":"SUM(C418:C468)","v":0},{"$f":"SUM(D418:D468)","v":0},{"$f":"SUM(E418:E468)","v":0},{"$f":"SUM(F418:F468)","v":0},{"$f":"SUM(G418:G468)","v":0},{"$f":"SUM(H418:H468)","v":0},{"$f":"SUM(I418:I468)","v":0}]
[]
[null,"C. LOW PRESSURE TO HIGH PRESSURE"]
[null,null,"LENGTH"]
[null,null,"0s, metres"]
[null,null,{"$f":"dms_y1","v":"2023-24"},{"$f":"dms_y2","v":"2024-25"},{"$f":"dms_y3","v":"2025-26"},{"$f":"dms_y4","v":"2026-27"},{"$f":"dms_y5","v":"2027-28"},{"$f":"dms_y6","v":"2028-29"},{"$f":"dms_y7","v":"2029-30"}]
[null,{"$f":"IF(ISBLANK(dms_E3_Projects_01),\"\",dms_E3_Projects_01)","v":"Figtree CDP - Stage 2 "},0,0,0,0,0,0,0]
[null,{"$f":"IF(ISBLANK(dms_E3_Projects_02),\"\",dms_E3_Projects_02)","v":"Woolwich Low Pressure CDP "},0,0,0,0,0,0,0]
[null,{"$f":"IF(ISBLANK(dms_E3_Projects_03),\"\",dms_E3_Projects_03)","v":"Box Hill CDP "},0,0,0,0,0,0,0]
[null,{"$f":"IF(ISBLANK(dms_E3_Projects_04),\"\",dms_E3_Projects_04)","v":"North Sydney CDP "},0,0,0,0,0,0,0]
[null,{"$f":"IF(ISBLANK(dms_E3_Projects_05),\"\",dms_E3_Projects_05)","v":"Umina Beach Low Pressure CDP "},0,0,0,0,0,0,0]
[null,{"$f":"IF(ISBLANK(dms_E3_Projects_06),\"\",dms_E3_Projects_06)","v":"Auburn CDP "},0,0,0,140,0,0,0]
[null,{"$f":"IF(ISBLANK(dms_E3_Projects_07),\"\",dms_E3_Projects_07)","v":"Blue Mountain Pressure Reduction Glenbrook-Springwood "},0,0,0,0,0,0,0]
[null,{"$f":"IF(ISBLANK(dms_E3_Projects_08),\"\",dms_E3_Projects_08)","v":"Gymea Bay 210 kPa CDP "},0,0,0,0,0,0,0]
[null,{"$f":"IF(ISBLANK(dms_E3_Projects_09),\"\",dms_E3_Projects_09)","v":"Edmondson Park Soldiers Pde steel main "},0,0,0,0,0,0,0]
[null,{"$f":"IF(ISBLANK(dms_E3_Projects_10),\"\",dms_E3_Projects_10)","v":"Minor Capital - Mains Interconnect"},0,0,0,0,0,0,0]
[null,{"$f":"IF(ISBLANK(dms_E3_Projects_11),\"\",dms_E3_Projects_11)","v":"Cecil Park CDP-Elizabeth Dr"},0,0,0,0,0,0,0]
[null,{"$f":"IF(ISBLANK(dms_E3_Projects_12),\"\",dms_E3_Projects_12)","v":""},"","","","","","",""]
[null,{"$f":"IF(ISBLANK(dms_E3_Projects_13),\"\",dms_E3_Projects_13)","v":""},"","","","","","",""]
[null,{"$f":"IF(ISBLANK(dms_E3_Projects_14),\"\",dms_E3_Projects_14)","v":""},"","","","","","",""]
[null,{"$f":"IF(ISBLANK(dms_E3_Projects_15),\"\",dms_E3_Projects_15)","v":""},"","","","","","",""]
[null,{"$f":"IF(ISBLANK(dms_E3_Projects_16),\"\",dms_E3_Projects_16)","v":""},"","","","","","",""]
[null,{"$f":"IF(ISBLANK(dms_E3_Projects_17),\"\",dms_E3_Projects_17)","v":""},"","","","","","",""]
[null,{"$f":"IF(ISBLANK(dms_E3_Projects_18),\"\",dms_E3_Projects_18)","v":""},"","","","","","",""]
[null,{"$f":"IF(ISBLANK(dms_E3_Projects_18),\"\",dms_E3_Projects_18)","v":""},"","","","","","",""]
[null,{"$f":"IF(ISBLANK(dms_E3_Projects_19),\"\",dms_E3_Projects_19)","v":""},"","","","","","",""]
[null,{"$f":"IF(ISBLANK(dms_E3_Projects_20),\"\",dms_E3_Projects_20)","v":""},"","","","","","",""]
[null,{"$f":"IF(ISBLANK(dms_E3_Projects_21),\"\",dms_E3_Projects_21)","v":""},"","","","","","",""]
[null,{"$f":"IF(ISBLANK(dms_E3_Projects_22),\"\",dms_E3_Projects_22)","v":""},"","","","","","",""]
[null,{"$f":"IF(ISBLANK(dms_E3_Projects_23),\"\",dms_E3_Projects_23)","v":""},"","","","","","",""]
[null,{"$f":"IF(ISBLANK(dms_E3_Projects_24),\"\",dms_E3_Projects_24)","v":""},"","","","","","",""]
[null,{"$f":"IF(ISBLANK(dms_E3_Projects_25),\"\",dms_E3_Projects_26)","v":""},"","","","","","",""]
[null,{"$f":"IF(ISBLANK(dms_E3_Projects_27),\"\",dms_E3_Projects_27)","v":""},"","","","","","",""]
[null,{"$f":"IF(ISBLANK(dms_E3_Projects_28),\"\",dms_E3_Projects_28)","v":""},"","","","","","",""]
[null,{"$f":"IF(ISBLANK(dms_E3_Projects_29),\"\",dms_E3_Projects_29)","v":""},"","","","","","",""]
[null,{"$f":"IF(ISBLANK(dms_E3_Projects_30),\"\",dms_E3_Projects_30)","v":""},"","","","","","",""]
[null,{"$f":"IF(ISBLANK(dms_E3_Projects_31),\"\",dms_E3_Projects_31)","v":""},"","","","","","",""]
[null,{"$f":"IF(ISBLANK(dms_E3_Projects_32),\"\",dms_E3_Projects_32)","v":""},"","","","","","",""]
[null,{"$f":"IF(ISBLANK(dms_E3_Projects_33),\"\",dms_E3_Projects_33)","v":""},"","","","","","",""]
[null,{"$f":"IF(ISBLANK(dms_E3_Projects_34),\"\",dms_E3_Projects_34)","v":""},"","","","","","",""]
[null,{"$f":"IF(ISBLANK(dms_E3_Projects_35),\"\",dms_E3_Projects_35)","v":""},"","","","","","",""]
[null,{"$f":"IF(ISBLANK(dms_E3_Projects_36),\"\",dms_E3_Projects_36)","v":""},"","","","","","",""]
[null,{"$f":"IF(ISBLANK(dms_E3_Projects_37),\"\",dms_E3_Projects_37)","v":""},"","","","","","",""]
[null,{"$f":"IF(ISBLANK(dms_E3_Projects_38),\"\",dms_E3_Projects_38)","v":""},"","","","","","",""]
[null,{"$f":"IF(ISBLANK(dms_E3_Projects_39),\"\",dms_E3_Projects_39)","v":""},"","","","","","",""]
[null,{"$f":"IF(ISBLANK(dms_E3_Projects_40),\"\",dms_E3_Projects_40)","v":""},"","","","","","",""]
[null,{"$f":"IF(ISBLANK(dms_E3_Projects_41),\"\",dms_E3_Projects_41)","v":""},"","","","","","",""]
[null,{"$f":"IF(ISBLANK(dms_E3_Projects_42),\"\",dms_E3_Projects_42)","v":""},"","","","","","",""]
[null,{"$f":"IF(ISBLANK(dms_E3_Projects_43),\"\",dms_E3_Projects_43)","v":""},"","","","","","",""]
[null,{"$f":"IF(ISBLANK(dms_E3_Projects_44),\"\",dms_E3_Projects_44)","v":""},"","","","","","",""]
[null,{"$f":"IF(ISBLANK(dms_E3_Projects_45),\"\",dms_E3_Projects_45)","v":""},"","","","","","",""]
[null,{"$f":"IF(ISBLANK(dms_E3_Projects_46),\"\",dms_E3_Projects_46)","v":""},"","","","","","",""]
[null,{"$f":"IF(ISBLANK(dms_E3_Projects_47),\"\",dms_E3_Projects_47)","v":""},"","","","","","",""]
[null,{"$f":"IF(ISBLANK(dms_E3_Projects_48),\"\",dms_E3_Projects_48)","v":""},"","","","","","",""]
[null,{"$f":"IF(ISBLANK(dms_E3_Projects_49),\"\",dms_E3_Projects_49)","v":""},"","","","","","",""]
[null,{"$f":"IF(ISBLANK(dms_E3_Projects_50),\"\",dms_E3_Projects_50)","v":""},"","","","","","",""]
[null,"Aggregate of other projects or categories with total expenditure of less than $500,000",0,0,0,0,0,0,0]
[null,"Total",{"$f":"SUM(C475:C525)","v":0},{"$f":"SUM(D475:D525)","v":0},{"$f":"SUM(E475:E525)","v":0},{"$f":"SUM(F475:F525)","v":140},{"$f":"SUM(G475:G525)","v":0},{"$f":"SUM(H475:H525)","v":0},{"$f":"SUM(I475:I525)","v":0}]
[]
[null,"D. MEDIUM PRESSURE TO MEDIUM PRESSURE"]
[null,null,"LENGTH"]
[null,null,"0s, metres"]
[null,null,{"$f":"dms_y1","v":"2023-24"},{"$f":"dms_y2","v":"2024-25"},{"$f":"dms_y3","v":"2025-26"},{"$f":"dms_y4","v":"2026-27"},{"$f":"dms_y5","v":"2027-28"},{"$f":"dms_y6","v":"2028-29"},{"$f":"dms_y7","v":"2029-30"}]
[null,{"$f":"IF(ISBLANK(dms_E3_Projects_01),\"\",dms_E3_Projects_01)","v":"Figtree CDP - Stage 2 "},0,0,0,0,0,0,780]
[null,{"$f":"IF(ISBLANK(dms_E3_Projects_02),\"\",dms_E3_Projects_02)","v":"Woolwich Low Pressure CDP "},0,0,0,0,0,620,0]
[null,{"$f":"IF(ISBLANK(dms_E3_Projects_03),\"\",dms_E3_Projects_03)","v":"Box Hill CDP "},0,0,2500,0,0,0,0]
[null,{"$f":"IF(ISBLANK(dms_E3_Projects_04),\"\",dms_E3_Projects_04)","v":"North Sydney CDP "},0,0,0,0,0,0,0]
[null,{"$f":"IF(ISBLANK(dms_E3_Projects_05),\"\",dms_E3_Projects_05)","v":"Umina Beach Low Pressure CDP "},0,0,0,1525,0,0,0]
[null,{"$f":"IF(ISBLANK(dms_E3_Projects_06),\"\",dms_E3_Projects_06)","v":"Auburn CDP "},0,0,0,0,0,0,0]
[null,{"$f":"IF(ISBLANK(dms_E3_Projects_07),\"\",dms_E3_Projects_07)","v":"Blue Mountain Pressure Reduction Glenbrook-Springwood "},0,0,0,110,0,0,0]
[null,{"$f":"IF(ISBLANK(dms_E3_Projects_08),\"\",dms_E3_Projects_08)","v":"Gymea Bay 210 kPa CDP "},0,0,0,0,700,0,0]
[null,{"$f":"IF(ISBLANK(dms_E3_Projects_09),\"\",dms_E3_Projects_09)","v":"Edmondson Park Soldiers Pde steel main "},0,0,0,0,0,0,0]
[null,{"$f":"IF(ISBLANK(dms_E3_Projects_10),\"\",dms_E3_Projects_10)","v":"Minor Capital - Mains Interconnect"},1027,1027,1027,1027,1027,1027,1027]
[null,{"$f":"IF(ISBLANK(dms_E3_Projects_11),\"\",dms_E3_Projects_11)","v":"Cecil Park CDP-Elizabeth Dr"},0,0,0,0,0,0,0]
[null,{"$f":"IF(ISBLANK(dms_E3_Projects_12),\"\",dms_E3_Projects_12)","v":""},"","","","","","",""]
[null,{"$f":"IF(ISBLANK(dms_E3_Projects_13),\"\",dms_E3_Projects_13)","v":""},"","","","","","",""]
[null,{"$f":"IF(ISBLANK(dms_E3_Projects_14),\"\",dms_E3_Projects_14)","v":""},"","","","","","",""]
[null,{"$f":"IF(ISBLANK(dms_E3_Projects_15),\"\",dms_E3_Projects_15)","v":""},"","","","","","",""]
[null,{"$f":"IF(ISBLANK(dms_E3_Projects_16),\"\",dms_E3_Projects_16)","v":""},"","","","","","",""]
[null,{"$f":"IF(ISBLANK(dms_E3_Projects_17),\"\",dms_E3_Projects_17)","v":""},"","","","","","",""]
[null,{"$f":"IF(ISBLANK(dms_E3_Projects_18),\"\",dms_E3_Projects_18)","v":""},"","","","","","",""]
[null,{"$f":"IF(ISBLANK(dms_E3_Projects_18),\"\",dms_E3_Projects_18)","v":""},"","","","","","",""]
[null,{"$f":"IF(ISBLANK(dms_E3_Projects_19),\"\",dms_E3_Projects_19)","v":""},"","","","","","",""]
[null,{"$f":"IF(ISBLANK(dms_E3_Projects_20),\"\",dms_E3_Projects_20)","v":""},"","","","","","",""]
[null,{"$f":"IF(ISBLANK(dms_E3_Projects_21),\"\",dms_E3_Projects_21)","v":""},"","","","","","",""]
[null,{"$f":"IF(ISBLANK(dms_E3_Projects_22),\"\",dms_E3_Projects_22)","v":""},"","","","","","",""]
[null,{"$f":"IF(ISBLANK(dms_E3_Projects_23),\"\",dms_E3_Projects_23)","v":""},"","","","","","",""]
[null,{"$f":"IF(ISBLANK(dms_E3_Projects_24),\"\",dms_E3_Projects_24)","v":""},"","","","","","",""]
[null,{"$f":"IF(ISBLANK(dms_E3_Projects_25),\"\",dms_E3_Projects_26)","v":""},"","","","","","",""]
[null,{"$f":"IF(ISBLANK(dms_E3_Projects_27),\"\",dms_E3_Projects_27)","v":""},"","","","","","",""]
[null,{"$f":"IF(ISBLANK(dms_E3_Projects_28),\"\",dms_E3_Projects_28)","v":""},"","","","","","",""]
[null,{"$f":"IF(ISBLANK(dms_E3_Projects_29),\"\",dms_E3_Projects_29)","v":""},"","","","","","",""]
[null,{"$f":"IF(ISBLANK(dms_E3_Projects_30),\"\",dms_E3_Projects_30)","v":""},"","","","","","",""]
[null,{"$f":"IF(ISBLANK(dms_E3_Projects_31),\"\",dms_E3_Projects_31)","v":""},"","","","","","",""]
[null,{"$f":"IF(ISBLANK(dms_E3_Projects_32),\"\",dms_E3_Projects_32)","v":""},"","","","","","",""]
[null,{"$f":"IF(ISBLANK(dms_E3_Projects_33),\"\",dms_E3_Projects_33)","v":""},"","","","","","",""]
[null,{"$f":"IF(ISBLANK(dms_E3_Projects_34),\"\",dms_E3_Projects_34)","v":""},"","","","","","",""]
[null,{"$f":"IF(ISBLANK(dms_E3_Projects_35),\"\",dms_E3_Projects_35)","v":""},"","","","","","",""]
[null,{"$f":"IF(ISBLANK(dms_E3_Projects_36),\"\",dms_E3_Projects_36)","v":""},"","","","","","",""]
[null,{"$f":"IF(ISBLANK(dms_E3_Projects_37),\"\",dms_E3_Projects_37)","v":""},"","","","","","",""]
[null,{"$f":"IF(ISBLANK(dms_E3_Projects_38),\"\",dms_E3_Projects_38)","v":""},"","","","","","",""]
[null,{"$f":"IF(ISBLANK(dms_E3_Projects_39),\"\",dms_E3_Projects_39)","v":""},"","","","","","",""]
[null,{"$f":"IF(ISBLANK(dms_E3_Projects_40),\"\",dms_E3_Projects_40)","v":""},"","","","","","",""]
[null,{"$f":"IF(ISBLANK(dms_E3_Projects_41),\"\",dms_E3_Projects_41)","v":""},"","","","","","",""]
[null,{"$f":"IF(ISBLANK(dms_E3_Projects_42),\"\",dms_E3_Projects_42)","v":""},"","","","","","",""]
[null,{"$f":"IF(ISBLANK(dms_E3_Projects_43),\"\",dms_E3_Projects_43)","v":""},"","","","","","",""]
[null,{"$f":"IF(ISBLANK(dms_E3_Projects_44),\"\",dms_E3_Projects_44)","v":""},"","","","","","",""]
[null,{"$f":"IF(ISBLANK(dms_E3_Projects_45),\"\",dms_E3_Projects_45)","v":""},"","","","","","",""]
[null,{"$f":"IF(ISBLANK(dms_E3_Projects_46),\"\",dms_E3_Projects_46)","v":""},"","","","","","",""]
[null,{"$f":"IF(ISBLANK(dms_E3_Projects_47),\"\",dms_E3_Projects_47)","v":""},"","","","","","",""]
[null,{"$f":"IF(ISBLANK(dms_E3_Projects_48),\"\",dms_E3_Projects_48)","v":""},"","","","","","",""]
[null,{"$f":"IF(ISBLANK(dms_E3_Projects_49),\"\",dms_E3_Projects_49)","v":""},"","","","","","",""]
[null,{"$f":"IF(ISBLANK(dms_E3_Projects_50),\"\",dms_E3_Projects_50)","v":""},"","","","","","",""]
[null,"Aggregate of other projects or categories with total expenditure of less than $500,000",535,830,0,0,0,127,0]
[null,"Total",{"$f":"SUM(C532:C582)","v":1562},{"$f":"SUM(D532:D582)","v":1857},{"$f":"SUM(E532:E582)","v":3527},{"$f":"SUM(F532:F582)","v":2662},{"$f":"SUM(G532:G582)","v":1727},{"$f":"SUM(H532:H582)","v":1774},{"$f":"SUM(I532:I582)","v":1807}]
[]
[null,"E. MEDIUM PRESSURE TO HIGH PRESSURE"]
[null,null,"LENGTH"]
[null,null,"0s, metres"]
[null,null,{"$f":"dms_y1","v":"2023-24"},{"$f":"dms_y2","v":"2024-25"},{"$f":"dms_y3","v":"2025-26"},{"$f":"dms_y4","v":"2026-27"},{"$f":"dms_y5","v":"2027-28"},{"$f":"dms_y6","v":"2028-29"},{"$f":"dms_y7","v":"2029-30"}]
[null,{"$f":"IF(ISBLANK(dms_E3_Projects_01),\"\",dms_E3_Projects_01)","v":"Figtree CDP - Stage 2 "},0,0,0,0,0,0,0]
[null,{"$f":"IF(ISBLANK(dms_E3_Projects_02),\"\",dms_E3_Projects_02)","v":"Woolwich Low Pressure CDP "},0,0,0,0,0,0,0]
[null,{"$f":"IF(ISBLANK(dms_E3_Projects_03),\"\",dms_E3_Projects_03)","v":"Box Hill CDP "},0,0,0,0,0,0,0]
[null,{"$f":"IF(ISBLANK(dms_E3_Projects_04),\"\",dms_E3_Projects_04)","v":"North Sydney CDP "},0,0,0,0,0,0,0]
[null,{"$f":"IF(ISBLANK(dms_E3_Projects_05),\"\",dms_E3_Projects_05)","v":"Umina Beach Low Pressure CDP "},0,0,0,0,0,0,0]
[null,{"$f":"IF(ISBLANK(dms_E3_Projects_06),\"\",dms_E3_Projects_06)","v":"Auburn CDP "},0,0,0,0,0,0,0]
[null,{"$f":"IF(ISBLANK(dms_E3_Projects_07),\"\",dms_E3_Projects_07)","v":"Blue Mountain Pressure Reduction Glenbrook-Springwood "},0,0,0,0,0,0,0]
[null,{"$f":"IF(ISBLANK(dms_E3_Projects_08),\"\",dms_E3_Projects_08)","v":"Gymea Bay 210 kPa CDP "},0,0,0,0,0,0,0]
[null,{"$f":"IF(ISBLANK(dms_E3_Projects_09),\"\",dms_E3_Projects_09)","v":"Edmondson Park Soldiers Pde steel main "},0,0,0,0,0,0,0]
[null,{"$f":"IF(ISBLANK(dms_E3_Projects_10),\"\",dms_E3_Projects_10)","v":"Minor Capital - Mains Interconnect"},0,0,0,0,0,0,0]
[null,{"$f":"IF(ISBLANK(dms_E3_Projects_11),\"\",dms_E3_Projects_11)","v":"Cecil Park CDP-Elizabeth Dr"},0,0,0,0,0,0,0]
[null,{"$f":"IF(ISBLANK(dms_E3_Projects_12),\"\",dms_E3_Projects_12)","v":""},"","","","","","",""]
[null,{"$f":"IF(ISBLANK(dms_E3_Projects_13),\"\",dms_E3_Projects_13)","v":""},"","","","","","",""]
[null,{"$f":"IF(ISBLANK(dms_E3_Projects_14),\"\",dms_E3_Projects_14)","v":""},"","","","","","",""]
[null,{"$f":"IF(ISBLANK(dms_E3_Projects_15),\"\",dms_E3_Projects_15)","v":""},"","","","","","",""]
[null,{"$f":"IF(ISBLANK(dms_E3_Projects_16),\"\",dms_E3_Projects_16)","v":""},"","","","","","",""]
[null,{"$f":"IF(ISBLANK(dms_E3_Projects_17),\"\",dms_E3_Projects_17)","v":""},"","","","","","",""]
[null,{"$f":"IF(ISBLANK(dms_E3_Projects_18),\"\",dms_E3_Projects_18)","v":""},"","","","","","",""]
[null,{"$f":"IF(ISBLANK(dms_E3_Projects_18),\"\",dms_E3_Projects_18)","v":""},"","","","","","",""]
[null,{"$f":"IF(ISBLANK(dms_E3_Projects_19),\"\",dms_E3_Projects_19)","v":""},"","","","","","",""]
[null,{"$f":"IF(ISBLANK(dms_E3_Projects_20),\"\",dms_E3_Projects_20)","v":""},"","","","","","",""]
[null,{"$f":"IF(ISBLANK(dms_E3_Projects_21),\"\",dms_E3_Projects_21)","v":""},"","","","","","",""]
[null,{"$f":"IF(ISBLANK(dms_E3_Projects_22),\"\",dms_E3_Projects_22)","v":""},"","","","","","",""]
[null,{"$f":"IF(ISBLANK(dms_E3_Projects_23),\"\",dms_E3_Projects_23)","v":""},"","","","","","",""]
[null,{"$f":"IF(ISBLANK(dms_E3_Projects_24),\"\",dms_E3_Projects_24)","v":""},"","","","","","",""]
[null,{"$f":"IF(ISBLANK(dms_E3_Projects_25),\"\",dms_E3_Projects_26)","v":""},"","","","","","",""]
[null,{"$f":"IF(ISBLANK(dms_E3_Projects_27),\"\",dms_E3_Projects_27)","v":""},"","","","","","",""]
[null,{"$f":"IF(ISBLANK(dms_E3_Projects_28),\"\",dms_E3_Projects_28)","v":""},"","","","","","",""]
[null,{"$f":"IF(ISBLANK(dms_E3_Projects_29),\"\",dms_E3_Projects_29)","v":""},"","","","","","",""]
[null,{"$f":"IF(ISBLANK(dms_E3_Projects_30),\"\",dms_E3_Projects_30)","v":""},"","","","","","",""]
[null,{"$f":"IF(ISBLANK(dms_E3_Projects_31),\"\",dms_E3_Projects_31)","v":""},"","","","","","",""]
[null,{"$f":"IF(ISBLANK(dms_E3_Projects_32),\"\",dms_E3_Projects_32)","v":""},"","","","","","",""]
[null,{"$f":"IF(ISBLANK(dms_E3_Projects_33),\"\",dms_E3_Projects_33)","v":""},"","","","","","",""]
[null,{"$f":"IF(ISBLANK(dms_E3_Projects_34),\"\",dms_E3_Projects_34)","v":""},"","","","","","",""]
[null,{"$f":"IF(ISBLANK(dms_E3_Projects_35),\"\",dms_E3_Projects_35)","v":""},"","","","","","",""]
[null,{"$f":"IF(ISBLANK(dms_E3_Projects_36),\"\",dms_E3_Projects_36)","v":""},"","","","","","",""]
[null,{"$f":"IF(ISBLANK(dms_E3_Projects_37),\"\",dms_E3_Projects_37)","v":""},"","","","","","",""]
[null,{"$f":"IF(ISBLANK(dms_E3_Projects_38),\"\",dms_E3_Projects_38)","v":""},"","","","","","",""]
[null,{"$f":"IF(ISBLANK(dms_E3_Projects_39),\"\",dms_E3_Projects_39)","v":""},"","","","","","",""]
[null,{"$f":"IF(ISBLANK(dms_E3_Projects_40),\"\",dms_E3_Projects_40)","v":""},"","","","","","",""]
[null,{"$f":"IF(ISBLANK(dms_E3_Projects_41),\"\",dms_E3_Projects_41)","v":""},"","","","","","",""]
[null,{"$f":"IF(ISBLANK(dms_E3_Projects_42),\"\",dms_E3_Projects_42)","v":""},"","","","","","",""]
[null,{"$f":"IF(ISBLANK(dms_E3_Projects_43),\"\",dms_E3_Projects_43)","v":""},"","","","","","",""]
[null,{"$f":"IF(ISBLANK(dms_E3_Projects_44),\"\",dms_E3_Projects_44)","v":""},"","","","","","",""]
[null,{"$f":"IF(ISBLANK(dms_E3_Projects_45),\"\",dms_E3_Projects_45)","v":""},"","","","","","",""]
[null,{"$f":"IF(ISBLANK(dms_E3_Projects_46),\"\",dms_E3_Projects_46)","v":""},"","","","","","",""]
[null,{"$f":"IF(ISBLANK(dms_E3_Projects_47),\"\",dms_E3_Projects_47)","v":""},"","","","","","",""]
[null,{"$f":"IF(ISBLANK(dms_E3_Projects_48),\"\",dms_E3_Projects_48)","v":""},"","","","","","",""]
[null,{"$f":"IF(ISBLANK(dms_E3_Projects_49),\"\",dms_E3_Projects_49)","v":""},"","","","","","",""]
[null,{"$f":"IF(ISBLANK(dms_E3_Projects_50),\"\",dms_E3_Projects_50)","v":""},"","","","","","",""]
[null,"Aggregate of other projects or categories with total expenditure of less than $500,000",0,0,0,0,0,0,0]
[null,"Total",{"$f":"SUM(C589:C639)","v":0},{"$f":"SUM(D589:D639)","v":0},{"$f":"SUM(E589:E639)","v":0},{"$f":"SUM(F589:F639)","v":0},{"$f":"SUM(G589:G639)","v":0},{"$f":"SUM(H589:H639)","v":0},{"$f":"SUM(I589:I639)","v":0}]
[]
[null,"F. HIGH PRESSURE TO HIGH PRESSURE"]
[null,null,"LENGTH"]
[null,null,"0s, metres"]
[null,null,{"$f":"dms_y1","v":"2023-24"},{"$f":"dms_y2","v":"2024-25"},{"$f":"dms_y3","v":"2025-26"},{"$f":"dms_y4","v":"2026-27"},{"$f":"dms_y5","v":"2027-28"},{"$f":"dms_y6","v":"2028-29"},{"$f":"dms_y7","v":"2029-30"}]
[null,{"$f":"IF(ISBLANK(dms_E3_Projects_01),\"\",dms_E3_Projects_01)","v":"Figtree CDP - Stage 2 "},0,0,0,0,0,0,0]
[null,{"$f":"IF(ISBLANK(dms_E3_Projects_02),\"\",dms_E3_Projects_02)","v":"Woolwich Low Pressure CDP "},0,0,0,0,0,0,0]
[null,{"$f":"IF(ISBLANK(dms_E3_Projects_03),\"\",dms_E3_Projects_03)","v":"Box Hill CDP "},0,0,0,0,0,0,0]
[null,{"$f":"IF(ISBLANK(dms_E3_Projects_04),\"\",dms_E3_Projects_04)","v":"North Sydney CDP "},0,0,0,0,0,0,20]
[null,{"$f":"IF(ISBLANK(dms_E3_Projects_05),\"\",dms_E3_Projects_05)","v":"Umina Beach Low Pressure CDP "},0,0,0,0,0,0,0]
[null,{"$f":"IF(ISBLANK(dms_E3_Projects_06),\"\",dms_E3_Projects_06)","v":"Auburn CDP "},0,0,0,0,0,0,0]
[null,{"$f":"IF(ISBLANK(dms_E3_Projects_07),\"\",dms_E3_Projects_07)","v":"Blue Mountain Pressure Reduction Glenbrook-Springwood "},0,0,0,0,0,0,0]
[null,{"$f":"IF(ISBLANK(dms_E3_Projects_08),\"\",dms_E3_Projects_08)","v":"Gymea Bay 210 kPa CDP "},0,0,0,0,0,0,0]
[null,{"$f":"IF(ISBLANK(dms_E3_Projects_09),\"\",dms_E3_Projects_09)","v":"Edmondson Park Soldiers Pde steel main "},0,0,500,0,0,0,0]
[null,{"$f":"IF(ISBLANK(dms_E3_Projects_10),\"\",dms_E3_Projects_10)","v":"Minor Capital - Mains Interconnect"},0,0,0,0,0,0,0]
[null,{"$f":"IF(ISBLANK(dms_E3_Projects_11),\"\",dms_E3_Projects_11)","v":"Cecil Park CDP-Elizabeth Dr"},830,0,0,0,0,0,0]
[null,{"$f":"IF(ISBLANK(dms_E3_Projects_12),\"\",dms_E3_Projects_12)","v":""},"","","","","","",""]
[null,{"$f":"IF(ISBLANK(dms_E3_Projects_13),\"\",dms_E3_Projects_13)","v":""},"","","","","","",""]
[null,{"$f":"IF(ISBLANK(dms_E3_Projects_14),\"\",dms_E3_Projects_14)","v":""},"","","","","","",""]
[null,{"$f":"IF(ISBLANK(dms_E3_Projects_15),\"\",dms_E3_Projects_15)","v":""},"","","","","","",""]
[null,{"$f":"IF(ISBLANK(dms_E3_Projects_16),\"\",dms_E3_Projects_16)","v":""},"","","","","","",""]
[null,{"$f":"IF(ISBLANK(dms_E3_Projects_17),\"\",dms_E3_Projects_17)","v":""},"","","","","","",""]
[null,{"$f":"IF(ISBLANK(dms_E3_Projects_18),\"\",dms_E3_Projects_18)","v":""},"","","","","","",""]
[null,{"$f":"IF(ISBLANK(dms_E3_Projects_18),\"\",dms_E3_Projects_18)","v":""},"","","","","","",""]
[null,{"$f":"IF(ISBLANK(dms_E3_Projects_19),\"\",dms_E3_Projects_19)","v":""},"","","","","","",""]
[null,{"$f":"IF(ISBLANK(dms_E3_Projects_20),\"\",dms_E3_Projects_20)","v":""},"","","","","","",""]
[null,{"$f":"IF(ISBLANK(dms_E3_Projects_21),\"\",dms_E3_Projects_21)","v":""},"","","","","","",""]
[null,{"$f":"IF(ISBLANK(dms_E3_Projects_22),\"\",dms_E3_Projects_22)","v":""},"","","","","","",""]
[null,{"$f":"IF(ISBLANK(dms_E3_Projects_23),\"\",dms_E3_Projects_23)","v":""},"","","","","","",""]
[null,{"$f":"IF(ISBLANK(dms_E3_Projects_24),\"\",dms_E3_Projects_24)","v":""},"","","","","","",""]
[null,{"$f":"IF(ISBLANK(dms_E3_Projects_25),\"\",dms_E3_Projects_26)","v":""},"","","","","","",""]
[null,{"$f":"IF(ISBLANK(dms_E3_Projects_27),\"\",dms_E3_Projects_27)","v":""},"","","","","","",""]
[null,{"$f":"IF(ISBLANK(dms_E3_Projects_28),\"\",dms_E3_Projects_28)","v":""},"","","","","","",""]
[null,{"$f":"IF(ISBLANK(dms_E3_Projects_29),\"\",dms_E3_Projects_29)","v":""},"","","","","","",""]
[null,{"$f":"IF(ISBLANK(dms_E3_Projects_30),\"\",dms_E3_Projects_30)","v":""},"","","","","","",""]
[null,{"$f":"IF(ISBLANK(dms_E3_Projects_31),\"\",dms_E3_Projects_31)","v":""},"","","","","","",""]
[null,{"$f":"IF(ISBLANK(dms_E3_Projects_32),\"\",dms_E3_Projects_32)","v":""},"","","","","","",""]
[null,{"$f":"IF(ISBLANK(dms_E3_Projects_33),\"\",dms_E3_Projects_33)","v":""},"","","","","","",""]
[null,{"$f":"IF(ISBLANK(dms_E3_Projects_34),\"\",dms_E3_Projects_34)","v":""},"","","","","","",""]
[null,{"$f":"IF(ISBLANK(dms_E3_Projects_35),\"\",dms_E3_Projects_35)","v":""},"","","","","","",""]
[null,{"$f":"IF(ISBLANK(dms_E3_Projects_36),\"\",dms_E3_Projects_36)","v":""},"","","","","","",""]
[null,{"$f":"IF(ISBLANK(dms_E3_Projects_37),\"\",dms_E3_Projects_37)","v":""},"","","","","","",""]
[null,{"$f":"IF(ISBLANK(dms_E3_Projects_38),\"\",dms_E3_Projects_38)","v":""},"","","","","","",""]
[null,{"$f":"IF(ISBLANK(dms_E3_Projects_39),\"\",dms_E3_Projects_39)","v":""},"","","","","","",""]
[null,{"$f":"IF(ISBLANK(dms_E3_Projects_40),\"\",dms_E3_Projects_40)","v":""},"","","","","","",""]
[null,{"$f":"IF(ISBLANK(dms_E3_Projects_41),\"\",dms_E3_Projects_41)","v":""},"","","","","","",""]
[null,{"$f":"IF(ISBLANK(dms_E3_Projects_42),\"\",dms_E3_Projects_42)","v":""},"","","","","","",""]
[null,{"$f":"IF(ISBLANK(dms_E3_Projects_43),\"\",dms_E3_Projects_43)","v":""},"","","","","","",""]
[null,{"$f":"IF(ISBLANK(dms_E3_Projects_44),\"\",dms_E3_Projects_44)","v":""},"","","","","","",""]
[null,{"$f":"IF(ISBLANK(dms_E3_Projects_45),\"\",dms_E3_Projects_45)","v":""},"","","","","","",""]
[null,{"$f":"IF(ISBLANK(dms_E3_Projects_46),\"\",dms_E3_Projects_46)","v":""},"","","","","","",""]
[null,{"$f":"IF(ISBLANK(dms_E3_Projects_47),\"\",dms_E3_Projects_47)","v":""},"","","","","","",""]
[null,{"$f":"IF(ISBLANK(dms_E3_Projects_48),\"\",dms_E3_Projects_48)","v":""},"","","","","","",""]
[null,{"$f":"IF(ISBLANK(dms_E3_Projects_49),\"\",dms_E3_Projects_49)","v":""},"","","","","","",""]
[null,{"$f":"IF(ISBLANK(dms_E3_Projects_50),\"\",dms_E3_Projects_50)","v":""},"","","","","","",""]
[null,"Aggregate of other projects or categories with total expenditure of less than $500,000",0,0,0,0,0,0,0]
[null,"Total",{"$f":"SUM(C646:C696)","v":830},{"$f":"SUM(D646:D696)","v":0},500,0,0,0,20]

{"sheet":"E4. Meter replacement","index":6,"n_rows":208,"n_cols":9,"rows_kept":208,"cut":false,"hidden":false,"merged":[]}
[null,{"$f":"INDEX(dms_Worksheet_List,MATCH(dms_Model,dms_Model_List))","v":"REGULATORY REPORTING STATEMENT"}]
[null,{"$f":"dms_TradingNameFull","v":"Jemena Gas Networks (NSW) Ltd"}]
[null,{"$f":"dms_Header_Span","v":"2023-24 to 2029-30"}]
[null,"E4. METER (GAS) REPLACEMENT"]
[null,"FINAL RIN TEMPLATE - FEBRUARY 2024"]
[]
[null,"E4.1 - CAPEX"]
[null,"E4.1.1 - NEW METERS ACQUIRED"]
[null,null,"EXPENDITURE"]
[null,null,{"$f":"CONCATENATE(\"$, real \",dms_DollarReal)","v":"$, real June 2025"}]
[null,null,{"$f":"dms_y1","v":"2023-24"},{"$f":"dms_y2","v":"2024-25"},{"$f":"dms_y3","v":"2025-26"},{"$f":"dms_y4","v":"2026-27"},{"$f":"dms_y5","v":"2027-28"},{"$f":"dms_y6","v":"2028-29"},{"$f":"dms_y7","v":"2029-30"}]
[null,"A. DIRECT INTERNAL LABOUR EXPENDITURE"]
[null,"Residential",0,0,0,0,0,0,0]
[null,"Industrial and Commercial",0,0,0,0,0,0,0]
[null,"Other",0,0,0,0,0,0,0]
[null,"Total",{"$f":"SUM(C13:C15)","v":0},{"$f":"SUM(D13:D15)","v":0},0,0,0,0,0]
[null,"B. DIRECT CONTRACTOR EXPENDITURE"]
[null,"Residential"]
[null,"Industrial and Commercial"]
[null,"Other"]
[null,"Total"]
[null,"C. DIRECT MATERIAL EXPENDITURE"]
[null,"Residential",0,0,0,0,0,0,0]
[null,"Industrial and Commercial",0,0,0,0,0,0,0]
[null,"Other",0,0,0,0,0,0,0]
[null,"Total",{"$f":"SUM(C23:C25)","v":0},{"$f":"SUM(D23:D25)","v":0},0,0,0,0,0]
[null,"D. OTHER DIRECT EXPENDITURE"]
[null,"Residential",0,0,0,0,0,0,0]
[null,"Industrial and Commercial",0,0,0,0,0,0,0]
[null,"Other",0,0,0,0,0,0,0]
[null,"Total",{"$f":"SUM(C28:C30)","v":0},{"$f":"SUM(D28:D30)","v":0},0,0,0,0,0]
[null,"E. RELATED PARTY MARGIN EXPENDITURE"]
[null,"Residential"]
[null,"Industrial and Commercial"]
[null,"Other"]
[null,"Total"]
[null,"F. CAPITAL CONTRIBUTIONS included in the above"]
[null,"Residential",0,0,0,0,0,0,0]
[null,"Industrial and Commercial",0,0,0,0,0,0,0]
[null,"Other",0,0,0,0,0,0,0]
[null,"Total",{"$f":"SUM(C38:C40)","v":0},{"$f":"SUM(D38:D40)","v":0},0,0,0,0,0]
[null,"TOTAL",{"$f":"SUM(C16,C21,C26,C31,C36,C41)","v":0},{"$f":"SUM(D16,D21,D26,D31,D36,D41)","v":0},0,0,0,0,0]
[]
[null,"E4.1.2 - METER (GAS) REFURBISHMENT"]
[null,null,"EXPENDITURE"]
[null,null,{"$f":"CONCATENATE(\"$, real \",dms_DollarReal)","v":"$, real June 2025"}]
[null,null,{"$f":"dms_y1","v":"2023-24"},{"$f":"dms_y2","v":"2024-25"},{"$f":"dms_y3","v":"2025-26"},{"$f":"dms_y4","v":"2026-27"},{"$f":"dms_y5","v":"2027-28"},{"$f":"dms_y6","v":"2028-29"},{"$f":"dms_y7","v":"2029-30"}]
[null,"A. DIRECT INTERNAL LABOUR EXPENDITURE"]
[null,"Residential",0,0,0,0,0,0,0]
[null,"Industrial and Commercial",0,0,0,0,0,0,0]
[null,"Other",0,0,0,0,0,0,0]
[null,"Total",{"$f":"SUM(C49:C51)","v":0},{"$f":"SUM(D49:D51)","v":0},0,0,0,0,0]
[null,"B. DIRECT CONTRACTOR EXPENDITURE"]
[null,"Residential"]
[null,"Industrial and Commercial"]
[null,"Other"]
[null,"Total"]
[null,"C. DIRECT MATERIAL EXPENDITURE"]
[null,"Residential",0,0,0,0,0,0,0]
[null,"Industrial and Commercial",0,0,0,0,0,0,0]
[null,"Other",0,0,0,0,0,0,0]
[null,"Total",{"$f":"SUM(C59:C61)","v":0},{"$f":"SUM(D59:D61)","v":0},0,0,0,0,0]
[null,"D. OTHER DIRECT EXPENDITURE"]
[null,"Residential",0,0,0,0,0,0,0]
[null,"Industrial and Commercial",0,0,0,0,0,0,0]
[null,"Other",0,0,0,0,0,0,0]
[null,"Total",{"$f":"SUM(C64:C66)","v":0},{"$f":"SUM(D64:D66)","v":0},0,0,0,0,0]
[null,"E. RELATED PARTY MARGIN EXPENDITURE"]
[null,"Residential"]
[null,"Industrial and Commercial"]
[null,"Other"]
[null,"Total"]
[null,"F. CAPITAL CONTRIBUTIONS included in the above"]
[null,"Residential",0,0,0,0,0,0,0]
[null,"Industrial and Commercial",0,0,0,0,0,0,0]
[null,"Other",0,0,0,0,0,0,0]
[null,"Total",{"$f":"SUM(C74:C76)","v":0},{"$f":"SUM(D74:D76)","v":0},0,0,0,0,0]
[null,"TOTAL",{"$f":"SUM(C52,C57,C62,C67,C72,C77)","v":0},{"$f":"SUM(D52,D57,D62,D67,D72,D77)","v":0},0,0,0,0,0]
[]
[null,"E4.1.3 - METER (GAS) INSTALLATION"]
[null,null,"EXPENDITURE"]
[null,null,{"$f":"CONCATENATE(\"$, real \",dms_DollarReal)","v":"$, real June 2025"}]
[null,null,{"$f":"dms_y1","v":"2023-24"},{"$f":"dms_y2","v":"2024-25"},{"$f":"dms_y3","v":"2025-26"},{"$f":"dms_y4","v":"2026-27"},{"$f":"dms_y5","v":"2027-28"},{"$f":"dms_y6","v":"2028-29"},{"$f":"dms_y7","v":"2029-30"}]
[null,"A. DIRECT INTERNAL LABOUR EXPENDITURE"]
[null,"Residential",0,0,0,0,0,0,0]
[null,"Industrial and Commercial",0,0,0,0,0,0,0]
[null,"Other",0,0,0,0,0,0,0]
[null,"Total",{"$f":"SUM(C85:C87)","v":0},{"$f":"SUM(D85:D87)","v":0},0,0,0,0,0]
[null,"B. DIRECT CONTRACTOR EXPENDITURE"]
[null,"Residential"]
[null,"Industrial and Commercial"]
[null,"Other"]
[null,"Total"]
[null,"C. DIRECT MATERIAL EXPENDITURE"]
[null,"Residential",0,0,0,0,0,0,0]
[null,"Industrial and Commercial",0,0,0,0,0,0,0]
[null,"Other",0,0,0,0,0,0,0]
[null,"Total",{"$f":"SUM(C95:C97)","v":0},{"$f":"SUM(D95:D97)","v":0},0,0,0,0,0]
[null,"D. OTHER DIRECT EXPENDITURE"]
[null,"Residential",0,0,0,0,0,0,0]
[null,"Industrial and Commercial",0,0,0,0,0,0,0]
[null,"Other",0,0,0,0,0,0,0]
[null,"Total",{"$f":"SUM(C100:C102)","v":0},{"$f":"SUM(D100:D102)","v":0},0,0,0,0,0]
[null,"E. RELATED PARTY MARGIN EXPENDITURE"]
[null,"Residential"]
[null,"Industrial and Commercial"]
[null,"Other"]
[null,"Total"]
[null,"F. CAPITAL CONTRIBUTIONS included in the above"]
[null,"Residential",0,0,0,0,0,0,0]
[null,"Industrial and Commercial",0,0,0,0,0,0,0]
[null,"Other",0,0,0,0,0,0,0]
[null,"Total",{"$f":"SUM(C110:C112)","v":0},{"$f":"SUM(D110:D112)","v":0},0,0,0,0,0]
[null,"TOTAL",{"$f":"SUM(C88,C93,C98,C103,C108,C113)","v":0},{"$f":"SUM(D88,D93,D98,D103,D108,D113)","v":0},0,0,0,0,0]
[]
[null,"E4.1.4 - OTHER METER (GAS) REPLACEMENT CAPEX"]
[null,null,"EXPENDITURE"]
[null,null,{"$f":"CONCATENATE(\"$, real \",dms_DollarReal)","v":"$, real June 2025"}]
[null,null,{"$f":"dms_y1","v":"2023-24"},{"$f":"dms_y2","v":"2024-25"},{"$f":"dms_y3","v":"2025-26"},{"$f":"dms_y4","v":"2026-27"},{"$f":"dms_y5","v":"2027-28"},{"$f":"dms_y6","v":"2028-29"},{"$f":"dms_y7","v":"2029-30"}]
[null,"A. DIRECT INTERNAL LABOUR EXPENDITURE"]
[null,"Residential",0,0,0,0,0,0,0]
[null,"Industrial and Commercial",0,0,0,0,0,0,0]
[null,"Other",0,0,0,0,0,0,0]
[null,"Total",{"$f":"SUM(C121:C123)","v":0},{"$f":"SUM(D121:D123)","v":0},0,0,0,0,0]
[null,"B. DIRECT CONTRACTOR EXPENDITURE"]
[null,"Residential"]
[null,"Industrial and Commercial"]
[null,"Other"]
[null,"Total"]
[null,"C. DIRECT MATERIAL EXPENDITURE"]
[null,"Residential",0,0,0,0,0,0,0]
[null,"Industrial and Commercial",0,0,0,0,0,0,0]
[null,"Other",0,0,0,0,0,0,0]
[null,"Total",{"$f":"SUM(C131:C133)","v":0},{"$f":"SUM(D131:D133)","v":0},0,0,0,0,0]
[null,"D. OTHER DIRECT EXPENDITURE"]
[null,"Residential",0,0,0,0,0,0,0]
[null,"Industrial and Commercial",0,0,0,0,0,0,0]
[null,"Other",0,0,0,0,0,0,0]
[null,"Total",{"$f":"SUM(C136:C138)","v":0},{"$f":"SUM(D136:D138)","v":0},0,0,0,0,0]
[null,"E. RELATED PARTY MARGIN EXPENDITURE"]
[null,"Residential"]
[null,"Industrial and Commercial"]
[null,"Other"]
[null,"Total"]
[null,"F. CAPITAL CONTRIBUTIONS included in the above"]
[null,"Residential",0,0,0,0,0,0,0]
[null,"Industrial and Commercial",0,0,0,0,0,0,0]
[null,"Other",0,0,0,0,0,0,0]
[null,"Total",{"$f":"SUM(C146:C148)","v":0},{"$f":"SUM(D146:D148)","v":0},0,0,0,0,0]
[null,"TOTAL",{"$f":"SUM(C124,C129,C134,C139,C144,C149)","v":0},{"$f":"SUM(D124,D129,D134,D139,D144,D149)","v":0},0,0,0,0,0]
[]
[]
[null,"E4.2 - VOLUMES"]
[null,"E4.2.1 - NUMBER OF NEW METERS ACQUIRED"]
[null,null,"VOLUMES"]
[null,null,"0s"]
[null,null,{"$f":"dms_y1","v":"2023-24"},{"$f":"dms_y2","v":"2024-25"},{"$f":"dms_y3","v":"2025-26"},{"$f":"dms_y4","v":"2026-27"},{"$f":"dms_y5","v":"2027-28"},{"$f":"dms_y6","v":"2028-29"},{"$f":"dms_y7","v":"2029-30"}]
[null,"Residential"]
[null,"Industrial and commercial"]
[null,"Other meters"]
[null,"Total"]
[]
[]
[null,"E4.2.2 - NUMBER OF METERS REFURBISHED"]
[null,null,"VOLUMES"]
[null,null,"0s"]
[null,null,{"$f":"dms_y1","v":"2023-24"},{"$f":"dms_y2","v":"2024-25"},{"$f":"dms_y3","v":"2025-26"},{"$f":"dms_y4","v":"2026-27"},{"$f":"dms_y5","v":"2027-28"},{"$f":"dms_y6","v":"2028-29"},{"$f":"dms_y7","v":"2029-30"}]
[null,"A. REFURBISHABLE METERS REMOVED"]
[null,"Residential"]
[null,"Industrial and commercial"]
[null,"Other meters"]
[null,"Total"]
[null,"B. METERS DECOMMISSIONED"]
[null,"Residential"]
[null,"Industrial and commercial"]
[null,"Other meters"]
[null,"Total"]
[null,"TOTAL"]
[]
[]
[null,"E4.2.3 - NUMBER OF METERS INSTALLED"]
[null,null,"VOLUMES"]
[null,null,"0s"]
[null,null,{"$f":"dms_y1","v":"2023-24"},{"$f":"dms_y2","v":"2024-25"},{"$f":"dms_y3","v":"2025-26"},{"$f":"dms_y4","v":"2026-27"},{"$f":"dms_y5","v":"2027-28"},{"$f":"dms_y6","v":"2028-29"},{"$f":"dms_y7","v":"2029-30"}]
[null,"Residential"]
[null,"Industrial and commercial"]
[null,"Other meters"]
[null,"Total"]
[]
[]
[null,"E4.2.4 - NUMBER OF METERS REMOVED / DECOMMISSIONED"]
[null,null,"VOLUMES"]
[null,null,"0s"]
[null,null,{"$f":"dms_y1","v":"2023-24"},{"$f":"dms_y2","v":"2024-25"},{"$f":"dms_y3","v":"2025-26"},{"$f":"dms_y4","v":"2026-27"},{"$f":"dms_y5","v":"2027-28"},{"$f":"dms_y6","v":"2028-29"},{"$f":"dms_y7","v":"2029-30"}]
[null,"Residential"]
[null,"Industrial and commercial"]
[null,"Other meters"]
[null,"Total"]
[]
[]
[null,"E4.2.5 - OTHER METER (GAS) REPLACEMENT VOLUMES"]
[null,null,"VOLUMES"]
[null,null,"0s"]
[null,null,{"$f":"dms_y1","v":"2023-24"},{"$f":"dms_y2","v":"2024-25"},{"$f":"dms_y3","v":"2025-26"},{"$f":"dms_y4","v":"2026-27"},{"$f":"dms_y5","v":"2027-28"},{"$f":"dms_y6","v":"2028-29"},{"$f":"dms_y7","v":"2029-30"}]
[null,"Residential",0,0,0,0,0,0,0]
[null,"Industrial and commercial",0,0,0,0,0,0,0]
[null,"Other meters",0,0,0,0,0,0,0]
[null,"Total",{"$f":"SUM(C205:C207)","v":0},{"$f":"SUM(D205:D207)","v":0},0,0,0,0,0]

{"sheet":"E5. Connections (gas)","index":7,"n_rows":326,"n_cols":10,"rows_kept":326,"cut":false,"hidden":false,"merged":[]}
[null,{"$f":"INDEX(dms_Worksheet_List,MATCH(dms_Model,dms_Model_List))","v":"REGULATORY REPORTING STATEMENT"}]
[null,{"$f":"dms_TradingNameFull","v":"Jemena Gas Networks (NSW) Ltd"}]
[null,{"$f":"dms_Header_Span","v":"2023-24 to 2029-30"}]
[null,"E5. CONNECTIONS (GAS)"]
[null,"FINAL RIN TEMPLATE - FEBRUARY 2024"]
[]
[null,"E5.1 - EXPENDITURE"]
[null,"E5.1.1 - CAPEX - BY CONNECTION TYPE"]
[null,"A. DIRECT INTERNAL LABOUR EXPENDITURE"]
[null,null,null,"EXPENDITURE"]
[null,null,null,{"$f":"CONCATENATE(\"$, real \",dms_DollarReal)","v":"$, real June 2025"}]
[null,null,null,{"$f":"dms_y1","v":"2023-24"},{"$f":"dms_y2","v":"2024-25"},{"$f":"dms_y3","v":"2025-26"},{"$f":"dms_y4","v":"2026-27"},{"$f":"dms_y5","v":"2027-28"},{"$f":"dms_y6","v":"2028-29"},{"$f":"dms_y7","v":"2029-30"}]
[null,"(i)  ELECTRICITY TO GAS"]
[null,"Distribution mains",null,0,0,0,0,0,0,0]
[null,"Inlet service pipes",null,0,0,0,0,0,0,0]
[null,"Meters (gas)",null,0,0,0,0,0,0,0]
[null,null,"Total",{"$f":"SUM(D14:D16)","v":0},{"$f":"SUM(E14:E16)","v":0},0,0,0,0,0]
[null,"(ii)  NEW HOMES"]
[null,"Distribution mains",null,0,20857.541247290017,73146.232650066522,2369.907518141446,0,0,0]
[null,"Inlet service pipes",null,0,0,0,0,0,0,0]
[null,"Meters (gas)",null,0,0,0,0,0,0,0]
[null,null,"Total",{"$f":"SUM(D19:D21)","v":0},{"$f":"SUM(E19:E21)","v":20857.541247290017},{"$f":"SUM(F19:F21)","v":73146.232650066522},{"$f":"SUM(G19:G21)","v":2369.907518141446},{"$f":"SUM(H19:H21)","v":0},{"$f":"SUM(I19:I21)","v":0},{"$f":"SUM(J19:J21)","v":0}]
[null,"(iii)  NEW MEDIUM DENSITY / HIGH RISE"]
[null,"Distribution mains",null,0,0,0,0,0,0,0]
[null,"Inlet service pipes",null,0,0,0,0,0,0,0]
[null,"Meters (gas)",null,0,0,0,0,0,0,0]
[null,null,"Total",{"$f":"SUM(D24:D26)","v":0},{"$f":"SUM(E24:E26)","v":0},{"$f":"SUM(F24:F26)","v":0},{"$f":"SUM(G24:G26)","v":0},{"$f":"SUM(H24:H26)","v":0},{"$f":"SUM(I24:I26)","v":0},{"$f":"SUM(J24:J26)","v":0}]
[null,"(iv)  INDUSTRIAL & COMMERCIAL TARIFF"]
[null,"Distribution mains",null,0,0,0,0,0,0,0]
[null,"Inlet service pipes",null,0,0,0,0,0,0,0]
[null,"Meters (gas)",null,0,0,0,0,0,0,0]
[null,null,"Total",{"$f":"SUM(D29:D31)","v":0},{"$f":"SUM(E29:E31)","v":0},{"$f":"SUM(F29:F31)","v":0},{"$f":"SUM(G29:G31)","v":0},{"$f":"SUM(H29:H31)","v":0},{"$f":"SUM(I29:I31)","v":0},{"$f":"SUM(J29:J31)","v":0}]
[null,"(v)  INDUSTRIAL & COMMERCIAL CONTRACT"]
[null,"Distribution mains",null,67938.537114135193,29479.917162364149,29360.771183322529,29410.508938522649,29457.346507541191,29512.583404351943,29572.640595742665]
[null,"Inlet service pipes",null,7371.0443137216407,7379.6299570267238,7390.7419966469852,7398.5558828888552,7405.914144931121,7414.5919557067882,7424.027042988977]
[null,"Meters (gas)",null,0,0,0,0,0,0,0]
[null,null,"Total",{"$f":"SUM(D34:D36)","v":75309.581427856829},{"$f":"SUM(E34:E36)","v":36859.547119390874},{"$f":"SUM(F34:F36)","v":36751.513179969515},{"$f":"SUM(G34:G36)","v":36809.064821411506},{"$f":"SUM(H34:H36)","v":36863.260652472309},{"$f":"SUM(I34:I36)","v":36927.175360058733},{"$f":"SUM(J34:J36)","v":36996.66763873164}]
[null,"(vi)  GAS SUPPLIERS"]
[null,"Distribution mains",null,535.11796918683922,25018.495311900948,134648.16310565107,648388.84185222408,680112.23378940392,59035.286143714387,0]
[null,"Inlet service pipes",null,0,0,0,0,0,0,0]
[null,"Meters (gas)",null,0,0,0,0,0,0,0]
[null,null,"Total",{"$f":"SUM(D39:D41)","v":535.11796918683922},{"$f":"SUM(E39:E41)","v":25018.495311900948},134648.16310565107,648388.84185222408,680112.23378940392,59035.286143714387,0]
[null,null,"TOTAL",{"$f":"SUM(D37,D32,D27,D22,D17,D42)","v":75844.699397043674},{"$f":"SUM(E37,E32,E27,E22,E17,E42)","v":82735.583678581839},244545.9089356871,687567.81419177703,716975.49444187619,95962.461503773113,36996.66763873164]
[]
[null,"B. DIRECT CONTRACTOR EXPENDITURE"]
[null,null,null,"EXPENDITURE"]
[null,null,null,{"$f":"CONCATENATE(\"$, real \",dms_DollarReal)","v":"$, real June 2025"}]
[null,null,null,{"$f":"dms_y1","v":"2023-24"},{"$f":"dms_y2","v":"2024-25"},{"$f":"dms_y3","v":"2025-26"},{"$f":"dms_y4","v":"2026-27"},{"$f":"dms_y5","v":"2027-28"},{"$f":"dms_y6","v":"2028-29"},{"$f":"dms_y7","v":"2029-30"}]
[null,"(i)  ELECTRICITY TO GAS"]
[null,"Distribution mains"]
[null,"Inlet service pipes"]
[null,"Meters (gas)"]
[null,null,"Total"]
[null,"(ii)  NEW HOMES"]
[null,"Distribution mains"]
[null,"Inlet service pipes"]
[null,"Meters (gas)"]
[null,null,"Total"]
[null,"(iii)  NEW MEDIUM DENSITY / HIGH RISE"]
[null,"Distribution mains"]
[null,"Inlet service pipes"]
[null,"Meters (gas)"]
[null,null,"Total"]
[null,"(iv)  INDUSTRIAL & COMMERCIAL TARIFF"]
[null,"Distribution mains"]
[null,"Inlet service pipes"]
[null,"Meters (gas)"]
[null,null,"Total"]
[null,"(v)  INDUSTRIAL & COMMERCIAL CONTRACT"]
[null,"Distribution mains"]
[null,"Inlet service pipes"]
[null,"Meters (gas)"]
[null,null,"Total"]
[null,"(vi)  GAS SUPPLIERS"]
[null,"Distribution mains"]
[null,"Inlet service pipes"]
[null,"Meters (gas)"]
[null,null,"Total"]
[null,null,"TOTAL"]
[]
[null,"C. DIRECT MATERIAL EXPENDITURE"]
[null,null,null,"EXPENDITURE"]
[null,null,null,{"$f":"CONCATENATE(\"$, real \",dms_DollarReal)","v":"$, real June 2025"}]
[null,null,null,{"$f":"dms_y1","v":"2023-24"},{"$f":"dms_y2","v":"2024-25"},{"$f":"dms_y3","v":"2025-26"},{"$f":"dms_y4","v":"2026-27"},{"$f":"dms_y5","v":"2027-28"},{"$f":"dms_y6","v":"2028-29"},{"$f":"dms_y7","v":"2029-30"}]
[null,"(i)  ELECTRICITY TO GAS"]
[null,"Distribution mains",null,0,0,0,0,0,0,0]
[null,"Inlet service pipes",null,0,0,0,0,0,0,0]
[null,"Meters (gas)",null,0,0,0,0,0,0,0]
[null,null,"Total",{"$f":"SUM(D86:D88)","v":0},{"$f":"SUM(E86:E88)","v":0},{"$f":"SUM(F86:F88)","v":0},{"$f":"SUM(G86:G88)","v":0},{"$f":"SUM(H86:H88)","v":0},{"$f":"SUM(I86:I88)","v":0},{"$f":"SUM(J86:J88)","v":0}]
[null,"(ii)  NEW HOMES"]
[null,"Distribution mains",null,0,0,0,0,0,0,0]
[null,"Inlet service pipes",null,0,0,0,0,0,0,0]
[null,"Meters (gas)",null,0,0,0,0,0,0,0]
[null,null,"Total",{"$f":"SUM(D91:D93)","v":0},{"$f":"SUM(E91:E93)","v":0},{"$f":"SUM(F91:F93)","v":0},{"$f":"SUM(G91:G93)","v":0},{"$f":"SUM(H91:H93)","v":0},{"$f":"SUM(I91:I93)","v":0},{"$f":"SUM(J91:J93)","v":0}]
[null,"(iii)  NEW MEDIUM DENSITY / HIGH RISE"]
[null,"Distribution mains",null,0,0,0,0,0,0,0]
[null,"Inlet service pipes",null,0,0,0,0,0,0,0]
[null,"Meters (gas)",null,0,0,0,0,0,0,0]
[null,null,"Total",{"$f":"SUM(D96:D98)","v":0},{"$f":"SUM(E96:E98)","v":0},{"$f":"SUM(F96:F98)","v":0},{"$f":"SUM(G96:G98)","v":0},{"$f":"SUM(H96:H98)","v":0},{"$f":"SUM(I96:I98)","v":0},{"$f":"SUM(J96:J98)","v":0}]
[null,"(iv)  INDUSTRIAL & COMMERCIAL TARIFF"]
[null,"Distribution mains",null,0,0,0,0,0,0,0]
[null,"Inlet service pipes",null,0,0,0,0,0,0,0]
[null,"Meters (gas)",null,0,0,0,0,0,0,0]
[null,null,"Total",{"$f":"SUM(D101:D103)","v":0},{"$f":"SUM(E101:E103)","v":0},{"$f":"SUM(F101:F103)","v":0},{"$f":"SUM(G101:G103)","v":0},{"$f":"SUM(H101:H103)","v":0},{"$f":"SUM(I101:I103)","v":0},{"$f":"SUM(J101:J103)","v":0}]
[null,"(v)  INDUSTRIAL & COMMERCIAL CONTRACT"]
[null,"Distribution mains",null,0,0,0,0,0,0,0]
[null,"Inlet service pipes",null,0,0,0,0,0,0,0]
[null,"Meters (gas)",null,0,0,0,0,0,0,0]
[null,null,"Total",{"$f":"SUM(D106:D108)","v":0},{"$f":"SUM(E106:E108)","v":0},{"$f":"SUM(F106:F108)","v":0},{"$f":"SUM(G106:G108)","v":0},{"$f":"SUM(H106:H108)","v":0},{"$f":"SUM(I106:I108)","v":0},{"$f":"SUM(J106:J108)","v":0}]
[null,"(vi)  GAS SUPPLIERS"]
[null,"Distribution mains",null,0,0,5276.8930405636629,8343.8884064979156,25163.439689294461,0,0]
[null,"Inlet service pipes",null,0,0,0,0,0,0,0]
[null,"Meters (gas)",null,0,0,0,0,0,0,0]
[null,null,"Total",{"$f":"SUM(D111:D113)","v":0},{"$f":"SUM(E111:E113)","v":0},5276.8930405636629,8343.8884064979156,25163.439689294461,0,0]
[null,null,"TOTAL",{"$f":"SUM(D109,D104,D99,D94,D89,D114)","v":0},{"$f":"SUM(E109,E104,E99,E94,E89,E114)","v":0},{"$f":"SUM(F109,F104,F99,F94,F89,F114)","v":5276.8930405636629},{"$f":"SUM(G109,G104,G99,G94,G89,G114)","v":8343.8884064979156},{"$f":"SUM(H109,H104,H99,H94,H89,H114)","v":25163.439689294461},{"$f":"SUM(I109,I104,I99,I94,I89,I114)","v":0},{"$f":"SUM(J109,J104,J99,J94,J89,J114)","v":0}]
[]
[null,"D. OTHER DIRECT EXPENDITURE"]
[null,null,null,"EXPENDITURE"]
[null,null,null,{"$f":"CONCATENATE(\"$, real \",dms_DollarReal)","v":"$, real June 2025"}]
[null,null,null,{"$f":"dms_y1","v":"2023-24"},{"$f":"dms_y2","v":"2024-25"},{"$f":"dms_y3","v":"2025-26"},{"$f":"dms_y4","v":"2026-27"},{"$f":"dms_y5","v":"2027-28"},{"$f":"dms_y6","v":"2028-29"},{"$f":"dms_y7","v":"2029-30"}]
[null,"(i)  ELECTRICITY TO GAS"]
[null,"Distribution mains",null,0,0,0,0,0,0,0]
[null,"Inlet service pipes",null,0,0,0,0,0,0,0]
[null,"Meters (gas)",null,0,0,0,0,0,0,0]
[null,null,"Total",{"$f":"SUM(D122:D124)","v":0},{"$f":"SUM(E122:E124)","v":0},{"$f":"SUM(F122:F124)","v":0},{"$f":"SUM(G122:G124)","v":0},{"$f":"SUM(H122:H124)","v":0},{"$f":"SUM(I122:I124)","v":0},{"$f":"SUM(J122:J124)","v":0}]
[null,"(ii)  NEW HOMES"]
[null,"Distribution mains",null,0,8099.5688200625509,23277.22816495231,0,0,0,0]
[null,"Inlet service pipes",null,0,0,0,0,0,0,0]
[null,"Meters (gas)",null,0,0,0,0,0,0,0]
[null,null,"Total",{"$f":"SUM(D127:D129)","v":0},{"$f":"SUM(E127:E129)","v":8099.5688200625509},{"$f":"SUM(F127:F129)","v":23277.22816495231},{"$f":"SUM(G127:G129)","v":0},{"$f":"SUM(H127:H129)","v":0},{"$f":"SUM(I127:I129)","v":0},{"$f":"SUM(J127:J129)","v":0}]
[null,"(iii)  NEW MEDIUM DENSITY / HIGH RISE"]
[null,"Distribution mains",null,0,0,0,0,0,0,0]
[null,"Inlet service pipes",null,0,0,0,0,0,0,0]
[null,"Meters (gas)",null,0,0,0,0,0,0,0]
[null,null,"Total",{"$f":"SUM(D132:D134)","v":0},{"$f":"SUM(E132:E134)","v":0},{"$f":"SUM(F132:F134)","v":0},{"$f":"SUM(G132:G134)","v":0},{"$f":"SUM(H132:H134)","v":0},{"$f":"SUM(I132:I134)","v":0},{"$f":"SUM(J132:J134)","v":0}]
[null,"(iv)  INDUSTRIAL & COMMERCIAL TARIFF"]
[null,"Distribution mains",null,0,0,0,0,0,0,0]
[null,"Inlet service pipes",null,339904.54528591712,345338.04074071796,351144.36769812816,356661.76071713725,362210.06612519553,367999.42199722474,373969.55979645997]
[null,"Meters (gas)",null,0,0,0,0,0,0,0]
[null,null,"Total",{"$f":"SUM(D137:D139)","v":339904.54528591712},{"$f":"SUM(E137:E139)","v":345338.04074071796},{"$f":"SUM(F137:F139)","v":351144.36769812816},{"$f":"SUM(G137:G139)","v":356661.76071713725},{"$f":"SUM(H137:H139)","v":362210.06612519553},{"$f":"SUM(I137:I139)","v":367999.42199722474},{"$f":"SUM(J137:J139)","v":373969.55979645997}]
[null,"(v)  INDUSTRIAL & COMMERCIAL CONTRACT"]
[null,"Distribution mains",null,221383.2392920735,96062.703624336718,95674.456777859188,95836.531291515857,95989.155313026218,96169.149226110661,96364.850460456146]
[null,"Inlet service pipes",null,0,0,0,0,0,0,0]
[null,"Meters (gas)",null,0,0,0,0,0,0,0]
[null,null,"Total",{"$f":"SUM(D142:D144)","v":221383.2392920735},{"$f":"SUM(E142:E144)","v":96062.703624336718},{"$f":"SUM(F142:F144)","v":95674.456777859188},{"$f":"SUM(G142:G144)","v":95836.531291515857},{"$f":"SUM(H142:H144)","v":95989.155313026218},{"$f":"SUM(I142:I144)","v":96169.149226110661},{"$f":"SUM(J142:J144)","v":96364.850460456146}]
[null,"(vi)  GAS SUPPLIERS"]
[null,"Distribution mains",null,19579.119313036765,750180.54563449905,1948544.701393716,9957531.6461550146,6851402.3255272983,862803.52255915687,0]
[null,"Inlet service pipes",null,0,0,0,0,0,0,0]
[null,"Meters (gas)",null,0,0,0,0,0,0,0]
[null,null,"Total",{"$f":"SUM(D147:D149)","v":19579.119313036765},{"$f":"SUM(E147:E149)","v":750180.54563449905},1948544.701393716,9957531.6461550146,6851402.3255272983,862803.52255915687,0]
[null,null,"TOTAL",{"$f":"SUM(D145,D140,D135,D130,D125,D150)","v":580866.90389102744},{"$f":"SUM(E145,E140,E135,E130,E125,E150)","v":1199680.8588196163},{"$f":"SUM(F145,F140,F135,F130,F125,F150)","v":2418640.7540346556},{"$f":"SUM(G145,G140,G135,G130,G125,G150)","v":10410029.938163668},{"$f":"SUM(H145,H140,H135,H130,H125,H150)","v":7309601.5469655199},{"$f":"SUM(I145,I140,I135,I130,I125,I150)","v":1326972.0937824922},{"$f":"SUM(J145,J140,J135,J130,J125,J150)","v":470334.41025691613}]
[]
[null,"E. RELATED PARTY MARGIN EXPENDITURE"]
[null,null,null,"EXPENDITURE"]
[null,null,null,{"$f":"CONCATENATE(\"$, real \",dms_DollarReal)","v":"$, real June 2025"}]
[null,null,null,{"$f":"dms_y1","v":"2023-24"},{"$f":"dms_y2","v":"2024-25"},{"$f":"dms_y3","v":"2025-26"},{"$f":"dms_y4","v":"2026-27"},{"$f":"dms_y5","v":"2027-28"},{"$f":"dms_y6","v":"2028-29"},{"$f":"dms_y7","v":"2029-30"}]
[null,"(i)  ELECTRICITY TO GAS"]
[null,"Distribution mains"]
[null,"Inlet service pipes"]
[null,"Meters (gas)"]
[null,null,"Total"]
[null,"(ii)  NEW HOMES"]
[null,"Distribution mains"]
[null,"Inlet service pipes"]
[null,"Meters (gas)"]
[null,null,"Total"]
[null,"(iii)  NEW MEDIUM DENSITY / HIGH RISE"]
[null,"Distribution mains"]
[null,"Inlet service pipes"]
[null,"Meters (gas)"]
[null,null,"Total"]
[null,"(iv)  INDUSTRIAL & COMMERCIAL TARIFF"]
[null,"Distribution mains"]
[null,"Inlet service pipes"]
[null,"Meters (gas)"]
[null,null,"Total"]
[null,"(v)  INDUSTRIAL & COMMERCIAL CONTRACT"]
[null,"Distribution mains"]
[null,"Inlet service pipes"]
[null,"Meters (gas)"]
[null,null,"Total"]
[null,"(vi)  GAS SUPPLIERS"]
[null,"Distribution mains"]
[null,"Inlet service pipes"]
[null,"Meters (gas)"]
[null,null,"Total"]
[null,null,"TOTAL"]
[]
[null,"F. CAPITAL CONTRIBUTIONS included in the above"]
[null,null,null,"EXPENDITURE"]
[null,null,null,{"$f":"CONCATENATE(\"$, real \",dms_DollarReal)","v":"$, real June 2025"}]
[null,null,null,{"$f":"dms_y1","v":"2023-24"},{"$f":"dms_y2","v":"2024-25"},{"$f":"dms_y3","v":"2025-26"},{"$f":"dms_y4","v":"2026-27"},{"$f":"dms_y5","v":"2027-28"},{"$f":"dms_y6","v":"2028-29"},{"$f":"dms_y7","v":"2029-30"}]
[null,"(i)  ELECTRICITY TO GAS"]
[null,"Distribution mains",null,147468.41236329652,141337.83613646924,160745.03341992982,129615.06422757595,91402.659022653912,64537.044692262665,32570.542732950657]
[null,"Inlet service pipes",null,652674.4625501699,625547.36752528127,711450.33878472017,573675.28583829943,404550.61311597138,285645.26143643557,144160.78229505301]
[null,"Meters (gas)",null,60996.743166361564,58460.978754148193,66488.297006409208,53612.138000004292,37806.500447195664,26694.188588674351,13472.017776892428]
[null,null,"Total",{"$f":"SUM(D194:D196)","v":861139.61807982798},{"$f":"SUM(E194:E196)","v":825346.18241589877},938683.66921105911,756902.48806587968,533759.77258582087,376876.49471737258,190203.34280489609]
[null,"(ii)  NEW HOMES"]
[null,"Distribution mains",null,583627.08356672106,486218.54236868565,375107.12357725127,443140.17264289293,475979.18333181081,430457.43892338127,369030.726702035]
[null,"Inlet service pipes",null,1406840.2192460834,1172035.27988075,904199.50122344238,1068193.4841028468,1147351.8568066633,1037620.9213300524,889551.01323025604]
[null,"Meters (gas)",null,125611.44344501551,104646.59838118895,80732.554553559894,95374.957276610003,102442.70914839808,92645.248893781041,79424.646715318668]
[null,null,"Total",{"$f":"SUM(D199:D201)","v":2116078.7462578202},{"$f":"SUM(E199:E201)","v":1762900.4206306245},1360039.1793542537,1606708.6140223497,1725773.7492868723,1560723.6091472148,1338006.3866476095]
[null,"(iii)  NEW MEDIUM DENSITY / HIGH RISE"]
[null,"Distribution mains",null,69224.997836564376,109624.75316056013,229486.30120385744,142917.53249783462,74508.0534288255,23195.808682405343,3790.2536793286054]
[null,"Inlet service pipes",null,50916.414155555576,80631.325628454229,168792.18437935293,105119.03129054983,54802.366347278752,17061.055935158103,2787.8216180921941]
[null,"Meters (gas)",null,118913.39646379137,172479.30516937061,338007.75131922262,224032.83633067468,134007.12769776053,66593.190109367337,41318.079885249565]
[null,null,"Total",{"$f":"SUM(D204:D206)","v":239054.80845591132},{"$f":"SUM(E204:E206)","v":362735.38395838498},736286.23690243298,472069.40011905914,263317.54747386475,106850.05472693079,47896.155182670365]
[null,"(iv)  INDUSTRIAL & COMMERCIAL TARIFF"]
[null,"Distribution mains",null,548747.306660695,204593.6501977389,261823.40843100552,267284.8199123352,272726.17248520313,278616.44589307538,284820.15989010193]
[null,"Inlet service pipes",null,109912.30095568081,111706.65538703176,141979.7961237772,144254.55344825049,146540.57637296789,148933.08209295833,151404.81842978782]
[null,"Meters (gas)",null,80690.970510496147,82476.963798382611,105594.74263341496,107830.49775509941,110057.09460072663,112471.3517141888,115016.39929929284]
[null,null,"Total",{"$f":"SUM(D209:D211)","v":739350.57812687196},{"$f":"SUM(E209:E211)","v":398777.26938315324},509397.94718819769,519369.87111568509,529323.84345889767,540020.87970022252,551241.37761918257]
[null,"(v)  INDUSTRIAL & COMMERCIAL CONTRACT"]
[null,"Distribution mains"]
[null,"Inlet service pipes"]
[null,"Meters (gas)"]
[null,null,"Total"]
[null,"(vi)  GAS SUPPLIERS"]
[null,"Distribution mains",null,0,0,0,0,0,0,0]
[null,"Inlet service pipes",null,0,0,0,0,0,0,0]
[null,"Meters (gas)",null,0,0,0,0,0,0,0]
[null,null,"Total",{"$f":"SUM(D219:D221)","v":0},{"$f":"SUM(E219:E221)","v":0},0,0,0,0,0]
[null,null,"TOTAL"]
[]
[]
[null,"E5.2 - UNIT RATES"]
[null,"E5.2.1 - UNIT RATES - PER CONNECTION - BY CONNECTION TYPE"]
[null,null,null,"RATES PER CONNECTION"]
[null,null,null,{"$f":"CONCATENATE(\"$, real \",dms_DollarReal)","v":"$, real June 2025"}]
[null,null,"Units",{"$f":"dms_y1","v":"2023-24"},{"$f":"dms_y2","v":"2024-25"},{"$f":"dms_y3","v":"2025-26"},{"$f":"dms_y4","v":"2026-27"},{"$f":"dms_y5","v":"2027-28"},{"$f":"dms_y6","v":"2028-29"},{"$f":"dms_y7","v":"2029-30"}]
[null,"A. ELECTRICITY TO GAS"]
[null,"Distribution mains","per metre per connection"]
[null,"Inlet service pipes","per service per connection"]
[null,"Meters (gas)","number per connection"]
[null,"B. NEW HOMES"]
[null,"Distribution mains","per metre per connection"]
[null,"Inlet service pipes","per service per connection"]
[null,"Meters (gas)","number per connection"]
[null,"C. NEW MEDIUM DENSITY / HIGH RISE"]
[null,"Distribution mains","per metre per connection"]
[null,"Inlet service pipes","per service per connection"]
[null,"Meters (gas)","number per connection"]
[null,"D. INDUSTRIAL & COMMERCIAL TARIFF"]
[null,"Distribution mains","per metre per connection"]
[null,"Inlet service pipes","per service per connection"]
[null,"Meters (gas)","number per connection"]
[null,"E. INDUSTRIAL & COMMERCIAL CONTRACT"]
[null,"Distribution mains","per metre per connection"]
[null,"Inlet service pipes","per service per connection"]
[null,"Meters (gas)","number per connection"]
[null,"F. GAS SUPPLIERS"]
[null,"Distribution mains","per metre per connection"]
[null,"Inlet service pipes","per service per connection"]
[null,"Meters (gas)","number per connection"]
[]
[]
[]
[]
[null,"E5.3 - VOLUMES"]
[null,"E5.3.1 - NUMBER OF NEW CONNECTIONS"]
[null,null,null,"VOLUMES"]
[null,null,null,"0s"]
[null,null,null,{"$f":"dms_y1","v":"2023-24"},{"$f":"dms_y2","v":"2024-25"},{"$f":"dms_y3","v":"2025-26"},{"$f":"dms_y4","v":"2026-27"},{"$f":"dms_y5","v":"2027-28"},{"$f":"dms_y6","v":"2028-29"},{"$f":"dms_y7","v":"2029-30"}]
[null,"Electricity to gas",null,3500,3324.9999999999995,2992.4999999999995,2393.9999999999995,1675.7999999999997,1173.0599999999997,586.52999999999986]
[null,"New homes",null,16131.620000000003,13321.051646108192,8132.5369126867099,9532.0029454794785,10163.093467588256,9112.0529672019111,7739.3218821839082]
[null,"New medium density / high rise",null,2295.1975703431999,3602.6807403503135,5968.044259808019,3687.4761096499146,1908.263046316777,588.96355391824136,95.344814602257884]
[null,"Industrial and commercial tariff",null,583.56634032808017,591.2320721595637,598.99850110198611,606.86694991335332,614.83875872743045,622.91528528198967,631.09790515005682]
[null,"Industrial and commercial contract",null,"NA","NA","NA","NA","NA","NA","NA"]
[null,"Gas suppliers",null,0,0,1,0,3,3,1]
[null,null,"Total",{"$f":"SUM(D264:D269)","v":22510.383910671284},{"$f":"SUM(E264:E269)","v":20839.964458618069},17693.079673596712,16220.346005042747,14364.995272632463,11499.991806402142,9053.2946019362225]
[]
[null,"E5.3.2 - VOLUMES - PER CONNECTION - BY CONNECTION TYPE"]
[null,null,null,"VOLUMES"]
[null,null,null,"0s"]
[null,null,"Units",{"$f":"dms_y1","v":"2023-24"},{"$f":"dms_y2","v":"2024-25"},{"$f":"dms_y3","v":"2025-26"},{"$f":"dms_y4","v":"2026-27"},{"$f":"dms_y5","v":"2027-28"},{"$f":"dms_y6","v":"2028-29"},{"$f":"dms_y7","v":"2029-30"}]
[null,"A. ELECTRICITY TO GAS"]
[null,"Distribution mains","metres per connection"]
[null,"Inlet service pipes","number per connection"]
[null,"Meters (gas)","number per connection"]
[null,"B. NEW HOMES"]
[null,"Distribution mains","metres per connection"]
[null,"Inlet service pipes","number per connection"]
[null,"Meters (gas)","number per connection"]
[null,"C. NEW MEDIUM DENSITY / HIGH RISE"]
[null,"Distribution mains","metres per connection"]
[null,"Inlet service pipes","number per connection"]
[null,"Meters (gas)","number per connection"]
[null,"D. INDUSTRIAL & COMMERCIAL TARIFF"]
[null,"Distribution mains","metres per connection"]
[null,"Inlet service pipes","number per connection"]
[null,"Meters (gas)","number per connection"]
[null,"E. INDUSTRIAL & COMMERCIAL CONTRACT"]
[null,"Distribution mains","metres per connection"]
[null,"Inlet service pipes","number per connection"]
[null,"Meters (gas)","number per connection"]
[null,"F. GAS SUPPLIERS"]
[null,"Distribution mains","metres per connection"]
[null,"Inlet service pipes","number per connection"]
[null,"Meters (gas)","number per connection"]
[]
[]
[]
[null,"E5.4 -  CAPITAL CONTRIBUTIONS"]
[null,"E5.4.1 - VALUE OF CAPITAL CONTRIBUTIONS - BY CONNECTION TYPE"]
[null,null,null,"VALUE"]
[null,null,null,{"$f":"CONCATENATE(\"$, real \",dms_DollarReal)","v":"$, real June 2025"}]
[null,null,null,{"$f":"dms_y1","v":"2023-24"},{"$f":"dms_y2","v":"2024-25"},{"$f":"dms_y3","v":"2025-26"},{"$f":"dms_y4","v":"2026-27"},{"$f":"dms_y5","v":"2027-28"},{"$f":"dms_y6","v":"2028-29"},{"$f":"dms_y7","v":"2029-30"}]
[null,"Electricity to gas",null,861139.61807982798,825346.18241589877,938683.66921105911,756902.48806587968,533759.77258582087,376876.49471737258,190203.34280489609]
[null,"New homes",null,2116078.7462578202,1762900.4206306245,1360039.1793542537,1606708.6140223497,1725773.7492868723,1560723.6091472148,1338006.3866476095]
[null,"New medium density / high rise",null,239054.80845591132,362735.38395838498,736286.23690243298,472069.40011905908,263317.54747386475,106850.05472693079,47896.155182670365]
[null,"Industrial & commercial tariff",null,739350.57812687196,398777.26938315324,509397.94718819769,519369.87111568509,529323.84345889767,540020.87970022252,551241.37761918257]
[null,"Industrial & commercial contract"]
[null,"Gas suppliers",null,0,0,0,0,0,0,0]
[null,null,"Total"]
[]
[null,"E5.4.2 - NUMBER OF CAPITAL CONTRIBUTIONS - BY CONNECTION TYPE"]
[null,null,null,"VOLUMES"]
[null,null,null,"0's"]
[null,null,null,{"$f":"dms_y1","v":"2023-24"},{"$f":"dms_y2","v":"2024-25"},{"$f":"dms_y3","v":"2025-26"},{"$f":"dms_y4","v":"2026-27"},{"$f":"dms_y5","v":"2027-28"},{"$f":"dms_y6","v":"2028-29"},{"$f":"dms_y7","v":"2029-30"}]
[null,"Electricity to gas",null,328.69792965826889,416.35071090047387,374.71563981042647,299.77251184834114,209.84075829383883,146.88853080568717,73.444265402843584]
[null,"New homes",null,1034.9054676923076,928.90945425202619,567.10165427932418,664.68983750249879,708.69732039871292,635.40570022127042,539.6818101790451]
[null,"New medium density / high rise",null,8.3920854571478749,13.172724230149708,21.821362172695505,13.482767249856398,6.9773106970538983,2.1534671086673955,0.34861566706800928]
[null,"Industrial & commercial tariff",null,33.278289254638935,33.71543311234187,34.158319295044308,34.60702323397058,35.061621351210157,35.522191072733662,35.988810841579834]
[null,"Industrial & commercial contract",null,1,1,1,1,1,1,1]
[null,"Gas suppliers",null,0,0,0,0,0,0,0]
[null,null,"Total",{"$f":"SUM(D320:D325)","v":1406.2737720623632},{"$f":"SUM(E320:E325)","v":1393.1483224949916},998.79697555749055,1013.5521398346669,961.57701074081581,820.96988920835872,650.46350209053651]

{"sheet":"E6. Telemetry","index":8,"n_rows":144,"n_cols":9,"rows_kept":144,"cut":false,"hidden":false,"merged":[]}
[null,{"$f":"INDEX(dms_Worksheet_List,MATCH(dms_Model,dms_Model_List))","v":"REGULATORY REPORTING STATEMENT"}]
[null,{"$f":"dms_TradingNameFull","v":"Jemena Gas Networks (NSW) Ltd"}]
[null,{"$f":"dms_Header_Span","v":"2023-24 to 2029-30"}]
[null,"E6. NON-NETWORK EXPENDITURE"]
[null,"FINAL RIN TEMPLATE - FEBRUARY 2024"]
[]
[null,"E6.5 - TELEMETRY"]
[]
[null,"Please list all projects or categories here:"]
[null,"Recurrent Capex (telemetry only)"]
[null,""]
[null,""]
[null,""]
[null,""]
[null,""]
[null,""]
[null,""]
[null,""]
[null,""]
[null,""]
[null,""]
[null,""]
[null,""]
[null,""]
[]
[]
[null,"E6.5.1 - CAPEX - BY PROJECT"]
[null,"A. DIRECT INTERNAL LABOUR EXPENDITURE"]
[null,null,"EXPENDITURE"]
[null,null,{"$f":"CONCATENATE(\"$, real \",dms_DollarReal)","v":"$, real June 2025"}]
[null,null,{"$f":"dms_y1","v":"2023-24"},{"$f":"dms_y2","v":"2024-25"},{"$f":"dms_y3","v":"2025-26"},{"$f":"dms_y4","v":"2026-27"},{"$f":"dms_y5","v":"2027-28"},{"$f":"dms_y6","v":"2028-29"},{"$f":"dms_y7","v":"2029-30"}]
[null,{"$f":"IF(ISBLANK(dms_E65_Projects_01),\"\",dms_E65_Projects_01)","v":"Recurrent Capex (telemetry only)"},86774.927607775404,87237.340213467804,87835.821540116958,88256.668222106047,88652.97552295994,89120.352159735106,89628.514814536844]
[null,{"$f":"IF(ISBLANK(dms_E65_Projects_02),\"\",dms_E65_Projects_02)","v":""},"","","","","","",""]
[null,{"$f":"IF(ISBLANK(dms_E65_Projects_03),\"\",dms_E65_Projects_03)","v":""},"","","","","","",""]
[null,{"$f":"IF(ISBLANK(dms_E65_Projects_04),\"\",dms_E65_Projects_04)","v":""},"","","","","","",""]
[null,{"$f":"IF(ISBLANK(dms_E65_Projects_05),\"\",dms_E65_Projects_05)","v":""},"","","","","","",""]
[null,{"$f":"IF(ISBLANK(dms_E65_Projects_06),\"\",dms_E65_Projects_06)","v":""},"","","","","","",""]
[null,{"$f":"IF(ISBLANK(dms_E65_Projects_07),\"\",dms_E65_Projects_07)","v":""},"","","","","","",""]
[null,{"$f":"IF(ISBLANK(dms_E65_Projects_08),\"\",dms_E65_Projects_08)","v":""},"","","","","","",""]
[null,{"$f":"IF(ISBLANK(dms_E65_Projects_09),\"\",dms_E65_Projects_09)","v":""},"","","","","","",""]
[null,{"$f":"IF(ISBLANK(dms_E65_Projects_10),\"\",dms_E65_Projects_10)","v":""},"","","","","","",""]
[null,{"$f":"IF(ISBLANK(dms_E65_Projects_11),\"\",dms_E65_Projects_11)","v":""},"","","","","","",""]
[null,{"$f":"IF(ISBLANK(dms_E65_Projects_12),\"\",dms_E65_Projects_12)","v":""},"","","","","","",""]
[null,{"$f":"IF(ISBLANK(dms_E65_Projects_13),\"\",dms_E65_Projects_13)","v":""},"","","","","","",""]
[null,{"$f":"IF(ISBLANK(dms_E65_Projects_14),\"\",dms_E65_Projects_14)","v":""},"","","","","","",""]
[null,{"$f":"IF(ISBLANK(dms_E65_Projects_15),\"\",dms_E65_Projects_15)","v":""},"","","","","","",""]
[null,"Aggregate of other projects or categories with total expenditure of less than $500,000",0,0,0,0,0,0,0]
[null,"Total",{"$f":"SUM(C32:C47)","v":86774.927607775404},{"$f":"SUM(D32:D47)","v":87237.340213467804},87835.821540116958,88256.668222106047,88652.97552295994,89120.352159735106,89628.514814536844]
[]
[null,"B. DIRECT CONTRACTOR EXPENDITURE"]
[null,{"$f":"IF(ISBLANK(dms_E65_Projects_01),\"\",dms_E65_Projects_01)","v":"Recurrent Capex (telemetry only)"},93144.059760616467,93640.412665378972,94282.821503874235,94734.557616803431,95159.953199743628,95661.634487030591,96207.095416723445]
[null,{"$f":"IF(ISBLANK(dms_E65_Projects_02),\"\",dms_E65_Projects_02)","v":""},"","","","","","",""]
[null,{"$f":"IF(ISBLANK(dms_E65_Projects_03),\"\",dms_E65_Projects_03)","v":""},"","","","","","",""]
[null,{"$f":"IF(ISBLANK(dms_E65_Projects_04),\"\",dms_E65_Projects_04)","v":""},"","","","","","",""]
[null,{"$f":"IF(ISBLANK(dms_E65_Projects_05),\"\",dms_E65_Projects_05)","v":""},"","","","","","",""]
[null,{"$f":"IF(ISBLANK(dms_E65_Projects_06),\"\",dms_E65_Projects_06)","v":""},"","","","","","",""]
[null,{"$f":"IF(ISBLANK(dms_E65_Projects_07),\"\",dms_E65_Projects_07)","v":""},"","","","","","",""]
[null,{"$f":"IF(ISBLANK(dms_E65_Projects_08),\"\",dms_E65_Projects_08)","v":""},"","","","","","",""]
[null,{"$f":"IF(ISBLANK(dms_E65_Projects_09),\"\",dms_E65_Projects_09)","v":""},"","","","","","",""]
[null,{"$f":"IF(ISBLANK(dms_E65_Projects_10),\"\",dms_E65_Projects_10)","v":""},"","","","","","",""]
[null,{"$f":"IF(ISBLANK(dms_E65_Projects_11),\"\",dms_E65_Projects_11)","v":""},"","","","","","",""]
[null,{"$f":"IF(ISBLANK(dms_E65_Projects_12),\"\",dms_E65_Projects_12)","v":""},"","","","","","",""]
[null,{"$f":"IF(ISBLANK(dms_E65_Projects_13),\"\",dms_E65_Projects_13)","v":""},"","","","","","",""]
[null,{"$f":"IF(ISBLANK(dms_E65_Projects_14),\"\",dms_E65_Projects_14)","v":""},"","","","","","",""]
[null,{"$f":"IF(ISBLANK(dms_E65_Projects_15),\"\",dms_E65_Projects_15)","v":""},"","","","","","",""]
[null,"Aggregate of other projects or categories with total expenditure of less than $500,000",0,0,0,0,0,0,0]
[null,"Total",{"$f":"SUM(C51:C66)","v":93144.059760616467},{"$f":"SUM(D51:D66)","v":93640.412665378972},{"$f":"SUM(E51:E66)","v":94282.821503874235},{"$f":"SUM(F51:F66)","v":94734.557616803431},{"$f":"SUM(G51:G66)","v":95159.953199743628},{"$f":"SUM(H51:H66)","v":95661.634487030591},{"$f":"SUM(I51:I66)","v":96207.095416723445}]
[]
[null,"C. DIRECT MATERIAL EXPENDITURE"]
[null,{"$f":"IF(ISBLANK(dms_E65_Projects_01),\"\",dms_E65_Projects_01)","v":"Recurrent Capex (telemetry only)"},0,0,0,0,0,0,0]
[null,{"$f":"IF(ISBLANK(dms_E65_Projects_02),\"\",dms_E65_Projects_02)","v":""},"","","","","","",""]
[null,{"$f":"IF(ISBLANK(dms_E65_Projects_03),\"\",dms_E65_Projects_03)","v":""},"","","","","","",""]
[null,{"$f":"IF(ISBLANK(dms_E65_Projects_04),\"\",dms_E65_Projects_04)","v":""},"","","","","","",""]
[null,{"$f":"IF(ISBLANK(dms_E65_Projects_05),\"\",dms_E65_Projects_05)","v":""},"","","","","","",""]
[null,{"$f":"IF(ISBLANK(dms_E65_Projects_06),\"\",dms_E65_Projects_06)","v":""},"","","","","","",""]
[null,{"$f":"IF(ISBLANK(dms_E65_Projects_07),\"\",dms_E65_Projects_07)","v":""},"","","","","","",""]
[null,{"$f":"IF(ISBLANK(dms_E65_Projects_08),\"\",dms_E65_Projects_08)","v":""},"","","","","","",""]
[null,{"$f":"IF(ISBLANK(dms_E65_Projects_09),\"\",dms_E65_Projects_09)","v":""},"","","","","","",""]
[null,{"$f":"IF(ISBLANK(dms_E65_Projects_10),\"\",dms_E65_Projects_10)","v":""},"","","","","","",""]
[null,{"$f":"IF(ISBLANK(dms_E65_Projects_11),\"\",dms_E65_Projects_11)","v":""},"","","","","","",""]
[null,{"$f":"IF(ISBLANK(dms_E65_Projects_12),\"\",dms_E65_Projects_12)","v":""},"","","","","","",""]
[null,{"$f":"IF(ISBLANK(dms_E65_Projects_13),\"\",dms_E65_Projects_13)","v":""},"","","","","","",""]
[null,{"$f":"IF(ISBLANK(dms_E65_Projects_14),\"\",dms_E65_Projects_14)","v":""},"","","","","","",""]
[null,{"$f":"IF(ISBLANK(dms_E65_Projects_15),\"\",dms_E65_Projects_15)","v":""},"","","","","","",""]
[null,"Aggregate of other projects or categories with total expenditure of less than $500,000",0,0,0,0,0,0,0]
[null,"Total",{"$f":"SUM(C70:C85)","v":0},{"$f":"SUM(D70:D85)","v":0},0,0,0,0,0]
[]
[null,"D. OTHER DIRECT EXPENDITURE"]
[null,{"$f":"IF(ISBLANK(dms_E65_Projects_01),\"\",dms_E65_Projects_01)","v":"Recurrent Capex (telemetry only)"},0,0,0,0,0,0,0]
[null,{"$f":"IF(ISBLANK(dms_E65_Projects_02),\"\",dms_E65_Projects_02)","v":""},"","","","","","",""]
[null,{"$f":"IF(ISBLANK(dms_E65_Projects_03),\"\",dms_E65_Projects_03)","v":""},"","","","","","",""]
[null,{"$f":"IF(ISBLANK(dms_E65_Projects_04),\"\",dms_E65_Projects_04)","v":""},"","","","","","",""]
[null,{"$f":"IF(ISBLANK(dms_E65_Projects_05),\"\",dms_E65_Projects_05)","v":""},"","","","","","",""]
[null,{"$f":"IF(ISBLANK(dms_E65_Projects_06),\"\",dms_E65_Projects_06)","v":""},"","","","","","",""]
[null,{"$f":"IF(ISBLANK(dms_E65_Projects_07),\"\",dms_E65_Projects_07)","v":""},"","","","","","",""]
[null,{"$f":"IF(ISBLANK(dms_E65_Projects_08),\"\",dms_E65_Projects_08)","v":""},"","","","","","",""]
[null,{"$f":"IF(ISBLANK(dms_E65_Projects_09),\"\",dms_E65_Projects_09)","v":""},"","","","","","",""]
[null,{"$f":"IF(ISBLANK(dms_E65_Projects_10),\"\",dms_E65_Projects_10)","v":""},"","","","","","",""]
[null,{"$f":"IF(ISBLANK(dms_E65_Projects_11),\"\",dms_E65_Projects_11)","v":""},"","","","","","",""]
[null,{"$f":"IF(ISBLANK(dms_E65_Projects_12),\"\",dms_E65_Projects_12)","v":""},"","","","","","",""]
[null,{"$f":"IF(ISBLANK(dms_E65_Projects_13),\"\",dms_E65_Projects_13)","v":""},"","","","","","",""]
[null,{"$f":"IF(ISBLANK(dms_E65_Projects_14),\"\",dms_E65_Projects_14)","v":""},"","","","","","",""]
[null,{"$f":"IF(ISBLANK(dms_E65_Projects_15),\"\",dms_E65_Projects_15)","v":""},"","","","","","",""]
[null,"Aggregate of other projects or categories with total expenditure of less than $500,000",0,0,0,0,0,0,0]
[null,"Total",{"$f":"SUM(C89:C104)","v":0},{"$f":"SUM(D89:D104)","v":0},{"$f":"SUM(E89:E104)","v":0},{"$f":"SUM(F89:F104)","v":0},{"$f":"SUM(G89:G104)","v":0},{"$f":"SUM(H89:H104)","v":0},{"$f":"SUM(I89:I104)","v":0}]
[]
[null,"E. RELATED PARTY MARGIN EXPENDITURE"]
[null,"Total",0,0,0,0,0,0,0]
[null,"Total",{"$f":"SUM(C108:C108)","v":0},0,0,0,0,0,0]
[]
[null,"F. CAPITAL CONTRIBUTIONS included in the above"]
[null,{"$f":"IF(ISBLANK(dms_E65_Projects_01),\"\",dms_E65_Projects_01)","v":"Recurrent Capex (telemetry only)"},0,0,0,0,0,0,0]
[null,{"$f":"IF(ISBLANK(dms_E65_Projects_02),\"\",dms_E65_Projects_02)","v":""},"","","","","","",""]
[null,{"$f":"IF(ISBLANK(dms_E65_Projects_03),\"\",dms_E65_Projects_03)","v":""},"","","","","","",""]
[null,{"$f":"IF(ISBLANK(dms_E65_Projects_04),\"\",dms_E65_Projects_04)","v":""},"","","","","","",""]
[null,{"$f":"IF(ISBLANK(dms_E65_Projects_05),\"\",dms_E65_Projects_05)","v":""},"","","","","","",""]
[null,{"$f":"IF(ISBLANK(dms_E65_Projects_06),\"\",dms_E65_Projects_06)","v":""},"","","","","","",""]
[null,{"$f":"IF(ISBLANK(dms_E65_Projects_07),\"\",dms_E65_Projects_07)","v":""},"","","","","","",""]
[null,{"$f":"IF(ISBLANK(dms_E65_Projects_08),\"\",dms_E65_Projects_08)","v":""},"","","","","","",""]
[null,{"$f":"IF(ISBLANK(dms_E65_Projects_09),\"\",dms_E65_Projects_09)","v":""},"","","","","","",""]
[null,{"$f":"IF(ISBLANK(dms_E65_Projects_10),\"\",dms_E65_Projects_10)","v":""},"","","","","","",""]
[null,{"$f":"IF(ISBLANK(dms_E65_Projects_11),\"\",dms_E65_Projects_11)","v":""},"","","","","","",""]
[null,{"$f":"IF(ISBLANK(dms_E65_Projects_12),\"\",dms_E65_Projects_12)","v":""},"","","","","","",""]
[null,{"$f":"IF(ISBLANK(dms_E65_Projects_13),\"\",dms_E65_Projects_13)","v":""},"","","","","","",""]
[null,{"$f":"IF(ISBLANK(dms_E65_Projects_14),\"\",dms_E65_Projects_14)","v":""},"","","","","","",""]
[null,{"$f":"IF(ISBLANK(dms_E65_Projects_15),\"\",dms_E65_Projects_15)","v":""},"","","","","","",""]
[null,"Aggregate of other projects or categories with total expenditure of less than $500,000",0,0,0,0,0,0,0]
[null,"Total",{"$f":"SUM(C112:C127)","v":0},{"$f":"SUM(D112:D127)","v":0},{"$f":"SUM(E112:E127)","v":0},{"$f":"SUM(F112:F127)","v":0},{"$f":"SUM(G112:G127)","v":0},{"$f":"SUM(H112:H127)","v":0},{"$f":"SUM(I112:I127)","v":0}]
[]
[]
[]
[]
[null,"E6.5.2 - EXPENDITURE BY PURPOSE"]
[null,null,"EXPENDITURE"]
[null,null,{"$f":"CONCATENATE(\"$, real \",dms_DollarReal)","v":"$, real June 2025"}]
[null,null,{"$f":"dms_y1","v":"2023-24"},{"$f":"dms_y2","v":"2024-25"},{"$f":"dms_y3","v":"2025-26"},{"$f":"dms_y4","v":"2026-27"},{"$f":"dms_y5","v":"2027-28"},{"$f":"dms_y6","v":"2028-29"},{"$f":"dms_y7","v":"2029-30"}]
[null,"OPEX"]
[null,"Recurrent expenditure",0,0,0,0,0,0,0]
[null,"Non-recurrent expenditure",0,0,0,0,0,0,0]
[null,"Total",{"$f":"SUM(C138:C139)","v":0},{"$f":"SUM(D138:D139)","v":0},0,0,0,0,0]
[null,"CAPEX"]
[null,"Recurrent expenditure",179918.98736839188,180877.7528788468,182118.64304399121,182991.22583890948,183812.92872270357,184781.98664676573,185835.6102312603]
[null,"Non-recurrent expenditure",0,0,0,0,0,0,0]
[null,"Total",{"$f":"SUM(C142:C143)","v":179918.98736839188},{"$f":"SUM(D142:D143)","v":180877.7528788468},{"$f":"SUM(E142:E143)","v":182118.64304399121},{"$f":"SUM(F142:F143)","v":182991.22583890948},{"$f":"SUM(G142:G143)","v":183812.92872270357},{"$f":"SUM(H142:H143)","v":184781.98664676573},{"$f":"SUM(I142:I143)","v":185835.6102312603}]

{"sheet":"E10. Overheads","index":9,"n_rows":33,"n_cols":9,"rows_kept":33,"cut":false,"hidden":false,"merged":[]}
[null,{"$f":"INDEX(dms_Worksheet_List,MATCH(dms_Model,dms_Model_List))","v":"REGULATORY REPORTING STATEMENT"}]
[null,{"$f":"dms_TradingNameFull","v":"Jemena Gas Networks (NSW) Ltd"}]
[null,{"$f":"dms_Header_Span","v":"2023-24 to 2029-30"}]
[null,"E10. OVERHEADS EXPENDITURE"]
[null,"FINAL RIN TEMPLATE - FEBRUARY 2024"]
[]
[null,"E10.1 - NETWORK"]
[null,null,"EXPENDITURE"]
[null,null,{"$f":"CONCATENATE(\"$, real \",dms_DollarReal)","v":"$, real June 2025"}]
[null,null,{"$f":"dms_y1","v":"2023-24"},{"$f":"dms_y2","v":"2024-25"},{"$f":"dms_y3","v":"2025-26"},{"$f":"dms_y4","v":"2026-27"},{"$f":"dms_y5","v":"2027-28"},{"$f":"dms_y6","v":"2028-29"},{"$f":"dms_y7","v":"2029-30"}]
[null,"E10.1.1 - OPEX"]
[null,"Reference services",42119828.752052225,43077205.067793444,43088830.014889725,42214145.314459756,42894125.428689323,43069174.855272792,44064062.481412761]
[null,"Non-reference services",0,0,0,0,0,0,0]
[null,"Total",{"$f":"SUM(C12:C13)","v":42119828.752052225},{"$f":"SUM(D12:D13)","v":43077205.067793444},43088830.014889725,42214145.314459756,42894125.428689323,43069174.855272792,44064062.481412761]
[null,"E10.1.2 - CAPEX"]
[null,"Reference services",4254116.505143079,5218123.1860515112,5446584.012768046,5990759.3480244288,5142075.4116338575,3882854.017952444,3265911.0580942701]
[null,"Non-reference services",0,0,0,0,0,0,0]
[null,"Total",{"$f":"SUM(C16:C17)","v":4254116.505143079},{"$f":"SUM(D16:D17)","v":5218123.1860515112},5446584.012768046,5990759.3480244288,5142075.4116338575,3882854.017952444,3265911.0580942701]
[]
[]
[]
[null,"E10.2 - CORPORATE"]
[null,null,"EXPENDITURE"]
[null,null,{"$f":"CONCATENATE(\"$, real \",dms_DollarReal)","v":"$, real June 2025"}]
[null,null,{"$f":"dms_y1","v":"2023-24"},{"$f":"dms_y2","v":"2024-25"},{"$f":"dms_y3","v":"2025-26"},{"$f":"dms_y4","v":"2026-27"},{"$f":"dms_y5","v":"2027-28"},{"$f":"dms_y6","v":"2028-29"},{"$f":"dms_y7","v":"2029-30"}]
[null,"E10.2.1 - OPEX"]
[null,"Reference services",66964021.029364988,68486101.475553587,68504583.345610619,67113969.793536246,68195033.131586969,68473334.678155884,70055052.313117683]
[null,"Non-reference services",0,0,0,0,0,0,0]
[null,"Total",{"$f":"SUM(C27:C28)","v":66964021.029364988},68486101.475553587,68504583.345610619,67113969.793536246,68195033.131586969,68473334.678155884,70055052.313117683]
[null,"E10.2.2 - CAPEX"]
[null,"Reference services",0,0,0,0,0,0,0]
[null,"Non-reference services",0,0,0,0,0,0,0]
[null,"Total",{"$f":"SUM(C31:C32)","v":0},0,0,0,0,0,0]

{"sheet":"E12. ICT","index":10,"n_rows":141,"n_cols":9,"rows_kept":141,"cut":false,"hidden":false,"merged":[]}
[null,{"$f":"INDEX(dms_Worksheet_List,MATCH(dms_Model,dms_Model_List))","v":"REGULATORY REPORTING STATEMENT"}]
[null,{"$f":"dms_TradingNameFull","v":"Jemena Gas Networks (NSW) Ltd"}]
[null,{"$f":"dms_Header_Span","v":"2023-24 to 2029-30"}]
[null,"E12. INFORMATION AND COMMUNICATION TECHNOLOGY"]
[null,"FINAL RIN TEMPLATE - FEBRUARY 2024"]
[]
[null,"Please list all projects or categories here:"]
[null,"Network Management Advanced Analytics"]
[null,"JGN Chronic no-access metering"]
[null,"Gas Retail Market Settlement - Major Application Lifecycle (CABS/ELMS)"]
[null,"JGN Enhancements to Geospatial Systems"]
[null,"SAP Migration (JGN portion)"]
[null,"Recurrent Capex (excluding telemetry)"]
[null,"Non-recurrent capex (t-2 and t-1 only)"]
[null,"SaaS implementation costs capitalised under the old IFRS treatment"]
[null,""]
[null,""]
[null,""]
[null,""]
[null,""]
[null,""]
[null,""]
[]
[null,"E12.1 - CAPEX - BY PROJECT"]
[null,"A. DIRECT INTERNAL LABOUR EXPENDITURE"]
[null,null,"EXPENDITURE"]
[null,null,{"$f":"CONCATENATE(\"$, real \",dms_DollarReal)","v":"$, real June 2025"}]
[null,null,{"$f":"dms_y1","v":"2023-24"},{"$f":"dms_y2","v":"2024-25"},{"$f":"dms_y3","v":"2025-26"},{"$f":"dms_y4","v":"2026-27"},{"$f":"dms_y5","v":"2027-28"},{"$f":"dms_y6","v":"2028-29"},{"$f":"dms_y7","v":"2029-30"}]
[null,{"$f":"IF(ISBLANK(dms_E12_Projects_01),\"\",dms_E12_Projects_01)","v":"Network Management Advanced Analytics"},0,0,446779.61742764816,776367.99127807131,676404.1445758068,226656.71103649994,0]
[null,{"$f":"IF(ISBLANK(dms_E12_Projects_02),\"\",dms_E12_Projects_02)","v":"JGN Chronic no-access metering"},0,0,537764.97245909041,1621024.6772991726,542767.90612981014,0,0]
[null,{"$f":"IF(ISBLANK(dms_E12_Projects_03),\"\",dms_E12_Projects_03)","v":"Gas Retail Market Settlement - Major Application Lifecycle (CABS/ELMS)"},0,0,1396759.2336178664,957562.77389554086,0,0,0]
[null,{"$f":"IF(ISBLANK(dms_E12_Projects_04),\"\",dms_E12_Projects_04)","v":"JGN Enhancements to Geospatial Systems"},0,0,298553.9090575343,151048.46633029138,151726.73360680841,152526.63377985641,153396.33791893587]
[null,{"$f":"IF(ISBLANK(dms_E12_Projects_05),\"\",dms_E12_Projects_05)","v":"SAP Migration (JGN portion)"},0,0,273823.34317521559,0,0,0,0]
[null,{"$f":"IF(ISBLANK(dms_E12_Projects_06),\"\",dms_E12_Projects_06)","v":"Recurrent Capex (excluding telemetry)"},3342459.5747345504,4995140.4280184573,2643436.5854234109,2657642.6367326556,2671124.8748646793,2686764.3991829003,2692699.7131216913]
[null,{"$f":"IF(ISBLANK(dms_E12_Projects_07),\"\",dms_E12_Projects_07)","v":"Non-recurrent capex (t-2 and t-1 only)"},3896083.7928921478,2883654.0925518381,0,0,0,0,0]
[null,{"$f":"IF(ISBLANK(dms_E12_Projects_08),\"\",dms_E12_Projects_08)","v":"SaaS implementation costs capitalised under the old IFRS treatment"},1196153.8280440941,1191246.3694246481,0,0,0,0,0]
[null,{"$f":"IF(ISBLANK(dms_E12_Projects_09),\"\",dms_E12_Projects_09)","v":""},"","","","","","",""]
[null,{"$f":"IF(ISBLANK(dms_E12_Projects_10),\"\",dms_E12_Projects_10)","v":""},"","","","","","",""]
[null,{"$f":"IF(ISBLANK(dms_E12_Projects_11),\"\",dms_E12_Projects_11)","v":""},"","","","","","",""]
[null,{"$f":"IF(ISBLANK(dms_E12_Projects_12),\"\",dms_E12_Projects_12)","v":""},"","","","","","",""]
[null,{"$f":"IF(ISBLANK(dms_E12_Projects_13),\"\",dms_E12_Projects_13)","v":""},"","","","","","",""]
[null,{"$f":"IF(ISBLANK(dms_E12_Projects_14),\"\",dms_E12_Projects_14)","v":""},"","","","","","",""]
[null,{"$f":"IF(ISBLANK(dms_E12_Projects_15),\"\",dms_E12_Projects_15)","v":""},"","","","","","",""]
[null,"Aggregate of other projects or categories with total expenditure of less than $500,000",0,0,0,0,0,0,0]
[null,"Total",{"$f":"SUM(C29:C44)","v":8434697.1956707928},{"$f":"SUM(D29:D44)","v":9070040.8899949435},5597117.6611607652,6163646.5455357321,4042023.6591771045,3065947.7439992568,2846096.0510406271]
[]
[null,"B. DIRECT CONTRACTOR EXPENDITURE"]
[null,{"$f":"IF(ISBLANK(dms_E12_Projects_01),\"\",dms_E12_Projects_01)","v":"Network Management Advanced Analytics"},0,0,479572.48173811601,833352.0818674214,726051.05877440399,243292.92826787473,0]
[null,{"$f":"IF(ISBLANK(dms_E12_Projects_02),\"\",dms_E12_Projects_02)","v":"JGN Chronic no-access metering"},0,0,577236.00713678414,1740005.1325684874,582606.14763301401,0,0]
[null,{"$f":"IF(ISBLANK(dms_E12_Projects_03),\"\",dms_E12_Projects_03)","v":"Gas Retail Market Settlement - Major Application Lifecycle (CABS/ELMS)"},0,0,1499278.9866140769,1027846.253464071,0,0,0]
[null,{"$f":"IF(ISBLANK(dms_E12_Projects_04),\"\",dms_E12_Projects_04)","v":"JGN Enhancements to Geospatial Systems"},0,0,320467.25838499999,162135.16694835544,162863.21788978789,163721.82937555807,164655.36831978662]
[null,{"$f":"IF(ISBLANK(dms_E12_Projects_05),\"\",dms_E12_Projects_05)","v":"SAP Migration (JGN portion)"},0,0,293921.51101349597,0,0,0,0]
[null,{"$f":"IF(ISBLANK(dms_E12_Projects_06),\"\",dms_E12_Projects_06)","v":"Recurrent Capex (excluding telemetry)"},3587790.4247150659,5361775.24276416,2837460.3364580125,2852709.0877804174,2867180.8992690113,2883968.3380820802,2890339.2939728363]
[null,{"$f":"IF(ISBLANK(dms_E12_Projects_07),\"\",dms_E12_Projects_07)","v":"Non-recurrent capex (t-2 and t-1 only)"},4182049.7192209512,3095309.4001950785,0,0,0,0,0]
[null,{"$f":"IF(ISBLANK(dms_E12_Projects_08),\"\",dms_E12_Projects_08)","v":"SaaS implementation costs capitalised under the old IFRS treatment"},1283949.4853378134,1278681.8275992954,0,0,0,0,0]
[null,{"$f":"IF(ISBLANK(dms_E12_Projects_09),\"\",dms_E12_Projects_09)","v":""},"","","","","","",""]
[null,{"$f":"IF(ISBLANK(dms_E12_Projects_10),\"\",dms_E12_Projects_10)","v":""},"","","","","","",""]
[null,{"$f":"IF(ISBLANK(dms_E12_Projects_11),\"\",dms_E12_Projects_11)","v":""},"","","","","","",""]
[null,{"$f":"IF(ISBLANK(dms_E12_Projects_12),\"\",dms_E12_Projects_12)","v":""},"","","","","","",""]
[null,{"$f":"IF(ISBLANK(dms_E12_Projects_13),\"\",dms_E12_Projects_13)","v":""},"","","","","","",""]
[null,{"$f":"IF(ISBLANK(dms_E12_Projects_14),\"\",dms_E12_Projects_14)","v":""},"","","","","","",""]
[null,{"$f":"IF(ISBLANK(dms_E12_Projects_15),\"\",dms_E12_Projects_15)","v":""},"","","","","","",""]
[null,"Aggregate of other projects or categories with total expenditure of less than $500,000",0,0,0,0,0,0,0]
[null,"Total",{"$f":"SUM(C48:C63)","v":9053789.6292738318},{"$f":"SUM(D48:D63)","v":9735766.4705585353},{"$f":"SUM(E48:E63)","v":6007936.5813454855},{"$f":"SUM(F48:F63)","v":6616047.7226287527},{"$f":"SUM(G48:G63)","v":4338701.323566217},{"$f":"SUM(H48:H63)","v":3290983.0957255131},{"$f":"SUM(I48:I63)","v":3054994.662292623}]
[]
[null,"C. DIRECT MATERIAL EXPENDITURE"]
[null,{"$f":"IF(ISBLANK(dms_E12_Projects_01),\"\",dms_E12_Projects_01)","v":"Network Management Advanced Analytics"},0,0,0,0,0,0,0]
[null,{"$f":"IF(ISBLANK(dms_E12_Projects_02),\"\",dms_E12_Projects_02)","v":"JGN Chronic no-access metering"},0,0,0,0,0,0,0]
[null,{"$f":"IF(ISBLANK(dms_E12_Projects_03),\"\",dms_E12_Projects_03)","v":"Gas Retail Market Settlement - Major Application Lifecycle (CABS/ELMS)"},0,0,0,0,0,0,0]
[null,{"$f":"IF(ISBLANK(dms_E12_Projects_04),\"\",dms_E12_Projects_04)","v":"JGN Enhancements to Geospatial Systems"},0,0,0,0,0,0,0]
[null,{"$f":"IF(ISBLANK(dms_E12_Projects_05),\"\",dms_E12_Projects_05)","v":"SAP Migration (JGN portion)"},0,0,0,0,0,0,0]
[null,{"$f":"IF(ISBLANK(dms_E12_Projects_06),\"\",dms_E12_Projects_06)","v":"Recurrent Capex (excluding telemetry)"},0,0,0,0,0,0,0]
[null,{"$f":"IF(ISBLANK(dms_E12_Projects_07),\"\",dms_E12_Projects_07)","v":"Non-recurrent capex (t-2 and t-1 only)"},0,0,0,0,0,0,0]
[null,{"$f":"IF(ISBLANK(dms_E12_Projects_08),\"\",dms_E12_Projects_08)","v":"SaaS implementation costs capitalised under the old IFRS treatment"},0,0,0,0,0,0,0]
[null,{"$f":"IF(ISBLANK(dms_E12_Projects_09),\"\",dms_E12_Projects_09)","v":""},"","","","","","",""]
[null,{"$f":"IF(ISBLANK(dms_E12_Projects_10),\"\",dms_E12_Projects_10)","v":""},"","","","","","",""]
[null,{"$f":"IF(ISBLANK(dms_E12_Projects_11),\"\",dms_E12_Projects_11)","v":""},"","","","","","",""]
[null,{"$f":"IF(ISBLANK(dms_E12_Projects_12),\"\",dms_E12_Projects_12)","v":""},"","","","","","",""]
[null,{"$f":"IF(ISBLANK(dms_E12_Projects_13),\"\",dms_E12_Projects_13)","v":""},"","","","","","",""]
[null,{"$f":"IF(ISBLANK(dms_E12_Projects_14),\"\",dms_E12_Projects_14)","v":""},"","","","","","",""]
[null,{"$f":"IF(ISBLANK(dms_E12_Projects_15),\"\",dms_E12_Projects_15)","v":""},"","","","","","",""]
[null,"Aggregate of other projects or categories with total expenditure of less than $500,000",0,0,0,0,0,0,0]
[null,"Total",{"$f":"SUM(C67:C82)","v":0},{"$f":"SUM(D67:D82)","v":0},{"$f":"SUM(E67:E82)","v":0},{"$f":"SUM(F67:F82)","v":0},{"$f":"SUM(G67:G82)","v":0},{"$f":"SUM(H67:H82)","v":0},{"$f":"SUM(I67:I82)","v":0}]
[]
[null,"D. OTHER DIRECT EXPENDITURE"]
[null,{"$f":"IF(ISBLANK(dms_E12_Projects_01),\"\",dms_E12_Projects_01)","v":"Network Management Advanced Analytics"},0,0,0,0,0,0,0]
[null,{"$f":"IF(ISBLANK(dms_E12_Projects_02),\"\",dms_E12_Projects_02)","v":"JGN Chronic no-access metering"},0,0,0,0,0,0,0]
[null,{"$f":"IF(ISBLANK(dms_E12_Projects_03),\"\",dms_E12_Projects_03)","v":"Gas Retail Market Settlement - Major Application Lifecycle (CABS/ELMS)"},0,0,0,0,0,0,0]
[null,{"$f":"IF(ISBLANK(dms_E12_Projects_04),\"\",dms_E12_Projects_04)","v":"JGN Enhancements to Geospatial Systems"},0,0,0,0,0,0,0]
[null,{"$f":"IF(ISBLANK(dms_E12_Projects_05),\"\",dms_E12_Projects_05)","v":"SAP Migration (JGN portion)"},0,0,0,0,0,0,0]
[null,{"$f":"IF(ISBLANK(dms_E12_Projects_06),\"\",dms_E12_Projects_06)","v":"Recurrent Capex (excluding telemetry)"},0,0,0,0,0,0,0]
[null,{"$f":"IF(ISBLANK(dms_E12_Projects_07),\"\",dms_E12_Projects_07)","v":"Non-recurrent capex (t-2 and t-1 only)"},0,0,0,0,0,0,0]
[null,{"$f":"IF(ISBLANK(dms_E12_Projects_08),\"\",dms_E12_Projects_08)","v":"SaaS implementation costs capitalised under the old IFRS treatment"},0,0,0,0,0,0,0]
[null,{"$f":"IF(ISBLANK(dms_E12_Projects_09),\"\",dms_E12_Projects_09)","v":""},"","","","","","",""]
[null,{"$f":"IF(ISBLANK(dms_E12_Projects_10),\"\",dms_E12_Projects_10)","v":""},"","","","","","",""]
[null,{"$f":"IF(ISBLANK(dms_E12_Projects_11),\"\",dms_E12_Projects_11)","v":""},"","","","","","",""]
[null,{"$f":"IF(ISBLANK(dms_E12_Projects_12),\"\",dms_E12_Projects_12)","v":""},"","","","","","",""]
[null,{"$f":"IF(ISBLANK(dms_E12_Projects_13),\"\",dms_E12_Projects_13)","v":""},"","","","","","",""]
[null,{"$f":"IF(ISBLANK(dms_E12_Projects_14),\"\",dms_E12_Projects_14)","v":""},"","","","","","",""]
[null,{"$f":"IF(ISBLANK(dms_E12_Projects_15),\"\",dms_E12_Projects_15)","v":""},"","","","","","",""]
[null,"Aggregate of other projects or categories with total expenditure of less than $500,000",0,0,0,0,0,0,0]
[null,"Total",{"$f":"SUM(C86:C101)","v":0},{"$f":"SUM(D86:D101)","v":0},{"$f":"SUM(E86:E101)","v":0},{"$f":"SUM(F86:F101)","v":0},{"$f":"SUM(G86:G101)","v":0},{"$f":"SUM(H86:H101)","v":0},{"$f":"SUM(I86:I101)","v":0}]
[]
[null,"E. RELATED PARTY MARGIN EXPENDITURE"]
[null,"Total",0,0,0,0,0,0,0]
[null,"Total",{"$f":"SUM(C105:C105)","v":0},0,0,0,0,0,0]
[]
[null,"F. CAPITAL CONTRIBUTIONS included in the above"]
[null,{"$f":"IF(ISBLANK(dms_E12_Projects_01),\"\",dms_E12_Projects_01)","v":"Network Management Advanced Analytics"},0,0,0,0,0,0,0]
[null,{"$f":"IF(ISBLANK(dms_E12_Projects_02),\"\",dms_E12_Projects_02)","v":"JGN Chronic no-access metering"},0,0,0,0,0,0,0]
[null,{"$f":"IF(ISBLANK(dms_E12_Projects_03),\"\",dms_E12_Projects_03)","v":"Gas Retail Market Settlement - Major Application Lifecycle (CABS/ELMS)"},0,0,0,0,0,0,0]
[null,{"$f":"IF(ISBLANK(dms_E12_Projects_04),\"\",dms_E12_Projects_04)","v":"JGN Enhancements to Geospatial Systems"},0,0,0,0,0,0,0]
[null,{"$f":"IF(ISBLANK(dms_E12_Projects_05),\"\",dms_E12_Projects_05)","v":"SAP Migration (JGN portion)"},0,0,0,0,0,0,0]
[null,{"$f":"IF(ISBLANK(dms_E12_Projects_06),\"\",dms_E12_Projects_06)","v":"Recurrent Capex (excluding telemetry)"},0,0,0,0,0,0,0]
[null,{"$f":"IF(ISBLANK(dms_E12_Projects_07),\"\",dms_E12_Projects_07)","v":"Non-recurrent capex (t-2 and t-1 only)"},0,0,0,0,0,0,0]
[null,{"$f":"IF(ISBLANK(dms_E12_Projects_08),\"\",dms_E12_Projects_08)","v":"SaaS implementation costs capitalised under the old IFRS treatment"},0,0,0,0,0,0,0]
[null,{"$f":"IF(ISBLANK(dms_E12_Projects_09),\"\",dms_E12_Projects_09)","v":""},"","","","","","",""]
[null,{"$f":"IF(ISBLANK(dms_E12_Projects_10),\"\",dms_E12_Projects_10)","v":""},"","","","","","",""]
[null,{"$f":"IF(ISBLANK(dms_E12_Projects_11),\"\",dms_E12_Projects_11)","v":""},"","","","","","",""]
[null,{"$f":"IF(ISBLANK(dms_E12_Projects_12),\"\",dms_E12_Projects_12)","v":""},"","","","","","",""]
[null,{"$f":"IF(ISBLANK(dms_E12_Projects_13),\"\",dms_E12_Projects_13)","v":""},"","","","","","",""]
[null,{"$f":"IF(ISBLANK(dms_E12_Projects_14),\"\",dms_E12_Projects_14)","v":""},"","","","","","",""]
[null,{"$f":"IF(ISBLANK(dms_E12_Projects_15),\"\",dms_E12_Projects_15)","v":""},"","","","","","",""]
[null,"Aggregate of other projects or categories with total expenditure of less than $500,000",0,0,0,0,0,0,0]
[null,"Total",{"$f":"SUM(C109:C124)","v":0},{"$f":"SUM(D109:D124)","v":0},{"$f":"SUM(E109:E124)","v":0},{"$f":"SUM(F109:F124)","v":0},{"$f":"SUM(G109:G124)","v":0},{"$f":"SUM(H109:H124)","v":0},{"$f":"SUM(I109:I124)","v":0}]
[]
[]
[]
[]
[null,"E12.2 - EXPENDITURE BY PURPOSE"]
[null,null,"EXPENDITURE"]
[null,null,{"$f":"CONCATENATE(\"$, real \",dms_DollarReal)","v":"$, real June 2025"}]
[null,null,{"$f":"dms_y1","v":"2023-24"},{"$f":"dms_y2","v":"2024-25"},{"$f":"dms_y3","v":"2025-26"},{"$f":"dms_y4","v":"2026-27"},{"$f":"dms_y5","v":"2027-28"},{"$f":"dms_y6","v":"2028-29"},{"$f":"dms_y7","v":"2029-30"}]
[null,"OPEX"]
[null,"Recurrent expenditure",36908757.975276716,36908757.975276716,37977062.81657251,39651136.855373107,41276524.455657281,41587347.157825708,42110135.12729685]
[null,"Non-recurrent expenditure",4065110.7892308761,4065110.7892308761,6523618.0776425377,6553972.5216671089,6576196.7504541706,6600179.5174643351,6619021.3576555811]
[null,"Total",{"$f":"SUM(C135:C136)","v":40973868.764507592},{"$f":"SUM(D135:D136)","v":40973868.764507592},44500680.894215047,46205109.377040215,47852721.206111453,48187526.675290041,48729156.484952435]
[null,"CAPEX"]
[null,"Recurrent expenditure",9410353.3128315248,12826843.867806559,5480896.9218814233,5510351.7245130735,5538305.7741336906,5570732.7372649806,5583039.0070945276]
[null,"Non-recurrent expenditure",8078133.512113099,5978963.4927469157,6124157.3206248274,7269342.5436514113,2842419.2086096313,786198.10245978914,318051.70623872249]
[null,"Total",{"$f":"SUM(C139:C140)","v":17488486.824944623},{"$f":"SUM(D139:D140)","v":18805807.360553473},11605054.242506251,12779694.268164486,8380724.9827433219,6356930.8397247698,5901090.71333325]

{"sheet":"E13. Other capex","index":11,"n_rows":125,"n_cols":9,"rows_kept":125,"cut":false,"hidden":false,"merged":[]}
[null,{"$f":"INDEX(dms_Worksheet_List,MATCH(dms_Model,dms_Model_List))","v":"REGULATORY REPORTING STATEMENT"}]
[null,{"$f":"dms_TradingNameFull","v":"Jemena Gas Networks (NSW) Ltd"}]
[null,{"$f":"dms_Header_Span","v":"2023-24 to 2029-30"}]
[null,"E13. OTHER CAPITAL EXPENDITURE"]
[null,"FINAL RIN TEMPLATE - FEBRUARY 2024"]
[]
[null,"Please list all projects or categories here:"]
[null,"ALBV replacement projects"]
[null,"Allocations - Facilities projects"]
[null,"Allocations - Networks projects"]
[null,"Facility upgrade projects"]
[null,"Mains relocation projects"]
[null,"Networks upgrade projects"]
[null,"Non Network"]
[null,"Pigging facilities projects"]
[null,"Pipes upgrade projects"]
[null,"Pipes washaway projects"]
[null,"Primary mains integrity projects - SPM"]
[null,""]
[null,""]
[null,""]
[null,""]
[]
[null,"E13.1 - CAPEX - BY PROJECT"]
[null,null,"EXPENDITURE"]
[null,null,{"$f":"CONCATENATE(\"$, real \",dms_DollarReal)","v":"$, real June 2025"}]
[null,null,{"$f":"dms_y1","v":"2023-24"},{"$f":"dms_y2","v":"2024-25"},{"$f":"dms_y3","v":"2025-26"},{"$f":"dms_y4","v":"2026-27"},{"$f":"dms_y5","v":"2027-28"},{"$f":"dms_y6","v":"2028-29"},{"$f":"dms_y7","v":"2029-30"}]
[null,"A. DIRECT INTERNAL LABOUR EXPENDITURE"]
[null,{"$f":"IF(ISBLANK(dms_E13_Projects_01),\"\",dms_E13_Projects_01)","v":"ALBV replacement projects"},102562.46406683314,83025.189698069487,64082.427743381515,156704.27381193786,197580.89413646891,60132.651009422269,0]
[null,{"$f":"IF(ISBLANK(dms_E13_Projects_02),\"\",dms_E13_Projects_02)","v":"Allocations - Facilities projects"},55853.658994379868,59839.040085587279,16785.277989544316,16819.372635039043,16851.479237057909,16889.343479370695,16930.511976855898]
[null,{"$f":"IF(ISBLANK(dms_E13_Projects_03),\"\",dms_E13_Projects_03)","v":"Allocations - Networks projects"},1517.8713689336346,1521.5592135047889,1526.3322367404257,1529.6885837179018,1532.8492236095735,1536.576657445499,1540.6293689518568]
[null,{"$f":"IF(ISBLANK(dms_E13_Projects_04),\"\",dms_E13_Projects_04)","v":"Facility upgrade projects"},318909.06868037803,917465.7782332697,872736.6675092479,647475.13091322675,450506.5774086726,347176.11764831143,386915.22382200515]
[null,{"$f":"IF(ISBLANK(dms_E13_Projects_05),\"\",dms_E13_Projects_05)","v":"Mains relocation projects"},5505.5289553102039,25001.335380391138,4175.4908403017025,4181.1223308133785,4186.4254516409401,4192.6795750735855,4199.4794698841579]
[null,{"$f":"IF(ISBLANK(dms_E13_Projects_06),\"\",dms_E13_Projects_06)","v":"Networks upgrade projects"},182439.78604376176,385979.22283495497,160434.82799787281,160722.44722980473,160993.29551341687,161312.71471058589,161660.00829450996]
[null,{"$f":"IF(ISBLANK(dms_E13_Projects_07),\"\",dms_E13_Projects_07)","v":"Non Network"},514912.91326652869,571329.12719439424,152701.66000193005,203239.1704841732,203431.34729364404,97072.52080126392,97189.974449806628]
[null,{"$f":"IF(ISBLANK(dms_E13_Projects_08),\"\",dms_E13_Projects_08)","v":"Pigging facilities projects"},14566.957550422301,69471.590060361254,339509.6328712845,278547.60600618878,157530.58038547376,19669.616596355172,0]
[null,{"$f":"IF(ISBLANK(dms_E13_Projects_09),\"\",dms_E13_Projects_09)","v":"Pipes upgrade projects"},13525.802393857643,49979.736253051997,142650.28030634043,64808.854347239307,26126.360491038497,0,0]
[null,{"$f":"IF(ISBLANK(dms_E13_Projects_10),\"\",dms_E13_Projects_10)","v":"Pipes washaway projects"},23575.302141370914,54429.714778792972,0,0,0,0,0]
[null,{"$f":"IF(ISBLANK(dms_E13_Projects_11),\"\",dms_E13_Projects_11)","v":"Primary mains integrity projects - SPM"},111740.2124500988,146520.24883974029,177609.93820625611,85192.284465781719,43482.034514613893,91315.664613734305,6212.1193851704429]
[null,{"$f":"IF(ISBLANK(dms_E13_Projects_12),\"\",dms_E13_Projects_12)","v":""},"","","","","","",""]
[null,{"$f":"IF(ISBLANK(dms_E13_Projects_13),\"\",dms_E13_Projects_13)","v":""},"","","","","","",""]
[null,{"$f":"IF(ISBLANK(dms_E13_Projects_14),\"\",dms_E13_Projects_14)","v":""},"","","","","","",""]
[null,{"$f":"IF(ISBLANK(dms_E13_Projects_15),\"\",dms_E13_Projects_15)","v":""},"","","","","","",""]
[null,"Aggregate of other projects or categories with total expenditure of less than $500,000","","","","","","",""]
[null,"Total",{"$f":"SUM(C29:C44)","v":1345109.5659118749},{"$f":"SUM(D29:D44)","v":2364562.5425721183},1932212.5357029,1619219.9508079225,1262221.843655637,799297.88509156276,674647.94676718407]
[]
[null,"B. DIRECT CONTRACTOR EXPENDITURE"]
[null,{"$f":"IF(ISBLANK(dms_E13_Projects_01),\"\",dms_E13_Projects_01)","v":"ALBV replacement projects"}]
[null,{"$f":"IF(ISBLANK(dms_E13_Projects_02),\"\",dms_E13_Projects_02)","v":"Allocations - Facilities projects"}]
[null,{"$f":"IF(ISBLANK(dms_E13_Projects_03),\"\",dms_E13_Projects_03)","v":"Allocations - Networks projects"}]
[null,{"$f":"IF(ISBLANK(dms_E13_Projects_04),\"\",dms_E13_Projects_04)","v":"Facility upgrade projects"}]
[null,{"$f":"IF(ISBLANK(dms_E13_Projects_05),\"\",dms_E13_Projects_05)","v":"Mains relocation projects"}]
[null,{"$f":"IF(ISBLANK(dms_E13_Projects_06),\"\",dms_E13_Projects_06)","v":"Networks upgrade projects"}]
[null,{"$f":"IF(ISBLANK(dms_E13_Projects_07),\"\",dms_E13_Projects_07)","v":"Non Network"}]
[null,{"$f":"IF(ISBLANK(dms_E13_Projects_08),\"\",dms_E13_Projects_08)","v":"Pigging facilities projects"}]
[null,{"$f":"IF(ISBLANK(dms_E13_Projects_09),\"\",dms_E13_Projects_09)","v":"Pipes upgrade projects"}]
[null,{"$f":"IF(ISBLANK(dms_E13_Projects_10),\"\",dms_E13_Projects_10)","v":"Pipes washaway projects"}]
[null,{"$f":"IF(ISBLANK(dms_E13_Projects_11),\"\",dms_E13_Projects_11)","v":"Primary mains integrity projects - SPM"}]
[null,{"$f":"IF(ISBLANK(dms_E13_Projects_12),\"\",dms_E13_Projects_12)","v":""},"","","","","","",""]
[null,{"$f":"IF(ISBLANK(dms_E13_Projects_13),\"\",dms_E13_Projects_13)","v":""},"","","","","","",""]
[null,{"$f":"IF(ISBLANK(dms_E13_Projects_14),\"\",dms_E13_Projects_14)","v":""},"","","","","","",""]
[null,{"$f":"IF(ISBLANK(dms_E13_Projects_15),\"\",dms_E13_Projects_15)","v":""},"","","","","","",""]
[null,"Aggregate of other projects or categories with total expenditure of less than $500,000","","","","","","",""]
[null,"Total"]
[]
[null,"C. DIRECT MATERIAL EXPENDITURE"]
[null,{"$f":"IF(ISBLANK(dms_E13_Projects_01),\"\",dms_E13_Projects_01)","v":"ALBV replacement projects"},2236.5858932610722,35360.816859011298,0,0,0,0,0]
[null,{"$f":"IF(ISBLANK(dms_E13_Projects_02),\"\",dms_E13_Projects_02)","v":"Allocations - Facilities projects"},22469.347897987936,34646.634048910775,22584.992575957738,22630.867736074713,22674.067936195737,22725.015178896228,22780.408375877883]
[null,{"$f":"IF(ISBLANK(dms_E13_Projects_03),\"\",dms_E13_Projects_03)","v":"Allocations - Networks projects"},0,0,0,0,0,0,0]
[null,{"$f":"IF(ISBLANK(dms_E13_Projects_04),\"\",dms_E13_Projects_04)","v":"Facility upgrade projects"},4228.9283287516801,88980.809548633697,0,0,0,0,0]
[null,{"$f":"IF(ISBLANK(dms_E13_Projects_05),\"\",dms_E13_Projects_05)","v":"Mains relocation projects"},0,0,0,0,0,0,0]
[null,{"$f":"IF(ISBLANK(dms_E13_Projects_06),\"\",dms_E13_Projects_06)","v":"Networks upgrade projects"},0,0,0,0,0,0,0]
[null,{"$f":"IF(ISBLANK(dms_E13_Projects_07),\"\",dms_E13_Projects_07)","v":"Non Network"},7447506.6470740791,8326418.4781405143,4112184.9379989291,5551632.4786364585,9955672.8076296709,8195032.9774611127,7721068.6886867192]
[null,{"$f":"IF(ISBLANK(dms_E13_Projects_08),\"\",dms_E13_Projects_08)","v":"Pigging facilities projects"},0,0,46232.388637400167,65492.369165573138,666131.48889407632,0,0]
[null,{"$f":"IF(ISBLANK(dms_E13_Projects_09),\"\",dms_E13_Projects_09)","v":"Pipes upgrade projects"},0,0,0,0,0,0,0]
[null,{"$f":"IF(ISBLANK(dms_E13_Projects_10),\"\",dms_E13_Projects_10)","v":"Pipes washaway projects"},0,0,0,0,0,0,0]
[null,{"$f":"IF(ISBLANK(dms_E13_Projects_11),\"\",dms_E13_Projects_11)","v":"Primary mains integrity projects - SPM"},0,0,0,0,0,0,0]
[null,{"$f":"IF(ISBLANK(dms_E13_Projects_12),\"\",dms_E13_Projects_12)","v":""},"","","","","","",""]
[null,{"$f":"IF(ISBLANK(dms_E13_Projects_13),\"\",dms_E13_Projects_13)","v":""},"","","","","","",""]
[null,{"$f":"IF(ISBLANK(dms_E13_Projects_14),\"\",dms_E13_Projects_14)","v":""},"","","","","","",""]
[null,{"$f":"IF(ISBLANK(dms_E13_Projects_15),\"\",dms_E13_Projects_15)","v":""},"","","","","","",""]
[null,"Aggregate of other projects or categories with total expenditure of less than $500,000","","","","","","",""]
[null,"Total",{"$f":"SUM(C67:C82)","v":7476441.5091940798},{"$f":"SUM(D67:D82)","v":8485406.7385970708},4181002.3192122872,5639755.7155381069,10644478.364459943,8217757.9926400091,7743849.0970625971]
[]
[null,"D. OTHER DIRECT EXPENDITURE"]
[null,{"$f":"IF(ISBLANK(dms_E13_Projects_01),\"\",dms_E13_Projects_01)","v":"ALBV replacement projects"},0,0,0,0,0,15104.296818132634,0]
[null,{"$f":"IF(ISBLANK(dms_E13_Projects_02),\"\",dms_E13_Projects_02)","v":"Allocations - Facilities projects"},0,0,0,0,0,0,0]
[null,{"$f":"IF(ISBLANK(dms_E13_Projects_03),\"\",dms_E13_Projects_03)","v":"Allocations - Networks projects"},0,0,0,0,0,0,0]
[null,{"$f":"IF(ISBLANK(dms_E13_Projects_04),\"\",dms_E13_Projects_04)","v":"Facility upgrade projects"},1514.9709007055114,12112.452802240714,0,0,0,0,0]
[null,{"$f":"IF(ISBLANK(dms_E13_Projects_05),\"\",dms_E13_Projects_05)","v":"Mains relocation projects"},0,0,0,0,0,0,0]
[null,{"$f":"IF(ISBLANK(dms_E13_Projects_06),\"\",dms_E13_Projects_06)","v":"Networks upgrade projects"},27294.51845694075,108017.67137021488,16093.653587055329,16122.505453831714,16149.674981206157,16181.716788913654,16216.554752106756]
[null,{"$f":"IF(ISBLANK(dms_E13_Projects_07),\"\",dms_E13_Projects_07)","v":"Non Network"},0,0,0,0,0,0,0]
[null,{"$f":"IF(ISBLANK(dms_E13_Projects_08),\"\",dms_E13_Projects_08)","v":"Pigging facilities projects"},54.444676405028559,0,0,0,0,0,0]
[null,{"$f":"IF(ISBLANK(dms_E13_Projects_09),\"\",dms_E13_Projects_09)","v":"Pipes upgrade projects"},1356.8099952498767,154.58023650233787,0,0,0,0,0]
[null,{"$f":"IF(ISBLANK(dms_E13_Projects_10),\"\",dms_E13_Projects_10)","v":"Pipes washaway projects"},2364.9026249987169,5459.99260524488,0,0,0,0,0]
[null,{"$f":"IF(ISBLANK(dms_E13_Projects_11),\"\",dms_E13_Projects_11)","v":"Primary mains integrity projects - SPM"},245303.08956272982,442352.90840277629,1751662.8655333999,567372.9466279042,0,0,0]
[null,{"$f":"IF(ISBLANK(dms_E13_Projects_12),\"\",dms_E13_Projects_12)","v":""},"","","","","","",""]
[null,{"$f":"IF(ISBLANK(dms_E13_Projects_13),\"\",dms_E13_Projects_13)","v":""},"","","","","","",""]
[null,{"$f":"IF(ISBLANK(dms_E13_Projects_14),\"\",dms_E13_Projects_14)","v":""},"","","","","","",""]
[null,{"$f":"IF(ISBLANK(dms_E13_Projects_15),\"\",dms_E13_Projects_15)","v":""},"","","","","","",""]
[null,"Aggregate of other projects or categories with total expenditure of less than $500,000","","","","","","",""]
[null,"Total",{"$f":"SUM(C86:C101)","v":277888.73621702968},{"$f":"SUM(D86:D101)","v":568097.60541697918},1767756.5191204553,583495.45208173594,16149.674981206157,31286.01360704629,16216.554752106756]
[]
[null,"E. RELATED PARTY MARGIN EXPENDITURE"]
[null,"Total"]
[null,"Total",{"$f":"SUM(C105)","v":0},{"$f":"SUM(D105)","v":0},0,0,0,0,0]
[]
[null,"F. CAPITAL CONTRIBUTIONS included in the above"]
[null,{"$f":"IF(ISBLANK(dms_E13_Projects_01),\"\",dms_E13_Projects_01)","v":"ALBV replacement projects"},0,0,0,0,0,0,0]
[null,{"$f":"IF(ISBLANK(dms_E13_Projects_02),\"\",dms_E13_Projects_02)","v":"Allocations - Facilities projects"},0,0,0,0,0,0,0]
[null,{"$f":"IF(ISBLANK(dms_E13_Projects_03),\"\",dms_E13_Projects_03)","v":"Allocations - Networks projects"},0,0,0,0,0,0,0]
[null,{"$f":"IF(ISBLANK(dms_E13_Projects_04),\"\",dms_E13_Projects_04)","v":"Facility upgrade projects"},0,0,0,0,0,0,0]
[null,{"$f":"IF(ISBLANK(dms_E13_Projects_05),\"\",dms_E13_Projects_05)","v":"Mains relocation projects"},0,0,0,0,0,0,0]
[null,{"$f":"IF(ISBLANK(dms_E13_Projects_06),\"\",dms_E13_Projects_06)","v":"Networks upgrade projects"},0,0,0,0,0,0,0]
[null,{"$f":"IF(ISBLANK(dms_E13_Projects_07),\"\",dms_E13_Projects_07)","v":"Non Network"},0,0,0,0,0,0,0]
[null,{"$f":"IF(ISBLANK(dms_E13_Projects_08),\"\",dms_E13_Projects_08)","v":"Pigging facilities projects"},0,0,0,0,0,0,0]
[null,{"$f":"IF(ISBLANK(dms_E13_Projects_09),\"\",dms_E13_Projects_09)","v":"Pipes upgrade projects"},0,0,0,0,0,0,0]
[null,{"$f":"IF(ISBLANK(dms_E13_Projects_10),\"\",dms_E13_Projects_10)","v":"Pipes washaway projects"},0,0,0,0,0,0,0]
[null,{"$f":"IF(ISBLANK(dms_E13_Projects_11),\"\",dms_E13_Projects_11)","v":"Primary mains integrity projects - SPM"},0,0,0,0,0,0,0]
[null,{"$f":"IF(ISBLANK(dms_E13_Projects_12),\"\",dms_E13_Projects_12)","v":""},"","","","","","",""]
[null,{"$f":"IF(ISBLANK(dms_E13_Projects_13),\"\",dms_E13_Projects_13)","v":""},"","","","","","",""]
[null,{"$f":"IF(ISBLANK(dms_E13_Projects_14),\"\",dms_E13_Projects_14)","v":""},"","","","","","",""]
[null,{"$f":"IF(ISBLANK(dms_E13_Projects_15),\"\",dms_E13_Projects_15)","v":""},"","","","","","",""]
[null,"Aggregate of other projects or categories with total expenditure of less than $500,000","","","","","","",""]
[null,"Total",{"$f":"SUM(C109:C124)","v":0},{"$f":"SUM(D109:D124)","v":0},0,0,0,0,0]

{"sheet":"E17. Step changes","index":12,"n_rows":71,"n_cols":10,"rows_kept":71,"cut":false,"hidden":false,"merged":[[70,1,70,2],[37,1,37,2],[21,1,21,2]]}
[null,{"$f":"INDEX(dms_Worksheet_List,MATCH(dms_Model,dms_Model_List))","v":"REGULATORY REPORTING STATEMENT"}]
[null,{"$f":"dms_TradingNameFull","v":"Jemena Gas Networks (NSW) Ltd"}]
[null,{"$f":"dms_Header_Span","v":"2023-24 to 2029-30"}]
[null,"E17. STEP CHANGES"]
[null,"FINAL RIN TEMPLATE - FEBRUARY 2024"]
[]
[null,"E17.1 - STEP CHANGES FOR REFERENCE SERVICES"]
[null,"E17.1.1 - FORECAST OPEX"]
[null,null,null,"EXPENDITURE"]
[null,null,null,{"$f":"CONCATENATE(\"$, real \",dms_DollarReal)","v":"$, real June 2025"}]
[null,"Step change","Description",{"$f":"dms_y1","v":"2023-24"},{"$f":"dms_y2","v":"2024-25"},{"$f":"dms_y3","v":"2025-26"},{"$f":"dms_y4","v":"2026-27"},{"$f":"dms_y5","v":"2027-28"},{"$f":"dms_y6","v":"2028-29"},{"$f":"dms_y7","v":"2029-30"}]
[null,"Support for customers experiencing vulnerability","Refer to attachment 6.2",0,0,532511.49999999988,532511.49999999988,532511.49999999988,532511.49999999988,532511.49999999988]
[null,"ICT services for new recurrent projects","Refer to attachment 6.2",0,0,755072.80076902476,2255952.6398217771,3754534.8366970634,3928518.3947618557,4343799.9499808354]
[null,"Emissions reduction – Climate change reporting","Refer to attachment 6.2",0,0,780498.04122972453,707146.90154055553,707146.90154055553,707146.90154055553,707146.90154055553]
[null,"Emissions measurement – Picarro leak detection services","Refer to attachment 6.2",0,0,4171421.9385175044,4142605.4193539023,4163043.9274568642,4163043.9274568642,4163043.9274568642]
[null,"Pipeline Integrity Management Program","Refer to attachment 6.2",0,0,9304362.8062510472,3144759.4010837101,4075518.5204739054,4033489.3338255123,7575952.2043658877]
[null,"","","","","","","","",""]
[null,"","","","","","","","",""]
[null,"","","","","","","","",""]
[null,"","","","","","","","",""]
[null,"","","","","","","","",""]
[null,"Total",null,{"$f":"SUM(D12:D21)","v":0},0,15543867.086767301,10782975.861799944,13232755.686168388,13364710.057584787,17322454.483344141]
[]
[null,"E17.1.2 - FORECAST CAPEX"]
[null,null,null,"EXPENDITURE"]
[null,null,null,{"$f":"CONCATENATE(\"$, real \", dms_DollarReal)","v":"$, real June 2025"}]
[null,"Step change","Description",{"$f":"dms_y1","v":"2023-24"},{"$f":"dms_y2","v":"2024-25"},{"$f":"dms_y3","v":"2025-26"},{"$f":"dms_y4","v":"2026-27"},{"$f":"dms_y5","v":"2027-28"},{"$f":"dms_y6","v":"2028-29"},{"$f":"dms_y7","v":"2029-30"}]
[null,"None","","","","","","","",""]
[null,"","","","","","","","",""]
[null,"","","","","","","","",""]
[null,"","","","","","","","",""]
[null,"","","","","","","","",""]
[null,"","","","","","","","",""]
[null,"","","","","","","","",""]
[null,"","","","","","","","",""]
[null,"","","","","","","","",""]
[null,"","","","","","","","",""]
[null,"Total",null,{"$f":"SUM(D28:D37)","v":0},0,0,0,0,0,0]
[]
[]
[]
[null,"E17.2 - CATEGORY SPECIFIC FORECASTS"]
[null,null,null,"EXPENDITURE"]
[null,null,null,{"$f":"CONCATENATE(\"$, real \",dms_DollarReal)","v":"$, real June 2025"}]
[null,"Category desription",null,{"$f":"dms_y1","v":"2023-24"},{"$f":"dms_y2","v":"2024-25"},{"$f":"dms_y3","v":"2025-26"},{"$f":"dms_y4","v":"2026-27"},{"$f":"dms_y5","v":"2027-28"},{"$f":"dms_y6","v":"2028-29"},{"$f":"dms_y7","v":"2029-30"}]
[null,"UAG costs","",74402780.710760355,74593426.173378572,36108636.153228492,32762974.544000473,27760733.062397152,25086821.729997851,24050704.839820106]
[null,"Government levies & licence fees","",4587280.3509509116,4599034.5377744697,4256838.3600000003,4256838.3600000003,4256838.3600000003,4256838.3600000003,4256838.3600000003]
[null,"Safeguard mechanism costs","",0,0,2163786.1221675961,2315518.1421285607,2089383.6558870592,1956894.4783439129,1888143.772353478]
[null,"Debt raising costs","",0,0,1985463.3653473016,1967910.9275037572,1957346.6149873119,1928606.3766568552,1873993.2499448936]
[null,"Movement in provisions","",721604.4178796804,0,0,0,0,0,0]
[null,"","","","","","","","",""]
[null,"","","","","","","","",""]
[null,"","","","","","","","",""]
[null,"","","","","","","","",""]
[null,"","","","","","","","",""]
[null,"","","","","","","","",""]
[null,"","","","","","","","",""]
[null,"","","","","","","","",""]
[null,"","","","","","","","",""]
[null,"","","","","","","","",""]
[null,"","","","","","","","",""]
[null,"","","","","","","","",""]
[null,"","","","","","","","",""]
[null,"","","","","","","","",""]
[null,"","","","","","","","",""]
[null,"","","","","","","","",""]
[null,"","","","","","","","",""]
[null,"","","","","","","","",""]
[null,"","","","","","","","",""]
[null,"","","","","","","","",""]
[null,"Total",null,{"$f":"SUM(D46:D70)","v":79711665.479590952},79192460.711153045,44514724.000743389,41303241.97363279,36064301.693271525,33229160.944998618,32069680.222118475]

{"sheet":"E20. Opex","index":13,"n_rows":132,"n_cols":12,"rows_kept":132,"cut":false,"hidden":false,"merged":[[7,1,7,3],[8,1,8,2],[8,3,9,3],[9,1,9,2],[10,1,10,2]]}
[null,{"$f":"INDEX(dms_Worksheet_List,MATCH(dms_Model,dms_Model_List))","v":"REGULATORY REPORTING STATEMENT"}]
[null,{"$f":"dms_TradingNameFull","v":"Jemena Gas Networks (NSW) Ltd"}]
[null,{"$f":"dms_Header_Span","v":"2023-24 to 2029-30"}]
[null,"E20. OPERATING EXPENDITURE"]
[null,"FINAL RIN TEMPLATE - FEBRUARY 2024"]
[]
[]
[null,"IMPORTANT!"]
[null,{"$f":"CONCATENATE(\"Has \",dms_TradingName,\" used a base-step-trend model to derive its opex forecast? \")","v":"Has JGN used a base-step-trend model to derive its opex forecast? "},null,"Yes"]
[null,"Yes /  No",null,"$, real June 2025"]
[null,"Please nominate the base year",null,"2023-24"]
[null,null,null,null,"2015-16","2016-17","2017-18","2018-19","2019-20"]
[null,"E20.1 - OPEX - BY DRIVER"]
[null,"E20.1.1 - REFERENCE SERVICES  "]
[null,null,"EXPENDITURE"]
[null,null,{"$f":"CONCATENATE(\"$, real \",dms_DollarReal)","v":"$, real June 2025"}]
[null,null,{"$f":"CRCP_y1","v":"2020-21"},{"$f":"CRCP_y2","v":"2021-22"},{"$f":"CRCP_y3","v":"2022-23"},{"$f":"dms_y1","v":"2023-24"},{"$f":"dms_y2","v":"2024-25"},{"$f":"dms_y3","v":"2025-26"},{"$f":"dms_y4","v":"2026-27"},{"$f":"dms_y5","v":"2027-28"},{"$f":"dms_y6","v":"2028-29"},{"$f":"dms_y7","v":"2029-30"}]
[null,"Base year total opex, excluding category specific","","","",188618573.11290196,189137777.88133985,176653042.65313441,176653042.65313441,176653042.65313441,176653042.65313441,176653042.65313441]
[null,"Increment from base year to final year","","","","",4506068.6565807946,"","","","",""]
[null,"Price growth","","","","","",1491139.357700025,2788868.3192258705,3942387.7333857939,4977423.1435465049,5783425.4496281352]
[null,"Output growth","","","","","",1557804.6979105112,2666735.3996354486,3720276.9509485541,4966636.8906907979,6321167.8862090278]
[null,"Productivity growth","","","","","",-1549749.9333762014,-3127465.89779469,-4727609.6553778434,-6354064.2138255127,-8000049.3099535909]
[null,"Step changes","","","","","",15543867.086767301,10782975.861799944,13232755.686168388,13364710.057584787,17322454.483344141]
[null,"Category specific",null,null,null,{"$f":"IF(ISBLANK('E17. Step changes'!D71),\"\",'E17. Step changes'!D71)","v":79711665.479590952},{"$f":"IF(ISBLANK('E17. Step changes'!E71),\"\",'E17. Step changes'!E71)","v":79192460.711153045},{"$f":"IF(ISBLANK('E17. Step changes'!F71),\"\",'E17. Step changes'!F71)","v":44514724.000743389},{"$f":"IF(ISBLANK('E17. Step changes'!G71),\"\",'E17. Step changes'!G71)","v":41303241.97363279},{"$f":"IF(ISBLANK('E17. Step changes'!H71),\"\",'E17. Step changes'!H71)","v":36064301.693271525},{"$f":"IF(ISBLANK('E17. Step changes'!I71),\"\",'E17. Step changes'!I71)","v":33229160.944998618},{"$f":"IF(ISBLANK('E17. Step changes'!J71),\"\",'E17. Step changes'!J71)","v":32069680.222118475}]
[]
[null,"E20.1.2 - NON-REFERENCE SERVICES  "]
[null,null,"EXPENDITURE"]
[null,null,{"$f":"CONCATENATE(\"$, real \",dms_DollarReal)","v":"$, real June 2025"}]
[null,null,{"$f":"CRCP_y1","v":"2020-21"},{"$f":"CRCP_y2","v":"2021-22"},{"$f":"CRCP_y3","v":"2022-23"},{"$f":"dms_y1","v":"2023-24"},{"$f":"dms_y2","v":"2024-25"},{"$f":"dms_y3","v":"2025-26"},{"$f":"dms_y4","v":"2026-27"},{"$f":"dms_y5","v":"2027-28"},{"$f":"dms_y6","v":"2028-29"},{"$f":"dms_y7","v":"2029-30"}]
[null,"Base year total opex, excluding category specific"]
[null,"Increment from base year to final year"]
[null,"Price growth"]
[null,"Output growth"]
[null,"Productivity growth"]
[null,"Step changes"]
[null,"Category specific"]
[]
[]
[]
[null,"E20.2 - OPEX - BY CATEGORY"]
[null,"E20.2.1 - REFERENCE SERVICES"]
[null,null,"EXPENDITURE"]
[null,null,{"$f":"CONCATENATE(\"$, real \",dms_DollarReal)","v":"$, real June 2025"}]
[null,null,{"$f":"CRCP_y1","v":"2020-21"},{"$f":"CRCP_y2","v":"2021-22"},{"$f":"CRCP_y3","v":"2022-23"},{"$f":"dms_y1","v":"2023-24"},{"$f":"dms_y2","v":"2024-25"},{"$f":"dms_y3","v":"2025-26"},{"$f":"dms_y4","v":"2026-27"},{"$f":"dms_y5","v":"2027-28"},{"$f":"dms_y6","v":"2028-29"},{"$f":"dms_y7","v":"2029-30"}]
[null,"repairs and maintenance","","","","","","","","","",""]
[null,"marketing and retail incentives","","","","","","","","","",""]
[null,"debt raising","","","","","","","","","",""]
[null,"equity raising","","","","","","","","","",""]
[null,"unaccounted for gas","","","","","","","","","",""]
[null,"jurisdictional charges","","","","","","","","","",""]
[null,"GSL payments","","","","","","","","","",""]
[null,"other opex","","","","","","","","","",""]
[null,"TOTAL",null,null,null,{"$f":"SUM(F45:F52)","v":0},0,0,0,0,0,0]
[]
[null,"E20.2.2 - NON-REFERENCE SERVICES"]
[null,null,"EXPENDITURE"]
[null,null,{"$f":"CONCATENATE(\"$, real \",dms_DollarReal)","v":"$, real June 2025"}]
[null,null,{"$f":"CRCP_y1","v":"2020-21"},{"$f":"CRCP_y2","v":"2021-22"},{"$f":"CRCP_y3","v":"2022-23"},{"$f":"dms_y1","v":"2023-24"},{"$f":"dms_y2","v":"2024-25"},{"$f":"dms_y3","v":"2025-26"},{"$f":"dms_y4","v":"2026-27"},{"$f":"dms_y5","v":"2027-28"},{"$f":"dms_y6","v":"2028-29"},{"$f":"dms_y7","v":"2029-30"}]
[]
[]
[]
[]
[]
[]
[]
[]
[]
[]
[]
[]
[]
[]
[]
[]
[]
[]
[]
[]
[]
[]
[]
[]
[]
[null,"TOTAL",null,null,null,{"$f":"SUM(F59:F83)","v":0},{"$f":"SUM(G59:G83)","v":0},0,0,0,0,0]
[]
[]
[]
[null,"E20.3 - OPEX - BY CATEGORY - RELATED PARTY MARGIN EXPENDITURE"]
[null,"20.3.1 - REFERENCE SERVICES"]
[null,null,"EXPENDITURE"]
[null,null,{"$f":"CONCATENATE(\"$, real \",dms_DollarReal)","v":"$, real June 2025"}]
[null,null,{"$f":"CRCP_y1","v":"2020-21"},{"$f":"CRCP_y2","v":"2021-22"},{"$f":"CRCP_y3","v":"2022-23"},{"$f":"dms_y1","v":"2023-24"},{"$f":"dms_y2","v":"2024-25"},{"$f":"dms_y3","v":"2025-26"},{"$f":"dms_y4","v":"2026-27"},{"$f":"dms_y5","v":"2027-28"},{"$f":"dms_y6","v":"2028-29"},{"$f":"dms_y7","v":"2029-30"}]
[null,"repairs and maintenance","","","","","","","","","",""]
[null,"marketing and retail incentives","","","","","","","","","",""]
[null,"debt raising","","","","","","","","","",""]
[null,"equity raising","","","","","","","","","",""]
[null,"unaccounted for gas","","","","","","","","","",""]
[null,"jurisdictional charges","","","","","","","","","",""]
[null,"GSL payments","","","","","","","","","",""]
[null,"other opex","","","","","","","","","",""]
[null,"TOTAL",null,null,null,{"$f":"SUM(F93:F100)","v":0},0,0,0,0,0,0]
[]
[null,"20.3.2 - NON-REFERENCE SERVICES"]
[null,null,"EXPENDITURE"]
[null,null,{"$f":"CONCATENATE(\"$, real \",dms_DollarReal)","v":"$, real June 2025"}]
[null,null,{"$f":"CRCP_y1","v":"2020-21"},{"$f":"CRCP_y2","v":"2021-22"},{"$f":"CRCP_y3","v":"2022-23"},{"$f":"dms_y1","v":"2023-24"},{"$f":"dms_y2","v":"2024-25"},{"$f":"dms_y3","v":"2025-26"},{"$f":"dms_y4","v":"2026-27"},{"$f":"dms_y5","v":"2027-28"},{"$f":"dms_y6","v":"2028-29"},{"$f":"dms_y7","v":"2029-30"}]
[null,{"$f":"IF(ISBLANK(B59),\"\",B59)","v":""}]
[null,""]
[null,""]
[null,""]
[null,""]
[null,""]
[null,""]
[null,""]
[null,""]
[null,""]
[null,""]
[null,""]
[null,""]
[null,""]
[null,""]
[null,""]
[null,""]
[null,""]
[null,""]
[null,""]
[null,""]
[null,""]
[null,""]
[null,""]
[null,""]
[null,"TOTAL",null,null,null,{"$f":"SUM(F107:F131)","v":0},{"$f":"SUM(G107:G131)","v":0},0,0,0,0,0]

{"sheet":"E21. ARS","index":14,"n_rows":37,"n_cols":9,"rows_kept":37,"cut":false,"hidden":false,"merged":[]}
[null,{"$f":"INDEX(dms_Worksheet_List,MATCH(dms_Model,dms_Model_List))","v":"REGULATORY REPORTING STATEMENT"}]
[null,{"$f":"dms_TradingNameFull","v":"Jemena Gas Networks (NSW) Ltd"}]
[null,{"$f":"dms_Header_Span","v":"2023-24 to 2029-30"}]
[null,"E21. ANCILLARY REFERENCE SERVICES"]
[null,"FINAL RIN TEMPLATE - FEBRUARY 2024"]
[]
[null,"E21.1 - VOLUMES"]
[null,null,"NUMBER OF SERVICES"]
[null,null,"0's"]
[null,"Description",{"$f":"dms_y1","v":"2023-24"},{"$f":"dms_y2","v":"2024-25"},{"$f":"dms_y3","v":"2025-26"},{"$f":"dms_y4","v":"2026-27"},{"$f":"dms_y5","v":"2027-28"},{"$f":"dms_y6","v":"2028-29"},{"$f":"dms_y7","v":"2029-30"}]
[null,"Hourly charge – non-standard retailer-initiated requests and queries",69.54031722819056,69.168443874029109,68.796570519867672,68.42469716570622,67.95985547300441,67.40204544176224,66.844235410520071]
[null,"Disconnection – Volume Customers – Completed",18310.174397866751,18378.21651753924,19202.719721847126,21148.764596789959,24445.808680688529,31695.130944881363,45816.140441937721]
[null,"Disconnection – Volume Customers – Wasted Visit",14031.869882399438,14084.01346929385,14715.865543942444,15396.842827379905,15923.788559043091,18217.000982361031,21066.520959076468]
[null,"Reconnection – Volume Customers – Completed",9252.9131968538404,8988.5270672732131,8899.8838329276696,8594.2110716941897,8349.0115234088425,8066.8342562740318,7539.6144315674155]
[null,"Reconnection – Volume Customers – Wasted Visit",1653.9043745749473,1606.6468928513516,1590.8024306866771,1536.1652038763843,1492.337211878056,1441.899667875314,1347.6621930504778]
[null,"Expedited reconnection",5465.8978318179697,5309.7191730871309,5257.3556793304433,5076.7881059266429,4931.9433796418098,4765.2551075476867,4453.8148470105843]
[null,"Abolishment – Up to 25m3/hr – Completed",4271.9495524671265,4589.1399424378278,6150.1580345973989,8337.9363672092113,8815.0508664870449,10343.718441946579,13281.632088064798]
["Row inserted","Special meter read – Completed",510960.54041889531,517222.23498088738,521906.00040556415,524417.36167450889,524754.93541992025,521852.28261079895,513285.52387934696]
["Row inserted","Special meter read – Wasted Visit",29895.491276132092,30261.853099294349,30535.89278987022,30682.828556858025,30702.579461600537,30532.74984684871,30031.522372979809]
[null,"Total",{"$f":"SUM(C11:C19)","v":593912.28124823561},{"$f":"SUM(D11:D19)","v":600509.51958653843},{"$f":"SUM(E11:E19)","v":608327.47500928608},615259.3231014089,619483.41495814116,626982.27390397538,636889.27544844477]
[]
[null,"E21.2 - omitted"]
[]
[null,"E21.3 - EXPENDITURE"]
[null,null,"EXPENDITURE"]
[null,null,{"$f":"CONCATENATE(\"$, real \",dms_DollarReal)","v":"$, real June 2025"}]
[null,null,{"$f":"dms_y1","v":"2023-24"},{"$f":"dms_y2","v":"2024-25"},{"$f":"dms_y3","v":"2025-26"},{"$f":"dms_y4","v":"2026-27"},{"$f":"dms_y5","v":"2027-28"},{"$f":"dms_y6","v":"2028-29"},{"$f":"dms_y7","v":"2029-30"}]
[null,{"$f":"IF(ISBLANK(B11),\"\",B11)","v":"Hourly charge – non-standard retailer-initiated requests and queries"},13480.848310875939,15240.424776023439,13787.457108994084,13779.986778710656,13748.786467688071,13708.609586270755,13673.105962413665]
[null,{"$f":"IF(ISBLANK(B12),\"\",B12)","v":"Disconnection – Volume Customers – Completed"},2340782.9074128368,2668509.3807454943,1569250.2042079302,1736732.7172479418,2016640.0810672713,2628602.689759667,3821499.3186835931]
[null,"Disconnection – Volume Customers – Wasted Visit",1176289.8832504298,1344261.0588464721,658557.66281559342,692401.82625580777,719364.38734988798,827347.24481651315,962247.1877391641]
[null,"Reconnection – Volume Customers – Completed",950196.41980785527,1049580.3794996841,1021683.8065356511,991417.81708123151,967524.04688076035,939806.08521090704,883419.82967212878]
[null,"Reconnection – Volume Customers – Wasted Visit",138646.5952136855,153347.8264619296,182620.03340053477,177210.16395784682,172939.29161538451,167984.86730762609,157906.1523432195]
[null,"Expedited reconnection",1672450.1704773526,1843855.9576836515,1002475.1033569748,972778.1455384877,949333.60271801858,922136.76714904746,866810.63103182847]
[null,"Abolishment – Up to 25m3/hr – Completed",5622436.7810047595,6853575.6041924814,8807329.6165785585,11998724.533513326,12743165.771167947,15032721.51088063,19413116.233330805]
["Row inserted","Special meter read – Completed",7335281.0038585756,8402847.8891917262,8631601.38549456,8715547.6009349544,8760928.8494592868,8758901.055064138,8664508.5882465523]
["Row inserted","Special meter read – Wasted Visit",429175.66409150074,491637.31030981697,505021.31477227435,509932.87477122294,512588.05968676828,512469.41665104526,506946.6630427838]
[null,"Total",{"$f":"SUM(C28:C36)","v":19678740.27342787},22822855.83170728,22392326.58427107,25808525.666079529,26856232.876413014,29803678.246425845,35290127.71005249]

{"sheet":"E25. Escalators","index":15,"n_rows":23,"n_cols":9,"rows_kept":23,"cut":false,"hidden":false,"merged":[[7,1,8,1]]}
[null,{"$f":"INDEX(dms_Worksheet_List,MATCH(dms_Model,dms_Model_List))","v":"REGULATORY REPORTING STATEMENT"}]
[null,{"$f":"dms_TradingNameFull","v":"Jemena Gas Networks (NSW) Ltd"}]
[null,{"$f":"dms_Header_Span","v":"2023-24 to 2029-30"}]
[null,"E25. ESCALATORS"]
[null,"FINAL RIN TEMPLATE - FEBRUARY 2024"]
[]
[null,"E25.1 - FORECAST CAPEX AND OPEX PRICE CHANGES"]
[null,null,"Price changes (% YoY real)"]
[null,null,{"$f":"dms_y1","v":"2023-24"},{"$f":"dms_y2","v":"2024-25"},{"$f":"dms_y3","v":"2025-26"},{"$f":"dms_y4","v":"2026-27"},{"$f":"dms_y5","v":"2027-28"},{"$f":"dms_y6","v":"2028-29"},{"$f":"dms_y7","v":"2029-30"}]
[null,"E25.1.1 - OPEX"]
[null,"Consumer price index",3.3000000000000002E-2,3.1E-2,2.7897560446280112E-2,2.7897560446280112E-2,2.7897560446280112E-2,2.7897560446280112E-2,2.7897560446280112E-2]
[null,"Real labour escalation","","",1.4104239577599428E-2,9.7800343713248077E-3,9.1205655125751149E-3,1.065893064062973E-2,1.1466866713006455E-2]
[null,"","","","","","","",""]
[null,"","","","","","","",""]
[null,"","","","","","","",""]
[null,"","","","","","","",""]
[null,"E25.1.2 - CAPEX"]
[null,"Consumer price index",4.0519877675840865E-2,3.2000000000000001E-2,2.7897560446280112E-2,2.7897560446280112E-2,2.7897560446280112E-2,2.7897560446280112E-2,2.7897560446280112E-2]
[null,"Real labour escalation",5.4960372005078374E-3,1.101761158294012E-2,1.4104239577599428E-2,9.7800343713248077E-3,9.1205655125751149E-3,1.065893064062973E-2,1.1466866713006455E-2]
[null,"","","","","","","",""]
[null,"","","","","","","",""]
[null,"","","","","","","",""]
[null,"","","","","","","",""]

{"sheet":"N1. Demand","index":16,"n_rows":97,"n_cols":9,"rows_kept":97,"cut":false,"hidden":false,"merged":[]}
[null,{"$f":"INDEX(dms_Worksheet_List,MATCH(dms_Model,dms_Model_List))","v":"REGULATORY REPORTING STATEMENT"}]
[null,{"$f":"dms_TradingNameFull","v":"Jemena Gas Networks (NSW) Ltd"}]
[null,{"$f":"dms_Header_Span","v":"2023-24 to 2029-30"}]
[null,"N1. DEMAND"]
[null,"FINAL RIN TEMPLATE - FEBRUARY 2024"]
[]
[null,"N1.1 - DEMAND - BY CUSTOMER (GAS) TYPE"]
[null,null,"VOLUME"]
[null,null,"GJ"]
[null,null,{"$f":"dms_y1","v":"2023-24"},{"$f":"dms_y2","v":"2024-25"},{"$f":"dms_y3","v":"2025-26"},{"$f":"dms_y4","v":"2026-27"},{"$f":"dms_y5","v":"2027-28"},{"$f":"dms_y6","v":"2028-29"},{"$f":"dms_y7","v":"2029-30"}]
[null,"Residential",27907590.238972846,27893078.680408254,27871515.705164969,27678948.980971068,27231417.918383893,26586477.330974076,25593196.750508085]
[null,"Commercial",13113223.630603049,12905584.533194916,12650295.26746163,12307867.025429621,11884976.015640501,11385743.053549554,10736290.432308655]
[null,"Industrial",45989918.672300056,47064081.672300048,47272683.672300056,48963100.672300018,48622231.672300018,47220799.672300041,48578813.672300033]
[null,"Total",{"$f":"SUM(C11:C13)","v":87010732.541875958},87862744.885903209,87794494.644926652,88949916.678700715,87738625.606324404,85193020.056823671,84908300.855116785]
[]
[]
[]
[null,"N1.2 - DEMAND - BY TARIFF"]
[null,null,"VOLUME"]
[null,null,"GJ"]
[null,"Tariff",{"$f":"dms_y1","v":"2023-24"},{"$f":"dms_y2","v":"2024-25"},{"$f":"dms_y3","v":"2025-26"},{"$f":"dms_y4","v":"2026-27"},{"$f":"dms_y5","v":"2027-28"},{"$f":"dms_y6","v":"2028-29"},{"$f":"dms_y7","v":"2029-30"}]
[null,"Volume - Individual metered (VI-Coastal)","","","","","","",""]
[null,"Volume - Individual metered (VI-Country)","","","","","","",""]
[null,"Volume - Boundary metered (VB-Coastal)","","","","","","",""]
[null,"Volume - Boundary metered (VB-Country)","","","","","","",""]
[null,"Volume - Individual metered (VI) small",27359519.58460933,27208656.335960124,27020705.256703671,26660116.373411112,26075771.368683971,25308627.972692251,24208376.256331772]
[null,"Volume - Individual metered (VI) large",12861233.6484657,12790315.46279202,12701962.933891678,12532456.380067769,12257765.970615651,11897145.221146163,11379936.051866826]
[null,"Volume - Boundary metered (VB)",710060.63650086487,709691.41485102836,709142.78203124728,704243.2529218134,692856.59472476155,676447.19068521354,651174.87461814238]
[null,"Volume - Residential distributed generation technology (VRT3)",0,0,0,0,0,0,0]
[null,"Volume - Residential distributed generation technology (VRT4)"]
[null,"Volume - Residential distributed generation technology (VRT6)",0,0,0,0,0,0,0]
[null,"Volume - Residential distributed generation technology (VRT10)",0,0,0,0,0,0,0]
[null,"Demand - Capacity coastal (DC1)",2742527.0674000042,3624177.0674000038,3624177.0674000038,3324177.067400001,3328177.067400001,3432027.0674000029,3335703.0674000015]
[null,"Demand - Capacity coastal (DC2)",3706547.7675000038,3741547.7675000033,3741547.7675000033,3741547.7675000015,3741547.7675000015,3741547.7675000019,3741547.7675000019]
[null,"Demand - Capacity coastal (DC3)",6818744.8875000104,6833744.8875000086,6863744.8875000086,6878744.8875000058,6893744.8875000058,6723744.8875000067,6733744.8875000058]
[null,"Demand - Capacity coastal (DC4)",1045875.3015000015,1045875.3015000012,1045875.3015000012,1045875.3015000005,1045875.3015000005,1045875.3015000012,1045875.301500001]
[null,"Demand - Capacity coastal (DC5)"]
[null,"Demand - Capacity coastal (DC6)",4539353.1514000045,4284376.1514000027,4315699.1514000027,4333854.1514000008,4346097.1514000008,4356746.1514000017,4362189.1514000017]
[null,"Demand - Capacity coastal (DC7)",1381648.0670000017,1381648.0670000012,1381648.0670000012,1381648.0670000003,1381648.0670000003,1381648.067000001,1381648.0670000005]
[null,"Demand - Capacity coastal (DC8)"]
[null,"Demand - Capacity coastal (DC9)"]
[null,"Demand - Capacity coastal (DC10)",392436.95050000056,392436.9505000005,392436.9505000005,392436.95050000027,392436.95050000027,392436.95050000038,392436.95050000033]
[null,"Demand - Capacity coastal (DC11)",0,0,0,0,0,0,0]
[null,"Demand - Capacity country (DC Country) - Distance",0,0,0,0,0,0,0]
[null,"Demand - Capacity country (DC Country) - Pressure reduction",2679354.109500003,2679354.1095000026,2679354.1095000026,2679354.1095000007,2679354.1095000007,2679354.1095000021,2679354.1095000012]
[null,"Demand - Capacity - First response (DCFR1)"]
[null,"Demand - Capacity - First response (DCFR6)"]
[null,"Demand - Throughput (DT)",238247.33800000028,238247.33800000025,238247.33800000025,238247.33800000011,238247.33800000011,238247.33800000022,238247.33800000016]
[null,"Demand - Major end-user (throughput) (DMT1)"]
[null,"Demand - Major end-user (throughput) (DMT2)"]
[null,"Demand - Major end-user (throughput) (DMT3)",0,0,0,0,0,0,0]
[null,"Demand - Major end-user (throughput) (DMT4)",0,0,0,0,0,0,0]
[null,"Demand - Major end-user (throughput) (DMT5)",0,0,0,0,0,0,0]
[null,"Demand - Major end-user (throughput) - First response (DMTFR3)"]
[null,"Prudent discounts"]
[null,"","","","","","","",""]
[null,"","","","","","","",""]
[null,"","","","","","","",""]
[null,"","","","","","","",""]
[null,"","","","","","","",""]
[null,"","","","","","","",""]
[null,"","","","","","","",""]
[null,"","","","","","","",""]
[null,"","","","","","","",""]
[null,"","","","","","","",""]
[null,"","","","","","","",""]
[null,"","","","","","","",""]
[null,"","","","","","","",""]
[null,"","","","","","","",""]
[null,"","","","","","","",""]
[null,"","","","","","","",""]
[null,"","","","","","","",""]
[null,"","","","","","","",""]
[null,"","","","","","","",""]
[null,"","","","","","","",""]
[null,"","","","","","","",""]
[null,"","","","","","","",""]
[null,"","","","","","","",""]
[null,"","","","","","","",""]
[null,"","","","","","","",""]
[null,"","","","","","","",""]
[null,"","","","","","","",""]
[null,"","","","","","","",""]
[null,"","","","","","","",""]
[null,"","","","","","","",""]
[null,"","","","","","","",""]
[null,"","","","","","","",""]
[null,"","","","","","","",""]
[null,"","","","","","","",""]
[null,"","","","","","","",""]
[null,"","","","","","","",""]
[null,"","","","","","","",""]
[null,"","","","","","","",""]
[null,"","","","","","","",""]
[null,"","","","","","","",""]
[null,"","","","","","","",""]
[null,"Total",{"$f":"SUM(C22:C96)","v":64475548.509875931},64930070.853903197,64714541.612926625,63912701.646700703,63073522.574324377,61873848.024823651,60150233.823116757]

{"sheet":"N2. Network characteristics","index":17,"n_rows":64,"n_cols":10,"rows_kept":64,"cut":false,"hidden":false,"merged":[]}
[null,{"$f":"INDEX(dms_Worksheet_List,MATCH(dms_Model,dms_Model_List))","v":"REGULATORY REPORTING STATEMENT"}]
[null,{"$f":"dms_TradingNameFull","v":"Jemena Gas Networks (NSW) Ltd"}]
[null,{"$f":"dms_Header_Span","v":"2023-24 to 2029-30"}]
[null,"N2. NETWORK CHARACTERISTICS"]
[null,"FINAL RIN TEMPLATE - FEBRUARY 2024"]
[]
[null,"N2.1 - NETWORK LENGTH - BY PRESSURE AND ASSET TYPE"]
[null,null,null,"LENGTH"]
[null,null,null,"KM"]
[null,null,null,{"$f":"dms_y1","v":"2023-24"},{"$f":"dms_y2","v":"2024-25"},{"$f":"dms_y3","v":"2025-26"},{"$f":"dms_y4","v":"2026-27"},{"$f":"dms_y5","v":"2027-28"},{"$f":"dms_y6","v":"2028-29"},{"$f":"dms_y7","v":"2029-30"}]
[null,"N2.1.1 - LOW PRESSURE"]
[null,null,"Cast Iron",35.680109999999871,35.680109999999871,35.680109999999871,35.680109999999871,12.680109999999871,0,0]
[null,null,"PVC",0,0,0,0,0,0,0]
[null,null,"Polyamide",956.9036314681116,958.03460281979153,958.85839834244678,959.71447281124813,960.55694497484342,961.2930805136524,961.91226737192369]
[null,null,"High density polyethylene (80)",28.559159999999991,28.559159999999991,28.559159999999991,28.559159999999991,28.559159999999991,28.559159999999991,28.559159999999991]
[null,null,"High density polyethylene (100)",71.006604693000043,91.536596783836899,106.06509448231401,120.92661560396122,159.30436106236576,204.85047834480235,224.39479967449117]
[null,null,"High density polyethylene (250)",0,0,0,0,0,0,0]
[null,null,"High density polyethylene (575)",0,0,0,0,0,0,0]
[null,null,"Medium density polyethylene",0,0,0,0,0,0,0]
[null,null,"Other polyethylene",33.537984999999999,33.537984999999999,33.537984999999999,33.537984999999999,33.537984999999999,33.537984999999999,33.537984999999999]
[null,null,"Unprotected steel",0,0,0,0,0,0,0]
[null,null,"Protected steel",5.5214470000000011,5.5214470000000011,5.5214470000000011,5.5214470000000011,5.5214470000000011,5.5214470000000011,5.5214470000000011]
[null,null,"Other",0.28976499999999999,0.28976499999999999,0.28976499999999999,0.28976499999999999,0.28976499999999999,0.28976499999999999,0.28976499999999999]
[null,"N2.1.2 - MEDIUM PRESSURE"]
[null,null,"Cast Iron",34.860600000000005,34.860600000000005,25.860600000000005,16.860600000000005,7.8606000000000051,7.8606000000000051,7.8606000000000051]
[null,null,"PVC",0,0,0,0,0,0,0]
[null,null,"Polyamide",19138.337357579654,19147.204234260891,19153.113869863795,19159.600516763097,19166.218004166614,19172.060511990319,19176.963663244547]
[null,null,"High density polyethylene (80)",640.03354799999988,640.03354799999988,640.03354799999988,640.03354799999988,640.03354799999988,640.03354799999988,640.03354799999988]
[null,null,"High density polyethylene (100)",3009.2206412085902,3172.7836711359309,3291.2265832765893,3421.7811429117178,3554.6747915624278,3664.9605118015152,3788.8794214261866]
[null,null,"High density polyethylene (250)",0,0,0,0,0,0,0]
[null,null,"High density polyethylene (575)",0,0,0,0,0,0,0]
[null,null,"Medium density polyethylene",0,0,0,0,0,0,0]
[null,null,"Other polyethylene",355.82130700000067,355.82130700000067,355.82130700000067,355.82130700000067,355.82130700000067,355.82130700000067,355.82130700000067]
[null,null,"Unprotected steel",0,0,0,0,0,0,0]
[null,null,"Protected steel",357.62119100000007,357.31119100000006,357.31119100000006,357.31119100000006,357.31119100000006,357.31119100000006,327.11119100000008]
[null,null,"Other",1.5796839999999996,1.5796839999999996,1.5796839999999996,1.5796839999999996,1.5796839999999996,1.5796839999999996,1.5796839999999996]
[null,"N2.1.3 - HIGH PRESSURE"]
[null,null,"Cast Iron",0,0,0,0,0,0,0]
[null,null,"PVC",0,0,0,0,0,0,0]
[null,null,"Polyamide",0,0,0,0,0,0,0]
[null,null,"High density polyethylene (80)",0,0,0,0,0,0,0]
[null,null,"High density polyethylene (100)",9.5294629999999998,9.5294629999999998,9.5294629999999998,9.5294629999999998,9.5294629999999998,9.5294629999999998,9.5294629999999998]
[null,null,"High density polyethylene (250)",0,0,0,0,0,0,0]
[null,null,"High density polyethylene (575)",0,0,0,0,0,0,0]
[null,null,"Medium density polyethylene",0,0,0,0,0,0,0]
[null,null,"Other polyethylene",0,0,0,0,0,0,0]
[null,null,"Unprotected steel",0,0,0,0,0,0,0]
[null,null,"Protected steel",1449.4284779999984,1449.4284779999984,1462.4284779999984,1468.5284779999984,1472.8284779999983,1489.9784779999984,1490.5984779999983]
[null,null,"Other",0,0,0,0,0,0,0]
[null,"N2.1.4 - TRANSMISSION"]
[null,null,"Protected steel",414.56718757601993,414.56718757601993,414.56718757601993,414.56718757601993,414.56718757601993,414.56718757601993,414.56718757601993]
[null,null,"Other",0,0,0,0,0,0,0]
[null,null,"Total",{"$f":"SUM(D12:D52)","v":26542.498160525374},26736.279030576468,26879.983871541164,27029.842673666044,27180.874027342274,27347.754398226305,27467.15996729317]
[]
[]
[]
[null,"N2.2 - CITY GATES / REGULATORS"]
[null,null,null,"VOLUMES"]
[null,null,null," 0's"]
[null,null,null,{"$f":"dms_y1","v":"2023-24"},{"$f":"dms_y2","v":"2024-25"},{"$f":"dms_y3","v":"2025-26"},{"$f":"dms_y4","v":"2026-27"},{"$f":"dms_y5","v":"2027-28"},{"$f":"dms_y6","v":"2028-29"},{"$f":"dms_y7","v":"2029-30"}]
[null,null,"City Gate",75,75,76,76,79,82,83]
[null,null,"Field Regulator",0,0,0,0,0,0,0]
[null,null,"District Regulator",648,650,652,655,655,655,656]
[null,null,"Total",{"$f":"SUM(D61:D63)","v":723},{"$f":"SUM(E61:E63)","v":725},{"$f":"SUM(F61:F63)","v":728},{"$f":"SUM(G61:G63)","v":731},734,737,739]

{"sheet":"S1. Cust. no.-by type","index":18,"n_rows":73,"n_cols":9,"rows_kept":73,"cut":false,"hidden":false,"merged":[]}
[null,{"$f":"INDEX(dms_Worksheet_List,MATCH(dms_Model,dms_Model_List))","v":"REGULATORY REPORTING STATEMENT"}]
[null,{"$f":"dms_TradingNameFull","v":"Jemena Gas Networks (NSW) Ltd"}]
[null,{"$f":"dms_Header_Span","v":"2023-24 to 2029-30"}]
[null,"S1. CUSTOMER NUMBERS"]
[null,"FINAL RIN TEMPLATE - FEBRUARY 2024"]
[]
[null,"S1.1 - CUSTOMER NUMBERS - BY CUSTOMER (GAS) TYPE "]
[null,null,"NUMBER OF CUSTOMERS"]
[null,null,{"$f":"dms_y1","v":"2023-24"},{"$f":"dms_y2","v":"2024-25"},{"$f":"dms_y3","v":"2025-26"},{"$f":"dms_y4","v":"2026-27"},{"$f":"dms_y5","v":"2027-28"},{"$f":"dms_y6","v":"2028-29"},{"$f":"dms_y7","v":"2029-30"}]
[null,"A. RESIDENTIAL"]
[null,"Customer numbers - beginning of year",1480471.3504887661,1500778.7225001915,1518170.0872502539,1529073.3940221802,1533488.9120908666,1531408.6202319073,1516500.9139270959]
[null,"Customer numbers - end of year",1500778.7225001915,1518170.0872502539,1529073.3940221802,1533488.9120908666,1531408.6202319073,1516500.9139270959,1480630.3651070935]
[null,"Total customer connections",41743.885334939747,39181.221690537677,35075.426767741825,32732.790139493874,29985.289697827608,25914.879968395835,21988.386255807636]
[null,"Total customer disconnections",21436.518285284437,21789.852162136533,24172.121913767485,28317.267447008489,32065.582617453998,40822.589754572145,57858.934658571387]
[null,"B. COMMERCIAL"]
[null,"Customer numbers - beginning of year",34266.021454627968,34107.693869798517,33941.480713865662,33767.780230171687,33611.576768918967,33447.381467676496,33275.348830366282]
[null,"Customer numbers - end of year",34107.693869798517,33941.480713865662,33767.780230171687,33611.576768918967,33447.381467676496,33275.348830366282,33095.609816906042]
[null,"Total customer connections",994.70434032808021,1010.700867770719,1006.2420445575503,1012.0263543847452,1029.886449212167,1042.7912289275546,1056.9656416155442]
[null,"Total customer disconnections",1153.0502256,1177.8930278684429,1179.9202932385883,1168.2096162258463,1194.0602787791649,1214.8009321025638,1236.6799815954819]
[null,"C. INDUSTRIAL"]
[null,"Customer numbers - beginning of year",380,380,380,380,380,380,380]
[null,"Customer numbers - end of year",380,380,380,380,380,380,380]
[null,"Total customer connections",0,0,0,0,0,0,0]
[null,"Total customer disconnections",0,0,0,0,0,0,0]
[]
[]
[]
[null,"S1.3 - CUSTOMER DISCONNECTIONS - BY CUSTOMER (GAS) TYPE"]
[null,null,"NUMBER OF CUSTOMERS"]
[null,null,{"$f":"dms_y1","v":"2023-24"},{"$f":"dms_y2","v":"2024-25"},{"$f":"dms_y3","v":"2025-26"},{"$f":"dms_y4","v":"2026-27"},{"$f":"dms_y5","v":"2027-28"},{"$f":"dms_y6","v":"2028-29"},{"$f":"dms_y7","v":"2029-30"}]
[null,"A. RESIDENTIAL"]
[null,"Disconnection - meter not removed",17381.434212766751,17553.772766815688,18403.843637435129,20367.144578997231,23632.516849941112,30869.759516034486,44970.393734050791]
[null,"Disconnection - meter removed",0,0,0,0,0,0,0]
[null,"Disconnection - other",0,0,0,0,0,0,0]
[null,"Abolishment",4055.0840725176863,4236.0793953208449,5768.2782763323567,7950.1228680112599,8433.0657675128859,9952.8302385376574,12888.540924520594]
[null,"B. COMMERCIAL"]
[null,"Disconnection - meter not removed",928.74018509999996,825.44375072355126,798.87608441199859,781.62001779272669,813.29183074741889,825.37142884687728,845.74670788692902]
[null,"Disconnection - meter removed",0,0,0,0,0,0,0]
[null,"Disconnection - other",0,0,0,0,0,0,0]
[null,"Abolishment",224.31004049999999,352.44927714489177,381.04420882658968,386.5895984331197,380.76844803174612,389.42950325568665,390.93327370855292]
[null,"C. INDUSTRIAL"]
[null,"Disconnection - meter not removed",0,0,0,0,0,0,0]
[null,"Disconnection - meter removed",0,0,0,0,0,0,0]
[null,"Disconnection - other",0,0,0,0,0,0,0]
[null,"Abolishment",0,0,0,0,0,0,0]
[]
[]
[null,"S1.4 - CONNECTION ACTIVITIES - BY CUSTOMER (GAS) TYPE"]
[null,null,"NUMBER OF CONNECTIONS"]
[null,null,{"$f":"dms_y1","v":"2023-24"},{"$f":"dms_y2","v":"2024-25"},{"$f":"dms_y3","v":"2025-26"},{"$f":"dms_y4","v":"2026-27"},{"$f":"dms_y5","v":"2027-28"},{"$f":"dms_y6","v":"2028-29"},{"$f":"dms_y7","v":"2029-30"}]
[null,"A. RESIDENTIAL"]
[null,"New connections (no previous supply)",27670.741999999998,25530.272655646124,21551.012406070007,19684.784214737007,17331.00136397508,13707.13319858819,10611.928145217053]
[null,"Reconnections (previous supply at the connection point)",14073.143334939748,13650.949034891555,13524.414361671816,13048.005924756866,12654.288333852528,12207.746769807647,11376.458110590582]
[null,"B. COMMERCIAL"]
[null,"New connections (no previous supply)",583.56634032808017,591.2320721595637,598.99850110198611,606.86694991335332,614.83875872743045,622.91528528198967,631.09790515005682]
[null,"Reconnections (previous supply at the connection point)",411.13800000000003,419.46879561115537,407.24354345556429,405.15940447139184,415.04769048473651,419.87594364556503,425.86773646548744]
[null,"C. INDUSTRIAL"]
[null,"New connections (no previous supply)",0,0,0,0,0,0,0]
[null,"Reconnections (previous supply at the connection point)",0,0,0,0,0,0,0]
[]
[]
[null,"S1.5 - DORMANT CONNECTIONS - BY CUSTOMER (GAS) TYPE"]
[null,null,"NUMBER OF DORMANT CONNECTIONS"]
[null,null,{"$f":"dms_y1","v":"2023-24"},{"$f":"dms_y2","v":"2024-25"},{"$f":"dms_y3","v":"2025-26"},{"$f":"dms_y4","v":"2026-27"},{"$f":"dms_y5","v":"2027-28"},{"$f":"dms_y6","v":"2028-29"},{"$f":"dms_y7","v":"2029-30"}]
[null,"A. RESIDENTIAL"]
[null,"Dormant connection <= 12 months",20555.333333333332,19486.666666666664,18418,17349.333333333336,16280.666666666672,15212.000000000007,14143.333333333343]
[null,"Dormant connection > 12 months",30794.666666666668,31796.333333333336,32798,33799.666666666664,34801.333333333328,35802.999999999993,36804.666666666657]
[null,"B. COMMERCIAL"]
[null,"Dormant connection <= 12 months",757,707,657,607,557,507,457]
[null,"Dormant connection > 12 months",2244.6666666666665,2300.333333333333,2355.9999999999995,2411.6666666666661,2467.3333333333326,2522.9999999999991,2578.6666666666656]
[null,"C. INDUSTRIAL"]
[null,"Dormant connection <= 12 months",0,0,0,0,0,0,0]
[null,"Dormant connection > 12 months",0,0,0,0,0,0,0]

{"sheet":"S1.2 Cust. no.-by tariff","index":19,"n_rows":329,"n_cols":9,"rows_kept":329,"cut":false,"hidden":false,"merged":[]}
[null,{"$f":"INDEX(dms_Worksheet_List,MATCH(dms_Model,dms_Model_List))","v":"REGULATORY REPORTING STATEMENT"}]
[null,{"$f":"dms_TradingNameFull","v":"Jemena Gas Networks (NSW) Ltd"}]
[null,{"$f":"dms_Header_Span","v":"2023-24 to 2029-30"}]
[null,"S1. CUSTOMER NUMBERS"]
[null,"FINAL RIN TEMPLATE - FEBRUARY 2024"]
[]
[null,"S1.2 - CUSTOMER (GAS) NUMBERS - BY TARIFF"]
[null,"S1.2.1 - CUSTOMER NUMBERS - BEGINNING OF YEAR"]
[null,null,"NUMBER OF CUSTOMERS"]
[null,null,{"$f":"dms_y1","v":"2023-24"},{"$f":"dms_y2","v":"2024-25"},{"$f":"dms_y3","v":"2025-26"},{"$f":"dms_y4","v":"2026-27"},{"$f":"dms_y5","v":"2027-28"},{"$f":"dms_y6","v":"2028-29"},{"$f":"dms_y7","v":"2029-30"}]
[null,{"$f":"IF(ISBLANK('N1. Demand'!B22),\"\",'N1. Demand'!B22)","v":"Volume - Individual metered (VI-Coastal)"},1411545.2879575524,{"$f":"C92","v":1430353.7004829147},1446435.7944597432,0,0,0,0]
[null,{"$f":"IF(ISBLANK('N1. Demand'!B23),\"\",'N1. Demand'!B23)","v":"Volume - Individual metered (VI-Country)"},102305.08398584176,{"$f":"C93","v":103631.86908528695},104764.51069187027,0,0,0,0]
[null,{"$f":"IF(ISBLANK('N1. Demand'!B24),\"\",'N1. Demand'!B24)","v":"Volume - Boundary metered (VB-Coastal)"},885,{"$f":"C94","v":898.84680178856195},909.26281250607417,0,0,0,0]
[null,{"$f":"IF(ISBLANK('N1. Demand'!B25),\"\",'N1. Demand'!B25)","v":"Volume - Boundary metered (VB-Country)"},1,{"$f":"C95","v":1},1,0,0,0,0]
[null,{"$f":"IF(ISBLANK('N1. Demand'!B26),\"\",'N1. Demand'!B26)","v":"Volume - Individual metered (VI) small"},0,{"$f":"C96","v":0},0,1546841.2259375949,1551056.7930038825,1548835.2128411077,1533909.9283236214]
[null,{"$f":"IF(ISBLANK('N1. Demand'!B27),\"\",'N1. Demand'!B27)","v":"Volume - Individual metered (VI) large"},0,{"$f":"C97","v":0},0,15082.155315153548,15123.258329586499,15101.597271878574,14956.071373395269]
[null,{"$f":"IF(ISBLANK('N1. Demand'!B28),\"\",'N1. Demand'!B28)","v":"Volume - Boundary metered (VB)"},0,{"$f":"C98","v":0},0,916.79299960360481,919.43752631640348,918.19158659754726,909.26306044562773]
[null,{"$f":"IF(ISBLANK('N1. Demand'!B29),\"\",'N1. Demand'!B29)","v":"Volume - Residential distributed generation technology (VRT3)"},0,{"$f":"C99","v":0},0,0,0,0,0]
[null,{"$f":"IF(ISBLANK('N1. Demand'!B30),\"\",'N1. Demand'!B30)","v":"Volume - Residential distributed generation technology (VRT4)"},1,{"$f":"C100","v":1},1,1,1,1,1]
[null,{"$f":"IF(ISBLANK('N1. Demand'!B31),\"\",'N1. Demand'!B31)","v":"Volume - Residential distributed generation technology (VRT6)"},0,{"$f":"C101","v":0},0,0,0,0,0]
[null,{"$f":"IF(ISBLANK('N1. Demand'!B32),\"\",'N1. Demand'!B32)","v":"Volume - Residential distributed generation technology (VRT10)"},0,{"$f":"C102","v":0},0,0,0,0,0]
[null,{"$f":"IF(ISBLANK('N1. Demand'!B33),\"\",'N1. Demand'!B33)","v":"Demand - Capacity coastal (DC1)"},33,{"$f":"C103","v":33},35,35,35,35,35]
[null,{"$f":"IF(ISBLANK('N1. Demand'!B34),\"\",'N1. Demand'!B34)","v":"Demand - Capacity coastal (DC2)"},74,{"$f":"C104","v":74},74,74,74,74,74]
[null,{"$f":"IF(ISBLANK('N1. Demand'!B35),\"\",'N1. Demand'!B35)","v":"Demand - Capacity coastal (DC3)"},100,{"$f":"C105","v":100},100,100,100,100,100]
[null,{"$f":"IF(ISBLANK('N1. Demand'!B36),\"\",'N1. Demand'!B36)","v":"Demand - Capacity coastal (DC4)"},43,{"$f":"C106","v":43},43,43,43,43,43]
[null,{"$f":"IF(ISBLANK('N1. Demand'!B37),\"\",'N1. Demand'!B37)","v":"Demand - Capacity coastal (DC5)"},2,{"$f":"C107","v":2},2,2,2,2,2]
[null,{"$f":"IF(ISBLANK('N1. Demand'!B38),\"\",'N1. Demand'!B38)","v":"Demand - Capacity coastal (DC6)"},27,{"$f":"C108","v":27},27,27,27,27,27]
[null,{"$f":"IF(ISBLANK('N1. Demand'!B39),\"\",'N1. Demand'!B39)","v":"Demand - Capacity coastal (DC7)"},18,{"$f":"C109","v":18},18,18,18,18,18]
[null,{"$f":"IF(ISBLANK('N1. Demand'!B40),\"\",'N1. Demand'!B40)","v":"Demand - Capacity coastal (DC8)"},3,{"$f":"C110","v":3},3,3,3,3,3]
[null,{"$f":"IF(ISBLANK('N1. Demand'!B41),\"\",'N1. Demand'!B41)","v":"Demand - Capacity coastal (DC9)"},2,{"$f":"C111","v":2},2,2,2,2,2]
[null,{"$f":"IF(ISBLANK('N1. Demand'!B42),\"\",'N1. Demand'!B42)","v":"Demand - Capacity coastal (DC10)"},11,{"$f":"C112","v":11},11,11,11,11,11]
[null,{"$f":"IF(ISBLANK('N1. Demand'!B43),\"\",'N1. Demand'!B43)","v":"Demand - Capacity coastal (DC11)"},0,{"$f":"C113","v":0},0,0,0,0,0]
[null,{"$f":"IF(ISBLANK('N1. Demand'!B44),\"\",'N1. Demand'!B44)","v":"Demand - Capacity country (DC Country) - Distance"},44,{"$f":"C114","v":44},44,44,44,44,44]
[null,{"$f":"IF(ISBLANK('N1. Demand'!B45),\"\",'N1. Demand'!B45)","v":"Demand - Capacity country (DC Country) - Pressure reduction"},"",{"$f":"C115","v":""},"","","","",""]
[null,{"$f":"IF(ISBLANK('N1. Demand'!B46),\"\",'N1. Demand'!B46)","v":"Demand - Capacity - First response (DCFR1)"},1,{"$f":"C116","v":1},1,1,1,1,1]
[null,{"$f":"IF(ISBLANK('N1. Demand'!B47),\"\",'N1. Demand'!B47)","v":"Demand - Capacity - First response (DCFR6)"},3,{"$f":"C117","v":3},3,3,3,3,3]
[null,{"$f":"IF(ISBLANK('N1. Demand'!B48),\"\",'N1. Demand'!B48)","v":"Demand - Throughput (DT)"},12,{"$f":"C118","v":12},12,12,12,12,12]
[null,{"$f":"IF(ISBLANK('N1. Demand'!B49),\"\",'N1. Demand'!B49)","v":"Demand - Major end-user (throughput) (DMT1)"},1,{"$f":"C119","v":1},1,1,1,1,1]
[null,{"$f":"IF(ISBLANK('N1. Demand'!B50),\"\",'N1. Demand'!B50)","v":"Demand - Major end-user (throughput) (DMT2)"},1,{"$f":"C120","v":1},1,1,1,1,1]
[null,{"$f":"IF(ISBLANK('N1. Demand'!B51),\"\",'N1. Demand'!B51)","v":"Demand - Major end-user (throughput) (DMT3)"},0,{"$f":"C121","v":0},0,0,0,0,0]
[null,{"$f":"IF(ISBLANK('N1. Demand'!B52),\"\",'N1. Demand'!B52)","v":"Demand - Major end-user (throughput) (DMT4)"},0,{"$f":"C122","v":0},0,0,0,0,0]
[null,{"$f":"IF(ISBLANK('N1. Demand'!B53),\"\",'N1. Demand'!B53)","v":"Demand - Major end-user (throughput) (DMT5)"},0,{"$f":"C123","v":0},0,0,0,0,0]
[null,{"$f":"IF(ISBLANK('N1. Demand'!B54),\"\",'N1. Demand'!B54)","v":"Demand - Major end-user (throughput) - First response (DMTFR3)"},1,{"$f":"C124","v":1},1,1,1,1,1]
[null,{"$f":"IF(ISBLANK('N1. Demand'!B55),\"\",'N1. Demand'!B55)","v":"Prudent discounts"},4,{"$f":"C125","v":4},2,2,2,2,2]
[null,{"$f":"IF(ISBLANK('N1. Demand'!B56),\"\",'N1. Demand'!B56)","v":""},"",{"$f":"C126","v":""},"","","","",""]
[null,{"$f":"IF(ISBLANK('N1. Demand'!B57),\"\",'N1. Demand'!B57)","v":""},"",{"$f":"C127","v":""},"","","","",""]
[null,{"$f":"IF(ISBLANK('N1. Demand'!B58),\"\",'N1. Demand'!B58)","v":""},"",{"$f":"C128","v":""},"","","","",""]
[null,{"$f":"IF(ISBLANK('N1. Demand'!B59),\"\",'N1. Demand'!B59)","v":""},"",{"$f":"C129","v":""},"","","","",""]
[null,{"$f":"IF(ISBLANK('N1. Demand'!B60),\"\",'N1. Demand'!B60)","v":""},"",{"$f":"C130","v":""},"","","","",""]
[null,{"$f":"IF(ISBLANK('N1. Demand'!B61),\"\",'N1. Demand'!B61)","v":""},"",{"$f":"C131","v":""},{"$f":"D131","v":""},{"$f":"E131","v":""},{"$f":"F131","v":""},{"$f":"G131","v":""},{"$f":"H131","v":""}]
[null,{"$f":"IF(ISBLANK('N1. Demand'!B62),\"\",'N1. Demand'!B62)","v":""},"","","","","","",""]
[null,{"$f":"IF(ISBLANK('N1. Demand'!B63),\"\",'N1. Demand'!B63)","v":""},"","","","","","",""]
[null,{"$f":"IF(ISBLANK('N1. Demand'!B64),\"\",'N1. Demand'!B64)","v":""},"",{"$f":"C134","v":""},"","","","",""]
[null,{"$f":"IF(ISBLANK('N1. Demand'!B65),\"\",'N1. Demand'!B65)","v":""},"",{"$f":"C135","v":""},"","","","",""]
[null,{"$f":"IF(ISBLANK('N1. Demand'!B66),\"\",'N1. Demand'!B66)","v":""},"",{"$f":"C136","v":""},"","","","",""]
[null,{"$f":"IF(ISBLANK('N1. Demand'!B67),\"\",'N1. Demand'!B67)","v":""},"",{"$f":"C137","v":""},"","","","",""]
[null,{"$f":"IF(ISBLANK('N1. Demand'!B68),\"\",'N1. Demand'!B68)","v":""},"",{"$f":"C138","v":""},"","","","",""]
[null,{"$f":"IF(ISBLANK('N1. Demand'!B69),\"\",'N1. Demand'!B69)","v":""},"",{"$f":"C139","v":""},{"$f":"D139","v":""},{"$f":"E139","v":""},{"$f":"F139","v":""},{"$f":"G139","v":""},{"$f":"H139","v":""}]
[null,{"$f":"IF(ISBLANK('N1. Demand'!B70),\"\",'N1. Demand'!B70)","v":""},"","","","","","",""]
[null,{"$f":"IF(ISBLANK('N1. Demand'!B71),\"\",'N1. Demand'!B71)","v":""},"","","","","","",""]
[null,{"$f":"IF(ISBLANK('N1. Demand'!B72),\"\",'N1. Demand'!B72)","v":""},"","","","","","",""]
[null,{"$f":"IF(ISBLANK('N1. Demand'!B73),\"\",'N1. Demand'!B73)","v":""},"","","","","","",""]
[null,{"$f":"IF(ISBLANK('N1. Demand'!B74),\"\",'N1. Demand'!B74)","v":""},"","","","","","",""]
[null,{"$f":"IF(ISBLANK('N1. Demand'!B75),\"\",'N1. Demand'!B75)","v":""},"","","","","","",""]
[null,{"$f":"IF(ISBLANK('N1. Demand'!B76),\"\",'N1. Demand'!B76)","v":""},"","","","","","",""]
[null,{"$f":"IF(ISBLANK('N1. Demand'!B77),\"\",'N1. Demand'!B77)","v":""},"","","","","","",""]
[null,{"$f":"IF(ISBLANK('N1. Demand'!B78),\"\",'N1. Demand'!B78)","v":""},"","","","","","",""]
[null,{"$f":"IF(ISBLANK('N1. Demand'!B79),\"\",'N1. Demand'!B79)","v":""},"","","","","","",""]
[null,{"$f":"IF(ISBLANK('N1. Demand'!B80),\"\",'N1. Demand'!B80)","v":""},"","","","","","",""]
[null,{"$f":"IF(ISBLANK('N1. Demand'!B81),\"\",'N1. Demand'!B81)","v":""},"","","","","","",""]
[null,{"$f":"IF(ISBLANK('N1. Demand'!B82),\"\",'N1. Demand'!B82)","v":""},"","","","","","",""]
[null,{"$f":"IF(ISBLANK('N1. Demand'!B83),\"\",'N1. Demand'!B83)","v":""},"","","","","","",""]
[null,{"$f":"IF(ISBLANK('N1. Demand'!B84),\"\",'N1. Demand'!B84)","v":""},"","","","","","",""]
[null,{"$f":"IF(ISBLANK('N1. Demand'!B85),\"\",'N1. Demand'!B85)","v":""},"","","","","","",""]
[null,{"$f":"IF(ISBLANK('N1. Demand'!B86),\"\",'N1. Demand'!B86)","v":""},"","","","","","",""]
[null,{"$f":"IF(ISBLANK('N1. Demand'!B87),\"\",'N1. Demand'!B87)","v":""},"","","","","","",""]
[null,{"$f":"IF(ISBLANK('N1. Demand'!B88),\"\",'N1. Demand'!B88)","v":""},"","","","","","",""]
[null,{"$f":"IF(ISBLANK('N1. Demand'!B89),\"\",'N1. Demand'!B89)","v":""},"","","","","","",""]
[null,{"$f":"IF(ISBLANK('N1. Demand'!B90),\"\",'N1. Demand'!B90)","v":""},"","","","","","",""]
[null,{"$f":"IF(ISBLANK('N1. Demand'!B91),\"\",'N1. Demand'!B91)","v":""},"","","","","","",""]
[null,{"$f":"IF(ISBLANK('N1. Demand'!B92),\"\",'N1. Demand'!B92)","v":""},"","","","","","",""]
[null,{"$f":"IF(ISBLANK('N1. Demand'!B93),\"\",'N1. Demand'!B93)","v":""},"","","","","","",""]
[null,{"$f":"IF(ISBLANK('N1. Demand'!B94),\"\",'N1. Demand'!B94)","v":""},"","","","","","",""]
[null,{"$f":"IF(ISBLANK('N1. Demand'!B95),\"\",'N1. Demand'!B95)","v":""},"","","","","","",""]
[null,{"$f":"IF(ISBLANK('N1. Demand'!B96),\"\",'N1. Demand'!B96)","v":""},"","","","","","",""]
[null,"Total",{"$f":"SUM(C11:C85)","v":1515117.3719433942},{"$f":"SUM(D11:D85)","v":1535266.4163699902},1552491.5679641196,1563221.174252352,1567480.4888597855,1565236.0016995838,1550156.2627574622]
[]
[null,"S1.2.2 - CUSTOMER NUMBERS - END OF YEAR"]
[null,null,"VOLUMES"]
[null,null,"0's"]
[null,null,{"$f":"dms_y1","v":"2023-24"},{"$f":"dms_y2","v":"2024-25"},{"$f":"dms_y3","v":"2025-26"},{"$f":"dms_y4","v":"2026-27"},{"$f":"dms_y5","v":"2027-28"},{"$f":"dms_y6","v":"2028-29"},{"$f":"dms_y7","v":"2029-30"}]
[null,{"$f":"IF(ISBLANK(B11),\"\",B11)","v":"Volume - Individual metered (VI-Coastal)"},1430353.7004829147,1446435.7944597432,0,0,0,0,0]
[null,"Volume - Individual metered (VI-Country)",103631.86908528695,104764.51069187027,0,0,0,0,0]
[null,"Volume - Boundary metered (VB-Coastal)",898.84680178856195,909.26281250607417,0,0,0,0,0]
[null,"Volume - Boundary metered (VB-Country)",1,1,0,0,0,0,0]
[null,"Volume - Individual metered (VI) small",0,0,1546841.2259375949,1551056.7930038825,1548835.2128411077,1533909.9283236214,1498229.0233486514]
[null,"Volume - Individual metered (VI) large",0,0,15082.155315153548,15123.258329586499,15101.597271878574,14956.071373395269,14608.172092205925]
[null,"Volume - Boundary metered (VB)",0,0,916.79299960360481,919.43752631640348,918.19158659754726,909.26306044562773,887.77948314237221]
[null,"Volume - Residential distributed generation technology (VRT3)",0,0,0,0,0,0,0]
[null,"Volume - Residential distributed generation technology (VRT4)",1,1,1,1,1,1,1]
[null,"Volume - Residential distributed generation technology (VRT6)",0,0,0,0,0,0,0]
[null,"Volume - Residential distributed generation technology (VRT10)",0,0,0,0,0,0,0]
[null,"Demand - Capacity coastal (DC1)",33,35,35,35,35,35,35]
[null,"Demand - Capacity coastal (DC2)",74,74,74,74,74,74,74]
[null,"Demand - Capacity coastal (DC3)",100,100,100,100,100,100,100]
[null,"Demand - Capacity coastal (DC4)",43,43,43,43,43,43,43]
[null,"Demand - Capacity coastal (DC5)",2,2,2,2,2,2,2]
[null,"Demand - Capacity coastal (DC6)",27,27,27,27,27,27,27]
[null,"Demand - Capacity coastal (DC7)",18,18,18,18,18,18,18]
[null,"Demand - Capacity coastal (DC8)",3,3,3,3,3,3,3]
[null,"Demand - Capacity coastal (DC9)",2,2,2,2,2,2,2]
[null,"Demand - Capacity coastal (DC10)",11,11,11,11,11,11,11]
[null,"Demand - Capacity coastal (DC11)",0,0,0,0,0,0,0]
[null,"Demand - Capacity country (DC Country) - Distance",44,44,44,44,44,44,44]
[null,"Demand - Capacity country (DC Country) - Pressure reduction","","","","","","",""]
[null,"Demand - Capacity - First response (DCFR1)",1,1,1,1,1,1,1]
[null,"Demand - Capacity - First response (DCFR6)",3,3,3,3,3,3,3]
[null,"Demand - Throughput (DT)",12,12,12,12,12,12,12]
[null,"Demand - Major end-user (throughput) (DMT1)",1,1,1,1,1,1,1]
[null,"Demand - Major end-user (throughput) (DMT2)",1,1,1,1,1,1,1]
[null,"Demand - Major end-user (throughput) (DMT3)",0,0,0,0,0,0,0]
[null,"Demand - Major end-user (throughput) (DMT4)",0,0,0,0,0,0,0]
[null,"Demand - Major end-user (throughput) (DMT5)",0,0,0,0,0,0,0]
[null,{"$f":"IF(ISBLANK(B43),\"\",B43)","v":"Demand - Major end-user (throughput) - First response (DMTFR3)"},1,1,1,1,1,1,1]
[null,"Prudent discounts",4,2,2,2,2,2,2]
[null,"","","","","","","",""]
[null,"","","","","","","",""]
[null,"","","","","","","",""]
[null,"","","","","","","",""]
[null,"","","","","","","",""]
[null,"","","","","","","",""]
[null,"","","","","","","",""]
[null,"","","","","","","",""]
[null,"","","","","","","",""]
[null,"","","","","","","",""]
[null,"","","","","","","",""]
[null,"","","","","","","",""]
[null,"","","","","","","",""]
[null,"","","","","","","",""]
[null,"","","","","","","",""]
[null,{"$f":"IF(ISBLANK(B60),\"\",B60)","v":""},"","","","","","",""]
[null,"","","","","","","",""]
[null,"","","","","","","",""]
[null,"","","","","","","",""]
[null,"","","","","","","",""]
[null,"","","","","","","",""]
[null,"","","","","","","",""]
[null,"","","","","","","",""]
[null,"","","","","","","",""]
[null,"","","","","","","",""]
[null,"","","","","","","",""]
[null,"","","","","","","",""]
[null,"","","","","","","",""]
[null,"","","","","","","",""]
[null,"","","","","","","",""]
[null,"","","","","","","",""]
[null,"","","","","","","",""]
[null,"","","","","","","",""]
[null,"","","","","","","",""]
[null,"","","","","","","",""]
[null,"","","","","","","",""]
[null,"","","","","","","",""]
[null,"","","","","","","",""]
[null,"","","","","","","",""]
[null,"","","","","","","",""]
[null,"","","","","","","",""]
[null,"Total",{"$f":"SUM(C92:C166)","v":1535266.4163699902},{"$f":"SUM(D92:D166)","v":1552491.5679641196},{"$f":"SUM(E92:E166)","v":1563221.174252352},{"$f":"SUM(F92:F166)","v":1567480.4888597855},{"$f":"SUM(G92:G166)","v":1565236.0016995838},{"$f":"SUM(H92:H166)","v":1550156.2627574622},{"$f":"SUM(I92:I166)","v":1514105.9749239995}]
[]
[null,"S1.2.3 - TOTAL CUSTOMER CONNECTIONS"]
[null,null,"VOLUMES"]
[null,null,"0's"]
[null,null,{"$f":"dms_y1","v":"2023-24"},{"$f":"dms_y2","v":"2024-25"},{"$f":"dms_y3","v":"2025-26"},{"$f":"dms_y4","v":"2026-27"},{"$f":"dms_y5","v":"2027-28"},{"$f":"dms_y6","v":"2028-29"},{"$f":"dms_y7","v":"2029-30"}]
[null,{"$f":"IF(ISBLANK(B11),\"\",B11)","v":"Volume - Individual metered (VI-Coastal)"},39827.481306358801,37455.086169226553,0,0,0,0,0]
[null,"Volume - Individual metered (VI-Country)",2886.0808150080684,2713.2692105662281,0,0,0,0,0]
[null,"Volume - Boundary metered (VB-Coastal)",24.999525120570691,23.541139011341695,0,0,0,0,0]
[null,"Volume - Boundary metered (VB-Country)",2.8028780381258174E-2,2.6039504270348516E-2,0,0,0,0,0]
[null,"Volume - Individual metered (VI) small",0,0,35712.299933047791,33399.365936015158,30697.667187658117,26681.699863066082,22809.434869199125]
[null,"Volume - Individual metered (VI) large",0,0,348.20539123212137,325.65360686537053,299.31125223050594,260.15439377959069,222.39867517082786]
[null,"Volume - Boundary metered (VB)",0,0,21.163488019466993,19.796950998096264,18.197707151158315,15.816940477716209,13.518353053228001]
[null,"Volume - Residential distributed generation technology (VRT3)",0,0,0,0,0,0,0]
[null,"Volume - Residential distributed generation technology (VRT4)",0,0,0,0,0,0,0]
[null,"Volume - Residential distributed generation technology (VRT6)",0,0,0,0,0,0,0]
[null,"Volume - Residential distributed generation technology (VRT10)",0,0,0,0,0,0,0]
[null,"Demand - Capacity coastal (DC1)",0,0,0,0,0,0,0]
[null,"Demand - Capacity coastal (DC2)",0,0,0,0,0,0,0]
[null,"Demand - Capacity coastal (DC3)",0,0,0,0,0,0,0]
[null,"Demand - Capacity coastal (DC4)",0,0,0,0,0,0,0]
[null,"Demand - Capacity coastal (DC5)",0,0,0,0,0,0,0]
[null,"Demand - Capacity coastal (DC6)",0,0,0,0,0,0,0]
[null,"Demand - Capacity coastal (DC7)",0,0,0,0,0,0,0]
[null,"Demand - Capacity coastal (DC8)",0,0,0,0,0,0,0]
[null,"Demand - Capacity coastal (DC9)",0,0,0,0,0,0,0]
[null,"Demand - Capacity coastal (DC10)",0,0,0,0,0,0,0]
[null,"Demand - Capacity coastal (DC11)",0,0,0,0,0,0,0]
[null,"Demand - Capacity country (DC Country) - Distance",0,0,0,0,0,0,0]
[null,"Demand - Capacity country (DC Country) - Pressure reduction",0,0,0,0,0,0,0]
[null,"Demand - Capacity - First response (DCFR1)",0,0,0,0,0,0,0]
[null,"Demand - Capacity - First response (DCFR6)",0,0,0,0,0,0,0]
[null,"Demand - Throughput (DT)",0,0,0,0,0,0,0]
[null,"Demand - Major end-user (throughput) (DMT1)",0,0,0,0,0,0,0]
[null,"Demand - Major end-user (throughput) (DMT2)",0,0,0,0,0,0,0]
[null,"Demand - Major end-user (throughput) (DMT3)",0,0,0,0,0,0,0]
[null,"Demand - Major end-user (throughput) (DMT4)",0,0,0,0,0,0,0]
[null,"Demand - Major end-user (throughput) (DMT5)",0,0,0,0,0,0,0]
[null,{"$f":"IF(ISBLANK(B43),\"\",B43)","v":"Demand - Major end-user (throughput) - First response (DMTFR3)"},0,0,0,0,0,0,0]
[null,"Prudent discounts",0,0,0,0,0,0,0]
[null,"","","","","","","",""]
[null,"","","","","","","",""]
[null,"","","","","","","",""]
[null,"","","","","","","",""]
[null,"","","","","","","",""]
[null,"","","","","","","",""]
[null,"","","","","","","",""]
[null,"","","","","","","",""]
[null,"","","","","","","",""]
[null,"","","","","","","",""]
[null,"","","","","","","",""]
[null,"","","","","","","",""]
[null,"","","","","","","",""]
[null,"","","","","","","",""]
[null,"","","","","","","",""]
[null,{"$f":"IF(ISBLANK(B60),\"\",B60)","v":""},"","","","","","",""]
[null,"","","","","","","",""]
[null,"","","","","","","",""]
[null,"","","","","","","",""]
[null,"","","","","","","",""]
[null,"","","","","","","",""]
[null,"","","","","","","",""]
[null,"","","","","","","",""]
[null,"","","","","","","",""]
[null,"","","","","","","",""]
[null,"","","","","","","",""]
[null,"","","","","","","",""]
[null,"","","","","","","",""]
[null,"","","","","","","",""]
[null,"","","","","","","",""]
[null,"","","","","","","",""]
[null,"","","","","","","",""]
[null,"","","","","","","",""]
[null,"","","","","","","",""]
[null,"","","","","","","",""]
[null,"","","","","","","",""]
[null,"","","","","","","",""]
[null,"","","","","","","",""]
[null,"","","","","","","",""]
[null,"","","","","","","",""]
[null,"","","","","","","",""]
[null,"Total",{"$f":"SUM(C173:C247)","v":42738.589675267824},{"$f":"SUM(D173:D247)","v":40191.922558308397},{"$f":"SUM(E173:E247)","v":36081.66881229938},{"$f":"SUM(F173:F247)","v":33744.816493878629},{"$f":"SUM(G173:G247)","v":31015.17614703978},{"$f":"SUM(H173:H247)","v":26957.671197323387},{"$f":"SUM(I173:I247)","v":23045.351897423181}]
[]
[null,"S1.2.4 - TOTAL CUSTOMER DISCONNECTIONS"]
[null,null,"VOLUMES"]
[null,null,"0's"]
[null,null,{"$f":"dms_y1","v":"2023-24"},{"$f":"dms_y2","v":"2024-25"},{"$f":"dms_y3","v":"2025-26"},{"$f":"dms_y4","v":"2026-27"},{"$f":"dms_y5","v":"2027-28"},{"$f":"dms_y6","v":"2028-29"},{"$f":"dms_y7","v":"2029-30"}]
[null,{"$f":"IF(ISBLANK(B11),\"\",B11)","v":"Volume - Individual metered (VI-Coastal)"},21050.896260776615,21403.775197776504,0,0,0,0,0]
[null,"Volume - Individual metered (VI-Country)",1525.4438855829044,1550.5024864079041,0,0,0,0,0]
[null,"Volume - Boundary metered (VB-Coastal)",13.213549856033458,13.452625499827256,0,0,0,0,0]
[null,"Volume - Boundary metered (VB-Country)",1.4814668886122935E-2,1.4880320743247941E-2,0,0,0,0,0]
[null,"Volume - Individual metered (VI) small",0,0,25092.512763801693,29183.629978002373,32919.156853035354,41607.045101123935,58490.648317715481]
[null,"Volume - Individual metered (VI) large",0,0,244.65935378838807,284.54894568859919,320.9714275622822,405.68088430626449,570.30096406765881]
[null,"Volume - Boundary metered (VB)",0,0,14.870089415989032,17.298139543364535,19.514615635530468,24.664701244507103,34.665358383727323]
[null,"Volume - Residential distributed generation technology (VRT3)",0,0,0,0,0,0,0]
[null,"Volume - Residential distributed generation technology (VRT4)",0,0,0,0,0,0,0]
[null,"Volume - Residential distributed generation technology (VRT6)",0,0,0,0,0,0,0]
[null,"Volume - Residential distributed generation technology (VRT10)",0,0,0,0,0,0,0]
[null,"Demand - Capacity coastal (DC1)",0,0,0,0,0,0,0]
[null,"Demand - Capacity coastal (DC2)",0,0,0,0,0,0,0]
[null,"Demand - Capacity coastal (DC3)",0,0,0,0,0,0,0]
[null,"Demand - Capacity coastal (DC4)",0,0,0,0,0,0,0]
[null,"Demand - Capacity coastal (DC5)",0,0,0,0,0,0,0]
[null,"Demand - Capacity coastal (DC6)",0,0,0,0,0,0,0]
[null,"Demand - Capacity coastal (DC7)",0,0,0,0,0,0,0]
[null,"Demand - Capacity coastal (DC8)",0,0,0,0,0,0,0]
[null,"Demand - Capacity coastal (DC9)",0,0,0,0,0,0,0]
[null,"Demand - Capacity coastal (DC10)",0,0,0,0,0,0,0]
[null,"Demand - Capacity coastal (DC11)",0,0,0,0,0,0,0]
[null,"Demand - Capacity country (DC Country) - Distance",0,0,0,0,0,0,0]
[null,"Demand - Capacity country (DC Country) - Pressure reduction",0,0,0,0,0,0,0]
[null,"Demand - Capacity - First response (DCFR1)",0,0,0,0,0,0,0]
[null,"Demand - Capacity - First response (DCFR6)",0,0,0,0,0,0,0]
[null,"Demand - Throughput (DT)",0,0,0,0,0,0,0]
[null,"Demand - Major end-user (throughput) (DMT1)",0,0,0,0,0,0,0]
[null,"Demand - Major end-user (throughput) (DMT2)",0,0,0,0,0,0,0]
[null,"Demand - Major end-user (throughput) (DMT3)",0,0,0,0,0,0,0]
[null,"Demand - Major end-user (throughput) (DMT4)",0,0,0,0,0,0,0]
[null,"Demand - Major end-user (throughput) (DMT5)",0,0,0,0,0,0,0]
[null,{"$f":"IF(ISBLANK(B43),\"\",B43)","v":"Demand - Major end-user (throughput) - First response (DMTFR3)"},0,0,0,0,0,0,0]
[null,"Prudent discounts",0,0,0,0,0,0,0]
[null,"","","","","","","",""]
[null,"","","","","","","",""]
[null,"","","","","","","",""]
[null,"","","","","","","",""]
[null,"","","","","","","",""]
[null,"","","","","","","",""]
[null,"","","","","","","",""]
[null,"","","","","","","",""]
[null,"","","","","","","",""]
[null,"","","","","","","",""]
[null,"","","","","","","",""]
[null,"","","","","","","",""]
[null,"","","","","","","",""]
[null,"","","","","","","",""]
[null,"","","","","","","",""]
[null,{"$f":"IF(ISBLANK(B60),\"\",B60)","v":""},"","","","","","",""]
[null,"","","","","","","",""]
[null,"","","","","","","",""]
[null,"","","","","","","",""]
[null,"","","","","","","",""]
[null,"","","","","","","",""]
[null,"","","","","","","",""]
[null,"","","","","","","",""]
[null,"","","","","","","",""]
[null,"","","","","","","",""]
[null,"","","","","","","",""]
[null,"","","","","","","",""]
[null,"","","","","","","",""]
[null,"","","","","","","",""]
[null,"","","","","","","",""]
[null,"","","","","","","",""]
[null,"","","","","","","",""]
[null,"","","","","","","",""]
[null,"","","","","","","",""]
[null,"","","","","","","",""]
[null,"","","","","","","",""]
[null,"","","","","","","",""]
[null,"","","","","","","",""]
[null,"","","","","","","",""]
[null,"","","","","","","",""]
[null,"","","","","","","",""]
[null,"Total",{"$f":"SUM(C254:C328)","v":22589.568510884437},{"$f":"SUM(D254:D328)","v":22967.745190004982},{"$f":"SUM(E254:E328)","v":25352.04220700607},{"$f":"SUM(F254:F328)","v":29485.477063234335},{"$f":"SUM(G254:G328)","v":33259.64289623317},{"$f":"SUM(H254:H328)","v":42037.390686674706},{"$f":"SUM(I254:I328)","v":59095.614640166867}]

{"sheet":"S10. Supply Quality","index":20,"n_rows":14,"n_cols":9,"rows_kept":14,"cut":false,"hidden":false,"merged":[]}
[null,{"$f":"INDEX(dms_Worksheet_List,MATCH(dms_Model,dms_Model_List))","v":"REGULATORY REPORTING STATEMENT"}]
[null,{"$f":"dms_TradingNameFull","v":"Jemena Gas Networks (NSW) Ltd"}]
[null,{"$f":"dms_Header_Span","v":"2023-24 to 2029-30"}]
[null,"S10. SUPPLY QUALITY"]
[null,"FINAL RIN TEMPLATE - FEBRUARY 2024"]
[]
[null,"S10.1 - PRESSURE FAULTS"]
[null,null,"NUMBER OF EVENTS"]
[null,null,{"$f":"dms_y1","v":"2023-24"},{"$f":"dms_y2","v":"2024-25"},{"$f":"dms_y3","v":"2025-26"},{"$f":"dms_y4","v":"2026-27"},{"$f":"dms_y5","v":"2027-28"},{"$f":"dms_y6","v":"2028-29"},{"$f":"dms_y7","v":"2029-30"}]
[null,"Poor Pressure events - mains",0,0,0,0,0,0,0]
[null,"Poor Pressure events - services",918.75,918.75,918.75,918.75,918.75,918.75,918.75]
[null,"Poor Pressure event - meters",0,0,0,0,0,0,0]
[null,"Pressure events impacting 5+ customers",0,0,0,0,0,0,0]
[null,"Pressure events with >12 hr resolution",555.75,555.75,555.75,555.75,555.75,555.75,555.75]

{"sheet":"S11. Network reliability","index":21,"n_rows":38,"n_cols":9,"rows_kept":38,"cut":false,"hidden":false,"merged":[]}
[null,{"$f":"INDEX(dms_Worksheet_List,MATCH(dms_Model,dms_Model_List))","v":"REGULATORY REPORTING STATEMENT"}]
[null,{"$f":"dms_TradingNameFull","v":"Jemena Gas Networks (NSW) Ltd"}]
[null,{"$f":"dms_Header_Span","v":"2023-24 to 2029-30"}]
[null,"S11. NETWORK RELIABILITY"]
[null,"FINAL RIN TEMPLATE - FEBRUARY 2024"]
[]
[null,"S11.1 - NETWORK OUTAGES"]
[null,"S11.1.1 - PLANNED"]
[null,null,"NUMBER OF EVENTS"]
[null,null,{"$f":"dms_y1","v":"2023-24"},{"$f":"dms_y2","v":"2024-25"},{"$f":"dms_y3","v":"2025-26"},{"$f":"dms_y4","v":"2026-27"},{"$f":"dms_y5","v":"2027-28"},{"$f":"dms_y6","v":"2028-29"},{"$f":"dms_y7","v":"2029-30"}]
[null,"Count of outage events",25334.75,25334.75,25334.75,25334.75,25334.75,25334.75,25334.75]
[null,"Outages affecting 5+ customers",1,1,1,1,1,1,1]
[null,"Outages with >12 hr supply interruption",0.25,0.25,0.25,0.25,0.25,0.25,0.25]
[]
[null,"S11.1.2 - UNPLANNED"]
[null,null,"NUMBER OF EVENTS"]
[null,null,{"$f":"dms_y1","v":"2023-24"},{"$f":"dms_y2","v":"2024-25"},{"$f":"dms_y3","v":"2025-26"},{"$f":"dms_y4","v":"2026-27"},{"$f":"dms_y5","v":"2027-28"},{"$f":"dms_y6","v":"2028-29"},{"$f":"dms_y7","v":"2029-30"}]
[null,"Count of outage events",5194.75,5194.75,5194.75,5194.75,5194.75,5194.75,5194.75]
[null,"Outages affecting 5+ customers",32.5,32.5,32.5,32.5,32.5,32.5,32.5]
[null,"Outages with >12 hr supply interruption",2465,2465,2465,2465,2465,2465,2465]
[]
[]
[]
[null,"S11.3 - UNACCOUNTED FOR GAS - TRANSMISSION AND DISTRIBUTION"]
[null,null,"VOLUME"]
[null,null,"GJ"]
[null,"Place of loss",{"$f":"dms_y1","v":"2023-24"},{"$f":"dms_y2","v":"2024-25"},{"$f":"dms_y3","v":"2025-26"},{"$f":"dms_y4","v":"2026-27"},{"$f":"dms_y5","v":"2027-28"},{"$f":"dms_y6","v":"2028-29"},{"$f":"dms_y7","v":"2029-30"}]
[null,"Forecast UAG",2752340,2751920,2804270,2807110,2705640,2607520,2532600]
[]
[]
[]
[]
[]
[]
[]
[]
[]
[null,"Total",{"$f":"SUM(C28:C37)","v":2752340},2751920,2804270,2807110,2705640,2607520,2532600]

{"sheet":"F3. Revenue","index":22,"n_rows":202,"n_cols":9,"rows_kept":202,"cut":false,"hidden":false,"merged":[]}
[null,{"$f":"INDEX(dms_Worksheet_List,MATCH(dms_Model,dms_Model_List))","v":"REGULATORY REPORTING STATEMENT"}]
[null,{"$f":"dms_TradingNameFull","v":"Jemena Gas Networks (NSW) Ltd"}]
[null,{"$f":"dms_Header_Span","v":"2023-24 to 2029-30"}]
[null,"F3. REVENUE"]
[null,"FINAL RIN TEMPLATE - FEBRUARY 2024"]
[]
[null,"F3.1 - REFERENCE SERVICES"]
[null,"F3.1.1 -  REVENUE - BY TARIFF"]
[null,null,"REVENUE"]
[null,null,{"$f":"CONCATENATE(\"$, real \",dms_DollarReal)","v":"$, real June 2025"}]
[null,"Tariff",{"$f":"dms_y1","v":"2023-24"},{"$f":"dms_y2","v":"2024-25"},{"$f":"dms_y3","v":"2025-26"},{"$f":"dms_y4","v":"2026-27"},{"$f":"dms_y5","v":"2027-28"},{"$f":"dms_y6","v":"2028-29"},{"$f":"dms_y7","v":"2029-30"}]
[null,{"$f":"IF(ISBLANK('N1. Demand'!B22),\"\",'N1. Demand'!B22)","v":"Volume - Individual metered (VI-Coastal)"},"","","","","","",""]
[null,{"$f":"IF(ISBLANK('N1. Demand'!B23),\"\",'N1. Demand'!B23)","v":"Volume - Individual metered (VI-Country)"},"","","","","","",""]
[null,{"$f":"IF(ISBLANK('N1. Demand'!B24),\"\",'N1. Demand'!B24)","v":"Volume - Boundary metered (VB-Coastal)"},"","","","","","",""]
[null,{"$f":"IF(ISBLANK('N1. Demand'!B25),\"\",'N1. Demand'!B25)","v":"Volume - Boundary metered (VB-Country)"},"","","","","","",""]
[null,{"$f":"IF(ISBLANK('N1. Demand'!B26),\"\",'N1. Demand'!B26)","v":"Volume - Individual metered (VI) small"},390508432.10181338,436834439.65333301,442013035.25762808,446417308.40596735,447511511.36257845,445391914.23260319,437340344.83332151]
[null,{"$f":"IF(ISBLANK('N1. Demand'!B27),\"\",'N1. Demand'!B27)","v":"Volume - Individual metered (VI) large"},69657309.527652934,77920754.774733439,79485071.047417611,80016515.653945044,79882724.226080045,79150345.698303729,77315825.322901309]
[null,{"$f":"IF(ISBLANK('N1. Demand'!B28),\"\",'N1. Demand'!B28)","v":"Volume - Boundary metered (VB)"},7040568.0120874504,7673907.9118353147,7167574.5649128389,7268961.5056801504,7310555.8552347114,7298546.9207240744,7189091.6168526541]
[null,{"$f":"IF(ISBLANK('N1. Demand'!B29),\"\",'N1. Demand'!B29)","v":"Volume - Residential distributed generation technology (VRT3)"},0,0,0,0,0,0,0]
[null,{"$f":"IF(ISBLANK('N1. Demand'!B30),\"\",'N1. Demand'!B30)","v":"Volume - Residential distributed generation technology (VRT4)"}]
[null,{"$f":"IF(ISBLANK('N1. Demand'!B31),\"\",'N1. Demand'!B31)","v":"Volume - Residential distributed generation technology (VRT6)"},0,0,0,0,0,0,0]
[null,{"$f":"IF(ISBLANK('N1. Demand'!B32),\"\",'N1. Demand'!B32)","v":"Volume - Residential distributed generation technology (VRT10)"},0,0,0,0,0,0,0]
[null,{"$f":"IF(ISBLANK('N1. Demand'!B33),\"\",'N1. Demand'!B33)","v":"Demand - Capacity coastal (DC1)"},2751082.7235618425,3421828.8791095894,4166746.5784629979,4246941.3902926836,4372181.8473122623,4411989.1323404172,4495169.5432519969]
[null,{"$f":"IF(ISBLANK('N1. Demand'!B34),\"\",'N1. Demand'!B34)","v":"Demand - Capacity coastal (DC2)"},5695308.6270287409,6917917.3843150679,6063967.0321756303,6178292.6241843021,6294773.6271506492,6413450.6776138274,6534365.1782445395]
[null,{"$f":"IF(ISBLANK('N1. Demand'!B35),\"\",'N1. Demand'!B35)","v":"Demand - Capacity coastal (DC3)"},10641719.626326833,12853947.222939726,11467116.066393282,11691357.096654136,11922661.23208555,12085745.701066578,12313601.496589424]
[null,{"$f":"IF(ISBLANK('N1. Demand'!B36),\"\",'N1. Demand'!B36)","v":"Demand - Capacity coastal (DC4)"},4510247.0402894104,5581171.2775890408,4245618.0060445564,4325661.777623171,4407214.6358316736,4490305.0318838367,4574961.9533917774]
[null,{"$f":"IF(ISBLANK('N1. Demand'!B37),\"\",'N1. Demand'!B37)","v":"Demand - Capacity coastal (DC5)"}]
[null,{"$f":"IF(ISBLANK('N1. Demand'!B38),\"\",'N1. Demand'!B38)","v":"Demand - Capacity coastal (DC6)"},2428953.6252287901,2774383.9739123285,2383658.7314559054,2430186.6885677185,2477236.5200039162,2523940.5225475007,2571525.0481400476]
[null,{"$f":"IF(ISBLANK('N1. Demand'!B39),\"\",'N1. Demand'!B39)","v":"Demand - Capacity coastal (DC7)"},2000212.6505144271,2425414.6269589039,2442751.7474697079,2488805.599375214,2535727.7168658464,2583534.4695848618,2632242.5357967797]
[null,{"$f":"IF(ISBLANK('N1. Demand'!B40),\"\",'N1. Demand'!B40)","v":"Demand - Capacity coastal (DC8)"}]
[null,{"$f":"IF(ISBLANK('N1. Demand'!B41),\"\",'N1. Demand'!B41)","v":"Demand - Capacity coastal (DC9)"}]
[null,{"$f":"IF(ISBLANK('N1. Demand'!B42),\"\",'N1. Demand'!B42)","v":"Demand - Capacity coastal (DC10)"},710916.08160395024,866867.86641095881,676802.77468306897,689562.71837639611,702563.22870027984,715808.8411217354,729304.17661615065]
[null,{"$f":"IF(ISBLANK('N1. Demand'!B43),\"\",'N1. Demand'!B43)","v":"Demand - Capacity coastal (DC11)"},0,0,0,0,0,0,0]
[null,{"$f":"IF(ISBLANK('N1. Demand'!B44),\"\",'N1. Demand'!B44)","v":"Demand - Capacity country (DC Country) - Distance"},3699122.6386431167,4528471.6555150673,4154962.3083507689,4233296.9238187382,4313108.4027393973,4394424.588814348,4477273.8506899374]
[null,{"$f":"IF(ISBLANK('N1. Demand'!B45),\"\",'N1. Demand'!B45)","v":"Demand - Capacity country (DC Country) - Pressure reduction"},260646.55591782497,316626.44592328765,273798.5328789078,278960.52983509121,284219.84730024682,289578.32008395466,295037.81758795033]
[null,{"$f":"IF(ISBLANK('N1. Demand'!B46),\"\",'N1. Demand'!B46)","v":"Demand - Capacity - First response (DCFR1)"}]
[null,{"$f":"IF(ISBLANK('N1. Demand'!B47),\"\",'N1. Demand'!B47)","v":"Demand - Capacity - First response (DCFR6)"}]
[null,{"$f":"IF(ISBLANK('N1. Demand'!B48),\"\",'N1. Demand'!B48)","v":"Demand - Throughput (DT)"},1144108.161922018,1204821.0520000001,1308298.59389503,1332964.2971347619,1358095.0294734698,1383699.5582291086,1409786.8160122244]
[null,{"$f":"IF(ISBLANK('N1. Demand'!B49),\"\",'N1. Demand'!B49)","v":"Demand - Major end-user (throughput) (DMT1)"}]
[null,{"$f":"IF(ISBLANK('N1. Demand'!B50),\"\",'N1. Demand'!B50)","v":"Demand - Major end-user (throughput) (DMT2)"}]
[null,{"$f":"IF(ISBLANK('N1. Demand'!B51),\"\",'N1. Demand'!B51)","v":"Demand - Major end-user (throughput) (DMT3)"},0,0,0,0,0,0,0]
[null,{"$f":"IF(ISBLANK('N1. Demand'!B52),\"\",'N1. Demand'!B52)","v":"Demand - Major end-user (throughput) (DMT4)"},0,0,0,0,0,0,0]
[null,{"$f":"IF(ISBLANK('N1. Demand'!B53),\"\",'N1. Demand'!B53)","v":"Demand - Major end-user (throughput) (DMT5)"},0,0,0,0,0,0,0]
[null,{"$f":"IF(ISBLANK('N1. Demand'!B54),\"\",'N1. Demand'!B54)","v":"Demand - Major end-user (throughput) - First response (DMTFR3)"}]
[null,{"$f":"IF(ISBLANK('N1. Demand'!B55),\"\",'N1. Demand'!B55)","v":"Prudent discounts"}]
[null,{"$f":"IF(ISBLANK('N1. Demand'!B56),\"\",'N1. Demand'!B56)","v":""},"","","","","","",""]
[null,{"$f":"IF(ISBLANK('N1. Demand'!B57),\"\",'N1. Demand'!B57)","v":""},"","","","","","",""]
[null,{"$f":"IF(ISBLANK('N1. Demand'!B58),\"\",'N1. Demand'!B58)","v":""},"","","","","","",""]
[null,{"$f":"IF(ISBLANK('N1. Demand'!B59),\"\",'N1. Demand'!B59)","v":""},"","","","","","",""]
[null,{"$f":"IF(ISBLANK('N1. Demand'!B60),\"\",'N1. Demand'!B60)","v":""},"","","","","","",""]
[null,{"$f":"IF(ISBLANK('N1. Demand'!B61),\"\",'N1. Demand'!B61)","v":""},"","","","","","",""]
[null,{"$f":"IF(ISBLANK('N1. Demand'!B62),\"\",'N1. Demand'!B62)","v":""},"","","","","","",""]
[null,{"$f":"IF(ISBLANK('N1. Demand'!B63),\"\",'N1. Demand'!B63)","v":""},"","","","","","",""]
[null,{"$f":"IF(ISBLANK('N1. Demand'!B64),\"\",'N1. Demand'!B64)","v":""},"","","","","","",""]
[null,{"$f":"IF(ISBLANK('N1. Demand'!B65),\"\",'N1. Demand'!B65)","v":""},"","","","","","",""]
[null,{"$f":"IF(ISBLANK('N1. Demand'!B66),\"\",'N1. Demand'!B66)","v":""},"","","","","","",""]
[null,{"$f":"IF(ISBLANK('N1. Demand'!B67),\"\",'N1. Demand'!B67)","v":""},"","","","","","",""]
[null,{"$f":"IF(ISBLANK('N1. Demand'!B68),\"\",'N1. Demand'!B68)","v":""},"","","","","","",""]
[null,{"$f":"IF(ISBLANK('N1. Demand'!B69),\"\",'N1. Demand'!B69)","v":""},"","","","","","",""]
[null,{"$f":"IF(ISBLANK('N1. Demand'!B70),\"\",'N1. Demand'!B70)","v":""},"","","","","","",""]
[null,{"$f":"IF(ISBLANK('N1. Demand'!B71),\"\",'N1. Demand'!B71)","v":""},"","","","","","",""]
[null,{"$f":"IF(ISBLANK('N1. Demand'!B72),\"\",'N1. Demand'!B72)","v":""},"","","","","","",""]
[null,{"$f":"IF(ISBLANK('N1. Demand'!B73),\"\",'N1. Demand'!B73)","v":""},"","","","","","",""]
[null,{"$f":"IF(ISBLANK('N1. Demand'!B74),\"\",'N1. Demand'!B74)","v":""},"","","","","","",""]
[null,{"$f":"IF(ISBLANK('N1. Demand'!B75),\"\",'N1. Demand'!B75)","v":""},"","","","","","",""]
[null,{"$f":"IF(ISBLANK('N1. Demand'!B76),\"\",'N1. Demand'!B76)","v":""},"","","","","","",""]
[null,{"$f":"IF(ISBLANK('N1. Demand'!B77),\"\",'N1. Demand'!B77)","v":""},"","","","","","",""]
[null,{"$f":"IF(ISBLANK('N1. Demand'!B78),\"\",'N1. Demand'!B78)","v":""},"","","","","","",""]
[null,{"$f":"IF(ISBLANK('N1. Demand'!B79),\"\",'N1. Demand'!B79)","v":""},"","","","","","",""]
[null,{"$f":"IF(ISBLANK('N1. Demand'!B80),\"\",'N1. Demand'!B80)","v":""},"","","","","","",""]
[null,{"$f":"IF(ISBLANK('N1. Demand'!B81),\"\",'N1. Demand'!B81)","v":""},"","","","","","",""]
[null,{"$f":"IF(ISBLANK('N1. Demand'!B82),\"\",'N1. Demand'!B82)","v":""},"","","","","","",""]
[null,{"$f":"IF(ISBLANK('N1. Demand'!B83),\"\",'N1. Demand'!B83)","v":""},"","","","","","",""]
[null,{"$f":"IF(ISBLANK('N1. Demand'!B84),\"\",'N1. Demand'!B84)","v":""},"","","","","","",""]
[null,{"$f":"IF(ISBLANK('N1. Demand'!B85),\"\",'N1. Demand'!B85)","v":""},"","","","","","",""]
[null,{"$f":"IF(ISBLANK('N1. Demand'!B86),\"\",'N1. Demand'!B86)","v":""},"","","","","","",""]
[null,{"$f":"IF(ISBLANK('N1. Demand'!B87),\"\",'N1. Demand'!B87)","v":""},"","","","","","",""]
[null,{"$f":"IF(ISBLANK('N1. Demand'!B88),\"\",'N1. Demand'!B88)","v":""},"","","","","","",""]
[null,{"$f":"IF(ISBLANK('N1. Demand'!B89),\"\",'N1. Demand'!B89)","v":""},"","","","","","",""]
[null,{"$f":"IF(ISBLANK('N1. Demand'!B90),\"\",'N1. Demand'!B90)","v":""},"","","","","","",""]
[null,{"$f":"IF(ISBLANK('N1. Demand'!B91),\"\",'N1. Demand'!B91)","v":""},"","","","","","",""]
[null,{"$f":"IF(ISBLANK('N1. Demand'!B92),\"\",'N1. Demand'!B92)","v":""},"","","","","","",""]
[null,{"$f":"IF(ISBLANK('N1. Demand'!B93),\"\",'N1. Demand'!B93)","v":""},"","","","","","",""]
[null,{"$f":"IF(ISBLANK('N1. Demand'!B94),\"\",'N1. Demand'!B94)","v":""},"","","","","","",""]
[null,{"$f":"IF(ISBLANK('N1. Demand'!B95),\"\",'N1. Demand'!B95)","v":""},"","","","","","",""]
[null,{"$f":"IF(ISBLANK('N1. Demand'!B96),\"\",'N1. Demand'!B96)","v":""},"","","","","","",""]
[null,"Total",{"$f":"SUM(C12:C86)","v":501048627.37259072},563320552.72457576,565849401.24176848,571598815.21145475,573372573.53135657,571133283.6949172,561878530.18939638]
[]
[null,"F3.1.2 - STAND ALONE COST PER UNIT - BY TARIFF CLASS"]
[null,null,"STAND ALONE COST PER UNIT"]
[null,null,{"$f":"CONCATENATE(\"$, real \",dms_DollarReal)","v":"$, real June 2025"}]
[null,"Tariff Class",{"$f":"dms_y1","v":"2023-24"},{"$f":"dms_y2","v":"2024-25"},{"$f":"dms_y3","v":"2025-26"},{"$f":"dms_y4","v":"2026-27"},{"$f":"dms_y5","v":"2027-28"},{"$f":"dms_y6","v":"2028-29"},{"$f":"dms_y7","v":"2029-30"}]
[null,"Volume - Individual metered (VI) small",1872796356.1103139,1730966630.7007225,1721524163.2868831,1708886553.9443555,1698564720.9182422,1689202553.7522454,1679235426.1894934]
[null,"Volume - Individual metered (VI) large",1665309078.5339313,1531399607.6032796,1516553088.579772,1500080442.8829186,1486732473.1703882,1474256707.6662593,1461725241.4831398]
[null,"Volume - Boundary metered (VB)",335361760.75813687,322786280.81565809,323971892.16924471,325356280.71232921,326904675.58626133,324275941.8595885,320841521.16769308]
[null,"Volume - Residential distributed generation technology (VRT3)",197855283.76647273,198763770.82071745,201582974.10686859,204808254.7743811,207900942.26372731,206286498.84079331,203808505.80376276]
[null,"Volume - Residential distributed generation technology (VRT4)",197343655.45531607,198300119.45441252,201125909.79569942,204358251.15183207,207456685.87596914,205846151.59702,203371869.91666177]
[null,"Volume - Residential distributed generation technology (VRT6)",161753845.44127813,166350673.55550092,169676272.27797347,173444360.07566103,176978879.82685512,175664961.08954525,173472287.37088916]
[null,"Volume - Residential distributed generation technology (VRT10)",161753845.44127813,166350673.55550092,169676272.27797347,173444360.07566103,176978879.82685512,175664961.08954525,173472287.37088916]
[null,"Demand - Capacity country (DC Country)",340225386.36652696,328251639.94638652,329286417.49983537,330565128.70071256,332054206.69269776,329363280.49822634,325884739.16743356]
[null,"Demand - Capacity coastal (DC1)",336915414.25485533,323991897.86647475,324895904.365385,326033643.79493934,327407522.61720198,324638576.61415249,321086469.15204364]
[null,"Demand - Capacity coastal (DC2)",349632736.74674541,335578585.30982959,336321695.4886812,337274795.15979958,338491492.30786228,335620764.54140985,331979749.41756481]
[null,"Demand - Capacity coastal (DC3)",362798298.01416975,347704421.30965286,348285965.75111771,349025442.68452972,350045371.86482716,347057846.48299289,343331601.27619815]
[null,"Demand - Capacity coastal (DC4)",343987671.06828481,330300911.7137754,331110096.92804337,332167623.70882696,333488336.21313941,330674199.3398574,327065592.83879292]
[null,"Demand - Capacity coastal (DC5)",338548346.81022316,325307283.91147184,326183481.11232579,327325346.20533293,328721786.09107196,325953887.01467055,322381242.90773797]
[null,"Demand - Capacity coastal (DC6)",302334955.37626946,292831436.13725168,294194437.73581505,295801483.98648113,297544526.76681399,295036239.40139776,291745999.58407569]
[null,"Demand - Capacity coastal (DC7)",302709429.50530875,292982056.40182674,294332877.62306064,295966745.63226986,297754186.8119961,295259295.35169059,291956472.12533128]
[null,"Demand - Capacity coastal (DC8)",298372059.93401545,288973397.98369545,290376809.476623,292083081.81041121,293938530.9424206,291483141.52780634,288207649.41436744]
[null,"Demand - Capacity coastal (DC9)",293739666.34262305,284882732.59432244,286349635.71657532,288100568.4786883,289979130.55917317,287549320.37954807,284312957.75917751]
[null,"Demand - Capacity coastal (DC10)",296047294.4862836,286881550.22826535,288315293.35834152,290050538.19202012,291927566.99219728,289488347.2471323,286230452.77987331]
[null,"Demand - Capacity coastal (DC11)",292203578.39213341,283373392.47081363,284855512.37165493,286647568.44208777,288573644.75361186,286165697.80516744,282934349.40048641]
[null,"Demand - Throughput (DT)",162388493.82301778,166978800.09212714,170298288.45174757,174048618.06105936,177562340.42060941,176238998.53534225,174044489.92775592]
["Row inserted","Demand - Major end-user (throughput) (DMT1)",335659887.27158988,322749272.9212079,323665367.43084723,324838237.53542173,326253259.42879349,323502955.05413258,319954477.51672906]
["Row inserted","Demand - Major end-user (throughput) (DMT2)",347844022.25811547,333808250.60021597,334568580.92413098,335571726.49060619,336847034.57712102,334002863.00359917,330367018.93985605]
["Row inserted","Demand - Major end-user (throughput) (DMT3)",357858110.11806059,342815000.7802971,343444109.5270344,344321819.80491799,345503640.10509831,342589466.42052203,338877504.36177105]
["Row inserted","Demand - Major end-user (throughput) (DMT4)",161753845.44127813,166350673.55550092,169676272.27797347,173444360.07566103,176978879.82685512,175664961.08954525,173472287.37088916]
["Row inserted","Demand - Major end-user (throughput) (DMT5)",161753845.44127813,166350673.55550092,169676272.27797347,173444360.07566103,176978879.82685512,175664961.08954525,173472287.37088916]
["Row inserted","Demand - Capacity - First response (DCFR1)",334970920.93858957,322067387.31005841,322990115.79812121,324182265.84422696,325619867.32096714,322879793.59246296,319333308.18120098]
["Row inserted","Demand - Capacity - First response (DCFR6)",309819489.65894008,300239048.30400336,301529981.02766269,302927577.74357295,304425325.00660354,301805896.01379657,298494014.53885537]
["Row inserted","Demand - Major end-user (throughput) - First response (DMTFR3)",358134331.96458471,343217763.39895755,343849241.83488274,344697244.33429116,345836634.7963047,342907189.17342776,339201188.31271034]
[]
[null,"F3.1.3 -  AVOIDABLE COST PER UNIT - BY TARIFF CLASS"]
[null,null,"AVOIDABLE COST PER UNIT"]
[null,null,{"$f":"CONCATENATE(\"$, real \",dms_DollarReal)","v":"$, real June 2025"}]
[null,"Tariff Class",{"$f":"dms_y1","v":"2023-24"},{"$f":"dms_y2","v":"2024-25"},{"$f":"dms_y3","v":"2025-26"},{"$f":"dms_y4","v":"2026-27"},{"$f":"dms_y5","v":"2027-28"},{"$f":"dms_y6","v":"2028-29"},{"$f":"dms_y7","v":"2029-30"}]
[null,{"$f":"IF(ISBLANK(B93),\"\",B93)","v":"Volume - Individual metered (VI) small"},129746453.76104631,129488201.27700916,132696064.31303643,134503874.09857184,135383085.08981383,136885957.55819139,138574995.68864599]
[null,{"$f":"IF(ISBLANK(B94),\"\",B94)","v":"Volume - Individual metered (VI) large"},50380273.483513132,48820419.994121656,48770110.255994864,48228461.547278799,47429646.469317384,47128267.666351862,47130876.386997998]
[null,"Volume - Boundary metered (VB)",633635.99249401619,703755.05420939159,784047.43306385924,839891.88980360201,850454.06332055468,877473.96915979346,917057.85571819753]
[null,"Volume - Residential distributed generation technology (VRT3)",0,0,0,0,0,0,0]
[null,"Volume - Residential distributed generation technology (VRT4)",0,0,0,0,0,0,0]
[null,"Volume - Residential distributed generation technology (VRT6)",0,0,0,0,0,0,0]
[null,"Volume - Residential distributed generation technology (VRT10)",0,0,0,0,0,0,0]
[null,"Demand - Capacity country (DC Country)",740267.17014638137,715512.63861055428,696370.68888257327,642015.40004778909,578623.82467440923,549763.7524438072,543832.56928303279]
[null,"Demand - Capacity coastal (DC1)",728785.86824971682,704951.61790300987,685564.83012181497,630149.30135087983,565443.25845333515,536025.27275951777,530070.58613123943]
[null,"Demand - Capacity coastal (DC2)",1058972.4059702193,1024103.349787558,997537.16893135954,922251.62096509582,834482.60372564872,794507.47444865084,786254.13889072591]
[null,"Demand - Capacity coastal (DC3)",1887789.7721651185,1825913.9447068761,1776824.489315795,1636956.3308240934,1473734.5107051916,1399477.7001166756,1384335.2339174827]
[null,"Demand - Capacity coastal (DC4)",371930.46594112122,359477.08965386113,351621.97406333894,329993.92200365028,304914.9872046471,293422.19952253363,290891.11733979877]
[null,"Demand - Capacity coastal (DC5)",12644.6907582686,12237.262727875472,11855.540522187008,10746.163714322012,9446.9239796259117,8858.2478388107847,8743.619973561912]
[null,"Demand - Capacity coastal (DC6)",1111918.649945454,1075815.8380246351,1044186.9014975185,952957.25457171025,846258.58263227611,797839.4750797631,788242.35778695275]
[null,"Demand - Capacity coastal (DC7)",382473.28453019285,369878.02434039966,360030.50800910033,332026.39526913798,299357.94153641199,284489.65715372394,281444.28929009172]
[null,"Demand - Capacity coastal (DC8)",40408.677865860598,39056.191653097136,38211.725611375667,35890.634559801227,33200.089315587851,31966.64276598343,31693.958956911076]
[null,"Demand - Capacity coastal (DC9)",448074.35365670826,433636.82767287595,420110.20738139708,380798.585954768,334759.02551803802,313898.83317712386,309836.9065065289]
[null,"Demand - Capacity coastal (DC10)",125486.93198094255,121307.66418655519,118428.00051006611,110385.2801341119,101034.19630341504,96762.045470687095,95850.502186277139]
[null,"Demand - Capacity coastal (DC11)",0,0,0,0,0,0,0]
[null,"Demand - Throughput (DT)",202408.05364466336,195886.20853127254,189775.84567911454,172017.65730336102,151220.26565930826,141797.11770201047,139962.22877178533]
["Row inserted","Demand - Major end-user (throughput) (DMT1)",328365.99412757531,317433.7817794779,310135.0047273275,289850.15097656578,266287.17918823753,255510.82188298009,253186.05995996424]
["Row inserted","Demand - Major end-user (throughput) (DMT2)",488548.66353990661,472059.38637365855,462713.35058072949,437473.6979712926,408315.61918400845,394896.6828375191,391814.40738158219]
["Row inserted","Demand - Major end-user (throughput) (DMT3)",312204.37959830317,301095.91889356606,299570.76877486525,297935.95475475496,296605.25451879262,295700.14118822687,294840.82303274045]
["Row inserted","Demand - Major end-user (throughput) (DMT4)",0,0,0,0,0,0,0]
["Row inserted","Demand - Major end-user (throughput) (DMT5)",0,0,0,0,0,0,0]
["Row inserted","Demand - Capacity - First response (DCFR1)",108612.97894603897,104761.48844871651,104096.68982003475,103091.7776005741,102108.38918057973,101562.67803208661,101230.04225069197]
["Row inserted","Demand - Capacity - First response (DCFR6)",3499227.0718226871,3386202.1439829529,3282504.3325518202,2981825.1508701281,2629830.9616283602,2470270.2266851449,2439031.4517731881]
["Row inserted","Demand - Major end-user (throughput) - First response (DMTFR3)",894552.11834276596,864679.67228351184,845574.41146373563,792847.55511326855,731680.72791686887,703664.297590881,697525.82477665879]
[]
[]
[null,"F3.2 - ANCILLARY REFERENCE SERVICES"]
[null,null,"REVENUE"]
[null,null,{"$f":"CONCATENATE(\"$, real \",dms_DollarReal)","v":"$, real June 2025"}]
[null,"Service Name",{"$f":"dms_y1","v":"2023-24"},{"$f":"dms_y2","v":"2024-25"},{"$f":"dms_y3","v":"2025-26"},{"$f":"dms_y4","v":"2026-27"},{"$f":"dms_y5","v":"2027-28"},{"$f":"dms_y6","v":"2028-29"},{"$f":"dms_y7","v":"2029-30"}]
[null,"Hourly charge – non-standard retailer-initiated requests and queries",13480.848310875939,15240.424776023439,13787.457108994084,13779.986778710656,13748.786467688071,13708.609586270755,13673.105962413665]
[null,"Disconnection – Volume Customers – Completed",2340782.9074128368,2668509.3807454943,1569250.2042079302,1736732.7172479418,2016640.0810672713,2628602.689759667,3821499.3186835931]
[null,"Disconnection – Volume Customers – Wasted Visit",1176289.8832504298,1344261.0588464721,658557.66281559342,692401.82625580777,719364.38734988798,827347.24481651315,962247.1877391641]
[null,"Reconnection – Volume Customers – Completed",950196.41980785527,1049580.3794996841,1021683.8065356511,991417.81708123151,967524.04688076035,939806.08521090704,883419.82967212878]
[null,"Reconnection – Volume Customers – Wasted Visit",138646.5952136855,153347.8264619296,182620.03340053477,177210.16395784682,172939.29161538451,167984.86730762609,157906.1523432195]
[null,"Expedited reconnection",1672450.1704773526,1843855.9576836515,1002475.1033569748,972778.1455384877,949333.60271801858,922136.76714904746,866810.63103182847]
[null,"Abolishment – Up to 25m3/hr – Completed",5622436.7810047595,6853575.6041924814,8807329.6165785585,11998724.533513326,12743165.771167947,15032721.51088063,19413116.233330805]
[null,"Special meter read – Completed",7335281.0038585756,8402847.8891917262,8631601.38549456,8715547.6009349544,8760928.8494592868,8758901.055064138,8664508.5882465523]
[null,"Special meter read – Wasted Visit",429175.66409150074,491637.31030981697,505021.31477227435,509932.87477122294,512588.05968676828,512469.41665104526,506946.6630427838]
[null,"Total",{"$f":"SUM(C160:C168)","v":19678740.27342787},22822855.83170728,{"$f":"SUM(E160:E168)","v":22392326.58427107},{"$f":"SUM(F160:F168)","v":25808525.666079529},26856232.876413014,29803678.246425845,35290127.71005249]
[]
[]
[null,"F3.3 - REBATEABLE SERVICES"]
[null,null,"REVENUE"]
[null,null,{"$f":"CONCATENATE(\"$, real \",dms_DollarReal)","v":"$, real June 2025"}]
[null,"Service Name",{"$f":"dms_y1","v":"2023-24"},{"$f":"dms_y2","v":"2024-25"},{"$f":"dms_y3","v":"2025-26"},{"$f":"dms_y4","v":"2026-27"},{"$f":"dms_y5","v":"2027-28"},{"$f":"dms_y6","v":"2028-29"},{"$f":"dms_y7","v":"2029-30"}]
[null,"None","","","","","","",""]
[null,"","","","","","","",""]
[null,"","","","","","","",""]
[null,"","","","","","","",""]
[null,"","","","","","","",""]
[null,"","","","","","","",""]
[null,"Total",{"$f":"SUM(C176:C181)","v":0},{"$f":"SUM(D176:D181)","v":0},0,0,0,0,0]
[]
[]
[null,"F3.4 - NON-REFERENCE SERVICES"]
[null,null,"REVENUE"]
[null,null,{"$f":"CONCATENATE(\"$, real \",dms_DollarReal)","v":"$, real June 2025"}]
[null,"Service Name",{"$f":"dms_y1","v":"2023-24"},{"$f":"dms_y2","v":"2024-25"},{"$f":"dms_y3","v":"2025-26"},{"$f":"dms_y4","v":"2026-27"},{"$f":"dms_y5","v":"2027-28"},{"$f":"dms_y6","v":"2028-29"},{"$f":"dms_y7","v":"2029-30"}]
[]
[null,"","","","","","","",""]
[null,"","","","","","","",""]
[null,"","","","","","","",""]
[null,"","","","","","","",""]
[null,"","","","","","","",""]
[null,"Total"]
[]
[]
[null,"F3.5 - TOTAL REVENUE"]
[null,null,"REVENUE"]
[null,null,{"$f":"CONCATENATE(\"$, real \",dms_DollarReal)","v":"$, real June 2025"}]
[null,null,{"$f":"dms_y1","v":"2023-24"},{"$f":"dms_y2","v":"2024-25"},{"$f":"dms_y3","v":"2025-26"},{"$f":"dms_y4","v":"2026-27"},{"$f":"dms_y5","v":"2027-28"},{"$f":"dms_y6","v":"2028-29"},{"$f":"dms_y7","v":"2029-30"}]
[null,"Total",{"$f":"SUM(C195,C182,C169,C87)","v":520727367.64601856},586143408.556283,588241727.82603955,597407340.87753427,600228806.40776956,600936961.94134307,597168657.89944887]

{"sheet":"Additional disclosures","index":23,"n_rows":21,"n_cols":4,"rows_kept":21,"cut":false,"hidden":false,"merged":[]}
[]
[null,"N1.2 - DEMAND - BY TARIFF (previous tariff classes) - Additional disclosure"]
[null,null,"VOLUME"]
[null,null,"GJ"]
[null,"Tariff","2023-24","2024-25"]
[null,"Volume - Individual metered (VI-Coastal)",36148880.46705652,35949483.850625277]
[null,"Volume - Individual metered (VI-Country)",4071872.7660185071,4049487.9481268702]
[null,"Volume - Boundary metered (VB-Coastal)",709731.79450086493,709362.57285102841]
[null,"Volume - Boundary metered (VB-Country)",328.84199999999998,328.84199999999998]
[null,"Total",40930813.869575895,40708663.213603176]
[]
[null,"F3.1 - REFERENCE SERVICES - Additional disclosure"]
[null,"F3.1.1 -  REVENUE - BY TARIFF (previous tariff classes)"]
[null,null,"REVENUE"]
[null,null,"$, real June 2025"]
[null,"Tariff","2023-24","2024-25"]
[null,"Volume - Individual metered (VI-Coastal)",424177709.41333026,473921029.71017766]
[null,"Volume - Individual metered (VI-Country)",35988032.216136023,40834164.717888772]
[null,"Volume - Boundary metered (VB-Coastal)",7034530.2498442233,7667322.2146813143]
[null,"Volume - Boundary metered (VB-Country)",6037.7622432270646,6585.6971539999995]
[null,"Total",467206309.6415537,522429102.33990175]

{"sheet":"AER CF","index":24,"n_rows":50,"n_cols":25,"rows_kept":50,"cut":false,"hidden":true,"merged":[[15,38,15,59],[15,69,15,90],[3,1,3,22],[13,38,13,59],[13,69,13,90],[14,38,14,59],[14,69,14,90]]}
[null,"AER CONDITIONAL FORMATTING"]
[]
[null,"CELLS FLAGED \"Y\" and greyed out will be greyed out in the worksheets."]
[null,"CONDITIONAL FORMATTING MAP"]
[null,null,null,null,null,"=INDEX(dms_CF_3.6.1, MATCH(dms_TradingName,dms_CF_TradingName))=\"Y\"","=INDEX(dms_CF_3.6.5, MATCH(dms_TradingName,dms_CF_TradingName))=\"Y\"","=INDEX(dms_CF_3.6.6.1, MATCH(dms_TradingName,dms_CF_TradingName))=\"Y\"","=INDEX(dms_CF_3.6.6.2, MATCH(dms_TradingName,dms_CF_TradingName))=\"Y\"","=INDEX(dms_CF_3.6.6.3, MATCH(dms_TradingName,dms_CF_TradingName))=\"Y\"","=INDEX(dms_CF_3.6.7.1, MATCH(dms_TradingName,dms_CF_TradingName))=\"Y\"","=INDEX(dms_CF_3.6.7.2, MATCH(dms_TradingName,dms_CF_TradingName))=\"Y\"","=INDEX(dms_CF_3.6.7.3, MATCH(dms_TradingName,dms_CF_TradingName))=\"Y\"","=INDEX(dms_CF_3.6.7.4, MATCH(dms_TradingName,dms_CF_TradingName))=\"Y\"","=INDEX(dms_CF_3.6.8, MATCH(dms_TradingName,dms_CF_TradingName))=\"Y\"","=INDEX(dms_CF_4.1, MATCH(dms_TradingName,dms_CF_TradingName))=\"Y\"","=INDEX(dms_CF_6.8, MATCH(dms_TradingName,dms_CF_TradingName))=\"Y\"","=INDEX(dms_CF_7.12, MATCH(dms_TradingName,dms_CF_TradingName))=\"Y\"","=INDEX(dms_CF_8.1_A, MATCH(dms_TradingName,dms_CF_TradingName))=\"Y\"","=INDEX(dms_CF_8.1_B, MATCH(dms_TradingName,dms_CF_TradingName))=\"Y\"",{"$f":"INDEX(dms_CF_8.1_Neg, MATCH(dms_TradingName,dms_CF_TradingName))=\"Y\"","v":false},"=INDEX(dms_CF_4.4.1_Neg, MATCH(dms_TradingName,dms_CF_TradingName))=\"Y\"",null,null,"=INDEX(dms_CF_F10, MATCH(dms_TradingName,dms_CF_TradingName))=\"Y\""]
[null,"dms_CF_TradingName","JurisdictionList","Sector","Segment","dms_CF_3.6.1","dms_CF_3.6.5","dms_CF_3.6.6.1","dms_CF_3.6.6.2","dms_CF_3.6.6.3","dms_CF_3.6.7.1","dms_CF_3.6.7.2","dms_CF_3.6.7.3","dms_CF_3.6.7.4","dms_CF_3.6.8","dms_CF_4.1","dms_CF_6.8 (set from dms_MAIFI_flag)","dms_CF_7.12","dms_CF_8.1_A  (and 8.4)","dms_CF_8.1_B  (and 8.4)","dms_CF_8.1_Neg  (and 8.4)","dms_CF_4.4.1","dms_CF_MAIFI_flag (set from dms_MAIFI_flag)","9.5 TUOS (set from Jurisdiction)","dms_CF_F10"]
[null,"Amadeus","NT","Gas","Transmission","-","-","-","-","-","-","-","-","-","-","-","-","-","-","-","-","-","-","-","-"]
[null,"APA GasNet","Vic","Gas","Transmission","-","-","-","-","-","-","-","-","-","-","-","-","-","-","-","-","-","-","-","-"]
[]
[]
[]
[null,"Confidential"]
[null,"Amended"]
[]
[null,"Worksheet 6.2 STPIS reliability"]
[null,"Formula",null,null,null,"Applied to:"]
[]
[null,"=INDEX(dms_CBD_flag,MATCH(dms_TradingName,dms_TradingName_List))=\"NO\"",null,null,null,"$D$11,$D$17,$D$23,$D$33,$D$39,$D$45,$D$55,$D$61,$D$67,$D$77,$D$83,$D$89"]
[null,"=INDEX(dms_Urban_flag,MATCH(dms_TradingName,dms_TradingName_List))=\"NO\"",null,null,null,"$D$12,$D$18,$D$24,$D$56,$D$62,$D$78,$D$68,$D$84"]
[null,"=INDEX(dms_ShortRural_flag,MATCH(dms_TradingName,dms_TradingName_List))=\"NO\"",null,null,null,"$D$13,$D$19,$D$25,$D$57,$D$63,$D$69,$D$79,$D$85"]
[null,"=INDEX(dms_LongRural_flag,MATCH(dms_TradingName,dms_TradingName_List))=\"NO\"",null,null,null,"$D$14,$D$20,$D$26,$D$58,$D$64,$D$65,$D$70,$D$71,$D$80,$D$86"]
[null,"=INDEX(dms_FeederType_5_flag,MATCH(dms_TradingName,dms_TradingName_List))=\"NO\"",null,null,null,"$D$87,$D$81,$D$71,$D$65,$D$59,$D$49,$D$43,$D$37,$D$21,$D$15"]
[null,"=dms_MAIFI_Flag=\"No\"",null,null,null,"$D$55:$D$72"]
[]
[]
[null,"Business & other details"]
[null,"=(INDEX(dms_Model_Span,MATCH(dms_Model,dms_Model_List))>1)"]
[null,"=(INDEX(dms_Model_Span,MATCH(dms_Model,dms_Model_List))=1)"]
[]
[]
[null,"STYLES IN USE"]
[null,"HEADING ONE","dms_1"]
[null,"HEADING TWO","dms_2"]
[null,"HEADING THREE","dms_3"]
[null,"HEADING FOUR","dms_4"]
[null,"HEADING FIVE","dms_5"]
[null,5.1109999999999998,"dms_NUM"]
[null,5.45E-2,"dms_NUM%"]
[null,5.5555000000000003,"dms_NUM3d"]
[null,"Text description","dms_Row_Locked"]
[null,"Text description","dms_Row1"]
[null,"Text description","dms_Row2"]
[null,"Total","dms_T1"]
[null,"Total","dms_T2"]
[null,"EXPENSES","dms_BH"]
[null,2019,"dms_BY1"]
[null,2019,"dms_BY2"]
[null,"VOLUMES","dms_GH"]
[null,2019,"dms_GY1"]
[null,2019,"dms_GY2"]

{"sheet":"AER NRs","index":25,"n_rows":232,"n_cols":22,"rows_kept":232,"cut":false,"hidden":true,"merged":[[195,1,196,1],[199,1,200,1],[208,1,213,1],[135,1,150,1],[152,1,158,1],[160,1,174,1],[176,1,177,1],[179,1,184,1],[191,1,192,1],[65,1,78,1],[84,1,97,1],[100,1,107,1],[110,1,115,1],[118,1,132,1],[4,1,28,1],[32,1,55,1],[33,10,35,10],[33,36,33,57],[33,67,33,88],[34,36,34,57],[34,67,34,88],[35,36,35,57],[35,67,35,88],[36,10,40,10],[44,10,45,10]]}
[null,"AER NAMED RANGES"]
[null,null,null,null,null,null,null,null,null,null,null,null,null,null,null,null,null,null,null,null,null,{"$f":"dms_TradingNameFull","v":"Jemena Gas Networks (NSW) Ltd"}]
[null,"DROP DOWN SELECTORS USED IN WORKBOOKS"]
[]
[null,"COVER SHEET","dms_DataQuality_List","dms_Confid_status_List"]
[null,null,"-- select --","-- select --"]
[null,null,"Actual","Public"]
[null,null,"Estimate","Confidential"]
[null,null,"Consolidated"]
[]
[]
[null,null,"For all files either AER or business needs to be able to specify the type of submission","For PTRM & RFM templates we must provide a choice in case they change their form of control - otherwise it is drawn from the business specific lookup table above."]
[null,null,"dms_SourceList","dms_FormControl_Choices"]
[null,null,"-- select --","Revenue cap"]
[null,null,"After appeal","Revenue yield"]
[null,null,"Draft decision","Tariff cap"]
[null,null,"Final decision","Weighted average price cap"]
[null,null,"PTRM update 1"]
[null,null,"PTRM update 2"]
[null,null,"PTRM update 3"]
[null,null,"PTRM update 4"]
[null,null,"PTRM update 5"]
[null,null,"PTRM update 6"]
[null,null,"PTRM update 7"]
[null,null,"Reallocated"]
[null,null,"Recast"]
[null,null,"Regulatory proposal"]
[null,null,"Reporting"]
[null,null,"Revised regulatory proposal"]
[]
[]
[null,null,null,null,null,null,null,null,null,null,"This is used to create an image to insert on 6.3 STPIS sheet - not for dropdown lists.",null,null,"GAS"]
[null,"CA & RESET RINS \nDNSP","dms_DNSP_020301_SubstationType","dms_DNSP_020301_ProjectType","dms_DNSP_020301_ProjectTrigger","dms_DNSP_020302_ProjectType","dms_DNSP_020302_ProjectTrigger","dms_STPIS_Exclusion_List","dms_Reason_Interruption","dms_Reason_Interruption_Detailed","Reason for interruption",null,null,"dms_N0205_AssetType"]
[null,null,"Subtransmission substation","New substation establishment","Demand growth","New line on new route - single circuit","Demand growth","Weather","Animal","Animal impact","Animal","Animal impact",null,"Cast Iron"]
[null,null,"Zone substation","Substation upgrade - capacity"," Voltage issues","New line on new route - dual circuit"," Voltage issues","Equipment failure","Asset failure","Animal nesting/burrowing, etc and other",null,"Animal nesting/burrowing, etc and other",null,"PVC"]
[null,null,"Switching station","Substation upgrade - voltage"," Reactive power issue","New line on new route - other"," Reactive power issue","Operational error","Other","Other",null,"Other",null,"Polyamide"]
[null,null,"Other","Other"," Fault level issues","Line rebuild over existing route - single circuit"," Fault level issues","Vegetation","Overloads","LV","Asset failure","LV",null,"High density polyethylene (80)"]
[null,null,null,null," Safety","Line rebuild over existing route - dual circuit"," Net market benefit","Animals","Planned","Distribution substation",null,"Distribution substation",null,"High density polyethylene (100)"]
[null,null,null,null," Environment","Reconductor - Single circuit"," Safety","Third party impacts","Network business","HV",null,"HV",null,"High density polyethylene (250)"]
[null,null,null,null," Other","Reconductor - Dual circuit"," Environment","Transmission failure","Third party","Zone substation",null,"Zone substation",null,"High density polyethylene (575)"]
[null,null,null,null,null,"Reconductor - Other"," Other","Load shedding","Unknown","Subtransmission",null,"Subtransmission",null,"Medium density polyethylene"]
[null,null,null,null,null,"Line upgrade - raising/retensoring",null,"Inter-distributor connection failure","Vegetation","insert description of 'other'","Other","insert description of 'other'",null,"Unprotected steel"]
[null,null,null,null,null,"Line upgrade - voltage upgrade",null,"Other","Weather","Network error","Overloads",null,null,"Protected steel"]
[null,null,null,null,null,"Line upgrade - capacity",null,null,"2 - STPIS Exclusion (3.3)(a)","Switching and protection error","Planned",null,null,"Other"]
[null,null,null,null,null,"String spare circuit",null,null,"3 - STPIS Exclusion (3.3)(a)","Fire","Network business","Network error"]
[null,null,null,null,null,"Other",null,null,"4 - STPIS Exclusion (3.3)(a)","Other",null,"Switching and protection error"]
[null,null,null,null,null,null,null,null,"5 - STPIS Exclusion (3.3)(a)","Dig-in","Third party","Fire"]
[null,null,null,null,null,null,null,null,"6 - STPIS Exclusion (3.3)(a)","Unauthorised access",null,"Other"]
[null,null,null,null,null,null,null,null,"7 - STPIS Exclusion (3.3)(a)","Vehicle impact",null,"Dig-in"]
[null,null,null,null,null,null,null,null,null,"Unknown",null,"Unauthorised access"]
[null,null,null,null,null,null,null,null,null,"Blow-in/Fall-in - NSP responsibility",null,"Vehicle impact"]
[null,null,null,null,null,null,null,null,null,"Grow-in - NSP responsibility","Unknown","Unknown"]
[null,null,null,null,null,null,null,null,null,"Blow-in/Fall-in - Other responsible party","Vegetation","Blow-in/Fall-in - NSP responsibility"]
[null,null,null,null,null,null,null,null,null,"Grow-in - Other responsible party",null,"Grow-in - NSP responsibility"]
[null,null,null,null,null,null,null,null,null,null,null,"Blow-in/Fall-in - Other responsible party"]
[null,null,null,null,null,null,null,null,null,null,null,"Grow-in - Other responsible party"]
[null,null,null,null,null,null,null,null,null,null,"Weather"]
[null,null,null,null,null,null,null,null,null,null,"2 - STPIS Exclusion (3.3)(a)"]
[null,null,null,null,null,null,null,null,null,null,"3 - STPIS Exclusion (3.3)(a)"]
[null,null,null,null,null,null,null,null,null,null,"4 - STPIS Exclusion (3.3)(a)"]
[null,null,null,null,null,null,null,null,null,null,"5 - STPIS Exclusion (3.3)(a)"]
[null,null,null,null,null,null,null,null,null,null,"6 - STPIS Exclusion (3.3)(a)"]
[null,null,null,null,null,null,null,null,null,null,"7 - STPIS Exclusion (3.3)(a)"]
[]
[]
[null,"CA & RESET RINS \nTNSP ","dms_TNSP_0203_SubstationType","dms_TNSP_020301_ProjectType","dms_TNSP_020301_ProjectTrigger","dms_TNSP_020302_ProjectType","dms_TNSP_0203_ProjectTrigger"]
[null,null,"Terminal station","New substation establishment","Demand growth","New line on new route - single circuit","Demand growth"]
[null,null,"Switching station","Capacity upgrade"," Voltage issues","New line on new route - dual circuit"," Voltage issues"]
[null,null,"Transmission substation","Voltage upgrade"," Reactive power issue","New line on new route - other"," Reactive power issue"]
[null,null,"Other","Other"," Fault level issues","Line rebuild over existing route - single circuit"," Fault level issues"]
[null,null,null,null,"Net market benefit","Line rebuild over existing route - dual circuit"," Net market benefit"]
[null,null,null,null," Safety","Reconductor - Single circuit"," Safety"]
[null,null,null,null," Environment","Reconductor - Dual circuit"," Environment"]
[null,null,null,null," Other","Reconductor - Other"," Other"]
[null,null,null,null,null,"Line upgrade - raising/retensoring"]
[null,null,null,null,null,"Line upgrade - voltage upgrade"]
[null,null,null,null,null,"Line upgrade - capacity"]
[null,null,null,null,null,"String spare circuit"]
[null,null,null,null,null,"Other"]
[]
[]
[]
[null,"NAMED RANGES USED IN ETL PROCESS"]
[null,null,null,null,null,null,null,null,null,null,null,null,"GAS ARR & RESET"]
[null,"CA & RESET RINS \nDNSP ONLY","dms_020303_01_UOM","dms_020501_01_UOM","dms_020501_02_UOM","dms_020501_03_UOM","dms_020501_04_UOM","dms_020701_01_UOM","dms_020701_02_UOM","dms_020701_01_Rows","dms_040102_01_UOM","dms_040102_04_UOM","dms_S140101_UOM","dms_S140201_UOM","dms_E050201_UOM","dms_E050202_UOM"]
[null,null,"Circuit line length in km","0's","0's","0's","0's","km","km","Route line length within zone","0's","days","number","number per km","per metre per connection","metres per connection"]
[null,null,"Circuit line length in km","0's","0's","0's","0's","0's","0's","Number of maintenance spans","0's","0's","number","number","per service per connection","number per connection"]
[null,null,"Circuit line length in km","MVA added","MVA added","MVA added","MVA added","km","km","Total length of maintenance spans","0's","$0s","number","number","number per connection","number per connection"]
[null,null,"Circuit line length in km","0's","0's","0's","0's","km","km","Length of vegetation corridors","$0s","0's","km"]
[null,null,"Number","total spend $0s","total spend $0s","total spend $0s","total spend $0s","0's","0's","Average number of trees per maintenance span"]
[null,null,"Number","net circuit km added","net circuit km added","net circuit km added","net circuit km added","years","years","Average frequency of cutting cycle"]
[null,null,"Number","total spend $0s","total spend $0s","total spend $0s","total spend $0s"]
[null,null,null,"net circuit km added","net circuit km added","net circuit km added","net circuit km added"]
[null,null,null,"total spend $0s","total spend $0s","total spend $0s","total spend $0s"]
[null,null,null,"0's",null,"$0s"]
[null,null,null,"0's"]
[null,null,null,"0's"]
[null,null,null,"$0s"]
[]
[]
[null,"CA & RESET RINS \nTNSP ONLY","dms_020701_01_UOM"]
[null,null,"km"]
[null,null,"0's"]
[null,null,"km"]
[null,null,"0's"]
[null,null,"km"]
[null,null,"metres"]
[null,null,"years"]
[]
[]
[null,"CA & RESET RINS \nDNSP & TNSP","dms_020603_01_UOM"]
[null,null,"0's"]
[null,null,"0's"]
[null,null,"0's"]
[null,null,"0's"]
[null,null,"(per cent)"]
[]
[]
[null,"EB & RESET RINS \nDNSP ONLY","dms_030601_01_UOM","dms_030601_02_UOM","dms_030701_01_UOM","dms_030702_01_UOM","dms_030703_01_UOM"]
[null,null,"minutes/customer","minutes/customer","Customer / km","%","km"]
[null,null,"minutes/customer","minutes/customer","MWh/customer","Number of spans"]
[null,null,"interruptions/customer","interruptions/customer","kVA / customer","Number of spans"]
[null,null,"interruptions/customer","interruptions/customer",null,"Number of spans"]
[null,null,null,null,null,"Number of spans"]
[null,null,null,null,null,"Years"]
[null,null,null,null,null,"Years"]
[null,null,null,null,null,"Trees"]
[null,null,null,null,null,"Trees"]
[null,null,null,null,null,"Defects"]
[null,null,null,null,null,"Defects"]
[null,null,null,null,null,"Spans"]
[null,null,null,null,null,"km"]
[null,null,null,null,null,"Spans"]
[]
[null,null,"WHEN INSERTING COVER SHEET INTO A TNSP FILE - APPLY THESE NAMED RANGES"]
[null,"EB & RESET RINS \nTNSP ONLY","dms_030601_01_UOM",null,"dms_030701_01_UOM","dms_030702_01_UOM"]
[null,null,"%",null,"Number of spans","km"]
[null,null,"number",null,"Years","%"]
[null,null,"number",null,"Trees","km"]
[null,null,"%",null,"Defects","number"]
[null,null,"number",null,"Number of spans"]
[null,null,"number",null,"km"]
[null,null,"%",null,"km"]
[null,null,"number",null,"Number of spans"]
[null,null,"number"]
[null,null,"%"]
[null,null,"number"]
[null,null,"%"]
[null,null,"number"]
[null,null,"%"]
[null,null,"number"]
[]
[null,"EB & RESET RINS \nDNSP & TNSP","dms_EB_RAB_PIT"]
[null,null,"Beginning of year"]
[null,null,"End of year"]
[null,null,"End of year"]
[null,null,"End of year"]
[null,null,"End of year"]
[null,null,"End of year"]
[]
[null,"ARR \nDNSP ONLY","dms_030605_UOM","dms_03060703_UOM","dms_E020202_UOM","Spare"]
[null,null,"number","number","Length of mains replaced"]
[null,null,"number","number","Number of services replaced"]
[null,null,"number","number"]
[null,null,"number","number"]
[null,null,"number","(per cent)"]
[null,null,"number"]
[null,null,"number"]
[null,null,"number"]
[null,null,"number"]
[null,null,"number"]
[null,null,"number"]
[null,null,"number"]
[null,null,"(per cent)"]
[null,null,"(per cent)",""]
[]
[null,"RFM","dms_Beg","dms_Mid","dms_End"]
[null,null,"Beginning of year","Mid year","End of Year"]
[]
[null,"PTRM","dms_PTRM_RAB_PIT","dms_PTRM_TAB_PIT","DMS_Xfactor"]
[null,null,"Beginning of year","Beginning of year","x factors"]
[null,null,"End of year","End of year"]
[null,null,"End of year","End of year"]
[null,null,"End of year","End of year"]
[null,null,"End of year"]
[]
[]
[null,"STPIS & MIC NAMED RANGES "]
[]
[null,"These \"row descriptions\" are the column headings in the various templates but become row descriptions in the ETL process"]
[]
[null,"Table 6.3 sustained interruptions - row descriptions","dms_060301_CustNo_Affected_Row","dms_060301_Avg_Duration_Sustained_Int_Row","dms_060301_Effect_unplanned_SAIDI_Row","dms_060301_Effect_unplanned_SAIFI_Row"]
[null,null,"Number of customers affected by the interruption","Average duration of sustained customer interruption","Effect on unplanned SAIDI","Effect on unplanned SAIFI"]
[]
[]
[null,"Table 6.1 telephone answering - row descriptions and start date","dms_060101_Rows","dms_060102_Rows","dms_060101_StartDateTxt"]
[null,null,"Total number of calls \n(after removing excluded events)","Number of calls answered within 30 seconds \n(after excluding excluded events) ",{"$f":"dms_060701_StartDateTxt","v":"1-Jul-2018"}]
[]
[]
[null,"Table 6.8.1 - row descriptions","dms_060801_01_Rows","dms_060801_02_Rows","dms_060801_03_Rows","dms_060801_04_Rows"]
[null,null,"Number of interruptions","Duration of interruptions","Total unplanned minutes off supply","Effect on unplanned MAIFI"]
[]
[]
[null,"Table 7.9.4 - market impact component - row descriptions","dms_070904_01_Rows","without exclusions","with exclusions"]
[]
[]
[null,"These headings (Lists) are determined from the INDEX/MATCH function on the NSP selected on the Business & other details sheet"]
[]
[null,"Table 6.7.1 - daily performance data - unplanned - MAIFI  -- row descriptions and header named range values","dms_060701_Feeder_Header_Lvl4",{"$f":"INDEX(dms_FeederName_1,MATCH(dms_TradingName,dms_TradingName_List))","v":"CBD"},{"$f":"INDEX(dms_FeederName_1,MATCH(dms_TradingName,dms_TradingName_List))","v":"CBD"},{"$f":"INDEX(dms_FeederName_2,MATCH(dms_TradingName,dms_TradingName_List))","v":"Urban"},{"$f":"INDEX(dms_FeederName_2,MATCH(dms_TradingName,dms_TradingName_List))","v":"Urban"},{"$f":"INDEX(dms_FeederName_3,MATCH(dms_TradingName,dms_TradingName_List))","v":"Short rural"},{"$f":"INDEX(dms_FeederName_3,MATCH(dms_TradingName,dms_TradingName_List))","v":"Short rural"},{"$f":"INDEX(dms_FeederName_4,MATCH(dms_TradingName,dms_TradingName_List))","v":"Long rural"},{"$f":"INDEX(dms_FeederName_4,MATCH(dms_TradingName,dms_TradingName_List))","v":"Long rural"},{"$f":"IF((INDEX(dms_FeederName_5,MATCH(dms_TradingName,dms_TradingName_List))=0),\"Network\",(INDEX(dms_FeederName_5,MATCH(dms_TradingName,dms_TradingName_List))))","v":"Network"},{"$f":"IF((INDEX(dms_FeederName_5,MATCH(dms_TradingName,dms_TradingName_List))=0),\"Network\",(INDEX(dms_FeederName_5,MATCH(dms_TradingName,dms_TradingName_List))))","v":"Network"},"Network","Network"]
[]
[null,null,"dms_060701_Rows","All events","After removing excluded events","All events","After removing excluded events","All events","After removing excluded events","All events","After removing excluded events","All events","After removing excluded events","All events","After removing excluded events"]
[null,null,null,"the number of column headings changes from 10 to 12 depending on the number of feeder categories for the NSP"]
[]
[null,null,"dms_0603_FeederList",{"$f":"INDEX(dms_FeederName_1,MATCH(dms_TradingName,dms_TradingName_List))","v":"CBD"},{"$f":"INDEX(dms_FeederName_2,MATCH(dms_TradingName,dms_TradingName_List))","v":"Urban"},{"$f":"INDEX(dms_FeederName_3,MATCH(dms_TradingName,dms_TradingName_List))","v":"Short rural"},{"$f":"INDEX(dms_FeederName_4,MATCH(dms_TradingName,dms_TradingName_List))","v":"Long rural"}]
[]
[]
[null,"Use these to add to specific worksheets in existing files","Use these to add to specific worksheets in existing files"]
[]
[]
[null,"ARRs 6.7 STPIS daily performance","dms_060101_Values","dms_060102_Values","dms_060701_Values"]
[null,null,"dms_LeapYear"]
[]
[]
[null,"ARR's  6.8 STPIS exclusions","dms_060801_Event_Date","dms_060801_OutageID","dms_060801_FeederID","dms_060801_FeederClass","dms_060801_CauseID","dms_060801_01_Values","dms_060801_02_Values","dms_060801_03_Values","dms_060801_Excl_Cat","dms_060801_04_Values"]
[null,null,"dms_060801_StartCell"]
[]
[]
[null,"CA 6.3 sustained interruptions","dms_060301_Event_Date","dms_060301_Event_Time","dms_060301_AssetID","dms_060301_FeederClass","dms_060301_Reason","dms_060301_DetailedReason","dms_060301_CustNo_Affected_Values","dms_060301_Avg_Duration_Sustained_Int_Values","dms_060301_Effect_unplanned_SAIDI_Values","dms_060301_Effect_unplanned_SAIFI_Values","dms_060301_MED"]
[]
[]
[]
[null,"PTRM input sheet","DMS_50_01_01a","DMS_50_01_01aa","DMS_50_01_01b","DMS_50_01_01bb","DMS_50_01_01c","DMS_50_01_01d","DMS_50_01_01dd"]

{"sheet":"AER lookups","index":26,"n_rows":118,"n_cols":38,"rows_kept":118,"cut":false,"hidden":true,"merged":[[33,1,33,4],[10,26,10,36],[11,26,11,29],[11,31,11,35],[11,36,13,36]]}
[null,"AER LOOKUP TABLES"]
[null,null,null,null,null,null,null,null,null,null,null,null,null,null,null,null,null,null,null,null,null,{"$f":"dms_TradingNameFull","v":"Jemena Gas Networks (NSW) Ltd"}]
[null,"Data in these columns used for data validation and database purposes."]
[null,"Date last modified:","2017-01-16","added (Albury and Victora) for AGN"]
[null,null,"2016-10-17","updated TransGrid's correct legal name, corrected TasNetworks (T) to June financial year"]
[null,null,"2017-02-01","inserted Power and Water, added NRs (dms_FeederCat_1 and dms_FeederCat_2)"]
[null,null,"2017-03-03","inserted AEMO as a business"]
[null,null,"2018-03-28","major changes to accommodate STPIS"]
[null,null,"Template Version",5]
[]
[null,null,null,null,null,null,null,null,null,null,null,null,null,null,null,null,null,null,null,null,null,null,null,null,null,null,"FOR ELECTRICITY BUSINESSES ONLY"]
[null,null,null,null,null,null,null,null,null,null,null,null,null,null,null,null,null,null,null,null,null,null,null,null,null,null,"Feeder Types",null,null,null,"TasNetworks (D)","Feeder Names"]
[]
[null,null,null,null,null,null,null,null,null,null,null,null,null,null,null,null,null,null,null,null,null,null,null,null,null,null,"CBD","Urban","Short rural","long rural","EXTRA"]
[null,"dms_TradingName_List","dms_TradingNameFull_List","dms_ABN_List","dms_UniqueID_List","dms_JurisdictionList","dms_Sector_List","dms_Segment_List","dms_FormControl_List","dms_RPT_List","dms_RPTMonth_List","dms_CRCPlength_List","dms_FRCPlength_List","dms_PRCPlength_List","dms_663_List","dms_DeterminationRef_List","dms_Addr1_List","dms_Addr2_List","dms_Suburb_List","dms_State_List","dms_PostCode_List","dms_PAddr1_List","dms_PAddr2_List","dms_PSuburb_List","dms_PState_List","dms_PPostCode_List","dms_CBD_flag","dms_Urban_flag","dms_ShortRural_flag","dms_LongRural_flag","dms_FeederType_5_flag","dms_FeederName_1","dms_FeederName_2","dms_FeederName_3","dms_FeederName_4","dms_FeederName_5","dms_Public_Lighting_List","Name"]
[null,"AGN (Albury and Victoria)","Australian Gas Networks Limited (reporting data for Albury and Victoria)",19078551685,"GDDVIC100","Vic","Gas","Distribution","Tariff cap","Financial","June",5,5,5,"x",null,"Level 6","400 King William Street","ADELAIDE","SA",5000,"PO Box 6468","Halifax Street","ADELAIDE","SA",5000,"NO","NO","NO","NO","NO","CBD","Urban","Short rural","Long rural",null,"NO",{"$f":"B16","v":"AGN (Albury and Victoria)"}]
[null,"AGN (Albury)","Australian Gas Networks Limited (reporting data for Albury)",19078551685,"GDDVIC200","Vic","Gas","Distribution","Tariff cap","Financial","June",5,5,5,"x",null,"Level 6","400 King William Street","ADELAIDE","SA",5000,"PO Box 6468","Halifax Street","ADELAIDE","SA",5000,"NO","NO","NO","NO","NO","CBD","Urban","Short rural","Long rural",null,"NO","AGN (Albury)"]
[null,"AGN (SA)","Australian Gas Networks Limited (reporting data for SA)",19078551685,"GDDSTH100","SA","Gas","Distribution","Tariff cap","Financial","June",5,5,5,5,"distribution determination","Level 6","400 King William Street","ADELAIDE","SA",5000,"PO Box 6468","Halifax Street","ADELAIDE","SA",5000,"NO","NO","NO","NO","NO","CBD","Urban","Short rural","Long rural",null,"NO","AGN (SA)"]
[null,"AGN (Victoria)","Australian Gas Networks Limited (reporting data for Victoria)",19078551685,"GDDVIC300","Vic","Gas","Distribution","Tariff cap","Financial","June",5,5,5,"x",null,"Level 6","400 King William Street","ADELAIDE","SA",5000,"PO Box 6468","Halifax Street","ADELAIDE","SA",5000,"NO","NO","NO","NO","NO","CBD","Urban","Short rural","Long rural",null,"NO","AGN (Victoria)"]
[null,"Amadeus","APT Pipelines (NT) Pty Ltd",39009737393,"GTTNTY100","NT","Gas","Transmission","Tariff cap","Financial","June",5,5,5,"x","n/a","Level 19, HSBC Building","580 George Street","SYDNEY","NSW",2000,"Level 19, HSBC Building","580 George Street","SYDNEY","NSW",2000,"NO","NO","NO","NO","NO","CBD","Urban","Short rural","Long rural",null,"NO","Amadeus"]
[null,"APA GasNet","APA GasNet Australia (Operations) Pty Ltd","065083009","GNTNSW100","Vic","Gas","Transmission","Weighted average price cap","Financial","June",5,5,5,"x",null,"Level 19, HSBC Building","580 George Street","SYDNEY","NSW",2000,"PO Box R41",null,"ROYAL EXCHANGE","NSW",1225,"Alexandra Curran","02 9275 0020","alexandra.curran@apa.com.au","NO","NO","NO","NO","NO","-","CBD","Urban","APA GasNet"]
[null,"APA VTS","APA VTS Australia (Operations) Pty Ltd",65083009,"GTTVIC100","Vic","Gas","Transmission","Tariff cap","Financial","June",5,5,5,"x",null,"Level 19, HSBC Building","580 George Street","SYDNEY","NSW",2000,"PO Box R41",null,"ROYAL EXCHANGE","NSW",1225,"NO","NO","NO","NO","NO","CBD","Urban","Short rural","Long rural",null,"NO","APA VTS"]
[null,"AusNet (Gas)","AusNet Gas Services","086015036","GDDVIC400","Vic","Gas","Distribution","Tariff cap","Financial","June",5,5,5,"-","-","Level 31","2 Southbank Boulevard","SOUTHBANK","Vic",3008,null,null,null,"Vic",null,"NO","NO","NO","NO","NO","CBD","Urban","Short rural","Long rural",null,"NO","AusNet (Gas)"]
[null,"Australian Distribution Co. (Gas)","Australian Gas Distribution Co. ",11222333444,"GDXXX000","Vic","Gas","Distribution","Tariff cap","Financial","June",5,5,5,"-","-","123 Straight Street",null,"MELBOURNE","Vic",3000,"PO Box 123",null,"MELBOURNE","Vic",3000,"NO","NO","NO","NO","NO","CBD","Urban","Short rural","Long rural",null,"NO","Australian Distribution Co. (Gas)"]
[null,"Australian Transmission Co. (Gas)","Australian Transmission Co. (Gas)",11222333444,"GTXXX000","NSW","Gas","Transmission","Tariff cap","Financial","June",5,5,5,5,"transmission determination","123 Straight Street",null,"SYDNEY","NSW",2000,"PO Box 123",null,"SYDNEY","NSW",2000,"NO","NO","NO","NO","NO","CBD","Urban","Short rural","Long rural",null,"NO","Australian Transmission Co. (Gas)"]
[null,"Evoenergy Gas","Icon Distribution Investments Limited (ABN 83 073 025 224) and Jemena Networks (ACT) Pty Ltd (ABN 24 008 552 663)",76670568688,"GDDACT100","ACT","Gas","Distribution","Tariff cap","Financial","June",5,5,5,"x",null,"40 Bunda Street",null,"CANBERRA","ACT",2600,"GPO BOX 366",null,"CANBERRA","ACT",2601,"NO","NO","NO","NO","NO","CBD","Urban","Short rural","Long rural",null,"NO","Evoenergy Gas"]
[null,"JGN","Jemena Gas Networks (NSW) Ltd","003 004 322","GDDNSW100","NSW","Gas","Distribution","Tariff cap","Financial","June",5,5,5,null,null,null,null,null,null,null,null,null,null,null,null,"NO","NO","NO","NO","NO","CBD","Urban","Short rural","Long rural",null,"NO","JGN"]
[null,"Multinet Gas","Multinet Gas (DB No.1) Pty Ltd (ACN 086 026 986), Multinet Gas (DB No.2) Pty Ltd (ACN 086 230 122)","086026986","GDDVIC500","Vic","Gas","Distribution","Tariff cap","Financial","June",5,5,5,"x",null,"43-45 Centreway",null,"MT WAVERLEY","Vic",3149,null,null,null,"Vic",null,"NO","NO","NO","NO","NO","CBD","Urban","Short rural","Long rural",null,"NO","Multinet Gas"]
[null,"Roma to Brisbane Pipeline","APT Petroleum Pipelines Limited t/a Roma to Brisbane Pipeline","009 737 393","GTTQLD100","Qld","Gas","Transmission","Tariff cap","Financial","June",5,5,5,"x","n/a","580 George Street",null,"SYDNEY","NSW",2000,"PO Box R41",null,"ROYAL EXCHANGE","NSW",1225,"NO","NO","NO","NO","NO","CBD","Urban","Short rural","Long rural",null,"NO","Roma to Brisbane Pipeline"]
[]
[]
[]
[]
[null,"The Reg Year Ending (dms_RYE) must be set to the last year of the regulatory period. For forecast data is is usually (FRCP_y5) for actual it is a single year (CRY). For historical actual data the RYE will need to be set manually in the business details sheet by setting the dms_Multiyear_flag to 1 and putting the correct value in 'dms_Specified_FinalYear. See cells C67:C68"]
[null,"dms_Model_List ","dms_Model_Name_Format1","dms_Worksheet_List","dms_Model_Span_List"]
[null,"ARR","Annual Reporting",{"$f":"IF(dms_MultiYear_ResponseFlag=\"yes\",\"NEW HISTORICAL ANNUAL REPORTING\",\"ANNUAL REPORTING\")","v":"ANNUAL REPORTING"},1]
[null,"CA","Category Analysis",{"$f":"IF(dms_MultiYear_ResponseFlag=\"yes\",\"NEW HISTORICAL CATEGORY ANALYSIS\",\"CATEGORY ANALYSIS\")","v":"CATEGORY ANALYSIS"},1]
[null,"CESS","Capitlal Expenditure","CAPITLAL EXPENDITURE SHARING SCHEMING",5]
[null,"CPI","CPI","CPI",5]
[null,"EB","Economic Benchmarking",{"$f":"IF(dms_MultiYear_ResponseFlag=\"yes\",\"NEW HISTORICAL ECONOMIC BENCHMARKING\",\"ECONOMIC BENCHMARKING\")","v":"ECONOMIC BENCHMARKING"},1]
[null,"EBSS","Efficiency Benefit Sharing Scheme","EFFICIENCY BENEFIT SHARING SCHEME",5]
[null,"Pricing","Pricing Proposal","PRICING PROPOSAL",5]
[null,"Profitability","Profitability","PROFITABILITY",5]
[null,"PTRM","Post Tax Revenue Model","POST TAX REVENUE MODEL",5]
[null,"Reset","Regulatory Reporting (Reset)","REGULATORY REPORTING STATEMENT",5]
[null,"RFM","Roll Forward Model","ROLL FORWARD MODEL",5]
[null,"WACC","Weighted Average Cost of Capital","WEIGHTED AVERAGE COST OF CAPITAL",1]
[]
[]
[]
[null,"Financial","Calendar",null,"PREVIOUS",null,"CURRENT",null,"FORTHCOMING"]
[null,"1987-88","1988","PRCP_y1",{"$f":"INDEX(INDIRECT(dms_RPT),dms_PRCP_start_row)","v":"2015-16"},"CRCP_y1",{"$f":"INDEX(INDIRECT(dms_RPT),dms_CRCP_start_row)","v":"2020-21"},{"$f":"FRCP_y1","v":"2025-26"},{"$f":"INDEX(INDIRECT(dms_RPT),dms_FRCP_start_row)","v":"2025-26"}]
[null,"1988-89","1989","PRCP_y2",{"$f":"INDEX(INDIRECT(dms_RPT),dms_PRCP_start_row+1)","v":"2016-17"},"CRCP_y2",{"$f":"INDEX(INDIRECT(dms_RPT),dms_CRCP_start_row+1)","v":"2021-22"},"FRCP_y2",{"$f":"INDEX(INDIRECT(dms_RPT),dms_FRCP_start_row+1)","v":"2026-27"}]
[null,"1989-90","1990","PRCP_y3",{"$f":"INDEX(INDIRECT(dms_RPT),dms_PRCP_start_row+2)","v":"2017-18"},"CRCP_y3",{"$f":"INDEX(INDIRECT(dms_RPT),dms_CRCP_start_row+2)","v":"2022-23"},"FRCP_y3",{"$f":"INDEX(INDIRECT(dms_RPT),dms_FRCP_start_row+2)","v":"2027-28"}]
[null,"1990-91","1991","PRCP_y4",{"$f":"INDEX(INDIRECT(dms_RPT),dms_PRCP_start_row+3)","v":"2018-19"},"CRCP_y4",{"$f":"INDEX(INDIRECT(dms_RPT),dms_CRCP_start_row+3)","v":"2023-24"},"FRCP_y4",{"$f":"INDEX(INDIRECT(dms_RPT),dms_FRCP_start_row+3)","v":"2028-29"}]
[null,"1991-92","1992","PRCP_y5",{"$f":"INDEX(INDIRECT(dms_RPT),dms_PRCP_start_row+4)","v":"2019-20"},"CRCP_y5",{"$f":"INDEX(INDIRECT(dms_RPT),dms_CRCP_start_row+4)","v":"2024-25"},"FRCP_y5",{"$f":"INDEX(INDIRECT(dms_RPT),dms_FRCP_start_row+4)","v":"2029-30"}]
[null,"1992-93","1993","PRCP_y6",{"$f":"INDEX(INDIRECT(dms_RPT),dms_PRCP_start_row+5)","v":"2020-21"},"CRCP_y6",{"$f":"INDEX(INDIRECT(dms_RPT),dms_CRCP_start_row+5)","v":"2025-26"},"FRCP_y6",{"$f":"INDEX(INDIRECT(dms_RPT),dms_FRCP_start_row+5)","v":"2030-31"}]
[null,"1993-94","1994","PRCP_y7",{"$f":"INDEX(INDIRECT(dms_RPT),dms_PRCP_start_row+6)","v":"2021-22"},"CRCP_y7",{"$f":"INDEX(INDIRECT(dms_RPT),dms_CRCP_start_row+6)","v":"2026-27"},"FRCP_y7",{"$f":"INDEX(INDIRECT(dms_RPT),dms_FRCP_start_row+6)","v":"2031-32"}]
[null,"1994-95","1995","PRCP_y8",{"$f":"INDEX(INDIRECT(dms_RPT),dms_PRCP_start_row+7)","v":"2022-23"},"CRCP_y8",{"$f":"INDEX(INDIRECT(dms_RPT),dms_CRCP_start_row+7)","v":"2027-28"},"FRCP_y8",{"$f":"INDEX(INDIRECT(dms_RPT),dms_FRCP_start_row+7)","v":"2032-33"}]
[null,"1995-96","1996","PRCP_y9",{"$f":"INDEX(INDIRECT(dms_RPT),dms_PRCP_start_row+8)","v":"2023-24"},"CRCP_y9",{"$f":"INDEX(INDIRECT(dms_RPT),dms_CRCP_start_row+8)","v":"2028-29"},"FRCP_y9",{"$f":"INDEX(INDIRECT(dms_RPT),dms_FRCP_start_row+8)","v":"2033-34"}]
[null,"1996-97","1997","PRCP_y10",{"$f":"INDEX(INDIRECT(dms_RPT),dms_PRCP_start_row+9)","v":"2024-25"},"CRCP_y10",{"$f":"INDEX(INDIRECT(dms_RPT),dms_CRCP_start_row+9)","v":"2029-30"},"FRCP_y10",{"$f":"INDEX(INDIRECT(dms_RPT),dms_FRCP_start_row+9)","v":"2034-35"}]
[null,"1997-98","1998","PRCP_y11",{"$f":"INDEX(INDIRECT(dms_RPT),dms_PRCP_start_row+10)","v":"2025-26"},"CRCP_y11",{"$f":"INDEX(INDIRECT(dms_RPT),dms_CRCP_start_row+10)","v":"2030-31"},"FRCP_y11",{"$f":"INDEX(INDIRECT(dms_RPT),dms_FRCP_start_row+10)","v":"2035-36"}]
[null,"1998-99","1999","PRCP_y12",{"$f":"INDEX(INDIRECT(dms_RPT),dms_PRCP_start_row+11)","v":"2026-27"},"CRCP_y12",{"$f":"INDEX(INDIRECT(dms_RPT),dms_CRCP_start_row+11)","v":"2031-32"},"FRCP_y12",{"$f":"INDEX(INDIRECT(dms_RPT),dms_FRCP_start_row+11)","v":"2036-37"}]
[null,"1999-00","2000","PRCP_y13",{"$f":"INDEX(INDIRECT(dms_RPT),dms_PRCP_start_row+12)","v":"2027-28"},"CRCP_y13",{"$f":"INDEX(INDIRECT(dms_RPT),dms_CRCP_start_row+12)","v":"2032-33"},"FRCP_y13",{"$f":"INDEX(INDIRECT(dms_RPT),dms_FRCP_start_row+12)","v":"2037-38"}]
[null,"2000-01","2001","PRCP_y14",{"$f":"INDEX(INDIRECT(dms_RPT),dms_PRCP_start_row+13)","v":"2028-29"},"CRCP_y14",{"$f":"INDEX(INDIRECT(dms_RPT),dms_CRCP_start_row+13)","v":"2033-34"},"FRCP_y14",{"$f":"INDEX(INDIRECT(dms_RPT),dms_FRCP_start_row+13)","v":"2038-39"}]
[null,"2001-02","2002","PRCP_y15",{"$f":"INDEX(INDIRECT(dms_RPT),dms_PRCP_start_row+14)","v":"2029-30"},"CRCP_y15",{"$f":"INDEX(INDIRECT(dms_RPT),dms_CRCP_start_row+14)","v":"2034-35"},"FRCP_y15",{"$f":"INDEX(INDIRECT(dms_RPT),dms_FRCP_start_row+14)","v":"2039-40"}]
[null,"2002-03","2003","PRCP_y16",{"$f":"INDEX(INDIRECT(dms_RPT),dms_PRCP_start_row+15)","v":"2030-31"},"CRCP_y16",{"$f":"INDEX(INDIRECT(dms_RPT),dms_CRCP_start_row+15)","v":"2035-36"},"FRCP_y16",{"$f":"INDEX(INDIRECT(dms_RPT),dms_FRCP_start_row+15)","v":"2040-41"}]
[null,"2003-04","2004","PRCP_y17","2031-32","CRCP_y17","2036-37","FRCP_y17",{"$f":"INDEX(INDIRECT(dms_RPT),dms_FRCP_start_row+16)","v":"2041-42"}]
[null,"2004-05",2005,"PRCP_y18","2032-33","CRCP_y18","2037-38","FRCP_y18",{"$f":"INDEX(INDIRECT(dms_RPT),dms_FRCP_start_row+17)","v":"2042-43"}]
[null,"2005-06",2006,"PRCP_y19","2033-34","CRCP_y19","2038-39","FRCP_y19",{"$f":"INDEX(INDIRECT(dms_RPT),dms_FRCP_start_row+18)","v":"2043-44"}]
[null,"2006-07",2007,"PRCP_y20","2034-35","CRCP_y20","2039-40","FRCP_y20",{"$f":"INDEX(INDIRECT(dms_RPT),dms_FRCP_start_row+19)","v":"2044-45"}]
[null,"2007-08",2008,"PRCP_y21","2035-36","CRCP_y21","2040-41","FRCP_y21",{"$f":"INDEX(INDIRECT(dms_RPT),dms_FRCP_start_row+20)","v":"2045-46"}]
[null,"2008-09",2009,"PRCP_y22","2036-37","CRCP_y22","2041-42","FRCP_y22",{"$f":"INDEX(INDIRECT(dms_RPT),dms_FRCP_start_row+21)","v":"2046-47"}]
[null,"2009-10",2010,"PRCP_y23","2037-38","CRCP_y23","2042-43","FRCP_y23",{"$f":"INDEX(INDIRECT(dms_RPT),dms_FRCP_start_row+22)","v":"2047-48"}]
[null,"2010-11",2011,"PRCP_y24","2038-39","CRCP_y24","2043-44","FRCP_y24",{"$f":"INDEX(INDIRECT(dms_RPT),dms_FRCP_start_row+23)","v":"2048-49"}]
[null,"2011-12",2012,"PRCP_y25","2039-40","CRCP_y25","2044-45","FRCP_y25",{"$f":"INDEX(INDIRECT(dms_RPT),dms_FRCP_start_row+24)","v":"2049-50"}]
[null,"2012-13",2013]
[null,"2013-14",2014]
[null,"2014-15",2015]
[null,"2015-16",2016]
[null,"2016-17",2017]
[null,"2017-18",2018]
[null,"2018-19",2019]
[null,"2019-20",2020]
[null,"2020-21",2021]
[null,"2021-22",2022]
[null,"2022-23",2023]
[null,"2023-24",2024]
[null,"2024-25",2025]
[null,"2025-26",2026,null,"CRY - FRY"]
[null,"2026-27",2027,"dms_y1",{"$f":"IFERROR(INDEX(INDIRECT(dms_RPT),dms_CRY_start_row),0)","v":"2023-24"}]
[null,"2027-28",2028,"dms_y2",{"$f":"IFERROR(INDEX(INDIRECT(dms_RPT),dms_CRY_start_row+1),0)","v":"2024-25"}]
[null,"2028-29",2029,"dms_y3",{"$f":"IFERROR(INDEX(INDIRECT(dms_RPT),dms_CRY_start_row+2),0)","v":"2025-26"}]
[null,"2029-30",2030,"dms_y4",{"$f":"IFERROR(INDEX(INDIRECT(dms_RPT),dms_CRY_start_row+3),0)","v":"2026-27"}]
[null,"2030-31",2031,"dms_y5",{"$f":"IFERROR(INDEX(INDIRECT(dms_RPT),dms_CRY_start_row+4),0)","v":"2027-28"}]
[null,"2031-32",2032,"dms_y6",{"$f":"IFERROR(INDEX(INDIRECT(dms_RPT),dms_CRY_start_row+5),0)","v":"2028-29"}]
[null,"2032-33",2033,"dms_y7",{"$f":"IFERROR(INDEX(INDIRECT(dms_RPT),dms_CRY_start_row+6),0)","v":"2029-30"}]
[null,"2033-34",2034,"dms_y8",{"$f":"IFERROR(INDEX(INDIRECT(dms_RPT),dms_CRY_start_row+7),0)","v":"2030-31"}]
[null,"2034-35",2035,"dms_y9",{"$f":"IFERROR(INDEX(INDIRECT(dms_RPT),dms_CRY_start_row+8),0)","v":"2031-32"}]
[null,"2035-36",2036,"dms_y10",{"$f":"IFERROR(INDEX(INDIRECT(dms_RPT),dms_CRY_start_row+9),0)","v":"2032-33"}]
[null,"2036-37",2037,"dms_y11",{"$f":"IFERROR(INDEX(INDIRECT(dms_RPT),dms_CRY_start_row+10),0)","v":"2033-34"}]
[null,"2037-38",2038,"dms_y12",{"$f":"IFERROR(INDEX(INDIRECT(dms_RPT),dms_CRY_start_row+11),0)","v":"2034-35"}]
[null,"2038-39",2039,"dms_y13",{"$f":"IFERROR(INDEX(INDIRECT(dms_RPT),dms_CRY_start_row+12),0)","v":"2035-36"}]
[null,"2039-40",2040,"dms_y14",{"$f":"IFERROR(INDEX(INDIRECT(dms_RPT),dms_CRY_start_row+13),0)","v":"2036-37"}]
[null,"2040-41",2041,"dms_y15",{"$f":"IFERROR(INDEX(INDIRECT(dms_RPT),dms_CRY_start_row+14),0)","v":"2037-38"}]
[null,"2041-42",2042,"dms_y16",{"$f":"IFERROR(INDEX(INDIRECT(dms_RPT),dms_CRY_start_row+15),0)","v":"2038-39"}]
[null,"2042-43",2043,"dms_y17","2038-39"]
[null,"2043-44",2044,"dms_y18","2039-40"]
[null,"2044-45",2045,"dms_y19","2040-41"]
[null,"2045-46",2046,"dms_y20","2041-42"]
[null,"2046-47",2047,"dms_y21","2042-43"]
[null,"2047-48",2048,"dms_y22","2043-44"]
[null,"2048-49","2049","dms_y23","2044-45"]
[null,"2049-50","2050","dms_y24","2045-46"]
[null,null,null,"dms_y25","2046-47"]
[null,null,null,"dms_y26","2047-48"]
[null,null,null,"dms_y27","2048-49"]
[null,null,null,"dms_y28","2049-50"]

{"sheet":"AER ETL","index":27,"n_rows":146,"n_cols":8,"rows_kept":146,"cut":false,"hidden":true,"merged":[[35,0,60,0],[35,37,35,58],[35,68,35,89],[33,37,33,58],[72,1,74,1],[33,68,33,89],[34,37,34,58],[34,68,34,89],[12,0,16,0],[13,4,13,8],[15,2,15,4],[19,0,26,0],[27,0,32,0]]}
[null,"AER ETL INFORMATION"]
[]
[null,"USES NAMED RANGES FLAG","yes","dms_Defined_Names_Used"]
[]
[null,"IF THIS IS AN ABC RIN - make sure the the named range CRY is applied and the named range dms_dollar_nom_UOM is applied"]
[null,"IF THIS IS A RESET RIN - make sure the named ranges CRY and dms_dollar_nom_UOM are NOT present in the workbook"]
[null,"FOR ABC RINS THAT SPAN MULTIPLE YEARS - make sure MultiYear Flag is set and final year entered as required"]
[]
[null,"Full trading name",{"$f":"INDEX(dms_TradingNameFull_List,MATCH(dms_TradingName,dms_TradingName_List))","v":"Jemena Gas Networks (NSW) Ltd"},null,"dms_TradingNameFull"]
[null,"Trading name",{"$f":"dms_TradingName","v":"JGN"}]
[null,"Unique ID",{"$f":"INDEX(dms_UniqueID_List,MATCH(dms_TradingName,dms_TradingName_List))","v":"GDDNSW100"},"dms_UID"]
["Selected here","Model / RIN","Reset","dms_Model"]
["Read from Business & other details","Source","Regulatory proposal","dms_Source"]
[null,"Data quality","Consolidated","For DB purposes this is always Consoldiated"]
[null,"Data status","Public","For DB purposes this is always Public"]
[null,"Amendment reason",{"$f":"dms_Amendment_Text","v":"."},null,null,"dms_AmendmentReason"]
[null,"Submission date",{"$f":"dms_Typed_Submission_Date","v":"dd/mm/yy"},"dms_SubmissionDate"]
[]
["Redundant","EBSS - First application of scheme in forthcoming period?","No"]
["Pre-populated from lookup table","Data ingestion data quality","Consolidated","dms_DataQuality","Always Consolidated"]
[null,"Sector",{"$f":"INDEX(dms_Sector_List,MATCH(dms_TradingName,dms_TradingName_List))","v":"Gas"},"dms_Sector","=INDEX(dms_Sector_List,MATCH(dms_TradingName,dms_TradingName_List))"]
[null,"Segment",{"$f":"INDEX(dms_Segment_List,MATCH(dms_TradingName,dms_TradingName_List))","v":"Distribution"},"dms_Segment","=INDEX(dms_Segment_List,MATCH(dms_TradingName,dms_TradingName_List))"]
[null,"Regulatory Year Ending",{"$f":"IF(dms_MultiYear_Flag=1,LEFT(dms_Specified_FinalYear,2)&RIGHT(dms_Specified_FinalYear,2),dms_RYE_result)","v":"2030"},"dms_RYE","=IF(dms_MultiYear_Flag=1,LEFT(dms_Specified_FinalYear,2)&RIGHT(dms_Specified_FinalYear,2),dms_RYE_result)"]
[null,"Reporting Period Type",{"$f":"INDEX(dms_RPT_List,MATCH(dms_TradingName,dms_TradingName_List))","v":"Financial"},"dms_RPT","=INDEX(dms_RPT_List,MATCH(dms_TradingName,dms_TradingName_List))"]
[null,"EB/CA Unit of Measure for Monetary Values","$0s","dms_dollar_nom_UOM","If the cover sheet is attached to an ABC RIN apply the NAMED RANGE to the cell"]
[null,"Security Classification","Public","dms_Classification","Always Public"]
[null,"Jurisdiction",{"$f":"INDEX(dms_JurisdictionList,MATCH(dms_TradingName,dms_TradingName_List))","v":"NSW"},"dms_Jurisdiction","=INDEX(dms_JurisdictionList,MATCH(dms_TradingName,dms_TradingName_List))"]
["Relevant for PTRM, RFMs and Reset RINS","$ REAL REFERENCES"]
[null,"Does the named range CRY exist in this file? ",{"$f":"IFERROR(CRY,\"NO\")","v":"NO"}]
[null,"CRY-1  (last full calendar year before CRY)",{"$f":"IFERROR(IF(dms_RPT=\"calendar\",CRY-1,LEFT(CRY,4)),\"CRY not present\")","v":"CRY not present"},"dms_Cal_Year_B4_CRY","'=IF(dms_RPT=\"financial\",VALUE(LEFT(dms_SingleYear_FinalYear_Result,4)),VALUE(LEFT(dms_SingleYear_FinalYear_Result,4)-1))"]
[null,"Dollar $ real month",{"$f":"INDEX(dms_RPTMonth_List,MATCH(dms_TradingName,dms_TradingName_List))","v":"June"},"dms_RPTMonth","=INDEX(dms_RPTMonth_List,MATCH(dms_TradingName,dms_TradingName_List))"]
[null,"Dollar $ real  (the last month before the FRCP_y1)",{"$f":"IF(dms_Model=\"RFM\",dms_DollarReal_Prev, IF(dms_SingleYearModel=\"yes\",CONCATENATE(dms_RPTMonth)&\" \"&VALUE((LEFT(dms_CRY_start_year,2)&RIGHT(dms_CRY_start_year,2))),CONCATENATE(dms_RPTMonth)&\" \"&dms_DollarReal_year))","v":"June 2025"},"dms_DollarReal","=IF(dms_Model=\"RFM\",dms_DollarReal_Prev, IF(dms_SingleYearModel=\"yes\",CONCATENATE(dms_RPTMonth)&\" \"&VALUE((LEFT(dms_CRY_start_year,2)&RIGHT(dms_CRY_start_year,2))),CONCATENATE(dms_RPTMonth)&\" \"&dms_DollarReal_year))"]
[null,"Dollar $ real previous year (PRCP_y5)","December 2017","dms_DollarReal_Prev","=IF(SUM(dms_SingleYear_Model)>0,CONCATENATE(dms_RPTMonth)&\" \"&VALUE(((LEFT(CRY,2))&RIGHT(CRY,2))-1),CONCATENATE(dms_RPTMonth)&\" \"&VALUE(((LEFT(dms_CRCP_FirstYear_Result,2)&RIGHT(dms_CRCP_FirstYear_Result,2))))-1)"]
[null,"PTRM/ RFMs"]
[null,"Form of control",{"$f":"INDEX(dms_FormControl_List,MATCH(dms_TradingName,dms_TradingName_List))","v":"Tariff cap"},"dms_FormControl","=INDEX(dms_FormControl_List,MATCH(dms_TradingName,dms_TradingName_List))"]
["All potential values for Regulatory Years or RYEs as calculated","This block works out the various RYE's for ALL RIN types and MODELS"]
[null,"dms_start_year",{"$f":"FRCP_y1","v":"2025-26"},"=FRCP_y1","FRCP_y1 from cover sheet"]
[null,"dms_CRY_start_year",{"$f":"IFERROR(CRY,CRCP_y4)","v":"2023-24"},"=IFERROR(CRY,CRCP_y4)"]
[null,"dms_CRY_start_row",{"$f":"IFERROR(MATCH(dms_CRY_start_year,INDIRECT(dms_RPT),0),0)","v":37},"=IFERROR(MATCH(dms_CRY_start_year,INDIRECT(dms_RPT),0),0)"]
[null,"dms_FRCP_start_row",{"$f":"MATCH(dms_start_year,INDIRECT(dms_RPT),0)","v":39},"=MATCH(dms_start_year,INDIRECT(dms_RPT),0)","Uses FRCP_y1 as a start reference"]
[null,"dms_CRCP_start_row",{"$f":"dms_FRCP_start_row-dms_CRCPlength_Num","v":34},"=dms_FRCP_start_row-dms_CRCPlength_Num","Uses the value in dms_CRCPlength_Num"]
[null,"dms_PRCP_start_row",{"$f":"dms_FRCP_start_row-dms_CRCPlength_Num-dms_PRCPlength_Num","v":29},"=dms_FRCP_start_row-dms_CRCPlength_Num-dms_PRCPlength_Num","Uses the value in dms_CRCPlength_Num and dms_PRCPlength_Num"]
[null,"dms_RYE_start_row",{"$f":"dms_FRCP_start_row+(dms_FRCPlength_Num-1)","v":43},"=dms_FRCP_start_row+(dms_FRCPlength_Num-1)","Uses the value in dms_FRCPlength_Num-1"]
[null,"FRCP_start_year",{"$f":"INDEX(INDIRECT(dms_RPT),dms_FRCP_start_row)","v":"2025-26"},"=INDEX(INDIRECT(dms_RPT),dms_FRCP_start_row)","Converts the FRCP start row to display the year"]
[null,"CRCP_start_year",{"$f":"INDEX(INDIRECT(dms_RPT),dms_CRCP_start_row)","v":"2020-21"},"=INDEX(INDIRECT(dms_RPT),dms_CRCP_start_row)","Converts the CRCP start row to display the year"]
[null,"PRCP_start_year",{"$f":"INDEX(INDIRECT(dms_RPT),dms_PRCP_start_row)","v":"2015-16"},"=INDEX(INDIRECT(dms_RPT),dms_PRCP_start_row)","Converts the PRCP start row to display the year"]
[null,"FRCP_final_year",{"$f":"INDEX(INDIRECT(dms_RPT),dms_FRCP_start_row+dms_FRCPlength_Num-1)","v":"2029-30"},"=INDEX(INDIRECT(dms_RPT),dms_FRCP_start_row+dms_FRCPlength_Num-1)","Finds the FRCP final year"]
[null,"CRCP_final_year",{"$f":"INDEX(INDIRECT(dms_RPT),dms_CRCP_start_row+dms_CRCPlength_Num-1)","v":"2024-25"},"=INDEX(INDIRECT(dms_RPT),dms_CRCP_start_row+dms_CRCPlength_Num-1)","Finds the CRCP final year"]
[null,"PRCP_final_year",{"$f":"INDEX(INDIRECT(dms_RPT),dms_PRCP_start_row+dms_FRCPlength_Num-1)","v":"2019-20"},"=INDEX(INDIRECT(dms_RPT),dms_PRCP_start_row+dms_FRCPlength_Num-1)","Finds the PRCP final year"]
[null,"dms_Reset_final_year",{"$f":"INDEX(INDIRECT(dms_RPT),dms_RYE_start_row)","v":"2029-30"},"=INDEX(INDIRECT(dms_RPT),dms_RYE_start_row)","For Resets and PTRM/RFMs (same as FRCP_final_year)"]
[null,"dms_SpecifiedYear_final_year",{"$f":"FRY","v":"2029-30"},"=FRY","FRY from cover sheet"]
[null,"dms_DollarReal_year",{"$f":"LEFT(CRCP_final_year,2)&RIGHT(CRCP_final_year,2)","v":"2025"},"=LEFT(CRCP_final_year,2)&RIGHT(CRCP_final_year,2)","Uses the value in CRCP_final_year"]
[null,"dms_Previous_DollarReal_year",{"$f":"LEFT(PRCP_final_year,2)&RIGHT(PRCP_final_year,2)","v":"2020"},"=LEFT(PRCP_final_year,2)&RIGHT(PRCP_final_year,2)","Uses the value in PRCP_final_year"]
[null,"dms_CRY_RYE",{"$f":"IFERROR(LEFT(CRY,2)&RIGHT(CRY,2),0)","v":0},"=IFERROR(LEFT(CRY,2)&RIGHT(CRY,2),0)","For ABC single year RINS"]
[null,"dms_Reset_RYE",{"$f":"IF(dms_Model_Span>1,IF(dms_Model=\"RFM\",(LEFT(dms_DollarReal_year,2)&RIGHT(dms_DollarReal_year,2)),(LEFT(dms_Reset_final_year,2)&RIGHT(dms_Reset_final_year,2))),0)","v":"2030"},"=IF(dms_Model_Span>1,IF(dms_Model=\"RFM\",(LEFT(dms_DollarReal_year,2)&RIGHT(dms_DollarReal_year,2)),(LEFT(dms_Reset_final_year,2)&RIGHT(dms_Reset_final_year,2))),0)","If model span > 1 then uses dms_Reset_RYE otherwise it's a multi year ABC and uses dms_Specified_RYE"]
[null,"dms_Specified_RYE",{"$f":"IF(dms_MultiYear_ResponseFlag=\"Yes\",(LEFT(dms_Specified_FinalYear,2)&RIGHT(dms_Specified_FinalYear,2)),0)","v":0},"=IF(dms_MultiYear_ResponseFlag=\"Yes\",(LEFT(dms_Specified_FinalYear,2)&RIGHT(dms_Specified_FinalYear,2)),0)","If multi year ABC - uses dms_Specified_FinalYear"]
[null,"dms_Model_Span",{"$f":"INDEX(dms_Model_Span_List,MATCH(dms_Model,dms_Model_List))","v":5},"=INDEX(dms_Model_Span_List,MATCH(dms_Model,dms_Model_List))","A result of 5 is used to signify that it is more than 1 year span"]
[null,"dms_RYE_result",{"$f":"IF(dms_MultiYear_ResponseFlag=\"yes\",dms_Specified_RYE,(IF(dms_Model_Span>1,dms_Reset_RYE,dms_CRY_RYE)))","v":"2030"},"=IF(dms_MultiYear_ResponseFlag=\"yes\",dms_Specified_RYE,(IF(dms_Model_Span>1,dms_Reset_RYE,dms_CRY_RYE)))","Nested IF - feeds into dms_RYE"]
[null,"dms_Reset_Span",{"$f":"IF(dms_Reset_RYE>0,CONCATENATE(FRCP_y1,\" to \",FRCP_final_year),0)","v":"2025-26 to 2029-30"},"=IF(dms_Reset_RYE>0,CONCATENATE(FRCP_y1,\" to \",FRCP_final_year),0)","Reset span of years as text"]
[null,"dms_SpecifiedYear_Span",{"$f":"IF(dms_Specified_RYE>0,CONCATENATE(CRY,\" to \",dms_Specified_FinalYear),0)","v":0},"=IF(dms_Specified_RYE>0,CONCATENATE(CRY,\" to \",dms_Specified_FinalYear),0)","Multi year ABC span of years as text"]
[null,"dms_Header_Span",{"$f":"IF(dms_MultiYear_Flag=1,dms_SpecifiedYear_Span,IF(dms_Model_Span>1,dms_y1&\" to \"&FRCP_final_year,CRY))","v":"2023-24 to 2029-30"},"=IF(dms_MultiYear_Flag=1,dms_SpecifiedYear_Span,IF(dms_Model_Span>1,dms_Reset_Span,CRY))","NESTED IF - for Sheet Headers"]
[null,"ABC RINS THAT SPAN MULTIPLE YEARS"]
[null,"This is a multi year ABC RIN?","No"]
[null,null,{"$f":"IF(dms_MultiYear_ResponseFlag=\"No\",0,1)","v":0},"dms_MultiYear_Flag","This is set from the answer provided above"]
[null,null,{"$f":"IF(dms_MultiYear_Flag=1,FRY,\"not a Multiple year submission\")","v":"not a Multiple year submission"},"dms_Specified_FinalYear","The result here is returned to dms_CRCP_FinalYear_Result if response to Q in C73 is \"yes\" and dms_MultiYear_Flag is set to 1"]
[null," Start year for 5.2 in Multi year ABC RINS",{"$f":"IFERROR(IF(dms_MultiYear_Flag=1,FRY,CRY),\"not an ABC\")","v":"not an ABC"},"dms_0502_Inst_Year","=IF(dms_MultiYear_Flag=1,FRY,CRY)",null,"For single year RINS this is CRY - multi year RINS need to start a the end of the span of years (ie. FRY)"]
[null,"WHAT IS THE RYE?"]
[null,"Reg Period Lengths"]
[null,"PRCP length in years",{"$f":"INDEX(dms_PRCPlength_List,MATCH(dms_TradingName,dms_TradingName_List))","v":5},"dms_PRCPlength_Num","=INDEX(dms_PRCPlength_List,MATCH(dms_TradingName,dms_TradingName_List))"]
[null,"CRCP length in years",{"$f":"INDEX(dms_CRCPlength_List,MATCH(dms_TradingName,dms_TradingName_List))","v":5},"dms_CRCPlength_Num","=INDEX(dms_CRCPlength_List,MATCH(dms_TradingName,dms_TradingName_List))"]
[null,"FRCP length in years",{"$f":"INDEX(dms_FRCPlength_List,MATCH(dms_TradingName,dms_TradingName_List))","v":5},"dms_FRCPlength_Num","=INDEX(dms_FRCPlength_List,MATCH(dms_TradingName,dms_TradingName_List))"]
[null,"Single year RIN?"]
[null,"Single Year ABC RIN ?",{"$f":"IF(dms_Model=\"EB\",1,0)","v":0},"dms_EB"]
[null,null,{"$f":"IF(dms_Model=\"CA\",1,0)","v":0},"dms_CA","=dms_SingleYear_Model"]
[null,null,{"$f":"IF(dms_Model=\"ARR\",1,0)","v":0},"dms_ARR"]
[null,"Is this a single Year ABC RIN?",{"$f":"IF(SUM(dms_SingleYear_Model)=1,\"yes\",\"no\")","v":"no"},"dms_SingleYearModel","=IF(SUM(dms_SingleYear_Model)=1,\"yes\",\"no\")"]
[null,"Single Year Final Year Result",{"$f":"IF(AND(dms_SingleYearModel=\"yes\",dms_MultiYear_Flag=0),CRY,0)","v":0},"dms_SingleYear_FinalYear_Result","=IFERROR(IF(SUM(dms_SingleYear_Model)<>0,(INDIRECT(dms_SingleYear_FinalYear_Ref)),\"not a single year RIN\"),\"CRY not present\")"]
[null,"Multi year RIN?"]
[]
[null,"Multi Year Reset/Model?",{"$f":"IF(dms_Model_Span>1,\"yes\",\"no\")","v":"yes"}]
[null,"Final year result for Reset/Model",{"$f":"IF(dms_Model_Span>1,dms_Reset_final_year,0)","v":"2029-30"},"dms_MultiYear_FinalYear_Result","dms_CRCP_FinalYear_Result"]
[]
[null,"Multi Year ABC RIN?",{"$f":"IF(dms_MultiYear_Flag=1,\"yes\",\"no\")","v":"no"},"dms_MultiYear_ABC_RIN"]
[null,"Final year result for ABC multi year",{"$f":"IF(dms_MultiYear_Flag=1,C51,0)","v":0}]
[]
[null,"EB RINS"]
[null,"Calendar Year for table 3.6 data",{"$f":"IFERROR(IF(dms_Segment=\"Transmission\",dms_Cal_Year_B4_CRY,CRY),\"CRY not present\")","v":"CRY not present"},"dms_0306_Year","=IF(dms_Segment=\"Transmission\",dms_Cal_Year_B4_CRY,CRY)"]
[null,"CA RINS"]
[null,"Find how many rows in tables 6.3 sustained interruptions?",null,null,"dms_060301_MaxRows only returns a valid value when cover sheet is attached to a CA file"]
[null,null,{"$f":"IF(dms_Model<>\"CA\",\"not a CA\",\"Is a CA\")","v":"not a CA"},null,"=IF(dms_Model<>\"CA\",\"not a CA\",\"Is a CA\")"]
[null,"dms_060301_Avg_Duration_Sustained_Int_Values present?",{"$f":"IFERROR(IF(INDEX(dms_060301_Avg_Duration_Sustained_Int_Values,1,1)<>\"\",\"yes\",\"no\"),\"no\")","v":"no"},"dms_060301_checkvalue","=IFERROR(IF(INDEX(dms_060301_Avg_Duration_Sustained_Int_Values,1,1)<>\"\",\"yes\",\"no\"),\"no\")"]
[null,null,{"$f":"IF(AND(dms_Model=\"CA\",(dms_060301_checkvalue=\"no\")),\"error - NR not present\",\"no errors\")","v":"no errors"},null,"=IF(AND(dms_Model=\"CA\",(dms_060301_checkvalue=\"no\")),\"error - NR not present\",\"no errors\")"]
[null,"Table 6.3.1 - last row reference",{"$f":"IFERROR(IF(dms_Model=\"CA\",LOOKUP(2,1/(dms_060301_Avg_Duration_Sustained_Int_Values<>\"\"),(ROW(dms_060301_Avg_Duration_Sustained_Int_Values))),\"not a CA\"),\"6.3 not present\")","v":"not a CA"},"dms_060301_LastRow","=IFERROR(IF(dms_Model=\"CA\",LOOKUP(2,1/(dms_060301_Avg_Duration_Sustained_Int_Values<>\"\"),(ROW(dms_060301_Avg_Duration_Sustained_Int_Values))),\"not a CA\"),\"6.3 not present\")"]
[null,"Table 6.3.1 - max number rows",{"$f":"IFERROR(IF(dms_Model=\"CA\",(dms_060301_LastRow-15),\"not a CA\"),\"error\")","v":"not a CA"},"dms_060301_MaxRows","=IFERROR(IF(dms_Model=\"CA\",(dms_060301_LastRow-15),\"not a CA\"),\"error\")"]
[null,"Table 6.6.3 - Public lighting repair - no. business days",{"$f":"INDEX(dms_663_List,MATCH(dms_TradingName,dms_TradingName_List))","v":0},"dms_663","=INDEX(dms_663_List,MATCH(dms_TradingName,dms_TradingName_List))"]
[null,"ARR or RESET RINS"]
[null,"How many rows in tables 6.1 or 6.7?  (leap year?)","insert dms_LeapYear NR if required",null,"'dms_LeapYear is used to determine dms_060701_Max_Rows BUT it is only found on worksheet 6.1 or 6.7 and the date value in the cell is used to determine whether it is a leap year"]
[null,"Is dms_LeapYear named range present?",{"$f":"IFERROR(IF(dms_LeapYear,\"yes\"),\"no\")","v":"no"}]
[null,"Table 6.7.1 - includes a leap year?",{"$f":"\nIFERROR(IF(MONTH(DATE(YEAR(dms_LeapYear),2,29))=2,\"is a leap year\",\"not a leap year\"),\n\"dms_LeapYear not present\")","v":"dms_LeapYear not present"},"dms_LeapYear_Result","=IFERROR(IF(MONTH(DATE(YEAR(dms_LeapYear),2,29))=2,\"is a leap year\",\"not a leap year\"),\"dms_LeapYear not present\")"]
[null,"MaxRows if Reset and leap year",{"$f":"IF(dms_LeapYear_Result=\"is a leap year\",1827,1826)","v":1826},"dms_060701_Reset_MaxRows","=IF(dms_LeapYear_Result=\"is a leap year\",1827,1826)",null,null,"number of days present in Reset RIN table"]
[null,"MaxRows if ARR and leap year",{"$f":"IF(dms_LeapYear_Result=\"is a leap year\",366,365)","v":365},"dms_060701_ARR_MaxRows","=IF(dms_LeapYear_Result=\"is a leap year\",366,365)",null,null,"number of days present in ARR RIN table"]
[null,"Table 6.7.1 - Max Rows (leap year/ non leap year)",{"$f":"IF(dms_Model=\"ARR\",dms_060701_ARR_MaxRows,IF(dms_Model=\"Reset\",dms_060701_Reset_MaxRows,\"not a relevant RIN type\"))","v":1826},"dms_060701_MaxRows","=IF(dms_Model=\"ARR\",dms_060701_ARR_MaxRows,IF(dms_Model=\"Reset\",dms_060701_Reset_MaxRows,\"not a relevant RIN type\"))"]
[null,"How many columns in 6.7?   (4 or 5 feeder categories)",{"$f":"IF(dms_FifthFeeder_flag_NSP=\"NO\",\"This NSP has only 4 feeder categories\",\"This NSP has 5 feeder categories\")","v":"This NSP has only 4 feeder categories"}]
[null,"Table 6.7.1 - Last column (# of feeder categories > 4)",{"$f":"IF(dms_FifthFeeder_flag_NSP=\"NO\",10,12)","v":10},"dms_060701_MaxCols","=IF(dms_FifthFeeder_flag_NSP=\"NO\",8,10)"]
[null,"Table 6.7.1 - Number of offset rows",{"$f":"IF(dms_Model=\"ARR\",15,9)","v":9},"dms_060701_OffsetRows","=IF(dms_Model=\"ARR\",15,9)"]
[null,"Start date for telephone answering in 6.1 or 6.7?",null,null,"Using 060101 as naming standard not 060701 for start dates"]
[null,"Table 6.1.1 and 6.7.1 - Start Date as Text",{"$f":"IF(dms_SingleYearModel=\"yes\",(CONCATENATE(IF(LEN(CRY)=4,\"1-Jan-\",\"1-Jul-\"),LEFT(CRY,4))),(CONCATENATE(IF(LEN(PRCP_y4)=4,\"1-Jan-\",\"1-Jul-\"),LEFT(PRCP_y4,4))))","v":"1-Jul-2018"},"dms_060101_StartDateTxt","=IF(SUM(dms_SingleYear_Model)>1,(CONCATENATE(IF(LEN(CRY)=4,\"1-Jan-\",\"1-Jul-\"),LEFT(CRY,4))),(CONCATENATE(IF(LEN(CRCP_y4)=4,\"1-Jan-\",\"1-Jul-\"),LEFT(CRCP_y4,4))))"]
[null,"Table 6.1.1 and 6.7.1 - Start Date as Date Value",{"$f":"DATEVALUE(dms_060701_StartDateTxt)","v":43282},"dms_060101_StartDateVal","=DATEVALUE(dms_060701_StartDateTxt)"]
[null,"ARRs"]
[null,"How many rows in table 6.8?","insert dms_060801_StartCell NR if required",null,"dms_060801_StartCell is only found on worksheet 6.8 and is used to determine the starting date for the date range"]
[null,"Is dms_060801_StartCell named range present?",{"$f":"IFERROR(IF((ROW(dms_060801_StartCell)-1)=1,\"yes\",\"yes\"),\"no\")","v":"no"},"Must be present for ARRs","=IFERROR(IF((ROW(dms_060801_StartCell)-1)=1,\"yes\",\"yes\"),\"no\")"]
[null,"Table 6.8 - Number of offset rows",12,"dms_0608_OffsetRows","=IFERROR(IF(dms_Model=\"ARR\",(ROW(dms_060801_StartCell)-1),\"not an ARR\"),\"6.8 error\")"]
[null,"Table 6.8 - Last row",{"$f":"IFERROR(IF(dms_060801_StartCell<>\"\",IF(dms_Model=\"ARR\",(LOOKUP(2,1/(dms_060801_01_Values<>\"\"),(ROW(dms_060801_01_Values)))),\"not an ARR\"),0),\"0\")","v":"0"},"dms_0608_LastRow","=IFERROR(IF(dms_060801_StartCell<>\"\",IF(dms_Model=\"ARR\",(LOOKUP(2,1/(dms_060801_01_Values<>\"\"),(ROW(dms_060801_01_Values)))),\"not an ARR\"),0),\"0\")"]
[null,"Table 6.8 - MaxRows",{"$f":"IFERROR(IF(dms_Model=\"ARR\",(MAX(0,dms_0608_LastRow-dms_0608_OffsetRows)),\"not an ARR\"),\"0\")","v":"not an ARR"},"dms_060801_MaxRows","=IFERROR(IF(dms_Model=\"ARR\",(MAX(0,dms_0608_LastRow-dms_0608_OffsetRows)),\"not an ARR\"),\"0\")"]
[null,"TNSP RESET RINS"]
[null,"Table 7.9.4 only appears in TNSPs Reset RIN"]
[null,"Table 7.9.4 - first year",{"$f":"LEFT(PRCP_y3,4)","v":"2017"},"dms_070904_Start_Year","=LEFT(PRCP_y3,4)"]
[]
[null,"MISC"]
[null,"Distribution Determination Reference",{"$f":"INDEX(dms_DeterminationRef_List,MATCH(dms_TradingName,dms_TradingName_List))","v":0},"dms_DeterminationRef"]
[null,"Public lighting NSP?",{"$f":"INDEX(dms_Public_Lighting_List,MATCH(dms_TradingName,dms_TradingName_List))","v":"NO"},"dms_Public_Lighting","=INDEX(dms_Public_Lighting_List,MATCH(dms_TradingName,dms_TradingName_List))"]
[null,"CBD Feeder for this business",{"$f":"INDEX(dms_CBD_flag,MATCH(dms_TradingName,dms_TradingName_List))","v":"NO"},"dms_CBD_flag_NSP"]
[null,"Urban Feeder for this business",{"$f":"INDEX(dms_Urban_flag,MATCH(dms_TradingName,dms_TradingName_List))","v":"NO"},"dms_Urban_flag_NSP"]
[null,"Short rural Feeder for this business",{"$f":"INDEX(dms_ShortRural_flag,MATCH(dms_TradingName,dms_TradingName_List))","v":"NO"},"dms_ShortRural_flag_NSP"]
[null,"Long rural Feeder for this business",{"$f":"INDEX(dms_LongRural_flag,MATCH(dms_TradingName,dms_TradingName_List))","v":"NO"},"dms_LongRural_flag_NSP"]
[null,"Fifth Feeder Category (eg. TasNetworks (D))",{"$f":"INDEX(dms_FeederType_5_flag,MATCH(dms_TradingName,dms_TradingName_List))","v":"NO"},"dms_FifthFeeder_flag_NSP","=INDEX(dms_FeederType_5_flag,MATCH(dms_TradingName,dms_TradingName_List))"]
[]
[null,"DISCARD FILES"]
[null,"discard this record?","NO","dms_DISCARD","If record is to be discarded from DB set this flag to YES"]
[]
[null,"SUBSET FILES"]
[null,"Is this Submission File a Subset File","NO","dms_Partial"]
[]
[]
[null,"REGULATORY YEARS FOR MULTI RYE SUBMISSIONS"]
[null,"Multiple RYE flag","NO","dms_Multi_RYE_flag"]
[null,null,"Manually specify RYE","Named ranges to apply"]
[null,null,2013,"dms_RYE_01"]
[null,null,2014,"dms_RYE_02"]
[null,null,2015,"dms_RYE_03"]
[null,null,2016,"dms_RYE_04"]
[null,null,2017,"dms_RYE_05"]
[null,null,2018,"dms_RYE_06"]
[null,null,2019,"dms_RYE_07"]
[null,null,2020,"dms_RYE_08"]
[null,null,2021,"dms_RYE_09"]