{"text_format":"1","workbook":"xlsx","n_sheets":18,"sheets":["Draft Decision changes","Cover page","Version Control","Intro",">>General inputs","Cost Escalations","Ratios & Assumptions","Overheads",">>Volumes","EGX - Yearly volume scenarios",">>Unit Rates","EGX Unit Rates",">>Forecast capex","EGX - Forecast capex scenarios","EGX - Gross Capex",">>Forecast opex","EGX - Opex BST","EGX - Forecast Opex"],"not_rendered":{"charts":0,"images":2,"macros":1,"external_links":3,"defined_names":24,"comments":2,"pivot_tables":0},"unopened":[],"bounds":{"document_bytes":16777216,"sheet_cells":100000,"rows_first":2000,"rows_last":500,"rows_between":2000,"halvings":0,"cell_chars":16384,"cell_head_chars":4096},"cells_cut":0,"cells_raw":0,"read":"whole","date_system":"1900"}

{"sheet":"Draft Decision changes","index":0,"n_rows":3,"n_cols":2,"rows_kept":3,"cut":false,"hidden":false,"merged":[]}
["Cells","Decription of changes"]
[" 'Cost Escalations' - row 3 ","Updated actual CPI in cells E3:F3 and forecast CPI in cell G3."]
[" 'Cost Escalations' - row 29","Substituted with our labour escalators consistent with ANS."]

{"sheet":"Cover page","index":1,"n_rows":3,"n_cols":1,"rows_kept":3,"cut":false,"hidden":false,"merged":[[1,0,1,5],[2,0,2,5]]}
[]
["Energex Public Lighting Capex and Opex Forecasting Model"]
["2025-30"]

{"sheet":"Version Control","index":2,"n_rows":6,"n_cols":4,"rows_kept":6,"cut":false,"hidden":false,"merged":[]}
["RDP2025 Project: Public Lighting Expenditure Analysis Model"]
[]
[]
[null,"Date","Version","Description of any updates made"]
[null,"2024-01-31","V1","Version submitted to the AER"]
[null,"2024-08-21","V2","AER - updated inflation figures and labour escalators"]

{"sheet":"Intro","index":3,"n_rows":15,"n_cols":3,"rows_kept":15,"cut":false,"hidden":false,"merged":[]}
["Model developer ","Energex"]
[]
[]
[]
["Purpose","To provide capex and opex forecasts based on the 100% LED deployment during 2025-30 regulatory period.  "]
[]
["Colour chart","Data","Cells containing hard coded data"]
[null,null,"Cell containing formula"]
[null,null,"Cells to remain empty (non-applicable input/output)"]
[null,"Assumptions","Cells containing assumptions intended to be manipulated by model users"]
[null,"Text","Important notes providing details"]
[null,null,"Cell highlighting particular attention"]
[null,"Header 1","Fist header"]
[null,"Header 2","Second header"]
[null,"Header 3","Third hearder"]
{"$rows_left_out":1}
{"sheet":">>General inputs","index":4,"n_rows":0,"n_cols":0,"rows_kept":0,"cut":false,"hidden":false,"merged":[]}

{"sheet":"Cost Escalations","index":5,"n_rows":30,"n_cols":12,"rows_kept":30,"cut":false,"hidden":false,"merged":[]}
[null,"2019-20","2020-21","2021-22","2022-23","2023-24","2024-25"]
[null,"2020-06-01","2021-06-01","2022-06-01","2023-06-01","2024-06-01","2025-06-01"]
["Inflation",-3.4843205574912606E-3,3.8461538461538325E-2,6.1447811447811418E-2,0.06,3.7999999999999999E-2,2.8000000000000001E-2,null,null,"Sources used",null,"https://www.rba.gov.au/publications/smp/2024/aug/"]
[null,null,null,null,null,null,null,null,null,null,null,"https://www.abs.gov.au/statistics/economy/price-indexes-and-inflation/consumer-price-index-australia/jun-quarter-2024"]
["Real to Real"]
[null,"2020-06-01","2021-06-01","2022-06-01","2023-06-01","2024-06-01","2025-06-01"]
["2020-06-01",{"$f":"IF(AND($A7>B$6,ISNONTEXT($A7)),C7/(1+C$3),IF(AND($A7=B$6,B$6=B$2),1,IF(AND($A7<B$6,B$6=B$2),#REF!*(1+B$3),0)))","v":1},{"$f":"IF(AND($A7>C$6,ISNONTEXT($A7)),D7/(1+D$3),IF(AND($A7=C$6,C$6=C$2),1,IF(AND($A7<C$6,C$6=C$2),B7*(1+C$3),0)))","v":1.0384615384615383},1.1022727272727271,1.1684090909090907,1.2128086363636361,{"$f":"IF(AND($A7>G$6,ISNONTEXT($A7)),'EGX - Gross Capex'!P8/(1+'EGX - Gross Capex'!P$4),IF(AND($A7=G$6,G$6=G$2),1,IF(AND($A7<G$6,G$6=G$2),F7*(1+G$3),0)))","v":1.246767278181818}]
["2021-06-01",{"$f":"IF(AND($A8>B$6,ISNONTEXT($A8)),C8/(1+C$3),IF(AND($A8=B$6,B$6=B$2),1,IF(AND($A8<B$6,B$6=B$2),#REF!*(1+B$3),0)))","v":0.96296296296296313},1,1.0614478114478114,1.1251346801346802,1.1678897979797982,{"$f":"IF(AND($A8>G$6,ISNONTEXT($A8)),'EGX - Gross Capex'!P10/(1+'EGX - Gross Capex'!P$4),IF(AND($A8=G$6,G$6=G$2),1,IF(AND($A8<G$6,G$6=G$2),F8*(1+G$3),0)))","v":1.2005907123232327}]
["2022-06-01",{"$f":"IF(AND($A9>B$6,ISNONTEXT($A9)),C9/(1+C$3),IF(AND($A9=B$6,B$6=B$2),1,IF(AND($A9<B$6,B$6=B$2),#REF!*(1+B$3),0)))","v":0.90721649484536093},0.94210943695479776,1,1.06,{"$f":"IF(AND($A9>F$6,ISNONTEXT($A9)),G9/(1+G$3),IF(AND($A9=F$6,F$6=F$2),1,IF(AND($A9<F$6,F$6=F$2),E9*(1+F$3),0)))","v":1.1002800000000001},{"$f":"IF(AND($A9>G$6,ISNONTEXT($A9)),'EGX - Gross Capex'!#REF!/(1+'EGX - Gross Capex'!P$4),IF(AND($A9=G$6,G$6=G$2),1,IF(AND($A9<G$6,G$6=G$2),F9*(1+G$3),0)))","v":1.1310878400000002}]
["2023-06-01",{"$f":"IF(AND($A10>B$6,ISNONTEXT($A10)),C10/(1+C$3),IF(AND($A10=B$6,B$6=B$2),1,IF(AND($A10<B$6,B$6=B$2),#REF!*(1+B$3),0)))","v":0.85586461777864231},0.88878248769320534,0.94339622641509424,1,1.038,{"$f":"IF(AND($A10>G$6,ISNONTEXT($A10)),'EGX - Gross Capex'!P12/(1+'EGX - Gross Capex'!P$4),IF(AND($A10=G$6,G$6=G$2),1,IF(AND($A10<G$6,G$6=G$2),F10*(1+G$3),0)))","v":1.067064}]
["2024-06-01",{"$f":"IF(AND($A11>B$6,ISNONTEXT($A11)),C11/(1+C$3),IF(AND($A11=B$6,B$6=B$2),1,IF(AND($A11<B$6,B$6=B$2),#REF!*(1+B$3),0)))","v":0.82453238706998289},0.8562451711880591,0.908859563020322,0.96339113680154143,1,{"$f":"IF(AND($A11>G$6,ISNONTEXT($A11)),'EGX - Gross Capex'!P20/(1+'EGX - Gross Capex'!P$4),IF(AND($A11=G$6,G$6=G$2),1,IF(AND($A11<G$6,G$6=G$2),F11*(1+G$3),0)))","v":1.028}]
["2025-06-01",{"$f":"IF(AND($A12>B$6,ISNONTEXT($A12)),C12/(1+C$3),IF(AND($A12=B$6,B$6=B$2),1,IF(AND($A12<B$6,B$6=B$2),#REF!*(1+B$3),0)))","v":0.80207430648831024},0.83292331827632204,0.88410463328825095,0.93715091128554606,0.97276264591439687,{"$f":"IF(AND($A12>G$6,ISNONTEXT($A12)),'EGX - Gross Capex'!P21/(1+'EGX - Gross Capex'!P$4),IF(AND($A12=G$6,G$6=G$2),1,IF(AND($A12<G$6,G$6=G$2),F12*(1+G$3),0)))","v":1}]
[]
["Nominal to Real"]
[null,"2020-06-01","2021-06-01","2022-06-01","2023-06-01","2024-06-01","2025-06-01"]
{"$rows_left_out":16}
{"sheet":"Ratios & Assumptions","index":6,"n_rows":16,"n_cols":4,"rows_kept":16,"cut":false,"hidden":false,"merged":[[1,2,1,3]]}
["Table 1 - EGX ratios between major and minor roads"]
[null,null,"2025-26"]
["DNSP","Road type","Volume","Ratio"]
["Energex","Major",{"$f":"SUMIF('EGX - Yearly volume scenarios'!$C$5:$C$12,'Ratios & Assumptions'!$B4,'EGX - Yearly volume scenarios'!$G$5:$G$12)","v":97805},{"$f":"C4/$C$6","v":0.2849995337669301}]
["Energex","Minor",{"$f":"SUMIF('EGX - Yearly volume scenarios'!$C$5:$C$12,'Ratios & Assumptions'!$B5,'EGX - Yearly volume scenarios'!$G$5:$G$12)","v":245371},{"$f":"C5/$C$6","v":0.7150004662330699}]
["Energex","All",{"$f":"SUM(C4:C5)","v":343176},{"$f":"SUM(D4:D5)","v":1}]
["Note:"]
["Allocation based on actual 2021-22 volumes"]
["Used to allocate expenditure between major and minor road types where the breakdown is not available"]
[]
["Table 2 - EGX estimated annual growth rates"]
["DNSP","Road","Rate","Rate"]
["All","All ",1,2.5000000000000001E-2]
["All","All ",2,1.4999999999999999E-2]
["Note:"]
{"$rows_left_out":2}
{"sheet":"Overheads","index":7,"n_rows":29,"n_cols":4,"rows_kept":29,"cut":false,"hidden":false,"merged":[]}
["Table 1 - EGX Labour Oncosts"]
["DNSP","Cost type","Cost recovery","FY2023"]
["Energex","Labour Oncosts","Labour only",0]
["Energex","All","All",{"$f":"SUM(D3)","v":0}]
[]
["Table 2 - EGX Material Oncosts"]
["DNSP","Cost type","Cost recovery","FY2023"]
["Energex","Material Oncosts","Material only",8.716716242153344E-2]
["Energex","All","All",{"$f":"SUM(D8)","v":8.716716242153344E-2}]
[]
["Table 3 - EGX Fleet Oncosts"]
["DNSP","Cost type","Cost recovery","FY2023"]
["Energex","Fleet Oncost Indirects","Labour only",0.12669576075036793]
["Energex","Fleet Oncost Depreciation","Labour only",8.4944584136218471E-2]
["Energex","All","All",{"$f":"SUM(D13:D14)","v":0.2116403448865864}]
{"$rows_left_out":15}
{"sheet":">>Volumes","index":8,"n_rows":0,"n_cols":0,"rows_kept":0,"cut":false,"hidden":false,"merged":[]}

{"sheet":"EGX - Yearly volume scenarios","index":9,"n_rows":109,"n_cols":16,"rows_kept":109,"cut":false,"hidden":false,"merged":[[23,10,23,14],[23,5,23,9],[98,0,98,3],[1,5,1,9],[92,5,92,9],[38,5,38,9],[22,10,22,14],[37,10,37,14],[95,0,95,3],[92,10,92,14],[1,10,1,14],[71,5,71,9],[71,10,71,14],[70,10,70,14],[91,10,91,14],[38,10,38,14],[51,5,51,9],[51,10,51,14],[61,5,61,9],[61,10,61,14],[50,10,50,14],[60,10,60,14]]}
["Table 1 - EGX Total public lighting asset base by tariffs to be converted from CONV to LED- yearly data as at 30 June",null,null,null,null,null,null,null,null,null,"100%  LED deployment by 2030"]
["1.a - Number of public lights for LED conversion",null,null,null,"Previous period","Current period",null,null,null,null,"Forthcoming period"]
[null,null,null,null,"Actual","Actual","Actual","Forecast","Forecast","Forecast","Forecast","Forecast","Forecast","Forecast","Forecast"]
["DNSP","Rate","Road type","Light type","2019-20","2020-21","2021-22","2022-23","2023-24","2024-25","2025-26","2026-27","2027-28","2028-29","2029-30"]
["Energex",1,"Major","CONV",39166,38542,38010,32565,25403,19811,17899,13391,9719,6071,0]
["Energex",1,"Major","LED",1477,2306,3113,8558,15720,21312,23224,27732,31404,35052,41123]
["Energex",1,"Minor","CONV",104697,102204,95466,81790,63801,49755,44844,33549,24351,15211,0,"Removes the Nostalgia  as these are to be converted to LED (see Table 3 below)"]
["Energex",1,"Minor","LED",4798,7287,13986,27662,45651,59697,64608,75903,85101,94241,109452]
["Energex",2,"Major","CONV",52820,52615,52158,49902,44915,40417,36516,27319,19829,12387,0]
["Energex","2A","Major","LED",2101,3389,4524,6780,11767,16265,20166,29363,36853,44295,56682]
["Energex",2,"Minor","CONV",126472,125346,115984,110967,99877,89874,73032,54638,39657,24772,0,"Removes the Nostalgia  as these are to be converted to LED (see Table 3 below)"]
["Energex","2A","Minor","LED",6059,8985,19935,24952,36042,46045,62887,81281,96262,111147,135919]
["Energex","All","All","CONV",{"$f":"E5+E7+E9+E11","v":323155},318707,301618,275224,233996,199857,172291,128897,93556,58441,0]
["Energex","All","All","LED",{"$f":"E6+E8+E10+E12","v":14435},{"$f":"F6+F8+F10+F12","v":21967},{"$f":"G6+G8+G10+G12","v":41558},67952,109180,143319,170885,214279,249620,284735,343176]
["Energex","All","All","All",{"$f":"E13+E14","v":337590},{"$f":"F13+F14","v":340674},343176,343176,343176,343176,{"$f":"SUM(K5:K12)","v":343176},{"$f":"SUM(L5:L12)","v":343176},{"$f":"SUM(M5:M12)","v":343176},{"$f":"SUM(N5:N12)","v":343176},{"$f":"SUM(O5:O12)","v":343176}]
{"$rows_left_out":95}
{"sheet":">>Unit Rates","index":10,"n_rows":0,"n_cols":0,"rows_kept":0,"cut":false,"hidden":false,"merged":[]}

{"sheet":"EGX Unit Rates","index":11,"n_rows":31,"n_cols":4,"rows_kept":31,"cut":false,"hidden":false,"merged":[]}
["Table 1: Energex Public Light - Unit costs per luminaire"]
[null,null,null,"Unit cost"]
["Activity type","Asset type","Cost categories","$2022-23 "]
[null,null,null,"Actual"]
["Light installation","steel underground decorative minor (typically Rate 2)","Labour","N/A"]
[null,null,"Material","N/A"]
[null,null,"Contractor","N/A"]
[null,"Rate 1 Minor LED install","Labour",506.2196263223293]
[null,null,"Material",841.11606018807208]
[null,null,"Contractor",3510.0585400868404]
[null,"Rate 1 Major LED install","Labour",856.48872629500556]
[null,null,"Material",3433.5610582571344]
[null,null,"Contractor",5938.7771866151279]
[null,"wood pole minor (Rate 1 and 2)","Labour","N/A"]
[null,null,"Material","N/A"]
{"$rows_left_out":17}
{"sheet":">>Forecast capex","index":12,"n_rows":0,"n_cols":0,"rows_kept":0,"cut":false,"hidden":false,"merged":[]}

{"sheet":"EGX - Forecast capex scenarios","index":13,"n_rows":147,"n_cols":11,"rows_kept":147,"cut":false,"hidden":false,"merged":[[2,5,2,9],[29,5,29,9],[58,5,58,9],[86,5,86,9],[101,5,101,9]]}
[]
["Table 1 - EGX Light Replacement Capex - CONV to LED"]
["Real $2022-23",null,null,null,null,"100%  LED deployment by 2030"]
[null,null,null,null,null,"Forecast","Forecast","Forecast","Forecast","Forecast"]
["DNSP","Rate","Road type","Light type","Cost category","2025-26","2026-27","2027-28","2028-29","2029-30"]
["Energex",1,"Major","LED","Labour",{"$f":"'EGX Unit Rates'!$D23*'EGX - Yearly volume scenarios'!K$42","v":0},{"$f":"'EGX Unit Rates'!$D23*'EGX - Yearly volume scenarios'!L$42","v":0},{"$f":"'EGX Unit Rates'!$D23*'EGX - Yearly volume scenarios'!M$42","v":0},{"$f":"'EGX Unit Rates'!$D23*'EGX - Yearly volume scenarios'!N$42","v":0},{"$f":"'EGX Unit Rates'!$D23*'EGX - Yearly volume scenarios'!O$42","v":0}]
[null,1,"Major","LED","Material",{"$f":"'EGX Unit Rates'!$D24*'EGX - Yearly volume scenarios'!K$42","v":2313808},{"$f":"'EGX Unit Rates'!$D24*'EGX - Yearly volume scenarios'!L$42","v":2313808},{"$f":"'EGX Unit Rates'!$D24*'EGX - Yearly volume scenarios'!M$42","v":2313808},{"$f":"'EGX Unit Rates'!$D24*'EGX - Yearly volume scenarios'!N$42","v":2313808},{"$f":"'EGX Unit Rates'!$D24*'EGX - Yearly volume scenarios'!O$42","v":2313808}]
[null,1,"Major","LED","Contractor",{"$f":"'EGX Unit Rates'!$D25*'EGX - Yearly volume scenarios'!K$42","v":297150},{"$f":"'EGX Unit Rates'!$D25*'EGX - Yearly volume scenarios'!L$42","v":297150},{"$f":"'EGX Unit Rates'!$D25*'EGX - Yearly volume scenarios'!M$42","v":297150},{"$f":"'EGX Unit Rates'!$D25*'EGX - Yearly volume scenarios'!N$42","v":297150},{"$f":"'EGX Unit Rates'!$D25*'EGX - Yearly volume scenarios'!O$42","v":297150}]
["Energex",1,"Minor","LED","Labour",{"$f":"'EGX Unit Rates'!$D26*'EGX - Yearly volume scenarios'!K$43","v":0},{"$f":"'EGX Unit Rates'!$D26*'EGX - Yearly volume scenarios'!L$43","v":0},{"$f":"'EGX Unit Rates'!$D26*'EGX - Yearly volume scenarios'!M$43","v":0},{"$f":"'EGX Unit Rates'!$D26*'EGX - Yearly volume scenarios'!N$43","v":0},{"$f":"'EGX Unit Rates'!$D26*'EGX - Yearly volume scenarios'!O$43","v":0}]
[null,1,"Minor","LED","Material",{"$f":"'EGX Unit Rates'!$D27*'EGX - Yearly volume scenarios'!K$43","v":1960347},{"$f":"'EGX Unit Rates'!$D27*'EGX - Yearly volume scenarios'!L$43","v":1960347},{"$f":"'EGX Unit Rates'!$D27*'EGX - Yearly volume scenarios'!M$43","v":1960347},{"$f":"'EGX Unit Rates'!$D27*'EGX - Yearly volume scenarios'!N$43","v":1960347},{"$f":"'EGX Unit Rates'!$D27*'EGX - Yearly volume scenarios'!O$43","v":1960347}]
[null,1,"Minor","LED","Contractor",{"$f":"'EGX Unit Rates'!$D28*'EGX - Yearly volume scenarios'!K$43","v":746325},{"$f":"'EGX Unit Rates'!$D28*'EGX - Yearly volume scenarios'!L$43","v":746325},{"$f":"'EGX Unit Rates'!$D28*'EGX - Yearly volume scenarios'!M$43","v":746325},{"$f":"'EGX Unit Rates'!$D28*'EGX - Yearly volume scenarios'!N$43","v":746325},{"$f":"'EGX Unit Rates'!$D28*'EGX - Yearly volume scenarios'!O$43","v":746325}]
["Energex","2A","Major","LED","Labour",{"$f":"'EGX Unit Rates'!$D23*'EGX - Yearly volume scenarios'!K$44","v":0},{"$f":"'EGX Unit Rates'!$D23*'EGX - Yearly volume scenarios'!L$44","v":0},{"$f":"'EGX Unit Rates'!$D23*'EGX - Yearly volume scenarios'!M$44","v":0},{"$f":"'EGX Unit Rates'!$D23*'EGX - Yearly volume scenarios'!N$44","v":0},{"$f":"'EGX Unit Rates'!$D23*'EGX - Yearly volume scenarios'!O$44","v":0}]
[null,"2A","Major","LED","Material",{"$f":"'EGX Unit Rates'!$D24*'EGX - Yearly volume scenarios'!K$44","v":4720472},{"$f":"'EGX Unit Rates'!$D24*'EGX - Yearly volume scenarios'!L$44","v":4720472},{"$f":"'EGX Unit Rates'!$D24*'EGX - Yearly volume scenarios'!M$44","v":4720472},{"$f":"'EGX Unit Rates'!$D24*'EGX - Yearly volume scenarios'!N$44","v":4720472},{"$f":"'EGX Unit Rates'!$D24*'EGX - Yearly volume scenarios'!O$44","v":4720472}]
[null,"2A","Major","LED","Contractor",{"$f":"'EGX Unit Rates'!$D25*'EGX - Yearly volume scenarios'!K$44","v":606225},{"$f":"'EGX Unit Rates'!$D25*'EGX - Yearly volume scenarios'!L$44","v":606225},{"$f":"'EGX Unit Rates'!$D25*'EGX - Yearly volume scenarios'!M$44","v":606225},{"$f":"'EGX Unit Rates'!$D25*'EGX - Yearly volume scenarios'!N$44","v":606225},{"$f":"'EGX Unit Rates'!$D25*'EGX - Yearly volume scenarios'!O$44","v":606225}]
["Energex","2A","Minor","LED","Labour",{"$f":"'EGX Unit Rates'!$D26*'EGX - Yearly volume scenarios'!K$45","v":0},{"$f":"'EGX Unit Rates'!$D26*'EGX - Yearly volume scenarios'!L$45","v":0},{"$f":"'EGX Unit Rates'!$D26*'EGX - Yearly volume scenarios'!M$45","v":0},{"$f":"'EGX Unit Rates'!$D26*'EGX - Yearly volume scenarios'!N$45","v":0},{"$f":"'EGX Unit Rates'!$D26*'EGX - Yearly volume scenarios'!O$45","v":0}]
{"$rows_left_out":133}
{"sheet":"EGX - Gross Capex","index":14,"n_rows":82,"n_cols":8,"rows_kept":82,"cut":false,"hidden":false,"merged":[[1,1,1,5],[36,1,36,5],[59,1,59,5]]}
["1 - This tables applies the oncosts and overheads to the capex (direct cost) for both RATE 1 and RATE 2A LED conversions funded by Energex"]
[null,"100%  LED deployment by 2030"]
[null,"2025-26","2026-27","2027-28","2028-29","2029-30"]
["Direct Costs ($Real 2024-25)"]
["Labour",{"$f":"'EGX - Forecast capex scenarios'!F144*'Cost Escalations'!$E$21*(1+'Cost Escalations'!B30)","v":459559.36224893975},{"$f":"'EGX - Forecast capex scenarios'!G144*'Cost Escalations'!$E$21*(1+'Cost Escalations'!C30)","v":473690.97108932381},{"$f":"'EGX - Forecast capex scenarios'!H144*'Cost Escalations'!$E$21*(1+'Cost Escalations'!D30)","v":487371.55813236028},{"$f":"'EGX - Forecast capex scenarios'!I144*'Cost Escalations'!$E$21*(1+'Cost Escalations'!E30)","v":503260.38362324622},{"$f":"'EGX - Forecast capex scenarios'!J144*'Cost Escalations'!$E$21*(1+'Cost Escalations'!F30)","v":520382.91745841986}]
["Contractors",{"$f":"'EGX - Forecast capex scenarios'!F146*'Cost Escalations'!$E$21*(1+'Cost Escalations'!B26)","v":8751669.5560389645},{"$f":"'EGX - Forecast capex scenarios'!G146*'Cost Escalations'!$E$21*(1+'Cost Escalations'!C26)","v":8879906.1071561426},{"$f":"'EGX - Forecast capex scenarios'!H146*'Cost Escalations'!$E$21*(1+'Cost Escalations'!D26)","v":9000576.4398324415},{"$f":"'EGX - Forecast capex scenarios'!I146*'Cost Escalations'!$E$21*(1+'Cost Escalations'!E26)","v":9157238.149061393},{"$f":"'EGX - Forecast capex scenarios'!J146*'Cost Escalations'!$E$21*(1+'Cost Escalations'!F26)","v":9331713.4856938627}]
["Materials",{"$f":"'EGX - Forecast capex scenarios'!F145*'Cost Escalations'!$E$21","v":21069533.73329065},{"$f":"'EGX - Forecast capex scenarios'!G145*'Cost Escalations'!$E$21","v":21100559.026961233},{"$f":"'EGX - Forecast capex scenarios'!H145*'Cost Escalations'!$E$21","v":21131584.320631817},{"$f":"'EGX - Forecast capex scenarios'!I145*'Cost Escalations'!$E$21","v":21166381.757539589},{"$f":"'EGX - Forecast capex scenarios'!J145*'Cost Escalations'!$E$21","v":21201179.194447357}]
["Total Direct Costs",{"$f":"SUM(B5:B7)","v":30280762.651578553},30454156.105206698,30619532.318596616,30826880.290224228,31053275.59759964]
[]
["Overheads & Oncosts",null,null,null,null,null,null,"Note: application of the overhead and on-cost rates in accordance with the EQL's Cost Allocation Methodology"]
["Fleet oncost",{"$f":"B5*Overheads!$D$15","v":97261.301922225306},{"$f":"C5*Overheads!$D$15","v":100252.12049100651},{"$f":"D5*Overheads!$D$15","v":103147.48465104571},{"$f":"E5*Overheads!$D$15","v":106510.20115777961},{"$f":"F5*Overheads!$D$15","v":110134.020123988}]
["Material oncosts",{"$f":"B7*Overheads!$D$9","v":1836571.469075724},{"$f":"C7*Overheads!$D$9","v":1839275.8558882833},{"$f":"D7*Overheads!$D$9","v":1841980.2427008429},{"$f":"E7*Overheads!$D$9","v":1845013.4365356357},{"$f":"F7*Overheads!$D$9","v":1848046.6303704283}]
["Network overheads",{"$f":"(B8+B11+B12)*Overheads!$D$19","v":6406450.1228632489},{"$f":"(C8+C11+C12)*Overheads!$D$19","v":6442065.1149643352},{"$f":"(D8+D11+D12)*Overheads!$D$19","v":6476066.7522200132},{"$f":"(E8+E11+E12)*Overheads!$D$19","v":6518573.5570064802},{"$f":"(F8+F11+F12)*Overheads!$D$19","v":6564920.1910598576}]
["Non-network overheads",{"$f":"B5*Overheads!$D$20","v":201513.83300174653},{"$f":"C5*Overheads!$D$20","v":207710.45284639802},{"$f":"D5*Overheads!$D$20","v":213709.30252550208},{"$f":"E5*Overheads!$D$20","v":220676.45060164088},{"$f":"F5*Overheads!$D$20","v":228184.57187446757}]
["Non-network depreciation",{"$f":"B5*Overheads!$D$25","v":67585.155204382303},{"$f":"C5*Overheads!$D$25","v":69663.422029566937},{"$f":"D5*Overheads!$D$25","v":71675.359277599389},{"$f":"E5*Overheads!$D$25","v":74012.051389716944},{"$f":"F5*Overheads!$D$25","v":76530.178974104259}]
{"$rows_left_out":68}
{"sheet":">>Forecast opex","index":15,"n_rows":0,"n_cols":0,"rows_kept":0,"cut":false,"hidden":false,"merged":[]}

{"sheet":"EGX - Opex BST","index":16,"n_rows":39,"n_cols":9,"rows_kept":39,"cut":false,"hidden":false,"merged":[]}
["Energex - Factors for the Base Step Trend Approach used to derive forecast opex"]
[]
["Table 1: Forecast Volume of LED and CONV Lights"]
["Volumes","2021-22","2022-23","2024-25","2025-26","2026-27","2027-28","2028-29","2029-30"]
["Conventional",null,null,null,{"$f":"'EGX - Yearly volume scenarios'!K83","v":172291},{"$f":"'EGX - Yearly volume scenarios'!L83","v":128897},{"$f":"'EGX - Yearly volume scenarios'!M83","v":93556},{"$f":"'EGX - Yearly volume scenarios'!N83","v":58441},{"$f":"'EGX - Yearly volume scenarios'!O83","v":0}]
["LED",null,null,null,{"$f":"'EGX - Yearly volume scenarios'!K84+'EGX - Yearly volume scenarios'!K104","v":184781},{"$f":"'EGX - Yearly volume scenarios'!L84+'EGX - Yearly volume scenarios'!L104","v":228876},{"$f":"'EGX - Yearly volume scenarios'!M84+'EGX - Yearly volume scenarios'!M104","v":264931},{"$f":"'EGX - Yearly volume scenarios'!N84+'EGX - Yearly volume scenarios'!N104","v":300775},{"$f":"'EGX - Yearly volume scenarios'!O84+'EGX - Yearly volume scenarios'!O104","v":359959}]
["Total",null,null,null,{"$f":"SUM(E5:E6)","v":357072},{"$f":"SUM(F5:F6)","v":357773},{"$f":"SUM(G5:G6)","v":358487},{"$f":"SUM(H5:H6)","v":359216},{"$f":"SUM(I5:I6)","v":359959}]
[]
["Table 2: Base Step Trend approach"]
["2a: Forecast Price Change"]
["Rate","2021-22","2022-23","2024-25","2025-26","2026-27","2027-28","2028-29","2029-30"]
["Labour",null,null,null,{"$f":"'Cost Escalations'!B29","v":1.4816502818954524E-2},{"$f":"'Cost Escalations'!C29","v":9.8611007932502479E-3},{"$f":"'Cost Escalations'!D29","v":8.4436518056068104E-3},{"$f":"'Cost Escalations'!E29","v":1.0512472688202901E-2},{"$f":"'Cost Escalations'!F29","v":1.2367452017459594E-2}]
["Contractor",null,null,null,{"$f":"'Cost Escalations'!B25","v":1.0500000000000001E-2},{"$f":"'Cost Escalations'!C25","v":7.1000000000000004E-3},{"$f":"'Cost Escalations'!D25","v":6.1000000000000004E-3},{"$f":"'Cost Escalations'!E25","v":9.1999999999999998E-3},{"$f":"'Cost Escalations'!F25","v":1.09E-2}]
["Materials/other",null,null,null,0,0,0,0,0]
[]
{"$rows_left_out":25}
{"sheet":"EGX - Forecast Opex","index":17,"n_rows":37,"n_cols":8,"rows_kept":37,"cut":false,"hidden":false,"merged":[]}
["Table 1 - Opex Direct Costs","Actual","Forecast "]
["Opex Direct Costs","2022-23","2024-25","2025-26","2026-27","2027-28","2028-29","2029-30"]
["Maintenance","Adjusted"]
["   Labour",871863.59000000008,{"$f":"B4*'Cost Escalations'!$E$21","v":957837.73434309382}]
["   Contractor",6530695.4500000011,{"$f":"B5*'Cost Escalations'!$E$21","v":7174684.899403532}]
["   Materials",1898621.2599999998,{"$f":"B6*'Cost Escalations'!$E$21","v":2085843.5963061948}]
["   Other",1011.36,{"$f":"B7*'Cost Escalations'!$E$21","v":1111.089833451161}]
["Damage/Emergency"]
["   Labour",554577.46,{"$f":"B9*'Cost Escalations'!$E$21","v":609264.13707005209}]
["   Contractor",1368158.03,{"$f":"B10*'Cost Escalations'!$E$21","v":1503071.5844877872}]
["   Materials",476783.69000000006,{"$f":"B11*'Cost Escalations'!$E$21","v":523799.15234370553}]
["Other",7016.1100000000006,{"$f":"B12*'Cost Escalations'!$E$21","v":7707.9659976418152}]
["Total direct opex",11708726.949999999,{"$f":"SUM(C4:C12)","v":12863320.159785459}]
["Adjustments (material costs)"]
["LED Lamps",-700000,{"$f":"B15*'Cost Escalations'!$E$21","v":-769026.73965335067}]
{"$rows_left_out":22}