{"text_format":"1","workbook":"xlsx","n_sheets":10,"sheets":["AER CF","AER NRs","AER lookups","AER ETL","Instructions","CONTENTS","Business & other details","N1. Demand","S1.1 Customer numbers","S1.2 Customer numbers"],"not_rendered":{"charts":0,"images":5,"macros":1,"external_links":0,"defined_names":757,"comments":1,"pivot_tables":0},"unopened":[],"bounds":{"document_bytes":16777216,"sheet_cells":100000,"rows_first":2000,"rows_last":500,"rows_between":2000,"halvings":0,"cell_chars":16384,"cell_head_chars":4096},"cells_cut":0,"cells_raw":0,"read":"whole","date_system":"1900"}

{"sheet":"AER CF","index":0,"n_rows":76,"n_cols":25,"rows_kept":76,"cut":false,"hidden":true,"merged":[[41,38,41,59],[41,69,41,90],[3,1,3,22],[39,38,39,59],[39,69,39,90],[40,38,40,59],[40,69,40,90]]}
[null,"AER CONDITIONAL FORMATTING"]
[]
[null,"CELLS FLAGED \"Y\" and greyed out will be greyed out in the worksheets."]
[null,"CONDITIONAL FORMATTING MAP"]
[null,null,null,null,null,"=INDEX(dms_CF_3.6.1, MATCH(dms_TradingName,dms_CF_TradingName))=\"Y\"","=INDEX(dms_CF_3.6.5, MATCH(dms_TradingName,dms_CF_TradingName))=\"Y\"","=INDEX(dms_CF_3.6.6.1, MATCH(dms_TradingName,dms_CF_TradingName))=\"Y\"","=INDEX(dms_CF_3.6.6.2, MATCH(dms_TradingName,dms_CF_TradingName))=\"Y\"","=INDEX(dms_CF_3.6.6.3, MATCH(dms_TradingName,dms_CF_TradingName))=\"Y\"","=INDEX(dms_CF_3.6.7.1, MATCH(dms_TradingName,dms_CF_TradingName))=\"Y\"","=INDEX(dms_CF_3.6.7.2, MATCH(dms_TradingName,dms_CF_TradingName))=\"Y\"","=INDEX(dms_CF_3.6.7.3, MATCH(dms_TradingName,dms_CF_TradingName))=\"Y\"","=INDEX(dms_CF_3.6.7.4, MATCH(dms_TradingName,dms_CF_TradingName))=\"Y\"","=INDEX(dms_CF_3.6.8, MATCH(dms_TradingName,dms_CF_TradingName))=\"Y\"","=INDEX(dms_CF_4.1, MATCH(dms_TradingName,dms_CF_TradingName))=\"Y\"","=INDEX(dms_CF_6.8, MATCH(dms_TradingName,dms_CF_TradingName))=\"Y\"","=INDEX(dms_CF_7.12, MATCH(dms_TradingName,dms_CF_TradingName))=\"Y\"","=INDEX(dms_CF_8.1_A, MATCH(dms_TradingName,dms_CF_TradingName))=\"Y\"","=INDEX(dms_CF_8.1_B, MATCH(dms_TradingName,dms_CF_TradingName))=\"Y\"",{"$f":"INDEX(dms_CF_8.1_Neg, MATCH(dms_TradingName,dms_CF_TradingName))=\"Y\"","v":true},"=INDEX(dms_CF_4.4.1_Neg, MATCH(dms_TradingName,dms_CF_TradingName))=\"Y\"",null,null,"=INDEX(dms_CF_F10, MATCH(dms_TradingName,dms_CF_TradingName))=\"Y\""]
[null,"dms_CF_TradingName","JurisdictionList","Sector","Segment","dms_CF_3.6.1","dms_CF_3.6.5","dms_CF_3.6.6.1","dms_CF_3.6.6.2","dms_CF_3.6.6.3","dms_CF_3.6.7.1","dms_CF_3.6.7.2","dms_CF_3.6.7.3","dms_CF_3.6.7.4","dms_CF_3.6.8","dms_CF_4.1","dms_CF_6.8 (set from dms_MAIFI_flag)","dms_CF_7.12","dms_CF_8.1_A  (and 8.4)","dms_CF_8.1_B  (and 8.4)","dms_CF_8.1_Neg  (and 8.4)","dms_CF_4.4.1","dms_CF_MAIFI_flag (set from dms_MAIFI_flag)","9.5 TUOS (set from Jurisdiction)","dms_CF_F10"]
[null,"Amadeus","NT","Gas","Transmission","-","-","-","-","-","-","-","-","-","-","-","-","-","-","-","-","-","-","-","-"]
[null,"APA GasNet","Vic","Gas","Transmission","-","-","-","-","-","-","-","-","-","-","-","-","-","-","-","-","-","-","-","-"]
[null,"Ausgrid","NSW","Electricity","Distribution",null,"Y","N","N","N","N","N","N","Y","N","N",{"$f":"IFERROR(IF(dms_MAIFI_flag=\"Yes\",\"N\",\"Y\"),\"Y\")","v":"Y"},"Y","N","Y","Y","N",{"$f":"IFERROR(LEFT(dms_MAIFI_flag),\"N\")","v":"N"},{"$f":"IF('AER CF'!$C7=\"Vic\",\"Y\",\"N\")","v":"N"}]
[null,"Ausgrid (Tx Assets)","NSW","Electricity","Distribution",null,"Y","N","N","N","N","N","N","Y","N","N",{"$f":"IFERROR(IF(dms_MAIFI_flag=\"Yes\",\"N\",\"Y\"),\"Y\")","v":"Y"},"Y","N","Y","Y","N",{"$f":"IFERROR(LEFT(dms_MAIFI_flag),\"N\")","v":"N"},{"$f":"IF('AER CF'!$C8=\"Vic\",\"Y\",\"N\")","v":"Y"}]
[null,"AusNet (D)","Vic","Electricity","Distribution",null,"N","N",null,null,"N","N","N","N","N","N",{"$f":"IFERROR(IF(dms_MAIFI_flag=\"Yes\",\"N\",\"Y\"),\"Y\")","v":"Y"},"N","N","N","Y","N",{"$f":"IFERROR(LEFT(dms_MAIFI_flag),\"N\")","v":"N"},{"$f":"IF('AER CF'!$C9=\"Vic\",\"Y\",\"N\")","v":"N"}]
[null,"AusNet (T)","Vic","Electricity","Transmission",null,"N",null,null,null,"N","N","N","N","N","Y",{"$f":"IFERROR(IF(dms_MAIFI_flag=\"Yes\",\"N\",\"Y\"),\"Y\")","v":"Y"},"N","N","N","Y","N",{"$f":"IFERROR(LEFT(dms_MAIFI_flag),\"N\")","v":"N"},{"$f":"IF('AER CF'!$C10=\"Vic\",\"Y\",\"N\")","v":"N"}]
[null,"Australian Distribution Co.","NSW","Electricity","Distribution","N","N","N","N",null,"N","N","N","N","N","N",{"$f":"IFERROR(IF(dms_MAIFI_flag=\"Yes\",\"N\",\"Y\"),\"Y\")","v":"Y"},"N","N","N","N","N",{"$f":"IFERROR(LEFT(dms_MAIFI_flag),\"N\")","v":"N"},{"$f":"IF('AER CF'!$C13=\"Vic\",\"Y\",\"N\")","v":"N"}]
[null,"Australian Distribution Co. (Vic)","Vic","Electricity","Distribution","N","N","N","N",null,"N","N","N","N","N","N",{"$f":"IFERROR(IF(dms_MAIFI_flag=\"Yes\",\"N\",\"Y\"),\"Y\")","v":"Y"},"N","N","N","N","N",{"$f":"IFERROR(LEFT(dms_MAIFI_flag),\"N\")","v":"N"},{"$f":"IF('AER CF'!$C14=\"Vic\",\"Y\",\"N\")","v":"Y"}]
[null,"CitiPower","Vic","Electricity","Distribution",null,"N","N",null,null,"N","N","N","N","N","N",{"$f":"IFERROR(IF(dms_MAIFI_flag=\"Yes\",\"N\",\"Y\"),\"Y\")","v":"Y"},"N","N","N","Y","N",{"$f":"IFERROR(LEFT(dms_MAIFI_flag),\"N\")","v":"N"},{"$f":"IF('AER CF'!$C15=\"Vic\",\"Y\",\"N\")","v":"Y"}]
{"$rows_left_out":62}
{"sheet":"AER NRs","index":1,"n_rows":232,"n_cols":16,"rows_kept":232,"cut":false,"hidden":true,"merged":[[4,1,28,1],[32,1,55,1],[33,10,35,10],[33,36,33,57],[33,67,33,88],[34,36,34,57],[34,67,34,88],[35,36,35,57],[35,67,35,88],[36,10,40,10],[44,10,45,10],[65,1,78,1],[84,1,97,1],[100,1,107,1],[110,1,115,1],[118,1,132,1],[195,1,196,1],[199,1,200,1],[208,1,213,1],[135,1,150,1],[152,1,158,1],[160,1,174,1],[176,1,177,1],[179,1,184,1],[191,1,192,1]]}
[null,"AER NAMED RANGES"]
[]
[null,"DROP DOWN SELECTORS USED IN WORKBOOKS"]
[]
[null,"COVER SHEET","dms_DataQuality_List","dms_Confid_status_List"]
[null,null,"-- select --","-- select --"]
[null,null,"Actual","Public"]
[null,null,"Estimate","Confidential"]
[null,null,"Consolidated"]
[]
[]
[null,null,"For all files either AER or business needs to be able to specify the type of submission","For PTRM & RFM templates we must provide a choice in case they change their form of control - otherwise it is drawn from the business specific lookup table above."]
[null,null,"dms_SourceList","dms_FormControl_Choices"]
[null,null,"-- select --","Revenue cap"]
[null,null,"After appeal","Revenue yield"]
{"$rows_left_out":218}
{"sheet":"AER lookups","index":2,"n_rows":101,"n_cols":37,"rows_kept":101,"cut":false,"hidden":true,"merged":[[33,1,33,4],[10,25,10,35],[11,25,11,28],[11,30,11,34],[11,35,13,35]]}
[null,"AER LOOKUP TABLES"]
[]
[null,"Data in these columns used for data validation and database purposes."]
[null,"Date last modified:","2017-01-16","added (Albury and Victora) for AGN"]
[null,null,"2016-10-17","updated TransGrid's correct legal name, corrected TasNetworks (T) to June financial year"]
[null,null,"2017-02-01","inserted Power and Water, added NRs (dms_FeederCat_1 and dms_FeederCat_2)"]
[null,null,"2017-03-03","inserted AEMO as a business"]
[null,null,"2018-03-28","major changes to accommodate STPIS"]
[null,null,"Template Version",5]
[]
[null,null,null,null,null,null,null,null,null,null,null,null,null,null,null,null,null,null,null,null,null,null,null,null,null,"FOR ELECTRICITY BUSINESSES ONLY"]
[null,null,null,null,null,null,null,null,null,null,null,null,null,null,null,null,null,null,null,null,null,null,null,null,null,"Feeder Types",null,null,null,"TasNetworks (D)","Feeder Names"]
[]
[null,null,null,null,null,null,null,null,null,null,null,null,null,null,null,null,null,null,null,null,null,null,null,null,null,"CBD","Urban","Short rural","long rural","EXTRA"]
[null,"dms_TradingName_List","dms_TradingNameFull_List","dms_ABN_List","dms_JurisdictionList","dms_Sector_List","dms_Segment_List","dms_FormControl_List","dms_RPT_List","dms_RPTMonth_List","dms_CRCPlength_List","dms_FRCPlength_List","dms_PRCPlength_List","dms_663_List","dms_DeterminationRef_List","dms_Addr1_List","dms_Addr2_List","dms_Suburb_List","dms_State_List","dms_PostCode_List","dms_PAddr1_List","dms_PAddr2_List","dms_PSuburb_List","dms_PState_List","dms_PPostCode_List","dms_CBD_flag","dms_Urban_flag","dms_ShortRural_flag","dms_LongRural_flag","dms_FeederType_5_flag","dms_FeederName_1","dms_FeederName_2","dms_FeederName_3","dms_FeederName_4","dms_FeederName_5","dms_Public_Lighting_List","Name"]
{"$rows_left_out":87}
{"sheet":"AER ETL","index":3,"n_rows":145,"n_cols":8,"rows_kept":145,"cut":false,"hidden":true,"merged":[[11,0,15,0],[12,4,12,8],[14,2,14,4],[18,0,25,0],[26,0,31,0],[34,0,59,0],[34,37,34,58],[34,68,34,89],[32,37,32,58],[71,1,73,1],[32,68,32,89],[33,37,33,58],[33,68,33,89]]}
[null,"AER ETL INFORMATION"]
[]
[null,"USES NAMED RANGES FLAG","yes","dms_Defined_Names_Used"]
[]
[null,"IF THIS IS AN ABC RIN - make sure the the named range CRY is applied and the named range dms_dollar_nom_UOM is applied"]
[null,"IF THIS IS A RESET RIN - make sure the named ranges CRY and dms_dollar_nom_UOM are NOT present in the workbook"]
[null,"FOR ABC RINS THAT SPAN MULTIPLE YEARS - make sure MultiYear Flag is set and final year entered as required"]
[]
[null,"Full trading name",{"$f":"INDEX(dms_TradingNameFull_List,MATCH(dms_TradingName,dms_TradingName_List))","v":"AusNet Gas Services"},null,"dms_TradingNameFull"]
[null,"Trading name",{"$f":"dms_TradingName","v":"AusNet (Gas)"}]
["Selected here","Model / RIN","Reset","dms_Model"]
["Read from Business & other details","Source","Regulatory proposal","dms_Source"]
[null,"Data quality","Consolidated","For DB purposes this is always Consoldiated"]
[null,"Data status","Public","For DB purposes this is always Public"]
[null,"Amendment reason",{"$f":"dms_Amendment_Text","v":"."},null,null,"dms_AmendmentReason"]
{"$rows_left_out":131}
{"sheet":"Instructions","index":4,"n_rows":27,"n_cols":4,"rows_kept":27,"cut":false,"hidden":false,"merged":[[7,1,8,1],[7,2,7,3],[8,2,8,4],[1,1,1,4],[2,1,2,4],[3,1,3,4],[4,1,4,4],[5,2,5,4],[18,1,24,1],[18,2,18,4],[26,2,26,4],[10,2,10,4],[12,1,14,1],[12,2,12,4],[13,2,13,3],[14,2,14,4],[16,2,16,4]]}
[]
[null,{"$f":"CONCATENATE(dms_Sector,\" \",dms_Segment,\" \", \"Pipeline Service Provider\")","v":"Gas Distribution Pipeline Service Provider"}]
[null,{"$f":"IF(dms_Model=\"Reset\",\"Regulatory Proposal RIN Template\",\"Annual Reporting RIN\")","v":"Regulatory Proposal RIN Template"}]
[]
[null,"INSTRUCTIONS"]
[null,"GENERAL","Complete the Business & other details worksheet before entering data or values in any other worksheets. The Business & other details worksheet is linked to other worksheets within the workbook and automatically generates certain column headings and conditional formatting."]
[]
[null,"CONFIDENTIAL INFORMATION","\nPlease use the macro at the top of each \nworksheet to identify confidential information\nin the confidential workbook. \n\n"]
[null,null,"-Do this by selecting the cell or cells that contain confidential information and then run the Mark selection as CONFIDENTIAL macro. This will format the cells a specific colour that is identified by the AER's database which in turn marks that information as confidential.\n\n-To reverse this, select the cell or cells and run the Return selection to NON-CONFIDENTIAL macro."]
[]
[null,"RESPONSES","\nPlease return two (2) files to the AER: \n\n1. A confidential version which must contain a complete set of all responses with confidential information marked using the Mark selection CONFIDENTIAL macro and which has been completed using the locked template file provided by the AER. \n\n2. A public version with confidential information either removed completely or aggregated in some form together with writtten consent to disclose the public version of the response.\n\nUse the drop down box on the Business and other details worksheet to identify the file as either confidential ('consolidated') or public. "]
[]
[null,"AMENDMENTS","\nIf an NSP wishes to correct data previously submitted to the AER it should resubmit that data using the original completed submission as the starting point. Please make any necessary changes to the data. Data that is not being amended should be left unchanged. \n\nNSPs must identify the reason for the amendments in the Amendment Reason box on the  Business and other details worksheet. NSPs may provide further details regarding any amendments in the Amendments worksheet. \n\n."]
[null,null,"NSP may use Amended Data macro \nto highlight cells that contain amended data.\nNB: if data is also CONFIDENTIAL, re-apply \nthe Confidentiality macro after applying the \nAmended macro"]
[null,null,"Please resubmit two (2) files - a confidential version and a public version of the amended submission to the AER"]
{"$rows_left_out":13}
{"sheet":"CONTENTS","index":5,"n_rows":37,"n_cols":4,"rows_kept":37,"cut":false,"hidden":false,"merged":[]}
[null,{"$f":"INDEX(dms_Worksheet_List,MATCH(dms_Model,dms_Model_List))","v":"REGULATORY REPORTING STATEMENT"}]
[null,{"$f":"dms_TradingName","v":"AusNet (Gas)"}]
[null,{"$f":"dms_Header_Span","v":"2021-22 to 2027-28"}]
[]
[]
[]
[null,null,"CONTENTS"]
[]
[null,null,"TEMPLATE DATE","FINAL RIN MARCH 2022"]
[]
[null,null,"SUBMISSION","Business & other details"]
[]
[null,null,"EXPENDITURE","E1. Expenditure Summary"]
[null,null,null,"E2. Mains Repex"]
[null,null,null,"E3. Mains Augex"]
{"$rows_left_out":23}
{"sheet":"Business & other details","index":6,"n_rows":76,"n_cols":79,"rows_kept":76,"cut":false,"hidden":false,"merged":[[0,7,2,15],[3,21,3,57],[6,21,6,75],[8,16,8,93],[15,21,15,35],[15,37,15,58],[16,21,16,35],[16,37,16,48],[22,21,22,35],[22,37,22,58],[22,60,22,66],[22,68,22,89],[23,21,23,35],[23,37,23,58],[23,60,23,66],[23,68,23,89],[24,21,24,35],[24,37,24,51],[24,60,24,66],[24,68,24,82],[25,21,25,35],[25,37,25,40],[25,49,25,51],[25,60,25,66],[25,68,25,71],[25,80,25,82],[31,21,31,35],[31,37,31,58],[31,60,31,66],[31,68,31,89],[32,21,32,35],[32,37,32,58],[32,60,32,66],[32,68,32,89],[33,21,33,35],[33,37,33,58],[33,60,33,66],[33,68,33,89],[41,25,41,34],[41,37,41,44],[41,46,41,53],[41,55,41,62],[41,64,41,71],[41,73,41,80],[42,37,42,44],[42,46,42,53],[42,55,42,62],[42,64,42,71],[42,73,42,80],[43,37,43,44],[43,46,43,53],[43,55,43,62],[43,64,43,71],[43,73,43,80],[47,25,47,34],[47,37,47,44],[47,46,47,53],[47,55,47,62],[47,64,47,71],[47,73,47,80],[45,25,45,34],[48,37,48,44],[48,46,48,53],[48,55,48,62],[48,64,48,71],[48,73,48,80],[49,37,49,44],[49,46,49,53],[49,55,49,62],[49,64,49,71],[49,73,49,80],[51,25,51,34],[51,37,51,44],[51,46,51,53],[51,55,51,62],[51,64,51,71],[51,73,51,80],[52,37,52,44],[52,46,52,53],[52,55,52,62],[52,64,52,71],[52,73,52,80],[53,37,53,44],[53,46,53,53],[53,55,53,62],[53,64,53,71],[53,73,53,80],[55,25,55,34],[55,37,55,44],[57,25,57,34],[57,37,57,44],[63,25,63,34],[63,37,63,52],[71,25,73,34],[71,37,73,81],[75,25,75,34],[75,37,75,52],[65,25,65,34],[65,37,65,52],[67,25,67,34],[67,37,67,52],[69,25,69,34],[69,37,69,52]]}
[null,null,null,null,null,null,null,null,null,null,null,null,null,null,null,null,null,null,null,null,null,{"$f":"INDEX(dms_Worksheet_List,MATCH(dms_Model,dms_Model_List))","v":"REGULATORY REPORTING STATEMENT"}]
[null,null,null,null,null,null,null,null,null,null,null,null,null,null,null,null,null,null,null,null,null,{"$f":"dms_TradingName","v":"AusNet (Gas)"}]
[null,null,null,null,null,null,null,null,null,null,null,null,null,null,null,null,null,null,null,null,null,{"$f":"dms_Header_Span","v":"2021-22 to 2027-28"}]
[null,null,null,null,null,null,null,null,null,null,null,null,null,null,null,null,null,null,null,null,null,"BUSINESS & OTHER DETAILS"]
[]
[null,null,null,null,null,null,null,null,null,null,null,null,null,null,null,null,null,null,null,null,null,"INSTRUCTIONS"]
[null,null,null,null,null,null,null,null,null,null,null,null,null,null,null,null,null,null,null,null,null,"Complete the following business details regulatory template before entering data or values in any other regulatory template. This regulatory template is linked to other cells within the spreadsheet and automatically generates column headings and conditional formatting to distinguish business specific input and non-input cells. "]
[]
[null,null,null,null,null,null,null,null,null,null,null,null,null,null,null,null,"SUBMISSION PARTICULARS INPUT SHEET"]
[]
[]
[null,null,null,null,null,null,null,null,null,null,null,null,null,null,null,null,null,null,null,null,null,"ENTITY DETAILS"]
[]
[null,null,null,null,null,null,null,null,null,null,null,null,null,null,null,null,null,null,null,null,null,"Business Name"]
[]
{"$rows_left_out":62}
{"sheet":"N1. Demand","index":7,"n_rows":96,"n_cols":9,"rows_kept":96,"cut":false,"hidden":false,"merged":[]}
[null,{"$f":"INDEX(dms_Worksheet_List,MATCH(dms_Model,dms_Model_List))","v":"REGULATORY REPORTING STATEMENT"}]
[null,{"$f":"dms_TradingName","v":"AusNet (Gas)"}]
[null,{"$f":"dms_Header_Span","v":"2021-22 to 2027-28"}]
[null,"N1. DEMAND"]
[]
[null,"N1.1 - DEMAND - BY CUSTOMER TYPE"]
[null,null,"VOLUME"]
[null,null,"GJ"]
[null,null,{"$f":"VLOOKUP(CRCP_y4,'AER lookups'!$B$52:$C$101,2,0)","v":2022},{"$f":"CONCATENATE(\"1 Jan-30 Jun \"&(C9+1))","v":"1 Jan-30 Jun 2023"},{"$f":"FRCP_y1","v":"2023-24"},{"$f":"FRCP_y2","v":"2024-25"},{"$f":"FRCP_y3","v":"2025-26"},{"$f":"FRCP_y4","v":"2026-27"},{"$f":"FRCP_y5","v":"2027-28"}]
[null,"Residential",{"$f":"SUM(C21,C23,C25,C27)","v":31708822.429773424},{"$f":"SUM(D21,D23,D25,D27)","v":12539510.834329322},31255312.316056099,31135197.114078853,31298330.504176348,31746711.929648921,32283972.952542555]
[null,"Commercial",{"$f":"SUM(C22,C24,C26,C28)","v":6104918.2925856737},2942804.8786398186,6261663.6148024118,6180197.9367408892,6156615.8166677495,6188099.3859273056,6237212.1026167329]
[null,"Industrial","n/a","n/a","n/a","n/a","n/a","n/a","n/a"]
[null,"Total",{"$f":"SUM(C10:C12)","v":37813740.722359098},15482315.712969141,37516975.930858508,37315395.05081974,37454946.320844099,37934811.315576226,38521185.055159286]
[]
[]
{"$rows_left_out":82}
{"sheet":"S1.1 Customer numbers","index":8,"n_rows":34,"n_cols":9,"rows_kept":34,"cut":false,"hidden":false,"merged":[]}
[null,{"$f":"INDEX(dms_Worksheet_List,MATCH(dms_Model,dms_Model_List))","v":"REGULATORY REPORTING STATEMENT"}]
[null,{"$f":"dms_TradingName","v":"AusNet (Gas)"}]
[null,{"$f":"dms_Header_Span","v":"2021-22 to 2027-28"}]
[null,"S1. CUSTOMER NUMBERS"]
[]
[null,"S1.1 - CUSTOMER NUMBERS - BY CUSTOMER TYPE "]
[null,"A. RESIDENTIAL"]
[null,null,"VOLUMES"]
[null,null,"0's"]
[null,null,{"$f":"VLOOKUP(CRCP_y4,'AER lookups'!$B$52:$C$101,2,0)","v":2022},{"$f":"CONCATENATE(\"1 Jan-30 Jun \"&(C10+1))","v":"1 Jan-30 Jun 2023"},{"$f":"FRCP_y1","v":"2023-24"},{"$f":"FRCP_y2","v":"2024-25"},{"$f":"FRCP_y3","v":"2025-26"},{"$f":"FRCP_y4","v":"2026-27"},{"$f":"FRCP_y5","v":"2027-28"}]
[null,"Customer numbers - Beginning of year",{"$f":"SUM('S1.2 Customer numbers'!C11,'S1.2 Customer numbers'!C13,'S1.2 Customer numbers'!C15,'S1.2 Customer numbers'!C17)","v":759407},{"$f":"C12","v":775187.34928235516},{"$f":"D12","v":783516.8247746058},783516.8247746058,800434.9179784318,817897.50919278793,835888.94360849645]
[null,"Customer numbers - End of year",{"$f":"+SUM('S1.2 Customer numbers'!C92,'S1.2 Customer numbers'!C94,'S1.2 Customer numbers'!C96,'S1.2 Customer numbers'!C98)","v":775187.34928235516},{"$f":"+SUM('S1.2 Customer numbers'!D92,'S1.2 Customer numbers'!D94,'S1.2 Customer numbers'!D96,'S1.2 Customer numbers'!D98)","v":783516.8247746058},{"$f":"+SUM('S1.2 Customer numbers'!E92,'S1.2 Customer numbers'!E94,'S1.2 Customer numbers'!E96,'S1.2 Customer numbers'!E98)","v":783516.8247746058},{"$f":"+SUM('S1.2 Customer numbers'!F92,'S1.2 Customer numbers'!F94,'S1.2 Customer numbers'!F96,'S1.2 Customer numbers'!F98)","v":800434.9179784318},{"$f":"+SUM('S1.2 Customer numbers'!G92,'S1.2 Customer numbers'!G94,'S1.2 Customer numbers'!G96,'S1.2 Customer numbers'!G98)","v":817897.50919278793},{"$f":"+SUM('S1.2 Customer numbers'!H92,'S1.2 Customer numbers'!H94,'S1.2 Customer numbers'!H96,'S1.2 Customer numbers'!H98)","v":835888.94360849645},{"$f":"+SUM('S1.2 Customer numbers'!I92,'S1.2 Customer numbers'!I94,'S1.2 Customer numbers'!I96,'S1.2 Customer numbers'!I98)","v":853341.24707404908}]
[null,"Total customer connections",{"$f":"+SUM('S1.2 Customer numbers'!C173,'S1.2 Customer numbers'!C175,'S1.2 Customer numbers'!C177,'S1.2 Customer numbers'!C179)","v":17733.303972092825},{"$f":"+SUM('S1.2 Customer numbers'!D173,'S1.2 Customer numbers'!D175,'S1.2 Customer numbers'!D177,'S1.2 Customer numbers'!D179)","v":9317.036865384076},{"$f":"+SUM('S1.2 Customer numbers'!E173,'S1.2 Customer numbers'!E175,'S1.2 Customer numbers'!E177,'S1.2 Customer numbers'!E179)","v":18938.327364280736},{"$f":"+SUM('S1.2 Customer numbers'!F173,'S1.2 Customer numbers'!F175,'S1.2 Customer numbers'!F177,'S1.2 Customer numbers'!F179)","v":19529.479723936241},{"$f":"+SUM('S1.2 Customer numbers'!G173,'S1.2 Customer numbers'!G175,'S1.2 Customer numbers'!G177,'S1.2 Customer numbers'!G179)","v":20106.438367849623},{"$f":"+SUM('S1.2 Customer numbers'!H173,'S1.2 Customer numbers'!H175,'S1.2 Customer numbers'!H177,'S1.2 Customer numbers'!H179)","v":19613.915533544259},{"$f":"+SUM('S1.2 Customer numbers'!I173,'S1.2 Customer numbers'!I175,'S1.2 Customer numbers'!I177,'S1.2 Customer numbers'!I179)","v":19102.873359070509}]
[null,"Total customer disconnections",{"$f":"+SUM('S1.2 Customer numbers'!C254,'S1.2 Customer numbers'!C256,'S1.2 Customer numbers'!C258,'S1.2 Customer numbers'!C260)","v":1952.9546897377322},{"$f":"+SUM('S1.2 Customer numbers'!D254,'S1.2 Customer numbers'!D256,'S1.2 Customer numbers'!D258,'S1.2 Customer numbers'!D260)","v":987.56137313325223},{"$f":"+SUM('S1.2 Customer numbers'!E254,'S1.2 Customer numbers'!E256,'S1.2 Customer numbers'!E258,'S1.2 Customer numbers'!E260)","v":18938.327364280736},{"$f":"+SUM('S1.2 Customer numbers'!F254,'S1.2 Customer numbers'!F256,'S1.2 Customer numbers'!F258,'S1.2 Customer numbers'!F260)","v":2611.386520110374},{"$f":"+SUM('S1.2 Customer numbers'!G254,'S1.2 Customer numbers'!G256,'S1.2 Customer numbers'!G258,'S1.2 Customer numbers'!G260)","v":2643.847153493457},{"$f":"+SUM('S1.2 Customer numbers'!H254,'S1.2 Customer numbers'!H256,'S1.2 Customer numbers'!H258,'S1.2 Customer numbers'!H260)","v":1622.4811178357204},{"$f":"+SUM('S1.2 Customer numbers'!I254,'S1.2 Customer numbers'!I256,'S1.2 Customer numbers'!I258,'S1.2 Customer numbers'!I260)","v":1650.5698935179657}]
[]
{"$rows_left_out":20}
{"sheet":"S1.2 Customer numbers","index":9,"n_rows":329,"n_cols":9,"rows_kept":329,"cut":false,"hidden":false,"merged":[]}
[null,{"$f":"INDEX(dms_Worksheet_List,MATCH(dms_Model,dms_Model_List))","v":"REGULATORY REPORTING STATEMENT"}]
[null,{"$f":"dms_TradingName","v":"AusNet (Gas)"}]
[null,{"$f":"dms_Header_Span","v":"2021-22 to 2027-28"}]
[null,"S1. CUSTOMER NUMBERS"]
[]
[null,"S1.2 - CUSTOMER NUMBERS - BY TARIFF"]
[null,"S1.2.1 - CUSTOMER NUMBERS - BEGINNING OF YEAR"]
[null,null,"VOLUMES"]
[null,null,"0's"]
[null,null,{"$f":"VLOOKUP(CRCP_y4,'AER lookups'!$B$52:$C$101,2,0)","v":2022},{"$f":"CONCATENATE(\"1 Jan-30 Jun \"&(C10+1))","v":"1 Jan-30 Jun 2023"},{"$f":"FRCP_y1","v":"2023-24"},{"$f":"FRCP_y2","v":"2024-25"},{"$f":"FRCP_y3","v":"2025-26"},{"$f":"FRCP_y4","v":"2026-27"},{"$f":"FRCP_y5","v":"2027-28"}]
[null,{"$f":"IF(ISBLANK('N1. Demand'!B21),\"\",'N1. Demand'!B21)","v":"Tariff V Central Domestic"},589629,{"$f":"C92","v":602504.93497561489},609288.95267938077,609288.95267938077,623125.3987129028,637468.61405461445,652277.52657522564]
[null,{"$f":"IF(ISBLANK('N1. Demand'!B22),\"\",'N1. Demand'!B22)","v":"Tariff V Central Non-Domestic"},11966,{"$f":"C93","v":12005.915398424406},12026.945853306081,12026.945853306081,12069.838836009998,12114.302803569304,12160.210432383197]
[null,{"$f":"IF(ISBLANK('N1. Demand'!B23),\"\",'N1. Demand'!B23)","v":"Tariff V West Domestic"},155189,{"$f":"C94","v":157403.56244044524},158609.17047845284,158609.17047845284,160983.40271076921,163360.09864168023,165784.68032720688]
[null,{"$f":"IF(ISBLANK('N1. Demand'!B24),\"\",'N1. Demand'!B24)","v":"Tariff V West Non-Domestic"},6713,{"$f":"C95","v":6719.8651435653801},6723.602528483204,6723.602528483204,6730.9626484033843,6738.3304057892083,6745.846609014342]
[null,{"$f":"IF(ISBLANK('N1. Demand'!B25),\"\",'N1. Demand'!B25)","v":"Tariff V Adjoining Central Domestic"},2306,{"$f":"C96","v":2491.9529760157025},2587.2865381141232,2587.2865381141232,2780.2148955663411,2977.7334051717808,3179.9653933447203]
{"$rows_left_out":314}