{"text_format":"1","workbook":"xlsx","n_sheets":19,"sheets":["Draft Decision changes","RRP changes","Cover page","Version Control","Intro",">>General inputs","Cost Escalations","Ratios & Assumptions","Overheads",">>Volumes","ERG - Yearly volume scenarios",">>Unit Rates","ERG Unit Rates",">>Forecast capex","ERG - Forecast capex scenarios","ERG - Gross Capex ",">>Forecast opex","ERG - Opex BST","ERG - Forecast opex"],"not_rendered":{"charts":0,"images":2,"macros":1,"external_links":0,"defined_names":25,"comments":0,"pivot_tables":0},"unopened":[],"bounds":{"document_bytes":16777216,"sheet_cells":100000,"rows_first":2000,"rows_last":500,"rows_between":2000,"halvings":0,"cell_chars":16384,"cell_head_chars":4096},"cells_cut":0,"cells_raw":0,"read":"whole","date_system":"1900"}

{"sheet":"Draft Decision changes","index":0,"n_rows":3,"n_cols":2,"rows_kept":3,"cut":false,"hidden":false,"merged":[]}
["Cells","Decription of changes"]
[" 'Cost Escalations' - row 3 ","Updated actual CPI in cells E3:F3 and forecast CPI in cell G3."]
[" 'Cost Escalations' - row 29","Substituted with our labour escalators consistent with ANS."]

{"sheet":"RRP changes","index":1,"n_rows":3,"n_cols":2,"rows_kept":3,"cut":false,"hidden":false,"merged":[]}
["Cells","Decription of changes"]
[" 'Cost Escalations' - row 29","Substituted with our labour escalators consistent with ANS."]
["ERG - Yearly volume scenario' - columns H, I, & J","Updated for actual (2022-23 & 2023-24) and revised forecast volumes"]

{"sheet":"Cover page","index":2,"n_rows":3,"n_cols":1,"rows_kept":3,"cut":false,"hidden":false,"merged":[[1,0,1,5],[2,0,2,5]]}
[]
["Ergon Energy Public Lighting Capex and Opex Forecasting Model"]
["2025-30"]

{"sheet":"Version Control","index":3,"n_rows":7,"n_cols":4,"rows_kept":7,"cut":false,"hidden":false,"merged":[]}
["RDP2025 Project: Public Lighting Expenditure Analysis Model"]
[]
[]
[null,"Date","Version","Description of any updates made"]
[null,"2024-01-31","V1","Version submitted to the AER"]
[null,"2024-08-21","V2","AER - updated inflation figures and labour escalators"]
[null,"2024-11-26","V3","ERG - updated actual volumes (2022-23 & 2023-24) and revised forecast"]

{"sheet":"Intro","index":4,"n_rows":15,"n_cols":3,"rows_kept":15,"cut":false,"hidden":false,"merged":[]}
["Model developer ","Energex & Ergon Energy Network"]
[]
[]
[]
["Purpose","To provide capex and opex scenarios based on the 100% LED deployment during 2025-30 regulatory period.  "]
[]
["Colour chart","Data","Cells containing hard coded data"]
[null,null,"Cell containing formula"]
[null,null,"Cells to remain empty (non-applicable input/output)"]
[null,"Assumptions","Cells containing assumptions intended to be manipulated by model users"]
[null,"Text","Important notes providing details"]
[null,null,"Cell highlighting particular attention"]
[null,"Header 1","Fist header"]
[null,"Header 2","Second header"]
[null,"Header 3","Third hearder"]
{"$rows_left_out":1}
{"sheet":">>General inputs","index":5,"n_rows":0,"n_cols":0,"rows_kept":0,"cut":false,"hidden":false,"merged":[]}

{"sheet":"Cost Escalations","index":6,"n_rows":30,"n_cols":12,"rows_kept":30,"cut":false,"hidden":false,"merged":[]}
[null,"2019-20","2020-21","2021-22","2022-23","2023-24","2024-25"]
[null,"2020-06-01","2021-06-01","2022-06-01","2023-06-01","2024-06-01","2025-06-01"]
["Inflation",-3.4843205574912606E-3,3.8461538461538325E-2,6.1447811447811418E-2,0.06,3.7999999999999999E-2,2.8000000000000001E-2,null,null,"Sources used",null,"https://www.rba.gov.au/publications/smp/2024/aug/"]
[null,null,null,null,null,null,null,null,null,null,null,"https://www.abs.gov.au/statistics/economy/price-indexes-and-inflation/consumer-price-index-australia/jun-quarter-2024"]
["Real to Real"]
[null,"2020-06-01","2021-06-01","2022-06-01","2023-06-01","2024-06-01","2025-06-01"]
["2020-06-01",{"$f":"IF(AND($A7>B$6,ISNONTEXT($A7)),C7/(1+C$3),IF(AND($A7=B$6,B$6=B$2),1,IF(AND($A7<B$6,B$6=B$2),#REF!*(1+B$3),0)))","v":1},{"$f":"IF(AND($A7>C$6,ISNONTEXT($A7)),D7/(1+D$3),IF(AND($A7=C$6,C$6=C$2),1,IF(AND($A7<C$6,C$6=C$2),B7*(1+C$3),0)))","v":1.0384615384615383},1.1022727272727271,1.1684090909090907,1.2128086363636361,{"$f":"IF(AND($A7>G$6,ISNONTEXT($A7)),#REF!/(1+#REF!),IF(AND($A7=G$6,G$6=G$2),1,IF(AND($A7<G$6,G$6=G$2),F7*(1+G$3),0)))","v":1.246767278181818}]
["2021-06-01",{"$f":"IF(AND($A8>B$6,ISNONTEXT($A8)),C8/(1+C$3),IF(AND($A8=B$6,B$6=B$2),1,IF(AND($A8<B$6,B$6=B$2),#REF!*(1+B$3),0)))","v":0.96296296296296313},1,1.0614478114478114,1.1251346801346802,1.1678897979797982,{"$f":"IF(AND($A8>G$6,ISNONTEXT($A8)),#REF!/(1+#REF!),IF(AND($A8=G$6,G$6=G$2),1,IF(AND($A8<G$6,G$6=G$2),F8*(1+G$3),0)))","v":1.2005907123232327}]
["2022-06-01",{"$f":"IF(AND($A9>B$6,ISNONTEXT($A9)),C9/(1+C$3),IF(AND($A9=B$6,B$6=B$2),1,IF(AND($A9<B$6,B$6=B$2),#REF!*(1+B$3),0)))","v":0.90721649484536093},0.94210943695479776,1,1.06,{"$f":"IF(AND($A9>F$6,ISNONTEXT($A9)),G9/(1+G$3),IF(AND($A9=F$6,F$6=F$2),1,IF(AND($A9<F$6,F$6=F$2),E9*(1+F$3),0)))","v":1.1002800000000001},{"$f":"IF(AND($A9>G$6,ISNONTEXT($A9)),#REF!/(1+#REF!),IF(AND($A9=G$6,G$6=G$2),1,IF(AND($A9<G$6,G$6=G$2),F9*(1+G$3),0)))","v":1.1310878400000002}]
["2023-06-01",{"$f":"IF(AND($A10>B$6,ISNONTEXT($A10)),C10/(1+C$3),IF(AND($A10=B$6,B$6=B$2),1,IF(AND($A10<B$6,B$6=B$2),#REF!*(1+B$3),0)))","v":0.85586461777864231},0.88878248769320534,0.94339622641509424,1,1.038,{"$f":"IF(AND($A10>G$6,ISNONTEXT($A10)),#REF!/(1+#REF!),IF(AND($A10=G$6,G$6=G$2),1,IF(AND($A10<G$6,G$6=G$2),F10*(1+G$3),0)))","v":1.067064}]
["2024-06-01",{"$f":"IF(AND($A11>B$6,ISNONTEXT($A11)),C11/(1+C$3),IF(AND($A11=B$6,B$6=B$2),1,IF(AND($A11<B$6,B$6=B$2),#REF!*(1+B$3),0)))","v":0.82453238706998289},0.8562451711880591,0.908859563020322,0.96339113680154143,1,{"$f":"IF(AND($A11>G$6,ISNONTEXT($A11)),#REF!/(1+#REF!),IF(AND($A11=G$6,G$6=G$2),1,IF(AND($A11<G$6,G$6=G$2),F11*(1+G$3),0)))","v":1.028}]
["2025-06-01",{"$f":"IF(AND($A12>B$6,ISNONTEXT($A12)),C12/(1+C$3),IF(AND($A12=B$6,B$6=B$2),1,IF(AND($A12<B$6,B$6=B$2),#REF!*(1+B$3),0)))","v":0.80207430648831024},0.83292331827632204,0.88410463328825095,0.93715091128554606,0.97276264591439687,{"$f":"IF(AND($A12>G$6,ISNONTEXT($A12)),#REF!/(1+#REF!),IF(AND($A12=G$6,G$6=G$2),1,IF(AND($A12<G$6,G$6=G$2),F12*(1+G$3),0)))","v":1}]
[]
["Nominal to Real"]
[null,"2020-06-01","2021-06-01","2022-06-01","2023-06-01","2024-06-01","2025-06-01"]
{"$rows_left_out":16}
{"sheet":"Ratios & Assumptions","index":7,"n_rows":24,"n_cols":4,"rows_kept":24,"cut":false,"hidden":false,"merged":[[1,2,1,3]]}
["Table 1 - ERG ratios between major and minor roads"]
[null,null,"2025-26"]
["DNSP","Road type","Volume","Ratio"]
["Ergon","Major",{"$f":"SUMIF('ERG - Yearly volume scenarios'!$C$5:$C$12,'Ratios & Assumptions'!$B4,'ERG - Yearly volume scenarios'!$G$5:$G$12)","v":42421},{"$f":"C4/$C$6","v":0.28251661627395874}]
["Ergon","Minor",{"$f":"SUMIF('ERG - Yearly volume scenarios'!$C$5:$C$12,'Ratios & Assumptions'!$B5,'ERG - Yearly volume scenarios'!$G$5:$G$12)","v":107733},{"$f":"C5/$C$6","v":0.71748338372604126}]
["Ergon","All",{"$f":"SUM(C4:C5)","v":150154},{"$f":"SUM(D4:D5)","v":1}]
["Notes:"]
["Allocation based on actual 2021-22 volumes"]
["Used to allocate expenditure between major and minor road types where the breakdown is not available"]
[]
["Table 2 - ERG estimated annual growth rates"]
["DNSP","Road","Rate","Rate"]
["Ergon","All ",1,2.5000000000000001E-2]
["Ergon","All ",2,1.4999999999999999E-2]
["Note:"]
{"$rows_left_out":10}
{"sheet":"Overheads","index":8,"n_rows":29,"n_cols":4,"rows_kept":29,"cut":false,"hidden":false,"merged":[]}
["Table 1 - ERG Labour Oncosts"]
["DNSP","Cost type","Cost recovery","FY2023"]
["Ergon","Labour Oncosts","Labour only",0]
["Ergon","All","All",{"$f":"SUM(D3)","v":0}]
[]
["Table 2 - ERG Material Oncosts"]
["DNSP","Cost type","Cost recovery","FY2023"]
["Ergon","Material Oncosts","Material only",7.9587700999130317E-2]
["Ergon","All","All",{"$f":"SUM(D8)","v":7.9587700999130317E-2}]
[]
["Table 3 - ERG Fleet Oncosts"]
["DNSP","Cost type","Cost recovery","FY2023"]
["Ergon","Fleet Oncost Indirects","Labour only",0.12669576075036793]
["Ergon","Fleet Oncost Depreciation","Labour only",8.4944584136218471E-2]
["Ergon","All","All",{"$f":"SUM(D13:D14)","v":0.2116403448865864}]
{"$rows_left_out":15}
{"sheet":">>Volumes","index":9,"n_rows":0,"n_cols":0,"rows_kept":0,"cut":false,"hidden":false,"merged":[]}

{"sheet":"ERG - Yearly volume scenarios","index":10,"n_rows":110,"n_cols":16,"rows_kept":110,"cut":false,"hidden":false,"merged":[[97,0,97,3],[100,0,100,3],[70,10,70,14],[71,10,71,14],[0,10,0,14],[1,5,1,9],[1,10,1,14],[93,10,93,14],[94,5,94,9],[94,10,94,14],[23,5,23,9],[36,10,36,14],[37,10,37,14],[59,10,59,14],[60,10,60,14],[49,10,49,14],[50,10,50,14],[22,10,22,14],[23,10,23,14]]}
["Table 1 - ERG Total public lighting asset base by tariffs to be converted from CONV to LED- yearly data as at 30 June",null,null,null,null,null,null,null,null,null,"100%  LED deployment by 2030"]
["1.a - Number of public lights for LED conversion",null,null,null,"Previous period","Current period",null,null,null,null,"Forthcoming period"]
[null,null,null,null,"Actual","Actual","Actual","Actual","Actuals","Forecast","Forecast","Forecast","Forecast","Forecast","Forecast"]
["DNSP","Rate","Road type","Light type","2019-20","2020-21","2021-22","2022-23","2023-24","2024-25","2025-26","2026-27","2027-28","2028-29","2029-30"]
["Ergon Energy",1,"Major","CONV",27931,27894,26945,26195,25747,21456,17165,12874,8582,4291,0]
["Ergon Energy",1,"Major","LED",346,754,1837,2626,3277,7568,11859,16150,20442,24733,29024.000000000004]
["Ergon Energy",1,"Minor","CONV",68751,68404,53974,30065,16683,13903,11122,8342,5561,2781,0,"Removes the Nostalgia  as these are to be converted to LED (see Table 3 below)"]
["Ergon Energy",1,"Minor","LED",1287,1714,17369,41990,56894,59674,62455,65235,68016,70796,73577]
["Ergon Energy",2,"Major","CONV",12886,12883,12715,12494,12293,10244,8195,6147,4098,2049,0]
["Ergon Energy","2A","Major","LED",255,558,924,1483,2217,4266,6315,8363,10412,12461,14510.000000000004]
["Ergon Energy",2,"Minor","CONV",34331,34480,29753,21261,15755,13129,10503,7878,5252,2626,0,"Removes the Nostalgia  as these are to be converted to LED (see Table 3 below)"]
["Ergon Energy","2A","Minor","LED",686,1302,6637,16154,21842,24468,27094,29719,32345,34971,37597]
["Ergon Energy","All","All","CONV",{"$f":"E5+E7+E9+E11","v":143899},143661,123387,90015,70478,58732,46985,35241,23493,11747,0]
["Ergon Energy","All","All","LED",{"$f":"E6+E8+E10+E12","v":2574},{"$f":"F6+F8+F10+F12","v":4328},26767,62253,84230,95976,107723,119467,131215,142961,154708]
["Ergon Energy","All","All","All",{"$f":"E13+E14","v":146473},{"$f":"F13+F14","v":147989},150154,152268,154708,154708,{"$f":"SUM(K5:K12)","v":154708},{"$f":"SUM(L5:L12)","v":154708},{"$f":"SUM(M5:M12)","v":154708},{"$f":"SUM(N5:N12)","v":154708},{"$f":"SUM(O5:O12)","v":154708}]
{"$rows_left_out":96}
{"sheet":">>Unit Rates","index":11,"n_rows":0,"n_cols":0,"rows_kept":0,"cut":false,"hidden":false,"merged":[]}

{"sheet":"ERG Unit Rates","index":12,"n_rows":31,"n_cols":4,"rows_kept":31,"cut":false,"hidden":false,"merged":[]}
["Table 1: Ergon Energy Public Light - Unit costs per luminaire"]
[null,null,null,"Unit cost "]
["Activity type","Asset type","Cost categories","$2022-30 "]
[null,null,null,"Actual"]
["Light installation","steel underground decorative minor (typically Rate 2)","Labour","N/A"]
[null,null,"Material","N/A"]
[null,null,"Contractor","N/A"]
[null,"steel underground minor","Labour","N/A"]
[null,null,"Material","N/A"]
[null,null,"Contractor","N/A"]
[null,"Rate 1 Major LED install","Labour",14745.486098730435]
[null,null,"Material",9330.2050159722203]
[null,null,"Contractor",7769.1658993793917]
[null,"Rate 1 Minor LED install","Labour",3459.3008037554196]
[null,null,"Material",882.75971032001712]
{"$rows_left_out":17}
{"sheet":">>Forecast capex","index":13,"n_rows":0,"n_cols":0,"rows_kept":0,"cut":false,"hidden":false,"merged":[]}

{"sheet":"ERG - Forecast capex scenarios","index":14,"n_rows":141,"n_cols":11,"rows_kept":141,"cut":false,"hidden":false,"merged":[[116,5,116,9],[1,5,1,9],[28,5,28,9],[57,5,57,9],[85,5,85,9],[101,5,101,9]]}
["Table 1 - ERG Light Replacement Capex - CONV to LED"]
["Real $2022-23",null,null,null,null,"100%  LED deployment by 2030"]
[null,null,null,null,null,"Forecast","Forecast","Forecast","Forecast","Forecast"]
["DNSP","Rate","Road type","Light type","Cost category","2025-26","2026-27","2027-28","2028-29","2029-30"]
["Ergon Energy",1,"Major","LED","Labour",{"$f":"'ERG Unit Rates'!$D23*'ERG - Yearly volume scenarios'!K$41","v":0},{"$f":"'ERG Unit Rates'!$D23*'ERG - Yearly volume scenarios'!L$41","v":0},{"$f":"'ERG Unit Rates'!$D23*'ERG - Yearly volume scenarios'!M$41","v":0},{"$f":"'ERG Unit Rates'!$D23*'ERG - Yearly volume scenarios'!N$41","v":0},{"$f":"'ERG Unit Rates'!$D23*'ERG - Yearly volume scenarios'!O$41","v":0}]
[null,1,"Major","LED","Material",{"$f":"'ERG Unit Rates'!$D24*'ERG - Yearly volume scenarios'!K$41","v":2505944},{"$f":"'ERG Unit Rates'!$D24*'ERG - Yearly volume scenarios'!L$41","v":2505944},{"$f":"'ERG Unit Rates'!$D24*'ERG - Yearly volume scenarios'!M$41","v":2505944},{"$f":"'ERG Unit Rates'!$D24*'ERG - Yearly volume scenarios'!N$41","v":2505944},{"$f":"'ERG Unit Rates'!$D24*'ERG - Yearly volume scenarios'!O$41","v":2505944}]
[null,1,"Major","LED","Contractor",{"$f":"'ERG Unit Rates'!$D25*'ERG - Yearly volume scenarios'!K$41","v":536375},{"$f":"'ERG Unit Rates'!$D25*'ERG - Yearly volume scenarios'!L$41","v":536375},{"$f":"'ERG Unit Rates'!$D25*'ERG - Yearly volume scenarios'!M$41","v":536375},{"$f":"'ERG Unit Rates'!$D25*'ERG - Yearly volume scenarios'!N$41","v":536375},{"$f":"'ERG Unit Rates'!$D25*'ERG - Yearly volume scenarios'!O$41","v":536375}]
["Ergon Energy",1,"Minor","LED","Labour",{"$f":"'ERG Unit Rates'!$D26*'ERG - Yearly volume scenarios'!K$42","v":0},{"$f":"'ERG Unit Rates'!$D26*'ERG - Yearly volume scenarios'!L$42","v":0},{"$f":"'ERG Unit Rates'!$D26*'ERG - Yearly volume scenarios'!M$42","v":0},{"$f":"'ERG Unit Rates'!$D26*'ERG - Yearly volume scenarios'!N$42","v":0},{"$f":"'ERG Unit Rates'!$D26*'ERG - Yearly volume scenarios'!O$42","v":0}]
[null,1,"Minor","LED","Material",{"$f":"'ERG Unit Rates'!$D27*'ERG - Yearly volume scenarios'!K$42","v":547857},{"$f":"'ERG Unit Rates'!$D27*'ERG - Yearly volume scenarios'!L$42","v":547857},{"$f":"'ERG Unit Rates'!$D27*'ERG - Yearly volume scenarios'!M$42","v":547857},{"$f":"'ERG Unit Rates'!$D27*'ERG - Yearly volume scenarios'!N$42","v":547857},{"$f":"'ERG Unit Rates'!$D27*'ERG - Yearly volume scenarios'!O$42","v":547857}]
[null,1,"Minor","LED","Contractor",{"$f":"'ERG Unit Rates'!$D28*'ERG - Yearly volume scenarios'!K$42","v":347625},{"$f":"'ERG Unit Rates'!$D28*'ERG - Yearly volume scenarios'!L$42","v":347625},{"$f":"'ERG Unit Rates'!$D28*'ERG - Yearly volume scenarios'!M$42","v":347625},{"$f":"'ERG Unit Rates'!$D28*'ERG - Yearly volume scenarios'!N$42","v":347625},{"$f":"'ERG Unit Rates'!$D28*'ERG - Yearly volume scenarios'!O$42","v":347625}]
["Ergon Energy","2A","Major","LED","Labour",{"$f":"'ERG Unit Rates'!$D23*'ERG - Yearly volume scenarios'!K$43","v":0},{"$f":"'ERG Unit Rates'!$D23*'ERG - Yearly volume scenarios'!L$43","v":0},{"$f":"'ERG Unit Rates'!$D23*'ERG - Yearly volume scenarios'!M$43","v":0},{"$f":"'ERG Unit Rates'!$D23*'ERG - Yearly volume scenarios'!N$43","v":0},{"$f":"'ERG Unit Rates'!$D23*'ERG - Yearly volume scenarios'!O$43","v":0}]
[null,"2A","Major","LED","Material",{"$f":"'ERG Unit Rates'!$D24*'ERG - Yearly volume scenarios'!K$43","v":1196616},{"$f":"'ERG Unit Rates'!$D24*'ERG - Yearly volume scenarios'!L$43","v":1196616},{"$f":"'ERG Unit Rates'!$D24*'ERG - Yearly volume scenarios'!M$43","v":1196616},{"$f":"'ERG Unit Rates'!$D24*'ERG - Yearly volume scenarios'!N$43","v":1196616},{"$f":"'ERG Unit Rates'!$D24*'ERG - Yearly volume scenarios'!O$43","v":1196616}]
[null,"2A","Major","LED","Contractor",{"$f":"'ERG Unit Rates'!$D25*'ERG - Yearly volume scenarios'!K$43","v":256125},{"$f":"'ERG Unit Rates'!$D25*'ERG - Yearly volume scenarios'!L$43","v":256125},{"$f":"'ERG Unit Rates'!$D25*'ERG - Yearly volume scenarios'!M$43","v":256125},{"$f":"'ERG Unit Rates'!$D25*'ERG - Yearly volume scenarios'!N$43","v":256125},{"$f":"'ERG Unit Rates'!$D25*'ERG - Yearly volume scenarios'!O$43","v":256125}]
["Ergon Energy","2A","Minor","LED","Labour",{"$f":"'ERG Unit Rates'!$D26*'ERG - Yearly volume scenarios'!K$44","v":0},{"$f":"'ERG Unit Rates'!$D26*'ERG - Yearly volume scenarios'!L$44","v":0},{"$f":"'ERG Unit Rates'!$D26*'ERG - Yearly volume scenarios'!M$44","v":0},{"$f":"'ERG Unit Rates'!$D26*'ERG - Yearly volume scenarios'!N$44","v":0},{"$f":"'ERG Unit Rates'!$D26*'ERG - Yearly volume scenarios'!O$44","v":0}]
[null,"2A","Minor","LED","Material",{"$f":"'ERG Unit Rates'!$D27*'ERG - Yearly volume scenarios'!K$44","v":517322},{"$f":"'ERG Unit Rates'!$D27*'ERG - Yearly volume scenarios'!L$44","v":517322},{"$f":"'ERG Unit Rates'!$D27*'ERG - Yearly volume scenarios'!M$44","v":517322},{"$f":"'ERG Unit Rates'!$D27*'ERG - Yearly volume scenarios'!N$44","v":517322},{"$f":"'ERG Unit Rates'!$D27*'ERG - Yearly volume scenarios'!O$44","v":517322}]
{"$rows_left_out":127}
{"sheet":"ERG - Gross Capex ","index":15,"n_rows":98,"n_cols":8,"rows_kept":98,"cut":false,"hidden":false,"merged":[[1,1,1,5],[36,1,36,5],[66,1,66,5]]}
["1 - This tables shows the RATE 1 and RATE 2A LED capex conversions funded by Ergon"]
[null,"100%  LED deployment by 2030"]
[null,"2025-26","2026-27","2027-28","2028-29","2029-30"]
["Direct Costs ($Real 2024-25)"]
["Labour",{"$f":"'ERG - Forecast capex scenarios'!F138*'Cost Escalations'!$E$21*(1+'Cost Escalations'!B30)","v":2565823.2629344026},{"$f":"'ERG - Forecast capex scenarios'!G138*'Cost Escalations'!$E$21*(1+'Cost Escalations'!C30)","v":2638043.3266435019},{"$f":"'ERG - Forecast capex scenarios'!H138*'Cost Escalations'!$E$21*(1+'Cost Escalations'!D30)","v":2711093.8339020181},{"$f":"'ERG - Forecast capex scenarios'!I138*'Cost Escalations'!$E$21*(1+'Cost Escalations'!E30)","v":2789864.4585498236},{"$f":"'ERG - Forecast capex scenarios'!J138*'Cost Escalations'!$E$21*(1+'Cost Escalations'!F30)","v":2874454.0041424059}]
["Contractors",{"$f":"'ERG - Forecast capex scenarios'!F140*'Cost Escalations'!$E$21*(1+'Cost Escalations'!B26)","v":3466669.8063749913},{"$f":"'ERG - Forecast capex scenarios'!G140*'Cost Escalations'!$E$21*(1+'Cost Escalations'!C26)","v":3516806.532028262},{"$f":"'ERG - Forecast capex scenarios'!H140*'Cost Escalations'!$E$21*(1+'Cost Escalations'!D26)","v":3563938.1144588133},{"$f":"'ERG - Forecast capex scenarios'!I140*'Cost Escalations'!$E$21*(1+'Cost Escalations'!E26)","v":3622641.6550727976},{"$f":"'ERG - Forecast capex scenarios'!J140*'Cost Escalations'!$E$21*(1+'Cost Escalations'!F26)","v":3688326.2359526278}]
["Materials",{"$f":"'ERG - Forecast capex scenarios'!F139*'Cost Escalations'!$E$21","v":7561081.8784683077},{"$f":"'ERG - Forecast capex scenarios'!G139*'Cost Escalations'!$E$21","v":7585461.6178613938},{"$f":"'ERG - Forecast capex scenarios'!H139*'Cost Escalations'!$E$21","v":7609841.3572544781},{"$f":"'ERG - Forecast capex scenarios'!I139*'Cost Escalations'!$E$21","v":7634221.0966475653},{"$f":"'ERG - Forecast capex scenarios'!J139*'Cost Escalations'!$E$21","v":7658600.8360406496}]
["Total",{"$f":"SUM(B5:B7)","v":13593574.947777702},13740311.476533158,13884873.30561531,14046727.210270185,14221381.076135684]
[]
["Overheads & Oncosts"]
["Fleet oncost",{"$f":"B5*Overheads!$D$15","v":543031.72028546338},{"$f":"C5*Overheads!$D$15","v":558316.39947658847},{"$f":"D5*Overheads!$D$15","v":573776.83402692084},{"$f":"E5*Overheads!$D$15","v":590447.87619431433},{"$f":"F5*Overheads!$D$15","v":608350.43679732806}]
["Material oncosts",{"$f":"B7*Overheads!$D$9","v":601769.12377347832},{"$f":"C7*Overheads!$D$9","v":603709.45118273189},{"$f":"D7*Overheads!$D$9","v":605649.77859198547},{"$f":"E7*Overheads!$D$9","v":607590.10600123915},{"$f":"F7*Overheads!$D$9","v":609530.43341049273}]
["Network overheads",{"$f":"(B8+B11+B12)*Overheads!$D$19","v":1701449.8633727953},{"$f":"(C8+C11+C12)*Overheads!$D$19","v":1720378.1588559444},{"$f":"(D8+D11+D12)*Overheads!$D$19","v":1739075.6891870752},{"$f":"(E8+E11+E12)*Overheads!$D$19","v":1759909.2342480468},{"$f":"(F8+F11+F12)*Overheads!$D$19","v":1782362.6225986865}]
["Non-network overheads",{"$f":"B5*Overheads!$D$20","v":908353.95548731915},{"$f":"C5*Overheads!$D$20","v":933921.33632892929},{"$f":"D5*Overheads!$D$20","v":959782.7111855672},{"$f":"E5*Overheads!$D$20","v":987669.12468437187},{"$f":"F5*Overheads!$D$20","v":1017615.555306418}]
["Non-network depreciation",{"$f":"B5*Overheads!$D$25","v":353620.2630859791},{"$f":"C5*Overheads!$D$25","v":363573.59007378214},{"$f":"D5*Overheads!$D$25","v":373641.36830640206},{"$f":"E5*Overheads!$D$25","v":384497.48977579258},{"$f":"F5*Overheads!$D$25","v":396155.57153024786}]
{"$rows_left_out":84}
{"sheet":">>Forecast opex","index":16,"n_rows":0,"n_cols":0,"rows_kept":0,"cut":false,"hidden":false,"merged":[]}

{"sheet":"ERG - Opex BST","index":17,"n_rows":39,"n_cols":9,"rows_kept":39,"cut":false,"hidden":false,"merged":[]}
["Ergon Energy - Factors for the Base Step Trend Approach used to derive forecast opex"]
[]
["Table 1: Forecast Volume of LED and CONV Lights"]
["Volumes","2021-22","2022-23","2024-25","2025-26","2026-27","2027-28","2028-29","2029-30"]
["Conventional",null,null,null,{"$f":"'ERG - Yearly volume scenarios'!K83","v":46985},{"$f":"'ERG - Yearly volume scenarios'!L83","v":35241},{"$f":"'ERG - Yearly volume scenarios'!M83","v":23493},{"$f":"'ERG - Yearly volume scenarios'!N83","v":11747},{"$f":"'ERG - Yearly volume scenarios'!O83","v":0}]
["LED",null,null,null,{"$f":"'ERG - Yearly volume scenarios'!K84+'ERG - Yearly volume scenarios'!K106","v":111068},{"$f":"'ERG - Yearly volume scenarios'!L84+'ERG - Yearly volume scenarios'!L106","v":123225},{"$f":"'ERG - Yearly volume scenarios'!M84+'ERG - Yearly volume scenarios'!M106","v":135392},{"$f":"'ERG - Yearly volume scenarios'!N84+'ERG - Yearly volume scenarios'!N106","v":147564},{"$f":"'ERG - Yearly volume scenarios'!O84+'ERG - Yearly volume scenarios'!O106","v":159744}]
["Total",null,null,null,{"$f":"SUM(E5:E6)","v":158053},{"$f":"SUM(F5:F6)","v":158466},{"$f":"SUM(G5:G6)","v":158885},{"$f":"SUM(H5:H6)","v":159311},{"$f":"SUM(I5:I6)","v":159744}]
[]
["Table 2: Base Step Trend approach"]
["2a: Forecast Price Change"]
["Rate","2021-22","2022-23","2024-25","2025-26","2026-27","2027-28","2028-29","2029-30"]
["Labour",null,null,null,{"$f":"'Cost Escalations'!B29","v":1.1250515567042995E-2},{"$f":"'Cost Escalations'!C29","v":9.2135243940020661E-3},{"$f":"'Cost Escalations'!D29","v":9.1083556288052894E-3},{"$f":"'Cost Escalations'!E29","v":1.0777935799648537E-2},{"$f":"'Cost Escalations'!F29","v":1.2340188084018006E-2}]
["Contractor",null,null,null,{"$f":"'Cost Escalations'!B25","v":1.0500000000000001E-2},{"$f":"'Cost Escalations'!C25","v":7.1000000000000004E-3},{"$f":"'Cost Escalations'!D25","v":6.1000000000000004E-3},{"$f":"'Cost Escalations'!E25","v":9.1999999999999998E-3},{"$f":"'Cost Escalations'!F25","v":1.09E-2}]
["Materials/other",null,null,null,0,0,0,0,0]
[]
{"$rows_left_out":25}
{"sheet":"ERG - Forecast opex","index":18,"n_rows":39,"n_cols":8,"rows_kept":39,"cut":false,"hidden":false,"merged":[]}
["Table 1 - Opex Direct Costs","Actual"]
["Opex Direct Costs","2022-23","2024-25","2025-26","2026-27","2027-28","2028-29","2029-30"]
["Maintenance"]
["   Labour",68437.169999999984,{"$f":"B4*'Cost Escalations'!$E$21","v":75185.733880288695}]
["   Contractor",4774784.0299999993,{"$f":"B5*'Cost Escalations'!$E$21","v":5245623.7073425511}]
["   Materials",303078.30000000005,{"$f":"B6*'Cost Escalations'!$E$21","v":332964.73844097165}]
["   Other",458593.18,{"$f":"B7*'Cost Escalations'!$E$21","v":503814.88291808881}]
["Damage/Emergency"]
["   Labour",1332665.0599999998,{"$f":"B9*'Cost Escalations'!$E$21","v":1464078.6659167667}]
["   Contractor",331765.18000000005,{"$f":"B10*'Cost Escalations'!$E$21","v":364480.42100843863}]
["   Materials",401137.78,{"$f":"B11*'Cost Escalations'!$E$21","v":440693.82729311869}]
["  Other",52326.39,{"$f":"B12*'Cost Escalations'!$E$21","v":57486.275856470987}]
["Total direct opex",{"$f":"SUM(B4:B12)","v":7722787.089999998},{"$f":"SUM(C4:C12)","v":8484328.2526566964}]
[]
["Adjustments (material costs)"]
{"$rows_left_out":24}