{"text_format":"1","workbook":"xlsx","n_sheets":6,"sheets":["AER CF","AER NRs","AER lookups","AER ETL","Business & other details","5.2 Asset Age Profile"],"not_rendered":{"charts":0,"images":2,"macros":1,"external_links":15,"defined_names":780,"comments":1,"pivot_tables":0},"unopened":[],"bounds":{"document_bytes":16777216,"sheet_cells":100000,"rows_first":2000,"rows_last":500,"rows_between":2000,"halvings":0,"cell_chars":16384,"cell_head_chars":4096},"cells_cut":0,"cells_raw":0,"read":"whole","date_system":"1900"}

{"sheet":"AER CF","index":0,"n_rows":67,"n_cols":24,"rows_kept":67,"cut":false,"hidden":true,"merged":[[33,37,33,58],[33,68,33,89],[3,1,3,21],[31,37,31,58],[31,68,31,89],[32,37,32,58],[32,68,32,89]]}
[null,"AER CONDITIONAL FORMATTING"]
[]
[]
[null,"CONDITIONAL FORMATTING MAP"]
[null,null,null,null,null,"=INDEX(dms_CF_3.6.1, MATCH(dms_TradingName,dms_CF_TradingName))=\"Y\"","=INDEX(dms_CF_3.6.5, MATCH(dms_TradingName,dms_CF_TradingName))=\"Y\"","=INDEX(dms_CF_3.6.6, MATCH(dms_TradingName,dms_CF_TradingName))=\"Y\"","=INDEX(dms_CF_3.6.7.1, MATCH(dms_TradingName,dms_CF_TradingName))=\"Y\"","=INDEX(dms_CF_3.6.7.2, MATCH(dms_TradingName,dms_CF_TradingName))=\"Y\"","=INDEX(dms_CF_3.6.7.3, MATCH(dms_TradingName,dms_CF_TradingName))=\"Y\"","=INDEX(dms_CF_3.6.7.4, MATCH(dms_TradingName,dms_CF_TradingName))=\"Y\"","=INDEX(dms_CF_3.6.8, MATCH(dms_TradingName,dms_CF_TradingName))=\"Y\"","=INDEX(dms_CF_4.1, MATCH(dms_TradingName,dms_CF_TradingName))=\"Y\"","=INDEX(dms_CF_6.6.1, MATCH(dms_TradingName,dms_CF_TradingName))=\"Y\"","=INDEX(dms_CF_6.8, MATCH(dms_TradingName,dms_CF_TradingName))=\"Y\"","=INDEX(dms_CF_7.12, MATCH(dms_TradingName,dms_CF_TradingName))=\"Y\"","=INDEX(dms_CF_8.1_A, MATCH(dms_TradingName,dms_CF_TradingName))=\"Y\"","=INDEX(dms_CF_8.1_B, MATCH(dms_TradingName,dms_CF_TradingName))=\"Y\"","=INDEX(dms_CF_8.1_Neg, MATCH(dms_TradingName,dms_CF_TradingName))=\"Y\"","=INDEX(dms_CF_4.4.1_Neg, MATCH(dms_TradingName,dms_CF_TradingName))=\"Y\""]
[null,"dms_CF_TradingName","JurisdictionList","Sector","Segment","dms_CF_3.6.1","dms_CF_3.6.5","dms_CF_3.6.6","dms_CF_3.6.7.1","dms_CF_3.6.7.2","dms_CF_3.6.7.3","dms_CF_3.6.7.4","dms_CF_3.6.8","dms_CF_4.1","dms_CF_6.6.1","dms_CF_6.8","dms_CF_7.12","dms_CF_8.1_A","dms_CF_8.1_B","dms_CF_8.1_Neg","dms_CF_4.4.1","dms_CF_MAIFI_flag","Spare1","Spare2"]
[null,"ActewAGL Distribution","ACT","Electricity","Distribution",null,"Y",null,"Y","Y","N","Y","N","N","N","Y","Y","N","Y","Y","N","N","N","N"]
[null,"Ausgrid","NSW","Electricity","Distribution",null,"Y",null,"N","N","N","Y","N","N","N","Y","Y","N","Y","Y","N","N","N","N"]
[null,"AusNet (D)","Vic","Electricity","Distribution",null,"N",null,"N","N","N","N","N","Y","N","Y","N","N","N","Y","N","N","N","N"]
[null,"AusNet (T)","Vic","Electricity","Transmission",null,"N",null,"N","N","N","N","N","Y","N","Y","N","N","N","Y","N","N","N","N"]
[null,"CitiPower","Vic","Electricity","Distribution",null,"N",null,"N","N","N","N","N","Y","N","Y","N","N","N","Y","N","N","N","N"]
[null,"Directlink","Qld","Electricity","Transmission",null,"N",null,"N","N","N","N","N","Y","N","Y","N","N","Y","Y","N","N","N","N"]
[null,"ElectraNet","SA","Electricity","Transmission",null,"N",null,"N","N","N","N","N","Y","N","Y","N","N","Y","Y","N","N","N","N"]
[null,"Endeavour Energy","NSW","Electricity","Distribution",null,"Y",null,"N","N","N","Y","N","N","N","Y","Y","N","Y","Y","Y","N","N","N"]
[null,"Energex","Qld","Electricity","Distribution",null,"Y",null,"N","N","N","N","N","N","N","Y","Y","N","Y","Y","Y","N","N","N"]
[null,"Ergon Energy","Qld","Electricity","Distribution",null,"Y",null,"N","N","N","N","N","N","N","Y","Y","N","Y","Y","N","N","N","N"]
[null,"Essential Energy","NSW","Electricity","Distribution",null,"Y",null,"N","N","N","Y","N","N","N","Y","Y","N","Y","Y","N","N","N","N"]
[null,"Jemena Electricity","Vic","Electricity","Distribution",null,"N",null,"N","N","N","N","N","Y","N","Y","N","N","N","Y","N","N","N","N"]
[null,"Murraylink","SA","Electricity","Transmission",null,"N",null,"N","N","N","N","N","Y","N","Y","N","N","Y","Y","N","N","N","N"]
[null,"Power and Water","NT","Electricity","Distribution",null,"N",null,"N","Y","N","N","Y","Y","Y","Y","Y","N","Y","Y","N","N","N","N"]
[null,"Powercor Australia","Vic","Electricity","Distribution",null,"N",null,"N","N","N","N","N","Y","N","Y","N","N","N","Y","N","N","N","N"]
[null,"Powerlink","Qld","Electricity","Transmission",null,"N",null,"N","N","N","N","N","Y","N","Y","N","N","Y","Y","N","N","N","N"]
[null,"SA Power Networks","SA","Electricity","Distribution",null,"Y",null,"N","N","N","N","N","Y","N","Y","Y","Y","Y","N","N","N","N","N"]
[null,"TasNetworks (D)","Tas","Electricity","Distribution",null,"Y",null,"N","N","N","N","N","N","N","Y","Y","N","Y","Y","N","N","N","N"]
[null,"TasNetworks (T)","Tas","Electricity","Transmission",null,"N",null,"N","N","N","N","N","Y","N","Y","N","N","Y","Y","N","N","N","N"]
[null,"TransGrid","NSW","Electricity","Transmission",null,"N",null,"N","N","N","N","N","Y","N","Y","N","N","Y","Y","N","N","N","N"]
[null,"United Energy","Vic","Electricity","Distribution",null,"N",null,"N","N","N","N","N","Y","N","Y","N","N","N","Y","N","N","N","N"]
[]
[]
[null,"Confidential"]
[null,"Amended"]
[]
[null,"Worksheet 6.2 STPIS reliability"]
[null,"Formula",null,null,null,"Applied to:"]
[]
[null,"=INDEX(dms_CBD_flag,MATCH(dms_TradingName,dms_TradingName_List))=\"NO\"",null,null,null,"$D$11,$D$17,$D$23,$D$33,$D$39,$D$45,$D$55,$D$61,$D$67,$D$77,$D$83,$D$89"]
[null,"=INDEX(dms_Urban_flag,MATCH(dms_TradingName,dms_TradingName_List))=\"NO\"",null,null,null,"$D$12,$D$18,$D$24,$D$56,$D$62,$D$78,$D$68,$D$84"]
[null,"=INDEX(dms_ShortRural_flag,MATCH(dms_TradingName,dms_TradingName_List))=\"NO\"",null,null,null,"$D$13,$D$19,$D$25,$D$57,$D$63,$D$69,$D$79,$D$85"]
[null,"=INDEX(dms_LongRural_flag,MATCH(dms_TradingName,dms_TradingName_List))=\"NO\"",null,null,null,"$D$14,$D$20,$D$26,$D$58,$D$64,$D$65,$D$70,$D$71,$D$80,$D$86"]
[null,"=INDEX(dms_FeederType_5_flag,MATCH(dms_TradingName,dms_TradingName_List))=\"NO\"",null,null,null,"$D$87,$D$81,$D$71,$D$65,$D$59,$D$49,$D$43,$D$37,$D$21,$D$15"]
[null,"=dms_MAIFI_Flag=\"No\"",null,null,null,"$D$55:$D$72"]
[]
[]
[null,"Business & other details"]
[null,"=(INDEX(dms_Model_Span,MATCH(dms_Model,dms_Model_List))>1)"]
[null,"=(INDEX(dms_Model_Span,MATCH(dms_Model,dms_Model_List))=1)"]
[]
[]
[null,"STYLES IN USE"]
[null,null,"dms_1"]
[null,null,"dms_2"]
[null,null,"dms_3"]
[null,null,"dms_4"]
[null,null,"dms_5"]
[null,null,"dms_NUM"]
[null,null,"dms_NUM%"]
[null,null,"dms_Row_Locked"]
[null,null,"dms_Row1"]
[null,null,"dms_Row2"]
[null,null,"dms_T1"]
[null,null,"dms_T2"]
[null,null,"dms_BH"]
[null,null,"dms_BY1"]
[null,null,"dms_BY2"]
[null,null,"dms_GH"]
[null,null,"dms_GY1"]
[null,null,"dms_GY2"]

{"sheet":"AER NRs","index":1,"n_rows":226,"n_cols":15,"rows_kept":226,"cut":false,"hidden":true,"merged":[[31,67,31,88],[32,36,32,57],[32,67,32,88],[33,36,33,57],[33,67,33,88],[116,1,130,1],[4,1,26,1],[30,1,53,1],[31,10,33,10],[31,36,31,57],[34,10,38,10],[42,10,43,10],[63,1,76,1],[82,1,95,1],[98,1,105,1],[108,1,113,1],[193,1,194,1],[197,1,198,1],[206,1,211,1],[133,1,148,1],[150,1,156,1],[158,1,172,1],[174,1,175,1],[177,1,182,1],[189,1,190,1]]}
[null,"AER NAMED RANGES"]
[]
[null,"DROP DOWN SELECTORS USED IN WORKBOOKS"]
[]
[null,"COVER SHEET","dms_DataQuality_List","dms_Confid_status_List"]
[null,null,"-- select --","-- select --"]
[null,null,"Actual","Public"]
[null,null,"Estimate","Confidential"]
[null,null,"Consolidated"]
[]
[]
[null,null,"For all files either AER or business needs to be able to specify the type of submission","For PTRM & RFM templates we must provide a choice in case they change their form of control - otherwise it is drawn from the business specific lookup table above."]
[null,null,"dms_SourceList","dms_FormControl_Choices"]
[null,null,"-- select --","Revenue cap"]
[null,null,"After appeal","Revenue yield"]
[null,null,"Draft decision","Weighted average price cap"]
[null,null,"Final decision"]
[null,null,"PTRM update 1"]
[null,null,"PTRM update 2"]
[null,null,"PTRM update 3"]
[null,null,"PTRM update 4"]
[null,null,"PTRM update 5"]
[null,null,"PTRM update 6"]
[null,null,"PTRM update 7"]
[null,null,"Regulatory proposal"]
[null,null,"Reporting"]
[null,null,"Revised regulatory proposal"]
[]
[]
[null,null,null,null,null,null,null,null,null,null,"This is used to create an image to insert on 6.3 STPIS sheet - not for dropdown lists.",null,null,"GAS"]
[null,"CA & RESET RINS \nDNSP","dms_DNSP_020301_SubstationType","dms_DNSP_020301_ProjectType","dms_DNSP_020301_ProjectTrigger","dms_DNSP_020302_ProjectType","dms_DNSP_020302_ProjectTrigger","dms_STPIS_Exclusion_List","dms_Reason_Interruption","dms_Reason_Interruption_Detailed","Reason for interruption",null,null,"dms_N0205_AssetType"]
[null,null,"Subtransmission substation","New substation establishment","Demand growth","New line on new route - single circuit","Demand growth","Weather","Animal","Animal impact","Animal","Animal impact",null,"Cast Iron"]
[null,null,"Zone substation","Substation upgrade - capacity"," Voltage issues","New line on new route - dual circuit"," Voltage issues","Equipment failure","Asset failure","Animal nesting/burrowing, etc and other",null,"Animal nesting/burrowing, etc and other",null,"PVC"]
[null,null,"Switching station","Substation upgrade - voltage"," Reactive power issue","New line on new route - other"," Reactive power issue","Operational error","Other","Other",null,"Other",null,"Polyamide"]
[null,null,"Other","Other"," Fault level issues","Line rebuild over existing route - single circuit"," Fault level issues","Vegetation","Overloads","LV","Asset failure","LV",null,"High density polyethylene (80)"]
[null,null,null,null," Safety","Line rebuild over existing route - dual circuit"," Net market benefit","Animals","Planned","Distribution substation",null,"Distribution substation",null,"High density polyethylene (100)"]
[null,null,null,null," Environment","Reconductor - Single circuit"," Safety","Third party impacts","Network business","HV",null,"HV",null,"High density polyethylene (250)"]
[null,null,null,null," Other","Reconductor - Dual circuit"," Environment","Transmission failure","Third party","Zone substation",null,"Zone substation",null,"High density polyethylene (575)"]
[null,null,null,null,null,"Reconductor - Other"," Other","Load shedding","Unknown","Subtransmission",null,"Subtransmission",null,"Medium density polyethylene"]
[null,null,null,null,null,"Line upgrade - raising/retensoring",null,"Inter-distributor connection failure","Vegetation","insert description of 'other'","Other","insert description of 'other'",null,"Unprotected steel"]
[null,null,null,null,null,"Line upgrade - voltage upgrade",null,"Other","Weather","Network error","Overloads",null,null,"Protected steel"]
[null,null,null,null,null,"Line upgrade - capacity",null,null,"2 - STPIS Exclusion (3.3)(a)","Switching and protection error","Planned",null,null,"Other"]
[null,null,null,null,null,"String spare circuit",null,null,"3 - STPIS Exclusion (3.3)(a)","Fire","Network business","Network error"]
[null,null,null,null,null,"Other",null,null,"4 - STPIS Exclusion (3.3)(a)","Other",null,"Switching and protection error"]
[null,null,null,null,null,null,null,null,"5 - STPIS Exclusion (3.3)(a)","Dig-in","Third party","Fire"]
[null,null,null,null,null,null,null,null,"6 - STPIS Exclusion (3.3)(a)","Unauthorised access",null,"Other"]
[null,null,null,null,null,null,null,null,"7 - STPIS Exclusion (3.3)(a)","Vehicle impact",null,"Dig-in"]
[null,null,null,null,null,null,null,null,null,"Unknown",null,"Unauthorised access"]
[null,null,null,null,null,null,null,null,null,"Blow-in/Fall-in - NSP responsibility",null,"Vehicle impact"]
[null,null,null,null,null,null,null,null,null,"Grow-in - NSP responsibility","Unknown","Unknown"]
[null,null,null,null,null,null,null,null,null,"Blow-in/Fall-in - Other responsible party","Vegetation","Blow-in/Fall-in - NSP responsibility"]
[null,null,null,null,null,null,null,null,null,"Grow-in - Other responsible party",null,"Grow-in - NSP responsibility"]
[null,null,null,null,null,null,null,null,null,null,null,"Blow-in/Fall-in - Other responsible party"]
[null,null,null,null,null,null,null,null,null,null,null,"Grow-in - Other responsible party"]
[null,null,null,null,null,null,null,null,null,null,"Weather"]
[null,null,null,null,null,null,null,null,null,null,"2 - STPIS Exclusion (3.3)(a)"]
[null,null,null,null,null,null,null,null,null,null,"3 - STPIS Exclusion (3.3)(a)"]
[null,null,null,null,null,null,null,null,null,null,"4 - STPIS Exclusion (3.3)(a)"]
[null,null,null,null,null,null,null,null,null,null,"5 - STPIS Exclusion (3.3)(a)"]
[null,null,null,null,null,null,null,null,null,null,"6 - STPIS Exclusion (3.3)(a)"]
[null,null,null,null,null,null,null,null,null,null,"7 - STPIS Exclusion (3.3)(a)"]
[]
[]
[null,"CA & RESET RINS \nTNSP ","dms_TNSP_0203_SubstationType","dms_TNSP_020301_ProjectType","dms_TNSP_020301_ProjectTrigger","dms_TNSP_020302_ProjectType","dms_TNSP_0203_ProjectTrigger"]
[null,null,"Terminal station","New substation establishment","Demand growth","New line on new route - single circuit","Demand growth"]
[null,null,"Switching station","Capacity upgrade"," Voltage issues","New line on new route - dual circuit"," Voltage issues"]
[null,null,"Transmission substation","Voltage upgrade"," Reactive power issue","New line on new route - other"," Reactive power issue"]
[null,null,"Other","Other"," Fault level issues","Line rebuild over existing route - single circuit"," Fault level issues"]
[null,null,null,null,"Net market benefit","Line rebuild over existing route - dual circuit"," Net market benefit"]
[null,null,null,null," Safety","Reconductor - Single circuit"," Safety"]
[null,null,null,null," Environment","Reconductor - Dual circuit"," Environment"]
[null,null,null,null," Other","Reconductor - Other"," Other"]
[null,null,null,null,null,"Line upgrade - raising/retensoring"]
[null,null,null,null,null,"Line upgrade - voltage upgrade"]
[null,null,null,null,null,"Line upgrade - capacity"]
[null,null,null,null,null,"String spare circuit"]
[null,null,null,null,null,"Other"]
[]
[]
[]
[null,"NAMED RANGES USED IN ETL PROCESS"]
[]
[null,"CA & RESET RINS \nDNSP ONLY","dms_020303_01_UOM","dms_020501_01_UOM","dms_020501_02_UOM","dms_020501_03_UOM","dms_020501_04_UOM","dms_020701_01_UOM","dms_020701_02_UOM","dms_020701_01_Rows","dms_040102_01_UOM","dms_040102_04_UOM","dms_S140101_UOM","dms_S140102_UOM","dms_S140201_UOM"]
[null,null,"Circuit line length in km","0's","0's","0's","0's","km","km","Route line length within zone","0's","days","number","number","number per km"]
[null,null,"Circuit line length in km","0's","0's","0's","0's","0's","0's","Number of maintenance spans","0's","0's","number","number","number"]
[null,null,"Circuit line length in km","MVA added","MVA added","MVA added","MVA added","km","km","Total length of maintenance spans","0's","$0s","number","number","number"]
[null,null,"Circuit line length in km","0's","0's","0's","0's","km","km","Length of vegetation corridors","$0s","0's","km","number"]
[null,null,"Number","total spend $0s","total spend $0s","total spend $0s","total spend $0s","0's","0's","Average number of trees per maintenance span"]
[null,null,"Number","net circuit km added","net circuit km added","net circuit km added","net circuit km added","years","years","Average frequency of cutting cycle"]
[null,null,"Number","total spend $0s","total spend $0s","total spend $0s","total spend $0s"]
[null,null,null,"net circuit km added","net circuit km added","net circuit km added","net circuit km added"]
[null,null,null,"total spend $0s","total spend $0s","total spend $0s","total spend $0s"]
[null,null,null,"0's",null,"$0s"]
[null,null,null,"0's"]
[null,null,null,"0's"]
[null,null,null,"$0s"]
[]
[]
[null,"CA & RESET RINS \nTNSP ONLY","dms_020701_01_UOM"]
[null,null,"km"]
[null,null,"0's"]
[null,null,"km"]
[null,null,"0's"]
[null,null,"km"]
[null,null,"metres"]
[null,null,"years"]
[]
[]
[null,"CA & RESET RINS \nDNSP & TNSP","dms_020603_01_UOM"]
[null,null,"0's"]
[null,null,"0's"]
[null,null,"0's"]
[null,null,"0's"]
[null,null,"(per cent)"]
[]
[]
[null,"EB & RESET RINS \nDNSP ONLY","dms_030601_01_UOM","dms_030601_02_UOM","dms_030701_01_UOM","dms_030702_01_UOM","dms_030703_01_UOM"]
[null,null,"minutes/customer","minutes/customer","Customer / km","%","km"]
[null,null,"minutes/customer","minutes/customer","MWh/customer","Number of spans"]
[null,null,"interruptions/customer","interruptions/customer","kVA / customer","Number of spans"]
[null,null,"interruptions/customer","interruptions/customer",null,"Number of spans"]
[null,null,null,null,null,"Number of spans"]
[null,null,null,null,null,"Years"]
[null,null,null,null,null,"Years"]
[null,null,null,null,null,"Trees"]
[null,null,null,null,null,"Trees"]
[null,null,null,null,null,"Defects"]
[null,null,null,null,null,"Defects"]
[null,null,null,null,null,"Spans"]
[null,null,null,null,null,"km"]
[null,null,null,null,null,"Spans"]
[]
[null,null,"WHEN INSERTING COVER SHEET INTO A TNSP FILE - APPLY THESE NAMED RANGES"]
[null,"EB & RESET RINS \nTNSP ONLY","dms_030601_01_UOM",null,"dms_030701_01_UOM","dms_030702_01_UOM"]
[null,null,"%",null,"Number of spans","km"]
[null,null,"number",null,"Years","%"]
[null,null,"number",null,"Trees","km"]
[null,null,"%",null,"Defects","number"]
[null,null,"number",null,"Number of spans"]
[null,null,"number",null,"km"]
[null,null,"%",null,"km"]
[null,null,"number",null,"Number of spans"]
[null,null,"number"]
[null,null,"%"]
[null,null,"number"]
[null,null,"%"]
[null,null,"number"]
[null,null,"%"]
[null,null,"number"]
[]
[null,"EB & RESET RINS \nDNSP & TNSP","dms_EB_RAB_PIT"]
[null,null,"Beginning of year"]
[null,null,"End of year"]
[null,null,"End of year"]
[null,null,"End of year"]
[null,null,"End of year"]
[null,null,"End of year"]
[]
[null,"ARR \nDNSP ONLY","dms_030605_UOM","dms_03060703_UOM","Spare","Spare"]
[null,null,"number","number"]
[null,null,"number","number"]
[null,null,"number","number"]
[null,null,"number","number"]
[null,null,"number","(per cent)"]
[null,null,"number"]
[null,null,"number"]
[null,null,"number"]
[null,null,"number"]
[null,null,"number"]
[null,null,"number"]
[null,null,"number"]
[null,null,"(per cent)"]
[null,null,"(per cent)"]
[]
[null,"RFM","dms_Beg","dms_Mid","dms_End"]
[null,null,"Beginning of year","Mid year","End of Year"]
[]
[null,"PTRM","dms_PTRM_RAB_PIT","dms_PTRM_TAB_PIT","DMS_Xfactor"]
[null,null,"Beginning of year","Beginning of year","x factors"]
[null,null,"End of year","End of year"]
[null,null,"End of year","End of year"]
[null,null,"End of year","End of year"]
[null,null,"End of year"]
[]
[]
[null,"STPIS & MIC NAMED RANGES "]
[]
[null,"These \"row descriptions\" are the column headings in the various templates but become row descriptions in the ETL process"]
[]
[null,"Table 6.3 sustained interruptions - row descriptions","dms_060301_CustNo_Affected_Row","dms_060301_Avg_Duration_Sustained_Int_Row","dms_060301_Effect_unplanned_SAIDI_Row","dms_060301_Effect_unplanned_SAIFI_Row"]
[null,null,"Number of customers affected by the interruption","Average duration of sustained customer interruption","Effect on unplanned SAIDI","Effect on unplanned SAIFI"]
[]
[]
[null,"Table 6.1 telephone answering - row descriptions and start date","dms_060101_Rows","dms_060102_Rows","dms_060101_StartDateTxt"]
[null,null,"Total number of calls \n(after removing excluded events)","Number of calls answered within 30 seconds \n(after excluding excluded events) ",{"$f":"dms_060701_StartDateTxt","v":"1-Jul-2023"}]
[]
[]
[null,"Table 6.8.1 - row descriptions","dms_060801_01_Rows","dms_060801_02_Rows","dms_060801_03_Rows","dms_060801_04_Rows"]
[null,null,"Number of interruptions","Duration of interruptions","Total unplanned minutes off supply","Effect on unplanned MAIFI"]
[]
[]
[null,"Table 7.9.4 - market impact component - row descriptions","dms_070904_01_Rows","without exclusions","with exclusions"]
[]
[]
[null,"These headings (Lists) are determined from the INDEX/MATCH function on the NSP selected on the Business & other details sheet"]
[]
[null,"Table 6.7.1 - daily performance data - unplanned - MAIFI  -- row descriptions and header named range values","dms_060701_Feeder_Header_Lvl4",{"$f":"INDEX(dms_FeederName_1,MATCH(dms_TradingName,dms_TradingName_List))","v":"CBD"},{"$f":"INDEX(dms_FeederName_1,MATCH(dms_TradingName,dms_TradingName_List))","v":"CBD"},{"$f":"INDEX(dms_FeederName_2,MATCH(dms_TradingName,dms_TradingName_List))","v":"Urban"},{"$f":"INDEX(dms_FeederName_2,MATCH(dms_TradingName,dms_TradingName_List))","v":"Urban"},{"$f":"INDEX(dms_FeederName_3,MATCH(dms_TradingName,dms_TradingName_List))","v":"Short rural"},{"$f":"INDEX(dms_FeederName_3,MATCH(dms_TradingName,dms_TradingName_List))","v":"Short rural"},{"$f":"INDEX(dms_FeederName_4,MATCH(dms_TradingName,dms_TradingName_List))","v":"Long rural"},{"$f":"INDEX(dms_FeederName_4,MATCH(dms_TradingName,dms_TradingName_List))","v":"Long rural"},{"$f":"IF((INDEX(dms_FeederName_5,MATCH(dms_TradingName,dms_TradingName_List))=0),\"Network\",(INDEX(dms_FeederName_5,MATCH(dms_TradingName,dms_TradingName_List))))","v":"Network"},{"$f":"IF((INDEX(dms_FeederName_5,MATCH(dms_TradingName,dms_TradingName_List))=0),\"Network\",(INDEX(dms_FeederName_5,MATCH(dms_TradingName,dms_TradingName_List))))","v":"Network"},"Network","Network"]
[]
[null,null,"dms_060701_Rows","All events","After removing excluded events","All events","After removing excluded events","All events","After removing excluded events","All events","After removing excluded events","All events","After removing excluded events","All events","After removing excluded events"]
[null,null,null,"the number of column headings changes from 10 to 12 depending on the number of feeder categories for the NSP"]
[]
[null,null,"dms_0603_FeederList",{"$f":"INDEX(dms_FeederName_1,MATCH(dms_TradingName,dms_TradingName_List))","v":"CBD"},{"$f":"INDEX(dms_FeederName_2,MATCH(dms_TradingName,dms_TradingName_List))","v":"Urban"},{"$f":"INDEX(dms_FeederName_3,MATCH(dms_TradingName,dms_TradingName_List))","v":"Short rural"},{"$f":"INDEX(dms_FeederName_4,MATCH(dms_TradingName,dms_TradingName_List))","v":"Long rural"}]
[]
[]
[null,"Use these to add to specific worksheets in existing files","Use these to add to specific worksheets in existing files"]
[]
[]
[null,"ARRs 6.7 STPIS daily performance","dms_060101_Values","dms_060102_Values","dms_060701_Values"]
[null,null,"dms_LeapYear"]
[]
[]
[null,"ARR's  6.8 STPIS exclusions","dms_060801_Event_Date","dms_060801_OutageID","dms_060801_FeederID","dms_060801_FeederClass","dms_060801_CauseID","dms_060801_01_Values","dms_060801_02_Values","dms_060801_03_Values","dms_060801_Excl_Cat","dms_060801_04_Values"]
[null,null,"dms_060801_StartCell"]
[]
[]
[null,"CA 6.3 sustained interruptions","dms_060301_Event_Date","dms_060301_Event_Time","dms_060301_AssetID","dms_060301_FeederClass","dms_060301_Reason","dms_060301_DetailedReason","dms_060301_CustNo_Affected_Values","dms_060301_Avg_Duration_Sustained_Int_Values","dms_060301_Effect_unplanned_SAIDI_Values","dms_060301_Effect_unplanned_SAIFI_Values","dms_060301_MED"]

{"sheet":"AER lookups","index":2,"n_rows":99,"n_cols":38,"rows_kept":99,"cut":false,"hidden":true,"merged":[[16,65,16,86],[33,1,33,4],[6,25,6,36],[8,25,8,28],[8,31,8,35],[16,34,16,55]]}
[null,"AER LOOKUP TABLES"]
[]
[null,"Data in these columns used for data validation and database purposes."]
[null,"Date last modified:","2017-01-16","added (Albury and Victora) for AGN"]
[null,null,"2016-10-17","updated TransGrid's correct legal name, corrected TasNetworks (T) to June financial year"]
[null,null,"2017-02-01","inserted Power and Water, added NRs (dms_FeederCat_1 and dms_FeederCat_2)"]
[null,null,"2017-03-03","inserted AEMO as a business",null,null,null,null,null,null,null,null,null,null,null,null,null,null,null,null,null,null,null,null,null,"FOR ELECTRICITY BUSINESSES ONLY"]
[null,null,"2018-03-28","major changes to accommodate STPIS"]
[null,null,"Template Version",5,null,null,null,null,null,null,null,null,null,null,null,null,null,null,null,null,null,null,null,null,null,"Feeder Types",null,null,null,"TasNetworks (D)","MAIFI flag","Feeder Names"]
[]
[null,null,null,null,null,null,null,null,null,null,null,null,null,null,null,null,null,null,null,null,null,null,null,null,null,"CBD","Urban","Short rural","long rural","EXTRA"]
[null,"dms_TradingName_List","dms_TradingNameFull_List","dms_ABN_List","dms_JurisdictionList","dms_Sector_List","dms_Segment_List","dms_FormControl_List","dms_RPT_List","dms_RPTMonth_List","dms_CRCPlength_List","dms_FRCPlength_List","dms_PRCPlength_List","dms_663_List","dms_DeterminationRef_List","dms_Addr1_List","dms_Addr2_List","dms_Suburb_List","dms_State_List","dms_PostCode_List","dms_PAddr1_List","dms_PAddr2_List","dms_PSuburb_List","dms_PState_List","dms_PPostCode_List","dms_CBD_flag","dms_Urban_flag","dms_ShortRural_flag","dms_LongRural_flag","dms_FeederType_5_flag","dms_MAIFI_flag_List","dms_FeederName_1","dms_FeederName_2","dms_FeederName_3","dms_FeederName_4","dms_FeederName_5","dms_Public_Lighting_List","Column1"]
[null,"Ausgrid","Ausgrid","78 508 211 731","NSW","Electricity","Distribution","Revenue cap","Financial","June",5,5,5,5,"2014-19 Distribution Determination","570 George St",null,"SYDNEY","NSW",2000,"GPO Box 4009",null,"SYDNEY","NSW",2001,"YES","YES","YES","YES","NO","NO","CBD","Urban","Short rural","Long rural",null,"YES","Ausgrid"]
[null,"AusNet (D)","AusNet Electricity Services Pty Ltd",91064651118,"Vic","Electricity","Distribution","Revenue cap","Calendar","December",5,5,5,2,"2016-20 Distribution Determination","Level 32","2 Southbank Boulevard","SOUTHBANK","Vic",3006,"Locked Bag 14051",null,"MELBOURNE CITY MAIL CENTRE","Vic",8001,"NO","YES","YES","YES","NO","YES","CBD","Urban","Short rural","Long rural",null,"YES","AusNet (D)"]
[null,"Australian Distribution Co.","Australian Distribution Co.",11222333444,"-","Electricity","Distribution","Revenue cap","Financial","June",5,5,5,2,"distribution determination","123 Straight Street",null,"SYDNEY","NSW",2000,"PO Box 123",null,"SYDNEY","NSW",2000,"YES","YES","YES","YES","NO","NO","CBD","Urban","Short rural","Long rural",null,"YES","Australian Distribution Co."]
[null,"Australian Distribution Co. (Vic)","Australian Distribution Co. (Victoria)",11222333444,"Vic","Electricity","Distribution","Revenue cap","Calendar","December",5,5,5,2,"distribution determination","123 Straight Street",null,"MELBOURNE","Vic",3000,"PO Box 123",null,"MELBOURNE","Vic",3000,"NO","NO","NO","NO","NO","YES","CBD","Urban","Short rural","Long rural",null,"YES","Australian Distribution Co. (Vic)"]
[null,"CitiPower","CitiPower",76064651056,"Vic","Electricity","Distribution","Revenue cap","Calendar","December",5,5,5,2,"2016-20 Distribution Determination","40 Market Street",null,"MELBOURNE","Vic",3000,"Locked Bag 14090",null,"MELBOURNE","Vic",8001,"YES","YES","NO","NO","NO","YES","CBD","Urban","Short rural","Long rural"]
[null,"Endeavour Energy","Endeavour Energy",11247365823,"NSW","Electricity","Distribution","Revenue cap","Financial","June",5,5,5,5,"2014-19 Distribution Determination","51 Huntingwood Drive",null,"HUNTINGWOOD","NSW",2148,"PO Box 811",null,"SEVEN HILLS","NSW",1730,"NO","YES","YES","YES","NO","NO","CBD","Urban","Short rural","Long rural",null,"YES","Endeavour Energy"]
[null,"Energex","Energex",40078849055,"Qld","Electricity","Distribution","Revenue cap","Financial","June",5,5,5,5,"2015-20 Distribution Determination","26 Reddacliff Street",null,"NEWSTEAD","Qld",4006,"26 Reddacliff Street",null,"NEWSTEAD","QLD",4006,"YES","YES","YES","NO","NO","NO","CBD","Urban","Short rural","Long rural",null,"YES","Energex"]
[null,"Ergon Energy","Ergon Energy",50087646062,"Qld","Electricity","Distribution","Revenue cap","Financial","June",5,5,5,5,"2015-20 Distribution Determination","22 Walker Street",null,"TOWNSVILLE","Qld",4810,"Po Box 264",null,"FORTITUDE VALLEY","QLD",4006,"NO","YES","YES","YES","NO","NO","CBD","Urban","Short rural","Long rural",null,"YES","Ergon Energy"]
[null,"Essential Energy","Essential Energy",37428185226,"NSW","Electricity","Distribution","Revenue cap","Financial","June",5,5,5,5,"2014-19 Distribution Determination","8 Buller Street",null,"PORT MACQUARIE","NSW",2444,"PO Box 5730",null,"PORT MACQUARIE","NSW",2444,"NO","NO","YES","YES","NO","NO","CBD","Urban","Short rural","Long rural",null,"YES","Essential Energy"]
[null,"Evoenergy Distribution","Evoenergy Distribution",76670568688,"ACT","Electricity","Distribution","Revenue cap","Financial","June",5,5,5,5,"2014-19 Distribution Determination","40 Bunda Street",null,"CANBERRA","ACT",2600,"GPO BOX 366",null,"CANBERRA","ACT",2601,"NO","YES","YES","NO","NO","NO","CBD","Urban","Short rural","Long rural",null,"YES","ActewAGL Distribution"]
[null,"Evoenergy Distribution (Tx Assets)","Evoenergy Distribution (Tx Assets)",76670568688,"ACT","Electricity","Distribution","Revenue cap","Financial","June",5,5,5,5,"distribution determination","40 Bunda Street",null,"CANBERRA","ACT",2600,"GPO BOX 366",null,"CANBERRA","ACT",2601,"NO","YES","YES","NO","NO","NO","CBD","Urban","Short rural","Long rural",null,"NO","ActewAGL Distribution (Tx Assets)"]
[null,"Jemena Electricity","Jemena Electricity",82064651083,"Vic","Electricity","Distribution","Revenue cap","Calendar","December",5,5,5,2,"2016-20 Distribution Determination","Level 16","567 Collins Street","MELBOURNE","Vic",3000,"PO Box 16182",null,"MELBOURNE","Vic",8001,"NO","YES","YES","NO","NO","YES","CBD","Urban","Short rural","Long rural",null,"YES","Jemena Electricity"]
[null,"Power and Water","Power and Water Corporation",15947352360,"NT","Electricity","Distribution","Revenue cap","Financial","June",5,5,5,"x","distribution determination","GPO Box 1921",null,"DARWIN","NT",801,"GPO Box 1921",null,"DARWIN","NT",801,"YES","YES","YES","YES","NO","NO","CBD","Urban","Short rural","Long rural",null,"NO","Power and Water"]
[null,"Powercor Australia","Powercor Australia",89064651109,"Vic","Electricity","Distribution","Revenue cap","Calendar","December",5,5,5,2,"2016-20 Distribution Determination","40 Market Street",null,"MELBOURNE","Vic",3000,"Locked bag 14090",null,"MELBOURNE","Vic",8001,"NO","NO","YES","YES","NO","YES","CBD","Urban","Short rural","Long rural",null,"YES","Powercor Australia"]
[null,"SA Power Networks","SA Power Networks",13332330749,"SA","Electricity","Distribution","Revenue cap","Financial","June",5,5,5,5,"2015-20 Distribution Determination","1 Anzac Highway",null,"KESWICK","SA",5035,"GPO Box 77",null,"ADELAIDE","SA",5000,"NO","NO","YES","YES","NO","NO","CBD","Urban","Short rural","Long rural",null,"NO","SA Power Networks"]
[null,"TasNetworks (D)","TasNetworks (D)",24167357299,"Tas","Electricity","Distribution","Revenue cap","Financial","June",5,5,5,5,"distribution determination","1-7 Maria Street",null,"LENAH VALLEY","Tas",7008,"PO Box 606",null,"MOONAH","Tas",7009,"YES","YES","YES","YES","YES","NO","Critical Infrastructure","High density commercial","Urban","High density rural","Low density rural","YES","TasNetworks (D)"]
[null,"United Energy","United Energy",70064651029,"Vic","Electricity","Distribution","Revenue cap","Calendar","December",5,5,5,2,"2016-20 Distribution Determination","43-45 Centreway",null,"MOUNT WAVERLEY","Vic",3149,"PO Box 449",null,"MOUNT WAVERLEY","Vic",3170,"NO","NO","YES","NO","NO","YES","CBD","Urban","Short rural","Long rural",null,"YES","United Energy"]
[]
[]
[]
[]
[null,"The Reg Year Ending (dms_RYE) must be set to the last year of the regulatory period. For forecast data is is usually (FRCP_y5) for actual it is a single year (CRY). For historical actual data the RYE will need to be set manually in the business details sheet by setting the dms_Multiyear_flag to 1 and putting the correct value in 'dms_Specified_FinalYear. See cells C67:C68"]
[null,"dms_Model_List ","dms_Model_Name_Format1","dms_Worksheet_List","dms_Model_Span_List"]
[null,"ARR","Annual Reporting",{"$f":"IF(dms_MultiYear_ResponseFlag=\"yes\",\"NEW HISTORICAL ANNUAL REPORTING\",\"ANNUAL REPORTING\")","v":"ANNUAL REPORTING"},1]
[null,"CA","Category Analysis",{"$f":"IF(dms_MultiYear_ResponseFlag=\"yes\",\"NEW HISTORICAL CATEGORY ANALYSIS\",\"CATEGORY ANALYSIS\")","v":"CATEGORY ANALYSIS"},1]
[null,"CESS","Capitlal Expenditure","CAPITLAL EXPENDITURE SHARING SCHEMING",5]
[null,"CPI","CPI","CPI",5]
[null,"EB","Economic Benchmarking",{"$f":"IF(dms_MultiYear_ResponseFlag=\"yes\",\"NEW HISTORICAL ECONOMIC BENCHMARKING\",\"ECONOMIC BENCHMARKING\")","v":"ECONOMIC BENCHMARKING"},1]
[null,"Pricing","Pricing Proposal","PRICING PROPOSAL",5]
[null,"PTRM","Post Tax Revenue Model","POST TAX REVENUE MODEL",5]
[null,"Reset","Regulatory Reporting (Reset)","REGULATORY REPORTING STATEMENT",5]
[null,"RFM","Roll Forward Model","ROLL FORWARD MODEL",5]
[null,"WACC","Weighted Average Cost of Capital","WEIGHTED AVERAGE COST OF CAPITAL",1]
[]
[]
[]
[null,"Financial","Calendar",null,"PREVIOUS",null,"CURRENT",null,"FORTHCOMING"]
[null,"1987-88","1988","PRCP_y1",{"$f":"INDEX(INDIRECT(dms_RPT),dms_PRCP_start_row)","v":"2010-11"},"CRCP_y1",{"$f":"INDEX(INDIRECT(dms_RPT),dms_CRCP_start_row)","v":"2015-16"},{"$f":"FRCP_y1","v":"2020-21"},{"$f":"INDEX(INDIRECT(dms_RPT),dms_FRCP_start_row)","v":"2020-21"}]
[null,"1988-89","1989","PRCP_y2",{"$f":"INDEX(INDIRECT(dms_RPT),dms_PRCP_start_row+1)","v":"2011-12"},"CRCP_y2",{"$f":"INDEX(INDIRECT(dms_RPT),dms_CRCP_start_row+1)","v":"2016-17"},"FRCP_y2",{"$f":"INDEX(INDIRECT(dms_RPT),dms_FRCP_start_row+1)","v":"2021-22"}]
[null,"1989-90","1990","PRCP_y3",{"$f":"INDEX(INDIRECT(dms_RPT),dms_PRCP_start_row+2)","v":"2012-13"},"CRCP_y3",{"$f":"INDEX(INDIRECT(dms_RPT),dms_CRCP_start_row+2)","v":"2017-18"},"FRCP_y3",{"$f":"INDEX(INDIRECT(dms_RPT),dms_FRCP_start_row+2)","v":"2022-23"}]
[null,"1990-91","1991","PRCP_y4",{"$f":"INDEX(INDIRECT(dms_RPT),dms_PRCP_start_row+3)","v":"2013-14"},"CRCP_y4",{"$f":"INDEX(INDIRECT(dms_RPT),dms_CRCP_start_row+3)","v":"2018-19"},"FRCP_y4",{"$f":"INDEX(INDIRECT(dms_RPT),dms_FRCP_start_row+3)","v":"2023-24"}]
[null,"1991-92","1992","PRCP_y5",{"$f":"INDEX(INDIRECT(dms_RPT),dms_PRCP_start_row+4)","v":"2014-15"},"CRCP_y5",{"$f":"INDEX(INDIRECT(dms_RPT),dms_CRCP_start_row+4)","v":"2019-20"},"FRCP_y5",{"$f":"INDEX(INDIRECT(dms_RPT),dms_FRCP_start_row+4)","v":"2024-25"}]
[null,"1992-93","1993","PRCP_y6",{"$f":"INDEX(INDIRECT(dms_RPT),dms_PRCP_start_row+5)","v":"2015-16"},"CRCP_y6",{"$f":"INDEX(INDIRECT(dms_RPT),dms_CRCP_start_row+5)","v":"2020-21"},"FRCP_y6",{"$f":"INDEX(INDIRECT(dms_RPT),dms_FRCP_start_row+5)","v":"2025-26"}]
[null,"1993-94","1994","PRCP_y7",{"$f":"INDEX(INDIRECT(dms_RPT),dms_PRCP_start_row+6)","v":"2016-17"},"CRCP_y7",{"$f":"INDEX(INDIRECT(dms_RPT),dms_CRCP_start_row+6)","v":"2021-22"},"FRCP_y7",{"$f":"INDEX(INDIRECT(dms_RPT),dms_FRCP_start_row+6)","v":"2026-27"}]
[null,"1994-95","1995","PRCP_y8",{"$f":"INDEX(INDIRECT(dms_RPT),dms_PRCP_start_row+7)","v":"2017-18"},"CRCP_y8",{"$f":"INDEX(INDIRECT(dms_RPT),dms_CRCP_start_row+7)","v":"2022-23"},"FRCP_y8",{"$f":"INDEX(INDIRECT(dms_RPT),dms_FRCP_start_row+7)","v":"2027-28"}]
[null,"1995-96","1996","PRCP_y9",{"$f":"INDEX(INDIRECT(dms_RPT),dms_PRCP_start_row+8)","v":"2018-19"},"CRCP_y9",{"$f":"INDEX(INDIRECT(dms_RPT),dms_CRCP_start_row+8)","v":"2023-24"},"FRCP_y9",{"$f":"INDEX(INDIRECT(dms_RPT),dms_FRCP_start_row+8)","v":"2028-29"}]
[null,"1996-97","1997","PRCP_y10",{"$f":"INDEX(INDIRECT(dms_RPT),dms_PRCP_start_row+9)","v":"2019-20"},"CRCP_y10",{"$f":"INDEX(INDIRECT(dms_RPT),dms_CRCP_start_row+9)","v":"2024-25"},"FRCP_y10",{"$f":"INDEX(INDIRECT(dms_RPT),dms_FRCP_start_row+9)","v":"2029-30"}]
[null,"1997-98","1998","PRCP_y11",{"$f":"INDEX(INDIRECT(dms_RPT),dms_PRCP_start_row+10)","v":"2020-21"},"CRCP_y11",{"$f":"INDEX(INDIRECT(dms_RPT),dms_CRCP_start_row+10)","v":"2025-26"},"FRCP_y11",{"$f":"INDEX(INDIRECT(dms_RPT),dms_FRCP_start_row+10)","v":"2030-31"}]
[null,"1998-99","1999","PRCP_y12",{"$f":"INDEX(INDIRECT(dms_RPT),dms_PRCP_start_row+11)","v":"2021-22"},"CRCP_y12",{"$f":"INDEX(INDIRECT(dms_RPT),dms_CRCP_start_row+11)","v":"2026-27"},"FRCP_y12",{"$f":"INDEX(INDIRECT(dms_RPT),dms_FRCP_start_row+11)","v":"2031-32"}]
[null,"1999-00","2000","PRCP_y13",{"$f":"INDEX(INDIRECT(dms_RPT),dms_PRCP_start_row+12)","v":"2022-23"},"CRCP_y13",{"$f":"INDEX(INDIRECT(dms_RPT),dms_CRCP_start_row+12)","v":"2027-28"},"FRCP_y13",{"$f":"INDEX(INDIRECT(dms_RPT),dms_FRCP_start_row+12)","v":"2032-33"}]
[null,"2000-01","2001","PRCP_y14",{"$f":"INDEX(INDIRECT(dms_RPT),dms_PRCP_start_row+13)","v":"2023-24"},"CRCP_y14",{"$f":"INDEX(INDIRECT(dms_RPT),dms_CRCP_start_row+13)","v":"2028-29"},"FRCP_y14",{"$f":"INDEX(INDIRECT(dms_RPT),dms_FRCP_start_row+13)","v":"2033-34"}]
[null,"2001-02","2002","PRCP_y15",{"$f":"INDEX(INDIRECT(dms_RPT),dms_PRCP_start_row+14)","v":"2024-25"},"CRCP_y15",{"$f":"INDEX(INDIRECT(dms_RPT),dms_CRCP_start_row+14)","v":"2029-30"},"FRCP_y15",{"$f":"INDEX(INDIRECT(dms_RPT),dms_FRCP_start_row+14)","v":"2034-35"}]
[null,"2002-03","2003","PRCP_y16",{"$f":"INDEX(INDIRECT(dms_RPT),dms_PRCP_start_row+15)","v":"2025-26"},"CRCP_y16",{"$f":"INDEX(INDIRECT(dms_RPT),dms_CRCP_start_row+15)","v":"2030-31"},"FRCP_y16",{"$f":"INDEX(INDIRECT(dms_RPT),dms_FRCP_start_row+15)","v":"2035-36"}]
[null,"2003-04","2004"]
[null,"2004-05","2005"]
[null,"2005-06","2006",null,"CRY - FRY"]
[null,"2006-07","2007","dms_y1",{"$f":"IFERROR(INDEX(INDIRECT(dms_RPT),dms_CRY_start_row),0)","v":"2023-24"}]
[null,"2007-08","2008","dms_y2",{"$f":"IFERROR(INDEX(INDIRECT(dms_RPT),dms_CRY_start_row+1),0)","v":"2024-25"}]
[null,"2008-09","2009","dms_y3",{"$f":"IFERROR(INDEX(INDIRECT(dms_RPT),dms_CRY_start_row+2),0)","v":"2025-26"}]
[null,"2009-10",2010,"dms_y4",{"$f":"IFERROR(INDEX(INDIRECT(dms_RPT),dms_CRY_start_row+3),0)","v":"2026-27"}]
[null,"2010-11",2011,"dms_y5",{"$f":"IFERROR(INDEX(INDIRECT(dms_RPT),dms_CRY_start_row+4),0)","v":"2027-28"}]
[null,"2011-12",2012,"dms_y6",{"$f":"IFERROR(INDEX(INDIRECT(dms_RPT),dms_CRY_start_row+5),0)","v":"2028-29"}]
[null,"2012-13",2013,"dms_y7",{"$f":"IFERROR(INDEX(INDIRECT(dms_RPT),dms_CRY_start_row+6),0)","v":"2029-30"}]
[null,"2013-14",2014,"dms_y8",{"$f":"IFERROR(INDEX(INDIRECT(dms_RPT),dms_CRY_start_row+7),0)","v":"2030-31"}]
[null,"2014-15",2015,"dms_y9",{"$f":"IFERROR(INDEX(INDIRECT(dms_RPT),dms_CRY_start_row+8),0)","v":"2031-32"}]
[null,"2015-16",2016,"dms_y10",{"$f":"IFERROR(INDEX(INDIRECT(dms_RPT),dms_CRY_start_row+9),0)","v":"2032-33"}]
[null,"2016-17",2017,"dms_y11",{"$f":"IFERROR(INDEX(INDIRECT(dms_RPT),dms_CRY_start_row+10),0)","v":"2033-34"}]
[null,"2017-18",2018,"dms_y12",{"$f":"IFERROR(INDEX(INDIRECT(dms_RPT),dms_CRY_start_row+11),0)","v":"2034-35"}]
[null,"2018-19",2019,"dms_y13",{"$f":"IFERROR(INDEX(INDIRECT(dms_RPT),dms_CRY_start_row+12),0)","v":"2035-36"}]
[null,"2019-20",2020,"dms_y14",{"$f":"IFERROR(INDEX(INDIRECT(dms_RPT),dms_CRY_start_row+13),0)","v":"2036-37"}]
[null,"2020-21",2021,"dms_y15",{"$f":"IFERROR(INDEX(INDIRECT(dms_RPT),dms_CRY_start_row+14),0)","v":0}]
[null,"2021-22",2022,"dms_y16",{"$f":"IFERROR(INDEX(INDIRECT(dms_RPT),dms_CRY_start_row+15),0)","v":0}]
[null,"2022-23",2023]
[null,"2023-24",2024]
[null,"2024-25",2025]
[null,"2025-26",2026]
[null,"2026-27",2027]
[null,"2027-28",2028]
[null,"2028-29",2029]
[null,"2029-30",2030]
[null,"2030-31",2031]
[null,"2031-32",2032]
[null,"2032-33",2033]
[null,"2033-34",2034]
[null,"2034-35",2035]
[null,"2035-36",2036]
[null,"2036-37","2037"]

{"sheet":"AER ETL","index":3,"n_rows":146,"n_cols":8,"rows_kept":146,"cut":false,"hidden":true,"merged":[[12,0,16,0],[13,4,13,8],[15,2,15,4],[19,0,26,0],[27,0,32,0],[72,1,74,1],[33,68,33,89],[34,37,34,58],[34,68,34,89],[35,0,60,0],[35,37,35,58],[35,68,35,89],[33,37,33,58]]}
[null,"AER ETL INFORMATION"]
[]
[null,"USES NAMED RANGES FLAG","yes","dms_Defined_Names_Used"]
[]
[null,"IF THIS IS AN ABC RIN - make sure the the named range CRY is applied and the named range dms_dollar_nom_UOM is applied"]
[]
[null,"IF THIS IS A RESET RIN - make sure the named ranges CRY and dms_dollar_nom_UOM are NOT present in the workbook"]
[null,"FOR ABC RINS THAT SPAN MULTIPLE YEARS - make sure MultiYear Flag is set and final year entered as required"]
[]
[null,"Full trading name",{"$f":"INDEX(dms_TradingNameFull_List,MATCH(dms_TradingName,dms_TradingName_List))","v":"Ergon Energy"},null,"dms_TradingNameFull"]
[null,"Trading name",{"$f":"dms_TradingName","v":"Ergon Energy"}]
["Selected here","Model / RIN","CA","dms_Model"]
["Read from Business & other details","Source",{"$f":"dms_Selected_Source","v":"Reporting"},"dms_Source"]
[null,"Data quality",{"$f":"dms_Selected_Quality","v":"Consolidated"},"dms_DQ_1"]
[null,"Data status",{"$f":"dms_Selected_Status","v":"Public"},"dms_DQ_2"]
[null,"Amendment reason",{"$f":"dms_Amendment_Text","v":"."},null,null,"dms_AmendmentReason"]
[null,"Submission date",{"$f":"dms_Typed_Submission_Date","v":"dd/mm/yy"},"dms_SubmissionDate"]
[]
["Redundant","EBSS - First application of scheme in forthcoming period?","No"]
["Pre-populated from lookup table","Data ingestion data quality",{"$f":"dms_Selected_Quality","v":"Consolidated"},"dms_DataQuality","=IF(dms_DQ_2=\"Confidential\",\"Consolidated\",\"Public\")"]
[null,"Sector",{"$f":"INDEX(dms_Sector_List,MATCH(dms_TradingName,dms_TradingName_List))","v":"Electricity"},"dms_Sector","=INDEX(dms_Sector_List,MATCH(dms_TradingName,dms_TradingName_List))"]
[null,"Segment",{"$f":"INDEX(dms_Segment_List,MATCH(dms_TradingName,dms_TradingName_List))","v":"Distribution"},"dms_Segment","=INDEX(dms_Segment_List,MATCH(dms_TradingName,dms_TradingName_List))"]
[null,"Regulatory Year Ending",{"$f":"dms_RYE_result","v":"2024"},"dms_RYE","=IF(dms_MultiYear_Flag=1,LEFT(dms_Specified_FinalYear,2)&RIGHT(dms_Specified_FinalYear,2),INDEX(dms_RYE_Formula_Result,MATCH(dms_Model,dms_Model_List)))"]
[null,"Reporting Period Type",{"$f":"INDEX(dms_RPT_List,MATCH(dms_TradingName,dms_TradingName_List))","v":"Financial"},"dms_RPT","=INDEX(dms_RPT_List,MATCH(dms_TradingName,dms_TradingName_List))"]
[null,"EB/CA Unit of Measure for Monetary Values","$0s","dms_dollar_nom_UOM","If the cover sheet is attached to an ABC RIN apply the NAMED RANGE to the cell"]
[null,"Security Classification","Public","dms_Classification","Always Public"]
[null,"Jurisdiction",{"$f":"INDEX(dms_JurisdictionList,MATCH(dms_TradingName,dms_TradingName_List))","v":"Qld"},"dms_Jurisdiction","=INDEX(dms_JurisdictionList,MATCH(dms_TradingName,dms_TradingName_List))"]
["Relevant for PTRM, RFMs and Reset RINS","$ REAL REFERENCES"]
[null,"Does the named range CRY exist in this file? ",{"$f":"IFERROR(CRY,\"NO\")","v":"2023-24"}]
[null,"CRY-1  (last full calendar year before CRY)",{"$f":"IFERROR(IF(dms_RPT=\"calendar\",CRY-1,LEFT(CRY,4)),\"CRY not present\")","v":"2023"},"dms_Cal_Year_B4_CRY","'=IF(dms_RPT=\"financial\",VALUE(LEFT(dms_SingleYear_FinalYear_Result,4)),VALUE(LEFT(dms_SingleYear_FinalYear_Result,4)-1))"]
[null,"Dollar $ real month",{"$f":"INDEX(dms_RPTMonth_List,MATCH(dms_TradingName,dms_TradingName_List))","v":"June"},"dms_RPTMonth","=INDEX(dms_RPTMonth_List,MATCH(dms_TradingName,dms_TradingName_List))"]
[null,"Dollar $ real  (the last month before the FRCP_y1)",{"$f":"IF(dms_SingleYearModel=\"yes\",CONCATENATE(dms_RPTMonth)&\" \"&VALUE((LEFT(CRY,2))&RIGHT(CRY,2)),CONCATENATE(dms_RPTMonth)&\" \"&dms_DollarReal_year)","v":"June 2024"},"dms_DollarReal","=IF(SUM(dms_SingleYear_Model)>0,CONCATENATE(dms_RPTMonth)&\" \"&VALUE((LEFT(CRY,2))&RIGHT(CRY,2)),CONCATENATE(dms_RPTMonth)&\" \"&VALUE((LEFT(dms_RYE,2)&RIGHT(dms_RYE,2))))"]
[null,"Dollar $ real previous year (PRCP_y5)",{"$f":"IF(dms_SingleYearModel=\"yes\",CONCATENATE(dms_RPTMonth)&\" \"&VALUE((LEFT(CRY,2))&RIGHT(CRY,2)),CONCATENATE(dms_RPTMonth)&\" \"&dms_Previous_DollarReal_year)","v":"June 2024"},"dms_DollarReal_Prev","=IF(SUM(dms_SingleYear_Model)>0,CONCATENATE(dms_RPTMonth)&\" \"&VALUE(((LEFT(CRY,2))&RIGHT(CRY,2))-1),CONCATENATE(dms_RPTMonth)&\" \"&VALUE(((LEFT(dms_CRCP_FirstYear_Result,2)&RIGHT(dms_CRCP_FirstYear_Result,2))))-1)"]
[null,"PTRM/ RFMs"]
[null,"Form of control",{"$f":"INDEX(dms_FormControl_List,MATCH(dms_TradingName,dms_TradingName_List))","v":"Revenue cap"},"dms_FormControl","=INDEX(dms_FormControl_List,MATCH(dms_TradingName,dms_TradingName_List))"]
["All potential values for Regulatory Years or RYEs as calculated","This block works out the various RYE's for ALL RIN types and MODELS"]
[null,"dms_start_year",{"$f":"FRCP_y1","v":"2020-21"},"FRCP_y1 from cover sheet"]
[null,"dms_CRY_start_year",{"$f":"IFERROR(CRY,0)","v":"2023-24"}]
[null,"dms_CRY_start_row",{"$f":"IFERROR(MATCH(CRY,INDIRECT(dms_RPT),0),0)","v":37}]
[null,"dms_FRCP_start_row",{"$f":"MATCH(dms_start_year,INDIRECT(dms_RPT),0)","v":34},"Uses FRCP_y1 as a start reference"]
[null,"dms_CRCP_start_row",{"$f":"dms_FRCP_start_row-dms_CRCPlength_Num","v":29},"Uses the value in dms_CRCPlength_Num"]
[null,"dms_PRCP_start_row",{"$f":"dms_FRCP_start_row-dms_CRCPlength_Num-dms_PRCPlength_Num","v":24},"Uses the value in dms_CRCPlength_Num and dms_PRCPlength_Num"]
[null,"dms_RYE_start_row",{"$f":"dms_FRCP_start_row+(dms_FRCPlength_Num-1)","v":38},"Uses the value in dms_FRCPlength_Num-1"]
[null,"FRCP_start_year",{"$f":"INDEX(INDIRECT(dms_RPT),dms_FRCP_start_row)","v":"2020-21"},"Converts the FRCP start row to display the year"]
[null,"CRCP_start_year",{"$f":"INDEX(INDIRECT(dms_RPT),dms_CRCP_start_row)","v":"2015-16"},"Converts the CRCP start row to display the year"]
[null,"PRCP_start_year",{"$f":"INDEX(INDIRECT(dms_RPT),dms_PRCP_start_row)","v":"2010-11"},"Converts the PRCP start row to display the year"]
[null,"FRCP_final_year",{"$f":"INDEX(INDIRECT(dms_RPT),dms_FRCP_start_row+dms_FRCPlength_Num-1)","v":"2024-25"},"Finds the FRCP final year"]
[null,"CRCP_final_year",{"$f":"INDEX(INDIRECT(dms_RPT),dms_CRCP_start_row+dms_CRCPlength_Num-1)","v":"2019-20"},"Finds the CRCP final year"]
[null,"PRCP_final_year",{"$f":"INDEX(INDIRECT(dms_RPT),dms_PRCP_start_row+dms_FRCPlength_Num-1)","v":"2014-15"},"Finds the PRCP final year"]
[null,"dms_Reset_final_year",{"$f":"INDEX(INDIRECT(dms_RPT),dms_RYE_start_row)","v":"2024-25"},"For Resets and PTRM/RFMs (same as FRCP_final_year)"]
[null,"dms_SpecifiedYear_final_year",{"$f":"FRY","v":"2023-24"},"FRY from cover sheet"]
[null,"dms_DollarReal_year",{"$f":"LEFT(CRCP_final_year,2)&RIGHT(CRCP_final_year,2)","v":"2020"},"Uses the value in CRCP_final_year"]
[null,"dms_Previous_DollarReal_year",{"$f":"LEFT(PRCP_final_year,2)&RIGHT(PRCP_final_year,2)","v":"2015"},"Uses the value in PRCP_final_year"]
[null,"dms_CRY_RYE",{"$f":"IFERROR(LEFT(CRY,2)&RIGHT(CRY,2),0)","v":"2024"},"For ABC single year RINS"]
[null,"dms_Reset_RYE",{"$f":"IF(dms_Model_Span>1,IF(dms_Model=\"RFM\",(LEFT(dms_DollarReal_year,2)&RIGHT(dms_DollarReal_year,2)),(LEFT(dms_Reset_final_year,2)&RIGHT(dms_Reset_final_year,2))),0)","v":0},"If model span > 1 then uses dms_Reset_RYE otherwise it's a multi year ABC and uses dms_Specified_RYE"]
[null,"dms_Specified_RYE",{"$f":"IF(dms_MultiYear_ResponseFlag=\"Yes\",(LEFT(dms_Specified_FinalYear,2)&RIGHT(dms_Specified_FinalYear,2)),0)","v":0},"If multi year ABC - uses dms_Specified_FinalYear"]
[null,"dms_Model_Span",{"$f":"INDEX(dms_Model_Span_List,MATCH(dms_Model,dms_Model_List))","v":1},"A result of 5 is used to signify that it is more than 1 year span"]
[null,"dms_RYE_result",{"$f":"IF(dms_MultiYear_ResponseFlag=\"yes\",dms_Specified_RYE,(IF(dms_Model_Span>1,dms_Reset_RYE,dms_CRY_RYE)))","v":"2024"},"Nested IF - feeds into dms_RYE"]
[null,"dms_Reset_Span",{"$f":"IF(dms_Reset_RYE>0,CONCATENATE(FRCP_y1,\" to \",FRCP_final_year),0)","v":0},"Reset span of years as text"]
[null,"dms_SpecifiedYear_Span",{"$f":"IF(dms_Specified_RYE>0,CONCATENATE(CRY,\" to \",dms_Specified_FinalYear),0)","v":0},"Multi year ABC span of years as text"]
[null,"dms_Header_Span",{"$f":"IF(dms_MultiYear_Flag=1,dms_SpecifiedYear_Span,IF(dms_Model_Span>1,dms_Reset_Span,CRY))","v":"2023-24"},"NESTED IF - for Sheet Headers"]
[null,"ABC RINS THAT SPAN MULTIPLE YEARS"]
[null,"This is a multi year ABC RIN?","No"]
[null,null,{"$f":"IF(dms_MultiYear_ResponseFlag=\"No\",0,1)","v":0},"dms_MultiYear_Flag","This is set from the answer provided above"]
[null,null,{"$f":"IF(dms_MultiYear_Flag=1,FRY,\"not a Multiple year submission\")","v":"not a Multiple year submission"},"dms_Specified_FinalYear","The result here is returned to dms_CRCP_FinalYear_Result if response to Q in C73 is \"yes\" and dms_MultiYear_Flag is set to 1"]
[null," Start year for 5.2 in Multi year ABC RINS",{"$f":"IFERROR(IF(dms_MultiYear_Flag=1,FRY,CRY),\"not an ABC\")","v":"2023-24"},"dms_0502_Inst_Year","=IF(dms_MultiYear_Flag=1,FRY,CRY)",null,"For single year RINS this is CRY - multi year RINS need to start a the end of the span of years (ie. FRY)"]
[null,"WHAT IS THE RYE?"]
[null,"Reg Period Lengths"]
[null,"PRCP length in years",{"$f":"INDEX(dms_PRCPlength_List,MATCH(dms_TradingName,dms_TradingName_List))","v":5},"dms_PRCPlength_Num","=INDEX(dms_PRCPlength_List,MATCH(dms_TradingName,dms_TradingName_List))"]
[null,"CRCP length in years",{"$f":"INDEX(dms_CRCPlength_List,MATCH(dms_TradingName,dms_TradingName_List))","v":5},"dms_CRCPlength_Num","=INDEX(dms_CRCPlength_List,MATCH(dms_TradingName,dms_TradingName_List))"]
[null,"FRCP length in years",{"$f":"INDEX(dms_FRCPlength_List,MATCH(dms_TradingName,dms_TradingName_List))","v":5},"dms_FRCPlength_Num","=INDEX(dms_FRCPlength_List,MATCH(dms_TradingName,dms_TradingName_List))"]
[null,"Single year RIN?"]
[null,"Single Year ABC RIN ?",{"$f":"IF(dms_Model=\"EB\",1,0)","v":0},"dms_EB"]
[null,null,{"$f":"IF(dms_Model=\"CA\",1,0)","v":1},"dms_CA","=dms_SingleYear_Model"]
[null,null,{"$f":"IF(dms_Model=\"ARR\",1,0)","v":0},"dms_ARR"]
[null,"Is this a single Year ABC RIN?",{"$f":"IF(SUM(dms_SingleYear_Model)=1,\"yes\",\"no\")","v":"yes"},"dms_SingleYearModel","=IF(SUM(dms_SingleYear_Model)=1,\"yes\",\"no\")"]
[null,"Single Year Final Year Result",{"$f":"IF(AND(dms_SingleYearModel=\"yes\",dms_MultiYear_Flag=0),CRY,0)","v":"2023-24"},"dms_SingleYear_FinalYear_Result","=IFERROR(IF(SUM(dms_SingleYear_Model)<>0,(INDIRECT(dms_SingleYear_FinalYear_Ref)),\"not a single year RIN\"),\"CRY not present\")"]
[null,"Multi year RIN?"]
[]
[null,"Multi Year Reset/Model?",{"$f":"IF(dms_Model_Span>1,\"yes\",\"no\")","v":"no"}]
[null,"Final year result for Reset/Model",{"$f":"IF(dms_Model_Span>1,dms_Reset_final_year,0)","v":0},"dms_MultiYear_FinalYear_Result","dms_CRCP_FinalYear_Result"]
[]
[null,"Multi Year ABC RIN?",{"$f":"IF(dms_MultiYear_Flag=1,\"yes\",\"no\")","v":"no"},"dms_MultiYear_ABC_RIN"]
[null,"Final year result for ABC multi year",{"$f":"IF(dms_MultiYear_Flag=1,C51,0)","v":0}]
[]
[null,"EB RINS"]
[null,"Calendar Year for table 3.6 data",{"$f":"IFERROR(IF(dms_Segment=\"Transmission\",dms_Cal_Year_B4_CRY,CRY),\"CRY not present\")","v":"2023-24"},"dms_0306_Year","=IF(dms_Segment=\"Transmission\",dms_Cal_Year_B4_CRY,CRY)"]
[null,"CA RINS"]
[null,"Find how many rows in tables 6.3 sustained interruptions?",null,null,"dms_060301_MaxRows only returns a valid value when cover sheet is attached to a CA file"]
[null,null,{"$f":"IF(dms_Model<>\"CA\",\"not a CA\",\"Is a CA\")","v":"Is a CA"},null,"=IF(dms_Model<>\"CA\",\"not a CA\",\"Is a CA\")"]
[null,"dms_060301_Avg_Duration_Sustained_Int_Values present?",{"$f":"IFERROR(IF(INDEX(dms_060301_Avg_Duration_Sustained_Int_Values,1,1)<>\"\",\"yes\",\"no\"),\"no\")","v":"no"},"dms_060301_checkvalue","=IFERROR(IF(INDEX(dms_060301_Avg_Duration_Sustained_Int_Values,1,1)<>\"\",\"yes\",\"no\"),\"no\")"]
[null,null,{"$f":"IF(AND(dms_Model=\"CA\",(dms_060301_checkvalue=\"no\")),\"error - NR not present\",\"no errors\")","v":"error - NR not present"},null,"=IF(AND(dms_Model=\"CA\",(dms_060301_checkvalue=\"no\")),\"error - NR not present\",\"no errors\")"]
[null,"Table 6.3.1 - last row reference",{"$f":"IFERROR(IF(dms_Model=\"CA\",LOOKUP(2,1/(dms_060301_Avg_Duration_Sustained_Int_Values<>\"\"),(ROW(dms_060301_Avg_Duration_Sustained_Int_Values))),\"not a CA\"),\"6.3 not present\")","v":"6.3 not present"},"dms_060301_LastRow","=IFERROR(IF(dms_Model=\"CA\",LOOKUP(2,1/(dms_060301_Avg_Duration_Sustained_Int_Values<>\"\"),(ROW(dms_060301_Avg_Duration_Sustained_Int_Values))),\"not a CA\"),\"6.3 not present\")"]
[null,"Table 6.3.1 - max number rows",{"$f":"IFERROR(IF(dms_Model=\"CA\",(dms_060301_LastRow-15),\"not a CA\"),\"error\")","v":"error"},"dms_060301_MaxRows","=IFERROR(IF(dms_Model=\"CA\",(dms_060301_LastRow-15),\"not a CA\"),\"error\")"]
[null,"Table 6.6.3 - Public lighting repair - no. business days",{"$f":"INDEX(dms_663_List,MATCH(dms_TradingName,dms_TradingName_List))","v":5},"dms_663","=INDEX(dms_663_List,MATCH(dms_TradingName,dms_TradingName_List))"]
[null,"ARR or RESET RINS"]
[null,"How many rows in tables 6.1 or 6.7?  (leap year?)","insert dms_LeapYear NR if required",null,"'dms_LeapYear is used to determine dms_060701_Max_Rows BUT it is only found on worksheet 6.1 or 6.7 and the date value in the cell is used to determine whether it is a leap year"]
[null,"Is dms_LeapYear named range present?",{"$f":"IFERROR(IF(dms_LeapYear,\"yes\"),\"no\")","v":"no"}]
[null,"Table 6.7.1 - includes a leap year?",{"$f":"\nIFERROR(IF(MONTH(DATE(YEAR(dms_LeapYear),2,29))=2,\"is a leap year\",\"not a leap year\"),\n\"dms_LeapYear not present\")","v":"dms_LeapYear not present"},"dms_LeapYear_Result","=IFERROR(IF(MONTH(DATE(YEAR(dms_LeapYear),2,29))=2,\"is a leap year\",\"not a leap year\"),\"dms_LeapYear not present\")"]
[null,"MaxRows if Reset and leap year",{"$f":"IF(dms_LeapYear_Result=\"is a leap year\",1827,1826)","v":1826},"dms_060701_Reset_MaxRows","=IF(dms_LeapYear_Result=\"is a leap year\",1827,1826)",null,null,"number of days present in Reset RIN table"]
[null,"MaxRows if ARR and leap year",{"$f":"IF(dms_LeapYear_Result=\"is a leap year\",366,365)","v":365},"dms_060701_ARR_MaxRows","=IF(dms_LeapYear_Result=\"is a leap year\",366,365)",null,null,"number of days present in ARR RIN table"]
[null,"Table 6.7.1 - Max Rows (leap year/ non leap year)",{"$f":"IF(dms_Model=\"ARR\",dms_060701_ARR_MaxRows,IF(dms_Model=\"Reset\",dms_060701_Reset_MaxRows,\"not a relevant RIN type\"))","v":"not a relevant RIN type"},"dms_060701_MaxRows","=IF(dms_Model=\"ARR\",dms_060701_ARR_MaxRows,IF(dms_Model=\"Reset\",dms_060701_Reset_MaxRows,\"not a relevant RIN type\"))"]
[null,"How many columns in 6.7?   (4 or 5 feeder categories)",{"$f":"IF(dms_FifthFeeder_flag_NSP=\"NO\",\"This NSP has only 4 feeder categories\",\"This NSP has 5 feeder categories\")","v":"This NSP has only 4 feeder categories"}]
[null,"Table 6.7.1 - Last column (# of feeder categories > 4)",{"$f":"IF(dms_FifthFeeder_flag_NSP=\"NO\",10,12)","v":10},"dms_060701_MaxCols","=IF(dms_FifthFeeder_flag_NSP=\"NO\",8,10)"]
[null,"Table 6.7.1 - Number of offset rows",{"$f":"IF(dms_Model=\"ARR\",15,9)","v":9},"dms_060701_OffsetRows","=IF(dms_Model=\"ARR\",15,9)"]
[null,"Start date for telephone answering in 6.1 or 6.7?",null,null,"Using 060101 as naming standard not 060701 for start dates"]
[null,"Table 6.1.1 and 6.7.1 - Start Date as Text",{"$f":"IF(dms_SingleYearModel=\"yes\",(CONCATENATE(IF(LEN(CRY)=4,\"1-Jan-\",\"1-Jul-\"),LEFT(CRY,4))),(CONCATENATE(IF(LEN(PRCP_y4)=4,\"1-Jan-\",\"1-Jul-\"),LEFT(PRCP_y4,4))))","v":"1-Jul-2023"},"dms_060101_StartDateTxt","=IF(SUM(dms_SingleYear_Model)>1,(CONCATENATE(IF(LEN(CRY)=4,\"1-Jan-\",\"1-Jul-\"),LEFT(CRY,4))),(CONCATENATE(IF(LEN(CRCP_y4)=4,\"1-Jan-\",\"1-Jul-\"),LEFT(CRCP_y4,4))))"]
[null,"Table 6.1.1 and 6.7.1 - Start Date as Date Value",{"$f":"DATEVALUE(dms_060701_StartDateTxt)","v":45108},"dms_060101_StartDateVal","=DATEVALUE(dms_060701_StartDateTxt)"]
[null,"ARRs"]
[null,"How many rows in table 6.8?","insert dms_060801_StartCell NR if required",null,"dms_060801_StartCell is only found on worksheet 6.8 and is used to determine the starting date for the date range"]
[null,"Is dms_060801_StartCell named range present?","yes",null,"=IFERROR(IF((ROW(dms_060801_StartCell)-1)=1,\"yes\",\"yes\"),\"no\")"]
[null,"Table 6.8 - Number of offset rows",12,"dms_0608_OffsetRows","=IFERROR(IF(dms_Model=\"ARR\",(ROW(dms_060801_StartCell)-1),\"not an ARR\"),\"6.8 error\")"]
[null,"Table 6.8 - Last row","0","dms_0608_LastRow","=IFERROR(IF(dms_060801_StartCell<>\"\",IF(dms_Model=\"ARR\",(LOOKUP(2,1/(dms_060801_01_Values<>\"\"),(ROW(dms_060801_01_Values)))),\"not an ARR\"),0),\"0\")"]
[null,"Table 6.8 - MaxRows",{"$f":"IFERROR(IF(dms_Model=\"ARR\",(MAX(0,dms_0608_LastRow-dms_0608_OffsetRows)),\"not an ARR\"),\"0\")","v":"not an ARR"},"dms_060801_MaxRows","=IFERROR(IF(dms_Model=\"ARR\",(MAX(0,dms_0608_LastRow-dms_0608_OffsetRows)),\"not an ARR\"),\"0\")"]
[null,"TNSP RESET RINS"]
[null,"Table 7.9.4 only appears in TNSPs Reset RIN"]
[null,"Table 7.9.4 - first year",{"$f":"LEFT(PRCP_y3,4)","v":"2012"},"dms_070904_Start_Year","=LEFT(PRCP_y3,4)"]
[]
[null,"MISC"]
[null,"Distribution Determination Reference",{"$f":"INDEX(dms_DeterminationRef_List,MATCH(dms_TradingName,dms_TradingName_List))","v":"2015-20 Distribution Determination"},"dms_DeterminationRef"]
[null,"Public lighting NSP?",{"$f":"INDEX(dms_Public_Lighting_List,MATCH(dms_TradingName,dms_TradingName_List))","v":"YES"},"dms_Public_Lighting","=INDEX(dms_Public_Lighting_List,MATCH(dms_TradingName,dms_TradingName_List))"]
[null,"CBD Feeder for this business",{"$f":"INDEX(dms_CBD_flag,MATCH(dms_TradingName,dms_TradingName_List))","v":"NO"},"dms_CBD_flag_NSP"]
[null,"Urban Feeder for this business",{"$f":"INDEX(dms_Urban_flag,MATCH(dms_TradingName,dms_TradingName_List))","v":"YES"},"dms_Urban_flag_NSP"]
[null,"Short rural Feeder for this business",{"$f":"INDEX(dms_ShortRural_flag,MATCH(dms_TradingName,dms_TradingName_List))","v":"YES"},"dms_ShortRural_flag_NSP"]
[null,"Long rural Feeder for this business",{"$f":"INDEX(dms_LongRural_flag,MATCH(dms_TradingName,dms_TradingName_List))","v":"YES"},"dms_LongRural_flag_NSP"]
[null,"Fifth Feeder Category (eg. TasNetworks (D))",{"$f":"INDEX(dms_FeederType_5_flag,MATCH(dms_TradingName,dms_TradingName_List))","v":"NO"},"dms_FifthFeeder_flag_NSP","=INDEX(dms_FeederType_5_flag,MATCH(dms_TradingName,dms_TradingName_List))"]
[]
[null,"DISCARD FILES"]
[null,"discard this record?","NO","dms_DISCARD","If record is to be discarded from DB set this flag to YES"]
[]
[null,"SUBSET FILES"]
[null,"Is this Submission File a Subset File","NO","dms_Partial"]
[]
[]
[null,"REGULATORY YEARS FOR MULTI RYE SUBMISSIONS"]
[null,"Multiple RYE flag","NO","dms_Multi_RYE_flag"]
[null,null,"Manually specify RYE","Named ranges to apply"]
[null,null,2013,"dms_RYE_01"]
[null,null,2014,"dms_RYE_02"]
[null,null,2015,"dms_RYE_03"]
[null,null,2016,"dms_RYE_04"]
[null,null,2017,"dms_RYE_05"]
[null,null,2018,"dms_RYE_06"]
[null,null,2019,"dms_RYE_07"]
[null,null,2020,"dms_RYE_08"]
[null,null,2021,"dms_RYE_09"]

{"sheet":"Business & other details","index":4,"n_rows":75,"n_cols":81,"rows_kept":75,"cut":false,"hidden":true,"merged":[[0,7,2,15],[3,21,3,57],[7,21,7,75],[9,16,9,93],[16,21,16,35],[16,37,16,58],[32,21,32,35],[32,37,32,58],[32,60,32,66],[32,68,32,89],[24,21,24,35],[24,37,24,58],[24,60,24,66],[24,68,24,89],[25,21,25,35],[25,37,25,51],[25,60,25,66],[25,68,25,82],[26,21,26,35],[26,37,26,40],[26,49,26,51],[26,60,26,66],[26,68,26,71],[26,80,26,82],[17,21,17,35],[17,37,17,48],[23,21,23,35],[23,37,23,58],[23,60,23,66],[23,68,23,89],[46,25,46,34],[46,37,46,44],[46,46,46,53],[46,55,46,62],[46,64,46,71],[33,21,33,35],[33,37,33,58],[33,60,33,66],[33,68,33,89],[34,21,34,35],[34,37,34,58],[34,60,34,66],[34,68,34,89],[42,25,42,34],[42,37,42,44],[42,46,42,53],[42,55,42,62],[42,64,42,71],[42,73,42,80],[46,73,46,80],[43,37,43,44],[43,46,43,53],[43,55,43,62],[43,64,43,71],[43,73,43,80],[44,37,44,44],[44,46,44,53],[44,55,44,62],[44,64,44,71],[44,73,44,80],[47,37,47,44],[47,46,47,53],[47,55,47,62],[47,64,47,71],[47,73,47,80],[48,37,48,44],[48,46,48,53],[48,55,48,62],[48,64,48,71],[48,73,48,80],[50,73,50,80],[54,25,54,34],[54,37,54,44],[56,25,56,34],[56,37,56,44],[50,25,50,34],[50,37,50,44],[50,46,50,53],[50,55,50,62],[50,64,50,71],[51,64,51,71],[51,73,51,80],[52,37,52,44],[52,46,52,53],[52,55,52,62],[52,64,52,71],[51,37,51,44],[51,46,51,53],[51,55,51,62],[52,73,52,80],[62,25,62,34],[62,37,62,52],[70,25,72,34],[70,37,72,81],[74,25,74,34],[74,37,74,52],[64,25,64,34],[64,37,64,52],[66,25,66,34],[66,37,66,52],[68,25,68,34],[68,37,68,52]]}
[null,null,null,null,null,null,null,null,null,null,null,null,null,null,null,null,null,null,null,null,null,{"$f":"INDEX(dms_Worksheet_List,MATCH(dms_Model,dms_Model_List))","v":"CATEGORY ANALYSIS"}]
[null,null,null,null,null,null,null,null,null,null,null,null,null,null,null,null,null,null,null,null,null,{"$f":"INDEX(dms_TradingNameFull_List,MATCH(dms_TradingName,dms_TradingName_List))","v":"Ergon Energy"}]
[null,null,null,null,null,null,null,null,null,null,null,null,null,null,null,null,null,null,null,null,null,{"$f":"dms_Header_Span","v":"2023-24"}]
[null,null,null,null,null,null,null,null,null,null,null,null,null,null,null,null,null,null,null,null,null,"BUSINESS & OTHER DETAILS"]
[]
[]
[null,null,null,null,null,null,null,null,null,null,null,null,null,null,null,null,null,null,null,null,null,"INSTRUCTIONS"]
[null,null,null,null,null,null,null,null,null,null,null,null,null,null,null,null,null,null,null,null,null,"Complete the following business details regulatory template before entering data or values in any other regulatory template. This regulatory template is linked to other cells within the spreadsheet and automatically generates column headings and conditional formatting to distinguish business specific input and non-input cells. "]
[]
[null,null,null,null,null,null,null,null,null,null,null,null,null,null,null,null,"SUBMISSION PARTICULARS INPUT SHEET"]
[]
[]
[null,null,null,null,null,null,null,null,null,null,null,null,null,null,null,null,null,null,null,null,null,"ENTITY DETAILS"]
[]
[null,null,null,null,null,null,null,null,null,null,null,null,null,null,null,null,null,null,null,null,null,"Business Name"]
[]
[null,null,null,null,null,null,null,null,null,null,null,null,null,null,null,null,null,null,null,null,null,"Short name",null,null,null,null,null,null,null,null,null,null,null,null,null,null,null,"Ergon Energy"]
[null,null,null,null,null,null,null,null,null,null,null,null,null,null,null,null,null,null,null,null,null,"ACN/ABN",null,null,null,null,null,null,null,null,null,null,null,null,null,null,null,{"$f":"INDEX(dms_ABN_List,MATCH(dms_TradingName,dms_TradingName_List))","v":50087646062}]
[]
[]
[]
[null,null,null,null,null,null,null,null,null,null,null,null,null,null,null,null,null,null,null,null,null,"Business Address",null,null,null,null,null,null,null,null,null,null,null,null,null,null,null,null,null,null,null,null,null,null,null,null,null,null,null,null,null,null,null,null,null,null,null,null,null,null,null,null,null,null,null,null,null,null,"Postal Address"]
[]
[null,null,null,null,null,null,null,null,null,null,null,null,null,null,null,null,null,null,null,null,null,"Address 1",null,null,null,null,null,null,null,null,null,null,null,null,null,null,null,"420 Flinders Street",null,null,null,null,null,null,null,null,null,null,null,null,null,null,null,null,null,null,null,null,null,null,"Address 1",null,null,null,null,null,null,null,"PO Box 1090"]
[null,null,null,null,null,null,null,null,null,null,null,null,null,null,null,null,null,null,null,null,null,"Address 2",null,null,null,null,null,null,null,null,null,null,null,null,null,null,null,{"$f":"IF(ISBLANK(INDEX(dms_Addr2_List,MATCH(dms_TradingName,dms_TradingName_List))),\"\",(INDEX(dms_Addr2_List,MATCH(dms_TradingName,dms_TradingName_List))))","v":""},null,null,null,null,null,null,null,null,null,null,null,null,null,null,null,null,null,null,null,null,null,null,"Address 2",null,null,null,null,null,null,null,{"$f":"IF(ISBLANK(INDEX(dms_PAddr2_List,MATCH(dms_TradingName,dms_TradingName_List))),\"\",(INDEX(dms_PAddr2_List,MATCH(dms_TradingName,dms_TradingName_List))))","v":""}]
[null,null,null,null,null,null,null,null,null,null,null,null,null,null,null,null,null,null,null,null,null,"Suburb",null,null,null,null,null,null,null,null,null,null,null,null,null,null,null,{"$f":"INDEX(dms_Suburb_List,MATCH(dms_TradingName,dms_TradingName_List))","v":"TOWNSVILLE"},null,null,null,null,null,null,null,null,null,null,null,null,null,null,null,null,null,null,null,null,null,null,"Suburb",null,null,null,null,null,null,null,"TOWNSVILLE"]
[null,null,null,null,null,null,null,null,null,null,null,null,null,null,null,null,null,null,null,null,null,"State",null,null,null,null,null,null,null,null,null,null,null,null,null,null,null,{"$f":"INDEX(dms_State_List,MATCH(dms_TradingName,dms_TradingName_List))","v":"Qld"},null,null,null,null,null,null,null,null,null,"Post code",null,4810,null,null,null,null,null,null,null,null,null,null,"State",null,null,null,null,null,null,null,{"$f":"INDEX(dms_PState_List,MATCH(dms_TradingName,dms_TradingName_List))","v":"QLD"},null,null,null,null,null,null,null,null,null,"Post code",null,4810]
[]
[null,null,null,null,null,null,null,null,null,null,null,null,null,null,null,null,null,null,null,null,null,null,null,null,null,null,null,null,null,null,null,null,null,null,null,null,null,null,null,null,null,null,null,null,null,null,null,null,null,null,null,null,"`"]
[]
[null,null,null,null,null,null,null,null,null,null,null,null,null,null,null,null,null,null,null,null,null,"Contact Names"]
[]
[null,null,null,null,null,null,null,null,null,null,null,null,null,null,null,null,null,null,null,null,null,"Name",null,null,null,null,null,null,null,null,null,null,null,null,null,null,null,null,null,null,null,null,null,null,null,null,null,null,null,null,null,null,null,null,null,null,null,null,null,null,"Name"]
[null,null,null,null,null,null,null,null,null,null,null,null,null,null,null,null,null,null,null,null,null,"Phone",null,null,null,null,null,null,null,null,null,null,null,null,null,null,null,null,null,null,null,null,null,null,null,null,null,null,null,null,null,null,null,null,null,null,null,null,null,null,"Phone"]
[null,null,null,null,null,null,null,null,null,null,null,null,null,null,null,null,null,null,null,null,null,"Email",null,null,null,null,null,null,null,null,null,null,null,null,null,null,null,null,null,null,null,null,null,null,null,null,null,null,null,null,null,null,null,null,null,null,null,null,null,null,"Email"]
[]
[]
[]
[]
[null,null,null,null,null,null,null,null,null,null,null,null,null,null,null,null,"REGULATORY CONTROL PERIODS"]
[]
[]
[null,null,null,null,null,null,null,null,null,null,null,null,null,null,null,null,null,null,null,null,null,null,null,null,null,"Forthcoming period",null,null,null,null,null,null,null,null,null,null,null,"2020-21",null,null,null,null,null,null,null,null,{"$f":"FRCP_y2","v":"2021-22"},null,null,null,null,null,null,null,null,{"$f":"FRCP_y3","v":"2022-23"},null,null,null,null,null,null,null,null,{"$f":"FRCP_y4","v":"2023-24"},null,null,null,null,null,null,null,null,{"$f":"FRCP_y5","v":"2024-25"}]
[null,null,null,null,null,null,null,null,null,null,null,null,null,null,null,null,null,null,null,null,null,null,null,null,null,null,null,null,null,null,null,null,null,null,null,null,null,{"$f":"FRCP_y6","v":"2025-26"},null,null,null,null,null,null,null,null,{"$f":"FRCP_y7","v":"2026-27"},null,null,null,null,null,null,null,null,{"$f":"FRCP_y8","v":"2027-28"},null,null,null,null,null,null,null,null,{"$f":"FRCP_y9","v":"2028-29"},null,null,null,null,null,null,null,null,{"$f":"FRCP_y10","v":"2029-30"}]
[null,null,null,null,null,null,null,null,null,null,null,null,null,null,null,null,null,null,null,null,null,null,null,null,null,null,null,null,null,null,null,null,null,null,null,null,null,{"$f":"FRCP_y11","v":"2030-31"},null,null,null,null,null,null,null,null,{"$f":"FRCP_y12","v":"2031-32"},null,null,null,null,null,null,null,null,{"$f":"FRCP_y13","v":"2032-33"},null,null,null,null,null,null,null,null,{"$f":"FRCP_y14","v":"2033-34"},null,null,null,null,null,null,null,null,{"$f":"FRCP_y15","v":"2034-35"}]
[]
[null,null,null,null,null,null,null,null,null,null,null,null,null,null,null,null,null,null,null,null,null,null,null,"RESETS",null,"Current period",null,null,null,null,null,null,null,null,null,null,null,{"$f":"CRCP_y1","v":"2015-16"},null,null,null,null,null,null,null,null,{"$f":"CRCP_y2","v":"2016-17"},null,null,null,null,null,null,null,null,{"$f":"CRCP_y3","v":"2017-18"},null,null,null,null,null,null,null,null,{"$f":"CRCP_y4","v":"2018-19"},null,null,null,null,null,null,null,null,{"$f":"CRCP_y5","v":"2019-20"}]
[null,null,null,null,null,null,null,null,null,null,null,null,null,null,null,null,null,null,null,null,null,null,null,null,null,null,null,null,null,null,null,null,null,null,null,null,null,{"$f":"CRCP_y6","v":"2020-21"},null,null,null,null,null,null,null,null,{"$f":"CRCP_y7","v":"2021-22"},null,null,null,null,null,null,null,null,{"$f":"CRCP_y8","v":"2022-23"},null,null,null,null,null,null,null,null,{"$f":"CRCP_y9","v":"2023-24"},null,null,null,null,null,null,null,null,{"$f":"CRCP_y10","v":"2024-25"}]
[null,null,null,null,null,null,null,null,null,null,null,null,null,null,null,null,null,null,null,null,null,null,null,null,null,null,null,null,null,null,null,null,null,null,null,null,null,{"$f":"CRCP_y11","v":"2025-26"},null,null,null,null,null,null,null,null,{"$f":"CRCP_y12","v":"2026-27"},null,null,null,null,null,null,null,null,{"$f":"CRCP_y13","v":"2027-28"},null,null,null,null,null,null,null,null,{"$f":"CRCP_y14","v":"2028-29"},null,null,null,null,null,null,null,null,{"$f":"CRCP_y15","v":"2029-30"}]
[]
[null,null,null,null,null,null,null,null,null,null,null,null,null,null,null,null,null,null,null,null,null,null,null,null,null,"Previous period",null,null,null,null,null,null,null,null,null,null,null,{"$f":"PRCP_y1","v":"2010-11"},null,null,null,null,null,null,null,null,{"$f":"PRCP_y2","v":"2011-12"},null,null,null,null,null,null,null,null,{"$f":"PRCP_y3","v":"2012-13"},null,null,null,null,null,null,null,null,{"$f":"PRCP_y4","v":"2013-14"},null,null,null,null,null,null,null,null,{"$f":"PRCP_y5","v":"2014-15"}]
[null,null,null,null,null,null,null,null,null,null,null,null,null,null,null,null,null,null,null,null,null,null,null,null,null,null,null,null,null,null,null,null,null,null,null,null,null,{"$f":"PRCP_y6","v":"2015-16"},null,null,null,null,null,null,null,null,{"$f":"PRCP_y7","v":"2016-17"},null,null,null,null,null,null,null,null,{"$f":"PRCP_y8","v":"2017-18"},null,null,null,null,null,null,null,null,{"$f":"PRCP_y9","v":"2018-19"},null,null,null,null,null,null,null,null,{"$f":"PRCP_y10","v":"2019-20"}]
[null,null,null,null,null,null,null,null,null,null,null,null,null,null,null,null,null,null,null,null,null,null,null,null,null,null,null,null,null,null,null,null,null,null,null,null,null,{"$f":"PRCP_y11","v":"2020-21"},null,null,null,null,null,null,null,null,{"$f":"PRCP_y12","v":"2021-22"},null,null,null,null,null,null,null,null,{"$f":"PRCP_y13","v":"2022-23"},null,null,null,null,null,null,null,null,{"$f":"PRCP_y14","v":"2023-24"},null,null,null,null,null,null,null,null,{"$f":"PRCP_y15","v":"2024-25"}]
[]
[null,null,null,null,null,null,null,null,null,null,null,null,null,null,null,null,null,null,null,null,null,null,null,null,null,"Commencing year",null,null,null,null,null,null,null,null,null,null,null,"2023-24"]
[null,null,null,null,null,null,null,null,null,null,null,null,null,null,null,null,null,null,null,null,null,null,null,"ANNUAL RINS"]
[null,null,null,null,null,null,null,null,null,null,null,null,null,null,null,null,null,null,null,null,null,null,null,null,null,"Ending year",null,null,null,null,null,null,null,null,null,null,null,"2023-24"]
[]
[]
[]
[null,null,null,null,null,null,null,null,null,null,null,null,null,null,null,null,"SUBMISSION DETAILS"]
[]
[null,null,null,null,null,null,null,null,null,null,null,null,null,null,null,null,null,null,null,null,null,null,null,null,null,"RIN type",null,null,null,null,null,null,null,null,null,null,null,{"$f":"INDIRECT(dms_Model)","v":"Category Analysis"}]
[]
[null,null,null,null,null,null,null,null,null,null,null,null,null,null,null,null,null,null,null,null,null,null,null,null,null,"Source",null,null,null,null,null,null,null,null,null,null,null,"Reporting"]
[]
[null,null,null,null,null,null,null,null,null,null,null,null,null,null,null,null,null,null,null,null,null,null,null,"THIS FILE",null,"Data Quality",null,null,null,null,null,null,null,null,null,null,null,"Consolidated"]
[]
[null,null,null,null,null,null,null,null,null,null,null,null,null,null,null,null,null,null,null,null,null,null,null,null,null,"Confidentiality Status",null,null,null,null,null,null,null,null,null,null,null,"Public"]
[]
[null,null,null,null,null,null,null,null,null,null,null,null,null,null,null,null,null,null,null,null,null,null,null,null,null,"Amended RIN \nAmendment Reason",null,null,null,null,null,null,null,null,null,null,null,"."]
[]
[]
[]
[null,null,null,null,null,null,null,null,null,null,null,null,null,null,null,null,null,null,null,null,null,null,null,null,null,"Submission Date",null,null,null,null,null,null,null,null,null,null,null,"dd/mm/yy"]

{"sheet":"5.2 Asset Age Profile","index":5,"n_rows":128,"n_cols":119,"rows_kept":128,"cut":false,"hidden":false,"merged":[[9,3,9,4]]}
[null,"REGULATORY REPORTING STATEMENT"]
[null,{"$f":"INDEX(dms_TradingNameFull_List,MATCH(dms_TradingName,dms_TradingName_List))","v":"Ergon Energy"}]
[null,{"$f":"CONCATENATE((LOOKUP(dms_Model,dms_Model_List,dms_Worksheet_List))&\" \"&CRY)","v":"CATEGORY ANALYSIS 2023-24"}]
[null,"5.2 ASSET AGE PROFILE"]
[null," TEMPLATE DATE - MAY 2024"]
[]
[null,"There is ONE table on this worksheet. Both the ROWS and COLUMNS have been 'grouped' for easy navigation. See the Instructions sheet on how to group or ungroup data."]
[]
[null,"5.2.1 - ASSET AGE PROFILE"]
[null,null,null,"ECONOMIC LIFE (YEARS)",null,"INSTALLED ASSETS -˃ QUANTITY CURRENTLY IN COMMISSION BY YEAR"]
[null,"ASSET GROUP","ASSET CATEGORY","MEAN ","STANDARD DEVIATION ",{"$f":"CRY","v":"2023-24"},{"$f":"IF(dms_RPT=\"financial\",(VALUE(LEFT(F11,4)-1)&\"-\"&MID(F11,3,2)),VALUE(LEFT(F11,4)-1))","v":"2022-23"},"2021-22","2020-21","2019-20","2018-19","2017-18","2016-17","2015-16","2014-15","2013-14","2012-13","2011-12","2010-11","2009-10","2008-09","2007-08","2006-07","2005-06","2004-05","2003-04","2002-03","2001-02","2000-01","1999-00","1998-99","1997-98","1996-97","1995-96","1994-95","1993-94","1992-93","1991-92",{"$f":"IF(dms_RPT=\"financial\",(VALUE(LEFT(AL11,4)-1)&\"-\"&MID(AL11,3,2)),VALUE(LEFT(AL11,4)-1))","v":"1990-91"},"1989-90","1988-89","1987-88","1986-87","1985-86","1984-85","1983-84","1982-83","1981-82","1980-81","1979-80","1978-79","1977-78","1976-77","1975-76","1974-75","1973-74","1972-73","1971-72","1970-71","1969-70","1968-69","1967-68","1966-67","1965-66","1964-65","1963-64","1962-63","1961-62","1960-61","1959-60",{"$f":"IF(dms_RPT=\"financial\",(VALUE(LEFT(BR11,4)-1)&\"-\"&MID(BR11,3,2)),VALUE(LEFT(BR11,4)-1))","v":"1958-59"},"1957-58","1956-57","1955-56","1954-55","1953-54","1952-53","1951-52","1950-51","1949-50","1948-49","1947-48","1946-47","1945-46","1944-45","1943-44","1942-43","1941-42","1940-41","1939-40","1938-39","1937-38","1936-37","1935-36","1934-35","1933-34","1932-33","1931-32","1930-31","1929-30","1928-29","1927-28",{"$f":"IF(dms_RPT=\"financial\",(VALUE(LEFT(CX11,4)-1)&\"-\"&MID(CX11,3,2)),VALUE(LEFT(CX11,4)-1))","v":"1926-27"},"1925-26","1924-25","1923-24","1922-23","1921-22","1920-21","1919-20","1918-19","1917-18","1916-17","1915-16","1914-15","1913-14","1912-13","1911-12","1910-11"]
[null,"POLES BY: \nHIGHEST OPERATING VOLTAGE ; MATERIAL TYPE;  STAKING (IF WOOD)","Staking of a wooden pole"]
[null,null,"˂ = 1 kV; Wood",50,7.07,332,2852,3738,4979,4990,2789,2175,1787,1260,1830,2477,2068,2460,1749,2104,2016,2181,4289,4415,5208,5086,4369,4415,4081,3957,3461,3989,4011,4360,5245,4823,4713,5189,4556,4380,4357,3316,2948,4142,4772,4470,3941,5198,4390,3843,2858,3581,3629,3538,3304,3413,2700,2750,2793,3242,2553,2178,1738,1726,1527,1410,2123,1209,1199,1206,1174,1142,1163,1135,1135,1096,1093,1096,1100,1138,0,0,0,0,0,0,0,0,0,0,0,0,0,0,0,0,0,0,0,0,0,0,0,0,0,0,0,0,0]
[null,null,"> 1 kV & < = 11 kV; Wood",50,7.07,522,4402,5239,5717,5235,2903,2977,2368,1883,3583,4675,4434,4896,3917,3394,3870,5211,7363,6238,5564,5173,4199,4288,3907,4155,3727,4291,4608,5012,6537,5213,4863,5166,4757,4541,3950,2786,3633,4620,5517,5536,4600,6682,5269,5231,3364,3880,3748,3478,3041,3462,2141,2637,3069,3601,3147,2883,2423,2190,2614,3080,3033,1536,1515,1593,1458,1462,1469,1450,1480,1498,1527,1523,1575,1498,1,0,2,0,0,0,0,0,0,0,0,0,0,0,0,0,0,0,0,0,0,0,0,0,0,0,0,0,0]
[null,null,"˃ 11 kV & < = 22 kV; Wood",50,7.07,701,5961,5926,6399,5366,3152,2589,2460,1805,2571,2889,3157,4217,3446,2472,3526,3927,5037,4965,5863,5328,4917,5721,5548,5177,5424,3510,2940,3048,3720,3582,3574,3787,4909,5508,7426,6565,9387,12410,8035,8541,8037,11693,12377,7398,3414,2382,4137,4371,8516,7541,2943,3263,4400,5653,3903,3673,2989,3404,3468,2864,2517,1146,1000,842,825,772,766,740,735,742,760,768,776,775,0,0,0,0,0,0,0,0,0,0,0,0,0,0,0,0,0,0,0,0,0,0,0,0,0,0,0,0,0]
[null,null,"> 22 kV & < = 66 kV; Wood",50,7.07,155,715,686,856,1082,622,444,404,287,558,732,769,601,633,405,387,414,842,785,744,732,835,931,1078,1278,804,848,646,458,667,833,556,750,851,840,586,558,838,913,862,1470,1047,1517,887,761,592,500,672,917,838,516,1293,1126,471,1232,1053,1681,1797,531,1553,906,1447,217,424,217,232,593,179,209,348,273,469,296,200,285,36,33,34,0,0,0,0,0,0,0,0,0,0,0,0,0,0,0,0,0,0,0,0,0,0,0,0,0,0]
[null,null,"> 66 kV & < = 132 kV; Wood",50,7.07,0,12,20,7,15,6,6,10,3,4,21,3,1,2,35,14,16,20,18,9,5,15,100,36,7,9,4,6,3,5,5,135,10,8,3,2,2,10,3,13,7,4,197,17,4,140,39,280,89,254,74,8,2,250,36,445,621,14,511,74,0,2,3,2,1,0,203,3,2,3,3,3,2,1,1,0,0,0,0,0,0,0,0,0,0,0,0,0,0,0,0,0,0,0,0,0,0,0,0,0,0,0,0,0]
[null,null,"> 132 kV; Wood"]
[null,null,"˂ = 1 kV; Concrete",70,8.3699999999999992,2,2,4,26,0,13,3,7,4,3,5,47,35,61,72,59,84,52,101,64,49,59,108,79,135,97,78,101,64,159,130,96,177,57,91,194,185,55,64,37,30,26,31,33,27,2,5,5,3,1,2,6,7,15,17,8,5,11,4,3,1,1,0,0,0,0,0,0,0,0,0,0,0,0,0,0,0,0,0,0,0,0,0,0,0,0,0,0,0,0,0,0,0,0,0,0,0,0,0,0,0,0,0,0]
[null,null,"> 1 kV & < = 11 kV; Concrete",70,8.3699999999999992,0,20,7,2,40,0,2,2,2,0,2,4,3,5,9,5,8,50,163,3,1,2,5,2,125,34,241,17,17,14,43,34,75,37,23,26,45,46,101,122,18,12,2,0,5,2,2,1,0,1,2,0,1,2,0,3,1,0,1,2,2,0,0,0,0,1,0,0,1,0,0,0,0,0,0,0,0,0,0,0,0,0,0,0,0,0,0,0,0,0,0,0,0,0,0,0,0,0,0,0,0,0,0,0]
[null,null,"˃ 11 kV & < = 22 kV; Concrete",70,8.3699999999999992,0,0,4,23,16,2,1,1,2,1,4,1,1,65,2,40,4,0,13,16,6,1,17,7,3397,2389,19,11,54,202,161,123,183,215,278,745,115,28,69,73,1,0,2,2,2,1,1,1,0,4,0,0,2,1,0,0,1,0,0,0,0,0,0,0,0,0,0,0,0,0,0,0,0,0,0,0,0,0,0,0,0,0,0,0,0,0,0,0,0,0,0,0,0,0,0,0,0,0,0,0,0,0,0,0]
[null,null,"> 22 kV & < = 66 kV; Concrete",70,8.3699999999999992,0,25,69,35,7,109,38,19,45,17,25,60,107,90,88,150,191,307,255,248,364,91,348,211,455,860,347,942,262,229,44,42,58,154,1363,244,489,1397,2240,664,738,155,234,10,14,5,8,8,12,6,11,10,10,9,56,6,9,12,10,8,8,8,0,0,0,0,10,0,0,0,0,0,0,0,0,0,0,0,0,0,0,0,0,0,0,0,0,0,0,0,0,0,0,0,0,0,0,0,0,0,0,0,0,0]
[null,null,"> 66 kV & < = 132 kV; Concrete",70,8.3699999999999992,0,0,0,0,0,0,30,0,0,3,46,10,33,10,39,57,263,250,146,260,481,149,444,14,14,13,10,13,36,297,114,80,21,11,293,11,25,892,9,759,637,17,14,13,12,0,0,3,1,9,5,0,0,2,0,0,9,0,0,0,0,0,0,0,0,0,0,0,0,0,0,0,0,0,0,0,0,0,0,0,0,0,0,0,0,0,0,0,0,0,0,0,0,0,0,0,0,0,0,0,0,0,0,0]
[null,null,"> 132 kV; Concrete"]
[null,null,"˂ = 1 kV; Steel",60,7.75,41,709,1214,1311,1224,793,1118,1042,1098,1228,2098,3333,3568,3333,2741,3262,5347,4652,4977,3522,3380,2442,1903,2117,1766,1880,1951,1944,1906,1638,1446,1430,1357,1313,1302,45,42,30,54,46,45,37,41,38,46,44,49,38,39,33,43,28,31,38,49,49,43,21,16,14,16,10,1,0,1,0,1,0,0,0,0,0,0,0,0,0,0,0,0,0,0,0,0,0,0,0,0,0,0,0,0,0,0,0,0,0,0,0,0,0,0,0,0,0]
[null,null,"> 1 kV & < = 11 kV; Steel",60,7.75,1,11,12,7,6,5,0,1,2,0,6,29,45,32,22,48,50,69,87,27,50,28,21,38,49,36,51,21,30,41,28,30,33,25,26,18,13,7,11,12,5,4,16,15,7,5,5,4,3,6,8,6,5,14,15,11,10,3,3,7,4,0,0,0,0,0,0,0,0,0,0,0,0,0,0,0,0,0,0,0,0,0,0,0,0,0,0,0,0,0,0,0,0,0,0,0,0,0,0,0,0,0,0,0]
[null,null,"˃ 11 kV & < = 22 kV; Steel",60,7.75,0,7,7,7,2,1,1,2,1,0,8,4,8,39,30,4,144,4,1,2,7,4,6,4,1,1,0,3,1,3,1,1,1,0,0,2,6,1,0,0,0,0,1,0,0,0,0,0,4,1,1,3,0,0,0,0,0,0,0,4,0,0,0,0,0,0,0,0,0,0,0,0,0,0,0,0,0,0,0,0,0,0,0,0,0,0,0,0,0,0,0,0,0,0,0,0,0,0,0,0,0,0,0,0]
[null,null,"> 22 kV & < = 66 kV; Steel",60,7.75,0,1,0,1,2,0,1,1,1,0,3,33,36,39,34,47,37,30,27,29,52,29,23,30,36,36,34,30,32,28,28,26,31,25,30,0,1,1,5,5,3,1,2,2,4,1,2,0,1,0,0,1,51,0,2,72,4,2,1,1,1,0,0,0,0,0,536,445,0,0,0,0,0,0,33,0,0,0,0,0,0,0,0,0,0,0,0,0,0,0,0,0,0,0,0,0,0,0,0,0,0,0,0,0]
[null,null,"> 66 kV & < = 132 kV; Steel",60,7.75,0,0,0,0,0,0,0,0,0,0,0,6,9,7,7,6,3,8,3,3,2,6,6,4,3,3,4,6,159,14,2,4,3,3,3,11,0,0,287,0,0,23,197,0,2,1,0,0,0,0,0,0,16,0,0,1,0,0,0,48,0,0,0,0,0,0,0,0,0,0,0,0,0,0,0,0,0,0,0,0,0,0,0,0,0,0,0,0,0,0,0,0,0,0,0,0,0,0,0,0,0,0,0,0]
[null,null,"> 132 kV; Steel"]
[null,null,"Other"]
[null,"OVERHEAD CONDUCTORS BY: \nHIGHEST OPERATING VOLTAGE; NUMBER OF PHASES (AT HV)","˂ = 1 kV",60,7.75,84.861754289999993,135.27913760000001,180.60306320000001,181.19712250000001,143.02333669999999,83.316421770000005,73.285550220000005,70.716515819999998,148.68809469999999,141.8585085,135.1853696,157.65135309999999,180.21117179999999,163.2979674,175.8312981,217.4751713,214.3827115,268.62655890000002,237.13143260000001,222.27388719999999,125.7961165,106.1585259,129.99450210000001,124.5737494,143.932626,132.52257739999999,163.7144898,164.17781930000001,195.70284219999999,244.4074565,241.16156319999999,230.0334277,296.51580539999998,278.66896070000001,311.48603609999998,329.42215950000002,224.9651514,221.72390920000001,310.87307190000001,400.18897570000001,382.35138089999998,339.21892559999998,452.9711767,441.82237120000002,367.7646178,272.488247,338.1178152,375.42345519999998,357.70249669999998,378.57852050000002,371.72746480000001,325.03103859999999,349.43711710000002,327.73479279999998,369.8125139,308.14108709999999,289.54257209999997,246.53424960000001,238.7657236,234.87689460000001,223.72056570000001,255.16482880000001,136.85624319999999,150.2323451,163.3196586,154.1674343,165.11523080000001,168.97038760000001,180.5850619,186.58060879999999,179.24122879999999,269.34512000000001,225.60373050000001,227.759376,284.44891380000001,0.75678098699999996,0,4.6321968929999997]
[null,null,"> 1 kV & < = 11 kV",60,7.75,144.45426019999999,388.39883500000002,348.77951789999997,160.90528570000001,218.91899029999999,163.567305,173.58239689999999,202.18529229999999,308.2601641,396.58251159999998,354.2469845,407.49717709999999,484.88465389999999,419.19447229999997,391.42907309999998,579.11340489999998,478.887989,617.1403262,396.20203370000002,321.60513659999998,133.2820337,111.6414523,152.355279,196.03560959999999,236.2936942,227.6846821,286.75291520000002,315.93901369999998,373.32985000000002,596.44390989999999,426.77368860000001,441.73043089999999,520.40386960000001,490.12489629999999,482.45338370000002,436.32222510000003,243.8866314,352.70259909999999,472.8782271,586.69966850000003,606.77397829999995,526.40190399999994,856.27178700000002,782.6877882,836.27916730000004,441.70287309999998,512.37443859999996,565.98530849999997,566.51746649999995,473.8019572,606.2541056,339.73407350000002,488.9421572,578.67755620000003,744.35082250000005,642.98351079999998,656.85174529999995,666.43729689999998,601.40116279999995,867.83428590000005,938.39519810000002,634.28373810000005,278.57771100000002,294.334676,312.15769699999998,371.72527059999999,392.37448699999999,387.53778499999999,397.02851459999999,480.8059202,561.30826720000005,716.99156200000004,703.02652060000003,789.80928140000003,1449.328362,0,15.480923819999999,3.5450907279999999]
[null,null,"˃ 11 kV & < = 22 kV  ; SWER",60,7.75,51.295377960000003,135.1032922,72.641489160000006,53.540398830000001,55.306690629999999,60.008484070000002,42.969952399999997,99.359452759999996,97.00227237,80.576626660000002,145.07936799999999,214.715542,217.47964339999999,158.55767990000001,135.22678970000001,182.64764009999999,176.89996160000001,250.27766370000001,242.73343149999999,213.65381840000001,57.627120050000002,141.24485000000001,234.8318659,192.4913215,1022.685123,1772.1245550000001,205.46735190000001,204.29695369999999,204.76581870000001,256.92955760000001,341.76242680000001,366.6501743,644.2019626,574.68596600000001,623.30023600000004,1342.2845130000001,1269.707138,1494.610911,3087.1325860000002,2204.9129419999999,1828.3485619999999,2344.2681440000001,3726.2021719999998,4796.2982009999996,2974.0013739999999,967.56668109999998,666.48020029999998,866.93152950000001,1241.999151,2033.27143,2768.8806509999999,1151.2937099999999,994.64241089999996,1568.23948,2042.867855,1381.0500010000001,1077.081576,1275.5365790000001,1169.1848660000001,1468.9205139999999,1316.478529,1475.4803179999999,216.66878009999999,139.60516229999999,145.8073737,208.140567,189.9291499,221.74705520000001,280.41322070000001,273.54740220000002,323.53972759999999,342.36803220000002,436.27653529999998,457.08818150000002,865.24681859999998,0,0,0]
[null,null,"˃ 11 kV & < = 22 kV ; Single-Phase",60,7.75,19.08935009,32.750057920000003,12.972369860000001,3.9530554580000001,13.90163252,11.30480685,6.6474370460000003,5.0708614030000003,15.048547960000001,25.611963589999998,31.90012342,47.244871660000001,92.073998439999997,48.413529859999997,39.773521250000002,36.276421980000002,51.534739500000001,65.023613740000002,57.657211519999997,27.032602709999999,18.344408990000002,10.9856567,25.885107309999999,18.089709559999999,27.792806290000001,36.127932860000001,44.655833280000003,23.192572470000002,18.824836779999998,55.208170869999996,51.33917005,34.638315759999998,39.343932430000002,38.207085200000002,47.824132390000003,106.3507846,49.666364190000003,41.09409359,85.249240439999994,63.251060549999998,59.036111079999998,57.393796629999997,110.3266816,125.44761800000001,81.476994509999997,52.365637309999997,55.144088670000002,41.642583440000003,32.216474980000001,49.398517609999999,63.974553210000003,89.050990909999996,59.005531220000002,108.0358057,94.504338880000006,57.754665590000002,46.758793429999997,65.252040539999996,58.684622130000001,49.319191379999999,30.484634740000001,30.83436798,16.66962251,17.8784542,13.80683709,8.4309335940000008,18.635811799999999,17.443188790000001,14.618486450000001,17.790930209999999,10.6621802,20.50798176,20.956915030000001,32.373238209999997,39.415394820000003,0,0,0]
[null,null,"˃ 11 kV & < = 22 kV ; Multiple-Phase",60,7.75,53.195224160000002,100.1829608,82.072840869999993,32.577024850000001,67.256162099999997,39.062217160000003,46.621845620000002,59.364784090000001,71.930157820000005,141.1713795,127.95678599999999,114.6127226,201.5210835,141.29114999999999,160.0043503,151.9723458,128.6839951,145.85519840000001,93.242245060000002,85.243041309999995,32.362665210000003,55.891224309999998,43.717558289999999,74.367125509999994,119.8440374,109.8667695,68.851638519999995,78.242824519999999,56.746364100000001,149.9085494,119.9932185,132.67428799999999,115.6494318,229.47556760000001,196.46111289999999,358.0440949,249.22036610000001,222.04047270000001,312.37947279999997,246.86755049999999,208.28711229999999,172.12265930000001,288.10790900000001,348.5883197,283.81522849999999,164.71116129999999,140.25243409999999,143.19287890000001,152.471801,181.57959099999999,265.67796870000001,159.4603492,220.36127310000001,248.37621820000001,259.91886909999999,367.29080240000002,319.29927520000001,259.54735690000001,259.4126966,410.8525277,234.21058869999999,213.9419805,89.282017089999997,75.343651929999993,66.256394060000005,83.337600530000003,75.196352230000002,71.943412760000001,88.972061719999999,85.085426830000003,105.5769183,134.5294677,153.22391469999999,147.91641910000001,367.72413599999999,0,0,0]
[null,null,"> 22 kV & < = 66 kV",60,7.75,3.2496159489999998,34.203859790000003,12.51255276,29.837248030000001,39.186831249999997,28.342252590000001,22.596502529999999,27.998636449999999,36.333757720000001,71.296628080000005,56.935252120000001,48.231517140000001,81.974791039999999,134.1642871,60.202130859999997,91.41531268,54.538524150000001,151.54986719999999,53.463127380000003,75.301658799999998,76.649139550000001,48.546951389999997,100.1525279,116.101214,190.83848140000001,411.57612219999999,56.002537359999998,446.86753520000002,48.719303029999999,150.5067253,111.8091647,47.33455945,104.44849960000001,75.176139829999997,460.11578029999998,192.95029529999999,172.0813225,499.16570480000001,592.52536429999998,333.09776599999998,406.7914725,142.60578820000001,318.5067032,129.65734430000001,130.3182175,95.06108931,65.692043549999994,115.1461853,152.20104570000001,160.1478659,126.0277529,248.54006089999999,265.81650869999999,60.406832190000003,254.9994293,551.6194299,250.33836700000001,367.13406090000001,117.4105392,459.59344850000002,222.2338168,246.7252101,42.529434719999998,51.530979719999998,38.478906670000001,88.119255129999999,198.56535980000001,126.4019531,45.826525349999997,124.5602092,100.8800462,192.580151,129.89192779999999,127.81940849999999,429.77367550000002,14.037098200000001,24.870714249999999,4.7040981510000002]
[null,null,"> 66 kV & < = 132 kV",60,7.75,8.0629625960000002,0,0,0,2.156284415,3.2484869280000002,0,0.151785373,4.8567065549999997,1.863619551,14.845758460000001,3.7273568749999999,0.228276219,79.949068339999997,45.749142820000003,5.4512703629999999,99.094438940000003,28.466887140000001,31.13138198,0.78704959699999999,123.14564540000001,35.191921430000001,150.63969779999999,28.169258060000001,4.6290008240000002,5.1889238520000003,0,0.12503365799999999,163.06403760000001,71.687363640000001,35.633188390000001,35.081560590000002,17.044339730000001,7.0686675289999998,106.9173516,19.78204753,2.4784527359999999,262.3005331,281.74116939999999,262.9588991,174.73632420000001,14.790896630000001,133.24059629999999,27.31640075,62.963856419999999,7.2354576069999998,20.31521468,9.3457866640000002,46.879505620000003,12.49363275,38.299348639999998,24.004663470000001,4.8896823239999998,15.069484689999999,38.659512550000002,97.073753019999998,104.78271359999999,23.177192210000001,43.482112270000002,77.849327759999994,0,0,2.9387185179999999,4.9989381100000001,4.8179002439999996,0,24.65474523,0.25530062100000001,0,0,0,6.6131158799999996,1.1321129999999999E-3,4.753583034,3.9016810720000001,0,0,0]
[null,null,"> 132 kV"]
[null,null,"Other"]
[null,"UNDERGROUND CABLES BY: \nHIGHEST OPERATING VOLTAGE","˂ = 1 kV",50,7.07,120.1006896,217.7838175,210.9435604,207.78664319999999,126.1586787,152.510469,199.27040919999999,78.483360180000005,155.33884520000001,234.7477849,265.26035780000001,359.01027169999998,379.01638709999997,336.1032343,490.09582949999998,1077.028988,1187.676111,599.88643379999996,211.72348049999999,293.66468909999998,78.32314384,16.329900640000002,12.2288833,4.2152286429999997,5.9289740679999996,3.6686335059999999,1.998027958,3.4329707140000001,5.9892869000000001E-2,3.0461263270000001,10.321469779999999,7.8167543769999996,1.5815737969999999,5.032048273,0,1.178819399,0.53033804500000004,0,0.69652319600000001,0,0.40408941100000001,0,0,0.24794871600000001,0,0,0,3.6227891999999998E-2,0,0,0.18540057099999999,0,0,6.6944097999999994E-2,0.43131494799999998,0,0,0,0,0,0,0,0,0,0,0,0,0,0,0,0,0,0,0,0,0,0,0,0,0,0,0,0,0,0,0,0,0,0,0]
[null,null,"> 1 kV & < = 11 kV",50,7.07,10.21136482,20.93323857,19.810894170000001,18.41215549,21.422236819999998,25.966377470000001,38.967826420000002,16.894768169999999,26.660630510000001,34.660170919999999,73.762622579999999,107.8900792,93.634381680000004,111.3535081,142.76724039999999,178.13958650000001,172.1839707,88.165416559999997,45.134168219999999,58.879078890000002,47.589102629999999,65.68386409,42.074340960000001,11.925654590000001,32.820041869999997,94.331288619999995,17.75064897,15.06665143,12.6825396,10.127756189999999,23.137074850000001,16.699837649999999,28.110396420000001,16.468625939999999,11.812592110000001,8.6034111370000002,3.9538600060000002,4.1836101279999998,19.987705009999999,20.003085030000001,10.604648600000001,5.608746676,17.278374589999999,10.10606518,7.1603989270000001,2.898277389,4.425360124,2.450355397,2.5602309010000002,25.540968639999999,1.5096668689999999,0.63296166700000001,3.4548940400000001,2.3638380799999998,1.952702548,1.150394599,0.35109263099999999,0.21345903299999999,0.32620655999999998,3.136343111,0.12760940800000001,0.47094678499999998,0,0,1.5293846999999999E-2,0,0,0.332502256,0,0.83206957400000003,0,0,0,0,3.4119078999999997E-2,0,0,0,0,0,0,0,0,0,0,0,0,0,0.40559620299999999,0]
[null,null,"> 11 kV & < = 22 kV",50,7.07,1.037460305,7.4804908560000003,5.8798709139999996,0.97111657200000001,21.055299430000002,10.276290639999999,8.1054428010000006,5.6941466949999997,12.62091719,12.5943422,17.59278986,16.117206889999999,21.941233100000002,22.545589849999999,35.92978609,78.382537310000004,102.19937040000001,35.671451679999997,17.392840320000001,25.617074370000001,16.26924868,4.0169868620000004,4.2376257759999998,6.0565092910000002,17.605896999999999,25.533961699999999,14.32518149,11.90425574,7.6398175779999997,22.98667416,19.69781699,10.41540475,15.49133215,5.4538219960000003,7.6710559409999997,10.62625523,1.824279539,14.23052202,4.3435767859999999,52.056795520000001,3.6384241909999999,3.0276789709999998,5.1900404330000001,2.2560862689999999,1.844022729,1.2172159090000001,0,0.73519058900000001,0.138265417,4.5966582579999997,0,6.4270855000000002E-2,7.9084333000000007E-2,0.68564498299999999,1.932854928,0.77420065500000002,0.36177849000000001,0.13203785300000001,0,3.128446694,0,1.0396495290000001,7.8250547000000004E-2,0,0.245060628,0.13275436600000001,4.3849808999999997E-2,0.35844587700000002,0.70638274300000004,0,0,0.21263755200000001,0,0,0,0,0,0,0,0,0,0,0,0,0,0,0,0,0,0]
[null,null,"> 22 kV & < = 33 kV",50,7.07,6.1181513560000003,0.399141731,3.4549387829999998,4.1524080999999997E-2,0.54035795499999995,0,2.3916297179999999,5.4690030000000001E-3,0.73308936999999996,5.6678409999999999E-3,0.566089591,3.4660933639999998,2.2101018219999999,9.8959874659999993,5.5234285520000004,5.026982683,0.27399382900000002,0.90385346200000005,0.70999024600000005,5.6898039579999997,1.613213491,0.23123389799999999,2.2900996560000002,0,0.114825092,0.40094073499999999,7.9234827999999993E-2,1.66689E-2,9.8728589999999995E-3,2.9264315999999999E-2,0,0.59183779199999997,5.5227705000000002E-2,0.42027771600000002,0.52450136000000003,0.15224407400000001,0,8.2495720999999994E-2,0.59104095700000003,0.37793027099999998,0,0.274682853,1.30298852,0.236926303,0.12051592,0,0,0.78979084300000002,0,3.6593107759999999,1.136571336,0.17151925000000001,0,0,0,0,0,0.50033737,0,0.70960226699999995,0,0,0,0,0,0,0,0,0,0,0,0,0,0,4.7428273999999999E-2,0,0,0,0,0,0,0,0,0,0,0,0,0,0,0]
[null,null,"> 33 kV & < = 66 kV",50,7.07,0,3.5850849469999999,0,0.94490391399999996,0,0,0.12035895000000001,0,0,0,0,0,0,0.15221179200000001,0.88888556799999996,9.0935759090000001,3.596005312,1.021711507,0,0,0,0,0,0,0,2.652843946,0,0,0,0.164294888,0,0,0,0,0.36196655599999999,0,0,0.66159552700000002,0,0,0,0,0,0,0,0,0,0,0,0,0,0,0.73514123399999998,0,0,0,0,0,0,0,0,0,0,0,0,0,0,0,0,0,0,0,0,0,0,0,0,0,0,0,0,0,0,0,0,0,0,0,0,0]
[null,null,"> 66 kV & < = 132 kV",60,7.75,0,0,0,0,0,0,0,0,0,6.1496723590000002,0,0,0,0,0,8.8744772709999999,4.3437071000000001E-2,0,0,0,0,0,0,0,0,0,0,0,0,0,0,0,0,0,0,0,0,0,0,0,0,0,0,0,0,0,0,0,0,0,0,0,0,0,0,0,0,0,0,0,0,0,0,0,0,0,0,0,0,0,0,0,0,0,0,0,0,0,0,0,0,0,0,0,0,0,0,0,0,0]
[null,null,">  132 kV",60,7.75,0,0,0,0,0,0,0,0,0,0,0,0,0,0,0,0,0,0,0,0,0,0,0,0,0,0,0,0,0,0,0,0,0,0,0,0,0,0,0,0,0,0,0,0,0,0,0,0,0,0,0,0,0,0,0,0,0,0,0,0,0,0,0,0,0,0,0,0,0,0,0,0,0,0,0,0,0,0,0,0,0,0,0,0,0,0,0,0,0,0]
[null,null,"Other"]
[null,"SERVICE LINES BY: \nCONNECTION VOLTAGE; CUSTOMER TYPE; CONNECTION COMPLEXITY ","˂ = 11 kV ; Residential ; Simple Type",35,5.92,560.39080550000006,5150.5919219999996,8256.7581009999994,12111.44628,12196.5056,8047.612247,7187.0120809999999,6559.5745180000004,6007.1892959999996,7160.9939359999998,8362.8320750000003,8419.8718530000006,8843.1670510000004,7977.5633959999996,8095.6457440000004,8075.6317870000003,8755.1056389999994,11291.87473,11798.227849999999,12271.557940000001,12113.447679999999,10673.443450000001,10758.502769999999,10007.979369999999,10019.98774,5730.9966839999997,5989.1767339999997,5887.105552,6513.5424169999997,7484.2193479999996,6918.8250529999996,7000.882278,8395.8551040000002,7664.3449639999999,7332.1132719999996,6735.6973429999998,5198.625419,4732.3002130000004,7084.9408990000002,9371.5355249999993,8487.9193080000005,7130.973,10259.15453,8044.6101529999996,6868.7901590000001,4914.4272250000004,6567.5801009999996,7515.2409809999999,7060.9241499999998,131.09142059999999,132.0921184,112.0781611,104.0725782,110.0767654,113.07885899999999,99.069088840000006,78.054433630000005,66.046059220000004,60.04187202,51.035591220000001,44.03070615,58.040476290000001,31.02163388,36.025123209999997,37.02582108,37.02582108,35.024425350000001,36.025123209999997,31.02163388,37.02582108,34.023727479999998,28.019540280000001,33.023029610000002,32.022331749999999,null,null,0]
[null,null,"˂ = 11 kV ; Commercial & Industrial ; Simple Type",35,5.92,104.1171559,667.75137500000005,1196.3461669999999,1564.760718,1493.6807369999999,1212.3641909999999,1159.304486,1081.216619,957.07693329999995,1134.2763239999999,1310.474588,1290.4520580000001,1327.4937379999999,1165.3112450000001,1155.29998,1298.4610700000001,1618.821549,2172.4445030000002,1815.0423430000001,1875.109933,1769.991651,1599.800146,1713.9285669999999,1714.929693,1665.874495,1086.222252,1186.3349020000001,1147.290968,1382.555695,1603.804652,1192.3416609999999,1129.2706909999999,1131.2729440000001,1172.319131,1287.448678,1099.2368959999999,795.89556689999995,984.10734879999995,1103.2414020000001,1173.3202570000001,1100.2380230000001,919.03412630000003,1257.4148829999999,1163.308992,1077.212113,752.84712739999998,812.91471739999997,814.91697039999997,721.81220599999995,9.0101384929999995,17.019150490000001,11.012391490000001,13.01464449,11.012391490000001,16.01802399,12.01351799,12.01351799,4.0045059969999999,6.0067589950000002,9.0101384929999995,3.0033794980000001,11.012391490000001,10.011264990000001,4.0045059969999999,6.0067589950000002,3.0033794980000001,4.0045059969999999,3.0033794980000001,8.0090119939999997,1.0011264989999999,3.0033794980000001,10.011264990000001,5.0056324959999996,7.007885495]
[null,null,"˂ = 11 kV ; Residential ; Complex Type"]
[null,null,"˂ = 11 kV ; Commercial & Industrial ; Complex Type"]
[null,null,"˂ = 11 kV ; Subdivision ; Complex Type"]
[null,null,"> 11 kV  & < = 22 kV ; Commercial & Industrial  "]
[null,null,"> 11 kV  & < = 22 kV ; Subdivision  "]
[null,null,"> 22 kV & < = 33 kV ; Commercial & Industrial  "]
[null,null,"> 22 kV & < = 33 kV ; Subdivision  "]
[null,null,"> 33 kV & < = 66 kV ; Commercial & Industrial  "]
[null,null,"> 33 kV & < = 66 kV ; Subdivision  "]
[null,null,"> 66 kV & < = 132 kV ; Commercial & Industrial  "]
[null,null,"> 66 kV & < = 132 kV ; Subdivision  "]
[null,null,"> 132 kV ; Commercial & Industrial  "]
[null,null,"> 132 kV ; Subdivision  "]
[null,null,"Other"]
[null,"TRANSFORMERS BY: \nMOUNTING TYPE; HIGHEST OPERATING VOLTAGE ; AMPERE RATING; NUMBER OF PHASES (AT LV)","Pole Mounted ; < = 22kV ;  < = 60 kVA ; Single Phase",40,6.32,252.18536449999999,803.59066529999996,996.73263099999997,1195.8790100000001,1173.8628269999999,1167.858414,1518.115865,785.57742499999995,786.57816060000005,1086.7988330000001,1003.73778,788.57963170000005,846.62229500000001,945.69511669999997,1308.9621299999999,1731.2725419999999,1464.0761440000001,1027.7554339999999,1014.745871,951.69953020000003,864.63553530000002,628.46194000000003,636.46782459999997,629.46267560000001,558.4104499,601.44207949999998,498.36631549999998,523.38470480000001,599.44060839999997,756.55609340000001,639.47003129999996,585.43031040000005,625.45973330000004,642.47223799999995,689.50680999999997,712.52372820000005,609.44796410000004,743.54653089999999,652.47959379999998,717.52740600000004,730.53696849999994,587.43178150000006,835.61420369999996,762.56050679999998,583.42883919999997,386.28393130000001,296.21772970000001,349.25671510000001,256.18830680000002,348.25597950000002,429.31556089999998,249.18315770000001,279.20522490000002,264.1941913,337.24788819999998,243.17874430000001,204.15005690000001,173.12725420000001,156.11474939999999,555.40824320000002,203.14932139999999,102.0750285,24.017653760000002,10.00735573,10.00735573,9.0066201590000006,3.0022067200000002,1.000735573,1.000735573,17.012504750000002,1.000735573,0,0,1.000735573,0,0,0,0,1.000735573,0,0,0,0,0,0,0,0,0,0,0,0,0,0,0]
[null,null,"Pole Mounted ; < = 22kV ;  > 60 kVA and < = 600 kVA ; Single Phase",40,6.32,1,18,14,18,19,12,21,25,25,26,21,23,17,17,13,74,50,40,25,18,13,10,10,8,8,8,8,6,3,11,3,4,11,12,7,7,10,15,18,9,7,13,13,7,3,1,7,0,0,5,5,1,6,2,3,2,0,0,0,2,2,2,1,0,0,0,0,0,0,1,0,0,0,0,0,0,0,0,0,0,0,0,0,0,0,0,0,0,0,0,0,0,0,0]
[null,null,"Pole Mounted ; < = 22kV ;  > 600 kVA ; Single Phase",40,6.32,84.672538029999998,97.776621300000002,111.888711,78.624499599999993,72.576461170000002,50.400320260000001,61.488390709999997,33.264211369999998,53.42433947,67.536429139999996,60.480384309999998,49.392313850000001,41.328262610000003,45.360288230000002,33.264211369999998,25.20016013,21.168134510000002,28.224179339999999,27.21617294,13.10408327,22.176140910000001,8.0640512409999996,17.136108889999999,11.088070460000001,12.09607686,3.024019215,6.0480384310000002,6.0480384310000002,2.0160128099999999,5.0400320260000004,2.0160128099999999,2.0160128099999999,2.0160128099999999,2.0160128099999999,8.0640512409999996,9.0720576459999993,1.0080064049999999,13.10408327,7.0560448359999999,8.0640512409999996,7.0560448359999999,6.0480384310000002,3.024019215,4.0320256199999998,5.0400320260000004,2.0160128099999999,4.0320256199999998,9.0720576459999993,1.0080064049999999,3.024019215,2.0160128099999999,3.024019215,1.0080064049999999,2.0160128099999999,2.0160128099999999,0,0,1.0080064049999999,0,0,0,0,0,0,0,0,0,0,0,0,0,0,0,0,0,0,0,0,0,0,0,0,0,0,0,0,0,0,0,0,0,0,0,0]
[null,null,"Pole Mounted ; < = 22kV ;  < = 60 kVA  ; Multiple Phase",40,6.32,112.02688860000001,339.08138600000001,395.09483030000001,401.09627080000001,573.137564,398.09555060000002,240.0576184,250.0600192,356.0854673,462.11091549999998,384.09218950000002,302.07250320000003,325.07802500000003,388.09314979999999,1007.241757,507.12171899999998,488.11715750000002,307.07370359999999,287.06890199999998,298.0715429,293.07034249999998,338.08114599999999,426.10227270000001,446.10707430000002,466.11187580000001,414.09939179999998,534.12820099999999,504.12099869999997,667.16013120000002,691.16589309999995,761.18269850000001,641.15388919999998,624.14980790000004,628.15076820000002,674.16181180000001,530.12724070000002,374.08978869999999,427.1025128,527.12652049999997,496.11907810000002,547.13132199999995,497.11931820000001,594.14260560000002,522.12532009999995,489.1173976,307.07370359999999,354.0849872,301.07226309999999,259.06217989999999,207.04969589999999,250.0600192,197.04729510000001,252.0604994,190.04561459999999,273.065541,214.05137640000001,216.05185660000001,196.04705509999999,209.05017609999999,275.0660211,173.0415333,78.018725989999993,19.004561460000001,20.004801539999999,10.002400769999999,9.0021606910000003,11.002640850000001,4.0009603069999997,2.0004801539999999,26.006242,0,0,2.0004801539999999,1.0002400769999999,3.0007202300000002,0,1.0002400769999999,0,2.0004801539999999,0,0,0,1.0002400769999999,0,0,0,0,0,1.0002400769999999,0,0,0,0,0]
[null,null,"Pole Mounted ; < = 22kV ;  > 60 kVA and < = 600 kVA  ; Multiple Phase",40,6.32,237.0176615,788.05872269999998,841.06267230000003,849.06326850000005,931.06937919999996,610.04545789999997,371.02764739999998,668.04978019999999,735.05477310000003,970.07228559999999,858.06393920000005,821.06118189999995,708.05276100000003,730.05440050000004,1287.0959089999999,1556.115955,1369.10202,765.05700869999998,678.05052539999997,611.04553250000004,489.0364409,413.03077730000001,439.03271480000001,355.026455,396.02951039999999,367.02734930000003,438.03264030000003,413.03077730000001,400.0298085,470.03502500000002,401.02988299999998,266.0198226,272.02026979999999,281.02094049999999,311.0231761,228.0169908,207.0154259,180.0134138,229.01706540000001,269.02004620000002,240.0178851,225.0167673,308.02295249999997,299.02228179999997,272.02026979999999,148.0110291,162.01207239999999,189.0140845,176.01311569999999,159.01184889999999,143.01065650000001,126.0093897,115.0085699,108.0080483,164.01222150000001,106.0078992,84.006259779999993,74.005514570000003,88.006557869999995,196.0146062,61.004545790000002,32.002384679999999,8.0005961699999997,8.0005961699999997,14.001043299999999,9.0006706909999998,11.00081973,4.0002980849999998,1.0000745209999999,84.006259779999993,0,3.0002235640000001,0,3.0002235640000001,1.0000745209999999,2.0001490419999999,1.0000745209999999,2.0001490419999999,3.0002235640000001,0,0,0,0,0,1.0000745209999999,0,0,0,0,1.0000745209999999,0,0,0,0]
[null,null,"Pole Mounted ; < = 22kV ;  > 600 kVA  ; Multiple Phase",40,6.32,142.5244691,170.62788549999999,198.73130190000001,199.7349954,155.57248379999999,118.4358264,85.313942749999995,97.358264079999998,58.214219759999999,78.288088639999998,70.258541089999994,85.313942749999995,58.214219759999999,64.236380420000003,62.228993539999998,49.180978760000002,59.217913199999998,76.280701750000006,83.306555860000003,37.13665743,33.121883660000002,15.055401659999999,28.10341644,15.055401659999999,8.0295475530000004,10.03693444,18.06648199,9.033240997,6.0221606650000004,7.025854109,5.0184672209999999,1.003693444,2.0073868880000001,3.0110803320000001,3.0110803320000001,1.003693444,0,3.0110803320000001,1.003693444,7.025854109,3.0110803320000001,7.025854109,5.0184672209999999,5.0184672209999999,1.003693444,4.0147737770000003,7.025854109,0,3.0110803320000001,1.003693444,1.003693444,1.003693444,3.0110803320000001,3.0110803320000001,2.0073868880000001,0,1.003693444,1.003693444,0,0,0,0,0,0,0,0,0,0,0,0,0,0,0,0,0,0,0,0,0,0,0,0,0,0,0,0,0,0,0,0,0,0,0,0]
[null,null,"Kiosk Mounted ; < = 22kV ;  < = 60 kVA ; Single Phase",40,6.32,0,0,0,2,1,0,0,1,1,1,0,2,0,1,11,2,1,3,1,2,0,5,1,2,2,0,3,2,4,1,1,1,2,0,6,3,2,0,0,0,1,0,2,0,1,0,1,0,1,1,0,0,1,0,0,0,0,1,0,0,1,0,0,0,0,0,0,0,0,0,0,0,0,0,0,0,0,0,0,0,0,0,0,0,0,0,0,0,0,0,0,0,0,0]
[null,null,"Kiosk Mounted ; < = 22kV ;  > 60 kVA and < = 600 kVA ; Single Phase",40,6.32,1,0,0,0,0,0,0,0,0,0,0,0,0,0,0,0,0,0,0,0,0,0,0,0,0,0,0,0,0,0,0,0,0,0,0,0,0,0,0,1,0,0,0,0,0,0,0,0,0,0,0,0,0,0,0,0,0,0,0,0,0,0,0,0,0,0,0,0,0,0,0,0,0,0,0,0,0,0,0,0,0,0,0,0,0,0,0,0,0,0,0,0,0,0]
[null,null,"Kiosk Mounted ; < = 22kV ;  > 600 kVA ; Single Phase",40,6.32,0,0,0,1,0,2,1,0,0,0,0,0,0,1,0,0,0,0,0,0,0,0,0,0,0,0,0,0,0,0,0,0,0,0,0,0,0,0,0,0,0,0,0,0,0,0,0,1,0,0,0,0,0,0,0,0,0,0,0,0,0,0,0,0,0,0,0,0,0,0,0,0,0,0,0,0,0,0,0,0,0,0,0,0,0,0,0,0,0,0,0,0,0,0]
[null,null,"Kiosk Mounted ; < = 22kV ;  < = 60 kVA  ; Multiple Phase",40,6.32,0,2.0265251989999999,1.0132625989999999,2.0265251989999999,5.0663129969999998,10.132625989999999,5.0663129969999998,0,10.132625989999999,6.0795755969999998,9.1193633950000006,16.212201589999999,8.1061007959999998,11.14588859,9.1193633950000006,13.17241379,18.238726790000001,21.27851459,19.251989389999999,7.0928381959999998,10.132625989999999,8.1061007959999998,6.0795755969999998,0,8.1061007959999998,3.0397877979999999,1.0132625989999999,0,4.0530503979999999,5.0663129969999998,1.0132625989999999,2.0265251989999999,5.0663129969999998,8.1061007959999998,29.38461538,3.0397877979999999,6.0795755969999998,7.0928381959999998,8.1061007959999998,18.238726790000001,0,1.0132625989999999,7.0928381959999998,9.1193633950000006,4.0530503979999999,1.0132625989999999,2.0265251989999999,1.0132625989999999,3.0397877979999999,1.0132625989999999,2.0265251989999999,2.0265251989999999,4.0530503979999999,2.0265251989999999,0,3.0397877979999999,2.0265251989999999,3.0397877979999999,3.0397877979999999,6.0795755969999998,3.0397877979999999,0,2.0265251989999999,2.0265251989999999,4.0530503979999999,3.0397877979999999,0,1.0132625989999999,0,0,0,0,0,0,1.0132625989999999,0,1.0132625989999999,0,0,0,0,0,0,0,0,0,0,0,0,0,0,0,0,0]
[null,null,"Kiosk Mounted ; < = 22kV ;  > 60 kVA and < = 600 kVA  ; Multiple Phase",40,6.32,24.009234320000001,55.021161990000003,142.05463639999999,117.0450173,84.032320119999994,38.014621009999999,49.018853409999998,84.032320119999994,87.033474409999997,124.0477107,184.0707965,227.08734129999999,186.07156599999999,202.07772220000001,198.07618310000001,240.09234319999999,390.15005769999999,324.12466330000001,370.14236240000002,329.12658709999999,275.1058099,183.07041169999999,102.0392459,83.031935360000006,87.033474409999997,66.025394379999994,59.022701040000001,51.019622929999997,51.019622929999997,80.030781070000003,92.035398229999998,76.029242019999998,53.020392459999997,52.020007700000001,46.017699120000003,46.017699120000003,23.008849560000002,19.007310499999999,25.00961908,13.00500192,27.01038861,21.008080029999999,37.014236240000002,34.01308195,16.00615621,9.0034628699999999,10.003847629999999,2.0007695270000001,11.004232399999999,6.0023085800000002,9.0034628699999999,10.003847629999999,2.0007695270000001,10.003847629999999,10.003847629999999,4.0015390530000001,2.0007695270000001,9.0034628699999999,2.0007695270000001,5.0019238169999998,2.0007695270000001,8.0030781070000003,0,2.0007695270000001,0,0,0,0,0,0,0,0,0,0,0,0,0,0,3.0011542900000001,0,0,0,0,0,1.000384763,0,0,0,9.0034628699999999,0,0,0,0,0]
[null,null,"Kiosk Mounted ; < = 22kV ;  > 600 kVA  ; Multiple Phase",40,6.32,30.748387099999999,48.172473119999999,68.671397850000005,58.421935480000002,57.396989249999997,36.898064519999998,44.072688169999999,52.272258059999999,68.671397850000005,69.696344089999997,61.496774189999996,75.84602151,77.895913980000003,87.120430110000001,115.8189247,133.24301080000001,177.3156989,154.7668817,87.120430110000001,131.19311830000001,95.32,72.771182800000005,47.147526880000001,36.898064519999998,43.047741940000002,29.72344086,37.923010750000003,43.047741940000002,49.197419349999997,19.47397849,31.77333333,5.1247311829999997,6.1496774189999996,14.349247310000001,15.374193549999999,29.72344086,3.0748387099999999,17.424086020000001,14.349247310000001,15.374193549999999,15.374193549999999,10.24946237,6.1496774189999996,8.1995698919999995,3.0748387099999999,4.0997849459999998,10.24946237,10.24946237,3.0748387099999999,5.1247311829999997,0,6.1496774189999996,2.0498924729999999,3.0748387099999999,1.024946237,1.024946237,3.0748387099999999,5.1247311829999997,0,2.0498924729999999,1.024946237,3.0748387099999999,0,0,2.0498924729999999,0,1.024946237,5.1247311829999997,0,0,0,0,0,0,3.0748387099999999,0,0,0,1.024946237,1.024946237,0,0,0,1.024946237,0,0,0,0,1.024946237,0,0,0,0,0]
[null,null,"Ground Outdoor / Indoor Chamber Mounted; ˂ 22 kV ;  < = 60 kVA ; Single Phase",40,6.32,0,0,0,0,0,0,0,0,0,0,0,0,0,0,0,0,0,0,0,0,0,0,0,0,0,0,0,0,0,0,0,0,0,0,0,0,2,0,0,0,0,0,0,0,0,0,0,0,0,0,0,0,0,0,0,0,0,0,0,0,0,0,0,0,0,0,0,0,0,0,0,0,0,0,0,0,0,0,0,0,0,0,0,0,0,0,0,0,0,0,0,0,0,0]
[null,null,"Ground Outdoor / Indoor Chamber Mounted; ˂  22 kV ;  > 60 kVA  and < = 600 kVA ; Single Phase",40,6.32,0,0,0,0,0,0,0,0,0,0,0,0,0,0,0,0,0,0,0,0,0,0,0,0,0,0,0,0,0,0,0,0,0,0,0,0,0,0,0,0,0,0,0,0,0,0,0,0,0,0,0,0,0,0,0,0,0,0,0,0,0,0,0,0,0,0,0,0,0,0,0,0,0,0,0,0,0,0,0,0,0,0,0,0,0,0,0,0,0,0,0,0,0,0]
[null,null,"Ground Outdoor / Indoor Chamber Mounted; ˂  22 kV ;  >  600 kVA ; Single Phase",40,6.32,0,0,0,0,0,0,0,0,0,0,0,0,0,0,0,0,0,0,0,0,0,0,0,0,0,0,0,0,0,0,0,0,0,0,0,0,0,0,0,0,0,0,0,0,0,0,0,0,0,0,0,0,0,0,0,0,0,0,0,0,0,0,0,0,0,0,0,0,0,0,0,0,0,0,0,0,0,0,0,0,0,0,0,0,0,0,0,0,0,0,0,0,0,0]
[null,null,"Ground Outdoor / Indoor Chamber Mounted; ˂  22 kV ;  < = 60 kVA ; Multiple Phase",40,6.32,0,0,0,0,0,0,0,0,0,0,0,0,0,0,0,0,0,0,0,0,0,0,0,0,0,0,0,0,0,0,0,0,0,0,0,0,0,0,0,0,0,0,0,0,0,0,0,0,0,0,0,0,0,0,0,0,0,0,0,0,0,0,0,0,0,0,0,0,0,0,0,0,0,0,0,0,0,0,0,0,0,0,0,0,0,0,0,0,0,0,0,0,0,0]
[null,null,"Ground Outdoor / Indoor Chamber Mounted; ˂  22 kV ;  > 60 kVA  and < = 600 kVA ; Multiple Phase",40,6.32,0,0,0,0,0,0,0,0,0,0,0,0,0,0,0,0,0,0,1,0,1,1,0,0,0,0,0,0,0,0,0,0,0,0,0,1,0,0,0,0,0,0,1,0,0,0,0,0,0,0,0,0,0,0,0,0,0,0,0,0,0,0,0,0,0,0,0,0,0,0,0,0,0,0,0,0,0,0,0,0,0,0,0,0,0,0,0,0,0,0,0,0,0,0]
[null,null,"Ground Outdoor / Indoor Chamber Mounted; ˂  22 kV ;  >  600 kVA ; Multiple Phase",40,6.32,0,0,0,0,0,0,0,0,0,0,0,0,6,1,0,0,1,1,1,0,0,0,0,1,1,0,2,2,0,3,0,0,0,0,0,0,0,1,0,3,2,0,2,0,0,1,3,0,2,0,0,2,0,0,0,0,0,2,0,0,2,0,1,0,0,0,0,0,0,0,0,0,0,0,0,0,0,0,1,0,0,0,0,0,0,0,0,0,0,0,0,0,0,0]
[null,null,"Ground Outdoor / Indoor Chamber Mounted; > = 22 kV & < = 33 kV ;  < = 15 MVA",60,7.75,0,0,0,0,1,0,0,1,0,0,0,5,1,2,0,1,2,1,2,1,3,0,1,0,3,4,4,1,1,3,2,1,2,0,0,0,4,1,1,4,3,0,2,2,0,4,0,1,1,8,0,2,1,6,1,2,2,7,1,3,2,2,1,0,0,1,0,0,0,0,0,1,1,0,0,2,0,0,0,0,2,1,0,0,0,0,0,0,0,0,0,0,0,2]
[null,null,"Ground Outdoor / Indoor Chamber Mounted; > = 22 kV & < = 33 kV ;  > 15 MVA and < = 40 MVA",60,7.75,0,0,0,1,0,0,0,0,0,0,0,2,2,0,0,0,0,2,0,0,5,0,0,0,0,1,2,0,0,0,0,0,0,0,0,0,0,0,0,0,2,0,0,0,0,0,0,2,0,0,0,0,0,0,0,0,0,0,0,0,0,0,1,0,0,0,0,0,0,0,0,0,0,0,0,0,0,0,0,0,0,0,0,0,0,0,0,0,0,0,0,0,0,0]
[null,null,"Ground Outdoor / Indoor Chamber Mounted; > = 22 kV & < = 33 kV ;  > 40 MVA",60,7.75,0,0,0,0,0,0,0,0,0,0,0,0,0,0,0,0,0,0,0,0,0,0,0,0,0,0,0,0,0,0,0,0,0,0,0,0,0,0,0,0,0,0,0,0,0,0,0,0,0,0,0,0,0,0,0,0,0,0,0,0,0,0,0,0,0,0,0,0,0,0,0,0,0,0,0,0,0,0,0,0,0,0,0,0,0,0,0,0,0,0,0,0,0,0]
[null,null,"Ground Outdoor / Indoor Chamber Mounted; > 33 kV & < = 66 kV ;  < = 15 MVA",60,7.75,0,1,1,0,1,0,0,1,1,1,2,3,2,2,1,6,2,7,2,1,2,3,2,3,8,4,3,6,4,3,0,0,5,10,5,1,2,6,12,7,5,8,6,5,12,3,0,5,5,4,1,1,5,3,2,3,0,4,1,3,5,1,1,0,0,0,0,1,1,0,1,1,3,0,1,0,0,0,3,0,0,0,0,0,0,0,0,0,0,0,0,0,0,0]
[null,null,"Ground Outdoor / Indoor Chamber Mounted; > 33 kV & < = 66 kV ;  > 15 MVA and < = 40 MVA",60,7.75,0,1,0,0,0,0,0,0,0,0,1,1,0,3,4,2,13,5,3,8,2,0,4,2,3,0,1,1,6,0,1,1,2,1,1,0,0,2,7,0,2,4,2,5,1,6,0,1,0,2,0,0,2,0,1,0,1,0,0,0,0,0,1,0,0,0,0,0,0,0,0,0,0,0,0,0,0,0,0,0,0,0,0,0,0,0,0,0,0,0,0,0,0,0]
[null,null,"Ground Outdoor / Indoor Chamber Mounted; > 33 kV & < = 66 kV ;  > 40 MVA",60,7.75,0,0,0,1,0,0,0,0,0,0,0,0,1,0,0,0,0,2,0,0,0,0,0,0,0,0,0,0,0,0,0,0,0,0,0,0,0,0,0,0,0,0,0,0,0,0,0,0,0,0,0,0,0,0,0,0,0,0,0,0,0,0,0,0,0,0,0,0,0,0,0,0,0,0,0,0,0,0,0,0,0,0,0,0,0,0,0,0,0,0,0,0,0,0]
[null,null,"Ground Outdoor / Indoor Chamber Mounted; > 66 kV & < = 132 kV ;  < = 100 MVA",60,7.75,0,0,0,0,1,0,0,0,0,0,1,2,6,0,2,4,5,6,3,4,3,3,0,0,2,1,2,1,0,0,0,1,1,3,0,2,0,0,0,1,3,1,0,1,0,0,0,0,0,0,0,0,1,2,0,1,0,3,0,3,0,1,0,0,0,0,0,2,0,0,0,1,0,0,0,0,0,0,0,0,0,0,0,0,0,0,0,0,0,0,0,0,0,0]
[null,null,"Ground Outdoor / Indoor Chamber Mounted; > 66 kV & < = 132 kV ;  > 100 MVA",60,7.75,0,0,0,0,0,0,0,0,0,0,0,0,0,0,0,0,0,0,0,0,1,0,0,0,0,0,0,0,0,1,0,0,0,0,0,0,0,0,0,0,0,0,0,0,0,0,0,0,0,0,0,0,0,0,0,0,0,0,0,0,0,0,0,0,0,0,0,0,0,0,0,0,0,0,0,0,0,0,0,0,0,0,0,0,0,0,0,0,0,0,0,0,0,0]
[null,null,"Ground Outdoor / Indoor Chamber Mounted; > 132 kV ;  < = 100 MVA",60,7.75,0,0,0,0,0,0,0,0,0,0,0,0,0,0,0,0,0,0,0,0,0,0,0,0,0,2,0,2,0,0,0,0,0,0,0,0,0,0,0,0,0,0,0,0,0,0,0,0,0,0,0,0,0,0,0,0,0,0,0,0,0,0,0,0,0,0,0,0,0,0,0,0,0,0,0,0,0,0,0,0,0,0,0,0,0,0,0,0,0,0,0,0,0,0]
[null,null,"Ground Outdoor / Indoor Chamber Mounted; > 132 kV ;  > 100 MVA",60,7.75,0,0,0,0,0,0,0,0,0,0,0,0,0,0,0,0,0,0,0,0,0,0,0,0,0,0,0,0,0,0,0,0,0,0,0,0,0,0,0,0,0,0,0,0,0,0,0,0,0,0,0,0,0,0,0,0,0,0,0,0,0,0,0,0,0,0,0,0,0,0,0,0,0,0,0,0,0,0,0,0,0,0,0,0,0,0,0,0,0,0,0,0,0,0]
[null,null,"Other"]
[null,"SWITCHGEAR BY: \nHIGHEST OPERATING VOLTAGE ; SWITCH FUNCTION","˂ = 11 kV ;  Fuse",30,5.48,2212.7805360000002,4447.1541909999996,4580.8258770000002,4421.4480970000004,3453.8707340000001,2719.704702,2790.6535199999998,1835.415082,2189.1309299999998,2874.9695069999998,3099.1266430000001,3100.1548870000001,3557.7233529999999,3599.8813460000001,4597.2777770000002,6585.9011769999997,5952.5030310000002,2807.1054199999999,1866.2623940000001,1866.2623940000001,1639.0205269999999,1343.914573,1037.4979370000001,908.96746929999995,1015.904819,832.87743220000004,906.91098179999994,741.36373909999998,774.26753889999998,967.57736260000001,948.04073149999999,798.94538869999997,924.39112539999996,857.5552821,869.89420700000005,829.79270099999997,676.58438320000005,730.0530579,831.84918849999997,889.43083809999996,959.35141269999997,748.56144529999995,1138.2658240000001,912.05220050000003,791.7476825,521.31957799999998,633.398146,625.17219609999995,555.25162150000006,584.04244630000005,600.4943462,458.5967096,576.84474009999997,543.94094029999997,576.84474009999997,455.51197839999998,440.08832219999999,382.5066726,304.3601481,351.6593603,405.12803489999999,362.97004149999998,130.58695539999999,178.91441140000001,155.26480530000001,127.5022242,170.68846139999999,135.72817409999999,129.5587117,133.67168670000001,156.293049,186.1121176,132.6434429,155.26480530000001,125.4457367,0,0,0,0,0,0,0,0,0,0,0,0,0,7.1977062050000002,0,0,0,0,0,0,0,0,1.0282437440000001,0,0,0,0,0]
[null,null,"˂ = 11 kV  ; Switch",40,6.32,785.04708319999997,1577.4212729999999,1663.2530870000001,1364.935195,1156.6360360000001,1149.3089299999999,1213.1594259999999,1060.3369270000001,1631.8512040000001,2802.0947219999998,3052.2630589999999,3645.7586540000002,4333.4598990000004,4013.1606889999998,4666.3198629999997,5595.8156090000002,4180.6373999999996,2306.9916950000002,1817.1223150000001,1398.4305380000001,1381.6828660000001,823.77607260000002,523.36472209999999,275.28984380000003,375.7758705,378.91605879999997,367.40203489999999,363.21511720000001,305.64499769999998,346.46744610000002,346.46744610000002,256.44871380000001,333.90669270000001,272.14965549999999,183.17765270000001,227.1402894,175.8505466,174.8038172,261.68236109999998,331.81323379999998,250.1683372,196.7851355,314.01883329999998,219.81318329999999,214.57953610000001,135.02809830000001,183.17765270000001,227.1402894,191.55148829999999,183.17765270000001,192.59821769999999,186.31784110000001,152.8224989,241.79450159999999,227.1402894,196.7851355,145.49539279999999,118.28042720000001,100.4860266,125.6075333,118.28042720000001,138.16828659999999,81.644896650000007,64.897225539999994,75.364519990000005,84.785084990000001,58.616848879999999,79.551437759999999,71.177602210000003,69.084143319999995,64.897225539999994,81.644896650000007,66.990684430000002,62.803766660000001,81.644896650000007,0,1.0467294439999999,8.3738355539999993,1.0467294439999999,0,0,0,0,0,0,0,0,0,3.1401883330000002,0,0,0,0,0,0,0,0,2.0934588889999999,0,0,0,0,0]
[null,null,"˂ = 11 kV ;  Circuit Breaker",55,7.42,53.93259767,103.79481060000001,125.16433050000001,91.583656430000005,146.53385030000001,105.830003,75.302117510000002,62.073367130000001,105.830003,388.7217417,111.9355801,123.12913810000001,98.7068297,80.390098420000001,117.023561,90.566060239999999,144.49865790000001,113.9707724,114.9883686,77.337309869999999,82.425290779999997,23.404712199999999,178.0793319,46.809424399999997,80.390098420000001,21.369519830000002,28.492693110000001,8.1407694599999996,28.492693110000001,28.492693110000001,0,8.1407694599999996,17.299135100000001,23.404712199999999,23.404712199999999,8.1407694599999996,2.0351923649999999,16.281538919999999,26.457500750000001,31.54548166,35.615866390000001,39.686251120000001,35.615866390000001,28.492693110000001,60.038174769999998,14.246346559999999,11.19355801,0,16.281538919999999,10.17596183,13.22875037,0,0,13.22875037,17.299135100000001,23.404712199999999,12.21115419,23.404712199999999,4.0703847299999998,14.246346559999999,17.299135100000001,0,0,0,1.017596183,3.0527885480000001,1.017596183,0,0,0,0,0,0,3.0527885480000001,0,0,0,0,0,0,0,0,0,0,0,0,0,0,0,0,0,0,0,0,0,0,0,0,0,0,0,0,0]
[null,null,"> 11 kV & < = 22 kV  ; Switch",40,6.32,542.30487659999994,1067.0827899999999,1101.1057189999999,872.22419319999995,876.34818459999997,817.58130640000002,775.31039390000001,951.61102870000002,1001.098926,1585.6747150000001,1398.0331040000001,1620.7286429999999,1960.957938,1849.6101679999999,2311.4972120000002,2756.888289,1648.5655850000001,784.58937470000001,707.26453489999994,559.83184029999995,587.66878259999999,272.18343620000002,346.41528240000002,302.0823742,571.17281679999996,363.94224609999998,241.25350019999999,216.50955149999999,151.55668600000001,249.5014832,224.7575344,169.0836497,170.11464760000001,224.7575344,224.7575344,248.47048530000001,171.1456455,287.64840409999999,306.20636569999999,225.78853230000001,244.34649379999999,227.850528,293.83439129999999,307.23736359999998,211.3545622,121.657748,91.758809920000004,126.81273729999999,88.665816329999998,191.76560280000001,196.92059209999999,118.5647544,116.5027587,176.30063480000001,197.95158989999999,160.83566680000001,91.758809920000004,126.81273729999999,97.944797100000002,140.2157095,121.657748,83.51082701,43.301910300000003,39.177918839999997,43.301910300000003,47.425901760000002,29.898938059999999,31.960933789999999,26.80594447,37.115923109999997,41.239914570000003,28.8679402,25.774946610000001,41.239914570000003,42.270912430000003,0,0,0,0,0,0,0,0,0,0,0,0,0,0,0,0,0,0,0,0,0,0,0,1.0309978639999999,0,0,0,0]
[null,null,"> 11 kV & < = 22 kV  ; Circuit Breaker",55,7.42,35.328295990000001,54.506513810000001,51.47837415,72.675351750000004,55.515893689999999,74.694111520000007,55.515893689999999,84.787910370000006,55.515893689999999,132.22876500000001,81.759770709999998,46.431474729999998,76.712871289999995,63.590932780000003,30.281396560000001,77.722251170000007,45.42209484,68.637832200000005,67.628452319999994,47.440854610000002,25.234497130000001,22.206357480000001,89.834809800000002,55.515893689999999,33.309536219999998,25.234497130000001,31.290776449999999,16.15007817,47.440854610000002,14.131318390000001,5.0468994269999996,5.0468994269999996,12.11255862,25.234497130000001,35.328295990000001,4.037519541,4.037519541,10.093798850000001,31.290776449999999,35.328295990000001,22.206357480000001,18.16883794,5.0468994269999996,10.093798850000001,1.009379885,9.0844189679999996,2.018759771,0,1.009379885,13.12193851,4.037519541,2.018759771,2.018759771,2.018759771,3.028139656,6.056279312,4.037519541,14.131318390000001,2.018759771,0,3.028139656,1.009379885,0,0,1.009379885,0,0,0,0,0,1.009379885,1.009379885,0,0,0,0,0,0,0,0,1.009379885,0,0,0,0,0,0,0,0,0,0,0,0,0,0,0,0,0,0,0,0,0,2.018759771]
[null,null,"> 22 kV & < = 33 kV ; Switch",40,6.32,41.013620529999997,56.39372822,81.001900539999994,109.7114349,106.6354134,120.9901806,145.59835290000001,109.7114349,96.382008240000005,246.0817232,178.4092493,221.4735508,200.96674060000001,181.4852708,95.356667720000004,158.92777950000001,92.280646180000005,84.077922079999993,33.836236929999998,51.267025660000002,41.013620529999997,17.430788719999999,29.73487488,30.760215389999999,20.506810260000002,18.456129239999999,26.65885334,19.481469749999999,13.32942667,15.3801077,7.177383592,11.27874564,18.456129239999999,6.1520430790000002,24.608172320000001,22.557491290000002,10.253405130000001,14.35476718,8.2027241049999997,14.35476718,69.723154890000004,19.481469749999999,33.836236929999998,29.73487488,27.68419385,4.1013620529999999,3.0760215390000001,3.0760215390000001,15.3801077,7.177383592,6.1520430790000002,3.0760215390000001,5.1267025659999996,27.68419385,21.532150779999998,28.70953437,27.68419385,19.481469749999999,4.1013620529999999,37.937598989999998,12.304086160000001,9.2280646179999994,6.1520430790000002,7.177383592,3.0760215390000001,1.025340513,4.1013620529999999,2.0506810259999999,1.025340513,1.025340513,4.1013620529999999,1.025340513,1.025340513,2.0506810259999999,3.0760215390000001,0,0,0,0,0,0,0,0,2.0506810259999999,0,0,0,0,0,0,0,0,0,0,0,0,0,0,0,0,0,0,0]
[null,null,"> 22 kV & < = 33 kV ; Circuit Breaker",55,7.42,5.0446428570000004,4.0357142860000002,15.13392857,10.08928571,25.223214290000001,44.392857139999997,15.13392857,19.16964286,10.08928571,10.08928571,32.285714290000001,21.1875,12.10714286,7.0625,2.0178571430000001,32.285714290000001,9.0803571430000005,23.20535714,10.08928571,6.0535714289999998,14.125,5.0446428570000004,19.16964286,19.16964286,7.0625,4.0357142860000002,5.0446428570000004,0,4.0357142860000002,2.0178571430000001,1.008928571,0,1.008928571,0,0,1.008928571,0,0,6.0535714289999998,0,3.0267857139999998,0,2.0178571430000001,1.008928571,0,0,3.0267857139999998,0,0,0,0,0,0,0,5.0446428570000004,0,11.09821429,2.0178571430000001,0,10.08928571,1.008928571,0,0,0,0,2.0178571430000001,0,0,0,1.008928571,0,0,4.0357142860000002,4.0357142860000002,0,0,0,0,0,0,0,0,0,0,0,0,0,0,0,0,0,0,0,0,0,0,0,0,0,0,0,0,0]
[null,null,"> 33 kV & < = 66 kV ; Switch",50,7.07,4.1059602650000002,17.450331129999999,30.79470199,12.31788079,10.26490066,11.29139073,35.927152319999998,6.1589403970000003,6.1589403970000003,11.29139073,29.768211919999999,44.139072849999998,52.350993379999998,45.165562909999998,50.298013249999997,73.907284770000004,90.331125830000005,31.821192050000001,55.430463580000001,52.350993379999998,44.139072849999998,37.980132449999999,22.58278146,43.112582779999997,43.112582779999997,31.821192050000001,43.112582779999997,22.58278146,18.476821189999999,35.927152319999998,9.2384105959999996,13.34437086,29.768211919999999,61.589403969999999,8.2119205300000004,28.741721850000001,32.847682120000002,40.033112580000001,52.350993379999998,45.165562909999998,98.543046360000005,30.79470199,63.642384110000002,42.086092720000003,40.033112580000001,65.695364240000004,53.377483439999999,16.423841060000001,7.1854304640000004,35.927152319999998,4.1059602650000002,16.423841060000001,9.2384105959999996,50.298013249999997,3.0794701990000002,13.34437086,8.2119205300000004,11.29139073,3.0794701990000002,52.350993379999998,22.58278146,8.2119205300000004,10.26490066,7.1854304640000004,0,1.026490066,0,0,3.0794701990000002,0,0,0,0,0,0,0,0,0,2.0529801320000001,0,0,0,0,0,0,0,0,0,0,0,0,0,0,0,0,0,0,0,0,0,0,0,0]
[null,null,"> 33 kV & < = 66 kV ; Circuit Breaker",55,7.42,2.0351437699999999,6.1054313100000002,10.175718850000001,16.281150159999999,10.175718850000001,26.456869009999998,63.089456869999999,43.75559105,3.0527156550000001,8.1405750799999996,16.281150159999999,17.298722040000001,20.351437700000002,6.1054313100000002,19.333865809999999,25.439297119999999,24.421725240000001,23.404153350000001,18.316293930000001,41.720447280000002,16.281150159999999,20.351437700000002,19.333865809999999,6.1054313100000002,17.298722040000001,2.0351437699999999,9.1581469650000003,12.21086262,3.0527156550000001,7.1230031949999999,4.0702875399999998,7.1230031949999999,3.0527156550000001,23.404153350000001,1.017571885,0,3.0527156550000001,3.0527156550000001,7.1230031949999999,10.175718850000001,11.193290729999999,1.017571885,3.0527156550000001,2.0351437699999999,5.0878594250000004,2.0351437699999999,7.1230031949999999,1.017571885,0,1.017571885,5.0878594250000004,1.017571885,3.0527156550000001,3.0527156550000001,2.0351437699999999,1.017571885,0,0,0,2.0351437699999999,0,4.0702875399999998,0,0,0,4.0702875399999998,0,0,1.017571885,0,0,0,0,0,0,0,0,0,0,0,0,0,0,0,0,0,0,0,0,0,0,0,0,0,0,0,0,0,0,0,0,0,0]
[null,null,"> 66 kV & < = 132 kV ; Switch",50,7.07,0,0,14.5,0,2.0714285710000002,9.3214285710000002,2.0714285710000002,6.2142857139999998,0,22.785714290000001,18.64285714,2.0714285710000002,37.285714290000001,10.35714286,3.1071428569999999,17.60714286,16.571428569999998,12.42857143,32.107142860000003,13.46428571,0,4.1428571429999996,8.2857142859999993,0,0,1.0357142859999999,6.2142857139999998,0,4.1428571429999996,4.1428571429999996,13.46428571,0,7.25,7.25,1.0357142859999999,3.1071428569999999,0,4.1428571429999996,3.1071428569999999,1.0357142859999999,16.571428569999998,0,10.35714286,1.0357142859999999,5.1785714289999998,0,0,2.0714285710000002,0,0,0,0,0,0,0,21.75,0,0,0,0,0,0,2.0714285710000002,0,0,0,0,0,0,0,0,0,0,0,0,0,0,0,0,0,0,0,0,0,0,0,0,0,0,0,0,0,0,0,0,0,0,0,0,0,0,0,0]
[null,null,"> 66 kV & < = 132 kV  ; Circuit Breaker",55,7.42,0,1.0147058819999999,6.0882352940000004,0,0,5.0735294120000001,0,2.0294117649999999,0,15.22058824,8.1176470589999994,0,10.14705882,0,1.0147058819999999,7.1029411759999999,4.0588235289999997,5.0735294120000001,10.14705882,14.20588235,6.0882352940000004,3.0441176470000002,3.0441176470000002,0,0,0,0,0,2.0294117649999999,2.0294117649999999,0,0,2.0294117649999999,3.0441176470000002,0,9.1323529410000006,4.0588235289999997,0,0,0,4.0588235289999997,0,5.0735294120000001,0,0,0,1.0147058819999999,0,0,0,0,0,0,0,0,0,2.0294117649999999,0,0,0,0,0,1.0147058819999999,0,0,1.0147058819999999,0,0,0,0,0,0,0,0,0,0,0,0,0,0,0,0,0,0,0,0,0,0,0,0,0,0,0,0,0,0,0,0,0,0,0,0,0]
[null,null,"> 132 kV ; Switch",50,7.07,0,0,3,0,3,0,0,9,1.5,0,0,0,0,0,0,0,0,0,0,0,0,0,0,0,0,0,4.5,4.5,1.5,0,0,0,0,0,0,0,0,0,0,0,0,0,0,0,0,0,0,0,0,0,0,0,0,0,0,0,0,0,0,0,0,0,0,0,0,0,0,0,0,0,0,0,0,0,0,0,0,0,0,0,0,0,0,0,0,0,0,0,0,0,0,0,0,0,0,0,0,0,0,0,0,0,0]
[null,null,"> 132 kV ; Circuit Breaker",55,7.42,1.2,1.2,0,0,0,0,0,2.4,0,0,0,0,0,0,0,0,0,0,0,0,0,0,0,0,0,0,0,0,1.2,0,0,0,0,0,0,0,0,0,0,0,0,0,0,0,0,0,0,0,0,0,0,0,0,0,0,0,0,0,0,0,0,0,0,0,0,0,0,0,0,0,0,0,0,0,0,0,0,0,0,0,0,0,0,0,0,0,0,0,0,0,0,0,0,0,0,0,0,0,0,0,0,0,0]
[null,null,"Other"]
[null,"PUBLIC LIGHTING BY: \nASSET TYPE ; LIGHTING OBLIGATION","Luminaires ;  Major Road"]
[null,null,"Luminaires ;  Minor Road"]
[null,null,"Brackets ; Major Road"]
[null,null,"Brackets ; Minor Road"]
[null,null,"Lamps ; Major Road"]
[null,null,"Lamps ; Minor Road"]
[null,null,"Poles / Columns ; Major Road"]
[null,null,"Poles / Columns ; Minor Road"]
[null,null,"Other"]
[null,"SCADA, NETWORK CONTROL AND PROTECTION SYSTEMS BY: \nFUNCTION","Field Devices",30,5.47,70,121,148,151,228,245,253,231,254,388,323,176,294,245,443,346,257,375,291,388,190,175,209,209,264,120,123,101,85,169,71,92,66,102,188,45,83,79,102,190,62,77,66,134,175,37,34,20,74,67,5,15,54,2,60,66,70,41,5,54,18,1,3,18,6,0,0,6,4]
[null,null,"Local Network Wiring Assets"]
[null,null,"Communications Network Assets",15,3.87,1715,579,95,112,143,26,82,114,395,1619,240,733,4878,2143,1741,0,1646,1094,320,380,0,0,406,0,0,0,0,0,0,0,0,0,0,0,0,0,0,0,0,0,0,0,0,0,0,0,0,0,0,0,0,0,0,0,0,0,0,0,0,0,0,0,0,0,0,0,0,0,0,0,0,0,0,0,0,0,0,0,0,0,0,0,0,0,0,0,0,0,0,0]
[null,null,"Master Station Assets",5,2.23,0,0,0,15,48,0,0,0,23,2,0,28]
[null,null,"Communications Site Infrastructure",25,5,4,36,50,143,142,76,51,179,57,199,6,116,712,152,4,56,148,361,5,29,2,1,0,0,1,0,0,0,0,0,0,1,1,1,0,1,2,1,1,3,0,1,1,0,0,1,0,1,0,1,0,0,0,0,2,0,0,1,0,0,0,0,0,0,0,0,0,0,0,0,0,0,0,0,0,0,0,0,0,0,0,0,0,0,0,0,0,0,0,0]
[null,null,"Communications Linear Assets",30,5.47,189,311,18,117,82,128,73,132,48,70,89,135,161,60,83,164,79,159,78,283,5,1,0,0,0,0,0,0,0,0,0,0,0,0,0,0,0,0,0,0,0,0,0,0,0,0,0,0,0,0,0,0,0,0,0,0,0,0,0,0,0,0,0,0,0,0,0,0,0,0,0,0,0,0,0,0,0,0,0,0,0,0,0,0,0,0,0,0,0,0]
[null,null,"AFLC",25,5,0,0,1,0,0,5,0,12,8,9,3,8,7,15,13,5,11,8,6,6,9,2,1,1,2,1,4,0,0,2,0,0,0,2,5,10,2,2,1,1,0,7,1,0,0]
[null,null,"Other"]
[null,"OTHER BY: \nDNSP DEFINED","CURRENT TRANSFORMERS",45,6.71,19.457317979999999,41.986844069999997,48.131260279999999,69.636717000000004,73.732994469999994,93.190312449999993,154.63447450000001,87.045896249999998,64.516370159999994,204.8138735,128.00867099999999,159.7548213,187.40469429999999,35.842427870000002,112.6476304,311.31708780000002,483.36074150000002,228.367469,241.68037079999999,147.46598890000001,257.04141129999999,142.34564209999999,148.49005829999999,209.93422039999999,172.04365379999999,46.08312154,76.805202570000006,58.371953949999998,148.49005829999999,77.829271939999998,19.457317979999999,21.505456720000002,90.118104349999996,326.67812830000003,176.13993120000001,20.481387349999999,94.21438182,100.35879799999999,137.2252953,185.35655550000001,68.612647629999998,162.82702950000001,138.24936460000001,69.636717000000004,92.166243089999995,36.86649723,90.118104349999996,49.155329649999999,2.0481387350000002,33.794289130000003,27.649872930000001,0,43.010913440000003,68.612647629999998,32.770219760000003,37.8905666,26.625803560000001,166.9233069,33.794289130000003,59.396023319999998,47.10719091,9.2166243090000002,6.1444162059999998,0,24.577664819999999,3.0722081029999999,3.0722081029999999,28.673942289999999,45.059052180000002,0,0,0,10.24069368,24.577664819999999,0,0,0,0]
[null,null,"VOLTAGE TRANSFORMERS",45,6.71,6.2439969020000001,37.463981410000002,77.009295120000004,64.521301320000006,73.887296669999998,59.31797057,64.521301320000006,38.504647560000002,27.05731991,71.805964369999998,68.683965920000006,63.480635169999999,88.456622769999996,30.17931836,47.870642910000001,82.212625869999997,99.903950429999995,97.822618129999995,103.0259489,114.4732765,131.12393489999999,40.585979860000002,57.236638259999999,36.423315260000003,43.707978310000001,23.935321460000001,28.09798606,5.2033307510000002,41.626646010000002,16.650658400000001,17.691324550000001,6.2439969020000001,26.016653760000001,78.049961269999997,37.463981410000002,6.2439969020000001,43.707978310000001,30.17931836,31.21998451,78.049961269999997,52.03330751,45.789310610000001,90.537955069999995,15.609992249999999,33.301316810000003,22.894655310000001,37.463981410000002,13.52865995,5.2033307510000002,8.3253292020000007,16.650658400000001,3.1219984510000001,38.504647560000002,19.772656860000001,8.3253292020000007,9.3659953520000006,15.609992249999999,42.667312160000002,10.4066615,24.975987610000001,22.894655310000001,3.1219984510000001,8.3253292020000007,0,3.1219984510000001,2.0813323010000002,1.0406661500000001,11.44732765,1.0406661500000001,0,2.0813323010000002,1.0406661500000001,3.1219984510000001,0,10.4066615,2.0813323010000002,1.0406661500000001,0,1.0406661500000001,0,1.0406661500000001,1.0406661500000001,0,1.0406661500000001,0,0,0,0,0,0,0,0,0,0,0,0,0,0,0,0,0,0,0,0]
[null,null,"CAPACITOR BANKS",30,5.48,0,0,0,0,0,1.265625,1.265625,0,0,6.328125,0,0,2.53125,6.328125,3.796875,1.265625,5.0625,12.65625,10.125,11.390625,17.71875,2.53125,2.53125,1.265625,1.265625,2.53125,2.53125,1.265625,10.125,10.125,0,1.265625,0,1.265625,0,3.796875,0,0,2.53125,0,6.328125,13.921875,7.59375,6.328125,1.265625,1.265625,2.53125,0,0,0,0,0,0,0,0,0,0,0,0,0,0,0,0,0,0,0,0,0,0,0,0,0,0,0,0,0,0,0,0,0,0,0,0,0,0,0,0,0,0,0,0,0,0,0,0,0,0,0,0,0,0,0,0,0]
[null,null,"STATIC VAR COMPENSATOR",30,5.48,0,0,0,0,0,0,0,0,0,0,0,0,0,2,0,0,0,0,0,0,0,0,0,0,0,0,0,0,0,0,0,0,0,0,2,0,1,0,0,0,0,0,0,0,0,0,0,0,0,0,0,0,0,0,0,0,0,0,0,0,0,0,0,0,0,0,0,0,0,0,0,0,0,0,0,0,0,0,0,0,0,0,0,0,0,0,0,0,0,0,0,0,0,0,0,0,0,0,0,0,0,0,0,0]