{"text_format":"1","workbook":"xlsx","n_sheets":5,"sheets":["Project_Input","DCF","NPV_Output","Sensitivity","Hidden"],"not_rendered":{"charts":0,"images":0,"macros":1,"external_links":2,"defined_names":219,"comments":3,"pivot_tables":0},"unopened":[],"bounds":{"document_bytes":16777216,"sheet_cells":100000,"rows_first":2000,"rows_last":500,"rows_between":2000,"halvings":0,"cell_chars":16384,"cell_head_chars":4096},"cells_cut":0,"cells_raw":0,"read":"whole","date_system":"1900"}

{"sheet":"Project_Input","index":0,"n_rows":42,"n_cols":51,"rows_kept":42,"cut":false,"hidden":false,"merged":[[3,4,4,4],[3,5,4,5],[3,3,4,3],[3,2,4,2],[3,1,4,1],[3,37,3,43],[3,44,3,50],[3,18,4,18],[3,6,3,11],[3,19,3,23],[3,24,3,30],[3,31,3,36],[3,13,3,17]]}
[]
[null,"Project Input"]
[null,1,{"$f":"B3+1","v":2},{"$f":"C3+1","v":3},4,5,6,7,8,9,10,11,{"$f":"L3+1","v":12},{"$f":"M3+1","v":13},{"$f":"N3+1","v":14},{"$f":"O3+1","v":15},{"$f":"P3+1","v":16},{"$f":"Q3+1","v":17},{"$f":"R3+1","v":18},{"$f":"S3+1","v":19},{"$f":"T3+1","v":20},{"$f":"U3+1","v":21},{"$f":"V3+1","v":22},{"$f":"W3+1","v":23},{"$f":"X3+1","v":24},{"$f":"Y3+1","v":25},{"$f":"Z3+1","v":26},{"$f":"AA3+1","v":27},{"$f":"AB3+1","v":28},{"$f":"AC3+1","v":29},{"$f":"AD3+1","v":30},{"$f":"AE3+1","v":31},{"$f":"AF3+1","v":32},{"$f":"AG3+1","v":33},{"$f":"AH3+1","v":34},{"$f":"AI3+1","v":35},{"$f":"AJ3+1","v":36},{"$f":"AK3+1","v":37},{"$f":"AL3+1","v":38},{"$f":"AM3+1","v":39},{"$f":"AN3+1","v":40},{"$f":"AO3+1","v":41},{"$f":"AP3+1","v":42},{"$f":"AQ3+1","v":43},{"$f":"AR3+1","v":44},{"$f":"AS3+1","v":45},{"$f":"AT3+1","v":46},{"$f":"AU3+1","v":47},48,49,50]
[null,"Index","Stream","WR Description","Manager","DNSP","Capex Input",null,null,null,null,null,"O&M","Benefit Claim Ramping Up (% from 2026 to 2030)",null,null,null,null,"Additional Benefit Claim Period (No of Year beyond 2030)","Value of Customer Reliability (VCR) (Reliability)",null,null,null,null,"Financial",null,null,null,null,null,null,"Safety",null,null,null,null,null,"Environmental",null,null,null,null,null,null,"Other Inputs"]
[null,null,null,null,null,null,2026,{"$f":"G5+1","v":2027},{"$f":"H5+1","v":2028},2029,2030,"Total","As % of Capex",2026,{"$f":"N5+1","v":2027},{"$f":"O5+1","v":2028},{"$f":"P5+1","v":2029},{"$f":"Q5+1","v":2030},null,"Yes/No","Average Load (KWh)","Outage Duration (Hours Per Year)","Frequency of Event (%)","Comments","Yes/No","Labour Saving ($/Per Year)","Material Saving ($/Per Year)","Other Saving ($/Per Year)","Equipment Replacement Cost","Probability of Failure of Equipment (%)","Comments","Yes/No","Probability of Fatality (%)","Cost of Fatality ($)","Probability of Enjury (%)","Cost of Enjury ($)","Comments","Yes/No","Probability of Bushfire/Flood  (%)","Bushfire/Flood Cost($)","Probability of Oil Spilt (%)","Cost of Oil Split ($)","Carbon Reduction (in MWh)","Comments"]
[null,1,null,"Ergon AER Response",null,null,null,null,null,null,null,null,null,null,null,null,null,null,null,"No",null,null,null,null,"No",null,null,null,null,null,null,null,null,null,null,null,null,"No"]
[null,{"$f":"B6+1","v":2},"OT","Server & Workstation_ERG_1829387",null,"ERG",3620640,508517,0,0,0,{"$f":"SUM(G7:K7)","v":4129157},2.8044462949142384E-3,0.47388816991566046,0.89595694638954948,0.92985891058685444,0.96467144391085979,1,6,"Yes",2000,1,1,null,"Yes",null,null,{"$f":"384543.874628548*1","v":384543.87462854799},null,null,null,null,null,null,null,null,null,"No"]
[null,{"$f":"B7+1","v":3},"OT","STOR BACKUP_ERG_1829388",null,"ERG",null,null,752283.95962188172,310726.12516317161,214505.18220766695,1277515.2669927203,{"$f":"7.62263168415946%*2","v":0.1524526336831892},0.74131166318219299,0.84701665252436253,0.89688900489178125,0.9480905965513291,1,5,"Yes",2000,2,1,null,"Yes",null,null,{"$f":"245310.527011228*1","v":245310.527011228},null,null,null,null,null,null,null,null,null,"No"]
[null,4,"OT","Zetron Combined ERG (opt1) - Sept 2024",null,"ERG",125000,125000,125000,4255912.3687826656,125000,4755912.3687826656,6.4100000000000004E-2,2.1174750710691682E-2,0.65987712764575457,0.73597803000356077,0.85203739920467336,1,10,"Yes",3000,2.5,1,null,"Yes",null,null,519929.61572109937,null,null,null,null,null,null,null,null,null,"No"]
[null,5]
{"$rows_left_out":33}
{"sheet":"DCF","index":1,"n_rows":50,"n_cols":71,"rows_kept":50,"cut":false,"hidden":false,"merged":[[2,31,2,36],[4,2,4,3],[2,2,2,3],[3,2,3,3],[2,10,2,14],[2,15,3,15],[2,16,2,19],[2,20,2,25],[2,26,2,30]]}
[null,"Discounted Cashflow Analysis","All $ in Real AUD2022"]
[]
[null,"Project Inedx",2,null,"Capex",null,null,null,null,"O&M","Benefit Claim Ramping Up (%)",null,null,null,null,"Benefit Claim Period (No of Year)",{"$f":"Project_Input!T4","v":"Value of Customer Reliability (VCR) (Reliability)"},null,null,null,{"$f":"Project_Input!Y4","v":"Financial"},null,null,null,null,null,{"$f":"Project_Input!AF4","v":"Safety"},null,null,null,null,{"$f":"Project_Input!AL4","v":"Environmental"}]
[null,"WR Description",{"$f":"VLOOKUP(Index_1,Project_Table,Project_Input!$D$3,FALSE)","v":"Server & Workstation_ERG_1829387"},null,2026,2027,2028,2029,2030,"As % of Capex",2026,{"$f":"K4+1","v":2027},{"$f":"L4+1","v":2028},2029,2030,null,{"$f":"Project_Input!T5","v":"Yes/No"},{"$f":"Project_Input!U5","v":"Average Load (KWh)"},{"$f":"Project_Input!V5","v":"Outage Duration (Hours Per Year)"},{"$f":"Project_Input!W5","v":"Frequency of Event (%)"},{"$f":"Project_Input!Y5","v":"Yes/No"},{"$f":"Project_Input!Z5","v":"Labour Saving ($/Per Year)"},{"$f":"Project_Input!AA5","v":"Material Saving ($/Per Year)"},{"$f":"Project_Input!AB5","v":"Other Saving ($/Per Year)"},{"$f":"Project_Input!AC5","v":"Equipment Replacement Cost"},{"$f":"Project_Input!AD5","v":"Probability of Failure of Equipment (%)"},{"$f":"Project_Input!AF5","v":"Yes/No"},{"$f":"Project_Input!AG5","v":"Probability of Fatality (%)"},{"$f":"Project_Input!AH5","v":"Cost of Fatality ($)"},{"$f":"Project_Input!AI5","v":"Probability of Enjury (%)"},{"$f":"Project_Input!AJ5","v":"Cost of Enjury ($)"},{"$f":"Project_Input!AL5","v":"Yes/No"},{"$f":"Project_Input!AM5","v":"Probability of Bushfire/Flood  (%)"},{"$f":"Project_Input!AN5","v":"Bushfire/Flood Cost($)"},{"$f":"Project_Input!AO5","v":"Probability of Oil Spilt (%)"},{"$f":"Project_Input!AP5","v":"Cost of Oil Split ($)"},{"$f":"Project_Input!AQ5","v":"Carbon Reduction (in MWh)"}]
[null,"DNSP",{"$f":"VLOOKUP(Index_1,Project_Table,Project_Input!$F$3,FALSE)","v":"ERG"},null,{"$f":"VLOOKUP(Index_1,Project_Table,Project_Input!G3,FALSE)","v":3620640},{"$f":"VLOOKUP(Index_1,Project_Table,Project_Input!H3,FALSE)","v":508517},{"$f":"VLOOKUP(Index_1,Project_Table,Project_Input!I3,FALSE)","v":0},{"$f":"VLOOKUP(Index_1,Project_Table,Project_Input!J3,FALSE)","v":0},{"$f":"VLOOKUP(Index_1,Project_Table,Project_Input!K3,FALSE)","v":0},{"$f":"VLOOKUP(Index_1,Project_Table,Project_Input!M3,FALSE)","v":2.8044462949142384E-3},{"$f":"VLOOKUP(Index_1,Project_Table,Project_Input!N3,FALSE)","v":0.47388816991566046},{"$f":"VLOOKUP(Index_1,Project_Table,Project_Input!O3,FALSE)","v":0.89595694638954948},{"$f":"VLOOKUP(Index_1,Project_Table,Project_Input!P3,FALSE)","v":0.92985891058685444},{"$f":"VLOOKUP(Index_1,Project_Table,Project_Input!Q3,FALSE)","v":0.96467144391085979},{"$f":"VLOOKUP(Index_1,Project_Table,Project_Input!R3,FALSE)","v":1},{"$f":"VLOOKUP(Index_1,Project_Table,Project_Input!S3,FALSE)","v":6},{"$f":"VLOOKUP(Index_1,Project_Table,Project_Input!T3,FALSE)","v":"Yes"},{"$f":"VLOOKUP(Index_1,Project_Table,Project_Input!U3,FALSE)","v":2000},{"$f":"VLOOKUP(Index_1,Project_Table,Project_Input!V3,FALSE)","v":1},{"$f":"VLOOKUP(Index_1,Project_Table,Project_Input!W3,FALSE)","v":1},{"$f":"VLOOKUP(Index_1,Project_Table,Project_Input!Y3,FALSE)","v":"Yes"},{"$f":"VLOOKUP(Index_1,Project_Table,Project_Input!Z3,FALSE)","v":0},{"$f":"VLOOKUP(Index_1,Project_Table,Project_Input!AA3,FALSE)","v":0},{"$f":"VLOOKUP(Index_1,Project_Table,Project_Input!AB3,FALSE)","v":384543.87462854799},{"$f":"VLOOKUP(Index_1,Project_Table,Project_Input!AC3,FALSE)","v":0},{"$f":"VLOOKUP(Index_1,Project_Table,Project_Input!AD3,FALSE)","v":0},{"$f":"VLOOKUP(Index_1,Project_Table,Project_Input!AF3,FALSE)","v":0},{"$f":"VLOOKUP(Index_1,Project_Table,Project_Input!AG3,FALSE)","v":0},{"$f":"VLOOKUP(Index_1,Project_Table,Project_Input!AH3,FALSE)","v":0},{"$f":"VLOOKUP(Index_1,Project_Table,Project_Input!AI3,FALSE)","v":0},{"$f":"VLOOKUP(Index_1,Project_Table,Project_Input!AJ3,FALSE)","v":0},{"$f":"VLOOKUP(Index_1,Project_Table,Project_Input!AL3,FALSE)","v":"No"},{"$f":"VLOOKUP(Index_1,Project_Table,Project_Input!AM3,FALSE)","v":0},{"$f":"VLOOKUP(Index_1,Project_Table,Project_Input!AN3,FALSE)","v":0},{"$f":"VLOOKUP(Index_1,Project_Table,Project_Input!AO3,FALSE)","v":0},{"$f":"VLOOKUP(Index_1,Project_Table,Project_Input!AP3,FALSE)","v":0},{"$f":"VLOOKUP(Index_1,Project_Table,Project_Input!AQ3,FALSE)","v":0}]
[]
[null,"Year Index",null,null,0,1,{"$f":"F7+1","v":2},{"$f":"G7+1","v":3},4,5,6,7,8,9,10,11,12,13,14,15,16,17,18,19,20,{"$f":"Y7+1","v":21},{"$f":"Z7+1","v":22},{"$f":"AA7+1","v":23},{"$f":"AB7+1","v":24},{"$f":"AC7+1","v":25},{"$f":"AD7+1","v":26},{"$f":"AE7+1","v":27},{"$f":"AF7+1","v":28},{"$f":"AG7+1","v":29},{"$f":"AH7+1","v":30},{"$f":"AI7+1","v":31},{"$f":"AJ7+1","v":32},{"$f":"AK7+1","v":33},{"$f":"AL7+1","v":34},{"$f":"AM7+1","v":35},{"$f":"AN7+1","v":36},{"$f":"AO7+1","v":37},{"$f":"AP7+1","v":38},{"$f":"AQ7+1","v":39},{"$f":"AR7+1","v":40},{"$f":"AS7+1","v":41},{"$f":"AT7+1","v":42},{"$f":"AU7+1","v":43},{"$f":"AV7+1","v":44},{"$f":"AW7+1","v":45},{"$f":"AX7+1","v":46},{"$f":"AY7+1","v":47},{"$f":"AZ7+1","v":48},{"$f":"BA7+1","v":49},{"$f":"BB7+1","v":50},{"$f":"BC7+1","v":51},{"$f":"BD7+1","v":52},{"$f":"BE7+1","v":53},{"$f":"BF7+1","v":54},{"$f":"BG7+1","v":55},{"$f":"BH7+1","v":56},{"$f":"BI7+1","v":57},{"$f":"BJ7+1","v":58},{"$f":"BK7+1","v":59},{"$f":"BL7+1","v":60},{"$f":"BM7+1","v":61},{"$f":"BN7+1","v":62},{"$f":"BO7+1","v":63},{"$f":"BP7+1","v":64},{"$f":"BQ7+1","v":65},{"$f":"BR7+1","v":66}]
[null,"Financial Year",null,"Sum",{"$f":"Hidden!C3","v":2023},{"$f":"E8+1","v":2024},{"$f":"F8+1","v":2025},2026,2027,2028,2029,2030,2031,2032,2033,2034,2035,2036,2037,2038,2039,2040,2041,2042,2043,2044,2045,2046,2047,2048,2049,2050,2051,2052,2053,2054,2055,2056,2057,2058,2059,2060,2061,2062,2063,2064,2065,2066,2067,2068,2069,2070,2071,2072,2073,2074,2075,2076,2077,2078,2079,2080,2081,2082,2083,2084,2085,2086,2087,2088,2089]
[null,"Capex Start Flag",null,null,null,{"$f":"IF(F8=Hidden!$C$4,1,0)","v":0},{"$f":"IF(G8=Hidden!$C$4,1,0)","v":0},{"$f":"IF(H8=Hidden!$C$4,1,0)","v":1},{"$f":"IF(I8=Hidden!$C$4,1,0)","v":0},{"$f":"IF(J8=Hidden!$C$4,1,0)","v":0},{"$f":"IF(K8=Hidden!$C$4,1,0)","v":0},{"$f":"IF(L8=Hidden!$C$4,1,0)","v":0},{"$f":"IF(M8=Hidden!$C$4,1,0)","v":0},{"$f":"IF(N8=Hidden!$C$4,1,0)","v":0},{"$f":"IF(O8=Hidden!$C$4,1,0)","v":0},{"$f":"IF(P8=Hidden!$C$4,1,0)","v":0},{"$f":"IF(Q8=Hidden!$C$4,1,0)","v":0},{"$f":"IF(R8=Hidden!$C$4,1,0)","v":0},{"$f":"IF(S8=Hidden!$C$4,1,0)","v":0},{"$f":"IF(T8=Hidden!$C$4,1,0)","v":0},{"$f":"IF(U8=Hidden!$C$4,1,0)","v":0},{"$f":"IF(V8=Hidden!$C$4,1,0)","v":0},{"$f":"IF(W8=Hidden!$C$4,1,0)","v":0},{"$f":"IF(X8=Hidden!$C$4,1,0)","v":0},{"$f":"IF(Y8=Hidden!$C$4,1,0)","v":0},{"$f":"IF(Z8=Hidden!$C$4,1,0)","v":0},{"$f":"IF(AA8=Hidden!$C$4,1,0)","v":0},{"$f":"IF(AB8=Hidden!$C$4,1,0)","v":0},{"$f":"IF(AC8=Hidden!$C$4,1,0)","v":0},{"$f":"IF(AD8=Hidden!$C$4,1,0)","v":0},{"$f":"IF(AE8=Hidden!$C$4,1,0)","v":0},{"$f":"IF(AF8=Hidden!$C$4,1,0)","v":0},{"$f":"IF(AG8=Hidden!$C$4,1,0)","v":0},{"$f":"IF(AH8=Hidden!$C$4,1,0)","v":0},{"$f":"IF(AI8=Hidden!$C$4,1,0)","v":0},{"$f":"IF(AJ8=Hidden!$C$4,1,0)","v":0},{"$f":"IF(AK8=Hidden!$C$4,1,0)","v":0},{"$f":"IF(AL8=Hidden!$C$4,1,0)","v":0},{"$f":"IF(AM8=Hidden!$C$4,1,0)","v":0},{"$f":"IF(AN8=Hidden!$C$4,1,0)","v":0},{"$f":"IF(AO8=Hidden!$C$4,1,0)","v":0},{"$f":"IF(AP8=Hidden!$C$4,1,0)","v":0},{"$f":"IF(AQ8=Hidden!$C$4,1,0)","v":0},{"$f":"IF(AR8=Hidden!$C$4,1,0)","v":0},{"$f":"IF(AS8=Hidden!$C$4,1,0)","v":0},{"$f":"IF(AT8=Hidden!$C$4,1,0)","v":0},{"$f":"IF(AU8=Hidden!$C$4,1,0)","v":0},{"$f":"IF(AV8=Hidden!$C$4,1,0)","v":0},{"$f":"IF(AW8=Hidden!$C$4,1,0)","v":0},{"$f":"IF(AX8=Hidden!$C$4,1,0)","v":0},{"$f":"IF(AY8=Hidden!$C$4,1,0)","v":0},{"$f":"IF(AZ8=Hidden!$C$4,1,0)","v":0},{"$f":"IF(BA8=Hidden!$C$4,1,0)","v":0},{"$f":"IF(BB8=Hidden!$C$4,1,0)","v":0},{"$f":"IF(BC8=Hidden!$C$4,1,0)","v":0},{"$f":"IF(BD8=Hidden!$C$4,1,0)","v":0},{"$f":"IF(BE8=Hidden!$C$4,1,0)","v":0},{"$f":"IF(BF8=Hidden!$C$4,1,0)","v":0},{"$f":"IF(BG8=Hidden!$C$4,1,0)","v":0},{"$f":"IF(BH8=Hidden!$C$4,1,0)","v":0},{"$f":"IF(BI8=Hidden!$C$4,1,0)","v":0},{"$f":"IF(BJ8=Hidden!$C$4,1,0)","v":0},{"$f":"IF(BK8=Hidden!$C$4,1,0)","v":0},{"$f":"IF(BL8=Hidden!$C$4,1,0)","v":0},{"$f":"IF(BM8=Hidden!$C$4,1,0)","v":0}]
[null,"Capex",null,null,{"$f":"IFERROR(HLOOKUP(E8,Table_2,2,FALSE),0)","v":0},0,0,3620640,508517,0,0,0,0,0,0,0,0,0,0,0,0,0,0,0,0,0,0,0,0,0,0,0,0,0,0,0,0,0,0,0,0]
{"$rows_left_out":41}
{"sheet":"NPV_Output","index":2,"n_rows":41,"n_cols":8,"rows_kept":41,"cut":false,"hidden":false,"merged":[]}
[{"$f":"\"R\"&ROW(Start_1)+Index_1*1-1&\"C\"&COLUMN(Start_1)","v":"R6C8"}]
[null,"NPV Summary",null,null,null,"WACC:",{"$f":"Hidden!C5","v":3.5000000000000003E-2}]
[]
[null,"Index","GT Stream","WR Description","GT Lvl 3 Managers","DNSP","Total Capex ","NPV"]
[null,1,{"$f":"IF(Project_Input!C6=0,\"\",Project_Input!C6)","v":""},{"$f":"IF(Project_Input!D6=0,\"\",Project_Input!D6)","v":"Ergon AER Response"},{"$f":"IF(Project_Input!E6=0,\"\",Project_Input!E6)","v":""},{"$f":"IF(Project_Input!F6=0,\"\",Project_Input!F6)","v":""},{"$f":"IF(Project_Input!L6<>\"\",Project_Input!L6,\"\")","v":""},-1.8996942752456305E-2]
[null,{"$f":"B5+1","v":2},{"$f":"IF(Project_Input!C7=0,\"\",Project_Input!C7)","v":"OT"},{"$f":"IF(Project_Input!D7=0,\"\",Project_Input!D7)","v":"Server & Workstation_ERG_1829387"},{"$f":"IF(Project_Input!E7=0,\"\",Project_Input!E7)","v":""},{"$f":"IF(Project_Input!F7=0,\"\",Project_Input!F7)","v":"ERG"},{"$f":"IF(Project_Input!L7<>\"\",Project_Input!L7,\"\")","v":4129157},-115465.97472609166]
[null,{"$f":"B6+1","v":3},{"$f":"IF(Project_Input!C8=0,\"\",Project_Input!C8)","v":"OT"},{"$f":"IF(Project_Input!D8=0,\"\",Project_Input!D8)","v":"STOR BACKUP_ERG_1829388"},{"$f":"IF(Project_Input!E8=0,\"\",Project_Input!E8)","v":""},{"$f":"IF(Project_Input!F8=0,\"\",Project_Input!F8)","v":"ERG"},{"$f":"IF(Project_Input!L8<>\"\",Project_Input!L8,\"\")","v":1277515.2669927203},-9454.1988352567278]
[null,4,{"$f":"IF(Project_Input!C9=0,\"\",Project_Input!C9)","v":"OT"},{"$f":"IF(Project_Input!D9=0,\"\",Project_Input!D9)","v":"Zetron Combined ERG (opt1) - Sept 2024"},{"$f":"IF(Project_Input!E9=0,\"\",Project_Input!E9)","v":""},{"$f":"IF(Project_Input!F9=0,\"\",Project_Input!F9)","v":"ERG"},{"$f":"IF(Project_Input!L9<>\"\",Project_Input!L9,\"\")","v":4755912.3687826656},908780.68120789609]
[null,5,{"$f":"IF(Project_Input!C10=0,\"\",Project_Input!C10)","v":""},{"$f":"IF(Project_Input!D10=0,\"\",Project_Input!D10)","v":""},{"$f":"IF(Project_Input!E10=0,\"\",Project_Input!E10)","v":""},{"$f":"IF(Project_Input!F10=0,\"\",Project_Input!F10)","v":""},{"$f":"IF(Project_Input!L10<>\"\",Project_Input!L10,\"\")","v":""},-1.8996942752456305E-2]
[null,6,{"$f":"IF(Project_Input!C11=0,\"\",Project_Input!C11)","v":""},{"$f":"IF(Project_Input!D11=0,\"\",Project_Input!D11)","v":""},{"$f":"IF(Project_Input!E11=0,\"\",Project_Input!E11)","v":""},{"$f":"IF(Project_Input!F11=0,\"\",Project_Input!F11)","v":""},{"$f":"IF(Project_Input!L11<>\"\",Project_Input!L11,\"\")","v":""},-1.8996942752456305E-2]
{"$rows_left_out":32}
{"sheet":"Sensitivity","index":3,"n_rows":19,"n_cols":28,"rows_kept":19,"cut":false,"hidden":false,"merged":[[1,1,1,3],[6,1,16,1],[4,3,4,13],[2,24,2,25],[2,26,2,27],[2,22,2,23]]}
[]
[null,"NPV (Base Case)",null,null,{"$f":"NPV_1","v":-115465.97472609166},null,null,null,null,null,null,null,null,"Base Case)"]
[null,null,null,null,null,null,null,null,null,null,null,null,null,null,null,null,null,"2024-05-01",null,"NPV","Benefit","VCR","Discount",null,"Failure rate",null,"Benefit"]
[null,"NPV Sensitivity Analysis",null,null,null,"Project Index",{"$f":"Index_1","v":2},null,"Project Name",{"$f":"DCF!C4","v":"Server & Workstation_ERG_1829387"},null,null,null,null,null,null,null,null,null,3.5000000000000003E-2,null,null,2.5000000000000001E-2,4.4999999999999998E-2,1.25,0.75,1.25,0.75]
[null,null,null,"WACC Sensitivity",null,null,null,null,null,null,null,null,null,null,null,1,"","OT Server & Workstation Replacement",""]
[null,null,null,{"$f":"Hidden!C14","v":9.9999999999999985E-3},{"$f":"Hidden!D14","v":1.4999999999999999E-2},{"$f":"Hidden!E14","v":0.02},{"$f":"Hidden!F14","v":2.5000000000000001E-2},{"$f":"Hidden!G14","v":3.0000000000000002E-2},{"$f":"Hidden!H14","v":3.5000000000000003E-2},{"$f":"Hidden!I14","v":0.04},{"$f":"Hidden!J14","v":4.4999999999999998E-2},{"$f":"Hidden!K14","v":4.9999999999999996E-2},{"$f":"Hidden!L14","v":5.4999999999999993E-2},{"$f":"Hidden!M14","v":5.9999999999999991E-2},null,2,"OT","Server & Workstation_EGX_7862124","EGX",-119075.3506069242,488363.87462854799,103820,60127.333641324913,-275481.60229089012,65313.110911224285,-303463.81212507328,999044.12365674938,-1015105.2803154073]
[null,"Benefit Sensitivity",{"$f":"Hidden!B15","v":1.2500000000000002},{"$f":"Hidden!C15","v":1790066.8567402998},{"$f":"Hidden!D15","v":1612368.8617642992},{"$f":"Hidden!E15","v":1445416.3153588087},{"$f":"Hidden!F15","v":1288550.0968910397},{"$f":"Hidden!G15","v":1141154.3645141434},{"$f":"Hidden!H15","v":1002653.499537583},{"$f":"Hidden!I15","v":872509.28166532819},{"$f":"Hidden!J15","v":750218.27654998039},{"$f":"Hidden!K15","v":635309.4186870188},{"$f":"Hidden!L15","v":527341.77410934912},{"$f":"Hidden!M15","v":425902.4686497337},null,3,"OT","Server & Workstation_ERG_1829387","ERG",-115465.97472609166,488363.87462854799,103820,63855.376876618706,-271985.403714124,68922.486792057331,-299854.43624423956,1002653.499537583,-1011495.9044345733]
[null,null,{"$f":"Hidden!B16","v":1.2000000000000002},{"$f":"Hidden!C16","v":1482820.1098892873},{"$f":"Hidden!D16","v":1319156.1328750809},{"$f":"Hidden!E16","v":1165497.1629941075},{"$f":"Hidden!F16","v":1021227.9881946159},{"$f":"Hidden!G16","v":885773.80495415372},{"$f":"Hidden!H16","v":758597.36658577039},{"$f":"Hidden!I16","v":639196.34682615963},{"$f":"Hidden!J16","v":527100.90142493311},{"$f":"Hidden!K16","v":421871.41192036908},{"$f":"Hidden!L16","v":323096.39712306927},{"$f":"Hidden!M16","v":230390.57904554586},null,4,"","",""]
[null,null,{"$f":"Hidden!B17","v":1.1500000000000001},{"$f":"Hidden!C17","v":1188998.4439082958},{"$f":"Hidden!D17","v":1038754.3945813697},{"$f":"Hidden!E17","v":897807.33994595322},{"$f":"Hidden!F17","v":765584.05238177779},{"$f":"Hidden!G17","v":641548.96836588695},{"$f":"Hidden!H17","v":525201.53177260689},{"$f":"Hidden!I17","v":416073.73755308014},{"$f":"Hidden!J17","v":313727.85972887283},{"$f":"Hidden!K17","v":217754.3489952512},{"$f":"Hidden!L17","v":127769.88647024817},{"$f":"Hidden!M17","v":43415.581255445613},null,5,"","OT SAN & Backup Replacement",""]
[null,null,{"$f":"Hidden!B18","v":1.1000000000000001},{"$f":"Hidden!C18","v":908042.48042774189},{"$f":"Hidden!D18","v":770629.85560835432},{"$f":"Hidden!E18","v":641837.2908261579},{"$f":"Hidden!F18","v":521131.69891570986},{"$f":"Hidden!G18","v":408015.03295885393},{"$f":"Hidden!H18","v":302021.81600898248},{"$f":"Hidden!I18","v":202716.85694750323},{"$f":"Hidden!J18","v":109693.13756892702},{"$f":"Hidden!K18","v":22569.857251601057},{"$f":"Hidden!L18","v":-59009.377279673652},{"$f":"Hidden!M18","v":-135378.22854615422},null,6,"OT","STOR BACKUP_EGX_7862125","EGX",-11928.480656387699,452950.52701122803,207640,-29869.559981791823,1207.9594246554357,327174.09000222734,-351031.05131500325,1296301.2020821981,-928648.32486851874]
{"$rows_left_out":10}
{"sheet":"Hidden","index":4,"n_rows":72,"n_cols":13,"rows_kept":72,"cut":false,"hidden":false,"merged":[]}
[]
[null,"Model General Input"]
[null,"Model Start Year",2023,"Year"]
[null,"Program Start Year",2026,"Year",null,"2023-11-01",3.5]
[null,"Pre-Tax Real WACC",3.5000000000000003E-2,"%",null,"2023-05-01",2.73]
[null,"Benefit Sensitivity",1]
[null,"VCR ",51.91,"$/KWh"]
[null,"Carbon Conversion Rate",8.5000000000000006E-3,"Ton/MWh"]
[null,"Carbon Price",30,"$/Ton"]
[]
{"$rows_left_out":62}