{"text_format":"1","workbook":"xlsx","n_sheets":5,"sheets":["Project_Input","DCF","NPV_Output","Sensitivity","Hidden"],"not_rendered":{"charts":3,"images":0,"macros":1,"external_links":2,"defined_names":220,"comments":2,"pivot_tables":0},"unopened":[],"bounds":{"document_bytes":16777216,"sheet_cells":100000,"rows_first":2000,"rows_last":500,"rows_between":2000,"halvings":0,"cell_chars":16384,"cell_head_chars":4096},"cells_cut":0,"cells_raw":0,"read":"whole","date_system":"1900"}

{"sheet":"Project_Input","index":0,"n_rows":88,"n_cols":51,"rows_kept":88,"cut":false,"hidden":false,"merged":[[3,4,4,4],[3,5,4,5],[3,3,4,3],[3,2,4,2],[3,1,4,1],[3,37,3,43],[3,44,3,50],[3,18,4,18],[3,6,3,11],[3,19,3,23],[3,24,3,30],[3,31,3,36],[3,13,3,17]]}
[]
[null,"Project Input"]
[null,1,{"$f":"B3+1","v":2},{"$f":"C3+1","v":3},{"$f":"D3+1","v":4},{"$f":"E3+1","v":5},{"$f":"F3+1","v":6},7,8,9,10,11,{"$f":"L3+1","v":12},{"$f":"M3+1","v":13},{"$f":"N3+1","v":14},{"$f":"O3+1","v":15},{"$f":"P3+1","v":16},{"$f":"Q3+1","v":17},{"$f":"R3+1","v":18},{"$f":"S3+1","v":19},{"$f":"T3+1","v":20},{"$f":"U3+1","v":21},{"$f":"V3+1","v":22},{"$f":"W3+1","v":23},{"$f":"X3+1","v":24},{"$f":"Y3+1","v":25},{"$f":"Z3+1","v":26},{"$f":"AA3+1","v":27},{"$f":"AB3+1","v":28},29,{"$f":"AD3+1","v":30},{"$f":"AE3+1","v":31},{"$f":"AF3+1","v":32},{"$f":"AG3+1","v":33},{"$f":"AH3+1","v":34},{"$f":"AI3+1","v":35},{"$f":"AJ3+1","v":36},{"$f":"AK3+1","v":37},{"$f":"AL3+1","v":38},{"$f":"AM3+1","v":39},{"$f":"AN3+1","v":40},{"$f":"AO3+1","v":41},{"$f":"AP3+1","v":42},{"$f":"AQ3+1","v":43},{"$f":"AR3+1","v":44},{"$f":"AS3+1","v":45},{"$f":"AT3+1","v":46},{"$f":"AU3+1","v":47},48,49,50]
[null,"Index","Stream","WR Description","Manager","DNSP","Capex Input",null,null,null,null,null,"O&M","Benefit Claim Ramping Up (% from 2026 to 2030)",null,null,null,null,"Additional Benefit Claim Period (No of Year beyond 2030)","Value of Customer Reliability (VCR) (Reliability)",null,null,null,null,"Financial",null,null,null,null,null,null,"Safety",null,null,null,null,null,"Environmental",null,null,null,null,null,null,"Other Inputs"]
[null,null,null,null,null,null,2026,{"$f":"G5+1","v":2027},{"$f":"H5+1","v":2028},2029,2030,"Total","As % of Capex",2026,{"$f":"N5+1","v":2027},{"$f":"O5+1","v":2028},{"$f":"P5+1","v":2029},{"$f":"Q5+1","v":2030},null,"Yes/No","Average Load (KWh)","Outage Duration (Hours Per Year)","Frequency of Event (%)","Comments","Yes/No","Labour Saving ($/Per Year)","Material Saving ($/Per Year)","Other Saving ($/Per Year)","Equipment Replacement Cost","Probability of Failure of Equipment (%)","Comments","Yes/No","Probability of Fatality (%)","Cost of Fatality ($)","Probability of Enjury (%)","Cost of Enjury ($)","Comments","Yes/No","Probability of event A","Cost of event A","Probability of event B","Cost of Event B","Carbon Reduction (in MWh)","Comments"]
[null,361,"REPEX","GRID COMMS AC Systems Replacements (Option1 - Risk based program) Preferred","Brad S","EECL",701000,879200,880200,881200,{"$f":"L6-SUM(G6:J6)","v":1058400},4400000,0,{"$f":"G6/L6","v":0.15931818181818183},{"$f":"H6/L6+N6","v":0.35913636363636364},{"$f":"O6+J6/L6","v":0.55940909090909097},1,1,12,"yes",200,4,0.01,"Failure of a site from weather, loss of P25 and protection, SCADA and some depot comms","Yes",8960,null,null,{"$f":"L6*2","v":8800000},0.05,"Currently having 2 fail a year, if proactive program not proceeding likely 5 per year, out of a propulation of 100","Yes",{"$f":"1/1000000","v":9.9999999999999995E-7},30000000,{"$f":"1/100000","v":1.0000000000000001E-5},500000,null,"No"]
[null,362,"REPEX","GRID COMMS AC Systems Replacements (Option 2 - Replace all)","Brad S","EECL",{"$f":"$L7/5","v":1305130.8622400002},1305130.8622400002,1305130.8622400002,1305130.8622400002,1305130.8622400002,6525654.3112000003,0,{"$f":"G7/L7","v":0.2},{"$f":"H7/L7+N7","v":0.4},{"$f":"O7+J7/L7","v":0.60000000000000009},{"$f":"P7+K7/L7","v":0.8},1,12,"yes",200,4,0.01,"Failure of a site from weather, loss of P25 and protection, SCADA and some depot comms","Yes",8960,null,null,{"$f":"L7*2","v":13051308.622400001},0.05,"Currently having 2 fail a year, if proactive program not proceeding likely 5 per year, out of a propulation of 100","Yes",{"$f":"1/1000000","v":9.9999999999999995E-7},30000000,{"$f":"1/100000","v":1.0000000000000001E-5},500000,null,"No"]
[null,363,"REPEX","GRID COMMS AC Systems Replacements (Option 3 - AER proposed)","Brad S","EECL",896582.43984000012,896582.43984000012,896582.43984000012,896582.43984000012,896582.43984000012,4482912.1992000006,0,{"$f":"G8/L8","v":0.2},{"$f":"H8/L8+N8","v":0.4},{"$f":"O8+J8/L8","v":0.60000000000000009},{"$f":"P8+K8/L8","v":0.8},1,12,"yes",200,4,0.01,"Failure of a site from weather, loss of P25 and protection, SCADA and some depot comms","Yes",8960,null,null,{"$f":"L8*2","v":8965824.3984000012},0.05,"Currently having 2 fail a year, if proactive program not proceeding likely 5 per year, out of a propulation of 100","Yes",{"$f":"1/1000000","v":9.9999999999999995E-7},30000000,{"$f":"1/100000","v":1.0000000000000001E-5},500000,null,"No"]
[null,364,"REPEX","GRID COMMS AC Systems Replacements (Option 4 - Reactive replace)","Brad S","EECL",{"$f":"$L9/5","v":1522026.47832},{"$f":"$L9/5","v":1522026.47832},1522026.47832,1522026.47832,1522026.47832,7610132.3915999997,0,{"$f":"G9/L9","v":0.2},{"$f":"H9/L9+N9","v":0.4},{"$f":"O9+J9/L9","v":0.60000000000000009},{"$f":"P9+K9/L9","v":0.8},1,12]
[null,881,"REPEX","GRID COMMS P25 Replacement (Option 1 - Proposed Life Extension) Preferred","Luke A","EECL",448196.62443396676,449489.72297671071,1200459.2841964411,1200459.2841964411,1200459.2841964411,4499064.2000000011,0,0.1,0.3,0.6,0.9,1,9,"Yes",2000,8,0.01,"Outage of P25 during natural disaster increasing the restoration time. Probability once every 8 years.","Yes",{"$f":"90*112","v":10080},null,null,{"$f":"L10 * 2","v":8998128.4000000022},0.05,"double cost to replace reactivly vs proactivly","Yes",{"$f":"1/1000000","v":9.9999999999999995E-7},30000000,{"$f":"1/100000","v":1.0000000000000001E-5},500000,"P25 safety duress, impact detection functions utilised X  per year"]
{"$rows_left_out":79}
{"sheet":"DCF","index":1,"n_rows":65,"n_cols":71,"rows_kept":65,"cut":false,"hidden":false,"merged":[[2,31,2,36],[4,2,4,3],[2,2,2,3],[3,2,3,3],[2,10,2,14],[2,15,3,15],[2,16,2,19],[2,20,2,25],[2,26,2,30]]}
[null,"Discounted Cashflow Analysis","All $ in Real AUD2022"]
[]
[null,"Project Inedx",361,null,"Capex",null,null,null,null,"O&M","Benefit Claim Ramping Up (%)",null,null,null,null,"Benefit Claim Period (No of Year)",{"$f":"Project_Input!T4","v":"Value of Customer Reliability (VCR) (Reliability)"},null,null,null,{"$f":"Project_Input!Y4","v":"Financial"},null,null,null,null,null,{"$f":"Project_Input!AF4","v":"Safety"},null,null,null,null,{"$f":"Project_Input!AL4","v":"Environmental"}]
[null,"WR Description",{"$f":"VLOOKUP(Index_1,Project_Table,Project_Input!$D$3,FALSE)","v":"GRID COMMS AC Systems Replacements (Option1 - Risk based program) Preferred"},null,2026,2027,2028,2029,2030,"As % of Capex",2026,{"$f":"K4+1","v":2027},{"$f":"L4+1","v":2028},2029,2030,null,{"$f":"Project_Input!T5","v":"Yes/No"},{"$f":"Project_Input!U5","v":"Average Load (KWh)"},{"$f":"Project_Input!V5","v":"Outage Duration (Hours Per Year)"},{"$f":"Project_Input!W5","v":"Frequency of Event (%)"},{"$f":"Project_Input!Y5","v":"Yes/No"},{"$f":"Project_Input!Z5","v":"Labour Saving ($/Per Year)"},{"$f":"Project_Input!AA5","v":"Material Saving ($/Per Year)"},{"$f":"Project_Input!AB5","v":"Other Saving ($/Per Year)"},{"$f":"Project_Input!AC5","v":"Equipment Replacement Cost"},{"$f":"Project_Input!AD5","v":"Probability of Failure of Equipment (%)"},{"$f":"Project_Input!AF5","v":"Yes/No"},{"$f":"Project_Input!AG5","v":"Probability of Fatality (%)"},{"$f":"Project_Input!AH5","v":"Cost of Fatality ($)"},{"$f":"Project_Input!AI5","v":"Probability of Enjury (%)"},{"$f":"Project_Input!AJ5","v":"Cost of Enjury ($)"},{"$f":"Project_Input!AL5","v":"Yes/No"},{"$f":"Project_Input!AM5","v":"Probability of event A"},{"$f":"Project_Input!AN5","v":"Cost of event A"},{"$f":"Project_Input!AO5","v":"Probability of event B"},{"$f":"Project_Input!AP5","v":"Cost of Event B"},{"$f":"Project_Input!AQ5","v":"Carbon Reduction (in MWh)"}]
[null,"DNSP",{"$f":"VLOOKUP(Index_1,Project_Table,Project_Input!$F$3)","v":"EECL"},null,{"$f":"VLOOKUP(Index_1,Project_Table,Project_Input!G3,FALSE)","v":701000},{"$f":"VLOOKUP(Index_1,Project_Table,Project_Input!H3,FALSE)","v":879200},{"$f":"VLOOKUP(Index_1,Project_Table,Project_Input!I3,FALSE)","v":880200},{"$f":"VLOOKUP(Index_1,Project_Table,Project_Input!J3,FALSE)","v":881200},{"$f":"VLOOKUP(Index_1,Project_Table,Project_Input!K3,FALSE)","v":1058400},{"$f":"VLOOKUP(Index_1,Project_Table,Project_Input!M3,FALSE)","v":0},{"$f":"VLOOKUP(Index_1,Project_Table,Project_Input!N3,FALSE)","v":0.15931818181818183},{"$f":"VLOOKUP(Index_1,Project_Table,Project_Input!O3,FALSE)","v":0.35913636363636364},{"$f":"VLOOKUP(Index_1,Project_Table,Project_Input!P3,FALSE)","v":0.55940909090909097},{"$f":"VLOOKUP(Index_1,Project_Table,Project_Input!Q3,FALSE)","v":1},{"$f":"VLOOKUP(Index_1,Project_Table,Project_Input!R3,FALSE)","v":1},{"$f":"VLOOKUP(Index_1,Project_Table,Project_Input!S3,FALSE)","v":12},{"$f":"VLOOKUP(Index_1,Project_Table,Project_Input!T3,FALSE)","v":"yes"},{"$f":"VLOOKUP(Index_1,Project_Table,Project_Input!U3,FALSE)","v":200},{"$f":"VLOOKUP(Index_1,Project_Table,Project_Input!V3,FALSE)","v":4},{"$f":"VLOOKUP(Index_1,Project_Table,Project_Input!W3,FALSE)","v":0.01},{"$f":"VLOOKUP(Index_1,Project_Table,Project_Input!Y3,FALSE)","v":"Yes"},{"$f":"VLOOKUP(Index_1,Project_Table,Project_Input!Z3,FALSE)","v":8960},{"$f":"VLOOKUP(Index_1,Project_Table,Project_Input!AA3,FALSE)","v":0},{"$f":"VLOOKUP(Index_1,Project_Table,Project_Input!AB3,FALSE)","v":0},{"$f":"VLOOKUP(Index_1,Project_Table,Project_Input!AC3,FALSE)","v":8800000},{"$f":"VLOOKUP(Index_1,Project_Table,Project_Input!AD3,FALSE)","v":0.05},{"$f":"VLOOKUP(Index_1,Project_Table,Project_Input!AF3,FALSE)","v":"Yes"},{"$f":"VLOOKUP(Index_1,Project_Table,Project_Input!AG3,FALSE)","v":9.9999999999999995E-7},{"$f":"VLOOKUP(Index_1,Project_Table,Project_Input!AH3,FALSE)","v":30000000},{"$f":"VLOOKUP(Index_1,Project_Table,Project_Input!AI3,FALSE)","v":1.0000000000000001E-5},{"$f":"VLOOKUP(Index_1,Project_Table,Project_Input!AJ3,FALSE)","v":500000},{"$f":"VLOOKUP(Index_1,Project_Table,Project_Input!AL3,FALSE)","v":"No"},{"$f":"VLOOKUP(Index_1,Project_Table,Project_Input!AM3,FALSE)","v":0},{"$f":"VLOOKUP(Index_1,Project_Table,Project_Input!AN3,FALSE)","v":0},{"$f":"VLOOKUP(Index_1,Project_Table,Project_Input!AO3,FALSE)","v":0},{"$f":"VLOOKUP(Index_1,Project_Table,Project_Input!AP3,FALSE)","v":0},{"$f":"VLOOKUP(Index_1,Project_Table,Project_Input!AQ3,FALSE)","v":0},{"$f":"VLOOKUP(Index_1,Project_Table,Project_Input!F3)","v":"EECL"}]
[]
[null,"Year Index",null,null,0,1,{"$f":"F7+1","v":2},{"$f":"G7+1","v":3},4,5,6,7,8,9,10,11,12,13,14,15,16,17,18,19,20,{"$f":"Y7+1","v":21},{"$f":"Z7+1","v":22},{"$f":"AA7+1","v":23},{"$f":"AB7+1","v":24},{"$f":"AC7+1","v":25},{"$f":"AD7+1","v":26},{"$f":"AE7+1","v":27},{"$f":"AF7+1","v":28},{"$f":"AG7+1","v":29},{"$f":"AH7+1","v":30},{"$f":"AI7+1","v":31},{"$f":"AJ7+1","v":32},{"$f":"AK7+1","v":33},{"$f":"AL7+1","v":34},{"$f":"AM7+1","v":35},{"$f":"AN7+1","v":36},{"$f":"AO7+1","v":37},{"$f":"AP7+1","v":38},{"$f":"AQ7+1","v":39},{"$f":"AR7+1","v":40},{"$f":"AS7+1","v":41},{"$f":"AT7+1","v":42},{"$f":"AU7+1","v":43},{"$f":"AV7+1","v":44},{"$f":"AW7+1","v":45},{"$f":"AX7+1","v":46},{"$f":"AY7+1","v":47},{"$f":"AZ7+1","v":48},{"$f":"BA7+1","v":49},{"$f":"BB7+1","v":50},{"$f":"BC7+1","v":51},{"$f":"BD7+1","v":52},{"$f":"BE7+1","v":53},{"$f":"BF7+1","v":54},{"$f":"BG7+1","v":55},{"$f":"BH7+1","v":56},{"$f":"BI7+1","v":57},{"$f":"BJ7+1","v":58},{"$f":"BK7+1","v":59},{"$f":"BL7+1","v":60},{"$f":"BM7+1","v":61},{"$f":"BN7+1","v":62},{"$f":"BO7+1","v":63},{"$f":"BP7+1","v":64},{"$f":"BQ7+1","v":65},{"$f":"BR7+1","v":66}]
[null,"Financial Year",null,"Sum",{"$f":"Hidden!C3","v":2023},{"$f":"E8+1","v":2024},{"$f":"F8+1","v":2025},2026,2027,2028,2029,2030,2031,2032,2033,2034,2035,2036,2037,2038,2039,2040,2041,2042,2043,2044,2045,2046,2047,2048,2049,2050,2051,2052,2053,2054,2055,2056,2057,2058,2059,2060,2061,2062,2063,2064,2065,2066,2067,2068,2069,2070,2071,2072,2073,2074,2075,2076,2077,2078,2079,2080,2081,2082,2083,2084,2085,2086,2087,2088,2089]
[null,"Capex Start Flag",null,null,null,{"$f":"IF(F8=Hidden!$C$4,1,0)","v":0},{"$f":"IF(G8=Hidden!$C$4,1,0)","v":0},{"$f":"IF(H8=Hidden!$C$4,1,0)","v":1},{"$f":"IF(I8=Hidden!$C$4,1,0)","v":0},{"$f":"IF(J8=Hidden!$C$4,1,0)","v":0},{"$f":"IF(K8=Hidden!$C$4,1,0)","v":0},{"$f":"IF(L8=Hidden!$C$4,1,0)","v":0},{"$f":"IF(M8=Hidden!$C$4,1,0)","v":0},{"$f":"IF(N8=Hidden!$C$4,1,0)","v":0},{"$f":"IF(O8=Hidden!$C$4,1,0)","v":0},{"$f":"IF(P8=Hidden!$C$4,1,0)","v":0},{"$f":"IF(Q8=Hidden!$C$4,1,0)","v":0},{"$f":"IF(R8=Hidden!$C$4,1,0)","v":0},{"$f":"IF(S8=Hidden!$C$4,1,0)","v":0},{"$f":"IF(T8=Hidden!$C$4,1,0)","v":0},{"$f":"IF(U8=Hidden!$C$4,1,0)","v":0},{"$f":"IF(V8=Hidden!$C$4,1,0)","v":0},{"$f":"IF(W8=Hidden!$C$4,1,0)","v":0},{"$f":"IF(X8=Hidden!$C$4,1,0)","v":0},{"$f":"IF(Y8=Hidden!$C$4,1,0)","v":0},{"$f":"IF(Z8=Hidden!$C$4,1,0)","v":0},{"$f":"IF(AA8=Hidden!$C$4,1,0)","v":0},{"$f":"IF(AB8=Hidden!$C$4,1,0)","v":0},{"$f":"IF(AC8=Hidden!$C$4,1,0)","v":0},{"$f":"IF(AD8=Hidden!$C$4,1,0)","v":0},{"$f":"IF(AE8=Hidden!$C$4,1,0)","v":0},{"$f":"IF(AF8=Hidden!$C$4,1,0)","v":0},{"$f":"IF(AG8=Hidden!$C$4,1,0)","v":0},{"$f":"IF(AH8=Hidden!$C$4,1,0)","v":0},{"$f":"IF(AI8=Hidden!$C$4,1,0)","v":0},{"$f":"IF(AJ8=Hidden!$C$4,1,0)","v":0},{"$f":"IF(AK8=Hidden!$C$4,1,0)","v":0},{"$f":"IF(AL8=Hidden!$C$4,1,0)","v":0},{"$f":"IF(AM8=Hidden!$C$4,1,0)","v":0},{"$f":"IF(AN8=Hidden!$C$4,1,0)","v":0},{"$f":"IF(AO8=Hidden!$C$4,1,0)","v":0},{"$f":"IF(AP8=Hidden!$C$4,1,0)","v":0},{"$f":"IF(AQ8=Hidden!$C$4,1,0)","v":0},{"$f":"IF(AR8=Hidden!$C$4,1,0)","v":0},{"$f":"IF(AS8=Hidden!$C$4,1,0)","v":0},{"$f":"IF(AT8=Hidden!$C$4,1,0)","v":0},{"$f":"IF(AU8=Hidden!$C$4,1,0)","v":0},{"$f":"IF(AV8=Hidden!$C$4,1,0)","v":0},{"$f":"IF(AW8=Hidden!$C$4,1,0)","v":0},{"$f":"IF(AX8=Hidden!$C$4,1,0)","v":0},{"$f":"IF(AY8=Hidden!$C$4,1,0)","v":0},{"$f":"IF(AZ8=Hidden!$C$4,1,0)","v":0},{"$f":"IF(BA8=Hidden!$C$4,1,0)","v":0},{"$f":"IF(BB8=Hidden!$C$4,1,0)","v":0},{"$f":"IF(BC8=Hidden!$C$4,1,0)","v":0},{"$f":"IF(BD8=Hidden!$C$4,1,0)","v":0},{"$f":"IF(BE8=Hidden!$C$4,1,0)","v":0},{"$f":"IF(BF8=Hidden!$C$4,1,0)","v":0},{"$f":"IF(BG8=Hidden!$C$4,1,0)","v":0},{"$f":"IF(BH8=Hidden!$C$4,1,0)","v":0},{"$f":"IF(BI8=Hidden!$C$4,1,0)","v":0},{"$f":"IF(BJ8=Hidden!$C$4,1,0)","v":0},{"$f":"IF(BK8=Hidden!$C$4,1,0)","v":0},{"$f":"IF(BL8=Hidden!$C$4,1,0)","v":0},{"$f":"IF(BM8=Hidden!$C$4,1,0)","v":0}]
[null,"Capex",null,null,{"$f":"IFERROR(HLOOKUP(E8,Table_2,2,FALSE),0)","v":0},0,0,{"$f":"IFERROR(HLOOKUP(H8,Table_2,2,FALSE),0)","v":701000},879200,880200,881200,1058400,0,0,0,0,0,0,0,0,0,0,0,0,0,0,0,0,0,0,0,0,0,0,0,0,0,0,0,0,0]
{"$rows_left_out":56}
{"sheet":"NPV_Output","index":2,"n_rows":98,"n_cols":39,"rows_kept":98,"cut":false,"hidden":false,"merged":[]}
[{"$f":"\"R\"&ROW(Start_1)+Index_1*1-1&\"C\"&COLUMN(Start_1)","v":{"$error":"#REF!"}}]
[null,"NPV Summary",null,null,null,null,null,null,null,null,null,null,null,"Cash Inflows (Benefits)"]
[]
[null,"Index","GT Stream","WR Description","Managers","Case Ref","Total Capex ","NPV","Counterfactual ","WACC 2.5%","WACC 4.5%","WACC 75%","WACC 125%",2026,2027,2028,2029,2030,2031,2032,2033,2034,2035,2036,2037,2038,2039,2040,2041,2042,2043,2044,2045,2046,2047,2048,2049,2050,2051]
[null,{"$f":"IF(Project_Input!$D6=\"\",\"\",Project_Input!B6)","v":361},{"$f":"IF(Project_Input!$D6=\"\",\"\",Project_Input!C6)","v":"REPEX"},{"$f":"IF(Project_Input!$D6=\"\",\"\",Project_Input!D6)","v":"GRID COMMS AC Systems Replacements (Option1 - Risk based program) Preferred"},{"$f":"IF(Project_Input!$D6=\"\",\"\",Project_Input!E6)","v":"Brad S"},{"$f":"IF(Project_Input!$D6=\"\",\"\",Project_Input!F6)","v":"EECL"},{"$f":"Project_Input!L6","v":4400000},860541.31527332356,1382869.5581279213,1202698.0727556518,573909.91847565258,-277945.07272360194,2000489.4153933725,71534.746379297794,161269.6677853716,251244.58396325185,449410.28,449410.28,449410.28,449410.28,449410.28,449410.28,449410.28,449410.28,449410.28,449410.28,449410.28,449410.28,449410.28,449410.28,0,0,0,0,0,0,0,0,0]
[null,{"$f":"IF(Project_Input!$D7=\"\",\"\",Project_Input!B7)","v":362},{"$f":"IF(Project_Input!$D7=\"\",\"\",Project_Input!C7)","v":"REPEX"},{"$f":"IF(Project_Input!$D7=\"\",\"\",Project_Input!D7)","v":"GRID COMMS AC Systems Replacements (Option 2 - Replace all)"},{"$f":"IF(Project_Input!$D7=\"\",\"\",Project_Input!E7)","v":"Brad S"},{"$f":"IF(Project_Input!$D7=\"\",\"\",Project_Input!F7)","v":"EECL"},{"$f":"Project_Input!L7","v":6525654.3112000003},1162247.0502545887,1985428.7973600002,1668266.3058085719,738436.92321072321,-504779.51005832624,2830681.8225728311,132315.40846400004,264650.75036800007,397025.95915200008,529460.96825600008,661975.71112000011,661975.71112000011,661975.71112000011,661975.71112000011,661975.71112000011,661975.71112000011,661975.71112000011,661975.71112000011,661975.71112000011,661975.71112000011,661975.71112000011,661975.71112000011,661975.71112000011,0,0,0,0,0,0,0,0,0]
[null,{"$f":"IF(Project_Input!$D8=\"\",\"\",Project_Input!B8)","v":363},{"$f":"IF(Project_Input!$D8=\"\",\"\",Project_Input!C8)","v":"REPEX"},{"$f":"IF(Project_Input!$D8=\"\",\"\",Project_Input!D8)","v":"GRID COMMS AC Systems Replacements (Option 3 - AER proposed)"},{"$f":"IF(Project_Input!$D8=\"\",\"\",Project_Input!E8)","v":"Brad S"},{"$f":"IF(Project_Input!$D8=\"\",\"\",Project_Input!F8)","v":"EECL"},{"$f":"Project_Input!L8","v":4482912.1992000006},827945.18771666591,1372606.1637600004,1179012.5543717062,533789.74700910773,-325013.35753192136,1982311.9449705828,91460.566224000009,182941.06588800004,274461.43243200006,366041.59929600009,457701.49992000009,457701.49992000009,457701.49992000009,457701.49992000009,457701.49992000009,457701.49992000009,457701.49992000009,457701.49992000009,457701.49992000009,457701.49992000009,457701.49992000009,457701.49992000009,457701.49992000009,0,0,0,0,0,0,0,0,0]
[null,{"$f":"IF(Project_Input!$D9=\"\",\"\",Project_Input!B9)","v":364},{"$f":"IF(Project_Input!$D9=\"\",\"\",Project_Input!C9)","v":"REPEX"},{"$f":"IF(Project_Input!$D9=\"\",\"\",Project_Input!D9)","v":"GRID COMMS AC Systems Replacements (Option 4 - Reactive replace)"},{"$f":"IF(Project_Input!$D9=\"\",\"\",Project_Input!E9)","v":"Brad S"},{"$f":"IF(Project_Input!$D9=\"\",\"\",Project_Input!F9)","v":"EECL"},{"$f":"Project_Input!L9","v":7610132.3915999997},-6415112.8724759929,0,-6730350.0338524068,-6118596.9777984498,-6415112.8724759929,-6415112.8724759929,0,0,0,0,0,0,0,0,0,0,0,0,0,0,0,0,0,0,0,0,0,0,0,0,0,0]
[null,{"$f":"IF(Project_Input!$D10=\"\",\"\",Project_Input!B10)","v":881},{"$f":"IF(Project_Input!$D10=\"\",\"\",Project_Input!C10)","v":"REPEX"},{"$f":"IF(Project_Input!$D10=\"\",\"\",Project_Input!D10)","v":"GRID COMMS P25 Replacement (Option 1 - Proposed Life Extension) Preferred"},{"$f":"IF(Project_Input!$D10=\"\",\"\",Project_Input!E10)","v":"Luke A"},{"$f":"IF(Project_Input!$D10=\"\",\"\",Project_Input!F10)","v":"EECL"},{"$f":"Project_Input!L10","v":4499064.2000000011},179260.53329436987,1350449.0668000006,380632.66172980895,10408.003946562198,-817878.80888869276,1199961.5218783633,46010.447600000021,138230.67720000003,277806.86160000006,420074.06040000019,468327.02000000014,468327.02000000014,468327.02000000014,468327.02000000014,468327.02000000014,468327.02000000014,468327.02000000014,468327.02000000014,468327.02000000014,468327.02000000014,0,0,0,0,0,0,0,0,0,0,0,0]
[null,{"$f":"IF(Project_Input!$D11=\"\",\"\",Project_Input!B11)","v":882},{"$f":"IF(Project_Input!$D11=\"\",\"\",Project_Input!C11)","v":"REPEX"},{"$f":"IF(Project_Input!$D11=\"\",\"\",Project_Input!D11)","v":"GRID COMMS P25 Replacement (Option 2 - Technology change)"},{"$f":"IF(Project_Input!$D11=\"\",\"\",Project_Input!E11)","v":"Luke A"},{"$f":"IF(Project_Input!$D11=\"\",\"\",Project_Input!F11)","v":"EECL"},{"$f":"Project_Input!L11","v":10462940.684799999},42967.894998877557,3079973.2473919997,534193.85576110508,-369898.68505814194,-2199805.3578122128,2309302.7942108964,105649.21244800001,317146.97174399998,635639.45068799995,956822.94403199991,1064714.66848,1064714.66848,1064714.66848,1064714.66848,1064714.66848,1064714.66848,1064714.66848,1064714.66848,1064714.66848,1064714.66848,0,0,0,0,0,0,0,0,0,0,0,0]
{"$rows_left_out":89}
{"sheet":"Sensitivity","index":3,"n_rows":17,"n_cols":14,"rows_kept":17,"cut":false,"hidden":false,"merged":[[1,1,1,3],[6,1,16,1],[4,3,4,13]]}
[]
[null,"NPV (Base Case)",null,null,{"$f":"NPV_1","v":860541.31527332356},null,null,null,null,null,null,null,null,"Base Case)"]
[]
[null,"NPV Sensitivity Analysis",null,null,null,"Project Index",{"$f":"Index_1","v":361},null,"Project Name",{"$f":"DCF!C4","v":"GRID COMMS AC Systems Replacements (Option1 - Risk based program) Preferred"}]
[null,null,null,"WACC Sensitivity"]
[null,null,null,{"$f":"Hidden!H12","v":9.9999999999999985E-3},{"$f":"Hidden!I12","v":1.4999999999999999E-2},{"$f":"Hidden!J12","v":0.02},{"$f":"Hidden!K12","v":2.5000000000000001E-2},{"$f":"Hidden!L12","v":3.0000000000000002E-2},{"$f":"Hidden!M12","v":3.5000000000000003E-2},{"$f":"Hidden!N12","v":0.04},{"$f":"Hidden!O12","v":4.4999999999999998E-2},{"$f":"Hidden!P12","v":4.9999999999999996E-2},{"$f":"Hidden!Q12","v":5.4999999999999993E-2},{"$f":"Hidden!R12","v":5.9999999999999991E-2}]
[null,"Benefit Sensitivity",{"$f":"Hidden!G13","v":1.2500000000000002},{"$f":"Hidden!H13","v":3353376.1025560456},{"$f":"Hidden!I13","v":3035987.3762662532},{"$f":"Hidden!J13","v":2744020.5095057413},{"$f":"Hidden!K13","v":2475368.2302910197},{"$f":"Hidden!L13","v":2228108.9613793865},{"$f":"Hidden!M13","v":2000489.4153933725},{"$f":"Hidden!N13","v":1790908.9170908828},{"$f":"Hidden!O13","v":1597905.2722529459},{"$f":"Hidden!P13","v":1420142.0224450722},{"$f":"Hidden!Q13","v":1256396.942429021},{"$f":"Hidden!R13","v":1105551.6525265439}]
[null,null,{"$f":"Hidden!G14","v":1.2000000000000002},{"$f":"Hidden!H14","v":3051269.5637953449},{"$f":"Hidden!I14","v":2750810.5611509546},{"$f":"Hidden!J14","v":2474621.0571477087},{"$f":"Hidden!K14","v":2220683.2834915407},{"$f":"Hidden!L14","v":1987157.5039326414},{"$f":"Hidden!M14","v":1772365.3178540356},{"$f":"Hidden!N14","v":1574774.6211785581},{"$f":"Hidden!O14","v":1392986.0513391383},{"$f":"Hidden!P14","v":1225720.7620458235},{"$f":"Hidden!Q14","v":1071809.3903991766},{"$f":"Hidden!R14","v":930182.09379996033}]
[null,null,{"$f":"Hidden!G15","v":1.1500000000000001},{"$f":"Hidden!H15","v":2749257.1176985665},{"$f":"Hidden!I15","v":2465722.3516869643},{"$f":"Hidden!J15","v":2205305.1022155178},{"$f":"Hidden!K15","v":1966077.0751054895},{"$f":"Hidden!L15","v":1746280.3480629248},{"$f":"Hidden!M15","v":1544311.382496608},{"$f":"Hidden!N15","v":1358706.6228502579},{"$f":"Hidden!O15","v":1188129.5174644683},{"$f":"Hidden!P15","v":1031358.8131771036},{"$f":"Hidden!Q15","v":887277.99198270659},{"$f":"Hidden!R15","v":754865.7323474806}]
[null,null,{"$f":"Hidden!G16","v":1.1000000000000001},{"$f":"Hidden!H16","v":2447334.8437380535},{"$f":"Hidden!I16","v":2180719.0559721468},{"$f":"Hidden!J16","v":1936069.1656497631},{"$f":"Hidden!K16","v":1711546.3243656422},{"$f":"Hidden!L16","v":1505474.3978711956},{"$f":"Hidden!M16","v":1316324.6858968444},{"$f":"Hidden!N16","v":1142702.1597066503},{"$f":"Hidden!O16","v":983333.05866897351},{"$f":"Hidden!P16","v":837053.70452514186},{"$f":"Hidden!Q16","v":702800.40744572051},{"$f":"Hidden!R16","v":579600.35161601799}]
{"$rows_left_out":8}
{"sheet":"Hidden","index":4,"n_rows":1014,"n_cols":18,"rows_kept":1014,"cut":false,"hidden":true,"merged":[]}
[]
[null,"Model General Input"]
[null,"Model Start Year",2023,"Year"]
[null,"Program Start Year",2026,"Year"]
[null,"Pre-Tax Real WACC",3.5000000000000003E-2,"%"]
[null,"Benefit Sensitivity",1,"%"]
[null,"VCR ",51.91,"$/KWh"]
[null,"Carbon Conversion Rate",8.5000000000000006E-3,"Ton/MWh"]
[null,"Carbon Price",30,"$/Ton"]
[null,null,null,null,null,null,"NPV",{"$f":"NPV_1","v":860541.31527332356}]
{"$rows_left_out":1004}