{"text_format":"1","workbook":"xlsx","n_sheets":8,"sheets":["Change Log","Index","Input|Rate of return","Calc|RfR","Calc|Rate of return","Output|Rate of return","Lookup|Tables","Check|List"],"not_rendered":{"charts":0,"images":1,"macros":0,"external_links":0,"defined_names":3221,"comments":0,"pivot_tables":0},"unopened":[],"bounds":{"document_bytes":16777216,"sheet_cells":100000,"rows_first":2000,"rows_last":500,"rows_between":2000,"halvings":0,"cell_chars":16384,"cell_head_chars":4096},"cells_cut":0,"cells_raw":0,"read":"whole","date_system":"1900"}

{"sheet":"Change Log","index":0,"n_rows":22,"n_cols":8,"rows_kept":22,"cut":false,"hidden":false,"merged":[]}
[null,"Rate of Return Model"]
[null,"Change Log"]
[]
[null,"Model change log"]
[]
[null,null,"Starting model name ---->","JGN - Att 7.13M - Rate of return model - 20240628 - Public.xlsb"]
[]
[null,null,"Model changes to above model"]
[]
[null,null,"Model sheet","Reference","Cell reference","Type","Legend","Comments"]
[]
[null,null,"Input|Rate of return",1,"Q12:R13, Q19:R20","Input",null,"Updated FY24 CPI for actuals and FY25 CPI to align with Nov 2024 RBA MPS"]
[null,null,"Input|Rate of return",{"$f":"D12+1","v":2},"S26","Input",null,"Updated forecast to align with Nov 2024 RBA MPS"]
[null,null,"Input|Rate of return",{"$f":"D13+1","v":3},"J52:J56","Input",null,"Placeholder cost of debt observations updated to reflect more recent observations"]
[null,null,"Input|Rate of return",{"$f":"+D14+1","v":4},"J83","Input",null,"For consistency, updated to match PTRM value from AER Draft Decision"]
[]
[]
[null,null,"Model sheet","Reference","Cell reference","Type","Legend","Comments"]
[]
[null,null,"Calc|RfR",{"$f":"+D15+1","v":5},"All highlighted cells","Input",null,"Updated risk-free rate inputs for more recent bond series and observations"]
{"$rows_left_out":3}
{"sheet":"Index","index":1,"n_rows":18,"n_cols":12,"rows_kept":18,"cut":false,"hidden":false,"merged":[[0,2,0,4],[1,2,1,4]]}
[null,null,"JGN - Rate of Return Model",null,null,null,null,null,null,null,"Overall Check:",{"$f":"'Check|List'!$V$1","v":"OK"}]
[null,null,"Index"]
[]
[]
[null,"Copyright Jemena Limited. All rights reserved. Jemena is not liable for any loss caused by reliance on this document."]
[]
[null,"Model Index"]
[]
[null,null,"Sheet Name","Sheet Description"]
[null,null,"Index","Model index with hyperlinks"]
[null,null,"Input|Rate of return","Data for forecast inflation and bond yield"]
[null,null,"Calc|RfR","Inputs and calculation for the placeholder risk free rate"]
[null,null,"Calc|Rate of return","Estimates the rate of return and forecast inflation expectation"]
[null,null,"Output|Rate of return","Summary of the rate of return and forecast inflation expectation"]
[null,null,"Lookup|Tables","Source for named ranges used for units, basis, etc"]
[null,null,"Check|List","Check for errors"]
[]
[null,"End"]

{"sheet":"Input|Rate of return","index":2,"n_rows":85,"n_cols":23,"rows_kept":85,"cut":false,"hidden":false,"merged":[[2,13,2,17],[0,2,0,4],[1,2,1,4],[2,8,2,12],[2,18,2,22]]}
[null,null,{"$f":"Index!$C$1","v":"JGN - Rate of Return Model"},null,null,"Back to Index",null,"Key:","Input (hard code)","External Link","Internal Link","Drop down Selection","Calculation","Unique calculation","Empty cell","JGN RP",null,"Section Check:",{"$f":"IF(COUNTA($A$8:$A$85)=COUNTIF($A$8:$A$85,\"OK\"),\"OK\",\"Check\")","v":"OK"},null,"Overall Check:",{"$f":"'Check|List'!$V$1","v":"OK"}]
[null,null,{"$f":"RIGHT(CELL(\"filename\",C1),LEN(CELL(\"filename\",C1))-FIND(\"]\",CELL(\"filename\",C1)))","v":"Input|Rate of return"}]
[null,null,null,null,null,null,null,null,"Prior",null,null,null,null,"Current Regulatory Period",null,null,null,null,"Next Regulatory Period"]
[null,null,null,"Source","Unit","Basis",null,{"$f":"+I4-1","v":2015},{"$f":"+J4-1","v":2016},{"$f":"+K4-1","v":2017},{"$f":"+L4-1","v":2018},{"$f":"+M4-1","v":2019},2020,{"$f":"+M4+1","v":2021},{"$f":"+N4+1","v":2022},2023,2024,2025,2026,2027,2028,2029,2030]
[]
[null,"Copyright Jemena Limited. All rights reserved. Jemena is not liable for any loss caused by reliance on this document."]
[]
[null,"Input | Inflation"]
[]
[null,null,"Opex Inflation (year to Jun, no lag)","Source","Unit","Basis",null,{"$f":"\"RY\"&RIGHT(H$4,2)","v":"RY15"},"RY16","RY17","RY18","RY19","RY20","RY21","RY22","RY23","RY24","RY25"]
[]
[null,null,"Actual inflation","ABS","Per cent","n/a",null,null,1.0232558139534831E-2,1.9337016574585641E-2,2.0776874435411097E-2,1.5929203539823078E-2,-3.4843205574912606E-3,3.8461538461538325E-2,6.1447811447811418E-2,6.0269627279936566E-2,3.8145100972326373E-2]
[null,null,"Forecast inflation","Placeholder","Per cent","n/a",null,null,null,null,null,null,null,null,null,null,null,2.5000000000000001E-2]
[]
[{"$f":"IF(SUM(M15:AB15)=0,\"Ok\",\"Check\")","v":"Ok"},null,"Check: Only one active input per period",null,null,null,null,null,{"$f":"+IF(OR(COUNTBLANK(I12:I13)=2,COUNTBLANK(I12:I13)=1),0,1)","v":0},0,0,0,0,0,0,0,0,0]
[]
[null,null,"Capex Inflation (year to Dec, no lag)","Source","Unit","Basis",null,{"$f":"\"RY\"&RIGHT(H$4,2)","v":"RY15"},"RY16","RY17","RY18","RY19","RY20","RY21","RY22","RY23","RY24","RY25"]
[]
[null,null,"Actual inflation","ABS","Per cent","n/a",null,1.7175572519083859E-2,1.6885553470919357E-2,1.4760147601476037E-2,1.9090909090909047E-2,1.7841213202497874E-2,1.8404907975460238E-2,8.6058519793459354E-3,3.4982935153583528E-2,7.8318219291014124E-2,4.0519877675840865E-2]
[null,null,"Forecast inflation (Jun end from RY26)","Placeholder","Per cent","n/a",null,null,null,null,null,null,null,null,null,null,null,2.5999999999999999E-2]
{"$rows_left_out":66}
{"sheet":"Calc|RfR","index":3,"n_rows":42,"n_cols":27,"rows_kept":42,"cut":false,"hidden":false,"merged":[[2,17,2,21],[2,22,2,26],[9,7,9,9],[9,10,9,12],[0,2,0,4],[1,2,1,4],[2,11,2,16]]}
[null,null,{"$f":"Index!$C$1","v":"JGN - Rate of Return Model"},null,null,"Back to Index",null,null,null,null,null,"Key:","Input (hard code)","External Link","Internal Link","Drop down Selection","Calculation","Unique calculation","Empty cell","JGN RP",null,"Section Check:",{"$f":"IF(COUNTA($A$8:$A$42)=COUNTIF($A$8:$A$42,\"OK\"),\"OK\",\"Check\")","v":"OK"},null,"Overall Check:",{"$f":"'Check|List'!$V$1","v":"OK"}]
[null,null,{"$f":"RIGHT(CELL(\"filename\",C1),LEN(CELL(\"filename\",C1))-FIND(\"]\",CELL(\"filename\",C1)))","v":"Calc|RfR"}]
[null,null,null,null,null,null,null,null,null,null,null,"Prior",null,null,null,null,null,"Current Regulatory Period",null,null,null,null,"Next Regulatory Period"]
[null,null,null,"Source","Unit","Basis",null,null,null,null,null,{"$f":"+M4-1","v":2015},{"$f":"+N4-1","v":2016},{"$f":"+O4-1","v":2017},{"$f":"+P4-1","v":2018},{"$f":"+Q4-1","v":2019},{"$f":"+'Input|Rate of return'!$M$4","v":2020},{"$f":"Q4+1","v":2021},{"$f":"R4+1","v":2022},2023,2024,2025,2026,2027,2028,2029,2030]
[]
[null,"Copyright Jemena Limited. All rights reserved. Jemena is not liable for any loss caused by reliance on this document."]
[]
[null,"Calc | Risk-free rate"]
[]
[null,null,null,null,null,null,null,"170 (RBA F16)",null,null,"168 (RBA F16)",null,null,null,null,"Interpolation"]
[null,null,"Yields on government bonds",{"$f":"+D$4","v":"Source"},{"$f":"+E$4","v":"Unit"},{"$f":"+F$4","v":"Basis"},null,"Date","Yield","Weight","Date","Yield","Weight",null,"Date","Yield","Annualised"]
[]
[null,null,"2024-11-01","RBA",{"$f":"+Percent","v":"Per cent"},{"$f":"+Nominal","v":"Nominal"},null,"2034-06-21",4.5159999999999999E-2,{"$f":"+_xlfn.LET(\n_xlpm.futureday,O13,\n_xlpm.maturitydate_1,H13,\n_xlpm.maturitydate_2,K13,\nIF(_xlpm.futureday>=_xlpm.maturitydate_2,0,1-(_xlpm.futureday-_xlpm.maturitydate_1)/(_xlpm.maturitydate_2-_xlpm.maturitydate_1)))","v":0.27322404371584696},"2034-12-21",4.5370000000000001E-2,{"$f":"1-J13","v":0.72677595628415304},null,{"$f":"+DATE(YEAR(C13)+10,MONTH(C13),DAY(C13))","v":"2034-11-01"},{"$f":"+I13*J13+L13*M13","v":4.531262295081967E-2},{"$f":"+(1+P13/2)^2-1","v":4.5825931400490738E-2}]
[null,null,"2024-11-04","RBA","Per cent","Nominal",null,{"$f":"+H13","v":"2034-06-21"},4.5359999999999998E-2,0.25683060109289613,{"$f":"+K13","v":"2034-12-21"},4.5570000000000006E-2,0.74316939890710387,null,"2034-11-04",4.5516065573770491E-2,4.6033993630099523E-2]
[null,null,"2024-11-05","RBA","Per cent","Nominal",null,{"$f":"+H14","v":"2034-06-21"},4.5410000000000006E-2,0.25136612021857918,{"$f":"+K14","v":"2034-12-21"},4.5609999999999998E-2,0.74863387978142082,null,"2034-11-05",4.5559726775956287E-2,4.6078648951931145E-2]
[null,null,"2024-11-06","RBA","Per cent","Nominal",null,"2034-06-21",4.6029999999999995E-2,0.24590163934426235,"2034-12-21",4.6260000000000003E-2,0.75409836065573765,null,"2034-11-06",4.6203442622950827E-2,4.6737132150504124E-2]
[null,null,"2024-11-07","RBA","Per cent","Nominal",null,"2034-06-21",4.6130000000000004E-2,0.2404371584699454,"2034-12-21",4.6349999999999995E-2,0.7595628415300546,null,"2034-11-07",4.6297103825136611E-2,4.6832959280785458E-2]
[null,null,"2024-11-08","RBA","Per cent","Nominal",null,"2034-06-21",4.5530000000000001E-2,0.23497267759562845,"2034-12-21",4.5759999999999995E-2,0.76502732240437155,null,"2034-11-08",4.5705956284152999E-2,4.6228214894115327E-2]
[null,null,"2024-11-11","RBA","Per cent","Nominal",null,"2034-06-21",4.5540000000000004E-2,0.21857923497267762,"2034-12-21",4.5759999999999995E-2,0.78142076502732238,null,"2034-11-11",4.5711912568306007E-2,4.6234307305969224E-2]
[null,null,"2024-11-12","RBA","Per cent","Nominal",null,"2034-06-21",4.5400000000000003E-2,0.21311475409836067,"2034-12-21",4.5609999999999998E-2,0.78688524590163933,null,"2034-11-12",4.5565245901639344E-2,4.6084293810158661E-2]
{"$rows_left_out":23}
{"sheet":"Calc|Rate of return","index":4,"n_rows":40,"n_cols":28,"rows_kept":40,"cut":false,"hidden":false,"merged":[[2,11,2,16],[0,2,0,4],[1,2,1,4],[2,17,2,21],[2,22,2,26]]}
[null,null,{"$f":"Index!$C$1","v":"JGN - Rate of Return Model"},null,null,"Back to Index",null,null,null,null,null,"Key:","Input (hard code)","External Link","Internal Link","Drop down Selection","Calculation","Unique calculation","Empty cell",null,null,"Section Check:",{"$f":"IF(COUNTA($A$8:$A$40)=COUNTIF($A$8:$A$40,\"OK\"),\"OK\",\"Check\")","v":"OK"},null,"Overall Check:",{"$f":"'Check|List'!$V$1","v":"OK"}]
[null,null,{"$f":"RIGHT(CELL(\"filename\",C1),LEN(CELL(\"filename\",C1))-FIND(\"]\",CELL(\"filename\",C1)))","v":"Calc|Rate of return"}]
[null,null,null,null,null,null,null,null,null,null,null,"Prior",null,null,null,null,null,"Current Regulatory Period",null,null,null,null,"Next Regulatory Period"]
[null,null,null,"Source","Unit","Basis",null,null,null,null,null,{"$f":"+M4-1","v":2015},{"$f":"+N4-1","v":2016},{"$f":"+O4-1","v":2017},{"$f":"+P4-1","v":2018},{"$f":"+Q4-1","v":2019},{"$f":"+'Input|Rate of return'!$M$4","v":2020},{"$f":"Q4+1","v":2021},{"$f":"R4+1","v":2022},2023,2024,2025,2026,2027,2028,2029,2030]
[]
[null,"Copyright Jemena Limited. All rights reserved. Jemena is not liable for any loss caused by reliance on this document."]
[]
[null,"Calc | Forecast Inflation"]
[]
[null,null,"Inflation",{"$f":"+D$4","v":"Source"},{"$f":"+E$4","v":"Unit"},{"$f":"+F$4","v":"Basis"},null,null,null,null,null,{"$f":"+\"FY\"&RIGHT(L$4,2)","v":"FY15"},"FY16","FY17","FY18","FY19","FY20","FY21","FY22","FY23","FY24","FY25","FY26","FY27","FY28","FY29","FY30"]
[]
[null,null,"Expected inflation - Glide Path","Input|Rate of Return","Per cent","n/a",null,null,null,null,null,null,null,null,null,null,null,null,null,null,null,null,{"$f":"PRODUCT(1+'Input|Rate of return'!S26:W26)^(1/COUNT('Input|Rate of return'!S26:W26))-1","v":2.7997811278454687E-2},{"$f":"+W12","v":2.7997811278454687E-2},{"$f":"+X12","v":2.7997811278454687E-2},{"$f":"+Y12","v":2.7997811278454687E-2},{"$f":"+Z12","v":2.7997811278454687E-2}]
[null,null,"Inflation (Capex)","Input|Rate of Return","Per cent","n/a",null,null,null,null,null,{"$f":"+'Input|Rate of return'!H19","v":1.7175572519083859E-2},{"$f":"+'Input|Rate of return'!I19","v":1.6885553470919357E-2},{"$f":"+'Input|Rate of return'!J19","v":1.4760147601476037E-2},{"$f":"+'Input|Rate of return'!K19","v":1.9090909090909047E-2},{"$f":"+'Input|Rate of return'!L19","v":1.7841213202497874E-2},{"$f":"+'Input|Rate of return'!M19","v":1.8404907975460238E-2},{"$f":"+'Input|Rate of return'!N19","v":8.6058519793459354E-3},{"$f":"+'Input|Rate of return'!O19","v":3.4982935153583528E-2},{"$f":"+'Input|Rate of return'!P19","v":7.8318219291014124E-2},4.0519877675840865E-2,2.5999999999999999E-2,{"$f":"+W12","v":2.7997811278454687E-2},{"$f":"+X12","v":2.7997811278454687E-2},{"$f":"+Y12","v":2.7997811278454687E-2},{"$f":"+Z12","v":2.7997811278454687E-2},{"$f":"+AA12","v":2.7997811278454687E-2}]
[null,null,"Inflation (Opex)","Input|Rate of Return","Per cent","n/a",null,null,null,null,null,null,{"$f":"+SUM('Input|Rate of return'!I12:I13)","v":1.0232558139534831E-2},{"$f":"+SUM('Input|Rate of return'!J12:J13)","v":1.9337016574585641E-2},{"$f":"+SUM('Input|Rate of return'!K12:K13)","v":2.0776874435411097E-2},{"$f":"+SUM('Input|Rate of return'!L12:L13)","v":1.5929203539823078E-2},{"$f":"+SUM('Input|Rate of return'!M12:M13)","v":-3.4843205574912606E-3},{"$f":"+SUM('Input|Rate of return'!N12:N13)","v":3.8461538461538325E-2},{"$f":"+SUM('Input|Rate of return'!O12:O13)","v":6.1447811447811418E-2},{"$f":"+SUM('Input|Rate of return'!P12:P13)","v":6.0269627279936566E-2},3.8145100972326373E-2,2.5000000000000001E-2,{"$f":"+W$13","v":2.7997811278454687E-2},{"$f":"+X$13","v":2.7997811278454687E-2},{"$f":"+Y$13","v":2.7997811278454687E-2},{"$f":"+Z$13","v":2.7997811278454687E-2},{"$f":"+AA$13","v":2.7997811278454687E-2}]
[]
[null,"Calc | Return on debt"]
[]
[null,null,"Estimates","Source","Unit","Basis",null,null,null,null,null,null,{"$f":"M$4","v":2016},2017,2018,2019,2020,2021,2022,2023,2024,2025,2026,2027,2028,2029,2030]
[]
[null,null,"Observations"]
{"$rows_left_out":21}
{"sheet":"Output|Rate of return","index":5,"n_rows":43,"n_cols":25,"rows_kept":43,"cut":false,"hidden":false,"merged":[[0,2,0,4],[1,2,1,4],[2,20,2,24],[2,15,2,19],[2,9,2,14]]}
[null,null,{"$f":"Index!$C$1","v":"JGN - Rate of Return Model"},null,null,"Back to Index",null,null,null,"Key:","Input (hard code)","External Link","Internal Link","Drop down Selection","Calculation","Unique calculation","Empty cell",null,"Section Check:",{"$f":"IF(COUNTA($A$8:$A$43)=COUNTIF($A$8:$A$43,\"OK\"),\"OK\",\"Check\")","v":"OK"},null,"Overall Check:",{"$f":"'Check|List'!$V$1","v":"OK"}]
[null,null,{"$f":"RIGHT(CELL(\"filename\",C1),LEN(CELL(\"filename\",C1))-FIND(\"]\",CELL(\"filename\",C1)))","v":"Output|Rate of return"}]
[null,null,null,null,null,null,null,null,null,"Prior Regulatory Period",null,null,null,null,null,"Current Regulatory Period",null,null,null,null,"Next Regulatory Period"]
[null,null,null,"Source","Unit","Basis",null,null,null,{"$f":"+K4-1","v":2015},{"$f":"+L4-1","v":2016},{"$f":"+M4-1","v":2017},{"$f":"+N4-1","v":2018},{"$f":"+O4-1","v":2019},{"$f":"+'Input|Rate of return'!$M$4","v":2020},{"$f":"O4+1","v":2021},2022,2023,2024,2025,2026,2027,2028,2029,2030]
[]
[null,"Copyright Jemena Limited. All rights reserved. Jemena is not liable for any loss caused by reliance on this document."]
[]
[null,"Outputs | PTRM inputs"]
[]
[null,null,"Rate of return","Source","Unit","Basis",null,null,null,{"$f":"\"RY\"&RIGHT(J$4,2)","v":"RY15"},"RY16","RY17","RY18","RY19","RY20","RY21","RY22","RY23","RY24","RY25",{"$f":"\"RY\"&RIGHT(U$4,2)","v":"RY26"},{"$f":"\"RY\"&RIGHT(V$4,2)","v":"RY27"},{"$f":"\"RY\"&RIGHT(W$4,2)","v":"RY28"},{"$f":"\"RY\"&RIGHT(X$4,2)","v":"RY29"},{"$f":"\"RY\"&RIGHT(Y$4,2)","v":"RY30"}]
[]
[{"$f":"IF(ISERROR(U12),\"Check\",\"Ok\")","v":"Ok"},null,"Return on equity (post-tax)","Calc|Rate of return","Per cent","Nominal",null,null,null,null,null,null,null,null,null,null,null,null,null,null,{"$f":"Cost_of_Equity","v":8.2835167097263213E-2},{"$f":"Cost_of_Equity","v":8.2835167097263213E-2},{"$f":"Cost_of_Equity","v":8.2835167097263213E-2},{"$f":"Cost_of_Equity","v":8.2835167097263213E-2},{"$f":"Cost_of_Equity","v":8.2835167097263213E-2}]
[{"$f":"IF(ISERROR(U13),\"Check\",\"Ok\")","v":"Ok"},null,"Gamma","Input|Rate of return","Per cent","Nominal",null,null,null,null,null,null,null,null,null,null,null,null,null,null,{"$f":"Gamma","v":0.56999999999999995},{"$f":"Gamma","v":0.56999999999999995},{"$f":"Gamma","v":0.56999999999999995},{"$f":"Gamma","v":0.56999999999999995},{"$f":"Gamma","v":0.56999999999999995}]
[{"$f":"IF(ISERROR(U14),\"Check\",\"Ok\")","v":"Ok"},null,"Leverage","Input|Rate of return","Per cent","Nominal",null,null,null,null,null,null,null,null,null,null,null,null,null,null,{"$f":"Leverage","v":0.6},{"$f":"Leverage","v":0.6},{"$f":"Leverage","v":0.6},{"$f":"Leverage","v":0.6},{"$f":"Leverage","v":0.6}]
[{"$f":"IF(ISERROR(U15),\"Check\",\"Ok\")","v":"Ok"},null,"Tax rate","Input|Rate of return","Per cent","Nominal",null,null,null,null,null,null,null,null,null,null,null,null,null,null,{"$f":"Tax","v":0.3},{"$f":"Tax","v":0.3},{"$f":"Tax","v":0.3},{"$f":"Tax","v":0.3},{"$f":"Tax","v":0.3}]
[{"$f":"IF(ISERROR(U16),\"Check\",\"Ok\")","v":"Ok"},null,"Return on debt (pre-tax)","Calc|Rate of return","Per cent","Nominal",null,null,null,null,null,null,null,null,null,null,null,null,null,null,{"$f":"+_xlfn.XLOOKUP(RIGHT(U$10,2),RIGHT('Calc|Rate of return'!$M$18:$AA$18,2),'Calc|Rate of return'!$M$28:$AA$28)","v":4.6262928900712055E-2},{"$f":"+_xlfn.XLOOKUP(RIGHT(V$10,2),RIGHT('Calc|Rate of return'!$M$18:$AA$18,2),'Calc|Rate of return'!$M$28:$AA$28)","v":4.6089396836998461E-2},{"$f":"+_xlfn.XLOOKUP(RIGHT(W$10,2),RIGHT('Calc|Rate of return'!$M$18:$AA$18,2),'Calc|Rate of return'!$M$28:$AA$28)","v":4.6269800909531963E-2},{"$f":"+_xlfn.XLOOKUP(RIGHT(X$10,2),RIGHT('Calc|Rate of return'!$M$18:$AA$18,2),'Calc|Rate of return'!$M$28:$AA$28)","v":4.6945514937697386E-2},{"$f":"+_xlfn.XLOOKUP(RIGHT(Y$10,2),RIGHT('Calc|Rate of return'!$M$18:$AA$18,2),'Calc|Rate of return'!$M$28:$AA$28)","v":4.767452667274491E-2}]
[]
[null,null,"Nominal vanilla WACC",null,null,null,null,null,null,null,null,null,null,null,null,null,null,null,null,null,{"$f":"U12*(1-U14)+U16*U14","v":6.0891824179332518E-2},{"$f":"V12*(1-V14)+V16*V14","v":6.0787704941104366E-2},{"$f":"W12*(1-W14)+W16*W14","v":6.0895947384624463E-2},{"$f":"X12*(1-X14)+X16*X14","v":6.1301375801523721E-2},{"$f":"Y12*(1-Y14)+Y16*Y14","v":6.1738782842552235E-2}]
[]
[null,null,"Debt and equity raising costs","Source","Unit","Basis",null,null,null,null,null,null,null,null,null,null,null,null,null,null,"Estimates"]
{"$rows_left_out":24}
{"sheet":"Lookup|Tables","index":6,"n_rows":84,"n_cols":22,"rows_kept":84,"cut":false,"hidden":false,"merged":[[0,2,0,6],[1,2,1,4]]}
[null,null,{"$f":"Index!$C$1","v":"JGN - Rate of Return Model"},null,null,null,null,null,null,"Back to Index",null,"Key:","Input","External Link","Internal Link",null,null,null,null,null,"Overall Check:",{"$f":"+'Check|List'!V1","v":"OK"}]
[null,null,{"$f":"RIGHT(CELL(\"filename\",C1),LEN(CELL(\"filename\",C1))-FIND(\"]\",CELL(\"filename\",C1)))","v":"Lookup|Tables"}]
[]
[]
[null,"Copyright Jemena Limited. All rights reserved. Jemena is not liable for any loss caused by reliance on this document."]
[]
[null,"Lookup table"]
[]
[null,null,"Financial Unit Denomination","Source",null,null,"Ref"]
[null,null,"Dollars","JGN",null,null,"$dollars"]
[null,null,"Thousands","JGN",null,null,"$000"]
[null,null,"Millions","JGN",null,null,"$millions"]
[]
[null,null,"Non-financial Unit Denomination"]
[null,null,"Percent","JGN",null,null,"Per cent"]
[null,null,"Unit","JGN",null,null,"unit"]
[null,null,"Number","JGN",null,null,"number"]
[null,null,"Factor","JGN",null,null,"factor"]
[null,null,"Mains","JGN",null,null,"mains"]
[null,null,"Kilometres","JGN",null,null,"kms"]
{"$rows_left_out":65}
{"sheet":"Check|List","index":7,"n_rows":15,"n_cols":22,"rows_kept":15,"cut":false,"hidden":false,"merged":[[0,2,0,6],[1,2,1,4]]}
[null,null,{"$f":"Index!$C$1","v":"JGN - Rate of Return Model"},null,null,null,null,null,null,"Back to Index",null,"Key:","Input","External Link","Internal Link",null,null,null,null,null,"Overall Check:",{"$f":"IF(COUNTA($G$10:$G$13)=COUNTIF($G$10:$G$13,\"OK\"),\"OK\",\"Check\")","v":"OK"}]
[null,null,{"$f":"RIGHT(CELL(\"filename\",C1),LEN(CELL(\"filename\",C1))-FIND(\"]\",CELL(\"filename\",C1)))","v":"Check|List"}]
[]
[]
[null,"Copyright Jemena Limited. All rights reserved. Jemena is not liable for any loss caused by reliance on this document."]
[]
[null,"Check List"]
[]
[null,null,"Sheet",null,null,null,"Status"]
[null,null,"Input | Rate of return",null,null,null,{"$f":"'Input|Rate of return'!$S$1","v":"OK"}]
[null,null,"Calc | Placeholder RfR",null,null,null,{"$f":"+'Calc|Rate of return'!W1","v":"OK"}]
[null,null,"Calc | Rate of return",null,null,null,{"$f":"'Calc|Rate of return'!W1","v":"OK"}]
[null,null,"Output | Rate of return",null,null,null,{"$f":"'Output|Rate of return'!T1","v":"OK"}]
[]
[null,"End"]