{"text_format":"1","workbook":"xlsx","n_sheets":13,"sheets":["ASD changes","Title Page","Inputs | General","Price Cap >","Inputs | Price Cap","Calc | Price Cap","Output | Price Caps","Exit Fees >","Input | Exit Fees","Calc | Exit Fees","Output | Exit Fee price caps","LUTs and Dropdowns","Reg Depreciation Calc"],"not_rendered":{"charts":0,"images":1,"macros":1,"external_links":2,"defined_names":22,"comments":1,"pivot_tables":0},"unopened":[],"bounds":{"document_bytes":16777216,"sheet_cells":100000,"rows_first":2000,"rows_last":500,"rows_between":2000,"halvings":0,"cell_chars":16384,"cell_head_chars":4096},"cells_cut":0,"cells_raw":0,"read":"whole","date_system":"1900"}

{"sheet":"ASD changes","index":0,"n_rows":10,"n_cols":3,"rows_kept":10,"cut":false,"hidden":false,"merged":[]}
[]
["Issues","Location","Comment"]
[]
[]
[null,"ASD Initial Proposal (2026-31)"]
[1,"Reg Depreciation Calc' worksheet","Added worksheet to calculate regualtory depreciation amounts that are used in worksheet 'Input | Exit Fees' table 3. Linked Input - RAB"]
[]
[2,"Output | Exit Fee price caps!'H24:M24","Modified hardcoded values for regulatory years by linking the cells to an existing source from 'Inputs | General' worksheet and extrapolating forward using the appropriate formula ."]
[]
[3,"Output | Exit Fee price caps!'H61:M64","Modified hardcoded values for regulatory years by linking the cells to an existing source from 'Inputs | General' worksheet and extrapolating forward using the appropriate formula ."]
{"$rows_left_out":1}
{"sheet":"Title Page","index":1,"n_rows":24,"n_cols":8,"rows_kept":24,"cut":false,"hidden":false,"merged":[[13,1,13,23],[7,1,8,23],[27,4,27,7],[19,1,19,23],[22,4,22,7],[25,4,25,7],[26,4,26,7],[23,4,23,7]]}
[]
[]
[]
[]
[]
[]
[]
[null,"Preliminary Standardised Metering Pricing Model "]
[]
[null,"Version",1]
{"$rows_left_out":15}
{"sheet":"Inputs | General","index":2,"n_rows":27,"n_cols":23,"rows_kept":27,"cut":false,"hidden":false,"merged":[[4,1,4,6],[1,10,1,11],[1,12,1,13],[20,1,20,6],[23,7,23,11]]}
[null,{"$f":"'Title Page'!B8&\" v\"&'Title Page'!$C$10","v":"Preliminary Standardised Metering Pricing Model  v1"},null,null,null,null,null,null,null,null,null,null,null,null,null,null,null,null,null,null,null,"Worksheet check:",{"$f":"IF(COUNTA($X$14:$X$46)=COUNTIF($X14:$X47,\"OK\"),\"OK\",\"Check\")","v":"OK"}]
[null,{"$f":"MID(CELL(\"filename\",A1),FIND(\"]\",CELL(\"filename\",A1))+1,255)","v":"Inputs | General"},null,null,null,null,null,null,"Key:","Input","External Link",null,"Internal Link"]
[]
[]
[null,"1. Inputs - General"]
[]
[null,null,"Inputs","Source","Input Format",null,"Value"]
[null,null,"NSP name","NSP",null,null,"AusNet"]
[null,null,"Decision stage","NSP",null,null,"draft"]
[]
{"$rows_left_out":18}
{"sheet":"Price Cap >","index":3,"n_rows":0,"n_cols":0,"rows_kept":0,"cut":false,"hidden":true,"merged":[]}

{"sheet":"Inputs | Price Cap","index":4,"n_rows":125,"n_cols":22,"rows_kept":125,"cut":false,"hidden":true,"merged":[[94,1,94,7],[1,10,1,11],[40,9,40,13],[38,1,38,7],[6,7,6,11],[4,1,4,6],[14,1,14,6],[4,9,4,11],[14,9,14,11]]}
[null,{"$f":"'Title Page'!B8&\" v\"&'Title Page'!$C$10","v":"Preliminary Standardised Metering Pricing Model  v1"},null,null,null,null,null,null,null,null,null,null,null,"DNSP:",{"$f":"IF('Inputs | General'!$G$16=\"Exit Fees (Vic)\",\"NOT USED\",NSP)","v":"NOT USED"},null,null,null,null,null,"Worksheet check:",{"$f":"IF(COUNTA($W$4:$W$71)=COUNTIF($W4:$W72,\"OK\"),\"OK\",\"Check\")","v":"OK"}]
[null,{"$f":"MID(CELL(\"filename\",A1),FIND(\"]\",CELL(\"filename\",A1))+1,255)","v":"Inputs | Price Cap"},null,null,null,null,null,"Key:","Input","External Link","Internal Link"]
[]
[]
[null,{"$f":"LEFT('Inputs | General'!B21,1)+1&\". Linked Input -  Inflation & Discount Rates\"","v":"3. Linked Input -  Inflation & Discount Rates"},null,null,null,null,null,null,null,{"$f":"IF('Inputs | General'!$G$16=\"Exit Fees (Vic)\",\"NOT USED\",\"\")","v":"NOT USED"}]
[]
[null,"Linked Inputs - Discount Rates",null,null,null,null,"Base year","Regulatory period"]
[null,null,"Year",null,"Units",null,{"$f":"LEFT(H8,4)-1&\"-\"&RIGHT(H8,2)-1","v":"2025-26"},{"$f":"FPFirstYear","v":"2026-27"},{"$f":"LEFT(H8,4)+1&\"-\"&RIGHT(H8,2)+1","v":"2027-28"},{"$f":"LEFT(I8,4)+1&\"-\"&RIGHT(I8,2)+1","v":"2028-29"},"2029-30","2030-31",null,"Link from PTRM"]
[null,null,"Nominal Vanilla WACC",null,"%",null,null,{"$f":"[1]WACC!G18","v":6.0360530205153029E-2},{"$f":"[1]WACC!H18","v":6.1278003802165776E-2},{"$f":"[1]WACC!I18","v":6.2358025086078517E-2},{"$f":"[1]WACC!J18","v":6.3761644774099915E-2},{"$f":"[1]WACC!K18","v":6.5777620209021309E-2}]
[null,null,"Cumulative Discount Index",null,"Index",null,1,{"$f":"G10*(1+H9)","v":1.0603605302051531},{"$f":"H10*(1+I9)","v":1.1253373068067312},{"$f":"I10*(1+J9)","v":1.1955111188148853},{"$f":"J10*(1+K9)","v":1.2717388740962468},{"$f":"K10*(1+L9)","v":1.3553908307615978}]
{"$rows_left_out":116}
{"sheet":"Calc | Price Cap","index":5,"n_rows":63,"n_cols":14,"rows_kept":63,"cut":false,"hidden":true,"merged":[[7,9,7,13],[4,1,4,7],[1,10,1,11],[0,13,0,14]]}
[null,{"$f":"'Title Page'!B8&\" v\"&'Title Page'!$C$10","v":"Preliminary Standardised Metering Pricing Model  v1"},null,null,null,null,null,null,null,null,null,null,"DNSP:",{"$f":"IF('Inputs | General'!$G$16=\"Exit Fees (Vic)\",\"NOT USED\",NSP)","v":"NOT USED"}]
[null,{"$f":"MID(CELL(\"filename\",A1),FIND(\"]\",CELL(\"filename\",A1))+1,255)","v":"Calc | Price Cap"},null,null,null,null,null,"Key:","Input","External Link","Internal Link"]
[]
[]
[null,"Annual Charges Calculations"]
[]
[null,"Annual Smoothed Revenue Calculation"]
[null,null,null,null,null,null,null,null,"Base Year Revenue","Annual Revenue"]
["▼ Table Filters",null,"Tariff #","Tariff name","Application","Tariff Code","Other designation",null,{"$f":"LEFT(J9,4)-1&\"-\"&RIGHT(J9,2)-1","v":"2025-26"},{"$f":"FPFirstYear","v":"2026-27"},{"$f":"LEFT(J9,4)+1&\"-\"&RIGHT(J9,2)+1","v":"2027-28"},{"$f":"LEFT(K9,4)+1&\"-\"&RIGHT(K9,2)+1","v":"2028-29"},"2029-30","2030-31"]
[null,null,"Tariff #","Tariff name","Application","Tariff Code","Other designation","Column1","F-RP-1","F-RP0","F-RP+1","F-RP+2","F-RP+3","F-RP+4"]
{"$rows_left_out":54}
{"sheet":"Output | Price Caps","index":6,"n_rows":70,"n_cols":22,"rows_kept":70,"cut":false,"hidden":true,"merged":[[56,3,57,3],[65,9,65,13],[5,9,5,13],[1,10,1,11],[0,14,0,15]]}
[null,null,{"$f":"'Title Page'!B8&\" v\"&'Title Page'!$C$10","v":"Preliminary Standardised Metering Pricing Model  v1"},null,null,null,null,null,null,null,null,null,null,"DNSP:",{"$f":"IF('Inputs | General'!$G$16=\"Exit Fees (Vic)\",\"NOT USED\",NSP)","v":"NOT USED"},null,null,null,null,null,"Worksheet check:",{"$f":"IF(COUNTA($W$5:$W$52)=COUNTIF($W5:$W53,\"OK\"),\"OK\",\"Check\")","v":"OK"}]
[null,null,{"$f":"MID(CELL(\"filename\",A1),FIND(\"]\",CELL(\"filename\",A1))+1,255)","v":"Output | Price Caps"},null,null,null,null,"Key:","Input","External Link","Internal Link"]
[]
[]
[null,"RESULT - Price Cap - Annual Charges"]
[null,null,null,null,null,null,null,null,"Base Year Charges","Price Cap - Annual Charges (nominal)"]
["▼ Table Filters",null,"Tariff #","Tariff name","Application","Tariff Code","Other designation",null,{"$f":"LEFT(J7,4)-1&\"-\"&RIGHT(J7,2)-1","v":"2025-26"},{"$f":"FPFirstYear","v":"2026-27"},{"$f":"LEFT(J7,4)+1&\"-\"&RIGHT(J7,2)+1","v":"2027-28"},{"$f":"LEFT(K7,4)+1&\"-\"&RIGHT(K7,2)+1","v":"2028-29"},"2029-30","2030-31"]
[null,null,"Tariff #","Tariff name","Application","Tariff Code","Other designation","Ca","F-RP-1","F-RP0","F-RP+1","F-RP+2","F-RP+3","F-RP+4","Column1"]
[null,null,1,{"$f":"'Inputs | Price Cap'!D44","v":"Residential Non ToU"},"Non-capital",{"$f":"'Inputs | Price Cap'!F44","v":"R1"},{"$f":"'Inputs | Price Cap'!G44","v":"Primary"},null,{"$f":"ROUND('Inputs | Price Cap'!H44,2)","v":10},{"$f":"ROUND('Output | Price Caps'!I9*(1-'Inputs | Price Cap'!F$109)*(1+'Inputs | General'!H$26),2)","v":13.05},{"$f":"ROUND('Output | Price Caps'!J9*(1-'Inputs | Price Cap'!G$109)*(1+'Inputs | General'!I$26),2)","v":13.51},{"$f":"ROUND('Output | Price Caps'!K9*(1-'Inputs | Price Cap'!H$109)*(1+'Inputs | General'!J$26),2)","v":13.99},{"$f":"ROUND('Output | Price Caps'!L9*(1-'Inputs | Price Cap'!I$109)*(1+'Inputs | General'!K$26),2)","v":14.48},{"$f":"ROUND('Output | Price Caps'!M9*(1-'Inputs | Price Cap'!J$109)*(1+'Inputs | General'!L$26),2)","v":14.99}]
[null,null,1,{"$f":"'Inputs | Price Cap'!D45","v":"Residential Non ToU"},"Capital",{"$f":"'Inputs | Price Cap'!F45","v":"R1"},{"$f":"'Inputs | Price Cap'!G45","v":"Primary"},null,{"$f":"ROUND('Inputs | Price Cap'!H45,2)","v":20},{"$f":"ROUND('Output | Price Caps'!I10*(1-'Inputs | Price Cap'!F$125)*(1+'Inputs | General'!H$26),2)","v":17.93},{"$f":"ROUND('Output | Price Caps'!J10*(1-'Inputs | Price Cap'!G$125)*(1+'Inputs | General'!I$26),2)","v":17.829999999999998},{"$f":"ROUND('Output | Price Caps'!K10*(1-'Inputs | Price Cap'!H$125)*(1+'Inputs | General'!J$26),2)","v":17.73},{"$f":"ROUND('Output | Price Caps'!L10*(1-'Inputs | Price Cap'!I$125)*(1+'Inputs | General'!K$26),2)","v":17.63},{"$f":"ROUND('Output | Price Caps'!M10*(1-'Inputs | Price Cap'!J$125)*(1+'Inputs | General'!L$26),2)","v":17.53}]
{"$rows_left_out":61}
{"sheet":"Exit Fees >","index":7,"n_rows":0,"n_cols":0,"rows_kept":0,"cut":false,"hidden":false,"merged":[]}

{"sheet":"Input | Exit Fees","index":8,"n_rows":119,"n_cols":17,"rows_kept":119,"cut":false,"hidden":false,"merged":[[117,3,117,5],[66,9,66,14],[50,3,50,5],[51,3,51,5],[97,3,97,5],[98,3,98,5],[99,3,99,5],[100,3,100,5],[101,3,101,5],[102,3,102,5],[103,3,103,5],[104,3,104,5],[111,3,111,5],[112,3,112,5],[113,3,113,5],[114,3,114,5],[95,3,95,5],[96,3,96,5],[49,3,49,5],[116,3,116,5],[115,3,115,5],[107,3,107,5],[108,3,108,5],[109,3,109,5],[110,3,110,5],[86,1,86,7],[41,1,41,7],[6,7,6,11],[4,9,4,11],[21,1,21,3],[94,3,94,5],[0,13,0,14],[62,3,62,5],[52,3,52,5],[53,3,53,5],[54,3,54,5],[55,3,55,5],[56,3,56,5],[57,3,57,5],[58,3,58,5],[59,3,59,5],[60,3,60,5],[61,3,61,5],[47,3,47,5],[48,3,48,5],[4,1,4,6],[24,1,24,7]]}
[null,{"$f":"'Title Page'!B8&\" v\"&'Title Page'!$C$10","v":"Preliminary Standardised Metering Pricing Model  v1"},null,null,null,null,null,null,null,null,null,null,"DNSP:",{"$f":"IF('Inputs | General'!$G$16=\"Price Cap\",\"NOT USED\",NSP)","v":"AusNet"}]
[null,{"$f":"MID(CELL(\"filename\",A1),FIND(\"]\",CELL(\"filename\",A1))+1,255)","v":"Input | Exit Fees"},null,null,null,null,null,"Key:","Input","External Link","Internal Link"]
[]
[]
[null,{"$f":"LEFT('Inputs | General'!B21,1)+1&\". Linked Input - RAB\"","v":"3. Linked Input - RAB"},null,null,null,null,null,null,null,{"$f":"IF('Inputs | General'!$G$16=\"Price Cap\",\"NOT USED\",\"\")","v":""}]
[]
[null,"Linked Input - RAB Meters",null,null,null,null,"Base Year","Regulatory Period"]
[null,null,null,null,"Units",null,{"$f":"LEFT(H8,4)-1&\"-\"&RIGHT(H8,2)-1","v":"2025-26"},{"$f":"FPFirstYear","v":"2026-27"},{"$f":"LEFT(H8,4)+1&\"-\"&RIGHT(H8,2)+1","v":"2027-28"},{"$f":"LEFT(I8,4)+1&\"-\"&RIGHT(I8,2)+1","v":"2028-29"},{"$f":"LEFT(J8,4)+1&\"-\"&RIGHT(J8,2)+1","v":"2029-30"},{"$f":"LEFT(K8,4)+1&\"-\"&RIGHT(K8,2)+1","v":"2030-31"}]
[null,null,"Opening RAB",null,"$m",null,{"$f":"[1]!A1value","v":75.224861419544013},{"$f":"G9+G10-G11","v":75.224861419544013},{"$f":"H9+H10-H11","v":53.076089609987768},{"$f":"I9+I10-I11","v":58.346186625833475},{"$f":"J9+J10-J11","v":85.848696692315869},{"$f":"K9+K10-K11","v":131.6115181098821},null,"Opening balance of METERS row in PTRM inputs sheet of PTRM"]
[null,null,"Gross capital expenditure",null,"$m",null,null,{"$f":"[1]Assets!G62","v":11.777922702882458},{"$f":"[1]Assets!H62","v":12.775457517050814},{"$f":"[1]Assets!I62","v":32.908723524532867},{"$f":"[1]Assets!J62","v":52.981459917715249},{"$f":"[1]Assets!K62","v":57.746031867109167},null,"Gross capex from METERS row in ASSETS sheet of PTRM"]
{"$rows_left_out":110}
{"sheet":"Calc | Exit Fees","index":9,"n_rows":160,"n_cols":15,"rows_kept":160,"cut":false,"hidden":false,"merged":[[98,6,98,10],[95,1,95,7],[0,13,0,14],[4,1,4,7],[54,10,54,14],[97,6,97,10],[69,10,69,14],[38,10,38,14],[86,10,86,14],[82,1,82,7],[8,10,8,14],[23,10,23,14]]}
[null,{"$f":"'Title Page'!B8&\" v\"&'Title Page'!$C$10","v":"Preliminary Standardised Metering Pricing Model  v1"},null,null,null,null,null,null,null,null,null,null,"DNSP:",{"$f":"IF('Inputs | General'!$G$16=\"Price Cap\",\"NOT USED\",NSP)","v":"AusNet"}]
[null,{"$f":"MID(CELL(\"filename\",A1),FIND(\"]\",CELL(\"filename\",A1))+1,255)","v":"Calc | Exit Fees"},null,null,null,null,null,"Key:","Input","External Link","Internal Link"]
[]
[]
[null,"CALCULATION | Meters"]
[]
[null,"Calculation of Allocated Meters RAB by Designated Exit Fee"]
[]
[null,null,null,null,"Volume of meters",null,null,null,null,"Base Year","Regulatory period"]
[null,null,null,null,null,"Exit Fee","Units",null,null,{"$f":"LEFT(K10,4)-1&\"-\"&RIGHT(K10,2)-1","v":"2025-26"},{"$f":"FPFirstYear","v":"2026-27"},{"$f":"LEFT(K10,4)+1&\"-\"&RIGHT(K10,2)+1","v":"2027-28"},{"$f":"LEFT(L10,4)+1&\"-\"&RIGHT(L10,2)+1","v":"2028-29"},{"$f":"LEFT(M10,4)+1&\"-\"&RIGHT(M10,2)+1","v":"2029-30"},{"$f":"LEFT(N10,4)+1&\"-\"&RIGHT(N10,2)+1","v":"2030-31"}]
{"$rows_left_out":151}
{"sheet":"Output | Exit Fee price caps","index":10,"n_rows":62,"n_cols":14,"rows_kept":62,"cut":false,"hidden":false,"merged":[[59,8,59,12],[49,3,49,4],[50,3,50,4],[51,3,51,4],[52,3,52,4],[53,3,53,4],[61,3,61,4],[48,3,48,4],[28,3,28,4],[29,3,29,4],[30,3,30,4],[31,3,31,4],[32,3,32,4],[33,3,33,4],[43,3,43,4],[44,3,44,4],[45,3,45,4],[46,3,46,4],[17,3,17,4],[60,3,60,4],[14,3,14,4],[47,3,47,4],[27,3,27,4],[0,13,0,14],[23,3,23,4],[24,3,24,4],[25,3,25,4],[26,3,26,4],[22,8,22,12],[6,8,6,12],[7,3,7,4],[8,3,8,4],[9,3,9,4],[10,3,10,4],[11,3,11,4],[12,3,12,4],[13,3,13,4],[15,3,15,4],[16,3,16,4]]}
[null,{"$f":"'Title Page'!B8&\" v\"&'Title Page'!$C$10","v":"Preliminary Standardised Metering Pricing Model  v1"},null,null,null,null,null,null,null,null,null,null,"DNSP:","D"]
[null,{"$f":"MID(CELL(\"filename\",A1),FIND(\"]\",CELL(\"filename\",A1))+1,255)","v":"Output | Exit Fee price caps"},null,null,null,null,null,"Key:","Input","External Link","Internal Link"]
[]
[]
[null,null,"Applicable Exit Fees Price Caps"]
[]
[null,null,null,null,null,null,null,"Base Year","Regulatory Period"]
[null,null,null,"Exit Fee Name",null,"Units","Basis","2025-26",{"$f":"FPFirstYear","v":"2026-27"},{"$f":"LEFT(I8,4)+1&\"-\"&RIGHT(I8,2)+1","v":"2027-28"},{"$f":"LEFT(J8,4)+1&\"-\"&RIGHT(J8,2)+1","v":"2028-29"},{"$f":"LEFT(K8,4)+1&\"-\"&RIGHT(K8,2)+1","v":"2029-30"},{"$f":"LEFT(L8,4)+1&\"-\"&RIGHT(L8,2)+1","v":"2030-31"}]
[null,null,null,{"$f":"D25","v":"Single phase single element"},null,"$dollars","nominal",{"$f":"ROUND(H25,2)","v":287.57},{"$f":"IF(I25=0,0,ROUND(H9*(1-I45)*(1+I$41),2))","v":210.52},{"$f":"IF(J25=0,0,ROUND(I9*(1-J45)*(1+J$41),2))","v":193.73},177.37,188.19,219.41]
[null,null,null,{"$f":"D26","v":"Single phase two element with contactor"},null,"$dollars","nominal",287.57,213.96,196.6,179.81,191.29,223.98]
{"$rows_left_out":53}
{"sheet":"LUTs and Dropdowns","index":11,"n_rows":23,"n_cols":2,"rows_kept":23,"cut":false,"hidden":false,"merged":[]}
[null,{"$f":"'Title Page'!B8&\" v\"&'Title Page'!$C$10","v":"Preliminary Standardised Metering Pricing Model  v1"}]
[null,{"$f":"MID(CELL(\"filename\",A1),FIND(\"]\",CELL(\"filename\",A1))+1,255)","v":"LUTs and Dropdowns"}]
[]
[]
[]
[]
[]
[]
[]
[]
{"$rows_left_out":14}
{"sheet":"Reg Depreciation Calc","index":12,"n_rows":28,"n_cols":10,"rows_kept":28,"cut":false,"hidden":false,"merged":[]}
[]
[null,null,null,null,{"$f":"[1]Assets!F4","v":"2025-26"},{"$f":"[1]Assets!G4","v":"2026-27"},{"$f":"[1]Assets!H4","v":"2027-28"},{"$f":"[1]Assets!I4","v":"2028-29"},{"$f":"[1]Assets!J4","v":"2029-30"},{"$f":"[1]Assets!K4","v":"2030-31"}]
[]
[null,null,"CPI"]
[]
[null,null,null,"Infation Assumption",null,{"$f":"[1]Assets!G6","v":2.4999999999999911E-2},{"$f":"[1]Assets!H6","v":2.4999999999999911E-2},{"$f":"[1]Assets!I6","v":2.4999999999999911E-2},{"$f":"[1]Assets!J6","v":2.4999999999999911E-2},{"$f":"[1]Assets!K6","v":2.4999999999999911E-2}]
[null,null,null,"Cummulative Inflation Index",{"$f":"[1]Assets!F7","v":1},{"$f":"[1]Assets!G7","v":1.0249999999999999},{"$f":"[1]Assets!H7","v":1.0506249999999999},{"$f":"[1]Assets!I7","v":1.0768906249999999},{"$f":"[1]Assets!J7","v":1.1038128906249998},{"$f":"[1]Assets!K7","v":1.1314082128906247}]
[]
[null,null,"Meters"]
[]
{"$rows_left_out":18}