{"text_format":"1","workbook":"xlsx","n_sheets":8,"sheets":["Table for Chapter","Incentive Rate Calculator (New)","VCR Calculation","Share of customer calculation","Source data >>","Energy Consumption forecast","PTRM","Inflation"],"not_rendered":{"charts":0,"images":2,"macros":0,"external_links":6,"defined_names":322,"comments":0,"pivot_tables":1},"unopened":[],"bounds":{"document_bytes":16777216,"sheet_cells":100000,"rows_first":2000,"rows_last":500,"rows_between":2000,"halvings":0,"cell_chars":16384,"cell_head_chars":4096},"cells_cut":0,"cells_raw":0,"read":"whole","date_system":"1900"}

{"sheet":"Table for Chapter","index":0,"n_rows":15,"n_cols":6,"rows_kept":15,"cut":false,"hidden":false,"merged":[]}
[]
[]
[null,"Measure","Average Historic Performance","Modification","Proposed Targets","Proposed Incentive Rates"]
[null,"USAIDI ",null,null,null,"(%/minute)"]
[null,"Urban",{"$f":"'Incentive Rate Calculator (New)'!H30","v":88.03},0,{"$f":"C5+D5","v":88.03},{"$f":"'Incentive Rate Calculator (New)'!H50","v":2.017141892694929E-4}]
[null,"Rural Short",{"$f":"'Incentive Rate Calculator (New)'!H34","v":184.24},0,{"$f":"C6+D6","v":184.24},{"$f":"'Incentive Rate Calculator (New)'!H63","v":2.0032470759472006E-4}]
[null,"Rural long",{"$f":"'Incentive Rate Calculator (New)'!H38","v":295.08},0,295.08,{"$f":"'Incentive Rate Calculator (New)'!H75","v":7.9197185301898684E-5}]
[null,"USAIFI ",null,null,null,"(%/0.01 Interruptions)"]
[null,"Urban",{"$f":"'Incentive Rate Calculator (New)'!H29","v":0.81200000000000006},0,0.81200000000000006,{"$f":"'Incentive Rate Calculator (New)'!H48","v":1.457873569900941E-2}]
[null,"Rural Short",{"$f":"'Incentive Rate Calculator (New)'!H33","v":1.506},0,1.506,{"$f":"'Incentive Rate Calculator (New)'!H61","v":1.5917311008247115E-2}]
[null,"Rural long",{"$f":"'Incentive Rate Calculator (New)'!H37","v":2.1459999999999999},0,2.1459999999999999,{"$f":"'Incentive Rate Calculator (New)'!H73","v":7.2598650012066683E-3}]
[null,"MAIFI ",null,null,null,"(%/0.01 Interruptions)"]
[null,"Urban",2.9409999999999998,0,2.9409999999999998,{"$f":"'Incentive Rate Calculator (New)'!H49","v":1.1662988559207528E-3}]
[null,"Rural Short",4.9480000000000004,0,4.9480000000000004,{"$f":"'Incentive Rate Calculator (New)'!H62","v":1.2733848806597693E-3}]
[null,"Rural long",8.8390000000000004,0,8.8390000000000004,{"$f":"'Incentive Rate Calculator (New)'!H74","v":5.8078920009653348E-4}]

{"sheet":"Incentive Rate Calculator (New)","index":1,"n_rows":75,"n_cols":19,"rows_kept":75,"cut":false,"hidden":false,"merged":[[12,0,12,1],[0,7,0,11],[1,0,2,2],[5,0,5,2],[10,0,10,2],[11,0,11,1],[54,2,54,3],[15,0,15,1],[16,0,16,1],[19,6,19,7],[40,0,40,5],[41,2,41,3],[42,2,42,3],[44,2,44,3],[45,2,45,3],[46,2,46,3],[47,2,47,3],[53,0,53,5],[72,2,72,3],[55,2,55,3],[57,2,57,3],[58,2,58,3],[59,2,59,3],[60,2,60,3],[65,0,65,5],[66,2,66,3],[67,2,67,3],[69,2,69,3],[70,2,70,3],[71,2,71,3]]}
[null,null,null,null,null,null,null,"REG Period 1"]
["S-Factor Example of USAIDI and USAIFI",null,null,null,null,null,null,2027,2028,2029,2030,2031]
[null,null,null,null,null,null,null,"Year 1","Year 2","Year 3","Year 4","Year 5"]
[null,null,null,null,null,null,null,null,null,null,null,null,null,null,null,null,"CBD",95700,1.5]
[null,"Year",null,null,null,null,{"$f":"\"Energy - \"&A7&\" (MWh)\"","v":"Energy - Urban (MWh)"},{"$f":"'Energy Consumption forecast'!$L$4*1000000*H11","v":3112094.4575866298},{"$f":"'Energy Consumption forecast'!$L$5*1000000*I11/SUM($I$11:$I$13)","v":3229609.8278975436},{"$f":"'Energy Consumption forecast'!$L$6*1000000*J11/SUM($J$11:$J$13)","v":3351574.3234189446},{"$f":"'Energy Consumption forecast'!$L$7*1000000*K11/SUM($K$11:$K$13)","v":3479674.6630222662},{"$f":"'Energy Consumption forecast'!$L$8*1000000*L11/SUM($L$11:$L$13)","v":3603650.5850864081},null,null,null,null,"Urban",47850,1.5]
["VCR",null,null,null,null,null,{"$f":"\"Energy - \"&A8&\" (MWh)\"","v":"Energy - Short Rural (MWh)"},{"$f":"'Energy Consumption forecast'!$L$4*1000000*H12","v":3090657.2040417055},{"$f":"'Energy Consumption forecast'!$L$5*1000000*I12/SUM($I$11:$I$13)","v":3207363.0851731892},{"$f":"'Energy Consumption forecast'!$L$6*1000000*J12/SUM($J$11:$J$13)","v":3328487.4443010441},{"$f":"'Energy Consumption forecast'!$L$7*1000000*K12/SUM($K$11:$K$13)","v":3455705.3815555},{"$f":"'Energy Consumption forecast'!$L$8*1000000*L12/SUM($L$11:$L$13)","v":3578827.3117787852},null,null,null,null,"Short Rural",47850,1.5]
["Urban","2023-09-01",{"$f":"'VCR Calculation'!O7*1000","v":44899.549907770117},null,null,null,{"$f":"\"Energy - \"&A9&\" (MWh)\"","v":"Energy - Long Rural (MWh)"},{"$f":"'Energy Consumption forecast'!$L$4*1000000*H13","v":1221872.9992524923},{"$f":"'Energy Consumption forecast'!$L$5*1000000*I13/SUM($I$11:$I$13)","v":1268011.977338464},{"$f":"'Energy Consumption forecast'!$L$6*1000000*J13/SUM($J$11:$J$13)","v":1315897.7745004876},{"$f":"'Energy Consumption forecast'!$L$7*1000000*K13/SUM($K$11:$K$13)","v":1366192.6316423733},{"$f":"'Energy Consumption forecast'!$L$8*1000000*L13/SUM($L$11:$L$13)","v":1414868.1566921747},null,null,null,null,"Long Rural",47850,1.5]
["Short Rural","2023-09-01",{"$f":"'VCR Calculation'!O6*1000","v":43743.091989422108}]
["Long Rural","2023-09-01",{"$f":"'VCR Calculation'!O7*1000","v":44899.549907770117}]
[]
["Ratio",null,null,null,null,null,{"$f":"\"Customers - \"&A7","v":"Customers - Urban"},{"$f":"'Share of customer calculation'!B17","v":0.41915848944981193},{"$f":"H11","v":0.41915848944981193},{"$f":"I11","v":0.41915848944981193},0.41915848944981193,0.41915848944981193,"* use the average customer share from RY 22 to RY 24 to split total energy delivered, this is because RY 21 is affected by COVID where the share of customer at shorrual is abnormally high while the share for urban is low,"]
[{"$f":"A7","v":"Urban"},null,{"$f":"VLOOKUP(A12,Q4:S6,3,FALSE)","v":1.5},null,null,null,{"$f":"\"Customers - \"&A8","v":"Customers - Short Rural"},{"$f":"'Share of customer calculation'!C17","v":0.41627117129918895},{"$f":"H12","v":0.41627117129918895},0.41627117129918895,0.41627117129918895,0.41627117129918895]
["Short Rural",null,{"$f":"VLOOKUP(A13,Q4:S6,3,FALSE)","v":1.5},null,null,null,"Customers - Long Rural",{"$f":"'Share of customer calculation'!D17","v":0.16457033925099915},0.16457033925099915,0.16457033925099915,0.16457033925099915,0.16457033925099915]
["Long Rural",null,{"$f":"VLOOKUP(A14,Q5:S7,3,FALSE)","v":1.5}]
[null,null,null,null,null,null,null,{"$f":"H2","v":2027},{"$f":"I2","v":2028},{"$f":"J2","v":2029},{"$f":"K2","v":2030},{"$f":"L2","v":2031}]
["CPI",null,null,null,null,null,"DUOS Revenue",827.45884050715301,906.95410722762676,994.08660872232326,1089.5900660969494,1194.268690192944,"*the revenue forecast will change"]
["CPI (September 2023 - June 2026) ",null,{"$f":"Inflation!F86/Inflation!F75-1","v":8.8339725055432528E-2},null,null,null,"Deflator",{"$f":"Inflation!F90/Inflation!F86","v":1.0249999999999999},{"$f":"Inflation!F94/Inflation!F86","v":1.0506249999999999},{"$f":"1.025^3","v":1.0768906249999999},{"$f":"1.025^4","v":1.1038128906249998},{"$f":"1.025^5","v":1.1314082128906247},"*apply the RBA long term forecast of 2.5%"]
[null,null,null,null,null,null,"DUOS $2021",{"$f":"H16/H17","v":807.27691756795423},{"$f":"I16/I17","v":863.25197594539145},923.10823926276021,987.11482294793893,1055.5595023848357]
[]
[null,null,null,null,null,null,"Average for Reg Period"]
{"$rows_left_out":56}
{"sheet":"VCR Calculation","index":2,"n_rows":10,"n_cols":15,"rows_kept":10,"cut":false,"hidden":false,"merged":[]}
[]
[]
[null,null,"% Energy",null,null,null,"$VCR Value (kWh)",null,null,null,"VCR_Weighted"]
[null,null,"Commercial","Agri","Indust","Res","Commercial","Agri","Indust","Res","Commercial","Agri","Indust","Res","Total_VCR"]
[null,"Long rural",0.25328554743599041,0.21035247038298388,0.13895875033792982,0.39740323184309589,52.2,44.4,74.790000000000006,25.13,{"$f":"G5*C5","v":13.2215055761587},{"$f":"H5*D5","v":9.3396496850044848},10.392724937773771,9.9867432162169987,{"$f":"SUM(K5:N5)","v":42.940623415153958}]
[null,"Short rural",0.29081507783893584,6.045280748461971E-2,0.19282727007840292,0.45590484459804154,{"$f":"G5","v":52.2},{"$f":"H5","v":44.4},74.790000000000006,25.13,{"$f":"G6*C6","v":15.180547063192451},{"$f":"H6*D6","v":2.684104652317115},{"$f":"I6*E6","v":14.421551529163755},{"$f":"J6*F6","v":11.456888744748783},{"$f":"SUM(K6:N6)","v":43.743091989422105}]
[null,"Urban",0.48156182361144712,1.4212392783520716E-3,0.13504398030033007,0.38197295680987076,{"$f":"G6","v":52.2},44.4,74.790000000000006,25.13,25.137527192517542,6.310302395883198E-2,10.099939286661687,9.5989804046320515,44.899549907770115]
[]
[null,null,"VCR Rates as of September 2023"]
[null,null,"https://www.aer.gov.au/documents/aer-value-customer-reliability-update-summary-december-2023"]

{"sheet":"Share of customer calculation","index":3,"n_rows":17,"n_cols":10,"rows_kept":17,"cut":false,"hidden":false,"merged":[]}
[]
[]
["Average of Avg FdrClass Cust","Column Labels",null,null,null,null,null,"Note:","ELM15 (Short Rural) was inadvertently omitted in the RY21 (STPIS1) submission."]
["Row Labels","URBAN","RURAL SHORT","RURAL LONG","TOTAL",null,null,null,"This is the main reason why this version of STPIS2 recast, the Short Rural USAIDI is about 2.4mins higher than the STPIS1 value."]
["RY21",308958.5,325369.5,125639.5,{"$f":"SUM(B5:D5)","v":759967.5},"actual",null,null,4.1399999999999997,"Total Short Rural USAIDI minutes unaccounted in the RY21 STPIS1 from ELM15"]
["RY22",334819,315746,127846.5,{"$f":"SUM(B6:D6)","v":778411.5},"actual",null,null,2.39,"Net Short Rural USAIDI minutes unaccounted in the RY21 STPIS1 from ELM15"]
["RY23",334918.5,330339,130646.5,795904,"actual"]
["RY24",367629.5,306124,135536,809289.5,"actual"]
[null,null,null,null,null,null,null,null,"Datalink Source:","\"G:\\01 Distribution\\Regulatory\\2024 Review for EDPR FY2731\\Tableau\\NOS_CA_RIN_Summary.csv\""]
["RY25",359189.04816076945,325794.15742867312,138016.79441055737,823000,"forecast"]
[]
[]
[null,"URBAN","RURAL SHORT","RURAL LONG","TOTAL"]
["RY22",{"$f":"GETPIVOTDATA(\"Avg FdrClass Cust\",$A$3,\"Feeder classification\",\"URBAN\",\"AER_RY\",\"RY21\")/$E5","v":0.40654172711333053},{"$f":"GETPIVOTDATA(\"Avg FdrClass Cust\",$A$3,\"Feeder classification\",\"RURAL SHORT\",\"AER_RY\",\"RY21\")/E5","v":0.42813607160832534},{"$f":"GETPIVOTDATA(\"Avg FdrClass Cust\",$A$3,\"Feeder classification\",\"RURAL LONG\",\"AER_RY\",\"RY21\")/E5","v":0.16532220127834413},{"$f":"SUM(B14:D14)","v":1}]
["RY23",{"$f":"GETPIVOTDATA(\"Avg FdrClass Cust\",$A$3,\"Feeder classification\",\"URBAN\",\"AER_RY\",\"RY22\")/E6","v":0.43013110674752364},{"$f":"GETPIVOTDATA(\"Avg FdrClass Cust\",$A$3,\"Feeder classification\",\"RURAL SHORT\",\"AER_RY\",\"RY22\")/E6","v":0.40562864243398256},{"$f":"GETPIVOTDATA(\"Avg FdrClass Cust\",$A$3,\"Feeder classification\",\"RURAL LONG\",\"AER_RY\",\"RY22\")/E6","v":0.1642402508184938},{"$f":"SUM(B15:D15)","v":1}]
["RY24",{"$f":"GETPIVOTDATA(\"Avg FdrClass Cust\",$A$3,\"Feeder classification\",\"URBAN\",\"AER_RY\",\"RY23\")/E7","v":0.42080263448858152},{"$f":"GETPIVOTDATA(\"Avg FdrClass Cust\",$A$3,\"Feeder classification\",\"RURAL SHORT\",\"AER_RY\",\"RY23\")/E7","v":0.41504879985525894},{"$f":"GETPIVOTDATA(\"Avg FdrClass Cust\",$A$3,\"Feeder classification\",\"RURAL LONG\",\"AER_RY\",\"RY23\")/E7","v":0.16414856565615954},1]
["Average",{"$f":"AVERAGE(B14:B16)","v":0.41915848944981193},{"$f":"AVERAGE(C14:C16)","v":0.41627117129918895},0.16457033925099915,1]

{"sheet":"Source data >>","index":4,"n_rows":0,"n_cols":0,"rows_kept":0,"cut":false,"hidden":false,"merged":[]}

{"sheet":"Energy Consumption forecast","index":5,"n_rows":15,"n_cols":12,"rows_kept":15,"cut":false,"hidden":false,"merged":[]}
["asset_type","asset","demand_year","scenario","Base_Load","PV_Generation","EV_Load","Gas_Load","Operational_Demand",null,"Reg Year","Operational_Demand"]
["network","network",2024,"Step Change",{"$f":"I2-H2-G2-F2","v":8.4730128840737251},{"$f":"GETPIVOTDATA(\"value\",[5]Pivot!$A$3,\"demand_type\",\"PV_Generation\",\"demand_year\",C2)","v":-1.63197279453947},{"$f":"GETPIVOTDATA(\"value\",[5]Pivot!$A$3,\"demand_type\",\"EV_Load\",\"demand_year\",C2)","v":4.2943992319526697E-2},{"$f":"GETPIVOTDATA(\"value\",[5]Pivot!$A$3,\"demand_type\",\"Gas_Load\",\"demand_year\",C2)","v":0.132277049649589},{"$f":"GETPIVOTDATA(\"value\",[5]Pivot!$A$3,\"demand_type\",\"Operational_Demand_Actual_Residuals\",\"demand_year\",C2)","v":7.0162611315033701},null,"2024-25",{"$f":"9/12*I2+3/12*I3","v":7.0486240370003674}]
["network","network",2025,"Step Change",{"$f":"I3-H3-G3-F3","v":8.6251703756003018},{"$f":"GETPIVOTDATA(\"value\",[5]Pivot!$A$3,\"demand_type\",\"PV_Generation\",\"demand_year\",C3)","v":-1.80464702503573},{"$f":"GETPIVOTDATA(\"value\",[5]Pivot!$A$3,\"demand_type\",\"EV_Load\",\"demand_year\",C3)","v":8.8498938022875798E-2},{"$f":"GETPIVOTDATA(\"value\",[5]Pivot!$A$3,\"demand_type\",\"Gas_Load\",\"demand_year\",C3)","v":0.23669046490391199},{"$f":"GETPIVOTDATA(\"value\",[5]Pivot!$A$3,\"demand_type\",\"Operational_Demand_Actual_Residuals\",\"demand_year\",C3)","v":7.1457127534913596},null,"2025-26",{"$f":"9/12*I3+3/12*I4","v":7.1979956686368869}]
["network","network",2026,"Step Change",8.7812341940999286,{"$f":"GETPIVOTDATA(\"value\",[5]Pivot!$A$3,\"demand_type\",\"PV_Generation\",\"demand_year\",C4)","v":-1.95018708486422},{"$f":"GETPIVOTDATA(\"value\",[5]Pivot!$A$3,\"demand_type\",\"EV_Load\",\"demand_year\",C4)","v":0.14619270449204499},{"$f":"GETPIVOTDATA(\"value\",[5]Pivot!$A$3,\"demand_type\",\"Gas_Load\",\"demand_year\",C4)","v":0.37760460034571602},{"$f":"GETPIVOTDATA(\"value\",[5]Pivot!$A$3,\"demand_type\",\"Operational_Demand_Actual_Residuals\",\"demand_year\",C4)","v":7.3548444140734697},null,"2026-27",{"$f":"9/12*I4+3/12*I5","v":7.4246246608808271}]
["network","network",2027,"Step Change",8.9407016241082236,{"$f":"GETPIVOTDATA(\"value\",[5]Pivot!$A$3,\"demand_type\",\"PV_Generation\",\"demand_year\",C5)","v":-2.0737912528973799},{"$f":"GETPIVOTDATA(\"value\",[5]Pivot!$A$3,\"demand_type\",\"EV_Load\",\"demand_year\",C5)","v":0.21594031294522001},{"$f":"GETPIVOTDATA(\"value\",[5]Pivot!$A$3,\"demand_type\",\"Gas_Load\",\"demand_year\",C5)","v":0.55111471714683702},{"$f":"GETPIVOTDATA(\"value\",[5]Pivot!$A$3,\"demand_type\",\"Operational_Demand_Actual_Residuals\",\"demand_year\",C5)","v":7.6339654013029001},null,"2027-28",7.7049848904091967]
["network","network",2028,"Step Change",9.0996802612914394,{"$f":"GETPIVOTDATA(\"value\",[5]Pivot!$A$3,\"demand_type\",\"PV_Generation\",\"demand_year\",C6)","v":-2.1677667682359898},{"$f":"GETPIVOTDATA(\"value\",[5]Pivot!$A$3,\"demand_type\",\"EV_Load\",\"demand_year\",C6)","v":0.30660653682480499},{"$f":"GETPIVOTDATA(\"value\",[5]Pivot!$A$3,\"demand_type\",\"Gas_Load\",\"demand_year\",C6)","v":0.67952332784783498},{"$f":"GETPIVOTDATA(\"value\",[5]Pivot!$A$3,\"demand_type\",\"Operational_Demand_Actual_Residuals\",\"demand_year\",C6)","v":7.9180433577280898},null,"2028-29",7.9959595422204757]
["network","network",2029,"Step Change",9.2581494490068081,{"$f":"GETPIVOTDATA(\"value\",[5]Pivot!$A$3,\"demand_type\",\"PV_Generation\",\"demand_year\",C7)","v":-2.2536336435964301},{"$f":"GETPIVOTDATA(\"value\",[5]Pivot!$A$3,\"demand_type\",\"EV_Load\",\"demand_year\",C7)","v":0.41214560128911898},{"$f":"GETPIVOTDATA(\"value\",[5]Pivot!$A$3,\"demand_type\",\"Gas_Load\",\"demand_year\",C7)","v":0.81304668899813404},{"$f":"GETPIVOTDATA(\"value\",[5]Pivot!$A$3,\"demand_type\",\"Operational_Demand_Actual_Residuals\",\"demand_year\",C7)","v":8.2297080956976298},null,"2029-30",8.3015726762201396]
["network","network",2030,"Step Change",9.416211275189438,{"$f":"GETPIVOTDATA(\"value\",[5]Pivot!$A$3,\"demand_type\",\"PV_Generation\",\"demand_year\",C8)","v":-2.3447744335389702},{"$f":"GETPIVOTDATA(\"value\",[5]Pivot!$A$3,\"demand_type\",\"EV_Load\",\"demand_year\",C8)","v":0.52279813759649496},{"$f":"GETPIVOTDATA(\"value\",[5]Pivot!$A$3,\"demand_type\",\"Gas_Load\",\"demand_year\",C8)","v":0.92293143854070803},{"$f":"GETPIVOTDATA(\"value\",[5]Pivot!$A$3,\"demand_type\",\"Operational_Demand_Actual_Residuals\",\"demand_year\",C8)","v":8.5171664177876707},null,"2030-31",8.5973460535573683]
["network","network",2031,"Step Change",9.5797826251465263,{"$f":"GETPIVOTDATA(\"value\",[5]Pivot!$A$3,\"demand_type\",\"PV_Generation\",\"demand_year\",C9)","v":-2.4343322358511301},{"$f":"GETPIVOTDATA(\"value\",[5]Pivot!$A$3,\"demand_type\",\"EV_Load\",\"demand_year\",C9)","v":0.656995199912213},{"$f":"GETPIVOTDATA(\"value\",[5]Pivot!$A$3,\"demand_type\",\"Gas_Load\",\"demand_year\",C9)","v":1.0354393716588499},{"$f":"GETPIVOTDATA(\"value\",[5]Pivot!$A$3,\"demand_type\",\"Operational_Demand_Actual_Residuals\",\"demand_year\",C9)","v":8.8378849608664591},null,"2031-32",8.9199531539967793]
["network","network",2032,"Step Change",9.7490087422805267,{"$f":"GETPIVOTDATA(\"value\",[5]Pivot!$A$3,\"demand_type\",\"PV_Generation\",\"demand_year\",C10)","v":-2.5247615435343098},{"$f":"GETPIVOTDATA(\"value\",[5]Pivot!$A$3,\"demand_type\",\"EV_Load\",\"demand_year\",C10)","v":0.796060985786602},{"$f":"GETPIVOTDATA(\"value\",[5]Pivot!$A$3,\"demand_type\",\"Gas_Load\",\"demand_year\",C10)","v":1.1458495488549201},{"$f":"GETPIVOTDATA(\"value\",[5]Pivot!$A$3,\"demand_type\",\"Operational_Demand_Actual_Residuals\",\"demand_year\",C10)","v":9.16615773338774},null,"2032-33",9.2499200318378776]
["network","network",2033,"Step Change",9.9180023691475814,{"$f":"GETPIVOTDATA(\"value\",[5]Pivot!$A$3,\"demand_type\",\"PV_Generation\",\"demand_year\",C11)","v":-2.6092178930487999},{"$f":"GETPIVOTDATA(\"value\",[5]Pivot!$A$3,\"demand_type\",\"EV_Load\",\"demand_year\",C11)","v":0.939482335544368},{"$f":"GETPIVOTDATA(\"value\",[5]Pivot!$A$3,\"demand_type\",\"Gas_Load\",\"demand_year\",C11)","v":1.2529401155451401},{"$f":"GETPIVOTDATA(\"value\",[5]Pivot!$A$3,\"demand_type\",\"Operational_Demand_Actual_Residuals\",\"demand_year\",C11)","v":9.5012069271882904},null,"2033-34",9.586149012833399]
["network","network",2034,"Step Change",10.0862440273935,{"$f":"GETPIVOTDATA(\"value\",[5]Pivot!$A$3,\"demand_type\",\"PV_Generation\",\"demand_year\",C12)","v":-2.6898371537572001},{"$f":"GETPIVOTDATA(\"value\",[5]Pivot!$A$3,\"demand_type\",\"EV_Load\",\"demand_year\",C12)","v":1.0870128250786399},{"$f":"GETPIVOTDATA(\"value\",[5]Pivot!$A$3,\"demand_type\",\"Gas_Load\",\"demand_year\",C12)","v":1.3575555710537901},{"$f":"GETPIVOTDATA(\"value\",[5]Pivot!$A$3,\"demand_type\",\"Operational_Demand_Actual_Residuals\",\"demand_year\",C12)","v":9.8409752697687303},null,"2034-35",9.9261305578359469]
["network","network",2035,"Step Change",10.253683868329432,{"$f":"GETPIVOTDATA(\"value\",[5]Pivot!$A$3,\"demand_type\",\"PV_Generation\",\"demand_year\",C13)","v":-2.7705045715614398},{"$f":"GETPIVOTDATA(\"value\",[5]Pivot!$A$3,\"demand_type\",\"EV_Load\",\"demand_year\",C13)","v":1.2378447484669199},{"$f":"GETPIVOTDATA(\"value\",[5]Pivot!$A$3,\"demand_type\",\"Gas_Load\",\"demand_year\",C13)","v":1.4605723768026899},{"$f":"GETPIVOTDATA(\"value\",[5]Pivot!$A$3,\"demand_type\",\"Operational_Demand_Actual_Residuals\",\"demand_year\",C13)","v":10.1815964220376},null,"2035-36",10.26714372873195]
["network","network",2036,"Step Change",10.42477747810106,{"$f":"GETPIVOTDATA(\"value\",[5]Pivot!$A$3,\"demand_type\",\"PV_Generation\",\"demand_year\",C14)","v":-2.85801972362531},{"$f":"GETPIVOTDATA(\"value\",[5]Pivot!$A$3,\"demand_type\",\"EV_Load\",\"demand_year\",C14)","v":1.39218908608541},{"$f":"GETPIVOTDATA(\"value\",[5]Pivot!$A$3,\"demand_type\",\"Gas_Load\",\"demand_year\",C14)","v":1.56483880825384},{"$f":"GETPIVOTDATA(\"value\",[5]Pivot!$A$3,\"demand_type\",\"Operational_Demand_Actual_Residuals\",\"demand_year\",C14)","v":10.523785648815}]
["network","network",2037,"Step Change",10.599171613222198,{"$f":"GETPIVOTDATA(\"value\",[5]Pivot!$A$3,\"demand_type\",\"PV_Generation\",\"demand_year\",C15)","v":-2.9473242121825298},{"$f":"GETPIVOTDATA(\"value\",[5]Pivot!$A$3,\"demand_type\",\"EV_Load\",\"demand_year\",C15)","v":1.5497081976047899},{"$f":"GETPIVOTDATA(\"value\",[5]Pivot!$A$3,\"demand_type\",\"Gas_Load\",\"demand_year\",C15)","v":1.6679371479479399},{"$f":"GETPIVOTDATA(\"value\",[5]Pivot!$A$3,\"demand_type\",\"Operational_Demand_Actual_Residuals\",\"demand_year\",C15)","v":10.8694927465924}]

{"sheet":"PTRM","index":6,"n_rows":0,"n_cols":0,"rows_kept":0,"cut":false,"hidden":false,"merged":[]}

{"sheet":"Inflation","index":7,"n_rows":96,"n_cols":23,"rows_kept":96,"cut":false,"hidden":false,"merged":[]}
[null,null,null,null,null,null,null,null,null,null,null,null,null,null,null,null,null,null,"Worksheet check:",{"$f":"IF(COUNTA($T$5:$T$95)=COUNTIF($T5:$T96,\"OK\"),\"OK\",\"Check\")","v":"OK"},null,"Overall Check:",{"$f":"'[6]Check|List'!$S$1","v":"Ok"}]
[]
[]
[null,"Input | General inputs"]
[]
[null,null,null,"Index value, new base","Percentage Change from Corresponding Quarter of Previous Year","Index value, new base","Percentage Change from Corresponding Quarter of Previous Year"]
[null,null,"Source","ABS","Calculated","ABS","Calculated"]
[null,null,"Unit","index","Percent","index","Percent"]
[null,null,"2007-03-31",155.6,null,null,null,null,null,null,null,null,null,null,null,null,null,null,null,{"$f":"IF(C9>EOMONTH(DATE('[6]Input|General'!$G$12,MONTH('[6]Input|General'!$G$9),1),0),\"Ok\",IF(ISBLANK($D9),\"Check\",\"Ok\"))","v":"Ok"}]
[null,null,"2007-06-30",157.5,null,null,null,null,null,null,null,null,null,null,null,null,null,null,null,{"$f":"IF(C10>EOMONTH(DATE('[6]Input|General'!$G$12,MONTH('[6]Input|General'!$G$9),1),0),\"Ok\",IF(ISBLANK($D10),\"Check\",\"Ok\"))","v":"Ok"}]
[null,null,"2007-09-30",158.6,null,null,null,null,null,null,null,null,null,null,null,null,null,null,null,{"$f":"IF(C11>EOMONTH(DATE('[6]Input|General'!$G$12,MONTH('[6]Input|General'!$G$9),1),0),\"Ok\",IF(ISBLANK($D11),\"Check\",\"Ok\"))","v":"Ok"}]
[null,null,"2007-12-31",160.1,null,null,null,null,null,null,null,null,null,null,null,null,null,null,null,{"$f":"IF(C12>EOMONTH(DATE('[6]Input|General'!$G$12,MONTH('[6]Input|General'!$G$9),1),0),\"Ok\",IF(ISBLANK($D12),\"Check\",\"Ok\"))","v":"Ok"}]
[null,null,"2008-03-31",162.19999999999999,{"$f":"D13/D9-1","v":4.2416452442159303E-2},null,null,null,null,null,null,null,null,null,null,null,null,null,null,{"$f":"IF(C13>EOMONTH(DATE('[6]Input|General'!$G$12,MONTH('[6]Input|General'!$G$9),1),0),\"Ok\",IF(ISBLANK($D13),\"Check\",\"Ok\"))","v":"Ok"}]
[null,null,"2008-06-30",164.6,{"$f":"D14/D10-1","v":4.5079365079365052E-2},null,null,null,null,null,null,null,null,null,null,null,null,null,null,{"$f":"IF(C14>EOMONTH(DATE('[6]Input|General'!$G$12,MONTH('[6]Input|General'!$G$9),1),0),\"Ok\",IF(ISBLANK($D14),\"Check\",\"Ok\"))","v":"Ok"}]
[null,null,"2008-09-30",166.5,4.9810844892812067E-2,null,null,null,null,null,null,null,null,null,null,null,null,null,null,{"$f":"IF(C15>EOMONTH(DATE('[6]Input|General'!$G$12,MONTH('[6]Input|General'!$G$9),1),0),\"Ok\",IF(ISBLANK($D15),\"Check\",\"Ok\"))","v":"Ok"}]
[null,null,"2008-12-31",166,3.6851967520299844E-2,null,null,null,null,null,null,null,null,null,null,null,null,null,null,{"$f":"IF(C16>EOMONTH(DATE('[6]Input|General'!$G$12,MONTH('[6]Input|General'!$G$9),1),0),\"Ok\",IF(ISBLANK($D16),\"Check\",\"Ok\"))","v":"Ok"}]
[null,null,"2009-03-31",166.2,2.4660912453760897E-2,null,null,null,null,null,null,null,null,null,null,null,null,null,null,{"$f":"IF(C17>EOMONTH(DATE('[6]Input|General'!$G$12,MONTH('[6]Input|General'!$G$9),1),0),\"Ok\",IF(ISBLANK($D17),\"Check\",\"Ok\"))","v":"Ok"}]
[null,null,"2009-06-30",167,1.4580801944106936E-2,null,null,null,null,null,null,null,null,null,null,null,null,null,null,{"$f":"IF(C18>EOMONTH(DATE('[6]Input|General'!$G$12,MONTH('[6]Input|General'!$G$9),1),0),\"Ok\",IF(ISBLANK($D18),\"Check\",\"Ok\"))","v":"Ok"}]
[null,null,"2009-09-30",168.6,1.2612612612612484E-2,null,null,null,null,null,null,null,null,null,null,null,null,null,null,{"$f":"IF(C19>EOMONTH(DATE('[6]Input|General'!$G$12,MONTH('[6]Input|General'!$G$9),1),0),\"Ok\",IF(ISBLANK($D19),\"Check\",\"Ok\"))","v":"Ok"}]
[null,null,"2009-12-31",169.5,2.108433734939763E-2,null,null,null,null,null,null,null,null,null,null,null,null,null,null,{"$f":"IF(C20>EOMONTH(DATE('[6]Input|General'!$G$12,MONTH('[6]Input|General'!$G$9),1),0),\"Ok\",IF(ISBLANK($D20),\"Check\",\"Ok\"))","v":"Ok"}]
{"$rows_left_out":76}