{"text_format":"1","workbook":"xlsx","n_sheets":13,"sheets":["Cover","Outputs->","Output","Assumptions->","General","Analysis->","BaseCase_Analysis","Option1_Analysis","Option2_Analysis","Do Nothing Risk","A_CPI","CPI","CPI_Con_F"],"not_rendered":{"charts":0,"images":1,"macros":1,"external_links":0,"defined_names":278,"comments":0,"pivot_tables":0},"unopened":[],"bounds":{"document_bytes":16777216,"sheet_cells":100000,"rows_first":2000,"rows_last":500,"rows_between":2000,"halvings":0,"cell_chars":16384,"cell_head_chars":4096},"cells_cut":0,"cells_raw":0,"read":"whole","date_system":"1900"}

{"sheet":"Cover","index":0,"n_rows":11,"n_cols":3,"rows_kept":11,"cut":false,"hidden":false,"merged":[]}
[]
[]
[]
[]
[]
[]
{"$rows_left_out":6}
{"sheet":"Outputs->","index":1,"n_rows":11,"n_cols":3,"rows_kept":11,"cut":false,"hidden":false,"merged":[]}
[]
[]
[]
[]
[]
[null,null,"Outputs"]
{"$rows_left_out":6}
{"sheet":"Output","index":2,"n_rows":15,"n_cols":12,"rows_kept":15,"cut":false,"hidden":false,"merged":[[7,9,7,11],[7,6,7,8],[16,6,16,8],[16,9,16,11]]}
[null,"Outputs"]
[null,{"$f":"Cover!$C$9","v":"AusNet Services"}]
[null,{"$f":"Cover!$C$10","v":"Business Case Evaluation"}]
[null,{"$f":"Cover!$C$11","v":"Voltage Compliance"}]
[]
[null,"Outputs"]
{"$rows_left_out":10}
{"sheet":"Assumptions->","index":3,"n_rows":11,"n_cols":3,"rows_kept":11,"cut":false,"hidden":false,"merged":[]}
[]
[]
[]
[]
[]
[null,null,"Assumptions"]
{"$rows_left_out":6}
{"sheet":"General","index":4,"n_rows":32,"n_cols":59,"rows_kept":32,"cut":false,"hidden":false,"merged":[[13,3,13,5],[13,6,13,11],[22,7,22,8],[19,7,19,8],[21,7,21,8],[17,7,17,8],[23,7,23,8],[20,7,20,8],[6,3,6,10],[10,3,10,5],[9,3,9,5],[7,3,7,5],[8,3,8,5],[7,6,7,8],[8,6,8,11],[9,6,9,11],[10,6,10,11],[11,3,11,5],[11,6,11,11],[12,3,12,5],[12,6,12,11],[18,7,18,8]]}
[null,"Assumptions: General"]
[null,{"$f":"Cover!$C$9","v":"AusNet Services"}]
[null,{"$f":"Cover!$C$10","v":"Business Case Evaluation"}]
[null,{"$f":"Cover!$C$11","v":"Voltage Compliance"}]
[]
[null,"Project Details"]
{"$rows_left_out":27}
{"sheet":"Analysis->","index":5,"n_rows":11,"n_cols":3,"rows_kept":11,"cut":false,"hidden":false,"merged":[[11,2,11,6]]}
[]
[]
[]
[]
[]
[null,null,"Analysis"]
{"$rows_left_out":6}
{"sheet":"BaseCase_Analysis","index":6,"n_rows":124,"n_cols":59,"rows_kept":124,"cut":false,"hidden":false,"merged":[[38,6,38,7],[37,6,37,7],[34,6,34,7],[41,6,41,7],[42,6,42,7],[35,6,35,7],[36,6,36,7],[67,6,67,7],[68,6,68,7],[44,6,44,7],[40,6,40,7],[39,6,39,7],[43,6,43,7],[18,0,22,3],[24,0,28,3],[96,6,96,7],[94,6,94,7],[95,6,95,7],[93,6,93,7],[70,6,70,7],[71,6,71,7],[92,6,92,7],[72,6,72,7],[73,6,73,7],[63,6,63,7],[64,6,64,7],[65,6,65,7],[66,6,66,7],[69,6,69,7],[104,6,104,7],[99,6,99,7],[100,6,100,7],[97,6,97,7],[98,6,98,7],[101,6,101,7],[102,6,102,7],[103,6,103,7]]}
[null,"Analysis: Base Case"]
[null,{"$f":"Cover!$C$9","v":"AusNet Services"}]
[null,{"$f":"Cover!$C$10","v":"Business Case Evaluation"}]
[null,{"$f":"Cover!$C$11","v":"Voltage Compliance"}]
[]
[null,"Regulatory Period Indicator",null,null,null,null,null,null,null,{"$f":"IF(AND(J$7>=General!$H$20,J$8<=General!$H$21),1,0)","v":0},{"$f":"IF(AND(K$7>=General!$H$20,K$8<=General!$H$21),1,0)","v":0},{"$f":"IF(AND(L$7>=General!$H$20,L$8<=General!$H$21),1,0)","v":0},{"$f":"IF(AND(M$7>=General!$H$20,M$8<=General!$H$21),1,0)","v":1},{"$f":"IF(AND(N$7>=General!$H$20,N$8<=General!$H$21),1,0)","v":1},{"$f":"IF(AND(O$7>=General!$H$20,O$8<=General!$H$21),1,0)","v":1},{"$f":"IF(AND(P$7>=General!$H$20,P$8<=General!$H$21),1,0)","v":1},{"$f":"IF(AND(Q$7>=General!$H$20,Q$8<=General!$H$21),1,0)","v":1},{"$f":"IF(AND(R$7>=General!$H$20,R$8<=General!$H$21),1,0)","v":0},{"$f":"IF(AND(S$7>=General!$H$20,S$8<=General!$H$21),1,0)","v":0},{"$f":"IF(AND(T$7>=General!$H$20,T$8<=General!$H$21),1,0)","v":0},{"$f":"IF(AND(U$7>=General!$H$20,U$8<=General!$H$21),1,0)","v":0},{"$f":"IF(AND(V$7>=General!$H$20,V$8<=General!$H$21),1,0)","v":0},{"$f":"IF(AND(W$7>=General!$H$20,W$8<=General!$H$21),1,0)","v":0},{"$f":"IF(AND(X$7>=General!$H$20,X$8<=General!$H$21),1,0)","v":0},{"$f":"IF(AND(Y$7>=General!$H$20,Y$8<=General!$H$21),1,0)","v":0},{"$f":"IF(AND(Z$7>=General!$H$20,Z$8<=General!$H$21),1,0)","v":0},{"$f":"IF(AND(AA$7>=General!$H$20,AA$8<=General!$H$21),1,0)","v":0},{"$f":"IF(AND(AB$7>=General!$H$20,AB$8<=General!$H$21),1,0)","v":0},{"$f":"IF(AND(AC$7>=General!$H$20,AC$8<=General!$H$21),1,0)","v":0},{"$f":"IF(AND(AD$7>=General!$H$20,AD$8<=General!$H$21),1,0)","v":0},{"$f":"IF(AND(AE$7>=General!$H$20,AE$8<=General!$H$21),1,0)","v":0},{"$f":"IF(AND(AF$7>=General!$H$20,AF$8<=General!$H$21),1,0)","v":0},{"$f":"IF(AND(AG$7>=General!$H$20,AG$8<=General!$H$21),1,0)","v":0},{"$f":"IF(AND(AH$7>=General!$H$20,AH$8<=General!$H$21),1,0)","v":0},{"$f":"IF(AND(AI$7>=General!$H$20,AI$8<=General!$H$21),1,0)","v":0},{"$f":"IF(AND(AJ$7>=General!$H$20,AJ$8<=General!$H$21),1,0)","v":0},{"$f":"IF(AND(AK$7>=General!$H$20,AK$8<=General!$H$21),1,0)","v":0},{"$f":"IF(AND(AL$7>=General!$H$20,AL$8<=General!$H$21),1,0)","v":0},{"$f":"IF(AND(AM$7>=General!$H$20,AM$8<=General!$H$21),1,0)","v":0},{"$f":"IF(AND(AN$7>=General!$H$20,AN$8<=General!$H$21),1,0)","v":0},{"$f":"IF(AND(AO$7>=General!$H$20,AO$8<=General!$H$21),1,0)","v":0},{"$f":"IF(AND(AP$7>=General!$H$20,AP$8<=General!$H$21),1,0)","v":0},{"$f":"IF(AND(AQ$7>=General!$H$20,AQ$8<=General!$H$21),1,0)","v":0},{"$f":"IF(AND(AR$7>=General!$H$20,AR$8<=General!$H$21),1,0)","v":0},{"$f":"IF(AND(AS$7>=General!$H$20,AS$8<=General!$H$21),1,0)","v":0},{"$f":"IF(AND(AT$7>=General!$H$20,AT$8<=General!$H$21),1,0)","v":0},{"$f":"IF(AND(AU$7>=General!$H$20,AU$8<=General!$H$21),1,0)","v":0},{"$f":"IF(AND(AV$7>=General!$H$20,AV$8<=General!$H$21),1,0)","v":0},{"$f":"IF(AND(AW$7>=General!$H$20,AW$8<=General!$H$21),1,0)","v":0},{"$f":"IF(AND(AX$7>=General!$H$20,AX$8<=General!$H$21),1,0)","v":0},{"$f":"IF(AND(AY$7>=General!$H$20,AY$8<=General!$H$21),1,0)","v":0},{"$f":"IF(AND(AZ$7>=General!$H$20,AZ$8<=General!$H$21),1,0)","v":0},{"$f":"IF(AND(BA$7>=General!$H$20,BA$8<=General!$H$21),1,0)","v":0},{"$f":"IF(AND(BB$7>=General!$H$20,BB$8<=General!$H$21),1,0)","v":0},{"$f":"IF(AND(BC$7>=General!$H$20,BC$8<=General!$H$21),1,0)","v":0},{"$f":"IF(AND(BD$7>=General!$H$20,BD$8<=General!$H$21),1,0)","v":0},{"$f":"IF(AND(BE$7>=General!$H$20,BE$8<=General!$H$21),1,0)","v":0},{"$f":"IF(AND(BF$7>=General!$H$20,BF$8<=General!$H$21),1,0)","v":0},{"$f":"IF(AND(BG$7>=General!$H$20,BG$8<=General!$H$21),1,0)","v":0}]
{"$rows_left_out":119}
{"sheet":"Option1_Analysis","index":7,"n_rows":124,"n_cols":59,"rows_kept":124,"cut":false,"hidden":false,"merged":[[104,6,104,7],[98,6,98,7],[99,6,99,7],[100,6,100,7],[101,6,101,7],[102,6,102,7],[103,6,103,7],[97,6,97,7],[68,6,68,7],[69,6,69,7],[70,6,70,7],[71,6,71,7],[72,6,72,7],[73,6,73,7],[92,6,92,7],[93,6,93,7],[94,6,94,7],[95,6,95,7],[96,6,96,7],[67,6,67,7],[38,6,38,7],[39,6,39,7],[40,6,40,7],[41,6,41,7],[42,6,42,7],[43,6,43,7],[44,6,44,7],[63,6,63,7],[64,6,64,7],[65,6,65,7],[66,6,66,7],[37,6,37,7],[18,0,22,3],[24,0,28,3],[34,6,34,7],[35,6,35,7],[36,6,36,7]]}
[null,"Analysis: Option 1"]
[null,{"$f":"Cover!$C$9","v":"AusNet Services"}]
[null,{"$f":"Cover!$C$10","v":"Business Case Evaluation"}]
[null,{"$f":"Cover!$C$11","v":"Voltage Compliance"}]
[]
[null,"Regulatory Period Indicator",null,null,null,null,null,null,null,{"$f":"IF(AND(J$7>=General!$H$20,J$8<=General!$H$21),1,0)","v":0},{"$f":"IF(AND(K$7>=General!$H$20,K$8<=General!$H$21),1,0)","v":0},{"$f":"IF(AND(L$7>=General!$H$20,L$8<=General!$H$21),1,0)","v":0},{"$f":"IF(AND(M$7>=General!$H$20,M$8<=General!$H$21),1,0)","v":1},{"$f":"IF(AND(N$7>=General!$H$20,N$8<=General!$H$21),1,0)","v":1},{"$f":"IF(AND(O$7>=General!$H$20,O$8<=General!$H$21),1,0)","v":1},{"$f":"IF(AND(P$7>=General!$H$20,P$8<=General!$H$21),1,0)","v":1},{"$f":"IF(AND(Q$7>=General!$H$20,Q$8<=General!$H$21),1,0)","v":1},{"$f":"IF(AND(R$7>=General!$H$20,R$8<=General!$H$21),1,0)","v":0},{"$f":"IF(AND(S$7>=General!$H$20,S$8<=General!$H$21),1,0)","v":0},{"$f":"IF(AND(T$7>=General!$H$20,T$8<=General!$H$21),1,0)","v":0},{"$f":"IF(AND(U$7>=General!$H$20,U$8<=General!$H$21),1,0)","v":0},{"$f":"IF(AND(V$7>=General!$H$20,V$8<=General!$H$21),1,0)","v":0},{"$f":"IF(AND(W$7>=General!$H$20,W$8<=General!$H$21),1,0)","v":0},{"$f":"IF(AND(X$7>=General!$H$20,X$8<=General!$H$21),1,0)","v":0},{"$f":"IF(AND(Y$7>=General!$H$20,Y$8<=General!$H$21),1,0)","v":0},{"$f":"IF(AND(Z$7>=General!$H$20,Z$8<=General!$H$21),1,0)","v":0},{"$f":"IF(AND(AA$7>=General!$H$20,AA$8<=General!$H$21),1,0)","v":0},{"$f":"IF(AND(AB$7>=General!$H$20,AB$8<=General!$H$21),1,0)","v":0},{"$f":"IF(AND(AC$7>=General!$H$20,AC$8<=General!$H$21),1,0)","v":0},{"$f":"IF(AND(AD$7>=General!$H$20,AD$8<=General!$H$21),1,0)","v":0},{"$f":"IF(AND(AE$7>=General!$H$20,AE$8<=General!$H$21),1,0)","v":0},{"$f":"IF(AND(AF$7>=General!$H$20,AF$8<=General!$H$21),1,0)","v":0},{"$f":"IF(AND(AG$7>=General!$H$20,AG$8<=General!$H$21),1,0)","v":0},{"$f":"IF(AND(AH$7>=General!$H$20,AH$8<=General!$H$21),1,0)","v":0},{"$f":"IF(AND(AI$7>=General!$H$20,AI$8<=General!$H$21),1,0)","v":0},{"$f":"IF(AND(AJ$7>=General!$H$20,AJ$8<=General!$H$21),1,0)","v":0},{"$f":"IF(AND(AK$7>=General!$H$20,AK$8<=General!$H$21),1,0)","v":0},{"$f":"IF(AND(AL$7>=General!$H$20,AL$8<=General!$H$21),1,0)","v":0},{"$f":"IF(AND(AM$7>=General!$H$20,AM$8<=General!$H$21),1,0)","v":0},{"$f":"IF(AND(AN$7>=General!$H$20,AN$8<=General!$H$21),1,0)","v":0},{"$f":"IF(AND(AO$7>=General!$H$20,AO$8<=General!$H$21),1,0)","v":0},{"$f":"IF(AND(AP$7>=General!$H$20,AP$8<=General!$H$21),1,0)","v":0},{"$f":"IF(AND(AQ$7>=General!$H$20,AQ$8<=General!$H$21),1,0)","v":0},{"$f":"IF(AND(AR$7>=General!$H$20,AR$8<=General!$H$21),1,0)","v":0},{"$f":"IF(AND(AS$7>=General!$H$20,AS$8<=General!$H$21),1,0)","v":0},{"$f":"IF(AND(AT$7>=General!$H$20,AT$8<=General!$H$21),1,0)","v":0},{"$f":"IF(AND(AU$7>=General!$H$20,AU$8<=General!$H$21),1,0)","v":0},{"$f":"IF(AND(AV$7>=General!$H$20,AV$8<=General!$H$21),1,0)","v":0},{"$f":"IF(AND(AW$7>=General!$H$20,AW$8<=General!$H$21),1,0)","v":0},{"$f":"IF(AND(AX$7>=General!$H$20,AX$8<=General!$H$21),1,0)","v":0},{"$f":"IF(AND(AY$7>=General!$H$20,AY$8<=General!$H$21),1,0)","v":0},{"$f":"IF(AND(AZ$7>=General!$H$20,AZ$8<=General!$H$21),1,0)","v":0},{"$f":"IF(AND(BA$7>=General!$H$20,BA$8<=General!$H$21),1,0)","v":0},{"$f":"IF(AND(BB$7>=General!$H$20,BB$8<=General!$H$21),1,0)","v":0},{"$f":"IF(AND(BC$7>=General!$H$20,BC$8<=General!$H$21),1,0)","v":0},{"$f":"IF(AND(BD$7>=General!$H$20,BD$8<=General!$H$21),1,0)","v":0},{"$f":"IF(AND(BE$7>=General!$H$20,BE$8<=General!$H$21),1,0)","v":0},{"$f":"IF(AND(BF$7>=General!$H$20,BF$8<=General!$H$21),1,0)","v":0},{"$f":"IF(AND(BG$7>=General!$H$20,BG$8<=General!$H$21),1,0)","v":0}]
{"$rows_left_out":119}
{"sheet":"Option2_Analysis","index":8,"n_rows":124,"n_cols":59,"rows_kept":124,"cut":false,"hidden":false,"merged":[[37,6,37,7],[18,0,22,3],[24,0,28,3],[34,6,34,7],[35,6,35,7],[36,6,36,7],[67,6,67,7],[38,6,38,7],[39,6,39,7],[40,6,40,7],[41,6,41,7],[42,6,42,7],[43,6,43,7],[44,6,44,7],[63,6,63,7],[64,6,64,7],[65,6,65,7],[66,6,66,7],[97,6,97,7],[68,6,68,7],[69,6,69,7],[70,6,70,7],[71,6,71,7],[72,6,72,7],[73,6,73,7],[92,6,92,7],[93,6,93,7],[94,6,94,7],[95,6,95,7],[96,6,96,7],[104,6,104,7],[98,6,98,7],[99,6,99,7],[100,6,100,7],[101,6,101,7],[102,6,102,7],[103,6,103,7]]}
[null,"Analysis: Option 2"]
[null,{"$f":"Cover!$C$9","v":"AusNet Services"}]
[null,{"$f":"Cover!$C$10","v":"Business Case Evaluation"}]
[null,{"$f":"Cover!$C$11","v":"Voltage Compliance"}]
[]
[null,"Regulatory Period Indicator",null,null,null,null,null,null,null,{"$f":"IF(AND(J$7>=General!$H$20,J$8<=General!$H$21),1,0)","v":0},{"$f":"IF(AND(K$7>=General!$H$20,K$8<=General!$H$21),1,0)","v":0},{"$f":"IF(AND(L$7>=General!$H$20,L$8<=General!$H$21),1,0)","v":0},{"$f":"IF(AND(M$7>=General!$H$20,M$8<=General!$H$21),1,0)","v":1},{"$f":"IF(AND(N$7>=General!$H$20,N$8<=General!$H$21),1,0)","v":1},{"$f":"IF(AND(O$7>=General!$H$20,O$8<=General!$H$21),1,0)","v":1},{"$f":"IF(AND(P$7>=General!$H$20,P$8<=General!$H$21),1,0)","v":1},{"$f":"IF(AND(Q$7>=General!$H$20,Q$8<=General!$H$21),1,0)","v":1},{"$f":"IF(AND(R$7>=General!$H$20,R$8<=General!$H$21),1,0)","v":0},{"$f":"IF(AND(S$7>=General!$H$20,S$8<=General!$H$21),1,0)","v":0},{"$f":"IF(AND(T$7>=General!$H$20,T$8<=General!$H$21),1,0)","v":0},{"$f":"IF(AND(U$7>=General!$H$20,U$8<=General!$H$21),1,0)","v":0},{"$f":"IF(AND(V$7>=General!$H$20,V$8<=General!$H$21),1,0)","v":0},{"$f":"IF(AND(W$7>=General!$H$20,W$8<=General!$H$21),1,0)","v":0},{"$f":"IF(AND(X$7>=General!$H$20,X$8<=General!$H$21),1,0)","v":0},{"$f":"IF(AND(Y$7>=General!$H$20,Y$8<=General!$H$21),1,0)","v":0},{"$f":"IF(AND(Z$7>=General!$H$20,Z$8<=General!$H$21),1,0)","v":0},{"$f":"IF(AND(AA$7>=General!$H$20,AA$8<=General!$H$21),1,0)","v":0},{"$f":"IF(AND(AB$7>=General!$H$20,AB$8<=General!$H$21),1,0)","v":0},{"$f":"IF(AND(AC$7>=General!$H$20,AC$8<=General!$H$21),1,0)","v":0},{"$f":"IF(AND(AD$7>=General!$H$20,AD$8<=General!$H$21),1,0)","v":0},{"$f":"IF(AND(AE$7>=General!$H$20,AE$8<=General!$H$21),1,0)","v":0},{"$f":"IF(AND(AF$7>=General!$H$20,AF$8<=General!$H$21),1,0)","v":0},{"$f":"IF(AND(AG$7>=General!$H$20,AG$8<=General!$H$21),1,0)","v":0},{"$f":"IF(AND(AH$7>=General!$H$20,AH$8<=General!$H$21),1,0)","v":0},{"$f":"IF(AND(AI$7>=General!$H$20,AI$8<=General!$H$21),1,0)","v":0},{"$f":"IF(AND(AJ$7>=General!$H$20,AJ$8<=General!$H$21),1,0)","v":0},{"$f":"IF(AND(AK$7>=General!$H$20,AK$8<=General!$H$21),1,0)","v":0},{"$f":"IF(AND(AL$7>=General!$H$20,AL$8<=General!$H$21),1,0)","v":0},{"$f":"IF(AND(AM$7>=General!$H$20,AM$8<=General!$H$21),1,0)","v":0},{"$f":"IF(AND(AN$7>=General!$H$20,AN$8<=General!$H$21),1,0)","v":0},{"$f":"IF(AND(AO$7>=General!$H$20,AO$8<=General!$H$21),1,0)","v":0},{"$f":"IF(AND(AP$7>=General!$H$20,AP$8<=General!$H$21),1,0)","v":0},{"$f":"IF(AND(AQ$7>=General!$H$20,AQ$8<=General!$H$21),1,0)","v":0},{"$f":"IF(AND(AR$7>=General!$H$20,AR$8<=General!$H$21),1,0)","v":0},{"$f":"IF(AND(AS$7>=General!$H$20,AS$8<=General!$H$21),1,0)","v":0},{"$f":"IF(AND(AT$7>=General!$H$20,AT$8<=General!$H$21),1,0)","v":0},{"$f":"IF(AND(AU$7>=General!$H$20,AU$8<=General!$H$21),1,0)","v":0},{"$f":"IF(AND(AV$7>=General!$H$20,AV$8<=General!$H$21),1,0)","v":0},{"$f":"IF(AND(AW$7>=General!$H$20,AW$8<=General!$H$21),1,0)","v":0},{"$f":"IF(AND(AX$7>=General!$H$20,AX$8<=General!$H$21),1,0)","v":0},{"$f":"IF(AND(AY$7>=General!$H$20,AY$8<=General!$H$21),1,0)","v":0},{"$f":"IF(AND(AZ$7>=General!$H$20,AZ$8<=General!$H$21),1,0)","v":0},{"$f":"IF(AND(BA$7>=General!$H$20,BA$8<=General!$H$21),1,0)","v":0},{"$f":"IF(AND(BB$7>=General!$H$20,BB$8<=General!$H$21),1,0)","v":0},{"$f":"IF(AND(BC$7>=General!$H$20,BC$8<=General!$H$21),1,0)","v":0},{"$f":"IF(AND(BD$7>=General!$H$20,BD$8<=General!$H$21),1,0)","v":0},{"$f":"IF(AND(BE$7>=General!$H$20,BE$8<=General!$H$21),1,0)","v":0},{"$f":"IF(AND(BF$7>=General!$H$20,BF$8<=General!$H$21),1,0)","v":0},{"$f":"IF(AND(BG$7>=General!$H$20,BG$8<=General!$H$21),1,0)","v":0}]
{"$rows_left_out":119}
{"sheet":"Do Nothing Risk","index":9,"n_rows":124,"n_cols":59,"rows_kept":124,"cut":false,"hidden":false,"merged":[[104,6,104,7],[98,6,98,7],[99,6,99,7],[100,6,100,7],[101,6,101,7],[102,6,102,7],[103,6,103,7],[97,6,97,7],[68,6,68,7],[69,6,69,7],[70,6,70,7],[71,6,71,7],[72,6,72,7],[73,6,73,7],[92,6,92,7],[93,6,93,7],[94,6,94,7],[95,6,95,7],[96,6,96,7],[67,6,67,7],[38,6,38,7],[39,6,39,7],[40,6,40,7],[41,6,41,7],[42,6,42,7],[43,6,43,7],[44,6,44,7],[63,6,63,7],[64,6,64,7],[65,6,65,7],[66,6,66,7],[37,6,37,7],[18,0,22,3],[24,0,28,3],[34,6,34,7],[35,6,35,7],[36,6,36,7]]}
[null,"Analysis: Do Nothing Risk"]
[null,{"$f":"Cover!$C$9","v":"AusNet Services"}]
[null,{"$f":"Cover!$C$10","v":"Business Case Evaluation"}]
[null,{"$f":"Cover!$C$11","v":"Voltage Compliance"}]
[]
[null,"Regulatory Period Indicator",null,null,null,null,null,null,null,{"$f":"IF(AND(J$7>=General!$H$20,J$8<=General!$H$21),1,0)","v":0},{"$f":"IF(AND(K$7>=General!$H$20,K$8<=General!$H$21),1,0)","v":0},{"$f":"IF(AND(L$7>=General!$H$20,L$8<=General!$H$21),1,0)","v":0},{"$f":"IF(AND(M$7>=General!$H$20,M$8<=General!$H$21),1,0)","v":1},{"$f":"IF(AND(N$7>=General!$H$20,N$8<=General!$H$21),1,0)","v":1},{"$f":"IF(AND(O$7>=General!$H$20,O$8<=General!$H$21),1,0)","v":1},{"$f":"IF(AND(P$7>=General!$H$20,P$8<=General!$H$21),1,0)","v":1},{"$f":"IF(AND(Q$7>=General!$H$20,Q$8<=General!$H$21),1,0)","v":1},{"$f":"IF(AND(R$7>=General!$H$20,R$8<=General!$H$21),1,0)","v":0},{"$f":"IF(AND(S$7>=General!$H$20,S$8<=General!$H$21),1,0)","v":0},{"$f":"IF(AND(T$7>=General!$H$20,T$8<=General!$H$21),1,0)","v":0},{"$f":"IF(AND(U$7>=General!$H$20,U$8<=General!$H$21),1,0)","v":0},{"$f":"IF(AND(V$7>=General!$H$20,V$8<=General!$H$21),1,0)","v":0},{"$f":"IF(AND(W$7>=General!$H$20,W$8<=General!$H$21),1,0)","v":0},{"$f":"IF(AND(X$7>=General!$H$20,X$8<=General!$H$21),1,0)","v":0},{"$f":"IF(AND(Y$7>=General!$H$20,Y$8<=General!$H$21),1,0)","v":0},{"$f":"IF(AND(Z$7>=General!$H$20,Z$8<=General!$H$21),1,0)","v":0},{"$f":"IF(AND(AA$7>=General!$H$20,AA$8<=General!$H$21),1,0)","v":0},{"$f":"IF(AND(AB$7>=General!$H$20,AB$8<=General!$H$21),1,0)","v":0},{"$f":"IF(AND(AC$7>=General!$H$20,AC$8<=General!$H$21),1,0)","v":0},{"$f":"IF(AND(AD$7>=General!$H$20,AD$8<=General!$H$21),1,0)","v":0},{"$f":"IF(AND(AE$7>=General!$H$20,AE$8<=General!$H$21),1,0)","v":0},{"$f":"IF(AND(AF$7>=General!$H$20,AF$8<=General!$H$21),1,0)","v":0},{"$f":"IF(AND(AG$7>=General!$H$20,AG$8<=General!$H$21),1,0)","v":0},{"$f":"IF(AND(AH$7>=General!$H$20,AH$8<=General!$H$21),1,0)","v":0},{"$f":"IF(AND(AI$7>=General!$H$20,AI$8<=General!$H$21),1,0)","v":0},{"$f":"IF(AND(AJ$7>=General!$H$20,AJ$8<=General!$H$21),1,0)","v":0},{"$f":"IF(AND(AK$7>=General!$H$20,AK$8<=General!$H$21),1,0)","v":0},{"$f":"IF(AND(AL$7>=General!$H$20,AL$8<=General!$H$21),1,0)","v":0},{"$f":"IF(AND(AM$7>=General!$H$20,AM$8<=General!$H$21),1,0)","v":0},{"$f":"IF(AND(AN$7>=General!$H$20,AN$8<=General!$H$21),1,0)","v":0},{"$f":"IF(AND(AO$7>=General!$H$20,AO$8<=General!$H$21),1,0)","v":0},{"$f":"IF(AND(AP$7>=General!$H$20,AP$8<=General!$H$21),1,0)","v":0},{"$f":"IF(AND(AQ$7>=General!$H$20,AQ$8<=General!$H$21),1,0)","v":0},{"$f":"IF(AND(AR$7>=General!$H$20,AR$8<=General!$H$21),1,0)","v":0},{"$f":"IF(AND(AS$7>=General!$H$20,AS$8<=General!$H$21),1,0)","v":0},{"$f":"IF(AND(AT$7>=General!$H$20,AT$8<=General!$H$21),1,0)","v":0},{"$f":"IF(AND(AU$7>=General!$H$20,AU$8<=General!$H$21),1,0)","v":0},{"$f":"IF(AND(AV$7>=General!$H$20,AV$8<=General!$H$21),1,0)","v":0},{"$f":"IF(AND(AW$7>=General!$H$20,AW$8<=General!$H$21),1,0)","v":0},{"$f":"IF(AND(AX$7>=General!$H$20,AX$8<=General!$H$21),1,0)","v":0},{"$f":"IF(AND(AY$7>=General!$H$20,AY$8<=General!$H$21),1,0)","v":0},{"$f":"IF(AND(AZ$7>=General!$H$20,AZ$8<=General!$H$21),1,0)","v":0},{"$f":"IF(AND(BA$7>=General!$H$20,BA$8<=General!$H$21),1,0)","v":0},{"$f":"IF(AND(BB$7>=General!$H$20,BB$8<=General!$H$21),1,0)","v":0},{"$f":"IF(AND(BC$7>=General!$H$20,BC$8<=General!$H$21),1,0)","v":0},{"$f":"IF(AND(BD$7>=General!$H$20,BD$8<=General!$H$21),1,0)","v":0},{"$f":"IF(AND(BE$7>=General!$H$20,BE$8<=General!$H$21),1,0)","v":0},{"$f":"IF(AND(BF$7>=General!$H$20,BF$8<=General!$H$21),1,0)","v":0},{"$f":"IF(AND(BG$7>=General!$H$20,BG$8<=General!$H$21),1,0)","v":0}]
{"$rows_left_out":119}
{"sheet":"A_CPI","index":10,"n_rows":11,"n_cols":3,"rows_kept":11,"cut":false,"hidden":false,"merged":[[11,2,11,6]]}
[]
[]
[]
[]
[]
[null,null,"Appendix A - CPI"]
{"$rows_left_out":6}
{"sheet":"CPI","index":11,"n_rows":54,"n_cols":5,"rows_kept":54,"cut":false,"hidden":false,"merged":[[5,2,5,4]]}
[null,"Appendix A: CPI Raw Data"]
[null,{"$f":"Cover!$C$9","v":"AusNet Services"}]
[null,{"$f":"Cover!$C$10","v":"Business Case Evaluation"}]
[null,{"$f":"Cover!$C$11","v":"Voltage Compliance"}]
[]
[null,null,"CPI from ABS"]
{"$rows_left_out":49}
{"sheet":"CPI_Con_F","index":12,"n_rows":200,"n_cols":11,"rows_kept":200,"cut":false,"hidden":false,"merged":[]}
[null,"Appendix A: Conversion Factors"]
[null,{"$f":"Cover!$C$9","v":"AusNet Services"}]
[null,{"$f":"Cover!$C$10","v":"Business Case Evaluation"}]
[null,{"$f":"Cover!$C$11","v":"Voltage Compliance"}]
[]
[null,"Converting Actual CPI into Escalation Using the Lagged Approach"]
{"$rows_left_out":194}