{"text_format":"1","workbook":"xlsx","n_sheets":9,"sheets":["Cover","Summary","Result tables","Option 3","Option 2","Option 1","Unit rate buildup","Labour costs","Replacement program breakdown"],"not_rendered":{"charts":2,"images":2,"macros":0,"external_links":0,"defined_names":4,"comments":0,"pivot_tables":0},"unopened":[],"bounds":{"document_bytes":16777216,"sheet_cells":100000,"rows_first":2000,"rows_last":500,"rows_between":2000,"halvings":0,"cell_chars":16384,"cell_head_chars":4096},"cells_cut":0,"cells_raw":0,"read":"whole","date_system":"1900"}

{"sheet":"Cover","index":0,"n_rows":8,"n_cols":4,"rows_kept":8,"cut":false,"hidden":false,"merged":[]}
[]
[null,null,"CitiPower"]
[null,null,"Regulatory proposal 2026-31"]
[]
[null,null,{"$f":"REPLACE(LEFT(_xlfn.TEXTAFTER(CELL(\"filename\"),\" - \",1),FIND(\"Jan2025\",_xlfn.TEXTAFTER(CELL(\"filename\"),\" - \"),1)-4),1,1,UPPER(LEFT(LEFT(_xlfn.TEXTAFTER(CELL(\"filename\"),\" - \",1),FIND(\"Jan2025\",_xlfn.TEXTAFTER(CELL(\"filename\"),\" - \"),1)-4),1)))","v":"Metering business case"}]
[null,null,"Model number:",{"$f":"LEFT(_xlfn.TEXTAFTER(CELL(\"filename\"),\" MOD \"),FIND(\" - \",_xlfn.TEXTAFTER(CELL(\"filename\"),\" MOD \"),1)-1)","v":"11.04"}]
[]
[null,null,"2025-01-31"]

{"sheet":"Summary","index":1,"n_rows":31,"n_cols":4,"rows_kept":31,"cut":false,"hidden":false,"merged":[]}
[]
[null,"Proactive meter replacement - Cost model"]
[]
[]
[null,"Options summary - NPV"]
[]
[null,"Description","NPV","NPV net"]
[null,{"$f":"'Option 3'!B2","v":"Option 3 - Proactive delayed"},{"$f":"'Option 3'!D50","v":135826153.76511857},{"$f":"$C$10-C8","v":3199735.8519577384}]
[null,{"$f":"'Option 2'!B2","v":"Option 2 - Proactive"},{"$f":"'Option 2'!D50","v":130301670.47386195},{"$f":"$C$10-C9","v":8724219.1432143599}]
[null,{"$f":"'Option 1'!B2","v":"Option 1 - Reactive"},{"$f":"'Option 1'!D35","v":139025889.61707631},"-"]
[]
[]
[null,"WACC"]
[null,3.6400000000000002E-2,3.6400000000000002E-2]
[]
[]
[]
[null,"Waterfall - NPV"]
[]
[null,null,"Option 2","Option 3"]
{"$rows_left_out":12}
{"sheet":"Result tables","index":2,"n_rows":21,"n_cols":5,"rows_kept":21,"cut":false,"hidden":false,"merged":[]}
[]
[null,"NPV Results"]
[]
[]
[null,"Citipower"]
[]
[null,"option ","gross npv","net npv*","bcr*"]
[null,"Option1 - Base Case ",139025889.61707631,"N/A","N/A"]
[null,"Option 2",130302680.14308113,{"$f":"C8-C9","v":8723209.4739951789},{"$f":"C8/C9","v":1.066945740981049}]
[null,"Option 3",135826153.76511857,{"$f":"C8-C10","v":3199735.8519577384},{"$f":"C8/C10","v":1.0235575827133483}]
[]
[]
[null,null,"Reactive","Proactive","Move to 2031"]
[null,"Sensitivity analysis","Base Case","Option 2","Option 3"]
[null,"Adopting alternative failure rate profile option 1",173111153.67151079,153276922.33457187,166607277.7872774]
[null,"Adopting alternative failure rate profile option 2",93211516.604964107,115204864.7577894,110994308.70414548]
[null,"+10% change in reactive replacement installation costs",146437685.6692383,133484821.33901249,141381662.02429369]
[null,"-10% change in reactive replacement installation costs",131614093.56491435,127678777.43331847,131398899.41523519]
[null,"\"+10% change in tech capital costs\"",145516682.52662197,138641020.93246537,143812708.66855851]
[null,"\"-10% change in tech capital costs\"",132535096.70753062,122522577.8398656,128967852.77097036]
{"$rows_left_out":2}
{"sheet":"Option 3","index":3,"n_rows":72,"n_cols":18,"rows_kept":72,"cut":false,"hidden":false,"merged":[[7,1,12,1],[14,1,19,1],[24,1,29,1],[31,1,36,1]]}
[]
[null,"Option 3 - Proactive delayed"]
[]
[null,"Expenditure / benefits profile"]
[]
[null,null,null,1,2,3,4,5,6,7,8,9,10,11,12,13,14,15]
[null,null,null,"2026-27","2027-28","2028-29","2029-30","2030-31","2031-32","2032-33","2033-34","2034-35","2035-36","2036-37","2037-38","2038-39","2039-40","2040-41"]
[null," Pro-active Labour Costs","AMI 1Ph 1e",0,0,0,0,0,1761177.7235476959,1921348.1437001904,1921348.1437001904,1921348.1437001904,1841321.0084680885,880646.93661799317,0,0,0,0]
[null,null,"AMI 1Ph 1e + c",0,0,0,0,0,58307.143521792743,63533.879494861816,63533.879494861816,63533.879494861816,60862.436664182067,29153.571760896371,0,0,0,0]
[null,null,"AMI 1Ph 2e + C",0,0,0,0,0,243798.19572159954,265982.78618507046,265982.78618507046,265982.78618507046,254948.56579748023,121957.17270494498,0,0,0,0]
[null,null,"AMI 3Ph",0,0,0,0,0,743421.09871654911,810990.10441942641,810990.10441942641,810990.10441942641,777286.61956043728,371710.54935827455,0,0,0,0]
[null,null,"AMI 3Ph + C",0,0,0,0,0,15069.346595605726,16527.670459696601,16527.670459696601,16527.670459696601,15717.49053520167,7615.6912902523563,0,0,0,0]
[null,null,"AMI 3Ph CT",0,0,0,0,0,150441.48279600983,163680.33328205871,163680.33328205871,163680.33328205871,157060.90803903426,75220.741398004917,0,0,0,0]
[null,null,null,{"$f":"SUM(D8:D13)","v":0},{"$f":"SUM(E8:E13)","v":0},0,0,{"$f":"SUM(H8:H13)","v":0},2972214.9908992527,3242062.9175413041,3242062.9175413041,3242062.9175413041,3107197.0290644239,1486304.6631303662,0,0,0,0]
[null,"Pro-active Material Costs","AMI 1Ph 1e",0,0,0,0,0,4487700.1223938726,4895834.2956301151,4895834.2956301151,4895834.2956301151,4691915.1909457268,2243998.0431306693,0,0,0,0]
[null,null,"AMI 1Ph 1e + c",0,0,0,0,0,171250.81568584446,186601.98442262335,186601.98442262335,186601.98442262335,178755.83151271415,85625.407842922228,0,0,0,0]
[null,null,"AMI 1Ph 2e + C",0,0,0,0,0,814843.11401215685,888990.34353875136,888990.34353875136,888990.34353875136,852110.83147054981,407615.65970117418,0,0,0,0]
[null,null,"AMI 3Ph",0,0,0,0,0,2086061.6877047287,2275662.324969958,2275662.324969958,2275662.324969958,2181089.3452309468,1043030.8438523643,0,0,0,0]
[null,null,"AMI 3Ph + C",0,0,0,0,0,44308.003273158727,48595.874557657953,48595.874557657953,48595.874557657953,46213.723844047272,22392.216707940428,0,0,0,0]
[null,null,"AMI 3Ph CT",0,0,0,0,0,153456.07054970984,166960.20475808429,166960.20475808429,166960.20475808429,160208.13765389708,76728.035274854919,0,0,0,0]
{"$rows_left_out":53}
{"sheet":"Option 2","index":4,"n_rows":72,"n_cols":18,"rows_kept":72,"cut":false,"hidden":false,"merged":[[7,1,12,1],[14,1,19,1],[24,1,29,1],[31,1,36,1]]}
[]
[null,"Option 2 - Proactive"]
[]
[null,"Expenditure / benefits profile"]
[]
[null,null,null,1,2,3,4,5,6,7,8,9,10,11,12,13,14,15]
[null,null,null,"2026-27","2027-28","2028-29","2029-30","2030-31","2031-32","2032-33","2033-34","2034-35","2035-36","2036-37","2037-38","2038-39","2039-40","2040-41"]
[null," Pro-active Labour Costs","AMI 1Ph 1e",1761293.8732359863,1921348.1437001904,1921348.1437001904,1921348.1437001904,1921348.1437001904,1921348.1437001904,1921348.1437001904,1521096.31785139,560422.24600129481,0,0,0,0,0,0]
[null,null,"AMI 1Ph 1e + c",58307.143521792743,63533.879494861816,63533.879494861816,63533.879494861816,63533.879494861816,63533.879494861816,63533.879494861816,50292.815029753503,18583.950126467807,0,0,0,0,0,0]
[null,null,"AMI 1Ph 2e + C",243914.34540988997,265982.78618507046,265982.78618507046,265982.78618507046,265982.78618507046,265982.78618507046,265982.78618507046,210579.38487053834,77587.991778003096,0,0,0,0,0,0]
[null,null,"AMI 3Ph",743421.09871654911,810990.10441942641,810990.10441942641,810990.10441942641,810990.10441942641,810990.10441942641,810990.10441942641,641986.57216978376,236572.53795252001,0,0,0,0,0,0]
[null,null,"AMI 3Ph + C",15069.346595605726,16527.670459696601,16527.670459696601,16527.670459696601,16527.670459696601,16527.670459696601,16527.670459696601,13124.91477681789,4861.0795469695886,0,0,0,0,0,0]
[null,null,"AMI 3Ph CT",149839.71686482581,163680.33328205871,163680.33328205871,163680.33328205871,163680.33328205871,163680.33328205871,163680.33328205871,129379.67520456846,47539.508563539108,0,0,0,0,0,0]
[null,null,null,{"$f":"SUM(D8:D13)","v":2971845.5243446496},{"$f":"SUM(E8:E13)","v":3242062.9175413041},3242062.9175413041,3242062.9175413041,3242062.9175413041,3242062.9175413041,{"$f":"SUM(J8:J13)","v":3242062.9175413041},2566459.679902852,945567.31396879454,0,{"$f":"SUM(N8:N13)","v":0},0,0,0,0]
[null,"Pro-active Material Costs","AMI 1Ph 1e",4487931.6407894818,4895763.9937971253,4895763.9937971253,4895763.9937971253,4895763.9937971253,4895763.9937971253,4895763.9937971253,3875887.1516604493,1428005.1547618867,0,0,0,0,0,0]
[null,null,"AMI 1Ph 1e + c",171248.35660624399,186599.30490760051,186599.30490760051,186599.30490760051,186599.30490760051,186599.30490760051,186599.30490760051,147710.2358774973,54581.149515934339,0,0,0,0,0,0]
[null,null,"AMI 1Ph 2e + C",815219.61307149578,888977.57806367869,888977.57806367869,888977.57806367869,888977.57806367869,888977.57806367869,888977.57806367869,703806.26595172472,259317.47691988532,0,0,0,0,0,0]
[null,null,"AMI 3Ph",2086031.7328591354,2275629.6475501247,2275629.6475501247,2275629.6475501247,2275629.6475501247,2275629.6475501247,2275629.6475501247,1801407.5251935252,663820.03704758885,0,0,0,0,0,0]
[null,null,"AMI 3Ph + C",44307.36703147689,48595.176744200457,48595.176744200457,48595.176744200457,48595.176744200457,48595.176744200457,48595.176744200457,38590.287414512131,14292.699042411899,0,0,0,0,0,0]
[null,null,"AMI 3Ph CT",152840.05152614065,166957.80728959944,166957.80728959944,166957.80728959944,166957.80728959944,166957.80728959944,166957.80728959944,131970.32561494072,48491.421970141011,0,0,0,0,0,0]
{"$rows_left_out":53}
{"sheet":"Option 1","index":5,"n_rows":50,"n_cols":18,"rows_kept":50,"cut":false,"hidden":false,"merged":[]}
[]
[null,"Option 1 - Reactive"]
[]
[null,"Expenditure / benefits profile"]
[]
[null,null,null,1,2,3,4,5,6,7,8,9,10,11,12,13,14,15]
[null,null,null,"2026-27","2027-28","2028-29","2029-30","2030-31","2031-32","2032-33","2033-34","2034-35","2035-36","2036-37","2037-38","2038-39","2039-40","2040-41"]
[null,"Labour Costs","AMI 1Ph 1e",1001208.3113057356,1566716.9730289343,2232960.7041105013,2967589.6245532376,3731701.9799301303,4479844.1413843548,5163696.034996043,5737804.0319083715,6162856.8855424626,6410599.6374197509,6467109.5543768844,6333615.1128694527,6028133.9675794411,5581378.0298965955,5031839.5620960649]
[null,null,"AMI 1Ph 1e + c",33168.864300926209,52005.503286637395,73708.587335391581,98278.116447188775,123257.13771084925,148236.15897450974,170758.22732699048,190004.35846456495,203927.0916279167,212116.93466518243,213754.90327263557,209659.98175400271,199422.67795742056,184680.96049034223,166663.30580835763]
[null,null,"AMI 1Ph 2e + C",138817.83948165414,217030.84048754186,309166.57465678133,411130.12047073973,516779.09565146762,620380.61007287912,714973.29715329828,794414.7746147759,853381.64448308921,887778.98523960519,895559.33612500771,877132.18929115974,834545.00549737795,772711.69056602172,696546.15031945042]
[null,null,"AMI 3Ph",383745.22459814034,600509.41903330607,855648.13592828589,1137234.1588428672,1430228.8235698259,1716482.018134925,1978362.205191764,2198756.4220217774,2361588.8551620692,2456488.0120559335,2478268.1464250172,2426929.2582693202,2309731.3923785365,2138601.7651928794,1928060.4662917375]
[null,null,"AMI 3Ph + C",7778.6194175298724,12445.791068047794,17631.537346401044,23335.858252589616,29040.179158778188,34744.500064966764,40448.820971155335,44597.417993837931,48227.440388685209,49783.164272191178,50301.738900026503,49264.589644355859,47190.291133014558,43560.26873816728,39411.671715484685]
[null,null,"AMI 3Ph CT",26745.152497068415,42123.615182882757,60176.593118403936,79566.828678778533,100294.32186400656,120353.18623680787,138406.16417232904,153784.6268581434,165151.31666939746,171837.60479366456,173843.4912309447,169831.71835638443,161808.17260726393,149772.85398358313,135063.0201101955]
[null,null,"Percentage failure",1.0999999999999999E-2,1.7000000000000001E-2,2.4E-2,3.2000000000000001E-2,0.04,4.8000000000000001E-2,5.5E-2,6.0999999999999999E-2,6.6000000000000003E-2,6.8000000000000005E-2,6.9000000000000006E-2,6.7000000000000004E-2,6.4000000000000001E-2,5.8999999999999997E-2,5.3999999999999999E-2]
[null,null,"Efficiency",{"$f":"VLOOKUP(D14,'Labour costs'!$B$82:$D$202,2,FALSE)","v":1},{"$f":"VLOOKUP(E14,'Labour costs'!$B$82:$D$202,2,FALSE)","v":1},{"$f":"VLOOKUP(F14,'Labour costs'!$B$82:$D$202,2,FALSE)","v":0.99315525876460764},{"$f":"VLOOKUP(G14,'Labour costs'!$B$82:$D$202,2,FALSE)","v":0.97946577629382303},{"$f":"VLOOKUP(H14,'Labour costs'!$B$82:$D$202,2,FALSE)","v":0.96577629382303842},{"$f":"VLOOKUP(I14,'Labour costs'!$B$82:$D$202,2,FALSE)","v":0.95208681135225381},{"$f":"VLOOKUP(J14,'Labour costs'!$B$82:$D$202,2,FALSE)","v":0.94010851419031716},{"$f":"VLOOKUP(K14,'Labour costs'!$B$82:$D$202,2,FALSE)","v":0.92984140233722878},{"$f":"VLOOKUP(L14,'Labour costs'!$B$82:$D$202,2,FALSE)","v":0.92128547579298836},{"$f":"VLOOKUP(M14,'Labour costs'!$B$82:$D$202,2,FALSE)","v":0.91786310517529213},{"$f":"VLOOKUP(N14,'Labour costs'!$B$82:$D$202,2,FALSE)","v":0.91615191986644406},{"$f":"VLOOKUP(O14,'Labour costs'!$B$82:$D$202,2,FALSE)","v":0.91957429048414019},{"$f":"VLOOKUP(P14,'Labour costs'!$B$82:$D$202,2,FALSE)","v":0.92470784641068449},{"$f":"VLOOKUP(Q14,'Labour costs'!$B$82:$D$202,2,FALSE)","v":0.93326377295492491},{"$f":"VLOOKUP(R14,'Labour costs'!$B$82:$D$202,2,FALSE)","v":0.94181969949916522}]
[null,null,null,{"$f":"SUM(D8:D13)*D15","v":1591464.0116010548},{"$f":"SUM(E8:E13)*E15","v":2490832.1420873501},3524998.1462800177,4620272.007914653,5728310.4168055179,6778896.7657086374,7715136.6022331314,8479560.0081903897,9024113.9818249699,9351744.0154887997,9416976.4075928684,9256832.8459148146,8859470.0698031336,8278708.1479736306,7532282.3256810335]
[null,"Material Costs","AMI 1Ph 1e",739541.12261800223,1157253.3068042849,1649373.3094625629,2192005.9368558945,2756416.462338591,3309030.6263562148,3814156.873706752,4238220.9448357662,4552185.6422907701,4735180.4804027919,4776921.4517407399,4678315.9687250061,4452672.7468546471,4122677.0966394152,3716761.2739182049]
[null,null,"AMI 1Ph 1e + c",33268.045011932612,52161.008845869655,73928.988915405818,98571.985220541086,123625.69813076194,148679.41104098281,171268.82432069012,190572.50475971276,204536.86933262274,212751.20143433451,214394.06785467686,210286.90180382098,200018.98667668129,185233.18889360011,167161.65826983424]
[null,null,"AMI 1Ph 2e + C",147406.10317131659,230457.91941238285,328293.82859688503,436565.56809440075,548750.74395929649,658761.78850898123,759206.65527173667,843562.95030192973,906177.93218001106,942703.33827555855,950965.037273361,931397.85543646046,886175.92408006836,820517.15836069139,739639.47343483625]
[null,null,"AMI 3Ph",355842.65496228926,556845.66817071754,793432.94687537465,1054544.5166652708,1326235.1924135052,1591674.5782772668,1834513.1468663968,2038882.239243387,2189874.9333760343,2277873.860211303,2298070.3352226764,2250464.3584101535,2141788.08811086,1983101.498735785,1787868.9069591777]
{"$rows_left_out":31}
{"sheet":"Unit rate buildup","index":6,"n_rows":2,"n_cols":2,"rows_kept":2,"cut":false,"hidden":false,"merged":[]}
[]
[null,"Information in this sheet has been deleted because it contains confidential pricing information"]

{"sheet":"Labour costs","index":7,"n_rows":202,"n_cols":11,"rows_kept":202,"cut":false,"hidden":false,"merged":[[38,7,38,8],[37,7,37,8],[53,7,53,8],[54,7,54,8],[71,7,93,11]]}
[]
[null,"Labour cost estimation"]
[]
[null,"Labour rates",2024,"2026-06-01",null,null,null,"Escallation factor to $2026"]
[null,"Specialist metering (Office hours)",175.90826169265964,{"$f":"$H$5*C5","v":199.02405199438837},null,null,null,{"$f":"1.025*1.025*1.025*1.025*1.025","v":1.1314082128906247}]
[null,"Specialist metering (After hours)",234.09907576364884,{"$f":"C6*$H$5","v":264.86161694909686}]
[null,"Faults (Linesman) rate",197.86936413283024,{"$f":"C7*$H$5","v":223.87102365932972}]
[]
[null,"Electrician charge out rates",126.74,{"$f":"C9*$H$5","v":143.39467690175778}]
[null,"Project manager",159.28,{"$f":"C10*$H$5","v":180.2107001492187}]
[]
[]
[null,"Assumptions",null,null,null,null,null,"Blended rates","Overall percentage"]
[null,"Percentage of failed meters will result in faults truck (i.e. hot water / heating complaints)",null,0.1,null,null,null,{"$f":"D14*(2*D7)","v":44.77420473186595},{"$f":"H14/H19","v":0.17239401489386924}]
[null,"Percentage of meters that have an antenna connected",null,0.05]
[null,"Percentage time increase for 3 phase tasks",null,0.8]
[null,"Percentage of jobs that require 2 person crews",null,0.15,null,null,null,{"$f":"D17*(2*D5)","v":59.707215598316509}]
[null,"Percentage refusals and double visits",null,0.03,null,null,null,{"$f":"D18*(2*D5)","v":11.941443119663301}]
[null,null,null,null,null,null,null,{"$f":"((1-(D14+D17+D18))*D5)+SUM(H14:H18)","v":259.72018088580541}]
[]
{"$rows_left_out":183}
{"sheet":"Replacement program breakdown","index":8,"n_rows":215,"n_cols":15,"rows_kept":215,"cut":false,"hidden":false,"merged":[]}
[]
[null,"Program level costs"]
[]
[null,"Assumptions"]
[null,"Working days per year",251]
[null,"Project duration (days)",{"$f":"C5*5","v":1255}]
[null,"Labour rate - Project management (daily)",900]
[null,"Labour rate - SME metering (daily)",1200]
[]
[]
[null,"Project element (Activity","Category","Scope","Time FTE","Duration","Cost","Notes",null,"2026-27","2027-28","2028-29","2029-30","2030-31"]
[null,null,null,null,null,null,null,null,null,0.2,0.4,0.6,0.8,1]
[null,"1.0 ProgramManagement ","High level category"]
[null,"1.1 Industry Planning & Liaison","Program management","Partially in scope",0.2,1,{"$f":"F14*E14*$C$7*$C$6","v":225900},"There will be a some industry communications etc",null,{"$f":"IF($F14>=$J$12,1,$F14*5)*$C$5*$C$7*$E14","v":45180},{"$f":"IF($F14>=K$12,1,IF((($F14-K$12)>=0),($F14-K$12)*5,0))*$C$5*$C$7*$E14","v":45180},{"$f":"IF($F14>=L$12,1,IF((($F14-L$12)>=0),($F14-L$12)*5,0))*$C$5*$C$7*$E14","v":45180},{"$f":"IF($F14>=M$12,1,IF((($F14-M$12)>=0),($F14-M$12)*5,0))*$C$5*$C$7*$E14","v":45180},{"$f":"IF($F14>=N$12,1,IF((($F14-N$12)>=0),($F14-N$12)*5,0))*$C$5*$C$7*$E14","v":45180}]
[null,"1.2 PMO: ProgramEstablishment ","Program management","In scope",2,0.2,{"$f":"F15*E15*$C$7*$C$6","v":451800},"Establish the PMO in the first year",null,451800,{"$f":"IF($F15>=K$12,1,IF((($F15-K$12)>=0),($F15-K$12)*5,0))*$C$5*$C$7*$E15","v":0},0,0,0]
[null,"1.3 PMO: ProgramOperation Mode ","Program management","In scope",1,0.8,{"$f":"F16*E16*$C$7*$C$6","v":903600},null,null,225900,225900,225900,225900,0]
[null,"1.4 PMO: ProgramClose-Down","Program management","Out of scope",null,null,null,"Will not close down until next EDPR",null,0,0,0,0,0]
[null,"1.5 ProgramManagement Tools ","Program management","In scope",0,0.2,{"$f":"F18*E18*$C$7*$C$6","v":0},"Should already have tools, no cost",null,0,0,0,0,0]
[null,"1.6 Commercial & Procurement ","Procurement","In scope",0.5,0.2,{"$f":"F19*E19*$C$7*$C$6","v":112950},"Only in the first year",null,112950,0,0,0,0]
[null,"1.7 Management of the AMI Program","Program management","In scope",1,1,{"$f":"F20*E20*$C$7*$C$6","v":1129500},"PMO manager",null,225900,225900,225900,225900,225900]
{"$rows_left_out":195}