{"text_format":"1","workbook":"xlsx","n_sheets":7,"sheets":["Index","Input|Rate of return","Input|Indicators","Calc|Rate of return","Output|Rate of return","Lookup|Tables","Check|List"],"not_rendered":{"charts":0,"images":4,"macros":0,"external_links":0,"defined_names":432,"comments":2,"pivot_tables":0},"unopened":[],"bounds":{"document_bytes":16777216,"sheet_cells":100000,"rows_first":2000,"rows_last":500,"rows_between":2000,"halvings":0,"cell_chars":16384,"cell_head_chars":4096},"cells_cut":0,"cells_raw":0,"read":"whole","date_system":"1900"}

{"sheet":"Index","index":0,"n_rows":19,"n_cols":8,"rows_kept":19,"cut":false,"hidden":false,"merged":[[0,2,0,4],[1,2,1,4]]}
[null,null,"EDPR 2027-31 JEN - Rate of Return Model"]
[null,null,"Index",null,null,null,"Overall Check:",{"$f":"'Check|List'!$H$2","v":"OK"}]
[]
[]
[null,"Copyright Jemena Limited. All rights reserved. Jemena is not liable for any loss caused by reliance on this document."]
[]
[null,"Model Index"]
[]
[null,null,"Description of model"]
[]
[null,null,"Sheet Name","Sheet Description"]
[null,null,"Input|Rate of return","Inputs the forecast inflation and bond yield data"]
[null,null,"Input|Indicators","Controls timing and flags in the model"]
[null,null,"Calc|Rate of return","Calculates the rate of return and inflation estimates"]
[null,null,"Output|Rate of return","Outputs the rate of return and inflation estimates"]
[null,null,"Lookup|Tables","Includes the lookup tables used within the model"]
[null,null,"Check|List","Shows checks on the calculations within the model"]
[]
[null,"End"]

{"sheet":"Input|Rate of return","index":1,"n_rows":119,"n_cols":28,"rows_kept":119,"cut":false,"hidden":false,"merged":[[0,2,0,4],[1,2,1,4],[2,12,2,16],[2,18,2,22],[2,23,2,27]]}
[null,null,{"$f":"Index!$C$1","v":"EDPR 2027-31 JEN - Rate of Return Model"},null,null,null,"Section Check",{"$f":"IF(COUNTA($A$8:$A$119)=COUNTIF($A$8:$A$119,\"OK\"),\"OK\",\"Check\")","v":"OK"},null,"Back to Index",null,"Key:","Input","Internal links","External links","Drop-down","Calculation","Unique","Empty"]
[null,null,{"$f":"Index!$C$12","v":"Input|Rate of return"},null,null,null,"Overall Check: ",{"$f":"+Overall_Check","v":"OK"}]
[null,null,null,null,null,null,null,null,null,null,null,"Prior","Previous Regulatory Period",null,null,null,null,"Intermediate Period","Current Regulatory Period",null,null,null,null,"Next Regulatory Period"]
[null,null,null,"Source","Unit","Basis","Timing",null,null,null,null,{"$f":"+'Input|Indicators'!L$16","v":2015},{"$f":"+'Input|Indicators'!M$16","v":2016},{"$f":"+'Input|Indicators'!N$16","v":2017},{"$f":"+'Input|Indicators'!O$16","v":2018},{"$f":"+'Input|Indicators'!P$16","v":2019},{"$f":"+'Input|Indicators'!Q$16","v":2020},{"$f":"+'Input|Indicators'!R$16","v":2021},{"$f":"+'Input|Indicators'!S$16","v":2022},{"$f":"+'Input|Indicators'!T$16","v":2023},{"$f":"+'Input|Indicators'!U$16","v":2024},{"$f":"+'Input|Indicators'!V$16","v":2025},{"$f":"+'Input|Indicators'!W$16","v":2026},{"$f":"+'Input|Indicators'!X$16","v":2027},{"$f":"+'Input|Indicators'!Y$16","v":2028},{"$f":"+'Input|Indicators'!Z$16","v":2029},{"$f":"+'Input|Indicators'!AA$16","v":2030},{"$f":"+'Input|Indicators'!AB$16","v":2031}]
[]
[null,"Copyright Jemena Limited. All rights reserved. Jemena is not liable for any loss caused by reliance on this document."]
[]
[null,"Input | Inflation"]
[]
[null,null,"Opex Inflation (unlagged)","Source","Unit","Basis",{"$f":"+G$4","v":"Timing"},null,null,null,null,{"$f":"+'Input|Indicators'!L$18","v":"CY15"},{"$f":"+'Input|Indicators'!M$18","v":"CY16"},{"$f":"+'Input|Indicators'!N$18","v":"CY17"},{"$f":"+'Input|Indicators'!O$18","v":"CY18"},{"$f":"+'Input|Indicators'!P$18","v":"CY19"},{"$f":"+'Input|Indicators'!Q$18","v":"CY20"},{"$f":"+'Input|Indicators'!R$18","v":"HY21"},{"$f":"+'Input|Indicators'!S$18","v":"FY22"},{"$f":"+'Input|Indicators'!T$18","v":"FY23"},{"$f":"+'Input|Indicators'!U$18","v":"FY24"},{"$f":"+'Input|Indicators'!V$18","v":"FY25"},{"$f":"+'Input|Indicators'!W$18","v":"FY26"},{"$f":"+'Input|Indicators'!X$18","v":"FY27"},{"$f":"+'Input|Indicators'!Y$18","v":"FY28"},{"$f":"+'Input|Indicators'!Z$18","v":"FY29"},{"$f":"+'Input|Indicators'!AA$18","v":"FY30"},{"$f":"+'Input|Indicators'!AB$18","v":"FY31"}]
[]
[null,null,"Actual inflation","ABS",{"$f":"percent","v":"Per cent"},"n/a",{"$f":"+Not_Applicable","v":"n/a"},null,null,null,null,1.6885553470919357E-2,1.4760147601476037E-2,1.9090909090909047E-2,1.7841213202497874E-2,1.8404907975460238E-2,8.6058519793459354E-3,1.3651877133105783E-2,6.1447811447811418E-2,6.0269627279936566E-2,3.8145100972326373E-2]
[null,null,"Forecast inflation","RBA",{"$f":"percent","v":"Per cent"},"n/a",{"$f":"+Not_Applicable","v":"n/a"},null,null,null,null,null,null,null,null,null,null,null,null,null,null,2.5000000000000001E-2,3.1E-2]
[]
[{"$f":"IF(SUM(L15:AB15)=0,\"Ok\",\"Check\")","v":"Ok"},null,"Check: Only one active input per period",null,null,null,null,null,null,null,null,{"$f":"+IF(OR(COUNTBLANK(L12:L13)=2,COUNTBLANK(L12:L13)=1),0,1)","v":0},0,0,0,0,0,0,0,0,0,0,0]
[]
[null,null,"Capex Inflation (18 month lag)","Source","Unit","Basis",{"$f":"+G$4","v":"Timing"},null,null,null,null,{"$f":"+'Input|Indicators'!L$18","v":"CY15"},{"$f":"+'Input|Indicators'!M$18","v":"CY16"},{"$f":"+'Input|Indicators'!N$18","v":"CY17"},{"$f":"+'Input|Indicators'!O$18","v":"CY18"},{"$f":"+'Input|Indicators'!P$18","v":"CY19"},{"$f":"+'Input|Indicators'!Q$18","v":"CY20"},{"$f":"+'Input|Indicators'!R$18","v":"HY21"},{"$f":"+'Input|Indicators'!S$18","v":"FY22"},{"$f":"+'Input|Indicators'!T$18","v":"FY23"},{"$f":"+'Input|Indicators'!U$18","v":"FY24"},{"$f":"+'Input|Indicators'!V$18","v":"FY25"},{"$f":"+'Input|Indicators'!W$18","v":"FY26"},{"$f":"+'Input|Indicators'!X$18","v":"FY27"},{"$f":"+'Input|Indicators'!Y$18","v":"FY28"},{"$f":"+'Input|Indicators'!Z$18","v":"FY29"},{"$f":"+'Input|Indicators'!AA$18","v":"FY30"},{"$f":"+'Input|Indicators'!AB$18","v":"FY31"}]
[]
[null,null,"Actual inflation","ABS",{"$f":"percent","v":"Per cent"},"n/a",{"$f":"+Not_Applicable","v":"n/a"},null,null,null,null,2.3076923076923217E-2,1.5108593012275628E-2,1.0232558139534831E-2,1.9337016574585641E-2,2.0776874435411097E-2,1.5929203539823078E-2,1.2195121951219523E-2,8.6058519793459354E-3,3.4982935153583528E-2,7.8318219291014124E-2,4.0519877675840865E-2]
[null,null,"Forecast inflation (year to Dec)","RBA",{"$f":"percent","v":"Per cent"},"n/a",{"$f":"+Not_Applicable","v":"n/a"},null,null,null,null,null,null,null,null,null,null,null,null,null,null,null,2.5999999999999999E-2,3.6999999999999998E-2]
{"$rows_left_out":100}
{"sheet":"Input|Indicators","index":2,"n_rows":20,"n_cols":32,"rows_kept":20,"cut":false,"hidden":false,"merged":[]}
[null,null,null,{"$f":"Model_Name","v":"EDPR 2027-31 JEN - Rate of Return Model"},null,null,"Section Check: ",{"$f":"IF(SUM(A7:A20)=0,\"Ok\",\"Check\")","v":"Ok"},null,null,null,"Legend:","Input","Internal links","External links","Drop-down","Calculation","Unique","Empty"]
[null,null,null,{"$f":"RIGHT(CELL(\"filename\",D1),LEN(CELL(\"filename\",D1))-FIND(\"]\",CELL(\"filename\",D1)))","v":"Input|Indicators"},null,null,"Overall Check: ",{"$f":"_xlfn.SINGLE(Overall_Check)","v":"OK"}]
[null,null,null,null,"Source","Unit","Basis","Timing",null,null,"Year",{"$f":"+'Input|Indicators'!L$16","v":2015},{"$f":"+'Input|Indicators'!M$16","v":2016},{"$f":"+'Input|Indicators'!N$16","v":2017},{"$f":"+'Input|Indicators'!O$16","v":2018},{"$f":"+'Input|Indicators'!P$16","v":2019},{"$f":"+'Input|Indicators'!Q$16","v":2020},{"$f":"+'Input|Indicators'!R$16","v":2021},{"$f":"+'Input|Indicators'!S$16","v":2022},{"$f":"+'Input|Indicators'!T$16","v":2023},{"$f":"+'Input|Indicators'!U$16","v":2024},{"$f":"+'Input|Indicators'!V$16","v":2025},{"$f":"+'Input|Indicators'!W$16","v":2026},{"$f":"+'Input|Indicators'!X$16","v":2027},{"$f":"+'Input|Indicators'!Y$16","v":2028},{"$f":"+'Input|Indicators'!Z$16","v":2029},{"$f":"+'Input|Indicators'!AA$16","v":2030},{"$f":"+'Input|Indicators'!AB$16","v":2031},{"$f":"+'Input|Indicators'!AC$16","v":2032},{"$f":"+'Input|Indicators'!AD$16","v":2033},{"$f":"+'Input|Indicators'!AE$16","v":2034},{"$f":"+'Input|Indicators'!AF$16","v":2035}]
[]
[null,"Copyright Jemena Limited. All rights reserved. Jemena is not liable for any loss caused by reliance on this document."]
[]
[null,"Timing"]
[]
[null,null,null,"Assumption",{"$f":"+E$3","v":"Source"},{"$f":"+F$3","v":"Unit"},{"$f":"+G$3","v":"Basis"},{"$f":"+H$3","v":"Timing"},null,null,null,"Constant"]
[]
[null,null,null,"Base year (year ending)","Input",{"$f":"+Year","v":"year"},{"$f":"+Not_Applicable","v":"n/a"},{"$f":"+Not_Applicable","v":"n/a"},null,null,null,2015]
[]
[null,null,null,"Counters",{"$f":"+E$3","v":"Source"},{"$f":"+F$3","v":"Unit"},{"$f":"+G$3","v":"Basis"},{"$f":"+H$3","v":"Timing"},null,null,null,"Series"]
[]
[null,null,null,"Period counter","Input",{"$f":"+number","v":"number"},{"$f":"+Not_Applicable","v":"n/a"},"n/a",null,null,null,1,{"$f":"+L15+1","v":2},{"$f":"+M15+1","v":3},4,5,6,7,8,9,10,11,12,13,14,15,16,17,18,19,20,21]
[null,null,null,"Year","Calculation",{"$f":"+Year","v":"year"},"n/a","n/a",null,null,null,{"$f":"+$L$11","v":2015},{"$f":"+L16+1","v":2016},2017,2018,2019,2020,2021,2022,2023,2024,2025,2026,2027,2028,2029,2030,2031,2032,2033,2034,2035]
[null,null,null,"Prefix","Input","text","n/a","n/a",null,null,null,"CY",{"$f":"+L17","v":"CY"},{"$f":"+M17","v":"CY"},{"$f":"+N17","v":"CY"},{"$f":"+O17","v":"CY"},{"$f":"+P17","v":"CY"},"HY","FY",{"$f":"+S17","v":"FY"},{"$f":"+T17","v":"FY"},"FY","FY","FY","FY","FY","FY","FY","FY","FY","FY","FY"]
[null,null,null,"Presentation year","Calculation",{"$f":"+Year","v":"year"},"n/a","n/a",null,null,null,{"$f":"+L$17&RIGHT(L$16,2)","v":"CY15"},{"$f":"+M$17&RIGHT(M$16,2)","v":"CY16"},"CY17","CY18","CY19","CY20","HY21","FY22","FY23","FY24","FY25","FY26","FY27","FY28","FY29","FY30","FY31","FY32","FY33","FY34","FY35"]
[]
[null,"End"]
{"$rows_left_out":1}
{"sheet":"Calc|Rate of return","index":3,"n_rows":101,"n_cols":28,"rows_kept":101,"cut":false,"hidden":false,"merged":[[2,23,2,27],[41,10,41,11],[0,2,0,4],[1,2,1,4],[2,12,2,16],[2,18,2,22],[41,14,41,15],[41,18,41,19],[41,20,41,21]]}
[null,null,{"$f":"Index!$C$1","v":"EDPR 2027-31 JEN - Rate of Return Model"},null,null,null,"Section Check:",{"$f":"IF(COUNTA($A$8:$A$101)=COUNTIF($A$8:$A$101,\"OK\"),\"OK\",\"Check\")","v":"OK"},null,"Back to Index",null,"Key:","Input","Internal links","External links","Drop-down","Calculation","Unique","Empty"]
[null,null,{"$f":"Index!$C$14","v":"Calc|Rate of return"},null,null,null,"Overall Check:",{"$f":"'Check|List'!$H$2","v":"OK"}]
[null,null,null,null,null,null,null,null,null,null,null,"Prior","Previous Regulatory Period",null,null,null,null,"Intermediate Period","Current Regulatory Period",null,null,null,null,"Next Regulatory Period"]
[null,null,null,"Source","Unit","Basis","Timing",null,null,null,null,{"$f":"+'Input|Indicators'!L$3","v":2015},{"$f":"+'Input|Indicators'!M$3","v":2016},{"$f":"+'Input|Indicators'!N$3","v":2017},{"$f":"+'Input|Indicators'!O$3","v":2018},{"$f":"+'Input|Indicators'!P$3","v":2019},{"$f":"+'Input|Indicators'!Q$3","v":2020},{"$f":"+'Input|Indicators'!R$3","v":2021},{"$f":"+'Input|Indicators'!S$3","v":2022},{"$f":"+'Input|Indicators'!T$3","v":2023},{"$f":"+'Input|Indicators'!U$3","v":2024},{"$f":"+'Input|Indicators'!V$3","v":2025},{"$f":"+'Input|Indicators'!W$3","v":2026},{"$f":"+'Input|Indicators'!X$3","v":2027},{"$f":"+'Input|Indicators'!Y$3","v":2028},{"$f":"+'Input|Indicators'!Z$3","v":2029},{"$f":"+'Input|Indicators'!AA$3","v":2030},{"$f":"+'Input|Indicators'!AB$3","v":2031}]
[]
[null,"Copyright Jemena Limited. All rights reserved. Jemena is not liable for any loss caused by reliance on this document."]
[]
[null,"Calc | Forecast inflation"]
[]
[null,null,"Inflation",{"$f":"+D$4","v":"Source"},{"$f":"+E$4","v":"Unit"},{"$f":"+F$4","v":"Basis"},{"$f":"+G$4","v":"Timing"},null,null,null,null,{"$f":"+'Input|Indicators'!L$18","v":"CY15"},{"$f":"+'Input|Indicators'!M$18","v":"CY16"},{"$f":"+'Input|Indicators'!N$18","v":"CY17"},{"$f":"+'Input|Indicators'!O$18","v":"CY18"},{"$f":"+'Input|Indicators'!P$18","v":"CY19"},{"$f":"+'Input|Indicators'!Q$18","v":"CY20"},{"$f":"+'Input|Indicators'!R$18","v":"HY21"},{"$f":"+'Input|Indicators'!S$18","v":"FY22"},{"$f":"+'Input|Indicators'!T$18","v":"FY23"},{"$f":"+'Input|Indicators'!U$18","v":"FY24"},{"$f":"+'Input|Indicators'!V$18","v":"FY25"},{"$f":"+'Input|Indicators'!W$18","v":"FY26"},{"$f":"+'Input|Indicators'!X$18","v":"FY27"},{"$f":"+'Input|Indicators'!Y$18","v":"FY28"},{"$f":"+'Input|Indicators'!Z$18","v":"FY29"},{"$f":"+'Input|Indicators'!AA$18","v":"FY30"},{"$f":"+'Input|Indicators'!AB$18","v":"FY31"}]
[]
[null,null,"Inflation (Capex and Pricing)","Inputs|Rate of return",{"$f":"+percent","v":"Per cent"},{"$f":"+Not_Applicable","v":"n/a"},"n/a",null,null,null,null,{"$f":"+'Input|Rate of return'!L$19","v":2.3076923076923217E-2},{"$f":"+'Input|Rate of return'!M$19","v":1.5108593012275628E-2},{"$f":"+'Input|Rate of return'!N$19","v":1.0232558139534831E-2},{"$f":"+'Input|Rate of return'!O$19","v":1.9337016574585641E-2},{"$f":"+'Input|Rate of return'!P$19","v":2.0776874435411097E-2},{"$f":"+'Input|Rate of return'!Q$19","v":1.5929203539823078E-2},{"$f":"+'Input|Rate of return'!R$19","v":1.2195121951219523E-2},{"$f":"+'Input|Rate of return'!S$19","v":8.6058519793459354E-3},{"$f":"+'Input|Rate of return'!T$19","v":3.4982935153583528E-2},{"$f":"+'Input|Rate of return'!U$19","v":7.8318219291014124E-2},{"$f":"+'Input|Rate of return'!V$19","v":4.0519877675840865E-2},{"$f":"+'Input|Rate of return'!W$20","v":2.5999999999999999E-2},{"$f":"+X14","v":2.4999999999999911E-2},{"$f":"+Y14","v":2.4999999999999911E-2},{"$f":"+Z14","v":2.4999999999999911E-2},{"$f":"+AA14","v":2.4999999999999911E-2},{"$f":"+AB14","v":2.4999999999999911E-2}]
[null,null,"Inflation (Opex)","Inputs|Rate of return",{"$f":"+percent","v":"Per cent"},"n/a","n/a",null,null,null,null,{"$f":"+'Input|Rate of return'!L$12","v":1.6885553470919357E-2},{"$f":"+'Input|Rate of return'!M$12","v":1.4760147601476037E-2},{"$f":"+'Input|Rate of return'!N$12","v":1.9090909090909047E-2},{"$f":"+'Input|Rate of return'!O$12","v":1.7841213202497874E-2},{"$f":"+'Input|Rate of return'!P$12","v":1.8404907975460238E-2},{"$f":"+'Input|Rate of return'!Q$12","v":8.6058519793459354E-3},{"$f":"+'Input|Rate of return'!R$12","v":1.3651877133105783E-2},{"$f":"+'Input|Rate of return'!S$12","v":6.1447811447811418E-2},{"$f":"+'Input|Rate of return'!T$12","v":6.0269627279936566E-2},{"$f":"+'Input|Rate of return'!U$12","v":3.8145100972326373E-2},{"$f":"+'Input|Rate of return'!V$13","v":2.5000000000000001E-2},{"$f":"+'Input|Rate of return'!W$13","v":3.1E-2},{"$f":"+X14","v":2.4999999999999911E-2},{"$f":"+Y14","v":2.4999999999999911E-2},{"$f":"+Z14","v":2.4999999999999911E-2},{"$f":"+AA14","v":2.4999999999999911E-2},{"$f":"+AB14","v":2.4999999999999911E-2}]
[null,null,"Expected inflation - Glide Path","Inputs|Rate of return",{"$f":"+percent","v":"Per cent"},"n/a","n/a",null,null,null,null,null,null,null,null,null,null,null,null,null,null,null,null,{"$f":"PRODUCT(1+'Input|Rate of return'!$X$26:$AB$26)^(1/Reg_Period_Length)-1","v":2.4999999999999911E-2},{"$f":"PRODUCT(1+'Input|Rate of return'!$X$26:$AB$26)^(1/Reg_Period_Length)-1","v":2.4999999999999911E-2},{"$f":"PRODUCT(1+'Input|Rate of return'!$X$26:$AB$26)^(1/Reg_Period_Length)-1","v":2.4999999999999911E-2},{"$f":"PRODUCT(1+'Input|Rate of return'!$X$26:$AB$26)^(1/Reg_Period_Length)-1","v":2.4999999999999911E-2},{"$f":"PRODUCT(1+'Input|Rate of return'!$X$26:$AB$26)^(1/Reg_Period_Length)-1","v":2.4999999999999911E-2}]
[]
[null,"Calc | Inflation Indices"]
[]
[null,null,"Inflation indices",{"$f":"+D$4","v":"Source"},{"$f":"+E$4","v":"Unit"},"From",{"$f":"+$G$4","v":"Timing"},"To",{"$f":"+$G$4","v":"Timing"}]
[]
[null,null,{"$f":"+\"Opex - Dec-Dec Lagged Index: Real \"&$L$4&\" to Nominal\"","v":"Opex - Dec-Dec Lagged Index: Real 2015 to Nominal"},"Calculated","factor",{"$f":"+Not_Applicable","v":"n/a"},{"$f":"+Not_Applicable","v":"n/a"},null,null,null,null,1,{"$f":"+L20*(1+M$13)","v":1.014760147601476},1.0341328413284132,1.0525830258302584,1.0719557195571958,1.0811808118081183,1.0959409594095944,1.1632841328413286,1.2333948339483396,1.2804428044280447,1.3124538745387457,1.3531399446494468,1.3869684432656828,1.4216426543473248,1.4571837207060079,1.493613313723658,1.5309536465667493]
{"$rows_left_out":82}
{"sheet":"Output|Rate of return","index":4,"n_rows":54,"n_cols":28,"rows_kept":54,"cut":false,"hidden":false,"merged":[[0,2,0,4],[1,2,1,4],[2,12,2,16],[2,18,2,22],[2,23,2,27]]}
[null,null,{"$f":"Index!$C$1","v":"EDPR 2027-31 JEN - Rate of Return Model"},null,null,null,"Section Check:",{"$f":"IF(COUNTA($A$8:$A$54)=COUNTIF($A$8:$A$54,\"OK\"),\"OK\",\"Check\")","v":"OK"},null,"Back to Index",null,"Key:","Input","Internal links","External links","Drop-down","Calculation","Unique","Empty"]
[null,null,{"$f":"Index!$C$15","v":"Output|Rate of return"},null,null,null,"Overall Check:",{"$f":"'Check|List'!$H$2","v":"OK"}]
[null,null,null,null,null,null,null,null,null,null,null,"Prior","Previous Regulatory Period",null,null,null,null,"Intermediate Period","Current Regulatory Period",null,null,null,null,"Next Regulatory Period"]
[null,null,null,"Source","Unit","Basis","Timing",null,null,null,null,{"$f":"+'Input|Indicators'!L$18","v":"CY15"},{"$f":"+'Input|Indicators'!M$18","v":"CY16"},{"$f":"+'Input|Indicators'!N$18","v":"CY17"},{"$f":"+'Input|Indicators'!O$18","v":"CY18"},{"$f":"+'Input|Indicators'!P$18","v":"CY19"},{"$f":"+'Input|Indicators'!Q$18","v":"CY20"},{"$f":"+'Input|Indicators'!R$18","v":"HY21"},{"$f":"+'Input|Indicators'!S$18","v":"FY22"},{"$f":"+'Input|Indicators'!T$18","v":"FY23"},{"$f":"+'Input|Indicators'!U$18","v":"FY24"},{"$f":"+'Input|Indicators'!V$18","v":"FY25"},{"$f":"+'Input|Indicators'!W$18","v":"FY26"},{"$f":"+'Input|Indicators'!X$18","v":"FY27"},{"$f":"+'Input|Indicators'!Y$18","v":"FY28"},{"$f":"+'Input|Indicators'!Z$18","v":"FY29"},{"$f":"+'Input|Indicators'!AA$18","v":"FY30"},{"$f":"+'Input|Indicators'!AB$18","v":"FY31"}]
[]
[null,"Copyright Jemena Limited. All rights reserved. Jemena is not liable for any loss caused by reliance on this document."]
[]
[null,"Inputs for JEN Revenue Model"]
[]
[null,null,"Rate of return","Source","Unit","Basis",null,null,null,null,null,null,null,null,null,null,null,null,null,null,null,null,null,{"$f":"+'Input|Indicators'!X18","v":"FY27"},{"$f":"+'Input|Indicators'!Y18","v":"FY28"},{"$f":"+'Input|Indicators'!Z18","v":"FY29"},{"$f":"+'Input|Indicators'!AA18","v":"FY30"},{"$f":"+'Input|Indicators'!AB18","v":"FY31"}]
[]
[{"$f":"IF(ISERROR(X12),\"Check\",\"Ok\")","v":"Ok"},null,"Cost of equity (post-tax)","Calc|Rate of return",{"$f":"+percent","v":"Per cent"},{"$f":"+Nominal","v":"Nominal"},null,null,null,null,null,null,null,null,null,null,null,null,null,null,null,null,null,{"$f":"Cost_of_Equity","v":7.6744388602158126E-2}]
[{"$f":"IF(ISERROR(X13),\"Check\",\"Ok\")","v":"Ok"},null,"Cost of debt (pre-tax)","Calc|Rate of return",{"$f":"+percent","v":"Per cent"},{"$f":"+Nominal","v":"Nominal"},null,null,null,null,null,null,null,null,null,null,null,null,null,null,null,null,null,{"$f":"+INDEX('Calc|Rate of return'!$M$87:$AB$87,MATCH('Output|Rate of return'!X$10,'Calc|Rate of return'!$M$72:$AB$72,0))","v":4.7493932104883979E-2},{"$f":"+INDEX('Calc|Rate of return'!$M$87:$AB$87,MATCH('Output|Rate of return'!Y$10,'Calc|Rate of return'!$M$72:$AB$72,0))","v":4.8782410552917141E-2},{"$f":"+INDEX('Calc|Rate of return'!$M$87:$AB$87,MATCH('Output|Rate of return'!Z$10,'Calc|Rate of return'!$M$72:$AB$72,0))","v":5.0026104347984809E-2},{"$f":"+INDEX('Calc|Rate of return'!$M$87:$AB$87,MATCH('Output|Rate of return'!AA$10,'Calc|Rate of return'!$M$72:$AB$72,0))","v":5.1774090329149855E-2},{"$f":"+INDEX('Calc|Rate of return'!$M$87:$AB$87,MATCH('Output|Rate of return'!AB$10,'Calc|Rate of return'!$M$72:$AB$72,0))","v":5.4667717370483905E-2}]
[{"$f":"IF(ISERROR(X14),\"Check\",\"Ok\")","v":"Ok"},null,"Leverage","Inputs|Rate of return",{"$f":"+percent","v":"Per cent"},{"$f":"+Nominal","v":"Nominal"},null,null,null,null,null,null,null,null,null,null,null,null,null,null,null,null,null,{"$f":"Leverage","v":0.6}]
[{"$f":"IF(ISERROR(X15),\"Check\",\"Ok\")","v":"Ok"},null,"Gamma","Inputs|Rate of return",{"$f":"+percent","v":"Per cent"},{"$f":"+Nominal","v":"Nominal"},null,null,null,null,null,null,null,null,null,null,null,null,null,null,null,null,null,{"$f":"Gamma","v":0.56999999999999995}]
[{"$f":"IF(ISERROR(X16),\"Check\",\"Ok\")","v":"Ok"},null,"Tax rate","Inputs|Rate of return",{"$f":"+percent","v":"Per cent"},{"$f":"+Nominal","v":"Nominal"},null,null,null,null,null,null,null,null,null,null,null,null,null,null,null,null,null,{"$f":"Tax","v":0.3}]
[]
[{"$f":"IF(ISERROR(X18),\"Check\",\"Ok\")","v":"Ok"},null,"Nominal vanilla WACC","Calc",{"$f":"+percent","v":"Per cent"},{"$f":"+Nominal","v":"Nominal"},null,null,null,null,null,null,null,null,null,null,null,null,null,null,null,null,null,{"$f":"$X$12*(1-$X$14)+X13*$X$14","v":5.919411470379364E-2},{"$f":"$X$12*(1-$X$14)+Y13*$X$14","v":5.996720177261354E-2},{"$f":"$X$12*(1-$X$14)+Z13*$X$14","v":6.0713418049654133E-2},{"$f":"$X$12*(1-$X$14)+AA13*$X$14","v":6.176220963835316E-2},{"$f":"$X$12*(1-$X$14)+AB13*$X$14","v":6.3498385863153595E-2}]
[]
[null,null,"Debt and equity raising costs","Source","Unit","Basis",null,null,null,null,null,null,null,null,null,null,null,null,null,null,null,null,null,"Estimates"]
{"$rows_left_out":35}
{"sheet":"Lookup|Tables","index":5,"n_rows":90,"n_cols":19,"rows_kept":90,"cut":false,"hidden":false,"merged":[[0,2,0,6]]}
[null,null,{"$f":"Index!$C$1","v":"EDPR 2027-31 JEN - Rate of Return Model"},null,null,null,null,null,null,"Back to Index",null,"Key:","Input","Internal links","External links","Drop-down","Calculation","Unique","Empty"]
[null,null,{"$f":"Index!$C$16","v":"Lookup|Tables"},null,null,null,"Overall Check:",{"$f":"'Check|List'!$H$2","v":"OK"}]
[]
[]
[null,"Copyright Jemena Limited. All rights reserved. Jemena is not liable for any loss caused by reliance on this document."]
[]
[null,"Lookup table"]
[]
[null,null,"Financial Unit Denomination","Source",null,null,"Ref"]
[null,null,"Dollars","Reg Team",null,null,"$dollars"]
[null,null,"Thousands","Reg Team",null,null,"$000"]
[null,null,"Millions","Reg Team",null,null,"$millions"]
[]
[null,null,"Non-financial Unit Denomination"]
[null,null,"Percent","Reg Team",null,null,"Per cent"]
[null,null,"Unit","Reg Team",null,null,"unit"]
[null,null,"Number","Reg Team",null,null,"number"]
[null,null,"Factor","Reg Team",null,null,"factor"]
[null,null,"Elec Energy  - Kilowatts/hr","Reg Team",null,null,"kWh"]
[null,null,"Elec Energy  - Gigawatts/hr","Reg Team",null,null,"GWh"]
{"$rows_left_out":71}
{"sheet":"Check|List","index":6,"n_rows":15,"n_cols":19,"rows_kept":15,"cut":false,"hidden":false,"merged":[[0,2,0,6]]}
[null,null,{"$f":"Index!$C$1","v":"EDPR 2027-31 JEN - Rate of Return Model"},null,null,null,null,null,null,"Back to Index",null,"Key:","Input","Internal links","External links","Drop-down","Calculation","Unique","Empty"]
[null,null,{"$f":"Index!$C$17","v":"Check|List"},null,null,null,"Overall Check:",{"$f":"IF(COUNTA($G$10:$G$13)=COUNTIF($G$10:$G$13,\"OK\"),\"OK\",\"Check\")","v":"OK"}]
[]
[]
[null,"Copyright Jemena Limited. All rights reserved. Jemena is not liable for any loss caused by reliance on this document."]
[]
[null,"Check List"]
[]
[null,null,"Sheet","Source","Unit","Basis","Status"]
[null,null,"Input|Rate of return","Input|Rate of return","Ok/Check",{"$f":"+Not_Applicable","v":"n/a"},{"$f":"+'Input|Rate of return'!H1","v":"OK"}]
[null,null,"Input|Indicators","Input|Indicators","Ok/Check",{"$f":"+Not_Applicable","v":"n/a"}]
[null,null,"Calc|Rate of return","Calc|Rate of return","Ok/Check",{"$f":"+Not_Applicable","v":"n/a"},{"$f":"'Calc|Rate of return'!H1","v":"OK"}]
[null,null,"Output|Rate of return","Output|Rate of return","Ok/Check",{"$f":"+Not_Applicable","v":"n/a"},{"$f":"'Output|Rate of return'!H1","v":"OK"}]
[]
[null,"End"]