{"text_format":"1","workbook":"xlsx","n_sheets":4,"sheets":["Business & other details","7.5 EBSS","AER lookups","AER ETL"],"not_rendered":{"charts":0,"images":1,"macros":0,"external_links":0,"defined_names":389,"comments":2,"pivot_tables":0},"unopened":[],"bounds":{"document_bytes":16777216,"sheet_cells":100000,"rows_first":2000,"rows_last":500,"rows_between":2000,"halvings":0,"cell_chars":16384,"cell_head_chars":4096},"cells_cut":0,"cells_raw":0,"read":"whole","date_system":"1900"}

{"sheet":"Business & other details","index":0,"n_rows":77,"n_cols":79,"rows_kept":77,"cut":false,"hidden":false,"merged":[[72,25,74,34],[72,37,74,81],[76,25,76,34],[76,37,76,52],[66,25,66,34],[66,37,66,52],[68,25,68,34],[68,37,68,52],[70,25,70,34],[70,37,70,52],[56,25,56,34],[56,37,56,44],[58,25,58,34],[58,37,58,44],[64,25,64,34],[64,37,64,52],[54,37,54,44],[54,46,54,53],[54,55,54,62],[54,64,54,71],[54,73,54,80],[52,73,52,80],[48,25,48,34],[48,37,48,44],[48,46,48,53],[48,55,48,62],[48,64,48,71],[48,73,48,80],[52,25,52,34],[52,37,52,44],[52,46,52,53],[52,55,52,62],[52,64,52,71],[36,21,36,35],[36,37,36,58],[36,60,36,66],[36,68,36,89],[44,25,44,34],[44,37,44,44],[44,46,44,53],[44,55,44,62],[44,64,44,71],[44,73,44,80],[34,21,34,35],[34,37,34,58],[34,60,34,66],[34,68,34,89],[35,21,35,35],[35,37,35,58],[35,60,35,66],[35,68,35,89],[27,21,27,35],[27,37,27,51],[27,60,27,66],[27,68,27,82],[28,21,28,35],[28,37,28,40],[28,49,28,51],[28,60,28,66],[28,68,28,71],[28,80,28,82],[25,21,25,35],[25,37,25,58],[25,60,25,66],[25,68,25,89],[26,21,26,35],[26,37,26,58],[26,60,26,66],[26,68,26,89],[18,21,18,35],[18,37,18,58],[19,21,19,35],[19,37,19,48],[20,21,20,35],[20,37,20,48],[11,16,11,93],[0,7,2,15],[3,21,3,57],[6,21,6,75],[8,16,8,93],[10,16,10,93]]}
[null,null,null,null,null,null,null,null,null,null,null,null,null,null,null,null,null,null,null,null,null,{"$f":"INDEX(dms_Worksheet_List,MATCH(dms_MODEL,dms_Model_List))","v":"REGULATORY REPORTING STATEMENT"}]
[null,null,null,null,null,null,null,null,null,null,null,null,null,null,null,null,null,null,null,null,null,{"$f":"INDEX(dms_TradingNameFull_List,MATCH(dms_TradingName,dms_TradingName_List))","v":"Jemena Electricity"}]
[null,null,null,null,null,null,null,null,null,null,null,null,null,null,null,null,null,null,null,null,null,"REGULATORY PERIOD FROM 2026-27 TO 2030-31"]
[null,null,null,null,null,null,null,null,null,null,null,null,null,null,null,null,null,null,null,null,null,"BUSINESS & OTHER DETAILS"]
[]
[null,null,null,null,null,null,null,null,null,null,null,null,null,null,null,null,null,null,null,null,null,"INSTRUCTIONS"]
[null,null,null,null,null,null,null,null,null,null,null,null,null,null,null,null,null,null,null,null,null,"Complete the following business details regulatory template before entering data or values in any other regulatory template. This regulatory template is linked to other cells within the spreadsheet and automatically generates column headings and conditional formatting to distinguish business specific input and non-input cells. "]
[]
[null,null,null,null,null,null,null,null,null,null,null,null,null,null,null,null,"SUBMISSION PARTICULARS INPUT SHEET"]
[]
[null,null,null,null,null,null,null,null,null,null,null,null,null,null,null,null,"DRAFT TEMPLATE ONLY"]
[null,null,null,null,null,null,null,null,null,null,null,null,null,null,null,null,"DO NOT USE FOR SUBMISSIONS"]
[]
[]
[null,null,null,null,null,null,null,null,null,null,null,null,null,null,null,null,null,null,null,null,null,"ENTITY DETAILS"]
[]
[null,null,null,null,null,null,null,null,null,null,null,null,null,null,null,null,null,null,null,null,null,"Business Name"]
[]
[null,null,null,null,null,null,null,null,null,null,null,null,null,null,null,null,null,null,null,null,null,"Short name",null,null,null,null,null,null,null,null,null,null,null,null,null,null,null,"Jemena Electricity"]
[null,null,null,null,null,null,null,null,null,null,null,null,null,null,null,null,null,null,null,null,null,"ACN/ABN",null,null,null,null,null,null,null,null,null,null,null,null,null,null,null,{"$f":"INDEX(dms_ABN_List,MATCH(dms_TradingName,dms_TradingName_List))","v":82064651083}]
[null,null,null,null,null,null,null,null,null,null,null,null,null,null,null,null,null,null,null,null,null,"UID",null,null,null,null,null,null,null,null,null,null,null,null,null,null,null,{"$f":"INDEX(dms_UID_List,MATCH(dms_TradingName,dms_TradingName_List))","v":"EDDVIC300"}]
[]
[]
[null,null,null,null,null,null,null,null,null,null,null,null,null,null,null,null,null,null,null,null,null,"Business Address",null,null,null,null,null,null,null,null,null,null,null,null,null,null,null,null,null,null,null,null,null,null,null,null,null,null,null,null,null,null,null,null,null,null,null,null,null,null,null,null,null,null,null,null,null,null,"Postal Address"]
[]
[null,null,null,null,null,null,null,null,null,null,null,null,null,null,null,null,null,null,null,null,null,"Address 1",null,null,null,null,null,null,null,null,null,null,null,null,null,null,null,null,null,null,null,null,null,null,null,null,null,null,null,null,null,null,null,null,null,null,null,null,null,null,"Address 1"]
[null,null,null,null,null,null,null,null,null,null,null,null,null,null,null,null,null,null,null,null,null,"Address 2",null,null,null,null,null,null,null,null,null,null,null,null,null,null,null,null,null,null,null,null,null,null,null,null,null,null,null,null,null,null,null,null,null,null,null,null,null,null,"Address 2"]
[null,null,null,null,null,null,null,null,null,null,null,null,null,null,null,null,null,null,null,null,null,"Suburb",null,null,null,null,null,null,null,null,null,null,null,null,null,null,null,null,null,null,null,null,null,null,null,null,null,null,null,null,null,null,null,null,null,null,null,null,null,null,"Suburb"]
[null,null,null,null,null,null,null,null,null,null,null,null,null,null,null,null,null,null,null,null,null,"State",null,null,null,null,null,null,null,null,null,null,null,null,null,null,null,{"$f":"INDEX(dms_State_List,MATCH(dms_TradingName,dms_TradingName_List))","v":"Vic"},null,null,null,null,null,null,null,null,null,"Post code",null,null,null,null,null,null,null,null,null,null,null,null,"State",null,null,null,null,null,null,null,{"$f":"INDEX(dms_PState_List,MATCH(dms_TradingName,dms_TradingName_List))","v":"Vic"},null,null,null,null,null,null,null,null,null,"Post code"]
[]
{"$rows_left_out":48}
{"sheet":"7.5 EBSS","index":1,"n_rows":82,"n_cols":25,"rows_kept":82,"cut":false,"hidden":false,"merged":[[55,14,55,18],[55,19,55,23],[56,14,56,24],[59,11,59,13],[58,11,58,13],[60,11,60,13],[61,11,61,13],[62,11,62,13],[73,2,73,8],[63,11,63,13],[64,11,64,13],[72,4,72,8],[72,2,72,3],[38,2,38,9],[39,5,39,9],[39,2,39,4],[49,20,49,25],[50,20,50,25],[39,14,39,18],[38,11,38,18],[39,11,39,13],[7,1,7,13],[25,2,25,3],[25,5,25,9],[26,5,26,9],[25,11,25,18],[26,11,26,13],[26,14,26,18],[26,2,26,4]]}
[null,{"$f":"INDEX(dms_Worksheet_List,MATCH(dms_MODEL,dms_Model_List))","v":"REGULATORY REPORTING STATEMENT"}]
[null,{"$f":"_xlfn.SINGLE(INDEX(dms_TradingNameFull_List,MATCH(_xlfn.SINGLE(dms_TradingName),dms_TradingName_List)))","v":"Jemena Electricity"}]
[null,{"$f":"'Business & other details'!V3","v":"REGULATORY PERIOD FROM 2026-27 TO 2030-31"}]
[null,"7.5 EBSS"]
[]
[null,"Instructions"]
[null,{"$f":"CONCATENATE(_xlfn.SINGLE(dms_TradingName), \" is required to populate all input cells (yellow) in this worksheet.\")","v":"Jemena Electricity is required to populate all input cells (yellow) in this worksheet."}]
[null,"\nEfficiency gains are calculated using the formulae outlined on page 6 and 7 of version 2 of the AER's Efficiency benefit sharing scheme.  All terms and definitions are as set out in the AER's  Efficiency benefit sharing scheme."]
[]
[]
[]
[null,"Actual and estimated inflation"]
[null,null,"Actual",null,null,null,null,null,null,null,null,null,"Estimated"]
[null,null,2015,2016,2017,2018,2019,2020,"HY2021","2021-22","2022-23","2023-24","2024-25","2025-26"]
[null,"ABS CPI index - December/June",108.4,110,112.1,114.1,116.2,117.2,118.8,126.1,133.69999999999999,138.80000000000001,142.27000000000001,146.68037000000001]
[null,"Inflation rate (per cent) ",null,{"$f":"+D15/C15-1","v":1.4760147601476037E-2},1.9090909090909047E-2,1.7841213202497874E-2,1.8404907975460238E-2,8.6058519793459354E-3,1.3651877133105783E-2,6.1447811447811418E-2,6.0269627279936566E-2,3.8145100972326373E-2,2.4999999999999911E-2,3.0999999999999917E-2]
[null,"Reconstructed cumulative index (2025-26=1)",{"$f":"D17/(1+D16)","v":0.73902186093476585},0.74992993268288044,0.76424677685228082,0.77788186653742419,0.79219871070682468,0.79901625554939626,0.80992432729751085,0.85969240464828378,0.91150574545182828,0.94627522414894394,0.96993210475266745,1]
[]
[]
[]
[null,"7.5.1 -  The carryover amounts that arise from applying the EBSS during the current regulatory control period"]
[]
[null,"Base year used to forecast opex for the current period (drop down menu)",2018]
[null,{"$f":"\"Non-recurrent efficiency adjustment made to \"&dms_PRCP_BaseYear&\" opex, \"&\"$m, real June 2021\"","v":"Non-recurrent efficiency adjustment made to 2018 opex, $m, real June 2021"}]
[null,"7.5.1.1 - Opex allowance applicable to EBSS (EBSS target)"]
[null,null,"$m, real December 2015",null,"$m, real Dec 2020","$m, real June 2021",null,null,null,null,null,"$m, real June 2026"]
[null,null,"Previous period",null,null,"Current regulatory control period",null,null,null,null,null,"Previous period",null,null,"Current regulatory control period"]
[null,null,{"$f":"dms_PRCP_BaseYear","v":2018},2020,"HY2021","2021-22","2022-23","2023-24","2024-25","2025-26",null,{"$f":"dms_PRCP_BaseYear","v":2018},{"$f":"D28","v":2020},{"$f":"E28","v":"HY2021"},"2021-22","2022-23","2023-24","2024-25","2025-26"]
[null,"Total opex allowance",89.714278320310214,91.983331818592859,56.594030650698336,99.386239191558531,101.30329650911582,103.77869636121616,107.268438063057,109.36670517071171,null,{"$f":"+C29/$C$17","v":121.39597360060959},{"$f":"+D29/$C$17","v":124.46632052568241},{"$f":"+E29/$H$17","v":70.829636140236971},{"$f":"+F29/$I$17","v":122.71052472665242},{"$f":"+G29/$I$17","v":125.07748328431666},{"$f":"+H29/$I$17","v":128.13381801667376},{"$f":"+I29/$I$17","v":132.44254363982563},{"$f":"+J29/$I$17","v":135.03323888990664}]
[null,"Approved excludable costs - allowance "]
{"$rows_left_out":53}
{"sheet":"AER lookups","index":2,"n_rows":99,"n_cols":38,"rows_kept":99,"cut":false,"hidden":true,"merged":[[5,37,7,37],[17,1,17,4],[4,25,4,36],[5,25,5,28],[5,30,7,34],[5,35,7,35],[5,36,7,36]]}
[null,"AER LOOKUP TABLES"]
[]
[null,"Template number",5]
[]
[null,null,null,null,null,null,null,null,null,null,null,null,null,null,null,null,null,null,null,null,null,null,null,null,null,"FOR ELECTRICITY BUSINESSES ONLY"]
[null,null,null,null,null,null,null,null,null,null,null,null,null,null,null,null,null,null,null,null,null,null,null,null,null,"Feeder Types",null,null,null,"TasNetworks (D)","Feeder Names"]
[]
[null,null,null,null,null,null,null,null,null,null,null,null,null,null,null,null,null,null,null,null,null,null,null,null,null,"CBD","Urban","Short rural","long rural","EXTRA"]
[null,"dms_TradingName_List","dms_TradingNameFull_List","dms_ABN_List","dms_UID_List","dms_JurisdictionList","dms_Sector_List","dms_Segment_List","dms_FormControl_List","dms_RPT_List","dms_RPTMonth_List","dms_CRCPlength_List","dms_FRCPlength_List","dms_PRCPlength_List","dms_663_List","dms_Addr1_List","dms_Addr2_List","dms_Suburb_List","dms_State_List","dms_PostCode_List","dms_PAddr1_List","dms_PAddr2_List","dms_PSuburb_List","dms_PState_List","dms_PPostCode_List","dms_CBD_flag","dms_Urban_flag","dms_ShortRural_flag","dms_LongRural_flag","dms_FeederType_5_flag","dms_FeederName_1","dms_FeederName_2","dms_FeederName_3","dms_FeederName_4","dms_FeederName_5","dms_MAIFI_flag_List","dms_Public_Lighting_List","Name"]
[null,"AusNet (D)","AusNet Electricity Services Pty Ltd",91064651118,"EDDVIC100","Vic","Electricity","Distribution","Revenue cap","Financial","June",5,5,5,2,"Level 32","2 Southbank Boulevard","SOUTHBANK","Vic",3006,"Locked Bag 14051",null,"MELBOURNE CITY MAIL CENTRE","Vic",8001,"NO","YES","YES","YES","NO","CBD","Urban","Short rural","Long rural",null,"YES","YES",{"$f":"B10","v":"AusNet (D)"}]
[null,"Australian Distribution Co. (Vic)","Australian Distribution Co. (Victoria)",11222333444,"UID_123","Vic","Electricity","Distribution","Revenue cap","Financial","June",5,5,5,2,"123 Straight Street",null,"MELBOURNE","Vic",3000,"PO Box 123",null,"MELBOURNE","Vic",3000,"NO","NO","NO","NO","NO","CBD","Urban","Short rural","Long rural",null,"YES","YES","Australian Distribution Co. (Vic)"]
[null,"CitiPower","CitiPower",76064651056,"EDDVIC200","Vic","Electricity","Distribution","Revenue cap","Financial","June",5,5,5,2,"40 Market Street",null,"MELBOURNE","Vic",3000,"Locked Bag 14090",null,"MELBOURNE","Vic",8001,"YES","YES","NO","NO","NO","CBD","Urban","Short rural","Long rural",null,"YES","YES","CitiPower"]
[null,"Jemena Electricity","Jemena Electricity",82064651083,"EDDVIC300","Vic","Electricity","Distribution","Revenue cap","Financial","June",5,5,5,2,"Level 16","567 Collins Street","MELBOURNE","Vic",3000,"PO Box 16182",null,"MELBOURNE","Vic",8001,"NO","YES","YES","NO","NO","CBD","Urban","Short rural","Long rural",null,"YES","YES","Jemena Electricity"]
[null,"Powercor Australia","Powercor Australia",89064651109,"EDDVIC400","Vic","Electricity","Distribution","Revenue cap","Financial","June",5,5,5,2,"40 Market Street",null,"MELBOURNE","Vic",3000,"Locked bag 14090",null,"MELBOURNE","Vic",8001,"NO","YES","YES","YES","NO","CBD","Urban","Short rural","Long rural",null,"YES","YES","Powercor Australia"]
[null,"United Energy","United Energy",70064651029,"EDDVIC500","Vic","Electricity","Distribution","Revenue cap","Financial","June",5,5,5,2,"43-45 Centreway",null,"MOUNT WAVERLEY","Vic",3149,"PO Box 449",null,"MOUNT WAVERLEY","Vic",3170,"NO","YES","YES","NO","NO","CBD","Urban","Short rural","Long rural",null,"YES","YES","United Energy"]
[]
[]
[null,"The Reg Year Ending (dms_RYE) must be set to the last year of the regulatory period. For forecast data is is usually (FRCP_y5) for actual it is a single year (CRY). For historical actual data the RYE will need to be set manually in the business details sheet by setting the dms_Multiyear_flag to 1 and putting the correct value in 'dms_Specified_FinalYear. See cells C67:C68"]
[null,"dms_Model_List ","dms_Model_Name_Format1","dms_Worksheet_List","dms_Model_Span_List"]
[null,"ARR","Annual Reporting",{"$f":"IF(dms_MultiYear_ResponseFlag=\"yes\",\"NEW HISTORICAL ANNUAL REPORTING\",\"ANNUAL REPORTING\")","v":{"$error":"#NAME?"}},1]
[null,"CA","Category Analysis",{"$f":"IF(dms_MultiYear_ResponseFlag=\"yes\",\"NEW HISTORICAL CATEGORY ANALYSIS\",\"CATEGORY ANALYSIS\")","v":{"$error":"#NAME?"}},1]
[null,"CESS","Capitlal Expenditure","CAPITLAL EXPENDITURE SHARING SCHEMING",5]
[null,"CPI","CPI","CPI",5]
[null,"EB","Economic Benchmarking",{"$f":"IF(dms_MultiYear_ResponseFlag=\"yes\",\"NEW HISTORICAL ECONOMIC BENCHMARKING\",\"ECONOMIC BENCHMARKING\")","v":{"$error":"#NAME?"}},1]
[null,"EBSS","Efficiency Benefit Sharing Scheme","EFFICIENCY BENEFIT SHARING SCHEME",5]
[null,"Pricing","Pricing Proposal","PRICING PROPOSAL",5]
[null,"Profitability","Profitability","PROFITABILITY",5]
[null,"PTRM","Post Tax Revenue Model","POST TAX REVENUE MODEL",5]
[null,"Reset","Regulatory Reporting (Reset)","REGULATORY REPORTING STATEMENT",5]
[null,"Reset_outputs","Reset Outputs","AER RESET DECISION OUTPUTS",5]
{"$rows_left_out":70}
{"sheet":"AER ETL","index":3,"n_rows":147,"n_cols":10,"rows_kept":147,"cut":false,"hidden":true,"merged":[[72,1,74,1],[33,68,33,89],[34,37,34,58],[34,68,34,89],[35,0,60,0],[35,37,35,58],[35,68,35,89],[33,37,33,58],[12,0,16,0],[13,4,13,8],[15,2,15,4],[19,0,26,0],[27,0,32,0]]}
[null,"AER ETL INFORMATION"]
[]
[null,"USES NAMED RANGES FLAG","yes","dms_Defined_Names_Used"]
[]
[null,"IF THIS IS AN ABC RIN - make sure the the named range CRY is applied and the named range dms_dollar_nom_UOM is applied"]
[null,"IF THIS IS A RESET RIN - make sure the named ranges CRY and dms_dollar_nom_UOM are NOT present in the workbook"]
[null,"FOR ABC RINS THAT SPAN MULTIPLE YEARS - make sure MultiYear Flag is set and final year entered as required"]
[]
[null,"Full trading name",{"$f":"INDEX(dms_TradingNameFull_List,MATCH(dms_TradingName,dms_TradingName_List))","v":"Efficiency Benefit Sharing Scheme"},null,"dms_TradingNameFull"]
[null,"Trading name",{"$f":"dms_TradingName","v":"Jemena Electricity"}]
[null,"Unique ID",{"$f":"INDEX(dms_UID_List,MATCH(dms_TradingName,dms_TradingName_List))","v":5}]
["Selected here","Model / RIN","Reset","dms_Model"]
["Read from Business & other details","Source","Final decision","dms_Source",{"$f":"IF(dms_MODEL=\"Reset\", \"Make sure you have set Reg Proposal as source\",\"\")","v":"Make sure you have set Reg Proposal as source"}]
[null,"Data quality","Consolidated","For DB purposes this is always Consoldiated"]
[null,"Data status","Public","For DB purposes this is always Public"]
[null,"Amendment reason",{"$f":"dms_Amendment_Text","v":0},null,null,"dms_AmendmentReason"]
[null,"Submission date",{"$f":"dms_Typed_Submission_Date","v":"dd/mm/yy"},"dms_SubmissionDate"]
[]
["Redundant","EBSS - First application of scheme in forthcoming period?","No"]
["Pre-populated from lookup table","Data ingestion data quality","Consolidated","dms_DataQuality","Always Consolidated"]
[null,"Sector",{"$f":"INDEX(dms_Sector_List,MATCH(dms_TradingName,dms_TradingName_List))","v":0},"dms_Sector","=INDEX(dms_Sector_List,MATCH(dms_TradingName,dms_TradingName_List))"]
[null,"Segment",{"$f":"INDEX(dms_Segment_List,MATCH(dms_TradingName,dms_TradingName_List))","v":0},"dms_Segment","=INDEX(dms_Segment_List,MATCH(dms_TradingName,dms_TradingName_List))"]
[null,"Regulatory Year Ending",{"$f":"IF(dms_MultiYear_Flag=1,LEFT(dms_Specified_FinalYear,2)&RIGHT(dms_Specified_FinalYear,2),dms_RYE_result)","v":{"$error":"#NAME?"}},"dms_RYE","=IF(dms_MultiYear_Flag=1,LEFT(dms_Specified_FinalYear,2)&RIGHT(dms_Specified_FinalYear,2),dms_RYE_result)"]
[null,"Reporting Period Type",{"$f":"INDEX(dms_RPT_List,MATCH(dms_TradingName,dms_TradingName_List))","v":0},"dms_RPT","=INDEX(dms_RPT_List,MATCH(dms_TradingName,dms_TradingName_List))"]
[null,"EB/CA Unit of Measure for Monetary Values","$0s","dms_dollar_nom_UOM",{"$f":"IF(dms_SingleYearModel=\"yes\",\"This is set to an historical template (EB, CA or ARR), apply UOM Named Range to cell !\",\"This is not an historical template, make sure UOM Named Range is not applied\")","v":{"$error":"#NAME?"}},null,null,null,null,{"$f":"IFERROR(dms_dollar_nom_UOM, \"NR not applied\")","v":"NR not applied"}]
[null,"Security Classification","Public","dms_Classification","Always Public"]
[null,"Jurisdiction",{"$f":"INDEX(dms_JurisdictionList,MATCH(dms_TradingName,dms_TradingName_List))","v":0},"dms_Jurisdiction","=INDEX(dms_JurisdictionList,MATCH(dms_TradingName,dms_TradingName_List))"]
["Relevant for PTRM, RFMs and Reset RINS","$ REAL REFERENCES"]
[null,"Does the named range CRY exist in this file? ",{"$f":"IFERROR(CRY,\"NO\")","v":"2023-24"}]
[null,"CRY-1  (last full calendar year before CRY)",{"$f":"IFERROR(IF(dms_RPT=\"calendar\",CRY-1,LEFT(CRY,4)),\"CRY not present\")","v":"CRY not present"},"dms_Cal_Year_B4_CRY","'=IF(dms_RPT=\"financial\",VALUE(LEFT(dms_SingleYear_FinalYear_Result,4)),VALUE(LEFT(dms_SingleYear_FinalYear_Result,4)-1))"]
{"$rows_left_out":117}