{"text_format":"1","workbook":"xlsx","n_sheets":12,"sheets":["Title Page","Inputs | General","Price Cap >","Inputs | Price Cap","Calc | Price Cap","Output | Price Caps","Exit Fees >","Input | Exit Fees","Calc | Exit Fees","Calc | Tax Allowance","Output | Exit Fee price caps","LUTs and Dropdowns"],"not_rendered":{"charts":0,"images":1,"macros":1,"external_links":0,"defined_names":23,"comments":0,"pivot_tables":0},"unopened":[],"bounds":{"document_bytes":16777216,"sheet_cells":100000,"rows_first":2000,"rows_last":500,"rows_between":2000,"halvings":0,"cell_chars":16384,"cell_head_chars":4096},"cells_cut":0,"cells_raw":0,"read":"whole","date_system":"1900"}

{"sheet":"Title Page","index":0,"n_rows":30,"n_cols":8,"rows_kept":30,"cut":false,"hidden":false,"merged":[[13,1,13,23],[7,1,8,23],[32,4,32,7],[24,1,24,23],[27,4,27,7],[30,4,30,7],[31,4,31,7],[29,4,29,7],[28,4,28,7]]}
[]
[]
[]
[]
[]
[]
[]
[null,"JEN 2027-31 - ACS Standardised Metering Pricing Model "]
[]
[null,"Version",1.02]
{"$rows_left_out":21}
{"sheet":"Inputs | General","index":1,"n_rows":42,"n_cols":23,"rows_kept":42,"cut":false,"hidden":false,"merged":[[35,1,35,6],[38,7,38,11],[4,1,4,6],[1,10,1,11],[1,12,1,13],[20,1,20,6],[23,7,23,11],[29,7,29,11]]}
[null,{"$f":"'Title Page'!B8&\" v\"&'Title Page'!$C$10","v":"JEN 2027-31 - ACS Standardised Metering Pricing Model  v1.02"},null,null,null,null,null,null,null,null,null,null,null,null,null,null,null,null,null,null,null,"Worksheet check:",{"$f":"IF(COUNTA($X$14:$X$46)=COUNTIF($X14:$X47,\"OK\"),\"OK\",\"Check\")","v":"OK"}]
[null,{"$f":"MID(CELL(\"filename\",A1),FIND(\"]\",CELL(\"filename\",A1))+1,255)","v":"Inputs | General"},null,null,null,null,null,null,"Key:","Input","External Link",null,"Internal Link",null,"Jemena modification"]
[]
[]
[null,"1. Inputs - General"]
[]
[null,null,"Inputs","Source","Input Format",null,"Value"]
[null,null,"NSP name","NSP",null,null,"JEN - ACS"]
[null,null,"Decision stage","NSP",null,null,"initial proposal"]
[]
{"$rows_left_out":33}
{"sheet":"Price Cap >","index":2,"n_rows":0,"n_cols":0,"rows_kept":0,"cut":false,"hidden":true,"merged":[]}

{"sheet":"Inputs | Price Cap","index":3,"n_rows":125,"n_cols":22,"rows_kept":125,"cut":false,"hidden":true,"merged":[[94,1,94,7],[1,10,1,11],[40,9,40,13],[38,1,38,7],[6,7,6,11],[4,1,4,6],[14,1,14,6],[4,9,4,11],[14,9,14,11]]}
[null,{"$f":"'Title Page'!B8&\" v\"&'Title Page'!$C$10","v":"JEN 2027-31 - ACS Standardised Metering Pricing Model  v1.02"},null,null,null,null,null,null,null,null,null,null,null,"DNSP:",{"$f":"IF('Inputs | General'!$G$16=\"Exit Fees (Vic)\",\"NOT USED\",NSP)","v":"NOT USED"},null,null,null,null,null,"Worksheet check:",{"$f":"IF(COUNTA($W$4:$W$71)=COUNTIF($W4:$W72,\"OK\"),\"OK\",\"Check\")","v":"OK"}]
[null,{"$f":"MID(CELL(\"filename\",A1),FIND(\"]\",CELL(\"filename\",A1))+1,255)","v":"Inputs | Price Cap"},null,null,null,null,null,"Key:","Input","External Link","Internal Link"]
[]
[]
[null,{"$f":"LEFT('Inputs | General'!B21,1)+1&\". Linked Input -  Inflation & Discount Rates\"","v":"3. Linked Input -  Inflation & Discount Rates"},null,null,null,null,null,null,null,{"$f":"IF('Inputs | General'!$G$16=\"Exit Fees (Vic)\",\"NOT USED\",\"\")","v":"NOT USED"}]
[]
[null,"Linked Inputs - Discount Rates",null,null,null,null,"Base year","Regulatory period"]
[null,null,"Year",null,"Units",null,{"$f":"LEFT(H8,4)-1&\"-\"&RIGHT(H8,2)-1","v":"2025-26"},{"$f":"FPFirstYear","v":"2026-27"},{"$f":"LEFT(H8,4)+1&\"-\"&RIGHT(H8,2)+1","v":"2027-28"},{"$f":"LEFT(I8,4)+1&\"-\"&RIGHT(I8,2)+1","v":"2028-29"},{"$f":"LEFT(J8,4)+1&\"-\"&RIGHT(J8,2)+1","v":"2029-30"},{"$f":"LEFT(K8,4)+1&\"-\"&RIGHT(K8,2)+1","v":"2030-31"},null,"Link from PTRM"]
[null,null,"Nominal Vanilla WACC",null,"%",null,null,5.919411470379364E-2,5.996720177261354E-2,6.0713418049654133E-2,6.176220963835316E-2,6.3498385863153595E-2]
[null,null,"Cumulative Discount Index",null,"Index",null,1,{"$f":"G10*(1+H9)","v":1.0591941147037935},{"$f":"H10*(1+I9)","v":1.1227110218966008},{"$f":"I10*(1+J9)","v":1.1908746455179635},{"$f":"J10*(1+K9)","v":1.2644256950274435},{"$f":"K10*(1+L9)","v":1.3447146857055821}]
{"$rows_left_out":116}
{"sheet":"Calc | Price Cap","index":4,"n_rows":63,"n_cols":14,"rows_kept":63,"cut":false,"hidden":true,"merged":[[7,9,7,13],[4,1,4,7],[1,10,1,11],[0,13,0,14]]}
[null,{"$f":"'Title Page'!B8&\" v\"&'Title Page'!$C$10","v":"JEN 2027-31 - ACS Standardised Metering Pricing Model  v1.02"},null,null,null,null,null,null,null,null,null,null,"DNSP:",{"$f":"IF('Inputs | General'!$G$16=\"Exit Fees (Vic)\",\"NOT USED\",NSP)","v":"NOT USED"}]
[null,{"$f":"MID(CELL(\"filename\",A1),FIND(\"]\",CELL(\"filename\",A1))+1,255)","v":"Calc | Price Cap"},null,null,null,null,null,"Key:","Input","External Link","Internal Link"]
[]
[]
[null,"Annual Charges Calculations"]
[]
[null,"Annual Smoothed Revenue Calculation"]
[null,null,null,null,null,null,null,null,"Base Year Revenue","Annual Revenue"]
["▼ Table Filters",null,"Tariff #","Tariff name","Application","Tariff Code","Other designation",null,{"$f":"LEFT(J9,4)-1&\"-\"&RIGHT(J9,2)-1","v":"2025-26"},{"$f":"FPFirstYear","v":"2026-27"},{"$f":"LEFT(J9,4)+1&\"-\"&RIGHT(J9,2)+1","v":"2027-28"},{"$f":"LEFT(K9,4)+1&\"-\"&RIGHT(K9,2)+1","v":"2028-29"},{"$f":"LEFT(L9,4)+1&\"-\"&RIGHT(L9,2)+1","v":"2029-30"},{"$f":"LEFT(M9,4)+1&\"-\"&RIGHT(M9,2)+1","v":"2030-31"}]
[null,null,"Tariff #","Tariff name","Application","Tariff Code","Other designation","Column1","F-RP-1","F-RP0","F-RP+1","F-RP+2","F-RP+3","F-RP+4"]
{"$rows_left_out":54}
{"sheet":"Output | Price Caps","index":5,"n_rows":70,"n_cols":22,"rows_kept":70,"cut":false,"hidden":true,"merged":[[56,3,57,3],[65,9,65,13],[5,9,5,13],[1,10,1,11],[0,14,0,15]]}
[null,null,{"$f":"'Title Page'!B8&\" v\"&'Title Page'!$C$10","v":"JEN 2027-31 - ACS Standardised Metering Pricing Model  v1.02"},null,null,null,null,null,null,null,null,null,null,"DNSP:",{"$f":"IF('Inputs | General'!$G$16=\"Exit Fees (Vic)\",\"NOT USED\",NSP)","v":"NOT USED"},null,null,null,null,null,"Worksheet check:",{"$f":"IF(COUNTA($W$5:$W$52)=COUNTIF($W5:$W53,\"OK\"),\"OK\",\"Check\")","v":"OK"}]
[null,null,{"$f":"MID(CELL(\"filename\",A1),FIND(\"]\",CELL(\"filename\",A1))+1,255)","v":"Output | Price Caps"},null,null,null,null,"Key:","Input","External Link","Internal Link"]
[]
[]
[null,"RESULT - Price Cap - Annual Charges"]
[null,null,null,null,null,null,null,null,"Base Year Charges","Price Cap - Annual Charges (nominal)"]
["▼ Table Filters",null,"Tariff #","Tariff name","Application","Tariff Code","Other designation",null,{"$f":"LEFT(J7,4)-1&\"-\"&RIGHT(J7,2)-1","v":"2025-26"},{"$f":"FPFirstYear","v":"2026-27"},{"$f":"LEFT(J7,4)+1&\"-\"&RIGHT(J7,2)+1","v":"2027-28"},{"$f":"LEFT(K7,4)+1&\"-\"&RIGHT(K7,2)+1","v":"2028-29"},{"$f":"LEFT(L7,4)+1&\"-\"&RIGHT(L7,2)+1","v":"2029-30"},{"$f":"LEFT(M7,4)+1&\"-\"&RIGHT(M7,2)+1","v":"2030-31"}]
[null,null,"Tariff #","Tariff name","Application","Tariff Code","Other designation","Ca","F-RP-1","F-RP0","F-RP+1","F-RP+2","F-RP+3","F-RP+4","Column1"]
[null,null,1,{"$f":"'Inputs | Price Cap'!D44","v":"Residential Non ToU"},"Non-capital",{"$f":"'Inputs | Price Cap'!F44","v":"R1"},{"$f":"'Inputs | Price Cap'!G44","v":"Primary"},null,{"$f":"ROUND('Inputs | Price Cap'!H44,2)","v":0},{"$f":"ROUND('Output | Price Caps'!I9*(1-'Inputs | Price Cap'!F$109)*(1+'Inputs | General'!H$26),2)","v":0},{"$f":"ROUND('Output | Price Caps'!J9*(1-'Inputs | Price Cap'!G$109)*(1+'Inputs | General'!I$26),2)","v":0},{"$f":"ROUND('Output | Price Caps'!K9*(1-'Inputs | Price Cap'!H$109)*(1+'Inputs | General'!J$26),2)","v":0},{"$f":"ROUND('Output | Price Caps'!L9*(1-'Inputs | Price Cap'!I$109)*(1+'Inputs | General'!K$26),2)","v":0},{"$f":"ROUND('Output | Price Caps'!M9*(1-'Inputs | Price Cap'!J$109)*(1+'Inputs | General'!L$26),2)","v":0}]
[null,null,1,{"$f":"'Inputs | Price Cap'!D45","v":"Residential Non ToU"},"Capital",{"$f":"'Inputs | Price Cap'!F45","v":"R1"},{"$f":"'Inputs | Price Cap'!G45","v":"Primary"},null,{"$f":"ROUND('Inputs | Price Cap'!H45,2)","v":0},{"$f":"ROUND('Output | Price Caps'!I10*(1-'Inputs | Price Cap'!F$125)*(1+'Inputs | General'!H$26),2)","v":0},{"$f":"ROUND('Output | Price Caps'!J10*(1-'Inputs | Price Cap'!G$125)*(1+'Inputs | General'!I$26),2)","v":0},{"$f":"ROUND('Output | Price Caps'!K10*(1-'Inputs | Price Cap'!H$125)*(1+'Inputs | General'!J$26),2)","v":0},{"$f":"ROUND('Output | Price Caps'!L10*(1-'Inputs | Price Cap'!I$125)*(1+'Inputs | General'!K$26),2)","v":0},{"$f":"ROUND('Output | Price Caps'!M10*(1-'Inputs | Price Cap'!J$125)*(1+'Inputs | General'!L$26),2)","v":0}]
{"$rows_left_out":61}
{"sheet":"Exit Fees >","index":6,"n_rows":0,"n_cols":0,"rows_kept":0,"cut":false,"hidden":false,"merged":[]}

{"sheet":"Input | Exit Fees","index":7,"n_rows":139,"n_cols":17,"rows_kept":139,"cut":false,"hidden":false,"merged":[[86,1,86,7],[114,3,114,5],[115,3,115,5],[116,3,116,5],[117,3,117,5],[123,7,123,11],[107,3,107,5],[108,3,108,5],[109,3,109,5],[110,3,110,5],[138,1,138,3],[0,13,0,14],[47,3,47,5],[4,1,4,6],[24,1,24,7],[41,1,41,7],[6,7,6,11],[4,9,4,11],[21,1,21,3],[94,3,94,5],[66,9,66,14],[111,3,111,5],[112,3,112,5],[113,3,113,5],[121,1,121,6],[121,9,121,11]]}
[null,{"$f":"'Title Page'!B8&\" v\"&'Title Page'!$C$10","v":"JEN 2027-31 - ACS Standardised Metering Pricing Model  v1.02"},null,null,null,null,null,null,null,null,null,null,"DNSP:",{"$f":"IF('Inputs | General'!$G$16=\"Price Cap\",\"NOT USED\",NSP)","v":"JEN - ACS"}]
[null,{"$f":"MID(CELL(\"filename\",A1),FIND(\"]\",CELL(\"filename\",A1))+1,255)","v":"Input | Exit Fees"},null,null,null,null,null,"Key:","Input","External Link","Internal Link","Jemena modification"]
[]
[]
[null,{"$f":"LEFT('Inputs | General'!B21,1)+1&\". Linked Input - RAB\"","v":"3. Linked Input - RAB"},null,null,null,null,null,null,null,{"$f":"IF('Inputs | General'!$G$16=\"Price Cap\",\"NOT USED\",\"\")","v":""}]
[]
[null,"Linked Input - RAB Meters",null,null,null,null,"Base Year","Regulatory Period"]
[null,null,null,null,"Units",null,{"$f":"LEFT(H8,4)-1&\"-\"&RIGHT(H8,2)-1","v":"2025-26"},{"$f":"FPFirstYear","v":"2026-27"},{"$f":"LEFT(H8,4)+1&\"-\"&RIGHT(H8,2)+1","v":"2027-28"},{"$f":"LEFT(I8,4)+1&\"-\"&RIGHT(I8,2)+1","v":"2028-29"},{"$f":"LEFT(J8,4)+1&\"-\"&RIGHT(J8,2)+1","v":"2029-30"},{"$f":"LEFT(K8,4)+1&\"-\"&RIGHT(K8,2)+1","v":"2030-31"},{"$f":"LEFT(L8,4)+1&\"-\"&RIGHT(L8,2)+1","v":"2031-32"}]
[null,null,"Opening RAB",null,"$m",null,43.114588863786828,{"$f":"G9+G10-G11","v":41.400155542247752},44.052506830790421,52.178020338116937,64.79051275805206,79.94624277896817,98.182428128678865,"Opening balance of METERS row in PTRM inputs sheet of PTRM (nominal)"]
[null,null,"Gross capital expenditure",null,"$m",null,8.0736489483395282,6.8303053979195871,12.834220319962705,18.140316937170745,21.778637427335564,26.174473152109456,null,"Gross capex from METERS row in ASSETS sheet of PTRM (nominal)"]
{"$rows_left_out":130}
{"sheet":"Calc | Exit Fees","index":8,"n_rows":286,"n_cols":15,"rows_kept":286,"cut":false,"hidden":false,"merged":[[115,6,115,10],[112,1,112,7],[0,13,0,14],[4,1,4,7],[74,10,74,14],[114,6,114,10],[89,10,89,14],[58,10,58,14],[106,10,106,14],[102,1,102,7],[28,10,28,14],[43,10,43,14],[9,10,9,14],[179,1,179,7],[224,6,224,10],[183,10,183,14],[198,10,198,14],[211,1,211,7],[215,10,215,14],[221,1,221,7],[223,6,223,10]]}
[null,{"$f":"'Title Page'!B8&\" v\"&'Title Page'!$C$10","v":"JEN 2027-31 - ACS Standardised Metering Pricing Model  v1.02"},null,null,null,null,null,null,null,null,null,null,"DNSP:",{"$f":"IF('Inputs | General'!$G$16=\"Price Cap\",\"NOT USED\",NSP)","v":"JEN - ACS"}]
[null,{"$f":"MID(CELL(\"filename\",A1),FIND(\"]\",CELL(\"filename\",A1))+1,255)","v":"Calc | Exit Fees"},null,null,null,null,null,"Key:","Input","External Link","Internal Link","Jemena modification"]
[]
[]
[null,"CALCULATION | Meters"]
[]
[null,"Calculation of Allocated Meters RAB by Designated Exit Fee"]
[]
[]
[null,null,null,null,"Average number of meters (Year, Year-1)",null,null,null,null,null,"Average number of meters (Year, Year-1)"]
{"$rows_left_out":277}
{"sheet":"Calc | Tax Allowance","index":9,"n_rows":92,"n_cols":14,"rows_kept":92,"cut":false,"hidden":false,"merged":[[6,6,6,10],[7,6,7,10],[0,13,0,14],[4,1,4,7]]}
[null,{"$f":"'Title Page'!B8&\" v\"&'Title Page'!$C$10","v":"JEN 2027-31 - ACS Standardised Metering Pricing Model  v1.02"},null,null,null,null,null,null,null,null,null,null,"DNSP:",{"$f":"IF('Inputs | General'!$G$16=\"Price Cap\",\"NOT USED\",NSP)","v":"JEN - ACS"}]
[null,{"$f":"MID(CELL(\"filename\",A1),FIND(\"]\",CELL(\"filename\",A1))+1,255)","v":"Calc | Tax Allowance"},null,null,null,null,null,"Key:","Input","External Link","Internal Link","Jemena added sheet"]
[]
[]
[null,"CALCULATION | Tax Allowance"]
[]
[null,null,null,null,null,"Base Year","Regulatory period"]
[null,null,null,null,null,null,"Tariff ($/year)"]
[null,null,null,"Exit Fee Name","Component","2025-26","2026-27","2027-28","2028-29","2029-30","2030-31"]
[null,null,null,"Single Phase"]
{"$rows_left_out":83}
{"sheet":"Output | Exit Fee price caps","index":10,"n_rows":62,"n_cols":14,"rows_kept":62,"cut":false,"hidden":false,"merged":[[59,8,59,12],[49,3,49,4],[50,3,50,4],[51,3,51,4],[52,3,52,4],[53,3,53,4],[61,3,61,4],[48,3,48,4],[28,3,28,4],[29,3,29,4],[30,3,30,4],[31,3,31,4],[32,3,32,4],[33,3,33,4],[43,3,43,4],[44,3,44,4],[45,3,45,4],[46,3,46,4],[17,3,17,4],[60,3,60,4],[14,3,14,4],[47,3,47,4],[27,3,27,4],[0,13,0,14],[23,3,23,4],[24,3,24,4],[25,3,25,4],[26,3,26,4],[22,8,22,12],[6,8,6,12],[7,3,7,4],[8,3,8,4],[9,3,9,4],[10,3,10,4],[11,3,11,4],[12,3,12,4],[13,3,13,4],[15,3,15,4],[16,3,16,4]]}
[null,{"$f":"'Title Page'!B8&\" v\"&'Title Page'!$C$10","v":"JEN 2027-31 - ACS Standardised Metering Pricing Model  v1.02"},null,null,null,null,null,null,null,null,null,null,"DNSP:","D"]
[null,{"$f":"MID(CELL(\"filename\",A1),FIND(\"]\",CELL(\"filename\",A1))+1,255)","v":"Output | Exit Fee price caps"},null,null,null,null,null,"Key:","Input","External Link","Internal Link"]
[]
[]
[null,null,"Applicable Exit Fees Price Caps"]
[]
[null,null,null,null,null,null,null,"Base Year","Regulatory Period"]
[null,null,null,"Exit Fee Name",null,"Units","Basis",{"$f":"LEFT(I8,4)-1&\"-\"&RIGHT(I8,2)-1","v":"2025-26"},{"$f":"FPFirstYear","v":"2026-27"},{"$f":"LEFT(I8,4)+1&\"-\"&RIGHT(I8,2)+1","v":"2027-28"},{"$f":"LEFT(J8,4)+1&\"-\"&RIGHT(J8,2)+1","v":"2028-29"},{"$f":"LEFT(K8,4)+1&\"-\"&RIGHT(K8,2)+1","v":"2029-30"},{"$f":"LEFT(L8,4)+1&\"-\"&RIGHT(L8,2)+1","v":"2030-31"}]
[null,null,null,{"$f":"D25","v":"Single Phase"},null,"$dollars","nominal",{"$f":"ROUND(H25,2)","v":191.96},{"$f":"IF(I25=0,0,ROUND(H9*(1-I45)*(1+I$41),2))","v":191.94},{"$f":"IF(J25=0,0,ROUND(I9*(1-J45)*(1+J$41),2))","v":213.57},249.44,283.83999999999997,320.14999999999998]
[null,null,null,{"$f":"D26","v":"Single Phase, Two Element"},null,"$dollars","nominal",191.96,208.3,231.41,270.39999999999998,308.94,350.05]
{"$rows_left_out":53}
{"sheet":"LUTs and Dropdowns","index":11,"n_rows":23,"n_cols":2,"rows_kept":23,"cut":false,"hidden":false,"merged":[]}
[null,{"$f":"'Title Page'!B8&\" v\"&'Title Page'!$C$10","v":"JEN 2027-31 - ACS Standardised Metering Pricing Model  v1.02"}]
[null,{"$f":"MID(CELL(\"filename\",A1),FIND(\"]\",CELL(\"filename\",A1))+1,255)","v":"LUTs and Dropdowns"}]
[]
[]
[]
[]
[]
[]
[]
[]
{"$rows_left_out":13}