{"text_format":"1","workbook":"xlsx","n_sheets":9,"sheets":["Cover","Summary","Result tables","Option 3","Option 2","Option 1","Unit rate buildup","Labour costs","Replacement program breakdown"],"not_rendered":{"charts":2,"images":2,"macros":0,"external_links":0,"defined_names":4,"comments":0,"pivot_tables":0},"unopened":[],"bounds":{"document_bytes":16777216,"sheet_cells":100000,"rows_first":2000,"rows_last":500,"rows_between":2000,"halvings":0,"cell_chars":16384,"cell_head_chars":4096},"cells_cut":0,"cells_raw":0,"read":"whole","date_system":"1900"}

{"sheet":"Cover","index":0,"n_rows":8,"n_cols":4,"rows_kept":8,"cut":false,"hidden":false,"merged":[]}
[]
[null,null,"Powercor"]
[null,null,"Regulatory proposal 2026-31"]
[]
[null,null,{"$f":"REPLACE(LEFT(_xlfn.TEXTAFTER(CELL(\"filename\"),\" - \",1),FIND(\"Jan2025\",_xlfn.TEXTAFTER(CELL(\"filename\"),\" - \"),1)-4),1,1,UPPER(LEFT(LEFT(_xlfn.TEXTAFTER(CELL(\"filename\"),\" - \",1),FIND(\"Jan2025\",_xlfn.TEXTAFTER(CELL(\"filename\"),\" - \"),1)-4),1)))","v":"Metering business case"}]
[null,null,"Model number:",{"$f":"LEFT(_xlfn.TEXTAFTER(CELL(\"filename\"),\" MOD \"),FIND(\" - \",_xlfn.TEXTAFTER(CELL(\"filename\"),\" MOD \"),1)-1)","v":"12.04"}]
[]
[null,null,"2025-01-31"]

{"sheet":"Summary","index":1,"n_rows":32,"n_cols":4,"rows_kept":32,"cut":false,"hidden":false,"merged":[]}
[]
[null,"Proactive meter replacement - Cost model"]
[]
[]
[null,"Options summary - NPV"]
[]
[null,"Description","NPV","NPV net"]
[null,{"$f":"'Option 3'!B2","v":"Option 3 - Proactive deplayed"},{"$f":"'Option 3'!D50","v":422331353.21736139},{"$f":"$C$10-C8","v":17786851.097462356}]
[null,{"$f":"'Option 2'!B2","v":"Option 2 - Proactive"},{"$f":"'Option 2'!D50","v":402402034.42388684},{"$f":"$C$10-C9","v":37716169.890936911}]
[null,{"$f":"'Option 1'!B2","v":"Option 1 - Reactive"},{"$f":"'Option 1'!D35","v":440118204.31482375},"-"]
[]
[]
[]
[null,"WACC"]
[null,3.6400000000000002E-2,3.6400000000000002E-2]
[]
[]
[]
[null,"Waterfall - NPV"]
[]
{"$rows_left_out":13}
{"sheet":"Result tables","index":2,"n_rows":21,"n_cols":6,"rows_kept":21,"cut":false,"hidden":false,"merged":[]}
[]
[null,"NPV Results"]
[]
[]
[null,"Powercor"]
[]
[null,"option ","gross npv","net npv*","bcr*"]
[null,"Option1 - Base Case ",440118204.31482375,"N/A","N/A"]
[null,"Option 2",402402034.42388684,{"$f":"C8-C9","v":37716169.890936911},{"$f":"C8/C9","v":1.0937275825280919}]
[null,"Option 3",422331353.21736139,{"$f":"C8-C10","v":17786851.097462356},{"$f":"C8/C10","v":1.042115866989179}]
[]
[]
[null,null,"Reactive","Proactive","Move to 2031","Net"]
[null,"Sensitivity analysis","Base Case","Option 2","Option 3"]
[null,"Adopting alternative failure rate profile option 1",546451608.68785405,473903121.94850916,517829275.85123622,{"$f":"C15-D15","v":72548486.739344895}]
[null,"Adopting alternative failure rate profile option 2",296190135.04567873,353939630.72508514,342551115.1863603,-57749495.679406404]
[null,"+10% change in reactive replacement installation costs",464916051.21436369,412094289.97257817,439394177.73899442,52821761.241785526]
[null,"-10% change in reactive replacement installation costs",415320357.41528374,392716442.88403559,405706551.0143562,22603914.531248152]
[null,"\"+10% change in tech capital costs\"",459332177.84676605,425609514.62521601,443666437.24462128,33722663.221550047]
[null,"\"-10% change in tech capital costs\"",420904230.78288138,379201218.23139751,401434291.50872934,41703012.55148387]
{"$rows_left_out":2}
{"sheet":"Option 3","index":3,"n_rows":72,"n_cols":18,"rows_kept":72,"cut":false,"hidden":false,"merged":[[7,1,12,1],[14,1,19,1],[24,1,29,1],[31,1,36,1]]}
[]
[null,"Option 3 - Proactive deplayed"]
[]
[null,"Expenditure / benefits profile"]
[]
[null,null,null,1,2,3,4,5,6,7,8,9,10,11,12,13,14,15]
[null,null,null,"2026-27","2027-28","2028-29","2029-30","2030-31","2031-32","2032-33","2033-34","2034-35","2035-36","2036-37","2037-38","2038-39","2039-40","2040-41"]
[null," Pro-active Labour Costs","AMI 1Ph 1e",0,0,0,0,0,5373721.2526804488,5862228.2003219742,5862228.2003219742,5862228.2003219742,5618047.1408130471,2686860.6263402244,0,0,0,0]
[null,null,"AMI 1Ph 1e + c",0,0,0,0,0,533403.82097946561,581921.40990917536,581921.40990917536,581921.40990917536,557590.20113248518,266774.32480156823,0,0,0,0]
[null,null,"AMI 1Ph 2e + C",0,0,0,0,0,1892185.9682586801,2064242.3731795612,2064242.3731795612,2064242.3731795612,1978214.1707191207,946165.39844117546,0,0,0,0]
[null,null,"AMI 3Ph",0,0,0,0,0,1819038.9096243244,1984388.7455065104,1984388.7455065104,1984388.7455065104,1901809.1850255572,909519.45481216221,0,0,0,0]
[null,null,"AMI 3Ph + C",0,0,0,0,0,274057.34044140851,298850.28007772245,298850.28007772245,298850.28007772245,286453.81025956548,136933.31276056459,0,0,0,0]
[null,null,"AMI 3Ph CT",0,0,0,0,0,287644.11510597082,313520.05014688452,313520.05014688452,313520.05014688452,300281.19966083561,143822.05755298541,0,0,0,0]
[null,null,null,{"$f":"SUM(D8:D13)","v":0},{"$f":"SUM(E8:E13)","v":0},0,0,0,10180051.407090299,11105151.059141828,11105151.059141828,11105151.059141828,10642395.707610613,5090075.1747086812,0,0,0,0]
[null,"Pro-active Material Costs","AMI 1Ph 1e",0,0,0,0,0,10981443.338475384,11979729.46343974,11979729.46343974,11979729.46343974,11480734.382891295,5490721.6692376919,0,0,0,0]
[null,null,"AMI 1Ph 1e + c",0,0,0,0,0,1256407.8768345919,1370688.7996528349,1370688.7996528349,1370688.7996528349,1313377.7697021936,628374.50695881573,0,0,0,0]
[null,null,"AMI 1Ph 2e + C",0,0,0,0,0,5071903.4228531811,5533091.4264007956,5533091.4264007956,5533091.4264007956,5302497.4246269884,2536145.8141216864,0,0,0,0]
[null,null,"AMI 3Ph",0,0,0,0,0,4336716.7343783136,4730922.3758865958,4730922.3758865958,4730922.3758865958,4534046.8940260578,2168358.3671891568,0,0,0,0]
[null,null,"AMI 3Ph + C",0,0,0,0,0,684630.11509171058,746566.03364558832,746566.03364558832,746566.03364558832,715598.07436864951,342076.84247449425,0,0,0,0]
[null,null,"AMI 3Ph CT",0,0,0,0,0,293408.0068910452,319802.45102559531,319802.45102559531,319802.45102559531,306298.31681722082,146704.0034455226,0,0,0,0]
{"$rows_left_out":53}
{"sheet":"Option 2","index":4,"n_rows":70,"n_cols":18,"rows_kept":70,"cut":false,"hidden":false,"merged":[[7,1,12,1],[14,1,19,1],[24,1,29,1],[31,1,36,1]]}
[]
[null,"Option 2 - Proactive"]
[]
[null,"Expenditure / benefits profile"]
[]
[null,null,null,1,2,3,4,5,6,7,8,9,10,11,12,13,14,15]
[null,null,null,"2026-27","2027-28","2028-29","2029-30","2030-31","2031-32","2032-33","2033-34","2034-35","2035-36","2036-37","2037-38","2038-39","2039-40","2040-41"]
[null," Pro-active Labour Costs","AMI 1Ph 1e",5373721.2526804488,5862228.2003219742,5862228.2003219742,5862228.2003219742,5862228.2003219742,5862228.2003219742,5862228.2003219742,4640888.4169063251,1709846.7310571738,0,0,0,0,0,0]
[null,null,"AMI 1Ph 1e + c",533403.82097946561,581921.40990917536,581921.40990917536,581921.40990917536,581921.40990917536,581921.40990917536,581921.40990917536,460699.85189673642,169739.14694214871,0,0,0,0,0,0]
[null,null,"AMI 1Ph 2e + C",1892185.9682586801,2064242.3731795612,2064242.3731795612,2064242.3731795612,2064242.3731795612,2064242.3731795612,2064242.3731795612,1634246.1895010292,602052.58859941317,0,0,0,0,0,0]
[null,null,"AMI 3Ph",1819038.9096243244,1984388.7455065104,1984388.7455065104,1984388.7455065104,1984388.7455065104,1984388.7455065104,1984388.7455065104,1570918.7983409059,578819.78304779041,0,0,0,0,0,0]
[null,null,"AMI 3Ph + C",274057.34044140851,298850.28007772245,298850.28007772245,298850.28007772245,298850.28007772245,298850.28007772245,298850.28007772245,236677.21606665829,87156.718567657401,0,0,0,0,0,0]
[null,null,"AMI 3Ph CT",287042.34917478677,313520.05014688452,313520.05014688452,313520.05014688452,313520.05014688452,313520.05014688452,313520.05014688452,247927.56364782422,91468.421539973977,0,0,0,0,0,0]
[null,null,null,{"$f":"SUM(D8:D13)","v":10179449.641159113},{"$f":"SUM(E8:E13)","v":11105151.059141828},11105151.059141828,11105151.059141828,11105151.059141828,11105151.059141828,{"$f":"SUM(J8:J13)","v":11105151.059141828},8791358.0363594797,3239083.389754157,0,{"$f":"SUM(N8:N13)","v":0},0,0,0,0]
[null,"Pro-active Material Costs","AMI 1Ph 1e",10981285.650214517,11979557.440268785,11979557.440268785,11979557.440268785,11979557.440268785,11979557.440268785,11979557.440268785,9483729.9853243306,3494099.2449987219,0,0,0,0,0,0]
[null,null,"AMI 1Ph 1e + c",1256389.8354199135,1370669.1172189012,1370669.1172189012,1370669.1172189012,1370669.1172189012,1370669.1172189012,1370669.1172189012,1085141.4788136696,399806.92020421906,0,0,0,0,0,0]
[null,null,"AMI 1Ph 2e + C",5071830.5927519491,5533011.973860966,5533011.973860966,5533011.973860966,5533011.973860966,5533011.973860966,5533011.973860966,4380446.7209041705,1613746.6340658134,0,0,0,0,0,0]
[null,null,"AMI 3Ph",4336654.4612054126,4730854.4421096994,4730854.4421096994,4730854.4421096994,4730854.4421096994,4730854.4421096994,4730854.4421096994,3745127.1542198556,1379927.2687941315,0,0,0,0,0,0]
[null,null,"AMI 3Ph + C",684620.28413152997,746555.31331531482,746555.31331531482,746555.31331531482,746555.31331531482,746555.31331531482,746555.31331531482,591241.31705443887,217725.4487460746,0,0,0,0,0,0]
[null,null,"AMI 3Ph CT",292789.97822477552,319797.8588157401,319797.8588157401,319797.8588157401,319797.8588157401,319797.8588157401,319797.8588157401,252891.97280630504,93299.951132423215,0,0,0,0,0,0]
{"$rows_left_out":51}
{"sheet":"Option 1","index":5,"n_rows":50,"n_cols":18,"rows_kept":50,"cut":false,"hidden":false,"merged":[]}
[]
[null,"Option 1 - Reactive"]
[]
[null,"Expenditure / benefits profile"]
[]
[null,null,null,1,2,3,4,5,6,7,8,9,10,11,12,13,14,15]
[null,null,null,"2026-27","2027-28","2028-29","2029-30","2030-31","2031-32","2032-33","2033-34","2034-35","2035-36","2036-37","2037-38","2038-39","2039-40","2040-41"]
[null,"Labour Costs","AMI 1Ph 1e",2951338.5732578896,4618650.018621698,6581933.9099080767,8747958.9266514145,11000309.240122169,13204810.674835442,15220876.318978012,16912852.13483537,18166295.443317451,18896854.097336326,19062598.667052966,18669448.601385821,17768212.503551595,16452121.694015902,14832165.839999704]
[null,null,"AMI 1Ph 1e + c",293012.72146334389,458264.00377011194,653112.5306691369,868185.84137287084,1092138.3254542819,1310664.6480271122,1510939.3364347178,1678657.0557908404,1803458.7704881907,1875972.0197392202,1892250.5042649617,1853280.7988851566,1763502.4902886439,1633274.6140827131,1472462.9184647838]
[null,null,"AMI 1Ph 2e + C",1039356.5725980902,1626368.5903445198,2317464.25157372,3080579.8746440783,3873786.0297165648,4649727.1254435685,5359567.7082478646,5955458.8993719714,6396951.1312064705,6653953.8717492353,6712655.0735238781,6574041.3113501417,6256857.5068031214,5793167.3415244287,5222927.0957136117]
[null,null,"AMI 3Ph",926444.88442651497,1449904.3152240713,2066128.7084414475,2746204.3095581806,3452784.185652005,4144907.184485598,4777997.9345065774,5309288.1738200933,5702635.7092755642,5931536.2658958994,5983942.4459642395,5860456.619366427,5577342.7730202228,5164117.0313319331,4655716.8476804513]
[null,null,"AMI 3Ph + C",139749.81351557313,218660.26856100452,311425.23098082462,413828.11157413252,519845.21148249833,624055.20173333515,719832.01358237024,799947.20839948754,858979.45721210039,893314.54070515069,901145.34922110953,882471.8827599769,840305.99075096776,777659.52262329706,701158.54712123761]
[null,null,"AMI 3Ph CT",51484.418556856697,80235.457491205249,115004.15573739419,152447.36923328997,191896.46916646589,230008.31147478838,265445.63853340404,294865.3062801793,316930.05709026073,329634.00452636823,332308.51977607509,325622.23165180796,310243.7689659936,286841.76053105877,258759.35040913691]
[null,null,"Percentage failure",1.0999999999999999E-2,1.7000000000000001E-2,2.4E-2,3.2000000000000001E-2,0.04,4.8000000000000001E-2,5.5E-2,6.0999999999999999E-2,6.6000000000000003E-2,6.8000000000000005E-2,6.9000000000000006E-2,6.7000000000000004E-2,6.4000000000000001E-2,5.8999999999999997E-2,5.3999999999999999E-2]
[null,null,"Efficiency",{"$f":"VLOOKUP(D14,'Labour costs'!$B$82:$D$202,3,FALSE)","v":1},{"$f":"VLOOKUP(E14,'Labour costs'!$B$82:$D$202,3,FALSE)","v":1},{"$f":"VLOOKUP(F14,'Labour costs'!$B$82:$D$202,3,FALSE)","v":0.99163842301974459},{"$f":"VLOOKUP(G14,'Labour costs'!$B$82:$D$202,3,FALSE)","v":0.97491526905923376},{"$f":"VLOOKUP(H14,'Labour costs'!$B$82:$D$202,3,FALSE)","v":0.95819211509872282},{"$f":"VLOOKUP(I14,'Labour costs'!$B$82:$D$202,3,FALSE)","v":0.94146896113821199},{"$f":"VLOOKUP(J14,'Labour costs'!$B$82:$D$202,3,FALSE)","v":0.9268362014227649},{"$f":"VLOOKUP(K14,'Labour costs'!$B$82:$D$202,3,FALSE)","v":0.91429383595238178},{"$f":"VLOOKUP(L14,'Labour costs'!$B$82:$D$202,3,FALSE)","v":0.90384186472706252},{"$f":"VLOOKUP(M14,'Labour costs'!$B$82:$D$202,3,FALSE)","v":0.89966107623693481},{"$f":"VLOOKUP(N14,'Labour costs'!$B$82:$D$202,3,FALSE)","v":0.89757068199187096},{"$f":"VLOOKUP(O14,'Labour costs'!$B$82:$D$202,3,FALSE)","v":0.90175147048199866},{"$f":"VLOOKUP(P14,'Labour costs'!$B$82:$D$202,3,FALSE)","v":0.90802265321719022},{"$f":"VLOOKUP(Q14,'Labour costs'!$B$82:$D$202,3,FALSE)","v":0.9184746244425096},{"$f":"VLOOKUP(R14,'Labour costs'!$B$82:$D$202,3,FALSE)","v":0.92892659566782887}]
[null,null,null,{"$f":"SUM(D8:D13)*D15","v":5401386.9838182684},{"$f":"SUM(E8:E13)*E15","v":8452082.6540126111},11944353.017413031,15607617.847255586,19289134.987048369,22749818.988528352,25816706.293406866,28298371.400318883,30048449.267232858,31111417.907559428,31311663.986681189,30808628.852879003,29525686.852854196,27652682.647507619,25214031.639053367]
[null,"Material Costs","AMI 1Ph 1e",1809682.8370648292,2832034.1640377729,4035867.9750887542,5364017.2877331907,6745098.9915670557,8096841.0271416372,9333039.2145198677,10370514.081832649,11139092.401903136,11587051.666769093,11688681.857852792,11447612.6248358,10894998.460818177,10088006.348284503,9094692.2187640462]
[null,null,"AMI 1Ph 1e + c",243965.66342083918,381555.7261245111,543788.78513331828,722861.22495063464,909326.56365949148,1091274.0197124069,1258024.9613771555,1397668.6071062554,1501579.9081929091,1561955.2491404905,1575508.897108315,1543062.2853065536,1468311.8631809766,1359882.6794383815,1225989.0661804797]
[null,null,"AMI 1Ph 2e + C",916178.93622998241,1433622.1892502382,2042813.783772405,2715490.0126987374,3414690.6436706465,4098672.3554360769,4724387.3479538485,5249657.4737088643,5638826.9791316623,5865371.4621766647,5917115.78747869,5794929.6075638235,5515336.3204276683,5106599.63316797,4603940.4730911506]
[null,null,"AMI 3Ph",739575.68017837952,1157450.3655327435,1649378.7925954759,2192279.2756392928,2756337.9705997864,3308855.8226966383,3814248.5664336197,4238374.5416724561,4552381.6412540441,4735111.6532617062,4776947.2086424073,4678369.1758488007,4452361.0031024814,4122485.2445833865,3716632.2705453159]
{"$rows_left_out":31}
{"sheet":"Unit rate buildup","index":6,"n_rows":2,"n_cols":2,"rows_kept":2,"cut":false,"hidden":false,"merged":[]}
[]
[null,"Information in this sheet has been deleted because it contains confidential pricing information"]

{"sheet":"Labour costs","index":7,"n_rows":202,"n_cols":11,"rows_kept":202,"cut":false,"hidden":false,"merged":[[38,7,38,8],[37,7,37,8],[53,7,53,8],[54,7,54,8],[71,7,93,11]]}
[]
[null,"Labour cost estimation"]
[]
[null,"Labour rates",2024,"2026-06-01",null,null,null,"Escallation factor to $2026"]
[null,"Specialist metering (Office hours)",175.90826169265964,{"$f":"$H$5*C5","v":199.02405199438837},null,null,null,{"$f":"1.025*1.025*1.025*1.025*1.025","v":1.1314082128906247}]
[null,"Specialist metering (After hours)",234.09907576364884,{"$f":"C6*$H$5","v":264.86161694909686}]
[null,"Faults (Linesman) rate",197.86936413283024,{"$f":"C7*$H$5","v":223.87102365932972}]
[]
[null,"Electrician contracted rate",126.74,{"$f":"C9*$H$5","v":143.39467690175778}]
[null,"Project manager",159.28,{"$f":"C10*$H$5","v":180.2107001492187}]
[]
[]
[null,"Assumptions",null,null,null,null,null,"Blended rates"]
[null,"Percentage of failed meters will result in faults truck (i.e. hot water / heating complaints)",null,0.1,null,null,null,{"$f":"D14*(2*D7)","v":44.77420473186595},{"$f":"H14/H19","v":0.17239401489386924}]
[null,"Percentage of meters that have an antenna connected",null,0.05]
[null,"Percentage time increase for 3 phase tasks",null,0.8]
[null,"Percentage of jobs that require 2 person crews",null,0.15,null,null,null,{"$f":"D17*(2*D5)","v":59.707215598316509}]
[null,"Percentage refusals and double visits",null,0.03,null,null,null,{"$f":"D18*(2*D5)","v":11.941443119663301}]
[null,null,null,null,null,null,null,{"$f":"((1-(D14+D17+D18))*D5)+SUM(H14:H18)","v":259.72018088580541}]
[]
{"$rows_left_out":183}
{"sheet":"Replacement program breakdown","index":8,"n_rows":215,"n_cols":15,"rows_kept":215,"cut":false,"hidden":false,"merged":[]}
[]
[null,"Program level costs"]
[]
[null,"Assumptions"]
[null,"Working days per year",251]
[null,"Project duration (days)",{"$f":"C5*5","v":1255}]
[null,"Labour rate - Project management (daily)",900]
[null,"Labour rate - SME metering (daily)",1200]
[]
[]
[null,"Project element (Activity","Category","Scope","Time FTE","Duration","Cost","Notes",null,"2026-27","2027-28","2028-29","2029-30","2030-31"]
[null,null,null,null,null,null,null,null,null,0.2,0.4,0.6,0.8,1]
[null,"1.0 ProgramManagement ","High level category"]
[null,"1.1 Industry Planning & Liaison","Program management","Partially in scope",0.2,1,{"$f":"F14*E14*$C$7*$C$6","v":225900},"There will be a some industry communications etc",null,{"$f":"IF($F14>=$J$12,1,$F14*5)*$C$5*$C$7*$E14","v":45180},{"$f":"IF($F14>=K$12,1,IF((($F14-K$12)>=0),($F14-K$12)*5,0))*$C$5*$C$7*$E14","v":45180},{"$f":"IF($F14>=L$12,1,IF((($F14-L$12)>=0),($F14-L$12)*5,0))*$C$5*$C$7*$E14","v":45180},{"$f":"IF($F14>=M$12,1,IF((($F14-M$12)>=0),($F14-M$12)*5,0))*$C$5*$C$7*$E14","v":45180},{"$f":"IF($F14>=N$12,1,IF((($F14-N$12)>=0),($F14-N$12)*5,0))*$C$5*$C$7*$E14","v":45180}]
[null,"1.2 PMO: ProgramEstablishment ","Program management","In scope",2,0.2,{"$f":"F15*E15*$C$7*$C$6","v":451800},"Establish the PMO in the first year",null,451800,{"$f":"IF($F15>=K$12,1,IF((($F15-K$12)>=0),($F15-K$12)*5,0))*$C$5*$C$7*$E15","v":0},0,0,0]
[null,"1.3 PMO: ProgramOperation Mode ","Program management","In scope",1,0.8,{"$f":"F16*E16*$C$7*$C$6","v":903600},null,null,225900,225900,225900,225900,0]
[null,"1.4 PMO: ProgramClose-Down","Program management","Out of scope",null,null,null,"Will not close down until next EDPR",null,0,0,0,0,0]
[null,"1.5 ProgramManagement Tools ","Program management","In scope",0,0.2,{"$f":"F18*E18*$C$7*$C$6","v":0},"Should already have tools, no cost",null,0,0,0,0,0]
[null,"1.6 Commercial & Procurement ","Procurement","In scope",0.5,0.2,{"$f":"F19*E19*$C$7*$C$6","v":112950},"Only in the first year",null,112950,0,0,0,0]
[null,"1.7 Management of the AMI Program","Program management","In scope",1,1,{"$f":"F20*E20*$C$7*$C$6","v":1129500},"PMO manager",null,225900,225900,225900,225900,225900]
{"$rows_left_out":195}