{"text_format":"1","workbook":"xlsx","n_sheets":8,"sheets":["CONTENTS","Business & other details","OPTIONAL 5.4 MD & utilisation","AER Sheet Heading","AER CF","AER NRs","AER lookups","AER ETL"],"not_rendered":{"charts":0,"images":1,"macros":1,"external_links":4,"defined_names":365,"comments":1,"pivot_tables":0},"unopened":[],"bounds":{"document_bytes":16777216,"sheet_cells":100000,"rows_first":2000,"rows_last":500,"rows_between":2000,"halvings":0,"cell_chars":16384,"cell_head_chars":4096},"cells_cut":0,"cells_raw":0,"read":"whole","date_system":"1900"}

{"sheet":"CONTENTS","index":0,"n_rows":15,"n_cols":5,"rows_kept":15,"cut":false,"hidden":false,"merged":[[6,3,6,4],[8,3,8,4]]}
[null,null,{"$f":"IF(dms_MultiYear_ResponseFlag=\"Yes\",\"REGULATORY REPORTING STATEMENT - HISTORICAL INFORMATION\",INDEX(dms_Worksheet_List,MATCH(dms_Model,dms_Model_List)))","v":"REGULATORY REPORTING STATEMENT"}]
[null,null,{"$f":"INDEX(dms_TradingNameFull_List,MATCH(dms_TradingName,dms_TradingName_List))","v":"Powercor Australia"}]
[null,null,{"$f":"CONCATENATE(\"REGULATORY PERIOD FROM \", FRCP_y1,\" TO \",dms_MultiYear_FinalYear_Result)","v":"REGULATORY PERIOD FROM 2026-27 TO 2030-31"}]
[]
[]
[]
[null,null,null,"CONTENTS"]
[]
[null,null,null,"DRAFT RIN ONLY - DO NOT USE FOR SUBMISSION"]
[]
[null,null,null,"TEMPLATE","JUNE 2024 - DRAFT RIN"]
[]
[null,null,null,"SUBMISSION","Business & other details"]
[]
[null,null,null,"NETWORK","OPTIONAL 5.4 MD & utilisation"]

{"sheet":"Business & other details","index":1,"n_rows":77,"n_cols":79,"rows_kept":77,"cut":false,"hidden":false,"merged":[[10,16,10,93],[11,16,11,93],[18,37,18,58],[27,37,27,51],[0,7,2,15],[6,21,6,75],[27,21,27,35],[45,37,45,44],[45,46,45,53],[45,55,45,62],[45,64,45,71],[3,21,3,57],[8,16,8,93],[25,68,25,89],[26,68,26,89],[28,68,28,71],[28,80,28,82],[27,68,27,82],[28,37,28,40],[25,37,25,58],[26,37,26,58],[28,49,28,51],[27,60,27,66],[28,60,28,66],[18,21,18,35],[46,73,46,80],[44,73,44,80],[54,55,54,62],[28,21,28,35],[26,21,26,35],[48,73,48,80],[48,64,48,71],[49,73,49,80],[48,55,48,62],[45,73,45,80],[35,21,35,35],[36,21,36,35],[36,60,36,66],[35,60,35,66],[34,21,34,35],[34,68,34,89],[35,68,35,89],[36,68,36,89],[34,37,34,58],[44,46,44,53],[44,25,44,34],[44,55,44,62],[44,64,44,71],[46,64,46,71],[19,21,19,35],[19,37,19,48],[48,25,48,34],[52,25,52,34],[25,21,25,35],[25,60,25,66],[26,60,26,66],[34,60,34,66],[56,25,56,34],[48,46,48,53],[48,37,48,44],[52,37,52,44],[50,73,50,80],[54,73,54,80],[52,73,52,80],[56,37,56,44],[52,46,52,53],[53,46,53,53],[49,46,49,53],[49,37,49,44],[54,64,54,71],[50,46,50,53],[53,55,53,62],[50,37,50,44],[53,37,53,44],[52,64,52,71],[50,64,50,71],[52,55,52,62],[50,55,50,62],[49,64,49,71],[49,55,49,62],[76,25,76,34],[76,37,76,52],[58,25,58,34],[66,25,66,34],[68,25,68,34],[58,37,58,44],[64,25,64,34],[64,37,64,52],[35,37,35,58],[36,37,36,58],[46,37,46,44],[46,46,46,53],[46,55,46,62],[44,37,44,44],[66,37,66,52],[68,37,68,52],[70,37,70,52],[72,37,74,81],[70,25,70,34],[72,25,74,34],[54,46,54,53],[54,37,54,44],[53,73,53,80],[53,64,53,71]]}
[null,null,null,null,null,null,null,null,null,null,null,null,null,null,null,null,null,null,null,null,null,{"$f":"INDEX(dms_Worksheet_List,MATCH(dms_Model,dms_Model_List))","v":"REGULATORY REPORTING STATEMENT"}]
[null,null,null,null,null,null,null,null,null,null,null,null,null,null,null,null,null,null,null,null,null,{"$f":"INDEX(dms_TradingNameFull_List,MATCH(dms_TradingName,dms_TradingName_List))","v":"Powercor Australia"}]
[null,null,null,null,null,null,null,null,null,null,null,null,null,null,null,null,null,null,null,null,null,{"$f":"CONCATENATE(\"REGULATORY PERIOD FROM \", FRCP_y1,\" TO \",dms_MultiYear_FinalYear_Result)","v":"REGULATORY PERIOD FROM 2026-27 TO 2030-31"}]
[null,null,null,null,null,null,null,null,null,null,null,null,null,null,null,null,null,null,null,null,null,"BUSINESS & OTHER DETAILS"]
[]
[null,null,null,null,null,null,null,null,null,null,null,null,null,null,null,null,null,null,null,null,null,"INSTRUCTIONS"]
[null,null,null,null,null,null,null,null,null,null,null,null,null,null,null,null,null,null,null,null,null,"Complete the following business details regulatory template before entering data or values in any other regulatory template. This regulatory template is linked to other cells within the spreadsheet and automatically generates column headings and conditional formatting to distinguish business specific input and non-input cells. "]
[]
[null,null,null,null,null,null,null,null,null,null,null,null,null,null,null,null,"SUBMISSION PARTICULARS INPUT SHEET"]
[]
[null,null,null,null,null,null,null,null,null,null,null,null,null,null,null,null,"DRAFT TEMPLATE ONLY"]
[null,null,null,null,null,null,null,null,null,null,null,null,null,null,null,null,"DO NOT USE FOR SUBMISSIONS"]
[]
[]
[null,null,null,null,null,null,null,null,null,null,null,null,null,null,null,null,null,null,null,null,null,"ENTITY DETAILS"]
[]
[null,null,null,null,null,null,null,null,null,null,null,null,null,null,null,null,null,null,null,null,null,"Business Name"]
[]
[null,null,null,null,null,null,null,null,null,null,null,null,null,null,null,null,null,null,null,null,null,"Short name",null,null,null,null,null,null,null,null,null,null,null,null,null,null,null,"Powercor Australia"]
[null,null,null,null,null,null,null,null,null,null,null,null,null,null,null,null,null,null,null,null,null,"ACN/ABN",null,null,null,null,null,null,null,null,null,null,null,null,null,null,null,{"$f":"INDEX(dms_ABN_List,MATCH(dms_TradingName,dms_TradingName_List))","v":89064651109}]
[]
[]
[]
[null,null,null,null,null,null,null,null,null,null,null,null,null,null,null,null,null,null,null,null,null,"Business Address",null,null,null,null,null,null,null,null,null,null,null,null,null,null,null,null,null,null,null,null,null,null,null,null,null,null,null,null,null,null,null,null,null,null,null,null,null,null,null,null,null,null,null,null,null,null,"Postal Address"]
[]
[null,null,null,null,null,null,null,null,null,null,null,null,null,null,null,null,null,null,null,null,null,"Address 1",null,null,null,null,null,null,null,null,null,null,null,null,null,null,null,null,null,null,null,null,null,null,null,null,null,null,null,null,null,null,null,null,null,null,null,null,null,null,"Address 1"]
[null,null,null,null,null,null,null,null,null,null,null,null,null,null,null,null,null,null,null,null,null,"Address 2",null,null,null,null,null,null,null,null,null,null,null,null,null,null,null,null,null,null,null,null,null,null,null,null,null,null,null,null,null,null,null,null,null,null,null,null,null,null,"Address 2"]
[null,null,null,null,null,null,null,null,null,null,null,null,null,null,null,null,null,null,null,null,null,"Suburb",null,null,null,null,null,null,null,null,null,null,null,null,null,null,null,null,null,null,null,null,null,null,null,null,null,null,null,null,null,null,null,null,null,null,null,null,null,null,"Suburb"]
[null,null,null,null,null,null,null,null,null,null,null,null,null,null,null,null,null,null,null,null,null,"State",null,null,null,null,null,null,null,null,null,null,null,null,null,null,null,{"$f":"INDEX(dms_State_List,MATCH(dms_TradingName,dms_TradingName_List))","v":"Vic"},null,null,null,null,null,null,null,null,null,"Post code",null,null,null,null,null,null,null,null,null,null,null,null,"State",null,null,null,null,null,null,null,{"$f":"INDEX(dms_PState_List,MATCH(dms_TradingName,dms_TradingName_List))","v":"Vic"},null,null,null,null,null,null,null,null,null,"Post code"]
[]
[null,null,null,null,null,null,null,null,null,null,null,null,null,null,null,null,null,null,null,null,null,null,null,null,null,null,null,null,null,null,null,null,null,null,null,null,null,null,null,null,null,null,null,null,null,null,null,null,null,null,null,null,"`"]
[]
[null,null,null,null,null,null,null,null,null,null,null,null,null,null,null,null,null,null,null,null,null,"Contact Names"]
[]
[null,null,null,null,null,null,null,null,null,null,null,null,null,null,null,null,null,null,null,null,null,"Name",null,null,null,null,null,null,null,null,null,null,null,null,null,null,null,null,null,null,null,null,null,null,null,null,null,null,null,null,null,null,null,null,null,null,null,null,null,null,"Name"]
[null,null,null,null,null,null,null,null,null,null,null,null,null,null,null,null,null,null,null,null,null,"Phone",null,null,null,null,null,null,null,null,null,null,null,null,null,null,null,null,null,null,null,null,null,null,null,null,null,null,null,null,null,null,null,null,null,null,null,null,null,null,"Phone"]
[null,null,null,null,null,null,null,null,null,null,null,null,null,null,null,null,null,null,null,null,null,"Email",null,null,null,null,null,null,null,null,null,null,null,null,null,null,null,null,null,null,null,null,null,null,null,null,null,null,null,null,null,null,null,null,null,null,null,null,null,null,"Email"]
[]
[]
[]
[]
[null,null,null,null,null,null,null,null,null,null,null,null,null,null,null,null,"REGULATORY CONTROL PERIODS"]
[]
[]
[null,null,null,null,null,null,null,null,null,null,null,null,null,null,null,null,null,null,null,null,null,null,null,null,null,"Forthcoming period",null,null,null,null,null,null,null,null,null,null,null,"2026-27",null,null,null,null,null,null,null,null,{"$f":"FRCP_y2","v":"2027-28"},null,null,null,null,null,null,null,null,{"$f":"FRCP_y3","v":"2028-29"},null,null,null,null,null,null,null,null,{"$f":"FRCP_y4","v":"2029-30"},null,null,null,null,null,null,null,null,{"$f":"FRCP_y5","v":"2030-31"}]
[null,null,null,null,null,null,null,null,null,null,null,null,null,null,null,null,null,null,null,null,null,null,null,null,null,null,null,null,null,null,null,null,null,null,null,null,null,{"$f":"FRCP_y6","v":"2031-32"},null,null,null,null,null,null,null,null,{"$f":"FRCP_y7","v":"2032-33"},null,null,null,null,null,null,null,null,{"$f":"FRCP_y8","v":"2033-34"},null,null,null,null,null,null,null,null,{"$f":"FRCP_y9","v":"2034-35"},null,null,null,null,null,null,null,null,{"$f":"FRCP_y10","v":"2035-36"}]
[null,null,null,null,null,null,null,null,null,null,null,null,null,null,null,null,null,null,null,null,null,null,null,null,null,null,null,null,null,null,null,null,null,null,null,null,null,{"$f":"FRCP_y11","v":"2036-37"},null,null,null,null,null,null,null,null,{"$f":"FRCP_y12","v":"2037-38"},null,null,null,null,null,null,null,null,{"$f":"FRCP_y13","v":"2038-39"},null,null,null,null,null,null,null,null,{"$f":"FRCP_y14","v":"2039-40"},null,null,null,null,null,null,null,null,{"$f":"FRCP_y15","v":"2040-41"}]
[]
[null,null,null,null,null,null,null,null,null,null,null,null,null,null,null,null,null,null,null,null,null,null,null,"RESETS",null,"Current period",null,null,null,null,null,null,null,null,null,null,null,{"$f":"CRCP_y1","v":"2021-22"},null,null,null,null,null,null,null,null,{"$f":"CRCP_y2","v":"2022-23"},null,null,null,null,null,null,null,null,{"$f":"CRCP_y3","v":"2023-24"},null,null,null,null,null,null,null,null,{"$f":"CRCP_y4","v":"2024-25"},null,null,null,null,null,null,null,null,{"$f":"CRCP_y5","v":"2025-26"}]
[null,null,null,null,null,null,null,null,null,null,null,null,null,null,null,null,null,null,null,null,null,null,null,null,null,null,null,null,null,null,null,null,null,null,null,null,null,{"$f":"CRCP_y6","v":"2026-27"},null,null,null,null,null,null,null,null,{"$f":"CRCP_y7","v":"2027-28"},null,null,null,null,null,null,null,null,{"$f":"CRCP_y8","v":"2028-29"},null,null,null,null,null,null,null,null,{"$f":"CRCP_y9","v":"2029-30"},null,null,null,null,null,null,null,null,{"$f":"CRCP_y10","v":"2030-31"}]
[null,null,null,null,null,null,null,null,null,null,null,null,null,null,null,null,null,null,null,null,null,null,null,null,null,null,null,null,null,null,null,null,null,null,null,null,null,{"$f":"CRCP_y11","v":"2031-32"},null,null,null,null,null,null,null,null,{"$f":"CRCP_y12","v":"2032-33"},null,null,null,null,null,null,null,null,{"$f":"CRCP_y13","v":"2033-34"},null,null,null,null,null,null,null,null,{"$f":"CRCP_y14","v":"2034-35"},null,null,null,null,null,null,null,null,{"$f":"CRCP_y15","v":"2035-36"}]
[]
[null,null,null,null,null,null,null,null,null,null,null,null,null,null,null,null,null,null,null,null,null,null,null,null,null,"Previous period",null,null,null,null,null,null,null,null,null,null,null,{"$f":"PRCP_y1","v":"2016-17"},null,null,null,null,null,null,null,null,{"$f":"PRCP_y2","v":"2017-18"},null,null,null,null,null,null,null,null,{"$f":"PRCP_y3","v":"2018-19"},null,null,null,null,null,null,null,null,{"$f":"PRCP_y4","v":"2019-20"},null,null,null,null,null,null,null,null,{"$f":"PRCP_y5","v":"2020-21"}]
[null,null,null,null,null,null,null,null,null,null,null,null,null,null,null,null,null,null,null,null,null,null,null,null,null,null,null,null,null,null,null,null,null,null,null,null,null,{"$f":"PRCP_y6","v":"2021-22"},null,null,null,null,null,null,null,null,{"$f":"PRCP_y7","v":"2022-23"},null,null,null,null,null,null,null,null,{"$f":"PRCP_y8","v":"2023-24"},null,null,null,null,null,null,null,null,{"$f":"PRCP_y9","v":"2024-25"},null,null,null,null,null,null,null,null,{"$f":"PRCP_y10","v":"2025-26"}]
[null,null,null,null,null,null,null,null,null,null,null,null,null,null,null,null,null,null,null,null,null,null,null,null,null,null,null,null,null,null,null,null,null,null,null,null,null,{"$f":"PRCP_y11","v":"2026-27"},null,null,null,null,null,null,null,null,{"$f":"PRCP_y12","v":"2027-28"},null,null,null,null,null,null,null,null,{"$f":"PRCP_y13","v":"2028-29"},null,null,null,null,null,null,null,null,{"$f":"PRCP_y14","v":"2029-30"},null,null,null,null,null,null,null,null,{"$f":"PRCP_y15","v":"2030-31"}]
[]
[null,null,null,null,null,null,null,null,null,null,null,null,null,null,null,null,null,null,null,null,null,null,null,null,null,"Commencing year",null,null,null,null,null,null,null,null,null,null,null,"2022-23"]
[null,null,null,null,null,null,null,null,null,null,null,null,null,null,null,null,null,null,null,null,null,null,null,"ANNUAL RINS"]
[null,null,null,null,null,null,null,null,null,null,null,null,null,null,null,null,null,null,null,null,null,null,null,null,null,"Final year",null,null,null,null,null,null,null,null,null,null,null,"2028-29"]
[]
[]
[]
[null,null,null,null,null,null,null,null,null,null,null,null,null,null,null,null,"SUBMISSION DETAILS"]
[]
[null,null,null,null,null,null,null,null,null,null,null,null,null,null,null,null,null,null,null,null,null,null,null,null,null,"RIN type",null,null,null,null,null,null,null,null,null,null,null,{"$f":"INDIRECT(dms_Model)","v":"Regulatory Reporting (Reset)"}]
[]
[null,null,null,null,null,null,null,null,null,null,null,null,null,null,null,null,null,null,null,null,null,null,null,null,null,"Source",null,null,null,null,null,null,null,null,null,null,null,"Regulatory proposal"]
[]
[null,null,null,null,null,null,null,null,null,null,null,null,null,null,null,null,null,null,null,null,null,null,null,"THIS FILE",null,"Data Quality",null,null,null,null,null,null,null,null,null,null,null,"Consolidated"]
[]
[null,null,null,null,null,null,null,null,null,null,null,null,null,null,null,null,null,null,null,null,null,null,null,null,null,"Confidentiality Status",null,null,null,null,null,null,null,null,null,null,null,"Confidential"]
[]
[null,null,null,null,null,null,null,null,null,null,null,null,null,null,null,null,null,null,null,null,null,null,null,null,null,"Amended RIN \nAmendment Reason",null,null,null,null,null,null,null,null,null,null,null,"."]
[]
[]
[]
[null,null,null,null,null,null,null,null,null,null,null,null,null,null,null,null,null,null,null,null,null,null,null,null,null,"Submission Date",null,null,null,null,null,null,null,null,null,null,null,"31/01/25",null,null,null,null,null,null,null,null,null,null,null,null,null,null,null,null,null,"Please enter date this file submitted to AER"]

{"sheet":"OPTIONAL 5.4 MD & utilisation","index":2,"n_rows":271,"n_cols":11,"rows_kept":271,"cut":false,"hidden":false,"merged":[]}
[null,{"$f":"INDEX(dms_Worksheet_List,MATCH(dms_Model,dms_Model_List))","v":"REGULATORY REPORTING STATEMENT"}]
[null,{"$f":"INDEX(dms_TradingNameFull_List,MATCH(dms_TradingName,dms_TradingName_List))","v":"Powercor Australia"}]
[null,{"$f":"CONCATENATE(\"REGULATORY PERIOD FROM \", FRCP_y1,\" TO \",dms_MultiYear_FinalYear_Result)","v":"REGULATORY PERIOD FROM 2026-27 TO 2030-31"}]
[null,"5.4 OPTIONAL MAXIMUM DEMAND AND UTILISATION AT SPATIAL LEVEL"]
[null," TEMPLATE DATE - SEPTEMBER 2024 - FINAL RIN"]
[]
[]
[null,"5.4.1 - OPTIONAL NON-COINCIDENT & COINCIDENT MAXIMUM DEMAND"]
[null,"SUBTRANSMISSION/ZONE SUBSTATION"]
[null,"Network Level","Substation","Incidence","Seasonal peak","Substation Rating","Adjustments - Embedded Generation","Weather corrected maximum demand 10% POE","Weather corrected maximum demand 10% POE","Weather corrected maximum demand 50% POE","Weather corrected maximum demand 50% POE"]
["UNITS","Subtransmission / Zone","Name","Coincident / non-coincident","Summer/Winter","MVA","MW","MVA","MW","MVA","MW"]
[null,"Zone","AC","Non-coincident","Summer",{"$f":"_xlfn.XLOOKUP(C12,[1]Sheet1!$A$2:$A$86,[1]Sheet1!$B$2:$B$86)","v":40},null,{"$f":"_xlfn.XLOOKUP(1,('[2]ZSS Results'!$B$4:$B$462=\"Powercor\")*('[2]ZSS Results'!$D$4:$D$462=\"summer\")*('[2]ZSS Results'!$C$4:$C$462=C12),'[2]ZSS Results'!$N$4:$N$462)","v":7.94},{"$f":"_xlfn.XLOOKUP(C12,'[3]zss forecast'!$B$3:$B$155,'[3]zss forecast'!$BX$3:$BX$155)","v":7.45},{"$f":"_xlfn.XLOOKUP(1,('[2]ZSS Results'!$B$4:$B$462=\"Powercor\")*('[2]ZSS Results'!$D$4:$D$462=\"summer\")*('[2]ZSS Results'!$C$4:$C$462=C12),'[2]ZSS Results'!$AN$4:$AN$462)","v":5.79},{"$f":"_xlfn.XLOOKUP(C12,'[3]zss forecast'!$B$3:$B$155,'[3]zss forecast'!$DA$3:$DA$155)","v":5.41}]
[null,"Zone","AL","Non-coincident","Summer",{"$f":"_xlfn.XLOOKUP(C13,[1]Sheet1!$A$2:$A$86,[1]Sheet1!$B$2:$B$86)","v":30},null,{"$f":"_xlfn.XLOOKUP(1,('[2]ZSS Results'!$B$4:$B$462=\"Powercor\")*('[2]ZSS Results'!$D$4:$D$462=\"summer\")*('[2]ZSS Results'!$C$4:$C$462=C13),'[2]ZSS Results'!$N$4:$N$462)","v":24.64},{"$f":"_xlfn.XLOOKUP(C13,'[3]zss forecast'!$B$3:$B$155,'[3]zss forecast'!$BX$3:$BX$155)","v":24.02},{"$f":"_xlfn.XLOOKUP(1,('[2]ZSS Results'!$B$4:$B$462=\"Powercor\")*('[2]ZSS Results'!$D$4:$D$462=\"summer\")*('[2]ZSS Results'!$C$4:$C$462=C13),'[2]ZSS Results'!$AN$4:$AN$462)","v":20.95},{"$f":"_xlfn.XLOOKUP(C13,'[3]zss forecast'!$B$3:$B$155,'[3]zss forecast'!$DA$3:$DA$155)","v":20.49}]
[null,"Zone","ART","Non-coincident","Summer",{"$f":"_xlfn.XLOOKUP(C14,[1]Sheet1!$A$2:$A$86,[1]Sheet1!$B$2:$B$86)","v":20},null,{"$f":"_xlfn.XLOOKUP(1,('[2]ZSS Results'!$B$4:$B$462=\"Powercor\")*('[2]ZSS Results'!$D$4:$D$462=\"summer\")*('[2]ZSS Results'!$C$4:$C$462=C14),'[2]ZSS Results'!$N$4:$N$462)","v":16.190000000000001},{"$f":"_xlfn.XLOOKUP(C14,'[3]zss forecast'!$B$3:$B$155,'[3]zss forecast'!$BX$3:$BX$155)","v":16.18},{"$f":"_xlfn.XLOOKUP(1,('[2]ZSS Results'!$B$4:$B$462=\"Powercor\")*('[2]ZSS Results'!$D$4:$D$462=\"summer\")*('[2]ZSS Results'!$C$4:$C$462=C14),'[2]ZSS Results'!$AN$4:$AN$462)","v":14.34},{"$f":"_xlfn.XLOOKUP(C14,'[3]zss forecast'!$B$3:$B$155,'[3]zss forecast'!$DA$3:$DA$155)","v":14.33}]
[null,"Zone","AWT","Non-coincident","Summer",{"$f":"_xlfn.XLOOKUP(C15,[1]Sheet1!$A$2:$A$86,[1]Sheet1!$B$2:$B$86)","v":66},null,{"$f":"_xlfn.XLOOKUP(1,('[2]ZSS Results'!$B$4:$B$462=\"Powercor\")*('[2]ZSS Results'!$D$4:$D$462=\"summer\")*('[2]ZSS Results'!$C$4:$C$462=C15),'[2]ZSS Results'!$N$4:$N$462)","v":3.8},{"$f":"_xlfn.XLOOKUP(C15,'[3]zss forecast'!$B$3:$B$155,'[3]zss forecast'!$BX$3:$BX$155)","v":3.8},{"$f":"_xlfn.XLOOKUP(1,('[2]ZSS Results'!$B$4:$B$462=\"Powercor\")*('[2]ZSS Results'!$D$4:$D$462=\"summer\")*('[2]ZSS Results'!$C$4:$C$462=C15),'[2]ZSS Results'!$AN$4:$AN$462)","v":3.72},{"$f":"_xlfn.XLOOKUP(C15,'[3]zss forecast'!$B$3:$B$155,'[3]zss forecast'!$DA$3:$DA$155)","v":3.72}]
[null,"Zone","BAE","Non-coincident","Summer",{"$f":"_xlfn.XLOOKUP(C16,[1]Sheet1!$A$2:$A$86,[1]Sheet1!$B$2:$B$86)","v":33},null,{"$f":"_xlfn.XLOOKUP(1,('[2]ZSS Results'!$B$4:$B$462=\"Powercor\")*('[2]ZSS Results'!$D$4:$D$462=\"summer\")*('[2]ZSS Results'!$C$4:$C$462=C16),'[2]ZSS Results'!$N$4:$N$462)","v":0},{"$f":"_xlfn.XLOOKUP(C16,'[3]zss forecast'!$B$3:$B$155,'[3]zss forecast'!$BX$3:$BX$155)","v":0},{"$f":"_xlfn.XLOOKUP(1,('[2]ZSS Results'!$B$4:$B$462=\"Powercor\")*('[2]ZSS Results'!$D$4:$D$462=\"summer\")*('[2]ZSS Results'!$C$4:$C$462=C16),'[2]ZSS Results'!$AN$4:$AN$462)","v":0},{"$f":"_xlfn.XLOOKUP(C16,'[3]zss forecast'!$B$3:$B$155,'[3]zss forecast'!$DA$3:$DA$155)","v":0}]
[null,"Zone","BAN","Non-coincident","Summer",{"$f":"_xlfn.XLOOKUP(C17,[1]Sheet1!$A$2:$A$86,[1]Sheet1!$B$2:$B$86)","v":120},null,{"$f":"_xlfn.XLOOKUP(1,('[2]ZSS Results'!$B$4:$B$462=\"Powercor\")*('[2]ZSS Results'!$D$4:$D$462=\"summer\")*('[2]ZSS Results'!$C$4:$C$462=C17),'[2]ZSS Results'!$N$4:$N$462)","v":101.08},{"$f":"_xlfn.XLOOKUP(C17,'[3]zss forecast'!$B$3:$B$155,'[3]zss forecast'!$BX$3:$BX$155)","v":100.66},{"$f":"_xlfn.XLOOKUP(1,('[2]ZSS Results'!$B$4:$B$462=\"Powercor\")*('[2]ZSS Results'!$D$4:$D$462=\"summer\")*('[2]ZSS Results'!$C$4:$C$462=C17),'[2]ZSS Results'!$AN$4:$AN$462)","v":85.47},{"$f":"_xlfn.XLOOKUP(C17,'[3]zss forecast'!$B$3:$B$155,'[3]zss forecast'!$DA$3:$DA$155)","v":85.14}]
[null,"Zone","BAS","Non-coincident","Summer",{"$f":"_xlfn.XLOOKUP(C18,[1]Sheet1!$A$2:$A$86,[1]Sheet1!$B$2:$B$86)","v":99},null,{"$f":"_xlfn.XLOOKUP(1,('[2]ZSS Results'!$B$4:$B$462=\"Powercor\")*('[2]ZSS Results'!$D$4:$D$462=\"summer\")*('[2]ZSS Results'!$C$4:$C$462=C18),'[2]ZSS Results'!$N$4:$N$462)","v":86.39},{"$f":"_xlfn.XLOOKUP(C18,'[3]zss forecast'!$B$3:$B$155,'[3]zss forecast'!$BX$3:$BX$155)","v":86.28},{"$f":"_xlfn.XLOOKUP(1,('[2]ZSS Results'!$B$4:$B$462=\"Powercor\")*('[2]ZSS Results'!$D$4:$D$462=\"summer\")*('[2]ZSS Results'!$C$4:$C$462=C18),'[2]ZSS Results'!$AN$4:$AN$462)","v":79.819999999999993},{"$f":"_xlfn.XLOOKUP(C18,'[3]zss forecast'!$B$3:$B$155,'[3]zss forecast'!$DA$3:$DA$155)","v":79.739999999999995}]
[null,"Zone","BBD","Non-coincident","Summer",{"$f":"_xlfn.XLOOKUP(C19,[1]Sheet1!$A$2:$A$86,[1]Sheet1!$B$2:$B$86)","v":66},null,{"$f":"_xlfn.XLOOKUP(1,('[2]ZSS Results'!$B$4:$B$462=\"Powercor\")*('[2]ZSS Results'!$D$4:$D$462=\"summer\")*('[2]ZSS Results'!$C$4:$C$462=C19),'[2]ZSS Results'!$N$4:$N$462)","v":37.799999999999997},{"$f":"_xlfn.XLOOKUP(C19,'[3]zss forecast'!$B$3:$B$155,'[3]zss forecast'!$BX$3:$BX$155)","v":37.07},{"$f":"_xlfn.XLOOKUP(1,('[2]ZSS Results'!$B$4:$B$462=\"Powercor\")*('[2]ZSS Results'!$D$4:$D$462=\"summer\")*('[2]ZSS Results'!$C$4:$C$462=C19),'[2]ZSS Results'!$AN$4:$AN$462)","v":33.44},{"$f":"_xlfn.XLOOKUP(C19,'[3]zss forecast'!$B$3:$B$155,'[3]zss forecast'!$DA$3:$DA$155)","v":32.729999999999997}]
[null,"Zone","BGO","Non-coincident","Summer",{"$f":"_xlfn.XLOOKUP(C20,[1]Sheet1!$A$2:$A$86,[1]Sheet1!$B$2:$B$86)","v":66},null,{"$f":"_xlfn.XLOOKUP(1,('[2]ZSS Results'!$B$4:$B$462=\"Powercor\")*('[2]ZSS Results'!$D$4:$D$462=\"summer\")*('[2]ZSS Results'!$C$4:$C$462=C20),'[2]ZSS Results'!$N$4:$N$462)","v":46.76},{"$f":"_xlfn.XLOOKUP(C20,'[3]zss forecast'!$B$3:$B$155,'[3]zss forecast'!$BX$3:$BX$155)","v":46.56},{"$f":"_xlfn.XLOOKUP(1,('[2]ZSS Results'!$B$4:$B$462=\"Powercor\")*('[2]ZSS Results'!$D$4:$D$462=\"summer\")*('[2]ZSS Results'!$C$4:$C$462=C20),'[2]ZSS Results'!$AN$4:$AN$462)","v":40.630000000000003},{"$f":"_xlfn.XLOOKUP(C20,'[3]zss forecast'!$B$3:$B$155,'[3]zss forecast'!$DA$3:$DA$155)","v":40.53}]
[null,"Zone","BMH","Non-coincident","Summer",{"$f":"_xlfn.XLOOKUP(C21,[1]Sheet1!$A$2:$A$86,[1]Sheet1!$B$2:$B$86)","v":27},null,{"$f":"_xlfn.XLOOKUP(1,('[2]ZSS Results'!$B$4:$B$462=\"Powercor\")*('[2]ZSS Results'!$D$4:$D$462=\"summer\")*('[2]ZSS Results'!$C$4:$C$462=C21),'[2]ZSS Results'!$N$4:$N$462)","v":30.7},{"$f":"_xlfn.XLOOKUP(C21,'[3]zss forecast'!$B$3:$B$155,'[3]zss forecast'!$BX$3:$BX$155)","v":30.54},{"$f":"_xlfn.XLOOKUP(1,('[2]ZSS Results'!$B$4:$B$462=\"Powercor\")*('[2]ZSS Results'!$D$4:$D$462=\"summer\")*('[2]ZSS Results'!$C$4:$C$462=C21),'[2]ZSS Results'!$AN$4:$AN$462)","v":28.68},{"$f":"_xlfn.XLOOKUP(C21,'[3]zss forecast'!$B$3:$B$155,'[3]zss forecast'!$DA$3:$DA$155)","v":28.56}]
[null,"Zone","CDN","Non-coincident","Summer",{"$f":"_xlfn.XLOOKUP(C22,[1]Sheet1!$A$2:$A$86,[1]Sheet1!$B$2:$B$86)","v":20},null,{"$f":"_xlfn.XLOOKUP(1,('[2]ZSS Results'!$B$4:$B$462=\"Powercor\")*('[2]ZSS Results'!$D$4:$D$462=\"summer\")*('[2]ZSS Results'!$C$4:$C$462=C22),'[2]ZSS Results'!$N$4:$N$462)","v":15.39},{"$f":"_xlfn.XLOOKUP(C22,'[3]zss forecast'!$B$3:$B$155,'[3]zss forecast'!$BX$3:$BX$155)","v":15.39},{"$f":"_xlfn.XLOOKUP(1,('[2]ZSS Results'!$B$4:$B$462=\"Powercor\")*('[2]ZSS Results'!$D$4:$D$462=\"summer\")*('[2]ZSS Results'!$C$4:$C$462=C22),'[2]ZSS Results'!$AN$4:$AN$462)","v":13.76},{"$f":"_xlfn.XLOOKUP(C22,'[3]zss forecast'!$B$3:$B$155,'[3]zss forecast'!$DA$3:$DA$155)","v":13.76}]
[null,"Zone","CHA","Non-coincident","Summer",{"$f":"_xlfn.XLOOKUP(C23,[1]Sheet1!$A$2:$A$86,[1]Sheet1!$B$2:$B$86)","v":27},null,{"$f":"_xlfn.XLOOKUP(1,('[2]ZSS Results'!$B$4:$B$462=\"Powercor\")*('[2]ZSS Results'!$D$4:$D$462=\"summer\")*('[2]ZSS Results'!$C$4:$C$462=C23),'[2]ZSS Results'!$N$4:$N$462)","v":26.89},{"$f":"_xlfn.XLOOKUP(C23,'[3]zss forecast'!$B$3:$B$155,'[3]zss forecast'!$BX$3:$BX$155)","v":26.84},{"$f":"_xlfn.XLOOKUP(1,('[2]ZSS Results'!$B$4:$B$462=\"Powercor\")*('[2]ZSS Results'!$D$4:$D$462=\"summer\")*('[2]ZSS Results'!$C$4:$C$462=C23),'[2]ZSS Results'!$AN$4:$AN$462)","v":18.82},{"$f":"_xlfn.XLOOKUP(C23,'[3]zss forecast'!$B$3:$B$155,'[3]zss forecast'!$DA$3:$DA$155)","v":18.77}]
[null,"Zone","CHM","Non-coincident","Summer",{"$f":"_xlfn.XLOOKUP(C24,[1]Sheet1!$A$2:$A$86,[1]Sheet1!$B$2:$B$86)","v":33},null,{"$f":"_xlfn.XLOOKUP(1,('[2]ZSS Results'!$B$4:$B$462=\"Powercor\")*('[2]ZSS Results'!$D$4:$D$462=\"summer\")*('[2]ZSS Results'!$C$4:$C$462=C24),'[2]ZSS Results'!$N$4:$N$462)","v":2.36},{"$f":"_xlfn.XLOOKUP(C24,'[3]zss forecast'!$B$3:$B$155,'[3]zss forecast'!$BX$3:$BX$155)","v":2.34},{"$f":"_xlfn.XLOOKUP(1,('[2]ZSS Results'!$B$4:$B$462=\"Powercor\")*('[2]ZSS Results'!$D$4:$D$462=\"summer\")*('[2]ZSS Results'!$C$4:$C$462=C24),'[2]ZSS Results'!$AN$4:$AN$462)","v":2.17},{"$f":"_xlfn.XLOOKUP(C24,'[3]zss forecast'!$B$3:$B$155,'[3]zss forecast'!$DA$3:$DA$155)","v":2.16}]
[null,"Zone","CLC","Non-coincident","Summer",{"$f":"_xlfn.XLOOKUP(C25,[1]Sheet1!$A$2:$A$86,[1]Sheet1!$B$2:$B$86)","v":79},null,{"$f":"_xlfn.XLOOKUP(1,('[2]ZSS Results'!$B$4:$B$462=\"Powercor\")*('[2]ZSS Results'!$D$4:$D$462=\"summer\")*('[2]ZSS Results'!$C$4:$C$462=C25),'[2]ZSS Results'!$N$4:$N$462)","v":42.46},{"$f":"_xlfn.XLOOKUP(C25,'[3]zss forecast'!$B$3:$B$155,'[3]zss forecast'!$BX$3:$BX$155)","v":42.46},{"$f":"_xlfn.XLOOKUP(1,('[2]ZSS Results'!$B$4:$B$462=\"Powercor\")*('[2]ZSS Results'!$D$4:$D$462=\"summer\")*('[2]ZSS Results'!$C$4:$C$462=C25),'[2]ZSS Results'!$AN$4:$AN$462)","v":39.159999999999997},{"$f":"_xlfn.XLOOKUP(C25,'[3]zss forecast'!$B$3:$B$155,'[3]zss forecast'!$DA$3:$DA$155)","v":39.159999999999997}]
[null,"Zone","CME","Non-coincident","Summer",{"$f":"_xlfn.XLOOKUP(C26,[1]Sheet1!$A$2:$A$86,[1]Sheet1!$B$2:$B$86)","v":40.5},null,{"$f":"_xlfn.XLOOKUP(1,('[2]ZSS Results'!$B$4:$B$462=\"Powercor\")*('[2]ZSS Results'!$D$4:$D$462=\"summer\")*('[2]ZSS Results'!$C$4:$C$462=C26),'[2]ZSS Results'!$N$4:$N$462)","v":44.16},{"$f":"_xlfn.XLOOKUP(C26,'[3]zss forecast'!$B$3:$B$155,'[3]zss forecast'!$BX$3:$BX$155)","v":44.16},{"$f":"_xlfn.XLOOKUP(1,('[2]ZSS Results'!$B$4:$B$462=\"Powercor\")*('[2]ZSS Results'!$D$4:$D$462=\"summer\")*('[2]ZSS Results'!$C$4:$C$462=C26),'[2]ZSS Results'!$AN$4:$AN$462)","v":35.979999999999997},{"$f":"_xlfn.XLOOKUP(C26,'[3]zss forecast'!$B$3:$B$155,'[3]zss forecast'!$DA$3:$DA$155)","v":35.950000000000003}]
[null,"Zone","CMN","Non-coincident","Summer",{"$f":"_xlfn.XLOOKUP(C27,[1]Sheet1!$A$2:$A$86,[1]Sheet1!$B$2:$B$86)","v":66},null,{"$f":"_xlfn.XLOOKUP(1,('[2]ZSS Results'!$B$4:$B$462=\"Powercor\")*('[2]ZSS Results'!$D$4:$D$462=\"summer\")*('[2]ZSS Results'!$C$4:$C$462=C27),'[2]ZSS Results'!$N$4:$N$462)","v":31.13},{"$f":"_xlfn.XLOOKUP(C27,'[3]zss forecast'!$B$3:$B$155,'[3]zss forecast'!$BX$3:$BX$155)","v":31.08},{"$f":"_xlfn.XLOOKUP(1,('[2]ZSS Results'!$B$4:$B$462=\"Powercor\")*('[2]ZSS Results'!$D$4:$D$462=\"summer\")*('[2]ZSS Results'!$C$4:$C$462=C27),'[2]ZSS Results'!$AN$4:$AN$462)","v":27.08},{"$f":"_xlfn.XLOOKUP(C27,'[3]zss forecast'!$B$3:$B$155,'[3]zss forecast'!$DA$3:$DA$155)","v":27.07}]
[null,"Zone","COB","Non-coincident","Summer",{"$f":"_xlfn.XLOOKUP(C28,[1]Sheet1!$A$2:$A$86,[1]Sheet1!$B$2:$B$86)","v":26},null,{"$f":"_xlfn.XLOOKUP(1,('[2]ZSS Results'!$B$4:$B$462=\"Powercor\")*('[2]ZSS Results'!$D$4:$D$462=\"summer\")*('[2]ZSS Results'!$C$4:$C$462=C28),'[2]ZSS Results'!$N$4:$N$462)","v":17.16},{"$f":"_xlfn.XLOOKUP(C28,'[3]zss forecast'!$B$3:$B$155,'[3]zss forecast'!$BX$3:$BX$155)","v":16.739999999999998},{"$f":"_xlfn.XLOOKUP(1,('[2]ZSS Results'!$B$4:$B$462=\"Powercor\")*('[2]ZSS Results'!$D$4:$D$462=\"summer\")*('[2]ZSS Results'!$C$4:$C$462=C28),'[2]ZSS Results'!$AN$4:$AN$462)","v":14.3},{"$f":"_xlfn.XLOOKUP(C28,'[3]zss forecast'!$B$3:$B$155,'[3]zss forecast'!$DA$3:$DA$155)","v":13.83}]
[null,"Zone","CRO","Non-coincident","Summer",{"$f":"_xlfn.XLOOKUP(C29,[1]Sheet1!$A$2:$A$86,[1]Sheet1!$B$2:$B$86)","v":60},null,{"$f":"_xlfn.XLOOKUP(1,('[2]ZSS Results'!$B$4:$B$462=\"Powercor\")*('[2]ZSS Results'!$D$4:$D$462=\"summer\")*('[2]ZSS Results'!$C$4:$C$462=C29),'[2]ZSS Results'!$N$4:$N$462)","v":37.590000000000003},{"$f":"_xlfn.XLOOKUP(C29,'[3]zss forecast'!$B$3:$B$155,'[3]zss forecast'!$BX$3:$BX$155)","v":36.47},{"$f":"_xlfn.XLOOKUP(1,('[2]ZSS Results'!$B$4:$B$462=\"Powercor\")*('[2]ZSS Results'!$D$4:$D$462=\"summer\")*('[2]ZSS Results'!$C$4:$C$462=C29),'[2]ZSS Results'!$AN$4:$AN$462)","v":33.090000000000003},{"$f":"_xlfn.XLOOKUP(C29,'[3]zss forecast'!$B$3:$B$155,'[3]zss forecast'!$DA$3:$DA$155)","v":32.22}]
[null,"Zone","CTN","Non-coincident","Summer",{"$f":"_xlfn.XLOOKUP(C30,[1]Sheet1!$A$2:$A$86,[1]Sheet1!$B$2:$B$86)","v":39.5},null,{"$f":"_xlfn.XLOOKUP(1,('[2]ZSS Results'!$B$4:$B$462=\"Powercor\")*('[2]ZSS Results'!$D$4:$D$462=\"summer\")*('[2]ZSS Results'!$C$4:$C$462=C30),'[2]ZSS Results'!$N$4:$N$462)","v":21.61},{"$f":"_xlfn.XLOOKUP(C30,'[3]zss forecast'!$B$3:$B$155,'[3]zss forecast'!$BX$3:$BX$155)","v":20.92},{"$f":"_xlfn.XLOOKUP(1,('[2]ZSS Results'!$B$4:$B$462=\"Powercor\")*('[2]ZSS Results'!$D$4:$D$462=\"summer\")*('[2]ZSS Results'!$C$4:$C$462=C30),'[2]ZSS Results'!$AN$4:$AN$462)","v":19.78},{"$f":"_xlfn.XLOOKUP(C30,'[3]zss forecast'!$B$3:$B$155,'[3]zss forecast'!$DA$3:$DA$155)","v":19.16}]
[null,"Zone","DDL","Non-coincident","Summer",{"$f":"_xlfn.XLOOKUP(C31,[1]Sheet1!$A$2:$A$86,[1]Sheet1!$B$2:$B$86)","v":66},null,{"$f":"_xlfn.XLOOKUP(1,('[2]ZSS Results'!$B$4:$B$462=\"Powercor\")*('[2]ZSS Results'!$D$4:$D$462=\"summer\")*('[2]ZSS Results'!$C$4:$C$462=C31),'[2]ZSS Results'!$N$4:$N$462)","v":77.87},{"$f":"_xlfn.XLOOKUP(C31,'[3]zss forecast'!$B$3:$B$155,'[3]zss forecast'!$BX$3:$BX$155)","v":77.83},{"$f":"_xlfn.XLOOKUP(1,('[2]ZSS Results'!$B$4:$B$462=\"Powercor\")*('[2]ZSS Results'!$D$4:$D$462=\"summer\")*('[2]ZSS Results'!$C$4:$C$462=C31),'[2]ZSS Results'!$AN$4:$AN$462)","v":71.34},{"$f":"_xlfn.XLOOKUP(C31,'[3]zss forecast'!$B$3:$B$155,'[3]zss forecast'!$DA$3:$DA$155)","v":71.319999999999993}]
[null,"Zone","DLF","Non-coincident","Summer",{"$f":"_xlfn.XLOOKUP(C32,[1]Sheet1!$A$2:$A$86,[1]Sheet1!$B$2:$B$86)","v":66},null,{"$f":"_xlfn.XLOOKUP(1,('[2]ZSS Results'!$B$4:$B$462=\"Powercor\")*('[2]ZSS Results'!$D$4:$D$462=\"summer\")*('[2]ZSS Results'!$C$4:$C$462=C32),'[2]ZSS Results'!$N$4:$N$462)","v":18.07},{"$f":"_xlfn.XLOOKUP(C32,'[3]zss forecast'!$B$3:$B$155,'[3]zss forecast'!$BX$3:$BX$155)","v":17.98},{"$f":"_xlfn.XLOOKUP(1,('[2]ZSS Results'!$B$4:$B$462=\"Powercor\")*('[2]ZSS Results'!$D$4:$D$462=\"summer\")*('[2]ZSS Results'!$C$4:$C$462=C32),'[2]ZSS Results'!$AN$4:$AN$462)","v":16.23},{"$f":"_xlfn.XLOOKUP(C32,'[3]zss forecast'!$B$3:$B$155,'[3]zss forecast'!$DA$3:$DA$155)","v":16.170000000000002}]
[null,"Zone","ECA","Non-coincident","Summer",{"$f":"_xlfn.XLOOKUP(C33,[1]Sheet1!$A$2:$A$86,[1]Sheet1!$B$2:$B$86)","v":40.5},null,{"$f":"_xlfn.XLOOKUP(1,('[2]ZSS Results'!$B$4:$B$462=\"Powercor\")*('[2]ZSS Results'!$D$4:$D$462=\"summer\")*('[2]ZSS Results'!$C$4:$C$462=C33),'[2]ZSS Results'!$N$4:$N$462)","v":41.8},{"$f":"_xlfn.XLOOKUP(C33,'[3]zss forecast'!$B$3:$B$155,'[3]zss forecast'!$BX$3:$BX$155)","v":41.7},{"$f":"_xlfn.XLOOKUP(1,('[2]ZSS Results'!$B$4:$B$462=\"Powercor\")*('[2]ZSS Results'!$D$4:$D$462=\"summer\")*('[2]ZSS Results'!$C$4:$C$462=C33),'[2]ZSS Results'!$AN$4:$AN$462)","v":37.24},{"$f":"_xlfn.XLOOKUP(C33,'[3]zss forecast'!$B$3:$B$155,'[3]zss forecast'!$DA$3:$DA$155)","v":37.18}]
[null,"Zone","EHK","Non-coincident","Summer",{"$f":"_xlfn.XLOOKUP(C34,[1]Sheet1!$A$2:$A$86,[1]Sheet1!$B$2:$B$86)","v":54},null,{"$f":"_xlfn.XLOOKUP(1,('[2]ZSS Results'!$B$4:$B$462=\"Powercor\")*('[2]ZSS Results'!$D$4:$D$462=\"summer\")*('[2]ZSS Results'!$C$4:$C$462=C34),'[2]ZSS Results'!$N$4:$N$462)","v":55.03},{"$f":"_xlfn.XLOOKUP(C34,'[3]zss forecast'!$B$3:$B$155,'[3]zss forecast'!$BX$3:$BX$155)","v":54.82},{"$f":"_xlfn.XLOOKUP(1,('[2]ZSS Results'!$B$4:$B$462=\"Powercor\")*('[2]ZSS Results'!$D$4:$D$462=\"summer\")*('[2]ZSS Results'!$C$4:$C$462=C34),'[2]ZSS Results'!$AN$4:$AN$462)","v":51.3},{"$f":"_xlfn.XLOOKUP(C34,'[3]zss forecast'!$B$3:$B$155,'[3]zss forecast'!$DA$3:$DA$155)","v":51.13}]
[null,"Zone","FNS","Non-coincident","Summer",{"$f":"_xlfn.XLOOKUP(C35,[1]Sheet1!$A$2:$A$86,[1]Sheet1!$B$2:$B$86)","v":99},null,{"$f":"_xlfn.XLOOKUP(1,('[2]ZSS Results'!$B$4:$B$462=\"Powercor\")*('[2]ZSS Results'!$D$4:$D$462=\"summer\")*('[2]ZSS Results'!$C$4:$C$462=C35),'[2]ZSS Results'!$N$4:$N$462)","v":50.87},{"$f":"_xlfn.XLOOKUP(C35,'[3]zss forecast'!$B$3:$B$155,'[3]zss forecast'!$BX$3:$BX$155)","v":50.63},{"$f":"_xlfn.XLOOKUP(1,('[2]ZSS Results'!$B$4:$B$462=\"Powercor\")*('[2]ZSS Results'!$D$4:$D$462=\"summer\")*('[2]ZSS Results'!$C$4:$C$462=C35),'[2]ZSS Results'!$AN$4:$AN$462)","v":44.14},{"$f":"_xlfn.XLOOKUP(C35,'[3]zss forecast'!$B$3:$B$155,'[3]zss forecast'!$DA$3:$DA$155)","v":43.96}]
[null,"Zone","GB","Non-coincident","Summer",{"$f":"_xlfn.XLOOKUP(C36,[1]Sheet1!$A$2:$A$86,[1]Sheet1!$B$2:$B$86)","v":37.5},null,{"$f":"_xlfn.XLOOKUP(1,('[2]ZSS Results'!$B$4:$B$462=\"Powercor\")*('[2]ZSS Results'!$D$4:$D$462=\"summer\")*('[2]ZSS Results'!$C$4:$C$462=C36),'[2]ZSS Results'!$N$4:$N$462)","v":16.809999999999999},{"$f":"_xlfn.XLOOKUP(C36,'[3]zss forecast'!$B$3:$B$155,'[3]zss forecast'!$BX$3:$BX$155)","v":15.56},{"$f":"_xlfn.XLOOKUP(1,('[2]ZSS Results'!$B$4:$B$462=\"Powercor\")*('[2]ZSS Results'!$D$4:$D$462=\"summer\")*('[2]ZSS Results'!$C$4:$C$462=C36),'[2]ZSS Results'!$AN$4:$AN$462)","v":15.25},{"$f":"_xlfn.XLOOKUP(C36,'[3]zss forecast'!$B$3:$B$155,'[3]zss forecast'!$DA$3:$DA$155)","v":14.17}]
[null,"Zone","GCY","Non-coincident","Summer",{"$f":"_xlfn.XLOOKUP(C37,[1]Sheet1!$A$2:$A$86,[1]Sheet1!$B$2:$B$86)","v":66},null,{"$f":"_xlfn.XLOOKUP(1,('[2]ZSS Results'!$B$4:$B$462=\"Powercor\")*('[2]ZSS Results'!$D$4:$D$462=\"summer\")*('[2]ZSS Results'!$C$4:$C$462=C37),'[2]ZSS Results'!$N$4:$N$462)","v":53.25},{"$f":"_xlfn.XLOOKUP(C37,'[3]zss forecast'!$B$3:$B$155,'[3]zss forecast'!$BX$3:$BX$155)","v":52.52},{"$f":"_xlfn.XLOOKUP(1,('[2]ZSS Results'!$B$4:$B$462=\"Powercor\")*('[2]ZSS Results'!$D$4:$D$462=\"summer\")*('[2]ZSS Results'!$C$4:$C$462=C37),'[2]ZSS Results'!$AN$4:$AN$462)","v":46.1},{"$f":"_xlfn.XLOOKUP(C37,'[3]zss forecast'!$B$3:$B$155,'[3]zss forecast'!$DA$3:$DA$155)","v":45.58}]
[null,"Zone","GHP","Non-coincident","Summer",{"$f":"_xlfn.XLOOKUP(C38,[1]Sheet1!$A$2:$A$86,[1]Sheet1!$B$2:$B$86)","v":66},null,{"$f":"_xlfn.XLOOKUP(1,('[2]ZSS Results'!$B$4:$B$462=\"Powercor\")*('[2]ZSS Results'!$D$4:$D$462=\"summer\")*('[2]ZSS Results'!$C$4:$C$462=C38),'[2]ZSS Results'!$N$4:$N$462)","v":37.340000000000003},{"$f":"_xlfn.XLOOKUP(C38,'[3]zss forecast'!$B$3:$B$155,'[3]zss forecast'!$BX$3:$BX$155)","v":37.299999999999997},{"$f":"_xlfn.XLOOKUP(1,('[2]ZSS Results'!$B$4:$B$462=\"Powercor\")*('[2]ZSS Results'!$D$4:$D$462=\"summer\")*('[2]ZSS Results'!$C$4:$C$462=C38),'[2]ZSS Results'!$AN$4:$AN$462)","v":33.35},{"$f":"_xlfn.XLOOKUP(C38,'[3]zss forecast'!$B$3:$B$155,'[3]zss forecast'!$DA$3:$DA$155)","v":33.33}]
[null,"Zone","GL","Non-coincident","Summer",{"$f":"_xlfn.XLOOKUP(C39,[1]Sheet1!$A$2:$A$86,[1]Sheet1!$B$2:$B$86)","v":80},null,{"$f":"_xlfn.XLOOKUP(1,('[2]ZSS Results'!$B$4:$B$462=\"Powercor\")*('[2]ZSS Results'!$D$4:$D$462=\"summer\")*('[2]ZSS Results'!$C$4:$C$462=C39),'[2]ZSS Results'!$N$4:$N$462)","v":42.21},{"$f":"_xlfn.XLOOKUP(C39,'[3]zss forecast'!$B$3:$B$155,'[3]zss forecast'!$BX$3:$BX$155)","v":42.17},{"$f":"_xlfn.XLOOKUP(1,('[2]ZSS Results'!$B$4:$B$462=\"Powercor\")*('[2]ZSS Results'!$D$4:$D$462=\"summer\")*('[2]ZSS Results'!$C$4:$C$462=C39),'[2]ZSS Results'!$AN$4:$AN$462)","v":38.29},{"$f":"_xlfn.XLOOKUP(C39,'[3]zss forecast'!$B$3:$B$155,'[3]zss forecast'!$DA$3:$DA$155)","v":38.26}]
[null,"Zone","GLE","Non-coincident","Summer",{"$f":"_xlfn.XLOOKUP(C40,[1]Sheet1!$A$2:$A$86,[1]Sheet1!$B$2:$B$86)","v":79.5},null,{"$f":"_xlfn.XLOOKUP(1,('[2]ZSS Results'!$B$4:$B$462=\"Powercor\")*('[2]ZSS Results'!$D$4:$D$462=\"summer\")*('[2]ZSS Results'!$C$4:$C$462=C40),'[2]ZSS Results'!$N$4:$N$462)","v":65.05},{"$f":"_xlfn.XLOOKUP(C40,'[3]zss forecast'!$B$3:$B$155,'[3]zss forecast'!$BX$3:$BX$155)","v":64.959999999999994},{"$f":"_xlfn.XLOOKUP(1,('[2]ZSS Results'!$B$4:$B$462=\"Powercor\")*('[2]ZSS Results'!$D$4:$D$462=\"summer\")*('[2]ZSS Results'!$C$4:$C$462=C40),'[2]ZSS Results'!$AN$4:$AN$462)","v":58.97},{"$f":"_xlfn.XLOOKUP(C40,'[3]zss forecast'!$B$3:$B$155,'[3]zss forecast'!$DA$3:$DA$155)","v":58.91}]
[null,"Zone","GSB","Non-coincident","Summer",{"$f":"_xlfn.XLOOKUP(C41,[1]Sheet1!$A$2:$A$86,[1]Sheet1!$B$2:$B$86)","v":66},null,{"$f":"_xlfn.XLOOKUP(1,('[2]ZSS Results'!$B$4:$B$462=\"Powercor\")*('[2]ZSS Results'!$D$4:$D$462=\"summer\")*('[2]ZSS Results'!$C$4:$C$462=C41),'[2]ZSS Results'!$N$4:$N$462)","v":31.85},{"$f":"_xlfn.XLOOKUP(C41,'[3]zss forecast'!$B$3:$B$155,'[3]zss forecast'!$BX$3:$BX$155)","v":31.82},{"$f":"_xlfn.XLOOKUP(1,('[2]ZSS Results'!$B$4:$B$462=\"Powercor\")*('[2]ZSS Results'!$D$4:$D$462=\"summer\")*('[2]ZSS Results'!$C$4:$C$462=C41),'[2]ZSS Results'!$AN$4:$AN$462)","v":28.94},{"$f":"_xlfn.XLOOKUP(C41,'[3]zss forecast'!$B$3:$B$155,'[3]zss forecast'!$DA$3:$DA$155)","v":28.9}]
[null,"Zone","HSM","Non-coincident","Summer",{"$f":"_xlfn.XLOOKUP(C42,[1]Sheet1!$A$2:$A$86,[1]Sheet1!$B$2:$B$86)","v":40.5},null,{"$f":"_xlfn.XLOOKUP(1,('[2]ZSS Results'!$B$4:$B$462=\"Powercor\")*('[2]ZSS Results'!$D$4:$D$462=\"summer\")*('[2]ZSS Results'!$C$4:$C$462=C42),'[2]ZSS Results'!$N$4:$N$462)","v":43.58},{"$f":"_xlfn.XLOOKUP(C42,'[3]zss forecast'!$B$3:$B$155,'[3]zss forecast'!$BX$3:$BX$155)","v":43.4},{"$f":"_xlfn.XLOOKUP(1,('[2]ZSS Results'!$B$4:$B$462=\"Powercor\")*('[2]ZSS Results'!$D$4:$D$462=\"summer\")*('[2]ZSS Results'!$C$4:$C$462=C42),'[2]ZSS Results'!$AN$4:$AN$462)","v":41.13},{"$f":"_xlfn.XLOOKUP(C42,'[3]zss forecast'!$B$3:$B$155,'[3]zss forecast'!$DA$3:$DA$155)","v":41}]
[null,"Zone","HTN","Non-coincident","Summer",{"$f":"_xlfn.XLOOKUP(C43,[1]Sheet1!$A$2:$A$86,[1]Sheet1!$B$2:$B$86)","v":39.5},null,{"$f":"_xlfn.XLOOKUP(1,('[2]ZSS Results'!$B$4:$B$462=\"Powercor\")*('[2]ZSS Results'!$D$4:$D$462=\"summer\")*('[2]ZSS Results'!$C$4:$C$462=C43),'[2]ZSS Results'!$N$4:$N$462)","v":28.49},{"$f":"_xlfn.XLOOKUP(C43,'[3]zss forecast'!$B$3:$B$155,'[3]zss forecast'!$BX$3:$BX$155)","v":28.49},{"$f":"_xlfn.XLOOKUP(1,('[2]ZSS Results'!$B$4:$B$462=\"Powercor\")*('[2]ZSS Results'!$D$4:$D$462=\"summer\")*('[2]ZSS Results'!$C$4:$C$462=C43),'[2]ZSS Results'!$AN$4:$AN$462)","v":25.26},{"$f":"_xlfn.XLOOKUP(C43,'[3]zss forecast'!$B$3:$B$155,'[3]zss forecast'!$DA$3:$DA$155)","v":25.26}]
[null,"Zone","KRT","Non-coincident","Summer",{"$f":"_xlfn.XLOOKUP(C44,[1]Sheet1!$A$2:$A$86,[1]Sheet1!$B$2:$B$86)","v":40.5},null,{"$f":"_xlfn.XLOOKUP(1,('[2]ZSS Results'!$B$4:$B$462=\"Powercor\")*('[2]ZSS Results'!$D$4:$D$462=\"summer\")*('[2]ZSS Results'!$C$4:$C$462=C44),'[2]ZSS Results'!$N$4:$N$462)","v":37.69},{"$f":"_xlfn.XLOOKUP(C44,'[3]zss forecast'!$B$3:$B$155,'[3]zss forecast'!$BX$3:$BX$155)","v":37.68},{"$f":"_xlfn.XLOOKUP(1,('[2]ZSS Results'!$B$4:$B$462=\"Powercor\")*('[2]ZSS Results'!$D$4:$D$462=\"summer\")*('[2]ZSS Results'!$C$4:$C$462=C44),'[2]ZSS Results'!$AN$4:$AN$462)","v":29.39},{"$f":"_xlfn.XLOOKUP(C44,'[3]zss forecast'!$B$3:$B$155,'[3]zss forecast'!$DA$3:$DA$155)","v":29.38}]
[null,"Zone","KYM","Non-coincident","Summer",{"$f":"_xlfn.XLOOKUP(C45,[1]Sheet1!$A$2:$A$86,[1]Sheet1!$B$2:$B$86)","v":40.5},null,{"$f":"_xlfn.XLOOKUP(1,('[2]ZSS Results'!$B$4:$B$462=\"Powercor\")*('[2]ZSS Results'!$D$4:$D$462=\"summer\")*('[2]ZSS Results'!$C$4:$C$462=C45),'[2]ZSS Results'!$N$4:$N$462)","v":28.71},{"$f":"_xlfn.XLOOKUP(C45,'[3]zss forecast'!$B$3:$B$155,'[3]zss forecast'!$BX$3:$BX$155)","v":28.59},{"$f":"_xlfn.XLOOKUP(1,('[2]ZSS Results'!$B$4:$B$462=\"Powercor\")*('[2]ZSS Results'!$D$4:$D$462=\"summer\")*('[2]ZSS Results'!$C$4:$C$462=C45),'[2]ZSS Results'!$AN$4:$AN$462)","v":26.42},{"$f":"_xlfn.XLOOKUP(C45,'[3]zss forecast'!$B$3:$B$155,'[3]zss forecast'!$DA$3:$DA$155)","v":26.32}]
[null,"Zone","LV","Non-coincident","Summer",{"$f":"_xlfn.XLOOKUP(C46,[1]Sheet1!$A$2:$A$86,[1]Sheet1!$B$2:$B$86)","v":99},null,{"$f":"_xlfn.XLOOKUP(1,('[2]ZSS Results'!$B$4:$B$462=\"Powercor\")*('[2]ZSS Results'!$D$4:$D$462=\"summer\")*('[2]ZSS Results'!$C$4:$C$462=C46),'[2]ZSS Results'!$N$4:$N$462)","v":109.33},{"$f":"_xlfn.XLOOKUP(C46,'[3]zss forecast'!$B$3:$B$155,'[3]zss forecast'!$BX$3:$BX$155)","v":109.16},{"$f":"_xlfn.XLOOKUP(1,('[2]ZSS Results'!$B$4:$B$462=\"Powercor\")*('[2]ZSS Results'!$D$4:$D$462=\"summer\")*('[2]ZSS Results'!$C$4:$C$462=C46),'[2]ZSS Results'!$AN$4:$AN$462)","v":99.4},{"$f":"_xlfn.XLOOKUP(C46,'[3]zss forecast'!$B$3:$B$155,'[3]zss forecast'!$DA$3:$DA$155)","v":99.33}]
[null,"Zone","LVN","Non-coincident","Summer",{"$f":"_xlfn.XLOOKUP(C47,[1]Sheet1!$A$2:$A$86,[1]Sheet1!$B$2:$B$86)","v":99},null,{"$f":"_xlfn.XLOOKUP(1,('[2]ZSS Results'!$B$4:$B$462=\"Powercor\")*('[2]ZSS Results'!$D$4:$D$462=\"summer\")*('[2]ZSS Results'!$C$4:$C$462=C47),'[2]ZSS Results'!$N$4:$N$462)","v":83.59},{"$f":"_xlfn.XLOOKUP(C47,'[3]zss forecast'!$B$3:$B$155,'[3]zss forecast'!$BX$3:$BX$155)","v":81.66},{"$f":"_xlfn.XLOOKUP(1,('[2]ZSS Results'!$B$4:$B$462=\"Powercor\")*('[2]ZSS Results'!$D$4:$D$462=\"summer\")*('[2]ZSS Results'!$C$4:$C$462=C47),'[2]ZSS Results'!$AN$4:$AN$462)","v":72.27},{"$f":"_xlfn.XLOOKUP(C47,'[3]zss forecast'!$B$3:$B$155,'[3]zss forecast'!$DA$3:$DA$155)","v":70.69}]
[null,"Zone","LVN11","Non-coincident","Summer",{"$f":"_xlfn.XLOOKUP(C48,[1]Sheet1!$A$2:$A$86,[1]Sheet1!$B$2:$B$86)","v":30},null,{"$f":"_xlfn.XLOOKUP(1,('[2]ZSS Results'!$B$4:$B$462=\"Powercor\")*('[2]ZSS Results'!$D$4:$D$462=\"summer\")*('[2]ZSS Results'!$C$4:$C$462=C48),'[2]ZSS Results'!$N$4:$N$462)","v":14.05},{"$f":"_xlfn.XLOOKUP(C48,'[3]zss forecast'!$B$3:$B$155,'[3]zss forecast'!$BX$3:$BX$155)","v":13.56},{"$f":"_xlfn.XLOOKUP(1,('[2]ZSS Results'!$B$4:$B$462=\"Powercor\")*('[2]ZSS Results'!$D$4:$D$462=\"summer\")*('[2]ZSS Results'!$C$4:$C$462=C48),'[2]ZSS Results'!$AN$4:$AN$462)","v":13.95},{"$f":"_xlfn.XLOOKUP(C48,'[3]zss forecast'!$B$3:$B$155,'[3]zss forecast'!$DA$3:$DA$155)","v":13.48}]
[null,"Zone","MBN","Non-coincident","Summer",{"$f":"_xlfn.XLOOKUP(C49,[1]Sheet1!$A$2:$A$86,[1]Sheet1!$B$2:$B$86)","v":59},null,{"$f":"_xlfn.XLOOKUP(1,('[2]ZSS Results'!$B$4:$B$462=\"Powercor\")*('[2]ZSS Results'!$D$4:$D$462=\"summer\")*('[2]ZSS Results'!$C$4:$C$462=C49),'[2]ZSS Results'!$N$4:$N$462)","v":52.78},{"$f":"_xlfn.XLOOKUP(C49,'[3]zss forecast'!$B$3:$B$155,'[3]zss forecast'!$BX$3:$BX$155)","v":51.99},{"$f":"_xlfn.XLOOKUP(1,('[2]ZSS Results'!$B$4:$B$462=\"Powercor\")*('[2]ZSS Results'!$D$4:$D$462=\"summer\")*('[2]ZSS Results'!$C$4:$C$462=C49),'[2]ZSS Results'!$AN$4:$AN$462)","v":47.6},{"$f":"_xlfn.XLOOKUP(C49,'[3]zss forecast'!$B$3:$B$155,'[3]zss forecast'!$DA$3:$DA$155)","v":46.99}]
[null,"Zone","MDA","Non-coincident","Summer",{"$f":"_xlfn.XLOOKUP(C50,[1]Sheet1!$A$2:$A$86,[1]Sheet1!$B$2:$B$86)","v":66},null,{"$f":"_xlfn.XLOOKUP(1,('[2]ZSS Results'!$B$4:$B$462=\"Powercor\")*('[2]ZSS Results'!$D$4:$D$462=\"summer\")*('[2]ZSS Results'!$C$4:$C$462=C50),'[2]ZSS Results'!$N$4:$N$462)","v":56.64},{"$f":"_xlfn.XLOOKUP(C50,'[3]zss forecast'!$B$3:$B$155,'[3]zss forecast'!$BX$3:$BX$155)","v":55.55},{"$f":"_xlfn.XLOOKUP(1,('[2]ZSS Results'!$B$4:$B$462=\"Powercor\")*('[2]ZSS Results'!$D$4:$D$462=\"summer\")*('[2]ZSS Results'!$C$4:$C$462=C50),'[2]ZSS Results'!$AN$4:$AN$462)","v":51.43},{"$f":"_xlfn.XLOOKUP(C50,'[3]zss forecast'!$B$3:$B$155,'[3]zss forecast'!$DA$3:$DA$155)","v":50.61}]
[null,"Zone","MLN","Non-coincident","Summer",{"$f":"_xlfn.XLOOKUP(C51,[1]Sheet1!$A$2:$A$86,[1]Sheet1!$B$2:$B$86)","v":99},null,{"$f":"_xlfn.XLOOKUP(1,('[2]ZSS Results'!$B$4:$B$462=\"Powercor\")*('[2]ZSS Results'!$D$4:$D$462=\"summer\")*('[2]ZSS Results'!$C$4:$C$462=C51),'[2]ZSS Results'!$N$4:$N$462)","v":107.55},{"$f":"_xlfn.XLOOKUP(C51,'[3]zss forecast'!$B$3:$B$155,'[3]zss forecast'!$BX$3:$BX$155)","v":107.52},{"$f":"_xlfn.XLOOKUP(1,('[2]ZSS Results'!$B$4:$B$462=\"Powercor\")*('[2]ZSS Results'!$D$4:$D$462=\"summer\")*('[2]ZSS Results'!$C$4:$C$462=C51),'[2]ZSS Results'!$AN$4:$AN$462)","v":96.01},{"$f":"_xlfn.XLOOKUP(C51,'[3]zss forecast'!$B$3:$B$155,'[3]zss forecast'!$DA$3:$DA$155)","v":96.01}]
[null,"Zone","MNA","Non-coincident","Summer",{"$f":"_xlfn.XLOOKUP(C52,[1]Sheet1!$A$2:$A$86,[1]Sheet1!$B$2:$B$86)","v":66},null,{"$f":"_xlfn.XLOOKUP(1,('[2]ZSS Results'!$B$4:$B$462=\"Powercor\")*('[2]ZSS Results'!$D$4:$D$462=\"summer\")*('[2]ZSS Results'!$C$4:$C$462=C52),'[2]ZSS Results'!$N$4:$N$462)","v":48.59},{"$f":"_xlfn.XLOOKUP(C52,'[3]zss forecast'!$B$3:$B$155,'[3]zss forecast'!$BX$3:$BX$155)","v":47.16},{"$f":"_xlfn.XLOOKUP(1,('[2]ZSS Results'!$B$4:$B$462=\"Powercor\")*('[2]ZSS Results'!$D$4:$D$462=\"summer\")*('[2]ZSS Results'!$C$4:$C$462=C52),'[2]ZSS Results'!$AN$4:$AN$462)","v":43.64},{"$f":"_xlfn.XLOOKUP(C52,'[3]zss forecast'!$B$3:$B$155,'[3]zss forecast'!$DA$3:$DA$155)","v":42.54}]
[null,"Zone","MRO","Non-coincident","Summer",{"$f":"_xlfn.XLOOKUP(C53,[1]Sheet1!$A$2:$A$86,[1]Sheet1!$B$2:$B$86)","v":27},null,{"$f":"_xlfn.XLOOKUP(1,('[2]ZSS Results'!$B$4:$B$462=\"Powercor\")*('[2]ZSS Results'!$D$4:$D$462=\"summer\")*('[2]ZSS Results'!$C$4:$C$462=C53),'[2]ZSS Results'!$N$4:$N$462)","v":23.37},{"$f":"_xlfn.XLOOKUP(C53,'[3]zss forecast'!$B$3:$B$155,'[3]zss forecast'!$BX$3:$BX$155)","v":23.34},{"$f":"_xlfn.XLOOKUP(1,('[2]ZSS Results'!$B$4:$B$462=\"Powercor\")*('[2]ZSS Results'!$D$4:$D$462=\"summer\")*('[2]ZSS Results'!$C$4:$C$462=C53),'[2]ZSS Results'!$AN$4:$AN$462)","v":21.63},{"$f":"_xlfn.XLOOKUP(C53,'[3]zss forecast'!$B$3:$B$155,'[3]zss forecast'!$DA$3:$DA$155)","v":21.62}]
[null,"Zone","MTC","Non-coincident","Summer",{"$f":"_xlfn.XLOOKUP(C54,[1]Sheet1!$A$2:$A$86,[1]Sheet1!$B$2:$B$86)","v":66},null,{"$f":"_xlfn.XLOOKUP(1,('[2]ZSS Results'!$B$4:$B$462=\"Powercor\")*('[2]ZSS Results'!$D$4:$D$462=\"summer\")*('[2]ZSS Results'!$C$4:$C$462=C54),'[2]ZSS Results'!$N$4:$N$462)","v":0},{"$f":"_xlfn.XLOOKUP(C54,'[3]zss forecast'!$B$3:$B$155,'[3]zss forecast'!$BX$3:$BX$155)","v":0},{"$f":"_xlfn.XLOOKUP(1,('[2]ZSS Results'!$B$4:$B$462=\"Powercor\")*('[2]ZSS Results'!$D$4:$D$462=\"summer\")*('[2]ZSS Results'!$C$4:$C$462=C54),'[2]ZSS Results'!$AN$4:$AN$462)","v":0},{"$f":"_xlfn.XLOOKUP(C54,'[3]zss forecast'!$B$3:$B$155,'[3]zss forecast'!$DA$3:$DA$155)","v":0}]
[null,"Zone","NHL","Non-coincident","Summer",{"$f":"_xlfn.XLOOKUP(C55,[1]Sheet1!$A$2:$A$86,[1]Sheet1!$B$2:$B$86)","v":20},null,{"$f":"_xlfn.XLOOKUP(1,('[2]ZSS Results'!$B$4:$B$462=\"Powercor\")*('[2]ZSS Results'!$D$4:$D$462=\"summer\")*('[2]ZSS Results'!$C$4:$C$462=C55),'[2]ZSS Results'!$N$4:$N$462)","v":16.829999999999998},{"$f":"_xlfn.XLOOKUP(C55,'[3]zss forecast'!$B$3:$B$155,'[3]zss forecast'!$BX$3:$BX$155)","v":16.829999999999998},{"$f":"_xlfn.XLOOKUP(1,('[2]ZSS Results'!$B$4:$B$462=\"Powercor\")*('[2]ZSS Results'!$D$4:$D$462=\"summer\")*('[2]ZSS Results'!$C$4:$C$462=C55),'[2]ZSS Results'!$AN$4:$AN$462)","v":13.7},{"$f":"_xlfn.XLOOKUP(C55,'[3]zss forecast'!$B$3:$B$155,'[3]zss forecast'!$DA$3:$DA$155)","v":13.69}]
[null,"Zone","NKA","Non-coincident","Summer",{"$f":"_xlfn.XLOOKUP(C56,[1]Sheet1!$A$2:$A$86,[1]Sheet1!$B$2:$B$86)","v":39.5},null,{"$f":"_xlfn.XLOOKUP(1,('[2]ZSS Results'!$B$4:$B$462=\"Powercor\")*('[2]ZSS Results'!$D$4:$D$462=\"summer\")*('[2]ZSS Results'!$C$4:$C$462=C56),'[2]ZSS Results'!$N$4:$N$462)","v":32.450000000000003},{"$f":"_xlfn.XLOOKUP(C56,'[3]zss forecast'!$B$3:$B$155,'[3]zss forecast'!$BX$3:$BX$155)","v":32.44},{"$f":"_xlfn.XLOOKUP(1,('[2]ZSS Results'!$B$4:$B$462=\"Powercor\")*('[2]ZSS Results'!$D$4:$D$462=\"summer\")*('[2]ZSS Results'!$C$4:$C$462=C56),'[2]ZSS Results'!$AN$4:$AN$462)","v":29.04},{"$f":"_xlfn.XLOOKUP(C56,'[3]zss forecast'!$B$3:$B$155,'[3]zss forecast'!$DA$3:$DA$155)","v":29.01}]
[null,"Zone","OYN","Non-coincident","Summer",{"$f":"_xlfn.XLOOKUP(C57,[1]Sheet1!$A$2:$A$86,[1]Sheet1!$B$2:$B$86)","v":27},null,{"$f":"_xlfn.XLOOKUP(1,('[2]ZSS Results'!$B$4:$B$462=\"Powercor\")*('[2]ZSS Results'!$D$4:$D$462=\"summer\")*('[2]ZSS Results'!$C$4:$C$462=C57),'[2]ZSS Results'!$N$4:$N$462)","v":7.96},{"$f":"_xlfn.XLOOKUP(C57,'[3]zss forecast'!$B$3:$B$155,'[3]zss forecast'!$BX$3:$BX$155)","v":6.92},{"$f":"_xlfn.XLOOKUP(1,('[2]ZSS Results'!$B$4:$B$462=\"Powercor\")*('[2]ZSS Results'!$D$4:$D$462=\"summer\")*('[2]ZSS Results'!$C$4:$C$462=C57),'[2]ZSS Results'!$AN$4:$AN$462)","v":7.55},{"$f":"_xlfn.XLOOKUP(C57,'[3]zss forecast'!$B$3:$B$155,'[3]zss forecast'!$DA$3:$DA$155)","v":6.56}]
[null,"Zone","PLD","Non-coincident","Summer",{"$f":"_xlfn.XLOOKUP(C58,[1]Sheet1!$A$2:$A$86,[1]Sheet1!$B$2:$B$86)","v":32},null,{"$f":"_xlfn.XLOOKUP(1,('[2]ZSS Results'!$B$4:$B$462=\"Powercor\")*('[2]ZSS Results'!$D$4:$D$462=\"summer\")*('[2]ZSS Results'!$C$4:$C$462=C58),'[2]ZSS Results'!$N$4:$N$462)","v":16.16},{"$f":"_xlfn.XLOOKUP(C58,'[3]zss forecast'!$B$3:$B$155,'[3]zss forecast'!$BX$3:$BX$155)","v":16.149999999999999},{"$f":"_xlfn.XLOOKUP(1,('[2]ZSS Results'!$B$4:$B$462=\"Powercor\")*('[2]ZSS Results'!$D$4:$D$462=\"summer\")*('[2]ZSS Results'!$C$4:$C$462=C58),'[2]ZSS Results'!$AN$4:$AN$462)","v":14.91},{"$f":"_xlfn.XLOOKUP(C58,'[3]zss forecast'!$B$3:$B$155,'[3]zss forecast'!$DA$3:$DA$155)","v":14.89}]
[null,"Zone","RVL","Non-coincident","Summer",{"$f":"_xlfn.XLOOKUP(C59,[1]Sheet1!$A$2:$A$86,[1]Sheet1!$B$2:$B$86)","v":19.5},null,{"$f":"_xlfn.XLOOKUP(1,('[2]ZSS Results'!$B$4:$B$462=\"Powercor\")*('[2]ZSS Results'!$D$4:$D$462=\"summer\")*('[2]ZSS Results'!$C$4:$C$462=C59),'[2]ZSS Results'!$N$4:$N$462)","v":24.72},{"$f":"_xlfn.XLOOKUP(C59,'[3]zss forecast'!$B$3:$B$155,'[3]zss forecast'!$BX$3:$BX$155)","v":24.7},{"$f":"_xlfn.XLOOKUP(1,('[2]ZSS Results'!$B$4:$B$462=\"Powercor\")*('[2]ZSS Results'!$D$4:$D$462=\"summer\")*('[2]ZSS Results'!$C$4:$C$462=C59),'[2]ZSS Results'!$AN$4:$AN$462)","v":21.55},{"$f":"_xlfn.XLOOKUP(C59,'[3]zss forecast'!$B$3:$B$155,'[3]zss forecast'!$DA$3:$DA$155)","v":21.52}]
[null,"Zone","SA","Non-coincident","Summer",{"$f":"_xlfn.XLOOKUP(C60,[1]Sheet1!$A$2:$A$86,[1]Sheet1!$B$2:$B$86)","v":93},null,{"$f":"_xlfn.XLOOKUP(1,('[2]ZSS Results'!$B$4:$B$462=\"Powercor\")*('[2]ZSS Results'!$D$4:$D$462=\"summer\")*('[2]ZSS Results'!$C$4:$C$462=C60),'[2]ZSS Results'!$N$4:$N$462)","v":93.46},{"$f":"_xlfn.XLOOKUP(C60,'[3]zss forecast'!$B$3:$B$155,'[3]zss forecast'!$BX$3:$BX$155)","v":92.9},{"$f":"_xlfn.XLOOKUP(1,('[2]ZSS Results'!$B$4:$B$462=\"Powercor\")*('[2]ZSS Results'!$D$4:$D$462=\"summer\")*('[2]ZSS Results'!$C$4:$C$462=C60),'[2]ZSS Results'!$AN$4:$AN$462)","v":85.51},{"$f":"_xlfn.XLOOKUP(C60,'[3]zss forecast'!$B$3:$B$155,'[3]zss forecast'!$DA$3:$DA$155)","v":85.11}]
[null,"Zone","SHL","Non-coincident","Summer",{"$f":"_xlfn.XLOOKUP(C61,[1]Sheet1!$A$2:$A$86,[1]Sheet1!$B$2:$B$86)","v":40.5},null,{"$f":"_xlfn.XLOOKUP(1,('[2]ZSS Results'!$B$4:$B$462=\"Powercor\")*('[2]ZSS Results'!$D$4:$D$462=\"summer\")*('[2]ZSS Results'!$C$4:$C$462=C61),'[2]ZSS Results'!$N$4:$N$462)","v":41.31},{"$f":"_xlfn.XLOOKUP(C61,'[3]zss forecast'!$B$3:$B$155,'[3]zss forecast'!$BX$3:$BX$155)","v":41.22},{"$f":"_xlfn.XLOOKUP(1,('[2]ZSS Results'!$B$4:$B$462=\"Powercor\")*('[2]ZSS Results'!$D$4:$D$462=\"summer\")*('[2]ZSS Results'!$C$4:$C$462=C61),'[2]ZSS Results'!$AN$4:$AN$462)","v":37.049999999999997},{"$f":"_xlfn.XLOOKUP(C61,'[3]zss forecast'!$B$3:$B$155,'[3]zss forecast'!$DA$3:$DA$155)","v":37.03}]
[null,"Zone","SHN","Non-coincident","Summer",{"$f":"_xlfn.XLOOKUP(C62,[1]Sheet1!$A$2:$A$86,[1]Sheet1!$B$2:$B$86)","v":66},null,{"$f":"_xlfn.XLOOKUP(1,('[2]ZSS Results'!$B$4:$B$462=\"Powercor\")*('[2]ZSS Results'!$D$4:$D$462=\"summer\")*('[2]ZSS Results'!$C$4:$C$462=C62),'[2]ZSS Results'!$N$4:$N$462)","v":42.39},{"$f":"_xlfn.XLOOKUP(C62,'[3]zss forecast'!$B$3:$B$155,'[3]zss forecast'!$BX$3:$BX$155)","v":42.37},{"$f":"_xlfn.XLOOKUP(1,('[2]ZSS Results'!$B$4:$B$462=\"Powercor\")*('[2]ZSS Results'!$D$4:$D$462=\"summer\")*('[2]ZSS Results'!$C$4:$C$462=C62),'[2]ZSS Results'!$AN$4:$AN$462)","v":38.29},{"$f":"_xlfn.XLOOKUP(C62,'[3]zss forecast'!$B$3:$B$155,'[3]zss forecast'!$DA$3:$DA$155)","v":38.28}]
[null,"Zone","SHP","Non-coincident","Summer",{"$f":"_xlfn.XLOOKUP(C63,[1]Sheet1!$A$2:$A$86,[1]Sheet1!$B$2:$B$86)","v":66},null,{"$f":"_xlfn.XLOOKUP(1,('[2]ZSS Results'!$B$4:$B$462=\"Powercor\")*('[2]ZSS Results'!$D$4:$D$462=\"summer\")*('[2]ZSS Results'!$C$4:$C$462=C63),'[2]ZSS Results'!$N$4:$N$462)","v":36.1},{"$f":"_xlfn.XLOOKUP(C63,'[3]zss forecast'!$B$3:$B$155,'[3]zss forecast'!$BX$3:$BX$155)","v":35.78},{"$f":"_xlfn.XLOOKUP(1,('[2]ZSS Results'!$B$4:$B$462=\"Powercor\")*('[2]ZSS Results'!$D$4:$D$462=\"summer\")*('[2]ZSS Results'!$C$4:$C$462=C63),'[2]ZSS Results'!$AN$4:$AN$462)","v":24.16},{"$f":"_xlfn.XLOOKUP(C63,'[3]zss forecast'!$B$3:$B$155,'[3]zss forecast'!$DA$3:$DA$155)","v":24}]
[null,"Zone","SSE","Non-coincident","Summer",{"$f":"_xlfn.XLOOKUP(C64,[1]Sheet1!$A$2:$A$86,[1]Sheet1!$B$2:$B$86)","v":99},null,{"$f":"_xlfn.XLOOKUP(1,('[2]ZSS Results'!$B$4:$B$462=\"Powercor\")*('[2]ZSS Results'!$D$4:$D$462=\"summer\")*('[2]ZSS Results'!$C$4:$C$462=C64),'[2]ZSS Results'!$N$4:$N$462)","v":73.83},{"$f":"_xlfn.XLOOKUP(C64,'[3]zss forecast'!$B$3:$B$155,'[3]zss forecast'!$BX$3:$BX$155)","v":72.67},{"$f":"_xlfn.XLOOKUP(1,('[2]ZSS Results'!$B$4:$B$462=\"Powercor\")*('[2]ZSS Results'!$D$4:$D$462=\"summer\")*('[2]ZSS Results'!$C$4:$C$462=C64),'[2]ZSS Results'!$AN$4:$AN$462)","v":68.67},{"$f":"_xlfn.XLOOKUP(C64,'[3]zss forecast'!$B$3:$B$155,'[3]zss forecast'!$DA$3:$DA$155)","v":67.66}]
[null,"Zone","STL","Non-coincident","Summer",{"$f":"_xlfn.XLOOKUP(C65,[1]Sheet1!$A$2:$A$86,[1]Sheet1!$B$2:$B$86)","v":27},null,{"$f":"_xlfn.XLOOKUP(1,('[2]ZSS Results'!$B$4:$B$462=\"Powercor\")*('[2]ZSS Results'!$D$4:$D$462=\"summer\")*('[2]ZSS Results'!$C$4:$C$462=C65),'[2]ZSS Results'!$N$4:$N$462)","v":19.54},{"$f":"_xlfn.XLOOKUP(C65,'[3]zss forecast'!$B$3:$B$155,'[3]zss forecast'!$BX$3:$BX$155)","v":19.100000000000001},{"$f":"_xlfn.XLOOKUP(1,('[2]ZSS Results'!$B$4:$B$462=\"Powercor\")*('[2]ZSS Results'!$D$4:$D$462=\"summer\")*('[2]ZSS Results'!$C$4:$C$462=C65),'[2]ZSS Results'!$AN$4:$AN$462)","v":18.29},{"$f":"_xlfn.XLOOKUP(C65,'[3]zss forecast'!$B$3:$B$155,'[3]zss forecast'!$DA$3:$DA$155)","v":17.850000000000001}]
[null,"Zone","STN","Non-coincident","Summer",{"$f":"_xlfn.XLOOKUP(C66,[1]Sheet1!$A$2:$A$86,[1]Sheet1!$B$2:$B$86)","v":79},null,{"$f":"_xlfn.XLOOKUP(1,('[2]ZSS Results'!$B$4:$B$462=\"Powercor\")*('[2]ZSS Results'!$D$4:$D$462=\"summer\")*('[2]ZSS Results'!$C$4:$C$462=C66),'[2]ZSS Results'!$N$4:$N$462)","v":51.58},{"$f":"_xlfn.XLOOKUP(C66,'[3]zss forecast'!$B$3:$B$155,'[3]zss forecast'!$BX$3:$BX$155)","v":50.47},{"$f":"_xlfn.XLOOKUP(1,('[2]ZSS Results'!$B$4:$B$462=\"Powercor\")*('[2]ZSS Results'!$D$4:$D$462=\"summer\")*('[2]ZSS Results'!$C$4:$C$462=C66),'[2]ZSS Results'!$AN$4:$AN$462)","v":48.58},{"$f":"_xlfn.XLOOKUP(C66,'[3]zss forecast'!$B$3:$B$155,'[3]zss forecast'!$DA$3:$DA$155)","v":47.59}]
[null,"Zone","SU","Non-coincident","Summer",{"$f":"_xlfn.XLOOKUP(C67,[1]Sheet1!$A$2:$A$86,[1]Sheet1!$B$2:$B$86)","v":99},null,{"$f":"_xlfn.XLOOKUP(1,('[2]ZSS Results'!$B$4:$B$462=\"Powercor\")*('[2]ZSS Results'!$D$4:$D$462=\"summer\")*('[2]ZSS Results'!$C$4:$C$462=C67),'[2]ZSS Results'!$N$4:$N$462)","v":97.27},{"$f":"_xlfn.XLOOKUP(C67,'[3]zss forecast'!$B$3:$B$155,'[3]zss forecast'!$BX$3:$BX$155)","v":96.8},{"$f":"_xlfn.XLOOKUP(1,('[2]ZSS Results'!$B$4:$B$462=\"Powercor\")*('[2]ZSS Results'!$D$4:$D$462=\"summer\")*('[2]ZSS Results'!$C$4:$C$462=C67),'[2]ZSS Results'!$AN$4:$AN$462)","v":86.68},{"$f":"_xlfn.XLOOKUP(C67,'[3]zss forecast'!$B$3:$B$155,'[3]zss forecast'!$DA$3:$DA$155)","v":86.34}]
[null,"Zone","TNA","Non-coincident","Summer",{"$f":"_xlfn.XLOOKUP(C68,[1]Sheet1!$A$2:$A$86,[1]Sheet1!$B$2:$B$86)","v":99},null,{"$f":"_xlfn.XLOOKUP(1,('[2]ZSS Results'!$B$4:$B$462=\"Powercor\")*('[2]ZSS Results'!$D$4:$D$462=\"summer\")*('[2]ZSS Results'!$C$4:$C$462=C68),'[2]ZSS Results'!$N$4:$N$462)","v":145.38},{"$f":"_xlfn.XLOOKUP(C68,'[3]zss forecast'!$B$3:$B$155,'[3]zss forecast'!$BX$3:$BX$155)","v":145.19999999999999},{"$f":"_xlfn.XLOOKUP(1,('[2]ZSS Results'!$B$4:$B$462=\"Powercor\")*('[2]ZSS Results'!$D$4:$D$462=\"summer\")*('[2]ZSS Results'!$C$4:$C$462=C68),'[2]ZSS Results'!$AN$4:$AN$462)","v":123.61},{"$f":"_xlfn.XLOOKUP(C68,'[3]zss forecast'!$B$3:$B$155,'[3]zss forecast'!$DA$3:$DA$155)","v":123.32}]
[null,"Zone","TQY","Non-coincident","Summer",{"$f":"_xlfn.XLOOKUP(C69,[1]Sheet1!$A$2:$A$86,[1]Sheet1!$B$2:$B$86)","v":66},null,{"$f":"_xlfn.XLOOKUP(1,('[2]ZSS Results'!$B$4:$B$462=\"Powercor\")*('[2]ZSS Results'!$D$4:$D$462=\"summer\")*('[2]ZSS Results'!$C$4:$C$462=C69),'[2]ZSS Results'!$N$4:$N$462)","v":39.32},{"$f":"_xlfn.XLOOKUP(C69,'[3]zss forecast'!$B$3:$B$155,'[3]zss forecast'!$BX$3:$BX$155)","v":39.270000000000003},{"$f":"_xlfn.XLOOKUP(1,('[2]ZSS Results'!$B$4:$B$462=\"Powercor\")*('[2]ZSS Results'!$D$4:$D$462=\"summer\")*('[2]ZSS Results'!$C$4:$C$462=C69),'[2]ZSS Results'!$AN$4:$AN$462)","v":34.369999999999997},{"$f":"_xlfn.XLOOKUP(C69,'[3]zss forecast'!$B$3:$B$155,'[3]zss forecast'!$DA$3:$DA$155)","v":34.270000000000003}]
[null,"Zone","TRG","Non-coincident","Summer",{"$f":"_xlfn.XLOOKUP(C70,[1]Sheet1!$A$2:$A$86,[1]Sheet1!$B$2:$B$86)","v":46.5},null,{"$f":"_xlfn.XLOOKUP(1,('[2]ZSS Results'!$B$4:$B$462=\"Powercor\")*('[2]ZSS Results'!$D$4:$D$462=\"summer\")*('[2]ZSS Results'!$C$4:$C$462=C70),'[2]ZSS Results'!$N$4:$N$462)","v":23.95},{"$f":"_xlfn.XLOOKUP(C70,'[3]zss forecast'!$B$3:$B$155,'[3]zss forecast'!$BX$3:$BX$155)","v":23.88},{"$f":"_xlfn.XLOOKUP(1,('[2]ZSS Results'!$B$4:$B$462=\"Powercor\")*('[2]ZSS Results'!$D$4:$D$462=\"summer\")*('[2]ZSS Results'!$C$4:$C$462=C70),'[2]ZSS Results'!$AN$4:$AN$462)","v":18.04},{"$f":"_xlfn.XLOOKUP(C70,'[3]zss forecast'!$B$3:$B$155,'[3]zss forecast'!$DA$3:$DA$155)","v":17.989999999999998}]
[null,"Zone","WBE","Non-coincident","Summer",{"$f":"_xlfn.XLOOKUP(C71,[1]Sheet1!$A$2:$A$86,[1]Sheet1!$B$2:$B$86)","v":99},null,{"$f":"_xlfn.XLOOKUP(1,('[2]ZSS Results'!$B$4:$B$462=\"Powercor\")*('[2]ZSS Results'!$D$4:$D$462=\"summer\")*('[2]ZSS Results'!$C$4:$C$462=C71),'[2]ZSS Results'!$N$4:$N$462)","v":131.22},{"$f":"_xlfn.XLOOKUP(C71,'[3]zss forecast'!$B$3:$B$155,'[3]zss forecast'!$BX$3:$BX$155)","v":131.22},{"$f":"_xlfn.XLOOKUP(1,('[2]ZSS Results'!$B$4:$B$462=\"Powercor\")*('[2]ZSS Results'!$D$4:$D$462=\"summer\")*('[2]ZSS Results'!$C$4:$C$462=C71),'[2]ZSS Results'!$AN$4:$AN$462)","v":116.73},{"$f":"_xlfn.XLOOKUP(C71,'[3]zss forecast'!$B$3:$B$155,'[3]zss forecast'!$DA$3:$DA$155)","v":116.73}]
[null,"Zone","WBL","Non-coincident","Summer",{"$f":"_xlfn.XLOOKUP(C72,[1]Sheet1!$A$2:$A$86,[1]Sheet1!$B$2:$B$86)","v":79.5},null,{"$f":"_xlfn.XLOOKUP(1,('[2]ZSS Results'!$B$4:$B$462=\"Powercor\")*('[2]ZSS Results'!$D$4:$D$462=\"summer\")*('[2]ZSS Results'!$C$4:$C$462=C72),'[2]ZSS Results'!$N$4:$N$462)","v":55.5},{"$f":"_xlfn.XLOOKUP(C72,'[3]zss forecast'!$B$3:$B$155,'[3]zss forecast'!$BX$3:$BX$155)","v":55},{"$f":"_xlfn.XLOOKUP(1,('[2]ZSS Results'!$B$4:$B$462=\"Powercor\")*('[2]ZSS Results'!$D$4:$D$462=\"summer\")*('[2]ZSS Results'!$C$4:$C$462=C72),'[2]ZSS Results'!$AN$4:$AN$462)","v":50.14},{"$f":"_xlfn.XLOOKUP(C72,'[3]zss forecast'!$B$3:$B$155,'[3]zss forecast'!$DA$3:$DA$155)","v":49.74}]
[null,"Zone","WIN","Non-coincident","Summer",{"$f":"_xlfn.XLOOKUP(C73,[1]Sheet1!$A$2:$A$86,[1]Sheet1!$B$2:$B$86)","v":20.5},null,{"$f":"_xlfn.XLOOKUP(1,('[2]ZSS Results'!$B$4:$B$462=\"Powercor\")*('[2]ZSS Results'!$D$4:$D$462=\"summer\")*('[2]ZSS Results'!$C$4:$C$462=C73),'[2]ZSS Results'!$N$4:$N$462)","v":9.91},{"$f":"_xlfn.XLOOKUP(C73,'[3]zss forecast'!$B$3:$B$155,'[3]zss forecast'!$BX$3:$BX$155)","v":9.17},{"$f":"_xlfn.XLOOKUP(1,('[2]ZSS Results'!$B$4:$B$462=\"Powercor\")*('[2]ZSS Results'!$D$4:$D$462=\"summer\")*('[2]ZSS Results'!$C$4:$C$462=C73),'[2]ZSS Results'!$AN$4:$AN$462)","v":9.23},{"$f":"_xlfn.XLOOKUP(C73,'[3]zss forecast'!$B$3:$B$155,'[3]zss forecast'!$DA$3:$DA$155)","v":8.4}]
[null,"Zone","WMN","Non-coincident","Summer",{"$f":"_xlfn.XLOOKUP(C74,[1]Sheet1!$A$2:$A$86,[1]Sheet1!$B$2:$B$86)","v":46.5},null,{"$f":"_xlfn.XLOOKUP(1,('[2]ZSS Results'!$B$4:$B$462=\"Powercor\")*('[2]ZSS Results'!$D$4:$D$462=\"summer\")*('[2]ZSS Results'!$C$4:$C$462=C74),'[2]ZSS Results'!$N$4:$N$462)","v":27.81},{"$f":"_xlfn.XLOOKUP(C74,'[3]zss forecast'!$B$3:$B$155,'[3]zss forecast'!$BX$3:$BX$155)","v":27.41},{"$f":"_xlfn.XLOOKUP(1,('[2]ZSS Results'!$B$4:$B$462=\"Powercor\")*('[2]ZSS Results'!$D$4:$D$462=\"summer\")*('[2]ZSS Results'!$C$4:$C$462=C74),'[2]ZSS Results'!$AN$4:$AN$462)","v":24.25},{"$f":"_xlfn.XLOOKUP(C74,'[3]zss forecast'!$B$3:$B$155,'[3]zss forecast'!$DA$3:$DA$155)","v":23.92}]
[null,"Zone","WND","Non-coincident","Summer",{"$f":"_xlfn.XLOOKUP(C75,[1]Sheet1!$A$2:$A$86,[1]Sheet1!$B$2:$B$86)","v":66},null,{"$f":"_xlfn.XLOOKUP(1,('[2]ZSS Results'!$B$4:$B$462=\"Powercor\")*('[2]ZSS Results'!$D$4:$D$462=\"summer\")*('[2]ZSS Results'!$C$4:$C$462=C75),'[2]ZSS Results'!$N$4:$N$462)","v":25.03},{"$f":"_xlfn.XLOOKUP(C75,'[3]zss forecast'!$B$3:$B$155,'[3]zss forecast'!$BX$3:$BX$155)","v":24.85},{"$f":"_xlfn.XLOOKUP(1,('[2]ZSS Results'!$B$4:$B$462=\"Powercor\")*('[2]ZSS Results'!$D$4:$D$462=\"summer\")*('[2]ZSS Results'!$C$4:$C$462=C75),'[2]ZSS Results'!$AN$4:$AN$462)","v":21.61},{"$f":"_xlfn.XLOOKUP(C75,'[3]zss forecast'!$B$3:$B$155,'[3]zss forecast'!$DA$3:$DA$155)","v":21.38}]
[null,"Zone","WPD","Non-coincident","Summer",{"$f":"_xlfn.XLOOKUP(C76,[1]Sheet1!$A$2:$A$86,[1]Sheet1!$B$2:$B$86)","v":79.5},null,{"$f":"_xlfn.XLOOKUP(1,('[2]ZSS Results'!$B$4:$B$462=\"Powercor\")*('[2]ZSS Results'!$D$4:$D$462=\"summer\")*('[2]ZSS Results'!$C$4:$C$462=C76),'[2]ZSS Results'!$N$4:$N$462)","v":60.54},{"$f":"_xlfn.XLOOKUP(C76,'[3]zss forecast'!$B$3:$B$155,'[3]zss forecast'!$BX$3:$BX$155)","v":60.54},{"$f":"_xlfn.XLOOKUP(1,('[2]ZSS Results'!$B$4:$B$462=\"Powercor\")*('[2]ZSS Results'!$D$4:$D$462=\"summer\")*('[2]ZSS Results'!$C$4:$C$462=C76),'[2]ZSS Results'!$AN$4:$AN$462)","v":54.3},{"$f":"_xlfn.XLOOKUP(C76,'[3]zss forecast'!$B$3:$B$155,'[3]zss forecast'!$DA$3:$DA$155)","v":54.3}]
[null,"Zone","AC","Non-coincident","Winter",{"$f":"_xlfn.XLOOKUP(C77,[1]Sheet1!$A$2:$A$86,[1]Sheet1!$B$2:$B$86)","v":40},null,{"$f":"_xlfn.XLOOKUP(1,('[2]ZSS Results'!$B$4:$B$462=\"Powercor\")*('[2]ZSS Results'!$D$4:$D$462=\"winter\")*('[2]ZSS Results'!$C$4:$C$462=C77),'[2]ZSS Results'!$N$4:$N$462)","v":6.2},{"$f":"_xlfn.XLOOKUP(C77,'[3]zss forecast'!$B$3:$B$155,'[3]zss forecast'!$GJ$3:$GJ$155)","v":5.79},{"$f":"_xlfn.XLOOKUP(1,('[2]ZSS Results'!$B$4:$B$462=\"Powercor\")*('[2]ZSS Results'!$D$4:$D$462=\"winter\")*('[2]ZSS Results'!$C$4:$C$462=C77),'[2]ZSS Results'!$AN$4:$AN$462)","v":4.17},{"$f":"_xlfn.XLOOKUP(C77,'[3]zss forecast'!$B$3:$B$155,'[3]zss forecast'!$HM$3:$HM$155)","v":3.87}]
[null,"Zone","AL","Non-coincident","Winter",{"$f":"_xlfn.XLOOKUP(C78,[1]Sheet1!$A$2:$A$86,[1]Sheet1!$B$2:$B$86)","v":30},null,{"$f":"_xlfn.XLOOKUP(1,('[2]ZSS Results'!$B$4:$B$462=\"Powercor\")*('[2]ZSS Results'!$D$4:$D$462=\"winter\")*('[2]ZSS Results'!$C$4:$C$462=C78),'[2]ZSS Results'!$N$4:$N$462)","v":18.850000000000001},{"$f":"_xlfn.XLOOKUP(C78,'[3]zss forecast'!$B$3:$B$155,'[3]zss forecast'!$GJ$3:$GJ$155)","v":18.47},{"$f":"_xlfn.XLOOKUP(1,('[2]ZSS Results'!$B$4:$B$462=\"Powercor\")*('[2]ZSS Results'!$D$4:$D$462=\"winter\")*('[2]ZSS Results'!$C$4:$C$462=C78),'[2]ZSS Results'!$AN$4:$AN$462)","v":17.75},{"$f":"_xlfn.XLOOKUP(C78,'[3]zss forecast'!$B$3:$B$155,'[3]zss forecast'!$HM$3:$HM$155)","v":17.420000000000002}]
[null,"Zone","ART","Non-coincident","Winter",{"$f":"_xlfn.XLOOKUP(C79,[1]Sheet1!$A$2:$A$86,[1]Sheet1!$B$2:$B$86)","v":20},null,{"$f":"_xlfn.XLOOKUP(1,('[2]ZSS Results'!$B$4:$B$462=\"Powercor\")*('[2]ZSS Results'!$D$4:$D$462=\"winter\")*('[2]ZSS Results'!$C$4:$C$462=C79),'[2]ZSS Results'!$N$4:$N$462)","v":14.85},{"$f":"_xlfn.XLOOKUP(C79,'[3]zss forecast'!$B$3:$B$155,'[3]zss forecast'!$GJ$3:$GJ$155)","v":14.84},{"$f":"_xlfn.XLOOKUP(1,('[2]ZSS Results'!$B$4:$B$462=\"Powercor\")*('[2]ZSS Results'!$D$4:$D$462=\"winter\")*('[2]ZSS Results'!$C$4:$C$462=C79),'[2]ZSS Results'!$AN$4:$AN$462)","v":13.93},{"$f":"_xlfn.XLOOKUP(C79,'[3]zss forecast'!$B$3:$B$155,'[3]zss forecast'!$HM$3:$HM$155)","v":13.92}]
[null,"Zone","AWT","Non-coincident","Winter",{"$f":"_xlfn.XLOOKUP(C80,[1]Sheet1!$A$2:$A$86,[1]Sheet1!$B$2:$B$86)","v":66},null,{"$f":"_xlfn.XLOOKUP(1,('[2]ZSS Results'!$B$4:$B$462=\"Powercor\")*('[2]ZSS Results'!$D$4:$D$462=\"winter\")*('[2]ZSS Results'!$C$4:$C$462=C80),'[2]ZSS Results'!$N$4:$N$462)","v":4.0199999999999996},{"$f":"_xlfn.XLOOKUP(C80,'[3]zss forecast'!$B$3:$B$155,'[3]zss forecast'!$GJ$3:$GJ$155)","v":4.0199999999999996},{"$f":"_xlfn.XLOOKUP(1,('[2]ZSS Results'!$B$4:$B$462=\"Powercor\")*('[2]ZSS Results'!$D$4:$D$462=\"winter\")*('[2]ZSS Results'!$C$4:$C$462=C80),'[2]ZSS Results'!$AN$4:$AN$462)","v":3.61},{"$f":"_xlfn.XLOOKUP(C80,'[3]zss forecast'!$B$3:$B$155,'[3]zss forecast'!$HM$3:$HM$155)","v":3.61}]
[null,"Zone","BAE","Non-coincident","Winter",{"$f":"_xlfn.XLOOKUP(C81,[1]Sheet1!$A$2:$A$86,[1]Sheet1!$B$2:$B$86)","v":33},null,{"$f":"_xlfn.XLOOKUP(1,('[2]ZSS Results'!$B$4:$B$462=\"Powercor\")*('[2]ZSS Results'!$D$4:$D$462=\"winter\")*('[2]ZSS Results'!$C$4:$C$462=C81),'[2]ZSS Results'!$N$4:$N$462)","v":0},{"$f":"_xlfn.XLOOKUP(C81,'[3]zss forecast'!$B$3:$B$155,'[3]zss forecast'!$GJ$3:$GJ$155)","v":0},{"$f":"_xlfn.XLOOKUP(1,('[2]ZSS Results'!$B$4:$B$462=\"Powercor\")*('[2]ZSS Results'!$D$4:$D$462=\"winter\")*('[2]ZSS Results'!$C$4:$C$462=C81),'[2]ZSS Results'!$AN$4:$AN$462)","v":0},{"$f":"_xlfn.XLOOKUP(C81,'[3]zss forecast'!$B$3:$B$155,'[3]zss forecast'!$HM$3:$HM$155)","v":0}]
[null,"Zone","BAN","Non-coincident","Winter",{"$f":"_xlfn.XLOOKUP(C82,[1]Sheet1!$A$2:$A$86,[1]Sheet1!$B$2:$B$86)","v":120},null,{"$f":"_xlfn.XLOOKUP(1,('[2]ZSS Results'!$B$4:$B$462=\"Powercor\")*('[2]ZSS Results'!$D$4:$D$462=\"winter\")*('[2]ZSS Results'!$C$4:$C$462=C82),'[2]ZSS Results'!$N$4:$N$462)","v":95.39},{"$f":"_xlfn.XLOOKUP(C82,'[3]zss forecast'!$B$3:$B$155,'[3]zss forecast'!$GJ$3:$GJ$155)","v":95.01},{"$f":"_xlfn.XLOOKUP(1,('[2]ZSS Results'!$B$4:$B$462=\"Powercor\")*('[2]ZSS Results'!$D$4:$D$462=\"winter\")*('[2]ZSS Results'!$C$4:$C$462=C82),'[2]ZSS Results'!$AN$4:$AN$462)","v":90.06},{"$f":"_xlfn.XLOOKUP(C82,'[3]zss forecast'!$B$3:$B$155,'[3]zss forecast'!$HM$3:$HM$155)","v":89.7}]
[null,"Zone","BAS","Non-coincident","Winter",{"$f":"_xlfn.XLOOKUP(C83,[1]Sheet1!$A$2:$A$86,[1]Sheet1!$B$2:$B$86)","v":99},null,{"$f":"_xlfn.XLOOKUP(1,('[2]ZSS Results'!$B$4:$B$462=\"Powercor\")*('[2]ZSS Results'!$D$4:$D$462=\"winter\")*('[2]ZSS Results'!$C$4:$C$462=C83),'[2]ZSS Results'!$N$4:$N$462)","v":87.91},{"$f":"_xlfn.XLOOKUP(C83,'[3]zss forecast'!$B$3:$B$155,'[3]zss forecast'!$GJ$3:$GJ$155)","v":87.79},{"$f":"_xlfn.XLOOKUP(1,('[2]ZSS Results'!$B$4:$B$462=\"Powercor\")*('[2]ZSS Results'!$D$4:$D$462=\"winter\")*('[2]ZSS Results'!$C$4:$C$462=C83),'[2]ZSS Results'!$AN$4:$AN$462)","v":83.22},{"$f":"_xlfn.XLOOKUP(C83,'[3]zss forecast'!$B$3:$B$155,'[3]zss forecast'!$HM$3:$HM$155)","v":83.12}]
[null,"Zone","BBD","Non-coincident","Winter",{"$f":"_xlfn.XLOOKUP(C84,[1]Sheet1!$A$2:$A$86,[1]Sheet1!$B$2:$B$86)","v":66},null,{"$f":"_xlfn.XLOOKUP(1,('[2]ZSS Results'!$B$4:$B$462=\"Powercor\")*('[2]ZSS Results'!$D$4:$D$462=\"winter\")*('[2]ZSS Results'!$C$4:$C$462=C84),'[2]ZSS Results'!$N$4:$N$462)","v":25.58},{"$f":"_xlfn.XLOOKUP(C84,'[3]zss forecast'!$B$3:$B$155,'[3]zss forecast'!$GJ$3:$GJ$155)","v":24.89},{"$f":"_xlfn.XLOOKUP(1,('[2]ZSS Results'!$B$4:$B$462=\"Powercor\")*('[2]ZSS Results'!$D$4:$D$462=\"winter\")*('[2]ZSS Results'!$C$4:$C$462=C84),'[2]ZSS Results'!$AN$4:$AN$462)","v":22.47},{"$f":"_xlfn.XLOOKUP(C84,'[3]zss forecast'!$B$3:$B$155,'[3]zss forecast'!$HM$3:$HM$155)","v":21.86}]
[null,"Zone","BGO","Non-coincident","Winter",{"$f":"_xlfn.XLOOKUP(C85,[1]Sheet1!$A$2:$A$86,[1]Sheet1!$B$2:$B$86)","v":66},null,{"$f":"_xlfn.XLOOKUP(1,('[2]ZSS Results'!$B$4:$B$462=\"Powercor\")*('[2]ZSS Results'!$D$4:$D$462=\"winter\")*('[2]ZSS Results'!$C$4:$C$462=C85),'[2]ZSS Results'!$N$4:$N$462)","v":36.5},{"$f":"_xlfn.XLOOKUP(C85,'[3]zss forecast'!$B$3:$B$155,'[3]zss forecast'!$GJ$3:$GJ$155)","v":36.450000000000003},{"$f":"_xlfn.XLOOKUP(1,('[2]ZSS Results'!$B$4:$B$462=\"Powercor\")*('[2]ZSS Results'!$D$4:$D$462=\"winter\")*('[2]ZSS Results'!$C$4:$C$462=C85),'[2]ZSS Results'!$AN$4:$AN$462)","v":35.229999999999997},{"$f":"_xlfn.XLOOKUP(C85,'[3]zss forecast'!$B$3:$B$155,'[3]zss forecast'!$HM$3:$HM$155)","v":35.19}]
[null,"Zone","BMH","Non-coincident","Winter",{"$f":"_xlfn.XLOOKUP(C86,[1]Sheet1!$A$2:$A$86,[1]Sheet1!$B$2:$B$86)","v":27},null,{"$f":"_xlfn.XLOOKUP(1,('[2]ZSS Results'!$B$4:$B$462=\"Powercor\")*('[2]ZSS Results'!$D$4:$D$462=\"winter\")*('[2]ZSS Results'!$C$4:$C$462=C86),'[2]ZSS Results'!$N$4:$N$462)","v":26.39},{"$f":"_xlfn.XLOOKUP(C86,'[3]zss forecast'!$B$3:$B$155,'[3]zss forecast'!$GJ$3:$GJ$155)","v":26.31},{"$f":"_xlfn.XLOOKUP(1,('[2]ZSS Results'!$B$4:$B$462=\"Powercor\")*('[2]ZSS Results'!$D$4:$D$462=\"winter\")*('[2]ZSS Results'!$C$4:$C$462=C86),'[2]ZSS Results'!$AN$4:$AN$462)","v":25.07},{"$f":"_xlfn.XLOOKUP(C86,'[3]zss forecast'!$B$3:$B$155,'[3]zss forecast'!$HM$3:$HM$155)","v":25.01}]
[null,"Zone","CDN","Non-coincident","Winter",{"$f":"_xlfn.XLOOKUP(C87,[1]Sheet1!$A$2:$A$86,[1]Sheet1!$B$2:$B$86)","v":20},null,{"$f":"_xlfn.XLOOKUP(1,('[2]ZSS Results'!$B$4:$B$462=\"Powercor\")*('[2]ZSS Results'!$D$4:$D$462=\"winter\")*('[2]ZSS Results'!$C$4:$C$462=C87),'[2]ZSS Results'!$N$4:$N$462)","v":18.899999999999999},{"$f":"_xlfn.XLOOKUP(C87,'[3]zss forecast'!$B$3:$B$155,'[3]zss forecast'!$GJ$3:$GJ$155)","v":18.899999999999999},{"$f":"_xlfn.XLOOKUP(1,('[2]ZSS Results'!$B$4:$B$462=\"Powercor\")*('[2]ZSS Results'!$D$4:$D$462=\"winter\")*('[2]ZSS Results'!$C$4:$C$462=C87),'[2]ZSS Results'!$AN$4:$AN$462)","v":16.54},{"$f":"_xlfn.XLOOKUP(C87,'[3]zss forecast'!$B$3:$B$155,'[3]zss forecast'!$HM$3:$HM$155)","v":16.54}]
[null,"Zone","CHA","Non-coincident","Winter",{"$f":"_xlfn.XLOOKUP(C88,[1]Sheet1!$A$2:$A$86,[1]Sheet1!$B$2:$B$86)","v":27},null,{"$f":"_xlfn.XLOOKUP(1,('[2]ZSS Results'!$B$4:$B$462=\"Powercor\")*('[2]ZSS Results'!$D$4:$D$462=\"winter\")*('[2]ZSS Results'!$C$4:$C$462=C88),'[2]ZSS Results'!$N$4:$N$462)","v":24.03},{"$f":"_xlfn.XLOOKUP(C88,'[3]zss forecast'!$B$3:$B$155,'[3]zss forecast'!$GJ$3:$GJ$155)","v":23.98},{"$f":"_xlfn.XLOOKUP(1,('[2]ZSS Results'!$B$4:$B$462=\"Powercor\")*('[2]ZSS Results'!$D$4:$D$462=\"winter\")*('[2]ZSS Results'!$C$4:$C$462=C88),'[2]ZSS Results'!$AN$4:$AN$462)","v":15.33},{"$f":"_xlfn.XLOOKUP(C88,'[3]zss forecast'!$B$3:$B$155,'[3]zss forecast'!$HM$3:$HM$155)","v":15.29}]
[null,"Zone","CHM","Non-coincident","Winter",{"$f":"_xlfn.XLOOKUP(C89,[1]Sheet1!$A$2:$A$86,[1]Sheet1!$B$2:$B$86)","v":33},null,{"$f":"_xlfn.XLOOKUP(1,('[2]ZSS Results'!$B$4:$B$462=\"Powercor\")*('[2]ZSS Results'!$D$4:$D$462=\"winter\")*('[2]ZSS Results'!$C$4:$C$462=C89),'[2]ZSS Results'!$N$4:$N$462)","v":2.2799999999999998},{"$f":"_xlfn.XLOOKUP(C89,'[3]zss forecast'!$B$3:$B$155,'[3]zss forecast'!$GJ$3:$GJ$155)","v":2.2599999999999998},{"$f":"_xlfn.XLOOKUP(1,('[2]ZSS Results'!$B$4:$B$462=\"Powercor\")*('[2]ZSS Results'!$D$4:$D$462=\"winter\")*('[2]ZSS Results'!$C$4:$C$462=C89),'[2]ZSS Results'!$AN$4:$AN$462)","v":1.87},{"$f":"_xlfn.XLOOKUP(C89,'[3]zss forecast'!$B$3:$B$155,'[3]zss forecast'!$HM$3:$HM$155)","v":1.87}]
[null,"Zone","CLC","Non-coincident","Winter",{"$f":"_xlfn.XLOOKUP(C90,[1]Sheet1!$A$2:$A$86,[1]Sheet1!$B$2:$B$86)","v":79},null,{"$f":"_xlfn.XLOOKUP(1,('[2]ZSS Results'!$B$4:$B$462=\"Powercor\")*('[2]ZSS Results'!$D$4:$D$462=\"winter\")*('[2]ZSS Results'!$C$4:$C$462=C90),'[2]ZSS Results'!$N$4:$N$462)","v":38.86},{"$f":"_xlfn.XLOOKUP(C90,'[3]zss forecast'!$B$3:$B$155,'[3]zss forecast'!$GJ$3:$GJ$155)","v":38.85},{"$f":"_xlfn.XLOOKUP(1,('[2]ZSS Results'!$B$4:$B$462=\"Powercor\")*('[2]ZSS Results'!$D$4:$D$462=\"winter\")*('[2]ZSS Results'!$C$4:$C$462=C90),'[2]ZSS Results'!$AN$4:$AN$462)","v":36.630000000000003},{"$f":"_xlfn.XLOOKUP(C90,'[3]zss forecast'!$B$3:$B$155,'[3]zss forecast'!$HM$3:$HM$155)","v":36.619999999999997}]
[null,"Zone","CME","Non-coincident","Winter",{"$f":"_xlfn.XLOOKUP(C91,[1]Sheet1!$A$2:$A$86,[1]Sheet1!$B$2:$B$86)","v":40.5},null,{"$f":"_xlfn.XLOOKUP(1,('[2]ZSS Results'!$B$4:$B$462=\"Powercor\")*('[2]ZSS Results'!$D$4:$D$462=\"winter\")*('[2]ZSS Results'!$C$4:$C$462=C91),'[2]ZSS Results'!$N$4:$N$462)","v":35.700000000000003},{"$f":"_xlfn.XLOOKUP(C91,'[3]zss forecast'!$B$3:$B$155,'[3]zss forecast'!$GJ$3:$GJ$155)","v":35.68},{"$f":"_xlfn.XLOOKUP(1,('[2]ZSS Results'!$B$4:$B$462=\"Powercor\")*('[2]ZSS Results'!$D$4:$D$462=\"winter\")*('[2]ZSS Results'!$C$4:$C$462=C91),'[2]ZSS Results'!$AN$4:$AN$462)","v":29.87},{"$f":"_xlfn.XLOOKUP(C91,'[3]zss forecast'!$B$3:$B$155,'[3]zss forecast'!$HM$3:$HM$155)","v":29.78}]
[null,"Zone","CMN","Non-coincident","Winter",{"$f":"_xlfn.XLOOKUP(C92,[1]Sheet1!$A$2:$A$86,[1]Sheet1!$B$2:$B$86)","v":66},null,{"$f":"_xlfn.XLOOKUP(1,('[2]ZSS Results'!$B$4:$B$462=\"Powercor\")*('[2]ZSS Results'!$D$4:$D$462=\"winter\")*('[2]ZSS Results'!$C$4:$C$462=C92),'[2]ZSS Results'!$N$4:$N$462)","v":28.85},{"$f":"_xlfn.XLOOKUP(C92,'[3]zss forecast'!$B$3:$B$155,'[3]zss forecast'!$GJ$3:$GJ$155)","v":28.83},{"$f":"_xlfn.XLOOKUP(1,('[2]ZSS Results'!$B$4:$B$462=\"Powercor\")*('[2]ZSS Results'!$D$4:$D$462=\"winter\")*('[2]ZSS Results'!$C$4:$C$462=C92),'[2]ZSS Results'!$AN$4:$AN$462)","v":27.63},{"$f":"_xlfn.XLOOKUP(C92,'[3]zss forecast'!$B$3:$B$155,'[3]zss forecast'!$HM$3:$HM$155)","v":27.62}]
[null,"Zone","COB","Non-coincident","Winter",{"$f":"_xlfn.XLOOKUP(C93,[1]Sheet1!$A$2:$A$86,[1]Sheet1!$B$2:$B$86)","v":26},null,{"$f":"_xlfn.XLOOKUP(1,('[2]ZSS Results'!$B$4:$B$462=\"Powercor\")*('[2]ZSS Results'!$D$4:$D$462=\"winter\")*('[2]ZSS Results'!$C$4:$C$462=C93),'[2]ZSS Results'!$N$4:$N$462)","v":17.3},{"$f":"_xlfn.XLOOKUP(C93,'[3]zss forecast'!$B$3:$B$155,'[3]zss forecast'!$GJ$3:$GJ$155)","v":16.89},{"$f":"_xlfn.XLOOKUP(1,('[2]ZSS Results'!$B$4:$B$462=\"Powercor\")*('[2]ZSS Results'!$D$4:$D$462=\"winter\")*('[2]ZSS Results'!$C$4:$C$462=C93),'[2]ZSS Results'!$AN$4:$AN$462)","v":14},{"$f":"_xlfn.XLOOKUP(C93,'[3]zss forecast'!$B$3:$B$155,'[3]zss forecast'!$HM$3:$HM$155)","v":13.52}]
[null,"Zone","CRO","Non-coincident","Winter",{"$f":"_xlfn.XLOOKUP(C94,[1]Sheet1!$A$2:$A$86,[1]Sheet1!$B$2:$B$86)","v":60},null,{"$f":"_xlfn.XLOOKUP(1,('[2]ZSS Results'!$B$4:$B$462=\"Powercor\")*('[2]ZSS Results'!$D$4:$D$462=\"winter\")*('[2]ZSS Results'!$C$4:$C$462=C94),'[2]ZSS Results'!$N$4:$N$462)","v":38.71},{"$f":"_xlfn.XLOOKUP(C94,'[3]zss forecast'!$B$3:$B$155,'[3]zss forecast'!$GJ$3:$GJ$155)","v":37.53},{"$f":"_xlfn.XLOOKUP(1,('[2]ZSS Results'!$B$4:$B$462=\"Powercor\")*('[2]ZSS Results'!$D$4:$D$462=\"winter\")*('[2]ZSS Results'!$C$4:$C$462=C94),'[2]ZSS Results'!$AN$4:$AN$462)","v":33.96},{"$f":"_xlfn.XLOOKUP(C94,'[3]zss forecast'!$B$3:$B$155,'[3]zss forecast'!$HM$3:$HM$155)","v":33.03}]
[null,"Zone","CTN","Non-coincident","Winter",{"$f":"_xlfn.XLOOKUP(C95,[1]Sheet1!$A$2:$A$86,[1]Sheet1!$B$2:$B$86)","v":39.5},null,{"$f":"_xlfn.XLOOKUP(1,('[2]ZSS Results'!$B$4:$B$462=\"Powercor\")*('[2]ZSS Results'!$D$4:$D$462=\"winter\")*('[2]ZSS Results'!$C$4:$C$462=C95),'[2]ZSS Results'!$N$4:$N$462)","v":20.059999999999999},{"$f":"_xlfn.XLOOKUP(C95,'[3]zss forecast'!$B$3:$B$155,'[3]zss forecast'!$GJ$3:$GJ$155)","v":19.43},{"$f":"_xlfn.XLOOKUP(1,('[2]ZSS Results'!$B$4:$B$462=\"Powercor\")*('[2]ZSS Results'!$D$4:$D$462=\"winter\")*('[2]ZSS Results'!$C$4:$C$462=C95),'[2]ZSS Results'!$AN$4:$AN$462)","v":17.440000000000001},{"$f":"_xlfn.XLOOKUP(C95,'[3]zss forecast'!$B$3:$B$155,'[3]zss forecast'!$HM$3:$HM$155)","v":16.899999999999999}]
[null,"Zone","DDL","Non-coincident","Winter",{"$f":"_xlfn.XLOOKUP(C96,[1]Sheet1!$A$2:$A$86,[1]Sheet1!$B$2:$B$86)","v":66},null,{"$f":"_xlfn.XLOOKUP(1,('[2]ZSS Results'!$B$4:$B$462=\"Powercor\")*('[2]ZSS Results'!$D$4:$D$462=\"winter\")*('[2]ZSS Results'!$C$4:$C$462=C96),'[2]ZSS Results'!$N$4:$N$462)","v":55.36},{"$f":"_xlfn.XLOOKUP(C96,'[3]zss forecast'!$B$3:$B$155,'[3]zss forecast'!$GJ$3:$GJ$155)","v":55.35},{"$f":"_xlfn.XLOOKUP(1,('[2]ZSS Results'!$B$4:$B$462=\"Powercor\")*('[2]ZSS Results'!$D$4:$D$462=\"winter\")*('[2]ZSS Results'!$C$4:$C$462=C96),'[2]ZSS Results'!$AN$4:$AN$462)","v":51.03},{"$f":"_xlfn.XLOOKUP(C96,'[3]zss forecast'!$B$3:$B$155,'[3]zss forecast'!$HM$3:$HM$155)","v":51.01}]
[null,"Zone","DLF","Non-coincident","Winter",{"$f":"_xlfn.XLOOKUP(C97,[1]Sheet1!$A$2:$A$86,[1]Sheet1!$B$2:$B$86)","v":66},null,{"$f":"_xlfn.XLOOKUP(1,('[2]ZSS Results'!$B$4:$B$462=\"Powercor\")*('[2]ZSS Results'!$D$4:$D$462=\"winter\")*('[2]ZSS Results'!$C$4:$C$462=C97),'[2]ZSS Results'!$N$4:$N$462)","v":16.82},{"$f":"_xlfn.XLOOKUP(C97,'[3]zss forecast'!$B$3:$B$155,'[3]zss forecast'!$GJ$3:$GJ$155)","v":16.760000000000002},{"$f":"_xlfn.XLOOKUP(1,('[2]ZSS Results'!$B$4:$B$462=\"Powercor\")*('[2]ZSS Results'!$D$4:$D$462=\"winter\")*('[2]ZSS Results'!$C$4:$C$462=C97),'[2]ZSS Results'!$AN$4:$AN$462)","v":13.27},{"$f":"_xlfn.XLOOKUP(C97,'[3]zss forecast'!$B$3:$B$155,'[3]zss forecast'!$HM$3:$HM$155)","v":13.26}]
[null,"Zone","ECA","Non-coincident","Winter",{"$f":"_xlfn.XLOOKUP(C98,[1]Sheet1!$A$2:$A$86,[1]Sheet1!$B$2:$B$86)","v":40.5},null,{"$f":"_xlfn.XLOOKUP(1,('[2]ZSS Results'!$B$4:$B$462=\"Powercor\")*('[2]ZSS Results'!$D$4:$D$462=\"winter\")*('[2]ZSS Results'!$C$4:$C$462=C98),'[2]ZSS Results'!$N$4:$N$462)","v":36.24},{"$f":"_xlfn.XLOOKUP(C98,'[3]zss forecast'!$B$3:$B$155,'[3]zss forecast'!$GJ$3:$GJ$155)","v":36.18},{"$f":"_xlfn.XLOOKUP(1,('[2]ZSS Results'!$B$4:$B$462=\"Powercor\")*('[2]ZSS Results'!$D$4:$D$462=\"winter\")*('[2]ZSS Results'!$C$4:$C$462=C98),'[2]ZSS Results'!$AN$4:$AN$462)","v":28.78},{"$f":"_xlfn.XLOOKUP(C98,'[3]zss forecast'!$B$3:$B$155,'[3]zss forecast'!$HM$3:$HM$155)","v":28.76}]
[null,"Zone","EHK","Non-coincident","Winter",{"$f":"_xlfn.XLOOKUP(C99,[1]Sheet1!$A$2:$A$86,[1]Sheet1!$B$2:$B$86)","v":54},null,{"$f":"_xlfn.XLOOKUP(1,('[2]ZSS Results'!$B$4:$B$462=\"Powercor\")*('[2]ZSS Results'!$D$4:$D$462=\"winter\")*('[2]ZSS Results'!$C$4:$C$462=C99),'[2]ZSS Results'!$N$4:$N$462)","v":47.25},{"$f":"_xlfn.XLOOKUP(C99,'[3]zss forecast'!$B$3:$B$155,'[3]zss forecast'!$GJ$3:$GJ$155)","v":47.11},{"$f":"_xlfn.XLOOKUP(1,('[2]ZSS Results'!$B$4:$B$462=\"Powercor\")*('[2]ZSS Results'!$D$4:$D$462=\"winter\")*('[2]ZSS Results'!$C$4:$C$462=C99),'[2]ZSS Results'!$AN$4:$AN$462)","v":45.63},{"$f":"_xlfn.XLOOKUP(C99,'[3]zss forecast'!$B$3:$B$155,'[3]zss forecast'!$HM$3:$HM$155)","v":45.51}]
[null,"Zone","FNS","Non-coincident","Winter",{"$f":"_xlfn.XLOOKUP(C100,[1]Sheet1!$A$2:$A$86,[1]Sheet1!$B$2:$B$86)","v":99},null,{"$f":"_xlfn.XLOOKUP(1,('[2]ZSS Results'!$B$4:$B$462=\"Powercor\")*('[2]ZSS Results'!$D$4:$D$462=\"winter\")*('[2]ZSS Results'!$C$4:$C$462=C100),'[2]ZSS Results'!$N$4:$N$462)","v":40.340000000000003},{"$f":"_xlfn.XLOOKUP(C100,'[3]zss forecast'!$B$3:$B$155,'[3]zss forecast'!$GJ$3:$GJ$155)","v":40.19},{"$f":"_xlfn.XLOOKUP(1,('[2]ZSS Results'!$B$4:$B$462=\"Powercor\")*('[2]ZSS Results'!$D$4:$D$462=\"winter\")*('[2]ZSS Results'!$C$4:$C$462=C100),'[2]ZSS Results'!$AN$4:$AN$462)","v":38.28},{"$f":"_xlfn.XLOOKUP(C100,'[3]zss forecast'!$B$3:$B$155,'[3]zss forecast'!$HM$3:$HM$155)","v":38.15}]
[null,"Zone","GB","Non-coincident","Winter",{"$f":"_xlfn.XLOOKUP(C101,[1]Sheet1!$A$2:$A$86,[1]Sheet1!$B$2:$B$86)","v":37.5},null,{"$f":"_xlfn.XLOOKUP(1,('[2]ZSS Results'!$B$4:$B$462=\"Powercor\")*('[2]ZSS Results'!$D$4:$D$462=\"winter\")*('[2]ZSS Results'!$C$4:$C$462=C101),'[2]ZSS Results'!$N$4:$N$462)","v":15.25},{"$f":"_xlfn.XLOOKUP(C101,'[3]zss forecast'!$B$3:$B$155,'[3]zss forecast'!$GJ$3:$GJ$155)","v":14.17},{"$f":"_xlfn.XLOOKUP(1,('[2]ZSS Results'!$B$4:$B$462=\"Powercor\")*('[2]ZSS Results'!$D$4:$D$462=\"winter\")*('[2]ZSS Results'!$C$4:$C$462=C101),'[2]ZSS Results'!$AN$4:$AN$462)","v":13.98},{"$f":"_xlfn.XLOOKUP(C101,'[3]zss forecast'!$B$3:$B$155,'[3]zss forecast'!$HM$3:$HM$155)","v":13.05}]
[null,"Zone","GCY","Non-coincident","Winter",{"$f":"_xlfn.XLOOKUP(C102,[1]Sheet1!$A$2:$A$86,[1]Sheet1!$B$2:$B$86)","v":66},null,{"$f":"_xlfn.XLOOKUP(1,('[2]ZSS Results'!$B$4:$B$462=\"Powercor\")*('[2]ZSS Results'!$D$4:$D$462=\"winter\")*('[2]ZSS Results'!$C$4:$C$462=C102),'[2]ZSS Results'!$N$4:$N$462)","v":36.07},{"$f":"_xlfn.XLOOKUP(C102,'[3]zss forecast'!$B$3:$B$155,'[3]zss forecast'!$GJ$3:$GJ$155)","v":35.82},{"$f":"_xlfn.XLOOKUP(1,('[2]ZSS Results'!$B$4:$B$462=\"Powercor\")*('[2]ZSS Results'!$D$4:$D$462=\"winter\")*('[2]ZSS Results'!$C$4:$C$462=C102),'[2]ZSS Results'!$AN$4:$AN$462)","v":34.71},{"$f":"_xlfn.XLOOKUP(C102,'[3]zss forecast'!$B$3:$B$155,'[3]zss forecast'!$HM$3:$HM$155)","v":34.49}]
[null,"Zone","GHP","Non-coincident","Winter",{"$f":"_xlfn.XLOOKUP(C103,[1]Sheet1!$A$2:$A$86,[1]Sheet1!$B$2:$B$86)","v":66},null,{"$f":"_xlfn.XLOOKUP(1,('[2]ZSS Results'!$B$4:$B$462=\"Powercor\")*('[2]ZSS Results'!$D$4:$D$462=\"winter\")*('[2]ZSS Results'!$C$4:$C$462=C103),'[2]ZSS Results'!$N$4:$N$462)","v":29.67},{"$f":"_xlfn.XLOOKUP(C103,'[3]zss forecast'!$B$3:$B$155,'[3]zss forecast'!$GJ$3:$GJ$155)","v":29.67},{"$f":"_xlfn.XLOOKUP(1,('[2]ZSS Results'!$B$4:$B$462=\"Powercor\")*('[2]ZSS Results'!$D$4:$D$462=\"winter\")*('[2]ZSS Results'!$C$4:$C$462=C103),'[2]ZSS Results'!$AN$4:$AN$462)","v":27.51},{"$f":"_xlfn.XLOOKUP(C103,'[3]zss forecast'!$B$3:$B$155,'[3]zss forecast'!$HM$3:$HM$155)","v":27.51}]
[null,"Zone","GL","Non-coincident","Winter",{"$f":"_xlfn.XLOOKUP(C104,[1]Sheet1!$A$2:$A$86,[1]Sheet1!$B$2:$B$86)","v":80},null,{"$f":"_xlfn.XLOOKUP(1,('[2]ZSS Results'!$B$4:$B$462=\"Powercor\")*('[2]ZSS Results'!$D$4:$D$462=\"winter\")*('[2]ZSS Results'!$C$4:$C$462=C104),'[2]ZSS Results'!$N$4:$N$462)","v":37.049999999999997},{"$f":"_xlfn.XLOOKUP(C104,'[3]zss forecast'!$B$3:$B$155,'[3]zss forecast'!$GJ$3:$GJ$155)","v":37.03},{"$f":"_xlfn.XLOOKUP(1,('[2]ZSS Results'!$B$4:$B$462=\"Powercor\")*('[2]ZSS Results'!$D$4:$D$462=\"winter\")*('[2]ZSS Results'!$C$4:$C$462=C104),'[2]ZSS Results'!$AN$4:$AN$462)","v":35.090000000000003},{"$f":"_xlfn.XLOOKUP(C104,'[3]zss forecast'!$B$3:$B$155,'[3]zss forecast'!$HM$3:$HM$155)","v":35.07}]
[null,"Zone","GLE","Non-coincident","Winter",{"$f":"_xlfn.XLOOKUP(C105,[1]Sheet1!$A$2:$A$86,[1]Sheet1!$B$2:$B$86)","v":79.5},null,{"$f":"_xlfn.XLOOKUP(1,('[2]ZSS Results'!$B$4:$B$462=\"Powercor\")*('[2]ZSS Results'!$D$4:$D$462=\"winter\")*('[2]ZSS Results'!$C$4:$C$462=C105),'[2]ZSS Results'!$N$4:$N$462)","v":59.85},{"$f":"_xlfn.XLOOKUP(C105,'[3]zss forecast'!$B$3:$B$155,'[3]zss forecast'!$GJ$3:$GJ$155)","v":59.78},{"$f":"_xlfn.XLOOKUP(1,('[2]ZSS Results'!$B$4:$B$462=\"Powercor\")*('[2]ZSS Results'!$D$4:$D$462=\"winter\")*('[2]ZSS Results'!$C$4:$C$462=C105),'[2]ZSS Results'!$AN$4:$AN$462)","v":54.46},{"$f":"_xlfn.XLOOKUP(C105,'[3]zss forecast'!$B$3:$B$155,'[3]zss forecast'!$HM$3:$HM$155)","v":54.43}]
[null,"Zone","GSB","Non-coincident","Winter",{"$f":"_xlfn.XLOOKUP(C106,[1]Sheet1!$A$2:$A$86,[1]Sheet1!$B$2:$B$86)","v":66},null,{"$f":"_xlfn.XLOOKUP(1,('[2]ZSS Results'!$B$4:$B$462=\"Powercor\")*('[2]ZSS Results'!$D$4:$D$462=\"winter\")*('[2]ZSS Results'!$C$4:$C$462=C106),'[2]ZSS Results'!$N$4:$N$462)","v":32.479999999999997},{"$f":"_xlfn.XLOOKUP(C106,'[3]zss forecast'!$B$3:$B$155,'[3]zss forecast'!$GJ$3:$GJ$155)","v":32.46},{"$f":"_xlfn.XLOOKUP(1,('[2]ZSS Results'!$B$4:$B$462=\"Powercor\")*('[2]ZSS Results'!$D$4:$D$462=\"winter\")*('[2]ZSS Results'!$C$4:$C$462=C106),'[2]ZSS Results'!$AN$4:$AN$462)","v":31.14},{"$f":"_xlfn.XLOOKUP(C106,'[3]zss forecast'!$B$3:$B$155,'[3]zss forecast'!$HM$3:$HM$155)","v":31.11}]
[null,"Zone","HSM","Non-coincident","Winter",{"$f":"_xlfn.XLOOKUP(C107,[1]Sheet1!$A$2:$A$86,[1]Sheet1!$B$2:$B$86)","v":40.5},null,{"$f":"_xlfn.XLOOKUP(1,('[2]ZSS Results'!$B$4:$B$462=\"Powercor\")*('[2]ZSS Results'!$D$4:$D$462=\"winter\")*('[2]ZSS Results'!$C$4:$C$462=C107),'[2]ZSS Results'!$N$4:$N$462)","v":36.520000000000003},{"$f":"_xlfn.XLOOKUP(C107,'[3]zss forecast'!$B$3:$B$155,'[3]zss forecast'!$GJ$3:$GJ$155)","v":36.47},{"$f":"_xlfn.XLOOKUP(1,('[2]ZSS Results'!$B$4:$B$462=\"Powercor\")*('[2]ZSS Results'!$D$4:$D$462=\"winter\")*('[2]ZSS Results'!$C$4:$C$462=C107),'[2]ZSS Results'!$AN$4:$AN$462)","v":34.619999999999997},{"$f":"_xlfn.XLOOKUP(C107,'[3]zss forecast'!$B$3:$B$155,'[3]zss forecast'!$HM$3:$HM$155)","v":34.590000000000003}]
[null,"Zone","HTN","Non-coincident","Winter",{"$f":"_xlfn.XLOOKUP(C108,[1]Sheet1!$A$2:$A$86,[1]Sheet1!$B$2:$B$86)","v":39.5},null,{"$f":"_xlfn.XLOOKUP(1,('[2]ZSS Results'!$B$4:$B$462=\"Powercor\")*('[2]ZSS Results'!$D$4:$D$462=\"winter\")*('[2]ZSS Results'!$C$4:$C$462=C108),'[2]ZSS Results'!$N$4:$N$462)","v":24.23},{"$f":"_xlfn.XLOOKUP(C108,'[3]zss forecast'!$B$3:$B$155,'[3]zss forecast'!$GJ$3:$GJ$155)","v":24.23},{"$f":"_xlfn.XLOOKUP(1,('[2]ZSS Results'!$B$4:$B$462=\"Powercor\")*('[2]ZSS Results'!$D$4:$D$462=\"winter\")*('[2]ZSS Results'!$C$4:$C$462=C108),'[2]ZSS Results'!$AN$4:$AN$462)","v":23.54},{"$f":"_xlfn.XLOOKUP(C108,'[3]zss forecast'!$B$3:$B$155,'[3]zss forecast'!$HM$3:$HM$155)","v":23.54}]
[null,"Zone","KRT","Non-coincident","Winter",{"$f":"_xlfn.XLOOKUP(C109,[1]Sheet1!$A$2:$A$86,[1]Sheet1!$B$2:$B$86)","v":40.5},null,{"$f":"_xlfn.XLOOKUP(1,('[2]ZSS Results'!$B$4:$B$462=\"Powercor\")*('[2]ZSS Results'!$D$4:$D$462=\"winter\")*('[2]ZSS Results'!$C$4:$C$462=C109),'[2]ZSS Results'!$N$4:$N$462)","v":32.24},{"$f":"_xlfn.XLOOKUP(C109,'[3]zss forecast'!$B$3:$B$155,'[3]zss forecast'!$GJ$3:$GJ$155)","v":32.229999999999997},{"$f":"_xlfn.XLOOKUP(1,('[2]ZSS Results'!$B$4:$B$462=\"Powercor\")*('[2]ZSS Results'!$D$4:$D$462=\"winter\")*('[2]ZSS Results'!$C$4:$C$462=C109),'[2]ZSS Results'!$AN$4:$AN$462)","v":28.54},{"$f":"_xlfn.XLOOKUP(C109,'[3]zss forecast'!$B$3:$B$155,'[3]zss forecast'!$HM$3:$HM$155)","v":28.53}]
[null,"Zone","KYM","Non-coincident","Winter",{"$f":"_xlfn.XLOOKUP(C110,[1]Sheet1!$A$2:$A$86,[1]Sheet1!$B$2:$B$86)","v":40.5},null,{"$f":"_xlfn.XLOOKUP(1,('[2]ZSS Results'!$B$4:$B$462=\"Powercor\")*('[2]ZSS Results'!$D$4:$D$462=\"winter\")*('[2]ZSS Results'!$C$4:$C$462=C110),'[2]ZSS Results'!$N$4:$N$462)","v":20.399999999999999},{"$f":"_xlfn.XLOOKUP(C110,'[3]zss forecast'!$B$3:$B$155,'[3]zss forecast'!$GJ$3:$GJ$155)","v":20.37},{"$f":"_xlfn.XLOOKUP(1,('[2]ZSS Results'!$B$4:$B$462=\"Powercor\")*('[2]ZSS Results'!$D$4:$D$462=\"winter\")*('[2]ZSS Results'!$C$4:$C$462=C110),'[2]ZSS Results'!$AN$4:$AN$462)","v":19.21},{"$f":"_xlfn.XLOOKUP(C110,'[3]zss forecast'!$B$3:$B$155,'[3]zss forecast'!$HM$3:$HM$155)","v":19.190000000000001}]
[null,"Zone","LV","Non-coincident","Winter",{"$f":"_xlfn.XLOOKUP(C111,[1]Sheet1!$A$2:$A$86,[1]Sheet1!$B$2:$B$86)","v":99},null,{"$f":"_xlfn.XLOOKUP(1,('[2]ZSS Results'!$B$4:$B$462=\"Powercor\")*('[2]ZSS Results'!$D$4:$D$462=\"winter\")*('[2]ZSS Results'!$C$4:$C$462=C111),'[2]ZSS Results'!$N$4:$N$462)","v":94.83},{"$f":"_xlfn.XLOOKUP(C111,'[3]zss forecast'!$B$3:$B$155,'[3]zss forecast'!$GJ$3:$GJ$155)","v":94.79},{"$f":"_xlfn.XLOOKUP(1,('[2]ZSS Results'!$B$4:$B$462=\"Powercor\")*('[2]ZSS Results'!$D$4:$D$462=\"winter\")*('[2]ZSS Results'!$C$4:$C$462=C111),'[2]ZSS Results'!$AN$4:$AN$462)","v":80.05},{"$f":"_xlfn.XLOOKUP(C111,'[3]zss forecast'!$B$3:$B$155,'[3]zss forecast'!$HM$3:$HM$155)","v":80.040000000000006}]
[null,"Zone","LVN","Non-coincident","Winter",{"$f":"_xlfn.XLOOKUP(C112,[1]Sheet1!$A$2:$A$86,[1]Sheet1!$B$2:$B$86)","v":99},null,{"$f":"_xlfn.XLOOKUP(1,('[2]ZSS Results'!$B$4:$B$462=\"Powercor\")*('[2]ZSS Results'!$D$4:$D$462=\"winter\")*('[2]ZSS Results'!$C$4:$C$462=C112),'[2]ZSS Results'!$N$4:$N$462)","v":96.69},{"$f":"_xlfn.XLOOKUP(C112,'[3]zss forecast'!$B$3:$B$155,'[3]zss forecast'!$GJ$3:$GJ$155)","v":94.36},{"$f":"_xlfn.XLOOKUP(1,('[2]ZSS Results'!$B$4:$B$462=\"Powercor\")*('[2]ZSS Results'!$D$4:$D$462=\"winter\")*('[2]ZSS Results'!$C$4:$C$462=C112),'[2]ZSS Results'!$AN$4:$AN$462)","v":76.3},{"$f":"_xlfn.XLOOKUP(C112,'[3]zss forecast'!$B$3:$B$155,'[3]zss forecast'!$HM$3:$HM$155)","v":74.59}]
[null,"Zone","LVN11","Non-coincident","Winter",{"$f":"_xlfn.XLOOKUP(C113,[1]Sheet1!$A$2:$A$86,[1]Sheet1!$B$2:$B$86)","v":30},null,{"$f":"_xlfn.XLOOKUP(1,('[2]ZSS Results'!$B$4:$B$462=\"Powercor\")*('[2]ZSS Results'!$D$4:$D$462=\"winter\")*('[2]ZSS Results'!$C$4:$C$462=C113),'[2]ZSS Results'!$N$4:$N$462)","v":14.05},{"$f":"_xlfn.XLOOKUP(C113,'[3]zss forecast'!$B$3:$B$155,'[3]zss forecast'!$GJ$3:$GJ$155)","v":13.56},{"$f":"_xlfn.XLOOKUP(1,('[2]ZSS Results'!$B$4:$B$462=\"Powercor\")*('[2]ZSS Results'!$D$4:$D$462=\"winter\")*('[2]ZSS Results'!$C$4:$C$462=C113),'[2]ZSS Results'!$AN$4:$AN$462)","v":13.95},{"$f":"_xlfn.XLOOKUP(C113,'[3]zss forecast'!$B$3:$B$155,'[3]zss forecast'!$HM$3:$HM$155)","v":13.48}]
[null,"Zone","MBN","Non-coincident","Winter",{"$f":"_xlfn.XLOOKUP(C114,[1]Sheet1!$A$2:$A$86,[1]Sheet1!$B$2:$B$86)","v":59},null,{"$f":"_xlfn.XLOOKUP(1,('[2]ZSS Results'!$B$4:$B$462=\"Powercor\")*('[2]ZSS Results'!$D$4:$D$462=\"winter\")*('[2]ZSS Results'!$C$4:$C$462=C114),'[2]ZSS Results'!$N$4:$N$462)","v":34.33},{"$f":"_xlfn.XLOOKUP(C114,'[3]zss forecast'!$B$3:$B$155,'[3]zss forecast'!$GJ$3:$GJ$155)","v":34.159999999999997},{"$f":"_xlfn.XLOOKUP(1,('[2]ZSS Results'!$B$4:$B$462=\"Powercor\")*('[2]ZSS Results'!$D$4:$D$462=\"winter\")*('[2]ZSS Results'!$C$4:$C$462=C114),'[2]ZSS Results'!$AN$4:$AN$462)","v":27.84},{"$f":"_xlfn.XLOOKUP(C114,'[3]zss forecast'!$B$3:$B$155,'[3]zss forecast'!$HM$3:$HM$155)","v":27.8}]
[null,"Zone","MDA","Non-coincident","Winter",{"$f":"_xlfn.XLOOKUP(C115,[1]Sheet1!$A$2:$A$86,[1]Sheet1!$B$2:$B$86)","v":66},null,{"$f":"_xlfn.XLOOKUP(1,('[2]ZSS Results'!$B$4:$B$462=\"Powercor\")*('[2]ZSS Results'!$D$4:$D$462=\"winter\")*('[2]ZSS Results'!$C$4:$C$462=C115),'[2]ZSS Results'!$N$4:$N$462)","v":43.99},{"$f":"_xlfn.XLOOKUP(C115,'[3]zss forecast'!$B$3:$B$155,'[3]zss forecast'!$GJ$3:$GJ$155)","v":43.49},{"$f":"_xlfn.XLOOKUP(1,('[2]ZSS Results'!$B$4:$B$462=\"Powercor\")*('[2]ZSS Results'!$D$4:$D$462=\"winter\")*('[2]ZSS Results'!$C$4:$C$462=C115),'[2]ZSS Results'!$AN$4:$AN$462)","v":41.92},{"$f":"_xlfn.XLOOKUP(C115,'[3]zss forecast'!$B$3:$B$155,'[3]zss forecast'!$HM$3:$HM$155)","v":41.51}]
[null,"Zone","MLN","Non-coincident","Winter",{"$f":"_xlfn.XLOOKUP(C116,[1]Sheet1!$A$2:$A$86,[1]Sheet1!$B$2:$B$86)","v":99},null,{"$f":"_xlfn.XLOOKUP(1,('[2]ZSS Results'!$B$4:$B$462=\"Powercor\")*('[2]ZSS Results'!$D$4:$D$462=\"winter\")*('[2]ZSS Results'!$C$4:$C$462=C116),'[2]ZSS Results'!$N$4:$N$462)","v":80.89},{"$f":"_xlfn.XLOOKUP(C116,'[3]zss forecast'!$B$3:$B$155,'[3]zss forecast'!$GJ$3:$GJ$155)","v":80.89},{"$f":"_xlfn.XLOOKUP(1,('[2]ZSS Results'!$B$4:$B$462=\"Powercor\")*('[2]ZSS Results'!$D$4:$D$462=\"winter\")*('[2]ZSS Results'!$C$4:$C$462=C116),'[2]ZSS Results'!$AN$4:$AN$462)","v":74.12},{"$f":"_xlfn.XLOOKUP(C116,'[3]zss forecast'!$B$3:$B$155,'[3]zss forecast'!$HM$3:$HM$155)","v":74.11}]
[null,"Zone","MNA","Non-coincident","Winter",{"$f":"_xlfn.XLOOKUP(C117,[1]Sheet1!$A$2:$A$86,[1]Sheet1!$B$2:$B$86)","v":66},null,{"$f":"_xlfn.XLOOKUP(1,('[2]ZSS Results'!$B$4:$B$462=\"Powercor\")*('[2]ZSS Results'!$D$4:$D$462=\"winter\")*('[2]ZSS Results'!$C$4:$C$462=C117),'[2]ZSS Results'!$N$4:$N$462)","v":33.24},{"$f":"_xlfn.XLOOKUP(C117,'[3]zss forecast'!$B$3:$B$155,'[3]zss forecast'!$GJ$3:$GJ$155)","v":32.75},{"$f":"_xlfn.XLOOKUP(1,('[2]ZSS Results'!$B$4:$B$462=\"Powercor\")*('[2]ZSS Results'!$D$4:$D$462=\"winter\")*('[2]ZSS Results'!$C$4:$C$462=C117),'[2]ZSS Results'!$AN$4:$AN$462)","v":31.09},{"$f":"_xlfn.XLOOKUP(C117,'[3]zss forecast'!$B$3:$B$155,'[3]zss forecast'!$HM$3:$HM$155)","v":30.71}]
[null,"Zone","MRO","Non-coincident","Winter",{"$f":"_xlfn.XLOOKUP(C118,[1]Sheet1!$A$2:$A$86,[1]Sheet1!$B$2:$B$86)","v":27},null,{"$f":"_xlfn.XLOOKUP(1,('[2]ZSS Results'!$B$4:$B$462=\"Powercor\")*('[2]ZSS Results'!$D$4:$D$462=\"winter\")*('[2]ZSS Results'!$C$4:$C$462=C118),'[2]ZSS Results'!$N$4:$N$462)","v":20.3},{"$f":"_xlfn.XLOOKUP(C118,'[3]zss forecast'!$B$3:$B$155,'[3]zss forecast'!$GJ$3:$GJ$155)","v":20.29},{"$f":"_xlfn.XLOOKUP(1,('[2]ZSS Results'!$B$4:$B$462=\"Powercor\")*('[2]ZSS Results'!$D$4:$D$462=\"winter\")*('[2]ZSS Results'!$C$4:$C$462=C118),'[2]ZSS Results'!$AN$4:$AN$462)","v":18.62},{"$f":"_xlfn.XLOOKUP(C118,'[3]zss forecast'!$B$3:$B$155,'[3]zss forecast'!$HM$3:$HM$155)","v":18.62}]
[null,"Zone","MTC","Non-coincident","Winter",{"$f":"_xlfn.XLOOKUP(C119,[1]Sheet1!$A$2:$A$86,[1]Sheet1!$B$2:$B$86)","v":66},null,{"$f":"_xlfn.XLOOKUP(1,('[2]ZSS Results'!$B$4:$B$462=\"Powercor\")*('[2]ZSS Results'!$D$4:$D$462=\"winter\")*('[2]ZSS Results'!$C$4:$C$462=C119),'[2]ZSS Results'!$N$4:$N$462)","v":0},{"$f":"_xlfn.XLOOKUP(C119,'[3]zss forecast'!$B$3:$B$155,'[3]zss forecast'!$GJ$3:$GJ$155)","v":0},{"$f":"_xlfn.XLOOKUP(1,('[2]ZSS Results'!$B$4:$B$462=\"Powercor\")*('[2]ZSS Results'!$D$4:$D$462=\"winter\")*('[2]ZSS Results'!$C$4:$C$462=C119),'[2]ZSS Results'!$AN$4:$AN$462)","v":0},{"$f":"_xlfn.XLOOKUP(C119,'[3]zss forecast'!$B$3:$B$155,'[3]zss forecast'!$HM$3:$HM$155)","v":0}]
[null,"Zone","NHL","Non-coincident","Winter",{"$f":"_xlfn.XLOOKUP(C120,[1]Sheet1!$A$2:$A$86,[1]Sheet1!$B$2:$B$86)","v":20},null,{"$f":"_xlfn.XLOOKUP(1,('[2]ZSS Results'!$B$4:$B$462=\"Powercor\")*('[2]ZSS Results'!$D$4:$D$462=\"winter\")*('[2]ZSS Results'!$C$4:$C$462=C120),'[2]ZSS Results'!$N$4:$N$462)","v":17.07},{"$f":"_xlfn.XLOOKUP(C120,'[3]zss forecast'!$B$3:$B$155,'[3]zss forecast'!$GJ$3:$GJ$155)","v":17.07},{"$f":"_xlfn.XLOOKUP(1,('[2]ZSS Results'!$B$4:$B$462=\"Powercor\")*('[2]ZSS Results'!$D$4:$D$462=\"winter\")*('[2]ZSS Results'!$C$4:$C$462=C120),'[2]ZSS Results'!$AN$4:$AN$462)","v":13.6},{"$f":"_xlfn.XLOOKUP(C120,'[3]zss forecast'!$B$3:$B$155,'[3]zss forecast'!$HM$3:$HM$155)","v":13.59}]
[null,"Zone","NKA","Non-coincident","Winter",{"$f":"_xlfn.XLOOKUP(C121,[1]Sheet1!$A$2:$A$86,[1]Sheet1!$B$2:$B$86)","v":39.5},null,{"$f":"_xlfn.XLOOKUP(1,('[2]ZSS Results'!$B$4:$B$462=\"Powercor\")*('[2]ZSS Results'!$D$4:$D$462=\"winter\")*('[2]ZSS Results'!$C$4:$C$462=C121),'[2]ZSS Results'!$N$4:$N$462)","v":26.81},{"$f":"_xlfn.XLOOKUP(C121,'[3]zss forecast'!$B$3:$B$155,'[3]zss forecast'!$GJ$3:$GJ$155)","v":26.78},{"$f":"_xlfn.XLOOKUP(1,('[2]ZSS Results'!$B$4:$B$462=\"Powercor\")*('[2]ZSS Results'!$D$4:$D$462=\"winter\")*('[2]ZSS Results'!$C$4:$C$462=C121),'[2]ZSS Results'!$AN$4:$AN$462)","v":24.78},{"$f":"_xlfn.XLOOKUP(C121,'[3]zss forecast'!$B$3:$B$155,'[3]zss forecast'!$HM$3:$HM$155)","v":24.73}]
[null,"Zone","OYN","Non-coincident","Winter",{"$f":"_xlfn.XLOOKUP(C122,[1]Sheet1!$A$2:$A$86,[1]Sheet1!$B$2:$B$86)","v":27},null,{"$f":"_xlfn.XLOOKUP(1,('[2]ZSS Results'!$B$4:$B$462=\"Powercor\")*('[2]ZSS Results'!$D$4:$D$462=\"winter\")*('[2]ZSS Results'!$C$4:$C$462=C122),'[2]ZSS Results'!$N$4:$N$462)","v":6.83},{"$f":"_xlfn.XLOOKUP(C122,'[3]zss forecast'!$B$3:$B$155,'[3]zss forecast'!$GJ$3:$GJ$155)","v":5.92},{"$f":"_xlfn.XLOOKUP(1,('[2]ZSS Results'!$B$4:$B$462=\"Powercor\")*('[2]ZSS Results'!$D$4:$D$462=\"winter\")*('[2]ZSS Results'!$C$4:$C$462=C122),'[2]ZSS Results'!$AN$4:$AN$462)","v":6.52},{"$f":"_xlfn.XLOOKUP(C122,'[3]zss forecast'!$B$3:$B$155,'[3]zss forecast'!$HM$3:$HM$155)","v":5.64}]
[null,"Zone","PLD","Non-coincident","Winter",{"$f":"_xlfn.XLOOKUP(C123,[1]Sheet1!$A$2:$A$86,[1]Sheet1!$B$2:$B$86)","v":32},null,{"$f":"_xlfn.XLOOKUP(1,('[2]ZSS Results'!$B$4:$B$462=\"Powercor\")*('[2]ZSS Results'!$D$4:$D$462=\"winter\")*('[2]ZSS Results'!$C$4:$C$462=C123),'[2]ZSS Results'!$N$4:$N$462)","v":17.989999999999998},{"$f":"_xlfn.XLOOKUP(C123,'[3]zss forecast'!$B$3:$B$155,'[3]zss forecast'!$GJ$3:$GJ$155)","v":17.98},{"$f":"_xlfn.XLOOKUP(1,('[2]ZSS Results'!$B$4:$B$462=\"Powercor\")*('[2]ZSS Results'!$D$4:$D$462=\"winter\")*('[2]ZSS Results'!$C$4:$C$462=C123),'[2]ZSS Results'!$AN$4:$AN$462)","v":17.34},{"$f":"_xlfn.XLOOKUP(C123,'[3]zss forecast'!$B$3:$B$155,'[3]zss forecast'!$HM$3:$HM$155)","v":17.329999999999998}]
[null,"Zone","RVL","Non-coincident","Winter",{"$f":"_xlfn.XLOOKUP(C124,[1]Sheet1!$A$2:$A$86,[1]Sheet1!$B$2:$B$86)","v":19.5},null,{"$f":"_xlfn.XLOOKUP(1,('[2]ZSS Results'!$B$4:$B$462=\"Powercor\")*('[2]ZSS Results'!$D$4:$D$462=\"winter\")*('[2]ZSS Results'!$C$4:$C$462=C124),'[2]ZSS Results'!$N$4:$N$462)","v":17.37},{"$f":"_xlfn.XLOOKUP(C124,'[3]zss forecast'!$B$3:$B$155,'[3]zss forecast'!$GJ$3:$GJ$155)","v":17.329999999999998},{"$f":"_xlfn.XLOOKUP(1,('[2]ZSS Results'!$B$4:$B$462=\"Powercor\")*('[2]ZSS Results'!$D$4:$D$462=\"winter\")*('[2]ZSS Results'!$C$4:$C$462=C124),'[2]ZSS Results'!$AN$4:$AN$462)","v":14.61},{"$f":"_xlfn.XLOOKUP(C124,'[3]zss forecast'!$B$3:$B$155,'[3]zss forecast'!$HM$3:$HM$155)","v":14.57}]
[null,"Zone","SA","Non-coincident","Winter",{"$f":"_xlfn.XLOOKUP(C125,[1]Sheet1!$A$2:$A$86,[1]Sheet1!$B$2:$B$86)","v":93},null,{"$f":"_xlfn.XLOOKUP(1,('[2]ZSS Results'!$B$4:$B$462=\"Powercor\")*('[2]ZSS Results'!$D$4:$D$462=\"winter\")*('[2]ZSS Results'!$C$4:$C$462=C125),'[2]ZSS Results'!$N$4:$N$462)","v":70.84},{"$f":"_xlfn.XLOOKUP(C125,'[3]zss forecast'!$B$3:$B$155,'[3]zss forecast'!$GJ$3:$GJ$155)","v":70.69},{"$f":"_xlfn.XLOOKUP(1,('[2]ZSS Results'!$B$4:$B$462=\"Powercor\")*('[2]ZSS Results'!$D$4:$D$462=\"winter\")*('[2]ZSS Results'!$C$4:$C$462=C125),'[2]ZSS Results'!$AN$4:$AN$462)","v":67.98},{"$f":"_xlfn.XLOOKUP(C125,'[3]zss forecast'!$B$3:$B$155,'[3]zss forecast'!$HM$3:$HM$155)","v":67.87}]
[null,"Zone","SHL","Non-coincident","Winter",{"$f":"_xlfn.XLOOKUP(C126,[1]Sheet1!$A$2:$A$86,[1]Sheet1!$B$2:$B$86)","v":40.5},null,{"$f":"_xlfn.XLOOKUP(1,('[2]ZSS Results'!$B$4:$B$462=\"Powercor\")*('[2]ZSS Results'!$D$4:$D$462=\"winter\")*('[2]ZSS Results'!$C$4:$C$462=C126),'[2]ZSS Results'!$N$4:$N$462)","v":30.36},{"$f":"_xlfn.XLOOKUP(C126,'[3]zss forecast'!$B$3:$B$155,'[3]zss forecast'!$GJ$3:$GJ$155)","v":30.33},{"$f":"_xlfn.XLOOKUP(1,('[2]ZSS Results'!$B$4:$B$462=\"Powercor\")*('[2]ZSS Results'!$D$4:$D$462=\"winter\")*('[2]ZSS Results'!$C$4:$C$462=C126),'[2]ZSS Results'!$AN$4:$AN$462)","v":27.43},{"$f":"_xlfn.XLOOKUP(C126,'[3]zss forecast'!$B$3:$B$155,'[3]zss forecast'!$HM$3:$HM$155)","v":27.34}]
[null,"Zone","SHN","Non-coincident","Winter",{"$f":"_xlfn.XLOOKUP(C127,[1]Sheet1!$A$2:$A$86,[1]Sheet1!$B$2:$B$86)","v":66},null,{"$f":"_xlfn.XLOOKUP(1,('[2]ZSS Results'!$B$4:$B$462=\"Powercor\")*('[2]ZSS Results'!$D$4:$D$462=\"winter\")*('[2]ZSS Results'!$C$4:$C$462=C127),'[2]ZSS Results'!$N$4:$N$462)","v":34.700000000000003},{"$f":"_xlfn.XLOOKUP(C127,'[3]zss forecast'!$B$3:$B$155,'[3]zss forecast'!$GJ$3:$GJ$155)","v":34.69},{"$f":"_xlfn.XLOOKUP(1,('[2]ZSS Results'!$B$4:$B$462=\"Powercor\")*('[2]ZSS Results'!$D$4:$D$462=\"winter\")*('[2]ZSS Results'!$C$4:$C$462=C127),'[2]ZSS Results'!$AN$4:$AN$462)","v":33.22},{"$f":"_xlfn.XLOOKUP(C127,'[3]zss forecast'!$B$3:$B$155,'[3]zss forecast'!$HM$3:$HM$155)","v":33.21}]
[null,"Zone","SHP","Non-coincident","Winter",{"$f":"_xlfn.XLOOKUP(C128,[1]Sheet1!$A$2:$A$86,[1]Sheet1!$B$2:$B$86)","v":66},null,{"$f":"_xlfn.XLOOKUP(1,('[2]ZSS Results'!$B$4:$B$462=\"Powercor\")*('[2]ZSS Results'!$D$4:$D$462=\"winter\")*('[2]ZSS Results'!$C$4:$C$462=C128),'[2]ZSS Results'!$N$4:$N$462)","v":30.71},{"$f":"_xlfn.XLOOKUP(C128,'[3]zss forecast'!$B$3:$B$155,'[3]zss forecast'!$GJ$3:$GJ$155)","v":30.46},{"$f":"_xlfn.XLOOKUP(1,('[2]ZSS Results'!$B$4:$B$462=\"Powercor\")*('[2]ZSS Results'!$D$4:$D$462=\"winter\")*('[2]ZSS Results'!$C$4:$C$462=C128),'[2]ZSS Results'!$AN$4:$AN$462)","v":19.2},{"$f":"_xlfn.XLOOKUP(C128,'[3]zss forecast'!$B$3:$B$155,'[3]zss forecast'!$HM$3:$HM$155)","v":19.100000000000001}]
[null,"Zone","SSE","Non-coincident","Winter",{"$f":"_xlfn.XLOOKUP(C129,[1]Sheet1!$A$2:$A$86,[1]Sheet1!$B$2:$B$86)","v":99},null,{"$f":"_xlfn.XLOOKUP(1,('[2]ZSS Results'!$B$4:$B$462=\"Powercor\")*('[2]ZSS Results'!$D$4:$D$462=\"winter\")*('[2]ZSS Results'!$C$4:$C$462=C129),'[2]ZSS Results'!$N$4:$N$462)","v":64.819999999999993},{"$f":"_xlfn.XLOOKUP(C129,'[3]zss forecast'!$B$3:$B$155,'[3]zss forecast'!$GJ$3:$GJ$155)","v":63.92},{"$f":"_xlfn.XLOOKUP(1,('[2]ZSS Results'!$B$4:$B$462=\"Powercor\")*('[2]ZSS Results'!$D$4:$D$462=\"winter\")*('[2]ZSS Results'!$C$4:$C$462=C129),'[2]ZSS Results'!$AN$4:$AN$462)","v":62.67},{"$f":"_xlfn.XLOOKUP(C129,'[3]zss forecast'!$B$3:$B$155,'[3]zss forecast'!$HM$3:$HM$155)","v":61.84}]
[null,"Zone","STL","Non-coincident","Winter",{"$f":"_xlfn.XLOOKUP(C130,[1]Sheet1!$A$2:$A$86,[1]Sheet1!$B$2:$B$86)","v":27},null,{"$f":"_xlfn.XLOOKUP(1,('[2]ZSS Results'!$B$4:$B$462=\"Powercor\")*('[2]ZSS Results'!$D$4:$D$462=\"winter\")*('[2]ZSS Results'!$C$4:$C$462=C130),'[2]ZSS Results'!$N$4:$N$462)","v":19.559999999999999},{"$f":"_xlfn.XLOOKUP(C130,'[3]zss forecast'!$B$3:$B$155,'[3]zss forecast'!$GJ$3:$GJ$155)","v":19.13},{"$f":"_xlfn.XLOOKUP(1,('[2]ZSS Results'!$B$4:$B$462=\"Powercor\")*('[2]ZSS Results'!$D$4:$D$462=\"winter\")*('[2]ZSS Results'!$C$4:$C$462=C130),'[2]ZSS Results'!$AN$4:$AN$462)","v":18.29},{"$f":"_xlfn.XLOOKUP(C130,'[3]zss forecast'!$B$3:$B$155,'[3]zss forecast'!$HM$3:$HM$155)","v":17.850000000000001}]
[null,"Zone","STN","Non-coincident","Winter",{"$f":"_xlfn.XLOOKUP(C131,[1]Sheet1!$A$2:$A$86,[1]Sheet1!$B$2:$B$86)","v":79},null,{"$f":"_xlfn.XLOOKUP(1,('[2]ZSS Results'!$B$4:$B$462=\"Powercor\")*('[2]ZSS Results'!$D$4:$D$462=\"winter\")*('[2]ZSS Results'!$C$4:$C$462=C131),'[2]ZSS Results'!$N$4:$N$462)","v":45.3},{"$f":"_xlfn.XLOOKUP(C131,'[3]zss forecast'!$B$3:$B$155,'[3]zss forecast'!$GJ$3:$GJ$155)","v":44.45},{"$f":"_xlfn.XLOOKUP(1,('[2]ZSS Results'!$B$4:$B$462=\"Powercor\")*('[2]ZSS Results'!$D$4:$D$462=\"winter\")*('[2]ZSS Results'!$C$4:$C$462=C131),'[2]ZSS Results'!$AN$4:$AN$462)","v":42.25},{"$f":"_xlfn.XLOOKUP(C131,'[3]zss forecast'!$B$3:$B$155,'[3]zss forecast'!$HM$3:$HM$155)","v":41.52}]
[null,"Zone","SU","Non-coincident","Winter",{"$f":"_xlfn.XLOOKUP(C132,[1]Sheet1!$A$2:$A$86,[1]Sheet1!$B$2:$B$86)","v":99},null,{"$f":"_xlfn.XLOOKUP(1,('[2]ZSS Results'!$B$4:$B$462=\"Powercor\")*('[2]ZSS Results'!$D$4:$D$462=\"winter\")*('[2]ZSS Results'!$C$4:$C$462=C132),'[2]ZSS Results'!$N$4:$N$462)","v":84.43},{"$f":"_xlfn.XLOOKUP(C132,'[3]zss forecast'!$B$3:$B$155,'[3]zss forecast'!$GJ$3:$GJ$155)","v":84.11},{"$f":"_xlfn.XLOOKUP(1,('[2]ZSS Results'!$B$4:$B$462=\"Powercor\")*('[2]ZSS Results'!$D$4:$D$462=\"winter\")*('[2]ZSS Results'!$C$4:$C$462=C132),'[2]ZSS Results'!$AN$4:$AN$462)","v":75.709999999999994},{"$f":"_xlfn.XLOOKUP(C132,'[3]zss forecast'!$B$3:$B$155,'[3]zss forecast'!$HM$3:$HM$155)","v":75.489999999999995}]
[null,"Zone","TNA","Non-coincident","Winter",{"$f":"_xlfn.XLOOKUP(C133,[1]Sheet1!$A$2:$A$86,[1]Sheet1!$B$2:$B$86)","v":99},null,{"$f":"_xlfn.XLOOKUP(1,('[2]ZSS Results'!$B$4:$B$462=\"Powercor\")*('[2]ZSS Results'!$D$4:$D$462=\"winter\")*('[2]ZSS Results'!$C$4:$C$462=C133),'[2]ZSS Results'!$N$4:$N$462)","v":127.43},{"$f":"_xlfn.XLOOKUP(C133,'[3]zss forecast'!$B$3:$B$155,'[3]zss forecast'!$GJ$3:$GJ$155)","v":127.16},{"$f":"_xlfn.XLOOKUP(1,('[2]ZSS Results'!$B$4:$B$462=\"Powercor\")*('[2]ZSS Results'!$D$4:$D$462=\"winter\")*('[2]ZSS Results'!$C$4:$C$462=C133),'[2]ZSS Results'!$AN$4:$AN$462)","v":110.2},{"$f":"_xlfn.XLOOKUP(C133,'[3]zss forecast'!$B$3:$B$155,'[3]zss forecast'!$HM$3:$HM$155)","v":109.8}]
[null,"Zone","TQY","Non-coincident","Winter",{"$f":"_xlfn.XLOOKUP(C134,[1]Sheet1!$A$2:$A$86,[1]Sheet1!$B$2:$B$86)","v":66},null,{"$f":"_xlfn.XLOOKUP(1,('[2]ZSS Results'!$B$4:$B$462=\"Powercor\")*('[2]ZSS Results'!$D$4:$D$462=\"winter\")*('[2]ZSS Results'!$C$4:$C$462=C134),'[2]ZSS Results'!$N$4:$N$462)","v":39.54},{"$f":"_xlfn.XLOOKUP(C134,'[3]zss forecast'!$B$3:$B$155,'[3]zss forecast'!$GJ$3:$GJ$155)","v":39.49},{"$f":"_xlfn.XLOOKUP(1,('[2]ZSS Results'!$B$4:$B$462=\"Powercor\")*('[2]ZSS Results'!$D$4:$D$462=\"winter\")*('[2]ZSS Results'!$C$4:$C$462=C134),'[2]ZSS Results'!$AN$4:$AN$462)","v":36.79},{"$f":"_xlfn.XLOOKUP(C134,'[3]zss forecast'!$B$3:$B$155,'[3]zss forecast'!$HM$3:$HM$155)","v":36.71}]
[null,"Zone","TRG","Non-coincident","Winter",{"$f":"_xlfn.XLOOKUP(C135,[1]Sheet1!$A$2:$A$86,[1]Sheet1!$B$2:$B$86)","v":46.5},null,{"$f":"_xlfn.XLOOKUP(1,('[2]ZSS Results'!$B$4:$B$462=\"Powercor\")*('[2]ZSS Results'!$D$4:$D$462=\"winter\")*('[2]ZSS Results'!$C$4:$C$462=C135),'[2]ZSS Results'!$N$4:$N$462)","v":21.12},{"$f":"_xlfn.XLOOKUP(C135,'[3]zss forecast'!$B$3:$B$155,'[3]zss forecast'!$GJ$3:$GJ$155)","v":21.06},{"$f":"_xlfn.XLOOKUP(1,('[2]ZSS Results'!$B$4:$B$462=\"Powercor\")*('[2]ZSS Results'!$D$4:$D$462=\"winter\")*('[2]ZSS Results'!$C$4:$C$462=C135),'[2]ZSS Results'!$AN$4:$AN$462)","v":19.440000000000001},{"$f":"_xlfn.XLOOKUP(C135,'[3]zss forecast'!$B$3:$B$155,'[3]zss forecast'!$HM$3:$HM$155)","v":19.39}]
[null,"Zone","WBE","Non-coincident","Winter",{"$f":"_xlfn.XLOOKUP(C136,[1]Sheet1!$A$2:$A$86,[1]Sheet1!$B$2:$B$86)","v":99},null,{"$f":"_xlfn.XLOOKUP(1,('[2]ZSS Results'!$B$4:$B$462=\"Powercor\")*('[2]ZSS Results'!$D$4:$D$462=\"winter\")*('[2]ZSS Results'!$C$4:$C$462=C136),'[2]ZSS Results'!$N$4:$N$462)","v":97.66},{"$f":"_xlfn.XLOOKUP(C136,'[3]zss forecast'!$B$3:$B$155,'[3]zss forecast'!$GJ$3:$GJ$155)","v":97.63},{"$f":"_xlfn.XLOOKUP(1,('[2]ZSS Results'!$B$4:$B$462=\"Powercor\")*('[2]ZSS Results'!$D$4:$D$462=\"winter\")*('[2]ZSS Results'!$C$4:$C$462=C136),'[2]ZSS Results'!$AN$4:$AN$462)","v":88.64},{"$f":"_xlfn.XLOOKUP(C136,'[3]zss forecast'!$B$3:$B$155,'[3]zss forecast'!$HM$3:$HM$155)","v":88.58}]
[null,"Zone","WBL","Non-coincident","Winter",{"$f":"_xlfn.XLOOKUP(C137,[1]Sheet1!$A$2:$A$86,[1]Sheet1!$B$2:$B$86)","v":79.5},null,{"$f":"_xlfn.XLOOKUP(1,('[2]ZSS Results'!$B$4:$B$462=\"Powercor\")*('[2]ZSS Results'!$D$4:$D$462=\"winter\")*('[2]ZSS Results'!$C$4:$C$462=C137),'[2]ZSS Results'!$N$4:$N$462)","v":53.09},{"$f":"_xlfn.XLOOKUP(C137,'[3]zss forecast'!$B$3:$B$155,'[3]zss forecast'!$GJ$3:$GJ$155)","v":52.64},{"$f":"_xlfn.XLOOKUP(1,('[2]ZSS Results'!$B$4:$B$462=\"Powercor\")*('[2]ZSS Results'!$D$4:$D$462=\"winter\")*('[2]ZSS Results'!$C$4:$C$462=C137),'[2]ZSS Results'!$AN$4:$AN$462)","v":47.71},{"$f":"_xlfn.XLOOKUP(C137,'[3]zss forecast'!$B$3:$B$155,'[3]zss forecast'!$HM$3:$HM$155)","v":47.36}]
[null,"Zone","WIN","Non-coincident","Winter",{"$f":"_xlfn.XLOOKUP(C138,[1]Sheet1!$A$2:$A$86,[1]Sheet1!$B$2:$B$86)","v":20.5},null,{"$f":"_xlfn.XLOOKUP(1,('[2]ZSS Results'!$B$4:$B$462=\"Powercor\")*('[2]ZSS Results'!$D$4:$D$462=\"winter\")*('[2]ZSS Results'!$C$4:$C$462=C138),'[2]ZSS Results'!$N$4:$N$462)","v":10.38},{"$f":"_xlfn.XLOOKUP(C138,'[3]zss forecast'!$B$3:$B$155,'[3]zss forecast'!$GJ$3:$GJ$155)","v":9.69},{"$f":"_xlfn.XLOOKUP(1,('[2]ZSS Results'!$B$4:$B$462=\"Powercor\")*('[2]ZSS Results'!$D$4:$D$462=\"winter\")*('[2]ZSS Results'!$C$4:$C$462=C138),'[2]ZSS Results'!$AN$4:$AN$462)","v":9.85},{"$f":"_xlfn.XLOOKUP(C138,'[3]zss forecast'!$B$3:$B$155,'[3]zss forecast'!$HM$3:$HM$155)","v":9.1}]
[null,"Zone","WMN","Non-coincident","Winter",{"$f":"_xlfn.XLOOKUP(C139,[1]Sheet1!$A$2:$A$86,[1]Sheet1!$B$2:$B$86)","v":46.5},null,{"$f":"_xlfn.XLOOKUP(1,('[2]ZSS Results'!$B$4:$B$462=\"Powercor\")*('[2]ZSS Results'!$D$4:$D$462=\"winter\")*('[2]ZSS Results'!$C$4:$C$462=C139),'[2]ZSS Results'!$N$4:$N$462)","v":20.9},{"$f":"_xlfn.XLOOKUP(C139,'[3]zss forecast'!$B$3:$B$155,'[3]zss forecast'!$GJ$3:$GJ$155)","v":20.63},{"$f":"_xlfn.XLOOKUP(1,('[2]ZSS Results'!$B$4:$B$462=\"Powercor\")*('[2]ZSS Results'!$D$4:$D$462=\"winter\")*('[2]ZSS Results'!$C$4:$C$462=C139),'[2]ZSS Results'!$AN$4:$AN$462)","v":18.010000000000002},{"$f":"_xlfn.XLOOKUP(C139,'[3]zss forecast'!$B$3:$B$155,'[3]zss forecast'!$HM$3:$HM$155)","v":17.8}]
[null,"Zone","WND","Non-coincident","Winter",{"$f":"_xlfn.XLOOKUP(C140,[1]Sheet1!$A$2:$A$86,[1]Sheet1!$B$2:$B$86)","v":66},null,{"$f":"_xlfn.XLOOKUP(1,('[2]ZSS Results'!$B$4:$B$462=\"Powercor\")*('[2]ZSS Results'!$D$4:$D$462=\"winter\")*('[2]ZSS Results'!$C$4:$C$462=C140),'[2]ZSS Results'!$N$4:$N$462)","v":27.06},{"$f":"_xlfn.XLOOKUP(C140,'[3]zss forecast'!$B$3:$B$155,'[3]zss forecast'!$GJ$3:$GJ$155)","v":26.9},{"$f":"_xlfn.XLOOKUP(1,('[2]ZSS Results'!$B$4:$B$462=\"Powercor\")*('[2]ZSS Results'!$D$4:$D$462=\"winter\")*('[2]ZSS Results'!$C$4:$C$462=C140),'[2]ZSS Results'!$AN$4:$AN$462)","v":25.14},{"$f":"_xlfn.XLOOKUP(C140,'[3]zss forecast'!$B$3:$B$155,'[3]zss forecast'!$HM$3:$HM$155)","v":24.96}]
[null,"Zone","WPD","Non-coincident","Winter",{"$f":"_xlfn.XLOOKUP(C141,[1]Sheet1!$A$2:$A$86,[1]Sheet1!$B$2:$B$86)","v":79.5},null,{"$f":"_xlfn.XLOOKUP(1,('[2]ZSS Results'!$B$4:$B$462=\"Powercor\")*('[2]ZSS Results'!$D$4:$D$462=\"winter\")*('[2]ZSS Results'!$C$4:$C$462=C141),'[2]ZSS Results'!$N$4:$N$462)","v":48.84},{"$f":"_xlfn.XLOOKUP(C141,'[3]zss forecast'!$B$3:$B$155,'[3]zss forecast'!$GJ$3:$GJ$155)","v":48.82},{"$f":"_xlfn.XLOOKUP(1,('[2]ZSS Results'!$B$4:$B$462=\"Powercor\")*('[2]ZSS Results'!$D$4:$D$462=\"winter\")*('[2]ZSS Results'!$C$4:$C$462=C141),'[2]ZSS Results'!$AN$4:$AN$462)","v":46.47},{"$f":"_xlfn.XLOOKUP(C141,'[3]zss forecast'!$B$3:$B$155,'[3]zss forecast'!$HM$3:$HM$155)","v":46.45}]
[null,"Zone","AC","Coincident","Summer",{"$f":"_xlfn.XLOOKUP(C142,[1]Sheet1!$A$2:$A$86,[1]Sheet1!$B$2:$B$86)","v":40},null,{"$f":"_xlfn.XLOOKUP($C142,[4]Sheet1!$A$2:$A$66,[4]Sheet1!$D$2:$D$66)*H12","v":0.62822868810617671},{"$f":"_xlfn.XLOOKUP($C142,[4]Sheet1!$A$2:$A$66,[4]Sheet1!$D$2:$D$66)*I12","v":0.58945890760592146},{"$f":"_xlfn.XLOOKUP($C142,[4]Sheet1!$A$2:$A$66,[4]Sheet1!$D$2:$D$66)*J12","v":0.4581163859111792},{"$f":"_xlfn.XLOOKUP($C142,[4]Sheet1!$A$2:$A$66,[4]Sheet1!$D$2:$D$66)*K12","v":0.42805002552322619}]
[null,"Zone","AL","Coincident","Summer",{"$f":"_xlfn.XLOOKUP(C143,[1]Sheet1!$A$2:$A$86,[1]Sheet1!$B$2:$B$86)","v":30},null,{"$f":"_xlfn.XLOOKUP($C143,[4]Sheet1!$A$2:$A$66,[4]Sheet1!$D$2:$D$66)*H13","v":18.451584934390254},{"$f":"_xlfn.XLOOKUP($C143,[4]Sheet1!$A$2:$A$66,[4]Sheet1!$D$2:$D$66)*I13","v":17.987299923865823},{"$f":"_xlfn.XLOOKUP($C143,[4]Sheet1!$A$2:$A$66,[4]Sheet1!$D$2:$D$66)*J13","v":15.688340274978726},{"$f":"_xlfn.XLOOKUP($C143,[4]Sheet1!$A$2:$A$66,[4]Sheet1!$D$2:$D$66)*K13","v":15.343870751041246}]
[null,"Zone","ART","Coincident","Summer",{"$f":"_xlfn.XLOOKUP(C144,[1]Sheet1!$A$2:$A$86,[1]Sheet1!$B$2:$B$86)","v":20},null,{"$f":"_xlfn.XLOOKUP($C144,[4]Sheet1!$A$2:$A$66,[4]Sheet1!$D$2:$D$66)*H14","v":11.021396849386736},{"$f":"_xlfn.XLOOKUP($C144,[4]Sheet1!$A$2:$A$66,[4]Sheet1!$D$2:$D$66)*I14","v":11.014589315817009},{"$f":"_xlfn.XLOOKUP($C144,[4]Sheet1!$A$2:$A$66,[4]Sheet1!$D$2:$D$66)*J14","v":9.7620031389873869},{"$f":"_xlfn.XLOOKUP($C144,[4]Sheet1!$A$2:$A$66,[4]Sheet1!$D$2:$D$66)*K14","v":9.7551956054176596}]
[null,"Zone","AWT","Coincident","Summer",{"$f":"_xlfn.XLOOKUP(C145,[1]Sheet1!$A$2:$A$86,[1]Sheet1!$B$2:$B$86)","v":66},null,{"$f":"_xlfn.XLOOKUP($C145,[4]Sheet1!$A$2:$A$66,[4]Sheet1!$D$2:$D$66)*H15","v":3.3723055934515687},{"$f":"_xlfn.XLOOKUP($C145,[4]Sheet1!$A$2:$A$66,[4]Sheet1!$D$2:$D$66)*I15","v":3.3723055934515687},{"$f":"_xlfn.XLOOKUP($C145,[4]Sheet1!$A$2:$A$66,[4]Sheet1!$D$2:$D$66)*J15","v":3.3013096862210096},{"$f":"_xlfn.XLOOKUP($C145,[4]Sheet1!$A$2:$A$66,[4]Sheet1!$D$2:$D$66)*K15","v":3.3013096862210096}]
[null,"Zone","BAE","Coincident","Summer",{"$f":"_xlfn.XLOOKUP(C146,[1]Sheet1!$A$2:$A$86,[1]Sheet1!$B$2:$B$86)","v":33},null,{"$f":"_xlfn.XLOOKUP($C146,[4]Sheet1!$A$2:$A$66,[4]Sheet1!$D$2:$D$66)*H16","v":0},{"$f":"_xlfn.XLOOKUP($C146,[4]Sheet1!$A$2:$A$66,[4]Sheet1!$D$2:$D$66)*I16","v":0},{"$f":"_xlfn.XLOOKUP($C146,[4]Sheet1!$A$2:$A$66,[4]Sheet1!$D$2:$D$66)*J16","v":0},{"$f":"_xlfn.XLOOKUP($C146,[4]Sheet1!$A$2:$A$66,[4]Sheet1!$D$2:$D$66)*K16","v":0}]
[null,"Zone","BAN","Coincident","Summer",{"$f":"_xlfn.XLOOKUP(C147,[1]Sheet1!$A$2:$A$86,[1]Sheet1!$B$2:$B$86)","v":120},null,{"$f":"_xlfn.XLOOKUP($C147,[4]Sheet1!$A$2:$A$66,[4]Sheet1!$D$2:$D$66)*H17","v":90.507674911660771},{"$f":"_xlfn.XLOOKUP($C147,[4]Sheet1!$A$2:$A$66,[4]Sheet1!$D$2:$D$66)*I17","v":90.131604240282684},{"$f":"_xlfn.XLOOKUP($C147,[4]Sheet1!$A$2:$A$66,[4]Sheet1!$D$2:$D$66)*J17","v":76.530381625441692},{"$f":"_xlfn.XLOOKUP($C147,[4]Sheet1!$A$2:$A$66,[4]Sheet1!$D$2:$D$66)*K17","v":76.234897526501769}]
[null,"Zone","BAS","Coincident","Summer",{"$f":"_xlfn.XLOOKUP(C148,[1]Sheet1!$A$2:$A$86,[1]Sheet1!$B$2:$B$86)","v":99},null,{"$f":"_xlfn.XLOOKUP($C148,[4]Sheet1!$A$2:$A$66,[4]Sheet1!$D$2:$D$66)*H18","v":70.390194892133579},{"$f":"_xlfn.XLOOKUP($C148,[4]Sheet1!$A$2:$A$66,[4]Sheet1!$D$2:$D$66)*I18","v":70.300567372303348},{"$f":"_xlfn.XLOOKUP($C148,[4]Sheet1!$A$2:$A$66,[4]Sheet1!$D$2:$D$66)*J18","v":65.036987571363611},{"$f":"_xlfn.XLOOKUP($C148,[4]Sheet1!$A$2:$A$66,[4]Sheet1!$D$2:$D$66)*K18","v":64.971803920577983}]
[null,"Zone","BBD","Coincident","Summer",{"$f":"_xlfn.XLOOKUP(C149,[1]Sheet1!$A$2:$A$86,[1]Sheet1!$B$2:$B$86)","v":66},null,{"$f":"_xlfn.XLOOKUP($C149,[4]Sheet1!$A$2:$A$66,[4]Sheet1!$D$2:$D$66)*H19","v":36.512812763564796},{"$f":"_xlfn.XLOOKUP($C149,[4]Sheet1!$A$2:$A$66,[4]Sheet1!$D$2:$D$66)*I19","v":35.807671141411298},{"$f":"_xlfn.XLOOKUP($C149,[4]Sheet1!$A$2:$A$66,[4]Sheet1!$D$2:$D$66)*J19","v":32.301281979195949},{"$f":"_xlfn.XLOOKUP($C149,[4]Sheet1!$A$2:$A$66,[4]Sheet1!$D$2:$D$66)*K19","v":31.615459305594598}]
[null,"Zone","BGO","Coincident","Summer",{"$f":"_xlfn.XLOOKUP(C150,[1]Sheet1!$A$2:$A$86,[1]Sheet1!$B$2:$B$86)","v":66},null,{"$f":"_xlfn.XLOOKUP($C150,[4]Sheet1!$A$2:$A$66,[4]Sheet1!$D$2:$D$66)*H20","v":38.522213438735172},{"$f":"_xlfn.XLOOKUP($C150,[4]Sheet1!$A$2:$A$66,[4]Sheet1!$D$2:$D$66)*I20","v":38.357447769621679},{"$f":"_xlfn.XLOOKUP($C150,[4]Sheet1!$A$2:$A$66,[4]Sheet1!$D$2:$D$66)*J20","v":33.472145680406548},{"$f":"_xlfn.XLOOKUP($C150,[4]Sheet1!$A$2:$A$66,[4]Sheet1!$D$2:$D$66)*K20","v":33.389762845849795}]
[null,"Zone","BMH","Coincident","Summer",{"$f":"_xlfn.XLOOKUP(C151,[1]Sheet1!$A$2:$A$86,[1]Sheet1!$B$2:$B$86)","v":27},null,{"$f":"_xlfn.XLOOKUP($C151,[4]Sheet1!$A$2:$A$66,[4]Sheet1!$D$2:$D$66)*H21","v":28.115189736955585},{"$f":"_xlfn.XLOOKUP($C151,[4]Sheet1!$A$2:$A$66,[4]Sheet1!$D$2:$D$66)*I21","v":27.96866106080207},{"$f":"_xlfn.XLOOKUP($C151,[4]Sheet1!$A$2:$A$66,[4]Sheet1!$D$2:$D$66)*J21","v":26.265265200517465},{"$f":"_xlfn.XLOOKUP($C151,[4]Sheet1!$A$2:$A$66,[4]Sheet1!$D$2:$D$66)*K21","v":26.155368693402327}]
[null,"Zone","CDN","Coincident","Summer",{"$f":"_xlfn.XLOOKUP(C152,[1]Sheet1!$A$2:$A$86,[1]Sheet1!$B$2:$B$86)","v":20},null,{"$f":"_xlfn.XLOOKUP($C152,[4]Sheet1!$A$2:$A$66,[4]Sheet1!$D$2:$D$66)*H22","v":11.648452765063405},{"$f":"_xlfn.XLOOKUP($C152,[4]Sheet1!$A$2:$A$66,[4]Sheet1!$D$2:$D$66)*I22","v":11.648452765063405},{"$f":"_xlfn.XLOOKUP($C152,[4]Sheet1!$A$2:$A$66,[4]Sheet1!$D$2:$D$66)*J22","v":10.414730997223682},{"$f":"_xlfn.XLOOKUP($C152,[4]Sheet1!$A$2:$A$66,[4]Sheet1!$D$2:$D$66)*K22","v":10.414730997223682}]
[null,"Zone","CHA","Coincident","Summer",{"$f":"_xlfn.XLOOKUP(C153,[1]Sheet1!$A$2:$A$86,[1]Sheet1!$B$2:$B$86)","v":27},null,{"$f":"_xlfn.XLOOKUP($C153,[4]Sheet1!$A$2:$A$66,[4]Sheet1!$D$2:$D$66)*H23","v":23.978391931643085},{"$f":"_xlfn.XLOOKUP($C153,[4]Sheet1!$A$2:$A$66,[4]Sheet1!$D$2:$D$66)*I23","v":23.933805855161783},{"$f":"_xlfn.XLOOKUP($C153,[4]Sheet1!$A$2:$A$66,[4]Sheet1!$D$2:$D$66)*J23","v":16.782199187561282},{"$f":"_xlfn.XLOOKUP($C153,[4]Sheet1!$A$2:$A$66,[4]Sheet1!$D$2:$D$66)*K23","v":16.73761311107998}]
[null,"Zone","CHM","Coincident","Summer",{"$f":"_xlfn.XLOOKUP(C154,[1]Sheet1!$A$2:$A$86,[1]Sheet1!$B$2:$B$86)","v":33},null,{"$f":"_xlfn.XLOOKUP($C154,[4]Sheet1!$A$2:$A$66,[4]Sheet1!$D$2:$D$66)*H24","v":2.2726363181590794},{"$f":"_xlfn.XLOOKUP($C154,[4]Sheet1!$A$2:$A$66,[4]Sheet1!$D$2:$D$66)*I24","v":2.2533766883441717},{"$f":"_xlfn.XLOOKUP($C154,[4]Sheet1!$A$2:$A$66,[4]Sheet1!$D$2:$D$66)*J24","v":2.0896698349174585},{"$f":"_xlfn.XLOOKUP($C154,[4]Sheet1!$A$2:$A$66,[4]Sheet1!$D$2:$D$66)*K24","v":2.0800400200100051}]
[null,"Zone","CLC","Coincident","Summer",{"$f":"_xlfn.XLOOKUP(C155,[1]Sheet1!$A$2:$A$86,[1]Sheet1!$B$2:$B$86)","v":79},null,{"$f":"_xlfn.XLOOKUP($C155,[4]Sheet1!$A$2:$A$66,[4]Sheet1!$D$2:$D$66)*H25","v":38.083215082315455},{"$f":"_xlfn.XLOOKUP($C155,[4]Sheet1!$A$2:$A$66,[4]Sheet1!$D$2:$D$66)*I25","v":38.083215082315455},{"$f":"_xlfn.XLOOKUP($C155,[4]Sheet1!$A$2:$A$66,[4]Sheet1!$D$2:$D$66)*J25","v":35.123379713223578},{"$f":"_xlfn.XLOOKUP($C155,[4]Sheet1!$A$2:$A$66,[4]Sheet1!$D$2:$D$66)*K25","v":35.123379713223578}]
[null,"Zone","CME","Coincident","Summer",{"$f":"_xlfn.XLOOKUP(C156,[1]Sheet1!$A$2:$A$86,[1]Sheet1!$B$2:$B$86)","v":40.5},null,{"$f":"_xlfn.XLOOKUP($C156,[4]Sheet1!$A$2:$A$66,[4]Sheet1!$D$2:$D$66)*H26","v":36.837959885386816},{"$f":"_xlfn.XLOOKUP($C156,[4]Sheet1!$A$2:$A$66,[4]Sheet1!$D$2:$D$66)*I26","v":36.837959885386816},{"$f":"_xlfn.XLOOKUP($C156,[4]Sheet1!$A$2:$A$66,[4]Sheet1!$D$2:$D$66)*J26","v":30.01426170009551},{"$f":"_xlfn.XLOOKUP($C156,[4]Sheet1!$A$2:$A$66,[4]Sheet1!$D$2:$D$66)*K26","v":29.989235912129899}]
[null,"Zone","CMN","Coincident","Summer",{"$f":"_xlfn.XLOOKUP(C157,[1]Sheet1!$A$2:$A$86,[1]Sheet1!$B$2:$B$86)","v":66},null,{"$f":"_xlfn.XLOOKUP($C157,[4]Sheet1!$A$2:$A$66,[4]Sheet1!$D$2:$D$66)*H27","v":22.810733891147951},{"$f":"_xlfn.XLOOKUP($C157,[4]Sheet1!$A$2:$A$66,[4]Sheet1!$D$2:$D$66)*I27","v":22.774096027525804},{"$f":"_xlfn.XLOOKUP($C157,[4]Sheet1!$A$2:$A$66,[4]Sheet1!$D$2:$D$66)*J27","v":19.843066937754141},{"$f":"_xlfn.XLOOKUP($C157,[4]Sheet1!$A$2:$A$66,[4]Sheet1!$D$2:$D$66)*K27","v":19.835739365029717}]
[null,"Zone","COB","Coincident","Summer",{"$f":"_xlfn.XLOOKUP(C158,[1]Sheet1!$A$2:$A$86,[1]Sheet1!$B$2:$B$86)","v":26},null,{"$f":"_xlfn.XLOOKUP($C158,[4]Sheet1!$A$2:$A$66,[4]Sheet1!$D$2:$D$66)*H28","v":8.3029213483146069},{"$f":"_xlfn.XLOOKUP($C158,[4]Sheet1!$A$2:$A$66,[4]Sheet1!$D$2:$D$66)*I28","v":8.099702993635578},{"$f":"_xlfn.XLOOKUP($C158,[4]Sheet1!$A$2:$A$66,[4]Sheet1!$D$2:$D$66)*J28","v":6.9191011235955058},{"$f":"_xlfn.XLOOKUP($C158,[4]Sheet1!$A$2:$A$66,[4]Sheet1!$D$2:$D$66)*K28","v":6.6916901076451643}]
[null,"Zone","CRO","Coincident","Summer",{"$f":"_xlfn.XLOOKUP(C159,[1]Sheet1!$A$2:$A$86,[1]Sheet1!$B$2:$B$86)","v":60},null,{"$f":"_xlfn.XLOOKUP($C159,[4]Sheet1!$A$2:$A$66,[4]Sheet1!$D$2:$D$66)*H29","v":21.240705737859798},{"$f":"_xlfn.XLOOKUP($C159,[4]Sheet1!$A$2:$A$66,[4]Sheet1!$D$2:$D$66)*I29","v":20.607835548277382},{"$f":"_xlfn.XLOOKUP($C159,[4]Sheet1!$A$2:$A$66,[4]Sheet1!$D$2:$D$66)*J29","v":18.69792372614474},{"$f":"_xlfn.XLOOKUP($C159,[4]Sheet1!$A$2:$A$66,[4]Sheet1!$D$2:$D$66)*K29","v":18.206319203879826}]
[null,"Zone","CTN","Coincident","Summer",{"$f":"_xlfn.XLOOKUP(C160,[1]Sheet1!$A$2:$A$86,[1]Sheet1!$B$2:$B$86)","v":39.5},null,{"$f":"_xlfn.XLOOKUP($C160,[4]Sheet1!$A$2:$A$66,[4]Sheet1!$D$2:$D$66)*H30","v":13.307781678123934},{"$f":"_xlfn.XLOOKUP($C160,[4]Sheet1!$A$2:$A$66,[4]Sheet1!$D$2:$D$66)*I30","v":12.882868704597534},{"$f":"_xlfn.XLOOKUP($C160,[4]Sheet1!$A$2:$A$66,[4]Sheet1!$D$2:$D$66)*J30","v":12.180838574423483},{"$f":"_xlfn.XLOOKUP($C160,[4]Sheet1!$A$2:$A$66,[4]Sheet1!$D$2:$D$66)*K30","v":11.799032714153382}]
[null,"Zone","DDL","Coincident","Summer",{"$f":"_xlfn.XLOOKUP(C161,[1]Sheet1!$A$2:$A$86,[1]Sheet1!$B$2:$B$86)","v":66},null,{"$f":"_xlfn.XLOOKUP($C161,[4]Sheet1!$A$2:$A$66,[4]Sheet1!$D$2:$D$66)*H31","v":77.758374078748503},{"$f":"_xlfn.XLOOKUP($C161,[4]Sheet1!$A$2:$A$66,[4]Sheet1!$D$2:$D$66)*I31","v":77.718431418376724},{"$f":"_xlfn.XLOOKUP($C161,[4]Sheet1!$A$2:$A$66,[4]Sheet1!$D$2:$D$66)*J31","v":71.237734773056616},{"$f":"_xlfn.XLOOKUP($C161,[4]Sheet1!$A$2:$A$66,[4]Sheet1!$D$2:$D$66)*K31","v":71.217763442870719}]
[null,"Zone","DLF","Coincident","Summer",{"$f":"_xlfn.XLOOKUP(C162,[1]Sheet1!$A$2:$A$86,[1]Sheet1!$B$2:$B$86)","v":66},null,{"$f":"_xlfn.XLOOKUP($C162,[4]Sheet1!$A$2:$A$66,[4]Sheet1!$D$2:$D$66)*H32","v":13.855495445763179},{"$f":"_xlfn.XLOOKUP($C162,[4]Sheet1!$A$2:$A$66,[4]Sheet1!$D$2:$D$66)*I32","v":13.786486337289539},{"$f":"_xlfn.XLOOKUP($C162,[4]Sheet1!$A$2:$A$66,[4]Sheet1!$D$2:$D$66)*J32","v":12.444642561413193},{"$f":"_xlfn.XLOOKUP($C162,[4]Sheet1!$A$2:$A$66,[4]Sheet1!$D$2:$D$66)*K32","v":12.398636489097433}]
[null,"Zone","ECA","Coincident","Summer",{"$f":"_xlfn.XLOOKUP(C163,[1]Sheet1!$A$2:$A$86,[1]Sheet1!$B$2:$B$86)","v":40.5},null,{"$f":"_xlfn.XLOOKUP($C163,[4]Sheet1!$A$2:$A$66,[4]Sheet1!$D$2:$D$66)*H33","v":31.976093263421255},{"$f":"_xlfn.XLOOKUP($C163,[4]Sheet1!$A$2:$A$66,[4]Sheet1!$D$2:$D$66)*I33","v":31.899595432647523},{"$f":"_xlfn.XLOOKUP($C163,[4]Sheet1!$A$2:$A$66,[4]Sheet1!$D$2:$D$66)*J33","v":28.487792180138939},{"$f":"_xlfn.XLOOKUP($C163,[4]Sheet1!$A$2:$A$66,[4]Sheet1!$D$2:$D$66)*K33","v":28.441893481674697}]
[null,"Zone","EHK","Coincident","Summer",{"$f":"_xlfn.XLOOKUP(C164,[1]Sheet1!$A$2:$A$86,[1]Sheet1!$B$2:$B$86)","v":54},null,{"$f":"_xlfn.XLOOKUP($C164,[4]Sheet1!$A$2:$A$66,[4]Sheet1!$D$2:$D$66)*H34","v":44.633843324604712},{"$f":"_xlfn.XLOOKUP($C164,[4]Sheet1!$A$2:$A$66,[4]Sheet1!$D$2:$D$66)*I34","v":44.463516101305295},{"$f":"_xlfn.XLOOKUP($C164,[4]Sheet1!$A$2:$A$66,[4]Sheet1!$D$2:$D$66)*J34","v":41.608507406000754},{"$f":"_xlfn.XLOOKUP($C164,[4]Sheet1!$A$2:$A$66,[4]Sheet1!$D$2:$D$66)*K34","v":41.470623463329801}]
[null,"Zone","FNS","Coincident","Summer",{"$f":"_xlfn.XLOOKUP(C165,[1]Sheet1!$A$2:$A$86,[1]Sheet1!$B$2:$B$86)","v":99},null,{"$f":"_xlfn.XLOOKUP($C165,[4]Sheet1!$A$2:$A$66,[4]Sheet1!$D$2:$D$66)*H35","v":39.442317707166225},{"$f":"_xlfn.XLOOKUP($C165,[4]Sheet1!$A$2:$A$66,[4]Sheet1!$D$2:$D$66)*I35","v":39.256232465378929},{"$f":"_xlfn.XLOOKUP($C165,[4]Sheet1!$A$2:$A$66,[4]Sheet1!$D$2:$D$66)*J35","v":34.22417738538072},{"$f":"_xlfn.XLOOKUP($C165,[4]Sheet1!$A$2:$A$66,[4]Sheet1!$D$2:$D$66)*K35","v":34.084613454040245}]
[null,"Zone","GB","Coincident","Summer",{"$f":"_xlfn.XLOOKUP(C166,[1]Sheet1!$A$2:$A$86,[1]Sheet1!$B$2:$B$86)","v":37.5},null,{"$f":"_xlfn.XLOOKUP($C166,[4]Sheet1!$A$2:$A$66,[4]Sheet1!$D$2:$D$66)*H36","v":10.827351817062901},{"$f":"_xlfn.XLOOKUP($C166,[4]Sheet1!$A$2:$A$66,[4]Sheet1!$D$2:$D$66)*I36","v":10.022224525490705},{"$f":"_xlfn.XLOOKUP($C166,[4]Sheet1!$A$2:$A$66,[4]Sheet1!$D$2:$D$66)*J36","v":9.8225529571808003},{"$f":"_xlfn.XLOOKUP($C166,[4]Sheet1!$A$2:$A$66,[4]Sheet1!$D$2:$D$66)*K36","v":9.1269229772624225}]
[null,"Zone","GCY","Coincident","Summer",{"$f":"_xlfn.XLOOKUP(C167,[1]Sheet1!$A$2:$A$86,[1]Sheet1!$B$2:$B$86)","v":66},null,{"$f":"_xlfn.XLOOKUP($C167,[4]Sheet1!$A$2:$A$66,[4]Sheet1!$D$2:$D$66)*H37","v":42.624803226015139},{"$f":"_xlfn.XLOOKUP($C167,[4]Sheet1!$A$2:$A$66,[4]Sheet1!$D$2:$D$66)*I37","v":42.040463200569299},{"$f":"_xlfn.XLOOKUP($C167,[4]Sheet1!$A$2:$A$66,[4]Sheet1!$D$2:$D$66)*J37","v":36.901472839799027},{"$f":"_xlfn.XLOOKUP($C167,[4]Sheet1!$A$2:$A$66,[4]Sheet1!$D$2:$D$66)*K37","v":36.485230629892392}]
[null,"Zone","GHP","Coincident","Summer",{"$f":"_xlfn.XLOOKUP(C168,[1]Sheet1!$A$2:$A$86,[1]Sheet1!$B$2:$B$86)","v":66},null,{"$f":"_xlfn.XLOOKUP($C168,[4]Sheet1!$A$2:$A$66,[4]Sheet1!$D$2:$D$66)*H38","v":33.342227123695977},{"$f":"_xlfn.XLOOKUP($C168,[4]Sheet1!$A$2:$A$66,[4]Sheet1!$D$2:$D$66)*I38","v":33.306509687034278},{"$f":"_xlfn.XLOOKUP($C168,[4]Sheet1!$A$2:$A$66,[4]Sheet1!$D$2:$D$66)*J38","v":29.779412816691508},{"$f":"_xlfn.XLOOKUP($C168,[4]Sheet1!$A$2:$A$66,[4]Sheet1!$D$2:$D$66)*K38","v":29.761554098360655}]
[null,"Zone","GL","Coincident","Summer",{"$f":"_xlfn.XLOOKUP(C169,[1]Sheet1!$A$2:$A$86,[1]Sheet1!$B$2:$B$86)","v":80},null,{"$f":"_xlfn.XLOOKUP($C169,[4]Sheet1!$A$2:$A$66,[4]Sheet1!$D$2:$D$66)*H39","v":37.431921088904211},{"$f":"_xlfn.XLOOKUP($C169,[4]Sheet1!$A$2:$A$66,[4]Sheet1!$D$2:$D$66)*I39","v":37.396449000689188},{"$f":"_xlfn.XLOOKUP($C169,[4]Sheet1!$A$2:$A$66,[4]Sheet1!$D$2:$D$66)*J39","v":33.955656443831842},{"$f":"_xlfn.XLOOKUP($C169,[4]Sheet1!$A$2:$A$66,[4]Sheet1!$D$2:$D$66)*K39","v":33.929052377670573}]
[null,"Zone","GLE","Coincident","Summer",{"$f":"_xlfn.XLOOKUP(C170,[1]Sheet1!$A$2:$A$86,[1]Sheet1!$B$2:$B$86)","v":79.5},null,{"$f":"_xlfn.XLOOKUP($C170,[4]Sheet1!$A$2:$A$66,[4]Sheet1!$D$2:$D$66)*H40","v":60.300982055783102},{"$f":"_xlfn.XLOOKUP($C170,[4]Sheet1!$A$2:$A$66,[4]Sheet1!$D$2:$D$66)*I40","v":60.217552564852731},{"$f":"_xlfn.XLOOKUP($C170,[4]Sheet1!$A$2:$A$66,[4]Sheet1!$D$2:$D$66)*J40","v":54.664856446264871},{"$f":"_xlfn.XLOOKUP($C170,[4]Sheet1!$A$2:$A$66,[4]Sheet1!$D$2:$D$66)*K40","v":54.609236785644619}]
[null,"Zone","GSB","Coincident","Summer",{"$f":"_xlfn.XLOOKUP(C171,[1]Sheet1!$A$2:$A$86,[1]Sheet1!$B$2:$B$86)","v":66},null,{"$f":"_xlfn.XLOOKUP($C171,[4]Sheet1!$A$2:$A$66,[4]Sheet1!$D$2:$D$66)*H41","v":25.232754591594553},{"$f":"_xlfn.XLOOKUP($C171,[4]Sheet1!$A$2:$A$66,[4]Sheet1!$D$2:$D$66)*I41","v":25.208987475809689},{"$f":"_xlfn.XLOOKUP($C171,[4]Sheet1!$A$2:$A$66,[4]Sheet1!$D$2:$D$66)*J41","v":22.927344360462993},{"$f":"_xlfn.XLOOKUP($C171,[4]Sheet1!$A$2:$A$66,[4]Sheet1!$D$2:$D$66)*K41","v":22.895654872749841}]
[null,"Zone","HSM","Coincident","Summer",{"$f":"_xlfn.XLOOKUP(C172,[1]Sheet1!$A$2:$A$86,[1]Sheet1!$B$2:$B$86)","v":40.5},null,{"$f":"_xlfn.XLOOKUP($C172,[4]Sheet1!$A$2:$A$66,[4]Sheet1!$D$2:$D$66)*H42","v":39.58983466639409},{"$f":"_xlfn.XLOOKUP($C172,[4]Sheet1!$A$2:$A$66,[4]Sheet1!$D$2:$D$66)*I42","v":39.426315385991359},{"$f":"_xlfn.XLOOKUP($C172,[4]Sheet1!$A$2:$A$66,[4]Sheet1!$D$2:$D$66)*J42","v":37.364155572023613},{"$f":"_xlfn.XLOOKUP($C172,[4]Sheet1!$A$2:$A$66,[4]Sheet1!$D$2:$D$66)*K42","v":37.246058313954968}]
[null,"Zone","HTN","Coincident","Summer",{"$f":"_xlfn.XLOOKUP(C173,[1]Sheet1!$A$2:$A$86,[1]Sheet1!$B$2:$B$86)","v":39.5},null,{"$f":"_xlfn.XLOOKUP($C173,[4]Sheet1!$A$2:$A$66,[4]Sheet1!$D$2:$D$66)*H43","v":25.629028950310317},{"$f":"_xlfn.XLOOKUP($C173,[4]Sheet1!$A$2:$A$66,[4]Sheet1!$D$2:$D$66)*I43","v":25.629028950310317},{"$f":"_xlfn.XLOOKUP($C173,[4]Sheet1!$A$2:$A$66,[4]Sheet1!$D$2:$D$66)*J43","v":22.723386145483982},{"$f":"_xlfn.XLOOKUP($C173,[4]Sheet1!$A$2:$A$66,[4]Sheet1!$D$2:$D$66)*K43","v":22.723386145483982}]
[null,"Zone","KRT","Coincident","Summer",{"$f":"_xlfn.XLOOKUP(C174,[1]Sheet1!$A$2:$A$86,[1]Sheet1!$B$2:$B$86)","v":40.5},null,{"$f":"_xlfn.XLOOKUP($C174,[4]Sheet1!$A$2:$A$66,[4]Sheet1!$D$2:$D$66)*H44","v":27.416860221845024},{"$f":"_xlfn.XLOOKUP($C174,[4]Sheet1!$A$2:$A$66,[4]Sheet1!$D$2:$D$66)*I44","v":27.409585915604154},{"$f":"_xlfn.XLOOKUP($C174,[4]Sheet1!$A$2:$A$66,[4]Sheet1!$D$2:$D$66)*J44","v":21.379186041921606},{"$f":"_xlfn.XLOOKUP($C174,[4]Sheet1!$A$2:$A$66,[4]Sheet1!$D$2:$D$66)*K44","v":21.371911735680733}]
[null,"Zone","KYM","Coincident","Summer",{"$f":"_xlfn.XLOOKUP(C175,[1]Sheet1!$A$2:$A$86,[1]Sheet1!$B$2:$B$86)","v":40.5},null,{"$f":"_xlfn.XLOOKUP($C175,[4]Sheet1!$A$2:$A$66,[4]Sheet1!$D$2:$D$66)*H45","v":22.206669655345554},{"$f":"_xlfn.XLOOKUP($C175,[4]Sheet1!$A$2:$A$66,[4]Sheet1!$D$2:$D$66)*I45","v":22.113851809346198},{"$f":"_xlfn.XLOOKUP($C175,[4]Sheet1!$A$2:$A$66,[4]Sheet1!$D$2:$D$66)*J45","v":20.435395760857872},{"$f":"_xlfn.XLOOKUP($C175,[4]Sheet1!$A$2:$A$66,[4]Sheet1!$D$2:$D$66)*K45","v":20.358047555858409}]
[null,"Zone","LV","Coincident","Summer",{"$f":"_xlfn.XLOOKUP(C176,[1]Sheet1!$A$2:$A$86,[1]Sheet1!$B$2:$B$86)","v":99},null,{"$f":"_xlfn.XLOOKUP($C176,[4]Sheet1!$A$2:$A$66,[4]Sheet1!$D$2:$D$66)*H46","v":108.10353777461847},{"$f":"_xlfn.XLOOKUP($C176,[4]Sheet1!$A$2:$A$66,[4]Sheet1!$D$2:$D$66)*I46","v":107.93544483195237},{"$f":"_xlfn.XLOOKUP($C176,[4]Sheet1!$A$2:$A$66,[4]Sheet1!$D$2:$D$66)*J46","v":98.28493235888665},{"$f":"_xlfn.XLOOKUP($C176,[4]Sheet1!$A$2:$A$66,[4]Sheet1!$D$2:$D$66)*K46","v":98.215717617788826}]
[null,"Zone","LVN","Coincident","Summer",{"$f":"_xlfn.XLOOKUP(C177,[1]Sheet1!$A$2:$A$86,[1]Sheet1!$B$2:$B$86)","v":99},null,{"$f":"_xlfn.XLOOKUP($C177,[4]Sheet1!$A$2:$A$66,[4]Sheet1!$D$2:$D$66)*H47","v":59.32386239927019},{"$f":"_xlfn.XLOOKUP($C177,[4]Sheet1!$A$2:$A$66,[4]Sheet1!$D$2:$D$66)*I47","v":57.954140489584915},{"$f":"_xlfn.XLOOKUP($C177,[4]Sheet1!$A$2:$A$66,[4]Sheet1!$D$2:$D$66)*J47","v":51.290053063706857},{"$f":"_xlfn.XLOOKUP($C177,[4]Sheet1!$A$2:$A$66,[4]Sheet1!$D$2:$D$66)*K47","v":50.168726318990423}]
[null,"Zone","LVN11","Coincident","Summer",{"$f":"_xlfn.XLOOKUP(C178,[1]Sheet1!$A$2:$A$86,[1]Sheet1!$B$2:$B$86)","v":30},null,{"$f":"_xlfn.XLOOKUP($C178,[4]Sheet1!$A$2:$A$66,[4]Sheet1!$D$2:$D$66)*H48","v":9.1458365488501325},{"$f":"_xlfn.XLOOKUP($C178,[4]Sheet1!$A$2:$A$66,[4]Sheet1!$D$2:$D$66)*I48","v":8.8268714307763556},{"$f":"_xlfn.XLOOKUP($C178,[4]Sheet1!$A$2:$A$66,[4]Sheet1!$D$2:$D$66)*J48","v":9.0807416267942589},{"$f":"_xlfn.XLOOKUP($C178,[4]Sheet1!$A$2:$A$66,[4]Sheet1!$D$2:$D$66)*K48","v":8.7747954931316574}]
[null,"Zone","MBN","Coincident","Summer",{"$f":"_xlfn.XLOOKUP(C179,[1]Sheet1!$A$2:$A$86,[1]Sheet1!$B$2:$B$86)","v":59},null,{"$f":"_xlfn.XLOOKUP($C179,[4]Sheet1!$A$2:$A$66,[4]Sheet1!$D$2:$D$66)*H49","v":44.236657357384857},{"$f":"_xlfn.XLOOKUP($C179,[4]Sheet1!$A$2:$A$66,[4]Sheet1!$D$2:$D$66)*I49","v":43.574532323047343},{"$f":"_xlfn.XLOOKUP($C179,[4]Sheet1!$A$2:$A$66,[4]Sheet1!$D$2:$D$66)*J49","v":39.895128651222421},{"$f":"_xlfn.XLOOKUP($C179,[4]Sheet1!$A$2:$A$66,[4]Sheet1!$D$2:$D$66)*K49","v":39.383867548759277}]
[null,"Zone","MDA","Coincident","Summer",{"$f":"_xlfn.XLOOKUP(C180,[1]Sheet1!$A$2:$A$86,[1]Sheet1!$B$2:$B$86)","v":66},null,{"$f":"_xlfn.XLOOKUP($C180,[4]Sheet1!$A$2:$A$66,[4]Sheet1!$D$2:$D$66)*H50","v":42.9817104334875},{"$f":"_xlfn.XLOOKUP($C180,[4]Sheet1!$A$2:$A$66,[4]Sheet1!$D$2:$D$66)*I50","v":42.154555342165089},{"$f":"_xlfn.XLOOKUP($C180,[4]Sheet1!$A$2:$A$66,[4]Sheet1!$D$2:$D$66)*J50","v":39.028060868542759},{"$f":"_xlfn.XLOOKUP($C180,[4]Sheet1!$A$2:$A$66,[4]Sheet1!$D$2:$D$66)*K50","v":38.405797405346085}]
[null,"Zone","MLN","Coincident","Summer",{"$f":"_xlfn.XLOOKUP(C181,[1]Sheet1!$A$2:$A$86,[1]Sheet1!$B$2:$B$86)","v":99},null,{"$f":"_xlfn.XLOOKUP($C181,[4]Sheet1!$A$2:$A$66,[4]Sheet1!$D$2:$D$66)*H51","v":90.398294238365295},{"$f":"_xlfn.XLOOKUP($C181,[4]Sheet1!$A$2:$A$66,[4]Sheet1!$D$2:$D$66)*I51","v":90.373078535648872},{"$f":"_xlfn.XLOOKUP($C181,[4]Sheet1!$A$2:$A$66,[4]Sheet1!$D$2:$D$66)*J51","v":80.698653926782455},{"$f":"_xlfn.XLOOKUP($C181,[4]Sheet1!$A$2:$A$66,[4]Sheet1!$D$2:$D$66)*K51","v":80.698653926782455}]
[null,"Zone","MNA","Coincident","Summer",{"$f":"_xlfn.XLOOKUP(C182,[1]Sheet1!$A$2:$A$86,[1]Sheet1!$B$2:$B$86)","v":66},null,{"$f":"_xlfn.XLOOKUP($C182,[4]Sheet1!$A$2:$A$66,[4]Sheet1!$D$2:$D$66)*H52","v":38.541613503519031},{"$f":"_xlfn.XLOOKUP($C182,[4]Sheet1!$A$2:$A$66,[4]Sheet1!$D$2:$D$66)*I52","v":37.407336752952403},{"$f":"_xlfn.XLOOKUP($C182,[4]Sheet1!$A$2:$A$66,[4]Sheet1!$D$2:$D$66)*J52","v":34.615270905403797},{"$f":"_xlfn.XLOOKUP($C182,[4]Sheet1!$A$2:$A$66,[4]Sheet1!$D$2:$D$66)*K52","v":33.742750328044849}]
[null,"Zone","MRO","Coincident","Summer",{"$f":"_xlfn.XLOOKUP(C183,[1]Sheet1!$A$2:$A$86,[1]Sheet1!$B$2:$B$86)","v":27},null,{"$f":"_xlfn.XLOOKUP($C183,[4]Sheet1!$A$2:$A$66,[4]Sheet1!$D$2:$D$66)*H53","v":21.03193482224248},{"$f":"_xlfn.XLOOKUP($C183,[4]Sheet1!$A$2:$A$66,[4]Sheet1!$D$2:$D$66)*I53","v":21.004936189608021},{"$f":"_xlfn.XLOOKUP($C183,[4]Sheet1!$A$2:$A$66,[4]Sheet1!$D$2:$D$66)*J53","v":19.466014129443938},{"$f":"_xlfn.XLOOKUP($C183,[4]Sheet1!$A$2:$A$66,[4]Sheet1!$D$2:$D$66)*K53","v":19.457014585232454}]
[null,"Zone","MTC","Coincident","Summer",{"$f":"_xlfn.XLOOKUP(C184,[1]Sheet1!$A$2:$A$86,[1]Sheet1!$B$2:$B$86)","v":66},null,{"$f":"_xlfn.XLOOKUP($C184,[4]Sheet1!$A$2:$A$66,[4]Sheet1!$D$2:$D$66)*H54","v":0},{"$f":"_xlfn.XLOOKUP($C184,[4]Sheet1!$A$2:$A$66,[4]Sheet1!$D$2:$D$66)*I54","v":0},{"$f":"_xlfn.XLOOKUP($C184,[4]Sheet1!$A$2:$A$66,[4]Sheet1!$D$2:$D$66)*J54","v":0},{"$f":"_xlfn.XLOOKUP($C184,[4]Sheet1!$A$2:$A$66,[4]Sheet1!$D$2:$D$66)*K54","v":0}]
[null,"Zone","NHL","Coincident","Summer",{"$f":"_xlfn.XLOOKUP(C185,[1]Sheet1!$A$2:$A$86,[1]Sheet1!$B$2:$B$86)","v":20},null,{"$f":"_xlfn.XLOOKUP($C185,[4]Sheet1!$A$2:$A$66,[4]Sheet1!$D$2:$D$66)*H55","v":14.349888888888888},{"$f":"_xlfn.XLOOKUP($C185,[4]Sheet1!$A$2:$A$66,[4]Sheet1!$D$2:$D$66)*I55","v":14.349888888888888},{"$f":"_xlfn.XLOOKUP($C185,[4]Sheet1!$A$2:$A$66,[4]Sheet1!$D$2:$D$66)*J55","v":11.681133557800225},{"$f":"_xlfn.XLOOKUP($C185,[4]Sheet1!$A$2:$A$66,[4]Sheet1!$D$2:$D$66)*K55","v":11.672607182940517}]
[null,"Zone","NKA","Coincident","Summer",{"$f":"_xlfn.XLOOKUP(C186,[1]Sheet1!$A$2:$A$86,[1]Sheet1!$B$2:$B$86)","v":39.5},null,{"$f":"_xlfn.XLOOKUP($C186,[4]Sheet1!$A$2:$A$66,[4]Sheet1!$D$2:$D$66)*H56","v":30.362294000075426},{"$f":"_xlfn.XLOOKUP($C186,[4]Sheet1!$A$2:$A$66,[4]Sheet1!$D$2:$D$66)*I56","v":30.352937360938263},{"$f":"_xlfn.XLOOKUP($C186,[4]Sheet1!$A$2:$A$66,[4]Sheet1!$D$2:$D$66)*J56","v":27.171680054304787},{"$f":"_xlfn.XLOOKUP($C186,[4]Sheet1!$A$2:$A$66,[4]Sheet1!$D$2:$D$66)*K56","v":27.143610136893315}]
[null,"Zone","OYN","Coincident","Summer",{"$f":"_xlfn.XLOOKUP(C187,[1]Sheet1!$A$2:$A$86,[1]Sheet1!$B$2:$B$86)","v":27},null,{"$f":"_xlfn.XLOOKUP($C187,[4]Sheet1!$A$2:$A$66,[4]Sheet1!$D$2:$D$66)*H57","v":7.086313680595306},{"$f":"_xlfn.XLOOKUP($C187,[4]Sheet1!$A$2:$A$66,[4]Sheet1!$D$2:$D$66)*I57","v":6.1604636519748137},{"$f":"_xlfn.XLOOKUP($C187,[4]Sheet1!$A$2:$A$66,[4]Sheet1!$D$2:$D$66)*J57","v":6.7213151116199192},{"$f":"_xlfn.XLOOKUP($C187,[4]Sheet1!$A$2:$A$66,[4]Sheet1!$D$2:$D$66)*K57","v":5.8399771036061807}]
[null,"Zone","PLD","Coincident","Summer",{"$f":"_xlfn.XLOOKUP(C188,[1]Sheet1!$A$2:$A$86,[1]Sheet1!$B$2:$B$86)","v":32},null,{"$f":"_xlfn.XLOOKUP($C188,[4]Sheet1!$A$2:$A$66,[4]Sheet1!$D$2:$D$66)*H58","v":13.160690607734805},{"$f":"_xlfn.XLOOKUP($C188,[4]Sheet1!$A$2:$A$66,[4]Sheet1!$D$2:$D$66)*I58","v":13.152546616022097},{"$f":"_xlfn.XLOOKUP($C188,[4]Sheet1!$A$2:$A$66,[4]Sheet1!$D$2:$D$66)*J58","v":12.142691643646408},{"$f":"_xlfn.XLOOKUP($C188,[4]Sheet1!$A$2:$A$66,[4]Sheet1!$D$2:$D$66)*K58","v":12.126403660220994}]
[null,"Zone","RVL","Coincident","Summer",{"$f":"_xlfn.XLOOKUP(C189,[1]Sheet1!$A$2:$A$86,[1]Sheet1!$B$2:$B$86)","v":19.5},null,{"$f":"_xlfn.XLOOKUP($C189,[4]Sheet1!$A$2:$A$66,[4]Sheet1!$D$2:$D$66)*H59","v":20.954313871327628},{"$f":"_xlfn.XLOOKUP($C189,[4]Sheet1!$A$2:$A$66,[4]Sheet1!$D$2:$D$66)*I59","v":20.937360542952767},{"$f":"_xlfn.XLOOKUP($C189,[4]Sheet1!$A$2:$A$66,[4]Sheet1!$D$2:$D$66)*J59","v":18.267211323912235},{"$f":"_xlfn.XLOOKUP($C189,[4]Sheet1!$A$2:$A$66,[4]Sheet1!$D$2:$D$66)*K59","v":18.241781331349941}]
[null,"Zone","SA","Coincident","Summer",{"$f":"_xlfn.XLOOKUP(C190,[1]Sheet1!$A$2:$A$86,[1]Sheet1!$B$2:$B$86)","v":93},null,{"$f":"_xlfn.XLOOKUP($C190,[4]Sheet1!$A$2:$A$66,[4]Sheet1!$D$2:$D$66)*H60","v":86.255284932244464},{"$f":"_xlfn.XLOOKUP($C190,[4]Sheet1!$A$2:$A$66,[4]Sheet1!$D$2:$D$66)*I60","v":85.738454635197002},{"$f":"_xlfn.XLOOKUP($C190,[4]Sheet1!$A$2:$A$66,[4]Sheet1!$D$2:$D$66)*J60","v":78.918140536659791},{"$f":"_xlfn.XLOOKUP($C190,[4]Sheet1!$A$2:$A$66,[4]Sheet1!$D$2:$D$66)*K60","v":78.548976038768743}]
[null,"Zone","SHL","Coincident","Summer",{"$f":"_xlfn.XLOOKUP(C191,[1]Sheet1!$A$2:$A$86,[1]Sheet1!$B$2:$B$86)","v":40.5},null,{"$f":"_xlfn.XLOOKUP($C191,[4]Sheet1!$A$2:$A$66,[4]Sheet1!$D$2:$D$66)*H61","v":38.834472083705649},{"$f":"_xlfn.XLOOKUP($C191,[4]Sheet1!$A$2:$A$66,[4]Sheet1!$D$2:$D$66)*I61","v":38.74986539071282},{"$f":"_xlfn.XLOOKUP($C191,[4]Sheet1!$A$2:$A$66,[4]Sheet1!$D$2:$D$66)*J61","v":34.829755282045369},{"$f":"_xlfn.XLOOKUP($C191,[4]Sheet1!$A$2:$A$66,[4]Sheet1!$D$2:$D$66)*K61","v":34.810953794713633}]
[null,"Zone","SHN","Coincident","Summer",{"$f":"_xlfn.XLOOKUP(C192,[1]Sheet1!$A$2:$A$86,[1]Sheet1!$B$2:$B$86)","v":66},null,{"$f":"_xlfn.XLOOKUP($C192,[4]Sheet1!$A$2:$A$66,[4]Sheet1!$D$2:$D$66)*H62","v":34.233683444323994},{"$f":"_xlfn.XLOOKUP($C192,[4]Sheet1!$A$2:$A$66,[4]Sheet1!$D$2:$D$66)*I62","v":34.217531671054672},{"$f":"_xlfn.XLOOKUP($C192,[4]Sheet1!$A$2:$A$66,[4]Sheet1!$D$2:$D$66)*J62","v":30.922569924113368},{"$f":"_xlfn.XLOOKUP($C192,[4]Sheet1!$A$2:$A$66,[4]Sheet1!$D$2:$D$66)*K62","v":30.914494037478711}]
[null,"Zone","SHP","Coincident","Summer",{"$f":"_xlfn.XLOOKUP(C193,[1]Sheet1!$A$2:$A$86,[1]Sheet1!$B$2:$B$86)","v":66},null,{"$f":"_xlfn.XLOOKUP($C193,[4]Sheet1!$A$2:$A$66,[4]Sheet1!$D$2:$D$66)*H63","v":35.603597523848194},{"$f":"_xlfn.XLOOKUP($C193,[4]Sheet1!$A$2:$A$66,[4]Sheet1!$D$2:$D$66)*I63","v":35.287997767404107},{"$f":"_xlfn.XLOOKUP($C193,[4]Sheet1!$A$2:$A$66,[4]Sheet1!$D$2:$D$66)*J63","v":23.827781611528319},{"$f":"_xlfn.XLOOKUP($C193,[4]Sheet1!$A$2:$A$66,[4]Sheet1!$D$2:$D$66)*K63","v":23.669981733306276}]
[null,"Zone","SSE","Coincident","Summer",{"$f":"_xlfn.XLOOKUP(C194,[1]Sheet1!$A$2:$A$86,[1]Sheet1!$B$2:$B$86)","v":99},null,{"$f":"_xlfn.XLOOKUP($C194,[4]Sheet1!$A$2:$A$66,[4]Sheet1!$D$2:$D$66)*H64","v":56.911890648877389},{"$f":"_xlfn.XLOOKUP($C194,[4]Sheet1!$A$2:$A$66,[4]Sheet1!$D$2:$D$66)*I64","v":56.017704096626304},{"$f":"_xlfn.XLOOKUP($C194,[4]Sheet1!$A$2:$A$66,[4]Sheet1!$D$2:$D$66)*J64","v":52.934302192312209},{"$f":"_xlfn.XLOOKUP($C194,[4]Sheet1!$A$2:$A$66,[4]Sheet1!$D$2:$D$66)*K64","v":52.155743211472902}]
[null,"Zone","STL","Coincident","Summer",{"$f":"_xlfn.XLOOKUP(C195,[1]Sheet1!$A$2:$A$86,[1]Sheet1!$B$2:$B$86)","v":27},null,{"$f":"_xlfn.XLOOKUP($C195,[4]Sheet1!$A$2:$A$66,[4]Sheet1!$D$2:$D$66)*H65","v":18.67663789319678},{"$f":"_xlfn.XLOOKUP($C195,[4]Sheet1!$A$2:$A$66,[4]Sheet1!$D$2:$D$66)*I65","v":18.256079005120704},{"$f":"_xlfn.XLOOKUP($C195,[4]Sheet1!$A$2:$A$66,[4]Sheet1!$D$2:$D$66)*J65","v":17.481868324798828},{"$f":"_xlfn.XLOOKUP($C195,[4]Sheet1!$A$2:$A$66,[4]Sheet1!$D$2:$D$66)*K65","v":17.061309436722752}]
[null,"Zone","STN","Coincident","Summer",{"$f":"_xlfn.XLOOKUP(C196,[1]Sheet1!$A$2:$A$86,[1]Sheet1!$B$2:$B$86)","v":79},null,{"$f":"_xlfn.XLOOKUP($C196,[4]Sheet1!$A$2:$A$66,[4]Sheet1!$D$2:$D$66)*H66","v":40.480203604402689},{"$f":"_xlfn.XLOOKUP($C196,[4]Sheet1!$A$2:$A$66,[4]Sheet1!$D$2:$D$66)*I66","v":39.609070878522758},{"$f":"_xlfn.XLOOKUP($C196,[4]Sheet1!$A$2:$A$66,[4]Sheet1!$D$2:$D$66)*J66","v":38.125790831754216},{"$f":"_xlfn.XLOOKUP($C196,[4]Sheet1!$A$2:$A$66,[4]Sheet1!$D$2:$D$66)*K66","v":37.348834616780231}]
[null,"Zone","SU","Coincident","Summer",{"$f":"_xlfn.XLOOKUP(C197,[1]Sheet1!$A$2:$A$86,[1]Sheet1!$B$2:$B$86)","v":99},null,{"$f":"_xlfn.XLOOKUP($C197,[4]Sheet1!$A$2:$A$66,[4]Sheet1!$D$2:$D$66)*H67","v":79.923538744382398},{"$f":"_xlfn.XLOOKUP($C197,[4]Sheet1!$A$2:$A$66,[4]Sheet1!$D$2:$D$66)*I67","v":79.537355304371502},{"$f":"_xlfn.XLOOKUP($C197,[4]Sheet1!$A$2:$A$66,[4]Sheet1!$D$2:$D$66)*J67","v":71.222086340732673},{"$f":"_xlfn.XLOOKUP($C197,[4]Sheet1!$A$2:$A$66,[4]Sheet1!$D$2:$D$66)*K67","v":70.942719596895003}]
[null,"Zone","TNA","Coincident","Summer",{"$f":"_xlfn.XLOOKUP(C198,[1]Sheet1!$A$2:$A$86,[1]Sheet1!$B$2:$B$86)","v":99},null,{"$f":"_xlfn.XLOOKUP($C198,[4]Sheet1!$A$2:$A$66,[4]Sheet1!$D$2:$D$66)*H68","v":123.22586449994026},{"$f":"_xlfn.XLOOKUP($C198,[4]Sheet1!$A$2:$A$66,[4]Sheet1!$D$2:$D$66)*I68","v":123.07329430039431},{"$f":"_xlfn.XLOOKUP($C198,[4]Sheet1!$A$2:$A$66,[4]Sheet1!$D$2:$D$66)*J68","v":104.77334647707811},{"$f":"_xlfn.XLOOKUP($C198,[4]Sheet1!$A$2:$A$66,[4]Sheet1!$D$2:$D$66)*K68","v":104.52753893336519}]
[null,"Zone","TQY","Coincident","Summer",{"$f":"_xlfn.XLOOKUP(C199,[1]Sheet1!$A$2:$A$86,[1]Sheet1!$B$2:$B$86)","v":66},null,{"$f":"_xlfn.XLOOKUP($C199,[4]Sheet1!$A$2:$A$66,[4]Sheet1!$D$2:$D$66)*H69","v":35.590093497889626},{"$f":"_xlfn.XLOOKUP($C199,[4]Sheet1!$A$2:$A$66,[4]Sheet1!$D$2:$D$66)*I69","v":35.54483651226159},{"$f":"_xlfn.XLOOKUP($C199,[4]Sheet1!$A$2:$A$66,[4]Sheet1!$D$2:$D$66)*J69","v":31.109651920713791},{"$f":"_xlfn.XLOOKUP($C199,[4]Sheet1!$A$2:$A$66,[4]Sheet1!$D$2:$D$66)*K69","v":31.019137949457718}]
[null,"Zone","TRG","Coincident","Summer",{"$f":"_xlfn.XLOOKUP(C200,[1]Sheet1!$A$2:$A$86,[1]Sheet1!$B$2:$B$86)","v":46.5},null,{"$f":"_xlfn.XLOOKUP($C200,[4]Sheet1!$A$2:$A$66,[4]Sheet1!$D$2:$D$66)*H70","v":16.39021524141943},{"$f":"_xlfn.XLOOKUP($C200,[4]Sheet1!$A$2:$A$66,[4]Sheet1!$D$2:$D$66)*I70","v":16.342310645724258},{"$f":"_xlfn.XLOOKUP($C200,[4]Sheet1!$A$2:$A$66,[4]Sheet1!$D$2:$D$66)*J70","v":12.345698662012797},{"$f":"_xlfn.XLOOKUP($C200,[4]Sheet1!$A$2:$A$66,[4]Sheet1!$D$2:$D$66)*K70","v":12.311481093659102}]
[null,"Zone","WBE","Coincident","Summer",{"$f":"_xlfn.XLOOKUP(C201,[1]Sheet1!$A$2:$A$86,[1]Sheet1!$B$2:$B$86)","v":99},null,{"$f":"_xlfn.XLOOKUP($C201,[4]Sheet1!$A$2:$A$66,[4]Sheet1!$D$2:$D$66)*H71","v":114.21910016351075},{"$f":"_xlfn.XLOOKUP($C201,[4]Sheet1!$A$2:$A$66,[4]Sheet1!$D$2:$D$66)*I71","v":114.21910016351075},{"$f":"_xlfn.XLOOKUP($C201,[4]Sheet1!$A$2:$A$66,[4]Sheet1!$D$2:$D$66)*J71","v":101.60642860910386},{"$f":"_xlfn.XLOOKUP($C201,[4]Sheet1!$A$2:$A$66,[4]Sheet1!$D$2:$D$66)*K71","v":101.60642860910386}]
[null,"Zone","WBL","Coincident","Summer",{"$f":"_xlfn.XLOOKUP(C202,[1]Sheet1!$A$2:$A$86,[1]Sheet1!$B$2:$B$86)","v":79.5},null,{"$f":"_xlfn.XLOOKUP($C202,[4]Sheet1!$A$2:$A$66,[4]Sheet1!$D$2:$D$66)*H72","v":49.926679773331784},{"$f":"_xlfn.XLOOKUP($C202,[4]Sheet1!$A$2:$A$66,[4]Sheet1!$D$2:$D$66)*I72","v":49.476889865463932},{"$f":"_xlfn.XLOOKUP($C202,[4]Sheet1!$A$2:$A$66,[4]Sheet1!$D$2:$D$66)*J72","v":45.104931960988395},{"$f":"_xlfn.XLOOKUP($C202,[4]Sheet1!$A$2:$A$66,[4]Sheet1!$D$2:$D$66)*K72","v":44.745100034694111}]
[null,"Zone","WIN","Coincident","Summer",{"$f":"_xlfn.XLOOKUP(C203,[1]Sheet1!$A$2:$A$86,[1]Sheet1!$B$2:$B$86)","v":20.5},null,{"$f":"_xlfn.XLOOKUP($C203,[4]Sheet1!$A$2:$A$66,[4]Sheet1!$D$2:$D$66)*H73","v":9.1322454227525203},{"$f":"_xlfn.XLOOKUP($C203,[4]Sheet1!$A$2:$A$66,[4]Sheet1!$D$2:$D$66)*I73","v":8.4503219502160061},{"$f":"_xlfn.XLOOKUP($C203,[4]Sheet1!$A$2:$A$66,[4]Sheet1!$D$2:$D$66)*J73","v":8.5056130425838319},{"$f":"_xlfn.XLOOKUP($C203,[4]Sheet1!$A$2:$A$66,[4]Sheet1!$D$2:$D$66)*K73","v":7.7407529314955781}]
[null,"Zone","WMN","Coincident","Summer",{"$f":"_xlfn.XLOOKUP(C204,[1]Sheet1!$A$2:$A$86,[1]Sheet1!$B$2:$B$86)","v":46.5},null,{"$f":"_xlfn.XLOOKUP($C204,[4]Sheet1!$A$2:$A$66,[4]Sheet1!$D$2:$D$66)*H74","v":17.660455541132563},{"$f":"_xlfn.XLOOKUP($C204,[4]Sheet1!$A$2:$A$66,[4]Sheet1!$D$2:$D$66)*I74","v":17.406439639785816},{"$f":"_xlfn.XLOOKUP($C204,[4]Sheet1!$A$2:$A$66,[4]Sheet1!$D$2:$D$66)*J74","v":15.399714019146517},{"$f":"_xlfn.XLOOKUP($C204,[4]Sheet1!$A$2:$A$66,[4]Sheet1!$D$2:$D$66)*K74","v":15.190150900535452}]
[null,"Zone","WND","Coincident","Summer",{"$f":"_xlfn.XLOOKUP(C205,[1]Sheet1!$A$2:$A$86,[1]Sheet1!$B$2:$B$86)","v":66},null,{"$f":"_xlfn.XLOOKUP($C205,[4]Sheet1!$A$2:$A$66,[4]Sheet1!$D$2:$D$66)*H75","v":15.087430263362942},{"$f":"_xlfn.XLOOKUP($C205,[4]Sheet1!$A$2:$A$66,[4]Sheet1!$D$2:$D$66)*I75","v":14.978930964625214},{"$f":"_xlfn.XLOOKUP($C205,[4]Sheet1!$A$2:$A$66,[4]Sheet1!$D$2:$D$66)*J75","v":13.025943587346111},{"$f":"_xlfn.XLOOKUP($C205,[4]Sheet1!$A$2:$A$66,[4]Sheet1!$D$2:$D$66)*K75","v":12.887305594514569}]
[null,"Zone","WPD","Coincident","Summer",{"$f":"_xlfn.XLOOKUP(C206,[1]Sheet1!$A$2:$A$86,[1]Sheet1!$B$2:$B$86)","v":79.5},null,{"$f":"_xlfn.XLOOKUP($C206,[4]Sheet1!$A$2:$A$66,[4]Sheet1!$D$2:$D$66)*H76","v":56.252074039472149},{"$f":"_xlfn.XLOOKUP($C206,[4]Sheet1!$A$2:$A$66,[4]Sheet1!$D$2:$D$66)*I76","v":56.252074039472149},{"$f":"_xlfn.XLOOKUP($C206,[4]Sheet1!$A$2:$A$66,[4]Sheet1!$D$2:$D$66)*J76","v":50.454040639962628},{"$f":"_xlfn.XLOOKUP($C206,[4]Sheet1!$A$2:$A$66,[4]Sheet1!$D$2:$D$66)*K76","v":50.454040639962628}]
[null,"Zone","AC","Coincident","Winter",{"$f":"_xlfn.XLOOKUP(C207,[1]Sheet1!$A$2:$A$86,[1]Sheet1!$B$2:$B$86)","v":40},null,{"$f":"_xlfn.XLOOKUP($C207,[4]Sheet1!$A$2:$A$66,[4]Sheet1!$D$2:$D$66)*H77","v":0.49055640632976011},{"$f":"_xlfn.XLOOKUP($C207,[4]Sheet1!$A$2:$A$66,[4]Sheet1!$D$2:$D$66)*I77","v":0.4581163859111792},{"$f":"_xlfn.XLOOKUP($C207,[4]Sheet1!$A$2:$A$66,[4]Sheet1!$D$2:$D$66)*J77","v":0.3299387442572741},{"$f":"_xlfn.XLOOKUP($C207,[4]Sheet1!$A$2:$A$66,[4]Sheet1!$D$2:$D$66)*K77","v":0.30620214395099543}]
[null,null,"AL","Coincident","Winter",{"$f":"_xlfn.XLOOKUP(C208,[1]Sheet1!$A$2:$A$86,[1]Sheet1!$B$2:$B$86)","v":30},null,{"$f":"_xlfn.XLOOKUP($C208,[4]Sheet1!$A$2:$A$66,[4]Sheet1!$D$2:$D$66)*H78","v":14.115762013525014},{"$f":"_xlfn.XLOOKUP($C208,[4]Sheet1!$A$2:$A$66,[4]Sheet1!$D$2:$D$66)*I78","v":13.831200232881006},{"$f":"_xlfn.XLOOKUP($C208,[4]Sheet1!$A$2:$A$66,[4]Sheet1!$D$2:$D$66)*J78","v":13.292030543239733},{"$f":"_xlfn.XLOOKUP($C208,[4]Sheet1!$A$2:$A$66,[4]Sheet1!$D$2:$D$66)*K78","v":13.044911102154151}]
[null,null,"ART","Coincident","Winter",{"$f":"_xlfn.XLOOKUP(C209,[1]Sheet1!$A$2:$A$86,[1]Sheet1!$B$2:$B$86)","v":20},null,{"$f":"_xlfn.XLOOKUP($C209,[4]Sheet1!$A$2:$A$66,[4]Sheet1!$D$2:$D$66)*H79","v":10.109187351043422},{"$f":"_xlfn.XLOOKUP($C209,[4]Sheet1!$A$2:$A$66,[4]Sheet1!$D$2:$D$66)*I79","v":10.102379817473697},{"$f":"_xlfn.XLOOKUP($C209,[4]Sheet1!$A$2:$A$66,[4]Sheet1!$D$2:$D$66)*J79","v":9.4828942626286121},{"$f":"_xlfn.XLOOKUP($C209,[4]Sheet1!$A$2:$A$66,[4]Sheet1!$D$2:$D$66)*K79","v":9.4760867290588848}]
[null,null,"AWT","Coincident","Winter",{"$f":"_xlfn.XLOOKUP(C210,[1]Sheet1!$A$2:$A$86,[1]Sheet1!$B$2:$B$86)","v":66},null,{"$f":"_xlfn.XLOOKUP($C210,[4]Sheet1!$A$2:$A$66,[4]Sheet1!$D$2:$D$66)*H80","v":3.5675443383356065},{"$f":"_xlfn.XLOOKUP($C210,[4]Sheet1!$A$2:$A$66,[4]Sheet1!$D$2:$D$66)*I80","v":3.5675443383356065},{"$f":"_xlfn.XLOOKUP($C210,[4]Sheet1!$A$2:$A$66,[4]Sheet1!$D$2:$D$66)*J80","v":3.2036903137789903},{"$f":"_xlfn.XLOOKUP($C210,[4]Sheet1!$A$2:$A$66,[4]Sheet1!$D$2:$D$66)*K80","v":3.2036903137789903}]
[null,null,"BAE","Coincident","Winter",{"$f":"_xlfn.XLOOKUP(C211,[1]Sheet1!$A$2:$A$86,[1]Sheet1!$B$2:$B$86)","v":33},null,{"$f":"_xlfn.XLOOKUP($C211,[4]Sheet1!$A$2:$A$66,[4]Sheet1!$D$2:$D$66)*H81","v":0},{"$f":"_xlfn.XLOOKUP($C211,[4]Sheet1!$A$2:$A$66,[4]Sheet1!$D$2:$D$66)*I81","v":0},{"$f":"_xlfn.XLOOKUP($C211,[4]Sheet1!$A$2:$A$66,[4]Sheet1!$D$2:$D$66)*J81","v":0},{"$f":"_xlfn.XLOOKUP($C211,[4]Sheet1!$A$2:$A$66,[4]Sheet1!$D$2:$D$66)*K81","v":0}]
[null,null,"BAN","Coincident","Winter",{"$f":"_xlfn.XLOOKUP(C212,[1]Sheet1!$A$2:$A$86,[1]Sheet1!$B$2:$B$86)","v":120},null,{"$f":"_xlfn.XLOOKUP($C212,[4]Sheet1!$A$2:$A$66,[4]Sheet1!$D$2:$D$66)*H82","v":85.412812720848052},{"$f":"_xlfn.XLOOKUP($C212,[4]Sheet1!$A$2:$A$66,[4]Sheet1!$D$2:$D$66)*I82","v":85.072558303886922},{"$f":"_xlfn.XLOOKUP($C212,[4]Sheet1!$A$2:$A$66,[4]Sheet1!$D$2:$D$66)*J82","v":80.640296819787977},{"$f":"_xlfn.XLOOKUP($C212,[4]Sheet1!$A$2:$A$66,[4]Sheet1!$D$2:$D$66)*K82","v":80.317950530035333}]
[null,null,"BAS","Coincident","Winter",{"$f":"_xlfn.XLOOKUP(C213,[1]Sheet1!$A$2:$A$86,[1]Sheet1!$B$2:$B$86)","v":99},null,{"$f":"_xlfn.XLOOKUP($C213,[4]Sheet1!$A$2:$A$66,[4]Sheet1!$D$2:$D$66)*H83","v":71.62868425706057},{"$f":"_xlfn.XLOOKUP($C213,[4]Sheet1!$A$2:$A$66,[4]Sheet1!$D$2:$D$66)*I83","v":71.530908780882143},{"$f":"_xlfn.XLOOKUP($C213,[4]Sheet1!$A$2:$A$66,[4]Sheet1!$D$2:$D$66)*J83","v":67.807292729752945},{"$f":"_xlfn.XLOOKUP($C213,[4]Sheet1!$A$2:$A$66,[4]Sheet1!$D$2:$D$66)*K83","v":67.72581316627091}]
[null,null,"BBD","Coincident","Winter",{"$f":"_xlfn.XLOOKUP(C214,[1]Sheet1!$A$2:$A$86,[1]Sheet1!$B$2:$B$86)","v":66},null,{"$f":"_xlfn.XLOOKUP($C214,[4]Sheet1!$A$2:$A$66,[4]Sheet1!$D$2:$D$66)*H84","v":24.708935198200727},{"$f":"_xlfn.XLOOKUP($C214,[4]Sheet1!$A$2:$A$66,[4]Sheet1!$D$2:$D$66)*I84","v":24.042431473151531},{"$f":"_xlfn.XLOOKUP($C214,[4]Sheet1!$A$2:$A$66,[4]Sheet1!$D$2:$D$66)*J84","v":21.704838698341298},{"$f":"_xlfn.XLOOKUP($C214,[4]Sheet1!$A$2:$A$66,[4]Sheet1!$D$2:$D$66)*K84","v":21.115610767500701}]
[null,null,"BGO","Coincident","Winter",{"$f":"_xlfn.XLOOKUP(C215,[1]Sheet1!$A$2:$A$86,[1]Sheet1!$B$2:$B$86)","v":66},null,{"$f":"_xlfn.XLOOKUP($C215,[4]Sheet1!$A$2:$A$66,[4]Sheet1!$D$2:$D$66)*H85","v":30.069734613212869},{"$f":"_xlfn.XLOOKUP($C215,[4]Sheet1!$A$2:$A$66,[4]Sheet1!$D$2:$D$66)*I85","v":30.028543195934496},{"$f":"_xlfn.XLOOKUP($C215,[4]Sheet1!$A$2:$A$66,[4]Sheet1!$D$2:$D$66)*J85","v":29.023472614342172},{"$f":"_xlfn.XLOOKUP($C215,[4]Sheet1!$A$2:$A$66,[4]Sheet1!$D$2:$D$66)*K85","v":28.990519480519474}]
[null,null,"BMH","Coincident","Winter",{"$f":"_xlfn.XLOOKUP(C216,[1]Sheet1!$A$2:$A$86,[1]Sheet1!$B$2:$B$86)","v":27},null,{"$f":"_xlfn.XLOOKUP($C216,[4]Sheet1!$A$2:$A$66,[4]Sheet1!$D$2:$D$66)*H86","v":24.168073523070291},{"$f":"_xlfn.XLOOKUP($C216,[4]Sheet1!$A$2:$A$66,[4]Sheet1!$D$2:$D$66)*I86","v":24.09480918499353},{"$f":"_xlfn.XLOOKUP($C216,[4]Sheet1!$A$2:$A$66,[4]Sheet1!$D$2:$D$66)*J86","v":22.959211944803794},{"$f":"_xlfn.XLOOKUP($C216,[4]Sheet1!$A$2:$A$66,[4]Sheet1!$D$2:$D$66)*K86","v":22.904263691246229}]
[null,null,"CDN","Coincident","Winter",{"$f":"_xlfn.XLOOKUP(C217,[1]Sheet1!$A$2:$A$86,[1]Sheet1!$B$2:$B$86)","v":20},null,{"$f":"_xlfn.XLOOKUP($C217,[4]Sheet1!$A$2:$A$66,[4]Sheet1!$D$2:$D$66)*H87","v":14.305117430779619},{"$f":"_xlfn.XLOOKUP($C217,[4]Sheet1!$A$2:$A$66,[4]Sheet1!$D$2:$D$66)*I87","v":14.305117430779619},{"$f":"_xlfn.XLOOKUP($C217,[4]Sheet1!$A$2:$A$66,[4]Sheet1!$D$2:$D$66)*J87","v":12.518869963232534},{"$f":"_xlfn.XLOOKUP($C217,[4]Sheet1!$A$2:$A$66,[4]Sheet1!$D$2:$D$66)*K87","v":12.518869963232534}]
[null,null,"CHA","Coincident","Winter",{"$f":"_xlfn.XLOOKUP(C218,[1]Sheet1!$A$2:$A$86,[1]Sheet1!$B$2:$B$86)","v":27},null,{"$f":"_xlfn.XLOOKUP($C218,[4]Sheet1!$A$2:$A$66,[4]Sheet1!$D$2:$D$66)*H88","v":21.428068356912732},{"$f":"_xlfn.XLOOKUP($C218,[4]Sheet1!$A$2:$A$66,[4]Sheet1!$D$2:$D$66)*I88","v":21.38348228043143},{"$f":"_xlfn.XLOOKUP($C218,[4]Sheet1!$A$2:$A$66,[4]Sheet1!$D$2:$D$66)*J88","v":13.670091049166547},{"$f":"_xlfn.XLOOKUP($C218,[4]Sheet1!$A$2:$A$66,[4]Sheet1!$D$2:$D$66)*K88","v":13.634422187981508}]
[null,null,"CHM","Coincident","Winter",{"$f":"_xlfn.XLOOKUP(C219,[1]Sheet1!$A$2:$A$86,[1]Sheet1!$B$2:$B$86)","v":33},null,{"$f":"_xlfn.XLOOKUP($C219,[4]Sheet1!$A$2:$A$66,[4]Sheet1!$D$2:$D$66)*H89","v":2.1955977988994495},{"$f":"_xlfn.XLOOKUP($C219,[4]Sheet1!$A$2:$A$66,[4]Sheet1!$D$2:$D$66)*I89","v":2.1763381690845418},{"$f":"_xlfn.XLOOKUP($C219,[4]Sheet1!$A$2:$A$66,[4]Sheet1!$D$2:$D$66)*J89","v":1.800775387693847},{"$f":"_xlfn.XLOOKUP($C219,[4]Sheet1!$A$2:$A$66,[4]Sheet1!$D$2:$D$66)*K89","v":1.800775387693847}]
[null,null,"CLC","Coincident","Winter",{"$f":"_xlfn.XLOOKUP(C220,[1]Sheet1!$A$2:$A$86,[1]Sheet1!$B$2:$B$86)","v":79},null,{"$f":"_xlfn.XLOOKUP($C220,[4]Sheet1!$A$2:$A$66,[4]Sheet1!$D$2:$D$66)*H90","v":34.854303770578866},{"$f":"_xlfn.XLOOKUP($C220,[4]Sheet1!$A$2:$A$66,[4]Sheet1!$D$2:$D$66)*I90","v":34.845334572490707},{"$f":"_xlfn.XLOOKUP($C220,[4]Sheet1!$A$2:$A$66,[4]Sheet1!$D$2:$D$66)*J90","v":32.85417259691981},{"$f":"_xlfn.XLOOKUP($C220,[4]Sheet1!$A$2:$A$66,[4]Sheet1!$D$2:$D$66)*K90","v":32.84520339883165}]
[null,null,"CME","Coincident","Winter",{"$f":"_xlfn.XLOOKUP(C221,[1]Sheet1!$A$2:$A$86,[1]Sheet1!$B$2:$B$86)","v":40.5},null,{"$f":"_xlfn.XLOOKUP($C221,[4]Sheet1!$A$2:$A$66,[4]Sheet1!$D$2:$D$66)*H91","v":29.780687679083098},{"$f":"_xlfn.XLOOKUP($C221,[4]Sheet1!$A$2:$A$66,[4]Sheet1!$D$2:$D$66)*I91","v":29.764003820439353},{"$f":"_xlfn.XLOOKUP($C221,[4]Sheet1!$A$2:$A$66,[4]Sheet1!$D$2:$D$66)*J91","v":24.917342884431712},{"$f":"_xlfn.XLOOKUP($C221,[4]Sheet1!$A$2:$A$66,[4]Sheet1!$D$2:$D$66)*K91","v":24.842265520534863}]
[null,null,"CMN","Coincident","Winter",{"$f":"_xlfn.XLOOKUP(C222,[1]Sheet1!$A$2:$A$86,[1]Sheet1!$B$2:$B$86)","v":66},null,{"$f":"_xlfn.XLOOKUP($C222,[4]Sheet1!$A$2:$A$66,[4]Sheet1!$D$2:$D$66)*H92","v":21.140047309978105},{"$f":"_xlfn.XLOOKUP($C222,[4]Sheet1!$A$2:$A$66,[4]Sheet1!$D$2:$D$66)*I92","v":21.125392164529245},{"$f":"_xlfn.XLOOKUP($C222,[4]Sheet1!$A$2:$A$66,[4]Sheet1!$D$2:$D$66)*J92","v":20.246083437597747},{"$f":"_xlfn.XLOOKUP($C222,[4]Sheet1!$A$2:$A$66,[4]Sheet1!$D$2:$D$66)*K92","v":20.238755864873319}]
[null,null,"COB","Coincident","Winter",{"$f":"_xlfn.XLOOKUP(C223,[1]Sheet1!$A$2:$A$86,[1]Sheet1!$B$2:$B$86)","v":26},null,{"$f":"_xlfn.XLOOKUP($C223,[4]Sheet1!$A$2:$A$66,[4]Sheet1!$D$2:$D$66)*H93","v":8.3706607998742832},{"$f":"_xlfn.XLOOKUP($C223,[4]Sheet1!$A$2:$A$66,[4]Sheet1!$D$2:$D$66)*I93","v":8.1722809774495175},{"$f":"_xlfn.XLOOKUP($C223,[4]Sheet1!$A$2:$A$66,[4]Sheet1!$D$2:$D$66)*J93","v":6.7739451559676276},{"$f":"_xlfn.XLOOKUP($C223,[4]Sheet1!$A$2:$A$66,[4]Sheet1!$D$2:$D$66)*K93","v":6.5416956077630237}]
[null,null,"CRO","Coincident","Winter",{"$f":"_xlfn.XLOOKUP(C224,[1]Sheet1!$A$2:$A$86,[1]Sheet1!$B$2:$B$86)","v":60},null,{"$f":"_xlfn.XLOOKUP($C224,[4]Sheet1!$A$2:$A$66,[4]Sheet1!$D$2:$D$66)*H94","v":21.873575927442214},{"$f":"_xlfn.XLOOKUP($C224,[4]Sheet1!$A$2:$A$66,[4]Sheet1!$D$2:$D$66)*I94","v":21.206801977703599},{"$f":"_xlfn.XLOOKUP($C224,[4]Sheet1!$A$2:$A$66,[4]Sheet1!$D$2:$D$66)*J94","v":19.189528248409651},{"$f":"_xlfn.XLOOKUP($C224,[4]Sheet1!$A$2:$A$66,[4]Sheet1!$D$2:$D$66)*K94","v":18.664019965988537}]
[null,null,"CTN","Coincident","Winter",{"$f":"_xlfn.XLOOKUP(C225,[1]Sheet1!$A$2:$A$86,[1]Sheet1!$B$2:$B$86)","v":39.5},null,{"$f":"_xlfn.XLOOKUP($C225,[4]Sheet1!$A$2:$A$66,[4]Sheet1!$D$2:$D$66)*H95","v":12.353267027448686},{"$f":"_xlfn.XLOOKUP($C225,[4]Sheet1!$A$2:$A$66,[4]Sheet1!$D$2:$D$66)*I95","v":11.965303008141973},{"$f":"_xlfn.XLOOKUP($C225,[4]Sheet1!$A$2:$A$66,[4]Sheet1!$D$2:$D$66)*J95","v":10.739829359855689},{"$f":"_xlfn.XLOOKUP($C225,[4]Sheet1!$A$2:$A$66,[4]Sheet1!$D$2:$D$66)*K95","v":10.407288771878504}]
[null,null,"DDL","Coincident","Winter",{"$f":"_xlfn.XLOOKUP(C226,[1]Sheet1!$A$2:$A$86,[1]Sheet1!$B$2:$B$86)","v":66},null,{"$f":"_xlfn.XLOOKUP($C226,[4]Sheet1!$A$2:$A$66,[4]Sheet1!$D$2:$D$66)*H96","v":55.280641954533415},{"$f":"_xlfn.XLOOKUP($C226,[4]Sheet1!$A$2:$A$66,[4]Sheet1!$D$2:$D$66)*I96","v":55.270656289440474},{"$f":"_xlfn.XLOOKUP($C226,[4]Sheet1!$A$2:$A$66,[4]Sheet1!$D$2:$D$66)*J96","v":50.95684896928902},{"$f":"_xlfn.XLOOKUP($C226,[4]Sheet1!$A$2:$A$66,[4]Sheet1!$D$2:$D$66)*K96","v":50.93687763910313}]
[null,null,"DLF","Coincident","Winter",{"$f":"_xlfn.XLOOKUP(C227,[1]Sheet1!$A$2:$A$86,[1]Sheet1!$B$2:$B$86)","v":66},null,{"$f":"_xlfn.XLOOKUP($C227,[4]Sheet1!$A$2:$A$66,[4]Sheet1!$D$2:$D$66)*H97","v":12.897035605851503},{"$f":"_xlfn.XLOOKUP($C227,[4]Sheet1!$A$2:$A$66,[4]Sheet1!$D$2:$D$66)*I97","v":12.851029533535744},{"$f":"_xlfn.XLOOKUP($C227,[4]Sheet1!$A$2:$A$66,[4]Sheet1!$D$2:$D$66)*J97","v":10.175009660502345},{"$f":"_xlfn.XLOOKUP($C227,[4]Sheet1!$A$2:$A$66,[4]Sheet1!$D$2:$D$66)*K97","v":10.167341981783052}]
[null,null,"ECA","Coincident","Winter",{"$f":"_xlfn.XLOOKUP(C228,[1]Sheet1!$A$2:$A$86,[1]Sheet1!$B$2:$B$86)","v":40.5},null,{"$f":"_xlfn.XLOOKUP($C228,[4]Sheet1!$A$2:$A$66,[4]Sheet1!$D$2:$D$66)*H98","v":27.722813872401588},{"$f":"_xlfn.XLOOKUP($C228,[4]Sheet1!$A$2:$A$66,[4]Sheet1!$D$2:$D$66)*I98","v":27.676915173937346},{"$f":"_xlfn.XLOOKUP($C228,[4]Sheet1!$A$2:$A$66,[4]Sheet1!$D$2:$D$66)*J98","v":22.016075696680954},{"$f":"_xlfn.XLOOKUP($C228,[4]Sheet1!$A$2:$A$66,[4]Sheet1!$D$2:$D$66)*K98","v":22.000776130526205}]
[null,null,"EHK","Coincident","Winter",{"$f":"_xlfn.XLOOKUP(C229,[1]Sheet1!$A$2:$A$86,[1]Sheet1!$B$2:$B$86)","v":54},null,{"$f":"_xlfn.XLOOKUP($C229,[4]Sheet1!$A$2:$A$66,[4]Sheet1!$D$2:$D$66)*H99","v":38.323625242369118},{"$f":"_xlfn.XLOOKUP($C229,[4]Sheet1!$A$2:$A$66,[4]Sheet1!$D$2:$D$66)*I99","v":38.210073760169507},{"$f":"_xlfn.XLOOKUP($C229,[4]Sheet1!$A$2:$A$66,[4]Sheet1!$D$2:$D$66)*J99","v":37.009672376916463},{"$f":"_xlfn.XLOOKUP($C229,[4]Sheet1!$A$2:$A$66,[4]Sheet1!$D$2:$D$66)*K99","v":36.91234253503108}]
[null,null,"FNS","Coincident","Winter",{"$f":"_xlfn.XLOOKUP(C230,[1]Sheet1!$A$2:$A$86,[1]Sheet1!$B$2:$B$86)","v":99},null,{"$f":"_xlfn.XLOOKUP($C230,[4]Sheet1!$A$2:$A$66,[4]Sheet1!$D$2:$D$66)*H100","v":31.277827723748491},{"$f":"_xlfn.XLOOKUP($C230,[4]Sheet1!$A$2:$A$66,[4]Sheet1!$D$2:$D$66)*I100","v":31.161524447631422},{"$f":"_xlfn.XLOOKUP($C230,[4]Sheet1!$A$2:$A$66,[4]Sheet1!$D$2:$D$66)*J100","v":29.680596065074173},{"$f":"_xlfn.XLOOKUP($C230,[4]Sheet1!$A$2:$A$66,[4]Sheet1!$D$2:$D$66)*K100","v":29.579799892439382}]
[null,null,"GB","Coincident","Winter",{"$f":"_xlfn.XLOOKUP(C231,[1]Sheet1!$A$2:$A$86,[1]Sheet1!$B$2:$B$86)","v":37.5},null,{"$f":"_xlfn.XLOOKUP($C231,[4]Sheet1!$A$2:$A$66,[4]Sheet1!$D$2:$D$66)*H101","v":9.8225529571808003},{"$f":"_xlfn.XLOOKUP($C231,[4]Sheet1!$A$2:$A$66,[4]Sheet1!$D$2:$D$66)*I101","v":9.1269229772624225},{"$f":"_xlfn.XLOOKUP($C231,[4]Sheet1!$A$2:$A$66,[4]Sheet1!$D$2:$D$66)*J101","v":9.0045436289434484},{"$f":"_xlfn.XLOOKUP($C231,[4]Sheet1!$A$2:$A$66,[4]Sheet1!$D$2:$D$66)*K101","v":8.4055289240137352}]
[null,null,"GCY","Coincident","Winter",{"$f":"_xlfn.XLOOKUP(C232,[1]Sheet1!$A$2:$A$86,[1]Sheet1!$B$2:$B$86)","v":66},null,{"$f":"_xlfn.XLOOKUP($C232,[4]Sheet1!$A$2:$A$66,[4]Sheet1!$D$2:$D$66)*H102","v":28.872800983330819},{"$f":"_xlfn.XLOOKUP($C232,[4]Sheet1!$A$2:$A$66,[4]Sheet1!$D$2:$D$66)*I102","v":28.672684536260324},{"$f":"_xlfn.XLOOKUP($C232,[4]Sheet1!$A$2:$A$66,[4]Sheet1!$D$2:$D$66)*J102","v":27.784167511267334},{"$f":"_xlfn.XLOOKUP($C232,[4]Sheet1!$A$2:$A$66,[4]Sheet1!$D$2:$D$66)*K102","v":27.6080650378453}]
[null,null,"GHP","Coincident","Winter",{"$f":"_xlfn.XLOOKUP(C233,[1]Sheet1!$A$2:$A$86,[1]Sheet1!$B$2:$B$86)","v":66},null,{"$f":"_xlfn.XLOOKUP($C233,[4]Sheet1!$A$2:$A$66,[4]Sheet1!$D$2:$D$66)*H103","v":26.493408643815204},{"$f":"_xlfn.XLOOKUP($C233,[4]Sheet1!$A$2:$A$66,[4]Sheet1!$D$2:$D$66)*I103","v":26.493408643815204},{"$f":"_xlfn.XLOOKUP($C233,[4]Sheet1!$A$2:$A$66,[4]Sheet1!$D$2:$D$66)*J103","v":24.564667064083459},{"$f":"_xlfn.XLOOKUP($C233,[4]Sheet1!$A$2:$A$66,[4]Sheet1!$D$2:$D$66)*K103","v":24.564667064083459}]
[null,null,"GL","Coincident","Winter",{"$f":"_xlfn.XLOOKUP(C234,[1]Sheet1!$A$2:$A$86,[1]Sheet1!$B$2:$B$86)","v":80},null,{"$f":"_xlfn.XLOOKUP($C234,[4]Sheet1!$A$2:$A$66,[4]Sheet1!$D$2:$D$66)*H104","v":32.856021709166093},{"$f":"_xlfn.XLOOKUP($C234,[4]Sheet1!$A$2:$A$66,[4]Sheet1!$D$2:$D$66)*I104","v":32.838285665058585},{"$f":"_xlfn.XLOOKUP($C234,[4]Sheet1!$A$2:$A$66,[4]Sheet1!$D$2:$D$66)*J104","v":31.117889386629919},{"$f":"_xlfn.XLOOKUP($C234,[4]Sheet1!$A$2:$A$66,[4]Sheet1!$D$2:$D$66)*K104","v":31.100153342522404}]
[null,null,"GLE","Coincident","Winter",{"$f":"_xlfn.XLOOKUP(C235,[1]Sheet1!$A$2:$A$86,[1]Sheet1!$B$2:$B$86)","v":79.5},null,{"$f":"_xlfn.XLOOKUP($C235,[4]Sheet1!$A$2:$A$66,[4]Sheet1!$D$2:$D$66)*H105","v":55.480611468695145},{"$f":"_xlfn.XLOOKUP($C235,[4]Sheet1!$A$2:$A$66,[4]Sheet1!$D$2:$D$66)*I105","v":55.415721864638186},{"$f":"_xlfn.XLOOKUP($C235,[4]Sheet1!$A$2:$A$66,[4]Sheet1!$D$2:$D$66)*J105","v":50.484111956309732},{"$f":"_xlfn.XLOOKUP($C235,[4]Sheet1!$A$2:$A$66,[4]Sheet1!$D$2:$D$66)*K105","v":50.456302125999606}]
[null,null,"GSB","Coincident","Winter",{"$f":"_xlfn.XLOOKUP(C236,[1]Sheet1!$A$2:$A$86,[1]Sheet1!$B$2:$B$86)","v":66},null,{"$f":"_xlfn.XLOOKUP($C236,[4]Sheet1!$A$2:$A$66,[4]Sheet1!$D$2:$D$66)*H106","v":25.731864023076639},{"$f":"_xlfn.XLOOKUP($C236,[4]Sheet1!$A$2:$A$66,[4]Sheet1!$D$2:$D$66)*I106","v":25.716019279220067},{"$f":"_xlfn.XLOOKUP($C236,[4]Sheet1!$A$2:$A$66,[4]Sheet1!$D$2:$D$66)*J106","v":24.670266184686163},{"$f":"_xlfn.XLOOKUP($C236,[4]Sheet1!$A$2:$A$66,[4]Sheet1!$D$2:$D$66)*K106","v":24.646499068901303}]
[null,null,"HSM","Coincident","Winter",{"$f":"_xlfn.XLOOKUP(C237,[1]Sheet1!$A$2:$A$86,[1]Sheet1!$B$2:$B$86)","v":40.5},null,{"$f":"_xlfn.XLOOKUP($C237,[4]Sheet1!$A$2:$A$66,[4]Sheet1!$D$2:$D$66)*H107","v":33.176245112820382},{"$f":"_xlfn.XLOOKUP($C237,[4]Sheet1!$A$2:$A$66,[4]Sheet1!$D$2:$D$66)*I107","v":33.130823090486288},{"$f":"_xlfn.XLOOKUP($C237,[4]Sheet1!$A$2:$A$66,[4]Sheet1!$D$2:$D$66)*J107","v":31.450208264124903},{"$f":"_xlfn.XLOOKUP($C237,[4]Sheet1!$A$2:$A$66,[4]Sheet1!$D$2:$D$66)*K107","v":31.422955050724454}]
[null,null,"HTN","Coincident","Winter",{"$f":"_xlfn.XLOOKUP(C238,[1]Sheet1!$A$2:$A$86,[1]Sheet1!$B$2:$B$86)","v":39.5},null,{"$f":"_xlfn.XLOOKUP($C238,[4]Sheet1!$A$2:$A$66,[4]Sheet1!$D$2:$D$66)*H108","v":21.796818935276203},{"$f":"_xlfn.XLOOKUP($C238,[4]Sheet1!$A$2:$A$66,[4]Sheet1!$D$2:$D$66)*I108","v":21.796818935276203},{"$f":"_xlfn.XLOOKUP($C238,[4]Sheet1!$A$2:$A$66,[4]Sheet1!$D$2:$D$66)*J108","v":21.176108862418562},{"$f":"_xlfn.XLOOKUP($C238,[4]Sheet1!$A$2:$A$66,[4]Sheet1!$D$2:$D$66)*K108","v":21.176108862418562}]
[null,null,"KRT","Coincident","Winter",{"$f":"_xlfn.XLOOKUP(C239,[1]Sheet1!$A$2:$A$86,[1]Sheet1!$B$2:$B$86)","v":40.5},null,{"$f":"_xlfn.XLOOKUP($C239,[4]Sheet1!$A$2:$A$66,[4]Sheet1!$D$2:$D$66)*H109","v":23.452363320570011},{"$f":"_xlfn.XLOOKUP($C239,[4]Sheet1!$A$2:$A$66,[4]Sheet1!$D$2:$D$66)*I109","v":23.445089014329135},{"$f":"_xlfn.XLOOKUP($C239,[4]Sheet1!$A$2:$A$66,[4]Sheet1!$D$2:$D$66)*J109","v":20.760870011447519},{"$f":"_xlfn.XLOOKUP($C239,[4]Sheet1!$A$2:$A$66,[4]Sheet1!$D$2:$D$66)*K109","v":20.753595705206649}]
[null,null,"KYM","Coincident","Winter",{"$f":"_xlfn.XLOOKUP(C240,[1]Sheet1!$A$2:$A$86,[1]Sheet1!$B$2:$B$86)","v":40.5},null,{"$f":"_xlfn.XLOOKUP($C240,[4]Sheet1!$A$2:$A$66,[4]Sheet1!$D$2:$D$66)*H110","v":15.779033819890255},{"$f":"_xlfn.XLOOKUP($C240,[4]Sheet1!$A$2:$A$66,[4]Sheet1!$D$2:$D$66)*I110","v":15.75582935839042},{"$f":"_xlfn.XLOOKUP($C240,[4]Sheet1!$A$2:$A$66,[4]Sheet1!$D$2:$D$66)*J110","v":14.858590180396659},{"$f":"_xlfn.XLOOKUP($C240,[4]Sheet1!$A$2:$A$66,[4]Sheet1!$D$2:$D$66)*K110","v":14.843120539396768}]
[null,null,"LV","Coincident","Winter",{"$f":"_xlfn.XLOOKUP(C241,[1]Sheet1!$A$2:$A$86,[1]Sheet1!$B$2:$B$86)","v":99},null,{"$f":"_xlfn.XLOOKUP($C241,[4]Sheet1!$A$2:$A$66,[4]Sheet1!$D$2:$D$66)*H111","v":93.766198547215495},{"$f":"_xlfn.XLOOKUP($C241,[4]Sheet1!$A$2:$A$66,[4]Sheet1!$D$2:$D$66)*I111","v":93.726647266588188},{"$f":"_xlfn.XLOOKUP($C241,[4]Sheet1!$A$2:$A$66,[4]Sheet1!$D$2:$D$66)*J111","v":79.152000355421279},{"$f":"_xlfn.XLOOKUP($C241,[4]Sheet1!$A$2:$A$66,[4]Sheet1!$D$2:$D$66)*K111","v":79.142112535264459}]
[null,null,"LVN","Coincident","Winter",{"$f":"_xlfn.XLOOKUP(C242,[1]Sheet1!$A$2:$A$86,[1]Sheet1!$B$2:$B$86)","v":99},null,{"$f":"_xlfn.XLOOKUP($C242,[4]Sheet1!$A$2:$A$66,[4]Sheet1!$D$2:$D$66)*H112","v":68.620938573817853},{"$f":"_xlfn.XLOOKUP($C242,[4]Sheet1!$A$2:$A$66,[4]Sheet1!$D$2:$D$66)*I112","v":66.967336475596781},{"$f":"_xlfn.XLOOKUP($C242,[4]Sheet1!$A$2:$A$66,[4]Sheet1!$D$2:$D$66)*J112","v":54.150145963205112},{"$f":"_xlfn.XLOOKUP($C242,[4]Sheet1!$A$2:$A$66,[4]Sheet1!$D$2:$D$66)*K112","v":52.936558157214542}]
[null,null,"LVN11","Coincident","Winter",{"$f":"_xlfn.XLOOKUP(C243,[1]Sheet1!$A$2:$A$86,[1]Sheet1!$B$2:$B$86)","v":30},null,{"$f":"_xlfn.XLOOKUP($C243,[4]Sheet1!$A$2:$A$66,[4]Sheet1!$D$2:$D$66)*H113","v":9.1458365488501325},{"$f":"_xlfn.XLOOKUP($C243,[4]Sheet1!$A$2:$A$66,[4]Sheet1!$D$2:$D$66)*I113","v":8.8268714307763556},{"$f":"_xlfn.XLOOKUP($C243,[4]Sheet1!$A$2:$A$66,[4]Sheet1!$D$2:$D$66)*J113","v":9.0807416267942589},{"$f":"_xlfn.XLOOKUP($C243,[4]Sheet1!$A$2:$A$66,[4]Sheet1!$D$2:$D$66)*K113","v":8.7747954931316574}]
[null,null,"MBN","Coincident","Winter",{"$f":"_xlfn.XLOOKUP(C244,[1]Sheet1!$A$2:$A$86,[1]Sheet1!$B$2:$B$86)","v":59},null,{"$f":"_xlfn.XLOOKUP($C244,[4]Sheet1!$A$2:$A$66,[4]Sheet1!$D$2:$D$66)*H114","v":28.773104340261881},{"$f":"_xlfn.XLOOKUP($C244,[4]Sheet1!$A$2:$A$66,[4]Sheet1!$D$2:$D$66)*I114","v":28.630621737936085},{"$f":"_xlfn.XLOOKUP($C244,[4]Sheet1!$A$2:$A$66,[4]Sheet1!$D$2:$D$66)*J114","v":23.333621463235971},{"$f":"_xlfn.XLOOKUP($C244,[4]Sheet1!$A$2:$A$66,[4]Sheet1!$D$2:$D$66)*K114","v":23.300096145041667}]
[null,null,"MDA","Coincident","Winter",{"$f":"_xlfn.XLOOKUP(C245,[1]Sheet1!$A$2:$A$86,[1]Sheet1!$B$2:$B$86)","v":66},null,{"$f":"_xlfn.XLOOKUP($C245,[4]Sheet1!$A$2:$A$66,[4]Sheet1!$D$2:$D$66)*H115","v":33.38215822685585},{"$f":"_xlfn.XLOOKUP($C245,[4]Sheet1!$A$2:$A$66,[4]Sheet1!$D$2:$D$66)*I115","v":33.002729285882261},{"$f":"_xlfn.XLOOKUP($C245,[4]Sheet1!$A$2:$A$66,[4]Sheet1!$D$2:$D$66)*J115","v":31.811322411225213},{"$f":"_xlfn.XLOOKUP($C245,[4]Sheet1!$A$2:$A$66,[4]Sheet1!$D$2:$D$66)*K115","v":31.500190679626872}]
[null,null,"MLN","Coincident","Winter",{"$f":"_xlfn.XLOOKUP(C246,[1]Sheet1!$A$2:$A$86,[1]Sheet1!$B$2:$B$86)","v":99},null,{"$f":"_xlfn.XLOOKUP($C246,[4]Sheet1!$A$2:$A$66,[4]Sheet1!$D$2:$D$66)*H116","v":67.989939757706821},{"$f":"_xlfn.XLOOKUP($C246,[4]Sheet1!$A$2:$A$66,[4]Sheet1!$D$2:$D$66)*I116","v":67.989939757706821},{"$f":"_xlfn.XLOOKUP($C246,[4]Sheet1!$A$2:$A$66,[4]Sheet1!$D$2:$D$66)*J116","v":62.29959617803474},{"$f":"_xlfn.XLOOKUP($C246,[4]Sheet1!$A$2:$A$66,[4]Sheet1!$D$2:$D$66)*K116","v":62.291190943795925}]
[null,null,"MNA","Coincident","Winter",{"$f":"_xlfn.XLOOKUP(C247,[1]Sheet1!$A$2:$A$86,[1]Sheet1!$B$2:$B$86)","v":66},null,{"$f":"_xlfn.XLOOKUP($C247,[4]Sheet1!$A$2:$A$66,[4]Sheet1!$D$2:$D$66)*H117","v":26.365985446737447},{"$f":"_xlfn.XLOOKUP($C247,[4]Sheet1!$A$2:$A$66,[4]Sheet1!$D$2:$D$66)*I117","v":25.977317189550281},{"$f":"_xlfn.XLOOKUP($C247,[4]Sheet1!$A$2:$A$66,[4]Sheet1!$D$2:$D$66)*J117","v":24.66060431826315},{"$f":"_xlfn.XLOOKUP($C247,[4]Sheet1!$A$2:$A$66,[4]Sheet1!$D$2:$D$66)*K117","v":24.359188118811883}]
[null,null,"MRO","Coincident","Winter",{"$f":"_xlfn.XLOOKUP(C248,[1]Sheet1!$A$2:$A$86,[1]Sheet1!$B$2:$B$86)","v":27},null,{"$f":"_xlfn.XLOOKUP($C248,[4]Sheet1!$A$2:$A$66,[4]Sheet1!$D$2:$D$66)*H118","v":18.269074749316317},{"$f":"_xlfn.XLOOKUP($C248,[4]Sheet1!$A$2:$A$66,[4]Sheet1!$D$2:$D$66)*I118","v":18.26007520510483},{"$f":"_xlfn.XLOOKUP($C248,[4]Sheet1!$A$2:$A$66,[4]Sheet1!$D$2:$D$66)*J118","v":16.75715132178669},{"$f":"_xlfn.XLOOKUP($C248,[4]Sheet1!$A$2:$A$66,[4]Sheet1!$D$2:$D$66)*K118","v":16.75715132178669}]
[null,null,"MTC","Coincident","Winter",{"$f":"_xlfn.XLOOKUP(C249,[1]Sheet1!$A$2:$A$86,[1]Sheet1!$B$2:$B$86)","v":66},null,{"$f":"_xlfn.XLOOKUP($C249,[4]Sheet1!$A$2:$A$66,[4]Sheet1!$D$2:$D$66)*H119","v":0},{"$f":"_xlfn.XLOOKUP($C249,[4]Sheet1!$A$2:$A$66,[4]Sheet1!$D$2:$D$66)*I119","v":0},{"$f":"_xlfn.XLOOKUP($C249,[4]Sheet1!$A$2:$A$66,[4]Sheet1!$D$2:$D$66)*J119","v":0},{"$f":"_xlfn.XLOOKUP($C249,[4]Sheet1!$A$2:$A$66,[4]Sheet1!$D$2:$D$66)*K119","v":0}]
[null,null,"NHL","Coincident","Winter",{"$f":"_xlfn.XLOOKUP(C250,[1]Sheet1!$A$2:$A$86,[1]Sheet1!$B$2:$B$86)","v":20},null,{"$f":"_xlfn.XLOOKUP($C250,[4]Sheet1!$A$2:$A$66,[4]Sheet1!$D$2:$D$66)*H120","v":14.554521885521886},{"$f":"_xlfn.XLOOKUP($C250,[4]Sheet1!$A$2:$A$66,[4]Sheet1!$D$2:$D$66)*I120","v":14.554521885521886},{"$f":"_xlfn.XLOOKUP($C250,[4]Sheet1!$A$2:$A$66,[4]Sheet1!$D$2:$D$66)*J120","v":11.595869809203142},{"$f":"_xlfn.XLOOKUP($C250,[4]Sheet1!$A$2:$A$66,[4]Sheet1!$D$2:$D$66)*K120","v":11.587343434343435}]
[null,null,"NKA","Coincident","Winter",{"$f":"_xlfn.XLOOKUP(C251,[1]Sheet1!$A$2:$A$86,[1]Sheet1!$B$2:$B$86)","v":39.5},null,{"$f":"_xlfn.XLOOKUP($C251,[4]Sheet1!$A$2:$A$66,[4]Sheet1!$D$2:$D$66)*H121","v":25.085149526718709},{"$f":"_xlfn.XLOOKUP($C251,[4]Sheet1!$A$2:$A$66,[4]Sheet1!$D$2:$D$66)*I121","v":25.057079609307237},{"$f":"_xlfn.XLOOKUP($C251,[4]Sheet1!$A$2:$A$66,[4]Sheet1!$D$2:$D$66)*J121","v":23.18575178187578},{"$f":"_xlfn.XLOOKUP($C251,[4]Sheet1!$A$2:$A$66,[4]Sheet1!$D$2:$D$66)*K121","v":23.138968586189993}]
[null,null,"OYN","Coincident","Winter",{"$f":"_xlfn.XLOOKUP(C252,[1]Sheet1!$A$2:$A$86,[1]Sheet1!$B$2:$B$86)","v":27},null,{"$f":"_xlfn.XLOOKUP($C252,[4]Sheet1!$A$2:$A$66,[4]Sheet1!$D$2:$D$66)*H122","v":6.0803420148826559},{"$f":"_xlfn.XLOOKUP($C252,[4]Sheet1!$A$2:$A$66,[4]Sheet1!$D$2:$D$66)*I122","v":5.2702232398397246},{"$f":"_xlfn.XLOOKUP($C252,[4]Sheet1!$A$2:$A$66,[4]Sheet1!$D$2:$D$66)*J122","v":5.8043674871207775},{"$f":"_xlfn.XLOOKUP($C252,[4]Sheet1!$A$2:$A$66,[4]Sheet1!$D$2:$D$66)*K122","v":5.0209559244418998}]
[null,null,"PLD","Coincident","Winter",{"$f":"_xlfn.XLOOKUP(C253,[1]Sheet1!$A$2:$A$86,[1]Sheet1!$B$2:$B$86)","v":32},null,{"$f":"_xlfn.XLOOKUP($C253,[4]Sheet1!$A$2:$A$66,[4]Sheet1!$D$2:$D$66)*H123","v":14.651041091160218},{"$f":"_xlfn.XLOOKUP($C253,[4]Sheet1!$A$2:$A$66,[4]Sheet1!$D$2:$D$66)*I123","v":14.642897099447513},{"$f":"_xlfn.XLOOKUP($C253,[4]Sheet1!$A$2:$A$66,[4]Sheet1!$D$2:$D$66)*J123","v":14.121681629834253},{"$f":"_xlfn.XLOOKUP($C253,[4]Sheet1!$A$2:$A$66,[4]Sheet1!$D$2:$D$66)*K123","v":14.113537638121544}]
[null,null,"RVL","Coincident","Winter",{"$f":"_xlfn.XLOOKUP(C254,[1]Sheet1!$A$2:$A$86,[1]Sheet1!$B$2:$B$86)","v":19.5},null,{"$f":"_xlfn.XLOOKUP($C254,[4]Sheet1!$A$2:$A$66,[4]Sheet1!$D$2:$D$66)*H124","v":14.723965693566381},{"$f":"_xlfn.XLOOKUP($C254,[4]Sheet1!$A$2:$A$66,[4]Sheet1!$D$2:$D$66)*I124","v":14.690059036816658},{"$f":"_xlfn.XLOOKUP($C254,[4]Sheet1!$A$2:$A$66,[4]Sheet1!$D$2:$D$66)*J124","v":12.384406377835624},{"$f":"_xlfn.XLOOKUP($C254,[4]Sheet1!$A$2:$A$66,[4]Sheet1!$D$2:$D$66)*K124","v":12.350499721085905}]
[null,null,"SA","Coincident","Winter",{"$f":"_xlfn.XLOOKUP(C255,[1]Sheet1!$A$2:$A$86,[1]Sheet1!$B$2:$B$86)","v":93},null,{"$f":"_xlfn.XLOOKUP($C255,[4]Sheet1!$A$2:$A$66,[4]Sheet1!$D$2:$D$66)*H125","v":65.379032576505438},{"$f":"_xlfn.XLOOKUP($C255,[4]Sheet1!$A$2:$A$66,[4]Sheet1!$D$2:$D$66)*I125","v":65.240595889796282},{"$f":"_xlfn.XLOOKUP($C255,[4]Sheet1!$A$2:$A$66,[4]Sheet1!$D$2:$D$66)*J125","v":62.739506416584412},{"$f":"_xlfn.XLOOKUP($C255,[4]Sheet1!$A$2:$A$66,[4]Sheet1!$D$2:$D$66)*K125","v":62.637986179664374}]
[null,null,"SHL","Coincident","Winter",{"$f":"_xlfn.XLOOKUP(C256,[1]Sheet1!$A$2:$A$86,[1]Sheet1!$B$2:$B$86)","v":40.5},null,{"$f":"_xlfn.XLOOKUP($C256,[4]Sheet1!$A$2:$A$66,[4]Sheet1!$D$2:$D$66)*H126","v":28.540657769578878},{"$f":"_xlfn.XLOOKUP($C256,[4]Sheet1!$A$2:$A$66,[4]Sheet1!$D$2:$D$66)*I126","v":28.512455538581268},{"$f":"_xlfn.XLOOKUP($C256,[4]Sheet1!$A$2:$A$66,[4]Sheet1!$D$2:$D$66)*J126","v":25.786239875479204},{"$f":"_xlfn.XLOOKUP($C256,[4]Sheet1!$A$2:$A$66,[4]Sheet1!$D$2:$D$66)*K126","v":25.701633182486379}]
[null,null,"SHN","Coincident","Winter",{"$f":"_xlfn.XLOOKUP(C257,[1]Sheet1!$A$2:$A$86,[1]Sheet1!$B$2:$B$86)","v":66},null,{"$f":"_xlfn.XLOOKUP($C257,[4]Sheet1!$A$2:$A$66,[4]Sheet1!$D$2:$D$66)*H127","v":28.02332662227041},{"$f":"_xlfn.XLOOKUP($C257,[4]Sheet1!$A$2:$A$66,[4]Sheet1!$D$2:$D$66)*I127","v":28.015250735635746},{"$f":"_xlfn.XLOOKUP($C257,[4]Sheet1!$A$2:$A$66,[4]Sheet1!$D$2:$D$66)*J127","v":26.828095400340718},{"$f":"_xlfn.XLOOKUP($C257,[4]Sheet1!$A$2:$A$66,[4]Sheet1!$D$2:$D$66)*K127","v":26.820019513706061}]
[null,null,"SHP","Coincident","Winter",{"$f":"_xlfn.XLOOKUP(C258,[1]Sheet1!$A$2:$A$86,[1]Sheet1!$B$2:$B$86)","v":66},null,{"$f":"_xlfn.XLOOKUP($C258,[4]Sheet1!$A$2:$A$66,[4]Sheet1!$D$2:$D$66)*H128","v":30.287714126243156},{"$f":"_xlfn.XLOOKUP($C258,[4]Sheet1!$A$2:$A$66,[4]Sheet1!$D$2:$D$66)*I128","v":30.041151816521218},{"$f":"_xlfn.XLOOKUP($C258,[4]Sheet1!$A$2:$A$66,[4]Sheet1!$D$2:$D$66)*J128","v":18.935985386645019},{"$f":"_xlfn.XLOOKUP($C258,[4]Sheet1!$A$2:$A$66,[4]Sheet1!$D$2:$D$66)*K128","v":18.837360462756248}]
[null,null,"SSE","Coincident","Winter",{"$f":"_xlfn.XLOOKUP(C259,[1]Sheet1!$A$2:$A$86,[1]Sheet1!$B$2:$B$86)","v":99},null,{"$f":"_xlfn.XLOOKUP($C259,[4]Sheet1!$A$2:$A$66,[4]Sheet1!$D$2:$D$66)*H129","v":49.966527859409887},{"$f":"_xlfn.XLOOKUP($C259,[4]Sheet1!$A$2:$A$66,[4]Sheet1!$D$2:$D$66)*I129","v":49.272762430939224},{"$f":"_xlfn.XLOOKUP($C259,[4]Sheet1!$A$2:$A$66,[4]Sheet1!$D$2:$D$66)*J129","v":48.309199335841072},{"$f":"_xlfn.XLOOKUP($C259,[4]Sheet1!$A$2:$A$66,[4]Sheet1!$D$2:$D$66)*K129","v":47.669393440695899}]
[null,null,"STL","Coincident","Winter",{"$f":"_xlfn.XLOOKUP(C260,[1]Sheet1!$A$2:$A$86,[1]Sheet1!$B$2:$B$86)","v":27},null,{"$f":"_xlfn.XLOOKUP($C260,[4]Sheet1!$A$2:$A$66,[4]Sheet1!$D$2:$D$66)*H130","v":18.695754206291149},{"$f":"_xlfn.XLOOKUP($C260,[4]Sheet1!$A$2:$A$66,[4]Sheet1!$D$2:$D$66)*I130","v":18.284753474762251},{"$f":"_xlfn.XLOOKUP($C260,[4]Sheet1!$A$2:$A$66,[4]Sheet1!$D$2:$D$66)*J130","v":17.481868324798828},{"$f":"_xlfn.XLOOKUP($C260,[4]Sheet1!$A$2:$A$66,[4]Sheet1!$D$2:$D$66)*K130","v":17.061309436722752}]
[null,null,"STN","Coincident","Winter",{"$f":"_xlfn.XLOOKUP(C261,[1]Sheet1!$A$2:$A$86,[1]Sheet1!$B$2:$B$86)","v":79},null,{"$f":"_xlfn.XLOOKUP($C261,[4]Sheet1!$A$2:$A$66,[4]Sheet1!$D$2:$D$66)*H131","v":35.551632866991888},{"$f":"_xlfn.XLOOKUP($C261,[4]Sheet1!$A$2:$A$66,[4]Sheet1!$D$2:$D$66)*I131","v":34.884549248074826},{"$f":"_xlfn.XLOOKUP($C261,[4]Sheet1!$A$2:$A$66,[4]Sheet1!$D$2:$D$66)*J131","v":33.157979881465948},{"$f":"_xlfn.XLOOKUP($C261,[4]Sheet1!$A$2:$A$66,[4]Sheet1!$D$2:$D$66)*K131","v":32.585072773454826}]
[null,null,"SU","Coincident","Winter",{"$f":"_xlfn.XLOOKUP(C262,[1]Sheet1!$A$2:$A$86,[1]Sheet1!$B$2:$B$86)","v":99},null,{"$f":"_xlfn.XLOOKUP($C262,[4]Sheet1!$A$2:$A$66,[4]Sheet1!$D$2:$D$66)*H132","v":69.373335830042222},{"$f":"_xlfn.XLOOKUP($C262,[4]Sheet1!$A$2:$A$66,[4]Sheet1!$D$2:$D$66)*I132","v":69.11040242407735},{"$f":"_xlfn.XLOOKUP($C262,[4]Sheet1!$A$2:$A$66,[4]Sheet1!$D$2:$D$66)*J132","v":62.208400517499655},{"$f":"_xlfn.XLOOKUP($C262,[4]Sheet1!$A$2:$A$66,[4]Sheet1!$D$2:$D$66)*K132","v":62.027633800898805}]
[null,null,"TNA","Coincident","Winter",{"$f":"_xlfn.XLOOKUP(C263,[1]Sheet1!$A$2:$A$86,[1]Sheet1!$B$2:$B$86)","v":99},null,{"$f":"_xlfn.XLOOKUP($C263,[4]Sheet1!$A$2:$A$66,[4]Sheet1!$D$2:$D$66)*H133","v":108.01122515633091},{"$f":"_xlfn.XLOOKUP($C263,[4]Sheet1!$A$2:$A$66,[4]Sheet1!$D$2:$D$66)*I133","v":107.78236985701199},{"$f":"_xlfn.XLOOKUP($C263,[4]Sheet1!$A$2:$A$66,[4]Sheet1!$D$2:$D$66)*J133","v":93.406866610905325},{"$f":"_xlfn.XLOOKUP($C263,[4]Sheet1!$A$2:$A$66,[4]Sheet1!$D$2:$D$66)*K133","v":93.067821723025446}]
[null,null,"TQY","Coincident","Winter",{"$f":"_xlfn.XLOOKUP(C264,[1]Sheet1!$A$2:$A$86,[1]Sheet1!$B$2:$B$86)","v":66},null,{"$f":"_xlfn.XLOOKUP($C264,[4]Sheet1!$A$2:$A$66,[4]Sheet1!$D$2:$D$66)*H134","v":35.789224234652991},{"$f":"_xlfn.XLOOKUP($C264,[4]Sheet1!$A$2:$A$66,[4]Sheet1!$D$2:$D$66)*I134","v":35.743967249024955},{"$f":"_xlfn.XLOOKUP($C264,[4]Sheet1!$A$2:$A$66,[4]Sheet1!$D$2:$D$66)*J134","v":33.300090025110862},{"$f":"_xlfn.XLOOKUP($C264,[4]Sheet1!$A$2:$A$66,[4]Sheet1!$D$2:$D$66)*K134","v":33.227678848106002}]
[null,null,"TRG","Coincident","Winter",{"$f":"_xlfn.XLOOKUP(C265,[1]Sheet1!$A$2:$A$86,[1]Sheet1!$B$2:$B$86)","v":46.5},null,{"$f":"_xlfn.XLOOKUP($C265,[4]Sheet1!$A$2:$A$66,[4]Sheet1!$D$2:$D$66)*H135","v":14.453500872600349},{"$f":"_xlfn.XLOOKUP($C265,[4]Sheet1!$A$2:$A$66,[4]Sheet1!$D$2:$D$66)*I135","v":14.412439790575915},{"$f":"_xlfn.XLOOKUP($C265,[4]Sheet1!$A$2:$A$66,[4]Sheet1!$D$2:$D$66)*J135","v":13.30379057591623},{"$f":"_xlfn.XLOOKUP($C265,[4]Sheet1!$A$2:$A$66,[4]Sheet1!$D$2:$D$66)*K135","v":13.269573007562535}]
[null,null,"WBE","Coincident","Winter",{"$f":"_xlfn.XLOOKUP(C266,[1]Sheet1!$A$2:$A$86,[1]Sheet1!$B$2:$B$86)","v":99},null,{"$f":"_xlfn.XLOOKUP($C266,[4]Sheet1!$A$2:$A$66,[4]Sheet1!$D$2:$D$66)*H136","v":85.007143133428272},{"$f":"_xlfn.XLOOKUP($C266,[4]Sheet1!$A$2:$A$66,[4]Sheet1!$D$2:$D$66)*I136","v":84.981029941804252},{"$f":"_xlfn.XLOOKUP($C266,[4]Sheet1!$A$2:$A$66,[4]Sheet1!$D$2:$D$66)*J136","v":77.155776851803012},{"$f":"_xlfn.XLOOKUP($C266,[4]Sheet1!$A$2:$A$66,[4]Sheet1!$D$2:$D$66)*K136","v":77.103550468554957}]
[null,null,"WBL","Coincident","Winter",{"$f":"_xlfn.XLOOKUP(C267,[1]Sheet1!$A$2:$A$86,[1]Sheet1!$B$2:$B$86)","v":79.5},null,{"$f":"_xlfn.XLOOKUP($C267,[4]Sheet1!$A$2:$A$66,[4]Sheet1!$D$2:$D$66)*H137","v":47.758692417408732},{"$f":"_xlfn.XLOOKUP($C267,[4]Sheet1!$A$2:$A$66,[4]Sheet1!$D$2:$D$66)*I137","v":47.353881500327667},{"$f":"_xlfn.XLOOKUP($C267,[4]Sheet1!$A$2:$A$66,[4]Sheet1!$D$2:$D$66)*J137","v":42.918953008750627},{"$f":"_xlfn.XLOOKUP($C267,[4]Sheet1!$A$2:$A$66,[4]Sheet1!$D$2:$D$66)*K137","v":42.604100073243124}]
[null,null,"WIN","Coincident","Winter",{"$f":"_xlfn.XLOOKUP(C268,[1]Sheet1!$A$2:$A$86,[1]Sheet1!$B$2:$B$86)","v":20.5},null,{"$f":"_xlfn.XLOOKUP($C268,[4]Sheet1!$A$2:$A$66,[4]Sheet1!$D$2:$D$66)*H138","v":9.565358979633821},{"$f":"_xlfn.XLOOKUP($C268,[4]Sheet1!$A$2:$A$66,[4]Sheet1!$D$2:$D$66)*I138","v":8.9295114174038268},{"$f":"_xlfn.XLOOKUP($C268,[4]Sheet1!$A$2:$A$66,[4]Sheet1!$D$2:$D$66)*J138","v":9.0769543303846945},{"$f":"_xlfn.XLOOKUP($C268,[4]Sheet1!$A$2:$A$66,[4]Sheet1!$D$2:$D$66)*K138","v":8.3858156757868745}]
[null,null,"WMN","Coincident","Winter",{"$f":"_xlfn.XLOOKUP(C269,[1]Sheet1!$A$2:$A$86,[1]Sheet1!$B$2:$B$86)","v":46.5},null,{"$f":"_xlfn.XLOOKUP($C269,[4]Sheet1!$A$2:$A$66,[4]Sheet1!$D$2:$D$66)*H139","v":13.272330845367513},{"$f":"_xlfn.XLOOKUP($C269,[4]Sheet1!$A$2:$A$66,[4]Sheet1!$D$2:$D$66)*I139","v":13.100870111958459},{"$f":"_xlfn.XLOOKUP($C269,[4]Sheet1!$A$2:$A$66,[4]Sheet1!$D$2:$D$66)*J139","v":11.43706595813727},{"$f":"_xlfn.XLOOKUP($C269,[4]Sheet1!$A$2:$A$66,[4]Sheet1!$D$2:$D$66)*K139","v":11.303707609930228}]
[null,null,"WND","Coincident","Winter",{"$f":"_xlfn.XLOOKUP(C270,[1]Sheet1!$A$2:$A$86,[1]Sheet1!$B$2:$B$86)","v":66},null,{"$f":"_xlfn.XLOOKUP($C270,[4]Sheet1!$A$2:$A$66,[4]Sheet1!$D$2:$D$66)*H140","v":16.311061243571761},{"$f":"_xlfn.XLOOKUP($C270,[4]Sheet1!$A$2:$A$66,[4]Sheet1!$D$2:$D$66)*I140","v":16.214617422471559},{"$f":"_xlfn.XLOOKUP($C270,[4]Sheet1!$A$2:$A$66,[4]Sheet1!$D$2:$D$66)*J140","v":15.153735390369331},{"$f":"_xlfn.XLOOKUP($C270,[4]Sheet1!$A$2:$A$66,[4]Sheet1!$D$2:$D$66)*K140","v":15.045236091631603}]
[null,null,"WPD","Coincident","Winter",{"$f":"_xlfn.XLOOKUP(C271,[1]Sheet1!$A$2:$A$86,[1]Sheet1!$B$2:$B$86)","v":79.5},null,{"$f":"_xlfn.XLOOKUP($C271,[4]Sheet1!$A$2:$A$66,[4]Sheet1!$D$2:$D$66)*H141","v":45.380761415391802},{"$f":"_xlfn.XLOOKUP($C271,[4]Sheet1!$A$2:$A$66,[4]Sheet1!$D$2:$D$66)*I141","v":45.362177975008755},{"$f":"_xlfn.XLOOKUP($C271,[4]Sheet1!$A$2:$A$66,[4]Sheet1!$D$2:$D$66)*J141","v":43.178623730001163},{"$f":"_xlfn.XLOOKUP($C271,[4]Sheet1!$A$2:$A$66,[4]Sheet1!$D$2:$D$66)*K141","v":43.160040289618124}]

{"sheet":"AER Sheet Heading","index":3,"n_rows":68,"n_cols":9,"rows_kept":68,"cut":false,"hidden":true,"merged":[]}
[null,{"$f":"INDEX(dms_Worksheet_List,MATCH(dms_Model,dms_Model_List))","v":"REGULATORY REPORTING STATEMENT"}]
[null,{"$f":"INDEX(dms_TradingNameFull_List,MATCH(dms_TradingName,dms_TradingName_List))","v":"Powercor Australia"}]
[null,{"$f":"dms_Header_Span","v":"2022-23 to 2030-31"}]
[null,"XX"]
[]
[]
[]
[]
[]
[]
[null,null,"EXPENDITURE"]
[null,null,{"$f":"CONCATENATE(\"Forecast ($0's, real \",dms_DollarReal,\")\")","v":"Forecast ($0's, real June 2026)"}]
[null,null,{"$f":"dms_y1","v":"2022-23"},{"$f":"dms_y2","v":"2023-24"},{"$f":"dms_y3","v":"2024-25"},{"$f":"dms_y4","v":"2025-26"},{"$f":"dms_y5","v":"2026-27"},{"$f":"dms_y6","v":"2027-28"},{"$f":"dms_y7","v":"2028-29"}]
[]
[]
[]
[]
[]
[]
[]
[]
[]
[]
[]
[]
[]
[]
[]
[]
[]
[]
[]
[]
[]
[]
[null,null,{"$f":"SUM(C15:C35)","v":0},{"$f":"SUM(D15:D35)","v":0},0,0,0,0,0]
[null,null,{"$f":"SUM(C15:C36)","v":0},{"$f":"SUM(D15:D36)","v":0},0,0,0,0,0]
[]
[]
[]
[]
[null,null,"VOLUMES"]
[null,null,"0's"]
[null,null,{"$f":"dms_y1","v":"2022-23"},{"$f":"dms_y2","v":"2023-24"},{"$f":"dms_y3","v":"2024-25"},{"$f":"dms_y4","v":"2025-26"},{"$f":"dms_y5","v":"2026-27"},{"$f":"dms_y6","v":"2027-28"},{"$f":"dms_y7","v":"2028-29"}]
[]
[]
[]
[]
[]
[]
[]
[]
[]
[]
[]
[]
[]
[]
[]
[]
[]
[]
[]
[]
[]
[]
[null,null,{"$f":"SUM(C46:C66)","v":0},{"$f":"SUM(D46:D66)","v":0},{"$f":"SUM(E46:E66)","v":0},{"$f":"SUM(F46:F66)","v":0},{"$f":"SUM(G46:G66)","v":0},{"$f":"SUM(H46:H66)","v":0},{"$f":"SUM(I46:I66)","v":0}]
[null,null,{"$f":"SUM(C46:C67)","v":0},{"$f":"SUM(D46:D67)","v":0},{"$f":"SUM(E46:E67)","v":0},{"$f":"SUM(F46:F67)","v":0},{"$f":"SUM(G46:G67)","v":0},{"$f":"SUM(H46:H67)","v":0},{"$f":"SUM(I46:I67)","v":0}]

{"sheet":"AER CF","index":4,"n_rows":77,"n_cols":25,"rows_kept":77,"cut":false,"hidden":true,"merged":[[3,1,3,22],[39,38,39,59],[40,38,40,59],[41,38,41,59],[39,69,39,90],[40,69,40,90],[41,69,41,90]]}
[null,"AER CONDITIONAL FORMATTING"]
[]
[null,"CELLS FLAGED \"Y\" and greyed out will be greyed out in the worksheets."]
[null,"CONDITIONAL FORMATTING MAP"]
[null,null,null,null,null,"=INDEX(dms_CF_3.6.1, MATCH(dms_TradingName,dms_CF_TradingName))=\"Y\"","=INDEX(dms_CF_3.6.5, MATCH(dms_TradingName,dms_CF_TradingName))=\"Y\"","=INDEX(dms_CF_3.6.6.1, MATCH(dms_TradingName,dms_CF_TradingName))=\"Y\"","=INDEX(dms_CF_3.6.6.2, MATCH(dms_TradingName,dms_CF_TradingName))=\"Y\"","=INDEX(dms_CF_3.6.6.3, MATCH(dms_TradingName,dms_CF_TradingName))=\"Y\"","=INDEX(dms_CF_3.6.7.1, MATCH(dms_TradingName,dms_CF_TradingName))=\"Y\"","=INDEX(dms_CF_3.6.7.2, MATCH(dms_TradingName,dms_CF_TradingName))=\"Y\"","=INDEX(dms_CF_3.6.7.3, MATCH(dms_TradingName,dms_CF_TradingName))=\"Y\"","=INDEX(dms_CF_3.6.7.4, MATCH(dms_TradingName,dms_CF_TradingName))=\"Y\"","=INDEX(dms_CF_3.6.8, MATCH(dms_TradingName,dms_CF_TradingName))=\"Y\"","=INDEX(dms_CF_4.1, MATCH(dms_TradingName,dms_CF_TradingName))=\"Y\"","=INDEX(dms_CF_6.8, MATCH(dms_TradingName,dms_CF_TradingName))=\"Y\"","=INDEX(dms_CF_7.12, MATCH(dms_TradingName,dms_CF_TradingName))=\"Y\"","=INDEX(dms_CF_8.1_A, MATCH(dms_TradingName,dms_CF_TradingName))=\"Y\"","=INDEX(dms_CF_8.1_B, MATCH(dms_TradingName,dms_CF_TradingName))=\"Y\"",{"$f":"INDEX(dms_CF_8.1_Neg, MATCH(dms_TradingName,dms_CF_TradingName))=\"Y\"","v":true},"=INDEX(dms_CF_4.4.1_Neg, MATCH(dms_TradingName,dms_CF_TradingName))=\"Y\"",null,null,"=INDEX(dms_CF_F10, MATCH(dms_TradingName,dms_CF_TradingName))=\"Y\""]
[null,"dms_CF_TradingName","JurisdictionList","Sector","Segment","dms_CF_3.6.1","dms_CF_3.6.5","dms_CF_3.6.6.1","dms_CF_3.6.6.2","dms_CF_3.6.6.3","dms_CF_3.6.7.1","dms_CF_3.6.7.2","dms_CF_3.6.7.3","dms_CF_3.6.7.4","dms_CF_3.6.8","dms_CF_4.1","dms_CF_6.8 (set from dms_MAIFI_flag)","dms_CF_7.12","dms_CF_8.1_A  (and 8.4)","dms_CF_8.1_B  (and 8.4)","dms_CF_8.1_Neg  (and 8.4)","dms_CF_4.4.1","dms_CF_MAIFI_flag (set from dms_MAIFI_flag)","9.5 TUOS (set from Jurisdiction)","dms_CF_F10"]
[null,"Amadeus","NT","Gas","Transmission","-","-","-","-","-","-","-","-","-","-","-","-","-","-","-","-","-","-","-","-"]
[null,"APA GasNet","Vic","Gas","Transmission","-","-","-","-","-","-","-","-","-","-","-","-","-","-","-","-","-","-","-","-"]
[null,"Ausgrid","NSW","Electricity","Distribution",null,"Y","N","N","N","N","N","N","Y","N","N",{"$f":"IFERROR(IF(_xlfn.SINGLE(dms_MAIFI_Flag)=\"Yes\",\"N\",\"Y\"),\"Y\")","v":"N"},"Y","N","Y","Y","N",{"$f":"IFERROR(LEFT(_xlfn.SINGLE(dms_MAIFI_Flag)),\"N\")","v":"Y"},{"$f":"IF('AER CF'!$C7=\"Vic\",\"Y\",\"N\")","v":"N"}]
[null,"Ausgrid (Tx Assets)","NSW","Electricity","Distribution",null,"Y","N","N","N","N","N","N","Y","N","N","N","Y","N","Y","Y","N","Y",{"$f":"IF('AER CF'!$C8=\"Vic\",\"Y\",\"N\")","v":"Y"}]
[null,"AusNet (D)","Vic","Electricity","Distribution",null,"N","N",null,null,"N","N","N","N","N","N","N","N","N","N","Y","N","Y",{"$f":"IF('AER CF'!$C9=\"Vic\",\"Y\",\"N\")","v":"N"}]
[null,"AusNet (T)","Vic","Electricity","Transmission",null,"N",null,null,null,"N","N","N","N","N","Y","N","N","N","N","Y","N","Y",{"$f":"IF('AER CF'!$C10=\"Vic\",\"Y\",\"N\")","v":"N"}]
[null,"Australian Distribution Co.","NSW","Electricity","Distribution","N","N","N","N",null,"N","N","N","N","N","N","N","N","N","N","N","N","Y",{"$f":"IF('AER CF'!$C13=\"Vic\",\"Y\",\"N\")","v":"N"}]
[null,"Australian Distribution Co. (Vic)","Vic","Electricity","Distribution","N","N","N","N",null,"N","N","N","N","N","N","N","N","N","N","N","N","Y",{"$f":"IF('AER CF'!$C14=\"Vic\",\"Y\",\"N\")","v":"Y"}]
[null,"CitiPower","Vic","Electricity","Distribution",null,"N","N",null,null,"N","N","N","N","N","N","N","N","N","N","Y","N","Y",{"$f":"IF('AER CF'!$C15=\"Vic\",\"Y\",\"N\")","v":"Y"}]
[null,"Directlink","Qld","Electricity","Transmission",null,"N",null,null,null,"N","N","N","N","N","-","N","N","N","Y","Y","N","Y",{"$f":"IF('AER CF'!$C16=\"Vic\",\"Y\",\"N\")","v":"N"}]
[null,"ElectraNet","SA","Electricity","Transmission",null,"N",null,null,null,"N","N","N","N","N","-","N","N","N","Y","Y","N","Y",{"$f":"IF('AER CF'!$C17=\"Vic\",\"Y\",\"N\")","v":"N"}]
[null,"Endeavour Energy","NSW","Electricity","Distribution",null,"Y","N","Y","Y","N","N","N","Y","N","N","N","Y","N","Y","Y","Y","Y",{"$f":"IF('AER CF'!$C18=\"Vic\",\"Y\",\"N\")","v":"N"}]
[null,"Energex","Qld","Electricity","Distribution",null,"Y","N",null,null,"N","N","N","N","N","N","N","Y","N","Y","Y","Y","Y",{"$f":"IF('AER CF'!$C19=\"Vic\",\"Y\",\"N\")","v":"N"}]
[null,"Ergon Energy","Qld","Electricity","Distribution",null,"Y","N","Y","Y","N","N","N","N","N","N","N","Y","N","Y","Y","N","Y",{"$f":"IF('AER CF'!$C20=\"Vic\",\"Y\",\"N\")","v":"N"}]
[null,"Essential Energy","NSW","Electricity","Distribution",null,"Y","N","Y","Y","N","N","N","Y","N","N","N","Y","N","Y","Y","N","Y",{"$f":"IF('AER CF'!$C21=\"Vic\",\"Y\",\"N\")","v":"N"}]
[null,"Evoenergy Distribution","ACT","Electricity","Distribution",null,"Y","N","Y","Y","Y","Y","N","Y","N","Y","N","Y","N","Y","Y","N","Y",{"$f":"IF('AER CF'!$C22=\"Vic\",\"Y\",\"N\")","v":"N"}]
[null,"Evoenergy Distribution (Tx Assets)","ACT","Electricity","Distribution",null,"Y","N","Y","Y","Y","Y","N","Y","N","Y","N","Y","N","Y","Y","N","Y",{"$f":"IF('AER CF'!$C23=\"Vic\",\"Y\",\"N\")","v":"N"}]
[null,"Jemena Electricity","Vic","Electricity","Distribution",null,"N","N",null,null,"N","N","N","N","N","N","N","N","N","N","Y","N","Y",{"$f":"IF('AER CF'!$C25=\"Vic\",\"Y\",\"N\")","v":"Y"}]
[null,"JGN","Vic","Gas","Distribution","-","-","-","-","-","-","-","-","-","-","-","-","-","-","-","-","-","-","-","-"]
[null,"Murraylink","SA","Electricity","Transmission",null,"N",null,null,null,"N","N","N","N","N","-",{"$f":"IFERROR(IF(_xlfn.SINGLE(dms_MAIFI_Flag)=\"Yes\",\"N\",\"Y\"),\"Y\")","v":"N"},"N","N","Y","Y","N",{"$f":"IFERROR(LEFT(_xlfn.SINGLE(dms_MAIFI_Flag)),\"N\")","v":"Y"},{"$f":"IF('AER CF'!$C26=\"Vic\",\"Y\",\"N\")","v":"N"}]
[null,"Power and Water","NT","Electricity","Distribution",null,"N","N",null,null,"N","Y","N","N","N","Y",{"$f":"IFERROR(IF(_xlfn.SINGLE(dms_MAIFI_Flag)=\"Yes\",\"N\",\"Y\"),\"Y\")","v":"N"},"Y","Y","Y","Y","N",{"$f":"IFERROR(LEFT(_xlfn.SINGLE(dms_MAIFI_Flag)),\"N\")","v":"Y"},{"$f":"IF('AER CF'!$C27=\"Vic\",\"Y\",\"N\")","v":"N"}]
[null,"Powercor Australia","Vic","Electricity","Distribution",null,"N","N",null,null,"N","N","N","N","N","N",{"$f":"IFERROR(IF(_xlfn.SINGLE(dms_MAIFI_Flag)=\"Yes\",\"N\",\"Y\"),\"Y\")","v":"N"},"N","N","N","Y","N",{"$f":"IFERROR(LEFT(_xlfn.SINGLE(dms_MAIFI_Flag)),\"N\")","v":"Y"},{"$f":"IF('AER CF'!$C28=\"Vic\",\"Y\",\"N\")","v":"Y"}]
[null,"Powerlink","Qld","Electricity","Transmission",null,"N",null,null,null,"N","N","N","N","N","-",{"$f":"IFERROR(IF(_xlfn.SINGLE(dms_MAIFI_Flag)=\"Yes\",\"N\",\"Y\"),\"Y\")","v":"N"},"N","N","Y","Y","N",{"$f":"IFERROR(LEFT(_xlfn.SINGLE(dms_MAIFI_Flag)),\"N\")","v":"Y"},{"$f":"IF('AER CF'!$C29=\"Vic\",\"Y\",\"N\")","v":"N"}]
[null,"Roma to Brisbane Pipeline","Qld","Gas","Transmission","-","-","-","-","-","-","-","-","-","-","-","-","-","-","-","-","-","-","-","-"]
[null,"SA Power Networks","SA","Electricity","Distribution",null,"Y","N",null,null,"N","N","N","N","N","N",{"$f":"IFERROR(IF(_xlfn.SINGLE(dms_MAIFI_Flag)=\"Yes\",\"N\",\"Y\"),\"Y\")","v":"N"},"Y","N","Y","N","N",{"$f":"IFERROR(LEFT(_xlfn.SINGLE(dms_MAIFI_Flag)),\"N\")","v":"Y"},{"$f":"IF('AER CF'!$C31=\"Vic\",\"Y\",\"N\")","v":"N"}]
[null,"TasNetworks (D)","Tas","Electricity","Distribution",null,"Y","N",null,null,"N","N","N","N","N","N",{"$f":"IFERROR(IF(_xlfn.SINGLE(dms_MAIFI_Flag)=\"Yes\",\"N\",\"Y\"),\"Y\")","v":"N"},"Y","N","Y","Y","N",{"$f":"IFERROR(LEFT(_xlfn.SINGLE(dms_MAIFI_Flag)),\"N\")","v":"Y"},{"$f":"IF('AER CF'!$C32=\"Vic\",\"Y\",\"N\")","v":"N"}]
[null,"TasNetworks (T)","Tas","Electricity","Transmission",null,"N",null,null,null,"N","N","N","N","N","-",{"$f":"IFERROR(IF(_xlfn.SINGLE(dms_MAIFI_Flag)=\"Yes\",\"N\",\"Y\"),\"Y\")","v":"N"},"N","N","Y","Y","N",{"$f":"IFERROR(LEFT(_xlfn.SINGLE(dms_MAIFI_Flag)),\"N\")","v":"Y"},{"$f":"IF('AER CF'!$C33=\"Vic\",\"Y\",\"N\")","v":"N"}]
[null,"TransGrid","NSW","Electricity","Transmission",null,"N",null,null,null,"N","N","N","N","N","-",{"$f":"IFERROR(IF(_xlfn.SINGLE(dms_MAIFI_Flag)=\"Yes\",\"N\",\"Y\"),\"Y\")","v":"N"},"N","N","Y","Y","N",{"$f":"IFERROR(LEFT(_xlfn.SINGLE(dms_MAIFI_Flag)),\"N\")","v":"Y"},{"$f":"IF('AER CF'!$C34=\"Vic\",\"Y\",\"N\")","v":"N"}]
[null,"United Energy","Vic","Electricity","Distribution",null,"N","N",null,null,"N","N","N","N","N","N",{"$f":"IFERROR(IF(_xlfn.SINGLE(dms_MAIFI_Flag)=\"Yes\",\"N\",\"Y\"),\"Y\")","v":"N"},"N","N","N","Y","N",{"$f":"IFERROR(LEFT(_xlfn.SINGLE(dms_MAIFI_Flag)),\"N\")","v":"Y"},{"$f":"IF('AER CF'!$C35=\"Vic\",\"Y\",\"N\")","v":"Y"}]
[]
[]
[null,"Confidential"]
[null,"Amended"]
[]
[null,"Worksheet 6.2 STPIS reliability"]
[null,"Formula",null,null,null,"Applied to:"]
[]
[null,"=INDEX(dms_CBD_flag,MATCH(dms_TradingName,dms_TradingName_List))=\"NO\"",null,null,null,"$D$11,$D$17,$D$23,$D$33,$D$39,$D$45,$D$55,$D$61,$D$67,$D$77,$D$83,$D$89"]
[null,"=INDEX(dms_Urban_flag,MATCH(dms_TradingName,dms_TradingName_List))=\"NO\"",null,null,null,"$D$12,$D$18,$D$24,$D$56,$D$62,$D$78,$D$68,$D$84"]
[null,"=INDEX(dms_ShortRural_flag,MATCH(dms_TradingName,dms_TradingName_List))=\"NO\"",null,null,null,"$D$13,$D$19,$D$25,$D$57,$D$63,$D$69,$D$79,$D$85"]
[null,"=INDEX(dms_LongRural_flag,MATCH(dms_TradingName,dms_TradingName_List))=\"NO\"",null,null,null,"$D$14,$D$20,$D$26,$D$58,$D$64,$D$65,$D$70,$D$71,$D$80,$D$86"]
[null,"=INDEX(dms_FeederType_5_flag,MATCH(dms_TradingName,dms_TradingName_List))=\"NO\"",null,null,null,"$D$87,$D$81,$D$71,$D$65,$D$59,$D$49,$D$43,$D$37,$D$21,$D$15"]
[null,"=dms_MAIFI_Flag=\"No\"",null,null,null,"$D$55:$D$72"]
[]
[]
[null,"Business & other details"]
[null,"=(INDEX(dms_Model_Span,MATCH(dms_Model,dms_Model_List))>1)"]
[null,"=(INDEX(dms_Model_Span,MATCH(dms_Model,dms_Model_List))=1)"]
[]
[]
[null,"STYLES IN USE","dms_H2"]
[null,"TOP HEADER","dms_H1"]
[null,"HEADING ONE","dms_1"]
[null,"HEADING TWO","dms_2"]
[null,"HEADING THREE","dms_3"]
[null,"HEADING FOUR","dms_4"]
[null,"HEADING FIVE","dms_5"]
[null,5.1109999999999998,"dms_NUM"]
[null,5.45E-2,"dms_NUM%"]
[null,5.5555000000000003,"dms_NUM3d"]
[null,"Text description","dms_Row_Locked"]
[null,"Text description - not locked","dms_Row1"]
[null,"Text description","dms_Row2"]
[null,"Total","dms_T1"]
[null,"Total","dms_T2"]
[null,"EXPENSES","dms_BH"]
[null,2019,"dms_BY1"]
[null,2019,"dms_BY2"]
[null,"VOLUMES","dms_GH"]
[null,2019,"dms_GY1"]
[null,2019,"dms_GY2"]

{"sheet":"AER NRs","index":5,"n_rows":232,"n_cols":16,"rows_kept":232,"cut":false,"hidden":true,"merged":[[4,1,28,1],[176,1,177,1],[179,1,184,1],[65,1,78,1],[135,1,150,1],[84,1,97,1],[152,1,158,1],[118,1,132,1],[208,1,213,1],[199,1,200,1],[32,1,55,1],[100,1,107,1],[110,1,115,1],[191,1,192,1],[195,1,196,1],[160,1,174,1],[33,67,33,88],[34,67,34,88],[35,67,35,88],[36,10,40,10],[44,10,45,10],[33,10,35,10],[33,36,33,57],[34,36,34,57],[35,36,35,57]]}
[null,"AER NAMED RANGES"]
[]
[null,"DROP DOWN SELECTORS USED IN WORKBOOKS"]
[]
[null,"COVER SHEET","dms_DataQuality_List","dms_Confid_status_List"]
[null,null,"-- select --","-- select --"]
[null,null,"Actual","Public"]
[null,null,"Estimate","Confidential"]
[null,null,"Consolidated"]
[]
[]
[null,null,"For all files either AER or business needs to be able to specify the type of submission","For PTRM & RFM templates we must provide a choice in case they change their form of control - otherwise it is drawn from the business specific lookup table above."]
[null,null,"dms_SourceList","dms_FormControl_Choices"]
[null,null,"-- select --","Revenue cap"]
[null,null,"After appeal","Revenue yield"]
[null,null,"Draft decision","Tariff cap"]
[null,null,"Final decision","Weighted average price cap"]
[null,null,"PTRM update 1"]
[null,null,"PTRM update 2"]
[null,null,"PTRM update 3"]
[null,null,"PTRM update 4"]
[null,null,"PTRM update 5"]
[null,null,"PTRM update 6"]
[null,null,"PTRM update 7"]
[null,null,"Reallocated"]
[null,null,"Recast"]
[null,null,"Regulatory proposal"]
[null,null,"Reporting"]
[null,null,"Revised regulatory proposal"]
[]
[]
[null,null,null,null,null,null,null,null,null,null,"This is used to create an image to insert on 6.3 STPIS sheet - not for dropdown lists.",null,null,"GAS"]
[null,"CA & RESET RINS \nDNSP","dms_DNSP_020301_SubstationType","dms_DNSP_020301_ProjectType","dms_DNSP_020301_ProjectTrigger","dms_DNSP_020302_ProjectType","dms_DNSP_020302_ProjectTrigger","dms_STPIS_Exclusion_List","dms_Reason_Interruption","dms_Reason_Interruption_Detailed","Reason for interruption",null,null,"dms_N0205_AssetType"]
[null,null,"Subtransmission substation","New substation establishment","Demand growth","New line on new route - single circuit","Demand growth","Weather","Animal","Animal impact","Animal","Animal impact",null,"Cast Iron"]
[null,null,"Zone substation","Substation upgrade - capacity"," Voltage issues","New line on new route - dual circuit"," Voltage issues","Equipment failure","Asset failure","Animal nesting/burrowing, etc and other",null,"Animal nesting/burrowing, etc and other",null,"PVC"]
[null,null,"Switching station","Substation upgrade - voltage"," Reactive power issue","New line on new route - other"," Reactive power issue","Operational error","Other","Other",null,"Other",null,"Polyamide"]
[null,null,"Other","Other"," Fault level issues","Line rebuild over existing route - single circuit"," Fault level issues","Vegetation","Overloads","LV","Asset failure","LV",null,"High density polyethylene (80)"]
[null,null,null,null," Safety","Line rebuild over existing route - dual circuit"," Net market benefit","Animals","Planned","Distribution substation",null,"Distribution substation",null,"High density polyethylene (100)"]
[null,null,null,null," Environment","Reconductor - Single circuit"," Safety","Third party impacts","Network business","HV",null,"HV",null,"High density polyethylene (250)"]
[null,null,null,null," Other","Reconductor - Dual circuit"," Environment","Transmission failure","Third party","Zone substation",null,"Zone substation",null,"High density polyethylene (575)"]
[null,null,null,null,null,"Reconductor - Other"," Other","Load shedding","Unknown","Subtransmission",null,"Subtransmission",null,"Medium density polyethylene"]
[null,null,null,null,null,"Line upgrade - raising/retensoring",null,"Inter-distributor connection failure","Vegetation","insert description of 'other'","Other","insert description of 'other'",null,"Unprotected steel"]
[null,null,null,null,null,"Line upgrade - voltage upgrade",null,"Other","Weather","Network error","Overloads",null,null,"Protected steel"]
[null,null,null,null,null,"Line upgrade - capacity",null,null,"2 - STPIS Exclusion (3.3)(a)","Switching and protection error","Planned",null,null,"Other"]
[null,null,null,null,null,"String spare circuit",null,null,"3 - STPIS Exclusion (3.3)(a)","Fire","Network business","Network error"]
[null,null,null,null,null,"Other",null,null,"4 - STPIS Exclusion (3.3)(a)","Other",null,"Switching and protection error"]
[null,null,null,null,null,null,null,null,"5 - STPIS Exclusion (3.3)(a)","Dig-in","Third party","Fire"]
[null,null,null,null,null,null,null,null,"6 - STPIS Exclusion (3.3)(a)","Unauthorised access",null,"Other"]
[null,null,null,null,null,null,null,null,"7 - STPIS Exclusion (3.3)(a)","Vehicle impact",null,"Dig-in"]
[null,null,null,null,null,null,null,null,null,"Unknown",null,"Unauthorised access"]
[null,null,null,null,null,null,null,null,null,"Blow-in/Fall-in - NSP responsibility",null,"Vehicle impact"]
[null,null,null,null,null,null,null,null,null,"Grow-in - NSP responsibility","Unknown","Unknown"]
[null,null,null,null,null,null,null,null,null,"Blow-in/Fall-in - Other responsible party","Vegetation","Blow-in/Fall-in - NSP responsibility"]
[null,null,null,null,null,null,null,null,null,"Grow-in - Other responsible party",null,"Grow-in - NSP responsibility"]
[null,null,null,null,null,null,null,null,null,null,null,"Blow-in/Fall-in - Other responsible party"]
[null,null,null,null,null,null,null,null,null,null,null,"Grow-in - Other responsible party"]
[null,null,null,null,null,null,null,null,null,null,"Weather"]
[null,null,null,null,null,null,null,null,null,null,"2 - STPIS Exclusion (3.3)(a)"]
[null,null,null,null,null,null,null,null,null,null,"3 - STPIS Exclusion (3.3)(a)"]
[null,null,null,null,null,null,null,null,null,null,"4 - STPIS Exclusion (3.3)(a)"]
[null,null,null,null,null,null,null,null,null,null,"5 - STPIS Exclusion (3.3)(a)"]
[null,null,null,null,null,null,null,null,null,null,"6 - STPIS Exclusion (3.3)(a)"]
[null,null,null,null,null,null,null,null,null,null,"7 - STPIS Exclusion (3.3)(a)"]
[]
[]
[null,"CA & RESET RINS \nTNSP ","dms_TNSP_0203_SubstationType","dms_TNSP_020301_ProjectType","dms_TNSP_020301_ProjectTrigger","dms_TNSP_020302_ProjectType","dms_TNSP_0203_ProjectTrigger"]
[null,null,"Terminal station","New substation establishment","Demand growth","New line on new route - single circuit","Demand growth"]
[null,null,"Switching station","Capacity upgrade"," Voltage issues","New line on new route - dual circuit"," Voltage issues"]
[null,null,"Transmission substation","Voltage upgrade"," Reactive power issue","New line on new route - other"," Reactive power issue"]
[null,null,"Other","Other"," Fault level issues","Line rebuild over existing route - single circuit"," Fault level issues"]
[null,null,null,null,"Net market benefit","Line rebuild over existing route - dual circuit"," Net market benefit"]
[null,null,null,null," Safety","Reconductor - Single circuit"," Safety"]
[null,null,null,null," Environment","Reconductor - Dual circuit"," Environment"]
[null,null,null,null," Other","Reconductor - Other"," Other"]
[null,null,null,null,null,"Line upgrade - raising/retensoring"]
[null,null,null,null,null,"Line upgrade - voltage upgrade"]
[null,null,null,null,null,"Line upgrade - capacity"]
[null,null,null,null,null,"String spare circuit"]
[null,null,null,null,null,"Other"]
[]
[]
[]
[null,"NAMED RANGES USED IN ETL PROCESS"]
[null,null,null,null,null,null,null,null,null,null,null,null,"GAS ARR & RESET"]
[null,"CA & RESET RINS \nDNSP ONLY","dms_020303_01_UOM","dms_020501_01_UOM","dms_020501_02_UOM","dms_020501_03_UOM","dms_020501_04_UOM","dms_020701_01_UOM","dms_020701_02_UOM","dms_020701_01_Rows","dms_040102_01_UOM","dms_040102_04_UOM","dms_S140101_UOM","dms_S140201_UOM","dms_E050201_UOM","dms_E050202_UOM"]
[null,null,"Circuit line length in km","0's","0's","0's","0's","km","km","Route line length within zone","0's","days","number","number per km","per metre per connection","metres per connection"]
[null,null,"Circuit line length in km","0's","0's","0's","0's","0's","0's","Number of maintenance spans","0's","0's","number","number","per service per connection","number per connection"]
[null,null,"Circuit line length in km","MVA added","MVA added","MVA added","MVA added","km","km","Total length of maintenance spans","0's","$0s","number","number","number per connection","number per connection"]
[null,null,"Circuit line length in km","0's","0's","0's","0's","km","km","Length of vegetation corridors","$0s","0's","km"]
[null,null,"Number","total spend $0s","total spend $0s","total spend $0s","total spend $0s","0's","0's","Average number of trees per maintenance span"]
[null,null,"Number","net circuit km added","net circuit km added","net circuit km added","net circuit km added","years","years","Average frequency of cutting cycle"]
[null,null,"Number","total spend $0s","total spend $0s","total spend $0s","total spend $0s"]
[null,null,null,"net circuit km added","net circuit km added","net circuit km added","net circuit km added"]
[null,null,null,"total spend $0s","total spend $0s","total spend $0s","total spend $0s"]
[null,null,null,"0's",null,"$0s"]
[null,null,null,"0's"]
[null,null,null,"0's"]
[null,null,null,"$0s"]
[]
[]
[null,"CA & RESET RINS \nTNSP ONLY","dms_020701_01_UOM"]
[null,null,"km"]
[null,null,"0's"]
[null,null,"km"]
[null,null,"0's"]
[null,null,"km"]
[null,null,"metres"]
[null,null,"years"]
[]
[]
[null,"CA & RESET RINS \nDNSP & TNSP","dms_020603_01_UOM"]
[null,null,"0's"]
[null,null,"0's"]
[null,null,"0's"]
[null,null,"0's"]
[null,null,"(per cent)"]
[]
[]
[null,"EB & RESET RINS \nDNSP ONLY","dms_030601_01_UOM","dms_030601_02_UOM","dms_030701_01_UOM","dms_030702_01_UOM","dms_030703_01_UOM"]
[null,null,"minutes/customer","minutes/customer","Customer / km","%","km"]
[null,null,"minutes/customer","minutes/customer","MWh/customer","Number of spans"]
[null,null,"interruptions/customer","interruptions/customer","kVA / customer","Number of spans"]
[null,null,"interruptions/customer","interruptions/customer",null,"Number of spans"]
[null,null,null,null,null,"Number of spans"]
[null,null,null,null,null,"Years"]
[null,null,null,null,null,"Years"]
[null,null,null,null,null,"Trees"]
[null,null,null,null,null,"Trees"]
[null,null,null,null,null,"Defects"]
[null,null,null,null,null,"Defects"]
[null,null,null,null,null,"Spans"]
[null,null,null,null,null,"km"]
[null,null,null,null,null,"Spans"]
[]
[null,null,"WHEN INSERTING COVER SHEET INTO A TNSP FILE - APPLY THESE NAMED RANGES"]
[null,"EB & RESET RINS \nTNSP ONLY","dms_030601_01_UOM",null,"dms_030701_01_UOM","dms_030702_01_UOM"]
[null,null,"%",null,"Number of spans","km"]
[null,null,"number",null,"Years","%"]
[null,null,"number",null,"Trees","km"]
[null,null,"%",null,"Defects","number"]
[null,null,"number",null,"Number of spans"]
[null,null,"number",null,"km"]
[null,null,"%",null,"km"]
[null,null,"number",null,"Number of spans"]
[null,null,"number"]
[null,null,"%"]
[null,null,"number"]
[null,null,"%"]
[null,null,"number"]
[null,null,"%"]
[null,null,"number"]
[]
[null,"EB & RESET RINS \nDNSP & TNSP","dms_EB_RAB_PIT"]
[null,null,"Beginning of year"]
[null,null,"End of year"]
[null,null,"End of year"]
[null,null,"End of year"]
[null,null,"End of year"]
[null,null,"End of year"]
[]
[null,"ARR \nDNSP ONLY","dms_030605_UOM","dms_03060703_UOM","dms_E020202_UOM","Spare"]
[null,null,"number","number","Length of mains replaced"]
[null,null,"number","number","Number of services replaced"]
[null,null,"number","number"]
[null,null,"number","number"]
[null,null,"number","(per cent)"]
[null,null,"number"]
[null,null,"number"]
[null,null,"number"]
[null,null,"number"]
[null,null,"number"]
[null,null,"number"]
[null,null,"number"]
[null,null,"(per cent)"]
[null,null,"(per cent)",""]
[]
[null,"RFM","dms_Beg","dms_Mid","dms_End"]
[null,null,"Beginning of year","Mid year","End of Year"]
[]
[null,"PTRM","dms_PTRM_RAB_PIT","dms_PTRM_TAB_PIT","DMS_Xfactor"]
[null,null,"Beginning of year","Beginning of year","x factors"]
[null,null,"End of year","End of year"]
[null,null,"End of year","End of year"]
[null,null,"End of year","End of year"]
[null,null,"End of year"]
[]
[]
[null,"STPIS & MIC NAMED RANGES "]
[]
[null,"These \"row descriptions\" are the column headings in the various templates but become row descriptions in the ETL process"]
[]
[null,"Table 6.3 sustained interruptions - row descriptions","dms_060301_CustNo_Affected_Row","dms_060301_Avg_Duration_Sustained_Int_Row","dms_060301_Effect_unplanned_SAIDI_Row","dms_060301_Effect_unplanned_SAIFI_Row"]
[null,null,"Number of customers affected by the interruption","Average duration of sustained customer interruption","Effect on unplanned SAIDI","Effect on unplanned SAIFI"]
[]
[]
[null,"Table 6.1 telephone answering - row descriptions and start date","dms_060101_Rows","dms_060102_Rows","dms_060101_StartDateTxt"]
[null,null,"Total number of calls \n(after removing excluded events)","Number of calls answered within 30 seconds \n(after excluding excluded events) ",{"$f":"dms_060701_StartDateTxt","v":{"$error":"#NAME?"}}]
[]
[]
[null,"Table 6.8.1 - row descriptions","dms_060801_01_Rows","dms_060801_02_Rows","dms_060801_03_Rows","dms_060801_04_Rows"]
[null,null,"Number of interruptions","Duration of interruptions","Total unplanned minutes off supply","Effect on unplanned MAIFI"]
[]
[]
[null,"Table 7.9.4 - market impact component - row descriptions","dms_070904_01_Rows","without exclusions","with exclusions"]
[]
[]
[null,"These headings (Lists) are determined from the INDEX/MATCH function on the NSP selected on the Business & other details sheet"]
[]
[null,"Table 6.7.1 - daily performance data - unplanned - MAIFI  -- row descriptions and header named range values","dms_060701_Feeder_Header_Lvl4",{"$f":"INDEX(dms_FeederName_1,MATCH(dms_TradingName,dms_TradingName_List))","v":"CBD"},{"$f":"INDEX(dms_FeederName_1,MATCH(dms_TradingName,dms_TradingName_List))","v":"CBD"},{"$f":"INDEX(dms_FeederName_2,MATCH(dms_TradingName,dms_TradingName_List))","v":"Urban"},{"$f":"INDEX(dms_FeederName_2,MATCH(dms_TradingName,dms_TradingName_List))","v":"Urban"},{"$f":"INDEX(dms_FeederName_3,MATCH(dms_TradingName,dms_TradingName_List))","v":"Short rural"},{"$f":"INDEX(dms_FeederName_3,MATCH(dms_TradingName,dms_TradingName_List))","v":"Short rural"},{"$f":"INDEX(dms_FeederName_4,MATCH(dms_TradingName,dms_TradingName_List))","v":"Long rural"},{"$f":"INDEX(dms_FeederName_4,MATCH(dms_TradingName,dms_TradingName_List))","v":"Long rural"},{"$f":"IF((INDEX(dms_FeederName_5,MATCH(dms_TradingName,dms_TradingName_List))=0),\"Network\",(INDEX(dms_FeederName_5,MATCH(dms_TradingName,dms_TradingName_List))))","v":"Network"},{"$f":"IF((INDEX(dms_FeederName_5,MATCH(dms_TradingName,dms_TradingName_List))=0),\"Network\",(INDEX(dms_FeederName_5,MATCH(dms_TradingName,dms_TradingName_List))))","v":"Network"},"Network","Network"]
[]
[null,null,"dms_060701_Rows","All events","After removing excluded events","All events","After removing excluded events","All events","After removing excluded events","All events","After removing excluded events","All events","After removing excluded events","All events","After removing excluded events"]
[null,null,null,"the number of column headings changes from 10 to 12 depending on the number of feeder categories for the NSP"]
[]
[null,null,"dms_0603_FeederList",{"$f":"INDEX(dms_FeederName_1,MATCH(dms_TradingName,dms_TradingName_List))","v":"CBD"},{"$f":"INDEX(dms_FeederName_2,MATCH(dms_TradingName,dms_TradingName_List))","v":"Urban"},{"$f":"INDEX(dms_FeederName_3,MATCH(dms_TradingName,dms_TradingName_List))","v":"Short rural"},{"$f":"INDEX(dms_FeederName_4,MATCH(dms_TradingName,dms_TradingName_List))","v":"Long rural"}]
[]
[]
[null,"Use these to add to specific worksheets in existing files","Use these to add to specific worksheets in existing files"]
[]
[]
[null,"ARRs 6.7 STPIS daily performance","dms_060101_Values","dms_060102_Values","dms_060701_Values"]
[null,null,"dms_LeapYear"]
[]
[]
[null,"ARR's  6.8 STPIS exclusions","dms_060801_Event_Date","dms_060801_OutageID","dms_060801_FeederID","dms_060801_FeederClass","dms_060801_CauseID","dms_060801_01_Values","dms_060801_02_Values","dms_060801_03_Values","dms_060801_Excl_Cat","dms_060801_04_Values"]
[null,null,"dms_060801_StartCell"]
[]
[]
[null,"CA 6.3 sustained interruptions","dms_060301_Event_Date","dms_060301_Event_Time","dms_060301_AssetID","dms_060301_FeederClass","dms_060301_Reason","dms_060301_DetailedReason","dms_060301_CustNo_Affected_Values","dms_060301_Avg_Duration_Sustained_Int_Values","dms_060301_Effect_unplanned_SAIDI_Values","dms_060301_Effect_unplanned_SAIFI_Values","dms_060301_MED"]
[]
[]
[]
[null,"PTRM input sheet","DMS_50_01_01a","DMS_50_01_01aa","DMS_50_01_01b","DMS_50_01_01bb","DMS_50_01_01c","DMS_50_01_01d","DMS_50_01_01dd"]

{"sheet":"AER lookups","index":6,"n_rows":122,"n_cols":38,"rows_kept":122,"cut":false,"hidden":true,"merged":[[30,61,30,82],[31,61,31,82],[32,61,32,82],[39,1,39,4],[4,25,4,36],[5,25,5,28],[5,30,7,34],[5,35,7,35],[5,36,7,36],[5,37,7,37]]}
[null,"AER LOOKUP TABLES"]
[]
[null,"Template number",5]
[]
[null,null,null,null,null,null,null,null,null,null,null,null,null,null,null,null,null,null,null,null,null,null,null,null,null,"FOR ELECTRICITY BUSINESSES ONLY"]
[null,null,null,null,null,null,null,null,null,null,null,null,null,null,null,null,null,null,null,null,null,null,null,null,null,"Feeder Types",null,null,null,"TasNetworks (D)","Feeder Names"]
[]
[null,null,null,null,null,null,null,null,null,null,null,null,null,null,null,null,null,null,null,null,null,null,null,null,null,"CBD","Urban","Short rural","long rural","EXTRA"]
[null,"dms_TradingName_List","dms_TradingNameFull_List","dms_ABN_List","dms_UID_List","dms_JurisdictionList","dms_Sector_List","dms_Segment_List","dms_FormControl_List","dms_RPT_List","dms_RPTMonth_List","dms_CRCPlength_List","dms_FRCPlength_List","dms_PRCPlength_List","dms_663_List","dms_Addr1_List","dms_Addr2_List","dms_Suburb_List","dms_State_List","dms_PostCode_List","dms_PAddr1_List","dms_PAddr2_List","dms_PSuburb_List","dms_PState_List","dms_PPostCode_List","dms_CBD_flag","dms_Urban_flag","dms_ShortRural_flag","dms_LongRural_flag","dms_FeederType_5_flag","dms_FeederName_1","dms_FeederName_2","dms_FeederName_3","dms_FeederName_4","dms_FeederName_5","dms_MAIFI_flag_List","dms_Public_Lighting_List","Name"]
[null,"AEMO","Australian Energy Market Operator Ltd",94072010327,"ETTVIC100","Vic","Electricity","Transmission","-","Financial","March",5,5,5,"x","Level 22","530 Collins Street","MELBOURNE","Vic",3000,"GPO Box 2008",null,"MELBOURNE","Vic",3001,"NO","NO","NO","NO","NO","CBD","Urban","Short rural","Long rural",null,"YES","NO",{"$f":"B10","v":"AEMO"}]
[null,"Ausgrid","Ausgrid",67505337385,"EDDNSW100","NSW","Electricity","Distribution","Revenue cap","Financial","June",5,5,5,5,"570 George St",null,"SYDNEY","NSW",2000,"GPO Box 4009",null,"SYDNEY","NSW",2001,"YES","YES","YES","YES","NO","CBD","Urban","Short rural","Long rural",null,"NO","YES","Ausgrid"]
[null,"Ausgrid (Tx Assets)","Ausgrid (Tx Assets)",67505337385,"EDTNSW100","NSW","Electricity","Distribution","Revenue cap","Financial","June",5,5,5,5,"570 George St",null,"SYDNEY","NSW",2000,"GPO Box 4009",null,"SYDNEY","NSW",2001,"YES","YES","YES","YES","NO","CBD","Urban","Short rural","Long rural",null,"NO","NO","Ausgrid (Tx Assets)"]
[null,"AusNet (D)","AusNet Electricity Services Pty Ltd",91064651118,"EDDVIC100","Vic","Electricity","Distribution","Revenue cap","Financial","June",5,5,5,2,"Level 32","2 Southbank Boulevard","SOUTHBANK","Vic",3006,"Locked Bag 14051",null,"MELBOURNE CITY MAIL CENTRE","Vic",8001,"NO","YES","YES","YES","NO","CBD","Urban","Short rural","Long rural",null,"YES","YES","AusNet (D)"]
[null,"AusNet (T)","AusNet Transmission Group Pty Ltd",78079798173,"ETTVIC200","Vic","Electricity","Transmission","Revenue cap","Financial","March",5,5,5,2,"Level 32","2 Southbank Boulevard","SOUTHBANK","Vic",3006,"Locked Bag 14051",null,"MELBOURNE CITY MAIL CENTRE","Vic",8001,"NO","NO","NO","NO","NO","CBD","Urban","Short rural","Long rural",null,"YES","NO","AusNet (T)"]
[null,"Australian Distribution Co.","Australian Distribution Co.",11222333444,"UID_Test","NSW","Electricity","Distribution","Revenue cap","Financial","June",5,5,5,2,"123 Straight Street",null,"SYDNEY","NSW",2000,"PO Box 123",null,"SYDNEY","NSW",2000,"YES","YES","YES","YES","NO","CBD","Urban","Short rural","Long rural",null,"NO","YES","Australian Distribution Co."]
[null,"Australian Distribution Co. (Vic)","Australian Distribution Co. (Victoria)",11222333444,"UID_Test","Vic","Electricity","Distribution","Revenue cap","Financial","June",5,5,5,2,"123 Straight Street",null,"MELBOURNE","Vic",3000,"PO Box 123",null,"MELBOURNE","Vic",3000,"NO","NO","NO","NO","NO","CBD","Urban","Short rural","Long rural",null,"YES","YES","Australian Distribution Co. (Vic)"]
[null,"Australian Transmission Co.","Australian Transmission Co.",11222333444,"UID_Test","NSW","Electricity","Transmission","Revenue cap","Financial","June",5,5,5,5,"123 Straight Street",null,"SYDNEY","NSW",2000,"PO Box 123",null,"SYDNEY","NSW",2000,"NO","NO","NO","NO","NO","CBD","Urban","Short rural","Long rural",null,"NO","NO","Australian Transmission Co."]
[null,"Basslink","Basslink Telecoms Pty Ltd"," 52090996231","ETITVC100","Vic","Electricity","Transmission","Revenue cap","Financial","June",10,5,10,"x",null,null,null,null,null,null,null,null,null,null,null,null,null,null,null,null,null,null,null,null,"NO","NO","Basslink"]
[null,"CitiPower","CitiPower",76064651056,"EDDVIC200","Vic","Electricity","Distribution","Revenue cap","Financial","June",5,5,5,2,"40 Market Street",null,"MELBOURNE","Vic",3000,"Locked Bag 14090",null,"MELBOURNE","Vic",8001,"YES","YES","NO","NO","NO","CBD","Urban","Short rural","Long rural",null,"YES","YES","CitiPower"]
[null,"Directlink","Directlink",16779340889,"ETINQL100","Qld","Electricity","Transmission","Revenue cap","Financial","June",5,5,5,5,"Level 25","580 George Street","SYDNEY","NSW",2000,"PO Box R41",null,"ROYAL EXCHANGE","NSW",1225,"NO","NO","NO","NO","NO","CBD","Urban","Short rural","Long rural",null,"NO","NO","Directlink"]
[null,"ElectraNet","ElectraNet",41094482416,"ETTSTH100","SA","Electricity","Transmission","Revenue cap","Financial","June",5,5,5,5,"52-55 East Terrace","Rymill Park","ADELAIDE","SA",5000,"PO Box 7096","Hutt Street Post Office","ADELAIDE","SA",5000,"NO","NO","NO","NO","NO","CBD","Urban","Short rural","Long rural",null,"NO","NO","ElectraNet"]
[null,"Endeavour Energy","Endeavour Energy",11247365823,"EDDNSW200","NSW","Electricity","Distribution","Revenue cap","Financial","June",5,5,5,5,"51 Huntingwood Drive",null,"HUNTINGWOOD","NSW",2148,"PO Box 811",null,"SEVEN HILLS","NSW",1730,"NO","YES","YES","YES","NO","CBD","Urban","Short rural","Long rural",null,"NO","YES","Endeavour Energy"]
[null,"Energex","Energex",40078849055,"EDDQLD100","Qld","Electricity","Distribution","Revenue cap","Financial","June",5,5,5,5,"26 Reddacliff Street",null,"NEWSTEAD","Qld",4006,"26 Reddacliff Street",null,"NEWSTEAD","QLD",4006,"YES","YES","YES","NO","NO","CBD","Urban","Short rural","Long rural",null,"NO","YES","Energex"]
[null,"Ergon Energy","Ergon Energy",50087646062,"EDDQLD200","Qld","Electricity","Distribution","Revenue cap","Financial","June",5,5,5,5,"22 Walker Street",null,"TOWNSVILLE","Qld",4810,"Po Box 264",null,"FORTITUDE VALLEY","QLD",4006,"NO","YES","YES","YES","NO","CBD","Urban","Short rural","Long rural",null,"NO","YES","Ergon Energy"]
[null,"Essential Energy","Essential Energy",37428185226,"EDDNSW300","NSW","Electricity","Distribution","Revenue cap","Financial","June",5,5,5,5,"8 Buller Street",null,"PORT MACQUARIE","NSW",2444,"PO Box 5730",null,"PORT MACQUARIE","NSW",2444,"NO","YES","YES","YES","NO","CBD","Urban","Short rural","Long rural",null,"NO","YES","Essential Energy"]
[null,"Evoenergy Distribution","Evoenergy Distribution",76670568688,"EDDACT100","ACT","Electricity","Distribution","Revenue cap","Financial","June",5,5,5,5,"40 Bunda Street",null,"CANBERRA","ACT",2600,"GPO BOX 366",null,"CANBERRA","ACT",2601,"NO","YES","YES","NO","NO","CBD","Urban","Short rural","Long rural",null,"NO","NO","Evoenergy Distribution"]
[null,"Evoenergy Distribution (Tx Assets)","Evoenergy Distribution (Tx Assets)",76670568688,"EDTACT100","ACT","Electricity","Distribution","Revenue cap","Financial","June",5,5,5,5,"40 Bunda Street",null,"CANBERRA","ACT",2600,"GPO BOX 366",null,"CANBERRA","ACT",2601,"NO","YES","YES","NO","NO","CBD","Urban","Short rural","Long rural",null,"NO","NO","Evoenergy Distribution (Tx Assets)"]
[null,"Jemena Electricity","Jemena Electricity",82064651083,"EDDVIC300","Vic","Electricity","Distribution","Revenue cap","Financial","June",5,5,5,2,"Level 16","567 Collins Street","MELBOURNE","Vic",3000,"PO Box 16182",null,"MELBOURNE","Vic",8001,"NO","YES","YES","NO","NO","CBD","Urban","Short rural","Long rural",null,"YES","YES","Jemena Electricity"]
[null,"Murraylink","Murraylink",79181207909,"ETINSA100","SA","Electricity","Transmission","Revenue cap","Financial","June",5,5,5,5,"Level 19","580 George Street","SYDNEY","NSW",2000,"PO Box R41",null,"ROYAL EXCHANGE","NSW",1225,"NO","NO","NO","NO","NO","CBD","Urban","Short rural","Long rural",null,"NO","NO","Murraylink"]
[null,"Power and Water","Power and Water Corporation",15947352360,"EDDNTY100","NT","Electricity","Distribution","Revenue cap","Financial","June",5,5,5,"x","GPO Box 1921",null,"DARWIN","NT",801,"GPO Box 1921",null,"DARWIN","NT",801,"YES","YES","YES","YES","NO","CBD","Urban","Short rural","Long rural",null,"NO","NO","Power and Water"]
[null,"Powercor Australia","Powercor Australia",89064651109,"EDDVIC400","Vic","Electricity","Distribution","Revenue cap","Financial","June",5,5,5,2,"40 Market Street",null,"MELBOURNE","Vic",3000,"Locked bag 14090",null,"MELBOURNE","Vic",8001,"NO","YES","YES","YES","NO","CBD","Urban","Short rural","Long rural",null,"YES","YES","Powercor Australia"]
[null,"Powerlink","Queensland Electricity Transmission Corporation Limited trading as Powerlink Queensland",82078849233,"ETTQLD100","Qld","Electricity","Transmission","Revenue cap","Financial","June",5,5,5,5,"33 Harold St",null,"VIRGINIA","Qld",4014,"PO Box 1193",null,"VIRGINIA","QLD",4014,"NO","NO","NO","NO","NO","CBD","Urban","Short rural","Long rural",null,"NO","NO","Powerlink"]
[null,"SA Power Networks","SA Power Networks",13332330749,"EDDSTH100","SA","Electricity","Distribution","Revenue cap","Financial","June",5,5,5,5,"1 Anzac Highway",null,"KESWICK","SA",5035,"GPO Box 77",null,"ADELAIDE","SA",5000,"YES","YES","YES","YES","NO","CBD","Urban","Short rural","Long rural",null,"NO","YES","SA Power Networks"]
[null,"TasNetworks (D)","TasNetworks (D)",24167357299,"EDDTAS100","Tas","Electricity","Distribution","Revenue cap","Financial","June",5,5,5,5,"1-7 Maria Street",null,"LENAH VALLEY","Tas",7008,"PO Box 606",null,"MOONAH","Tas",7009,"YES","YES","YES","YES","YES","Critical Infrastructure","Urban","High density commercial","High density rural","Low density rural","NO","YES","TasNetworks (D)"]
[null,"TasNetworks (T)","TasNetworks (T)",24167357299,"ETTTAS100","Tas","Electricity","Transmission","Revenue cap","Financial","June",5,5,5,5,"1-7 Maria Street",null,"LENAH VALLEY","Tas",7008,"PO Box 606",null,"MOONAH","Tas",7009,"NO","NO","NO","NO","NO","CBD","Urban","Short rural","Long rural",null,"NO","NO","TasNetworks (T)"]
[null,"TransGrid","NSW Electricity Networks Operations Pty Ltd trading as TransGrid","70 250 995 390","ETTNSW100","NSW","Electricity","Transmission","Revenue cap","Financial","June",5,5,4,5,"180 Thomas Street",null,"SYDNEY","NSW",2000,"PO Box A1000",null,"SYDNEY SOUTH","NSW",1235,"NO","NO","NO","NO","NO","CBD","Urban","Short rural","Long rural",null,"NO","NO","TransGrid"]
[null,"United Energy","United Energy",70064651029,"EDDVIC500","Vic","Electricity","Distribution","Revenue cap","Financial","June",5,5,5,2,"43-45 Centreway",null,"MOUNT WAVERLEY","Vic",3149,"PO Box 449",null,"MOUNT WAVERLEY","Vic",3170,"NO","YES","YES","NO","NO","CBD","Urban","Short rural","Long rural",null,"YES","YES","United Energy"]
[]
[]
[null,"The Reg Year Ending (dms_RYE) must be set to the last year of the regulatory period. For forecast data is is usually (FRCP_y5) for actual it is a single year (CRY). For historical actual data the RYE will need to be set manually in the business details sheet by setting the dms_Multiyear_flag to 1 and putting the correct value in 'dms_Specified_FinalYear. See cells C67:C68"]
[null,"dms_Model_List ","dms_Model_Name_Format1","dms_Worksheet_List","dms_Model_Span_List"]
[null,"ARR","Annual Reporting",{"$f":"IF(dms_MultiYear_ResponseFlag=\"yes\",\"NEW HISTORICAL ANNUAL REPORTING\",\"ANNUAL REPORTING\")","v":"ANNUAL REPORTING"},1]
[null,"CA","Category Analysis",{"$f":"IF(dms_MultiYear_ResponseFlag=\"yes\",\"NEW HISTORICAL CATEGORY ANALYSIS\",\"CATEGORY ANALYSIS\")","v":"CATEGORY ANALYSIS"},1]
[null,"CESS","Capitlal Expenditure","CAPITLAL EXPENDITURE SHARING SCHEMING",5]
[null,"CPI","CPI","CPI",5]
[null,"EB","Economic Benchmarking",{"$f":"IF(dms_MultiYear_ResponseFlag=\"yes\",\"NEW HISTORICAL ECONOMIC BENCHMARKING\",\"ECONOMIC BENCHMARKING\")","v":"ECONOMIC BENCHMARKING"},1]
[null,"EBSS","Efficiency Benefit Sharing Scheme","EFFICIENCY BENEFIT SHARING SCHEME",5]
[null,"Pricing","Pricing Proposal","PRICING PROPOSAL",5]
[null,"Profitability","Profitability","PROFITABILITY",5]
[null,"PTRM","Post Tax Revenue Model","POST TAX REVENUE MODEL",5]
[null,"Reset","Regulatory Reporting (Reset)","REGULATORY REPORTING STATEMENT",5]
[null,"Reset_outputs","Reset Outputs","AER RESET DECISION OUTPUTS",5]
[null,"RFM","Roll Forward Model","ROLL FORWARD MODEL",5]
[null,"WACC","Weighted Average Cost of Capital","WEIGHTED AVERAGE COST OF CAPITAL",1]
[]
[]
[]
[null,"Financial","Calendar",null,"PREVIOUS",null,"CURRENT",null,"FORTHCOMING"]
[null,"1987-88","1988","PRCP_y1",{"$f":"INDEX(INDIRECT(dms_RPT),dms_PRCP_start_row)","v":"2016-17"},"CRCP_y1",{"$f":"INDEX(INDIRECT(dms_RPT),dms_CRCP_start_row)","v":"2021-22"},{"$f":"FRCP_y1","v":"2026-27"},{"$f":"INDEX(INDIRECT(dms_RPT),dms_FRCP_start_row)","v":"2026-27"}]
[null,"1988-89","1989","PRCP_y2",{"$f":"INDEX(INDIRECT(dms_RPT),dms_PRCP_start_row+1)","v":"2017-18"},"CRCP_y2",{"$f":"INDEX(INDIRECT(dms_RPT),dms_CRCP_start_row+1)","v":"2022-23"},"FRCP_y2",{"$f":"INDEX(INDIRECT(dms_RPT),dms_FRCP_start_row+1)","v":"2027-28"}]
[null,"1989-90","1990","PRCP_y3",{"$f":"INDEX(INDIRECT(dms_RPT),dms_PRCP_start_row+2)","v":"2018-19"},"CRCP_y3",{"$f":"INDEX(INDIRECT(dms_RPT),dms_CRCP_start_row+2)","v":"2023-24"},"FRCP_y3",{"$f":"INDEX(INDIRECT(dms_RPT),dms_FRCP_start_row+2)","v":"2028-29"}]
[null,"1990-91","1991","PRCP_y4",{"$f":"INDEX(INDIRECT(dms_RPT),dms_PRCP_start_row+3)","v":"2019-20"},"CRCP_y4",{"$f":"INDEX(INDIRECT(dms_RPT),dms_CRCP_start_row+3)","v":"2024-25"},"FRCP_y4",{"$f":"INDEX(INDIRECT(dms_RPT),dms_FRCP_start_row+3)","v":"2029-30"}]
[null,"1991-92","1992","PRCP_y5",{"$f":"INDEX(INDIRECT(dms_RPT),dms_PRCP_start_row+4)","v":"2020-21"},"CRCP_y5",{"$f":"INDEX(INDIRECT(dms_RPT),dms_CRCP_start_row+4)","v":"2025-26"},"FRCP_y5",{"$f":"INDEX(INDIRECT(dms_RPT),dms_FRCP_start_row+4)","v":"2030-31"}]
[null,"1992-93","1993","PRCP_y6",{"$f":"INDEX(INDIRECT(dms_RPT),dms_PRCP_start_row+5)","v":"2021-22"},"CRCP_y6",{"$f":"INDEX(INDIRECT(dms_RPT),dms_CRCP_start_row+5)","v":"2026-27"},"FRCP_y6",{"$f":"INDEX(INDIRECT(dms_RPT),dms_FRCP_start_row+5)","v":"2031-32"}]
[null,"1993-94","1994","PRCP_y7",{"$f":"INDEX(INDIRECT(dms_RPT),dms_PRCP_start_row+6)","v":"2022-23"},"CRCP_y7",{"$f":"INDEX(INDIRECT(dms_RPT),dms_CRCP_start_row+6)","v":"2027-28"},"FRCP_y7",{"$f":"INDEX(INDIRECT(dms_RPT),dms_FRCP_start_row+6)","v":"2032-33"}]
[null,"1994-95","1995","PRCP_y8",{"$f":"INDEX(INDIRECT(dms_RPT),dms_PRCP_start_row+7)","v":"2023-24"},"CRCP_y8",{"$f":"INDEX(INDIRECT(dms_RPT),dms_CRCP_start_row+7)","v":"2028-29"},"FRCP_y8",{"$f":"INDEX(INDIRECT(dms_RPT),dms_FRCP_start_row+7)","v":"2033-34"}]
[null,"1995-96","1996","PRCP_y9",{"$f":"INDEX(INDIRECT(dms_RPT),dms_PRCP_start_row+8)","v":"2024-25"},"CRCP_y9",{"$f":"INDEX(INDIRECT(dms_RPT),dms_CRCP_start_row+8)","v":"2029-30"},"FRCP_y9",{"$f":"INDEX(INDIRECT(dms_RPT),dms_FRCP_start_row+8)","v":"2034-35"}]
[null,"1996-97","1997","PRCP_y10",{"$f":"INDEX(INDIRECT(dms_RPT),dms_PRCP_start_row+9)","v":"2025-26"},"CRCP_y10",{"$f":"INDEX(INDIRECT(dms_RPT),dms_CRCP_start_row+9)","v":"2030-31"},"FRCP_y10",{"$f":"INDEX(INDIRECT(dms_RPT),dms_FRCP_start_row+9)","v":"2035-36"}]
[null,"1997-98","1998","PRCP_y11",{"$f":"INDEX(INDIRECT(dms_RPT),dms_PRCP_start_row+10)","v":"2026-27"},"CRCP_y11",{"$f":"INDEX(INDIRECT(dms_RPT),dms_CRCP_start_row+10)","v":"2031-32"},"FRCP_y11",{"$f":"INDEX(INDIRECT(dms_RPT),dms_FRCP_start_row+10)","v":"2036-37"}]
[null,"1998-99","1999","PRCP_y12",{"$f":"INDEX(INDIRECT(dms_RPT),dms_PRCP_start_row+11)","v":"2027-28"},"CRCP_y12",{"$f":"INDEX(INDIRECT(dms_RPT),dms_CRCP_start_row+11)","v":"2032-33"},"FRCP_y12",{"$f":"INDEX(INDIRECT(dms_RPT),dms_FRCP_start_row+11)","v":"2037-38"}]
[null,"1999-00","2000","PRCP_y13",{"$f":"INDEX(INDIRECT(dms_RPT),dms_PRCP_start_row+12)","v":"2028-29"},"CRCP_y13",{"$f":"INDEX(INDIRECT(dms_RPT),dms_CRCP_start_row+12)","v":"2033-34"},"FRCP_y13",{"$f":"INDEX(INDIRECT(dms_RPT),dms_FRCP_start_row+12)","v":"2038-39"}]
[null,"2000-01","2001","PRCP_y14",{"$f":"INDEX(INDIRECT(dms_RPT),dms_PRCP_start_row+13)","v":"2029-30"},"CRCP_y14",{"$f":"INDEX(INDIRECT(dms_RPT),dms_CRCP_start_row+13)","v":"2034-35"},"FRCP_y14",{"$f":"INDEX(INDIRECT(dms_RPT),dms_FRCP_start_row+13)","v":"2039-40"}]
[null,"2001-02","2002","PRCP_y15",{"$f":"INDEX(INDIRECT(dms_RPT),dms_PRCP_start_row+14)","v":"2030-31"},"CRCP_y15",{"$f":"INDEX(INDIRECT(dms_RPT),dms_CRCP_start_row+14)","v":"2035-36"},"FRCP_y15",{"$f":"INDEX(INDIRECT(dms_RPT),dms_FRCP_start_row+14)","v":"2040-41"}]
[null,"2002-03","2003","PRCP_y16",{"$f":"INDEX(INDIRECT(dms_RPT),dms_PRCP_start_row+15)","v":"2031-32"},"CRCP_y16",{"$f":"INDEX(INDIRECT(dms_RPT),dms_CRCP_start_row+15)","v":"2036-37"},"FRCP_y16",{"$f":"INDEX(INDIRECT(dms_RPT),dms_FRCP_start_row+15)","v":"2041-42"}]
[null,"2003-04","2004","PRCP_y17",{"$f":"INDEX(INDIRECT(dms_RPT),dms_PRCP_start_row+16)","v":"2032-33"},"CRCP_y17",{"$f":"INDEX(INDIRECT(dms_RPT),dms_CRCP_start_row+16)","v":"2037-38"},"FRCP_y17",{"$f":"INDEX(INDIRECT(dms_RPT),dms_FRCP_start_row+16)","v":"2042-43"}]
[null,"2004-05","2005","PRCP_y18",{"$f":"INDEX(INDIRECT(dms_RPT),dms_PRCP_start_row+17)","v":"2033-34"},"CRCP_y18",{"$f":"INDEX(INDIRECT(dms_RPT),dms_CRCP_start_row+17)","v":"2038-39"},"FRCP_y18",{"$f":"INDEX(INDIRECT(dms_RPT),dms_FRCP_start_row+17)","v":"2043-44"}]
[null,"2005-06","2006","PRCP_y19",{"$f":"INDEX(INDIRECT(dms_RPT),dms_PRCP_start_row+18)","v":"2034-35"},"CRCP_y19",{"$f":"INDEX(INDIRECT(dms_RPT),dms_CRCP_start_row+18)","v":"2039-40"},"FRCP_y19",{"$f":"INDEX(INDIRECT(dms_RPT),dms_FRCP_start_row+18)","v":"2044-45"}]
[null,"2006-07","2007","PRCP_y20",{"$f":"INDEX(INDIRECT(dms_RPT),dms_PRCP_start_row+19)","v":"2035-36"},"CRCP_y20",{"$f":"INDEX(INDIRECT(dms_RPT),dms_CRCP_start_row+19)","v":"2040-41"},"FRCP_y20",{"$f":"INDEX(INDIRECT(dms_RPT),dms_FRCP_start_row+19)","v":"2045-46"}]
[null,"2007-08","2008","PRCP_y21",{"$f":"INDEX(INDIRECT(dms_RPT),dms_PRCP_start_row+20)","v":"2036-37"},"CRCP_y21",{"$f":"INDEX(INDIRECT(dms_RPT),dms_CRCP_start_row+20)","v":"2041-42"},"FRCP_y21",{"$f":"INDEX(INDIRECT(dms_RPT),dms_FRCP_start_row+20)","v":"2046-47"}]
[null,"2008-09","2009","PRCP_y22",{"$f":"INDEX(INDIRECT(dms_RPT),dms_PRCP_start_row+21)","v":"2037-38"},"CRCP_y22",{"$f":"INDEX(INDIRECT(dms_RPT),dms_CRCP_start_row+21)","v":"2042-43"},"FRCP_y22",{"$f":"INDEX(INDIRECT(dms_RPT),dms_FRCP_start_row+21)","v":"2047-48"}]
[null,"2009-10",2010,"PRCP_y23",{"$f":"INDEX(INDIRECT(dms_RPT),dms_PRCP_start_row+22)","v":"2038-39"},"CRCP_y23",{"$f":"INDEX(INDIRECT(dms_RPT),dms_CRCP_start_row+22)","v":"2043-44"},"FRCP_y23",{"$f":"INDEX(INDIRECT(dms_RPT),dms_FRCP_start_row+22)","v":"2048-49"}]
[null,"2010-11",2011,"PRCP_y24",{"$f":"INDEX(INDIRECT(dms_RPT),dms_PRCP_start_row+23)","v":"2039-40"},"CRCP_y24",{"$f":"INDEX(INDIRECT(dms_RPT),dms_CRCP_start_row+23)","v":"2044-45"},"FRCP_y24",{"$f":"INDEX(INDIRECT(dms_RPT),dms_FRCP_start_row+23)","v":"2049-50"}]
[null,"2011-12",2012,"PRCP_y25",{"$f":"INDEX(INDIRECT(dms_RPT),dms_PRCP_start_row+24)","v":"2040-41"},"CRCP_y25",{"$f":"INDEX(INDIRECT(dms_RPT),dms_CRCP_start_row+24)","v":"2045-46"},"FRCP_y25",{"$f":"INDEX(INDIRECT(dms_RPT),dms_FRCP_start_row+24)","v":"2050-51"}]
[null,"2012-13",2013]
[null,"2013-14",2014]
[null,"2014-15",2015]
[null,"2015-16",2016]
[null,"2016-17",2017]
[null,"2017-18",2018]
[null,"2018-19",2019]
[null,"2019-20",2020]
[null,"2020-21",2021]
[null,"2021-22",2022,null,"CRY - FRY"]
[null,"2022-23",2023,"dms_y1",{"$f":"IFERROR(INDEX(INDIRECT(dms_RPT),dms_CRY_start_row),0)","v":"2022-23"}]
[null,"2023-24",2024,"dms_y2",{"$f":"IFERROR(INDEX(INDIRECT(dms_RPT),dms_CRY_start_row+1),0)","v":"2023-24"}]
[null,"2024-25",2025,"dms_y3",{"$f":"IFERROR(INDEX(INDIRECT(dms_RPT),dms_CRY_start_row+2),0)","v":"2024-25"}]
[null,"2025-26",2026,"dms_y4",{"$f":"IFERROR(INDEX(INDIRECT(dms_RPT),dms_CRY_start_row+3),0)","v":"2025-26"}]
[null,"2026-27",2027,"dms_y5",{"$f":"IFERROR(INDEX(INDIRECT(dms_RPT),dms_CRY_start_row+4),0)","v":"2026-27"}]
[null,"2027-28",2028,"dms_y6",{"$f":"IFERROR(INDEX(INDIRECT(dms_RPT),dms_CRY_start_row+5),0)","v":"2027-28"}]
[null,"2028-29",2029,"dms_y7",{"$f":"IFERROR(INDEX(INDIRECT(dms_RPT),dms_CRY_start_row+6),0)","v":"2028-29"}]
[null,"2029-30",2030,"dms_y8",{"$f":"IFERROR(INDEX(INDIRECT(dms_RPT),dms_CRY_start_row+7),0)","v":"2029-30"}]
[null,"2030-31",2031,"dms_y9",{"$f":"IFERROR(INDEX(INDIRECT(dms_RPT),dms_CRY_start_row+8),0)","v":"2030-31"}]
[null,"2031-32",2032,"dms_y10",{"$f":"IFERROR(INDEX(INDIRECT(dms_RPT),dms_CRY_start_row+9),0)","v":"2031-32"}]
[null,"2032-33",2033,"dms_y11",{"$f":"IFERROR(INDEX(INDIRECT(dms_RPT),dms_CRY_start_row+10),0)","v":"2032-33"}]
[null,"2033-34",2034,"dms_y12",{"$f":"IFERROR(INDEX(INDIRECT(dms_RPT),dms_CRY_start_row+11),0)","v":"2033-34"}]
[null,"2034-35",2035,"dms_y13",{"$f":"IFERROR(INDEX(INDIRECT(dms_RPT),dms_CRY_start_row+12),0)","v":"2034-35"}]
[null,"2035-36",2036,"dms_y14",{"$f":"IFERROR(INDEX(INDIRECT(dms_RPT),dms_CRY_start_row+13),0)","v":"2035-36"}]
[null,"2036-37",2037,"dms_y15",{"$f":"IFERROR(INDEX(INDIRECT(dms_RPT),dms_CRY_start_row+14),0)","v":"2036-37"}]
[null,"2037-38",2038,"dms_y16",{"$f":"IFERROR(INDEX(INDIRECT(dms_RPT),dms_CRY_start_row+15),0)","v":"2037-38"}]
[null,"2038-39",2039,"dms_y17",{"$f":"IFERROR(INDEX(INDIRECT(dms_RPT),dms_CRY_start_row+16),0)","v":"2038-39"}]
[null,"2039-40",2040,"dms_y18",{"$f":"IFERROR(INDEX(INDIRECT(dms_RPT),dms_CRY_start_row+17),0)","v":"2039-40"}]
[null,"2040-41",2041,"dms_y19",{"$f":"IFERROR(INDEX(INDIRECT(dms_RPT),dms_CRY_start_row+18),0)","v":"2040-41"}]
[null,"2041-42",2042,"dms_y20",{"$f":"IFERROR(INDEX(INDIRECT(dms_RPT),dms_CRY_start_row+19),0)","v":"2041-42"}]
[null,"2042-43",2043,"dms_y21",{"$f":"IFERROR(INDEX(INDIRECT(dms_RPT),dms_CRY_start_row+20),0)","v":"2042-43"}]
[null,"2043-44",2044,"dms_y22",{"$f":"IFERROR(INDEX(INDIRECT(dms_RPT),dms_CRY_start_row+21),0)","v":"2043-44"}]
[null,"2044-45",2045,"dms_y23",{"$f":"IFERROR(INDEX(INDIRECT(dms_RPT),dms_CRY_start_row+22),0)","v":"2044-45"}]
[null,"2045-46",2046,"dms_y24",{"$f":"IFERROR(INDEX(INDIRECT(dms_RPT),dms_CRY_start_row+23),0)","v":"2045-46"}]
[null,"2046-47",2047,"dms_y25",{"$f":"IFERROR(INDEX(INDIRECT(dms_RPT),dms_CRY_start_row+24),0)","v":"2046-47"}]
[null,"2047-48",2048,"dms_y26",{"$f":"IFERROR(INDEX(INDIRECT(dms_RPT),dms_CRY_start_row+25),0)","v":"2047-48"}]
[null,"2048-49","2049"]
[null,"2049-50","2050"]
[null,"2050-51","2051"]

{"sheet":"AER ETL","index":7,"n_rows":146,"n_cols":10,"rows_kept":146,"cut":false,"hidden":true,"merged":[[13,4,13,8],[72,1,74,1],[12,0,16,0],[19,0,26,0],[27,0,32,0],[35,0,60,0],[15,2,15,4],[33,37,33,58],[34,37,34,58],[35,37,35,58],[33,68,33,89],[34,68,34,89],[35,68,35,89]]}
[null,"AER ETL INFORMATION"]
[]
[null,"USES NAMED RANGES FLAG","yes","dms_Defined_Names_Used"]
[]
[null,"IF THIS IS AN ABC RIN - make sure the the named range CRY is applied and the named range dms_dollar_nom_UOM is applied"]
[null,"IF THIS IS A RESET RIN - make sure the named ranges CRY and dms_dollar_nom_UOM are NOT present in the workbook"]
[null,"FOR ABC RINS THAT SPAN MULTIPLE YEARS - make sure MultiYear Flag is set and final year entered as required"]
[]
[null,"Full trading name",{"$f":"INDEX(dms_TradingNameFull_List,MATCH(dms_TradingName,dms_TradingName_List))","v":"Powercor Australia"},null,"dms_TradingNameFull"]
[null,"Trading name",{"$f":"dms_TradingName","v":"Powercor Australia"}]
[null,"Unique ID",{"$f":"INDEX(dms_UID_List,MATCH(dms_TradingName,dms_TradingName_List))","v":"EDDVIC400"}]
["Selected here","Model / RIN","Reset","dms_Model"]
["Read from Business & other details","Source","Regulatory proposal","dms_Source",{"$f":"IF(dms_Model=\"Reset\", \"Make sure you have set Reg Proposal as source\",\"\")","v":"Make sure you have set Reg Proposal as source"}]
[null,"Data quality","Consolidated","For DB purposes this is always Consoldiated"]
[null,"Data status","Public","For DB purposes this is always Public"]
[null,"Amendment reason",{"$f":"dms_Amendment_Text","v":"."},null,null,"dms_AmendmentReason"]
[null,"Submission date",{"$f":"dms_Typed_Submission_Date","v":"31/01/25"},"dms_SubmissionDate"]
[]
["Redundant","EBSS - First application of scheme in forthcoming period?","No"]
["Pre-populated from lookup table","Data ingestion data quality","Consolidated","dms_DataQuality","Always Consolidated"]
[null,"Sector",{"$f":"INDEX(dms_Sector_List,MATCH(dms_TradingName,dms_TradingName_List))","v":"Electricity"},"dms_Sector","=INDEX(dms_Sector_List,MATCH(dms_TradingName,dms_TradingName_List))"]
[null,"Segment",{"$f":"INDEX(dms_Segment_List,MATCH(dms_TradingName,dms_TradingName_List))","v":"Distribution"},"dms_Segment","=INDEX(dms_Segment_List,MATCH(dms_TradingName,dms_TradingName_List))"]
[null,"Regulatory Year Ending",{"$f":"IF(dms_MultiYear_Flag=1,LEFT(dms_Specified_FinalYear,2)&RIGHT(dms_Specified_FinalYear,2),dms_RYE_result)","v":"2031"},"dms_RYE","=IF(dms_MultiYear_Flag=1,LEFT(dms_Specified_FinalYear,2)&RIGHT(dms_Specified_FinalYear,2),dms_RYE_result)"]
[null,"Reporting Period Type","Financial","dms_RPT","=INDEX(dms_RPT_List,MATCH(dms_TradingName,dms_TradingName_List))"]
[null,"EB/CA Unit of Measure for Monetary Values","$0s","dms_dollar_nom_UOM",{"$f":"IF(dms_SingleYearModel=\"yes\",\"This is set to an historical template (EB, CA or ARR), apply UOM Named Range to cell !\",\"This is not an historical template, make sure UOM Named Range is not applied\")","v":"This is not an historical template, make sure UOM Named Range is not applied"},null,null,null,null,{"$f":"IFERROR(dms_dollar_nom_UOM, \"NR not applied\")","v":"NR not applied"}]
[null,"Security Classification","Public","dms_Classification","Always Public"]
[null,"Jurisdiction",{"$f":"INDEX(dms_JurisdictionList,MATCH(dms_TradingName,dms_TradingName_List))","v":"Vic"},"dms_Jurisdiction","=INDEX(dms_JurisdictionList,MATCH(dms_TradingName,dms_TradingName_List))"]
["Relevant for PTRM, RFMs and Reset RINS","$ REAL REFERENCES"]
[null,"Does the named range CRY exist in this file? ",{"$f":"IFERROR(CRY,\"NO\")","v":"2022-23"}]
[null,"CRY-1  (last full calendar year before CRY)",{"$f":"IFERROR(IF(dms_RPT=\"calendar\",CRY-1,LEFT(CRY,4)),\"CRY not present\")","v":"2022"},"dms_Cal_Year_B4_CRY","'=IF(dms_RPT=\"financial\",VALUE(LEFT(dms_SingleYear_FinalYear_Result,4)),VALUE(LEFT(dms_SingleYear_FinalYear_Result,4)-1))"]
[null,"Dollar $ real month",{"$f":"INDEX(dms_RPTMonth_List,MATCH(dms_TradingName,dms_TradingName_List))","v":"June"},"dms_RPTMonth","=INDEX(dms_RPTMonth_List,MATCH(dms_TradingName,dms_TradingName_List))"]
[null,"Dollar $ real  (the last month before the FRCP_y1)",{"$f":"IF(dms_Model=\"RFM\",dms_DollarReal_Prev, IF(dms_SingleYearModel=\"yes\",CONCATENATE(dms_RPTMonth)&\" \"&VALUE((LEFT(dms_CRY_start_year,2)&RIGHT(dms_CRY_start_year,2))),CONCATENATE(dms_RPTMonth)&\" \"&dms_DollarReal_year))","v":"June 2026"},"dms_DollarReal","=IF(dms_Model=\"RFM\",dms_DollarReal_Prev, IF(dms_SingleYearModel=\"yes\",CONCATENATE(dms_RPTMonth)&\" \"&VALUE((LEFT(dms_CRY_start_year,2)&RIGHT(dms_CRY_start_year,2))),CONCATENATE(dms_RPTMonth)&\" \"&dms_DollarReal_year))"]
[null,"Dollar $ real previous year (PRCP_y5)",{"$f":"CONCATENATE(dms_RPTMonth)&\" \"&dms_Previous_DollarReal_year","v":"June 2021"},"dms_DollarReal_Prev","=IF(SUM(dms_SingleYear_Model)>0,CONCATENATE(dms_RPTMonth)&\" \"&VALUE(((LEFT(CRY,2))&RIGHT(CRY,2))-1),CONCATENATE(dms_RPTMonth)&\" \"&VALUE(((LEFT(dms_CRCP_FirstYear_Result,2)&RIGHT(dms_CRCP_FirstYear_Result,2))))-1)"]
[null,"PTRM/ RFMs"]
[null,"Form of control",{"$f":"INDEX(dms_FormControl_List,MATCH(dms_TradingName,dms_TradingName_List))","v":"Revenue cap"},"dms_FormControl","=INDEX(dms_FormControl_List,MATCH(dms_TradingName,dms_TradingName_List))"]
["All potential values for Regulatory Years or RYEs as calculated","This block works out the various RYE's for ALL RIN types and MODELS"]
[null,"dms_start_year",{"$f":"FRCP_y1","v":"2026-27"},"=FRCP_y1","FRCP_y1 from cover sheet"]
[null,"dms_CRY_start_year",{"$f":"IFERROR(CRY,CRCP_y4)","v":"2022-23"},"=IFERROR(CRY,CRCP_y4)"]
[null,"dms_CRY_start_row",{"$f":"IFERROR(MATCH(dms_CRY_start_year,INDIRECT(dms_RPT),0),0)","v":36},"=IFERROR(MATCH(dms_CRY_start_year,INDIRECT(dms_RPT),0),0)"]
[null,"dms_FRCP_start_row",{"$f":"MATCH(dms_start_year,INDIRECT(dms_RPT),0)","v":40},"=MATCH(dms_start_year,INDIRECT(dms_RPT),0)","Uses FRCP_y1 as a start reference"]
[null,"dms_CRCP_start_row",{"$f":"dms_FRCP_start_row-dms_CRCPlength_Num","v":35},"=dms_FRCP_start_row-dms_CRCPlength_Num","Uses the value in dms_CRCPlength_Num"]
[null,"dms_PRCP_start_row",{"$f":"dms_FRCP_start_row-dms_CRCPlength_Num-dms_PRCPlength_Num","v":30},"=dms_FRCP_start_row-dms_CRCPlength_Num-dms_PRCPlength_Num","Uses the value in dms_CRCPlength_Num and dms_PRCPlength_Num"]
[null,"dms_RYE_start_row",{"$f":"dms_FRCP_start_row+(dms_FRCPlength_Num-1)","v":44},"=dms_FRCP_start_row+(dms_FRCPlength_Num-1)","Uses the value in dms_FRCPlength_Num-1"]
[null,"FRCP_start_year",{"$f":"INDEX(INDIRECT(dms_RPT),dms_FRCP_start_row)","v":"2026-27"},"=INDEX(INDIRECT(dms_RPT),dms_FRCP_start_row)","Converts the FRCP start row to display the year"]
[null,"CRCP_start_year",{"$f":"INDEX(INDIRECT(dms_RPT),dms_CRCP_start_row)","v":"2021-22"},"=INDEX(INDIRECT(dms_RPT),dms_CRCP_start_row)","Converts the CRCP start row to display the year"]
[null,"PRCP_start_year",{"$f":"INDEX(INDIRECT(dms_RPT),dms_PRCP_start_row)","v":"2016-17"},"=INDEX(INDIRECT(dms_RPT),dms_PRCP_start_row)","Converts the PRCP start row to display the year"]
[null,"FRCP_final_year",{"$f":"INDEX(INDIRECT(dms_RPT),dms_FRCP_start_row+dms_FRCPlength_Num-1)","v":"2030-31"},"=INDEX(INDIRECT(dms_RPT),dms_FRCP_start_row+dms_FRCPlength_Num-1)","Finds the FRCP final year"]
[null,"CRCP_final_year",{"$f":"INDEX(INDIRECT(dms_RPT),dms_CRCP_start_row+dms_CRCPlength_Num-1)","v":"2025-26"},"=INDEX(INDIRECT(dms_RPT),dms_CRCP_start_row+dms_CRCPlength_Num-1)","Finds the CRCP final year"]
[null,"PRCP_final_year",{"$f":"INDEX(INDIRECT(dms_RPT),dms_PRCP_start_row+dms_FRCPlength_Num-1)","v":"2020-21"},"=INDEX(INDIRECT(dms_RPT),dms_PRCP_start_row+dms_FRCPlength_Num-1)","Finds the PRCP final year"]
[null,"dms_Reset_final_year",{"$f":"INDEX(INDIRECT(dms_RPT),dms_RYE_start_row)","v":"2030-31"},"=INDEX(INDIRECT(dms_RPT),dms_RYE_start_row)","For Resets and PTRM/RFMs (same as FRCP_final_year)"]
[null,"dms_SpecifiedYear_final_year",{"$f":"FRY","v":"2028-29"},"=FRY","FRY from cover sheet"]
[null,"dms_DollarReal_year",{"$f":"LEFT(CRCP_final_year,2)&RIGHT(CRCP_final_year,2)","v":"2026"},"=LEFT(CRCP_final_year,2)&RIGHT(CRCP_final_year,2)","Uses the value in CRCP_final_year"]
[null,"dms_Previous_DollarReal_year",{"$f":"LEFT(PRCP_final_year,2)&RIGHT(PRCP_final_year,2)","v":"2021"},"=LEFT(PRCP_final_year,2)&RIGHT(PRCP_final_year,2)","Uses the value in PRCP_final_year"]
[null,"dms_CRY_RYE",{"$f":"IFERROR(LEFT(CRY,2)&RIGHT(CRY,2),0)","v":"2023"},"=IFERROR(LEFT(CRY,2)&RIGHT(CRY,2),0)","For ABC single year RINS"]
[null,"dms_Reset_RYE",{"$f":"IF(dms_Model_Span>1,IF(dms_Model=\"RFM\",(LEFT(dms_DollarReal_year,2)&RIGHT(dms_DollarReal_year,2)),(LEFT(dms_Reset_final_year,2)&RIGHT(dms_Reset_final_year,2))),0)","v":"2031"},"=IF(dms_Model_Span>1,IF(dms_Model=\"RFM\",(LEFT(dms_DollarReal_year,2)&RIGHT(dms_DollarReal_year,2)),(LEFT(dms_Reset_final_year,2)&RIGHT(dms_Reset_final_year,2))),0)","If model span > 1 then uses dms_Reset_RYE otherwise it's a multi year ABC and uses dms_Specified_RYE"]
[null,"dms_Specified_RYE",{"$f":"IF(dms_MultiYear_ResponseFlag=\"Yes\",(LEFT(dms_Specified_FinalYear,2)&RIGHT(dms_Specified_FinalYear,2)),0)","v":0},"=IF(dms_MultiYear_ResponseFlag=\"Yes\",(LEFT(dms_Specified_FinalYear,2)&RIGHT(dms_Specified_FinalYear,2)),0)","If multi year ABC - uses dms_Specified_FinalYear"]
[null,"dms_Model_Span",{"$f":"INDEX(dms_Model_Span_List,MATCH(dms_Model,dms_Model_List))","v":5},"=INDEX(dms_Model_Span_List,MATCH(dms_Model,dms_Model_List))","A result of 5 is used to signify that it is more than 1 year span"]
[null,"dms_RYE_result",{"$f":"IF(dms_MultiYear_ResponseFlag=\"yes\",dms_Specified_RYE,(IF(dms_Model_Span>1,dms_Reset_RYE,dms_CRY_RYE)))","v":"2031"},"=IF(dms_MultiYear_ResponseFlag=\"yes\",dms_Specified_RYE,(IF(dms_Model_Span>1,dms_Reset_RYE,dms_CRY_RYE)))","Nested IF - feeds into dms_RYE"]
[null,"dms_Reset_Span",{"$f":"IF(dms_Reset_RYE>0,CONCATENATE(FRCP_y1,\" to \",FRCP_final_year),0)","v":"2026-27 to 2030-31"},"=IF(dms_Reset_RYE>0,CONCATENATE(FRCP_y1,\" to \",FRCP_final_year),0)","Reset span of years as text"]
[null,"dms_SpecifiedYear_Span",{"$f":"IF(dms_Specified_RYE>0,CONCATENATE(CRY,\" to \",dms_Specified_FinalYear),0)","v":0},"=IF(dms_Specified_RYE>0,CONCATENATE(CRY,\" to \",dms_Specified_FinalYear),0)","Multi year ABC span of years as text"]
[null,"dms_Header_Span",{"$f":"IF(dms_MultiYear_Flag=1,dms_SpecifiedYear_Span,IF(dms_Model_Span>1,dms_y1&\" to \"&FRCP_final_year,CRY))","v":"2022-23 to 2030-31"},"=IF(dms_MultiYear_Flag=1,dms_SpecifiedYear_Span,IF(dms_Model_Span>1,dms_Reset_Span,CRY))","NESTED IF - for Sheet Headers"]
[null,"ABC RINS THAT SPAN MULTIPLE YEARS"]
[null,"This is a multi year ABC RIN?","No"]
[null,null,{"$f":"IF(dms_MultiYear_ResponseFlag=\"No\",0,1)","v":0},"dms_MultiYear_Flag","This is set from the answer provided above"]
[null,null,{"$f":"IF(dms_MultiYear_Flag=1,FRY,\"not a Multiple year submission\")","v":"not a Multiple year submission"},"dms_Specified_FinalYear","The result here is returned to dms_CRCP_FinalYear_Result if response to Q in C73 is \"yes\" and dms_MultiYear_Flag is set to 1"]
[null," Start year for 5.2 in Multi year ABC RINS",{"$f":"IFERROR(IF(dms_MultiYear_Flag=1,FRY,CRY),\"not an ABC\")","v":"2022-23"},"dms_0502_Inst_Year","=IF(dms_MultiYear_Flag=1,FRY,CRY)",null,"For single year RINS this is CRY - multi year RINS need to start a the end of the span of years (ie. FRY)"]
[null,"WHAT IS THE RYE?"]
[null,"Reg Period Lengths"]
[null,"PRCP length in years",{"$f":"INDEX(dms_PRCPlength_List,MATCH(dms_TradingName,dms_TradingName_List))","v":5},"dms_PRCPlength_Num","=INDEX(dms_PRCPlength_List,MATCH(dms_TradingName,dms_TradingName_List))"]
[null,"CRCP length in years",{"$f":"INDEX(dms_CRCPlength_List,MATCH(dms_TradingName,dms_TradingName_List))","v":5},"dms_CRCPlength_Num","=INDEX(dms_CRCPlength_List,MATCH(dms_TradingName,dms_TradingName_List))"]
[null,"FRCP length in years",{"$f":"INDEX(dms_FRCPlength_List,MATCH(dms_TradingName,dms_TradingName_List))","v":5},"dms_FRCPlength_Num","=INDEX(dms_FRCPlength_List,MATCH(dms_TradingName,dms_TradingName_List))"]
[null,"Single year RIN?"]
[null,"Single Year ABC RIN ?",{"$f":"IF(dms_Model=\"EB\",1,0)","v":0},"dms_EB"]
[null,null,{"$f":"IF(dms_Model=\"CA\",1,0)","v":0},"dms_CA","=dms_SingleYear_Model"]
[null,null,{"$f":"IF(dms_Model=\"ARR\",1,0)","v":0},"dms_ARR"]
[null,"Is this a single Year ABC RIN?",{"$f":"IF(SUM(dms_SingleYear_Model)=1,\"yes\",\"no\")","v":"no"},"dms_SingleYearModel","=IF(SUM(dms_SingleYear_Model)=1,\"yes\",\"no\")"]
[null,"Single Year Final Year Result",{"$f":"IF(AND(dms_SingleYearModel=\"yes\",dms_MultiYear_Flag=0),CRY,0)","v":0},"dms_SingleYear_FinalYear_Result","=IFERROR(IF(SUM(dms_SingleYear_Model)<>0,(INDIRECT(dms_SingleYear_FinalYear_Ref)),\"not a single year RIN\"),\"CRY not present\")"]
[null,"Multi year RIN?"]
[]
[null,"Multi Year Reset/Model?",{"$f":"IF(dms_Model_Span>1,\"yes\",\"no\")","v":"yes"}]
[null,"Final year result for Reset/Model",{"$f":"IF(dms_Model_Span>1,dms_Reset_final_year,0)","v":"2030-31"},"dms_MultiYear_FinalYear_Result","dms_CRCP_FinalYear_Result"]
[]
[null,"Multi Year ABC RIN?",{"$f":"IF(dms_MultiYear_Flag=1,\"yes\",\"no\")","v":"no"},"dms_MultiYear_ABC_RIN"]
[null,"Final year result for ABC multi year",{"$f":"IF(dms_MultiYear_Flag=1,C51,0)","v":0}]
[]
[null,"EB RINS"]
[null,"Calendar Year for table 3.6 data",{"$f":"IFERROR(IF(dms_Segment=\"Transmission\",dms_Cal_Year_B4_CRY,CRY),\"CRY not present\")","v":"2022-23"},"dms_0306_Year","=IF(dms_Segment=\"Transmission\",dms_Cal_Year_B4_CRY,CRY)"]
[null,"CA RINS"]
[null,"Find how many rows in tables 6.3 sustained interruptions?",null,null,"dms_060301_MaxRows only returns a valid value when cover sheet is attached to a CA file"]
[null,null,{"$f":"IF(dms_Model<>\"CA\",\"not a CA\",\"Is a CA\")","v":"not a CA"},null,"=IF(dms_Model<>\"CA\",\"not a CA\",\"Is a CA\")"]
[null,"dms_060301_Avg_Duration_Sustained_Int_Values present?",{"$f":"IFERROR(IF(INDEX(dms_060301_Avg_Duration_Sustained_Int_Values,1,1)<>\"\",\"yes\",\"no\"),\"no\")","v":"no"},"dms_060301_checkvalue","=IFERROR(IF(INDEX(dms_060301_Avg_Duration_Sustained_Int_Values,1,1)<>\"\",\"yes\",\"no\"),\"no\")"]
[null,null,{"$f":"IF(AND(dms_Model=\"CA\",(dms_060301_checkvalue=\"no\")),\"error - NR not present\",\"no errors\")","v":"no errors"},null,"=IF(AND(dms_Model=\"CA\",(dms_060301_checkvalue=\"no\")),\"error - NR not present\",\"no errors\")"]
[null,"Table 6.3.1 - last row reference",{"$f":"IFERROR(IF(dms_Model=\"CA\",LOOKUP(2,1/(dms_060301_Avg_Duration_Sustained_Int_Values<>\"\"),(ROW(dms_060301_Avg_Duration_Sustained_Int_Values))),\"not a CA\"),\"6.3 not present\")","v":"not a CA"},"dms_060301_LastRow","=IFERROR(IF(dms_Model=\"CA\",LOOKUP(2,1/(dms_060301_Avg_Duration_Sustained_Int_Values<>\"\"),(ROW(dms_060301_Avg_Duration_Sustained_Int_Values))),\"not a CA\"),\"6.3 not present\")"]
[null,"Table 6.3.1 - max number rows",{"$f":"IFERROR(IF(dms_Model=\"CA\",(dms_060301_LastRow-15),\"not a CA\"),\"error\")","v":"not a CA"},"dms_060301_MaxRows","=IFERROR(IF(dms_Model=\"CA\",(dms_060301_LastRow-15),\"not a CA\"),\"error\")"]
[null,"Table 6.6.3 - Public lighting repair - no. business days",{"$f":"INDEX(dms_663_List,MATCH(dms_TradingName,dms_TradingName_List))","v":2},"dms_663","=INDEX(dms_663_List,MATCH(dms_TradingName,dms_TradingName_List))"]
[null,"ARR or RESET RINS"]
[null,"How many rows in tables 6.1 or 6.7?  (leap year?)","insert dms_LeapYear NR if required",null,"'dms_LeapYear is used to determine dms_060701_Max_Rows BUT it is only found on worksheet 6.1 or 6.7 and the date value in the cell is used to determine whether it is a leap year"]
[null,"Is dms_LeapYear named range present?",{"$f":"IFERROR(IF(dms_LeapYear,\"yes\"),\"no\")","v":"no"}]
[null,"Table 6.7.1 - includes a leap year?",{"$f":"\nIFERROR(IF(MONTH(DATE(YEAR(dms_LeapYear),2,29))=2,\"is a leap year\",\"not a leap year\"),\n\"dms_LeapYear not present\")","v":"dms_LeapYear not present"},"dms_LeapYear_Result","=IFERROR(IF(MONTH(DATE(YEAR(dms_LeapYear),2,29))=2,\"is a leap year\",\"not a leap year\"),\"dms_LeapYear not present\")"]
[null,"MaxRows if Reset and leap year",{"$f":"IF(dms_LeapYear_Result=\"is a leap year\",1827,1826)","v":1826},"dms_060701_Reset_MaxRows","=IF(dms_LeapYear_Result=\"is a leap year\",1827,1826)",null,null,"number of days present in Reset RIN table"]
[null,"MaxRows if ARR and leap year",{"$f":"IF(dms_LeapYear_Result=\"is a leap year\",366,365)","v":365},"dms_060701_ARR_MaxRows","=IF(dms_LeapYear_Result=\"is a leap year\",366,365)",null,null,"number of days present in ARR RIN table"]
[null,"Table 6.7.1 - Max Rows (leap year/ non leap year)",{"$f":"IF(dms_Model=\"ARR\",dms_060701_ARR_MaxRows,IF(dms_Model=\"Reset\",dms_060701_Reset_MaxRows,\"not a relevant RIN type\"))","v":1826},"dms_060701_MaxRows","=IF(dms_Model=\"ARR\",dms_060701_ARR_MaxRows,IF(dms_Model=\"Reset\",dms_060701_Reset_MaxRows,\"not a relevant RIN type\"))"]
[null,"How many columns in 6.7?   (4 or 5 feeder categories)",{"$f":"IF(dms_FifthFeeder_flag_NSP=\"NO\",\"This NSP has only 4 feeder categories\",\"This NSP has 5 feeder categories\")","v":"This NSP has only 4 feeder categories"}]
[null,"Table 6.7.1 - Last column (# of feeder categories > 4)",{"$f":"IF(dms_FifthFeeder_flag_NSP=\"NO\",10,12)","v":10},"dms_060701_MaxCols","=IF(dms_FifthFeeder_flag_NSP=\"NO\",8,10)"]
[null,"Table 6.7.1 - Number of offset rows",{"$f":"IF(dms_Model=\"ARR\",15,9)","v":9},"dms_060701_OffsetRows","=IF(dms_Model=\"ARR\",15,9)"]
[null,"Start date for telephone answering in 6.1 or 6.7?",null,null,"Using 060101 as naming standard not 060701 for start dates"]
[null,"Table 6.1.1 and 6.7.1 - Start Date as Text",{"$f":"IF(dms_SingleYearModel=\"yes\",(CONCATENATE(IF(LEN(CRY)=4,\"1-Jan-\",\"1-Jul-\"),LEFT(CRY,4))),(CONCATENATE(IF(LEN(PRCP_y4)=4,\"1-Jan-\",\"1-Jul-\"),LEFT(PRCP_y4,4))))","v":"1-Jul-2019"},"dms_060101_StartDateTxt","=IF(SUM(dms_SingleYear_Model)>1,(CONCATENATE(IF(LEN(CRY)=4,\"1-Jan-\",\"1-Jul-\"),LEFT(CRY,4))),(CONCATENATE(IF(LEN(CRCP_y4)=4,\"1-Jan-\",\"1-Jul-\"),LEFT(CRCP_y4,4))))"]
[null,"Table 6.1.1 and 6.7.1 - Start Date as Date Value",{"$f":"DATEVALUE(dms_060101_StartDateTxt)","v":43647},"dms_060101_StartDateVal","=DATEVALUE(dms_060701_StartDateTxt)"]
[null,"Does the NSP report MAIFI or MAIFIe",{"$f":"INDEX(dms_MAIFI_flag_List,MATCH(dms_TradingName,dms_TradingName_List))","v":"YES"},"dms_MAIFI_Flag"]
[null,"ARRs"]
[null,"How many rows in table 6.8?","insert dms_060801_StartCell NR if required",null,"dms_060801_StartCell is only found on worksheet 6.8 and is used to determine the starting date for the date range"]
[null,"Is dms_060801_StartCell named range present?","yes","Must be present for ARRs","=IFERROR(IF((ROW(dms_060801_StartCell)-1)=1,\"yes\",\"yes\"),\"no\")"]
[null,"Table 6.8 - Number of offset rows",12,"dms_0608_OffsetRows","=IFERROR(IF(dms_Model=\"ARR\",(ROW(dms_060801_StartCell)-1),\"not an ARR\"),\"6.8 error\")"]
[null,"Table 6.8 - Last row","0","dms_0608_LastRow","=IFERROR(IF(dms_060801_StartCell<>\"\",IF(dms_Model=\"ARR\",(LOOKUP(2,1/(dms_060801_01_Values<>\"\"),(ROW(dms_060801_01_Values)))),\"not an ARR\"),0),\"0\")"]
[null,"Table 6.8 - MaxRows",{"$f":"IFERROR(IF(dms_Model=\"ARR\",(MAX(0,dms_0608_LastRow-dms_0608_OffsetRows)),\"not an ARR\"),\"0\")","v":"not an ARR"},"dms_060801_MaxRows","=IFERROR(IF(dms_Model=\"ARR\",(MAX(0,dms_0608_LastRow-dms_0608_OffsetRows)),\"not an ARR\"),\"0\")"]
[null,"TNSP RESET RINS"]
[null,"Table 7.9.4 only appears in TNSPs Reset RIN"]
[null,"Table 7.9.4 - first year",{"$f":"LEFT(PRCP_y3,4)","v":"2018"},"dms_070904_Start_Year","=LEFT(PRCP_y3,4)"]
[]
[null,"MISC"]
[null,"Public lighting NSP?",{"$f":"INDEX(dms_Public_Lighting_List,MATCH(dms_TradingName,dms_TradingName_List))","v":"YES"},"dms_Public_Lighting","=INDEX(dms_Public_Lighting_List,MATCH(dms_TradingName,dms_TradingName_List))"]
[null,"CBD Feeder for this business",{"$f":"INDEX(dms_CBD_flag,MATCH(dms_TradingName,dms_TradingName_List))","v":"NO"},"dms_CBD_flag_NSP"]
[null,"Urban Feeder for this business",{"$f":"INDEX(dms_Urban_flag,MATCH(dms_TradingName,dms_TradingName_List))","v":"YES"},"dms_Urban_flag_NSP"]
[null,"Short rural Feeder for this business",{"$f":"INDEX(dms_ShortRural_flag,MATCH(dms_TradingName,dms_TradingName_List))","v":"YES"},"dms_ShortRural_flag_NSP"]
[null,"Long rural Feeder for this business",{"$f":"INDEX(dms_LongRural_flag,MATCH(dms_TradingName,dms_TradingName_List))","v":"YES"},"dms_LongRural_flag_NSP"]
[null,"Fifth Feeder Category (eg. TasNetworks (D))",{"$f":"INDEX(dms_FeederType_5_flag,MATCH(dms_TradingName,dms_TradingName_List))","v":"NO"},"dms_FifthFeeder_flag_NSP","=INDEX(dms_FeederType_5_flag,MATCH(dms_TradingName,dms_TradingName_List))"]
[]
[null,"DISCARD FILES"]
[null,"discard this record?","NO","dms_DISCARD","If record is to be discarded from DB set this flag to YES"]
[]
[null,"SUBSET FILES"]
[null,"Is this Submission File a Subset File","NO","dms_Partial"]
[]
[]
[null,"REGULATORY YEARS FOR MULTI RYE SUBMISSIONS"]
[null,"Multiple RYE flag","NO","dms_Multi_RYE_flag"]
[null,null,"Manually specify RYE","Named ranges to apply"]
[null,null,2013,"dms_RYE_01"]
[null,null,2014,"dms_RYE_02"]
[null,null,2015,"dms_RYE_03"]
[null,null,2016,"dms_RYE_04"]
[null,null,2017,"dms_RYE_05"]
[null,null,2018,"dms_RYE_06"]
[null,null,2019,"dms_RYE_07"]
[null,null,2020,"dms_RYE_08"]
[null,null,2021,"dms_RYE_09"]