{"text_format":"1","workbook":"xlsx","n_sheets":8,"sheets":["CONTENTS","Business & other details","OPTIONAL 5.4 MD & utilisation","AER Sheet Heading","AER CF","AER NRs","AER lookups","AER ETL"],"not_rendered":{"charts":0,"images":1,"macros":1,"external_links":4,"defined_names":365,"comments":1,"pivot_tables":0},"unopened":[],"bounds":{"document_bytes":16777216,"sheet_cells":100000,"rows_first":2000,"rows_last":500,"rows_between":2000,"halvings":0,"cell_chars":16384,"cell_head_chars":4096},"cells_cut":0,"cells_raw":0,"read":"whole","date_system":"1900"}

{"sheet":"CONTENTS","index":0,"n_rows":15,"n_cols":5,"rows_kept":15,"cut":false,"hidden":false,"merged":[[6,3,6,4],[8,3,8,4]]}
[null,null,{"$f":"IF(dms_MultiYear_ResponseFlag=\"Yes\",\"REGULATORY REPORTING STATEMENT - HISTORICAL INFORMATION\",INDEX(dms_Worksheet_List,MATCH(dms_Model,dms_Model_List)))","v":"REGULATORY REPORTING STATEMENT"}]
[null,null,{"$f":"INDEX(dms_TradingNameFull_List,MATCH(dms_TradingName,dms_TradingName_List))","v":"Powercor Australia"}]
[null,null,{"$f":"CONCATENATE(\"REGULATORY PERIOD FROM \", FRCP_y1,\" TO \",dms_MultiYear_FinalYear_Result)","v":"REGULATORY PERIOD FROM 2026-27 TO 2030-31"}]
[]
[]
[]
[null,null,null,"CONTENTS"]
[]
[null,null,null,"DRAFT RIN ONLY - DO NOT USE FOR SUBMISSION"]
[]
[null,null,null,"TEMPLATE","JUNE 2024 - DRAFT RIN"]
[]
[null,null,null,"SUBMISSION","Business & other details"]
[]
[null,null,null,"NETWORK","OPTIONAL 5.4 MD & utilisation"]
{"$rows_left_out":1}
{"sheet":"Business & other details","index":1,"n_rows":77,"n_cols":79,"rows_kept":77,"cut":false,"hidden":false,"merged":[[76,25,76,34],[76,37,76,52],[58,25,58,34],[66,25,66,34],[68,25,68,34],[58,37,58,44],[64,25,64,34],[64,37,64,52],[35,37,35,58],[36,37,36,58],[46,37,46,44],[46,46,46,53],[46,55,46,62],[44,37,44,44],[66,37,66,52],[68,37,68,52],[70,37,70,52],[72,37,74,81],[70,25,70,34],[72,25,74,34],[54,46,54,53],[54,37,54,44],[53,73,53,80],[53,64,53,71],[56,25,56,34],[48,46,48,53],[48,37,48,44],[52,37,52,44],[50,73,50,80],[54,73,54,80],[52,73,52,80],[56,37,56,44],[52,46,52,53],[53,46,53,53],[49,46,49,53],[49,37,49,44],[54,64,54,71],[50,46,50,53],[53,55,53,62],[50,37,50,44],[53,37,53,44],[52,64,52,71],[50,64,50,71],[52,55,52,62],[50,55,50,62],[49,64,49,71],[49,55,49,62],[46,64,46,71],[19,21,19,35],[19,37,19,48],[48,25,48,34],[52,25,52,34],[25,21,25,35],[25,60,25,66],[26,60,26,66],[34,60,34,66],[18,21,18,35],[46,73,46,80],[44,73,44,80],[54,55,54,62],[28,21,28,35],[26,21,26,35],[48,73,48,80],[48,64,48,71],[49,73,49,80],[48,55,48,62],[45,73,45,80],[35,21,35,35],[36,21,36,35],[36,60,36,66],[35,60,35,66],[34,21,34,35],[34,68,34,89],[35,68,35,89],[36,68,36,89],[34,37,34,58],[44,46,44,53],[44,25,44,34],[44,55,44,62],[44,64,44,71],[10,16,10,93],[11,16,11,93],[18,37,18,58],[27,37,27,51],[0,7,2,15],[6,21,6,75],[27,21,27,35],[45,37,45,44],[45,46,45,53],[45,55,45,62],[45,64,45,71],[3,21,3,57],[8,16,8,93],[25,68,25,89],[26,68,26,89],[28,68,28,71],[28,80,28,82],[27,68,27,82],[28,37,28,40],[25,37,25,58],[26,37,26,58],[28,49,28,51],[27,60,27,66],[28,60,28,66]]}
[null,null,null,null,null,null,null,null,null,null,null,null,null,null,null,null,null,null,null,null,null,{"$f":"INDEX(dms_Worksheet_List,MATCH(dms_Model,dms_Model_List))","v":"REGULATORY REPORTING STATEMENT"}]
[null,null,null,null,null,null,null,null,null,null,null,null,null,null,null,null,null,null,null,null,null,{"$f":"INDEX(dms_TradingNameFull_List,MATCH(dms_TradingName,dms_TradingName_List))","v":"Powercor Australia"}]
[null,null,null,null,null,null,null,null,null,null,null,null,null,null,null,null,null,null,null,null,null,{"$f":"CONCATENATE(\"REGULATORY PERIOD FROM \", FRCP_y1,\" TO \",dms_MultiYear_FinalYear_Result)","v":"REGULATORY PERIOD FROM 2026-27 TO 2030-31"}]
[null,null,null,null,null,null,null,null,null,null,null,null,null,null,null,null,null,null,null,null,null,"BUSINESS & OTHER DETAILS"]
[]
[null,null,null,null,null,null,null,null,null,null,null,null,null,null,null,null,null,null,null,null,null,"INSTRUCTIONS"]
[null,null,null,null,null,null,null,null,null,null,null,null,null,null,null,null,null,null,null,null,null,"Complete the following business details regulatory template before entering data or values in any other regulatory template. This regulatory template is linked to other cells within the spreadsheet and automatically generates column headings and conditional formatting to distinguish business specific input and non-input cells. "]
[]
[null,null,null,null,null,null,null,null,null,null,null,null,null,null,null,null,"SUBMISSION PARTICULARS INPUT SHEET"]
[]
[null,null,null,null,null,null,null,null,null,null,null,null,null,null,null,null,"DRAFT TEMPLATE ONLY"]
[null,null,null,null,null,null,null,null,null,null,null,null,null,null,null,null,"DO NOT USE FOR SUBMISSIONS"]
[]
[]
[null,null,null,null,null,null,null,null,null,null,null,null,null,null,null,null,null,null,null,null,null,"ENTITY DETAILS"]
{"$rows_left_out":63}
{"sheet":"OPTIONAL 5.4 MD & utilisation","index":2,"n_rows":271,"n_cols":11,"rows_kept":271,"cut":false,"hidden":false,"merged":[]}
[null,{"$f":"INDEX(dms_Worksheet_List,MATCH(dms_Model,dms_Model_List))","v":"REGULATORY REPORTING STATEMENT"}]
[null,{"$f":"INDEX(dms_TradingNameFull_List,MATCH(dms_TradingName,dms_TradingName_List))","v":"Powercor Australia"}]
[null,{"$f":"CONCATENATE(\"REGULATORY PERIOD FROM \", FRCP_y1,\" TO \",dms_MultiYear_FinalYear_Result)","v":"REGULATORY PERIOD FROM 2026-27 TO 2030-31"}]
[null,"5.4 OPTIONAL MAXIMUM DEMAND AND UTILISATION AT SPATIAL LEVEL"]
[null," TEMPLATE DATE - SEPTEMBER 2024 - FINAL RIN"]
[]
[]
[null,"5.4.1 - OPTIONAL NON-COINCIDENT & COINCIDENT MAXIMUM DEMAND"]
[null,"SUBTRANSMISSION/ZONE SUBSTATION"]
[null,"Network Level","Substation","Incidence","Seasonal peak","Substation Rating","Adjustments - Embedded Generation","Weather corrected maximum demand 10% POE","Weather corrected maximum demand 10% POE","Weather corrected maximum demand 50% POE","Weather corrected maximum demand 50% POE"]
["UNITS","Subtransmission / Zone","Name","Coincident / non-coincident","Summer/Winter","MVA","MW","MVA","MW","MVA","MW"]
[null,"Zone","AC","Non-coincident","Summer",{"$f":"_xlfn.XLOOKUP(C12,[1]Sheet1!$A$2:$A$86,[1]Sheet1!$B$2:$B$86)","v":40},null,{"$f":"_xlfn.XLOOKUP(1,('[2]ZSS Results'!$B$4:$B$462=\"Powercor\")*('[2]ZSS Results'!$D$4:$D$462=\"summer\")*('[2]ZSS Results'!$C$4:$C$462=C12),'[2]ZSS Results'!$S$4:$S$462)","v":8.24},{"$f":"_xlfn.XLOOKUP(C12,'[3]zss forecast'!$B$3:$B$155,'[3]zss forecast'!$CC$3:$CC$155)","v":7.73},{"$f":"_xlfn.XLOOKUP(1,('[2]ZSS Results'!$B$4:$B$462=\"Powercor\")*('[2]ZSS Results'!$D$4:$D$462=\"summer\")*('[2]ZSS Results'!$C$4:$C$462=C12),'[2]ZSS Results'!$AO$4:$AO$462)","v":5.82},{"$f":"_xlfn.XLOOKUP(C12,'[3]zss forecast'!$B$3:$B$155,'[3]zss forecast'!$DF$3:$DF$155)","v":5.61}]
[null,"Zone","AL","Non-coincident","Summer",{"$f":"_xlfn.XLOOKUP(C13,[1]Sheet1!$A$2:$A$86,[1]Sheet1!$B$2:$B$86)","v":30},null,{"$f":"_xlfn.XLOOKUP(1,('[2]ZSS Results'!$B$4:$B$462=\"Powercor\")*('[2]ZSS Results'!$D$4:$D$462=\"summer\")*('[2]ZSS Results'!$C$4:$C$462=C13),'[2]ZSS Results'!$S$4:$S$462)","v":25.47},{"$f":"_xlfn.XLOOKUP(C13,'[3]zss forecast'!$B$3:$B$155,'[3]zss forecast'!$CC$3:$CC$155)","v":24.81},{"$f":"_xlfn.XLOOKUP(1,('[2]ZSS Results'!$B$4:$B$462=\"Powercor\")*('[2]ZSS Results'!$D$4:$D$462=\"summer\")*('[2]ZSS Results'!$C$4:$C$462=C13),'[2]ZSS Results'!$AO$4:$AO$462)","v":21.06},{"$f":"_xlfn.XLOOKUP(C13,'[3]zss forecast'!$B$3:$B$155,'[3]zss forecast'!$DF$3:$DF$155)","v":21.48}]
[null,"Zone","ART","Non-coincident","Summer",{"$f":"_xlfn.XLOOKUP(C14,[1]Sheet1!$A$2:$A$86,[1]Sheet1!$B$2:$B$86)","v":20},null,{"$f":"_xlfn.XLOOKUP(1,('[2]ZSS Results'!$B$4:$B$462=\"Powercor\")*('[2]ZSS Results'!$D$4:$D$462=\"summer\")*('[2]ZSS Results'!$C$4:$C$462=C14),'[2]ZSS Results'!$S$4:$S$462)","v":16.07},{"$f":"_xlfn.XLOOKUP(C14,'[3]zss forecast'!$B$3:$B$155,'[3]zss forecast'!$CC$3:$CC$155)","v":16.059999999999999},{"$f":"_xlfn.XLOOKUP(1,('[2]ZSS Results'!$B$4:$B$462=\"Powercor\")*('[2]ZSS Results'!$D$4:$D$462=\"summer\")*('[2]ZSS Results'!$C$4:$C$462=C14),'[2]ZSS Results'!$AO$4:$AO$462)","v":14.17},{"$f":"_xlfn.XLOOKUP(C14,'[3]zss forecast'!$B$3:$B$155,'[3]zss forecast'!$DF$3:$DF$155)","v":14.21}]
[null,"Zone","AWT","Non-coincident","Summer",{"$f":"_xlfn.XLOOKUP(C15,[1]Sheet1!$A$2:$A$86,[1]Sheet1!$B$2:$B$86)","v":66},null,{"$f":"_xlfn.XLOOKUP(1,('[2]ZSS Results'!$B$4:$B$462=\"Powercor\")*('[2]ZSS Results'!$D$4:$D$462=\"summer\")*('[2]ZSS Results'!$C$4:$C$462=C15),'[2]ZSS Results'!$S$4:$S$462)","v":14.71},{"$f":"_xlfn.XLOOKUP(C15,'[3]zss forecast'!$B$3:$B$155,'[3]zss forecast'!$CC$3:$CC$155)","v":14.68},{"$f":"_xlfn.XLOOKUP(1,('[2]ZSS Results'!$B$4:$B$462=\"Powercor\")*('[2]ZSS Results'!$D$4:$D$462=\"summer\")*('[2]ZSS Results'!$C$4:$C$462=C15),'[2]ZSS Results'!$AO$4:$AO$462)","v":4.21},{"$f":"_xlfn.XLOOKUP(C15,'[3]zss forecast'!$B$3:$B$155,'[3]zss forecast'!$DF$3:$DF$155)","v":14.28}]
{"$rows_left_out":257}
{"sheet":"AER Sheet Heading","index":3,"n_rows":68,"n_cols":9,"rows_kept":68,"cut":false,"hidden":true,"merged":[]}
[null,{"$f":"INDEX(dms_Worksheet_List,MATCH(dms_Model,dms_Model_List))","v":"REGULATORY REPORTING STATEMENT"}]
[null,{"$f":"INDEX(dms_TradingNameFull_List,MATCH(dms_TradingName,dms_TradingName_List))","v":"Powercor Australia"}]
[null,{"$f":"dms_Header_Span","v":"2022-23 to 2030-31"}]
[null,"XX"]
[]
[]
[]
[]
[]
[]
[null,null,"EXPENDITURE"]
[null,null,{"$f":"CONCATENATE(\"Forecast ($0's, real \",dms_DollarReal,\")\")","v":"Forecast ($0's, real June 2026)"}]
[null,null,{"$f":"dms_y1","v":"2022-23"},{"$f":"dms_y2","v":"2023-24"},{"$f":"dms_y3","v":"2024-25"},{"$f":"dms_y4","v":"2025-26"},{"$f":"dms_y5","v":"2026-27"},{"$f":"dms_y6","v":"2027-28"},{"$f":"dms_y7","v":"2028-29"}]
[]
[]
{"$rows_left_out":54}
{"sheet":"AER CF","index":4,"n_rows":77,"n_cols":25,"rows_kept":77,"cut":false,"hidden":true,"merged":[[3,1,3,22],[39,38,39,59],[40,38,40,59],[41,38,41,59],[39,69,39,90],[40,69,40,90],[41,69,41,90]]}
[null,"AER CONDITIONAL FORMATTING"]
[]
[null,"CELLS FLAGED \"Y\" and greyed out will be greyed out in the worksheets."]
[null,"CONDITIONAL FORMATTING MAP"]
[null,null,null,null,null,"=INDEX(dms_CF_3.6.1, MATCH(dms_TradingName,dms_CF_TradingName))=\"Y\"","=INDEX(dms_CF_3.6.5, MATCH(dms_TradingName,dms_CF_TradingName))=\"Y\"","=INDEX(dms_CF_3.6.6.1, MATCH(dms_TradingName,dms_CF_TradingName))=\"Y\"","=INDEX(dms_CF_3.6.6.2, MATCH(dms_TradingName,dms_CF_TradingName))=\"Y\"","=INDEX(dms_CF_3.6.6.3, MATCH(dms_TradingName,dms_CF_TradingName))=\"Y\"","=INDEX(dms_CF_3.6.7.1, MATCH(dms_TradingName,dms_CF_TradingName))=\"Y\"","=INDEX(dms_CF_3.6.7.2, MATCH(dms_TradingName,dms_CF_TradingName))=\"Y\"","=INDEX(dms_CF_3.6.7.3, MATCH(dms_TradingName,dms_CF_TradingName))=\"Y\"","=INDEX(dms_CF_3.6.7.4, MATCH(dms_TradingName,dms_CF_TradingName))=\"Y\"","=INDEX(dms_CF_3.6.8, MATCH(dms_TradingName,dms_CF_TradingName))=\"Y\"","=INDEX(dms_CF_4.1, MATCH(dms_TradingName,dms_CF_TradingName))=\"Y\"","=INDEX(dms_CF_6.8, MATCH(dms_TradingName,dms_CF_TradingName))=\"Y\"","=INDEX(dms_CF_7.12, MATCH(dms_TradingName,dms_CF_TradingName))=\"Y\"","=INDEX(dms_CF_8.1_A, MATCH(dms_TradingName,dms_CF_TradingName))=\"Y\"","=INDEX(dms_CF_8.1_B, MATCH(dms_TradingName,dms_CF_TradingName))=\"Y\"",{"$f":"INDEX(dms_CF_8.1_Neg, MATCH(dms_TradingName,dms_CF_TradingName))=\"Y\"","v":true},"=INDEX(dms_CF_4.4.1_Neg, MATCH(dms_TradingName,dms_CF_TradingName))=\"Y\"",null,null,"=INDEX(dms_CF_F10, MATCH(dms_TradingName,dms_CF_TradingName))=\"Y\""]
[null,"dms_CF_TradingName","JurisdictionList","Sector","Segment","dms_CF_3.6.1","dms_CF_3.6.5","dms_CF_3.6.6.1","dms_CF_3.6.6.2","dms_CF_3.6.6.3","dms_CF_3.6.7.1","dms_CF_3.6.7.2","dms_CF_3.6.7.3","dms_CF_3.6.7.4","dms_CF_3.6.8","dms_CF_4.1","dms_CF_6.8 (set from dms_MAIFI_flag)","dms_CF_7.12","dms_CF_8.1_A  (and 8.4)","dms_CF_8.1_B  (and 8.4)","dms_CF_8.1_Neg  (and 8.4)","dms_CF_4.4.1","dms_CF_MAIFI_flag (set from dms_MAIFI_flag)","9.5 TUOS (set from Jurisdiction)","dms_CF_F10"]
[null,"Amadeus","NT","Gas","Transmission","-","-","-","-","-","-","-","-","-","-","-","-","-","-","-","-","-","-","-","-"]
[null,"APA GasNet","Vic","Gas","Transmission","-","-","-","-","-","-","-","-","-","-","-","-","-","-","-","-","-","-","-","-"]
[null,"Ausgrid","NSW","Electricity","Distribution",null,"Y","N","N","N","N","N","N","Y","N","N",{"$f":"IFERROR(IF(_xlfn.SINGLE(dms_MAIFI_Flag)=\"Yes\",\"N\",\"Y\"),\"Y\")","v":"N"},"Y","N","Y","Y","N",{"$f":"IFERROR(LEFT(_xlfn.SINGLE(dms_MAIFI_Flag)),\"N\")","v":"Y"},{"$f":"IF('AER CF'!$C7=\"Vic\",\"Y\",\"N\")","v":"N"}]
[null,"Ausgrid (Tx Assets)","NSW","Electricity","Distribution",null,"Y","N","N","N","N","N","N","Y","N","N","N","Y","N","Y","Y","N","Y",{"$f":"IF('AER CF'!$C8=\"Vic\",\"Y\",\"N\")","v":"Y"}]
[null,"AusNet (D)","Vic","Electricity","Distribution",null,"N","N",null,null,"N","N","N","N","N","N","N","N","N","N","Y","N","Y",{"$f":"IF('AER CF'!$C9=\"Vic\",\"Y\",\"N\")","v":"N"}]
[null,"AusNet (T)","Vic","Electricity","Transmission",null,"N",null,null,null,"N","N","N","N","N","Y","N","N","N","N","Y","N","Y",{"$f":"IF('AER CF'!$C10=\"Vic\",\"Y\",\"N\")","v":"N"}]
[null,"Australian Distribution Co.","NSW","Electricity","Distribution","N","N","N","N",null,"N","N","N","N","N","N","N","N","N","N","N","N","Y",{"$f":"IF('AER CF'!$C13=\"Vic\",\"Y\",\"N\")","v":"N"}]
[null,"Australian Distribution Co. (Vic)","Vic","Electricity","Distribution","N","N","N","N",null,"N","N","N","N","N","N","N","N","N","N","N","N","Y",{"$f":"IF('AER CF'!$C14=\"Vic\",\"Y\",\"N\")","v":"Y"}]
[null,"CitiPower","Vic","Electricity","Distribution",null,"N","N",null,null,"N","N","N","N","N","N","N","N","N","N","Y","N","Y",{"$f":"IF('AER CF'!$C15=\"Vic\",\"Y\",\"N\")","v":"Y"}]
{"$rows_left_out":63}
{"sheet":"AER NRs","index":5,"n_rows":232,"n_cols":16,"rows_kept":232,"cut":false,"hidden":true,"merged":[[33,67,33,88],[34,67,34,88],[35,67,35,88],[36,10,40,10],[44,10,45,10],[33,10,35,10],[33,36,33,57],[34,36,34,57],[35,36,35,57],[208,1,213,1],[199,1,200,1],[32,1,55,1],[100,1,107,1],[110,1,115,1],[191,1,192,1],[195,1,196,1],[160,1,174,1],[4,1,28,1],[176,1,177,1],[179,1,184,1],[65,1,78,1],[135,1,150,1],[84,1,97,1],[152,1,158,1],[118,1,132,1]]}
[null,"AER NAMED RANGES"]
[]
[null,"DROP DOWN SELECTORS USED IN WORKBOOKS"]
[]
[null,"COVER SHEET","dms_DataQuality_List","dms_Confid_status_List"]
[null,null,"-- select --","-- select --"]
[null,null,"Actual","Public"]
[null,null,"Estimate","Confidential"]
[null,null,"Consolidated"]
[]
[]
[null,null,"For all files either AER or business needs to be able to specify the type of submission","For PTRM & RFM templates we must provide a choice in case they change their form of control - otherwise it is drawn from the business specific lookup table above."]
[null,null,"dms_SourceList","dms_FormControl_Choices"]
[null,null,"-- select --","Revenue cap"]
[null,null,"After appeal","Revenue yield"]
{"$rows_left_out":218}
{"sheet":"AER lookups","index":6,"n_rows":122,"n_cols":38,"rows_kept":122,"cut":false,"hidden":true,"merged":[[30,61,30,82],[31,61,31,82],[32,61,32,82],[39,1,39,4],[4,25,4,36],[5,25,5,28],[5,30,7,34],[5,35,7,35],[5,36,7,36],[5,37,7,37]]}
[null,"AER LOOKUP TABLES"]
[]
[null,"Template number",5]
[]
[null,null,null,null,null,null,null,null,null,null,null,null,null,null,null,null,null,null,null,null,null,null,null,null,null,"FOR ELECTRICITY BUSINESSES ONLY"]
[null,null,null,null,null,null,null,null,null,null,null,null,null,null,null,null,null,null,null,null,null,null,null,null,null,"Feeder Types",null,null,null,"TasNetworks (D)","Feeder Names"]
[]
[null,null,null,null,null,null,null,null,null,null,null,null,null,null,null,null,null,null,null,null,null,null,null,null,null,"CBD","Urban","Short rural","long rural","EXTRA"]
[null,"dms_TradingName_List","dms_TradingNameFull_List","dms_ABN_List","dms_UID_List","dms_JurisdictionList","dms_Sector_List","dms_Segment_List","dms_FormControl_List","dms_RPT_List","dms_RPTMonth_List","dms_CRCPlength_List","dms_FRCPlength_List","dms_PRCPlength_List","dms_663_List","dms_Addr1_List","dms_Addr2_List","dms_Suburb_List","dms_State_List","dms_PostCode_List","dms_PAddr1_List","dms_PAddr2_List","dms_PSuburb_List","dms_PState_List","dms_PPostCode_List","dms_CBD_flag","dms_Urban_flag","dms_ShortRural_flag","dms_LongRural_flag","dms_FeederType_5_flag","dms_FeederName_1","dms_FeederName_2","dms_FeederName_3","dms_FeederName_4","dms_FeederName_5","dms_MAIFI_flag_List","dms_Public_Lighting_List","Name"]
[null,"AEMO","Australian Energy Market Operator Ltd",94072010327,"ETTVIC100","Vic","Electricity","Transmission","-","Financial","March",5,5,5,"x","Level 22","530 Collins Street","MELBOURNE","Vic",3000,"GPO Box 2008",null,"MELBOURNE","Vic",3001,"NO","NO","NO","NO","NO","CBD","Urban","Short rural","Long rural",null,"YES","NO",{"$f":"B10","v":"AEMO"}]
[null,"Ausgrid","Ausgrid",67505337385,"EDDNSW100","NSW","Electricity","Distribution","Revenue cap","Financial","June",5,5,5,5,"570 George St",null,"SYDNEY","NSW",2000,"GPO Box 4009",null,"SYDNEY","NSW",2001,"YES","YES","YES","YES","NO","CBD","Urban","Short rural","Long rural",null,"NO","YES","Ausgrid"]
[null,"Ausgrid (Tx Assets)","Ausgrid (Tx Assets)",67505337385,"EDTNSW100","NSW","Electricity","Distribution","Revenue cap","Financial","June",5,5,5,5,"570 George St",null,"SYDNEY","NSW",2000,"GPO Box 4009",null,"SYDNEY","NSW",2001,"YES","YES","YES","YES","NO","CBD","Urban","Short rural","Long rural",null,"NO","NO","Ausgrid (Tx Assets)"]
[null,"AusNet (D)","AusNet Electricity Services Pty Ltd",91064651118,"EDDVIC100","Vic","Electricity","Distribution","Revenue cap","Financial","June",5,5,5,2,"Level 32","2 Southbank Boulevard","SOUTHBANK","Vic",3006,"Locked Bag 14051",null,"MELBOURNE CITY MAIL CENTRE","Vic",8001,"NO","YES","YES","YES","NO","CBD","Urban","Short rural","Long rural",null,"YES","YES","AusNet (D)"]
[null,"AusNet (T)","AusNet Transmission Group Pty Ltd",78079798173,"ETTVIC200","Vic","Electricity","Transmission","Revenue cap","Financial","March",5,5,5,2,"Level 32","2 Southbank Boulevard","SOUTHBANK","Vic",3006,"Locked Bag 14051",null,"MELBOURNE CITY MAIL CENTRE","Vic",8001,"NO","NO","NO","NO","NO","CBD","Urban","Short rural","Long rural",null,"YES","NO","AusNet (T)"]
[null,"Australian Distribution Co.","Australian Distribution Co.",11222333444,"UID_Test","NSW","Electricity","Distribution","Revenue cap","Financial","June",5,5,5,2,"123 Straight Street",null,"SYDNEY","NSW",2000,"PO Box 123",null,"SYDNEY","NSW",2000,"YES","YES","YES","YES","NO","CBD","Urban","Short rural","Long rural",null,"NO","YES","Australian Distribution Co."]
{"$rows_left_out":108}
{"sheet":"AER ETL","index":7,"n_rows":146,"n_cols":10,"rows_kept":146,"cut":false,"hidden":true,"merged":[[33,37,33,58],[34,37,34,58],[35,37,35,58],[33,68,33,89],[34,68,34,89],[35,68,35,89],[13,4,13,8],[72,1,74,1],[12,0,16,0],[19,0,26,0],[27,0,32,0],[35,0,60,0],[15,2,15,4]]}
[null,"AER ETL INFORMATION"]
[]
[null,"USES NAMED RANGES FLAG","yes","dms_Defined_Names_Used"]
[]
[null,"IF THIS IS AN ABC RIN - make sure the the named range CRY is applied and the named range dms_dollar_nom_UOM is applied"]
[null,"IF THIS IS A RESET RIN - make sure the named ranges CRY and dms_dollar_nom_UOM are NOT present in the workbook"]
[null,"FOR ABC RINS THAT SPAN MULTIPLE YEARS - make sure MultiYear Flag is set and final year entered as required"]
[]
[null,"Full trading name",{"$f":"INDEX(dms_TradingNameFull_List,MATCH(dms_TradingName,dms_TradingName_List))","v":"Powercor Australia"},null,"dms_TradingNameFull"]
[null,"Trading name",{"$f":"dms_TradingName","v":"Powercor Australia"}]
[null,"Unique ID",{"$f":"INDEX(dms_UID_List,MATCH(dms_TradingName,dms_TradingName_List))","v":"EDDVIC400"}]
["Selected here","Model / RIN","Reset","dms_Model"]
["Read from Business & other details","Source","Regulatory proposal","dms_Source",{"$f":"IF(dms_Model=\"Reset\", \"Make sure you have set Reg Proposal as source\",\"\")","v":"Make sure you have set Reg Proposal as source"}]
[null,"Data quality","Consolidated","For DB purposes this is always Consoldiated"]
[null,"Data status","Public","For DB purposes this is always Public"]
{"$rows_left_out":131}