{"text_format":"1","workbook":"xlsx","n_sheets":9,"sheets":["Cover","Summary","Result tables","Option 3","Option 2","Option 1","Unit rate buildup","Labour costs","Replacement program breakdown"],"not_rendered":{"charts":2,"images":2,"macros":0,"external_links":0,"defined_names":4,"comments":0,"pivot_tables":0},"unopened":[],"bounds":{"document_bytes":16777216,"sheet_cells":100000,"rows_first":2000,"rows_last":500,"rows_between":2000,"halvings":0,"cell_chars":16384,"cell_head_chars":4096},"cells_cut":0,"cells_raw":0,"read":"whole","date_system":"1900"}

{"sheet":"Cover","index":0,"n_rows":8,"n_cols":4,"rows_kept":8,"cut":false,"hidden":false,"merged":[]}
[]
[null,null,"United Energy"]
[null,null,"Regulatory proposal 2026-31"]
[]
[null,null,{"$f":"REPLACE(LEFT(_xlfn.TEXTAFTER(CELL(\"filename\"),\" - \",1),FIND(\"Jan2025\",_xlfn.TEXTAFTER(CELL(\"filename\"),\" - \"),1)-4),1,1,UPPER(LEFT(LEFT(_xlfn.TEXTAFTER(CELL(\"filename\"),\" - \",1),FIND(\"Jan2025\",_xlfn.TEXTAFTER(CELL(\"filename\"),\" - \"),1)-4),1)))","v":"Metering business case"}]
[null,null,"Model number:",{"$f":"LEFT(_xlfn.TEXTAFTER(CELL(\"filename\"),\" MOD \"),FIND(\" - \",_xlfn.TEXTAFTER(CELL(\"filename\"),\" MOD \"),1)-1)","v":"12.04"}]
[]
[null,null,"2025-01-31"]

{"sheet":"Summary","index":1,"n_rows":31,"n_cols":4,"rows_kept":31,"cut":false,"hidden":false,"merged":[]}
[]
[null,"Proactive meter replacement - Cost model"]
[]
[]
[null,"Options summary - NPV"]
[]
[null,"Description","NPV","NPV net"]
[null,{"$f":"'Option 3'!B2","v":"Option 3 - Proactive delayed"},{"$f":"'Option 3'!D50","v":284091606.10944033},{"$f":"$C$10-C8","v":6414136.2160415649}]
[null,{"$f":"'Option 2'!B2","v":"Option 2 - Proactive"},{"$f":"'Option 2'!D50","v":274662245.71917748},{"$f":"$C$10-C9","v":15843496.606304407}]
[null,{"$f":"'Option 1'!B2","v":"Option 1 - Reactive"},{"$f":"'Option 1'!D35","v":290505742.32548189},"-"]
[]
[]
[null,"WACC"]
[null,3.6400000000000002E-2,3.6400000000000002E-2]
[]
[]
[]
[null,"Waterfall - NPV"]
[]
[]
{"$rows_left_out":12}
{"sheet":"Result tables","index":2,"n_rows":21,"n_cols":5,"rows_kept":21,"cut":false,"hidden":false,"merged":[]}
[]
[null,"NPV Results"]
[]
[]
[null,"United Energy"]
[]
[null,"option ","gross npv","net npv*","bcr*"]
[null,"Option1 - Base Case ",290505742.32548189,"N/A","N/A"]
[null,"Option 2",274664437.69732958,{"$f":"C8-C9","v":15841304.628152311},{"$f":"C8/C9","v":1.0576751208163646}]
[null,"Option 3",284091606.10944033,{"$f":"C8-C10","v":6414136.2160415649},{"$f":"C8/C10","v":1.0225777040859512}]
[]
[]
[null,null,"Reactive","Proactive","Move to 2031"]
[null,"Sensitivity analysis","Base Case","Option 2","Option 3"]
[null,"Adopting alternative failure rate profile option 1",358032836.04069787,317068863.71231252,347155477.29951739]
[null,"Adopting alternative failure rate profile option 2",193430852.74088576,243192313.17925668,236565776.62614363]
[null,"+10% change in reactive replacement installation costs",303740876.73315924,281267610.76492435,296599904.96216768]
[null,"-10% change in reactive replacement installation costs",272941915.80650109,270515812.26807529,276874119.27110994]
[null,"\"+10% change in tech capital costs\"",301776055.43348414,293237662.40837073,302592149.59181076]
[null,"\"-10% change in tech capital costs\"",274906737.10617632,258545760.62462881,270881874.6414668]
{"$rows_left_out":2}
{"sheet":"Option 3","index":3,"n_rows":72,"n_cols":18,"rows_kept":72,"cut":false,"hidden":false,"merged":[[7,1,12,1],[14,1,19,1],[24,1,29,1],[31,1,36,1]]}
[]
[null,"Option 3 - Proactive delayed"]
[]
[null,"Expenditure / benefits profile"]
[]
[null,null,null,1,2,3,4,5,6,7,8,9,10,11,12,13,14,15]
[null,null,null,"2026-27","2027-28","2028-29","2029-30","2030-31","2031-32","2032-33","2033-34","2034-35","2035-36","2036-37","2037-38","2038-39","2039-40","2040-41"]
[null," Pro-active Labour Costs","AMI 1Ph 1e",0,0,0,0,0,3936661.3852273338,4294518.5748501299,4294518.5748501299,4294518.5748501299,4294518.5748501299,3041960.3363261991,894701.04890113452,0,0,0]
[null,null,"AMI 1Ph 1e + c",0,0,0,0,0,89319.110295335893,97449.588475665572,97449.588475665572,97449.588475665572,97449.588475665572,68992.914844511732,20326.195450824165,0,0,0]
[null,null,"AMI 1Ph 2e + C",0,0,0,0,0,374118.14598345506,408150.00465254922,408150.00465254922,408150.00465254922,408150.00465254922,289096.57415486482,85021.571828590226,0,0,0]
[null,null,"AMI 3Ph",0,0,0,0,0,1252376.1272842651,1366287.4246682525,1366287.4246682525,1366287.4246682525,1366287.4246682525,967678.90181674622,284697.2254675189,0,0,0]
[null,null,"AMI 3Ph + C",0,0,0,0,0,46990.435620706026,51365.407212978658,51365.407212978658,51365.407212978658,51365.407212978658,36296.060617372932,10694.375003333096,0,0,0]
[null,null,"AMI 3Ph CT",0,0,0,0,0,179326.24749284366,194972.16170362866,194972.16170362866,194972.16170362866,194972.16170362866,138406.16417232901,40920.083320514663,0,0,0]
[null,null,null,{"$f":"SUM(D8:D13)","v":0},{"$f":"SUM(E8:E13)","v":0},0,0,0,5878791.4519039383,6412743.1615632046,6412743.1615632046,6412743.1615632046,6412743.1615632046,4542430.9519320242,1336360.499971916,0,0,0]
[null,"Pro-active Material Costs","AMI 1Ph 1e",0,0,0,0,0,10030959.318206139,10942810.899930777,10942810.899930777,10942810.899930777,10942810.899930777,7751182.3840857642,2279776.9341203757,0,0,0]
[null,null,"AMI 1Ph 1e + c",0,0,0,0,0,262330.64986095938,286209.90277418069,286209.90277418069,286209.90277418069,286209.90277418069,202632.51757790623,59698.132283053186,0,0,0]
[null,null,"AMI 1Ph 2e + C",0,0,0,0,0,1250391.606525375,1364134.1525396362,1364134.1525396362,1364134.1525396362,1364134.1525396362,966229.34139759664,284162.26512777852,0,0,0]
[null,null,"AMI 3Ph",0,0,0,0,0,3514154.1550279548,3833788.0495789512,3833788.0495789512,3833788.0495789512,3833788.0495789512,2715296.7542795893,798857.40074836544,0,0,0]
[null,null,"AMI 3Ph + C",0,0,0,0,0,138162.75740998168,151026.18654815241,151026.18654815241,151026.18654815241,151026.18654815241,106718.81951667552,31443.937893306178,0,0,0]
[null,null,"AMI 3Ph CT",0,0,0,0,0,182917.00945698764,198876.21162437581,198876.21162437581,198876.21162437581,198876.21162437581,141177.55763458778,41739.45182239986,0,0,0]
{"$rows_left_out":53}
{"sheet":"Option 2","index":4,"n_rows":72,"n_cols":18,"rows_kept":72,"cut":false,"hidden":false,"merged":[[7,1,12,1],[14,1,19,1],[24,1,29,1],[31,1,36,1]]}
[]
[null,"Option 2 - Proactive"]
[]
[null,"Expenditure / benefits profile"]
[]
[null,null,null,1,2,3,4,5,6,7,8,9,10,11,12,13,14,15]
[null,null,null,"2026-27","2027-28","2028-29","2029-30","2030-31","2031-32","2032-33","2033-34","2034-35","2035-36","2036-37","2037-38","2038-39","2039-40","2040-41"]
[null," Pro-active Labour Costs","AMI 1Ph 1e",3936661.3852273338,4294518.5748501299,4294518.5748501299,4294518.5748501299,4294518.5748501299,4294518.5748501299,4294518.5748501299,4294518.5748501299,2862973.6666706563,715714.37924559147,0,0,0,0,0]
[null,null,"AMI 1Ph 1e + c",89319.110295335893,97449.588475665572,97449.588475665572,97449.588475665572,97449.588475665572,97449.588475665572,97449.588475665572,97449.588475665572,64927.675754346899,16260.956360659331,0,0,0,0,0]
[null,null,"AMI 1Ph 2e + C",374118.14598345506,408150.00465254922,408150.00465254922,408150.00465254922,408150.00465254922,408150.00465254922,408150.00465254922,408150.00465254922,272138.71966446296,68063.717338188348,0,0,0,0,0]
[null,null,"AMI 3Ph",1252376.1272842651,1366287.4246682525,1366287.4246682525,1366287.4246682525,1366287.4246682525,1366287.4246682525,1366287.4246682525,1366287.4246682525,910804.27111720201,227660.55878307574,0,0,0,0,0]
[null,null,"AMI 3Ph + C",46990.435620706026,51365.407212978658,51365.407212978658,51365.407212978658,51365.407212978658,51365.407212978658,51365.407212978658,51365.407212978658,34189.592813686111,8587.9071996462735,0,0,0,0,0]
[null,null,"AMI 3Ph CT",178724.48156165969,194972.16170362875,194972.16170362875,194972.16170362875,194972.16170362875,194972.16170362875,194972.16170362875,194972.16170362875,129981.4411357525,32495.360283938124,0,0,0,0,0]
[null,null,null,{"$f":"SUM(D8:D13)","v":5878189.6859727548},{"$f":"SUM(E8:E13)","v":6412743.1615632046},6412743.1615632046,6412743.1615632046,6412743.1615632046,6412743.1615632046,{"$f":"SUM(J8:J13)","v":6412743.1615632046},6412743.1615632046,4275015.367156107,1068782.8792110994,{"$f":"SUM(N8:N13)","v":0},0,0,0,0]
[null,"Pro-active Material Costs","AMI 1Ph 1e",10030959.318206139,10942810.899930777,10942810.899930777,10942810.899930777,10942810.899930777,10942810.899930777,10942810.899930777,10942810.899930777,7295108.613414662,1823703.1634492737,0,0,0,0,0]
[null,null,"AMI 1Ph 1e + c",262330.64986095944,286209.90277418069,286209.90277418069,286209.90277418069,286209.90277418069,286209.90277418069,286209.90277418069,286209.90277418069,190692.8911212956,47758.505826442546,0,0,0,0,0]
[null,null,"AMI 1Ph 2e + C",1250391.6065253753,1364134.1525396362,1364134.1525396362,1364134.1525396362,1364134.1525396362,1364134.1525396362,1364134.1525396362,1364134.1525396362,909552.16829834029,227485.09202852217,0,0,0,0,0]
[null,null,"AMI 3Ph",3514154.1550279548,3833788.0495789512,3833788.0495789512,3833788.0495789512,3833788.0495789512,3833788.0495789512,3833788.0495789512,3833788.0495789512,2555707.1426332169,638813.11784374132,0,0,0,0,0]
[null,null,"AMI 3Ph + C",138162.75740998168,151026.18654815241,151026.18654815241,151026.18654815241,151026.18654815241,151026.18654815241,151026.18654815241,151026.18654815241,100525.31659829702,25250.434974927688,0,0,0,0,0]
[null,null,"AMI 3Ph CT",182303.19398901117,198876.21162437581,198876.21162437581,198876.21162437581,198876.21162437581,198876.21162437581,198876.21162437581,198876.21162437581,132584.14108291719,33146.035270729299,0,0,0,0,0]
{"$rows_left_out":53}
{"sheet":"Option 1","index":5,"n_rows":50,"n_cols":18,"rows_kept":50,"cut":false,"hidden":false,"merged":[]}
[]
[null,"Option 1 - Reactive"]
[]
[null,"Expenditure / benefits profile"]
[]
[null,null,null,1,2,3,4,5,6,7,8,9,10,11,12,13,14,15]
[null,null,null,"2026-27","2027-28","2028-29","2029-30","2030-31","2031-32","2032-33","2033-34","2034-35","2035-36","2036-37","2037-38","2038-39","2039-40","2040-41"]
[null,"Labour Costs","AMI 1Ph 1e",2239922.0706921774,3552344.417414011,5120289.8668985348,6863907.4495324092,8686966.5096277613,10480951.626940819,12131204.998949865,13525525.776044356,14562769.39671406,15170046.257927313,15310092.573864557,14982908.344525792,14227804.816489892,13119719.053547839,11719665.386327261]
[null,null,"AMI 1Ph 1e + c",50777.026831047529,80669.953917067454,116295.77112917339,155607.01770804889,196965.72504624084,237914.9402325695,275178.72605212854,306709.62174560165,330460.16655367223,343973.40756516071,347249.34478006698,339878.48604652786,322679.81566826982,297700.7944046093,265760.40655927296]
[null,null,"AMI 1Ph 2e + C",212935.91896890901,337831.02528721141,486886.16856544773,652320.99791821546,825536.17815638566,996294.40548337623,1153129.8996470149,1285395.8646988564,1384083.4732979084,1441821.8667106319,1455335.1077221204,1424213.7041805107,1352552.5776044354,1246903.6024237075,1113818.6530681395]
[null,null,"AMI 3Ph",646662.56091065006,1025740.6138582724,1478456.2639585109,1981992.2275866114,2508864.0494673015,3026920.1026747907,3503490.1856554542,3905904.0968556665,4205640.231744484,4380918.4559528241,4421367.2769239796,4326986.6946579497,4108666.7763392786,3788706.2309648832,3384736.595881165]
[null,null,"AMI 3Ph + C",24373.007508260267,38374.522459814034,55487.485178379757,74674.746408286766,94380.582266029116,113567.84349593613,131717.95547017251,146756.61967739693,158165.26148977407,164388.15702379798,165943.88090730394,162832.43314029198,154535.2390949268,142608.02265471432,127050.78381965458]
[null,null,"AMI 3Ph CT",32094.182996482101,50815.789744429989,73549.169366938149,98288.435426726428,124364.95911136814,150441.48279600983,173843.4912309447,193902.35560374602,208612.18947713365,217304.36403868088,219310.25047596102,214629.84878897405,203931.78779014669,187884.69629190562,167825.8319191043]
[null,null,"Percentage failure",0.01,1.6E-2,2.4E-2,3.2000000000000001E-2,0.04,4.8000000000000001E-2,5.6000000000000001E-2,6.3E-2,6.7000000000000004E-2,7.0000000000000007E-2,7.0999999999999994E-2,6.9000000000000006E-2,6.6000000000000003E-2,6.0999999999999999E-2,5.3999999999999999E-2]
[null,null,"Efficiency",{"$f":"VLOOKUP(D14,'Labour costs'!$B$81:$D$201,2,FALSE)","v":1},{"$f":"VLOOKUP(E14,'Labour costs'!$B$81:$D$201,2,FALSE)","v":1},{"$f":"VLOOKUP(F14,'Labour costs'!$B$81:$D$201,2,FALSE)","v":0.99315525876460764},{"$f":"VLOOKUP(G14,'Labour costs'!$B$81:$D$201,2,FALSE)","v":0.97946577629382303},{"$f":"VLOOKUP(H14,'Labour costs'!$B$81:$D$201,2,FALSE)","v":0.96577629382303842},{"$f":"VLOOKUP(I14,'Labour costs'!$B$81:$D$201,2,FALSE)","v":0.95208681135225381},{"$f":"VLOOKUP(J14,'Labour costs'!$B$81:$D$201,2,FALSE)","v":0.93839732888146909},{"$f":"VLOOKUP(K14,'Labour costs'!$B$81:$D$201,2,FALSE)","v":0.92641903171953255},{"$f":"VLOOKUP(L14,'Labour costs'!$B$81:$D$201,2,FALSE)","v":0.91957429048414019},{"$f":"VLOOKUP(M14,'Labour costs'!$B$81:$D$201,2,FALSE)","v":0.914440734557596},{"$f":"VLOOKUP(N14,'Labour costs'!$B$81:$D$201,2,FALSE)","v":0.91272954924874794},{"$f":"VLOOKUP(O14,'Labour costs'!$B$81:$D$201,2,FALSE)","v":0.91615191986644406},{"$f":"VLOOKUP(P14,'Labour costs'!$B$81:$D$201,2,FALSE)","v":0.92128547579298836},{"$f":"VLOOKUP(Q14,'Labour costs'!$B$81:$D$201,2,FALSE)","v":0.92984140233722878},{"$f":"VLOOKUP(R14,'Labour costs'!$B$81:$D$201,2,FALSE)","v":0.94181969949916522}]
[null,null,null,{"$f":"SUM(D8:D13)*D15","v":3206764.7679075263},{"$f":"SUM(E8:E13)*E15","v":5085776.3226808067},7280786.168547906,9625005.3524478488,12011435.100377358,14287100.761345379,16298615.243677523,17939358.165512733,19172876.332964562,19860237.665983945,20006391.380128779,19652786.653732277,18766742.693684224,17465696.809516225,15802658.676996179]
[null,"Material Costs","AMI 1Ph 1e",1654515.3131781074,2623934.2489616238,3782094.9681862989,5070015.6635267707,6416615.6953858081,7741740.2999622775,8960697.6513530947,9990610.7484959569,10756769.302112071,11205333.50859162,11308778.524516102,11067104.349885516,10509348.182152348,9690862.1789603978,8656714.4905223828]
[null,null,"AMI 1Ph 1e + c",50928.85903061289,80911.171201860809,116643.51584430695,156072.30993252338,197554.68704616776,238626.34755472653,276001.55861751502,307626.73720910528,331448.30030406942,345001.94827189378,348287.68111257849,340894.78222103789,323644.68480744323,298590.97189722233,266555.07670054649]
[null,null,"AMI 1Ph 2e + C",226109.65678196054,358731.66700984124,517008.4267572136,692678.23702627525,876609.74629313929,1057932.29798175,1224470.7567269248,1364919.6396895656,1469712.7690827434,1531023.2721716983,1545372.5388520919,1512325.7428608823,1436231.1468284917,1324045.9709635959,1182727.4354748705]
[null,null,"AMI 3Ph",599642.96045672253,951157.79934514617,1370955.9585101171,1837879.2260349588,2326441.5739291292,2806829.1581282197,3248747.2661151704,3621901.1853729226,3899843.1510056295,4062376.6880019186,4099884.4273087545,4012366.3689261372,3809920.7503597536,3513224.915073629,3138628.3904579217]
{"$rows_left_out":31}
{"sheet":"Unit rate buildup","index":6,"n_rows":2,"n_cols":2,"rows_kept":2,"cut":false,"hidden":false,"merged":[]}
[]
[null,"Information in this sheet has been deleted because it contains confidential pricing information"]

{"sheet":"Labour costs","index":7,"n_rows":201,"n_cols":11,"rows_kept":201,"cut":false,"hidden":false,"merged":[[37,7,37,8],[36,7,36,8],[52,7,52,8],[53,7,53,8],[70,7,92,11]]}
[]
[null,"Labour cost estimation"]
[]
[null,"Labour rates",2024,"2026-06-01",null,null,null,"Escallation factor to $2026"]
[null,"Specialist metering (Office hours)",175.90826169265964,{"$f":"$H$5*C5","v":199.02405199438837},null,null,null,{"$f":"1.025*1.025*1.025*1.025*1.025","v":1.1314082128906247}]
[null,"Specialist metering (After hours)",234.09907576364884,{"$f":"C6*$H$5","v":264.86161694909686}]
[null,"Faults (Linesman) rate",197.86936413283024,{"$f":"C7*$H$5","v":223.87102365932972}]
[]
[null,"Electrician charge out rates",126.74,{"$f":"C9*$H$5","v":143.39467690175778}]
[null,"Project manager",159.28,{"$f":"C10*$H$5","v":180.2107001492187}]
[]
[]
[null,"Assumptions",null,null,null,null,null,"Blended rates","Overall percentage"]
[null,"Percentage of failed meters will result in faults truck (i.e. hot water / heating complaints)",null,0.1,null,null,null,{"$f":"D14*(2*D7)","v":44.77420473186595},{"$f":"H14/H19","v":0.17239401489386924}]
[null,"Percentage of meters that have an antenna connected",null,0.05]
[null,"Percentage time increase for 3 phase tasks",null,0.8]
[null,"Percentage of jobs that require 2 person crews",null,0.15,null,null,null,{"$f":"D17*(2*D5)","v":59.707215598316509}]
[null,"Percentage refusals and double visits",null,0.03,null,null,null,{"$f":"D18*(2*D5)","v":11.941443119663301}]
[null,null,null,null,null,null,null,{"$f":"((1-(D14+D17+D18))*D5)+SUM(H14:H18)","v":259.72018088580541}]
[]
{"$rows_left_out":182}
{"sheet":"Replacement program breakdown","index":8,"n_rows":215,"n_cols":15,"rows_kept":215,"cut":false,"hidden":false,"merged":[]}
[]
[null,"Program level costs"]
[]
[null,"Assumptions"]
[null,"Working days per year",251]
[null,"Project duration (days)",{"$f":"C5*5","v":1255}]
[null,"Labour rate - Project management (daily)",900]
[null,"Labour rate - SME metering (daily)",1200]
[]
[]
[null,"Project element (Activity","Category","Scope","Time FTE","Duration","Cost","Notes",null,"2026-27","2027-28","2028-29","2029-30","2030-31"]
[null,null,null,null,null,null,null,null,null,0.2,0.4,0.6,0.8,1]
[null,"1.0 ProgramManagement ","High level category"]
[null,"1.1 Industry Planning & Liaison","Program management","Partially in scope",0.2,1,{"$f":"F14*E14*$C$7*$C$6","v":225900},"There will be a some industry communications etc",null,{"$f":"IF($F14>=$J$12,1,$F14*5)*$C$5*$C$7*$E14","v":45180},{"$f":"IF($F14>=K$12,1,IF((($F14-K$12)>=0),($F14-K$12)*5,0))*$C$5*$C$7*$E14","v":45180},{"$f":"IF($F14>=L$12,1,IF((($F14-L$12)>=0),($F14-L$12)*5,0))*$C$5*$C$7*$E14","v":45180},{"$f":"IF($F14>=M$12,1,IF((($F14-M$12)>=0),($F14-M$12)*5,0))*$C$5*$C$7*$E14","v":45180},{"$f":"IF($F14>=N$12,1,IF((($F14-N$12)>=0),($F14-N$12)*5,0))*$C$5*$C$7*$E14","v":45180}]
[null,"1.2 PMO: ProgramEstablishment ","Program management","In scope",2,0.2,{"$f":"F15*E15*$C$7*$C$6","v":451800},"Establish the PMO in the first year",null,451800,{"$f":"IF($F15>=K$12,1,IF((($F15-K$12)>=0),($F15-K$12)*5,0))*$C$5*$C$7*$E15","v":0},0,0,0]
[null,"1.3 PMO: ProgramOperation Mode ","Program management","In scope",1,0.8,{"$f":"F16*E16*$C$7*$C$6","v":903600},null,null,225900,225900,225900,225900,0]
[null,"1.4 PMO: ProgramClose-Down","Program management","Out of scope",null,null,null,"Will not close down until next EDPR",null,0,0,0,0,0]
[null,"1.5 ProgramManagement Tools ","Program management","In scope",0,0.2,{"$f":"F18*E18*$C$7*$C$6","v":0},"Should already have tools, no cost",null,0,0,0,0,0]
[null,"1.6 Commercial & Procurement ","Procurement","In scope",0.5,0.2,{"$f":"F19*E19*$C$7*$C$6","v":112950},"Only in the first year",null,112950,0,0,0,0]
[null,"1.7 Management of the AMI Program","Program management","In scope",1,1,{"$f":"F20*E20*$C$7*$C$6","v":1129500},"PMO manager",null,225900,225900,225900,225900,225900]
{"$rows_left_out":195}