{"text_format":"1","workbook":"xlsx","n_sheets":5,"sheets":["Index","Notes & Assumptions","Inputs","Calculations","Outputs"],"not_rendered":{"charts":0,"images":0,"macros":1,"external_links":0,"defined_names":139,"comments":0,"pivot_tables":0},"unopened":[],"bounds":{"document_bytes":16777216,"sheet_cells":100000,"rows_first":2000,"rows_last":500,"rows_between":2000,"halvings":0,"cell_chars":16384,"cell_head_chars":4096},"cells_cut":0,"cells_raw":0,"read":"whole","date_system":"1900"}

{"sheet":"Index","index":0,"n_rows":22,"n_cols":11,"rows_kept":22,"cut":false,"hidden":false,"merged":[]}
["Index and File Details"]
[]
[null,"Index",null,null,null,null,null,"File Details"]
[]
[null,"Inputs",null,"Calculations",null,"Outputs",null,null,"Model","Transgrid | CWOREZ Non-Contestable Opex Forecast Model"]
[null,null,null,null,null,null,null,null,"Author","Transgrid"]
[null,"Notes & Assumptions",null,"Calculations",null,"Outputs",null,null,"Revision","2025-07-24"]
[null,{"$f":"Inputs!A1","v":"Inputs"},null,null,null,null,null,null,"Status","Revenue Proposal"]
[]
[]
[]
[null,"Model Checks",null,null,null,null,null,"Instructions"]
[]
[null,"Worksheet",null,null,null,null,null,null,"Input Sheets"]
[null,{"$f":"B7","v":"Notes & Assumptions"},null,"N/A",null,null,null,null,"Fill in any cells marked as input cells as seen on the right =>",null,"user input"]
[null,{"$f":"B8","v":"Inputs"},null,"N/A",null,null,null,null,"Historical / Not applicable"]
[null,{"$f":"D7","v":"Calculations"},null,{"$f":"IF(SUM(Calculations!A2:A97)=0,0,1)","v":0},null,null,null,null,"Cells not marked as inputs should not be modified."]
[null,{"$f":"F7","v":"Outputs"},null,{"$f":"IF(SUM(Outputs!A3:A121)=0,0,1)","v":0},null,null,null,null,"Confidential information",null,"user input"]
[]
[null,"Total Error Check",null,{"$f":"IF(SUM(D15:D18)=0,0,1)","v":0}]
[]
[null,"End"]

{"sheet":"Notes & Assumptions","index":1,"n_rows":12,"n_cols":5,"rows_kept":12,"cut":false,"hidden":false,"merged":[]}
["Assumptions & Notes"]
[]
[null,null,null,null,"User inputs in cells coloured like this"]
[null,null,"*",null,"1.     Inputs and calculations are in $. Some outputs are $million."]
[null,null,"*",null,"2.     Financial years are recorded in the Opex Forecast Model as tax years (e.g. 2017/18 is shown as 2018, 2018/19 is shown as 2019)"]
[null,null,"*",null,"3.     Escalation is treated as follows:"]
[null,null,null,null,"a.    CPI escalation and Commodity escalation are treated separately. "]
[]
[]
["Modifications"]
["Date","Version",null,"Who","Notes"]
["2023-06-26","v1.1",null,null,"Initial model development"]

{"sheet":"Inputs","index":2,"n_rows":188,"n_cols":31,"rows_kept":188,"cut":false,"hidden":false,"merged":[[5,2,5,5],[32,16,32,21],[12,12,12,21],[18,12,18,21],[87,23,87,28],[87,5,87,7],[32,5,32,7],[182,16,182,21],[166,16,166,21],[156,16,156,21],[87,16,87,21],[32,23,32,25],[174,16,174,21]]}
["Inputs"]
[]
[]
[null,"Output Reporting Format and Year"]
[null,"Real"]
[null,2026,"The Financial Year that results are reported in."]
[]
[null,{"$f":" IF(Real_or_Nom=\"Real\", \"Real $\" & Report_Year, \"$ Nominal\")","v":"Real $2026"}]
[]
[null,"Indexation and escalation"]
[]
[]
[null,"Forecasts",null,null,null,null,null,null,null,null,null,null,"Rates"]
[null,"Item","Source","Units",null,null,null,null,null,null,null,null,2022,2023,{"$f":"N14+1","v":2024},2025,2026,2027,2028,2029,{"$f":"T14+1","v":2030},{"$f":"U14+1","v":2031}]
[null,"Actual / Forecast Inflation ","ABS / RBA / PTRM","%",null,null,null,null,null,null,null,null,6.1447811447811418E-2,6.0269627279936566E-2,3.8145100972326373E-2,2.4E-2,3.2000000000000001E-2,2.7798093009959057E-2,2.7798093009959057E-2,2.7798093009959057E-2,2.7798093009959057E-2,2.7798093009959057E-2,null,"Note: Currently set to June to June unlagged for actual/estimates and PTRM for forecasts"]
[null,"Real labour escalation","Transgrid AER FD","%",null,null,null,null,null,null,null,null,null,-3.4704503367676172E-2,3.9046564755527329E-3,1.3076482545953276E-2,1.1546438954636147E-2,4.3304575862308627E-3,3.00941333753012E-3,{"$f":"AVERAGE($R$16:$S$16)","v":3.6699354618804914E-3},{"$f":"AVERAGE($R$16:$S$16)","v":3.6699354618804914E-3},{"$f":"AVERAGE($R$16:$S$16)","v":3.6699354618804914E-3},null,"Note: Based on Final Decision values applied to both the opex and capex models"]
[]
[]
[null,"Cumulative factors",null,null,null,null,null,null,null,null,null,null,"Cumulative Factors"]
[null,"Item","Source","Units",null,null,null,null,null,null,null,null,{"$f":"M$14","v":2022},{"$f":"N$14","v":2023},{"$f":"O$14","v":2024},2025,2026,2027,2028,2029,2030,2031]
[null,"Nominal (mid year) to Real 2026 (end year)","Calculated","Factor",null,null,null,null,null,null,null,null,{"$f":"N21*(1+N15)^0.5*(1+M15)^0.5","v":1.1984042938974993},{"$f":"O21*(1+O15)^0.5*(1+N15)^0.5","v":1.1296551150404281},{"$f":"P21*(1+P15)^0.5*(1+O15)^0.5","v":1.0767346356483898},{"$f":"Q21*(1+Q15)^0.5*(1+P15)^0.5","v":1.0443105744940056},{"$f":"(1+Q15)^0.5","v":1.0158740079360236},{"$f":"Q21/(1+Q15)^0.5/(1+R15)^0.5","v":0.98638417536075473},{"$f":"R21/(1+R15)^0.5/(1+S15)^0.5","v":0.95970617387708745},{"$f":"S21/(1+S15)^0.5/(1+T15)^0.5","v":0.93374971252042205},{"$f":"T21/(1+T15)^0.5/(1+U15)^0.5","v":0.90849527632989502},{"$f":"U21/(1+U15)^0.5/(1+V15)^0.5","v":0.88392387815132079},null,"Note: this index converts from nominal mid year dollars for each year between 2021-22 to 2030-31 to dollars as at the end of 2025-26 (i.e., Real 2026, 30 June 2026)."]
[null,"Nominal (end year) to Real 2026 (end year)","Calculated","Factor",null,null,null,null,null,null,null,null,{"$f":"N22*(1+N15)","v":1.1631990356859641},{"$f":"O22*(1+O15)","v":1.0970785220643235},{"$f":"P22*(1+P15)","v":1.0567680000000002},{"$f":"Q22*(1+Q15)","v":1.032},1,{"$f":"Q22/(1+R15)","v":0.97295374140211632},{"$f":"R22/(1+S15)","v":0.94663898290837623},{"$f":"S22/(1+T15)","v":0.92103594017779866},{"$f":"T22/(1+U15)","v":0.89612536396180498},{"$f":"U22/(1+V15)","v":0.87188852563197139}]
[null,"Labour escalation from 2024","Calculated","Factor",null,null,null,null,null,null,null,null,null,null,1,{"$f":"O23*(1+P16)","v":1.0130764825459533},1.0247739083080478,1.0292116482534519,1.032308971514847,1.0360974788170267,1.0398998896965024,1.0437162551785053]
[]
[]
[null,"Opex forecast sensitivities"]
[]
[null,"Apply real labour escalation?","Yes"]
[]
[]
{"$rows_left_out":159}
{"sheet":"Calculations","index":3,"n_rows":97,"n_cols":11,"rows_kept":97,"cut":false,"hidden":false,"merged":[]}
["Calculations"]
[]
[null,{"$f":"Inputs!$B$31","v":"Maintenance expenditure"},null,null,null,null,null,null,null,null,"Total"]
[null,"Activity","Dollar basis","Units",{"$f":"Inputs!Q$20","v":2026},{"$f":"Inputs!R$20","v":2027},{"$f":"Inputs!S$20","v":2028},{"$f":"Inputs!T$20","v":2029},{"$f":"Inputs!U$20","v":2030},{"$f":"Inputs!V$20","v":2031}]
[]
[null,{"$f":"Inputs!B35","v":"Substations"}]
[null,"Labour",{"$f":"Inputs!$B$8","v":"Real $2026"},"Dollars",{"$f":"SUM(Inputs!Q$36:Q$64*Inputs!$Y$36:$Y$64*(1+Inputs!$L$36:$L$64))*INDEX(IF(Inputs!$H$35=\"Mid\",Inputs!$N$21:$V$21,Inputs!$N$22:$V$22),MATCH(Inputs!$F$35,Inputs!$N$20:$V$20,0))","v":0},{"$f":"SUM(Inputs!R$36:R$64*Inputs!$Y$36:$Y$64*(1+Inputs!$L$36:$L$64))*INDEX(IF(Inputs!$H$35=\"Mid\",Inputs!$N$21:$V$21,Inputs!$N$22:$V$22),MATCH(Inputs!$F$35,Inputs!$N$20:$V$20,0))","v":0},{"$f":"SUM(Inputs!S$36:S$64*Inputs!$Y$36:$Y$64*(1+Inputs!$L$36:$L$64))*INDEX(IF(Inputs!$H$35=\"Mid\",Inputs!$N$21:$V$21,Inputs!$N$22:$V$22),MATCH(Inputs!$F$35,Inputs!$N$20:$V$20,0))","v":64642.210806582603},{"$f":"SUM(Inputs!T$36:T$64*Inputs!$Y$36:$Y$64*(1+Inputs!$L$36:$L$64))*INDEX(IF(Inputs!$H$35=\"Mid\",Inputs!$N$21:$V$21,Inputs!$N$22:$V$22),MATCH(Inputs!$F$35,Inputs!$N$20:$V$20,0))","v":408485.18476416427},{"$f":"SUM(Inputs!U$36:U$64*Inputs!$Y$36:$Y$64*(1+Inputs!$L$36:$L$64))*INDEX(IF(Inputs!$H$35=\"Mid\",Inputs!$N$21:$V$21,Inputs!$N$22:$V$22),MATCH(Inputs!$F$35,Inputs!$N$20:$V$20,0))","v":303570.96603384166},{"$f":"SUM(Inputs!V$36:V$64*Inputs!$Y$36:$Y$64*(1+Inputs!$L$36:$L$64))*INDEX(IF(Inputs!$H$35=\"Mid\",Inputs!$N$21:$V$21,Inputs!$N$22:$V$22),MATCH(Inputs!$F$35,Inputs!$N$20:$V$20,0))","v":78355.781940615096},{"$f":"SUM(E7:J7)","v":855054.14354520361}]
[null,"Labour escalation",{"$f":"Inputs!$B$8","v":"Real $2026"},"Dollars",{"$f":"E7*(Inputs!Q$23-1)","v":0},{"$f":"F7*(Inputs!R$23-1)","v":0},{"$f":"G7*(Inputs!S$23-1)","v":2088.5233476066132},{"$f":"H7*(Inputs!T$23-1)","v":14745.285304093673},{"$f":"I7*(Inputs!U$23-1)","v":12112.448059810951},{"$f":"J7*(Inputs!V$23-1)","v":3425.4213580272472},{"$f":"SUM(E8:J8)","v":32371.678069538488}]
[null,"Materials",{"$f":"Inputs!$B$8","v":"Real $2026"},"Dollars",{"$f":"SUM(Inputs!Q$36:Q$64*Inputs!$Z$36:$Z$64*(1+Inputs!$L$36:$L$64))*INDEX(IF(Inputs!$H$35=\"Mid\",Inputs!$N$21:$V$21,Inputs!$N$22:$V$22),MATCH(Inputs!$F$35,Inputs!$N$20:$V$20,0))","v":0},{"$f":"SUM(Inputs!R$36:R$64*Inputs!$Z$36:$Z$64*(1+Inputs!$L$36:$L$64))*INDEX(IF(Inputs!$H$35=\"Mid\",Inputs!$N$21:$V$21,Inputs!$N$22:$V$22),MATCH(Inputs!$F$35,Inputs!$N$20:$V$20,0))","v":0},{"$f":"SUM(Inputs!S$36:S$64*Inputs!$Z$36:$Z$64*(1+Inputs!$L$36:$L$64))*INDEX(IF(Inputs!$H$35=\"Mid\",Inputs!$N$21:$V$21,Inputs!$N$22:$V$22),MATCH(Inputs!$F$35,Inputs!$N$20:$V$20,0))","v":29587.5432},{"$f":"SUM(Inputs!T$36:T$64*Inputs!$Z$36:$Z$64*(1+Inputs!$L$36:$L$64))*INDEX(IF(Inputs!$H$35=\"Mid\",Inputs!$N$21:$V$21,Inputs!$N$22:$V$22),MATCH(Inputs!$F$35,Inputs!$N$20:$V$20,0))","v":34118.023200000003},{"$f":"SUM(Inputs!U$36:U$64*Inputs!$Z$36:$Z$64*(1+Inputs!$L$36:$L$64))*INDEX(IF(Inputs!$H$35=\"Mid\",Inputs!$N$21:$V$21,Inputs!$N$22:$V$22),MATCH(Inputs!$F$35,Inputs!$N$20:$V$20,0))","v":30829.379760000003},{"$f":"SUM(Inputs!V$36:V$64*Inputs!$Z$36:$Z$64*(1+Inputs!$L$36:$L$64))*INDEX(IF(Inputs!$H$35=\"Mid\",Inputs!$N$21:$V$21,Inputs!$N$22:$V$22),MATCH(Inputs!$F$35,Inputs!$N$20:$V$20,0))","v":29633.364000000001},{"$f":"SUM(E9:J9)","v":124168.31016000001}]
[null,"Sub-Total",{"$f":"Inputs!$B$8","v":"Real $2026"},"Dollars",{"$f":"SUM(E7:E9)","v":0},0,96318.277354189209,457348.49326825794,346512.79385365261,111414.56729864235,1011594.131774742]
[]
[null,{"$f":"Inputs!B65","v":"Transmission Lines"}]
[null,"Labour",{"$f":"Inputs!$B$8","v":"Real $2026"},"Dollars",{"$f":"SUM(Inputs!Q$66:Q$82*Inputs!$Y$66:$Y$82*(1+Inputs!$L$66:$L$82))*INDEX(IF(Inputs!$H$35=\"Mid\",Inputs!$N$21:$V$21,Inputs!$N$22:$V$22),MATCH(Inputs!$F$35,Inputs!$N$20:$V$20,0))","v":0},{"$f":"SUM(Inputs!R$66:R$82*Inputs!$Y$66:$Y$82*(1+Inputs!$L$66:$L$82))*INDEX(IF(Inputs!$H$35=\"Mid\",Inputs!$N$21:$V$21,Inputs!$N$22:$V$22),MATCH(Inputs!$F$35,Inputs!$N$20:$V$20,0))","v":0},{"$f":"SUM(Inputs!S$66:S$82*Inputs!$Y$66:$Y$82*(1+Inputs!$L$66:$L$82))*INDEX(IF(Inputs!$H$35=\"Mid\",Inputs!$N$21:$V$21,Inputs!$N$22:$V$22),MATCH(Inputs!$F$35,Inputs!$N$20:$V$20,0))","v":0},{"$f":"SUM(Inputs!T$66:T$82*Inputs!$Y$66:$Y$82*(1+Inputs!$L$66:$L$82))*INDEX(IF(Inputs!$H$35=\"Mid\",Inputs!$N$21:$V$21,Inputs!$N$22:$V$22),MATCH(Inputs!$F$35,Inputs!$N$20:$V$20,0))","v":8575.206721973771},{"$f":"SUM(Inputs!U$66:U$82*Inputs!$Y$66:$Y$82*(1+Inputs!$L$66:$L$82))*INDEX(IF(Inputs!$H$35=\"Mid\",Inputs!$N$21:$V$21,Inputs!$N$22:$V$22),MATCH(Inputs!$F$35,Inputs!$N$20:$V$20,0))","v":57835.334334670682},{"$f":"SUM(Inputs!V$66:V$82*Inputs!$Y$66:$Y$82*(1+Inputs!$L$66:$L$82))*INDEX(IF(Inputs!$H$35=\"Mid\",Inputs!$N$21:$V$21,Inputs!$N$22:$V$22),MATCH(Inputs!$F$35,Inputs!$N$20:$V$20,0))","v":8575.206721973771},{"$f":"SUM(E13:J13)","v":74985.747778618213}]
[null,"Labour escalation",{"$f":"Inputs!$B$8","v":"Real $2026"},"Dollars",{"$f":"E13*(Inputs!Q$23-1)","v":0},{"$f":"F13*(Inputs!R$23-1)","v":0},{"$f":"G13*(Inputs!S$23-1)","v":0},{"$f":"H13*(Inputs!T$23-1)","v":309.54334299807351},{"$f":"I13*(Inputs!U$23-1)","v":2307.623460513697},{"$f":"J13*(Inputs!V$23-1)","v":374.87592526623934},{"$f":"SUM(E14:J14)","v":2992.0427287780099}]
[null,"Materials",{"$f":"Inputs!$B$8","v":"Real $2026"},"Dollars",{"$f":"SUM(Inputs!Q$66:Q$82*Inputs!$Z$66:$Z$82*(1+Inputs!$L$66:$L$82))*INDEX(IF(Inputs!$H$35=\"Mid\",Inputs!$N$21:$V$21,Inputs!$N$22:$V$22),MATCH(Inputs!$F$35,Inputs!$N$20:$V$20,0))","v":0},{"$f":"SUM(Inputs!R$66:R$82*Inputs!$Z$66:$Z$82*(1+Inputs!$L$66:$L$82))*INDEX(IF(Inputs!$H$35=\"Mid\",Inputs!$N$21:$V$21,Inputs!$N$22:$V$22),MATCH(Inputs!$F$35,Inputs!$N$20:$V$20,0))","v":0},{"$f":"SUM(Inputs!S$66:S$82*Inputs!$Z$66:$Z$82*(1+Inputs!$L$66:$L$82))*INDEX(IF(Inputs!$H$35=\"Mid\",Inputs!$N$21:$V$21,Inputs!$N$22:$V$22),MATCH(Inputs!$F$35,Inputs!$N$20:$V$20,0))","v":0},{"$f":"SUM(Inputs!T$66:T$82*Inputs!$Z$66:$Z$82*(1+Inputs!$L$66:$L$82))*INDEX(IF(Inputs!$H$35=\"Mid\",Inputs!$N$21:$V$21,Inputs!$N$22:$V$22),MATCH(Inputs!$F$35,Inputs!$N$20:$V$20,0))","v":65382.566399999996},{"$f":"SUM(Inputs!U$66:U$82*Inputs!$Z$66:$Z$82*(1+Inputs!$L$66:$L$82))*INDEX(IF(Inputs!$H$35=\"Mid\",Inputs!$N$21:$V$21,Inputs!$N$22:$V$22),MATCH(Inputs!$F$35,Inputs!$N$20:$V$20,0))","v":386617.29311999993},{"$f":"SUM(Inputs!V$66:V$82*Inputs!$Z$66:$Z$82*(1+Inputs!$L$66:$L$82))*INDEX(IF(Inputs!$H$35=\"Mid\",Inputs!$N$21:$V$21,Inputs!$N$22:$V$22),MATCH(Inputs!$F$35,Inputs!$N$20:$V$20,0))","v":65382.566399999996},{"$f":"SUM(E15:J15)","v":517382.42591999995}]
[null,"Sub-Total",{"$f":"Inputs!$B$8","v":"Real $2026"},"Dollars",{"$f":"SUM(E13:E15)","v":0},0,0,74267.316464971838,446760.25091518433,74332.649047240004,595360.21642739617]
[]
[]
[null,"Labour",{"$f":"Inputs!$B$8","v":"Real $2026"},"Dollars",{"$f":"E7+E13","v":0},0,64642.210806582603,417060.39148613805,{"$f":"I7+I13","v":361406.30036851234},86930.988662588861,{"$f":"SUM(E19:J19)","v":930039.89132382185}]
[null,"Labour escalation",{"$f":"Inputs!$B$8","v":"Real $2026"},"Dollars",0,0,2088.5233476066132,15054.828647091746,14420.071520324647,3800.2972832934865,{"$f":"SUM(E20:J20)","v":35363.720798316492}]
[null,"Materials",{"$f":"Inputs!$B$8","v":"Real $2026"},"Dollars",0,0,29587.5432,99500.589600000007,417446.67287999991,95015.930399999997,{"$f":"SUM(E21:J21)","v":641550.73607999983}]
[null,"Total maintenance costs",{"$f":"Inputs!$B$8","v":"Real $2026"},"Dollars",{"$f":"SUM(E19:E21)","v":0},0,96318.277354189209,531615.80973322981,793273.04476883681,185747.21634588233,1606954.3482021382]
[]
[{"$f":"IF(SUM(E24:J24)=0,0,1)","v":0},"Check - Labour",null,null,{"$f":"IF(ROUND(SUMPRODUCT(Inputs!Q36:Q82,Inputs!$Y36:$Y82,(1+Inputs!$L$36:$L$82))*INDEX(IF(Inputs!$H$35=\"Mid\",Inputs!$N$21:$V$21,Inputs!$N$22:$V$22),MATCH(Inputs!$F$35,Inputs!$N$20:$V$20,0))-E19,3)=0,0,1)","v":0},{"$f":"IF(ROUND(SUMPRODUCT(Inputs!R36:R82,Inputs!$Y36:$Y82,(1+Inputs!$L$36:$L$82))*INDEX(IF(Inputs!$H$35=\"Mid\",Inputs!$N$21:$V$21,Inputs!$N$22:$V$22),MATCH(Inputs!$F$35,Inputs!$N$20:$V$20,0))-F19,3)=0,0,1)","v":0},{"$f":"IF(ROUND(SUMPRODUCT(Inputs!S36:S82,Inputs!$Y36:$Y82,(1+Inputs!$L$36:$L$82))*INDEX(IF(Inputs!$H$35=\"Mid\",Inputs!$N$21:$V$21,Inputs!$N$22:$V$22),MATCH(Inputs!$F$35,Inputs!$N$20:$V$20,0))-G19,3)=0,0,1)","v":0},{"$f":"IF(ROUND(SUMPRODUCT(Inputs!T36:T82,Inputs!$Y36:$Y82,(1+Inputs!$L$36:$L$82))*INDEX(IF(Inputs!$H$35=\"Mid\",Inputs!$N$21:$V$21,Inputs!$N$22:$V$22),MATCH(Inputs!$F$35,Inputs!$N$20:$V$20,0))-H19,3)=0,0,1)","v":0},{"$f":"IF(ROUND(SUMPRODUCT(Inputs!U36:U82,Inputs!$Y36:$Y82,(1+Inputs!$L$36:$L$82))*INDEX(IF(Inputs!$H$35=\"Mid\",Inputs!$N$21:$V$21,Inputs!$N$22:$V$22),MATCH(Inputs!$F$35,Inputs!$N$20:$V$20,0))-I19,3)=0,0,1)","v":0},{"$f":"IF(ROUND(SUMPRODUCT(Inputs!V36:V82,Inputs!$Y36:$Y82,(1+Inputs!$L$36:$L$82))*INDEX(IF(Inputs!$H$35=\"Mid\",Inputs!$N$21:$V$21,Inputs!$N$22:$V$22),MATCH(Inputs!$F$35,Inputs!$N$20:$V$20,0))-J19,3)=0,0,1)","v":0}]
[{"$f":"IF(SUM(E25:J25)=0,0,1)","v":0},"Check - Materials",null,null,{"$f":"IF(ROUND(SUMPRODUCT(Inputs!Q36:Q82,Inputs!$Z36:$Z82,(1+Inputs!$L$36:$L$82))*INDEX(IF(Inputs!$H$35=\"Mid\",Inputs!$N$21:$V$21,Inputs!$N$22:$V$22),MATCH(Inputs!$F$35,Inputs!$N$20:$V$20,0))-E21,3)=0,0,1)","v":0},{"$f":"IF(ROUND(SUMPRODUCT(Inputs!R36:R82,Inputs!$Z36:$Z82,(1+Inputs!$L$36:$L$82))*INDEX(IF(Inputs!$H$35=\"Mid\",Inputs!$N$21:$V$21,Inputs!$N$22:$V$22),MATCH(Inputs!$F$35,Inputs!$N$20:$V$20,0))-F21,3)=0,0,1)","v":0},{"$f":"IF(ROUND(SUMPRODUCT(Inputs!S36:S82,Inputs!$Z36:$Z82,(1+Inputs!$L$36:$L$82))*INDEX(IF(Inputs!$H$35=\"Mid\",Inputs!$N$21:$V$21,Inputs!$N$22:$V$22),MATCH(Inputs!$F$35,Inputs!$N$20:$V$20,0))-G21,3)=0,0,1)","v":0},{"$f":"IF(ROUND(SUMPRODUCT(Inputs!T36:T82,Inputs!$Z36:$Z82,(1+Inputs!$L$36:$L$82))*INDEX(IF(Inputs!$H$35=\"Mid\",Inputs!$N$21:$V$21,Inputs!$N$22:$V$22),MATCH(Inputs!$F$35,Inputs!$N$20:$V$20,0))-H21,3)=0,0,1)","v":0},{"$f":"IF(ROUND(SUMPRODUCT(Inputs!U36:U82,Inputs!$Z36:$Z82,(1+Inputs!$L$36:$L$82))*INDEX(IF(Inputs!$H$35=\"Mid\",Inputs!$N$21:$V$21,Inputs!$N$22:$V$22),MATCH(Inputs!$F$35,Inputs!$N$20:$V$20,0))-I21,3)=0,0,1)","v":0},{"$f":"IF(ROUND(SUMPRODUCT(Inputs!V36:V82,Inputs!$Z36:$Z82,(1+Inputs!$L$36:$L$82))*INDEX(IF(Inputs!$H$35=\"Mid\",Inputs!$N$21:$V$21,Inputs!$N$22:$V$22),MATCH(Inputs!$F$35,Inputs!$N$20:$V$20,0))-J21,3)=0,0,1)","v":0}]
[]
[null,{"$f":"Inputs!$B$86","v":"Operating costs"},null,null,null,null,null,null,null,null,"Total"]
[null,"Component","Dollar basis",null,{"$f":"Inputs!Q$20","v":2026},{"$f":"Inputs!R$20","v":2027},{"$f":"Inputs!S$20","v":2028},{"$f":"Inputs!T$20","v":2029},{"$f":"Inputs!U$20","v":2030},{"$f":"Inputs!V$20","v":2031}]
[]
[null,{"$f":"Inputs!B96","v":"Asset Management"}]
{"$rows_left_out":68}
{"sheet":"Outputs","index":4,"n_rows":121,"n_cols":18,"rows_kept":121,"cut":false,"hidden":false,"merged":[]}
["Outputs"]
[]
[null,"PTRM and Proposal"]
[]
[null,"Operating Costs",null,null,null,null,null,null,null,null,"Total","Total"]
[null,"Component","Dollar basis","Units",{"$f":"Inputs!Q$20","v":2026},{"$f":"Inputs!R$20","v":2027},{"$f":"Inputs!S$20","v":2028},{"$f":"Inputs!T$20","v":2029},{"$f":"Inputs!U$20","v":2030},{"$f":"Inputs!V$20","v":2031},"Next period","All years"]
[]
[null,"Costs"]
[null,"Maintenance costs (excl labour escalation)",{"$f":"Inputs!$B$8","v":"Real $2026"},"$Million",{"$f":"(Calculations!E22-Calculations!E20)/10^6","v":0},{"$f":"(Calculations!F22-Calculations!F20)/10^6","v":0},{"$f":"(Calculations!G22-Calculations!G20)/10^6","v":9.4229754006582608E-2},{"$f":"(Calculations!H22-Calculations!H20)/10^6","v":0.51656098108613802},{"$f":"(Calculations!I22-Calculations!I20)/10^6","v":0.7788529732485121},{"$f":"(Calculations!J22-Calculations!J20)/10^6","v":0.18194691906258886},{"$f":"SUM(F9:J9)","v":1.5715906274038216},{"$f":"SUM(E9:J9)","v":1.5715906274038216}]
[null,"Operating Costs (excl labour escalation)",{"$f":"Inputs!$B$8","v":"Real $2026"},"$Million",{"$f":"(Calculations!E69-Calculations!E67)/10^6","v":0},{"$f":"(Calculations!F69-Calculations!F67)/10^6","v":0.49083675157894741},{"$f":"(Calculations!G69-Calculations!G67)/10^6","v":2.468934158934474},{"$f":"(Calculations!H69-Calculations!H67)/10^6","v":5.9207582901327909},{"$f":"(Calculations!I69-Calculations!I67)/10^6","v":7.2445487905811747},{"$f":"(Calculations!J69-Calculations!J67)/10^6","v":6.6434482734373139},{"$f":"SUM(F10:J10)","v":22.7685262646647},{"$f":"SUM(E10:J10)","v":22.7685262646647}]
[null,"Strategic Benefit Payments",{"$f":"Inputs!$B$8","v":"Real $2026"},"$Million",{"$f":"Calculations!E84/10^6","v":0},{"$f":"Calculations!F84/10^6","v":0},{"$f":"Calculations!G84/10^6","v":6.8233673227507272E-2},{"$f":"Calculations!H84/10^6","v":0.20470741562252184},{"$f":"Calculations!I84/10^6","v":0.20470741562252184},{"$f":"Calculations!J84/10^6","v":0.20470741562252184},{"$f":"SUM(F11:J11)","v":0.68235592009507273},{"$f":"SUM(E11:J11)","v":0.68235592009507273}]
[null,"Insurance Costs",{"$f":"Inputs!$B$8","v":"Real $2026"},"$Million",{"$f":"Calculations!E80/10^6","v":0},{"$f":"Calculations!F80/10^6","v":0},{"$f":"Calculations!G80/10^6","v":0.31527052099999997},{"$f":"Calculations!H80/10^6","v":0.31527052099999997},{"$f":"Calculations!I80/10^6","v":0.37277738349999995},{"$f":"Calculations!J80/10^6","v":0.31527052099999997},1.3185889464999998,1.3185889464999998]
[null,"Vegetation Integrity Rehabilitation Costs",{"$f":"Inputs!$B$8","v":"Real $2026"},"$Million",0,0.14035859999999997,0.14035859999999997,0.14035859999999997,0.14035859999999997,0.14035859999999997,{"$f":"SUM(F13:J13)","v":0.70179299999999989},{"$f":"SUM(E13:J13)","v":0.70179299999999989}]
[null,"Real input cost escalation",{"$f":"Inputs!$B$8","v":"Real $2026"},"$Million",0,1.6650503716426866E-2,6.9410493341713522E-2,0.21263787644160365,0.28769391293724911,0.27738566592235497,0.86377845235934814,0.86377845235934814]
[]
[null,"Total (excluding debt raising costs)",{"$f":"Inputs!$B$8","v":"Real $2026"},"$Million",{"$f":"SUM(E9:E14)","v":0},0.6478458552953742,3.1564372005102772,7.3102936842830548,9.0289390758894594,7.7631173950447803,27.906633211022946,27.906633211022946]
[]
[null,"Debt Raising Costs",{"$f":"Inputs!$B$8","v":"Real $2026"},"$Million",{"$f":"Calculations!E93/10^6","v":0},{"$f":"Calculations!F93/10^6","v":8.3350438479535063E-2},{"$f":"Calculations!G93/10^6","v":0.15618487166244979},{"$f":"Calculations!H93/10^6","v":0.21049249951108251},{"$f":"Calculations!I93/10^6","v":0.20846183577747063},{"$f":"Calculations!J93/10^6","v":0.202177771489439},0.86066741691997706,0.86066741691997706]
[]
[null,"Total (including debt raising costs)",{"$f":"Inputs!$B$8","v":"Real $2026"},"$Million",{"$f":"E16+E18","v":0},0.73119629377490925,3.3126220721727271,7.5207861837941374,9.2374009116669296,7.9652951665342195,28.767300627942923,28.767300627942923]
[]
[{"$f":"IF(SUM(E22:J22)=0,0,1)","v":0},"Check - Calculations",null,null,{"$f":"IF(ROUND(E16-Calculations!E91/10^6,3)=0,0,1)","v":0},{"$f":"IF(ROUND(F16-Calculations!F91/10^6,3)=0,0,1)","v":0},{"$f":"IF(ROUND(G16-Calculations!G91/10^6,3)=0,0,1)","v":0},{"$f":"IF(ROUND(H16-Calculations!H91/10^6,3)=0,0,1)","v":0},{"$f":"IF(ROUND(I16-Calculations!I91/10^6,3)=0,0,1)","v":0},{"$f":"IF(ROUND(J16-Calculations!J91/10^6,3)=0,0,1)","v":0}]
[]
[null,null,null,null,null,null,null,null,null,null,"Total","Total"]
[null,"Maintenance costs (excl labour escalation)","Dollar basis","Units",{"$f":"Inputs!Q$20","v":2026},{"$f":"Inputs!R$20","v":2027},{"$f":"Inputs!S$20","v":2028},{"$f":"Inputs!T$20","v":2029},{"$f":"Inputs!U$20","v":2030},{"$f":"Inputs!V$20","v":2031},"Next period","All years"]
[]
[null,"Transmission lines",{"$f":"Inputs!$B$8","v":"Real $2026"},"$Million",{"$f":"(Calculations!E16-Calculations!E14)/10^6","v":0},{"$f":"(Calculations!F16-Calculations!F14)/10^6","v":0},{"$f":"(Calculations!G16-Calculations!G14)/10^6","v":0},{"$f":"(Calculations!H16-Calculations!H14)/10^6","v":7.3957773121973755E-2},{"$f":"(Calculations!I16-Calculations!I14)/10^6","v":0.44445262745467062},{"$f":"(Calculations!J16-Calculations!J14)/10^6","v":7.3957773121973755E-2},{"$f":"SUM(F27:J27)","v":0.59236817369861805},{"$f":"SUM(E27:J27)","v":0.59236817369861805}]
[null,"Substations",{"$f":"Inputs!$B$8","v":"Real $2026"},"$Million",{"$f":"(Calculations!E10-Calculations!E8)/10^6","v":0},{"$f":"(Calculations!F10-Calculations!F8)/10^6","v":0},{"$f":"(Calculations!G10-Calculations!G8)/10^6","v":9.4229754006582608E-2},{"$f":"(Calculations!H10-Calculations!H8)/10^6","v":0.44260320796416425},{"$f":"(Calculations!I10-Calculations!I8)/10^6","v":0.33440034579384165},{"$f":"(Calculations!J10-Calculations!J8)/10^6","v":0.10798914594061509},{"$f":"SUM(F28:J28)","v":0.97922245370520344},{"$f":"SUM(E28:J28)","v":0.97922245370520344}]
[]
[null,"Total (excluding labour escalation)",{"$f":"Inputs!$B$8","v":"Real $2026"},"$Million",{"$f":"SUM(E27:E28)","v":0},0,9.4229754006582608E-2,0.51656098108613802,0.77885297324851233,0.18194691906258886,{"$f":"SUM(F30:J30)","v":1.5715906274038218},{"$f":"SUM(E30:J30)","v":1.5715906274038218}]
{"$rows_left_out":91}