{"text_format":"1","workbook":"xlsx","n_sheets":9,"sheets":["Title Page","Change log","Inputs | General","Exit Fees >","Input | Exit Fees","Calc | Exit Fees","Calc | Tax Allowance","Output | Exit Fee price caps","LUTs and Dropdowns"],"not_rendered":{"charts":0,"images":1,"macros":1,"external_links":0,"defined_names":23,"comments":0,"pivot_tables":0},"unopened":[],"bounds":{"document_bytes":16777216,"sheet_cells":100000,"rows_first":2000,"rows_last":500,"rows_between":2000,"halvings":0,"cell_chars":16384,"cell_head_chars":4096},"cells_cut":0,"cells_raw":0,"read":"whole","date_system":"1900"}

{"sheet":"Title Page","index":0,"n_rows":30,"n_cols":8,"rows_kept":30,"cut":false,"hidden":false,"merged":[[13,1,13,23],[7,1,8,23],[32,4,32,7],[24,1,24,23],[27,4,27,7],[30,4,30,7],[31,4,31,7],[29,4,29,7],[28,4,28,7]]}
[]
[]
[]
[]
[]
[]
[]
[null,"JEN 2027-31 - ACS Standardised Metering Pricing Model "]
[]
[null,"Version",1.02]
[null,"Date","2022-01-14"]
[]
[]
[null,"Status"]
[]
[null,"Notes:"]
[null,"Current model version contains test data. "]
[]
[null,null,"Locked Sheets Pwd:"]
[]
{"$rows_left_out":11}
{"sheet":"Change log","index":1,"n_rows":13,"n_cols":4,"rows_kept":13,"cut":false,"hidden":false,"merged":[]}
[]
[null,"Worksheet","Cells","Description of change"]
[null,"Throughout workbook",null,"Added cost basis labelling"]
[null,"Inputs | General","G9","Updated decision stage"]
[null,"Inputs | General","H26:L26","Update forecast inflation"]
[null,"Inputs | General","H32:L32","Update opex price change to reflect Input prices "]
[null,"Inputs | Exit Fees","G9:L18","Updated RAB inputs"]
[null,"Inputs | Exit Fees","D29:D31","Updated titles for Single Phase and Three Phase to include DC"]
[null,"Inputs | Exit Fees","G29:G32","Corrected base year exit fees"]
[null,"Inputs | Exit Fees","K49:L63","Updated meter unit costs"]
[null,"Inputs | Exit Fees","K71:O71","Updated meter end year populations"]
[null,"Inputs | Exit Fees","K102:O103","Updated admin labour tasks"]
[null,"Inputs | Exit Fees","G126:L135","Updated TAB inputs"]

{"sheet":"Inputs | General","index":2,"n_rows":42,"n_cols":23,"rows_kept":42,"cut":false,"hidden":false,"merged":[[35,1,35,6],[38,7,38,11],[4,1,4,6],[1,10,1,11],[1,12,1,13],[20,1,20,6],[23,7,23,11],[29,7,29,11]]}
[null,{"$f":"'Title Page'!B8&\" v\"&'Title Page'!$C$10","v":"JEN 2027-31 - ACS Standardised Metering Pricing Model  v1.02"},null,null,null,null,null,null,null,null,null,null,null,null,null,null,null,null,null,null,null,"Worksheet check:",{"$f":"IF(COUNTA($X$14:$X$46)=COUNTIF($X14:$X47,\"OK\"),\"OK\",\"Check\")","v":"OK"}]
[null,{"$f":"MID(CELL(\"filename\",A1),FIND(\"]\",CELL(\"filename\",A1))+1,255)","v":"Inputs | General"},null,null,null,null,null,null,"Key:","Input","External Link",null,"Internal Link",null,"Jemena modification"]
[]
[]
[null,"1. Inputs - General"]
[]
[null,null,"Inputs","Source","Input Format",null,"Value"]
[null,null,"NSP name","NSP",null,null,"JEN - ACS"]
[null,null,"Decision stage","NSP",null,null,"draft"]
[]
[null,null,"Forecast regulatory control period, first year","NSP","YYYY-YY",null,"2026-27"]
[null,null,"Forecast regulatory control period, last year","NSP",null,null,{"$f":"LEFT(FPFirstYear,4)+4&\"-\"&RIGHT(FPFirstYear,2)+4","v":"2030-31"}]
[]
[null,null,"Regulatory Period Length, Yrs",null,null,null,{"$f":"LEFT(G12,4)-LEFT(FPFirstYear,4)+1","v":5}]
[]
[null,null,"Model Used For (Price Cap or Vic Exit Fees?)",null,null,null,"Exit Fees (Vic)"]
[]
[]
[]
[]
{"$rows_left_out":23}
{"sheet":"Exit Fees >","index":3,"n_rows":0,"n_cols":0,"rows_kept":0,"cut":false,"hidden":false,"merged":[]}

{"sheet":"Input | Exit Fees","index":4,"n_rows":139,"n_cols":17,"rows_kept":139,"cut":false,"hidden":false,"merged":[[138,1,138,3],[0,13,0,14],[47,3,47,5],[4,1,4,6],[24,1,24,7],[41,1,41,7],[6,7,6,11],[4,9,4,11],[21,1,21,3],[94,3,94,5],[66,9,66,14],[111,3,111,5],[112,3,112,5],[113,3,113,5],[121,1,121,6],[121,9,121,11],[123,7,123,11],[107,3,107,5],[108,3,108,5],[109,3,109,5],[110,3,110,5],[86,1,86,7],[114,3,114,5],[115,3,115,5],[116,3,116,5],[117,3,117,5]]}
[null,{"$f":"'Title Page'!B8&\" v\"&'Title Page'!$C$10","v":"JEN 2027-31 - ACS Standardised Metering Pricing Model  v1.02"},null,null,null,null,null,null,null,null,null,null,"DNSP:",{"$f":"IF('Inputs | General'!$G$16=\"Price Cap\",\"NOT USED\",NSP)","v":"JEN - ACS"}]
[null,{"$f":"MID(CELL(\"filename\",A1),FIND(\"]\",CELL(\"filename\",A1))+1,255)","v":"Input | Exit Fees"},null,null,null,null,null,"Key:","Input","External Link","Internal Link","Jemena modification"]
[]
[]
[null,{"$f":"LEFT('Inputs | General'!B21,1)+1&\". Linked Input - RAB\"","v":"3. Linked Input - RAB"},null,null,null,null,null,null,null,{"$f":"IF('Inputs | General'!$G$16=\"Price Cap\",\"NOT USED\",\"\")","v":""}]
[]
[null,"Linked Input - RAB Meters",null,null,null,null,"Base Year","Regulatory Period"]
[null,null,null,null,"Units",null,{"$f":"LEFT(H8,4)-1&\"-\"&RIGHT(H8,2)-1","v":"2025-26"},{"$f":"FPFirstYear","v":"2026-27"},{"$f":"LEFT(H8,4)+1&\"-\"&RIGHT(H8,2)+1","v":"2027-28"},{"$f":"LEFT(I8,4)+1&\"-\"&RIGHT(I8,2)+1","v":"2028-29"},{"$f":"LEFT(J8,4)+1&\"-\"&RIGHT(J8,2)+1","v":"2029-30"},{"$f":"LEFT(K8,4)+1&\"-\"&RIGHT(K8,2)+1","v":"2030-31"},{"$f":"LEFT(L8,4)+1&\"-\"&RIGHT(L8,2)+1","v":"2031-32"}]
[null,null,"Opening RAB",null,"$m",null,41.287458655463894,{"$f":"G9+G10-G11","v":41.287458655463894},43.262016262813972,52.495106609501647,67.135364133308926,84.138830888907322,103.77344803998778,"Opening balance of METERS row in PTRM inputs sheet of PTRM (nominal)"]
[null,null,"Gross capital expenditure",null,"$m",null,null,7.0506577460841804,14.779234335160725,21.171683801291035,24.94633861983489,29.240578256639299,null,"Gross capex from METERS row in ASSETS sheet of PTRM (nominal)"]
[null,null,"Regulatory depreciation",null,"$m",null,null,5.0761001387341036,5.546143988473049,6.5314262774837637,7.9428718642364995,9.6059611055588263,null,"Depreciation from METERS row in ASSETS sheet of PTRM (nominal)"]
[]
[]
[null,"Linked Input - RAB Comms & IT & Other"]
[null,null,null,null,"Units",null,{"$f":"LEFT(H15,4)-1&\"-\"&RIGHT(H15,2)-1","v":"2025-26"},{"$f":"FPFirstYear","v":"2026-27"},{"$f":"LEFT(H15,4)+1&\"-\"&RIGHT(H15,2)+1","v":"2027-28"},{"$f":"LEFT(I15,4)+1&\"-\"&RIGHT(I15,2)+1","v":"2028-29"},{"$f":"LEFT(J15,4)+1&\"-\"&RIGHT(J15,2)+1","v":"2029-30"},{"$f":"LEFT(K15,4)+1&\"-\"&RIGHT(K15,2)+1","v":"2030-31"},{"$f":"LEFT(L15,4)+1&\"-\"&RIGHT(L15,2)+1","v":"2031-32"}]
[null,null,"Opening RAB",null,"$m",null,6.7386775247177786,{"$f":"G16+G17-G18","v":6.7386775247177786},{"$f":"H16+H17-H18","v":7.6543885085298013},8.5360216979165529,8.8887772887078054,8.9694372412223853,8.9539322240333092,"Opening balance of COMMS & IT & Inhouse Software & ERC rows from PTRM INPUTS sheet of PTRM (nominal)"]
[null,null,"Gross capital expenditure",null,"$m",null,null,2.3338315028367904,2.5727670584168125,2.1649263201351197,2.202105870449178,2.4205274536668346,null,"Gross capex from COMMS & IT & Inhouse Software & ERC rows in ASSETS sheet of PTRM (nominal)"]
[null,null,"Regulatory depreciation",null,"$m",null,null,1.4181205190247672,1.6911338690300619,1.8121707293438671,2.1214459179345986,2.4360324708559098,null,"Depreciation from COMMS & IT & Inhouse Software & ERC rows in ASSETS sheet of PTRM (nominal)"]
[]
[]
{"$rows_left_out":120}
{"sheet":"Calc | Exit Fees","index":5,"n_rows":286,"n_cols":15,"rows_kept":286,"cut":false,"hidden":false,"merged":[[179,1,179,7],[224,6,224,10],[183,10,183,14],[198,10,198,14],[211,1,211,7],[215,10,215,14],[221,1,221,7],[223,6,223,10],[115,6,115,10],[112,1,112,7],[0,13,0,14],[4,1,4,7],[74,10,74,14],[114,6,114,10],[89,10,89,14],[58,10,58,14],[106,10,106,14],[102,1,102,7],[28,10,28,14],[43,10,43,14],[9,10,9,14]]}
[null,{"$f":"'Title Page'!B8&\" v\"&'Title Page'!$C$10","v":"JEN 2027-31 - ACS Standardised Metering Pricing Model  v1.02"},null,null,null,null,null,null,null,null,null,null,"DNSP:",{"$f":"IF('Inputs | General'!$G$16=\"Price Cap\",\"NOT USED\",NSP)","v":"JEN - ACS"}]
[null,{"$f":"MID(CELL(\"filename\",A1),FIND(\"]\",CELL(\"filename\",A1))+1,255)","v":"Calc | Exit Fees"},null,null,null,null,null,"Key:","Input","External Link","Internal Link","Jemena modification"]
[]
[]
[null,"CALCULATION | Meters"]
[]
[null,"Calculation of Allocated Meters RAB by Designated Exit Fee"]
[]
[]
[null,null,null,null,"Average number of meters (Year, Year-1)",null,null,null,null,null,"Average number of meters (Year, Year-1)"]
[null,null,null,null,null,{"$f":"'Input | Exit Fees'!H68","v":"Meter Type"},{"$f":"'Input | Exit Fees'!I68","v":"Units"},"Designated Exit Fee",null,null,{"$f":"FPFirstYear","v":"2026-27"},{"$f":"LEFT(K11,4)+1&\"-\"&RIGHT(K11,2)+1","v":"2027-28"},{"$f":"LEFT(L11,4)+1&\"-\"&RIGHT(L11,2)+1","v":"2028-29"},{"$f":"LEFT(M11,4)+1&\"-\"&RIGHT(M11,2)+1","v":"2029-30"},{"$f":"LEFT(N11,4)+1&\"-\"&RIGHT(N11,2)+1","v":"2030-31"}]
[null,null,null,null,null,{"$f":"'Input | Exit Fees'!H69","v":"Single Phase (inc. DC)"},"No.",{"$f":"'Input | Exit Fees'!D49","v":"Single Phase (inc. DC)"},null,null,{"$f":"IFERROR(AVERAGE('Input | Exit Fees'!J69:K69),0)","v":306881.31317020638},{"$f":"IFERROR(AVERAGE('Input | Exit Fees'!K69:L69),0)","v":305471.60124517092},{"$f":"IFERROR(AVERAGE('Input | Exit Fees'!L69:M69),0)","v":303726.30598456541},{"$f":"IFERROR(AVERAGE('Input | Exit Fees'!M69:N69),0)","v":301950.1093753078},{"$f":"IFERROR(AVERAGE('Input | Exit Fees'!N69:O69),0)","v":300143.00420653843}]
[null,null,null,null,null,{"$f":"'Input | Exit Fees'!H70","v":"Single Phase, Two Element"},"No.",{"$f":"'Input | Exit Fees'!D50","v":"Single Phase, Two Element"},null,null,{"$f":"IFERROR(AVERAGE('Input | Exit Fees'!J70:K70),0)","v":20366.679503952022},{"$f":"IFERROR(AVERAGE('Input | Exit Fees'!K70:L70),0)","v":19995.214387729036},{"$f":"IFERROR(AVERAGE('Input | Exit Fees'!L70:M70),0)","v":19617.038348064045},{"$f":"IFERROR(AVERAGE('Input | Exit Fees'!M70:N70),0)","v":19232.16650745504},{"$f":"IFERROR(AVERAGE('Input | Exit Fees'!N70:O70),0)","v":18840.597303430375}]
[null,null,null,null,null,{"$f":"'Input | Exit Fees'!H71","v":"Three Phase (inc. DC)"},"No.",{"$f":"'Input | Exit Fees'!D51","v":"Three Phase (inc. DC)"},null,null,{"$f":"IFERROR(AVERAGE('Input | Exit Fees'!J71:K71),0)","v":69646.77784576673},{"$f":"IFERROR(AVERAGE('Input | Exit Fees'!K71:L71),0)","v":79116.668687719997},{"$f":"IFERROR(AVERAGE('Input | Exit Fees'!L71:M71),0)","v":87883.188263737073},{"$f":"IFERROR(AVERAGE('Input | Exit Fees'!M71:N71),0)","v":96804.923569721766},{"$f":"IFERROR(AVERAGE('Input | Exit Fees'!N71:O71),0)","v":105881.91082541502}]
[null,null,null,null,null,{"$f":"'Input | Exit Fees'!H72","v":"Three Phase CT"},"No.",{"$f":"'Input | Exit Fees'!D52","v":"Three Phase CT"},null,null,{"$f":"IFERROR(AVERAGE('Input | Exit Fees'!J72:K72),0)","v":2764.2084638213669},{"$f":"IFERROR(AVERAGE('Input | Exit Fees'!K72:L72),0)","v":2947.6996544019103},{"$f":"IFERROR(AVERAGE('Input | Exit Fees'!L72:M72),0)","v":3135.2864919153649},{"$f":"IFERROR(AVERAGE('Input | Exit Fees'!M72:N72),0)","v":3326.194650697139},{"$f":"IFERROR(AVERAGE('Input | Exit Fees'!N72:O72),0)","v":3520.4249057807683}]
[null,null,null,null,null,{"$f":"'Input | Exit Fees'!H73","v":0},"No.",{"$f":"'Input | Exit Fees'!D53","v":0},null,null,{"$f":"IFERROR(AVERAGE('Input | Exit Fees'!J73:K73),0)","v":0},{"$f":"IFERROR(AVERAGE('Input | Exit Fees'!K73:L73),0)","v":0},{"$f":"IFERROR(AVERAGE('Input | Exit Fees'!L73:M73),0)","v":0},{"$f":"IFERROR(AVERAGE('Input | Exit Fees'!M73:N73),0)","v":0},{"$f":"IFERROR(AVERAGE('Input | Exit Fees'!N73:O73),0)","v":0}]
[null,null,null,null,null,{"$f":"'Input | Exit Fees'!H74","v":0},"No.",{"$f":"'Input | Exit Fees'!D54","v":0},null,null,{"$f":"IFERROR(AVERAGE('Input | Exit Fees'!J74:K74),0)","v":0},{"$f":"IFERROR(AVERAGE('Input | Exit Fees'!K74:L74),0)","v":0},{"$f":"IFERROR(AVERAGE('Input | Exit Fees'!L74:M74),0)","v":0},{"$f":"IFERROR(AVERAGE('Input | Exit Fees'!M74:N74),0)","v":0},{"$f":"IFERROR(AVERAGE('Input | Exit Fees'!N74:O74),0)","v":0}]
[null,null,null,null,null,{"$f":"'Input | Exit Fees'!H75","v":0},"No.",{"$f":"'Input | Exit Fees'!D55","v":0},null,null,{"$f":"IFERROR(AVERAGE('Input | Exit Fees'!J75:K75),0)","v":0},{"$f":"IFERROR(AVERAGE('Input | Exit Fees'!K75:L75),0)","v":0},{"$f":"IFERROR(AVERAGE('Input | Exit Fees'!L75:M75),0)","v":0},{"$f":"IFERROR(AVERAGE('Input | Exit Fees'!M75:N75),0)","v":0},{"$f":"IFERROR(AVERAGE('Input | Exit Fees'!N75:O75),0)","v":0}]
[null,null,null,null,null,{"$f":"'Input | Exit Fees'!H76","v":0},"No.",{"$f":"'Input | Exit Fees'!D56","v":0},null,null,{"$f":"IFERROR(AVERAGE('Input | Exit Fees'!J76:K76),0)","v":0},{"$f":"IFERROR(AVERAGE('Input | Exit Fees'!K76:L76),0)","v":0},{"$f":"IFERROR(AVERAGE('Input | Exit Fees'!L76:M76),0)","v":0},{"$f":"IFERROR(AVERAGE('Input | Exit Fees'!M76:N76),0)","v":0},{"$f":"IFERROR(AVERAGE('Input | Exit Fees'!N76:O76),0)","v":0}]
[null,null,null,null,null,{"$f":"'Input | Exit Fees'!H77","v":0},"No.",{"$f":"'Input | Exit Fees'!D57","v":0},null,null,{"$f":"IFERROR(AVERAGE('Input | Exit Fees'!J77:K77),0)","v":0},{"$f":"IFERROR(AVERAGE('Input | Exit Fees'!K77:L77),0)","v":0},{"$f":"IFERROR(AVERAGE('Input | Exit Fees'!L77:M77),0)","v":0},{"$f":"IFERROR(AVERAGE('Input | Exit Fees'!M77:N77),0)","v":0},{"$f":"IFERROR(AVERAGE('Input | Exit Fees'!N77:O77),0)","v":0}]
{"$rows_left_out":267}
{"sheet":"Calc | Tax Allowance","index":6,"n_rows":92,"n_cols":14,"rows_kept":92,"cut":false,"hidden":false,"merged":[[6,6,6,10],[7,6,7,10],[0,13,0,14],[4,1,4,7]]}
[null,{"$f":"'Title Page'!B8&\" v\"&'Title Page'!$C$10","v":"JEN 2027-31 - ACS Standardised Metering Pricing Model  v1.02"},null,null,null,null,null,null,null,null,null,null,"DNSP:",{"$f":"IF('Inputs | General'!$G$16=\"Price Cap\",\"NOT USED\",NSP)","v":"JEN - ACS"}]
[null,{"$f":"MID(CELL(\"filename\",A1),FIND(\"]\",CELL(\"filename\",A1))+1,255)","v":"Calc | Tax Allowance"},null,null,null,null,null,"Key:","Input","External Link","Internal Link","Jemena added sheet"]
[]
[]
[null,"CALCULATION | Tax Allowance"]
[]
[null,null,null,null,null,"Base Year","Regulatory period"]
[null,null,null,null,null,null,"Tariff ($/year)"]
[null,null,null,"Exit Fee Name","Component","2025-26","2026-27","2027-28","2028-29","2029-30","2030-31"]
[null,null,null,"Single Phase"]
[null,null,null,null,"Revenue excluding tax allowance"]
[null,null,null,null,"Meter RAB",null,{"$f":"+'Calc | Exit Fees'!G119","v":97.374356435376015},{"$f":"+'Calc | Exit Fees'!H119","v":107.29935506264201},{"$f":"+'Calc | Exit Fees'!I119","v":130.90218448347608},{"$f":"+'Calc | Exit Fees'!J119","v":161.66357608367991},{"$f":"+'Calc | Exit Fees'!K119","v":196.15938403627649}]
[null,null,null,null,"Comms & IT & Other",null,{"$f":"+'Calc | Exit Fees'!G120","v":16.861068758802563},{"$f":"+'Calc | Exit Fees'!H120","v":17.658852376472069},{"$f":"+'Calc | Exit Fees'!I120","v":19.536561358464482},{"$f":"+'Calc | Exit Fees'!J120","v":20.67914197662197},{"$f":"+'Calc | Exit Fees'!K120","v":20.843605003631005}]
[null,null,null,null,"Admin cost",null,{"$f":"+'Calc | Exit Fees'!G121","v":58.785722930508697},{"$f":"+'Calc | Exit Fees'!H121","v":60.576707248343126},{"$f":"+'Calc | Exit Fees'!I121","v":62.498191576191175},{"$f":"+'Calc | Exit Fees'!J121","v":64.496919303493158},{"$f":"+'Calc | Exit Fees'!K121","v":66.526599984674206}]
[null,null,null,null,"Revenue for Tax Assessment Subtotal",null,{"$f":"SUM(G12:G14)","v":173.02114812468727},{"$f":"SUM(H12:H14)","v":185.53491468745722},{"$f":"SUM(I12:I14)","v":212.93693741813172},{"$f":"SUM(J12:J14)","v":246.83963736379502},{"$f":"SUM(K12:K14)","v":283.5295890245817}]
[]
[null,null,null,null,"Tax expenses"]
[null,null,null,null,"WDV - Meter TAB",null,{"$f":"+'Calc | Exit Fees'!G228","v":59.867982544698869},{"$f":"+'Calc | Exit Fees'!H228","v":71.748180892747328},{"$f":"+'Calc | Exit Fees'!I228","v":95.873797038648704},{"$f":"+'Calc | Exit Fees'!J228","v":125.31639513513967},{"$f":"+'Calc | Exit Fees'!K228","v":158.64689145666588}]
[null,null,null,null,"WDV - Comms & IT & Other TAB",null,{"$f":"+'Calc | Exit Fees'!G229","v":7.6269126189432983},{"$f":"+'Calc | Exit Fees'!H229","v":8.6076537395644763},{"$f":"+'Calc | Exit Fees'!I229","v":9.881122031093815},{"$f":"+'Calc | Exit Fees'!J229","v":9.3765433160162317},{"$f":"+'Calc | Exit Fees'!K229","v":8.1594773848220523}]
[null,null,null,null,"Admin cost",null,{"$f":"+'Calc | Exit Fees'!G121","v":58.785722930508697},{"$f":"+'Calc | Exit Fees'!H121","v":60.576707248343126},{"$f":"+'Calc | Exit Fees'!I121","v":62.498191576191175},{"$f":"+'Calc | Exit Fees'!J121","v":64.496919303493158},{"$f":"+'Calc | Exit Fees'!K121","v":66.526599984674206}]
{"$rows_left_out":73}
{"sheet":"Output | Exit Fee price caps","index":7,"n_rows":62,"n_cols":14,"rows_kept":62,"cut":false,"hidden":false,"merged":[[0,13,0,14],[23,3,23,4],[24,3,24,4],[25,3,25,4],[26,3,26,4],[22,8,22,12],[6,8,6,12],[7,3,7,4],[8,3,8,4],[9,3,9,4],[10,3,10,4],[11,3,11,4],[12,3,12,4],[13,3,13,4],[15,3,15,4],[16,3,16,4],[17,3,17,4],[60,3,60,4],[14,3,14,4],[47,3,47,4],[27,3,27,4],[61,3,61,4],[48,3,48,4],[28,3,28,4],[29,3,29,4],[30,3,30,4],[31,3,31,4],[32,3,32,4],[33,3,33,4],[43,3,43,4],[44,3,44,4],[45,3,45,4],[46,3,46,4],[59,8,59,12],[49,3,49,4],[50,3,50,4],[51,3,51,4],[52,3,52,4],[53,3,53,4]]}
[null,{"$f":"'Title Page'!B8&\" v\"&'Title Page'!$C$10","v":"JEN 2027-31 - ACS Standardised Metering Pricing Model  v1.02"},null,null,null,null,null,null,null,null,null,null,"DNSP:","D"]
[null,{"$f":"MID(CELL(\"filename\",A1),FIND(\"]\",CELL(\"filename\",A1))+1,255)","v":"Output | Exit Fee price caps"},null,null,null,null,null,"Key:","Input","External Link","Internal Link"]
[]
[]
[null,null,"Applicable Exit Fees Price Caps"]
[]
[null,null,null,null,null,null,null,"Base Year","Regulatory Period"]
[null,null,null,"Exit Fee Name",null,"Units","Basis",{"$f":"LEFT(I8,4)-1&\"-\"&RIGHT(I8,2)-1","v":"2025-26"},{"$f":"FPFirstYear","v":"2026-27"},{"$f":"LEFT(I8,4)+1&\"-\"&RIGHT(I8,2)+1","v":"2027-28"},{"$f":"LEFT(J8,4)+1&\"-\"&RIGHT(J8,2)+1","v":"2028-29"},{"$f":"LEFT(K8,4)+1&\"-\"&RIGHT(K8,2)+1","v":"2029-30"},{"$f":"LEFT(L8,4)+1&\"-\"&RIGHT(L8,2)+1","v":"2030-31"}]
[null,null,null,{"$f":"D25","v":"Single Phase (inc. DC)"},null,"$dollars","nominal",{"$f":"ROUND(H25,2)","v":191.64},{"$f":"IF(I25=0,0,ROUND(H9*(1-I45)*(1+I$41),2))","v":179.94},{"$f":"IF(J25=0,0,ROUND(I9*(1-J45)*(1+J$41),2))","v":192.14},219.55,253.89,290.95999999999998]
[null,null,null,{"$f":"D26","v":"Single Phase, Two Element"},null,"$dollars","nominal",191.64,189.25,202.32,231.86,269,309.2]
[null,null,null,"Three Phase (inc. DC)",null,"$dollars","nominal",{"$f":"ROUND(H27,2)","v":191.64},{"$f":"IF(I27=0,0,ROUND(H11*(1-I47)*(1+I$41),2))","v":223.75},{"$f":"IF(J27=0,0,ROUND(I11*(1-J47)*(1+J$41),2))","v":240.05},{"$f":"IF(K27=0,0,ROUND(J11*(1-K47)*(1+K$41),2))","v":277.48},{"$f":"IF(L27=0,0,ROUND(K11*(1-L47)*(1+L$41),2))","v":325},{"$f":"IF(M27=0,0,ROUND(L11*(1-M47)*(1+M$41),2))","v":376.82}]
[null,null,null,"Three Phase CT",null,"$dollars","nominal",191.64,291.86,314.52999999999997,367.52,435.52,510.28]
[null,null,null,0,null,"$dollars","nominal",0,0,0,0,0,0]
[null,null,null,0,null,"$dollars","nominal",0,0,0,0,0,0]
[null,null,null,0,null,"$dollars","nominal",0,0,0,0,0,0]
[null,null,null,0,null,"$dollars","nominal",0,0,0,0,0,0]
[null,null,null,0,null,"$dollars","nominal",0,0,0,0,0,0]
[null,null,null,0,null,"$dollars","nominal",0,0,0,0,0,0]
[]
[]
{"$rows_left_out":43}
{"sheet":"LUTs and Dropdowns","index":8,"n_rows":23,"n_cols":2,"rows_kept":23,"cut":false,"hidden":false,"merged":[]}
[null,{"$f":"'Title Page'!B8&\" v\"&'Title Page'!$C$10","v":"JEN 2027-31 - ACS Standardised Metering Pricing Model  v1.02"}]
[null,{"$f":"MID(CELL(\"filename\",A1),FIND(\"]\",CELL(\"filename\",A1))+1,255)","v":"LUTs and Dropdowns"}]
[]
[]
[]
[]
[]
[]
[]
[]
[]
[]
[]
[null,"Model Use"]
[null,"Price Cap"]
[null,"Exit Fees (Vic)"]
[null,"Show All Sheets"]
[]
[]
[null,"Admin Charges"]
{"$rows_left_out":3}