{"text_format":"1","workbook":"xlsx","n_sheets":13,"sheets":["_@RISKFitInformation","Tables in STPIS chapter","T7.1 Historical SC performance","F7.1-7.11 Performance vs target","T7.3 Prop SC target cap & colla","Source data","2020-24 actual performance data","2024","2023","2022 Q1","2022 Q2-4","2021","2020"],"not_rendered":{"charts":15,"images":0,"macros":0,"external_links":0,"defined_names":95,"comments":0,"pivot_tables":0},"unopened":[],"bounds":{"document_bytes":16777216,"sheet_cells":100000,"rows_first":2000,"rows_last":500,"rows_between":2000,"halvings":0,"cell_chars":16384,"cell_head_chars":4096},"cells_cut":0,"cells_raw":0,"read":"whole","date_system":"1900"}

{"sheet":"_@RISKFitInformation","index":0,"n_rows":36,"n_cols":16,"rows_kept":36,"cut":false,"hidden":true,"merged":[]}
["Created By Version","8.9.0"]
["Required Version","5.0.0"]
["Recommended Version","6.0.0"]
["Modified By Version","8.9.0"]
[]
[]
[]
[]
["Count",26]
["GUID","Name","Range","CRC","Options","Comp. Graph Serialization","PP Graph Serialization","QQ Graph Serialization","Unsued","Fixed Params","Bootstrap Options","BootstrapParamGraphSerialization","BatchFit Options","BootstrapGOFGraphSerialization","FitSelector"]
{"$rows_left_out":27}
{"sheet":"Tables in STPIS chapter","index":1,"n_rows":0,"n_cols":0,"rows_kept":0,"cut":false,"hidden":false,"merged":[]}

{"sheet":"T7.1 Historical SC performance","index":2,"n_rows":18,"n_cols":8,"rows_kept":18,"cut":false,"hidden":false,"merged":[[6,0,11,0],[12,0,13,0],[15,0,17,0]]}
[]
[]
[null,null,30,23,46,28,33]
[null,null,0,2,0,0,2]
[null,null,5,6,12,7,1]
["Parameter","Sub-parameter",2020,2021,2022,2023,2024,"2020-24 average"]
["Unplanned outage circuit event rate","Lines event rate - fault",{"$f":"'2020-24 actual performance data'!C23","v":0.17599999999999999},{"$f":"'2020-24 actual performance data'!D23","v":0.18253968253968253},{"$f":"'2020-24 actual performance data'!E23","v":6.3492063492063489E-2},{"$f":"'2020-24 actual performance data'!F23","v":5.3030303030303032E-2},{"$f":"'2020-24 actual performance data'!G23","v":9.0909090909090912E-2},{"$f":"AVERAGE(C7:G7)","v":0.11319422799422799}]
[null,"Transformer event rate - fault",{"$f":"'2020-24 actual performance data'!C24","v":0.15625},{"$f":"'2020-24 actual performance data'!D24","v":0.1984126984126984},{"$f":"'2020-24 actual performance data'!E24","v":7.1428571428571425E-2},{"$f":"'2020-24 actual performance data'!F24","v":4.8000000000000001E-2},{"$f":"'2020-24 actual performance data'!G24","v":7.6335877862595422E-2},{"$f":"AVERAGE(C8:G8)","v":0.11008542954077302}]
[null,"Reactive plant event rate - fault",{"$f":"'2020-24 actual performance data'!C25","v":0.22535211267605634},{"$f":"'2020-24 actual performance data'!D25","v":0.21428571428571427},{"$f":"'2020-24 actual performance data'!E25","v":4.1666666666666664E-2},{"$f":"'2020-24 actual performance data'!F25","v":0.12328767123287671},{"$f":"'2020-24 actual performance data'!G25","v":5.4054054054054057E-2},0.1317292437830736]
[null,"Lines event rate - forced",{"$f":"'2020-24 actual performance data'!C26","v":7.1999999999999995E-2},{"$f":"'2020-24 actual performance data'!D26","v":0.25396825396825395},{"$f":"'2020-24 actual performance data'!E26","v":5.5555555555555552E-2},{"$f":"'2020-24 actual performance data'!F26","v":2.2727272727272728E-2},{"$f":"'2020-24 actual performance data'!G26","v":7.575757575757576E-3},8.2365367965367947E-2]
{"$rows_left_out":9}
{"sheet":"F7.1-7.11 Performance vs target","index":3,"n_rows":83,"n_cols":17,"rows_kept":83,"cut":false,"hidden":false,"merged":[]}
[]
[]
[null,null,null,30,23,46,28,33]
[null,null,null,0,2,0,0,2]
[null,null,null,5,6,12,7,1]
["Parameter","Sub-parameter",null,"2020","2021","2022","2023","2024"]
["Unplanned outage curcuit event rate","Lines event rate - fault","Performance",{"$f":"INDEX('T7.1 Historical SC performance'!C$7:C$18,MATCH($B7,'T7.1 Historical SC performance'!$B$7:$B$18,0))","v":0.17599999999999999},{"$f":"INDEX('T7.1 Historical SC performance'!D$7:D$18,MATCH($B7,'T7.1 Historical SC performance'!$B$7:$B$18,0))","v":0.18253968253968253},{"$f":"INDEX('T7.1 Historical SC performance'!E$7:E$18,MATCH($B7,'T7.1 Historical SC performance'!$B$7:$B$18,0))","v":6.3492063492063489E-2},{"$f":"INDEX('T7.1 Historical SC performance'!F$7:F$18,MATCH($B7,'T7.1 Historical SC performance'!$B$7:$B$18,0))","v":5.3030303030303032E-2},{"$f":"INDEX('T7.1 Historical SC performance'!G$7:G$18,MATCH($B7,'T7.1 Historical SC performance'!$B$7:$B$18,0))","v":9.0909090909090912E-2},null,"lines",null,null,null,null,null,"lines"]
["Unplanned outage curcuit event rate","Lines event rate - fault","Cap ",0.11600000000000001,0.11600000000000001,0.11600000000000001,0.11600000000000001,0.11600000000000001,null,"fault",null,null,null,null,null,"forced"]
["Unplanned outage curcuit event rate","Lines event rate - fault","Target",0.17380000000000001,0.17380000000000001,0.17380000000000001,0.17380000000000001,0.17380000000000001]
["Unplanned outage curcuit event rate","Lines event rate - fault","Collar",0.23200000000000001,0.23200000000000001,0.23200000000000001,0.23200000000000001,0.23200000000000001]
{"$rows_left_out":74}
{"sheet":"T7.3 Prop SC target cap & colla","index":4,"n_rows":18,"n_cols":7,"rows_kept":18,"cut":false,"hidden":false,"merged":[[6,0,11,0],[12,0,13,0],[15,0,17,0]]}
[]
[]
[null,null,30,23,{"$f":"#REF!","v":{"$error":"#REF!"}},28]
[null,null,0,2,0,0]
[null,null,5,6,12,7]
["Parameter","Sub-parameter","Preferred distribution","Target","Floor","Cap","Weighting"]
["Unplanned outage curcuit event rate","Lines event rate - fault","Beta General",{"$f":"'T7.1 Historical SC performance'!H7","v":0.11319422799422799},5.3030300000000002E-2,0.1825397,0.2]
[null,"Transformer event rate - fault","Beta General",{"$f":"'T7.1 Historical SC performance'!H8","v":0.11008542954077302},4.8000000000000001E-2,0.19841259999999999,0.2]
[null,"Reactive plant event rate - fault","Uniform",{"$f":"'T7.1 Historical SC performance'!H9","v":0.1317292437830736},9.5216999999999993E-3,0.25749709999999998,0.1]
[null,"Lines event rate - forced","Exponential",{"$f":"'T7.1 Historical SC performance'!H10","v":8.2365367965367947E-2},0,0.21666748999999999,0.1]
{"$rows_left_out":9}
{"sheet":"Source data","index":5,"n_rows":0,"n_cols":0,"rows_kept":0,"cut":false,"hidden":false,"merged":[]}

{"sheet":"2020-24 actual performance data","index":6,"n_rows":34,"n_cols":12,"rows_kept":34,"cut":false,"hidden":false,"merged":[[20,0,20,6],[0,0,0,11],[2,3,4,3],[2,5,4,5],[2,7,4,7],[2,9,4,9],[2,11,4,11]]}
["Table 1: Raw data transferand outage rate calculation "]
[null,null,2020,2020,2021,2021,2022,2022,2023,2023,2024,2024]
[null,"Lines",{"$f":"'2020'!O3","v":125},null,{"$f":"'2021'!O3","v":126},null,{"$f":"'2022 Q2-4'!O3","v":126},null,{"$f":"'2023'!P9","v":132},null,{"$f":"'2024'!P9","v":132}]
[null,"Transformers",{"$f":"'2020'!O4","v":128},null,{"$f":"'2021'!O4","v":126},null,{"$f":"'2022 Q2-4'!O4","v":126},null,{"$f":"'2023'!P10","v":125},null,{"$f":"'2024'!P10","v":131}]
[null,"Reactive Plant ",{"$f":"'2020'!O5","v":71},null,{"$f":"'2021'!O5","v":70},null,{"$f":"'2022 Q2-4'!O5","v":72},null,{"$f":"'2023'!P11","v":73},null,{"$f":"'2024'!P11","v":74}]
["S","Performance parameter","No. of Outages","Outage Rate","No. of Outages","Outage Rate","No. of Outages","Outage Rate","No. of Outages","Outage Rate","No. of Outages","Outage Rate"]
["S1","line outage - fault ",{"$f":"'2020'!M3","v":22},{"$f":"C7/$C$3","v":0.17599999999999999},{"$f":"'2021'!M3","v":23},{"$f":"E7/$E$3","v":0.18253968253968253},{"$f":"'2022 Q1'!M3+'2022 Q2-4'!M3","v":8},{"$f":"G7/$G$3","v":6.3492063492063489E-2},{"$f":"'2023'!N9","v":7},{"$f":"I7/$I$3","v":5.3030303030303032E-2},{"$f":"'2024'!N9","v":12},{"$f":"K7/$K$3","v":9.0909090909090912E-2}]
["S2","transformer outage - fault",{"$f":"'2020'!M4","v":20},{"$f":"C8/$C$4","v":0.15625},{"$f":"'2021'!M4","v":25},{"$f":"E8/$E$4","v":0.1984126984126984},{"$f":"'2022 Q1'!M4+'2022 Q2-4'!M4","v":9},{"$f":"G8/$G$4","v":7.1428571428571425E-2},{"$f":"'2023'!N10","v":6},{"$f":"I8/$I$4","v":4.8000000000000001E-2},{"$f":"'2024'!N10","v":10},{"$f":"K8/$K$4","v":7.6335877862595422E-2}]
["S3","reactive plant - fault",{"$f":"'2020'!M5","v":16},{"$f":"C9/$C$5","v":0.22535211267605634},{"$f":"'2021'!M5","v":15},{"$f":"E9/$E$5","v":0.21428571428571427},{"$f":"'2022 Q1'!M5+'2022 Q2-4'!M5","v":3},{"$f":"G9/$G$5","v":4.1666666666666664E-2},{"$f":"'2023'!N11","v":9},{"$f":"I9/$I$5","v":0.12328767123287671},{"$f":"'2024'!N11","v":4},{"$f":"K9/$K$5","v":5.4054054054054057E-2}]
["S4","line outage - forced",{"$f":"'2020'!M6","v":9},{"$f":"C10/$C$3","v":7.1999999999999995E-2},{"$f":"'2021'!M6","v":32},{"$f":"E10/$E$3","v":0.25396825396825395},{"$f":"'2022 Q1'!M6+'2022 Q2-4'!M6","v":7},{"$f":"G10/$G$3","v":5.5555555555555552E-2},{"$f":"'2023'!N12","v":3},{"$f":"I10/$I$3","v":2.2727272727272728E-2},{"$f":"'2024'!N12","v":1},{"$f":"K10/$K$3","v":7.575757575757576E-3}]
{"$rows_left_out":25}
{"sheet":"2024","index":7,"n_rows":29,"n_cols":21,"rows_kept":29,"cut":false,"hidden":false,"merged":[[22,12,22,14],[22,17,22,19],[3,3,3,4],[4,3,4,4],[6,2,6,6],[6,8,6,10],[6,12,6,15],[6,17,6,20]]}
[]
[null,"Service Standards Performance"]
[]
[null,null,"TNSP","AusNet Services"]
[null,null,"Assessment period",2024]
[]
[null,"S","Performance parameter",null,null,null,null,null,"Average 2024 & 2023",null,null,null,2024,null,null,null,null,2023]
[null,null,"Unplanned circuit outage event rate (%)","Floor","Target","Cap","Revenue at Risk",null,"Performance\n(Without exclusions)","Performance\n(With exclusions)","Exclusions",null,"Performance\n(Without exclusions)","Performance\n(With exclusions)","Exclusions","No. of defined circuits",null,"Performance\n(Without exclusions)","Performance\n(With exclusions)","Exclusions","No. of defined circuits"]
[null,"S1","Lines event rate – fault ",22.37,17.09,12.43,2E-3,null,9.8484848484848477,7.1969696969696972,null,null,16,12,4,132,null,10,7,3,132]
[null,"S2","Transformer event rate – fault ",18.8,11.97,6.49,2E-3,null,9.6702290076335871,6.216793893129771,null,null,18,10,8,131,null,7,6,1,125]
{"$rows_left_out":20}
{"sheet":"2023","index":8,"n_rows":29,"n_cols":21,"rows_kept":29,"cut":false,"hidden":false,"merged":[[22,12,22,14],[22,17,22,19],[3,3,3,4],[4,3,4,4],[6,2,6,6],[6,8,6,10],[6,12,6,15],[6,17,6,20]]}
[]
[null,"Service Standards Performance"]
[]
[null,null,"TNSP","AusNet Services"]
[null,null,"Assessment period",2023]
[]
[null,"S","Performance parameter",null,null,null,null,null,"Average 2023 & 2022",null,null,null,2023,null,null,null,null,2022]
[null,null,"Unplanned circuit outage event rate (%)","Floor","Target","Cap","Revenue at Risk",null,"Performance\n(Without exclusions)","Performance\n(With exclusions)","Exclusions",null,"Performance\n(Without exclusions)","Performance\n(With exclusions)","Exclusions","No. of defined circuits",null,"Performance\n(Without exclusions)","Performance\n(With exclusions)","Exclusions","No. of defined circuits"]
[null,"S1","Lines event rate – fault ",22.37,17.09,12.43,2E-3,null,10.137085137085137,5.8261183261183263,null,null,10,7,3,132,null,16,8,8,126]
[null,"S2","Transformer event rate – fault ",18.8,11.97,6.49,2E-3,null,6.7682539682539673,5.9714285714285715,null,null,7,6,1,125,null,10,9,1,126]
{"$rows_left_out":20}
{"sheet":"2022 Q1","index":9,"n_rows":49,"n_cols":20,"rows_kept":49,"cut":false,"hidden":false,"merged":[[0,8,0,9],[0,11,0,14],[0,16,0,19]]}
[null,null,null,null,null,null,null,null,"Performance",null,null,"Number of events pa - 2022",null,null,null,null,"Number of events pa - 2021"]
[null,"Average circuit outage rate (%)","Floor","Target","Cap","Weighting"," ","Unit","without exclusions","with exclusions",null,"without exclusions","with exclusions","exclusions","No. of defined circuits",null,"without exclusions","with exclusions","exclusions","No. of defined circuits"]
["S1","line outage - fault ",33.799999999999997,25.4,16,0.2,null,"average circuit outage rate ",14.68253968253968,9.9206349206349209,null,6,2,4,126,null,31,23,8,126]
["S2","transformer outage - fault",31.8,20.3,9.1999999999999993,0.2,null,"average circuit outage rate ",11.111111111111111,9.9206349206349209,null,1,0,1,126,null,27,25,2,126]
["S3","reactive plant - fault",61.2,34.299999999999997,18.399999999999999,0.1,null,"average circuit outage rate ",12.103174603174601,12.103174603174601,null,2,2,0,72,null,15,15,0,70]
["S4","line outage - forced",17.100000000000001,15,12.3,0.1,null,"average circuit outage rate ",26.190476190476193,12.698412698412698,null,0,0,0,126,null,66,32,34,126]
["S5","transformer outage - forced",14.4,10.4,6.1,0.1,null,"average circuit outage rate ",9.5238095238095237,7.9365079365079358,null,3,3,0,126,null,21,17,4,126]
["S6","reactive plant - forced",40.700000000000003,30.9,19.899999999999999,0.05,null,"average circuit outage rate ",7.083333333333333,7.083333333333333,null,3,3,0,72,null,7,7,0,70]
[null,"Loss of supply event frequency*",null,null,null,null,null,null,null,null,"exclusions"]
["S7",">0.05 system minutes",0,1,2,0.15,null,"number of events per annum",0,0,0]
{"$rows_left_out":40}
{"sheet":"2022 Q2-4","index":10,"n_rows":49,"n_cols":20,"rows_kept":49,"cut":false,"hidden":false,"merged":[[0,8,0,9],[0,11,0,14],[0,16,0,19]]}
[null,null,null,null,null,null,null,null,"Performance",null,null,"Number of events pa - 2022",null,null,null,null,"Number of events pa - 2021"]
[null,"Average circuit outage rate (%)","Floor","Target","Cap","Weighting"," ","Unit","without exclusions","with exclusions",null,"without exclusions","with exclusions","exclusions","No. of defined circuits",null,"without exclusions","with exclusions","exclusions","No. of defined circuits"]
["S1","line outage - fault ",22.37,17.09,12.43,0.2,null,"average circuit outage rate ",16.269841269841269,11.507936507936508,null,10,6,4,126,null,31,23,8,126]
["S2","transformer outage - fault",18.8,11.97,6.49,0.2,null,"average circuit outage rate ",14.285714285714285,13.492063492063492,null,9,9,0,126,null,27,25,2,126]
["S3","reactive plant - fault",30.43,20.669999999999998,14.899999999999999,0.1,null,"average circuit outage rate ",11.408730158730158,11.408730158730158,null,1,1,0,72,null,15,15,0,70]
["S4","line outage - forced",20.74,10.14,3.82,0.1,null,"average circuit outage rate ",28.968253968253972,15.476190476190476,null,7,7,0,126,null,66,32,34,126]
["S5","transformer outage - forced",15.879999999999999,11.97,7.5399999999999991,0.1,null,"average circuit outage rate ",12.301587301587301,9.9206349206349209,null,10,8,2,126,null,21,17,4,126]
["S6","reactive plant - forced",34.660000000000004,27.779999999999998,19.650000000000002,0.05,null,"average circuit outage rate ",6.3888888888888884,5.6944444444444446,null,2,1,1,72,null,7,7,0,70]
[null,"Loss of supply event frequency*",null,null,null,null,null,null,null,null,"exclusions"]
["S7",">0.05 system minutes",3,1,0,0.15,null,"number of events per annum",2,2,0]
{"$rows_left_out":40}
{"sheet":"2021","index":11,"n_rows":49,"n_cols":20,"rows_kept":49,"cut":false,"hidden":false,"merged":[[0,8,0,9],[0,11,0,14],[0,16,0,19]]}
[null,null,null,null,null,null,null,null,"Performance",null,null,"Number of events pa - 2021",null,null,null,null,"Number of events pa - 2020"]
[null,"Average circuit outage rate (%)","Floor","Target","Cap","Weighting"," ","Unit","without exclusions","with exclusions",null,"without exclusions","with exclusions","exclusions","No. of defined circuits",null,"without exclusions","with exclusions","exclusions","No. of defined circuits"]
["S1","line outage - fault ",33.799999999999997,25.4,16,0.2,null,"average circuit outage rate ",24.701587301587303,17.926984126984124,null,31,23,8,126,null,31,22,9,125]
["S2","transformer outage - fault",31.8,20.3,9.1999999999999993,0.2,null,"average circuit outage rate ",19.308035714285715,17.733134920634917,null,27,25,2,126,null,22,20,2,128]
["S3","reactive plant - fault",61.199999999999996,34.299999999999997,18.399999999999999,0.1,null,"average circuit outage rate ",21.981891348088531,21.981891348088531,null,15,15,0,70,null,16,16,0,71]
["S4","line outage - forced",17.100000000000001,15,12.3,0.1,null,"average circuit outage rate ",60.590476190476195,16.298412698412697,null,66,32,34,126,null,86,9,77,125]
["S5","transformer outage - forced",14.399999999999999,10.4,6.1,0.1,null,"average circuit outage rate ",16.536458333333332,12.605406746031743,null,21,17,4,126,null,21,15,6,128]
["S6","reactive plant - forced",40.699999999999996,30.9,19.899999999999999,0.05,null,"average circuit outage rate ",14.859154929577464,14.859154929577464,null,7,7,0,70,null,14,14,0,71]
[null,"Loss of supply event frequency*",null,null,null,null,null,null,null,null,"exclusions"]
["S7",">0.05 system minutes",5,2,0,0.15,null,"number of events per annum",0,0,0]
{"$rows_left_out":40}
{"sheet":"2020","index":12,"n_rows":49,"n_cols":20,"rows_kept":49,"cut":false,"hidden":false,"merged":[[0,8,0,9],[0,11,0,14],[0,16,0,19]]}
[null,null,null,null,null,null,null,null,"Performance",null,null,"Number of events pa - 2020",null,null,null,null,"Number of events pa - 2019"]
[null,"Average circuit outage rate (%)","Floor","Target","Cap","Weighting"," ","Unit","without exclusions","with exclusions",null,"without exclusions","with exclusions","exclusions","No. of defined circuits",null,"without exclusions","with exclusions","exclusions","No. of defined circuits"]
["S1","line outage - fault ",33.799999999999997,25.4,16,0.2,null,"average circuit outage rate ",21.74959349593496,15.304065040650405,null,31,22,9,125,null,23,16,7,123]
["S2","transformer outage - fault",31.8,20.3,9.1999999999999993,0.2,null,"average circuit outage rate ",12.109375,10.9375,null,22,20,2,128,null,9,8,1,128]
["S3","reactive plant - fault",61.199999999999996,34.299999999999997,18.399999999999999,0.1,null,"average circuit outage rate ",27.464788732394368,26.056338028169012,null,16,16,0,71,null,23,21,2,71]
["S4","line outage - forced",17.100000000000001,15,12.3,0.1,null,"average circuit outage rate ",63.668292682926818,6.0390243902439025,null,86,9,77,125,null,72,6,66,123]
["S5","transformer outage - forced",14.399999999999999,10.4,6.1,0.1,null,"average circuit outage rate ",14.0625,11.71875,null,21,15,6,128,null,15,15,0,128]
["S6","reactive plant - forced",40.699999999999996,30.9,19.899999999999999,0.05,null,"average circuit outage rate ",23.239436619718308,22.535211267605632,null,14,14,0,71,null,19,18,1,71]
[null,"Loss of supply event frequency*",null,null,null,null,null,null,null,null,"exclusions"]
["S7",">0.05 system minutes",5,2,0,0.15,null,"number of events per annum",3,3,0]
{"$rows_left_out":39}