{"text_format":"1","workbook":"xlsx","n_sheets":12,"sheets":["Title Page","AER Changelog","Inputs | General","Price Cap >","Inputs | Price Cap","Calc | Price Cap","Output | Price Caps","Exit Fees >","Input | Exit Fees","Calc | Exit Fees","Output | Exit Fee price caps","LUTs and Dropdowns"],"not_rendered":{"charts":0,"images":1,"macros":1,"external_links":2,"defined_names":23,"comments":0,"pivot_tables":0},"unopened":[],"bounds":{"document_bytes":16777216,"sheet_cells":100000,"rows_first":2000,"rows_last":500,"rows_between":2000,"halvings":0,"cell_chars":16384,"cell_head_chars":4096},"cells_cut":0,"cells_raw":0,"read":"whole","date_system":"1900"}

{"sheet":"Title Page","index":0,"n_rows":30,"n_cols":8,"rows_kept":30,"cut":false,"hidden":false,"merged":[[13,1,13,23],[7,1,8,23],[32,4,32,7],[24,1,24,23],[27,4,27,7],[30,4,30,7],[31,4,31,7],[29,4,29,7],[28,4,28,7]]}
[]
[]
[]
[]
[]
[]
[]
[null,"Final Standardised Metering Pricing Model "]
[]
[null,"Version",1.02]
[null,"Date","2022-01-14"]
[]
[]
[null,"Status"]
[]
{"$rows_left_out":16}
{"sheet":"AER Changelog","index":1,"n_rows":15,"n_cols":4,"rows_kept":15,"cut":false,"hidden":false,"merged":[]}
[]
[null,"Worksheet","Cells","Description of change"]
[null,"Throughout workbook",null,"Added cost basis labelling"]
[null,"Inputs | General","C28:N29","Added historical inflation for escalation of inputs"]
[null,"Inputs | General","C30:N30","Added labour cost escalators"]
[null,"Inputs | Exit Fees","C9:N21","Updated inputs from RAB to reflect use of net capex, use of real regulatory depreciation and escalation to nominal, and closing balance to better represent data."]
[null,"Inputs | Exit Fees","G31:G35","Updated 2025–26 meter exit fees"]
[null,"Inputs | Exit Fees","J51:J65","Updated cost basis"]
[null,"Inputs | Exit Fees","L52:L53","Updated meter labour costs"]
[null,"Inputs | Exit Fees","F93:G93","Updated administration hourly rate to be the draft decision ANS 2026-31 price"]
[null,"Calc | Exit Fees","K46:O55","Added CPI and labour escalations to calculations"]
[null,"Calc | Exit Fees","K77:O88","Updated calculation to consistently refer to closing balances"]
[null,"Calc | Exit Fees","K109:O109","Updated calculations to refer to closing balances"]
[null,"Calc | Exit Fees","F117:K117","Updated year labelling"]
[null,"Calc | Exit Fees","G121:K139","Added escalation of admin costs"]
{"$rows_left_out":1}
{"sheet":"Inputs | General","index":2,"n_rows":31,"n_cols":23,"rows_kept":31,"cut":false,"hidden":false,"merged":[[4,1,4,6],[1,10,1,11],[1,12,1,13],[20,1,20,6],[23,9,23,13]]}
[null,{"$f":"'Title Page'!B8&\" v\"&'Title Page'!$C$10","v":"Final Standardised Metering Pricing Model  v1.02"},null,null,null,null,null,null,null,null,null,null,null,null,null,null,null,null,null,null,null,"Worksheet check:",{"$f":"IF(COUNTA($X$14:$X$50)=COUNTIF($X14:$X51,\"OK\"),\"OK\",\"Check\")","v":"OK"}]
[null,{"$f":"MID(CELL(\"filename\",A1),FIND(\"]\",CELL(\"filename\",A1))+1,255)","v":"Inputs | General"},null,null,null,null,null,null,"Key:","Input","External Link",null,"Internal Link",null,"Draft Decision","Revised proposal"]
[]
[]
[null,"1. Inputs - General"]
[]
[null,null,"Inputs","Source","Input Format",null,"Value"]
[null,null,"NSP name","NSP",null,null,"AusNet"]
[null,null,"Decision stage","NSP",null,null,"revised proposal"]
[]
[null,null,"Forecast regulatory control period, first year","NSP","YYYY-YY",null,"2026-27"]
[null,null,"Forecast regulatory control period, last year","NSP",null,null,{"$f":"LEFT(FPFirstYear,4)+4&\"-\"&RIGHT(FPFirstYear,2)+4","v":"2030-31"}]
[]
[null,null,"Regulatory Period Length, Yrs",null,null,null,{"$f":"LEFT(G12,4)-LEFT(FPFirstYear,4)+1","v":5}]
[]
{"$rows_left_out":17}
{"sheet":"Price Cap >","index":3,"n_rows":0,"n_cols":0,"rows_kept":0,"cut":false,"hidden":false,"merged":[]}

{"sheet":"Inputs | Price Cap","index":4,"n_rows":125,"n_cols":22,"rows_kept":125,"cut":false,"hidden":false,"merged":[[94,1,94,7],[1,10,1,11],[40,9,40,13],[38,1,38,7],[6,7,6,11],[4,1,4,6],[14,1,14,6],[4,9,4,11],[14,9,14,11],[38,9,38,11]]}
[null,{"$f":"'Title Page'!B8&\" v\"&'Title Page'!$C$10","v":"Final Standardised Metering Pricing Model  v1.02"},null,null,null,null,null,null,null,null,null,null,null,"DNSP:",{"$f":"IF('Inputs | General'!$G$16=\"Exit Fees (Vic)\",\"NOT USED\",NSP)","v":"NOT USED"},null,null,null,null,null,"Worksheet check:",{"$f":"IF(COUNTA($W$4:$W$71)=COUNTIF($W4:$W72,\"OK\"),\"OK\",\"Check\")","v":"OK"}]
[null,{"$f":"MID(CELL(\"filename\",A1),FIND(\"]\",CELL(\"filename\",A1))+1,255)","v":"Inputs | Price Cap"},null,null,null,null,null,"Key:","Input","External Link","Internal Link"]
[]
[]
[null,{"$f":"LEFT('Inputs | General'!B21,1)+1&\". Linked Input -  Inflation & Discount Rates\"","v":"3. Linked Input -  Inflation & Discount Rates"},null,null,null,null,null,null,null,{"$f":"IF('Inputs | General'!$G$16=\"Exit Fees (Vic)\",\"NOT USED\",\"\")","v":"NOT USED"}]
[]
[null,"Linked Inputs - Discount Rates",null,null,null,null,"Base year","Regulatory period"]
[null,null,"Year",null,"Units",null,{"$f":"LEFT(H8,4)-1&\"-\"&RIGHT(H8,2)-1","v":"2025-26"},{"$f":"FPFirstYear","v":"2026-27"},{"$f":"LEFT(H8,4)+1&\"-\"&RIGHT(H8,2)+1","v":"2027-28"},{"$f":"LEFT(I8,4)+1&\"-\"&RIGHT(I8,2)+1","v":"2028-29"},"2029-30","2030-31",null,"Link from PTRM"]
[null,null,"Nominal Vanilla WACC",null,"%",null,null,0.05,0.05,0.05,0.05,0.05]
[null,null,"Cumulative Discount Index",null,"Index",null,1,{"$f":"G10*(1+H9)","v":1.05},{"$f":"H10*(1+I9)","v":1.1025},{"$f":"I10*(1+J9)","v":1.1576250000000001},{"$f":"J10*(1+K9)","v":1.2155062500000002},{"$f":"K10*(1+L9)","v":1.2762815625000004}]
[]
[]
[]
[]
[null,{"$f":"LEFT(B5,1)+1&\". Linked Input - Building Block Revenue Requirements\"","v":"4. Linked Input - Building Block Revenue Requirements"},null,null,null,null,null,null,null,{"$f":"IF('Inputs | General'!$G$16=\"Exit Fees (Vic)\",\"NOT USED\",\"\")","v":"NOT USED"}]
{"$rows_left_out":111}
{"sheet":"Calc | Price Cap","index":5,"n_rows":63,"n_cols":14,"rows_kept":63,"cut":false,"hidden":false,"merged":[[7,9,7,13],[4,1,4,7],[1,10,1,11],[0,13,0,14]]}
[null,{"$f":"'Title Page'!B8&\" v\"&'Title Page'!$C$10","v":"Final Standardised Metering Pricing Model  v1.02"},null,null,null,null,null,null,null,null,null,null,"DNSP:",{"$f":"IF('Inputs | General'!$G$16=\"Exit Fees (Vic)\",\"NOT USED\",NSP)","v":"NOT USED"}]
[null,{"$f":"MID(CELL(\"filename\",A1),FIND(\"]\",CELL(\"filename\",A1))+1,255)","v":"Calc | Price Cap"},null,null,null,null,null,"Key:","Input","External Link","Internal Link"]
[]
[]
[null,"Annual Charges Calculations"]
[]
[null,"Annual Smoothed Revenue Calculation"]
[null,null,null,null,null,null,null,null,"Base Year Revenue","Annual Revenue"]
["▼ Table Filters",null,"Tariff #","Tariff name","Application","Tariff Code","Other designation",null,{"$f":"LEFT(J9,4)-1&\"-\"&RIGHT(J9,2)-1","v":"2025-26"},{"$f":"FPFirstYear","v":"2026-27"},{"$f":"LEFT(J9,4)+1&\"-\"&RIGHT(J9,2)+1","v":"2027-28"},{"$f":"LEFT(K9,4)+1&\"-\"&RIGHT(K9,2)+1","v":"2028-29"},"2029-30","2030-31"]
[null,null,"Tariff #","Tariff name","Application","Tariff Code","Other designation","Column1","F-RP-1","F-RP0","F-RP+1","F-RP+2","F-RP+3","F-RP+4"]
[null,null,1,{"$f":"'Inputs | Price Cap'!D44","v":"Residential Non ToU"},"Non-capital",{"$f":"'Inputs | Price Cap'!F44","v":"R1"},{"$f":"'Inputs | Price Cap'!G44","v":"Primary"},null,{"$f":"'Output | Price Caps'!$I9*'Inputs | Price Cap'!I44","v":10000000},{"$f":"'Output | Price Caps'!J9*'Inputs | Price Cap'!J44","v":11754000},{"$f":"'Output | Price Caps'!K9*'Inputs | Price Cap'!K44","v":10959300},{"$f":"'Output | Price Caps'!L9*'Inputs | Price Cap'!L44","v":10220580},{"$f":"'Output | Price Caps'!M9*'Inputs | Price Cap'!M44","v":9533133},{"$f":"'Output | Price Caps'!N9*'Inputs | Price Cap'!N44","v":8892779.4000000004}]
[null,null,1,{"$f":"'Inputs | Price Cap'!D45","v":"Residential Non ToU"},"Capital",{"$f":"'Inputs | Price Cap'!F45","v":"R1"},{"$f":"'Inputs | Price Cap'!G45","v":"Primary"},null,{"$f":"'Output | Price Caps'!$I10*'Inputs | Price Cap'!I45","v":22000000},{"$f":"'Output | Price Caps'!J10*'Inputs | Price Cap'!J45","v":19745000},{"$f":"'Output | Price Caps'!K10*'Inputs | Price Cap'!K45","v":19646000},{"$f":"'Output | Price Caps'!L10*'Inputs | Price Cap'!L45","v":19547000},{"$f":"'Output | Price Caps'!M10*'Inputs | Price Cap'!M45","v":19459000},{"$f":"'Output | Price Caps'!N10*'Inputs | Price Cap'!N45","v":19371000}]
[null,null,1,{"$f":"'Inputs | Price Cap'!D46","v":"Residential Non ToU"},"Total",{"$f":"'Inputs | Price Cap'!F46","v":"R1"},{"$f":"'Inputs | Price Cap'!G46","v":"Primary"},null,{"$f":"I11+I12","v":32000000},31499000,30605300,29767580,28992133,28263779.399999999]
[null,null,2,{"$f":"'Inputs | Price Cap'!D47","v":"Residential ToU"},"Non-capital",{"$f":"'Inputs | Price Cap'!F47","v":"R2"},{"$f":"'Inputs | Price Cap'!G47","v":"Primary"},null,{"$f":"'Output | Price Caps'!$I12*'Inputs | Price Cap'!I47","v":6000000},{"$f":"'Output | Price Caps'!J12*'Inputs | Price Cap'!J47","v":7055100},{"$f":"'Output | Price Caps'!K12*'Inputs | Price Cap'!K47","v":6580440},{"$f":"'Output | Price Caps'!L12*'Inputs | Price Cap'!L47","v":6136722},{"$f":"'Output | Price Caps'!M12*'Inputs | Price Cap'!M47","v":5723816.3999999994},{"$f":"'Output | Price Caps'!N12*'Inputs | Price Cap'!N47","v":5337439.1099999994}]
[null,null,2,{"$f":"'Inputs | Price Cap'!D48","v":"Residential ToU"},"Capital",{"$f":"'Inputs | Price Cap'!F48","v":"R2"},{"$f":"'Inputs | Price Cap'!G48","v":"Primary"},null,{"$f":"'Output | Price Caps'!$I13*'Inputs | Price Cap'!I48","v":6600000},{"$f":"'Output | Price Caps'!J13*'Inputs | Price Cap'!J48","v":5923500},{"$f":"'Output | Price Caps'!K13*'Inputs | Price Cap'!K48","v":5893800},{"$f":"'Output | Price Caps'!L13*'Inputs | Price Cap'!L48","v":5864100},{"$f":"'Output | Price Caps'!M13*'Inputs | Price Cap'!M48","v":5837700},{"$f":"'Output | Price Caps'!N13*'Inputs | Price Cap'!N48","v":5811300}]
{"$rows_left_out":49}
{"sheet":"Output | Price Caps","index":6,"n_rows":70,"n_cols":22,"rows_kept":70,"cut":false,"hidden":false,"merged":[[56,3,57,3],[65,9,65,13],[5,9,5,13],[1,10,1,11],[0,14,0,15]]}
[null,null,{"$f":"'Title Page'!B8&\" v\"&'Title Page'!$C$10","v":"Final Standardised Metering Pricing Model  v1.02"},null,null,null,null,null,null,null,null,null,null,"DNSP:",{"$f":"IF('Inputs | General'!$G$16=\"Exit Fees (Vic)\",\"NOT USED\",NSP)","v":"NOT USED"},null,null,null,null,null,"Worksheet check:",{"$f":"IF(COUNTA($W$5:$W$52)=COUNTIF($W5:$W53,\"OK\"),\"OK\",\"Check\")","v":"OK"}]
[null,null,{"$f":"MID(CELL(\"filename\",A1),FIND(\"]\",CELL(\"filename\",A1))+1,255)","v":"Output | Price Caps"},null,null,null,null,"Key:","Input","External Link","Internal Link"]
[]
[]
[null,"RESULT - Price Cap - Annual Charges"]
[null,null,null,null,null,null,null,null,"Base Year Charges","Price Cap - Annual Charges (nominal)"]
["▼ Table Filters",null,"Tariff #","Tariff name","Application","Tariff Code","Other designation",null,{"$f":"LEFT(J7,4)-1&\"-\"&RIGHT(J7,2)-1","v":"2025-26"},{"$f":"FPFirstYear","v":"2026-27"},{"$f":"LEFT(J7,4)+1&\"-\"&RIGHT(J7,2)+1","v":"2027-28"},{"$f":"LEFT(K7,4)+1&\"-\"&RIGHT(K7,2)+1","v":"2028-29"},"2029-30","2030-31"]
[null,null,"Tariff #","Tariff name","Application","Tariff Code","Other designation","Ca","F-RP-1","F-RP0","F-RP+1","F-RP+2","F-RP+3","F-RP+4","Column1"]
[null,null,1,{"$f":"'Inputs | Price Cap'!D44","v":"Residential Non ToU"},"Non-capital",{"$f":"'Inputs | Price Cap'!F44","v":"R1"},{"$f":"'Inputs | Price Cap'!G44","v":"Primary"},null,{"$f":"ROUND('Inputs | Price Cap'!H44,2)","v":10},{"$f":"ROUND('Output | Price Caps'!I9*(1-'Inputs | Price Cap'!F$109)*(1+'Inputs | General'!J$26),2)","v":13.06},{"$f":"ROUND('Output | Price Caps'!J9*(1-'Inputs | Price Cap'!G$109)*(1+'Inputs | General'!K$26),2)","v":13.53},{"$f":"ROUND('Output | Price Caps'!K9*(1-'Inputs | Price Cap'!H$109)*(1+'Inputs | General'!L$26),2)","v":14.02},{"$f":"ROUND('Output | Price Caps'!L9*(1-'Inputs | Price Cap'!I$109)*(1+'Inputs | General'!M$26),2)","v":14.53},{"$f":"ROUND('Output | Price Caps'!M9*(1-'Inputs | Price Cap'!J$109)*(1+'Inputs | General'!N$26),2)","v":15.06}]
[null,null,1,{"$f":"'Inputs | Price Cap'!D45","v":"Residential Non ToU"},"Capital",{"$f":"'Inputs | Price Cap'!F45","v":"R1"},{"$f":"'Inputs | Price Cap'!G45","v":"Primary"},null,{"$f":"ROUND('Inputs | Price Cap'!H45,2)","v":20},{"$f":"ROUND('Output | Price Caps'!I10*(1-'Inputs | Price Cap'!F$125)*(1+'Inputs | General'!J$26),2)","v":17.95},{"$f":"ROUND('Output | Price Caps'!J10*(1-'Inputs | Price Cap'!G$125)*(1+'Inputs | General'!K$26),2)","v":17.86},{"$f":"ROUND('Output | Price Caps'!K10*(1-'Inputs | Price Cap'!H$125)*(1+'Inputs | General'!L$26),2)","v":17.77},{"$f":"ROUND('Output | Price Caps'!L10*(1-'Inputs | Price Cap'!I$125)*(1+'Inputs | General'!M$26),2)","v":17.690000000000001},{"$f":"ROUND('Output | Price Caps'!M10*(1-'Inputs | Price Cap'!J$125)*(1+'Inputs | General'!N$26),2)","v":17.61}]
[null,null,1,{"$f":"'Inputs | Price Cap'!D46","v":"Residential Non ToU"},"Total",{"$f":"'Inputs | Price Cap'!F46","v":"R1"},{"$f":"'Inputs | Price Cap'!G46","v":"Primary"},null,{"$f":"ROUND('Inputs | Price Cap'!H46,2)","v":30},{"$f":"J9+J10","v":31.009999999999998},{"$f":"K9+K10","v":31.39},{"$f":"L9+L10","v":31.79},{"$f":"M9+M10","v":32.22},{"$f":"N9+N10","v":32.67}]
[null,null,2,{"$f":"'Inputs | Price Cap'!D47","v":"Residential ToU"},"Non-capital",{"$f":"'Inputs | Price Cap'!F47","v":"R2"},{"$f":"'Inputs | Price Cap'!G47","v":"Primary"},null,{"$f":"ROUND('Inputs | Price Cap'!H47,2)","v":20},{"$f":"ROUND('Output | Price Caps'!I12*(1-'Inputs | Price Cap'!F$109)*(1+'Inputs | General'!J$26),2)","v":26.13},{"$f":"ROUND('Output | Price Caps'!J12*(1-'Inputs | Price Cap'!G$109)*(1+'Inputs | General'!K$26),2)","v":27.08},{"$f":"ROUND('Output | Price Caps'!K12*(1-'Inputs | Price Cap'!H$109)*(1+'Inputs | General'!L$26),2)","v":28.06},{"$f":"ROUND('Output | Price Caps'!L12*(1-'Inputs | Price Cap'!I$109)*(1+'Inputs | General'!M$26),2)","v":29.08},{"$f":"ROUND('Output | Price Caps'!M12*(1-'Inputs | Price Cap'!J$109)*(1+'Inputs | General'!N$26),2)","v":30.13}]
[null,null,2,{"$f":"'Inputs | Price Cap'!D48","v":"Residential ToU"},"Capital",{"$f":"'Inputs | Price Cap'!F48","v":"R2"},{"$f":"'Inputs | Price Cap'!G48","v":"Primary"},null,{"$f":"ROUND('Inputs | Price Cap'!H48,2)","v":20},{"$f":"ROUND('Output | Price Caps'!I13*(1-'Inputs | Price Cap'!F$125)*(1+'Inputs | General'!J$26),2)","v":17.95},{"$f":"ROUND('Output | Price Caps'!J13*(1-'Inputs | Price Cap'!G$125)*(1+'Inputs | General'!K$26),2)","v":17.86},{"$f":"ROUND('Output | Price Caps'!K13*(1-'Inputs | Price Cap'!H$125)*(1+'Inputs | General'!L$26),2)","v":17.77},{"$f":"ROUND('Output | Price Caps'!L13*(1-'Inputs | Price Cap'!I$125)*(1+'Inputs | General'!M$26),2)","v":17.690000000000001},{"$f":"ROUND('Output | Price Caps'!M13*(1-'Inputs | Price Cap'!J$125)*(1+'Inputs | General'!N$26),2)","v":17.61}]
[null,null,2,{"$f":"'Inputs | Price Cap'!D49","v":"Residential ToU"},"Total",{"$f":"'Inputs | Price Cap'!F49","v":"R2"},{"$f":"'Inputs | Price Cap'!G49","v":"Primary"},null,{"$f":"ROUND('Inputs | Price Cap'!H49,2)","v":40},{"$f":"J12+J13","v":44.08},{"$f":"K12+K13","v":44.94},{"$f":"L12+L13","v":45.83},{"$f":"M12+M13","v":46.769999999999996},{"$f":"N12+N13","v":47.739999999999995}]
[null,null,3,{"$f":"'Inputs | Price Cap'!D50","v":"Controlled load"},"Non-capital",{"$f":"'Inputs | Price Cap'!F50","v":"B1"},{"$f":"'Inputs | Price Cap'!G50","v":"Secondary"},null,{"$f":"ROUND('Inputs | Price Cap'!H50,2)","v":1},{"$f":"ROUND('Output | Price Caps'!I15*(1-'Inputs | Price Cap'!F$109)*(1+'Inputs | General'!J$26),2)","v":1.31},{"$f":"ROUND('Output | Price Caps'!J15*(1-'Inputs | Price Cap'!G$109)*(1+'Inputs | General'!K$26),2)","v":1.36},{"$f":"ROUND('Output | Price Caps'!K15*(1-'Inputs | Price Cap'!H$109)*(1+'Inputs | General'!L$26),2)","v":1.41},{"$f":"ROUND('Output | Price Caps'!L15*(1-'Inputs | Price Cap'!I$109)*(1+'Inputs | General'!M$26),2)","v":1.46},{"$f":"ROUND('Output | Price Caps'!M15*(1-'Inputs | Price Cap'!J$109)*(1+'Inputs | General'!N$26),2)","v":1.51}]
{"$rows_left_out":56}
{"sheet":"Exit Fees >","index":7,"n_rows":0,"n_cols":0,"rows_kept":0,"cut":false,"hidden":false,"merged":[]}

{"sheet":"Input | Exit Fees","index":8,"n_rows":121,"n_cols":17,"rows_kept":121,"cut":false,"hidden":false,"merged":[[99,3,99,5],[96,3,96,5],[119,3,119,5],[68,9,68,14],[113,3,113,5],[114,3,114,5],[115,3,115,5],[116,3,116,5],[118,3,118,5],[117,3,117,5],[109,3,109,5],[110,3,110,5],[111,3,111,5],[112,3,112,5],[88,1,88,7],[97,3,97,5],[98,3,98,5],[0,13,0,14],[49,3,49,5],[4,1,4,6],[26,1,26,7],[43,1,43,7],[6,7,6,11],[4,9,4,11],[23,1,23,3]]}
[null,{"$f":"'Title Page'!B8&\" v\"&'Title Page'!$C$10","v":"Final Standardised Metering Pricing Model  v1.02"},null,null,null,null,null,null,null,null,null,null,"DNSP:",{"$f":"IF('Inputs | General'!$G$16=\"Price Cap\",\"NOT USED\",NSP)","v":"AusNet"}]
[null,{"$f":"MID(CELL(\"filename\",A1),FIND(\"]\",CELL(\"filename\",A1))+1,255)","v":"Input | Exit Fees"},null,null,null,null,null,"Key:","Input","External Link","Internal Link","Draft Decision","Revised Proposal"]
[]
[]
[null,{"$f":"LEFT('Inputs | General'!B21,1)+1&\". Linked Input - RAB\"","v":"3. Linked Input - RAB"},null,null,null,null,null,null,null,{"$f":"IF('Inputs | General'!$G$16=\"Price Cap\",\"NOT USED\",\"\")","v":""}]
[]
[null,"Linked Input - RAB Meters",null,null,null,null,"Base Year","Regulatory Period"]
[null,null,null,null,"Units",null,{"$f":"LEFT(H8,4)-1&\"-\"&RIGHT(H8,2)-1","v":"2025-26"},{"$f":"FPFirstYear","v":"2026-27"},{"$f":"LEFT(H8,4)+1&\"-\"&RIGHT(H8,2)+1","v":"2027-28"},{"$f":"LEFT(I8,4)+1&\"-\"&RIGHT(I8,2)+1","v":"2028-29"},{"$f":"LEFT(J8,4)+1&\"-\"&RIGHT(J8,2)+1","v":"2029-30"},{"$f":"LEFT(K8,4)+1&\"-\"&RIGHT(K8,2)+1","v":"2030-31"},{"$f":"LEFT(L8,4)+1&\"-\"&RIGHT(L8,2)+1","v":"2031-32"}]
[null,null,"Opening RAB",null,"$m","$nominal",null,{"$f":"G13","v":117.49195264148101},{"$f":"H13","v":95.645616307929771},{"$f":"I13","v":101.61580319679688},128.9152154180365,172.85161911967327,217.70057456642542,"Opening balance of METERS row in PTRM inputs sheet of PTRM"]
[null,null,"Net capital expenditure",null,"$m","$nominal",null,{"$f":"[1]Assets!G$62","v":14.389366463216687},{"$f":"[1]Assets!H$62","v":15.519943361371411},{"$f":"[1]Assets!I$62","v":35.068742516240832},{"$f":"[1]Assets!J$62","v":54.306436109638859},{"$f":"[1]Assets!K$62","v":59.203165518278752},null,"Net capex from METERS row in ASSETS sheet of PTRM"]
[null,null,"Regulatory depreciation",null,"$m","$2025–26",null,{"$f":"[1]Assets!G$128","v":35.317457507201439},{"$f":"[1]Assets!H$128","v":9.0718901242643764},{"$f":"[1]Assets!I$128","v":7.1935259058175829},{"$f":"[1]Assets!J$128","v":9.3581732923697523},{"$f":"[1]Assets!K$128","v":12.62533788106056},null,"Depreciation from METERS row in ASSETS sheet of PTRM"]
[null,null,"Regulatory depreciation",null,"$m","$nominal",null,{"$f":"H11*'Inputs | General'!J27","v":36.235702796767924},{"$f":"I11*'Inputs | General'!K27","v":9.5497564725043098},{"$f":"J11*'Inputs | General'!L27","v":7.7693302950012262},{"$f":"K11*'Inputs | General'!M27","v":10.370032408002077},{"$f":"L11*'Inputs | General'!N27","v":14.354210071526614}]
[null,null,"Closing RAB",null,null,"$nominal",117.49195264148101,{"$f":"H9+H10-H12","v":95.645616307929771},{"$f":"I9+I10-I12","v":101.61580319679688},128.9152154180365,172.85161911967327,217.70057456642542]
[]
[null,"Linked Input - RAB Comms & IT"]
{"$rows_left_out":107}
{"sheet":"Calc | Exit Fees","index":9,"n_rows":177,"n_cols":15,"rows_kept":177,"cut":false,"hidden":false,"merged":[[115,6,115,10],[112,1,112,7],[0,13,0,14],[4,1,4,7],[74,10,74,14],[114,6,114,10],[89,10,89,14],[58,10,58,14],[106,10,106,14],[102,1,102,7],[28,10,28,14],[43,10,43,14],[9,10,9,14]]}
[null,{"$f":"'Title Page'!B8&\" v\"&'Title Page'!$C$10","v":"Final Standardised Metering Pricing Model  v1.02"},null,null,null,null,null,null,null,null,null,null,"DNSP:",{"$f":"IF('Inputs | General'!$G$16=\"Price Cap\",\"NOT USED\",NSP)","v":"AusNet"}]
[null,{"$f":"MID(CELL(\"filename\",A1),FIND(\"]\",CELL(\"filename\",A1))+1,255)","v":"Calc | Exit Fees"},null,null,null,null,null,"Key:","Input","External Link","Internal Link","Draft Decision","Revised Proposal"]
[]
[]
[null,"CALCULATION | Meters"]
[]
[null,"Calculation of Allocated Meters RAB by Designated Exit Fee"]
[]
[]
[null,null,null,null,"Average number of meters (Year, Year-1)",null,null,null,null,null,"Average number of meters (Year, Year-1)"]
[null,null,null,null,null,{"$f":"'Input | Exit Fees'!H70","v":"Meter Type"},{"$f":"'Input | Exit Fees'!I70","v":"Units"},"Designated Exit Fee",null,null,{"$f":"FPFirstYear","v":"2026-27"},{"$f":"LEFT(K11,4)+1&\"-\"&RIGHT(K11,2)+1","v":"2027-28"},{"$f":"LEFT(L11,4)+1&\"-\"&RIGHT(L11,2)+1","v":"2028-29"},"2029-30","2030-31"]
[null,null,null,null,null,{"$f":"'Input | Exit Fees'!H71","v":"AMI - Single Phase, single element"},"No.",{"$f":"'Input | Exit Fees'!D51","v":"Single phase single element"},null,null,{"$f":"IFERROR(AVERAGE('Input | Exit Fees'!J71:K71),0)","v":577221.0552012719},{"$f":"IFERROR(AVERAGE('Input | Exit Fees'!K71:L71),0)","v":583235.68111911637},{"$f":"IFERROR(AVERAGE('Input | Exit Fees'!L71:M71),0)","v":587523.90913189622},{"$f":"IFERROR(AVERAGE('Input | Exit Fees'!M71:N71),0)","v":590221.13010110077},{"$f":"IFERROR(AVERAGE('Input | Exit Fees'!N71:O71),0)","v":591219.09110072139}]
[null,null,null,null,null,{"$f":"'Input | Exit Fees'!H72","v":"AMI - Single Phase, two element"},"No.",{"$f":"'Input | Exit Fees'!D52","v":"Single phase two element with contactor"},null,null,{"$f":"IFERROR(AVERAGE('Input | Exit Fees'!J72:K72),0)","v":116618.13763857586},{"$f":"IFERROR(AVERAGE('Input | Exit Fees'!K72:L72),0)","v":115241.564993854},{"$f":"IFERROR(AVERAGE('Input | Exit Fees'!L72:M72),0)","v":113827.71425139207},{"$f":"IFERROR(AVERAGE('Input | Exit Fees'!M72:N72),0)","v":112403.52741782906},{"$f":"IFERROR(AVERAGE('Input | Exit Fees'!N72:O72),0)","v":110959.33739466491}]
[null,null,null,null,null,{"$f":"'Input | Exit Fees'!H73","v":"AMI - 3 Phase DC"},"No.",{"$f":"'Input | Exit Fees'!D53","v":"Multiphase"},null,null,{"$f":"IFERROR(AVERAGE('Input | Exit Fees'!J73:K73),0)","v":164056.50850767939},{"$f":"IFERROR(AVERAGE('Input | Exit Fees'!K73:L73),0)","v":176835.24979685261},{"$f":"IFERROR(AVERAGE('Input | Exit Fees'!L73:M73),0)","v":191524.49211272554},{"$f":"IFERROR(AVERAGE('Input | Exit Fees'!M73:N73),0)","v":208188.47917396924},{"$f":"IFERROR(AVERAGE('Input | Exit Fees'!N73:O73),0)","v":227015.06316381268}]
[null,null,null,null,null,{"$f":"'Input | Exit Fees'!H74","v":"AMI 3Ph CT"},"No.",{"$f":"'Input | Exit Fees'!D54","v":"Multiphase CT connected"},null,null,{"$f":"IFERROR(AVERAGE('Input | Exit Fees'!J74:K74),0)","v":5317.663462155384},{"$f":"IFERROR(AVERAGE('Input | Exit Fees'!K74:L74),0)","v":5412.6537997461628},{"$f":"IFERROR(AVERAGE('Input | Exit Fees'!L74:M74),0)","v":5507.8215155724447},{"$f":"IFERROR(AVERAGE('Input | Exit Fees'!M74:N74),0)","v":5603.9322835077219},{"$f":"IFERROR(AVERAGE('Input | Exit Fees'!N74:O74),0)","v":5700.8815530421016}]
{"$rows_left_out":163}
{"sheet":"Output | Exit Fee price caps","index":10,"n_rows":62,"n_cols":14,"rows_kept":62,"cut":false,"hidden":false,"merged":[[59,8,59,12],[49,3,49,4],[50,3,50,4],[51,3,51,4],[52,3,52,4],[53,3,53,4],[61,3,61,4],[48,3,48,4],[28,3,28,4],[29,3,29,4],[30,3,30,4],[31,3,31,4],[32,3,32,4],[33,3,33,4],[43,3,43,4],[44,3,44,4],[45,3,45,4],[46,3,46,4],[17,3,17,4],[60,3,60,4],[14,3,14,4],[47,3,47,4],[27,3,27,4],[0,13,0,14],[23,3,23,4],[24,3,24,4],[25,3,25,4],[26,3,26,4],[22,8,22,12],[6,8,6,12],[7,3,7,4],[8,3,8,4],[9,3,9,4],[10,3,10,4],[11,3,11,4],[12,3,12,4],[13,3,13,4],[15,3,15,4],[16,3,16,4]]}
[null,{"$f":"'Title Page'!B8&\" v\"&'Title Page'!$C$10","v":"Final Standardised Metering Pricing Model  v1.02"},null,null,null,null,null,null,null,null,null,null,"DNSP:",{"$f":"IF('Inputs | General'!$G$16=\"Price Cap\",\"NOT USED\",NSP)","v":"AusNet"}]
[null,{"$f":"MID(CELL(\"filename\",A1),FIND(\"]\",CELL(\"filename\",A1))+1,255)","v":"Output | Exit Fee price caps"},null,null,null,null,null,"Key:","Input","External Link","Internal Link","Draft Decision","Revised Proposal"]
[]
[]
[null,null,"Applicable Exit Fees Price Caps"]
[]
[null,null,null,null,null,null,null,"Base Year","Regulatory Period"]
[null,null,null,"Exit Fee Name",null,"Units","Basis",{"$f":"LEFT(I8,4)-1&\"-\"&RIGHT(I8,2)-1","v":"2025-26"},{"$f":"FPFirstYear","v":"2026-27"},{"$f":"LEFT(I8,4)+1&\"-\"&RIGHT(I8,2)+1","v":"2027-28"},{"$f":"LEFT(J8,4)+1&\"-\"&RIGHT(J8,2)+1","v":"2028-29"},"2029-30","2030-31"]
[null,null,null,{"$f":"D25","v":"Single phase single element"},null,"$dollars","nominal",{"$f":"ROUND(H25,2)","v":315.20999999999998},{"$f":"IF(I25=0,0,ROUND(H9*(1-I45)*(1+I$41),2))","v":208.39},192.25,204.88,236.1,276.87]
[null,null,null,{"$f":"D26","v":"Single phase two element with contactor"},null,"$dollars","nominal",315.20999999999998,214.15,197.5,210.92,243.87,286.75]
[null,null,null,"Multiphase",null,"$dollars","nominal",{"$f":"ROUND(H27,2)","v":315.22000000000003},{"$f":"IF(I27=0,0,ROUND(H11*(1-I47)*(1+I$41),2))","v":237.6},{"$f":"IF(J27=0,0,ROUND(I11*(1-J47)*(1+J$41),2))","v":218.87},235.49,275.48,326.95]
[null,null,null,"Multiphase CT connected",null,"$dollars","nominal",315.22000000000003,387.83,353.97,388.96,470.75,572.44000000000005]
[null,null,null,0,null,"$dollars","nominal",0,0,0,0,0,0]
[null,null,null,0,null,"$dollars","nominal",0,0,0,0,0,0]
[null,null,null,0,null,"$dollars","nominal",0,0,0,0,0,0]
{"$rows_left_out":48}
{"sheet":"LUTs and Dropdowns","index":11,"n_rows":23,"n_cols":2,"rows_kept":23,"cut":false,"hidden":false,"merged":[]}
[null,{"$f":"'Title Page'!B8&\" v\"&'Title Page'!$C$10","v":"Final Standardised Metering Pricing Model  v1.02"}]
[null,{"$f":"MID(CELL(\"filename\",A1),FIND(\"]\",CELL(\"filename\",A1))+1,255)","v":"LUTs and Dropdowns"}]
[]
[]
[]
[]
[]
[]
[]
[]
[]
[]
[]
[null,"Model Use"]
[null,"Price Cap"]
{"$rows_left_out":8}