{"text_format":"1","workbook":"xlsx","n_sheets":10,"sheets":["Title Page","Change Log","AER Change log","Inputs | General","Exit Fees >","Input | Exit Fees","Calc | Exit Fees","Calc | Tax Allowance","Output | Exit Fee price caps","LUTs and Dropdowns"],"not_rendered":{"charts":0,"images":1,"macros":1,"external_links":2,"defined_names":3547,"comments":0,"pivot_tables":0},"unopened":[],"bounds":{"document_bytes":16777216,"sheet_cells":100000,"rows_first":2000,"rows_last":500,"rows_between":2000,"halvings":0,"cell_chars":16384,"cell_head_chars":4096},"cells_cut":0,"cells_raw":0,"read":"whole","date_system":"1900"}

{"sheet":"Title Page","index":0,"n_rows":30,"n_cols":8,"rows_kept":30,"cut":false,"hidden":false,"merged":[[13,1,13,23],[7,1,8,23],[32,4,32,7],[24,1,24,23],[27,4,27,7],[30,4,30,7],[31,4,31,7],[29,4,29,7],[28,4,28,7]]}
[]
[]
[]
[]
[]
[]
[]
[null,"JEN 2027-31 - ACS Standardised Metering Pricing Model "]
[]
[null,"Version",1.02]
[null,"Date","2022-01-14"]
[]
[]
[null,"Status"]
[]
[null,"Notes:"]
[null,"Current model version contains test data. "]
[]
[null,null,"Locked Sheets Pwd:"]
[]
{"$rows_left_out":11}
{"sheet":"Change Log","index":1,"n_rows":51,"n_cols":8,"rows_kept":51,"cut":false,"hidden":false,"merged":[]}
[null,"AMI Pricing Model"]
[null,"Change Log"]
[]
[null,"Model change log"]
[]
[null,null,"Starting model name ---->","AER – Metering pricing model – Draft decision – Jemena distribution determination 2026–31 – September 2025"]
[]
[null,null,"Model changes to above model"]
[]
[null,null,"Model sheet","Reference","Cell reference","Type","Legend","Comments"]
[]
[null,null,{"$f":"SheetName('Inputs | General'!A1)","v":"Inputs | General"},1,{"$f":"CellReference('Inputs | General'!G9)","v":"G9"},"Input",null,"Changed state to revised proposal"]
[null,null,{"$f":"SheetName('Inputs | General'!A2)","v":"Inputs | General"},{"$f":"+D12+1","v":2},{"$f":"CellReference('Inputs | General'!G24:H37)","v":"G24:H37"},"Input",null,"Shifted tables two columns right to include FY24 and FY25 inflation values"]
[null,null,{"$f":"SheetName('Inputs | General'!A4)","v":"Inputs | General"},{"$f":"+D13+1","v":3},{"$f":"CellReference('Inputs | General'!J26:N26)","v":"J26:N26"},"Input",null,"Updated forecast inflation to align with PTRM"]
[null,null,{"$f":"SheetName('Inputs | General'!A6)","v":"Inputs | General"},{"$f":"+D14+1","v":4},{"$f":"CellReference('Inputs | General'!G29:N29)","v":"G29:N29"},"Formula",null,"Included Cumulative inflation for FY24 to Nominal"]
[null,null,{"$f":"SheetName('Inputs | General'!A8)","v":"Inputs | General"},{"$f":"+D15+1","v":5},{"$f":"CellReference('Inputs | General'!J33:N33)","v":"J33:N33"},"Input",null,"Updated forecast labour escalation"]
[null,null,{"$f":"SheetName('Inputs | General'!A9)","v":"Inputs | General"},{"$f":"+D16+1","v":6},{"$f":"CellReference('Inputs | General'!H35:I35)","v":"H35:I35"},"Input",null,"Included historical labour escalation"]
[null,null,{"$f":"SheetName('Inputs | General'!A10)","v":"Inputs | General"},7,{"$f":"CellReference('Inputs | General'!G36:N36)","v":"G36:N36"},"Formula",null,"Included Cumulative labour escalation for FY24 to Nominal"]
[]
[]
{"$rows_left_out":32}
{"sheet":"AER Change log","index":2,"n_rows":13,"n_cols":4,"rows_kept":13,"cut":false,"hidden":false,"merged":[]}
[]
[null,"Worksheet","Cells","Description of change"]
[null,"Throughout workbook",null,"Added cost basis labelling"]
[null,"Inputs | General","G9","Updated decision stage"]
[null,"Inputs | General","H26:L26","Update forecast inflation"]
[null,"Inputs | General","H32:L32","Update opex price change to reflect Input prices "]
[null,"Inputs | Exit Fees","G9:L18","Updated RAB inputs"]
[null,"Inputs | Exit Fees","D29:D31","Updated titles for Single Phase and Three Phase to include DC"]
[null,"Inputs | Exit Fees","G29:G32","Corrected base year exit fees"]
[null,"Inputs | Exit Fees","K49:L63","Updated meter unit costs"]
[null,"Inputs | Exit Fees","K71:O71","Updated meter end year populations"]
[null,"Inputs | Exit Fees","K102:O103","Updated admin labour tasks"]
[null,"Inputs | Exit Fees","G126:L135","Updated TAB inputs"]

{"sheet":"Inputs | General","index":3,"n_rows":44,"n_cols":23,"rows_kept":44,"cut":false,"hidden":false,"merged":[[37,1,37,6],[40,9,40,13],[4,1,4,6],[1,10,1,11],[1,12,1,13],[20,1,20,6],[23,9,23,13],[30,9,30,13]]}
[null,{"$f":"'Title Page'!B8&\" v\"&'Title Page'!$C$10","v":"JEN 2027-31 - ACS Standardised Metering Pricing Model  v1.02"},null,null,null,null,null,null,null,null,null,null,null,null,null,null,null,null,null,null,null,"Worksheet check:",{"$f":"IF(COUNTA($X$14:$X$48)=COUNTIF($X14:$X49,\"OK\"),\"OK\",\"Check\")","v":"OK"}]
[null,{"$f":"MID(CELL(\"filename\",A1),FIND(\"]\",CELL(\"filename\",A1))+1,255)","v":"Inputs | General"},null,null,null,null,null,null,"Key:","Input","External Link",null,"Internal Link",null,"Jemena modification","JEN - RP"]
[]
[]
[null,"1. Inputs - General"]
[]
[null,null,"Inputs","Source","Input Format",null,"Value"]
[null,null,"NSP name","NSP",null,null,"JEN - ACS"]
[null,null,"Decision stage","NSP",null,null,"revised proposal"]
[]
[null,null,"Forecast regulatory control period, first year","NSP","YYYY-YY",null,"2026-27"]
[null,null,"Forecast regulatory control period, last year","NSP",null,null,{"$f":"LEFT(FPFirstYear,4)+4&\"-\"&RIGHT(FPFirstYear,2)+4","v":"2030-31"}]
[]
[null,null,"Regulatory Period Length, Yrs",null,null,null,{"$f":"LEFT(G12,4)-LEFT(FPFirstYear,4)+1","v":5}]
[]
[null,null,"Model Used For (Price Cap or Vic Exit Fees?)",null,null,null,"Exit Fees (Vic)"]
[]
[]
[]
[]
{"$rows_left_out":25}
{"sheet":"Exit Fees >","index":4,"n_rows":0,"n_cols":0,"rows_kept":0,"cut":false,"hidden":false,"merged":[]}

{"sheet":"Input | Exit Fees","index":5,"n_rows":141,"n_cols":17,"rows_kept":141,"cut":false,"hidden":false,"merged":[[140,1,140,3],[87,1,87,7],[115,3,115,5],[116,3,116,5],[117,3,117,5],[118,3,118,5],[124,7,124,11],[108,3,108,5],[109,3,109,5],[110,3,110,5],[111,3,111,5],[139,1,139,3],[95,3,95,5],[112,3,112,5],[113,3,113,5],[114,3,114,5],[122,1,122,6],[122,9,122,11],[0,13,0,14],[48,3,48,5],[4,1,4,6],[25,1,25,7],[42,1,42,7],[6,7,6,11],[4,9,4,11],[21,1,21,3],[22,1,22,3],[67,9,67,14]]}
[null,{"$f":"'Title Page'!B8&\" v\"&'Title Page'!$C$10","v":"JEN 2027-31 - ACS Standardised Metering Pricing Model  v1.02"},null,null,null,null,null,null,null,null,null,null,"DNSP:",{"$f":"IF('Inputs | General'!$G$16=\"Price Cap\",\"NOT USED\",NSP)","v":"JEN - ACS"}]
[null,{"$f":"MID(CELL(\"filename\",A1),FIND(\"]\",CELL(\"filename\",A1))+1,255)","v":"Input | Exit Fees"},null,null,null,null,null,"Key:","Input","External Link","Internal Link","Jemena modification","JEN - RP"]
[]
[]
[null,{"$f":"LEFT('Inputs | General'!B21,1)+1&\". Linked Input - RAB\"","v":"3. Linked Input - RAB"},null,null,null,null,null,null,null,{"$f":"IF('Inputs | General'!$G$16=\"Price Cap\",\"NOT USED\",\"\")","v":""}]
[]
[null,"Linked Input - RAB Meters",null,null,null,null,"Base Year","Regulatory Period"]
[null,null,null,null,"Units","Basis",{"$f":"LEFT(H8,4)-1&\"-\"&RIGHT(H8,2)-1","v":"2025-26"},{"$f":"FPFirstYear","v":"2026-27"},{"$f":"LEFT(H8,4)+1&\"-\"&RIGHT(H8,2)+1","v":"2027-28"},{"$f":"LEFT(I8,4)+1&\"-\"&RIGHT(I8,2)+1","v":"2028-29"},{"$f":"LEFT(J8,4)+1&\"-\"&RIGHT(J8,2)+1","v":"2029-30"},{"$f":"LEFT(K8,4)+1&\"-\"&RIGHT(K8,2)+1","v":"2030-31"},{"$f":"LEFT(L8,4)+1&\"-\"&RIGHT(L8,2)+1","v":"2031-32"}]
[null,null,"Opening RAB",null,"$m","Nominal",null,{"$f":"+G12","v":48.426387001777677},{"$f":"+H12","v":67.58559211095681},92.648565065246743,121.67668827482134,153.31704511439389,188.86855320958239,"Opening balance of METERS row in PTRM inputs sheet of PTRM"]
[null,null,"Gross capital expenditure",null,"$m","Nominal",null,{"$f":"[2]Assets!G$64","v":23.289094051416797},{"$f":"[2]Assets!H$64","v":30.42127848981281},{"$f":"[2]Assets!I$64","v":35.992171639418039},{"$f":"[2]Assets!J$64","v":40.546394987826524},{"$f":"[2]Assets!K$64","v":46.713934824750524},null,"Gross capex from METERS row in ASSETS sheet of PTRM"]
[null,null,"Regulatory depreciation",null,"$m","Nominal",null,{"$f":"[2]Assets!G$154*[2]Assets!G$7-H9*[2]Assets!G$6","v":4.1298889422376757},{"$f":"[2]Assets!H$154*[2]Assets!H$7-I9*[2]Assets!H$6","v":5.3583055355228772},{"$f":"[2]Assets!I$154*[2]Assets!I$7-J9*[2]Assets!I$6","v":6.9640484298434444},{"$f":"[2]Assets!J$154*[2]Assets!J$7-K9*[2]Assets!J$6","v":8.906038148253959},{"$f":"[2]Assets!K$154*[2]Assets!K$7-L9*[2]Assets!K$6","v":11.162426729562014},null,"Depreciation from METERS row in ASSETS sheet of PTRM"]
[null,null,"Closing RAB",null,"$m","Nominal",{"$f":"[2]!A3value","v":48.426387001777677},{"$f":"+H9+H10-H11","v":67.58559211095681},{"$f":"+I9+I10-I11","v":92.648565065246743},121.67668827482134,153.31704511439389,188.86855320958239,null,"Closing balance of METERS row in PTRM inputs sheet of PTRM"]
[]
[null,"Linked Input - RAB Comms, IT, Inhouse software & Equity Raising Costs"]
[null,null,null,null,"Units","Basis",{"$f":"LEFT(H15,4)-1&\"-\"&RIGHT(H15,2)-1","v":"2025-26"},{"$f":"FPFirstYear","v":"2026-27"},{"$f":"LEFT(H15,4)+1&\"-\"&RIGHT(H15,2)+1","v":"2027-28"},{"$f":"LEFT(I15,4)+1&\"-\"&RIGHT(I15,2)+1","v":"2028-29"},{"$f":"LEFT(J15,4)+1&\"-\"&RIGHT(J15,2)+1","v":"2029-30"},{"$f":"LEFT(K15,4)+1&\"-\"&RIGHT(K15,2)+1","v":"2030-31"},{"$f":"LEFT(L15,4)+1&\"-\"&RIGHT(L15,2)+1","v":"2031-32"}]
[null,null,"Opening RAB",null,"$m","Nominal",null,{"$f":"+G19","v":6.0424658357638208},{"$f":"+H19","v":16.112932546728139},22.00524213490209,26.044708547343596,31.616955808961556,33.851299735096127,"Opening balance of COMMS & IT & Inhouse Software & Equity Raising Costs rows from PTRM INPUTS sheet of PTRM"]
[null,null,"Gross capital expenditure",null,"$m","Nominal",null,{"$f":"[2]Assets!G$61-H10","v":11.339441192098988},{"$f":"[2]Assets!H$61-I10","v":8.6403509658323863},{"$f":"[2]Assets!I$61-J10","v":7.7588396724066939},{"$f":"[2]Assets!J$61-K10","v":10.335122035852294},{"$f":"[2]Assets!K$61-L10","v":8.5105063229978697},null,"Gross capex from COMMS & IT & Inhouse Software & Equity Raising Costs rows in ASSETS sheet of PTRM"]
[null,null,"Regulatory depreciation",null,"$m","Nominal",null,{"$f":"-[2]Assets!G$1436-[2]Assets!G$1437-H11","v":1.2689744811346708},{"$f":"-[2]Assets!H$1436-[2]Assets!H$1437-I11","v":2.7480413776584349},{"$f":"-[2]Assets!I$1436-[2]Assets!I$1437-J11","v":3.7193732599651881},{"$f":"-[2]Assets!J$1436-[2]Assets!J$1437-K11","v":4.7628747742343318},{"$f":"-[2]Assets!K$1436-[2]Assets!K$1437-L11","v":6.2761623968632989},null,"Depreciation from COMMS & IT & Inhouse Software & Equity Raising Costs rows in ASSETS sheet of PTRM"]
[null,null,"Closing RAB",null,"$m","Nominal",{"$f":"[2]!RAB-G12","v":6.0424658357638208},{"$f":"+H16+H17-H18","v":16.112932546728139},{"$f":"+I16+I17-I18","v":22.00524213490209},{"$f":"+J16+J17-J18","v":26.044708547343596},{"$f":"+K16+K17-K18","v":31.616955808961556},{"$f":"+L16+L17-L18","v":33.851299735096127},null,"Closing balance of COMMS & IT & Inhouse Software & Equity Raising Costs rows from PTRM INPUTS sheet of PTRM"]
[]
{"$rows_left_out":122}
{"sheet":"Calc | Exit Fees","index":6,"n_rows":286,"n_cols":15,"rows_kept":286,"cut":false,"hidden":false,"merged":[[115,6,115,10],[0,13,0,14],[4,1,4,7],[74,10,74,14],[114,6,114,10],[89,10,89,14],[58,10,58,14],[106,10,106,14],[102,1,102,7],[28,10,28,14],[43,10,43,14],[9,10,9,14],[179,1,179,7],[224,6,224,10],[183,10,183,14],[198,10,198,14],[211,1,211,7],[215,10,215,14],[223,6,223,10]]}
[null,{"$f":"'Title Page'!B8&\" v\"&'Title Page'!$C$10","v":"JEN 2027-31 - ACS Standardised Metering Pricing Model  v1.02"},null,null,null,null,null,null,null,null,null,null,"DNSP:",{"$f":"IF('Inputs | General'!$G$16=\"Price Cap\",\"NOT USED\",NSP)","v":"JEN - ACS"}]
[null,{"$f":"MID(CELL(\"filename\",A1),FIND(\"]\",CELL(\"filename\",A1))+1,255)","v":"Calc | Exit Fees"},null,null,null,null,null,"Key:","Input","External Link","Internal Link","Jemena modification","JEN - RP"]
[]
[]
[null,"CALCULATION | Meters"]
[]
[null,"Calculation of Allocated Meters RAB by Designated Exit Fee"]
[]
[]
[null,null,null,null,"Average number of meters (Year, Year-1)",null,null,null,null,null,"Average number of meters (Year, Year-1)"]
[null,null,null,null,null,{"$f":"'Input | Exit Fees'!H69","v":"Meter Type"},{"$f":"'Input | Exit Fees'!I69","v":"Units"},"Designated Exit Fee",null,null,{"$f":"FPFirstYear","v":"2026-27"},{"$f":"LEFT(K11,4)+1&\"-\"&RIGHT(K11,2)+1","v":"2027-28"},{"$f":"LEFT(L11,4)+1&\"-\"&RIGHT(L11,2)+1","v":"2028-29"},{"$f":"LEFT(M11,4)+1&\"-\"&RIGHT(M11,2)+1","v":"2029-30"},{"$f":"LEFT(N11,4)+1&\"-\"&RIGHT(N11,2)+1","v":"2030-31"}]
[null,null,null,null,null,{"$f":"'Input | Exit Fees'!H70","v":"Single Phase (inc. DC)"},"No.",{"$f":"'Input | Exit Fees'!D50","v":"Single Phase (inc. DC)"},null,null,{"$f":"IFERROR(AVERAGE('Input | Exit Fees'!J70:K70),0)","v":309987.63019177737},{"$f":"IFERROR(AVERAGE('Input | Exit Fees'!K70:L70),0)","v":309052.53068717441},{"$f":"IFERROR(AVERAGE('Input | Exit Fees'!L70:M70),0)","v":307689.46726064553},{"$f":"IFERROR(AVERAGE('Input | Exit Fees'!M70:N70),0)","v":306309.85474931204},{"$f":"IFERROR(AVERAGE('Input | Exit Fees'!N70:O70),0)","v":304913.69026228361}]
[null,null,null,null,null,{"$f":"'Input | Exit Fees'!H71","v":"Single Phase, Two Element"},"No.",{"$f":"'Input | Exit Fees'!D51","v":"Single Phase, Two Element"},null,null,{"$f":"IFERROR(AVERAGE('Input | Exit Fees'!J71:K71),0)","v":20612.44544734824},{"$f":"IFERROR(AVERAGE('Input | Exit Fees'!K71:L71),0)","v":20344.250889396011},{"$f":"IFERROR(AVERAGE('Input | Exit Fees'!L71:M71),0)","v":20072.760711556308},{"$f":"IFERROR(AVERAGE('Input | Exit Fees'!M71:N71),0)","v":19797.974345227314},{"$f":"IFERROR(AVERAGE('Input | Exit Fees'!N71:O71),0)","v":19519.891214611682}]
[null,null,null,null,null,{"$f":"'Input | Exit Fees'!H72","v":"Three Phase (inc. DC)"},"No.",{"$f":"'Input | Exit Fees'!D52","v":"Three Phase (inc. DC)"},null,null,{"$f":"IFERROR(AVERAGE('Input | Exit Fees'!J72:K72),0)","v":68349.313878602115},{"$f":"IFERROR(AVERAGE('Input | Exit Fees'!K72:L72),0)","v":77301.69011237107},{"$f":"IFERROR(AVERAGE('Input | Exit Fees'!L72:M72),0)","v":86764.215629710845},{"$f":"IFERROR(AVERAGE('Input | Exit Fees'!M72:N72),0)","v":96341.626583931138},{"$f":"IFERROR(AVERAGE('Input | Exit Fees'!N72:O72),0)","v":106033.94304388719}]
[null,null,null,null,null,{"$f":"'Input | Exit Fees'!H73","v":"Three Phase CT"},"No.",{"$f":"'Input | Exit Fees'!D53","v":"Three Phase CT"},null,null,{"$f":"IFERROR(AVERAGE('Input | Exit Fees'!J73:K73),0)","v":2730.8907197692074},{"$f":"IFERROR(AVERAGE('Input | Exit Fees'!K73:L73),0)","v":2927.6243270103901},{"$f":"IFERROR(AVERAGE('Input | Exit Fees'!L73:M73),0)","v":3130.9822305677399},{"$f":"IFERROR(AVERAGE('Input | Exit Fees'!M73:N73),0)","v":3336.8091220871802},{"$f":"IFERROR(AVERAGE('Input | Exit Fees'!N73:O73),0)","v":3545.1054328658661}]
[null,null,null,null,null,{"$f":"'Input | Exit Fees'!H74","v":0},"No.",{"$f":"'Input | Exit Fees'!D54","v":0},null,null,{"$f":"IFERROR(AVERAGE('Input | Exit Fees'!J74:K74),0)","v":0},{"$f":"IFERROR(AVERAGE('Input | Exit Fees'!K74:L74),0)","v":0},{"$f":"IFERROR(AVERAGE('Input | Exit Fees'!L74:M74),0)","v":0},{"$f":"IFERROR(AVERAGE('Input | Exit Fees'!M74:N74),0)","v":0},{"$f":"IFERROR(AVERAGE('Input | Exit Fees'!N74:O74),0)","v":0}]
[null,null,null,null,null,{"$f":"'Input | Exit Fees'!H75","v":0},"No.",{"$f":"'Input | Exit Fees'!D55","v":0},null,null,{"$f":"IFERROR(AVERAGE('Input | Exit Fees'!J75:K75),0)","v":0},{"$f":"IFERROR(AVERAGE('Input | Exit Fees'!K75:L75),0)","v":0},{"$f":"IFERROR(AVERAGE('Input | Exit Fees'!L75:M75),0)","v":0},{"$f":"IFERROR(AVERAGE('Input | Exit Fees'!M75:N75),0)","v":0},{"$f":"IFERROR(AVERAGE('Input | Exit Fees'!N75:O75),0)","v":0}]
[null,null,null,null,null,{"$f":"'Input | Exit Fees'!H76","v":0},"No.",{"$f":"'Input | Exit Fees'!D56","v":0},null,null,{"$f":"IFERROR(AVERAGE('Input | Exit Fees'!J76:K76),0)","v":0},{"$f":"IFERROR(AVERAGE('Input | Exit Fees'!K76:L76),0)","v":0},{"$f":"IFERROR(AVERAGE('Input | Exit Fees'!L76:M76),0)","v":0},{"$f":"IFERROR(AVERAGE('Input | Exit Fees'!M76:N76),0)","v":0},{"$f":"IFERROR(AVERAGE('Input | Exit Fees'!N76:O76),0)","v":0}]
[null,null,null,null,null,{"$f":"'Input | Exit Fees'!H77","v":0},"No.",{"$f":"'Input | Exit Fees'!D57","v":0},null,null,{"$f":"IFERROR(AVERAGE('Input | Exit Fees'!J77:K77),0)","v":0},{"$f":"IFERROR(AVERAGE('Input | Exit Fees'!K77:L77),0)","v":0},{"$f":"IFERROR(AVERAGE('Input | Exit Fees'!L77:M77),0)","v":0},{"$f":"IFERROR(AVERAGE('Input | Exit Fees'!M77:N77),0)","v":0},{"$f":"IFERROR(AVERAGE('Input | Exit Fees'!N77:O77),0)","v":0}]
[null,null,null,null,null,{"$f":"'Input | Exit Fees'!H78","v":0},"No.",{"$f":"'Input | Exit Fees'!D58","v":0},null,null,{"$f":"IFERROR(AVERAGE('Input | Exit Fees'!J78:K78),0)","v":0},{"$f":"IFERROR(AVERAGE('Input | Exit Fees'!K78:L78),0)","v":0},{"$f":"IFERROR(AVERAGE('Input | Exit Fees'!L78:M78),0)","v":0},{"$f":"IFERROR(AVERAGE('Input | Exit Fees'!M78:N78),0)","v":0},{"$f":"IFERROR(AVERAGE('Input | Exit Fees'!N78:O78),0)","v":0}]
{"$rows_left_out":267}
{"sheet":"Calc | Tax Allowance","index":7,"n_rows":92,"n_cols":14,"rows_kept":92,"cut":false,"hidden":false,"merged":[[6,6,6,10],[7,6,7,10],[0,13,0,14],[4,1,4,7]]}
[null,{"$f":"'Title Page'!B8&\" v\"&'Title Page'!$C$10","v":"JEN 2027-31 - ACS Standardised Metering Pricing Model  v1.02"},null,null,null,null,null,null,null,null,null,null,"DNSP:",{"$f":"IF('Inputs | General'!$G$16=\"Price Cap\",\"NOT USED\",NSP)","v":"JEN - ACS"}]
[null,{"$f":"MID(CELL(\"filename\",A1),FIND(\"]\",CELL(\"filename\",A1))+1,255)","v":"Calc | Tax Allowance"},null,null,null,null,null,"Key:","Input","External Link","Internal Link","Jemena added sheet","JEN - RP"]
[]
[]
[null,"CALCULATION | Tax Allowance"]
[]
[null,null,null,null,null,"Base Year","Regulatory period"]
[null,null,null,null,null,null,"Tariff ($/year) (Nominal)"]
[null,null,null,"Exit Fee Name","Component","2025-26","2026-27","2027-28","2028-29","2029-30","2030-31"]
[null,null,null,"Single Phase"]
[null,null,null,null,"Revenue excluding tax allowance"]
[null,null,null,null,"Meter RAB",null,{"$f":"+'Calc | Exit Fees'!G119","v":133.70239558555289},{"$f":"+'Calc | Exit Fees'!H119","v":179.85616564466204},{"$f":"+'Calc | Exit Fees'!I119","v":234.33729632814689},{"$f":"+'Calc | Exit Fees'!J119","v":293.01802668902076},{"$f":"+'Calc | Exit Fees'!K119","v":355.48194958067273}]
[null,null,null,null,"Comms, IT, Inhouse software & Equity Raising Costs RAB",null,{"$f":"+'Calc | Exit Fees'!G120","v":27.578399379467161},{"$f":"+'Calc | Exit Fees'!H120","v":46.528010608174014},{"$f":"+'Calc | Exit Fees'!I120","v":57.523160981122118},{"$f":"+'Calc | Exit Fees'!J120","v":67.711982657912202},{"$f":"+'Calc | Exit Fees'!K120","v":75.422062660998549}]
[null,null,null,null,"Admin cost",null,{"$f":"+'Calc | Exit Fees'!G121","v":78.859266178541176},{"$f":"+'Calc | Exit Fees'!H121","v":84.078246264713485},{"$f":"+'Calc | Exit Fees'!I121","v":88.997112820564254},{"$f":"+'Calc | Exit Fees'!J121","v":93.59208989469623},{"$f":"+'Calc | Exit Fees'!K121","v":98.418889948844097}]
[null,null,null,null,"Revenue for Tax Assessment Subtotal",null,{"$f":"SUM(G12:G14)","v":240.14006114356124},{"$f":"SUM(H12:H14)","v":310.46242251754956},{"$f":"SUM(I12:I14)","v":380.85757012983328},{"$f":"SUM(J12:J14)","v":454.32209924162919},{"$f":"SUM(K12:K14)","v":529.32290219051538}]
[]
[null,null,null,null,"Tax expenses"]
[null,null,null,null,"WDV - Meter TAB",null,{"$f":"+'Calc | Exit Fees'!G228","v":98.136715437138704},{"$f":"+'Calc | Exit Fees'!H228","v":139.38582433721882},{"$f":"+'Calc | Exit Fees'!I228","v":185.73957588087978},{"$f":"+'Calc | Exit Fees'!J228","v":233.3078867587779},{"$f":"+'Calc | Exit Fees'!K228","v":284.30582007307595}]
[null,null,null,null,"WDV - Comms, IT, Inhouse software & Equity Raising Costs TAB",null,{"$f":"+'Calc | Exit Fees'!G229","v":18.922790894347234},{"$f":"+'Calc | Exit Fees'!H229","v":32.941369099983632},{"$f":"+'Calc | Exit Fees'!I229","v":34.759182418450784},{"$f":"+'Calc | Exit Fees'!J229","v":35.704706956159868},{"$f":"+'Calc | Exit Fees'!K229","v":36.042716824546169}]
[null,null,null,null,"Admin cost",null,{"$f":"+'Calc | Exit Fees'!G121","v":78.859266178541176},{"$f":"+'Calc | Exit Fees'!H121","v":84.078246264713485},{"$f":"+'Calc | Exit Fees'!I121","v":88.997112820564254},{"$f":"+'Calc | Exit Fees'!J121","v":93.59208989469623},{"$f":"+'Calc | Exit Fees'!K121","v":98.418889948844097}]
{"$rows_left_out":73}
{"sheet":"Output | Exit Fee price caps","index":8,"n_rows":62,"n_cols":14,"rows_kept":62,"cut":false,"hidden":false,"merged":[[59,8,59,12],[49,3,49,4],[50,3,50,4],[51,3,51,4],[52,3,52,4],[53,3,53,4],[61,3,61,4],[48,3,48,4],[28,3,28,4],[29,3,29,4],[30,3,30,4],[31,3,31,4],[32,3,32,4],[33,3,33,4],[43,3,43,4],[44,3,44,4],[45,3,45,4],[46,3,46,4],[17,3,17,4],[60,3,60,4],[14,3,14,4],[47,3,47,4],[27,3,27,4],[0,13,0,14],[23,3,23,4],[24,3,24,4],[25,3,25,4],[26,3,26,4],[22,8,22,12],[6,8,6,12],[7,3,7,4],[8,3,8,4],[9,3,9,4],[10,3,10,4],[11,3,11,4],[12,3,12,4],[13,3,13,4],[15,3,15,4],[16,3,16,4]]}
[null,{"$f":"'Title Page'!B8&\" v\"&'Title Page'!$C$10","v":"JEN 2027-31 - ACS Standardised Metering Pricing Model  v1.02"},null,null,null,null,null,null,null,null,null,null,"DNSP:","D"]
[null,{"$f":"MID(CELL(\"filename\",A1),FIND(\"]\",CELL(\"filename\",A1))+1,255)","v":"Output | Exit Fee price caps"},null,null,null,null,null,"Key:","Input","External Link","Internal Link"]
[]
[]
[null,null,"Applicable Exit Fees Price Caps"]
[]
[null,null,null,null,null,null,null,"Base Year","Regulatory Period"]
[null,null,null,"Exit Fee Name",null,"Units","Basis",{"$f":"LEFT(I8,4)-1&\"-\"&RIGHT(I8,2)-1","v":"2025-26"},{"$f":"FPFirstYear","v":"2026-27"},{"$f":"LEFT(I8,4)+1&\"-\"&RIGHT(I8,2)+1","v":"2027-28"},{"$f":"LEFT(J8,4)+1&\"-\"&RIGHT(J8,2)+1","v":"2028-29"},{"$f":"LEFT(K8,4)+1&\"-\"&RIGHT(K8,2)+1","v":"2029-30"},{"$f":"LEFT(L8,4)+1&\"-\"&RIGHT(L8,2)+1","v":"2030-31"}]
[null,null,null,{"$f":"D25","v":"Single Phase (inc. DC)"},null,"$dollars","nominal",{"$f":"ROUND(H25,2)","v":191.64},{"$f":"IF(I25=0,0,ROUND(H9*(1-I45)*(1+I$41),2))","v":246.69},{"$f":"IF(J25=0,0,ROUND(I9*(1-J45)*(1+J$41),2))","v":318.47000000000003},391.43,467.91,545.70000000000005]
[null,null,null,{"$f":"D26","v":"Single Phase, Two Element"},null,"$dollars","nominal",191.64,258.33,333.96,411.45,492.78,575.67999999999995]
[null,null,null,"Three Phase (inc. DC)",null,"$dollars","nominal",{"$f":"ROUND(H27,2)","v":191.64},{"$f":"IF(I27=0,0,ROUND(H11*(1-I47)*(1+I$41),2))","v":302.62},{"$f":"IF(J27=0,0,ROUND(I11*(1-J47)*(1+J$41),2))","v":392.98},{"$f":"IF(K27=0,0,ROUND(J11*(1-K47)*(1+K$41),2))","v":487.82},{"$f":"IF(L27=0,0,ROUND(K11*(1-L47)*(1+L$41),2))","v":587.77},{"$f":"IF(M27=0,0,ROUND(L11*(1-M47)*(1+M$41),2))","v":690.32}]
[null,null,null,"Three Phase CT",null,"$dollars","nominal",191.64,395.86,517.80999999999995,650.26,791.07,937.18]
[null,null,null,0,null,"$dollars","nominal",0,0,0,0,0,0]
[null,null,null,0,null,"$dollars","nominal",0,0,0,0,0,0]
[null,null,null,0,null,"$dollars","nominal",0,0,0,0,0,0]
[null,null,null,0,null,"$dollars","nominal",0,0,0,0,0,0]
[null,null,null,0,null,"$dollars","nominal",0,0,0,0,0,0]
[null,null,null,0,null,"$dollars","nominal",0,0,0,0,0,0]
[]
[]
{"$rows_left_out":43}
{"sheet":"LUTs and Dropdowns","index":9,"n_rows":23,"n_cols":2,"rows_kept":23,"cut":false,"hidden":false,"merged":[]}
[null,{"$f":"'Title Page'!B8&\" v\"&'Title Page'!$C$10","v":"JEN 2027-31 - ACS Standardised Metering Pricing Model  v1.02"}]
[null,{"$f":"MID(CELL(\"filename\",A1),FIND(\"]\",CELL(\"filename\",A1))+1,255)","v":"LUTs and Dropdowns"}]
[]
[]
[]
[]
[]
[]
[]
[]
[]
[]
[]
[null,"Model Use"]
[null,"Price Cap"]
[null,"Exit Fees (Vic)"]
[null,"Show All Sheets"]
[]
[]
[null,"Admin Charges"]
{"$rows_left_out":3}