{"text_format":"1","workbook":"xlsx","n_sheets":14,"sheets":["Cover","Repex forecast","Hist_volumes","Defect analysis","Forecast_volumes","Hist_expenditure","Unit_rates","AER_DD_expenditure ","Trend_based_exp","Risk_based_exp","Consol","Adjustments","Assumptions","Lists"],"not_rendered":{"charts":0,"images":1,"macros":0,"external_links":0,"defined_names":10,"comments":0,"pivot_tables":0},"unopened":[],"bounds":{"document_bytes":16777216,"sheet_cells":100000,"rows_first":2000,"rows_last":500,"rows_between":2000,"halvings":0,"cell_chars":16384,"cell_head_chars":4096},"cells_cut":0,"cells_raw":0,"read":"whole","date_system":"1900"}

{"sheet":"Cover","index":0,"n_rows":41,"n_cols":4,"rows_kept":41,"cut":false,"hidden":false,"merged":[]}
[]
[null,null,"Powercor"]
[null,null,"Revised proposal 2026-31"]
[]
[null,null,"Replacement expenditure forecast model"]
[null,null,"Model number:","3.4.01"]
[]
[null,null,"2025-12-01"]
[]
[]
{"$rows_left_out":32}
{"sheet":"Repex forecast","index":1,"n_rows":47,"n_cols":13,"rows_kept":47,"cut":false,"hidden":false,"merged":[]}
[{"$f":"bus","v":"Powercor"}]
[{"$f":"Cover!$C$5","v":"Replacement expenditure forecast model"}]
["TOTAL FORECAST EXPENDITURE"]
[]
[]
[]
[]
[null,null,null,null,null,"FORECAST EXPENDITURE ($'000 2026)",null,null,null,null,null,"TOTAL"]
[null,"Project/Program",null,"Asset category",null,"2026-27","2027-28","2028-29","2029-30","2030-31",null,"2026-31"]
[null,{"$f":"Consol!B10","v":"LV wood pole replacement"},null,{"$f":"Consol!D10","v":"Poles"},null,{"$f":"Consol!Y10/thous_conv","v":6257.7603282398786},{"$f":"Consol!Z10/thous_conv","v":6257.7603282398786},{"$f":"Consol!AA10/thous_conv","v":6257.7603282398786},{"$f":"Consol!AB10/thous_conv","v":6257.7603282398786},{"$f":"Consol!AC10/thous_conv","v":6257.7603282398786},null,{"$f":"SUM(F10:J10)","v":31288.801641199392}]
{"$rows_left_out":38}
{"sheet":"Hist_volumes","index":2,"n_rows":32,"n_cols":15,"rows_kept":32,"cut":false,"hidden":false,"merged":[]}
[{"$f":"bus","v":"Powercor"}]
[{"$f":"Cover!$C$5","v":"Replacement expenditure forecast model"}]
["HISTORICAL VOLUMES"]
[null,null,{"$f":"Hist_expenditure!C4","v":"Converstion to June 2026 $"}]
[null,null,{"$f":"Hist_expenditure!C5","v":"Financial year ending"},null,null,null,null,{"$f":"Hist_expenditure!H5","v":22},{"$f":"Hist_expenditure!I5","v":23},{"$f":"Hist_expenditure!J5","v":24},{"$f":"Hist_expenditure!K5","v":25}]
[null,null,{"$f":"Hist_expenditure!C6","v":"Count"},null,null,null,null,{"$f":"Hist_expenditure!H6","v":1},{"$f":"Hist_expenditure!I6","v":2},{"$f":"Hist_expenditure!J6","v":3},{"$f":"Hist_expenditure!K6","v":4}]
[]
[null,null,null,null,null,null,null,null,null,null,null,null,"Historical average volume"]
[null,"Capex model project/program","Description","Asset class","Volume units","Forecast methodology",null,"2021/22","2022/23","2023/24","2024/25",null,"Average period (yrs)","End year","Average pa"]
[null,"LV wood pole replacement","LV wood pole replacement","Poles","each","Pole calculation model & adjustment",null,472,753,787,625,null,null,null,{"$f":"Adjustments!L18","v":306}]
{"$rows_left_out":23}
{"sheet":"Defect analysis","index":3,"n_rows":144,"n_cols":21,"rows_kept":144,"cut":false,"hidden":false,"merged":[]}
[{"$f":"bus","v":"Powercor"}]
[{"$f":"Cover!$C$5","v":"Replacement expenditure forecast model"}]
["DEFECT RATE ANALYSIS"]
[]
[null,"Year",null,null,null,null,null,null,null,null,21,{"$f":"K5+1","v":22},23,24,25,26,27,28,29,30,31]
[null,"Count",null,null,null,null,null,null,null,null,1,{"$f":"K6+1","v":2},3,4,5,6,7,8,9,10,11]
[]
[]
[null,"Description","Region",null,"Methodology","Linear",null,"Average",null,null,"2020/21","2021/22","2022/23","2023/24","2024/25","2025/26","2026/27","2027/28","2028/29","2029/30","2030/31"]
[null,null,null,null,null,"Gradient","Intercept","No. Yrs","End year"]
{"$rows_left_out":135}
{"sheet":"Forecast_volumes","index":4,"n_rows":32,"n_cols":19,"rows_kept":32,"cut":false,"hidden":false,"merged":[]}
[{"$f":"bus","v":"Powercor"}]
[{"$f":"Cover!$C$5","v":"Replacement expenditure forecast model"}]
["TREND-BASED FORECAST VOLUMES"]
[]
[]
[]
[]
[null,null,null,null,null,null,null,null,null,null,null,null,"FORECAST VOLUME",null,null,null,null,null,"TOTAL"]
[null,{"$f":"Hist_volumes!B9","v":"Capex model project/program"},{"$f":"Hist_volumes!C9","v":"Description"},{"$f":"Hist_volumes!D9","v":"Asset class"},{"$f":"Hist_volumes!E9","v":"Volume units"},{"$f":"Hist_volumes!F9","v":"Forecast methodology"},null,"Average hist vol pa",null,null,null,null,"2026/27","2027/28","2028/29","2029/30","2030/31",null,"2026-31"]
[null,{"$f":"IF(ISBLANK($C10),0, INDEX(Hist_volumes!B$10:B$32, MATCH($C10, Hist_volumes!$C$10:$C$32,0)))","v":"LV wood pole replacement"},{"$f":"_xlfn.UNIQUE(Hist_volumes!$C$10:$C$32)","v":"LV wood pole replacement"},{"$f":"IF(ISBLANK($C10),0, INDEX(Hist_volumes!D$10:D$32, MATCH($C10, Hist_volumes!$C$10:$C$32,0)))","v":"Poles"},{"$f":"IF(ISBLANK($C10),0, INDEX(Hist_volumes!E$10:E$32, MATCH($C10, Hist_volumes!$C$10:$C$32,0)))","v":"each"},{"$f":"IF(ISBLANK($C10),0, INDEX(Hist_volumes!F$10:F$32, MATCH($C10, Hist_volumes!$C$10:$C$32,0)))","v":"Pole calculation model & adjustment"},null,{"$f":"SUMPRODUCT((Hist_volumes!$O$10:$O$32)*(Hist_volumes!$C$10:$C$32=$C10))","v":306},null,null,null,null,{"$f":"ROUND(IF($F10=Lists!$C$5,SUMPRODUCT(('Defect analysis'!Q$140:Q$144)*('Defect analysis'!$B$140:$B$144=$C10)),$H10), IF($E10=Lists!$M$5,0,Lists!$M$6))","v":306},{"$f":"ROUND(IF($F10=Lists!$C$5,SUMPRODUCT(('Defect analysis'!R$140:R$144)*('Defect analysis'!$B$140:$B$144=$C10)),$H10), IF($E10=Lists!$M$5,0,Lists!$M$6))","v":306},{"$f":"ROUND(IF($F10=Lists!$C$5,SUMPRODUCT(('Defect analysis'!S$140:S$144)*('Defect analysis'!$B$140:$B$144=$C10)),$H10), IF($E10=Lists!$M$5,0,Lists!$M$6))","v":306},{"$f":"ROUND(IF($F10=Lists!$C$5,SUMPRODUCT(('Defect analysis'!T$140:T$144)*('Defect analysis'!$B$140:$B$144=$C10)),$H10), IF($E10=Lists!$M$5,0,Lists!$M$6))","v":306},{"$f":"ROUND(IF($F10=Lists!$C$5,SUMPRODUCT(('Defect analysis'!U$140:U$144)*('Defect analysis'!$B$140:$B$144=$C10)),$H10), IF($E10=Lists!$M$5,0,Lists!$M$6))","v":306},null,{"$f":"SUM(M10:Q10)","v":1530}]
{"$rows_left_out":23}
{"sheet":"Hist_expenditure","index":5,"n_rows":32,"n_cols":16,"rows_kept":32,"cut":false,"hidden":false,"merged":[]}
[{"$f":"bus","v":"Powercor"}]
[{"$f":"Cover!$C$5","v":"Replacement expenditure forecast model"}]
["HISTORICAL EXPENDITURE"]
[null,null,"Converstion to June 2026 $",null,null,null,null,{"$f":"INDEX(Assumptions!$J$35:$Z$35, MATCH(H5,Assumptions!$J$30:$Z$30,0))","v":1.1945268165421203},{"$f":"INDEX(Assumptions!$J$35:$Z$35, MATCH(I5,Assumptions!$J$30:$Z$30,0))","v":1.1691455136558526},{"$f":"INDEX(Assumptions!$J$35:$Z$35, MATCH(J5,Assumptions!$J$30:$Z$30,0))","v":1.1066964104811114},{"$f":"INDEX(Assumptions!$J$35:$Z$35, MATCH(K5,Assumptions!$J$30:$Z$30,0))","v":1.0447920015079382}]
[null,null,"Financial year ending",null,null,null,null,{"$f":"VALUE(RIGHT(H9,2))","v":22},{"$f":"VALUE(RIGHT(I9,2))","v":23},{"$f":"VALUE(RIGHT(J9,2))","v":24},{"$f":"VALUE(RIGHT(K9,2))","v":25}]
[null,null,"Count",null,null,null,null,1,{"$f":"H6+1","v":2},{"$f":"I6+1","v":3},{"$f":"J6+1","v":4}]
[]
[null,null,null,null,null,null,null,"Historical expenditure ($ nominal)",null,null,null,null,"Historical expenditure ($ 2026)"]
[null,"Capex model project/program","Description","Asset class",null,null,null,"2021/22","2022/23","2023/24","2024/25",null,"2021/22","2022/23","2023/24","2024/25"]
[null,{"$f":"Hist_volumes!B10","v":"LV wood pole replacement"},{"$f":"Hist_volumes!C10","v":"LV wood pole replacement"},{"$f":"Hist_volumes!D10","v":"Poles"},null,null,null,7176517.8651069589,11582636.999418378,14940542.084825236,10397107.795529215,null,{"$f":"Hist_expenditure!H10*Hist_expenditure!H$4","v":8572543.0392638687},{"$f":"Hist_expenditure!I10*Hist_expenditure!I$4","v":13541788.084174283},{"$f":"Hist_expenditure!J10*Hist_expenditure!J$4","v":16534644.29591807},{"$f":"Hist_expenditure!K10*Hist_expenditure!K$4","v":10862815.063584754}]
{"$rows_left_out":23}
{"sheet":"Unit_rates","index":6,"n_rows":32,"n_cols":11,"rows_kept":32,"cut":false,"hidden":false,"merged":[]}
[{"$f":"bus","v":"Powercor"}]
[{"$f":"Cover!$C$5","v":"Replacement expenditure forecast model"}]
["AVERAGE HISTORICAL UNIT RATES"]
[]
[]
[]
[]
[null,null,null,null,null,null,"AVERAGE UNIT RATE ($ 2026)"]
[null,{"$f":"Hist_volumes!B9","v":"Capex model project/program"},{"$f":"Hist_volumes!C9","v":"Description"},{"$f":"Hist_volumes!D9","v":"Asset class"},{"$f":"Hist_volumes!E9","v":"Volume units"},null,"Average period (yrs)","End year","Hist ave unit rate","Override rate","Applied rate"]
[null,{"$f":"Hist_expenditure!B10","v":"LV wood pole replacement"},{"$f":"Hist_expenditure!C10","v":"LV wood pole replacement"},{"$f":"Hist_expenditure!D10","v":"Poles"},{"$f":"INDEX(Hist_volumes!$E$10:$E$32, MATCH($C10, Hist_volumes!$C$10:$C$32,0))","v":"each"},null,4,25,{"$f":"IF(ISBLANK(H10),0,IF(SUMPRODUCT((Hist_volumes!$H10:$K10)*(Hist_volumes!$H$5:$K$5<=$H10)*(Hist_volumes!$H$5:$K$5>($H10-$G10)))=0,0, SUMPRODUCT((Hist_expenditure!$M10:$P10)*(Hist_expenditure!$H$5:$K$5<=$H10)*(Hist_expenditure!$H$5:$K$5>($H10-$G10)))/SUMPRODUCT((Hist_volumes!$H10:$K10)*(Hist_volumes!$H$5:$K$5<=$H10)*(Hist_volumes!$H$5:$K$5>($H10-$G10)))))","v":18775.802230921869},null,{"$f":"IF(ISBLANK(J10), I10,J10)","v":18775.802230921869}]
{"$rows_left_out":23}
{"sheet":"AER_DD_expenditure ","index":7,"n_rows":34,"n_cols":19,"rows_kept":34,"cut":false,"hidden":false,"merged":[]}
[{"$f":"bus","v":"Powercor"}]
[{"$f":"Cover!$C$5","v":"Replacement expenditure forecast model"}]
["ACCEPTED AER DRAFT DECISION EXPENDITURE"]
[]
[]
[]
[]
[null,null,null,null,null,null,null,null,null,null,null,null,"ACCEPTED AER DRAFT DECISION EXPENDITURE ($ 2026)",null,null,null,null,null,"TOTAL"]
[null,{"$f":"Hist_volumes!B9","v":"Capex model project/program"},null,null,null,null,null,null,null,null,null,null,"2026/27","2027/28","2028/29","2029/30","2030/31",null,"2026-31"]
[null,"Service lines",null,null,null,null,null,null,null,null,null,null,8686187.2415880132,12471137.607236272,12292045.314850282,10401769.343525024,12999009.02321689,null,{"$f":"SUM(M10:Q10)","v":56850148.530416481}]
{"$rows_left_out":25}
{"sheet":"Trend_based_exp","index":8,"n_rows":30,"n_cols":19,"rows_kept":30,"cut":false,"hidden":false,"merged":[]}
[{"$f":"bus","v":"Powercor"}]
[{"$f":"Cover!$C$5","v":"Replacement expenditure forecast model"}]
["FORECAST TREND-BASED EXPENDITURE"]
[]
[]
[]
[]
[null,null,null,null,null,null,"Unit rate applied",null,null,null,null,null,"FORECAST EXPENDITURE ($ 2026)",null,null,null,null,null,"TOTAL"]
[null,{"$f":"Hist_volumes!B9","v":"Capex model project/program"},{"$f":"Hist_volumes!C9","v":"Description"},{"$f":"Hist_volumes!D9","v":"Asset class"},{"$f":"Hist_volumes!E9","v":"Volume units"},null,2026,null,null,null,null,null,"2026/27","2027/28","2028/29","2029/30","2030/31",null,"2026-31"]
[null,{"$f":"Hist_expenditure!B10","v":"LV wood pole replacement"},{"$f":"Hist_expenditure!C10","v":"LV wood pole replacement"},{"$f":"Hist_expenditure!D10","v":"Poles"},{"$f":"INDEX(Unit_rates!$E$10:$E$32,MATCH($C10,Unit_rates!$C$10:$C$32,0))","v":"each"},null,{"$f":"INDEX(Unit_rates!$K$10:$K$32,MATCH($C10,Unit_rates!$C$10:$C$32,0))","v":18775.802230921869},null,null,null,null,null,{"$f":"SUMPRODUCT((Forecast_volumes!M$10:M$32)*(Forecast_volumes!$C$10:$C$32=$C10))*$G10","v":5745395.482662092},{"$f":"SUMPRODUCT((Forecast_volumes!N$10:N$32)*(Forecast_volumes!$C$10:$C$32=$C10))*$G10","v":5745395.482662092},{"$f":"SUMPRODUCT((Forecast_volumes!O$10:O$32)*(Forecast_volumes!$C$10:$C$32=$C10))*$G10","v":5745395.482662092},{"$f":"SUMPRODUCT((Forecast_volumes!P$10:P$32)*(Forecast_volumes!$C$10:$C$32=$C10))*$G10","v":5745395.482662092},{"$f":"SUMPRODUCT((Forecast_volumes!Q$10:Q$32)*(Forecast_volumes!$C$10:$C$32=$C10))*$G10","v":5745395.482662092},null,{"$f":"SUM(M10:Q10)","v":28726977.413310461}]
{"$rows_left_out":21}
{"sheet":"Risk_based_exp","index":9,"n_rows":16,"n_cols":19,"rows_kept":16,"cut":false,"hidden":false,"merged":[]}
[{"$f":"bus","v":"Powercor"}]
[{"$f":"Cover!$C$5","v":"Replacement expenditure forecast model"}]
["FORECAST RISK-BASED EXPENDITURE"]
[]
[]
[]
[]
[null,null,null,null,null,null,null,null,null,null,null,null,"FORECAST RISK-BASED EXPENDITURE ($ 2026)",null,null,null,null,null,"TOTAL"]
[null,{"$f":"Hist_volumes!B9","v":"Capex model project/program"},{"$f":"Hist_volumes!C9","v":"Description"},{"$f":"Hist_volumes!D9","v":"Asset class"},null,null,null,null,null,null,null,null,"2026/27","2027/28","2028/29","2029/30","2030/31",null,"2026-31"]
[null,"Risk-based HV cable replacement","Risk-based HV cable","Underground cable",null,null,null,null,null,null,null,null,3184512.3398571843,3183169.5522784744,3179784.0197096565,3173390.4493527231,3162664.2218830888,null,{"$f":"SUM(M10:Q10)","v":15883520.583081126}]
{"$rows_left_out":7}
{"sheet":"Consol","index":10,"n_rows":46,"n_cols":31,"rows_kept":46,"cut":false,"hidden":false,"merged":[]}
[{"$f":"bus","v":"Powercor"}]
[{"$f":"Cover!$C$5","v":"Replacement expenditure forecast model"}]
["CONSOLIDATED EXPENDITURE"]
[]
[]
[]
[]
[null,null,null,null,null,null,"Accepted AER draft decision ($ 2026)",null,null,null,null,null,"Trend-based expenditure ($ 2026)",null,null,null,null,null,"Risk -based expenditure ($ 2026)",null,null,null,null,null,"Total forecast expenditure ($ 2026)",null,null,null,null,null,"TOTAL"]
[null,"Project/Program",null,"Asset class",null,null,"2026-27","2027-28","2028-29","2029-30","2030-31",null,"2026-27","2027-28","2028-29","2029-30","2030-31",null,{"$f":"M9","v":"2026-27"},{"$f":"N9","v":"2027-28"},{"$f":"O9","v":"2028-29"},{"$f":"P9","v":"2029-30"},{"$f":"Q9","v":"2030-31"},null,{"$f":"G9","v":"2026-27"},{"$f":"H9","v":"2027-28"},{"$f":"I9","v":"2028-29"},{"$f":"J9","v":"2029-30"},{"$f":"K9","v":"2030-31"},null,"2026-31"]
[null,"LV wood pole replacement",null,"Poles",null,null,{"$f":"SUMPRODUCT(('AER_DD_expenditure '!M$10:M$34)*('AER_DD_expenditure '!$B$10:$B$34=$B10))","v":0},{"$f":"SUMPRODUCT(('AER_DD_expenditure '!N$10:N$34)*('AER_DD_expenditure '!$B$10:$B$34=$B10))","v":0},{"$f":"SUMPRODUCT(('AER_DD_expenditure '!O$10:O$34)*('AER_DD_expenditure '!$B$10:$B$34=$B10))","v":0},{"$f":"SUMPRODUCT(('AER_DD_expenditure '!P$10:P$34)*('AER_DD_expenditure '!$B$10:$B$34=$B10))","v":0},{"$f":"SUMPRODUCT(('AER_DD_expenditure '!Q$10:Q$34)*('AER_DD_expenditure '!$B$10:$B$34=$B10))","v":0},null,{"$f":"SUMPRODUCT((Trend_based_exp!M$10:M$30)*(Trend_based_exp!$B$10:$B$30=$B10))","v":6257760.3282398786},{"$f":"SUMPRODUCT((Trend_based_exp!N$10:N$30)*(Trend_based_exp!$B$10:$B$30=$B10))","v":6257760.3282398786},{"$f":"SUMPRODUCT((Trend_based_exp!O$10:O$30)*(Trend_based_exp!$B$10:$B$30=$B10))","v":6257760.3282398786},{"$f":"SUMPRODUCT((Trend_based_exp!P$10:P$30)*(Trend_based_exp!$B$10:$B$30=$B10))","v":6257760.3282398786},{"$f":"SUMPRODUCT((Trend_based_exp!Q$10:Q$30)*(Trend_based_exp!$B$10:$B$30=$B10))","v":6257760.3282398786},null,{"$f":"SUMPRODUCT((Risk_based_exp!M$10:M$16)*(Risk_based_exp!$B$10:$B$16=$B10))","v":0},{"$f":"SUMPRODUCT((Risk_based_exp!N$10:N$16)*(Risk_based_exp!$B$10:$B$16=$B10))","v":0},{"$f":"SUMPRODUCT((Risk_based_exp!O$10:O$16)*(Risk_based_exp!$B$10:$B$16=$B10))","v":0},{"$f":"SUMPRODUCT((Risk_based_exp!P$10:P$16)*(Risk_based_exp!$B$10:$B$16=$B10))","v":0},{"$f":"SUMPRODUCT((Risk_based_exp!Q$10:Q$16)*(Risk_based_exp!$B$10:$B$16=$B10))","v":0},null,{"$f":"M10+G10+S10","v":6257760.3282398786},{"$f":"N10+H10+T10","v":6257760.3282398786},{"$f":"O10+I10+U10","v":6257760.3282398786},{"$f":"P10+J10+V10","v":6257760.3282398786},{"$f":"Q10+K10+W10","v":6257760.3282398786},null,{"$f":"SUM(Y10:AC10)","v":31288801.641199395}]
{"$rows_left_out":37}
{"sheet":"Adjustments","index":11,"n_rows":56,"n_cols":16,"rows_kept":56,"cut":false,"hidden":false,"merged":[]}
[{"$f":"bus","v":"Powercor"}]
[{"$f":"Cover!$C$5","v":"Replacement expenditure forecast model"}]
["ADJUSTMENTS"]
[]
[]
[null,"Count",null,null,null,null,null,null,null,null,null,1,{"$f":"L6+1","v":2},{"$f":"M6+1","v":3},{"$f":"N6+1","v":4},{"$f":"O6+1","v":5}]
[]
[]
["Allocation of poles: concrete & wood",null,null,null,null,null,{"$f":"Hist_volumes!H9","v":"2021/22"},{"$f":"Hist_volumes!I9","v":"2022/23"},{"$f":"Hist_volumes!J9","v":"2023/24"},{"$f":"Hist_volumes!K9","v":"2024/25"},null,{"$f":"Consol!S9","v":"2026-27"},{"$f":"Consol!T9","v":"2027-28"},{"$f":"Consol!U9","v":"2028-29"},{"$f":"Consol!V9","v":"2029-30"},{"$f":"Consol!W9","v":"2030-31"}]
[]
{"$rows_left_out":47}
{"sheet":"Assumptions","index":12,"n_rows":41,"n_cols":38,"rows_kept":41,"cut":false,"hidden":false,"merged":[]}
[{"$f":"bus","v":"Powercor"}]
[{"$f":"Cover!$C$5","v":"Replacement expenditure forecast model"}]
["ASSUMPTIONS"]
[]
[]
[null,"Output dollars",null,"2026-06-30"]
[]
[null,"HY",null,"2021-06-30"]
[]
[]
{"$rows_left_out":32}
{"sheet":"Lists","index":13,"n_rows":14,"n_cols":13,"rows_kept":14,"cut":false,"hidden":false,"merged":[]}
["Powercor"]
[{"$f":"Cover!$C$5","v":"Replacement expenditure forecast model"}]
[]
[]
[0.1,null,"Defect analysis",null,"Average",null,"each",23,null,1000,null,"Volumes rounded if units are:","each"]
[null,null,"Historical average",null,"Linear",null,"km",24,null,null,null,"Decimal places for rounding:",5]
[null,null,"Historial %",null,"5 year cycle",null,null,25]
[null,null,"Estimate",null,null,null,null,26]
[null,null,"Expenditure"]
[null,null,"Risk-based"]
{"$rows_left_out":4}