{"text_format":"1","workbook":"xlsx","n_sheets":21,"sheets":["Title Page","AER Change Log","Powercor Change Log","Input|General","Input| Historical Inflation","Input| Prices","Opex Specific >","Input | Meter-Opex BST","Calc | Opex","Capex Specific >","Input | Meters Vols & Costs","NMIs","Input | Comms, IT, Other","Calculations >","Calc | Capex Meters","Calc | Meters Detail","Calc | Capex Comm, IT, Other","Outputs","Output | PTRM","Output | RFM","Lookup|Tables"],"not_rendered":{"charts":0,"images":2,"macros":1,"external_links":0,"defined_names":94,"comments":0,"pivot_tables":0},"unopened":[],"bounds":{"document_bytes":16777216,"sheet_cells":100000,"rows_first":2000,"rows_last":500,"rows_between":2000,"halvings":0,"cell_chars":16384,"cell_head_chars":4096},"cells_cut":0,"cells_raw":0,"read":"whole","date_system":"1900"}

{"sheet":"Title Page","index":0,"n_rows":30,"n_cols":8,"rows_kept":30,"cut":false,"hidden":false,"merged":[[9,1,9,2],[35,4,35,7],[5,1,6,8],[36,4,36,7],[34,4,34,7],[33,4,33,7],[32,4,32,7],[31,4,31,7]]}
[]
[]
[]
[]
[]
[null,"Final Standardised Metering Capex and Opex Model"]
[]
[]
[null,"Version ",null,1.08]
[null,"Date",null,44589]
{"$rows_left_out":21}
{"sheet":"AER Change Log","index":1,"n_rows":31,"n_cols":4,"rows_kept":31,"cut":false,"hidden":false,"merged":[]}
[null,"AER Draft Decision Change Log"]
[]
[null,"changes in the spreadsheet are also highlighted in green"]
[]
[null,"Tab","Cells","Description of change"]
[null,"Input| General","J9","Updated to draft decision"]
[null,"Input| Historical Inflation","I45:I54","Updated historical CPI"]
[null,null,"I55:I86","Removed forecast CPI"]
[null,"Input| Prices","J21:Q21","Removed forecast inflation as replaced by historical CPI"]
[null,null,"L21","Updated forecast inflation for August 2025 RBA Statement on Monetary Policy"]
{"$rows_left_out":22}
{"sheet":"Powercor Change Log","index":2,"n_rows":5,"n_cols":4,"rows_kept":5,"cut":false,"hidden":false,"merged":[]}
[null,"changes in the spreadsheet are also highlighted in yellow"]
[]
[null,"Tab","Cells","Description of change"]
[null,"Input| General","J9","Updated to revised proposal"]
[null,"Input | Meter-Opex BST","P9","Updated 2024-25 actual Opex "]

{"sheet":"Input|General","index":3,"n_rows":47,"n_cols":22,"rows_kept":47,"cut":false,"hidden":false,"merged":[[1,1,1,2],[1,11,1,12],[1,13,1,14],[1,15,1,16],[1,9,1,10]]}
[null,"AER Metering Opex & Capex Forecasting Model "]
[null,"Ver:",null,1.08,null,null,null,"Key:","Input","External Link",null,"Internal Link",null,"NSP New Data",null,"AER Addition"]
[null,{"$f":"MID(CELL(\"filename\",A1),FIND(\"]\",CELL(\"filename\",A1))+1,255)","v":"Input|General"}]
[]
[null,"Input | General inputs"]
[]
[null,null,null,null,"Inputs",null,"Source",null,null,"Value",null,null,null,"Note"]
[null,null,null,null,"NSP name",null,"NSP",null,null,"Powercor",null,null,null,null,null,null,null,null,null,null,null,{"$f":"IF(COUNTBLANK($J8),0,1)","v":1}]
[null,null,null,null,"Decision stage",null,"NSP",null,null,"revised proposal",null,null,null,null,null,null,null,null,null,null,null,{"$f":"IF(COUNTBLANK($J9),0,1)","v":1}]
[]
{"$rows_left_out":38}
{"sheet":"Input| Historical Inflation","index":4,"n_rows":86,"n_cols":11,"rows_kept":86,"cut":false,"hidden":false,"merged":[[6,3,7,4]]}
[null,{"$f":"'Input|General'!B1&\" v\"&'Input|General'!$D$2","v":"AER Metering Opex & Capex Forecasting Model  v1.08"}]
[null,{"$f":"MID(CELL(\"filename\",B2),FIND(\"]\",CELL(\"filename\",B2))+1,255)","v":"Input| Historical Inflation"}]
[]
[]
[null,"Input | General inputs"]
[]
[null,null,null,"Added Calc",null,null,"Index value, new base","Percentage Change from Corresponding Quarter of Previous Year","Index value, new base","Percentage Change from Corresponding Quarter of Previous Year"]
[null,null,null,null,null,"Source","ABS","Calculated","ABS","Calculated"]
[null,null,null,"Year","Month","Unit","index","Percent","index2","Percent3","Percent4"]
[null,null,null,{"$f":"YEAR(F10)","v":2014},{"$f":"MONTH(F10)","v":6},"2014-06-30",null,null,105.9]
{"$rows_left_out":77}
{"sheet":"Input| Prices","index":5,"n_rows":59,"n_cols":17,"rows_kept":59,"cut":false,"hidden":false,"merged":[[5,3,5,11],[11,3,11,18],[13,12,13,16],[18,12,18,16]]}
[null,{"$f":"'Input|General'!B1&\" v\"&'Input|General'!$D$2","v":"AER Metering Opex & Capex Forecasting Model  v1.08"}]
[null,{"$f":"MID(CELL(\"filename\",A1),FIND(\"]\",CELL(\"filename\",A1))+1,255)","v":"Input| Prices"}]
[]
[{"$f":"PRODUCT(A5:A61)","v":0}]
[]
[null,null,null,"6. Inflation table setup"]
[]
[null,null,null,"First year of forecast regulatory control period",null,null,null,null,null,{"$f":"FPFirstYear","v":"2026-27"}]
[null,null,null,"Year End",null,null,null,null,null,{"$f":"'Input|General'!J14","v":"2000-06-01"}]
[null,null,null,"Notation Adjustment",null,null,null,null,null,{"$f":"IF(MID(PPFirstYear,5,1)=\"\",0,1)","v":1}]
{"$rows_left_out":50}
{"sheet":"Opex Specific >","index":6,"n_rows":0,"n_cols":0,"rows_kept":0,"cut":false,"hidden":false,"merged":[]}

{"sheet":"Input | Meter-Opex BST","index":7,"n_rows":46,"n_cols":22,"rows_kept":46,"cut":false,"hidden":false,"merged":[[3,17,3,21]]}
[null,{"$f":"'Input|General'!B1&\" v\"&'Input|General'!$D$2","v":"AER Metering Opex & Capex Forecasting Model  v1.08"}]
[null,{"$f":"MID(CELL(\"filename\",A1),FIND(\"]\",CELL(\"filename\",A1))+1,255)","v":"Input | Meter-Opex BST"}]
[]
[null,null,null,null,null,null,null,null,null,null,null,null,null,{"$f":"IF(N5=Opex_BaseYear,\"Base Year\",\"\")","v":""},{"$f":"IF(O5=Opex_BaseYear,\"Base Year\",\"\")","v":""},{"$f":"IF(P5=Opex_BaseYear,\"Base Year\",\"\")","v":"Base Year"},{"$f":"IF(Q5=Opex_BaseYear,\"Base Year\",\"\")","v":""},"Forecast RP"]
[{"$f":"PRODUCT($A$6:$A$52)","v":1},null,null,null,null,null,null,null,null,"Value",null,{"$f":"IF(MONTH('Input|General'!$J$14)=6,LEFT(M5,4)-1&\"-\"&TEXT(MOD(MID(M5,6,2)-1,100),\"00\"),M5-1)","v":"2020-21"},{"$f":"IF(MONTH('Input|General'!$J$14)=6,LEFT(N5,4)-1&\"-\"&TEXT(MOD(MID(N5,6,2)-1,100),\"00\"),N5-1)","v":"2021-22"},{"$f":"IF(MONTH('Input|General'!$J$14)=6,LEFT(O5,4)-1&\"-\"&TEXT(MOD(MID(O5,6,2)-1,100),\"00\"),O5-1)","v":"2022-23"},{"$f":"IF(MONTH('Input|General'!$J$14)=6,LEFT(P5,4)-1&\"-\"&TEXT(MOD(MID(P5,6,2)-1,100),\"00\"),P5-1)","v":"2023-24"},{"$f":"IF(MONTH('Input|General'!$J$14)=6,LEFT(Q5,4)-1&\"-\"&TEXT(MOD(MID(Q5,6,2)-1,100),\"00\"),Q5-1)","v":"2024-25"},{"$f":"IF(MONTH('Input|General'!$J$14)=6,LEFT(R5,4)-1&\"-\"&TEXT(MOD(MID(R5,6,2)-1,100),\"00\"),R5-1)","v":"2025-26"},{"$f":"FPFirstYear","v":"2026-27"},{"$f":"IF(MONTH('Input|General'!$J$14)=6,LEFT(R5,4)+1&\"-\"&TEXT(MOD(MID(R5,6,2)+1,100),\"00\"),R5+1)","v":"2027-28"},{"$f":"IF(MONTH('Input|General'!$J$14)=6,LEFT(S5,4)+1&\"-\"&TEXT(MOD(MID(S5,6,2)+1,100),\"00\"),S5+1)","v":"2028-29"},{"$f":"IF(MONTH('Input|General'!$J$14)=6,LEFT(T5,4)+1&\"-\"&TEXT(MOD(MID(T5,6,2)+1,100),\"00\"),T5+1)","v":"2029-30"},{"$f":"IF(MONTH('Input|General'!$J$14)=6,LEFT(U5,4)+1&\"-\"&TEXT(MOD(MID(U5,6,2)+1,100),\"00\"),U5+1)","v":"2030-31"}]
[]
[null,null,"Base"]
[null,null,null,"Historical Opex"]
[null,null,null,null,null,"Total opex","$millions",{"$f":"Basis_OpexHist","v":"nominal"},null,null,null,9.7145982036794418,11.233975467413275,12.195660478106477,9.2435632838852282,10.395117659999974,10.870430421849029]
[]
{"$rows_left_out":37}
{"sheet":"Calc | Opex","index":8,"n_rows":53,"n_cols":22,"rows_kept":53,"cut":false,"hidden":false,"merged":[[46,1,54,1]]}
[null,{"$f":"'Input|General'!B1&\" v\"&'Input|General'!$D$2","v":"AER Metering Opex & Capex Forecasting Model  v1.08"}]
[null,{"$f":"MID(CELL(\"filename\",A1),FIND(\"]\",CELL(\"filename\",A1))+1,255)","v":"Calc | Opex"}]
[]
[null,null,null,null,null,null,null,null,null,"Value",null,{"$f":"IF(MONTH('Input|General'!$J$14)=6,LEFT(M4,4)-1&\"-\"&TEXT(MOD(MID(M4,6,2)-1,100),\"00\"),M4-1)","v":"2020-21"},{"$f":"IF(MONTH('Input|General'!$J$14)=6,LEFT(N4,4)-1&\"-\"&TEXT(MOD(MID(N4,6,2)-1,100),\"00\"),N4-1)","v":"2021-22"},{"$f":"IF(MONTH('Input|General'!$J$14)=6,LEFT(O4,4)-1&\"-\"&TEXT(MOD(MID(O4,6,2)-1,100),\"00\"),O4-1)","v":"2022-23"},{"$f":"IF(MONTH('Input|General'!$J$14)=6,LEFT(P4,4)-1&\"-\"&TEXT(MOD(MID(P4,6,2)-1,100),\"00\"),P4-1)","v":"2023-24"},{"$f":"IF(MONTH('Input|General'!$J$14)=6,LEFT(Q4,4)-1&\"-\"&TEXT(MOD(MID(Q4,6,2)-1,100),\"00\"),Q4-1)","v":"2024-25"},{"$f":"IF(MONTH('Input|General'!$J$14)=6,LEFT(R4,4)-1&\"-\"&TEXT(MOD(MID(R4,6,2)-1,100),\"00\"),R4-1)","v":"2025-26"},{"$f":"FPFirstYear","v":"2026-27"},{"$f":"IF(MONTH('Input|General'!$J$14)=6,LEFT(R4,4)+1&\"-\"&TEXT(MOD(MID(R4,6,2)+1,100),\"00\"),R4+1)","v":"2027-28"},{"$f":"IF(MONTH('Input|General'!$J$14)=6,LEFT(S4,4)+1&\"-\"&TEXT(MOD(MID(S4,6,2)+1,100),\"00\"),S4+1)","v":"2028-29"},{"$f":"IF(MONTH('Input|General'!$J$14)=6,LEFT(T4,4)+1&\"-\"&TEXT(MOD(MID(T4,6,2)+1,100),\"00\"),T4+1)","v":"2029-30"},{"$f":"IF(MONTH('Input|General'!$J$14)=6,LEFT(U4,4)+1&\"-\"&TEXT(MOD(MID(U4,6,2)+1,100),\"00\"),U4+1)","v":"2030-31"}]
[]
[null,"Calcs"]
[]
[null,null,null,null,null,null,null,null,null,"Value",null,{"$f":"L4","v":"2020-21"},{"$f":"M4","v":"2021-22"},"2022-23","2023-24","2024-25","2025-26","2026-27","2027-28","2028-29","2029-30","2030-31"]
[]
[null,null,"Base"]
{"$rows_left_out":44}
{"sheet":"Capex Specific >","index":9,"n_rows":0,"n_cols":0,"rows_kept":0,"cut":false,"hidden":false,"merged":[]}

{"sheet":"Input | Meters Vols & Costs","index":10,"n_rows":448,"n_cols":31,"rows_kept":448,"cut":false,"hidden":false,"merged":[[169,16,169,20],[52,6,53,8],[70,1,70,11],[119,1,119,11],[120,0,139,0],[24,1,24,11],[368,0,427,0],[143,1,143,11],[4,1,4,11],[40,1,40,11]]}
[null,{"$f":"'Input|General'!B1&\" v\"&'Input|General'!$D$2","v":"AER Metering Opex & Capex Forecasting Model  v1.08"}]
[null,{"$f":"MID(CELL(\"filename\",A1),FIND(\"]\",CELL(\"filename\",A1))+1,255)","v":"Input | Meters Vols & Costs"}]
[]
[{"$f":"PRODUCT($A$5:$A$452)","v":1}]
[null,"1. Meter Types"]
[]
[]
[null,null,null,null,null,"Meter Type","RIN Subcategory 1","RIN Subcategory 2","AER Type","RIN Subcategory 3","Meter Code"]
[null,null,null,null,null,"AMI - Single Phase, single element","Single Phase Meter Population","Direct Connect Meter Population","Meter Type 4","Single phase single element - AMI","AMI 1ph 1e"]
[null,null,null,null,null,"AMI - Single Phase, single element + C","Single Phase Meter Population","Direct Connect Meter Population","Meter Type 4","Single phase two element with contactor - AMI","AMI 1ph 1e + C"]
{"$rows_left_out":439}
{"sheet":"NMIs","index":11,"n_rows":23,"n_cols":16,"rows_kept":23,"cut":false,"hidden":false,"merged":[[2,2,2,7],[11,2,11,7]]}
[]
[]
["Meter Quantities",null,"Customer Numbers"]
["Year","2024-25","2025-26","2026-27","2027-28","2028-29","2029-30","2030-31",null,"2024-25","2025-26","2026-27","2027-28","2028-29","2029-30","2030-31"]
["single phase single element meter",{"$f":"'Input | Meters Vols & Costs'!O412+'Input | Meters Vols & Costs'!O418+'Input | Meters Vols & Costs'!O421","v":571224.08023129357},{"$f":"'Input | Meters Vols & Costs'!P412+'Input | Meters Vols & Costs'!P418+'Input | Meters Vols & Costs'!P421","v":573710.45356176596},{"$f":"'Input | Meters Vols & Costs'!Q412+'Input | Meters Vols & Costs'!Q418+'Input | Meters Vols & Costs'!Q421","v":576216.23139393295},{"$f":"'Input | Meters Vols & Costs'!R412+'Input | Meters Vols & Costs'!R418+'Input | Meters Vols & Costs'!R421","v":578740.84607824741},{"$f":"'Input | Meters Vols & Costs'!S412+'Input | Meters Vols & Costs'!S418+'Input | Meters Vols & Costs'!S421","v":581839.39631365647},{"$f":"'Input | Meters Vols & Costs'!T412+'Input | Meters Vols & Costs'!T418+'Input | Meters Vols & Costs'!T421","v":584956.47655682289},{"$f":"'Input | Meters Vols & Costs'!U412+'Input | Meters Vols & Costs'!U418+'Input | Meters Vols & Costs'!U421","v":588092.42034788639},null,{"$f":"B5/$B$9*$J$10","v":527130.31422730081},{"$f":"C5-B5","v":2486.3733304723864},{"$f":"D5-C5","v":2505.7778321669903},2524.614684314467,3098.5502354090568,3117.0802431664197,3135.9437910635024]
["single phase single element meter with contactor",{"$f":"'Input | Meters Vols & Costs'!O413+'Input | Meters Vols & Costs'!O414","v":254677.04415875624},{"$f":"'Input | Meters Vols & Costs'!P413+'Input | Meters Vols & Costs'!P414","v":265656.54054571321},{"$f":"'Input | Meters Vols & Costs'!Q413+'Input | Meters Vols & Costs'!Q414","v":276824.93717078632},{"$f":"'Input | Meters Vols & Costs'!R413+'Input | Meters Vols & Costs'!R414","v":288176.49302039936},{"$f":"'Input | Meters Vols & Costs'!S413+'Input | Meters Vols & Costs'!S414","v":299159.94732106244},{"$f":"'Input | Meters Vols & Costs'!T413+'Input | Meters Vols & Costs'!T414","v":310323.57725961751},{"$f":"'Input | Meters Vols & Costs'!U413+'Input | Meters Vols & Costs'!U414","v":321670.62599754654},null,{"$f":"B6/$B$9*$J$10","v":235018.08652661697},{"$f":"C6-B6","v":10979.496386956976},11168.396625073103,11351.55584961304,10983.454300663085,11163.629938555066,11347.048737929028]
["three phase direct connected meter",{"$f":"'Input | Meters Vols & Costs'!O415+'Input | Meters Vols & Costs'!O416+'Input | Meters Vols & Costs'!O419+'Input | Meters Vols & Costs'!O422","v":169833.39278442305},{"$f":"'Input | Meters Vols & Costs'!P415+'Input | Meters Vols & Costs'!P416+'Input | Meters Vols & Costs'!P419+'Input | Meters Vols & Costs'!P422","v":176876.6100058094},{"$f":"'Input | Meters Vols & Costs'!Q415+'Input | Meters Vols & Costs'!Q416+'Input | Meters Vols & Costs'!Q419+'Input | Meters Vols & Costs'!Q422","v":184060.6100058094},{"$f":"'Input | Meters Vols & Costs'!R415+'Input | Meters Vols & Costs'!R416+'Input | Meters Vols & Costs'!R419+'Input | Meters Vols & Costs'!R422","v":191381.10600580944},{"$f":"'Input | Meters Vols & Costs'!S415+'Input | Meters Vols & Costs'!S416+'Input | Meters Vols & Costs'!S419+'Input | Meters Vols & Costs'!S422","v":198840.69142980943},{"$f":"'Input | Meters Vols & Costs'!T415+'Input | Meters Vols & Costs'!T416+'Input | Meters Vols & Costs'!T419+'Input | Meters Vols & Costs'!T422","v":206434.54939144143},{"$f":"'Input | Meters Vols & Costs'!U415+'Input | Meters Vols & Costs'!U416+'Input | Meters Vols & Costs'!U419+'Input | Meters Vols & Costs'!U422","v":214165.0967963828},null,156723.66204956267,7043.2172213863523,7184,7320.4960000000428,7459.5854239999899,7593.8579616319912,7730.5474049413751]
["three phase Current transformer connected meter",{"$f":"'Input | Meters Vols & Costs'!O417+'Input | Meters Vols & Costs'!O423+'Input | Meters Vols & Costs'!O420","v":7647.2408255270657},{"$f":"'Input | Meters Vols & Costs'!P417+'Input | Meters Vols & Costs'!P423+'Input | Meters Vols & Costs'!P420","v":8083.5202887114938},{"$f":"'Input | Meters Vols & Costs'!Q417+'Input | Meters Vols & Costs'!Q423+'Input | Meters Vols & Costs'!Q420","v":8528.5202887114938},{"$f":"'Input | Meters Vols & Costs'!R417+'Input | Meters Vols & Costs'!R423+'Input | Meters Vols & Costs'!R420","v":8981.9752887114937},{"$f":"'Input | Meters Vols & Costs'!S417+'Input | Meters Vols & Costs'!S423+'Input | Meters Vols & Costs'!S420","v":9444.0459337114935},{"$f":"'Input | Meters Vols & Costs'!T417+'Input | Meters Vols & Costs'!T423+'Input | Meters Vols & Costs'!T420","v":9914.4338503214931},{"$f":"'Input | Meters Vols & Costs'!U417+'Input | Meters Vols & Costs'!U423+'Input | Meters Vols & Costs'!U420","v":10393.288749430472},null,7056.9371965196242,436.2794631844281,445,453.45499999999993,462.07064499999979,470.38791660999959,478.85489910897923]
[null,{"$f":"'Input | Meters Vols & Costs'!O427","v":1003381.7579999998},{"$f":"SUM(C5:C8)","v":1024327.1244020002},{"$f":"SUM(D5:D8)","v":1045630.2988592401},1067280.4203931678,1089284.0809982398,1111629.0370582032,1134321.4318912465,null,null,{"$f":"C9/$C$9","v":1},{"$f":"D9/$D$9","v":1},{"$f":"E9/$E$9","v":1},{"$f":"F9/$F$9","v":1},{"$f":"G9/$G$9","v":1},{"$f":"H9/$H$9","v":1}]
[null,null,{"$f":"C9/B9-1","v":2.0874772971505751E-2},{"$f":"D9/C9-1","v":2.0797237473992203E-2},2.0705331088385126E-2,2.0616569164612075E-2,2.0513433042633089E-2,2.0413639871351252E-2,null,{"$f":"B22-B23","v":925929},{"$f":"J10*(1+C10)","v":945257.55766273336},{"$f":"K10*(1+D10)","v":964916.30356353114},984895.2151013948,1005200.3754234283,1025820.4860191063,1046761.2159933549]
{"$rows_left_out":14}
{"sheet":"Input | Comms, IT, Other","index":12,"n_rows":262,"n_cols":18,"rows_kept":262,"cut":false,"hidden":false,"merged":[[5,0,5,11],[38,0,38,11],[152,0,152,11],[172,0,172,11],[80,12,80,16],[107,12,107,16],[121,12,121,16],[41,6,41,11],[42,6,42,8],[95,4,95,5],[81,4,81,5],[42,9,42,11],[68,4,68,5],[199,12,199,16],[222,12,222,16],[245,12,245,16],[174,12,174,16]]}
[null,{"$f":"'Input|General'!B1&\" v\"&'Input|General'!$D$2","v":"AER Metering Opex & Capex Forecasting Model  v1.08"}]
[null,{"$f":"MID(CELL(\"filename\",A1),FIND(\"]\",CELL(\"filename\",A1))+1,255)","v":"Input | Comms, IT, Other"}]
[]
[]
[]
[{"$f":"LEFT('Input | Meters Vols & Costs'!B144,1)+1&\". Comms Setup\"","v":"7. Comms Setup"}]
[]
[null,"a","Define equipment types and actions / drivers of volumes and unit costs"]
[]
[null,null,null,null,"Equipment Type"]
{"$rows_left_out":253}
{"sheet":"Calculations >","index":13,"n_rows":1,"n_cols":1,"rows_kept":1,"cut":false,"hidden":false,"merged":[]}
["w"]

{"sheet":"Calc | Capex Meters","index":14,"n_rows":164,"n_cols":24,"rows_kept":164,"cut":false,"hidden":false,"merged":[[30,4,30,21],[10,4,10,21],[71,4,71,21],[51,4,51,21]]}
[null,{"$f":"'Input|General'!B1&\" v\"&'Input|General'!$D$2","v":"AER Metering Opex & Capex Forecasting Model  v1.08"}]
[null,{"$f":"MID(CELL(\"filename\",A1),FIND(\"]\",CELL(\"filename\",A1))+1,255)","v":"Calc | Capex Meters"}]
[]
[{"$f":"PRODUCT(X48:X49,X89:X90,X110,X151,X163)","v":1},null,"Sheet Check"]
[null,"Summary: Yearly Meter Costs"]
[]
[]
[null,null,"a","Meter Costs by Labour/Non-Labour"]
[]
[null,null,null,"i","Meters - Labour Component"]
{"$rows_left_out":155}
{"sheet":"Calc | Meters Detail","index":15,"n_rows":662,"n_cols":22,"rows_kept":662,"cut":false,"hidden":false,"merged":[[5,0,5,10]]}
[null,{"$f":"'Input|General'!B1&\" v\"&'Input|General'!$D$2","v":"AER Metering Opex & Capex Forecasting Model  v1.08"}]
[null,{"$f":"MID(CELL(\"filename\",A1),FIND(\"]\",CELL(\"filename\",A1))+1,255)","v":"Calc | Meters Detail"}]
[]
[]
[]
["Extra: Detailed Cost Tables - including real price escalation"]
[]
[null,null,null,null,null,null,null,null,null,null,null,null,null,null,1,2,3,4,5,6,7]
[null,"a","Labour Costs"]
[null,null,null,1,{"$f":"'Input | Meters Vols & Costs'!$G$29","v":"New Meter Installations - Growth"}]
{"$rows_left_out":653}
{"sheet":"Calc | Capex Comm, IT, Other","index":16,"n_rows":191,"n_cols":17,"rows_kept":191,"cut":false,"hidden":false,"merged":[[6,0,6,9]]}
[null,{"$f":"'Input|General'!B1&\" v\"&'Input|General'!$D$2","v":"AER Metering Opex & Capex Forecasting Model  v1.08"}]
[null,{"$f":"MID(CELL(\"filename\",A1),FIND(\"]\",CELL(\"filename\",A1))+1,255)","v":"Calc | Capex Comm, IT, Other"}]
[]
[]
[]
[]
["CALC | Comms"]
[]
[]
[null,"a","Equipment cost"]
{"$rows_left_out":182}
{"sheet":"Outputs","index":17,"n_rows":0,"n_cols":0,"rows_kept":0,"cut":false,"hidden":false,"merged":[]}

{"sheet":"Output | PTRM","index":18,"n_rows":59,"n_cols":14,"rows_kept":59,"cut":false,"hidden":false,"merged":[]}
[null,{"$f":"'Input|General'!B1&\" v\"&'Input|General'!$D$2","v":"AER Metering Opex & Capex Forecasting Model  v1.08"}]
[null,{"$f":"MID(CELL(\"filename\",A1),FIND(\"]\",CELL(\"filename\",A1))+1,255)","v":"Output | PTRM"}]
[]
[]
[]
[]
[null,"Forecast Capex"]
[]
[null,"Gross capital expenditure"]
[null,null,null,"Units","Output Basis",null,{"$f":"(LEFT(H10,4)-1&IF(MID(H10,5,1)=\"\",\"\",\"-\"&TEXT(MOD(MID(H10,6,2)-1,100),\"00\")))","v":"2024-25"},{"$f":"(LEFT(I10,4)-1&IF(MID(I10,5,1)=\"\",\"\",\"-\"&TEXT(MOD(MID(I10,6,2)-1,100),\"00\")))","v":"2025-26"},{"$f":"FPFirstYear","v":"2026-27"},{"$f":"(LEFT(I10,4)+1&IF(MID(I10,5,1)=\"\",\"\",\"-\"&TEXT(MOD(MID(I10,6,2)+1,100),\"00\")))","v":"2027-28"},{"$f":"(LEFT(J10,4)+1&IF(MID(J10,5,1)=\"\",\"\",\"-\"&TEXT(MOD(MID(J10,6,2)+1,100),\"00\")))","v":"2028-29"},"2029-30","2030-31","Total"]
{"$rows_left_out":50}
{"sheet":"Output | RFM","index":19,"n_rows":51,"n_cols":14,"rows_kept":51,"cut":false,"hidden":false,"merged":[]}
[null,{"$f":"'Input|General'!B1&\" v\"&'Input|General'!$D$2","v":"AER Metering Opex & Capex Forecasting Model  v1.08"}]
[null,{"$f":"MID(CELL(\"filename\",A1),FIND(\"]\",CELL(\"filename\",A1))+1,255)","v":"Output | RFM"}]
[]
[]
[]
[]
[null,"Forecast Capex"]
[]
[null,"Gross capital expenditure"]
[null,null,null,"Units","Output Basis",null,{"$f":"(LEFT(H10,4)-1&IF(MID(H10,5,1)=\"\",\"\",\"-\"&TEXT(MOD(MID(H10,6,2)-1,100),\"00\")))","v":"2024-25"},{"$f":"(LEFT(I10,4)-1&IF(MID(I10,5,1)=\"\",\"\",\"-\"&TEXT(MOD(MID(I10,6,2)-1,100),\"00\")))","v":"2025-26"},{"$f":"FPFirstYear","v":"2026-27"},{"$f":"(LEFT(I10,4)+1&IF(MID(I10,5,1)=\"\",\"\",\"-\"&TEXT(MOD(MID(I10,6,2)+1,100),\"00\")))","v":"2027-28"},{"$f":"(LEFT(J10,4)+1&IF(MID(J10,5,1)=\"\",\"\",\"-\"&TEXT(MOD(MID(J10,6,2)+1,100),\"00\")))","v":"2028-29"},"2029-30","2030-31","Total"]
{"$rows_left_out":42}
{"sheet":"Lookup|Tables","index":20,"n_rows":142,"n_cols":9,"rows_kept":142,"cut":false,"hidden":false,"merged":[]}
[]
[]
[]
[]
[]
[]
[null,"Unit Denominations"]
[]
[null,null,{"$f":"B7","v":"Unit Denominations"},"Source",null,null,"Ref"]
[null,null,"Dollars","AER",null,null,"$dollars"]
{"$rows_left_out":132}