{"text_format":"1","workbook":"xlsx","n_sheets":23,"sheets":["AER only","Instructions","Contents","Business & other details","2.11 Labour","3.6 Quality of services","3.6.8 Network-feeders","3.6.9 Network-reliability","4.1 Public lighting","6.2 STPIS Reliability","6.6 STPIS Customer Service","6.7 STPIS Daily Performance","6.8 STPIS Exclusions","6.9 STPIS - GSL","7.8 Avoided TUOS Payments","7.10 Juris Scheme","7.11 DMIS-DMIA","7.12 Safety and Bushfire","7.13 TARC","8.1 Income","8.2 Capex","8.4 Opex","9.5 TUoS"],"not_rendered":{"charts":0,"images":7,"macros":1,"external_links":1,"defined_names":848,"comments":3,"pivot_tables":0},"unopened":[],"bounds":{"document_bytes":16777216,"sheet_cells":100000,"rows_first":2000,"rows_last":500,"rows_between":2000,"halvings":0,"cell_chars":16384,"cell_head_chars":4096},"cells_cut":0,"cells_raw":0,"read":"whole","date_system":"1900"}

{"sheet":"AER only","index":0,"n_rows":125,"n_cols":40,"rows_kept":125,"cut":false,"hidden":true,"merged":[[48,34,50,34],[0,1,0,11],[3,28,3,38],[4,28,4,31],[4,34,4,38],[46,22,46,26],[46,28,46,31],[47,1,47,5],[47,14,47,21],[47,22,47,26],[47,28,47,31],[48,2,48,3],[51,34,55,34],[59,34,60,34],[65,14,65,15],[65,22,65,25],[103,1,103,8]]}
[null,"Data in these columns used for data validation and database purposes."]
[null,"Date last modified:","2016-09-06","added new business names, improved column heading formatting"]
[]
[null,null,null,null,null,null,null,null,null,null,null,null,null,null,null,null,null,null,null,null,null,null,null,null,null,null,null,null,"FOR ELECTRICITY BUSINESSES ONLY"]
[null,null,null,null,null,null,null,null,null,null,null,null,null,null,null,null,null,null,null,null,null,null,null,null,null,null,null,null,"Feeder Types",null,null,null,"TasNetworks (D)","MAIFI flag","Feeder Names"]
[null,null,null,null,null,null,null,null,null,null,null,null,null,null,null,null,null,null,null,null,null,null,null,null,null,null,null,null,"CBD","Urban","Short rural","long rural","EXTRA"]
[null,"dms_TradingName_List","dms_TradingNameFull_List","dms_ABN_List","dms_JurisdictionList","dms_Sector_List","dms_Segment_List","dms_FormControl_List","dms_RPT_List","dms_RPTMonth_List","dms_CRCPlength_List","dms_FRCPlength_List","dms_663_List","dms_DeterminationRef_List","dms_Addr1_List","dms_Addr2_List","dms_Suburb_List","dms_State_List","dms_PostCode_List","dms_PAddr1_List","dms_PAddr2_List","dms_PSuburb_List","dms_PState_List","dms_PPostCode_List","dms_ContactName1_List","dms_ContactPh1_List","dms_ContactEmail_List",null,"dms_CBD_flag","dms_Urban_flag","dms_ShortRural_flag","dms_LongRural_flag","dms_FeederType_5_flag","dms_MAIFI_flag_List","dms_FeederName_1","dms_FeederName_2","dms_FeederName_3","dms_FeederName_4","dms_FeederName_5"]
[null,"ActewAGL Distribution","ActewAGL Distribution",76670568688,"ACT","Electricity","Distribution","Revenue cap","Financial","June",5,5,5,"2014-19 Distribution Determination","40 Bunda Street",null,"CANBERRA","ACT","2600","GPO BOX 366",null,"CANBERRA","ACT",2601,"Robert Walker","02 6248 3847","robert.walker@actewagle.com.au",null,"NO","YES","YES","NO","NO",null,"CBD","Urban","Short rural","Long rural",null,"ActewAGL Distribution"]
[null,"ActewAGL Distribution (Tx Assets)","ActewAGL Distribution (Tx Assets)",76670568688,"ACT","Electricity","Distribution","Revenue cap","Financial","June",5,5,5,"distribution determination","40 Bunda Street",null,"CANBERRA","ACT","2600","GPO BOX 366",null,"CANBERRA","ACT",2601,"Robert Walker","02 6248 3847","robert.walker@actewagle.com.au",null,null,null,null,null,null,null,"CBD","Urban","Short rural","Long rural",null,"ActewAGL Distribution (Tx Assets)"]
[null,"ActewAGL Gas","ActewAGL Gas",76670568688,"ACT","Gas","Distribution","Weighted average price cap","Financial","June",5,5,"x",null,"40 Bunda Street",null,"CANBERRA","ACT","2600","GPO BOX 366",null,"CANBERRA","ACT",2601,"Philip Deamer","02 6248 3438","GasAAReview@actewagl.com.au",null,null,null,null,null,null,null,null,null,null,null,null,"ActewAGL Gas"]
[null,"AGN (Albury)","Australian Gas Networks Limited (reporting data for Albury)",19078551685,"Vic","Gas","Distribution","Weighted average price cap","Calendar","December",5,5,"x",null,"Level 10","81 Flinders Street","ADELAIDE","SA","5000",null,null,null,null,null,null,"08 8227 1500",null,null,null,null,null,null,null,null,"CBD","Urban","Short rural","Long rural",null,"AGN (SA)"]
[null,"AGN (SA)","AGN (SA)",78551685,"SA","Gas","Distribution","Revenue cap","Financial","June",5,5,5,"distribution determination",null,null,null,"SA",null,null,null,null,null,null,null,null,null,null,null,null,null,null,null,null,null,null,null,null,null,"AGN (Victoria)"]
[null,"AGN (Victoria)","Australian Gas Networks Limited (reporting data for Victoria)",19078551685,"Vic","Gas","Distribution","Weighted average price cap","Calendar","December",5,5,"x",null,"Level 10","81 Flinders Street","ADELAIDE","SA","5000",null,null,null,null,null,null,"08 8227 1500",null,null,null,null,null,null,null,null,null,null,null,null,null,"AGN (Albury)"]
[null,"Amadeus","APT Pipelines (NT) Pty Ltd",39009737393,"NT","Gas","Transmission","Weighted average price cap","Financial","June",5,5,"x","n/a","Level 19, HSBC Building","580 George Street","SYDNEY","NSW","2000","Level 19, HSBC Building","580 George Street","SYDNEY","NSW","2000","Alexandra Curran","02 9275 0020","alexandra.curran@apa.com.au",null,null,null,null,null,null,null,null,null,null,null,null,"Amadeus"]
[null,"APA GasNet","APA GasNet Australia (Operations) Pty Ltd",65083009,"Vic","Gas","Transmission","Weighted average price cap","Calendar","December",5,5,"x",null,"Level 19, HSBC Building","580 George Street","SYDNEY","NSW","2000","PO Box R41",null,"ROYAL EXCHANGE","NSW","1225",null,"02 9693 0000",null,null,null,null,null,null,null,null,null,null,null,null,null,"APA GasNet"]
[null,"Ausgrid","Ausgrid",67505337385,"NSW","Electricity","Distribution","Revenue cap","Financial","June",5,5,5,"2014-19 Distribution Determination","570 George St",null,"SYDNEY","NSW",2000,null,null,null,null,null,"John Thomson","(02) 9269 2312","john.thomson@ausgrid.com.au",null,"YES","YES","YES","YES","NO",null,"CBD","Urban","Short rural","Long rural",null,"Ausgrid"]
[null,"Ausgrid (Tx Assets)","Ausgrid (Tx Assets)",67505337385,"NSW","Electricity","Distribution","Revenue cap","Financial","June",5,5,5,"distribution determination",null,null,null,"NSW",null,null,null,null,null,null,null,null,null,null,null,null,null,null,null,null,"CBD","Urban","Short rural","Long rural",null,"Ausgrid (Tx Assets)"]
[null,"AusNet (D)","AusNet Services (D)",91064651118,"Vic","Electricity","Distribution","Revenue cap","Calendar","December",5,5,2,"2016-20 Distribution Determination","Level 32","2 Southbank Boulevard","SOUTHBANK","Vic","3006","Locked Bag 14051",null,"MELBOURNE CITY MAIL CENTRE","VIC",8001,"Hannah Williams","03 9683 4088","hwilliams@powercor.com.au",null,null,"YES","YES","YES","NO",null,"CBD","Urban","Short rural","Long rural",null,"AusNet (D)"]
[null,"AusNet (Gas)","AusNet Gas Services",86015036,"Vic","Gas","Distribution","Weighted average price cap","Calendar","December",5,5,"X",null,null,null,null,null,null,null,null,null,null,null,null,null,null,null,null,null,null,null,null,null,null,null,null,null,null,"AusNet (Gas)"]
[null,"AusNet (T)","AusNet (T)",78079798173,"Vic","Electricity","Transmission","Revenue cap","Financial","March",5,5,2,"transmission determination","Level 32","2 Southbank Boulevard","SOUTHBANK","Vic","3006","Locked Bag 14051",null,"MELBOURNE CITY MAIL CENTRE","Vic","8001","Clare Thompson","03 9695 6670","clare.e.thompson@ausnetservices.com.au",null,null,null,null,null,null,null,"CBD","Urban","Short rural","Long rural",null,"AusNet (T)"]
[null,"Australian Distribution Co.","Australian Distribution Co.",11222333444,"-","Electricity","Distribution","Revenue cap","Financial","June",5,5,2,"distribution determination","123 Straight Street",null,"SYDNEY","NSW","2000","PO Box 123",null,"SYDNEY","NSW",2000,"Bob Smith","02 1234 5678","bob@auselec.net.au",null,null,null,null,null,null,null,"CBD","Urban","Short rural","Long rural",null,"Australian Distribution Co."]
[null,"Australian Distribution Co. (Vic)","Australian Distribution Co. (Victoria)",11222333444,"Vic","Electricity","Distribution","Revenue cap","Calendar","December",5,5,2,"distribution determination","123 Straight Street",null,"MELBOURNE","Vic","3000","PO Box 123",null,"MELBOURNE","VIC","3000","Bob Smith","02 1234 5678","bob@auselec.net.au",null,null,null,null,null,null,null,"CBD","Urban","Short rural","Long rural",null,"Australian Distribution Co. (Vic)"]
[null,"Australian Transmission Co.","Australian Transmission Co.",11222333444,"-","Electricity","Transmission","Revenue cap","Financial","June",5,5,5,"transmission determination","123 Straight Street",null,"SYDNEY","NSW","2000","PO Box 123",null,"SYDNEY","NSW",2000,"Bob Smith","02 1234 5678","bob@auselec.net.au",null,null,null,null,null,null,null,"CBD","Urban","Short rural","Long rural",null,"Australian Transmission Co."]
[null,"CitiPower","CitiPower",76064651056,"Vic","Electricity","Distribution","Revenue cap","Calendar","December",5,5,2,"2016-20 Distribution Determination","40 Market Street",null,"MELBOURNE","Vic","3000","Locked Bag 14090",null,"MELBOURNE","VIC",8001,"Hannah Williams","03 9683 4088","hwilliams@powercor.com.au",null,"YES","YES","NO","NO","NO",null,"CBD","Urban","Short rural","Long rural",null,"CitiPower"]
[null,"Directlink","Directlink",16779340889,"Qld","Electricity","Transmission","Revenue cap","Financial","June",9,5,5,"transmission determination",null,null,null,"NSW",null,null,null,null,null,null,null,null,null,null,null,null,null,null,null,null,"CBD","Urban","Short rural","Long rural",null,"Directlink"]
[null,"ElectraNet","ElectraNet",41094482416,"SA","Electricity","Transmission","Revenue cap","Financial","June",5,5,5,"transmission determination","52-55 East Terrace","Rymill Park","ADELAIDE","SA","5000","PO Box 7096","Hutt Street Post Office","ADELAIDE","SA",5000,"Bill Jackson","08 8404 7969","jackson.bill@electranet.com.au",null,null,null,null,null,null,null,"CBD","Urban","Short rural","Long rural",null,"ElectraNet"]
[null,"Endeavour Energy","Endeavour Energy",59253130878,"NSW","Electricity","Distribution","Revenue cap","Financial","June",5,5,5,"2014-19 Distribution Determination","51 Huntingwood Drive",null,"HUNTINGWOOD","NSW","2148","PO Box 811",null,"SEVEN HILLS","NSW","1730","Jon Hocking","02 9853 4386 / 0407 348 156","Jon.Hocking@Endeavourenergy.com.au",null,"NO","YES","YES","YES","NO",null,"CBD","Urban","Short rural","Long rural",null,"Endeavour Energy"]
[null,"Energex","Energex",40078849055,"Qld","Electricity","Distribution","Revenue cap","Financial","June",5,5,5,"2015-20 Distribution Determination","26 Reddacliff Street",null,"NEWSTEAD","Qld","4006","26 Reddacliff Street",null,"NEWSTEAD","QLD","4006","Nicola Roscoe","07 3664 5891","nicolaroscoe@energex.com.au",null,"YES","YES","YES","NO","NO",null,"CBD","Urban","Short rural","Long rural",null,"Energex"]
[null,"Ergon Energy","Ergon Energy",50087646062,"Qld","Electricity","Distribution","Revenue cap","Financial","June",5,5,5,"2015-20 Distribution Determination","22 Walker Street",null,"TOWNSVILLE","Qld","4810","Po Box 264",null,"FORTITUDE VALLEY","QLD",4006,"Jenny Doyle, Group Manager Regulatory Affairs","(07) 3851 6416","jenny.doyle@ergon.com.au",null,"NO","YES","YES","YES","NO",null,"CBD","Urban","Short rural","Long rural",null,"Ergon Energy"]
[null,"Essential Energy","Essential Energy",37428185226,"NSW","Electricity","Distribution","Revenue cap","Financial","June",5,5,5,"2014-19 Distribution Determination","8 Buller Street",null,"PORT MACQUARIE","NSW","2444","PO Box 5730",null,"PORT MACQUARIE","NSW","2444","Catherine Waddell","02 6338 3553","catherine.waddell@essentialenergy.com.au",null,null,null,"YES","YES","NO",null,"CBD","Urban","Short rural","Long rural",null,"Essential Energy"]
[null,"Jemena Electricity","Jemena Electricity",82064651083,"Vic","Electricity","Distribution","Revenue cap","Calendar","December",5,5,2,"2016-20 Distribution Determination","Level 16","567 Collins Street","MELBOURNE","VIC","3000","PO Box 16182",null,"MELBOURNE","VIC",8001,"Matthew Serpell","03 9173 8231","matthew.serpell@jemena.com..au",null,null,null,"YES","NO","NO",null,"CBD","Urban","Short rural","Long rural",null,"Jemena Electricity"]
[null,"JGN","Jemena Gas Networks",null,"NSW","Gas","Distribution","Weighted average price cap","Financial","June",5,5,null,null,null,null,null,null,null,null,null,null,null,null,null,null,null,null,null,null,null,null,null,null,null,null,null,null,null,"JGN"]
[null,"Multinet Gas","Multinet Gas (DB No.1) Pty Ltd (ACN 086 026 986), Multinet Gas (DB No.2) Pty Ltd (ACN 086 230 122)",86026986,"Vic","Gas","Distribution","Weighted average price cap","Calendar","December",5,5,"x",null,null,null,null,null,null,null,null,null,null,null,null,null,null,null,null,null,null,null,null,null,null,null,null,null,null,"Multinet Gas"]
[null,"Murraylink","Murraylink",79181207909,"SA","Electricity","Transmission","Revenue cap","Financial","June",5,5,5,"transmission determination",null,null,null,null,null,null,null,null,null,null,null,null,null,null,null,null,null,null,null,null,"CBD","Urban","Short rural","Long rural",null,"Murraylink"]
[null,"Powercor Australia","Powercor Australia",89064651109,"Vic","Electricity","Distribution","Revenue cap","Calendar","December",5,5,2,"2016-20 Distribution Determination","40 Market Street",null,"MELBOURNE","Vic","3000","Locked bag 14090",null,"MELBOURNE","VIC",8001,"Hannah Williams","03 9683 4088","hwilliams@powercor.com.au",null,null,null,"YES","YES","NO",null,"CBD","Urban","Short rural","Long rural",null,"Powercor Australia"]
[null,"Powerlink","Queensland Electricity Transmission Corporation Limited trading as Powerlink Queensland",82078849233,"Qld","Electricity","Transmission","Revenue cap","Financial","June",5,5,5,"transmission determination","33 Harold St",null,"VIRGINIA","Qld","4014","PO Box 1193",null,"VIRGINIA","QLD",4014,"Jennifer Harris","07 3860 2667","jharris@powerlink.com.au",null,null,null,null,null,null,null,"CBD","Urban","Short rural","Long rural",null,"Powerlink"]
[null,"Roma to Brisbane Pipeline","APT Petroleum Pipelines Limited t/a Roma to Brisbane Pipeline","009 737 393","Qld","Gas","Transmission","Revenue cap","Financial","June",5,5,"x","n/a",null,null,null,null,null,null,null,null,null,null,null,null,null,null,null,null,null,null,null,null,"CBD","Urban","Short rural","Long rural",null,"Roma to Brisbane Pipeline"]
[null,"SA Power Networks","SA Power Networks",13332330749,"SA","Electricity","Distribution","Revenue cap","Financial","June",5,5,5,"2015-20 Distribution Determination","1 Anzac Highway",null,"KESWICK","SA","5035","GPO Box 77",null,"ADELAIDE","SA","5000","Damien O'Connor","08 8404 5066","damien.oconnor@sapowernetworks.com.au",null,null,null,"YES","YES","NO",null,"CBD","Urban","Short rural","Long rural",null,"SA Power Networks"]
[null,"TasNetworks (D)","TasNetworks (D)",24167357299,"Tas","Electricity","Distribution","Revenue cap","Financial","June",5,5,5,"distribution determination","21 Kirksway Place",null,"HOBART","Tas","7000","GPO Box 191",null,"HOBART","Tas","7000","Leigh Mayne","03 6270 3691","rrp2012@auroraenergy.com.au",null,null,null,"YES","YES","YES",null,"Critical Infrastructure","High density commercial","Urban","High density rural","Low density rural","TasNetworks (D)"]
[null,"TasNetworks (T)","TasNetworks (T)",24167357299,"Tas","Electricity","Transmission","Revenue cap","Financial","June",5,5,5,"transmission determination","1-7 Maria Street",null,"LENAH VALLEY","Tas","7008","PO Box 606",null,"MOONAH","Tas","7009","Heath Dillon","03 6274 3664","heath.dillon@transend.com.au",null,null,null,null,null,null,null,"CBD","Urban","Short rural","Long rural",null,"TasNetworks (T)"]
[null,"TransGrid","NSW Electricity Networks Operations Pty Ltd trading as TransGrid",609169959,"NSW","Electricity","Transmission","Revenue cap","Financial","June",5,4,5,"transmission determination","180 Thomas Street",null,"SYDNEY","NSW","2000","PO Box A1000",null,"SYDNEY SOUTH","NSW","1235","Garrie Chubb","0408 210 221","garrie.chubb@transgrid.com.au",null,null,null,null,null,null,null,"CBD","Urban","Short rural","Long rural",null,"TransGrid"]
[null,"United Energy","United Energy",70064651029,"Vic","Electricity","Distribution","Revenue cap","Calendar","December",5,5,2,"2016-20 Distribution Determination","Level 3","6 Nexus Court","MULGRAVE","Vic","3149","PO Box 449",null,"MOUNT WAVERLEY","VIC",3170,"Mathew Abraham","03 8846 9758","mathew.abraham@ue.com.au",null,null,null,"YES","NO","NO",null,"CBD","Urban","Short rural","Long rural",null,"United Energy"]
[null,"Western Power (D)","Western Power (D)",18540492861,"WA","Electricity","Distribution","Revenue cap","Financial","June",12,4,"x","distribution determination","363 Wellington Street",null,"PERTH","WA","6000","GPO Box L921",null,"PERTH","WA",6842,"Judy Hunter","08 9326 6239","judy.hunter@westernpower.com.au",null,null,null,"YES","YES","NO","NO","CBD","Urban","Short rural","Long rural",null,"Western Power (D)"]
[null,"Western Power (T)","Western Power (T)",18540492861,"WA","Electricity","Transmission","Revenue cap","Financial","June",12,4,"x","transmission determination","363 Wellington Street",null,"PERTH","WA","6000","GPO Box L921",null,"PERTH","WA",6842,"Judy Hunter","08 9326 6239","judy.hunter@westernpower.com.au",null,null,null,"YES","YES","NO",null,"CBD","Urban","Short rural","Long rural",null,"Western Power (T)"]
[]
[]
[null,null,null,null,null,null,null,null,null,null,null,null,null,null,null,null,null,null,null,null,null,null,"For EB & Reset RINs only",null,null,null,null,null,"For AARs only"]
[null,"The Reg Year Ending (dms_RYE) must be set to the last year of the regulatory period. For forecast data is is usually (FRCP_y5) for actual it is a single year (CRY). For historical actual data the RYE will need to be set manually in the business details sheet by setting the dms_Multiyear_flag to 1 and putting the correct value in 'dms_Specified_FinalYear. See cells C67:C68",null,null,null,null,{"$f":"IF(dms_RPT=\"financial\",VALUE(LEFT(CRCP_y1,4)-1)&\"-\"&TEXT(VALUE(RIGHT(CRCP_y1,2)-1),\"00\"),VALUE(LEFT(CRCP_y1,4)-1))","v":2011},null,null,null,null,null,null,"Drop down selector box for CA & Reset RINs.","For CA & Reset RINs only",null,null,null,null,null,null,null,"for DNSP only",null,null,null,null,null,"For DNSPs only",null,null,null,null,null,"Reason for interruption","dms_Reason_Interruption_Detailed","dms_Reason_Interruption"]
[null,"dms_Model_List ","DELETE NR 'CRY' IF NOT AN ANNUAL RIN (EB, CA , ARR)",null,"dms_RYE_Formula_Result",null,null,null,null,null,null,null,null,"dms_0203_ProjectType","dms_020303_01_UOM","dms_020501_01_UOM","dms_020501_02_UOM","dms_020501_03_UOM","dms_020501_04_UOM","dms_020603_01_UOM","dms_040102_01_UOM","dms_040102_04_UOM","dms_030601_01_UOM","dms_030601_02_UOM","dms_030701_01_UOM","dms_030702_01_UOM","dms_030703_01_UOM",null,"dms_030605_UOM","dms_03060703_UOM",null,null,null,null,"Animal","Animal impact","Animal"]
[null,"ARR","ANNUAL REPORTING STATEMENT",null,{"$f":"LEFT(dms_SingleYear_FinalYear_Result,2)&RIGHT(dms_SingleYear_FinalYear_Result,2)","v":"2017"},"=LEFT(dms_SingleYear_FinalYear_Result,2)&RIGHT(dms_SingleYear_FinalYear_Result,2)",null,"Formula errors are OK",null,null,null,null,null,"New line on new route - single circuit","Circuit line length in km","0's","0's","0's","0's","0's","0's","days","minutes/customer","minutes/customer","Customer / km","%","km",null,"number","number",null,null,null,null,null,"Animal nesting/burrowing, etc and other","Asset failure"]
[null,"CA","CATEGORY ANALYSIS",null,{"$f":"LEFT(dms_SingleYear_FinalYear_Result,2)&RIGHT(dms_SingleYear_FinalYear_Result,2)","v":"2017"},"=LEFT(dms_SingleYear_FinalYear_Result,2)&RIGHT(dms_SingleYear_FinalYear_Result,2)",null,"Formula errors are OK",null,null,null,null,null,"New line on new route - dual circuit","Circuit line length in km","0's","0's","0's","0's","0's","0's","0's","minutes/customer","minutes/customer","MWh/customer","Number of spans",null,null,"number","number",null,null,null,null,null,"Other","Other"]
[null,"CPI","CPI",null,null,null,null,null,null,null,null,null,null,"New line on new route - other","Circuit line length in km","MVA added","MVA added","MVA added","MVA added","0's","0's","$0s","interruptions/customer","interruptions/customer","kVA / customer","Number of spans",null,null,"number","number",null,null,null,null,"Asset failure","LV","Overloads"]
[null,"EB","ECONOMIC BENCHMARKING",null,{"$f":"LEFT(dms_SingleYear_FinalYear_Result,2)&RIGHT(dms_SingleYear_FinalYear_Result,2)","v":"2017"},"=LEFT(dms_SingleYear_FinalYear_Result,2)&RIGHT(dms_SingleYear_FinalYear_Result,2)",null,"Formula errors are OK",null,null,null,null,null,"Line rebuild over existing route - single circuit","Circuit line length in km","0's","0's","0's","0's","0's","$0s","0's","interruptions/customer","interruptions/customer",null,"Number of spans",null,null,"number","number",null,null,null,null,null,"Distribution substation","Planned"]
[null,"PTRM","POST TAX REVENUE MODEL",null,{"$f":"LEFT(dms_MultiYear_FinalYear_Result,2)&RIGHT(dms_MultiYear_FinalYear_Result,2)","v":"2021"},"=LEFT(dms_MultiYear_FinalYear_Result,2)&RIGHT(dms_MultiYear_FinalYear_Result,2)",null,null,null,null,null,null,null,"Line rebuild over existing route - dual circuit","Number","total spend $0s","total spend $0s","total spend $0s","total spend $0s","(per cent)",null,null,null,null,null,"Number of spans",null,null,"number","(per cent)",null,null,null,null,null,"HV","Network business"]
[null,"Reset","REGULATORY REPORTING STATEMENT",null,{"$f":"LEFT(dms_MultiYear_FinalYear_Result,2)&RIGHT(dms_MultiYear_FinalYear_Result,2)","v":"2021"},"=LEFT(dms_MultiYear_FinalYear_Result,2)&RIGHT(dms_MultiYear_FinalYear_Result,2)",null,"Formula errors are OK",null,null,null,null,null,"Reconductor - Single circuit","Number","net circuit km added","net circuit km added","net circuit km added","net circuit km added",null,null,null,null,null,null,"Years",null,null,"number",null,null,null,null,null,null,"Zone substation","Third party"]
[null,"RFM","ROLL FORWARD MODEL",null,{"$f":"LEFT(dms_CRCP_FinalYear_Result,2)&RIGHT(dms_CRCP_FinalYear_Result,2)","v":"2017"},"=LEFT(dms_CRCP_FinalYear_Result,2)&RIGHT(dms_CRCP_FinalYear_Result,2)",null,null,null,null,null,null,null,"Reconductor - Dual circuit","Number","total spend $0s","total spend $0s","total spend $0s","total spend $0s",null,null,null,null,null,null,"Years",null,null,"number",null,null,null,null,null,null,"Subtransmission","Unknown"]
[null,"WACC","WEIGHTED AVERAGE COST OF CAPITAL",null,{"$f":"LEFT(dms_MultiYear_FinalYear_Result,2)&RIGHT(dms_MultiYear_FinalYear_Result,2)","v":"2021"},"=LEFT(dms_MultiYear_FinalYear_Result,2)&RIGHT(dms_MultiYear_FinalYear_Result,2)",null,null,null,null,null,null,null,"Other",null,"net circuit km added","net circuit km added","net circuit km added","net circuit km added",null,null,null,null,null,null,"Trees",null,null,"number",null,null,null,null,null,"Other","insert description of 'other'","Vegetation"]
[null,null,null,null,null,null,null,null,null,null,null,null,null,null,null,"total spend $0s","total spend $0s","total spend $0s","total spend $0s",null,null,null,null,null,null,"Trees",null,null,"number",null,null,null,null,null,"Overloads","-","Weather"]
[null,"dms_DataQuality_List",null,null,null,null,null,null,null,null,null,null,null,null,null,"0's",null,"$0s",null,null,null,null,null,null,null,"Defects",null,null,"number",null,null,null,null,null,"Planned","-","2 - STPIS Exclusion (3.3)(a)"]
[null,"Actual",null,null,null,null,null,null,null,null,null,null,null,null,null,"0's",null,null,null,null,null,null,null,null,null,"Defects",null,null,"number",null,null,null,null,null,"Network business","Network error","3 - STPIS Exclusion (3.3)(a)"]
[null,"Estimate",null,null,null,null,null,null,null,null,null,null,null,null,null,"0's",null,null,null,null,null,null,null,null,null,"Spans",null,null,"number",null,null,null,null,null,null,"Switching and protection error","4 - STPIS Exclusion (3.3)(a)"]
[null,"Consolidated",null,null,null,null,null,null,null,null,null,null,null,null,null,"$0s",null,null,null,null,null,null,null,null,null,"km",null,null,"(per cent)",null,null,null,null,null,"Third party","Fire","5 - STPIS Exclusion (3.3)(a)"]
[null,"Recast",null,null,null,null,null,null,null,null,null,null,null,null,null,null,null,null,null,null,null,null,null,null,null,"Spans",null,null,"(per cent)","",null,null,null,null,null,"Other","6 - STPIS Exclusion (3.3)(a)"]
[null,"Public",null,null,null,null,null,null,null,null,null,null,null,null,null,null,null,null,null,null,null,null,null,null,null,null,null,null,null,null,null,null,null,null,null,"Dig-in","7 - STPIS Exclusion (3.3)(a)"]
[null,null,null,null,null,null,null,null,null,null,null,null,null,null,null,null,null,null,null,null,null,null,null,null,null,null,null,null,null,null,null,null,null,null,null,"Unauthorised access"]
[null,"For all files either AER or business needs to be able to specify the type of submission","For PTRM & RFM templates we must provide a choice in case they change their form of control - otherwise it is drawn from the business specific lookup table above.",null,null,null,null,null,null,null,null,null,null,null,"For PTRM files - this field set the text for the named range \"DMS_Xfactor\" which in all cases is simply the text \"x factors\" - this saves putting in each old gas PTRM file ",null,null,null,null,null,null,null,"for TNSP only",null,null,null,null,null,null,null,null,null,null,null,null,"Vehicle impact"]
[null,"dms_SourceList","dms_FormControl_Choices",null,null,null,null,null,null,null,null,null,null,null,"DMS_Xfactor",null,null,null,null,null,null,null,"dms_030601_01_UOM",null,"dms_030701_01_UOM","dms_030702_01_UOM",null,null,null,null,null,null,null,null,"Unknown","Unknown"]
[null,"After appeal","Revenue cap",null,null,null,null,null,null,null,null,null,null,null,"x factors",null,null,null,null,null,null,null,"%",null,"Number of spans","km",null,null,null,null,null,null,null,null,"Vegetation","Blow-in/Fall-in - NSP responsibility"]
[null,"Draft decision","Revenue yield",null,null,null,null,null,null,null,null,null,null,null,null,null,null,null,null,null,null,null,"number",null,"Years","%",null,null,null,null,null,null,null,null,null,"Grow-in - NSP responsibility"]
[null,"Final decision","Weighted average price cap",null,null,null,null,null,null,null,null,null,null,null,null,null,null,null,null,null,null,null,"number",null,"Trees","km",null,null,null,null,null,null,null,null,null,"Blow-in/Fall-in - Other responsible party"]
[null,"PTRM update 1",null,null,null,null,null,null,null,null,null,null,null,null,null,null,null,null,null,null,null,null,"%",null,"Defects","number",null,null,null,null,null,null,null,null,null,"Grow-in - Other responsible party"]
[null,"PTRM update 2",null,null,null,null,null,null,null,null,null,null,null,null,null,null,null,null,null,null,null,null,"number",null,"Number of spans",null,null,null,null,null,null,null,null,null,"Weather"]
[null,"PTRM update 3",null,null,null,null,null,null,null,null,null,null,null,null,null,null,null,null,null,null,null,null,"number",null,"km",null,null,null,null,null,null,null,null,null,"2 - STPIS Exclusion (3.3)(a)"]
[null,"PTRM update 4",null,null,null,null,null,null,null,null,null,null,null,null,null,null,null,null,null,null,null,null,"%",null,"km",null,null,null,null,null,null,null,null,null,"3 - STPIS Exclusion (3.3)(a)"]
[null,"PTRM update 5",null,null,null,null,null,null,null,null,null,null,null,null,null,null,null,null,null,null,null,null,"number",null,"Number of spans",null,null,null,null,null,null,null,null,null,"4 - STPIS Exclusion (3.3)(a)"]
[null,"PTRM update 6",null,null,null,null,null,null,null,null,null,null,null,null,null,null,null,null,null,null,null,null,"number",null,null,null,null,null,null,null,null,null,null,null,"5 - STPIS Exclusion (3.3)(a)"]
[null,"PTRM update 7",null,null,null,null,null,null,null,null,null,null,null,null,null,null,null,null,null,null,null,null,"%",null,null,null,null,null,null,null,null,null,null,null,"6 - STPIS Exclusion (3.3)(a)"]
[null,"Regulatory proposal",null,null,null,null,null,null,null,null,null,null,null,null,null,null,null,null,null,null,null,null,"number",null,null,null,null,null,null,null,null,null,null,null,"7 - STPIS Exclusion (3.3)(a)"]
[null,"Reporting",null,null,null,null,null,null,null,null,null,null,null,null,null,null,null,null,null,null,null,null,"%"]
[null,"Revised regulatory proposal",null,null,null,null,null,null,null,null,null,null,null,null,null,null,null,null,null,null,null,null,"number"]
[null,null,null,null,null,null,null,null,null,null,null,null,null,null,null,null,null,null,null,null,null,null,"%"]
[null,null,null,null,null,null,null,null,null,null,null,null,null,null,null,null,null,null,null,null,null,null,"number"]
[]
[]
[]
[null,"These are indeces and lookup values for various dates. All step from the value placed in FRCP_y1 on the business and other details worksheet",null,null,null,null,null,null,null,null,null,"These date tables are currently used in the Recast templates to provide column headings and conditional formatting"]
[null,"dms_FRCPlength_Num_List","dms_FinalYear_List","dms_CRCPlength_Num_List","dms_CFinalYear_List","dms_FRCP_years",null,"dms_CRCP_years",null,"dms_CRCP_index",null,"CRY from input cell on business sheet","CRY - financial","dms_FinYears","CRY calendar","dms_CalYears"]
[null,1,"dms_FRCP_y1",1,"CRCP_y1",{"$f":"FRCP_y1","v":"2017-18"},"dms_FRCP_y1",{"$f":"IF(dms_RPT=\"financial\",VALUE(LEFT(dms_FRCP_y1,4)-1)&\"-\"&TEXT(VALUE(MID(dms_FRCP_y1,3,2)),\"00\"),VALUE(LEFT(dms_FRCP_y1,4)-1))","v":2016},"dms_CRCP_yZ",1,null,{"$f":"CRY","v":"2017"},{"$f":"VALUE(LEFT(CRY,4))&\"-\"&TEXT(MID(CRY,3,2)+1,\"00\")","v":"2017-18"},"dms_CRYf_y1",{"$f":"VALUE(LEFT(CRY,4)+1)","v":2018},"dms_CRYc_y1"]
[null,2,"dms_FRCP_y2",2,"CRCP_y2",{"$f":"IF(dms_RPT=\"financial\",VALUE(LEFT(dms_FRCP_y1,4)+1)&\"-\"&TEXT(VALUE(RIGHT(dms_FRCP_y1,2)+1),\"00\"),VALUE(LEFT(dms_FRCP_y1,4)+1))","v":2018},"dms_FRCP_y2",{"$f":"IF(dms_RPT=\"financial\",VALUE(LEFT(dms_CRCP_yZ,4)-1)&\"-\"&TEXT(VALUE(MID(dms_CRCP_yZ,3,2)),\"00\"),VALUE(LEFT(dms_CRCP_yZ,4)-1))","v":2015},"dms_CRCP_yY",2,null,null,{"$f":"VALUE(LEFT(dms_CRYf_y1,4)+1)&\"-\"&TEXT(MID(dms_CRYf_y1,3,2)+2,\"00\")","v":"2018-19"},"dms_CRYf_y2",{"$f":"VALUE(LEFT(dms_CRYc_y1,4)+1)","v":2019},"dms_CRYc_y2"]
[null,3,"dms_FRCP_y3",3,"CRCP_y3",{"$f":"IF(dms_RPT=\"financial\",VALUE(LEFT(dms_FRCP_y2,4)+1)&\"-\"&TEXT(VALUE(RIGHT(dms_FRCP_y2,2)+1),\"00\"),VALUE(LEFT(dms_FRCP_y2,4)+1))","v":2019},"dms_FRCP_y3",{"$f":"IF(dms_RPT=\"financial\",VALUE(LEFT(dms_CRCP_yY,4)-1)&\"-\"&TEXT(VALUE(MID(dms_CRCP_yY,3,2)),\"00\"),VALUE(LEFT(dms_CRCP_yY,4)-1))","v":2014},"dms_CRCP_yX",3,null,null,{"$f":"VALUE(LEFT(dms_CRYf_y2,4)+1)&\"-\"&TEXT(MID(dms_CRYf_y2,3,2)+2,\"00\")","v":"2019-20"},"dms_CRYf_y3",{"$f":"VALUE(LEFT(dms_CRYc_y2,4)+1)","v":2020},"dms_CRYc_y3"]
[null,4,"dms_FRCP_y4",4,"CRCP_y4",{"$f":"IF(dms_RPT=\"financial\",VALUE(LEFT(dms_FRCP_y3,4)+1)&\"-\"&TEXT(VALUE(RIGHT(dms_FRCP_y3,2)+1),\"00\"),VALUE(LEFT(dms_FRCP_y3,4)+1))","v":2020},"dms_FRCP_y4",{"$f":"IF(dms_RPT=\"financial\",VALUE(LEFT(dms_CRCP_yX,4)-1)&\"-\"&TEXT(VALUE(MID(dms_CRCP_yX,3,2)),\"00\"),VALUE(LEFT(dms_CRCP_yX,4)-1))","v":2013},"dms_CRCP_yW",4,null,null,{"$f":"VALUE(LEFT(dms_CRYf_y3,4)+1)&\"-\"&TEXT(MID(dms_CRYf_y3,3,2)+2,\"00\")","v":"2020-21"},"dms_CRYf_y4",{"$f":"VALUE(LEFT(dms_CRYc_y3,4)+1)","v":2021},"dms_CRYc_y4"]
[null,5,"dms_FRCP_y5",5,"CRCP_y5",{"$f":"IF(dms_RPT=\"financial\",VALUE(LEFT(dms_FRCP_y4,4)+1)&\"-\"&TEXT(VALUE(RIGHT(dms_FRCP_y4,2)+1),\"00\"),VALUE(LEFT(dms_FRCP_y4,4)+1))","v":2021},"dms_FRCP_y5",{"$f":"IF(dms_RPT=\"financial\",VALUE(LEFT(dms_CRCP_yW,4)-1)&\"-\"&TEXT(VALUE(MID(dms_CRCP_yW,3,2)),\"00\"),VALUE(LEFT(dms_CRCP_yW,4)-1))","v":2012},"dms_CRCP_yV",5,null,null,{"$f":"VALUE(LEFT(dms_CRYf_y4,4)+1)&\"-\"&TEXT(MID(dms_CRYf_y4,3,2)+2,\"00\")","v":"2021-22"},"dms_CRYf_y5",{"$f":"VALUE(LEFT(dms_CRYc_y4,4)+1)","v":2022},"dms_CRYc_y5"]
[null,6,"dms_FRCP_y6",6,"CRCP_y6",{"$f":"IF(dms_RPT=\"financial\",VALUE(LEFT(dms_FRCP_y5,4)+1)&\"-\"&TEXT(VALUE(RIGHT(dms_FRCP_y5,2)+1),\"00\"),VALUE(LEFT(dms_FRCP_y5,4)+1))","v":2022},"dms_FRCP_y6",{"$f":"IF(dms_RPT=\"financial\",VALUE(LEFT(dms_CRCP_yV,4)-1)&\"-\"&TEXT(VALUE(MID(dms_CRCP_yV,3,2)),\"00\"),VALUE(LEFT(dms_CRCP_yV,4)-1))","v":2011},"dms_CRCP_yU",6,null,null,{"$f":"VALUE(LEFT(dms_CRYf_y5,4)+1)&\"-\"&TEXT(MID(dms_CRYf_y5,3,2)+2,\"00\")","v":"2022-23"},"dms_CRYf_y6",{"$f":"VALUE(LEFT(dms_CRYc_y5,4)+1)","v":2023},"dms_CRYc_y6"]
[null,7,"dms_FRCP_y7",7,"CRCP_y7",{"$f":"IF(dms_RPT=\"financial\",VALUE(LEFT(dms_FRCP_y6,4)+1)&\"-\"&TEXT(VALUE(RIGHT(dms_FRCP_y6,2)+1),\"00\"),VALUE(LEFT(dms_FRCP_y6,4)+1))","v":2023},"dms_FRCP_y7",{"$f":"IF(dms_RPT=\"financial\",VALUE(LEFT(dms_CRCP_yU,4)-1)&\"-\"&TEXT(VALUE(MID(dms_CRCP_yU,3,2)),\"00\"),VALUE(LEFT(dms_CRCP_yU,4)-1))","v":2010},"dms_CRCP_yT",7,null,null,{"$f":"VALUE(LEFT(dms_CRYf_y6,4)+1)&\"-\"&TEXT(MID(dms_CRYf_y6,3,2)+2,\"00\")","v":"2023-24"},"dms_CRYf_y7",{"$f":"VALUE(LEFT(dms_CRYc_y6,4)+1)","v":2024},"dms_CRYc_y7"]
[null,8,"dms_FRCP_y8",8,"CRCP_y8",{"$f":"IF(dms_RPT=\"financial\",VALUE(LEFT(dms_FRCP_y7,4)+1)&\"-\"&TEXT(VALUE(RIGHT(dms_FRCP_y7,2)+1),\"00\"),VALUE(LEFT(dms_FRCP_y7,4)+1))","v":2024},"dms_FRCP_y8",{"$f":"IF(dms_RPT=\"financial\",VALUE(LEFT(dms_CRCP_yT,4)-1)&\"-\"&TEXT(VALUE(MID(dms_CRCP_yT,3,2)),\"00\"),VALUE(LEFT(dms_CRCP_yT,4)-1))","v":2009},"dms_CRCP_yS",8,null,null,{"$f":"VALUE(LEFT(dms_CRYf_y7,4)+1)&\"-\"&TEXT(MID(dms_CRYf_y7,3,2)+2,\"00\")","v":"2024-25"},"dms_CRYf_y8",{"$f":"VALUE(LEFT(dms_CRYc_y7,4)+1)","v":2025},"dms_CRYc_y8"]
[null,9,"dms_FRCP_y9",9,"CRCP_y9",{"$f":"IF(dms_RPT=\"financial\",VALUE(LEFT(dms_FRCP_y8,4)+1)&\"-\"&TEXT(VALUE(RIGHT(dms_FRCP_y8,2)+1),\"00\"),VALUE(LEFT(dms_FRCP_y8,4)+1))","v":2025},"dms_FRCP_y9",{"$f":"IF(dms_RPT=\"financial\",VALUE(LEFT(dms_CRCP_yS,4)-1)&\"-\"&TEXT(VALUE(MID(dms_CRCP_yS,3,2)),\"00\"),VALUE(LEFT(dms_CRCP_yS,4)-1))","v":2008},"dms_CRCP_yR",9,null,null,{"$f":"VALUE(LEFT(dms_CRYf_y8,4)+1)&\"-\"&TEXT(MID(dms_CRYf_y8,3,2)+2,\"00\")","v":"2025-26"},"dms_CRYf_y9",{"$f":"VALUE(LEFT(dms_CRYc_y8,4)+1)","v":2026},"dms_CRYc_y9"]
[null,10,"dms_FRCP_y10",10,"CRCP_y10",{"$f":"IF(dms_RPT=\"financial\",VALUE(LEFT(dms_FRCP_y9,4)+1)&\"-\"&TEXT(VALUE(RIGHT(dms_FRCP_y9,2)+1),\"00\"),VALUE(LEFT(dms_FRCP_y9,4)+1))","v":2026},"dms_FRCP_y10",{"$f":"IF(dms_RPT=\"financial\",VALUE(LEFT(dms_CRCP_yR,4)-1)&\"-\"&TEXT(VALUE(MID(dms_CRCP_yR,3,2)),\"00\"),VALUE(LEFT(dms_CRCP_yR,4)-1))","v":2007},"dms_CRCP_yQ",10,null,null,{"$f":"VALUE(LEFT(dms_CRYf_y9,4)+1)&\"-\"&TEXT(MID(dms_CRYf_y9,3,2)+2,\"00\")","v":"2026-27"},"dms_CRYf_y10",{"$f":"VALUE(LEFT(dms_CRYc_y9,4)+1)","v":2027},"dms_CRYc_y10"]
[null,11,"dms_FRCP_y11",11,"CRCP_y11",{"$f":"IF(dms_RPT=\"financial\",VALUE(LEFT(dms_FRCP_y10,4)+1)&\"-\"&TEXT(VALUE(RIGHT(dms_FRCP_y10,2)+1),\"00\"),VALUE(LEFT(dms_FRCP_y10,4)+1))","v":2027},"dms_FRCP_y11",{"$f":"IF(dms_RPT=\"financial\",VALUE(LEFT(dms_CRCP_yQ,4)-1)&\"-\"&TEXT(VALUE(MID(dms_CRCP_yQ,3,2)),\"00\"),VALUE(LEFT(dms_CRCP_yQ,4)-1))","v":2006},"dms_CRCP_yP",11,null,null,{"$f":"VALUE(LEFT(dms_CRYf_y10,4)+1)&\"-\"&TEXT(MID(dms_CRYf_y10,3,2)+2,\"00\")","v":"2027-28"},"dms_CRYf_y11",{"$f":"VALUE(LEFT(dms_CRYc_y10,4)+1)","v":2028},"dms_CRYc_y11"]
[null,12,"dms_FRCP_y12",12,"CRCP_y12",{"$f":"IF(dms_RPT=\"financial\",VALUE(LEFT(dms_FRCP_y11,4)+1)&\"-\"&TEXT(VALUE(RIGHT(dms_FRCP_y11,2)+1),\"00\"),VALUE(LEFT(dms_FRCP_y11,4)+1))","v":2028},"dms_FRCP_y12",{"$f":"IF(dms_RPT=\"financial\",VALUE(LEFT(dms_CRCP_yP,4)-1)&\"-\"&TEXT(VALUE(MID(dms_CRCP_yP,3,2)),\"00\"),VALUE(LEFT(dms_CRCP_yP,4)-1))","v":2005},"dms_CRCP_yO",12,null,null,{"$f":"VALUE(LEFT(dms_CRYf_y11,4)+1)&\"-\"&TEXT(MID(dms_CRYf_y11,3,2)+2,\"00\")","v":"2028-29"},"dms_CRYf_y12",{"$f":"VALUE(LEFT(dms_CRYc_y11,4)+1)","v":2029},"dms_CRYc_y12"]
[null,13,"dms_FRCP_y13",13,"CRCP_y13",{"$f":"IF(dms_RPT=\"financial\",VALUE(LEFT(dms_FRCP_y12,4)+1)&\"-\"&TEXT(VALUE(RIGHT(dms_FRCP_y12,2)+1),\"00\"),VALUE(LEFT(dms_FRCP_y12,4)+1))","v":2029},"dms_FRCP_y13",{"$f":"IF(dms_RPT=\"financial\",VALUE(LEFT(dms_CRCP_yO,4)-1)&\"-\"&TEXT(VALUE(MID(dms_CRCP_yO,3,2)),\"00\"),VALUE(LEFT(dms_CRCP_yO,4)-1))","v":2004},"dms_CRCP_yN",13,null,null,{"$f":"VALUE(LEFT(dms_CRYf_y12,4)+1)&\"-\"&TEXT(MID(dms_CRYf_y12,3,2)+2,\"00\")","v":"2029-30"},"dms_CRYf_y13",{"$f":"VALUE(LEFT(dms_CRYc_y12,4)+1)","v":2030},"dms_CRYc_y13"]
[null,14,"dms_FRCP_y14",14,"CRCP_y14",{"$f":"IF(dms_RPT=\"financial\",VALUE(LEFT(dms_FRCP_y13,4)+1)&\"-\"&TEXT(VALUE(RIGHT(dms_FRCP_y13,2)+1),\"00\"),VALUE(LEFT(dms_FRCP_y13,4)+1))","v":2030},"dms_FRCP_y14",{"$f":"IF(dms_RPT=\"financial\",VALUE(LEFT(dms_CRCP_yN,4)-1)&\"-\"&TEXT(VALUE(MID(dms_CRCP_yN,3,2)),\"00\"),VALUE(LEFT(dms_CRCP_yN,4)-1))","v":2003},"dms_CRCP_yM",14,null,null,{"$f":"VALUE(LEFT(dms_CRYf_y13,4)+1)&\"-\"&TEXT(MID(dms_CRYf_y13,3,2)+2,\"00\")","v":"2030-31"},"dms_CRYf_y14",{"$f":"VALUE(LEFT(dms_CRYc_y13,4)+1)","v":2031},"dms_CRYc_y14"]
[null,15,"dms_FRCP_y15",15,"CRCP_y15",{"$f":"IF(dms_RPT=\"financial\",VALUE(LEFT(dms_FRCP_y14,4)+1)&\"-\"&TEXT(VALUE(RIGHT(dms_FRCP_y14,2)+1),\"00\"),VALUE(LEFT(dms_FRCP_y14,4)+1))","v":2031},"dms_FRCP_y15",{"$f":"IF(dms_RPT=\"financial\",VALUE(LEFT(dms_CRCP_yM,4)-1)&\"-\"&TEXT(VALUE(MID(dms_CRCP_yM,3,2)),\"00\"),VALUE(LEFT(dms_CRCP_yM,4)-1))","v":2002},"dms_CRCP_yL",15,null,null,{"$f":"VALUE(LEFT(dms_CRYf_y14,4)+1)&\"-\"&TEXT(MID(dms_CRYf_y14,3,2)+2,\"00\")","v":"2031-32"},"dms_CRYf_y15",{"$f":"VALUE(LEFT(dms_CRYc_y14,4)+1)","v":2032},"dms_CRYc_y15"]
[null,null,null,null,null,null,null,null,null,null,null,null,{"$f":"VALUE(LEFT(dms_CRYf_y15,4)+1)&\"-\"&TEXT(MID(dms_CRYf_y15,3,2)+2,\"00\")","v":"2032-33"},"dms_CRYf_y16",{"$f":"VALUE(LEFT(dms_CRYc_y15,4)+1)","v":2033},"dms_CRYc_y16"]
[null,"These are drop down lists for businesses to select the correct FRCP_y1 on the business and other details worksheet.\nThis also populates the column headings in the worksheets",null,null,null,null,null,null,null,null,null,null,{"$f":"VALUE(LEFT(dms_CRYf_y16,4)+1)&\"-\"&TEXT(MID(dms_CRYf_y16,3,2)+2,\"00\")","v":"2033-34"},"dms_CRYf_y17",{"$f":"VALUE(LEFT(dms_CRYc_y16,4)+1)","v":2034},"dms_CRYc_y17"]
[null,"dms_RCP_fyear_list","dms_CRY_ListF","dms_CRY_ListC","dms_RCP_cyear_list","dms_FRCP_fyear_list","dms_FRCP_ListF","dms_FRCP_ListC","dms_FRCP_cyear_list",null,null,null,{"$f":"VALUE(LEFT(dms_CRYf_y17,4)+1)&\"-\"&TEXT(MID(dms_CRYf_y17,3,2)+2,\"00\")","v":"2034-35"},"dms_CRYf_y18",{"$f":"VALUE(LEFT(dms_CRYc_y17,4)+1)","v":2035},"dms_CRYc_y18"]
[null,"dms_fy1","2006-07",2007,"dms_cy1","dms_frcp_fy1","2016-17","2017","dms_crcp_cy1",null,null,null,{"$f":"VALUE(LEFT(dms_CRYf_y18,4)+1)&\"-\"&TEXT(MID(dms_CRYf_y18,3,2)+2,\"00\")","v":"2035-36"},"dms_CRYf_y19",{"$f":"VALUE(LEFT(dms_CRYc_y18,4)+1)","v":2036},"dms_CRYc_y19"]
[null,"dms_fy2","2007-08","2008","dms_cy2","dms_frcp_fy2","2017-18","2018","dms_crcp_cy2",null,null,null,{"$f":"VALUE(LEFT(dms_CRYf_y19,4)+1)&\"-\"&TEXT(MID(dms_CRYf_y19,3,2)+2,\"00\")","v":"2036-37"},"dms_CRYf_y20",{"$f":"VALUE(LEFT(dms_CRYc_y19,4)+1)","v":2037},"dms_CRYc_y20"]
[null,"dms_fy3","2008-09","2009","dms_cy3","dms_frcp_fy3","2018-19","2019","dms_crcp_cy3"]
[null,"dms_fy4","2009-10","2010","dms_cy4","dms_frcp_fy4","2019-20","2020","dms_crcp_cy4"]
[null,"dms_fy5","2010-11","2011","dms_cy5","dms_frcp_fy5","2020-21","2021","dms_crcp_cy5"]
[null,"dms_fy6","2011-12","2012","dms_cy6","dms_frcp_fy6","2021-22","2022","dms_crcp_cy6"]
[null,"dms_fy7","2012-13","2013","dms_cy7","dms_frcp_fy7","2022-23","2023","dms_crcp_cy7"]
[null,"dms_fy8","2013-14","2014","dms_cy8","dms_frcp_fy8","2023-24","2024","dms_crcp_cy8"]
[null,"dms_fy9","2014-15","2015","dms_cy9","dms_frcp_fy9","2024-25","2025","dms_crcp_cy9"]
[null,"dms_fy10","2015-16","2016","dms_cy10","dms_frcp_fy10","2025-26","2026","dms_crcp_cy10"]
[null,"dms_fy11","2016-17","2017","dms_cy11","dms_frcp_fy11","2026-27","2027","dms_crcp_cy11"]
[null,"dms_fy12","2017-18","2018","dms_cy12","dms_frcp_fy12","2027-28","2028","dms_crcp_cy12"]
[null,"dms_fy13","2018-19",2019,"dms_cy13","dms_frcp_fy13","2028-29","2029","dms_crcp_cy13"]
[null,"dms_fy14","2019-20","2020","dms_cy14","dms_frcp_fy14","2029-30","2030","dms_crcp_cy14"]
[null,"dms_fy15","2019-20","2020","dms_cy15","dms_frcp_fy15","2030-31","2031","dms_crcp_cy15"]
[null,"dms_fy16","2020-21","2021","dms_cy16"]
[null,"dms_fy17","2021-22","2022","dms_cy17"]
[null,"dms_fy18","2022-23","2023","dms_cy18"]
[null,"dms_fy19","2023-24","2024","dms_cy19"]
[null,"dms_fy20","2024-25","2025","dms_cy20"]

{"sheet":"Instructions","index":1,"n_rows":27,"n_cols":4,"rows_kept":27,"cut":false,"hidden":false,"merged":[[7,2,7,3],[1,1,1,5],[2,1,2,5],[3,2,3,4],[4,2,4,4],[5,2,5,4],[24,2,24,4],[25,2,25,3],[26,2,26,4],[8,2,8,4],[10,2,10,4],[12,2,12,4],[20,2,20,4],[22,2,22,4]]}
[]
[null,"Distribution Network Service Provider"]
[null,"Annual Reporting RIN"]
[null,null,"This template is to be used by AusNet (D) to fulfil its reporting obligations to the AER."]
[null,null,"INSTRUCTIONS"]
[null,null,"Complete the Business & other details worksheet before entering data or values in any other worksheets. The Business & other details worksheet is linked to other worksheets within the workbook and automatically generates certain column headings and conditional formatting."]
[]
[null,null,"Identifying CONFIDENTIAL INFORMATION:\n\nPlease use the macro at the top of each \nworksheet to identify confidential information. \n\n"]
[null,null,"-Do this by selecting the cell or cells that contain confidential information and then run the Mark selected cells as CONFIDENTIAL macro. This will format the cells a specific colour that is identified by the AER's database which in turn marks that information as confidential.\n\n-To reverse this, select the cell or cells and run the Return cells to NON-CONFIDENTIAL macro."]
[]
[null,null,"UNITS OF MEASURE\n\nAll amounts are to be unrounded and reported on a one for one basis: that is 1000 is to be entered as '1000'. Applicable units of measure may be identified in the table column headings or row descriptors.\n\n"]
[]
[null,null,"COLOUR CODING OF INPUT / NON-INPUT CELLS:"]
[null,null,null,"Yellow = Input cell (mandatory)"]
[null,null,null,"Darker yellow = input cell (mandatory)"]
[null,null,null,"Orange = input cell (if data available)"]
[null,null,null,"Grey = Not applicable/No inputs required"]
[null,null,null," \nPLEASE DO NOT ENTER TEXT into cells that are to contain numeric data."]
[]
[]
[null,null,"WORKSHEET NAVIGATION\n\nMany tables in the worksheets have been \"grouped\" to allow for easy navigation. To ungroup or group data use the outline symbols in the left margin (for Row groupings) or above the columns (for column groupings). \n\n\n\n"]
[]
[null,null,"RETURNING COMPLETED RESPONSES\n\nPlease return two (2) files to the AER: \n1. A confidential version which must contain a complete set of all responses with confidential information marked using the Mark selection CONFIDENTIAL macro and which has been completed using the locked template file provided by the AER. \n\n2. A public version with confidential information either removed completely or aggregated in some form together with writtten consent to disclose the public version of the response.\n\nUse the drop down box on the Business and other details worksheet to identify the file as either confidential ('consolidated') or public. "]
[]
[null,null,"SUBMITTING AMENDED DATA TO THE AER\n\nIf an NSP wishes to correct data previously submitted to the AER it should resubmit that data using the original completed submission as the starting point. Please make any necessary changes to the data. Data that is not being amended should be left unchanged. \n\nNSPs must identify the reason for the amendments in the Amendment Reason box on the  Business and other details worksheet. NSPs may provide further details regarding any amendments in the Amendments worksheet. \n\n."]
[null,null,"NSP may use Amended Data macro \nto highlight cells that contain amended data.\nNB: if data is also CONFIDENTIAL, re-apply \nthe Confidentiality macro after applying the \nAmended macro"]
[null,null,"Please resubmit two (2) files - a confidential version and a public version of the amended submission to the AER"]

{"sheet":"Contents","index":2,"n_rows":31,"n_cols":4,"rows_kept":31,"cut":false,"hidden":false,"merged":[[2,1,2,3],[3,1,3,3],[4,1,4,3]]}
[]
[]
[null,"Distribution Network Service Provider"]
[null,"Annual Reporting RIN Template"]
[null,"Table of Contents"]
[]
[]
[null,null,"Instructions"]
[null,null,"Business & other details"]
[]
[]
[null,"CATEGORY ANALYSIS","STPIS","STATUTORY ACCOUNTS"]
[]
[null,"2.11 Labour","6.2 STPIS Reliability","8.1 Income"]
[null,null,"6.6 STPIS Customer Service","8.2 Capex"]
[null,null,"6.7 STPIS Daily Performance"]
[null,null,"6.8 STPIS Exclusions","8.4 Opex"]
[null,null,"6.9 STPIS GSL"]
[]
[]
[]
[null,"NETWORK PERFORMANCE","OTHER INFORMATION","PRICING PROPOSAL"]
[null,null,null,"Victorian Businesses Only"]
[null,"3.6 Quality of services","7.8 Avoided Cost Payments"]
[null,"3.6.8 Network-feeders","7.10 Juris Scheme","9.5 TUoS"]
[null,"3.6.9 Network-reliability","7.11 DMIS-DMIA"]
[null,null,"7.12 Safety and Bushfire"]
[null,null,"7.13 TARC"]
[null,"PUBLIC LIGHTING"]
[]
[null,"4.1 Public lighting tariffs"]

{"sheet":"Business & other details","index":3,"n_rows":90,"n_cols":12,"rows_kept":90,"cut":false,"hidden":false,"merged":[[7,1,7,8],[11,1,11,8],[13,2,13,4],[14,2,14,4],[17,2,17,3],[17,4,17,7],[84,4,84,8],[18,4,18,7],[19,2,19,3],[19,4,19,7],[22,2,22,3],[22,4,22,7],[23,4,23,7],[24,2,24,3],[24,4,24,7],[32,1,32,8],[51,2,51,3],[53,2,53,8]]}
[null,{"$f":"IF(dms_DataQuality=\"backcast\",INDEX(dms_Worksheet_List,MATCH(dms_Model,dms_Model_List))&\" BACKCAST\",INDEX(dms_Worksheet_List,MATCH(dms_Model,dms_Model_List)))","v":"ANNUAL REPORTING STATEMENT"}]
[null,{"$f":"INDEX(dms_TradingNameFull_List,MATCH(dms_TradingName,dms_TradingName_List))","v":"AusNet Services (D)"}]
[null,{"$f":"IF(SUM(dms_SingleYear_Model)>0,CRY,CONCATENATE(FRCP_y1,\" to \",dms_MultiYear_FinalYear_Result))","v":"2017"}]
[null,"BUSINESS & OTHER DETAILS"]
[]
[]
[null,"Instructions"]
[null,"Complete the following business details regulatory template before entering data or values in any other regulatory template. This regulatory template is linked to other cells within the spreadsheet and automatically generates column headings and conditional formatting to distinguish business specific input and non-input cells. "]
[]
[null,"SUBMISSION PARTICULARS INPUT SHEETS"]
[]
[null,"ENTITY DETAILS"]
[]
[null,"Short name","AusNet (D)",null,null,"Select business name from drop down list first"]
[null,"ACN / ABN",{"$f":"INDEX(dms_ABN_List,MATCH(dms_TradingName,dms_TradingName_List))","v":91064651118}]
[]
[]
[null,"Business address","Address 1",null,{"$f":"INDEX(dms_Addr1_List,MATCH(dms_TradingName,dms_TradingName_List))","v":"Level 32"}]
[null,null,null,"Address 2",{"$f":"IF(ISBLANK(INDEX(dms_Addr2_List,MATCH(dms_TradingName,dms_TradingName_List))),\"\",INDEX(dms_Addr2_List,MATCH(dms_TradingName,dms_TradingName_List)))","v":"2 Southbank Boulevard"}]
[null,null,"Suburb",null,{"$f":"INDEX(dms_Suburb_List,MATCH(dms_TradingName,dms_TradingName_List))","v":"SOUTHBANK"}]
[null,null,null,"State",{"$f":"INDEX(dms_State_List,MATCH(dms_TradingName,dms_TradingName_List))","v":"Vic"},"p/code",{"$f":"INDEX(dms_PostCode_List,MATCH(dms_TradingName,dms_TradingName_List))","v":"3006"}]
[]
[null,"Postal address","Address 1",null,{"$f":"INDEX(dms_PAddr1_List,MATCH(dms_TradingName,dms_TradingName_List))","v":"Locked Bag 14051"}]
[null,null,null,"Address 2",{"$f":"IF(ISBLANK(INDEX(dms_PAddr2_List,MATCH(dms_TradingName,dms_TradingName_List))),\"\",INDEX(dms_PAddr2_List,MATCH(dms_TradingName,dms_TradingName_List)))","v":""}]
[null,null,"Suburb",null,{"$f":"INDEX(dms_PSuburb_List,MATCH(dms_TradingName,dms_TradingName_List))","v":"MELBOURNE CITY MAIL CENTRE"}]
[null,null,null,"State",{"$f":"INDEX(dms_PState_List,MATCH(dms_TradingName,dms_TradingName_List))","v":"VIC"},"p/code",{"$f":"INDEX(dms_PPostCode_List,MATCH(dms_TradingName,dms_TradingName_List))","v":8001}]
[]
[]
[null,"Contact name/s","Clare Thompson"]
[null,"Contact phone/s"]
[null,"Contact email address/s"]
[]
[null,"REGULATORY CONTROL PERIODS"]
[]
[null,"Forthcoming regulatory control period","2017-18",{"$f":"dms_FRCP_y2","v":2018},{"$f":"dms_FRCP_y3","v":2019},{"$f":"dms_FRCP_y4","v":2020},{"$f":"dms_FRCP_y5","v":2021},{"$f":"dms_FRCP_y6","v":2022},{"$f":"dms_FRCP_y7","v":2023},{"$f":"dms_FRCP_y8","v":2024},{"$f":"dms_FRCP_y9","v":2025},{"$f":"dms_FRCP_y10","v":2026}]
[]
[]
[null,"Current regulatory control period",{"$f":"dms_CRCP_FirstYear_Result","v":2012},{"$f":"IF(dms_RPT=\"financial\",VALUE(LEFT(CRCP_y1,4)+1)&\"-\"&TEXT(MID(CRCP_y1,3,2)+2,\"00\"),VALUE(LEFT(CRCP_y1,4)+1))","v":2013},{"$f":"IF(dms_RPT=\"financial\",VALUE(LEFT(CRCP_y2,4)+1)&\"-\"&TEXT(VALUE(MID(CRCP_y2,3,2)+2),\"00\"),VALUE(LEFT(CRCP_y2,4)+1))","v":2014},{"$f":"IF(dms_RPT=\"financial\",VALUE(LEFT(CRCP_y3,4)+1)&\"-\"&TEXT(VALUE(MID(CRCP_y3,3,2)+2),\"00\"),VALUE(LEFT(CRCP_y3,4)+1))","v":2015},{"$f":"IF(dms_RPT=\"financial\",VALUE(LEFT(CRCP_y4,4)+1)&\"-\"&TEXT(VALUE(MID(CRCP_y4,3,2)+2),\"00\"),VALUE(LEFT(CRCP_y4,4)+1))","v":2016},{"$f":"IF(dms_RPT=\"financial\",VALUE(LEFT(CRCP_y5,4)+1)&\"-\"&TEXT(VALUE(MID(CRCP_y5,3,2)+2),\"00\"),VALUE(LEFT(CRCP_y5,4)+1))","v":2017},{"$f":"IF(dms_RPT=\"financial\",VALUE(LEFT(CRCP_y6,4)+1)&\"-\"&TEXT(VALUE(MID(CRCP_y6,3,2)+2),\"00\"),VALUE(LEFT(CRCP_y6,4)+1))","v":2018},{"$f":"IF(dms_RPT=\"financial\",VALUE(LEFT(CRCP_y7,4)+1)&\"-\"&TEXT(VALUE(MID(CRCP_y7,3,2)+2),\"00\"),VALUE(LEFT(CRCP_y7,4)+1))","v":2019},{"$f":"IF(dms_RPT=\"financial\",VALUE(LEFT(CRCP_y8,4)+1)&\"-\"&TEXT(VALUE(MID(CRCP_y8,3,2)+2),\"00\"),VALUE(LEFT(CRCP_y8,4)+1))","v":2020},{"$f":"IF(dms_RPT=\"financial\",VALUE(LEFT(CRCP_y9,4)+1)&\"-\"&TEXT(VALUE(MID(CRCP_y9,3,2)+2),\"00\"),VALUE(LEFT(CRCP_y9,4)+1))","v":2021}]
[]
[]
[null,"Previous regulatory control period",{"$f":"IF(dms_RPT=\"financial\",VALUE(LEFT(PRCP_y2,4)-1)&\"-\"&TEXT(VALUE(MID(PRCP_y2,3,2)),\"00\"),VALUE(LEFT(PRCP_y2,4)-1))","v":2007},{"$f":"IF(dms_RPT=\"financial\",VALUE(LEFT(PRCP_y3,4)-1)&\"-\"&TEXT(VALUE(MID(PRCP_y3,3,2)),\"00\"),VALUE(LEFT(PRCP_y3,4)-1))","v":2008},{"$f":"IF(dms_RPT=\"financial\",VALUE(LEFT(PRCP_y4,4)-1)&\"-\"&TEXT(VALUE(MID(PRCP_y4,3,2)),\"00\"),VALUE(LEFT(PRCP_y4,4)-1))","v":2009},{"$f":"IF(dms_RPT=\"financial\",VALUE(LEFT(PRCP_y5,4)-1)&\"-\"&TEXT(VALUE(RIGHT(PRCP_y5,2)-1),\"00\"),VALUE(LEFT(PRCP_y5,4)-1))","v":2010},{"$f":"IF(dms_RPT=\"financial\",VALUE(LEFT(CRCP_y1,4)-1)&\"-\"&TEXT(VALUE(RIGHT(CRCP_y1,2)-1),\"00\"),VALUE(LEFT(CRCP_y1,4)-1))","v":2011}]
[]
[]
[null,"Commencing regulatory year","2017","CRY"]
[]
[null,"Last completed regulatory year","2021-22","dms_FinalYear"]
[]
[]
[]
[]
[]
[null,"Source","Reporting",null,"Please select the correct submission type from the dropdown list."]
[null,"Data quality (actual, estimate, public, consolidated)","Consolidated"]
[null,"Amended RIN submission - amendment reason","Correction to Capex Movement in Provisions"]
[null,"Submission Date","19/12/20118","dms_SubmissionDate","Please enter date this file submitted to AER (dd/mm/yyyy)"]
[null,"EBSS - First application of scheme in forthcoming period?","No"]
[null,"Sector",{"$f":"INDEX(dms_Sector_List,MATCH(dms_TradingName,dms_TradingName_List))","v":"Electricity"},"dms_Sector","=INDEX(dms_Sector_List,MATCH(dms_TradingName,dms_TradingName_List))"]
[null,"Segment",{"$f":"INDEX(dms_Segment_List,MATCH(dms_TradingName,dms_TradingName_List))","v":"Distribution"},"dms_Segment","=INDEX(dms_Segment_List,MATCH(dms_TradingName,dms_TradingName_List))"]
[null,"Regulatory Year Ending",{"$f":"IF(dms_MultiYear_Flag=1,LEFT(dms_Specified_FinalYear,2)&RIGHT(dms_Specified_FinalYear,2),INDEX(dms_RYE_Formula_Result,MATCH(dms_Model,dms_Model_List)))","v":"2017"},"dms_RYE","=IF(dms_MultiYear_Flag=1,LEFT(dms_Specified_FinalYear,2)&RIGHT(dms_Specified_FinalYear,2),INDEX(dms_RYE_Formula_Result,MATCH(dms_Model,dms_Model_List)))"]
[null,"Reporting Period Type",{"$f":"INDEX(dms_RPT_List,MATCH(dms_TradingName,dms_TradingName_List))","v":"Calendar"},"dms_RPT","=INDEX(dms_RPT_List,MATCH(dms_TradingName,dms_TradingName_List))"]
[null,"Model or RIN Type","ARR","dms_Model","Drop down selection"]
[null,"Security Classification","Public","dms_Classification","Always Public"]
[null,"Template - version no.",5,"dms_TemplateNumber"]
[null,"Dollar $ real month",{"$f":"INDEX(dms_RPTMonth_List,MATCH(dms_TradingName,dms_TradingName_List))","v":"December"},"dms_RPTMonth","=INDEX(dms_RPTMonth_List,MATCH(dms_TradingName,dms_TradingName_List))"]
[null,"Dollar $ real  (the last month before the FRCP_y1)",{"$f":"CONCATENATE(dms_RPTMonth)&\" \"&VALUE((LEFT(dms_CRCP_FinalYear_Result,2)&RIGHT(dms_CRCP_FinalYear_Result,2)))","v":"December 2017"},"dms_DollarReal","=IF(SUM(dms_SingleYear_Model)>0,CONCATENATE(dms_RPTMonth)&\" \"&VALUE((LEFT(CRY,2))&RIGHT(CRY,2)),CONCATENATE(dms_RPTMonth)&\" \"&VALUE((LEFT(dms_CRCP_FinalYear_Result,2)&RIGHT(dms_CRCP_FinalYear_Result,2))))"]
[null,"Form of control",{"$f":"INDEX(dms_FormControl_List,MATCH(dms_TradingName,dms_TradingName_List))","v":"Revenue cap"},"dms_FormControl","=INDEX(dms_FormControl_List,MATCH(dms_TradingName,dms_TradingName_List))"]
[null,"RIN response - version no.",1,"dms_RINversion"]
[null,"Jurisdiction",{"$f":"INDEX(dms_JurisdictionList,MATCH(dms_TradingName,dms_TradingName_List))","v":"Vic"},"dms_Jurisdiction","=INDEX(dms_JurisdictionList,MATCH(dms_TradingName,dms_TradingName_List))"]
[null,"Backcast Multiyear EB, CA or ARR?",0,"dms_MultiYear_Flag","1=y, 0-n"]
[null,null,2013,"dms_Specified_FinalYear","The result here is returned to dms_CRCP_FinalYear_Result if dms_MultiYear_Flag is set to 1"]
[null,"Single Year Model T/F",{"$f":"IF(dms_Model=\"EB\",1,0)","v":0},"dms_EB"]
[null,null,{"$f":"IF(dms_Model=\"CA\",1,0)","v":0},"dms_CA","=dms_SingleYear_Model"]
[null,null,{"$f":"IF(dms_Model=\"ARR\",1,0)","v":1},"dms_ARR"]
[null,"Single Year Final Year Reference","CRY","dms_SingleYear_FinalYear_Ref","This is the reference for EB, CA & ARR RINs"]
[null,"Single Year Final Year Result",{"$f":"INDIRECT(dms_SingleYear_FinalYear_Ref)","v":"2017"},"dms_SingleYear_FinalYear_Result","=INDIRECT(dms_SingleYear_FinalYear_Ref)",null,null,null,"Formula errors OK"]
[null,"FRCP length in years",{"$f":"INDEX(dms_FRCPlength_List,MATCH(dms_TradingName,dms_TradingName_List))","v":5},"dms_FRCPlength_Num","=INDEX(dms_FRCPlength_List,MATCH(dms_TradingName,dms_TradingName_List))"]
[null,"Multi Year Final Year Reference",{"$f":"INDEX(dms_FinalYear_List,MATCH(dms_FRCPlength_Num,dms_FRCPlength_Num_List))","v":"dms_FRCP_y5"},"dms_MultiYear_FinalYear_Ref","=INDEX(dms_FinalYear_List,MATCH(dms_FRCPlength_Num,dms_FRCPlength_Num_List))"]
[null,"Multi Year Final Year Result",{"$f":"IF(dms_MultiYear_Flag=0,INDIRECT(dms_MultiYear_FinalYear_Ref),dms_Specified_FinalYear)","v":2021},"dms_MultiYear_FinalYear_Result","=IF(dms_MultiYear_Flag=0,INDIRECT(dms_MultiYear_FinalYear_Ref),dms_Specified_FinalYear)",null,null,null,"Formula errors OK"]
[null,"CRCP length in years",{"$f":"INDEX(dms_CRCPlength_List,MATCH(dms_TradingName,dms_TradingName_List))","v":5},"dms_CRCPlength_Num","=INDEX(dms_CRCPlength_List,MATCH(dms_TradingName,dms_TradingName_List))"]
[null,"CRCP Final Year Reference",{"$f":"INDEX(dms_CFinalYear_List,MATCH(dms_CRCPlength_Num,dms_CRCPlength_Num_List))","v":"CRCP_y5"},"dms_CRCP_FinalYear_Ref","=INDEX(dms_CFinalYear_List,MATCH(dms_CRCPlength_Num,dms_CRCPlength_Num_List))"]
[null,"CRCP First Year Result",{"$f":"INDEX(dms_CRCP_years,MATCH(dms_CRCPlength_Num,dms_CRCP_index))","v":2012},"dms_CRCP_FirstYear_Result","=INDEX(dms_CRCP_years,MATCH(dms_CRCPlength_Num,dms_CRCP_index))"]
[null,"CRCP Final Year Result",{"$f":"IF(dms_MultiYear_Flag=0,(IF(SUM(dms_SingleYear_Model)>0,CRY,dms_CRCP_yZ)),dms_Specified_FinalYear)","v":"2017"},"dms_CRCP_FinalYear_Result","=IF(dms_MultiYear_Flag=0,(IF(SUM(dms_SingleYear_Model)>0,CRY,dms_CRCP_yZ)),dms_Specified_FinalYear)"]
[null,"Table 6.6.3 - Public lighting repair - no. business days",{"$f":"INDEX(dms_663_List,MATCH(dms_TradingName,dms_TradingName_List))","v":2},"dms_663"]
[null,"Distribution Determination Reference",{"$f":"INDEX(dms_DeterminationRef_List,MATCH(dms_TradingName,dms_TradingName_List))","v":"2016-20 Distribution Determination"},"dms_DeterminationRef"]
[null,"Backcast templates only - unit of measure ","$0s","dms_Backcast_UOM","If the cover sheet is for Backcast data ensure to apply dms_Backcast_UOM named range to this field. Otherwise, do not apply this named range."]
[null,"EB/CA Unit of Measure for Monetary Values","$0s","dms_dollar_nom_UOM","If the cover sheet is attached to an EB files make sure this field is set"]
[]
[null,"discard this record?","NO","dms_DISCARD","If record is to be discarded from DB set this flag to YES"]
[]
[null,"USES NAMED RANGES FLAG","yes","dms_Defined_Names_Used"]

{"sheet":"2.11 Labour","index":4,"n_rows":36,"n_cols":4,"rows_kept":36,"cut":false,"hidden":false,"merged":[]}
[null,"ANNUAL REPORTING STATEMENT"]
[null,"AusNet (D)"]
[null,"Annual Reporting RIN Response 2017"]
[null,"2.11 LABOUR "]
[]
[null,"Tables 2.11.1 and 2.11.2 deliberately omitted."]
[]
[null,"2.11.3 - LABOUR / NON-LABOUR EXPENDITURE SPLIT"]
[null,"2.11.3.1 - Opex"]
[null,null,"2017"]
[null,null,"$0's, nominal"]
[null,null,"Opex "]
[null,"In-house labour expenditure"]
[null,"Labour expenditure outsourced to related parties"]
[null,"Labour expenditure outsourced to unrelated parties"]
[null,"Controllable non-labour expenditure"]
[null,"Uncontrollable non-labour expenditure"]
[null,"Total",216729106.74238384]
[]
[null,"Reconciliation with Opex worksheets - SCS","Opex"]
[null,"Total including margins",216729106.74238384,"OK"]
[]
[]
[null,"2.11.3.2 - Capex"]
[null,null,"2017"]
[null,null,"$0's, nominal"]
[null,null,"Capex"]
[null,"In-house labour expenditure"]
[null,"Labour expenditure outsourced to related parties"]
[null,"Labour expenditure outsourced to unrelated parties"]
[null,"Controllable non-labour expenditure"]
[null,"Uncontrollable non-labour expenditure"]
[null,"Total",318943061.50614494]
[]
[null,"Reconciliation with Capex & Opex worksheets - SCS","Capex"]
[null,"Total including margins",318943061.50614494,"OK"]

{"sheet":"3.6 Quality of services","index":5,"n_rows":74,"n_cols":4,"rows_kept":74,"cut":false,"hidden":false,"merged":[]}
[null,"ANNUAL REPORTING STATEMENT"]
[null,"AusNet (D)"]
[null,"Annual Reporting RIN Response 2017"]
[null,"3.6 QUALITY OF SERVICES"]
[]
[null,"3.6.5 - QUALITY OF SUPPLY METRICS"]
[null,null,null,"Volume"]
[null,null,"Units","2017"]
[null,"Over voltage events - due to high voltage injection","number"]
[null,"Customers receiving over-voltage - due to high voltage injection","number"]
[null,"Over voltage events - due to lightning","number"]
[null,"Customers receiving over-voltage - due to lightning","number"]
[null,"Over voltage events - due to voltage regulation or other cause","number"]
[null,"Customers receiving over-voltage - due to voltage regulation or other cause","number"]
[null,"Voltage variations - steady state (zone sub)","number",663]
[null,"Voltage variations - one minute (zone sub)","number",327]
[null,"Voltage variations - 10 seconds (zone sub) Min<0.7","number",619]
[null,"Voltage variations - 10 seconds (zone sub) Min<0.8","number",901]
[null,"Voltage variations - 10 seconds (zone sub) Min<0.9","number",1953]
[null,"Voltage variations - steady state (feeder)","number",15389]
[null,"Voltage variations - % zone subs monitored","(per cent)",1]
[null,"Voltage variations - % feeders monitored","(per cent)",1]
[]
[null,"3.6.6 - COMPLAINTS - TECHNICAL QUALITY OF SUPPLY"]
[null,null,null,"Volume"]
[null,null,"Units","2017"]
[null,"3.6.6.1 - TECHNICAL QUALITY OF SUPPLY"]
[null,"Number of complaints - technical quality of supply","number",30]
[null,"3.6.6.2 - PERCENTAGE OF COMPLAINTS BY CATEGORY"]
[null,"Low voltage supply","(per cent)",10]
[null,"Voltage dips","(per cent)",10]
[null,"Voltage swell","(per cent)",30]
[null,"Voltage spike (impulsive transient)","(per cent)",3]
[null,"Waveform distortion","(per cent)",3]
[null,"TV or radio interference","(per cent)",6]
[null,"Solar related","(per cent)",14]
[null,"Noise from appliances","(per cent)",0]
[null,"Other","(per cent)",24]
[null,"3.6.6.3 - PERCENTAGE OF COMPLAINTS BY LIKELY CAUSE"]
[null,"Network equipment faulty","(per cent)",30]
[null,"Network interference by NSP equipment","(per cent)",0]
[null,"Network interference by another customer","(per cent)",0]
[null,"Network limitation","(per cent)",0]
[null,"Customer internal problem","(per cent)",24]
[null,"No problem identified","(per cent)",10]
[null,"Environmental","(per cent)",0]
[null,"Other","(per cent)",36]
[]
[]
[]
[null,"3.6.7 - CUSTOMER SERVICE METRICS"]
[null,null,null,"Volume"]
[null,null,"Unit","2017"]
[null,"3.6.7.1 - TIMELY PROVISIONS OF SERVICES"]
[null,"Number of connections made","number",18311]
[null,"Number of connections not made on or before agreed date","number",587]
[null,"3.6.7.2 - TIMELY REPAIR OF FAULTY STREET LIGHTS"]
[null,"Street lights - average monthly number \"out\"","number",6668]
[null,"Street lights - not repaired by \"fix by\" date","number",0]
[null,"Street lights - average number of days to repair","number",1.76]
[null,"Total number of street lights","number",151414]
[null,"3.6.7.3 - CALL CENTRE PERFORMANCE"]
[null,"Calls to call centre fault line","number",85073]
[null,"Calls to fault line answered within 30 seconds","number",72566]
[null,"Calls to fault line - average waiting time before call answered","number",22.91]
[null,"Call centre - number of overload events","number",2]
[null,"Percentage of calls abandoned","(per cent)",5.0380000000000001E-2]
[null,"3.6.7.4 - NUMBER OF CUSTOMER COMPLAINTS"]
[null,"Complaint - reliability of supply","number",131]
[null,"Complaint - technical quality of supply","number",39]
[null,"Complaint - administrative process or customer service","number",359]
[null,"Complaint - connection or augmentation","number",307]
[null,"Complaint - other","number",426]
[null,"Total number of complaints","number",1262]

{"sheet":"3.6.8 Network-feeders","index":6,"n_rows":369,"n_cols":23,"rows_kept":369,"cut":false,"hidden":false,"merged":[[10,10,10,14],[11,11,11,12],[11,13,11,14],[11,18,11,19],[11,15,12,15],[11,10,12,10],[10,15,10,19],[11,16,11,17],[5,6,5,8],[5,1,5,4],[11,8,12,8],[11,9,12,9],[11,20,12,20],[10,20,10,22],[11,21,11,22],[10,1,12,1],[10,2,12,2],[10,3,12,3],[10,4,12,4],[10,7,12,7],[11,5,12,5],[11,6,12,6],[10,5,10,6],[10,8,10,9]]}
[null,"ANNUAL REPORTING STATEMENT"]
[null,"AusNet (D)"]
[null,"Annual Reporting RIN Response 2017"]
[null,"3.6 QUALITY OF SERVICES"]
[]
[null,"Did the MAIFI parameter of the STPIS apply during the period?",null,null,null,"Yes","** IMPORTANT\nPlease ensure this question is answered correctly. Your response will affect other tables throughout this workbook and will determine which cells are grey and which are input cells. "]
[]
[]
[]
[null,"3.6.8 - NETWORK FEEDER RELIABILITY"]
[null,"Feeder ID / name","Description of the service area for the feeder","Feeder classification\n\n(drop down)","Number of distribution customers","Length of high voltage distribution lines",null,"Maximum demand\n(MVA)","Energy not supplied\n(MWh)",null,"Unplanned Outages",null,null,null,null,"Planned Outages",null,null,null,null,"Momentary feeder outages"]
[null,null,null,null,null,"Overhead","Underground",null,"Unplanned","Planned","Total number of unplanned outages","Unplanned customer minutes off-supply (SAIDI)",null,"Unplanned interruptions\n(SAIFI)",null,"Total number of planned outages","Planned customer minutes off-supply (SAIDI)",null,"Planned interruptions\n(SAIFI)",null,"Total number of momentary feeder outages","Momentary interruptions due to feeder outages (MAIFI)"]
[null,null,null,null,null,null,null,null,null,null,null,"Including excluded events and MEDs","After removing excluded events and MED","Including excluded events and MEDs","After removing excluded events and MED",null,"Including MEDs","After removing  MED","Including MEDs","After removing  MED",null,"Including excluded events and MEDs","After removing excluded events and MED"]
[null,"BDL2","East","RURAL SHORT",3821.5,32.019044939597002,3.3207798895300003,8.0020747309682125,1.4983340606529549,12.883709457272957,13,108056,108056,6794,6794,26,929140,910660,2744,2656,1,3570,3570]
[null,"BDL4","East","RURAL SHORT",2893,62.473775394008001,1.0679896059135001,8.5736514974659421,0.40147606617876819,1.7274352782717064,4,16676,16676,1047,1047,16,71752,71752,540,540,1,1058,1058]
[null,"BDL41","East","RURAL LONG",4093,399.58582588305001,3.8984862821749999,9.9073306192939778,2.8671216317636943,34.684395634985393,35,179930,179475,10315,10313,88,2176665,2176665,6205,6205,4,15700,15700]
[null,"BDL42","East","RURAL SHORT",2357.5,88.008189836971994,15.515548849427999,6.8589211979727542,14.191624199032141,30.636910398583424,18,616194,616194,18413,18413,36,1330241,1330241,3974,3974,2,7632,7632]
[null,"BDL43","East","URBAN",1880,17.022801687792001,2.0922715496416,11.050484152289437,0.91305488291764203,2.4216243779779827,3,27946,27946,1636,1636,12,74119,74119,256,256,0,0,0]
[null,"BDL44","East","RURAL LONG",2368,657.99229647293998,6.9604502540826001,6.8589211979727542,18.498551123609481,23.339476189299841,64,886580,876845,6601,6568,98,1118591,1118591,2768,2768,0,0,0]
[null,"BDL6","East","RURAL SHORT",3216.5,164.14412525482001,14.463696172985999,8.7260719685320041,3.2637024030805826,20.207625262745712,35,216771,216771,9052,9052,45,1342165,1342165,3724,3724,0,0,0]
[null,"BDL8","East","RURAL LONG",2064.5,583.85224205203008,3.8040973019226998,3.6580913055854691,8.0265622658318172,14.640518598859064,53,595370,595370,10443,10443,135,1085960,1085960,4790,4790,1,2049,2049]
[null,"BGE11","Central","RURAL SHORT",3146.5,47.660699335243002,15.118154738341,7.2018672578713918,22.952223497854881,8.2385074501852849,60,1257199,1245737,9971,9949,25,451261,451261,1883,1883,7,19093,19093]
[null,"BGE12","Central","RURAL SHORT",2254,96.281819302848007,5.5472722284351006,5.0679806629465345,10.670663110205716,17.858359498881089,37,587995,549206,4023,3589,26,984065,983925,2091,2090,6,13422,13422]
[null,"BGE21","Central","RURAL SHORT",16,7.7914286499559005,1.3091414708131002,7.6210235533030593E-2,0,0.45402457845764149,0,0,0,0,0,3,10269,10269,33,33,3,48,48]
[null,"BGE22","Central","RURAL SHORT",3275.5,80.751638863704997,21.325853127161,6.4778700203076003,9.1736792715102595,17.49270257728196,36,680800,679542,6488,6486,21,1298174,1298174,3954,3954,5,16266,16266]
[null,"BGE23","Central","URBAN",1858,18.713920588411,2.0226924140608,8.0020747309682125,7.4336965092956193,4.254307131002947,22,468663,468663,2830,2830,11,268216,268216,1502,1502,10,16932,16932]
[null,"BGE24","Central","RURAL SHORT",1550,24.781412818697,19.159399724050999,4.1153527187836518,41.570026068479365,37.347778213273443,50,1502173,1502173,8380,8380,34,1349598,1330968,3501,3420,11,14313,14313]
[null,"BM8B31","East","RURAL SHORT",126,134.96009809845,6.4828267463643998,0.46525080259906598,1.6047253805229522,1.0257433463884384,5,225306,225306,433,433,6,144016,144016,387,387,0,0,0]
[null,"BM8B32","East","RURAL SHORT",75.5,45.109784015976999,0,0.49569060877163712,0.63125271182316056,0.65095780838471962,3,55837,55837,142,142,3,57580,57580,142,142,0,0,0]
[null,"BM8B33","East","RURAL SHORT",22.5,14.484145472095999,0,0.67899056494663135,6.9645664801752188E-2,5.7351771804089478E-2,4,8237,8237,71,71,1,6783,6783,21,21,0,0,0]
[null,"BN1","North","RURAL LONG",4587.5,1198.7516850211,4.4635176576241005,10.821853445690346,24.768881654928379,7.2204516831421088,71,1737840,718770,8215,4690,88,506603,506603,1908,1908,2,9053,9053]
[null,"BN2","North","RURAL LONG",1083,381.58775920373,1.6626573970193002,10.097856208126554,96.418432426638375,7.9827193379698391,29,1101308,330260,2911,1884,11,91180,91180,264,264,1,42,0]
[null,"BN3","North","RURAL SHORT",657,151.19998449915002,1.6448951130278,4.3439834253827438,12.268515088534993,9.9175400735727184,10,341920,36026,417,275,34,276399,276399,778,778,0,0,0]
[null,"BN4","North","URBAN",3359.5,17.079630367351001,2.3209892400288998,8.4593361441663966,20.405328110531631,3.2242397289754061,12,1313489,129090,6267,3751,32,207544,207544,756,756,6,17224,16437]
[null,"BN6","North","RURAL LONG",2332,502.15705225054,3.1274934267368,5.9062932538098716,7.4111225961832803,6.7701346289554518,52,505122,505122,5433,5433,38,461434,461434,1401,1401,0,0,0]
[null,"BRA11","Central","URBAN",2278,9.2658511836385014,2.1794537595457002,8.9547026751310952,2.5023058201243669,8.1961302827361955,9,136978,119596,327,265,12,448662,448662,1442,1442,3,6780,6780]
[null,"BRA12","Central","URBAN",214,2.7218338059860998,1.1168570598590999,4.7250346030478969,4.3657603552394703E-2,0.97157542580210943,1,169,169,1,1,3,3761,3761,32,32,2,420,420]
[null,"BRA13","Central","URBAN",1660,7.9140847536344001,4.1038772088910997,6.0587137248759326,0.43030478584482523,4.021034161249128,2,19317,19317,105,105,4,180510,180510,528,528,1,1637,1637]
[null,"BRA14","Central","URBAN",3960,15.752376690939,0.66411165632591995,6.8589211979727542,2.1973054234031677,10.237248365379207,11,271256,271256,2041,2041,32,1263782,1263782,3915,3915,2,7787,7787]
[null,"BRA21","Central","URBAN",5122,17.991134927505001,13.383852576762999,14.251314044676722,7.7963213223186028,9.5763192998276132,13,578422,578422,3619,3619,23,710483,710483,2638,2638,4,19675,14540]
[null,"BRA22","Central","URBAN",1,3.0010530650112E-3,1.0587968704371999,4.1915629543166828,14.551735731240436,0,1,565,565,1,1,0,0,0,0,0,0,0,0]
[null,"BRA23","Central","URBAN",1801,7.6475590427077993,4.5993095875899996,5.715767664977295,2.9943095292452075,0.6170279653615014,10,148248,148248,3698,3698,3,30549,30549,191,191,1,1789,1789]
[null,"BRA24","Central","URBAN",1790,9.1723931691184006,2.1825716149036003,4.572614131981835,1.3838421885656393,3.6085603301550868E-2,8,102008,102008,2204,2204,1,2660,2660,95,95,0,0,0]
[null,"BRA31","Central","URBAN",772.5,1.3955068978238001,4.0737375920972996,6.1349239604089636,6.5412915029559052E-2,0.53260141539029993,1,1604,1604,767,767,3,13060,13060,43,43,0,0,0]
[null,"BRA32","Central","URBAN",2163.5,8.5998617491044005,2.0742265868496004,5.2966113695456274,1.8982021181931168,6.579244539025674,7,123837,123541,2380,2379,13,429224,429224,1250,1250,2,4278,4278]
[null,"BRA33","Central","URBAN",4000.5,13.993392696542999,7.5890985469267997,9.1071231461971571,0.53617129452915935,10.656582809876232,7,40965,40873,295,294,6,814193,814193,2034,2034,2,8012,8012]
[null,"BRA34","Central","URBAN",42.5,3.0014516693112002E-3,1.7896189777182998,3.9248271299510757,0,0,0,0,0,0,0,0,0,0,0,0,0,0,0]
[null,"BRT11","North","RURAL SHORT",1082.5,25.307427582151998,1.7776493991207001,3.5437759522859231,1.7258406194077023,0.15900884681899355,4,97955,97955,734,734,2,9025,9025,69,69,2,1430,1430]
[null,"BRT21","North","RURAL SHORT",1494.5,43.577549323168995,46.031653126491996,6.0587137248759326,1.4159505767470473,3.7650217517038427,14,75368,75368,191,191,1,200404,200404,409,409,4,5907,5907]
[null,"BRT22","North","RURAL SHORT",1570.5,92.619603772231997,3.3352718002006001,5.8681881360433552,11.658871603852969,1.8253109051034624,11,495440,78330,1563,231,24,77566,77566,308,308,2,1820,1577]
[null,"BWA21","North","URBAN",4.5,1.5574723754068001,2.8810731988341001,3.5437759522859231,2.9583663757482601E-2,0.97330253762117758,1,10,10,5,5,2,329,329,2,2,0,0,0]
[null,"BWA22","North","RURAL LONG",1419,222.99548533571999,11.745562254897001,4.1153527187836518,1.1812811635916773,6.9627111360114107,35,67847,67847,1791,1791,108,399904,399904,2759,2759,1,1404,1404]
[null,"BWA23","North","RURAL SHORT",429.5,174.23331472139,1.7387311573295998,6.9351314335057843,3.3691564078857494,49.821342991619524,15,30087,30087,634,634,69,444911,444911,1517,1517,1,423,423]
[null,"BWA24","North","URBAN",0.5,1.2574702743078998,1.6768153069062,3.6199861878189532,1.6564169917529621E-3,0,1,2,2,1,1,0,0,0,0,0,0,0,0]
[null,"BWN11","Central","URBAN",2911.5,8.3115998479508999,14.893404381926999,10.669432974624284,0.83559182424040845,1.3610151014327385,5,47716,47716,1581,1581,7,77720,77720,285,285,3,7902,7902]
[null,"BWN12","Central","URBAN",1133.5,3.7491154626346002,7.1943396733164002,6.6683956091401768,0.53096008249885807,9.7889287700394583,4,11527,11527,73,73,10,212515,212515,737,737,1,1097,1097]
[null,"BWN13","Central","URBAN",1775,10.681938741194001,4.8232005228990005,6.6302904913736622,1.5790137656763767,8.7472407706793103,7,82346,82346,401,401,11,456171,456171,1365,1365,3,5258,5258]
[null,"BWN14","Central","RURAL SHORT",2722.5,72.996128234855007,8.9966275611041997,7.2399723756379064,0.68208349311966587,20.66339809320808,24,40193,40193,315,315,17,1217628,1217628,3464,3464,3,8109,8109]
[null,"BWR12","Central","URBAN",787.5,6.0791185213366994,0.43494990706725001,6.3635546670080547,1.0803311001162166,0.52245028187943776,4,25186,25186,77,77,5,12180,12180,74,74,1,775,775]
[null,"BWR13","Central","URBAN",4458,33.113402238014004,5.7854056798129001,11.774481389853229,0.63694149577077175,8.5650923277059139,11,43397,43328,331,330,18,583569,583569,1769,1769,2,8838,8838]
[null,"BWR14","Central","URBAN",1,6.4812098078659997E-3,1.1711296195106,2.8578838324886475,0,0,0,0,0,0,0,0,0,0,0,0,0,0,0]
[null,"BWR21","Central","URBAN",0,6.8331280027984003E-3,1.142843473366,2.8578838324886475,0,0,0,0,0,0,0,0,0,0,0,0,0,0,0]
[null,"BWR22","Central","URBAN",1069,9.7587966986317998,0.54147428573100997,6.5921853736071467,0.35445198515643628,3.3998109415700797,7,8982,8982,72,72,8,86153,86153,440,440,0,0,0]
[null,"BWR23","Central","URBAN",3644.5,17.451410437010001,2.2661241895869999,8.5736514974659421,4.9691938811864951,7.5205245898016884,8,213597,213597,4059,4059,7,323264,323264,836,836,11,39878,39878]
[null,"BWR24","Central","URBAN",750,5.7146937805766003,3.4790603269735003,9.5643845593953412,4.0347615844839613,3.1580450534112758,8,45851,44885,402,388,3,35888,35888,114,114,4,7448,7448]
[null,"BWR32","Central","URBAN",2864.5,12.984144696207,0.91197831308569,7.354287728937452,2.0385752369157242,6.7926598612941023,9,116186,116186,541,541,16,387139,387139,1106,1106,5,17080,11336]
[null,"BWR33","Central","URBAN",95.5,1.6770715709602,1.1918889706052,6.4016597847745711,1.1477204336642752,0.11700718053301983,1,7651,7651,16,16,2,780,780,3,3,0,0,0]
[null,"BWR34","Central","URBAN",3121.5,10.475088600362,1.5520924357790999,7.2399723756379064,3.1419361164742772,23.49356666359461,4,206461,206461,2874,2874,23,1543795,1543795,5085,5085,3,7342,7342]
[null,"CF1","North","RURAL SHORT",68,6.3340788871389995,18.867687772349999,5.410926722845173,1.421927930295088,0,3,18982,18982,134,134,0,0,0,0,0,4,264,264]
[null,"CF2","North","RURAL SHORT",645.5,15.745947617219,5.4609794853330005,5.5633471939112331,3.1014670384400893,0.88212413530737033,2,86087,86087,631,631,4,24485,24485,20,20,0,0,0]
[null,"CLN12","Central","RURAL SHORT",4540,6.8072826383496006,21.933942945359998,8.2307054375673037,0.39115918517045728,0,4,37228,36811,284,283,0,0,0,0,0,0,0,0]
[null,"CLN13","Central","RURAL SHORT",4691,7.5664133668487006,33.946965676280996,6.9351314335057843,16.126668432830922,5.2142539950788072,10,1493005,16739,5217,148,10,482735,482735,1065,1065,1,5070,0]
[null,"CLN14","Central","URBAN",4192,3.3399958065270998,21.865125014945999,9.1833333817301863,1.0330852633071288,2.7706773875343975,2,82014,82014,109,109,9,219957,219957,472,472,0,0,0]
[null,"CLN21","Central","RURAL SHORT",3859,9.6373633993876986,24.293332814745,8.6498617329989731,6.2737731805930758E-2,2.8950762597597712E-2,7,3775,3775,32,32,1,1742,1742,2,2,1,3790,3790]
[null,"CLN22","Central","RURAL SHORT",1273.5,79.034242389698008,6.1053545335416999,6.5540802558406313,5.3652926812626003,11.426926801282885,36,146695,146695,1269,1269,21,312429,308958,793,780,2,2480,2480]
[null,"CLN23","Central","RURAL SHORT",5837.5,23.474074899302998,39.046231244403003,10.135961325893069,3.7491908717468889,0.86546859553617528,12,380339,380339,3543,3543,14,87798,87538,469,467,1,5423,5423]
[null,"CNR1","East","RURAL SHORT",144,9.0365205362814987,2.0252856121374001,0.22863070659909182,3.1580326255650841,0,6,173447,173447,570,570,0,0,0,0,0,0,0,0]
[null,"CNR2","East","RURAL SHORT",1191.5,143.39242475948001,1.0032845904487,2.59114800812304,16.33582496262644,0.44289332862956166,10,1431149,1431149,4783,4783,8,38801,38801,129,129,0,0,0]
[null,"CNR3","East","RURAL SHORT",59.5,86.250202829448995,0.12596765544890001,0.19052558883257648,0.79902508600257327,0,6,63354,63354,238,238,0,0,0,0,0,2,118,118]
[null,"CPK11","Central","URBAN",3521.5,25.507111351058999,5.0592423661729997,9.3738589705627628,18.86479601379083,1.6321078035088932,13,1361019,743528,10952,7432,10,117750,117750,805,805,9,35251,35251]
[null,"CPK12","Central","RURAL SHORT",2303.5,119.37859140982,14.717372582218001,6.3635546670080547,0.33129361064471879,8.7953559125081,15,21186,21186,126,126,19,562457,562457,1767,1767,0,0,0]
[null,"CPK13","Central","URBAN",4674,18.971738023927998,3.9279798732682001,10.36459203249216,4.706548397696058,21.927225343943817,17,422471,422471,6313,6313,34,1968240,1968240,4489,4489,8,34170,34170]
[null,"CPK21","Central","URBAN",1759,10.498351373129001,2.2718301417097999,6.9351314335057843,5.9930335222023148,18.064521083303759,5,246820,246820,3158,3158,12,743978,743978,1837,1837,0,0,0]
[null,"CPK22","Central","URBAN",1515,16.025774080318001,3.3905765931939,6.1349239604089636,0.12025239663026895,0.41942629427521205,4,4993,4993,33,33,4,17415,17415,67,67,1,1517,1517]
[null,"CPK23","Central","URBAN",2266.5,12.169115877526,1.9740343830425,5.0679806629465345,0.3131962785880904,2.6361169096487962,6,24351,24351,263,263,6,204958,204958,1200,1200,1,2076,2076]
[null,"CRE21","Central","RURAL SHORT",2877,16.083832060186001,14.488008812,6.0968188426424472,0.20608544268192491,1.5119272929593157,4,13543,13543,53,53,6,99357,99357,616,616,2,5736,5736]
[null,"CRE22","Central","URBAN",2613,8.6900006546703015,2.5375668262692996,7.5448133177700285,4.2687342656312524,10.053036214158034,4,215841,215841,670,670,18,508314,508314,2659,2659,3,7133,7133]
[null,"CRE23","Central","URBAN",2979,4.6838729457903998,12.722970181582999,7.3923928467039675,10.765365171237022,4.4465674016908541E-2,3,663610,663610,3189,3189,2,2741,2741,11,11,2,3551,3551]
[null,"CRE31","Central","RURAL SHORT",6131,14.06581978124,27.014568531690003,10.555117621324738,0.33811117422477316,4.5089601511033575,6,33068,33068,734,734,14,440986,440986,1230,1230,4,25174,25174]
[null,"CRE32","Central","URBAN",1975,11.368843111423001,4.1599162001650001,8.9165975573645788,1.3803383470703317,11.580969566086967,12,56079,56079,491,491,9,470500,470500,1364,1364,5,9753,9753]
[null,"CRE33","Central","RURAL SHORT",2587.5,76.374025490547993,7.3294980930158999,6.4016597847745711,2.1908373921352187,16.555876729519412,23,127577,122233,2234,2218,22,964083,964083,2683,2683,1,1163,1163]
[null,"CYN11","Central","URBAN",1494,5.2889082472173996,3.3790566367852999,7.4304979644704829,2.1692081223911872,0.89461798395734116,6,78925,78925,2191,2191,3,32550,32550,131,131,8,11365,11365]
[null,"CYN12","Central","URBAN",2783.5,9.9192077002680001,3.5317549363960001,8.8022822040650333,2.9330766109216642,5.2142767292975227,10,183514,183514,6339,6339,7,326242,326242,1205,1205,4,11099,11099]
[null,"CYN13","Central","URBAN",1090,9.968864199815199,1.9061351098245001,7.7353389066026059,5.2649409794469042,24.301037951029073,11,122084,122084,2604,2604,6,563495,563495,1244,1244,8,7641,7641]
[null,"CYN14","Central","URBAN",2074,6.6383275166607998,0.23362872374293001,4.1153527187836518,6.397295578568281,17.169667467433698,7,585365,585365,6056,6056,24,1571058,1571058,3927,3927,1,2074,2074]
[null,"CYN21","Central","URBAN",2342,12.902666898314999,4.0814545986450002,5.5633471939112331,2.527656899894462,7.6483617014793559,12,162117,162117,3738,3738,12,490545,490545,1295,1295,0,0,0]
[null,"CYN22","Central","URBAN",2080,10.705019562143999,1.6407516433102001,6.1349239604089636,2.2088351824923658,7.0719544455715937,10,117585,117585,4521,4521,5,376468,376468,1134,1134,0,0,0]
[null,"CYN23","Central","URBAN",1752,8.6514105845184996,0.46782754431644996,5.258506251779111,1.2938627322188951,7.3425616962200024,6,76051,76051,2275,2275,9,431583,431583,1489,1489,4,6926,6926]
[null,"CYN24","Central","URBAN",1273,12.100353201069,2.2373887251014999,10.517012503558222,9.0966386894567357,6.121762023432896,5,166587,166587,3317,3317,5,112108,112108,351,351,4,2996,2996]
[null,"CYN31","Central","URBAN",1906,9.5886205685207013,0.67209381356848996,3.6580913055854691,2.0114700030023265,12.845697182861713,12,221030,221030,5649,5649,20,1411547,1411547,4121,4121,2,2601,2601]
[null,"CYN32","Central","URBAN",4006.5,18.623693465618999,1.5412121186937,10.478907385791707,2.4178633263279536,29.861501143641849,9,167661,167462,4820,4819,24,2070675,2070675,5206,5206,5,19316,19316]
[null,"CYN33","Central","RURAL SHORT",3412.5,23.187061754941002,2.7467018188628001,7.7353389066026059,8.6379283544065331,25.529161825671999,26,787877,782927,9592,9562,21,2328549,2328549,5134,5134,1,5333,5333]
[null,"DRN11","Central","RURAL SHORT",5073.5,10.454582917522,25.389764128477001,10.7075380923908,3.2230163159954994,2.8652136622387854,10,433978,433978,12416,12416,9,385800,385800,771,771,1,4089,4089]
[null,"DRN12","Central","RURAL SHORT",4725,9.2062978196192002,26.622724829594002,10.593222739091255,0.32462882492602446,2.192617408481961,5,20336,20336,52,52,10,137354,137354,547,547,0,0,0]
[null,"DRN13","Central","RURAL SHORT",3130.5,23.110819342060999,15.495742273231999,6.2873444314750246,0.80656959463631361,3.3418558929696154,9,56750,45678,165,133,13,235132,235132,731,731,1,2784,2784]
[null,"DRN14","Central","RURAL SHORT",3937.5,69.233590950966004,19.646985614948001,8.9547026751310952,4.0077371499504713,1.7932774631559121,16,314162,202452,3026,2987,17,140573,140298,560,557,1,3932,3932]
[null,"DRN21","Central","RURAL SHORT",3439.5,14.456627218291001,22.354655070982002,5.1822960162460801,2.8356143464342396,1.4174376285404653,14,187995,187995,9799,9799,5,93973,93973,361,361,1,4441,4441]
[null,"DRN22","Central","RURAL SHORT",3909.5,79.938444563188,20.766002154233998,8.8022822040650333,16.140820449262428,4.767001480949987,32,1096238,1020280,24985,24938,27,323761,323761,1161,1161,5,22518,22518]
[null,"DRN23","Central","RURAL LONG",2623.5,227.12794871893001,4.9052319856827999,10.288381796959131,3.9443209859286394,6.433371551935454,51,211894,164533,3034,2977,35,345609,345609,1592,1592,3,7762,7762]
[null,"ELM11","Central","URBAN",2297.5,6.874688326877,4.2718946496787007,9.1452282639636699,2.7264979478789217,3.4835455862719242,4,133608,133608,1887,1887,10,170706,170706,910,910,2,4054,4054]
[null,"ELM12","Central","RURAL SHORT",2921.5,20.357485146578,7.1412540786448995,7.2018672578713918,0.63238896195176342,6.4739907731181212,9,46879,46879,1104,1104,14,479917,479917,1858,1858,3,8746,8746]
[null,"ELM13","Central","URBAN",2095.5,9.1333786682506002,1.9882956962635998,6.6683956091401768,4.6435431453202405,4.3387274494210004,10,365843,365843,6285,6285,5,341828,341828,999,999,8,14397,12339]
[null,"ELM15","Central","RURAL SHORT",6134,79.853471056028994,13.072411286604,18.099930939094769,6.8399019961277912,10.088862406445974,24,491220,484032,9892,9888,24,724550,724550,2485,2485,2,10474,10474]
[null,"ELM31","Central","URBAN",4092.5,14.535455660895,5.1685749442730007,9.8311203837609469,2.6761759927929805,24.352006505985056,13,206251,205021,3430,3429,31,1876792,1876792,5143,5143,3,9189,9189]
[null,"ELM32","Central","URBAN",3344,21.030796223484,5.5094250168457002,9.4500692060957938,12.988187630140565,2.3073959726659745,23,841847,841483,8595,8594,10,149557,149557,806,806,9,30119,30119]
[null,"ELM33","Central","RURAL SHORT",2241,112.57327224373999,6.5785199225047997,6.1730290781754791,5.2802028158767467,3.9495432899032386,22,260431,260431,4187,4187,32,194800,194800,853,853,3,5152,5152]
[null,"ELM34","Central","RURAL SHORT",3224,30.317219273815002,2.1843751006834999,9.3357538527962483,9.0720771009283645,32.525096360766199,32,566193,566193,10423,10423,38,2029908,2029908,4878,4878,7,16973,16973]
[null,"EPG11","Central","URBAN",1502,2.6901976203715998,4.6920924417416998,6.2873444314750246,8.6381805275647594E-2,0,1,3557,3557,61,61,0,0,0,0,0,0,0,0]
[null,"EPG12","Central","URBAN",1602.5,5.9285893772855998,2.6000829763783999,2.819778714722132,1.403596161019899,2.1369800345462373,2,158931,158931,977,977,6,241973,241973,817,817,0,0,0]
[null,"EPG13","Central","RURAL SHORT",5732,26.658004186368,33.019732565739005,10.288381796959131,11.734692121012605,4.8139822594348374,8,994932,508617,9126,4581,16,408156,408156,1406,1406,4,18820,18820]
[null,"EPG14","Central","URBAN",2247.5,10.733571392657,0.77370566934413998,4.9155601918804734,0.16515279792353474,5.2360855440047214,1,13580,13580,138,138,10,430547,430547,1472,1472,1,2223,2223]
[null,"EPG21","Central","URBAN",2,1.9990494691641998E-3,2.967001107532,2.7816735969556166,0.1997446228777143,0,1,14,14,2,2,0,0,0,0,0,0,0,0]
[null,"EPG22","Central","URBAN",135,1.6113816062499,1.7170189429616001,7.9258644954351825,0.36881626055643624,11.889352187511832,1,1057,1057,133,133,3,34074,34074,78,78,0,0,0]
[null,"EPG23","Central","URBAN",902,10.115612928588,5.2233355109493997,7.2399723756379064,0.65141615912581319,2.9544152470988325,4,14545,14545,907,907,4,65967,65967,234,234,0,0,0]
[null,"EPG24","Central","URBAN",0,4.8754786788878998E-3,0.22824661110676001,8.1926003198007891,0,0,0,0,0,0,0,0,0,0,0,0,0,0,0]
[null,"EPG31","Central","URBAN",3089.5,13.273545883430002,1.9359365233034,5.5252420761447185,0.31873926796308644,7.7333795851104297,3,34093,34093,3185,3185,10,827178,827178,2389,2389,1,3057,3057]
[null,"EPG32","Central","RURAL SHORT",3258.5,25.198221677492999,13.620247524425,7.6972337888360896,10.407388391922849,1.0260532762144816,13,752549,625966,14592,9889,5,74193,74193,201,201,3,9762,9762]
[null,"EPG33","Central","URBAN",1,2.5002547538492998E-3,3.3867773187783001,3.2008298923872855,0.1953752121206862,0,1,7,7,1,1,0,0,0,0,0,0,0,0]
[null,"EPG34","Central","URBAN",3332.5,8.1703615662095004,8.6997781848633,5.7538727827438096,2.0015647342173795,8.1467730666327185,5,196447,195338,6766,6765,7,799579,799579,1860,1860,2,6644,6644]
[null,"EPG35","Central","URBAN",181,2.1461326835603001,16.926165509960001,8.8403873218315496,1.8928295843312846,1.4204255963912187,2,4712,4712,183,183,5,3536,3536,15,15,1,148,148]
[null,"FGY12","Central","URBAN",4107.5,2.1491000031545999,24.248455234554999,9.3738589705627628,3.2121480345151392,0.33132392973130559,9,284225,284225,2354,2354,2,29317,29317,129,129,3,10331,10331]
[null,"FGY13","Central","RURAL SHORT",1561.5,18.075154960701997,1.3866314306182002,2.9721991857881935,0.59070123182811185,7.3802833988063457,3,46737,46737,424,424,17,583937,583937,2241,2241,3,4503,4503]
[null,"FGY14","Central","URBAN",2570.5,11.020555844751,0.19565316031652,9.7168050304614013,1.6740153988294308,12.853719448287807,8,102455,102455,1454,1454,11,786688,786688,2551,2551,4,9321,9321]
[null,"FGY21","Central","URBAN",2507,20.613118373879999,12.783546734673001,11.43153532995459,3.2934387730905672E-2,0.61436686084457515,2,1371,1371,10,10,2,25575,25575,69,69,3,7484,7484]
[null,"FGY22","Central","URBAN",3362,6.1207430665350007,15.043949903385998,9.5262794416288248,1.791719960779004,1.4237410374544028,5,93092,93092,911,911,10,73973,73973,440,440,3,8325,8325]
[null,"FGY23","Central","URBAN",1142,10.393425737803,0.3799300598466,3.5437759522859231,0.92904415224246906,7.9611738568582116,4,42422,42422,640,640,15,363523,363523,1588,1588,2,2267,2267]
[null,"FGY31","Central","URBAN",1181,10.338937890844999,6.2767396762194005,10.478907385791707,1.1547670742092315,5.6761376752492172,4,19940,19940,163,163,5,98013,98013,1461,1461,3,3672,3672]
[null,"FGY32","Central","URBAN",1379.5,8.8540938271153014,0.63733499708521002,5.2966113695456274,12.407138413049784,6.8086550063164504,9,512742,234044,4228,2835,6,281377,281377,1022,1022,4,4724,4724]
[null,"FGY33","Central","URBAN",1886,12.574689150095001,3.4023875622950999,6.5540802558406313,21.043742661427338,23.847605274164152,21,1031314,1029851,6040,6037,25,1168726,1123256,3330,3213,3,2606,2606]
[null,"FGY34","Central","URBAN",3648,22.338346482727001,3.198859403613,8.2688105553338183,11.802821028931413,20.342428441397768,20,1145334,1141674,11684,11664,22,1974009,1974009,5196,5196,2,4000,4000]
[null,"FTR12","East","RURAL LONG",1644.5,465.14998418381003,1.1499042343589001,4.3820885431492593,9.4536791004146252,16.566250479051462,95,460459,386783,6458,6132,52,806890,806890,2842,2842,4,6042,6042]
[null,"FTR21","East","RURAL LONG",2421,400.89306900908002,0.65815502265312997,4.7250346030478969,8.2838282891316357,28.34276350842438,92,684639,681172,12084,12069,75,2342463,2342171,6508,6507,2,4796,4796]
[null,"FTR22","East","RURAL SHORT",1310,126.0862197053,1.6431884654903,2.8959889502551626,4.6682679283259976,2.9349280015166257,36,249904,249904,4600,4600,16,157114,157114,565,565,4,5157,5157]
[null,"FTR23","East","RURAL LONG",3413.5,417.31669030244001,3.6870200602864003,8.1544952020342727,19.04506545957187,20.22420575739411,72,1065250,1038822,17456,14807,74,1131203,1131203,3527,3527,3,6822,6822]
[null,"HPK11","Central","URBAN",5112,4.8869732525832994,15.029572379848,9.1833333817301863,0.52226339488615969,4.469086988479579,2,56254,56254,401,401,11,481374,481374,2354,2354,0,0,0]
[null,"HPK12","Central","URBAN",1545.5,7.3638544387384002,8.5034676987161006,8.3069156731003346,0.325231762854781,9.0709265221780438E-2,2,10828,10828,136,136,4,3020,3020,128,128,1,1544,1544]
[null,"HPK13","Central","URBAN",2048.5,8.6633359703754991,8.0516267395660996,7.2018672578713918,3.9401020665306357,2.4257791753095264,3,229864,225843,3093,3031,8,141519,141519,703,703,2,3239,3239]
[null,"HPK14","Central","URBAN",4021.5,8.9559354050657003,12.354954319995,8.2307054375673037,0.51726415384049818,0.72629472290174713,2,46641,46641,492,492,3,65489,65489,224,224,1,4007,4007]
[null,"HPK21","Central","RURAL SHORT",3036.5,9.1759044077147998,11.667778780021001,5.6014523116777495,0.55910027878771396,0.69175228182401816,4,53178,53178,439,439,6,65795,65795,383,383,1,3036,3036]
[null,"HPK22","Central","URBAN",4384,8.3878162850002997,20.176937584109002,8.8022822040650333,1.2459202386583306,14.897030107164191,4,115082,115082,596,596,14,1375995,1375995,1382,1382,0,0,0]
[null,"HPK23","Central","URBAN",3238.5,8.4391601630451998,13.395775640896,8.4593361441663966,2.5523435853222649,2.4613368844494423,4,144323,143999,4260,4254,5,139177,139177,466,466,1,2176,2176]
[null,"HPK24","Central","URBAN",1507.5,8.5647655354599994,3.7872014222111003,7.7734440243691205,0.26592338938266585,4.6707204520644634,7,7388,7388,83,83,4,129764,129764,450,450,1,1491,1491]
[null,"KLK1","Central","RURAL SHORT",1461,179.85688058056999,19.785247071336997,2.9340940680216776,14.457271373202651,34.974176681836603,43,795124,795124,2434,2434,72,1923517,1923517,5960,5960,1,69,69]
[null,"KLK2","Central","RURAL SHORT",797.5,86.215846823147004,1.9242745795937002,1.29557400406152,1.5321801681666987,15.171573129119446,9,91281,91281,1339,1339,40,903860,903860,3071,3071,0,0,0]
[null,"KLK3","Central","RURAL SHORT",141.5,58.612112057727998,0,0.53347164873121411,0.52854837718962699,2.6900611863111932,9,27690,27690,156,156,18,140929,119545,391,327,0,0,0]
[null,"KLO11","Central","RURAL SHORT",1,3.6775112455276998E-3,0.12972915278354,1.6910000000000001E-2,1.3003754628392032E-2,0,1,174,0,1,0,0,0,0,0,0,0,0,0]
[null,"KLO12","Central","URBAN",2,3.4733578354422998E-3,0.86083122103318999,1.1431535329954587,0.30569355034660795,0,1,348,0,2,0,0,0,0,0,0,0,0,0]
[null,"KLO14","Central","RURAL LONG",3504,250.71370721878,23.033160379272999,7.4686030822369984,17.999067306818926,23.32702221550031,80,917619,584464,14923,11452,67,1189246,1189246,3647,3647,2,6763,6763]
[null,"KLO24","Central","RURAL SHORT",4382,75.160269716341006,31.854928039025999,9.3738589705627628,41.080882976901329,19.992214271664835,25,2744347,547902,10970,6445,16,1335550,1335550,4065,4065,3,11056,11056]
[null,"KMS1","North","RURAL SHORT",1885,111.63349305634999,5.8770897118234995,5.9443983715763871,4.4127471145834933,3.3834322985358107,14,244869,221217,4224,2336,17,187751,187751,574,574,0,0,0]
[null,"KMS21","North","RURAL SHORT",3178,169.02290445311999,12.949110485786999,10.745643210157313,23.325742164054386,4.8316615422553166,22,1340151,72827,9229,4006,64,277597,277597,935,935,5,18915,18915]
[null,"LDL11","Central","URBAN",1353,5.9157632088016996,2.0562797919503,3.8867220121845603,0.60708886992414834,7.465217613490891,2,38629,38629,1330,1330,10,475011,475011,1514,1514,2,1352,1352]
[null,"LDL12","Central","URBAN",460.5,3.6252829848075998,0.58218447454119993,7.1637621401048763,0.87312710289105167,16.277637379992058,3,6990,6990,162,162,3,130314,130314,257,257,0,0,0]
[null,"LDL13","Central","RURAL SHORT",3998,133.84525491377002,1.4024344672882001,8.2307054375673037,7.0109223976333279,19.334487441454538,45,485156,485026,3816,3815,37,1337947,1337947,4040,4040,2,1631,1631]
[null,"LDL14","Central","RURAL SHORT",2245,133.60547000540001,3.9786805584695997,7.9639696132016979,13.435621188331632,32.396428880680645,39,528210,520994,5046,4998,40,1273638,1273638,3188,3188,3,6688,6688]
[null,"LDL21","Central","RURAL SHORT",2352.5,24.227125491271,12.057828179776999,6.3254495492415392,3.5360675755765709,23.882064389616364,33,190533,190533,1584,1584,37,1286831,1286831,3860,3860,0,0,0]
[null,"LDL22","Central","URBAN",1784,10.853075239893,4.3652443425184,7.6210235533030604,0.13439864040667604,3.8913300041921697,4,5328,5328,71,71,9,154265,154265,568,568,3,5356,5356]
[null,"LDL23","Central","RURAL LONG",4656.5,210.60149778082999,10.192402145735,13.565421924879445,15.238427409224112,63.429389769289109,75,764525,750254,7214,7147,143,3182307,3164450,9095,9015,5,23062,23062]
[null,"LDL24","Central","URBAN",3775,14.358809303499999,10.603118685762,10.859958563456859,6.0373553890593499,3.5708002099447689,7,517982,517982,5416,5416,13,306361,306361,954,954,2,7520,3774]
[null,"LGA11","East","RURAL LONG",1681.5,251.63745490029001,0.19982719073672001,3.8105117766515302,6.1380847911133056,8.9414293351614855,38,376674,185386,4354,2683,45,548706,548706,2364,2364,4,5294,5294]
[null,"LGA12","East","RURAL SHORT",983.5,182.13150767623,1.6793430531373001,3.5056708345194076,3.1267482134837192,2.520687384319261,22,101119,101119,1340,1340,11,81519,81519,396,396,1,980,980]
[null,"LGA13","East","RURAL LONG",910.5,288.99796644733004,0.14035409604446999,2.5149377725900095,5.1637413814100581,6.2320472159002183,37,294307,255033,1931,1891,24,355195,355195,1240,1240,4,2355,2355]
[null,"LGA14","East","RURAL LONG",1529,210.60058576531,1.1622547280474,3.4294605989863771,3.0002220978874763,5.7365271893789362,36,171578,158724,4959,4941,31,328063,328063,1260,1260,8,10844,10844]
[null,"LGA21","East","RURAL SHORT",1779,82.929969446293995,1.9535375552073,2.2482019482244029,11.278093587430764,6.4230674136087389,19,718154,545820,3244,3096,28,409001,409001,1589,1589,3,4408,4408]
[null,"LGA22","East","RURAL SHORT",2001,56.823764281326,1.2402354387895,5.1441908984795655,1.4744705694215947,1.2209536112537789,12,64378,64002,578,574,6,53309,53309,263,263,0,0,0]
[null,"LGA23","East","RURAL LONG",1513,323.87573551898004,0.56985289544481998,3.8105117766515302,9.0076881891541127,4.4475153297826315,44,439920,439777,1642,1629,44,217209,217209,874,874,4,3052,3052]
[null,"LGA24","East","RURAL SHORT",1075.5,174.4232737849,17.226527721928001,6.0206086071094171,14.536779975872701,49.524833044838431,30,282603,274453,2640,2630,53,962790,962790,2895,2895,0,0,0]
[null,"LGA25","East","URBAN",1,2.4995427935897E-3,1.3052674474415,0.70546660685616369,0,0,0,0,0,0,0,0,0,0,0,0,0,0,0]
[null,"LGA41","East","URBAN",2,2.000075533471E-3,1.3201919869905001,6.8589211979727542,0,17.841736883793899,0,0,0,0,0,1,540,540,1,1,0,0,0]
[null,"LLG11","Central","RURAL SHORT",967,156.75507676925,0.46412188223885997,2.4006224192904639,6.3544826163457273,4.9498700666960023,49,271599,125955,1238,505,16,211564,211564,769,769,1,957,957]
[null,"LLG12","East","RURAL SHORT",1466.5,188.09022888459,3.9315206523692998,4.4582987786822894,2.2672620219028894,13.753924389154978,27,81581,81581,573,573,42,494896,494896,6316,6316,0,0,0]
[null,"LLG13","East","RURAL SHORT",1317.5,111.82859944838999,3.4404303357962998,5.1441908984795655,3.3859818288215124,28.233590668000346,24,85201,82408,694,687,69,710438,710438,7510,7510,2,2582,2582]
[null,"LLG14","Central","RURAL SHORT",2542,134.62466758603,4.8106801549846994,7.0113416690388153,6.7196434846104625,13.19475710535526,36,310907,307345,5990,5984,28,610500,610500,1958,1958,1,2507,2507]
[null,"LYD11","Central","RURAL SHORT",2408.5,10.679315997748001,10.002230331250999,4.6869294852813814,4.9410613269955756E-3,1.4345625196525116,0,427,427,1,1,7,123973,123973,643,643,3,7171,7171]
[null,"LYD12","Central","URBAN",2066,2.2463910044536999E-3,10.107453709123,3.8105117766515302,1.2182763745121032,0,1,144127,144127,2247,2247,0,0,0,0,0,0,0,0]
[null,"LYD13","Central","URBAN",2010.5,10.162454835579,9.6241583357627007,6.0587137248759326,2.1381775249066792,10.488421103063436,9,139654,139654,1531,1531,13,685046,685046,1995,1995,1,2002,2002]
[null,"LYD14","Central","RURAL SHORT",1187.5,31.150235064011003,10.499613134497,4.6869294852813814,3.0829429430183022,20.797800829340797,10,123877,95483,663,567,13,835685,835685,2470,2470,5,5401,5401]
[null,"LYS36","East","RURAL SHORT",2,3.8966030055295002,1.2995296483989001,0.13698000641397448,0,1.3839272304641255,0,0,0,0,0,1,1171,1171,2,2,0,0,0]
[null,"MBY11","North","RURAL SHORT",1149,107.84813434726,1.4886743967798,3.4294605989863771,1.3405608659423378,10.486745825265814,16,96321,96321,3740,3740,20,753486,753486,2287,2287,2,2265,2265]
[null,"MBY12","North","RURAL SHORT",712,22.017582773696997,0.56495243511126003,2.0576763593918259,0.81866913732719837,13.34687352494649,5,51195,51195,1526,1526,7,834639,834639,1902,1902,0,0,0]
[null,"MBY13","North","RURAL SHORT",252.5,1.6081903797346999E-2,52.002997698107002,4.572614131981835,0.73784800362749903,0.20078719329242478,4,16011,16011,527,527,3,4357,4357,12,12,0,0,0]
[null,"MBY14","North","RURAL SHORT",1,8.6608588620911995,9.8731535354694006E-2,1.4479944751275813,0,0,3,47,47,3,3,0,0,0,0,0,0,0,0]
[null,"MDG1","Central","RURAL SHORT",754.5,7.4399506198117997,4.0849287990779999,1.1545850683254135,6.4101344603275834,3.3635086041255282,11,476872,476872,2206,2206,9,250223,250223,1682,1682,1,3084,3084]
[null,"MDI1","North","RURAL SHORT",54.5,24.790859308594001,0,0.30484094213212237,0.11718632772341381,0.53626082466836933,1,7644,7644,52,52,3,34980,34980,107,107,0,0,0]
[null,"MFA14","East","URBAN",30.5,0.87269681666143006,7.7720634231405003E-2,7.9258644954351825,1.8042995856229955,0,2,1056,1056,31,31,0,0,0,0,0,0,0,0]
[null,"MFA21","East","RURAL LONG",2502,435.044464178,1.9466784033609998,7.4686030822369984,4.3290718320086041,48.312319771053012,57,213125,211856,5335,5332,90,2378469,2378469,7352,7352,2,4941,4941]
[null,"MFA22","East","RURAL LONG",1579,321.2221585039,0.24588191550339,6.7065007269066932,3.7365696177575156,8.3956266208523047,46,126636,126336,1561,1558,28,284536,284536,1736,1736,1,1555,1555]
[null,"MFA23","East","RURAL SHORT",480.5,126.94100719999,1.9449532153444999,2.1338865949248564,1.4478453994705645,5.4805715620894793,23,39330,39330,618,618,16,148877,148877,448,448,9,4222,4222]
[null,"MFA31","East","RURAL SHORT",2181,25.898023775422999,1.1561612736289,4.8012448385809279,0.50557519714860599,5.2248248925395728,8,42450,42450,249,249,33,438696,438696,1535,1535,1,2156,2156]
[null,"MFA34","East","RURAL SHORT",1530.5,188.60165840449,1.4519770717792,7.3923928467039675,5.5797286566630167,14.310792368603874,39,154686,154686,4882,4882,27,396736,396736,1231,1231,2,3023,3023]
[null,"MJG11","North","RURAL SHORT",1359.5,77.06232342604099,22.941399414884998,14.098893573610662,10.683013804839836,3.6761534771188229,19,312654,312654,3152,3152,17,107588,107588,760,760,4,5360,5360]
[null,"MOE13","East","RURAL SHORT",3054.5,32.679658741079002,0.37093555467530004,6.0587137248759326,0.50907298723453087,2.5382922418440668,13,44266,44266,402,402,6,220715,220715,654,654,3,9146,9146]
[null,"MOE14","East","RURAL SHORT",1806,151.26550520068,10.080178695747,3.1627247746207696,8.4917477547147939,6.5948075885287878,45,557138,557138,10630,10630,55,432681,432681,1778,1778,9,14613,14613]
[null,"MOE21","East","RURAL SHORT",692.5,186.19993449012,0.71679953679957997,2.8578838324886475,6.0475090619424048,6.6153897464333609,42,253282,249117,2493,2476,35,277066,277066,1260,1260,2,959,959]
[null,"MOE22","East","RURAL LONG",2651,257.40372476050999,3.2913290699017002,5.1441908984795655,5.0520552825638303,6.3400649371303714,43,325255,197414,1775,1453,21,408178,408178,1096,1096,0,0,0]
[null,"MOE23","East","RURAL SHORT",1184.5,9.422726746722299,1.1009274791657,2.0195712416253109,1.354661508694454,1.1335527699178165,8,133004,133004,1340,1340,4,111295,111295,323,323,0,0,0]
[null,"MOE24","East","RURAL SHORT",2097.5,17.379192791257999,1.5132497955452999,5.2204011340125964,0.18432986019766887,11.643636408181878,6,12420,12420,139,139,17,784539,784539,2285,2285,2,4166,4166]
[null,"MOE31","East","RURAL LONG",2360.5,216.19773345683001,0.80903310325127997,7.811549142135636,5.7242870804574313,15.823628019044278,60,298460,298460,2796,2796,37,825032,825032,2304,2304,2,3763,3763]
[null,"MOE32","East","RURAL SHORT",1050.5,136.80805151347002,3.6153049300226998,2.7054633614225865,5.6504103105203844,2.018543577485989,28,353593,353593,5370,5370,19,126317,126317,631,631,3,2193,2193]
[null,"MSD1","North","RURAL LONG",2004.5,322.34830280316999,3.1031254232390002,4.8012448385809279,5.9058555162852286,7.6714205705460339,33,431140,431140,7000,7000,21,560030,560030,1300,1300,2,3976,3976]
[null,"MSD2","North","RURAL LONG",1649,401.87589347403997,1.6743683071687001,3.9629322477175912,7.3572350227747689,6.9233580907874641,51,615046,615046,5391,5391,66,578775,578775,1997,1997,0,0,0]
[null,"MSD4","North","RURAL LONG",2582.5,221.76691698047998,3.5333861467687,8.4593361441663966,6.9978851783460145,10.046535659583348,19,337934,337934,3692,3692,41,485156,474224,1466,1400,1,2585,2585]
[null,"MWE1","East","RURAL SHORT",1,1.0680336918538,0.36940333095000999,0.1829045652792734,0,0,0,0,0,0,0,0,0,0,0,0,0,0,0]
[null,"MWE236","East","RURAL SHORT",33,6.5326746785181005,0.7787133063766799,0.83450207908668494,0.18297105133609384,4.0157622265994362E-2,1,1982,1982,28,28,1,435,435,1,1,0,0,0]
[null,"MWT11","East","RURAL SHORT",2048.5,29.520267877456,3.6955299493016001,5.3728216050786566,0.40640349860125935,0.44371010303336555,8,23857,23857,627,627,8,26047,26047,243,243,0,0,0]
[null,"MWT12","East","URBAN",1075,7.9406186489083002,1.2727584769769,4.3820885431492593,9.2648143315443077E-2,4.2233376250295747,2,3542,3542,53,53,7,161461,161461,460,460,0,0,0]
[null,"MWT13","East","RURAL SHORT",874.5,17.723759046329999,0.23334167805330999,1.5242047106606118,1.2805874438858722,1.9113941242608311E-2,4,109876,109398,468,467,1,1640,1640,10,10,2,1281,1281]
[null,"MWT14","East","RURAL SHORT",1306.5,197.92445397209002,1.2875147197142001,2.553042890356525,1.4336822722808913,9.8083894072897824,38,101341,88413,1070,1006,52,693314,693314,2451,2451,2,2565,2565]
[null,"MWT21","East","URBAN",2913,18.011665281429,0.69320328717250002,6.4778700203076003,5.6045814331824735,8.3896005961712508,10,371550,371550,5583,5583,11,556180,556180,1935,1935,2,3565,3565]
[null,"MWT22","East","RURAL SHORT",922,16.997724328642001,1.063888145248,3.6199861878189532,9.2384947734808334E-2,0.40868769829105189,2,2695,2695,34,34,5,11922,11922,99,99,1,970,970]
[null,"MWT24","East","RURAL SHORT",803.5,51.432695701223999,4.3466851061109004,5.9825034893429017,13.560608553552296,22.431218418050356,18,256018,229838,1587,1477,11,423491,423491,1394,1394,2,1593,1593]
[null,"MWT31","East","RURAL SHORT",719,123.74262671554999,0.64232255755721002,1.6385200639601578,3.5852821926405838,3.5433234196761414,24,262410,262410,365,365,14,259339,259339,916,916,1,706,706]
[null,"MWT32","East","RURAL SHORT",467,52.886777401131006,4.1575294363906998,4.9536653096469889,19.10569057087584,6.2810037639585543,11,236167,236167,1316,1316,9,77640,77640,215,215,6,2269,2269]
[null,"MWT34","East","RURAL SHORT",1612.5,24.258360898797999,1.4066974561401,2.7816735969556166,1.4576652065360092,2.1606950764757005,7,150214,150214,1842,1842,11,222662,222662,856,856,1,1606,1606]
[null,"MWT35","East","URBAN",1,6.2554229363651999E-3,5.9918387953728995,2.7435684791891011,0,0,0,0,0,0,0,0,0,0,0,0,0,0,0]
[null,"MYT1","North","RURAL SHORT",323,51.763525635922996,1.0061972372625001,0.95262794416288255,2.1657420875721214,1.6962915208552778,14,168023,67216,705,614,4,131602,131602,326,326,2,631,631]
[null,"MYT2","North","RURAL SHORT",1760.5,101.72703590327001,1.5633121079186001,6.1349239604089636,1.6272026365269874,5.370442438787582,13,78252,78252,2089,2089,35,258264,258264,954,954,0,0,0]
[null,"MYT7","North","RURAL LONG",3113,340.61380975002999,5.1352399093166996,8.9928077928976116,14.231944427072431,27.205360886864987,59,741707,463848,9685,9158,96,1417825,1337225,5213,4888,1,3101,3101]
[null,"MYT8","North","RURAL SHORT",676,102.33100932446,0.63449063237446002,2.1719917126913719,0.73646555641174727,7.3106707524464127,17,41813,41813,922,922,32,415065,415065,659,659,3,1973,1973]
[null,"NLA31","East","RURAL LONG",915.5,209.92434269637999,0.23727204886186998,2.4006224192904639,3.338653962233495,10.315043211918644,24,215413,215413,1816,1816,26,665536,665536,1780,1780,0,0,0]
[null,"NLA32","East","RURAL SHORT",1458.5,79.415055475714993,2.6487017591026001E-2,3.2008298923872855,3.108577631223191,8.5471462514704974,8,183747,183747,3256,3256,14,505219,505219,1199,1199,0,0,0]
[null,"NLA34","East","RURAL SHORT",1305.5,135.97529990942999,1.8839651404463,2.7435684791891011,2.0064402823681475,1.4486994845214953,31,158086,158086,2795,2795,6,114142,114142,1004,1004,0,0,0]
[null,"NRN11","Central","URBAN",76.5,2.2238709990382,4.7386991493253996,4.0391424832506218,1.4564752910819707,0,2,4857,210,4,1,0,0,0,0,0,1,76,0]
[null,"NRN12","Central","URBAN",897,3.6341878772145999,6.1964384779451001,7.0875519045718463,2.1818267085143041E-2,0,0,315,315,2,2,0,0,0,0,0,0,0,0]
[null,"NRN13","Central","URBAN",2599,1.7581986778359999E-3,10.996824151368001,5.2204011340125964,1.9177966775207988E-3,0,0,177,177,2,2,0,0,0,0,0,0,0,0]
[null,"NRN14","Central","URBAN",2103.5,10.911663297914,9.3128772606004002,6.3254495492415392,0.78771522132543115,6.3028523401604239,6,43198,43198,437,437,11,345646,345646,1090,1090,2,4215,4215]
[null,"NRN15","Central","URBAN",4,4.7068891637970997E-2,0.13111524452466,1.8671507705592496,0,1.8124709623517442E-2,0,0,0,0,0,2,702,702,6,6,0,0,0]
[null,"NW13","Central","URBAN",18,0.11027608584626,0,8.7230000000000002E-2,1.7631299713737659E-2,0,1,1260,1260,18,18,0,0,0,0,0,0,0,0]
[null,"OFR21","Central","URBAN",3812.5,22.734526265264002,20.958282409430002,13.717842395945508,1.5527388106260327,8.5519788822487168,5,95650,95650,7874,7874,17,526809,526809,1532,1532,2,7630,7630]
[null,"OFR22","Central","RURAL SHORT",4098.5,25.929808481565001,21.952132306351,7.4686030822369984,0.71515744708023854,45.610926025767903,8,63090,63090,206,206,11,4023720,4023720,1098,1098,1,4163,4163]
[null,"OFR23","Central","RURAL LONG",6188.5,290.06545452183997,29.908330511974999,13.413001453813386,13.032140726219367,28.155960508525315,78,760491,759024,9259,9258,95,1643042,1643042,5197,5197,3,16309,16309]
[null,"OFR24","Central","URBAN",1851.5,7.8419608370337004,7.2005404957241002,7.0875519045718463,5.3649741428459789E-2,5.3236115304068042E-2,3,2205,2205,13,13,4,2188,2188,60,60,2,3886,0]
[null,"PHI11","East","RURAL SHORT",1354,25.522791803911002,0.54216120759977005,2.553042890356525,2.3111753292035666,3.0226636059217009,16,228318,228318,3822,3822,27,298605,288816,1840,1769,3,3780,3780]
[null,"PHI12","East","RURAL SHORT",4513,61.377185611654994,11.179601015593001,7.8877593776686661,4.2546657683093994,24.888614804441772,24,486607,486607,4930,4930,61,2846516,2836769,13043,12986,0,0,0]
[null,"PHI13","East","URBAN",4401.5,24.640400854465998,4.0189751113967001,10.250276679192615,10.606209959064817,15.211899019991035,14,782711,782711,11016,11016,36,1122599,1122599,4332,4332,7,30412,30412]
[null,"PHM21","Central","URBAN",1703,6.5777458891593996,5.0350337762987998,9.2595436172632155,0.31107007777718404,3.4001877587898615,2,8417,8417,1709,1709,6,92003,92003,457,457,0,0,0]
[null,"PHM22","Central","RURAL SHORT",785,51.169012251521998,7.8866691482337004,7.0494467868053308,5.4784080991855131,16.889918342920179,22,75677,75677,759,759,14,233312,233312,681,681,4,2753,2753]
[null,"PHM24","Central","RURAL SHORT",2500,28.080943153983,10.198784742199001,4.2677731898497129,0.73978481463428547,0.86499443080316818,16,75314,75314,2898,2898,7,88061,88061,271,271,0,0,0]
[null,"PHM31","Central","RURAL SHORT",579,50.420084710171004,1.6826793474711998,2.0957814771583414,2.884042997369118,0.95573065678710467,18,112274,112274,1962,1962,5,37206,37206,199,199,2,1447,1447]
[null,"PHM32","Central","URBAN",4333.5,10.871383647769001,17.703974314221998,11.850691625386256,0.76459497848973035,1.6525245141883609,3,63655,63655,3470,3470,12,137578,137578,905,905,0,0,0]
[null,"PHM33","Central","RURAL LONG",2784,208.23244895747999,8.1581989308088989,9.3357538527962483,6.616432932030504,17.56625026373165,46,253981,253611,1721,1720,24,674305,674305,2121,2121,3,7741,7741]
[null,"PHM34","Central","URBAN",2716,9.8153787253245994,4.7526010155615008,5.3728216050786566,0.10251040632366901,2.2698484198188305,3,9424,9424,2770,2770,6,208672,208672,1586,1586,0,0,0]
[null,"RUBA12","North","RURAL LONG",2593.5,434.27126925117,3.5590857066168002,7.7734440243691205,13.637561196851735,34.198364282909708,37,698058,408603,7150,6732,163,1750492,1750492,5506,5506,3,7677,7677]
[null,"RUBA22","North","RURAL SHORT",1236,168.32531827168,8.7004230152569999,3.9248271299510757,6.3451025801961185,14.158734285916449,23,383075,383075,1739,1739,109,854810,854810,3173,3173,2,2467,2467]
[null,"RUBA24","North","RURAL SHORT",1029,74.767574373114002,0.32581686560255996,3.5437759522859231,8.7351639705221942,10.451051528539258,17,503099,53143,1412,394,39,601925,601925,1497,1497,1,487,487]
[null,"RWN22","Central","URBAN",2618,13.647770946832001,1.5632047133814999,5.6014523116777495,1.5446158349915888,1.5467433899839487,13,141571,141571,998,998,8,141766,141766,726,726,4,13021,13021]
[null,"RWN24","Central","URBAN",2749,15.732178694653999,4.1590835277347997,6.0968188426424472,22.541424511675373,26.492885364928664,36,1651841,1651603,19882,19881,28,1941405,1941405,5281,5281,2,5073,5073]
[null,"RWN26","Central","RURAL SHORT",2567,41.453965461546005,7.2008961675960004,8.4593361441663966,12.329190035884661,15.09653806207139,27,675151,675151,7037,7037,22,826692,826692,2745,2745,7,17267,17267]
[null,"RWN31","Central","RURAL SHORT",2346.5,42.185493974810996,4.0479820113748,6.9732365512722998,1.0719240004654993,3.4007781793004508,17,66909,66909,873,873,19,212275,212275,976,976,2,4674,4674]
[null,"RWN32","Central","URBAN",1651.5,5.6554400112761005,0.39488924929010999,3.3532503634533466,1.2917847462270653,1.7033905124693134,9,115352,115352,746,746,3,152107,152107,488,488,2,5121,5121]
[null,"RWN33","Central","RURAL SHORT",1129.5,7.2538474070122003,0.55547131289359009,2.2482019482244029,0.19373568859314433,0.5982034975427637,4,19674,19674,254,254,5,60748,60748,222,222,0,0,0]
[null,"RWN34","Central","RURAL SHORT",2104.5,30.609995605413999,9.4681133439418002,5.715767664977295,10.835103999453414,16.280153742841012,23,654691,654515,9177,9176,15,983698,983698,2233,2233,9,18490,18490]
[null,"RWT11","Central","URBAN",0,0.43649740715860996,5.6701190258643001E-2,11.050484152289437,0,0,0,0,0,0,0,0,0,0,0,0,0,0,0]
[null,"RWT14","Central","URBAN",1148,4.5664677955377,4.0623874621844998,4.1153527187836518,2.3224798311999821,8.2316604828893354,3,87109,87109,1322,1322,8,308744,308744,911,911,1,1900,1900]
[null,"RWT15","Central","URBAN",2490.5,12.129227944288001,1.2356956554517999,5.6395574294442641,38.398772715146784,36.059573890465181,10,1404990,1404990,2199,2199,32,1319400,1319400,3174,3174,6,13175,13175]
[null,"RWT21","Central","URBAN",521,1.7083163397005001,3.6482277280058,7.8496542599021515,1.7255208550090737,2.7938325669487587,2,16168,16168,40,40,2,26178,26178,56,56,2,1012,1012]
[null,"RWT22","Central","URBAN",2663.5,12.316667240506,1.9778306774273,6.2111341959419937,13.12574889697496,10.513672972509076,10,935097,930372,3120,3099,13,749009,749009,2522,2522,5,17785,17785]
[null,"RWT25","Central","RURAL SHORT",2531.5,10.134569260184,10.404460928371,5.4490318406116875,9.4396030062335292,6.787464191198012,4,598337,598337,2681,2681,7,430229,430229,1012,1012,2,4158,4158]
[null,"RWT26","Central","URBAN",1,0.44491411470968001,0.37013003826592,7.2399723756379064,0.16783346592783674,0,2,4,4,2,2,0,0,0,0,0,1,1,1]
[null,"RWT31","Central","URBAN",1321,8.2034665129920992,0.54834664208992001,6.4397649025410848,0.38199241634387776,1.4926314048636056,3,27478,27478,180,180,3,107370,107370,750,750,1,1106,1106]
[null,"RWT32","Central","URBAN",3832.5,13.734619026801999,0.84847383460268,6.4778700203076003,6.6325570908918792,9.2442820312364571,16,629852,629852,5266,5266,22,877871,877871,2312,2312,8,29291,25476]
[null,"RWT33","Central","URBAN",0,0.34310043494482001,0.1925691494906,10.097856208126554,0,0,0,0,0,0,0,0,0,0,0,0,0,0,0]
[null,"RWT36","Central","URBAN",701.5,1.6704299253776,2.3961303143295001,8.5355463796994258,5.590797311222504,1.7597879402830416,3,60731,60731,769,769,1,19116,19116,59,59,3,2096,2096]
[null,"SFS1","Central","RURAL SHORT",1083.5,13.534790666323001,4.0224639082269,1.3146265629447778,11.074378515539145,21.766766469078547,20,645055,644931,9088,9087,15,1267860,1267860,2565,2565,11,51569,51569]
[null,"SLE11","East","URBAN",1739,13.553568336721,1.1148918839881001,7.7734440243691205,8.5296644374552582,3.5992395464483891,6,301976,301976,3633,3633,14,127424,127424,493,493,3,5161,5161]
[null,"SLE14","East","RURAL SHORT",4457,59.615657199396999,4.5264098792586998,8.9928077928976116,6.0908958252290519,6.7859237529786851,22,492703,492703,9637,9637,40,548925,548925,1913,1913,2,8849,8849]
[null,"SLE31","East","RURAL LONG",4835,459.76149067700999,19.416171057179,7.8877593776686661,28.892671845992872,40.803717505042599,56,2452103,2452103,26436,26436,65,3462986,3462986,9218,9218,3,14334,14334]
[null,"SLE32","East","RURAL SHORT",1429.5,164.86662834987001,4.5002683464229003,5.9443983715763871,6.5171362576526741,5.2939566903733759,26,195203,195203,4348,4348,24,158566,158566,557,557,1,74,74]
[null,"SMG21","Central","URBAN",2679.5,4.9747658694375003,12.212743505100999,5.1822960162460801,1.1625776830484469,4.5424625762718147E-4,7,115171,115171,2796,2796,1,45,45,1,1,5,14792,14792]
[null,"SMG22","Central","URBAN",2433.5,3.9959063543595005E-3,14.109826060825,6.4016597847745711,4.4686155318655736,0.36745247961201044,2,224919,224919,2374,2374,1,18495,18495,1,1,0,0,0]
[null,"SMG23","Central","URBAN",1029,2.6684203425372996,6.3808267828686001,7.1256570223383608,15.037480208456966,2.3453046697160058,2,345208,345208,1401,1401,2,53840,53840,133,133,0,0,0]
[null,"SMG31","Central","URBAN",3019,3.8884704878295002,14.860092192325999,8.1163900842677581,0.67800072492812558,1.4643634062672659,6,50724,48759,118,117,4,109555,109555,315,315,0,0,0]
[null,"SMG32","Central","URBAN",280.5,1.9441755815938,3.6398311612548002,4.6107192497483513,2.2549019726255202E-2,6.4527981260955496,0,185,185,1,1,7,52941,52941,195,195,0,0,0]
[null,"SMG33","Central","URBAN",2724,2.1857222710333999,12.238498112843001,4.8393499563474434,0.23151624943819102,4.6217696767336676E-2,3,24355,24355,83,83,1,4862,4862,22,22,0,0,0]
[null,"SMR1","North","RURAL SHORT",463,62.831547184256998,1.1078829918722,4.9536653096469889,7.5633710800622627,3.7159930179720551,12,99187,95074,1475,1018,33,48732,39060,233,194,1,472,472]
[null,"SMR2","North","RURAL SHORT",2716.5,42.641494245573,1.4901412699765002,8.3450207908668492,2.759561528176528,10.011537256070655,11,143382,119262,5605,2925,25,520182,520182,1349,1349,6,15959,15959]
[null,"SMR3","North","RURAL LONG",1459,225.47960258479,4.5431171013117,5.1441908984795655,6.1523063923355039,26.29262514005438,36,295289,220812,5107,2747,70,1006036,1006036,2991,2991,3,4127,4127]
[null,"SMR4","North","RURAL SHORT",350,177.67206307271002,1.6282699577604001,2.0576763593918259,0.64813560102292234,0.12976466603472425,9,32985,29853,785,437,18,6604,6604,37,37,0,0,0]
[null,"SMR5","North","RURAL LONG",2231,467.82538694507002,4.7658273238198996,6.4016597847745711,5.950142695876111,18.716036058529085,44,315576,295614,6363,4145,201,992637,992637,5823,5823,4,8791,8791]
[null,"SMR8","North","RURAL LONG",3162.5,468.91217693408004,15.879925827396001,10.936168798989891,22.53445391241819,8.4675368283192078,49,960899,799180,12896,9619,115,361067,361067,1612,1612,1,626,626]
[null,"TGN11","East","RURAL SHORT",3515,45.681428040541,8.6436211301257,7.7353389066026059,1.5612141466926137,10.363729938474973,13,126886,126886,3655,3655,17,842301,842301,3235,3235,4,11965,11965]
[null,"TGN12","East","URBAN",1737.5,3.2558500893157003,1.5704181128068,9.4500692060957938,2.9581971368609996,4.0027170181641439E-2,4,209446,209446,537,537,3,2834,2834,16,16,0,0,0]
[null,"TGN23","East","RURAL SHORT",2425,170.32451863905999,5.3436511748121003,5.410926722845173,4.1061839758338792,6.7260882116462728,38,254809,247361,3802,3750,23,417387,417387,1444,1444,3,5644,5644]
[null,"TGN31","East","RURAL LONG",1953.5,339.43090284176998,6.8748638000233004,3.8867220121845603,6.116376149149036,13.25202391220499,47,335945,335945,4461,4461,43,727874,726410,2407,2393,2,1746,1746]
[null,"TGN41","East","RURAL LONG",1783,333.69841963149997,3.4185763415629,3.7343015411184992,9.5858682935233794,16.148616008589535,58,518317,518317,5462,5462,47,873171,873171,2649,2649,4,5485,5485]
[null,"TGN42","East","URBAN",617.5,3.7827959399868001,2.2778874905877,7.2018672578713918,3.2315073042923068E-2,4.6555613705906121E-2,0,472,472,7,7,1,680,680,17,17,0,0,0]
[null,"TGN43","East","RURAL SHORT",3850,20.453865456512002,3.9494044736278,7.3161826111709383,3.4781871377045772,9.2158149110146201,7,329432,329432,2799,2799,15,872864,872864,2441,2441,4,16832,16832]
[null,"TGN44","East","RURAL SHORT",1288,26.953805947254001,5.2538455920215004,3.8105117766515302,1.4730866155318563,6.3843919762049941,2,52646,52646,302,302,5,228169,228169,658,658,0,0,0]
[null,"TRC01","North","RURAL SHORT",229,111.01213779850001,1.2551717921463001,0.47,1.3125203504120713,0.26402509801142876,7,82840,82840,954,954,1,16664,16664,155,155,0,0,0]
[null,"TT1","Central","URBAN",197,4.8020911092347998,0.52319368393377996,5.7919779005103251,3.7781051968906092,0,1,17240,17240,193,193,0,0,0,0,0,1,193,193]
[null,"TT12","Central","URBAN",334.5,7.4642192513529997,1.2483614369115001,6.5921853736071467,3.0395620006141777,4.6743338779179903E-2,3,26856,26856,700,700,1,413,413,1,1,3,1001,1001]
[null,"TT2","Central","URBAN",430.5,5.5630516291170995,1.4196417191697002,8.1926003198007891,4.4662385616169651,0.21287327854696422,6,39213,39213,346,346,2,1869,1869,2,2,2,867,867]
[null,"TT4","Central","URBAN",2607.5,9.2457973937146001,0.69255894553142006,4.1534578365501673,7.895776564918125E-2,1.1872584466964544,2,7672,7672,46,46,5,115361,115361,394,394,1,2585,2585]
[null,"TT5","Central","URBAN",1739,7.1710981284431998,3.3995771635459002,7.5448133177700285,0.86636091816371363,10.193186359210266,8,49808,49808,243,243,7,586017,586017,1852,1852,2,3443,3443]
[null,"TT6","Central","URBAN",4674,19.199210939845003,3.9904847009465003,8.7641770862985187,1.091636664998566,2.4613926740509213,10,103241,103241,441,441,12,232785,232785,778,778,2,9274,9274]
[null,"TT7","Central","URBAN",447,7.9022366356576006,1.1735241811781001,9.5262794416288248,10.837939632503698,17.496390736880091,5,76728,76728,506,506,2,123867,123867,262,262,1,434,434]
[null,"TT9","Central","URBAN",3499,14.014713559434,0.51169010085944999,6.7446058446732087,0.60723883299298687,16.61421108562746,8,51180,51180,437,437,25,1400298,1400298,4179,4179,1,3484,3484]
[null,"UWY1","Central","RURAL SHORT",1076.5,15.656059269557,2.9942386935636001,1.2346058156350954,3.287652066038302,12.750421702088321,17,264204,264204,4089,4089,21,1024656,1024656,2730,2730,16,45375,45375]
[null,"WGI14","East","RURAL SHORT",3486,147.81996841534001,1.0602194597524999,6.1730290781754791,2.0481427594559367,10.818245288243025,36,236990,236935,5007,5006,74,1251776,1251776,3527,3527,4,13426,13426]
[null,"WGI21","East","URBAN",1,2.2696908207336999,4.1379852087928004,12.307953038584442,0.4150753781885469,0.4994287985969823,2,4404,4404,2,2,2,5299,5299,2,2,1,1,1]
[null,"WGI22","East","RURAL LONG",835.5,212.05765833793001,0.41353582008181999,3.2770401279203156,6.6047220947722964,1.497520826324644,40,251589,251589,1751,1751,57,57044,56761,325,324,0,0,0]
[null,"WGI23","East","RURAL SHORT",2385,123.93894004955,3.341146252208,4.4964038964488058,1.6906173966533373,3.4098768401384318,36,156064,153484,4542,4537,44,314772,314734,4520,4518,4,10167,7551]
[null,"WGI24","East","URBAN",2779.5,18.848528345684002,3.1008396084209,6.9732365512722998,11.019677753868553,10.769816567086243,11,507275,507275,6185,6185,18,495773,495773,2461,2461,4,11065,11065]
[null,"WGI31","East","RURAL SHORT",3630.5,65.357018638321009,6.2668557923764006,7.2780774934044219,6.9130405524142899,2.1271417168895708,20,599711,599711,11163,11163,15,184531,184241,858,857,1,3635,0]
[null,"WGI33","East","RURAL SHORT",2866.5,46.191233026014999,2.8763830624343001,4.4582987786822894,5.5584608044645964,8.1425064628591119,15,426144,426144,6509,6509,15,624252,624252,1951,1951,5,14189,14189]
[null,"WGI34","East","RURAL SHORT",3369,50.234798498570996,6.6776620711199,6.5540802558406313,1.9425332574780148,0.5507613205044618,13,178071,178071,10222,10222,22,50488,50488,1356,1356,0,0,0]
[null,"WGL11","East","RURAL SHORT",3650.5,54.28347244007,4.1994339725304997,10.517012503558222,3.6673697860964136,7.123090525246047,16,165184,165184,2140,2140,20,320835,320835,1555,1555,0,0,0]
[null,"WGL12","East","RURAL LONG",3346,319.01324550671001,5.6523390086829002,9.3738589705627628,5.5876455502929598,40.015234123729236,61,271799,271799,3706,3706,71,1946455,1946455,9522,9522,7,23318,23318]
[null,"WGL13","East","RURAL SHORT",3968.5,139.69965581459999,10.2975914653,7.7353389066026059,2.4503034193303588,9.9156095830052298,26,177482,177212,5178,5177,36,718214,718214,2634,2634,0,0,0]
[null,"WGL14","East","URBAN",1,7.4160591882221993,0.17250251013407,4.2296680720831983,0.6506775122330799,0,1,8,8,1,1,0,0,0,0,0,0,0,0]
[null,"WGL15","East","RURAL SHORT",2398.5,110.86058573135,4.6561250592684997,6.4778700203076003,2.8610876305613893,6.9928590523913936,28,142070,126239,3916,3755,39,347237,347237,1544,1544,4,9534,9534]
[null,"WGL21","East","RURAL LONG",4550,209.31723832187998,17.242904329611999,10.555117621324738,7.1583393431315026,4.9763036757173085,55,459094,459094,13689,13689,43,319151,319151,1468,1468,2,6123,6123]
[null,"WGL22","East","URBAN",0,9.2734375560653,0.62410593012769,3.6199861878189532,0,0,0,0,0,0,0,0,0,0,0,0,0,0,0]
[null,"WGL23","East","RURAL SHORT",1335,166.09585607133999,1.2843248677194998,2.9721991857881935,3.4337024793849333,5.642272193618683,22,181647,181647,1834,1834,29,298483,298483,1164,1164,2,1722,1722]
[null,"WGL24","East","RURAL LONG",2949.5,418.37313501713999,4.9064892681462,7.0494467868053308,28.220671561316372,57.248132909484575,51,1393492,1393492,12640,12640,126,2826822,2826822,8760,8760,4,9259,9259]
[null,"WN1","North","URBAN",1558.5,11.492997380774002,3.0662747094145,10.059751090360038,24.58549165484412,7.3223726362154586,9,650277,157313,4154,1663,15,193674,193674,583,583,0,0,0]
[null,"WN2","North","RURAL LONG",3518,310.69106353647999,6.3775329881189,10.898063681223375,37.969724697991438,7.1091821747267057,46,2389206,665859,11548,8032,46,447338,447338,1294,1294,1,3492,0]
[null,"WN3","North","RURAL LONG",2844,547.97683581979004,5.3875825118717007,9.2976487350297319,18.721622340038689,24.413034924108196,56,1079782,687490,12129,11792,158,1408038,1408038,9752,9752,1,2826,2826]
[null,"WN4","North","RURAL SHORT",2659,86.063054882445996,3.0778326959537998,7.4686030822369984,20.985208249698545,5.8812856036835983,17,1238242,399459,7925,5349,39,347028,347028,1239,1239,1,1334,0]
[null,"WN5","North","RURAL LONG",2436,652.78022893577997,1.2879901617840002,7.2018672578713918,50.585418234092572,19.174746467623201,81,2375367,663860,8339,7390,187,900399,900399,4211,4211,3,3787,3787]
[null,"WN6","North","RURAL LONG",4338.5,465.66076642601001,6.4063785744380004,9.4500692060957938,22.818255586697799,3.2310917759688667,51,1668376,927201,9959,8704,76,236244,236244,943,943,1,4331,4331]
[null,"WN7","North","URBAN",106.5,2.5973286805671001,0.91525376432431993,7.811549142135636,1.4400464735480587,9.9043539371488993,1,10262,10262,103,103,5,70580,70580,223,223,1,102,102]
[null,"WO11","North","URBAN",207,3.3299627519696,1.7395010141187,5.6776625472107796,1.4293042824926924E-2,1.3370911029770349E-2,0,62,62,1,1,1,58,58,1,1,1,207,207]
[null,"WO12","North","URBAN",1,4.8699086992869001E-3,0.91810328884868997,5.10608578071305,0,0,0,0,0,0,0,0,0,0,0,0,0,0,0]
[null,"WO13","North","RURAL SHORT",327,10.712544982117999,11.717558648961999,4.1153527187836518,0.38979243106031103,7.6860698902649283,3,3501,3501,8,8,4,69034,69034,252,252,1,351,351]
[null,"WO14","North","URBAN",566.5,11.87432981563,2.5587299632739002,7.0494467868053308,5.841559452900146,0.57135014900370551,6,92191,92191,370,370,4,9017,9017,27,27,5,2785,2785]
[null,"WO22","North","RURAL SHORT",4110.5,14.39831489849,19.127849849434998,9.0690180284306408,4.5482571471351241,3.3953640195217498,6,322108,322108,7116,7116,10,240460,240460,735,735,4,13517,13517]
[null,"WO23","North","URBAN",628.5,0.99843114414108003,3.5310914203450996,5.10608578071305,1.6404320484716215E-2,3.6386169115704905,0,355,355,5,5,4,78742,78742,106,106,0,0,0]
[null,"WO31","North","URBAN",4018,8.9843907169884005,14.619229869066,8.5736514974659421,1.0843870042716259,2.7905898120545714,1,87394,87394,4048,4048,19,224902,224902,779,779,1,2768,2768]
[null,"WO32","North","URBAN",2464,12.444077427799,2.0523940432157,9.8692255015274615,1.2910140797079108,4.4717891999680397,5,65158,65158,2590,2590,12,225693,225693,1168,1168,0,0,0]
[null,"WO33","North","URBAN",90,4.7888417760908997,2.2150890632883002,8.8022822040650333,1.8295164197629659E-3,2.5308310473387698E-2,1,6,6,2,2,2,83,83,2,2,1,89,89]
[null,"WO34","North","URBAN",0,1.8106400502514001E-2,0.35546195461141,5.4871369583782021,0,0,0,0,0,0,0,0,0,0,0,0,0,0,0]
[null,"WOTS11","North","RURAL LONG",2973,391.06249193805996,13.797119281386999,9.4500692060957938,25.282115682365056,16.812375057796103,54,1001489,1001489,9186,9186,92,665981,665981,2644,2644,1,2946,2946]
[null,"WOTS12","North","RURAL SHORT",2060,21.508744007653,5.4328549507255,8.0401798487347271,9.7820449257801041,5.4597789078081318,9,394098,394098,1291,1291,8,219963,219963,571,571,7,13586,11539]
[null,"WOTS13","North","RURAL LONG",1989.5,470.44093067862002,1.8356688190346999,5.4871369583782021,3.0236243934786224,14.740274991758827,39,174593,150293,2588,2561,39,851147,851147,2684,2684,0,0,0]
[null,"WOTS23","North","URBAN",2,2.0010019641513001E-3,0.96665281418531002,2.5149377725900095,0,0,0,0,0,0,0,0,0,0,0,0,0,0,0]
[null,"WOTS24","North","RURAL LONG",2213,696.11656598089996,1.6584401807700999,7.8877593776686661,35.778130303376912,13.082419521283105,49,2249071,2160299,6514,5020,55,822382,822382,3453,3453,6,12453,12453]
[null,"WOTS25","North","RURAL SHORT",2984,152.57789227229,18.418834351363,9.5643845593953412,0.87983383450170405,3.3284236015995314,27,37772,37772,251,251,22,142892,142892,1072,1072,3,9001,9001]
[null,"WT10","Central","URBAN",974,2.9735782915431002,2.2879662630961999,5.6395574294442641,5.3447580655843412,9.2113241320966122,2,153358,153358,746,746,9,264302,264302,810,810,2,1378,1378]
[null,"WT11","Central","URBAN",2192.5,10.322330741114,0.80149460141914997,5.8681881360433552,0.272204520338793,6.8884632083559456,4,18197,18197,87,87,9,460497,392577,1020,876,2,4364,4364]
[null,"WT12","Central","URBAN",2762.5,13.915009553895,0.79634394768238992,7.6210235533030604,7.2821602296879098,14.521133218949268,17,401143,401143,3600,3600,12,799907,799907,2392,2392,5,13747,13747]
[null,"WT13","Central","URBAN",3470,13.017861106962,11.229396624794001,13.222475864980808,4.9024861989148221,6.8399352427604709,4,212628,212628,1568,1568,7,296658,296658,704,704,1,3367,3367]
[null,"WT15","Central","URBAN",1920,7.9601546713708,0.28838531613363,4.0391424832506218,0.24295513225288595,6.9968019958831533,3,29236,29236,156,156,12,841960,841960,2362,2362,1,1912,1912]
[null,"WT5","Central","URBAN",1410.5,6.2449258960153999,1.0060176262934,5.2204011340125964,0.42780019306164602,20.787871377623965,2,14517,14517,119,119,13,705417,705417,2065,2065,0,0,0]
[null,"WT6","Central","URBAN",3479.5,13.134367536734,7.3214271910314004,7.9639696132016979,2.2190557008167016,4.263845001048475,12,183951,177321,4372,4342,12,353456,342468,1064,997,8,30533,27050]
[null,"WT7","Central","URBAN",2433,10.463697379296001,0.49149824011782001,4.8393499563474434,2.0400757444934685,17.362838263144784,9,173358,172410,1204,1203,26,1475429,1475429,3731,3731,6,14090,11669]
[null,"WT8","Central","URBAN",1872,8.0584348760405007,2.6445537214714001,8.3831259086333656,1.0969591687584888,5.2703664728235697,7,82629,82629,334,334,12,396993,396993,1378,1378,1,1849,1849]
[null,"WT9","Central","URBAN",2819.5,3.9265035092346001,10.050166392089,7.0875519045718463,0.37758456745039309,10.035377207883098,5,27240,27240,176,176,10,723980,723980,1966,1966,2,5631,5631]
[null,"WYK12","Central","RURAL SHORT",2101.5,104.92370234560001,1.9787589423645,5.715767664977295,7.7934453631095115,17.476502599287056,29,415212,413931,7875,7638,44,931097,931097,2590,2590,3,13786,13786]
[null,"WYK13","Central","RURAL SHORT",3532.5,110.01404353748001,18.278120669067,5.3728216050786566,15.535482135841107,32.751889779293229,42,1326773,1105358,18058,14250,50,2414044,2414044,8779,8779,2,8756,8756]
[null,"WYK23","Central","RURAL SHORT",3765,187.28388864170998,7.2684171865566993,9.6024896771618558,30.612216210143796,25.514980986165398,45,1772658,1772658,12146,12146,68,1477493,1477493,5527,5527,1,31,31]
[null,"WYK24","Central","RURAL SHORT",3405.5,83.158798785946999,12.358076262588,9.1071231461971571,19.739194040364445,40.548649870840848,43,1231074,1231074,16300,16300,118,2528897,2528897,8552,8552,11,32293,32293]
[null,"YN31","East","URBAN",17.5,5.9489523640898998,0.27844560874605001,3.0750000000000002,1.3423358661749383,0,6,9693,9693,53,53,0,0,0,0,0,0,0,0]
[null,"YN35","East","URBAN",2,0.25648053010205002,2.0197331506910002E-3,0.75,4.9508618267229965E-2,1.5612119006438936,3,2138,2138,7,7,3,67420,67420,60,60,0,0,0]
[null,"YN38","East","RURAL SHORT",2,0.53280452008687995,0.27974636223832,0.20499999999999999,1.6484230402543619E-2,9.7073801259423526E-2,2,936,936,4,4,2,5512,5512,4,4,0,0,0]
[]
[]
[]
[null,"To enter further feeder ID's - please insert new lines above this line. "]

{"sheet":"3.6.9 Network-reliability","index":7,"n_rows":22,"n_cols":3,"rows_kept":22,"cut":false,"hidden":false,"merged":[]}
[null,"ANNUAL REPORTING STATEMENT"]
[null,"AusNet (D)"]
[null,"Annual Reporting RIN Response 2017"]
[null,"3.6 QUALITY OF SERVICES"]
[]
[]
[null,"3.6.9 - NETWORK FEEDER RELIABILITY - PLANNED OUTAGES"]
[null,null,"2017"]
[null,"3.6.9.1 - PLANNED MINUTES OFF SUPPLY (SAIDI)"]
[null,"CBD","0"]
[null,"Urban",180.16116993046012]
[null,"Short rural",247.00136671165779]
[null,"Long rural",381.60966518005722]
[null,""]
[]
[null,null,"2017"]
[null,"3.6.9.2 - PLANNED INTERRUPTIONS TO SUPPLY (SAIFI)"]
[null,"CBD","0"]
[null,"Urban",0.54848400310275847]
[null,"Short rural",0.79898133292586648]
[null,"Long rural",1.3301937029887505]
[null,""]

{"sheet":"4.1 Public lighting","index":8,"n_rows":53,"n_cols":4,"rows_kept":53,"cut":false,"hidden":false,"merged":[[5,1,5,2]]}
[null,"ANNUAL REPORTING STATEMENT"]
[null,"AusNet (D)"]
[null,"Annual Reporting RIN Response 2017"]
[null,"4.1 PUBLIC LIGHTING"]
[]
[null,"Tables 4.1.1 - 4.1.3 deliberately omitted."]
[]
[null,"4.1.4 - PUBLIC LIGHTING METRICS BY TARIFF"]
[null,null,"Number of Lights","Public Lighting Revenue"]
[null,"Tariff categories","0's","$0's, nominal"]
[null,"50W Colour Corrected Mercury Vapour C",71,4108.6599999999953]
[null,"80W Colour Corrected Mercury Vapour C",19501,713713.83000000007]
[null,"125W Colour Corrected Mercury Vapour C",332,18367.059999999983]
[null,"250W Colour Corrected Mercury Vapour C",668,67054.549999999916]
[null,"400W Colour Corrected Mercury Vapour C",141,14740.439999999995]
[null,"50W High Pressure Sodium C",0,0]
[null,"100W High Pressure Sodium C",2465,240381.20999999979]
[null,"150W High Pressure Sodium C",14457,1317991.5899999999]
[null,"250W High Pressure Sodium C",7048,657202.63]
[null,"400W High Pressure Sodium C",281,38127.109999999855]
[null,"32W Compact Fluorescent C",2707,90769.989999999947]
[null,"42W Compact Fluorescent C",1336,37593.159999999931]
[null,"2x14W T5 Fluorescent C",21271,693779.07999999903]
[null,"2x24W T5 Fluorescent C",1584,61328.229999999923]
[null,"18W LED C",23946,344520.6800000004]
[null,"70W Metal Halide C",31,4984.7999999999993]
[null,"100W Metal Halide C",34,7540.2000000000025]
[null,"150W Metal Halide C",33,8314.32]
[null,"50W Colour Corrected Mercury Vapour NE",128,8459.0799999999927]
[null,"80W Colour Corrected Mercury Vapour NE",8177,398145.34999999992]
[null,"125W Colour Corrected Mercury Vapour NE",21,1772.6699999999998]
[null,"250W Colour Corrected Mercury Vapour NE",275,30191.110000000004]
[null,"400W Colour Corrected Mercury Vapour NE",91,10200.169999999993]
[null,"50W High Pressure Sodium NE",0,0]
[null,"100W High Pressure Sodium NE",729,86230.210000000021]
[null,"150W High Pressure Sodium NE",7159,769262.11000000022]
[null,"250W High Pressure Sodium NE",5363,558082.52000000014]
[null,"400W High Pressure Sodium NE",361,53385.780000000021]
[null,"32W Compact Fluorescent NE",718,24337.49]
[null,"42W Compact Fluorescent NE",3222,106446]
[null,"2x14W T5 Fluorescent NE",8015,302571.44]
[null,"2x24W T5 Fluorescent NE",1159,51756.250000000036]
[null,"18W LED NE",19876,287496.37999999989]
[null,"70W Metal Halide C NE",0,0]
[null,"100W Metal Halide C NE",0,0]
[null,"150W Metal Halide C NE",0,0]
[]
[]
[]
[]
[]
[null,"To enter further tariff categories - please insert new lines above this line. "]
[null,"Total ",151200,7008854.1000000006]

{"sheet":"6.2 STPIS Reliability","index":9,"n_rows":94,"n_cols":5,"rows_kept":94,"cut":false,"hidden":false,"merged":[[76,1,81,1],[82,1,87,1],[88,1,93,1],[75,1,75,2],[22,1,27,1],[32,1,37,1],[38,1,43,1],[44,1,49,1],[5,1,5,2],[31,1,31,2],[66,1,71,1],[60,1,65,1],[53,1,53,2],[54,1,59,1],[16,1,21,1],[9,1,9,2],[10,1,15,1]]}
[null,"ANNUAL REPORTING STATEMENT"]
[null,"AusNet (D)"]
[null,"Annual Reporting RIN Response 2017"]
[null,"6.2 RELIABILITY AND CUSTOMER SERVICE PERFORMANCE"]
[]
[null,"Did the MAIFI parameter of the STPIS apply during the period?\nNB:This flag is set from the response on worksheet 3.6.8 Network feeders",null,"Yes"]
[]
[]
[null,"6.2.1 - UNPLANNED MINUTES OFF SUPPLY (SAIDI)"]
[null,null,null,"2017"]
[null,"Total sustained minutes off supply","CBD",0]
[null,null,"Urban",90.154882761999374]
[null,null,"Short rural",153.56426855459631]
[null,null,"Long rural",280.15455468281965]
[null,null,"",null,""]
[null,null,"Whole Network",148.73244347981318,""]
[null,"Total of excluded events*\n\n*see 3.3 of STPIS","CBD",0]
[null,null,"Urban",8.9280105602656405]
[null,null,"Short rural",29.372762540216126]
[null,null,"Long rural",68.048467350063234]
[null,null,"",null,""]
[null,null,"Whole Network",27.451889839172981,""]
[null,"Total sustained minutes off supply after removing excluded events","CBD",0]
[null,null,"Urban",81.226872201733741]
[null,null,"Short rural",124.19150601438018]
[null,null,"Long rural",212.10608733275643]
[null,null,"",null,""]
[null,null,"Whole Network",121.28055364064021,""]
[]
[]
[null,"6.2.2 - UNPLANNED INTERRUPTIONS TO SUPPLY (SAIFI)"]
[null,null,null,"2017"]
[null,"Total sustained interruptions","CBD",0]
[null,null,"Urban",1.0015819985574894]
[null,null,"Short rural",1.763329683109651]
[null,null,"Long rural",2.7434517073820142]
[null,null,"",null,""]
[null,null,"Whole Network",1.6135917986899861,""]
[null,"Total of excluded events*\n\n*see 3.3 of STPIS","CBD",0]
[null,null,"Urban",3.4542002912238204E-2]
[null,null,"Short rural",0.13832480199658748]
[null,null,"Long rural",0.24647207614990349]
[null,null,"",null,""]
[null,null,"Whole Network",0.11361825862576266,""]
[null,"Total sustained interruptions after removing excluded events","CBD",0]
[null,null,"Urban",0.96703999564525134]
[null,null,"Short rural",1.6250048811130635]
[null,null,"Long rural",2.4969796312321106]
[null,null,"",null,""]
[null,null,"Whole Network",1.4999735400642236,""]
[]
[]
[null,"6.2.3 - UNPLANNED MOMENTARY INTERRUPTIONS TO SUPPLY (MAIFI)"]
[null,null,null,"2017"]
[null,"Total momentary interruptions","CBD",0]
[null,null,"Urban",2.9320387028292259]
[null,null,"Short rural",5.0519333452177824]
[null,null,"Long rural",9.9889502762430933]
[null,null,""]
[null,null,"Whole Network",5.0099439966639316]
[null,"Total of excluded events*\n\n*see 3.3 of STPIS","CBD",0]
[null,null,"Urban",0.10598029476205381]
[null,null,"Short rural",0.13339445335778136]
[null,null,"Long rural",0.32079977368035678]
[null,null,""]
[null,null,"Whole Network",0.15380772587788774]
[null,"Total momentary interruptions after removing excluded events","CBD",0]
[null,null,"Urban",2.8260584080671718]
[null,null,"Short rural",4.9185388918600008]
[null,null,"Long rural",9.668150502562737]
[null,null,""]
[null,null,"Whole Network",4.8561362707860436]
[]
[]
[null,"6.2.4 - DISTRIBUTION CUSTOMER NUMBERS"]
[null,null,null,"2017"]
[null,"Customer numbers at the start of the period","CBD",0]
[null,null,"Urban",293720]
[null,null,"Short rural",288985]
[null,null,"Long rural",119221]
[null,null,""]
[null,null,"Whole Network",701926]
[null,"Customer numbers at the end of the period","CBD",0]
[null,null,"Urban",294144]
[null,null,"Short rural",300020]
[null,null,"Long rural",121147]
[null,null,""]
[null,null,"Whole Network",715311]
[null,"Average customer numbers","CBD",0]
[null,null,"Urban",293932]
[null,null,"Short rural",294503]
[null,null,"Long rural",120184]
[null,null,""]
[null,null,"Whole Network",708619]

{"sheet":"6.6 STPIS Customer Service","index":10,"n_rows":12,"n_cols":4,"rows_kept":12,"cut":false,"hidden":false,"merged":[]}
[null,"ANNUAL REPORTING STATEMENT"]
[null,"AusNet (D)"]
[null,"Annual Reporting RIN Response 2017"]
[null,"6.6 STPIS CUSTOMER SERVICE"]
[]
[]
[null,"6.6.1 - TELEPHONE ANSWERING"]
[null,null,"Number of calls \nafter removing excluded events","Total number of calls"]
[null,null,"2017","2017"]
[null,"Number of calls received",85073,88282]
[null,"Number of calls answered within 30 seconds",72566]
[null,"Percentage of calls answered within 30 seconds",0.85298508339896328]

{"sheet":"6.7 STPIS Daily Performance","index":11,"n_rows":380,"n_cols":14,"rows_kept":380,"cut":false,"hidden":false,"merged":[[12,14,12,15],[12,3,13,3],[6,1,6,5],[8,1,8,6],[12,4,12,5],[12,6,12,7],[12,10,12,11],[12,8,12,9],[12,12,12,13],[11,1,13,1],[11,2,11,3],[12,2,13,2],[11,4,11,13]]}
[null,"ANNUAL REPORTING STATEMENT",null,null,null,null,null,null,"1-Jan-2017"]
[null,"AusNet (D)"]
[null,"Annual Reporting RIN Response 2017"]
[null,"6.7 STPIS DAILY PERFORMANCE"]
[]
[]
[null,"Did the MAIFI parameter of the STPIS apply during the period?\nThis flag is set from the response on worksheet 3.6.8 Network feeders",null,null,null,null,"Yes"]
[]
[null,"The excluded events to be removed from the data refer only to events listed in clause 3.3(a) of the STPIS, with respect to reliability data, and in clause 5.4 of the STPIS with respect to customer service parameters.\n\n*Customer service information must be reported as per the definitions in the STPIS, that is excluding: \n   • calls to payment lines and automated interactive services \n   • calls abandoned by the customer within 30 seconds of the call being queued for response by a human operator (where the time in which a telephone call is abandoned is not measured, then an estimate of the number of calls abandoned within 30 seconds will be determined by taking 20 per cent of all calls abandoned)."]
[]
[null,"6.7.1 - DAILY PERFORMANCE DATA - UNPLANNED"]
[null,"Date","Customer service*",null,"MAIFI"]
[null,null,"Number of calls received\n(after removing excluded events)","Number of calls answered in 30 seconds\n(after removing excluded events)","CBD",null,"Urban",null,"Short rural",null,"Long rural",null,"Network"]
[null,null,null,null,"All events","After removing excluded events","All events","After removing excluded events","All events","After removing excluded events","All events","After removing excluded events","All events","After removing excluded events"]
[null,"1-Jan-2017",98,91,"N/A","N/A",8.0664915694786555E-3,8.0664915694786555E-3,2.2465004541557372E-2,2.2465004541557372E-2,2.0984490447979766E-2,2.0984490447979766E-2,1.6241461378724942E-2,1.6241461378724942E-2]
[null,"2017-01-02",92,86,"N/A","N/A",1.0083964998707184E-2,1.0083964998707184E-2,8.4107944754289021E-3,8.4107944754289021E-3,8.2124076416161887E-3,8.2124076416161887E-3,9.0711715824523358E-3,9.0711715824523358E-3]
[null,"2017-01-03",164,160,"N/A","N/A",1.8252520991249677E-2,1.8252520991249677E-2,1.9588967835587133E-2,1.9588967835587133E-2,2.3788524262797043E-2,2.3788524262797043E-2,1.9746873670388226E-2,1.9746873670388226E-2]
[null,"2017-01-04",235,199,"N/A","N/A",9.1721894860035662E-3,9.1721894860035662E-3,7.3639442789110443E-2,7.3639442789110443E-2,0.13358683352193304,0.13358683352193304,5.7065967089484679E-2,5.7065967089484679E-2]
[null,"2017-01-05",251,212,"N/A","N/A",0,0,1.5178139404589096E-3,1.5178139404589096E-3,4.4914464487785397E-2,4.4914464487785397E-2,8.2484439793767735E-3,8.2484439793767735E-3]
[null,"2017-01-06",446,315,"N/A","N/A",8.811561857844671E-3,8.811561857844671E-3,1.8967580920365702E-2,1.8967580920365702E-2,4.9224522398988217E-2,4.9224522398988217E-2,1.9886582131287852E-2,1.9886582131287852E-2]
[null,"2017-01-07",379,358,"N/A","N/A",8.9986799667950406E-3,8.9986799667950406E-3,2.9099922751080211E-3,2.9099922751080211E-3,2.6517672901550954E-2,2.6517672901550954E-2,9.4394938884604339E-3,9.4394938884604339E-3]
[null,"2017-01-08",152,147,"N/A","N/A",5.4808595185280948E-3,5.4808595185280948E-3,2.6689077342297602E-2,2.6689077342297602E-2,8.2373693669706444E-3,8.2373693669706444E-3,1.4762527368393572E-2,1.4762527368393572E-2]
[null,"2017-01-09",271,233,"N/A","N/A",1.5993495094103399E-2,1.5993495094103399E-2,1.2176467092809059E-2,1.2176467092809059E-2,4.3541569593290287E-2,4.3541569593290287E-2,1.9079377690534468E-2,1.9079377690534468E-2]
[null,"2017-01-10",232,193,"N/A","N/A",1.3152701985493244E-2,1.3152701985493244E-2,9.5618882691997521E-3,9.5618882691997521E-3,5.68295280569793E-2,5.68295280569793E-2,1.9068088117936519E-2,1.9068088117936519E-2]
[null,"2017-01-11",178,160,"N/A","N/A",2.1705700638242858E-3,2.1705700638242858E-3,9.1951681225116936E-3,9.1951681225116936E-3,0,0,4.7218637390923322E-3,4.7218637390923322E-3]
[null,"2017-01-12",203,186,"N/A","N/A",0,0,7.6705630682252276E-3,7.6705630682252276E-3,1.7806030752845637E-2,1.7806030752845637E-2,6.2078537322974208E-3,6.2078537322974208E-3]
[null,"2017-01-13",395,307,"N/A","N/A",1.546276009417144E-2,1.546276009417144E-2,1.4648432526039677E-2,1.4648432526039677E-2,4.7119416894095718E-2,4.7119416894095718E-2,2.0493396658427632E-2,2.0493396658427632E-2]
[null,"2017-01-14",115,104,"N/A","N/A",0,0,2.0108488043395219E-2,2.0108488043395219E-2,2.0543499966717699E-2,2.0543499966717699E-2,1.1841350458674167E-2,1.1841350458674167E-2]
[null,"2017-01-15",160,151,"N/A","N/A",1.8813875318100786E-3,1.8813875318100786E-3,3.6583730189047634E-2,3.6583730189047634E-2,2.8231711375890301E-2,2.8231711375890301E-2,2.0772813580226878E-2,2.0772813580226878E-2]
[null,"2017-01-16",211,178,"N/A","N/A",0,0,1.0662048709263927E-2,1.0662048709263927E-2,7.0308859748385811E-3,7.0308859748385811E-3,5.6236183503535399E-3,5.6236183503535399E-3]
[null,"2017-01-17",385,268,"N/A","N/A",6.0660288774274321E-3,6.0660288774274321E-3,6.8386516243495385E-3,6.8386516243495385E-3,1.9420222325767157E-2,1.9420222325767157E-2,8.6520461997534638E-3,8.6520461997534638E-3]
[null,"2017-01-18",294,241,"N/A","N/A",5.3890015377706406E-3,5.3890015377706406E-3,2.4549876486617259E-3,2.4549876486617259E-3,1.3462690541170205E-2,1.3462690541170205E-2,5.5389465558689198E-3,5.5389465558689198E-3]
[null,"2017-01-19",197,152,"N/A","N/A",0,0,8.4006078046875658E-3,8.4006078046875658E-3,1.6216800905278574E-2,1.6216800905278574E-2,6.2417224500912688E-3,6.2417224500912688E-3]
[null,"2017-01-20",509,420,"N/A","N/A",3.1571928201080523E-3,3.1571928201080523E-3,3.9670291423672122E-2,3.9670291423672122E-2,0.14078413099913467,0.14078413099913467,4.167404604875543E-2,4.167404604875543E-2]
[null,"2017-01-21",144,122,"N/A","N/A",0,0,2.5195032300235143E-3,2.5195032300235143E-3,1.1299341010450643E-2,1.1299341010450643E-2,2.9635128069617151E-3,2.9635128069617151E-3]
[null,"2017-01-22",140,131,"N/A","N/A",0,0,2.6101645996213955E-2,2.6101645996213955E-2,2.1558610131132264E-2,2.1558610131132264E-2,1.4504278395215479E-2,1.4504278395215479E-2]
[null,"2017-01-23",318,272,"N/A","N/A",0,0,1.6468451031824856E-3,1.6468451031824856E-3,1.3961925048259336E-2,1.3961925048259336E-2,3.0524181911705662E-3,3.0524181911705662E-3]
[null,"2017-01-24",296,249,"N/A","N/A",3.5722548072343262E-3,3.5722548072343262E-3,1.0441337509868337E-2,1.0441337509868337E-2,4.7344072422285831E-3,4.7344072422285831E-3,6.6241567218468045E-3,6.6241567218468045E-3]
[null,"2017-01-25",333,217,"N/A","N/A",1.2346393043288923E-2,1.2346393043288923E-2,1.8502389623178073E-2,1.8502389623178073E-2,3.552885575450975E-3,3.552885575450975E-3,1.3413423442938619E-2,1.3413423442938619E-2]
[null,"2017-01-26",109,103,"N/A","N/A",1.3965815222568486E-2,1.3965815222568486E-2,1.8614443001332755E-2,1.8614443001332755E-2,5.0356120615056912E-2,5.0356120615056912E-2,2.2069703232416315E-2,2.2069703232416315E-2]
[null,"2017-01-27",200,155,"N/A","N/A",2.5567137977491394E-2,2.5567137977491394E-2,1.5246050542864662E-3,1.5246050542864662E-3,5.0589096718365173E-3,5.0589096718365173E-3,1.2096777038702771E-2,1.2096777038702771E-2]
[null,"2017-01-28",129,113,"N/A","N/A",0,0,2.1765519817319039E-2,2.1765519817319039E-2,4.5563469347001263E-2,4.5563469347001263E-2,1.6773482487403308E-2,1.6773482487403308E-2]
[null,"2017-01-29",97,91,"N/A","N/A",1.4282214934066383E-2,1.4282214934066383E-2,3.4393595979660616E-2,3.4393595979660616E-2,6.3702323104572994E-2,6.3702323104572994E-2,3.1022334302590181E-2,3.1022334302590181E-2]
[null,"2017-01-30",327,285,"N/A","N/A",3.7529088360573191E-2,3.7529088360573191E-2,6.6104701997436358E-2,6.6104701997436358E-2,5.6671437129734409E-2,5.6671437129734409E-2,5.2651744203686471E-2,5.2651744203686471E-2]
[null,"2017-01-31",260,179,"N/A","N/A",2.0685056407604482E-3,2.0685056407604482E-3,4.7945263622549894E-3,4.7945263622549894E-3,3.7151367902549422E-2,3.7151367902549422E-2,9.1516097872127236E-3,9.1516097872127236E-3]
[null,"2017-02-01",263,185,"N/A","N/A",3.7627750636201572E-3,3.7627750636201572E-3,5.5140448722846153E-2,5.5140448722846153E-2,8.4537043200426012E-3,8.4537043200426012E-3,2.5910980308868594E-2,2.5910980308868594E-2]
[null,"2017-02-02",275,209,"N/A","N/A",0,0,6.5092826037130413E-3,6.5092826037130413E-3,3.5245956200492576E-2,3.5245956200492576E-2,8.6830925243978254E-3,8.6830925243978254E-3]
[null,"2017-02-03",204,152,"N/A","N/A",1.8259325286120599E-2,1.8259325286120599E-2,4.6892640979278614E-3,4.6892640979278614E-3,2.5960194368634761E-2,2.5960194368634761E-2,1.3925687799570572E-2,1.3925687799570572E-2]
[null,"2017-02-04",182,158,"N/A","N/A",1.1866690254888885E-2,1.1866690254888885E-2,1.1320786750536922E-2,1.1320786750536922E-2,5.6330293549890172E-2,5.6330293549890172E-2,1.9180983843916016E-2,1.9180983843916016E-2]
[null,"2017-02-05",186,158,"N/A","N/A",0,0,1.3541480972147944E-2,1.3541480972147944E-2,5.3850762164680821E-2,5.3850762164680821E-2,1.4761116171818828E-2,1.4761116171818828E-2]
[null,"2017-02-06",294,253,"N/A","N/A",5.8006613774614539E-3,5.8006613774614539E-3,1.7965891630801097E-2,1.7965891630801097E-2,7.4227850629035474E-2,7.4227850629035474E-2,2.2462015880195054E-2,2.2462015880195054E-2]
[null,"2017-02-07",253,214,"N/A","N/A",0,0,1.9897963514740963E-2,1.9897963514740963E-2,6.4700792118751252E-2,6.4700792118751252E-2,1.9243076493204735E-2,1.9243076493204735E-2]
[null,"2017-02-08",316,234,"N/A","N/A",1.864036579889226E-2,1.864036579889226E-2,1.8227349513162027E-2,1.8227349513162027E-2,2.2815016973973239E-2,2.2815016973973239E-2,1.9176750254191782E-2,1.9176750254191782E-2]
[null,"2017-02-09",502,341,"N/A","N/A",2.4257311214838807E-2,2.4257311214838807E-2,2.056688822675529E-2,2.056688822675529E-2,6.5166744325367773E-2,6.5166744325367773E-2,2.9661940804537278E-2,2.9661940804537278E-2]
[null,"2017-02-10",330,284,"N/A","N/A",0,0,2.475360990144396E-2,2.475360990144396E-2,2.5560806762963455E-2,2.5560806762963455E-2,1.4622818907493947E-2,1.4622818907493947E-2]
[null,"2017-02-11",252,172,"N/A","N/A",1.2455261761223685E-2,1.2455261761223685E-2,1.8132273919576234E-3,1.8132273919576234E-3,7.8213406110630365E-3,7.8213406110630365E-3,7.2464944113087649E-3,7.2464944113087649E-3]
[null,"2017-02-12",125,122,"N/A","N/A",0,0,8.51605673975603E-3,8.51605673975603E-3,8.0110497237569064E-2,8.0110497237569064E-2,1.7126281631089226E-2,1.7126281631089226E-2]
[null,"2017-02-13",268,189,"N/A","N/A",2.4665568907094159E-2,2.4665568907094159E-2,8.1459410361541928E-3,8.1459410361541928E-3,4.1103641083671703E-3,4.1103641083671703E-3,1.4313766857625082E-2,1.4313766857625082E-2]
[null,"2017-02-14",199,172,"N/A","N/A",2.5002381503204822E-2,2.5002381503204822E-2,1.591837081179277E-2,1.591837081179277E-2,3.0619716434799972E-2,3.0619716434799972E-2,2.217977656524632E-2,2.217977656524632E-2]
[null,"2017-02-15",261,228,"N/A","N/A",2.924826150266048E-2,2.924826150266048E-2,2.3154302595054372E-2,2.3154302595054372E-2,4.0878985555481598E-2,4.0878985555481598E-2,2.8688215167964146E-2,2.8688215167964146E-2]
[null,"2017-02-16",256,221,"N/A","N/A",1.9735857273110786E-2,1.9735857273110786E-2,9.6026349521650921E-3,9.6026349521650921E-3,6.4983691672768421E-3,6.4983691672768421E-3,1.3279359768337971E-2,1.3279359768337971E-2]
[null,"2017-02-17",196,175,"N/A","N/A",1.6265666888940298E-2,1.6265666888940298E-2,7.8403409139141435E-3,7.8403409139141435E-3,3.3756573254343343E-2,3.3756573254343343E-2,1.5730608218667733E-2,1.5730608218667733E-2]
[null,"2017-02-18",140,119,"N/A","N/A",0,0,0,0,1.2938494308726619E-2,1.2938494308726619E-2,2.1944106737264127E-3,2.1944106737264127E-3]
[null,"2017-02-19",176,142,"N/A","N/A",2.7206973041383722E-2,2.7206973041383722E-2,2.4464987563772803E-2,2.4464987563772803E-2,7.6840511216135263E-2,7.6840511216135263E-2,3.4485410697011158E-2,3.4485410697011158E-2]
[null,"2017-02-20",215,175,"N/A","N/A",0,0,3.1918234989516215E-4,3.1918234989516215E-4,5.9691805897623643E-2,5.9691805897623643E-2,1.0256576705237021E-2,1.0256576705237021E-2]
[null,"2017-02-21",222,192,"N/A","N/A",0,0,1.6740095584927124E-2,1.6740095584927124E-2,2.4246155894295414E-2,2.4246155894295414E-2,1.1069425932289377E-2,1.1069425932289377E-2]
[null,"2017-02-22",336,275,"N/A","N/A",0,0,2.2611013488849838E-2,2.2611013488849838E-2,8.1974306064035149E-2,8.1974306064035149E-2,2.3300266645592798E-2,2.3300266645592798E-2]
[null,"2017-02-23",290,237,"N/A","N/A",0,0,8.2613899712226553E-3,8.2613899712226553E-3,3.805831059042801E-2,3.805831059042801E-2,9.8882543992289216E-3,9.8882543992289216E-3]
[null,"2017-02-24",222,186,"N/A","N/A",0,0,1.2950654069150516E-2,1.2950654069150516E-2,2.2215935565466287E-3,2.2215935565466287E-3,5.7590932215289331E-3,5.7590932215289331E-3]
[null,"2017-02-25",94,88,"N/A","N/A",0,0,2.9395336202578927E-2,2.9395336202578927E-2,3.9056779604606268E-2,3.9056779604606268E-2,1.8840885469402789E-2,1.8840885469402789E-2]
[null,"2017-02-26",101,92,"N/A","N/A",1.3901174421294722E-2,1.3901174421294722E-2,1.4220592354903609E-2,1.4220592354903609E-2,1.2356054050455968E-2,1.2356054050455968E-2,1.3771867372923512E-2,1.3771867372923512E-2]
[null,"2017-02-27",217,184,"N/A","N/A",9.3593075949539341E-3,9.3593075949539341E-3,1.3385285354114141E-2,1.3385285354114141E-2,2.2665246621846501E-2,2.2665246621846501E-2,1.3289238144361176E-2,1.3289238144361176E-2]
[null,"2017-02-28",416,322,"N/A","N/A",1.4656451151967122E-2,1.4656451151967122E-2,1.2750316211237596E-2,1.2750316211237596E-2,3.8590827397989746E-2,3.8590827397989746E-2,1.79236076958194E-2,1.79236076958194E-2]
[null,"2017-03-01",401,302,"N/A","N/A",0,0,1.2050831486999262E-2,1.2050831486999262E-2,1.2996738334553684E-2,1.2996738334553684E-2,7.2126256935149168E-3,7.2126256935149168E-3]
[null,"2017-03-02",296,232,"N/A","N/A",1.9926377529496619E-2,1.9926377529496619E-2,1.2386991621463315E-2,1.2386991621463315E-2,2.9196898089595955E-2,2.9196898089595955E-2,1.836531222371417E-2,1.836531222371417E-2]
[null,"2017-03-03",361,276,"N/A","N/A",1.4067879645632324E-2,1.4067879645632324E-2,1.660427330837599E-3,1.660427330837599E-3,4.9016508021034411E-2,4.9016508021034411E-2,1.4838731983429729E-2,1.4838731983429729E-2]
[null,"2017-03-04",105,99,"N/A","N/A",6.2871684607324141E-3,6.2871684607324141E-3,4.0746682965339854E-4,4.0746682965339854E-4,4.3092258536910073E-2,4.3092258536910073E-2,1.0085821919693037E-2,1.0085821919693037E-2]
[null,"2017-03-05",107,104,"N/A","N/A",3.7083407046527766E-4,3.7083407046527766E-4,5.8607312331813823E-3,5.8607312331813823E-3,1.651634160953205E-2,1.651634160953205E-2,5.3907709155208341E-3,5.3907709155208341E-3]
[null,"2017-03-06",323,281,"N/A","N/A",2.3634718234149397E-2,2.3634718234149397E-2,1.0016892895646046E-2,1.0016892895646046E-2,4.1253411435798443E-2,4.1253411435798443E-2,2.0963325117817275E-2,2.0963325117817275E-2]
[null,"2017-03-07",221,182,"N/A","N/A",1.5734931889008343E-2,1.5734931889008343E-2,2.5001485556149779E-2,2.5001485556149779E-2,4.8259335685282568E-4,4.8259335685282568E-4,1.6999273939362295E-2,1.6999273939362295E-2]
[null,"2017-03-08",199,158,"N/A","N/A",1.5996897241538858E-2,1.5996897241538858E-2,1.7813091569681073E-2,1.7813091569681073E-2,1.7240231644811289E-2,1.7240231644811289E-2,1.6962582828418959E-2,1.6962582828418959E-2]
[null,"2017-03-09",275,209,"N/A","N/A",0,0,1.9931919083878745E-3,1.9931919083878745E-3,7.2122745124142976E-2,7.2122745124142976E-2,1.3060624299252701E-2,1.3060624299252701E-2]
[null,"2017-03-10",215,178,"N/A","N/A",0,0,4.3463128496362509E-3,4.3463128496362509E-3,2.0119150635691939E-2,2.0119150635691939E-2,5.2186049334021056E-3,5.2186049334021056E-3]
[null,"2017-03-11",195,163,"N/A","N/A",2.5686213137732536E-3,2.5686213137732536E-3,2.7554944355311077E-2,2.7554944355311077E-2,3.7459229181921051E-2,3.7459229181921051E-2,1.8870520597472407E-2,1.8870520597472407E-2]
[null,"2017-03-12",227,220,"N/A","N/A",0,0,2.633254386635088E-2,2.633254386635088E-2,4.6928043666378219E-2,4.6928043666378219E-2,1.8902978118691509E-2,1.8902978118691509E-2]
[null,"2017-03-13",168,162,"N/A","N/A",9.7607609923383645E-3,9.7607609923383645E-3,1.5028734900382848E-2,1.5028734900382848E-2,5.4707781401850494E-2,5.4707781401850494E-2,1.9573296491694755E-2,1.9573296491694755E-2]
[null,"2017-03-14",296,276,"N/A","N/A",0,0,3.8848566650537771E-2,3.8848566650537771E-2,1.9911136257738136E-2,1.9911136257738136E-2,1.9522493415003984E-2,1.9522493415003984E-2]
[null,"2017-03-15",315,285,"N/A","N/A",3.7937346052828544E-2,3.7937346052828544E-2,1.5663704043259397E-2,1.5663704043259397E-2,1.8222059508753246E-3,1.8222059508753246E-3,2.2555154854128137E-2,2.2555154854128137E-2]
[null,"2017-03-16",241,224,"N/A","N/A",6.290570608167876E-3,6.290570608167876E-3,2.6349521650919773E-3,2.6349521650919773E-3,2.4354323370831391E-2,2.4354323370831391E-2,7.8349633829768763E-3,7.8349633829768763E-3]
[null,"2017-03-17",207,172,"N/A","N/A",1.3921587305907489E-2,1.3921587305907489E-2,3.3276457755027544E-4,3.3276457755027544E-4,6.7729481461758639E-3,6.7729481461758639E-3,7.0616276600173437E-3,7.0616276600173437E-3]
[null,"2017-03-18",150,130,"N/A","N/A",0,0,1.4363205745282298E-2,1.4363205745282298E-2,4.2110430672968116E-2,4.2110430672968116E-2,1.3111427375943473E-2,1.3111427375943473E-2]
[null,"2017-03-19",123,116,"N/A","N/A",1.0546657049929915E-3,1.0546657049929915E-3,2.2230711114506668E-2,2.2230711114506668E-2,4.6395526858816483E-2,4.6395526858816483E-2,1.7545407013788095E-2,1.7545407013788095E-2]
[null,"2017-03-20",321,268,"N/A","N/A",1.2839704421430807E-2,1.2839704421430807E-2,1.2145907080585055E-2,1.2145907080585055E-2,7.6615855687945156E-2,7.6615855687945156E-2,2.3368004081180494E-2,2.3368004081180494E-2]
[null,"2017-03-21",428,304,"N/A","N/A",1.6163602465876462E-2,1.6163602465876462E-2,1.8380149574282051E-2,1.8380149574282051E-2,5.9808293949277773E-2,5.9808293949277773E-2,2.4487082964952226E-2,2.4487082964952226E-2]
[null,"2017-03-22",295,252,"N/A","N/A",0,0,1.2994796309029635E-2,1.2994796309029635E-2,3.699327697530453E-2,3.699327697530453E-2,1.1674829262854413E-2,1.1674829262854413E-2]
[null,"2017-03-23",240,222,"N/A","N/A",2.3529251663650094E-2,2.3529251663650094E-2,2.1504061934958109E-2,2.1504061934958109E-2,3.7717167010583773E-2,3.7717167010583773E-2,2.5093897492092006E-2,2.5093897492092006E-2]
[null,"2017-03-24",233,186,"N/A","N/A",1.2560728331722984E-2,1.2560728331722984E-2,1.6981180125805382E-2,1.6981180125805382E-2,2.8922319110696933E-2,2.8922319110696933E-2,1.7172851118055766E-2,1.7172851118055766E-2]
[null,"2017-03-25",157,140,"N/A","N/A",2.4185866118694121E-2,2.4185866118694121E-2,6.6858515632295138E-3,6.6858515632295138E-3,2.8215070225653997E-2,2.8215070225653997E-2,1.7596210090478868E-2,1.7596210090478868E-2]
[null,"2017-03-26",220,192,"N/A","N/A",1.3972619517439408E-2,1.3972619517439408E-2,2.5334250133700054E-2,2.5334250133700054E-2,1.0741862477534447E-2,1.0741862477534447E-2,1.8146576754628902E-2,1.8146576754628902E-2]
[null,"2017-03-27",1425,858,"N/A","N/A",6.3402419607256094E-2,6.3402419607256094E-2,9.3187663941732238E-2,9.3187663941732238E-2,0.1001963655727884,0.1001963655727884,8.2021567317251812E-2,8.2021567317251812E-2]
[null,"2017-03-28",381,281,"N/A","N/A",0,0,1.9694230099914263E-4,1.9694230099914263E-4,5.0006656460094522E-3,5.0006656460094522E-3,9.29978542756081E-4,9.29978542756081E-4]
[null,"2017-03-29",301,248,"N/A","N/A",1.7010737177306317E-4,1.7010737177306317E-4,2.170100423595725E-2,2.170100423595725E-2,2.4628902349730412E-2,2.4628902349730412E-2,1.3266658999165277E-2,1.3266658999165277E-2]
[null,"2017-03-30",313,284,"N/A","N/A",1.6595675190180043E-2,1.6595675190180043E-2,2.2532915679832937E-2,2.2532915679832937E-2,1.1465752512813687E-2,1.1465752512813687E-2,1.8193146241595442E-2,1.8193146241595442E-2]
[null,"2017-03-31",229,203,"N/A","N/A",0,0,6.791113827556642E-5,6.791113827556642E-5,2.3389136657125741E-2,2.3389136657125741E-2,3.9950975030993404E-3,3.9950975030993404E-3]
[null,"2017-04-01",126,115,"N/A","N/A",1.4431909421226678E-2,1.4431909421226678E-2,3.3065933226373294E-2,3.3065933226373294E-2,8.803168475004992E-3,8.803168475004992E-3,2.1221574090995367E-2,2.1221574090995367E-2]
[null,"2017-04-02",112,104,"N/A","N/A",2.626457820176095E-3,2.626457820176095E-3,4.3361261788949163E-3,4.3361261788949163E-3,1.3063302935498902E-3,1.3063302935498902E-3,3.1130996438845445E-3,3.1130996438845445E-3]
[null,"2017-04-03",221,192,"N/A","N/A",1.1288325190860472E-2,1.1288325190860472E-2,7.9761631904652769E-3,7.9761631904652769E-3,2.7923850096518672E-2,2.7923850096518672E-2,1.2733226693912169E-2,1.2733226693912169E-2]
[null,"2017-04-04",239,219,"N/A","N/A",3.0279112175605243E-2,3.0279112175605243E-2,1.8067758338214446E-2,1.8067758338214446E-2,1.1024762031551621E-2,1.1024762031551621E-2,2.1938461950965153E-2,2.1938461950965153E-2]
[null,"2017-04-05",406,287,"N/A","N/A",0,0,2.1823244284853268E-2,2.1823244284853268E-2,1.0783465353125209E-2,1.0783465353125209E-2,1.0898671146745392E-2,1.0898671146745392E-2]
[null,"2017-04-06",259,245,"N/A","N/A",1.1135228556264714E-2,1.1135228556264714E-2,2.3442924932725529E-2,2.3442924932725529E-2,5.8427078479664517E-2,5.8427078479664517E-2,2.4271169889016446E-2,2.4271169889016446E-2]
[null,"2017-04-07",268,253,"N/A","N/A",2.3740184804648696E-2,2.3740184804648696E-2,1.3976112257111569E-2,1.3976112257111569E-2,7.5217999068095589E-3,7.5217999068095589E-3,1.6931536503774599E-2,1.6931536503774599E-2]
[null,"2017-04-08",313,274,"N/A","N/A",0,0,4.5160906953251673E-2,4.5160906953251673E-2,5.0131465086866805E-2,5.0131465086866805E-2,2.7271373806921496E-2,2.7271373806921496E-2]
[null,"2017-04-09",325,252,"N/A","N/A",3.0609120476844984E-2,3.0609120476844984E-2,5.5748253410412472E-2,5.5748253410412472E-2,0.17401650802103441,0.17401650802103441,6.5379326111299665E-2,6.5379326111299665E-2]
[null,"2017-04-10",519,400,"N/A","N/A",6.675013268374998E-3,6.675013268374998E-3,2.950399402381983E-2,2.950399402381983E-2,7.5717233575184714E-2,7.5717233575184714E-2,2.78725435477623E-2,2.78725435477623E-2]
[null,"2017-04-11",325,264,"N/A","N/A",0,0,1.4648432526039677E-2,1.4648432526039677E-2,1.2039872195966184E-2,1.2039872195966184E-2,8.1299034670983053E-3,8.1299034670983053E-3]
[null,"2017-04-12",409,290,"N/A","N/A",0,0,3.9863838167757491E-3,3.9863838167757491E-3,1.3154829261798576E-2,1.3154829261798576E-2,3.8878465634188211E-3,3.8878465634188211E-3]
[null,"2017-04-13",285,197,"N/A","N/A",1.0403766857640542E-2,1.0403766857640542E-2,6.0950246602320861E-3,6.0950246602320861E-3,5.3434733408773215E-2,5.3434733408773215E-2,1.5911241380234923E-2,1.5911241380234923E-2]
[null,"2017-04-14",125,119,"N/A","N/A",0,0,1.2325871597015305E-3,1.2325871597015305E-3,2.9995673300938559E-2,2.9995673300938559E-2,5.5996280085828971E-3,5.5996280085828971E-3]
[null,"2017-04-15",83,73,"N/A","N/A",0,0,5.2495309887012846E-3,5.2495309887012846E-3,1.531817879251814E-2,1.531817879251814E-2,4.7797227986568231E-3,4.7797227986568231E-3]
[null,"2017-04-16",224,130,"N/A","N/A",0,0,1.672311780035823E-2,1.672311780035823E-2,2.6476070025960193E-2,2.6476070025960193E-2,1.1440570631446963E-2,1.1440570631446963E-2]
[null,"2017-04-17",113,109,"N/A","N/A",4.0206578392281207E-2,4.0206578392281207E-2,1.7792718228198404E-2,1.7792718228198404E-2,1.0117819343673035E-2,1.0117819343673035E-2,2.5788206206865893E-2,2.5788206206865893E-2]
[null,"2017-04-18",258,208,"N/A","N/A",1.1305335928037778E-2,1.1305335928037778E-2,3.1371550326397907E-2,3.1371550326397907E-2,4.9590627704186917E-3,4.9590627704186917E-3,1.8568524530477259E-2,1.8568524530477259E-2]
[null,"2017-04-19",284,230,"N/A","N/A",8.8183661527155947E-3,8.8183661527155947E-3,3.8172850824695882E-2,3.8172850824695882E-2,3.428909006190508E-2,3.428909006190508E-2,2.5338034499522662E-2,2.5338034499522662E-2]
[null,"2017-04-20",213,184,"N/A","N/A",0,0,2.0067741360429877E-2,2.0067741360429877E-2,6.3569193902682552E-3,6.3569193902682552E-3,9.4183259398392793E-3,9.4183259398392793E-3]
[null,"2017-04-21",245,188,"N/A","N/A",9.0224949988432692E-3,9.0224949988432692E-3,4.4773813465080942E-2,4.4773813465080942E-2,1.9178925647340743E-2,1.9178925647340743E-2,2.5603339455574473E-2,2.5603339455574473E-2]
[null,"2017-04-22",126,114,"N/A","N/A",0,0,1.2142511523671276E-2,1.2142511523671276E-2,4.9715436330959199E-2,4.9715436330959199E-2,1.3478338485376828E-2,1.3478338485376828E-2]
[null,"2017-04-23",86,82,"N/A","N/A",0,0,0,0,7.6133262331092326E-3,7.6133262331092326E-3,1.2912448658904615E-3,1.2912448658904615E-3]
[null,"2017-04-24",232,214,"N/A","N/A",1.050583128070438E-2,1.050583128070438E-2,1.1344555648933372E-2,1.1344555648933372E-2,2.3131198828463023E-3,2.3131198828463023E-3,9.4648954268058208E-3,9.4648954268058208E-3]
[null,"2017-04-25",160,159,"N/A","N/A",6.0864417620401998E-3,6.0864417620401998E-3,4.3598950772913642E-3,4.3598950772913642E-3,3.7276176529321705E-3,3.7276176529321705E-3,4.9688231396724757E-3,4.9688231396724757E-3]
[null,"2017-04-26",403,233,"N/A","N/A",8.4611406719921622E-3,8.4611406719921622E-3,2.030543034439436E-2,2.030543034439436E-2,1.0825068228715968E-2,1.0825068228715968E-2,1.3784568142096205E-2,1.3784568142096205E-2]
[null,"2017-04-27",312,189,"N/A","N/A",0,0,5.9367917080500168E-2,5.9367917080500168E-2,8.9446182520135798E-3,8.9446182520135798E-3,2.6190397230667843E-2,2.6190397230667843E-2]
[null,"2017-04-28",237,191,"N/A","N/A",0,0,9.7792039116815655E-3,9.7792039116815655E-3,0,0,4.0642461352617806E-3,4.0642461352617806E-3]
[null,"2017-04-29",134,105,"N/A","N/A",5.8687043261706788E-3,5.8687043261706788E-3,1.3045729662736309E-2,1.3045729662736309E-2,5.691273380816082E-3,5.691273380816082E-3,8.8213897887227041E-3,8.8213897887227041E-3]
[null,"2017-04-30",127,98,"N/A","N/A",1.1172652178054788E-2,1.1172652178054788E-2,2.6383477220057556E-3,2.6383477220057556E-3,4.1220129135325835E-2,4.1220129135325835E-2,1.272193712131422E-2,1.272193712131422E-2]
[null,"2017-05-01",317,239,"N/A","N/A",1.4731298395547269E-2,1.4731298395547269E-2,2.6346126094005991E-2,2.6346126094005991E-2,3.8857085801770616E-3,3.8857085801770616E-3,1.7718984192481569E-2,1.7718984192481569E-2]
[null,"2017-05-02",316,250,"N/A","N/A",0,0,1.6774051154064905E-2,1.6774051154064905E-2,4.3533249018172133E-2,4.3533249018172133E-2,1.4354691558292649E-2,1.4354691558292649E-2]
[null,"2017-05-03",285,224,"N/A","N/A",0,0,5.2019931919083879E-3,5.2019931919083879E-3,1.4369633229048792E-2,1.4369633229048792E-2,4.5990896370896326E-3,4.5990896370896326E-3]
[null,"2017-05-04",240,189,"N/A","N/A",1.1931331056162649E-2,1.1931331056162649E-2,1.2190049320464174E-3,1.2190049320464174E-3,1.0650336151234773E-2,1.0650336151234773E-2,7.2620175736309456E-3,7.2620175736309456E-3]
[null,"2017-05-05",222,203,"N/A","N/A",3.1731829130547201E-2,3.1731829130547201E-2,7.7520564341559068E-3,7.7520564341559068E-3,4.8525594089063435E-2,4.8525594089063435E-2,2.4614090656679157E-2,2.4614090656679157E-2]
[null,"2017-05-06",144,124,"N/A","N/A",0,0,8.6926256992725024E-4,8.6926256992725024E-4,1.531817879251814E-2,1.531817879251814E-2,2.9592792172374841E-3,2.9592792172374841E-3]
[null,"2017-05-07",134,126,"N/A","N/A",1.2319175863805234E-2,1.2319175863805234E-2,1.2359827166153088E-3,1.2359827166153088E-3,2.1591892431604871E-2,2.1591892431604871E-2,9.2856734618133735E-3,9.2856734618133735E-3]
[null,"2017-05-08",221,192,"N/A","N/A",0,0,0,0,0,0,0,0]
[null,"2017-05-09",187,167,"N/A","N/A",7.05605378114666E-3,7.05605378114666E-3,1.9354674408536429E-4,1.9354674408536429E-4,4.7593689675830397E-3,4.7593689675830397E-3,3.8144643415321503E-3,3.8144643415321503E-3]
[null,"2017-05-10",228,200,"N/A","N/A",0,0,0,0,1.866304999001531E-2,1.866304999001531E-2,3.1653139171500602E-3,3.1653139171500602E-3]
[null,"2017-05-11",248,206,"N/A","N/A",8.2297946463807947E-3,8.2297946463807947E-3,1.120533781546846E-4,1.120533781546846E-4,1.6691073687013246E-2,1.6691073687013246E-2,6.2911143302072977E-3,6.2911143302072977E-3]
[null,"2017-05-12",173,165,"N/A","N/A",1.8490671311731967E-2,1.8490671311731967E-2,4.0542949550513158E-3,4.0542949550513158E-3,6.0324169606603209E-3,6.0324169606603209E-3,1.0377939610664976E-2,1.0377939610664976E-2]
[null,"2017-05-13",104,92,"N/A","N/A",0,0,0,0,1.1923384144312054E-2,1.1923384144312054E-2,2.0222446916076846E-3,2.0222446916076846E-3]
[null,"2017-05-14",55,51,"N/A","N/A",0,0,1.6583899966893322E-2,1.6583899966893322E-2,3.2907874592291816E-2,3.2907874592291816E-2,1.2473566524159332E-2,1.2473566524159332E-2]
[null,"2017-05-15",184,175,"N/A","N/A",8.1719581399779546E-3,8.1719581399779546E-3,7.266491795485607E-3,7.266491795485607E-3,9.1775943553218404E-3,9.1775943553218404E-3,7.9662046644280379E-3,7.9662046644280379E-3]
[null,"2017-05-16",240,175,"N/A","N/A",2.2644693330430166E-2,2.2644693330430166E-2,5.7588645257680322E-3,5.7588645257680322E-3,4.326699061439127E-3,4.326699061439127E-3,1.2520136011125874E-2,1.2520136011125874E-2]
[null,"2017-05-17",268,209,"N/A","N/A",0,0,5.7384911842853627E-4,5.7384911842853627E-4,1.6108633428742594E-2,1.6108633428742594E-2,2.9705687898354334E-3,2.9705687898354334E-3]
[null,"2017-05-18",211,185,"N/A","N/A",0,0,7.0084294700384544E-3,7.0084294700384544E-3,3.0370099181255407E-3,3.0370099181255407E-3,3.4277964800523836E-3,3.4277964800523836E-3]
[null,"2017-05-19",198,160,"N/A","N/A",0,0,5.976180168249845E-4,5.976180168249845E-4,4.0279904146974639E-2,4.0279904146974639E-2,7.079973215489011E-3,7.079973215489011E-3]
[null,"2017-05-20",100,88,"N/A","N/A",0,0,4.5670240490318422E-3,4.5670240490318422E-3,2.3979897490514546E-2,2.3979897490514546E-2,5.9651279214415088E-3,5.9651279214415088E-3]
[null,"2017-05-21",70,66,"N/A","N/A",0,0,0,0,7.6882114091726024E-3,7.6882114091726024E-3,1.3039456350631546E-3,1.3039456350631546E-3]
[null,"2017-05-22",211,206,"N/A","N/A",0,0,4.0203393859135324E-3,4.0203393859135324E-3,7.3221061039739068E-4,7.3221061039739068E-4,1.795042043073953E-3,1.795042043073953E-3]
[null,"2017-05-23",219,207,"N/A","N/A",0,0,1.4213801241076051E-2,1.4213801241076051E-2,4.0021966318311919E-3,4.0021966318311919E-3,6.5860544143287259E-3,6.5860544143287259E-3]
[null,"2017-05-24",367,304,"N/A","N/A",0,0,2.5840188113853024E-2,2.5840188113853024E-2,2.8797510483924649E-2,2.8797510483924649E-2,1.5623357278987213E-2,1.5623357278987213E-2]
[null,"2017-05-25",262,224,"N/A","N/A",0,0,6.5907759696437213E-3,6.5907759696437213E-3,1.5883977900552487E-2,1.5883977900552487E-2,5.4331068127631442E-3,5.4331068127631442E-3]
[null,"2017-05-26",174,165,"N/A","N/A",0,0,4.4244106586531521E-3,4.4244106586531521E-3,1.2647274179591293E-3,1.2647274179591293E-3,2.0532910162520453E-3,2.0532910162520453E-3]
[null,"2017-05-27",162,108,"N/A","N/A",1.4751711280160036E-2,1.4751711280160036E-2,5.4091221636488655E-2,5.4091221636488655E-2,1.2455900951873794E-2,1.2455900951873794E-2,3.0711871056146572E-2,3.0711871056146572E-2]
[null,"2017-05-28",455,351,"N/A","N/A",1.5551215927493435E-2,1.5551215927493435E-2,3.6091374436549778E-2,3.6091374436549778E-2,4.5105837715502896E-2,4.5105837715502896E-2,2.9100284567789299E-2,2.9100284567789299E-2]
[null,"2017-05-29",240,214,"N/A","N/A",0,0,1.2631471719255355E-2,1.2631471719255355E-2,0,0,5.2496512580464663E-3,5.2496512580464663E-3]
[null,"2017-05-30",247,232,"N/A","N/A",0,0,8.101798796275074E-3,8.101798796275074E-3,1.6524662184650204E-2,1.6524662184650204E-2,6.1697514247793421E-3,6.1697514247793421E-3]
[null,"2017-05-31",356,302,"N/A","N/A",0,0,1.258053836554868E-2,1.258053836554868E-2,1.2014910470611729E-2,1.2014910470611729E-2,7.2662511633551762E-3,7.2662511633551762E-3]
[null,"2017-06-01",266,254,"N/A","N/A",0,0,2.6858855187986519E-3,2.6858855187986519E-3,4.0521200825401052E-3,4.0521200825401052E-3,1.803509222522415E-3,1.803509222522415E-3]
[null,"2017-06-02",186,164,"N/A","N/A",3.6334934610726291E-3,3.6334934610726291E-3,7.4057096289505183E-3,7.4057096289505183E-3,5.0722225920255611E-2,5.0722225920255611E-2,1.3187631990979632E-2,1.3187631990979632E-2]
[null,"2017-06-03",102,95,"N/A","N/A",9.0939400949879567E-3,9.0939400949879567E-3,0,0,1.5085202689209877E-2,1.5085202689209877E-2,6.3306278343001204E-3,6.3306278343001204E-3]
[null,"2017-06-04",73,66,"N/A","N/A",0,0,4.4379928863082655E-3,4.4379928863082655E-3,7.0142448246022764E-3,7.0142448246022764E-3,3.0340726356988985E-3,3.0340726356988985E-3]
[null,"2017-06-05",224,196,"N/A","N/A",0,0,1.2057622600826818E-2,1.2057622600826818E-2,0,0,5.0111590369147857E-3,5.0111590369147857E-3]
[null,"2017-06-06",221,210,"N/A","N/A",0,0,1.9229038802726632E-2,1.9229038802726632E-2,3.0910936563935298E-2,3.0910936563935298E-2,1.3234201477946173E-2,1.3234201477946173E-2]
[null,"2017-06-07",185,176,"N/A","N/A",0,0,1.2835205134082053E-3,1.2835205134082053E-3,0,0,5.3343230525310873E-4,5.3343230525310873E-4]
[null,"2017-06-08",223,212,"N/A","N/A",0,0,5.1442687243741566E-3,5.1442687243741566E-3,4.4099048126206479E-3,4.4099048126206479E-3,2.8858969953508128E-3,2.8858969953508128E-3]
[null,"2017-06-09",241,196,"N/A","N/A",0,0,1.1782582490810774E-2,1.1782582490810774E-2,2.3796844837915197E-2,2.3796844837915197E-2,8.9328743181274553E-3,8.9328743181274553E-3]
[null,"2017-06-10",171,149,"N/A","N/A",0,0,4.2953794959295763E-3,4.2953794959295763E-3,7.3886707049191239E-3,7.3886707049191239E-3,3.0383062254231295E-3,3.0383062254231295E-3]
[null,"2017-06-11",101,99,"N/A","N/A",1.874583236939156E-3,1.874583236939156E-3,6.1391669001112049E-3,6.1391669001112049E-3,2.6875457631631498E-3,2.6875457631631498E-3,3.7848292134625332E-3,3.7848292134625332E-3]
[null,"2017-06-12",90,87,"N/A","N/A",0,0,9.9523773142842584E-3,9.9523773142842584E-3,1.1748652066830859E-2,1.1748652066830859E-2,6.1288267241117753E-3,6.1288267241117753E-3]
[null,"2017-06-13",218,200,"N/A","N/A",0,0,4.6077707319971814E-3,4.6077707319971814E-3,1.7439925447646942E-2,1.7439925447646942E-2,4.8728617725899053E-3,4.8728617725899053E-3]
[null,"2017-06-14",253,222,"N/A","N/A",1.4755113427595497E-2,1.4755113427595497E-2,0,0,1.3046661785262597E-2,1.3046661785262597E-2,8.3331157738613937E-3,8.3331157738613937E-3]
[null,"2017-06-15",238,214,"N/A","N/A",0,0,4.6688907564451914E-3,4.6688907564451914E-3,3.486320974505758E-3,3.486320974505758E-3,2.531686655090151E-3,2.531686655090151E-3]
[null,"2017-06-16",229,198,"N/A","N/A",1.9436468298790196E-2,1.9436468298790196E-2,2.6892810757124302E-3,2.6892810757124302E-3,0,0,9.1798337187075987E-3,9.1798337187075987E-3]
[null,"2017-06-17",131,117,"N/A","N/A",5.5693153518500882E-3,5.5693153518500882E-3,6.6145448680401692E-3,6.6145448680401692E-3,1.4028489649204553E-2,1.4028489649204553E-2,7.4384171454739047E-3,7.4384171454739047E-3]
[null,"2017-06-18",64,60,"N/A","N/A",0,0,8.288554426532882E-3,8.288554426532882E-3,1.9237169673167808E-2,1.9237169673167808E-2,6.7074173197566814E-3,6.7074173197566814E-3]
[null,"2017-06-19",229,185,"N/A","N/A",0,0,8.5635945365489258E-3,8.5635945365489258E-3,9.7017905877654267E-3,9.7017905877654267E-3,5.2044929676546689E-3,5.2044929676546689E-3]
[null,"2017-06-20",280,247,"N/A","N/A",3.8580351918130725E-3,3.8580351918130725E-3,1.3072894118046536E-3,1.3072894118046536E-3,1.2148039672502163E-2,1.2148039672502163E-2,4.2039545961614043E-3,4.2039545961614043E-3]
[null,"2017-06-21",192,169,"N/A","N/A",2.7387286855463169E-3,2.7387286855463169E-3,1.3038938548908753E-3,1.3038938548908753E-3,2.3280969180589764E-2,2.3280969180589764E-2,5.6264407435030273E-3,5.6264407435030273E-3]
[null,"2017-06-22",219,212,"N/A","N/A",0,0,5.7384911842853622E-3,5.7384911842853622E-3,2.5793782866271719E-4,2.5793782866271719E-4,2.4286693051338627E-3,2.4286693051338627E-3]
[null,"2017-06-23",272,217,"N/A","N/A",0,0,4.7096374394105314E-3,4.7096374394105314E-3,4.9590627704186917E-3,4.9590627704186917E-3,2.7984028077167049E-3,2.7984028077167049E-3]
[null,"2017-06-24",158,125,"N/A","N/A",0,0,1.6434495462687073E-3,1.6434495462687073E-3,1.1732010916594555E-2,1.1732010916594555E-2,2.6728063125645183E-3,2.6728063125645183E-3]
[null,"2017-06-25",78,72,"N/A","N/A",0,0,0,0,5.150435998136191E-3,5.150435998136191E-3,8.7353067976633412E-4,8.7353067976633412E-4]
[null,"2017-06-26",196,181,"N/A","N/A",2.8237823714328484E-3,2.8237823714328484E-3,0,0,4.5596751647473876E-3,4.5596751647473876E-3,1.9446288799967824E-3,1.9446288799967824E-3]
[null,"2017-06-27",215,172,"N/A","N/A",0,0,5.1069175983225945E-3,5.1069175983225945E-3,1.1199494109032817E-2,1.1199494109032817E-2,4.0219102380194705E-3,4.0219102380194705E-3]
[null,"2017-06-28",239,200,"N/A","N/A",0,0,2.7673788847293315E-3,2.7673788847293315E-3,8.3538574186247747E-3,8.3538574186247747E-3,2.5669665694587427E-3,2.5669665694587427E-3]
[null,"2017-06-29",204,169,"N/A","N/A",5.1379230570335999E-2,5.1379230570335999E-2,0,0,2.6842175331158891E-2,2.6842175331158891E-2,2.5864410821902054E-2,2.5864410821902054E-2]
[null,"2017-06-30",191,178,"N/A","N/A",0,0,0,0,5.7411968315249952E-4,5.7411968315249952E-4,9.7372563657313494E-5,9.7372563657313494E-5]
[null,"2017-07-01",166,133,"N/A","N/A",0,0,3.5177969626743405E-3,3.5177969626743405E-3,1.3812154696132596E-2,1.3812154696132596E-2,3.8045859655089446E-3,3.8045859655089446E-3]
[null,"2017-07-02",199,172,"N/A","N/A",3.3443109290584219E-3,3.3443109290584219E-3,6.7911138275566425E-6,6.7911138275566425E-6,2.6991945683285629E-2,2.6991945683285629E-2,5.9679503145909961E-3,5.9679503145909961E-3]
[null,"2017-07-03",366,318,"N/A","N/A",9.1007443898588787E-3,9.1007443898588787E-3,0,0,3.9863875391067033E-2,3.9863875391067033E-2,1.0535993627036269E-2,1.0535993627036269E-2]
[null,"2017-07-04",245,223,"N/A","N/A",0,0,1.1775791376983218E-2,1.1775791376983218E-2,4.3766225121480394E-3,4.3766225121480394E-3,5.6363191195262334E-3,5.6363191195262334E-3]
[null,"2017-07-05",235,212,"N/A","N/A",2.1154552753698135E-2,2.1154552753698135E-2,0,0,6.1480729548026358E-2,6.1480729548026358E-2,1.9202151792537168E-2,1.9202151792537168E-2]
[null,"2017-07-06",309,267,"N/A","N/A",1.753126573493189E-2,1.753126573493189E-2,0,0,2.7724156293683019E-2,2.7724156293683019E-2,1.1974002936700073E-2,1.1974002936700073E-2]
[null,"2017-07-07",197,189,"N/A","N/A",6.5049058966019351E-3,6.5049058966019351E-3,8.0474698856546206E-3,8.0474698856546206E-3,4.8841775943553219E-3,4.8841775943553219E-3,6.8711161224269479E-3,6.8711161224269479E-3]
[null,"2017-07-08",104,99,"N/A","N/A",0,0,0,0,0,0,0,0]
[null,"2017-07-09",106,86,"N/A","N/A",9.6655008641454484E-3,9.6655008641454484E-3,7.7758253325523551E-4,7.7758253325523551E-4,2.5460959861545629E-3,2.5460959861545629E-3,4.7641996363346423E-3,4.7641996363346423E-3]
[null,"2017-07-10",276,214,"N/A","N/A",0,0,0,0,6.2903547893230381E-3,6.2903547893230381E-3,1.0668646105062175E-3,1.0668646105062175E-3]
[null,"2017-07-11",262,231,"N/A","N/A",0,0,1.9375047750019098E-2,1.9375047750019098E-2,2.584370631698063E-2,2.584370631698063E-2,1.2435464216641254E-2,1.2435464216641254E-2]
[null,"2017-07-12",308,276,"N/A","N/A",5.855095736428834E-3,5.855095736428834E-3,0,0,4.3167143712973442E-2,4.3167143712973442E-2,9.7499571349040429E-3,9.7499571349040429E-3]
[null,"2017-07-13",197,186,"N/A","N/A",0,0,1.1018582185210651E-2,1.1018582185210651E-2,0,0,4.5793328850432212E-3,4.5793328850432212E-3]
[null,"2017-07-14",232,206,"N/A","N/A",0,0,1.9796096807327612E-3,1.9796096807327612E-3,1.6757638287958464E-2,1.6757638287958464E-2,3.6648775046093209E-3,3.6648775046093209E-3]
[null,"2017-07-15",140,121,"N/A","N/A",2.2692323394526625E-3,2.2692323394526625E-3,2.2210337773023999E-2,2.2210337773023999E-2,2.2881581574918458E-2,2.2881581574918458E-2,1.4052695491297503E-2,1.4052695491297503E-2]
[null,"2017-07-16",97,80,"N/A","N/A",7.1581182042104972E-3,7.1581182042104972E-3,1.5775757421414079E-2,1.5775757421414079E-2,0,0,9.5255768795197981E-3,9.5255768795197981E-3]
[null,"2017-07-17",214,193,"N/A","N/A",0,0,1.4791045916418366E-2,1.4791045916418366E-2,1.7323437395992812E-2,1.7323437395992812E-2,9.0852835481997716E-3,9.0852835481997716E-3]
[null,"2017-07-18",265,228,"N/A","N/A",5.0964168583209719E-3,5.0964168583209719E-3,0,0,1.6840844039139987E-2,1.6840844039139987E-2,4.9702343362472189E-3,4.9702343362472189E-3]
[null,"2017-07-19",371,300,"N/A","N/A",1.6510621504293509E-2,1.6510621504293509E-2,6.2410336075245541E-3,6.2410336075245541E-3,2.5519203887372697E-2,2.5519203887372697E-2,1.3770456176348769E-2,1.3770456176348769E-2]
[null,"2017-07-20",288,223,"N/A","N/A",8.8455833321992845E-4,8.8455833321992845E-4,2.8950518246873964E-2,2.8950518246873964E-2,2.8131864474472475E-2,2.8131864474472475E-2,1.7170028724906278E-2,1.7170028724906278E-2]
[null,"2017-07-21",244,221,"N/A","N/A",7.4268878516119373E-3,7.4268878516119373E-3,5.1408731674603778E-3,5.1408731674603778E-3,1.4577647607002597E-2,1.4577647607002597E-2,7.6896101357782787E-3,7.6896101357782787E-3]
[null,"2017-07-22",213,170,"N/A","N/A",1.3023420382945716E-2,1.3023420382945716E-2,3.1120279114778313E-2,3.1120279114778313E-2,6.4068428409771679E-4,6.4068428409771679E-4,1.8444339231899816E-2,1.8444339231899816E-2]
[null,"2017-07-23",272,251,"N/A","N/A",7.9236013771892821E-3,7.9236013771892821E-3,2.1453128581251431E-2,2.1453128581251431E-2,7.1249084736737009E-2,7.1249084736737009E-2,2.4286693051338626E-2,2.4286693051338626E-2]
[null,"2017-07-24",190,169,"N/A","N/A",3.4069104418709091E-2,3.4069104418709091E-2,1.0105177375404284E-2,1.0105177375404284E-2,5.306030752845637E-2,5.306030752845637E-2,2.7330644063060731E-2,2.7330644063060731E-2]
[null,"2017-07-25",243,194,"N/A","N/A",1.2679803491964127E-2,1.2679803491964127E-2,7.8471320277416993E-3,7.8471320277416993E-3,7.9045463622445591E-3,7.9045463622445591E-3,9.8614416643087923E-3,9.8614416643087923E-3]
[null,"2017-07-26",266,214,"N/A","N/A",0,0,1.5687472941655844E-3,1.5687472941655844E-3,4.4140651001797246E-2,4.4140651001797246E-2,8.1383706465467665E-3,8.1383706465467665E-3]
[null,"2017-07-27",222,193,"N/A","N/A",0,0,1.0763915416677277E-3,1.0763915416677277E-3,2.8581175530852692E-2,2.8581175530852692E-2,5.2948095484382637E-3,5.2948095484382637E-3]
[null,"2017-07-28",284,214,"N/A","N/A",0,0,0,0,8.811489050123144E-3,8.811489050123144E-3,1.4944571726535506E-3,1.4944571726535506E-3]
[null,"2017-07-29",348,311,"N/A","N/A",4.3948940571288599E-2,4.3948940571288599E-2,6.5415403943939354E-2,6.5415403943939354E-2,5.3917326765626043E-3,5.3917326765626043E-3,4.6330994745409554E-2,4.6330994745409554E-2]
[null,"2017-07-30",118,112,"N/A","N/A",0,0,5.1204998259777078E-3,5.1204998259777078E-3,9.6102642614657521E-3,9.6102642614657521E-3,3.7580164785424035E-3,3.7580164785424035E-3]
[null,"2017-07-31",267,230,"N/A","N/A",2.7560796374671691E-2,2.7560796374671691E-2,1.0305515233317205E-2,1.0305515233317205E-2,2.8955601411169542E-3,2.8955601411169542E-3,1.6206181464356349E-2,1.6206181464356349E-2]
[null,"2017-08-01",255,239,"N/A","N/A",1.1179456472925712E-2,1.1179456472925712E-2,1.1215524486209794E-2,1.1215524486209794E-2,9.6435465619383615E-3,9.6435465619383615E-3,1.0933951061113984E-2,1.0933951061113984E-2]
[null,"2017-08-02",170,156,"N/A","N/A",0,0,0,0,2.3630433335552151E-3,2.3630433335552151E-3,4.0077982722720333E-4,4.0077982722720333E-4]
[null,"2017-08-03",245,212,"N/A","N/A",3.1425635861355689E-2,3.1425635861355689E-2,2.9524367365302503E-2,2.9524367365302503E-2,0.10151933701657459,0.10151933701657459,4.2523586386751119E-2,4.2523586386751119E-2]
[null,"2017-08-04",234,194,"N/A","N/A",1.508512172883524E-2,1.508512172883524E-2,3.2257790680894049E-4,3.2257790680894049E-4,8.7865273247686882E-3,8.7865273247686882E-3,7.8815328699434178E-3,7.8815328699434178E-3]
[null,"2017-08-05",144,138,"N/A","N/A",1.5057904549351551E-2,1.5057904549351551E-2,0,0,1.758969579977368E-2,1.758969579977368E-2,9.2292255988236267E-3,9.2292255988236267E-3]
[null,"2017-08-06",163,159,"N/A","N/A",0,0,2.3870765103861599E-2,2.3870765103861599E-2,3.1859482127404644E-2,3.1859482127404644E-2,1.5324183605141553E-2,1.5324183605141553E-2]
[null,"2017-08-07",279,253,"N/A","N/A",3.402147435461263E-6,3.402147435461263E-6,1.3089871902615428E-2,1.3089871902615428E-2,1.4993676362910205E-2,1.4993676362910205E-2,7.9845502198997061E-3,7.9845502198997061E-3]
[null,"2017-08-08",205,190,"N/A","N/A",0,0,1.1901426982793015E-2,1.1901426982793015E-2,1.2605671304000532E-2,1.2605671304000532E-2,7.0842068052132424E-3,7.0842068052132424E-3]
[null,"2017-08-09",220,205,"N/A","N/A",0,0,1.7734993760664172E-2,1.7734993760664172E-2,1.4827264860547161E-2,1.4827264860547161E-2,9.8854320060794351E-3,9.8854320060794351E-3]
[null,"2017-08-10",351,323,"N/A","N/A",1.8667582978375952E-2,1.8667582978375952E-2,9.6637549766131012E-3,9.6637549766131012E-3,1.167376689076749E-2,1.167376689076749E-2,1.3739409851704408E-2,1.3739409851704408E-2]
[null,"2017-08-11",183,172,"N/A","N/A",3.1554917463903216E-2,3.1554917463903216E-2,8.3191144387568874E-3,8.3191144387568874E-3,1.547626971976303E-2,1.547626971976303E-2,1.9171105467892809E-2,1.9171105467892809E-2]
[null,"2017-08-12",183,170,"N/A","N/A",0,0,1.9218852131985297E-3,1.9218852131985297E-3,4.3516607867935828E-3,4.3516607867935828E-3,1.5367930698958606E-3,1.5367930698958606E-3]
[null,"2017-08-13",83,80,"N/A","N/A",6.290570608167876E-3,6.290570608167876E-3,3.3806164633576961E-2,3.3806164633576961E-2,3.4730080543167147E-2,3.4730080543167147E-2,2.2549510067829164E-2,2.2549510067829164E-2]
[null,"2017-08-14",247,191,"N/A","N/A",2.5573942272362316E-2,2.5573942272362316E-2,1.3989694484766683E-3,1.3989694484766683E-3,1.0434001198162818E-2,1.0434001198162818E-2,1.2959018145871156E-2,1.2959018145871156E-2]
[null,"2017-08-15",235,208,"N/A","N/A",0,0,1.3242671963735453E-3,1.3242671963735453E-3,1.8513279637888572E-2,1.8513279637888572E-2,3.6902790429547069E-3,3.6902790429547069E-3]
[null,"2017-08-16",247,216,"N/A","N/A",2.0552372657621491E-2,2.0552372657621491E-2,4.5296729229802801E-3,4.5296729229802801E-3,4.1702722492178657E-2,4.1702722492178657E-2,1.7480491971349887E-2,1.7480491971349887E-2]
[null,"2017-08-17",280,257,"N/A","N/A",5.0862104160145881E-3,5.0862104160145881E-3,2.1015101739374029E-2,2.1015101739374029E-2,2.5710577115090196E-2,2.5710577115090196E-2,1.5204231896288341E-2,1.5204231896288341E-2]
[null,"2017-08-18",231,216,"N/A","N/A",1.3632404773893282E-2,1.3632404773893282E-2,9.5075593585792993E-5,9.5075593585792993E-5,6.5982160686946685E-3,6.5982160686946685E-3,6.8132570628624571E-3,6.8132570628624571E-3]
[null,"2017-08-19",140,119,"N/A","N/A",3.0279112175605241E-4,3.0279112175605241E-4,8.6960212561862805E-3,8.6960212561862805E-3,5.5498236038074951E-3,5.5498236038074951E-3,4.6809390384247663E-3,4.6809390384247663E-3]
[null,"2017-08-20",108,106,"N/A","N/A",0,0,1.1330973421278258E-2,1.1330973421278258E-2,1.2239565998801837E-2,1.2239565998801837E-2,6.7850331313675837E-3,6.7850331313675837E-3]
[null,"2017-08-21",206,187,"N/A","N/A",1.4812949933998339E-2,1.4812949933998339E-2,2.0746852743185541E-2,2.0746852743185541E-2,4.1602875590760835E-4,4.1602875590760835E-4,1.4837320786854987E-2,1.4837320786854987E-2]
[null,"2017-08-22",257,200,"N/A","N/A",1.3635806921328743E-2,1.3635806921328743E-2,0,0,1.9054117020568461E-3,1.9054117020568461E-3,5.9792398871889455E-3,5.9792398871889455E-3]
[null,"2017-08-23",219,194,"N/A","N/A",0,0,4.4505564468892457E-2,4.4505564468892457E-2,9.0860680290221658E-3,9.0860680290221658E-3,2.0037580164785424E-2,2.0037580164785424E-2]
[null,"2017-08-24",286,250,"N/A","N/A",0,0,3.7588815035526015E-3,3.7588815035526015E-3,3.0711242761099648E-2,3.0711242761099648E-2,6.770921165620147E-3,6.770921165620147E-3]
[null,"2017-08-25",188,166,"N/A","N/A",0,0,1.4651828082953455E-2,1.4651828082953455E-2,5.1005125474272777E-3,5.1005125474272777E-3,6.954376720336824E-3,6.954376720336824E-3]
[null,"2017-08-26",101,94,"N/A","N/A",0,0,4.3463128496362512E-4,4.3463128496362512E-4,0,0,1.8063316156719024E-4,1.8063316156719024E-4]
[null,"2017-08-27",103,99,"N/A","N/A",1.2377012370208076E-2,1.2377012370208076E-2,1.2067809271568154E-2,1.2067809271568154E-2,3.6327630965852363E-2,3.6327630965852363E-2,1.6310610010887381E-2,1.6310610010887381E-2]
[null,"2017-08-28",242,219,"N/A","N/A",0,0,0,0,6.411003128536244E-2,6.411003128536244E-2,1.0873269608400007E-2,1.0873269608400007E-2]
[null,"2017-08-29",220,207,"N/A","N/A",8.7945511206673644E-3,8.7945511206673644E-3,1.3415845366338146E-2,1.3415845366338146E-2,3.8274645543499966E-4,3.8274645543499966E-4,9.28849585496286E-3,9.28849585496286E-3]
[null,"2017-08-30",260,230,"N/A","N/A",0,0,1.1412466787208937E-2,1.1412466787208937E-2,2.5760500565799108E-2,2.5760500565799108E-2,9.1120962831199009E-3,9.1120962831199009E-3]
[null,"2017-08-31",302,238,"N/A","N/A",0,0,6.3496914287654608E-4,6.3496914287654608E-4,2.6875457631631498E-3,2.6875457631631498E-3,7.1971025311927362E-4,7.1971025311927362E-4]
[null,"2017-09-01",165,133,"N/A","N/A",0,0,3.7283214913285965E-3,3.7283214913285965E-3,0,0,1.5494938390685539E-3,1.5494938390685539E-3]
[null,"2017-09-02",119,109,"N/A","N/A",0,0,1.0655257595436372E-2,1.0655257595436372E-2,1.3945283898023032E-2,1.3945283898023032E-2,6.7935003108160457E-3,6.7935003108160457E-3]
[null,"2017-09-03",131,126,"N/A","N/A",2.4410407849434563E-2,2.4410407849434563E-2,1.4003276712421795E-2,1.4003276712421795E-2,0.12196299008187446,0.12196299008187446,3.6630429490621542E-2,3.6630429490621542E-2]
[null,"2017-09-04",268,232,"N/A","N/A",0,0,5.7656556395955889E-3,5.7656556395955889E-3,2.8281634826599216E-2,2.8281634826599216E-2,7.1928689414685054E-3,7.1928689414685054E-3]
[null,"2017-09-05",329,292,"N/A","N/A",1.2519902562497449E-3,1.2519902562497449E-3,4.3564995203775863E-3,4.3564995203775863E-3,1.9569992677893895E-2,1.9569992677893895E-2,5.649019888698926E-3,5.649019888698926E-3]
[null,"2017-09-06",225,205,"N/A","N/A",0,0,4.3870595326015909E-3,4.3870595326015909E-3,5.2744125673966587E-2,5.2744125673966587E-2,1.0768841061868975E-2,1.0768841061868975E-2]
[null,"2017-09-07",206,187,"N/A","N/A",0,0,0,0,1.3204752712507489E-2,1.3204752712507489E-2,2.2395689641182101E-3,2.2395689641182101E-3]
[null,"2017-09-08",216,206,"N/A","N/A",0,0,3.3887657999507642E-3,3.3887657999507642E-3,7.2222592025560804E-3,7.2222592025560804E-3,2.6332928084716952E-3,2.6332928084716952E-3]
[null,"2017-09-09",111,106,"N/A","N/A",3.2140086822802554E-2,3.2140086822802554E-2,9.8810706190949147E-3,9.8810706190949147E-3,0,0,1.7438156074107578E-2,1.7438156074107578E-2]
[null,"2017-09-10",64,59,"N/A","N/A",0,0,0,0,4.6595220661652131E-4,4.6595220661652131E-4,7.9027008185645738E-5,7.9027008185645738E-5]
[null,"2017-09-11",196,169,"N/A","N/A",3.402147435461263E-6,3.402147435461263E-6,0,0,0,0,1.4111965747436737E-6,1.4111965747436737E-6]
[null,"2017-09-12",164,137,"N/A","N/A",0,0,1.1775791376983218E-2,1.1775791376983218E-2,5.9408906343606472E-3,5.9408906343606472E-3,5.9016240755780441E-3,5.9016240755780441E-3]
[null,"2017-09-13",206,183,"N/A","N/A",1.1682974293373978E-2,1.1682974293373978E-2,1.5847064116603426E-2,1.5847064116603426E-2,1.4727417959129335E-2,1.4727417959129335E-2,1.3929921389294804E-2,1.3929921389294804E-2]
[null,"2017-09-14",171,148,"N/A","N/A",1.0747383748622131E-2,1.0747383748622131E-2,2.9982767548662574E-3,2.9982767548662574E-3,6.4484457165679288E-3,6.4484457165679288E-3,6.7977339005402763E-3,6.7977339005402763E-3]
[null,"2017-09-15",219,174,"N/A","N/A",1.1329150960086006E-3,1.1329150960086006E-3,1.6118708669705689E-2,1.6118708669705689E-2,2.3430739532716502E-2,2.3430739532716502E-2,1.1142808154176048E-2,1.1142808154176048E-2]
[null,"2017-09-16",316,261,"N/A","N/A",2.5005783650640283E-3,2.5005783650640283E-3,2.1931902106094175E-2,2.1931902106094175E-2,2.6792251880449975E-3,2.6792251880449975E-3,1.0606553455773451E-2,1.0606553455773451E-2]
[null,"2017-09-17",216,188,"N/A","N/A",7.3826599349509411E-3,7.3826599349509411E-3,1.6244344275515486E-2,1.6244344275515486E-2,1.6649470811422484E-2,1.6649470811422484E-2,1.2637265326829598E-2,1.2637265326829598E-2]
[null,"2017-09-18",406,326,"N/A","N/A",1.5850604901814024E-2,1.5850604901814024E-2,2.1052452865425592E-2,2.1052452865425592E-2,1.6740997137722161E-2,1.6740997137722161E-2,1.8163511113525824E-2,1.8163511113525824E-2]
[null,"2017-09-19",326,236,"N/A","N/A",0,0,2.1663653109905688E-3,2.1663653109905688E-3,8.070957864607602E-4,8.070957864607602E-4,1.0372294824366002E-3,1.0372294824366002E-3]
[null,"2017-09-20",211,179,"N/A","N/A",0,0,2.6892810757124302E-3,2.6892810757124302E-3,5.5415030286893431E-3,5.5415030286893431E-3,2.0575246059762763E-3,2.0575246059762763E-3]
[null,"2017-09-21",233,195,"N/A","N/A",0,0,6.556820400505938E-3,6.556820400505938E-3,5.2419623244358651E-4,5.2419623244358651E-4,2.8139259700388857E-3,2.8139259700388857E-3]
[null,"2017-09-22",206,159,"N/A","N/A",1.2587945511206673E-3,1.2587945511206673E-3,0,0,1.800572455568129E-2,1.800572455568129E-2,3.5759721204004693E-3,3.5759721204004693E-3]
[null,"2017-09-23",257,193,"N/A","N/A",8.4101084604602423E-3,8.4101084604602423E-3,2.8519282518824119E-2,2.8519282518824119E-2,3.4247487186314318E-2,3.4247487186314318E-2,2.1149603065683437E-2,2.1149603065683437E-2]
[null,"2017-09-24",262,220,"N/A","N/A",7.2976062490644096E-3,7.2976062490644096E-3,5.1578509520292699E-3,5.1578509520292699E-3,2.4920122478865738E-2,2.4920122478865738E-2,9.3971579912181229E-3,9.3971579912181229E-3]
[null,"2017-09-25",274,213,"N/A","N/A",0,0,7.8946698245345968E-3,7.8946698245345968E-3,2.49617253544565E-4,2.49617253544565E-4,3.3233679335213516E-3,3.3233679335213516E-3]
[null,"2017-09-26",240,207,"N/A","N/A",6.3007770504742598E-3,6.3007770504742598E-3,1.3483756504613713E-2,1.3483756504613713E-2,1.5983824801970314E-2,1.5983824801970314E-2,1.092830627481501E-2,1.092830627481501E-2]
[null,"2017-09-27",249,207,"N/A","N/A",6.2089190697168055E-3,6.2089190697168055E-3,1.4475259123436982E-2,1.4475259123436982E-2,8.9862211276043398E-4,8.9862211276043398E-4,8.7437739771118028E-3,8.7437739771118028E-3]
[null,"2017-09-28",229,184,"N/A","N/A",1.5275641985221071E-3,1.5275641985221071E-3,0,0,3.4114357984423884E-4,3.4114357984423884E-4,6.9148632162440013E-4,6.9148632162440013E-4]
[null,"2017-09-29",152,133,"N/A","N/A",1.0124790767932719E-2,1.0124790767932719E-2,1.0954066603848863E-2,1.0954066603848863E-2,0,0,8.7522411565602656E-3,8.7522411565602656E-3]
[null,"2017-09-30",116,110,"N/A","N/A",0,0,1.0926902148538637E-2,1.0926902148538637E-2,5.0006656460094522E-3,5.0006656460094522E-3,5.38935971894609E-3,5.38935971894609E-3]
[null,"2017-10-01",75,72,"N/A","N/A",0,0,7.4396651980883017E-3,7.4396651980883017E-3,2.1999600612394327E-2,2.1999600612394327E-2,6.8231354388856623E-3,6.8231354388856623E-3]
[null,"2017-10-02",197,169,"N/A","N/A",1.1196467210103016E-2,1.1196467210103016E-2,6.4515581361788098E-5,6.4515581361788098E-5,2.0368767889236503E-2,2.0368767889236503E-2,8.125669877374073E-3,8.125669877374073E-3]
[null,"2017-10-03",228,200,"N/A","N/A",2.7217179483690107E-3,2.7217179483690107E-3,8.8624035449614176E-3,8.8624035449614176E-3,2.561905078879052E-2,2.561905078879052E-2,9.1572545735117E-3,9.1572545735117E-3]
[null,"2017-10-04",221,187,"N/A","N/A",7.3758556400800182E-3,7.3758556400800182E-3,8.852216874220083E-3,8.852216874220083E-3,0,0,6.7384636444010422E-3,6.7384636444010422E-3]
[null,"2017-10-05",246,188,"N/A","N/A",3.7831879482329248E-3,3.7831879482329248E-3,2.3381804908277518E-2,2.3381804908277518E-2,6.7205285229315057E-2,6.7205285229315057E-2,2.2684984939004556E-2,2.2684984939004556E-2]
[null,"2017-10-06",293,248,"N/A","N/A",1.3513329613652137E-2,1.3513329613652137E-2,1.2224004889601957E-3,1.2224004889601957E-3,1.6982293816148571E-2,1.6982293816148571E-2,8.9935557708414327E-3,8.9935557708414327E-3]
[null,"2017-10-07",136,113,"N/A","N/A",4.740552236571724E-2,4.740552236571724E-2,0,0,0,0,1.966361307247835E-2,1.966361307247835E-2]
[null,"2017-10-08",79,75,"N/A","N/A",0,0,3.1256101391329442E-2,3.1256101391329442E-2,2.4187911868468349E-2,2.4187911868468349E-2,1.7092412913295378E-2,1.7092412913295378E-2]
[null,"2017-10-09",247,216,"N/A","N/A",9.8662275628376634E-5,9.8662275628376634E-5,7.9218342798448235E-3,7.9218342798448235E-3,0.13669872861612195,0.13669872861612195,2.6517794836008374E-2,2.6517794836008374E-2]
[null,"2017-10-10",209,192,"N/A","N/A",8.9986799667950406E-3,8.9986799667950406E-3,6.9541005594180019E-3,6.9541005594180019E-3,0,0,6.6227455252720613E-3,6.6227455252720613E-3]
[null,"2017-10-11",241,228,"N/A","N/A",1.7378169100336131E-2,1.7378169100336131E-2,3.8006468535920747E-2,3.8006468535920747E-2,2.4986687079810957E-2,2.4986687079810957E-2,2.7241738678851879E-2,2.7241738678851879E-2]
[null,"2017-10-12",342,259,"N/A","N/A",2.5243933971122573E-3,2.5243933971122573E-3,4.3734773049464775E-3,4.3734773049464775E-3,6.6980629701124941E-3,6.6980629701124941E-3,4.000742289398315E-3,4.000742289398315E-3]
[null,"2017-10-13",146,132,"N/A","N/A",0,0,8.6892301423587229E-3,8.6892301423587229E-3,0,0,3.611252034769061E-3,3.611252034769061E-3]
[null,"2017-10-14",102,82,"N/A","N/A",6.3109834927806427E-3,6.3109834927806427E-3,2.7639833278155532E-3,2.7639833278155532E-3,7.1057711509019501E-3,7.1057711509019501E-3,4.971645532821963E-3,4.971645532821963E-3]
[null,"2017-10-15",82,74,"N/A","N/A",0,0,2.4991298885408443E-3,2.4991298885408443E-3,9.6685082872928173E-3,9.6685082872928173E-3,2.678451098863493E-3,2.678451098863493E-3]
[null,"2017-10-16",181,158,"N/A","N/A",7.1819332362587267E-3,7.1819332362587267E-3,1.4967614875934839E-2,1.4967614875934839E-2,0,0,9.1995904707540092E-3,9.1995904707540092E-3]
[null,"2017-10-17",239,193,"N/A","N/A",0,0,6.4549536930925879E-3,6.4549536930925879E-3,5.2918857751447779E-3,5.2918857751447779E-3,3.5802057101247003E-3,3.5802057101247003E-3]
[null,"2017-10-18",304,266,"N/A","N/A",0,0,2.9188207230838446E-2,2.9188207230838446E-2,4.3683019370298875E-3,4.3683019370298875E-3,1.2871523958237048E-2,1.2871523958237048E-2]
[null,"2017-10-19",355,294,"N/A","N/A",2.5971993522311283E-2,2.5971993522311283E-2,4.4142239879118175E-5,4.4142239879118175E-5,1.4927111761964987E-2,1.4927111761964987E-2,1.3323106862155024E-2,1.3323106862155024E-2]
[null,"2017-10-20",250,219,"N/A","N/A",0,0,5.6128555784755651E-3,5.6128555784755651E-3,0.10736870132463557,0.10736870132463557,2.054278853854366E-2,2.054278853854366E-2]
[null,"2017-10-21",124,114,"N/A","N/A",0,0,1.413570343205915E-2,1.413570343205915E-2,5.7162351061705386E-3,5.7162351061705386E-3,6.8443033875068178E-3,6.8443033875068178E-3]
[null,"2017-10-22",96,91,"N/A","N/A",0,0,2.6349521650919773E-3,2.6349521650919773E-3,0,0,1.0950885420010908E-3,1.0950885420010908E-3]
[null,"2017-10-23",202,190,"N/A","N/A",6.3007770504742598E-3,6.3007770504742598E-3,2.7385166509622159E-2,2.7385166509622159E-2,5.3168475004992345E-3,5.3168475004992345E-3,1.489659104299422E-2,1.489659104299422E-2]
[null,"2017-10-24",422,295,"N/A","N/A",5.1610576595947366E-3,5.1610576595947366E-3,8.8827768864440885E-3,8.8827768864440885E-3,4.7552086800239632E-2,4.7552086800239632E-2,1.3897463868075699E-2,1.3897463868075699E-2]
[null,"2017-10-25",258,225,"N/A","N/A",0,0,1.9218852131985296E-2,1.9218852131985296E-2,6.0532183984557016E-2,6.0532183984557016E-2,1.8253827694309419E-2,1.8253827694309419E-2]
[null,"2017-10-26",225,206,"N/A","N/A",0,0,2.1660257552991911E-2,2.1660257552991911E-2,5.9076083338880384E-2,5.9076083338880384E-2,1.9021518630969979E-2,1.9021518630969979E-2]
[null,"2017-10-27",241,218,"N/A","N/A",8.1787624348488765E-3,8.1787624348488765E-3,1.2658636174565582E-2,1.2658636174565582E-2,4.942421620182387E-3,4.942421620182387E-3,9.4917081617259501E-3,9.4917081617259501E-3]
[null,"2017-10-28",239,205,"N/A","N/A",1.4904807914755795E-2,1.4904807914755795E-2,1.9602550063242248E-2,1.9602550063242248E-2,4.8508952938827135E-2,4.8508952938827135E-2,2.2556566050702883E-2,2.2556566050702883E-2]
[null,"2017-10-29",157,134,"N/A","N/A",2.5345998394186412E-3,2.5345998394186412E-3,3.2393612957445183E-3,3.2393612957445183E-3,5.3842441589562667E-2,5.3842441589562667E-2,1.1529476015655815E-2,1.1529476015655815E-2]
[null,"2017-10-30",296,263,"N/A","N/A",1.5717921151831037E-2,1.5717921151831037E-2,3.219667065644604E-2,3.219667065644604E-2,0.13461026426146575,0.13461026426146575,4.2731032283238442E-2,4.2731032283238442E-2]
[null,"2017-10-31",202,180,"N/A","N/A",0,0,5.0933353706674818E-5,5.0933353706674818E-5,6.8137189642548099E-2,6.8137189642548099E-2,1.1577456699197099E-2,1.1577456699197099E-2]
[null,"2017-11-01",232,206,"N/A","N/A",0,0,8.5907589918591523E-4,8.5907589918591523E-4,5.7245556812886905E-3,5.7245556812886905E-3,1.3279359768337969E-3,1.3279359768337969E-3]
[null,"2017-11-02",226,181,"N/A","N/A",9.3422968577766292E-3,9.3422968577766292E-3,6.1221891155423128E-3,6.1221891155423128E-3,1.0184383944618252E-2,1.0184383944618252E-2,8.1468378259952293E-3,8.1468378259952293E-3]
[null,"2017-11-03",201,177,"N/A","N/A",5.8959215056543692E-3,5.8959215056543692E-3,8.5466167519800337E-3,8.5466167519800337E-3,1.5784130999134661E-2,1.5784130999134661E-2,8.6746253449493625E-3,8.6746253449493625E-3]
[null,"2017-11-04",98,91,"N/A","N/A",1.3557557530313133E-2,1.3557557530313133E-2,4.1052283087579904E-3,4.1052283087579904E-3,1.6641150236304332E-4,1.6641150236304332E-4,7.3579789407135152E-3,7.3579789407135152E-3]
[null,"2017-11-05",73,71,"N/A","N/A",0,0,1.4448094668126757E-2,1.4448094668126757E-2,3.045330493243693E-2,3.045330493243693E-2,1.1169620889096179E-2,1.1169620889096179E-2]
[null,"2017-11-06",173,162,"N/A","N/A",1.9912768939754775E-2,1.9912768939754775E-2,0,0,2.1633495307195634E-4,2.1633495307195634E-4,8.2964246629180574E-3,8.2964246629180574E-3]
[null,"2017-11-07",80,77,"N/A","N/A",0,0,1.9507474469656453E-2,1.9507474469656453E-2,4.0754176928709314E-2,4.0754176928709314E-2,1.5019365144996921E-2,1.5019365144996921E-2]
[null,"2017-11-08",214,167,"N/A","N/A",8.1311323707524189E-4,8.1311323707524189E-4,5.011842004736802E-3,5.011842004736802E-3,3.9406243759568658E-2,3.9406243759568658E-2,9.1036291036714397E-3,9.1036291036714397E-3]
[null,"2017-11-09",249,187,"N/A","N/A",2.6366642624824788E-3,2.6366642624824788E-3,9.3785281958557228E-3,9.3785281958557228E-3,9.6352259868202096E-3,9.6352259868202096E-3,6.6255679184215486E-3,6.6255679184215486E-3]
[null,"2017-11-10",226,192,"N/A","N/A",0,0,3.1724688245430857E-2,3.1724688245430857E-2,1.1715369766358251E-2,1.1715369766358251E-2,1.5171774375069237E-2,1.5171774375069237E-2]
[null,"2017-11-11",121,105,"N/A","N/A",8.6754759604262214E-3,8.6754759604262214E-3,2.0797786096892215E-2,2.0797786096892215E-2,2.5876988617453238E-2,2.5876988617453238E-2,1.6630951633354197E-2,1.6630951633354197E-2]
[null,"2017-11-12",148,134,"N/A","N/A",1.1853081665147041E-2,1.1853081665147041E-2,2.9846945272111441E-3,2.9846945272111441E-3,8.8614125008320572E-3,8.8614125008320572E-3,7.6599750077086613E-3,7.6599750077086613E-3]
[null,"2017-11-13",309,273,"N/A","N/A",0,0,9.1917725655979148E-3,9.1917725655979148E-3,1.0017972442255208E-2,1.0017972442255208E-2,5.5191898038225084E-3,5.5191898038225084E-3]
[null,"2017-11-14",303,235,"N/A","N/A",0,0,2.9361380633441143E-2,2.9361380633441143E-2,1.098315915596086E-2,1.098315915596086E-2,1.4065396260470197E-2,1.4065396260470197E-2]
[null,"2017-11-15",364,308,"N/A","N/A",2.9448988201352694E-2,2.9448988201352694E-2,5.8288129981918659E-2,5.8288129981918659E-2,4.3832789722425616E-2,4.3832789722425616E-2,4.3874101508780815E-2,4.3874101508780815E-2]
[null,"2017-11-16",355,273,"N/A","N/A",1.1492454036988146E-2,1.1492454036988146E-2,2.9799407475318545E-2,2.9799407475318545E-2,0.16189343007388671,0.16189343007388671,4.4609334924222269E-2,4.4609334924222269E-2]
[null,"2017-11-17",455,350,"N/A","N/A",0,0,2.7157664196399013E-2,2.7157664196399013E-2,8.2124076416161887E-2,8.2124076416161887E-2,2.5215260397519965E-2,2.5215260397519965E-2]
[null,"2017-11-18",199,179,"N/A","N/A",3.5814406053100718E-2,3.5814406053100718E-2,6.4960399317493062E-2,6.4960399317493062E-2,2.1525327830659656E-2,2.1525327830659656E-2,4.5504033552609763E-2,4.5504033552609763E-2]
[null,"2017-11-19",98,92,"N/A","N/A",0,0,8.2444121866537632E-3,8.2444121866537632E-3,4.3183784863209743E-2,4.3183784863209743E-2,1.0750495506397307E-2,1.0750495506397307E-2]
[null,"2017-11-20",284,223,"N/A","N/A",7.1479117619041143E-3,7.1479117619041143E-3,3.7792548450352715E-3,3.7792548450352715E-3,2.531118950941889E-2,2.531118950941889E-2,8.8284457715964229E-3,8.8284457715964229E-3]
[null,"2017-11-21",349,203,"N/A","N/A",8.1107194861396517E-3,8.1107194861396517E-3,3.792497516999007E-2,3.792497516999007E-2,5.2519470145776473E-2,5.2519470145776473E-2,2.803341995728308E-2,2.803341995728308E-2]
[null,"2017-11-22",270,234,"N/A","N/A",0,0,1.6655206662082665E-2,1.6655206662082665E-2,5.9059442188644076E-2,5.9059442188644076E-2,1.6938592486648318E-2,1.6938592486648318E-2]
[null,"2017-11-23",654,413,"N/A","N/A",2.3410176503408951E-2,2.3410176503408951E-2,2.7025237476761658E-2,2.7025237476761658E-2,5.4033814817280174E-2,5.4033814817280174E-2,3.0106467725581537E-2,3.0106467725581537E-2]
[null,"2017-11-24",310,266,"N/A","N/A",4.6510757590190931E-2,4.6510757590190931E-2,2.1184879585062946E-2,2.1184879585062946E-2,0.1130516541303335,0.1130516541303335,4.7270851664188838E-2,4.7270851664188838E-2]
[null,"2017-11-25",377,243,"N/A","N/A",2.3454404420069949E-2,2.3454404420069949E-2,9.0970365277035004E-2,9.0970365277035004E-2,0.11232776409505425,0.11232776409505425,6.6587310379280243E-2,6.6587310379280243E-2]
[null,"2017-11-26",254,224,"N/A","N/A",1.0604493556332757E-2,1.0604493556332757E-2,2.7833380022240898E-2,2.7833380022240898E-2,0.11165379751048392,0.11165379751048392,3.4903124883135281E-2,3.4903124883135281E-2]
[null,"2017-11-27",366,316,"N/A","N/A",0,0,1.1283435624485361E-2,1.1283435624485361E-2,2.6442787725487586E-2,2.6442787725487586E-2,9.1741889324086241E-3,9.1741889324086241E-3]
[null,"2017-11-28",269,213,"N/A","N/A",0,0,1.373163215931953E-2,1.373163215931953E-2,1.0508886374226187E-2,1.0508886374226187E-2,7.4892202221646768E-3,7.4892202221646768E-3]
[null,"2017-11-29",417,295,"N/A","N/A",2.1025271151150606E-3,2.1025271151150606E-3,1.0519435318885238E-2,1.0519435318885238E-2,7.3553884044465154E-3,7.3553884044465154E-3,6.4915042438208996E-3,6.4915042438208996E-3]
[null,"2017-11-30",324,275,"N/A","N/A",4.2867057686811916E-4,4.2867057686811916E-4,2.6288401626471763E-2,2.6288401626471763E-2,5.4865872329095386E-2,5.4865872329095386E-2,2.040872486394301E-2,2.040872486394301E-2]
[null,"2017-12-01",422,397,"N/A","N/A",5.0147653198699016E-2,5.0147653198699016E-2,2.8529469189565452E-2,2.8529469189565452E-2,3.7966784264128334E-2,3.7966784264128334E-2,3.9097201103273485E-2,3.9097201103273485E-2]
[null,"2017-12-02",344,329,"N/A","N/A",8.1311323707524189E-4,8.1311323707524189E-4,2.4740027673788849E-2,2.4740027673788849E-2,5.4666178526259733E-2,5.4666178526259733E-2,1.9890815721012083E-2,1.9890815721012083E-2]
[null,"2017-12-03",346,310,"N/A","N/A",0,0,1.7626335939423265E-2,1.7626335939423265E-2,7.321274046462091E-2,7.321274046462091E-2,1.9742640080663995E-2,1.9742640080663995E-2]
[null,"2017-12-04",230,212,"N/A","N/A",0,0,6.8250693966944252E-3,6.8250693966944252E-3,2.9205218664714104E-3,2.9205218664714104E-3,3.3318351129698136E-3,3.3318351129698136E-3]
[null,"2017-12-05",283,250,"N/A","N/A",1.8752636664262481E-2,1.8752636664262481E-2,2.8013344538671148E-2,2.8013344538671148E-2,1.5068561538973574E-2,1.5068561538973574E-2,2.1976564258483232E-2,2.1976564258483232E-2]
[null,"2017-12-06",221,200,"N/A","N/A",0,0,0,0,1.0400718897690209E-3,1.0400718897690209E-3,1.7639957184295923E-4,1.7639957184295923E-4]
[null,"2017-12-07",223,202,"N/A","N/A",7.1581182042104972E-3,7.1581182042104972E-3,3.574163207443061E-2,3.574163207443061E-2,4.5446981295347133E-2,4.5446981295347133E-2,2.5531368430262547E-2,2.5531368430262547E-2]
[null,"2017-12-08",232,221,"N/A","N/A",0,0,4.7062418824967527E-3,4.7062418824967527E-3,2.8872395659988018E-2,2.8872395659988018E-2,6.8527705669552798E-3,6.8527705669552798E-3]
[null,"2017-12-09",334,256,"N/A","N/A",4.0209980539716667E-2,4.0209980539716667E-2,1.0872573237918183E-2,1.0872573237918183E-2,4.9257804699460823E-3,4.9257804699460823E-3,2.2033012121472979E-2,2.2033012121472979E-2]
[null,"2017-12-10",131,119,"N/A","N/A",5.2256984608685005E-3,5.2256984608685005E-3,1.8386940688109608E-2,1.8386940688109608E-2,0,0,9.8092273910432761E-3,9.8092273910432761E-3]
[null,"2017-12-11",286,261,"N/A","N/A",1.184967951771158E-2,1.184967951771158E-2,9.7452483425437813E-3,9.7452483425437813E-3,6.2113093257005925E-2,6.2113093257005925E-2,1.9499914269808086E-2,1.9499914269808086E-2]
[null,"2017-12-12",230,209,"N/A","N/A",0,0,1.9388629977674214E-3,1.9388629977674214E-3,2.8705984157624976E-2,2.8705984157624976E-2,5.674421427044312E-3,5.674421427044312E-3]
[null,"2017-12-13",448,385,"N/A","N/A",1.2506293972755603E-2,1.2506293972755603E-2,4.3079430565105561E-2,4.3079430565105561E-2,2.2257538441057045E-2,2.2257538441057045E-2,2.6866360389970062E-2,2.6866360389970062E-2]
[null,"2017-12-14",326,295,"N/A","N/A",0,0,3.1171212468484987E-3,3.1171212468484987E-3,2.9005524861878452E-2,2.9005524861878452E-2,6.2149097151711396E-3,6.2149097151711396E-3]
[null,"2017-12-15",276,262,"N/A","N/A",4.765387912850591E-2,4.765387912850591E-2,2.0227332535377458E-2,2.0227332535377458E-2,2.0560141116954003E-2,2.0560141116954003E-2,3.1660195154374321E-2,3.1660195154374321E-2]
[null,"2017-12-16",174,145,"N/A","N/A",2.6016221438972278E-2,2.6016221438972278E-2,2.0886070576650453E-2,2.0886070576650453E-2,3.5903281634826596E-2,3.5903281634826596E-2,2.5561003558332164E-2,2.5561003558332164E-2]
[null,"2017-12-17",154,145,"N/A","N/A",0,0,1.7300362475700545E-2,1.7300362475700545E-2,1.1474073087931838E-2,1.1474073087931838E-2,9.1360866248905437E-3,9.1360866248905437E-3]
[null,"2017-12-18",269,257,"N/A","N/A",6.9573915055182829E-3,6.9573915055182829E-3,1.4828397042469929E-2,1.4828397042469929E-2,2.1758303933967917E-2,2.1758303933967917E-2,1.2738871480211144E-2,1.2738871480211144E-2]
[null,"2017-12-19",0,0,"N/A","N/A",0.10598029476205381,0.10598029476205381,0.13339445335778136,0.13339445335778136,0.32079977368035678,0.32079977368035678,0.15380772587788774,0.15380772587788774]
[null,"2017-12-20",504,1013,"N/A","N/A",2.3815032048228842E-5,2.3815032048228842E-5,2.9942020865697236E-2,2.9942020865697236E-2,5.2436264394594957E-2,5.2436264394594957E-2,2.1347170586147553E-2,2.1347170586147553E-2]
[null,"2017-12-21",17,427,"N/A","N/A",1.136317243444062E-3,1.136317243444062E-3,2.0054159132774765E-2,2.0054159132774765E-2,3.3773214404579643E-2,3.3773214404579643E-2,1.4533913523285097E-2,1.4533913523285097E-2]
[null,"2017-12-22",241,212,"N/A","N/A",2.5067022304478586E-2,2.5067022304478586E-2,2.587074812607703E-2,2.587074812607703E-2,2.8572854955734542E-2,2.8572854955734542E-2,2.5995652103353216E-2,2.5995652103353216E-2]
[null,"2017-12-23",185,155,"N/A","N/A",0,0,3.8037028548144752E-2,3.8037028548144752E-2,3.11023097916528E-2,3.11023097916528E-2,2.1083276826670487E-2,2.1083276826670487E-2]
[null,"2017-12-24",79,78,"N/A","N/A",0,0,5.867522347008939E-3,5.867522347008939E-3,4.0246621846502031E-2,4.0246621846502031E-2,9.2645055131922189E-3,9.2645055131922189E-3]
[null,"2017-12-25",75,72,"N/A","N/A",2.1307649388293892E-2,2.1307649388293892E-2,2.716445531022657E-5,2.716445531022657E-5,3.6860147773414099E-2,3.6860147773414099E-2,1.5101214546332052E-2,1.5101214546332052E-2]
[null,"2017-12-26",105,98,"N/A","N/A",6.4640801273763999E-3,6.4640801273763999E-3,2.1724773134353698E-2,2.1724773134353698E-2,3.3922984756706381E-2,3.3922984756706381E-2,1.7463557612452964E-2,1.7463557612452964E-2]
[null,"2017-12-27",222,215,"N/A","N/A",0,0,2.2787582448366313E-2,2.2787582448366313E-2,9.7101111628835779E-2,9.7101111628835779E-2,2.5939204240363469E-2,2.5939204240363469E-2]
[null,"2017-12-28",311,293,"N/A","N/A",0,0,1.0950671046935085E-2,1.0950671046935085E-2,3.9572655261931704E-2,3.9572655261931704E-2,1.126275986302926E-2,1.126275986302926E-2]
[null,"2017-12-29",444,349,"N/A","N/A",7.11048814011404E-4,7.11048814011404E-4,2.6060899313248613E-2,2.6060899313248613E-2,0.19173933302269852,0.19173933302269852,4.3645487663672343E-2,4.3645487663672343E-2]
[null,"2017-12-30",149,139,"N/A","N/A",1.4377475062259297E-2,1.4377475062259297E-2,1.9422585546811997E-3,1.9422585546811997E-3,1.1856819543366837E-2,1.1856819543366837E-2,8.7818762846298814E-3,8.7818762846298814E-3]
[null,"2017-12-31",90,85,"N/A","N/A",6.3007770504742598E-3,6.3007770504742598E-3,0,0,8.3205751181521671E-3,8.3205751181521671E-3,4.0247326311689579E-3,4.0247326311689579E-3]
[null,"2018-01-01",0,0,"N/A","N/A"]

{"sheet":"6.8 STPIS Exclusions","index":12,"n_rows":43,"n_cols":15,"rows_kept":43,"cut":false,"hidden":false,"merged":[[9,11,10,11],[6,1,6,4],[9,6,9,8],[9,5,10,5],[9,4,10,4],[9,2,10,2],[9,3,10,3]]}
[null,"ANNUAL REPORTING STATEMENT"]
[null,"AusNet (D)"]
[null,"Annual Reporting RIN Response 2017"]
[null,"6.8 STPIS EXCLUSIONS"]
[]
[]
[null,"This information is collected to inform the application of the STPIS to AusNet (D) in future regulatory periods. The information is also collected to monitor network performance, and may be used in performance reports."]
[]
[null,"6.8.1 - STPIS EXCLUSIONS"]
[null,"Date of event","Outage ID","Feeder ID / name","Feeder classification\n(drop down)","Cause of event\n(drop down)","Unplanned",null,null,"Event category","Effect on unplanned MAIFI","Please provide separate explanation to confirm the outage was not due to inadequate transmission connection planning "]
[null,"DD/MM/YYYY",null,null,null,null,"Number of  interruptions","Duration of interruption\n(mins)","Total unplanned minutes off supply","Use exclusion categories listed in section 3.3(a) of the STPIS\n(drop down)","by feeder classification",null,null,null,"Cause of Event"]
[null,null,null,null,null,null,null,null,null,null,null,null,null,null,"Weather"]
[null,null,null,null,null,null,null,null,null,null,null,null,null,null,"Equipment failure"]
[null,null,null,null,null,null,null,null,null,null,null,null,null,null,"Operational error"]
[null,null,null,null,null,null,null,null,null,null,null,null,null,null,"Vegetation"]
[null,null,null,null,null,null,null,null,null,null,null,null,null,null,"Animals"]
[null,null,null,null,null,null,null,null,null,null,null,null,null,null,"Third party impacts"]
[null,null,null,null,null,null,null,null,null,null,null,null,null,null,"Transmission failure"]
[null,null,null,null,null,null,null,null,null,null,null,null,null,null,"Load shedding"]
[null,null,null,null,null,null,null,null,null,null,null,null,null,null,"Inter-distributor connection failure"]
[null,null,null,null,null,null,null,null,null,null,null,null,null,null,"Other"]
[]
[]
[]
[]
[]
[]
[]
[]
[]
[]
[]
[]
[]
[]
[]
[]
[]
[]
[]
[]
[]
[null,"To enter further events - please insert new lines above this line. "]

{"sheet":"6.9 STPIS - GSL","index":13,"n_rows":110,"n_cols":5,"rows_kept":110,"cut":false,"hidden":false,"merged":[[71,1,71,2],[59,1,59,2],[60,1,60,2],[61,1,61,2],[67,1,67,2],[66,1,66,2],[65,1,65,2],[17,1,17,2],[15,1,15,2],[5,1,5,2],[7,1,7,2],[14,1,14,2],[16,1,16,2],[21,1,21,2],[23,1,23,2],[24,1,24,2],[25,1,25,2],[22,1,22,2],[29,1,29,2],[33,1,33,2],[34,1,34,2],[30,1,30,2],[31,1,31,2],[32,1,32,2],[35,1,35,2],[36,1,36,2],[37,1,37,2],[38,1,38,2],[39,1,39,2],[43,1,43,2],[45,1,45,2],[46,1,46,2],[47,1,47,2],[44,1,44,2],[93,1,93,2],[94,1,94,2],[48,1,48,2],[49,1,49,2],[79,1,79,2],[78,1,78,2],[85,1,85,2],[53,1,53,2],[54,1,54,2],[55,1,55,2],[58,1,58,4],[64,1,64,4],[70,1,70,4],[76,1,76,4],[73,1,73,2],[72,1,72,2],[5,4,5,5],[109,1,109,2],[77,1,77,2],[106,1,106,2],[108,1,108,2],[101,1,101,2],[102,1,102,2],[103,1,103,2],[104,1,104,2],[96,1,96,2],[97,1,97,2],[98,1,98,2],[99,1,99,2],[100,1,100,2],[91,1,91,2],[92,1,92,2]]}
[null,"ANNUAL REPORTING STATEMENT"]
[null,"AusNet (D)"]
[null,"Annual Reporting RIN Response 2017"]
[null,"6.9 STPIS - GUARANTEED SERVICE LEVEL"]
[]
[null,"Did the AER's GSL Scheme apply at any time during the regulatory year?",null,"No","**IMPORTANT \nPlease ensure this flag is set. Conditional formatting on this worksheet is dependant on this response."]
[]
[null,"Instructions:\nTable 6.9.1 collects information relating to jurisdiction GSL scheme parameters. These parameters can be found in the jurisdictonal scheme relevant to NSP. Please identify each parameter in the relevant sub-tables and provide the volume and value of GSL payments. \n\nFor GSL parameters that do not fit within the provided sub-tables provided, please enter a heading and identify the relevant parameter(s). "]
[]
[null,"6.9.1 - GUARANTEED SERVICE LEVELS - JURISDICTIONAL GSL SCHEME"]
[null,null,null,"2017","2017"]
[null,null,null,"Volume","Value of GSL payments"]
[null,null,null,"0's","$0's"]
[null,"Appointments"]
[null,"Total customer arranged appointments ",null,3782,0]
[null,"Appointments not met within 15 mins of agreed time",0,6,180]
[null,"Appointments - GSL payments",0,6,180]
[]
[null,"To enter further GSL parameters relating to appointments - please copy a row from above and \"insert copied cells\" above this row."]
[]
[null,"Connections"]
[null,"Total connections made",null,18311,0]
[null,"Connections not made on agreed date",0,587,127360]
[null,"Connections - GSL payments - 1-4 day delay",0,306,28030]
[null,"Connections - GSL payments - 5+ day delay",0,281,98350]
[]
[null,"To enter further GSL parameters relating to connections -  please copy a row from above and \"insert copied cells\" above this row."]
[]
[null,"Reliability of supply"]
[null,"Low reliability payments - 8 events",null,4707,564840]
[null,"Low reliability payments - 12 events",null,257,46260]
[null,"Low reliability payments - 24 events",null,0,0]
[null,"Low reliability payments - 20 hours",null,9133,1095960]
[null,"Low reliability payments - 30 hours",null,3362,605160]
[null,"Low reliability payments - 60 hours",null,115,41400]
[null,"Low reliability payments - 24 momentary events",null,12463,373890]
[null,"Low reliability payments - 36 momentary events",null,1830,73200]
[null,"Low reliability payments - Duration per Event (12hrs) Urban",null,3776,302080]
[null,"Low reliability payments - Duration per Event (18hrs) Rural",null,572,45760]
[null,null,null,0,0]
[null,"To enter further GSL parameters relating to reliability of supply -  please copy a row from above and \"insert copied cells\" above this row."]
[]
[null,"Street lights"]
[null,"Street lights",null,151414]
[null,"Street lights \"out\" during period",null,6668]
[null,"Street lights not repaired by \"fix by\" date",null,"N/A"]
[null,"Street lights not repaired in 2 business days",null,625]
[null,"Street lights – number of business days to repair",null,1.76]
[null,"Street Light - GSL payments ",null,33,825]
[]
[null,"To enter further GSL parameters relating to street lights -  please copy a row from above and \"insert copied cells\" above this row."]
[]
[null,"Planned interruptions"]
[]
[]
[]
[null,"To enter further GSL parameters relating to planned interruptions -  please copy a row from above and \"insert copied cells\" above this row."]
[]
[null,"<NSP defined parameter category>"]
[]
[]
[]
[null,"To enter further GSL parameters - please identify the parameter and if insufficient rows  please copy a row from above and \"insert copied cells\" above this row."]
[]
[null,"<NSP defined parameter category>"]
[]
[]
[]
[null,"To enter further GSL parameters - please identify the parameter and if insufficient rows  please copy a row from above and \"insert copied cells\" above this row."]
[]
[null,"<NSP defined parameter category>"]
[]
[]
[]
[null,"To enter further GSL parameters - please identify the parameter and if insufficient rows  please copy a row from above and \"insert copied cells\" above this row."]
[]
[null,"<NSP defined parameter category>"]
[]
[]
[]
[null,"To enter further GSL parameters - please identify the parameter and if insufficient rows  please copy a row from above and \"insert copied cells\" above this row."]
[]
[]
[null,"6.9.2 - GUARANTEED SERVICE LEVELS - AER GSL SCHEME"]
[]
[null,"Complete Table 6.9.2 if the AER's GSL scheme applied at any time during the regulatory year. \n\nDo not complete Table 6.9.2 if the AER's GSL scheme did not apply during the regulatory year."]
[]
[null,null,null,"2017","2017"]
[null,null,null,"Volume","Value \nof GSL payments"]
[null,null,null,"0's","$0's"]
[null,"New connections "]
[null,"Number of connections made"]
[null,"Number of connections not made on or before the day agreed"]
[null,"Connections - GSL payments – 1-6 day delay"]
[null,"Connections - GSL payments – 7+ day delay"]
[null,"Reliability of supply"]
[null,"Frequency of interruptions – CBD feeders – 9 interruptions"]
[null,"Frequency of interruptions – Urban feeders – 9 interruptions"]
[null,"Frequency of interruptions – Rural (short and long) feeders – 15 interruptions"]
[null,"Interruptions – CBD feeders – 12 hours duration"]
[null,"Interruptions – Urban feeders – 12 hours duration"]
[null,"Interruptions – Rural (short and long) feeders – 18 hours duration"]
[null,"Total duration of interruptions Level 1 – 20 hours"]
[null,"Total duration of interruptions Level 2 – 30 hours"]
[null,"Total duration of interruptions Level 3 – 60 hours"]
[null,"Street lights"]
[null,"Streetlight repair 5 days – GSL payments"]
[null,"Planned interruptions"]
[null,"Notice of planned interruptions – 4 business days notice not given"]
[null,"Total ",null,null,0]

{"sheet":"7.8 Avoided TUOS Payments","index":14,"n_rows":11,"n_cols":3,"rows_kept":11,"cut":false,"hidden":false,"merged":[]}
[null,"ANNUAL REPORTING STATEMENT"]
[null,"AusNet (D)"]
[null,"Annual Reporting RIN Response 2017"]
[null,"7.8 - AVOIDED TUOS PAYMENTS"]
[]
[null,"7.8.1 - AVOIDED TUOS PAYMENTS"]
[null,null,"Avoided TUOS Payment "]
[null,null,"$0's, nominal"]
[null,"Embedded generators"]
[null,"Market network service providers"]
[null,"Other"]

{"sheet":"7.10 Juris Scheme","index":15,"n_rows":17,"n_cols":6,"rows_kept":17,"cut":false,"hidden":false,"merged":[[8,4,9,4],[8,3,9,3],[8,2,9,2],[8,1,9,1],[5,1,5,2]]}
[null,"ANNUAL REPORTING STATEMENT"]
[null,"AusNet (D)"]
[null,"Annual Reporting RIN Response 2017"]
[null,"7.10 - JURISDICTIONAL SCHEMES"]
[]
[null,"Instructions\nBusiness must list each relevant jurisdictional scheme individually and report information for each scheme separately from other schemes."]
[]
[null,"7.10.1 - JURISDICTIONAL SCHEME PAYMENTS"]
[null,"Jurisdictional Scheme Name","Description","Date DNSP Became Subject to Scheme","Description of Cost Recovery Method","Total Scheme Payments  "]
[null,null,null,null,null,"$0's, nominal"]
[null,"PFIT","Premium feed-in tariff payments","2009-11-01","Through Jurisdictional Tariffs",25452097.728401579]
[null,"TFIT","Transitional feed-in tariff payments","2012-01-01","Through Jurisdictional Tariffs",-517209.54687557812]
[]
[]
[]
[]
[null,null,null,null,"Total",24934888.181526002]

{"sheet":"7.11 DMIS-DMIA","index":16,"n_rows":17,"n_cols":5,"rows_kept":17,"cut":false,"hidden":false,"merged":[[6,2,6,4],[8,2,8,4]]}
[null,"ANNUAL REPORTING STATEMENT"]
[null,"AusNet (D)"]
[null,"Annual Reporting RIN Response 2017"]
[null,"7.11 - DEMAND MANAGEMENT INCENTIVE SCHEME"]
[]
[null,"7.11.1 - DMIA - PROJECTS SUBMITTED FOR APPROVAL"]
[null,null,"Total amount of the DMIA spent in 2017"]
[null,null,"Operating expenditure","Capital expenditure","Total"]
[null,"Name of project","$0's, nominal"]
[null,"Grid Energy Storage System Trial",260556.93,null,260556.93]
[null,"Mooroolbark Community Mini Grid",null,600099.94999999984,600099.94999999984]
[null,null,null,null,0]
[null,null,null,null,0]
[null,null,null,null,0]
[null,null,null,null,0]
[null,"To enter additional projects - please copy a row from above and \"insert copied cells\" above this row. "]
[null,"Total",260556.93,600099.94999999984,860656.87999999989]

{"sheet":"7.12 Safety and Bushfire","index":17,"n_rows":357,"n_cols":7,"rows_kept":357,"cut":false,"hidden":false,"merged":[[87,3,87,4],[88,3,88,4],[171,2,171,3],[172,2,172,3],[223,3,223,4],[224,3,224,4],[145,1,145,2],[147,1,147,2],[149,1,149,2],[150,1,150,2],[151,1,151,2],[152,1,152,2],[153,1,153,2],[123,1,124,2],[222,1,224,1],[222,2,224,2],[170,1,172,1],[134,1,134,2],[135,1,135,2],[136,1,136,2],[125,1,125,2],[126,1,126,2],[127,1,127,2],[128,1,128,2],[129,1,129,2],[130,1,130,2],[131,1,131,2],[132,1,132,2],[133,1,133,2],[295,6,295,7],[296,6,296,7],[297,6,297,7],[137,1,137,2],[138,1,138,2],[139,1,139,2],[140,1,140,2],[141,1,141,2],[142,1,142,2],[143,1,143,2],[144,1,144,2],[319,6,319,7],[320,6,320,7],[301,6,301,7],[302,6,302,7],[303,6,303,7],[304,6,304,7],[305,6,305,7],[306,6,306,7],[307,6,307,7],[308,6,308,7],[309,6,309,7],[312,6,312,7],[313,6,313,7],[314,6,314,7],[316,6,316,7],[318,6,318,7],[310,6,310,7],[311,6,311,7],[5,1,5,2],[25,2,25,5],[26,2,26,5],[27,2,27,5],[28,2,28,5],[29,2,29,5],[30,2,30,5],[44,2,44,5],[31,2,31,5],[32,2,32,5],[14,1,14,4],[13,1,13,4],[33,2,33,5],[24,2,24,5],[17,2,17,5],[18,2,18,5],[19,2,19,5],[20,2,20,5],[21,2,21,5],[22,2,22,5],[23,2,23,5],[10,1,10,2],[43,2,43,5],[38,2,38,5],[37,2,37,5],[18,6,18,8],[19,6,19,8],[20,6,20,8],[21,6,21,8],[22,6,22,8],[44,6,44,8],[45,6,45,8],[46,6,46,8],[28,6,28,8],[42,2,42,5],[29,6,29,8],[30,6,30,8],[31,6,31,8],[23,6,23,8],[24,6,24,8],[25,6,25,8],[26,6,26,8],[27,6,27,8],[42,6,42,8],[37,6,37,8],[43,6,43,8],[38,6,38,8],[40,6,40,8],[11,1,11,2],[17,6,17,8],[32,6,32,8],[33,6,33,8],[34,2,34,5],[34,6,34,8],[35,2,35,5],[35,6,35,8],[36,2,36,5],[36,6,36,8],[355,4,355,6],[339,4,339,6],[328,4,328,6],[329,4,329,6],[330,4,330,6],[331,4,331,6],[332,4,332,6],[333,4,333,6],[340,4,340,6],[341,4,341,6],[336,4,336,6],[337,4,337,6],[338,4,338,6],[347,4,347,6],[349,4,349,6],[351,4,351,6],[353,4,353,6],[346,4,346,6],[352,4,352,6],[344,4,344,6],[345,4,345,6],[342,4,342,6],[343,4,343,6],[334,4,334,6],[39,2,39,5],[41,2,41,5],[39,6,39,8],[41,6,41,8],[146,1,146,2],[148,1,148,2],[40,2,40,5],[46,2,46,5],[354,4,354,6],[258,1,259,1],[258,2,259,2],[327,4,327,6],[326,4,326,6],[298,6,298,7],[299,6,299,7],[300,6,300,7],[321,6,321,7],[322,6,322,7],[335,4,335,6],[86,1,88,1],[86,2,88,2],[45,2,45,5],[293,6,293,7],[294,6,294,7]]}
[null,"ANNUAL REPORTING STATEMENT"]
[null,"AusNet (D)"]
[null,"Annual Reporting RIN Response 2017"]
[null,"7.12 SAFETY AND BUSHFIRE RELATED EXPENDITURE"]
[]
[null,"These templates collect information from Victorian businesses only.\n\nBushfire and safety related expenditure information is used by the AER to monitor the expenditures throughout the regulatory control period."]
[]
[null,"CPI applied to convert expected expenditure in real $ to nominal based on lagged September CPI index"]
[]
[null,"Instructions"]
[null,"For \"Exclusive of Margins & Overheads\" reported expenditure is to EXCLUDE any overheads, profit margins or management fees paid directly or indirectly to related party contractors (not including actual incurred expense of the related party contractor) for the reporting period."]
[null,"For \"Value of Margins & Overheads\" reported expenditure is to COMPRISE ONLY the sum of overheads, profit margins or management fees paid directly or indirectly to related party contractors (not including actual incurred expenses of the related party contractor) for the reporting period. "]
[]
[null,"AusNet (D) is to specify each activity in this table in accordance with the definition in Appendix F of the RIN."]
[null,"All activities must be reported but the Reason for Difference is only required if there is a 10 per cent difference between the expected value and the actual value.\n\nUse median unit costs. Where unit costs are not recorded at the asset category level - provide the best estimates of the unit cost using the cost allocation method identified in this table. (As a transitional measure, the unit cost may be based on a statistically significant annual sample of actual work orders at a 5% or better confidence interval.)\n\nProvide basis of allocation where applicable."]
[]
[null,"7.12.1 - SAFETY AND BUSHFIRE RELATED ASSET GROUP DEFINITIONS AND ALLOCATION BASIS"]
[null,"Activity","Definitions",null,null,null,"Basis for allocation of cost to activity"]
[null,"Planned non-preferred services replacements","N/A",null,null,null,"N/A"]
[null,"Planned replacement of non-preferred services due to height ","N/A",null,null,null,"N/A"]
[null,"Removal of public lighting switchwire ","N/A",null,null,null,"N/A"]
[null,"Replacement of existing SWER lines with 22kV overhead bare conductor ","N/A",null,null,null,"N/A"]
[null,"Installation of GFN and associated equipment at zone substations ","N/A - REFCL Programme works are disclosed in additional categories below.",null,null,null,"N/A"]
[null,"Replacement of crossarms/insulator sets – pole top fire mitigation","N/A",null,null,null,"N/A"]
[null,"Replacement of crossarms – based on age and condition ","Replacement of crossarms – based on age and condition ",null,null,null,"Projects allocated directly to activity"]
[null,"Replacement of poles – based on age and condition ","N/A",null,null,null,"N/A"]
[null,"Stake poles – based on age and condition ","N/A",null,null,null,"N/A"]
[null,"Replacement of undersized poles ","N/A",null,null,null,"N/A"]
[null,"Stake undersized poles","N/A",null,null,null,"N/A"]
[null,"Replacement of overhead conductor – mainly steel ","Includes Steel Conductor replacement programme",null,null,null,"Projects allocated directly to activity"]
[null,"Service line clearance – overhead services requiring relocation ","N/A",null,null,null,"N/A"]
[null,"Service line clearance – overhead services requiring undergrounding ","N/A",null,null,null,"N/A"]
[null,"Replacement of 22kV distribution feeders with ABC/underground cabling","Includes Vibration Dampers & Armour Rods, 56M (overhangs), Jigsaw/ABC projects. This will include works in codified areas (in future periods).",null,null,null,"Projects allocated directly to activity"]
[null,"Replacement of SWER with covered carbon core conductor or equivalent","N/A",null,null,null,"N/A"]
[null,"Replacement of SWER with ABC","N/A",null,null,null,"N/A"]
[null,"Replacement of SWER with underground","N/A",null,null,null,"N/A"]
[null,"Replacement of surge diverters (neptune configuration)","N/A",null,null,null,"N/A"]
[null,"Replacement of surge diverters (single phase or three phase)","N/A",null,null,null,"N/A"]
[null,"REFCL Programme - Surge Arrester Replacements","REFCL Programme - Surge Arrester Replacements",null,null,null,"Projects allocated directly to activity"]
[null,"REFCL Programme - Zone Substation Works","REFCL Programme - Zone Substation Works",null,null,null,"Projects allocated directly to activity"]
[null,"REFCL Programme - Network Balancing","REFCL Programme - Network Balancing",null,null,null,"Projects allocated directly to activity"]
[null,"REFCL Programme - Compatible equipment","REFCL Programme - Compatible equipment",null,null,null,"Projects allocated directly to activity"]
[null,"REFCL Programme - Other","REFCL Programme - Other",null,null,null,"Projects allocated directly to activity"]
[null,"Other ","Other ",null,null,null,"Projects allocated directly to activity"]
[null,"Other - Environmental works","Other - Environmental works",null,null,null,"Projects allocated directly to activity"]
[null,"Other - EDO","Other - EDO",null,null,null,"Projects allocated directly to activity"]
[null,"Other - Security","Other - Security",null,null,null,"Projects allocated directly to activity"]
[null,"To enter further activities - please copy row from above and \"insert copied cells\" into a row above this row. "]
[]
[null,"7.12.2 - BUSHFIRE RELATED"]
[]
[null,"7.12.2.1 - NUMBER OF ACTIVITIES"]
[null,"Activity","Units","Number of Activities"]
[null,"Planned non-preferred services replacements","number of services"]
[null,"Planned replacement of non-preferred services due to height ","number of services"]
[null,"Removal of public lighting switchwire ","number of spans removed"]
[null,"Replacement of existing SWER lines with 22kV overhead bare conductor ","kms of SWER"]
[null,"Installation of GFN and associated equipment at zone substations ","number of zone substations"]
[null,"Replacement of crossarms/insulator sets – pole top fire mitigation","number of crossarms/sets"]
[null,"Replacement of crossarms – based on age and condition ","number of crossarms"]
[null,"Replacement of poles – based on age and condition ","number of poles"]
[null,"Stake poles – based on age and condition ","number of poles"]
[null,"Replacement of undersized poles ","number of poles"]
[null,"Stake undersized poles","number of poles"]
[null,"Replacement of overhead conductor – mainly steel ","kms "]
[null,"Service line clearance – overhead services requiring relocation ","number of services"]
[null,"Service line clearance – overhead services requiring undergrounding ","number of services"]
[null,"Replacement of 22kV distribution feeders with ABC/underground cabling","number of feeders"]
[null,"Replacement of SWER with covered carbon core conductor or equivalent","kms "]
[null,"Replacement of SWER with ABC","kms "]
[null,"Replacement of SWER with underground","kms "]
[null,"Replacement of surge diverters (neptune configuration)","number of units"]
[null,"Replacement of surge diverters (single phase or three phase)","number of units"]
[null,"REFCL Programme - Surge Arrester Replacements","number of units"]
[null,"REFCL Programme - Zone Substation Works","number of units"]
[null,"REFCL Programme - Network Balancing","number of units"]
[null,"REFCL Programme - Compatible equipment","number of units"]
[null,"REFCL Programme - Other","number of units"]
[null,"Other ","number of units"]
[null,"Other - Environmental works","number of units"]
[null,"Other - EDO","number of units"]
[null,"Other - Security","number of projects"]
[null,"To enter further activities - please copy row from above and \"insert copied cells\" into a row above this row. "]
[]
[]
[null,"7.12.2.2 - EXPENDITURE "]
[null,"Activity","Units","Exclusive of \nMargins & Overheads","Value of \nMargins & Overheads"]
[null,null,null,"Actual Expenditure"]
[null,null,null,"$0's, Nominal"]
[null,"Planned non-preferred services replacements","number of services"]
[null,"Planned replacement of non-preferred services due to height ","number of services"]
[null,"Removal of public lighting switchwire ","number of spans removed"]
[null,"Replacement of existing SWER lines with 22kV overhead bare conductor ","kms of SWER"]
[null,"Installation of GFN and associated equipment at zone substations ","number of zone substations"]
[null,"Replacement of crossarms/insulator sets – pole top fire mitigation","number of crossarms/sets"]
[null,"Replacement of crossarms – based on age and condition ","number of crossarms"]
[null,"Replacement of poles – based on age and condition ","number of poles"]
[null,"Stake poles – based on age and condition ","number of poles"]
[null,"Replacement of undersized poles ","number of poles"]
[null,"Stake undersized poles","number of poles"]
[null,"Replacement of overhead conductor – mainly steel ","kms "]
[null,"Service line clearance – overhead services requiring relocation ","number of services"]
[null,"Service line clearance – overhead services requiring undergrounding ","number of services"]
[null,"Replacement of 22kV distribution feeders with ABC/underground cabling","number of feeders"]
[null,"Replacement of SWER with covered carbon core conductor or equivalent","kms "]
[null,"Replacement of SWER with ABC","kms "]
[null,"Replacement of SWER with underground","kms "]
[null,"Replacement of surge diverters (neptune configuration)","number of units"]
[null,"Replacement of surge diverters (single phase or three phase)","number of units"]
[null,"REFCL Programme - Surge Arrester Replacements","number of units"]
[null,"REFCL Programme - Zone Substation Works","number of units"]
[null,"REFCL Programme - Network Balancing","number of units"]
[null,"REFCL Programme - Compatible equipment","number of units"]
[null,"REFCL Programme - Other","number of units"]
[null,"Other ","number of units"]
[null,"Other - Environmental works","number of units"]
[null,"Other - EDO","number of units"]
[null,"Other - Security","number of projects"]
[null,"To enter further activities - please copy row from above and \"insert copied cells\" into a row above this row. "]
[]
[]
[]
[null,"7.12.2.3 - UNIT COSTS"]
[null,"Activity",null,"Actual"]
[null,null,null,"$0's, Per Unit"]
[null,"Planned non-preferred services replacements"]
[null,"Planned replacement of non-preferred services due to height "]
[null,"Removal of public lighting switchwire "]
[null,"Replacement of existing SWER lines with 22kV overhead bare conductor "]
[null,"Installation of GFN and associated equipment at zone substations "]
[null,"Replacement of crossarms/insulator sets – pole top fire mitigation"]
[null,"Replacement of crossarms – based on age and condition "]
[null,"Replacement of poles – based on age and condition "]
[null,"Stake poles – based on age and condition "]
[null,"Replacement of undersized poles "]
[null,"Stake undersized poles"]
[null,"Replacement of overhead conductor – mainly steel "]
[null,"Service line clearance – overhead services requiring relocation "]
[null,"Service line clearance – overhead services requiring undergrounding "]
[null,"Replacement of 22kV distribution feeders with ABC/underground cabling"]
[null,"Replacement of SWER with covered carbon core conductor or equivalent"]
[null,"Replacement of SWER with ABC"]
[null,"Replacement of SWER with underground"]
[null,"Replacement of surge diverters (neptune configuration)"]
[null,"Replacement of surge diverters (single phase or three phase)"]
[null,"REFCL Programme - Surge Arrester Replacements"]
[null,"REFCL Programme - Zone Substation Works"]
[null,"REFCL Programme - Network Balancing"]
[null,"REFCL Programme - Compatible equipment"]
[null,"REFCL Programme - Other"]
[null,"Other "]
[null,"Other - Environmental works"]
[null,"Other - EDO"]
[null,"Other - Security"]
[null,"To enter further activities - please copy row from above and \"insert copied cells\" into a row above this row. "]
[]
[]
[null,"7.12.2.4 - CONTINGENT PROJECT APPLICATIONS - VOLUMES APPROVED"]
[null,"Activity","Units","Volume approved under contingent project applications ","Actual volumes","Difference"]
[null,"REFCL Programme - Surge Arrester Replacements","number of units",null,null,-2769.4000000000005]
[null,"REFCL Programme - Zone Substation Works","number of units",null,null,-2]
[null,"REFCL Programme - Network Balancing","number of units",null,null,-3]
[null,"REFCL Programme - Compatible equipment","number of units",null,null,3]
[null,"REFCL Programme - Other","number of units",null,null,-5]
[null,null,null,null,null,0]
[null,null,null,null,null,0]
[null,null,null,null,null,0]
[null,"To enter further activities - please copy row from above and \"insert copied cells\" into a row above this row. "]
[]
[null,"7.12.2.5 - CONTINGENT PROJECT APPLICATIONS - EXPENDITURE APPROVED"]
[null,"Activity","Exclusive of \nMargins & Overheads","Value of \nMargins & Overheads"]
[null,null,"Actual Expenditure"]
[null,null,"$0's, Nominal"]
[null,"REFCL Programme - Surge Arrester Replacements"]
[null,"REFCL Programme - Zone Substation Works"]
[null,"REFCL Programme - Network Balancing"]
[null,"REFCL Programme - Compatible equipment"]
[null,"REFCL Programme - Other"]
[null,""]
[null,""]
[null,""]
[null,"To enter further activities - please copy row from above and \"insert copied cells\" into a row above this row. "]
[]
[]
[]
[null,"7.12.3 - SAFETY RELATED"]
[]
[null,"7.12.3.1 - NUMBER OF ACTIVITIES"]
[null,"Activity","Units","Number of Activities"]
[null,"Planned non-preferred services replacements","number of services"]
[null,"Planned replacement of non-preferred services due to height ","number of services"]
[null,"Removal of public lighting switchwire ","number of spans removed"]
[null,"Replacement of existing SWER lines with 22kV overhead bare conductor ","kms of SWER"]
[null,"Installation of GFN and associated equipment at zone substations ","number of zone substations"]
[null,"Replacement of crossarms/insulator sets – pole top fire mitigation","number of crossarms/sets"]
[null,"Replacement of crossarms – based on age and condition ","number of crossarms"]
[null,"Replacement of poles – based on age and condition ","number of poles"]
[null,"Stake poles – based on age and condition ","number of poles"]
[null,"Replacement of undersized poles ","number of poles"]
[null,"Stake undersized poles","number of poles"]
[null,"Replacement of overhead conductor – mainly steel ","kms "]
[null,"Service line clearance – overhead services requiring relocation ","number of services"]
[null,"Service line clearance – overhead services requiring undergrounding ","number of services"]
[null,"Replacement of 22kV distribution feeders with ABC/underground cabling","number of feeders"]
[null,"Replacement of SWER with covered carbon core conductor or equivalent","kms "]
[null,"Replacement of SWER with ABC","kms "]
[null,"Replacement of SWER with underground","kms "]
[null,"Replacement of surge diverters (neptune configuration)","number of units"]
[null,"Replacement of surge diverters (single phase or three phase)","number of units"]
[null,"REFCL Programme - Surge Arrester Replacements","number of units"]
[null,"REFCL Programme - Zone Substation Works","number of units"]
[null,"REFCL Programme - Network Balancing","number of units"]
[null,"REFCL Programme - Compatible equipment","number of units"]
[null,"REFCL Programme - Other","number of units"]
[null,"Other ","number of units"]
[null,"Other - Environmental works","number of units"]
[null,"Other - EDO","number of units"]
[null,"Other - Security","number of projects"]
[null,"To enter further activities - please copy row from above and \"insert copied cells\" into a row above this row. "]
[]
[]
[null,"7.12.3.2 - EXPENDITURE"]
[null,"Activity","Units","Exclusive of \nMargins & Overheads","Value of \nMargins & Overheads"]
[null,null,null,"Actual Expenditure"]
[null,null,null,"$0's, Nominal"]
[null,"Planned non-preferred services replacements","number of services"]
[null,"Planned replacement of non-preferred services due to height ","number of services"]
[null,"Removal of public lighting switchwire ","number of spans removed"]
[null,"Replacement of existing SWER lines with 22kV overhead bare conductor ","kms of SWER"]
[null,"Installation of GFN and associated equipment at zone substations ","number of zone substations"]
[null,"Replacement of crossarms/insulator sets – pole top fire mitigation","number of crossarms/sets"]
[null,"Replacement of crossarms – based on age and condition ","number of crossarms"]
[null,"Replacement of poles – based on age and condition ","number of poles"]
[null,"Stake poles – based on age and condition ","number of poles"]
[null,"Replacement of undersized poles ","number of poles"]
[null,"Stake undersized poles","number of poles"]
[null,"Replacement of overhead conductor – mainly steel ","kms "]
[null,"Service line clearance – overhead services requiring relocation ","number of services"]
[null,"Service line clearance – overhead services requiring undergrounding ","number of services"]
[null,"Replacement of 22kV distribution feeders with ABC/underground cabling","number of feeders"]
[null,"Replacement of SWER with covered carbon core conductor or equivalent","kms "]
[null,"Replacement of SWER with ABC","kms "]
[null,"Replacement of SWER with underground","kms "]
[null,"Replacement of surge diverters (neptune configuration)","number of units"]
[null,"Replacement of surge diverters (single phase or three phase)","number of units"]
[null,"REFCL Programme - Surge Arrester Replacements","number of units"]
[null,"REFCL Programme - Zone Substation Works","number of units"]
[null,"REFCL Programme - Network Balancing","number of units"]
[null,"REFCL Programme - Compatible equipment","number of units"]
[null,"REFCL Programme - Other","number of units"]
[null,"Other ","number of units"]
[null,"Other - Environmental works","number of units"]
[null,"Other - EDO","number of units"]
[null,"Other - Security","number of projects"]
[null,"To enter further activities - please copy row from above and \"insert copied cells\" into a row above this row. "]
[]
[]
[null,"7.12.3.3 - UNIT COSTS"]
[null,"Activity","Units","Actual"]
[null,null,null,"$0's, Per Unit"]
[null,"Planned non-preferred services replacements","number of services"]
[null,"Planned replacement of non-preferred services due to height ","number of services"]
[null,"Removal of public lighting switchwire ","number of spans removed"]
[null,"Replacement of  existing SWER lines with 22kV overhead bare conductor ","kms of SWER"]
[null,"Installation of GFN and associated equipment at zone substations ","number of zone substations"]
[null,"Replacement of crossarms/insulator sets – pole top fire mitigation","number of crossarms/sets"]
[null,"Replacement of crossarms – based on age and condition ","number of crossarms"]
[null,"Replacement of poles – based on age and condition ","number of poles"]
[null,"Stake poles – based on age and condition ","number of poles"]
[null,"Replacement of undersized poles ","number of poles"]
[null,"Stake undersized poles","number of poles"]
[null,"Replacement of overhead conductor – mainly steel ","kms "]
[null,"Service line clearance – overhead services requiring relocation ","number of services"]
[null,"Service line clearance – overhead services requiring undergrounding ","number of services"]
[null,"Replacement of 22kV distribution feeders with ABC/underground cabling","number of feeders"]
[null,"Replacement of SWER with covered carbon core conductor or equivalent","kms "]
[null,"Replacement of SWER with ABC","kms "]
[null,"Replacement of SWER with underground","kms "]
[null,"Replacement of surge diverters (neptune configuration)","number of units"]
[null,"Replacement of surge diverters (single phase or three phase)","number of units"]
[null,"REFCL Programme - Surge Arrester Replacements","number of units"]
[null,"REFCL Programme - Zone Substation Works","number of units"]
[null,"REFCL Programme - Network Balancing","number of units"]
[null,"REFCL Programme - Compatible equipment","number of units"]
[null,"REFCL Programme - Other","number of units"]
[null,"Other ","number of units"]
[null,"Other - Environmental works","number of units"]
[null,"Other - EDO","number of units"]
[null,"Other - Security","number of projects"]
[null,"To enter further activities - please copy row from above and \"insert copied cells\" into a row above this row. "]
[]
[]
[null,"7.12.4 - SAFETY IMPROVEMENT OUTCOMES REPORTED TO ESV"]
[null,"Activity","Units","Safety Improvement Programme - outcomes","Safety Improvement Target","Difference","Reasons for Difference"]
[null,"Planned non-preferred services replacements","number of services"]
[null,"Planned replacement of non-preferred services due to height ","number of services"]
[null,"Removal of public lighting switchwire ","number of spans removed"]
[null,"Replacement of  existing SWER lines with 22kV overhead bare conductor ","kms of SWER"]
[null,"Installation of GFN and associated equipment at zone substations ","number of zone substations"]
[null,"Replacement of crossarms/insulator sets – pole top fire mitigation","number of crossarms/sets"]
[null,"Replacement of crossarms – based on age and condition ","number of crossarms"]
[null,"Replacement of poles – based on age and condition ","number of poles"]
[null,"Stake poles – based on age and condition ","number of poles"]
[null,"Replacement of undersized poles ","number of poles"]
[null,"Stake undersized poles","number of poles"]
[null,"Replacement of overhead conductor – mainly steel ","kms "]
[null,"Service line clearance – overhead services requiring relocation ","number of services"]
[null,"Service line clearance – overhead services requiring undergrounding ","number of services"]
[null,"Replacement of 22kV distribution feeders with ABC/underground cabling","number of feeders"]
[null,"Replacement of SWER with covered carbon core conductor or equivalent","kms "]
[null,"Replacement of SWER with ABC","kms "]
[null,"Replacement of SWER with underground","kms "]
[null,"Replacement of surge diverters (neptune configuration)","number of units"]
[null,"Replacement of surge diverters (single phase or three phase)","number of units"]
[null,"REFCL Programme - Surge Arrester Replacements","number of units"]
[null,"REFCL Programme - Zone Substation Works","number of units"]
[null,"REFCL Programme - Network Balancing","number of units"]
[null,"REFCL Programme - Compatible equipment","number of units"]
[null,"REFCL Programme - Other","number of units"]
[null,"Other ","number of units"]
[null,"Other - Environmental works","number of units"]
[null,"Other - EDO","number of units"]
[null,"Other - Security","number of projects"]
[null,"To enter further activities - please copy row from above and \"insert copied cells\" into a row above this row. "]
[]
[null,"7.12.5 - RECONCILIATION OF VOLUME OF OUTCOMES REPORTED TO ESV AND AER"]
[null,"Activity","Units","Difference","Reasons for Difference"]
[null,"Planned non-preferred services replacements","number of services"]
[null,"Planned replacement of non-preferred services due to height ","number of services"]
[null,"Removal of public lighting switchwire ","number of spans removed"]
[null,"Replacement of  existing SWER lines with 22kV overhead bare conductor ","kms of SWER"]
[null,"Installation of GFN and associated equipment at zone substations ","number of zone substations"]
[null,"Replacement of crossarms/insulator sets – pole top fire mitigation","number of crossarms/sets"]
[null,"Replacement of crossarms – based on age and condition ","number of crossarms"]
[null,"Replacement of poles – based on age and condition ","number of poles"]
[null,"Stake poles – based on age and condition ","number of poles"]
[null,"Replacement of undersized poles ","number of poles"]
[null,"Stake undersized poles","number of poles"]
[null,"Replacement of overhead conductor – mainly steel ","kms "]
[null,"Service line clearance – overhead services requiring relocation ","number of services"]
[null,"Service line clearance – overhead services requiring undergrounding ","number of services"]
[null,"Replacement of 22kV distribution feeders with ABC/underground cabling","number of feeders"]
[null,"Replacement of SWER with covered carbon core conductor or equivalent","kms "]
[null,"Replacement of SWER with ABC","kms "]
[null,"Replacement of SWER with underground","kms "]
[null,"Replacement of surge diverters (neptune configuration)","number of units"]
[null,"Replacement of surge diverters (single phase or three phase)","number of units"]
[null,"REFCL Programme - Surge Arrester Replacements","number of units"]
[null,"REFCL Programme - Zone Substation Works","number of units"]
[null,"REFCL Programme - Network Balancing","number of units"]
[null,"REFCL Programme - Compatible equipment","number of units"]
[null,"REFCL Programme - Other","number of units"]
[null,"Other ","number of units"]
[null,"Other - Environmental works","number of units"]
[null,"Other - EDO","number of units"]
[null,"Other - Security","number of projects"]
[null,"To enter further activities - please copy row from above and \"insert copied cells\" into a row above this row. "]

{"sheet":"7.13 TARC","index":18,"n_rows":9,"n_cols":3,"rows_kept":9,"cut":false,"hidden":false,"merged":[]}
[null,"ANNUAL REPORTING STATEMENT"]
[null,"AusNet (D)"]
[null,"Annual Reporting RIN Response 2017"]
[null,"7.13 - TARC"]
[]
[]
[null,"7.13.1 - TOTAL ANNUAL RETAILER CHARGES"]
[null,null,"$0's"]
[null,"TARC",757655954.98899996]

{"sheet":"8.1 Income","index":19,"n_rows":39,"n_cols":12,"rows_kept":39,"cut":false,"hidden":false,"merged":[[6,6,6,10],[7,8,7,10],[6,11,8,11],[9,2,9,11],[6,5,8,5],[7,6,7,7],[6,2,8,2],[6,3,8,3],[6,4,8,4]]}
[null,"ANNUAL REPORTING STATEMENT"]
[null,"AusNet (D)"]
[null,"Annual Reporting RIN Response 2017"]
[null,"8.1 - INCOME"]
[]
[null,"8.1.1 - INCOME STATEMENT"]
[null,null,"Audited Statutory Accounts","Adjustments","Distribution business","Standard Control Services","Alternative Control Services",null,null,null,null,"Negotiated Services"]
[null,null,null,null,null,null,"Public Lighting",null,"Other"]
[null,null,null,null,null,null,"Energy efficient","Non-energy efficient","Connection services","Metering services","Ancillary network services"]
[null,null,"$0's, nominal"]
[null,"8.1.1.1 - REVENUE"]
[null,"Distribution revenue",null,null,754515833.21126235,648042240.6052624,1368581.639999999,5640272.4599999944,3657181.2639999981,89365701.379999995,6441855.861999996]
[null,"Cross boundary revenue",null,null,7663260,7663260]
[null,"Contributions",null,null,0,0]
[null,"Interest income",null,null,0,0]
[null,"Jurisdictional scheme amounts",null,null,26384071.281499997,26384071.281499997]
[null,"Profit from sale of fixed assets",null,null,1500841.0299999998,920123.2,null,129320.91,null,451396.91999999987]
[null,"TUOS revenue",null,null,83214590.99323763,83214590.99323763]
[null,"Pass through revenue (F-factor)",null,null,0,0]
[null,"Other Revenue ",null,null,380921,0,null,null,null,null,380921]
[null,"Total revenue",null,null,873659517.51599991,766224286.08000004,1368581.639999999,5769593.3699999945,3657181.2639999981,89817098.299999997,6822776.861999996,0]
[]
[null,"8.1.1.2 - EXPENDITURE"]
[null,"TUOS expenditure",null,null,92551168.870000005,92551168.870000005]
[null,"Avoided TUOS expenditure",null,null,708910.12999999989,708910.12999999989]
[null,"Cross boundary expenditure",null,null,205734,205734]
[null,"Depreciation ",null,null,138314038.66975084,85372359.338948876,98787.985917094062,990992.79235567665,null,50795361.127508201,1056537.425020993]
[null,"Finance charges",null,null,3084293.1514325058,2811112.2138110599,null,null,null,273180.93762144609]
[null,"Impairment losses",null,null,0]
[null,"Jurisdictional scheme amounts",null,null,24934888.181525998,24934888.181525998]
[null,"Loss from sale of fixed assets",null,null,9685965.0299999993,7371373.7700000061,null,204509.20999999993,null,2110082.0499999933]
[null,"Maintenance expenditure",null,null,82231123.215486333,75773447.931443974,456593.45011088764,1881737.5498891124,null,2051084.8240423666,2068259.4599999997]
[null,"Operating expenditure excluding maintenance expenditure",null,null,165853417.43464521,140955658.81093988,null,null,0,21278823.802746162,3618934.8209591853]
[null,"Other ",null,null,0]
[]
[null,"8.1.1.3 - PROFIT"]
[null,"Profit before tax (PBT)",null,null,{"$f":"E21-SUM(dms_080101_02_dnsp_Values)","v":356089978.83315897},335539632.83333027,{"$f":"G21-G27-G32","v":813200.20397201716},{"$f":"H21-H27-H31-H32","v":2692353.817755206},3657181.2639999981,13308565.558081836,79045.156019818038,0]
[null,"Income tax expenses (/ benefit)"]
[null,"Profit after tax",null,null,{"$f":"E37","v":356089978.83315897},335539632.83333027,{"$f":"G37","v":813200.20397201716},{"$f":"H37","v":2692353.817755206},3657181.2639999981,13308565.558081836,79045.156019818038,0]

{"sheet":"8.2 Capex","index":20,"n_rows":248,"n_cols":10,"rows_kept":248,"cut":false,"hidden":false,"merged":[[140,2,140,3],[196,2,196,3],[6,1,6,4],[41,1,41,4],[10,1,10,4],[7,1,7,4],[8,1,8,4],[14,1,14,4],[16,2,16,9],[17,2,18,2],[17,3,18,3],[17,4,18,4],[17,5,18,5],[17,6,17,9],[19,2,19,3],[19,5,19,9],[43,2,43,5],[44,2,44,5],[55,2,55,5],[56,2,56,5],[50,2,50,5],[51,2,51,5],[49,2,49,5],[45,2,45,5],[46,2,46,5],[47,2,47,5],[81,1,81,2],[58,2,58,5],[63,3,64,3],[63,5,64,5],[65,5,65,9],[65,2,65,3],[57,2,57,5],[63,4,64,4],[48,2,48,5],[63,2,64,2],[52,2,52,5],[53,2,53,5],[54,2,54,5],[62,2,62,9],[63,6,63,9]]}
[null,"ANNUAL REPORTING STATEMENT"]
[null,"AusNet (D)"]
[null,"Annual Reporting RIN Response 2017"]
[null,"8.2 - CAPEX"]
[]
[null,"Instructions"]
[null,"Reported expenditure must EXCLUDE capital contributions (except tables 8.2.1 and 8.2.5 which should include all capital contributions)."]
[null,"Forecast expenditure is to be taken from AusNet (D)'s 2016-20 Distribution Determination."]
[null,"If allocating based on assumptions then provide method in Basis of Preparation. All adjustments must be explained in Basis of Preparation with supporting documentation attached. "]
[]
[null,"For tables 8.2.1 and 8.2.3:\nReported expenditure must INCLUDE any profit margins or management fees paid directly or indirectly to related party contractors (not including actual incurred expenses of the related party contractor) for the regulatory reporting period.\n\n'Related Party Margin Expenditure' must COMPRISE ONLY profit margins or management fees paid directly or indirectly to related party contractors (not including actual incurred expenses of the related party contractor) for the regulatory reporting period."]
[]
[null,"8.2.1 - CAPEX BY PURPOSE - STANDARD CONTROL SERVICES"]
[]
[null,"Each line item in this table must INCLUDE the capital contributions. Total capital contributions should also be identified in the last item in the table. "]
[]
[null,null,"EXPENDITURE"]
[null,null,"CPI adjusted Forecast","Actual","Difference","Related Party Margin","Voltage level"]
[null,null,null,null,null,null,"Subtransmission","HV","LV","Other "]
[null,"Description","$0's, nominal",null," (%)","$0's, nominal"]
[null,"Augmentation",76710362.459005252,55367065.949454993,-0.27823224692695619,null,9657740.4600561131,34394189.433717445,6022125.7438836535,5293010.3117977874]
[null,"Connections",81552816.40599677,70091254.399239123,-0.14054158411523421,null,26152.944702166267,27173957.043765511,42891144.410771452,0]
[null,"Replacement",143237889.43203643,117291671.07975911,-0.18114074743183295,null,17558737.265181389,74458044.501906857,19667574.847287644,5607314.4653832158]
[null,"Non-Network",59755853.421004035,40855125.57,-0.31629918692384495,null,0,0,0,40855125.57]
[null,"Capitalised overheads",37080722.72235693,35881226.307664916,-3.23482480013478E-2,null,4026772.5264671776,20106227.454758406,10137033.6015475,1611192.7248918333]
[null,"Escalation adjustment",-2473974.7255709157,0,-1,null,0,0,0,0]
[null,"REFCL",52800932.195843369,32941186.910026774,-0.37612489893464435,null,0,32941186.910026774,0,0]
[]
[]
[]
[]
[]
[]
[]
[]
[null,"Capital contributions included in the above",39651373.109217823,33484468.709999997,-0.15552814229740242,null,2584603.5942563866,16432363.102966039,13054812.621794945,1412689.3909826297]
[null,"Total",409013228.80145401,318943061.50614494,-0.2202133352978457,null,31269403.196406845,189073605.34417498,78717878.603490248,53366643.072072841]
[]
[]
[null,"8.2.2 - CAPEX BY PURPOSE - MATERIAL DIFFERENCE EXPLANATION"]
[]
[null,"Where the difference between forecast and actual expenditure shown in table 8.2.1 is a Material Difference please explain the main factors driving the difference."]
[]
[null,"Description","Reason for material difference"]
[null,"All Categories  ±10 %","Refer to commentary provided in Responses to Schedule 1."]
[]
[]
[]
[]
[]
[]
[]
[]
[]
[]
[]
[]
[]
[]
[]
[]
[null,"8.2.3 - CAPEX OTHER"]
[null,null,"EXPENDITURE"]
[null,null,"CPI adjusted Forecast","Actual","Difference","Related Party Margin","Voltage level"]
[null,null,null,null,null,null,"Subtransmission","HV","LV","Other "]
[null,null,"$0's, nominal",null," (%)","$0's, nominal"]
[null,"Public lighting"]
[null,"Energy Efficient",null,0,1,null,0,0,0,0]
[null,"Non-energy efficient",1991548.6178676249,6969383.6064872313,2.4994795225985671,null,0,0,0,6969383.6064872313]
[null,"Alternative Control Services"]
[null,"Connection services",0,0,1,null,0,0,0,0]
[null,"Metering services",0,0,1,null,0,0,0,0]
[null,"Ancillary network services",0,0,1,null,0,0,0,0]
[null,"Negotiated Services"]
[null,"Negotiated services",0,0,1,null,0,0,0,0]
[null,"Total",1991548.6178676249,6969383.6064872313,2.4994795225985671,null,0,0,0,6969383.6064872313]
[]
[]
[]
[null,"8.2.4 - CAPEX BY ASSET CLASS"]
[]
[null,"AusNet (D) to enter in Table 8.2.4 each Asset Class specified in its current determination as listed in the AER's final decision in its Roll Forward Model and Post-tax Revenue Model and enter information against that Asset Class."]
[]
[null,null,"CPI adjusted Forecast","Actual ","Difference","Movements in provisions \nallocated to \nas-incurred capex"]
[null,"Asset class","$0's, nominal",null," (%)","$0's, nominal"]
[]
[null,"Subtransmission",67360144.596907571,30460629.900299251,-0.54779446982217928,-588421.7708926677]
[null,"Distribution system assets",260991028.12526786,223964162.81612372,-0.14187026111630302,-4326417.0745025398]
[null,"Standard metering",0,null,1,0]
[null,"Public lighting",0,null,1,0]
[null,"SCADA/Network control",19287740.595509097,19423543.48798335,7.0408916898163122E-3,-375213.37850264297]
[null,"Non-network general assets - IT",55102110.998452507,39722228.469999999,-0.27911603112418759,-767332.26123767439]
[null,"Non-network general assets - Other",6234838.9927249411,5319354.1500000004,-0.14683375846484006,-102756.37106629602]
[null,"Land",37365.492592035182,53142.681738625441,0.42223955987544831,-1026.5812296389906]
[]
[]
[]
[]
[]
[]
[]
[]
[]
[]
[]
[]
[]
[]
[]
[]
[]
[]
[]
[]
[]
[]
[]
[]
[]
[]
[]
[]
[]
[]
[]
[]
[]
[]
[]
[]
[]
[]
[]
[]
[]
[null,"Total",409013228.80145401,318943061.50614488,-0.22021333529784584,-6161167.4374314602]
[]
[]
[null,"8.2.5 - CAPITAL CONTRIBUTIONS BY ASSET CLASS",null,null,null,null,null,null," "]
[null,null,"CPI Adjusted Forecast","Actual","Difference"]
[null,"Asset class","$0's, nominal",null," (%)"]
[null,""]
[null,"Subtransmission",0,0,1]
[null,"Distribution system assets",39651373.109217823,33484468.709999997,-0.15552814229740242]
[null,"Standard metering",0,0,1]
[null,"Public lighting",0,0,1]
[null,"SCADA/Network control",0,0,1]
[null,"Non-network general assets - IT",0,0,1]
[null,"Non-network general assets - Other",null,0,1]
[null,"Land"]
[null,""]
[null,""]
[null,""]
[null,""]
[null,""]
[null,""]
[null,""]
[null,""]
[null,""]
[null,""]
[null,""]
[null,""]
[null,""]
[null,""]
[null,""]
[null,""]
[null,""]
[null,""]
[null,""]
[null,""]
[null,""]
[null,""]
[null,""]
[null,""]
[null,""]
[null,""]
[null,""]
[null,""]
[null,""]
[null,""]
[null,""]
[null,""]
[null,""]
[null,""]
[null,""]
[null,""]
[null,""]
[null,""]
[null,""]
[null,""]
[null,""]
[null,"Total",39651373.109217823,33484468.709999997,-0.15552814229740242]
[]
[]
[null,"8.2.6 - DISPOSALS BY ASSET CLASS"]
[null,null,"CPI Adjusted Forecast","Actual","Difference"]
[null,"Asset class","$0's, nominal",null," (%)"]
[null,"",null,0,1]
[null,"Subtransmission",0,0,1]
[null,"Distribution system assets",0,0,1]
[null,"Standard metering",0,0,1]
[null,"Public lighting",0,0,1]
[null,"SCADA/Network control",0,0,1]
[null,"Non-network general assets - IT",12470.419219953728,0,-1]
[null,"Non-network general assets - Other",1201663.1046269403,377795.12999999995,-0.68560644947380034]
[null,"Land"]
[null,""]
[null,""]
[null,""]
[null,""]
[null,""]
[null,""]
[null,""]
[null,""]
[null,""]
[null,""]
[null,""]
[null,""]
[null,""]
[null,""]
[null,""]
[null,""]
[null,""]
[null,""]
[null,""]
[null,""]
[null,""]
[null,""]
[null,""]
[null,""]
[null,""]
[null,""]
[null,""]
[null,""]
[null,""]
[null,""]
[null,""]
[null,""]
[null,""]
[null,""]
[null,""]
[null,""]
[null,""]
[null,""]
[null,""]
[null,""]
[null,""]
[null,"Total",1214133.523846894,377795.12999999995,-0.68883559956158413]

{"sheet":"8.4 Opex","index":21,"n_rows":142,"n_cols":16,"rows_kept":142,"cut":false,"hidden":false,"merged":[[6,1,6,4],[13,1,13,5],[15,2,17,2],[15,3,17,3],[15,4,17,4],[11,1,11,5],[7,1,7,4],[12,1,12,5],[16,5,17,5],[15,5,15,7],[16,7,17,7],[74,1,74,4],[18,2,18,6],[15,13,17,13],[76,13,78,13],[18,8,18,13],[16,8,16,9],[77,8,77,9],[77,10,77,12],[16,10,16,12],[15,8,15,12],[76,8,76,12],[76,5,76,7],[76,2,78,2],[76,3,78,3],[76,4,78,4],[16,6,17,6],[79,8,79,13],[77,6,78,6],[77,7,78,7],[141,2,141,7],[142,2,142,7],[79,2,79,4],[77,5,78,5],[138,2,138,7],[139,2,139,7],[140,2,140,7],[136,1,136,4]]}
[null,"ANNUAL REPORTING STATEMENT"]
[null,"AusNet (D)"]
[null,"Annual Reporting RIN Response 2017"]
[null,"8.4 OPEX"]
[]
[null,"Instructions"]
[null,"Forecast expenditure is to be taken from AusNet (D)'s 2016-20 Distribution Determination."]
[null,"If allocating based on assumptions then provide method in Basis of Preparation.  \n\nAll adjustments must be explained in Basis of Preparation with supporting documentation attached. "]
[]
[null,"8.4.1 - OPERATING & MAINTENANCE EXPENDITURE - BY PURPOSE"]
[]
[null,"AusNet (D) is to list the operating expenditure categories identified in AusNet (D)'s regulatory proposal at table 3.2.1.1 current opex categories and cost allocations."]
[null,"AusNet (D) must specify any expenditure category where the expense is more than 5 per cent of the total standard control services operating expenditure."]
[null,"Reported operating expenditure must INCLUDE any profit margins or management fees paid directly or indirectly to related party contractors (not including actual incurred expenditure of the related party contractor) for the regulatory reporting period.  "]
[]
[null,null,"Audited Statutory Accounts","Adjustments","Distribution business","Standard Control Services",null,null,"Alternative Control Services",null,null,null,null,"Negotiated Services"]
[null,null,null,null,null,"CPI Adjusted Forecast","Actual","Difference","Public Lighting",null,"Other"]
[null,null,null,null,null,null,null,null,"Energy efficient","Non-energy efficient","Connection services","Metering services","Ancillary network services"]
[null,"Opex category","$0's, nominal",null,null,null,null,"%","$0's, nominal"]
[null,"OPERATING"]
[null,"Network Operating Costs ",null,null,62632775.347223379,54451582.632831924,59013840.526264191,8.3785588459304491E-2,null,null,null,null,3618934.8209591853]
[null,"Billing & Revenue Collection",null,null,261355.00000000003,336611.13683962828,261355.00000000003,-0.22356995536806185]
[null,"Advertising, marketing & promotions",null,null,684289.84000000008,700938.18806707789,684289.84000000008,-2.3751520962194468E-2]
[null,"Customer Service",null,null,5404698.6808204465,9721794.1851992439,5404698.6808204465,-0.44406365966389982]
[null,"Regulatory",null,null,1342751.5531228923,2188920.1523833168,1342751.5531228923,-0.38656896567885685]
[null,"Regulatory Reset",null,null,0,0,0,0]
[null,"IT",null,null,40533130.591672935,15351942.331472827,24149214.711228926,0.57303969685457445,null,null,null,16383915.880444007]
[null,"Licence fee",null,null,0,0,0,1]
[null,"GSL payments",null,null,3476640,8448035.0191525426,3476640,-0.58846761499945155]
[null,"Non-network alternatives costs",null,null,9951882.2599999998,12388153.679390805,9951882.2599999998,-0.19666138170725456]
[null,"AMI Cost",null,null,11969264.971858148,9386075.8231359851,7074357.0495559936,-0.24629236084815925,null,null,null,4894907.9223021548]
[null,"Other - Standard Control Services",null,null,29596629.189947437,28609314.822633505,29596629.189947437,3.4510241627067728E-2]
[null,null,null,null,null,null,null,1]
[null,"MAINTENANCE",null,null,null,null,null,1]
[null,"Routine",null,null,11569604.373558395,14811068.595508208,11569604.373558395,-0.21885417659417641]
[null,"Condition based",null,null,47540327.583362587,56531075.1854399,47540327.583362587,-0.15904080317922137]
[null,"Emergency",null,null,16516475.275187487,18540419.700083718,16516475.275187487,-0.10916389475730649]
[null,"SCADA/Network Control",null,null,147040.69933549786,33058.236699126726,147040.69933549786,3.4479292913823842]
[null,"Other - Standard Control Services",null,null,0,0,0,1]
[null,"AMI",null,null,2051084.8240423666,0,0,1,null,null,null,2051084.8240423666]
[null,"Public Lighting",null,null,{"$f":"I41+J41","v":2338331},0,0,1,456593.45011088764,1881737.5498891124]
[null,"Alternative control -other",null,null,2068259.4599999997,0,0,1,null,null,null,null,2068259.4599999997]
[null,"Negotiated services",null,null,0,0,0,1]
[null,"Other",null,null,0,0,0,1]
[]
[]
[]
[]
[]
[]
[]
[]
[]
[]
[]
[]
[]
[]
[]
[]
[]
[]
[]
[]
[]
[]
[]
[]
[]
[null,"Total",null,null,{"$f":"SUM(E21:E44)","v":248084540.65013158},231498989.68883786,216729106.74238399,-6.3801068705770583E-2,{"$f":"I41","v":456593.45011088764},{"$f":"J41","v":1881737.5498891124},0,23329908.626788527,5687194.2809591852,0]
[]
[]
[null,"8.4.2 - OPERATING & MAINTENANCE EXPENDITURE - BY PURPOSE - MARGINS ONLY"]
[]
[null,"\"Related party margin expenditure' must COMPRISE ONLY profit margins or management fees paid directly or indirectly to related party contractors (for expenditure that is not an actual incurred expenditure of the related party contractor) for the regulatory reporting period."]
[]
[null,null,"Audited Statutory Accounts","Adjustments","Distribution business","Standard Control Services",null,null,"Alternative Control Services",null,null,null,null,"Negotiated Services"]
[null,null,null,null,null,"CPI Adjusted Forecast","Actual","Difference","Public Lighting",null,"Other"]
[null,null,null,null,null,null,null,null,"Energy efficient","Non-energy efficient","Connection services","Metering services","Ancillary network services"]
[null,"Opex category","$0's, nominal",null,null,null,"$0's, nominal","per cent","$0's, nominal"]
[null,"OPERATING",null,null,null,null,null,1]
[null,"Network Operating Costs ",null,null,null,null,null,1]
[null,"Billing & Revenue Collection",null,null,null,null,null,1]
[null,"Advertising, marketing & promotions",null,null,null,null,null,1]
[null,"Customer Service",null,null,null,null,null,1]
[null,"Regulatory",null,null,null,null,null,1]
[null,"Regulatory Reset",null,null,null,null,null,1]
[null,"Regulatory Reset",null,null,null,null,null,1]
[null,"IT",null,null,null,null,null,1]
[null,"Licence fee",null,null,null,null,null,1]
[null,"GSL payments",null,null,null,null,null,1]
[null,"Non-network alternatives costs",null,null,null,null,null,1]
[null,"AMI Cost",null,null,null,null,null,1]
[null,"Other - Standard Control Services",null,null,null,null,null,1]
[null,"",null,null,null,null,null,1]
[null,"MAINTENANCE",null,null,null,null,null,1]
[null,"Routine",null,null,null,null,null,1]
[null,"Condition based",null,null,null,null,null,1]
[null,"Emergency",null,null,null,null,null,1]
[null,"SCADA/Network Control",null,null,null,null,null,1]
[null,"Other - Standard Control Services",null,null,null,null,null,1]
[null,"AMI",null,null,null,null,null,1]
[null,"Public Lighting",null,null,null,null,null,1]
[null,"Alternative control -other",null,null,null,null,null,1]
[null,"Negotiated services",null,null,null,null,null,1]
[null,"Other",null,null,null,null,null,1]
[null,""]
[null,""]
[null,""]
[null,""]
[null,""]
[null,""]
[null,""]
[null,""]
[null,""]
[null,""]
[null,""]
[null,""]
[null,""]
[null,""]
[null,""]
[null,""]
[null,""]
[null,""]
[null,""]
[null,""]
[null,""]
[null,""]
[null,""]
[null,""]
[]
[null,"Total",null,null,0,0,0,1,0,0,0,0,0,0]
[]
[]
[null,"8.4.3 - OPERATING & MAINTENANCE EXPENDITURE - EXPLANATION OF MATERIAL DIFFERENCE"]
[]
[null,"Where the difference between forecast and actual expenditure shown in table 8.4.1, column I is a Material Difference please explain the main factors driving the difference."]
[]
[null,"Category","Explanation"]
[null,"Note",null,null,null,null,null,null,null,null,null,null,null,null,null," "]
[null,"Operating Expenditure"]
[null,"Maintenance Expenditure"]

{"sheet":"9.5 TUoS","index":22,"n_rows":57,"n_cols":6,"rows_kept":57,"cut":false,"hidden":false,"merged":[[79,1,79,4],[58,1,58,4],[24,1,24,4],[25,1,25,4],[81,1,81,4],[75,1,75,4],[55,1,55,4],[80,1,80,4],[47,1,47,4],[51,1,51,4],[52,1,52,4],[53,1,53,4],[54,1,54,4],[48,1,48,4],[49,1,49,4],[50,1,50,4],[77,1,77,4],[78,1,78,4],[59,1,59,4],[60,1,60,4],[61,1,61,4],[62,1,62,4],[63,1,63,4],[64,1,64,4],[65,1,65,4],[66,1,66,4],[67,1,67,4],[68,1,68,4],[69,1,69,4],[70,1,70,4],[57,1,57,4],[76,1,76,4],[74,1,74,4],[71,1,71,4],[72,1,72,4],[73,1,73,4],[5,1,5,3],[26,1,26,3],[30,2,30,5],[42,1,42,4],[31,2,31,5],[9,1,9,4],[10,1,10,4],[11,1,11,4],[12,1,12,4],[18,1,18,4],[19,1,19,4],[13,1,13,3],[20,1,20,4],[21,1,21,4],[22,1,22,4],[23,1,23,4]]}
[null,"ANNUAL REPORTING STATEMENT"]
[null,"AusNet (D)"]
[null,"Annual Reporting RIN Response 2017"]
[null,"9.5 - TUoS AUDIT (t-2)"]
[]
[null,"This template collects information for annual pricing proposals from Victorian businesses only.\n"]
[]
[null,"9.5.1 - TUOS CHARGES (AEMO)"]
[null,null,null,null,null,"2017"]
[]
[]
[]
[]
[null,null,null,null,"Total",82826522.483084679]
[]
[]
[null,"9.5.2 - TRANSMISSION CONNECTION FEES"]
[null,null,null,null,null,"2017"]
[]
[]
[]
[]
[]
[]
[]
[]
[null,null,null,null,"Total",9809533.1238109935]
[]
[]
[null,"9.5.3 - CROSS BOUNDARY NETWORK CHARGES"]
[null,null,"Amount (payable)/receivable"]
[null,null,"$0's, nominal"]
[null,null,"HV crossings","Subtransmission crossings","TUoS Adjustment","Total"]
[null,"Distribution Business",null,null,null,"2017"]
[null,"United Energy (VIC) ",191177.95645189917,170616.97999999998,1404658,1766452.9364518991]
[null,"United Energy (VIC) ",-52829.794655666112,-38314.019999999997,-128,-91271.814655666109]
[null,"Jemena Elec Nwks (Vic) Ltd ",2965970,99216,433925,3499111]
[null,"Jemena Elec Nwks (Vic) Ltd ",0,-196128,-13868,-209996]
[null,"Essential  Energy",-296840.81265583198,0,0,-296840.81265583198]
[null,null,null,null,null,""]
[null,null,null,null,null,""]
[null,null,null,null,null,""]
[null,"Total",null,null,null,4667455.3091404019]
[]
[]
[null,"9.5.4 - PAYMENTS TO EMBEDDED GENERATORS"]
[null,"9.5.4.1 - AVOIDED TRANSMISSION COSTS",null,null,null,"2017"]
[]
[]
[]
[]
[]
[]
[]
[]
[null,"Total",null,null,null,0]
[null,"9.5.4.2 - AVOIDED TUoS USAGE CHARGES",null,null,null,"2017"]