{"text_format":"1","workbook":"xlsx","n_sheets":23,"sheets":["AER only","Contents","Instructions","Business & other details","2.11 Labour","3.6 Quality of services","3.6.8 Network-feeders","3.6.9 Network-reliability","4.1 Public lighting","6.2 STPIS Reliability","6.6 STPIS Customer Service","6.7 STPIS Daily Performance","6.8 STPIS Exclusions","6.9 STPIS - GSL","7.8 Avoided TUOS Payments","7.10 Juris Scheme","7.11 DMIS-DMIA","7.12 Safety and Bushfire","7.13 TARC","8.1 Income","8.2 Capex","8.4 Opex","9.5 TUoS"],"not_rendered":{"charts":0,"images":4,"macros":1,"external_links":0,"defined_names":385,"comments":2,"pivot_tables":0},"unopened":[],"bounds":{"document_bytes":16777216,"sheet_cells":100000,"rows_first":2000,"rows_last":500,"rows_between":2000,"halvings":0,"cell_chars":16384,"cell_head_chars":4096},"cells_cut":0,"cells_raw":0,"read":"whole","date_system":"1900"}

{"sheet":"AER only","index":0,"n_rows":74,"n_cols":23,"rows_kept":74,"cut":false,"hidden":true,"merged":[[0,1,0,9],[18,13,18,16]]}
[null,"Data in this worksheet is used for data validation and database purposes."]
[null,"Date last modified:"]
[null,"14 April 2015","merged cell C46/47"]
[null,"17 April 2015","adjusted dms_RYE to automate based on dms_Model (NB: EB & CA refer to CRCP_y5)"]
[null,"14 May 2015","adapted this cover for use in CA & EB RINs"]
[]
[null,"October 2015","added full Trading Name for worksheet headings"]
[null,"USES NAMED RANGES FLAG","yes"]
[null,"dms_Model_List ","dms_Worksheet_List ",null,"dms_RYE_Formula_Result"]
[null,"ARR","REGULATORY REPORTING STATEMENT",null,{"$f":"LEFT(CRY,2)&RIGHT(CRY,2)","v":"2016"}]
[null,"CA","CATEGORY ANALYSIS",null,{"$f":"LEFT(CRY,2)&RIGHT(CRY,2)","v":"2016"}]
[null,"CAM/Service change Backcast","REGULATORY REPORTING STATEMENT",null,{"$f":"LEFT(dms_FRCP_FinalYear_Num,2)&RIGHT(dms_FRCP_FinalYear_Num,2)","v":"2021"}]
[null,"CPI","CPI"]
[null,"EB","ECONOMIC BENCHMARKING",null,{"$f":"LEFT(CRY,2)&RIGHT(CRY,2)","v":"2016"}]
[null,"PTRM","POST TAX REVENUE MODEL",null,{"$f":"LEFT(dms_FRCP_FinalYear_Num,2)&RIGHT(dms_FRCP_FinalYear_Num,2)","v":"2021"}]
[null,"Reset","REGULATORY REPORTING STATEMENT",null,{"$f":"LEFT(dms_FRCP_FinalYear_Num,2)&RIGHT(dms_FRCP_FinalYear_Num,2)","v":"2021"}]
[null,"RFM","ROLL FORWARD MODEL",null,{"$f":"LEFT(dms_CRCP_FinalYear_Num,2)&RIGHT(dms_CRCP_FinalYear_Num,2)","v":"2015"}]
[null,"WACC","WEIGHTED AVERAGE COST OF CAPITAL"]
[null,null,null,null,null,null,null,null,null,null,null,null,null,"Feeder Types",null,null,null,"TasNetworks (D)"]
[null,null,null,null,null,null,null,null,null,null,null,null,null,"CBD","Urban","Short rural","long rural","EXTRA"]
[null,"dms_TradingName_List","dms_TradingNameFull_List","dms_ABN_List","dms_State_List","dms_Sector_List","dms_Segment_List","dms_FormControl_List","dms_CRCPlength_List","dms_FRCPlength_List","dms_JurisdictionList","dms_663_List","dms_DeterminationRef_List","dms_CBD_flag","dms_Urban_flag","dms_ShortRural_flag","dms_LongRural_flag","dms_FeederType_5_flag","dms_FeederName_1","dms_FeederName_2","dms_FeederName_3","dms_FeederName_4","dms_FeederName_5"]
[null,"ActewAGL Distribution","ActewAGL Distribution",76670568688,"ACT","Electricity","Distribution","Revenue cap",5,6,"ACT",5,"2014-19 Distribution Determination","NO","YES","YES","NO","NO","CBD","Urban","Short rural","Long rural"]
[null,"ActewAGL Distribution (Tx Assets)","ActewAGL Distribution (Tx Assets)",76670568688,"ACT","Electricity","Distribution","Revenue cap",5,5,"ACT",5,"distribution determination",null,null,null,null,null,"CBD","Urban","Short rural","Long rural"]
[null,"AGN","AGN",78551685,"SA","Gas","Distribution","Revenue cap",5,5,"SA",5,"distribution determination",null,null,null,null,null,"CBD","Urban","Short rural","Long rural"]
[null,"Ausgrid","Ausgrid",67505337385,"NSW","Electricity","Distribution","Revenue cap",5,5,"NSW",5,"2014-19 Distribution Determination","YES","YES","YES","YES","NO","CBD","Urban","Short rural","Long rural"]
[null,"Ausgrid (Tx Assets)","Ausgrid (Tx Assets)",67505337385,"NSW","Electricity","Distribution","Revenue cap",5,5,"NSW",5,"distribution determination",null,null,null,null,null,"CBD","Urban","Short rural","Long rural"]
[null,"AusNet (D)","AusNet Electricity Services",91064651118,"Vic","Electricity","Distribution","Revenue cap",5,5,"Vic",2,"2016-20 Distribution Determination","NO","YES","YES","YES","NO","CBD","Urban","Short rural","Long rural"]
[null,"AusNet (T)","AusNet (T)",48116124362,"Vic","Electricity","Transmission","Revenue cap",5,5,"Vic",2,"distribution determination",null,null,null,null,null,"CBD","Urban","Short rural","Long rural"]
[null,"Australian Distribution Co.","Australian Distribution Co.",11222333444,"-","Electricity","Distribution","Revenue cap",5,5,"NSW",2,"distribution determination",null,null,null,null,null,"CBD","Urban","Short rural","Long rural"]
[null,"Australian Transmission Co.","Australian Transmission Co.",11222333444,"-","Electricity","Transmission","Revenue cap",5,5,"Vic",5,"distribution determination",null,null,null,null,null,"CBD","Urban","Short rural","Long rural"]
[null,"CitiPower","CitiPower",76064651056,"Vic","Electricity","Distribution","Revenue cap",5,5,"Vic",2,"2016-20 Distribution Determination","YES","YES","NO","NO","NO","CBD","Urban","Short rural","Long rural"]
[null,"Directlink","Directlink",16779340889,"NSW","Electricity","Transmission","Revenue cap",10,5,"Qld",5,"distribution determination",null,null,null,null,null,"CBD","Urban","Short rural","Long rural"]
[null,"ElectraNet","ElectraNet",41094482416,"SA","Electricity","Transmission","Revenue cap",5,5,"SA",5,"distribution determination",null,null,null,null,null,"CBD","Urban","Short rural","Long rural"]
[null,"Endeavour Energy","Endeavour Energy",59253130878,"NSW","Electricity","Distribution","Revenue cap",5,5,"NSW",5,"2014-19 Distribution Determination","NO","YES","YES","YES","NO","CBD","Urban","Short rural","Long rural"]
[null,"Energex","Energex",40078849055,"Qld","Electricity","Distribution","Revenue cap",5,5,"Qld",5,"2015-20 Distribution Determination","YES","YES","YES","NO","NO","CBD","Urban","Short rural","Long rural"]
[null,"Ergon Energy","Ergon Energy",50087646062,"Qld","Electricity","Distribution","Revenue cap",5,5,"Qld",5,"2015-20 Distribution Determination","NO","YES","YES","YES","NO","CBD","Urban","Short rural","Long rural"]
[null,"Essential Energy","Essential Energy",37428185226,"NSW","Electricity","Distribution","Revenue cap",5,5,"NSW",5,"2014-19 Distribution Determination","NO","YES","YES","YES","NO","CBD","Urban","Short rural","Long rural"]
[null,"Jemena Electricity","Jemena Electricity",82064651083,"Vic","Electricity","Distribution","Revenue cap",5,5,"Vic",2,"2016-20 Distribution Determination","NO","YES","YES","NO","NO","CBD","Urban","Short rural","Long rural"]
[null,"Murraylink","Murraylink",79181207909,"NSW","Electricity","Transmission","Revenue cap",5,5,"SA",5,"distribution determination",null,null,null,null,null,"CBD","Urban","Short rural","Long rural"]
[null,"Powercor Australia","Powercor Australia",89064651109,"Vic","Electricity","Distribution","Revenue cap",5,5,"Vic",2,"2016-20 Distribution Determination","NO","YES","YES","YES","NO","CBD","Urban","Short rural","Long rural"]
[null,"Powerlink","Queensland Electricity Transmission Corporation Limited trading as Powerlink Queensland",82078849233,"Qld","Electricity","Transmission","Revenue cap",5,5,"Qld",5,"distribution determination",null,null,null,null,null,"CBD","Urban","Short rural","Long rural"]
[null,"Qld,SA &ACT Gas Reset","Qld,SA &ACT Gas Reset",22222222222,"-","Gas","Distribution","?",5,5,"-","x","distribution determination",null,null,null,null,null,"CBD","Urban","Short rural","Long rural"]
[null,"SA Power Networks","SA Power Networks",13332330749,"SA","Electricity","Distribution","Revenue cap",5,5,"SA",5,"2015-20 Distribution Determination","YES","YES","YES","YES","NO","CBD","Urban","Short rural","Long rural"]
[null,"TasNetworks (D)","TasNetworks (D)",24167357299,"Tas","Electricity","Distribution","Revenue cap",5,5,"Tas",5,"distribution determination","YES","YES","YES","YES","YES","Critical Infrastructure","High density commercial","Urban","High density rural","Low density rural"]
[null,"TasNetworks (T)","TasNetworks (T)",24167357299,"Tas","Electricity","Transmission","Revenue cap",5,5,"Tas",5,"distribution determination",null,null,null,null,null,"CBD","Urban","Short rural","Long rural"]
[null,"TransGrid","TransGrid",19622755774,"NSW","Electricity","Transmission","Revenue cap",5,5,"NSW",5,"distribution determination",null,null,null,null,null,"CBD","Urban","Short rural","Long rural"]
[null,"United Energy","United Energy",70064651029,"Vic","Electricity","Distribution","Revenue cap",5,5,"Vic",2,"2016-20 Distribution Determination","NO","YES","YES","NO","NO","CBD","Urban","Short rural","Long rural"]
[null,"DNSP Backcasting","Victorian DNSP Backcasting",33333333666,"Vic","Electricity","Distribution","?",5,5,"-","x","distribution determination",null,null,null,null,null,"CBD","Urban","Short rural","Long rural"]
[null,"DNSP Reset ","Victorian DNSP Reset ",33333333333,"Vic","Electricity","Distribution","?",5,5,"-","x","distribution determination",null,null,null,null,null,"CBD","Urban","Short rural","Long rural"]
[]
[]
[]
[]
[null,"dms_SourceList","dms_FormControl_Choices",null,"dms_FRCPlength_Num_List","dms_FinalYear_List"]
[null,"After appeal","Revenue cap",null,1,"FRCP_y1"]
[null,"Draft decision","Revenue yield",null,2,"FRCP_y2"]
[null,"Final decision","Weighted average price cap",null,3,"FRCP_y3"]
[null,"Pass through decision",null,null,4,"FRCP_y4"]
[null,"PTRM annual update",null,null,5,"FRCP_y5"]
[null,"PTRM interim update 1",null,null,6,"FRCP_y6"]
[null,"PTRM interim update 2",null,null,7,"FRCP_y7"]
[null,"PTRM interim update 3",null,null,8,"FRCP_y8"]
[null,"PTRM interim update 4",null,null,9,"FRCP_y9"]
[null,"Regulatory proposal",null,null,10,"FRCP_y10"]
[null,"Reporting"]
[null,"Revised regulatory proposal"]
[null,"RFM annual update"]
[null,"WACC annual update"]
[]
[]
[null,"Notes"]
[null,"RFM - Base year is usually CRCP_y1","EG. Victorian 2016-20 - base year = 2011"]
[null,"RFM - Form of Control Field is not relevant"]
[null,"PTRM - capture base year input by NSP","=PTRM input'!Q7"]

{"sheet":"Contents","index":1,"n_rows":31,"n_cols":4,"rows_kept":31,"cut":false,"hidden":false,"merged":[[2,1,2,3],[3,1,3,3],[4,1,4,3]]}
[]
[]
[null,{"$f":"CONCATENATE(dms_Segment,\" Network Service Provider\")","v":"Distribution Network Service Provider"}]
[null,"Annual Reporting RIN Template"]
[null,"Table of Contents"]
[]
[]
[null,null,"Instructions"]
[null,null,"Business & other details"]
[]
[]
[null,"CATEGORY ANALYSIS","STPIS","STATUTORY ACCOUNTS"]
[]
[null,"2.11 Labour","6.2 STPIS Reliability","8.1 Income"]
[null,null,"6.6 STPIS Customer Service","8.2 Capex"]
[null,null,"6.7 STPIS Daily Performance"]
[null,null,"6.8 STPIS Exclusions","8.4 Opex"]
[null,null,"6.9 STPIS GSL"]
[]
[]
[]
[null,"NETWORK PERFORMANCE","OTHER INFORMATION","PRICING PROPOSAL"]
[null,null,null,"Victorian Businesses Only"]
[null,"3.6 Quality of services","7.8 Avoided Cost Payments"]
[null,"3.6.8 Network-feeders","7.10 Juris Scheme","9.5 TUoS"]
[null,"3.6.9 Network-reliability","7.11 DMIS-DMIA"]
[null,null,"7.12 Safety and Bushfire"]
[null,null,"7.13 TARC"]
[null,"PUBLIC LIGHTING"]
[]
[null,"4.1 Public lighting tariffs"]

{"sheet":"Instructions","index":2,"n_rows":26,"n_cols":6,"rows_kept":26,"cut":false,"hidden":false,"merged":[[17,2,17,4],[19,2,19,4],[25,2,25,4],[7,1,7,5],[8,1,8,5],[14,2,14,4],[10,2,10,4],[16,2,16,3]]}
[]
[]
[]
[]
[]
[]
[]
[null,{"$f":"CONCATENATE(dms_Segment,\" Network Service Provider\")","v":"Distribution Network Service Provider"}]
[null,"Annual Reporting RIN Template"]
[]
[null,null,{"$f":"CONCATENATE(\"This template is to be used by \",dms_TradingName, \" to fulfil its annual reporting obligations to the AER.\")","v":"This template is to be used by Ausgrid to fulfil its annual reporting obligations to the AER."}]
[null,null,null,null,null,"Amendments made December 2015"]
[null,null,null,null,null,"Click here for details."]
[null,null,"INSTRUCTIONS"]
[null,null,"Complete the Business & other details worksheet before entering data or values in any other worksheets. The Business & other details worksheet is linked to other cells within the workbook and automatically generates certain column headings and conditional formatting."]
[]
[null,null,"Identifying CONFIDENTIAL INFORMATION:\n\nPlease use the macro at the top of each \nworksheet to identify confidential information. \n\n"]
[null,null,"-Do this by selecting the cell or cells that contain confidential information and then run the Mark selected cells as CONFIDENTIAL macro. This will format the cells a specific colour that is identified by the AER's database which in turn marks that information as confidential.\n\n-To reverse this, select the cell or cells and run the Return cells to NON-CONFIDENTIAL macro"]
[]
[null,null,"All amounts are to be unrounded and reported in nominal terms on a one for one basis: that is 1000 is to be entered as '1000' not '1' as in previous templates.\n\nColour coding of input sheets:"]
[null,null,null,"Yellow = Input cells"]
[null,null,null,"Grey = Not applicable/No inputs required"]
[null,null,null,"Leave coloured cells blank if no information exists. \nPLEASE DO NOT ENTER TEXT into cells that are to contain numeric data."]
[]
[]
[null,null,"Returning completed responses\n\nPlease return two (2) files to the AER: \n1. A confidential version which must contain a complete set of all responses with confidential information marked using the Mark selected cells CONFIDENTIAL macro and which has been completed using the locked template file provided by the AER. \n\n2. A public version with confidential information either removed completely or aggregated in some form together with writtten consent to disclose the public version of the response.\n\nUse the drop down box on the Business and other details worksheet to identify the file as either confidential ('consolidated') or public. "]

{"sheet":"Business & other details","index":3,"n_rows":78,"n_cols":13,"rows_kept":78,"cut":false,"hidden":false,"merged":[[6,2,6,9],[11,2,11,9],[32,2,32,9],[28,6,28,7],[29,6,29,7],[19,3,19,4],[22,3,22,4],[17,3,17,4],[24,3,24,4],[28,3,28,4],[29,3,29,4],[30,3,30,4],[17,5,17,8],[18,5,18,8],[19,5,19,8],[22,5,22,8],[13,3,13,4],[14,3,14,4],[30,6,30,7],[71,4,71,9],[48,3,48,4],[50,3,50,9],[23,5,23,8],[24,5,24,8]]}
[null,null,{"$f":"(LOOKUP(dms_Model,dms_Model_List,dms_Worksheet_List))","v":"REGULATORY REPORTING STATEMENT"}]
[null,null,{"$f":"dms_TradingName","v":"Ausgrid"}]
[null,null,{"$f":"CONCATENATE(\"Annual Reporting RIN Response \",CRY)","v":"Annual Reporting RIN Response 2015-16"}]
[null,null,"BUSINESS & OTHER DETAILS"]
[]
[null,null,"Instructions"]
[null,null,"Complete the following business details regulatory template before entering data or values in any other regulatory templates. This regulatory template is linked to other cells within these worksheets and is used to automatically generate some column headings and to apply conditional formatting to certain cells."]
[]
[]
[null,null,"SUBMISSION PARTICULARS INPUT SHEETS"]
[]
[null,null,"ENTITY DETAILS"]
[]
[null,null,"Short name","Ausgrid"]
[null,null,"ACN / ABN",{"$f":"INDEX(dms_ABN_List,MATCH(dms_TradingName,dms_TradingName_List))","v":67505337385}]
[]
[]
[null,null,"Business address","Address 1",null,"570 George Street"]
[null,null,null,null,"Address 2"]
[null,null,null,"Suburb",null,"Sydney"]
[null,null,null,null,"State",{"$f":"INDEX(dms_State_List,MATCH(dms_TradingName,dms_TradingName_List))","v":"NSW"},"p/code",2000]
[]
[null,null,"Postal address","Address 1",null,"570 George Street"]
[null,null,null,null,"Address 2"]
[null,null,null,"Suburb",null,"Sydney"]
[null,null,null,null,"State","NSW","p/code",2000]
[]
[]
[null,null,"Contact name/s","John Thomson"]
[null,null,"Contact phone/s","(02)92692312"]
[null,null,"Contact email address/s","john.thomson@ausgrid.com.au"]
[]
[null,null,"REGULATORY CONTROL PERIODS"]
[]
[null,null,"Forthcoming regulatory control period","2016-17",{"$f":"IF(dms_RPT=\"financial\",VALUE(LEFT(FRCP_y1,4)+1)&\"-\"&VALUE(MID(FRCP_y1,3,2)+2),VALUE(LEFT(FRCP_y1,4)+1))","v":"2017-18"},{"$f":"IF(dms_RPT=\"financial\",VALUE(LEFT(FRCP_y2,4)+1)&\"-\"&VALUE(MID(FRCP_y2,3,2)+2),VALUE(LEFT(FRCP_y2,4)+1))","v":"2018-19"},{"$f":"IF(dms_RPT=\"financial\",VALUE(LEFT(FRCP_y3,4)+1)&\"-\"&VALUE(MID(FRCP_y3,3,2)+2),VALUE(LEFT(FRCP_y3,4)+1))","v":"2019-20"},{"$f":"IF(dms_RPT=\"financial\",VALUE(LEFT(FRCP_y4,4)+1)&\"-\"&VALUE(MID(FRCP_y4,3,2)+2),VALUE(LEFT(FRCP_y4,4)+1))","v":"2020-21"},{"$f":"IF(dms_RPT=\"financial\",VALUE(LEFT(FRCP_y5,4)+1)&\"-\"&VALUE(MID(FRCP_y5,3,2)+2),VALUE(LEFT(FRCP_y5,4)+1))","v":"2021-22"},{"$f":"IF(dms_RPT=\"financial\",VALUE(LEFT(FRCP_y6,4)+1)&\"-\"&VALUE(MID(FRCP_y6,3,2)+2),VALUE(LEFT(FRCP_y6,4)+1))","v":"2022-23"},{"$f":"IF(dms_RPT=\"financial\",VALUE(LEFT(FRCP_y7,4)+1)&\"-\"&VALUE(MID(FRCP_y7,3,2)+2),VALUE(LEFT(FRCP_y7,4)+1))","v":"2023-24"},{"$f":"IF(dms_RPT=\"financial\",VALUE(LEFT(FRCP_y8,4)+1)&\"-\"&VALUE(MID(FRCP_y8,3,2)+2),VALUE(LEFT(FRCP_y8,4)+1))","v":"2024-25"},{"$f":"IF(dms_RPT=\"financial\",VALUE(LEFT(FRCP_y9,4)+1)&\"-\"&VALUE(MID(FRCP_y9,3,2)+2),VALUE(LEFT(FRCP_y9,4)+1))","v":"2025-26"}]
[]
[]
[null,null,"Current regulatory control period",{"$f":"IF(dms_RPT=\"financial\",VALUE(LEFT(CRCP_y2,4)-1)&\"-\"&TEXT(VALUE(RIGHT(CRCP_y2,2)-1),\"0#\"),VALUE(LEFT(CRCP_y2,4)-1))","v":"2011-12"},{"$f":"IF(dms_RPT=\"financial\",VALUE(LEFT(CRCP_y3,4)-1)&\"-\"&TEXT(VALUE(RIGHT(CRCP_y3,2)-1),\"0#\"),VALUE(LEFT(CRCP_y3,4)-1))","v":"2012-13"},{"$f":"IF(dms_RPT=\"financial\",VALUE(LEFT(CRCP_y4,4)-1)&\"-\"&TEXT(VALUE(RIGHT(CRCP_y4,2)-1),\"0#\"),VALUE(LEFT(CRCP_y4,4)-1))","v":"2013-14"},{"$f":"IF(dms_RPT=\"financial\",VALUE(LEFT(CRCP_y5,4)-1)&\"-\"&TEXT(VALUE(RIGHT(CRCP_y5,2)-1),\"0#\"),VALUE(LEFT(CRCP_y5,4)-1))","v":"2014-15"},{"$f":"IF(dms_RPT=\"financial\",VALUE(LEFT(FRCP_y1,4)-1)&\"-\"&TEXT(VALUE(RIGHT(FRCP_y1,2)-1),\"0#\"),VALUE(LEFT(FRCP_y1,4)-1))","v":"2015-16"}]
[]
[]
[null,null,"Previous regulatory control period",{"$f":"IF(dms_RPT=\"financial\",VALUE(LEFT(PRCP_y2,4)-1)&\"-\"&TEXT(VALUE(MID(PRCP_y2,3,2)),\"0#\"),VALUE(LEFT(PRCP_y2,4)-1))","v":"2006-07"},{"$f":"IF(dms_RPT=\"financial\",VALUE(LEFT(PRCP_y3,4)-1)&\"-\"&TEXT(VALUE(MID(PRCP_y3,3,2)),\"0#\"),VALUE(LEFT(PRCP_y3,4)-1))","v":"2007-08"},{"$f":"IF(dms_RPT=\"financial\",VALUE(LEFT(PRCP_y4,4)-1)&\"-\"&TEXT(VALUE(MID(PRCP_y4,3,2)),\"0#\"),VALUE(LEFT(PRCP_y4,4)-1))","v":"2008-09"},{"$f":"IF(dms_RPT=\"financial\",VALUE(LEFT(PRCP_y5,4)-1)&\"-\"&TEXT(VALUE(RIGHT(PRCP_y5,2)-1),\"0#\"),VALUE(LEFT(PRCP_y5,4)-1))","v":"2009-10"},{"$f":"IF(dms_RPT=\"financial\",VALUE(LEFT(CRCP_y1,4)-1)&\"-\"&TEXT(VALUE(RIGHT(CRCP_y1,2)-1),\"0#\"),VALUE(LEFT(CRCP_y1,4)-1))","v":"2010-11"}]
[]
[]
[null,null,"Current regulatory year","2015-16"]
[]
[]
[]
[]
[null,null,"Source","Reporting"]
[null,null,"Consolidated confidential or public version?","Public"]
[null,null,"Amended RIN submission - amendment reason","Table 8.2.4 - added data which had inadvertently been omitted"]
[null,null,"EBSS - First application of scheme in forthcoming period?","No"]
[null,null,"Sector",{"$f":"INDEX(dms_Sector_List,MATCH(dms_TradingName,dms_TradingName_List))","v":"Electricity"},"dms_Sector","=INDEX(dms_Sector_List,MATCH(dms_TradingName,dms_TradingName_List))"]
[null,null,"Segment",{"$f":"INDEX(dms_Segment_List,MATCH(dms_TradingName,dms_TradingName_List))","v":"Distribution"},"dms_Segment","=INDEX(dms_Segment_List,MATCH(dms_TradingName,dms_TradingName_List))"]
[null,null,"Regulatory Year Ending",{"$f":"INDEX(dms_RYE_Formula_Result,MATCH(dms_Model,dms_Model_List))","v":"2016"},"dms_RYE","=INDEX(dms_RYE_Formula_Result,MATCH(dms_Model,dms_Model_List))"]
[null,null,"Reporting Period Type",{"$f":"IF(LEN(FRCP_y1)>4,\"Financial\",\"Calendar\")","v":"Financial"},"dms_RPT","=IF(LEN(FRCP_y1)>4,\"Financial\",\"Calendar\")"]
[null,null,"Model or RIN Type","ARR","dms_Model"]
[null,null,"Security Classification","Public","dms_Classification"]
[null,null,"Template - version no.",5,"dms_TemplateNumber"]
[null,null,"Dollar $ real  (the last month before the FRCP_y1)",{"$f":"CONCATENATE(IF(dms_RPT=\"Financial\",\"June \",\"December \"),VALUE((LEFT(FRCP_y1,2))&RIGHT(FRCP_y1,2))-1)","v":"June 2016"},"dms_DollarReal","=CONCATENATE(IF(dms_RPT=\"Financial\",\"June \",\"December \"),VALUE((LEFT(FRCP_y1,2))&RIGHT(FRCP_y1,2))-1)"]
[null,null,"Form of control",{"$f":"INDEX(dms_FormControl_List,MATCH(dms_TradingName,dms_TradingName_List))","v":"Revenue cap"},"dms_FormControl","=INDEX(dms_FormControl_List,MATCH(dms_TradingName,dms_TradingName_List))"]
[null,null,"RIN response - version no.",1,"dms_RINversion"]
[null,null,"Jurisdiction",{"$f":"INDEX(dms_JurisdictionList,MATCH(dms_TradingName,dms_TradingName_List))","v":"NSW"},"dms_Jurisdiction","=INDEX(dms_JurisdictionList,MATCH(dms_TradingName,dms_TradingName_List))"]
[null,null,"Length of current reg control period",{"$f":"INDEX(dms_CRCPlength_List,MATCH(dms_TradingName,dms_TradingName_List))","v":5},"dms_CRCPlength","=INDEX(dms_CRCPlength_List,MATCH(dms_TradingName,dms_TradingName_List))"]
[null,null,"Length of forthcoming reg control period",{"$f":"INDEX(dms_FRCPlength_List,MATCH(dms_TradingName,dms_TradingName_List))","v":5},"dms_FRCPlength","=INDEX(dms_FRCPlength_List,MATCH(dms_TradingName,dms_TradingName_List))"]
[null,null,"FRCP length in years",{"$f":"INDEX(dms_FRCPlength_List,MATCH(dms_TradingName,dms_TradingName_List))","v":5},"dms_FRCPlength_Num","=INDEX(dms_FRCPlength_List,MATCH(dms_TradingName,dms_TradingName_List))"]
[null,null,"FRCP Final Year Reference",{"$f":"INDEX(dms_FinalYear_List,MATCH(dms_FRCPlength_Num,dms_FRCPlength_Num_List))","v":"FRCP_y5"},"dms_FRCP_FinalYear","=INDEX(dms_FinalYear_List,MATCH(dms_FRCPlength_Num,dms_FRCPlength_Num_List))"]
[null,null,"FRCP Final Year",{"$f":"INDIRECT(dms_FRCP_FinalYear)","v":"2020-21"},"dms_FRCP_FinalYear_Num","=INDIRECT(dms_FRCP_FinalYear)"]
[null,null,"CRCP length in years",5,"dms_CRCPlength_Num","=INDEX(dms_CRCPlength_List,MATCH(dms_TradingName,dms_TradingName_List))"]
[null,null,"CRCP Final Year Reference","CRCP_y5","dms_CRCP_FinalYear","=INDEX(dms_CFinalYear_List,MATCH(dms_CRCPlength_Num,dms_CRCPlength_Num_List))"]
[null,null,"CRCP Final Year","2014-15","dms_CRCP_FinalYear_Num","=INDIRECT(dms_CRCP_FinalYear)"]
[null,null,"Backcast templates only - unit of measure ","$0s","If the cover sheet is for Backcast data ensure to apply dms_Backcast_UOM named range to this field. Otherwise, do not apply this named range."]
[null,null,"Table 6.6.3 - Public lighting repair - no. business days",{"$f":"INDEX(dms_663_List,MATCH(dms_TradingName,dms_TradingName_List))","v":5}]
[null,null,"Distribution Determination Reference",{"$f":"INDEX(dms_DeterminationRef_List,MATCH(dms_TradingName,dms_TradingName_List))","v":"2014-19 Distribution Determination"},"=dms_DeterminationRef"]
[null,null,"CBD Feeder for this business",{"$f":"INDEX(dms_CBD_flag,MATCH(dms_TradingName,dms_TradingName_List))","v":"YES"},"dms_CBD_flag_NSP"]
[null,null,"Urban Feeder for this business",{"$f":"INDEX(dms_Urban_flag,MATCH(dms_TradingName,dms_TradingName_List))","v":"YES"},"dms_Urban_flag_NSP"]
[null,null,"Short rural Feeder for this business",{"$f":"INDEX(dms_ShortRural_flag,MATCH(dms_TradingName,dms_TradingName_List))","v":"YES"},"dms_ShortRural_flag_NSP"]
[null,null,"Long rural Feeder for this business",{"$f":"INDEX(dms_LongRural_flag,MATCH(dms_TradingName,dms_TradingName_List))","v":"YES"},"dms_LongRural_flag_NSP"]

{"sheet":"2.11 Labour","index":4,"n_rows":36,"n_cols":4,"rows_kept":36,"cut":false,"hidden":false,"merged":[]}
[null,{"$f":"(LOOKUP(dms_Model,dms_Model_List,dms_Worksheet_List))","v":"REGULATORY REPORTING STATEMENT"}]
[null,{"$f":"dms_TradingName","v":"Ausgrid"}]
[null,{"$f":"CONCATENATE(\"Annual Reporting RIN Response \",CRY)","v":"Annual Reporting RIN Response 2015-16"}]
[null,"2.11 LABOUR "]
[]
[null,"Tables 2.11.1 and 2.11.2 deliberately omitted."]
[]
[null,"2.11.3 - LABOUR / NON-LABOUR EXPENDITURE SPLIT"]
[null,"2.11.3.1 - Opex"]
[null,null,{"$f":"CRY","v":"2015-16"}]
[null,null,"$0's, nominal"]
[null,null,"Opex "]
[null,"In-house labour expenditure",415049744.3378579]
[null,"Labour expenditure outsourced to related parties",55219.886399999959]
[null,"Labour expenditure outsourced to unrelated parties",0]
[null,"Controllable non-labour expenditure",147556406.53757197]
[null,"Uncontrollable non-labour expenditure",27218069.337319396]
[null,"Total",{"$f":"SUM(C13:C17)","v":589879440.09914923}]
[]
[null,"Reconciliation with Opex worksheets - SCS","Opex"]
[null,"Total including margins",{"$f":"dms_Total_Actual_Opex","v":589879440.09914923},{"$f":"IF(C18=dms_Total_Actual_Opex,\"OK\",\"Error\")","v":"OK"}]
[]
[]
[null,"2.11.3.2 - Capex"]
[null,null,{"$f":"CRY","v":"2015-16"}]
[null,null,"$0's, nominal"]
[null,null,"Capex"]
[null,"In-house labour expenditure",233988755.28000003]
[null,"Labour expenditure outsourced to related parties",0]
[null,"Labour expenditure outsourced to unrelated parties",0]
[null,"Controllable non-labour expenditure",241820856.28999996]
[null,"Uncontrollable non-labour expenditure",0]
[null,"Total",{"$f":"SUM(C28:C32)","v":475809611.56999999}]
[]
[null,"Reconciliation with Capex & Opex worksheets - SCS","Capex"]
[null,"Total including margins",{"$f":"dms_Total_Actual_Capex","v":551542057.43000007},{"$f":"IF(C33=dms_Total_Actual_Capex,\"OK\",\"Error\")","v":"Error"}]

{"sheet":"3.6 Quality of services","index":5,"n_rows":71,"n_cols":4,"rows_kept":71,"cut":false,"hidden":false,"merged":[[6,2,7,2],[24,2,25,2],[24,1,25,1]]}
[null,{"$f":"(LOOKUP(dms_Model,dms_Model_List,dms_Worksheet_List))","v":"REGULATORY REPORTING STATEMENT"}]
[null,{"$f":"dms_TradingName","v":"Ausgrid"}]
[null,{"$f":"CONCATENATE(\"Annual Reporting RIN Response \",CRY)","v":"Annual Reporting RIN Response 2015-16"}]
[null,"3.6 QUALITY OF SERVICES"]
[]
[null,"3.6.5 - QUALITY OF SUPPLY METRICS"]
[null,null,"Unit","Volume"]
[null,null,null,{"$f":"CRY","v":"2015-16"}]
[null,"Over voltage events - due to high voltage injection","number"]
[null,"Customers receiving over-voltage - due to high voltage injection","number"]
[null,"Over voltage events - due to lightning","number"]
[null,"Customers receiving over-voltage - due to lightning","number"]
[null,"Over voltage events - due to voltage regulation or other cause","number"]
[null,"Customers receiving over-voltage - due to voltage regulation or other cause","number"]
[null,"Voltage variations - steady state (zone sub)","number"]
[null,"Voltage variations - one minute (zone sub)","number"]
[null,"Voltage variations - 10 seconds (zone sub) Min<0.7","number"]
[null,"Voltage variations - 10 seconds (zone sub) Min<0.8","number"]
[null,"Voltage variations - 10 seconds (zone sub) Min<0.9","number"]
[null,"Voltage variations - steady state (feeder)","number"]
[null,"Voltage variations - % zone subs monitored","(per cent)"]
[null,"Voltage variations - % feeders monitored","(per cent)"]
[]
[null,"3.6.6 - COMPLAINTS - TECHNICAL QUALITY OF SUPPLY"]
[null,null,"Unit","Volume"]
[null,null,null,{"$f":"CRY","v":"2015-16"}]
[null,"3.6.6.1 - TECHNICAL QUALITY OF SUPPLY"]
[null,"Number of complaints - technical quality of supply","number",80]
[null,"3.6.6.2 - PERCENTAGE OF COMPLAINTS BY CATEGORY"]
[null,"Low voltage supply","(per cent)"]
[null,"Voltage dips","(per cent)"]
[null,"Voltage swell","(per cent)"]
[null,"Voltage spike (impulsive transient)","(per cent)"]
[null,"Waveform distortion","(per cent)"]
[null,"TV or radio interference","(per cent)"]
[null,"Solar related","(per cent)"]
[null,"Noise from appliances","(per cent)"]
[null,"Other","(per cent)"]
[null,"3.6.6.3 - PERCENTAGE OF COMPLAINTS BY LIKELY CAUSE"]
[null,"Network equipment faulty","(per cent)"]
[null,"Network interference by NSP equipment","(per cent)"]
[null,"Network interference by another customer","(per cent)"]
[null,"Network limitation","(per cent)"]
[null,"Customer internal problem","(per cent)"]
[null,"No problem identified","(per cent)"]
[null,"Environmental","(per cent)"]
[null,"Other","(per cent)"]
[]
[null,"3.6.7 - CUSTOMER SERVICE METRICS"]
[null,null,"Unit",{"$f":"CRY","v":"2015-16"}]
[null,"3.6.7.1 - TIMELY PROVISIONS OF SERVICES"]
[null,"Number of connections made","number",281]
[null,"Number of connections not made on or before agreed date","number",0]
[null,"3.6.7.2 - TIMELY REPAIR OF FAULTY STREET LIGHTS"]
[null,"Street lights - average monthly number \"out\"","number",1788.5]
[null,"Street lights - not repaired by \"fix by\" date","number",2844]
[null,"Street lights - average number of days to repair","number",5.5]
[null,"Total number of street lights","number",250961]
[null,"3.6.7.3 - CALL CENTRE PERFORMANCE"]
[null,"Calls to call centre fault line","number",222312]
[null,"Calls to fault line answered within 30 seconds","number",169482]
[null,"Calls to fault line - average waiting time before call answered","number",36]
[null,"Call centre - number of overload events","number",0]
[null,"Percentage of calls abandoned","(per cent)",10.199999999999999]
[null,"3.6.7.4 - NUMBER OF CUSTOMER COMPLAINTS"]
[null,"Complaint - reliability of supply","number"]
[null,"Complaint - technical quality of supply","number",{"$f":"IF(ISBLANK(D28),\"\",D28)","v":80}]
[null,"Complaint - administrative process or customer service","number"]
[null,"Complaint - connection or augmentation","number"]
[null,"Complaint - other","number"]
[null,"Total number of complaints","number"]

{"sheet":"3.6.8 Network-feeders","index":6,"n_rows":1753,"n_cols":23,"rows_kept":1753,"cut":false,"hidden":false,"merged":[[10,10,10,14],[11,11,11,12],[11,13,11,14],[11,18,11,19],[11,15,12,15],[11,10,12,10],[10,15,10,19],[11,16,11,17],[5,6,5,8],[5,1,5,4],[11,8,12,8],[11,9,12,9],[11,20,12,20],[10,20,10,22],[11,21,11,22],[10,1,12,1],[10,2,12,2],[10,3,12,3],[10,4,12,4],[10,7,12,7],[11,5,12,5],[11,6,12,6],[10,5,10,6],[10,8,10,9]]}
[null,{"$f":"(LOOKUP(dms_Model,dms_Model_List,dms_Worksheet_List))","v":"REGULATORY REPORTING STATEMENT"},null,null,null,null,{"$f":"CONCATENATE(\"1-Jan-\",LEFT(CRY,4))","v":"1-Jan-2015"}]
[null,{"$f":"dms_TradingName","v":"Ausgrid"}]
[null,{"$f":"CONCATENATE(\"Annual Reporting RIN Response \",CRY)","v":"Annual Reporting RIN Response 2015-16"}]
[null,"3.6 QUALITY OF SERVICES"]
[]
[null,"Did the MAIFI parameter of the STPIS apply during the period?",null,null,null,"No","** IMPORTANT\nPlease ensure this question is answered correctly. Your response will affect other tables throughout this workbook and will determine which cells are grey and which are input cells. "]
[]
[]
[]
[null,"3.6.8 - NETWORK FEEDER RELIABILITY"]
[null,"Feeder ID / name","Description of the service area for the feeder","Feeder classification\n\n(drop down)","Number of distribution customers","Length of high voltage distribution lines",null,"Maximum demand\n(MVA)","Energy not supplied\n(MWh)",null,"Unplanned Outages",null,null,null,null,"Planned Outages",null,null,null,null,"Momentary feeder outages"]
[null,null,null,null,null,"Overhead","Underground",null,"Unplanned","Planned","Total number of unplanned outages","Unplanned customer minutes off-supply (SAIDI)",null,"Unplanned interruptions\n(SAIFI)",null,"Total number of planned outages","Planned customer minutes off-supply (SAIDI)",null,"Planned interruptions\n(SAIFI)",null,"Total number of momentary feeder outages","Momentary interruptions due to feeder outages (MAIFI)"]
[null,null,null,null,null,null,null,null,null,null,null,"Including excluded events and MEDs","After removing excluded events and MED","Including excluded events and MEDs","After removing excluded events and MED",null,"Including MEDs","After removing  MED","Including MEDs","After removing  MED",null,"Including excluded events and MEDs","After removing excluded events and MED"]
[null,"202:34231 37 42","NEWCASTLE CBD 33","URBAN",453,0,4825.65019776603,3.9178915000000001,21.258427584597246,309.54281268624999,3,696.38333333330002,696.38333333330002,0.66225165562913901,0.66225165562913901,1,10140,10140,8.6092715231788102,8.6092715231788102]
[null,"202:34232","NEWCASTLE CBD 33","URBAN",698,2554.7281931584298,1541.4648947195601,3.1381215999999998,129.65654976657859,0,4,5302.6666666666997,5302.6666666666997,5.8739255014326694,5.8739255014326694,0,0,0,0,0]
[null,"202:34238 43 48","NEWCASTLE CBD 33","URBAN",488,0,10744.3532577846,4.4444027999999998,0,628.00244889524993,0,0,0,0,0,4,18135,18135,17.827868852459002,17.827868852459002]
[null,"202:34239","NEWCASTLE CBD 33","SHORT RURAL",39,0,2461.7010481146599,9.0449500000000002E-2,0.14406312706425961,0,1,204.4166666667,204.4166666667,5.1282051282051304,5.1282051282051304,0,0,0,0,0]
[null,"202:34240","NEWCASTLE CBD 33","URBAN",928,0,4892.8022943961196,2.1222308999999999,0,16.86643007775,0,0,0,0,0,1,1020,1020,5.4956896551724101,5.4956896551724101]
[null,"202:34245","NEWCASTLE CBD 33","URBAN",1180,4412.8239725331396,3705.3373635483799,4.2625517000000004,4193.6278374678886,0,4,126267,126267,202.203389830509,202.203389830509,0,0,0,0,0]
[null,"202:34249","NEWCASTLE CBD 33","URBAN",405,956.41006780117095,6532.9655511894898,3.8636217999999998,0,782.70538298333327,0,0,0,0,0,5,26000,26000,34.814814814814795,34.814814814814795]
[null,"202:34250","NEWCASTLE CBD 33","URBAN",1158,2708.5949745612802,1814.15289756116,2.7753714999999999,5882.2573789234748,0,4,272014.8,272014.8,109.32642487046699,109.32642487046699,0,0,0,0,0]
[null,"202:34254","NEWCASTLE CBD 33","URBAN",2012,3661.6956057969501,5219.7148905857703,5.496473299999999,27740.257538502246,246.68172170399995,15,647732.96666666667,647083.4,324.20477137176886,324.10536779324002,1,5760,5760,1.78926441351889,1.78926441351889]
[null,"202:34256","NEWCASTLE CBD 33","URBAN",930,0,1666.35700653867,1.6509414,5.5883701427487384,3353.1764486704001,1,434.43333333330003,0,0.10752688172043,0,4,260672,260672,80,80]
[null,"202:34260","NEWCASTLE CBD 33","URBAN",2476,5307.8567769114397,2618.9541296315801,3.9731132999999996,2042.5187702851185,3368.4501532646254,11,65978.850000000006,65978.850000000006,22.6978998384491,22.6978998384491,1,108810,108810,9.4507269789983805,9.4507269789983805]
[null,"202:34261","NEWCASTLE CBD 33","URBAN",462,0,4587.0426053759402,1.8318403999999999,952.10072708703342,1140.2914158802835,3,66706,66706,175.54112554112601,175.54112554112601,6,79891,54691,67.748917748917805,52.597402597402599]
[null,"202:34262","NEWCASTLE CBD 33","URBAN",798,0,5715.6909472852003,4.4805826,0,31.76919754341667,0,0,0,0,0,1,910,910,0.87719298245613997,0.87719298245613997]
[null,"203:8082","CARRINGTON 33","URBAN",22,1554.5719793814101,512.50005771014798,2.9838813999999996,0,71.09669346101667,0,0,0,0,0,2,3058,3058,63.636363636363704,63.636363636363704]
[null,"203:8084","CARRINGTON 33","URBAN",1059,7141.3540224819099,1282.5178724679699,3.5370514999999996,87.90202769170044,13.228572609999999,4,3189.5333333334002,3189.5333333334002,3.4938621340887597,3.4938621340887597,1,480,480,0.18885741265344699,0.18885741265344699]
[null,"203:8085","CARRINGTON 33","URBAN",1991,4663.6392806517197,4820.2316973378802,3.4285120999999998,3.7546278853118751,0,1,140.55000000000001,140.55000000000001,5.0226017076845798E-2,5.0226017076845798E-2,0,0,0,0,0]
[null,"203:8086","CARRINGTON 33","URBAN",2152,7032.9382778064301,848.94490405823694,5.4060237999999998,215.32733397780004,6319.1748768942753,6,5112,5065.5833333333003,1.4405204460966587,1.39405204460967,4,150021,150021,15.3345724907063,15.3345724907063]
[null,"203:8088","CARRINGTON 33","URBAN",638,3153.8708989444499,1084.62745877463,2.4545137999999995,10.392072229030301,0,2,543.38333333339995,543.38333333339995,0.31347962382445099,0.31347962382445099,0,0,0,0,0]
[null,"203:8089","CARRINGTON 33","URBAN",247,1532.96822841009,759.54238335308003,2.4640347999999999,22.232369991700001,87.643151133083336,2,1158,1158,4.4534412955465594,4.4534412955465594,1,4565,4565,4.4534412955465594,4.4534412955465594]
[null,"203:8090","CARRINGTON 33","URBAN",758,1545.5538024452201,4063.6987486314601,4.0635627999999997,5.6991468270000007,18.87050838273333,1,180,180,0.39577836411609502,0.39577836411609502,1,596,596,0.26385224274406299,0.26385224274406299]
[null,"205:12202","KOTARA 33","URBAN",4,0,770.26032734221599,0.88926139999999998,0,250.99680909187501,0,0,0,0,0,1,36225,36225,1725,1725]
[null,"205:12203","KOTARA 33","URBAN",654,3641.9429929759099,1846.5633981681699,4.1178324999999996,203.91106481133775,259.88670365625001,6,6355.3833333332004,6256.1333333332004,7.1865443425076379,7.0336391437308796,1,8100,8100,6.8807339449541303,6.8807339449541303]
[null,"205:12204","KOTARA 33","URBAN",47,0,1234.42970777506,2.2679022,0,455.19821023600002,0,0,0,0,0,1,25760,25760,97.872340425531902,97.872340425531902]
[null,"205:12205","KOTARA 33","URBAN",1677,10219.7298070285,2650.7855780003401,4.4444027999999998,18542.6775713844,7039.3758922817005,19,535462.01666666707,125511.566666667,220.33392963625502,118.96243291592099,9,203278,203278,37.388193202146702,37.388193202146702]
[null,"205:12206","KOTARA 33","URBAN",874,3171.2215946480701,948.30567177363298,2.3040819999999997,49.533425245624215,0,3,2759.1166666667,2759.1166666667,9.4965675057208188,9.4965675057208188,0,0,0,0,0]
[null,"205:12208","KOTARA 33","URBAN",51,0,810.35436158662105,2.2126803999999995,0,88.443601438499982,0,0,0,0,0,1,5130,5130,37.254901960784295,37.254901960784295]
[null,"205:12209","KOTARA 33","URBAN",59,0,764.60988317644296,2.0136915000000002,0,705.18763147593768,0,0,0,0,0,1,44945,44945,150.84745762711898,150.84745762711898,null,null," "]
[null,"205:12210","KOTARA 33","URBAN",1508,6572.1797766665504,929.887264628612,4.2806416,20.974243121659995,3347.6406263468666,5,628.84999999989998,628.84999999989998,0.33156498673740098,0.33156498673740098,2,100369,100369,17.771883289124698,17.771883289124698]
[null,"205:12213","KOTARA 33","SHORT RURAL",888,5377.6900553922897,903.85724429737502,1.6871212,42.118137197399996,0,1,3204,3204,10.0225225225225,10.0225225225225,0,0,0,0,0]
[null,"206:34432","CROUDACE BAY 33 11","URBAN",1156,4824.7639933546598,4347.3078171684101,4.9880518999999994,116.70712684396767,4933.3589500939788,5,3002.8666666667,3002.8666666667,4.75778546712802,4.75778546712802,5,126935,126935,42.214532871972295,42.214532871972295]
[null,"206:34434","CROUDACE BAY 33 11","URBAN",1517,4817.9748576280499,3774.54244080544,4.6986134999999996,270.65673284184908,2718.2581313916876,3,7392.9666666666999,7392.9666666666999,3.2959789057350002,3.2959789057350002,2,74249,74249,22.676334871456799,22.676334871456799]
[null,"206:34435","CROUDACE BAY 33 11","URBAN",142,1024.4548851229599,729.54194474733299,0.63505069999999997,0,104.02397716502918,0,0,0,0,0,2,21023,21023,33.098591549295804,33.098591549295804]
[null,"206:34437","CROUDACE BAY 33 11","SHORT RURAL",30,2587.5651097631999,158.48841451434001,9.0449500000000002E-2,3.0339588846875003,0,2,4305,4305,150,150,0,0,0,0,0]
[null,"206:34438","CROUDACE BAY 33 11","URBAN",599,3759.6838084936899,2026.6389205866999,2.4126213999999995,3.2461603130895118,17.482457819749996,1,172.6833333333,172.6833333333,0.166944908180301,0.166944908180301,2,930,930,0.333889816360601,0.333889816360601]
[null,"206:34440","CROUDACE BAY 33 11","URBAN",1626,8310.6087558359995,2738.4101832838101,5.5869228,3216.7223957801334,7582.785091168651,9,73894.233333333294,73894.233333333294,27.859778597786001,27.859778597786001,6,174191,174191,31.734317343173402,31.734317343173402]
[null,"206:34441","CROUDACE BAY 33 11","URBAN",1335,8025.4490332238602,1373.5840438794701,5.1518130999999991,740.09553858474203,295.03789647062501,6,18437.3,18437.3,17.8277153558052,17.8277153558052,1,7350,7350,1.8726591760299598,1.8726591760299598]
[null,"210:8676","NEW LAMBTON 33","URBAN",874,2832.0361118035098,1189.1596521967199,2.1945904999999999,1479.8418456715892,0,4,86542.9,86542.9,210.183066361556,210.183066361556,0,0,0,0,0]
[null,"210:8679","NEW LAMBTON 33","URBAN",895,3092.0453654655698,117.12610123645599,2.1945904999999999,615.60315467117493,0,2,36001.199999999997,36001.199999999997,106.59217877095,106.59217877095,0,0,0,0,0]
[null,"210:8681","NEW LAMBTON 33","SHORT RURAL",553,2317.60840478205,280.59287886795801,2.7030118999999999,321.06216733960105,0,4,15244.416666666701,15244.416666666701,99.095840867992806,99.095840867992806,0,0,0,0,0]
[null,"210:8682","NEW LAMBTON 33","URBAN",912,6457.8237931579697,546.172509632583,3.9178915000000001,758.75435444445793,1851.76203328875,8,24855.266666666699,24433.266666666699,100.32894736842101,100.219298245614,2,60660,60660,21.710526315789501,21.710526315789501]
[null,"213:33770","MARYLAND 132","URBAN",1210,123.376578636654,9456.5551691930796,4.4082229999999996,474.30845682350622,2563.1750390468746,2,13809.15,13809.15,4.4628099173553801,4.4628099173553801,3,74625,74625,18.5123966942149,18.5123966942149]
[null,"213:33771","MARYLAND 132","URBAN",1549,8762.1670013875591,1667.1865246604,4.3177734999999995,245.58070502899506,1009.7505527509584,3,7299.6833333332997,7299.6833333332997,9.9418979987088409,9.9418979987088409,1,30014,30014,5.5519690122659799,5.5519690122659799]
[null,"213:33773","MARYLAND 132","SHORT RURAL",1419,1119.6809938205499,13460.479785793001,5.3517541,0,15.845651931083333,0,0,0,0,0,1,380,0,7.0472163495419307E-2,0]
[null,"213:33774","MARYLAND 132","URBAN",1343,2891.1344834624301,5579.3813380288602,3.8817116999999999,303.75510853303689,996.72409569768752,4,10043.15,10043.15,4.54206999255398,4.54206999255398,1,32955,32955,12.583767684288899,12.583767684288899]
[null,"213:33775","MARYLAND 132","URBAN",1106,5933.6895828806901,2756.1220698914299,2.9391327,128.34721015029376,314.79360348397501,2,5604.5,5604.5,0.18083182640144699,0.18083182640144699,2,13746,13746,8.0470162748643794,8.0470162748643794]
[null,"213:33777","MARYLAND 132","SHORT RURAL",472,15082.8424823273,21743.7596413848,1.9775116999999998,32.984915755080209,42.156594420599994,3,2140.75,2140.75,5.0847457627118597,5.0847457627118597,6,2736,2736,1.6949152542372898,1.6949152542372898]
[null,"214:8665","CARDIFF 33","URBAN",1381,5514.32019156566,1069.06413017147,4.0454728999999992,101.52643806190139,2529.8735615165829,5,3220.9166666667002,3220.9166666667002,6.0101375814627103,6.0101375814627103,2,80260,80260,12.454742939898599,12.454742939898599]
[null,"214:8666","CARDIFF 33","URBAN",1453,5942.2568048489202,1130.4054081023201,3.9178915000000001,6083.5674123666722,23.047812976145835,7,199285.433333333,105924.483333333,205.16173434273898,106.125258086717,1,755,755,6.8823124569855496E-2,6.8823124569855496E-2]
[null,"214:8667","CARDIFF 33","URBAN",864,5880.1440178734601,3827.08899890564,3.6465429999999999,3943.7337247107939,2411.8075865743749,8,138802.04999999999,3802.05,34.606481481481524,8.5648148148148202,5,84885,84885,30.787037037037003,30.787037037037003]
[null,"214:8669","CARDIFF 33","URBAN",697,3407.3942393436901,1597.6339228929,2.7391916999999997,9.9151853516406607,288.12872694375,3,464.56666666659999,464.56666666659999,0.43041606886657102,0.43041606886657102,1,13500,13500,7.7474892395982806,7.7474892395982806]
[null,"214:8670","CARDIFF 33","URBAN",963,4526.4831528244704,3856.3862948333799,5.8049537000000004,32.670573702504363,2191.6324540318542,2,722.31666666670003,722.31666666670003,0.72689511941848406,0.72689511941848406,2,48455,48455,24.8182762201454,24.8182762201454]
[null,"214:8671","CARDIFF 33","URBAN",73,1286.97774951063,362.00483954638401,3.9540712999999994,3.7894830821374996,2.7727924991249995,1,123,123,4.10958904109589,4.10958904109589,1,90,90,2.7397260273972601,2.7397260273972601]
[null,"216:10722","EDGEWORTH 33","URBAN",517,1382.6714886982099,4594.2104662399297,1.0339806,82.0872559788139,1031.2233184000002,6,10189.0333333333,10189.0333333333,8.7040618955512592,8.7040618955512592,1,128000,128000,99.032882011605409,99.032882011605409]
[null,"216:10723","EDGEWORTH 33","URBAN",715,2618.91395203506,2233.7461862661999,1.4510003999999999,1.5880756016770436,0,1,140.46666666670001,140.46666666670001,0.13986013986013998,0.13986013986013998,0,0,0,0,0]
[null,"216:10724","EDGEWORTH 33","URBAN",877,7073.8766700754504,3524.0702923405802,3.0114922999999996,173.0404542150213,9469.1402646839615,7,7374.5500000001002,7374.5500000001002,5.0171037628278201,5.0171037628278201,7,403551,403551,88.369441277080995,88.369441277080995]
[null,"216:10726","EDGEWORTH 33","URBAN",764,3480.7583161126599,723.68245658957198,2.7391916999999997,6565.1539063465152,0,3,307604.09999999998,969,110.47120418848139,2.4869109947643997,0,0,0,0,0]
[null,"216:10727","EDGEWORTH 33","SHORT RURAL",1019,15021.553957374799,753.52227689604103,5.0613636,4000.7504535306985,2914.6303051013501,14,101448.0166666666,99719.183333333305,12.168792934249227,11.7762512266928,7,73907,73907,17.3699705593719,17.3699705593719]
[null,"216:10728","EDGEWORTH 33","SHORT RURAL",1636,10815.915342402999,10945.594591155699,5.1518130999999991,1917.0170950700483,12783.169159258894,11,47756.833333333205,47292.699999999903,80.806845965770123,80.745721271393606,15,318455,318455,56.295843520782398,56.295843520782398]
[null,"216:10729","EDGEWORTH 33","URBAN",1337,177.24268234402501,9569.3864898429601,5.2603524999999998,35.61762759614583,789.8178179260417,1,869,869,0.82273747195213198,0.82273747195213198,2,19270,19270,8.6761406133133789,8.6761406133133789]
[null,"217:33607","MOUNT HUTTON 33","SHORT RURAL",45,511.81172221667799,157.67032841192,0.18185109999999999,0.82890004518750005,0,1,585,0,100,0,0,0,0,0,0]
[null,"217:33608","MOUNT HUTTON 33","URBAN",698,0,6472.2625918861104,2.7934614,210.89386599869573,2839.8823267856255,3,9689.2666666666992,602.26666666669996,100.42979942693439,0.28653295128939799,4,130475,130475,74.785100286533009,74.785100286533009]
[null,"217:33610","MOUNT HUTTON 33","URBAN",1915,7095.1604790492902,1600.88660137992,4.8614226,3176.1761219128839,0,14,83851.499999999898,58449.166666666599,129.3994778067885,30.1305483028721,0,0,0,0,0]
[null,"217:33611","MOUNT HUTTON 33","URBAN",1352,6444.4968927330401,2815.7151929112201,4.2444617999999998,979.84643631847837,3204.0925718681005,5,29628.183333333298,2910.8333333332998,104.51183431952637,2.8846153846153797,3,96884,96884,22.5591715976331,22.5591715976331]
[null,"217:33612","MOUNT HUTTON 33","URBAN",1893,10199.1584720259,2883.6668864867802,5.7687739000000002,14310.467379957781,5597.5545273577882,15,318375.71666666702,293818.71666666702,419.65134706814558,319.86265187532996,4,124533,124533,25.779186476492299,25.779186476492299]
[null,"220:8687","JEWELLS 33","URBAN",1521,7232.7027908516602,406.892130597961,3.4646918999999996,7844.7577386470311,923.9826586109624,10,290592.59999999998,70337.600000000006,122.8139381985536,22.945430637738301,2,34227,34227,6.2458908612754795,6.2458908612754795]
[null,"220:8688","JEWELLS 33","URBAN",453,3679.8665853985199,502.32904992369799,1.3424609999999999,15.448386738262503,743.70661323750005,4,1476.9,1476.9,2.64900662251656,2.64900662251656,2,71100,71100,65.121412803531996,65.121412803531996]
[null,"220:8689","JEWELLS 33","URBAN",1507,6159.0135831460302,1428.1765384576299,3.7369924999999995,7830.1599454678262,0,11,268916.8666666667,189009.3,123.95487723954841,116.45653616456499,0,0,0,0,0]
[null,"220:8691","JEWELLS 33","URBAN",1175,8461.5319969667107,2651.37820917414,3.9540712999999994,149.42322037738509,15.096314717458332,9,4850.0166666667001,4850.0166666667001,2.3829787234042499,2.3829787234042499,1,490,490,8.5106382978723402E-2,8.5106382978723402E-2]
[null,"220:8692","JEWELLS 33","URBAN",884,2876.3330627261098,3082.0350000649801,3.0657619999999999,32.996455765776986,756.8721290579166,1,1381.3333333333001,1381.3333333333001,0.113122171945701,0.113122171945701,2,31685,31685,17.7601809954751,17.7601809954751]
[null,"221:11893","GATESHEAD 33","URBAN",710,2328.6460140406102,2292.31000658517,1.4690902999999997,338.31277028968259,1956.6466020995665,8,29555.583333333299,29555.583333333299,30.281690140845104,30.281690140845104,4,170936,170936,74.647887323943692,74.647887323943692]
[null,"221:11894","GATESHEAD 33","URBAN",920,4359.3571021257903,324.54267691064501,1.6690312999999999,2581.1523527035047,0,11,198480.933333333,145952.933333333,327.60869565217348,316.95652173912998,0,0,0,0,0]
[null,"221:11895","GATESHEAD 33","URBAN",935,5320.3507755954797,1592.3870146060201,2.4849809999999999,598.36155524152002,184.32760731000002,4,30903.6833333334,30903.6833333334,102.67379679144399,102.67379679144399,1,9520,9520,5.9893048128342201,5.9893048128342201]
[null,"221:11897","GATESHEAD 33","URBAN",847,5509.5002636412,1048.14263912965,2.7934614,6463.0432687662596,1642.4412368595001,6,296936.8,30639.8,229.87012987012992,16.883116883116898,2,75460,75460,35.537190082644599,35.537190082644599]
[null,"221:11898","GATESHEAD 33","URBAN",322,6003.1893593445602,3545.2476157391502,3.2837928999999995,220.62144355356196,78.037970021458321,6,8622.6666666667006,8622.6666666667006,32.9192546583851,32.9192546583851,2,3050,3050,5.5900621118012399,5.5900621118012399]
[null,"221:11899","GATESHEAD 33","URBAN",1316,10645.060198822801,1431.3264550581,3.1743014000000001,904.28123854781734,10.387901331499998,10,36561.583333333503,36561.583333333503,97.112462006078999,97.112462006078999,1,420,420,7.5987841945288792E-2,7.5987841945288792E-2]
[null,"221:11900","GATESHEAD 33","SHORT RURAL",1198,5717.1471763928803,1843.0842154270599,1.9232419999999999,18254.343132421367,2115.619089155,7,1218153.2,6838,107.0951585976626,7.0116861435726197,1,141180,141180,30.217028380634396,30.217028380634396]
[null,"222:33596","PELICAN 33","URBAN",1195,7656.5427210178404,553.77418582242603,2.9020007999999997,5581.2694675268012,4824.7123612875002,5,246834.066666667,246834.066666667,125.606694560669,125.606694560669,4,213375,213375,31.966527196652699,31.966527196652699]
[null,"222:33597","PELICAN 33","SHORT RURAL",662,3472.6364109092501,4747.4794711371796,2.1041409999999998,5.2326625889225182,648.41296728541658,2,319.16666666660001,319.16666666660001,0.30211480362537801,0.30211480362537801,1,39550,39550,34.138972809667699,34.138972809667699]
[null,"222:33600","PELICAN 33","URBAN",1038,4535.7818205838403,568.98392318635001,2.0498713,2859.8515720313121,0,4,179055.03333333301,179055.03333333301,210.59730250481698,210.59730250481698,0,0,0,0,0]
[null,"222:33601","PELICAN 33","SHORT RURAL",776,5891.8251208714801,524.14491414682902,1.5414498999999999,923.03396933532406,0,6,76852.483333333497,1809.2000000001001,16.108247422680421,4.5103092783505199,0,0,0,0,0]
[null,"222:33602","PELICAN 33","URBAN",943,4672.7456508407504,660.96069044271997,3.3561524999999999,2397.5146060831498,1137.6566880765627,5,91683.083333333299,91683.083333333299,129.162248144221,129.162248144221,2,43505,43505,7.2110286320254495,7.2110286320254495]
[null,"223:14393","SWANSEA 33","URBAN",1063,3310.34004585805,1124.8460471992601,2.2126803999999995,5662.3265966335002,0,2,328432.3,328432.3,110.44214487300098,110.44214487300098,0,0,0,0,0]
[null,"223:14394","SWANSEA 33","URBAN",1511,5333.9510435264301,477.48695785602399,2.6125623999999998,2940.4729517683181,0,5,144450.8666666667,30631.866666666701,106.35340833884842,6.2872270019854408,0,0,0,0,0]
[null,"223:14395","SWANSEA 33","SHORT RURAL",1086,16001.037401478099,8879.0916822693598,2.3040819999999997,8869.351352244219,6940.0234365715005,8,494041.65000000037,14489.7833333334,266.02209944751439,17.1270718232044,4,386574,386574,101.56537753222801,101.56537753222801]
[null,"223:14397","SWANSEA 33","URBAN",1204,4344.61507713842,4116.7749005053502,2.5944724999999997,75.697407086772955,1214.4320386171873,3,3744.5666666666002,325.56666666659999,1.2458471760797309,0.16611295681063099,1,60075,60075,22.1760797342193,22.1760797342193]
[null,"223:14398","SWANSEA 33","URBAN",845,2689.8380146323502,1575.05469661186,3.0476720999999998,1711.9999603856875,0,2,72095,70399,200.35502958579903,100,0,0,0,0,0]
[null,"223:14399","SWANSEA 33","SHORT RURAL",142,1918.33730614092,981.95958852851595,0.2180309,0.36422788614666668,0,1,214.4,0,0.70422535211267601,0,0,0,0,0,0]
[null,"224:80326","ARGENTON 132 11","URBAN",972,5919.7920829012,5370.8699607924,2.3402617999999999,10794.520590051874,203.49746481900002,5,591982.06666666665,19082.066666666698,99.279835390946531,4.6296296296296298,1,11160,11160,3.1893004115226304,3.1893004115226304]
[null,"224:80328","ARGENTON 132 11","URBAN",55,1672.5370755180099,2866.9687856260198,1.0158906999999999,0,199.84216658509584,0,0,0,0,0,3,25247,25247,52.727272727272698,52.727272727272698]
[null,"224:80329","ARGENTON 132 11","SHORT RURAL",404,9775.8787881614899,2121.1545030614898,2.5030709,1371.4263718684467,780.12376383333344,7,70318.399999999994,70318.399999999994,161.13861386138601,161.13861386138601,4,40000,40000,27.722772277227698,27.722772277227698]
[null,"224:80331","ARGENTON 132 11","URBAN",285,2865.4221421003199,5118.8242250323101,3.6284530999999998,84.504102544720837,29.402564953666669,2,2989,2989,2.8070175438596499,2.8070175438596499,1,1040,1040,4.5614035087719298,4.5614035087719298]
[null,"224:80332","ARGENTON 132 11","URBAN",1834,16604.037869127598,1517.2505427430201,5.8773133,6386.3068963473715,990.20509191097096,12,139457.08333333328,1976.0333333333001,101.14503816793923,1.09051254089422,5,21623,21623,5.8887677208287901,5.8887677208287901]
[null,"224:80337","ARGENTON 132 11","URBAN",1858,14192.051297038501,4249.5657528348502,4.9699619999999998,6575.6718255852129,1063.1365821615002,13,169807.433333333,157587.433333333,113.29386437029103,110.76426264800901,5,27454,27454,9.0958019375672805,9.0958019375672805]
[null,"224:80340","ARGENTON 132 11","SHORT RURAL",1088,25234.043554198,1318.8743339852199,3.9178915000000001,8275.9354189033966,6371.9723787415214,13,271103,271103,207.8125,207.8125,5,208733,208733,44.209558823529399,44.209558823529399]
[null,"224:80341","ARGENTON 132 11","URBAN",1381,6651.6669221132897,1628.6672186294099,3.8274419999999996,342.86279923889384,0,5,11496.916666666601,11496.916666666601,7.0238957277335299,7.0238957277335299,0,0,0,0,0]
[null,"224:80344","ARGENTON 132 11","URBAN",71,0,3527.1546356808999,4.7528831999999994,176.27651641599999,0,1,4760,4760,98.591549295774598,98.591549295774598,0,0,0,0,0]
[null,"224:80346","ARGENTON 132 11","URBAN",1600,9023.0179558329291,3225.17429375452,5.0975434000000002,14689.796016681579,8128.6799145165169,8,369849.01666666672,18912.016666666699,105.125,5.75,6,204658,204658,25,25]
[null,"225:13446","TORONTO 33","SHORT RURAL",1564,7837.9067584883796,2480.5588576169098,4.3358634,327.53202454087841,4494.5366697156751,10,9695.0000000001,8734.3000000000993,5.3708439897698215,5.3069053708439906,5,133039,133039,23.593350383631702,23.593350383631702]
[null,"225:33670","TORONTO 33","SHORT RURAL",815,6633.2226446548102,407.82139082972799,3.0838518999999995,1894.0103493736356,379.28744246502077,4,78824.000000000102,78489.783333333398,99.999999999999972,99.877300613496899,3,15785,15785,19.631901840490801,19.631901840490801]
[null,"225:33676","TORONTO 33","SHORT RURAL",1203,11709.0049730213,882.24079250541604,3.7912621999999998,3826.4088171460758,5052.2101007616329,10,129532.0333333333,128788.9,172.152950955943,171.98669991687402,7,171028,171028,41.729010806317504,41.729010806317504]
[null,"225:33679","TORONTO 33","URBAN",658,3152.49578019,1377.2853218364401,3.3380625999999998,680.20136475577704,4682.2830232772922,2,26152.4666666667,26152.4666666667,109.27051671732499,109.27051671732499,5,180025,180025,52.127659574468098,52.127659574468098]
[null,"227:13014","AVONDALE 33","SHORT RURAL",62,6957.4399000010599,559.94093370302096,7.2359599999999996E-2,19.700365407433331,12.657352280833333,2,34942,34942,106.45161290322601,106.45161290322601,3,22450,22450,109.67741935483899,109.67741935483899]
[null,"227:13015","AVONDALE 33","SHORT RURAL",1807,53279.258091206299,5387.0401279958296,4.0454728999999992,18610.986276278192,12395.623947998956,31,590431.78333333333,590111.80000000005,332.26342003320417,332.208079690094,21,393250,393250,56.170448256779203,56.170448256779203]
[null,"227:13016","AVONDALE 33","SHORT RURAL",146,4589.3685871113603,324.71079337071501,0.38084000000000001,62.052876036861036,0,4,20911.683333333302,20911.683333333302,186.98630136986301,186.98630136986301,0,0,0,0,0]
[null,"227:13018","AVONDALE 33","URBAN",601,6805.6152316958296,2286.69609357627,3.6094110999999995,8890.8934948277638,4199.0941266986247,5,316139.45,316139.45,292.34608985025,292.34608985025,7,149310,149310,91.846921797004995,91.846921797004995]
[null,"227:13019","AVONDALE 33","SHORT RURAL",118,34788.645748338698,989.35745598849905,0.43510969999999999,175.07451528160456,88.790117043374991,7,51640.9,51640.9,471.186440677966,471.186440677966,9,26190,26190,62.711864406779704,62.711864406779704]
[null,"227:13020","AVONDALE 33","SHORT RURAL",831,25339.6611750292,1064.7627423098199,2.1945904999999999,2161.8789063325075,2262.0096917790625,8,126429.233333333,126429.233333333,133.935018050542,133.935018050542,4,132285,132285,42.719614921781002,42.719614921781002]
[null,"228:7487","STOCKTON 33","URBAN",1077,2945.7585878949899,262.755429122495,1.7413908999999999,900.85755210583454,0,5,66394.100000000006,663.8,14.391829155060334,0.371402042711235,0,0,0,0,0]
[null,"228:7490","STOCKTON 33","SHORT RURAL",1438,16259.704039439601,8667.6212058040692,3.8998016,2315.1939646856531,4842.5487383210666,6,76192.899999999994,76192.899999999994,106.25869262865099,106.25869262865099,11,159368,159368,51.599443671766295,51.599443671766295]
[null,"228:7491","STOCKTON 33","URBAN",767,2791.3238457083999,181.503576868479,1.6509414,1353.0855679664626,0,3,105187.2833333333,462.28333333329999,100.13037809647977,0.26075619295958302,0,0,0,0,0]
[null,"229:34983","WILLIAMTOWN 33","SHORT RURAL",42,6837.2457455927297,3551.2615003073402,1.9594217999999997,116.69556692710634,0.45801484575000001,4,7643.5666666667003,7587.5666666667003,145.23809523809553,135.71428571428601,1,30,30,2.38095238095238,2.38095238095238]
[null,"229:34986","WILLIAMTOWN 33","SHORT RURAL",80,4537.0965738629702,107.366421678896,0.38084000000000001,37.307858658889003,0,3,12572.666666666701,12572.666666666701,91.25,91.25,0,0,0,0,0]
[null,"229:34989","WILLIAMTOWN 33","SHORT RURAL",14,1282.0114555452301,2273.02843074865,0.1266293,1.568778740375,3.5519518649999999,1,1590,1590,35.714285714285701,35.714285714285701,3,3600,3600,100,100]
[null,"229:34992","WILLIAMTOWN 33","URBAN",36,2170.6242684675299,1831.4196848738,0.27230059999999995,13.916069659158332,0,2,6559,6559,63.888888888888893,63.888888888888893,0,0,0,0,0]
[null,"229:34995","WILLIAMTOWN 33","SHORT RURAL",691,36941.829502701803,1730.825729211,2.3945314999999998,2328.5702337302055,2025.1292207100626,14,124806.85,124806.85,125.61505065122999,125.61505065122999,7,108543,108543,35.890014471779999,35.890014471779999]
[null,"230:81432","TANILBA BAY 33","SHORT RURAL",878,52532.073923927499,1437.39871648493,2.1584106999999997,6764.8574490090259,2804.9262020044366,28,402248.28333333298,231818.28333333301,231.09339407744841,131.548974943052,18,166785,156255,57.630979498860988,54.669703872437303]
[null,"230:81434","TANILBA BAY 33","URBAN",1285,8393.0424079693294,1938.5938894503599,3.3018828,11964.623722901686,4171.7892756732499,11,465057.9,215457.9,169.33852140077818,69.727626459144005,1,162155,162155,43.968871595330697,43.968871595330697]
[null,"230:81438","TANILBA BAY 33","SHORT RURAL",546,13775.0919372714,2428.7554430882901,1.5414498999999999,2496.5858855102056,1439.6942962054586,9,207867.566666667,101982.566666667,227.10622710622749,127.65567765567801,4,119870,119870,54.945054945054906,54.945054945054906]
[null,"230:81440","TANILBA BAY 33","SHORT RURAL",1621,9612.0922604791394,1872.2760531921599,3.2285710999999999,28977.90543582162,6622.5553498325844,18,1151930.4833333332,84146.483333333206,203.51634793337411,59.099321406539097,5,263260,263260,38.371375694016002,38.371375694016002]
[null,"232:11453","NELSON BAY 33","SHORT RURAL",1352,15334.359264770101,3788.2393811219899,2.8115512999999996,824.13478771306302,757.64220082764587,4,37620.266666666706,37398.466666666704,6.1390532544378695,6.0650887573964498,3,34585,34585,15.532544378698198,15.532544378698198]
[null,"232:11454","NELSON BAY 33","SHORT RURAL",1868,14664.974455890901,2503.4128298298101,3.8998016,1448.5860463704169,4633.7060755626671,11,47672.883333333302,44701.25,111.93790149892902,104.49678800856499,3,152495,152495,29.122055674518201,29.122055674518201]
[null,"232:11455","NELSON BAY 33","SHORT RURAL",2153,9961.4239396841695,7803.4716488634303,4.2987314999999997,4018.5647970382865,8809.565815372438,11,119977.633333333,119775.33333333299,109.89317231769596,109.84672549930301,4,263017,263017,46.446818392940095,46.446818392940095]
[null,"232:11457","NELSON BAY 33","SHORT RURAL",2271,15457.9794693815,3086.22669525424,5.4602934999999997,11698.518768896782,8284.3208962433328,23,274969.5,274969.5,95.728753852928307,95.728753852928307,8,194720,194720,34.4782034346103,34.4782034346103]
[null,"232:11460","NELSON BAY 33","URBAN",223,4011.8437083021799,669.81985700870405,2.9572225999999997,731.90746559386571,0,2,31764.483333333301,31764.483333333301,100.448430493274,100.448430493274,0,0,0,0,0]
[null,"232:33407","NELSON BAY 33","SHORT RURAL",515,32402.448993070298,2136.4482148751699,1.7956605999999997,2161.3401973422156,6039.4925401491992,13,154478.66666666701,154478.66666666701,331.06796116504904,331.06796116504904,18,431664,431664,193.009708737864,193.009708737864]
[null,"232:33409","NELSON BAY 33","URBAN",1686,7531.11674218199,7111.4746185844897,4.2444617999999998,12160.061665763007,3028.020270429,5,367690.816666667,367690.816666667,108.24436536180299,108.24436536180299,5,91560,91560,26.334519572953702,26.334519572953702]
[null,"232:33413","NELSON BAY 33","SHORT RURAL",194,4778.4581257693799,528.98461626630399,2.5754305,247.16395777539583,2714.4490191018749,2,12317,12317,100.51546391752599,100.51546391752599,7,135270,135270,207.21649484536101,207.21649484536101]
[null,"233:82812","MEDOWIE 33","SHORT RURAL",785,36603.482688213699,2489.2618577507201,3.0114922999999996,14987.190353662858,2981.5457696111084,36,638716.44999999995,169218.58333333299,557.4522292993629,216.433121019108,13,127066,127066,42.675159235668801,42.675159235668801]
[null,"233:82813","MEDOWIE 33","SHORT RURAL",279,1685.3186296588999,7406.4915103755502,1.1606099000000001,893.19459503967914,0,3,98771,0,468.10035842293854,0,0,0,0,0,0]
[null,"233:82815","MEDOWIE 33","SHORT RURAL",1571,14230.1071422844,6281.15594541265,4.5891219999999997,17324.600797411022,8263.4216506416669,10,484510.58333333302,145408.58333333299,400.06365372374199,100.25461489497101,5,231100,231100,50.413749204328397,50.413749204328397]
[null,"233:82821","MEDOWIE 33","SHORT RURAL",926,7187.4817909049098,5630.40521402185,2.8839108999999996,4505.0593273630202,0,6,200487.9666666667,8805.9666666666999,304.75161987041037,4.7516198704103596,0,0,0,0,0]
[null,"235:2120","TARRO 33","SHORT RURAL",702,59058.383195137103,2106.2485353891302,2.4668911000000002,1073.8678792704798,2764.6610961364081,15,55868.95,23313.066666666698,51.282051282051299,34.900284900284902,37,143834,143624,60.968660968661048,60.826210826210904]
[null,"235:2123","TARRO 33","URBAN",1358,8412.97970987999,1815.9000443928901,5.1879928999999994,4699.189388827228,951.96427219437498,5,116250.066666667,116250.066666667,99.852724594992608,99.852724594992608,9,23550,23550,11.782032400589101,11.782032400589101]
[null,"235:2124","TARRO 33","URBAN",933,6412.2701719947599,1163.8194717050601,2.1403208,11706.650863531806,67.206964920333334,7,701977.8833333333,76605.883333333302,204.82315112540198,104.930332261522,2,4030,4030,1.28617363344052,1.28617363344052]
[null,"235:2728","TARRO 33","URBAN",320,2420.5460737868798,939.70252923542296,4.6624337000000002,0,1145.244274474896,0,0,0,0,0,3,31525,31525,34.375,34.375]
[null,"235:2857","TARRO 33","SHORT RURAL",317,7830.0274807230799,740.60197145890595,0.97971089999999983,164.1513756796856,5.7251855718749995,3,21503.85,21503.85,199.36908517350201,199.36908517350201,1,750,750,0.63091482649842301,0.63091482649842301]
[null,"235:8684","TARRO 33","SHORT RURAL",119,8926.0498040593593,1968.19678425081,2.0679612000000001,67.22287006820001,418.4510871695,4,4172,4172,19.327731092437002,19.327731092437002,4,25970,25665,43.697478991596682,42.857142857142897]
[null,"235:8685","TARRO 33","URBAN",109,2111.3645096884802,287.05791650120199,4.4444027999999998,416.8947016847365,1155.0258439731001,3,12038.7833333334,12038.7833333334,101.834862385321,101.834862385321,1,33354,33354,100,100]
[null,"238:34136","THORNTON 33","URBAN",842,2362.8417529621402,3178.46743155578,2.5573405999999999,62.253635254410419,1726.3440669509835,2,3124.25,3124.25,6.2945368171021405,6.2945368171021405,6,86638,86638,56.294536817102106,56.294536817102106]
[null,"238:34137","THORNTON 33","SHORT RURAL",894,5711.6955822424798,7806.2855135536001,3.4646918999999996,100.07315030446249,319.35941950412496,3,3707,3707,5.7046979865771901,5.7046979865771901,2,11830,11830,4.6979865771812106,4.6979865771812106]
[null,"238:34138","THORNTON 33","SHORT RURAL",289,0,2987.98257521292,1.2158316999999998,0.55624384707788521,0,1,58.7166666667,58.7166666667,0.34602076124567499,0.34602076124567499,0,0,0,0,0]
[null,"238:34140","THORNTON 33","URBAN",979,8656.1845422866409,7049.7929536479596,3.9178915000000001,5274.0356223671415,2127.3284011505625,5,172766.8,172766.8,198.672114402451,198.672114402451,8,69687,69687,30.234933605720098,30.234933605720098]
[null,"238:34141","THORNTON 33","SHORT RURAL",868,33366.374629242702,7811.9136633354601,3.2837928999999995,5535.3688205863382,4422.0151747110167,16,216341.8,216341.8,299.65437788018397,299.65437788018397,13,172828,172828,47.8110599078341,47.8110599078341]
[null,"238:34143","THORNTON 33","URBAN",912,244.52096808637,7197.6107830493702,2.4488012000000001,1663.7933459381304,97.309237685000014,6,87199.8,87199.8,200.438596491228,200.438596491228,1,5100,5100,9.3201754385964897,9.3201754385964897]
[null,"238:34144","THORNTON 33","URBAN",435,6825.1157408157596,3583.8309551207899,5.0251837999999998,1840.4469053581736,203.64285152044167,9,47004.666666666701,46665.216666666704,208.96551724137927,208.735632183908,6,5201,5201,8.5057471264368001,8.5057471264368001]
[null,"238:34147","THORNTON 33","SHORT RURAL",889,4095.3418642327101,5128.92767566575,3.0657619999999999,0,576.64172938166666,0,0,0,0,0,2,24140,24140,12.485939257592801,12.485939257592801]
[null,"238:34148","THORNTON 33","SHORT RURAL",505,18348.763300456401,5524.0752538365896,1.5414498999999999,690.67953657991336,216.56067285292917,5,57506.483333333301,57506.483333333301,108.11881188118799,108.11881188118799,6,18031,18031,11.485148514851499,11.485148514851499]
[null,"238:34150","THORNTON 33","SHORT RURAL",717,13359.218614166,10527.572569526399,4.4263129000000001,173.71956693669648,38.971840787458333,8,5037.05,5037.05,5.02092050209205,5.02092050209205,2,1130,1130,0.418410041841004,0.418410041841004]
[null,"238:34151","THORNTON 33","URBAN",1219,57.169005391995498,8955.4619297034606,4.6433916999999996,18.355801403002708,1852.9826050185998,1,507.35,507.35,8.2034454470877802E-2,8.2034454470877802E-2,3,51216,51216,10.418375717801499,10.418375717801499]
[null,"239:82127","RATHMINES 132","SHORT RURAL",539,10318.763832012801,1731.7540639395099,2.1222308999999999,862.81711277148747,945.39647728941259,2,52179,52179,34.137291280148403,34.137291280148403,8,57173,57173,26.345083487940602,26.345083487940602]
[null,"239:82128","RATHMINES 132","URBAN",59,789.10116894922498,833.52536155412201,3.0295821999999997,46.805761625317267,0,3,1982.8333333333001,1982.8333333333001,103.38983050847499,103.38983050847499,0,0,0,0,0]
[null,"239:82129","RATHMINES 132","SHORT RURAL",1429,14721.6909287542,1388.14131370007,3.1200316999999997,9126.1246616578319,0,8,375402.38333333301,232868.38333333301,252.90412876137199,153.53393981805502,0,0,0,0,0]
[null,"239:82131","RATHMINES 132","SHORT RURAL",318,27883.564012639199,4064.4955580331498,1.4510003999999999,801.55233038209997,176.09776154519997,4,70898,70508,102.8301886792451,101.88679245283001,8,15576,11699,16.35220125786168,13.522012578616399]
[null,"239:82132","RATHMINES 132","URBAN",1234,8692.7301821920792,1779.4895348994301,3.5913211999999994,4712.4613909973659,23.785021030833331,11,168408.183333333,168396.183333333,105.99675850891448,105.91572123176701,1,850,850,0.162074554294976,0.162074554294976]
[null,"239:82133","RATHMINES 132","URBAN",1687,12818.9555052818,2146.2149418660501,4.5348522999999998,37.456456558247922,3891.5164232213956,4,1060.0666666666,1060.0666666666,0.2371072910492,0.2371072910492,3,110135,110135,21.991701244813299,21.991701244813299]
[null,"239:82136","RATHMINES 132","SHORT RURAL",1078,8389.7623697656509,1639.6958512036999,2.3945314999999998,147.74166234330616,997.89057212052091,10,7918.6666666666997,7715.4833333334,100.83487940630766,100.74211502782899,2,53485,53485,24.211502782931397,24.211502782931397]
[null,"240:34835","MAYFIELD WEST 132","SHORT RURAL",964,10469.323791610899,2143.4933959005102,3.4104221999999997,2.4269890650491144,742.97752838099996,1,91.333333333300004,91.333333333300004,0.103734439834025,0.103734439834025,6,27960,27960,9.0248962655601694,9.0248962655601694]
[null,"240:34840","MAYFIELD WEST 132","URBAN",1501,4438.0766142768598,1723.98650679811,4.7167033999999992,5563.0369808469968,5716.9825512103325,7,151371.11666666699,151088.11666666699,99.933377748167914,99.866755496335799,2,155560,155560,27.115256495669499,27.115256495669499]
[null,"240:34843","MAYFIELD WEST 132","URBAN",272,1169.7638583553,4418.21938824463,2.6306522999999999,618.56347064407498,16.110772348275002,1,30178,30178,100,100,2,786,786,1.47058823529412,1.47058823529412]
[null,"240:34846","MAYFIELD WEST 132","URBAN",835,2218.4695083332999,6891.1456365314498,4.0273830000000004,0,1722.7634205375002,0,0,0,0,0,3,54900,54900,17.365269461077801,17.365269461077801]
[null,"240:34849","MAYFIELD WEST 132","URBAN",2286,7604.1153037589202,7137.9140869671601,4.5167623999999993,11447.842024446587,8170.7836599289994,10,325286.48333333305,324510.33333333302,213.8232720909885,213.779527559055,5,232170,232170,26.990376202974598,26.990376202974598]
[null,"240:34852","MAYFIELD WEST 132","URBAN",165,0,5226.5893296617196,3.4646918999999996,0,311.53065943174994,0,0,0,0,0,2,11540,11540,15.7575757575758,15.7575757575758]
[null,"242:81532","TOMAREE 33","SHORT RURAL",898,493.54790343747101,7864.5157092640302,1.8861101,2.5470515415916708,234.98809972137505,1,173.3166666667,173.3166666667,0.11135857461024501,0.11135857461024501,2,15990,15990,16.258351893095799,16.258351893095799]
[null,"242:81533","TOMAREE 33","SHORT RURAL",17,2526.84673256106,105.580515149253,0.19994099999999998,0.15890310975000002,0,1,102,102,5.8823529411764701,5.8823529411764701,0,0,0,0,0]
[null,"242:81535","TOMAREE 33","URBAN",1580,3647.7488492785401,3161.33635965033,4.0092930999999998,865.34529735071214,6672.322876500556,10,27700.733333333301,13242.733333333301,10.189873417721509,5.1898734177215102,9,213589,213589,36.075949367088597,36.075949367088597]
[null,"242:81538","TOMAREE 33","URBAN",1004,3344.4327081187498,2362.32870505651,2.5754305,148.90105044114446,826.435044006,4,7420.2333333333008,3677.55,14.14342629482071,8.8645418326693211,1,41184,41184,14.3426294820717,14.3426294820717]
[null,"242:81539","TOMAREE 33","URBAN",2132,6678.5514401650398,5128.9284160775496,4.8976024000000002,9452.8508556654724,1432.7354230915003,9,247713.066666667,208929.066666667,151.07879924953082,146.34146341463401,2,37545,37545,6.1913696060037502,6.1913696060037502]
[null,"242:81541","TOMAREE 33","URBAN",1675,4928.44881868833,3853.7200925019702,5.4241136999999995,7109.4788689736861,10044.197465964748,7,168220.38333333342,89373.383333333404,112.2388059701493,12.238805970149299,6,237660,237660,35.462686567164198,35.462686567164198]
[null,"243:80074","MORISSET 132","URBAN",1755,17240.046555300301,5467.2120404492598,5.5869228,8933.4118679346338,10124.977664488502,8,205217.46666666699,205217.46666666699,108.547008547009,108.547008547009,9,232590,232590,39.772079772079799,39.772079772079799]
[null,"243:80075","MORISSET 132","SHORT RURAL",843,56615.952591302797,2100.1796716283002,1.6871212,1130.7414052557594,1824.8563688336667,24,86017.466666666805,83413.466666666805,171.648873072361,169.157769869514,15,138820,138820,44.009489916963204,44.009489916963204]
[null,"243:80077","MORISSET 132","URBAN",254,2775.31921425668,2900.8967448756598,1.4329104999999998,234.45998056249996,0,1,21000,21000,98.425196850393704,98.425196850393704,0,0,0,0,0]
[null,"243:80078","MORISSET 132","SHORT RURAL",1216,3709.9096134021802,7638.6255486445598,3.1743014000000001,2553.6891129139708,9.6459083792500007,6,103249.866666667,103249.866666667,100.082236842105,100.082236842105,1,390,390,8.2236842105263191E-2,8.2236842105263191E-2]
[null,"243:80080","MORISSET 132","SHORT RURAL",646,19758.5443331079,2573.7723552186899,5.0794534999999996,38.855780438804793,4991.6214948730631,2,981.76666666669996,981.76666666669996,1.39318885448917,1.39318885448917,8,126123,119408,52.631578947368418,50]
[null,"243:80081","MORISSET 132","SHORT RURAL",1711,16328.277512046699,5422.5590942930803,3.5189615999999999,17.913469522668493,3116.12113967,4,653.33333333339999,511.76666666670002,0.23378141437755717,0.17533606078316799,2,113650,113650,21.215663354763301,21.215663354763301]
[null,"243:80083","MORISSET 132","SHORT RURAL",284,41506.596247744899,1986.1916438921301,0.88926139999999998,600.517400853205,287.49787714697504,15,86669.4,86669.4,156.33802816901402,156.33802816901402,16,41493,41493,49.295774647887299,49.295774647887299]
[null,"243:80084","MORISSET 132","SHORT RURAL",811,8213.5143367542496,3648.4674387105501,2.1222308999999999,1083.1450526868177,8211.4710904998756,8,65503.366666666698,65503.366666666698,112.33045622688,112.33045622688,11,496590,496590,164.85819975339101,164.85819975339101]
[null,"256:80632","ADAMSTOWN 132","URBAN",829,7533.2821950031503,1667.1696445143,2.6125623999999998,507.99715769105654,0,5,24955.383333333299,22693.383333333299,12.545235223160439,7.8407720144752791,0,0,0,0,0]
[null,"256:80635","ADAMSTOWN 132","URBAN",530,1569.30018944379,2083.85379516578,1.4510003999999999,8.3042334885484124,0,3,734.51666666660003,734.51666666660003,0.56603773584905592,0.56603773584905592,0,0,0,0,0]
[null,"256:80638","ADAMSTOWN 132","URBAN",1024,2876.34886924785,947.26171351097503,3.5551413999999997,51.01504466590093,3148.9901959926665,7,1841.6666666665999,1841.6666666665999,0.78125,0.78125,1,113680,113680,22.65625,22.65625]
[null,"256:80641","ADAMSTOWN 132","URBAN",1089,3564.9409644227899,971.19586896869998,1.6690312999999999,4.8006242967443749,0,3,369.15,369.15,0.27548209366391196,0.27548209366391196,0,0,0,0,0]
[null,"256:80644","ADAMSTOWN 132","URBAN",1084,3131.4741777613799,587.43050263017506,2.4488012000000001,572.56119445764625,1430.4457939695001,4,30008.066666666698,30008.066666666698,103.505535055351,103.505535055351,2,74970,74970,18.0811808118081,18.0811808118081]
[null,"256:80646","ADAMSTOWN 132","URBAN",1677,5179.0368777609001,426.94172831998799,3.2942659999999999,6637.9727101575645,0,8,258610.66666666701,258610.66666666701,205.84376863446599,205.84376863446599,0,0,0,0,0]
[null,"256:80647","ADAMSTOWN 132","URBAN",1816,3607.8840158381699,3808.2197342691602,5.2241726999999996,240.12361640206004,732.64951616271253,4,5899.1166666666004,5899.1166666666004,8.2048458149779702,8.2048458149779702,2,17999,17999,5.0110132158590304,5.0110132158590304]
[null,"256:80650","ADAMSTOWN 132","URBAN",1200,8031.9592110084895,1907.09501599583,4.2082819999999996,372.50710166848421,0,12,11360.549999999899,11360.549999999899,7.1666666666666599,7.1666666666666599,0,0,0,0,0]
[null,"256:80653","ADAMSTOWN 132","URBAN",593,316.39268180540398,1260.90787297012,0.87117149999999999,0.6618180989062501,94.935260833875006,1,97.5,97.5,0.168634064080944,0.168634064080944,1,13986,13986,43.6762225969646,43.6762225969646]
[null,"257:81985","BROADMEADOW 132","URBAN",1004,1835.3316785203101,2541.01618420564,1.5785817999999998,8.6077982703009788,0,3,699.83333333330006,358.75,0.59760956175298807,0.49800796812749004,0,0,0,0,0]
[null,"257:81987","BROADMEADOW 132","URBAN",2025,8905.9548731001105,2158.78147247578,5.5869228,4651.0644850985709,949.85602407300007,9,106843.8,106843.8,103.111111111111,103.111111111111,3,21820,21820,3.06172839506173,3.06172839506173]
[null,"257:81988","BROADMEADOW 132","URBAN",971,4846.3250751134401,1931.3010983148399,3.0838518999999995,630.06448220097695,0.24028346054166666,5,26221.7166666667,26221.7166666667,57.878475798146198,57.878475798146198,1,10,10,0.20597322348094699,0.20597322348094699]
[null,"257:81991","BROADMEADOW 132","URBAN",411,0,4288.4816707561204,2.6306522999999999,2.1378543968512504,149.42433895537499,1,104.3,104.3,0.24330900243308998,0.24330900243308998,1,7290,7290,13.138686131386901,13.138686131386901]
[null,"257:81994","BROADMEADOW 132","URBAN",751,2190.9654954000998,4861.3216448125104,3.8998016,1954.1485641059564,0,2,64310.916666666701,64310.916666666701,112.38348868175801,112.38348868175801,0,0,0,0,0]
[null,"257:81997","BROADMEADOW 132","URBAN",344,2070.3667484121702,1753.9627328244101,2.7753714999999999,7.3524216654166672,69.631758125416667,1,340,340,0.290697674418605,0.290697674418605,3,3220,3220,9.5930232558139501,9.5930232558139501]
[null,"257:81999","BROADMEADOW 132","URBAN",930,4268.7419544025097,926.10767115787201,3.8998016,484.39870068167318,553.02436522666676,6,15941.5333333334,15941.5333333334,81.612903225806505,81.612903225806505,1,18200,18200,4.3010752688171996,4.3010752688171996]
[null,"257:82000","BROADMEADOW 132","URBAN",500,555.77887187704403,3959.6871722465899,1.2158316999999998,52.880269447408331,0,2,5582,5582,15.4,15.4,0,0,0,0,0]
[null,"257:82006","BROADMEADOW 132","URBAN",223,1571.7217828919199,1042.4443692310199,0.70741029999999994,18.630239759083334,352.89973389802083,1,3380,3380,58.295964125560495,58.295964125560495,2,64025,64025,78.475336322869907,78.475336322869907]
[null,"258:80773","JESMOND 132","URBAN",395,1137.0844987882899,1503.8033300288,2.8658209999999995,55.734486808,45.552224795000001,1,2496,2496,6.0759493670886098,6.0759493670886098,1,2040,2040,3.0379746835443,3.0379746835443]
[null,"258:80775","JESMOND 132","URBAN",2007,7628.8726175095799,1644.2247265778999,3.5370514999999996,289.02547918554643,0,9,10487.3166666666,10487.3166666666,10.463378176382699,10.463378176382699,0,0,0,0,0]
[null,"258:80776","JESMOND 132","URBAN",329,1021.01044047358,579.42511416422303,1.1244300999999999,690.28117135521666,0,3,78788.566666666695,78788.566666666695,99.696048632218805,99.696048632218805,0,0,0,0,0]
[null,"258:80778","JESMOND 132","URBAN",1187,4106.38899739104,1805.2319707788499,1.9594217999999997,2.1544509438685653,0,2,141.1166666666,141.1166666666,0.16849199663015998,0.16849199663015998,0,0,0,0,0]
[null,"258:80779","JESMOND 132","URBAN",1438,5096.5465554848497,3591.1003368203001,4.3720431999999994,486.54055040616663,0,5,14282.5,14282.5,7.2322670375521492,7.2322670375521492,0,0,0,0,0]
[null,"258:80781","JESMOND 132","URBAN",1589,9332.8311485500308,2814.13924833084,5.0432736999999994,20.965463143740678,723.0373394566667,4,533.53333333340004,533.53333333340004,0.25173064820641899,0.25173064820641899,1,18400,18400,5.0346129641283799,5.0346129641283799]
[null,"258:80784","JESMOND 132","URBAN",1769,7225.2020989066996,2347.05854320862,4.4444027999999998,1323.7340471130406,1594.85264868325,11,38225.833333333299,24238.233333333301,30.243075183719604,23.4030525720746,1,46055,46055,8.53589598643301,8.53589598643301]
[null,"258:80785","JESMOND 132","URBAN",1384,7094.11390529459,3577.2901586031098,3.4646918999999996,543.72358446107614,0,7,20141.099999999999,20141.099999999999,6.7196531791907601,6.7196531791907601,0,0,0,0,0]
[null,"258:80787","JESMOND 132","URBAN",1618,7384.2841439116501,1959.0057505658599,3.5732312999999998,520.79709719915525,16.148027783249997,10,18705.833333333299,18636.849999999999,18.541409147095184,18.479604449938201,1,580,580,0.123609394313968,0.123609394313968]
[null,"258:80790","JESMOND 132","URBAN",797,1211.98111136443,3672.8118241093998,2.4126213999999995,104.12777457543999,246.22068013234997,4,5539.2,4152,17.189460476787911,15.683814303638599,1,13098,13098,9.284818067754081,9.284818067754081]
[null,"258:80791","JESMOND 132","URBAN",802,4711.3109987207199,1145.6371363436799,2.0679612000000001,747.32189934195753,2909.9833016100006,2,46380.45,46380.45,99.875311720698207,99.875311720698207,2,180600,180600,85.785536159600994,85.785536159600994]
[null,"258:80793","JESMOND 132","URBAN",1425,11345.02828988,4839.9281936386697,4.9518720999999992,36068.289044828409,1314.4571173926497,12,934815.183333333,298914.183333333,312.91228070175407,213.614035087719,2,34068,34068,11.578947368421,11.578947368421]
[null,"261:81864","CHARLESTOWN 132","URBAN",1180,5155.5534476550802,2767.9519677009398,3.7369924999999995,168.02875015888387,657.32530264843751,7,5770.7333333334,5770.7333333334,2.2033898305084803,2.2033898305084803,1,22575,22575,8.8983050847457594,8.8983050847457594]
[null,"261:81865","CHARLESTOWN 132","URBAN",1128,7166.5423633575801,1587.49938631176,3.1562114999999999,464.14482252799377,10.8205450925,6,18873.7,1094.7,12.677304964539015,0.44326241134751698,1,440,440,8.8652482269503508E-2,8.8652482269503508E-2]
[null,"261:81867","CHARLESTOWN 132","URBAN",149,0,836.47953283505501,1.4510003999999999,0,360.87830948400006,0,0,0,0,0,1,31920,31920,51.006711409395997,51.006711409395997]
[null,"261:81870","CHARLESTOWN 132","URBAN",1765,8787.7162514109896,2082.3158750948701,4.9156922999999999,3081.972273101977,5704.998867995625,11,80466.233333333497,80204.233333333497,100.50991501416404,100.453257790368,2,148950,148950,26.7988668555241,26.7988668555241]
[null,"261:81876","CHARLESTOWN 132","URBAN",996,4747.2065467889597,306.76879714733701,2.2679022,906.83723933153487,310.01542703339999,8,51318.583333333299,918.58333333329995,7.0281124497991998,0.70281124497991998,1,17544,17544,10.2409638554217,10.2409638554217]
[null,"261:81879","CHARLESTOWN 132","URBAN",2182,8660.7445276598701,741.77783447851004,4.4444027999999998,4413.7762042578543,8335.9663357080008,11,127457.83333333369,127233.96666666699,110.99908340971616,110.95325389550901,4,240720,240720,28.5059578368469,28.5059578368469]
[null,"261:81882","CHARLESTOWN 132","URBAN",1184,7014.7453112500498,2522.8421739230998,4.4082229999999996,2063.5056038694079,425.90781218333331,7,60077.483333333301,32177.483333333301,118.07432432432449,115.96283783783801,2,12400,12400,5.0675675675675702,5.0675675675675702]
[null,"261:81885","CHARLESTOWN 132","URBAN",983,1356.1508360805501,2347.4549428683299,4.3901330999999999,869.28233764790332,4340.1148502139995,3,25412.816666666698,25412.816666666698,14.242115971515801,14.242115971515801,3,126880,126880,32.451678535096597,32.451678535096597]
[null,"261:81886","CHARLESTOWN 132","URBAN",821,2885.6982665010501,2873.3263895300202,2.6125623999999998,3.8463068935316667,478.37106111666668,1,188.95,188.95,0.12180267965895199,0.12180267965895199,1,23500,23500,6.09013398294762,6.09013398294762]
[null,"264:81231","RAYMOND TERRACE 33","URBAN",285,1050.75128065733,4975.3185781020202,3.2837928999999995,2291.8344553219954,1247.9678648513541,5,89573,89573,26.315789473684198,26.315789473684198,4,48775,48775,54.035087719298204,54.035087719298204]
[null,"264:81232","RAYMOND TERRACE 33","URBAN",811,7789.70857012329,4219.7078313286002,3.5008716999999998,7978.6290314303287,592.47002214949998,6,292497.2,292497.2,221.57829839704101,221.57829839704101,5,21720,21720,13.316892725030799,13.316892725030799]
[null,"264:81236","RAYMOND TERRACE 33","URBAN",1796,6652.4982370062398,8373.4511284529508,4.0635627999999997,2573.8333867451097,12198.010601535369,9,81291.116666666596,79667.116666666596,208.01781737193758,206.40311804008903,10,385258,385258,73.775055679287306,73.775055679287306]
[null,"264:81238","RAYMOND TERRACE 33","URBAN",578,5534.2586994813,199.456680067669,1.6871212,1429.8805232338918,3.8516274028833331,2,108773.5,108773.5,15.051903114186798,15.051903114186798,2,293,293,0.34602076124567499,0.34602076124567499]
[null,"264:81240","RAYMOND TERRACE 33","SHORT RURAL",372,40884.464375236603,8174.1469356343396,2.1584106999999997,1129.978469289076,1495.0693073837124,18,67190.166666666701,21909.85,66.129032258064498,50.268817204301101,14,88899,79099,83.064516129032199,75.537634408602088]
[null,"264:81241","RAYMOND TERRACE 33","URBAN",1310,7429.05493949847,7250.8028436146997,4.1178324999999996,1828.5147197580311,560.68149955468755,7,56990.1,56990.1,105.725190839695,105.725190839695,4,17475,17475,7.6335877862595396,7.6335877862595396]
[null,"264:81244","RAYMOND TERRACE 33","SHORT RURAL",1267,31841.815967940001,7888.0494543508603,3.7369924999999995,1253.3099495163185,4619.7375500730213,4,43043.333333333299,43043.333333333299,6.7087608524072699,6.7087608524072699,21,158659,158659,50.5130228887135,50.5130228887135]
[null,"265:81641","TOMAGO 33","URBAN",35,1631.18340276457,6949.3242792487799,3.3380625999999998,0,1.0403628436666665,0,0,0,0,0,1,40,40,5.71428571428571,5.71428571428571]
[null,"265:81645","TOMAGO 33","URBAN",43,1439.1272783602301,4454.8208083088903,1.2881912999999998,12.947932804124999,133.59456249837498,1,1290,1290,13.953488372093,13.953488372093,6,13310,13310,95.348837209302289,95.348837209302289]
[null,"265:81648","TOMAGO 33","SHORT RURAL",173,9134.1532091954705,7621.4138003292501,3.0476720999999998,9.698839732114628,327.34474587581258,2,408.43333333330003,408.43333333330003,1.15606936416185,1.15606936416185,3,13785,13785,28.901734104046202,28.901734104046202]
[null,"265:81649","TOMAGO 33","URBAN",47,9215.2030887080291,1422.08442406789,3.2647508999999997,24.165958224375,439.82043968362501,1,950,950,21.2765957446809,21.2765957446809,5,17290,17290,114.89361702127701,114.89361702127701]
[null,"265:81651","TOMAGO 33","SHORT RURAL",157,10588.235594621499,2721.66488493923,2.2307702999999997,555.86442930537453,488.41786230874993,6,31980.383333333299,31980.383333333299,222.29299363057299,222.29299363057299,6,28100,28100,47.133757961783502,47.133757961783502]
[null,"502:48002","TELARAH 33","URBAN",205,1634.89664234409,174.87162106544,1.52336,5.508838963222618,1814.848588666667,2,464.11666666669998,464.11666666669998,0.97560975609756095,0.97560975609756095,2,152900,152900,135.60975609756102,135.60975609756102]
[null,"502:48004","TELARAH 33","URBAN",1197,4416.2089207383897,3755.6478628783202,3.2837928999999995,3960.053419781686,1338.6710136139998,8,154772.89999999967,154369.98333333299,122.05513784461135,121.971595655806,2,52320,52320,28.738512949039301,28.738512949039301]
[null,"502:48008","TELARAH 33","URBAN",1092,5029.4548440314202,328.41071078986602,1.9775116999999998,947.42554648379848,0,13,61488.750000000102,61488.750000000102,41.849816849816804,41.849816849816804,0,0,0,0,0]
[null,"502:48009","TELARAH 33","SHORT RURAL",116,1438.9210894058699,54.777039021940098,0.48937939999999996,60.140742196818138,33.078479048541666,6,15772.2166666668,15772.2166666668,74.13793103448279,74.13793103448279,4,8675,8675,39.655172413793096,39.655172413793096]
[null,"502:48010","TELARAH 33","SHORT RURAL",1520,24865.835479642701,8152.9740553786296,4.4263129000000001,32438.162820938491,7296.7356878259707,25,940554.0833333336,940130.066666667,427.3684210526315,427.23684210526301,22,211571,211571,40.131578947368403,40.131578947368403]
[null,"504:48026","CESSNOCK 33","SHORT RURAL",1279,31690.652945346199,1502.36146779092,3.9731132999999996,3427.1733334554592,20278.032774043688,14,110706.91666666701,110706.91666666701,109.06958561376101,109.06958561376101,20,655035,632265,163.95621579358834,158.79593432369001]
[null,"504:48027","CESSNOCK 33","URBAN",139,214.32671225380901,1690.92736295029,2.3945314999999998,179.78262228575005,194.78316486750006,1,9636,9636,94.964028776978409,94.964028776978409,1,10440,10440,12.949640287769801,12.949640287769801]
[null,"504:48028","CESSNOCK 33","URBAN",1278,10050.767295350101,727.16277363732604,3.0838518999999995,4962.9231220572692,12821.285171042789,5,206544.51666666701,206544.51666666701,163.77151799686999,163.77151799686999,12,533590,533590,110.48513302034399,110.48513302034399]
[null,"504:48029","CESSNOCK 33","URBAN",259,1771.10583633487,304.91428517410401,0.88926139999999998,136.04477426626167,0,3,19634.599999999999,19634.599999999999,100.77220077220099,100.77220077220099,0,0,0,0,0]
[null,"504:48031","CESSNOCK 33","SHORT RURAL",562,111698.216188518,1182.79620951672,1.8861101,837.98436596585816,3235.7229406161919,24,57021.483333333403,56766.483333333403,124.55516014234851,124.37722419928801,37,220178,204423,119.57295373665443,112.989323843416]
[null,"504:48032","CESSNOCK 33","URBAN",341,1281.9131559489199,669.07829295389399,1.8499303,363.52545848614221,5.2611246927708342,3,25220.233333333301,25220.233333333301,100.58651026392999,100.58651026392999,1,365,365,0.29325513196480901,0.29325513196480901]
[null,"504:48033","CESSNOCK 33","SHORT RURAL",1171,33939.611101368297,1119.39868836807,3.1743014000000001,16545.243692120512,859.35150419754177,16,668951.51666666695,668951.51666666695,317.25021349274101,317.25021349274101,4,34745,34745,10.930828351836,10.930828351836]
[null,"504:48034","CESSNOCK 33","URBAN",1419,5591.3282696973001,256.57802384088899,3.7008126999999997,5610.6090574174123,18397.999904223823,5,194572.98333333299,194572.98333333299,209.302325581395,209.302325581395,6,638033,638033,136.011275546159,136.011275546159]
[null,"507:80914","KURRI KURRI 132 11kV","SHORT RURAL",620,35193.434680742903,4495.5951475718402,3.4285120999999998,461.93053749104985,1928.3640592609249,16,17291.8166666666,17291.8166666666,12.0967741935484,12.0967741935484,11,72186,72186,30.806451612903203,30.806451612903203]
[null,"507:80917","KURRI KURRI 132 11kV","URBAN",1362,6626.1065323084504,1406.9514496054101,3.4466019999999999,805.14729934167133,8377.2124494345826,10,29981.5333333333,29767.583333333299,20.264317180616708,20.190895741556499,7,311945,311945,66.299559471365598,66.299559471365598]
[null,"507:80920","KURRI KURRI 132 11kV","SHORT RURAL",80,1657.4152255521799,130.79355231202501,0.32657029999999998,0.13231539988333335,1.9847309982500001,1,52,52,1.25,1.25,1,780,780,16.25,16.25]
[null,"507:80922","KURRI KURRI 132 11kV","SHORT RURAL",1213,24308.259092781602,1747.00060797681,3.5189615999999999,2107.0124456894346,8771.0378869651995,7,76846.166666666701,76846.166666666701,103.38004946413899,103.38004946413899,15,319894,319894,89.117889530090693,89.117889530090693]
[null,"507:80923","KURRI KURRI 132 11kV","SHORT RURAL",810,12665.895435023,7644.5428141999701,3.8998016,9612.9521057433612,2147.679238144,8,316361.7,316091.7,117.65432098765432,114.32098765432099,3,70680,70680,11.8518518518518,11.8518518518518]
[null,"507:80925","KURRI KURRI 132 11kV","SHORT RURAL",1535,28451.5961411936,789.11169595761999,4.2625517000000004,2565.7035600526237,7561.9279823393181,16,77251.416666666802,77251.416666666802,90.749185667752499,90.749185667752499,22,227684,227684,45.537459283387598,45.537459283387598]
[null,"507:80926","KURRI KURRI 132 11kV","URBAN",44,2638.4081972703798,1434.4229954156999,3.9178915000000001,395.68770235223377,0,6,12961.9333333333,12961.9333333333,106.81818181818198,106.81818181818198,0,0,0,0,0]
[null,"507:80931","KURRI KURRI 132 11kV","URBAN",1084,6576.93229246793,1520.5934775373,3.3923323000000001,82.374645952192807,16412.505800124731,6,3116.4833333332999,3116.4833333332999,2.3985239852398603,2.3985239852398603,8,620935,620935,131.918819188192,131.918819188192]
[null,"507:80932","KURRI KURRI 132 11kV","SHORT RURAL",1176,62234.1717405577,3104.0140053160899,4.3358634,784.31729627700747,6555.0323591197503,10,23215.916666666701,23215.916666666701,13.6904761904762,13.6904761904762,19,194030,194030,50.595238095238102,50.595238095238102]
[null,"508:82574","BRANDY HILL 132","SHORT RURAL",195,33168.481596018202,367.064976201288,1.1063401999999998,923.0921609844869,2401.5541074813746,8,107084.35,107084.35,177.94871794871801,177.94871794871801,23,278595,278595,373.84615384615398,373.84615384615398]
[null,"508:82575","BRANDY HILL 132","SHORT RURAL",396,25043.790659756301,2428.8189067018802,1.8137504999999998,600.33704656548366,1976.1111722061871,9,42480.266666666699,42480.266666666699,155.050505050505,155.050505050505,11,139831,139831,106.56565656565699,106.56565656565699]
[null,"508:82576","BRANDY HILL 132","SHORT RURAL",227,4196.0918798762495,9542.2614622678393,1.1786998,37.314738030991663,0,1,4063,4063,7.4889867841409705,7.4889867841409705,0,0,0,0,0]
[null,"508:82578","BRANDY HILL 132","SHORT RURAL",315,44868.696243782601,842.50443813582694,0.92544119999999996,155.91183215157005,556.0193401785001,12,21622.2,21451.983333333301,109.52380952380932,109.20634920634899,11,77110,75940,68.888888888888843,67.936507936507894]
[null,"508:82579","BRANDY HILL 132","SHORT RURAL",461,69162.648916099803,7346.1535769475404,1.3062811999999999,2388.0626033902709,4859.7410755611663,26,234627.36666666699,234627.36666666699,327.54880694143196,327.54880694143196,56,477470,454700,270.06507592190906,256.832971800434]
[null,"508:82580","BRANDY HILL 132","SHORT RURAL",132,21284.100938679301,374.13354974991699,1.4510003999999999,104.75834543865091,1246.0929045961,16,9265.9666666665998,9081.5333333333001,124.24242424242375,123.484848484848,9,110218,98458,231.81818181818139,189.39393939393901]
[null,"509:33395","PAXTON 33","LONG RURAL",817,253349.63163113699,2163.2825354374299,1.5414498999999999,12009.139050009067,42178.010494485985,53,999889.7,998837.7,585.43451652386852,584.33292533659801,76,3511772,3511772,394.492044063648,394.492044063648]
[null,"509:33397","PAXTON 33","SHORT RURAL",397,24797.478052553299,343.16418531287201,1.0520704999999999,466.94750765460412,86.400413087083322,4,56963,56963,299.74811083123399,299.74811083123399,5,10540,10540,9.5717884130982398,9.5717884130982398]
[null,"509:33399","PAXTON 33","SHORT RURAL",889,68559.857557801501,935.84301808908697,2.3040819999999997,5309.1587413096622,14520.830413995584,18,295731.38333333301,295731.38333333301,419.347581552306,419.347581552306,26,808841,808841,207.19910011248598,207.19910011248598]
[null,"511:29872","RUTHERFORD 33","URBAN",74,3203.7012812040498,1461.86674477565,3.0295821999999997,589.45280669705824,105.79982698395,2,24971,24971,120.27027027027,120.27027027027,1,4482,4482,12.1621621621622,12.1621621621622]
[null,"511:29873","RUTHERFORD 33","SHORT RURAL",1346,3337.9231259473099,8220.6711705444795,5.9858526999999997,77.914066026383125,10817.488091922556,4,1670.55,1670.55,0.297176820208024,0.297176820208024,9,231937,231937,61.664190193164906,61.664190193164906]
[null,"511:29874","RUTHERFORD 33","URBAN",130,1495.4693901154801,1317.7366581466299,2.0860510999999997,278.6554012883667,231.94193749329168,2,17144,1001,108.46153846153845,8.4615384615384599,2,14270,14270,39.230769230769205,39.230769230769205]
[null,"511:29876","RUTHERFORD 33","SHORT RURAL",1348,24683.590401400001,13014.2699298342,4.7167033999999992,1689.3213026274107,12307.535912669251,9,45966.7,45966.7,15.5786350148368,15.5786350148368,11,334890,334890,79.154302670623096,79.154302670623096]
[null,"511:29877","RUTHERFORD 33","SHORT RURAL",1009,35530.487952325697,3104.5851722433699,5.3517541,2740.5020265571902,4148.6418700617915,19,65720.916666666599,65720.916666666599,56.392467789891001,56.392467789891001,23,99490,89250,30.624380574826525,27.452923686818597]
[null,"511:29878","RUTHERFORD 33","SHORT RURAL",1067,149009.95981150499,4062.6479633563699,4.9156922999999999,4561.2924595973309,8172.875283313263,68,119089.33333333371,116754.816666667,91.002811621368195,77.975632614807793,40,213383,213383,62.605435801312105,62.605435801312105]
[null,"511:29880","RUTHERFORD 33","URBAN",836,4086.2546028063698,5371.9914190792597,3.6284530999999998,1317.4389373381289,429.30572002060416,5,46599.216666666704,46599.216666666704,116.387559808612,116.387559808612,2,15185,15185,8.014354066985641,8.014354066985641]
[null,"512:48046","BRANXTON 66","SHORT RURAL",1320,34709.063597530403,899.09656676935799,4.8795124999999997,4157.1940831538586,3105.6257079661459,32,109343.633333333,100245.633333333,39.090909090909101,28.257575757575797,12,81685,81685,22.651515151515198,22.651515151515198]
[null,"512:48048","BRANXTON 66","SHORT RURAL",1357,34960.741966867099,2592.0926398901101,3.5008716999999998,953.4002864716166,3554.1427385346678,29,34951.733333333497,34951.733333333497,13.485630066322802,13.485630066322802,12,130295.16666666701,120845.16666666701,25.128960943257191,23.4340456890199]
[null,"512:48049","BRANXTON 66","SHORT RURAL",932,178508.344317212,1570.1037681087801,3.4285120999999998,2171.9927933957497,4864.3468250752376,58,81305.949999999895,78370.949999999895,41.845493562231781,41.309012875536496,51,182091,181391,77.253218884120216,77.03862660944209]
[null,"513:48050","SINGLETON 66","SHORT RURAL",202,40042.321825337996,2113.27715719363,2.0860510999999997,632.57409210460037,480.70657332614581,18,38918.499999999898,38918.499999999898,224.75247524752498,224.75247524752498,10,29575,25395,68.811881188118804,50]
[null,"513:48051","SINGLETON 66","URBAN",821,3677.1473684022299,1264.5412436568299,4.2625517000000004,3242.943330266357,885.94028973885429,7,97642.6,97642.6,116.56516443361799,116.56516443361799,1,26675,26675,6.6991473812423905,6.6991473812423905]
[null,"513:48052","SINGLETON 66","URBAN",746,3067.7047965032202,1471.2423701401201,2.9020007999999997,3447.9001829071544,3183.6883443199999,8,152484.88333333301,152484.88333333301,199.865951742628,199.865951742628,4,140800,140800,47.453083109919604,47.453083109919604]
[null,"513:48056","SINGLETON 66","SHORT RURAL",417,48617.673814695598,1094.91935581494,2.9020007999999997,2986.945599953011,2839.2711507071999,26,132098.96666666699,132098.96666666699,288.24940047961701,288.24940047961701,16,125568,125568,96.642685851318902,96.642685851318902]
[null,"513:48057","SINGLETON 66","URBAN",351,2758.3231510036799,244.48719840935499,1.5966716999999999,458.50323913143745,0,1,36855,36855,100,100,0,0,0,0,0]
[null,"513:48058","SINGLETON 66","URBAN",514,5022.7562092730004,1858.3021101499601,2.5573405999999999,1247.0925317645685,129.61827553170835,5,62586.366666666603,62586.366666666603,134.63035019455302,134.63035019455302,3,6505,6505,4.4747081712062204,4.4747081712062204]
[null,"513:48059","SINGLETON 66","SHORT RURAL",924,74489.784753530505,941.53888854321804,3.0476720999999998,3040.4303210286266,1137.6921853398749,37,128037.28333333399,128037.28333333399,120.67099567099599,120.67099567099599,25,47910,47910,24.783549783549798,24.783549783549798]
[null,"514:18137","NEWDELL 66","SHORT RURAL",246,90718.522854188806,962.13363114815604,1.8318403999999999,4832.6460162057019,1565.3297565381665,31,338584.433333333,338584.433333333,676.01626016260093,676.01626016260093,21,109670,109670,138.61788617886199,138.61788617886199]
[null,"514:18141","NEWDELL 66","URBAN",7,9096.9193568869505,0,0.30848039999999999,4.0500263182500005,0.34851858525000001,2,1685,1685,171.42857142857099,171.42857142857099,1,145,0,14.285714285714299,0]
[null,"514:18146","NEWDELL 66","SHORT RURAL",5,11504.4773563815,553.27565964621101,1.9594217999999997,49.404534694899993,73.28237532,3,3236,3236,240,240,3,4800,4800,240,240]
[null,"514:18160","NEWDELL 66","HV CUSTOMERS",2,2393.1890802437601,728.24099350016104,5.4269699999999997E-2,8.8798796624999995E-2,0.43976546900000002,1,210,210,100,100,1,1040,1040,100,100]
[null,"515:35192","MT THORLEY 66","SHORT RURAL",339,88150.691914837094,823.373314279488,1.8680201999999999,675.31324149775651,3086.3130082826247,24,46397.366666666603,46397.366666666603,119.17404129793501,119.17404129793501,22,212045,208265,144.24778761061972,138.05309734513301]
[null,"515:35193","MT THORLEY 66","SHORT RURAL",146,43375.189736927998,442.38567393594298,0.99780079999999993,693.4123843338092,245.60521619223334,24,89190.250000000102,89190.250000000102,492.46575342465701,492.46575342465701,19,31591,31591,97.945205479452099,97.945205479452099]
[null,"515:35197","MT THORLEY 66","LONG RURAL",537,225910.14514841599,493.01536431123702,1.723301,4839.9891309362565,2189.5905639084585,47,360456.51666666626,265902.98333333299,401.48975791433816,382.49534450651697,41,163069,163069,102.420856610801,102.420856610801]
[null,"515:35198","MT THORLEY 66","SHORT RURAL",71,24269.189865771801,141.23169216283799,0.96162099999999995,65.151916946844693,22.702669783750004,7,8695.4666666666999,8413.4666666666999,121.1267605633807,118.30985915493,6,3030,3030,19.7183098591549,19.7183098591549]
[null,"515:35200","MT THORLEY 66","URBAN",73,6460.7332067346397,1021.8718993375199,3.3380625999999998,241.8128362069979,0,4,9297.25,9297.25,126.02739726027401,126.02739726027401,0,0,0,0,0]
[null,"516:48065","LEMINGTON 66","SHORT RURAL",40,31224.964515992098,93.867914469274297,0.5446011999999999,588.24995219410914,59.326290564016659,11,138628.63333333301,138628.63333333301,550,550,6,13981,13981,167.5,167.5]
[null,"516:48066","LEMINGTON 66","SHORT RURAL",94,45659.138829013202,354.70463254785801,0.7978597999999999,367.71405420139507,219.44801357416671,12,59149.8,58549.8,230.85106382978725,224.468085106383,16,35300,35300,129.787234042553,129.787234042553]
[null,"516:48067","LEMINGTON 66","SHORT RURAL",281,79169.907669208595,27.625434241607302,1.6690312999999999,7943.2925540291308,946.10597003046666,28,610809.4,610809.4,284.34163701067598,284.34163701067598,26,72752,68462,90.747330960854043,86.120996441281093]
[null,"520:48172","MITCHELLS FLAT 66","SHORT RURAL",415,183547.84505269999,0,1.3424609999999999,1428.1978973145319,1623.5711587466251,54,136538.88333333301,136538.88333333301,271.084337349397,271.084337349397,49,155217,137097,118.31325301204789,103.61445783132498]
[null,"523:33500","SINGLETON NORTH 66","URBAN",210,0,2891.79857936588,0.76168000000000002,131.60965840305536,0,2,22176.083333333299,22176.083333333299,100.47619047619001,100.47619047619001,0,0,0,0,0]
[null,"523:33501","SINGLETON NORTH 66","SHORT RURAL",727,149749.34057119701,964.94754369927,3.0838518999999995,8455.7527862220413,2549.8159982300044,60,351907.39999999956,351520.53333333298,315.68088033012339,315.40577716643702,34,106117,106117,51.306740027510301,51.306740027510301]
[null,"523:33503","SINGLETON NORTH 66","URBAN",774,1464.7067536442801,4218.7571425023298,2.2307702999999997,1478.3585971606058,761.4799483183748,3,85053.966666666704,85053.966666666704,106.71834625323,106.71834625323,3,43810,43810,29.586563307493503,29.586563307493503]
[null,"523:33505","SINGLETON NORTH 66","URBAN",858,146.48373983488,7296.52070061616,3.6284530999999998,3412.1111194788746,3110.3107532477288,2,120690,120690,107.925407925408,107.925407925408,9,110015,110015,69.230769230769198,69.230769230769198]
[null,"523:33507","SINGLETON NORTH 66","URBAN",569,0,6320.8158017569804,2.1403208,1618.4940832221646,759.2886136036667,3,97051.416666666701,97051.416666666701,199.82425307557099,199.82425307557099,4,45530,45530,42.0035149384886,42.0035149384886]
[null,"523:33508","SINGLETON NORTH 66","SHORT RURAL",492,32115.156471711201,2631.7473276736,2.9753124999999998,1693.4410860755208,498.79775171875002,20,73047.8,72937.8,128.45528455284565,128.048780487805,16,21516,21516,25.8130081300813,25.8130081300813]
[null,"523:33509","SINGLETON NORTH 66","URBAN",463,1787.93477018918,2983.98459692496,1.6328514999999999,621.10290603825104,260.1397097513958,4,48818.733333333301,48818.733333333301,100.647948164147,100.647948164147,2,20447,20447,18.358531317494599,18.358531317494599]
[null,"523:33511","SINGLETON NORTH 66","URBAN",232,0,2209.4951500664602,0.74359010000000003,139.920419629375,65.006505517250005,1,24150,24150,99.13793103448279,99.13793103448279,1,11220,11220,28.448275862069,28.448275862069]
[null,"524:33570","NULKABA 33","SHORT RURAL",1306,17494.342972400798,1318.1752070499001,3.5008716999999998,883.66276418215364,3901.2459745774167,12,32395.15,32395.15,16.309341500765701,16.309341500765701,9,143020,143020,58.728943338438,58.728943338438]
[null,"524:33572","NULKABA 33","SHORT RURAL",1603,27709.881592893202,10689.919024995799,7.2921338999999996,1254.8029192823644,1760.6155433662127,7,22084.65,22084.65,12.788521522146002,12.788521522146002,7,30987,5527,6.7997504678727392,2.0586400499064301]
[null,"524:33576","NULKABA 33","SHORT RURAL",173,26177.724890037502,3365.2520527246102,2.6668321000000001,319.94394914332122,912.36726413965016,15,15397.416666666701,15397.416666666701,131.791907514451,131.791907514451,8,43908,43643,65.31791907514453,64.739884393063591]
[null,"524:33578","NULKABA 33","URBAN",1365,7486.9733489504097,2135.1652195904999,4.3720431999999994,830.5118598158432,758.77501976173323,9,24379.85,24379.85,16.776556776556799,16.776556776556799,1,22274,22274,6.3003663003663002,6.3003663003663002]
[null,"524:33580","NULKABA 33","SHORT RURAL",147,17828.164971811399,1597.36352048085,1.8680201999999999,774.13920268872005,438.76019540512499,9,53187.199999999997,53187.199999999997,127.21088435374099,127.21088435374099,8,30145,30145,63.945578231292501,63.945578231292501]
[null,"525:34580","TOMALPIN 33","URBAN",2,0.89951735053758497,2673.4048877213199,3.6179799999999998E-2,0.10317574465,0,1,366,366,100,100,0,0,0,0,0]
[null,"525:34586","TOMALPIN 33","SHORT RURAL",2,421.43087096801202,2041.3765237908499,0.18185109999999999,0.51859387442500005,0,1,366,366,100,100,0,0,0,0,0]
[null,"526:34633","ROTHBURY 132 11KV","URBAN",113,17562.186289725701,18128.148420637499,0.65314059999999996,1.221372922,85.190761309500004,1,240,240,0.88495575221238898,0.88495575221238898,6,16740,16740,38.938053097345097,38.938053097345097]
[null,"526:34635","ROTHBURY 132 11KV","SHORT RURAL",31,10838.617652840399,1625.5748954798401,0.18185109999999999,0.60927695629166678,1.3106539176041667,2,430,430,12.903225806451598,12.903225806451598,5,925,925,25.806451612903196,25.806451612903196]
[null,"526:34636","ROTHBURY 132 11KV","SHORT RURAL",128,33732.021781540403,589.87889389726104,1.6690312999999999,26.884276333901251,77.051873109062484,4,2067.3000000000002,2067.3000000000002,6.25,6.25,5,5925,5925,14.0625,14.0625]
[null,"526:34637","ROTHBURY 132 11KV","SHORT RURAL",157,38485.333994440101,3355.7887827600498,1.4690902999999997,324.59966930852534,155.96076867135417,10,28357.583333333398,27784.266666666699,192.35668789808923,191.71974522293002,8,13625,13625,42.038216560509603,42.038216560509603]
[null,"526:34639","ROTHBURY 132 11KV","SHORT RURAL",258,51759.997468130903,813.61260758204901,1.2881912999999998,5189.8725639525674,597.28111424423741,32,517065.98333333299,511665.98333333299,517.44186046511641,516.27906976744202,28,59507,59507,86.046511627906995,86.046511627906995]
[null,"526:34640","ROTHBURY 132 11KV","SHORT RURAL",162,41285.322062931496,4564.2411981661498,3.5551413999999997,1393.4249300044676,1558.1518167187501,13,50303.283333333296,50303.283333333296,285.18518518518499,285.18518518518499,23,56250,56250,110.49382716049401,110.49382716049401]
[null,"526:34641","ROTHBURY 132 11KV","SHORT RURAL",137,8915.8667288435208,151.03800349718699,0.50746930000000001,0,108.10322474141667,0,0,0,0,0,8,27340,27135,54.744525547445264,54.014598540145997]
[null,"526:34643","ROTHBURY 132 11KV","SHORT RURAL",354,991.09490822868895,7153.9119740010501,1.7052110999999999,0,161.96166078262499,0,0,0,0,0,1,12190,12190,14.971751412429398,14.971751412429398]
[null,"526:34644","ROTHBURY 132 11KV","SHORT RURAL",2,1376.2207601232601,968.76412808405905,0.18185109999999999,0.85903327759949166,0.17003077850000001,3,606.26666666669996,534.26666666669996,150,100,1,120,120,50,50]
[null,"528:83011","MAITLAND 33","SHORT RURAL",330,6713.3827111436303,552.06508490364899,1.1786998,656.13293683877134,196.17100771400001,5,71442.766666666605,71442.766666666605,199.09090909090901,199.09090909090901,6,21360,21360,25.454545454545503,25.454545454545503]
[null,"528:83013","MAITLAND 33","URBAN",1200,4065.66285704753,7475.7364796173497,6.4038245999999992,5682.0158603367618,147.44405902462501,4,113876.116666667,113876.116666667,99.4166666666667,99.4166666666667,2,2955,2955,1.7500000000000002,1.7500000000000002]
[null,"528:83014","MAITLAND 33","SHORT RURAL",1380,17583.640310062801,6591.9756858035598,4.6805235999999999,2235.0482742415984,4913.9756975286546,20,61286.116666666603,61162.299999999901,16.44927536231884,16.376811594202898,14,134743.61666666699,134743.61666666699,51.4492753623189,51.4492753623189]
[null,"528:83017","MAITLAND 33","URBAN",69,0,571.70591692290998,0.85212949999999998,0,21.910379768749998,0,0,0,0,0,1,3300,3300,47.826086956521699,47.826086956521699]
[null,"528:83019","MAITLAND 33","SHORT RURAL",1214,37230.501260224097,10555.0772881344,4.2806416,17238.286877962186,5115.7674870698002,28,516838.51666666701,516838.51666666701,175.04118616144999,175.04118616144999,20,153381,144381,38.879736408566721,37.2322899505766]
[null,"528:83020","MAITLAND 33","SHORT RURAL",959,16147.8194229446,2862.7377412691699,5.5869228,7831.2117648646754,3684.3704999755505,5,179897.83333333331,1263.8333333333001,55.995828988529681,1.0427528675703899,9,84637,84637,19.9165797705943,19.9165797705943]
[null,"528:83022","MAITLAND 33","URBAN",278,0,1236.9390528635099,2.5944724999999997,0,28.402447178645833,0,0,0,0,0,2,1405,1405,10.791366906474801,10.791366906474801]
[null,"528:83024","MAITLAND 33","URBAN",751,4094.4194906766202,1524.01265629054,3.5008716999999998,1493.3308744746059,5050.3432191938919,9,54745.633333333397,54745.633333333397,207.05725699067901,207.05725699067901,4,185146,185146,60.985352862849496,60.985352862849496]
[null,"532:83293","METFORD 33","URBAN",2059,8629.3691529383395,2910.22496609778,5.8954031999999996,13049.259326075733,17097.5184637026,12,284080.86666666699,284080.86666666699,302.525497814473,302.525497814473,16,372211,355831,58.717824186498326,55.658086449732899]
[null,"532:83295","METFORD 33","URBAN",645,519.058608927352,5708.2927526827398,3.6465429999999999,2512.0511954543804,886.6734918327918,4,88413.133333333302,88413.133333333302,103.255813953488,103.255813953488,3,31207,31207,25.116279069767401,25.116279069767401]
[null,"532:83298","METFORD 33","URBAN",262,2551.0063171604802,514.84556603761496,1.0158906999999999,5.1789677543409169,1606.169970000979,2,654.28333333329999,654.28333333329999,0.76335877862595403,0.76335877862595403,10,202915,202915,206.106870229008,206.106870229008]
[null,"532:83300","METFORD 33","URBAN",513,0,3577.1218619317801,1.6328514999999999,901.30833099951997,0,5,70842.900000000096,70842.900000000096,184.210526315789,184.210526315789,0,0,0,0,0]
[null,"532:83301","METFORD 33","URBAN",1023,4089.3913746719099,1681.42642919594,3.7369924999999995,9349.6888263617566,4325.3897545260415,8,321103.15000000002,321103.15000000002,312.31671554252199,312.31671554252199,2,148550,148550,36.168132942326494,36.168132942326494]
[null,"532:83306","METFORD 33","URBAN",75,0,1220.81310186325,1.1606099000000001,131.71208772841399,4.1146038892291674,3,14564.95,14564.95,210.666666666667,210.666666666667,1,455,455,9.3333333333333304,9.3333333333333304]
[null,"532:83307","METFORD 33","SHORT RURAL",1157,10568.3493564783,9974.0577187600193,5.5326530999999992,7781.9358552637632,6240.8303915278748,13,180519.38333333301,180519.38333333301,216.50821089023302,216.50821089023302,6,144770,144770,41.6594641313742,41.6594641313742]
[null,"532:83309","METFORD 33","SHORT RURAL",1852,24932.216966655898,4218.2630060293604,6.8389342999999991,45510.621210725927,244.31950308952082,25,854070.98333333305,854070.98333333305,389.95680345572401,389.95680345572401,2,4585,4585,0.91792656587473009,0.91792656587473009]
[null,"532:83312","METFORD 33","URBAN",480,52.622231105627399,4222.3466555040904,2.9572225999999997,1478.173362030089,1357.9621627123749,4,64152.116666666698,64152.116666666698,106.45833333333302,106.45833333333302,4,58935,58935,56.6666666666667,56.6666666666667]
[null,"532:83314","METFORD 33","URBAN",993,4002.2386434098999,1607.15044932364,3.1923913000000002,7711.5471549049917,2923.820075501646,9,310023.8,310023.8,340.78549848942703,340.78549848942703,2,117545,117545,22.860020140986901,22.860020140986901]
[null,"801:74117","MUSWELLBROOK 33","SHORT RURAL",19,1924.8481775615401,62.678696022576297,0.1266293,0,5.7719217806250009,0,0,0,0,0,1,5850,5850,78.947368421052602,78.947368421052602]
[null,"801:74118","MUSWELLBROOK 33","URBAN",794,3991.1567149982202,2850.33418729302,3.6465429999999999,4767.8842385398875,1276.8643805225004,11,167808.51666666631,167599.78333333301,215.61712846347686,215.491183879094,3,44940,44940,13.8539042821159,13.8539042821159]
[null,"801:74119","MUSWELLBROOK 33","URBAN",656,0,6735.2919369372003,2.4849809999999999,1.4382845689431047,294.3045831,1,74.283333333300007,74.283333333300007,0.15243902439024398,0.15243902439024398,1,15200,15200,5.7926829268292703,5.7926829268292703]
[null,"801:74120","MUSWELLBROOK 33","SHORT RURAL",614,3600.7343359625302,3353.1570425573,2.0679612000000001,19.709524220658093,115.04585145900002,4,1223.2166666666001,1017.3833333333,1.9543973941368111,1.79153094462541,1,7140,7140,5.5374592833876202,5.5374592833876202]
[null,"801:74121","MUSWELLBROOK 33","SHORT RURAL",483,199576.048497526,1964.46098091369,1.6328514999999999,915.69678256118948,1528.6245476906249,37,71973.833333333212,71617.149999999907,102.69151138716335,102.070393374741,36,120150,116670,95.859213250517655,93.374741200828197]
[null,"801:74122","MUSWELLBROOK 33","URBAN",1137,5716.0458106141396,2821.4775955351301,4.1540122999999998,507.29429098218066,4982.0087246913499,9,15673.35,15673.35,12.049252418645599,12.049252418645599,5,153924,153924,37.9947229551451,37.9947229551451]
[null,"801:74123","MUSWELLBROOK 33","SHORT RURAL",278,77472.334354739607,154.74906229590499,0.81594969999999989,153.39371873076615,630.1788280231583,17,24127.583333333201,24127.583333333201,71.582733812949598,71.582733812949598,21,99122,99122,117.62589928057601,117.62589928057601]
[null,"802:82215","BAERAMI 33","SHORT RURAL",36,26813.949833317602,0,0.30848039999999999,1.2835098243,11.527552654200001,3,534,534,11.1111111111111,11.1111111111111,6,4796,4796,66.6666666666667,66.6666666666667]
[null,"802:82220","BAERAMI 33","SHORT RURAL",63,34463.629147721702,0,0.2180309,54.464442081091264,63.045061020470833,8,32060.083333333299,32060.083333333299,134.920634920635,134.920634920635,6,37111,37111,201.58730158730199,201.58730158730199]
[null,"802:82225","BAERAMI 33","SHORT RURAL",107,94521.817077504107,1215.9218843646599,0.4170198,53.945888389914366,673.07520469915005,9,16602.416666666599,16602.416666666599,87.850467289719603,87.850467289719603,9,207146,207146,505.60747663551302,505.60747663551302]
[null,"806:82662","MOONAN 33","SHORT RURAL",229,186596.26861967999,642.44547783239796,0.90735129999999986,541.0489993261441,952.73754131425824,31,76529.833333333198,76529.833333333198,209.170305676856,209.170305676856,49,134762,134632,226.20087336244544,225.76419213973801]
[null,"806:82667","MOONAN 33","SHORT RURAL",40,37400.048202655198,0,0.36275009999999996,16.455463015475001,36.729430073187501,2,5822,5822,105,105,8,12995,11135,195,165]
[null,"807:74179","DENMAN 66","SHORT RURAL",135,56575.636306603999,1399.5020775104999,0.83403959999999999,472.59207400823067,199.51874460210001,19,72722.600000000093,72722.600000000093,245.92592592592601,245.92592592592601,16,30702,30702,114.07407407407399,114.07407407407399]
[null,"807:74180","DENMAN 66","SHORT RURAL",111,59998.901363261,885.95741066449398,0.38084000000000001,13.388118651722619,150.27990831333335,7,4511.7666666668001,4511.7666666668001,16.2162162162162,16.2162162162162,14,50644,46069,141.4414414414415,127.927927927928]
[null,"807:74181","DENMAN 66","SHORT RURAL",711,14891.7992911124,1497.3971804735299,1.8499303,515.26806609186258,1994.744616733871,12,35747.650000000103,35538.4333333334,125.59774964838302,125.31645569620299,5,138389,138389,51.054852320675103,51.054852320675103]
[null,"807:74183","DENMAN 66","SHORT RURAL",88,23772.769994767099,474.25246873118198,0.99780079999999993,40.06928609899748,170.12229244780002,11,5153.9166666666997,5153.9166666666997,23.863636363636402,23.863636363636402,13,21882,21496,122.72727272727226,120.454545454545]
[null,"807:74184","DENMAN 66","SHORT RURAL",499,164432.57488200499,1451.06587884685,1.9413319,1087.084233452912,2842.4116978216211,40,71867.583333333401,71867.583333333401,74.749498997996,74.749498997996,48,187913,186023,128.85771543086145,127.454909819639]
[null,"810:74050","MERRIWA 33","SHORT RURAL",138,102214.312577905,0,0.56269109999999989,123.24987583938818,1039.8291680918624,13,28111.633333333401,27894.1000000001,143.47826086956545,142.75362318840601,16,237171,237171,536.95652173913004,536.95652173913004]
[null,"810:74054","MERRIWA 33","LONG RURAL",326,328357.96159005299,0,0.70741029999999994,342.601565716398,3829.3410562797499,37,62156.6499999999,61876.266666666597,65.950920245398777,65.644171779141104,44,694740,677145,627.9141104294481,612.26993865030704]
[null,"810:74058","MERRIWA 33","SHORT RURAL",203,124024.25760316,0,0.4170198,114.90935353935596,993.0804740975251,26,35364.566666666702,35364.566666666702,93.103448275862092,93.103448275862092,24,305631,305631,484.23645320197102,484.23645320197102]
[null,"810:74062","MERRIWA 33","SHORT RURAL",576,11754.100845680299,193.51455966966,1.6509414,57.387240129675007,10028.322288619249,9,4461.2166666666999,4461.2166666666999,25.520833333333297,25.520833333333297,4,779590,779590,400.34722222222194,400.34722222222194]
[null,"811:74234","ROUCHEL 33","SHORT RURAL",261,115512.429933527,522.35006666260904,1.2339216,755.57082683312967,872.59439440800008,23,78588.183333333305,68362.183333333305,160.15325670498129,155.555555555556,19,90760,90760,96.551724137931103,96.551724137931103]
[null,"812:19065","MITCHELL LINE 66","SHORT RURAL",140,10149.1472958136,4370.33525650929,2.0498713,5.758673549133543,199.0899065038125,2,360.55,360.55,2.1428571428571401,2.1428571428571401,3,12465,12465,31.428571428571399,31.428571428571399]
[null,"812:19066","MITCHELL LINE 66","SHORT RURAL",1822,6190.4470491950897,25040.799721166299,5.9858526999999997,8654.2089031226296,7743.3210008465667,7,185554.28333333301,185554.28333333301,100.10976948408302,100.10976948408302,30,166024,143824,43.578485181119639,40.285400658616901]
[null,"812:19071","MITCHELL LINE 66","SHORT RURAL",835,14017.0229653275,3840.2057914289499,2.1765005999999998,1099.2172980785019,1012.9897674204967,15,64817.816666666702,64817.816666666702,80.239520958083801,80.239520958083801,9,59733.216666666704,59733.216666666704,27.305389221556904,27.305389221556904]
[null,"812:19072","MITCHELL LINE 66","SHORT RURAL",208,114640.882212556,1236.8535318767399,2.0498713,1367.0872190422867,448.26374195422187,35,85593.199999999895,68383.199999999895,194.23076923076908,133.65384615384599,21,28065.75,27351.75,58.173076923076948,55.769230769230802]
[null,"813:89055","SCONE 66","SHORT RURAL",593,140628.64208016099,1294.33181380619,4.8976024000000002,920.28208115107009,5432.4885363133017,24,24116.1,23668.1,34.907251264755537,34.738617200674597,41,142359,142359,93.929173693086,93.929173693086]
[null,"813:89058","SCONE 66","SHORT RURAL",14,11408.5035886734,430.023432144303,9.0449500000000002E-2,3.8371768886038433,0,3,5444.7166666666999,114.71666666669999,114.28571428571431,14.285714285714299,0,0,0,0,0]
[null,"813:89059","SCONE 66","URBAN",288,1605.13614591652,853.58549258405196,2.2859920999999996,773.12791458888569,0,5,43405.65,43405.65,301.04166666666703,301.04166666666703,0,0,0,0,0]
[null,"813:89061","SCONE 66","LONG RURAL",641,309715.46131378203,3410.5861769923099,2.2859920999999996,2848.7391091170225,5303.839903581129,52,159936.5,159936.5,83.6193447737909,83.6193447737909,57,297773,295710,158.19032761310413,156.630265210608]
[null,"813:89062","SCONE 66","SHORT RURAL",831,135761.517829299,2740.7707517222598,2.6487422,1065.4341552025815,1768.3150815306169,38,51624.583333333401,47102.583333333401,59.927797833934981,53.429602888086606,17,85682,85682,35.138387484957903,35.138387484957903]
[null,"813:89063","SCONE 66","SHORT RURAL",1027,8613.5652140177299,5418.6590349087601,2.9020007999999997,121.65058577314953,984.04912460800006,11,5380.0500000002003,5380.0500000002003,3.8948393378773196,3.8948393378773196,7,43520,43520,19.961051606621201,19.961051606621201]
[null,"813:89065","SCONE 66","URBAN",691,6871.5231775932898,3825.2681230983399,2.8477310999999998,139.84827932379179,1450.2450324230001,3,6302.7166666666999,6302.7166666666999,3.32850940665702,3.32850940665702,4,65360,65360,25.470332850940704,25.470332850940704]
[null,"814:82283","ABERDEEN 66","SHORT RURAL",181,74081.307716085706,279.66148638627902,0.83403959999999999,813.3816832170728,202.90449360665008,22,125163.4000000004,16243.333333333399,170.7182320441988,54.1436464088398,17,31223,31223,73.480662983425404,73.480662983425404]
[null,"814:82285","ABERDEEN 66","SHORT RURAL",156,48565.305009842203,294.55791847669099,0.88926139999999998,42.138824770014118,134.28069455350001,12,6081.6666666666997,4615.6666666666997,17.307692307692278,16.025641025641001,12,19380,19380,59.615384615384606,59.615384615384606]
[null,"814:82289","ABERDEEN 66","SHORT RURAL",667,53450.495420183797,2609.9790646431902,2.6849219999999998,619.1571985378979,2207.7940204787501,39,29596.3999999999,29311.3999999999,32.233883058470781,31.784107946027003,21,105535,94735,78.860569715142375,74.362818590704606]
[null,"814:82291","ABERDEEN 66","SHORT RURAL",465,16513.040043610501,5453.7273395014299,1.5414498999999999,834.11610195634842,293.655840011875,11,69449.116666666698,63521.133333333397,113.76344086021473,113.333333333333,3,24450,24450,17.204301075268798,17.204301075268798]
[null,"ZN1068:PA11","LIDCOMBE","URBAN",64,0,1544.8175966025599,1.6690312999999999,8.2448755360583323,0.78027213274999996,2,634,634,3.125,3.125,1,60,60,1.5625,1.5625]
[null,"ZN1068:PA16","LIDCOMBE","URBAN",677,0.89378019292786304,4320.2920522464901,1.4148205999999999,566.05319420435274,35.717146047,7,51348.233333333403,51348.233333333403,100.886262924668,100.886262924668,1,3240,3240,0.886262924667651,0.886262924667651]
[null,"ZN1068:PA17","LIDCOMBE","URBAN",868,0,5860.10623699813,3.4104221999999997,1455.9241672505207,418.52274935624996,6,54789.866666666698,54789.866666666698,34.562211981566797,34.562211981566797,1,15750,15750,4.0322580645161299,4.0322580645161299]
[null,"ZN1068:PA18","LIDCOMBE","URBAN",555,0,2850.5724466987099,2.7391916999999997,684.99830257950441,0,5,32094.95,32094.95,8.4684684684684601,8.4684684684684601,0,0,0,0,0]
[null,"ZN1068:PA20","LIDCOMBE","URBAN",317,0,1009.91389887436,1.7775706999999998,1737.0818920450195,0,1,125418.91666666701,0,26.813880126182998,0,0,0,0,0,0]
[null,"ZN1068:PA21","LIDCOMBE","URBAN",171,0,4766.35013624977,1.7775706999999998,427.84771351341249,0,8,30891,30891,69.005847953216303,69.005847953216303,0,0,0,0,0]
[null,"ZN1068:PA22","LIDCOMBE","URBAN",427,0,2026.6617241910801,1.0520704999999999,9.4432481849556282,259.69308221999995,1,1151.9833333332999,0,0.23419203747072601,0,1,31680,31680,15.456674473067899,15.456674473067899]
[null,"ZN1068:PA26","LIDCOMBE","URBAN",1813,0,5093.3954343987698,5.2965322999999991,4232.5791039376836,1414.2822616344581,10,102561.20000000029,101678.21666666699,25.427468284611184,25.317153888582499,2,34270,34270,5.2950910093767307,5.2950910093767307]
[null,"ZN1068:PA27","LIDCOMBE","URBAN",1465,0,5609.5832295733599,3.9912031999999997,749.12273151906663,357.00647423466665,2,24089,24089,7.9863481228669002,7.9863481228669002,1,11480,11480,1.9112627986348101,1.9112627986348101]
[null,"ZN1068:PA29","LIDCOMBE","URBAN",132,0,2885.81657125313,1.0882502999999999,72.353726852137484,0,2,8533,8533,94.696969696969703,94.696969696969703,0,0,0,0,0]
[null,"ZN10990:PA1","ARNCLIFFE","URBAN",1260,2989.0649749164099,1085.0109457926101,2.4307113,5389.7248385410385,0,5,284579,224840.75,114.60317460317455,111.031746031746,0,0,0,0,0]
[null,"ZN10990:PA11","ARNCLIFFE","URBAN",2026,6902.1749171858901,1527.72376162452,4.6072119000000002,54223.257112218482,1027.3967356702501,22,1510487.1999999969,1180017.9833333299,483.90918065153016,390.37512339585396,1,28620,28620,2.6159921026653503,2.6159921026653503]
[null,"ZN10990:PA12","ARNCLIFFE","URBAN",735,1860.99190423856,1462.0763617597199,1.723301,2228.6530704680813,0,3,165978.16666666701,165978.16666666701,189.11564625850298,189.11564625850298,0,0,0,0,0]
[null,"ZN10990:PA2","ARNCLIFFE","SHORT RURAL",2531,2874.0776112230401,5444.8107508676303,3.2837928999999995,19896.252949160884,189.84975001941663,9,777615.96666666702,777615.96666666702,249.901224812327,249.901224812327,1,7420,7420,1.1062821019359899,1.1062821019359899]
[null,"ZN10990:PA5","ARNCLIFFE","URBAN",691,888.49398364534295,1624.43428651042,1.8680201999999999,1286.1517554146251,58.074412992749998,1,88365,88365,93.342981186686004,93.342981186686004,1,3990,3990,1.01302460202605,1.01302460202605]
[null,"ZN10990:PA6","ARNCLIFFE","URBAN",1117,1715.3412008237301,855.99855082459499,1.723301,5881.214286091742,0,7,438001.4,403568.4,221.7547000895261,214.05550581915901,0,0,0,0,0]
[null,"ZN10990:PA7","ARNCLIFFE","URBAN",1076,1801.6085082951499,2193.16399096538,1.9775116999999998,2166.5454134125221,0,6,140610.70000000001,139410.45000000001,92.750929368029759,92.565055762081812,0,0,0,0,0]
[null,"ZN10990:PA8","ARNCLIFFE","URBAN",1882,2049.2303539069999,2332.0607275525699,2.8296411999999997,14115.814077333753,0,4,640242.05000000005,640242.05000000005,188.41657810839502,188.41657810839502,0,0,0,0,0]
[null,"ZN10991:PA1","BLAKEHURST","URBAN",1527,5846.0862241533896,1863.0110118951,4.0997425999999999,7031.4546026762791,651.65408627000011,14,220119.34999999963,197927.13333333301,128.22527832351014,126.981008513425,1,20400,20400,4.4531761624099495,4.4531761624099495]
[null,"ZN10991:PA12","BLAKEHURST","URBAN",1237,3548.1565049825099,3223.1673877765102,4.3720431999999994,24453.468448783216,55.18611529199999,10,717836.7,170452.95,300.97008892481904,200.72756669361399,1,1620,1620,0.323362974939369,0.323362974939369]
[null,"ZN10991:PA13","BLAKEHURST","URBAN",1134,2630.7244061364099,1101.1707002094799,2.6668321000000001,7041.2215815752306,1009.8626454675001,6,338861.3,338861.3,306.52557319224002,306.52557319224002,1,48600,48600,7.1428571428571397,7.1428571428571397]
[null,"ZN10991:PA5","BLAKEHURST","URBAN",1511,643.72956553173401,1936.3389549317001,2.7030118999999999,1319.3959143231855,483.34920919312503,8,62646.5,8205.4,12.97154202514891,4.1032428855062895,1,22950,22950,2.9781601588352102,2.9781601588352102]
[null,"ZN10991:PA6","BLAKEHURST","URBAN",1380,752.39428875477097,2443.8496789990299,1.8861101,28.172119272412505,6.1722953022500011,1,1917,1917,5.1449275362318803,5.1449275362318803,1,420,420,7.2463768115942004E-2,7.2463768115942004E-2]
[null,"ZN10991:PA7","BLAKEHURST","URBAN",1611,1502.3260494838,1770.7880247072201,2.4668911000000002,1583.0792521960743,0,3,82361.133333333302,82361.133333333302,8.7523277467411607,8.7523277467411607,0,0,0,0,0]
[null,"ZN10991:PA8","BLAKEHURST","URBAN",1818,4413.0768374920899,2643.5678653079599,3.6646329,8780.2951585459687,0,4,307502.23333333299,306320.23333333299,104.07040704070418,103.90539053905401,0,0,0,0,0]
[null,"ZN10993:PA22","HURSTVILLE NORTH","URBAN",1154,2121.5325196516701,1221.6455916576499,2.7934614,32.117133780668027,0,2,1475.5833333333001,194.95,0.34662045060658542,0.25996533795493904,0,0,0,0,0]
[null,"ZN10993:PA23","HURSTVILLE NORTH","URBAN",1614,4376.55333986607,1587.89160985289,4.1901921,5298.0983989121005,5.8767444202500014,4,162276.53333333301,162276.53333333301,99.938042131350699,99.938042131350699,1,180,180,6.1957868649318494E-2,6.1957868649318494E-2]
[null,"ZN10993:PA26","HURSTVILLE NORTH","URBAN",734,0,3439.6691092011201,3.3561524999999999,27.143722381875005,547.84295173437511,2,1038,1038,0.95367847411444095,0.95367847411444095,2,20950,20950,5.4495912806539506,5.4495912806539506]
[null,"ZN10993:PA27","HURSTVILLE NORTH","URBAN",933,1415.4824282417201,1469.7951082464101,2.1584106999999997,1232.7615761254842,915.71922954187494,4,73301.8,73301.8,35.905680600214403,35.905680600214403,1,54450,54450,12.968917470525202,12.968917470525202]
[null,"ZN10993:PA33","HURSTVILLE NORTH","URBAN",700,2838.9100001100401,1618.72455417063,3.1562114999999999,935.95501756810643,9.7138984353125011,4,38059.1,36257,105.5714285714283,105.28571428571401,1,395,395,0.14285714285714302,0.14285714285714302]
[null,"ZN10993:PA34","HURSTVILLE NORTH","URBAN",892,0,2885.51819882683,3.7731722999999997,65.090052054224998,202.56118277037498,1,2214,2214,4.5964125560538101,4.5964125560538101,1,6890,6890,1.4573991031390101,1.4573991031390101]
[null,"ZN10993:PA35","HURSTVILLE NORTH","URBAN",816,2850.0802028968101,1685.2181245710699,5.3517541,4882.7125453112412,0,3,117094,66750,113.8480392156863,14.338235294117698,0,0,0,0,0]
[null,"ZN10993:PA39","HURSTVILLE NORTH","URBAN",812,1064.7030132990501,1487.0917852222501,1.6871212,907.04905153881339,0,7,69000.800000000003,68433.466666666704,126.97044334975322,126.72413793103401,0,0,0,0,0]
[null,"ZN10993:PA43","HURSTVILLE NORTH","SHORT RURAL",233,997.64111343358195,395.742393555658,0.48937939999999996,8.7102848413335963,0,3,2284.3166666666998,2284.3166666666998,3.8626609442060102,3.8626609442060102,0,0,0,0,0]
[null,"ZN10994:PA1","MORTDALE","URBAN",1019,2614.6229210285601,2070.2509215842301,2.6849219999999998,15501.7237169092,0,11,740999.566666667,53369.65,129.63689892051019,29.5387634936212,0,0,0,0,0]
[null,"ZN10994:PA10","MORTDALE","URBAN",1104,4837.6156646279996,3270.1788187444599,3.1200316999999997,88.281446453021374,0,4,3631.4500000000999,3631.4500000000999,2.6268115942029002,2.6268115942029002,0,0,0,0,0]
[null,"ZN10994:PA11","MORTDALE","URBAN",735,4319.3574708175502,1279.8964667948001,2.4849809999999999,107.34598317375689,0,5,5544.1166666666995,1152.3666666667,0.68027210884353695,0.27210884353741499,0,0,0,0,0]
[null,"ZN10994:PA12","MORTDALE","URBAN",2077,2428.5746955213499,5632.4743490051796,3.9540712999999994,78.273364849834522,2221.3148798545831,4,2540.6166666665999,2251.6166666665999,0.24073182474723129,0.19258545979778499,4,72100,72100,7.6071256620125203,7.6071256620125203]
[null,"ZN10994:PA13","MORTDALE","URBAN",1081,1520.2040497457899,3698.5777200138,2.6306522999999999,10503.593624845234,223.21413597037503,6,512441.26666666701,10720,30.989824236817746,2.9602220166512501,1,10890,10890,3.0527289546716001,3.0527289546716001]
[null,"ZN10994:PA14","MORTDALE","URBAN",493,1233.5881645203001,490.461344472007,1.7052110999999999,3568.3854142974055,0,3,268573.55,0,100.20283975659201,0,0,0,0,0,0]
[null,"ZN10994:PA18","MORTDALE","URBAN",1099,901.56840510375696,2413.4917279790702,1.9956015999999999,10.291406144604963,0,2,661.86666666669998,391.76666666670002,0.18198362147406741,9.0991810737033704E-2,0,0,0,0,0]
[null,"ZN10994:PA19","MORTDALE","URBAN",904,4795.3636960338799,3293.59801104088,3.4646918999999996,5290.9824583828222,0,9,195993.35,195993.35,208.960176991151,208.960176991151,0,0,0,0,0]
[null,"ZN10994:PA2","MORTDALE","URBAN",1671,282.24569997320401,4774.5788887647705,3.4466019999999999,2.2558010090000002,0,1,84,84,5.9844404548174704E-2,5.9844404548174704E-2,0,0,0,0,0]
[null,"ZN10994:PA20","MORTDALE","URBAN",2352,1040.0579611753799,2618.4636120957198,3.3018828,5908.8209135588522,0,4,229672.3999999997,7615.0666666667003,10.50170068027211,3.4863945578231306,0,0,0,0,0]
[null,"ZN10994:PA21","MORTDALE","URBAN",1076,4198.29556897564,1195.64849355159,3.3561524999999999,8447.0536210128048,0,7,323022.81666666619,258115.683333333,209.01486988847594,200.46468401487002,0,0,0,0,0]
[null,"ZN10994:PA3","MORTDALE","URBAN",1080,2182.0163626859198,2062.7865023260301,2.5944724999999997,35.618285983213539,0,2,1761.9499999999998,50.983333333300003,0.1851851851851852,9.2592592592592601E-2,0,0,0,0,0]
[null,"ZN10994:PA4","MORTDALE","URBAN",2164,4869.9214375399697,3129.7622676185301,4.5529421999999995,29126.40882529585,1799.64715457175,7,821040.23333333305,468.55,105.68391866913099,0.18484288354898298,1,50730,50730,4.1127541589648802,4.1127541589648802]
[null,"ZN10994:PA7","MORTDALE","URBAN",1866,4547.9052327159097,4658.6165854835299,5.8230435999999992,14067.19086077246,711.32990432789995,18,310046.59999999998,285338.8,160.98606645230493,158.681672025724,1,15678,15678,2.09003215434084,2.09003215434084]
[null,"ZN10994:PA8","MORTDALE","URBAN",361,935.73854095781303,1520.1963942237201,1.6509414,14.280294577927522,0,3,1110.1333333334001,152.4166666667,0.83102493074792194,0.554016620498615,0,0,0,0,0]
[null,"ZN10994:PA9","MORTDALE","URBAN",1191,967.30184399867801,1800.6944509601401,1.8499303,3572.9112181881087,0,5,247877.15,22464,109.23593618807675,8.7321578505457609,0,0,0,0,0]
[null,"ZN10995:PA1","RIVERWOOD","URBAN",2062,5281.5412498098704,1810.7297596507001,4.1540122999999998,33771.070998389754,0,9,1043390.05,436856.21666666702,211.00872938894301,107.71096023278399,0,0,0,0,0]
[null,"ZN10995:PA12","RIVERWOOD","URBAN",1288,3872.0189956616,1617.4532135311099,2.7934614,5566.0554532314409,0,7,255725.76666666701,110746.766666667,114.9844720496894,15.372670807453401,0,0,0,0,0]
[null,"ZN10995:PA13","RIVERWOOD","URBAN",1313,4294.0275234441797,1440.0611569084199,3.7550823999999996,14362.001094042618,0,14,490868.45000000071,488830.28333333402,227.11348057882722,226.884996191927,0,0,0,0,0]
[null,"ZN10995:PA2","RIVERWOOD","URBAN",2369,4360.7060012790898,3344.2303343258,3.8274419999999996,43454.190560472576,0,17,1457111.15,429930.35,258.16800337695298,111.18615449556799,0,0,0,0,0]
[null,"ZN10995:PA5","RIVERWOOD","URBAN",1442,1542.5125879718701,2017.04478236314,3.7189025999999998,3298.4061409765714,0,5,113830.58333333299,113619.58333333299,107.83633841886311,107.697642163662,0,0,0,0,0]
[null,"ZN10995:PA6","RIVERWOOD","URBAN",1353,2736.6895420365099,2267.1456822915102,2.6487422,11190.855527074915,3586.0790897360002,7,542242.1,203003.33333333299,119.4382852919438,20.3991130820399,3,173760,173760,26.755358462675499,26.755358462675499]
[null,"ZN10995:PA7","RIVERWOOD","URBAN",2133,5404.5250974339997,1431.8918647666601,3.7550823999999996,175.64031544696294,0,5,6003.0833333333003,6003.0833333333003,2.76605719643694,2.76605719643694,0,0,0,0,0]
[null,"ZN10995:PA8","RIVERWOOD","URBAN",707,1799.6667705145101,2319.70113299785,4.0092930999999998,2265.6243567123215,13.120411669750002,5,72525.333333333299,71588.2,102.12164073550214,101.980198019802,1,420,420,0.141442715700141,0.141442715700141]
[null,"ZN10996:PA10","ROCKDALE","URBAN",876,2994.1276900598,2379.8153105081601,2.0679612000000001,170.89948444184,0,2,10606.4,10606.4,9.5890410958904209,9.5890410958904209,0,0,0,0,0]
[null,"ZN10996:PA11","ROCKDALE","URBAN",627,525.22669566363004,1308.14378601268,1.0339806,2385.2920433487752,0,1,296073,0,100,0,0,0,0,0,0]
[null,"ZN10996:PA12","ROCKDALE","URBAN",1088,4596.4032165302096,3698.24774189456,3.2647508999999997,10042.783351805097,143.72385680812502,8,394796.85,394796.85,323.98897058823502,323.98897058823502,2,5650,5650,0.91911764705882304,0.91911764705882304]
[null,"ZN10996:PA14","ROCKDALE","URBAN",493,118.37254669874,1057.37594141723,1.0339806,50.245147724213759,0,2,6236.65,6236.65,11.5618661257606,11.5618661257606,0,0,0,0,0]
[null,"ZN10996:PA19","ROCKDALE","SHORT RURAL",982,1628.4366880463199,1654.5639941101699,2.1945904999999999,105.79585564261446,0,4,6187.0666666667003,76,0.40733197556008099,0.10183299389002001,0,0,0,0,0]
[null,"ZN10996:PA20","ROCKDALE","URBAN",285,1337.95964456404,683.56990106715705,1.0701604,43.976368857300002,0,1,5274,0,2.1052631578947398,0,0,0,0,0,0]
[null,"ZN10996:PA21","ROCKDALE","URBAN",78,954.80761260945303,1262.82152217679,1.3786407999999999,2.3143444161383329,0,1,215.45,215.45,1.2820512820512799,1.2820512820512799,0,0,0,0,0]
[null,"ZN10996:PA4","ROCKDALE","URBAN",800,1157.9738067519299,1161.7993838025,0.99780079999999993,192.03092146333336,11.117579663666669,1,24700,0,11.875,0,1,1430,1430,1.625,1.625]
[null,"ZN10996:PA8","ROCKDALE","URBAN",1196,1149.8369676959101,1633.4578037886299,3.2104811999999998,67.415423248249994,0,1,2695,2695,0.91973244147157196,0.91973244147157196,0,0,0,0,0]
[null,"ZN10996:PA9","ROCKDALE","URBAN",1045,2464.7515585964802,2135.9437596453899,4.7347932999999998,5253.1804182237765,182.61505908937499,5,142393.75,142393.75,192.44019138755999,192.44019138755999,1,4950,4950,2.87081339712919,2.87081339712919]
[null,"ZN10997:PA11","SANS SOUCI","URBAN",710,1906.30999510841,980.38341731619505,2.3583516999999996,421.86511949335198,0,4,22958.0333333333,22958.0333333333,11.5492957746479,11.5492957746479,0,0,0,0,0]
[null,"ZN10997:PA12","SANS SOUCI","URBAN",1399,2394.0065377320102,2713.6519570770001,2.8839108999999996,8364.4165216983492,0,7,372240.35,372240.35,197.426733380987,197.426733380987,0,0,0,0,0]
[null,"ZN10997:PA2","SANS SOUCI","URBAN",2531,833.78765227392898,5783.3613160166196,4.4444027999999998,1695.2637818961898,0,5,48954.6,46860.666666666701,5.8870011853022577,5.7684709600948301,0,0,0,0,0]
[null,"ZN10997:PA5","SANS SOUCI","URBAN",825,1256.1969242335199,1498.4045530528799,1.7775706999999998,0,529.77161768437497,0,0,0,0,0,1,38250,38250,9.0909090909090899,9.0909090909090899]
[null,"ZN10997:PA7","SANS SOUCI","URBAN",1016,989.54047583285001,3840.4570666380801,2.2126803999999995,60.824371515599985,0,1,3528,3528,5.5118110236220499,5.5118110236220499,0,0,0,0,0]
[null,"ZN10997:PA8","SANS SOUCI","URBAN",252,906.84225936061898,505.267398740033,1.9232419999999999,8.1070259755833334,0,2,541,541,0.79365079365079394,0.79365079365079394,0,0,0,0,0]
[null,"ZN10999:PA10","KOGARAH","URBAN",1862,7631.0219243730398,686.79028383407501,4.5348522999999998,14035.740595568623,0,6,397229.8,11550.8,107.35767991407093,7.4113856068743296,0,0,0,0,0]
[null,"ZN10999:PA11","KOGARAH","URBAN",2334,1085.8078749490301,3753.8109943125501,3.1743014000000001,7340.9320061837834,17.807830853999999,1,296806,296806,100,100,1,720,720,0.12853470437018,0.12853470437018]
[null,"ZN10999:PA12","KOGARAH","URBAN",2726,3715.8794119805498,2819.1877907580702,4.6433916999999996,221.53470245554354,237.15832895768747,7,6123.1666666666997,3720.6833333333998,0.44020542920029321,0.36683785766691102,1,6555,6555,0.84372707263389601,0.84372707263389601]
[null,"ZN10999:PA14","KOGARAH","URBAN",192,310.43553612714999,1268.3437564630699,3.5732312999999998,81.937320286387475,584.66997146249992,2,2943,2943,4.6875,4.6875,1,21000,21000,18.2291666666667,18.2291666666667]
[null,"ZN10999:PA15","KOGARAH","URBAN",1509,3646.1454022020898,1463.48060083372,2.8477310999999998,22427.743208992339,9.3192000247499998,3,1010779.05,4491.1499999999996,105.23525513585157,5.2352551358515607,1,420,420,6.62690523525514E-2,6.62690523525514E-2]
[null,"ZN10999:PA16","KOGARAH","URBAN",1407,3579.3296786146202,1522.3672811773299,3.9540712999999994,334.03317756866335,0,4,10842.133333333299,10501.05,3.4825870646766242,3.4115138592750602,0,0,0,0,0]
[null,"ZN10999:PA17","KOGARAH","URBAN",1523,3707.1516720496402,1713.23714524811,2.5211608000000001,16298.312803367073,1948.8856614589999,7,829682.13333333319,22492.1333333332,110.57124097176629,10.571240971766301,4,99210,59170,14.90479317137226,12.015758371634901]
[null,"ZN10999:PA19","KOGARAH","URBAN",1898,738.39122344147995,3884.8527768210301,4.4986724999999996,9191.6066696468552,0,3,262226.566666667,262226.566666667,12.8029504741833,12.8029504741833,0,0,0,0,0]
[null,"ZN10999:PA22","KOGARAH","URBAN",2144,4171.1513513449199,1562.84282108006,3.8274419999999996,1641.6731977439308,0,6,55048.783333333398,31756.566666666698,8.9085820895522403,6.1567164179104505,0,0,0,0,0]
[null,"ZN10999:PA23","KOGARAH","URBAN",407,0,3528.5585727828602,2.9572225999999997,194.8935498578108,0,4,8458.2999999999993,2586.3333333332998,5.4054054054054026,4.4226044226044205,0,0,0,0,0]
[null,"ZN10999:PA24","KOGARAH","URBAN",2519,2573.8383908341998,2807.7776682899798,3.5370514999999996,18189.335567920974,1174.0358191375001,7,660001.75,660001.75,113.73560936879701,113.73560936879701,2,42600,42600,5.6371576022231,5.6371576022231]
[null,"ZN10999:PA25","KOGARAH","URBAN",1216,354.71239687780502,3535.4578875463699,2.8477310999999998,4235.8700400115513,0,2,190903.23333333299,190903.23333333299,99.671052631578902,99.671052631578902,0,0,0,0,0]
[null,"ZN10999:PA28","KOGARAH","URBAN",580,0,1426.4284763184,2.9391327,798.61758579198761,21.984712596000001,2,34873,34873,100.172413793103,100.172413793103,1,960,960,0.68965517241379304,0.68965517241379304]
[null,"ZN10999:PA29","KOGARAH","URBAN",2340,1542.92390419155,4194.0421972066897,3.7369924999999995,669.66040382430799,599.23608985624992,7,22998.633333333299,22998.633333333299,6.4957264957264904,6.4957264957264904,2,20580,20580,5.7692307692307701,5.7692307692307701]
[null,"ZN10999:PA30","KOGARAH","SHORT RURAL",206,1357.7020277888801,1151.9381217074599,0.67123049999999995,1.0407708581875001,0,1,199,199,0.485436893203883,0.485436893203883,0,0,0,0,0]
[null,"ZN10999:PA32","KOGARAH","URBAN",1548,4196.2779412709997,1873.3542010358599,3.0476720999999998,3966.8527588470938,10.685900300625001,7,167050.38333333371,136039.41666666701,103.4237726098191,98.708010335917294,1,450,450,6.4599483204134403E-2,6.4599483204134403E-2]
[null,"ZN10999:PA36","KOGARAH","URBAN",2398,1058.2601263817601,3103.28465940155,3.7731722999999997,37718.745367773306,1444.6816431547497,11,1282981.0333333341,918892.03333333402,418.18181818181853,376.35529608006698,2,49140,49140,5.2543786488740603,5.2543786488740603]
[null,"ZN10999:PA37","KOGARAH","URBAN",1,0,711.94062827418099,2.1041409999999998,0,3.93474367,0,0,0,0,0,1,240,240,100,100]
[null,"ZN10999:PA38","KOGARAH","URBAN",2017,2907.70114429367,5662.4762255770602,3.8274419999999996,16.461828041999997,0,1,552,552,0.198314328210213,0.198314328210213,0,0,0,0,0]
[null,"ZN10999:PA39","KOGARAH","URBAN",832,1126.6067373237699,4241.9710296343001,2.1765005999999998,6.91146405217125,0,1,407.55,407.55,0.120192307692308,0.120192307692308,0,0,0,0,0]
[null,"ZN10999:PA4","KOGARAH","URBAN",1633,4847.9897392603598,2296.6090423631099,4.0635627999999997,12594.198930286209,0,7,397771.08333333302,115363.08333333299,63.38028169014089,33.251684017146403,0,0,0,0,0]
[null,"ZN10999:PA7","KOGARAH","URBAN",1004,2676.61194752242,2361.2303484236299,3.1743014000000001,11252.348266187966,0,11,454951.01666666666,451925.55,189.5418326693225,189.44223107569701,0,0,0,0,0]
[null,"ZN116:PA33","LEICHHARDT","URBAN",1526,0,8335.1358918196493,3.1200316999999997,1490.4154590160335,0,4,61308.116666666698,678.11666666669998,9.4364351245085221,0.19659239842726101,0,0,0,0,0]
[null,"ZN116:PA34","LEICHHARDT","URBAN",1893,616.09315215869901,6966.2529827567896,3.6465429999999999,7855.6050329242371,0,6,276482.68333333329,272590.84999999998,101.4263074484941,101.37348124669801,0,0,0,0,0]
[null,"ZN116:PA36","LEICHHARDT","URBAN",1434,0,3700.1850628197299,2.5211608000000001,167.84460999096999,0,2,8544.2999999999993,8544.2999999999993,4.5327754532775399,4.5327754532775399,0,0,0,0,0]
[null,"ZN116:PA41","LEICHHARDT","URBAN",627,0,845.31177849378696,2.9572225999999997,133.71247918945966,88.825725583375004,1,5803.0666666667003,5803.0666666667003,11.323763955342899,11.323763955342899,2,3855,3855,37.001594896331703,37.001594896331703]
[null,"ZN116:PA43","LEICHHARDT","URBAN",1154,0,3430.9952711177798,3.9540712999999994,369.61324013336247,0,1,11997,11997,8.05892547660312,8.05892547660312,0,0,0,0,0]
[null,"ZN116:PA44","LEICHHARDT","URBAN",2127,0,8742.5596501871405,4.2625517000000004,5219.9707043956168,0,5,157169.41666666631,10316.8833333333,8.0394922425951911,2.77385989656793,0,0,0,0,0]
[null,"ZN116:PA45","LEICHHARDT","URBAN",78,193.55901777491101,9790.0513862030002,3.5551413999999997,0,123.26712150041664,0,0,0,0,0,1,4450,4450,12.8205128205128,12.8205128205128]
[null,"ZN116:PA47","LEICHHARDT","URBAN",1350,0,4748.7129573480397,4.1721021999999994,8451.2815420330644,1911.4486229300003,6,259978.3999999997,925.06666666670003,14.962962962962919,1.9259259259259203,1,58800,58800,10.3703703703704,10.3703703703704]
[null,"ZN1193:PA10","LINDFIELD","URBAN",552,280.214708677244,5264.3286513141202,3.4466019999999999,238.06757077124729,0,7,8864.9999999999,4657.2499999999,9.0579710144927557,8.8768115942029002,0,0,0,0,0]
[null,"ZN1193:PA11","LINDFIELD","URBAN",372,0,2037.95763500573,1.3967307,155.18196613272374,333.50524584918753,1,14259.3,14259.3,17.741935483871,17.741935483871,3,30645,30645,23.387096774193498,23.387096774193498]
[null,"ZN1193:PA12","LINDFIELD","URBAN",1320,6975.3234188971801,2722.07527300016,4.1721021999999994,1936.7162616566388,0,13,59577.283333333296,31820.35,46.893939393939398,25.530303030302999,0,0,0,0,0]
[null,"ZN1193:PA15","LINDFIELD","URBAN",1023,331.83773641919697,7207.5222887273103,2.3764415999999997,2641.2443683225547,0,10,142643.19999999969,40951.766666666699,29.912023460410591,21.896383186705801,0,0,0,0,0]
[null,"ZN1193:PA16","LINDFIELD","URBAN",887,4438.2733899370096,3099.8663780615502,2.9391327,382.65346470933156,239.08374948150001,12,16709.216666666598,13868.55,31.341600901916582,31.0033821871477,1,10440,10440,3.2694475760992106,3.2694475760992106]
[null,"ZN1193:PA17","LINDFIELD","URBAN",387,1270.7777138031599,1946.06454031314,1.3062811999999999,12.458003804400001,0,1,1224,1224,9.3023255813953494,9.3023255813953494,0,0,0,0,0]
[null,"ZN1193:PA21","LINDFIELD","URBAN",834,3011.4087514631601,1632.9406419484601,2.4849809999999999,1299.8765441571936,857.06528756062505,7,67134.95,61699.4,53.117505995203807,52.9976019184652,2,44265,44265,12.8297362110312,12.8297362110312]
[null,"ZN1193:PA25","LINDFIELD","URBAN",605,1157.3386782584,2392.8534909201999,1.6509414,1328.5735778198816,0,9,103281.75,96935.433333333407,79.504132231404995,79.173553719008311,0,0,0,0,0]
[null,"ZN1193:PA26","LINDFIELD","URBAN",1417,626.38095466632797,6450.8506270746402,2.9753124999999998,3487.3997949283848,165.75589908854164,8,150431.5,149197.29999999999,123.50035285815073,118.70148200423401,1,7150,7150,0.91743119266054995,0.91743119266054995]
[null,"ZN1193:PA27","LINDFIELD","URBAN",1103,4925.9447761442698,1997.05451421469,3.3561524999999999,7883.5054021616879,0,8,301472.23333333299,301472.23333333299,179.23844061650001,179.23844061650001,0,0,0,0,0]
[null,"ZN1193:PA28","LINDFIELD","URBAN",2623,6374.0306642417499,8098.4672170694203,7.1655045999999993,2516.1271319311072,0,12,45066.666666666599,40781.0666666666,8.8829584445291658,8.8067098741898597,0,0,0,0,0]
[null,"ZN12570:PA21","AVOCA","URBAN",2191,4191.0421310513402,11915.0139381186,6.2219734999999998,913.93393047756922,2405.1671131555831,8,18851.949999999903,18331.266666666601,3.8338658146964875,3.7882245549977198,4,49612,49612,16.522136010953901,16.522136010953901]
[null,"ZN12570:PA22","AVOCA","SHORT RURAL",1606,9919.7008769699896,6026.4658457100704,4.0635627999999997,2074.0525104379299,6320.4171549966331,15,65506.2,65506.2,50.373599003736004,50.373599003736004,7,199622,199622,42.092154420921503,42.092154420921503]
[null,"ZN12570:PA24","AVOCA","SHORT RURAL",1761,12539.2476240327,3894.7922112136798,3.4466019999999999,21958.435189831282,4031.2506769525835,17,817673.43333333335,815431.15,254.11697898921057,254.06019307211798,20,150113,150113,21.124361158432698,21.124361158432698]
[null,"ZN12570:PA25","AVOCA","SHORT RURAL",1048,3775.6592606331301,3227.8108118917198,1.7775706999999998,165.77327222319752,119.66605952399999,4,11968.983333333299,11798.083333333299,8.3969465648854946,8.30152671755725,1,8640,8640,3.4351145038167901,3.4351145038167901]
[null,"ZN12570:PA26","AVOCA","URBAN",413,688.80234057786902,7016.2030999784702,4.3901330999999999,16.038836049950319,59.353898310186551,1,468.88333333330002,468.88333333330002,0.24213075060532702,0.24213075060532702,2,1735.1666666666999,1735.1666666666999,1.2106537530266299,1.2106537530266299]
[null,"ZN12570:PA29","AVOCA","URBAN",776,2355.83047415479,4725.9929233352204,1.5966716999999999,58.975919963764369,144.31251048499999,3,4740.55,4740.55,6.7010309278350499,6.7010309278350499,2,11600,11600,3.8659793814432999,3.8659793814432999]
[null,"ZN12570:PA33","AVOCA","SHORT RURAL",1585,15486.0222136251,4049.43048695882,2.6125623999999998,6077.5472493586849,1211.1337456705667,15,298559.78333333402,165676.316666667,176.08832807570968,93.943217665615094,9,59497,59497,8.20189274447951,8.20189274447951]
[null,"ZN12570:PA34","AVOCA","SHORT RURAL",783,5144.8582715717102,3339.1223967075798,1.7594808,1864.2575150815001,181.78515755399999,11,135985,97358.033333333296,255.4278416347382,221.455938697318,1,13260,13260,4.34227330779055,4.34227330779055]
[null,"ZN12570:PA35","AVOCA","SHORT RURAL",1042,3889.2320614887399,5460.10074856544,3.4285120999999998,2245.5488610234661,0,4,84059.433333333407,84059.433333333407,111.22840690978899,111.22840690978899,0,0,0,0,0]
[null,"ZN12570:PA37","AVOCA","SHORT RURAL",2139,11879.3325888564,5795.4285765528502,4.3539532999999997,38451.270409462544,2495.4901036614997,23,1133434.8500000034,1131727.36666667,563.53436185133228,563.48761103319293,5,73560,73560,7.5736325385694307,7.5736325385694307]
[null,"ZN12570:PA39","AVOCA","URBAN",1599,4226.5943708470504,5961.1797207547997,3.0838518999999995,6227.0936542655245,69.201636636000003,23,259156.15,121858.5,165.35334584115068,89.493433395872401,1,2880,2880,0.50031269543464696,0.50031269543464696]
[null,"ZN12570:PA40","AVOCA","SHORT RURAL",1173,6818.3207812104401,5333.4969730558196,2.9572225999999997,90.237797321247442,1506.9267063950001,6,3916.2833333333001,3916.2833333333001,1.3640238704177301,1.3640238704177301,3,65400,65400,12.3614663256607,12.3614663256607]
[null,"ZN12570:PA41","AVOCA","SHORT RURAL",811,3071.7568892633799,3516.5722199269298,1.7775706999999998,535.75492066057495,43.212743716999995,2,38682,17800,11.467324290998771,4.9321824907521599,2,3120,3120,1.1097410604192399,1.1097410604192399]
[null,"ZN12580:PA1","ERINA","URBAN",1195,4041.5171243888699,4462.9266448839498,3.5732312999999998,459.82854781786222,814.08333169349999,5,16515.983333333301,16515.983333333301,5.1046025104602499,5.1046025104602499,2,29240,29240,5.5230125523012497,5.5230125523012497]
[null,"ZN12580:PA10","ERINA","URBAN",1590,1834.57408667971,7377.5829968525304,3.9912031999999997,134.69168040917006,3871.5921617002668,7,4331.1833333332997,4331.1833333332997,2.89308176100629,2.89308176100629,1,124496,124496,15.7861635220126,15.7861635220126]
[null,"ZN12580:PA12","ERINA","SHORT RURAL",343,3889.4855541888801,2188.30050672175,1.3062811999999999,35.101918508024234,92.824342072000007,2,3448.7666666667001,1113,2.3323615160349829,2.0408163265306101,1,9120,9120,5.5393586005830899,5.5393586005830899]
[null,"ZN12580:PA13","ERINA","URBAN",94,0,2935.0364152944499,2.9753124999999998,0,10.432189453125,0,0,0,0,0,2,450,450,31.914893617021299,31.914893617021299]
[null,"ZN12580:PA14","ERINA","URBAN",1831,5374.3395433966998,4525.7502079554397,3.3923323000000001,140.62663836300317,253.61429642747916,6,5320.3333333334003,1045.3333333334001,3.3861277990169349,0.273074822501365,4,9595,9595,2.1299836155106497,2.1299836155106497]
[null,"ZN12580:PA16","ERINA","URBAN",1296,8184.8307616329002,5047.9798680312097,5.2422626000000001,2512.4474230539149,3078.1517534680002,6,61510.300000000105,46728.233333333403,53.703703703703709,48.456790123456798,1,75360,75360,12.1141975308642,12.1141975308642]
[null,"ZN12580:PA2","ERINA","URBAN",384,0,3559.8671485974201,3.1923913000000002,0,37.733932149695839,0,0,0,0,0,5,1517,1517,1.5625,1.5625]
[null,"ZN12580:PA4","ERINA","SHORT RURAL",2112,10176.8902940435,4697.0821526175196,4.5710321,47913.06201684766,1631.2465127776125,9,1345269.4833333329,137804.48333333299,240.198863636363,140.15151515151501,3,45801,45801,7.5284090909090899,7.5284090909090899]
[null,"ZN12580:PA7","ERINA","URBAN",169,783.35809061146904,4709.12763911805,3.7550823999999996,659.57099231576672,25.454764819000001,1,22543,22543,101.183431952663,101.183431952663,3,870,870,34.319526627218899,34.319526627218899]
[null,"ZN12580:PA8","ERINA","URBAN",311,1.34516028997961,2716.0832462293001,3.8455318999999997,0,239.70482176666664,0,0,0,0,0,1,8000,8000,25.723472668810299,25.723472668810299]
[null,"ZN12600:PA1","LISAROW","SHORT RURAL",619,5439.8971233952097,2606.1875035630501,2.2126803999999995,5088.5336468916303,0,8,295150.55,48934.55,406.13893376413495,206.46203554119501,0,0,0,0,0]
[null,"ZN12600:PA11","LISAROW","SHORT RURAL",886,4745.8326855354799,2734.9245192707099,2.9391327,1361.4414954111132,878.24346672562513,5,59449.666666666701,59449.666666666701,208.69074492099301,208.69074492099301,2,38350,38350,14.672686230248299,14.672686230248299]
[null,"ZN12600:PA12","LISAROW","URBAN",279,847.38287724877102,3591.1900409292102,3.1923913000000002,1106.1676091932013,0,5,44470.75,44470.75,296.77419354838702,296.77419354838702,0,0,0,0,0]
[null,"ZN12600:PA13","LISAROW","SHORT RURAL",856,13556.637212080001,4405.4201621785196,4.2444617999999998,24594.226521482025,176.93215865875001,10,743669.85,258599.85,509.34579439252332,409.92990654205596,2,5350,5350,3.0373831775700899,3.0373831775700899]
[null,"ZN12600:PA2","LISAROW","SHORT RURAL",778,27203.865332319499,3370.28119654083,2.9934023999999999,5838.983160029552,1590.5991195589002,40,250346.63333333368,231023.86666666699,415.03856041131161,398.20051413881799,13,68197,68197,21.850899742930601,21.850899742930601]
[null,"ZN12600:PA3","LISAROW","SHORT RURAL",1744,6653.3312490608596,4165.4238523075601,3.7189025999999998,36025.432921999571,3105.1742732818498,9,1243265.95,507640.95,509.518348623853,309.74770642201798,11,107162,101562,18.520642201834882,17.7178899082569]
[null,"ZN12600:PA5","LISAROW","URBAN",83,1248.8082860173799,1911.0393514452401,4.2444617999999998,232.459092189225,33.236788682625004,3,7029,6244,191.56626506024088,189.156626506024,2,1005,1005,4.81927710843373,4.81927710843373]
[null,"ZN12600:PA9","LISAROW","SHORT RURAL",1497,10558.2884890696,2310.0352674040601,3.0476720999999998,1752.8576980721691,4133.4249685073128,7,73815.583333333299,69591.583333333299,200.93520374081453,200.40080160320599,5,174065,174065,27.5885103540414,27.5885103540414]
[null,"ZN12610:PA10","LONG JETTY","SHORT RURAL",1922,6349.3206830808704,8164.4799951637497,4.1359224000000001,3270.2094792598259,2242.3306544033999,13,101478.21666666689,14724.1000000002,110.24973985431809,10.197710718002099,6,69582,69582,8.6888657648283107,8.6888657648283107]
[null,"ZN12610:PA11","LONG JETTY","URBAN",1515,8127.3928361186199,1117.11352221995,2.7753714999999999,14614.013892303441,1588.1230797300002,18,675799.75000000035,31901.9333333334,66.336633663366314,12.2112211221122,2,73440,73440,10.099009900990099,10.099009900990099]
[null,"ZN12610:PA13","LONG JETTY","SHORT RURAL",2098,3899.3254723997502,5414.79308326505,2.9391327,16560.552319666695,0,16,723144.78333333344,13065.233333333401,107.05433746425157,6.8636796949475709,0,0,0,0,0]
[null,"ZN12610:PA16","LONG JETTY","URBAN",1379,4323.7764213954897,416.77673045957602,0.74359010000000003,325.33882680713663,5.2144255762500008E-2,9,56152.866666666698,56152.866666666698,13.343002175489499,13.343002175489499,2,9,9,0.14503263234227701,0.14503263234227701]
[null,"ZN12610:PA17","LONG JETTY","URBAN",1067,3789.5778321144799,1468.3248825001201,1.9594217999999997,248.20613294537853,393.06834062264994,7,16257.516666666599,15530.2166666666,17.994376757263311,17.900656044985901,3,25746,25746,7.3102155576382302,7.3102155576382302]
[null,"ZN12610:PA18","LONG JETTY","URBAN",1172,6074.1782278180099,4501.5450672174302,3.4646918999999996,626.21936868809678,377.80516280306244,11,23196.983333333301,22982.95,18.003412969283314,17.918088737201401,5,13995,13995,5.9726962457337898,5.9726962457337898]
[null,"ZN12610:PA2","LONG JETTY","URBAN",1578,6131.6343356647603,1901.7043561138901,3.5008716999999998,1848.687410687792,386.79672716758336,6,67773.033333333398,36389.533333333398,22.750316856780778,15.462610899873299,2,14180,14180,2.8517110266159702,2.8517110266159702]
[null,"ZN12610:PA20","LONG JETTY","SHORT RURAL",934,9198.8247525438092,4496.9089082853598,2.0679612000000001,871.08642170074256,272.38797183675001,13,54061.55,53852.833333333299,204.28265524625232,204.17558886509602,2,16905,16905,6.8522483940042802,6.8522483940042802]
[null,"ZN12610:PA22","LONG JETTY","SHORT RURAL",1233,4809.26654674977,494.46727269023899,2.1584106999999997,284.40888254362125,0,14,16911.366666666701,12905.483333333301,11.43552311435522,11.1111111111111,0,0,0,0,0]
[null,"ZN12610:PA23","LONG JETTY","URBAN",1022,3838.7804694043198,2606.8998597735899,2.4126213999999995,384.11967564669413,148.88286659399998,7,20433.7,17407.766666666601,102.73972602739765,102.544031311155,1,7920,7920,3.5225048923679099,3.5225048923679099]
[null,"ZN12610:PA24","LONG JETTY","SHORT RURAL",1260,6214.1790782410999,2782.3830023514001,2.0679612000000001,3902.4234926150234,1343.1683722160003,10,242193.03333333301,242193.03333333301,207.69841269841299,207.69841269841299,4,83360,83360,16.1904761904762,16.1904761904762]
[null,"ZN12610:PA25","LONG JETTY","SHORT RURAL",1339,8155.5736227970201,3742.8787166625698,4.2082819999999996,518.69485183686584,2164.502492867,7,15818.916666666601,15818.916666666601,16.8782673637042,16.8782673637042,3,66012,66012,38.088125466766201,38.088125466766201]
[null,"ZN12610:PA5","LONG JETTY","URBAN",214,2474.6400542817801,1027.8181186720301,2.5944724999999997,290.47314128822916,14.554990725,2,14369,14369,100.467289719626,100.467289719626,1,720,720,1.86915887850467,1.86915887850467]
[null,"ZN12610:PA6","LONG JETTY","URBAN",1718,4982.4769145429,760.54908761527599,2.7391916999999997,16724.461479751619,0,8,783608.8833333333,45888.883333333302,158.09080325960417,58.090803259604193,0,0,0,0,0]
[null,"ZN12610:PA7","LONG JETTY","SHORT RURAL",823,3726.6448246013001,190.95767441867901,1.6871212,52.434276440413214,59.154687074999998,6,3988.7666666667001,3744.35,4.9817739975698681,4.8602673147023099,1,4500,4500,1.8226002430133701,1.8226002430133701]
[null,"ZN12610:PA9","LONG JETTY","URBAN",1418,463.25746506179797,7470.39187564648,3.0657619999999999,131.55823868216865,491.55482631383336,2,5507.4333333332997,5507.4333333332997,3.2440056417489398,3.2440056417489398,4,20578,20578,3.8787023977433095,3.8787023977433095]
[null,"ZN12620:PA1","NORAVILLE","SHORT RURAL",2694,18886.467550140998,13382.3112041572,5.0975434000000002,59264.241395718898,1190.35921898025,17,1492112.0333333299,1492112.0333333299,410.69042316258299,410.69042316258299,1,29970,29970,2.7468448403860402,2.7468448403860402]
[null,"ZN12620:PA10","NORAVILLE","SHORT RURAL",1097,5693.03493238389,5299.8371015033099,2.2498122999999999,10382.509820697825,208.25387554950004,16,592278.1333333333,591983.55000000005,504.55788514129489,504.46672743846898,1,11880,11880,3.00820419325433,3.00820419325433]
[null,"ZN12620:PA11","NORAVILLE","SHORT RURAL",1628,15976.2252908227,3702.95007540395,3.7008126999999997,20043.658169654198,3438.0277048063381,9,695103.566666667,695103.566666667,348.03439803439801,348.03439803439801,3,119229,119229,17.076167076167099,17.076167076167099]
[null,"ZN12620:PA13","NORAVILLE","URBAN",409,1238.6625674178099,4086.4798843291701,0.72550019999999993,1167.0280132129785,195.36269385599999,6,206449.28333333301,206449.28333333301,361.85819070904699,361.85819070904699,2,34560,34560,140.83129584352102,140.83129584352102]
[null,"ZN12620:PA2","NORAVILLE","SHORT RURAL",513,5542.8266330342503,417.40988910053898,0.83403959999999999,3224.0111464086513,0,9,496111.73333333299,492716.73333333299,409.16179337232006,407.79727095516603,0,0,0,0,0]
[null,"ZN12620:PA3","NORAVILLE","URBAN",1056,4347.6728668772903,718.62150471225902,1.9956015999999999,6942.3467058725346,1.865887496,7,446480.08333333302,446480.08333333302,304.82954545454504,304.82954545454504,2,120,120,0.189393939393939,0.189393939393939]
[null,"ZN12620:PA7","NORAVILLE","URBAN",2159,6099.1905343123299,3399.24437924017,3.9731132999999996,49652.327693855194,515.12738305599999,17,1603903.7333333371,1158232.5166666701,506.99397869383898,406.94766095414502,2,16640,16640,1.48216767021769,1.48216767021769]
[null,"ZN12620:PA8","NORAVILLE","SHORT RURAL",1251,7529.0013200550302,4447.8938332307698,2.6306522999999999,11442.604320281886,116.218930298625,5,558253,558253,207.114308553157,207.114308553157,2,5670,5670,1.43884892086331,1.43884892086331]
[null,"ZN12630:PA21","PEATS RIDGE","SHORT RURAL",471,71381.057956402306,13124.483056114899,4.3901330999999999,15421.710006674921,3283.7511458925246,28,450842.11666666699,210354.11666666699,561.78343949044609,469.42675159235694,28,95998,90688,50.7430997876858,47.770700636942699]
[null,"ZN12630:PA22","PEATS RIDGE","SHORT RURAL",576,73349.922053990202,1145.50078572398,1.3243711,5244.2014208301389,2606.7591946729667,16,508205.43333333335,507220.9,513.36805555555532,513.02083333333303,21,252616,252616,126.04166666666701,126.04166666666701]
[null,"ZN12630:PA23","PEATS RIDGE","SHORT RURAL",421,56348.7575821723,460.37857612552,3.5189615999999999,2923.7624653350022,4865.3714385583999,19,106634.366666667,105668.266666667,426.8408551068884,425.41567695961999,27,177448,177448,102.85035629453701,102.85035629453701]
[null,"ZN12630:PA24","PEATS RIDGE","SHORT RURAL",325,32718.070921160001,19.553407905969198,2.7030118999999999,4678.0586399902068,1007.7673054418751,21,222119.83333333299,181943.83333333299,526.46153846153879,426.769230769231,8,47850,47850,40,40]
[null,"ZN12630:PA25","PEATS RIDGE","SHORT RURAL",246,29627.274286119999,5883.3078812182603,1.0158906999999999,2241.3327599365953,245.490749573025,19,283158.09999999998,139881.86666666699,902.03252032520402,797.15447154471599,5,31014,31014,28.455284552845502,28.455284552845502]
[null,"ZN12640:PA1","UMINA","SHORT RURAL",639,5814.1936791530097,2210.0866639926599,1.9232419999999999,9.4447102369893887,102.55912343233335,2,630.26666666669996,630.26666666669996,2.5039123630672999,2.5039123630672999,3,6844,6844,5.4773082942097,5.4773082942097]
[null,"ZN12640:PA10","UMINA","URBAN",1674,6014.0424760740398,1425.46104163521,3.9178915000000001,23093.204448165245,2545.3638328000206,12,756486.933333333,756230.28333333298,380.46594982078835,380.40621266427701,3,83381,83381,12.1266427718041,12.1266427718041]
[null,"ZN12640:PA13","UMINA","SHORT RURAL",2039,18863.3653139977,908.71409417961297,3.5370514999999996,3221.7081617349832,2900.8606162153746,17,116899.9833333335,86618.166666666802,61.893084845512561,59.342815105443904,3,105258,105258,11.7214320745463,11.7214320745463]
[null,"ZN12640:PA15","UMINA","SHORT RURAL",1059,2351.1711854855898,1098.9239685668599,1.9413319,1133.9472521268603,0,7,74965.716666666704,40947.800000000003,32.577903682719501,25.3068932955618,0,0,0,0,0]
[null,"ZN12640:PA16","UMINA","URBAN",797,2262.1158969767498,1187.7489335032201,1.6509414,1145.2788533346138,0,5,89032.633333333302,89032.633333333302,99.874529485570889,99.874529485570889,0,0,0,0,0]
[null,"ZN12640:PA18","UMINA","SHORT RURAL",949,8014.4763560863803,651.88007397852198,1.7956605999999997,455.6568766685761,33.508897275791661,9,32567.416666666701,12158.4333333334,16.649104320337198,7.4815595363540597,2,2395,2395,0.52687038988408896,0.52687038988408896]
[null,"ZN12640:PA19","UMINA","URBAN",1797,4405.5141229278097,3814.1444491134198,3.2285710999999999,992.71080008301146,1621.3009659527083,5,39462.266666666699,39462.266666666699,46.466332776850301,46.466332776850301,2,64450,64450,10.1279910962716,10.1279910962716]
[null,"ZN12640:PA2","UMINA","URBAN",1994,5363.9141497783403,1584.6875239860401,3.6284530999999998,3497.0817050252649,140867.39466736745,6,123695.5,123695.5,122.96890672016001,122.96890672016001,1,4982629.5999999996,4982629.5999999996,5.2156469408224702,5.2156469408224702]
[null,"ZN12640:PA6","UMINA","URBAN",1250,3251.5212276174202,2110.7900992426999,2.7572815999999998,228.56384531396714,0,3,10638.8833333333,10638.8833333333,8.16,8.16,0,0,0,0,0]
[null,"ZN12640:PA7","UMINA","SHORT RURAL",1662,3234.1665565503599,2147.8882118790102,2.7211018,3295.1388729595692,0,10,155417.01666666701,155417.01666666701,126.59446450060202,126.59446450060202,0,0,0,0,0]
[null,"ZN12640:PA8","UMINA","SHORT RURAL",915,1995.9469962973101,6023.2255715555702,2.5573405999999999,164.99944857448997,0,5,8280.6333333334005,8082.2666666667001,6.557377049180328,6.44808743169399,0,0,0,0,0]
[null,"ZN12650:PA1","WEST GOSFORD","SHORT RURAL",1713,52357.873329377398,2419.5646722736801,3.4827817999999997,78054.429095278581,3758.4163518196606,40,2876344.63333333,518634.65,412.37594862813796,218.73905429071797,11,138499.51666666701,138499.51666666701,18.739054290717998,18.739054290717998]
[null,"ZN12650:PA10","WEST GOSFORD","URBAN",707,601.90617667969605,3864.3136309106999,2.2126803999999995,1999.6589691435404,607.20928706899986,5,115986.35,115986.35,117.53889674681798,117.53889674681798,8,35220,35220,14.4271570014144,14.4271570014144]
[null,"ZN12650:PA12","WEST GOSFORD","SHORT RURAL",2031,11490.5656212266,3409.5577763912702,4.8795124999999997,849.33613248764016,6215.0533694218748,8,22339.4666666667,14338.3,6.7946824224519888,4.62826193993107,9,163470,163470,19.9901526341704,19.9901526341704]
[null,"ZN12650:PA13","WEST GOSFORD","SHORT RURAL",1793,11388.267921156399,5472.6966190743897,4.2625517000000004,14539.402733126057,1023.9377369315418,20,437770.55,436246.2,360.73619631901852,360.68042387060802,5,30830,30830,5.9118795315114401,5.9118795315114401]
[null,"ZN12650:PA14","WEST GOSFORD","URBAN",663,2725.0576042581902,5594.2797539011799,3.9731132999999996,2812.782802391258,0,5,90860.45,90860.45,104.977375565611,104.977375565611,0,0,0,0,0]
[null,"ZN12650:PA17","WEST GOSFORD","URBAN",2224,8005.7465221253296,5417.7580246927,6.0410744999999997,5490.6368704095412,1153.9220014884377,11,116648.233333333,116648.233333333,61.600719424460401,61.600719424460401,4,24515,24515,3.1924460431654604,3.1924460431654604]
[null,"ZN12650:PA19","WEST GOSFORD","URBAN",344,167.74870063997301,3637.79442501209,1.8318403999999999,0.44365520743146869,643.14542563700002,1,31.083333333300001,31.083333333300001,0.290697674418605,0.290697674418605,1,45060,45060,0.290697674418605,0.290697674418605]
[null,"ZN12650:PA2","WEST GOSFORD","URBAN",389,4001.3453252597201,1348.0351895951601,2.7391916999999997,1718.0856316087077,843.47016954200001,6,80499.283333333296,23590.2833333333,208.22622107969201,108.226221079692,4,39520,39520,17.223650385604099,17.223650385604099]
[null,"ZN12650:PA20","WEST GOSFORD","URBAN",1545,3701.1136888634801,4626.6321791057899,2.9934023999999999,5831.042642554371,0,6,250006.183333333,250006.183333333,106.084142394822,106.084142394822,0,0,0,0,0]
[null,"ZN12650:PA3","WEST GOSFORD","URBAN",1256,1518.61717767803,5576.0422562617296,3.5732312999999998,1638.9918743110077,1620.9278923117499,5,58868.816666666702,58688.816666666702,100.95541401273881,100.79617834394901,5,58220,55160,11.54458598726114,10.828025477707]
[null,"ZN12650:PA5","WEST GOSFORD","URBAN",126,0,2595.0508521863198,3.4285120999999998,153.60448481354166,0,1,5750,5750,99.206349206349202,99.206349206349202,0,0,0,0,0]
[null,"ZN12650:PA6","WEST GOSFORD","URBAN",1278,8625.7678315410994,5256.9797316367403,4.3358634,7787.5167301797683,3281.5702118388749,17,230511.73333333299,230511.73333333299,300.54773082942103,300.54773082942103,7,97135,97135,22.8482003129891,22.8482003129891]
[null,"ZN12650:PA8","WEST GOSFORD","URBAN",177,412.08513675528201,2678.38253617079,1.1786998,78.027569360400008,0,1,8496,8496,100,100,0,0,0,0,0]
[null,"ZN12650:PA9","WEST GOSFORD","URBAN",1097,3245.0324266757698,6955.9198787525102,4.7709731,3193.9552059183611,24.906467487458332,4,85919.45,85919.45,129.99088422971701,129.99088422971701,2,670,670,0.18231540565177801,0.18231540565177801]
[null,"ZN12660:PA10","WOY WOY","URBAN",1771,11458.721004123299,2878.331362204,4.1178324999999996,1945.4952864352713,5415.3651238534376,11,60636.083333333394,59202.633333333397,31.733483907396959,31.6205533596838,4,168783,168783,22.868435911914201,22.868435911914201]
[null,"ZN12660:PA11","WOY WOY","URBAN",720,2919.0505238516698,1373.8255338839101,1.7594808,152.33189494150653,262.32722396650001,6,11111.583333333201,6004.8666666666004,14.02777777777778,8.19444444444445,1,19135,19135,5.9722222222222197,5.9722222222222197]
[null,"ZN12660:PA13","WOY WOY","URBAN",614,792.97969397405996,1089.86531170851,3.1562114999999999,921.95962617687519,0,2,37490,37490,100,100,0,0,0,0,0]
[null,"ZN12660:PA14","WOY WOY","SHORT RURAL",1250,14745.6071427728,5229.3899272075396,2.7391916999999997,3669.064290348133,8022.293444254512,20,171910.5499999997,170734.433333333,156.32000000000002,156,15,375877,372337,79.760000000000005,78.8]
[null,"ZN12660:PA16","WOY WOY","SHORT RURAL",260,1464.53635005775,3701.10367825397,1.14252,157.17609555999999,0,1,17656,17656,97.692307692307708,97.692307692307708,0,0,0,0,0]
[null,"ZN12660:PA17","WOY WOY","URBAN",1247,3560.3289129315799,1167.96037366617,2.4126213999999995,37.438777412703324,2848.4187324060413,1,1991.6,1991.6,3.1275060144346405,3.1275060144346405,4,151525,151525,31.756214915797898,31.756214915797898]
[null,"ZN12660:PA5","WOY WOY","SHORT RURAL",278,916.89263462114195,5238.5175321381903,0.52651130000000002,126.83015714169535,124.54888057150001,2,30916.083333333299,30783.333333333299,68.705035971223026,68.345323741007206,2,30360,30360,37.410071942446002,37.410071942446002]
[null,"ZN12660:PA6","WOY WOY","SHORT RURAL",492,2481.64566527941,3721.8408781847902,1.1063401999999998,50.637409917165435,0,5,5874.2500000001,5874.2500000001,6.0975609756097597,6.0975609756097597,0,0,0,0,0]
[null,"ZN12660:PA8","WOY WOY","URBAN",1328,3598.2449665445802,1420.9016137732799,2.6487422,104.47702412488545,0,3,5062.3333333333003,5062.3333333333003,6.25,6.25,0,0,0,0,0]
[null,"ZN12690:PA10","BERKELEY VALE","SHORT RURAL",707,4313.0550919733896,1212.2838490855099,1.6509414,881.36203817795365,4.3736189255000006,5,68516.049999999988,67371.649999999994,105.37482319660513,105.233380480905,1,340,340,0.141442715700141,0.141442715700141]
[null,"ZN12690:PA11","BERKELEY VALE","URBAN",204,0,4982.8063060440199,3.9731132999999996,0,86.370516750374989,0,0,0,0,0,1,2790,2790,4.4117647058823497,4.4117647058823497]
[null,"ZN12690:PA12","BERKELEY VALE","SHORT RURAL",1045,15699.652425738001,2480.9733257553698,3.3018828,18885.865810423547,432.98827362449998,12,734082.51666666672,42130.516666666699,196.93779904306248,27.655502392344498,1,16830,16830,3.2535885167464098,3.2535885167464098]
[null,"ZN12690:PA14","BERKELEY VALE","SHORT RURAL",271,0,6001.4247827896797,1.0701604,9.0672424032822221,4.7528498765,2,1087.4166666666999,1087.4166666666999,0.73800738007380096,0.73800738007380096,1,570,570,0.73800738007380096,0.73800738007380096]
[null,"ZN12690:PA16","BERKELEY VALE","SHORT RURAL",373,13181.9540031699,5278.5969713335098,3.7550823999999996,1671.4647004376891,627.44532361316669,7,57127.783333333398,47645.883333333397,62.466487935656843,57.908847184986598,2,21445,21445,13.136729222520099,13.136729222520099]
[null,"ZN12690:PA17","BERKELEY VALE","URBAN",141,2003.45334869714,4693.3201751283696,2.0136915000000002,245.43887238131256,13.807211385000004,1,15643,15643,113.47517730496499,113.47517730496499,1,880,880,2.12765957446809,2.12765957446809]
[null,"ZN12690:PA19","BERKELEY VALE","URBAN",1216,4358.1157024791601,5675.1969657306099,3.1200316999999997,33286.342588839521,214.41637850325,18,1369230.95,69052.95,202.5493421052627,102.63157894736801,1,8820,8820,1.7269736842105299,1.7269736842105299]
[null,"ZN12690:PA22","BERKELEY VALE","URBAN",318,0,6628.7866187359996,4.5529421999999995,1838.1730132325999,252.75943182187498,2,51816,51816,109.11949685534601,109.11949685534601,1,7125,7125,4.7169811320754702,4.7169811320754702]
[null,"ZN12690:PA24","BERKELEY VALE","SHORT RURAL",892,29983.496894593001,4128.5013227748505,2.7211018,9285.1811273747044,1282.7160505958336,20,437940.616666666,183153.433333333,343.72197309417095,161.88340807174899,12,60500,60500,20.179372197309402,20.179372197309402]
[null,"ZN12690:PA26","BERKELEY VALE","URBAN",294,8394.3455992159597,2981.2547852020002,5.9315829999999998,257.56688145970827,54.53596269916666,5,5573,1920,8.5034013605442098,6.1224489795918293,1,1180,1180,0.68027210884353706,0.68027210884353706]
[null,"ZN12690:PA3","BERKELEY VALE","SHORT RURAL",612,2306.5840423980999,5257.6409648016697,1.5052700999999999,218.8923189393619,1065.8917929439999,5,18663.183333333302,15919.25,11.764705882352915,11.437908496732,4,90880,90880,41.993464052287599,41.993464052287599]
[null,"ZN12690:PA4","BERKELEY VALE","URBAN",49,0,4824.4680317653902,2.9020007999999997,0,5.426741496,0,0,0,0,0,1,240,240,8.1632653061224492,8.1632653061224492]
[null,"ZN12690:PA6","BERKELEY VALE","URBAN",964,7152.73650710129,1420.84930671401,2.6849219999999998,13902.089939233927,409.30013749624999,8,664535.30000000005,109653.96666666699,214.21161825726162,145.22821576763499,2,19565,19565,5.3941908713692994,5.3941908713692994]
[null,"ZN12690:PA7","BERKELEY VALE","SHORT RURAL",786,7299.6602212799498,8535.7624384476094,4.0454728999999992,2417.2417581384379,0,5,76686.766666666605,34588.766666666597,112.97709923664161,100.254452926209,0,0,0,0,0]
[null,"ZN12690:PA8","BERKELEY VALE","SHORT RURAL",956,5500.64760302583,1458.4374075686301,1.8137504999999998,1291.3809937725919,917.67046625718751,26,91379.016666666605,18399.3999999999,22.071129707112949,17.259414225941399,2,64935,64935,17.050209205020899,17.050209205020899]
[null,"ZN1285:PA17","GREENACRE PARK","URBAN",951,0,4578.7255065321697,5.1337232000000004,9074.7389702955334,0,4,226867,225124,11.67192429022087,11.5667718191378,0,0,0,0,0]
[null,"ZN1285:PA20","GREENACRE PARK","URBAN",1100,1172.2874609635301,7641.6222422638702,5.3327120999999993,9891.4621329416404,0,11,238057.56666666659,141267.15,129.99999999999972,124.272727272727,0,0,0,0,0]
[null,"ZN1285:PA21","GREENACRE PARK","URBAN",140,0,3770.6781927818301,7.2359599999999996E-2,0,1.9789446105000001,0,0,0,0,0,1,3510,3510,12.8571428571429,12.8571428571429]
[null,"ZN1285:PA22","GREENACRE PARK","URBAN",609,0,2267.2361215988899,3.5189615999999999,704.98642096960009,0,2,25712,25712,38.916256157635502,38.916256157635502,0,0,0,0,0]
[null,"ZN1285:PA24","GREENACRE PARK","URBAN",1515,2969.9331706788798,3252.78251259032,3.5008716999999998,19153.830231259577,9.0016163586250002,7,702181,428439,209.50495049504977,109.63696369636999,1,330,330,6.6006600660066E-2,6.6006600660066E-2]
[null,"ZN1285:PA27","GREENACRE PARK","URBAN",1999,2802.8726917558502,13128.886449247901,6.7113528999999996,16808.514220436438,0,7,321431.83333333302,321431.83333333302,117.208604302151,117.208604302151,0,0,0,0,0]
[null,"ZN1285:PA30","GREENACRE PARK","URBAN",37,0,3468.4110907960799,0.61696079999999998,11.045635575975002,0,1,2297.75,2297.75,35.135135135135101,35.135135135135101,0,0,0,0,0]
[null,"ZN1285:PA31","GREENACRE PARK","URBAN",1924,1776.55202446568,9052.5102074483093,7.9452745,26918.141423526282,0,8,434816.28333333298,428404.53333333298,207.74428274428311,207.64033264033301,0,0,0,0,0]
[null,"ZN1285:PA33","GREENACRE PARK","URBAN",2650,1624.0789974182401,7018.4160608735001,6.6389932999999992,2522.4422402286668,0,11,48762.800000000097,44763.800000000097,10.03773584905659,9.9245283018867791,0,0,0,0,0]
[null,"ZN1285:PA34","GREENACRE PARK","URBAN",8,0,3096.4089752164,2.8477310999999998,7.9435085925250011,7.7660000206250004,1,358,358,12.5,12.5,1,350,350,12.5,12.5]
[null,"ZN1285:PA35","GREENACRE PARK","URBAN",323,0,2753.3976062204501,1.6871212,348.59199818996672,0,1,26518,26518,101.54798761609899,101.54798761609899,0,0,0,0,0]
[null,"ZN1285:PA8","GREENACRE PARK","URBAN",209,0,2597.53215883956,0.7797698999999999,63.850315140487069,0,3,10509.1166666667,10509.1166666667,20.095693779904302,20.095693779904302,0,0,0,0,0]
[null,"ZN1287:PA11","REVESBY","URBAN",1374,1748.0270138332701,4027.6472263253299,3.8636217999999998,19774.387706701029,0,15,656867.94999999972,51506.716666666704,143.08588064046569,36.317321688500698,0,0,0,0,0]
[null,"ZN1287:PA12","REVESBY","URBAN",904,54.807414279298698,4659.6606331744497,2.3583516999999996,1340.2739636941349,0,8,72938.133333333302,52226.133333333302,44.800884955752252,40.154867256637203,0,0,0,0,0]
[null,"ZN1287:PA15","REVESBY","URBAN",1876,4109.4289664061598,2441.1850215794102,5.2422626000000001,1428.4037406402961,0,12,34970.5,716.2,2.9317697228145043,0.26652452025586404,0,0,0,0,0]
[null,"ZN1287:PA16","REVESBY","URBAN",539,2.79213225787925,2922.9246725973999,3.4285120999999998,4.0070735168749998,0,1,150,150,0.55658627087198498,0.55658627087198498,0,0,0,0,0]
[null,"ZN1287:PA17","REVESBY","URBAN",1220,2757.64371508661,3265.1645218538401,3.4466019999999999,30493.672766060234,594.56469451500004,8,1135502.8666666669,142540.86666666699,309.42622950819703,110.16393442623,1,22140,22140,3.3606557377049198,3.3606557377049198]
[null,"ZN1287:PA18","REVESBY","URBAN",254,280.55297568991,2602.92878846645,2.6306522999999999,317.63638011740255,20.08722252075,2,15496.6,15496.6,32.677165354330704,32.677165354330704,1,980,980,1.5748031496063,1.5748031496063]
[null,"ZN1287:PA20","REVESBY","URBAN",43,0,22.221154357953601,9.0449500000000002E-2,7.6296254944632187,0,1,10825.9666666667,10825.9666666667,100,100,0,0,0,0,0]
[null,"ZN1287:PA21","REVESBY","URBAN",1578,1885.61381666945,6643.76367736673,3.8093520999999999,16065.425362202424,0,6,541266,0,123.700887198986,0,0,0,0,0,0]
[null,"ZN1287:PA22","REVESBY","SHORT RURAL",959,794.33021843902202,4540.9849866401601,3.6646329,200.44625804774998,0,1,7020,7020,5.4223149113660103,5.4223149113660103,0,0,0,0,0]
[null,"ZN1287:PA23","REVESBY","URBAN",900,43.263075015231998,4218.5237705101299,2.6125623999999998,135.178501574655,0,4,6640.65,6640.65,7.7777777777777803,7.7777777777777803,0,0,0,0,0]
[null,"ZN1287:PA24","REVESBY","URBAN",1157,1082.48807932977,4757.9701364496696,6.2219734999999998,17.640897894837622,0,2,363.88333333330002,363.88333333330002,0.17286084701814999,0.17286084701814999,0,0,0,0,0]
[null,"ZN1287:PA3","REVESBY","URBAN",1541,4104.68460419238,4779.6539195674204,3.8274419999999996,6135.137419837708,0,6,205724.16666666669,136138.25,109.14990266061051,104.54250486697001,0,0,0,0,0]
[null,"ZN1287:PA4","REVESBY","URBAN",984,3408.1034890556498,4159.7005820288596,2.8477310999999998,9357.9368328528708,0,14,421745.7999999997,420595.683333333,128.25203252032514,128.15040650406499,0,0,0,0,0]
[null,"ZN1287:PA5","REVESBY","URBAN",1125,1773.3474522430399,7602.3326956117198,3.1562114999999999,178.54432232496816,0,4,7260.2166666665998,7260.2166666665998,8.9777777777777796,8.9777777777777796,0,0,0,0,0]
[null,"ZN1287:PA6","REVESBY","URBAN",870,2038.27467649132,2569.59939762454,1.7594808,647.18052307485493,0,7,47207.45,13622.3,19.080459770114992,14.827586206896601,0,0,0,0,0]
[null,"ZN129:PA11","HUNTERS HILL","URBAN",183,0,1858.3088305864201,0.92544119999999996,0.66338710020000002,0.43264376100000007,1,92,92,0.54644808743169404,0.54644808743169404,1,60,60,0.54644808743169404,0.54644808743169404]
[null,"ZN129:PA12","HUNTERS HILL","URBAN",1397,179.531138839677,8413.7101621682996,3.9731132999999996,7546.5511517040286,53.865483564750001,9,243773.9,224425.9,122.69148174659944,118.110236220472,2,1740,1740,0.93056549749463091,0.93056549749463091]
[null,"ZN129:PA16","HUNTERS HILL","URBAN",1353,340.92091602151601,3167.9785695519599,3.4827817999999997,3378.2487236151451,200.67571057737499,4,124490.15,124490.15,111.97339246119699,111.97339246119699,3,7395,7395,1.9216555801921598,1.9216555801921598]
[null,"ZN129:PA18","HUNTERS HILL","URBAN",874,0,9726.8294334587408,3.9912031999999997,1340.7044353341937,1287.6178628646667,5,43112.0666666666,43112.0666666666,8.6956521739130412,8.6956521739130412,4,41405,39245,10.86956521739134,10.183066361556101]
[null,"ZN129:PA19","HUNTERS HILL","URBAN",1712,5942.3134276335904,2257.3333021625599,4.5891219999999997,11973.118709855315,0,10,334847.69999999972,309429.683333333,111.91588785046692,106.54205607476599,0,0,0,0,0]
[null,"ZN129:PA2","HUNTERS HILL","URBAN",986,0,3855.3741952355099,2.8115512999999996,178.82378655446536,0,6,8162.9833333335,8162.9833333335,7.3022312373225091,7.3022312373225091,0,0,0,0,0]
[null,"ZN129:PA21","HUNTERS HILL","URBAN",706,559.49215854364195,6232.1600629168997,4.8252427999999989,5561.5727435871386,0,4,147927.2166666667,144819,212.03966005665711,211.89801699716702,0,0,0,0,0]
[null,"ZN129:PA24","HUNTERS HILL","URBAN",1575,1378.6846337667901,8056.6544067410596,3.7550823999999996,7245.0931578757682,0,12,247624.80000000028,246601.11666666699,119.23809523809507,118.15873015872999,0,0,0,0,0]
[null,"ZN129:PA25","HUNTERS HILL","URBAN",104,0,4011.5720484957501,2.3221718999999998,4.9573419323512722,4.1615255591250007,1,273.98333333329998,273.98333333329998,0.9615384615384619,0.9615384615384619,1,230,0,0.9615384615384619,0]
[null,"ZN129:PA27","HUNTERS HILL","URBAN",208,1127.9009790207101,4525.3208163670897,3.3199727000000001,2985.7415955909523,300.32888040787498,5,115421.6666666667,5195.6666666666997,55.769230769230703,27.4038461538461,2,11610,11610,18.75,18.75]
[null,"ZN129:PA28","HUNTERS HILL","URBAN",996,0,6845.3709252765102,3.8455318999999997,5474.5260380955115,0,3,182708.91666666669,9156.5166666666992,19.779116465863471,10.040160642570301,0,0,0,0,0]
[null,"ZN129:PA3","HUNTERS HILL","URBAN",1294,676.40484529996104,6456.7375258762704,4.6805235999999999,3268.7801420783944,0,9,89631.55,84972.033333333296,15.224111282843882,15.069551777434301,0,0,0,0,0]
[null,"ZN129:PA4","HUNTERS HILL","URBAN",442,0,6162.6987957454103,2.2679022,8.2165986460748286,74.217099494999999,1,464.98333333329998,464.98333333329998,0.22624434389140299,0.22624434389140299,1,4200,4200,5.4298642533936698,5.4298642533936698]
[null,"ZN129:PA5","HUNTERS HILL","URBAN",955,182.56072797267001,3409.7275439979198,2.4307113,94.468242591339376,912.85494535028761,1,4987.95,4987.95,3.4554973821989501,3.4554973821989501,7,48199,48199,11.518324607329799,11.518324607329799]
[null,"ZN129:PA8","HUNTERS HILL","URBAN",1227,1408.1875349490299,5992.87293854773,3.7189025999999998,10788.394295295828,75.049004010749996,9,372315.95,203698.066666667,226.56886715566401,126.65036674816601,1,2590,2590,0.57049714751426206,0.57049714751426206]
[null,"ZN129:PA9","HUNTERS HILL","URBAN",1076,2401.2452418173798,6936.3008548121097,3.4104221999999997,4342.7838148870951,39.859309462500001,11,163429.21666666699,163429.21666666699,156.970260223048,156.970260223048,1,1500,1500,0.27881040892193298,0.27881040892193298]
[null,"ZN1290:PA1","LEIGHTONFIELD","URBAN",1134,1699.3643331425201,3519.3997003122699,2.5573405999999999,1747.6150137811298,594.19169505850016,4,87705.5,84840.333333333299,10.317460317460309,10.1410934744268,1,29820,29820,6.2610229276895897,6.2610229276895897]
[null,"ZN1290:PA10","LEIGHTONFIELD","URBAN",37,0,2342.8258193175898,0.96162099999999995,13.209507204208334,0,1,1763,1763,91.891891891891902,91.891891891891902,0,0,0,0,0]
[null,"ZN1290:PA11","LEIGHTONFIELD","URBAN",7,957.81307671371701,803.98244128873705,2.1041409999999998,0,5.4102725462500008,0,0,0,0,0,1,330,330,14.285714285714299,14.285714285714299]
[null,"ZN1290:PA12","LEIGHTONFIELD","URBAN",1052,5868.9823571567204,1886.4951596892499,4.3539532999999997,1469.9395644591939,47.833619442124998,10,43329.666666666701,24791.3,17.300380228136902,14.068441064638801,1,1410,1410,0.28517110266159701,0.28517110266159701]
[null,"ZN1290:PA13","LEIGHTONFIELD","URBAN",161,0,4009.3042795191,2.9572225999999997,242.421649510425,1.3825015654999999,1,10521,10521,39.130434782608695,39.130434782608695,1,60,60,0.62111801242236009,0.62111801242236009]
[null,"ZN1290:PA16","LEIGHTONFIELD","URBAN",26,300.16802002111001,2472.4085109202701,2.0498713,0,7.6665186620000005,0,0,0,0,0,1,480,480,3.8461538461538498,3.8461538461538498]
[null,"ZN1290:PA2","LEIGHTONFIELD","URBAN",644,1.6503096991945301,5936.8551242883505,2.3040819999999997,1337.58709460203,0,6,74506.433333333305,1646.3333333333001,15.83850931677016,0.62111801242236009,0,0,0,0,0]
[null,"ZN1290:PA4","LEIGHTONFIELD","URBAN",1170,3595.0184997414099,3496.20795399899,3.4827817999999997,35386.914191363801,390.76811795999998,13,1304025.4333333299,184194.7,323.07692307692298,209.23076923076903,1,14400,14400,3.41880341880342,3.41880341880342]
[null,"ZN1290:PA9","LEIGHTONFIELD","URBAN",75,38.693375484536602,3105.2585538716298,1.3605509,1337.1519755529375,0,1,126135,0,72,0,0,0,0,0,0]
[null,"ZN13000:PA1","LAKE MUNMORAH","URBAN",670,3515.8122676971798,1282.2888552910699,1.2701013999999999,34.99001817651083,70.272964072574993,2,3535.7,250.7,98.208955223880579,0.14925373134328399,2,7101,7101,2.6865671641790998,2.6865671641790998]
[null,"ZN13000:PA10","LAKE MUNMORAH","SHORT RURAL",845,5980.7019926744697,2205.20307217652,1.9051520999999998,49.951103528562506,0,1,3365,0,99.526627218934905,0,0,0,0,0,0]
[null,"ZN13000:PA11","LAKE MUNMORAH","SHORT RURAL",1592,15140.6309138901,3212.3080636833301,4.3539532999999997,4493.2080711957924,811.13605734837483,7,132447.08333333299,126098.08333333299,176.57035175879398,76.884422110552791,3,23910,23910,141.01758793969901,141.01758793969901]
[null,"ZN13000:PA2","LAKE MUNMORAH","SHORT RURAL",1369,9356.0875377997709,1585.9884621282999,2.8115512999999996,154.40040467408792,2068.5373662903125,3,7048.1,218.1,100,0.21913805697589497,3,94425,94425,14.974433893352801,14.974433893352801]
[null,"ZN13000:PA4","LAKE MUNMORAH","SHORT RURAL",195,12629.2413970628,888.95183249651802,4.0816526999999994,77.312794685912479,72.510560215499979,2,2431,1701,171.7948717948718,96.923076923076906,2,2280,2280,5.1282051282051304,5.1282051282051304]
[null,"ZN13000:PA5","LAKE MUNMORAH","SHORT RURAL",1634,10801.5307824833,14333.9517974153,3.9359814000000002,754.96847796340433,1225.1808102462501,8,24617.583333333401,16452.583333333401,109.48592411260711,9.5471236230110197,3,39950,39950,5.6303549571603302,5.6303549571603302]
[null,"ZN13000:PA7","LAKE MUNMORAH","SHORT RURAL",1397,14808.468685305999,4613.7192773221304,0.23612079999999999,48.026732467553835,81.226047118333327,4,26104.683333333302,19248.683333333302,194.70293486041518,95.060844667143897,2,44150,44150,7.65926986399427,7.65926986399427]
[null,"ZN13000:PA8","LAKE MUNMORAH","SHORT RURAL",133,2030.86000130446,6917.2817895640001,0.76168000000000002,3.1810295733333338,270.44686130000002,1,536,0,100.75187969924799,0,1,45570,45570,73.684210526315795,73.684210526315795]
[null,"ZN14143:PA10","SOMERSBY","SHORT RURAL",58,2595.0362799190798,1118.1793958886301,0.5446011999999999,2.9533723075999996,17.037054331916664,1,696,696,100,100,2,4015,3135,22.41379310344827,18.965517241379303]
[null,"ZN14143:PA12","SOMERSBY","SHORT RURAL",1334,11127.485418259301,9735.2425333309093,4.5710321,580.78527918105101,193.57273415310416,6,16306.8833333333,16306.8833333333,104.42278860569701,104.42278860569701,4,5435,5435,1.72413793103449,1.72413793103449]
[null,"ZN14143:PA14","SOMERSBY","URBAN",69,0,3446.8714951264601,1.9232419999999999,157.91467602716665,0,4,10538,10538,385.50724637681202,385.50724637681202,0,0,0,0,0]
[null,"ZN14143:PA17","SOMERSBY","SHORT RURAL",739,62869.009588365298,2120.0662697626799,2.7391916999999997,10092.265354362456,12013.751370040613,17,472863.58333333331,472632.9,543.97834912043265,543.84303112313899,19,562893,486240,153.58592692828191,130.98782138024401]
[null,"ZN14143:PA21","SOMERSBY","URBAN",42,1968.55477084378,1530.87435288253,1.1063401999999998,2.5515892812666658,92.796819637958322,1,296,296,88.095238095238102,88.095238095238102,3,10765,10765,45.238095238095198,45.238095238095198]
[null,"ZN14143:PA5","SOMERSBY","SHORT RURAL",1027,600.39386803309401,7613.8405721917698,3.6646329,363.25887391502499,15.418942926749999,2,12722,12722,100.48685491723499,100.48685491723499,1,540,540,9.7370983446932791E-2,9.7370983446932791E-2]
[null,"ZN14143:PA6","SOMERSBY","URBAN",51,6223.3450182715897,5721.7873052257901,4.1359224000000001,545.81737180598952,262.63968890500007,10,16937.316666666698,16937.316666666698,458.82352941176396,458.82352941176396,3,8150,8150,45.098039215686299,45.098039215686299]
[null,"ZN14143:PA8","SOMERSBY","URBAN",32,0,1180.05153756664,1.5414498999999999,4.4678925351499998,0,1,372,372,96.875,96.875,0,0,0,0,0]
[null,"ZN14144:PA1","WAMBERAL","URBAN",1196,3984.7732619462299,2985.8674537658599,2.9200906999999998,851.02901515020505,454.59241994924997,6,37403.966666666704,37403.966666666704,8.5284280936454913,8.5284280936454913,1,19980,19980,3.09364548494983,3.09364548494983]
[null,"ZN14144:PA10","WAMBERAL","SHORT RURAL",673,14656.1400704467,6035.1345791359499,2.9934023999999999,7834.5362315718849,1245.4799035799999,24,335906.05,216413.96666666699,461.81277860326901,361.66419019316498,3,53400,53400,17.087667161961402,17.087667161961402]
[null,"ZN14144:PA2","WAMBERAL","SHORT RURAL",1022,9972.4301978008098,3602.1693004618501,2.9200906999999998,2737.5276433563904,307.83961170737501,13,120318.33333333369,112857.21666666699,42.074363992172195,25.733855185909999,2,13530,13530,4.3052837573385601,4.3052837573385601]
[null,"ZN14144:PA4","WAMBERAL","URBAN",833,2785.83239872385,2056.2004645153602,1.7052110999999999,101.16248453460918,384.90806504287497,7,7613.9666666666999,6650.5166666667001,109.48379351740705,109.12364945978399,2,28970,28970,9.8439375750300098,9.8439375750300098]
[null,"ZN14144:PA5","WAMBERAL","SHORT RURAL",277,5358.6429116735999,751.514322291908,0.7978597999999999,10.238835080924998,332.12493272520828,4,1647,1647,3.2490974729241904,3.2490974729241904,6,53425,53425,54.5126353790614,54.5126353790614]
[null,"ZN14144:PA7","WAMBERAL","SHORT RURAL",1024,5706.8885992078403,3838.65436644691,2.4307113,52.786648290067497,0,8,2787.1499999999,2787.1499999999,0.78125,0.78125,0,0,0,0,0]
[null,"ZN14144:PA8","WAMBERAL","URBAN",477,1438.7067369399399,1716.92595254548,0.90735129999999986,48.316282816000829,301.80886035162501,2,6834.2,6834.2,11.740041928721199,11.740041928721199,2,42690,42690,19.4968553459119,19.4968553459119]
[null,"ZN14891:PA1","WYONG","SHORT RURAL",1306,8284.2842904919908,8788.2419518076294,4.8976024000000002,3702.5395369354269,0,10,97025.483333333294,97017.483333333294,100.7656967840737,100.61255742725901,0,0,0,0,0]
[null,"ZN14891:PA10","WYONG","URBAN",1028,10213.340296009001,3828.4698063280898,2.9753124999999998,331.15323996180479,1280.3773855468751,4,14284.5333333333,464.53333333329999,4.0856031128404586,0.19455252918287899,2,55230,55230,12.2568093385214,12.2568093385214]
[null,"ZN14891:PA12","WYONG","SHORT RURAL",706,68729.504215699199,2628.9250679801598,2.6125623999999998,13716.421645664766,2029.6690400231967,27,673819.83333333302,160625.83333333299,230.45325779036833,163.31444759206798,23,99707.583333333299,99182.583333333299,38.668555240793154,38.243626062322903]
[null,"ZN14891:PA14","WYONG","URBAN",463,6700.3282199088799,12931.7440227351,4.4082229999999996,3408.7972539780444,195.95194100854167,8,99244.683333333393,93111.116666666698,214.90280777537768,209.935205183585,4,5705,5705,3.4557235421166399,3.4557235421166399]
[null,"ZN14891:PA16","WYONG","SHORT RURAL",1751,6386.6580343235501,11352.8209581971,3.7189025999999998,403.1102226433041,2995.0347890174248,6,13911.6500000001,13911.6500000001,6.1107938320959505,6.1107938320959505,9,103361,103361,15.4768703597944,15.4768703597944]
[null,"ZN14891:PA17","WYONG","SHORT RURAL",810,5469.8301003660299,6411.1997798940502,1.52336,401.78995021611075,19.940782400000003,3,33850.583333333299,33713,51.358024691358054,51.234567901234598,1,1680,1680,0.49382716049382697,0.49382716049382697]
[null,"ZN14891:PA19","WYONG","SHORT RURAL",180,1797.9673760782,3244.4359697825798,1.0339806,582.52032841337507,0,2,72305,50964,195,97.7777777777778,0,0,0,0,0]
[null,"ZN14891:PA20","WYONG","SHORT RURAL",530,31886.301182658499,5004.6611702739901,2.5211608000000001,4286.6117616847196,492.73156986570001,15,218214.316666667,209888.61666666699,313.20754716981122,311.13207547169799,12,25083,25083,23.018867924528301,23.018867924528301]
[null,"ZN14891:PA21","WYONG","SHORT RURAL",320,14247.435934151499,974.69787311738799,1.0520704999999999,2085.0194411256034,605.04061570631245,6,254351.85,244295.35,109.0625,104.375,6,73809,73809,50,50]
[null,"ZN14891:PA5","WYONG","SHORT RURAL",1453,63789.155380586897,2847.5821154740702,4.4624927000000003,5471.1907041069881,8564.8875265686329,31,157352.61666666632,154621.88333333301,77.907777013076412,77.150722642808006,30,246328,246328,38.609772883688898,38.609772883688898]
[null,"ZN14891:PA6","WYONG","URBAN",195,2842.62621784464,5007.2752856336001,3.4466019999999999,0,82.981251402499993,0,0,0,0,0,2,3090,3090,5.1282051282051304,5.1282051282051304]
[null,"ZN14891:PA8","WYONG","SHORT RURAL",1363,16681.9280049544,8173.6064059600403,3.5189615999999999,1144.6606490206059,783.07452484800001,4,41747.633333333302,41705.050000000003,5.6493030080704321,5.5759354365370504,3,28560,28560,5.0623624358033803,5.0623624358033803]
[null,"ZN14891:PA9","WYONG","URBAN",1293,3244.6754677838799,5450.3880315418301,3.1200316999999997,58.3478341562653,0,2,2400.1333333333,2400.1333333333,0.154679040989946,0.154679040989946,0,0,0,0,0]
[null,"ZN14892:PA1","CHARMHAVEN","SHORT RURAL",940,4920.5870465903299,13001.2672586401,4.0816526999999994,2854.6071835996272,1850.4504149731874,7,89759.4,89759.4,103.191489361702,103.191489361702,3,58185,58185,17.978723404255302,17.978723404255302]
[null,"ZN14892:PA10","CHARMHAVEN","URBAN",973,1.9300777040285799,7003.70071487306,3.5913211999999994,350.89901614899998,1377.3485943290332,2,12540,12540,1.2332990750257,1.2332990750257,3,49222,49222,18.807810894141799,18.807810894141799]
[null,"ZN14892:PA12","CHARMHAVEN","SHORT RURAL",216,0,2361.0516719853899,0.96162099999999995,27.797658382083334,0,1,3710,3710,16.203703703703702,16.203703703703702,0,0,0,0,0]
[null,"ZN14892:PA13","CHARMHAVEN","SHORT RURAL",1101,4674.9632599950601,2375.9548710559902,2.0136915000000002,49.382746719487507,36.479280079687513,3,3147.4,616.76666666669996,0.27247956403269752,0.18165304268846499,1,2325,2325,0.45413260672116307,0.45413260672116307]
[null,"ZN14892:PA14","CHARMHAVEN","SHORT RURAL",860,3826.2724153459098,9679.7403324115894,3.0295821999999997,15693.782635587098,262.37507294212497,6,664836,379257,572.20930232558101,474.30232558139494,8,11115,11115,3.4883720930232598,3.4883720930232598]
[null,"ZN14892:PA16","CHARMHAVEN","SHORT RURAL",2243,10440.756160736,5022.0672604226302,4.2082819999999996,31212.662930354669,868.10282219375006,17,951909.41666666698,248210.41666666701,206.10789121711952,106.41997325011101,3,26475,26475,2.8533214444939801,2.8533214444939801]
[null,"ZN14892:PA17","CHARMHAVEN","URBAN",513,1566.64639182472,4659.9743421540697,4.625301799999999,14.608932222907587,111.72031056083331,1,405.36666666669998,405.36666666669998,0.19493177387914201,0.19493177387914201,2,3100,3100,1.9493177387914202,1.9493177387914202]
[null,"ZN14892:PA19","CHARMHAVEN","URBAN",1758,6980.8229549083098,1760.04623282441,3.5189615999999999,317.39240672190152,338.07103961400003,8,11575.8166666666,8791.8166666666002,4.4368600682593895,3.8111490329920401,3,12330,12330,9.8407281001137701,9.8407281001137701]
[null,"ZN14892:PA20","CHARMHAVEN","URBAN",11,0,2707.83704741157,4.2987314999999997,0,2.5120712203125,0,0,0,0,0,1,75,75,45.454545454545496,45.454545454545496]
[null,"ZN14892:PA21","CHARMHAVEN","URBAN",1074,239.168539636834,6032.9948449539997,2.9391327,2937.7618007429451,18.549601252875004,3,128282.383333333,128282.383333333,100.186219739292,100.186219739292,1,810,810,0.27932960893854702,0.27932960893854702]
[null,"ZN14892:PA3","CHARMHAVEN","SHORT RURAL",1216,4985.2569745276196,2967.8094752882898,2.4668911000000002,320.12833127620803,0,6,16654.9666666667,16654.9666666667,102.796052631579,102.796052631579,0,0,0,0,0]
[null,"ZN14892:PA5","CHARMHAVEN","URBAN",295,6988.2986208964603,2885.8896865999,3.6827227999999996,853.8062901215834,1074.8403970887,3,29755,29755,100,100,6,37458,37458,44.406779661016898,44.406779661016898]
[null,"ZN14892:PA6","CHARMHAVEN","SHORT RURAL",1673,3522.4442343873402,10490.5848964901,3.5732312999999998,91.617784528173743,677.79954548831245,8,3290.7,3290.7,2.03227734608488,2.03227734608488,2,24345,24345,4.6025104602510396,4.6025104602510396]
[null,"ZN14892:PA8","CHARMHAVEN","URBAN",879,3702.1435765567498,3221.4990596590101,1.8318403999999999,1963.817057696263,216.665502911,4,137588.7833333333,137433.35,99.772468714448294,99.658703071672406,1,15180,15180,4.0955631399317394,4.0955631399317394]
[null,"ZN14892:PA9","CHARMHAVEN","URBAN",697,697.90942735891804,4276.0246114378097,1.9594217999999997,1623.2074123176076,270.22875899249999,3,106320.183333333,106316.183333333,99.856527977044436,99.713055954088901,2,17700,17700,6.0258249641319903,6.0258249641319903]
[null,"ZN15001:PA10","BROOKVALE","URBAN",317,0,2779.7386907709301,3.5189615999999999,37.700541725000001,12.338359110000001,1,1375,1375,7.8864353312302811,7.8864353312302811,1,450,450,0.94637223974763407,0.94637223974763407]
[null,"ZN15001:PA15","BROOKVALE","URBAN",2866,0,5114.5077575236,4.3539532999999997,5630.1928506034255,0,5,165962.183333333,165962.183333333,134.089323098395,134.089323098395,0,0,0,0,0]
[null,"ZN15001:PA16","BROOKVALE","URBAN",546,0,4187.4495933018197,3.8998016,106.18523601664,275.44867421866667,3,3494.55,3494.55,5.1282051282051304,5.1282051282051304,2,9065,9065,3.84615384615384,3.84615384615384]
[null,"ZN15001:PA17","BROOKVALE","URBAN",9,0,1513.79053108791,0.45319959999999998,2.8249441733333332E-2,5.4062369117166664,1,8,8,11.1111111111111,11.1111111111111,3,1531,1531,33.3333333333333,33.3333333333333]
[null,"ZN15001:PA18","BROOKVALE","URBAN",2345,2753.3764721449002,5449.2216066834599,5.9677627999999991,27536.324412840295,818.28620766969993,10,592194.06666666595,140594.63333333301,245.24520255863581,148.52878464818801,2,17598,17598,7.4200426439232396,7.4200426439232396]
[null,"ZN15001:PA2","BROOKVALE","URBAN",2286,95.129012172930501,8909.6453659500203,6.7294427999999993,20958.878869002961,1178.8116365223,13,399722.4833333334,36036.583333333401,119.24759405074361,103.01837270341201,4,22482,22482,1.9247594050743702,1.9247594050743702]
[null,"ZN15001:PA3","BROOKVALE","URBAN",407,0,2588.9777381520298,3.5732312999999998,124.3119725038125,564.20652246131249,1,4465,4465,4.6683046683046703,4.6683046683046703,5,20265,20265,24.815724815724799,24.815724815724799]
[null,"ZN15001:PA6","BROOKVALE","URBAN",1238,504.04713703510203,4717.5614024449396,4.4444027999999998,4222.6391773273426,0,3,121938.316666667,121938.316666667,104.927302100162,104.927302100162,0,0,0,0,0]
[null,"ZN15001:PA8","BROOKVALE","URBAN",687,3069.6115662554498,1720.77749394023,2.1765005999999998,1314.4005999630681,0,2,77506.583333333299,77506.583333333299,108.58806404657899,108.58806404657899,0,0,0,0,0]
[null,"ZN15002:PA2","NARRABEEN","SHORT RURAL",1218,9266.7890049048092,1525.93624821961,3.9912031999999997,7288.2809518757331,0,17,234364,158219.29999999999,166.09195402298832,143.67816091954001,0,0,0,0,0]
[null,"ZN15002:PA4","NARRABEEN","SHORT RURAL",683,1675.57912957915,2897.79167702222,1.2881912999999998,5919.2051950597179,0,10,589729.25000000023,4707.0833333333003,27.964860907759871,1.1713030746705699,0,0,0,0,0]
[null,"ZN15002:PA6","NARRABEEN","SHORT RURAL",1684,6100.6184636453099,5938.9147099525699,4.1359224000000001,24109.714375206571,45.438277467000006,17,748151.1,409066.566666667,219.1805225653209,204.03800475059398,1,1410,1410,5.9382422802850401E-2,5.9382422802850401E-2]
[null,"ZN15002:PA8","NARRABEEN","URBAN",1096,573.63645748917804,6056.1034312523298,3.8817116999999999,4948.9158490359014,0,12,163627.54999999999,112166.5,127.64598540145957,121.715328467153,0,0,0,0,0]
[null,"ZN15004:PA1","NEWPORT","URBAN",1756,1879.24545257451,2973.3167064470999,3.2285710999999999,4852.2242481538033,130.81093906833334,11,192885.75,88765.75,106.6059225512526,102.277904328018,1,5200,5200,3.7015945330296098,3.7015945330296098]
[null,"ZN15004:PA3","NEWPORT","URBAN",895,0,4595.9820635760798,1.9051520999999998,1968.4468134246918,0,10,132606.15,131179.9,119.55307262569843,119.44134078212301,0,0,0,0,0]
[null,"ZN15004:PA5","NEWPORT","URBAN",1729,2.3016712211707899,12330.291310970901,4.2444617999999998,11678.756035873383,0,26,353137.30000000005,211307.91666666701,209.54308849045674,201.85078079814903,0,0,0,0,0]
[null,"ZN15004:PA9","NEWPORT","URBAN",1929,1461.40339934145,8136.74602572599,3.9359814000000002,16762.011988231618,956.83707834000006,29,546566.16666666628,530407.33333333302,334.88854328667674,331.20787973043002,1,31200,31200,5.39139450492483,5.39139450492483]
[null,"ZN15005:PA10","BELROSE","URBAN",791,5933.8827280055802,7278.8734182445096,4.5710321,4785.8736401830956,18.876457976291665,10,134374.41666666672,133691.85,133.62831858407105,133.50189633375498,1,530,530,0.126422250316056,0.126422250316056]
[null,"ZN15005:PA12","BELROSE","URBAN",1453,6162.3787605815896,578.390284942471,3.8455318999999997,9499.0811050197699,0,17,317025.94999999995,282190.84999999998,132.00275292498307,122.98692360633201,0,0,0,0,0]
[null,"ZN15005:PA2","BELROSE","URBAN",1888,6823.2180361462397,6119.5632530309204,5.2422626000000001,11610.2286882383,59.635105627166674,21,284244.21666666667,251358.3,106.7796610169498,106.038135593221,2,1460,1460,0.68855932203389802,0.68855932203389802]
[null,"ZN15005:PA4","BELROSE","URBAN",1223,5943.0139138479099,2688.8272092081502,3.5008716999999998,11435.453386078127,431.88664183669584,13,419224.66666666698,418985.066666667,299.91823385118539,299.83646770237101,4,15833,15833,3.27064595257563,3.27064595257563]
[null,"ZN15005:PA6","BELROSE","URBAN",1269,6917.0027702011603,3702.3401990625998,4.4263129000000001,8045.1531025707718,773.91867900049999,11,233271.58333333299,233271.58333333299,181.63908589440501,181.63908589440501,1,22440,22440,5.20094562647754,5.20094562647754]
[null,"ZN15005:PA8","BELROSE","URBAN",1584,5099.17364795302,4809.2702453052898,4.8795124999999997,20698.162398950659,3138.1324103020834,16,544408.616666666,242881.33333333299,114.77272727272721,104.040404040404,3,82540,82540,10.4166666666667,10.4166666666667]
[null,"ZN15006:PA1","DEE WHY WEST","URBAN",736,0,7841.80276495217,2.3945314999999998,1396.9911397514384,0,4,74876.016666666692,18048,14.130434782608692,8.288043478260871,0,0,0,0,0]
[null,"ZN15006:PA12","DEE WHY WEST","URBAN",3603,5076.5093881336297,12561.464936373201,7.6367941000000004,6012.4856644775628,1961.8255823416252,14,101044.48333333331,97612.3,17.318900915903374,17.235636969192299,2,32970,32970,1.8040521787399399,1.8040521787399399]
[null,"ZN15006:PA13","DEE WHY WEST","URBAN",1321,1465.16428903833,6647.7801943458398,3.3199727000000001,6504.5143553939415,453.20947327700003,7,251449.04999999958,86234.116666666596,16.881150643451949,12.641937925813801,1,17520,17520,0.151400454201363,0.151400454201363]
[null,"ZN15006:PA15","DEE WHY WEST","URBAN",2050,849.37505758430495,7145.0010620535604,3.2285710999999999,75.3923816130375,0,5,2997,2997,2.8780487804878003,2.8780487804878003,0,0,0,0,0]
[null,"ZN15006:PA16","DEE WHY WEST","URBAN",2479,0,9318.2863684829499,4.6624337000000002,17469.723877703429,0,14,480886.96666666702,107300.96666666699,19.080274304154859,7.5030254134731607,0,0,0,0,0]
[null,"ZN15006:PA2","DEE WHY WEST","URBAN",2314,167.07203782069701,5784.4687781431703,4.5167623999999993,3019.5656507010813,0,7,85799.916666666701,850.88333333339995,1.944684528954193,0.129645635263613,0,0,0,0,0]
[null,"ZN15006:PA4","DEE WHY WEST","URBAN",1266,0,7326.0623246835503,2.4849809999999999,98.875045337819401,0,4,5106.6166666667004,876.8,0.31595576619273325,0.23696682464454999,0,0,0,0,0]
[null,"ZN15006:PA6","DEE WHY WEST","URBAN",640,1682.47215410073,1028.3460813449001,2.1765005999999998,16.097919890868749,0,1,949.25,0,0.15625,0,0,0,0,0,0]
[null,"ZN15006:PA8","DEE WHY WEST","URBAN",1902,5651.7919490250397,2652.7864665259799,3.3018828,7962.8884692029205,1.92953776125,21,309512.8,109816.45,85.278654048370115,80.914826498422698,1,75,75,0.26288117770767599,0.26288117770767599]
[null,"ZN15006:PA9","DEE WHY WEST","URBAN",2607,362.06069512715101,7362.3601109744804,5.3698439999999996,15511.155855353309,0,7,370725.21666666667,368972.35,204.71806674338336,204.67970847717697,0,0,0,0,0]
[null,"ZN15008:PA1","HARBORD","URBAN",2313,2345.65140406931,3998.11363101599,3.6646329,2046.8932271240749,0,8,71686,26351.733333333301,3.6748811067877196,1.4267185473411201,0,0,0,0,0]
[null,"ZN15008:PA10","HARBORD","URBAN",1752,3728.3258492957002,3521.6843457042901,3.7731722999999997,252.89719569929764,0,9,8602.1499999998996,863.26666666660003,0.51369863013698702,0.22831050228310501,0,0,0,0,0]
[null,"ZN15008:PA5","HARBORD","URBAN",2114,2396.0161494114,3123.3321574278398,4.6072119000000002,8513.7092403622028,1478.5969303117377,5,237164.8166666663,4541.0333333333001,102.03405865657582,1.8921475875118201,3,41189,41189,3.64238410596026,3.64238410596026]
[null,"ZN15008:PA7","HARBORD","URBAN",2654,4929.9617895106203,3302.6602333194401,5.1156332999999998,5534.6265490714477,1623.8682675022501,28,138854.04999999999,138854.04999999999,84.250188394875607,84.250188394875607,1,40740,40740,3.6548605877920104,3.6548605877920104]
[null,"ZN15008:PA9","HARBORD","URBAN",2221,7258.1326792294903,2691.7847532948499,4.6805235999999999,28340.750331628784,1692.5299896505001,12,777117.23333333328,2397.7833333333001,61.548851868527642,1.8009905447996399,2,46410,46410,4.0972534894191801,4.0972534894191801]
[null,"ZN15009:PA1","MANLY","URBAN",1989,323.79756752650297,3822.27244219658,6.4761841999999996,10701.292492141498,0,7,212073.63333333301,212073.63333333301,102.362996480644,102.362996480644,0,0,0,0,0]
[null,"ZN15009:PA11","MANLY","URBAN",2313,399.724210175922,4194.9413736634297,4.4444027999999998,11372.176083686965,0,5,328397.46666666702,191571.46666666699,103.24254215304785,101.38348465196701,0,0,0,0,0]
[null,"ZN15009:PA12","MANLY","URBAN",83,0,818.99229569013505,0.76168000000000002,40.391953873333343,0,1,6806,6806,100,100,0,0,0,0,0]
[null,"ZN15009:PA3","MANLY","URBAN",811,0,3263.7631312232502,1.7594808,6544.0047384976433,0,8,477340.96666666702,477340.96666666702,217.755856966708,217.755856966708,0,0,0,0,0]
[null,"ZN15009:PA5","MANLY","URBAN",1614,474.98813962880399,2641.1408956257701,3.5370514999999996,9999.1211400337925,16.535715762500001,8,362819.05,362819.05,248.32713754646801,248.32713754646801,1,600,600,1.2391573729863701,1.2391573729863701]
[null,"ZN15009:PA7","MANLY","URBAN",1580,1834.3764820343099,2231.7135523636398,3.0476720999999998,3125.5613267569156,0,8,131622.28333333301,130865.383333333,100.12658227848151,100.06329113924099,0,0,0,0,0]
[null,"ZN15009:PA9","MANLY","URBAN",635,0,573.85656695662499,2.1584106999999997,875.69330178595817,68.615876152999988,1,52070,52070,100,100,1,4080,4080,2.6771653543307101,2.6771653543307101]
[null,"ZN15010:PA1","CAREEL BAY","URBAN",1396,2.29955919911988,8697.2347545803896,2.8115512999999996,10722.104158415414,773.52453697337501,36,489444.71666666702,388233.51666666701,238.89684813753584,227.86532951289402,3,35310,35310,4.7277936962750697,4.7277936962750697]
[null,"ZN15010:PA11","CAREEL BAY","SHORT RURAL",471,0,3948.6995436401498,1.3243711,3213.9203655786546,0,15,311454.816666667,95146.8,236.7303609341823,214.22505307855602,0,0,0,0,0]
[null,"ZN15010:PA12","CAREEL BAY","URBAN",80,0,108.863288065633,0.81594969999999989,86.889429617970848,0,2,13667,13667,197.5,197.5,0,0,0,0,0]
[null,"ZN15010:PA5","CAREEL BAY","URBAN",907,0,4882.6953182677098,1.8861101,9042.2906414843237,0,26,615291.69999999995,201069.316666667,227.23263506063898,213.67144432193999,0,0,0,0,0]
[null,"ZN15010:PA7","CAREEL BAY","URBAN",1814,191.04176900912901,7374.9319463100701,4.1540122999999998,13890.215928962378,387.42914967487496,15,429151.71666666702,421202.71666666702,210.2535832414552,210.08820286659301,1,11970,11970,9.4266813671444289,9.4266813671444289]
[null,"ZN15010:PA9","CAREEL BAY","SHORT RURAL",1127,860.78757198326002,12618.9844320553,2.2307702999999997,8635.8034202642611,140.78949055874997,20,496841.11666666705,208437.71666666699,218.36734693877582,203.90417036379799,2,8100,6720,2.8393966282165031,2.4844720496894404]
[null,"ZN15011:PA1","BEACON HILL","URBAN",100,0,1398.42273371991,2.3040819999999997,39.57928538762917,0,1,2204.65,0,1,0,0,0,0,0,0]
[null,"ZN15011:PA10","BEACON HILL","URBAN",1482,2578.95834121401,8594.7347383297802,6.7294427999999993,1325.3914436399668,32.246648717249997,8,25277.533333333398,16376.6166666667,101.75438596491257,101.55195681511499,1,615,615,6.7476383265857004E-2,6.7476383265857004E-2]
[null,"ZN15011:PA2","BEACON HILL","URBAN",1599,6047.3120293811799,1874.8449802909399,3.8817116999999999,12460.579577072827,0,12,411988.03333333298,171963.83333333299,203.06441525953699,102.751719824891,0,0,0,0,0]
[null,"ZN15011:PA4","BEACON HILL","URBAN",60,319.220857222814,1318.1409957902099,3.1743014000000001,152.85054816350004,14.097866092750001,1,6180,0,100,0,1,570,0,31.6666666666667,0]
[null,"ZN15011:PA6","BEACON HILL","URBAN",1998,4096.6868529289204,4502.6114459831597,5.2965322999999991,1943.2459750826854,0,8,47087.516666666699,47087.516666666699,7.057057057057051,7.057057057057051,0,0,0,0,0]
[null,"ZN15012:PA2","KILLARNEY","URBAN",1306,0,6867.9223821695396,3.8998016,12405.948993333464,0,20,408279.0666666663,352903.03333333298,325.11485451761069,320.59724349157699,0,0,0,0,0]
[null,"ZN15012:PA4","KILLARNEY","URBAN",1182,4196.6473588581302,2980.6370489354399,2.7211018,4625.2380304260478,0,8,218151.86666666699,213667.316666667,204.99153976311334,204.90693739424702,0,0,0,0,0]
[null,"ZN15012:PA6","KILLARNEY","URBAN",1446,1072.0722711155699,9054.3263460907692,3.9731132999999996,8608.6711693960933,0,12,278083.23333333328,253218.4,208.29875518672165,202.76625172890701,0,0,0,0,0]
[null,"ZN15012:PA8","KILLARNEY","URBAN",1149,4538.76684649249,1657.60485131567,3.1381215999999998,9180.8753118302393,0,11,375477.53333333298,269568.05,212.09747606614405,204.351610095735,0,0,0,0,0]
[null,"ZN15013:PA10","TERREY HILLS","SHORT RURAL",626,25034.455410478,767.35434687238705,2.6125623999999998,4270.6447558493101,451.297294679,13,209795.6166666667,153570.79999999999,186.58146964856209,174.92012779552698,4,22170,22170,6.8690095846645303,6.8690095846645303]
[null,"ZN15013:PA4","TERREY HILLS","SHORT RURAL",819,8949.5286686495001,3053.6207693118999,3.6284530999999998,7967.4396702665845,323.42821449033335,10,281816.816666667,23945.5,55.4334554334554,23.687423687423699,3,11440,11440,5.6166056166056206,5.6166056166056206]
[null,"ZN15013:PA6","TERREY HILLS","SHORT RURAL",224,8489.7917186330997,213.098736093051,1.0158906999999999,1130.9788014571791,0,11,142881.86666666641,13175.983333333401,207.14285714285757,6.6964285714285694,0,0,0,0,0]
[null,"ZN15013:PA8","TERREY HILLS","SHORT RURAL",99,1801.72299956494,5629.7649319986704,2.0498713,187.28852553706145,0,2,11726.1166666667,11726.1166666667,18.181818181818198,18.181818181818198,0,0,0,0,0]
[null,"ZN15014:PA11","MONA VALE","URBAN",1211,2147.6843989920399,5042.5433427220596,3.0838518999999995,7398.1062888217775,0,8,307890.78333333309,64912.900000000103,183.07184145334429,92.072667217175891,0,0,0,0,0]
[null,"ZN15014:PA12","MONA VALE","SHORT RURAL",1820,5242.7278570281997,14893.745927517501,4.8976024000000002,20409.804874155147,75.557761026000009,41,534841.33333333302,181098.5,18.736263736263709,13.626373626373599,1,1980,1980,1.8131868131868099,1.8131868131868099]
[null,"ZN15014:PA14","MONA VALE","SHORT RURAL",852,7721.6855931080399,5455.2850015433596,2.2307702999999997,8264.8019652493331,106.20046756962499,12,475496.4,145859.4,130.63380281690141,53.755868544600901,1,6110,6110,1.5258215962441302,1.5258215962441302]
[null,"ZN15014:PA16","MONA VALE","URBAN",388,0,3688.5803996509599,2.2498122999999999,25.330542943520832,0,1,1445,1445,21.9072164948454,21.9072164948454,0,0,0,0,0]
[null,"ZN15014:PA18","MONA VALE","SHORT RURAL",699,557.63150895353601,4106.1713887763499,1.4690902999999997,1441.3041464293494,0,8,125914.8000000004,14205.333333333399,27.753934191702502,11.8741058655222,0,0,0,0,0]
[null,"ZN15014:PA19","MONA VALE","URBAN",1897,4080.4553661325399,7001.0125340824898,4.0454728999999992,1858.1536753427886,0,8,58949.75,52549.716666666602,7.7490774907749085,7.6436478650500792,0,0,0,0,0]
[null,"ZN15014:PA20","MONA VALE","URBAN",908,1800.3170162505501,3809.1041908310599,3.3561524999999999,620.15691386223182,0,7,23715.3499999999,22878.6499999999,12.444933920704818,12.2246696035242,0,0,0,0,0]
[null,"ZN15014:PA22","MONA VALE","URBAN",906,1872.31058528002,4414.8823874987602,3.2837928999999995,1976.2966654986199,0,5,77240.666666666701,564.38333333330002,4.1942604856512098,0.22075055187637999,0,0,0,0,0]
[null,"ZN15014:PA5","MONA VALE","URBAN",1649,769.80347777399095,5829.6351509474298,3.9540712999999994,5841.4491466279196,0,2,189603.23333333299,189603.23333333299,99.818071558520302,99.818071558520302,0,0,0,0,0]
[null,"ZN15014:PA7","MONA VALE","URBAN",398,0,3509.5419109455502,2.6849219999999998,34.609379204492363,0,2,1654.3666666667,1654.3666666667,7.7889447236181004,7.7889447236181004,0,0,0,0,0]
[null,"ZN15014:PA9","MONA VALE","URBAN",1019,924.54076696658205,5014.2079996656803,3.6827227999999996,799.20056435779998,6452.543117447166,8,27852,27852,10.598626104023499,10.598626104023499,1,224870,224870,11.0893032384691,11.0893032384691]
[null,"ZN15015:PA15","NORTH HEAD","SHORT RURAL",633,1004.42511566933,5409.3275335263097,1.723301,501.21750038066676,0,2,37328,37328,107.740916271722,107.740916271722,0,0,0,0,0]
[null,"ZN15015:PA5","NORTH HEAD","URBAN",1642,445.41411422392298,5392.4487990596199,3.246661,7408.8322026119131,0,9,292875.10000000033,82439.433333333305,114.73812423873323,107.673568818514,0,0,0,0,0]
[null,"ZN1600:PA21DEF","CITY EAST","CBD",224,0,6589.3590581348799,9.5962159000000007,0,393.29291181491675,0,0,0,0,0,1,5260,5260,0.89285714285714302,0.89285714285714302]
[null,"ZN1600:PA22ABC","CITY EAST","CBD",139,0,5240.0094065717003,6.8751140999999993,400.4252652846875,0,1,7475,7475,16.5467625899281,16.5467625899281,0,0,0,0,0]
[null,"ZN1600:PA23ABC","CITY EAST","CBD",156,0,4523.0258804610503,6.1857936999999996,0,127.24177640900001,0,0,0,0,0,1,2640,2640,0.64102564102564097,0.64102564102564097]
[null,"ZN1600:PA24DEF","CITY EAST","CBD",132,0,3247.3208606773501,5.2603524999999998,0,1050.781494456146,0,0,0,0,0,2,25637,25637,43.181818181818201,43.181818181818201]
[null,"ZN1610:PA11","HOMEBUSH BAY","URBAN",1311,0,10994.851188148599,3.8093520999999999,3888.9176272782734,0,5,131022.9166666667,130374.55,94.126620900076219,93.974065598779504,0,0,0,0,0]
[null,"ZN1610:PA12","HOMEBUSH BAY","URBAN",452,176.42537758643201,8741.5530925678595,4.5529421999999995,0,24.477755502749996,0,0,0,0,0,2,690,690,0.88495575221238898,0.88495575221238898]
[null,"ZN1610:PA16","HOMEBUSH BAY","URBAN",9,0,5000.8792586586196,4.2263719000000002,0,68.824705403208341,0,0,0,0,0,3,2090,2090,33.3333333333333,33.3333333333333]
[null,"ZN1610:PA17","HOMEBUSH BAY","URBAN",342,0,6753.9199723735801,3.3018828,90.181878312965011,0,5,3505.3166666666998,3505.3166666666998,6.1403508771929802,6.1403508771929802,0,0,0,0,0]
[null,"ZN1610:PA18","HOMEBUSH BAY","URBAN",81,0,2958.55558506136,1.4148205999999999,0,22.819287752249998,0,0,0,0,0,1,2070,2070,85.18518518518519,85.18518518518519]
[null,"ZN1610:PA19","HOMEBUSH BAY","URBAN",1822,0,8110.5325306642198,5.0794534999999996,887.6223296009897,50.659082906666669,3,22427.5,22427.5,3.4577387486278801,3.4577387486278801,1,1280,1280,0.43907793633369896,0.43907793633369896]
[null,"ZN1610:PA2","HOMEBUSH BAY","URBAN",698,0,4411.9168188314698,2.0136915000000002,0,37.65603105000001,0,0,0,0,0,1,2400,2400,0.71633237822349605,0.71633237822349605]
[null,"ZN1610:PA20","HOMEBUSH BAY","URBAN",47,0,5508.5665052324102,1.7594808,36.686054420399998,0,2,2676,2676,17.021276595744698,17.021276595744698,0,0,0,0,0]
[null,"ZN1610:PA23","HOMEBUSH BAY","URBAN",132,0,6558.5942059272602,6.2581533,489.07078643294824,0,2,10029.8666666667,10029.8666666667,13.636363636363599,13.636363636363599,0,0,0,0,0]
[null,"ZN1610:PA25","HOMEBUSH BAY","URBAN",69,0,5616.2589981768097,2.1584106999999997,0,3.0271710067499997,0,0,0,0,0,2,180,180,4.3478260869565206,4.3478260869565206]
[null,"ZN1610:PA26","HOMEBUSH BAY","URBAN",55,0,4424.22719816276,2.4849809999999999,158.05350111326939,30.204944055000002,3,8163.0166666667001,8163.0166666667001,118.18181818181802,118.18181818181802,1,1560,1560,7.2727272727272698,7.2727272727272698]
[null,"ZN1610:PA7","HOMEBUSH BAY","URBAN",13,0,5045.1106026225498,1.6147615999999998,0,9.0210675235999993,0,0,0,0,0,1,717,717,23.076923076923102,23.076923076923102]
[null,"ZN1610:PA8","HOMEBUSH BAY","URBAN",21,0,3600.5977464335501,2.7572815999999998,0,15.468349776,0,0,0,0,0,1,720,720,38.095238095238102,38.095238095238102]
[null,"ZN1648:PA1","ENFIELD","URBAN",282,0,6551.2750104311699,0.65314059999999996,139.53184786594457,0,3,27418.0333333333,26232.7833333333,17.021276595744713,16.6666666666667,0,0,0,0,0]
[null,"ZN1648:PA10","ENFIELD","URBAN",474,0,4496.8217835006399,1.5785817999999998,174.9843005509519,0,3,14226.6166666667,14226.6166666667,23.628691983122398,23.628691983122398,0,0,0,0,0]
[null,"ZN1648:PA11","ENFIELD","URBAN",546,0,3675.0338399379002,2.1584106999999997,113.74567028501893,0,2,6763.4833333332999,6763.4833333332999,13.9194139194139,13.9194139194139,0,0,0,0,0]
[null,"ZN1648:PA15","ENFIELD","URBAN",1122,0,5937.39206761895,3.1200316999999997,1525.6353345220289,0,8,62756.883333333302,8222.3166666667003,5.6149732620320902,2.76292335115865,0,0,0,0,0]
[null,"ZN1648:PA16","ENFIELD","URBAN",662,0,3265.93842933923,1.0701604,82.866354513433336,70.709064829333329,3,9938,9938,16.314199395770402,16.314199395770402,1,8480,8480,4.8338368580060402,4.8338368580060402]
[null,"ZN1648:PA19","ENFIELD","URBAN",808,0,2862.8620987602399,1.8137504999999998,30.659676238468748,228.94065686249999,4,2169.5,2169.5,0.49504950495049499,0.49504950495049499,1,16200,16200,6.6831683168316793,6.6831683168316793]
[null,"ZN1648:PA2","ENFIELD","URBAN",218,0,2981.2087234261699,1.3605509,3.400610995291383,0,1,320.78333333329999,320.78333333329999,0.45871559633027498,0.45871559633027498,0,0,0,0,0]
[null,"ZN1648:PA20","ENFIELD","URBAN",1033,0,4183.0458113684799,1.5414498999999999,12.916653298191044,0,3,1075.45,178.86666666670001,0.29041626331074583,9.6805421103581799E-2,0,0,0,0,0]
[null,"ZN1648:PA21","ENFIELD","URBAN",361,0,2532.1639004250301,0.94353109999999996,4.0647437729387503,0,1,552.9,552.9,0.277008310249307,0.277008310249307,0,0,0,0,0]
[null,"ZN1648:PA4","ENFIELD","URBAN",684,0,5019.7483803766499,2.0498713,358.2021125680709,336.8476637116251,2,22427,22427,10.9649122807018,10.9649122807018,1,21090,21090,5.4093567251461998,5.4093567251461998]
[null,"ZN1648:PA8","ENFIELD","SHORT RURAL",839,0,6717.3967754444102,1.4690902999999997,18.617423281139374,0,3,1626.45,1626.45,10.6078665077473,10.6078665077473,0,0,0,0,0]
[null,"ZN167:PA1","AUBURN","URBAN",176,0,4009.6492639124099,2.9200906999999998,424.87933715183391,0,3,18674.066666666702,3120,7.9545454545454604,2.8409090909090899,0,0,0,0,0]
[null,"ZN167:PA10","AUBURN","URBAN",1057,0,3427.5205865630901,1.6509414,254.2873497626,226.91364072299999,2,19768,19768,5.8656575212866606,5.8656575212866606,2,17640,17640,5.8656575212866606,5.8656575212866606]
[null,"ZN167:PA11","AUBURN","URBAN",136,0,2576.5542029083499,1.2158316999999998,1937.4505280502722,0,5,204515.76666666658,3527.9666666665998,91.176470588235304,5.1470588235294104,0,0,0,0,0]
[null,"ZN167:PA12","AUBURN","URBAN",393,0,7482.5811153794402,3.2104811999999998,8.7314855231175006,7.7546497985,1,349.05,349.05,0.25445292620865101,0.25445292620865101,1,310,310,0.25445292620865101,0.25445292620865101]
[null,"ZN167:PA17","AUBURN","URBAN",5,0,1502.62613159232,4.0092930999999998,2.4678869569291666,0,1,79,79,20,20,0,0,0,0,0]
[null,"ZN167:PA19","AUBURN","URBAN",74,368.24778466858299,6452.3813828553102,2.9572225999999997,21.964877650094653,4.4931300878749996,2,953.26666666669996,953.26666666669996,8.1081081081081106,8.1081081081081106,1,195,195,1.35135135135135,1.35135135135135]
[null,"ZN167:PA2","AUBURN","URBAN",119,0,4834.7469760427703,3.8636217999999998,0,54.187295745,0,0,0,0,0,1,1800,1800,5.0420168067226898,5.0420168067226898]
[null,"ZN167:PA20","AUBURN","URBAN",389,0,3428.3930999941099,3.5913211999999994,2385.3857679934331,0,3,85246,43063,201.02827763496131,101.542416452442,0,0,0,0,0]
[null,"ZN167:PA21","AUBURN","URBAN",964,0,10117.8151502973,3.7189025999999998,395.96607903756461,282.52038189374997,7,13665.0999999999,13665.0999999999,9.2323651452282203,9.2323651452282203,1,9750,9750,4.0456431535269699,4.0456431535269699]
[null,"ZN1673:PA1","TURRAMURRA","URBAN",1421,3.6502130586580899,10972.5176963306,5.1699029999999997,10625.204090179632,55.589382007499999,17,263769.46666666702,140838.21666666699,117.38212526389911,110.62631949331501,1,1380,1380,0.28149190710767102,0.28149190710767102]
[null,"ZN1673:PA11","TURRAMURRA","URBAN",624,409.01118134551803,2757.1407793318499,1.5414498999999999,6637.1568502564533,0,11,552614.53333333321,7191.8333333333003,34.935897435897438,5.2884615384615401,0,0,0,0,0]
[null,"ZN1673:PA13","TURRAMURRA","URBAN",841,1063.5338145150299,6375.6567803487396,4.3901330999999999,7706.4204216641701,0,15,225291.41666666669,146093.6,327.82401902497054,322.82996432818101,0,0,0,0,0]
[null,"ZN1673:PA14","TURRAMURRA","URBAN",865,0,4179.60608971087,3.1743014000000001,2094.8101670878555,0,6,84696.6333333332,8066.7499999999,14.450867052023069,10.4046242774566,0,0,0,0,0]
[null,"ZN1673:PA18","TURRAMURRA","URBAN",1173,4998.8748942332404,4905.71030698304,3.3742424,3615.5739104820505,0,9,137521.5,5767.05,8.0988917306052901,4.0920716112531998,0,0,0,0,0]
[null,"ZN1673:PA19","TURRAMURRA","URBAN",485,1.3309749081325799,5565.0265391355897,2.1765005999999998,206.56891504523998,0,3,12180.8,12180.8,21.855670103092802,21.855670103092802,0,0,0,0,0]
[null,"ZN1673:PA2","TURRAMURRA","URBAN",808,1337.60383643664,6127.7300715992296,2.7030118999999999,11619.955084034744,0,19,551729.4,254700.53333333301,264.23267326732679,255.94059405940598,0,0,0,0,0]
[null,"ZN1673:PA20","TURRAMURRA","URBAN",8,0,5373.7433932138201,3.0295821999999997,0,17.562488013399999,0,0,0,0,0,2,744,744,25,25]
[null,"ZN1673:PA21","TURRAMURRA","URBAN",916,1.2243552858109701,10039.854686967201,2.2126803999999995,211.87271014387994,0,5,12289.266666666601,7052.1666666665997,8.1877729257641896,6.9868995633187794,0,0,0,0,0]
[null,"ZN1673:PA6","TURRAMURRA","URBAN",1086,3824.4674186779198,5622.5549232362,3.1743014000000001,14644.733036163747,0,12,592110.73333333316,68152.983333333206,33.609576427256002,14.180478821362799,0,0,0,0,0]
[null,"ZN1673:PA7","TURRAMURRA","URBAN",1041,74.8538641456731,6214.2868017761602,3.5189615999999999,13951.420428937283,169.309705565,25,508830.96666666702,338808.75,381.65225744476419,368.10758885686801,1,6175,6175,1.8251681075888599,1.8251681075888599]
[null,"ZN1673:PA9","TURRAMURRA","URBAN",480,296.14934672786501,5334.7766822253097,2.6668321000000001,1093.4540605778491,0,7,52622.866666666603,44492.716666666602,128.74999999999969,128.333333333333,0,0,0,0,0]
[null,"ZN1788:PA1","MATRAVILLE","URBAN",882,0,6916.94898108694,2.9572225999999997,1144.3641347297737,0,5,49664.933333333298,31637.333333333299,20.521541950113349,12.3582766439909,0,0,0,0,0]
[null,"ZN1788:PA11","MATRAVILLE","URBAN",489,0,6542.2022745970198,2.5392506999999997,4.4318388883999997,0,2,224,224,0.40899795501022501,0.40899795501022501,0,0,0,0,0]
[null,"ZN1788:PA14","MATRAVILLE","URBAN",1102,0,8805.7269814185602,2.7211018,2731.2152000118567,1166.5295389055,10,128819.25,128819.25,26.950998185118003,26.950998185118003,1,55020,55020,11.8874773139746,11.8874773139746]
[null,"ZN1788:PA15","MATRAVILLE","URBAN",966,0,5417.4269350791001,3.9540712999999994,17.417758215339955,0,3,565.35000000009995,565.35000000009995,0.31055900621118004,0.31055900621118004,0,0,0,0,0]
[null,"ZN1788:PA16","MATRAVILLE","SHORT RURAL",44,0,10970.4770791275,3.9731132999999996,0,25.384883059250001,0,0,0,0,0,3,820,820,6.8181818181818095,6.8181818181818095]
[null,"ZN1788:PA17","MATRAVILLE","URBAN",1576,0,3714.2250996796702,2.7030118999999999,1506.5664895388738,631.82903162500008,3,71533.583333333299,71435.600000000006,105.77411167512676,105.710659898477,1,30000,30000,7.9314720812182697,7.9314720812182697]
[null,"ZN1788:PA21","MATRAVILLE","URBAN",35,0,4464.8967658781503,3.246661,63.368735230625006,103.21135319000001,1,2505,2505,94.285714285714292,94.285714285714292,2,4080,4080,45.714285714285701,45.714285714285701]
[null,"ZN1788:PA29","MATRAVILLE","SHORT RURAL",770,0,7455.8270234506899,2.0860510999999997,353.75019293592715,0,2,21764.133333333401,21764.133333333401,13.5064935064935,13.5064935064935,0,0,0,0,0]
[null,"ZN1788:PA30","MATRAVILLE","URBAN",1306,591.87823599365004,6040.09328829884,3.3199727000000001,2234.5835401385361,0,7,86383.683333333305,86383.683333333305,39.433384379785601,39.433384379785601,0,0,0,0,0]
[null,"ZN1788:PA32","MATRAVILLE","URBAN",1435,0,9945.3206844374708,3.246661,1992.5508265135918,0,6,78766.600000000006,31504.6,14.006968641114989,4.8083623693379796,0,0,0,0,0]
[null,"ZN1788:PA36","MATRAVILLE","URBAN",731,0,5581.8524356492499,2.3402617999999999,1504.0243556850271,0,5,82482.166666666701,761.16666666670005,125.44459644322825,0.41039671682626505,0,0,0,0,0]
[null,"ZN1788:PA37","MATRAVILLE","URBAN",792,0,4758.0374812503696,1.4871802000000001,858.00051074974783,0,3,74044.633333333302,74044.633333333302,111.23737373737399,111.23737373737399,0,0,0,0,0]
[null,"ZN1788:PA6","MATRAVILLE","URBAN",1121,0,6811.3885157798804,2.6306522999999999,7.4209988914668763,0,1,362.05,362.05,8.9206066012488802E-2,8.9206066012488802E-2,0,0,0,0,0]
[null,"ZN1788:PA8","MATRAVILLE","URBAN",1205,0,3746.9171160380502,3.8455318999999997,4956.9883463499173,388.32181126199993,11,165436.41666666669,116702,115.93360995850604,109.128630705394,1,12960,12960,2.9875518672199197,2.9875518672199197]
[null,"ZN180:PA10","MOSMAN","URBAN",1372,0,5716.0747196114899,3.2104811999999998,1571.0428530107106,0,6,62804.033333333296,30830.2166666667,9.9125364431486993,8.2361516034985502,0,0,0,0,0]
[null,"ZN180:PA15","MOSMAN","URBAN",477,0,3294.0414444540702,2.7934614,77.878471952353962,0,6,3578.0333333334002,2121.4166666667002,6.0796645702306007,5.8700209643605801,0,0,0,0,0]
[null,"ZN180:PA16","MOSMAN","URBAN",525,0,2960.7084069127,1.3967307,89.740063869225011,0,1,8246,8246,7.2380952380952408,7.2380952380952408,0,0,0,0,0]
[null,"ZN180:PA17","MOSMAN","URBAN",790,1456.3773900517499,6305.0375852655698,3.0114922999999996,13.239869048392707,530.7679891442499,2,564.25,564.25,0.253164556962025,0.253164556962025,1,22620,22620,4.9367088607594898,4.9367088607594898]
[null,"ZN180:PA18","MOSMAN","URBAN",2356,0,8760.0905415020097,4.8614226,8456.9615203378944,968.85843242265014,8,223264.98333333357,79742.116666666596,16.129032258064541,14.261460101867602,1,25578,25578,2.0797962648556898,2.0797962648556898]
[null,"ZN180:PA19","MOSMAN","URBAN",1452,0,5890.2398339401198,3.3380625999999998,1265.5151359013785,350.0820968938333,5,48656.683333333298,8222.9833333333008,2.0661157024793422,1.4462809917355399,2,13460,13460,1.7906336088154302,1.7906336088154302]
[null,"ZN180:PA20","MOSMAN","URBAN",1438,0,6583.0822468955903,2.6306522999999999,1236.2469296348609,4.3044048258750003,5,60313.066666666702,60313.066666666702,21.627260083449201,21.627260083449201,1,210,210,0.48678720445062601,0.48678720445062601]
[null,"ZN180:PA21","MOSMAN","URBAN",1930,0,6133.3225463029903,3.7008126999999997,7136.9090226184644,214.53611221900002,8,247504.26666666701,247504.26666666701,134.14507772020701,134.14507772020701,1,7440,7440,3.2124352331606203,3.2124352331606203]
[null,"ZN180:PA22","MOSMAN","URBAN",1369,0,5156.9620632972501,2.7391916999999997,1554.8767149465702,0,6,72852.283333333296,72852.283333333296,14.682249817384898,14.682249817384898,0,0,0,0,0]
[null,"ZN180:PA23","MOSMAN","URBAN",1220,0,6278.5405084808899,3.4285120999999998,2163.6242429709537,899.98871189012482,6,80992.683333333305,80992.683333333305,95.491803278688508,95.491803278688508,3,33690,33690,13.442622950819699,13.442622950819699]
[null,"ZN180:PA24","MOSMAN","URBAN",1122,0,7866.0620399272202,3.8817116999999999,2520.6594359876949,509.14439165452501,2,83341.350000000006,83341.350000000006,26.827094474153302,26.827094474153302,1,16834,16834,3.3868092691622103,3.3868092691622103]
[null,"ZN180:PA28","MOSMAN","URBAN",1268,0,4187.3079894371904,2.5030709,10.137708311014167,0,4,519.79999999999995,519.79999999999995,0.31545741324921101,0.31545741324921101,0,0,0,0,0]
[null,"ZN180:PA29","MOSMAN","URBAN",2018,0,4912.5368048495002,4.4444027999999998,1260.2902743028126,0,4,36393.75,33744.85,10.307234886025723,10.257680872150599,0,0,0,0,0]
[null,"ZN180:PA30","MOSMAN","URBAN",1223,0,3507.0334027233098,2.9753124999999998,188.39181831488563,334.52554179687496,6,8126.4166666666006,5489.5333333333001,4.9059689288634507,4.8242027800490597,1,14430,14430,3.02534750613246,3.02534750613246]
[null,"ZN180:PA31","MOSMAN","URBAN",1307,0,6359.2591513914404,2.6668321000000001,1370.186901400554,0,8,65940.733333333294,61513,28.921193573068045,28.844682478959399,0,0,0,0,0]
[null,"ZN180:PA32","MOSMAN","URBAN",946,0,7144.6423123777804,2.4849809999999999,113.47248811909937,345.61426370625003,4,5860.5333333333001,5860.5333333333001,105.708245243129,105.708245243129,1,17850,17850,3.6997885835095099,3.6997885835095099]
[null,"ZN180:PA33","MOSMAN","URBAN",916,0,4789.3836770234402,2.1403208,211.73640460926612,0,4,12696.5666666667,12696.5666666667,4.4759825327510905,4.4759825327510905,0,0,0,0,0]
[null,"ZN180:PA34","MOSMAN","URBAN",1275,0,8411.6344007417501,5.0070939000000001,5307.872707977388,0,11,136051.8333333336,19976.366666666599,18.666666666666632,12.156862745098,0,0,0,0,0]
[null,"ZN180:PA35","MOSMAN","URBAN",1428,0,4837.0366214282103,2.8477310999999998,608.47534685408925,372.76800098999996,2,27422.916666666697,24744.566666666698,5.182072829131652,5.1120448179271705,1,16800,16800,2.4509803921568598,2.4509803921568598]
[null,"ZN180:PA41","MOSMAN","URBAN",2144,0,10693.1410273481,4.7709731,379.44073871340623,66.355290246437505,8,10207.199999999899,7819.4666666665998,2.3320895522388061,2.28544776119403,1,1785,1785,0.32649253731343297,0.32649253731343297]
[null,"ZN180:PA42","MOSMAN","URBAN",1914,0,9147.4743314220395,3.9731132999999996,619.17444642446242,0,2,20001,20001,8.4639498432601901,8.4639498432601901,0,0,0,0,0]
[null,"ZN180:PA43","MOSMAN","URBAN",1138,0,8308.0108421683399,3.8817116999999999,1093.8891944638351,0,4,36167.599999999999,18455.599999999999,11.511423550087871,9.1388400702987695,0,0,0,0,0]
[null,"ZN180:PA7","MOSMAN","URBAN",1478,0,5284.7288771055901,2.5944724999999997,2198.3544654434113,698.63955480000004,5,108747.25,108747.25,12.652232746955299,12.652232746955299,1,34560,34560,4.87144790257104,4.87144790257104]
[null,"ZN180:PA9","MOSMAN","URBAN",795,0,4469.6295775860899,2.4307113,500.28392903214859,97.726747816500009,1,26415.133333333299,26415.133333333299,7.2955974842767297,7.2955974842767297,1,5160,5160,1.5094339622641499,1.5094339622641499]
[null,"ZN1850:PA10","BASS HILL","URBAN",911,5.1761687053433603,5517.5242727855803,2.8477310999999998,2489.2781448967644,9.8739143119375008,4,112187.4000000003,9264.7833333333001,109.33040614709111,9.3304061470911002,1,445,445,0.109769484083425,0.109769484083425]
[null,"ZN1850:PA11","BASS HILL","URBAN",287,1071.34828711819,3977.37739098062,2.3040819999999997,874.87787363840425,0,5,48732.55,16301.55,201.04529616724699,101.045296167247,0,0,0,0,0]
[null,"ZN1850:PA12","BASS HILL","URBAN",333,93.444313291731106,1394.0857794977001,3.7550823999999996,1135.0352778668018,0,3,38793.550000000003,73.383333333300001,100,0.30030030030029997,0,0,0,0,0]
[null,"ZN1850:PA13","BASS HILL","URBAN",1393,2159.5924253030598,3331.20573811338,4.6433916999999996,5660.139589716463,0,3,156444.91666666701,420.85,99.210337401292136,7.1787508973438607E-2,0,0,0,0,0]
[null,"ZN1850:PA14","BASS HILL","URBAN",426,467.76513575342602,2864.26128450747,4.6433916999999996,5643.6723718026433,659.19523319741666,7,155989.76666666701,45895,117.84037558685476,7.0422535211267592,5,18220,18220,12.9107981220657,12.9107981220657]
[null,"ZN1850:PA15","BASS HILL","URBAN",686,2825.02417343361,1497.8956011231201,3.8998016,3366.110419959467,0,4,110778.5,33147.5,153.35276967930008,53.2069970845481,0,0,0,0,0]
[null,"ZN1850:PA3","BASS HILL","SHORT RURAL",484,2011.58435427275,2745.72365226802,2.9753124999999998,4387.8101805527349,0,4,189271.35,29736,246.0743801652896,73.140495867768593,0,0,0,0,0]
[null,"ZN1850:PA8","BASS HILL","URBAN",172,0,537.80304572735997,0.52651130000000002,80.429408781308126,0,2,19605.45,282.45,100,0.581395348837209,0,0,0,0,0]
[null,"ZN1850:PA9","BASS HILL","URBAN",358,24.458302369781901,2983.7072613578698,2.9200906999999998,922.9955305345959,0,1,40567,0,100.27932960893899,0,0,0,0,0,0]
[null,"ZN187:PA10","CROWS NEST","URBAN",624,0,3843.9490374218499,2.5573405999999999,0,132.10901872025002,0,0,0,0,0,3,6630,3390,4.0064102564102502,2.0833333333333299]
[null,"ZN187:PA13","CROWS NEST","URBAN",1183,0,4200.2540307724203,1.8861101,1357.3764024766574,0,5,92364.033333333398,86789.783333333398,27.810650887574024,27.7261200338124,0,0,0,0,0]
[null,"ZN187:PA14","CROWS NEST","URBAN",666,0,5174.5917128175397,2.6668321000000001,19.937168256830077,0,1,959.48333333330004,959.48333333330004,0.15015015015014999,0.15015015015014999,0,0,0,0,0]
[null,"ZN187:PA16","CROWS NEST","URBAN",1540,0,4749.8618483719101,3.4646918999999996,455.40977169980869,0,4,16869.7,11166.6333333333,5.8441558441558445,5.7792207792207799,0,0,0,0,0]
[null,"ZN187:PA17","CROWS NEST","URBAN",1316,0,7140.7783031272002,2.8477310999999998,416.89552253576568,0,5,18788.75,191.73333333330001,1.8996960486322176,0.151975683890578,0,0,0,0,0]
[null,"ZN187:PA19","CROWS NEST","URBAN",307,0,2095.2366335912002,0.92544119999999996,42.948425975647254,0,1,5956.1833333332997,5956.1833333332997,43.322475570032601,43.322475570032601,0,0,0,0,0]
[null,"ZN187:PA20","CROWS NEST","URBAN",2037,0,10110.383934780601,3.7550823999999996,339.26520167668627,0,7,11595.5000000001,5906.5000000001,3.1418753068237701,1.6691212567501299,0,0,0,0,0]
[null,"ZN187:PA21","CROWS NEST","URBAN",1056,0,3585.2709331580099,1.9232419999999999,2191.4375145850563,0,3,146239.53333333301,146239.53333333301,199.905303030303,199.905303030303,0,0,0,0,0]
[null,"ZN187:PA22","CROWS NEST","URBAN",1108,0,4446.2333014887199,2.7211018,1.5477400279916667,0,1,73,73,9.0252707581227401E-2,9.0252707581227401E-2,0,0,0,0,0]
[null,"ZN187:PA24","CROWS NEST","SHORT RURAL",122,0,2376.7561062364698,0.59887089999999998,0.52261467206666667,0,1,112,112,0.81967213114754101,0.81967213114754101,0,0,0,0,0]
[null,"ZN187:PA26","CROWS NEST","URBAN",256,0,577.10087206141395,1.5966716999999999,0,2.8613687423749998,0,0,0,0,0,1,230,230,0.390625,0.390625]
[null,"ZN187:PA30","CROWS NEST","URBAN",1984,0,7264.1604085179397,3.4285120999999998,375.40980611468746,0,4,14053.016666666699,10990.1166666667,5.5947580645161317,5.5443548387096797,0,0,0,0,0]
[null,"ZN187:PA4","CROWS NEST","URBAN",1299,0,5831.7569895638599,4.0635627999999997,4349.1772533177837,0,1,137363,137363,99.6150885296382,99.6150885296382,0,0,0,0,0]
[null,"ZN187:PA7","CROWS NEST","URBAN",696,0,1149.83514087146,3.0114922999999996,153.53242326712507,0,1,6543.1666666666997,6543.1666666666997,12.356321839080501,12.356321839080501,0,0,0,0,0]
[null,"ZN188:PA15","ZETLAND","URBAN",252,0,2469.9182851954602,2.0860510999999997,11.099459244234485,0,3,682.88333333339995,682.88333333339995,1.19047619047619,1.19047619047619,0,0,0,0,0]
[null,"ZN188:PA17","ZETLAND","URBAN",2253,0,7543.8530352362704,3.9178915000000001,5765.3035718167557,0,7,188859.74999999971,188628.78333333301,35.153129161118521,35.108743897026201,0,0,0,0,0]
[null,"ZN188:PA2","ZETLAND","URBAN",942,0,7419.3814297438503,3.1743014000000001,4516.241097354784,3155.522894230392,2,182599.08333333299,182599.08333333299,33.121019108280301,33.121019108280301,4,127583,127583,28.237791932059501,28.237791932059501]
[null,"ZN188:PA20","ZETLAND","URBAN",1587,0,3561.3675264884801,3.7189025999999998,4.0098576595952835,8.6929348275000002,2,138.38333333329999,138.38333333329999,0.126023944549464,0.126023944549464,1,300,300,6.3011972274732195E-2,6.3011972274732195E-2]
[null,"ZN188:PA21","ZETLAND","URBAN",3153,0,3095.4506876854198,3.6094110999999995,521.96897054133331,683.39687414624996,1,18560,18560,9.19758959720901,9.19758959720901,1,24300,24300,2.5689819219790699,2.5689819219790699]
[null,"ZN188:PA22","ZETLAND","URBAN",70,0,5313.0145067769099,2.5392506999999997,11.028815733736424,0,1,557.43333333329997,557.43333333329997,1.4285714285714299,1.4285714285714299,0,0,0,0,0]
[null,"ZN188:PA25","ZETLAND","URBAN",285,0,3344.62500396225,2.6668321000000001,1009.3545972847496,0,3,48575.55,48575.55,198.59649122806999,198.59649122806999,0,0,0,0,0]
[null,"ZN188:PA3","ZETLAND","URBAN",875,0,3343.4186622795,1.9232419999999999,7.7224042872772793,0,1,515.33333333329995,515.33333333329995,0.11428571428571399,0.11428571428571399,0,0,0,0,0]
[null,"ZN188:PA31","ZETLAND","URBAN",130,0,3502.6317482210202,2.4126213999999995,12.331712182533332,0,1,656,656,12.307692307692299,12.307692307692299,0,0,0,0,0]
[null,"ZN188:PA32","ZETLAND","SHORT RURAL",625,0,3899.6897024243599,1.5414498999999999,190.54720929948459,0,2,15865.1,15865.1,18.88,18.88,0,0,0,0,0]
[null,"ZN188:PA33","ZETLAND","URBAN",77,0,2599.8727020729698,1.4148205999999999,147.56472746455,93.481913110666667,2,13386,13386,77.922077922077904,77.922077922077904,1,8480,8480,20.7792207792208,20.7792207792208]
[null,"ZN188:PA38","ZETLAND","URBAN",920,0,4449.1205299892199,1.9594217999999997,752.74739899012502,0,1,49305,49305,30.978260869565201,30.978260869565201,0,0,0,0,0]
[null,"ZN188:PA4","ZETLAND","URBAN",959,0,2747.9680830724601,2.5211608000000001,693.21868871309994,85.64803431066666,1,35289,35289,93.639207507820601,93.639207507820601,1,4360,4360,0.83420229405630897,0.83420229405630897]
[null,"ZN188:PA41","ZETLAND","URBAN",1521,0,7742.8310478638105,5.3879338999999993,9.8151542861808334,0,2,233.8,233.8,0.13149243918474698,0.13149243918474698,0,0,0,0,0]
[null,"ZN188:PA42","ZETLAND","URBAN",660,0,5693.0433911303198,1.8137504999999998,405.62560879613437,0,2,28702.35,28702.35,15.454545454545501,15.454545454545501,0,0,0,0,0]
[null,"ZN188:PA43","ZETLAND","URBAN",633,0,4464.7347320598301,3.8817116999999999,0,1009.8806722908751,0,0,0,0,0,2,33390,33390,0.94786729857819896,0.94786729857819896]
[null,"ZN188:PA44","ZETLAND","URBAN",1540,0,5420.04834589236,2.9391327,3434.3785193718004,0,2,149968,6657,106.81818181818181,6.8181818181818201,0,0,0,0,0]
[null,"ZN188:PA45","ZETLAND","SHORT RURAL",193,0,5432.4814870280898,1.0520704999999999,178.56358617418752,0,1,21783,21783,100,100,0,0,0,0,0]
[null,"ZN188:PA6","ZETLAND","URBAN",13,0,649.68068291013196,0.85212949999999998,0.51124219460416664,0,1,77,77,7.6923076923076898,7.6923076923076898,0,0,0,0,0]
[null,"ZN188:PA9","ZETLAND","URBAN",130,0,1273.2663595613701,2.2307702999999997,428.24773651347181,0,1,24638.25,24638.25,70,70,0,0,0,0,0]
[null,"ZN195:PA10","PYMBLE","SHORT RURAL",212,0,1781.0374663590301,0.47128949999999997,624.62073923445621,0,8,170097.6333333333,38058.633333333302,82.075471698113205,68.39622641509429,0,0,0,0,0]
[null,"ZN195:PA11","PYMBLE","URBAN",1277,1383.3498479856801,8090.1409699015903,4.0454728999999992,4508.815618216604,37.194752088083327,11,143041.75,138663.35,111.66797180892675,111.511354737666,1,1180,1180,0.15661707126076699,0.15661707126076699]
[null,"ZN195:PA22","PYMBLE","URBAN",658,1.39997039115265,3471.1694044060901,3.5008716999999998,847.65720800183033,0,3,31075.183333333302,31075.183333333302,109.27051671732499,109.27051671732499,0,0,0,0,0]
[null,"ZN195:PA23","PYMBLE","URBAN",484,0,4002.8589034410702,1.6690312999999999,180.34559849606205,0,5,13867.9,13867.9,20.247933884297499,20.247933884297499,0,0,0,0,0]
[null,"ZN195:PA25","PYMBLE","URBAN",766,2.7862534106307999,5123.7617323258601,2.8115512999999996,7178.6041733876482,0,14,327690.33333333372,54942.116666666698,105.22193211488251,92.819843342036506,0,0,0,0,0]
[null,"ZN195:PA28","PYMBLE","URBAN",904,7.5431879590270601,8550.8924317206001,3.1562114999999999,4498.5309575411602,0,10,182925.50000000012,43053.500000000102,31.747787610619493,26.5486725663717,0,0,0,0,0]
[null,"ZN195:PA29","PYMBLE","URBAN",1112,572.94506550547703,6195.6911464022196,3.246661,4155.7486397846997,0,12,164278.9666666667,58532.966666666704,36.780575539568311,31.3848920863309,0,0,0,0,0]
[null,"ZN195:PA3","PYMBLE","URBAN",289,439.76778005871398,2272.8618557515802,2.2498122999999999,385.48002721662505,0,3,21990,21990,12.802768166090001,12.802768166090001,0,0,0,0,0]
[null,"ZN195:PA30","PYMBLE","SHORT RURAL",1172,5642.6975418264801,6758.5076551702796,3.5913211999999994,3744.5066414995404,0,19,133816.59999999992,91813.299999999901,87.54266211604093,78.242320819112592,0,0,0,0,0]
[null,"ZN195:PA4","PYMBLE","URBAN",986,0,3879.8025465863402,1.8680201999999999,32.347253970419239,231.42435252749999,3,2222.4166666667002,2222.4166666667002,0.91277890466531408,0.91277890466531408,2,15900,15900,4.4624746450304302,4.4624746450304302]
[null,"ZN195:PA8","PYMBLE","URBAN",359,0,1160.83464493513,1.0339806,183.76708363788018,0,3,22809.983333333301,22809.983333333301,10.3064066852368,10.3064066852368,0,0,0,0,0]
[null,"ZN195:PA9","PYMBLE","SHORT RURAL",1324,2260.5298365158401,12229.0537226785,4.4263129000000001,595.68228721265757,0,10,17271.983333333399,15295.916666666701,8.0060422960725042,7.9305135951661594,0,0,0,0,0]
[null,"ZN2196:PA10","MILPERRA","URBAN",38,0,1318.99269977425,2.2498122999999999,0,5.6095320013333341,0,0,0,0,0,1,320,320,2.6315789473684199,2.6315789473684199]
[null,"ZN2196:PA11","MILPERRA","URBAN",105,0,2980.5887344398202,2.4488012000000001,3.4805542694853591,0,1,182.4166666667,182.4166666667,0.95238095238095299,0.95238095238095299,0,0,0,0,0]
[null,"ZN2196:PA13","MILPERRA","URBAN",31,2.9431113662906001,854.36853788520705,1.3967307,31.168511147400004,0,3,2864,2503,12.90322580645161,9.67741935483871,0,0,0,0,0]
[null,"ZN2196:PA14","MILPERRA","URBAN",125,0,5137.6969681159198,3.0114922999999996,358.1862667677708,236.52260524199997,2,15265,2235,8,4,1,10080,10080,16.8,16.8]
[null,"ZN2196:PA17","MILPERRA","URBAN",98,0,3472.7181533152998,3.8998016,1073.9145710921935,0,11,35342.466666666602,33612.983333333301,251.0204081632653,250,0,0,0,0,0]
[null,"ZN2196:PA18","MILPERRA","URBAN",1251,2135.21507573285,6984.3003803664296,4.3177734999999995,8182.8809034761089,67.453516967604173,10,243229.36666666641,82833.833333333401,180.57553956834531,80.655475619504401,3,2005,2005,0.39968025579536398,0.39968025579536398]
[null,"ZN2196:PA2","MILPERRA","URBAN",736,903.95812640462395,7019.7305799142796,4.2444617999999998,17327.571504648298,1650.925861728,20,523943.80000000005,149388.53333333301,272.28260869565304,161.684782608696,3,49920,49920,14.130434782608701,14.130434782608701]
[null,"ZN2196:PA20","MILPERRA","URBAN",101,0,2819.2967405777799,2.0317813999999998,73.096835044077267,0,2,4617.3333333333003,4617.3333333333003,110.89108910891099,110.89108910891099,0,0,0,0,0]
[null,"ZN2196:PA21","MILPERRA","URBAN",657,0.89989265587963996,2826.1071763008599,1.1786998,536.74643922046766,0,6,58443.416666666701,29370.1833333334,116.59056316590612,107.610350076104,0,0,0,0,0]
[null,"ZN2196:PA22","MILPERRA","URBAN",25,0,1303.7257884984699,1.0882502999999999,19.756730758874998,6.5290483623749989,2,2330,2330,200,200,2,770,770,16,16]
[null,"ZN2196:PA25","MILPERRA","URBAN",1748,4084.14543071049,5456.2774328981905,4.1901921,25426.43395796905,0,9,778791.41666666698,314826.816666667,405.32036613272339,305.66361556064101,0,0,0,0,0]
[null,"ZN2196:PA26","MILPERRA","URBAN",64,0,3872.77734125711,1.1606099000000001,21.992783865066666,0,1,2432,2432,100,100,0,0,0,0,0]
[null,"ZN2196:PA28","MILPERRA","URBAN",144,0,4276.7094906724096,2.8477310999999998,126.91862890850001,0,1,5720,5720,99.3055555555556,99.3055555555556,0,0,0,0,0]
[null,"ZN2196:PA3","MILPERRA","URBAN",940,4067.6005813707302,2805.0684040078199,1.8861101,79.137643339562516,0,1,5385,5385,5.31914893617021,5.31914893617021,0,0,0,0,0]
[null,"ZN2196:PA4","MILPERRA","URBAN",34,0,1069.3841167901901,1.52336,5.3315875641107171,0,1,449.18333333330003,449.18333333330003,2.9411764705882399,2.9411764705882399,0,0,0,0,0]
[null,"ZN2196:PA5","MILPERRA","URBAN",1583,6370.2223790852804,5580.4618618917802,4.6805235999999999,55615.614615652477,77.350918079050004,15,1525007.3499999968,166777.86666666699,190.14529374605181,90.840176879343005,1,2121,2121,0.50536955148452301,0.50536955148452301]
[null,"ZN2196:PA6","MILPERRA","URBAN",63,0,2005.7331842605599,2.0317813999999998,6.5856807778666671,0,1,416,416,3.1746031746031704,3.1746031746031704,0,0,0,0,0]
[null,"ZN2196:PA9","MILPERRA","URBAN",1443,1012.86241673108,5787.7302852905596,3.1743014000000001,13.330727823784038,101.2078386869,2,538.98333333330004,316.8,0.13860013860013859,6.9300069300069295E-2,1,4092,4092,0.76230076230076194,0.76230076230076194]
[null,"ZN2310:PA53","PUNCHBOWL","URBAN",2487,0,7853.2322885481799,3.6465429999999999,506.78597622993931,0,11,17836.6333333332,17633.083333333201,6.5942903096099696,6.5540812223562508,0,0,0,0,0]
[null,"ZN2310:PA54","PUNCHBOWL","URBAN",1096,0,7517.7383039225997,1.8318403999999999,16.911708314612699,0,1,1184.8666666667,0,9.12408759124088E-2,0,0,0,0,0,0]
[null,"ZN2310:PA55","PUNCHBOWL","URBAN",956,0,6037.3696377525703,2.5944724999999997,553.71699460393336,596.65354340052079,4,27391.0333333333,27391.0333333333,19.351464435146401,19.351464435146401,2,29515,29515,6.6945606694560702,6.6945606694560702]
[null,"ZN2310:PA59","PUNCHBOWL","URBAN",1599,0,7367.8161113252499,3.3923323000000001,3474.9678469312867,0,4,131468.6,131468.6,63.352095059412093,63.352095059412093,0,0,0,0,0]
[null,"ZN2310:PA60","PUNCHBOWL","URBAN",1159,0,2914.8203901095399,2.2679022,1.0455186635214226,65.20502312775001,1,59.166666666700003,59.166666666700003,8.6281276962899098E-2,8.6281276962899098E-2,1,3690,3690,3.5375323554788598,3.5375323554788598]
[null,"ZN2310:PA61","PUNCHBOWL","URBAN",2085,0,9766.4445591364492,3.246661,946.73185565057247,35.668629411250002,7,37424.816666666702,37424.816666666702,9.4964028776978395,9.4964028776978395,1,1410,1410,0.14388489208633101,0.14388489208633101]
[null,"ZN2310:PA62","PUNCHBOWL","URBAN",1544,0,5979.3657827857896,2.9934023999999999,51.815695763919997,0,4,2221.6,736.6,2.8497409326424923,0.71243523316062207,0,0,0,0,0]
[null,"ZN2310:PA65","PUNCHBOWL","URBAN",2226,0,10509.1124270005,4.6433916999999996,12538.411911979571,0,9,346558.73333333299,346558.73333333299,203.90835579514902,203.90835579514902,0,0,0,0,0]
[null,"ZN2310:PA66","PUNCHBOWL","URBAN",758,0,7126.9773051055099,2.7934614,5.9173737643907263,0,1,271.86666666669998,271.86666666669998,0.131926121372032,0.131926121372032,0,0,0,0,0]
[null,"ZN2310:PA67","PUNCHBOWL","URBAN",1138,0,6373.9130517879503,2.6306522999999999,817.98654622686388,0,3,39907.300000000003,39907.300000000003,9.7539543057996507,9.7539543057996507,0,0,0,0,0]
[null,"ZN2310:PA70","PUNCHBOWL","URBAN",1693,0,7960.6293533541602,3.1743014000000001,255.0460619135053,0,2,10311.9333333333,10311.9333333333,4.6072061429415303,4.6072061429415303,0,0,0,0,0]
[null,"ZN2310:PA71","PUNCHBOWL","URBAN",1112,0,4183.3692788818198,2.5573405999999999,576.20653664267843,0,2,28917.4,28917.4,3.7769784172661898,3.7769784172661898,0,0,0,0,0]
[null,"ZN2310:PA72","PUNCHBOWL","URBAN",1293,0,4795.8516285759597,2.3945314999999998,115.68204500958967,336.95248635125,5,6200.3333333333003,4205.3166666667003,5.1817478731631796,2.5522041763340999,1,18060,18060,3.32559938128384,3.32559938128384]
[null,"ZN2400:PA11","BEROWRA","SHORT RURAL",697,21457.194446091398,1761.84773793516,1.6871212,28166.059714242456,3696.1820307362505,7,2142641.1833333331,159568.183333333,393.83070301291218,98.134863701578197,10,281175,199870,83.0703012912482,53.084648493543796]
[null,"ZN2400:PA13","BEROWRA","URBAN",69,402.10530958257198,4420.90255857384,1.8318403999999999,59.44741894758333,84.782153312999995,1,4165,0,95.652173913043498,0,4,5940,5940,17.3913043478261,17.3913043478261]
[null,"ZN2400:PA15","BEROWRA","SHORT RURAL",1223,4123.5639088089101,9083.0242830406696,3.4827817999999997,7357.4612735858836,0,8,271126.1166666667,191235.75,202.371218315617,102.289452166803,0,0,0,0,0]
[null,"ZN2400:PA18","BEROWRA","SHORT RURAL",1345,16879.606846603001,3926.02105871188,4.3358634,55017.616087992566,5771.0838671681258,24,1628530.1833333301,250637.75,349.51672862453489,56.802973977695203,4,170825,89315,21.933085501858702,11.301115241635699]
[null,"ZN2400:PA21","BEROWRA","SHORT RURAL",1469,10409.354203707901,3995.1214399452001,4.6805235999999999,21908.795992879532,2088.5841953735003,11,600749.9,149113.9,267.66507828454797,120.83049693669199,4,57270,57270,6.8073519400953009,6.8073519400953009]
[null,"ZN2400:PA22","BEROWRA","SHORT RURAL",1319,6572.8789521385797,8114.2395749284597,3.7369924999999995,15612.982278054998,1194.978091725,12,536207.98333333328,9021.6333333333005,207.8089461713422,7.8847611827141799,1,41040,41040,5.7619408642911294,5.7619408642911294]
[null,"ZN2400:PA23","BEROWRA","URBAN",318,1958.6407594344901,3435.1075236452398,2.3040819999999997,1160.6889717727634,10.771583349999998,5,64652.833333333299,44300.833333333299,132.7044025157233,32.704402515723302,1,600,600,0.62893081761006298,0.62893081761006298]
[null,"ZN2400:PA26","BEROWRA","URBAN",981,4687.2590629094702,2500.7558826344198,3.0476720999999998,1844.3990566586033,0,5,77670.533333333398,10379.0666666667,104.68909276248726,4.6890927624872596,0,0,0,0,0]
[null,"ZN2466:PA12","FLEMINGTON","URBAN",418,0,3696.3956875254198,2.3764415999999997,838.76946243757277,0,2,45298.633333333302,45298.633333333302,100.239234449761,100.239234449761,0,0,0,0,0]
[null,"ZN2466:PA15","FLEMINGTON","URBAN",290,0,4941.1173571728104,4.5891219999999997,304.09343998482899,0,3,8504.4666666666999,8378.7999999999993,12.758620689655197,12.413793103448301,0,0,0,0,0]
[null,"ZN2466:PA16","FLEMINGTON","URBAN",1560,0,6851.2732865960097,4.3539532999999997,1638.648627149724,1621.9328691687915,6,48302.733333333301,48302.733333333301,16.153846153846199,16.153846153846199,2,47810,47810,6.4743589743589691,6.4743589743589691]
[null,"ZN2466:PA18","FLEMINGTON","URBAN",2,0,1138.1689199912601,1.3424609999999999,1.5376212678750001,0,1,147,147,50,50,0,0,0,0,0]
[null,"ZN2466:PA19","FLEMINGTON","URBAN",24,0,2926.8105808057298,3.0838518999999995,10.932897454645833,0,1,455,455,20.8333333333333,20.8333333333333,0,0,0,0,0]
[null,"ZN2466:PA2","FLEMINGTON","URBAN",131,0,5086.3307218948503,2.4488012000000001,14.195700556400002,0,1,744,744,9.1603053435114496,9.1603053435114496,0,0,0,0,0]
[null,"ZN2466:PA20","FLEMINGTON","URBAN",1133,0,9399.3262167826306,6.1134341000000001,1587.0206399498024,571.22501762443346,6,33317.083333333299,33317.083333333299,13.150926743159699,13.150926743159699,2,11992,11992,2.38305383936452,2.38305383936452]
[null,"ZN2466:PA22","FLEMINGTON","URBAN",59,0,4835.5931333752596,5.7145041999999995,0,216.39398779349997,0,0,0,0,0,2,4860,4860,28.8135593220339,28.8135593220339]
[null,"ZN2466:PA25","FLEMINGTON","URBAN",1208,0,6054.4341173630201,1.6328514999999999,0.31721768946346474,0,1,24.933333333299998,0,8.2781456953642391E-2,0,0,0,0,0,0]
[null,"ZN2466:PA26","FLEMINGTON","URBAN",11,0,4957.92297325654,2.3583516999999996,1.8461242617375568,0,1,100.46666666669999,100.46666666669999,9.0909090909090899,9.0909090909090899,0,0,0,0,0]
[null,"ZN2466:PA27","FLEMINGTON","URBAN",86,0,4773.0149099499104,3.6094110999999995,226.39841630667246,0,3,8050.2,8050.2,103.488372093023,103.488372093023,0,0,0,0,0]
[null,"ZN2466:PA28","FLEMINGTON","URBAN",498,0,2718.36628096595,0.56269109999999989,0,122.97965672437498,0,0,0,0,0,1,28050,28050,17.068273092369498,17.068273092369498]
[null,"ZN2466:PA30","FLEMINGTON","URBAN",1838,0,6293.0900755583798,2.6849219999999998,12.231236752167366,0,3,584.66666666670005,584.66666666670005,0.16322089227421099,0.16322089227421099,0,0,0,0,0]
[null,"ZN2466:PA40","FLEMINGTON","URBAN",851,0,4516.4960136905001,4.4986724999999996,3580.2623234503121,0,3,102141,102141,110.340775558167,110.340775558167,0,0,0,0,0]
[null,"ZN2466:PA44","FLEMINGTON","URBAN",21,0,1556.1827949676201,2.7572815999999998,0,22.987686472666667,0,0,0,0,0,2,1070,1070,33.3333333333333,33.3333333333333]
[null,"ZN2466:PA45","FLEMINGTON","URBAN",1402,0,9075.1205073552901,3.3561524999999999,1044.0256642046465,0,3,39924.466666666704,39879,5.6348074179743204,5.5634807417974299,0,0,0,0,0]
[null,"ZN2466:PA5","FLEMINGTON","URBAN",1243,0,7219.2654949560301,3.0295821999999997,142.90569743609495,0,4,6053.9166666665997,5890.2333333332999,6.4360418342719283,6.3555913113435292,0,0,0,0,0]
[null,"ZN2466:PA6","FLEMINGTON","URBAN",24,0,2792.5460029098399,1.8499303,39.782751101500004,0,1,2760,2760,100,100,0,0,0,0,0]
[null,"ZN2466:PA7","FLEMINGTON","URBAN",277,0,7783.0304750260302,5.5869228,1049.1171394270298,0,6,24100.216666666598,23775.333333333299,104.69314079422382,103.97111913357399,0,0,0,0,0]
[null,"ZN2473:PA30","NORTH SYDNEY","URBAN",141,0,507.54767702446401,2.4849809999999999,4.558816716506251,0,1,235.45,235.45,0.70921985815602806,0.70921985815602806,0,0,0,0,0]
[null,"ZN2473:PA31","NORTH SYDNEY","URBAN",2093,0,6970.74688875216,4.2444617999999998,639.73211784802379,0,3,19343.95,13880.233333333301,5.5422838031533637,5.4945054945054901,0,0,0,0,0]
[null,"ZN2473:PA33","NORTH SYDNEY","URBAN",65,0,384.90197871409202,2.2859920999999996,1652.4972072506332,0,2,92776,92776,86.153846153846104,86.153846153846104,0,0,0,0,0]
[null,"ZN2473:PA4","NORTH SYDNEY","URBAN",432,0,1899.32089051198,1.6328514999999999,2.3150954101386185,0,1,181.96666666670001,181.96666666670001,0.23148148148148098,0.23148148148148098,0,0,0,0,0]
[null,"ZN2473:PA41","NORTH SYDNEY","URBAN",766,0,3526.2741450037001,4.9156922999999999,720.06507867320818,3861.7805697517751,3,18799.95,18799.95,3.9164490861618799,3.9164490861618799,3,100826,100826,15.4046997389034,15.4046997389034]
[null,"ZN2568:PA14","ST  PETERS","URBAN",1489,0,7845.6830336575904,6.5666336999999997,72.386566086309628,13.558730541812501,2,1414.7666666667001,0,0.13431833445265301,0,1,265,265,6.7159167226326394E-2,6.7159167226326394E-2]
[null,"ZN2568:PA16","ST  PETERS","URBAN",1636,0,1522.59739350428,2.1584106999999997,1021.3103177806556,0,5,60728.6,460.7,6.9070904645476761,0.12224938875305599,0,0,0,0,0]
[null,"ZN2568:PA17","ST  PETERS","URBAN",190,0,2284.8183373104998,1.7052110999999999,6.2525970110174995,0,2,470.6,470.6,1.0526315789473699,1.0526315789473699,0,0,0,0,0]
[null,"ZN2568:PA19","ST  PETERS","URBAN",1027,0,6589.0381199749299,4.0273830000000004,623.92853147219591,0,5,19882.983333333399,19882.983333333399,3.6027263875365096,3.6027263875365096,0,0,0,0,0]
[null,"ZN2568:PA20","ST  PETERS","URBAN",14,0,1925.1120241487199,0.72550019999999993,0,0.39569990075,0,0,0,0,0,1,70,70,100,100]
[null,"ZN2568:PA21","ST  PETERS","URBAN",576,0,2510.05287362944,2.1041409999999998,0,1.9673718349999996,0,0,0,0,0,1,120,120,0.17361111111111099,0.17361111111111099]
[null,"ZN2568:PA22","ST  PETERS","URBAN",673,0,1582.96961447018,1.1967896999999998,1561.339979127752,0,4,167436.16666666669,91.166666666699996,34.769687964338814,0.148588410104012,0,0,0,0,0]
[null,"ZN2568:PA25","ST  PETERS","URBAN",304,0,3662.65646701266,3.1562114999999999,181.21134076879005,0,4,7368.6666666665997,7368.6666666665997,3.6184210526315796,3.6184210526315796,0,0,0,0,0]
[null,"ZN2568:PA26","ST  PETERS","URBAN",2771,0,6802.2197268290201,4.7167033999999992,2107.7814437627699,219.40335453025,3,57353.066666666702,57353.066666666702,7.3980512450378901,7.3980512450378901,3,5970,5970,4.8357993504150096,4.8357993504150096]
[null,"ZN2568:PA27","ST  PETERS","URBAN",2360,0,6570.02703590084,5.3879338999999993,369.34800609030736,0,4,8797.9833333333008,8797.9833333333008,2.8813559322033897,2.8813559322033897,0,0,0,0,0]
[null,"ZN2568:PA29","ST  PETERS","URBAN",1762,0,4793.0478225157403,3.246661,119.96759832819177,12.268996641458333,9,4742.3833333331995,1311.6833333333,0.51078320090805907,0.227014755959137,1,485,485,5.67536889897843E-2,5.67536889897843E-2]
[null,"ZN2568:PA30","ST  PETERS","URBAN",95,0,2542.0184090646999,1.8499303,2.3828810880184665,11.963653410958333,1,165.3166666667,165.3166666667,1.0526315789473699,1.0526315789473699,1,830,830,2.1052631578947398,2.1052631578947398]
[null,"ZN2568:PA31","ST  PETERS","URBAN",1093,0,707.86588671631898,1.1967896999999998,15.853098567011141,1069.8090661740623,1,1700.0666666667,0,0.64043915827996301,0,1,114725,114725,32.296431838975295,32.296431838975295]
[null,"ZN2568:PA32","ST  PETERS","URBAN",2415,0,3912.9860404353599,4.3177734999999995,5989.6469009558268,0,9,178037.3,178037.3,24.513457556935801,24.513457556935801,0,0,0,0,0]
[null,"ZN2568:PA33","ST  PETERS","SHORT RURAL",30,0,1845.0459627257901,1.1606099000000001,0,0.94952397443750014,0,0,0,0,0,1,105,105,23.3333333333333,23.3333333333333]
[null,"ZN2568:PA38","ST  PETERS","URBAN",262,0,3921.8090754650698,1.7594808,163.468863455205,0,3,11923.95,11923.95,27.480916030534303,27.480916030534303,0,0,0,0,0]
[null,"ZN2568:PA39","ST  PETERS","URBAN",1054,0,3544.4071674793499,2.0317813999999998,158.4579174405919,0,3,10009.3666666667,9779.85,5.7874762808349152,5.6925996204933593,0,0,0,0,0]
[null,"ZN2568:PA41","ST  PETERS","URBAN",27,0,1896.36659587281,2.0860510999999997,0,2.1942650008125,0,0,0,0,0,1,135,135,100,100]
[null,"ZN2568:PA42","ST  PETERS","URBAN",304,0,4984.1219689272802,2.0498713,159.21655590160171,0,2,9968.5333333333001,9968.5333333333001,20.065789473684202,20.065789473684202,0,0,0,0,0]
[null,"ZN2568:PA43","ST  PETERS","URBAN",286,0,2993.43328825249,1.1606099000000001,180.10209023711667,0,1,19916,19916,96.503496503496507,96.503496503496507,0,0,0,0,0]
[null,"ZN2568:PA6","ST  PETERS","URBAN",92,0,5516.9697624585697,4.7347932999999998,0,0.51648703580833333,0,0,0,0,0,1,14,14,2.1739130434782603,2.1739130434782603]
[null,"ZN2568:PA8","ST  PETERS","URBAN",5,0,6359.1337517212196,4.0273830000000004,0,5.9622049162500002,0,0,0,0,0,1,190,0,20,0]
[null,"ZN2568:PA9","ST  PETERS","URBAN",1168,0,4213.9237970634604,3.3923323000000001,14.566632492046251,0,2,551.1,551.1,0.17123287671232901,0.17123287671232901,0,0,0,0,0]
[null,"ZN2602:PA10","CLOVELLY","URBAN",701,0,3195.2065303858399,1.4329104999999998,605.84700880504477,0,5,54264.216666666602,54180.666666666599,23.823109843081362,23.5378031383738,0,0,0,0,0]
[null,"ZN2602:PA15","CLOVELLY","URBAN",2037,0,6304.2791774034804,3.8998016,341.66220043804339,0,7,11244.083333333299,6716.9,4.95827196858124,2.8473244968090299,0,0,0,0,0]
[null,"ZN2602:PA17","CLOVELLY","URBAN",1547,0,4423.6369400900003,2.6125623999999998,142.1491482567132,0,2,6983.0833333333003,6496,3.6845507433742695,3.6199095022624403,0,0,0,0,0]
[null,"ZN2602:PA18","CLOVELLY","URBAN",1287,0,2592.0946928768099,2.7753714999999999,485.17405166473617,0,4,22436.0333333333,22436.0333333333,11.4219114219114,11.4219114219114,0,0,0,0,0]
[null,"ZN2602:PA19","CLOVELLY","URBAN",1,0,2170.8684791321102,3.9540712999999994,1.1091169996499997,0,1,36,36,100,100,0,0,0,0,0]
[null,"ZN2602:PA20","CLOVELLY","URBAN",1495,0,5048.1774218620403,3.4285120999999998,722.00029426561571,0,4,27027.216666666602,27027.216666666602,7.4916387959866197,7.4916387959866197,0,0,0,0,0]
[null,"ZN2602:PA21","CLOVELLY","URBAN",1837,0,5742.2832400336802,3.7912621999999998,316.94080264976196,662.88323935899996,4,10729.1166666667,10729.1166666667,4.8448557430593393,4.8448557430593393,1,22440,22440,2.39520958083832,2.39520958083832]
[null,"ZN2602:PA27","CLOVELLY","URBAN",1817,0,6292.8250780036296,2.9391327,201.48531079388482,1399.3269567354,6,8798.2000000001008,2247.8333333333999,0.38525041276829902,0.27517886626307103,1,61104,61104,6.2740781507980197,6.2740781507980197]
[null,"ZN2602:PA28","CLOVELLY","URBAN",1233,0,3732.8830877600599,3.2104811999999998,60.64844900742083,0,6,2424.4833333334,1415.7833333333999,0.48661800486617995,0.24330900243308998,0,0,0,0,0]
[null,"ZN2602:PA29","CLOVELLY","URBAN",2182,0,6383.1313547487998,3.8636217999999998,7.3478976498649677,0,2,244.0833333333,118.4,9.1659028414298807E-2,4.5829514207149404E-2,0,0,0,0,0]
[null,"ZN2602:PA3","CLOVELLY","URBAN",1536,0,3244.22663087316,2.9753124999999998,10.240159891710842,0,2,441.71666666670001,317.76666666670002,0.1302083333333334,6.5104166666666699E-2,0,0,0,0,0]
[null,"ZN2602:PA30","CLOVELLY","URBAN",1919,0,5778.3092323286901,3.9540712999999994,244.16440527156408,0,3,7925.1500000000997,7925.1500000000997,3.2829598749348596,3.2829598749348596,0,0,0,0,0]
[null,"ZN2602:PA31","CLOVELLY","URBAN",1110,0,3510.9368056443,2.5211608000000001,729.32313302366151,0,5,37126.933333333298,37126.933333333298,10.6306306306306,10.6306306306306,0,0,0,0,0]
[null,"ZN2602:PA33","CLOVELLY","URBAN",1613,0,3019.3490778250498,3.1200316999999997,1908.0464593776378,0,6,78487.333333333401,14614.833333333399,21.69869807811531,8.7414755114693108,0,0,0,0,0]
[null,"ZN2602:PA34","CLOVELLY","URBAN",1233,0,3043.9546224127698,2.9934023999999999,70.484677614522553,0,1,3022.0333333333001,3022.0333333333001,8.1103000811030002E-2,8.1103000811030002E-2,0,0,0,0,0]
[null,"ZN2602:PA36","CLOVELLY","URBAN",1311,0,6958.3399951288302,3.8998016,47.402088448000001,0,1,1560,1560,1.8306636155606399,1.8306636155606399,0,0,0,0,0]
[null,"ZN2602:PA4","CLOVELLY","URBAN",1780,0,3615.9735463934899,3.246661,251.86816613897352,0,5,9956.4833333333008,9454.3833333333005,4.5505617977528088,4.4943820224719104,0,0,0,0,0]
[null,"ZN2602:PA41","CLOVELLY","URBAN",1389,0,4003.62825011016,3.0657619999999999,18.806944666018854,0,2,787.31666666670003,501.71666666670001,0.14398848092152622,7.1994240460763109E-2,0,0,0,0,0]
[null,"ZN2602:PA42","CLOVELLY","URBAN",1079,0,7890.4312282092897,2.5754305,91.716082521048236,18.060206381249998,2,4570.5166666667001,4570.5166666667001,7.228915662650599,7.228915662650599,1,900,900,0.18535681186283601,0.18535681186283601]
[null,"ZN2602:PA8","CLOVELLY","URBAN",1008,0,6854.6205783223104,2.9391327,2183.585777113125,0,1,95350,95350,100.099206349206,100.099206349206,0,0,0,0,0]
[null,"ZN2602:PA9","CLOVELLY","URBAN",1078,0,3691.0512892018201,2.6306522999999999,163.79216896860194,0,3,7990.9666666666999,7990.9666666666999,10.7606679035251,10.7606679035251,0,0,0,0,0]
[null,"ZN262:PA14","MARRICKVILLE","URBAN",19,0,1487.43938984694,0.7797698999999999,9.166014311203547,0,2,1508.6333333333,1508.6333333333,31.578947368421101,31.578947368421101,0,0,0,0,0]
[null,"ZN262:PA15","MARRICKVILLE","URBAN",2531,0,8037.4279381354399,4.1359224000000001,13251.918402657302,81.208836324000004,9,411221.683333333,411221.683333333,116.752271829316,116.752271829316,1,2520,2520,0.71118135124456694,0.71118135124456694]
[null,"ZN262:PA16","MARRICKVILLE","URBAN",2383,3.3501609777988399,8694.6493952556393,3.1743014000000001,6282.870667190623,0,7,254026.83333333328,40143.783333333296,155.60218212337392,77.045740663029804,0,0,0,0,0]
[null,"ZN262:PA17","MARRICKVILLE","URBAN",1687,0,4351.8693961180998,2.5392506999999997,2107.3990761692362,0,4,106515.016666667,106515.016666667,100.355660936574,100.355660936574,0,0,0,0,0]
[null,"ZN262:PA19","MARRICKVILLE","URBAN",3405,0,11098.641631279799,4.0635627999999997,178.65558825572018,2692.8468757575001,5,5642.5999999999003,5642.5999999999003,50.660792951541801,50.660792951541801,1,85050,85050,5.5506607929515406,5.5506607929515406]
[null,"ZN262:PA20","MARRICKVILLE","URBAN",618,0,3674.7164205030199,1.6690312999999999,229.20147111916651,0,5,17624.733333333301,17624.733333333301,7.6051779935275095,7.6051779935275095,0,0,0,0,0]
[null,"ZN262:PA25","MARRICKVILLE","URBAN",180,0,3729.9791736862499,1.3062811999999999,21.488699481564879,0,4,2111.2666666666,2111.2666666666,7.7777777777777803,7.7777777777777803,0,0,0,0,0]
[null,"ZN262:PA26","MARRICKVILLE","URBAN",309,0,2597.3074146827298,1.7413908999999999,13.324107355441667,0,2,982,982,1.2944983818770199,1.2944983818770199,0,0,0,0,0]
[null,"ZN262:PA27","MARRICKVILLE","URBAN",1097,0,3894.6365793088898,2.8658209999999995,1211.4089440464227,0,3,54251.45,54251.45,44.849589790337305,44.849589790337305,0,0,0,0,0]
[null,"ZN262:PA28","MARRICKVILLE","URBAN",155,0,3989.08974729908,2.1584106999999997,108.30545157483331,0,1,6440,6440,45.161290322580598,45.161290322580598,0,0,0,0,0]
[null,"ZN262:PA29","MARRICKVILLE","URBAN",421,0,1851.1880393664501,0.94353109999999996,6.7898889545244083,0,1,923.58333333329995,923.58333333329995,0.237529691211401,0.237529691211401,0,0,0,0,0]
[null,"ZN262:PA30","MARRICKVILLE","URBAN",2049,0,8221.8372213839502,4.0997425999999999,2802.5028180567824,0,5,87732.216666666704,86276.216666666704,7.8086871644704763,7.17423133235725,0,0,0,0,0]
[null,"ZN262:PA31","MARRICKVILLE","URBAN",1345,0,4245.9463104647002,2.2859920999999996,187.31602781765687,2.4936363824166667,3,10516.4666666666,8423.6833333332997,6.2453531598513026,6.1710037174721197,1,140,140,7.4349442379182201E-2,7.4349442379182201E-2]
[null,"ZN262:PA32","MARRICKVILLE","URBAN",845,0,6608.8530437385998,2.1222308999999999,1783.7352188271464,0,13,107871.6666666667,72134.700000000099,73.964497041420103,64.142011834319504,0,0,0,0,0]
[null,"ZN262:PA33","MARRICKVILLE","URBAN",191,0,2350.23320315609,1.2339216,169.33933187028032,0,4,17613.266666666699,17613.266666666699,100.52356020942399,100.52356020942399,0,0,0,0,0]
[null,"ZN262:PA34","MARRICKVILLE","URBAN",409,0.39743029010504599,4818.9959364838996,2.4126213999999995,1122.7760765412215,18.046408071999998,3,59727.4,17077.400000000001,123.2273838630806,22.982885085574601,1,960,960,0.48899755501222503,0.48899755501222503]
[null,"ZN262:PA39","MARRICKVILLE","URBAN",805,0,1242.36710830373,2.9200906999999998,233.43935078474999,0,2,10260,10260,10.8074534161491,10.8074534161491,0,0,0,0,0]
[null,"ZN262:PA40","MARRICKVILLE","URBAN",524,0,2683.0359114303501,2.6487422,337.92782849544045,0,5,16373.9666666667,16373.9666666667,15.4580152671756,15.4580152671756,0,0,0,0,0]
[null,"ZN262:PA41","MARRICKVILLE","URBAN",1152,0,6476.6237065547502,2.3221718999999998,15.981464386331295,0,3,883.26666666660003,557.68333333329997,0.60763888888888851,0.52083333333333293,0,0,0,0,0]
[null,"ZN262:PA42","MARRICKVILLE","URBAN",2059,0,8102.5048491193602,3.6094110999999995,8336.3825525571192,0,9,296422.33333333366,295716.66666666698,161.97183098591594,161.923263720253,0,0,0,0,0]
[null,"ZN262:PA5","MARRICKVILLE","URBAN",1437,0,6457.0699005327397,2.8296411999999997,220.09221410062784,11.685239138833333,4,9982.5833333333994,7417.6666666666997,4.9408489909533717,4.7320807237299904,1,530,530,6.9589422407793991E-2,6.9589422407793991E-2]
[null,"ZN262:PA6","MARRICKVILLE","URBAN",1256,0,6104.9528699122002,3.1019417999999996,1262.6217746167843,65.257100617500001,6,52240.733333333301,52240.733333333301,25.7165605095541,25.7165605095541,2,2700,2700,0.47770700636942698,0.47770700636942698]
[null,"ZN262:PA7","MARRICKVILLE","URBAN",2253,0,8515.4007633083093,4.1901921,1151.0795620233764,0,8,35256.650000000096,9634.6166666666995,11.09631602308033,3.8171327119396303,0,0,0,0,0]
[null,"ZN262:PA8","MARRICKVILLE","URBAN",113,0,1529.91808092167,2.2859920999999996,117.02932404155574,0,3,6570.3666666667004,6570.3666666667004,19.469026548672598,19.469026548672598,0,0,0,0,0]
[null,"ZN263:PA31 32ABC","DALLEY ST","CBD",449,0,1377.52327088477,13.387478099999999,0,3185.6508199807499,0,0,0,0,0,3,30540,30540,12.026726057906501,12.026726057906501]
[null,"ZN263:PA31 32GHJ","DALLEY ST","CBD",679,0,4793.4685975652501,17.0692488,3996.5336026862401,0,1,30049.599999999999,30049.599999999999,6.1855670103092804,6.1855670103092804,0,0,0,0,0]
[null,"ZN263:PA31 32KLM","DALLEY ST","CBD",567,0,4430.2277049935101,10.267446400000001,112.32072989280002,2472.0160638800003,2,1404,1404,1.41093474426808,1.41093474426808,3,30900,30900,12.874779541446198,12.874779541446198]
[null,"ZN263:PA33 34ABC","DALLEY ST","CBD",299,0,4463.4200457445904,11.808896299999999,0,1657.30183787905,0,0,0,0,0,2,18012,18012,12.709030100334401,12.709030100334401]
[null,"ZN263:PA33 34DEF","DALLEY ST","CBD",1108,0,11006.6192624341,12.824787000000001,5240.9432559879997,153.88675667750002,3,52448,52448,5.9566787003609996,5.9566787003609996,1,1540,1540,0.63176895306859204,0.63176895306859204]
[null,"ZN263:PA33 34GHJ","DALLEY ST","CBD",577,0,4002.4643517357699,14.7661189,608.51935826768397,111.60109613629167,5,5289.05,5289.05,6.4124783362218496,6.4124783362218496,1,970,970,0.86655112651646493,0.86655112651646493]
[null,"ZN263:PA33 34KLM","DALLEY ST","CBD",498,0,5567.11096253509,6.7484848,1286.4172615909999,144.60034618333333,1,24465,24465,4.2168674698795199,4.2168674698795199,1,2750,2750,2.0080321285140599,2.0080321285140599]
[null,"ZN263:PA35 37DEF","DALLEY ST","CBD",356,0,5709.81944211256,14.367189,0,394.04410364,0,0,0,0,0,1,3520,3520,4.4943820224719104,4.4943820224719104]
[null,"ZN263:PA35 37KLM","DALLEY ST","CBD",171,0,1608.87005223294,4.8795124999999997,0,290.12707079010414,0,0,0,0,0,1,7631,7631,7.6023391812865508,7.6023391812865508]
[null,"ZN2635:PA31","EPPING","URBAN",1592,9.3343641807720807,9275.2377223347194,5.2422626000000001,6275.5757604884757,498.3207456516667,15,153640.0500000001,44744.300000000097,21.168341708542709,12.9396984924623,2,12200,12200,3.32914572864322,3.32914572864322]
[null,"ZN2635:PA32","EPPING","URBAN",498,2251.9040725315099,2281.4448678025401,2.2859920999999996,89.223200347290629,0,1,5009.25,5009.25,9.0361445783132499,9.0361445783132499,0,0,0,0,0]
[null,"ZN2635:PA33","EPPING","URBAN",17,0,6103.3123872615797,3.1019417999999996,48.338593049999986,0,1,2000,2000,94.117647058823493,94.117647058823493,0,0,0,0,0]
[null,"ZN2635:PA35","EPPING","URBAN",1540,0,6509.6658407631903,3.6827227999999996,6262.0811389191331,0,5,218232.433333333,187412.433333333,20.324675324675269,14.3506493506493,0,0,0,0,0]
[null,"ZN2635:PA38","EPPING","URBAN",1012,2868.33906449591,3749.0171656289899,2.5211608000000001,6135.3144328574272,491.10111416666666,13,312324.40000000002,131028.5,144.46640316205531,125.69169960474301,1,25000,25000,4.9407114624505901,4.9407114624505901]
[null,"ZN2635:PA39","EPPING","URBAN",430,0,4002.8181985532501,2.7211018,3299.633326250892,0,4,155629,155629,91.395348837209298,91.395348837209298,0,0,0,0,0]
[null,"ZN2635:PA40","EPPING","URBAN",517,0,3715.74215545167,3.0295821999999997,0,608.07754196933331,0,0,0,0,0,2,25760,25760,21.663442940038699,21.663442940038699]
[null,"ZN2635:PA41","EPPING","URBAN",476,0,4230.0319110947603,2.4126213999999995,25.561985100318331,0,1,1359.8,1359.8,1.26050420168067,1.26050420168067,0,0,0,0,0]
[null,"ZN2635:PA43","EPPING","URBAN",914,2244.7859918129798,7334.2347276127903,2.7211018,860.27242437581526,0,7,40575.216666666602,40575.216666666602,20.568927789934399,20.568927789934399,0,0,0,0,0]
[null,"ZN2635:PA44","EPPING","URBAN",995,3.2946515032045101,6369.2039657031901,3.7912621999999998,4699.4192491240692,4.7264402093333331,3,159085.28333333301,159085.28333333301,29.246231155778901,29.246231155778901,1,160,160,0.80402010050251294,0.80402010050251294]
[null,"ZN2635:PA46","EPPING","URBAN",497,2118.4180655669502,1663.02062655857,1.4690902999999997,491.91953293701738,0,3,42974.933333333298,9961.9333333332997,117.30382293762619,16.901408450704199,0,0,0,0,0]
[null,"ZN2635:PA50","EPPING","URBAN",777,0,6210.5902859497,2.6487422,1853.1171014415586,0,2,89791,89791,198.84169884169899,198.84169884169899,0,0,0,0,0]
[null,"ZN2635:PA51","EPPING","URBAN",383,1.2981962168187,5811.6405417041497,4.5891219999999997,721.103622637596,0,2,20166.833333333299,16271.2,23.237597911227123,22.976501305482998,0,0,0,0,0]
[null,"ZN2635:PA52","EPPING","URBAN",1333,3787.6283799714301,1967.5307775259,3.2285710999999999,2234.5808014956178,0,11,88829.116666666698,32100.5,111.2528132033006,107.501875468867,0,0,0,0,0]
[null,"ZN2635:PA55","EPPING","URBAN",557,1.35784415723334,6858.6829140243399,0.90735129999999986,1314.9186605748814,0,6,185991.48333333369,43014.916666666701,191.0233393177738,98.204667863554789,0,0,0,0,0]
[null,"ZN2635:PA57","EPPING","URBAN",1230,1818.6907008877199,5350.0533078158396,3.2647508999999997,8253.8703126099008,721.29025837068741,7,324472,166665.566666667,20.16260162601629,15.853658536585399,2,28355,28355,5.44715447154472,5.44715447154472]
[null,"ZN2635:PA58","EPPING","SHORT RURAL",2493,3366.48528057878,9608.8918487919691,5.7145041999999995,37658.999686007191,0,30,845784.76666666707,680124.71666666702,352.70758122743666,306.33774568792603,0,0,0,0,0]
[null,"ZN2635:PA62","EPPING","URBAN",227,0,5114.3748659492103,4.4805826,0,2.0946723655000001,0,0,0,0,0,1,60,60,1.3215859030837001,1.3215859030837001]
[null,"ZN2635:PA65","EPPING","URBAN",218,0,4265.3758646814304,1.52336,1528.1745200382263,12.997117100000002,6,128747.866666667,128747.866666667,197.24770642201801,197.24770642201801,2,1095,585,1.376146788990825,0.45871559633027498]
[null,"ZN2835:PA10","BURWOOD","URBAN",1509,0,12871.1990248069,5.3517541,128.93356781818335,0,5,3092,1385.8333333333001,0.33134526176275736,0.26507620941020599,0,0,0,0,0]
[null,"ZN2835:PA15","BURWOOD","URBAN",2470,0,5436.3795695694398,2.5944724999999997,590.51180900408451,0,6,29211.183333333302,24888.483333333301,8.7044534412955556,8.6639676113360409,0,0,0,0,0]
[null,"ZN2835:PA16","BURWOOD","URBAN",1414,0,5232.7880157995096,5.5326530999999992,5346.503920438573,653.95729114787491,6,124024.1,114181.1,112.37623762376219,107.213578500707,1,15170,15170,2.6166902404526198,2.6166902404526198]
[null,"ZN2835:PA17","BURWOOD","URBAN",311,0,2555.9693253796399,1.8680201999999999,272.5276463349,172.84051485937502,1,18724,18724,39.871382636655902,39.871382636655902,2,11875,11875,12.2186495176849,12.2186495176849]
[null,"ZN2835:PA18","BURWOOD","URBAN",506,0,4320.5873290865802,2.3583516999999996,6.9465478607705302,0,3,378.03333333339998,378.03333333339998,0.98814229249011809,0.98814229249011809,0,0,0,0,0]
[null,"ZN2835:PA19","BURWOOD","URBAN",798,0,5309.4531516131401,1.3786407999999999,1.577449419865,0,2,146.85,146.85,0.25062656641603998,0.25062656641603998,0,0,0,0,0]
[null,"ZN2835:PA20","BURWOOD","URBAN",803,0,2627.1808183959201,2.7753714999999999,4.7790740825208333,223.90286448154168,2,221,221,0.24906600249065997,0.24906600249065997,2,10354,10354,15.193026151930301,15.193026151930301]
[null,"ZN2835:PA21","BURWOOD","URBAN",175,0,618.53758949288795,2.5030709,45.80236638092871,0,2,2348.4666666666999,0,1.1428571428571401,0,0,0,0,0,0]
[null,"ZN2835:PA22","BURWOOD","URBAN",600,0,2962.97787371607,4.4624927000000003,13.062026028227548,1898.2473353637752,1,375.6666666667,375.6666666667,0.16666666666666699,0.16666666666666699,2,54594,54594,27,27]
[null,"ZN2835:PA23","BURWOOD","URBAN",2204,0,10989.547779525999,5.2784423999999994,26390.642425827689,499.70354395499999,4,641673.066666667,641673.066666667,220.32667876588002,220.32667876588002,1,12150,12150,1.2250453720508199,1.2250453720508199]
[null,"ZN2835:PA24","BURWOOD","URBAN",867,0,5176.75027790897,1.9775116999999998,269.86871597528915,931.88261350799985,2,17514.7166666667,90.716666666699993,1.9607843137254881,0.115340253748558,5,60480,60480,15.570934256055398,15.570934256055398]
[null,"ZN2835:PA27","BURWOOD","URBAN",909,0,5010.7883561661702,2.8839108999999996,1118.514204138123,0,8,49777.0666666666,1393.3166666667,7.7007700770077001,0.44004400440044,0,0,0,0,0]
[null,"ZN2835:PA28","BURWOOD","URBAN",1396,0,4161.9670405034203,2.5392506999999997,12.802540538848298,242.16833925899999,1,647.08333333329995,0,7.1633237822349594E-2,0,1,12240,12240,2.4355300859598898,2.4355300859598898]
[null,"ZN2835:PA29","BURWOOD","URBAN",847,0,2672.0247077270201,1.5966716999999999,781.84806695230395,640.94659829199998,2,62845.816666666702,88,7.3199527744982316,0.118063754427391,1,51520,51520,10.86186540732,10.86186540732]
[null,"ZN2835:PA30","BURWOOD","URBAN",1842,0,7910.9931930101002,4.4444027999999998,818.86994440067554,0,3,23646.733333333301,23646.733333333301,7.4918566775244306,7.4918566775244306,0,0,0,0,0]
[null,"ZN2835:PA31","BURWOOD","URBAN",1341,0,12527.815629286901,5.5688329000000003,608.96888962606204,0,8,14034.616666666701,5308.9833333334,2.7591349739000739,2.3862788963460098,0,0,0,0,0]
[null,"ZN2835:PA32","BURWOOD","SHORT RURAL",919,0,7597.9712190365999,1.6871212,104.98795771214274,0,5,7986.6166666666004,6613.5333333333001,2.9379760609357968,2.8291621327529897,0,0,0,0,0]
[null,"ZN2835:PA33","BURWOOD","URBAN",468,0,4964.5505590786397,3.5370514999999996,228.54334283157831,0,4,8292.7166666666999,8292.7166666666999,4.4871794871794899,4.4871794871794899,0,0,0,0,0]
[null,"ZN2835:PA35","BURWOOD","URBAN",790,0,3470.91074675147,3.8817116999999999,425.67019787960351,79.483869625049991,3,14074.0666666667,14074.0666666667,14.303797468354402,14.303797468354402,2,2628,2628,1.51898734177215,1.51898734177215]
[null,"ZN2835:PA36","BURWOOD","URBAN",768,0,6164.1143388752598,3.7550823999999996,4995.8633251083338,961.13680954500012,4,170750,170750,204.6875,204.6875,2,32850,32850,10.546875,10.546875]
[null,"ZN2835:PA41","BURWOOD","URBAN",1249,0,4747.9312105601603,3.246661,545.02171678395837,6.0712560700000004,1,21545,21545,11.128903122498,11.128903122498,1,240,240,8.0064051240992806E-2,8.0064051240992806E-2]
[null,"ZN2835:PA43","BURWOOD","URBAN",170,0,1835.7846568734899,2.4668911000000002,196.0561701725,0,1,10200,10200,100,100,0,0,0,0,0]
[null,"ZN2835:PA8","BURWOOD","URBAN",2,0,3190.5626522927701,3.8455318999999997,0,124.25698698329582,0,0,0,0,0,4,4147,4147,200,200]
[null,"ZN2835:PA9","BURWOOD","URBAN",1277,0,5328.5453175188004,3.7912621999999998,7728.3668270132275,161.28977214350002,8,261621.566666667,261621.566666667,31.401722787783896,31.401722787783896,1,5460,5460,7.8308535630383702E-2,7.8308535630383702E-2]
[null,"ZN3154:PA10","ST IVES","URBAN",977,9.1709115848060403,6241.3037977698496,3.1019417999999996,6410.0885782120877,0,9,265216.183333333,30694,27.840327533265064,19.9590583418628,0,0,0,0,0]
[null,"ZN3154:PA11","ST IVES","URBAN",778,2152.7889041950598,6875.32367740878,3.1200316999999997,5171.7967905809528,0,6,212741.4333333337,2076.7166666666999,103.85604113110556,0.38560411311053999,0,0,0,0,0]
[null,"ZN3154:PA12","ST IVES","URBAN",708,3536.4152937601002,4818.2104794253701,2.8115512999999996,6890.946587116784,0,6,314559.28333333373,82498.766666666706,123.02259887005627,116.101694915254,0,0,0,0,0]
[null,"ZN3154:PA13","ST IVES","SHORT RURAL",623,2001.2704565910301,6283.6629961601702,2.0679612000000001,742.68676536394207,0,6,46092.783333333406,7796.8166666667003,19.101123595505591,8.5072231139646899,0,0,0,0,0]
[null,"ZN3154:PA14","ST IVES","URBAN",425,4.6808591355822502,2685.8263243935999,1.4871802000000001,1796.0967227463016,0,6,155001.45000000001,83688.75,227.29411764705924,218.35294117647101,0,0,0,0,0]
[null,"ZN3154:PA16","ST IVES","URBAN",1004,4264.7014982308601,4368.6599253561099,3.2837928999999995,4232.9151009281914,0,15,165437.2999999997,158067.58333333299,130.6772908366535,130.37848605577699,0,0,0,0,0]
[null,"ZN3154:PA17","ST IVES","URBAN",928,1401.5184933975199,5789.0255800227196,2.8658209999999995,3901.4509202712225,0,26,174721.64999999962,67739.366666666596,55.6034482758621,44.181034482758605,0,0,0,0,0]
[null,"ZN3154:PA18","ST IVES","URBAN",1079,10.0458797270999,8665.6807240567796,3.7008126999999997,9474.4995956281709,0,16,328570.6833333337,98182.216666666704,18.072289156626471,10.0092678405931,0,0,0,0,0]
[null,"ZN3154:PA19","ST IVES","URBAN",1014,2263.0346423232099,6173.1378300225897,3.5189615999999999,2472.6779969648155,0,14,90182.583333333299,80159.5,29.783037475345221,28.599605522682499,0,0,0,0,0]
[null,"ZN3154:PA22","ST IVES","SHORT RURAL",723,4215.9373313393899,3971.3710117925998,2.2859920999999996,2244.9495883359414,0,3,126038,25808,12.72475795297372,9.1286307053941904,0,0,0,0,0]
[null,"ZN3154:PA23","ST IVES","URBAN",471,1839.3569270610101,1468.58803569047,1.4148205999999999,5116.4839271853771,0,5,464130.25,16305.25,68.1528662420383,17.197452229299401,0,0,0,0,0]
[null,"ZN3154:PA24","ST IVES","URBAN",1000,2309.7017693074799,2405.5069559721301,2.7030118999999999,138.1901356357325,0,4,6561.4333333332997,6561.4333333332997,2.7,2.7,0,0,0,0,0]
[null,"ZN3154:PA25","ST IVES","URBAN",563,2070.26170876378,1200.5784006973699,1.4510003999999999,147.68650867135,0,3,13063,13063,11.722912966252199,11.722912966252199,0,0,0,0,0]
[null,"ZN3154:PA3","ST IVES","URBAN",326,0,2820.5359273137201,1.3605509,705.85443711961864,0,4,66584.016666666692,45634.016666666699,18.098159509202418,10.429447852760699,0,0,0,0,0]
[null,"ZN3154:PA4","ST IVES","URBAN",1289,3204.7138861636299,5187.8463938920104,3.8455318999999997,550.53555738700118,133.03617608049998,10,18373.7833333333,11342.7833333333,13.653995345228859,6.7494181536074507,1,4440,4440,5.7408844065166802,5.7408844065166802]
[null,"ZN3154:PA5","ST IVES","URBAN",1151,4299.5903969860301,3830.7709486222798,3.1743014000000001,18888.205982158852,309.04006461212498,8,763681.35000000009,4647.1000000001004,111.9026933101654,4.7784535186794095,2,12495,12495,18.679409209383099,18.679409209383099]
[null,"ZN3154:PA6","ST IVES","URBAN",323,0,1771.4188396444399,2.4307113,280.68031058925004,0,1,14820,14820,16.099071207430299,16.099071207430299,0,0,0,0,0]
[null,"ZN3155:PA15","DOUBLE BAY","URBAN",1093,0,1800.0103878648399,3.1019417999999996,115.54494743224126,0,3,4780.6500000000005,4569.8,31.83897529734671,31.747483989021003,0,0,0,0,0]
[null,"ZN3155:PA16","DOUBLE BAY","URBAN",736,0,2630.3693947339002,2.8115512999999996,666.67621183077665,224.105239683875,8,30432.566666666702,8926.9166666667006,23.097826086956498,18.478260869565201,2,10230,10230,25.271739130434799,25.271739130434799]
[null,"ZN3155:PA17","DOUBLE BAY","URBAN",1128,0,7444.67706047305,3.246661,3380.4458667256517,318.74094367500004,2,133630.83333333299,133630.83333333299,107.535460992908,107.535460992908,1,12600,12600,3.7234042553191502,3.7234042553191502]
[null,"ZN3155:PA18","DOUBLE BAY","URBAN",449,0,1227.6308201952399,2.0317813999999998,382.12067081681624,0,2,24137.55,24137.55,99.554565701559,99.554565701559,0,0,0,0,0]
[null,"ZN3155:PA19","DOUBLE BAY","URBAN",972,0,4641.8301376982199,3.0476720999999998,36.804615279863746,0,3,1549.9,1549.9,0.30864197530864201,0.30864197530864201,0,0,0,0,0]
[null,"ZN3155:PA20","DOUBLE BAY","URBAN",1197,0,2016.78708818255,2.7391916999999997,3436.5002991092897,114.184347344375,7,161013.98333333299,161013.98333333299,157.97827903091098,157.97827903091098,1,5350,5350,17.878028404344199,17.878028404344199]
[null,"ZN3155:PA21","DOUBLE BAY","URBAN",486,0,3488.2497994835999,1.7956605999999997,724.13729714852673,0,5,51756.666666666599,51756.666666666599,23.456790123456798,23.456790123456798,0,0,0,0,0]
[null,"ZN3155:PA22","DOUBLE BAY","URBAN",660,0,6063.1186762977104,3.0295821999999997,205.34380446294688,0,9,8698.9833333333008,8698.9833333333008,15.151515151515099,15.151515151515099,0,0,0,0,0]
[null,"ZN3155:PA23","DOUBLE BAY","URBAN",2139,0,10405.6426396717,7.2559541000000003,2981.6809747429234,1166.9025383620001,16,52739.533333333296,51704.5666666666,14.913510986442319,14.866760168303001,3,20640,20640,4.5348293595137905,4.5348293595137905]
[null,"ZN3155:PA24","DOUBLE BAY","URBAN",719,0,3014.0941770373502,3.9912031999999997,39.590504550543407,0,2,1273.0833333333001,1273.0833333333001,0.278164116828929,0.278164116828929,0,0,0,0,0]
[null,"ZN3155:PA27","DOUBLE BAY","URBAN",368,0,1709.4037513907199,2.5573405999999999,87.992975364800003,0,1,4416,4416,100,100,0,0,0,0,0]
[null,"ZN3155:PA28","DOUBLE BAY","URBAN",244,0,1653.6500135496799,3.8455318999999997,91.327537093100005,0,1,3048,3048,104.09836065573801,104.09836065573801,0,0,0,0,0]
[null,"ZN3155:PA29","DOUBLE BAY","URBAN",1744,0,7646.9468385851296,3.7912621999999998,6295.311632555924,0,6,213109.61666666699,213109.61666666699,22.2477064220183,22.2477064220183,0,0,0,0,0]
[null,"ZN3155:PA30","DOUBLE BAY","URBAN",302,0,2297.8914316014302,4.3720431999999994,246.0795437058089,1545.2112281759998,3,7223.7166666666999,7223.7166666666999,105.298013245033,105.298013245033,1,45360,45360,35.761589403973495,35.761589403973495]
[null,"ZN3155:PA32","DOUBLE BAY","URBAN",776,0,3573.7324448651798,2.4307113,174.31724552385003,0,1,9204,9204,98.840206185566998,98.840206185566998,0,0,0,0,0]
[null,"ZN3155:PA33","DOUBLE BAY","URBAN",1413,0,3328.3450147704398,3.4827817999999997,2537.8896744384783,0,2,93522.5,0,7.9971691436659595,0,0,0,0,0,0]
[null,"ZN3155:PA34","DOUBLE BAY","URBAN",754,0,4634.4093810792901,3.4104221999999997,240.43135467779999,0,1,9048,9048,100,100,0,0,0,0,0]
[null,"ZN3155:PA35","DOUBLE BAY","URBAN",1651,0,5078.3264811506797,3.0838518999999995,261.870927109165,76.890707373333328,6,10898.416666666701,10898.416666666701,3.8158691701998801,3.8158691701998801,1,3200,3200,1.9382192610539102,1.9382192610539102]
[null,"ZN3155:PA36","DOUBLE BAY","URBAN",335,0,1812.76104408426,2.3221718999999998,554.35139165422504,0,4,30638,7688,27.462686567164198,17.313432835820901,0,0,0,0,0]
[null,"ZN3155:PA44","DOUBLE BAY","URBAN",2159,0,8056.8171552336798,4.2987314999999997,251.1942825561251,183.38119908281251,4,7499.6166666667004,7499.6166666667004,3.3348772579898198,3.3348772579898198,1,5475,5475,3.3811949976841102,3.3811949976841102]
[null,"ZN3288:PA41 42ABC","CITY SOUTH","CBD",912,0,6849.4786388740604,11.718446799999999,1016.4209670171332,1780.8367356002666,1,11132,11132,4.8245614035087705,4.8245614035087705,6,19504,19504,8.6622807017543799,8.6622807017543799]
[null,"ZN3288:PA41 42DEF","CITY SOUTH","CBD",1069,0,7508.7827117257002,12.698157699999999,0,2226.1457717812505,0,0,0,0,0,3,22500,15900,5.61272217025257,3.5547240411599601]
[null,"ZN3288:PA41 42KLM","CITY SOUTH","CBD",1508,0,7877.6156696439903,13.477927599999999,262.32876700323328,502.49925945174988,1,2498,2498,6.6312997347480099E-2,6.6312997347480099E-2,2,4785,4785,1.3262599469495999,1.3262599469495999]
[null,"ZN3288:PA43 44ABC","CITY SOUTH","CBD",1353,0,6279.5928436678996,21.8402219,0,3226.4559812869998,0,0,0,0,0,2,18960,18960,3.7694013303769398,3.7694013303769398]
[null,"ZN3288:PA43 44GHJ","CITY SOUTH","CBD",717,0,4053.3099475215899,11.047216299999999,0,449.31790496175,0,0,0,0,0,2,5220,5220,8.7866108786610901,8.7866108786610901]
[null,"ZN3288:PA43 44KLM","CITY SOUTH","CBD",1168,0,5712.9150091788997,7.3644935,2563.2969612041461,0,1,44671,44671,2.6541095890410999,2.6541095890410999,0,0,0,0,0]
[null,"ZN3288:PA45 46ABC","CITY SOUTH","CBD",1312,0,5618.1634633748199,15.3278579,0,48234.493901723348,0,0,0,0,0,4,403874,403874,106.93597560975601,106.93597560975601]
[null,"ZN3288:PA45 46GHJ","CITY SOUTH","CBD",554,0,7780.1331677376702,11.355696699999999,0,5314.0969954572502,0,0,0,0,0,1,60060,60060,25.812274368230998,25.812274368230998]
[null,"ZN3288:PA45 46KLM","CITY SOUTH","CBD",1158,0,10467.595027562,13.042817899999999,13.350175526821861,4035.5402448867917,1,131.36666666670001,131.36666666670001,8.6355785837651092E-2,8.6355785837651092E-2,2,39710,39710,3.7996545768566397,3.7996545768566397]
[null,"ZN340:PA1","BOTANY","URBAN",358,0,5039.6824913441396,1.4329104999999998,13.112453531982291,0,1,1174.45,1174.45,0.27932960893854702,0.27932960893854702,0,0,0,0,0]
[null,"ZN340:PA19","BOTANY","URBAN",291,0,3890.7745137976099,1.2339216,12.690883656,0,1,1320,1320,2.7491408934707899,2.7491408934707899,0,0,0,0,0]
[null,"ZN340:PA2","BOTANY","URBAN",634,0,4739.72071474522,2.2679022,426.01145232269249,0,4,24108.3,24108.3,98.4227129337539,98.4227129337539,0,0,0,0,0]
[null,"ZN340:PA21","BOTANY","URBAN",966,0,5922.2417221825099,2.1403208,8.3244358948061112,0.75044998049999989,3,499.1666666667,499.1666666667,0.31055900621118004,0.31055900621118004,1,45,45,0.31055900621118004,0.31055900621118004]
[null,"ZN340:PA23","BOTANY","URBAN",311,0,2534.05163528495,1.0158906999999999,515.83848634164383,0,6,65168.299999999901,16163.483333333301,36.33440514469455,27.974276527331199,0,0,0,0,0]
[null,"ZN340:PA24","BOTANY","URBAN",543,0,6054.8815239257201,2.5030709,260.65885259081256,0,1,13365,13365,8.2872928176795604,8.2872928176795604,0,0,0,0,0]
[null,"ZN340:PA27","BOTANY","URBAN",1652,0,8756.1470821220992,3.2285710999999999,1029.6028390269259,0,6,40928.800000000097,40928.800000000097,12.1065375302663,12.1065375302663,0,0,0,0,0]
[null,"ZN340:PA28","BOTANY","SHORT RURAL",104,0,4909.75528364191,0.7978597999999999,0,0.18649972825,0,0,0,0,0,1,30,30,1.92307692307692,1.92307692307692]
[null,"ZN340:PA3","BOTANY","URBAN",649,0,2774.4260291958899,1.3605509,3.4654535284279171,0,1,326.89999999999998,326.89999999999998,0.15408320493066299,0.15408320493066299,0,0,0,0,0]
[null,"ZN340:PA4","BOTANY","SHORT RURAL",218,0,3114.5475315303302,1.0520704999999999,229.93658321562503,0,1,28050,28050,50.458715596330293,50.458715596330293,0,0,0,0,0]
[null,"ZN340:PA8","BOTANY","URBAN",591,119.554991179135,3531.7812293214001,2.0136915000000002,171.54335694935264,2.5104020700000005,6,10933.2833333333,7686.2833333333001,19.120135363790158,16.243654822334999,1,160,160,0.33840947546531303,0.33840947546531303]
[null,"ZN342:PA15","PADDINGTON","URBAN",117,0,3371.0798902176002,1.6871212,37.425198689449999,0,1,2847,2847,33.3333333333333,33.3333333333333,0,0,0,0,0]
[null,"ZN342:PA16","PADDINGTON","URBAN",1148,0,4443.7562471588399,5.1337232000000004,9.2280599666200018,0,1,230.7,230.7,8.7108013937282194E-2,8.7108013937282194E-2,0,0,0,0,0]
[null,"ZN342:PA17","PADDINGTON","URBAN",1452,0,3498.0491051342601,3.5370514999999996,6026.2188368057787,0,4,218661.91666666701,218661.91666666701,106.542699724518,106.542699724518,0,0,0,0,0]
[null,"ZN342:PA18","PADDINGTON","URBAN",1432,0,6031.9838491916098,4.2987314999999997,8920.1639376320618,317.5258022475,4,266319,266319,134.776536312849,134.776536312849,2,9480,9480,2.5837988826815699,2.5837988826815699]
[null,"ZN342:PA22","PADDINGTON","URBAN",2745,0,3880.4595820086802,4.0816526999999994,7648.9280380470891,5616.7061577453742,5,240510.56666666671,164666,32.495446265938057,27.176684881602903,5,176610,176610,18.214936247723102,18.214936247723102]
[null,"ZN342:PA23","PADDINGTON","URBAN",653,0,2410.78074867955,1.4510003999999999,5.0888891521695436,0,2,450.11666666669998,450.11666666669998,0.30627871362940301,0.30627871362940301,0,0,0,0,0]
[null,"ZN342:PA24","PADDINGTON","URBAN",964,0,3594.8086242910799,2.5211608000000001,700.15696525404667,122.578838096,3,35642.199999999997,8583,9.8547717842323603,7.7800829875518698,1,6240,6240,10.788381742738599,10.788381742738599]
[null,"ZN342:PA26","PADDINGTON","URBAN",2814,0,5641.5454859756201,4.1721021999999994,6532.5728818164353,0,2,200955.06666666671,199793,100.03553660270079,100,0,0,0,0,0]
[null,"ZN342:PA28","PADDINGTON","URBAN",1268,0,3415.52638074793,4.5710321,10812.529511109749,7.9067427749750001,6,303586.65000000002,303586.65000000002,56.466876971608805,56.466876971608805,1,222,222,7.8864353312302807E-2,7.8864353312302807E-2]
[null,"ZN342:PA35","PADDINGTON","URBAN",704,0,2872.02376131763,1.3786407999999999,688.16969447893325,0,1,64064,64064,100,100,0,0,0,0,0]
[null,"ZN3425:PA12","CASTLE COVE","URBAN",1228,4357.6423293217804,4062.5009385027101,3.9912031999999997,1820.6972557531267,1015.6647603226667,13,58546.85,14045.916666666701,15.635179153094469,7.2475570032573291,2,32660,32660,5.2117263843648196,5.2117263843648196]
[null,"ZN3425:PA15","CASTLE COVE","URBAN",1339,0,9322.9768249075205,3.3923323000000001,199.99493896756664,0,7,7566.4166666666006,4867.4999999999,4.4062733383121637,4.3315907393577202,0,0,0,0,0]
[null,"ZN3425:PA16","CASTLE COVE","URBAN",849,0,4553.6358854403898,3.8274419999999996,23.26227282674067,1.4314633079999999,1,780.03333333329999,780.03333333329999,1.6489988221437002,1.6489988221437002,1,48,48,1.8845700824499398,1.8845700824499398]
[null,"ZN3425:PA17","CASTLE COVE","URBAN",929,0,4227.2077972931602,3.2104811999999998,1580.7478389251999,0,1,63192,63192,100.10764262648,100.10764262648,0,0,0,0,0]
[null,"ZN3425:PA18","CASTLE COVE","URBAN",576,0,3863.0732458313601,3.5370514999999996,12931.839190641937,0,1,469233,469233,100,100,0,0,0,0,0]
[null,"ZN3425:PA19","CASTLE COVE","URBAN",130,0,3116.6676209159,1.8499303,94.886906291166468,0,2,6582.95,6582.95,100.76923076923102,100.76923076923102,0,0,0,0,0]
[null,"ZN3425:PA22","CASTLE COVE","URBAN",770,0,3615.9916411692002,2.8296411999999997,1636.9149660322594,1170.7286759849999,4,74244.516666666706,74244.516666666706,92.467532467532394,92.467532467532394,2,53100,53100,11.6883116883117,11.6883116883117]
[null,"ZN3425:PA23","CASTLE COVE","URBAN",755,0,2871.5527446154501,2.0498713,6.7979127455385191,0,1,425.61666666669998,425.61666666669998,0.13245033112582802,0.13245033112582802,0,0,0,0,0]
[null,"ZN3425:PA24","CASTLE COVE","URBAN",1326,0,4632.8541617848005,2.7753714999999999,108.28098801329101,2.3787246564583335,4,5007.2666666667001,687.41666666670005,0.30165912518853716,0.22624434389140299,1,110,110,7.5414781297134192E-2,7.5414781297134192E-2]
[null,"ZN3425:PA27","CASTLE COVE","URBAN",186,0,2679.4400450025,1.6147615999999998,58.350705589366655,0,1,4637.75,4637.75,8.0645161290322598,8.0645161290322598,0,0,0,0,0]
[null,"ZN3425:PA28","CASTLE COVE","URBAN",741,4791.5643856304096,3589.4495187018601,2.5573405999999999,3946.7991108521232,0,5,198073.36666666641,48653.033333333398,195.41160593792131,104.993252361673,0,0,0,0,0]
[null,"ZN3425:PA30","CASTLE COVE","URBAN",1480,4934.8957325206502,3595.2107767839302,3.4104221999999997,2161.70321651625,0,11,81350,12696.583333333299,11.95945945945946,5.8108108108108096,0,0,0,0,0]
[null,"ZN3425:PA33","CASTLE COVE","URBAN",455,2602.6990564739699,1529.8430960872399,1.4871802000000001,919.20164435757556,0,7,79326.233333333395,42550.400000000103,191.42857142857142,125.05494505494501,0,0,0,0,0]
[null,"ZN3425:PA34","CASTLE COVE","URBAN",571,0,3423.6652877821398,3.7369924999999995,0,68.717063754166674,0,0,0,0,0,1,2360,2360,0.70052539404553393,0.70052539404553393]
[null,"ZN3425:PA35","CASTLE COVE","URBAN",879,0,3408.6865699507398,2.1222308999999999,6.0746707806176357,0,1,367.36666666669998,367.36666666669998,0.113765642775882,0.113765642775882,0,0,0,0,0]
[null,"ZN3425:PA39","CASTLE COVE","URBAN",673,0,2631.3170408616402,1.4690902999999997,103.38510580277459,0,3,9031.9000000000015,1336.5333333333001,8.4695393759286741,0.297176820208024,0,0,0,0,0]
[null,"ZN3425:PA43","CASTLE COVE","URBAN",1257,0,6829.5032956736704,3.1381215999999998,3202.5689417890594,0,4,130977.99999999969,18699.166666666701,11.058074781225139,5.8870326173428804,0,0,0,0,0]
[null,"ZN3425:PA44","CASTLE COVE","URBAN",943,295.55195181948199,6400.0477850279203,3.5189615999999999,427.65803720665303,0,11,15597.3833333332,1989.7166666666001,5.0901378579003165,0.74231177094379597,0,0,0,0,0]
[null,"ZN3472:PA11","SEFTON","URBAN",448,1673.5278310610299,2212.8046597744101,2.5573405999999999,249.24966717463806,386.16482395150001,9,12508.799999999901,6878.9833333332999,4.9107142857142874,4.2410714285714306,1,19380,19380,8.4821428571428612,8.4821428571428612]
[null,"ZN3472:PA12","SEFTON","URBAN",1332,0,6800.783076918,3.1200316999999997,7685.1995983051411,0,6,316130.05,102.1,23.348348348348377,7.507507507507509E-2,0,0,0,0,0]
[null,"ZN3472:PA15","SEFTON","URBAN",183,558.97154610360201,925.97759881932996,0.81594969999999989,21.919125374542919,0,3,3447.7,1811.7833333333001,1.6393442622950842,1.0928961748633901,0,0,0,0,0]
[null,"ZN3472:PA16","SEFTON","URBAN",70,0,3889.4651724955902,2.7211018,3.4000809473376514,0,1,160.36666666670001,160.36666666670001,2.8571428571428599,2.8571428571428599,0,0,0,0,0]
[null,"ZN3472:PA17","SEFTON","URBAN",1550,0,7969.23709454045,3.1019417999999996,7578.4078001124699,0,8,313555.16666666698,7271.35,15.870967741935441,4.7096774193548399,0,0,0,0,0]
[null,"ZN3472:PA18","SEFTON","URBAN",52,337.340045747023,1588.77255421779,1.0701604,338.6152607568381,0,4,40609.466666666704,4926.4666666666999,207.69230769230802,101.92307692307701,0,0,0,0,0]
[null,"ZN3472:PA20","SEFTON","URBAN",1092,0,6546.0433375151697,2.9934023999999999,2264.6319298873773,0,5,97096.183333333291,42924.183333333298,17.673992673992711,12.3626373626374,0,0,0,0,0]
[null,"ZN3472:PA22","SEFTON","URBAN",899,805.24452520270302,4670.5421822407498,3.9731132999999996,3035.404615150529,4108.481408790688,18,98051.733333333395,86414.2,61.73526140155726,59.399332591768605,11,132715,132715,33.815350389321502,33.815350389321502]
[null,"ZN3472:PA27","SEFTON","URBAN",1858,6.6442543897102402,8000.7210468268504,4.3177734999999995,9755.3048084880247,0,23,289968.36666666699,215254.61666666699,112.54036598493009,108.66523143164699,0,0,0,0,0]
[null,"ZN3472:PA28","SEFTON","URBAN",1500,6645.0690854893501,6924.5349939785101,3.9540712999999994,41877.595512504726,0,20,1359273.583333333,292062.53333333298,384.66666666666669,81.066666666666691,0,0,0,0,0]
[null,"ZN3472:PA29","SEFTON","URBAN",691,1811.16304945507,3420.0175690054102,1.723301,3406.887477720089,0,11,253726.76666666698,231183.96666666699,368.8856729377714,329.232995658466,0,0,0,0,0]
[null,"ZN3472:PA30","SEFTON","URBAN",2673,4351.4131284408104,7385.4858939424303,3.6646329,15245.909550474147,0,25,533940.04999999993,14794.3499999999,117.35877291432854,4.1152263374485498,0,0,0,0,0]
[null,"ZN3472:PA33","SEFTON","URBAN",1554,0,7495.2792510014497,2.7391916999999997,9539.3452602139769,0,19,446957.03333333373,396010.01666666701,215.8301158301156,204.24710424710401,0,0,0,0,0]
[null,"ZN3472:PA34","SEFTON","SHORT RURAL",547,0,8855.4747973239901,4.7709731,84.434783474087283,15.798878630104166,2,2271.35,0,0.36563071297989003,0,2,425,425,0.36563071297989003,0.36563071297989003]
[null,"ZN3472:PA35","SEFTON","URBAN",414,0,4925.5552506146196,3.6465429999999999,35.204690936502082,73.730820370625011,1,1239.05,0,0.241545893719807,0,2,2595,2595,1.93236714975846,1.93236714975846]
[null,"ZN3472:PA8","SEFTON","URBAN",1142,0.88608999056912097,6234.5731476157698,3.2285710999999999,3542.1543704477572,0,10,140807.8166666663,116582.08333333299,39.929947460595436,36.077057793345006,0,0,0,0,0]
[null,"ZN35335:PA14","ROYAL NORTH SHORE","URBAN",179,0,7474.0142308927898,3.0657619999999999,87.355011278470826,0,2,3656.95,3656.95,10.614525139664801,10.614525139664801,0,0,0,0,0]
[null,"ZN35370:PA10","GALSTON","SHORT RURAL",521,16618.773357375401,3821.4603023680102,3.2285710999999999,9195.6367084464928,1190.0022062745209,10,365545.2000000003,88354.683333333305,243.378119001919,206.90978886756199,3,47305,47305,15.9309021113244,15.9309021113244]
[null,"ZN35370:PA2","GALSTON","SHORT RURAL",371,13161.364655913399,432.30019173270898,2.6125623999999998,19715.058026154544,1735.0213043471001,17,968503.116666666,106736.683333333,649.86522911051304,321.29380053908403,8,85233,85233,63.072776280323396,63.072776280323396]
[null,"ZN35370:PA4","GALSTON","SHORT RURAL",750,21965.246629648402,1960.18528552356,3.1200316999999997,9349.4410215862554,235.80939585958333,14,384588.48333333299,138498.65,264,144.933333333333,2,9700,9700,2.6666666666666701,2.6666666666666701]
[null,"ZN35370:PA8","GALSTON","SHORT RURAL",719,30505.937074691101,866.16207954228696,2.7572815999999998,9761.8947214892414,1341.6645048766666,29,454383.58333333395,209831.61666666699,323.78303198887306,221.55771905424203,4,62450,62450,16.272600834492401,16.272600834492401]
[null,"ZN35400:PA102","NORTH SYDNEY","URBAN",153,0,671.88159947749898,3.8817116999999999,0.36294004395000001,0,1,12,12,2.6143790849673199,2.6143790849673199,0,0,0,0,0]
[null,"ZN35400:PA106","NORTH SYDNEY","URBAN",68,0,613.81194800288199,3.1381215999999998,0,293.41436959999999,0,0,0,0,0,1,12000,12000,29.411764705882398,29.411764705882398]
[null,"ZN35400:PA109","NORTH SYDNEY","URBAN",53,0,295.34576619741898,1.2158316999999998,0,69.297594232854166,0,0,0,0,0,1,7315,7315,20.754716981132098,20.754716981132098]
[null,"ZN35400:PA110","NORTH SYDNEY","URBAN",1875,0,5302.4376271246101,3.1019417999999996,3443.7557702188765,0,5,142484.73333333299,142484.73333333299,12.533333333333299,12.533333333333299,0,0,0,0,0]
[null,"ZN35400:PA52","NORTH SYDNEY","URBAN",2026,0,4819.3047410465097,3.8817116999999999,722.07526643925735,0,6,23874.199999999997,14731.016666666699,8.4402764067127265,8.3415597235932797,0,0,0,0,0]
[null,"ZN35400:PA59","NORTH SYDNEY","URBAN",125,0,698.35301700284401,1.5604918999999999,0,741.08085433479164,0,0,0,0,0,3,60950,60950,110.4,110.4]
[null,"ZN35400:PA61","NORTH SYDNEY","URBAN",346,0,2537.2144176209599,2.0136915000000002,132.33166111659952,0.47070038812500009,3,8434.1333333333005,8056,71.965317919075162,71.676300578034699,1,30,30,0.57803468208092501,0.57803468208092501]
[null,"ZN35400:PA62","NORTH SYDNEY","URBAN",166,0,1200.01658397851,3.5732312999999998,0,210.48118972649999,0,0,0,0,0,1,7560,7560,8.4337349397590398,8.4337349397590398]
[null,"ZN35400:PA67","NORTH SYDNEY","URBAN",79,0,855.68543632071203,3.0657619999999999,0,127.08094450333333,0,0,0,0,0,1,5320,5320,35.443037974683499,35.443037974683499]
[null,"ZN35400:PA68","NORTH SYDNEY","URBAN",400,0,5292.6312762893103,4.0454728999999992,966.62226062132493,0,1,30666,30666,109.5,109.5,0,0,0,0,0]
[null,"ZN35400:PA72","NORTH SYDNEY","URBAN",226,0,1440.9534845174201,1.1786998,325.18742621893921,1.9043098525045832,3,35407.9,35407.9,87.610619469026503,87.610619469026503,1,207.35,207.35,0.44247787610619504,0.44247787610619504]
[null,"ZN35400:PA73","NORTH SYDNEY","URBAN",1208,0,3504.8244242507299,2.9753124999999998,6.1665830989583315,363.04019296874992,1,266,266,0.165562913907285,0.165562913907285,1,15660,15660,2.9801324503311299,2.9801324503311299]
[null,"ZN35400:PA77","NORTH SYDNEY","URBAN",532,0,2547.8438533326098,2.8296411999999997,519.52462973147919,128.9785829475,3,23563.75,23563.75,11.654135338345901,11.654135338345901,1,5850,5850,0.18796992481203001,0.18796992481203001]
[null,"ZN35400:PA79","NORTH SYDNEY","URBAN",958,0,2909.6909847111301,4.2082819999999996,252.72093503363166,1991.9639829375003,4,7707.3666666666995,2527.3666666667,4.9060542797494699,2.8183716075156502,3,60750,60750,17.536534446764097,17.536534446764097]
[null,"ZN35400:PA82","NORTH SYDNEY","URBAN",820,0,4031.8639152840401,3.246661,299.8315107069792,0,4,11852.5,11579.8,8.7804878048780459,8.6585365853658498,0,0,0,0,0]
[null,"ZN35400:PA95","NORTH SYDNEY","URBAN",710,0,4100.6693450152097,3.3561524999999999,3696.6184764507479,0,3,141361.96666666699,141361.96666666699,113.380281690141,113.380281690141,0,0,0,0,0]
[null,"ZN35500:PA14","TOP RYDE","URBAN",72,0,8819.26382663808,3.7550823999999996,209.34349687350002,74.60879343500001,1,7155,7155,106.944444444444,106.944444444444,2,2550,2550,23.6111111111111,23.6111111111111]
[null,"ZN35500:PA15","TOP RYDE","URBAN",195,0,1014.78439971649,1.2881912999999998,183.8706829757875,0,1,18319,18319,101.02564102564099,101.02564102564099,0,0,0,0,0]
[null,"ZN35500:PA16","TOP RYDE","URBAN",355,0,2344.4934736536602,0.83403959999999999,216.16956793752817,0,2,33264.233333333301,33264.233333333301,100.56338028169,100.56338028169,0,0,0,0,0]
[null,"ZN35500:PA18","TOP RYDE","SHORT RURAL",591,636.27416610922899,7253.5951745388302,2.1945904999999999,1267.6550711722875,0,3,74133.966666666704,74133.966666666704,108.62944162436601,108.62944162436601,0,0,0,0,0]
[null,"ZN35500:PA19","TOP RYDE","SHORT RURAL",330,0,4280.1516482345296,0.50746930000000001,55.447385535804173,61.619628908933336,2,14023,14023,45.7575757575758,45.7575757575758,1,15584,15584,9.696969696969699,9.696969696969699]
[null,"ZN35500:PA20","TOP RYDE","URBAN",98,0,1177.49371938328,2.8839108999999996,215.2446553989875,0,1,9579,9579,105.10204081632699,105.10204081632699,0,0,0,0,0]
[null,"ZN35500:PA22","TOP RYDE","URBAN",1057,2285.19681227723,3226.9384493765501,2.7934614,3151.1890774923286,59.572775845275004,8,144777.61666666699,144777.61666666699,134.05865657521301,134.05865657521301,1,2737,2737,15.231788079470199,15.231788079470199]
[null,"ZN35500:PA23","TOP RYDE","URBAN",377,0,7227.0134851112098,3.0295821999999997,4903.0685720021111,218.42164191934165,4,207708.7833333337,74283.216666666704,219.36339522546442,200.53050397878002,1,9253,9253,5.03978779840849,5.03978779840849]
[null,"ZN35500:PA24","TOP RYDE","URBAN",2704,2391.8317657378998,13592.9509907825,6.1134341000000001,28671.489084846733,0,13,601914.28333333402,601856.633333334,212.2041420118347,212.167159763314,0,0,0,0,0]
[null,"ZN35500:PA26","TOP RYDE","URBAN",49,0,6400.0838228870498,3.7550823999999996,125.13796451823333,0,1,4277,4277,95.918367346938808,95.918367346938808,0,0,0,0,0]
[null,"ZN35500:PA27","TOP RYDE","URBAN",1025,4438.2125152611297,3385.70572131686,4.1540122999999998,6473.0698879528118,632.76857778979172,9,199991.7833333333,196058.25,211.90243902439073,211.80487804878098,1,19550,19550,3.3170731707317103,3.3170731707317103]
[null,"ZN35500:PA28","TOP RYDE","URBAN",3149,9143.5716578433003,7670.2547687938404,7.9452745,36027.19011294355,2123.4077154354172,16,581957.30000000005,531587.4,208.09780882819967,205.11273420133401,2,34300,34300,3.1120990790727201,3.1120990790727201]
[null,"ZN35500:PA30","TOP RYDE","URBAN",131,0,1215.67332707694,1.5414498999999999,149.16996044775001,0,1,12420,12420,103.053435114504,103.053435114504,0,0,0,0,0]
[null,"ZN35500:PA31","TOP RYDE","URBAN",812,214.186906174092,10363.781240795901,4.4263129000000001,3362.2375085409253,0,4,97489.066666666695,94199,109.8522167487686,105.66502463054199,0,0,0,0,0]
[null,"ZN35500:PA32","TOP RYDE","URBAN",534,1685.1427937942799,5949.1818537618401,3.1743014000000001,1220.78616447788,0,2,49358.400000000001,49358.400000000001,100.561797752809,100.561797752809,0,0,0,0,0]
[null,"ZN35500:PA34","TOP RYDE","URBAN",951,2780.9778239426801,6025.4902350798902,3.1381215999999998,3759.7501965407669,638.17625387999999,10,153765.48333333299,153765.48333333299,187.90746582544699,187.90746582544699,1,26100,0,6.0988433228180901,0]
[null,"ZN35500:PA35","TOP RYDE","URBAN",599,0,1583.2383727373599,1.9594217999999997,863.81599908449994,0,1,56580,56580,102.671118530885,102.671118530885,0,0,0,0,0]
[null,"ZN35600:PA1","KINGSFORD","URBAN",2771,0,14065.620469629799,6.0220324999999999,26965.498931442275,111.67357435208334,15,574691.80000000005,574691.80000000005,128.401299169975,128.401299169975,2,2380,2380,0.28870443883074698,0.28870443883074698]
[null,"ZN35600:PA10","KINGSFORD","URBAN",507,0,4077.2631847432199,2.0136915000000002,26.527627873861981,0,1,1690.7333333332999,0,0.19723865877711999,0,0,0,0,0,0]
[null,"ZN35600:PA12","KINGSFORD","SHORT RURAL",661,0,6922.3288967622902,2.0498713,377.42777150298906,0,7,23630.716666666704,17898.150000000001,21.633888048411471,17.700453857791203,0,0,0,0,0]
[null,"ZN35600:PA14","KINGSFORD","URBAN",1918,0,6419.7626589798501,3.6465429999999999,464.8252312521555,0,9,16359.799999999899,164.8333333333,2.606882168925968,0.15641293013555801,0,0,0,0,0]
[null,"ZN35600:PA16","KINGSFORD","URBAN",1564,0,4234.7080484302596,2.6125623999999998,1226.7741044772904,0,3,60265.333333333401,46012.266666666699,23.145780051150872,20.3324808184143,0,0,0,0,0]
[null,"ZN35600:PA19","KINGSFORD","URBAN",2578,0,11205.6886656772,7.999544199999999,3527.4625891454257,0,8,56593.533333333202,55665.0666666666,4.6547711404189229,4.5384018619084499,0,0,0,0,0]
[null,"ZN35600:PA2","KINGSFORD","URBAN",1245,0,4605.1243403038097,2.2679022,12.737362444678407,0,3,720.81666666659999,720.81666666659999,0.240963855421687,0.240963855421687,0,0,0,0,0]
[null,"ZN35600:PA22","KINGSFORD","URBAN",1782,0,6024.84554552394,4.4444027999999998,4458.4658997090028,0,6,128748.35,28280.5,15.319865319865322,6.7901234567901199,0,0,0,0,0]
[null,"ZN35600:PA25","KINGSFORD","URBAN",1119,0,4354.3672753501296,1.9232419999999999,4.8407386771022782,0,1,323.03333333329999,323.03333333329999,8.9365504915102797E-2,8.9365504915102797E-2,0,0,0,0,0]
[null,"ZN35600:PA3","KINGSFORD","URBAN",1158,0,3755.23392359122,2.6306522999999999,1.5980956964644333,0,1,77.966666666699993,77.966666666699993,8.6355785837651092E-2,8.6355785837651092E-2,0,0,0,0,0]
[null,"ZN35600:PA4","KINGSFORD","URBAN",1236,0,3294.0134829501799,2.4668911000000002,245.8409825611071,0,5,12790.1,12790.1,8.2524271844660202,8.2524271844660202,0,0,0,0,0]
[null,"ZN35600:PA6","KINGSFORD","URBAN",1271,0,8846.3381278654197,3.2104811999999998,239.43857077832999,0,1,9571.7999999999993,9571.7999999999993,4.9567269866246999,4.9567269866246999,0,0,0,0,0]
[null,"ZN35600:PA7","KINGSFORD","URBAN",1336,0,4595.4923713831504,2.1584106999999997,345.75170005929209,0,4,20558.900000000001,8606.1,7.3353293413173803,3.7425149700598901,0,0,0,0,0]
[null,"ZN35600:PA9","KINGSFORD","URBAN",3008,0,9123.4928300858392,5.4422036,12843.994829002506,1396.7823704670002,11,302896.99999999971,289203.433333333,111.17021276595756,106.715425531915,1,32940,32940,4.05585106382979,4.05585106382979]
[null,"ZN35700:PA1","PORT BOTANY","URBAN",664,0,9435.2260714710901,4.4805826,0,21.994059837750001,0,0,0,0,0,1,630,630,0.15060240963855401,0.15060240963855401]
[null,"ZN35800:PA1","BANKSTOWN","URBAN",2507,7035.2784177121002,3822.7204998478301,2.8477310999999998,43696.112108810354,0,20,1969307.1333333331,833408.53333333298,567.65057838053497,316.07499002792201,0,0,0,0,0]
[null,"ZN35800:PA10","BANKSTOWN","URBAN",2020,0,10619.271672925999,5.3698439999999996,9234.9728602066989,5719.951116495,17,220720.96666666702,178171.41666666701,227.27722772277187,216.336633663366,5,136710,136710,16.881188118811899,16.881188118811899]
[null,"ZN35800:PA13","BANKSTOWN","URBAN",296,382.60674848009501,2327.4542393578599,3.0476720999999998,17.566036997888251,34.194880961999999,4,739.73333333339997,739.73333333339997,1.35135135135135,1.35135135135135,1,1440,1440,1.0135135135135098,1.0135135135135098]
[null,"ZN35800:PA14","BANKSTOWN","URBAN",1992,3012.53937626064,3523.19849626718,3.1019417999999996,32210.140712206194,246.52682455499999,5,1332688.3833333331,281968.38333333301,205.77309236947832,105.873493975904,1,10200,10200,1.0040160642570299,1.0040160642570299]
[null,"ZN35800:PA15","BANKSTOWN","SHORT RURAL",2956,8137.1735545744104,7467.91400997047,6.7113528999999996,84279.419215597867,475.86288458041668,16,1611688.45,671380.25,313.700947225981,103.72124492557499,1,9100,9100,0.67658998646820001,0.67658998646820001]
[null,"ZN35800:PA16","BANKSTOWN","URBAN",899,1618.0017600998999,4899.3017259985299,4.8071529000000002,10861.461527155476,387.66683667937502,14,289981.28333333402,129107.616666667,226.69632925472803,124.026696329255,1,10350,10350,2.5583982202447197,2.5583982202447197]
[null,"ZN35800:PA18","BANKSTOWN","URBAN",409,2384.9871980172802,3257.0487285058398,2.2498122999999999,0,0.52589362512500004,0,0,0,0,0,1,30,30,0.24449877750611199,0.24449877750611199]
[null,"ZN35800:PA19","BANKSTOWN","URBAN",518,376.95259209190903,4249.3714293896001,2.4307113,2170.3595546667657,0,4,114595.6,56209,118.3397683397684,107.915057915058,0,0,0,0,0]
[null,"ZN35800:PA2","BANKSTOWN","URBAN",2622,0,15330.3553763568,3.4104221999999997,5680.8072449160445,362.16168577627496,11,213782.2,213782.2,204.30968726163198,204.30968726163198,1,13629,13629,2.2501906941266201,2.2501906941266201]
[null,"ZN35800:PA21","BANKSTOWN","URBAN",289,0,4606.2566416218597,3.1743014000000001,3442.6193417163454,7.4199295225000004,6,139190.78333333367,136651.36666666699,95.847750865051879,95.50173010380621,2,300,300,1.73010380622837,1.73010380622837]
[null,"ZN35800:PA22","BANKSTOWN","URBAN",769,0,6312.8918125158098,2.4126213999999995,19.323755393348129,0,4,1027.9500000001001,308.9166666667,0.52015604681404393,0.26007802340702196,0,0,0,0,0]
[null,"ZN35800:PA3","BANKSTOWN","URBAN",151,0,4869.1445638769101,3.3018828,467.02531973295004,0,5,18153,13173,249.66887417218518,229.80132450331098,0,0,0,0,0]
[null,"ZN35800:PA4","BANKSTOWN","URBAN",37,640.01024462850296,3011.1616673284302,1.5052700999999999,24.911467519949998,0,1,2124,2124,97.297297297297305,97.297297297297305,0,0,0,0,0]
[null,"ZN35800:PA6","BANKSTOWN","URBAN",602,368.32369425127501,3914.8234576110099,2.3402617999999999,3063.4163721048944,0,9,168000.75,168000.75,286.87707641195999,286.87707641195999,0,0,0,0,0]
[null,"ZN35800:PA7","BANKSTOWN","URBAN",1168,3121.3482805139802,2629.4766401203901,2.5211608000000001,11478.720788904007,237.88937970233334,12,584335.91666666605,270442.433333333,378.33904109589099,277.99657534246597,2,12110,12110,3.4246575342465801,3.4246575342465801]
[null,"ZN35800:PA9","BANKSTOWN","SHORT RURAL",341,0,4205.6241433941796,2.6487422,592.8199158673267,0,7,28724.516666666699,23067,204.69208211143726,203.51906158357801,0,0,0,0,0]
[null,"ZN35900:PA1","POTTS HILL","URBAN",1446,368.157031273212,8450.2032681673008,2.5392506999999997,5531.3283243745227,283.91467878812506,11,279571.88333333301,248303.78333333301,57.330567081604414,54.080221300138298,1,14350,14350,2.83540802213001,2.83540802213001]
[null,"ZN35900:PA12","POTTS HILL","URBAN",73,0,4488.4292907682002,2.9020007999999997,129.99307025210001,0,2,5749,5749,41.095890410958901,41.095890410958901,0,0,0,0,0]
[null,"ZN35900:PA16","POTTS HILL","URBAN",241,372.96532484230198,5259.1058054283403,2.1222308999999999,823.47864497250009,0,6,49800,49800,122.40663900414901,122.40663900414901,0,0,0,0,0]
[null,"ZN35900:PA17","POTTS HILL","SHORT RURAL",1786,3062.2530872274301,7649.6151815146904,4.0092930999999998,3198.8006204418739,0,7,102397.4166666667,10896.666666666701,13.26987681970885,9.6304591265397601,0,0,0,0,0]
[null,"ZN35900:PA2","POTTS HILL","URBAN",1556,3109.0323514756401,5250.8131118342399,2.8658209999999995,52.16734567515401,0,5,2336.2499999999,1162.0999999999001,0.32133676092544999,0.25706940874035999,0,0,0,0,0]
[null,"ZN35900:PA20","POTTS HILL","URBAN",997,1266.5689257172,5793.91513427059,2.5944724999999997,9129.3787182883225,0,11,451608.16666666698,451608.16666666698,317.75325977933801,317.75325977933801,0,0,0,0,0]
[null,"ZN35900:PA22","POTTS HILL","URBAN",11,432.24988231486202,2186.1696762853298,0.97971089999999983,12.291846196469326,0,2,1610.2333333332999,44.233333333300003,27.272727272727288,9.0909090909090899,0,0,0,0,0]
[null,"ZN35900:PA23","POTTS HILL","SHORT RURAL",1109,0,13957.325648505899,2.3221718999999998,103.30896732580875,0,3,5709.7,431.7,6.0414788097384999,0.18034265103697,0,0,0,0,0]
[null,"ZN35900:PA24","POTTS HILL","URBAN",1368,769.79184704458396,5445.5088337171001,2.9391327,3406.2503009781399,0,6,148739.73333333331,21515.733333333301,110.45321637426899,10.453216374269001,0,0,0,0,0]
[null,"ZN35900:PA25","POTTS HILL","SHORT RURAL",558,0,10504.8854294999,2.5211608000000001,906.45479248426648,7.0718560439999987,3,46144,46144,110.394265232975,110.394265232975,1,360,360,0.17921146953405001,0.17921146953405001]
[null,"ZN35900:PA3","POTTS HILL","URBAN",464,353.86058504412102,9572.8572271374105,4.4082229999999996,13.583253450923367,0.51521106312499998,3,395.46666666670001,395.46666666670001,0.64655172413793105,0.64655172413793105,1,15,15,0.21551724137931,0.21551724137931]
[null,"ZN35900:PA4","POTTS HILL","URBAN",1083,2222.0623995862102,8084.2349382232596,2.5573405999999999,5587.4446750636034,0,11,280410.51666666701,240372.76666666701,153.92428439519853,150.41551246537398,0,0,0,0,0]
[null,"ZN35900:PA6","POTTS HILL","URBAN",293,2486.9453943019198,3101.8759184338701,3.2104811999999998,0,27.016199297999997,0,0,0,0,0,1,1080,1080,1.0238907849829399,1.0238907849829399]
[null,"ZN36100:PA1","ROSE BAY","URBAN",841,0,3655.8407316553798,2.3764415999999997,4532.6318282483271,0,2,244789.58333333299,244789.58333333299,106.302021403092,106.302021403092,0,0,0,0,0]
[null,"ZN36100:PA12","ROSE BAY","URBAN",1232,0,6075.5939227621902,3.6094110999999995,4832.1000901803754,169.44305212885413,10,171818.2166666667,13608.6166666667,26.2175324675325,12.987012987012999,2,6025,6025,4.9512987012987004,4.9512987012987004]
[null,"ZN36100:PA13","ROSE BAY","URBAN",468,0,6786.0312294137302,3.2837928999999995,1034.2947856886653,0,2,40423.9,40423.9,14.1025641025641,14.1025641025641,0,0,0,0,0]
[null,"ZN36100:PA15","ROSE BAY","URBAN",754,0,2563.0377800752999,2.4488012000000001,362.0078544106604,0,3,18972.916666666701,18972.916666666701,20.291777188328901,20.291777188328901,0,0,0,0,0]
[null,"ZN36100:PA16","ROSE BAY","URBAN",627,0,3943.3866977492698,1.6147615999999998,516.05056610753593,0,7,41016.016666666699,38816.400000000001,28.708133971291844,28.548644338118002,0,0,0,0,0]
[null,"ZN36100:PA19","ROSE BAY","URBAN",2192,0,5227.3265579013896,3.8093520999999999,202.62367081244247,0,5,6826.6666666666006,5427.6166666666004,3.9689781021897788,3.8777372262773704,0,0,0,0,0]
[null,"ZN36100:PA2","ROSE BAY","URBAN",1185,0,9124.0961438320301,3.7008126999999997,5832.1199962417768,0,11,202254.86666666641,117458.08333333299,29.704641350211002,22.7848101265823,0,0,0,0,0]
[null,"ZN36100:PA20","ROSE BAY","URBAN",1023,0,3737.0131749891302,2.5944724999999997,3072.2799083130112,0,11,151978.2166666663,24084.483333333301,20.039100684261978,7.7223851417399807,0,0,0,0,0]
[null,"ZN36100:PA21","ROSE BAY","URBAN",647,0,3677.6152824225501,1.6147615999999998,19.349791418125278,0,3,1537.9333333334,1537.9333333334,0.46367851622874806,0.46367851622874806,0,0,0,0,0]
[null,"ZN36100:PA23","ROSE BAY","URBAN",985,0,3364.9513564988301,2.4307113,188.196274512039,0,9,9936.8166666666002,7689.4499999998998,8.324873096446705,7.91878172588833,0,0,0,0,0]
[null,"ZN36100:PA27","ROSE BAY","URBAN",1696,0,9144.4441506490894,4.8976024000000002,224.91217667832839,2202.6232153640003,6,5893.85,5292.35,16.922169811320789,16.804245283018901,3,57720,57720,10.6132075471698,10.6132075471698]
[null,"ZN36100:PA5","ROSE BAY","URBAN",1406,0,6602.0799288094804,3.6465429999999999,977.03849670668535,199.45678574249999,5,34387.449999999997,33562.75,12.304409672830682,12.233285917496401,1,7020,7020,5.5476529160739707,5.5476529160739707]
[null,"ZN36100:PA7","ROSE BAY","URBAN",768,0,1109.64077164982,1.4690902999999997,297.53060319813756,0,2,25992.7833333333,25992.7833333333,22.265625,22.265625,0,0,0,0,0]
[null,"ZN36100:PA8","ROSE BAY","URBAN",782,0,8191.6859606845201,2.4668911000000002,4391.0812557161607,0,11,228449.9833333336,4610.0166666666,18.414322250639369,5.8823529411764701,0,0,0,0,0]
[null,"ZN36100:PA9","ROSE BAY","URBAN",122,0,3981.1703892048499,0.58078099999999999,6.8738577247083334,0,1,1519,1519,5.7377049180327901,5.7377049180327901,0,0,0,0,0]
[null,"ZN36200:PA1","EMPIRE BAY","URBAN",1356,8565.6612464283298,2028.65008986011,3.0838518999999995,104.20813352988277,536.31268392899995,7,4336.8833333333996,4336.8833333333996,2.4336283185840699,2.4336283185840699,2,22320,22320,3.4660766961651901,3.4660766961651901]
[null,"ZN36200:PA11","EMPIRE BAY","SHORT RURAL",1297,3882.2297507898202,6541.8568038403,2.8296411999999997,1510.0231904139846,1942.0646972530835,12,68489.166666666599,30525.0333333333,15.651503469545139,12.721665381649998,7,88085,69165,14.263685427910588,10.9483423284503]
[null,"ZN36200:PA4","EMPIRE BAY","SHORT RURAL",925,8627.0128179270996,3896.7647213352402,2.7753714999999999,1851.6115266232764,478.44802749218758,5,85624.566666666695,85624.566666666695,106.70270270270299,106.70270270270299,3,22125,22125,7.0270270270270299,7.0270270270270299]
[null,"ZN36200:PA8","EMPIRE BAY","URBAN",1371,13105.199828340101,926.70150583581994,2.4488012000000001,6401.9944635469301,2555.4550630642002,8,335530.03333333367,335059.566666667,97.22830051057619,97.082421590080202,5,133932,133932,22.246535375638199,22.246535375638199]
[null,"ZN36300:PA1","BALGOWLAH NORTH","URBAN",831,1676.31930016964,1299.6280783780301,1.4690902999999997,879.84652387866186,0,2,76864.899999999994,76864.899999999994,91.215403128760499,91.215403128760499,0,0,0,0,0]
[null,"ZN36300:PA11","BALGOWLAH NORTH","URBAN",2965,1274.5540582819001,13188.7502529392,7.8910048000000002,39607.685077618815,2791.9920304173338,16,644194.16666666709,640013.86666666705,203.60876897133258,203.507588532884,3,45410,45410,3.8785834738617297,3.8785834738617297]
[null,"ZN36300:PA13","BALGOWLAH NORTH","URBAN",1298,2131.8063496729401,2029.1349706027499,1.9775116999999998,1786.7143949621689,0,3,115959.3333333333,12119.333333333299,110.16949152542369,10.1694915254237,0,0,0,0,0]
[null,"ZN36300:PA17","BALGOWLAH NORTH","URBAN",769,541.89544850908305,1730.9928645285499,1.9956015999999999,0.18840280688829611,26.122424944000002,1,12.1166666667,12.1166666667,0.13003901170351098,0.13003901170351098,1,1680,1680,0.91027308192457701,0.91027308192457701]
[null,"ZN36300:PA19","BALGOWLAH NORTH","URBAN",1377,3111.3955935201602,5240.5467043012004,3.6646329,5863.0697041621852,0,8,205335.58333333299,104337.383333333,158.82352941176441,58.605664488017396,0,0,0,0,0]
[null,"ZN36300:PA3","BALGOWLAH NORTH","URBAN",2012,2199.60650688126,8755.9502508197493,5.0975434000000002,32326.756495973903,0,15,813899.6,813899.6,460.88469184890596,460.88469184890596,0,0,0,0,0]
[null,"ZN36300:PA5","BALGOWLAH NORTH","SHORT RURAL",1268,360.48911096170099,9339.3175500601192,3.6284530999999998,3536.5489941361479,503.80164180225,9,125091.5,125091.5,119.400630914827,119.400630914827,1,17820,17820,2.6025236593059899,2.6025236593059899]
[null,"ZN36300:PA7","BALGOWLAH NORTH","URBAN",455,438.052665426565,1049.2302336592099,0.96162099999999995,70.404500535645099,0,5,9396.4999999999,9396.4999999999,24.1758241758242,24.1758241758242,0,0,0,0,0]
[null,"ZN36300:PA8","BALGOWLAH NORTH","SHORT RURAL",1570,3998.1018840444399,4666.6427561950004,3.0476720999999998,6218.4491281353867,0,10,261868.6333333333,256927.95,223.05732484076381,222.92993630573199,0,0,0,0,0]
[null,"ZN36300:PA9","BALGOWLAH NORTH","URBAN",1376,1028.1538571523699,4585.7379948077596,3.0476720999999998,2886.9368617881864,0,7,121573.4333333337,110905.46666666699,100.43604651162794,100.21802325581399,0,0,0,0,0]
[null,"ZN3672:PA13","MAROUBRA","SHORT RURAL",1799,0,7793.7876782193198,2.9934023999999999,1649.9032438067675,0,7,70739.666666666701,57030.533333333398,113.2295719844354,109.505280711506,0,0,0,0,0]
[null,"ZN3672:PA21","MAROUBRA","URBAN",123,0,2561.1512069144101,0.85212949999999998,4.2867989993010411,0,3,645.65,0,2.4390243902439002,0,0,0,0,0,0]
[null,"ZN3672:PA23","MAROUBRA","URBAN",134,0,1892.09310223696,3.3923323000000001,0,651.15041089014585,0,0,0,0,0,2,24635,24635,85.074626865671604,85.074626865671604]
[null,"ZN3672:PA26","MAROUBRA","URBAN",186,0,1360.1730838168801,0.81594969999999989,339.00292104055666,0,4,53322.400000000001,0,153.76344086021501,0,0,0,0,0,0]
[null,"ZN3672:PA32","MAROUBRA","URBAN",148,0,25.439424931580099,0.10853939999999999,0.26698838185250001,0,1,315.7,315.7,0.67567567567567599,0.67567567567567599,0,0,0,0,0]
[null,"ZN3672:PA34","MAROUBRA","URBAN",100,0,5477.4988682841404,2.4668911000000002,7.7310842398257105,0,2,402.21666666670001,402.21666666670001,103,103,0,0,0,0,0]
[null,"ZN3672:PA35","MAROUBRA","URBAN",639,0,6615.3255819715596,1.3786407999999999,873.97751714469814,0,5,81361.466666666704,50468,40.375586854459996,28.482003129890398,0,0,0,0,0]
[null,"ZN3672:PA36","MAROUBRA","URBAN",1858,0,5910.9980280099298,3.7008126999999997,1799.6268538710872,102.4236922852,4,62410.116666666698,565.11666666669998,5.8127018299246487,0.16146393972012901,1,3552,3552,1.2917115177610299,1.2917115177610299]
[null,"ZN3672:PA37","MAROUBRA","URBAN",1843,0,3639.2629809157302,3.5008716999999998,438.18322701684423,0,2,16063.833333333299,16063.833333333299,2.3874118285404302,2.3874118285404302,0,0,0,0,0]
[null,"ZN3672:PA4","MAROUBRA","URBAN",117,0,2891.59130266491,4.1540122999999998,0,1120.5344328942499,0,0,0,0,0,2,34620,34620,90.598290598290603,90.598290598290603]
[null,"ZN3672:PA42","MAROUBRA","URBAN",348,0,9765.5911758052207,3.0114922999999996,799.56724812043979,65.888440031699986,5,34075.550000000003,34075.550000000003,127.586206896552,127.586206896552,2,2808,2808,1.4367816091954,1.4367816091954]
[null,"ZN3672:PA43","MAROUBRA","URBAN",1957,0,2559.0967276839601,3.9359814000000002,17.306381749741441,0,1,564.31666666670003,564.31666666670003,5.1098620337250898E-2,5.1098620337250898E-2,0,0,0,0,0]
[null,"ZN3672:PA44","MAROUBRA","URBAN",1889,0,6694.63211661072,3.0476720999999998,299.14623807880236,0,8,12597.516666666599,10685.766666666599,7.252514557967177,7.1466384330333508,0,0,0,0,0]
[null,"ZN3672:PA46","MAROUBRA","URBAN",1626,0,5738.5967053836403,2.3221718999999998,2088.3741494981705,723.01983192449995,11,115420.6666666664,114286.383333333,114.14514145141446,113.960639606396,1,39960,39960,6.8265682656826598,6.8265682656826598]
[null,"ZN3672:PA6","MAROUBRA","URBAN",1263,0,4432.0747746812503,2.3945314999999998,43.502817313158481,0,7,2331.6666666665997,201.95,0.55423594615993677,7.9176563737133804E-2,0,0,0,0,0]
[null,"ZN3672:PA9","MAROUBRA","URBAN",1319,0,6011.8889555148298,2.4307113,226.13325508803067,0,7,11939.9000000001,11939.9000000001,9.6285064442759687,9.6285064442759687,0,0,0,0,0]
[null,"ZN36800:PA32","WAVERLEY","URBAN",1002,0,3843.7431343599001,1.9051520999999998,347.1398822996884,0,3,23385.383333333299,23385.383333333299,11.2774451097804,11.2774451097804,0,0,0,0,0]
[null,"ZN36800:PA33","WAVERLEY","URBAN",1778,0,5056.1975925792603,2.3583516999999996,550.41913106168738,0,5,29953.983333333399,29953.983333333399,15.129358830146201,15.129358830146201,0,0,0,0,0]
[null,"ZN36800:PA35","WAVERLEY","URBAN",287,0,1756.4047159485899,3.5008716999999998,0,31.914821635125001,0,0,0,0,0,1,1170,1170,13.588850174215999,13.588850174215999]
[null,"ZN36800:PA36","WAVERLEY","URBAN",392,0,1782.7576658543201,0.70741029999999994,71.533506388575006,0,1,12978,12978,32.142857142857103,32.142857142857103,0,0,0,0,0]
[null,"ZN36800:PA40","WAVERLEY","URBAN",1101,0,2475.16935915247,2.1584106999999997,110.11530742581394,0,2,6547.6166666666995,6334.9166666666997,8.7193460490463224,8.6285195277020907,0,0,0,0,0]
[null,"ZN36800:PA42","WAVERLEY","URBAN",1443,0,3819.8691041853399,2.4488012000000001,22.990102413193696,400.68509635000009,3,1204.9166666666999,1204.9166666666999,0.48510048510048498,0.48510048510048498,1,21000,21000,4.8510048510048493,4.8510048510048493]
[null,"ZN36800:PA43","WAVERLEY","URBAN",2109,0,3797.8562816671301,3.5008716999999998,2750.7989421342454,0,4,100844.516666667,100844.516666667,5.6424845898529998,5.6424845898529998,0,0,0,0,0]
[null,"ZN36800:PA46","WAVERLEY","URBAN",988,0,3505.98453668508,2.1222308999999999,2558.0195582156825,166.68001488600001,3,154696.6333333333,336.63333333330002,4.2510121457489909,0.20242914979757098,1,10080,10080,8.50202429149798,8.50202429149798]
[null,"ZN36800:PA49","WAVERLEY","URBAN",1400,0,4982.7500870571002,2.9572225999999997,1495.7583979150359,0,2,64915.3,64915.3,5.6428571428571397,5.6428571428571397,0,0,0,0,0]
[null,"ZN36800:PA56","WAVERLEY","URBAN",536,0,2576.8440172433802,1.3424609999999999,349.14201289171984,0,4,33378.750000000102,45.166666666700003,19.216417910447806,0.18656716417910399,0,0,0,0,0]
[null,"ZN36800:PA57","WAVERLEY","URBAN",1247,0,4369.25951472206,1.9775116999999998,1596.0965326318549,0,3,103588.066666667,103588.066666667,23.897353648757001,23.897353648757001,0,0,0,0,0]
[null,"ZN36800:PA58","WAVERLEY","URBAN",1576,0,4030.4623603039699,3.3742424,1144.6620367645414,312.73111233650002,5,43538.216666666704,18100.7166666667,8.8197969543147163,0.88832487309644692,2,11895,11895,2.5380710659898402,2.5380710659898402]
[null,"ZN384:PA2","CAMPERDOWN","URBAN",889,0,3457.8884630527,2.5478196,734.24219713556261,0,3,36986.25,36986.25,95.050618672665905,95.050618672665905,0,0,0,0,0]
[null,"ZN384:PA22","CAMPERDOWN","URBAN",289,0,4173.0496234252796,1.1539451999999999,193.32394766994861,0,2,21501.566666666698,21170,100.69204152249168,100.346020761246,0,0,0,0,0]
[null,"ZN384:PA33","CAMPERDOWN","URBAN",461,0,4048.3976972389401,1.6652229000000001,59.126445051712501,0,1,4557,4557,6.7245119305856802,6.7245119305856802,0,0,0,0,0]
[null,"ZN384:PA37","CAMPERDOWN","URBAN",7,0,4643.2502040436702,0.50270879999999996,0.81864033459999985,4.0344475819999994,1,209,209,42.857142857142897,42.857142857142897,1,1030,1030,28.571428571428598,28.571428571428598]
[null,"ZN384:PA4","CAMPERDOWN","SHORT RURAL",375,0,3046.2562532125198,0.89878239999999987,139.27451928969336,0,6,19887.800000000003,17795.150000000001,101.06666666666635,100.533333333333,0,0,0,0,0]
[null,"ZN384:PA41","CAMPERDOWN","URBAN",487,0,1498.7831493908,1.4262458,100.56501626039461,0,2,9049.4500000000007,9049.4500000000007,12.936344969199201,12.936344969199201,0,0,0,0,0]
[null,"ZN384:PA43","CAMPERDOWN","URBAN",1108,0,2665.4731552080998,2.0527275999999999,2890.2985886287179,0,6,180709.51666666701,180709.51666666701,192.05776173285201,192.05776173285201,0,0,0,0,0]
[null,"ZN384:PA65","CAMPERDOWN","URBAN",81,0,3047.9411529922399,3.3923323000000001,86.30022697610417,18.898824590479169,2,3265,3265,92.592592592592609,92.592592592592609,2,715,715,95.061728395061692,95.061728395061692]
[null,"ZN384:PA66","CAMPERDOWN","URBAN",9,0,2888.8805505753398,0.90735129999999986,38.516155333699999,1.5907002478124999,4,5448,5448,266.66666666666703,266.66666666666703,3,225,225,55.5555555555556,55.5555555555556]
[null,"ZN384:PA70","CAMPERDOWN","URBAN",2877,0,8580.6356948639605,4.9699619999999998,2695.4775901820249,975.4647958275001,5,69606.899999999994,63456.9,21.793534932221089,20.7507820646507,3,25190,25190,16.371220020855102,16.371220020855102]
[null,"ZN384:PA71","CAMPERDOWN","URBAN",464,0,1805.74413147428,0.47128949999999997,0.22032784124999999,0,1,60,60,0.21551724137931,0.21551724137931,0,0,0,0,0]
[null,"ZN384:PA80","CAMPERDOWN","URBAN",409,0,1434.25712622583,0.83403959999999999,53.418151281,8.3181549440000015,1,8220,8220,33.496332518337404,33.496332518337404,2,1280,1280,0.73349633251833701,0.73349633251833701]
[null,"ZN384:PA81","CAMPERDOWN","URBAN",1421,0,3354.7986842234,3.6827227999999996,19.426209323216668,237.59086144200003,2,677,677,1.05559465165376,1.05559465165376,4,8280,8280,20.408163265306101,20.408163265306101]
[null,"ZN3922:PA10","DRUMMOYNE","URBAN",1185,0,5487.3219237406902,3.2285710999999999,28.446348057398332,0,2,1130.8,1130.8,0.253164556962025,0.253164556962025,0,0,0,0,0]
[null,"ZN3922:PA11","DRUMMOYNE","URBAN",1900,0,12293.5324280553,4.4624927000000003,1942.0387338054372,0,6,55853.450000000099,7328.8333333334003,8.5789473684210495,2.2105263157894699,0,0,0,0,0]
[null,"ZN3922:PA12","DRUMMOYNE","URBAN",1300,0,5724.9431568241898,3.5551413999999997,9.0972982365766164,0,2,328.4166666667,328.4166666667,0.15384615384615399,0.15384615384615399,0,0,0,0,0]
[null,"ZN3922:PA13","DRUMMOYNE","URBAN",1243,0,9661.5011307666391,2.4488012000000001,4596.4317344311739,0,3,240900.06666666639,18702.133333333401,11.021721641190659,5.5510860820595305,0,0,0,0,0]
[null,"ZN3922:PA14","DRUMMOYNE","URBAN",1812,0,6857.6070599241202,3.6094110999999995,5687.8746857483757,0,6,202247.566666667,202247.566666667,113.79690949227398,113.79690949227398,0,0,0,0,0]
[null,"ZN3922:PA17","DRUMMOYNE","SHORT RURAL",1013,0,17068.225221764598,2.2307702999999997,244.00527886659259,40.672519494749992,2,14038.2833333334,13825.166666666701,5.1332675222112574,5.0345508390918097,2,2340,2340,1.0858835143139201,1.0858835143139201]
[null,"ZN3922:PA18","DRUMMOYNE","URBAN",1015,0,5745.0096478843698,4.6805235999999999,5370.1582984345087,0,6,147252.36666666699,0,9.8522167487684804,0,0,0,0,0,0]
[null,"ZN3922:PA19","DRUMMOYNE","URBAN",1141,0,3572.80990318453,2.2307702999999997,0,398.9035565831249,0,0,0,0,0,1,22950,22950,13.4092900964067,13.4092900964067]
[null,"ZN3922:PA2","DRUMMOYNE","URBAN",2228,0,15606.6336544775,4.625301799999999,17271.258457206241,1498.4937139094998,7,479240.53333333298,337342.13333333301,111.31059245960479,106.238779174147,1,41580,41580,4.4434470377019695,4.4434470377019695]
[null,"ZN3922:PA21","DRUMMOYNE","URBAN",772,0,5656.6009016431099,1.8861101,1.5136819431708335,0,1,103,103,0.12953367875647701,0.12953367875647701,0,0,0,0,0]
[null,"ZN3922:PA22","DRUMMOYNE","URBAN",916,0,6138.4284718138097,1.9051520999999998,2209.2341411130374,0,5,148827,148827,211.79039301310101,211.79039301310101,0,0,0,0,0]
[null,"ZN3922:PA23","DRUMMOYNE","URBAN",704,0,2650.0175306480601,1.3424609999999999,686.50710207254895,0,6,65631.599999999904,1358.3333333333001,12.5,2.8409090909090899,0,0,0,0,0]
[null,"ZN3922:PA26","DRUMMOYNE","URBAN",1935,0,6844.1296079393396,4.2082819999999996,164.19138842733503,0,3,5007.4333333332997,0,0.15503875968992201,0,0,0,0,0,0]
[null,"ZN3922:PA29","DRUMMOYNE","URBAN",2248,0,10158.2177891223,4.2987314999999997,6509.96669535008,1631.841464715,8,194360.5333333337,182690.01666666701,5.4270462633452006,3.46975088967972,2,48720,48720,5.16014234875444,5.16014234875444]
[null,"ZN3922:PA3","DRUMMOYNE","URBAN",770,0,3615.1686601197298,1.7594808,910.22954104928851,0,5,66395.099999999904,66395.099999999904,44.545454545454497,44.545454545454497,0,0,0,0,0]
[null,"ZN3922:PA30","DRUMMOYNE","SHORT RURAL",358,0,2134.81330279863,0.63505069999999997,105.18529702616375,0,2,21257.7,21257.7,100.27932960893899,100.27932960893899,0,0,0,0,0]
[null,"ZN3922:PA5","DRUMMOYNE","SHORT RURAL",2435,0,16751.094624319001,4.6986134999999996,29561.585888737238,241.62619923749997,4,807472.316666667,807472.316666667,297.20739219712499,297.20739219712499,1,6600,6600,0.90349075975359305,0.90349075975359305]
[null,"ZN3922:PA7","DRUMMOYNE","URBAN",1833,0,6755.93222417371,4.0816526999999994,176.52505067199752,0,5,5550.6,4078.6666666667002,0.60010911074740891,0.49099836333878893,0,0,0,0,0]
[null,"ZN398:PA10","DULWICH HILL","URBAN",531,0,3492.9487477213702,1.9594217999999997,10.955460657647409,99.389221527749982,2,717.58333333330006,439.15,0.37664783427495196,0.18832391713747598,2,6510,6510,0.37664783427495296,0.37664783427495296]
[null,"ZN398:PA11","DULWICH HILL","URBAN",969,0,5512.4155350826504,3.6646329,3993.4215090208036,0,8,139857.03333333301,22793.1,21.568627450980422,16.8214654282766,0,0,0,0,0]
[null,"ZN398:PA15","DULWICH HILL","URBAN",1613,0,6212.5536359907701,3.2285710999999999,7538.9467715516666,164.14257258093753,5,299688.41666666698,299688.41666666698,102.78983261004299,102.78983261004299,1,6525,6525,1.7978921264724099,1.7978921264724099]
[null,"ZN398:PA16","DULWICH HILL","URBAN",2288,0,7836.2367689030598,4.6072119000000002,68.469782102748113,0,2,1907.35,1907.35,0.48076923076923095,0.48076923076923095,0,0,0,0,0]
[null,"ZN398:PA19","DULWICH HILL","URBAN",936,0,4025.77460278639,2.7572815999999998,31.782445898549604,0,2,1479.3666666667,30,0.213675213675214,0.106837606837607,0,0,0,0,0]
[null,"ZN398:PA2","DULWICH HILL","URBAN",2692,0,13279.5167993133,4.1359224000000001,3.8080069413844075,977.53525438580016,1,118.1666666667,118.1666666667,3.7147102526002999E-2,3.7147102526002999E-2,1,30334,30334,2.15453194650817,2.15453194650817]
[null,"ZN398:PA20","DULWICH HILL","URBAN",1457,0,7020.8434878125599,3.3561524999999999,503.18176574147481,0,2,19242.116666666701,19242.116666666701,4.46122168840082,4.46122168840082,0,0,0,0,0]
[null,"ZN398:PA22","DULWICH HILL","URBAN",84,0,2397.30555431107,0.88926139999999998,67.514504010799996,0,1,9744,0,100,0,0,0,0,0,0]
[null,"ZN398:PA24","DULWICH HILL","URBAN",2025,0,5915.0189803720996,2.9020007999999997,681.06171060372492,0,5,30120.25,30120.25,10.6666666666667,10.6666666666667,0,0,0,0,0]
[null,"ZN398:PA25","DULWICH HILL","URBAN",866,0,5140.1075049758801,2.8115512999999996,2037.7365875028706,1265.7674241382499,2,93019,93019,102.193995381062,102.193995381062,1,57780,57780,12.3556581986143,12.3556581986143]
[null,"ZN398:PA26","DULWICH HILL","URBAN",1073,0,1968.0865233315999,2.0136915000000002,477.83542150832824,0,5,30454.75,30113.016666666699,20.037278657968283,19.944082013047502,0,0,0,0,0]
[null,"ZN398:PA29","DULWICH HILL","URBAN",814,0,3253.0461769284698,1.9594217999999997,1022.7993133616276,0,4,66993.416666666701,59194,108.35380835380872,100.61425061425101,0,0,0,0,0]
[null,"ZN398:PA3","DULWICH HILL","URBAN",1931,3.2936438993001902,5026.7441988421897,2.8839108999999996,6948.3217315941583,0,5,309220.09999999998,309220.09999999998,200.41429311237601,200.41429311237601,0,0,0,0,0]
[null,"ZN398:PA30","DULWICH HILL","URBAN",1375,0,2522.7676505347399,2.8296411999999997,1273.9130121844019,0,5,57780.066666666702,57780.066666666702,9.6727272727272702,9.6727272727272702,0,0,0,0,0]
[null,"ZN398:PA31","DULWICH HILL","URBAN",855,0,3484.99146755314,4.1901921,330.21807797485849,0,3,10114.3166666666,10114.3166666666,5.3801169590643303,5.3801169590643303,0,0,0,0,0]
[null,"ZN398:PA4","DULWICH HILL","SHORT RURAL",1969,0,9301.6531935681396,3.4285120999999998,17.43166025918956,0,3,652.53333333340004,652.53333333340004,0.15236160487557099,0.15236160487557099,0,0,0,0,0]
[null,"ZN398:PA9","DULWICH HILL","URBAN",814,0,1662.4746268772701,1.2158316999999998,9.4773025605541346,0,4,1000.4166666666999,866.01666666669996,0.49140049140049097,0.36855036855036799,0,0,0,0,0]
[null,"ZN4545:PA11","MEADOWBANK","URBAN",430,0,1372.1545647975399,1.0520704999999999,1143.8299848690001,0,1,139536,0,99.534883720930196,0,0,0,0,0,0]
[null,"ZN4545:PA13","MEADOWBANK","URBAN",113,0,1363.0336343490601,0.36275009999999996,103.8344803846625,2.8829564197500002,1,36737,0,99.115044247787594,0,1,1020,1020,3.5398230088495604,3.5398230088495604]
[null,"ZN4545:PA17","MEADOWBANK","URBAN",1187,2332.2901066258601,6427.8388011941697,3.8998016,10971.694482230047,1208.1455363413334,8,361077.83333333337,2563.0333333334002,95.029486099410249,0.67396798652063994,2,39760,39760,11.9629317607414,11.9629317607414]
[null,"ZN4545:PA19","MEADOWBANK","URBAN",497,0,4752.6245162018304,2.6125623999999998,1450.7002767265137,0,2,71265.716666666704,194.71666666670001,100.20120724346076,0.20120724346076399,0,0,0,0,0]
[null,"ZN4545:PA2","MEADOWBANK","URBAN",1056,0,3991.03921299989,1.8680201999999999,5201.1861519374361,344.07998073900001,3,357347.26666666672,19229.266666666699,121.4015151515151,23.484848484848499,2,23640,23640,8.6174242424242493,8.6174242424242493]
[null,"ZN4545:PA21","MEADOWBANK","URBAN",724,2016.48538884089,3036.7713635925002,1.8318403999999999,3401.4024227887671,224.37297139400002,4,238308.76666666669,836.76666666669996,100.41436464088397,0.41436464088397795,1,15720,15720,0.96685082872928207,0.96685082872928207]
[null,"ZN4545:PA24","MEADOWBANK","URBAN",1670,1464.0912008682201,4760.2166588022401,4.4082229999999996,20193.429136974813,1486.8647807745415,5,587917.18333333335,42437.1833333334,105.98802395209582,6.7065868263473103,2,43289,43289,5.1497005988023998,5.1497005988023998]
[null,"ZN4545:PA25","MEADOWBANK","URBAN",1070,2330.2453810585798,5771.48033213893,3.7189025999999998,10127.750566038778,0,3,349516.6166666667,447.61666666669998,99.345794392523374,0.18691588785046701,0,0,0,0,0]
[null,"ZN4545:PA26","MEADOWBANK","URBAN",1186,0,2816.7569381461899,2.7211018,8624.0763422036889,955.78247208033326,5,406759.25,14603.25,103.70994940978093,3.2040472175379398,1,45080,45080,13.575042158516002,13.575042158516002]
[null,"ZN4545:PA27","MEADOWBANK","URBAN",1076,1327.3770484740901,3253.4041140772802,1.9413319,5644.5677580612701,0,5,373164.68333333329,20476.683333333302,112.08178438661709,12.453531598512999,0,0,0,0,0]
[null,"ZN4545:PA28","MEADOWBANK","URBAN",1099,1.2998618456777,1783.2458472907699,1.6871212,4983.740320513496,0,2,379121.8,17550.8,112.37488626023659,12.3748862602366,0,0,0,0,0]
[null,"ZN4545:PA29","MEADOWBANK","SHORT RURAL",1676,3761.9269430896502,5378.8580527176,3.9912031999999997,28422.55473562119,0,12,913963.61666666705,330847.816666667,313.18615751789997,210.97852028639599,0,0,0,0,0]
[null,"ZN4545:PA3","MEADOWBANK","URBAN",622,0,3351.9509271382399,3.0838518999999995,4842.7689771409659,4.3251022897500002,1,201544,0,99.035369774919602,0,1,180,180,0.64308681672025692,0.64308681672025692]
[null,"ZN4545:PA31","MEADOWBANK","URBAN",2978,4281.4047413313001,6214.7671214059401,5.0251837999999998,49790.560385652629,761.16459018599994,13,1271641.5166666671,179075.91666666701,206.88381464069877,106.91739422431199,1,19440,19440,1.20886501007388,1.20886501007388]
[null,"ZN4545:PA32","MEADOWBANK","URBAN",790,0,5928.6359439198204,4.3539532999999997,9259.3261652221918,0,3,272938.78333333367,1429.1166666667,110.63291139240501,0.126582278481013,0,0,0,0,0]
[null,"ZN4545:PA33","MEADOWBANK","URBAN",2628,0,6389.0617596587499,3.4104221999999997,20516.277475046099,0,2,772076,11,93.302891933028917,3.8051750380517502E-2,0,0,0,0,0]
[null,"ZN4545:PA35","MEADOWBANK","URBAN",1365,386.83956897765898,4280.1239729890804,3.2837928999999995,14445.496904179568,0,8,564581.133333334,131733.26666666701,223.58974358974399,121.538461538462,0,0,0,0,0]
[null,"ZN4545:PA36","MEADOWBANK","URBAN",1225,3676.5029251657302,4474.4261846127401,3.3018828,13362.246238294076,0,10,519382.66666666698,136657.66666666701,200.32653061224482,101.142857142857,0,0,0,0,0]
[null,"ZN4545:PA39","MEADOWBANK","URBAN",1141,0,5538.1866806745402,2.3764415999999997,7102.2922536527876,0,3,383566.81666666671,6557.8166666667003,104.29447852760738,4.4697633654688795,0,0,0,0,0]
[null,"ZN4545:PA4","MEADOWBANK","URBAN",1695,0,6996.7563515728698,3.6827227999999996,16299.917701531089,987.95330428116688,8,568049.28333333333,88013.283333333296,109.26253687315639,22.6548672566372,2,34430,34430,4.2477876106194694,4.2477876106194694]
[null,"ZN4545:PA40","MEADOWBANK","URBAN",1770,4072.60576565169,4930.6217851248202,5.4060237999999998,60898.141287015191,0,14,1445758.383333337,199115.71666666699,334.51977401129903,110.790960451977,0,0,0,0,0]
[null,"ZN4545:PA41","MEADOWBANK","URBAN",1054,2915.4618829006799,7926.3058383630096,2.5754305,9189.3340102196853,6.3210722334374996,8,457934.99999999988,5400.9999999999,200.94876660341509,1.8975332068311201,1,315,315,9.4876660341556007E-2,9.4876660341556007E-2]
[null,"ZN4545:PA42","MEADOWBANK","URBAN",1111,1607.60611823522,3062.5920172339102,1.6690312999999999,6620.2960705616088,0,6,509075.933333333,146961.933333333,214.9414941494145,116.471647164716,0,0,0,0,0]
[null,"ZN4545:PA44","MEADOWBANK","URBAN",1184,831.60571356019796,9557.5480305260298,3.2285710999999999,10064.647317943851,0,9,400090.1333333333,18765.133333333299,124.9155405405407,22.550675675675699,0,0,0,0,0]
[null,"ZN4545:PA6","MEADOWBANK","URBAN",726,185.89799148009101,2640.11204745738,2.8115512999999996,5622.904520353517,0,7,256675.45,19927.45,116.11570247933881,16.3911845730027,0,0,0,0,0]
[null,"ZN4545:PA9","MEADOWBANK","URBAN",26,0,3088.77909621359,5.2422626000000001,323.70425485979172,0,1,7925,0,96.153846153846104,0,0,0,0,0,0]
[null,"ZN4990:PA51 52ABC","CITY CENTRAL","CBD",1652,0,8053.3541660282499,17.650029799999999,30.255092748833331,4666.1604407632503,1,220,220,0.24213075060532702,0.24213075060532702,3,33930,33930,8.4745762711864394,8.4745762711864394]
[null,"ZN4990:PA51 52GHJ","CITY CENTRAL","CBD",300,0,6054.3283804774401,11.609907400000001,0,1757.6480685930835,0,0,0,0,0,2,19430,19430,9,9]
[null,"ZN4990:PA51 52KLM","CITY CENTRAL","CBD",179,0,9821.9597409655107,16.870259900000001,101.60887245020419,1255.3230684339585,1,773,773,0.55865921787709494,0.55865921787709494,3,9550,9550,12.849162011173201,12.849162011173201]
[null,"ZN4990:PA53 54ABC","CITY CENTRAL","CBD",341,0,5188.9197201692295,9.4324546999999992,0,642.34230469108331,0,0,0,0,0,1,8740,8740,5.5718475073313805,5.5718475073313805]
[null,"ZN4990:PA53 54DEF","CITY CENTRAL","CBD",1351,0,6075.8368755073298,7.1835944999999999,0,26.86664343,0,0,0,0,0,1,480,480,7.4019245003700995E-2,7.4019245003700995E-2]
[null,"ZN4990:PA53 54GHJ","CITY CENTRAL","CBD",306,0,6198.3195563460904,12.407767199999999,384.31437275758674,0,2,3975.2333333332999,3975.2333333332999,6.5359477124183094,6.5359477124183094,0,0,0,0,0]
[null,"ZN4990:PA53 54KLM","CITY CENTRAL","CBD",730,0,3025.9281789391198,4.7347932999999998,0,503.57485991312495,0,0,0,0,0,1,13650,13650,4.7945205479452104,4.7945205479452104]
[null,"ZN4990:PA55 56DEF","CITY CENTRAL","CBD",379,0,10809.6823754652,19.1191201,4379.563467096722,2712.7402542886257,2,29399,29399,12.9287598944591,12.9287598944591,2,18210,18210,10.026385224274401,10.026385224274401]
[null,"ZN4990:PA55 56GHJ","CITY CENTRAL","CBD",863,0,3173.59632327897,3.8998016,113.79539822933334,9.5715755520000023,2,3745,3745,1.1587485515643099,1.1587485515643099,1,315,315,0.34762456546929299,0.34762456546929299]
[null,"ZN4990:PA55ABC","CITY CENTRAL","CBD",415,0,2312.8778136781102,5.9677627999999991,455.17693413334996,491.0275231839999,1,9789,9789,9.397590361445781,9.397590361445781,2,10560,10560,11.566265060241001,11.566265060241001]
[null,"ZN5868:PA10","GORE HILL","URBAN",281,0,2923.90278280559,3.6284530999999998,5.2674883592483743,201.37929823554586,3,186.3166666667,186.3166666667,1.0676156583629901,1.0676156583629901,1,7123,7123,6.04982206405694,6.04982206405694]
[null,"ZN5868:PA13","GORE HILL","URBAN",769,0,3472.0409836015301,4.9156922999999999,24.704426115187502,0,1,645,645,0.65019505851755499,0.65019505851755499,0,0,0,0,0]
[null,"ZN5868:PA14","GORE HILL","URBAN",1947,0,5510.9209097918601,3.9731132999999996,2565.7017260891726,2059.5808169901252,5,82879.066666666797,1116.4833333334,2.619414483821263,0.15408320493066299,2,66530,66530,7.2419106317411401,7.2419106317411401]
[null,"ZN5868:PA17","GORE HILL","URBAN",248,0,1696.8074511023001,2.6668321000000001,459.07884870772159,0,2,22093.333333333299,22093.333333333299,112.903225806452,112.903225806452,0,0,0,0,0]
[null,"ZN5868:PA2","GORE HILL","URBAN",303,0,2494.3335888044699,3.6094110999999995,2.3103314078647919,0,1,82.15,82.15,0.33003300330032997,0.33003300330032997,0,0,0,0,0]
[null,"ZN5868:PA23","GORE HILL","URBAN",399,0,4714.0680903258899,4.4805826,785.02676280621733,13.61537037575,2,22486.383333333299,22486.383333333299,40.8521303258145,40.8521303258145,1,390,390,6.5162907268170391,6.5162907268170391]
[null,"ZN5868:PA24","GORE HILL","URBAN",69,0,1666.55918911556,4.2625517000000004,0,107.60811766650002,0,0,0,0,0,2,3240,3240,11.5942028985507,11.5942028985507]
[null,"ZN5868:PA25","GORE HILL","URBAN",78,0,1675.35133897999,2.7572815999999998,32.080712920849997,0,1,1493.25,1493.25,1.2820512820512799,1.2820512820512799,0,0,0,0,0]
[null,"ZN5868:PA27","GORE HILL","URBAN",774,0,4828.077195586,3.0657619999999999,0,112.74850715333334,0,0,0,0,0,1,4720,4720,1.29198966408269,1.29198966408269]
[null,"ZN5868:PA28","GORE HILL","URBAN",47,0,1418.49251022526,3.3380625999999998,29.338232191399996,0,1,1128,1128,100,100,0,0,0,0,0]
[null,"ZN5868:PA30","GORE HILL","URBAN",1724,0,8574.9228813058598,4.5710321,3864.9696106284023,0,10,108517.9166666666,19374.55,14.44315545243624,11.4269141531323,0,0,0,0,0]
[null,"ZN5868:PA5","GORE HILL","SHORT RURAL",741,0,7154.0352259441197,1.4690902999999997,1429.6441950413905,0,5,124896.16666666701,124896.16666666701,206.47773279352202,206.47773279352202,0,0,0,0,0]
[null,"ZN5868:PA6","GORE HILL","URBAN",1114,0,2139.0230706320499,3.3380625999999998,2295.4370714628144,378.43198438374998,2,88255.25,88255.25,104.129263913824,104.129263913824,1,14550,14550,43.536804308797102,43.536804308797102]
[null,"ZN5868:PA7","GORE HILL","URBAN",218,0,6753.6228173847903,3.5189615999999999,18.814169737695753,0,1,686.18333333329997,686.18333333329997,0.45871559633027498,0.45871559633027498,0,0,0,0,0]
[null,"ZN630:PA10","MASCOT","URBAN",304,0,2585.9711563390701,1.9232419999999999,0,36.339256914583331,0,0,0,0,0,1,2425,2425,1.6447368421052599,1.6447368421052599]
[null,"ZN630:PA14","MASCOT","SHORT RURAL",1246,0,9290.0644081110695,2.9200906999999998,9.7638018258695194,0,2,429.13333333330002,429.13333333330002,0.24077046548956699,0.24077046548956699,0,0,0,0,0]
[null,"ZN630:PA15","MASCOT","URBAN",54,0,2206.70310481357,1.6690312999999999,0,169.05896209583332,0,0,0,0,0,3,13000,13000,53.703703703703695,53.703703703703695]
[null,"ZN630:PA19","MASCOT","URBAN",233,0,1459.0439396264001,0.67123049999999995,0,7.6881063393749995,0,0,0,0,0,1,1470,1470,0.42918454935622302,0.42918454935622302]
[null,"ZN630:PA24","MASCOT","URBAN",746,0,3450.8084137054798,1.52336,7.9525739333333352,0,1,670,670,1.34048257372654,1.34048257372654,0,0,0,0,0]
[null,"ZN630:PA25","MASCOT","URBAN",96,0,2969.9347651428602,1.8861101,89.704025059366671,0.14695941195833334,2,6104,6104,29.166666666666703,29.166666666666703,1,10,10,1.0416666666666701,1.0416666666666701]
[null,"ZN630:PA26","MASCOT","URBAN",552,0,1320.4602967103001,1.2339216,115.55626427136002,0,3,12019.2,12019.2,10.869565217391299,10.869565217391299,0,0,0,0,0]
[null,"ZN630:PA27","MASCOT","URBAN",337,0,3585.8809400158402,1.2158316999999998,205.78385591303416,0,3,21722.383333333299,21722.383333333299,35.9050445103857,35.9050445103857,0,0,0,0,0]
[null,"ZN630:PA3","MASCOT","URBAN",1455,0,5028.61542737126,2.2859920999999996,968.89915091178148,0,4,54396.816666666702,54396.816666666702,104.74226804123701,104.74226804123701,0,0,0,0,0]
[null,"ZN630:PA32","MASCOT","URBAN",331,0,2899.2611618936198,1.9413319,6.0504844216666669,0,1,400,400,0.30211480362537801,0.30211480362537801,0,0,0,0,0]
[null,"ZN630:PA34","MASCOT","URBAN",183,0,2631.8814127301698,1.7956605999999997,1.7628897940500001,0,1,126,126,0.54644808743169404,0.54644808743169404,0,0,0,0,0]
[null,"ZN630:PA35","MASCOT","URBAN",564,0,4817.4865036199199,1.7052110999999999,280.70763680539886,0,3,21127.383333333299,21127.383333333299,2.4822695035461,2.4822695035461,0,0,0,0,0]
[null,"ZN630:PA38","MASCOT","URBAN",2232,0,7942.9371056884902,3.5370514999999996,1.5378215659124996,0,1,55.8,55.8,4.4802867383512503E-2,4.4802867383512503E-2,0,0,0,0,0]
[null,"ZN630:PA4","MASCOT","URBAN",92,0,646.60656073505004,1.2881912999999998,27.070213002112499,0,1,2697,2697,101.086956521739,101.086956521739,0,0,0,0,0]
[null,"ZN630:PA40","MASCOT","URBAN",79,0,3928.6976935975899,2.2498122999999999,363.70803113645002,0,4,20748,15060,148.1012658227848,48.101265822784796,0,0,0,0,0]
[null,"ZN630:PA41","MASCOT","URBAN",458,0,3307.42758534412,3.8455318999999997,16.714417467770527,0,2,557.83333333329995,557.83333333329995,0.43668122270742304,0.43668122270742304,0,0,0,0,0]
[null,"ZN630:PA8","MASCOT","URBAN",347,0,1431.04317967209,2.1403208,166.85004566450002,0,1,10005,10005,99.423631123919293,99.423631123919293,0,0,0,0,0]
[null,"ZN690:PA10","CAMPSIE","URBAN",1221,3.2999521891049399,5817.8775177617599,2.3402617999999999,2367.7437559716645,0,6,129849.383333333,128682.133333333,108.84520884520907,108.763308763309,0,0,0,0,0]
[null,"ZN690:PA11","CAMPSIE","URBAN",1766,0,5697.00480483914,3.0838518999999995,1.9963550846662128,0,1,83.083333333300004,83.083333333300004,5.6625141562853899E-2,5.6625141562853899E-2,0,0,0,0,0]
[null,"ZN690:PA12","CAMPSIE","URBAN",1937,0,9594.8390046405802,3.6284530999999998,6359.4652243951741,844.75830847650002,8,224941.05,224941.05,106.24677336086701,106.24677336086701,1,29880,29880,4.2849767681982396,4.2849767681982396]
[null,"ZN690:PA14","CAMPSIE","URBAN",2099,0,5833.4301718873803,3.3199727000000001,3989.4777053265661,0,11,154223.71666666699,154223.71666666699,101.09575988566,101.09575988566,0,0,0,0,0]
[null,"ZN690:PA17","CAMPSIE","URBAN",1752,0,3466.2200559120301,2.3221718999999998,3.1184301309356255,0,1,172.35,172.35,5.7077625570776294E-2,5.7077625570776294E-2,0,0,0,0,0]
[null,"ZN690:PA18","CAMPSIE","URBAN",1941,0,8218.7030127614398,4.7167033999999992,16143.21983855456,0,6,439259.566666667,439259.566666667,200.82431736218399,200.82431736218399,0,0,0,0,0]
[null,"ZN690:PA24","CAMPSIE","URBAN",916,0,11936.719779082699,3.0295821999999997,317.62530685058698,0,7,13455.5666666666,1045.3833333333,8.296943231441043,0.21834061135371199,0,0,0,0,0]
[null,"ZN690:PA25","CAMPSIE","URBAN",2307,0,10932.4076471928,4.5348522999999998,283.49162126647036,0,4,8023.1833333332997,8023.1833333332997,3.4677069787603001,3.4677069787603001,0,0,0,0,0]
[null,"ZN690:PA26","CAMPSIE","URBAN",1869,0,7310.6136408542598,3.4285120999999998,32.347323580167931,0,3,1210.8833333333,60.7,0.16051364365971141,5.35045478865704E-2,0,0,0,0,0]
[null,"ZN690:PA27","CAMPSIE","URBAN",199,0,5029.7599446208096,1.0882502999999999,2.8534202485871574,4.4516238834374997,1,336.51666666670002,336.51666666670002,0.50251256281406997,0.50251256281406997,1,525,525,0.50251256281406997,0.50251256281406997]
[null,"ZN690:PA3","CAMPSIE","URBAN",497,0,6907.1322112410598,2.0860510999999997,582.15042417975758,0,3,35816.233333333301,6669,26.760563380281699,13.279678068410499,0,0,0,0,0]
[null,"ZN690:PA30","CAMPSIE","URBAN",1238,0,7048.4464814584499,2.3040819999999997,646.99276023256004,0,6,36038.866666666603,32747.183333333302,12.116316639741544,12.035541195476601,0,0,0,0,0]
[null,"ZN690:PA33","CAMPSIE","URBAN",586,0,3670.08481350905,3.9178915000000001,2130.6008853241292,483.36300750237501,1,69794.2,0,7.1672354948805497,0,4,15834,15834,0.68259385665529004,0.68259385665529004]
[null,"ZN690:PA34","CAMPSIE","URBAN",2144,0,7825.3226339827597,3.7369924999999995,3492.7709104447213,0,4,119954.766666667,119954.766666667,6.8097014925373092,6.8097014925373092,0,0,0,0,0]
[null,"ZN690:PA35","CAMPSIE","URBAN",2692,0,9855.8178903893604,4.2263719000000002,2120.0555888056347,0,9,64379.733333333301,63075.85,10.735512630014805,10.661218424962799,0,0,0,0,0]
[null,"ZN690:PA36","CAMPSIE","SHORT RURAL",1296,0,8563.6245958061299,2.7572815999999998,2544.9721403437097,0,7,118459.95,118459.95,100.07716049382699,100.07716049382699,0,0,0,0,0]
[null,"ZN690:PA4","CAMPSIE","URBAN",1312,0,5790.0364811351901,2.2307702999999997,13.372394390293124,0,2,769.35,769.35,0.228658536585366,0.228658536585366,0,0,0,0,0]
[null,"ZN690:PA5","CAMPSIE","URBAN",530,0,4983.2586495632504,1.8861101,3.7624058784870877,0,2,256.01666666670002,256.01666666670002,0.56603773584905703,0.56603773584905703,0,0,0,0,0]
[null,"ZN690:PA6","CAMPSIE","URBAN",818,0,6635.1940223944703,2.4307113,0,465.90658842750003,0,0,0,0,0,2,24600,24600,8.5574572127139401,8.5574572127139401]
[null,"ZN711:PA11","BLACKWATTLE BAY","URBAN",406,0,943.65828964829802,1.5500187999999999,233.09053546166666,0,1,19300,19300,99.014778325123203,99.014778325123203,0,0,0,0,0]
[null,"ZN711:PA13","BLACKWATTLE BAY","URBAN",32,0,1509.59025492048,1.7813790999999999,0,206.53309285400002,0,0,0,0,0,1,14880,14880,96.875,96.875]
[null,"ZN711:PA14","BLACKWATTLE BAY","URBAN",639,0,2238.48308560034,3.2399963000000001,0,0.25244971170833336,0,0,0,0,0,1,10,10,0.15649452269170602,0.15649452269170602]
[null,"ZN711:PA15","BLACKWATTLE BAY","URBAN",491,0,5622.0487665386299,1.3357962999999999,306.65324643126252,0,1,29463,29463,100,100,0,0,0,0,0]
[null,"ZN711:PA16","BLACKWATTLE BAY","URBAN",285,0,1782.9512306269801,0.98161509999999985,1.7820813134208329,0,1,233,233,0.35087719298245601,0.35087719298245601,0,0,0,0,0]
[null,"ZN711:PA21","BLACKWATTLE BAY","URBAN",739,0,4303.0694174884002,1.0634957,176.84014767507918,0,2,21341,21341,23.410013531799699,23.410013531799699,0,0,0,0,0]
[null,"ZN711:PA22","BLACKWATTLE BAY","URBAN",546,0,3276.7809207710302,0.98161509999999985,676.40247471339978,0,3,88436.916666666701,88436.916666666701,39.926739926739899,39.926739926739899,0,0,0,0,0]
[null,"ZN711:PA23","BLACKWATTLE BAY","URBAN",298,0,2056.9858946488898,1.1130049,34.862095980250004,3.1219787444999998,2,4020,4020,13.087248322147699,13.087248322147699,1,360,360,0.33557046979865801,0.33557046979865801]
[null,"ZN711:PA32","BLACKWATTLE BAY","URBAN",390,0,1727.0230672048499,0.70074559999999997,177.74888602345089,85.175627679999991,3,32554.883333333299,1845.8833333333,3.8461538461538396,2.0512820512820498,1,15600,15600,6.1538461538461497,6.1538461538461497]
[null,"ZN711:PA33","BLACKWATTLE BAY","URBAN",1291,0,3476.4859037142801,1.4928927999999999,9.8589997738714974,0,2,847.56666666670003,847.56666666670003,0.154918667699458,0.154918667699458,0,0,0,0,0]
[null,"ZN711:PA34","BLACKWATTLE BAY","URBAN",403,0,2875.0908952493201,1.5500187999999999,1.0627962238666666,0,1,88,88,0.24813895781637699,0.24813895781637699,0,0,0,0,0]
[null,"ZN72:PA10","FIVE DOCK","URBAN",2365,0,5184.3409276410302,4.5348522999999998,14075.55618936626,0,8,398356.633333334,256781.46666666699,172.55813953488359,110.27484143763201,0,0,0,0,0]
[null,"ZN72:PA14","FIVE DOCK","URBAN",2309,1.65092377932328,9296.3005048597097,3.3018828,873.72985875987013,220.09594063325,2,33961.366666666603,33961.366666666603,6.5829363360762203,6.5829363360762203,1,8555,8555,1.2559549588566501,1.2559549588566501]
[null,"ZN72:PA15","FIVE DOCK","URBAN",890,0,3106.11159268235,2.4849809999999999,391.86332537371186,10.649178993750002,3,20238.633333333299,20238.633333333299,16.516853932584301,16.516853932584301,1,550,550,0.112359550561798,0.112359550561798]
[null,"ZN72:PA16","FIVE DOCK","URBAN",1652,0,7628.2591651278599,2.6849219999999998,22.90393221920764,0,2,1094.8333333333001,660.63333333330002,0.1210653753026634,6.0532687651331699E-2,0,0,0,0,0]
[null,"ZN72:PA17","FIVE DOCK","URBAN",722,0,4274.6659037434902,0.4170198,14.036886468000001,0,1,4320,4320,99.7229916897507,99.7229916897507,0,0,0,0,0]
[null,"ZN72:PA18","FIVE DOCK","URBAN",1962,0,4942.1132830400602,3.1381215999999998,685.43471330365855,0,2,28032.766666666699,28032.766666666699,101.07033639143701,101.07033639143701,0,0,0,0,0]
[null,"ZN72:PA21","FIVE DOCK","URBAN",417,0,1165.0988279261901,0.7978597999999999,267.66109443367577,0,3,43055.466666666704,43055.466666666704,135.49160671462801,135.49160671462801,0,0,0,0,0]
[null,"ZN72:PA22","FIVE DOCK","URBAN",620,0,2542.2508122204099,1.7413908999999999,156.877117356025,0,2,11562,11562,113.38709677419401,113.38709677419401,0,0,0,0,0]
[null,"ZN72:PA23","FIVE DOCK","URBAN",1674,0,5729.2632427561603,2.6306522999999999,393.45368845316256,0,4,19195.516666666699,19195.516666666699,106.869772998805,106.869772998805,0,0,0,0,0]
[null,"ZN72:PA24","FIVE DOCK","URBAN",548,0,5280.2420326679303,1.4329104999999998,165.92193194294168,0,5,14861.2166666667,14861.2166666667,108.211678832117,108.211678832117,0,0,0,0,0]
[null,"ZN72:PA25","FIVE DOCK","URBAN",492,0,2326.6346172830799,1.5052700999999999,557.52896423180005,38.000543674500001,3,47536,47536,30.081300813008099,30.081300813008099,1,3240,3240,0.203252032520325,0.203252032520325]
[null,"ZN72:PA26","FIVE DOCK","URBAN",1416,0,11346.5806385203,4.3901330999999999,5796.8383004774851,0,9,169466.2166666667,160796.5,164.90112994350369,164.68926553672401,0,0,0,0,0]
[null,"ZN72:PA30","FIVE DOCK","URBAN",729,0,4806.56396630167,2.7753714999999999,1222.5931116798895,0,4,56536.7,56536.7,25.788751714677598,25.788751714677598,0,0,0,0,0]
[null,"ZN72:PA31","FIVE DOCK","URBAN",1181,0,6947.5978818247004,4.7347932999999998,474.13509887204998,0,3,12852,12852,7.7053344623200601,7.7053344623200601,0,0,0,0,0]
[null,"ZN72:PA35","FIVE DOCK","URBAN",651,0,3231.2855721772398,1.6690312999999999,28.414476683128068,0,3,2184.9666666666999,576.26666666669996,0.46082949308755805,0.30721966205837198,0,0,0,0,0]
[null,"ZN7481:PA1","DARLING HARBOUR 132 11kV","URBAN",2437,0,11539.2638175023,5.496473299999999,1818.2255886034845,413.27753722979156,14,42455.4333333334,30107.116666666701,12.638489946655751,8.2068116536725704,3,9650,9650,3.28272466146902,3.28272466146902]
[null,"ZN7481:PA10","DARLING HARBOUR 132 11kV","URBAN",35,0,484.82419045615097,3.246661,0,318.74094367500004,0,0,0,0,0,1,12600,12600,100,100]
[null,"ZN7481:PA12","DARLING HARBOUR 132 11kV","URBAN",781,0,14862.703933352401,5.6411924999999998,212.7387711625,0,2,4840,4840,2.0486555697823401,2.0486555697823401,0,0,0,0,0]
[null,"ZN7481:PA13","DARLING HARBOUR 132 11kV","URBAN",432,0,1782.66082573111,5.1879928999999994,0,23.84963569404167,0,0,0,0,0,2,590,590,27.314814814814799,27.314814814814799]
[null,"ZN7481:PA16","DARLING HARBOUR 132 11kV","URBAN",98,0,1415.5498221201799,3.6284530999999998,0,18.093886125333334,0,0,0,0,0,3,640,640,3.0612244897959302,3.0612244897959302]
[null,"ZN7481:PA17","DARLING HARBOUR 132 11kV","URBAN",4206,0,17784.239766090799,5.8049537000000004,843.11021764803195,1052.9605516430001,9,18640.400000000001,18160.933333333302,4.77888730385164,4.7313361864003793,2,23280,23280,2.0684736091298102,2.0684736091298102]
[null,"ZN7481:PA19","DARLING HARBOUR 132 11kV","URBAN",140,0,1625.9656923842499,1.1967896999999998,7.8329885864999991,0,1,840,840,100,100,0,0,0,0,0]
[null,"ZN7481:PA2","DARLING HARBOUR 132 11kV","URBAN",3,0,192.31508584611601,1.9232419999999999,0,16.184081429999999,0,0,0,0,0,1,1080,1080,100,100]
[null,"ZN7481:PA3","DARLING HARBOUR 132 11kV","URBAN",555,0,1004.17743003428,4.2263719000000002,12055.481390225303,1197.8462483453127,2,366088.83333333302,366088.83333333302,34.234234234234201,34.234234234234201,1,36375,36375,13.5135135135135,13.5135135135135]
[null,"ZN7481:PA5","DARLING HARBOUR 132 11kV","URBAN",15,0,288.69769582562702,3.2647508999999997,0,137.36439411750001,0,0,0,0,0,1,5400,5400,100,100]
[null,"ZN7481:PA6","DARLING HARBOUR 132 11kV","URBAN",495,0,6856.7868282549998,1.2158316999999998,3.8419192537435416,8.4312862429583326,1,405.55,405.55,0.20202020202020202,0.20202020202020202,2,890,530,0.40404040404040403,0.20202020202020202]
[null,"ZN7481:PA9","DARLING HARBOUR 132 11kV","URBAN",1680,0,4592.8706845630704,8.6526847999999994,0,23.596592506666664,0,0,0,0,0,1,350,350,5.95238095238095E-2,5.95238095238095E-2]
[null,"ZN7900:PA1","CAMPBELL ST","URBAN",514,0,1049.72185462414,1.6690312999999999,1.8206349764166665,0.39013606637499998,1,140,140,0.38910505836575904,0.38910505836575904,1,30,30,1.1673151750972799,1.1673151750972799]
[null,"ZN7900:PA14","CAMPBELL ST","URBAN",433,0,1157.46869358602,3.2104811999999998,276.71342130976501,4.2525498895,3,11061.9,11061.9,34.872979214780599,34.872979214780599,1,170,170,3.92609699769053,3.92609699769053]
[null,"ZN7900:PA15","CAMPBELL ST","URBAN",470,0,2575.5819375712799,1.6328514999999999,893.48518298141664,0,2,70228,70228,200,200,0,0,0,0,0]
[null,"ZN7900:PA16","CAMPBELL ST","URBAN",1041,0,566.28062602351201,1.9413319,231.50741649457356,0,2,15305.05,15305.05,2.0172910662824202,2.0172910662824202,0,0,0,0,0]
[null,"ZN7900:PA2","CAMPBELL ST","URBAN",1567,0,3297.5638266280198,2.6125623999999998,770.36570338997501,319.99970556400001,3,37844.25,691.25,4.6585832801531595,1.2763241863433301,1,15720,15720,16.719846841097599,16.719846841097599]
[null,"ZN7900:PA20","CAMPBELL ST","URBAN",87,0,2501.5640184355002,2.0317813999999998,0,11.398293654000001,0,0,0,0,0,2,720,720,2.29885057471264,2.29885057471264]
[null,"ZN7900:PA23","CAMPBELL ST","URBAN",313,0,2432.0598435573302,2.5754305,11.237461748333333,229.24421966599999,1,560,560,2.5559105431309899,2.5559105431309899,1,11424,11424,10.8626198083067,10.8626198083067]
[null,"ZN7900:PA24","CAMPBELL ST","URBAN",784,0,1998.8461429830199,3.8636217999999998,1235.4914158232341,0,3,41040.699999999997,41040.699999999997,10.969387755102,10.969387755102,0,0,0,0,0]
[null,"ZN7900:PA3","CAMPBELL ST","URBAN",229,0,1231.3734183783199,1.4871802000000001,216.30962992583275,0,1,18667.316666666698,18667.316666666698,100,100,0,0,0,0,0]
[null,"ZN7900:PA6","CAMPBELL ST","URBAN",918,0,3238.6045048774599,2.5211608000000001,229.67816907346665,0,1,11692,11692,16.122004357298501,16.122004357298501,0,0,0,0,0]
[null,"ZN7900:PA7","CAMPBELL ST","URBAN",770,0,2568.6104677578101,2.8477310999999998,169.82392997482989,5.7690285867500002,2,7653.6666666666997,7653.6666666666997,4.5454545454545494,4.5454545454545494,1,260,260,3.37662337662338,3.37662337662338]
[null,"ZN80:PA21","CHATSWOOD","URBAN",772,0,3323.9588709516602,1.6871212,1201.9154483786633,0,4,91431.8,91431.8,163.34196891191698,163.34196891191698,0,0,0,0,0]
[null,"ZN80:PA22","CHATSWOOD","URBAN",1447,0,7863.1583628335702,2.6668321000000001,2874.4715102604687,0,5,138334.96666666699,138334.96666666699,108.707671043538,108.707671043538,0,0,0,0,0]
[null,"ZN80:PA24","CHATSWOOD","URBAN",1645,0,9445.6962200834096,7.3464035999999995,143.08464790658499,191.18403168699999,1,2499.6999999999998,0,6.0790273556230998E-2,0,3,3340,3340,0.36474164133738601,0.36474164133738601]
[null,"ZN80:PA25","CHATSWOOD","URBAN",1350,2350.18706415016,4198.8663315609501,2.3583516999999996,3549.2933338764215,1729.133639974583,11,193153.66666666701,193153.66666666701,125.70370370370401,125.70370370370401,2,94100,94100,15.333333333333298,15.333333333333298]
[null,"ZN80:PA28","CHATSWOOD","URBAN",506,0,3109.6254331589498,1.7594808,514.29959429399787,0,2,37514.683333333298,37514.683333333298,9.2885375494071099,9.2885375494071099,0,0,0,0,0]
[null,"ZN80:PA30","CHATSWOOD","URBAN",1314,0,6395.0519829086898,4.8252427999999989,2462.2387585044607,752.76079670329989,2,65490.85,82.85,8.5996955859969546,7.6103500761035003E-2,1,20022,20022,7.1537290715372901,7.1537290715372901]
[null,"ZN80:PA31","CHATSWOOD","URBAN",782,2768.8685763858998,2248.8866675689601,2.0498713,17.252328975145463,0,3,1080.1666666665999,1080.1666666665999,0.38363171355498699,0.38363171355498699,0,0,0,0,0]
[null,"ZN80:PA32","CHATSWOOD","URBAN",3835,5569.0741757531196,7556.46448458342,7.709153699999999,39124.827098744434,5240.2586818065001,21,651351.41666666698,492467.133333334,123.67666232073012,109.33507170795301,3,87240,87240,5.5019556714471998,5.5019556714471998]
[null,"ZN80:PA36","CHATSWOOD","URBAN",374,0,3570.0271091730801,1.3967307,249.9388470982353,0,2,22966.2833333333,22966.2833333333,100.26737967914401,100.26737967914401,0,0,0,0,0]
[null,"ZN80:PA37","CHATSWOOD","URBAN",1427,726.63088903712799,7645.7319564726104,6.7665746999999996,6513.4514160659955,326.6183316598125,8,123541.233333333,109897.233333333,114.15557112824079,111.63279607568299,2,6195,6195,9.4604064470918008,9.4604064470918008]
[null,"ZN80:PA39","CHATSWOOD","URBAN",606,0,4293.9597407884403,1.8137504999999998,2820.9601377999938,0,3,199613.1,37558.1,112.54125412541241,100.16501650165,0,0,0,0,0]
[null,"ZN80:PA40","CHATSWOOD","URBAN",2501,159.81951802401801,11880.9055891466,6.4219144999999997,23926.087362335456,1025.0164902323959,16,478163.91666666605,243663.63333333301,124.07037185125954,117.313074770092,2,20485,20485,1.15953618552579,1.15953618552579]
[null,"ZN8000:PA1","MACQUARIE PARK","URBAN",591,259.66189351813398,3606.9207579332701,2.8477310999999998,0,51.588428708437505,0,0,0,0,0,1,2325,2325,0.50761421319796896,0.50761421319796896]
[null,"ZN8000:PA12","MACQUARIE PARK","URBAN",53,0,3322.8141944249001,4.2263719000000002,0,1.9758288632500003,0,0,0,0,0,1,60,60,3.7735849056603801,3.7735849056603801]
[null,"ZN8000:PA14","MACQUARIE PARK","URBAN",3,0,2823.4277233733901,2.1765005999999998,1.7297738518499997,0,1,102,102,100,100,0,0,0,0,0]
[null,"ZN8000:PA15","MACQUARIE PARK","URBAN",98,0,2596.1970954130902,3.8636217999999998,92.118402766499983,0.90312159574999995,1,3060,3060,91.836734693877602,91.836734693877602,1,30,30,1.0204081632653099,1.0204081632653099]
[null,"ZN8000:PA17","MACQUARIE PARK","URBAN",41,0,3171.8692141567999,4.5167623999999993,243.50990584039516,46.454901283999995,3,6919.2500000001,1310.0333333333999,9.7560975609756007,7.3170731707316996,1,1320,1320,4.8780487804878003,4.8780487804878003]
[null,"ZN8000:PA19","MACQUARIE PARK","URBAN",888,0,3363.9273411996101,3.5732312999999998,1106.3069517158999,0,3,39736,39736,103.828828828829,103.828828828829,0,0,0,0,0]
[null,"ZN8000:PA20","MACQUARIE PARK","URBAN",71,0,3840.3936617519898,2.4307113,0,140.62424467781253,0,0,0,0,0,1,7425,7425,15.492957746478901,15.492957746478901]
[null,"ZN8000:PA25","MACQUARIE PARK","URBAN",334,1.3001056139770699,6270.4059596201396,3.9359814000000002,448.55367076704607,706.58738092800002,6,14626.1833333333,11379.1833333333,35.02994011976044,29.940119760479,1,23040,23040,14.371257485029901,14.371257485029901]
[null,"ZN8000:PA3","MACQUARIE PARK","URBAN",46,0,1850.3279796075501,2.3402617999999999,63.255010950563673,184.16885256916669,1,3468.9666666666999,3468.9666666666999,30.434782608695699,30.434782608695699,2,10100,10100,34.7826086956522,34.7826086956522]
[null,"ZN8000:PA38","MACQUARIE PARK","URBAN",630,0,5390.52812256794,3.7369924999999995,1176.4885427911461,1543.8045424770835,2,40405,40405,99.682539682539698,99.682539682539698,1,53020,53020,23.3333333333333,23.3333333333333]
[null,"ZN8000:PA39","MACQUARIE PARK","URBAN",51,0,2436.6743603866598,3.0657619999999999,0,184.17181994749998,0,0,0,0,0,3,7710,7710,31.372549019607799,31.372549019607799]
[null,"ZN8000:PA4","MACQUARIE PARK","URBAN",24,876.46122032186702,2506.73832731631,3.5008716999999998,50.054442479020835,0,1,1835,1835,95.8333333333333,95.8333333333333,0,0,0,0,0]
[null,"ZN8000:PA6","MACQUARIE PARK","URBAN",701,5.9325849812054603,8687.8081852096293,2.1041409999999998,1024.0973744674293,0,8,62464.9,59274.3,156.77603423680378,156.63338088444999,0,0,0,0,0]
[null,"ZN8100:PA17","GREEN SQUARE","URBAN",89,0,2562.1186901517499,2.1403208,108.34830051796666,0,2,6497,6497,200,200,0,0,0,0,0]
[null,"ZN8100:PA2","GREEN SQUARE","URBAN",204,0,2715.2652308752999,2.7934614,2.6307500330657256,26.118864090000002,2,120.8666666667,120.8666666667,1.47058823529412,1.47058823529412,1,1200,1200,0.98039215686274506,0.98039215686274506]
[null,"ZN8100:PA20","GREEN SQUARE","URBAN",759,0,2549.9808697537201,3.5189615999999999,0,39.894027789000006,0,0,0,0,0,2,1455,1455,2.10803689064559,2.10803689064559]
[null,"ZN8100:PA22","GREEN SQUARE","URBAN",264,0,3477.9577803216398,2.8296411999999997,318.01488554440004,0,2,14424,14424,9.0909090909090988,9.0909090909090988,0,0,0,0,0]
[null,"ZN8100:PA28","GREEN SQUARE","URBAN",394,0,5267.9405256625896,1.2520114999999998,39.091425516088172,0,2,4007.2166666666999,4007.2166666666999,3.8071065989847699,3.8071065989847699,0,0,0,0,0]
[null,"ZN8100:PA30","GREEN SQUARE","URBAN",1292,0,5529.8514129749801,3.9178915000000001,359.43140653560937,359.60693623708335,4,11774.25,11774.25,6.0371517027863897,6.0371517027863897,1,11780,11780,2.9411764705882399,2.9411764705882399]
[null,"ZN8100:PA4","GREEN SQUARE","URBAN",731,0,5056.04083592999,4.8976024000000002,155.92374320820002,33.772029549500004,2,4086,4086,101.77838577291401,101.77838577291401,1,885,885,0.41039671682626505,0.41039671682626505]
[null,"ZN8100:PA7","GREEN SQUARE","URBAN",78,0,1269.00763954068,2.3402617999999999,51.922852246604172,0,2,2847.5,2847.5,39.743589743589702,39.743589743589702,0,0,0,0,0]
[null,"ZN847:PA1","HORNSBY","SHORT RURAL",1203,3853.66596197648,7312.5613706746099,3.5551413999999997,7838.8655782017777,753.09286117569161,10,282986.66666666669,14120.416666666701,20.781379883624261,11.0556940980881,2,27187,27187,5.1537822111388198,5.1537822111388198]
[null,"ZN847:PA10","HORNSBY","URBAN",1328,902.78071941774601,6953.8907642313898,4.2987314999999997,836.10885316002793,42.705210745312499,9,24962.733333333297,2970.3833333333,9.1867469879517998,1.9578313253012101,1,1275,1275,1.12951807228916,1.12951807228916]
[null,"ZN847:PA14","HORNSBY","URBAN",389,34.167081848610302,2409.34986617815,3.1562114999999999,26.653789672926266,0,2,1083.8333333333001,1083.8333333333001,2.8277634961439602,2.8277634961439602,0,0,0,0,0]
[null,"ZN847:PA15","HORNSBY","URBAN",1251,820.565298789081,8497.7026607120097,4.0092930999999998,13481.638470371001,268.49985309881254,12,431563.3,330992.34999999998,317.5859312549955,312.62989608313296,1,8595,8595,1.1990407673860899,1.1990407673860899]
[null,"ZN847:PA18","HORNSBY","SHORT RURAL",1100,6209.6979133780796,7310.4378946078796,3.0657619999999999,9547.4094182057397,0,6,399683.98333333334,350.03333333329999,135.63636363636326,0.27272727272727298,0,0,0,0,0]
[null,"ZN847:PA19","HORNSBY","URBAN",1273,1.5615117674608401,3599.6753059298298,3.3742424,1683.7759456227286,1299.825657328,3,64043.883333333302,64043.883333333302,17.753338570306401,17.753338570306401,1,49440,49440,8.0911233307148507,8.0911233307148507]
[null,"ZN847:PA2","HORNSBY","URBAN",1535,2.3315465174032801,10306.499143323401,4.1721021999999994,11512.656681288872,0,9,354152.45,224732.65,120.5211726384367,113.81107491856699,0,0,0,0,0]
[null,"ZN847:PA21","HORNSBY","URBAN",1329,3799.99145766732,4775.63748181139,2.9934023999999999,8293.9247301651958,3213.1515624868002,9,355602.35,355355.6,262.52821670428852,262.45297215951797,6,137764,137764,53.649360421369394,53.649360421369394]
[null,"ZN847:PA22","HORNSBY","URBAN",1092,2975.33506467701,6409.9748297741999,3.2104811999999998,1882.0284910966,1917.3997001774999,12,75236,58369.65,11.44688644688644,7.9670329670329592,4,76650,76650,15.293040293040299,15.293040293040299]
[null,"ZN847:PA23","HORNSBY","URBAN",1242,259.67775022878999,6690.2787305239399,3.1743014000000001,5253.4139809433227,660.62105848658337,5,212404.2000000003,212225.01666666701,102.6570048309176,102.576489533011,3,26710,26710,5.3140096618357502,5.3140096618357502]
[null,"ZN847:PA28","HORNSBY","URBAN",1111,0,2460.3246960353999,3.3380625999999998,232.64593910073998,0,1,8944.7999999999993,0,12.961296129613,0,0,0,0,0,0]
[null,"ZN847:PA29","HORNSBY","URBAN",276,0,1560.5264610813599,3.0114922999999996,297.24884555611663,0,2,12668,12668,23.913043478260899,23.913043478260899,0,0,0,0,0]
[null,"ZN847:PA31","HORNSBY","URBAN",166,642.37290688784901,1772.1740066315199,3.9731132999999996,0,8.6680088494999996,0,0,0,0,0,1,280,280,0.60240963855421703,0.60240963855421703]
[null,"ZN847:PA36","HORNSBY","URBAN",1769,0,3846.6952189683102,2.6306522999999999,0,956.19278631937516,0,0,0,0,0,2,46650,46650,4.6353872244205796,4.6353872244205796]
[null,"ZN847:PA39","HORNSBY","URBAN",1586,2245.9890041511499,8222.1005028953005,3.246661,24754.12578285862,716.40821626000013,11,978543.83333333326,22949.833333333299,379.57124842370723,6.7465321563682208,1,28320,28320,3.7200504413619195,3.7200504413619195]
[null,"ZN847:PA44","HORNSBY","URBAN",968,3872.2708827087699,5146.1904194594099,2.6487422,97.456280925396243,2436.3296301987502,3,4722.1499999999996,1445,0.30991735537190102,0.20661157024793403,2,118050,118050,8.2644628099173598,8.2644628099173598]
[null,"ZN847:PA45","HORNSBY","SHORT RURAL",490,18111.2439155131,5453.2558977599401,2.5754305,3312.3916831445599,1229.6993856033332,6,165067.46666666662,25956.466666666602,107.75510204081628,7.9591836734693899,3,61280,61280,22.6530612244898,22.6530612244898]
[null,"ZN847:PA46","HORNSBY","URBAN",904,4242.8590517008697,2037.29510650323,2.3945314999999998,248.84637659647382,964.36324000683339,6,13337.6833333334,13337.6833333334,13.495575221238902,13.495575221238902,2,51688,51688,13.0530973451327,13.0530973451327]
[null,"ZN847:PA47","HORNSBY","SHORT RURAL",1066,12342.4763375818,6743.0580553026903,3.5551413999999997,3964.4765343305148,0,4,143119.43333333341,5303.4333333333998,36.491557223264572,5.7223264540337704,0,0,0,0,0]
[null,"ZN847:PA48","HORNSBY","URBAN",520,0,2955.7864892387602,1.9051520999999998,54.671594144337497,0,1,3683,3683,5.5769230769230802,5.5769230769230802,0,0,0,0,0]
[null,"ZN847:PA5","HORNSBY","URBAN",987,34.873299305636102,6831.8906315322602,4.8795124999999997,3622.199663231494,0,10,95272.066666666695,93443.666666666701,119.65552178318171,119.554204660588,0,0,0,0,0]
[null,"ZN847:PA7","HORNSBY","URBAN",1163,2487.7172223503799,2652.86537703972,1.8137504999999998,5177.4065133599697,4.2396417937499997,12,366356.88333333295,55843.049999999901,23.473774720550338,14.359415305245099,1,300,300,0.17196904557179699,0.17196904557179699]
[null,"ZN8700:PA61 62GHJ","CITY NORTH","CBD",1849,0,11571.3593730144,9.156345700000001,3656.9296303857773,0,4,51258.283333333398,51258.283333333398,3.6776636019470001,3.6776636019470001,0,0,0,0,0]
[null,"ZN8700:PA61 62KLM","CITY NORTH","CBD",209,0,1245.78464098636,7.0741029999999991,0,711.31137305020832,0,0,0,0,0,3,12905,12905,26.315789473684198,26.315789473684198]
[null,"ZN8700:PA63 64ABC","CITY NORTH","CBD",243,0,3674.37981061045,1.3424609999999999,0,139.32731488499999,0,0,0,0,0,1,13320,13320,15.226337448559699,15.226337448559699]
[null,"ZN8700:PA63 64DEF","CITY NORTH","CBD",877,0,7451.4116863056197,11.2471573,0,2699.1302993783333,0,0,0,0,0,1,30800,30800,6.3854047890535908,6.3854047890535908]
[null,"ZN8700:PA65 66ABC","CITY NORTH","CBD",747,0,5035.70518997415,12.069771699999999,0,48767.268832692665,0,0,0,0,0,3,518560,518560,27.576974564926399,27.576974564926399]
[null,"ZN8700:PA65 66DEF","CITY NORTH","CBD",344,0,2301.3389403147198,5.8516065999999993,492.41269539000001,1474.5024600844999,1,10800,10800,3.4883720930232598,3.4883720930232598,2,32340,32340,3.4883720930232598,3.4883720930232598]
[null,"ZN8700:PA65 66KLM","CITY NORTH","URBAN",293,0,4360,5.4241136999999995,102.08952282880172,0,1,2415.5833333332998,2415.5833333332998,0.34129692832764502,0.34129692832764502,0,0,0,0,0]
[null,"ZN874:PA11","CONCORD","URBAN",125,0,3624.5896463509398,2.3402617999999999,219.31045778414671,0,1,12027.2,12027.2,38.4,38.4,0,0,0,0,0]
[null,"ZN874:PA15","CONCORD","URBAN",537,0,2989.9627634726198,4.1901921,0,6528.0835934943752,0,0,0,0,0,2,199950,199950,109.86964618249499,109.86964618249499]
[null,"ZN874:PA16","CONCORD","URBAN",78,0,2137.9419818732899,1.14252,0.49481033708303657,0,1,55.583333333299997,55.583333333299997,1.2820512820512799,1.2820512820512799,0,0,0,0,0]
[null,"ZN874:PA17","CONCORD","URBAN",854,0,5251.5787825355601,3.0838518999999995,472.19784815266701,126.86966716599999,4,19651.7,19651.7,12.763466042154601,12.763466042154601,1,5280,5280,1.28805620608899,1.28805620608899]
[null,"ZN874:PA18","CONCORD","URBAN",1995,0,13159.9982062573,5.1337232000000004,0,1296.0084218400002,0,0,0,0,0,1,32400,32400,5.4135338345864703,5.4135338345864703]
[null,"ZN874:PA2","CONCORD","URBAN",220,0,2753.50519923305,3.7912621999999998,34.361220321853331,0,2,1163.2,1163.2,0.90909090909090906,0.90909090909090906,0,0,0,0,0]
[null,"ZN874:PA22","CONCORD","URBAN",1511,0,8178.8269306049997,5.4241136999999995,314.73171139038749,0,2,7447,7447,5.8239576439444001,5.8239576439444001,0,0,0,0,0]
[null,"ZN874:PA25","CONCORD","URBAN",366,0,4763.5369024274696,1.1967896999999998,0,24.617964128999997,0,0,0,0,0,1,2640,2640,4.3715846994535497,4.3715846994535497]
[null,"ZN874:PA3","CONCORD","URBAN",877,0,5752.8093898909501,1.7052110999999999,815.93224393082221,705.5762096686874,3,61410.916666666701,61410.916666666701,114.02508551881401,114.02508551881401,4,53105,52885,12.770809578107215,12.656784492588399]
[null,"ZN874:PA4","CONCORD","URBAN",1696,0,7611.7194005203401,4.6072119000000002,904.54289319075122,19.743822663125002,4,25197.683333333302,22869.683333333302,5.12971698113207,4.0683962264150901,1,550,550,5.8962264150943404E-2,5.8962264150943404E-2]
[null,"ZN874:PA7","CONCORD","URBAN",899,1.20217526971843,5397.9468966703598,2.7030118999999999,1296.5296706525476,0,4,61560.783333333304,2560.5500000000002,5.6729699666295819,0.222469410456062,0,0,0,0,0]
[null,"ZN874:PA8","CONCORD","URBAN",412,0,4020.0824876987899,3.4466019999999999,16.1249489982625,0,1,600.45000000000005,600.45000000000005,0.24271844660194197,0.24271844660194197,0,0,0,0,0]
[null,"ZN874:PA9","CONCORD","URBAN",370,0,3389.5981843140098,1.6328514999999999,12.768436088741664,2025.9523343674998,2,1003.5999999999999,237.3,0.54054054054054002,0.27027027027027001,4,159240,159240,80.540540540540491,80.540540540540491]
[null,"ZN901:PA1","SURRY HILLS","URBAN",525,0,2688.4827493494099,1.0701604,1.9617318379147224,0,1,235.26666666669999,235.26666666669999,0.19047619047618999,0.19047619047618999,0,0,0,0,0]
[null,"ZN901:PA10","SURRY HILLS","URBAN",232,0,2882.1413964797898,3.0657619999999999,610.98782299790196,0,1,25577.833333333299,25577.833333333299,35.775862068965502,35.775862068965502,0,0,0,0,0]
[null,"ZN901:PA11","SURRY HILLS","URBAN",2476,0,2677.24293466788,3.2837928999999995,34.005365264596449,0,2,1329.05,1329.05,8.0775444264943402E-2,8.0775444264943402E-2,0,0,0,0,0]
[null,"ZN901:PA12","SURRY HILLS","URBAN",568,0,2056.50348529848,2.3221718999999998,11651.366886080625,0,1,643950,0,23.767605633802798,0,0,0,0,0,0]
[null,"ZN901:PA13","SURRY HILLS","URBAN",1705,0,2426.9158208510098,2.7934614,63.315391412171252,0,2,2908.95,2908.95,1.70087976539589,1.70087976539589,0,0,0,0,0]
[null,"ZN901:PA14","SURRY HILLS","URBAN",1467,0,5105.6741106912104,3.0295821999999997,1139.161828915763,0,3,48258.333333333299,48258.333333333299,74.573960463530995,74.573960463530995,0,0,0,0,0]
[null,"ZN901:PA18","SURRY HILLS","URBAN",1493,0,2429.5389388705698,4.0092930999999998,1158.3808409232149,0,3,37081.15,36766.183333333298,7.8365706630944461,7.7695914266577404,0,0,0,0,0]
[null,"ZN901:PA19","SURRY HILLS","URBAN",721,0,3118.67412035708,2.2126803999999995,0,9.5684598047499989,0,0,0,0,0,1,555,555,0.13869625520111001,0.13869625520111001]
[null,"ZN901:PA2","SURRY HILLS","URBAN",151,0,3362.9642562401,4.2263719000000002,43.468234991500012,0,1,1320,1320,3.9735099337748299,3.9735099337748299,0,0,0,0,0]
[null,"ZN901:PA20","SURRY HILLS","URBAN",1274,0,4141.5371190641599,3.6646329,898.16532281569368,90.800441679750008,4,31455.416666666701,2970,10.832025117739411,2.5902668759811598,1,3180,3180,0.47095761381475698,0.47095761381475698]
[null,"ZN901:PA32","SURRY HILLS","URBAN",670,0,1956.0308053843301,2.0317813999999998,213.24861794744294,236.83121258866669,3,13470.35,13470.35,27.313432835820901,27.313432835820901,1,14960,14960,6.5671641791044806,6.5671641791044806]
[null,"ZN901:PA33","SURRY HILLS","URBAN",861,0,4079.0778034520199,3.2285710999999999,0,38.488603225874996,0,0,0,0,0,1,1530,1530,5.92334494773519,5.92334494773519]
[null,"ZN901:PA8","SURRY HILLS","URBAN",700,0,3804.1847471894998,4.7528831999999994,3363.2769297365348,26.4044445808,3,90818.666666666701,90818.666666666701,123.71428571428599,123.71428571428599,1,713,713,0.14285714285714302,0.14285714285714302]
[null,"ZN9035:PA1","CARINGBAH","URBAN",458,0,4976.5115063859303,3.6827227999999996,3000.3483789373827,0,10,104561.6166666667,29297.616666666701,404.366812227075,302.62008733624504,0,0,0,0,0]
[null,"ZN9035:PA10","CARINGBAH","URBAN",532,0,1434.973720035,2.5392506999999997,2094.5978546300498,0,3,105868,21812,300,200,0,0,0,0,0]
[null,"ZN9035:PA11","CARINGBAH","URBAN",1955,3.2973839998922001,6538.8577702514003,4.3720431999999994,22681.6279437499,0,13,665823.94999999995,348479.01666666701,505.57544757033304,405.52429667519203,0,0,0,0,0]
[null,"ZN9035:PA2","CARINGBAH","URBAN",676,304.36206629145698,4851.6031649287897,2.5754305,4036.6367282731871,27.692316451250001,5,201159,93516,500.29585798816606,400.14792899408303,1,1380,1380,0.59171597633136097,0.59171597633136097]
[null,"ZN9035:PA4","CARINGBAH","URBAN",1889,2524.9465423841498,6855.8798156745397,6.693263,21904.521079590519,1478.4999638062502,9,420015.68333333358,77492.866666666596,302.27633668607695,199.47061937533098,1,28350,28350,3.3350979354155594,3.3350979354155594]
[null,"ZN9035:PA5","CARINGBAH","URBAN",328,0,2697.1371685403401,0.90735129999999986,475.33658294077082,0,4,67235,15083,399.69512195122002,299.69512195122002,0,0,0,0,0]
[null,"ZN9035:PA7","CARINGBAH","URBAN",1117,0,3514.5849385133602,1.3243711,3143.6568667011152,0,6,304645.71666666667,27524.7166666667,251.56669650850532,151.656222023277,0,0,0,0,0]
[null,"ZN9035:PA8","CARINGBAH","URBAN",115,0,2622.5337167893199,2.9391327,994.51053531926254,0,5,43427,25415,489.56521739130477,390.43478260869603,0,0,0,0,0]
[null,"ZN9037:PA10","MIRANDA","URBAN",1460,1160.6680724343501,4410.6173596859098,3.1381215999999998,7359.4571176632735,0,13,300985.55,71346.8,306.301369863015,205.61643835616499,0,0,0,0,0]
[null,"ZN9037:PA14","MIRANDA","URBAN",452,0,2633.92158351337,3.5008716999999998,2416.5793831615329,0,3,88592,18984,300,200,0,0,0,0,0]
[null,"ZN9037:PA15","MIRANDA","URBAN",414,0,2201.59428217403,2.2679022,1518.3758312398502,0,5,85926,22170,400.24154589372006,300.24154589372,0,0,0,0,0]
[null,"ZN9037:PA16","MIRANDA","URBAN",1269,1602.0786693427799,2716.6069929872001,3.5189615999999999,8259.5393286773015,0,11,301238.81666666659,55486.0666666666,311.50512214342001,201.26083530338801,0,0,0,0,0]
[null,"ZN9037:PA17","MIRANDA","URBAN",35,235.642782933343,2322.5966116802902,3.3742424,183.91236029904309,0,4,6995.2666666667001,1605.2666666667001,305.71428571428601,205.71428571428601,0,0,0,0,0]
[null,"ZN9037:PA2","MIRANDA","URBAN",1044,5306.9230642093999,745.58697757225104,3.3561524999999999,18744.872838943109,0,13,716820.55,318408.55,811.11111111111109,610.82375478927202,0,0,0,0,0]
[null,"ZN9037:PA3","MIRANDA","URBAN",115,0,2048.1966425645101,1.5604918999999999,277.50103918757918,96.297955149000003,3,22823,5075,301.739130434782,200.869565217391,1,7920,7920,38.260869565217398,38.260869565217398]
[null,"ZN9037:PA4","MIRANDA","URBAN",352,1162.24250098177,2289.14870328704,3.0114922999999996,1628.4862945441748,0,3,69402,15546,300.56818181818198,200.56818181818201,0,0,0,0,0]
[null,"ZN9037:PA7","MIRANDA","URBAN",653,1856.2236673508901,3323.7498502870599,2.6668321000000001,2775.0104292153019,603.11241326531263,6,133548.36666666661,35169.366666666603,302.75650842266504,204.287901990812,3,29025,29025,10.566615620214399,10.566615620214399]
[null,"ZN9037:PA8","MIRANDA","URBAN",1655,3945.0968178622602,4226.9444330124898,4.7709731,28771.564014094452,0,13,773973.58333333302,451880.53333333298,409.60725075528597,307.00906344410799,0,0,0,0,0]
[null,"ZN9037:PA9","MIRANDA","URBAN",825,2907.7914787182799,2055.2564565037001,2.7211018,11575.857217355277,0,14,545981.60000000009,138528.38333333301,610.54545454545405,410.18181818181796,0,0,0,0,0]
[null,"ZN9118:PA11","CRONULLA","SHORT RURAL",1914,3720.2447142300998,6479.0287461790504,4.0454728999999992,40255.885963778142,0,8,1277114.1833333299,10174.200000000001,188.08777429467028,4.59770114942528,0,0,0,0,0]
[null,"ZN9118:PA12","CRONULLA","URBAN",1260,3.5084641899653599,3607.64989501952,4.0092930999999998,22547.31186988638,0.31239075404166672,15,721766.3,162783.46666666699,238.968253968254,129.12698412698401,1,10,10,7.9365079365079402E-2,7.9365079365079402E-2]
[null,"ZN9118:PA13","CRONULLA","URBAN",1155,0,4238.6070211190899,3.0114922999999996,9391.6462611053757,0,5,400248.40000000037,5026.0333333334002,103.030303030303,3.8095238095238098,0,0,0,0,0]
[null,"ZN9118:PA15","CRONULLA","URBAN",1904,1043.8158501010901,6852.9482277624102,3.4646918999999996,25178.320479928414,2362.935755637875,8,932678.08333333302,277178.08333333302,223.00420168067259,123.21428571428601,2,87530,87530,14.023109243697501,14.023109243697501]
[null,"ZN9118:PA16","CRONULLA","URBAN",1339,0,2391.6148540348499,2.6487422,9498.2802685842526,0,1,460230,0,99.62658700522779,0,0,0,0,0,0]
[null,"ZN9118:PA17","CRONULLA","URBAN",1030,6.54920590602398,8406.8814079961594,3.2837928999999995,10050.996723674518,0,3,392828.51666666672,40230.516666666699,105.0485436893204,5.82524271844661,0,0,0,0,0]
[null,"ZN9118:PA2","CRONULLA","URBAN",809,3.4746954467758302,3308.5679535597201,1.8499303,4068.2855063891725,0,4,282244.63333333301,2017,104.94437577255873,6.7985166872682399,0,0,0,0,0]
[null,"ZN9118:PA20","CRONULLA","URBAN",2028,0,5109.8466393380704,4.3720431999999994,24662.37230877412,0,5,723969.11666666693,6263.35,102.16962524654835,2.3175542406311598,0,0,0,0,0]
[null,"ZN9118:PA21","CRONULLA","URBAN",1326,3.2970852635179702,6104.7459862246697,3.7912621999999998,14316.26184800261,0,11,484635.75000000017,14202.6833333332,106.48567119155314,6.2594268476621497,0,0,0,0,0]
[null,"ZN9118:PA22","CRONULLA","URBAN",1442,614.03295411728197,6160.2730287799604,3.9359814000000002,15796.192806271087,0,5,515073.28333333362,5294.0166666666,103.32871012482659,3.5367545076282898,0,0,0,0,0]
[null,"ZN9118:PA24","CRONULLA","URBAN",1331,0,3012.2941586601501,3.0114922999999996,11707.71409348747,524.78453038068733,6,498953.4,24360.400000000001,114.1998497370399,13.298271975957901,1,22365,22365,5.3343350864012002,5.3343350864012002]
[null,"ZN9118:PA26","CRONULLA","URBAN",1614,6.0980577022573996,10764.8993166897,6.3857346999999995,31389.975670121552,1186.669061469375,17,630884.33333333337,25206.083333333401,122.92441140024771,20.755885997521702,1,23850,23850,3.2837670384138802,3.2837670384138802]
[null,"ZN9118:PA3","CRONULLA","SHORT RURAL",825,3397.6462234435398,5687.4513728172296,2.1945904999999999,7412.4200306991688,481.18042655375001,10,433487.08333333401,129385.316666667,272.24242424242402,166.42424242424201,1,28140,28140,10.181818181818199,10.181818181818199]
[null,"ZN9118:PA6","CRONULLA","URBAN",1740,0,4233.8068933043696,4.1359224000000001,19617.977907663688,0,5,608767.55000000005,7608.55,99.137931034482762,1.26436781609196,0,0,0,0,0]
[null,"ZN9118:PA7","CRONULLA","URBAN",976,0,7853.1582690873001,3.9540712999999994,11017.475333634364,1.2323522218333332,2,357608,10608,107.68442622950809,6.9672131147541005,1,40,40,0.204918032786885,0.204918032786885]
[null,"ZN9118:PA8","CRONULLA","URBAN",1232,6.5973348087314303,7456.49636708447,4.2625517000000004,14749.957057106256,0,11,444110.1833333337,6233.0166666667001,109.49675324675323,9.9837662337662412,0,0,0,0,0]
[null,"ZN9171:PA1","LUCAS HEIGHTS","HV CUSTOMERS",5,0,2869.8479382649398,4.6624337000000002,79.050009238933342,0,3,2176,132,240.00000000000003,80,0,0,0,0,0]
[null,"ZN9245:PA33","ENGADINE","URBAN",960,99.268682614631302,3706.7072627114899,5.0613636,15903.306448172418,141.97124897999998,8,403264.066666667,258304.066666667,406.66666666666697,306.66666666666697,1,3600,3600,3.75,3.75]
[null,"ZN9245:PA34","ENGADINE","URBAN",1631,4221.79066757484,11029.8799311005,5.4060237999999998,52108.107015725487,2067.344591477,11,1237077.7,653042.69999999995,505.82464745554699,305.70202329858904,4,49080,49080,9.31943592887799,9.31943592887799]
[null,"ZN9245:PA38","ENGADINE","SHORT RURAL",1182,12846.5759062013,7368.7776446175903,3.5189615999999999,16809.884642052042,752.91409146799992,12,613083.80000000005,228457.8,424.28087986463703,224.027072758038,6,27460,27460,6.4297800338409496,6.4297800338409496]
[null,"ZN9245:PA40","ENGADINE","URBAN",1792,6556.7974502412198,3393.3652100290801,5.0613636,44228.67455471935,1242.2484285749999,9,1121517.416666666,435154.48333333299,501.33928571428504,302.17633928571399,1,31500,31500,5.859375,5.859375]
[null,"ZN9245:PA41","ENGADINE","URBAN",1035,42.450653071849302,5014.4026179389402,2.6668321000000001,8385.6580244697179,59.220340320625013,14,403562.78333333402,245963.11666666699,424.92753623188503,324.057971014494,1,2850,2850,1.83574879227053,1.83574879227053]
[null,"ZN9245:PA42","ENGADINE","URBAN",389,1085.67859970427,979.65917844432101,1.2158316999999998,1149.7621895902998,0,3,121368,62629,300,200,0,0,0,0,0]
[null,"ZN9245:PA43","ENGADINE","URBAN",1204,1768.19413431569,3214.2158006801301,3.5189615999999999,14767.065936954346,0,12,538578.88333333295,352081.05,407.14285714285705,303.23920265780703,0,0,0,0,0]
[null,"ZN9245:PA44","ENGADINE","URBAN",1080,3798.9072786727702,3040.12136692693,3.2647508999999997,16058.222852861321,402.17242055512503,14,631272.78333333298,466710.78333333298,463.24074074074099,362.68518518518505,1,15810,15810,2.8703703703703698,2.8703703703703698]
[null,"ZN9245:PA45","ENGADINE","URBAN",942,3631.1711326715299,3608.4884113613498,3.3742424,13852.816575520015,0,10,526903.93333333405,384509.566666667,421.44373673036102,321.33757961783397,0,0,0,0,0]
[null,"ZN9252:PA21","JANNALI","URBAN",865,2498.9184879951599,2358.5044265666702,4.8614226,15902.515594368504,981.81290829600016,13,419828.66666666628,77916.633333333302,359.306358381503,142.42774566474,2,25920,25920,9.017341040462421,9.017341040462421]
[null,"ZN9252:PA22","JANNALI","SHORT RURAL",1542,6140.1563119051098,3064.5403772464001,5.5145631999999996,21215.806341263102,0,9,493762.4500000003,92505.883333333302,309.66277561608297,110.376134889754,0,0,0,0,0]
[null,"ZN9252:PA24","JANNALI","SHORT RURAL",1952,6025.0229375790605,4881.74198214027,5.6050126999999996,38962.508900036592,1780.5233656113749,16,892154.25,230747.86666666699,322.64344262295094,120.338114754099,3,40770,40770,5.8913934426229497,5.8913934426229497]
[null,"ZN9252:PA25","JANNALI","URBAN",870,5170.3395731083501,5699.9865791722495,3.3923323000000001,16715.773344040361,473.66005127466667,12,632408.53333333298,405338.53333333298,651.37931034482801,451.37931034482801,3,17920,17920,10.5747126436782,10.5747126436782]
[null,"ZN9252:PA27","JANNALI","URBAN",1718,5262.14472577581,3971.80410755206,5.4602934999999997,29079.411450407551,0,21,683501.16666666605,160009.33333333299,323.86495925494802,121.30384167636801,0,0,0,0,0]
[null,"ZN9252:PA28","JANNALI","URBAN",1697,2914.4452592771599,8384.34280474568,5.7145041999999995,38589.653383270204,12.021888210749999,19,866686.35000000068,94110.616666666698,320.80141426045998,109.25162050677699,1,270,270,5.8927519151443702E-2,5.8927519151443702E-2]
[null,"ZN9252:PA30","JANNALI","URBAN",1332,2552.7795139214099,3723.1011373910701,3.0476720999999998,11977.207052075375,620.85080746631252,10,504378.94999999972,88339.266666666706,316.51651651651605,111.936936936937,2,26145,26145,6.2312312312312299,6.2312312312312299]
[null,"ZN9252:PA31","JANNALI","URBAN",1402,4479.7882514951098,2823.51858804106,5.8592233999999994,26874.658399739394,0,11,588670.85,79851.899999999994,355.27817403709003,147.28958630527799,0,0,0,0,0]
[null,"ZN931:PA10","DARLINGHURST","URBAN",1811,0,2670.4399301311801,3.9912031999999997,2277.1498322016901,13.900861845200001,4,73224.666666666701,73224.666666666701,14.964108227498599,14.964108227498599,1,447,447,8.2274986195472106,8.2274986195472106]
[null,"ZN931:PA11","DARLINGHURST","URBAN",1290,0,1774.64366002562,2.3583516999999996,8396.1201597158415,0,12,456919.51666666666,454247.55,151.62790697674399,151.55038759689901,0,0,0,0,0]
[null,"ZN931:PA13","DARLINGHURST","URBAN",499,0,2864.4209967904899,3.0657619999999999,871.37874852618336,0,2,36478.6,36478.6,100.40080160320599,100.40080160320599,0,0,0,0,0]
[null,"ZN931:PA18","DARLINGHURST","URBAN",566,0,2589.56782717844,3.7731722999999997,2.3813433678374998,107.60144106524999,1,81,81,0.17667844522968199,0.17667844522968199,2,3660,3660,9.8939929328621901,9.8939929328621901]
[null,"ZN931:PA2","DARLINGHURST","URBAN",2518,0,4000.3364492641299,2.8839108999999996,256.85997033780416,0,1,11431,11431,6.3939634630659299,6.3939634630659299,0,0,0,0,0]
[null,"ZN931:PA22","DARLINGHURST","URBAN",526,0,2164.5523483114798,3.0476720999999998,3.0632914195125007,0,1,129,129,0.19011406844106502,0.19011406844106502,0,0,0,0,0]
[null,"ZN931:PA23","DARLINGHURST","URBAN",502,0,1580.1700259649799,1.2701013999999999,0,6.5314964494999996,0,0,0,0,0,1,660,660,0.39840637450199201,0.39840637450199201]
[null,"ZN931:PA24","DARLINGHURST","URBAN",315,0,4850.3838766395602,1.9232419999999999,299.63028536374998,13.187029313333333,1,19995,19995,49.206349206349195,49.206349206349195,1,880,880,0.634920634920635,0.634920634920635]
[null,"ZN931:PA25","DARLINGHURST","URBAN",1456,0,3064.6412270793398,3.4827817999999997,5676.1430024402671,1124.1367560064582,4,209168.7,209168.7,32.142857142857203,32.142857142857203,2,41425,41425,10.096153846153801,10.096153846153801]
[null,"ZN931:PA3","DARLINGHURST","URBAN",502,0,1728.68704349519,3.3380625999999998,6.0011596698830223,0,1,230.73333333330001,230.73333333330001,0.19920318725099601,0.19920318725099601,0,0,0,0,0]
[null,"ZN931:PA8","DARLINGHURST","URBAN",183,0,249.92689394124699,0.99780079999999993,1.0372520420474813,0,1,133.4166666667,133.4166666667,0.54644808743169404,0.54644808743169404,0,0,0,0,0]
[null,"ZN931:PA9","DARLINGHURST","URBAN",1539,0,3034.2745478125198,2.8658209999999995,6697.3240379762665,852.58580741308322,6,299931.36666666699,299931.36666666699,127.74528914879799,127.74528914879799,2,38182,38182,10.5912930474334,10.5912930474334]
[null,"ZN9534:PA10","KURNELL SOUTH","SHORT RURAL",2,136.76123051254399,1077.91031745548,1.8089899999999999E-2,0.21796580809666669,0,2,1546.4,1546.4,150,150,0,0,0,0,0]
[null,"ZN9534:PA11","KURNELL SOUTH","SHORT RURAL",248,1037.43650620991,1313.67941592938,0.58078099999999999,1839.712599152213,21.178179165000003,3,406543.68333333329,403418,100.40322580645163,99.596774193548399,1,4680,4680,20.9677419354839,20.9677419354839]
[null,"ZN9534:PA15","KURNELL SOUTH","URBAN",59,0,3037.9009564406801,0.45319959999999998,292.6055987657366,0,2,82863.399999999994,82863.399999999994,96.610169491525397,96.610169491525397,0,0,0,0,0]
[null,"ZN9534:PA17","KURNELL SOUTH","URBAN",683,4303.7062530973799,878.17256695521201,2.2498122999999999,31654.234397490109,3451.9657553205006,8,1805739.7666666633,1803395.7833333299,102.7818448023428,102.63543191800899,10,196920,173520,72.913616398243093,64.128843338213798]
[null,"ZN9534:PA18","KURNELL SOUTH","SHORT RURAL",25,5885.3564468265404,1134.1551424921199,2.1403208,196.7679848871,22.513499415000002,6,11799,10004,188,168,1,1350,1350,20,20]
[null,"ZN9550:PA1","GWAWLEY BAY","URBAN",828,1.64755604452296,3996.68869216031,2.2126803999999995,1855.7527817737239,8.6202340583333328E-2,5,107639.35,58283.199999999997,208.212560386474,200.72463768116,1,5,5,0.120772946859903,0.120772946859903]
[null,"ZN9550:PA11","GWAWLEY BAY","URBAN",458,0,5805.0621887131401,5.2241726999999996,111.2983582639697,559.49039389168752,3,2734.2666666667001,2734.2666666667001,100.87336244541501,100.87336244541501,4,13745,13415,5.6768558951965025,5.4585152838427904]
[null,"ZN9550:PA27","GWAWLEY BAY","URBAN",153,0,5341.4992074175198,2.9391327,41.966755278958132,0,4,1832.55,1832.55,9.1503267973856204,9.1503267973856204,0,0,0,0,0]
[null,"ZN9550:PA28","GWAWLEY BAY","URBAN",705,1.64880838853002,4249.3853723195398,3.4285120999999998,986.15414941466042,0,7,36915.5,23122.2833333333,22.127659574468101,19.5744680851064,0,0,0,0,0]
[null,"ZN9550:PA3","GWAWLEY BAY","URBAN",1286,1098.0333951216101,2386.7243022391699,3.6465429999999999,4061.2048688835621,2966.2804033500001,8,142936.5166666666,93161.516666666605,222.6283048211512,218.35147744945601,2,104400,104400,22.550544323483702,22.550544323483702]
[null,"ZN9550:PA33","GWAWLEY BAY","URBAN",485,3.3763281793806201,5349.5575153177697,3.1743014000000001,1444.6944921502143,0,3,58411.383333333302,58411.383333333302,106.39175257732001,106.39175257732001,0,0,0,0,0]
[null,"ZN9550:PA36","GWAWLEY BAY","URBAN",771,2981.4123769176499,1026.08890548728,3.1923913000000002,522.92712958672087,0,2,21023,11223,4.7989623865110298,3.7613488975356697,0,0,0,0,0]
[null,"ZN9550:PA4","GWAWLEY BAY","URBAN",456,582.98769124931505,1432.33930083001,1.0158906999999999,802.21309469077482,3.3245023157499998,9,101347.3499999999,15777.333333333299,153.5087719298248,135.96491228070201,1,420,420,0.21929824561403499,0.21929824561403499]
[null,"ZN9550:PA41","GWAWLEY BAY","URBAN",47,0,3268.3708325346302,2.1403208,26.022269990493335,0,2,1560.4,1560.4,97.872340425531902,97.872340425531902,0,0,0,0,0]
[null,"ZN9550:PA42","GWAWLEY BAY","URBAN",973,1105.58945728664,2536.6246835071001,2.7211018,96.333742226262359,0,3,4543.6333333333005,3584,6.8859198355601183,6.7831449126413101,0,0,0,0,0]
[null,"ZN9550:PA43","GWAWLEY BAY","URBAN",1047,2138.20887247669,2268.9790343095101,3.8455318999999997,146.53655139641782,276.85906914049997,5,4890.5666666667003,4890.5666666667003,7.7363896848137603,7.7363896848137603,1,9240,9240,4.2024832855778396,4.2024832855778396]
[null,"ZN9550:PA6","GWAWLEY BAY","URBAN",926,5.1260359866042897,3965.0788806136102,3.8817116999999999,2373.2094982156696,0,7,78466.166666666701,10732.166666666701,116.73866090712765,111.01511879049698,0,0,0,0,0]
[null,"ZN9550:PA9","GWAWLEY BAY","URBAN",632,6.6815663603015603,2667.3645607724302,2.2679022,4919.7083925459528,215.75971067475001,6,278409.89999999997,19010.599999999999,210.28481012658199,110.126582278481,2,12210,12210,4.7468354430379796,4.7468354430379796]
[null,"ZN965:PA11","PENNANT HILLS","URBAN",1150,3940.4968266158598,5507.5597354135498,4.1901921,1048.443853152716,1490.2444392350626,11,32113.000000000102,27618.583333333401,16.60869565217396,16.434782608695699,2,45645,45645,9.2173913043478208,9.2173913043478208]
[null,"ZN965:PA12","PENNANT HILLS","URBAN",624,1481.7831024455299,5328.9191427636897,2.2126803999999995,1331.550314522633,0,2,77234,77234,199.67948717948701,199.67948717948701,0,0,0,0,0]
[null,"ZN965:PA15","PENNANT HILLS","URBAN",1147,4681.0015407492301,4816.4346220467596,3.7369924999999995,5166.5632906967576,0,11,177439.03333333301,171889.83333333299,110.20052310374871,110.113339145597,0,0,0,0,0]
[null,"ZN965:PA2","PENNANT HILLS","SHORT RURAL",536,138.96112348631399,6050.7770205920297,2.3583516999999996,133.34419563897453,12.4034559721875,4,7256.6333333333005,1101.6500000000001,0.74626865671641696,0.55970149253731294,1,675,675,2.7985074626865702,2.7985074626865702]
[null,"ZN965:PA20","PENNANT HILLS","URBAN",967,0,8295.5690803759808,3.0476720999999998,6246.0749508311001,205.64421467425001,9,263032,112754.45,123.2678386763186,27.404343329886299,2,8660,8660,2.48190279214064,2.48190279214064]
[null,"ZN965:PA21","PENNANT HILLS","URBAN",695,2.7254340803217301,5128.5638777680097,2.2498122999999999,2055.978205794931,0,11,117284.83333333299,117284.83333333299,146.47482014388501,146.47482014388501,0,0,0,0,0]
[null,"ZN965:PA22","PENNANT HILLS","URBAN",558,5.9334264332793101,4294.8563621554304,2.1403208,1137.7330342700118,0,5,68223.05,68223.05,36.559139784946197,36.559139784946197,0,0,0,0,0]
[null,"ZN965:PA24","PENNANT HILLS","URBAN",956,0,10708.3856519767,3.1923913000000002,1327.2759316524837,556.80558416014583,6,53359.866666666698,53359.866666666698,9.2050209205020899,9.2050209205020899,2,22385,22385,5.3347280334727998,5.3347280334727998]
[null,"ZN965:PA26","PENNANT HILLS","SHORT RURAL",911,1845.00286311429,8781.6438635323702,3.0295821999999997,9682.7169955449917,148.360533822875,9,410189.11666666705,119362.15,218.22173435784896,114.160263446762,3,6285,6285,10.3183315038419,10.3183315038419]
[null,"ZN965:PA28","PENNANT HILLS","URBAN",1000,0,11292.8600128788,4.0997425999999999,4.2000809530904641,0,1,131.48333333330001,131.48333333330001,0.1,0.1,0,0,0,0,0]
[null,"ZN965:PA29","PENNANT HILLS","URBAN",751,55.743579690290503,6259.0056199526498,2.3764415999999997,1637.5412524957217,0,6,88437.150000000096,88437.150000000096,23.568575233022599,23.568575233022599,0,0,0,0,0]
[null,"ZN965:PA3","PENNANT HILLS","URBAN",1082,3.23338978879733,6292.4881354776098,3.8093520999999999,2611.2061999556681,448.77977090100001,12,87975.083333333299,84581.75,39.556377079482488,39.463955637707997,1,15120,15120,2.5878003696857701,2.5878003696857701]
[null,"ZN965:PA30","PENNANT HILLS","URBAN",146,0,5333.6659051261904,3.3923323000000001,84.582152013333342,0,1,3200,3200,21.917808219178099,21.917808219178099,0,0,0,0,0]
[null,"ZN965:PA33","PENNANT HILLS","URBAN",1285,4655.3273336636803,8023.3625901475398,4.0997425999999999,19557.966315910475,0,19,612261.19999999995,349801.65,358.132295719843,249.57198443579699,0,0,0,0,0]
[null,"ZN965:PA35","PENNANT HILLS","URBAN",949,124.23963022819601,6536.9460759794301,3.1381215999999998,6956.0119519433147,0,18,284485.53333333327,280962.05,225.81664910432048,225.50052687039002,0,0,0,0,0]
[null,"ZN965:PA37","PENNANT HILLS","URBAN",466,0,5283.6698808802403,3.6465429999999999,1164.7480733230834,376.75170640250002,1,40994,40994,95.493562231759597,95.493562231759597,2,13260,13260,7.9399141630901298,7.9399141630901298]
[null,"ZN965:PA38","PENNANT HILLS","URBAN",978,0,11245.397282923401,4.3901330999999999,3382.6385830022632,252.95672538881249,3,98888.9,98888.9,104.089979550102,104.089979550102,1,7395,7395,2.96523517382413,2.96523517382413]
[null,"ZN965:PA4","PENNANT HILLS","URBAN",1106,3767.9183142084198,8332.1696757047393,4.5710321,3247.6963756188998,2727.8262573663751,7,91186.549999999901,91046.149999999907,106.05786618444873,105.96745027124801,4,76590,75190,3.8878842676311072,3.7070524412296599]
[null,"ZN965:PA42","PENNANT HILLS","URBAN",1098,88.831817724082597,7215.6206608983903,3.8455318999999997,3461.0379952834487,0,5,115509.99999999969,5006.0666666667003,7.4681238615664896,1.63934426229509,0,0,0,0,0]
[null,"ZN965:PA43","PENNANT HILLS","SHORT RURAL",1021,2945.7654933878898,7778.0958751408498,3.8093520999999999,2547.0497876233053,302.7482581475,5,85813.566666666709,83161.633333333404,104.50538687561209,104.407443682664,1,10200,10200,2.9382957884427001,2.9382957884427001]
[null,"ZN965:PA46","PENNANT HILLS","URBAN",1079,35.601051017308599,9794.7771495071302,3.7189025999999998,4441.2083298491461,0,6,153269.58333333299,21339.1,116.8674698795184,13.160333642261399,0,0,0,0,0]
[null,"ZN965:PA47","PENNANT HILLS","URBAN",1096,36.316325358613497,6409.9191368596903,4.6072119000000002,793.57602854976528,445.85141359275002,6,22106.499999999902,22106.499999999902,16.788321167883201,16.788321167883201,1,12420,12420,1.6423357664233602,1.6423357664233602]
[null,"ZN965:PA6","PENNANT HILLS","SHORT RURAL",1074,1497.6461070236801,8382.2929362428094,2.9572225999999997,591.87925841934918,2089.4206993256671,10,25687.316666666698,22727.3,17.225325884543782,17.132216014897601,5,90680,90680,18.808193668528901,18.808193668528901]
[null,"ZN965:PA8","PENNANT HILLS","URBAN",1190,3.2983485820691598,8929.3584686938702,3.5189615999999999,1172.6604986275684,1002.834409885,9,42768.833333333401,42202.250000000102,13.781512605042037,13.529411764705902,3,36575,36575,6.7226890756302504,6.7226890756302504]
[null,"ZN9700:PA11","KIRRAWEE","URBAN",1997,2155.0006969875499,5634.6081968718199,4.0816526999999994,35588.106626862012,1346.215795579875,11,1119021.6000000034,90897.983333333395,312.46870305458197,109.313970956435,1,42330,42330,4.1562343515272904,4.1562343515272904]
[null,"ZN9700:PA12","KIRRAWEE","URBAN",996,95.262766005333901,4704.5891779878402,4.4444027999999998,28458.292559349527,38.784821768,7,821797.96666666667,43074.966666666704,312.65060240963703,102.911646586345,1,1120,1120,5.6224899598393598,5.6224899598393598]
[null,"ZN9700:PA15","KIRRAWEE","URBAN",1222,1058.7697531766901,6804.4860381661401,3.3199727000000001,16201.240160196787,360.86028266062499,14,626301.4,102393.35,408.91980360065503,209.16530278232401,1,13950,13950,2.5368248772504098,2.5368248772504098]
[null,"ZN9700:PA16","KIRRAWEE","URBAN",793,851.79806923712397,2579.6280730292801,1.8680201999999999,6383.684298320798,0,8,438590.75000000029,33488.933333333298,300.63051702395899,101.008827238335,0,0,0,0,0]
[null,"ZN9700:PA17","KIRRAWEE","URBAN",2254,4589.0456521876404,6527.5433410712003,5.6411924999999998,52256.787660308073,0,22,1188889.3166666671,211815.76666666701,417.83496007098506,215.97160603371802,0,0,0,0,0]
[null,"ZN9700:PA18","KIRRAWEE","URBAN",1303,1474.88342250541,2585.0093460561102,2.1222308999999999,13069.561033298862,0,6,790383.75,50817,310.82118188795096,100,0,0,0,0,0]
[null,"ZN9700:PA19","KIRRAWEE","URBAN",910,83.842836034832303,4677.5523769911497,2.8477310999999998,10352.847231304691,12.425600033,8,466584.66666666663,77532.666666666599,406.26373626373606,206.48351648351601,1,560,560,0.21978021978022,0.21978021978022]
[null,"ZN9700:PA20","KIRRAWEE","URBAN",1776,7959.14668522384,5911.5140175077204,5.0070939000000001,67809.692746529778,1037.7619365575001,10,1738103.666666667,228159.66666666701,627.36486486486501,308.05180180180201,3,26600,26600,3.1531531531531503,3.1531531531531503]
[null,"ZN9700:PA21","KIRRAWEE","URBAN",482,570.75910011304302,3587.6273944095401,2.9934023999999999,5337.4640879562303,364.08129765699999,6,228843.98333333299,22167,318.25726141078803,118.04979253112,2,15610,15610,13.070539419087099,13.070539419087099]
[null,"ZN9700:PA22","KIRRAWEE","URBAN",234,256.11425342536501,1194.11275911649,1.3967307,1449.7710827556002,0,5,133216,34814,497.86324786324803,300,0,0,0,0,0]
[null,"ZN9700:PA23","KIRRAWEE","URBAN",1645,3352.89961885805,3244.6572138864199,4.0273830000000004,33527.501732742254,0,19,1068434.4833333329,214368.183333333,451.30699088145894,244.25531914893602,0,0,0,0,0]
[null,"ZN9700:PA24","KIRRAWEE","URBAN",1361,2963.4791342854001,3538.6100585262502,3.7369924999999995,21851.554086656703,309.8091348916667,8,750463.78333333367,57028.366666666698,302.57163850110203,103.23291697281401,2,10640,10640,2.3512123438648,2.3512123438648]
[null,"ZN9900:PA1","MENAI","SHORT RURAL",1233,1797.2920241214999,15777.4518899371,5.5688329000000003,4598.0034103219341,488.57691378741669,9,105968,105457,112.24655312246507,112.08434712084301,2,11260,11260,2.1086780210867797,2.1086780210867797]
[null,"ZN9900:PA12","MENAI","SHORT RURAL",804,865.72634486834397,7330.3909208933401,3.0657619999999999,541.62280745650003,535.67484595625001,1,22674,22674,3.23383084577114,3.23383084577114,1,22425,22425,8.0845771144278604,8.0845771144278604]
[null,"ZN9900:PA13","MENAI","URBAN",829,0,5374.3047818974701,2.9753124999999998,80.03421197482561,177.4631339192708,1,3452.3333333332998,3452.3333333332998,2.5331724969843199,2.5331724969843199,4,7655,7655,8.3232810615199,8.3232810615199]
[null,"ZN9900:PA14","MENAI","URBAN",52,0,1695.87878474688,1.9051520999999998,0,418.23843741968744,0,0,0,0,0,2,28175,28175,67.307692307692307,67.307692307692307]
[null,"ZN9900:PA16","MENAI","URBAN",81,165.77683043647701,1207.8976273134001,0.48937939999999996,0,1.1439243475,0,0,0,0,0,1,300,300,1.2345679012345698,1.2345679012345698]
[null,"ZN9900:PA17","MENAI","SHORT RURAL",823,747.16847191583497,9350.4420694923992,4.0092930999999998,136.98803150857833,0,4,4385.1499999998996,4385.1499999998996,0.48602673147023101,0.48602673147023101,0,0,0,0,0]
[null,"ZN9900:PA19","MENAI","SHORT RURAL",703,1761.2908308599499,6548.2720417139899,2.8477310999999998,1831.9317297224029,1081.0272028710001,5,82561.950000000099,82561.950000000099,107.254623044097,107.254623044097,2,48720,48720,14.651493598862,14.651493598862]
[null,"ZN9900:PA2","MENAI","URBAN",658,0,5948.1564456265096,2.5944724999999997,194.06620607891773,0,2,9599.9833333333008,9599.9833333333008,9.7264437689969601,9.7264437689969601,0,0,0,0,0]
[null,"ZN9900:PA20","MENAI","URBAN",717,0,3244.7086156506698,2.2307702999999997,38.637445068464118,27.984083925874994,1,2222.9166666667002,2222.9166666667002,3.48675034867503,3.48675034867503,2,1610,1610,0.27894002789400302,0.27894002789400302]
[null,"ZN9900:PA21","MENAI","URBAN",787,0,5849.5130034788199,2.2307702999999997,402.07653454627308,406.72519494749997,4,23132.55,23132.55,19.313850063532399,19.313850063532399,1,23400,23400,9.9110546378653108,9.9110546378653108]
[null,"ZN9900:PA5","MENAI","URBAN",463,0,3821.54360705626,1.6690312999999999,493.9436876583195,273.87551859524996,6,37982.416666666701,37982.416666666701,36.933045356371501,36.933045356371501,2,21060,21060,10.3671706263499,10.3671706263499]
[null,"ZN9900:PA6","MENAI","URBAN",718,219.556606160896,6390.9153830124696,2.8839108999999996,647.21664286941291,45.839763755500002,5,28802.983333333301,28802.983333333301,15.320334261838401,15.320334261838401,2,2040,2040,0.97493036211699202,0.97493036211699202]
[null,"ZN9900:PA8","MENAI","URBAN",1251,983.61240003227897,11299.620947122099,5.2965322999999991,6498.9179373502284,699.25878731059993,11,157477.69999999972,156397.63333333301,105.03597122302122,104.79616306954401,3,16944,16944,3.9968025579536404,3.9968025579536404]
[null,"ZN9900:PA9","MENAI","URBAN",338,0,2751.5230891375099,1.9775116999999998,31.799518338867944,13.636179116312499,3,2063.8166666667003,1823.8166666667,0.88757396449704107,0.59171597633136097,1,885,885,0.88757396449704096,0.88757396449704096]

{"sheet":"3.6.9 Network-reliability","index":7,"n_rows":24,"n_cols":7,"rows_kept":24,"cut":false,"hidden":false,"merged":[]}
[null,{"$f":"(LOOKUP(dms_Model,dms_Model_List,dms_Worksheet_List))","v":"REGULATORY REPORTING STATEMENT"},null,null,null,null,{"$f":"CONCATENATE(\"1-Jan-\",LEFT(CRY,4))","v":"1-Jan-2015"}]
[null,{"$f":"dms_TradingName","v":"Ausgrid"}]
[null,{"$f":"CONCATENATE(\"Annual Reporting RIN Response \",CRY)","v":"Annual Reporting RIN Response 2015-16"}]
[null,"3.6 QUALITY OF SERVICES"]
[]
[]
[null,"3.6.9 - NETWORK FEEDER RELIABILITY - PLANNED OUTAGES"]
[]
[]
[null,"3.6.9.1 - PLANNED MINUTES OFF SUPPLY (SAIDI)"]
[null,null,{"$f":"CRY","v":"2015-16"}]
[null,{"$f":"INDEX(dms_FeederName_1,MATCH(dms_TradingName,dms_TradingName_List))","v":"CBD"},46.026572162959503]
[null,{"$f":"INDEX(dms_FeederName_2,MATCH(dms_TradingName,dms_TradingName_List))","v":"Urban"},19.611716966751299]
[null,{"$f":"INDEX(dms_FeederName_3,MATCH(dms_TradingName,dms_TradingName_List))","v":"Short rural"},83.106765902443996]
[null,{"$f":"INDEX(dms_FeederName_4,MATCH(dms_TradingName,dms_TradingName_List))","v":"Long rural"},1999.3247954440001]
[null,{"$f":"IF((INDEX(dms_FeederName_5,MATCH(dms_TradingName,dms_TradingName_List))=0),\"\",(INDEX(dms_FeederName_5,MATCH(dms_TradingName,dms_TradingName_List))))","v":""}]
[]
[null,"3.6.9.2 - PLANNED INTERRUPTIONS TO SUPPLY (SAIFI)"]
[null,null,{"$f":"CRY","v":"2015-16"}]
[null,{"$f":"INDEX(dms_FeederName_1,MATCH(dms_TradingName,dms_TradingName_List))","v":"CBD"},9.1580457975683291]
[null,{"$f":"INDEX(dms_FeederName_2,MATCH(dms_TradingName,dms_TradingName_List))","v":"Urban"},4.8714941492292301]
[null,{"$f":"INDEX(dms_FeederName_3,MATCH(dms_TradingName,dms_TradingName_List))","v":"Short rural"},25.444806724709402]
[null,{"$f":"INDEX(dms_FeederName_4,MATCH(dms_TradingName,dms_TradingName_List))","v":"Long rural"},289.742739560968]
[null,{"$f":"IF((INDEX(dms_FeederName_5,MATCH(dms_TradingName,dms_TradingName_List))=0),\"\",(INDEX(dms_FeederName_5,MATCH(dms_TradingName,dms_TradingName_List))))","v":""}]

{"sheet":"4.1 Public lighting","index":8,"n_rows":23,"n_cols":4,"rows_kept":23,"cut":false,"hidden":false,"merged":[[9,1,10,1],[5,1,5,2]]}
[null,{"$f":"(LOOKUP(dms_Model,dms_Model_List,dms_Worksheet_List))","v":"REGULATORY REPORTING STATEMENT"}]
[null,{"$f":"dms_TradingName","v":"Ausgrid"}]
[null,{"$f":"CONCATENATE(\"Annual Reporting RIN Response \",CRY)","v":"Annual Reporting RIN Response 2015-16"}]
[null,"4.1 PUBLIC LIGHTING"]
[]
[null,"Tables 4.1.1 - 4.1.3 deliberately omitted."]
[]
[null,"4.1.4 - PUBLIC LIGHTING METRICS BY TARIFF"]
[]
[null,"Tariff categories","Number of Lights","Public Lighting Revenue"]
[null,"<insert tariff category>","0's","$0's, nominal"]
[]
[]
[]
[]
[]
[]
[]
[]
[]
[]
[null,"To enter further tariff categories - please insert new lines above this line. "]
[null,"Total ",{"$f":"SUM(C12:C21)","v":0},{"$f":"SUM(D12:D21)","v":0}]

{"sheet":"6.2 STPIS Reliability","index":9,"n_rows":98,"n_cols":8,"rows_kept":98,"cut":false,"hidden":false,"merged":[[80,1,85,1],[86,1,91,1],[92,1,97,1],[79,1,79,2],[22,1,27,1],[32,1,37,1],[38,1,43,1],[44,1,49,1],[5,1,5,2],[31,1,31,2],[68,1,73,1],[62,1,67,1],[55,1,55,2],[56,1,61,1],[16,1,21,1],[9,1,9,2],[10,1,15,1]]}
[null,{"$f":"(LOOKUP(dms_Model,dms_Model_List,dms_Worksheet_List))","v":"REGULATORY REPORTING STATEMENT"}]
[null,{"$f":"dms_TradingName","v":"Ausgrid"}]
[null,{"$f":"CONCATENATE(\"Annual Reporting RIN Response \",CRY)","v":"Annual Reporting RIN Response 2015-16"}]
[null,"6.2 RELIABILITY AND CUSTOMER SERVICE PERFORMANCE"]
[]
[null,"Did the MAIFI parameter of the STPIS apply during the period?\nThis flag is set from the response on worksheet 3.6.8 Network feeders",null,{"$f":"dms_MAIFI_Flag","v":"No"}]
[]
[]
[null,"6.2.1 - UNPLANNED MINUTES OFF SUPPLY (SAIDI)"]
[null,null,null,{"$f":"CRY","v":"2015-16"}]
[null,"Total sustained minutes off supply",{"$f":"INDEX(dms_FeederName_1,MATCH(dms_TradingName,dms_TradingName_List))","v":"CBD"},9.4203315206814597]
[null,null,{"$f":"INDEX(dms_FeederName_2,MATCH(dms_TradingName,dms_TradingName_List))","v":"Urban"},126.90001169977199," "]
[null,null,{"$f":"INDEX(dms_FeederName_3,MATCH(dms_TradingName,dms_TradingName_List))","v":"Short rural"},240.11474004529501]
[null,null,{"$f":"INDEX(dms_FeederName_4,MATCH(dms_TradingName,dms_TradingName_List))","v":"Long rural"},625.749891066141]
[null,null,{"$f":"IF((INDEX(dms_FeederName_5,MATCH(dms_TradingName,dms_TradingName_List))=0),\"\",(INDEX(dms_FeederName_5,MATCH(dms_TradingName,dms_TradingName_List))))","v":""},null,"","","",""]
[null,null,"Whole Network",143.988252785111,"","","",""]
[null,"Total of excluded events*\n\n*see 3.3 of STPIS",{"$f":"INDEX(dms_FeederName_1,MATCH(dms_TradingName,dms_TradingName_List))","v":"CBD"},0]
[null,null,{"$f":"INDEX(dms_FeederName_2,MATCH(dms_TradingName,dms_TradingName_List))","v":"Urban"},61.535845018763595]
[null,null,{"$f":"INDEX(dms_FeederName_3,MATCH(dms_TradingName,dms_TradingName_List))","v":"Short rural"},108.39782754659902]
[null,null,{"$f":"INDEX(dms_FeederName_4,MATCH(dms_TradingName,dms_TradingName_List))","v":"Long rural"},35.345898885514998]
[null,null,{"$f":"IF((INDEX(dms_FeederName_5,MATCH(dms_TradingName,dms_TradingName_List))=0),\"\",(INDEX(dms_FeederName_5,MATCH(dms_TradingName,dms_TradingName_List))))","v":""},null,null,"","",""]
[null,null,"Whole Network",67.981387241598398,null,"","",""]
[null,"Total sustained minutes off supply after removing excluded events",{"$f":"INDEX(dms_FeederName_1,MATCH(dms_TradingName,dms_TradingName_List))","v":"CBD"},9.4203315206814597]
[null,null,{"$f":"INDEX(dms_FeederName_2,MATCH(dms_TradingName,dms_TradingName_List))","v":"Urban"},65.364166681008399]
[null,null,{"$f":"INDEX(dms_FeederName_3,MATCH(dms_TradingName,dms_TradingName_List))","v":"Short rural"},131.71691249869599]
[null,null,{"$f":"INDEX(dms_FeederName_4,MATCH(dms_TradingName,dms_TradingName_List))","v":"Long rural"},590.40399218062601]
[null,null,{"$f":"IF((INDEX(dms_FeederName_5,MATCH(dms_TradingName,dms_TradingName_List))=0),\"\",(INDEX(dms_FeederName_5,MATCH(dms_TradingName,dms_TradingName_List))))","v":""},null,"","","",""]
[null,null,"Whole Network",76.006865543512603,"","","",""]
[]
[]
[null,"6.2.2 - UNPLANNED INTERRUPTIONS TO SUPPLY (SAIFI)"]
[null,null,null,{"$f":"CRY","v":"2015-16"}]
[null,"Total sustained interruptions",{"$f":"INDEX(dms_FeederName_1,MATCH(dms_TradingName,dms_TradingName_List))","v":"CBD"},1.5425938037397999]
[null,null,{"$f":"INDEX(dms_FeederName_2,MATCH(dms_TradingName,dms_TradingName_List))","v":"Urban"},82.627982655980603]
[null,null,{"$f":"INDEX(dms_FeederName_3,MATCH(dms_TradingName,dms_TradingName_List))","v":"Short rural"},151.93460040369601]
[null,null,{"$f":"INDEX(dms_FeederName_4,MATCH(dms_TradingName,dms_TradingName_List))","v":"Long rural"},322.741963313479]
[null,null,{"$f":"IF((INDEX(dms_FeederName_5,MATCH(dms_TradingName,dms_TradingName_List))=0),\"\",(INDEX(dms_FeederName_5,MATCH(dms_TradingName,dms_TradingName_List))))","v":""},null,"","","",""]
[null,null,"Whole Network",92.831107135750599,"","","",""]
[null,"Total of excluded events*\n\n*see 3.3 of STPIS",{"$f":"INDEX(dms_FeederName_1,MATCH(dms_TradingName,dms_TradingName_List))","v":"CBD"},0]
[null,null,{"$f":"INDEX(dms_FeederName_2,MATCH(dms_TradingName,dms_TradingName_List))","v":"Urban"},20.171369590748306]
[null,null,{"$f":"INDEX(dms_FeederName_3,MATCH(dms_TradingName,dms_TradingName_List))","v":"Short rural"},37.204188358583011]
[null,null,{"$f":"INDEX(dms_FeederName_4,MATCH(dms_TradingName,dms_TradingName_List))","v":"Long rural"},4.1392316347930205]
[null,null,{"$f":"IF((INDEX(dms_FeederName_5,MATCH(dms_TradingName,dms_TradingName_List))=0),\"\",(INDEX(dms_FeederName_5,MATCH(dms_TradingName,dms_TradingName_List))))","v":""},null,"",null,"",""]
[null,null,"Whole Network",22.546259842741506,"",null,"",""]
[null,"Total sustained interruptions after removing excluded events",{"$f":"INDEX(dms_FeederName_1,MATCH(dms_TradingName,dms_TradingName_List))","v":"CBD"},1.5425938037397999]
[null,null,{"$f":"INDEX(dms_FeederName_2,MATCH(dms_TradingName,dms_TradingName_List))","v":"Urban"},62.456613065232297]
[null,null,{"$f":"INDEX(dms_FeederName_3,MATCH(dms_TradingName,dms_TradingName_List))","v":"Short rural"},114.730412045113]
[null,null,{"$f":"INDEX(dms_FeederName_4,MATCH(dms_TradingName,dms_TradingName_List))","v":"Long rural"},318.60273167868598]
[null,null,{"$f":"IF((INDEX(dms_FeederName_5,MATCH(dms_TradingName,dms_TradingName_List))=0),\"\",(INDEX(dms_FeederName_5,MATCH(dms_TradingName,dms_TradingName_List))))","v":""},null,"","","",""]
[null,null,"Whole Network",70.284847293009094,"","","",""]
[]
[]
[]
[]
[null,"6.2.3 - UNPLANNED MOMENTARY INTERRUPTIONS TO SUPPLY (MAIFI)"]
[null,null,null,{"$f":"CRY","v":"2015-16"}]
[null,"Total momentary interruptions",{"$f":"INDEX(dms_FeederName_1,MATCH(dms_TradingName,dms_TradingName_List))","v":"CBD"}]
[null,null,{"$f":"INDEX(dms_FeederName_2,MATCH(dms_TradingName,dms_TradingName_List))","v":"Urban"}]
[null,null,{"$f":"INDEX(dms_FeederName_3,MATCH(dms_TradingName,dms_TradingName_List))","v":"Short rural"}]
[null,null,{"$f":"INDEX(dms_FeederName_4,MATCH(dms_TradingName,dms_TradingName_List))","v":"Long rural"}]
[null,null,{"$f":"IF((INDEX(dms_FeederName_5,MATCH(dms_TradingName,dms_TradingName_List))=0),\"\",(INDEX(dms_FeederName_5,MATCH(dms_TradingName,dms_TradingName_List))))","v":""}]
[null,null,"Whole Network"]
[null,"Total of excluded events*\n\n*see 3.3 of STPIS",{"$f":"INDEX(dms_FeederName_1,MATCH(dms_TradingName,dms_TradingName_List))","v":"CBD"}]
[null,null,{"$f":"INDEX(dms_FeederName_2,MATCH(dms_TradingName,dms_TradingName_List))","v":"Urban"}]
[null,null,{"$f":"INDEX(dms_FeederName_3,MATCH(dms_TradingName,dms_TradingName_List))","v":"Short rural"}]
[null,null,{"$f":"INDEX(dms_FeederName_4,MATCH(dms_TradingName,dms_TradingName_List))","v":"Long rural"}]
[null,null,{"$f":"IF((INDEX(dms_FeederName_5,MATCH(dms_TradingName,dms_TradingName_List))=0),\"\",(INDEX(dms_FeederName_5,MATCH(dms_TradingName,dms_TradingName_List))))","v":""}]
[null,null,"Whole Network"]
[null,"Total momentary interruptions after removing excluded events",{"$f":"INDEX(dms_FeederName_1,MATCH(dms_TradingName,dms_TradingName_List))","v":"CBD"}]
[null,null,{"$f":"INDEX(dms_FeederName_2,MATCH(dms_TradingName,dms_TradingName_List))","v":"Urban"}]
[null,null,{"$f":"INDEX(dms_FeederName_3,MATCH(dms_TradingName,dms_TradingName_List))","v":"Short rural"}]
[null,null,{"$f":"INDEX(dms_FeederName_4,MATCH(dms_TradingName,dms_TradingName_List))","v":"Long rural"}]
[null,null,{"$f":"IF((INDEX(dms_FeederName_5,MATCH(dms_TradingName,dms_TradingName_List))=0),\"\",(INDEX(dms_FeederName_5,MATCH(dms_TradingName,dms_TradingName_List))))","v":""}]
[null,null,"Whole Network"]
[]
[]
[]
[]
[null,"6.2.4 - DISTRIBUTION CUSTOMER NUMBERS"]
[null,null,null,{"$f":"CRY","v":"2015-16"}]
[null,"Customer numbers at the start of the period",{"$f":"INDEX(dms_FeederName_1,MATCH(dms_TradingName,dms_TradingName_List))","v":"CBD"},30845]
[null,null,{"$f":"INDEX(dms_FeederName_2,MATCH(dms_TradingName,dms_TradingName_List))","v":"Urban"},1365116]
[null,null,{"$f":"INDEX(dms_FeederName_3,MATCH(dms_TradingName,dms_TradingName_List))","v":"Short rural"},279426]
[null,null,{"$f":"INDEX(dms_FeederName_4,MATCH(dms_TradingName,dms_TradingName_List))","v":"Long rural"},2696]
[null,null,{"$f":"IF((INDEX(dms_FeederName_5,MATCH(dms_TradingName,dms_TradingName_List))=0),\"\",(INDEX(dms_FeederName_5,MATCH(dms_TradingName,dms_TradingName_List))))","v":""}]
[null,null,"Whole Network",1678083]
[null,"Customer numbers at the end of the period",{"$f":"INDEX(dms_FeederName_1,MATCH(dms_TradingName,dms_TradingName_List))","v":"CBD"},31051]
[null,null,{"$f":"INDEX(dms_FeederName_2,MATCH(dms_TradingName,dms_TradingName_List))","v":"Urban"},1388473]
[null,null,{"$f":"INDEX(dms_FeederName_3,MATCH(dms_TradingName,dms_TradingName_List))","v":"Short rural"},275691]
[null,null,{"$f":"INDEX(dms_FeederName_4,MATCH(dms_TradingName,dms_TradingName_List))","v":"Long rural"},2321]
[null,null,{"$f":"IF((INDEX(dms_FeederName_5,MATCH(dms_TradingName,dms_TradingName_List))=0),\"\",(INDEX(dms_FeederName_5,MATCH(dms_TradingName,dms_TradingName_List))))","v":""}]
[null,null,"Whole Network",1697536]
[null,"Average customer numbers",{"$f":"INDEX(dms_FeederName_1,MATCH(dms_TradingName,dms_TradingName_List))","v":"CBD"},{"$f":"ROUND(SUM(D81+D87)/2,0)","v":30948}]
[null,null,{"$f":"INDEX(dms_FeederName_2,MATCH(dms_TradingName,dms_TradingName_List))","v":"Urban"},{"$f":"ROUND(SUM(D82+D88)/2,0)","v":1376795}]
[null,null,{"$f":"INDEX(dms_FeederName_3,MATCH(dms_TradingName,dms_TradingName_List))","v":"Short rural"},{"$f":"ROUND(SUM(D83+D89)/2,0)","v":277559}]
[null,null,{"$f":"INDEX(dms_FeederName_4,MATCH(dms_TradingName,dms_TradingName_List))","v":"Long rural"},{"$f":"ROUND(SUM(D84+D90)/2,0)","v":2509}]
[null,null,{"$f":"IF((INDEX(dms_FeederName_5,MATCH(dms_TradingName,dms_TradingName_List))=0),\"\",(INDEX(dms_FeederName_5,MATCH(dms_TradingName,dms_TradingName_List))))","v":""},{"$f":"ROUND(SUM(D85+D91)/2,0)","v":0}]
[null,null,"Whole Network",1687810]

{"sheet":"6.6 STPIS Customer Service","index":10,"n_rows":13,"n_cols":4,"rows_kept":13,"cut":false,"hidden":false,"merged":[[8,1,9,1]]}
[null,{"$f":"(LOOKUP(dms_Model,dms_Model_List,dms_Worksheet_List))","v":"REGULATORY REPORTING STATEMENT"}]
[null,{"$f":"dms_TradingName","v":"Ausgrid"}]
[null,{"$f":"CONCATENATE(\"Annual Reporting RIN Response \",CRY)","v":"Annual Reporting RIN Response 2015-16"}]
[null,"6.6 STPIS CUSTOMER SERVICE"]
[]
[]
[null,"6.6.1 - TELEPHONE ANSWERING"]
[]
[null,null,"Number of calls \nafter removing excluded events","Total number of calls"]
[null,null,{"$f":"CRY","v":"2015-16"},{"$f":"CRY","v":"2015-16"}]
[null,"Number of calls received",198366,222312]
[null,"Number of calls answered within 30 seconds",159428]
[null,"Percentage of calls answered within 30 seconds",{"$f":"C12/C11","v":0.8037062803101338}]

{"sheet":"6.7 STPIS Daily Performance","index":11,"n_rows":381,"n_cols":16,"rows_kept":381,"cut":false,"hidden":false,"merged":[[13,14,13,15],[13,3,14,3],[6,1,6,5],[8,1,8,6],[13,4,13,5],[13,6,13,7],[13,10,13,11],[13,8,13,9],[13,12,13,13],[12,1,14,1],[12,2,12,3],[13,2,14,2],[12,4,12,13]]}
[null,{"$f":"(LOOKUP(dms_Model,dms_Model_List,dms_Worksheet_List))","v":"REGULATORY REPORTING STATEMENT"},null,null,null,null,null,null,{"$f":"CONCATENATE(IF(LEN(CRY)=4,\"1-Jan-\",\"1-Jul-\"),LEFT(CRY,4))","v":"1-Jul-2015"}]
[null,{"$f":"dms_TradingName","v":"Ausgrid"}]
[null,{"$f":"CONCATENATE(\"Annual Reporting RIN Response \",CRY)","v":"Annual Reporting RIN Response 2015-16"}]
[null,"6.7 STPIS DAILY PERFORMANCE"]
[]
[]
[null,"Did the MAIFI parameter of the STPIS apply during the period?\nThis flag is set from the response on worksheet 3.6.8 Network feeders",null,null,null,null,{"$f":"dms_MAIFI_Flag","v":"No"}]
[]
[null,"The excluded events to be removed from the data refer only to events listed in clause 3.3(a) of the STPIS, with respect to reliability data, and in clause 5.4 of the STPIS with respect to customer service parameters.\n\n*Customer service information must be reported as per the definitions in the STPIS, that is excluding: \n   • calls to payment lines and automated interactive services \n   • calls abandoned by the customer within 30 seconds of the call being queued for response by a human operator (where the time in which a telephone call is abandoned is not measured, then an estimate of the number of calls abandoned within 30 seconds will be determined by taking 20 per cent of all calls abandoned)."]
[]
[null,"6.7.1 - DAILY PERFORMANCE DATA - UNPLANNED"]
[]
[null,"Date","Customer service*",null,"MAIFI"]
[null,null,"Number of calls received\n(after removing excluded events)","Number of calls answered in 30 seconds\n(after removing excluded events)",{"$f":"INDEX(dms_FeederName_1,MATCH(dms_TradingName,dms_TradingName_List))","v":"CBD"},null,{"$f":"INDEX(dms_FeederName_2,MATCH(dms_TradingName,dms_TradingName_List))","v":"Urban"},null,{"$f":"INDEX(dms_FeederName_3,MATCH(dms_TradingName,dms_TradingName_List))","v":"Short rural"},null,{"$f":"INDEX(dms_FeederName_4,MATCH(dms_TradingName,dms_TradingName_List))","v":"Long rural"},null,{"$f":"IF((INDEX(dms_FeederName_5,MATCH(dms_TradingName,dms_TradingName_List))=0),\"Network\",(INDEX(dms_FeederName_5,MATCH(dms_TradingName,dms_TradingName_List))))","v":"Network"},null,"Network"]
[null,null,null,null,"All events","After removing excluded events","All events","After removing excluded events","All events","After removing excluded events","All events","After removing excluded events","All events","After removing excluded events","All events","After removing excluded events"]
[null,{"$f":"CONCATENATE(IF(LEN(CRY)=4,\"1-Jan-\",\"1-Jul-\"),LEFT(CRY,4))","v":"1-Jul-2015"},578,531]
[null,{"$f":"B16+1","v":"2015-07-02"},644,531]
[null,"2015-07-03",550,516]
[null,"2015-07-04",397,316]
[null,"2015-07-05",332,259]
[null,"2015-07-06",657,596]
[null,"2015-07-07",720,597]
[null,"2015-07-08",658,500]
[null,"2015-07-09",546,507]
[null,"2015-07-10",533,510]
[null,"2015-07-11",472,343]
[null,"2015-07-12",844,427]
[null,"2015-07-13",804,684]
[null,"2015-07-14",1161,746]
[null,"2015-07-15",663,586]
[null,"2015-07-16",624,587]
[null,"2015-07-17",759,680]
[null,"2015-07-18",540,367]
[null,"2015-07-19",312,240]
[null,"2015-07-20",524,512]
[null,"2015-07-21",551,526]
[null,"2015-07-22",578,547]
[null,"2015-07-23",522,501]
[null,"2015-07-24",468,415]
[null,"2015-07-25",319,237]
[null,"2015-07-26",307,231]
[null,"2015-07-27",746,614]
[null,"2015-07-28",527,448]
[null,"2015-07-29",552,497]
[null,"2015-07-30",504,452]
[null,"2015-07-31",476,427]
[null,"2015-08-01",403,295]
[null,"2015-08-02",234,169]
[null,"2015-08-03",702,626]
[null,"2015-08-04",666,543]
[null,"2015-08-05",699,504]
[null,"2015-08-06",633,571]
[null,"2015-08-07",554,492]
[null,"2015-08-08",488,339]
[null,"2015-08-09",374,300]
[null,"2015-08-10",724,623]
[null,"2015-08-11",560,491]
[null,"2015-08-12",636,554]
[null,"2015-08-13",705,598]
[null,"2015-08-14"]
[null,"2015-08-15",399,293]
[null,"2015-08-16",219,166]
[null,"2015-08-17",518,454]
[null,"2015-08-18",579,504]
[null,"2015-08-19",458,389]
[null,"2015-08-20",530,454]
[null,"2015-08-21",547,477]
[null,"2015-08-22",382,282]
[null,"2015-08-23",383,270]
[null,"2015-08-24",907,781]
[null,"2015-08-25",696,605]
[null,"2015-08-26",677,448]
[null,"2015-08-27",489,440]
[null,"2015-08-28",422,381]
[null,"2015-08-29",299,226]
[null,"2015-08-30",217,173]
[null,"2015-08-31",518,473]
[null,"2015-09-01",527,453]
[null,"2015-09-02",464,397]
[null,"2015-09-03",512,454]
[null,{"$f":"B80+1","v":"2015-09-04"},462,397]
[null,"2015-09-05",332,261]
[null,"2015-09-06",285,238]
[null,"2015-09-07",538,504]
[null,"2015-09-08",479,442]
[null,"2015-09-09",532,448]
[null,"2015-09-10"]
[null,"2015-09-11",552,433]
[null,"2015-09-12",383,285]
[null,"2015-09-13",209,163]
[null,"2015-09-14",465,405]
[null,"2015-09-15",507,433]
[null,"2015-09-16",645,526]
[null,"2015-09-17",635,569]
[null,"2015-09-18",555,462]
[null,"2015-09-19",372,253]
[null,"2015-09-20",248,195]
[null,"2015-09-21",476,413]
[null,"2015-09-22",642,552]
[null,"2015-09-23",590,550]
[null,"2015-09-24",720,540]
[null,"2015-09-25",709,600]
[null,"2015-09-26",342,210]
[null,"2015-09-27",268,211]
[null,"2015-09-28",782,437]
[null,"2015-09-29",456,383]
[null,"2015-09-30",508,429]
[null,"2015-10-01",430,366]
[null,"2015-10-02",605,543]
[null,"2015-10-03",372,268]
[null,"2015-10-04",357,272]
[null,"2015-10-05",499,392]
[null,"2015-10-06",787,604]
[null,"2015-10-07",687,609]
[null,"2015-10-08",597,513]
[null,"2015-10-09",537,477]
[null,"2015-10-10",367,271]
[null,"2015-10-11",1297,650]
[null,"2015-10-12",986,833]
[null,"2015-10-13",529,470]
[null,"2015-10-14",551,466]
[null,"2015-10-15",560,463]
[null,"2015-10-16",546,483]
[null,"2015-10-17",296,231]
[null,"2015-10-18",246,198]
[null,"2015-10-19",449,388]
[null,"2015-10-20",1617,727]
[null,"2015-10-21",660,574]
[null,"2015-10-22",588,545]
[null,"2015-10-23",528,471]
[null,"2015-10-24",330,251]
[null,"2015-10-25",217,165]
[null,"2015-10-26",843,715]
[null,"2015-10-27",607,505]
[null,"2015-10-28",515,425]
[null,"2015-10-29",603,386]
[null,"2015-10-30",401,347]
[null,"2015-10-31",323,256]
[null,"2015-11-01",501,349]
[null,"2015-11-02",660,539]
[null,"2015-11-03",512,428]
[null,"2015-11-04",754,633]
[null,"2015-11-05",739,625]
[null,"2015-11-06",887,731]
[null,{"$f":"B144+1","v":"2015-11-07"},399,305]
[null,"2015-11-08",221,166]
[null,"2015-11-09",541,470]
[null,"2015-11-10",465,394]
[null,"2015-11-11",521,431]
[null,"2015-11-12",1008,542]
[null,"2015-11-13",1207,711]
[null,"2015-11-14",486,334]
[null,"2015-11-15",392,281]
[null,"2015-11-16",684,546]
[null,"2015-11-17",576,531]
[null,"2015-11-18",761,664]
[null,"2015-11-19",758,686]
[null,"2015-11-20",1866,920]
[null,"2015-11-21",383,274]
[null,"2015-11-22",244,210]
[null,"2015-11-23",479,460]
[null,"2015-11-24",492,466]
[null,"2015-11-25",624,495]
[null,"2015-11-26",1524,1244]
[null,"2015-11-27",538,496]
[null,"2015-11-28",893,339]
[null,"2015-11-29",340,305]
[null,"2015-11-30",617,578]
[null,"2015-12-01",576,506]
[null,"2015-12-02",845,653]
[null,"2015-12-03",410,404]
[null,"2015-12-04",428,398]
[null,"2015-12-05",254,227]
[null,"2015-12-06",366,278]
[null,"2015-12-07",497,472]
[null,"2015-12-08",576,512]
[null,"2015-12-09"]
[null,"2015-12-10",1988,975]
[null,"2015-12-11",982,878]
[null,"2015-12-12",272,226]
[null,"2015-12-13",247,233]
[null,"2015-12-14",590,561]
[null,"2015-12-15",596,519]
[null,"2015-12-16",1408,1158]
[null,"2015-12-17",553,522]
[null,"2015-12-18",433,383]
[null,"2015-12-19",436,319]
[null,"2015-12-20",377,325]
[null,"2015-12-21",856,674]
[null,"2015-12-22",782,569]
[null,"2015-12-23",559,513]
[null,"2015-12-24",323,310]
[null,"2015-12-25",229,212]
[null,"2015-12-26",329,273]
[null,"2015-12-27",324,269]
[null,"2015-12-28",296,256]
[null,"2015-12-29",382,339]
[null,"2015-12-30",317,293]
[null,"2015-12-31",354,233]
[null,"2016-01-01",202,183]
[null,"2016-01-02",229,201]
[null,"2016-01-03",260,213]
[null,"2016-01-04",452,416]
[null,"2016-01-05",799,575]
[null,"2016-01-06",1219,1016]
[null,"2016-01-07",721,659]
[null,"2016-01-08",471,451]
[null,"2016-01-09",336,277]
[null,{"$f":"B208+1","v":"2016-01-10"},215,194]
[null,"2016-01-11",671,631]
[null,"2016-01-12",768,593]
[null,"2016-01-13",512,477]
[null,"2016-01-14"]
[null,"2016-01-15",3751,2135]
[null,"2016-01-16",900,457]
[null,"2016-01-17",369,306]
[null,"2016-01-18",598,585]
[null,"2016-01-19",555,487]
[null,"2016-01-20",1134,694]
[null,"2016-01-21",1349,722]
[null,"2016-01-22",1193,838]
[null,"2016-01-23",612,422]
[null,"2016-01-24",328,275]
[null,"2016-01-25",485,449]
[null,"2016-01-26",324,262]
[null,"2016-01-27",590,498]
[null,"2016-01-28",598,569]
[null,"2016-01-29"]
[null,"2016-01-30"]
[null,"2016-01-31",689,598]
[null,"2016-02-01",667,642]
[null,"2016-02-02",617,539]
[null,"2016-02-03",615,580]
[null,"2016-02-04",816,728]
[null,"2016-02-05",611,571]
[null,"2016-02-06",286,240]
[null,"2016-02-07",151,146]
[null,"2016-02-08",573,506]
[null,"2016-02-09",490,425]
[null,"2016-02-10",521,369]
[null,"2016-02-11",551,457]
[null,"2016-02-12",596,509]
[null,"2016-02-13",301,240]
[null,"2016-02-14",342,277]
[null,"2016-02-15",720,643]
[null,"2016-02-16",759,690]
[null,"2016-02-17",444,425]
[null,"2016-02-18",434,412]
[null,"2016-02-19",579,509]
[null,"2016-02-20",356,263]
[null,"2016-02-21",488,310]
[null,"2016-02-22",530,512]
[null,"2016-02-23",498,460]
[null,"2016-02-24",817,536]
[null,"2016-02-25",1027,846]
[null,"2016-02-26",585,529]
[null,"2016-02-27",347,280]
[null,"2016-02-28",329,274]
[null,"2016-02-29",515,463]
[null,"2016-03-01",476,441]
[null,"2016-03-02",513,441]
[null,"2016-03-03",501,476]
[null,"2016-03-04",421,398]
[null,"2016-03-05",398,282]
[null,"2016-03-06",240,214]
[null,"2016-03-07",489,462]
[null,"2016-03-08",405,395]
[null,"2016-03-09",776,680]
[null,"2016-03-10",525,497]
[null,"2016-03-11",410,382]
[null,"2016-03-12",249,200]
[null,"2016-03-13",272,249]
[null,{"$f":"B272+1","v":"2016-03-14"},669,440]
[null,"2016-03-15",724,607]
[null,"2016-03-16",829,601]
[null,"2016-03-17",573,499]
[null,"2016-03-18",675,535]
[null,"2016-03-19",296,241]
[null,"2016-03-20",239,190]
[null,"2016-03-21",571,515]
[null,"2016-03-22",460,407]
[null,"2016-03-23",491,428]
[null,"2016-03-24",454,426]
[null,"2016-03-25",224,211]
[null,"2016-03-26",205,178]
[null,"2016-03-27",218,188]
[null,"2016-03-28",214,199]
[null,"2016-03-29",466,446]
[null,"2016-03-30",470,425]
[null,"2016-03-31",509,465]
[null,"2016-04-01",437,373]
[null,"2016-04-02",219,184]
[null,"2016-04-03",162,144]
[null,"2016-04-04",602,548]
[null,"2016-04-05",553,497]
[null,"2016-04-06",516,481]
[null,"2016-04-07",398,386]
[null,"2016-04-08",392,377]
[null,"2016-04-09",268,221]
[null,"2016-04-10",153,141]
[null,"2016-04-11",506,463]
[null,"2016-04-12",417,402]
[null,"2016-04-13",1055,375]
[null,"2016-04-14",414,387]
[null,"2016-04-15",401,361]
[null,"2016-04-16",197,172]
[null,"2016-04-17",676,330]
[null,"2016-04-18",529,485]
[null,"2016-04-19",571,419]
[null,"2016-04-20",428,381]
[null,"2016-04-21",425,400]
[null,"2016-04-22",844,490]
[null,"2016-04-23",279,219]
[null,"2016-04-24",296,244]
[null,"2016-04-25",171,167]
[null,"2016-04-26",450,435]
[null,"2016-04-27",512,484]
[null,"2016-04-28",463,430]
[null,"2016-04-29",423,407]
[null,"2016-04-30",262,216]
[null,"2016-05-01",218,188]
[null,"2016-05-02",440,416]
[null,"2016-05-03",517,492]
[null,"2016-05-04",558,520]
[null,"2016-05-05",363,345]
[null,"2016-05-06",413,367]
[null,"2016-05-07",253,206]
[null,"2016-05-08",192,185]
[null,"2016-05-09",488,476]
[null,"2016-05-10",684,625]
[null,"2016-05-11",519,454]
[null,"2016-05-12",466,424]
[null,"2016-05-13",469,383]
[null,"2016-05-14",235,171]
[null,"2016-05-15",188,153]
[null,"2016-05-16",459,444]
[null,{"$f":"B336+1","v":"2016-05-17"},466,443]
[null,"2016-05-18",422,391]
[null,"2016-05-19",502,424]
[null,"2016-05-20",416,364]
[null,"2016-05-21",244,203]
[null,"2016-05-22",170,149]
[null,"2016-05-23",471,447]
[null,"2016-05-24",368,334]
[null,"2016-05-25",367,322]
[null,"2016-05-26",493,418]
[null,"2016-05-27",521,496]
[null,"2016-05-28",380,295]
[null,"2016-05-29",327,265]
[null,"2016-05-30",600,448]
[null,"2016-05-31",607,484]
[null,"2016-06-01",535,482]
[null,"2016-06-02",534,441]
[null,"2016-06-03",536,495]
[null,"2016-06-04"]
[null,"2016-06-05"]
[null,"2016-06-06",3747,2051]
[null,"2016-06-07",1700,1124]
[null,"2016-06-08",958,865]
[null,"2016-06-09",742,536]
[null,"2016-06-10",598,557]
[null,"2016-06-11",281,189]
[null,"2016-06-12",252,223]
[null,"2016-06-13",383,316]
[null,"2016-06-14",604,575]
[null,"2016-06-15",623,455]
[null,"2016-06-16",489,453]
[null,"2016-06-17",495,467]
[null,"2016-06-18",254,206]
[null,"2016-06-19",373,309]
[null,"2016-06-20",771,633]
[null,"2016-06-21",903,712]
[null,"2016-06-22",628,587]
[null,"2016-06-23",532,462]
[null,"2016-06-24",761,634]
[null,"2016-06-25",500,394]
[null,"2016-06-26",792,371]
[null,"2016-06-27",731,245]
[null,"2016-06-28",696,292]
[null,"2016-06-29",433,314]
[null,"2016-06-30",555,406]

{"sheet":"6.8 STPIS Exclusions","index":12,"n_rows":44,"n_cols":15,"rows_kept":44,"cut":false,"hidden":false,"merged":[[10,11,11,11],[6,1,6,4],[10,6,10,8],[10,5,11,5],[10,4,11,4],[10,2,11,2],[10,3,11,3]]}
[null,{"$f":"(LOOKUP(dms_Model,dms_Model_List,dms_Worksheet_List))","v":"REGULATORY REPORTING STATEMENT"}]
[null,{"$f":"dms_TradingName","v":"Ausgrid"}]
[null,{"$f":"CONCATENATE(\"Annual Reporting RIN Response \",CRY)","v":"Annual Reporting RIN Response 2015-16"}]
[null,"6.8 STPIS EXCLUSIONS"]
[]
[]
[null,{"$f":"CONCATENATE(\"This information is collected to inform the application of the STPIS to \",dms_TradingName,\" in future regulatory periods. The information is also collected to monitor network performance, and may be used in performance reports.\")","v":"This information is collected to inform the application of the STPIS to Ausgrid in future regulatory periods. The information is also collected to monitor network performance, and may be used in performance reports."}]
[]
[null,"6.8.1 - STPIS EXCLUSIONS"]
[]
[null,"Date of event","Outage ID","Feeder ID / name","Feeder classification\n(drop down)","Cause of event\n(drop down)","Unplanned",null,null,"Event category","Effect on unplanned MAIFI","Please provide separate explanation to confirm the outage was not due to inadequate transmission connection planning "]
[null,"DD/MM/YYYY",null,null,null,null,"Number of  interruptions","Duration of interruption\n(mins)","Total unplanned minutes off supply","Use exclusion categories listed in section 3.3(a) of the STPIS\n(drop down)","by feeder classification",null,null,null,"Cause of Event"]
[null,null,null,null,null,null,null,null,null,null,null,null,null,null,"Weather"]
[null,null,null,null,null,null,null,null,null,null,null,null,null,null,"Equipment failure"]
[null,null,null,null,null,null,null,null,null,null,null,null,null,null,"Operational error"]
[null,null,null,null,null,null,null,null,null,null,null,null,null,null,"Vegetation"]
[null,null,null,null,null,null,null,null,null,null,null,null,null,null,"Animals"]
[null,null,null,null,null,null,null,null,null,null,null,null,null,null,"Third party impacts"]
[null,null,null,null,null,null,null,null,null,null,null,null,null,null,"Transmission failure"]
[null,null,null,null,null,null,null,null,null,null,null,null,null,null,"Load shedding"]
[null,null,null,null,null,null,null,null,null,null,null,null,null,null,"Inter-distributor connection failure"]
[null,null,null,null,null,null,null,null,null,null,null,null,null,null,"Other"]
[]
[]
[]
[]
[]
[]
[]
[]
[]
[]
[]
[]
[]
[]
[]
[]
[]
[]
[]
[]
[]
[null,"To enter further events - please insert new lines above this line. "]

{"sheet":"6.9 STPIS - GSL","index":13,"n_rows":102,"n_cols":5,"rows_kept":102,"cut":false,"hidden":false,"merged":[[64,1,64,2],[54,1,54,2],[55,1,55,2],[56,1,56,2],[61,1,61,2],[60,1,60,2],[59,1,59,2],[17,1,17,2],[15,1,15,2],[5,1,5,2],[7,1,7,2],[14,1,14,2],[16,1,16,2],[20,1,20,2],[22,1,22,2],[23,1,23,2],[24,1,24,2],[21,1,21,2],[27,1,27,2],[31,1,31,2],[32,1,32,2],[28,1,28,2],[29,1,29,2],[30,1,30,2],[33,1,33,2],[34,1,34,2],[35,1,35,2],[36,1,36,2],[37,1,37,2],[40,1,40,2],[42,1,42,2],[43,1,43,2],[44,1,44,2],[41,1,41,2],[85,1,85,2],[86,1,86,2],[45,1,45,2],[46,1,46,2],[71,1,71,2],[70,1,70,2],[77,1,77,2],[49,1,49,2],[50,1,50,2],[51,1,51,2],[53,1,53,4],[58,1,58,4],[63,1,63,4],[68,1,68,4],[66,1,66,2],[65,1,65,2],[5,4,5,5],[101,1,101,2],[69,1,69,2],[98,1,98,2],[100,1,100,2],[93,1,93,2],[94,1,94,2],[95,1,95,2],[96,1,96,2],[88,1,88,2],[89,1,89,2],[90,1,90,2],[91,1,91,2],[92,1,92,2],[83,1,83,2],[84,1,84,2]]}
[null,{"$f":"(LOOKUP(dms_Model,dms_Model_List,dms_Worksheet_List))","v":"REGULATORY REPORTING STATEMENT"}]
[null,{"$f":"dms_TradingName","v":"Ausgrid"}]
[null,{"$f":"CONCATENATE(\"Annual Reporting RIN Response \",CRY)","v":"Annual Reporting RIN Response 2015-16"}]
[null,"6.9 STPIS - GUARANTEED SERVICE LEVEL"]
[]
[null,"Did the AER's GSL Scheme apply at any time during the regulatory year?",null,"No","**IMPORTANT \nPlease ensure this flag is set. Conditional formatting on this worksheet is dependant on this response."]
[]
[null,"Instructions:\nTable 6.9.1 collects information relating to jurisdiction GSL scheme parameters. These parameters can be found in the jurisdictonal scheme relevant to NSP. Please identify each parameter in the relevant sub-tables and provide the volume and value of GSL payments. \n\nFor GSL parameters that do not fit within the provided sub-tables provided, please enter a heading and identify the relevant parameter(s). "]
[]
[null,"6.9.1 - GUARANTEED SERVICE LEVELS - JURISDICTIONAL GSL SCHEME"]
[null,null,null,{"$f":"CRY","v":"2015-16"},{"$f":"CRY","v":"2015-16"}]
[null,null,null,"Volume","Value of GSL payments"]
[null,null,null,"0's","$0's"]
[null,"Appointments"]
[null,"Appointments- GSL payments",null,0,0]
[]
[]
[]
[null,"To enter further GSL parameters relating to appointments - please copy a row from above and \"insert copied cells\" above this row."]
[null,"Connections"]
[null,"Connections made",null,281]
[null,"Connections not made on agreed date - number and value GSL payments",null,0,0]
[]
[]
[]
[null,"To enter further GSL parameters relating to connections -  please copy a row from above and \"insert copied cells\" above this row."]
[null,"Reliability of supply"]
[null,"Interruption Duration Standards - Claims",null,438,14160]
[null,"Interruption frequency Standards - Claims ",null,33,80]
[]
[]
[]
[]
[]
[]
[]
[]
[]
[null,"To enter further GSL parameters relating to reliability of supply -  please copy a row from above and \"insert copied cells\" above this row."]
[null,"Street lights"]
[null,"Street Light- GSL payments",null,367,5070]
[]
[]
[]
[]
[]
[]
[null,"To enter further GSL parameters relating to street lights -  please copy a row from above and \"insert copied cells\" above this row."]
[null,"Planned interruptions"]
[null,"Planned interruptions - 4 business days notice not given",null,43]
[null,"Planned interruptions - 4 business days notice not given - number and value GSL payments",null,0,0]
[]
[null,"To enter further GSL parameters relating to planned interruptions -  please copy a row from above and \"insert copied cells\" above this row."]
[null,"<NSP defined parameter category>"]
[]
[]
[]
[null,"To enter further GSL parameters - please identify the parameter and if insufficient rows  please copy a row from above and \"insert copied cells\" above this row."]
[null,"<NSP defined parameter category>"]
[]
[]
[]
[null,"To enter further GSL parameters - please identify the parameter and if insufficient rows  please copy a row from above and \"insert copied cells\" above this row."]
[null,"<NSP defined parameter category>"]
[]
[]
[]
[null,"To enter further GSL parameters - please identify the parameter and if insufficient rows  please copy a row from above and \"insert copied cells\" above this row."]
[null,"<NSP defined parameter category>"]
[]
[]
[]
[null,"To enter further GSL parameters - please identify the parameter and if insufficient rows  please copy a row from above and \"insert copied cells\" above this row."]
[]
[]
[null,"6.9.2 - GUARANTEED SERVICE LEVELS - AER GSL SCHEME"]
[]
[null,"Complete Table 6.9.2 if the AER's GSL scheme applied at any time during the regulatory year. \n\nDo not complete Table 6.9.2 if the AER's GSL scheme did not apply during the regulatory year."]
[]
[null,null,null,{"$f":"CRY","v":"2015-16"},{"$f":"CRY","v":"2015-16"}]
[null,null,null,"Volume","Value \nof GSL payments"]
[null,null,null,"0's","$0's"]
[null,"New connections "]
[null,"Number of connections made"]
[null,"Number of connections not made on or before the day agreed"]
[null,"Connections - GSL payments – 1-6 day delay"]
[null,"Connections - GSL payments – 7+ day delay"]
[null,"Reliability of supply"]
[null,"Frequency of interruptions – CBD feeders – 9 interruptions"]
[null,"Frequency of interruptions – Urban feeders – 9 interruptions"]
[null,"Frequency of interruptions – Rural (short and long) feeders – 15 interruptions"]
[null,"Interruptions – CBD feeders – 12 hours duration"]
[null,"Interruptions – Urban feeders – 12 hours duration"]
[null,"Interruptions – Rural (short and long) feeders – 18 hours duration"]
[null,"Total duration of interruptions Level 1 – 20 hours"]
[null,"Total duration of interruptions Level 2 – 30 hours"]
[null,"Total duration of interruptions Level 3 – 60 hours"]
[null,"Street lights"]
[null,"Streetlight repair 5 days – GSL payments"]
[null,"Planned interruptions"]
[null,"Notice of planned interruptions – 4 business days notice not given"]
[null,"Total ",null,null,{"$f":"SUM(E101,E99,E89:E97,E86:E87)","v":0}]

{"sheet":"7.8 Avoided TUOS Payments","index":14,"n_rows":11,"n_cols":3,"rows_kept":11,"cut":false,"hidden":false,"merged":[[6,1,7,1]]}
[null,{"$f":"(LOOKUP(dms_Model,dms_Model_List,dms_Worksheet_List))","v":"REGULATORY REPORTING STATEMENT"}]
[null,{"$f":"dms_TradingName","v":"Ausgrid"}]
[null,{"$f":"CONCATENATE(\"Annual Reporting RIN Response \",CRY)","v":"Annual Reporting RIN Response 2015-16"}]
[null,"7.8 - AVOIDED TUOS PAYMENTS"]
[]
[null,"7.8.1 - AVOIDED TUOS PAYMENTS"]
[null,"Description","Avoided TUOS Payment "]
[null,null,"$0's, nominal"]
[null,"Embedded generators",294174.08000000002]
[null,"Market network service providers"]
[null,"Other"]

{"sheet":"7.10 Juris Scheme","index":15,"n_rows":17,"n_cols":6,"rows_kept":17,"cut":false,"hidden":false,"merged":[[8,4,9,4],[8,3,9,3],[8,2,9,2],[8,1,9,1],[5,1,5,2]]}
[null,{"$f":"(LOOKUP(dms_Model,dms_Model_List,dms_Worksheet_List))","v":"REGULATORY REPORTING STATEMENT"}]
[null,{"$f":"dms_TradingName","v":"Ausgrid"}]
[null,{"$f":"CONCATENATE(\"Annual Reporting RIN Response \",CRY)","v":"Annual Reporting RIN Response 2015-16"}]
[null,"7.10 - JURISDICTIONAL SCHEMES"]
[]
[null,"Instructions\nBusiness must list each relevant jurisdictional scheme individually and report information for each scheme separately from other schemes."]
[]
[null,"7.10.1 - JURISDICTIONAL SCHEME PAYMENTS"]
[null,"Jurisdictional Scheme Name","Description","Date DNSP Became Subject to Scheme","Description of Cost Recovery Method","Total Scheme Payments  "]
[null,null,null,null,null,"$0's, nominal"]
[null,"Solar Bonus Scheme (SBS)","Solar Bonus Scheme","2010-01-01","Recovered from the Climate Change Fund. SBS credit payments are made to eligible solar PV system customers.",0]
[null,"Climate Change Fund (CCF)","Climate Change Fund","2007-07-01","Recovered from the customer's CCF component of their bills.",2457186.7376994491]
[]
[]
[]
[]
[null,null,null,null,"Total",{"$f":"SUM(F11:F16)","v":2457186.7376994491}]

{"sheet":"7.11 DMIS-DMIA","index":16,"n_rows":24,"n_cols":5,"rows_kept":24,"cut":false,"hidden":false,"merged":[[21,5,21,7],[6,1,7,1],[6,5,7,7],[6,2,6,4],[9,5,9,7],[10,5,10,7],[18,5,18,7],[19,5,19,7],[8,2,8,4],[11,5,11,7]]}
[null,{"$f":"(LOOKUP(dms_Model,dms_Model_List,dms_Worksheet_List))","v":"REGULATORY REPORTING STATEMENT"}]
[null,{"$f":"dms_TradingName","v":"Ausgrid"}]
[null,{"$f":"CONCATENATE(\"Annual Reporting RIN Response \",CRY)","v":"Annual Reporting RIN Response 2015-16"}]
[null,"7.11 - DEMAND MANAGEMENT INCENTIVE SCHEME"]
[]
[null,"7.11.1 - DMIA - PROJECTS SUBMITTED FOR APPROVAL"]
[null,"Name of project",{"$f":"CONCATENATE(\"Total amount of the DMIA spent in \", CRY)","v":"Total amount of the DMIA spent in 2015-16"}]
[null,null,"Operating expenditure","Capital expenditure","Total"]
[null,null,"$0's, nominal"]
[null,"Load control of small hot water systems",24698,null,{"$f":"SUM(C10:D10)","v":24698}]
[null,"Subsidised controlled load connections",25287,null,25287]
[null,"AS4755 air conditioner and pool pump load control",72915,null,{"$f":"SUM(C12:D12)","v":72915}]
[null,"Newington Grid battery trial",65108,null,65108]
[null,"Controlled load 2 summer scheduling",27572,null,27572]
[null,"Customer power factor correction",106140,null,106140]
[null,"CBD embedded generator connection",1767,null,1767]
[null,"CoolSaver Maitland Program",205673,null,205673]
[null,"Non-residential Energy Efficiency Program",20151,null,20151]
[null,"Pool pump demand study",19534,null,19534]
[null,"Solar & battery customer research",8513,null,8513]
[null,"DMIA market engagement",10581,null,10581]
[null,"Winter AC load control",11753,null,{"$f":"SUM(C22:D22)","v":11753}]
[null,"To enter additional projects - please copy a row from above and \"insert copied cells\" above this row. "]
[null,"Total",{"$f":"SUM(C10:C23)","v":599692},{"$f":"SUM(D10:D23)","v":0},{"$f":"SUM(E10:E23)","v":599692}]

{"sheet":"7.12 Safety and Bushfire","index":17,"n_rows":340,"n_cols":10,"rows_kept":340,"cut":false,"hidden":false,"merged":[[139,1,139,2],[140,1,140,2],[141,1,141,2],[142,1,142,2],[143,1,143,2],[144,1,144,2],[203,6,203,7],[204,6,204,7],[205,6,205,7],[145,1,145,2],[206,6,206,7],[181,6,181,7],[182,6,182,7],[183,6,183,7],[184,6,184,7],[185,6,185,7],[186,6,186,7],[187,6,187,7],[188,6,188,7],[189,6,189,7],[117,1,118,2],[180,6,180,7],[306,6,306,7],[307,6,307,7],[118,3,118,5],[119,1,119,2],[120,1,120,2],[121,1,121,2],[122,1,122,2],[123,1,123,2],[124,1,124,2],[125,1,125,2],[126,1,126,2],[127,1,127,2],[128,1,128,2],[129,1,129,2],[130,1,130,2],[131,1,131,2],[132,1,132,2],[133,1,133,2],[134,1,134,2],[135,1,135,2],[136,1,136,2],[137,1,137,2],[138,1,138,2],[297,6,297,7],[298,6,298,7],[299,6,299,7],[300,6,300,7],[301,6,301,7],[302,6,302,7],[303,6,303,7],[275,6,275,7],[276,6,276,7],[282,6,282,7],[283,6,283,7],[284,6,284,7],[285,6,285,7],[286,6,286,7],[287,6,287,7],[280,6,280,7],[281,6,281,7],[266,6,266,7],[267,6,267,7],[268,6,268,7],[269,6,269,7],[270,6,270,7],[271,6,271,7],[304,6,304,7],[305,6,305,7],[288,6,288,7],[289,6,289,7],[290,6,290,7],[291,6,291,7],[292,6,292,7],[293,6,293,7],[294,6,294,7],[295,6,295,7],[296,6,296,7],[272,6,272,7],[273,6,273,7],[274,6,274,7],[257,6,257,7],[258,6,258,7],[259,6,259,7],[260,6,260,7],[261,6,261,7],[262,6,262,7],[263,6,263,7],[264,6,264,7],[265,6,265,7],[248,6,249,7],[250,6,250,7],[251,6,251,7],[252,6,252,7],[253,6,253,7],[254,6,254,7],[255,6,255,7],[256,6,256,7],[169,8,169,9],[170,8,170,9],[207,6,207,7],[190,6,190,7],[191,6,191,7],[192,6,192,7],[193,6,193,7],[194,6,194,7],[195,6,195,7],[196,6,196,7],[197,6,197,7],[198,6,198,7],[199,6,199,7],[200,6,200,7],[201,6,201,7],[202,6,202,7],[162,8,164,9],[171,8,171,9],[172,8,172,9],[166,8,166,9],[167,8,167,9],[71,6,71,7],[72,6,72,7],[73,6,73,7],[74,6,74,7],[75,6,75,7],[76,6,76,7],[77,6,77,7],[165,8,165,9],[168,8,168,9],[130,6,130,8],[131,6,131,8],[132,6,132,8],[127,6,127,8],[128,6,128,8],[129,6,129,8],[63,6,63,7],[64,6,64,7],[65,6,65,7],[66,6,66,7],[67,6,67,7],[50,6,50,7],[51,6,51,7],[52,6,52,7],[53,6,53,7],[54,6,54,7],[55,6,55,7],[56,6,56,7],[57,6,57,7],[58,6,58,7],[18,6,18,8],[19,6,19,8],[20,6,20,8],[21,6,21,8],[22,6,22,8],[42,6,42,8],[43,6,43,8],[44,6,44,8],[28,6,28,8],[29,6,29,8],[30,6,30,8],[31,6,31,8],[23,6,23,8],[24,6,24,8],[25,6,25,8],[26,6,26,8],[27,6,27,8],[40,6,40,8],[37,6,37,8],[41,6,41,8],[38,6,38,8],[39,6,39,8],[212,1,214,1],[212,2,214,2],[214,3,214,5],[82,9,84,9],[162,2,162,4],[162,5,162,7],[162,1,164,1],[164,5,164,7],[133,6,133,8],[134,6,134,8],[135,6,135,8],[136,6,136,8],[137,6,137,8],[138,6,138,8],[139,6,139,8],[140,6,140,8],[141,6,141,8],[142,6,142,8],[143,6,143,8],[144,6,144,8],[145,6,145,8],[212,9,214,9],[117,6,118,8],[121,6,121,8],[37,2,37,5],[5,1,5,2],[25,2,25,5],[26,2,26,5],[27,2,27,5],[28,2,28,5],[29,2,29,5],[30,2,30,5],[42,2,42,5],[31,2,31,5],[32,2,32,5],[14,1,14,4],[13,1,13,4],[33,2,33,5],[24,2,24,5],[17,2,17,5],[18,2,18,5],[19,2,19,5],[20,2,20,5],[21,2,21,5],[22,2,22,5],[23,2,23,5],[248,1,249,1],[248,2,249,2],[312,4,312,6],[10,1,10,2],[82,3,82,5],[82,1,84,1],[82,2,84,2],[11,1,11,2],[164,2,164,4],[84,3,84,5],[82,6,82,8],[84,6,84,8],[17,6,17,8],[32,6,32,8],[33,6,33,8],[34,2,34,5],[34,6,34,8],[35,2,35,5],[35,6,35,8],[36,2,36,5],[36,6,36,8],[249,3,249,5],[311,4,311,6],[43,2,43,5],[337,4,337,6],[338,4,338,6],[324,4,324,6],[313,4,313,6],[314,4,314,6],[315,4,315,6],[316,4,316,6],[317,4,317,6],[318,4,318,6],[325,4,325,6],[326,4,326,6],[321,4,321,6],[322,4,322,6],[323,4,323,6],[332,4,332,6],[333,4,333,6],[334,4,334,6],[336,4,336,6],[331,4,331,6],[335,4,335,6],[329,4,329,6],[330,4,330,6],[327,4,327,6],[328,4,328,6],[319,4,319,6],[320,4,320,6],[214,6,214,8],[212,3,212,5],[212,6,212,8],[40,2,40,5],[41,2,41,5],[38,2,38,5],[39,2,39,5],[119,6,119,8],[120,6,120,8],[44,2,44,5],[68,6,68,7],[69,6,69,7],[70,6,70,7],[122,6,122,8],[123,6,123,8],[124,6,124,8],[125,6,125,8],[126,6,126,8],[59,6,59,7],[60,6,60,7],[61,6,61,7],[62,6,62,7]]}
[null,{"$f":"(LOOKUP(dms_Model,dms_Model_List,dms_Worksheet_List))","v":"REGULATORY REPORTING STATEMENT"}]
[null,{"$f":"dms_TradingName","v":"Ausgrid"}]
[null,{"$f":"CONCATENATE(\"Annual Reporting RIN Response \",CRY)","v":"Annual Reporting RIN Response 2015-16"}]
[null,"7.12 SAFETY AND BUSHFIRE RELATED EXPENDITURE"]
[]
[null,"These templates collect information from Victorian businesses only.\n\nBushfire and safety related expenditure information is used by the AER to monitor the expenditures throughout the regulatory control period."]
[]
[null,"CPI applied to convert expected expenditure in real $ to nominal based on lagged September CPI index"]
[]
[null,"Instructions"]
[null,"For \"Exclusive of Margins & Overheads\" reported expenditure is to EXCLUDE any overheads, profit margins or management fees paid directly or indirectly to related party contractors (not including actual incurred expense of the related party contractor) for the reporting period."]
[null,"For \"Value of Margins & Overheads\" reported expenditure is to COMPRISE ONLY the sum of overheads, profit margins or management fees paid directly or indirectly to related party contractors (not including actual incurred expenses of the related party contractor) for the reporting period. "]
[]
[null,{"$f":"CONCATENATE(dms_TradingName, \" is to specify each activity in this table in accordance with the definition in Appendix F of the RIN.\")","v":"Ausgrid is to specify each activity in this table in accordance with the definition in Appendix F of the RIN."}]
[null,"All activities must be reported but the Reason for Difference is only required if there is a 10 per cent difference between the expected value and the actual value.\n\nUse median unit costs. Where unit costs are not recorded at the asset category level - provide the best estimates of the unit cost using the cost allocation method identified in this table. (As a transitional measure, the unit cost may be based on a statistically significant annual sample of actual work orders at a 5% or better confidence interval.)\n\nProvide basis of allocation where applicable."]
[]
[null,"7.12.1 - SAFETY AND BUSHFIRE RELATED ASSET GROUP DEFINITIONS AND ALLOCATION BASIS"]
[null,"Activity","Definitions",null,null,null,"Basis for allocation of cost to activity"]
[null,"Planned non-preferred services replacements"]
[null,"Planned replacement of non-preferred services due to height "]
[null,"Removal of public lighting switchwire "]
[null,"Replacement of existing SWER lines with 22kV overhead bare conductor "]
[null,"Installation of GFN and associated equipment at zone substations "]
[null,"Replacement of crossarms/insulator sets – pole top fire mitigation"]
[null,"Replacement of crossarms – based on age and condition "]
[null,"Replacement of poles – based on age and condition "]
[null,"Stake poles – based on age and condition "]
[null,"Replacement of undersized poles "]
[null,"Stake undersized poles"]
[null,"Replacement of overhead conductor – mainly steel "]
[null,"Service line clearance – overhead services requiring relocation "]
[null,"Service line clearance – overhead services requiring undergrounding "]
[null,"Replacement of 22kV distribution feeders with ABC/underground cabling"]
[null,"Replacement of SWER with covered carbon core conductor or equivalent"]
[null,"Replacement of SWER with ABC"]
[null,"Replacement of SWER with underground"]
[null,"Replacement of surge diverters (neptune configuration)"]
[null,"Replacement of surge diverters (single phase or three phase)"]
[]
[]
[]
[]
[]
[]
[]
[null,"To enter further activities - please copy row from above and \"insert copied cells\" into a row above this row. "]
[]
[null,"7.12.2 - BUSHFIRE RELATED"]
[]
[null,"7.12.2.1 - NUMBER OF ACTIVITIES"]
[null,"Activity","Units","AER expected number","Actual Number","Difference","Reasons for Difference"]
[null,"Planned non-preferred services replacements","number of services",null,null,{"$f":"D52-E52","v":0}]
[null,"Planned replacement of non-preferred services due to height ","number of services",null,null,{"$f":"D53-E53","v":0}]
[null,"Removal of public lighting switchwire ","number of spans removed",null,null,0]
[null,"Replacement of existing SWER lines with 22kV overhead bare conductor ","kms of SWER",null,null,0]
[null,"Installation of GFN and associated equipment at zone substations ","number of zone substations",null,null,{"$f":"D56-E56","v":0}]
[null,"Replacement of crossarms/insulator sets – pole top fire mitigation","number of crossarms/sets",null,null,0]
[null,"Replacement of crossarms – based on age and condition ","number of crossarms",null,null,0]
[null,"Replacement of poles – based on age and condition ","number of poles",null,null,0]
[null,"Stake poles – based on age and condition ","number of poles",null,null,0]
[null,"Replacement of undersized poles ","number of poles",null,null,0]
[null,"Stake undersized poles","number of poles",null,null,0]
[null,"Replacement of overhead conductor – mainly steel ","kms ",null,null,0]
[null,"Service line clearance – overhead services requiring relocation ","number of services",null,null,0]
[null,"Service line clearance – overhead services requiring undergrounding ","number of services",null,null,0]
[null,"Replacement of 22kV distribution feeders with ABC/underground cabling","number of feeders",null,null,0]
[null,"Replacement of SWER with covered carbon core conductor or equivalent","kms ",null,null,0]
[null,"Replacement of SWER with ABC","kms ",null,null,0]
[null,"Replacement of SWER with underground","kms ",null,null,0]
[null,"Replacement of surge diverters (neptune configuration)","number of units",null,null,{"$f":"D70-E70","v":0}]
[null,"Replacement of surge diverters (single phase or three phase)","number of units",null,null,0]
[null,{"$f":"IF(ISBLANK(B39),\"\",B39)","v":""},null,null,null,{"$f":"D72-E72","v":0}]
[null,{"$f":"IF(ISBLANK(B40),\"\",B40)","v":""},null,null,null,0]
[null,"",null,null,null,0]
[null,"",null,null,null,0]
[null,"",null,null,null,0]
[null,"",null,null,null,0]
[null,"",null,null,null,0]
[null,"To enter further activities - please copy row from above and \"insert copied cells\" into a row above this row. "]
[]
[]
[null,"7.12.2.2 - EXPENDITURE "]
[null,"Activity","Units","Exclusive of Margins & Overheads",null,null,"Value of Margins & Overheads",null,null,"Reasons for Difference"]
[null,null,null,"AER expected expenditure ","Actual expenditure","Difference  ","AER expected expenditure ","Actual expenditure","Difference  "]
[null,null,null,"$0's, Nominal",null,null,"$0's, Nominal"]
[null,"Planned non-preferred services replacements","number of services",null,null,{"$f":"D86*$C$8-E86","v":0},null,null,{"$f":"G86*$C$8-H86","v":0}]
[null,"Planned replacement of non-preferred services due to height ","number of services",null,null,{"$f":"D87*$C$8-E87","v":0},null,null,{"$f":"G87*$C$8-H87","v":0}]
[null,"Removal of public lighting switchwire ","number of spans removed",null,null,0,null,null,0]
[null,"Replacement of existing SWER lines with 22kV overhead bare conductor ","kms of SWER",null,null,0,null,null,0]
[null,"Installation of GFN and associated equipment at zone substations ","number of zone substations",null,null,0,null,null,0]
[null,"Replacement of crossarms/insulator sets – pole top fire mitigation","number of crossarms/sets",null,null,0,null,null,0]
[null,"Replacement of crossarms – based on age and condition ","number of crossarms",null,null,0,null,null,0]
[null,"Replacement of poles – based on age and condition ","number of poles",null,null,0,null,null,0]
[null,"Stake poles – based on age and condition ","number of poles",null,null,0,null,null,0]
[null,"Replacement of undersized poles ","number of poles",null,null,0,null,null,0]
[null,"Stake undersized poles","number of poles",null,null,0,null,null,0]
[null,"Replacement of overhead conductor – mainly steel ","kms ",null,null,0,null,null,0]
[null,"Service line clearance – overhead services requiring relocation ","number of services",null,null,0,null,null,0]
[null,"Service line clearance – overhead services requiring undergrounding ","number of services",null,null,0,null,null,0]
[null,"Replacement of 22kV distribution feeders with ABC/underground cabling","number of feeders",null,null,0,null,null,0]
[null,"Replacement of SWER with covered carbon core conductor or equivalent","kms ",null,null,0,null,null,0]
[null,"Replacement of SWER with ABC","kms ",null,null,0,null,null,0]
[null,"Replacement of SWER with underground","kms ",null,null,0,null,null,0]
[null,"Replacement of surge diverters (neptune configuration)","number of units",null,null,0,null,null,0]
[null,"Replacement of surge diverters (single phase or three phase)","number of units",null,null,0,null,null,0]
[null,{"$f":"IF(ISBLANK(B39),\"\",B39)","v":""},{"$f":"IF(ISBLANK(C72),\"\",C72)","v":""},null,null,0,null,null,0]
[null,"","",null,null,{"$f":"D107*$C$8-E107","v":0},null,null,{"$f":"G107*$C$8-H107","v":0}]
[null,"","",null,null,0,null,null,0]
[null,"","",null,null,0,null,null,0]
[null,"","",null,null,0,null,null,0]
[null,"","",null,null,0,null,null,0]
[null,"","",null,null,0,null,null,0]
[null,"To enter further activities - please copy row from above and \"insert copied cells\" into a row above this row. "]
[]
[]
[]
[null,"7.12.2.3 - UNIT COSTS"]
[null,"Activity",null,"AER expected ","Actual","Difference","Reasons for Difference"]
[null,null,null,"$0's, Per Unit"]
[null,"Planned non-preferred services replacements",null,null,null,{"$f":"D120*$C$8-E120","v":0}]
[null,"Planned replacement of non-preferred services due to height ",null,null,null,0]
[null,"Removal of public lighting switchwire ",null,null,null,0]
[null,"Replacement of existing SWER lines with 22kV overhead bare conductor ",null,null,null,0]
[null,"Installation of GFN and associated equipment at zone substations ",null,null,null,0]
[null,"Replacement of crossarms/insulator sets – pole top fire mitigation",null,null,null,0]
[null,"Replacement of crossarms – based on age and condition ",null,null,null,0]
[null,"Replacement of poles – based on age and condition ",null,null,null,0]
[null,"Stake poles – based on age and condition ",null,null,null,0]
[null,"Replacement of undersized poles ",null,null,null,0]
[null,"Stake undersized poles",null,null,null,0]
[null,"Replacement of overhead conductor – mainly steel ",null,null,null,0]
[null,"Service line clearance – overhead services requiring relocation ",null,null,null,0]
[null,"Service line clearance – overhead services requiring undergrounding ",null,null,null,0]
[null,"Replacement of 22kV distribution feeders with ABC/underground cabling",null,null,null,0]
[null,"Replacement of SWER with covered carbon core conductor or equivalent",null,null,null,0]
[null,"Replacement of SWER with ABC",null,null,null,0]
[null,"Replacement of SWER with underground",null,null,null,0]
[null,"Replacement of surge diverters (neptune configuration)",null,null,null,0]
[null,"Replacement of surge diverters (single phase or three phase)",null,null,null,0]
[null,{"$f":"IF(ISBLANK(B39),\"\",B39)","v":""},null,null,null,0]
[null,"",null,null,null,0]
[null,"",null,null,null,0]
[null,"",null,null,null,0]
[null,"",null,null,null,0]
[null,"",null,null,null,0]
[null,"",null,null,null,0]
[null,"To enter further activities - please copy row from above and \"insert copied cells\" into a row above this row. "]
[]
[]
[null,"7.12.2.4 - CONTINGENT PROJECT APPLICATIONS - VOLUMES APPROVED"]
[null,"Activity","Units","Volume approved under contingent project applications ","Actual volumes","Difference"]
[null,null,null,null,null,{"$f":"E152-D152","v":0}]
[null,null,null,null,null,0]
[null,null,null,null,null,0]
[null,null,null,null,null,0]
[null,null,null,null,null,0]
[null,null,null,null,null,0]
[null,null,null,null,null,0]
[null,null,null,null,null,0]
[null,"To enter further activities - please copy row from above and \"insert copied cells\" into a row above this row. "]
[]
[null,"7.12.2.5 - CONTINGENT PROJECT APPLICATIONS - EXPENDITURE APPROVED"]
[null,"Activity","Exclusive of Margins & Overheads",null,null,"Value of Margins & Overheads",null,null,"Reasons for Difference"]
[null,null,"Expenditure approved under contingent project applications","Actual expenditure ","Difference","Expenditure approved under contingent project applications","Actual expenditure","Difference"]
[null,null,"$0's, Nominal",null,null,"$0's, Nominal"]
[null,{"$f":"IF(ISBLANK(B152),\"\",B152)","v":""},null,null,{"$f":"C166-D166","v":0},null,null,{"$f":"F166-G166","v":0}]
[null,{"$f":"IF(ISBLANK(B153),\"\",B153)","v":""},null,null,{"$f":"C167-D167","v":0},null,null,{"$f":"F167-G167","v":0}]
[null,"",null,null,0,null,null,0]
[null,"",null,null,0,null,null,0]
[null,"",null,null,0,null,null,0]
[null,"",null,null,0,null,null,0]
[null,"",null,null,0,null,null,0]
[null,"",null,null,0,null,null,0]
[null,"To enter further activities - please copy row from above and \"insert copied cells\" into a row above this row. "]
[]
[]
[]
[null,"7.12.3 - SAFETY RELATED"]
[]
[null,"7.12.3.1 - NUMBER OF ACTIVITIES"]
[null,"Activity","Units","AER expected volumes","Actual units","Difference","Reasons for Difference"]
[null,"Planned non-preferred services replacements","number of services",null,null,{"$f":"D182-E182","v":0}]
[null,"Planned replacement of non-preferred services due to height ","number of services",null,null,{"$f":"D183-E183","v":0}]
[null,"Removal of public lighting switchwire ","number of spans removed",null,null,0]
[null,"Replacement of existing SWER lines with 22kV overhead bare conductor ","kms of SWER",null,null,0]
[null,"Installation of GFN and associated equipment at zone substations ","number of zone substations",null,null,0]
[null,"Replacement of crossarms/insulator sets – pole top fire mitigation","number of crossarms/sets",null,null,0]
[null,"Replacement of crossarms – based on age and condition ","number of crossarms",null,null,0]
[null,"Replacement of poles – based on age and condition ","number of poles",null,null,0]
[null,"Stake poles – based on age and condition ","number of poles",null,null,0]
[null,"Replacement of undersized poles ","number of poles",null,null,0]
[null,"Stake undersized poles","number of poles",null,null,0]
[null,"Replacement of overhead conductor – mainly steel ","kms ",null,null,0]
[null,"Service line clearance – overhead services requiring relocation ","number of services",null,null,0]
[null,"Service line clearance – overhead services requiring undergrounding ","number of services",null,null,0]
[null,"Replacement of 22kV distribution feeders with ABC/underground cabling","number of feeders",null,null,0]
[null,"Replacement of SWER with covered carbon core conductor or equivalent","kms ",null,null,0]
[null,"Replacement of SWER with ABC","kms ",null,null,{"$f":"D198-E198","v":0}]
[null,"Replacement of SWER with underground","kms ",null,null,{"$f":"D199-E199","v":0}]
[null,"Replacement of surge diverters (neptune configuration)","number of units",null,null,0]
[null,"Replacement of surge diverters (single phase or three phase)","number of units",null,null,0]
[null,{"$f":"IF(ISBLANK(B39),\"\",B39)","v":""},{"$f":"IF(ISBLANK(C72),\"\",C72)","v":""},null,null,0]
[null,"","",null,null,0]
[null,"","",null,null,{"$f":"D204-E204","v":0}]
[null,"","",null,null,{"$f":"D205-E205","v":0}]
[null,"","",null,null,{"$f":"D206-E206","v":0}]
[null,"","",null,null,0]
[null,"","",null,null,0]
[null,"To enter further activities - please copy row from above and \"insert copied cells\" into a row above this row. "]
[]
[]
[null,"7.12.3.2 - EXPENDITURE"]
[null,"Activity","Units","Exclusive of Margins & Overheads",null,null,"Value of Margins & Overheads",null,null,"Reasons for Difference"]
[null,null,null,"AER expected expenditure ","Actual expenditure","Difference  ","AER expected expenditure ","Actual expenditure","Difference  "]
[null,null,null,"$0's, Nominal",null,null,"$0's, Nominal"]
[null,"Planned non-preferred services replacements","number of services",null,null,{"$f":"D216*$C$8-E216","v":0},null,null,{"$f":"G216*$C$8-H216","v":0}]
[null,"Planned replacement of non-preferred services due to height ","number of services",null,null,{"$f":"D217*$C$8-E217","v":0},null,null,{"$f":"G217*$C$8-H217","v":0}]
[null,"Removal of public lighting switchwire ","number of spans removed",null,null,0,null,null,0]
[null,"Replacement of existing SWER lines with 22kV overhead bare conductor ","kms of SWER",null,null,0,null,null,0]
[null,"Installation of GFN and associated equipment at zone substations ","number of zone substations",null,null,0,null,null,0]
[null,"Replacement of crossarms/insulator sets – pole top fire mitigation","number of crossarms/sets",null,null,0,null,null,0]
[null,"Replacement of crossarms – based on age and condition ","number of crossarms",null,null,0,null,null,0]
[null,"Replacement of poles – based on age and condition ","number of poles",null,null,0,null,null,0]
[null,"Stake poles – based on age and condition ","number of poles",null,null,0,null,null,0]
[null,"Replacement of undersized poles ","number of poles",null,null,0,null,null,0]
[null,"Stake undersized poles","number of poles",null,null,0,null,null,0]
[null,"Replacement of overhead conductor – mainly steel ","kms ",null,null,0,null,null,0]
[null,"Service line clearance – overhead services requiring relocation ","number of services",null,null,0,null,null,0]
[null,"Service line clearance – overhead services requiring undergrounding ","number of services",null,null,0,null,null,0]
[null,"Replacement of 22kV distribution feeders with ABC/underground cabling","number of feeders",null,null,0,null,null,0]
[null,"Replacement of SWER with covered carbon core conductor or equivalent","kms ",null,null,0,null,null,0]
[null,"Replacement of SWER with ABC","kms ",null,null,{"$f":"D232-E232","v":0},null,null,{"$f":"G232-H232","v":0}]
[null,"Replacement of SWER with underground","kms ",null,null,{"$f":"D233-E233","v":0},null,null,{"$f":"G233-H233","v":0}]
[null,"Replacement of surge diverters (neptune configuration)","number of units",null,null,0,null,null,0]
[null,"Replacement of surge diverters (single phase or three phase)","number of units",null,null,0,null,null,0]
[null,{"$f":"IF(ISBLANK(B39),\"\",B39)","v":""},{"$f":"IF(ISBLANK(C72),\"\",C72)","v":""},null,null,0,null,null,0]
[null,"","",null,null,0,null,null,0]
[null,"","",null,null,{"$f":"D238-E238","v":0},null,null,{"$f":"G238-H238","v":0}]
[null,"","",null,null,{"$f":"D239-E239","v":0},null,null,{"$f":"G239-H239","v":0}]
[null,"","",null,null,{"$f":"D240-E240","v":0},null,null,{"$f":"G240-H240","v":0}]
[null,"","",null,null,0,null,null,0]
[null,"","",null,null,0,null,null,0]
[null,"To enter further activities - please copy row from above and \"insert copied cells\" into a row above this row. "]
[]
[]
[]
[]
[null,"7.12.3.3 - UNIT COSTS"]
[null,"Activity","Units","AER expected","Actual\n  ","Difference\n  ","Reasons for Difference"]
[null,null,null,"$0's per Unit"]
[null,"Planned non-preferred services replacements","number of services",null,null,{"$f":"D251*$C$8-E251","v":0}]
[null,"Planned replacement of non-preferred services due to height ","number of services",null,null,0]
[null,"Removal of public lighting switchwire ","number of spans removed",null,null,0]
[null,"Replacement of  existing SWER lines with 22kV overhead bare conductor ","kms of SWER",null,null,0]
[null,"Installation of GFN and associated equipment at zone substations ","number of zone substations",null,null,0]
[null,"Replacement of crossarms/insulator sets – pole top fire mitigation","number of crossarms/sets",null,null,0]
[null,"Replacement of crossarms – based on age and condition ","number of crossarms",null,null,0]
[null,"Replacement of poles – based on age and condition ","number of poles",null,null,0]
[null,"Stake poles – based on age and condition ","number of poles",null,null,0]
[null,"Replacement of undersized poles ","number of poles",null,null,0]
[null,"Stake undersized poles","number of poles",null,null,0]
[null,"Replacement of overhead conductor – mainly steel ","kms ",null,null,0]
[null,"Service line clearance – overhead services requiring relocation ","number of services",null,null,0]
[null,"Service line clearance – overhead services requiring undergrounding ","number of services",null,null,0]
[null,"Replacement of 22kV distribution feeders with ABC/underground cabling","number of feeders",null,null,0]
[null,"Replacement of SWER with covered carbon core conductor or equivalent","kms ",null,null,0]
[null,"Replacement of SWER with ABC","kms ",null,null,{"$f":"D267-E267","v":0}]
[null,"Replacement of SWER with underground","kms ",null,null,{"$f":"D268-E268","v":0}]
[null,"Replacement of surge diverters (neptune configuration)","number of units",null,null,0]
[null,"Replacement of surge diverters (single phase or three phase)","number of units",null,null,0]
[null,{"$f":"IF(ISBLANK(B39),\"\",B39)","v":""},{"$f":"IF(ISBLANK(C72),\"\",C72)","v":""},null,null,0]
[null,"","",null,null,0]
[null,"","",null,null,{"$f":"D273-E273","v":0}]
[null,"","",null,null,{"$f":"D274-E274","v":0}]
[null,"","",null,null,{"$f":"D275-E275","v":0}]
[null,"","",null,null,0]
[null,"","",null,null,0]
[null,"To enter further activities - please copy row from above and \"insert copied cells\" into a row above this row. "]
[]
[null,"7.12.3.4 - SAFETY IMPROVEMENT OUTCOMES REPORTED TO ESV"]
[null,"Activity","Units","Safety Improvement Programme - outcomes","Safety Improvement Target","Difference","Reasons for Difference"]
[null,"Planned non-preferred services replacements","number of services",null,null,{"$f":"D282-E282","v":0}]
[null,"Planned replacement of non-preferred services due to height ","number of services",null,null,{"$f":"D283-E283","v":0}]
[null,"Removal of public lighting switchwire ","number of spans removed",null,null,0]
[null,"Replacement of  existing SWER lines with 22kV overhead bare conductor ","kms of SWER",null,null,0]
[null,"Installation of GFN and associated equipment at zone substations ","number of zone substations",null,null,0]
[null,"Replacement of crossarms/insulator sets – pole top fire mitigation","number of crossarms/sets",null,null,0]
[null,"Replacement of crossarms – based on age and condition ","number of crossarms",null,null,0]
[null,"Replacement of poles – based on age and condition ","number of poles",null,null,0]
[null,"Stake poles – based on age and condition ","number of poles",null,null,0]
[null,"Replacement of undersized poles ","number of poles",null,null,0]
[null,"Stake undersized poles","number of poles",null,null,0]
[null,"Replacement of overhead conductor – mainly steel ","kms ",null,null,0]
[null,"Service line clearance – overhead services requiring relocation ","number of services",null,null,0]
[null,"Service line clearance – overhead services requiring undergrounding ","number of services",null,null,0]
[null,"Replacement of 22kV distribution feeders with ABC/underground cabling","number of feeders",null,null,0]
[null,"Replacement of SWER with covered carbon core conductor or equivalent","kms ",null,null,0]
[null,"Replacement of SWER with ABC","kms ",null,null,0]
[null,"Replacement of SWER with underground","kms ",null,null,{"$f":"D299-E299","v":0}]
[null,"Replacement of surge diverters (neptune configuration)","number of units",null,null,0]
[null,"Replacement of surge diverters (single phase or three phase)","number of units",null,null,0]
[null,{"$f":"IF(ISBLANK(B39),\"\",B39)","v":""},{"$f":"IF(ISBLANK(C72),\"\",C72)","v":""},null,null,0]
[null,"","",null,null,0]
[null,"","",null,null,{"$f":"D304-E304","v":0}]
[null,"","",null,null,{"$f":"D305-E305","v":0}]
[null,"","",null,null,{"$f":"D306-E306","v":0}]
[null,"","",null,null,0]
[null,"","",null,null,0]
[null,"To enter further activities - please copy row from above and \"insert copied cells\" into a row above this row. "]
[]
[null,"7.12.3.5 - SAFETY IMPROVEMENT OUTCOMES RECONCILIATION"]
[null,"Activity","Units","Difference","Reasons for Difference"]
[null,"Planned non-preferred services replacements","number of services",{"$f":"D282-E52-E182","v":0}]
[null,"Planned replacement of non-preferred services due to height ","number of services",0]
[null,"Removal of public lighting switchwire ","number of spans removed",0]
[null,"Replacement of  existing SWER lines with 22kV overhead bare conductor ","kms of SWER",0]
[null,"Installation of GFN and associated equipment at zone substations ","number of zone substations",0]
[null,"Replacement of crossarms/insulator sets – pole top fire mitigation","number of crossarms/sets",0]
[null,"Replacement of crossarms – based on age and condition ","number of crossarms",0]
[null,"Replacement of poles – based on age and condition ","number of poles",0]
[null,"Stake poles – based on age and condition ","number of poles",0]
[null,"Replacement of undersized poles ","number of poles",0]
[null,"Stake undersized poles","number of poles",0]
[null,"Replacement of overhead conductor – mainly steel ","kms ",0]
[null,"Service line clearance – overhead services requiring relocation ","number of services",0]
[null,"Service line clearance – overhead services requiring undergrounding ","number of services",0]
[null,"Replacement of 22kV distribution feeders with ABC/underground cabling","number of feeders",0]
[null,"Replacement of SWER with covered carbon core conductor or equivalent","kms ",0]
[null,"Replacement of SWER with ABC","kms ",0]
[null,"Replacement of SWER with underground","kms ",0]
[null,"Replacement of surge diverters (neptune configuration)","number of units",0]
[null,"Replacement of surge diverters (single phase or three phase)","number of units",0]
[null,{"$f":"IF(ISBLANK(B39),\"\",B39)","v":""},{"$f":"IF(ISBLANK(C72),\"\",C72)","v":""},{"$f":"D302-E73-E202","v":0}]
[null,"","",0]
[null,"","",0]
[null,"","",0]
[null,"","",0]
[null,"","",0]
[null,"","",0]
[null,"To enter further activities - please copy row from above and \"insert copied cells\" into a row above this row. "]

{"sheet":"7.13 TARC","index":18,"n_rows":9,"n_cols":3,"rows_kept":9,"cut":false,"hidden":false,"merged":[]}
[null,{"$f":"(LOOKUP(dms_Model,dms_Model_List,dms_Worksheet_List))","v":"REGULATORY REPORTING STATEMENT"}]
[null,{"$f":"dms_TradingName","v":"Ausgrid"}]
[null,{"$f":"CONCATENATE(\"Annual Reporting RIN Response \",CRY)","v":"Annual Reporting RIN Response 2015-16"}]
[null,"7.13 - TARC"]
[]
[]
[null,"7.13.1 - TOTAL ANNUAL RETAILER CHARGES"]
[null,null,"$0's"]
[null,"TARC",2428971721.4510002]

{"sheet":"8.1 Income","index":19,"n_rows":40,"n_cols":12,"rows_kept":40,"cut":false,"hidden":false,"merged":[[6,1,9,1],[6,6,6,10],[7,8,7,10],[6,11,8,11],[9,2,9,11],[6,5,8,5],[7,6,7,7],[6,2,8,2],[6,3,8,3],[6,4,8,4]]}
[null,{"$f":"(LOOKUP(dms_Model,dms_Model_List,dms_Worksheet_List))","v":"REGULATORY REPORTING STATEMENT"}]
[null,{"$f":"dms_TradingName","v":"Ausgrid"}]
[null,{"$f":"CONCATENATE(\"Annual Reporting RIN Response \",CRY)","v":"Annual Reporting RIN Response 2015-16"}]
[null,"8.1 - INCOME"]
[]
[null,"8.1.1 - INCOME STATEMENT"]
[null,"Description","Audited Statutory Accounts","Adjustments","Distribution business","Standard Control Services","Alternative Control Services",null,null,null,null,"Negotiated Services"]
[null,null,null,null,null,null,"Public Lighting",null,"Other"]
[null,null,null,null,null,null,{"$f":"IF(dms_Jurisdiction=\"Vic\",\"Energy efficient\",\"\")","v":""},{"$f":"IF(dms_Jurisdiction=\"Vic\",\"Non-energy efficient\",\"\")","v":""},"Connection services","Metering services","Ancillary network services"]
[null,null,"$0's, nominal"]
[]
[null,"8.1.1.1 - REVENUE"]
[null,"Distribution revenue",0,1649280023.6865537,1649280023.6865537,1505329034.9465537,42363453.910000004,null,22047307.729999997,65110922.629999988,14429304.469999999]
[null,"Cross boundary revenue",0,0,0,0,0,null,0,0,0]
[null,"Contributions",91227889.390000001,-11295.839398175478,91216593.550601825,77181816.668077186,10059562.70661631,null,1643.9310714595415,3970459.3280805959,3110.9167562752718]
[null,"Interest income",339973.22000000003,0,339973.22000000003,339973.22000000003,0,null,0,0,0]
[null,"Jurisdictional scheme amounts",0,204957927.21769947,204957927.21769947,204957927.21769947,0,null,0,0,0]
[null,"Profit from sale of fixed assets",51093308.599999994,4310552.8328800574,55403861.432880051,53551383.667366825,433412.60975125676,null,149284.07060040874,975326.40927259682,294454.67588896677]
[null,"TUOS revenue",0,521761267.63574702,521761267.63574702,521761267.63574702,0,null,0,0,0]
[null,"Pass through revenue (F-factor)",0,0,0,0,0,null,0,0,0]
[null,"Other Revenue ",2535896806.7199998,-2535346581.7337899,550224.98621000024,534295.77713000018,10436.26194,null,1393.8127500000003,3423.1527500000007,675.98164000000008]
[null,"Total revenue",{"$f":"SUM(C13:C21)","v":2678557977.9299998},-155048106.20030785,2523509871.729692,2363655699.1325746,52866865.488307573,0,22199629.544421867,70060131.520103186,14727546.044285242,0]
[]
[null,"8.1.1.2 - EXPENDITURE"]
[null,"TUOS expenditure",0,478556222.79664809,478556222.79664809,478556222.79664809,0,null,0,0,0]
[null,"Avoided TUOS expenditure",0,294174.08000000002,294174.08000000002,294174.08000000002,0,null,0,0,0]
[null,"Cross boundary expenditure",0,0,0,0,0,null,0,0,0]
[null,"Depreciation ",549896386.57999277,-5606244.8507777452,544290141.72921503,504478814.00385165,24460498.43674789,null,357602.89048594015,14786669.114484843,206557.28364467318]
[null,"Finance charges",999121275.32000017,15326088.226072907,1014447363.5460731,952540710.78185153,24217456.707602907,null,259948.4368443898,37202681.234047741,226566.38572651439]
[null,"Impairment losses",0,0,0,0,0,null,0,0,0]
[null,"Jurisdictional scheme amounts",0,202500740.48000002,202500740.48000002,202500740.48000002,0,null,0,0,0]
[null,"Loss from sale of fixed assets",0,0,0,0,0,null,0,0,0]
[null,"Maintenance expenditure",0,217361584.28000003,217361584.28000003,199039057.98000005,18322526.299999986,null,0,0,0]
[null,"Operating expenditure excluding maintenance expenditure",0,468781929.91787726,468781929.91787726,390840382.14951271,8381529.4848109297,null,35684475.286217719,22554566.688916989,11320976.308418894]
[null,"Other ",1322507163.3703628,-1322507163.3703628,0,0,0,null,0,0,0]
[]
[null,"8.1.1.3 - PROFIT"]
[null,"Profit before tax (PBT)",{"$f":"C22-SUM(C25:C35)","v":-192966847.34035587},-209755437.75976562,-402722285.1001215,-364594403.13928938,-22515145.44085414,0,-14102397.069126181,-4483785.5173463821,2973446.0664951596,0]
[null,"Income tax expenses (/ benefit)",58454421.850000009,-6338746.7962703928,52115675.053729616,63766855.211977147,-6792074.0903748702,null,-4243680.1609141463,-1482343.4432916562,866917.53633314557]
[null,"Profit after tax",{"$f":"C38-C39","v":-251421269.1903559},-203416690.96349522,-454837960.15385109,-428361258.3512665,-15723071.350479269,0,-9858716.9082120359,-3001442.0740547259,2106528.5301620141,{"$f":"L38-L39","v":0}]

{"sheet":"8.2 Capex","index":20,"n_rows":273,"n_cols":10,"rows_kept":273,"cut":false,"hidden":false,"merged":[[212,1,214,1],[148,1,150,1],[212,3,213,3],[150,2,150,3],[214,2,214,3],[148,4,149,4],[212,4,213,4],[148,3,149,3],[148,2,149,2],[212,2,213,2],[6,1,6,4],[41,1,41,4],[10,1,10,4],[7,1,7,4],[8,1,8,4],[14,1,14,4],[16,1,19,1],[16,2,16,9],[17,2,18,2],[17,3,18,3],[17,4,18,4],[17,5,18,5],[17,6,17,9],[19,2,19,3],[19,5,19,9],[83,5,84,5],[43,2,43,5],[44,2,44,5],[55,2,55,5],[56,2,56,5],[50,2,50,5],[51,2,51,5],[49,2,49,5],[83,4,84,4],[85,2,85,3],[45,2,45,5],[46,2,46,5],[47,2,47,5],[65,2,65,3],[57,2,57,5],[83,3,84,3],[63,4,64,4],[81,1,81,2],[58,2,58,5],[63,3,64,3],[63,5,64,5],[83,1,85,1],[83,2,84,2],[65,5,65,9],[48,2,48,5],[62,1,65,1],[63,2,64,2],[52,2,52,5],[53,2,53,5],[54,2,54,5],[62,2,62,9],[63,6,63,9]]}
[null,{"$f":"(LOOKUP(dms_Model,dms_Model_List,dms_Worksheet_List))","v":"REGULATORY REPORTING STATEMENT"}]
[null,{"$f":"dms_TradingName","v":"Ausgrid"}]
[null,{"$f":"CONCATENATE(\"Annual Reporting RIN Response \",CRY)","v":"Annual Reporting RIN Response 2015-16"}]
[null,"8.2 - CAPEX"]
[]
[null,"Instructions"]
[null,"Reported expenditure must EXCLUDE capital contributions (except tables 8.2.1 and 8.2.5 which should include all capital contributions)."]
[null,{"$f":"CONCATENATE(\"Forecast expenditure is to be taken from \",dms_TradingName,\"'s \",dms_DeterminationRef,\".\")","v":"Forecast expenditure is to be taken from Ausgrid's 2014-19 Distribution Determination."}]
[null,"If allocating based on assumptions then provide method in Basis of Preparation. All adjustments must be explained in Basis of Preparation with supporting documentation attached. "]
[]
[null,"For tables 8.2.1 and 8.2.3:\nReported expenditure must INCLUDE any profit margins or management fees paid directly or indirectly to related party contractors (not including actual incurred expenses of the related party contractor) for the regulatory reporting period.\n\n'Related Party Margin Expenditure' must COMPRISE ONLY profit margins or management fees paid directly or indirectly to related party contractors (not including actual incurred expenses of the related party contractor) for the regulatory reporting period."]
[]
[null,"8.2.1 - CAPEX BY PURPOSE - STANDARD CONTROL SERVICES"]
[]
[null,"Each line item in this table must INCLUDE the capital contributions. Total capital contributions should also be identified in the last item in the table. "]
[]
[null,"Description","EXPENDITURE"]
[null,null,"CPI adjusted Forecast","Actual","Difference","Related Party Margin","Voltage level"]
[null,null,null,null,null,null,"Subtransmission","HV","LV","Other "]
[null,null,"$0's, nominal",null," (%)","$0's, nominal"]
[null,"Replacement expenditure",400209172.4822526,286117975.07999998,-0.28507891684394621,0,174468253.52248484,58804989.515107341,50013494.041667305,2831238.0007404508]
[null,"Connections",36474688.861259654,14463732.860000001,-0.60345836218051585,0,-832371.36198641756,14152769.604579452,1102008.8721447333,41325.745262231227]
[null,"Augmentation Expenditure",65558795.127728686,33217465.050000004,-0.49331794482674413,0,12223054.38334492,13699841.941658042,7240647.7414424112,53920.983554631435]
[null,"Non-network",72284832.132445976,25861548.329999998,-0.64222717868923829,0,0,0,0,25861548.329999998]
[null,"capitalised network overheads",135247237.95231628,113589063.05,-0.16013765035225522,0,44060978.570217267,42329337.88489829,26511835.830878414,686910.76400603878]
[null,"capitalised corporate overheads",4680497.3079589289,2560003,-0.45304893229040955,0,0,0,0,2560003]
[null,"Metering",0,0,1,0,0,0,0,0]
[null,"Public Lighting",0,0,1,0,0,0,0,0]
[null,"Capital Contributions",96300046.555343002,75732270.060000002,-0.21358013034316484,0,0,49564182.969999999,26168087.090000004,0]
[null,null,null,{"$f":"SUM(G30:J30)","v":0},{"$f":"IF(C30=0,1,(D30-C30)/C30*1)","v":1}]
[null,null,null,0,1]
[null,null,null,0,1]
[null,null,null,0,1]
[null,null,null,0,1]
[null,null,null,0,1]
[null,"Capital contributions included in the above",null,0,1]
[null,"Total",{"$f":"SUM(C21:C35)","v":810755270.41930521},551542057.43000007,{"$f":"IF(C37=0,1,(D37-C37)/C37*1)","v":-0.31971819665784673},null,{"$f":"SUM(G21:G35)","v":229919915.11406058},{"$f":"SUM(H21:H35)","v":178551121.91624314},111036073.57613286,32034946.823563349]
[]
[]
[null,"8.2.2 - CAPEX BY PURPOSE - MATERIAL DIFFERENCE EXPLANATION"]
[]
[null,"Where the difference between forecast and actual expenditure shown in table 8.2.1 is a Material Difference please explain the main factors driving the difference."]
[]
[null,"Description","Reason for material difference"]
[null,"Replacement expenditure","Reduction in reactive requirements (i.e. conditional & functional breakdowns);\nChange in strategic options for some key major projects (i.e. CBD);\nDelays in contract procurement on some Duty of Care programs."]
[null,"Connections","Faster transition to new connection policy (will result in increased Capital Contributions refer to item below)."]
[null,"Augmentation Expenditure","○ Impact of risk based assessment criteria and improved program governance of HV & LV Augmentation Programs;\n○ CBD Load transfer projects cancelled due to reduction in demand and changed licence conditions. "]
[null,"Non-network","Building works and refurbishment deferrals;\nReduction in minor assets and mobile plant requirements."]
[null,"capitalised network overheads","More labour assessed to Opex as a result of a lower overall Capex expenditure."]
[null,"capitalised corporate overheads","More labour assessed to Opex as a result of a lower overall Capex expenditure."]
[null,"Metering","NA"]
[null,"Public Lighting","NA"]
[null,"Capital Contributions","○ Faster transition to new connection policy. Delay impact as Capital Contributions are recognised post asset commissioning;\n○ Delays in major connections."]
[]
[]
[]
[]
[]
[]
[]
[]
[null,"8.2.3 - CAPEX OTHER"]
[null,null,"EXPENDITURE"]
[null,null,"CPI adjusted Forecast","Actual","Difference","Related Party Margin","Voltage level"]
[null,null,null,null,null,null,"Subtransmission","HV","LV","Other "]
[null,null,"$0's, nominal",null," (%)","$0's, nominal"]
[null,"Public lighting"]
[null,{"$f":"IF(dms_Jurisdiction=\"Vic\",\"Energy Efficient\", \"Total\")","v":"Total"},null,{"$f":"SUM(G68:J68)","v":12965056.730000002},{"$f":"IF(C68=0,1,((D68-C68)/C68)*1)","v":1},null,null,null,12965056.730000002]
[null,{"$f":"IF(dms_Jurisdiction=\"Vic\",\"Non-energy efficient\", \"\")","v":""},null,{"$f":"SUM(G69:J69)","v":0},{"$f":"IF(C69=0,1,((D69-C69)/C69)*1)","v":1}]
[null,"Alternative Control Services"]
[null,"Connection services",null,{"$f":"SUM(G71:J71)","v":5251932.37},{"$f":"IF(C71=0,1,((D71-C71)/C71)*1)","v":1},null,null,null,5111441.62,140490.75000000003]
[null,"Metering services",23162737.812681478,12547006.789999999,{"$f":"IF(C72=0,1,((D72-C72)/C72)*1)","v":-0.45831071907524773},null,null,null,null,12547006.789999999]
[null,"Ancillary network services",null,278579.46000000002,{"$f":"IF(C73=0,1,((D73-C73)/C73)*1)","v":1},null,null,null,null,278579.46000000002]
[null,"Negotiated Services"]
[null,"Negotiated services",null,{"$f":"SUM(G75:J75)","v":0},{"$f":"IF(C75=0,1,((D75-C75)/C75)*1)","v":1}]
[null,"Total",{"$f":"SUM(C68:C69,C71:C73,C75)","v":23162737.812681478},{"$f":"SUM(D68:D69,D71:D73,D75)","v":31042575.350000001},{"$f":"IF(C76=0,1,((C76-#REF!)/#REF!)*1)","v":{"$error":"#REF!"}},null,{"$f":"SUM(G68:G69,G71:G73,G75)","v":0},{"$f":"SUM(H68:H69,H71:H73,H75)","v":0},{"$f":"SUM(I68:I69,I71:I73,I75)","v":18076498.350000001},{"$f":"SUM(J68:J69,J71:J73,J75)","v":12966077}]
[]
[]
[]
[null,"8.2.4 - CAPEX BY ASSET CLASS"]
[]
[null,{"$f":"CONCATENATE(dms_TradingName, \" to enter in Table 8.2.4 each Asset Class specified in its current determination as listed in the AER's final decision in its Roll Forward Model and Post-tax Revenue Model and enter information against that Asset Class.\")","v":"Ausgrid to enter in Table 8.2.4 each Asset Class specified in its current determination as listed in the AER's final decision in its Roll Forward Model and Post-tax Revenue Model and enter information against that Asset Class."}]
[]
[null,"Asset class","CPI adjusted Forecast","Actual ","Difference","Movements in provisions \nallocated to \nas-incurred capex"]
[]
[null,null,"$0's, nominal",null," (%)","$0's, nominal"]
[null,"System Assets - Distribution",null,null,{"$f":"IF(C87=0,1,((D87-C87)/C87)*1)","v":1}]
[null,"Sub-transmission lines and cables ",94857413.382847339,52565733.119999997,{"$f":"IF(C88=0,1,((D88-C88)/C88)*1)","v":-0.44584475535040013},3726369]
[null,"Cable tunnel (dx)",85639.39490546842,2325601.91,26.155748970051413]
[null,"Distribution lines and cables",73694503.700036123,103394200.75999999,0.40301101939505035,521197]
[null,"Substations",192161611.31722465,131448318.12999998,-0.31594912621229959,5467018]
[null,"Transformers",42553470.778567426,11831091.689999999,-0.72197117007060041]
[null,"Ancillary substation equipment (dx)",29023666.910217617,10835662,-0.62666116471363698]
[null,"Low voltage lines and cables",106901233.54222639,72906492.780000001,-0.31800138909340403]
[null,"Customer metering and load control",0,27.36,1]
[null,"Customer metering (digital)",0,0,1]
[null,"Total communications",0,0,1]
[null,"Communications (digital) - dx",null,206417.9,1]
[null,"Land and easements",3658290.7294584629,59068.55,-0.98385351127936638,100000]
[null,"System IT (dx)",21262769.404154036,1286502.1099999999,-0.9394950824350915,871870]
[null,"Emergency spares (major plant, excludes inventory)",0,0,1]
[null,"Sub-total ",564198599.15963757,386859116.31,-0.3143210265211242]
[null,null,null,null,1]
[null,"Non-System Assets - Distribution",null,null,1]
[null,"IT systems",16493112.171591129,9445176.4000000004,-0.42732600726083569]
[null,"Furniture, fittings, plant and equipment",5382722.5570529141,920616.8899999999,-0.82896816987274835]
[null,"Motor vehicles",5223317.8255388923,2528836.27,-0.51585632839810991]
[null,"Buildings",22643271.502653982,6023415.21,-0.73398653064359509]
[null,"Land (non-system)",0,3278161.97,1]
[null,"Other non-system assets",0,586961.88,1]
[null,"Equity raising costs",0,0,1]
[null,"Sub-total ",49742424.056836918,22783168.619999997,-0.54197711406329152]
[null,"Total Distribution",613941023.21647453,409642284.93000001,-0.33276606475348552]
[null,null,null,null,1]
[null,"System Assets - Transmission",null,null,1]
[null,"Transmission and zone land easements",4771635.0249212151,14890.18,-0.99687943861543649]
[null,"Transmission building 132/66kV",16391981.816193031,1056665.6999999997,{"$f":"IF(C117=0,1,((D117-C117)/C117)*1)","v":-0.93553764811060502}]
[null,"Zone buildings 132/66kV",0,3743.0499999999997,1]
[null,"Transmission transformers 132/66kV",6013292.2204472683,330860.65999999992,-0.94497844976251777]
[null,"Transmission sub-station equipment 132/66kv",6377132.9480574736,15111428.560000001,1.3696273361531632]
[null,"Zone sub-station equipment 132/66kV",18849920.416046713,19521548.180000003,3.5630270533213611E-2]
[null,"Transmission and zone emergency spares",0,0,1]
[null,"Ancillary substation equipment",6375019.8695503259,3395004.9699999997,-0.46745186062620492]
[null,"132 kV tower lines",2452794.489792088,6617672.4400000004,1.6980134159388744]
[null,"132kV concrete and steel pole lines",120780.36055591401,536207.63,3.4395266542673406]
[null,"132 kV wood pole lines",1519014.491756482,1075260.98,-0.29213250707263272]
[null,"132kV feeder underground",24016315.688245811,15143831.449999999,-0.36943569336025295]
[null,"Cable tunnel",21779.365552250369,0,-1]
[null,"Network control & communication system",0,0,1]
[null,"Communications (digital)",0,20507.189999999999,1]
[null,"System IT",5154564.2695279336,663575.8600000001,-0.87126441241157093]
[null,"Sub-total ",92064230.960646495,63491196.849999994,-0.3103597761312995]
[null,null,null,null,1]
[null,"Non-System Assets - Transmission",null,null,1]
[null,"IT systems",2801569.3969457354,1321757.1099999999,-0.52820832800323403]
[null,"Furniture, fittings, plant and equipment",914332.58575891017,128572.66,-0.85938086205985675]
[null,"Motor vehicles",887255.40710003616,420068.41,-0.52655300081745438]
[null,"Buildings",3846284.2480952726,459787.03,-0.88045942516398989]
[null,"Land (non-system)",0,250232.78,1]
[null,"Other non-system assets",0,95887.61,1]
[null,"Equity raising costs",0,0,1]
[null,"Sub-total ",8449441.6378999539,2676305.5999999996,-0.68325651389845266]
[null,"Total Transmission",100513672.59854645,66167502.449999996,-0.34170644908902809]
[null,null,null,null,1]
[null,"Total",{"$f":"C143+C113","v":714454695.81502104},{"$f":"D143+D113","v":475809787.38},-0.33402385040353688,{"$f":"SUM(F87:F144)","v":10686454}]
[]
[]
[null,"8.2.5 - CAPITAL CONTRIBUTIONS BY ASSET CLASS"]
[null,"Asset class","CPI Adjusted Forecast","Actual","Difference"]
[]
[null,null,"$0's, nominal",null," (%)"]
[null,"System Assets - Distribution",null,null,{"$f":"IF(C152=0,1,((D152-C152)/C152)*1)","v":1}]
[null,"Sub-transmission lines and cables ",7631537.245523381,0,{"$f":"IF(C153=0,1,((D153-C153)/C153)*1)","v":-1}]
[null,"Cable tunnel (dx)",0,null,1]
[null,"Distribution lines and cables",25556400.378580134,25162714.789999999,-1.5404578999713092E-2]
[null,"Substations",10197381.560299285,18575723.200000003,0.82161696021256081]
[null,"Transformers",0,5825744.9799999995,1]
[null,"Ancillary substation equipment (dx)",68942.245041564427,null,-1]
[null,"Low voltage lines and cables",52845785.125898629,26168087.090000004,-0.50482168014615103]
[null,"Customer metering and load control",0,null,1]
[null,"Customer metering (digital)",0,0,1]
[null,"Total communications",0,null,1]
[null,"Communications (digital) - dx",0,0,1]
[null,"Land and easements",0,null,1]
[null,"System IT (dx)",0,0,1]
[null,"Emergency spares (major plant, excludes inventory)",0,null,1]
[null,"Sub-total ",96300046.555343002,75732270.060000002,-0.21358013034316484]
[null,"",null,null,1]
[null,"Non-System Assets - Distribution",null,null,1]
[null,"IT systems",0,null,1]
[null,"Furniture, fittings, plant and equipment",0,null,1]
[null,"Motor vehicles",0,null,1]
[null,"Buildings",0,null,1]
[null,"Land (non-system)",0,null,1]
[null,"Other non-system assets",0,null,1]
[null,"Equity raising costs",0,null,1]
[null,"Sub-total ",0,null,1]
[null,"",null,null,1]
[null,"System Assets - Transmission",null,null,1]
[null,"Transmission and zone land easements",null,null,1]
[null,"Transmission building 132/66kV",null,null,{"$f":"IF(C181=0,1,((D181-C181)/C181)*1)","v":1}]
[null,"Zone buildings 132/66kV",null,null,1]
[null,"Transmission transformers 132/66kV",null,null,1]
[null,"Transmission sub-station equipment 132/66kv",null,null,1]
[null,"Zone sub-station equipment 132/66kV",null,null,1]
[null,"Transmission and zone emergency spares",null,null,1]
[null,"Ancillary substation equipment",null,null,1]
[null,"132 kV tower lines",null,null,1]
[null,"132kV concrete and steel pole lines",null,null,1]
[null,"132 kV wood pole lines",null,null,1]
[null,"132kV feeder underground",null,null,{"$f":"IF(C191=0,1,((D191-C191)/C191)*1)","v":1}]
[null,"Cable tunnel",null,null,1]
[null,"Network control & communication system",null,null,1]
[null,"Communications (digital)",null,null,1]
[null,"System IT",null,null,1]
[null,"Sub-total ",null,null,1]
[null,"",null,null,1]
[null,"Non-System Assets - Transmission",null,null,1]
[null,"IT systems",null,null,1]
[null,"Furniture, fittings, plant and equipment",null,null,1]
[null,"Motor vehicles",null,null,1]
[null,"Buildings",null,null,1]
[null,"Land (non-system)",null,null,1]
[null,"Other non-system assets",null,null,1]
[null,"Equity raising costs",null,null,1]
[null,"Sub-total ",null,null,1]
[null,"Total Transmission",null,null,1]
[null,null,null,null,1]
[null,"Total",{"$f":"SUM(C167:C208)","v":96300046.555343002},{"$f":"SUM(D167:D208)","v":75732270.060000002},-0.21358013034316484]
[]
[]
[null,"8.2.6 - DISPOSALS BY ASSET CLASS"]
[null,"Asset class","CPI Adjusted Forecast","Actual","Difference"]
[]
[null,null,"$0's, nominal",null," (%)"]
[null,"",null,null,{"$f":"IF(C216=0,1,((D216-C216)/C216)*1)","v":1}]
[null,"Sub-transmission lines and cables ",0,0,{"$f":"IF(C217=0,1,((D217-C217)/C217)*1)","v":1}]
[null,"Cable tunnel (dx)",0,null,1]
[null,"Distribution lines and cables",0,null,1]
[null,"Substations",0,34007,1]
[null,"Transformers",0,null,1]
[null,"Ancillary substation equipment (dx)",0,null,1]
[null,"Low voltage lines and cables",0,null,1]
[null,"Customer metering and load control",0,null,1]
[null,"Customer metering (digital)",0,null,1]
[null,"Total communications",null,null,1]
[null,"Communications (digital) - dx",0,null,1]
[null,"Land and easements",15294167.538580669,45905248.549999982,2.0014872293114743]
[null,"System IT (dx)",0,null,1]
[null,"Emergency spares (major plant, excludes inventory)",null,null,1]
[null,"Sub-total ",15294167.538580669,45939255.549999982,2.0037107566734056]
[null,"Emergency spares (major plant, excludes inventory)",null,null,1]
[null,"Sub-total ",null,null,1]
[null,"IT systems",0,null,1]
[null,"Furniture, fittings, plant and equipment",0,116.92870000000002,1]
[null,"Motor vehicles",2639758.1899237921,5889354.1894806148,1.2310203305593821]
[null,"Buildings",0,null,1]
[null,"Land (non-system)",0,46940954.703069173,1]
[null,"Other non-system assets",0,null,1]
[null,"Equity raising costs",0,null,1]
[null,"Other non-system assets",2639758.1899237921,52830425.82124979,19.01335805033527]
[null,"Total Distribution",17933925.72850446,98769681.371249765,4.5074211227641978]
[null,"Sub-total ",null,null,1]
[null,"System Assets - Transmission",null,null,1]
[null,"Transmission and zone land easements",47990835.657824703,62904688.450000003,0.31076459886031721]
[null,"Transmission building 132/66kV",0,null,{"$f":"IF(C246=0,1,((D246-C246)/C246)*1)","v":1}]
[null,"Zone buildings 132/66kV",0,null,1]
[null,"Transmission transformers 132/66kV",0,null,1]
[null,"Transmission sub-station equipment 132/66kv",0,null,1]
[null,"Zone sub-station equipment 132/66kV",0,null,1]
[null,"Transmission and zone emergency spares",0,null,1]
[null,"Ancillary substation equipment",0,null,1]
[null,"132 kV tower lines",0,1700460.5,1]
[null,"132kV concrete and steel pole lines",0,null,1]
[null,"132 kV wood pole lines",0,null,1]
[null,"132kV feeder underground",0,null,1]
[null,"Cable tunnel",0,null,1]
[null,"Network control & communication system",0,null,1]
[null,"Communications (digital)",0,null,1]
[null,"System IT",0,null,1]
[null,"Sub-total ",47990835.657824703,64605148.950000003,0.34619762428467749]
[null,"Sub-total ",null,null,1]
[null,"Non-System Assets - Transmission",null,null,1]
[null,"IT systems",0,null,1]
[null,"Furniture, fittings, plant and equipment",0,19.4313,1]
[null,"Motor vehicles",454170.57387177442,978697.34344138484,1.1549113917664329]
[null,"Buildings",0,null,1]
[null,"Land (non-system)",0,7800683.4346208246,1]
[null,"Other non-system assets",0,null,1]
[null,"Equity raising costs",null,null,1]
[null,"Sub-total ",454170.57387177442,8779400.2093622088,18.33062315006099]
[null,"Total Transmission",48445006.231696479,73384549.159362212,0.51480110887772679]
[null,"Total",{"$f":"C272+C242","v":66378931.960200936},{"$f":"D272+D242","v":172154230.53061199},1.5935070879692843]

{"sheet":"8.4 Opex","index":21,"n_rows":155,"n_cols":14,"rows_kept":155,"cut":false,"hidden":false,"merged":[[6,1,6,4],[14,1,14,5],[16,2,18,2],[16,3,18,3],[16,4,18,4],[12,1,12,5],[7,1,7,4],[13,1,13,5],[77,3,79,3],[77,4,79,4],[16,13,18,13],[77,13,79,13],[19,8,19,13],[17,8,17,9],[78,8,78,9],[78,10,78,12],[17,10,17,12],[16,8,16,12],[77,8,77,12],[153,2,153,7],[152,2,152,7],[19,2,19,6],[139,2,139,7],[140,2,140,7],[141,2,141,7],[137,1,137,4],[16,1,19,1],[77,5,77,7],[17,5,18,5],[17,6,18,6],[17,7,18,7],[16,5,16,7],[75,1,75,4],[77,1,80,1],[77,2,79,2],[80,8,80,13],[78,6,79,6],[78,7,79,7],[142,2,142,7],[154,2,154,7],[80,2,80,4],[78,5,79,5],[143,2,143,7],[144,2,144,7],[145,2,145,7],[146,2,146,7],[147,2,147,7],[148,2,148,7],[149,2,149,7],[150,2,150,7],[151,2,151,7]]}
[null,{"$f":"(LOOKUP(dms_Model,dms_Model_List,dms_Worksheet_List))","v":"REGULATORY REPORTING STATEMENT"}]
[null,{"$f":"dms_TradingName","v":"Ausgrid"}]
[null,{"$f":"CONCATENATE(\"Annual Reporting RIN Response \",CRY)","v":"Annual Reporting RIN Response 2015-16"}]
[null,"8.4 OPEX"]
[]
[null,"Instructions"]
[null,{"$f":"CONCATENATE(\"Forecast expenditure is to be taken from \",dms_TradingName,\"'s \",dms_DeterminationRef,\".\")","v":"Forecast expenditure is to be taken from Ausgrid's 2014-19 Distribution Determination."}]
[null,"If allocating based on assumptions then provide method in Basis of Preparation.  \n\nAll adjustments must be explained in Basis of Preparation with supporting documentation attached. "]
[]
[null,"8.4.1 - OPERATING & MAINTENANCE EXPENDITURE - BY PURPOSE"]
[]
[]
[null,{"$f":"CONCATENATE(dms_TradingName,\" is to list the operating expenditure categories identified in \", dms_TradingName,\"'s regulatory proposal at table 3.2.1.1 current opex categories and cost allocations.\")","v":"Ausgrid is to list the operating expenditure categories identified in Ausgrid's regulatory proposal at table 3.2.1.1 current opex categories and cost allocations."}]
[null,{"$f":"CONCATENATE(dms_TradingName, \" must specify any expenditure category where the expense is more than 5 per cent of the total standard control services operating expenditure.\")","v":"Ausgrid must specify any expenditure category where the expense is more than 5 per cent of the total standard control services operating expenditure."}]
[null,"Reported operating expenditure must INCLUDE any profit margins or management fees paid directly or indirectly to related party contractors (not including actual incurred expenditure of the related party contractor) for the regulatory reporting period.  "]
[]
[null,"Opex category","Audited Statutory Accounts","Adjustments","Distribution business","Standard Control Services",null,null,"Alternative Control Services",null,null,null,null,"Negotiated Services"]
[null,null,null,null,null,"CPI Adjusted Forecast","Actual","Difference","Public Lighting",null,"Other"]
[null,null,null,null,null,null,null,null,{"$f":"IF(dms_Jurisdiction=\"Vic\",\"Energy efficient\",\"\")","v":""},{"$f":"IF(dms_Jurisdiction=\"Vic\",\"Non-energy efficient\",\"\")","v":""},"Connection services","Metering services","Ancillary network services"]
[null,null,"$0's, nominal",null,null,null,null,"%","$0's, nominal"]
[null,"Contact Centre",null,7215206.7100000009,7215206.7100000009,null,7215206.7100000009,1.0019784113189838,0,null,0,0,0]
[null,"Customer Operations",null,44359119.449999988,44359119.449999988,null,15485205.909999989,-0.22340764117624992,0,null,27162135.719999999,0,1711777.82]
[null,"Data Operations",null,11276478.880000018,11276478.880000018,null,8708200.8154152185,0.28039363696899783,452414.88759023586,null,32688.508495392409,93892.374297898277,1989282.2942012737]
[null,"Engineering, Planning & Project Management",null,43797293.282478541,43797293.282478541,null,40113735.799380064,2.6749306541490219,2391034.0194478706,null,1287987.9244706356,4222.1152012792963,313.42397869645572]
[null,"Finance Function",null,9599980.5458618756,9599980.5458618756,null,9262578.5500900075,-0.2510829353556045,117056.12507651644,null,36996.988955089633,142620.36281211113,40728.518928151956]
[null,"Information Communication & Technology",null,54884471.313423194,54884471.313423194,null,52622386.563188501,0.5252101086318276,716411.32036125916,null,430397.31056935922,963440.57885336969,151835.54045070653]
[null,"Insurance",null,4753920.3968220158,4753920.3968220158,null,4650364.3649402317,-4.6020865762872981E-2,27473.657850708365,null,11385.702438953736,53940.387065544353,10756.28452657761]
[null,"Management",null,140420804.35348207,140420804.35348207,null,125861018.72066319,7.1353558538884272,3611053.972008666,null,6358667.8650591169,3822236.6251592916,767827.17059181177]
[null,"Metering",null,24327057.80999998,24327057.80999998,null,1700573.6318839989,-0.26417235698820624,0,null,0,16218803.540239323,6407680.6378766596]
[null,"System Control",null,20319075.240000024,20319075.240000024,null,20319075.240000024,0.46672890033819064,0,null,0,0,0]
[null,"Network maintenance costs",null,217361584.28000003,217361584.28000003,null,199039057.98000005,0.11498151410674547,18322526.299999986,null,0,0,0]
[null,"Demand Management",null,1243687.2000000002,1243687.2000000002,null,1243687.2000000002,-0.58491301671627471,0,null,0,0,0]
[null,"Operational Technology ",null,13191160.590691475,13191160.590691475,null,12940782.116153304,0.19379230609589404,79295.86790031608,null,47638.45477253123,106638.26031118109,16805.891554143844]
[null,"Other",null,21106307.729308128,21106307.729308128,null,19867271.402211361,7.347977558435885E-2,692212.92288102675,null,200154.95836379347,281967.97586244135,64700.469989506688]
[null,"Property Management",null,51859532.091525219,51859532.091525219,null,50558052.102359757,0.15580360735011176,251634.40238866108,null,90623.468966981862,809055.0140753967,150167.10373441511]
[null,"Training & Development",null,20427834.293921214,20427834.293921214,null,20292242.992863573,-4.7510058275164807E-3,42942.309305664443,null,25798.384125861729,57749.455039162785,9101.1525869511552]
[null,null,null,null,null,null,null,{"$f":"IF(F37=0,1,((G37-F37)/F37)*1)","v":1}]
[null,null,null,null,null,null,null,1]
[null,null,null,null,null,null,null,1]
[null,null,null,null,null,null,null,1]
[null,null,null,null,null,null,null,1]
[null,null,null,null,null,null,null,{"$f":"IF(F42=0,1,((G42-F42)/F42)*1)","v":1}]
[null,null,null,null,null,null,null,1]
[null,null,null,null,null,null,null,1]
[null,null,null,null,null,null,null,1]
[null,null,null,null,null,null,null,1]
[null,null,null,null,null,null,null,1]
[null,null,null,null,null,null,null,1]
[null,null,null,null,null,null,null,1]
[null,null,null,null,null,null,null,1]
[null,null,null,null,null,null,null,1]
[null,null,null,null,null,null,null,1]
[null,null,null,null,null,null,null,1]
[null,null,null,null,null,null,null,1]
[null,null,null,null,null,null,null,1]
[null,null,null,null,null,null,null,{"$f":"IF(F56=0,1,((G56-F56)/F56)*1)","v":1}]
[null,null,null,null,null,null,null,1]
[null,null,null,null,null,null,null,1]
[null,null,null,null,null,null,null,1]
[null,null,null,null,null,null,null,1]
[null,null,null,null,null,null,null,1]
[null,null,null,null,null,null,null,1]
[null,null,null,null,null,null,null,1]
[null,null,null,null,null,null,null,1]
[null,null,null,null,null,null,null,1]
[null,null,null,null,null,null,null,1]
[null,null,null,null,null,null,null,1]
[null,null,null,null,null,null,null,1]
[null,null,null,null,null,null,null,1]
[null,null,null,null,null,null,null,1]
[null,"Total",{"$f":"SUM(C21:C70)","v":0},686143514.16751385,686143514.16751385,399629204.61979395,589879440.09914923,0.47606689721377793,{"$f":"SUM(I21:I70)","v":26704055.784810912},0,35684475.286217719,22554566.688917,11320976.308418894,0]
[]
[]
[null,"8.4.2 - OPERATING & MAINTENANCE EXPENDITURE - BY PURPOSE - MARGINS ONLY"]
[]
[null,"\"Related party margin expenditure' must COMPRISE ONLY profit margins or management fees paid directly or indirectly to related party contractors (for expenditure that is not an actual incurred expenditure of the related party contractor) for the regulatory reporting period."]
[]
[null,"Opex category","Audited Statutory Accounts","Adjustments","Distribution business","Standard Control Services",null,null,"Alternative Control Services",null,null,null,null,"Negotiated Services"]
[null,null,null,null,null,"CPI Adjusted Forecast","Actual","Difference","Public Lighting",null,"Other"]
[null,null,null,null,null,null,null,null,{"$f":"IF(dms_Jurisdiction=\"Vic\",\"Energy efficient\",\"\")","v":""},{"$f":"IF(dms_Jurisdiction=\"Vic\",\"Non-energy efficient\",\"\")","v":""},"Connection services","Metering services","Ancillary network services"]
[null,null,"$0's, nominal",null,null,null,"$0's, nominal","per cent","$0's, nominal"]
[null,{"$f":"IF(ISBLANK(B21),\"\",B21)","v":"Contact Centre"},null,null,null,null,null,{"$f":"IF(F82=0,1,((G82-F82)/F82)*1)","v":1}]
[null,"Customer Operations",null,null,null,null,null,1]
[null,"Data Operations",null,null,null,null,null,1]
[null,"Engineering, Planning & Project Management",null,null,null,null,null,1]
[null,"Finance Function",null,null,null,null,null,1]
[null,"Information Communication & Technology",null,null,null,null,null,1]
[null,"Insurance",null,null,null,null,null,1]
[null,{"$f":"IF(ISBLANK(B27),\"\",B27)","v":"Insurance"},null,null,null,null,null,{"$f":"IF(F89=0,1,((G89-F89)/F89)*1)","v":1}]
[null,"Management",null,null,null,null,null,1]
[null,"Metering",null,null,null,null,null,1]
[null,"System Control",null,null,null,null,null,1]
[null,"Network maintenance costs",null,null,null,null,null,1]
[null,"Demand Management",null,null,null,null,null,1]
[null,"Operational Technology ",null,null,null,null,null,1]
[null,"Other",null,null,null,null,null,1]
[null,"Property Management",null,null,null,null,null,1]
[null,"Training & Development",null,null,null,null,null,{"$f":"IF(F98=0,1,((G98-F98)/F98)*1)","v":1}]
[null,"",null,null,null,null,null,1]
[null,"",null,null,null,null,null,1]
[null,"",null,null,null,null,null,1]
[null,"",null,null,null,null,null,1]
[null,"",null,null,null,null,null,1]
[null,"",null,null,null,null,null,{"$f":"IF(F104=0,1,((G104-F104)/F104)*1)","v":1}]
[null,"",null,null,null,null,null,1]
[null,"",null,null,null,null,null,1]
[null,"",null,null,null,null,null,1]
[null,"",null,null,null,null,null,1]
[null,"",null,null,null,null,null,1]
[null,"",null,null,null,null,null,1]
[null,"",null,null,null,null,null,1]
[null,"",null,null,null,null,null,1]
[null,"",null,null,null,null,null,1]
[null,"",null,null,null,null,null,1]
[null,"",null,null,null,null,null,1]
[null,"",null,null,null,null,null,1]
[null,"",null,null,null,null,null,1]
[null,"",null,null,null,null,null,1]
[null,"",null,null,null,null,null,1]
[null,"",null,null,null,null,null,1]
[null,"",null,null,null,null,null,1]
[null,"",null,null,null,null,null,1]
[null,"",null,null,null,null,null,1]
[null,"",null,null,null,null,null,1]
[null,"",null,null,null,null,null,1]
[null,"",null,null,null,null,null,1]
[null,"",null,null,null,null,null,1]
[null,"",null,null,null,null,null,1]
[null,"",null,null,null,null,null,1]
[null,"",null,null,null,null,null,1]
[null,"",null,null,null,null,null,1]
[null,null,null,null,null,null,null,1]
[null,"Total",{"$f":"SUM(C82:C132)","v":0},{"$f":"SUM(D82:D132)","v":0},{"$f":"SUM(E82:E132)","v":0},{"$f":"SUM(F82:F132)","v":0},{"$f":"SUM(G82:G132)","v":0},1,{"$f":"SUM(I82:I132)","v":0},{"$f":"SUM(J82:J132)","v":0},0,0,{"$f":"SUM(M82:M132)","v":0},{"$f":"SUM(N82:N132)","v":0}]
[]
[]
[null,"8.4.3 - OPERATING & MAINTENANCE EXPENDITURE - EXPLANATION OF MATERIAL DIFFERENCE"]
[]
[null,"Where the difference between forecast and actual expenditure shown in table 8.4.1, column I is a Material Difference please explain the main factors driving the difference."]
[]
[null,"Category","Explanation"]
[null,"Contact Centre","Ausgrid has used the operating expenditure forecast from the April 2015 determination as a reference point for comparison.  Noting that Ausgrid sought the merits review of the AER's determination and on 26 February 2016, the Australian Competition Tribunal set aside the AER's April 2015 determination and remitted it to the AER to remake in accordance with the Tribunal's decision. The AER has sought the judicial review of the Tribunal's decision in the Federal Court. A consequence of the Tribunal's decision is that there is no distribution determination for the 2014-19 period and as such it is not strictly correct to compare Ausgrid's actual expenditure outturn with the opex determined in the April 2015 decision. "]
[null,"Customer Operations","Ausgrid has used the operating expenditure forecast from the April 2015 determination as a reference point for comparison.  Noting that Ausgrid sought the merits review of the AER's determination and on 26 February 2016, the Australian Competition Tribunal set aside the AER's April 2015 determination and remitted it to the AER to remake in accordance with the Tribunal's decision. The AER has sought the judicial review of the Tribunal's decision in the Federal Court. A consequence of the Tribunal's decision is that there is no distribution determination for the 2014-19 period and as such it is not strictly correct to compare Ausgrid's actual expenditure outturn with the opex determined in the April 2015 decision. "]
[null,"Data Operations","Ausgrid has used the operating expenditure forecast from the April 2015 determination as a reference point for comparison.  Noting that Ausgrid sought the merits review of the AER's determination and on 26 Febuary 2016, the Australian Competition Tribunal set aside the AER's April 2015 determination and remitted it to the AER to remake in accordance with the Tribunal's decision. The AER has sought the judicial review of the Tribunal's decision in the Federal Court. A consequence of the Tribunal's decision is that there is no distribution determination for the 2014-19 period and as such it is not strictly correct to compare Ausgrid's actual expenditure outturn with the opex determined in the April 2015 decision. "]
[null,"Engineering, Planning & Project Management","Ausgrid has used the operating expenditure forecast from the April 2015 determination as a reference point for comparison.  Noting that Ausgrid sought the merits review of the AER's determination and on 26 February 2016, the Australian Competition Tribunal set aside the AER's April 2015 determination and remitted it to the AER to remake in accordance with the Tribunal's decision. The AER has sought the judicial review of the Tribunal's decision in the Federal Court. A consequence of the Tribunal's decision is that there is no distribution determination for the 2014-19 period and as such it is not strictly correct to compare Ausgrid's actual expenditure outturn with the opex determined in the April 2015 decision. "]
[null,"Finance Function","Ausgrid has used the operating expenditure forecast from the April 2015 determination as a reference point for comparison.  Noting that Ausgrid sought the merits review of the AER's determination and on 26 February 2016, the Australian Competition Tribunal set aside the AER's April 2015 determination and remitted it to the AER to remake in accordance with the Tribunal's decision. The AER has sought the judicial review of the Tribunal's decision in the Federal Court. A consequence of the Tribunal's decision is that there is no distribution determination for the 2014-19 period and as such it is not strictly correct to compare Ausgrid's actual expenditure outturn with the opex determined in the April 2015 decision. "]
[null,"Information Communication & Technology","Ausgrid has used the operating expenditure forecast from the April 2015 determination as a reference point for comparison.  Noting that Ausgrid sought the merits review of the AER's determination and on 26 Febuary 2016, the Australian Competition Tribunal set aside the AER's April 2015 determination and remitted it to the AER to remake in accordance with the Tribunal's decision. The AER has sought the judicial review of the Tribunal's decision in the Federal Court. A consequence of the Tribunal's decision is that there is no distribution determination for the 2014-19 period and as such it is not strictly correct to compare Ausgrid's actual expenditure outturn with the opex determined in the April 2015 decision. "]
[null,"Management","Ausgrid has used the operating expenditure forecast from the April 2015 determination as a reference point for comparison.  Noting that Ausgrid sought the merits review of the AER's determination and on 26 February 2016, the Australian Competition Tribunal set aside the AER's April 2015 determination and remitted it to the AER to remake in accordance with the Tribunal's decision. The AER has sought the judicial review of the Tribunal's decision in the Federal Court. A consequence of the Tribunal's decision is that there is no distribution determination for the 2014-19 period and as such it is not strictly correct to compare Ausgrid's actual expenditure outturn with the opex determined in the April 2015 decision. "]
[null,"Metering","Ausgrid has used the operating expenditure forecast from the April 2015 determination as a reference point for comparison.  Noting that Ausgrid sought the merits review of the AER's determination and on 26 Febuary 2016, the Australian Competition Tribunal set aside the AER's April 2015 determination and remitted it to the AER to remake in accordance with the Tribunal's decision. The AER has sought the judicial review of the Tribunal's decision in the Federal Court. A consequence of the Tribunal's decision is that there is no distribution determination for the 2014-19 period and as such it is not strictly correct to compare Ausgrid's actual expenditure outturn with the opex determined in the April 2015 decision. "]
[null,"System Control","Ausgrid has used the operating expenditure forecast from the April 2015 determination as a reference point for comparison.  Noting that Ausgrid sought the merits review of the AER's determination and on 26 Febuary 2016, the Australian Competition Tribunal set aside the AER's April 2015 determination and remitted it to the AER to remake in accordance with the Tribunal's decision. The AER has sought the judicial review of the Tribunal's decision in the Federal Court. A consequence of the Tribunal's decision is that there is no distribution determination for the 2014-19 period and as such it is not strictly correct to compare Ausgrid's actual expenditure outturn with the opex determined in the April 2015 decision. "]
[null,"Demand Management","The variance between the forecast and actual expenditure for demand management is related to number of D-factor demand management projects implemented in the year.  Actual number of projects was lower than the initial forecast. It is difficult to forecast the number of D-Factor projects implemented each year, as they are implemented to defer or avoid capital investments on the network which is driven by demand growth. Actual approved demand management projects implemented are linked to the number of demand driven capital projects, and how many of these can be cost effectively deferred by reducing demand."]
[null,"Operational Technology ","Ausgrid has used the operating expenditure forecast from the April 2015 determination as a reference point for comparison.  Noting that Ausgrid sought the merits review of the AER's determination and on 26 Febuary 2016, the Australian Competition Tribunal set aside the AER's April 2015 determination and remitted it to the AER to remake in accordance with the Tribunal's decision. The AER has sought the judicial review of the Tribunal's decision in the Federal Court. A consequence of the Tribunal's decision is that there is no distribution determination for the 2014-19 period and as such it is not strictly correct to compare Ausgrid's actual expenditure outturn with the opex determined in the April 2015 decision. "]
[null,"Other","Ausgrid has used the operating expenditure forecast from the April 2015 determination as a reference point for comparison.  Noting that Ausgrid sought the merits review of the AER's determination and on 26 Febuary 2016, the Australian Competition Tribunal set aside the AER's April 2015 determination and remitted it to the AER to remake in accordance with the Tribunal's decision. The AER has sought the judicial review of the Tribunal's decision in the Federal Court. A consequence of the Tribunal's decision is that there is no distribution determination for the 2014-19 period and as such it is not strictly correct to compare Ausgrid's actual expenditure outturn with the opex determined in the April 2015 decision. "]
[null,"Property Management","Ausgrid has used the operating expenditure forecast from the April 2015 determination as a reference point for comparison.  Noting that Ausgrid sought the merits review of the AER's determination and on 26 Febuary 2016, the Australian Competition Tribunal set aside the AER's April 2015 determination and remitted it to the AER to remake in accordance with the Tribunal's decision. The AER has sought the judicial review of the Tribunal's decision in the Federal Court. A consequence of the Tribunal's decision is that there is no distribution determination for the 2014-19 period and as such it is not strictly correct to compare Ausgrid's actual expenditure outturn with the opex determined in the April 2015 decision. "]
[null,"Training & Development","Ausgrid has used the operating expenditure forecast from the April 2015 determination as a reference point for comparison.  Noting that Ausgrid sought the merits review of the AER's determination and on 26 Febuary 2016, the Australian Competition Tribunal set aside the AER's April 2015 determination and remitted it to the AER to remake in accordance with the Tribunal's decision. The AER has sought the judicial review of the Tribunal's decision in the Federal Court. A consequence of the Tribunal's decision is that there is no distribution determination for the 2014-19 period and as such it is not strictly correct to compare Ausgrid's actual expenditure outturn with the opex determined in the April 2015 decision. "]
[null,"Total","Operating and maintenance expenditure is in line with management expectations. The AER has not provided Ausgrid with the split of the \"CPI Adjusted Forecast\" between opex categories. As a result, we are unable to determine in which categories we have overspent."]

{"sheet":"9.5 TUoS","index":22,"n_rows":60,"n_cols":6,"rows_kept":60,"cut":false,"hidden":false,"merged":[[57,1,57,4],[51,1,51,4],[19,1,19,4],[20,1,20,4],[59,1,59,4],[53,1,53,4],[48,1,48,4],[58,1,58,4],[40,1,40,4],[44,1,44,4],[45,1,45,4],[46,1,46,4],[47,1,47,4],[41,1,41,4],[42,1,42,4],[43,1,43,4],[50,1,50,4],[54,1,54,4],[52,1,52,4],[55,1,55,4],[56,1,56,4],[5,1,5,3],[21,1,21,3],[24,2,24,5],[36,1,36,4],[25,2,25,5],[24,1,27,1],[9,1,9,4],[10,1,10,4],[11,1,11,4],[12,1,12,4],[17,1,17,4],[18,1,18,4],[13,1,13,3]]}
[null,{"$f":"(LOOKUP(dms_Model,dms_Model_List,dms_Worksheet_List))","v":"REGULATORY REPORTING STATEMENT"}]
[null,{"$f":"dms_TradingName","v":"Ausgrid"}]
[null,{"$f":"CONCATENATE(\"Annual Reporting RIN Response \",CRY)","v":"Annual Reporting RIN Response 2015-16"}]
[null,"9.5 - TUoS AUDIT (t-2)"]
[]
[null,"This template collects information for annual pricing proposals from Victorian businesses only.\n"]
[]
[null,"9.5.1 - TUOS CHARGES (AEMO)"]
[null,null,null,null,null,{"$f":"CRY","v":"2015-16"}]
[]
[]
[]
[]
[null,null,null,null,"Total",{"$f":"SUM(F10:F13)","v":0}]
[]
[null,"9.5.2 - TRANSMISSION CONNECTION FEES"]
[null,null,null,null,null,{"$f":"CRY","v":"2015-16"}]
[]
[]
[]
[]
[null,null,null,null,"Total",{"$f":"SUM(F18:F21)","v":0}]
[]
[null,"9.5.3 - CROSS BOUNDARY NETWORK CHARGES"]
[null,"Distribution Business","Amount (payable)/receivable"]
[null,null,"$0's, nominal"]
[null,null,"HV crossings","Subtransmission crossings","TUoS Adjustment","Total"]
[null,null,null,null,null,{"$f":"CRY","v":"2015-16"}]
[null,null,null,null,null,{"$f":"IF((SUM(C29:E29)=0),\"\",(SUM(C29:E29)))","v":""}]
[null,null,null,null,null,{"$f":"IF((SUM(C30:E30)=0),\"\",(SUM(C30:E30)))","v":""}]
[null,null,null,null,null,""]
[null,null,null,null,null,""]
[null,null,null,null,null,""]
[null,null,null,null,null,""]
[null,null,null,null,null,""]
[null,null,null,null,null,""]
[null,"Total",null,null,null,""]
[]
[null,"9.5.4 - PAYMENTS TO EMBEDDED GENERATORS"]
[null,"9.5.4.1 - AVOIDED TRANSMISSION COSTS",null,null,null,{"$f":"CRY","v":"2015-16"}]
[]
[]
[]
[]
[]
[]
[]
[]
[null,"Total",null,null,null,{"$f":"SUM(F41:F48)","v":0}]
[null,"9.5.4.2 - AVOIDED TUoS USAGE CHARGES",null,null,null,{"$f":"CRY","v":"2015-16"}]
[]
[]
[]
[]
[]
[]
[]
[]
[null,"Total",null,null,null,{"$f":"SUM(F51:F58)","v":0}]
[null,"Total payments to embedded generators",null,null,null,{"$f":"F59+F49","v":0}]