{"text_format":"1","workbook":"xlsx","n_sheets":23,"sheets":["AER only","Business & other details","Contents","Instructions","2.11 Labour","3.6 Quality of services","3.6.8 Network-feeders","3.6.9 Network-reliability","4.1 Public lighting","6.2 STPIS Reliability","6.6 STPIS Customer Service","6.7 STPIS Daily Performance","6.8 STPIS Exclusions","6.9 STPIS - GSL","7.8 Avoided TUOS Payments","7.10 Juris Scheme","7.11 DMIS-DMIA","7.12 Safety and Bushfire","7.13 TARC","8.1 Income","8.2 Capex","8.4 Opex","9.5 TUoS"],"not_rendered":{"charts":0,"images":5,"macros":1,"external_links":0,"defined_names":622,"comments":3,"pivot_tables":0},"unopened":[],"bounds":{"document_bytes":16777216,"sheet_cells":100000,"rows_first":2000,"rows_last":500,"rows_between":2000,"halvings":0,"cell_chars":16384,"cell_head_chars":4096},"cells_cut":0,"cells_raw":0,"read":"whole","date_system":"1900"}

{"sheet":"AER only","index":0,"n_rows":233,"n_cols":40,"rows_kept":233,"cut":false,"hidden":true,"merged":[[0,1,0,11],[4,27,4,38],[6,27,6,30],[6,33,6,37],[52,24,52,28],[52,29,52,32],[53,1,53,5],[53,14,53,21],[53,24,53,28],[53,29,53,32],[71,14,71,15],[71,24,71,27],[93,1,95,1],[96,1,100,1],[104,1,105,1],[136,11,136,12],[153,1,153,8]]}
[null,"Data in these columns used for data validation and database purposes."]
[null,"Date last modified:","2017-01-16","added (Albury and Victora) for AGN"]
[null,null,"2016-10-17","updated TransGrid's correct legal name, corrected TasNetworks (T) to June financial year"]
[null,null,"2017-02-01","inserted Power and Water, added NRs (dms_FeederCat_1 and dms_FeederCat_2)"]
[null,null,"2017-03-03","inserted AEMO as a business",null,null,null,null,null,null,null,null,null,null,null,null,null,null,null,null,null,null,null,null,null,null,null,"FOR ELECTRICITY BUSINESSES ONLY"]
[null,null,"2018-03-28","major changes to accommodate STPIS"]
[null,null,"Template Version",5,null,null,null,null,null,null,null,null,null,null,null,null,null,null,null,null,null,null,null,null,null,null,null,"Feeder Types",null,null,null,"TasNetworks (D)","MAIFI flag","Feeder Names"]
[]
[null,null,null,null,null,null,null,null,null,null,null,null,null,null,null,null,null,null,null,null,null,null,null,null,null,null,null,"CBD","Urban","Short rural","long rural","EXTRA"]
[null,"dms_TradingName_List","dms_TradingNameFull_List","dms_ABN_List","dms_JurisdictionList","dms_Sector_List","dms_Segment_List","dms_FormControl_List","dms_RPT_List","dms_RPTMonth_List","dms_CRCPlength_List","dms_FRCPlength_List","dms_663_List","dms_DeterminationRef_List","dms_Addr1_List","dms_Addr2_List","dms_Suburb_List","dms_State_List","dms_PostCode_List","dms_PAddr1_List","dms_PAddr2_List","dms_PSuburb_List","dms_PState_List","dms_PPostCode_List","dms_ContactName1_List","dms_ContactPh1_List","dms_ContactEmail_List","dms_CBD_flag","dms_Urban_flag","dms_ShortRural_flag","dms_LongRural_flag","dms_FeederType_5_flag","dms_MAIFI_flag_List","dms_FeederName_1","dms_FeederName_2","dms_FeederName_3","dms_FeederName_4","dms_FeederName_5","dms_Public_Lighting_List","Column1"]
[null,"ActewAGL Distribution","ActewAGL Distribution",76670568688,"ACT","Electricity","Distribution","Revenue cap","Financial","June",5,5,5,"2014-19 Distribution Determination","40 Bunda Street",null,"CANBERRA","ACT",2600,"GPO BOX 366",null,"CANBERRA","ACT",2601,"Robert Walker","02 6248 3847","robert.walker@actewagle.com.au","NO","YES","YES","NO","NO",null,"CBD","Urban","Short rural","Long rural",null,"NO","ActewAGL Distribution"]
[null,"ActewAGL Distribution (Tx Assets)","ActewAGL Distribution (Tx Assets)",76670568688,"ACT","Electricity","Distribution","Revenue cap","Financial","June",5,5,5,"distribution determination","40 Bunda Street",null,"CANBERRA","ACT",2600,"GPO BOX 366",null,"CANBERRA","ACT",2601,"Robert Walker","02 6248 3847","robert.walker@actewagle.com.au","NO","YES","YES","NO","NO",null,"CBD","Urban","Short rural","Long rural",null,"NO","ActewAGL Distribution (Tx Assets)"]
[null,"ActewAGL Gas","ActewAGL Gas",76670568688,"ACT","Gas","Distribution","Weighted average price cap","Financial","June",5,5,"x",null,"40 Bunda Street",null,"CANBERRA","ACT",2600,"GPO BOX 366",null,"CANBERRA","ACT",2601,"Philip Deamer","02 6248 3438","GasAAReview@actewagl.com.au","NO","NO","NO","NO","NO",null,"CBD","Urban","Short rural","Long rural",null,"NO","ActewAGL Gas"]
[null,"AEMO","Australian Energy Market Operator Ltd",94072010327,"Vic","Electricity","Transmission","-","Financial","March",5,5,"x","-","Level 22","530 Collins Street","MELBOURNE","VIC",3000,"GPO Box 2008",null,"MELBOURNE","VIC",3001,null,null,null,"NO","NO","NO","NO","NO",null,"CBD","Urban","Short rural","Long rural",null,"NO","AEMO"]
[null,"AGN (Albury and Victoria)","Australian Gas Networks Limited (reporting data for Albury and Victoria)",19078551685,"Vic","Gas","Distribution","Weighted average price cap","Calendar","December",5,5,"x",null,"Level 6","400 King William Street","ADELAIDE","SA",5000,"PO Box 6468","Halifax Street","ADELAIDE","SA",5000,"Craig de Laine","08 8418 1129 ","craig.delaine@agn.com.au","NO","NO","NO","NO","NO",null,"CBD","Urban","Short rural","Long rural",null,"NO","AGN (Albury)"]
[null,"AGN (Albury)","Australian Gas Networks Limited (reporting data for Albury)",19078551685,"Vic","Gas","Distribution","Weighted average price cap","Calendar","December",5,5,"x",null,"Level 6","400 King William Street","ADELAIDE","SA",5000,"PO Box 6468","Halifax Street","ADELAIDE","SA",5000,"Craig de Laine","08 8418 1129 ","craig.delaine@agn.com.au","NO","NO","NO","NO","NO",null,"CBD","Urban","Short rural","Long rural",null,"NO"]
[null,"AGN (SA)","Australian Gas Networks Limited (reporting data for SA)",19078551685,"SA","Gas","Distribution","Weighted average price cap","Financial","June",5,5,5,"distribution determination","Level 6","400 King William Street","ADELAIDE","SA",5000,"PO Box 6468","Halifax Street","ADELAIDE","SA",5000,"Craig de Laine","08 8418 1129 ","craig.delaine@agn.com.au","NO","NO","NO","NO","NO",null,"CBD","Urban","Short rural","Long rural",null,"NO","AGN (SA)"]
[null,"AGN (Victoria)","Australian Gas Networks Limited (reporting data for Victoria)",19078551685,"Vic","Gas","Distribution","Weighted average price cap","Calendar","December",5,5,"x",null,"Level 6","400 King William Street","ADELAIDE","SA",5000,"PO Box 6468","Halifax Street","ADELAIDE","SA",5000,"Craig de Laine","08 8418 1129 ","craig.delaine@agn.com.au","NO","NO","NO","NO","NO",null,"CBD","Urban","Short rural","Long rural",null,"NO","AGN (Victoria)"]
[null,"Amadeus","APT Pipelines (NT) Pty Ltd",39009737393,"NT","Gas","Transmission","Weighted average price cap","Financial","June",5,5,"x","n/a","Level 19, HSBC Building","580 George Street","SYDNEY","NSW",2000,"Level 19, HSBC Building","580 George Street","SYDNEY","NSW",2000,"Alexandra Curran","02 9275 0020","alexandra.curran@apa.com.au","NO","NO","NO","NO","NO",null,"CBD","Urban","Short rural","Long rural",null,"NO","Amadeus"]
[null,"APA GasNet","APA GasNet Australia (Operations) Pty Ltd","065083009","Vic","Gas","Transmission","Weighted average price cap","Calendar","December",5,5,"x",null,"Level 19, HSBC Building","580 George Street","SYDNEY","NSW",2000,"PO Box R41",null,"ROYAL EXCHANGE","NSW",1225,"Alexandra Curran","02 9275 0020","alexandra.curran@apa.com.au","NO","NO","NO","NO","NO",null,"CBD","Urban","Short rural","Long rural",null,"NO","APA GasNet"]
[null,"Ausgrid","Ausgrid",78508211731,"NSW","Electricity","Distribution","Revenue cap","Financial","June",5,5,5,"2014-19 Distribution Determination","570 George St",null,"SYDNEY","NSW",2000,"GPO Box 4009",null,"SYDNEY","NSW",2001,"John Thomson","02 9269 2312","john.thomson@ausgrid.com.au","YES","YES","YES","YES","NO",null,"CBD","Urban","Short rural","Long rural",null,"YES","Ausgrid"]
[null,"Ausgrid (Tx Assets)","Ausgrid (Tx Assets)",67505337385,"NSW","Electricity","Distribution","Revenue cap","Financial","June",5,5,5,"distribution determination","570 George St",null,"SYDNEY","NSW",2000,"GPO Box 4009",null,"SYDNEY","NSW",2001,"John Thomson","02 9269 2312","john.thomson@ausgrid.com.au","YES","YES","YES","YES","NO",null,"CBD","Urban","Short rural","Long rural",null,"NO","Ausgrid (Tx Assets)"]
[null,"AusNet (D)","AusNet Electricity Services Pty Ltd",91064651118,"Vic","Electricity","Distribution","Revenue cap","Calendar","December",5,5,2,"2016-20 Distribution Determination","Level 32","2 Southbank Boulevard","SOUTHBANK","Vic",3006,"Locked Bag 14051",null,"MELBOURNE CITY MAIL CENTRE","VIC",8001,"please provide contact details",null,null,"NO","YES","YES","YES","NO",null,"CBD","Urban","Short rural","Long rural",null,"YES","AusNet (D)"]
[null,"AusNet (Gas)","AusNet Gas Services","086015036","Vic","Gas","Distribution","Weighted average price cap","Calendar","December",5,5,"X",null,"Level 19, HSBC Building","580 George Street","SYDNEY","NSW",2000,"PO Box R41",null,"ROYAL EXCHANGE","NSW",1225,"Alexandra Curran","02 9275 0020","alexandra.curran@apa.com.au","NO","NO","NO","NO","NO",null,"CBD","Urban","Short rural","Long rural",null,"NO","AusNet (Gas)"]
[null,"AusNet (T)","Ausnet Services (Transmission) Ltd",48116124362,"Vic","Electricity","Transmission","Revenue cap","Financial","March",5,5,2,"transmission determination","Level 32","2 Southbank Boulevard","SOUTHBANK","Vic",3006,"Locked Bag 14051",null,"MELBOURNE CITY MAIL CENTRE","Vic",8001,"Clare Thompson","03 9695 6670","clare.e.thompson@ausnetservices.com.au","NO","NO","NO","NO","NO",null,"CBD","Urban","Short rural","Long rural",null,"NO","AusNet (T)"]
[null,"Australian Distribution Co.","Australian Distribution Co.",11222333444,"-","Electricity","Distribution","Revenue cap","Financial","June",5,5,2,"distribution determination","123 Straight Street",null,"SYDNEY","NSW",2000,"PO Box 123",null,"SYDNEY","NSW",2000,"Bob Smith","02 1234 5678","bob@auselec.net.au","YES","YES","YES","YES","NO",null,"CBD","Urban","Short rural","Long rural",null,"YES","Australian Distribution Co."]
[null,"Australian Distribution Co. (Vic)","Australian Distribution Co. (Victoria)",11222333444,"Vic","Electricity","Distribution","Revenue cap","Calendar","December",5,5,2,"distribution determination","123 Straight Street",null,"MELBOURNE","Vic",3000,"PO Box 123",null,"MELBOURNE","VIC",3000,"Bob Smith","02 1234 5678","bob@auselec.net.au","NO","NO","NO","NO","NO",null,"CBD","Urban","Short rural","Long rural",null,"YES","Australian Distribution Co. (Vic)"]
[null,"Australian Transmission Co.","Australian Transmission Co.",11222333444,"-","Electricity","Transmission","Revenue cap","Financial","June",5,5,5,"transmission determination","123 Straight Street",null,"SYDNEY","NSW",2000,"PO Box 123",null,"SYDNEY","NSW",2000,"Bob Smith","02 1234 5678","bob@auselec.net.au","NO","NO","NO","NO","NO",null,"CBD","Urban","Short rural","Long rural",null,"NO","Australian Transmission Co."]
[null,"Central Ranges Pipeline (D)","Central Ranges Pipeline Pty Ltd",108218355,"NSW","Gas","Distribution","Weighted average price cap","Financial","June",15,5,5,"distribution determination","Level 19","580 George Street","SYDNEY","NSW",2000,"PO Box R41",null,"ROYAL EXCHANGE","NSW",1225,"Scott Young","02 9275 0031","scott.young@apa.com.au","NO","NO","NO","NO","NO",null,"CBD","Urban","Short rural","Long rural",null,"NO"]
[null,"Central Ranges Pipeline (T)","Central Ranges Pipeline Pty Ltd",108218355,"NSW","Gas","Distribution","Weighted average price cap","Financial","June",14,5,5,"transmission determination","Level 19","580 George Street","SYDNEY","NSW",2000,"PO Box R41",null,"ROYAL EXCHANGE","NSW",1225,"Scott Young","02 9275 0031","scott.young@apa.com.au","NO","NO","NO","NO","NO",null,"CBD","Urban","Short rural","Long rural",null,"NO"]
[null,"CitiPower","CitiPower",76064651056,"Vic","Electricity","Distribution","Revenue cap","Calendar","December",5,5,2,"2016-20 Distribution Determination","40 Market Street",null,"MELBOURNE","Vic",3000,"Locked Bag 14090",null,"MELBOURNE","VIC",8001,"Hannah Williams","03 9683 4088","hwilliams@powercor.com.au","YES","YES","NO","NO","NO",null,"CBD","Urban","Short rural","Long rural",null,"YES","CitiPower"]
[null,"Directlink","Directlink",16779340889,"Qld","Electricity","Transmission","Revenue cap","Financial","June",9,5,5,"transmission determination","Level 19, HSBC Building","580 George Street","SYDNEY","NSW",2000,"PO Box R41",null,"ROYAL EXCHANGE","NSW",1225,"Scott Young","02 9275 0031","scott.young@apa.com.au","NO","NO","NO","NO","NO",null,"CBD","Urban","Short rural","Long rural",null,"NO","Directlink"]
[null,"ElectraNet","ElectraNet",41094482416,"SA","Electricity","Transmission","Revenue cap","Financial","June",5,5,5,"transmission determination","52-55 East Terrace","Rymill Park","ADELAIDE","SA",5000,"PO Box 7096","Hutt Street Post Office","ADELAIDE","SA",5000,"Bill Jackson","08 8404 7969","jackson.bill@electranet.com.au","NO","NO","NO","NO","NO",null,"CBD","Urban","Short rural","Long rural",null,"NO","ElectraNet"]
[null,"Endeavour Energy","Endeavour Energy",11247365823,"NSW","Electricity","Distribution","Revenue cap","Financial","June",5,5,5,"2014-19 Distribution Determination","51 Huntingwood Drive",null,"HUNTINGWOOD","NSW",2148,"PO Box 811",null,"SEVEN HILLS","NSW",1730,"Jon Hocking","02 9853 4386 / 0407 348 156","Jon.Hocking@Endeavourenergy.com.au","NO","YES","YES","YES","NO",null,"CBD","Urban","Short rural","Long rural",null,"YES","Endeavour Energy"]
[null,"Energex","Energex",40078849055,"Qld","Electricity","Distribution","Revenue cap","Financial","June",5,5,5,"2015-20 Distribution Determination","26 Reddacliff Street",null,"NEWSTEAD","Qld",4006,"26 Reddacliff Street",null,"NEWSTEAD","QLD",4006,"Nicola Roscoe","07 3664 5891","nicolaroscoe@energex.com.au","YES","YES","YES","NO","NO",null,"CBD","Urban","Short rural","Long rural",null,"YES","Energex"]
[null,"Ergon Energy","Ergon Energy",50087646062,"Qld","Electricity","Distribution","Revenue cap","Financial","June",5,5,5,"2015-20 Distribution Determination","22 Walker Street",null,"TOWNSVILLE","Qld",4810,"Po Box 264",null,"FORTITUDE VALLEY","QLD",4006,"Jenny Doyle, Group Manager Regulatory Affairs","(07) 3851 6416","jenny.doyle@ergon.com.au","NO","YES","YES","YES","NO",null,"CBD","Urban","Short rural","Long rural",null,"YES","Ergon Energy"]
[null,"Essential Energy","Essential Energy",37428185226,"NSW","Electricity","Distribution","Revenue cap","Financial","June",5,5,5,"2014-19 Distribution Determination","8 Buller Street",null,"PORT MACQUARIE","NSW",2444,"PO Box 5730",null,"PORT MACQUARIE","NSW",2444,"Catherine Waddell","02 6338 3553","catherine.waddell@essentialenergy.com.au","NO","NO","YES","YES","NO",null,"CBD","Urban","Short rural","Long rural",null,"YES","Essential Energy"]
[null,"Jemena Electricity","Jemena Electricity",82064651083,"Vic","Electricity","Distribution","Revenue cap","Calendar","December",5,5,2,"2016-20 Distribution Determination","Level 16","567 Collins Street","MELBOURNE","VIC",3000,"PO Box 16182",null,"MELBOURNE","VIC",8001,"Matthew Serpell","03 9173 8231","matthew.serpell@jemena.com.au","NO","NO","YES","NO","NO",null,"CBD","Urban","Short rural","Long rural",null,"YES","Jemena Electricity"]
[null,"JGN","Jemena Gas Networks (NSW) Ltd","003 004 322","NSW","Gas","Distribution","Weighted average price cap","Financial","June",5,5,null,null,null,null,null,null,null,null,null,null,null,null,"please provide contact details",null,null,"NO","NO","NO","NO","NO",null,"CBD","Urban","Short rural","Long rural",null,"NO","JGN"]
[null,"Multinet Gas","Multinet Gas (DB No.1) Pty Ltd (ACN 086 026 986), Multinet Gas (DB No.2) Pty Ltd (ACN 086 230 122)","086026986","Vic","Gas","Distribution","Weighted average price cap","Calendar","December",5,5,"x",null,"43-45 Centreway",null,"MT WAVERLEY","Vic",3149,null,null,null,null,null,"Andrew Schille","03 8846 9860","andrew.schille@ue.com.au","NO","NO","NO","NO","NO",null,"CBD","Urban","Short rural","Long rural",null,"NO","Multinet Gas"]
[null,"Murraylink","Murraylink",79181207909,"SA","Electricity","Transmission","Revenue cap","Financial","June",5,5,5,"transmission determination","Level 19","580 George Street","SYDNEY","NSW",2000,"PO Box R41",null,"ROYAL EXCHANGE","NSW",1225,"Scott Young","02 9275 0031","scott.young@apa.com.au","NO","NO","NO","NO","NO",null,"CBD","Urban","Short rural","Long rural",null,"NO","Murraylink"]
[null,"Power and Water","Power and Water Corporation",15947352360,"NT","Electricity","Distribution","Revenue cap","Financial","June",5,5,"x","distribution determination","GPO Box 1921",null,"DARWIN","NT",801,"GPO Box 1921",null,"DARWIN","NT",801,"Lucy Moon","08 8924 5822","Lucy.Moon@powerwater.com.au","YES","YES","YES","YES","NO",null,"CBD","Urban","Short rural","Long rural",null,"NO","Power and Water"]
[null,"Powercor Australia","Powercor Australia",89064651109,"Vic","Electricity","Distribution","Revenue cap","Calendar","December",5,5,2,"2016-20 Distribution Determination","40 Market Street",null,"MELBOURNE","Vic",3000,"Locked bag 14090",null,"MELBOURNE","VIC",8001,"Hannah Williams","03 9683 4088","hwilliams@powercor.com.au","NO","NO","YES","YES","NO",null,"CBD","Urban","Short rural","Long rural",null,"YES","Powercor Australia"]
[null,"Powerlink","Queensland Electricity Transmission Corporation Limited trading as Powerlink Queensland",82078849233,"Qld","Electricity","Transmission","Revenue cap","Financial","June",5,5,5,"transmission determination","33 Harold St",null,"VIRGINIA","Qld",4014,"PO Box 1193",null,"VIRGINIA","QLD",4014,"Jennifer Harris","07 3860 2667","jharris@powerlink.com.au","NO","NO","NO","NO","NO",null,"CBD","Urban","Short rural","Long rural",null,"NO","Powerlink"]
[null,"Roma to Brisbane Pipeline","APT Petroleum Pipelines Limited t/a Roma to Brisbane Pipeline","009 737 393","Qld","Gas","Transmission","Weighted average price cap","Financial","June",5,5,"x","n/a","580 George Street",null,"SYDNEY","NSW",2000,"PO Box R41",null,"ROYAL EXCHANGE","NSW",1225,"Mark Allen","02 9275 0010","mark.allen@apa.com.au","NO","NO","NO","NO","NO",null,"CBD","Urban","Short rural","Long rural",null,"NO","Roma to Brisbane Pipeline"]
[null,"SA Power Networks","SA Power Networks",13332330749,"SA","Electricity","Distribution","Revenue cap","Financial","June",5,5,5,"2015-20 Distribution Determination","1 Anzac Highway",null,"KESWICK","SA",5035,"GPO Box 77",null,"ADELAIDE","SA",5000,"Richard Sibly","08 8404 5613","richard.sibly@sapowernetworks.com.au","NO","NO","YES","YES","NO",null,"CBD","Urban","Short rural","Long rural",null,"NO","SA Power Networks"]
[null,"TasNetworks (D)","TasNetworks (D)",24167357299,"Tas","Electricity","Distribution","Revenue cap","Financial","June",5,5,5,"distribution determination","1-7 Maria Street",null,"LENAH VALLEY","Tas",7008,"PO Box 606",null,"MOONAH","Tas",7009,"John Sayers","03 6271 6469","john.sayers@tasnetworks.com.au","YES","YES","YES","YES","YES",null,"Critical Infrastructure","High density commercial","Urban","High density rural","Low density rural","YES","TasNetworks (D)"]
[null,"TasNetworks (T)","TasNetworks (T)",24167357299,"Tas","Electricity","Transmission","Revenue cap","Financial","June",5,5,5,"transmission determination","1-7 Maria Street",null,"LENAH VALLEY","Tas",7008,"PO Box 606",null,"MOONAH","Tas",7009,"John Sayers","03 6271 6469","john.sayers@tasnetworks.com.au","NO","NO","NO","NO","NO",null,"CBD","Urban","Short rural","Long rural",null,"NO","TasNetworks (T)"]
[null,"TransGrid","NSW Electricity Networks Operations Pty Ltd trading as TransGrid","70 250 995 390","NSW","Electricity","Transmission","Revenue cap","Financial","June",4,5,5,"transmission determination","180 Thomas Street",null,"SYDNEY","NSW",2000,"PO Box A1000",null,"SYDNEY SOUTH","NSW",1235,"Garrie Chubb","0408 210 221","garrie.chubb@transgrid.com.au","NO","NO","NO","NO","NO",null,"CBD","Urban","Short rural","Long rural",null,"NO","TransGrid"]
[null,"United Energy","United Energy",70064651029,"Vic","Electricity","Distribution","Revenue cap","Calendar","December",5,5,2,"2016-20 Distribution Determination","Level 3","6 Nexus Court","MULGRAVE","Vic",3149,"PO Box 449",null,"MOUNT WAVERLEY","VIC",3170,"Mathew Abraham","03 8846 9758","mathew.abraham@ue.com.au","NO","NO","YES","NO","NO",null,"CBD","Urban","Short rural","Long rural",null,"YES","United Energy"]
[]
[]
[null,null,null,null,null,null,null,null,null,null,null,null,null,null,null,null,null,null,null,null,null,null,null,null,"For EB & Reset RINs only",null,null,null,null,"For AARs only"]
[null,"The Reg Year Ending (dms_RYE) must be set to the last year of the regulatory period. For forecast data is is usually (FRCP_y5) for actual it is a single year (CRY). For historical actual data the RYE will need to be set manually in the business details sheet by setting the dms_Multiyear_flag to 1 and putting the correct value in 'dms_Specified_FinalYear. See cells C67:C68",null,null,null,null,{"$f":"IF(dms_RPT=\"financial\",VALUE(LEFT(CRCP_y1,4)-1)&\"-\"&TEXT(VALUE(RIGHT(CRCP_y1,2)-1),\"00\"),VALUE(LEFT(CRCP_y1,4)-1))","v":{"$error":"#REF!"}},null,null,null,null,null,null,"Drop down selector box for CA & Reset RINs.","For CA & Reset RINs only",null,null,null,null,null,null,null,null,null,"for DNSP only",null,null,null,null,"For DNSPs only"]
[null,"dms_Model_List ","dms_Worksheet_List",null,"dms_RYE_Formula_Result",null,null,null,null,null,null,null,null,"dms_0203_ProjectType","dms_020303_01_UOM","dms_020501_01_UOM","dms_020501_02_UOM","dms_020501_03_UOM","dms_020501_04_UOM","dms_020603_01_UOM","dms_020701_01_UOM","dms_020701_02_UOM","dms_040102_01_UOM","dms_040102_04_UOM","dms_030601_01_UOM","dms_030601_02_UOM","dms_030701_01_UOM","dms_030702_01_UOM","dms_030703_01_UOM","dms_030605_UOM","dms_03060703_UOM"]
[null,"ARR","ANNUAL REPORTING STATEMENT",null,{"$f":"LEFT(dms_SingleYear_FinalYear_Result,2)&RIGHT(dms_SingleYear_FinalYear_Result,2)","v":{"$error":"#REF!"}},"=LEFT(dms_SingleYear_FinalYear_Result,2)&RIGHT(dms_SingleYear_FinalYear_Result,2)",null,"Formula errors are OK",null,null,null,null,null,"New line on new route - single circuit","Circuit line length in km","0's","0's","0's","0's","0's","km","km","0's","days","minutes/customer","minutes/customer","Customer / km","%","km","number","number"]
[null,"CA","CATEGORY ANALYSIS",null,{"$f":"LEFT(dms_SingleYear_FinalYear_Result,2)&RIGHT(dms_SingleYear_FinalYear_Result,2)","v":{"$error":"#REF!"}},"=LEFT(dms_SingleYear_FinalYear_Result,2)&RIGHT(dms_SingleYear_FinalYear_Result,2)",null,"Formula errors are OK",null,null,null,null,null,"New line on new route - dual circuit","Circuit line length in km","0's","0's","0's","0's","0's","0's","0's","0's","0's","minutes/customer","minutes/customer","MWh/customer","Number of spans",null,"number","number"]
[null,"CPI","CPI",null,null,null,null,null,null,null,null,null,null,"New line on new route - other","Circuit line length in km","MVA added","MVA added","MVA added","MVA added","0's","km","km","0's","$0s","interruptions/customer","interruptions/customer","kVA / customer","Number of spans",null,"number","number"]
[null,"EB","ECONOMIC BENCHMARKING",null,{"$f":"LEFT(dms_SingleYear_FinalYear_Result,2)&RIGHT(dms_SingleYear_FinalYear_Result,2)","v":{"$error":"#REF!"}},"=LEFT(dms_SingleYear_FinalYear_Result,2)&RIGHT(dms_SingleYear_FinalYear_Result,2)",null,"Formula errors are OK",null,null,null,null,null,"Line rebuild over existing route - single circuit","Circuit line length in km","0's","0's","0's","0's","0's","km","km","$0s","0's","interruptions/customer","interruptions/customer",null,"Number of spans",null,"number","number"]
[null,"PTRM","POST TAX REVENUE MODEL",null,{"$f":"LEFT(dms_MultiYear_FinalYear_Result,2)&RIGHT(dms_MultiYear_FinalYear_Result,2)","v":{"$error":"#REF!"}},"=LEFT(dms_MultiYear_FinalYear_Result,2)&RIGHT(dms_MultiYear_FinalYear_Result,2)",null,null,null,null,null,null,null,"Line rebuild over existing route - dual circuit","Number","total spend $0s","total spend $0s","total spend $0s","total spend $0s","(per cent)","0's","0's",null,null,null,null,null,"Number of spans",null,"number","(per cent)"]
[null,"Reset","REGULATORY REPORTING STATEMENT",null,{"$f":"LEFT(dms_MultiYear_FinalYear_Result,2)&RIGHT(dms_MultiYear_FinalYear_Result,2)","v":{"$error":"#REF!"}},"=LEFT(dms_MultiYear_FinalYear_Result,2)&RIGHT(dms_MultiYear_FinalYear_Result,2)",null,"Formula errors are OK",null,null,null,null,null,"Reconductor - Single circuit","Number","net circuit km added","net circuit km added","net circuit km added","net circuit km added",null,"years","years",null,null,null,null,null,"Years",null,"number"]
[null,"RFM","ROLL FORWARD MODEL",null,{"$f":"LEFT(dms_CRCP_FinalYear_Result,2)&RIGHT(dms_CRCP_FinalYear_Result,2)","v":{"$error":"#REF!"}},"=LEFT(dms_CRCP_FinalYear_Result,2)&RIGHT(dms_CRCP_FinalYear_Result,2)",null,null,null,null,null,null,null,"Reconductor - Dual circuit","Number","total spend $0s","total spend $0s","total spend $0s","total spend $0s",null,null,null,null,null,null,null,null,"Years",null,"number"]
[null,"WACC","WEIGHTED AVERAGE COST OF CAPITAL",null,{"$f":"LEFT(dms_MultiYear_FinalYear_Result,2)&RIGHT(dms_MultiYear_FinalYear_Result,2)","v":{"$error":"#REF!"}},"=LEFT(dms_MultiYear_FinalYear_Result,2)&RIGHT(dms_MultiYear_FinalYear_Result,2)",null,null,null,null,null,null,null,"Other",null,"net circuit km added","net circuit km added","net circuit km added","net circuit km added",null,null,null,null,null,null,null,null,"Trees",null,"number"]
[null,null,null,null,null,null,null,null,null,null,null,null,null,null,null,"total spend $0s","total spend $0s","total spend $0s","total spend $0s",null,null,null,null,null,null,null,null,"Trees",null,"number"]
[null,"dms_DataQuality_List",null,null,null,null,null,null,null,null,null,null,null,null,null,"0's",null,"$0s",null,null,null,null,null,null,null,null,null,"Defects",null,"number"]
[null,"Actual",null,null,null,null,null,null,null,null,null,null,null,null,null,"0's",null,null,null,null,null,null,null,null,null,null,null,"Defects",null,"number"]
[null,"Estimate",null,null,null,null,null,null,null,null,null,null,null,null,null,"0's",null,null,null,null,null,null,null,null,null,null,null,"Spans",null,"number"]
[null,"Consolidated",null,null,null,null,null,null,null,null,null,null,null,null,null,"$0s",null,null,null,null,null,null,null,null,null,null,null,"km",null,"(per cent)"]
[null,"Recast",null,null,null,null,null,null,null,null,null,null,null,null,null,null,null,null,null,null,null,null,null,null,null,null,null,"Spans",null,"(per cent)",""]
[null,"Public"]
[]
[null,"For all files either AER or business needs to be able to specify the type of submission","For PTRM & RFM templates we must provide a choice in case they change their form of control - otherwise it is drawn from the business specific lookup table above.",null,null,null,null,null,null,null,null,null,null,null,"For PTRM files - this field set the text for the named range \"DMS_Xfactor\" which in all cases is simply the text \"x factors\" - this saves putting in each old gas PTRM file ",null,null,null,null,null,null,null,null,null,"for TNSP only"]
[null,"dms_SourceList","dms_FormControl_Choices",null,null,null,null,null,null,null,null,null,null,null,"DMS_Xfactor",null,null,null,null,null,null,null,null,null,"dms_030601_01_UOM",null,"dms_030701_01_UOM","dms_030702_01_UOM"]
[null,"After appeal","Revenue cap",null,null,null,null,null,null,null,null,null,null,null,"x factors",null,null,null,null,null,null,null,null,null,"%",null,"Number of spans","km"]
[null,"Draft decision","Revenue yield",null,null,null,null,null,null,null,null,null,null,null,null,null,null,null,null,null,null,null,null,null,"number",null,"Years","%"]
[null,"Final decision","Weighted average price cap",null,null,null,null,null,null,null,null,null,null,null,null,null,null,null,null,null,null,null,null,null,"number",null,"Trees","km"]
[null,"PTRM update 1",null,null,null,null,null,null,null,null,null,null,null,null,null,null,null,null,null,null,null,null,null,null,"%",null,"Defects","number"]
[null,"PTRM update 2",null,null,null,null,null,null,null,null,null,null,null,null,null,null,null,null,null,null,null,null,null,null,"number",null,"Number of spans"]
[null,"PTRM update 3",null,null,null,null,null,null,null,null,null,null,null,null,null,null,null,null,null,null,null,null,null,null,"number",null,"km"]
[null,"PTRM update 4",null,null,null,null,null,null,null,null,null,null,null,null,null,null,null,null,null,null,null,null,null,null,"%",null,"km"]
[null,"PTRM update 5",null,null,null,null,null,null,null,null,null,null,null,null,null,null,null,null,null,null,null,null,null,null,"number",null,"Number of spans"]
[null,"PTRM update 6",null,null,null,null,null,null,null,null,null,null,null,null,null,null,null,null,null,null,null,null,null,null,"number"]
[null,"PTRM update 7",null,null,null,null,null,null,null,null,null,null,null,null,null,null,null,null,null,null,null,null,null,null,"%"]
[null,"Regulatory proposal",null,null,null,null,null,null,null,null,null,null,null,null,null,null,null,null,null,null,null,null,null,null,"number"]
[null," Start year for 5.2 in Multi year RINS",{"$f":"IF(dms_MultiYear_Flag=1,FRY,CRY)","v":{"$error":"#REF!"}},"dms_0502_Inst_Year"," =IF(dms_MultiYear_Flag=1,FRY,CRY)",null,"For single year RINS this is CRY - multi year RINS need to start a the end of the span of years (ie. FRY)"]
[null,"Reporting",null,null,null,null,null,null,null,null,null,null,null,null,null,null,null,null,null,null,null,null,null,null,"%"]
[null,"Revised regulatory proposal",null,null,null,null,null,null,null,null,null,null,null,null,null,null,null,null,null,null,null,null,null,null,"number"]
[null,null,null,null,null,null,null,null,null,null,null,null,null,null,null,null,null,null,null,null,null,null,null,null,"%"]
[null,null,null,null,null,null,null,null,null,null,null,null,null,null,null,null,null,null,null,null,null,null,null,null,"number"]
[]
[]
[]
[null,"Reason for interruption","dms_Reason_Interruption_Detailed","dms_Reason_Interruption","dms_STPIS_Exclusion_List","dms_020301_ProjectType_List","dms_020302_ProjectType_List"]
[null,"Animal","Animal impact","Animal","Weather","New substation establishment","New line on new route - single circuit"]
[null,null,"Animal nesting/burrowing, etc and other","Asset failure","Equipment failure","Capacity upgrade","New line on new route - dual circuit"]
[null,null,"Other","Other","Operational error","Voltage upgrade","New line on new route - other"]
[null,"Asset failure","LV","Overloads","Vegetation","Other","Line rebuild over existing route - single circuit"]
[null,null,"Distribution substation","Planned","Animals",null,"Line rebuild over existing route - dual circuit"]
[null,null,"HV","Network business","Third party impacts",null,"Reconductor - Single circuit"]
[null,null,"Zone substation","Third party","Transmission failure",null,"Reconductor - Dual circuit"]
[null,null,"Subtransmission","Unknown","Load shedding",null,"Reconductor - Other"]
[null,"Other","insert description of 'other'","Vegetation","Inter-distributor connection failure",null,"Line upgrade - raising/retensoring"]
[null,"Overloads","-","Weather","Other",null,"Line upgrade - voltage upgrade"]
[null,"Planned","-","2 - STPIS Exclusion (3.3)(a)",null,null,"Line upgrade - capacity"]
[null,"Network business","Network error","3 - STPIS Exclusion (3.3)(a)",null,null,"String spare circuit"]
[null,null,"Switching and protection error","4 - STPIS Exclusion (3.3)(a)",null,null,"Other"]
[null,"Third party","Fire","5 - STPIS Exclusion (3.3)(a)"]
[null,null,"Other","6 - STPIS Exclusion (3.3)(a)"]
[null,null,"Dig-in","7 - STPIS Exclusion (3.3)(a)"]
[null,null,"Unauthorised access"]
[null,null,"Vehicle impact"]
[null,"Unknown","Unknown"]
[null,"Vegetation","Blow-in/Fall-in - NSP responsibility"]
[null,null,"Grow-in - NSP responsibility"]
[null,null,"Blow-in/Fall-in - Other responsible party"]
[null,null,"Grow-in - Other responsible party"]
[null,"Weather"]
[null,"2 - STPIS Exclusion (3.3)(a)"]
[null,"3 - STPIS Exclusion (3.3)(a)"]
[null,"4 - STPIS Exclusion (3.3)(a)"]
[null,"5 - STPIS Exclusion (3.3)(a)"]
[null,"6 - STPIS Exclusion (3.3)(a)"]
[null,"7 - STPIS Exclusion (3.3)(a)"]
[]
[]
[]
[]
[]
[]
[]
[]
[]
[]
[]
[]
[null,"These are indeces and lookup values for various dates. All step from the value placed in FRCP_y1 on the business and other details worksheet",{"$f":"IF(dms_FifthFeeder_flag_NSP=\"NO\",\"This NSP has only 4 feeder categories\",\"This NSP has 5 feeder categories\")","v":{"$error":"#REF!"}},null,null,null,null,null,null,null,null,null,null,null,"These date tables are currently used in the Recast templates to provide column headings and conditional formatting"]
[null,"dms_FRCPlength_Num_List","dms_FinalYear_List","dms_CRCPlength_Num_List","dms_CFinalYear_List","dms_FRCP_years",null,"dms_CRCP_years",null,"dms_CRCP_index",null,"These are static values for cut / paste purposes only",null,null,"CRY from input cell on business sheet","CRY - financial","dms_FinYears","CRY calendar","dms_CalYears"]
[null,1,"dms_FRCP_y1",1,"CRCP_y1",{"$f":"FRCP_y1","v":"2020-21"},"dms_FRCP_y1",{"$f":"IF(dms_RPT=\"financial\",VALUE(LEFT(dms_FRCP_y1,4)-1)&\"-\"&TEXT(VALUE(MID(dms_FRCP_y1,3,2)),\"00\"),VALUE(LEFT(dms_FRCP_y1,4)-1))","v":{"$error":"#REF!"}},"dms_CRCP_yZ",1,null,"2005-06","2006",null,{"$f":"CRY","v":"2016-17"},{"$f":"VALUE(LEFT(CRY,4))&\"-\"&TEXT(MID(CRY,3,2)+1,\"00\")","v":"2016-17"},"dms_CRYf_y1",{"$f":"VALUE(LEFT(CRY,4)+1)","v":2017},"dms_CRYc_y1"]
[null,2,"dms_FRCP_y2",2,"CRCP_y2",{"$f":"IF(dms_RPT=\"financial\",VALUE(LEFT(dms_FRCP_y1,4)+1)&\"-\"&TEXT(VALUE(RIGHT(dms_FRCP_y1,2)+1),\"00\"),VALUE(LEFT(dms_FRCP_y1,4)+1))","v":{"$error":"#REF!"}},"dms_FRCP_y2",{"$f":"IF(dms_RPT=\"financial\",VALUE(LEFT(dms_CRCP_yZ,4)-1)&\"-\"&TEXT(VALUE(MID(dms_CRCP_yZ,3,2)),\"00\"),VALUE(LEFT(dms_CRCP_yZ,4)-1))","v":{"$error":"#REF!"}},"dms_CRCP_yY",2,null,"2006-07","2007",null,null,{"$f":"VALUE(LEFT(dms_CRYf_y1,4)+1)&\"-\"&TEXT(MID(dms_CRYf_y1,3,2)+2,\"00\")","v":"2017-18"},"dms_CRYf_y2",{"$f":"VALUE(LEFT(dms_CRYc_y1,4)+1)","v":2018},"dms_CRYc_y2"]
[null,3,"dms_FRCP_y3",3,"CRCP_y3",{"$f":"IF(dms_RPT=\"financial\",VALUE(LEFT(dms_FRCP_y2,4)+1)&\"-\"&TEXT(VALUE(RIGHT(dms_FRCP_y2,2)+1),\"00\"),VALUE(LEFT(dms_FRCP_y2,4)+1))","v":{"$error":"#REF!"}},"dms_FRCP_y3",{"$f":"IF(dms_RPT=\"financial\",VALUE(LEFT(dms_CRCP_yY,4)-1)&\"-\"&TEXT(VALUE(MID(dms_CRCP_yY,3,2)),\"00\"),VALUE(LEFT(dms_CRCP_yY,4)-1))","v":{"$error":"#REF!"}},"dms_CRCP_yX",3,null,"2007-08","2008",null,null,{"$f":"VALUE(LEFT(dms_CRYf_y2,4)+1)&\"-\"&TEXT(MID(dms_CRYf_y2,3,2)+2,\"00\")","v":"2018-19"},"dms_CRYf_y3",{"$f":"VALUE(LEFT(dms_CRYc_y2,4)+1)","v":2019},"dms_CRYc_y3"]
[null,4,"dms_FRCP_y4",4,"CRCP_y4",{"$f":"IF(dms_RPT=\"financial\",VALUE(LEFT(dms_FRCP_y3,4)+1)&\"-\"&TEXT(VALUE(RIGHT(dms_FRCP_y3,2)+1),\"00\"),VALUE(LEFT(dms_FRCP_y3,4)+1))","v":{"$error":"#REF!"}},"dms_FRCP_y4",{"$f":"IF(dms_RPT=\"financial\",VALUE(LEFT(dms_CRCP_yX,4)-1)&\"-\"&TEXT(VALUE(MID(dms_CRCP_yX,3,2)),\"00\"),VALUE(LEFT(dms_CRCP_yX,4)-1))","v":{"$error":"#REF!"}},"dms_CRCP_yW",4,null,"2008-09","2009",null,null,{"$f":"VALUE(LEFT(dms_CRYf_y3,4)+1)&\"-\"&TEXT(MID(dms_CRYf_y3,3,2)+2,\"00\")","v":"2019-20"},"dms_CRYf_y4",{"$f":"VALUE(LEFT(dms_CRYc_y3,4)+1)","v":2020},"dms_CRYc_y4"]
[null,5,"dms_FRCP_y5",5,"CRCP_y5",{"$f":"IF(dms_RPT=\"financial\",VALUE(LEFT(dms_FRCP_y4,4)+1)&\"-\"&TEXT(VALUE(RIGHT(dms_FRCP_y4,2)+1),\"00\"),VALUE(LEFT(dms_FRCP_y4,4)+1))","v":{"$error":"#REF!"}},"dms_FRCP_y5",{"$f":"IF(dms_RPT=\"financial\",VALUE(LEFT(dms_CRCP_yW,4)-1)&\"-\"&TEXT(VALUE(MID(dms_CRCP_yW,3,2)),\"00\"),VALUE(LEFT(dms_CRCP_yW,4)-1))","v":{"$error":"#REF!"}},"dms_CRCP_yV",5,null,"2009-10",2010,null,null,{"$f":"VALUE(LEFT(dms_CRYf_y4,4)+1)&\"-\"&TEXT(MID(dms_CRYf_y4,3,2)+2,\"00\")","v":"2020-21"},"dms_CRYf_y5",{"$f":"VALUE(LEFT(dms_CRYc_y4,4)+1)","v":2021},"dms_CRYc_y5"]
[null,6,"dms_FRCP_y6",6,"CRCP_y6",{"$f":"IF(dms_RPT=\"financial\",VALUE(LEFT(dms_FRCP_y5,4)+1)&\"-\"&TEXT(VALUE(RIGHT(dms_FRCP_y5,2)+1),\"00\"),VALUE(LEFT(dms_FRCP_y5,4)+1))","v":{"$error":"#REF!"}},"dms_FRCP_y6",{"$f":"IF(dms_RPT=\"financial\",VALUE(LEFT(dms_CRCP_yV,4)-1)&\"-\"&TEXT(VALUE(MID(dms_CRCP_yV,3,2)),\"00\"),VALUE(LEFT(dms_CRCP_yV,4)-1))","v":{"$error":"#REF!"}},"dms_CRCP_yU",6,null,"2010-11",2011,null,null,{"$f":"VALUE(LEFT(dms_CRYf_y5,4)+1)&\"-\"&TEXT(MID(dms_CRYf_y5,3,2)+2,\"00\")","v":"2021-22"},"dms_CRYf_y6",{"$f":"VALUE(LEFT(dms_CRYc_y5,4)+1)","v":2022},"dms_CRYc_y6"]
[null,7,"dms_FRCP_y7",7,"CRCP_y7",{"$f":"IF(dms_RPT=\"financial\",VALUE(LEFT(dms_FRCP_y6,4)+1)&\"-\"&TEXT(VALUE(RIGHT(dms_FRCP_y6,2)+1),\"00\"),VALUE(LEFT(dms_FRCP_y6,4)+1))","v":{"$error":"#REF!"}},"dms_FRCP_y7",{"$f":"IF(dms_RPT=\"financial\",VALUE(LEFT(dms_CRCP_yU,4)-1)&\"-\"&TEXT(VALUE(MID(dms_CRCP_yU,3,2)),\"00\"),VALUE(LEFT(dms_CRCP_yU,4)-1))","v":{"$error":"#REF!"}},"dms_CRCP_yT",7,null,"2011-12",2012,null,null,{"$f":"VALUE(LEFT(dms_CRYf_y6,4)+1)&\"-\"&TEXT(MID(dms_CRYf_y6,3,2)+2,\"00\")","v":"2022-23"},"dms_CRYf_y7",{"$f":"VALUE(LEFT(dms_CRYc_y6,4)+1)","v":2023},"dms_CRYc_y7"]
[null,8,"dms_FRCP_y8",8,"CRCP_y8",{"$f":"IF(dms_RPT=\"financial\",VALUE(LEFT(dms_FRCP_y7,4)+1)&\"-\"&TEXT(VALUE(RIGHT(dms_FRCP_y7,2)+1),\"00\"),VALUE(LEFT(dms_FRCP_y7,4)+1))","v":{"$error":"#REF!"}},"dms_FRCP_y8",{"$f":"IF(dms_RPT=\"financial\",VALUE(LEFT(dms_CRCP_yT,4)-1)&\"-\"&TEXT(VALUE(MID(dms_CRCP_yT,3,2)),\"00\"),VALUE(LEFT(dms_CRCP_yT,4)-1))","v":{"$error":"#REF!"}},"dms_CRCP_yS",8,null,"2012-13",2013,null,null,{"$f":"VALUE(LEFT(dms_CRYf_y7,4)+1)&\"-\"&TEXT(MID(dms_CRYf_y7,3,2)+2,\"00\")","v":"2023-24"},"dms_CRYf_y8",{"$f":"VALUE(LEFT(dms_CRYc_y7,4)+1)","v":2024},"dms_CRYc_y8"]
[null,9,"dms_FRCP_y9",9,"CRCP_y9",{"$f":"IF(dms_RPT=\"financial\",VALUE(LEFT(dms_FRCP_y8,4)+1)&\"-\"&TEXT(VALUE(RIGHT(dms_FRCP_y8,2)+1),\"00\"),VALUE(LEFT(dms_FRCP_y8,4)+1))","v":{"$error":"#REF!"}},"dms_FRCP_y9",{"$f":"IF(dms_RPT=\"financial\",VALUE(LEFT(dms_CRCP_yS,4)-1)&\"-\"&TEXT(VALUE(MID(dms_CRCP_yS,3,2)),\"00\"),VALUE(LEFT(dms_CRCP_yS,4)-1))","v":{"$error":"#REF!"}},"dms_CRCP_yR",9,null,"2013-14",2014,null,null,{"$f":"VALUE(LEFT(dms_CRYf_y8,4)+1)&\"-\"&TEXT(MID(dms_CRYf_y8,3,2)+2,\"00\")","v":"2024-25"},"dms_CRYf_y9",{"$f":"VALUE(LEFT(dms_CRYc_y8,4)+1)","v":2025},"dms_CRYc_y9"]
[null,10,"dms_FRCP_y10",10,"CRCP_y10",{"$f":"IF(dms_RPT=\"financial\",VALUE(LEFT(dms_FRCP_y9,4)+1)&\"-\"&TEXT(VALUE(RIGHT(dms_FRCP_y9,2)+1),\"00\"),VALUE(LEFT(dms_FRCP_y9,4)+1))","v":{"$error":"#REF!"}},"dms_FRCP_y10",{"$f":"IF(dms_RPT=\"financial\",VALUE(LEFT(dms_CRCP_yR,4)-1)&\"-\"&TEXT(VALUE(MID(dms_CRCP_yR,3,2)),\"00\"),VALUE(LEFT(dms_CRCP_yR,4)-1))","v":{"$error":"#REF!"}},"dms_CRCP_yQ",10,null,"2014-15",2015,null,null,{"$f":"VALUE(LEFT(dms_CRYf_y9,4)+1)&\"-\"&TEXT(MID(dms_CRYf_y9,3,2)+2,\"00\")","v":"2025-26"},"dms_CRYf_y10",{"$f":"VALUE(LEFT(dms_CRYc_y9,4)+1)","v":2026},"dms_CRYc_y10"]
[null,11,"dms_FRCP_y11",11,"CRCP_y11",{"$f":"IF(dms_RPT=\"financial\",VALUE(LEFT(dms_FRCP_y10,4)+1)&\"-\"&TEXT(VALUE(RIGHT(dms_FRCP_y10,2)+1),\"00\"),VALUE(LEFT(dms_FRCP_y10,4)+1))","v":{"$error":"#REF!"}},"dms_FRCP_y11",{"$f":"IF(dms_RPT=\"financial\",VALUE(LEFT(dms_CRCP_yQ,4)-1)&\"-\"&TEXT(VALUE(MID(dms_CRCP_yQ,3,2)),\"00\"),VALUE(LEFT(dms_CRCP_yQ,4)-1))","v":{"$error":"#REF!"}},"dms_CRCP_yP",11,null,"2015-16",2016,null,null,{"$f":"VALUE(LEFT(dms_CRYf_y10,4)+1)&\"-\"&TEXT(MID(dms_CRYf_y10,3,2)+2,\"00\")","v":"2026-27"},"dms_CRYf_y11",{"$f":"VALUE(LEFT(dms_CRYc_y10,4)+1)","v":2027},"dms_CRYc_y11"]
[null,12,"dms_FRCP_y12",12,"CRCP_y12",{"$f":"IF(dms_RPT=\"financial\",VALUE(LEFT(dms_FRCP_y11,4)+1)&\"-\"&TEXT(VALUE(RIGHT(dms_FRCP_y11,2)+1),\"00\"),VALUE(LEFT(dms_FRCP_y11,4)+1))","v":{"$error":"#REF!"}},"dms_FRCP_y12",{"$f":"IF(dms_RPT=\"financial\",VALUE(LEFT(dms_CRCP_yP,4)-1)&\"-\"&TEXT(VALUE(MID(dms_CRCP_yP,3,2)),\"00\"),VALUE(LEFT(dms_CRCP_yP,4)-1))","v":{"$error":"#REF!"}},"dms_CRCP_yO",12,null,"2016-17",2017,null,null,{"$f":"VALUE(LEFT(dms_CRYf_y11,4)+1)&\"-\"&TEXT(MID(dms_CRYf_y11,3,2)+2,\"00\")","v":"2027-28"},"dms_CRYf_y12",{"$f":"VALUE(LEFT(dms_CRYc_y11,4)+1)","v":2028},"dms_CRYc_y12"]
[null,13,"dms_FRCP_y13",13,"CRCP_y13",{"$f":"IF(dms_RPT=\"financial\",VALUE(LEFT(dms_FRCP_y12,4)+1)&\"-\"&TEXT(VALUE(RIGHT(dms_FRCP_y12,2)+1),\"00\"),VALUE(LEFT(dms_FRCP_y12,4)+1))","v":{"$error":"#REF!"}},"dms_FRCP_y13",{"$f":"IF(dms_RPT=\"financial\",VALUE(LEFT(dms_CRCP_yO,4)-1)&\"-\"&TEXT(VALUE(MID(dms_CRCP_yO,3,2)),\"00\"),VALUE(LEFT(dms_CRCP_yO,4)-1))","v":{"$error":"#REF!"}},"dms_CRCP_yN",13,null,"2017-18",2018,null,null,{"$f":"VALUE(LEFT(dms_CRYf_y12,4)+1)&\"-\"&TEXT(MID(dms_CRYf_y12,3,2)+2,\"00\")","v":"2028-29"},"dms_CRYf_y13",{"$f":"VALUE(LEFT(dms_CRYc_y12,4)+1)","v":2029},"dms_CRYc_y13"]
[null,14,"dms_FRCP_y14",14,"CRCP_y14",{"$f":"IF(dms_RPT=\"financial\",VALUE(LEFT(dms_FRCP_y13,4)+1)&\"-\"&TEXT(VALUE(RIGHT(dms_FRCP_y13,2)+1),\"00\"),VALUE(LEFT(dms_FRCP_y13,4)+1))","v":{"$error":"#REF!"}},"dms_FRCP_y14",{"$f":"IF(dms_RPT=\"financial\",VALUE(LEFT(dms_CRCP_yN,4)-1)&\"-\"&TEXT(VALUE(MID(dms_CRCP_yN,3,2)),\"00\"),VALUE(LEFT(dms_CRCP_yN,4)-1))","v":{"$error":"#REF!"}},"dms_CRCP_yM",14,null,"2018-19",2019,null,null,{"$f":"VALUE(LEFT(dms_CRYf_y13,4)+1)&\"-\"&TEXT(MID(dms_CRYf_y13,3,2)+2,\"00\")","v":"2029-30"},"dms_CRYf_y14",{"$f":"VALUE(LEFT(dms_CRYc_y13,4)+1)","v":2030},"dms_CRYc_y14"]
[null,15,"dms_FRCP_y15",15,"CRCP_y15",{"$f":"IF(dms_RPT=\"financial\",VALUE(LEFT(dms_FRCP_y14,4)+1)&\"-\"&TEXT(VALUE(RIGHT(dms_FRCP_y14,2)+1),\"00\"),VALUE(LEFT(dms_FRCP_y14,4)+1))","v":{"$error":"#REF!"}},"dms_FRCP_y15",{"$f":"IF(dms_RPT=\"financial\",VALUE(LEFT(dms_CRCP_yM,4)-1)&\"-\"&TEXT(VALUE(MID(dms_CRCP_yM,3,2)),\"00\"),VALUE(LEFT(dms_CRCP_yM,4)-1))","v":{"$error":"#REF!"}},"dms_CRCP_yL",15,null,"2019-20",2020,null,null,{"$f":"VALUE(LEFT(dms_CRYf_y14,4)+1)&\"-\"&TEXT(MID(dms_CRYf_y14,3,2)+2,\"00\")","v":"2030-31"},"dms_CRYf_y15",{"$f":"VALUE(LEFT(dms_CRYc_y14,4)+1)","v":2031},"dms_CRYc_y15"]
[null,null,null,null,null,null,null,null,null,null,null,"2020-21",2021,null,null,{"$f":"VALUE(LEFT(dms_CRYf_y15,4)+1)&\"-\"&TEXT(MID(dms_CRYf_y15,3,2)+2,\"00\")","v":"2031-32"},"dms_CRYf_y16",{"$f":"VALUE(LEFT(dms_CRYc_y15,4)+1)","v":2032},"dms_CRYc_y16"]
[null,"These are drop down lists for businesses to select the correct FRCP_y1 on the business and other details worksheet.\nThis also populates the column headings in the worksheets",null,null,null,null,null,null,null,null,null,"2021-22",2022,null,null,{"$f":"VALUE(LEFT(dms_CRYf_y16,4)+1)&\"-\"&TEXT(MID(dms_CRYf_y16,3,2)+2,\"00\")","v":"2032-33"},"dms_CRYf_y17",{"$f":"VALUE(LEFT(dms_CRYc_y16,4)+1)","v":2033},"dms_CRYc_y17"]
[null,"dms_RCP_fyear_list","dms_CRY_ListF","dms_CRY_ListC","dms_RCP_cyear_list","dms_FRCP_fyear_list","dms_FRCP_ListF","dms_FRCP_ListC","dms_FRCP_cyear_list",null,null,"2022-23",2023,null,null,{"$f":"VALUE(LEFT(dms_CRYf_y17,4)+1)&\"-\"&TEXT(MID(dms_CRYf_y17,3,2)+2,\"00\")","v":"2033-34"},"dms_CRYf_y18",{"$f":"VALUE(LEFT(dms_CRYc_y17,4)+1)","v":2034},"dms_CRYc_y18"]
[null,"dms_fy1","2005-06","2006","dms_cy1","dms_frcp_fy1","2010-11",2011,"dms_crcp_cy1",null,null,"2023-24",2024,null,null,{"$f":"VALUE(LEFT(dms_CRYf_y18,4)+1)&\"-\"&TEXT(MID(dms_CRYf_y18,3,2)+2,\"00\")","v":"2034-35"},"dms_CRYf_y19",{"$f":"VALUE(LEFT(dms_CRYc_y18,4)+1)","v":2035},"dms_CRYc_y19"]
[null,"dms_fy2","2006-07","2007","dms_cy2","dms_frcp_fy2","2011-12",2012,"dms_crcp_cy2",null,null,"2024-25",2025,null,null,{"$f":"VALUE(LEFT(dms_CRYf_y19,4)+1)&\"-\"&TEXT(MID(dms_CRYf_y19,3,2)+2,\"00\")","v":"2035-36"},"dms_CRYf_y20",{"$f":"VALUE(LEFT(dms_CRYc_y19,4)+1)","v":2036},"dms_CRYc_y20"]
[null,"dms_fy3","2007-08","2008","dms_cy3","dms_frcp_fy3","2012-13",2013,"dms_crcp_cy3",null,null,"2025-26",2026]
[null,"dms_fy4","2008-09","2009","dms_cy4","dms_frcp_fy4","2013-14",2014,"dms_crcp_cy4",null,null,"2026-27",2027]
[null,"dms_fy5","2009-10",2010,"dms_cy5","dms_frcp_fy5","2014-15",2015,"dms_crcp_cy5",null,null,"2027-28",2028]
[null,"dms_fy6","2010-11",2011,"dms_cy6","dms_frcp_fy6","2015-16",2016,"dms_crcp_cy6",null,null,"2028-29",2029]
[null,"dms_fy7","2011-12",2012,"dms_cy7","dms_frcp_fy7","2016-17",2017,"dms_crcp_cy7",null,null,"2029-30",2030]
[null,"dms_fy8","2012-13",2013,"dms_cy8","dms_frcp_fy8","2017-18",2018,"dms_crcp_cy8",null,null,"2030-31",2031]
[null,"dms_fy9","2013-14",2014,"dms_cy9","dms_frcp_fy9","2018-19",2019,"dms_crcp_cy9",null,null,"2031-32",2032]
[null,"dms_fy10","2014-15",2015,"dms_cy10","dms_frcp_fy10","2019-20",2020,"dms_crcp_cy10",null,null,"2032-33",2033]
[null,"dms_fy11","2015-16",2016,"dms_cy11","dms_frcp_fy11","2020-21",2021,"dms_crcp_cy11",null,null,"2033-34",2034]
[null,"dms_fy12","2016-17",2017,"dms_cy12","dms_frcp_fy12","2021-22",2022,"dms_crcp_cy12",null,null,"2034-35",2035]
[null,"dms_fy13","2017-18",2018,"dms_cy13","dms_frcp_fy13","2022-23",2023,"dms_crcp_cy13",null,null,"2035-36",2036]
[null,"dms_fy14","2018-19",2019,"dms_cy14","dms_frcp_fy14","2023-24",2024,"dms_crcp_cy14"]
[null,"dms_fy15","2019-20",2020,"dms_cy15","dms_frcp_fy15","2024-25",2025,"dms_crcp_cy15"]
[null,"dms_fy16","2020-21",2021,"dms_cy16"]
[null,"dms_fy17","2021-22",2022,"dms_cy17"]
[null,"dms_fy18","2022-23",2023,"dms_cy18"]
[null,"dms_fy19","2023-24",2024,"dms_cy19"]
[null,"dms_fy20","2024-25",2025,"dms_cy20"]
[]
[]
[]
[]
[]
[]
[]
[]
[]
[]
[]
[null,"These \"row descriptions\" are the column headings in the various templates but become row descriptions in the ETL process"]
[null,null,"Table 6.3 sustained interruptions - row descriptions"]
[null,null,"dms_060301_CustNo_Affected_Row","dms_060301_Avg_Duration_Sustained_Int_Row","dms_060301_Effect_unplanned_SAIDI_Row","dms_060301_Effect_unplanned_SAIFI_Row"]
[null,null,"Number of customers affected by the interruption","Average duration of sustained customer interruption","Effect on unplanned SAIDI","Effect on unplanned SAIFI"]
[]
[]
[]
[null,null,"Table 6.1 telephone answering - row descriptions and start date"]
[null,null,"dms_060101_Rows","dms_060102_Rows","dms_060101_StartDateTxt"]
[null,null,"Total number of calls \n(after removing excluded events)","Number of calls answered within 30 seconds \n(after excluding excluded events) ",{"$f":"dms_060701_StartDateTxt","v":{"$error":"#REF!"}}]
[]
[]
[]
[null,null,null,null,null,null,null,"dms_0603_FeederList",{"$f":"INDEX(dms_FeederName_1,MATCH(dms_TradingName,dms_TradingName_List))","v":"CBD"},{"$f":"INDEX(dms_FeederName_2,MATCH(dms_TradingName,dms_TradingName_List))","v":"Urban"},{"$f":"INDEX(dms_FeederName_3,MATCH(dms_TradingName,dms_TradingName_List))","v":"Short rural"},{"$f":"INDEX(dms_FeederName_4,MATCH(dms_TradingName,dms_TradingName_List))","v":"Long rural"}]
[null,null,"Table 6.7.1 - daily performance data - unplanned - MAIFI  -- row descriptions and header named range values"]
[null,null,"These headings (Lists) are determined from the INDEX/MATCH function on the NSP selected on the Business & other details sheet"]
[null,"dms_060701_Feeder_Header_Lvl4",{"$f":"INDEX(dms_FeederName_1,MATCH(dms_TradingName,dms_TradingName_List))","v":"CBD"},{"$f":"INDEX(dms_FeederName_1,MATCH(dms_TradingName,dms_TradingName_List))","v":"CBD"},{"$f":"INDEX(dms_FeederName_2,MATCH(dms_TradingName,dms_TradingName_List))","v":"Urban"},{"$f":"INDEX(dms_FeederName_2,MATCH(dms_TradingName,dms_TradingName_List))","v":"Urban"},{"$f":"INDEX(dms_FeederName_3,MATCH(dms_TradingName,dms_TradingName_List))","v":"Short rural"},{"$f":"INDEX(dms_FeederName_3,MATCH(dms_TradingName,dms_TradingName_List))","v":"Short rural"},{"$f":"INDEX(dms_FeederName_4,MATCH(dms_TradingName,dms_TradingName_List))","v":"Long rural"},{"$f":"INDEX(dms_FeederName_4,MATCH(dms_TradingName,dms_TradingName_List))","v":"Long rural"},{"$f":"IF((INDEX(dms_FeederName_5,MATCH(dms_TradingName,dms_TradingName_List))=0),\"Network\",(INDEX(dms_FeederName_5,MATCH(dms_TradingName,dms_TradingName_List))))","v":"Network"},{"$f":"IF((INDEX(dms_FeederName_5,MATCH(dms_TradingName,dms_TradingName_List))=0),\"Network\",(INDEX(dms_FeederName_5,MATCH(dms_TradingName,dms_TradingName_List))))","v":"Network"},"Network","Network"]
[]
[null,"dms_060701_Rows","All events","After removing excluded events","All events","After removing excluded events","All events","After removing excluded events","All events","After removing excluded events","All events","After removing excluded events","All events","After removing excluded events"]
[null,null,"the number of column headings changes from 10 to 12 depending on the number of feeder categories for the NSP"]
[]
[]
[]
[]
[null,null,"Table 6.8.1 - row descriptions"]
[null,null,"dms_060801_01_Rows","dms_060801_02_Rows","dms_060801_03_Rows","dms_060801_04_Rows"]
[null,null,"Number of interruptions","Duration of interruptions","Total unplanned minutes off supply","Effect on unplanned MAIFI"]
[]
[]
[]
[]
[null,null,"Table 7.9.4 - market impact component - row descriptions"]
[null,"dms_070904_01_Rows","without exclusions","with exclusions"]
[]
[]
[]
[]
[]
[null,null,"Use this to add to existing files"]
[null,null,"ARRs 6.7 STPIS daily performance"]
[null,null,"dms_060101_Values","dms_060102_Values","dms_060701_Values"]
[]
[null,null,"ARR's  6.8 STPIS exclusions"]
[null,null,"dms_060801_Event_Date","dms_060801_OutageID","dms_060801_FeederID","dms_060801_FeederClass","dms_060801_CauseID","dms_060801_01_Values","dms_060801_02_Values","dms_060801_03_Values","dms_060801_Excl_Cat","dms_060801_04_Values"]
[]
[null,null,"CA 6.3 sustained interruptions"]
[null,null,"dms_060301_Event_Date","dms_060301_Event_Time","dms_060301_AssetID","dms_060301_FeederClass","dms_060301_Reason","dms_060301_DetailedReason","dms_060301_CustNo_Affected_Values","dms_060301_Avg_Duration_Sustained_Int_Values","dms_060301_Effect_unplanned_SAIDI_Values","dms_060301_Effect_unplanned_SAIFI_Values","dms_060301_MED"]

{"sheet":"Business & other details","index":1,"n_rows":50,"n_cols":7,"rows_kept":50,"cut":false,"hidden":false,"merged":[[23,4,23,7],[24,2,24,3],[24,4,24,7],[32,1,32,8],[7,1,7,8],[11,1,11,8],[13,2,13,4],[14,2,14,4],[17,2,17,3],[17,4,17,7],[18,4,18,7],[19,2,19,3],[19,4,19,7],[22,2,22,3],[22,4,22,7]]}
[]
[null,{"$f":"INDEX(dms_TradingNameFull_List,MATCH(dms_TradingName,dms_TradingName_List))","v":"Ausgrid"}]
[]
[null,"BUSINESS & OTHER DETAILS"]
[]
[]
[null,"Instructions"]
[null,"Complete the following business details regulatory template before entering data or values in any other regulatory template. This regulatory template is linked to other cells within the spreadsheet and automatically generates column headings and conditional formatting to distinguish business specific input and non-input cells. "]
[]
[null,"SUBMISSION PARTICULARS INPUT SHEETS"]
[]
[null,"ENTITY DETAILS"]
[]
[null,"Short name","Ausgrid",null,null,"Select business name from drop down list first"]
[null,"ACN / ABN",{"$f":"INDEX(dms_ABN_List,MATCH(dms_TradingName,dms_TradingName_List))","v":78508211731}]
[]
[]
[null,"Business address","Address 1",null,{"$f":"INDEX(dms_Addr1_List,MATCH(dms_TradingName,dms_TradingName_List))","v":"570 George St"}]
[null,null,null,"Address 2",{"$f":"IF(ISBLANK(INDEX(dms_Addr2_List,MATCH(dms_TradingName,dms_TradingName_List))),\"\",(INDEX(dms_Addr2_List,MATCH(dms_TradingName,dms_TradingName_List))))","v":""}]
[null,null,"Suburb",null,{"$f":"INDEX(dms_Suburb_List,MATCH(dms_TradingName,dms_TradingName_List))","v":"SYDNEY"}]
[null,null,null,"State",{"$f":"INDEX(dms_State_List,MATCH(dms_TradingName,dms_TradingName_List))","v":"NSW"},"p/code",{"$f":"INDEX(dms_PostCode_List,MATCH(dms_TradingName,dms_TradingName_List))","v":2000}]
[]
[null,"Postal address","Address 1",null,{"$f":"INDEX(dms_PAddr1_List,MATCH(dms_TradingName,dms_TradingName_List))","v":"GPO Box 4009"}]
[null,null,null,"Address 2",{"$f":"IF(ISBLANK(INDEX(dms_PAddr2_List,MATCH(dms_TradingName,dms_TradingName_List))),\"\",(INDEX(dms_PAddr2_List,MATCH(dms_TradingName,dms_TradingName_List))))","v":""}]
[null,null,"Suburb",null,{"$f":"INDEX(dms_PSuburb_List,MATCH(dms_TradingName,dms_TradingName_List))","v":"SYDNEY"}]
[null,null,null,"State",{"$f":"INDEX(dms_PState_List,MATCH(dms_TradingName,dms_TradingName_List))","v":"NSW"},"p/code",{"$f":"INDEX(dms_PPostCode_List,MATCH(dms_TradingName,dms_TradingName_List))","v":2001}]
[]
[]
[null,"Contact name/s",{"$f":"INDEX(dms_ContactName1_List,MATCH(dms_TradingName,dms_TradingName_List))","v":"John Thomson"}]
[null,"Contact phone/s"]
[null,"Contact email address/s"]
[]
[null,"REGULATORY CONTROL PERIODS"]
[]
[null,"Forthcoming regulatory control period","2020-21"]
[]
[]
[]
[null,"Current regulatory control period"]
[]
[]
[]
[]
[null,"Previous regulatory control period"]
[]
[]
[]
[null,"Commencing regulatory year","2016-17","CRY"]
[]
[null,"Last completed regulatory year","2016-17","dms_FinalYear"]

{"sheet":"Contents","index":2,"n_rows":31,"n_cols":4,"rows_kept":31,"cut":false,"hidden":false,"merged":[[2,1,2,3],[3,1,3,3],[4,1,4,3]]}
[]
[]
[]
[null,"Annual Reporting RIN Template"]
[null,"Table of Contents"]
[]
[]
[null,null,"Instructions"]
[null,null,"Business & other details"]
[]
[]
[null,"CATEGORY ANALYSIS","STPIS","STATUTORY ACCOUNTS"]
[]
[null,"2.11 Labour","6.2 STPIS Reliability","8.1 Income"]
[null,null,"6.6 STPIS Customer Service","8.2 Capex"]
[null,null,"6.7 STPIS Daily Performance"]
[null,null,"6.8 STPIS Exclusions","8.4 Opex"]
[null,null,"6.9 STPIS GSL"]
[]
[]
[]
[null,"NETWORK PERFORMANCE","OTHER INFORMATION","PRICING PROPOSAL"]
[null,null,null,"Victorian Businesses Only"]
[null,"3.6 Quality of services","7.8 Avoided Cost Payments"]
[null,"3.6.8 Network-feeders","7.10 Juris Scheme","9.5 TUoS"]
[null,"3.6.9 Network-reliability","7.11 DMIS-DMIA"]
[null,null,"7.12 Safety and Bushfire"]
[null,null,"7.13 TARC"]
[null,"PUBLIC LIGHTING"]
[]
[null,"4.1 Public lighting tariffs"]

{"sheet":"Instructions","index":3,"n_rows":26,"n_cols":6,"rows_kept":26,"cut":false,"hidden":false,"merged":[[17,2,17,4],[19,2,19,4],[25,2,25,4],[7,1,7,5],[8,1,8,5],[14,2,14,4],[10,2,10,4],[16,2,16,3]]}
[]
[]
[]
[]
[]
[]
[]
[]
[null,"Annual Reporting RIN Template"]
[]
[null,null,{"$f":"CONCATENATE(\"This template is to be used by \",dms_TradingName, \" to fulfil its annual reporting obligations to the AER.\")","v":"This template is to be used by Ausgrid to fulfil its annual reporting obligations to the AER."}]
[null,null,null,null,null,"Amendments made December 2015"]
[null,null,null,null,null,"Click here for details."]
[null,null,"INSTRUCTIONS"]
[null,null,"Complete the Business & other details worksheet before entering data or values in any other worksheets. The Business & other details worksheet is linked to other cells within the workbook and automatically generates certain column headings and conditional formatting."]
[]
[null,null,"Identifying CONFIDENTIAL INFORMATION:\n\nPlease use the macro at the top of each \nworksheet to identify confidential information. \n\n"]
[null,null,"-Do this by selecting the cell or cells that contain confidential information and then run the Mark selected cells as CONFIDENTIAL macro. This will format the cells a specific colour that is identified by the AER's database which in turn marks that information as confidential.\n\n-To reverse this, select the cell or cells and run the Return cells to NON-CONFIDENTIAL macro"]
[]
[null,null,"All amounts are to be unrounded and reported in nominal terms on a one for one basis: that is 1000 is to be entered as '1000' not '1' as in previous templates.\n\nColour coding of input sheets:"]
[null,null,null,"Yellow = Input cells"]
[null,null,null,"Grey = Not applicable/No inputs required"]
[null,null,null,"Leave coloured cells blank if no information exists. \nPLEASE DO NOT ENTER TEXT into cells that are to contain numeric data."]
[]
[]
[null,null,"Returning completed responses\n\nPlease return two (2) files to the AER: \n1. A confidential version which must contain a complete set of all responses with confidential information marked using the Mark selected cells CONFIDENTIAL macro and which has been completed using the locked template file provided by the AER. \n\n2. A public version with confidential information either removed completely or aggregated in some form together with writtten consent to disclose the public version of the response.\n\nUse the drop down box on the Business and other details worksheet to identify the file as either confidential ('consolidated') or public. "]

{"sheet":"2.11 Labour","index":4,"n_rows":36,"n_cols":4,"rows_kept":36,"cut":false,"hidden":false,"merged":[]}
[]
[null,{"$f":"dms_TradingName","v":"Ausgrid"}]
[null,{"$f":"CONCATENATE(\"Annual Reporting RIN Response \",CRY)","v":"Annual Reporting RIN Response 2016-17"}]
[null,"2.11 LABOUR "]
[]
[null,"Tables 2.11.1 and 2.11.2 deliberately omitted."]
[]
[null,"2.11.3 - LABOUR / NON-LABOUR EXPENDITURE SPLIT"]
[null,"2.11.3.1 - Opex"]
[null,null,{"$f":"CRY","v":"2016-17"}]
[null,null,"$0's, nominal"]
[null,null,"Opex "]
[null,"In-house labour expenditure",334740920.87736368]
[null,"Labour expenditure outsourced to related parties",0]
[null,"Labour expenditure outsourced to unrelated parties",0]
[null,"Controllable non-labour expenditure",168180747.92564285]
[null,"Uncontrollable non-labour expenditure",28215559.919495247]
[null,"Total",{"$f":"SUM(C13:C17)","v":531137228.72250175}]
[]
[null,"Reconciliation with Opex worksheets - SCS","Opex"]
[null,"Total including margins",{"$f":"dms_Total_Actual_Opex","v":531137228.72250181},{"$f":"IF(C18=dms_Total_Actual_Opex,\"OK\",\"Error\")","v":"OK"}]
[]
[]
[null,"2.11.3.2 - Capex"]
[null,null,{"$f":"CRY","v":"2016-17"}]
[null,null,"$0's, nominal"]
[null,null,"Capex"]
[null,"In-house labour expenditure",208648393.44999999]
[null,"Labour expenditure outsourced to related parties",0]
[null,"Labour expenditure outsourced to unrelated parties",0]
[null,"Controllable non-labour expenditure",249433078.24000001]
[null,"Uncontrollable non-labour expenditure",0]
[null,"Total",{"$f":"SUM(C28:C32)","v":458081471.69}]
[]
[null,"Reconciliation with Capex & Opex worksheets - SCS","Capex"]
[null,"Total including margins",{"$f":"dms_Total_Actual_Capex","v":574018873.55999994},{"$f":"IF(C33=dms_Total_Actual_Capex,\"OK\",\"Error\")","v":"Error"}]

{"sheet":"3.6 Quality of services","index":5,"n_rows":71,"n_cols":4,"rows_kept":71,"cut":false,"hidden":false,"merged":[[6,2,7,2],[24,2,25,2],[24,1,25,1]]}
[]
[null,{"$f":"dms_TradingName","v":"Ausgrid"}]
[null,{"$f":"CONCATENATE(\"Annual Reporting RIN Response \",CRY)","v":"Annual Reporting RIN Response 2016-17"}]
[null,"3.6 QUALITY OF SERVICES"]
[]
[null,"3.6.5 - QUALITY OF SUPPLY METRICS"]
[null,null,"Unit","Volume"]
[null,null,null,{"$f":"CRY","v":"2016-17"}]
[null,"Over voltage events - due to high voltage injection","number"]
[null,"Customers receiving over-voltage - due to high voltage injection","number"]
[null,"Over voltage events - due to lightning","number"]
[null,"Customers receiving over-voltage - due to lightning","number"]
[null,"Over voltage events - due to voltage regulation or other cause","number"]
[null,"Customers receiving over-voltage - due to voltage regulation or other cause","number"]
[null,"Voltage variations - steady state (zone sub)","number"]
[null,"Voltage variations - one minute (zone sub)","number"]
[null,"Voltage variations - 10 seconds (zone sub) Min<0.7","number"]
[null,"Voltage variations - 10 seconds (zone sub) Min<0.8","number"]
[null,"Voltage variations - 10 seconds (zone sub) Min<0.9","number"]
[null,"Voltage variations - steady state (feeder)","number"]
[null,"Voltage variations - % zone subs monitored","(per cent)"]
[null,"Voltage variations - % feeders monitored","(per cent)"]
[]
[null,"3.6.6 - COMPLAINTS - TECHNICAL QUALITY OF SUPPLY"]
[null,null,"Unit","Volume"]
[null,null,null,{"$f":"CRY","v":"2016-17"}]
[null,"3.6.6.1 - TECHNICAL QUALITY OF SUPPLY"]
[null,"Number of complaints - technical quality of supply","number",110]
[null,"3.6.6.2 - PERCENTAGE OF COMPLAINTS BY CATEGORY"]
[null,"Low voltage supply","(per cent)"]
[null,"Voltage dips","(per cent)"]
[null,"Voltage swell","(per cent)"]
[null,"Voltage spike (impulsive transient)","(per cent)"]
[null,"Waveform distortion","(per cent)"]
[null,"TV or radio interference","(per cent)"]
[null,"Solar related","(per cent)"]
[null,"Noise from appliances","(per cent)"]
[null,"Other","(per cent)"]
[null,"3.6.6.3 - PERCENTAGE OF COMPLAINTS BY LIKELY CAUSE"]
[null,"Network equipment faulty","(per cent)"]
[null,"Network interference by NSP equipment","(per cent)"]
[null,"Network interference by another customer","(per cent)"]
[null,"Network limitation","(per cent)"]
[null,"Customer internal problem","(per cent)"]
[null,"No problem identified","(per cent)"]
[null,"Environmental","(per cent)"]
[null,"Other","(per cent)"]
[]
[null,"3.6.7 - CUSTOMER SERVICE METRICS"]
[null,null,"Unit",{"$f":"CRY","v":"2016-17"}]
[null,"3.6.7.1 - TIMELY PROVISIONS OF SERVICES"]
[null,"Number of connections made","number",132]
[null,"Number of connections not made on or before agreed date","number",0]
[null,"3.6.7.2 - TIMELY REPAIR OF FAULTY STREET LIGHTS"]
[null,"Street lights - average monthly number \"out\"","number",1546.7]
[null,"Street lights - not repaired by \"fix by\" date","number",5752]
[null,"Street lights - average number of days to repair","number",7]
[null,"Total number of street lights","number",251461]
[null,"3.6.7.3 - CALL CENTRE PERFORMANCE"]
[null,"Calls to call centre fault line","number",182890]
[null,"Calls to fault line answered within 30 seconds","number",14300]
[null,"Calls to fault line - average waiting time before call answered","number",26]
[null,"Call centre - number of overload events","number",0]
[null,"Percentage of calls abandoned","(per cent)",6.2]
[null,"3.6.7.4 - NUMBER OF CUSTOMER COMPLAINTS"]
[null,"Complaint - reliability of supply","number"]
[null,"Complaint - technical quality of supply","number",{"$f":"IF(ISBLANK(D28),\"\",D28)","v":110}]
[null,"Complaint - administrative process or customer service","number"]
[null,"Complaint - connection or augmentation","number"]
[null,"Complaint - other","number"]
[null,"Total number of complaints","number"]

{"sheet":"3.6.8 Network-feeders","index":6,"n_rows":1743,"n_cols":23,"rows_kept":1743,"cut":false,"hidden":false,"merged":[[10,10,10,14],[11,11,11,12],[11,13,11,14],[11,18,11,19],[11,15,12,15],[11,10,12,10],[10,15,10,19],[11,16,11,17],[5,6,5,8],[5,1,5,4],[11,8,12,8],[11,9,12,9],[11,20,12,20],[10,20,10,22],[11,21,11,22],[10,1,12,1],[10,2,12,2],[10,3,12,3],[10,4,12,4],[10,7,12,7],[11,5,12,5],[11,6,12,6],[10,5,10,6],[10,8,10,9]]}
[null,null,null,null,null,null,{"$f":"CONCATENATE(\"1-Jan-\",LEFT(CRY,4))","v":"1-Jan-2016"}]
[null,{"$f":"dms_TradingName","v":"Ausgrid"}]
[null,{"$f":"CONCATENATE(\"Annual Reporting RIN Response \",CRY)","v":"Annual Reporting RIN Response 2016-17"}]
[null,"3.6 QUALITY OF SERVICES"]
[]
[null,"Did the MAIFI parameter of the STPIS apply during the period?",null,null,null,"No","** IMPORTANT\nPlease ensure this question is answered correctly. Your response will affect other tables throughout this workbook and will determine which cells are grey and which are input cells. "]
[]
[]
[]
[null,"3.6.8 - NETWORK FEEDER RELIABILITY"]
[null,"Feeder ID / name","Description of the service area for the feeder","Feeder classification\n\n(drop down)","Number of distribution customers","Length of high voltage distribution lines",null,"Maximum demand\n(MVA)","Energy not supplied\n(MWh)",null,"Unplanned Outages",null,null,null,null,"Planned Outages",null,null,null,null,"Momentary feeder outages"]
[null,null,null,null,null,"Overhead","Underground",null,"Unplanned","Planned","Total number of unplanned outages","Unplanned customer minutes off-supply (SAIDI)",null,"Unplanned interruptions\n(SAIFI)",null,"Total number of planned outages","Planned customer minutes off-supply (SAIDI)",null,"Planned interruptions\n(SAIFI)",null,"Total number of momentary feeder outages","Momentary interruptions due to feeder outages (MAIFI)"]
[null,null,null,null,null,null,null,null,null,null,null,"Including excluded events and MEDs","After removing excluded events and MED","Including excluded events and MEDs","After removing excluded events and MED",null,"Including MEDs","After removing  MED","Including MEDs","After removing  MED",null,"Including excluded events and MEDs","After removing excluded events and MED"]
[null,"202:34231 37 42","NEWCASTLE CBD 33","URBAN",392,0,4779.2951249673397,3.0937760000000001,432.77481846712982,260.92166755719893,5,19090.9333333334,19090.9333333334,23.469387755102002,23.469387755102002,3,11510,11510,10.2040816326531,10.2040816326531]
[null,"202:34232","NEWCASTLE CBD 33","URBAN",809,2554.7281931584298,1541.4648947195601,3.2950257435061112,0.48287504698006894,0.24143752349003447,1,20,20,0.247218788627936,0.247218788627936,1,10,10,0.123609394313968,0.123609394313968]
[null,"202:34239","NEWCASTLE CBD 33","SHORT RURAL",58,0,3997.3819239817199,0.16475128717530552,0,35.847436300182856,0,0,0,0,0,3,29695,29695,96.551724137931004,96.551724137931004]
[null,"202:34240","NEWCASTLE CBD 33","URBAN",930,0,4892.8022943961196,5.1072899024344718,4.5474958747296714,0,1,121.5166666667,121.5166666667,0.10752688172043,0.10752688172043,0,0,0,0,0]
[null,"202:34245","NEWCASTLE CBD 33","URBAN",963,3446.4684597156602,3578.3906670286001,4.155393576532707,272.67564026074814,0,3,8955.4666666666999,8955.4666666666999,15.680166147455902,15.680166147455902,0,0,0,0,0]
[null,"202:34249","NEWCASTLE CBD 33","URBAN",401,0,5813.4337290055601,3.1851915520559073,9.0846904151212708,723.74116833117705,2,389.25,389.25,0.49875311720698201,0.49875311720698201,5,31010,31010,35.660847880299201,35.660847880299201]
[null,"202:34250","NEWCASTLE CBD 33","URBAN",1195,2708.5949745612802,1814.15289756116,2.9289117720054314,3.7034727677278512,1168.9868359557488,2,172.5666666667,172.5666666667,0.167364016736402,0.167364016736402,2,54470,54470,15.481171548117201,15.481171548117201]
[null,"202:34253","NEWCASTLE CBD 33","URBAN",570,781.363816024583,2811.22286864221,2.1781335999999998,38.447426046710042,4.7560535333829783,1,2409,2409,5.7894736842105301,5.7894736842105301,1,298,298,0.175438596491228,0.175438596491228]
[null,"202:34254","NEWCASTLE CBD 33","URBAN",1917,3661.6956057969501,5298.6554526290201,6.3701039999999995,995.33816444089723,12311.929223336389,9,21324.466666666802,21324.466666666802,6.4684402712571698,6.4684402712571698,4,263775,263775,28.794992175273897,28.794992175273897]
[null,"202:34256","NEWCASTLE CBD 33","URBAN",952,0,1723.8520732224799,2.3065180204542779,3.5874396823644892,0,1,212.26666666669999,212.26666666669999,0.10504201680672301,0.10504201680672301,0,0,0,0,0]
[null,"202:34259","NEWCASTLE CBD 33","URBAN",388,0,2797.92977437637,2.4164120000000002,317.85553546758933,142.35508607171448,1,17952,17952,96.391752577319608,96.391752577319608,1,8040,8040,34.536082474226795,34.536082474226795]
[null,"202:34260","NEWCASTLE CBD 33","URBAN",2492,5307.3860458907702,2593.8668022045099,4.137087877957673,9183.9276711385828,0,12,302961.71666666702,302961.71666666702,164.48635634028901,164.48635634028901,0,0,0,0,0]
[null,"202:34261","NEWCASTLE CBD 33","URBAN",521,0,3801.7056364656501,1.8120687999999998,0.55766055794153702,782.31809699798475,1,42,42,0.191938579654511,0.191938579654511,7,58920,58920,27.255278310940501,27.255278310940501]
[null,"202:34262","NEWCASTLE CBD 33","URBAN",882,0,5776.08492950242,4.6128008000000005,709.62112395256179,79.428894560062886,1,20995,20995,7.3696145124716601,7.3696145124716601,2,2350,2350,0.45351473922902502,0.45351473922902502]
[null,"203:8082","CARRINGTON 33","URBAN",22,1554.55649850905,512.50005771014798,2.7641604848301262,27.038990651521441,79.516911833612866,1,1335,1335,59.090909090909108,59.090909090909108,1,3926,3926,59.090909090909108,59.090909090909108]
[null,"203:8084","CARRINGTON 33","URBAN",1017,7104.7815514623699,2014.53111877335,3.9723365907823665,1015.8079705965939,23.285307821038874,4,34899.533333333398,34899.533333333398,25.368731563421797,25.368731563421797,1,800,800,0.19665683382497501,0.19665683382497501]
[null,"203:8085","CARRINGTON 33","URBAN",1403,3846.6418161029001,4655.6678937371698,4.3201448637080127,309.93866052967405,0,4,9791.1,9791.1,5.2744119743406896,5.2744119743406896,0,0,0,0,0]
[null,"203:8086","CARRINGTON 33","URBAN",2818,8806.1586164024193,1139.1824714715899,4.6679531366336571,110.07760409513021,2284.1196909774712,6,3218.3,3218.3,1.7388218594748099,1.7388218594748099,1,66780,66780,4.4712562100780699,4.4712562100780699]
[null,"203:8088","CARRINGTON 33","URBAN",641,3153.8708989444499,1046.7790259401099,2.4712693076295831,3.0052935736428075,0,2,165.96666666670001,165.96666666670001,0.31201248049921998,0.31201248049921998,0,0,0,0,0]
[null,"203:8089","CARRINGTON 33","URBAN",247,1532.96822841009,759.54238335308003,2.4895750062046167,0,103.15820586984204,0,0,0,0,0,2,5655,1155,7.2874493927125599,1.2145748987854299]
[null,"205:12203","KOTARA 33","URBAN",656,3641.9429929759099,1846.5633981681699,4.0089479879324346,74.6396592479812,5541.5746381113913,2,2540.9333333333002,2540.9333333333002,10.060975609756099,10.060975609756099,1,188650,188650,52.286585365853597,52.286585365853597]
[null,"205:12205","KOTARA 33","SHORT RURAL",1676,10202.198716400801,2867.85541964599,5.0706785052844046,4094.4136972679357,3156.2792115958478,10,110199.516666667,110199.516666667,107.338902147971,107.338902147971,2,84950,84950,16.467780429594299,16.467780429594299]
[null,"205:12206","KOTARA 33","URBAN",887,3171.2215946480701,948.30567177363298,2.324823719029312,239.48201815278742,52.60333456234877,5,14058.4333333333,14058.4333333333,11.9503945885006,11.9503945885006,1,3088,3088,0.112739571589628,0.112739571589628]
[null,"205:12210","KOTARA 33","URBAN",1502,6572.1797766665504,929.887264628612,4.8327044238089618,507.42902850787442,747.8768727627305,4,14329.766666666699,14329.766666666699,13.9147802929427,13.9147802929427,1,21120,21120,12.782956058588498,12.782956058588498]
[null,"205:12213","KOTARA 33","SHORT RURAL",883,5377.6900553922897,903.85724429737502,1.7756527617782929,122.13302898504521,50.104590326184386,5,9387.0499999999993,9387.0499999999993,7.9275198187995501,7.9275198187995501,2,3851,3851,3.3975084937712299,3.3975084937712299]
[null,"206:34432","CROUDACE BAY 33 11","URBAN",1158,4824.7639933546598,4347.3078171684101,5.5466266682352874,2921.0781870025085,41.86124261444715,5,71873.416666666701,71873.416666666701,100.259067357513,100.259067357513,2,1030,1030,0.17271157167530199,0.17271157167530199]
[null,"206:34434","CROUDACE BAY 33 11","URBAN",1519,4817.9748576280499,3774.54244080544,5.5100152710852184,2.5166284971622783,2423.2306267341287,1,62.333333333299997,62.333333333299997,6.5832784726793894E-2,6.5832784726793894E-2,4,60020,60020,23.304805793285098,23.304805793285098,null,null," "]
[null,"206:34437","CROUDACE BAY 33 11","SHORT RURAL",29,2587.5651097631999,158.48841451434001,0.16475128717530552,2.856205902887107,0,1,2366,2366,48.275862068965502,48.275862068965502,0,0,0,0,0]
[null,"206:34438","CROUDACE BAY 33 11","URBAN",610,3759.6838084936899,2026.6389205866999,2.2699066233042098,154.63273953070041,158.32346082033507,2,9297.1,9297.1,8.5245901639344304,8.5245901639344304,1,9519,9519,9.34426229508197,9.34426229508197]
[null,"206:34440","CROUDACE BAY 33 11","URBAN",1626,8310.6087558359995,2738.4101832838101,5.8944349411609318,12435.307352695318,2643.3875786398366,8,287917.71666666702,287917.71666666702,105.658056580566,105.658056580566,2,61203,61203,12.6076260762608,12.6076260762608]
[null,"206:34441","CROUDACE BAY 33 11","URBAN",1341,8025.4490332238602,1373.5840438794701,5.2171240938846752,39.188395097457516,4.969589025169876,6,1025.1333333334001,1025.1333333334001,0.44742729306487705,0.44742729306487705,1,130,130,7.4571215510812805E-2,7.4571215510812805E-2]
[null,"210:83465","NEW LAMBTON 33","URBAN",911,6453.5008081496799,566.38055015812097,4.2652277679829105,3337.5588874795085,1162.9146822399748,9,106792.5,106792.5,84.193194291986799,84.193194291986799,2,37210,37210,27.0032930845225,27.0032930845225]
[null,"210:83466","NEW LAMBTON 33","URBAN",891,3092.0453654701801,158.626614077087,1.9953211446787003,0.53218195455503359,866.2577144886194,1,36.4,36.4,0.112233445566779,0.112233445566779,1,59250,59250,16.835016835016798,16.835016835016798]
[null,"210:83472","NEW LAMBTON 33","URBAN",364,1491.8480577820901,1893.86055335674,0.75053364157639191,0,620.5534534306862,0,0,0,0,0,1,112840,112840,100,100]
[null,"210:83473","NEW LAMBTON 33","URBAN",556,2317.60840478205,319.67469658451199,1.8305698575033951,117.65854113478106,0,1,8771.85,8771.85,18.1654676258993,18.1654676258993,0,0,0,0,0]
[null,"210:83474","NEW LAMBTON 33","URBAN",874,2832.0361118035098,1233.6244189348599,2.4895750062046167,2.163190789166928,0,2,118.58333333340001,118.58333333340001,0.22883295194507999,0.22883295194507999,0,0,0,0,0]
[null,"213:33769","MARYLAND 132","URBAN",1040,0,8302.5048377141102,4.8143987252339286,7.3205041954481409,1558.84230933711,1,207.51666666669999,207.51666666669999,9.6153846153846201E-2,9.6153846153846201E-2,2,44189,44189,9.7115384615384599,9.7115384615384599]
[null,"213:33771","MARYLAND 132","URBAN",1558,8762.1670013875591,1667.1865246604,4.5032018494583514,1474.9731776390868,2233.4314925042281,9,44700.95,1184.95,32.991014120667508,0.51347881899871606,3,67687,67687,17.9075738125802,17.9075738125802]
[null,"213:33773","MARYLAND 132","URBAN",919,935.22059967044095,11624.7291076817,3.6977511121568574,0,503.82511742112911,0,0,0,0,0,5,18595,18595,4.7878128400435198,4.7878128400435198]
[null,"213:33774","MARYLAND 132","URBAN",1347,2891.1344834624301,5577.0125094587802,4.2652277679829105,139.16847836642322,2714.2384929636478,1,4453,4453,4.5285820341499594,4.5285820341499594,5,86848,86848,23.682256867112102,23.682256867112102]
[null,"213:33775","MARYLAND 132","URBAN",1120,5935.0825480377498,2478.1778289793401,3.4231656335313483,752.90961334902238,7317.068092381176,7,30017.116666666701,30009.45,23.928571428571413,23.839285714285698,4,291718,291718,48.392857142857096,48.392857142857096]
[null,"213:33777","MARYLAND 132","SHORT RURAL",534,15075.8798642852,21743.7596413848,2.599409197654821,1.2799407911951697,445.02703253385619,1,67.2,67.2,0.18726591760299599,0.18726591760299599,3,23365,23365,25.655430711610499,25.655430711610499]
[null,"214:8665","CARDIFF 33","URBAN",1382,5517.8224733950401,1069.06413017147,4.3201448637080127,134.16398820591331,16030.417134082096,6,4238.3,4238.3,6.9464544138929094,6.9464544138929094,4,506408,506408,78.437047756874108,78.437047756874108]
[null,"214:8666","CARDIFF 33","URBAN",1479,5942.2568048489202,1132.4582572736099,4.5215075480333846,307.91021423394079,400.05191652617492,5,9293.8333333332994,9293.8333333332994,10.480054090601799,10.480054090601799,1,12075,12075,2.3664638269100697,2.3664638269100697]
[null,"214:8667","CARDIFF 33","URBAN",879,5827.72154536168,4234.6310326655203,3.4048599349563151,3099.8528613941876,1449.5852574919525,2,124249.85,124249.85,98.407281001137704,98.407281001137704,2,58103,58103,12.969283276450499,12.969283276450499]
[null,"214:8669","CARDIFF 33","URBAN",700,3407.3942494102498,1597.6339228929,2.8007718819801948,85.587107222806466,0,6,4170.4666666665998,4170.4666666665998,13.571428571428601,13.571428571428601,0,0,0,0,0]
[null,"214:8670","CARDIFF 33","URBAN",979,4527.64603856952,3863.9793657238301,4.0272536865074686,14.861731469080587,1749.0002465533084,2,503.63333333330002,503.63333333330002,0.20429009193054098,0.20429009193054098,3,59270,59270,24.923391215525999,24.923391215525999]
[null,"214:8671","CARDIFF 33","URBAN",74,1275.22910402806,442.16358112318801,1.0983419145020368,0.78534261112981585,261.39635876521061,1,97.583333333300004,97.583333333300004,1.35135135135135,1.35135135135135,2,32480,32480,75.675675675675706,75.675675675675706]
[null,"216:10722","EDGEWORTH 33","URBAN",518,1382.6714886982099,4594.2104662399297,2.0319325418287684,0,470.77902705321816,0,0,0,0,0,1,31620,31620,11.969111969111999,11.969111969111999]
[null,"216:10723","EDGEWORTH 33","URBAN",716,2618.91395203506,2233.7461862661999,1.5742900774529196,0,1.4419185430654835,0,0,0,0,0,1,125,125,0.13966480446927401,0.13966480446927401]
[null,"216:10724","EDGEWORTH 33","URBAN",885,7090.6547032748103,3507.6977064959501,3.4414713321063823,13.261939612045945,0,2,525.91666666670005,525.91666666670005,0.451977401129943,0.451977401129943,0,0,0,0,0]
[null,"216:10726","EDGEWORTH 33","URBAN",764,3494.82487682686,762.26382349048504,2.9472174705804659,156.30638444353332,1036.5717675172145,1,7238,7238,10.0785340314136,10.0785340314136,1,48000,48000,12.565445026177999,12.565445026177999]
[null,"216:10727","EDGEWORTH 33","SHORT RURAL",1613,16991.900342705001,6736.0451264826097,5.5832380653853537,23.892947943813681,4766.8619846127431,5,584.03333333329999,584.03333333329999,0.433973961562306,0.433973961562306,4,116520,116520,15.871047737135799,15.871047737135799]
[null,"216:10728","EDGEWORTH 33","SHORT RURAL",1422,7556.5851759277202,9702.6072193158598,5.418486778210049,158.79834160264849,3403.9417992331996,5,3999.65,3999.65,4.2194092827004193,4.2194092827004193,4,85735,85735,17.0886075949367,17.0886075949367]
[null,"216:10729","EDGEWORTH 33","URBAN",1121,177.24268234402501,7744.3123122972402,5.5832380653853537,11.953974183864087,0,3,292.2,292.2,0.267618198037466,0.267618198037466,0,0,0,0,0]
[null,"217:33610","MOUNT HUTTON 33","URBAN",1919,7092.0151760168301,1603.37098208307,5.6379744000000001,12253.341891730897,3155.8542360808938,10,296609.8,294373.8,270.76602397081808,266.28452318916101,2,76392,76392,12.2980719124544,12.2980719124544]
[null,"217:33611","MOUNT HUTTON 33","URBAN",1354,6443.7292611371004,2821.5829842491198,5.0523728067093696,2708.965551103408,8433.6219413605941,9,73174.899999999994,73174.899999999994,78.138847858197906,78.138847858197906,5,227810,227810,45.3471196454948,45.3471196454948]
[null,"217:33612","MOUNT HUTTON 33","URBAN",1921,10206.8105354656,3654.22465605248,6.3335935999999995,5722.5760150515553,6746.3821657082326,9,123309.183333333,123309.183333333,58.198854763144205,58.198854763144205,4,145370,145370,20.8224882873503,20.8224882873503]
[null,"220:8687","JEWELLS 33","URBAN",1525,7232.7027908516602,406.892130597961,3.8075853036070617,25.340137872810999,174.09255027121424,5,908.26666666669996,908.26666666669996,0.39344262295082,0.39344262295082,1,6240,6240,1.70491803278689,1.70491803278689]
[null,"220:8688","JEWELLS 33","URBAN",452,3679.8688600894998,502.32904992369799,1.6475128717530556,492.12814006782452,0,2,40766.5,40766.5,100.22123893805299,100.22123893805299,0,0,0,0,0]
[null,"220:8689","JEWELLS 33","URBAN",1510,6160.9168376641401,1427.7925086923201,3.8075853036070617,863.17681073053768,11.159778863539373,14,30938.85,30938.85,13.708609271523201,13.708609271523201,1,400,400,6.6225165562913899E-2,6.6225165562913899E-2]
[null,"220:8691","JEWELLS 33","URBAN",1179,8461.5319969667107,2651.37820917414,4.2652277679829105,55.6012397006646,24.845933146486967,4,1779.0833333333001,1779.0833333333001,0.33927056827820201,0.33927056827820201,2,795,795,0.16963528413910101,0.16963528413910101]
[null,"220:8692","JEWELLS 33","URBAN",884,2876.3330627261098,3082.0350000649801,3.1668858534808733,2.2972780360076777,0,1,99,99,0.113122171945701,0.113122171945701,0,0,0,0,0]
[null,"221:11893","GATESHEAD 33","URBAN",731,2332.4639802633001,2500.1387393206501,1.5010672831527838,177.17615008164165,2215.7123926552949,5,16108.65,16108.65,15.8686730506156,15.8686730506156,2,201450,201450,65.663474692202499,65.663474692202499]
[null,"221:11894","GATESHEAD 33","URBAN",922,4382.7494625311601,298.95939325215397,1.7207356660531912,191.84296099009185,73.683513002178643,5,15215.483333333301,15215.483333333301,24.7288503253796,24.7288503253796,1,5844,5844,1.3015184381778699,1.3015184381778699]
[null,"221:11895","GATESHEAD 33","URBAN",939,5301.5261859447401,1723.88455891936,2.7641604848301262,11.594022133796521,1703.8412356319025,4,572.43333333329997,572.43333333329997,0.42598509052183203,0.42598509052183203,4,84124,84124,24.707135250266298,24.707135250266298]
[null,"221:11897","GATESHEAD 33","URBAN",848,5468.1851163583797,1224.9280605491199,3.2584143463560427,195.55099424437418,1387.3091309468475,5,8190.45,8190.45,13.089622641509399,13.089622641509399,2,58106,58106,17.452830188679201,17.452830188679201]
[null,"221:11898","GATESHEAD 33","URBAN",352,6004.10981739211,3843.5324465265098,3.0204402648806017,72.725006033923208,2384.9641205805333,1,3286,3286,8.8068181818181799,8.8068181818181799,3,107762,107762,50.568181818181799,50.568181818181799]
[null,"221:11899","GATESHEAD 33","SHORT RURAL",1322,10645.0965812301,1431.3264550581,3.4048599349563151,11.03224619835364,12127.113055917524,6,442.2,442.2,0.45385779122541597,0.45385779122541597,9,486085,486085,107.63993948562801,107.63993948562801]
[null,"221:11900","GATESHEAD 33","SHORT RURAL",1205,5717.1471763928803,1892.73753067136,2.1783781304290399,1341.7221273044024,0,5,84058.833333333299,84058.833333333299,106.058091286307,106.058091286307,0,0,0,0,0]
[null,"222:33596","PELICAN 33","URBAN",1197,6401.9770743840199,300.16572903237898,3.2034972506309409,42.739415717825743,321.93346448139943,3,1820.7833333333001,1820.7833333333001,0.83542188805346695,0.83542188805346695,2,13715,13715,9.3567251461988299,9.3567251461988299]
[null,"222:33597","PELICAN 33","SHORT RURAL",657,3472.6364109092501,4747.4794711371796,2.6177148962298546,109.99557569652444,0,2,5734.65,5734.65,16.133942161339402,16.133942161339402,0,0,0,0,0]
[null,"222:33600","PELICAN 33","URBAN",1039,4535.7818205838403,568.98392318635001,2.1783781304290399,12.620652487732512,212.29064912648752,6,790.68333333340001,790.68333333340001,0.57747834456207903,0.57747834456207903,1,13300,13300,7.3147256977863302,7.3147256977863302]
[null,"222:33601","PELICAN 33","SHORT RURAL",780,5902.7290616840901,524.14491414682902,1.5376786803028519,162.31418164610071,1411.5403373321376,7,14406.049999999899,14406.049999999899,17.051282051281998,17.051282051281998,4,125280,125280,29.230769230769198,29.230769230769198]
[null,"222:33602","PELICAN 33","URBAN",945,4672.7456649695796,660.96069044271997,3.3865542363812811,1716.6002362916593,448.89271554884664,4,69177.55,69177.55,12.380952380952399,12.380952380952399,3,18090,18090,8.8888888888888999,8.8888888888888999]
[null,"223:14393","SWANSEA 33","URBAN",1066,3310.34004585805,1124.8460471992601,2.050238240403802,2.164281729085666,3134.6230705305356,2,144.06666666660001,144.06666666660001,0.18761726078799199,0.18761726078799199,2,208658,208658,60.6003752345216,60.6003752345216]
[null,"223:14394","SWANSEA 33","URBAN",1515,5306.09530761305,477.48695785602399,3.9906422893574005,392.93547398426421,0,7,13437.9333333334,13437.9333333334,12.871287128712899,12.871287128712899,0,0,0,0,0]
[null,"223:14395","SWANSEA 33","SHORT RURAL",933,12691.2000669679,8619.7358093008897,2.599409197654821,0.97392320123616583,4081.7159457310245,1,51.133333333300001,51.133333333300001,0.107181136120043,0.107181136120043,12,214300,214300,80.493033226152193,80.493033226152193]
[null,"223:14397","SWANSEA 33","URBAN",1210,4344.61507713842,4116.7749005053502,2.8190775805552279,242.51588630444232,1685.1633605507982,3,11740.516666666699,11740.516666666699,5.6198347107437998,5.6198347107437998,4,81581,81581,25.537190082644599,25.537190082644599]
[null,"223:14398","SWANSEA 33","URBAN",847,2689.8380146323502,1575.05469661186,3.0387459634556353,1473.8025141536625,0,2,66191,66191,93.624557260920909,93.624557260920909,0,0,0,0,0]
[null,"223:14399","SWANSEA 33","SHORT RURAL",388,5271.9044304026202,5245.5570965075503,0.25627978005047525,0.15773918201348913,33.658536885830706,1,84,84,0.25773195876288696,0.25773195876288696,3,17924,17924,24.4845360824742,24.4845360824742]
[null,"224:80326","ARGENTON 132 11","SHORT RURAL",1023,5919.7920829012,5370.8699607924,3.5513055235565858,431.25814118846245,0,7,16573.083333333401,7549.0833333334003,110.5571847507327,9.67741935483871,0,0,0,0,0]
[null,"224:80328","ARGENTON 132 11","SHORT RURAL",56,1672.5370755180099,2866.9687856260198,2.9106060734303978,9.3838717463126731,95.971415587288689,1,440,0,98.214285714285694,0,1,4500,4500,21.428571428571399,21.428571428571399]
[null,"224:80329","ARGENTON 132 11","SHORT RURAL",421,9775.5275402325697,3425.0603623495399,2.1417667332789718,54.365996148772865,1040.1611386997663,3,3464.25,200.25,97.387173396674612,0.47505938242280293,7,66280,66280,55.581947743467893,55.581947743467893]
[null,"224:80331","ARGENTON 132 11","URBAN",323,2865.4221421003199,5118.8242250323101,3.5696112221316199,16.086210931386272,3.7925810981559573,1,615.01666666669996,615.01666666669996,0.30959752321981399,0.30959752321981399,1,145,145,0.30959752321981399,0.30959752321981399]
[null,"224:80332","ARGENTON 132 11","URBAN",1857,16604.037869127598,1517.2505427430201,5.8944349411609318,540.97816736917162,5599.3447356764273,12,12525.4,12525.4,11.6316639741519,11.6316639741519,7,129643,129643,19.116855142703301,19.116855142703301]
[null,"224:80337","ARGENTON 132 11","SHORT RURAL",1886,14186.398470329201,4362.3769913920796,5.7662950511356943,1685.2833080537866,5019.5283649244275,9,39886.883333333302,24974.883333333299,115.32343584305411,16.4899257688229,5,118801,118801,15.747613997879101,15.747613997879101]
[null,"224:80340","ARGENTON 132 11","SHORT RURAL",1088,24094.802220678201,1145.8511868277999,3.6245283178567216,3266.0083140390147,2785.3898628722454,8,122975.85,114311.85,212.31617647058857,112.77573529411799,5,104879,104879,49.172794117647101,49.172794117647101]
[null,"224:80341","ARGENTON 132 11","URBAN",1383,6651.6669221132897,1628.6672186294099,4.1187821793826389,684.84357131757292,1024.4495918586524,7,22692.200000000099,11684.200000000101,111.9305856832972,12.4367317425886,1,33945,33945,6.7245119305856802,6.7245119305856802]
[null,"224:80344","ARGENTON 132 11","URBAN",71,0,3527.1546356808999,4.7594816295088265,3.3479336590618107,9.20681756241998,1,96,96,1.40845070422535,1.40845070422535,1,264,264,1.40845070422535,1.40845070422535]
[null,"224:80346","ARGENTON 132 11","URBAN",1610,9023.0179558329291,3225.17429375452,5.4734038739351503,507.6481688289652,669.56057608065066,8,12657.833333333399,12657.833333333399,7.4534161490683202,7.4534161490683202,1,16695,16695,3.29192546583851,3.29192546583851]
[null,"225:13444","TORONTO 33","SHORT RURAL",189,3412.4452925113701,213.66525152632201,1.3180102974024441,176.08151258972538,0,2,18232.616666666701,18232.616666666701,124.86772486772499,124.86772486772499,0,0,0,0,0]
[null,"225:13446","TORONTO 33","URBAN",1562,7839.0347725900601,2480.5588576169098,5.1072899024344718,11226.398887060912,4538.4520274943598,12,299988.08333333302,299988.08333333302,219.14212548015399,219.14212548015399,5,121275,103575,29.833546734955174,26.056338028169002]
[null,"225:33670","TORONTO 33","URBAN",109,550.84574581651998,284.66693839160803,2.9289117720054314,191.81942977368246,869.17508456412395,1,8938,8938,100,100,1,40500,40500,99.082568807339399,99.082568807339399]
[null,"225:33676","TORONTO 33","URBAN",487,6616.4418179432896,882.24079250541604,4.1187821793826389,1218.9546787512679,2480.9214523122855,4,40389.9,40389.9,100.61601642710501,100.61601642710501,3,82205,82205,48.254620123203303,48.254620123203303]
[null,"225:33679","TORONTO 33","URBAN",659,3152.4957810385399,1377.2853218364401,3.5329998249815517,1390.5306631202307,3019.0741568232274,2,53714.433333333298,53714.433333333298,99.393019726858896,99.393019726858896,5,116623,116623,46.737481031866501,46.737481031866501]
[null,"227:13014","AVONDALE 33","SHORT RURAL",62,6957.4399000010599,559.94093370302096,0.10983419145020371,0,0.86917508456412418,0,0,0,0,0,1,1080,1080,9.67741935483871,9.67741935483871]
[null,"227:13015","AVONDALE 33","SHORT RURAL",1924,53260.027025557698,5927.0173710441604,5.1072899024344718,18302.113482916851,17169.92485081558,20,489062.96666666702,489062.96666666702,270.84199584199598,270.84199584199598,22,458809,458809,54.106029106029098,54.106029106029098]
[null,"227:13016","AVONDALE 33","SHORT RURAL",147,4589.3685871113603,324.71079337071501,0.42103106722578088,0.17780085178930832,0,1,57.633333333300001,57.633333333300001,0.68027210884353706,0.68027210884353706,0,0,0,0,0]
[null,"227:13018","AVONDALE 33","URBAN",605,6805.6152316958296,2286.69609357627,4.3750619594331139,271.73839097222083,0,3,8476.5833333332994,8476.5833333332994,5.6198347107437998,5.6198347107437998,0,0,0,0,0]
[null,"227:13019","AVONDALE 33","SHORT RURAL",117,34695.632301436402,989.35745598849905,0.45764246437584877,68.839873885096083,380.99847196408649,3,20529,20529,100.85470085470101,100.85470085470101,11,113619,113619,250.42735042734998,250.42735042734998]
[null,"227:13020","AVONDALE 33","SHORT RURAL",838,25299.152040426401,1064.7627423098199,2.5261864033546848,2523.0863294389192,5213.2526026264877,11,136307.816666667,136307.816666667,127.08830548925999,127.08830548925999,9,281642,281642,88.782816229116904,88.782816229116904]
[null,"228:7486","STOCKTON 33","URBAN",3,2665.99978747772,80.639488304840199,1.2997045988274105,7.0663397847233318,0,1,742,0,66.6666666666667,0,0,0,0,0,0]
[null,"228:7487","STOCKTON 33","URBAN",1081,2945.7585878949899,262.755429122495,1.8305698575033951,419.67408058804017,0,6,31288.15,31288.15,16.928769657724299,16.928769657724299,0,0,0,0,0]
[null,"228:7490","STOCKTON 33","SHORT RURAL",1670,16259.6143578889,8878.7638037011202,4.905927218109098,3928.2447263572994,7283.2955433314755,13,109277.683333333,109277.683333333,99.760479041916199,99.760479041916199,7,202610,202610,24.071856287425099,24.071856287425099]
[null,"228:7491","STOCKTON 33","URBAN",771,2791.3238457083999,181.503576868479,1.739041364628225,23.357493169497999,0,7,1833.0333333333999,1833.0333333333999,14.396887159533101,14.396887159533101,0,0,0,0,0]
[null,"229:34983","WILLIAMTOWN 33","SHORT RURAL",35,5991.2683068863898,3551.2615003073402,2.0868496375538701,83.659081052587169,143.68993252160405,2,5471.1166666667004,5471.1166666667004,137.142857142857,137.142857142857,6,9397,9397,102.857142857143,102.857142857143]
[null,"229:34986","WILLIAMTOWN 33","SHORT RURAL",80,4537.0965738629702,107.366421678896,0.45764246437584877,6.8950532750029003,0,1,2056.1999999999998,2056.1999999999998,22.5,22.5,0,0,0,0,0]
[null,"229:34989","WILLIAMTOWN 33","SHORT RURAL",14,4813.2875582857396,2330.1283395264199,0.16475128717530552,0.39684280944307965,5.3176614548680075,1,328.73333333329998,328.73333333329998,7.1428571428571397,7.1428571428571397,2,4405,4405,100,100]
[null,"229:34992","WILLIAMTOWN 33","SHORT RURAL",39,2170.6242684675299,1259.53610707848,0.36611397150067893,0,1.649823077181902,0,0,0,0,0,2,615,615,7.6923076923076898,7.6923076923076898]
[null,"229:34995","WILLIAMTOWN 33","SHORT RURAL",687,37038.659602401902,1730.825729211,2.5811034990797865,158.70670935588547,2963.3216721628237,11,8391.5833333332994,8391.5833333332994,26.346433770014599,26.346433770014599,20,156685,156685,74.381368267831206,74.381368267831206]
[null,"230:81432","TANILBA BAY 33","SHORT RURAL",888,52532.073923927499,1437.39871648493,2.3797408147544132,13078.050108309149,2139.74809984788,8,750010.566666667,137166.566666667,254.39189189189148,155.40540540540499,26,122712,122712,55.292792792792802,55.292792792792802]
[null,"230:81434","TANILBA BAY 33","URBAN",1294,8393.0424091556706,1938.5938894503599,3.606222619281688,2220.0084693533636,913.21328884870627,6,84014.866666666698,84014.866666666698,61.901081916537905,61.901081916537905,2,34560,34560,11.901081916537901,11.901081916537901]
[null,"230:81438","TANILBA BAY 33","SHORT RURAL",547,13775.0919372714,2418.7458987929699,1.793958460353327,9.7491577772217166,4.0092042095095159,5,741.66666666660001,741.66666666660001,0.91407678244972601,0.91407678244972601,1,305,305,0.18281535648994501,0.18281535648994501]
[null,"230:81440","TANILBA BAY 33","SHORT RURAL",1638,9612.0922602992305,1872.27605319949,3.6977511121568574,2909.2660461860387,1776.0546623799416,11,107374.16666666701,107374.16666666701,59.462759462759394,59.462759462759394,2,65550,65550,11.599511599511599,11.599511599511599]
[null,"232:11453","NELSON BAY 33","SHORT RURAL",1349,14772.086293353599,3788.2393811219899,3.2218029492059754,7374.8540532857187,499.17476245479622,3,312398.18333333329,9166.5833333332994,103.26167531504812,4.1512231282431404,3,21145,21145,15.5670867309118,15.5670867309118]
[null,"232:11454","NELSON BAY 33","SHORT RURAL",1869,14663.628121456401,2503.36965900425,4.0821707822325717,17024.798800958073,6841.0423596786068,18,569173.75,568986.19999999995,252.9695024077046,252.91599785981802,4,228710,228710,35.634028892455802,35.634028892455802]
[null,"232:11455","NELSON BAY 33","SHORT RURAL",2136,9961.6027091299202,7803.4716488634303,4.6679531366336571,6199.7927811353848,1249.8013403461634,9,181261.15,181261.15,136.84456928839001,136.84456928839001,2,36540,36540,9.2696629213483206,9.2696629213483206]
[null,"232:11457","NELSON BAY 33","SHORT RURAL",1399,10794.895981327199,2980.3637763005399,5.8212121468607956,1824.560922887425,3451.5159901812508,7,42775.883333333302,42775.883333333302,112.008577555397,112.008577555397,7,80919,80919,15.296640457469602,15.296640457469602]
[null,"232:11460","NELSON BAY 33","URBAN",221,4011.8437083021799,669.81985700870405,2.9472174705804659,1.8856248229252641,778.31423068933191,1,87.316666666700002,87.316666666700002,0.45248868778280504,0.45248868778280504,3,36041,36041,71.040723981900499,71.040723981900499]
[null,"232:33407","NELSON BAY 33","SHORT RURAL",546,32402.448871763801,2136.4482148751699,2.452963609054549,66.979526229562566,1243.7967891369663,10,3726.5333333334002,3098.5333333334002,9.7069597069596956,9.3406593406593288,15,69201,69201,51.648351648351699,51.648351648351699]
[null,"232:33409","NELSON BAY 33","SHORT RURAL",1738,7529.0564708453203,7111.4746185844897,4.631341739483589,2392.1850541528675,1594.4540757879747,7,70492.350000000006,70492.350000000006,199.42462600690399,199.42462600690399,7,46985,46985,20.5408515535098,20.5408515535098]
[null,"232:33413","NELSON BAY 33","URBAN",1077,9442.2570181389492,634.84753522000904,0.60408805297612023,571.6753523106338,299.61551633781056,13,129152.633333333,129152.633333333,106.12813370473499,106.12813370473499,8,67689,67689,22.005571030640699,22.005571030640699]
[null,"233:82812","MEDOWIE 33","SHORT RURAL",752,22006.674063823699,3794.4829903528798,3.093663059180737,781.93056910193786,683.90263563574626,11,34494.449999999997,34494.449999999997,80.186170212765902,80.186170212765902,3,30170,30170,10.5053191489362,10.5053191489362]
[null,"233:82815","MEDOWIE 33","SHORT RURAL",1332,8952.0775063264791,5450.4704195741797,3.8991137964822311,894.23910956690008,1.228514598691792,7,31299.816666666698,31299.816666666698,9.3843843843843793,9.3843843843843793,1,43,43,7.507507507507509E-2,7.507507507507509E-2]
[null,"233:82819","MEDOWIE 33","SHORT RURAL",952,20047.568203093098,4510.1474871597002,3.4963884278314841,336.3233577280692,1312.9841989239305,8,13127.7833333333,11400.7833333333,6.4075630252100915,6.3025210084033692,3,51250,51250,14.915966386554599,14.915966386554599]
[null,"233:82821","MEDOWIE 33","SHORT RURAL",267,3879.0523883505998,1950.9432527006099,1.3912330917025801,157.14350199025628,0,2,15415.25,15415.25,15.730337078651699,15.730337078651699,0,0,0,0,0]
[null,"235:2120","TARRO 33","SHORT RURAL",708,59260.506589956203,2092.51259326849,2.7458547862550926,129.90814215296226,2894.5341097411506,8,6456.7333333332999,6121.6333333332996,10.310734463276814,10.0282485875706,24,143865,143865,70.056497175141203,70.056497175141203]
[null,"235:2121","TARRO 33","URBAN",26,5815.3278277323598,368.13196823990103,2.1600724318540063,1.1110954831011388,0,1,70.2,70.2,3.8461538461538498,3.8461538461538498,0,0,0,0,0]
[null,"235:2123","TARRO 33","URBAN",1352,8412.9797098948002,2064.1645585266601,5.6564608596854908,6.7378640340165221,1806.6649163997536,3,162.5666666667,162.5666666667,0.22189349112426002,0.22189349112426002,3,43590,43590,12.2041420118343,12.2041420118343]
[null,"235:2124","TARRO 33","SHORT RURAL",934,6412.2701719947599,1163.8194717050601,2.3614351161793796,131.9456401202909,327.45970113017131,9,7625.5833333332002,7625.5833333332002,16.381156316916503,16.381156316916503,3,18925,18925,8.4582441113490301,8.4582441113490301]
[null,"235:2728","TARRO 33","URBAN",321,2420.5460737868798,939.70252923542296,4.6862588352086911,1813.378220872351,701.69255715823704,1,52810,52810,98.130841121495308,98.130841121495308,1,20435,20435,19.003115264797501,19.003115264797501]
[null,"235:2857","TARRO 33","SHORT RURAL",315,7830.0274807230799,740.60197145890595,1.0617305173519691,32.283876577317947,0,4,4149.7833333333001,4149.7833333333001,15.8730158730159,15.8730158730159,0,0,0,0,0]
[null,"235:8684","TARRO 33","SHORT RURAL",121,8916.9355664475297,1964.6093781018899,2.0319325418287684,0,9.7520639696349747,0,0,0,0,0,2,655,655,1.65289256198347,1.65289256198347]
[null,"235:8685","TARRO 33","URBAN",108,2111.3645096884802,287.05791650120199,4.631341739483589,1644.0331080427709,0,2,48445.983333333301,48445.983333333301,101.85185185185199,101.85185185185199,0,0,0,0,0]
[null,"238:34136","THORNTON 33","URBAN",845,2362.8417529621402,3178.46743155578,2.7824661834051603,0,75.537753182582108,0,0,0,0,0,1,3705,3705,4.6153846153846194,4.6153846153846194]
[null,"238:34137","THORNTON 33","SHORT RURAL",900,5711.6955822424798,7802.1419504647502,3.9540308922073328,161.34303944745236,5.7945005637608267,3,5568.8333333334003,5568.8333333334003,2.55555555555555,2.55555555555555,2,200,200,0.22222222222222202,0.22222222222222202]
[null,"238:34140","THORNTON 33","URBAN",909,9486.3517873869296,5688.3767467561402,3.0021345663055676,18.685529544811004,1317.1527518989435,5,849.43333333329997,849.43333333329997,8.0308030803080293,8.0308030803080293,6,59877,59877,26.402640264026399,26.402640264026399]
[null,"238:34141","THORNTON 33","SHORT RURAL",991,33393.565235315902,7880.4304581182296,4.6130360409085558,1250.7883369421907,2173.6233939770223,15,37004.199999999997,37004.199999999997,16.851664984863802,16.851664984863802,14,64306,64306,21.997981836528798,21.997981836528798]
[null,"238:34143","THORNTON 33","URBAN",912,244.52096808637,7197.6107830493702,2.8190775805552279,298.2776260699132,255.93182281688618,2,14440.016666666699,14440.016666666699,3.8377192982456196,3.8377192982456196,1,12390,12390,6.4692982456140395,6.4692982456140395]
[null,"238:34144","THORNTON 33","URBAN",435,6825.1157408157596,3583.83095518657,4.887621519534064,8.6972435493006355,966.16939045926529,1,242.85,242.85,0.22988505747126403,0.22988505747126403,5,26978,26978,34.712643678160902,34.712643678160902]
[null,"238:34147","THORNTON 33","SHORT RURAL",889,4095.3418642327101,5128.92767566575,2.8190775805552279,1.0496854018956117,8.2625285816589571,1,50.816666666700002,50.816666666700002,0.11248593925759301,0.11248593925759301,1,400,400,0.11248593925759301,0.11248593925759301]
[null,"238:34148","THORNTON 33","SHORT RURAL",666,27895.868750518599,6914.5059559228703,2.7275490876800585,1394.2324011146416,1070.7318237921172,12,69761.633333333302,69761.633333333302,157.20720720720701,157.20720720720701,8,53575,53575,21.3213213213213,21.3213213213213]
[null,"238:34150","THORNTON 33","SHORT RURAL",739,13359.218614166,10533.3399043319,4.9791500124092334,18.721101339941697,2053.6783053628324,3,513.13333333339995,513.13333333339995,0.40595399188091996,0.40595399188091996,10,56290,56290,19.0798376184032,19.0798376184032]
[null,"238:34151","THORNTON 33","URBAN",1244,57.169005391995498,8955.4619297034606,5.180512696734608,4517.4276479488472,0,3,119007,119007,100.40192926044999,100.40192926044999,0,0,0,0,0]
[null,"239:82127","RATHMINES 132","SHORT RURAL",540,9896.6179724027897,1735.4260653148001,3.9357251936322992,1427.5897178635291,2036.9118106760247,3,49503.133333333397,49503.133333333397,98.518518518518505,98.518518518518505,5,70632,70632,39.814814814814795,39.814814814814795]
[null,"239:82129","RATHMINES 132","SHORT RURAL",1442,14721.6909287542,1388.14131370007,3.3865542363812811,2155.3314500706197,4162.4935638331281,8,86858.05,86858.05,107.905686546463,107.905686546463,3,167745,167745,31.761442441054101,31.761442441054101]
[null,"239:82131","RATHMINES 132","SHORT RURAL",343,27517.0205690929,4259.9418496477301,1.2081761059522405,638.41120548408128,246.49483481540565,10,72114.783333333296,72114.783333333296,168.804664723032,168.804664723032,7,27844,27844,17.201166180758001,17.201166180758001]
[null,"239:82132","RATHMINES 132","URBAN",1238,8692.7301821920792,1779.4895348994301,4.0455593850825027,2166.7946376575424,4429.1924271420094,4,73095.933333333305,73095.933333333305,21.486268174474901,21.486268174474901,3,149417,149417,30.371567043618704,30.371567043618704]
[null,"239:82133","RATHMINES 132","URBAN",1185,9355.0587801106103,2037.6019776625801,3.8808080979071975,155.06184554698433,1314.0264042336628,3,5453.0166666666,5453.0166666666,7.6793248945147701,7.6793248945147701,2,46210,46210,10.7172995780591,10.7172995780591]
[null,"239:82136","RATHMINES 132","SHORT RURAL",1588,11853.6590949369,1748.30881540717,4.9791500124092334,239.29845856895793,842.77791532921344,6,6559.0166666667001,6559.0166666667001,4.2821158690176402,4.2821158690176402,1,23100,23100,3.7783375314861498,3.7783375314861498]
[null,"240:34835","MAYFIELD WEST 132","SHORT RURAL",933,10469.3237917477,2143.4933959005102,3.5696112221316199,530.47485713200172,0,7,20281.400000000001,20281.400000000001,58.735262593783503,58.735262593783503,0,0,0,0,0]
[null,"240:34840","MAYFIELD WEST 132","URBAN",1501,4437.5117519423202,1677.5020797388399,4.6679531366336571,0,20.522189496652928,0,0,0,0,0,1,600,600,6.6622251832111901E-2,6.6622251832111901E-2]
[null,"240:34843","MAYFIELD WEST 132","URBAN",273,1209.8776784439799,4378.0038439943301,2.8923003748553642,0,150.04537293160675,0,0,0,0,0,3,7080,7080,2.1978021978022002,2.1978021978022002]
[null,"240:34846","MAYFIELD WEST 132","URBAN",836,2217.7231998823499,6891.1456365314498,4.0455593850825027,900.70206121189972,1125.2544525342541,2,30384.816666666698,30164,100.11961722488039,100,4,37960,37960,27.6315789473684,27.6315789473684]
[null,"240:34849","MAYFIELD WEST 132","SHORT RURAL",2338,7604.1153037589202,7137.9140869671601,5.0340671081343364,636.07084426332324,949.08419824145085,6,17244.0999999999,17244.0999999999,8.2121471343028212,8.2121471343028212,3,25730,25730,2.6946107784431099,2.6946107784431099]
[null,"242:81533","TOMAREE 33","SHORT RURAL",17,2526.84673256106,105.580515149253,0.23797408147544136,0,0.47080317080556727,0,0,0,0,0,1,270,270,17.647058823529399,17.647058823529399]
[null,"242:81535","TOMAREE 33","URBAN",1577,3647.7488492785401,3071.2000985638701,4.7228702323587592,731.98302717818842,856.29197831069587,3,21151.883333333401,21151.883333333401,9.5117311350665794,9.5117311350665794,2,24744,24744,4.8826886493341801,4.8826886493341801]
[null,"242:81538","TOMAREE 33","URBAN",1009,3344.4327081187498,2362.32870505651,2.8373832791302624,465.90574477352936,4307.8858991592515,2,22409.599999999999,22409.599999999999,10.703666997026801,10.703666997026801,4,207205,207205,78.196233894945493,78.196233894945493]
[null,"242:81539","TOMAREE 33","URBAN",2166,6678.5514406107604,5128.9284160775496,5.436792476785083,7679.3144606388951,9485.354778165367,8,192767.46666666699,192767.46666666699,146.81440443213302,146.81440443213302,5,238103,238103,34.856879039704502,34.856879039704502]
[null,"242:81541","TOMAREE 33","URBAN",1686,4616.2637323069703,3853.7200925019702,3.8075853036070617,2402.7399135368328,2359.0935534107466,9,86121.416666666599,86121.416666666599,18.208778173191,18.208778173191,2,84557,84557,16.6666666666667,16.6666666666667]
[null,"243:80074","MORISSET 132","SHORT RURAL",1740,17210.298325642001,5216.8275099441698,5.8945080000000001,4158.4528242519946,7715.0833369413704,4,96280.483333333294,96280.483333333294,193.56321839080499,193.56321839080499,10,178627,178627,31.551724137930997,31.551724137930997]
[null,"243:80075","MORISSET 132","SHORT RURAL",850,56616.339797248998,2104.02934629936,3.4231656335313483,2431.9092505321983,1770.2851103602748,12,96955.73333333341,96201.716666666704,125.64705882352906,125.41176470588201,5,70578,70578,17.529411764705898,17.529411764705898]
[null,"243:80078","MORISSET 132","SHORT RURAL",1227,3709.9096134021802,7638.6255486445598,3.5513055235565858,819.94060824620624,2544.5221319376478,2,31510,31510,13.7734311328443,13.7734311328443,4,97785,97785,33.170334148329303,33.170334148329303]
[null,"243:80080","MORISSET 132","SHORT RURAL",647,16521.230064707001,2573.7723552186899,3.3133314420811448,2211.3802255185274,332.5584592304084,6,91086.199999999895,91086.199999999895,100.309119010819,100.309119010819,4,13698,13698,20.4018547140649,20.4018547140649]
[null,"243:80081","MORISSET 132","SHORT RURAL",1885,16272.123237928199,6134.1390495114601,4.0455593850825027,1164.4288800238648,20119.110892505891,11,39281.533333333202,39281.533333333202,29.867374005304999,29.867374005304999,11,678710,678710,96.445623342174997,96.445623342174997]
[null,"243:80083","MORISSET 132","SHORT RURAL",298,41505.685380887997,1986.1916438921301,0.80545073730149386,88.1334414774918,8302.696274178079,12,14933.300000000099,14933.300000000099,14.093959731543601,14.093959731543601,41,1406806,1384126,253.02013422818749,234.89932885906001]
[null,"243:80084","MORISSET 132","SHORT RURAL",836,8147.5311207227096,3897.0025036472598,2.452963609054549,8.9484972965454439,3601.2968548926783,4,497.8666666666,497.8666666666,0.47846889952153099,0.47846889952153099,5,200365,200365,51.913875598086101,51.913875598086101]
[null,"256:80632","ADAMSTOWN 132","URBAN",831,7533.2821950031503,1652.15662822843,2.9289117720054314,361.50565581989997,304.4044296162354,5,16844.6833333334,16844.6833333334,5.8965102286401905,5.8965102286401905,1,14184,14184,4.3321299638989199,4.3321299638989199]
[null,"256:80638","ADAMSTOWN 132","URBAN",1027,2876.34886924785,947.26171351097503,2.7641604848301262,7.8362438075458014,0,3,386.9,275.45,0.29211295034079876,0.194741966893866,0,0,0,0,0]
[null,"256:80640","ADAMSTOWN 132","URBAN",929,3386.7905561846801,1577.91395583658,2.9289117720054314,52.316828701140572,0,1,2437.75,2437.75,3.76749192680301,3.76749192680301,0,0,0,0,0]
[null,"256:80641","ADAMSTOWN 132","URBAN",1097,3564.9408333522701,971.19586896869998,2.1783781304290399,4.5131715068055902,1944.454652375091,2,282.75,282.75,0.27347310847766598,0.27347310847766598,2,121820,121820,23.609845031905198,23.609845031905198]
[null,"256:80644","ADAMSTOWN 132","URBAN",1078,3131.4741777613799,587.43050263017506,2.1600724318540063,13.260075177836988,0,2,837.78333333340004,837.78333333340004,0.18552875695732801,0.18552875695732801,0,0,0,0,0]
[null,"256:80646","ADAMSTOWN 132","URBAN",1685,5179.0368777609001,426.94172831998799,3.5146941264065186,10.628401700729306,0,3,412.7,412.7,0.178041543026706,0.178041543026706,0,0,0,0,0]
[null,"256:80647","ADAMSTOWN 132","URBAN",1780,3605.8606409090298,3807.35897983834,5.3269582853348778,807.35981530517665,0,5,20684.349999999999,20684.349999999999,33.651685393258404,33.651685393258404,0,0,0,0,0]
[null,"256:80650","ADAMSTOWN 132","URBAN",1203,8031.9592110084895,1893.28721338282,3.8991137964822311,428.28256902106858,143.99333900945658,5,14990.583333333399,14990.583333333399,9.4763092269326599,9.4763092269326599,1,5040,5040,1.99501246882793,1.99501246882793]
[null,"256:80653","ADAMSTOWN 132","URBAN",793,1282.74819462289,1387.8545694899001,1.0617305173519691,63.483139791009926,0,2,8160.15,8160.15,8.9533417402269908,8.9533417402269908,0,0,0,0,0]
[null,"257:81987","BROADMEADOW 132","URBAN",2098,8905.9548731001105,2158.78147247578,5.6564608596854908,27.25263603341725,0,5,657.53333333329999,657.53333333329999,0.23832221163012399,0.23832221163012399,0,0,0,0,0]
[null,"257:81988","BROADMEADOW 132","URBAN",982,4846.3310447452004,1931.3010983148399,3.5879169207066539,2.5886752426000261,31.153488447664113,1,98.466666666699993,98.466666666699993,0.10183299389002001,0.10183299389002001,1,1185,1185,0.30549898167006101,0.30549898167006101]
[null,"257:81991","BROADMEADOW 132","URBAN",462,0,4288.4816707820401,2.7824661834051603,355.36384290753205,0,1,17430,17430,89.826839826839802,89.826839826839802,0,0,0,0,0]
[null,"257:81994","BROADMEADOW 132","URBAN",758,2190.9654954000998,4861.3216447835002,4.2835334665579436,2086.7440326493211,0,2,66484.600000000006,66484.600000000006,109.366754617414,109.366754617414,0,0,0,0,0]
[null,"257:81997","BROADMEADOW 132","URBAN",342,2070.3667484121702,1753.9627217694499,2.9289117720054314,0,4.184917073827263,0,0,0,0,0,1,195,195,0.29239766081871299,0.29239766081871299]
[null,"257:81999","BROADMEADOW 132","URBAN",938,4269.8851519740801,987.84784999143005,4.5581189451834536,234.51286058541692,64.12580623895316,5,7021.5833333334003,7021.5833333334003,11.513859275053299,11.513859275053299,2,1920,1920,1.59914712153518,1.59914712153518]
[null,"257:82000","BROADMEADOW 132","SHORT RURAL",502,555.77887187704403,3959.6871722465899,1.2447875031023083,5.0572755568486478,0,2,554.46666666659996,554.46666666659996,0.39840637450199201,0.39840637450199201,0,0,0,0,0]
[null,"257:82006","BROADMEADOW 132","URBAN",224,1571.7217828919199,1041.7365450903101,1.7207356660531912,859.57794300539513,8.5106727030237135,1,68175,68175,60.267857142857096,60.267857142857096,1,675,675,1.33928571428571,1.33928571428571]
[null,"258:80773","JESMOND 132","URBAN",385,1137.0887050382401,1503.8033300288,3.1119687577557711,53.927753510649076,0,1,2365,2365,11.168831168831201,11.168831168831201,0,0,0,0,0]
[null,"258:80775","JESMOND 132","URBAN",2012,7628.5601103679901,1644.2247265778999,3.9723365907823665,2681.9265626874198,673.52752872354938,7,92141.416666666701,92141.416666666701,107.306163021869,107.306163021869,1,23140,23140,4.4234592445327996,4.4234592445327996]
[null,"258:80776","JESMOND 132","URBAN",332,1021.01044047358,579.42511416422303,1.2081761059522405,1.9782854146946394,0,1,223.46666666670001,223.46666666670001,0.30120481927710802,0.30120481927710802,0,0,0,0,0]
[null,"258:80778","JESMOND 132","URBAN",1194,4106.38899739104,1805.2319707788499,2.0868496375538701,177.42630618236984,7.0338798510096705,5,11603.2833333334,11603.2833333334,12.897822445561099,12.897822445561099,2,460,460,0.16750418760468999,0.16750418760468999]
[null,"258:80779","JESMOND 132","URBAN",1087,4910.4635843801298,2147.6771753662802,4.8143987252339286,619.04325948572102,837.610079270867,7,17548.216666666602,17548.216666666602,29.714811407543699,29.714811407543699,1,23744,23744,5.1517939282428697,5.1517939282428697]
[null,"258:80781","JESMOND 132","URBAN",1523,9332.7875710054304,2608.9826116720801,4.8510101223839968,1.8714426039521297,0,1,52.65,52.65,6.5659881812212703E-2,6.5659881812212703E-2,0,0,0,0,0]
[null,"258:80784","JESMOND 132","URBAN",1774,7225.2020989066996,2347.05854320862,5.0889842038594386,10.956036891168045,1583.3521077981161,3,293.81666666659999,293.81666666659999,0.16910935738444199,0.16910935738444199,2,42462,42462,10.8229988726043,10.8229988726043]
[null,"258:80785","JESMOND 132","URBAN",1408,7099.2753676697703,3550.9374775957799,3.9906422893574005,31.971367000613203,393.69768330378974,8,1093.3833333332,1093.3833333332,0.56818181818181801,0.56818181818181801,1,13464,13464,6.25,6.25]
[null,"258:80787","JESMOND 132","URBAN",1666,7384.2841439116501,1959.0057505658599,4.2103106722578083,130.81216919115042,19.250618539605416,4,4240.2166666666999,4240.2166666666999,0.90036014405762299,0.90036014405762299,1,624,624,0.120048019207683,0.120048019207683]
[null,"258:80790","JESMOND 132","URBAN",791,1211.98111136443,3673.2646542267598,2.7458547862550926,1.2068522875557655,2076.1212644908064,1,59.983333333300003,59.983333333300003,0.126422250316056,0.126422250316056,2,103188,103188,35.903919089759803,35.903919089759803]
[null,"258:80791","JESMOND 132","URBAN",809,4711.3109987207199,1145.6371363436799,2.2882123218792438,2.5817607401897518,0,1,153.98333333330001,153.98333333330001,0.123609394313968,0.123609394313968,0,0,0,0,0]
[null,"258:80793","JESMOND 132","URBAN",1452,11345.02828988,4839.9281936386697,5.3635696824849468,2145.8633904011845,821.18736479111726,8,54601.2,46488.2,38.980716253443568,29.8209366391185,4,20895,20895,17.286501377410499,17.286501377410499]
[null,"261:81864","CHARLESTOWN 132","URBAN",1180,5155.5534476550802,2767.9519677009398,4.0638650836575367,5.2279003489107287,0,2,175.56666666660001,175.56666666660001,0.169491525423729,0.169491525423729,0,0,0,0,0]
[null,"261:81865","CHARLESTOWN 132","URBAN",1125,7166.5423633575801,1587.49938631176,3.3499428392312129,34.930396226586844,2480.3882777812451,3,1423.05,1423.05,0.266666666666667,0.266666666666667,6,101050,101050,25.511111111111102,25.511111111111102]
[null,"261:81867","CHARLESTOWN 132","URBAN",151,0,836.47953283505501,1.5376786803028519,0,1012.4038714158622,0,0,0,0,0,4,89855,89855,78.145695364238392,78.145695364238392]
[null,"261:81870","CHARLESTOWN 132","URBAN",1771,8786.9218847317097,2086.7960974743,5.4550981753601171,24.118696499343482,1735.5548591340637,6,603.4,603.4,0.33879164313946897,0.33879164313946897,3,43420,43420,11.0671936758893,11.0671936758893]
[null,"261:81876","CHARLESTOWN 132","URBAN",998,4747.2065467889597,306.76879714733701,2.6177148962298546,84.256766348584094,0,2,4392.75,4392.75,7.8156312625250495,7.8156312625250495,0,0,0,0,0]
[null,"261:81879","CHARLESTOWN 132","URBAN",2198,8660.7445276598701,744.16815715793405,4.7960930266588946,493.23655291177579,0,8,14035.3,14035.3,10.2820746132848,10.2820746132848,0,0,0,0,0]
[null,"261:81882","CHARLESTOWN 132","URBAN",1192,7014.7453112500498,2522.8421739230998,5.0157614095593024,458.51010209102913,1859.8428722680085,5,12475.733333333401,12475.733333333401,11.661073825503401,11.661073825503401,2,50605,50605,15.520134228187901,15.520134228187901]
[null,"261:81885","CHARLESTOWN 132","URBAN",1063,1345.35437469161,2625.7527404122902,4.7411759309337924,17.110695173998582,968.72983539587744,4,492.53333333329999,492.53333333329999,0.376293508936971,0.376293508936971,2,27885,27885,6.9614299153339596,6.9614299153339596]
[null,"261:81886","CHARLESTOWN 132","URBAN",823,2885.6982665010501,2873.3263895300202,2.9655231691555,137.26266444836384,0,5,6316.9166666666997,6316.9166666666997,14.094775212636701,14.094775212636701,0,0,0,0,0]
[null,"264:81232","RAYMOND TERRACE 33","URBAN",825,7759.4313959771698,4209.2010045954703,3.8076504,2433.3490788738345,167.39954485095527,7,87217.05,87217.05,116.848484848485,116.848484848485,1,6000,6000,1.8181818181818199,1.8181818181818199]
[null,"264:81236","RAYMOND TERRACE 33","SHORT RURAL",1799,6652.4982370062398,8373.4511284529508,4.905927218109098,279.74658524267892,3897.7727445014161,8,7782.1166666667004,7782.1166666667004,8.11561978877155,8.11561978877155,5,108430,108430,25.013896609227398,25.013896609227398]
[null,"264:81238","RAYMOND TERRACE 33","SHORT RURAL",579,5534.2586994813,199.456680067669,1.6109014746029877,3.9292257943204243,0.82625285816589567,1,332.88333333330002,332.88333333330002,0.17271157167530199,0.17271157167530199,1,70,70,0.17271157167530199,0.17271157167530199]
[null,"264:81240","RAYMOND TERRACE 33","SHORT RURAL",374,40884.464375238204,8174.1469356343396,2.1963887999999998,230.79614752870359,519.71298617542095,12,14340.799999999901,8933.8166666666002,9.0909090909090988,7.2192513368983997,15,32293,32293,28.074866310160402,28.074866310160402]
[null,"264:81241","RAYMOND TERRACE 33","SHORT RURAL",1311,7429.05493949847,7250.8028436146997,4.4302487999999993,11.753375628459926,20.775622543399905,3,362.06666666669997,362.06666666669997,0.22883295194507999,0.22883295194507999,1,640,640,0.30511060259344003,0.30511060259344003]
[null,"264:81244","RAYMOND TERRACE 33","SHORT RURAL",1275,31967.248244605798,8638.3887835424794,4.4299790551582161,2861.936091648317,7236.3254827199808,9,88168.266666666706,87880,26.745098039215719,26.6666666666667,17,222931,222931,50.117647058823501,50.117647058823501]
[null,"265:81641","TOMAGO 33","URBAN",36,1631.18340276457,6949.3242792487799,3.2950257435061112,2.7765315201353968,19.556439402692792,1,115,115,2.7777777777777799,2.7777777777777799,1,810,810,16.6666666666667,16.6666666666667]
[null,"265:81645","TOMAGO 33","URBAN",43,1441.39263552338,4547.3809678383795,1.48276158457775,19.81719192806203,0,1,1824,1824,88.3720930232558,88.3720930232558,0,0,0,0,0]
[null,"265:81648","TOMAGO 33","SHORT RURAL",183,9132.1815968821993,7612.2251050330597,3.6977511121568574,691.77758098409629,1629.0661567596335,5,25531.883333333401,25531.883333333401,190.16393442622902,190.16393442622902,6,60125,59585,86.88524590163928,85.792349726775896]
[null,"265:81649","TOMAGO 33","URBAN",48,9241.1927925692598,1401.9224616747899,3.0387459634556353,3.9347565020355817,0,1,176.71666666670001,176.71666666670001,2.0833333333333299,2.0833333333333299,0,0,0,0,0]
[null,"265:81651","TOMAGO 33","SHORT RURAL",156,10588.235594621499,2721.66488493923,2.1417667332789718,839.16794147798998,1254.5178223675409,5,53472.533333333296,53392,216.02564102564065,215.38461538461502,11,79939,79939,166.02564102564099,166.02564102564099]
[null,"270:83586","TORONTO WEST 132","URBAN",259,4656.4733059673499,1261.77834234171,1.1692936,184.52822419888966,1463.1581787653654,4,21537.4,21537.4,100.77220077220099,100.77220077220099,6,170774,170774,183.01158301158301,183.01158301158301]
[null,"270:83590","TORONTO WEST 132","URBAN",1163,10596.516977535,468.87630498641602,2.0445823999999999,1742.9357391272308,1038.8808150140146,9,116340.46666666699,116340.46666666699,124.50558899398101,124.50558899398101,2,69345,69345,12.295786758383501,12.295786758383501]
[null,"502:48002","TELARAH 33","URBAN",202,1634.89664234409,174.87162106544,1.739041364628225,80.863708463488962,531.3637496143175,2,6345.9666666666999,6345.9666666666999,10.3960396039604,10.3960396039604,1,41700,41700,68.81188118811879,68.81188118811879]
[null,"502:48004","TELARAH 33","URBAN",1198,4416.2089207383897,3755.6478628783202,4.100476480807604,183.19177611946159,1711.6954665349481,2,6097.1333333332996,6097.1333333332996,1.6694490818030001,1.6694490818030001,6,56970,56970,19.282136894824699,19.282136894824699]
[null,"502:48008","TELARAH 33","URBAN",1091,5029.4548440325398,328.41071078986602,3.0021345663055676,36.322504867236759,929.18035706884734,3,1651.2,1651.2,4.1246562786434504,4.1246562786434504,1,42240,42240,11.732355637030201,11.732355637030201]
[null,"502:48009","TELARAH 33","URBAN",115,1438.9210894058699,54.777039021940098,0.54917095725101839,4.0239587248339072E-2,0,1,10,10,0.86956521739130399,0.86956521739130399,0,0,0,0,0]
[null,"502:48010","TELARAH 33","SHORT RURAL",1288,20309.72340477,7644.4284381172001,4.3567562608580799,9704.534489339414,4728.4310326792602,13,303994.33333333302,303994.33333333302,442.93478260869597,442.93478260869597,15,148118,148118,25.310559006211196,25.310559006211196]
[null,"504:48026","CESSNOCK 33","SHORT RURAL",1286,31690.652945346199,1502.36146779092,4.6679531366336571,7960.4210612158586,2799.0556290976542,12,232736.01666666701,232736.01666666701,300.77760497667197,300.77760497667197,7,81835,81835,22.706065318817998,22.706065318817998]
[null,"504:48027","CESSNOCK 33","URBAN",139,214.32671225380901,1690.92736295029,2.434657910479515,478.61729625332208,12.041696484065467,5,26829,26829,310.07194244604301,310.07194244604301,1,675,675,10.791366906474801,10.791366906474801]
[null,"504:48028","CESSNOCK 33","URBAN",1282,10050.767295350101,727.16277363732604,3.5879169207066539,3521.0167769315844,4624.7813673171586,9,133930.58333333372,133701.51666666701,201.01404056162281,200.936037441498,3,175915,175915,27.847113884555402,27.847113884555402]
[null,"504:48029","CESSNOCK 33","URBAN",259,1771.10583633487,304.91428517410401,1.3180102974024441,250.35525985766236,0,3,25923.4,25923.4,197.683397683398,197.683397683398,0,0,0,0,0]
[null,"504:48031","CESSNOCK 33","SHORT RURAL",568,111457.12610181799,1182.7962095349601,2.3065180204542779,3261.8840380231654,1605.5426305820852,21,193003.73333333299,193003.73333333299,517.42957746478896,517.42957746478896,23,94999,94999,53.521126760563398,53.521126760563398]
[null,"504:48032","CESSNOCK 33","URBAN",344,1281.9131559489199,675.96824343158505,1.9770154461036664,984.05105824068244,0,5,67930,67930,295.63953488372101,295.63953488372101,0,0,0,0,0]
[null,"504:48033","CESSNOCK 33","SHORT RURAL",1176,33939.253370008999,1119.39868836807,3.7160568107318919,7658.4150250117764,3442.3994434262249,22,281261.7,281261.7,243.19727891156501,243.19727891156501,13,126425,126425,32.312925170067999,32.312925170067999]
[null,"504:48034","CESSNOCK 33","URBAN",1421,5591.3282696973001,256.57802384088899,4.2469220694078764,9421.8818637005716,2486.3772696833721,8,302773.183333333,302773.183333333,312.315270935961,312.315270935961,1,79900,79900,16.5376495425757,16.5376495425757]
[null,"507:80914","KURRI KURRI 132 11kV","SHORT RURAL",639,35193.434680743201,4495.4958793447904,3.7892796050320272,744.57644193642022,5132.890525328703,27,26816.7833333335,26108.7833333335,28.169014084507022,27.543035993740201,12,184867,184867,96.713615023474205,96.713615023474205]
[null,"507:80917","KURRI KURRI 132 11kV","URBAN",1368,6699.8721719607101,1406.9514496054101,3.7709739064569936,1413.824555386554,1676.7983551536136,12,51167.716666666798,51167.716666666798,47.002923976608201,47.002923976608201,3,60685,60685,16.739766081871398,16.739766081871398]
[null,"507:80922","KURRI KURRI 132 11kV","SHORT RURAL",1240,24008.621759214599,2274.1898977440601,4.100476480807604,689.92013504990791,5757.8707357525791,15,22962.4666666667,22962.4666666667,19.435483870967701,19.435483870967701,15,191638,191638,36.774193548387103,36.774193548387103]
[null,"507:80923","KURRI KURRI 132 11kV","SHORT RURAL",880,12633.6741858941,8963.0394792803709,3.606222619281688,1893.8579721364467,1344.4528974717066,11,71671.899999999994,70335.75,193.1818181818181,192.84090909090901,6,50880,50880,16.931818181818201,16.931818181818201]
[null,"507:80925","KURRI KURRI 132 11kV","SHORT RURAL",1526,22317.208787007999,919.93168468226804,4.9242329166841321,5730.2492010675396,4055.3437250402067,13,158814.066666667,158814.066666667,108.84665792922701,108.84665792922701,12,112394,112394,28.833551769331599,28.833551769331599]
[null,"507:80926","KURRI KURRI 132 11kV","URBAN",43,2638.4081972703798,1230.3685607274101,3.9540308922073328,10.34270063126513,4.0561503946325788,2,356.98333333329998,356.98333333329998,4.65116279069768,4.65116279069768,1,140,140,2.32558139534884,2.32558139534884]
[null,"507:80931","KURRI KURRI 132 11kV","URBAN",1091,6578.1880834271196,1520.5934775373,3.8808080979071975,15.901871146669087,3315.7768635720886,3,559.21666666670001,559.21666666670001,0.27497708524289599,0.27497708524289599,5,116605,116605,41.613198900091604,41.613198900091604]
[null,"507:80932","KURRI KURRI 132 11kV","SHORT RURAL",1184,63083.298940937602,3104.0140053160899,4.8693158209590299,6764.6183430000729,6156.9283320778468,24,189596.1,189596.1,138.006756756757,138.006756756757,14,172564,172564,43.665540540540498,43.665540540540498]
[null,"508:82574","BRANDY HILL 132","SHORT RURAL",194,33168.481596018202,367.064976201288,1.3729273931275463,268.67117314487075,136.9956747869704,9,26707.1500000001,26707.1500000001,163.91752577319602,163.91752577319602,34,13618,13458,58.247422680412356,57.216494845360799]
[null,"508:82575","BRANDY HILL 132","SHORT RURAL",396,25043.790659756301,2428.8189067018802,2.3980465133294473,300.50941194213743,28.641196883792812,10,17102.299999999799,17102.299999999799,6.8181818181818201,6.8181818181818201,3,1630,1630,3.2828282828282798,3.2828282828282798]
[null,"508:82576","BRANDY HILL 132","SHORT RURAL",231,4196.0918798762495,9542.2614622678393,2.0685439389788365,13.338081853249463,114.96517142829225,1,880,880,3.4632034632034596,3.4632034632034596,1,7585,7585,17.748917748917702,17.748917748917702]
[null,"508:82578","BRANDY HILL 132","SHORT RURAL",317,44870.323470980402,842.50443813582694,1.1715647088021728,823.21267687010925,469.0540900798394,9,95895.85,95515.133333333302,159.93690851735022,159.621451104101,12,54640,54640,52.365930599369101,52.365930599369101]
[null,"508:82579","BRANDY HILL 132","SHORT RURAL",466,69928.791690849597,7346.1535769475404,1.7024299674781576,6026.3599119509281,2946.7598628431533,26,483103.13333333365,482982.66666666698,445.92274678111607,445.70815450643801,32,236227,235947,154.7210300429181,154.50643776824]
[null,"508:82580","BRANDY HILL 132","SHORT RURAL",134,21271.420050040801,374.13354974991699,1.5193729817278177,38.751209866263132,263.21639529645302,8,3480.7666666667001,3480.7666666667001,23.880597014925399,23.880597014925399,10,23643,23643,71.641791044776099,71.641791044776099]
[null,"509:33395","PAXTON 33","LONG RURAL",821,253527.914285848,2907.6257125462898,2.3980465133294473,24038.282432498971,24817.966096821539,73,1368043.4,1368043.4,586.845310596834,586.845310596834,73,1412416,1412296,385.38367844092596,385.26187576126699]
[null,"509:33397","PAXTON 33","SHORT RURAL",407,24796.844034281701,343.16418531287201,1.2813989002523765,3151.187875463921,841.44464367171872,7,335617.03333333298,335617.03333333298,301.96560196560199,301.96560196560199,8,89618,89618,56.756756756756801,56.756756756756801]
[null,"509:33399","PAXTON 33","SHORT RURAL",930,68566.541856877302,935.84301808908697,2.9838288677305336,5219.4489200597754,1932.7342019292248,15,238728.78333333301,238728.78333333301,390.64516129032302,390.64516129032302,9,88400,88125,33.548387096774206,32.795698924731198]
[null,"511:29872","RUTHERFORD 33","URBAN",74,3203.7012812040498,1422.0450518223099,2.9106060734303978,29.38858015095196,116.97849211028411,3,1378,1378,9.4594594594594508,9.4594594594594508,4,5485,5485,43.243243243243199,43.243243243243199]
[null,"511:29873","RUTHERFORD 33","URBAN",1336,3337.9231259473099,8220.6711705444795,6.3703831041118146,30.25429463101273,0,4,648.15,648.15,0.29940119760479,0.29940119760479,0,0,0,0,0]
[null,"511:29874","RUTHERFORD 33","URBAN",131,1495.4693901154801,1316.32553121448,2.1783781304290399,3.382018824993247,0,2,211.88333333329999,211.88333333329999,1.5267175572519101,1.5267175572519101,0,0,0,0,0]
[null,"511:29876","RUTHERFORD 33","SHORT RURAL",1607,24684.554070038899,15828.439483166299,5.5466266682352874,5604.04651012868,1488.8377676650896,15,137888.11666666699,137888.11666666699,97.013067828251394,97.013067828251394,9,36633,36633,7.3428749222153105,7.3428749222153105]
[null,"511:29877","RUTHERFORD 33","SHORT RURAL",1013,35521.480281322903,3115.4745040090002,5.8212121468607956,1061.2192121929997,1052.9130638987651,6,24879.733333333301,24879.733333333301,15.3010858835143,15.3010858835143,13,24685,24685,7.1076011846001999,7.1076011846001999]
[null,"511:29878","RUTHERFORD 33","SHORT RURAL",1084,148237.08561375199,3938.4499121775798,5.6381551611104559,5338.3956175681687,12471.17145265567,47,129219.41666666701,128658.316666667,135.88560885608848,135.70110701107001,38,301873,301873,77.121771217712094,77.121771217712094]
[null,"511:29880","RUTHERFORD 33","URBAN",860,4086.2546028063698,6805.4577836081899,3.9357251936322992,53.623989337577591,989.30031239722848,3,1859.4666666666999,1859.4666666666999,1.8604651162790702,1.8604651162790702,4,34305,34305,10.930232558139499,10.930232558139499]
[null,"512:48046","BRANXTON 66","SHORT RURAL",1327,34697.780477726301,899.09656676935799,5.1988183953096421,1374.0888169522746,2377.7947674524548,15,36071.499999999898,36071.499999999898,21.2509419743783,21.2509419743783,8,62420,62420,18.688771665410702,18.688771665410702]
[null,"512:48048","BRANXTON 66","SHORT RURAL",1484,34934.9805135106,5951.8620860916499,4.4665904523082833,351.81994245857084,2881.5541602144108,16,10749.75,10749.75,6.0646900269541799,6.0646900269541799,19,88045,88045,23.5175202156334,23.5175202156334]
[null,"512:48049","BRANXTON 66","SHORT RURAL",944,178579.289767451,1570.1037681087801,4.6496474380586239,3952.1690432949431,2876.6596850854394,43,116003.083333334,115915.083333334,65.677966101694935,65.572033898305108,34,84435,82510,37.076271186440714,36.334745762711904]
[null,"513:48050","SINGLETON 66","SHORT RURAL",202,22341.811733001199,282.82686438140399,2.4895750062046167,1159.6390009953502,268.15660942293158,5,63569.916666666701,63569.916666666701,201.98019801980197,201.98019801980197,9,14700,14700,36.633663366336599,36.633663366336599]
[null,"513:48051","SINGLETON 66","URBAN",822,3677.1469081468899,1264.5412436568299,4.887621519534064,3759.8522298675207,1930.3332398900736,7,104985,104985,118.856447688564,118.856447688564,1,53900,53900,18.734793187347901,18.734793187347901]
[null,"513:48052","SINGLETON 66","URBAN",746,3067.7047965032202,1471.2423701401201,3.4597770306814164,132.84906580020609,1272.7692919557703,9,5240.4000000001006,4459.8000000001002,14.745308310991954,14.611260053619299,3,50206,50206,25.871313672922202,25.871313672922202]
[null,"513:48056","SINGLETON 66","SHORT RURAL",416,48617.673814695598,1094.91935581494,3.4414713321063823,2547.5793032813749,404.98193662388405,33,101027.03333333301,100853.233333333,304.32692307692326,303.84615384615404,20,16060,16060,22.115384615384599,22.115384615384599]
[null,"513:48057","SINGLETON 66","URBAN",353,2758.3231510036799,244.48719840935499,1.7207356660531912,16.460691707981152,127.40792246526613,3,1305.5333333333001,1305.5333333333001,5.6657223796034,5.6657223796034,2,10105,10105,14.164305949008499,14.164305949008499]
[null,"513:48058","SINGLETON 66","URBAN",508,4939.0341950388902,1859.36385677097,2.9838288677305336,15.219188664739066,1769.2607446008899,2,696.1,696.1,3.1496062992125999,3.1496062992125999,5,80923,80923,42.322834645669296,42.322834645669296]
[null,"513:48059","SINGLETON 66","SHORT RURAL",926,74489.816265517497,941.53888854321804,4.137087877957673,1241.8380691038094,3785.0444917282598,34,40966.066666666797,40966.066666666797,49.5680345572354,49.5680345572354,32,124862,124862,46.436285097192197,46.436285097192197]
[null,"514:18137","NEWDELL 66","SHORT RURAL",248,89265.979966147104,962.13363114815604,2.3797408147544132,697.15167622454453,2287.3536124726625,13,39980.8166666666,17077.8166666666,52.822580645161295,34.274193548387103,30,131177,131177,147.177419354839,147.177419354839]
[null,"514:18141","NEWDELL 66","SHORT RURAL",6,8988.9817556903708,0,0.36611397150067893,1.0167202378080338,0,2,379,121,116.6666666666667,16.6666666666667,0,0,0,0,0]
[null,"514:18146","NEWDELL 66","SHORT RURAL",5,11484.3674272281,553.27565964621101,1.9770154461036664,97.695279505007562,78.747262661509652,3,6744,1436,240.00000000000003,80,3,5436,5436,240,240]
[null,"515:35192","MT THORLEY 66","SHORT RURAL",343,88421.688895965606,823.373314279488,1.8122641589283608,728.3378369815224,663.91335240621879,10,54848.583333333299,3229.5833333332998,59.766763848396501,7.5801749271137,27,49997,49997,95.918367346938808,95.918367346938808]
[null,"515:35193","MT THORLEY 66","SHORT RURAL",148,43375.189736927998,442.38567393594298,1.4461501874276821,77.572186234682576,213.94181352324438,10,7320.5999999999003,7320.5999999999003,21.6216216216216,21.6216216216216,17,20190,20190,67.567567567567593,67.567567567567593]
[null,"515:35197","MT THORLEY 66","LONG RURAL",533,100395.43436791,493.01536431123702,1.8305698575033951,1980.497027120171,2926.699847361378,39,147652.88333333371,146139.76666666701,168.85553470919299,168.66791744840498,49,218195.566666667,218195.566666667,132.64540337711099,132.64540337711099]
[null,"515:35198","MT THORLEY 66","SHORT RURAL",71,24269.189865771801,141.23169216283799,1.1349533116521049,2.361795507562515,77.964200293656958,1,284,284,5.6338028169014098,5.6338028169014098,4,9375,9375,67.605633802816897,67.605633802816897]
[null,"515:35200","MT THORLEY 66","URBAN",71,6458.3185049827298,1124.4524424372801,3.2584143463560427,4.7392844541518819,120.80997147611346,2,198.5,198.5,4.2253521126760498,4.2253521126760498,2,5060,5060,28.169014084506998,28.169014084506998]
[null,"516:48065","LEMINGTON 66","SHORT RURAL",35,31154.638311927301,93.867914469274297,0.75053364157639191,112.98538373567393,7.1767303857412754,5,20545,8713,305.71428571428612,208.57142857142898,2,1305,1305,17.1428571428571,17.1428571428571]
[null,"516:48066","LEMINGTON 66","SHORT RURAL",93,42148.427696977204,354.70463254785801,0.65900514870122207,238.38020013008011,132.83409667374715,14,49366.85,14146.85,235.48387096774201,134.408602150538,10,27509,27509,112.903225806452,112.903225806452]
[null,"516:48067","LEMINGTON 66","SHORT RURAL",280,79111.779735454606,27.625434241607302,2.1051553361289042,1521.7531687957489,453.03739303542551,22,98653.866666666698,16666.866666666701,180,81.071428571428612,11,29370,29370,46.428571428571402,46.428571428571402]
[null,"520:48172","MITCHELLS FLAT 66","SHORT RURAL",418,182205.52660399099,0,1.6841242689031235,1690.8725263632014,1723.5843867194278,50,137022.15,137022.15,246.41148325358898,246.41148325358898,41,139673,139238,121.05263157894784,119.85645933014399]
[null,"523:33500","SINGLETON NORTH 66","URBAN",210,0,2891.79857936588,1.0068134216268672,3.9259306192319503,0,1,532.16666666670005,532.16666666670005,0.476190476190476,0.476190476190476,0,0,0,0,0]
[null,"523:33501","SINGLETON NORTH 66","SHORT RURAL",731,149950.85510206199,979.69454964464398,3.8075853036070617,706.29868434711977,1260.4133242952955,24,25315.866666666698,23807.3,24.21340629274961,23.939808481532097,26,45177,44967,25.17099863201091,24.897400820793401]
[null,"523:33503","SINGLETON NORTH 66","URBAN",773,1464.7067536442801,4218.7571425023298,3.368248537806247,1627.4843117585103,1611.8690984892687,7,65942.7,65942.7,100.646830530401,100.646830530401,5,65310,65310,56.9210866752911,56.9210866752911]
[null,"523:33505","SINGLETON NORTH 66","URBAN",858,146.48373983488,7296.52070061616,4.0455593850825027,21.297130174479317,0,2,718.45,718.45,0.23310023310023301,0.23310023310023301,0,0,0,0,0]
[null,"523:33507","SINGLETON NORTH 66","URBAN",571,0,6323.62172637604,1.7024299674781576,302.22375249087696,490.48837688745482,6,24227.766666666601,24227.766666666601,66.024518388791591,66.024518388791591,7,39320,39320,29.071803852889701,29.071803852889701]
[null,"523:33508","SINGLETON NORTH 66","SHORT RURAL",495,32115.156471711201,2631.7473276736,3.2767200449310772,156.89686685341093,444.7542081323125,10,6534.7499999999,4477.8666666666004,7.474747474747466,6.8686868686868605,10,18524,18524,19.797979797979799,19.797979797979799]
[null,"523:33509","SINGLETON NORTH 66","URBAN",463,1787.93477018918,2983.98459692496,1.8122641589283608,0,480.63571394969881,0,0,0,0,0,3,36195,36195,32.829373650108003,32.829373650108003]
[null,"523:33511","SINGLETON NORTH 66","URBAN",237,0,2209.4951500664602,0.91528492875169754,0.37132196899739695,0,1,55.366666666699999,55.366666666699999,0.42194092827004198,0.42194092827004198,0,0,0,0,0]
[null,"524:33570","NULKABA 33","SHORT RURAL",1321,23487.5195651793,1326.1879497402399,4.2286163708328424,8222.5864856791541,3249.2496928981118,9,265377.566666667,265377.566666667,217.10825132475401,217.10825132475401,13,104867,104867,36.033308099924298,36.033308099924298]
[null,"524:33572","NULKABA 33","SHORT RURAL",1602,28097.858748480499,10557.1897940855,6.9378597599378669,248.65249042578878,1979.3001229527902,8,4891.2666666666,4891.2666666666,1.3732833957553099,1.3732833957553099,7,38935,38935,10.799001248439501,10.799001248439501]
[null,"524:33574","NULKABA 33","SHORT RURAL",58,1692.3057372851299,517.632101709827,0.18305698575033946,1.6193751228306585,11.001503153695902,1,1207.3,1207.3,1.72413793103448,1.72413793103448,2,8202,8202,101.72413793103401,101.72413793103401]
[null,"524:33576","NULKABA 33","SHORT RURAL",177,26194.637018415699,3365.2520527246102,3.3499428392312129,242.42062355269732,739.1827075418546,4,9876.1166666666995,7997,11.864406779660991,10.1694915254237,10,30114,30114,57.062146892655399,57.062146892655399]
[null,"524:33578","NULKABA 33","URBAN",1372,7486.9733489504097,2135.1652195904999,6.2056318169365099,1434.8972045524997,329.20811119611164,9,31556.5,31556.5,16.6909620991254,16.6909620991254,2,7240,7240,6.8513119533527709,6.8513119533527709]
[null,"524:33580","NULKABA 33","SHORT RURAL",148,18247.701421489699,1597.36352048085,2.3065180204542779,187.24204259222645,1974.6016146137169,2,11079,11079,16.2162162162162,16.2162162162162,8,116836,116836,182.43243243243199,182.43243243243199]
[null,"525:34580","TOMALPIN 33","SHORT RURAL",2,0.89951735053758497,2673.4048877213199,0.10983419145020371,0.70177840161103355,0,3,872,872,300,300,0,0,0,0,0]
[null,"525:34586","TOMALPIN 33","SHORT RURAL",2,421.43087096801202,2041.3765237908499,3.6611397150067899E-2,0.2339261338703445,0,3,872,872,300,300,0,0,0,0,0]
[null,"526:34633","ROTHBURY 132 11KV","SHORT RURAL",112,17562.186289725701,18128.148420637499,0.56747665582605245,13.176989372298609,1.4220670133563031,4,3169,3169,11.6071428571429,11.6071428571429,4,342,342,4.4642857142857197,4.4642857142857197]
[null,"526:34635","ROTHBURY 132 11KV","SHORT RURAL",32,10838.617660105299,1625.5748954798401,0.25627978005047525,0,0.30421127959744337,0,0,0,0,0,1,162,162,9.375,9.375]
[null,"526:34636","ROTHBURY 132 11KV","SHORT RURAL",126,33732.021780819399,589.87889389726104,1.9953211446787003,417.61175703090913,7.0177840161103342,14,28563.666666666599,27448.666666666599,124.60317460317478,123.80952380952399,2,480,480,3.1746031746031704,3.1746031746031704]
[null,"526:34637","ROTHBURY 132 11KV","SHORT RURAL",159,38485.346227322698,3355.7887827600498,2.0685439389788365,46.597902553297892,401.18828247006815,8,3074.3666666667,3074.3666666667,8.1761006289308202,8.1761006289308202,4,26469,20469,49.056603773584904,33.962264150943398]
[null,"526:34639","ROTHBURY 132 11KV","SHORT RURAL",257,51799.327042690697,813.61260758204901,1.7573470632032593,1673.7715334007894,3436.2804776572852,20,129984.83333333299,129984.83333333299,175.48638132295699,175.48638132295699,21,266861,266861,287.54863813229599,287.54863813229599]
[null,"526:34640","ROTHBURY 132 11KV","SHORT RURAL",161,41233.6686444636,4945.9286684177596,4.3567562608580799,324.60676804704707,1128.9712490764257,15,10168.299999999999,10168.299999999999,26.086956521739101,26.086956521739101,18,35365,35365,75.155279503105604,75.155279503105604]
[null,"526:34641","ROTHBURY 132 11KV","SHORT RURAL",137,8915.8667288435208,151.03800349718699,0.69561654585129007,1.9120599962144178,0,2,375.1333333334,375.1333333334,1.4598540145985399,1.4598540145985399,0,0,0,0,0]
[null,"528:83011","MAITLAND 33","SHORT RURAL",456,11269.394931987399,740.89821117848896,1.4461501874276821,247.05740660046413,2.1192849284125246,8,23315.166666666701,23315.166666666701,50.438596491228104,50.438596491228104,1,200,200,0.21929824561403499,0.21929824561403499]
[null,"528:83013","MAITLAND 33","URBAN",1211,4065.7004190805501,7142.4038137793495,5.6930722568355572,8552.9630225925084,2581.3265997545532,7,205033.08333333299,205033.08333333299,299.17423616845599,299.17423616845599,3,61880,61880,13.1296449215524,13.1296449215524]
[null,"528:83014","MAITLAND 33","SHORT RURAL",1100,16221.270749547701,4758.0695985820703,5.8212121468607956,1461.0332859321486,3778.71453639018,12,34253.166666666701,34253.166666666701,23.818181818181799,23.818181818181799,6,88590,88590,38.363636363636402,38.363636363636402]
[null,"528:83019","MAITLAND 33","SHORT RURAL",1037,37249.778430153201,10521.2565181184,6.0408805297612034,1487.8209803613011,21744.245641591362,30,33612.783333333296,33526.699999999997,19.093539054966225,18.997107039537102,17,491245,491245,128.44744455159102,128.44744455159102]
[null,"528:83020","MAITLAND 33","SHORT RURAL",1282,17512.749921402599,4696.3021778351704,4.4116733565831812,7504.2845627157067,3069.4965057567165,15,232145.35,97038.35,113.7285491419656,58.502340093603699,5,94955,94955,25.429017160686403,25.429017160686403]
[null,"528:83022","MAITLAND 33","URBAN",274,0,1236.9390528635099,2.6726319919549564,184.77300858464707,62.274785225529556,2,9435.25,9435.25,13.503649635036499,13.503649635036499,1,3180,3180,4.3795620437956195,4.3795620437956195]
[null,"528:83024","MAITLAND 33","URBAN",742,4094.4194979889398,1524.1100938690399,3.8991137964822311,2675.1176802529726,5189.7027865852697,4,93633.449999999895,93633.449999999895,104.44743935309999,104.44743935309999,5,181648,181648,25.202156334231802,25.202156334231802]
[null,"532:83293","METFORD 33","URBAN",1757,7799.7685605164497,1675.9628882690999,5.8212121468607956,1742.2053630241624,3231.5921596176681,7,40845.1,1618.1,27.660785429709701,11.155378486055801,5,75763,75763,25.611838360842299,25.611838360842299]
[null,"532:83295","METFORD 33","URBAN",647,519.058608927352,5693.40610579441,3.8075853036070617,911.24058332344384,0,2,32661.599999999999,32661.599999999999,103.70942812983,103.70942812983,0,0,0,0,0]
[null,"532:83298","METFORD 33","URBAN",262,2551.0063221289602,514.84556603761496,0.7871450387264598,193.04405454560691,1131.9348946772659,1,33470,33470,100,100,8,196255,196255,254.961832061069,254.961832061069]
[null,"532:83300","METFORD 33","URBAN",516,0,3562.3057344199701,2.452963609054549,525.56844425881172,313.78454566773831,1,29241,29241,99.418604651162795,99.418604651162795,1,17458,17458,16.6666666666667,16.6666666666667]
[null,"532:83301","METFORD 33","URBAN",1028,4092.3148266288299,1677.1319625834001,3.8441967007571294,3598.2260378577907,1058.8242592655463,5,127742.933333333,127742.933333333,99.8054474708171,99.8054474708171,3,37590,37590,19.649805447470801,19.649805447470801]
[null,"532:83302","METFORD 33","URBAN",57,0,908.09250838032006,3.1302744563308056,0,53.786244295492438,0,0,0,0,0,1,2345,2345,12.280701754386,12.280701754386]
[null,"532:83307","METFORD 33","SHORT RURAL",1395,10566.988230827499,10587.4720901405,6.3154660083867125,7984.4146193054612,23011.384208103475,5,172540.76666666701,172540.76666666701,112.75985663082399,112.75985663082399,18,497269,497269,124.94623655913999,124.94623655913999]
[null,"532:83309","METFORD 33","SHORT RURAL",2267,14833.9069884008,8489.0460312672803,7.468725018613851,1543.0087024146758,6202.2434725977773,10,28195.25,28195.25,102.11733568592901,102.11733568592901,18,113333,110865,16.100573445081643,15.9241288045876]
[null,"532:83312","METFORD 33","URBAN",477,52.622231105627399,4225.8252144783601,2.9838288677305336,92.669576375419865,2794.5937295316007,1,4238.55,4238.55,5.6603773584905701,5.6603773584905701,3,127820,127820,54.088050314465399,54.088050314465399]
[null,"532:83314","METFORD 33","URBAN",1001,4002.2386434098999,1607.15044932364,2.4163522119044809,4.7471177604701476,3884.7458487895533,3,268.11666666669998,268.11666666669998,0.29970029970029999,0.29970029970029999,3,219410,219410,55.944055944055904,55.944055944055904]
[null,"801:74117","MUSWELLBROOK 33","SHORT RURAL",19,1924.8481775615401,62.678696022576297,0.10983419145020371,0.20652297495425243,5.6335422147674716E-2,1,256.61666666669998,256.61666666669998,5.2631578947368398,5.2631578947368398,1,70,70,5.2631578947368398,5.2631578947368398]
[null,"801:74118","MUSWELLBROOK 33","URBAN",796,3814.60067582186,2850.33418729302,2.4727502386443039,1341.0104508654761,169.4095227720149,13,74012.650000000198,74012.650000000198,132.035175879397,132.035175879397,2,9350,9350,11.4321608040201,11.4321608040201]
[null,"801:74119","MUSWELLBROOK 33","URBAN",657,0,6742.6439850842598,2.8739946762803301,31.684595111025871,277.97506871152638,5,1504.5833333333001,1504.5833333333001,2.5875190258751903,2.5875190258751903,2,13200,13200,10.0456621004566,10.0456621004566]
[null,"801:74120","MUSWELLBROOK 33","URBAN",612,3600.7343359625302,3353.1570425573,6.1141033240613387,5224.9191141411966,9.8560162366931863,9,116627.46666666699,116627.46666666699,216.176470588234,216.176470588234,1,220,220,0.16339869281045799,0.16339869281045799]
[null,"801:74121","MUSWELLBROOK 33","LONG RURAL",477,199065.20653934899,1967.8571225655701,1.9587097475286324,3226.1182076059272,403.39502143476699,69,224783.4,176994.4,485.95387840670838,451.57232704402503,19,28107,28107,20.964360587002101,20.964360587002101]
[null,"801:74122","MUSWELLBROOK 33","URBAN",1137,5716.0458106141396,2821.4775955351301,4.7411759309337924,34.149014979266937,338.71672566289419,4,982.98333333330004,982.98333333330004,1.8469656992084402,1.8469656992084402,1,9750,9750,4.3975373790677201,4.3975373790677201]
[null,"801:74123","MUSWELLBROOK 33","SHORT RURAL",279,77473.460675306706,154.74906229590499,0.95189632590176543,625.65591357295011,117.40087364443418,10,89701.55,89701.55,148.74551971326198,148.74551971326198,17,16832,16832,32.258064516128997,32.258064516128997]
[null,"802:82215","BAERAMI 33","SHORT RURAL",36,26813.949833317602,0,0.32950257435061103,6.9260377571842016,0,2,2868.6666666667002,2868.6666666667002,113.888888888889,113.888888888889,0,0,0,0,0]
[null,"802:82220","BAERAMI 33","SHORT RURAL",63,34463.629147856103,0,0.27458547862550919,22.966375559106481,3.0179690436254298,8,11414.8166666667,11414.8166666667,153.968253968254,153.968253968254,6,1500,1370,14.28571428571429,12.698412698412701]
[null,"802:82225","BAERAMI 33","SHORT RURAL",107,94493.561000355694,1215.9218843646599,0.43933676580081482,23.307144503719091,189.82783846880471,12,7240.1166666667004,6565.1166666667004,124.29906542056102,118.691588785047,14,58968,58968,134.57943925233599,134.57943925233599]
[null,"806:82662","MOONAN 33","SHORT RURAL",229,185343.776856724,642.44547783239796,0.84206213445156175,522.40790188649976,378.28699444333591,20,84668.066666666593,84668.066666666593,324.45414847161601,324.45414847161601,37,61310,61310,95.633187772925794,95.633187772925794]
[null,"806:82667","MOONAN 33","SHORT RURAL",40,37400.048202559701,0,0.36611397150067893,21.074410765657639,6.599292308727609,3,7855.85,7855.85,202.5,202.5,5,2460,2460,40,40]
[null,"807:74179","DENMAN 66","SHORT RURAL",136,55836.207526791601,1399.5020775104999,0.98850772305183321,513.37512500999389,204.16198423840802,22,70877.566666666593,70813.566666666593,305.14705882352905,304.41176470588198,10,28187,26587,97.058823529411796,93.382352941176507]
[null,"807:74180","DENMAN 66","SHORT RURAL",110,58540.489172685302,885.95741066449398,0.4942538615259166,195.26446826337232,40.347831738037115,17,53917.183333333305,28900.183333333302,262.72727272727332,165.45454545454601,18,11141,11141,63.636363636363605,63.636363636363605]
[null,"807:74181","DENMAN 66","SHORT RURAL",711,14947.217776003001,1501.8805250863199,0.91528492875169754,1580.2407829120748,93.047338913909414,18,235624.80000000002,235525.35,330.66104078762299,330.37974683544297,4,13874,13874,9.5639943741209592,9.5639943741209592]
[null,"807:74183","DENMAN 66","SHORT RURAL",88,23772.7667643809,474.25246873118198,2.050238240403802,322.00100439306254,55.809624874296411,9,21434.183333333298,21248.383333333299,217.04545454545462,215.90909090909099,3,3715,3715,18.181818181818198,18.181818181818198]
[null,"807:74184","DENMAN 66","SHORT RURAL",498,164432.53443454299,1451.06587884685,2.2149895275791081,3428.0043346819466,1386.818207982418,55,211214.50000000041,127944.066666667,362.650602409638,274.49799196787097,24,85448,85448,53.212851405622494,53.212851405622494]
[null,"810:74050","MERRIWA 33","SHORT RURAL",138,102251.396047253,0,0.58578235440108639,107.5326961102612,969.97364103772338,14,25052.916666666599,24940.916666666599,172.46376811594243,171.73913043478299,16,225984,225984,471.01449275362296,471.01449275362296]
[null,"810:74054","MERRIWA 33","LONG RURAL",326,328557.31210316799,0,0.86036783302659559,632.51477133922174,3752.6771090652696,46,100332.2499999998,99790.116666666494,238.95705521472402,238.03680981595102,22,595266,595266,518.09815950920301,518.09815950920301]
[null,"810:74058","MERRIWA 33","SHORT RURAL",201,124028.19835746101,0,0.53086525867598455,43.499414095588151,1309.9730706101373,12,11182.8666666667,10909.5,110.44776119402995,109.950248756219,13,336769,336769,456.218905472637,456.218905472637]
[null,"810:74062","MERRIWA 33","SHORT RURAL",578,11751.313052411801,193.51455966966,1.9587097475286324,579.97704071728617,12667.582487598303,12,40410.550000000097,40410.550000000097,109.861591695502,109.861591695502,11,882628,882628,415.91695501730095,415.91695501730095]
[null,"811:74234","ROUCHEL 33","SHORT RURAL",262,115511.185224243,522.35006666260904,1.5742900774529196,567.20230637891427,263.75573989753826,15,49170.8,49170.8,118.702290076336,118.702290076336,20,22865,22865,35.877862595419799,35.877862595419799]
[null,"812:19065","MITCHELL LINE 66","SHORT RURAL",139,10149.1472958136,4371.0218510280301,2.1234610347039382,211.67866759935484,1.2447445655486222,6,13604.633333333401,13604.633333333401,108.63309352518,108.63309352518,1,80,80,0.71942446043165498,0.71942446043165498]
[null,"812:19066","MITCHELL LINE 66","SHORT RURAL",1227,4840.0834629239598,16075.1826975654,7.468725018613851,25.571560210136862,2165.5014356868173,3,467.26666666659997,467.26666666659997,0.24449877750611299,0.24449877750611299,7,39570,30120,14.91442542787289,11.2469437652812]
[null,"812:19071","MITCHELL LINE 66","SHORT RURAL",1447,15376.9954982581,12834.924863183,2.0868496375538701,680.17898495054612,580.60090857138516,20,44482.183333333298,44482.183333333298,64.961990324809904,64.961990324809904,6,37970,37970,10.8500345542502,10.8500345542502]
[null,"812:19072","MITCHELL LINE 66","SHORT RURAL",207,113876.86534413599,1236.8535318767399,2.7458547862550926,1201.3062664439333,383.96614152365146,29,59707.683333333298,58888.683333333298,228.50241545893732,225.12077294686003,23,19084,19084,41.062801932367101,41.062801932367101]
[null,"813:89055","SCONE 66","SHORT RURAL",594,138925.829499919,1145.5104025641799,4.5032018494583514,3875.6477854182808,6219.0080894371795,39,117456.46666666699,117456.46666666699,202.35690235690197,202.35690235690197,23,188475,188475,85.016835016835003,85.016835016835003]
[null,"813:89058","SCONE 66","SHORT RURAL",14,11416.0894896396,430.023432144303,0.10983419145020371,5.1506671677874025E-2,0,1,64,64,7.1428571428571397,7.1428571428571397,0,0,0,0,0]
[null,"813:89059","SCONE 66","URBAN",288,1605.13614591652,853.68606081748203,1.8488755560784287,222.71806750210709,0,1,16440,16440,95.1388888888889,95.1388888888889,0,0,0,0,0]
[null,"813:89061","SCONE 66","LONG RURAL",646,309685.67331175902,3410.5861769923099,2.3614351161793796,9709.8382301326474,3475.3120724964292,52,561164.28333333402,560951.03333333402,337.46130030959785,337.151702786378,75,200850,192666,112.38390092879295,108.978328173375]
[null,"813:89062","SCONE 66","SHORT RURAL",834,136234.39347561801,2740.7707517222598,2.7458547862550926,1738.1643963671193,512.85353948008151,37,86390.766666666706,86257.216666666704,53.117505995203807,52.9976019184652,11,25490,25490,11.990407673860901,11.990407673860901]
[null,"813:89063","SCONE 66","SHORT RURAL",1040,8613.5652140177299,5431.29915213812,3.1668858534808733,795.4541778077255,1159.6613116109465,20,34279.683333333203,34279.683333333203,43.557692307692299,43.557692307692299,3,49975,49975,19.038461538461501,19.038461538461501]
[null,"813:89065","SCONE 66","URBAN",691,6871.5231772239404,3825.2681230983399,2.7641604848301262,7851.6847252784164,23.08947516309696,14,387662.36666666699,387662.36666666699,211.866859623734,211.866859623734,1,1140,1140,1.73661360347323,1.73661360347323]
[null,"814:82283","ABERDEEN 66","SHORT RURAL",181,74081.307716723895,279.66148638627902,0.98850772305183321,199.7262940568491,163.33248464100831,20,27574.6,27574.6,179.005524861878,179.005524861878,14,22550,22550,55.801104972375704,55.801104972375704]
[null,"814:82285","ABERDEEN 66","SHORT RURAL",156,48564.513528760901,294.55791847669099,0.84206213445156175,325.4189549339369,119.13171242394274,30,52741.533333333296,52741.533333333296,417.30769230769198,417.30769230769198,10,19308,19308,63.461538461538403,63.461538461538403]
[null,"814:82289","ABERDEEN 66","SHORT RURAL",666,52952.237624064801,3151.90990757894,3.2218029492059754,130.95871729684256,335.10455204756829,10,5547.4,5547.4,5.1051051051050997,5.1051051051050997,4,14195,8970,7.8078078078077997,4.9549549549549505]
[null,"814:82291","ABERDEEN 66","SHORT RURAL",464,16501.942489677,5453.7273395014299,1.9404040489535987,119.90668663475851,614.98009175418167,7,8433.4500000000007,8433.4500000000007,12.0689655172414,12.0689655172414,8,43253.666666666701,43253.666666666701,41.379310344827601,41.379310344827601]
[null,"ZN1068:PA16","LIDCOMBE","URBAN",682,0.89378019292786304,4320.2370320987202,1.4572695606303998,11.463437507072673,0,3,1073.5666666666,1073.5666666666,1.17302052785924,1.17302052785924,0,0,0,0,0]
[null,"ZN1068:PA17","LIDCOMBE","URBAN",899,0,5863.3765771151702,3.8164167420823998,5800.8784216271742,29.082724375536408,9,207439.76666666701,207439.76666666701,160.62291434927701,160.62291434927701,1,1040,1040,0.222469410456062,0.222469410456062]
[null,"ZN1068:PA18","LIDCOMBE","URBAN",555,0,2851.7784768633201,3.3267778122647997,229.5120288638258,17.06348724116798,3,9415.3333333333994,9415.3333333333994,6.8468468468468506,6.8468468468468506,1,700,700,0.36036036036036001,0.36036036036036001]
[null,"ZN1068:PA21","LIDCOMBE","URBAN",648,0,5996.9225651536999,1.9195334085543998,822.73365407828305,687.19076757965445,4,58494.85,58494.85,75.154320987654302,75.154320987654302,2,48858,48858,23.9197530864197,23.9197530864197]
[null,"ZN1068:PA22","LIDCOMBE","URBAN",434,0,2026.6617241910801,1.1142861483847999,891.88448455838,0,6,109236.03333333301,109236.03333333301,38.248847926267295,38.248847926267295,0,0,0,0,0]
[null,"ZN1068:PA26","LIDCOMBE","URBAN",1834,0,4329.5251374248501,4.5647960421440006,9672.8886025347329,0,9,289193.71666666702,289193.71666666702,148.25517993456901,148.25517993456901,0,0,0,0,0]
[null,"ZN1068:PA27","LIDCOMBE","URBAN",1444,0,6254.0221978848804,4.0166206989983992,8270.8209214720955,15.304181985941344,6,281022.98333333299,281022.98333333299,199.307479224377,199.307479224377,1,520,520,6.9252077562326902E-2,6.9252077562326902E-2]
[null,"ZN1068:PA29","LIDCOMBE","URBAN",133,0,2885.81657125313,0.92169189560880005,7.3985072956592983,0,1,1095.5,1095.5,0.75187969924812004,0.75187969924812004,0,0,0,0,0]
[null,"ZN10990:PA11","ARNCLIFFE","URBAN",1135,3920.7362327477099,827.39340387309198,4.5764246439368002,1394.0474063731838,410.54438891717558,4,41572.416666666701,41572.416666666701,10.0440528634361,10.0440528634361,1,12243,12243,4.6696035242290694,4.6696035242290694]
[null,"ZN10990:PA12","ARNCLIFFE","URBAN",879,1861.6947589869999,1461.4017937982301,1.8305698571903999,2265.3582065888636,217.29377110387762,5,168890.26666666701,168890.26666666701,158.93060295790698,158.93060295790698,1,16200,16200,3.4129692832764498,3.4129692832764498]
[null,"ZN10990:PA2","ARNCLIFFE","URBAN",2111,2285.1758617617402,4458.0562263028696,4.7594816298479996,207.49981330479457,0,3,5949.9333333333998,5949.9333333333998,3.1264803410705801,3.1264803410705801,0,0,0,0,0]
[null,"ZN10990:PA5","ARNCLIFFE","URBAN",682,821.90415462576698,1754.27411756786,2.3797408149239998,0,457.9868622996085,0,0,0,0,0,5,26265,26265,19.501466275659801,19.501466275659801]
[null,"ZN10990:PA6","ARNCLIFFE","URBAN",1114,1666.1871975285601,1130.2690461387399,1.8305698571903999,426.43097787391156,647.85735458748707,5,31791.9,31791.9,67.14542190305211,67.14542190305211,1,48300,48300,10.323159784560101,10.323159784560101]
[null,"ZN10990:PA7","ARNCLIFFE","URBAN",1117,1801.6085082951499,2196.9887784079101,1.7573470634024,93.813178749051033,0,1,7285.5166666667001,7285.5166666667001,5.2820053715308903,5.2820053715308903,0,0,0,0,0]
[null,"ZN10990:PA8","ARNCLIFFE","URBAN",1888,2020.42830935961,2429.12146208074,3.111968757608,2132.5975250925844,2234.1823630961926,2,93525,93525,100.900423728814,100.900423728814,2,97980,97980,10.963983050847501,10.963983050847501]
[null,"ZN10991:PA1","BLAKEHURST","URBAN",1542,5847.5874857208701,1863.0110119635101,4.7707070655488,10531.004966765302,356.55692690778011,9,301259.75,301259.75,222.82749675745799,222.82749675745799,1,10200,10200,4.4098573281452706,4.4098573281452706]
[null,"ZN10991:PA12","BLAKEHURST","URBAN",1240,3548.1565049825099,3223.1673877765102,3.4339118479712001,1284.346925327181,0,5,51044.3,51044.3,12.258064516129,12.258064516129,0,0,0,0,0]
[null,"ZN10991:PA13","BLAKEHURST","URBAN",1132,2630.7244061364099,1101.1707002094799,3.6874596313023997,534.60911182151949,149.95681697591542,6,19786.233333333399,19786.233333333399,12.9858657243816,12.9858657243816,1,5550,5550,3.2685512367491198,3.2685512367491198]
[null,"ZN10991:PA5","BLAKEHURST","URBAN",1511,643.72956553173401,1936.33895490492,3.4249503520360003,1409.4276956587171,0,4,56162,56162,14.824619457313002,14.824619457313002,0,0,0,0,0]
[null,"ZN10991:PA6","BLAKEHURST","URBAN",1378,752.39428875477097,2443.8496623280498,1.6841242686536,74.108711296455994,0,2,6005.5,6005.5,10.595065312046401,10.595065312046401,0,0,0,0,0]
[null,"ZN10991:PA7","BLAKEHURST","URBAN",1610,1643.0912308125901,2150.5045189077,3.6891214511591999,4142.5926077348349,0,4,153251,153251,119.130434782609,119.130434782609,0,0,0,0,0]
[null,"ZN10991:PA8","BLAKEHURST","URBAN",2010,4272.31165618667,2286.3042978625499,4.0675005797552002,8537.9883365419864,0,9,286471.86666666699,286471.86666666699,102.73631840796,102.73631840796,0,0,0,0,0]
[null,"ZN10993:PA22","HURSTVILLE NORTH","URBAN",2074,4876.5345690736904,2201.7711329399199,3.9906422897896001,1639.5697533225514,1259.2536195271794,11,56071.366666666698,56071.366666666698,7.7627772420443595,7.7627772420443595,1,43065,43065,4.1947926711668293,4.1947926711668293]
[null,"ZN10993:PA23","HURSTVILLE NORTH","URBAN",714,1862.81760091674,1053.3974547714299,4.5014502944543997,50.858554412888125,0,2,1541.9333333333,1541.9333333333,3.6414565826330501,3.6414565826330501,0,0,0,0,0]
[null,"ZN10993:PA26","HURSTVILLE NORTH","URBAN",696,0,3439.6691092011201,3.5700547435191998,0,2.6158981540519406,0,0,0,0,0,1,100,100,0.71839080459770099,0.71839080459770099]
[null,"ZN10993:PA27","HURSTVILLE NORTH","URBAN",949,1415.4824282417201,1469.7951082464101,2.3797408149239998,1617.1836079583804,0,2,92743.55,92743.55,8.2191780821917799,8.2191780821917799,0,0,0,0,0]
[null,"ZN10993:PA33","HURSTVILLE NORTH","URBAN",709,2597.7158535552999,1203.3787304350101,3.2799436037743996,3170.3753602942061,886.1055765731727,4,131916.26666666701,131916.26666666701,207.33427362482399,207.33427362482399,2,36870,36870,14.668547249647402,14.668547249647402]
[null,"ZN10993:PA34","HURSTVILLE NORTH","URBAN",1107,0,2928.3090551518999,3.3990469217375998,0,1047.7933252407765,0,0,0,0,0,4,42070,42070,11.653116531165301,11.653116531165301]
[null,"ZN10993:PA35","HURSTVILLE NORTH","URBAN",822,2850.0802028968101,1685.2181245710699,3.5978545287976003,719.44280529022569,964.08320164247789,4,27290.2,27290.2,13.503649635036499,13.503649635036499,3,36570,36570,11.922141119221399,11.922141119221399]
[null,"ZN10993:PA43","HURSTVILLE NORTH","URBAN",226,997.64111343358195,395.742393555658,0.59722341642719989,0,86.120764688986739,0,0,0,0,0,1,19680,19680,18.141592920354,18.141592920354]
[null,"ZN10994:PA1","MORTDALE","URBAN",1024,2614.3354571732798,2070.2509215842301,3.2909195898535999,2518.9359720432567,0,11,104460.933333333,104460.933333333,91.796875,91.796875,0,0,0,0,0]
[null,"ZN10994:PA10","MORTDALE","URBAN",1110,4837.6156646279996,3270.1788187444599,3.7916045682471999,7859.1890577662462,750.12347651644393,6,282884.23333333299,282884.23333333299,212.16216216216202,212.16216216216202,1,27000,27000,4.5045045045045002,4.5045045045045002]
[null,"ZN10994:PA11","MORTDALE","URBAN",739,4319.3527794047704,1279.8964667948001,2.6896933057607999,738.26526077074516,366.5740029694847,7,37459.65,37459.65,36.400541271989198,36.400541271989198,1,18600,18600,5.4127198917456001,5.4127198917456001]
[null,"ZN10994:PA12","MORTDALE","URBAN",2097,2428.5746955213499,5632.4743490051796,4.5038616699408003,4396.4403891693846,0,7,133220.23333333299,133220.23333333299,104.57796852646599,104.57796852646599,0,0,0,0,0]
[null,"ZN10994:PA13","MORTDALE","URBAN",1085,1514.78384601377,3698.5777200138,2.4989054338488002,155.28976772342745,402.09448168924263,3,8481,8481,15.2995391705069,15.2995391705069,1,21960,21960,5.6221198156682002,5.6221198156682002]
[null,"ZN10994:PA14","MORTDALE","URBAN",496,1233.4795708082199,490.70356131700299,1.6913939543207999,435.56630653909014,0,1,35145,35145,99.798387096774206,99.798387096774206,0,0,0,0,0]
[null,"ZN10994:PA19","MORTDALE","URBAN",905,4795.3636960338799,3293.59801104088,3.8940600027655998,9450.6465291577697,0,8,331217.23333333299,331217.23333333299,303.53591160221004,303.53591160221004,0,0,0,0,0]
[null,"ZN10994:PA2","MORTDALE","URBAN",1660,282.23579477946998,4774.5788888651796,3.3668712602919997,3624.469659077412,0,3,146916.98333333299,146916.98333333299,104.096385542169,104.096385542169,0,0,0,0,0]
[null,"ZN10994:PA20","MORTDALE","URBAN",2354,1040.0579611753799,2554.7710211547301,3.1981227808479997,495.75189483616435,118.10590862774544,3,21155.5,21155.5,4.5029736618521605,4.5029736618521605,1,5040,5040,3.5683942225998297,3.5683942225998297]
[null,"ZN10994:PA21","MORTDALE","URBAN",1082,4186.8068814463704,1195.64849355159,2.9687790752672001,1060.4451521940819,0,3,48748.85,48748.85,42.236598890942702,42.236598890942702,0,0,0,0,0]
[null,"ZN10994:PA3","MORTDALE","URBAN",1073,2182.0100200604302,2062.7865023260301,2.8371946828287999,129.4317197281722,1137.5779926799257,3,6225.95,6225.95,5.4986020503261903,5.4986020503261903,3,54720,54720,12.861136999068002,12.861136999068002]
[null,"ZN10994:PA4","MORTDALE","URBAN",2194,4869.9214375399697,3129.7622676185301,5.1683465312215997,166.76709926964142,0,4,4403.6499999999996,4403.6499999999996,2.0966271649954402,2.0966271649954402,0,0,0,0,0]
[null,"ZN10994:PA7","MORTDALE","URBAN",1694,4547.0771481513802,4658.6165854835299,4.0867472071768001,2165.3569544902416,2280.6081164979437,9,72311.233333333395,72311.233333333395,17.237308146399101,17.237308146399101,1,76160,76160,8.0283353010625689,8.0283353010625689]
[null,"ZN10994:PA8","MORTDALE","URBAN",362,935.73854095781303,1520.4386110687101,1.5210593526087999,5.7983470456474695,57.955607183790178,2,520.25,520.25,1.65745856353591,1.65745856353591,1,5200,5200,4.4198895027624303,4.4198895027624303]
[null,"ZN10995:PA1","RIVERWOOD","URBAN",2075,5279.0661267582,1810.7297596507001,3.9100469259488002,1443.2910034662236,1372.2021734642517,8,50376.266666666699,50376.266666666699,24.578313253012098,24.578313253012098,3,47895,47895,7.9518072289156594,7.9518072289156594]
[null,"ZN10995:PA12","RIVERWOOD","URBAN",1293,3872.0189956616,1617.4532135311099,3.1348622503536001,395.71266828098732,0,4,17227.233333333301,17227.233333333301,5.4137664346480996,5.4137664346480996,0,0,0,0,0]
[null,"ZN10995:PA13","RIVERWOOD","URBAN",1367,4221.4851660037502,1660.51259227898,3.8952644895087998,456.3783498542108,0,4,15989.766666666699,15989.766666666699,6.5837600585223104,6.5837600585223104,0,0,0,0,0]
[null,"ZN10995:PA2","RIVERWOOD","URBAN",2397,4360.7060012790898,3344.2303343258,4.8370635348039999,61.193136673218895,0,4,1726.5333333333999,1726.5333333333999,0.16687526074259498,0.16687526074259498,0,0,0,0,0]
[null,"ZN10995:PA5","RIVERWOOD","URBAN",1460,1514.5240937425001,2049.8831347966202,3.5915284832424001,7857.473589236195,0,3,298577.90000000002,298577.90000000002,202.32876712328797,202.32876712328797,0,0,0,0,0]
[null,"ZN10995:PA6","RIVERWOOD","URBAN",1562,2698.4225671212898,2408.1529074075202,5.4213517421456006,985.88476300411048,661.40546520791338,4,24818.333333333401,24818.333333333401,8.962868117797699,8.962868117797699,2,16650,16650,5.8258642765684998,5.8258642765684998]
[null,"ZN10995:PA7","RIVERWOOD","URBAN",2147,5406.1271968074097,1431.8918647666601,5.1450511608168004,20373.618270167695,1323.4034401106512,7,540421.36666666705,540421.36666666705,203.02748020493701,203.02748020493701,2,35104,35104,3.2603632976245898,3.2603632976245898]
[null,"ZN10995:PA8","RIVERWOOD","URBAN",708,1799.6667705145101,2319.70113299785,4.1392716268415999,14.428402512219881,0,1,475.71666666670001,475.71666666670001,0.14124293785310699,0.14124293785310699,0,0,0,0,0]
[null,"ZN10996:PA10","ROCKDALE","URBAN",874,2994.1276900598,2372.4737345332801,2.3352370374024001,838.57970647072364,0,8,49008.05,49008.05,19.3363844393593,19.3363844393593,0,0,0,0,0]
[null,"ZN10996:PA11","ROCKDALE","URBAN",627,525.22669566363004,1308.14378601268,1.0019437561552,0,229.93816030417216,0,0,0,0,0,1,31320,31320,13.8755980861244,13.8755980861244]
[null,"ZN10996:PA12","ROCKDALE","URBAN",1416,4596.4024909269001,3698.24774189456,3.2060638111032,831.71383428231957,131.08479422109474,6,35404.283333333398,35404.283333333398,21.892655367231601,21.892655367231601,2,5580,5580,0.84745762711864403,0.84745762711864403]
[null,"ZN10996:PA14","ROCKDALE","URBAN",494,118.37254669874,1057.1075075214401,0.89521394438159996,1.3840610577900587,0,1,211,211,0.20242914979757098,0.20242914979757098,0,0,0,0,0]
[null,"ZN10996:PA19","ROCKDALE","URBAN",1036,1628.4366880463199,1654.5639941101699,4.9402591821327997,3730.800112894301,7.6017745349513737,4,103063.83333333299,103063.83333333299,104.53667953668,104.53667953668,1,210,210,9.6525096525096499E-2,9.6525096525096499E-2]
[null,"ZN10996:PA4","ROCKDALE","URBAN",798,1157.9738067519299,1161.7993838025,2.8055758482191999,178.96989425802184,441.5727320269429,2,8705.8666666666995,8705.8666666666995,22.431077694235597,22.431077694235597,2,21480,21480,4.7619047619047601,4.7619047619047601]
[null,"ZN10996:PA8","ROCKDALE","URBAN",1197,1151.41793062027,1633.4578037886299,3.3740344182199999,270.4660672795772,563.67699579290309,2,10940,10940,5.6808688387635797,5.6808688387635797,1,22800,22800,3.34168755221387,3.34168755221387]
[null,"ZN10996:PA9","ROCKDALE","URBAN",1050,2464.7515585964802,2135.7163995682799,3.7201923367248,3265.7080083289006,1285.4023771290567,6,119802.53333333301,119802.53333333301,99.619047619047592,99.619047619047592,3,47155,47155,9.8095238095238102,9.8095238095238102]
[null,"ZN10997:PA1","SANS SOUCI","URBAN",1052,1923.2525817522201,2102.2841781672701,2.2194222236575998,1036.2620765198403,562.03015792019482,6,63721.166666666599,63721.166666666599,110.076045627376,110.076045627376,1,34560,34560,4.5627376425855504,4.5627376425855504]
[null,"ZN10997:PA11","SANS SOUCI","URBAN",713,1906.30999510841,980.38879421861895,3.3964947602272,2113.8674053913896,0,3,84937.766666666706,84937.766666666706,198.73772791023799,198.73772791023799,0,0,0,0,0]
[null,"ZN10997:PA12","SANS SOUCI","URBAN",1405,2394.0065377320102,2713.6519570770001,3.3394578357527998,924.91260586328508,749.49530543929177,5,37798.866666666698,37798.866666666698,10.2491103202847,10.2491103202847,2,30630,30630,12.170818505338101,12.170818505338101]
[null,"ZN10997:PA2","SANS SOUCI","URBAN",2537,821.19157379378805,5793.9439063821301,4.1446207703495999,1067.4811200525157,11165.169617755388,6,35150.333333333299,35150.333333333299,13.362238864800998,13.362238864800998,7,367650,367650,34.8048876625936,34.8048876625936]
[null,"ZN10997:PA5","SANS SOUCI","URBAN",825,1256.1969242335199,1498.4045530528799,1.9976093568703999,167.70368081317605,0,5,11457.4,11457.4,7.2727272727272698,7.2727272727272698,0,0,0,0,0]
[null,"ZN10997:PA7","SANS SOUCI","URBAN",1043,989.54047583285001,3840.4570666380801,4.6386913209895999,389.48041321537795,6158.8499401887348,2,11458.9333333333,11458.9333333333,9.0124640460210905,9.0124640460210905,6,181200,181200,28.283796740172601,28.283796740172601]
[null,"ZN10997:PA8","SANS SOUCI","URBAN",251,906.84225936061898,505.267398740033,1.3630213863607998,10.933110662435611,0,4,1094.7,1094.7,1.5936254980079698,1.5936254980079698,0,0,0,0,0]
[null,"ZN10999:PA10","KOGARAH","URBAN",2750,10606.5143384148,1490.0678768821899,4.7331717167759999,9733.873559566633,9842.6174888702008,7,280664.5,280664.5,94.436363636363595,94.436363636363595,2,283800,283800,6.2545454545454504,6.2545454545454504]
[null,"ZN10999:PA11","KOGARAH","URBAN",2293,1085.8078749490301,3753.8109943125501,3.1198581333336,7084.0297366177938,865.26011653698981,5,309884.3,309884.3,98.124727431312692,98.124727431312692,3,37850,37850,4.8844308765809004,4.8844308765809004]
[null,"ZN10999:PA12","KOGARAH","URBAN",3172,4276.5445701301396,3924.07797064445,4.4299790553999996,5142.6132325645985,2067.1134988661297,7,158429.566666667,158429.566666667,92.969735182849902,92.969735182849902,3,63682,63682,5.7061790668348102,5.7061790668348102]
[null,"ZN10999:PA14","KOGARAH","URBAN",253,310.48440981316497,1390.13323195977,3.8962060494887996,515.9910277288833,11.990496384094888,1,18074,18074,75.494071146245105,75.494071146245105,1,420,420,0.39525691699604698,0.39525691699604698]
[null,"ZN10999:PA15","KOGARAH","URBAN",1506,3595.7610473744699,1501.1154116484399,3.2498468810151997,322.17686188823723,565.79003138530641,5,13529.6166666667,13529.6166666667,5.4448871181938898,5.4448871181938898,1,23760,23760,2.9216467463479399,2.9216467463479399]
[null,"ZN10999:PA16","KOGARAH","URBAN",1431,3579.3296786146202,1522.3672811773299,3.5683395713991999,1099.4057190918388,1182.8637649478344,4,42048.05,42048.05,111.111111111111,111.111111111111,1,45240,45240,2.0265548567435401,2.0265548567435401]
[null,"ZN10999:PA17","KOGARAH","URBAN",2812,6691.2759113601796,2798.2480910407198,4.1984368424551999,283.39246264660358,0,3,9212.0166666666992,9212.0166666666992,3.6628733997155001,3.6628733997155001,0,0,0,0,0]
[null,"ZN10999:PA19","KOGARAH","URBAN",1993,1693.19883751916,5147.6742989978202,5.5386213348768001,0,3657.9780325788588,0,0,0,0,0,2,90135,90135,11.088810837932799,11.088810837932799]
[null,"ZN10999:PA2","KOGARAH","URBAN",289,0,1495.91729054748,1.9624666969848001,81.307561952550714,0,1,5654.35,5654.35,13.494809688581299,13.494809688581299,0,0,0,0,0]
[null,"ZN10999:PA22","KOGARAH","URBAN",2126,4135.5744005102797,1562.84282108006,4.4962315228592002,3189.883347093717,1551.0029591459995,8,96823.366666666596,96823.366666666596,18.5324553151458,18.5324553151458,2,47078,47078,13.3584195672625,13.3584195672625]
[null,"ZN10999:PA23","KOGARAH","URBAN",405,0,3528.5585727828602,3.2822325762231999,0,401.15420927461798,0,0,0,0,0,3,16680,16680,10.8641975308642,10.8641975308642]
[null,"ZN10999:PA24","KOGARAH","URBAN",2538,2573.57232208901,2807.7776682899798,4.0765555519224002,6530.9603953974147,922.09560090658067,4,218644.08333333299,218644.08333333299,103.50669818754901,103.50669818754901,1,30870,30870,3.8613081166272698,3.8613081166272698]
[null,"ZN10999:PA25","KOGARAH","URBAN",1196,354.71239687780502,3535.4578875463699,3.3772478801151999,580.09679677221732,237.56372506473306,2,23441.833333333299,23441.833333333299,4.4314381270903,4.4314381270903,1,9600,9600,5.3511705685618702,5.3511705685618702]
[null,"ZN10999:PA29","KOGARAH","URBAN",2338,1542.92390493584,3803.3540805633002,4.0241696911471996,350.62317701970585,919.97671541627415,6,11890.9999999999,11890.9999999999,3.3361847733105296,3.3361847733105296,3,31200,31200,6.7151411462788708,6.7151411462788708]
[null,"ZN10999:PA3","KOGARAH","URBAN",3,0,2690.9952790422699,2.2617724227448002,0,311.73362932124633,0,0,0,0,0,2,18810,18810,1266.6666666666699,1266.6666666666699]
[null,"ZN10999:PA32","KOGARAH","URBAN",1573,4224.5145306909399,1873.3542010358599,3.8534767917423998,43.834056455005857,1207.9236479152239,3,1552.4333333333,1552.4333333333,0.25429116338207203,0.25429116338207203,3,42780,42780,7.18372536554355,7.18372536554355]
[null,"ZN10999:PA35","KOGARAH","URBAN",145,0,3415.7469596890001,3.2100637435247998,0,534.87225728932822,0,0,0,0,0,3,22740,22740,73.793103448275801,73.793103448275801]
[null,"ZN10999:PA36","KOGARAH","URBAN",2393,1057.98160801518,3102.7591013684,3.9155406564056001,1017.0385012027461,271.17851619835727,8,35448.65,35448.65,5.7250313414124694,5.7250313414124694,2,9451.8666666666995,9451.8666666666995,1.8804847471792798,1.8804847471792798]
[null,"ZN10999:PA38","KOGARAH","URBAN",2309,4245.66078885772,6346.0461266442098,3.6590571256151998,486.55009664313548,2108.1592833678747,4,18147.3166666666,17711.133333333299,6.0632308358596818,6.0199220441749697,4,78630,78630,10.480727587700301,10.480727587700301]
[null,"ZN10999:PA39","KOGARAH","URBAN",855,1059.5611174855701,4364.5387172807496,2.6279088513455999,198.40484292184675,0,3,10303.766666666599,10303.766666666599,101.40350877193001,101.40350877193001,0,0,0,0,0]
[null,"ZN10999:PA4","KOGARAH","URBAN",1618,4847.9897392603598,2296.6090423631099,3.7515337999040002,127.26140839560915,856.54911038224259,9,4629.5833333334003,4629.5833333334003,3.0902348578491901,3.0902348578491901,2,31160,31160,5.0679851668726803,5.0679851668726803]
[null,"ZN10999:PA7","KOGARAH","URBAN",1009,2676.61194752242,2361.2303484236299,3.0780059860639999,485.75704518293099,1411.4027999093655,4,21537.916666666599,21537.916666666599,17.244796828543098,17.244796828543098,1,62580,62580,14.7670961347869,14.7670961347869]
[null,"ZN10999:PA9","KOGARAH","URBAN",111,0,1083.59644447389,2.6531932228312001,0,5.3462286490151989,0,0,0,0,0,1,275,275,0.90090090090090102,0.90090090090090102]
[null,"ZN116:PA73","LEICHHARDT","URBAN",1527,0,8335.1358918196493,3.2950257435191999,515.46267431931301,0,3,21349.733333333399,21349.733333333399,4.9770792403405402,4.9770792403405402,0,0,0,0,0]
[null,"ZN116:PA74","LEICHHARDT","URBAN",1894,616.09315215869901,6966.2529827567896,4.5764246439368002,717.97092332436978,932.21710462284432,2,21410.883333333299,21410.883333333299,8.2365364308342102,8.2365364308342102,2,27800,27800,5.9134107708553296,5.9134107708553296]
[null,"ZN116:PA76","LEICHHARDT","URBAN",1432,0,3700.1850628197299,2.5627978008351997,2153.3085280536493,2.8167711077469293,16,114668.98333333329,1199.9833333332999,16.13128491620111,0.209497206703911,1,150,150,6.9832402234636895E-2,6.9832402234636895E-2]
[null,"ZN116:PA81","LEICHHARDT","URBAN",615,0,845.31177849378696,3.0204402651328,351.18697378047756,0,1,15868,15868,24.065040650406498,24.065040650406498,0,0,0,0,0]
[null,"ZN116:PA83","LEICHHARDT","URBAN",1155,0,3430.9952711177798,2.2882123214879999,1598.3658663900603,0,7,95330.949999999895,95330.949999999895,23.3766233766234,23.3766233766234,0,0,0,0,0]
[null,"ZN116:PA84","LEICHHARDT","URBAN",2139,0,0,3.7237245776479999,609.91597816963656,0,4,22353.55,22353.55,102.244039270687,102.244039270687,0,0,0,0,0]
[null,"ZN116:PA85","LEICHHARDT","URBAN",79,193.55901777491101,9762.5855137695908,4.2103106721144004,0,1.8510210133605496,0,0,0,0,0,1,60,60,1.26582278481013,1.26582278481013]
[null,"ZN116:PA87","LEICHHARDT","URBAN",1351,0,4815.2583936473302,2.6543262933103997,65.617811888761665,0,3,3373.8166666667003,1980,0.59215396002960796,0.44411547002220603,0,0,0,0,0]
[null,"ZN1193:PA10","LINDFIELD","URBAN",554,280.214708677244,5264.3286513141202,3.8537171003128003,167.95459034651151,0,5,5947.9333333333998,5947.9333333333998,7.9422382671480092,7.9422382671480092,0,0,0,0,0]
[null,"ZN1193:PA11","LINDFIELD","URBAN",374,0,2037.95763500573,1.1176252416055998,38.546624731412571,0,3,4707,4707,17.9144385026738,17.9144385026738,0,0,0,0,0]
[null,"ZN1193:PA12","LINDFIELD","URBAN",1304,6973.6222303260201,2722.07527300016,3.7711448895111999,2834.1917312042178,158.61018317790666,7,102567.566666667,102567.566666667,103.067484662577,103.067484662577,1,5740,5740,1.0736196319018401,1.0736196319018401]
[null,"ZN1193:PA15","LINDFIELD","URBAN",1017,331.83773641919697,7207.5222887273103,4.1795560963208001,3017.7360652484867,1289.9250501532451,9,98538.316666666593,98538.316666666593,72.468043264503407,72.468043264503407,1,42120,42120,10.6194690265487,10.6194690265487]
[null,"ZN1193:PA16","LINDFIELD","URBAN",882,4438.2733899370096,3099.8663780615502,3.0804446386623998,3247.3218219419159,0,3,143868.58333333299,143868.58333333299,103.628117913832,103.628117913832,0,0,0,0,0]
[null,"ZN1193:PA17","LINDFIELD","URBAN",388,1270.7777138031599,1946.06454031314,2.3530682680688,254.07248767234023,0,2,14735.916666666701,14735.916666666701,17.268041237113398,17.268041237113398,0,0,0,0,0]
[null,"ZN1193:PA21","LINDFIELD","URBAN",842,2750.3677834613,1847.9917573175601,2.2447362877063997,1243.2930951018859,30.264193568705466,5,75589.633333333302,75589.633333333302,113.77672209026099,113.77672209026099,1,1840,1840,0.95011876484560587,0.95011876484560587]
[null,"ZN1193:PA25","LINDFIELD","URBAN",605,919.63932926743405,2656.0397363074799,1.54281723452,504.63042931258627,0,2,44638.85,44638.85,28.264462809917301,28.264462809917301,0,0,0,0,0]
[null,"ZN1193:PA26","LINDFIELD","URBAN",1525,626.38095466632797,6830.8209193762405,3.4284521211872003,2978.2920168678006,902.10990166290651,3,118555.91666666701,118555.91666666701,97.114754098360606,97.114754098360606,1,35910,35910,4.1311475409836103,4.1311475409836103]
[null,"ZN1193:PA27","LINDFIELD","URBAN",1101,4925.9447761442698,1997.05451421469,5.4717004292496005,894.5216840026377,0,5,22311.1833333334,22311.1833333334,9.8092643051771091,9.8092643051771091,0,0,0,0,0]
[null,"ZN1193:PA28","LINDFIELD","URBAN",2651,6374.0306642417399,7858.2541716085298,6.3621392331808,2233.0481473616114,1550.0323942600307,10,47901.483333333301,47901.483333333301,8.977744247453801,8.977744247453801,2,33250,33250,3.7721614485100003,3.7721614485100003]
[null,"ZN12570:PA21","AVOCA","URBAN",2241,3723.1246901620498,12587.2882933856,6.5351343909767996,35379.436197225237,4801.9187127954783,8,738840.05,738840.05,441.09772423025396,441.09772423025396,6,100280,100280,9.9509147701918792,9.9509147701918792]
[null,"ZN12570:PA22","AVOCA","SHORT RURAL",1623,9933.3811429641701,6026.4658457100704,3.9906422897896001,13845.010343031008,1293.8064588880213,13,473483.15,473423.15,530.19100431300035,530.12939001848395,4,44246.666666666701,44246.666666666701,6.9008009858287203,6.9008009858287203]
[null,"ZN12570:PA24","AVOCA","SHORT RURAL",1774,12543.0247128512,3894.7922112136798,3.3682485382679999,14229.05027099568,538.86923750175129,18,576535.19999999995,576535.19999999995,449.49267192784703,449.49267192784703,5,21834,21834,3.2694475760992106,3.2694475760992106]
[null,"ZN12570:PA25","AVOCA","SHORT RURAL",1055,3775.6592606331301,3227.8108118917198,2.1417667329511998,1930.5393870001005,416.19000292842844,5,123015.7,123015.7,207.10900473933597,207.10900473933597,1,26520,26520,6.4454976303317491,6.4454976303317491]
[null,"ZN12570:PA26","AVOCA","URBAN",1167,2235.8644503845799,8415.1958918543696,4.0089479875159997,21656.890807051095,43.474850058589524,11,737258.4,220455.4,388.08911739503048,291.77377892030898,2,1480,1480,0.34275921165381301,0.34275921165381301]
[null,"ZN12570:PA29","AVOCA","SHORT RURAL",778,2355.83047415479,4725.9929233352204,1.8305698571903999,1105.6287114311458,0,3,82428.433333333305,82428.433333333305,189.84575835475599,189.84575835475599,0,0,0,0,0]
[null,"ZN12570:PA33","AVOCA","SHORT RURAL",1593,15379.118414995801,4049.43048695882,2.7275490880591997,28271.292635392347,3860.4703793949134,24,1414578.7666666671,761122.76666666695,535.34212178279927,486.88010043942194,9,193162,193162,29.190207156308801,29.190207156308801]
[null,"ZN12570:PA34","AVOCA","SHORT RURAL",851,5323.7270158247502,3339.1223967075798,1.7390413647151999,1715.553951220691,283.64885052772831,6,134632.066666667,134632.066666667,309.63572267920097,309.63572267920097,1,22260,22260,6.2279670975323098,6.2279670975323098]
[null,"ZN12570:PA35","AVOCA","URBAN",1057,3889.2320614887399,5460.10074856544,3.5513055232183999,5613.6531588730759,1240.2935305530143,8,215730.51666666701,215730.51666666701,401.13528855250695,401.13528855250695,2,47664,47664,10.5014191106906,10.5014191106906]
[null,"ZN12570:PA37","AVOCA","SHORT RURAL",1521,9973.6809725916191,5525.6256845255202,4.4482847540871999,10164.378438428619,847.18495499206222,13,311847.51666666701,311847.51666666701,334.84549638395799,334.84549638395799,7,25992,25992,5.4569362261670005,5.4569362261670005]
[null,"ZN12570:PA39","AVOCA","URBAN",1443,4410.0209714890298,4831.9898209092298,3.7343625091295998,4369.6557310101043,2379.6162793222334,5,159692.6,159692.6,198.821898821899,198.821898821899,3,86965,86965,15.5925155925156,15.5925155925156]
[null,"ZN12570:PA40","AVOCA","SHORT RURAL",1172,6818.3207812104401,5333.4969730558196,3.111968757608,3771.2833351466752,223.46384117516521,7,165389.51666666701,165389.51666666701,209.47098976109203,209.47098976109203,1,9800,9800,2.98634812286689,2.98634812286689]
[null,"ZN12570:PA41","AVOCA","URBAN",812,3071.7568892633799,3516.5722199269298,1.8305698571903999,1198.8982622720241,1245.4957042976334,2,89382,89382,198.27586206896598,198.27586206896598,2,92856,92856,27.955665024630498,27.955665024630498]
[null,"ZN12580:PA1","ERINA","URBAN",1199,4041.5171243888699,4462.9266448839498,6.0225748315783996,8845.0496791992609,2180.8756407968658,11,200434.33333333401,200434.33333333401,199.91659716430402,199.91659716430402,2,49420,49420,11.4261884904087,11.4261884904087]
[null,"ZN12580:PA10","ERINA","URBAN",1614,1834.57408667971,7377.5827245459104,3.4597770307431999,19688.523594770169,1184.1424058541947,8,776638.8,776638.8,598.69888475836399,598.69888475836399,8,46710,46710,10.4089219330855,10.4089219330855]
[null,"ZN12580:PA12","ERINA","SHORT RURAL",347,3889.4855541888801,2188.30050672175,1.39123309158,483.61865662554652,38.43148845792755,7,47441.366666666705,44781.983333333403,111.81556195965435,111.52737752161399,1,3770,3770,3.7463976945245001,3.7463976945245001]
[null,"ZN12580:PA13","ERINA","URBAN",92,0,2935.0364152944499,2.9838288677583997,138.78955558779751,0,1,6348,6348,100,100,0,0,0,0,0]
[null,"ZN12580:PA14","ERINA","URBAN",1710,4697.2372727008296,4525.7502079554397,4.0455593848903995,6435.8492655150285,1507.6512500836293,5,217110.75,215011.75,154.2105263157892,153.80116959064301,4,50860,50860,3.2163742690058497,3.2163742690058497]
[null,"ZN12580:PA16","ERINA","URBAN",1323,8187.39481594263,5047.9798680312097,5.7113779558175999,5567.7943243369355,615.81054745756614,14,133044.316666667,133044.316666667,179.818594104308,179.818594104308,1,14715,14715,2.0408163265306101,2.0408163265306101]
[null,"ZN12580:PA2","ERINA","URBAN",383,0,3559.8671485974201,5.4001810800567993,3465.0509780187417,8.3094747674310359,3,87570,87570,249.608355091384,249.608355091384,1,210,210,0.52219321148825104,0.52219321148825104]
[null,"ZN12580:PA4","ERINA","URBAN",2264,10761.287436672201,4763.2270256943502,4.2103106721144004,31761.334327781242,6481.9670852864183,21,1029529.1333333331,426451.13333333301,347.12897526501729,254.240282685512,6,210110,210110,20.759717314487599,20.759717314487599]
[null,"ZN12580:PA7","ERINA","URBAN",170,783.35809061146904,4709.1276721655604,4.6496474377248003,1333.2764861497149,44.971762705514983,3,39134,39134,304.70588235294099,304.70588235294099,1,1320,1320,2.3529411764705901,2.3529411764705901]
[null,"ZN12580:PA8","ERINA","URBAN",310,1.34516028997961,2715.3355064764601,3.6428340166543998,2093.6047080315752,762.33093254892651,7,78434.899999999994,78434.899999999994,496.12903225806502,496.12903225806502,2,28560,28560,29.677419354838701,29.677419354838701]
[null,"ZN12600:PA1","LISAROW","SHORT RURAL",620,4694.8743762481599,3769.6320981020499,2.6909376906847999,536.9264299468299,2613.4424851475915,2,27231.1,27231.1,99.516129032258007,99.516129032258007,9,132545,132545,58.064516129032299,58.064516129032299]
[null,"ZN12600:PA11","LISAROW","URBAN",919,4745.8326855354799,2734.3573746371799,4.8693158210104004,11514.579397057565,2822.3239021898657,13,322726.16666666698,322726.16666666698,220.89227421109899,220.89227421109899,7,79103,79103,30.359085963003302,30.359085963003302]
[null,"ZN12600:PA12","LISAROW","URBAN",281,847.38287724877102,3591.1900409292102,3.1302744562951998,300.58712128829637,2.0642908258163142,3,13105.15,13105.15,104.982206405694,104.982206405694,1,90,90,0.35587188612099596,0.35587188612099596]
[null,"ZN12600:PA13","LISAROW","SHORT RURAL",861,13556.6363086742,4405.4201621785196,4.9791500121727994,32585.256526472502,55902.809025152426,7,893140.9,120117.9,315.09872241579569,215.91173054587699,7,1532260,1532260,19.047619047618998,19.047619047618998]
[null,"ZN12600:PA2","LISAROW","SHORT RURAL",785,27188.625922542102,3370.28119654083,5.1439012993968003,4405.2693619418942,4966.8174563508919,15,116878.3000000001,94540.300000000105,166.36942675159241,164.20382165605102,21,131777,131777,43.439490445859903,43.439490445859903]
[null,"ZN12600:PA3","LISAROW","URBAN",1725,6657.7472887273198,4162.7099762075504,4.4116733567128001,15898.856725881897,2842.4077485031644,15,491831.78333333298,491831.78333333298,401.21739130434798,401.21739130434798,6,87930,87930,15.304347826087,15.304347826087]
[null,"ZN12600:PA5","LISAROW","URBAN",82,1248.8082860173799,1911.0393514452401,3.0570516625071997,77.145727101051136,0,1,3444,3444,100,100,0,0,0,0,0]
[null,"ZN12600:PA9","LISAROW","SHORT RURAL",1505,10558.2884890696,2310.0352674040601,3.7160568104423999,11186.398630592887,3046.6290187459313,9,410829.85,410829.85,348.90365448504997,348.90365448504997,7,111890,111890,37.408637873754103,37.408637873754103]
[null,"ZN12610:PA10","LONG JETTY","URBAN",1968,6289.4625152312401,8250.4236359419101,4.7353770967424005,6668.8809839005698,2039.1830649502997,15,192199.58333333299,192199.58333333299,104.319105691057,104.319105691057,3,58770,58770,5.8943089430894293,5.8943089430894293]
[null,"ZN12610:PA11","LONG JETTY","URBAN",1523,8126.4037875898503,1117.11352221995,2.8207973846712,1823.9887083865688,0,15,88247.883333333302,84123.899999999907,74.195666447800363,73.933026920551498,0,0,0,0,0]
[null,"ZN12610:PA13","LONG JETTY","URBAN",2109,3897.4023818463902,5414.79308326505,2.8650523985823999,83.797134045766612,1354.6278470561988,10,3991.6333333334001,3991.6333333334001,0.47415836889521101,0.47415836889521101,1,64527,64527,6.4959696538643907,6.4959696538643907]
[null,"ZN12610:PA16","LONG JETTY","SHORT RURAL",1388,4323.7764213954897,416.77673045957602,2.1234610342639999,4639.332850607384,0,14,298170.91666666698,298170.91666666698,277.08933717579299,277.08933717579299,0,0,0,0,0]
[null,"ZN12610:PA17","LONG JETTY","URBAN",1063,3789.5778321144799,1468.3248825001201,2.9778981606575998,1862.6473511667314,0,3,85364.016666666605,85364.016666666605,99.435559736594499,99.435559736594499,0,0,0,0,0]
[null,"ZN12610:PA18","LONG JETTY","URBAN",1180,6074.1782278180099,4501.5450365922397,2.3431294175496,3826.0617938610249,563.05376587880403,8,222848.51666666701,222848.51666666701,147.203389830508,147.203389830508,4,32795,32795,6.1864406779661003,6.1864406779661003]
[null,"ZN12610:PA2","LONG JETTY","URBAN",1579,6132.1561024112498,1901.7043561138901,3.4816989375480003,2355.7718798116207,617.37997192778312,6,92341.316666666709,92263.266666666706,80.55731475617479,80.493983533882201,1,24200,24200,3.4832172260924601,3.4832172260924601]
[null,"ZN12610:PA20","LONG JETTY","SHORT RURAL",914,9197.9782640625308,4496.9089082853598,2.1051553365375999,284.15537755086075,806.27390325362569,7,18421.533333333398,9925.5333333334002,25.492341356673947,24.835886214441999,2,52270,52270,10.8315098468271,10.8315098468271]
[null,"ZN12610:PA22","LONG JETTY","URBAN",1241,4809.26654674977,494.46727269023899,2.9778981606575998,642.47872642844015,0,6,29444.416666666599,29444.416666666599,108.29975825946801,108.29975825946801,0,0,0,0,0]
[null,"ZN12610:PA23","LONG JETTY","URBAN",1023,3838.7722922473499,2606.8998597735899,2.4163522122984,1242.0911673679539,635.71304737034575,12,70153.166666666599,34694.366666666603,12.023460410557179,9.775171065493641,2,35905,35905,8.4066471163245389,8.4066471163245389]
[null,"ZN12610:PA24","LONG JETTY","URBAN",1292,6215.3218977151801,2782.3830023514001,2.3431294175496,36.982362560202596,475.32073512287519,4,2154.0333333334002,2154.0333333334002,0.30959752321981399,0.30959752321981399,1,27685,27685,8.7461300309597512,8.7461300309597512]
[null,"ZN12610:PA25","LONG JETTY","URBAN",1316,8155.5736227970201,3742.8787166625698,3.4816989375480003,0,2326.1448694369947,0,0,0,0,0,1,91180,91180,14.285714285714299,14.285714285714299]
[null,"ZN12610:PA5","LONG JETTY","URBAN",214,2474.6400542817801,1027.8181186720301,2.5078807047736,7.3504312706788699,0,1,400,400,1.86915887850467,1.86915887850467,0,0,0,0,0]
[null,"ZN12610:PA6","LONG JETTY","URBAN",1777,4982.4764676109198,760.54908761527599,5.3247289353032006,14193.066240528193,1453.7385610280667,13,363774.933333333,358314.933333333,338.88576252110317,337.42262239729899,1,37260,37260,3.8829487900956701,3.8829487900956701]
[null,"ZN12610:PA7","LONG JETTY","URBAN",831,3726.6448246013001,190.95767441867901,1.6166159933191999,467.04731428967369,0,2,39428.299999999996,37201.199999999997,8.7845968712394669,8.6642599277978292,0,0,0,0,0]
[null,"ZN12610:PA9","LONG JETTY","URBAN",1413,468.10381269380201,7466.9575985397296,2.9895500791448,2053.572754985908,1909.4963588472149,3,93747.199999999997,5472.2,6.51096956829441,2.2646850672328402,6,87170,87170,14.6496815286624,14.6496815286624]
[null,"ZN12620:PA1","NORAVILLE","SHORT RURAL",2700,17028.3326313301,13288.8489228992,5.3113973135887997,10849.675483556057,662.58540591574138,10,278780.25,278780.25,137.40740740740699,137.40740740740699,3,17025,17025,6.92592592592593,6.92592592592593]
[null,"ZN12620:PA10","NORAVILLE","SHORT RURAL",1103,5693.03493238389,5299.8371015033099,2.4130247899152,1673.6203883466849,0,9,94656.233333333206,92153.399999999907,100.27198549410699,100.181323662738,0,0,0,0,0]
[null,"ZN12620:PA11","NORAVILLE","SHORT RURAL",1643,15950.7198022549,3704.4592354320798,3.5679516320656002,6160.8454397348632,2670.9579661162356,7,235654.316666667,235654.316666667,136.457699330493,136.457699330493,3,102165,102165,14.9117468046257,14.9117468046257]
[null,"ZN12620:PA13","NORAVILLE","SHORT RURAL",410,1238.6625674178099,4086.4798843291701,0.82704759022480001,159.14801328751489,105.44493042317163,3,26261.816666666698,26261.816666666698,42.9268292682927,42.9268292682927,2,17400,17400,84.878048780487802,84.878048780487802]
[null,"ZN12620:PA2","NORAVILLE","SHORT RURAL",515,5542.8266330342503,417.40988910053898,0.85777692484160006,227.83159407252239,135.57214264042693,4,36248.800000000003,36248.800000000003,34.174757281553397,34.174757281553397,4,21570,21570,23.300970873786401,23.300970873786401]
[null,"ZN12620:PA3","NORAVILLE","URBAN",1074,4347.6728668772903,718.62150471225902,1.9402004365776,13.835967360852925,0,5,973.23333333330004,973.23333333330004,0.46554934823091304,0.46554934823091304,0,0,0,0,0]
[null,"ZN12620:PA7","NORAVILLE","URBAN",2168,6099.1905816212802,3399.24437924017,4.3011760338808003,358.42110444331581,999.69231058890978,12,11372.6166666667,11372.6166666667,3.5977859778597798,3.5977859778597798,3,31720,31720,5.8118081180811902,5.8118081180811902]
[null,"ZN12620:PA8","NORAVILLE","SHORT RURAL",1259,7529.1021204245999,4447.8938332307698,2.8657967562839999,355.57466362689462,164.20943074779015,3,16933.216666666602,16806.233333333301,6.8308181096107941,6.75138999205718,2,7820,7820,1.1119936457505899,1.1119936457505899]
[null,"ZN12630:PA1","PEATS RIDGE","SHORT RURAL",578,73048.609254303898,1330.2013619004999,1.3121743822584,13662.9042163009,3535.0319481258684,20,1421037.416666667,379040.41666666698,834.42906574394499,638.58131487889307,21,367668,367668,181.31487889273401,181.31487889273401]
[null,"ZN12630:PA10","PEATS RIDGE","SHORT RURAL",323,32676.224432485102,90.025380207818898,2.9147460900711999,1908.3869335132113,814.82434002499917,14,89355.183333333203,41995.183333333203,504.33436532507761,405.26315789473699,7,38152,38152,25.077399380804998,25.077399380804998]
[null,"ZN12630:PA11","PEATS RIDGE","SHORT RURAL",240,27803.613707608602,37.8157135914268,0.662562957668,882.72646324350819,106.99537186311237,14,181824.76666666701,146600.76666666701,806.24999999999966,707.08333333333303,6,22039,22039,20.4166666666667,20.4166666666667]
[null,"ZN12630:PA13","PEATS RIDGE","SHORT RURAL",95,15868.7741603267,130.01158196659,1.5555352,457.35808180843071,134.55250584814488,9,40126.433333333305,17108,567.36842105263202,462.10526315789497,5,11805,11805,27.368421052631597,27.368421052631597]
[null,"ZN12630:PA3","PEATS RIDGE","SHORT RURAL",422,56193.301742976597,621.08480855384403,2.5624536,7212.8924172842517,1986.0638723084596,22,384155.88333333301,322735.88333333301,871.8009478672991,773.45971563981107,18,105777,105777,70.142180094786696,70.142180094786696]
[null,"ZN12630:PA6","PEATS RIDGE","SHORT RURAL",7,1575.2853845453201,5923.8264909167801,0.36606480000000002,6.4213755762547002,5.1633867937720535,6,2394,1358,600,500,1,1925,1925,100,100]
[null,"ZN12630:PA8","PEATS RIDGE","SHORT RURAL",379,54313.577508789698,12967.7300465068,3.2945831999999999,7059.8510185609284,4819.3630725275771,25,292448.3,237392.3,762.00527704485455,663.85224274406301,13,199638,199638,123.482849604222,123.482849604222]
[null,"ZN12640:PA1","UMINA","SHORT RURAL",642,5785.1088721084197,2256.1702734895298,1.0251191197576,1368.9262203890919,512.23921489274517,5,182246.73333333328,99436.733333333294,213.39563862928301,114.17445482866,6,68195,68195,31.931464174454799,31.931464174454799]
[null,"ZN12640:PA15","UMINA","URBAN",1092,2351.1711862719999,1098.9239685668599,2.2332952263871997,2860.281922994197,0,9,174790.06666666659,36340.0666666666,127.1062271062271,29.578754578754602,0,0,0,0,0]
[null,"ZN12640:PA16","UMINA","URBAN",807,2262.1278588882601,1187.7489335032201,1.9037926519391999,1480.4569616288102,475.40657962065592,8,106128.0499999998,1868.0499999998001,100.24783147459726,0.8674101610904581,1,34080,34080,8.7980173482032207,8.7980173482032207]
[null,"ZN12640:PA18","UMINA","SHORT RURAL",950,8014.4763560863803,651.88007397852198,2.1966838290127999,6526.0817450334789,0,6,405451.58333333331,14948.583333333299,106.21052631578949,6.5263157894736796,0,0,0,0,0]
[null,"ZN12640:PA19","UMINA","URBAN",1803,4405.5141229278097,3814.1444491134198,3.9174194950407997,6876.9347659241639,3749.0606432115464,4,239579.06666666659,6359.0666666666002,103.60510260676649,4.1042706600110899,4,130610,130610,26.622296173044901,26.622296173044901]
[null,"ZN12640:PA2","UMINA","URBAN",2025,5363.9141436600403,1584.6875239860401,3.8991137963536002,7459.8087258473088,0,6,261105.3833333333,1020.3833333333,99.061728395061706,0.24691358024691301,0,0,0,0,0]
[null,"ZN12640:PA4","UMINA","URBAN",1682,0,0,4.2102255999999993,7020.0605001629747,1503.7390865964323,8,227556.65,9616.65,110.10701545778829,10.4042806183115,2,48744,48744,6.2425683709869197,6.2425683709869197]
[null,"ZN12640:PA6","UMINA","URBAN",1272,3251.5212276174202,2110.7900992426999,3.0387459638199998,4235.70989573524,0,3,190233,27733,107.54716981132073,9.2767295597484303,0,0,0,0,0]
[null,"ZN12640:PA7","UMINA","URBAN",1677,3226.5786782268401,2147.8882118790102,3.441471332056,5711.9411366517452,0,11,226513.25,10713.25,103.63744782349438,4.65116279069768,0,0,0,0,0]
[null,"ZN12640:PA8","UMINA","URBAN",915,1995.9469962973101,6023.2255715555702,2.1600724316384001,2146.6868575714311,0,9,135629.5833333334,17199.583333333401,117.0491803278688,17.486338797814199,0,0,0,0,0]
[null,"ZN12650:PA1","WEST GOSFORD","SHORT RURAL",1725,52355.209214771501,2419.5646722736801,3.441471332056,13292.652423165029,10363.200286442176,39,527134.61666666728,523446.83333333401,151.82608695652226,151.65217391304401,23,410964,410964,51.942028985507207,51.942028985507207]
[null,"ZN12650:PA10","WEST GOSFORD","URBAN",700,601.99599883324902,3863.9474034686,1.9953211444144001,1010.0343207118356,153.51402533207911,9,69083.983333333395,68808.983333333395,11.000000000000043,10.8571428571429,1,10500,10500,4,4]
[null,"ZN12650:PA12","WEST GOSFORD","URBAN",2033,11584.4811064934,3418.8518629308301,5.4184867777832002,2524.9769415362139,739.66799690580126,6,63596.533333333296,63596.533333333296,57.599606492867707,57.599606492867707,2,18630,18630,6.6404328578455507,6.6404328578455507]
[null,"ZN12650:PA13","WEST GOSFORD","SHORT RURAL",1824,11553.570994538,5575.1361739824397,5.2903468879336,20222.134487054002,3142.6084823387851,12,521671.23333333299,521671.23333333299,305.427631578947,305.427631578947,8,81070,81070,13.0482456140351,13.0482456140351]
[null,"ZN12650:PA14","WEST GOSFORD","URBAN",697,2725.0576042582002,5627.4531230099001,3.6611397153415997,2300.1484601084071,2646.5576535652876,1,85742,85742,95.98278335724531,95.98278335724531,6,98655,98655,32.998565279770496,32.998565279770496]
[null,"ZN12650:PA16","WEST GOSFORD","URBAN",143,0,973.93963806940201,1.9953211444144001,11.716044209510626,59.651164129036452,2,801.35,801.35,1.3986013986014001,1.3986013986014001,1,4080,4080,16.783216783216801,16.783216783216801]
[null,"ZN12650:PA17","WEST GOSFORD","URBAN",2226,7775.7108877403798,5650.9548314366702,6.0225748315783996,25052.587541093675,1491.1328996868899,13,567707.2333333334,564873.80000000005,200.35938903863433,200.31446540880501,2,33790,33790,2.1563342318059302,2.1563342318059302]
[null,"ZN12650:PA19","WEST GOSFORD","URBAN",298,167.74870063997301,3637.79442501209,1.5193729814296,0,7.1250895807074155,0,0,0,0,0,1,640,640,2.6845637583892601,2.6845637583892601]
[null,"ZN12650:PA2","WEST GOSFORD","URBAN",387,3835.25925228808,1247.3853516505801,2.6360205946231998,39.833650289430999,12.168451183059021,5,2062.3166666666002,2062.3166666666002,1.29198966408269,1.29198966408269,1,630,630,0.258397932816537,0.258397932816537]
[null,"ZN12650:PA20","WEST GOSFORD","URBAN",1538,3700.0774161296299,4626.6321791057899,3.3682485382679999,1324.4581865505352,3507.8082223194983,2,53664.633333333302,53664.633333333302,99.609882964889493,99.609882964889493,1,142130,142130,15.149544863458999,15.149544863458999]
[null,"ZN12650:PA3","WEST GOSFORD","URBAN",1258,1520.2258802598301,5350.3766465272702,3.8441967002920001,3514.2881362799581,73.94024155987664,2,124763,124763,106.51828298887101,106.51828298887101,1,2625,2625,0.556438791732909,0.556438791732909]
[null,"ZN12650:PA5","WEST GOSFORD","URBAN",116,0,2881.58996670647,2.9289117716968001,120.69730061909972,40.239587244098857,1,5624,5624,98.275862068965509,98.275862068965509,1,1875,1875,4.31034482758621,4.31034482758621]
[null,"ZN12650:PA6","WEST GOSFORD","URBAN",1282,8583.8766750838204,5442.4455320954403,3.9723365911023998,8022.1892463329677,0,6,275613.76666666701,275613.76666666701,99.609984399375989,99.609984399375989,0,0,0,0,0]
[null,"ZN12650:PA8","WEST GOSFORD","URBAN",186,412.08513675528201,2678.38253617079,1.2997045991048,19.475289572565156,0,2,2045,2045,5.3763440860214997,5.3763440860214997,0,0,0,0,0]
[null,"ZN12650:PA9","WEST GOSFORD","URBAN",1147,3245.0324266757698,6955.9198787525102,4.3933676580255998,396.19468382608159,42.493004134414853,5,12307.3666666667,12307.3666666667,11.682650392327799,11.682650392327799,2,1320,1320,0.34873583260680002,0.34873583260680002]
[null,"ZN12660:PA10","WOY WOY","URBAN",1776,11458.721004123299,2878.331362204,4.3201448632768003,26620.074556910295,2570.2392518915149,16,840939.98333333398,690829.98333333398,319.9887387387389,220.55180180180201,2,81195,81195,12.556306306306301,12.556306306306301]
[null,"ZN12660:PA11","WOY WOY","URBAN",719,2918.4705858821899,1373.8255338839101,2.0868496378504,2413.5645014526144,0,7,157841.71666666662,97236.716666666602,145.201668984701,46.036161335187799,0,0,0,0,0]
[null,"ZN12660:PA13","WOY WOY","URBAN",647,792.97969397405996,1089.86531170851,2.8923003752831997,1105.313054577053,762.94257434136512,2,52155,90,94.744976816074171,0.15455950540958299,2,36000,36000,7.7279752704791402,7.7279752704791402]
[null,"ZN12660:PA14","WOY WOY","SHORT RURAL",1252,14746.5791449471,5175.3788066789402,3.2584143461448001,4876.8940148236106,5042.8612892634492,15,204263.63333333319,98693.6333333332,204.39297124600665,105.19169329073502,5,211215,211215,36.341853035143799,36.341853035143799]
[null,"ZN12660:PA16","WOY WOY","URBAN",264,1464.53635005775,3701.10367825397,0.78714503874559993,133.65719743416193,0,2,23173.5,1158.5,98.48484848484847,0.37878787878787901,0,0,0,0,0]
[null,"ZN12660:PA17","WOY WOY","URBAN",1269,3560.3289129315799,1167.96037366617,2.8739946765959998,2359.3070783330199,0,3,112034.7,4924.7,106.38297872340424,7.2498029944838391,0,0,0,0,0]
[null,"ZN12660:PA5","WOY WOY","SHORT RURAL",280,916.89263462114195,5238.5175321381903,0.54917095677279992,119.82349789037775,0,4,29777.516666666601,6062.5166666666,108.92857142857149,9.2857142857142811,0,0,0,0,0]
[null,"ZN12660:PA6","WOY WOY","SHORT RURAL",495,2481.64566527941,3721.8408781847902,1.3363159955184001,1937.3780329457945,0,7,197860.566666667,156125.566666667,298.5858585858582,199.39393939393898,0,0,0,0,0]
[null,"ZN12660:PA8","WOY WOY","URBAN",1338,3596.4187133863802,1420.9016137732799,3.1302744562951998,3159.672347688645,5.1607270645407857,2,137757,25387,102.76532137518679,3.9611360239162905,1,225,225,7.4738415545590409E-2,7.4738415545590409E-2]
[null,"ZN12690:PA1","BERKELEY VALE","URBAN",4,437.09593450761503,2624.1827824822199,3.7526682078167997,0,36.296107697371617,0,0,0,0,0,1,1320,1320,50,50]
[null,"ZN12690:PA10","BERKELEY VALE","URBAN",708,4314.7950094351399,1242.2554927219701,2.0013634359447998,6.2564316046762309,15.397890112295528,2,426.6333333334,199.01666666669999,0.28248587570621397,0.14124293785310699,2,1050,1050,0.28248587570621497,0.28248587570621497]
[null,"ZN12690:PA11","BERKELEY VALE","URBAN",13,0,4978.4240451485302,3.9256764670816002,0,106.14189241225063,0,0,0,0,0,4,3690,3690,84.615384615384599,84.615384615384599]
[null,"ZN12690:PA12","BERKELEY VALE","SHORT RURAL",1051,15706.386082335899,2480.9733257568901,3.4865003462703998,7.251870940014582,967.32771187278036,1,283.86666666669998,283.86666666669998,9.5147478591817297E-2,9.5147478591817297E-2,4,37865,37865,8.3729781160799188,8.3729781160799188]
[null,"ZN12690:PA14","BERKELEY VALE","URBAN",239,0,5997.0925733889699,1.0873585235415999,0,283.95950748739517,0,0,0,0,0,1,35640,35640,13.807531380753099,13.807531380753099]
[null,"ZN12690:PA16","BERKELEY VALE","SHORT RURAL",375,13181.9540031699,5278.5969713335098,3.5512940089912002,780.17924266870023,1682.1608619253614,20,29982.083333333401,21885.333333333401,38.39999999999997,37.3333333333333,6,64645,64645,44.533333333333303,44.533333333333303]
[null,"ZN12690:PA19","BERKELEY VALE","URBAN",1217,4358.1801643966801,5672.1528532519897,3.3065687130511998,19056.046725505563,430.29516807693591,13,786519.15,165862.183333333,306.65571076417399,204.108463434675,2,17760,17760,3.1224322103533297,3.1224322103533297]
[null,"ZN12690:PA22","BERKELEY VALE","URBAN",336,0,6703.3225788867603,4.6529018172096004,0,848.58380817641375,0,0,0,0,0,3,24890,24890,15.1785714285714,15.1785714285714]
[null,"ZN12690:PA24","BERKELEY VALE","SHORT RURAL",791,29986.5809473138,3789.1265178444201,2.4872887671135997,15050.883863162582,2066.7370203613559,20,825828.45,246931.45,329.5828065739567,230.21491782553701,8,113400,113400,12.6422250316056,12.6422250316056]
[null,"ZN12690:PA26","BERKELEY VALE","URBAN",308,8394.3455992159597,2981.2547852019902,5.1072899020224005,6152.5966339065235,808.33282857941663,3,164407.6333333333,52175.633333333302,115.25974025974031,19.1558441558442,1,21600,21600,12.987012987012999,12.987012987012999]
[null,"ZN12690:PA3","BERKELEY VALE","SHORT RURAL",737,2306.5840423980999,5597.0157697321101,1.9770154457271998,56.863848396592267,1759.0655083087288,4,3925.3666666667,3925.3666666667,0.54274084124830402,0.54274084124830402,2,121430,121430,42.605156037991897,42.605156037991897]
[null,"ZN12690:PA4","BERKELEY VALE","URBAN",16,0,4820.6038717516703,2.8966578233063998,0,413.33132213557502,0,0,0,0,0,6,19474,19474,131.25,131.25]
[null,"ZN12690:PA6","BERKELEY VALE","URBAN",969,7152.73650710129,1420.84930671401,2.8937708402903999,14545.494438638061,0,8,685990.96666666667,18841.766666666699,146.749226006192,46.749226006192004,0,0,0,0,0]
[null,"ZN12690:PA7","BERKELEY VALE","SHORT RURAL",862,7299.6601023529602,8642.3768050299404,4.0542741915824001,7667.3063201677287,1491.7973680738532,13,258097.46666666699,258097.46666666699,328.77030162413001,328.77030162413001,3,50217,50217,34.222737819025504,34.222737819025504]
[null,"ZN12690:PA8","BERKELEY VALE","SHORT RURAL",962,5501.6366515434302,1458.4374075686301,2.9393806196728001,86.43451010571215,0,10,4013.1500000001001,1114.6166666667,1.0395010395010391,0.72765072765072702,0,0,0,0,0]
[null,"ZN1285:PA10","GREENACRE PARK","URBAN",889,0,5260.1283797871101,4.3018391655504002,3098.3534765501099,443.65821595067479,4,98294.866666666698,98294.866666666698,97.975253093363307,97.975253093363307,2,14075,14075,3.1496062992125999,3.1496062992125999]
[null,"ZN1285:PA17","GREENACRE PARK","URBAN",1576,0,5486.6541701231199,5.2171240941455999,1165.7031180296378,2048.0440925907064,7,30493.75,30493.75,13.705583756345199,13.705583756345199,3,53575,53575,8.8832487309644694,8.8832487309644694]
[null,"ZN1285:PA20","GREENACRE PARK","URBAN",897,491.501885770618,6747.5594227517104,5.7662950509184006,843.8482883182204,1.9013204974123732,2,19972,19972,11.8171683389075,11.8171683389075,2,45,45,0.334448160535117,0.334448160535117]
[null,"ZN1285:PA22","GREENACRE PARK","URBAN",615,0,2272.84455481227,3.5696112219055998,71.065123055429524,0,1,2717,2717,1.7886178861788602,1.7886178861788602,0,0,0,0,0]
[null,"ZN1285:PA23","GREENACRE PARK","URBAN",1941,0,4842.1652175321196,3.4780827294303998,266.98925901021022,0,2,10476.299999999999,10476.299999999999,2.67903142709944,2.67903142709944,0,0,0,0,0]
[null,"ZN1285:PA24","GREENACRE PARK","URBAN",1525,2969.9331706788798,3252.78251259032,3.8441967002920001,7064.0417681068329,687.85550433988101,9,250785.08333333299,250785.08333333299,27.737704918032801,27.737704918032801,1,24420,24420,4.85245901639344,4.85245901639344]
[null,"ZN1285:PA27","GREENACRE PARK","URBAN",2230,3483.2405381131498,14022.315381685699,7.1392224438111995,7155.5569180719312,13.600980489077422,14,136787.54999999999,136655.54999999999,21.973094170403552,21.928251121076201,1,260,260,4.4843049327354299E-2,4.4843049327354299E-2]
[null,"ZN1285:PA29","GREENACRE PARK","URBAN",530,0,3233.00255601861,4.7594816298479996,0,95.206863436354951,0,0,0,0,0,1,2730,2730,2.64150943396226,2.64150943396226]
[null,"ZN1285:PA31","GREENACRE PARK","URBAN",1916,1776.55202416621,9052.5092081652892,8.7867353160511996,39057.408266254955,3.8630003758558962,9,606638.433333333,606638.433333333,117.01461377870599,117.01461377870599,1,60,60,0.10438413361169099,0.10438413361169099]
[null,"ZN1285:PA32","GREENACRE PARK","URBAN",255,0,0,3.3865542359943999,111.96262754698802,0,1,4512,4512,18.431372549019599,18.431372549019599,0,0,0,0,0]
[null,"ZN1285:PA33","GREENACRE PARK","URBAN",2672,1624.0789974182401,7018.4160608734901,7.2307509372471994,7027.5205655893033,0,13,132639.46666666699,132639.46666666699,10.2919161676647,10.2919161676647,0,0,0,0,0]
[null,"ZN1285:PA35","GREENACRE PARK","URBAN",393,0,2753.7225871230398,1.7390413647151999,426.36525330897524,0,1,33460,33460,96.946564885496201,96.946564885496201,0,0,0,0,0]
[null,"ZN1285:PA8","GREENACRE PARK","URBAN",211,0,2643.01758375284,1.0068134220311999,8.5506104968015872,0,3,1159.05,1159.05,1.4218009478673002,1.4218009478673002,0,0,0,0,0]
[null,"ZN1287:PA11","REVESBY","URBAN",1387,1746.6855537199301,4028.1976618826702,4.2812526698616002,2179.1934056264504,1247.5914976751192,8,69467.066666666593,69467.066666666593,23.792357606344599,23.792357606344599,1,39770,39770,6.9935111751982708,6.9935111751982708]
[null,"ZN1287:PA12","REVESBY","URBAN",945,54.807414279298698,4659.6606331744497,3.8012505092783999,3092.8264483013031,0,6,111040.933333333,111040.933333333,120.529100529101,120.529100529101,0,0,0,0,0]
[null,"ZN1287:PA15","REVESBY","URBAN",1893,4103.8701127259201,2441.1850215794102,5.6660235695655992,2183.9063948133999,0,6,52602.9,52602.9,7.6597992604331697,7.6597992604331697,0,0,0,0,0]
[null,"ZN1287:PA16","REVESBY","URBAN",561,2.79213225787925,2922.9246725973999,3.6078272840271999,1455.987458062272,0,3,55076.45,55076.45,32.620320855614999,32.620320855614999,0,0,0,0,0]
[null,"ZN1287:PA17","REVESBY","URBAN",1226,2751.9491057416699,3265.1645218538401,3.4236230817784001,459.21939193122938,222.76392799448575,5,18305.7833333333,18305.7833333333,17.128874388254502,17.128874388254502,1,8880,8880,3.01794453507341,3.01794453507341]
[null,"ZN1287:PA18","REVESBY","URBAN",254,280.55297568991,2602.92878846645,4.4850143999999998,0,64.411864232229291,0,0,0,0,0,1,1960,1960,1.5748031496063,1.5748031496063]
[null,"ZN1287:PA20","REVESBY","URBAN",44,0,22.221154357953601,8.7812435139199993E-2,3.7436638245920824,0,2,5818.2833333333001,5818.2833333333001,100,100,0,0,0,0,0]
[null,"ZN1287:PA21","REVESBY","URBAN",1615,1885.61381666945,6643.76367736673,3.2932914947151999,1124.3944843710206,0,6,46595.349999999897,46595.349999999897,18.575851393188898,18.575851393188898,0,0,0,0,0]
[null,"ZN1287:PA22","REVESBY","URBAN",951,794.33021843902202,4540.9849866401601,3.0858740771872002,1224.3980150583686,0,1,54150,54150,99.894847528916898,99.894847528916898,0,0,0,0,0]
[null,"ZN1287:PA23","REVESBY","URBAN",912,43.263075015231998,4218.5237705101299,2.3989906110639998,370.67686438674372,27.070434392055187,2,21087.3,21087.3,12.828947368421101,12.828947368421101,1,1540,1540,0.109649122807018,0.109649122807018]
[null,"ZN1287:PA24","REVESBY","URBAN",776,686.36233652737405,2627.3484504589101,4.8639706311944,2639.393772492027,0,2,74057.2,74057.2,106.056701030928,106.056701030928,0,0,0,0,0]
[null,"ZN1287:PA3","REVESBY","URBAN",1551,4104.68460419238,4779.6539195674204,4.4047716641712,6458.1273595947996,0,7,200095.46666666699,200095.46666666699,108.123791102515,108.123791102515,0,0,0,0,0]
[null,"ZN1287:PA4","REVESBY","URBAN",980,3408.3434917889499,4159.7005820288596,2.6534159036039999,1258.1768746482753,4346.848689201086,5,64712.833333333299,64712.833333333299,117.65306122449,117.65306122449,3,223575,223575,30.714285714285701,30.714285714285701]
[null,"ZN1287:PA5","REVESBY","URBAN",1128,1773.3474522430399,7602.3326956117198,3.3204483750855998,696.45245032424054,12.651616872836685,2,28625.216666666602,28625.216666666602,11.347517730496499,11.347517730496499,1,520,520,8.8652482269503508E-2,8.8652482269503508E-2]
[null,"ZN1287:PA6","REVESBY","URBAN",865,2038.27467649132,2569.5993967752302,1.9841714774016002,1552.7171300549539,0,1,106799,106799,99.306358381502903,99.306358381502903,0,0,0,0,0]
[null,"ZN129:PA12","HUNTERS HILL","URBAN",1292,179.531138839677,8116.3964630957898,3.3945152874,128.44285730706392,114.912083802989,1,5164,0,99.922600619194995,0,1,4620,4620,0.85139318885448889,0.85139318885448889]
[null,"ZN129:PA3","HUNTERS HILL","URBAN",1580,1378.6846337667901,8037.6649326462702,4.3171427648911997,18128.457469498877,0,10,573084.26666666695,566780.26666666695,508.54430379746799,408.79746835443001,0,0,0,0,0]
[null,"ZN129:PA34","HUNTERS HILL","URBAN",442,0,6216.4594332550196,2.0136268431016,383.36903073057459,0,4,25983.166666666701,24219.166666666701,174.43438914027149,74.660633484162901,0,0,0,0,0]
[null,"ZN129:PA35","HUNTERS HILL","URBAN",1293,676.40484529996104,6469.7099357004599,4.3933676580255998,1013.9420967084385,0,7,31497.033333333398,26345.033333333398,109.74477958236662,10.131477184841501,0,0,0,0,0]
[null,"ZN129:PA38","HUNTERS HILL","URBAN",1222,1408.1875349490299,6032.5522256313598,3.4780827294303998,7534.7078125727548,0,9,295651.816666667,166215.816666667,314.5662847790507,115.13911620294598,0,0,0,0,0]
[null,"ZN129:PA39","HUNTERS HILL","URBAN",957,182.56072797267001,3409.90856083065,2.3797408149239998,2464.7115607140745,796.18047335237486,9,141348.26666666701,137524.26666666701,138.87147335423188,38.975966562173397,3,45660,45660,12.2257053291536,12.2257053291536]
[null,"ZN129:PA4","HUNTERS HILL","URBAN",38,0,4611.4258600727999,1.9220983506264,35.153303424681681,4.4364144947014141,2,2496,2340,205.26315789473603,102.63157894736801,1,315,315,2.6315789473684199,2.6315789473684199]
[null,"ZN129:PA40","HUNTERS HILL","URBAN",460,0,2079.9225687398198,1.2813989004175999,17.201082231307915,0,1,1832,0,99.565217391304401,0,0,0,0,0,0]
[null,"ZN129:PA41","HUNTERS HILL","URBAN",1075,2401.2452418173798,6931.3344576530098,3.2950257435191999,1252.41208477181,0,17,51873.133333333302,47585.133333333302,147.44186046511629,47.720930232558203,0,0,0,0,0]
[null,"ZN129:PA43","HUNTERS HILL","URBAN",107,0,4010.58965476821,2.4346178273704,118.88080627866449,0,2,6664,6240,196.2616822429907,97.196261682243005,0,0,0,0,0]
[null,"ZN129:PA46","HUNTERS HILL","URBAN",1487,342.502933612189,3418.64921769896,3.4780827294303998,4815.1044659244953,1478.6438731014196,9,188938.23333333299,183010.23333333299,214.32414256893111,114.660390047075,2,58020,58020,8.4734364492266305,8.4734364492266305]
[null,"ZN129:PA47","HUNTERS HILL","URBAN",872,0,9730.9899936608399,3.6611397153415997,1914.4430741673057,0,7,71364.166666666701,67880.166666666701,216.51376146789039,116.628440366973,0,0,0,0,0]
[null,"ZN129:PA49","HUNTERS HILL","URBAN",66,0,860.01224494233895,9.1275999999999996E-2,1.765657576273008,0,2,2640,2376,200,100,0,0,0,0,0]
[null,"ZN129:PA51","HUNTERS HILL","URBAN",209,1127.9009790207101,4524.29454529755,3.8402940133208001,2117.8717146302974,120.15402011760384,6,75264.333333333299,74432.333333333299,422.96650717703346,323.44497607655501,3,4270,4270,1.4354066985645901,1.4354066985645901]
[null,"ZN129:PA52","HUNTERS HILL","URBAN",942,0,6502.0595263321702,3.0204402651328,7972.222058567846,3417.478832597752,14,360216.15,356456.15,396.60297239915093,296.81528662420402,3,154415.04999999999,69187.05,30.467091295116798,15.286624203821701]
[null,"ZN1290:PA10","LEIGHTONFIELD","URBAN",37,0,2342.8258193175898,1.0009289053904,197.80175174206582,0,3,26970,20750,383.78378378378397,191.89189189189199,0,0,0,0,0]
[null,"ZN1290:PA11","LEIGHTONFIELD","URBAN",1188,4552.8315764551198,4306.3402218740102,4.2102255999999993,27850.792529590355,16.196106607236317,7,902788.95,693205.95,397.222222222222,198.98989898989902,1,525,525,8.4175084175084208E-2,8.4175084175084208E-2]
[null,"ZN1290:PA12","LEIGHTONFIELD","URBAN",1056,5868.9823571567204,1883.5336187257001,3.9354368000000002,26447.5981277342,3774.0894084305255,7,917164.71666666702,734264.71666666702,494.31818181818198,296.49621212121201,8,130880,130880,41.571969696969703,41.571969696969703]
[null,"ZN1290:PA13","LEIGHTONFIELD","URBAN",160,0,4009.3042795191,2.1051127999999997,1873.3270411039614,6.4784426428945263,4,121448.5333333333,93688.533333333296,398.125,200,1,420,420,1.25,1.25]
[null,"ZN1290:PA16","LEIGHTONFIELD","URBAN",22,298.43957951238701,1557.0626716517299,0.79815423775920002,110.63893858319598,0,4,18918,15068,413.63636363636402,213.63636363636397,0,0,0,0,0]
[null,"ZN1290:PA17","LEIGHTONFIELD","URBAN",48,0,2886.3760978612199,1.9186840459815999,503.50321661472429,0,3,35814,27589,391.666666666666,195.833333333333,0,0,0,0,0]
[null,"ZN1290:PA8","LEIGHTONFIELD","URBAN",791,1.6503096991945301,8763.7314450654703,4.5764246439368002,17818.120531715533,17.101824581210451,4,531360.933333333,410538.88333333301,356.00505689001301,174.96839443742101,1,510,510,0.252844500632111,0.252844500632111]
[null,"ZN1290:PA9","LEIGHTONFIELD","URBAN",1244,1739.7861491357801,7516.7816760732403,5.1255956007096,34705.383606367861,1622.4601577580991,5,924073.58333333302,715704.13333333295,392.122186495177,195.90032154340798,2,43200,43200,6.43086816720258,6.43086816720258]
[null,"ZN13000:PA1","LAKE MUNMORAH","URBAN",713,3515.8122676971798,1282.2888552910699,1.4333362545752,655.98819139558123,44.425713250133029,2,62460,56133,195.7924263674615,97.194950911641001,1,4230,4230,1.26227208976157,1.26227208976157]
[null,"ZN13000:PA10","LAKE MUNMORAH","SHORT RURAL",849,5980.7019926744697,2205.20307217652,1.5981301648088,90.09601509650787,157.38283833293323,2,7693.9166666666997,52.916666666700003,100.11778563015312,0.117785630153121,1,13440,13440,3.2979976442874004,3.2979976442874004]
[null,"ZN13000:PA11","LAKE MUNMORAH","SHORT RURAL",1606,15140.7208245239,3212.3080636833301,4.7374538736287999,521.31550307531302,595.84700121218225,6,15017.916666666601,617.91666666660001,99.999999999999986,0.37359900373599003,4,17165,16925,5.4794520547945247,5.4171855541718594]
[null,"ZN13000:PA2","LAKE MUNMORAH","SHORT RURAL",1375,9356.0872711945904,1585.9884621282999,2.8200330730752001,508.45170480329523,0,4,24606.483333333301,12276.483333333301,108.29090909090905,8.654545454545449,0,0,0,0,0]
[null,"ZN13000:PA4","LAKE MUNMORAH","URBAN",233,12629.2413970628,1810.4667171337701,3.6726054778679997,55.704538280935338,1170.7371680734745,1,2070,0,98.712446351931305,0,2,43505,43505,37.339055793991399,37.339055793991399]
[null,"ZN13000:PA5","LAKE MUNMORAH","SHORT RURAL",1644,10801.5307834388,14333.9517974153,4.1901410204663998,922.08385776748844,0,9,30032.799999999999,15317.8,106.93430656934314,7.4817518248175299,0,0,0,0,0]
[null,"ZN13000:PA7","LAKE MUNMORAH","SHORT RURAL",1401,14798.4647840486,4613.7192773221304,4.3614219976880007,3051.5986259767728,1409.3298642312272,6,95489,82898,202.99785867237691,103.140613847252,2,44100,44100,9.9928622412562405,9.9928622412562405]
[null,"ZN13000:PA8","LAKE MUNMORAH","SHORT RURAL",142,3888.9949341035599,7010.7440708220302,1.1576337712464,10.84046714096654,2.5447105964710186,1,1278,0,100,0,1,300,300,3.5211267605633796,3.5211267605633796]
[null,"ZN14143:PA10","SOMERSBY","SHORT RURAL",58,2595.0362799190798,1118.1793958886301,0.64069945020879993,14.923018597917585,4.4129414021368554,1,3178.75,3178.75,25.862068965517199,25.862068965517199,1,940,940,3.4482758620689702,3.4482758620689702]
[null,"ZN14143:PA12","SOMERSBY","SHORT RURAL",1320,11127.485418259301,9735.2425334669806,4.8510101223232001,21607.858176717193,134.8931563515541,5,607902.01666666695,607902.01666666695,208.93939393939399,208.93939393939399,4,3795,3795,0.83333333333333293,0.83333333333333293]
[null,"ZN14143:PA14","SOMERSBY","URBAN",72,0,3446.1162350005902,2.0685439391631997,47.137993826480617,5.3049189193788475,1,3110,3110,91.6666666666666,91.6666666666666,1,350,350,1.3888888888888899,1.3888888888888899]
[null,"ZN14143:PA17","SOMERSBY","SHORT RURAL",749,62724.953289060199,2192.8235071449699,2.7873530732976,25921.448490193699,12245.475712837349,20,1269174.466666667,486535.46666666702,361.54873164219009,289.31909212283097,12,599567,599567,151.93591455273702,151.93591455273702]
[null,"ZN14143:PA21","SOMERSBY","URBAN",44,1968.55477084378,1530.87435288253,1.226481804356,0,6.7940519100607997,0,0,0,0,0,1,756,756,6.8181818181818201,6.8181818181818201]
[null,"ZN14143:PA5","SOMERSBY","URBAN",1030,596.26189070530302,7659.8279088211902,3.9906422897896001,3807.9007788956596,94.301472726695764,2,130225.75,130225.75,99.417475728155296,99.417475728155296,3,3225,3225,0.77669902912621402,0.77669902912621402]
[null,"ZN14143:PA6","SOMERSBY","URBAN",55,6228.6505930496496,5789.2229758637404,4.5398132465624004,106.17379630567721,3.991767054994773,4,3191.7833333333001,3191.7833333333001,16.363636363636399,16.363636363636399,1,120,120,1.8181818181818199,1.8181818181818199]
[null,"ZN14143:PA8","SOMERSBY","URBAN",32,0,1176.4864824660201,1.4461501876415999,0,1.5894636965445108,0,0,0,0,0,1,150,150,3.125,3.125]
[null,"ZN14144:PA1","WAMBERAL","URBAN",1201,3984.7732619462299,2985.8674537658599,2.7641604844728001,643.82267204019593,0,7,31787.55,31787.55,12.9891756869276,12.9891756869276,0,0,0,0,0]
[null,"ZN14144:PA10","WAMBERAL","SHORT RURAL",679,14656.141258679299,6035.1345791359499,2.8923003752831997,1751.1782055300334,1245.355402667268,17,82630.616666666698,82630.616666666698,236.08247422680398,236.08247422680398,6,58763,58763,24.005891016200302,24.005891016200302]
[null,"ZN14144:PA2","WAMBERAL","SHORT RURAL",1027,9972.4301978008098,3602.1693004618501,3.0204402651328,5776.7114475124208,1839.3495212957971,12,261014.39999999999,261014.39999999999,202.14216163583299,202.14216163583299,5,83109,83109,19.474196689386599,19.474196689386599]
[null,"ZN14144:PA4","WAMBERAL","URBAN",834,2785.83239872385,2056.2004645153602,1.720735666028,177.41096148383423,2.2695127207730987,6,14070.85,14070.85,20.743405275779399,20.743405275779399,1,180,180,0.11990407673860899,0.11990407673860899]
[null,"ZN14144:PA5","WAMBERAL","SHORT RURAL",282,5356.5425719315599,751.514322291908,0.80545073743279993,144.9498340219796,60.416789360165509,6,24560.25,24560.25,119.14893617021301,119.14893617021301,4,10237,10237,10.2836879432624,10.2836879432624]
[null,"ZN14144:PA7","WAMBERAL","SHORT RURAL",1038,5706.8885992078403,3838.65436644691,2.3797408149239998,56.739047567144006,0,4,3253.9166666666001,3253.9166666666001,6.6473988439306391,6.6473988439306391,0,0,0,0,0]
[null,"ZN14144:PA8","WAMBERAL","URBAN",477,1438.7067369399399,1716.92595254548,1.061730517132,126.96809480820581,56.013505438083136,5,16320.5333333333,16320.5333333333,107.966457023061,107.966457023061,1,7200,7200,4.1928721174004204,4.1928721174004204]
[null,"ZN14891:PA1","WYONG","SHORT RURAL",912,6013.49820416697,8796.5933191028107,4.9753280439311993,13.297892600599996,1469.9013880731322,2,364.76666666670002,364.76666666670002,0.32894736842105299,0.32894736842105299,1,40320,40320,9.2105263157894708,9.2105263157894708]
[null,"ZN14891:PA10","WYONG","SHORT RURAL",1075,10213.340296009001,3828.8927318319802,3.4805716040056001,899.68489799760948,535.56948352215818,2,35277.183333333298,35277.183333333298,2.6046511627906903,2.6046511627906903,1,21000,21000,9.7674418604651194,9.7674418604651194]
[null,"ZN14891:PA12","WYONG","SHORT RURAL",715,70050.591511935694,2761.5467908445298,4.1783737867632,25143.157321987284,7844.8549057557248,18,821233.33333333302,362172.33333333302,462.37762237762229,397.06293706293701,24,256231,256231,76.223776223776298,76.223776223776298]
[null,"ZN14891:PA14","WYONG","URBAN",467,6700.3282199088799,12931.7440227352,4.4466028198823997,149.9927625132151,140.59021492196595,4,4603.5833333334003,4603.5833333334003,25.695931477516098,25.695931477516098,2,4315,4315,2.1413276231263398,2.1413276231263398]
[null,"ZN14891:PA16","WYONG","SHORT RURAL",2129,8657.4439094220106,10873.737762925301,4.7045645337863995,1881.0622036726788,1159.2904367491333,14,54567.966666666704,54567.966666666704,99.530295913574392,99.530295913574392,3,33630,33630,3.2409581963363001,3.2409581963363001]
[null,"ZN14891:PA17","WYONG","SHORT RURAL",1008,4965.1909239587203,7786.7583414137498,3.2279122762775998,7.0955968786903495E-2,280.27607670826882,1,3,3,9.9206349206349201E-2,9.9206349206349201E-2,2,11850,11850,4.6626984126984103,4.6626984126984103]
[null,"ZN14891:PA19","WYONG","SHORT RURAL",185,1797.9673760782,3243.9266647805998,0.91528492859519994,6.5188131331163293,7.0419277672552942,1,972,972,4.8648648648648605,4.8648648648648605,2,1050,1050,1.6216216216216199,1.6216216216216199]
[null,"ZN14891:PA20","WYONG","SHORT RURAL",538,31880.860276450701,4992.3400355215199,3.0070481793136001,258.16968397725651,1170.6475434447516,7,11717.0666666666,11717.0666666666,7.43494423791822,7.43494423791822,9,53130,53130,28.996282527881,28.996282527881]
[null,"ZN14891:PA21","WYONG","SHORT RURAL",490,14037.1736486972,2476.4189487559702,1.2630932017304,35.92908913081655,20.129853521827201,4,3882.0833333332998,3882.0833333332998,104.08163265306101,104.08163265306101,1,2175,2175,3.06122448979592,3.06122448979592]
[null,"ZN14891:PA5","WYONG","SHORT RURAL",1452,63762.929650168298,2847.9086112313998,4.8786217483727992,9698.8047259908526,5621.4612741959882,26,271315.816666667,271315.816666667,151.44628099173602,151.44628099173602,32,157255.6,157255.6,24.931129476583997,24.931129476583997]
[null,"ZN14891:PA6","WYONG","URBAN",195,2861.9602674010298,5007.2752856336001,3.4318770714959999,2.6403833045373717,0,1,105,105,0.512820512820513,0.512820512820513,0,0,0,0,0]
[null,"ZN14891:PA8","WYONG","SHORT RURAL",1366,16681.928004957601,8173.6064059862401,4.1798859159016004,9019.2605380791174,282.38479293445653,11,294483.21666666702,194277.21666666699,211.5666178623722,206.00292825768699,2,9220,9220,1.61054172767203,1.61054172767203]
[null,"ZN14891:PA9","WYONG","URBAN",1306,3213.84496443539,5482.1812932345201,3.5999605197688003,113.05526541983036,1327.3465523223238,3,4285.95,4285.95,99.617151607963194,99.617151607963194,3,50320,50320,8.0398162327718197,8.0398162327718197]
[null,"ZN14892:PA1","CHARMHAVEN","SHORT RURAL",1001,4920.5870465903299,13454.4409582629,3.9241280581351994,4027.3729935997048,147.50491523400746,2,140066,140066,94.105894105894095,94.105894105894095,3,5130,5130,4.3956043956044004,4.3956043956044004]
[null,"ZN14892:PA10","CHARMHAVEN","URBAN",973,1.9300777040285799,7003.70071487306,3.9764345347319998,4365.4251170628941,847.0027578886976,3,149825.85,149825.85,107.29701952723501,107.29701952723501,1,29070,29070,5.8581706063720498,5.8581706063720498]
[null,"ZN14892:PA12","CHARMHAVEN","URBAN",218,0,2361.0516719853899,1.0493154140671999,251.41996461221282,0,1,32700,32700,100,100,0,0,0,0,0]
[null,"ZN14892:PA13","CHARMHAVEN","URBAN",1103,4674.9632599950601,2375.9548710559902,2.103546129128,3213.8534144879786,0,6,208510.566666667,208510.566666667,190.20852221214898,190.20852221214898,0,0,0,0,0]
[null,"ZN14892:PA14","CHARMHAVEN","SHORT RURAL",883,3838.6012249523601,9683.4187988589692,3.4845467612383998,8969.4937165810916,437.24296721430585,3,351298,351298,296.71574178935498,296.71574178935498,3,17125,17125,8.7202718006794999,8.7202718006794999]
[null,"ZN14892:PA16","CHARMHAVEN","URBAN",2274,10442.4443814356,5021.8873916396597,5.8041917190999994,15160.995782828344,2651.9112673690333,12,356483.98333333334,356359.95,104.61741424802069,104.57343887423001,3,62355,62355,7.2999120492524199,7.2999120492524199]
[null,"ZN14892:PA17","CHARMHAVEN","URBAN",513,1566.64639182472,4659.9743421823796,3.9728956825440003,3240.433413720225,293.43617279489757,4,111314.05,111314.05,205.06822612085801,205.06822612085801,1,10080,10080,5.4580896686159797,5.4580896686159797]
[null,"ZN14892:PA19","CHARMHAVEN","URBAN",1771,6983.0512527856699,1760.04623282489,3.6522820444152,7493.1984629887475,2299.3470827160677,14,279999.316666667,279999.316666667,109.937888198758,109.937888198758,6,85920,85920,10.3896103896104,10.3896103896104]
[null,"ZN14892:PA20","CHARMHAVEN","URBAN",15,0,2707.83704741157,4.3018391655504002,70.922272532079447,0,1,2250,2250,100,100,0,0,0,0,0]
[null,"ZN14892:PA21","CHARMHAVEN","URBAN",1072,239.168539636834,6032.1893836250401,3.2239428896095998,3791.4761844361356,867.78739959664438,1,160500,160500,99.813432835820905,99.813432835820905,1,36735,36735,7.3694029850746299,7.3694029850746299]
[null,"ZN14892:PA3","CHARMHAVEN","URBAN",1225,4985.2569745276196,2967.8094752882898,2.3797408149239998,3164.5296685268436,417.44547814401784,1,181482,181482,99.428571428571402,99.428571428571402,1,23940,23940,4.6530612244897993,4.6530612244897993]
[null,"ZN14892:PA5","CHARMHAVEN","URBAN",293,6933.10512571651,3580.4995268213602,4.0203905111728,1294.8589990971225,119.60249201079097,1,43955,43955,100.68259385665499,100.68259385665499,2,4060,4060,3.0716723549488099,3.0716723549488099]
[null,"ZN14892:PA6","CHARMHAVEN","SHORT RURAL",1681,3522.5113405883299,10490.585733309301,4.5764246439368002,15196.284515822681,1543.7917648426801,8,453174.16666666698,453174.16666666698,205.472932778108,205.472932778108,3,46038,46038,8.9232599643069488,8.9232599643069488]
[null,"ZN14892:PA8","CHARMHAVEN","SHORT RURAL",889,3702.1435765567498,3221.4990596590101,2.1536387447767997,2117.2125833233026,43.711788922278785,4,134166.98333333299,134166.98333333299,99.550056242969703,99.550056242969703,3,2770,2770,0.337457817772778,0.337457817772778]
[null,"ZN14892:PA9","CHARMHAVEN","URBAN",704,697.90942735891804,4276.0246114378097,2.1966838290127999,3025.4536068656398,570.43638883472079,4,187965,187965,299.71590909090901,299.71590909090901,4,35440,35440,33.380681818181799,33.380681818181799]
[null,"ZN15001:PA10","BROOKVALE","URBAN",168,0,3087.1147733709399,4.2014969270423999,993.49729937356494,524.28164562023744,4,32271.316666666698,32271.316666666698,212.5,212.5,5,17030,17030,69.642857142857196,69.642857142857196]
[null,"ZN15001:PA11","BROOKVALE","URBAN",919,118.621475518308,4638.3314928371001,4.3566624904144007,2113.7309023830912,34.476536300083644,1,66214,66214,101.414581066376,101.414581066376,1,1080,1080,0.21762785636561502,0.21762785636561502]
[null,"ZN15001:PA13","BROOKVALE","URBAN",92,0,2300.5061259977201,1.6002665948848001,100.09046380193065,0,2,8536,8536,181.52173913043498,181.52173913043498,0,0,0,0,0]
[null,"ZN15001:PA15","BROOKVALE","URBAN",2875,0,5120.8605766143201,4.7957818260240002,10274.550674192846,959.32998778146725,4,292386.59999999998,292386.59999999998,199.02608695652199,199.02608695652199,1,27300,27300,1.46086956521739,1.46086956521739]
[null,"ZN15001:PA16","BROOKVALE","URBAN",542,0,3860.1739630591901,4.7186760916264001,1913.7378211797854,0,4,55349.833333333401,55349.833333333401,199.81549815498101,199.81549815498101,0,0,0,0,0]
[null,"ZN15001:PA17","BROOKVALE","URBAN",2,0,1513.8754514124601,0.45764246429759997,3.5343770793747997,0,3,1054,1054,950,950,0,0,0,0,0]
[null,"ZN15001:PA18","BROOKVALE","URBAN",2373,2753.3764721449002,5477.1906120972799,5.6238969380696,6426.8169768099197,5053.4400770208549,8,155959.78333333301,155959.78333333301,145.469869363675,145.469869363675,12,122632,122632,13.527180783817998,13.527180783817998]
[null,"ZN15001:PA2","BROOKVALE","URBAN",2301,95.129012172930501,8912.8408489086996,6.6507346215711998,13829.347675126719,0,5,283782.83333333302,283782.83333333302,204.86744893524599,204.86744893524599,0,0,0,0,0]
[null,"ZN15001:PA3","BROOKVALE","URBAN",411,0,2625.5683436878899,3.9369855740504001,885.33303086855426,70.099682796043879,3,30690,30690,111.192214111922,111.192214111922,2,2430,2430,1.21654501216545,1.21654501216545]
[null,"ZN15001:PA4","BROOKVALE","URBAN",322,0,2980.51371480744,5.2929423181112005,924.28010936020371,0,1,23832,23832,102.79503105590099,102.79503105590099,0,0,0,0,0]
[null,"ZN15001:PA6","BROOKVALE","URBAN",1268,504.04713703510203,4742.2294478631002,4.4960899509007994,4701.4322246965176,799.65821462422707,5,142708.29999999999,142708.29999999999,98.817034700315503,98.817034700315503,3,24273,24273,6.38801261829654,6.38801261829654]
[null,"ZN15001:PA8","BROOKVALE","URBAN",704,3069.8653320561598,1720.3249823655501,2.2766266405528,1785.2787267632245,96.086030610145855,5,107020.816666667,107020.816666667,229.11931818181799,229.11931818181799,1,5760,5760,1.7045454545454499,1.7045454545454499]
[null,"ZN15002:PA2","NARRABEEN","URBAN",1228,8670.6204776131399,1580.17773867648,3.5696112219055998,2315.7862004829335,451.9710439447266,9,88538.383333333404,88538.383333333404,96.335504885993501,96.335504885993501,1,17280,17280,10.4234527687296,10.4234527687296]
[null,"ZN15002:PA4","NARRABEEN","URBAN",670,1675.57912957915,2897.79167702222,1.3171865741672,13.783257516079214,6.111468650753042,4,1428.1,1428.1,0.59701492537313394,0.59701492537313394,1,633.21666666670001,633.21666666670001,0.14925373134328399,0.14925373134328399]
[null,"ZN15002:PA6","NARRABEEN","URBAN",1729,6100.6184582552596,6029.2482694261398,3.9551039369144001,6878.3032814483013,2.8980365375179575,16,237343.566666667,237343.566666667,151.47484094852499,151.47484094852499,1,100,100,5.7836899942163095E-2,5.7836899942163095E-2]
[null,"ZN15002:PA8","NARRABEEN","URBAN",1111,573.63645748917804,6056.1034312523298,4.1267886009815999,728.75950256301201,0,7,24100.5,24100.5,7.7407740774077398,7.7407740774077398,0,0,0,0,0]
[null,"ZN15004:PA1","NEWPORT","URBAN",1720,1879.24545257451,2973.3167064470999,3.5879169205927997,14503.817204905479,683.79935400677675,7,551688.566666667,551688.566666667,199.82558139534902,199.82558139534902,2,26010,26010,2.9651162790697598,2.9651162790697598]
[null,"ZN15004:PA3","NEWPORT","URBAN",904,0,4595.9820635760798,1.8671812545647999,3627.5804276005365,258.57958764554832,13,265145.71666666702,221583.816666667,125.33185840707969,120.35398230088501,1,18900,18900,4.9778761061946897,4.9778761061946897]
[null,"ZN15004:PA5","NEWPORT","URBAN",1734,2.3016712211707899,12330.291310970901,4.2529278890511995,22944.511552786073,0,30,736283.11666666705,622931.5,132.23760092272218,127.45098039215701,0,0,0,0,0]
[null,"ZN15004:PA9","NEWPORT","URBAN",1978,1461.40339934145,8137.1423254138299,4.2670882199816003,23437.166660443265,1124.6516255939459,24,749596.46666666633,744721.78333333298,211.98179979777535,211.88068756319498,2,35970,35970,3.7917087967644099,3.7917087967644099]
[null,"ZN15005:PA10","BELROSE","URBAN",798,5917.1694734703697,7430.5275286855504,5.1746905706391999,276.67803812506764,1058.8992148442874,1,7297,7297,9.8997493734335809,9.8997493734335809,11,27927,27927,7.1428571428571397,7.1428571428571397]
[null,"ZN15005:PA12","BELROSE","URBAN",1451,6162.3787605815896,578.390284942471,4.0389799782967994,834.73305089146345,1747.2860309563646,6,28205.25,28205.25,11.853893866299101,11.853893866299101,4,59040,59040,11.0957960027567,11.0957960027567]
[null,"ZN15005:PA2","BELROSE","URBAN",1890,5948.9655388355104,7105.8426410572301,5.1225893209224003,936.31170935069724,7944.4535099149643,8,24945.083333333401,24945.083333333401,9.4179894179894195,9.4179894179894195,10,211655,211655,27.8306878306878,27.8306878306878]
[null,"ZN15005:PA4","BELROSE","URBAN",1225,5943.0139138479099,2687.8848246683901,3.5710391205904002,792.51951545769043,1689.158679463636,7,30287.916666666599,30287.916666666599,19.428571428571402,19.428571428571402,7,64555,64555,12.8979591836735,12.8979591836735]
[null,"ZN15005:PA6","BELROSE","URBAN",1268,6915.9040704928302,3706.3901279217998,3.1670544500496001,3196.8283144516986,1738.3662549756004,9,137758.316666667,137758.316666667,82.807570977918004,82.807570977918004,8,74910,74910,16.0883280757098,16.0883280757098]
[null,"ZN15005:PA8","BELROSE","URBAN",1581,5097.8825394879996,4725.4487059165103,5.4189157519240005,3029.8360584895736,716.69695786507361,9,76306.366666666596,76306.366666666596,19.101834282099901,19.101834282099901,1,18050,18050,2.4035420619860801,2.4035420619860801]
[null,"ZN15006:PA1","DEE WHY WEST","URBAN",746,0,7841.80276495217,2.3884195724000001,33.684853746504231,0,3,1924.7666666666,1924.7666666666,5.49597855227882,5.49597855227882,0,0,0,0,0]
[null,"ZN15006:PA12","DEE WHY WEST","URBAN",3667,5076.5093881336297,12556.8785791794,8.0236094366056001,17835.18746694631,0,17,303362.53333333298,303362.53333333298,106.381238069266,106.381238069266,0,0,0,0,0]
[null,"ZN15006:PA13","DEE WHY WEST","URBAN",1381,1465.16428903833,6647.4406517615698,3.2473694197832002,7985.6239885565747,0,12,335607.15,335607.15,219.478638667632,219.478638667632,0,0,0,0,0]
[null,"ZN15006:PA14","DEE WHY WEST","URBAN",1,0,314.55895771420398,2.2300668259736001,0,6.536177299876675,0,0,0,0,0,1,400,400,100,100]
[null,"ZN15006:PA15","DEE WHY WEST","URBAN",2023,849.37505758430495,7145.0010627034899,3.2784036066320001,3942.7589376899223,0,5,164131.46666666699,164131.46666666699,202.471576866041,202.471576866041,0,0,0,0,0]
[null,"ZN15006:PA16","DEE WHY WEST","URBAN",2506,0,9318.2863684829699,4.8891329301575999,1456.7046998422154,2.3285799719416196,9,40662.466666666798,40662.466666666798,4.9082202713487604,4.9082202713487604,1,65,65,3.9904229848363899E-2,3.9904229848363899E-2]
[null,"ZN15006:PA2","DEE WHY WEST","URBAN",2288,167.07203782069701,5784.5358968400496,4.0272536862032,865.61544590008509,0,7,29333.916666666701,29333.916666666701,15.2534965034965,15.2534965034965,0,0,0,0,0]
[null,"ZN15006:PA4","DEE WHY WEST","URBAN",1326,0,7326.0623246835503,2.5371921147704,20.4211220951867,0,6,1098.45,1098.45,0.82956259426847589,0.82956259426847589,0,0,0,0,0]
[null,"ZN15006:PA6","DEE WHY WEST","URBAN",614,1682.47215410073,1028.3460813449001,2.2083257465327999,413.05297154601215,0,6,25526.816666666698,25526.816666666698,111.07491856677501,111.07491856677501,0,0,0,0,0]
[null,"ZN15006:PA8","DEE WHY WEST","URBAN",1881,5651.7919820933403,2652.7864665259799,4.4146808067543999,18961.601429700851,0,10,586178.316666667,586178.316666667,208.39978734715601,208.39978734715601,0,0,0,0,0]
[null,"ZN15006:PA9","DEE WHY WEST","URBAN",2608,362.06069512715101,7362.3601109744804,5.6197574408008002,617.65931458566024,0,3,14999.800000000099,14999.800000000099,5.8665644171779201,5.8665644171779201,0,0,0,0,0]
[null,"ZN15008:PA1","HARBORD","URBAN",2331,2345.65140406931,3998.11363101599,5.4492936201359994,22800.110527461769,0,7,571019.30000000005,571019.30000000005,198.84169884169899,198.84169884169899,0,0,0,0,0]
[null,"ZN15008:PA10","HARBORD","URBAN",1760,3728.32584891343,3635.7271200454302,3.5802939391576003,4931.171856080181,134.44928864876147,6,187968.683333333,187968.683333333,107.386363636364,107.386363636364,1,5125,5125,1.4204545454545499,1.4204545454545499]
[null,"ZN15008:PA5","HARBORD","URBAN",2131,2396.0161494114,3119.9077998088901,3.9694487433663999,17955.443623497158,1938.8377338582368,10,617333.69999999995,617333.69999999995,261.98967620835299,261.98967620835299,3,66660,66660,7.50821210699202,7.50821210699202]
[null,"ZN15008:PA7","HARBORD","URBAN",2657,4929.9617895106203,3302.6602333194401,5.4799850329376003,15369.135991290472,0,11,382757.86666666699,382757.86666666699,139.969890854347,139.969890854347,0,0,0,0,0]
[null,"ZN15008:PA9","HARBORD","URBAN",2265,7260.6053818088203,2709.6407680293601,5.0466400822687998,12169.255455084793,0,10,329090.78333333298,329090.78333333298,156.688741721854,156.688741721854,0,0,0,0,0]
[null,"ZN15009:PA1","MANLY","URBAN",2001,323.79756752650297,3822.3073474685302,6.4813292864032004,6699.0592528066418,76.935194626777417,2,141059.96666666699,141059.96666666699,52.223888055971997,52.223888055971997,1,1620,1620,0.29985007496251898,0.29985007496251898]
[null,"ZN15009:PA11","MANLY","URBAN",2332,399.724210175922,4194.9413736634297,4.5839517798072,32.962843943286138,80.611543702483985,2,981.38333333330002,981.38333333330002,0.12864493996569498,0.12864493996569498,1,2400,2400,0.34305317324185203,0.34305317324185203]
[null,"ZN15009:PA5","MANLY","URBAN",1612,474.06350150012798,2640.3238927737102,3.3133314422063997,5255.8163973355304,203.93422818229183,9,216485.76666666701,216485.76666666701,114.764267990074,114.764267990074,1,8400,8400,4.3424317617865995,4.3424317617865995]
[null,"ZN15009:PA7","MANLY","URBAN",1574,1834.3764820343099,2231.7135523636398,2.9827998557623996,6399.7588873316045,0,4,292815.15000000002,292815.15000000002,104.06607369758601,104.06607369758601,0,0,0,0,0]
[null,"ZN15009:PA9","MANLY","URBAN",634,0,573.856567034416,2.1808609941359998,0,62.321593277318563,0,0,0,0,0,1,3900,3900,1.5772870662460601,1.5772870662460601]
[null,"ZN15010:PA1","CAREEL BAY","URBAN",1404,2.29955919911988,8697.2347545803896,2.8751290057232,16752.666435524508,0,23,795207.83333333302,378054.03333333298,130.05698005698051,104.55840455840499,0,0,0,0,0]
[null,"ZN15010:PA11","CAREEL BAY","URBAN",477,0,3955.9228217268201,1.16906538598,1591.2156811371572,96.146264534588525,15,185756.61666666629,182817.83333333299,125.78616352201205,125.36687631027199,1,11224,11224,9.643605870020961,9.643605870020961]
[null,"ZN15010:PA12","CAREEL BAY","URBAN",79,0,108.863288065633,0.45734079999999999,81.800071307529052,0,2,24410,24410,137.97468354430401,137.97468354430401,0,0,0,0,0]
[null,"ZN15010:PA5","CAREEL BAY","URBAN",909,0,4882.6953182677098,1.8928458520815998,5469.1901501761804,0,9,394331.816666667,213020.6,122.33223322332209,100.2200220022,0,0,0,0,0]
[null,"ZN15010:PA7","CAREEL BAY","URBAN",1814,191.04176900912901,7374.9319463100701,4.1422853461032005,38970.998431478562,0,14,1283972.033333333,480099.58333333302,125.41345093715559,109.53693495038598,0,0,0,0,0]
[null,"ZN15010:PA9","CAREEL BAY","SHORT RURAL",1117,860.78757198326002,12618.9844320668,2.2537311416568002,8195.5860144250419,1646.594944678201,11,496285.91666666704,265340.65000000002,123.81378692927491,104.65532676812902,1,99710,99710,15.129811996418999,15.129811996418999]
[null,"ZN15011:PA10","BEACON HILL","URBAN",1480,2578.95834121401,8589.5437982796502,7.4833858587335991,7216.7730535783294,525.74133064851105,9,131613.04999999999,131613.04999999999,108.581081081081,108.581081081081,3,9588,9588,3.85135135135135,3.85135135135135]
[null,"ZN15011:PA2","BEACON HILL","URBAN",1710,6048.4764533037096,3229.4835308935899,5.0976069999759996,7949.028708193734,0,7,212814.76666666701,212814.76666666701,172.046783625731,172.046783625731,0,0,0,0,0]
[null,"ZN15011:PA4","BEACON HILL","URBAN",2003,4096.6868529289204,4500.4730233483597,3.7378825478927999,4123.9776817513321,0,8,150572.16666666701,150572.16666666701,103.694458312531,103.694458312531,0,0,0,0,0]
[null,"ZN15011:PA6","BEACON HILL","URBAN",62,319.220857222814,2553.1871885588298,5.6747665584432001,177.88311939573396,0,1,4278,4278,100,100,0,0,0,0,0]
[null,"ZN15011:PA8","BEACON HILL","URBAN",249,0,4186.3689257649003,8.7934333065024006,2307.46986177402,0,4,35812.25,35812.25,209.23694779116499,209.23694779116499,0,0,0,0,0]
[null,"ZN15012:PA2","KILLARNEY","URBAN",1306,0,6867.9223821695396,3.7532595571576,117.16277246277015,0,8,4260.2500000001,4260.2500000001,3.2924961715160697,3.2924961715160697,0,0,0,0,0]
[null,"ZN15012:PA4","KILLARNEY","URBAN",1216,4195.6466791836701,2980.6370489354399,3.8196431430711999,3229.0820438887235,0,5,115374.633333333,115374.633333333,100.57565789473699,100.57565789473699,0,0,0,0,0]
[null,"ZN15012:PA6","KILLARNEY","URBAN",1447,1072.0722711155699,9054.3263460907692,3.8108795786616003,5831.8417438002261,51.937868863807239,8,208850.03333333301,208850.03333333301,117.82999308915001,117.82999308915001,1,1860,1860,0.27643400138217,0.27643400138217]
[null,"ZN15012:PA8","KILLARNEY","URBAN",1153,4539.7675259048501,1657.60485131567,3.5135363157256001,2060.5686237074351,1015.5571837080128,6,80038.083333333299,80038.083333333299,72.419774501301006,72.419774501301006,3,39447,39447,13.703382480485701,13.703382480485701]
[null,"ZN15013:PA1","TERREY HILLS","URBAN",281,0,4133.2820318978102,5.6171389850512004,682.98664438024343,0.82317300756929412,2,16594,16594,99.288256227757998,99.288256227757998,1,20,20,0.35587188612099596,0.35587188612099596]
[null,"ZN15013:PA10","TERREY HILLS","SHORT RURAL",626,25034.455410478,767.35434687238705,2.3431294175496,974.92886897853134,1369.4593865393178,13,56784.616666666603,56784.616666666603,101.916932907348,101.916932907348,9,79764,79764,26.038338658146998,26.038338658146998]
[null,"ZN15013:PA12","TERREY HILLS","URBAN",101,0,3797.2834322215299,3.3288226454336001,137.95772174348159,0,1,5656,5656,100,100,0,0,0,0,0]
[null,"ZN15013:PA2","TERREY HILLS","URBAN",68,1949.82335176642,390.16124463410301,0.69274252348560006,60.48407012476428,0,3,11915.8,11220,195.58823529411811,194.11764705882399,0,0,0,0,0]
[null,"ZN15013:PA4","TERREY HILLS","URBAN",824,8949.5286686495001,3053.6207693118999,4.4848961505008003,5452.4043494308335,17.417034679170595,10,165916.54999999999,165916.54999999999,241.747572815534,241.747572815534,1,530,530,0.12135922330097099,0.12135922330097099]
[null,"ZN15013:PA6","TERREY HILLS","SHORT RURAL",228,8489.7917186330997,213.098736093051,1.1318047155152,1085.919937213735,24.381745019535042,6,130942.4166666666,42802.416666666599,306.57894736842087,207.45614035087701,2,2940,2940,6.1403508771929802,6.1403508771929802]
[null,"ZN15013:PA8","TERREY HILLS","URBAN",131,1801.72299956494,5629.7649320106802,2.0502382404759998,284.49964058781694,0,6,18937.883333333299,18937.883333333299,178.62595419847301,178.62595419847301,0,0,0,0,0]
[null,"ZN15014:PA11","MONA VALE","URBAN",1214,2147.6843990677698,5042.5433427220496,3.0819126296096,8596.2093226831839,4.7422623151923347,6,380663.03333333298,380663.03333333298,281.96046128500802,281.96046128500802,1,210,210,8.2372322899505801E-2,8.2372322899505801E-2]
[null,"ZN15014:PA12","MONA VALE","SHORT RURAL",1831,5242.7278570281997,14893.745927517501,5.0780846709943992,49611.824677713892,645.20093310744278,38,1333335.0833333367,1321438.41666667,45.221190606226116,45.057345712725301,2,17340,17340,3.71381758601856,3.71381758601856]
[null,"ZN15014:PA14","MONA VALE","SHORT RURAL",851,7721.6855931080399,5455.2850015433596,4.2103106721144004,9811.7749562907538,0,7,318044.2,57577.2,126.79200940070498,76.733254994124493,0,0,0,0,0]
[null,"ZN15014:PA16","MONA VALE","URBAN",385,0,3688.3450900007601,2.3797408149239998,1788.127880001445,0,3,102547,102547,299.22077922077904,299.22077922077904,0,0,0,0,0]
[null,"ZN15014:PA18","MONA VALE","URBAN",698,557.63150895353601,4106.1713887763499,1.6475128712792,640.78987460759447,0,4,53081.216666666704,53081.216666666704,19.7707736389685,19.7707736389685,0,0,0,0,0]
[null,"ZN15014:PA19","MONA VALE","URBAN",1904,4080.4553661325399,7001.0125340824898,4.0986610262927998,6093.0747453369977,427.95964854387347,11,202884.35,202884.35,109.558823529412,109.558823529412,1,14250,14250,1.3130252100840301,1.3130252100840301]
[null,"ZN15014:PA20","MONA VALE","URBAN",913,1800.3170162505501,3809.1041908310599,3.276720044832,3479.9683850519764,3.6014430586174515,10,144940.58333333299,144940.58333333299,113.253012048193,113.253012048193,1,150,150,0.10952902519167601,0.10952902519167601]
[null,"ZN15014:PA22","MONA VALE","URBAN",907,1872.31058473699,4414.8823874987602,3.4780827294303998,551.56534140481961,538.24471906070278,6,21642.6833333334,21642.6833333334,9.2613009922822496,9.2613009922822496,1,21120,21120,4.8511576626240398,4.8511576626240398]
[null,"ZN15014:PA5","MONA VALE","URBAN",1680,463.55955717549898,6134.3385381140997,4.8293260452247999,50.064818966651252,6917.6959955436078,4,1414.8166666667,1414.8166666667,0.53571428571428603,0.53571428571428603,6,195492,195492,21.071428571428598,21.071428571428598]
[null,"ZN15014:PA7","MONA VALE","URBAN",402,0,3509.5419109455502,2.9289117716968001,221.02800481438624,0,3,10299,10299,15.920398009950201,15.920398009950201,0,0,0,0,0]
[null,"ZN15014:PA9","MONA VALE","URBAN",1021,924.54076696658205,5010.59652017398,3.9291347225616002,5806.153550502906,0,4,201672.01666666701,201672.01666666701,212.43878550440698,212.43878550440698,0,0,0,0,0]
[null,"ZN15015:PA15","NORTH HEAD","SHORT RURAL",638,994.63149126867802,5409.3275336438901,1.7573470634024,3.9340366609758499,0,2,305.51666666670002,305.51666666670002,0.31347962382445099,0.31347962382445099,0,0,0,0,0]
[null,"ZN15015:PA5","NORTH HEAD","URBAN",1642,445.41411422392298,5392.4487990596199,3.2708937642007996,6522.6693103207954,0,5,272152.90000000002,272152.90000000002,102.923264311815,102.923264311815,0,0,0,0,0]
[null,"ZN1600:PA21DEF","CITY EAST","CBD",225,0,6048.1251171780204,7.2673623342884781,97.448208439302746,298.73467177294447,1,1830,1830,0.44444444444444403,0.44444444444444403,1,5610,5610,9.7777777777777803,9.7777777777777803]
[null,"ZN1600:PA23ABC","CITY EAST","CBD",150,0,4523.0258804610503,6.974471157087935,31.940172378369144,32.093485205785313,1,625,625,0.66666666666666696,0.66666666666666696,1,628,628,0.66666666666666696,0.66666666666666696]
[null,"ZN1600:PA23DEF","CITY EAST","CBD",236,0,3798.74128928444,5.0157614095593015,0,33.076940718134715,0,0,0,0,0,1,900,900,12.7118644067797,12.7118644067797]
[null,"ZN1610:PA1","HOMEBUSH BAY","URBAN",3,0,4373.5974274188002,1.4593421897432,1.7750524157556649,0,1,166,166,66.6666666666667,66.6666666666667,0,0,0,0,0]
[null,"ZN1610:PA10","HOMEBUSH BAY","URBAN",52,0,5111.4841593450501,2.1046208684784,54.930524163222934,0,1,3562,3562,98.076923076923094,98.076923076923094,0,0,0,0,0]
[null,"ZN1610:PA11","HOMEBUSH BAY","URBAN",315,0,8754.8357953442792,3.5994275294199998,1268.6784185750896,0,2,48103,48103,104.126984126984,104.126984126984,0,0,0,0,0]
[null,"ZN1610:PA12","HOMEBUSH BAY","URBAN",452,176.42537758643201,9242.9739291680708,4.4187844075743996,2439.0277190902007,0,3,75330,75330,297.78761061946904,297.78761061946904,0,0,0,0,0]
[null,"ZN1610:PA17","HOMEBUSH BAY","URBAN",347,0,6753.9199723735801,3.5404673715856001,0,198.97655895347259,0,0,0,0,0,3,7670,7670,1.15273775216138,1.15273775216138]
[null,"ZN1610:PA19","HOMEBUSH BAY","URBAN",1846,0,8110.5325306642198,5.3156856358951998,12970.206539030973,509.07390128640299,7,332998.01666666701,332998.01666666701,27.735644637053099,27.735644637053099,2,13070,13070,3.6836403033586103,3.6836403033586103]
[null,"ZN1610:PA2","HOMEBUSH BAY","URBAN",577,0,3081.0591124620601,2.1159248005784002,655.54714752763766,1.8604903882755228,2,42282.216666666704,42282.216666666704,197.74696707105699,197.74696707105699,1,120,120,0.17331022530329299,0.17331022530329299]
[null,"ZN1610:PA22","HOMEBUSH BAY","URBAN",1884,0,2890.4340999012702,2.4895750060863997,215.56507846260627,0,1,11817,11817,6.2101910828025497,6.2101910828025497,0,0,0,0,0]
[null,"ZN1610:PA23","HOMEBUSH BAY","URBAN",132,0,6558.5942059272602,3.7785150835056003,180.24841441116479,0.27686439962700127,2,6510.35,6510.35,9.8484848484848495,9.8484848484848495,1,10,10,0.75757575757575801,0.75757575757575801]
[null,"ZN1610:PA26","HOMEBUSH BAY","URBAN",55,0,4424.22719816276,4.4237699219103996,11.017667246399714,281.19524378498829,1,339.9,339.9,1.8181818181818199,1.8181818181818199,2,8675,8675,27.272727272727298,27.272727272727298]
[null,"ZN1610:PA29","HOMEBUSH BAY","URBAN",623,0,4510.6796456312804,2.4187819265743999,0.1240625520319083,0,1,7,7,0.16051364365971102,0.16051364365971102,0,0,0,0,0]
[null,"ZN1610:PA3","HOMEBUSH BAY","SHORT RURAL",467,0,2368.74373699747,1.4172411097624,617.70705415225598,0,2,59483,59483,157.17344753747301,157.17344753747301,0,0,0,0,0]
[null,"ZN1610:PA5","HOMEBUSH BAY","URBAN",7,0,4581.0837087711698,2.4529636087119999,6.6682361339485627,0,1,371,371,100,100,0,0,0,0,0]
[null,"ZN1648:PA1","ENFIELD","URBAN",284,0,6551.2750104311699,1.555984378804,430.64674535042553,0,1,37772,0,100,0,0,0,0,0,0]
[null,"ZN1648:PA10","ENFIELD","URBAN",476,0,4496.8217835006399,1.6475128712792,1061.2989935760695,5.915219323804517,3,87915,25706,108.61344537815121,10.294117647058799,1,490,490,0.21008403361344496,0.21008403361344496]
[null,"ZN1648:PA11","ENFIELD","URBAN",545,0,3675.0338399379002,1.4644558863288,796.28867325198848,3.8630003767007097,3,74207.583333333299,2156.5833333332998,100.91743119266057,1.4678899082568799,1,360,360,0.18348623853210999,0.18348623853210999]
[null,"ZN1648:PA13","ENFIELD","URBAN",68,0,4934.8819350823696,3.6611397153415997,387.94181277926452,0,3,14461.2,5617.2,197.0588235294118,98.529411764705898,0,0,0,0,0]
[null,"ZN1648:PA15","ENFIELD","URBAN",1123,0,5937.39206761895,3.111968757608,3362.0818977786794,0,1,147444,0,99.465716829919899,0,0,0,0,0,0]
[null,"ZN1648:PA16","ENFIELD","URBAN",663,0,3265.93842933923,0.91528492859519994,645.49607325283216,95.971415570879287,3,96247.916666666701,9655.9166666667006,103.92156862745097,4.9773755656108598,1,14310,14310,7.9939668174962302,7.9939668174962302]
[null,"ZN1648:PA19","ENFIELD","URBAN",806,0,2862.8620987602399,1.8305698571903999,2298.9627330007265,219.70814633836514,4,171395.6,65003.6,200.12406947890798,100.124069478908,1,16380,16380,4.8387096774193497,4.8387096774193497]
[null,"ZN1648:PA2","ENFIELD","URBAN",241,0,2981.2087234261699,1.6475128712792,385.33428737926562,412.8581650492132,1,31920,0,99.585062240663902,0,1,34200,34200,39.419087136929498,39.419087136929498]
[null,"ZN1648:PA20","ENFIELD","URBAN",1032,0,4183.0458113684799,1.4644558863288,1455.6429252804387,0,2,135654,90,99.612403100775211,9.6899224806201598E-2,0,0,0,0,0]
[null,"ZN1648:PA21","ENFIELD","URBAN",360,0,2522.9453014411802,0.91528492859519994,730.23069586316558,10.059896810364705,7,108882.43333333341,61758.4333333334,152.5,53.3333333333333,1,1500,1500,0.55555555555555491,0.55555555555555491]
[null,"ZN1648:PA4","ENFIELD","URBAN",751,0,5062.1812559509499,1.9220983506264,1409.7498100133173,0,3,100096.8666666667,612.86666666669998,99.866844207723034,0.266311584553928,0,0,0,0,0]
[null,"ZN1648:PA8","ENFIELD","SHORT RURAL",855,0,6732.6756671819003,1.4644558863288,1214.5165878781008,117.1240253102451,1,113183,0,99.532163742690102,0,1,10915,10915,4.3274853801169595,4.3274853801169595]
[null,"ZN167:PA1","AUBURN","URBAN",177,0,4009.6492639124099,2.8373832792216001,260.7192159415182,0,4,12540.333333333299,12540.333333333299,27.683615819209002,27.683615819209002,0,0,0,0,0]
[null,"ZN167:PA10","AUBURN","URBAN",1053,0,3510.8370469785,1.66430888126,1569.9535855051815,0,3,128738.05,128738.05,19.563152896486198,19.563152896486198,0,0,0,0,0]
[null,"ZN167:PA11","AUBURN","URBAN",141,0,2576.5542029083499,1.2319992819456,113.80678720394013,0,3,12607,12607,173.04964539007099,173.04964539007099,0,0,0,0,0]
[null,"ZN167:PA12","AUBURN","URBAN",392,0,7482.5613112631099,4.0619077226015996,317.24330884957072,0,1,10659,10659,14.540816326530601,14.540816326530601,0,0,0,0,0]
[null,"ZN167:PA2","AUBURN","URBAN",120,0,4828.4464365388403,2.9289117716968001,0,448.10804355028489,0,0,0,0,0,2,20880,20880,41.6666666666667,41.6666666666667]
[null,"ZN167:PA20","AUBURN","URBAN",389,0,3330.5488705924199,2.3650980672744,242.78501487118936,8.5782817795306805,7,14009.6333333333,14009.6333333333,39.845758354755802,39.845758354755802,1,495,495,0.77120822622107998,0.77120822622107998]
[null,"ZN167:PA21","AUBURN","URBAN",980,0,10117.821739609701,3.6798560003791998,1653.8801356878917,260.22504697261337,9,61337.666666666701,61337.666666666701,110.51020408163299,110.51020408163299,4,9651,9651,2.6530612244898002,2.6530612244898002]
[null,"ZN1673:PA1","TURRAMURRA","URBAN",1426,3.6502130586580899,10972.5176963306,5.1255956007096,1483.237803063568,0,12,39493.0333333335,32414.266666666801,12.76297335203369,10.098176718092599,0,0,0,0,0]
[null,"ZN1673:PA11","TURRAMURRA","URBAN",624,547.54307364028,2757.1407793318499,1.8305698571903999,258.64598293256279,0,5,19282.95,19282.95,26.602564102564102,26.602564102564102,0,0,0,0,0]
[null,"ZN1673:PA13","TURRAMURRA","URBAN",842,1063.5338145150299,6375.6567803487396,3.2950257435191999,2587.8484979340947,0,5,107185.016666667,107185.016666667,112.70783847981001,112.70783847981001,0,0,0,0,0]
[null,"ZN1673:PA14","TURRAMURRA","URBAN",956,0,4386.7896954374301,3.3865542359943999,227.93443694769965,0,5,9185.5666666666002,9185.5666666666002,6.1715481171548099,6.1715481171548099,0,0,0,0,0]
[null,"ZN1673:PA18","TURRAMURRA","URBAN",1183,4998.8748942332404,4905.71030698304,3.6611397153415997,524.24939063675629,0,6,19542.300000000101,19542.300000000101,7.2696534234995793,7.2696534234995793,0,0,0,0,0]
[null,"ZN1673:PA19","TURRAMURRA","URBAN",482,1.3309749081325799,5565.1408418282899,2.5627978008351997,1100.8232555422801,0,6,58621.55,58621.55,206.84647302904602,206.84647302904602,0,0,0,0,0]
[null,"ZN1673:PA2","TURRAMURRA","URBAN",807,1337.60383643664,6127.7300715992296,2.7458547857856002,100.90914825530265,0,6,5015.4166666667998,5015.4166666667998,7.43494423791822,7.43494423791822,0,0,0,0,0]
[null,"ZN1673:PA21","TURRAMURRA","SHORT RURAL",947,1.2243552858109701,10039.854686967201,2.4712693073991998,81.920958900149699,631.60056139104938,3,4524.0666666667003,4524.0666666667003,2.9567053854276599,2.9567053854276599,1,34880,34880,6.7581837381203798,6.7581837381203798]
[null,"ZN1673:PA6","TURRAMURRA","URBAN",1091,3824.4674186779198,5622.5549232362,3.2950257435191999,4515.2869019251639,295.76096627646706,12,187016.78333333301,187016.78333333301,125.939505041247,125.939505041247,1,12250,12250,3.2080659945004601,3.2080659945004601]
[null,"ZN1673:PA7","TURRAMURRA","URBAN",1037,72.8549993294166,6215.1740543040896,3.4780827294303998,1017.5607310599103,0,8,39927.716666666602,39927.716666666602,17.357762777242002,17.357762777242002,0,0,0,0,0]
[null,"ZN1673:PA9","TURRAMURRA","URBAN",431,296.14934672786501,5381.4072772659601,2.7458547857856002,29.306156058060115,0,8,1456.5833333333001,1456.5833333333001,1.8561484918793498,1.8561484918793498,0,0,0,0,0]
[null,"ZN1788:PA1","MATRAVILLE","URBAN",887,0,6913.0608232062896,4.2721375900464,10.55915067256946,0,2,337.31666666659999,337.31666666659999,0.22547914317925599,0.22547914317925599,0,0,0,0,0]
[null,"ZN1788:PA11","MATRAVILLE","URBAN",491,0,6542.20227474493,2.4200759935056002,12.92270787876812,0,2,728.75,728.75,0.40733197556008099,0.40733197556008099,0,0,0,0,0]
[null,"ZN1788:PA14","MATRAVILLE","URBAN",1104,0,8805.7269814192096,2.6585437854407998,266.69046990918474,168.30751801550394,4,13690.45,13690.45,6.25,6.25,1,8640,8640,2.1739130434782603,2.1739130434782603]
[null,"ZN1788:PA15","MATRAVILLE","URBAN",966,0,5417.4269350459399,3.9795644829304,9.5672634319194039,8.6020808059013234,2,328.1,328.1,0.20703933747412001,0.20703933747412001,1,295,295,0.10351966873706001,0.10351966873706001]
[null,"ZN1788:PA16","MATRAVILLE","URBAN",44,0,10970.4770791885,3.8067414140224001,0,9.3442433389863222,0,0,0,0,0,1,335,335,2.2727272727272698,2.2727272727272698]
[null,"ZN1788:PA20","MATRAVILLE","URBAN",49,0,7024.1468533863999,0.25627977969920002,0,32.392867690512993,0,0,0,0,0,2,17250,15180,187.75510204081641,93.877551020408205]
[null,"ZN1788:PA21","MATRAVILLE","URBAN",35,0,4464.8967658985703,2.8568748337791998,0,8.3733098128054078,0,0,0,0,0,1,400,400,2.8571428571428599,2.8571428571428599]
[null,"ZN1788:PA29","MATRAVILLE","SHORT RURAL",799,0,7728.0318563167502,2.1668075176168,2.7943381318239275,114.31383266552432,1,176,176,0.50062578222778498,0.50062578222778498,1,7200,7200,1.8773466833541901,1.8773466833541901]
[null,"ZN1788:PA30","MATRAVILLE","URBAN",1309,591.87823599365004,6040.0932881397302,3.6351726723967999,9056.2221011130114,0,3,339997.76666666701,339997.76666666701,99.847211611917501,99.847211611917501,0,0,0,0,0]
[null,"ZN1788:PA32","MATRAVILLE","URBAN",1445,0,10185.1766037293,3.4385530365679999,0,37.037274286132366,0,0,0,0,0,1,1470,1470,0.207612456747405,0.207612456747405]
[null,"ZN1788:PA36","MATRAVILLE","URBAN",769,0,5577.3809456973604,2.2342540077463999,348.24655242436972,440.05581652722157,2,21272,21272,13.394018205461599,13.394018205461599,1,26880,26880,0.26007802340702196,0.26007802340702196]
[null,"ZN1788:PA37","MATRAVILLE","URBAN",764,0,6360.4567925661404,1.5430926574479999,22.469913109280068,0,2,1987.3,1987.3,0.91623036649214706,0.91623036649214706,0,0,0,0,0]
[null,"ZN1788:PA6","MATRAVILLE","URBAN",1129,0,6811.3885158507601,3.1788925677336,6.4163915835774841,0,1,275.46666666670001,275.46666666670001,8.8573959255978704E-2,8.8573959255978704E-2,0,0,0,0,0]
[null,"ZN1788:PA7","MATRAVILLE","URBAN",76,0,8659.6392403155896,3.4742226837240002,101.91964532950001,0,2,4003.6333333333,4003.6333333333,100,100,0,0,0,0,0]
[null,"ZN1788:PA8","MATRAVILLE","URBAN",1212,0,3746.91711623623,3.7038892632623996,26.77686528349043,0,5,986.63333333330002,986.63333333330002,0.41254125412541304,0.41254125412541304,0,0,0,0,0]
[null,"ZN180:PA10","MOSMAN","URBAN",1386,0,5716.0747196114899,4.2510515936535995,1746.6605681232872,2313.5825078976427,8,56074.6,42364.6,110.6782106782107,11.7604617604618,3,74275,74275,16.017316017315999,16.017316017315999]
[null,"ZN180:PA15","MOSMAN","URBAN",475,0,3294.0414444540702,2.5793739105984002,397.97588360478977,0,2,21057,21057,12.842105263157899,12.842105263157899,0,0,0,0,0]
[null,"ZN180:PA16","MOSMAN","URBAN",527,0,2960.7084069127,1.3210077430231999,3.2382647558591473,170.74574889659348,1,334.55,334.55,0.18975332068311201,0.18975332068311201,1,17640,17640,9.2979127134724902,9.2979127134724902]
[null,"ZN180:PA17","MOSMAN","URBAN",792,1456.3773900517499,6305.0375852655698,3.2936054495664,381.42269708885289,0,3,15804.8,7924.8,106.56565656565658,7.0707070707070701,0,0,0,0,0]
[null,"ZN180:PA18","MOSMAN","URBAN",1242,0,6191.7683136186897,4.5265366537072005,5436.9101469988345,2833.8263671171444,5,163923.1,151513.1,212.15780998389738,112.23832528180399,2,85440,85440,14.331723027375201,14.331723027375201]
[null,"ZN180:PA19","MOSMAN","URBAN",1447,0,5890.2398339401198,3.6925510853680001,979.80617189906786,0,2,36213.266666666699,36213.266666666699,13.061506565307502,13.061506565307502,0,0,0,0,0]
[null,"ZN180:PA20","MOSMAN","URBAN",995,0,6057.2737898853802,2.8575620017824002,2776.1905839205015,0,8,132589.04999999999,122749.05,246.83417085427101,147.93969849246201,0,0,0,0,0]
[null,"ZN180:PA21","MOSMAN","URBAN",1971,0,6133.3225463029903,3.6110133890639999,2697.0527122409007,0,9,101932.9,101932.9,18.518518518518501,18.518518518518501,0,0,0,0,0]
[null,"ZN180:PA22","MOSMAN","URBAN",1437,0,4978.6385226795301,2.8817304770887997,611.27112572834983,0,5,28949.066666666698,28949.066666666698,12.456506610995099,12.456506610995099,0,0,0,0,0]
[null,"ZN180:PA23","MOSMAN","URBAN",1224,0,6831.1748824935603,3.7930975236608,392.13275441991209,5883.8395701079025,4,14108.9,14108.9,91.6666666666667,91.6666666666667,5,211700,211700,37.581699346405202,37.581699346405202]
[null,"ZN180:PA24","MOSMAN","URBAN",1118,0,7866.0620399272202,3.293656138492,499.37527017910753,266.43623343192769,6,20692.016666666699,9482.0166666666992,108.40787119856891,8.1395348837209287,1,11040,11040,2.0572450805008899,2.0572450805008899]
[null,"ZN180:PA27","MOSMAN","URBAN",988,0,2447.8398637456999,2.5287516404984003,5591.1419115653243,0,9,301750.76666666701,292867.76666666701,247.26720647773323,147.36842105263199,0,0,0,0,0]
[null,"ZN180:PA28","MOSMAN","URBAN",1329,0,4187.3079894371904,5.5878876577216001,977.14565857599109,0,3,23865.233333333301,12336.233333333301,102.1068472535741,5.7185854025583103,0,0,0,0,0]
[null,"ZN180:PA29","MOSMAN","URBAN",1195,0,2806.0133441430098,4.5219899328880002,3271.3324668996665,0,4,98730,96642,218.57740585774059,199.163179916318,0,0,0,0,0]
[null,"ZN180:PA30","MOSMAN","URBAN",1762,0,8638.0978158534199,4.8766065520407995,2373.0712494454392,81.470150869667606,14,66412.083333333299,61291.083333333299,126.61748013620891,94.324631101021609,1,2280,2280,1.0783200908058999,1.0783200908058999]
[null,"ZN180:PA31","MOSMAN","URBAN",1769,0,6919.8062620588398,3.5610761635991999,475.14964219970358,0,2,18209.7166666667,18209.7166666667,5.3137365743357794,5.3137365743357794,0,0,0,0,0]
[null,"ZN180:PA32","MOSMAN","URBAN",2545,0,12662.185437546599,5.1120857438696001,23631.545751869424,2441.322339023357,12,630881.86666666705,617224.86666666705,200.98231827111999,143.65422396856599,4,65175,65175,5.5795677799607102,5.5795677799607102]
[null,"ZN180:PA33","MOSMAN","URBAN",905,0,4789.4660640013599,2.1004885272479998,1873.9246470157277,54.022339263129723,7,121754.733333333,121754.733333333,206.07734806629799,206.07734806629799,1,3510,3510,1.98895027624309,1.98895027624309]
[null,"ZN180:PA34","MOSMAN","URBAN",705,0,3284.8615506435999,2.3797408149239998,2273.9351410282738,0,10,130407.46666666699,124782.46666666699,338.43971631205659,249.787234042553,0,0,0,0,0]
[null,"ZN180:PA35","MOSMAN","URBAN",1429,0,4837.1946637662104,3.0086451240327996,2939.089577900007,0,5,133320.183333333,120468.183333333,214.20573827851692,114.275717284815,0,0,0,0,0]
[null,"ZN180:PA41","MOSMAN","URBAN",2135,0,10693.1410273481,4.9957569934007999,730.51493325197976,1305.6477320572446,5,19956.383333333299,723.38333333330002,100.28103044496457,0.187353629976581,2,35668,35668,3.4660421545667397,3.4660421545667397]
[null,"ZN180:PA42","MOSMAN","URBAN",1908,0,9147.4743314220395,4.3617300407367994,312.86136780351859,0,2,9789.2000000000007,9789.2000000000007,3.1446540880503102,3.1446540880503102,0,0,0,0,0]
[null,"ZN180:PA43","MOSMAN","URBAN",1198,0,8327.6559606115497,4.8038282637255998,13.79869325193172,0,3,392.01666666659997,374.01666666659997,0.333889816360602,0.166944908180301,0,0,0,0,0]
[null,"ZN180:PA7","MOSMAN","URBAN",1480,0,5284.7288771091798,5.4638217722088003,7924.7456870869692,1506.1258806472545,10,197944.23333333299,197944.23333333299,114.66216216216201,114.66216216216201,2,37620,37620,7.7702702702702702,7.7702702702702702]
[null,"ZN180:PA9","MOSMAN","URBAN",820,0,4433.3442997624797,2.8450839663176,338.65928520527291,1299.5944315272884,2,16245.083333333299,16245.083333333299,10.487804878048799,10.487804878048799,3,62340,62340,21.4634146341463,21.4634146341463]
[null,"ZN1850:PA10","BASS HILL","URBAN",917,5.1761687053433603,5519.9812169434599,3.2950257435191999,7966.6620535647626,1227.468369428211,9,329967.84999999998,329967.84999999998,115.81243184296599,115.81243184296599,3,50840,50840,8.9422028353325995,8.9422028353325995]
[null,"ZN1850:PA11","BASS HILL","URBAN",292,1071.34828711819,3984.6511077189498,4.3933676580255998,2095.2592121944394,0,5,65087,65087,297.60273972602704,297.60273972602704,0,0,0,0,0]
[null,"ZN1850:PA3","BASS HILL","URBAN",1778,2314.0017503731901,3881.5669034007801,4.6679531364119997,242.22739304322894,0,7,7081.9166666666997,7081.9166666666997,3.0933633295837999,3.0933633295837999,0,0,0,0,0]
[null,"ZN1850:PA4","BASS HILL","URBAN",820,2105.0286675644802,4398.0060453306396,2.1966838290127999,148.41862055170296,0,4,9220.9333333332997,9220.9333333332997,8.0487804878048799,8.0487804878048799,0,0,0,0,0]
[null,"ZN1850:PA8","BASS HILL","URBAN",965,492.22343812320798,6304.7592946162504,5.4917095725320006,182.51268390365416,0,5,4535.6499999999996,4535.6499999999996,2.4870466321243598,2.4870466321243598,0,0,0,0,0]
[null,"ZN1850:PA9","BASS HILL","URBAN",688,2825.02417343361,1539.58109227879,3.111968757608,1729.6431942232994,0.15961702941083228,4,75853.45,75853.45,81.976744186046503,81.976744186046503,1,7,7,0.145348837209302,0.145348837209302]
[null,"ZN187:PA10","CROWS NEST","URBAN",510,0,3843.9490374218499,3.3603459304048,591.38020609874479,0,5,24018,24018,16.2745098039216,16.2745098039216,0,0,0,0,0]
[null,"ZN187:PA13","CROWS NEST","URBAN",1177,0,4651.2581976417596,2.1051553365375999,342.42654740975485,0,2,22199.200000000001,22199.200000000001,13.254035683942201,13.254035683942201,0,0,0,0,0]
[null,"ZN187:PA14","CROWS NEST","URBAN",668,0,4964.4585224644898,2.7458547857856002,1339.6808175248846,0,5,66585.216666666602,66585.216666666602,120.65868263473101,120.65868263473101,0,0,0,0,0]
[null,"ZN187:PA16","CROWS NEST","URBAN",1541,0,4749.8618483719101,3.3865542359943999,1410.0930309943576,0,2,56825.566666666702,56825.566666666702,8.5658663205710504,8.5658663205710504,0,0,0,0,0]
[null,"ZN187:PA17","CROWS NEST","URBAN",1310,0,7140.7782835896996,2.9289117716968001,1855.4427179175384,0,3,86456.033333333296,86456.033333333296,100.76335877862601,100.76335877862601,0,0,0,0,0]
[null,"ZN187:PA19","CROWS NEST","URBAN",307,0,2095.2366335912002,1.0068134220311999,1.6868099651384176,0,1,228.65,228.65,26.058631921824098,26.058631921824098,0,0,0,0,0]
[null,"ZN187:PA20","CROWS NEST","URBAN",2067,0,10110.3839347838,3.935725193728,3329.9013164624357,0,2,115467.733333333,115467.733333333,103.19303338171299,103.19303338171299,0,0,0,0,0]
[null,"ZN187:PA26","CROWS NEST","URBAN",154,0,577.10087206141395,0,0,0,2,4764.7833333333001,4764.7833333333001,15.5844155844156,15.5844155844156,0,0,0,0,0]
[null,"ZN187:PA28","CROWS NEST","URBAN",754,0,3113.0525107635299,2.8373832792216001,3.287317192043953,150.93869177337874,1,158.11666666670001,158.11666666670001,0.13262599469496,0.13262599469496,1,7260,7260,1.4588859416445599,1.4588859416445599]
[null,"ZN187:PA29","CROWS NEST","URBAN",96,0,909.39218150662498,0.51255956035920003,20.900441627317853,0,1,5565,5565,36.4583333333333,36.4583333333333,0,0,0,0,0]
[null,"ZN187:PA30","CROWS NEST","URBAN",1951,0,7287.3430798095596,3.3621028195,5044.0634251904576,0,9,204749.85,172821.85,115.83803177857467,106.201947719118,0,0,0,0,0]
[null,"ZN187:PA4","CROWS NEST","URBAN",1294,0,5831.7569895638599,4.3933676580255998,12.633620812538721,0,1,392.45,392.45,7.7279752704791302E-2,7.7279752704791302E-2,0,0,0,0,0]
[null,"ZN187:PA6","CROWS NEST","URBAN",183,0,4855.48013694973,3.2950257435191999,171.4689291833036,0,1,7102,7102,99.453551912568301,99.453551912568301,0,0,0,0,0]
[null,"ZN187:PA7","CROWS NEST","URBAN",592,0,956.81804208495998,2.3614351162367999,23.982854359974127,16.091810941002084,2,1386.05,1386.05,0.337837837837838,0.337837837837838,1,930,930,0.337837837837838,0.337837837837838]
[null,"ZN187:PA8","CROWS NEST","URBAN",1036,0,2196.95053854656,2.7458547857856002,483.66843742594938,1941.8015219238371,4,24039.433333333302,24039.433333333302,43.629343629343595,43.629343629343595,1,96512,96512,22.393822393822401,22.393822393822401]
[null,"ZN188:PA1","ZETLAND","URBAN",990,0,2962.03689359701,2.3917268669839999,247.29236792358094,0,2,14110.85,14110.85,8.5858585858585794,8.5858585858585794,0,0,0,0,0]
[null,"ZN188:PA10","ZETLAND","URBAN",803,0,2130.46883970216,2.4530813749287996,722.576717606329,290.46865065965864,1,40200,40200,74.719800747197993,74.719800747197993,1,16160,16160,25.155666251556703,25.155666251556703]
[null,"ZN188:PA15","ZETLAND","URBAN",227,0,2474.0034307382598,1.9577683484744002,12.82462802737219,27.542825293685237,1,894,894,0.88105726872246704,0.88105726872246704,1,1920,1920,1.7621145374449299,1.7621145374449299]
[null,"ZN188:PA16","ZETLAND","URBAN",1288,0,1867.7519998830501,1.6388736334288001,19.8381635781898,445.27790888576141,1,1652,1652,2.1739130434782603,2.1739130434782603,2,37080,37080,8.1521739130434803,8.1521739130434803]
[null,"ZN188:PA17","ZETLAND","URBAN",2227,0,7555.8415109875205,3.1037963109863997,409.50426008232284,0,3,18006.083333333299,18006.083333333299,3.8616973506960002,3.8616973506960002,0,0,0,0,0]
[null,"ZN188:PA20","ZETLAND","URBAN",1670,0,3855.3102547276599,4.0854042336039997,0,141.44343773643502,0,0,0,0,0,2,4725,4725,0.8383233532934129,0.8383233532934129]
[null,"ZN188:PA21","ZETLAND","URBAN",1517,0,2552.4309638515301,4.1359056504367997,452.85000316768964,50.912668495062476,2,14943,14943,8.3717864205669095,8.3717864205669095,1,1680,1680,0.26367831245879997,0.26367831245879997]
[null,"ZN188:PA22","ZETLAND","URBAN",68,0,5311.8327681873698,3.2880311435392002,175.1179466520361,0.48185001165393071,3,7268.5666666667003,7268.5666666667003,100,100,1,20,20,2.9411764705882399,2.9411764705882399]
[null,"ZN188:PA26","ZETLAND","URBAN",1063,0,5162.1252309461897,4.1472614465207993,1298.6468860948596,77.946162696462281,2,42735,42735,3.4807149576669798,3.4807149576669798,1,2565,2565,0.84666039510818392,0.84666039510818392]
[null,"ZN188:PA27","ZETLAND","URBAN",175,0,4151.8946103202798,3.2943946881575998,8.5697928994014259,1900.9563611881103,2,355.01666666670002,355.01666666670002,1.1428571428571401,1.1428571428571401,1,78750,78750,71.428571428571402,71.428571428571402]
[null,"ZN188:PA3","ZETLAND","URBAN",878,0,3343.4186622795,1.8738437991824,0,89.933323191349047,0,0,0,0,0,3,6550,6550,1.4806378132118401,1.4806378132118401]
[null,"ZN188:PA31","ZETLAND","URBAN",82,0,3507.1817650630401,2.7763879135127998,26.813776574036346,0,1,1318.05,1318.05,32.9268292682927,32.9268292682927,0,0,0,0,0]
[null,"ZN188:PA32","ZETLAND","URBAN",651,0,3899.6897024243599,1.6537629848104001,172.30119006892031,13.208263392300665,1,14219,14219,9.0629800307219703,9.0629800307219703,2,1090,1090,0.460829493087557,0.460829493087557]
[null,"ZN188:PA37","ZETLAND","URBAN",2287,0,6130.5547172262304,2.7275490880591997,796.73839528358542,503.33888914517803,5,39865.5,39865.5,13.1613467424574,13.1613467424574,1,25185,25185,3.0170529077393997,3.0170529077393997]
[null,"ZN188:PA38","ZETLAND","URBAN",870,0,4478.6287689168703,1.7902539906888,0,1140.8540180088937,0,0,0,0,0,1,86970,86970,25.632183908046002,25.632183908046002]
[null,"ZN188:PA4","ZETLAND","URBAN",845,0,6595.68499231038,2.0693988532384,586.19319928568405,0,3,38659,38659,20,20,0,0,0,0,0]
[null,"ZN188:PA43","ZETLAND","URBAN",618,0,4464.7347321243496,3.4473284937600002,0,2307.3243556099847,0,0,0,0,0,1,91344,91344,28.478964401294498,28.478964401294498]
[null,"ZN188:PA44","ZETLAND","URBAN",1546,0,5420.04834589236,2.9666630208767999,72.002604979551975,0,4,3312.3333333332998,3312.3333333332998,0.25873221216041398,0.25873221216041398,0,0,0,0,0]
[null,"ZN188:PA45","ZETLAND","SHORT RURAL",454,0,8060.2124239168797,2.5614914539191997,4.4923366966179845,0,1,239.35,239.35,0.22026431718061701,0.22026431718061701,0,0,0,0,0]
[null,"ZN188:PA9","ZETLAND","URBAN",674,0,4138.3430084913898,2.3116183087967999,116.35247304451573,0,1,6869.3166666667003,6869.3166666667003,0.89020771513353103,0.89020771513353103,0,0,0,0,0]
[null,"ZN195:PA10","PYMBLE","SHORT RURAL",212,0,1781.0374663590301,2.5495546063487997,160.11921709624619,0,4,8571.0333333333001,8571.0333333333001,40.094339622641499,40.094339622641499,0,0,0,0,0]
[null,"ZN195:PA11","PYMBLE","URBAN",1278,1244.8179561048701,8090.1409699015903,3.8962123091007994,5254.9177097051697,21.41163508558202,12,184067.6,184067.6,117.057902973396,117.057902973396,1,750,750,0.15649452269170602,0.15649452269170602]
[null,"ZN195:PA22","PYMBLE","URBAN",658,1.39997039115265,3471.1694044060901,4.5473779189671992,3406.6942294482797,9.9960463006319245,3,102241.25,102061,17.325227963525879,17.1732522796353,1,300,300,0.151975683890578,0.151975683890578]
[null,"ZN195:PA25","PYMBLE","URBAN",766,2.7862534106307999,5123.7617323258601,3.8866883858263996,4575.446546522473,0,7,160660.01666666701,160660.01666666701,218.92950391644899,218.92950391644899,0,0,0,0,0]
[null,"ZN195:PA28","PYMBLE","URBAN",899,7.5431879590270601,8547.7011389575091,2.7415993833696,1962.8777823504613,138.31009959799383,9,97710.966666666704,97710.966666666704,123.58175750834199,123.58175750834199,1,6885,6885,1.8909899888765298,1.8909899888765298]
[null,"ZN195:PA29","PYMBLE","URBAN",1109,572.94506550547703,6194.1882925931004,3.2455594426448,8031.3797401536121,0,17,337718.33333333302,337718.33333333302,222.72317403065801,222.72317403065801,0,0,0,0,0]
[null,"ZN195:PA3","PYMBLE","URBAN",289,439.76778005871398,2272.8618557515802,2.0959071984127999,4.5483532017033479,0,1,296.1666666667,296.1666666667,0.34602076124567499,0.34602076124567499,0,0,0,0,0]
[null,"ZN195:PA30","PYMBLE","SHORT RURAL",1235,5642.6975420093604,6758.5076551702796,3.5961474792807997,737.33753167145608,0,8,27982.266666666699,27982.266666666699,9.6356275303643795,9.6356275303643795,0,0,0,0,0]
[null,"ZN195:PA4","PYMBLE","URBAN",1124,0,3879.8025465863402,2.2114704920119999,13.286078653566859,0,3,819.91666666670005,819.91666666670005,0.97864768683274006,0.97864768683274006,0,0,0,0,0]
[null,"ZN195:PA8","PYMBLE","URBAN",353,0,1160.95381870596,1.1785258830031999,27.443898623377795,0,1,3178.05,3178.05,2.5495750708215299,2.5495750708215299,0,0,0,0,0]
[null,"ZN195:PA9","PYMBLE","URBAN",1324,2260.5298365158401,12229.195652950801,4.2381302806184005,3531.7225504583353,352.15455735897928,6,113727.71666666699,113727.71666666699,101.96374622356501,101.96374622356501,1,11340,11340,2.0392749244713002,2.0392749244713002]
[null,"ZN2196:PA1","MILPERRA","URBAN",11,0,1536.1483663988799,0.37652560319759998,0,1.2415178911910405,0,0,0,0,0,1,450,450,9.0909090909090899,9.0909090909090899]
[null,"ZN2196:PA10","MILPERRA","URBAN",36,0,1318.99269977425,2.0740158114199998,0,44.04092173859361,0,0,0,0,0,3,2898,2898,25,25]
[null,"ZN2196:PA11","MILPERRA","URBAN",104,0,2980.5887344398202,3.2945831999999999,109.79103804814424,7.4111364733465885,2,4548,4548,25.961538461538503,25.961538461538503,1,307,307,0.9615384615384619,0.9615384615384619]
[null,"ZN2196:PA12","MILPERRA","URBAN",8,0,881.581021586578,1.9041347207592001,50.311741498007414,0,1,3606,3606,37.5,37.5,0,0,0,0,0]
[null,"ZN2196:PA13","MILPERRA","URBAN",31,2.9431113662906001,846.59829083126101,1.4695248884200001,26.251649846345764,0,1,2438,2438,100,100,0,0,0,0,0]
[null,"ZN2196:PA17","MILPERRA","URBAN",98,0,3472.7181533152998,3.9994266372640004,3.3979301226562786,0,1,115.95,115.95,1.0204081632653099,1.0204081632653099,0,0,0,0,0]
[null,"ZN2196:PA18","MILPERRA","URBAN",932,1980.8057506627299,6417.9239454144099,4.9423551999999997,4.1229962992897127,162.23999491276163,1,113.85,113.85,0.10729613733905601,0.10729613733905601,1,4480,4480,1.5021459227467802,1.5021459227467802]
[null,"ZN2196:PA2","MILPERRA","URBAN",739,903.95812640462395,7019.7305799142796,4.5381395521784,5.8546500972781574,0,1,176.0666666667,176.0666666667,0.13531799729364,0.13531799729364,0,0,0,0,0]
[null,"ZN2196:PA21","MILPERRA","URBAN",674,0.89989265587963996,2826.1071763008599,1.6927233537112001,165.46337503726141,0,4,13340.4333333334,13340.4333333334,13.501483679525201,13.501483679525201,0,0,0,0,0]
[null,"ZN2196:PA22","MILPERRA","URBAN",24,0,1303.72765436023,1.1950993361543998,9.2472772570220361,0,1,1056,1056,100,100,0,0,0,0,0]
[null,"ZN2196:PA25","MILPERRA","URBAN",2176,4480.2711735128896,7590.5622098227504,5.4308171036992006,25182.243410004434,644.65320676122985,14,632824.5,632824.5,222.61029411764702,222.61029411764702,1,16200,16200,2.0680147058823501,2.0680147058823501]
[null,"ZN2196:PA26","MILPERRA","URBAN",64,0,3872.77734125711,3.169101576648,7.2047221203275749,585.17081252331991,1,310.26666666670002,310.26666666670002,1.5625,1.5625,1,25200,25200,23.4375,23.4375]
[null,"ZN2196:PA3","MILPERRA","SHORT RURAL",954,4067.6005813707302,2805.0684040078199,4.3150882641528003,4793.3035855049366,0,4,151600.03333333301,151600.03333333301,175.15723270440299,175.15723270440299,0,0,0,0,0]
[null,"ZN2196:PA4","MILPERRA","URBAN",43,0,1069.3841167901901,1.7423937582904001,0.56175240300046847,87.901483969505108,1,44,44,2.32558139534884,2.32558139534884,2,6885,6885,34.883720930232499,34.883720930232499]
[null,"ZN2196:PA5","MILPERRA","URBAN",1588,6372.4595248114201,5580.4618618917802,5.4110126425231995,9841.2279294674336,0,5,248213.15,248213.15,103.14861460957201,103.14861460957201,0,0,0,0,0]
[null,"ZN2196:PA9","MILPERRA","URBAN",1465,1012.86241673108,5787.7302852905596,4.0152944135608006,3398.0467824089528,13.239630480636984,7,115495.75,115495.75,27.9863481228669,27.9863481228669,1,450,450,6.8259385665528999E-2,6.8259385665528999E-2]
[null,"ZN2310:PA53","PUNCHBOWL","URBAN",2487,0,7853.2322885481799,4.3805326988119999,325.75557390801288,770.3429705477746,8,10148.9,10148.9,4.3023723361479798,4.3023723361479798,1,24000,24000,2.0104543626859699,2.0104543626859699]
[null,"ZN2310:PA54","PUNCHBOWL","URBAN",1099,0,7517.7383039225997,2.7908819312440003,2866.6233586490393,0,5,140179.08333333299,140179.08333333299,112.192902638763,112.192902638763,0,0,0,0,0]
[null,"ZN2310:PA55","PUNCHBOWL","URBAN",966,0,5614.5888273948603,3.0416679141912,0,18.052725191670376,0,0,0,0,0,1,810,810,0.10351966873706001,0.10351966873706001]
[null,"ZN2310:PA59","PUNCHBOWL","URBAN",1602,0,7367.8161113252499,2.9041257373864,12.871968133661301,0,3,604.9,604.9,0.37453183520599298,0.37453183520599298,0,0,0,0,0]
[null,"ZN2310:PA61","PUNCHBOWL","URBAN",2140,0,9804.9606890757295,3.7229547155103999,16.198921177545266,0,3,593.81666666670003,593.81666666670003,0.14018691588785001,0.14018691588785001,0,0,0,0,0]
[null,"ZN2310:PA62","PUNCHBOWL","URBAN",2073,0,7559.6306776115598,4.8875814725927995,401.62659434165136,0,5,11214.5666666667,11214.5666666667,5.9816690786300004,5.9816690786300004,0,0,0,0,0]
[null,"ZN2310:PA65","PUNCHBOWL","URBAN",2236,0,10507.201923954501,4.9685291224007999,5532.6728763105557,0,8,151971.16666666701,151971.16666666701,99.910554561717305,99.910554561717305,0,0,0,0,0]
[null,"ZN2310:PA66","PUNCHBOWL","URBAN",760,0,7123.2179196207398,3.2401086474575997,129.67093647978965,0,1,5461.8166666667003,5461.8166666667003,4.8684210526315805,4.8684210526315805,0,0,0,0,0]
[null,"ZN2310:PA67","PUNCHBOWL","URBAN",1157,0,6361.3720381777603,2.4444713060056,419.36540580948127,0,3,23413.25,23413.25,8.5566119273984409,8.5566119273984409,0,0,0,0,0]
[null,"ZN2310:PA71","PUNCHBOWL","URBAN",1121,0,4182.8256779776402,2.8081574755439997,271.61375771545704,0,4,13200.3166666667,13200.3166666667,8.92060660124889,8.92060660124889,0,0,0,0,0]
[null,"ZN2310:PA72","PUNCHBOWL","URBAN",1319,0,4796.6609159163499,2.2162314193479999,1473.0998625901711,0,4,90713.333333333299,90713.333333333299,52.3881728582259,52.3881728582259,0,0,0,0,0]
[null,"ZN2400:PA11","BEROWRA","SHORT RURAL",702,21457.260259009301,1761.84773793516,1.7538981065447998,9542.1139616470846,2137.624146172413,12,742496.28333333298,742496.28333333298,620.37037037036998,620.37037037036998,4,166334,166334,45.726495726495699,45.726495726495699]
[null,"ZN2400:PA13","BEROWRA","URBAN",71,402.10530958257198,4354.2803754414099,3.7582422678792002,0,68.156288349521944,0,0,0,0,0,2,2475,2475,7.0422535211267592,7.0422535211267592]
[null,"ZN2400:PA15","BEROWRA","SHORT RURAL",1230,4123.5639088089101,9083.0242830406696,4.5430609946055993,5585.5089795650338,0,6,167790.83333333299,167790.83333333299,101.707317073171,101.707317073171,0,0,0,0,0]
[null,"ZN2400:PA18","BEROWRA","SHORT RURAL",1348,16840.8341372059,3926.02105871188,4.2284247815168001,9938.5525462098631,4149.8425301049892,17,320773.566666667,320773.566666667,142.359050445104,142.359050445104,14,133939,132539,70.178041543026708,69.881305637982209]
[null,"ZN2400:PA21","BEROWRA","URBAN",1480,10248.4592993632,3995.1214399452001,4.9791500121727994,19807.992978633854,608.77022919980504,21,542924.33333333302,478068.33333333302,238.10810810810841,221.756756756757,3,16686,16686,1.08108108108108,1.08108108108108]
[null,"ZN2400:PA22","BEROWRA","URBAN",1392,6537.5378199753104,8224.4648616534505,3.5713398212056,230.38657364341688,292.0393187029228,2,8804,8804,4.4540229885057405,4.4540229885057405,1,11160,11160,2.2270114942528703,2.2270114942528703]
[null,"ZN2400:PA23","BEROWRA","URBAN",316,1958.6407594344901,3401.9370126477202,2.1453008685719999,140.02469066150874,0,2,8907.7999999999993,8907.7999999999993,12.6582278481013,12.6582278481013,0,0,0,0,0]
[null,"ZN2400:PA26","BEROWRA","URBAN",985,4835.5783314096598,2508.71120308544,3.0292220597616,2334.8875624711272,0,7,105193.5,105193.5,30.558375634517798,30.558375634517798,0,0,0,0,0]
[null,"ZN2466:PA11","FLEMINGTON","URBAN",83,0,2110.85183776134,2.4218806045759997,8.5002989208258377,19.16560090708122,1,479,479,1.2048192771084301,1.2048192771084301,1,1080,1080,2.4096385542168699,2.4096385542168699]
[null,"ZN2466:PA15","FLEMINGTON","URBAN",433,0,4979.7131506758597,3.8258910025655997,527.42469200038011,0,1,18814.0333333333,18814.0333333333,5.0808314087759801,5.0808314087759801,0,0,0,0,0]
[null,"ZN2466:PA16","FLEMINGTON","URBAN",1403,0,6950.1934829664997,4.6862588350992,526.86174458066353,255.11941237077306,6,15343.5,15343.5,7.8403421240199407,7.8403421240199407,4,7429.7,7429.7,1.7106200997861702,1.7106200997861702]
[null,"ZN2466:PA19","FLEMINGTON","URBAN",23,0,3151.4527495910602,3.3215703598544,49.820405127980983,0,1,2047,2047,100,100,0,0,0,0,0]
[null,"ZN2466:PA2","FLEMINGTON","URBAN",132,0,5169.8080572137296,2.4410946013079999,33.788002985484624,34.610791835316441,2,1889,1889,3.7878787878787898,3.7878787878787898,1,1935,1935,2.2727272727272698,2.2727272727272698]
[null,"ZN2466:PA20","FLEMINGTON","URBAN",740,0,8291.2753570389195,6.2790734949687996,4162.8821282446488,152.97947697185518,5,90480,90480,102.43243243243201,102.43243243243201,1,3325,3325,0.67567567567567599,0.67567567567567599]
[null,"ZN2466:PA21","FLEMINGTON","URBAN",8,0,3445.98052927668,4.5436035391495997,1.5647474152096144,0,1,47,47,12.5,12.5,0,0,0,0,0]
[null,"ZN2466:PA22","FLEMINGTON","URBAN",60,0,4835.8159252042697,5.8369767468079994,149.47931499833572,103.28828203747662,2,3495,3495,18.3333333333333,18.3333333333333,5,2415,2415,11.6666666666667,11.6666666666667]
[null,"ZN2466:PA25","FLEMINGTON","URBAN",1209,0,6054.4341173630201,1.782916331304,157.78726342786834,0,2,12078,12078,105.624483043838,105.624483043838,0,0,0,0,0]
[null,"ZN2466:PA26","FLEMINGTON","URBAN",24,0,4957.92297325654,2.2222686147952002,2.7355949302204379,0,1,168,168,100,100,0,0,0,0,0]
[null,"ZN2466:PA27","FLEMINGTON","URBAN",86,0,4773.0149099499104,4.1768842162480002,192.75295679042438,0,5,6298,5430,205.81395348837185,203.488372093023,0,0,0,0,0]
[null,"ZN2466:PA28","FLEMINGTON","SHORT RURAL",534,0,2718.36628096595,1.0325530388120001,28.228225227715146,0,1,3731,3731,99.812734082397,99.812734082397,0,0,0,0,0]
[null,"ZN2466:PA29","FLEMINGTON","URBAN",11,0,882.39642543933201,4.1920049734272,1.9351217506546476,0,1,63,63,81.818181818181799,81.818181818181799,0,0,0,0,0]
[null,"ZN2466:PA30","FLEMINGTON","URBAN",1858,0,6293.08907042394,3.6528788366880001,5335.4800234602762,0,2,199339,199339,199.19268030139901,199.19268030139901,0,0,0,0,0]
[null,"ZN2466:PA31","FLEMINGTON","URBAN",6,0,1674.6368653424499,2.3014414489016,0.59022001191136064,3.5413200714681636,1,35,35,83.3333333333333,83.3333333333333,1,210,210,50,50]
[null,"ZN2466:PA32","FLEMINGTON","URBAN",38,0,1849.39865043893,3.390556613652,6.4345283723367368,0,1,259,259,97.368421052631604,97.368421052631604,0,0,0,0,0]
[null,"ZN2466:PA39","FLEMINGTON","URBAN",5,0,1650.54661973016,3.7446547543791997,0.96034169141624859,59.541184867807409,1,35,35,100,100,2,2170,2170,80,80]
[null,"ZN2466:PA40","FLEMINGTON","URBAN",848,0,4516.4960136905001,4.0821707822648001,410.50242348598471,102.89530723396528,2,13723.9333333333,13723.9333333333,112.85377358490601,112.85377358490601,1,3440,3440,0.94339622641509391,0.94339622641509391]
[null,"ZN2466:PA41","FLEMINGTON","URBAN",1170,0,8783.7167627334802,4.7224243338407996,316.24516702366276,3159.406625791421,5,9139.2999999999993,9139.2999999999993,99.658119658119702,99.658119658119702,3,91305,91305,14.273504273504301,14.273504273504301]
[null,"ZN2466:PA44","FLEMINGTON","URBAN",21,0,1556.1827949676201,2.9185415248599997,3.1436136602271403,37.423972145561194,1,147,147,100,100,1,1750,1750,33.3333333333333,33.3333333333333]
[null,"ZN2466:PA45","FLEMINGTON","URBAN",2014,0,10509.899060776601,5.4835211045704,1307.403601349157,0,4,32539,32539,109.58291956305899,109.58291956305899,0,0,0,0,0]
[null,"ZN2466:PA5","FLEMINGTON","URBAN",1239,0,7219.2654949560301,3.1964678095735999,1397.1229486344785,185.49895718325999,2,59651.083333333299,59651.083333333299,6.6989507667473802,6.6989507667473802,2,7920,7920,2.4213075060532701,2.4213075060532701]
[null,"ZN2466:PA6","FLEMINGTON","URBAN",24,0,2791.2430789974001,1.9821357113024001,39.606318880733539,0,1,2727,2727,95.8333333333333,95.8333333333333,0,0,0,0,0]
[null,"ZN2466:PA7","FLEMINGTON","URBAN",278,0,7783.0304755830603,4.8327044236360006,1059.5105319749487,0,3,29920.516666666601,29920.516666666601,99.640287769784194,99.640287769784194,0,0,0,0,0]
[null,"ZN2568:PA14","ST  PETERS","URBAN",1372,0,7887.3661738508499,6.5900514870122215,45.011197504247129,0,2,932.15,932.15,0.14577259475218701,0.14577259475218701,0,0,0,0,0]
[null,"ZN2568:PA15","ST  PETERS","URBAN",1,0,3133.5773661599301,2.837383279130262,0,40.271108258350274,0,0,0,0,0,3,1937,1937,300,300]
[null,"ZN2568:PA16","ST  PETERS","URBAN",1595,0,1522.59739350428,1.9587097475286324,614.95411262954747,0,3,42847.616666666698,42847.616666666698,10.846394984325999,10.846394984325999,0,0,0,0,0]
[null,"ZN2568:PA17","ST  PETERS","URBAN",188,0,2284.8183373104998,1.3729273931275461,508.74910158075085,0,1,50572,50572,25,25,0,0,0,0,0]
[null,"ZN2568:PA18","ST  PETERS","URBAN",1,0,2998.4876132528698,1.8671812546534627,0,26.500987370011149,0,0,0,0,0,3,1937,1937,300,300]
[null,"ZN2568:PA19","ST  PETERS","URBAN",1027,0,6589.0381199749299,4.2103106722578083,4.2470648808007274,0,1,137.6666666667,137.6666666667,9.7370983446932791E-2,9.7370983446932791E-2,0,0,0,0,0]
[null,"ZN2568:PA22","ST  PETERS","URBAN",721,0,1582.96961447018,1.1898704073772066,3.779503232300248,0,2,433.5,433.5,0.27739251040221902,0.27739251040221902,0,0,0,0,0]
[null,"ZN2568:PA25","ST  PETERS","URBAN",322,0,3662.65646701266,3.3865542363812806,14.623133072025167,0,2,589.29999999999995,220.3,0.62111801242236009,0.31055900621118004,0,0,0,0,0]
[null,"ZN2568:PA26","ST  PETERS","URBAN",2786,0,6802.2197268290201,4.6130360409085549,129.73202689277156,0,2,3838.0833333332998,3838.0833333332998,1.83058147882269,1.83058147882269,0,0,0,0,0]
[null,"ZN2568:PA27","ST  PETERS","URBAN",2357,0,6566.9544763580898,4.3567562608580799,2547.8128762010983,0,5,79810.183333333305,79810.183333333305,18.5405176071277,18.5405176071277,0,0,0,0,0]
[null,"ZN2568:PA28","ST  PETERS","URBAN",324,0,3796.2663643481401,3.0753573606057034,6.2318243979757764,0,1,276.55,276.55,0.30864197530864201,0.30864197530864201,0,0,0,0,0]
[null,"ZN2568:PA29","ST  PETERS","URBAN",1804,0,4793.0478225157403,3.1668858534808733,256.68601328088818,0,3,11061.75,11061.75,4.7671840354767205,4.7671840354767205,0,0,0,0,0]
[null,"ZN2568:PA30","ST  PETERS","URBAN",64,0,2538.48302979447,0.80545073730149375,165.40205132384307,0,4,28025.666666666701,28025.666666666701,117.1875,117.1875,0,0,0,0,0]
[null,"ZN2568:PA32","ST  PETERS","URBAN",2404,0,4079.5472343838601,3.8075853036070613,198.25626145549558,0,4,7106.1000000001004,7106.1000000001004,1.4975041597337801,1.4975041597337801,0,0,0,0,0]
[null,"ZN2568:PA33","ST  PETERS","URBAN",30,0,1921.29168762264,1.5925957760279534,14.551841936616858,0,1,1247,1247,96.6666666666667,96.6666666666667,0,0,0,0,0]
[null,"ZN2568:PA38","ST  PETERS","URBAN",759,0,4874.9495292791398,2.7092433891050245,93.475890518104208,627.1098235130155,3,4708.75,4708.75,73.517786561264799,73.517786561264799,1,31590,31590,10.671936758893299,10.671936758893299]
[null,"ZN2568:PA39","ST  PETERS","URBAN",555,0,3346.8697621578099,3.6245283178567216,32.612495402115272,0,2,1227.9666666666999,1227.9666666666999,103.60360360360299,103.60360360360299,0,0,0,0,0]
[null,"ZN2568:PA40","ST  PETERS","URBAN",344,0,3812.48179720903,2.1051553361289042,100.17031591768476,9.8721120715925199,2,6493.95,6493.95,21.511627906976699,21.511627906976699,1,640,640,0.581395348837209,0.581395348837209]
[null,"ZN2568:PA42","ST  PETERS","URBAN",373,0,4984.1219689272802,2.2149895275791076,6.4405918476848676,0,2,396.8333333333,396.8333333333,0.53619302949061698,0.53619302949061698,0,0,0,0,0]
[null,"ZN2568:PA43","ST  PETERS","URBAN",283,0,2995.43497794617,0.82375643587652769,15.512360884234713,0,2,2570,2570,99.646643109540605,99.646643109540605,0,0,0,0,0]
[null,"ZN2568:PA6","ST  PETERS","URBAN",96,0,5527.2352307649599,6.2971603098116784,0,15.68807374855246,0,0,0,0,0,1,340,340,1.0416666666666701,1.0416666666666701]
[null,"ZN2568:PA8","ST  PETERS","URBAN",5,0,6359.1337519437102,4.5215075480333846,8.4483013427887865,0,1,255,255,100,100,0,0,0,0,0]
[null,"ZN2568:PA9","ST  PETERS","URBAN",1167,0,4213.9237970634604,3.3865542363812806,119.9694112091465,0,5,4834.6666666665997,4834.6666666665997,8.14053127677807,8.14053127677807,0,0,0,0,0]
[null,"ZN2602:PA10","CLOVELLY","URBAN",699,0,3195.2065303858399,1.9280325060383998,30.52211174877128,0,4,2160.5,2160.5,0.57224606580829696,0.57224606580829696,0,0,0,0,0]
[null,"ZN2602:PA15","CLOVELLY","URBAN",2044,0,6304.2791774034804,4.0272536862032,198.58200537033198,0,12,6729.5333333334002,6729.5333333334002,0.88062622309197702,0.88062622309197702,0,0,0,0,0]
[null,"ZN2602:PA17","CLOVELLY","URBAN",1563,0,4423.63699167714,2.72587984314,3105.2466118810512,0,4,155468.86666666699,155468.86666666699,105.37428023032601,105.37428023032601,0,0,0,0,0]
[null,"ZN2602:PA18","CLOVELLY","URBAN",1280,0,2592.0946928768099,3.111968757608,0,810.99132400366591,0,0,0,0,0,2,35566,35566,20.703125,20.703125]
[null,"ZN2602:PA20","CLOVELLY","URBAN",1494,0,5048.1774218620403,2.976811657272,212.71151758238221,0,1,9752,9752,3.0789825970548903,3.0789825970548903,0,0,0,0,0]
[null,"ZN2602:PA21","CLOVELLY","URBAN",1884,0,5745.1413062665997,3.8274111101871999,0,807.68786269179759,0,0,0,0,0,1,28800,28800,4.2462845010615702,4.2462845010615702]
[null,"ZN2602:PA22","CLOVELLY","URBAN",520,0,2208.1690893682699,1.0068134220311999,1.0704400872144515,0,1,145.1,145.1,0.19230769230769199,0.19230769230769199,0,0,0,0,0]
[null,"ZN2602:PA27","CLOVELLY","URBAN",2006,0,6292.8250780036296,3.6611397153415997,5898.1054295885051,2050.6093663628867,4,219862.05,219862.05,12.7617148554337,12.7617148554337,2,76440,76440,7.4775672981056811,7.4775672981056811]
[null,"ZN2602:PA28","CLOVELLY","URBAN",1232,0,3732.8830877600599,3.2950257435191999,36.700515549995053,2727.7611404012446,6,1520.0833333334001,1520.0833333334001,0.48701298701298701,0.48701298701298701,2,112980,112980,11.8506493506493,11.8506493506493]
[null,"ZN2602:PA29","CLOVELLY","URBAN",2193,0,6383.1313547487998,5.2624746343152005,2317.2177309407175,905.7722017539877,8,60093.966666666704,60093.966666666704,110.9439124487,110.9439124487,1,23490,23490,3.9671682626539,3.9671682626539]
[null,"ZN2602:PA3","CLOVELLY","URBAN",1530,0,3235.5398734420501,3.111968757608,2535.6214033818264,0,5,111199.6,111199.6,115.62091503267899,115.62091503267899,0,0,0,0,0]
[null,"ZN2602:PA30","CLOVELLY","URBAN",1916,0,5778.3092323286901,4.2103106721144004,4300.6910161020987,0,8,139404.933333333,139404.933333333,99.947807933194198,99.947807933194198,0,0,0,0,0]
[null,"ZN2602:PA31","CLOVELLY","URBAN",1108,0,3510.9368056443,2.5627978008351997,421.51790324076063,0,4,22446.866666666599,22446.866666666599,8.3032490974729196,8.3032490974729196,0,0,0,0,0]
[null,"ZN2602:PA32","CLOVELLY","URBAN",1019,0,5887.6836622666897,3.111968757608,369.71598469720925,0,2,16213.8833333333,16213.8833333333,103.925417075564,103.925417075564,0,0,0,0,0]
[null,"ZN2602:PA33","CLOVELLY","URBAN",1614,0,3019.3490778250498,3.111968757608,6.1433554295867214,0,1,269.4166666667,269.4166666667,6.1957868649318494E-2,6.1957868649318494E-2,0,0,0,0,0]
[null,"ZN2602:PA34","CLOVELLY","URBAN",1234,0,3043.9546224127698,3.111968757608,312.51684216729285,0,2,13705.416666666701,13705.416666666701,110.129659643436,110.129659643436,0,0,0,0,0]
[null,"ZN2602:PA35","CLOVELLY","URBAN",1049,0,4328.5231690737701,2.0136268431016,124.10022838407659,321.35334374095686,2,8411,8411,101.334604385129,101.334604385129,1,21780,21780,4.1944709246901803,4.1944709246901803]
[null,"ZN2602:PA36","CLOVELLY","URBAN",1319,0,7060.2073821638496,4.0272536862032,691.88004433415028,3881.9129815539827,6,23446.383333333299,23446.383333333299,112.81273692191101,112.81273692191101,3,131550,131550,17.8165276724792,17.8165276724792]
[null,"ZN2602:PA4","CLOVELLY","URBAN",1770,0,3615.9735463934899,3.111968757608,2886.4573537835586,0,4,126585.5,126585.5,103.785310734463,103.785310734463,0,0,0,0,0]
[null,"ZN2602:PA41","CLOVELLY","URBAN",1392,0,4003.62825011016,3.111968757608,238.22385590911256,0,4,10447.299999999999,10447.299999999999,104.23850574712601,104.23850574712601,0,0,0,0,0]
[null,"ZN2602:PA42","CLOVELLY","URBAN",2650,0,9875.6041398416692,4.5581189452495998,587.16638622214828,932.83008764580859,5,17580.433333333302,17580.433333333302,4.3396226415094397,4.3396226415094397,2,27930,27930,4.11320754716981,4.11320754716981]
[null,"ZN2602:PA8","CLOVELLY","URBAN",1011,0,6854.6503619928399,2.9289117716968001,417.39969436212903,900.61561530592451,2,19449.116666666701,19449.116666666701,5.44015825914936,5.44015825914936,1,41965,41965,7.6162215628091001,7.6162215628091001]
[null,"ZN2602:PA9","CLOVELLY","URBAN",1042,0,3691.0512892018201,2.3797408149239998,33.386338435799978,0,6,1914.6666666665999,1914.6666666665999,0.575815738963532,0.575815738963532,0,0,0,0,0]
[null,"ZN262:PA14","MARRICKVILLE","URBAN",19,0,1487.43938984694,1.1898704069816,1.0982501122735644,4.9695890235175932,1,125.96666666669999,125.96666666669999,10.526315789473701,10.526315789473701,2,570,570,21.052631578947402,21.052631578947402]
[null,"ZN262:PA15","MARRICKVILLE","URBAN",2594,0,8160.4384018711498,4.2103106721144004,4138.5821949595174,409.07564395268145,8,134150.25,111530.25,17.77178103315342,11.063993831919799,1,13260,13260,0.65535851966075598,0.65535851966075598]
[null,"ZN262:PA16","MARRICKVILLE","URBAN",2406,3.3501609777988399,8694.6493952556393,3.6611397153415997,1115.5508997245984,0,3,41584.083333333401,41584.083333333401,9.5594347464671703,9.5594347464671703,0,0,0,0,0]
[null,"ZN262:PA17","MARRICKVILLE","URBAN",1663,0,4351.8693977530102,2.8373832792216001,625.87303746375972,0,2,30103.866666666701,30103.866666666701,4.2092603728202098,4.2092603728202098,0,0,0,0,0]
[null,"ZN262:PA19","MARRICKVILLE","URBAN",3408,0,11239.4952390778,5.9493520368296,587.66407389420544,5787.6095343896495,5,13480.733333333301,13480.733333333301,1.46713615023474,1.46713615023474,3,132765,132765,8.5680751173708902,8.5680751173708902]
[null,"ZN262:PA20","MARRICKVILLE","URBAN",619,0,3674.7164205030199,1.8069485901511999,271.69465939311385,0,4,20520.5666666666,20520.5666666666,7.108239095315021,7.108239095315021,0,0,0,0,0]
[null,"ZN262:PA27","MARRICKVILLE","URBAN",1093,0,3894.6365793109399,2.9289117716968001,1413.2829795749819,0,2,65853.2,65853.2,99.908508691674299,99.908508691674299,0,0,0,0,0]
[null,"ZN262:PA28","MARRICKVILLE","URBAN",156,0,4332.7751571151703,2.1966838290127999,0,1.9315001879279483,0,0,0,0,0,1,120,120,0.64102564102564097,0.64102564102564097]
[null,"ZN262:PA29","MARRICKVILLE","URBAN",428,0,1851.1880393664501,1.2813989004175999,2.3768853530871175,0,1,253.15,253.15,0.233644859813084,0.233644859813084,0,0,0,0,0]
[null,"ZN262:PA30","MARRICKVILLE","URBAN",2062,0,8221.8372213839502,4.9425386147983996,8291.2645419977816,706.20475614251507,6,228941.61666666699,228941.61666666699,112.22114451988401,112.22114451988401,1,19500,19500,2.4248302618816697,2.4248302618816697]
[null,"ZN262:PA31","MARRICKVILLE","URBAN",1362,0,4245.9463104647002,2.3797408149239998,95.647732825343837,0,4,5485.2833333333001,5485.2833333333001,1.39500734214391,1.39500734214391,0,0,0,0,0]
[null,"ZN262:PA34","MARRICKVILLE","URBAN",421,0.39743029010504599,4818.9959531774603,2.4712693073991998,38.830396899282292,0,2,2144.4,2144.4,4.2755344418052301,4.2755344418052301,0,0,0,0,0]
[null,"ZN262:PA39","MARRICKVILLE","URBAN",792,0,1242.36710830373,2.9289117716968001,1066.5887110659853,0,5,49698.666666666701,49698.666666666701,16.414141414141401,16.414141414141401,0,0,0,0,0]
[null,"ZN262:PA40","MARRICKVILLE","URBAN",540,0,2795.2981471451999,2.3797408149239998,2.7989539125632628,0,1,160.51666666669999,160.51666666669999,0.18518518518518501,0.18518518518518501,0,0,0,0,0]
[null,"ZN262:PA41","MARRICKVILLE","URBAN",1219,0,6476.6237065547502,2.3797408149239998,100.51618635490982,0,3,5764.4833333332999,5764.4833333332999,0.82034454470877805,0.82034454470877805,0,0,0,0,0]
[null,"ZN262:PA42","MARRICKVILLE","URBAN",2108,0,9863.5084014706608,3.6611397153415997,851.00109861449425,0,6,31722.533333333198,31722.533333333198,14.089184060721099,14.089184060721099,0,0,0,0,0]
[null,"ZN262:PA5","MARRICKVILLE","URBAN",1425,0,6458.6495479784498,2.9289117716968001,2358.5838517237335,0,4,109900.35,109900.35,99.719298245613999,99.719298245613999,0,0,0,0,0]
[null,"ZN262:PA6","MARRICKVILLE","URBAN",1280,0,6104.9528699122002,3.111968757608,792.37921829327104,0,4,34749.766666666699,34749.766666666699,10.546875,10.546875,0,0,0,0,0]
[null,"ZN262:PA7","MARRICKVILLE","URBAN",2244,0,8515.4007633083093,3.935725193728,122.23047361960545,0,4,4238.4666666666999,4238.4666666666999,1.7825311942958999,1.7825311942958999,0,0,0,0,0]
[null,"ZN263:PA31 32ABC","DALLEY ST","CBD",454,0,1377.52327088477,6.0042691326111353,0,2243.7593849673872,0,0,0,0,0,2,51000,51000,18.281938325991202,18.281938325991202]
[null,"ZN263:PA31 32DEF","DALLEY ST","CBD",255,0,2513.92356839182,4.1370878779576721,114.58624864837034,0,1,3780,3780,10.588235294117601,10.588235294117601,0,0,0,0,0]
[null,"ZN263:PA31 32GHJ","DALLEY ST","CBD",691,0,4793.4685990993603,11.239698925070845,0,169.24368000778935,0,0,0,0,0,2,2055,2055,0.86830680173661401,0.86830680173661401]
[null,"ZN263:PA31 32KLM","DALLEY ST","CBD",619,0,4463.3011795157399,10.910196350720232,2161.6491658675759,3367.5839908347498,2,27040,27040,8.4006462035541194,8.4006462035541194,1,42125,42125,4.03877221324717,4.03877221324717]
[null,"ZN263:PA33 34ABC","DALLEY ST","CBD",314,0,4464.8125990975404,9.3359062732673141,0,6675.0473556813322,0,0,0,0,0,4,97578,97578,51.910828025477699,51.910828025477699]
[null,"ZN263:PA33 34DEF","DALLEY ST","CBD",1101,0,11006.7074274934,12.081761059522407,0,2900.1475321622938,0,0,0,0,0,3,32760,32760,5.4495912806539604,5.4495912806539604]
[null,"ZN263:PA33 34GHJ","DALLEY ST","CBD",575,0,4005.10334689305,9.5006575604426189,16977.511216470197,1681.0506064701033,1,243879,243879,97.565217391304401,97.565217391304401,5,24148,24148,12.521739130434801,12.521739130434801]
[null,"ZN263:PA33 34KLM","DALLEY ST","CBD",697,0,6128.7059668519796,7.6700877029392238,1177.4507502583901,4465.7545185117215,3,20950.599999999999,20950.599999999999,1.2912482065997199,1.2912482065997199,4,79460,79460,21.951219512195099,21.951219512195099]
[null,"ZN263:PA35 37DEF","DALLEY ST","CBD",376,0,6007.2683103794097,16.749714196156063,309.95648666682501,3667.1945442901333,2,2525.5,2525.5,3.7234042553191502,3.7234042553191502,2,29880,29880,4.2553191489361799,4.2553191489361799]
[null,"ZN263:PA35 37GHJ","DALLEY ST","CBD",182,0,2264.0437808439601,3.9357251936322992,0,673.52015146588747,0,0,0,0,0,1,23355,23355,14.835164835164798,14.835164835164798]
[null,"ZN2635:PA31","EPPING","URBAN",1674,9.3343641807720807,9387.7856981435998,3.6611397153415997,9979.6724892199672,1817.0856283436699,12,372009.5,365481.5,297.67025089605727,200.17921146953398,2,67735,67735,9.8566308243727594,9.8566308243727594]
[null,"ZN2635:PA32","EPPING","URBAN",497,2251.9040726575599,2281.4448678025401,2.677412368808,1372.4313795343285,0,4,69956.716666666704,67980.716666666704,203.01810865191169,103.621730382294,0,0,0,0,0]
[null,"ZN2635:PA33","EPPING","URBAN",21,0,6103.2217492208802,3.2950257435191999,119.63229288978728,646.08681286189858,4,4955,4871,371.42857142857099,271.42857142857099,2,26760,26760,76.190476190476204,76.190476190476204]
[null,"ZN2635:PA35","EPPING","URBAN",1541,0,6509.6658407631903,2.9289117716968001,7670.3127389733545,0,8,357405.16666666698,351245.16666666698,309.14990266061,209.214795587281,0,0,0,0,0]
[null,"ZN2635:PA38","EPPING","URBAN",1017,2867.3388740225701,3749.0171656289899,2.9289117716968001,6457.1768164426549,0,12,300878,296810,302.949852507375,202.949852507375,0,0,0,0,0]
[null,"ZN2635:PA39","EPPING","URBAN",602,0,0,3.0387459638199998,2407.557008228217,6453.4162943365636,3,108127.516666667,105747.516666667,208.97009966777463,110.132890365449,5,289834,289834,68.438538205980109,68.438538205980109]
[null,"ZN2635:PA40","EPPING","URBAN",501,0,3715.74215545167,3.4231656333688001,3429.5187625628359,1008.6998173617545,3,136728.58333333299,134732.58333333299,209.78043912175659,110.17964071856301,2,40215,40215,6.387225548902201,6.387225548902201]
[null,"ZN2635:PA41","EPPING","URBAN",476,0,4230.0319110947603,2.7824661831599999,1192.0285600369496,0,2,58467,56791,177.73109243697479,89.705882352941202,0,0,0,0,0]
[null,"ZN2635:PA43","EPPING","URBAN",952,2244.7859915163799,7342.4286858042597,3.0204402651328,3716.326745300772,0,8,167918.16666666701,164122.16666666701,228.46638655462181,128.781512605042,0,0,0,0,0]
[null,"ZN2635:PA44","EPPING","URBAN",998,3.2946515032045101,6380.8302927725199,3.6594957096776,6143.6460435242416,1.60886071941913,7,229117.88333333301,225129.88333333301,310.02004008016041,210.120240480962,1,60,60,0.100200400801603,0.100200400801603]
[null,"ZN2635:PA46","EPPING","URBAN",501,2118.4180821193399,1663.02062655857,1.3729273928928001,1099.5718711148884,0,9,109302.5,107314.5,263.4730538922152,164.27145708582799,0,0,0,0,0]
[null,"ZN2635:PA47","EPPING","URBAN",18,0,4494.97391123948,2.3797408149239998,54.665479280764238,0,3,3135,3063,216.666666666667,116.66666666666701,0,0,0,0,0]
[null,"ZN2635:PA50","EPPING","URBAN",778,0,6210.5902859497,3.0174454726704001,2347.7764274677806,0,2,106187,103075,199.6143958868895,99.614395886889497,0,0,0,0,0]
[null,"ZN2635:PA51","EPPING","URBAN",408,1.2981962168187,7943.1629291081099,5.2321685176864001,2148.6501837874216,24.152841339278702,3,56045.15,54413.15,200,100,1,630,630,0.24509803921568601,0.24509803921568601]
[null,"ZN2635:PA52","EPPING","URBAN",1347,3788.6285705262699,1918.9720284130699,3.5696112219055998,13800.822921277031,0,17,527640.48333333398,522260.48333333398,450.63103192279169,350.77951002227201,0,0,0,0,0]
[null,"ZN2635:PA53","EPPING","URBAN",1,0,4881.8233512036204,1.9264998225056,1.9339066029484155,0,2,137,133,200,100,0,0,0,0,0]
[null,"ZN2635:PA55","EPPING","URBAN",1191,1.35784415723334,7419.6880631456097,2.7458547857856002,3529.6355146781816,0,3,175431,170691,206.54911838790949,107.052896725441,0,0,0,0,0]
[null,"ZN2635:PA57","EPPING","URBAN",1287,1786.40990014978,5990.1057056237096,3.4048599346815998,12434.040855394089,762.17802200929555,19,498387.433333333,493279.433333333,440.79254079254025,341.569541569541,2,30550,30550,5.1282051282051304,5.1282051282051304]
[null,"ZN2635:PA58","EPPING","URBAN",2224,3366.48528057878,9082.4349018869798,5.0771687124911997,24791.614450726614,1964.2713097038345,13,666403.48333333398,657543.48333333398,314.5683453237412,214.97302158273399,3,52800,52800,4.9460431654676205,4.9460431654676205]
[null,"ZN2635:PA59","EPPING","URBAN",145,0,2942.85977653278,2.6532703952479997,398.7041680147575,0,4,20508,19333,205.51724137931052,100.68965517241399,0,0,0,0,0]
[null,"ZN2635:PA62","EPPING","URBAN",84,0,5286.7121042963599,5.2171240941455999,362.74177124765686,236.24661674681411,2,9489,9177,174.99999999999991,82.142857142857096,2,6180,6180,2.38095238095238,2.38095238095238]
[null,"ZN2635:PA64","EPPING","URBAN",244,0,5358.1310717354199,2.6269905715496003,643.45008605570717,143.78880408149251,2,33428,32452,200,100,1,7470,7470,0.40983606557377,0.40983606557377]
[null,"ZN2635:PA65","EPPING","URBAN",6,0,4265.3758646790802,1.555984378804,9.3717998696931524,0,2,822,798,200,100,0,0,0,0,0]
[null,"ZN2835:PA10","BURWOOD","URBAN",1467,0,12860.0520339862,6.2777126639672005,5079.3849367849334,16.559601837183173,6,110424.066666667,110424.066666667,119.42740286298601,119.42740286298601,1,360,360,0.13633265167007502,0.13633265167007502]
[null,"ZN2835:PA15","BURWOOD","URBAN",2878,0,7084.8696603606204,4.7068040115840004,1975.9871685021574,2206.9077552823455,10,57294.383333333397,57294.383333333397,6.2195969423210604,6.2195969423210604,4,63990,63990,4.5517720639332895,4.5517720639332895]
[null,"ZN2835:PA16","BURWOOD","URBAN",1493,0,4662.0018969447901,6.5406351458423995,3096.4466653916083,422.70215755148195,6,64609.7,64609.7,16.6108506363027,16.6108506363027,1,8820,8820,0.93770931011386505,0.93770931011386505]
[null,"ZN2835:PA17","BURWOOD","URBAN",308,0,2555.9693289881702,1.9079186490072,830.42337447904333,8.3460338136393126,2,59401,59401,122.72727272727299,122.72727272727299,3,597,597,2.5974025974026,2.5974025974026]
[null,"ZN2835:PA19","BURWOOD","URBAN",800,0,0,1.3370720759407999,2.8728576805215393,1.7634911304783536,1,293.23333333329998,293.23333333329998,0.125,0.125,1,180,180,0.125,0.125]
[null,"ZN2835:PA20","BURWOOD","URBAN",804,0,2627.1808183959201,4.9600415948703995,852.14765490351579,136.28954509306959,2,23446.799999999999,23446.799999999999,25.870646766169099,25.870646766169099,1,3750,3750,3.7313432835820901,3.7313432835820901]
[null,"ZN2835:PA22","BURWOOD","URBAN",613,0,2962.97787371607,4.8793756919759996,41.551918946592316,242.61858713782092,1,1162.2,1162.2,1.9575856443719402,1.9575856443719402,1,6786,6786,2.93637846655791,2.93637846655791]
[null,"ZN2835:PA23","BURWOOD","URBAN",1823,0,8403.6681935688193,5.3086525866207994,1235.2994178207043,1893.1786876145209,2,31757.183333333302,31757.183333333302,3.4558420186505803,3.4558420186505803,2,48670,48670,6.6922654964344508,6.6922654964344508]
[null,"ZN2835:PA24","BURWOOD","URBAN",1549,0,12438.3579110314,2.8302465721175998,2537.3733718402295,274.98800663382917,12,122352.866666667,122352.866666667,60.361523563589401,60.361523563589401,1,13260,13260,3.3570045190445401,3.3570045190445401]
[null,"ZN2835:PA27","BURWOOD","URBAN",910,0,5010.7883561661702,2.6960809213016002,7172.1530179297242,0,6,363053.53333333298,363053.53333333298,232.857142857143,232.857142857143,0,0,0,0,0]
[null,"ZN2835:PA28","BURWOOD","URBAN",1430,0,4161.9670405034203,2.6163115322400001,1389.3448399150182,0,4,72472.733333333294,72472.733333333294,22.027972027972002,22.027972027972002,0,0,0,0,0]
[null,"ZN2835:PA29","BURWOOD","URBAN",936,0,4100.0820120313401,1.5742900774911999,1598.0444842965264,0,7,138534.566666667,138534.566666667,125.85470085470101,125.85470085470101,0,0,0,0,0]
[null,"ZN2835:PA30","BURWOOD","URBAN",1602,0,6513.9550628633797,6.7609656625263996,2514.2150845180213,3919.3947609961438,8,50751.366666666698,50751.366666666698,107.05368289638,107.05368289638,4,79116,79116,11.235955056179799,11.235955056179799]
[null,"ZN2835:PA31","BURWOOD","URBAN",1387,0,12527.815629286901,5.0024299252272,5419.9978256642989,13.928699406511338,3,147867.29999999999,147867.29999999999,176.351838500361,176.351838500361,1,380,380,7.2098053352559505E-2,7.2098053352559505E-2]
[null,"ZN2835:PA32","BURWOOD","URBAN",913,0,7597.9712190365999,1.5652486160935999,277.59309117437374,0,4,24203.566666666698,24203.566666666698,106.462212486309,106.462212486309,0,0,0,0,0]
[null,"ZN2835:PA33","BURWOOD","URBAN",614,0,5319.9530718749602,3.657601692324,1518.2232413346808,3175.8553663926564,3,56649.133333333302,56649.133333333302,182.57328990227998,182.57328990227998,3,118500,118500,37.459283387622101,37.459283387622101]
[null,"ZN2835:PA35","BURWOOD","URBAN",821,0,3591.9856757177699,3.2486417908896001,6222.7782119655021,142.34721233549055,5,261418.63333333301,261418.63333333301,117.661388550548,117.661388550548,1,5980,5980,3.1668696711327597,3.1668696711327597]
[null,"ZN2835:PA36","BURWOOD","URBAN",488,0,6164.1143388752598,3.1766123981343997,834.24988865850253,0,4,35841.483333333301,35841.483333333301,120.90163934426199,120.90163934426199,0,0,0,0,0]
[null,"ZN2835:PA41","BURWOOD","URBAN",1531,0,4747.9312105601603,3.6694901463199998,980.24580478167627,835.66592093233987,5,36457.199999999997,36457.199999999997,101.371652514696,101.371652514696,2,31080,31080,4.8334421946440296,4.8334421946440296]
[null,"ZN2835:PA42","BURWOOD","URBAN",100,0,1700.11502119634,1.9927426195128002,32.940960657611896,0,1,2256,2256,94,94,0,0,0,0,0]
[null,"ZN2835:PA43","BURWOOD","URBAN",166,0,1835.7846568734899,2.0136268431016,59.755787059268833,0,1,4050,4050,97.590361445783103,97.590361445783103,0,0,0,0,0]
[null,"ZN2835:PA9","BURWOOD","URBAN",1068,0,4354.9352072145302,4.0968161115840003,1789.7321530048639,378.23609543464556,3,59620.5,59620.5,34.082397003745299,34.082397003745299,1,12600,12600,5.6179775280898898,5.6179775280898898]
[null,"ZN3154:PA10","ST IVES","URBAN",980,9.1709115848060403,6241.3037977698496,3.9041509306303994,1443.0413343444366,1167.1662408805557,7,50443.616666666603,50443.616666666603,22.959183673469401,22.959183673469401,2,40800,40800,10.2040816326531,10.2040816326531]
[null,"ZN3154:PA11","ST IVES","URBAN",787,2152.7893664021699,6875.32367740878,2.8785044709887999,189.18009941674285,227.79103063950851,7,8969.3833333333005,8969.3833333333005,12.579415501905999,12.579415501905999,1,10800,10800,2.5412960609911099,2.5412960609911099]
[null,"ZN3154:PA12","ST IVES","URBAN",698,3536.4152932982702,4818.2104794253701,3.5219740065599998,6028.638250031222,188.13068224308958,8,233607.68333333329,89967.683333333305,369.34097421203404,183.66762177650401,1,7290,7290,2.5787965616045803,2.5787965616045803]
[null,"ZN3154:PA13","ST IVES","SHORT RURAL",622,2001.2704565910301,6283.6629961601702,3.3282698779775997,1600.5681607878985,0,8,65631.100000000006,65631.100000000006,113.34405144694499,113.34405144694499,0,0,0,0,0]
[null,"ZN3154:PA14","ST IVES","URBAN",426,4.6808591355822502,2685.8263243935999,1.8305698571903999,237.33867438168451,0,7,17694.416666666599,17694.416666666599,132.86384976525801,132.86384976525801,0,0,0,0,0]
[null,"ZN3154:PA16","ST IVES","URBAN",1004,4264.7014982308601,4368.6599253561099,3.9155762223391997,796.8688407156103,0,5,27774.433333333302,27774.433333333302,108.26693227091599,108.26693227091599,0,0,0,0,0]
[null,"ZN3154:PA17","ST IVES","URBAN",932,1401.5184933975199,5789.0255800227196,3.3887602058919999,961.47259672455277,0,9,38721.3166666666,38721.3166666666,117.703862660944,117.703862660944,0,0,0,0,0]
[null,"ZN3154:PA18","ST IVES","URBAN",1159,10.0458797270999,8672.4459788568893,4.8318757211456003,4135.7751221236322,0,11,116814.08333333299,116814.08333333299,214.92666091458199,214.92666091458199,0,0,0,0,0]
[null,"ZN3154:PA19","ST IVES","URBAN",1016,2261.6594881206101,6174.1157769851498,4.2111803104496,11524.3203221025,349.91523148005729,10,373478.433333333,373478.433333333,312.204724409449,312.204724409449,1,11340,11340,2.6574803149606301,2.6574803149606301]
[null,"ZN3154:PA22","ST IVES","SHORT RURAL",723,4215.9373313393899,3970.9475453463001,2.5434352980512003,256.7735015973351,93.182992686606411,4,13777.916666666701,13777.916666666701,107.05394190871399,107.05394190871399,1,5000,5000,1.3831258644536701,1.3831258644536701]
[null,"ZN3154:PA23","ST IVES","URBAN",468,1839.3569270610101,1557.8349061466599,1.8290556882736,1187.7370708382502,0,7,88623.2,88623.2,232.05128205128199,232.05128205128199,0,0,0,0,0]
[null,"ZN3154:PA24","ST IVES","URBAN",983,2309.7017693074799,2405.5069559721301,3.3155080481343999,1476.1244716749563,0,3,60761.283333333296,60761.283333333296,196.54120040691799,196.54120040691799,0,0,0,0,0]
[null,"ZN3154:PA25","ST IVES","URBAN",610,2070.26170876378,1200.5784006973699,1.8412097842536002,330.9659884632394,0,3,24532.066666666698,24532.066666666698,114.42622950819701,114.42622950819701,0,0,0,0,0]
[null,"ZN3154:PA3","ST IVES","URBAN",326,0,2820.1547011959101,1.6367230594159998,3.9694220905037985,0,1,330.98333333329998,330.98333333329998,0.30674846625766899,0.30674846625766899,0,0,0,0,0]
[null,"ZN3154:PA4","ST IVES","URBAN",1290,3204.7138861636299,5187.8463938920104,4.5434503664920003,215.33472240901787,0,4,6468.1833333332997,6468.1833333332997,3.7209302325581404,3.7209302325581404,0,0,0,0,0]
[null,"ZN3154:PA5","ST IVES","URBAN",1149,4301.8840894893901,3829.2100329472801,3.6271468015799999,5649.0501899981591,0,8,212551.58333333299,212551.58333333299,212.09747606614502,212.09747606614502,0,0,0,0,0]
[null,"ZN3154:PA6","ST IVES","URBAN",397,0,1777.5511013092901,3.6855148817872001,0,2951.0790096595315,0,0,0,0,0,5,109279,109279,126.44836272040301,126.44836272040301]
[null,"ZN3155:PA11","DOUBLE BAY","URBAN",860,0,3562.2687462481599,2.7275490880591997,0,35.874262696668438,0,0,0,0,0,1,1795,1795,41.744186046511601,41.744186046511601]
[null,"ZN3155:PA12","DOUBLE BAY","URBAN",1125,0,2555.5952651152402,2.1966838290127999,795.77458999541921,0,3,49439.783333333296,49439.783333333296,12.977777777777799,12.977777777777799,0,0,0,0,0]
[null,"ZN3155:PA15","DOUBLE BAY","URBAN",1097,0,1800.0103878648399,3.2218029487703999,515.204067833561,0,2,21824,21824,11.1212397447584,11.1212397447584,0,0,0,0,0]
[null,"ZN3155:PA16","DOUBLE BAY","URBAN",751,0,2630.3693947339002,2.7458547857856002,1654.7745581098752,2168.9137523146305,6,82246.100000000093,82246.100000000093,25.432756324900101,25.432756324900101,2,107800,107800,37.283621837549902,37.283621837549902]
[null,"ZN3155:PA17","DOUBLE BAY","URBAN",1121,0,7444.5765617138204,3.1053081374727998,767.17308403666095,1553.6177326945049,3,33716.516666666699,33716.516666666699,2.8545941123996501,2.8545941123996501,2,68280,68280,16.859946476360399,16.859946476360399]
[null,"ZN3155:PA18","DOUBLE BAY","URBAN",449,0,1227.6308201952399,2.213919023556,1038.9296400895091,0,1,64044,64044,8.0178173719376389,8.0178173719376389,0,0,0,0,0]
[null,"ZN3155:PA19","DOUBLE BAY","URBAN",974,0,4641.8301376982199,3.2401086474575997,3352.4647167305243,0,9,141207.79999999999,141207.79999999999,130.69815195071902,130.69815195071902,0,0,0,0,0]
[null,"ZN3155:PA20","DOUBLE BAY","URBAN",1163,0,2016.78708818255,2.7794952319888,3132.2421479421218,1496.9221964788276,6,153795.433333333,153795.433333333,123.215821152193,123.215821152193,1,73500,73500,15.047291487532199,15.047291487532199]
[null,"ZN3155:PA21","DOUBLE BAY","URBAN",487,0,3488.2497994835999,2.4396840316119999,1213.1205350804432,105.11310506409743,3,67861.649999999994,67861.649999999994,33.8809034907597,33.8809034907597,1,5880,5880,2.8747433264887103,2.8747433264887103]
[null,"ZN3155:PA22","DOUBLE BAY","URBAN",664,0,6063.1186762977104,3.1546183794463998,1397.9869950053662,156.53437891951262,5,60479.8,60479.8,10.8433734939759,10.8433734939759,2,6772,6772,3.4638554216867403,3.4638554216867403]
[null,"ZN3155:PA23","DOUBLE BAY","URBAN",2163,0,10378.725085939501,6.2273238048544002,17992.004867934054,11992.848273810232,12,394304.88333333301,394304.88333333301,118.030513176144,118.030513176144,17,262830,262830,29.8659269533056,29.8659269533056]
[null,"ZN3155:PA24","DOUBLE BAY","URBAN",720,0,3013.7347432204701,2.1966838290127999,901.42523589984319,0,3,56003.633333333302,56003.633333333302,109.44444444444399,109.44444444444399,0,0,0,0,0]
[null,"ZN3155:PA27","DOUBLE BAY","URBAN",140,0,1709.4037513907199,2.3797408149239998,413.08618952513712,3976.1943350534834,1,23690,23690,82.142857142857096,82.142857142857096,4,228030,228030,175,175]
[null,"ZN3155:PA28","DOUBLE BAY","URBAN",4,0,1653.6500135496799,3.4780827294303998,0,921.94796196685525,0,0,0,0,0,4,36176,36176,1800,1800]
[null,"ZN3155:PA29","DOUBLE BAY","URBAN",1802,0,7646.9468388711302,3.5693282288343999,1219.2220806987145,2331.0755486961839,7,46617.6499999999,46617.6499999999,6.7147613762486094,6.7147613762486094,3,89130,89130,11.709211986681501,11.709211986681501]
[null,"ZN3155:PA30","DOUBLE BAY","URBAN",303,0,2297.8914316014302,3.111968757608,33.200342117453118,22.483198714154376,1,1456,1456,2.6402640264026398,2.6402640264026398,3,986,986,0.99009900990098998,0.99009900990098998]
[null,"ZN3155:PA32","DOUBLE BAY","URBAN",776,0,3561.3662067968799,2.3797408149239998,11.313225823719247,0,3,648.79999999999995,648.79999999999995,0.38659793814433002,0.38659793814433002,0,0,0,0,0]
[null,"ZN3155:PA33","DOUBLE BAY","URBAN",1410,0,3328.3450147704398,3.4653727357080002,3526.714694830684,0,6,138891.1,138891.1,35.602836879432601,35.602836879432601,0,0,0,0,0]
[null,"ZN3155:PA34","DOUBLE BAY","URBAN",788,0,4634.4093810792901,2.9982957630664,5315.6986548694786,0,11,241957.96666666699,241957.96666666699,100.63451776649698,100.63451776649698,0,0,0,0,0]
[null,"ZN3155:PA35","DOUBLE BAY","URBAN",1629,0,5078.3264811506797,2.7818295023144,75.221852012349558,0,4,3690.3499999998999,3690.3499999998999,1.7802332719459801,1.7802332719459801,0,0,0,0,0]
[null,"ZN3155:PA36","DOUBLE BAY","URBAN",335,0,1812.76104408426,1.8305698571903999,0,329.5622195075477,0,0,0,0,0,1,24570,24570,11.641791044776099,11.641791044776099]
[null,"ZN3155:PA44","DOUBLE BAY","URBAN",2132,0,8056.8171552336798,4.7594816298479996,14242.103393040577,4727.5264470948132,6,408383.816666667,408383.816666667,26.500938086303901,26.500938086303901,2,135559,135559,13.039399624765499,13.039399624765499]
[null,"ZN3288:PA41 42ABC","CITY SOUTH","CBD",912,0,6849.4786388740504,10.855279254995132,0,3114.398519847563,0,0,0,0,0,1,39155,39155,4.4956140350877201,4.4956140350877201]
[null,"ZN3288:PA41 42DEF","CITY SOUTH","CBD",1178,0,7508.7827117257002,12.026843963797306,27.289280884209056,315.04578846405883,1,309.6666666667,309.6666666667,8.4889643463497491E-2,8.4889643463497491E-2,4,3575,3575,1.8675721561969401,1.8675721561969401]
[null,"ZN3288:PA41 42GHJ","CITY SOUTH","CBD",640,0,5502.1934204910303,9.372517670417384,0,7215.9473509456766,0,0,0,0,0,3,105073,105073,49.53125,49.53125]
[null,"ZN3288:PA41 42KLM","CITY SOUTH","CBD",1502,0,7879.8647006309102,15.083895625827974,1879.2815080435025,1814.2634917918144,3,17003.266666666699,17003.266666666699,6.1251664447403504,6.1251664447403504,5,16415,16415,16.378162450066601,16.378162450066601]
[null,"ZN3288:PA43 44ABC","CITY SOUTH","CBD",1354,0,6260.5865946377498,13.216714371174511,0,714.70335703520004,0,0,0,0,0,1,7380,7380,6.0561299852289503,6.0561299852289503]
[null,"ZN3288:PA43 44DEF","CITY SOUTH","CBD",41,0,4489.2730733715398,9.2077663832420757,0,52.625332203377845,0,0,0,0,0,2,780,780,4.8780487804878003,4.8780487804878003]
[null,"ZN3288:PA43 44GHJ","CITY SOUTH","CBD",728,0,4053.30994950173,11.367838815096082,0,2533.8626652755624,0,0,0,0,0,1,30420,30420,5.3571428571428603,5.3571428571428603]
[null,"ZN3288:PA43 44KLM","CITY SOUTH","CBD",1133,0,5663.8812459323599,7.2490566357134441,79.588511472521631,0,2,1498.3833333333,1498.3833333333,0.52956751985878203,0.52956751985878203,0,0,0,0,0]
[null,"ZN3288:PA45 46ABC","CITY SOUTH","CBD",1361,0,5618.1634633748199,12.429569332448052,0,2360.1330760813289,0,0,0,0,0,2,25914,25914,5.5841293166789097,5.5841293166789097]
[null,"ZN3288:PA45 46DEF","CITY SOUTH","CBD",585,0,4333.1721232764103,11.276310322220914,1281.0637439433133,100.38972226715636,2,15504.5,15504.5,7.5213675213675195,7.5213675213675195,2,1215,1215,0.512820512820513,0.512820512820513]
[null,"ZN3288:PA45 46GHJ","CITY SOUTH","CBD",425,0,7721.6046860148999,12.008538265222271,148.08811940784753,0,2,1683,1683,1.1764705882352899,1.1764705882352899,0,0,0,0,0]
[null,"ZN3288:PA45 46KLM","CITY SOUTH","CBD",1170,0,10467.595027562,14.168610697076277,0,3155.0331257107232,0,0,0,0,0,2,30390,30390,5.2136752136752094,5.2136752136752094]
[null,"ZN340:PA1","BOTANY","SHORT RURAL",967,0,5945.00144671817,2.1051553365375999,285.49171188831082,0,3,18508.166666666701,18508.166666666701,111.37538779731099,111.37538779731099,0,0,0,0,0]
[null,"ZN340:PA10","BOTANY","URBAN",126,0,2615.8924054550098,1.8991149145104,99.189315043927806,4.4807743327924747,2,7128,7128,198.41269841269801,198.41269841269801,2,322,322,13.492063492063499,13.492063492063499]
[null,"ZN340:PA11","BOTANY","URBAN",310,0,2541.7890309561599,1.0264780964152,67.844182195076641,0,4,9020.2166666666999,9020.2166666666999,133.22580645161298,133.22580645161298,0,0,0,0,0]
[null,"ZN340:PA14","BOTANY","URBAN",1304,0,6519.4094102536701,3.0563310211928001,1435.2653891505397,0,6,64089.35,64089.35,42.177914110429498,42.177914110429498,0,0,0,0,0]
[null,"ZN340:PA18","BOTANY","URBAN",324,0,4974.14653158899,1.2029701242432,0.54650292030450698,0,1,62,62,0.30864197530864201,0.30864197530864201,0,0,0,0,0]
[null,"ZN340:PA19","BOTANY","URBAN",287,0,4393.3069818982303,2.3365772236944,5.2566809940674402,0,2,307.03333333329999,307.03333333329999,0.696864111498258,0.696864111498258,0,0,0,0,0]
[null,"ZN340:PA2","BOTANY","URBAN",636,0,4739.72071474522,2.4273155235039998,78.07973993481086,0,3,4390.0166666667001,4390.0166666667001,99.528301886792505,99.528301886792505,0,0,0,0,0]
[null,"ZN340:PA20","BOTANY","URBAN",1048,0,8115.3285591725698,2.3082335535560001,1233.9699346249542,0,1,72959,72959,99.522900763358805,99.522900763358805,0,0,0,0,0]
[null,"ZN340:PA3","BOTANY","URBAN",1050,0,6890.81061502188,1.889842879368,29.052073767108194,5.303595926025948,1,2098,2098,99.904761904761898,99.904761904761898,2,383,383,2.3809523809523898,2.3809523809523898]
[null,"ZN340:PA4","BOTANY","URBAN",236,0,3760.79524655044,1.0039825977751999,3.4134230861597987,0,1,464,464,98.305084745762699,98.305084745762699,0,0,0,0,0]
[null,"ZN340:PA8","BOTANY","URBAN",671,119.554991179135,3531.7812294832001,2.3177434078359997,22.723091835408468,0,1,1338,1338,99.701937406855407,99.701937406855407,0,0,0,0,0]
[null,"ZN342:PA15","PADDINGTON","URBAN",117,0,3212.0483954692199,3.8994429308839997,0,305.01163630941051,0,0,0,0,0,2,10675,10675,17.094017094017101,17.094017094017101]
[null,"ZN342:PA16","PADDINGTON","URBAN",1126,0,4437.8735415983701,5.3109265023728005,22.899490212095802,12.764096846915495,3,588.45000000000005,588.45000000000005,0.26642984014209603,0.26642984014209603,1,328,328,14.564831261101199,14.564831261101199]
[null,"ZN342:PA17","PADDINGTON","URBAN",1755,0,5521.5971385207404,3.4231656333688001,10060.431857278898,40.759348581694674,7,401090.85,401090.85,267.920227920228,267.920227920228,1,1625,1625,0.28490028490028502,0.28490028490028502]
[null,"ZN342:PA18","PADDINGTON","URBAN",1430,0,6031.9838491915998,4.1991822762527997,5545.0870225251037,0.6153761751086857,2,180217.8,180217.8,62.937062937062905,62.937062937062905,1,20,20,6.9930069930069894E-2,6.9930069930069894E-2]
[null,"ZN342:PA22","PADDINGTON","URBAN",2803,0,3880.4595820086902,4.1076576212128,164.50660324310348,6043.2624868269077,3,5465.6666666665997,5465.6666666665997,2.6757046022119102,2.6757046022119102,7,200785,200785,20.727791651801599,20.727791651801599]
[null,"ZN342:PA23","PADDINGTON","URBAN",1290,0,3759.33197493326,3.9805459660719995,3544.6523367546042,772.04486794304717,4,121530.433333333,121530.433333333,96.6666666666667,96.6666666666667,3,26470,26470,14.3410852713178,14.3410852713178]
[null,"ZN342:PA24","PADDINGTON","URBAN",906,0,3723.5439671900099,2.5078807047736,0,252.85483571135313,0,0,0,0,0,1,13760,13760,4.7461368653421596,4.7461368653421596]
[null,"ZN342:PA26","PADDINGTON","URBAN",2838,0,5641.5454834629199,4.2607937616872,4736.7071598969769,0,3,151719.03333333301,151719.03333333301,100.17618040873899,100.17618040873899,0,0,0,0,0]
[null,"ZN342:PA28","PADDINGTON","URBAN",1200,0,3189.2486490833498,4.1952397746903998,3619.99454522523,1327.9645756163272,2,117762,117762,103.833333333333,103.833333333333,1,43200,43200,6.6666666666666696,6.6666666666666696]
[null,"ZN342:PA33","PADDINGTON","URBAN",568,0,4245.5787102449503,2.0971306686424001,838.25116066692124,0,2,54551,54551,110.035211267606,110.035211267606,0,0,0,0,0]
[null,"ZN342:PA35","PADDINGTON","URBAN",704,0,2872.0237443389601,1.39123309158,652.75254514015842,0,2,64032.833333333299,64032.833333333299,120.59659090909101,120.59659090909101,0,0,0,0,0]
[null,"ZN3425:PA11","CASTLE COVE","URBAN",141,0,4817.2209838891504,3.1120311999999997,22.506452735183991,0,1,987,0,100,0,0,0,0,0,0]
[null,"ZN3425:PA12","CASTLE COVE","URBAN",1226,4357.6423293217804,4062.5009385027101,4.0670137491207994,5168.9181633962171,0,6,173451.5,164855.5,200.08156606851549,99.9184339314845,0,0,0,0,0]
[null,"ZN3425:PA15","CASTLE COVE","URBAN",1352,0,9322.9768249075205,3.9513866574407994,649.3216597397809,981.51102662139351,4,22426.6499999999,13034.6499999999,101.40532544378691,2.2928994082840202,1,33900,33900,8.3579881656804709,8.3579881656804709]
[null,"ZN3425:PA16","CASTLE COVE","URBAN",741,0,4553.6358854403898,3.6616087999999998,143.86019968190141,1185.8784259346025,2,5361.95,181.95,100,0.13495276653171401,1,44200,44200,18.3535762483131,18.3535762483131]
[null,"ZN3425:PA18","CASTLE COVE","URBAN",576,0,3863.0732458313601,4.7072925092064004,0,1937.0652085498421,0,0,0,0,0,1,56160,56160,9.375,9.375]
[null,"ZN3425:PA21","CASTLE COVE","URBAN",57,0,1385.59473242483,4.0674845564936,11.891722443613437,0,1,399,0,100,0,0,0,0,0,0]
[null,"ZN3425:PA22","CASTLE COVE","URBAN",1081,0,3615.99165017937,3.160790954496,1940.6627672810798,0,5,83793.116666666698,83793.116666666698,103.51526364477299,103.51526364477299,0,0,0,0,0]
[null,"ZN3425:PA23","CASTLE COVE","URBAN",733,0,2871.5527446154501,2.1050467863143996,66.01788768740856,0,2,4280.1000000000004,4280.1000000000004,1.7735334242837699,1.7735334242837699,0,0,0,0,0]
[null,"ZN3425:PA24","CASTLE COVE","URBAN",1400,0,4745.9130228743797,2.9647291591472,110.80499603592612,0,2,5100.6833333332997,5100.6833333332997,3.8571428571428599,3.8571428571428599,0,0,0,0,0]
[null,"ZN3425:PA27","CASTLE COVE","URBAN",182,0,0,1.4049989564624001,546.47366155758198,0,4,53082,51815,164.8351648351649,65.384615384615401,0,0,0,0,0]
[null,"ZN3425:PA28","CASTLE COVE","URBAN",742,4791.5643856304096,3589.4495187018601,2.8766013836831998,1812.2517821375184,0,8,85979.1,85979.1,107.547169811321,107.547169811321,0,0,0,0,0]
[null,"ZN3425:PA30","CASTLE COVE","URBAN",1482,4266.8323472096099,3728.22527397966,3.3682485378062466,4072.6620922529305,0,12,165016.85,154649.85,144.73684210526309,44.804318488528999,0,0,0,0,0]
[null,"ZN3425:PA32","CASTLE COVE","URBAN",177,0,1377.63408878062,2.6451090276111997,50.450294015543285,0,3,2603,1357,113.55932203389789,12.9943502824859,0,0,0,0,0]
[null,"ZN3425:PA33","CASTLE COVE","URBAN",463,2602.6990564739699,1529.8430960872399,1.6879999600272,742.05376982645578,0,5,59995.266666666597,59995.266666666597,108.639308855292,108.639308855292,0,0,0,0,0]
[null,"ZN3425:PA34","CASTLE COVE","URBAN",679,0,3423.6652877821398,3.6935136830247997,445.95410556152666,0,2,16478,11718,102.79823269513957,2.65095729013255,0,0,0,0,0]
[null,"ZN3425:PA35","CASTLE COVE","URBAN",906,0,3408.6865699507398,2.3646134560880001,134.66182384576709,0,2,7772.1,7772.1,5.2980132450331094,5.2980132450331094,0,0,0,0,0]
[null,"ZN3425:PA36","CASTLE COVE","URBAN",3,0,2237.2321211612698,3.0207552,0.61975425739420043,102.92347488867971,1,28,0,133.333333333333,0,2,4650,4650,333.333333333334,333.333333333334]
[null,"ZN3425:PA39","CASTLE COVE","URBAN",674,0,2626.3004109498002,1.3578039252967999,268.26157829845118,0,5,26963.45,26963.45,114.39169139465899,114.39169139465899,0,0,0,0,0]
[null,"ZN3425:PA43","CASTLE COVE","URBAN",1251,0,6829.5032956736704,3.2551236705183997,292.59477427222993,0,7,12267.416666666601,12232.416666666601,5.9952038369304548,5.5955235811350903,0,0,0,0,0]
[null,"ZN3425:PA44","CASTLE COVE","URBAN",930,295.55195181948199,6400.0477850279203,3.1258897109832002,280.42970162688175,0,5,12243.4666666667,12243.4666666667,7.2043010752688099,7.2043010752688099,0,0,0,0,0]
[null,"ZN3425:PA45","CASTLE COVE","URBAN",3,0,1671.0825288123999,1.7087688530271998,0.26293510267719106,0,1,21,0,100,0,0,0,0,0,0]
[null,"ZN3425:PA46","CASTLE COVE","URBAN",213,0,2551.3595635861502,2.2051586874344,24.0914781223773,0,1,1491,0,100,0,0,0,0,0,0]
[null,"ZN3425:PA7","CASTLE COVE","URBAN",429,0,3946.72203152564,2.0138368,77.380745851790152,50.465703816384881,1,5244,5244,1.3986013986014001,1.3986013986014001,2,3420,3420,17.7156177156177,17.7156177156177]
[null,"ZN3472:PA11","SEFTON","URBAN",499,1673.5278310610299,2212.8046597744101,3.2950257435191999,24.674914900779537,0,1,1022,1022,1.4028056112224401,1.4028056112224401,0,0,0,0,0]
[null,"ZN3472:PA12","SEFTON","URBAN",1370,0,6800.783076918,4.2103106721144004,79.515749353940535,0,9,2577.4666666666999,2577.4666666666999,0.87591240875912402,0.87591240875912402,0,0,0,0,0]
[null,"ZN3472:PA15","SEFTON","URBAN",183,558.97154610360201,925.97759881932996,0.73222794268400004,1.0354092901033229,0,1,192.98333333330001,192.98333333330001,0.54644808743169404,0.54644808743169404,0,0,0,0,0]
[null,"ZN3472:PA16","SEFTON","URBAN",70,0,3889.4651724955902,2.7458547857856002,0,5.4323442775969415,0,0,0,0,0,1,270,270,1.4285714285714299,1.4285714285714299]
[null,"ZN3472:PA17","SEFTON","URBAN",1568,0,7969.23709454045,3.3865542359943999,98.291127181958529,0,6,3961.05,3961.05,6.4413265306122405,6.4413265306122405,0,0,0,0,0]
[null,"ZN3472:PA18","SEFTON","URBAN",52,337.340045747023,1588.77255421779,0.91528492859519994,0,2.6155731706948231,0,0,0,0,0,1,390,390,1.92307692307692,1.92307692307692]
[null,"ZN3472:PA20","SEFTON","URBAN",1111,0,6546.0433375151697,3.3865542359943999,379.58358096708992,559.81313773494014,5,15296.8999999999,15296.8999999999,12.1512151215122,12.1512151215122,1,22560,22560,4.2304230423042304,4.2304230423042304]
[null,"ZN3472:PA22","SEFTON","URBAN",906,805.24452520270302,4671.5414364656199,3.2950257435191999,5246.81121122482,0,7,217315.48333333299,217315.48333333299,233.55408388521002,233.55408388521002,0,0,0,0,0]
[null,"ZN3472:PA27","SEFTON","URBAN",1885,6.6442543897102402,8001.78512036149,4.5764246439368002,44.776600712333952,0,7,1335.3,1335.3,0.47745358090185697,0.47745358090185697,0,0,0,0,0]
[null,"ZN3472:PA28","SEFTON","URBAN",1515,6647.9495214943199,6924.5349939785101,5.3086525866207994,24565.094941078009,0,7,631521.566666667,631521.566666667,238.019801980198,238.019801980198,0,0,0,0,0]
[null,"ZN3472:PA29","SEFTON","URBAN",700,1811.16304945507,3428.4555414516999,1.8305698571903999,177.28064331728277,35.410836772483755,6,13216.8833333333,13216.8833333333,106,106,3,2640,2640,0.85714285714285698,0.85714285714285698]
[null,"ZN3472:PA30","SEFTON","URBAN",2111,4351.4233264798404,6176.9146786715301,5.0340671082343995,10312.737340592934,1932.1037817674057,11,279581.86666666699,279581.86666666699,119.469445760303,119.469445760303,2,52380,52380,5.5423969682614898,5.5423969682614898]
[null,"ZN3472:PA33","SEFTON","URBAN",1556,0,7495.2792510014497,3.2950257435191999,623.67899630669967,0,5,25831.9,25831.9,7.8406169665809795,7.8406169665809795,0,0,0,0,0]
[null,"ZN3472:PA34","SEFTON","URBAN",550,0,8855.4747973239901,4.2103106721144004,1442.6009393501001,318.37561429801451,5,46761.25,46761.25,111.818181818182,111.818181818182,1,10320,10320,1.4545454545454501,1.4545454545454501]
[null,"ZN3472:PA35","SEFTON","URBAN",416,0,4925.5552506146196,3.6611397153415997,1126.6547902735285,164.17751598823739,1,41998,41998,99.519230769230802,99.519230769230802,2,6120,6120,1.92307692307692,1.92307692307692]
[null,"ZN3472:PA8","SEFTON","URBAN",1162,0.88608999056912097,6229.1600205578698,3.2950257435191999,5824.8375910063687,0,7,241256.51666666701,241256.51666666701,129.087779690189,129.087779690189,0,0,0,0,0]
[null,"ZN35335:PA14","ROYAL NORTH SHORE","URBAN",178,0,7474.0142308927898,3.0756578206487997,78.268814503369342,0,1,3473,3473,12.921348314606702,12.921348314606702,0,0,0,0,0]
[null,"ZN35335:PA16","ROYAL NORTH SHORE","URBAN",203,0,3874.34518141328,2.9476212975063998,296.67293194549075,0,1,13736,13736,98.029556650246292,98.029556650246292,0,0,0,0,0]
[null,"ZN35370:PA10","GALSTON","SHORT RURAL",519,16618.7314898025,3821.4603023680102,3.7168745799895997,7860.9473304470675,697.21035364895977,16,288636.34999999998,263391.34999999998,439.88439306358362,403.85356454720602,2,25600,25600,12.3314065510597,12.3314065510597]
[null,"ZN35370:PA2","GALSTON","SHORT RURAL",371,13161.364655913399,432.30019173270898,2.4712693073991998,605.83525427730842,614.03598155878683,7,33457.116666666698,8971.1166666666995,142.5876010781671,42.587601078167097,3,33910,33910,19.407008086253398,19.407008086253398]
[null,"ZN35370:PA4","GALSTON","SHORT RURAL",756,21983.984837040301,1960.18528552356,3.0204402651328,2489.6271195563863,486.67768801567314,6,112491.08333333299,112491.08333333299,148.01587301587301,148.01587301587301,4,21990,21990,5.6878306878306901,5.6878306878306901]
[null,"ZN35370:PA8","GALSTON","SHORT RURAL",724,30453.5160903826,866.16207954228696,3.2218029487703999,6290.0501498921521,2096.4159659041211,19,266445.98333333299,266445.98333333299,415.05524861878501,415.05524861878501,12,88804,88804,25.690607734806598,25.690607734806598]
[null,"ZN35400:PA101","NORTH SYDNEY","URBAN",1939,0,0,2.8026440496479998,0,952.45538954524864,0,0,0,0,0,3,46380,46380,10.005157297576101,10.005157297576101]
[null,"ZN35400:PA102","NORTH SYDNEY","URBAN",154,0,671.88159947749898,2.4735401091983999,0,32.261526664042037,0,0,0,0,0,1,1780,1780,2.5974025974026,2.5974025974026]
[null,"ZN35400:PA103","NORTH SYDNEY","URBAN",157,0,3008.4206071144399,1.9565379028368,0,373.31479438773823,0,0,0,0,0,1,26040,26040,19.7452229299363,19.7452229299363]
[null,"ZN35400:PA106","NORTH SYDNEY","URBAN",70,0,613.81194800288199,1.9791681901871998,0,40.460650539945611,0,0,0,0,0,1,2790,2790,12.8571428571429,12.8571428571429]
[null,"ZN35400:PA110","NORTH SYDNEY","URBAN",1875,0,5302.7720065653502,3.0171614899752002,8145.0626463687158,445.69220592046997,7,368425.7,368425.7,116.58666666666599,116.58666666666599,1,20160,20160,2.2399999999999998,2.2399999999999998]
[null,"ZN35400:PA51","NORTH SYDNEY","URBAN",17,0,29.624725715114,2.0993038493184,0,177.20408812981793,0,0,0,0,0,1,11520,11520,94.117647058823493,94.117647058823493]
[null,"ZN35400:PA52","NORTH SYDNEY","URBAN",2033,0,4819.3047410465097,3.7958250292496003,66.287843547489118,0,4,2383.3166666666998,2383.3166666666998,0.19675356615838699,0.19675356615838699,0,0,0,0,0]
[null,"ZN35400:PA53","NORTH SYDNEY","SHORT RURAL",738,0,7365.6057184494102,2.0657603026775999,1168.6764144632623,0,6,77209.083333333299,71359.083333333299,187.2628726287258,107.99457994579899,0,0,0,0,0]
[null,"ZN35400:PA59","NORTH SYDNEY","URBAN",110,0,0,0.37623701346639998,0,2286.1156223374901,0,0,0,0,0,3,829260,829260,256.36363636363598,256.36363636363598]
[null,"ZN35400:PA64","NORTH SYDNEY","URBAN",462,0,2011.3366141510801,1.2555725310832,54.586658395048474,240.11996361417522,1,5933.3333333333003,5933.3333333333003,8.6580086580086597,8.6580086580086597,1,26100,26100,6.2770562770562792,6.2770562770562792]
[null,"ZN35400:PA72","NORTH SYDNEY","URBAN",226,0,1440.9534845174201,0.81776915999760003,361.86094548069627,0,1,60390,60390,29.2035398230088,29.2035398230088,0,0,0,0,0]
[null,"ZN35400:PA73","NORTH SYDNEY","URBAN",1185,0,3504.8244242507299,2.6052753626095999,18.728925578134,0,1,981.1,981.1,0.16877637130801698,0.16877637130801698,0,0,0,0,0]
[null,"ZN35400:PA77","NORTH SYDNEY","URBAN",531,0,2547.8438533326098,2.3797473377951999,27.934398037781897,10.985437430588386,1,1602,1602,0.56497175141242906,0.56497175141242906,1,630,630,0.56497175141242906,0.56497175141242906]
[null,"ZN35400:PA79","NORTH SYDNEY","URBAN",961,0,2909.6909847111301,2.7362618520904003,959.67748074211863,389.1608531675181,2,47865.4,47865.4,14.4640998959417,14.4640998959417,2,19410,19410,3.4339229968782603,3.4339229968782603]
[null,"ZN35400:PA81","NORTH SYDNEY","URBAN",2121,0,6986.0901118515603,2.8007718819801943,39.306491579431651,339.84745806457255,4,1915.3166666667,1915.3166666667,0.18859028760018801,0.18859028760018801,1,16560,16560,1.0843941537010799,1.0843941537010799]
[null,"ZN35400:PA82","NORTH SYDNEY","URBAN",820,0,4031.8639152840401,1.9854754713184,0,337.81015219208615,0,0,0,0,0,1,23220,23220,5.2439024390243905,5.2439024390243905]
[null,"ZN35400:PA88","NORTH SYDNEY","URBAN",478,0,962.97763681466404,2.6010823555063998,0,679.8344497320428,0,0,0,0,0,1,35670,35670,17.154811715481198,17.154811715481198]
[null,"ZN35400:PA90","NORTH SYDNEY","URBAN",26,0,420.55745835119501,2.4402778300320001,0,321.85312868316402,0,0,0,0,0,1,18000,18000,96.153846153846104,96.153846153846104]
[null,"ZN35400:PA95","NORTH SYDNEY","URBAN",700,0,4100.6693450152097,2.7242712439168,6.5241305860268008,1195.9020808023627,1,326.8333333333,326.8333333333,0.14285714285714302,0.14285714285714302,2,59910,59910,15.285714285714299,15.285714285714299]
[null,"ZN35400:PA97","NORTH SYDNEY","URBAN",434,0,2059.96597822483,2.3897117379080002,85.825442101243425,0,2,4901.45,4901.45,2.30414746543779,2.30414746543779,0,0,0,0,0]
[null,"ZN35500:PA15","TOP RYDE","URBAN",237,0,1014.78439971649,1.438144286092,40.705621145366941,775.79009243351766,2,3862.8333333332998,3862.8333333332998,10.9704641350211,10.9704641350211,3,73620,73620,81.8565400843882,81.8565400843882]
[null,"ZN35500:PA16","TOP RYDE","URBAN",355,0,2344.4934736536602,1.0800362158192001,8.3094747659526185,0,1,1050,1050,11.830985915493001,11.830985915493001,0,0,0,0,0]
[null,"ZN35500:PA18","TOP RYDE","SHORT RURAL",609,1239.96153170752,7305.8768704565,4.7594816298479996,497.21987863105136,0,3,14257.483333333301,14257.483333333301,10.509031198686399,10.509031198686399,0,0,0,0,0]
[null,"ZN35500:PA19","TOP RYDE","SHORT RURAL",328,0,4280.1516482345296,0.91528492859519994,99.669545415000798,0,2,14861.416666666701,14861.416666666701,15.548780487804899,15.548780487804899,0,0,0,0,0]
[null,"ZN35500:PA22","TOP RYDE","URBAN",1070,2285.19679226059,3226.9384493765501,3.0180231113952001,108.84430596954483,0,4,4921.95,4921.95,9.7196261682243001,9.7196261682243001,0,0,0,0,0]
[null,"ZN35500:PA23","TOP RYDE","URBAN",383,0,7227.8804890174797,3.2176714155727999,4311.6958933818059,308.38652423921542,11,182877.58333333299,182877.58333333299,212.79373368146199,212.79373368146199,2,13080,13080,10.182767624020899,10.182767624020899]
[null,"ZN35500:PA24","TOP RYDE","URBAN",3284,2391.8317657378998,15373.986408565699,7.9812845786184008,5933.401878022647,0,15,101457.7,101457.7,33.191230207064599,33.191230207064599,0,0,0,0,0]
[null,"ZN35500:PA27","TOP RYDE","URBAN",846,2991.7339544080201,3324.40985651763,3.5390759717711999,6562.4435457104964,0,7,253063.63333333301,253063.63333333301,249.76359338061499,249.76359338061499,0,0,0,0,0]
[null,"ZN35500:PA28","TOP RYDE","URBAN",3772,11726.810576469499,7892.1938889051498,8.9697923019624,115206.85343214471,692.08066109928836,21,1752871.0666666699,1752871.0666666699,312.51325556733798,312.51325556733798,1,10530,10530,2.067868504772,2.067868504772]
[null,"ZN35500:PA30","TOP RYDE","URBAN",132,0,1215.67332707694,1.555984378804,1.6759788088137386,0,1,147,147,0.75757575757575801,0.75757575757575801,0,0,0,0,0]
[null,"ZN35500:PA31","TOP RYDE","URBAN",967,214.186906174092,10544.4276039207,4.4926226514104002,925.45192513881295,3248.2768220834341,5,28113.049999999901,28113.049999999901,13.753877973112699,13.753877973112699,2,98675,98675,20.475698035160299,20.475698035160299]
[null,"ZN35500:PA32","TOP RYDE","URBAN",536,1685.11552874429,5949.1818537618401,3.1608025782544003,1431.5770166608977,0,7,61811.8,61811.8,115.48507462686599,115.48507462686599,0,0,0,0,0]
[null,"ZN35500:PA34","TOP RYDE","URBAN",1402,3470.5640843395199,6939.96940474025,5.6488246106336,1042.498894292281,52.152435118575298,6,25186.7166666667,25186.7166666667,18.116975748930102,18.116975748930102,1,1260,1260,0.21398002853067,0.21398002853067]
[null,"ZN35500:PA35","TOP RYDE","URBAN",610,0,1583.2383727373599,2.1776931558288002,0,76.592082741794059,0,0,0,0,0,2,4800,4800,1.63934426229508,1.63934426229508]
[null,"ZN35555:PA6","CROYDON","URBAN",937,0,5791.8282934691897,2.3799015999999997,0,3.6620498462915885,0,0,0,0,0,1,210,210,0.10672358591248698,0.10672358591248698]
[null,"ZN35555:PA8","CROYDON","URBAN",1410,0,6906.2563149851203,2.3991175999999999,14.769988925337717,0,2,840.2,840.2,0.14184397163120602,0.14184397163120602,0,0,0,0,0]
[null,"ZN35600:PA1","KINGSFORD","URBAN",2741,0,13917.7159607375,6.8332162266375995,14449.652025399091,0,6,288593.316666667,288593.316666667,102.55381247719799,102.55381247719799,0,0,0,0,0]
[null,"ZN35600:PA12","KINGSFORD","URBAN",661,0,6922.3288967622902,1.9666185876127997,5.0838727525915983,0,1,352.8,352.8,0.15128593040847199,0.15128593040847199,0,0,0,0,0]
[null,"ZN35600:PA14","KINGSFORD","URBAN",1917,0,6419.7626589798501,3.5701294841512001,12.949402941229945,274.67505649554948,2,495.01666666670002,495.01666666670002,0.104329681794471,0.104329681794471,1,10500,10500,1.3041210224308799,1.3041210224308799]
[null,"ZN35600:PA16","KINGSFORD","URBAN",2958,0,10672.9417769664,5.6601230728992,4694.4745428286151,0,9,113191.85,113191.85,19.540229885057499,19.540229885057499,0,0,0,0,0]
[null,"ZN35600:PA19","KINGSFORD","URBAN",2656,0,11208.551830734399,8.8460750225527995,1768.8579110233497,0,8,27289.55,27289.55,6.4382530120482002,6.4382530120482002,0,0,0,0,0]
[null,"ZN35600:PA20","KINGSFORD","URBAN",341,0,4269.9982419246999,2.1417667329511998,5.0449175317272248,310.73009268412073,1,321.46666666670001,321.46666666670001,0.29325513196480901,0.29325513196480901,1,19800,19800,11.7302052785924,11.7302052785924]
[null,"ZN35600:PA22","KINGSFORD","URBAN",1776,0,6024.8455445780701,3.8258910025655997,28.070957224644225,0,2,1001.3333333332999,1001.3333333332999,0.168918918918919,0.168918918918919,0,0,0,0,0]
[null,"ZN35600:PA25","KINGSFORD","URBAN",1132,0,4354.5074967167202,1.9762656575840001,314.33259543058688,0,3,21706.916666666701,21706.916666666701,15.371024734982299,15.371024734982299,0,0,0,0,0]
[null,"ZN35600:PA3","KINGSFORD","URBAN",1202,0,3755.23392359122,2.5635906779759998,470.98147659705575,0,3,25073.166666666602,24788.733333333301,6.0732113144758753,5.9900166389351099,0,0,0,0,0]
[null,"ZN35600:PA4","KINGSFORD","URBAN",1239,0,3294.0134829501799,2.5627978008351997,2388.5377092107374,5.6335422154938586,3,127195.516666667,127195.516666667,23.083131557707802,23.083131557707802,1,300,300,8.0710250201775607E-2,8.0710250201775607E-2]
[null,"ZN35600:PA6","KINGSFORD","URBAN",1261,0,8844.8455420385399,3.0914264001103997,0,951.38030692916459,0,0,0,0,0,1,42000,42000,7.9302141157811299,7.9302141157811299]
[null,"ZN35600:PA7","KINGSFORD","URBAN",1349,0,4595.4923713831504,2.3797408149239998,3.9811929860037143,0,1,228.3166666667,228.3166666667,7.4128984432913297E-2,7.4128984432913297E-2,0,0,0,0,0]
[null,"ZN35600:PA9","KINGSFORD","URBAN",3012,0,9123.4928300858392,5.3565488845688005,235.27225251146277,1271.6747221181417,14,5994.3166666666002,5994.3166666666002,1.4940239043824699,1.4940239043824699,1,32400,32400,1.9920318725099602,1.9920318725099602]
[null,"ZN35700:PA1","PORT BOTANY","URBAN",620,0,8665.9335970140892,4.9668188407527998,374.18865104456569,0,2,10281.733333333301,10281.733333333301,15,15,0,0,0,0,0]
[null,"ZN35800:PA1","BANKSTOWN","URBAN",2538,7035.2784177138901,3822.7204998478301,4.7009031709512001,811.07152864878913,2843.0973200040376,7,23546.799999999999,23546.799999999999,100.43341213554,100.43341213554,2,82540,82540,9.1410559495665904,9.1410559495665904]
[null,"ZN35800:PA10","BANKSTOWN","URBAN",2014,0,10619.271672925999,4.7594816298479996,1415.1134339380233,489.63529767268261,4,40577.533333333296,40577.533333333296,8.6395233366434994,8.6395233366434994,2,14040,14040,1.9364448857994001,1.9364448857994001]
[null,"ZN35800:PA13","BANKSTOWN","URBAN",301,382.60674848009501,2327.4542393578599,3.0940250749096001,0,14.282700658710036,0,0,0,0,0,1,630,630,0.66445182724252505,0.66445182724252505]
[null,"ZN35800:PA14","BANKSTOWN","URBAN",1993,3011.5395499794499,3523.19849626718,3.2950257435191999,836.89046132223189,64.705256295586267,6,34662.8166666666,34662.8166666666,15.9056698444556,15.9056698444556,1,2680,2680,0.20070245860511798,0.20070245860511798]
[null,"ZN35800:PA15","BANKSTOWN","URBAN",3034,8139.2208782546904,7469.7365484757702,6.6942360406496002,68478.56388617582,437.77927949091281,21,1396071.5166666666,1395927.75,227.29070533948536,227.25774555042801,1,8925,8925,1.1535926170072499,1.1535926170072499]
[null,"ZN35800:PA16","BANKSTOWN","URBAN",913,1619.00158508459,4899.3692964647698,3.8441967002920001,14157.886382911762,20.280751970709023,16,502628.21666666702,502628.21666666702,461.11719605695498,461.11719605695498,2,720,720,0.21905805038335102,0.21905805038335102]
[null,"ZN35800:PA18","BANKSTOWN","URBAN",412,2384.9889607322998,3257.0487285058398,2.2882123214879999,1088.4640683867772,525.62960834155592,2,64919,64919,100.72815533980599,100.72815533980599,2,31350,31350,11.6504854368932,11.6504854368932]
[null,"ZN35800:PA19","BANKSTOWN","URBAN",518,376.95259209190903,4249.3714293896001,2.2699066237615999,0,0.16632362732664938,0,0,0,0,0,1,10,10,0.193050193050193,0.193050193050193]
[null,"ZN35800:PA2","BANKSTOWN","SHORT RURAL",2909,0,13423.174387020699,5.4917095725320006,3552.268271143626,0,9,88277.95,88277.95,12.581643176349299,12.581643176349299,0,0,0,0,0]
[null,"ZN35800:PA21","BANKSTOWN","URBAN",294,0,4606.2566416218597,2.1051553365375999,300.4754699086314,861.53922065513882,2,19479.55,19479.55,98.639455782312908,98.639455782312908,3,55852.800000000003,55852.800000000003,106.80272108843501,106.80272108843501]
[null,"ZN35800:PA22","BANKSTOWN","URBAN",776,0,6312.8918125158098,2.4480618405864001,372.59907766356486,0,7,20771.766666666601,20771.766666666601,13.530927835051502,13.530927835051502,0,0,0,0,0]
[null,"ZN35800:PA3","BANKSTOWN","URBAN",148,0,4868.58744556691,3.935725193728,301.36530126364323,53.235632611272131,6,10450.15,10450.15,39.864864864864899,39.864864864864899,2,1846,1846,2.7027027027027,2.7027027027027]
[null,"ZN35800:PA4","BANKSTOWN","URBAN",925,640.01024462850296,7829.7703695672099,3.2034972510439998,3.3801253292963156,0.14083855538734646,2,144,144,0.21621621621621601,0.21621621621621601,1,6,6,0.108108108108108,0.108108108108108]
[null,"ZN35800:PA6","BANKSTOWN","URBAN",636,346.95169654143598,4137.2601987595399,3.2553029548376,844.75256560218997,0,4,35415.4,35415.4,53.459119496855301,53.459119496855301,0,0,0,0,0]
[null,"ZN35800:PA7","BANKSTOWN","URBAN",1167,3123.0026287239998,2629.4766401203901,4.2103106721144004,8969.1973894240746,10.180615573483022,9,290732.433333333,290732.433333333,220.994001713796,220.994001713796,1,330,330,8.5689802913453308E-2,8.5689802913453308E-2]
[null,"ZN35800:PA9","BANKSTOWN","URBAN",341,0,4205.6241433941796,1.4644558863288,223.44774540063113,0,3,20823.5,20823.5,35.4838709677419,35.4838709677419,0,0,0,0,0]
[null,"ZN35900:PA1","POTTS HILL","URBAN",1454,368.157031273212,8677.9848667773203,3.6611397153415997,4079.2014190075784,4520.998106938835,8,152059.26666666701,152059.26666666701,40.508940852819805,40.508940852819805,6,168528,168528,18.500687757909201,18.500687757909201]
[null,"ZN35900:PA10","POTTS HILL","URBAN",14,41.7470064435362,4565.53276281735,2.1966838290127999,20.522189496734452,15.146180640334997,1,1275,1275,21.428571428571399,21.428571428571399,3,941,941,21.428571428571399,21.428571428571399]
[null,"ZN35900:PA16","POTTS HILL","URBAN",239,409.55138588352901,5259.1058054283403,2.4712693073991998,22.381258425439707,0,1,1236,1236,5.02092050209205,5.02092050209205,0,0,0,0,0]
[null,"ZN35900:PA17","POTTS HILL","URBAN",1805,3062.2530872274301,7646.3881711628101,3.8441967002920001,6458.5890246561066,1946.9521891880661,5,229290.51666666701,229290.51666666701,107.47922437673101,107.47922437673101,2,69120,69120,7.9778393351800609,7.9778393351800609]
[null,"ZN35900:PA2","POTTS HILL","URBAN",1563,3109.0323514756401,5250.8131118342399,3.3865542359943999,5169.9247829535025,1158.3367583983602,3,208343.63333333301,208343.63333333301,99.424184261036501,99.424184261036501,2,46680,46680,6.3979526551503501,6.3979526551503501]
[null,"ZN35900:PA20","POTTS HILL","URBAN",1004,1266.5689257172,5793.91513427059,2.6543262933103997,2868.7770628429103,0,11,147501.53333333301,147501.53333333301,59.163346613545798,59.163346613545798,0,0,0,0,0]
[null,"ZN35900:PA23","POTTS HILL","SHORT RURAL",1115,0,13957.325648505899,2.3797408149239998,362.51756968839697,1148.7597368474476,4,20789.95,20789.95,9.2376681614349803,9.2376681614349803,2,65880,65880,12.914798206278,12.914798206278]
[null,"ZN35900:PA24","POTTS HILL","URBAN",1378,769.79184704458396,5445.5088337171001,3.5696112219055998,797.42330643030095,1453.6047897701496,3,30487.516666666699,30487.516666666699,8.7082728592162493,8.7082728592162493,2,55575,55575,6.8940493468795401,6.8940493468795401]
[null,"ZN35900:PA25","POTTS HILL","SHORT RURAL",560,0,10504.8854294999,3.2034972510439998,111.86923819879755,11.220138245858603,2,4765.8500000000004,4765.8500000000004,4.1071428571428603,4.1071428571428603,1,478,478,0.17857142857142899,0.17857142857142899]
[null,"ZN35900:PA3","POTTS HILL","URBAN",465,353.86058504412102,10133.462623712299,5.8578235443544004,11.946686348206082,0.42922226400745556,2,278.3333333333,278.3333333333,0.43010752688171999,0.43010752688171999,1,10,10,0.21505376344086,0.21505376344086]
[null,"ZN35900:PA4","POTTS HILL","SHORT RURAL",1117,2222.0623995862102,8084.2349382232596,3.111968757608,964.4000110515085,2266.6758297976835,6,42293.733333333301,42293.733333333301,15.308863025962399,15.308863025962399,6,99405,99405,18.979409131602502,18.979409131602502]
[null,"ZN35900:PA6","POTTS HILL","URBAN",336,2486.9453943019198,3101.8759184338701,3.111968757608,14.309666686681112,10.717143403298737,3,627.54999999999995,627.54999999999995,1.78571428571429,1.78571428571429,1,470,470,0.297619047619048,0.297619047619048]
[null,"ZN36100:PA1","ROSE BAY","URBAN",835,0,3655.8407316553798,2.4606467054815999,3262.0919649414659,0,1,180926,180926,18.562874251497,18.562874251497,0,0,0,0,0]
[null,"ZN36100:PA12","ROSE BAY","URBAN",1227,0,6075.5939227621902,3.5924072049808,869.79191398029684,854.0421259686475,7,33043.333333333401,33043.333333333401,9.2094539527302306,9.2094539527302306,1,32445,32445,8.3944580277098595,8.3944580277098595]
[null,"ZN36100:PA13","ROSE BAY","URBAN",472,0,6786.0312294137302,3.196029481084,304.44471300455916,240.97506561926991,6,13000.25,13000.25,10.1694915254237,10.1694915254237,2,10290,10290,6.9915254237288105,6.9915254237288105]
[null,"ZN36100:PA15","ROSE BAY","URBAN",756,0,2563.0380734105402,2.3429428157776,2146.5072225787039,0,6,125033.016666667,125033.016666667,109.52380952381,109.52380952381,0,0,0,0,0]
[null,"ZN36100:PA16","ROSE BAY","URBAN",627,0,3943.3866977492698,1.8305698571903999,13.368932201187336,0,1,996.7,996.7,0.31897926634768703,0.31897926634768703,0,0,0,0,0]
[null,"ZN36100:PA19","ROSE BAY","URBAN",2197,0,5227.3265579013896,4.2103106721144004,144.42128701492351,4880.1243506744213,2,4681.3500000000004,4681.3500000000004,0.45516613563950803,0.45516613563950803,2,158187,158187,14.2922166590806,14.2922166590806]
[null,"ZN36100:PA2","ROSE BAY","URBAN",1187,0,9124.0961438320301,3.6611397153415997,637.48940154876107,342.03649164216125,2,23763.516666666699,23763.516666666699,2.44313395113732,2.44313395113732,1,12750,12750,2.1061499578770002,2.1061499578770002]
[null,"ZN36100:PA20","ROSE BAY","URBAN",1023,0,3737.0131749891302,2.4951486337887996,649.85492635532853,0,3,35544.633333333302,35544.633333333302,13.782991202346,13.782991202346,0,0,0,0,0]
[null,"ZN36100:PA21","ROSE BAY","URBAN",644,0,3677.6152824006899,2.7458547857856002,6.2723456612623947,0,1,311.75,311.75,0.15527950310559002,0.15527950310559002,0,0,0,0,0]
[null,"ZN36100:PA23","ROSE BAY","URBAN",984,0,3333.7341296192199,2.2882123214879999,6.8429653636719667,2837.2262304165261,2,408.13333333330002,408.13333333330002,0.203252032520325,0.203252032520325,2,169220,169220,34.247967479674799,34.247967479674799]
[null,"ZN36100:PA27","ROSE BAY","URBAN",1596,0,9143.5303918070495,4.6080706096167994,3666.9723579097408,5650.7198050946017,6,108603.183333333,108603.183333333,21.867167919799499,21.867167919799499,6,167355,167355,37.907268170426001,37.907268170426001]
[null,"ZN36100:PA5","ROSE BAY","URBAN",1428,0,6602.0799288094804,3.8441967002920001,485.43200442705285,0,7,17233.633333333401,17233.633333333401,9.1736694677871196,9.1736694677871196,0,0,0,0,0]
[null,"ZN36100:PA6","ROSE BAY","URBAN",226,0,624.80547600748605,0.3912843069168,37.23464575923304,0,1,12987,12987,51.769911504424805,51.769911504424805,0,0,0,0,0]
[null,"ZN36100:PA7","ROSE BAY","URBAN",769,0,1109.64077164982,1.555984378804,474.25582796792281,0,3,41596.949999999997,41596.949999999997,22.106631989596899,22.106631989596899,0,0,0,0,0]
[null,"ZN36100:PA8","ROSE BAY","URBAN",780,0,8189.8155266334898,3.0111069319112,20.798417163213944,1349.9481833074965,3,942.66666666670005,942.66666666670005,0.38461538461538497,0.38461538461538497,2,61185,61185,20.6410256410256,20.6410256410256]
[null,"ZN36200:PA1","EMPIRE BAY","URBAN",1360,8565.65044022855,2028.65008986011,3.5696112219055998,2620.7729304403288,728.17557079983749,11,100198.8,12058.8,109.85294117647059,9.9264705882353006,1,27840,0,4.2647058823529402,0]
[null,"ZN36200:PA11","EMPIRE BAY","SHORT RURAL",1302,3883.7007427560102,6541.8568038403,3.3316371408935996,1930.5783304114491,283.17938868249161,8,79083.116666666596,1143.1166666665999,100.30721966205836,0.53763440860214995,1,11600,11600,2.2273425499232,2.2273425499232]
[null,"ZN36200:PA4","EMPIRE BAY","SHORT RURAL",929,8627.0128179270996,3896.7647213352402,3.0387459638199998,3199.178211193705,0,13,143680.5833333334,88480.583333333401,209.25726587728718,110.226049515608,0,0,0,0,0]
[null,"ZN36200:PA8","EMPIRE BAY","SHORT RURAL",1375,13107.3236023435,926.70150583581994,3.1668858536695996,8479.8314183901311,6042.537379919685,11,365433.91666666698,283353.91666666698,227.27272727272708,127.781818181818,7,260400,250965,51.418181818181793,48.727272727272705]
[null,"ZN36300:PA1","BALGOWLAH NORTH","URBAN",829,1676.31930016964,1299.6280783780301,1.4644558863288,10.469625233908724,0,3,975.68333333329997,975.68333333329997,0.36188178528347403,0.36188178528347403,0,0,0,0,0]
[null,"ZN36300:PA11","BALGOWLAH NORTH","URBAN",2977,1274.5540568051399,13188.7502529392,9.4857573007039999,60747.691402660203,0,10,874000.76666666695,874000.76666666695,206.14712798118902,206.14712798118902,0,0,0,0,0]
[null,"ZN36300:PA13","BALGOWLAH NORTH","URBAN",1296,2131.8063496729401,2029.1349706027499,1.9088520604424,159.98096754185971,0,1,11438,11438,9.9537037037036988,9.9537037037036988,0,0,0,0,0]
[null,"ZN36300:PA17","BALGOWLAH NORTH","URBAN",769,541.89544850908305,1730.9928645285499,1.8822834000872,1521.0334041865449,148.95487569425771,7,110282.8,110282.8,124.44733420026,124.44733420026,1,10800,10800,2.60078023407022,2.60078023407022]
[null,"ZN36300:PA18","BALGOWLAH NORTH","URBAN",386,0,1248.47690797819,2.4224545422991999,1.5797617657015097,0,1,89,89,0.25906735751295301,0.25906735751295301,0,0,0,0,0]
[null,"ZN36300:PA19","BALGOWLAH NORTH","URBAN",1382,3111.3955936400698,5240.5467043012004,3.8152747457712,8944.2207327797933,1313.3630266792766,8,319941.61666666699,319941.61666666699,225.687409551375,225.687409551375,1,46980,46980,6.2952243125904497,6.2952243125904497]
[null,"ZN36300:PA3","BALGOWLAH NORTH","URBAN",2017,2199.6065068955299,8755.9502508197493,5.0419982826031999,1205.8726920607044,0,9,32640.200000000099,32640.200000000099,8.1804660386712893,8.1804660386712893,0,0,0,0,0]
[null,"ZN36300:PA5","BALGOWLAH NORTH","URBAN",1269,360.48911096170099,9339.3175500601192,4.6006796383223998,1471.4698484325352,192.15106869769764,9,43649.916666666701,43649.916666666701,23.089046493301801,23.089046493301801,1,5700,5700,1.4972419227738401,1.4972419227738401]
[null,"ZN36300:PA7","BALGOWLAH NORTH","URBAN",471,438.052665426565,1049.2302336592099,0.88137147971919994,88.017697312147945,0,2,13629.0333333333,13629.0333333333,14.861995753715501,14.861995753715501,0,0,0,0,0]
[null,"ZN36300:PA8","BALGOWLAH NORTH","URBAN",1577,3998.1018840444399,4666.6427561950004,3.2826693414911996,1765.1362070414739,92.604869554112085,7,73384.633333333302,73384.633333333302,112.682308180089,112.682308180089,1,3850,3850,1.3950538998097701,1.3950538998097701]
[null,"ZN36300:PA9","BALGOWLAH NORTH","URBAN",1378,1028.1538571523699,4585.7379948077596,2.9289117716968001,663.41630401248926,0,3,30912.483333333301,30912.483333333301,18.0696661828737,18.0696661828737,0,0,0,0,0]
[null,"ZN3672:PA13","MAROUBRA","URBAN",1807,0,7793.7876782193198,3.5466215540407999,1593.5529264308059,0,7,61320.499999999898,61320.499999999898,143.220807969009,143.220807969009,0,0,0,0,0]
[null,"ZN3672:PA21","MAROUBRA","URBAN",122,0,2561.1512069144101,0.60553373208399996,7.526024417703681,0,2,1696.2166666666999,1696.2166666666999,99.180327868852501,99.180327868852501,0,0,0,0,0]
[null,"ZN3672:PA23","MAROUBRA","URBAN",153,0,1939.2923037032101,3.2355573071119998,42.105420939569576,76.813943605971517,1,1776,1776,96.73202614379079,96.73202614379079,1,3240,3240,3.9215686274509802,3.9215686274509802]
[null,"ZN3672:PA26","MAROUBRA","URBAN",187,0,0,0.51896656196160007,8.5331265137152847,0,1,2244,2244,100,100,0,0,0,0,0]
[null,"ZN3672:PA29","MAROUBRA","URBAN",177,0,1370.0868123472701,0.38304672862400002,6.5836554664842541,0,2,2345.6833333333002,2345.6833333333002,100,100,0,0,0,0,0]
[null,"ZN3672:PA32","MAROUBRA","URBAN",147,0,25.439424931580099,0.1359198150824,1.8026329517036619,0,1,1810,1810,97.278911564625801,97.278911564625801,0,0,0,0,0]
[null,"ZN3672:PA34","MAROUBRA","URBAN",142,0,5513.9216496007602,3.0204402651328,91.249300031315173,13.27906379306066,2,4123,4123,76.760563380281695,76.760563380281695,1,600,600,0.70422535211267601,0.70422535211267601]
[null,"ZN3672:PA35","MAROUBRA","SHORT RURAL",638,0,6538.9193669974202,1.354581891144,86.058484546612277,0,2,8670.4666666666999,8670.4666666666999,100.156739811912,100.156739811912,0,0,0,0,0]
[null,"ZN3672:PA36","MAROUBRA","URBAN",1858,0,5910.9980280099298,3.6309702369631998,832.76854645877586,961.38358774306516,5,31300.8166666666,31300.8166666666,104.251883745963,104.251883745963,1,36135,36135,3.9289558665231401,3.9289558665231401]
[null,"ZN3672:PA37","MAROUBRA","URBAN",1819,0,3639.2629809157302,3.9067778212432001,1879.7865525656127,707.01146361181895,3,65666.5,65666.5,108.301264431006,108.301264431006,1,24698,24698,5.8273776800439796,5.8273776800439796]
[null,"ZN3672:PA4","MAROUBRA","URBAN",118,0,2891.59130266491,3.9702105098031999,42.356577932064816,0,1,1456,1456,94.91525423728811,94.91525423728811,0,0,0,0,0]
[null,"ZN3672:PA42","MAROUBRA","URBAN",348,0,9773.7901214745598,3.3583258608951998,120.13171266219413,0,2,4881.8999999999996,4881.8999999999996,99.712643678160902,99.712643678160902,0,0,0,0,0]
[null,"ZN3672:PA43","MAROUBRA","URBAN",1963,0,2631.62755557119,4.0288085363527992,750.26156457569152,736.82977185950256,1,25415,25415,99.5924605196128,99.5924605196128,1,24960,24960,2.64900662251656,2.64900662251656]
[null,"ZN3672:PA44","MAROUBRA","URBAN",1928,0,7091.8561680523599,2.8798301876327996,12307.068397047457,0,7,583232.58333333302,583232.58333333302,209.18049792531099,209.18049792531099,0,0,0,0,0]
[null,"ZN3672:PA46","MAROUBRA","URBAN",1618,0,5738.5967053836403,2.8986728370864001,880.97232534809541,0,5,41477.933333333298,40842.766666666597,106.73671199011096,106.61310259579699,0,0,0,0,0]
[null,"ZN3672:PA6","MAROUBRA","URBAN",1261,0,4432.0747626469902,2.7459663999999999,328.26777589315554,0,1,16315,16315,99.524187153053106,99.524187153053106,0,0,0,0,0]
[null,"ZN3672:PA9","MAROUBRA","URBAN",1318,0,6011.8889555148298,2.4980674999920001,649.33598075103589,0,4,35474.750000000102,35474.750000000102,103.945371775417,103.945371775417,0,0,0,0,0]
[null,"ZN36800:PA32","WAVERLEY","URBAN",1066,0,3843.7431343599001,2.0136268431016,2907.0078897513317,295.13457001149493,3,197024.96666666699,197024.96666666699,23.8273921200751,23.8273921200751,1,20003,20003,7.7861163227016901,7.7861163227016901]
[null,"ZN36800:PA33","WAVERLEY","URBAN",1873,0,5056.1975925792603,2.7458547857856002,3344.7530544478373,0,4,166241.91666666701,166241.91666666701,14.361986118526399,14.361986118526399,0,0,0,0,0]
[null,"ZN36800:PA36","WAVERLEY","URBAN",391,0,1782.7576658543201,0.82375643612000005,5.3700735188459676,0,1,889.68333333329997,889.68333333329997,0.25575447570332499,0.25575447570332499,0,0,0,0,0]
[null,"ZN36800:PA40","WAVERLEY","URBAN",1153,0,2490.6222473196499,2.3797408149239998,194.31034965950556,0,4,11143.4666666666,11143.4666666666,9.280138768430179,9.280138768430179,0,0,0,0,0]
[null,"ZN36800:PA42","WAVERLEY","URBAN",1332,0,3819.8691041853399,2.7458547857856002,1.0633310928555495,795.53663976364101,1,52.85,52.85,7.507507507507509E-2,7.507507507507509E-2,2,39540,39540,7.8828828828828801,7.8828828828828801]
[null,"ZN36800:PA43","WAVERLEY","URBAN",2162,0,3797.90731049753,3.6611397153415997,45.488617855780539,150.49605632255094,2,1695.6666666665999,1695.6666666665999,0.138760407030527,0.138760407030527,1,5610,5610,0.78630897317298798,0.78630897317298798]
[null,"ZN36800:PA46","WAVERLEY","URBAN",1092,0,3510.8324141715302,2.5349397670567999,1842.0448084949637,0,3,99171.433333333305,99171.433333333305,102.564102564103,102.564102564103,0,0,0,0,0]
[null,"ZN36800:PA49","WAVERLEY","URBAN",1416,0,4982.7500870571002,3.111968757608,705.67714812003737,1488.542811419876,2,30947.45,30947.45,6.2146892655367294,6.2146892655367294,2,65280,65280,19.209039548022599,19.209039548022599]
[null,"ZN36800:PA50","WAVERLEY","URBAN",1042,0,3662.12692127336,2.1966838290127999,0,663.95318960023224,0,0,0,0,0,1,41250,41250,10.556621880998101,10.556621880998101]
[null,"ZN36800:PA54","WAVERLEY","URBAN",7,0,1348.9493936301201,1.4644558863288,0,97.862676209751285,0,0,0,0,0,1,9120,9120,271.42857142857099,271.42857142857099]
[null,"ZN36800:PA56","WAVERLEY","URBAN",506,0,2576.8440172433802,1.3729273928928001,0,464.76723263884941,0,0,0,0,0,2,46200,46200,21.739130434782599,21.739130434782599]
[null,"ZN36800:PA57","WAVERLEY","URBAN",1247,0,4369.25951472206,2.0136268431016,5239.9908690334132,1782.2716784751549,6,355144.9,355144.9,45.870088211708101,45.870088211708101,5,120795,120795,35.605453087409799,35.605453087409799]
[null,"ZN36800:PA58","WAVERLEY","URBAN",1582,0,4030.4623602933102,3.111968757608,122.57637757386304,1615.4839546670337,1,5375.5833333333003,5375.5833333333003,7.6485461441213696,7.6485461441213696,4,70847,70847,16.814159292035399,16.814159292035399]
[null,"ZN384:PA2","CAMPERDOWN","URBAN",890,0,3457.8884630527,4.9423551999999997,24.937759932332206,0,1,688.61666666669998,688.61666666669998,0.112359550561798,0.112359550561798,0,0,0,0,0]
[null,"ZN384:PA22","CAMPERDOWN","URBAN",398,0,4173.0496234252796,0.69637770841984714,399.76220474134612,139.03541800778677,3,78344.933333333407,13422.9333333334,107.7889447236181,71.859296482412105,1,27248,27248,26.130653266331599,26.130653266331599]
[null,"ZN384:PA43","CAMPERDOWN","URBAN",869,0,2877.1004187170802,1.6641544159121773,16.61691723117735,0,2,1362.7333333332999,1362.7333333332999,0.23014959723820499,0.23014959723820499,0,0,0,0,0]
[null,"ZN384:PA62","CAMPERDOWN","URBAN",483,0,0,1.6641544159121773,0,1734.448148546591,0,0,0,0,0,7,142240,142240,83.850931677018608,83.850931677018608]
[null,"ZN384:PA63","CAMPERDOWN","URBAN",474,0,4076.1324878719201,1.3729273928928001,36.61400043100339,738.2958269126658,2,3639.6,3639.6,3.5864978902953601,3.5864978902953601,8,73390,73390,84.599156118143398,84.599156118143398]
[null,"ZN384:PA65","CAMPERDOWN","URBAN",81,0,3048.9777506175801,3.2950257435191999,0,3.8630003758558966,0,0,0,0,0,1,160,160,4.9382716049382696,4.9382716049382696]
[null,"ZN384:PA66","CAMPERDOWN","URBAN",8,0,2858.7735865319401,1.0983419145064,0,8.3698341476877758,0,0,0,0,0,1,1040,1040,25,25]
[null,"ZN384:PA70","CAMPERDOWN","URBAN",3869,0,8953.5533989481701,5.4917095725320006,46.551837168210774,1406.7759702075225,5,1156.8666666665999,1156.8666666665999,0.15507883173946799,0.15507883173946799,3,34960,34960,2.3778754200051702,2.3778754200051702]
[null,"ZN384:PA74","CAMPERDOWN","URBAN",8,0,4694.1266821219497,0.91528492859519994,0,8.316181363234822,0,0,0,0,0,3,1240,1240,87.5,87.5]
[null,"ZN384:PA81","CAMPERDOWN","URBAN",663,0,3109.61228931094,3.2950257435191999,1.2313313698040671,193.3914563162858,1,51,51,0.150829562594268,0.150829562594268,1,8010,8010,2.71493212669683,2.71493212669683]
[null,"ZN3922:PA1","DRUMMOYNE","URBAN",292,0,1117.31970870963,0.63727296646319997,490.60238391382842,0,5,105065.0333333337,249.71666666670001,78.767123287671211,0.68493150684931503,0,0,0,0,0]
[null,"ZN3922:PA10","DRUMMOYNE","URBAN",1192,0,5487.3219237406902,4.2828563296119997,3053.4960363201162,440.60210689496364,10,97301.133333333302,18891.983333333301,26.845637583892611,7.0469798657718101,1,14040,14040,3.2718120805369102,3.2718120805369102]
[null,"ZN3922:PA12","DRUMMOYNE","URBAN",1298,0,5866.5314664313601,4.9395612646992006,380.08027333872889,1673.6018892210761,4,10501.25,824.98333333339997,4.2372881355932233,0.15408320493066299,2,46240,46240,7.8582434514637898,7.8582434514637898]
[null,"ZN3922:PA13","DRUMMOYNE","SHORT RURAL",1252,0,9661.5011307666391,2.7327847111256003,569.53933330613984,571.88614901568587,4,28442.799999999999,28442.799999999999,7.9872204472843507,7.9872204472843507,1,28560,28560,5.4313099041533501,5.4313099041533501]
[null,"ZN3922:PA14","DRUMMOYNE","URBAN",1827,0,6857.6070599241202,3.833459885196,2334.09098530552,0,5,83096.149999999994,13995,18.71921182266011,4.4334975369458105,0,0,0,0,0]
[null,"ZN3922:PA17","DRUMMOYNE","SHORT RURAL",1164,0,17363.519778602498,2.1680711809928002,3936.5002074642352,89.947553914390582,3,247794,247794,272.07903780068699,272.07903780068699,2,5662,5662,0.42955326460481102,0.42955326460481102]
[null,"ZN3922:PA18","DRUMMOYNE","URBAN",1010,0,5888.3590062617704,4.5571372661047995,434.79286119107587,0,1,13021,13021,2.8712871287128698,2.8712871287128698,0,0,0,0,0]
[null,"ZN3922:PA2","DRUMMOYNE","URBAN",2229,0,15592.2756164574,5.8416917949832001,7.9401463952316105,882.404948451211,1,185.5,185.5,4.48631673396142E-2,4.48631673396142E-2,2,20615,20615,1.7048003589053298,1.7048003589053298]
[null,"ZN3922:PA21","DRUMMOYNE","URBAN",768,0,5656.6009016431099,2.0413107943319999,127.13211698669923,8.6254137389558699E-2,1,8499.6333333333005,8499.6333333333005,9.5052083333333304,9.5052083333333304,1,5.7666666666999999,5.7666666666999999,0.13020833333333301,0.13020833333333301]
[null,"ZN3922:PA22","DRUMMOYNE","URBAN",922,0,6138.4284718138097,2.1069644893096,2841.8500982442883,0,13,184076.34999999969,143018.73333333299,131.01952277657242,119.63123644251601,0,0,0,0,0]
[null,"ZN3922:PA26","DRUMMOYNE","URBAN",1912,0,6844.1296079393396,4.1473230434088002,160.93918470334737,0,1,5296,5296,0.836820083682008,0.836820083682008,0,0,0,0,0]
[null,"ZN3922:PA27","DRUMMOYNE","URBAN",473,0,2038.9737814907901,1.0106143055168,3.808200210481425,0,2,514.26666666669996,514.26666666669996,0.42283298097251598,0.42283298097251598,0,0,0,0,0]
[null,"ZN3922:PA29","DRUMMOYNE","URBAN",2265,0,10158.2177891223,4.4908952790520003,3466.4453670524799,0,9,105342.95,105342.95,15.143487858719601,15.143487858719601,0,0,0,0,0]
[null,"ZN3922:PA3","DRUMMOYNE","URBAN",783,0,3614.2816331272402,1.9429124809727998,67.216535135672927,0,2,4721.4666666666999,4721.4666666666999,7.7905491698595206,7.7905491698595206,0,0,0,0,0]
[null,"ZN3922:PA30","DRUMMOYNE","URBAN",360,0,2134.8133022843399,0.54732918291919996,2.629393506930394,0,2,655.63333333330002,318.78333333329999,0.55555555555555602,0.27777777777777801,0,0,0,0,0]
[null,"ZN3922:PA5","DRUMMOYNE","URBAN",2438,0,16829.470324707701,4.7228354371016001,13428.221416495649,70.249753856553454,2,388033.95,388033.95,99.712879409351899,99.712879409351899,1,2030,2030,4.1017227235438901E-2,4.1017227235438901E-2]
[null,"ZN3922:PA7","DRUMMOYNE","URBAN",1840,0,7015.9396832325101,3.9501838280776003,355.17567828578467,0,2,12271,12271,3.8043478260869601,3.8043478260869601,0,0,0,0,0]
[null,"ZN398:PA10","DULWICH HILL","URBAN",596,0,3550.2458530262102,2.5627978008351997,1877.2840509430703,0,2,99970,23010,198.32214765100667,98.993288590603996,0,0,0,0,0]
[null,"ZN398:PA11","DULWICH HILL","URBAN",927,0,5496.9829748741304,3.6611397153415997,4261.3977750607355,446.39115458239706,4,158850.95000000001,38584.949999999997,192.55663430420711,93.203883495145604,1,16640,16640,3.4519956850053899,3.4519956850053899]
[null,"ZN398:PA15","DULWICH HILL","URBAN",1545,0,6212.5536359907701,4.4848961505008003,7047.502940316188,0,4,214455.3666666667,2211.3666666667,99.870550161812261,0.32362459546925598,0,0,0,0,0]
[null,"ZN398:PA16","DULWICH HILL","URBAN",2291,0,7835.8202640980999,4.5764246439368002,17903.967220047969,0,3,533921,219281,202.924487123527,103.404626800524,0,0,0,0,0]
[null,"ZN398:PA19","DULWICH HILL","URBAN",876,0,4025.77460278639,2.5627978008351997,2626.9873986676712,0,5,139893.5500000001,19281.550000000101,113.24200913242011,13.470319634703202,0,0,0,0,0]
[null,"ZN398:PA2","DULWICH HILL","URBAN",2905,0,13279.5167993133,4.8510101223232001,17386.951788564606,0,4,489153.66666666698,113063.66666666701,199.1394148020654,99.552495697073994,0,0,0,0,0]
[null,"ZN398:PA20","DULWICH HILL","URBAN",1452,0,7019.1901863073899,3.2034972510439998,5417.7665945305798,0,7,230807.5333333333,30155.5333333333,121.07438016528928,20.9366391184573,0,0,0,0,0]
[null,"ZN398:PA22","DULWICH HILL","URBAN",262,0,2414.0814508293302,0.91528492859519994,278.981058345034,0,2,41598,7020,168.32061068702288,68.702290076335899,0,0,0,0,0]
[null,"ZN398:PA24","DULWICH HILL","URBAN",2030,0,5915.0336681418303,2.9043036717816002,9004.2376524016599,0,5,423115.53333333298,136843.53333333301,199.1625615763547,99.852216748768498,0,0,0,0,0]
[null,"ZN398:PA25","DULWICH HILL","URBAN",868,0,5150.0850530213702,3.8441967002920001,3451.8403208368168,15.210563978031766,1,122546,0,99.423963133640598,0,1,540,540,0.11520737327188901,0.11520737327188901]
[null,"ZN398:PA26","DULWICH HILL","URBAN",1087,0,1968.0865233315999,2.1051553365375999,2369.9856053472367,0,1,153644,0,99.540018399264,0,0,0,0,0,0]
[null,"ZN398:PA29","DULWICH HILL","URBAN",935,0,3317.6748844612598,3.6611397153415997,3442.8177118951903,666.63582880844763,2,128336.9666666667,394.96666666670001,96.470588235294159,0.10695187165775399,2,24850,24850,8.4491978609625598,8.4491978609625598]
[null,"ZN398:PA3","DULWICH HILL","URBAN",1929,3.2936438993001902,5026.7321972502004,3.05451812034,7291.7958034039211,0,3,325796.06666666671,75676.066666666695,199.63711767755311,99.896319336443696,0,0,0,0,0]
[null,"ZN398:PA30","DULWICH HILL","URBAN",1375,0,2522.7676505347399,2.9289117716968001,4184.1873955375886,0,1,194966,0,99.854545454545402,0,0,0,0,0,0]
[null,"ZN398:PA31","DULWICH HILL","URBAN",927,0,3714.3906325858802,4.3018391655504002,4096.7541505430381,2141.8526304687998,2,129969,39,98.813376483279427,0.107874865156419,3,67950,67950,23.19309600863,23.19309600863]
[null,"ZN398:PA4","DULWICH HILL","URBAN",2010,0,9301.6531935681396,3.6611397153415997,9099.7757901063196,0,5,339209.83333333331,78949.833333333299,199.4029850746268,99.800995024875604,0,0,0,0,0]
[null,"ZN398:PA9","DULWICH HILL","URBAN",846,0,1713.33687196745,1.3729273928928001,1710.9927824500749,0,5,170080.55,61400.55,227.42316784869931,128.605200945626,0,0,0,0,0]
[null,"ZN4545:PA11","MEADOWBANK","URBAN",659,0,1372.1545647975399,1.2813989004175999,714.75566859078333,0,1,76125,76125,79.66616084977241,79.66616084977241,0,0,0,0,0]
[null,"ZN4545:PA13","MEADOWBANK","URBAN",294,0,1363.0336343490601,0.73222794268400004,223.23849940043095,0,1,41608,41608,98.299319727891202,98.299319727891202,0,0,0,0,0]
[null,"ZN4545:PA17","MEADOWBANK","URBAN",1194,2332.2901066258601,6437.0319846156799,4.3933676580255998,12214.823284291246,0,8,379440.5,379440.5,210.21775544388598,210.21775544388598,0,0,0,0,0]
[null,"ZN4545:PA19","MEADOWBANK","URBAN",648,0,5263.5613472120003,3.2950257435191999,5463.7601291040028,0,9,226301.2,226301.2,238.27160493827199,238.27160493827199,0,0,0,0,0]
[null,"ZN4545:PA2","MEADOWBANK","URBAN",1708,0,5068.8567511656702,2.8556889779087999,6844.4936022590864,3193.3009734114571,11,327102.95,327102.95,115.92505854800901,115.92505854800901,6,152610,152610,16.159250585480102,16.159250585480102]
[null,"ZN4545:PA21","MEADOWBANK","URBAN",716,2016.48538884089,3036.7713635925002,1.9770154457271998,1605.5629110283289,0,8,110833.566666667,110833.566666667,105.44692737430199,105.44692737430199,0,0,0,0,0]
[null,"ZN4545:PA24","MEADOWBANK","URBAN",1673,1464.0912008682201,4758.0980354406202,4.3018391655504002,7927.9217270089457,0,6,251512.3,251512.3,106.395696353855,106.395696353855,0,0,0,0,0]
[null,"ZN4545:PA25","MEADOWBANK","URBAN",1078,2330.2453810585798,5771.48033213893,3.2034972510439998,4079.7103381626262,0,4,173803.7,173803.7,107.60667903525001,107.60667903525001,0,0,0,0,0]
[null,"ZN4545:PA26","MEADOWBANK","URBAN",1240,0,2981.06853865003,3.1725282650439999,4671.6705388721593,539.00900123642703,6,200965.15,200965.15,107.66129032258101,107.66129032258101,2,23187,23187,4.8387096774193497,4.8387096774193497]
[null,"ZN4545:PA27","MEADOWBANK","URBAN",1083,1327.3770484740901,3253.4041140772802,1.9925142969223999,2574.4503970607202,1136.5957267819167,9,176334.433333333,176334.433333333,112.280701754386,112.280701754386,2,77850,77850,15.974145891043401,15.974145891043401]
[null,"ZN4545:PA28","MEADOWBANK","URBAN",1099,1.2998618456777,1784.7543713488001,1.6475128712792,2589.4890651511319,0,5,214505.933333333,214505.933333333,173.43039126478601,173.43039126478601,0,0,0,0,0]
[null,"ZN4545:PA29","MEADOWBANK","URBAN",1697,3761.9269430896502,5378.8580527176,4.2881447505599999,15729.556398355964,0,8,500611.8,500611.8,204.47849145551001,204.47849145551001,0,0,0,0,0]
[null,"ZN4545:PA3","MEADOWBANK","URBAN",595,0,3351.9509271382399,3.1640306933103997,2027.7805076152415,0,1,87465,87465,100,100,0,0,0,0,0]
[null,"ZN4545:PA31","MEADOWBANK","URBAN",3045,4281.4047413313001,6214.7671214059401,5.0535087482711996,82515.350477794607,0,21,2228413.4500000002,2228413.4500000002,695.40229885057499,695.40229885057499,0,0,0,0,0]
[null,"ZN4545:PA32","MEADOWBANK","URBAN",815,0,5928.6359439198204,4.8084287903055998,4395.3218820366747,0,5,124750.28333333301,124750.28333333301,102.944785276074,102.944785276074,0,0,0,0,0]
[null,"ZN4545:PA33","MEADOWBANK","URBAN",2668,0,6499.7727918171904,4.0455593848903995,11608.49962136748,672.30692787842554,1,391608,391608,99.850074962518804,99.850074962518804,1,22680,22680,1.57421289355322,1.57421289355322]
[null,"ZN4545:PA35","MEADOWBANK","URBAN",1365,386.83956897765898,4280.1239729890804,3.2899665665688,4996.8089533267075,0,2,207279,207279,105.05494505494499,105.05494505494499,0,0,0,0,0]
[null,"ZN4545:PA36","MEADOWBANK","URBAN",1230,3676.5029251657302,4474.5890840703096,3.4963369619047997,8413.3516604912693,0,13,328405.03333333298,328405.03333333298,143.333333333333,143.333333333333,0,0,0,0,0]
[null,"ZN4545:PA39","MEADOWBANK","URBAN",1174,0,5538.1866806745402,2.5830832740408001,3257.8803384819662,422.90740120875978,4,172127.7,172127.7,100.93696763202699,100.93696763202699,2,22344,22344,16.354344122657601,16.354344122657601]
[null,"ZN4545:PA4","MEADOWBANK","URBAN",1244,0,7777.5923768107004,4.4127381056648005,10738.938183928381,174.11645499681165,9,332129.33333333302,332129.33333333302,232.95819935691301,232.95819935691301,3,5385,5385,1.2861736334405101,1.2861736334405101]
[null,"ZN4545:PA40","MEADOWBANK","URBAN",1777,4072.60576565169,4930.6217851248202,4.2777536332255996,9163.3087360897898,0,12,292341.58333333302,292341.58333333302,107.20315137872799,107.20315137872799,0,0,0,0,0]
[null,"ZN4545:PA41","MEADOWBANK","SHORT RURAL",1057,2915.4618829006799,7926.3058383630096,2.8217999083720002,5915.2568719144629,0,7,286089.183333333,286089.183333333,222.13812677388799,222.13812677388799,0,0,0,0,0]
[null,"ZN4545:PA42","MEADOWBANK","URBAN",1120,1607.60611823522,3062.5920172339102,1.9165975275440001,2816.9112674695657,0,6,200584,200584,113.21428571428601,113.21428571428601,0,0,0,0,0]
[null,"ZN4545:PA44","MEADOWBANK","URBAN",1195,831.60571356019796,9558.5567452662108,3.3682485382679999,4893.1111149416211,0,5,198259.95,198259.95,116.820083682008,116.820083682008,0,0,0,0,0]
[null,"ZN4545:PA6","MEADOWBANK","URBAN",729,185.89799148009101,2642.1657468409198,2.8818767857912002,2664.1280367846089,0,3,126163.5,126163.5,120.850480109739,120.850480109739,0,0,0,0,0]
[null,"ZN4545:PA9","MEADOWBANK","URBAN",26,0,3088.77909621359,5.3460146166816003,375.89481643310017,0,3,9596,9596,215.38461538461502,215.38461538461502,0,0,0,0,0]
[null,"ZN4990:PA51 52ABC","CITY CENTRAL","CBD",385,0,4638.62535535589,14.168610697076277,0,485.86887227134531,0,0,0,0,0,1,4680,4680,6.7532467532467502,6.7532467532467502]
[null,"ZN4990:PA51 52DEF","CITY CENTRAL","CBD",723,0,8441.8764824807404,10.068134216268673,0,239.3920111382439,0,0,0,0,0,2,3245,3245,0.69156293222683296,0.69156293222683296]
[null,"ZN4990:PA51 52GHJ","CITY CENTRAL","CBD",300,0,6054.3283804774301,11.624118595146557,0,751.65872330428704,0,0,0,0,0,2,8825,8825,8.6666666666666607,8.6666666666666607]
[null,"ZN4990:PA51 52KLM","CITY CENTRAL","CBD",192,0,9837.1238198810697,14.91914433865267,0,261.26893340559093,0,0,0,0,0,5,2390,2390,11.4583333333333,11.4583333333333]
[null,"ZN4990:PA53 54ABC","CITY CENTRAL","CBD",339,0,5189.2866355268197,5.9127406397359659,0,2065.0247959112044,0,0,0,0,0,2,47664,47664,46.017699115044202,46.017699115044202]
[null,"ZN4990:PA53 54KLM","CITY CENTRAL","CBD",2069,0,5305.9484607432396,3.7343625093069255,238.13264618932837,0,2,8702.75,8702.75,1.0633156114064801,1.0633156114064801,0,0,0,0,0]
[null,"ZN4990:PA55 56DEF","CITY CENTRAL","CBD",390,0,10828.6104287749,10.873584953570166,2045.9584746811963,3527.9816682457795,2,25679,25679,50.769230769230802,50.769230769230802,2,44280,44280,21.025641025641001,21.025641025641001]
[null,"ZN4990:PA55 56KLM","CITY CENTRAL","CBD",980,0,7678.2709939472797,12.374652236722948,10009.505581765417,2163.9159959492322,1,110391,110391,9.4897959183673493,9.4897959183673493,1,23865,23865,4.3877551020408196,4.3877551020408196]
[null,"ZN4990:PA55ABC","CITY CENTRAL","CBD",414,0,2312.8778136781102,5.1439012995845399,0,2079.0399758858857,0,0,0,0,0,3,55160,55160,39.130434782608695,39.130434782608695]
[null,"ZN4990:PA57L","CITY CENTRAL","URBAN",175,0,1692.05773845366,2.9289117720054318,0,149.36934786583467,0,0,0,0,0,1,6960,6960,16.571428571428601,16.571428571428601]
[null,"ZN5868:PA10","GORE HILL","URBAN",287,0,3365.2840277914702,3.2539325408168001,0,247.96354700385245,0,0,0,0,0,2,10400,10400,5.92334494773519,5.92334494773519]
[null,"ZN5868:PA13","GORE HILL","URBAN",767,0,3472.0409836015301,3.6611397153415997,0,17.973682305901811,0,0,0,0,0,1,670,670,0.13037809647979101,0.13037809647979101]
[null,"ZN5868:PA14","GORE HILL","URBAN",1948,0,5510.9209097918601,4.2214591919319995,15.651611807295776,0,2,506,506,2.2073921971252597,2.2073921971252597,0,0,0,0,0]
[null,"ZN5868:PA17","GORE HILL","URBAN",248,0,1696.8074511023001,2.372446916136,140.88308782029137,0,4,8104.3166666666002,8104.3166666666002,10.4838709677419,10.4838709677419,0,0,0,0,0]
[null,"ZN5868:PA2","GORE HILL","URBAN",289,0,2494.3859715263102,3.5336217974504001,404.92538204192437,0,2,15639,15639,104.15224913494801,104.15224913494801,0,0,0,0,0]
[null,"ZN5868:PA24","GORE HILL","URBAN",70,0,1666.55918911556,4.4275077855631997,139.40252588066656,1.135463906405243,1,4297,4297,98.571428571428598,98.571428571428598,1,35,35,1.4285714285714299,1.4285714285714299]
[null,"ZN5868:PA25","GORE HILL","URBAN",78,0,1675.35133897999,3.8198428914695999,42.52875153374805,0,1,1519.4666666666999,1519.4666666666999,10.2564102564103,10.2564102564103,0,0,0,0,0]
[null,"ZN5868:PA27","GORE HILL","URBAN",811,0,4828.077195586,3.3936933604711998,2842.8474775198692,0,2,114323.366666667,114323.366666667,98.890258939580704,98.890258939580704,0,0,0,0,0]
[null,"ZN5868:PA30","GORE HILL","URBAN",1744,0,8574.9228813058598,4.2103106721144004,523.84100347104823,0,11,16980.0666666666,16980.0666666666,6.7087155963302694,6.7087155963302694,0,0,0,0,0]
[null,"ZN5868:PA5","GORE HILL","SHORT RURAL",739,0,6690.7526619464397,1.5427952273959999,266.55057572169778,5.369673161194557,2,23579,23579,12.3139377537212,12.3139377537212,1,475,475,0.13531799729364,0.13531799729364]
[null,"ZN5868:PA6","GORE HILL","URBAN",1116,0,2139.0230706320499,2.7459663999999999,732.00461191988336,0,1,36380.833333333299,36380.833333333299,26.254480286738403,26.254480286738403,0,0,0,0,0]
[null,"ZN5868:PA7","GORE HILL","URBAN",218,0,6753.6228173847903,3.8846994183736001,243.88373311069589,0,1,8568,8568,28.899082568807298,28.899082568807298,0,0,0,0,0]
[null,"ZN630:PA10","MASCOT","URBAN",305,0,2585.9711563390701,1.8359691880864,0.96859860804250708,0,1,72,72,0.65573770491803296,0.65573770491803296,0,0,0,0,0]
[null,"ZN630:PA14","MASCOT","URBAN",1250,0,8098.00010892095,2.7458547857856002,7.072442787580739,0,3,351.51666666670002,351.51666666670002,0.48,0.48,0,0,0,0,0]
[null,"ZN630:PA15","MASCOT","URBAN",54,0,2206.70310481357,1.8358932464544,26.070367467035624,0,1,1938,1938,94.4444444444444,94.4444444444444,0,0,0,0,0]
[null,"ZN630:PA22","MASCOT","URBAN",403,0,1646.50576803942,2.5158906974096,0,111.43818503490442,0,0,0,0,0,1,6045,6045,3.2258064516128995,3.2258064516128995]
[null,"ZN630:PA24","MASCOT","URBAN",748,0,3450.8084137054798,1.4371522130128001,612.51668394091541,0,2,58166,58166,145.85561497326199,145.85561497326199,0,0,0,0,0]
[null,"ZN630:PA25","MASCOT","URBAN",103,0,2969.9347651428602,1.8305698571903999,1.4217987491982114,0,1,106,106,0.97087378640776711,0.97087378640776711,0,0,0,0,0]
[null,"ZN630:PA26","MASCOT","URBAN",411,0,1455.8566840791,1.8305698571903999,506.25424708479335,0.80479174482917637,2,37743,37743,104.86618004866199,104.86618004866199,1,60,60,0.72992700729926996,0.72992700729926996]
[null,"ZN630:PA27","MASCOT","URBAN",388,0,3660.9259981108999,1.8305698571903999,156.08935890961874,0,2,11637,11637,87.371134020618598,87.371134020618598,0,0,0,0,0]
[null,"ZN630:PA3","MASCOT","URBAN",1456,0,5028.61542737126,1.8305698571903999,64.034820050171021,0,4,4774.0166666667001,4774.0166666667001,1.0302197802197801,1.0302197802197801,0,0,0,0,0]
[null,"ZN630:PA30","MASCOT","URBAN",1,0,275.99846980820303,0.1805124944672,4.3648282882130997E-2,0,1,33,33,100,100,0,0,0,0,0]
[null,"ZN630:PA31","MASCOT","URBAN",603,0,4100.45866716827,2.2400222502928,173.3253980126033,0,1,10560,10560,53.067993366500801,53.067993366500801,0,0,0,0,0]
[null,"ZN630:PA32","MASCOT","URBAN",318,0,2899.2512974408501,1.8305698571903999,366.77042451015001,0,2,27344,27344,205.34591194968499,205.34591194968499,0,0,0,0,0]
[null,"ZN630:PA33","MASCOT","URBAN",118,0,2167.5186120164799,3.5827294854896001,101.35840675473219,0,1,3861,3861,99.1525423728813,99.1525423728813,0,0,0,0,0]
[null,"ZN630:PA34","MASCOT","URBAN",185,0,2631.88141271416,1.9682959243896001,95.077969797134955,8.5091927341043672,2,6592.4,6592.4,97.83783783783781,97.83783783783781,1,590,590,0.54054054054054101,0.54054054054054101]
[null,"ZN630:PA35","MASCOT","URBAN",157,0,3914.2759144838901,1.6591697801616001,68.275341928351054,0,1,5616,5616,99.363057324840796,99.363057324840796,0,0,0,0,0]
[null,"ZN630:PA38","MASCOT","URBAN",2235,0,7942.9371056884902,3.5490183186416,4013.9594071432552,0,4,154354.316666667,154354.316666667,77.449664429530202,77.449664429530202,0,0,0,0,0]
[null,"ZN630:PA40","MASCOT","URBAN",79,0,3877.9742206813098,2.5627978008351997,482.15703867377027,0,4,25676.05,25676.05,245.569620253164,245.569620253164,0,0,0,0,0]
[null,"ZN630:PA41","MASCOT","URBAN",599,0,3287.70015553645,4.0564117986384005,1736.0513188330794,0,6,58408.3,58408.3,103.83973288814701,103.83973288814701,0,0,0,0,0]
[null,"ZN630:PA9","MASCOT","URBAN",166,0,2022.5760717911201,0.96053057246400009,0,2.6392979225111688,0,0,0,0,0,1,375,375,0.60240963855421703,0.60240963855421703]
[null,"ZN690:PA10","CAMPSIE","URBAN",1226,3.2999521891049399,5817.8775177617599,2.8373832792216001,2525.1041726846893,0,3,121454.98333333329,476.98333333329998,99.836867862968987,0.16313213703099499,0,0,0,0,0]
[null,"ZN690:PA11","CAMPSIE","URBAN",1783,0,5697.00480483914,3.3865542359943999,4557.2391637118862,0,6,183652.91666666669,7630.9166666666997,103.14077397644419,3.4212002243409998,0,0,0,0,0]
[null,"ZN690:PA12","CAMPSIE","URBAN",2019,0,9703.1674176445104,3.935725193728,15196.212743825172,0,7,526944.21666666702,328350.21666666702,168.0039623576028,68.647845468053504,0,0,0,0,0]
[null,"ZN690:PA14","CAMPSIE","URBAN",2117,0,5833.4301718873803,3.4780827294303998,7016.2467300963945,0,5,275308.09999999998,66913.100000000006,109.73075106282471,10.2975909305621,0,0,0,0,0]
[null,"ZN690:PA15","CAMPSIE","URBAN",549,0,2806.0221366097799,3.111968757608,1413.8333007230442,0,3,62003.616666666698,6736.6166666667004,106.92167577413481,7.6502732240437101,0,0,0,0,0]
[null,"ZN690:PA17","CAMPSIE","URBAN",1786,0,3466.2200559120301,2.4712693073991998,4813.5595221708581,0,4,265827.75,91877.75,108.28667413213884,8.902575587905929,0,0,0,0,0]
[null,"ZN690:PA18","CAMPSIE","URBAN",1438,0,6920.9425606607601,5.4917095725320006,7930.1522736583283,0,9,197073.4,56541.4,116.8984700973575,17.1766342141864,0,0,0,0,0]
[null,"ZN690:PA24","CAMPSIE","SHORT RURAL",929,0,11936.719779082699,3.2034972510439998,2429.5354997094205,0,4,103503,13112,103.01399354144243,3.7674919268030203,0,0,0,0,0]
[null,"ZN690:PA25","CAMPSIE","URBAN",2316,0,10932.4076471928,5.0340671082343995,9012.3204677356407,0,4,244327.1166666667,17751.116666666701,106.86528497409327,7.0379965457685696,0,0,0,0,0]
[null,"ZN690:PA26","CAMPSIE","URBAN",1326,0,6203.0666289389401,3.8441967002920001,3969.9651791177603,0,5,140940.2833333333,11580.2833333333,109.95475113122171,10.4072398190045,0,0,0,0,0]
[null,"ZN690:PA27","CAMPSIE","SHORT RURAL",42,0,4635.9128680126196,1.4644558863288,59.039522423909169,0,1,5502,0,100,0,0,0,0,0,0]
[null,"ZN690:PA28","CAMPSIE","URBAN",1634,0,6030.3013025019,3.111968757608,4854.6694807319336,0,2,212901.3833333333,419.38333333330002,99.326805385556909,6.1199510403916794E-2,0,0,0,0,0]
[null,"ZN690:PA3","CAMPSIE","URBAN",523,0,7017.4437201904002,2.3797408149239998,886.90598808852042,979.27059534536522,2,50863,868,179.54110898661568,82.98279158699809,3,56160,56160,18.738049713193099,18.738049713193099]
[null,"ZN690:PA30","CAMPSIE","URBAN",1221,0,7048.4464786112303,2.6543262933103997,7731.1493396010519,1568.0864155426418,5,397506.1,238472.1,302.21130221130244,202.78460278460301,1,80625,80625,3.5217035217035204,3.5217035217035204]
[null,"ZN690:PA33","CAMPSIE","URBAN",1276,0,4977.0332798242098,3.111968757608,4396.3945477526813,0,9,192803.75000000009,29970.750000000098,106.5830721003135,9.1692789968652093,0,0,0,0,0]
[null,"ZN690:PA34","CAMPSIE","URBAN",2190,0,7825.3226339827597,3.2950257435191999,7890.4152788545634,0,7,326809.81666666671,42539.816666666702,110.41095890410961,11.324200913241999,0,0,0,0,0]
[null,"ZN690:PA35","CAMPSIE","URBAN",3249,0,10955.0178698626,4.8510101223232001,31162.845179653817,513.4038270069301,9,876716.066666667,471931.066666667,188.30409356725139,88.9812249923053,1,14443.7833333333,14443.7833333333,1.8775007694675301,1.8775007694675301]
[null,"ZN690:PA36","CAMPSIE","URBAN",1299,0,8563.6245958061299,3.2034972510439998,4260.4304602535758,0,6,181502.7333333334,11595.733333333401,103.0023094688222,3.1562740569668901,0,0,0,0,0]
[null,"ZN690:PA4","CAMPSIE","URBAN",1370,0,5822.5585214371904,2.6543262933103997,4765.8167276761515,0,5,245040.05,109905.05,111.021897810219,11.3868613138686,0,0,0,0,0]
[null,"ZN690:PA5","CAMPSIE","URBAN",685,0,4924.54206818066,2.0136268431016,4388.3686054659292,0.14754515323276254,14,297425.46666666702,229808.46666666699,344.8175182481753,245.10948905109501,2,10,10,0.29197080291970801,0.29197080291970801]
[null,"ZN690:PA6","CAMPSIE","URBAN",980,0,7030.4983468681003,3.0204402651328,2247.8821320666075,0.22131772988434434,2,101568.1,348.1,99.285714285714334,0.10204081632653099,2,10,10,0.20408163265306098,0.20408163265306098]
[null,"ZN711:PA10","BLACKWATTLE BAY","URBAN",2,0,907.39783232468096,0.24962316238682661,0.34020741946323041,0,1,186,186,100,100,0,0,0,0,0]
[null,"ZN711:PA11","BLACKWATTLE BAY","URBAN",366,0,943.65828964829802,1.5809466951165683,351.90250677531583,2997.85534690842,1,30378,30378,100,100,3,258790,258790,142.89617486338798,142.89617486338798]
[null,"ZN711:PA15","BLACKWATTLE BAY","URBAN",499,0,5618.8127034285899,1.3313235327297419,25.071132573910951,0,3,2570.0666666666998,2116.0666666666998,4.809619238476956,4.6092184368737499,0,0,0,0,0]
[null,"ZN711:PA2","BLACKWATTLE BAY","URBAN",32,0,1874.8533246689501,1.4145312535253507,27.860426953031855,0,1,2688,2688,100,100,0,0,0,0,0]
[null,"ZN711:PA21","BLACKWATTLE BAY","URBAN",755,0,4302.98148051929,1.3313235327297419,1463.4528191505042,0,3,150020,76472,140.00000000000011,118.54304635761601,0,0,0,0,0]
[null,"ZN711:PA22","BLACKWATTLE BAY","URBAN",387,0,3262.9966769900002,0.74886948716047974,375.57252943807742,41.48335630874228,2,68445,68445,197.157622739018,197.157622739018,1,7560,7560,3.1007751937984498,3.1007751937984498]
[null,"ZN711:PA23","BLACKWATTLE BAY","URBAN",298,0,2056.9858946488898,1.1649080911385241,3.9043577294016294,0,1,457.4166666667,457.4166666667,0.33557046979865801,0.33557046979865801,0,0,0,0,0]
[null,"ZN711:PA24","BLACKWATTLE BAY","URBAN",323,0,903.40033171709297,1.1649080911385241,0,81.942432214799581,0,0,0,0,0,1,9600,9600,4.95356037151703,4.95356037151703]
[null,"ZN711:PA28","BLACKWATTLE BAY","URBAN",435,0,635.14365859803797,1.0817003703429153,0,748.17281663622089,0,0,0,0,0,2,94395,94395,73.103448275862107,73.103448275862107]
[null,"ZN711:PA3","BLACKWATTLE BAY","URBAN",345,0,1607.5047361844099,0.49924632477365322,99.702722768498319,219.43378555378362,1,27255,27255,100,100,1,59985,59985,80.869565217391298,80.869565217391298]
[null,"ZN711:PA31","BLACKWATTLE BAY","URBAN",30,0,2268.7876389529501,0.49924632477365322,2.633863892618558,25.032681412762209,1,720,720,10,10,2,6843,6843,70,70]
[null,"ZN711:PA32","BLACKWATTLE BAY","URBAN",391,0,1693.6470962293099,0.66566176636487095,27.607771120369559,24.070589463097381,1,5660.2,5660.2,1.79028132992327,1.79028132992327,1,4935,4935,1.79028132992327,1.79028132992327]
[null,"ZN711:PA33","BLACKWATTLE BAY","URBAN",1290,0,2964.3959846695302,2.0801930198902219,12.753967662896867,15.547113255040101,1,836.75,836.75,7.7519379844961198E-2,7.7519379844961198E-2,2,1020,1020,0.15503875968992201,0.15503875968992201]
[null,"ZN711:PA34","BLACKWATTLE BAY","URBAN",420,0,2875.0908952493201,1.3729273931275463,386.25024109483536,171.16914425762235,1,38395.050000000003,38395.050000000003,85.476190476190496,85.476190476190496,1,17015,17015,9.761904761904761,9.761904761904761]
[null,"ZN711:PA4","BLACKWATTLE BAY","URBAN",639,0,2082.7026048008101,2.4962316238682658,1050.2532271816499,0,1,57420,57420,99.843505477308298,99.843505477308298,0,0,0,0,0]
[null,"ZN711:PA5","BLACKWATTLE BAY","URBAN",380,0,1414.6385105956001,1.8305698575033951,345.89949198672275,0,1,25788,25788,80.789473684210506,80.789473684210506,0,0,0,0,0]
[null,"ZN711:PA9","BLACKWATTLE BAY","URBAN",92,0,250.14831320539099,0.54085018517145766,29.89679394408417,0,1,7544,7544,100,100,0,0,0,0,0]
[null,"ZN72:PA10","FIVE DOCK","URBAN",3039,0,5947.4419402905996,4.5032018491880006,2179.6901554572469,726.21912207033097,5,66058.3,66058.3,6.4823955248436995,6.4823955248436995,2,22009,22009,2.2046725896676502,2.2046725896676502]
[null,"ZN72:PA14","FIVE DOCK","URBAN",2330,1.65092377932328,9287.8243510927005,4.9658457924743997,261.3993485078658,244.51666164400896,2,7183.9833333332999,7183.9833333332999,0.77253218884120201,0.77253218884120201,1,6720,6720,1.2017167381974199,1.2017167381974199]
[null,"ZN72:PA15","FIVE DOCK","URBAN",1278,0,4718.3302067782897,2.8164414499079999,120.69518356982117,0,4,5848.4833333334,5848.4833333334,2.660406885759,2.660406885759,0,0,0,0,0]
[null,"ZN72:PA16","FIVE DOCK","URBAN",2752,0,9856.6625572897301,4.8667814592808005,1381.2779632131796,3467.8082962937233,9,38734.083333333299,38734.083333333299,13.408430232558199,13.408430232558199,2,97245,97245,6.5770348837209296,6.5770348837209296]
[null,"ZN72:PA23","FIVE DOCK","URBAN",1675,0,5729.2632430036201,2.5701244004511996,17.282271846353087,0,3,917.7,917.7,0.17910447761193998,0.17910447761193998,0,0,0,0,0]
[null,"ZN72:PA24","FIVE DOCK","SHORT RURAL",782,0,5734.6324471377902,4.3415942889951999,138.83633961032052,1212.0489751891812,2,4364.2333333334,4364.2333333334,5.7544757033248102,5.7544757033248102,3,38100,38100,18.542199488491001,18.542199488491001]
[null,"ZN72:PA25","FIVE DOCK","URBAN",496,0,2326.6346172830799,1.3389553957472,17.280556693487025,174.39003901934984,3,1761.35,1761.35,3.2258064516128995,3.2258064516128995,2,17775,17775,6.0483870967742002,6.0483870967742002]
[null,"ZN72:PA26","FIVE DOCK","URBAN",1419,0,11348.160819906399,4.4743424398647997,646.63164979682028,0,6,19723.3999999999,19723.3999999999,7.7519379844961298,7.7519379844961298,0,0,0,0,0]
[null,"ZN72:PA30","FIVE DOCK","URBAN",726,0,4806.5069852675697,2.6847821813647998,381.23103027738154,6938.4181937827834,4,19379.083333333299,19379.083333333299,17.079889807162498,17.079889807162498,3,352700,352700,109.09090909090899,109.09090909090899]
[null,"ZN72:PA31","FIVE DOCK","URBAN",1668,0,9045.6822430992597,4.4483197108735997,12747.857643324907,4266.7596970326686,10,391106.7,391106.7,113.848920863309,113.848920863309,5,130905,130905,13.069544364508401,13.069544364508401]
[null,"ZN72:PA35","FIVE DOCK","URBAN",653,0,3231.2855721772398,1.5026768379616,301.75946353469641,0,3,27406.233333333301,27406.233333333301,14.701378254211301,14.701378254211301,0,0,0,0,0]
[null,"ZN7481:PA1","DARLING HARBOUR 132 11kV","URBAN",2653,0,10336.9381419767,6.5534400896639999,588.3957637101206,602.16127940083788,4,12253.333333333299,12253.333333333299,4.7870335469280096,4.7870335469280096,1,12540,12540,7.8778741047870309,7.8778741047870309]
[null,"ZN7481:PA10","DARLING HARBOUR 132 11kV","URBAN",23,0,484.82419045615097,3.2034972510439998,0,145.76790482590363,0,0,0,0,0,1,6210,6210,100,100]
[null,"ZN7481:PA12","DARLING HARBOUR 132 11kV","URBAN",1046,0,10889.9449411234,7.4202650938936001,1056.967508894081,2238.607162741564,1,19440,19440,15.487571701720801,15.487571701720801,5,41173,41173,13.671128107074601,13.671128107074601]
[null,"ZN7481:PA17","DARLING HARBOUR 132 11kV","URBAN",4281,0,17784.327812522399,8.0138708975136002,18117.108582361361,0,6,308532.26666666701,308532.26666666701,106.28357860313,106.28357860313,0,0,0,0,0]
[null,"ZN7481:PA19","DARLING HARBOUR 132 11kV","URBAN",139,0,1625.78525155182,1.1898704069816,58.135472997921596,0,1,6668,6668,100,100,0,0,0,0,0]
[null,"ZN7481:PA2","DARLING HARBOUR 132 11kV","URBAN",10,0,192.31508584611601,3.8441967002920001,0,76.05281989015883,0,0,0,0,0,1,2700,2700,100,100]
[null,"ZN7481:PA20","DARLING HARBOUR 132 11kV","URBAN",899,0,8130.1948765365596,5.0581277519959995,142.6217828867035,0,1,3848.1333333333,3848.1333333333,5.4505005561735302,5.4505005561735302,0,0,0,0,0]
[null,"ZN7481:PA5","DARLING HARBOUR 132 11kV","URBAN",10,0,288.69769582562702,3.2584143461448001,0,64.463818767660015,0,0,0,0,0,1,2700,2700,100,100]
[null,"ZN7481:PA6","DARLING HARBOUR 132 11kV","URBAN",486,0,5148.2307884663696,1.2765010254536,23.3740183082509,0,1,2499,0,2.8806584362139902,0,0,0,0,0,0]
[null,"ZN7481:PA8","DARLING HARBOUR 132 11kV","URBAN",1,0,472.22713129190299,2.0502382404759998,0,4.0561503947754129,0,0,0,0,0,1,270,270,100,100]
[null,"ZN7481:PA9","DARLING HARBOUR 132 11kV","URBAN",1723,0,4591.5327807719405,10.44640363996,17432.348058739586,1066.8742139908859,3,227742,227742,196.982008125363,196.982008125363,2,13938,13938,8.9378990133488099,8.9378990133488099]
[null,"ZN7900:PA1","CAMPBELL ST","URBAN",539,0,1049.72185462414,1.8105908244191999,45.850070172775268,0,1,3456,3456,3.3395176252319101,3.3395176252319101,0,0,0,0,0]
[null,"ZN7900:PA11","CAMPBELL ST","URBAN",851,0,3935.14697200111,2.7458547857856002,2403.1081500599207,1250.6463714645404,7,119440,119440,34.7826086956522,34.7826086956522,4,62160,62160,20.446533490011699,20.446533490011699]
[null,"ZN7900:PA12","CAMPBELL ST","URBAN",1711,0,2922.87572814435,4.8614927087783997,25.247528954419884,0,3,708.76666666669996,708.76666666669996,0.81823495032144899,0.81823495032144899,0,0,0,0,0]
[null,"ZN7900:PA14","CAMPBELL ST","URBAN",434,0,3728.9685854977602,2.5627978008351997,0.84503133232407879,0,1,45,45,0.23041474654377903,0.23041474654377903,0,0,0,0,0]
[null,"ZN7900:PA16","CAMPBELL ST","URBAN",1041,0,566.28062602351201,2.3779359895951999,102.13733478937098,0,3,5861.9,5861.9,6.3400576368876003,6.3400576368876003,0,0,0,0,0]
[null,"ZN7900:PA19","CAMPBELL ST","URBAN",745,0,2901.4162810623002,3.111968757608,0,1078.3498482668099,0,0,0,0,0,2,47291,47291,16.241610738254998,16.241610738254998]
[null,"ZN7900:PA2","CAMPBELL ST","URBAN",1587,0,3297.5638266280198,2.6531375569616,25.569017098569599,0,2,1315.25,1315.25,0.126023944549464,0.126023944549464,0,0,0,0,0]
[null,"ZN7900:PA20","CAMPBELL ST","URBAN",92,0,3331.9791050065401,2.7701592133312003,0,34.709375254291238,0,0,0,0,0,3,1710,1710,7.6086956521739095,7.6086956521739095]
[null,"ZN7900:PA23","CAMPBELL ST","URBAN",399,0,2562.0123568439699,2.6504284775951996,367.72855431295523,1891.1754221809126,3,18935,18935,12.280701754386,12.280701754386,2,97380,97380,10.275689223057601,10.275689223057601]
[null,"ZN7900:PA24","CAMPBELL ST","URBAN",801,0,2084.02784239944,3.601749586056,0,17.154293143280661,0,0,0,0,0,1,650,650,0.24968789013732801,0.24968789013732801]
[null,"ZN7900:PA6","CAMPBELL ST","URBAN",987,0,3413.5621465362101,2.6441739463056,1271.7582095757348,20.343481414602703,3,65640,65640,119.95947315096301,119.95947315096301,1,1050,1050,2.12765957446809,2.12765957446809]
[null,"ZN7900:PA7","CAMPBELL ST","URBAN",874,0,2543.17779940525,4.132178139404,90.871893246304879,1182.6527078124668,1,3001.2666666667001,3001.2666666667001,5.9496567505720801,5.9496567505720801,1,39060,39060,10.6407322654462,10.6407322654462]
[null,"ZN80:PA21","CHATSWOOD","URBAN",852,0,3657.50711001742,3.6093856036256002,6778.9430601262875,190.20806007029984,5,256320.15,256320.15,127.347417840376,127.347417840376,1,7192,7192,3.63849765258216,3.63849765258216]
[null,"ZN80:PA22","CHATSWOOD","URBAN",2224,559.49215854364195,9794.5971491140808,6.0537599994999995,2716.7761051048892,3458.586877579171,7,61246.7,61246.7,11.375899280575499,11.375899280575499,4,77970,77970,11.4208633093525,11.4208633093525]
[null,"ZN80:PA24","CHATSWOOD","URBAN",1643,0,9445.6962201744009,2.5432565978983996,4109.8080320244953,8.4790565594799361,2,220539,220539,198.90444309190499,198.90444309190499,2,455,455,3.10407790626902,3.10407790626902]
[null,"ZN80:PA25","CHATSWOOD","URBAN",1490,2294.6319459852998,4266.4748168065398,3.4110497455224,21581.084480173453,0,12,863454.1,863454.1,428.59060402684605,428.59060402684605,0,0,0,0,0]
[null,"ZN80:PA27","CHATSWOOD","URBAN",857,0,4228.0983357595196,2.033248716728,4.5802313658592944,0,1,307.43333333330003,307.43333333330003,0.11668611435239198,0.11668611435239198,0,0,0,0,0]
[null,"ZN80:PA30","CHATSWOOD","URBAN",1171,0,6395.0519829086898,3.2299944470951996,2572.3220046418492,0,3,108687,108687,109.99146029035001,109.99146029035001,0,0,0,0,0]
[null,"ZN80:PA31","CHATSWOOD","URBAN",783,2768.8685763858998,2248.8866675689601,2.6005811407352,1580.0415218093963,0,11,82918.633333333404,82918.633333333404,133.461047254151,133.461047254151,0,0,0,0,0]
[null,"ZN80:PA32","CHATSWOOD","URBAN",3794,5569.0741757531196,7556.9270613700501,6.8940850905359996,33894.945723774013,3497.6766225509659,12,670984.28333333298,670984.28333333298,134.976278334212,134.976278334212,3,69240,69240,3.45282024248815,3.45282024248815]
[null,"ZN80:PA37","CHATSWOOD","URBAN",1298,726.63088903712799,7645.6677243825097,7.2746158336912004,7684.9822129791637,1668.9337100968328,7,144173.96666666699,144166.96666666699,49.383667180277335,49.306625577812,3,31310,31310,3.92912172573189,3.92912172573189]
[null,"ZN80:PA39","CHATSWOOD","URBAN",607,0,4293.9597407884403,2.0196003230968,68.950142590914368,0,2,4659.3333333333003,4659.3333333333003,13.1795716639209,13.1795716639209,0,0,0,0,0]
[null,"ZN80:PA40","CHATSWOOD","URBAN",2493,159.81951802401801,11955.1312841581,11.010729202896,4795.2122631392995,0,9,59435.483333333301,59435.483333333301,14.079422382671499,14.079422382671499,0,0,0,0,0]
[null,"ZN8000:PA1","MACQUARIE PARK","URBAN",592,259.96212862953502,3607.0357015919799,3.1321618931296,1374.6571084297263,0,2,59896.883333333302,59896.883333333302,100,100,0,0,0,0,0]
[null,"ZN8000:PA10","MACQUARIE PARK","URBAN",34,0,10875.661412833901,5.8578235443544004,96.102864911269307,0,1,2239,2239,91.176470588235304,91.176470588235304,0,0,0,0,0]
[null,"ZN8000:PA12","MACQUARIE PARK","URBAN",52,0,3318.8415897316199,3.9868852341568002,0,7.0111770090115693,0,0,0,0,0,1,240,240,3.8461538461538498,3.8461538461538498]
[null,"ZN8000:PA15","MACQUARIE PARK","URBAN",85,0,2597.4808940080702,4.2689047862864005,0,236.44316790695069,0,0,0,0,0,2,7559,7559,2.3529411764705799,2.3529411764705799]
[null,"ZN8000:PA17","MACQUARIE PARK","URBAN",34,0,3171.7642950783602,4.5930198736200003,0,32.308404630230974,0,0,0,0,0,1,960,960,11.764705882352899,11.764705882352899]
[null,"ZN8000:PA19","MACQUARIE PARK","URBAN",888,0,3363.9273411996101,3.111968757608,970.86602090483279,804.12779173900003,4,42577.3,42577.3,16.554054054054099,16.554054054054099,3,35265,35265,25.900900900900897,25.900900900900897]
[null,"ZN8000:PA25","MACQUARIE PARK","URBAN",337,1.3001056139770699,6270.4059596201396,4.0627833121320007,284.03102915831238,0.29769368063086599,6,9541.0499999999993,9541.0499999999993,16.023738872403602,16.023738872403602,1,10,10,0.29673590504451003,0.29673590504451003]
[null,"ZN8000:PA28","MACQUARIE PARK","URBAN",35,0,2820.56100701885,2.3797408149239998,24.540179351127126,64.866214648945132,1,1407.35,1407.35,20,20,2,3720,3720,8.5714285714285694,8.5714285714285694]
[null,"ZN8000:PA30","MACQUARIE PARK","URBAN",13,0,1706.6346353475999,2.4533435820528,0,17.257407833393568,0,0,0,0,0,1,960,960,30.769230769230798,30.769230769230798]
[null,"ZN8000:PA34","MACQUARIE PARK","URBAN",73,0,4211.7563848242298,6.4272014404624001,0,16.953929317651799,0,0,0,0,0,1,360,360,1.3698630136986301,1.3698630136986301]
[null,"ZN8000:PA38","MACQUARIE PARK","URBAN",641,0,5390.52812256794,3.9745824860831998,15.02751505923178,0,1,516,516,0.46801872074883,0.46801872074883,0,0,0,0,0]
[null,"ZN8000:PA39","MACQUARIE PARK","URBAN",102,0,2436.6743603866598,3.4584482558728,0,180.68278159920209,0,0,0,0,0,2,7130,7130,38.235294117647101,38.235294117647101]
[null,"ZN8000:PA4","MACQUARIE PARK","URBAN",906,4388.7406557020504,3985.8561190559899,4.0272536862032,9859.1245205099658,273.6962592467745,9,334105.33333333302,334105.33333333302,215.34216335540802,215.34216335540802,1,9275,9275,5.8498896247240602,5.8498896247240602]
[null,"ZN8000:PA6","MACQUARIE PARK","URBAN",704,5.9325849812054603,8687.8081852096293,3.0462461482895997,7.140443529644803,0,1,319.89999999999998,319.89999999999998,0.142045454545455,0.142045454545455,0,0,0,0,0]
[null,"ZN8100:PA1","GREEN SQUARE","URBAN",199,0,1327.1052754028699,4.2103106721144004,0,1.3882657600204125,0,0,0,0,0,1,45,45,1.50753768844221,1.50753768844221]
[null,"ZN8100:PA10","GREEN SQUARE","URBAN",282,0,3470.6901725952998,2.1526703909672,0,20.032133878449351,0,0,0,0,0,2,1270,1270,1.0638297872340399,1.0638297872340399]
[null,"ZN8100:PA17","GREEN SQUARE","URBAN",233,0,7080.2508531950998,4.0130152998807995,0,299.22223984040704,0,0,0,0,0,2,10176,10176,40.343347639485003,40.343347639485003]
[null,"ZN8100:PA2","GREEN SQUARE","URBAN",207,0,2732.6548833704201,3.0960072178,31.853434787091071,16.696511254842548,3,1404.1333333333,1404.1333333333,2.8985507246376803,2.8985507246376803,2,736,736,0.96618357487922701,0.96618357487922701]
[null,"ZN8100:PA20","GREEN SQUARE","URBAN",754,0,2556.8652080791198,3.6010663813527999,570.15331539116153,311.88505127376567,1,21608,21608,77.453580901856796,77.453580901856796,2,11820,11820,2.78514588859416,2.78514588859416]
[null,"ZN8100:PA28","GREEN SQUARE","URBAN",432,0,5543.8513617381204,2.3797408149239998,579.97719501036659,109.60995303313685,1,33261,33261,89.120370370370409,89.120370370370409,2,6286,6286,2.7777777777777701,2.7777777777777701]
[null,"ZN8100:PA30","GREEN SQUARE","URBAN",1298,0,4954.1175076097497,4.028211460644,22.138512236866568,0,1,750.05,750.05,7.7041602465331302E-2,7.7041602465331302E-2,0,0,0,0,0]
[null,"ZN8100:PA4","GREEN SQUARE","URBAN",769,0,5057.97524442754,4.7598077628392002,49.025012716316283,496.99295556615402,2,1405.6666666666999,1405.6666666666999,4.5513654096228802,4.5513654096228802,2,14250,14250,4.0312093628088403,4.0312093628088403]
[null,"ZN8100:PA7","GREEN SQUARE","URBAN",380,0,4066.9633943854301,3.6520539725936003,5.7801205226715409,0,2,216,216,1.0526315789473699,1.0526315789473699,0,0,0,0,0]
[null,"ZN847:PA1","HORNSBY","URBAN",1216,3853.66596132205,7312.5613706746099,3.9540308924151994,1517.0123195485075,0,6,52360.416666666599,52360.416666666599,55.6743421052632,55.6743421052632,0,0,0,0,0]
[null,"ZN847:PA10","HORNSBY","URBAN",1282,902.78071941774601,6953.8907642313898,4.6988621021967996,510.51331837937983,644.01557151869736,4,14827.516666666599,14827.516666666599,1.40405616224649,1.40405616224649,3,18705,18705,2.4960998439937598,2.4960998439937598]
[null,"ZN847:PA14","HORNSBY","URBAN",391,34.167081848610302,2409.2247349316499,2.9289117716968001,1031.4425613539388,220.19102139970894,2,48061,48061,198.209718670077,198.209718670077,1,10260,10260,4.8593350383631702,4.8593350383631702]
[null,"ZN847:PA15","HORNSBY","URBAN",1338,820.565298789081,8497.7026607120097,4.3201448632768003,1140.6381718152704,683.75106645552967,3,36033.266666666699,36033.266666666699,2.54110612855008,2.54110612855008,1,21600,21600,3.3632286995515703,3.3632286995515703]
[null,"ZN847:PA18","HORNSBY","SHORT RURAL",1112,6209.6979133780796,7310.4378946078796,3.2034972510439998,19.100446637990832,0,3,813.71666666670001,813.71666666670001,0.26978417266186999,0.26978417266186999,0,0,0,0,0]
[null,"ZN847:PA19","HORNSBY","URBAN",1282,1.5615117674608401,3599.6753059298298,3.4780827294303998,568.8425211653248,73.397007144641293,2,22320.616666666701,22320.616666666701,11.7004680187207,11.7004680187207,1,2880,2880,7.8003120124804995E-2,7.8003120124804995E-2]
[null,"ZN847:PA2","HORNSBY","URBAN",1552,2.3315465174032801,10306.499143323401,4.1118963009048004,1145.9127387989445,0,10,38033.249999999898,38033.249999999898,13.595360824742301,13.595360824742301,0,0,0,0,0]
[null,"ZN847:PA21","HORNSBY","URBAN",1579,3568.5958495776299,5555.4299137992102,4.0272536862032,345.04073445812293,3454.1795823322041,5,11692.7166666667,11692.7166666667,4.8765041165294596,4.8765041165294596,6,117055,117055,18.936035465484498,18.936035465484498]
[null,"ZN847:PA22","HORNSBY","URBAN",1095,2975.33506467701,6409.9748297741999,5.0340671082343995,759.66818960790795,0,2,20594.866666666701,20594.866666666701,14.063926940639302,14.063926940639302,0,0,0,0,0]
[null,"ZN847:PA23","HORNSBY","URBAN",1248,259.67775022878999,6690.6449750531501,3.0606938122248,0,102.93866385089964,0,0,0,0,0,1,4590,4590,8.0128205128205107E-2,8.0128205128205107E-2]
[null,"ZN847:PA26","HORNSBY","URBAN",175,0,87.090146877381201,0.97517343925280009,361.32000083697346,0,5,50566.65,50566.65,207.42857142857099,207.42857142857099,0,0,0,0,0]
[null,"ZN847:PA28","HORNSBY","URBAN",1095,0,2460.3246960353999,3.4027796470319998,0,4.9866602261353536,0,0,0,0,0,1,200,200,0.36529680365296796,0.36529680365296796]
[null,"ZN847:PA31","HORNSBY","URBAN",167,642.37290688784901,1772.1740066315199,4.4516223513424,0,46.970670760932698,0,0,0,0,0,2,1440,1440,1.79640718562874,1.79640718562874]
[null,"ZN847:PA36","HORNSBY","URBAN",1985,0,4060.8531547980901,2.9106060730096002,301.03709372600065,10.236950994497464,3,14115.3166666667,14115.3166666667,2.9219143576826201,2.9219143576826201,1,480,480,5.0377833753148603E-2,5.0377833753148603E-2]
[null,"ZN847:PA39","HORNSBY","URBAN",1715,2245.9890041511499,8240.8298141449595,4.9425386147983996,8543.9820265616981,1389.5936663173488,8,235919.75,235919.75,95.7434402332362,95.7434402332362,3,38370,38370,4.0233236151603604,4.0233236151603604]
[null,"ZN847:PA44","HORNSBY","URBAN",975,3763.0815659453301,5239.0542549125303,3.2584143461448001,1144.8372309081146,0,5,47950.316666666702,47950.316666666702,20,20,0,0,0,0,0]
[null,"ZN847:PA45","HORNSBY","SHORT RURAL",489,18112.499893544002,5453.2558977599401,2.6759764013248,1415.5690037585389,226.9599539183979,4,72194.283333333296,72194.283333333296,110.42944785276102,110.42944785276102,3,11575,11575,5.1124744376278102,5.1124744376278102]
[null,"ZN847:PA46","HORNSBY","URBAN",1095,4229.5168017081396,2344.5535788993802,3.5695942541776002,11278.56163863789,9.4160186573628,10,431210.08333333401,431210.08333333401,290.95890410958896,290.95890410958896,1,360,360,9.132420091324199E-2,9.132420091324199E-2]
[null,"ZN847:PA47","HORNSBY","SHORT RURAL",1069,12342.476337640101,6743.1715239806299,3.7885627590367998,9639.1122049112364,1124.2825365844426,6,347229.48333333299,347229.48333333299,307.296538821328,307.296538821328,1,40500,40500,1.8709073900841902,1.8709073900841902]
[null,"ZN847:PA48","HORNSBY","URBAN",555,0,2955.7864892387602,1.8305698571903999,15.773918198651858,0,1,1176,1176,0.54054054054054101,0.54054054054054101,0,0,0,0,0]
[null,"ZN847:PA5","HORNSBY","URBAN",984,34.873299305636102,6831.88058884562,4.9443694730032002,1683.2696076470563,794.50293116328623,4,46461.883333333302,46461.883333333302,7.2154471544715504,7.2154471544715504,1,21930,21930,4.3699186991869903,4.3699186991869903]
[null,"ZN8700:PA61 62ABC","CITY NORTH","CBD",511,0,3570.55253872916,10.727139364969894,0,174.49494614369758,0,0,0,0,0,2,2220,2220,0.39138943248532299,0.39138943248532299]
[null,"ZN8700:PA61 62GHJ","CITY NORTH","CBD",1728,0,11480.8301663362,10.818667857845064,241.38320004724923,152.20221480811773,1,3045,3045,0.28935185185185203,0.28935185185185203,1,1920,1920,0.23148148148148098,0.23148148148148098]
[null,"ZN8700:PA61 62KLM","CITY NORTH","CBD",285,0,1994.55929759733,9.1894606846670417,402.6587711200799,1030.2139127319772,1,5980,5980,8.0701754385964897,8.0701754385964897,1,15300,15300,10.526315789473701,10.526315789473701]
[null,"ZN8700:PA63 64DEF","CITY NORTH","CBD",519,0,7210.72244570777,8.4572327416656847,68.10389183432396,1145.1864614179315,1,1099,1099,1.3487475915221601,1.3487475915221601,2,18480,18480,5.3949903660886296,5.3949903660886296]
[null,"ZN8700:PA63 64GHJ","CITY NORTH","CBD",166,0,825.05631875386803,2.5627978005047529,0,131.44931834457432,0,0,0,0,0,1,7000,7000,16.867469879518097,16.867469879518097]
[null,"ZN8700:PA65 66ABC","CITY NORTH","CBD",796,0,5453.9766034100303,11.807175580896898,0,3103.1240581603661,0,0,0,0,0,2,35868,35868,13.442211055276401,13.442211055276401]
[null,"ZN8700:PA65 66DEF","CITY NORTH","CBD",359,0,2301.3389403147198,5.6564608596854908,0,82.893549731578517,0,0,0,0,0,1,2000,2000,2.22841225626741,2.22841225626741]
[null,"ZN8700:PA65 66GHJ","CITY NORTH","CBD",65,0,4138.6682814453297,3.2584143463560431,0,228.24966942917882,0,0,0,0,0,3,9560,9560,43.076923076923102,43.076923076923102]
[null,"ZN874:PA12","CONCORD","URBAN",97,0,3099.20376398607,2.6298372009655999,3.5250693723228439,5.9736051681137798,1,182.9333333333,182.9333333333,1.0309278350515501,1.0309278350515501,1,310,310,1.0309278350515501,1.0309278350515501]
[null,"ZN874:PA16","CONCORD","URBAN",586,0,6133.5425509754004,2.5103299713295999,17.578862905093693,1077.1540904996314,2,955.68333333329997,955.68333333329997,0.34129692832764502,0.34129692832764502,4,58560,58560,24.232081911262799,24.232081911262799]
[null,"ZN874:PA17","CONCORD","URBAN",918,0,5251.7490519563198,3.1028552804071996,2682.3177493793114,398.32868062187674,4,117978.46666666699,117978.46666666699,99.346405228758201,99.346405228758201,2,17520,17520,15.904139433551201,15.904139433551201]
[null,"ZN874:PA18","CONCORD","URBAN",1854,0,8273.6186236124195,5.4805787756311997,19317.256457322288,0,6,481031,481031,175.566343042071,175.566343042071,0,0,0,0,0]
[null,"ZN874:PA2","CONCORD","URBAN",219,0,2753.50519923305,3.6967126877623997,698.03318913172325,0,3,25770,25770,121.46118721461201,121.46118721461201,0,0,0,0,0]
[null,"ZN874:PA22","CONCORD","URBAN",1508,0,8178.8269306049997,5.4790727197095999,215.09286693397155,552.42262112216224,3,5357.6333333332996,5357.6333333332996,4.0450928381962905,4.0450928381962905,1,13760,13760,2.8514588859416401,2.8514588859416401]
[null,"ZN874:PA25","CONCORD","SHORT RURAL",325,0,4763.5369024274696,0.93860196119680006,0,59.421164081871581,0,0,0,0,0,1,8640,8640,4.9230769230769207,4.9230769230769207]
[null,"ZN874:PA26","CONCORD","URBAN",638,0,888.36537390437297,1.2683994147727999,86.766324756562739,0,2,9335.75,9335.75,6.1128526645768098,6.1128526645768098,0,0,0,0,0]
[null,"ZN874:PA3","CONCORD","URBAN",873,0,5752.8093898909501,1.8453346965783999,0,1561.3140544436003,0,0,0,0,0,3,115470,115470,22.794959908361999,22.794959908361999]
[null,"ZN874:PA4","CONCORD","URBAN",1455,0,6809.9575628913099,5.0419105538767992,5184.2808764578758,1019.9063782708675,2,140329,140329,100.82474226804099,100.82474226804099,3,27607,27607,3.7800687285223402,3.7800687285223402]
[null,"ZN874:PA7","CONCORD","URBAN",915,1.20217526971843,5386.7456429042104,3.7693225920344,1362.0608812279643,0,2,49315.933333333298,49315.933333333298,57.814207650273197,57.814207650273197,0,0,0,0,0]
[null,"ZN874:PA8","CONCORD","URBAN",454,0,4020.0824876987899,3.5036429206544,391.60789046338482,0,1,15254.0666666667,15254.0666666667,13.656387665198199,13.656387665198199,0,0,0,0,0]
[null,"ZN874:PA9","CONCORD","URBAN",370,0,3389.5981843140098,1.536905484964,535.00749240135212,3.716268259923512,2,47508,47508,178.91891891891899,178.91891891891899,1,330,330,0.27027027027027001,0.27027027027027001]
[null,"ZN901:PA10","SURRY HILLS","URBAN",224,0,2882.1408558603198,3.0074356084623997,215.69310081716361,275.0153144869434,1,9788,9788,20.535714285714299,20.535714285714299,1,12480,12480,11.6071428571429,11.6071428571429]
[null,"ZN901:PA11","SURRY HILLS","URBAN",2478,0,2677.24293466788,3.6026678552831997,890.51368053817464,0,5,33734.199999999997,33734.199999999997,6.6585956416464906,6.6585956416464906,0,0,0,0,0]
[null,"ZN901:PA13","SURRY HILLS","URBAN",1699,0,2426.9158208510098,1.7790212202408,242.78693286566639,0,1,18625.083333333299,18625.083333333299,3.1194820482636798,3.1194820482636798,0,0,0,0,0]
[null,"ZN901:PA17","SURRY HILLS","URBAN",73,0,875.02196179808698,2.1966838290127999,10.742896739688717,0,2,667.43333333329997,667.43333333329997,4.10958904109589,4.10958904109589,0,0,0,0,0]
[null,"ZN901:PA18","SURRY HILLS","URBAN",1518,0,2429.5389388705698,2.9299180521256001,6110.6046667349347,339.41677234125126,3,284631.36666666699,284631.36666666699,195.65217391304299,195.65217391304299,1,15810,15810,2.0421607378129099,2.0421607378129099]
[null,"ZN901:PA19","SURRY HILLS","URBAN",1040,0,3871.1201553425299,2.1966838290127999,3219.4414138649486,323.52628147793138,6,200017.05,200017.05,55.384615384615401,55.384615384615401,1,20100,20100,6.4423076923076898,6.4423076923076898]
[null,"ZN901:PA2","SURRY HILLS","URBAN",147,0,3364.41316190617,4.2099495467872003,365.07846543401126,4.0102015378082054,2,11834.866666666599,11834.866666666599,4.0816326530612299,4.0816326530612299,1,130,130,0.68027210884353706,0.68027210884353706]
[null,"ZN901:PA20","SURRY HILLS","URBAN",1210,0,2961.73752255926,4.0514688218007997,1282.6333212254031,0,1,43206,43206,31.322314049586801,31.322314049586801,0,0,0,0,0]
[null,"ZN901:PA7","SURRY HILLS","URBAN",864,0,5414.8759458075101,1.5751305161536,0,0.17312259778692057,0,0,0,0,0,1,15,15,0.11574074074074099,0.11574074074074099]
[null,"ZN901:PA9","SURRY HILLS","URBAN",28,0,2576.3851200316499,2.1966838290127999,14.421868069862017,0,1,896,896,100,100,0,0,0,0,0]
[null,"ZN9035:PA1","CARINGBAH","URBAN",459,0,4976.5115063859303,3.0327729459696,2754.2818644215658,0,7,123943.15,123943.15,404.13943355119801,404.13943355119801,0,0,0,0,0]
[null,"ZN9035:PA10","CARINGBAH","URBAN",638,0,1440.0862235416801,2.2915129192960002,2656.9570868405472,7.5558056690991293,5,158240,158240,389.184952978056,389.184952978056,1,450,450,0.156739811912226,0.156739811912226]
[null,"ZN9035:PA11","CARINGBAH","URBAN",1881,3.2973839998922001,6541.0682552993903,4.2395341564207998,16574.650796483893,0,8,533556.35,533556.35,402.12652844231798,402.12652844231798,0,0,0,0,0]
[null,"ZN9035:PA2","CARINGBAH","URBAN",741,304.36206590401002,4846.1320885280302,2.3934871438599998,3128.3044467259465,598.48010078733034,7,178374.16666666701,178374.16666666701,428.47503373819194,428.47503373819194,1,34125,34125,12.280701754386,12.280701754386]
[null,"ZN9035:PA4","CARINGBAH","URBAN",1925,2524.9449133252901,6855.8798156745397,6.9719826125271993,26195.595500628588,4.5466576854534155,9,512774.03333333298,512774.03333333298,398.33766233766198,398.33766233766198,1,89,89,5.1948051948051903E-2,5.1948051948051903E-2]
[null,"ZN9035:PA5","CARINGBAH","URBAN",328,0,2697.1371685403301,1.6743143805536,998.28056545551192,0,4,81371,81371,387.5,387.5,0,0,0,0,0]
[null,"ZN9035:PA7","CARINGBAH","URBAN",1126,0,3514.5849385133602,2.6294064503055998,6150.0554874909976,0,12,319209.16666666698,319209.16666666698,408.08170515097703,408.08170515097703,0,0,0,0,0]
[null,"ZN9035:PA8","CARINGBAH","URBAN",118,0,2622.5337167893199,2.1963887999999998,473.26664554115757,43.45291743330246,4,29407,29407,392.37288135593201,392.37288135593201,1,2700,2700,7.6271186440678003,7.6271186440678003]
[null,"ZN9037:PA10","MIRANDA","URBAN",1475,1160.6680724343501,4410.6173596859098,5.6098781675679996,506.08821985901665,420.5087325044156,7,12311.95,12311.95,60.813559322033903,60.813559322033903,1,10230,10230,2.2372881355932202,2.2372881355932202]
[null,"ZN9037:PA16","MIRANDA","URBAN",1277,1602.85274395843,2716.6069929872001,3.8108813042584,215.52922237159106,0,5,7718.5333333334002,7718.5333333334002,31.636648394674999,31.636648394674999,0,0,0,0,0]
[null,"ZN9037:PA17","MIRANDA","URBAN",35,235.642782933343,2322.5966038674801,3.81453390748,243.22404922279836,4167.9579659967467,2,8702,8702,200,200,1,149120,149120,91.428571428571402,91.428571428571402]
[null,"ZN9037:PA2","MIRANDA","URBAN",1110,5760.1124939797401,745.58697757225104,4.1276074514288004,4601.0174445608391,468.18263316056778,7,152128.13333333301,152128.13333333301,116.396396396396,116.396396396396,1,15480,15480,3.8738738738738698,3.8738738738738698]
[null,"ZN9037:PA3","MIRANDA","URBAN",116,0,2036.9382206242999,1.6341349870447999,2.0776628779390416,0,1,173.51666666669999,173.51666666669999,0.86206896551724099,0.86206896551724099,0,0,0,0,0]
[null,"ZN9037:PA4","MIRANDA","URBAN",388,1162.2419905726099,2289.14870298701,2.7168263227415999,461.25861141910423,590.04621851266324,5,23170.566666666698,23170.566666666698,42.268041237113401,42.268041237113401,1,29640,29640,13.4020618556701,13.4020618556701]
[null,"ZN9037:PA7","MIRANDA","URBAN",658,1856.2236673508901,3323.7498504668401,5.5017702611384003,6074.6910310177609,0,4,150687,150687,180.243161094225,180.243161094225,0,0,0,0,0]
[null,"ZN9037:PA8","MIRANDA","URBAN",1647,3945.0968178622602,4226.9444330124898,5.1237821329848003,1903.6713144125833,0,5,50705.533333333398,50705.533333333398,10.8682452944748,10.8682452944748,0,0,0,0,0]
[null,"ZN9037:PA9","MIRANDA","URBAN",769,2451.8503142856998,2048.7357276502798,2.6568747874472001,721.52269539115014,0,4,37062.349999999897,37062.349999999897,22.106631989596899,22.106631989596899,0,0,0,0,0]
[null,"ZN9118:PA11","CRONULLA","URBAN",1849,3717.6698643188902,6444.6887042308699,4.0738465916952,9058.4186841518967,0,15,303460.21666666702,303460.21666666702,172.57977285018899,172.57977285018899,0,0,0,0,0]
[null,"ZN9118:PA12","CRONULLA","URBAN",1258,3.5084641899653599,3607.2513038117299,4.5261485548808,7967.586695094994,20.562051817625292,4,240243.71666666699,240243.71666666699,103.656597774245,103.656597774245,2,620,620,0.15898251192368798,0.15898251192368798]
[null,"ZN9118:PA13","CRONULLA","URBAN",1154,0,4238.6070211190899,2.8744177177968,1058.1993983801369,118.15679389108571,4,50242.55,50242.55,8.6655112651646498,8.6655112651646498,1,5610,0,0.95320623916811098,0]
[null,"ZN9118:PA15","CRONULLA","URBAN",1927,729.61083570174696,6862.0969501744403,3.6279685891928,23.005218627497236,0,3,865.4,865.4,0.15568240788790899,0.15568240788790899,0,0,0,0,0]
[null,"ZN9118:PA16","CRONULLA","URBAN",1316,0,2391.6148540348499,2.4790505575751998,16.766138159005248,71.115309742692901,1,923,923,0.98784194528875391,0.98784194528875391,1,3915,3915,2.0516717325228,2.0516717325228]
[null,"ZN9118:PA17","CRONULLA","URBAN",1031,6.54920590602398,8406.8814079961594,3.1816637685847997,1321.399585442419,812.46193083342553,7,56680.533333333296,56680.533333333296,102.909796314258,102.909796314258,1,34850,34850,7.9534432589718707,7.9534432589718707]
[null,"ZN9118:PA2","CRONULLA","URBAN",815,3.4746954467758302,3308.5679535597201,1.896996727144,49.27060993830942,0,2,3544.6666666667002,211.6666666667,4.171779141104297,0.122699386503067,0,0,0,0,0]
[null,"ZN9118:PA20","CRONULLA","URBAN",2095,0,5109.8466393380704,4.5215505917151999,2283.1961558780467,1471.0123550064682,13,68914.383333333404,68914.383333333404,16.276849642004802,16.276849642004802,1,44400,44400,5.7279236276849606,5.7279236276849606]
[null,"ZN9118:PA21","CRONULLA","URBAN",1337,3.2970852635179702,6104.7459862246697,3.8462580553776005,32.093650643863718,0,3,1138.7666666666,1138.7666666666,0.44876589379207199,0.44876589379207199,0,0,0,0,0]
[null,"ZN9118:PA22","CRONULLA","URBAN",1448,514.578963002009,6270.1607028133803,3.6462757723160002,5017.5776279965321,0,9,187801.316666667,187801.316666667,110.42817679557999,110.42817679557999,0,0,0,0,0]
[null,"ZN9118:PA24","CRONULLA","URBAN",1315,0,3012.2941586601501,3.0238274329424,6.2038457309994151,0,1,280,280,1.06463878326996,1.06463878326996,0,0,0,0,0]
[null,"ZN9118:PA26","CRONULLA","URBAN",1617,6.0980577022573996,10764.897073581,5.0755113478639995,255.28988856049935,0,9,6864.4833333331999,6864.4833333331999,1.5460729746444,1.5460729746444,0,0,0,0,0]
[null,"ZN9118:PA3","CRONULLA","SHORT RURAL",831,3397.5463632190599,5687.5126000373502,6.6468073265904,5304.3761499792281,5953.7439130460298,8,108911.883333333,108911.883333333,129.60288808664299,129.60288808664299,2,122245,122245,32.731648616125099,32.731648616125099]
[null,"ZN9118:PA6","CRONULLA","URBAN",1766,0,4233.8068933043696,4.2754617735728004,175.96840438714921,1993.6969960681929,5,5617.0166666666,5617.0166666666,0.73612684031710107,0.73612684031710107,5,63640,63640,9.7961494903737307,9.7961494903737307]
[null,"ZN9118:PA7","CRONULLA","URBAN",982,0,7853.1582690873001,5.1886268170680001,2633.1167417953475,633.01300062388532,4,69258.283333333296,69258.283333333296,110.081466395112,110.081466395112,1,16650,16650,3.7678207739307501,3.7678207739307501]
[null,"ZN9118:PA8","CRONULLA","URBAN",1230,6.5973348087314303,7456.49636708447,3.9414322083335995,568.6590856416334,0,3,19690.2833333333,19690.2833333333,7.5609756097560901,7.5609756097560901,0,0,0,0,0]
[null,"ZN9245:PA1","ENGADINE","URBAN",1085,3731.63363936217,3059.4452506246098,3.3856388952856,3878.5891869490943,1153.1861728307902,10,156346.15,156346.15,116.589861751152,116.589861751152,3,46485,46485,10.230414746543801,10.230414746543801]
[null,"ZN9245:PA10","ENGADINE","URBAN",943,3627.91200147783,3618.1705487613499,2.7977268568392,211.7145357167021,0,2,10327.6,10327.6,9.0137857900318092,9.0137857900318092,0,0,0,0,0]
[null,"ZN9245:PA13","ENGADINE","URBAN",1799,6556.7974502426596,3380.7981571302298,4.1016761185376005,224.72788549847698,855.64730533742886,5,7477.3833333332996,7477.3833333332996,3.1684269038354702,3.1684269038354702,1,28470,28470,4.0578098943857697,4.0578098943857697]
[null,"ZN9245:PA15","ENGADINE","URBAN",960,99.268682614631302,3620.36909882397,3.5188674394296,1051.942481613821,0,6,40798.400000000001,40798.400000000001,13.5416666666667,13.5416666666667,0,0,0,0,0]
[null,"ZN9245:PA19","ENGADINE","URBAN",1355,4201.5664268693599,7053.1731078726198,3.6518860641463999,107.99676482962154,692.37843638445167,3,4035.9666666666999,4035.9666666666999,1.6974169741697398,1.6974169741697398,2,25875,25875,5.0922509225092201,5.0922509225092201]
[null,"ZN9245:PA21","ENGADINE","URBAN",1206,1830.0790705290599,3224.2085778637402,2.6113077896063999,403.0825547984432,680.7849773167153,4,21066.383333333401,21066.383333333401,5.2238805970149205,5.2238805970149205,2,35580,35580,7.5456053067993301,7.5456053067993301]
[null,"ZN9245:PA3","ENGADINE","URBAN",1187,12846.5759062013,7392.8695970748804,2.8407221697135996,4601.5124198252752,1067.5971737783775,6,221068,221068,110.19376579612501,110.19376579612501,4,51290,51290,5.8129738837405203,5.8129738837405203]
[null,"ZN9245:PA4","ENGADINE","SHORT RURAL",1039,1.3987626550429999,5056.3180677524397,2.9745251588832002,290.9663051997502,0,7,13349.9333333334,13349.9333333334,7.1222329162656504,7.1222329162656504,0,0,0,0,0]
[null,"ZN9245:PA6","ENGADINE","URBAN",278,0.79872446607667402,4076.5973760889301,1.857627207328,2.2658533715197668,0,1,166.46666666670001,166.46666666670001,0.35971223021582699,0.35971223021582699,0,0,0,0,0]
[null,"ZN9245:PA9","ENGADINE","URBAN",388,1085.6786139862199,993.24786187685504,0.94320114746079997,231.34795895590088,91.641839954928386,6,33474.6,33474.6,51.5463917525773,51.5463917525773,1,13260,13260,6.7010309278350499,6.7010309278350499]
[null,"ZN9252:PA21","JANNALI","URBAN",864,2498.9184879951599,2358.5044265666702,2.9106060730096002,74.33021681129695,0,2,3485.2666666667001,3485.2666666667001,6.1342592592592604,6.1342592592592604,0,0,0,0,0]
[null,"ZN9252:PA22","JANNALI","URBAN",1550,6148.8808942468504,3064.5403772464001,3.9705905119680005,2449.6170126630063,0,4,84197.1,84197.1,7.4193548387096797,7.4193548387096797,0,0,0,0,0]
[null,"ZN9252:PA24","JANNALI","URBAN",1954,6025.0171392841703,4881.74198214027,5.4696552319376002,10937.045058443004,62.321270937167739,7,272894.066666667,272894.066666667,146.622313203685,146.622313203685,3,1555,1555,0.15353121801433001,0.15353121801433001]
[null,"ZN9252:PA25","JANNALI","URBAN",869,5170.3395731083501,5699.9865791722495,2.8556889779087999,284.19597478841536,0,2,13581.916666666701,13581.916666666701,7.9401611047180705,7.9401611047180705,0,0,0,0,0]
[null,"ZN9252:PA27","JANNALI","URBAN",1716,5261.4854042664901,3971.80410755206,5.0706785056087993,7374.6429725315211,0,13,198485.58333333299,198485.58333333299,69.4055944055944,69.4055944055944,0,0,0,0,0]
[null,"ZN9252:PA28","JANNALI","URBAN",1751,2914.4452592771599,8384.3428044648608,5.1822716083503995,643.84830734845514,417.69455313136302,5,16955.766666666699,16955.766666666699,11.707595659623101,11.707595659623101,1,11000,11000,2.2844089091947501,2.2844089091947501]
[null,"ZN9252:PA30","JANNALI","URBAN",1290,2552.7795139214099,3723.1011373910701,3.1352492750056,2977.8570211246424,19424.260103242668,6,129624.116666667,115106.116666667,107.13178294573662,102.40310077519399,7,845525,845525,135.42635658914699,135.42635658914699]
[null,"ZN9252:PA31","JANNALI","URBAN",1435,4479.7882514951098,2823.51858804106,5.7662950509184006,4441.3325763155108,0,4,105116.4,105116.4,40.766550522648096,40.766550522648096,0,0,0,0,0]
[null,"ZN931:PA10","DARLINGHURST","URBAN",1795,0,2670.4399301311801,5.4483113654720006,6890.8776711769697,1376.6961730295034,2,172610.28333333301,172610.28333333301,100.66852367688099,100.66852367688099,1,34485,34485,6.7409470752089096,6.7409470752089096]
[null,"ZN931:PA11","DARLINGHURST","URBAN",1289,0,1774.64365976881,2.0897788845368002,2544.3781797445145,0,5,166163.4,166163.4,61.986035686578802,61.986035686578802,0,0,0,0,0]
[null,"ZN931:PA12","DARLINGHURST","URBAN",432,0,1314.0637648475999,1.8571405112055999,8.0191282741206908,0,2,589.29999999999995,589.29999999999995,0.69444444444444398,0.69444444444444398,0,0,0,0,0]
[null,"ZN931:PA13","DARLINGHURST","URBAN",497,0,2864.4209967904899,3.2735820960519999,6.5227635969855902,1.6790639315606053,2,271.93333333330003,271.93333333330003,0.60362173038229394,0.60362173038229394,1,70,70,0.20120724346076399,0.20120724346076399]
[null,"ZN931:PA18","DARLINGHURST","URBAN",567,0,2589.56782717844,3.5788987691640002,0,3.9335676998188811,0,0,0,0,0,2,150,150,0.35273368606701899,0.35273368606701899]
[null,"ZN931:PA22","DARLINGHURST","URBAN",528,0,2164.55232495259,2.1891722532984002,1045.314452144522,0,2,65166,65166,105.871212121212,105.871212121212,0,0,0,0,0]
[null,"ZN931:PA23","DARLINGHURST","URBAN",502,0,0,1.3889396369992,176.19827672652994,0,1,17313,17313,17.3306772908367,17.3306772908367,0,0,0,0,0]
[null,"ZN931:PA24","DARLINGHURST","URBAN",310,0,4782.2372624701602,3.1015953891320001,4500.5136740535236,166.58468530430906,4,198030,198030,154.51612903225799,154.51612903225799,3,7330,7330,4.5161290322580605,4.5161290322580605]
[null,"ZN931:PA25","DARLINGHURST","URBAN",1491,0,3070.3681732127902,3.111968757608,188.25460473041286,3178.2030798974006,2,8255.9,8255.9,8.8531187122736501,8.8531187122736501,3,139380,139380,16.7672702883971,16.7672702883971]
[null,"ZN931:PA26","DARLINGHURST","URBAN",252,0,2083.05047119759,1.1901782953416,7.2305881822934461,0,1,829.11666666669998,829.11666666669998,0.39682539682539697,0.39682539682539697,0,0,0,0,0]
[null,"ZN931:PA3","DARLINGHURST","URBAN",501,0,1728.5915445124799,3.6611397153415997,750.25369111814302,1605.3180938320447,1,27967,27967,99.600798403193608,99.600798403193608,2,59841,59841,26.946107784431099,26.946107784431099]
[null,"ZN931:PA31","DARLINGHURST","URBAN",305,0,1485.96030879203,2.2439506665272,17.657799567655974,0.98653048673967292,5,1073.9333333334,1073.9333333334,1.63934426229508,1.63934426229508,1,60,60,0.65573770491803296,0.65573770491803296]
[null,"ZN931:PA32","DARLINGHURST","URBAN",58,0,804.95500024825401,1.5011672030599998,0,4.2898255377995467,0,0,0,0,0,3,390,390,5.1724137931034395,5.1724137931034395]
[null,"ZN931:PA9","DARLINGHURST","URBAN",1539,0,3034.2745478125198,2.8078117412719998,2338.5964191302769,733.7636102333056,4,113668.816666667,113668.816666667,15.269655620532799,15.269655620532799,4,35665,35665,6.30279402209226,6.30279402209226]
[null,"ZN9534:PA11","KURNELL SOUTH","SHORT RURAL",254,1037.43650620991,1313.67941592938,0.92630607707839996,2.1317946128953924,0,1,314.0833333333,314.0833333333,0.39370078740157499,0.39370078740157499,0,0,0,0,0]
[null,"ZN9534:PA17","KURNELL SOUTH","URBAN",688,4281.4036919054397,878.17256695521201,2.410475457,44.375201221161397,194.02099654958431,5,2512.4166666667002,2512.4166666667002,0.72674418604651192,0.72674418604651192,2,10985,10985,0.290697674418605,0.290697674418605]
[null,"ZN9534:PA18","KURNELL SOUTH","URBAN",26,5885.3564657480301,1134.1551424921199,2.3720031908327996,17.102370990516771,102.63160640142432,2,984,984,30.769230769230798,30.769230769230798,3,5905,5905,65.384615384615401,65.384615384615401]
[null,"ZN9550:PA1","GWAWLEY BAY","URBAN",827,1.64755604452296,3996.68869216031,2.3535622787615997,22.218028135498724,0,1,1288.3499999999999,1288.3499999999999,1.08827085852479,1.08827085852479,0,0,0,0,0]
[null,"ZN9550:PA11","GWAWLEY BAY","URBAN",463,0,5856.5675129760102,4.4585079235815996,40.789936760087926,770.33441271005722,1,1248.5833333333001,1248.5833333333001,0.21598272138228899,0.21598272138228899,1,23580,23580,7.7753779697624203,7.7753779697624203]
[null,"ZN9550:PA27","GWAWLEY BAY","URBAN",150,0,5341.4992074175198,3.7940766999215998,62.161839997589773,0,1,2236,2236,8.6666666666666696,8.6666666666666696,0,0,0,0,0]
[null,"ZN9550:PA28","GWAWLEY BAY","URBAN",711,1.64880838853002,4249.3853723195398,1.9459495313408002,172.27860113781222,0,2,12082.416666666701,12082.416666666701,18.8466947960619,18.8466947960619,0,0,0,0,0]
[null,"ZN9550:PA3","GWAWLEY BAY","URBAN",1282,952.36475882459501,2386.7243022391699,3.8346101693680001,379.67264721871811,0,2,13512.7,13512.7,8.5023400936037401,8.5023400936037401,0,0,0,0,0]
[null,"ZN9550:PA33","GWAWLEY BAY","URBAN",485,3.3763281793806201,5348.4910183679904,2.5296756764472001,6.0991974882137736,0,1,329.05,329.05,0.20618556701030899,0.20618556701030899,0,0,0,0,0]
[null,"ZN9550:PA36","GWAWLEY BAY","URBAN",772,2981.4123769176499,1026.08890548728,2.3727638513887999,8.2798079429071976,106.40251545585973,2,476.23333333329998,476.23333333329998,0.25906735751295301,0.25906735751295301,1,6120,6120,2.2020725388600999,2.2020725388600999]
[null,"ZN9550:PA4","GWAWLEY BAY","URBAN",457,582.98769124931505,1432.33930083001,1.1079524337240001,653.77779119988702,0,4,80531,80531,248.35886214441999,248.35886214441999,0,0,0,0,0]
[null,"ZN9550:PA42","GWAWLEY BAY","URBAN",1018,1105.5894567850601,2536.6246835071001,2.5895264574496002,1421.2691966759642,0,2,74904.866666666698,74904.866666666698,104.02750491159101,104.02750491159101,0,0,0,0,0]
[null,"ZN9550:PA43","GWAWLEY BAY","URBAN",1062,2138.20887247669,2268.9790343095101,3.7172087087583998,3157.9114181937139,0,3,115941,115941,101.129943502825,101.129943502825,0,0,0,0,0]
[null,"ZN9550:PA6","GWAWLEY BAY","URBAN",922,5.1260359866042897,3961.4467142434601,2.8137596101823998,786.38302758055579,0,4,38141.800000000003,22580.6,14.425162689804768,9.436008676789589,0,0,0,0,0]
[null,"ZN9550:PA9","GWAWLEY BAY","URBAN",636,6.6815663603015603,2667.3645607724302,2.9077573778736001,496.11059182621568,0,3,23284.9,23284.9,34.748427672955998,34.748427672955998,0,0,0,0,0]
[null,"ZN965:PA11","PENNANT HILLS","URBAN",1160,3940.4968266158598,5507.5597351637898,4.0586436582527998,6254.8819590273097,0,10,210325.65,210325.65,194.22413793103399,194.22413793103399,0,0,0,0,0]
[null,"ZN965:PA12","PENNANT HILLS","URBAN",622,1481.7831024455299,5328.9191427636897,1.7085914720527999,2347.7996964298814,0,3,187532.63333333301,187532.63333333301,124.11575562701,124.11575562701,0,0,0,0,0]
[null,"ZN965:PA15","PENNANT HILLS","URBAN",1162,4681.0015407492301,4816.4346220467596,3.7451197354608001,9532.7175157990241,711.28992962037194,9,347380.2,347380.2,116.60929432013801,116.60929432013801,5,25920,25920,18.588640275387299,18.588640275387299]
[null,"ZN965:PA2","PENNANT HILLS","URBAN",533,138.96112348631399,6084.9145314077896,1.5658379218128,1609.7696821146726,0,5,140304.29999999999,140304.29999999999,117.63602251407099,117.63602251407099,0,0,0,0,0]
[null,"ZN965:PA20","PENNANT HILLS","URBAN",971,0,8280.4615872815702,3.9957442117712003,4436.8621211857908,1054.01340793998,9,151541.75,151541.75,51.699279093717799,51.699279093717799,2,36000,36000,7.2090628218331609,7.2090628218331609]
[null,"ZN965:PA21","PENNANT HILLS","URBAN",701,2.7254340803217301,5128.5638777680097,2.7824661831599999,1139.8320745326721,430.59577518908748,8,55906.85,55906.85,26.390870185449401,26.390870185449401,1,21120,21120,6.2767475035663294,6.2767475035663294]
[null,"ZN965:PA22","PENNANT HILLS","URBAN",565,5.9334264332793101,4294.8563621733101,2.3982496440255998,1572.2054124105732,0,5,89468.25,89468.25,222.12389380531002,222.12389380531002,0,0,0,0,0]
[null,"ZN965:PA24","PENNANT HILLS","URBAN",954,0,10708.3856519767,3.9906422897896001,1048.3463045529452,0,4,35852.216666666602,35852.216666666602,9.2243186582809304,9.2243186582809304,0,0,0,0,0]
[null,"ZN965:PA26","PENNANT HILLS","URBAN",921,1885.6555829424001,8781.6438635323702,3.2950257435191999,4146.5687471960682,10.381813510112721,2,171745,171745,106.08034744842601,106.08034744842601,1,430,430,0.10857763300760001,0.10857763300760001]
[null,"ZN965:PA28","PENNANT HILLS","URBAN",1004,0,11292.8600128788,3.8441967002920001,416.26994558842239,1270.9271234977653,2,14778.266666666699,14778.266666666699,7.3705179282868505,7.3705179282868505,4,45120,45120,11.3545816733068,11.3545816733068]
[null,"ZN965:PA29","PENNANT HILLS","URBAN",752,55.743579690290503,6258.8529432065197,2.5627978008351997,722.82477889077563,6884.5641568145275,3,38492.199999999997,38492.199999999997,16.888297872340399,16.888297872340399,21,366620,366620,108.64361702127701,108.64361702127701]
[null,"ZN965:PA3","PENNANT HILLS","URBAN",1148,3.1422950665996101,6430.7108414900904,4.5468081568807994,9924.3833032548846,3707.069038814288,10,297886.58333333302,297886.58333333302,114.024390243902,114.024390243902,14,111270,111270,36.236933797909401,36.236933797909401]
[null,"ZN965:PA33","PENNANT HILLS","URBAN",1289,4655.32733372447,8023.3625901475398,4.4927234210752003,5376.0870304507853,300.22750535616586,11,163309.20000000001,163309.20000000001,147.47866563227302,147.47866563227302,1,9120,9120,1.24127230411171,1.24127230411171]
[null,"ZN965:PA35","PENNANT HILLS","URBAN",950,124.23963022819601,6536.9460759794301,2.9289117716968001,5869.5357685908248,0,12,273496.33333333302,273496.33333333302,144.105263157895,144.105263157895,0,0,0,0,0]
[null,"ZN965:PA37","PENNANT HILLS","URBAN",464,0,5282.5570708122004,4.0272536862032,1159.7344134401603,0,2,39301,39301,99.568965517241409,99.568965517241409,0,0,0,0,0]
[null,"ZN965:PA38","PENNANT HILLS","URBAN",980,0,11245.6951098025,4.0272536862032,8998.4213445781788,5619.8178324520459,14,304937.88333333301,304937.88333333301,151.224489795918,151.224489795918,10,190444,190444,33.571428571428605,33.571428571428605]
[null,"ZN965:PA4","PENNANT HILLS","URBAN",1111,3769.2169849020202,8343.0945808929901,5.5649323672808002,16234.440713397131,190.62833800724809,6,398136.03333333298,398136.03333333298,211.431143114311,211.431143114311,2,4675,4675,0.36003600360036003,0.36003600360036003]
[null,"ZN965:PA42","PENNANT HILLS","URBAN",1097,63.7032500728562,7205.9230684136501,3.8441967002920001,3833.2879336144297,490.11817262546805,9,136088.01666666701,136088.01666666701,125.797629899726,125.797629899726,1,17400,17400,5.2871467639015499,5.2871467639015499]
[null,"ZN965:PA43","PENNANT HILLS","URBAN",1022,2951.85917095589,7775.5036614694,3.9373131088487994,5740.2804137235353,315.47481610854084,4,198969.816666667,198969.816666667,202.93542074364001,202.93542074364001,1,10935,10935,2.64187866927593,2.64187866927593]
[null,"ZN965:PA46","PENNANT HILLS","URBAN",1079,35.601051017308599,9794.7771495036704,3.4780827294303998,220.78354935618529,440.3820428678477,3,8663.25,8663.25,5.6533827618165002,5.6533827618165002,1,17280,17280,4.4485634847080604,4.4485634847080604]
[null,"ZN965:PA47","PENNANT HILLS","URBAN",1134,36.316325358613497,6414.85926770673,4.5764246439368002,511.23221946378987,0,6,15245.6500000001,15245.6500000001,7.8483245149911802,7.8483245149911802,0,0,0,0,0]
[null,"ZN965:PA6","PENNANT HILLS","URBAN",1074,1456.99338808061,8378.1028545114004,3.0487362546103998,7155.8039073408354,0,9,320326.316666667,320326.316666667,204.18994413407799,204.18994413407799,0,0,0,0,0]
[null,"ZN965:PA8","PENNANT HILLS","URBAN",1191,3.2983485820691598,8929.3584686938702,3.5696112219055998,8710.9807402418537,922.77421472048377,7,333042.90000000002,333042.90000000002,108.98404701931199,108.98404701931199,3,35280,35280,6.8010075566750592,6.8010075566750592]
[null,"ZN9700:PA11","KIRRAWEE","URBAN",2003,2155.0006969875499,5634.6081968729504,3.6081513733968,5946.7092401617865,843.90505377044576,8,224929.28333333301,220169.28333333301,171.4927608587121,141.78731902146799,2,31920,31920,3.9440838741887205,3.9440838741887205]
[null,"ZN9700:PA12","KIRRAWEE","URBAN",1011,95.262766005333901,4704.5891779878402,4.6667400101552001,16.342245802149669,3080.6059445138162,1,477.9166666667,477.9166666667,9.8911968348170107E-2,9.8911968348170107E-2,3,90090,90090,22.453016815034598,22.453016815034598]
[null,"ZN9700:PA15","KIRRAWEE","URBAN",1239,1058.7697531766901,6804.4860381661401,3.3062282785520001,1682.1205924117421,691.88990639847077,4,69434.983333333294,69434.983333333294,101.291364003228,101.291364003228,2,28560,28560,6.456820016142049,6.456820016142049]
[null,"ZN9700:PA16","KIRRAWEE","URBAN",803,851.79806923712397,2579.6280730292801,1.6475128712792,377.28516274429506,0,4,31253.233333333301,31253.233333333301,22.415940224159399,22.415940224159399,0,0,0,0,0]
[null,"ZN9700:PA17","KIRRAWEE","URBAN",2256,4589.0456521876404,6527.5433410712003,4.5764246439368002,4090.2970378711038,248.47945126817541,12,121978.3,121945.3,101.77304964538976,101.72872340425501,1,7410,7410,0.84219858156028404,0.84219858156028404]
[null,"ZN9700:PA18","KIRRAWEE","URBAN",1315,1474.88342250541,2585.0093460882499,2.4513550363911998,3020.4185046375228,0,1,168157,168157,96.349809885931606,96.349809885931606,0,0,0,0,0]
[null,"ZN9700:PA19","KIRRAWEE","URBAN",907,83.842836034832303,4676.3764729983404,2.9447572833751998,2787.0146005281845,0,6,129164.683333333,129164.683333333,207.16648291069498,207.16648291069498,0,0,0,0,0]
[null,"ZN9700:PA20","KIRRAWEE","URBAN",1817,7959.1475833823297,5911.5140175077204,5.0130239385408002,4272.3384785526068,1150.8166300430153,8,116310.766666667,116310.766666667,104.292790313704,104.292790313704,3,31330,31330,3.9625756741882201,3.9625756741882201]
[null,"ZN9700:PA21","KIRRAWEE","URBAN",484,570.759100120212,3587.6273944095401,3.1855113315776,608.72564054544989,373.46085976356142,6,26079.333333333401,26079.333333333401,100.619834710744,100.619834710744,1,16000,16000,8.2644628099173598,8.2644628099173598]
[null,"ZN9700:PA22","KIRRAWEE","URBAN",250,256.11425342536501,1384.7855617273899,2.1966838290127999,222.57186366932282,0,2,13827.916666666701,13827.916666666701,99.6,99.6,0,0,0,0,0]
[null,"ZN9700:PA23","KIRRAWEE","URBAN",1614,3356.5330019395001,3244.6572138902802,4.2504644737544002,6159.1949059093831,0,11,197761.433333333,192976.433333333,118.46344485749718,109.479553903346,0,0,0,0,0]
[null,"ZN9700:PA24","KIRRAWEE","URBAN",1390,2963.4791342854001,3724.4185445910898,4.0012945650544003,534.73275557094553,0,8,18238.550000000101,18238.550000000101,4.4604316546762597,4.4604316546762597,0,0,0,0,0]
[null,"ZN9900:PA1","MENAI","URBAN",1229,1797.2920241214999,15777.4518899371,4.8011519956791995,33.00671241929571,257.51497663259295,2,938.23333333330004,938.23333333330004,3.3360455655003998,3.3360455655003998,2,7320,7320,3.0919446704637901,3.0919446704637901]
[null,"ZN9900:PA10","MENAI","URBAN",429,0,2537.0971188751901,2.1341332480503996,0,1156.3153763781304,0,0,0,0,0,2,73945,73945,67.365967365967407,67.365967365967407]
[null,"ZN9900:PA12","MENAI","URBAN",806,865.72634486834397,7330.3909208933401,2.8040537421336,675.51951530107533,174.9512061845372,2,32878.016666666699,32878.016666666699,6.9478908188585597,6.9478908188585597,2,8515,8515,3.2258064516128995,3.2258064516128995]
[null,"ZN9900:PA13","MENAI","URBAN",829,0,5374.3047818974701,3.2835548013199998,3321.8671691835584,948.43341068504583,7,138067.683333333,138067.683333333,212.424607961399,212.424607961399,1,39420,39420,8.8057901085645405,8.8057901085645405]
[null,"ZN9900:PA17","MENAI","URBAN",824,747.16847191583497,9350.4420694923992,3.3808762298624,78.648296337160048,0,4,3174.7833333333001,3174.7833333333001,3.8834951456310698,3.8834951456310698,0,0,0,0,0]
[null,"ZN9900:PA19","MENAI","URBAN",705,1763.0336503219,6548.2720417333303,2.6796184636096001,2740.3443250602554,494.2974801913935,4,139568.11666666699,139568.11666666699,103.54609929078001,103.54609929078001,5,25175,25175,13.0496453900709,13.0496453900709]
[null,"ZN9900:PA2","MENAI","URBAN",659,0,5948.1564456265096,2.6510399364799997,131.83783880936915,899.76848293059959,3,6787,6787,103.03490136570601,103.03490136570601,2,46320,46320,12.1396054628225,12.1396054628225]
[null,"ZN9900:PA20","MENAI","URBAN",720,0,3244.7086175322902,2.1690225007792003,0,132.15155159408175,0,0,0,0,0,2,8315,8315,5.1388888888888902,5.1388888888888902]
[null,"ZN9900:PA21","MENAI","URBAN",791,0,5849.5130034788199,2.1197450115167999,1523.7124357104187,190.11264118709806,8,98101.000000000102,98101.000000000102,40.707964601769902,40.707964601769902,1,12240,12240,3.0341340075853402,3.0341340075853402]
[null,"ZN9900:PA3","MENAI","URBAN",925,0,5658.0552684596996,2.9567875783536,0,370.47780181879358,0,0,0,0,0,1,17100,17100,10.2702702702703,10.2702702702703]
[null,"ZN9900:PA5","MENAI","URBAN",463,0,3821.5522433444498,1.8754115134831999,315.0169197601092,635.41923742564904,4,22924.05,22924.05,28.293736501079902,28.293736501079902,7,46240,46240,32.829373650108003,32.829373650108003]
[null,"ZN9900:PA6","MENAI","URBAN",719,219.556606160896,6390.9153830124696,2.5259885122887997,33.55638209830235,41.644710270921287,1,1813,1813,5.1460361613351902,5.1460361613351902,1,2250,2250,0.69541029207232297,0.69541029207232297]
[null,"ZN9900:PA8","MENAI","URBAN",1263,931.89107575677997,11299.620947122099,5.5082521599831997,567.64236761975997,43.589664327110022,9,14064.2,14064.2,3.0878859857482199,3.0878859857482199,1,1080,1080,0.47505938242280293,0.47505938242280293]
[null,"ZN9900:PA9","MENAI","URBAN",339,0,2751.5230891375099,1.946856174888,0,928.38340536854071,0,0,0,0,0,2,65080,65080,41.592920353982301,41.592920353982301]

{"sheet":"3.6.9 Network-reliability","index":7,"n_rows":24,"n_cols":7,"rows_kept":24,"cut":false,"hidden":false,"merged":[]}
[null,null,null,null,null,null,{"$f":"CONCATENATE(\"1-Jan-\",LEFT(CRY,4))","v":"1-Jan-2016"}]
[null,{"$f":"dms_TradingName","v":"Ausgrid"}]
[null,{"$f":"CONCATENATE(\"Annual Reporting RIN Response \",CRY)","v":"Annual Reporting RIN Response 2016-17"}]
[null,"3.6 QUALITY OF SERVICES"]
[]
[]
[null,"3.6.9 - NETWORK FEEDER RELIABILITY - PLANNED OUTAGES"]
[]
[]
[null,"3.6.9.1 - PLANNED MINUTES OFF SUPPLY (SAIDI)"]
[null,null,{"$f":"CRY","v":"2016-17"}]
[null,{"$f":"INDEX(dms_FeederName_1,MATCH(dms_TradingName,dms_TradingName_List))","v":"CBD"},30.017337470567899]
[null,{"$f":"INDEX(dms_FeederName_2,MATCH(dms_TradingName,dms_TradingName_List))","v":"Urban"},20.5364802071139]
[null,{"$f":"INDEX(dms_FeederName_3,MATCH(dms_TradingName,dms_TradingName_List))","v":"Short rural"},99.403304231975895]
[null,{"$f":"INDEX(dms_FeederName_4,MATCH(dms_TradingName,dms_TradingName_List))","v":"Long rural"},875.21450196951298]
[null,{"$f":"IF((INDEX(dms_FeederName_5,MATCH(dms_TradingName,dms_TradingName_List))=0),\"\",(INDEX(dms_FeederName_5,MATCH(dms_TradingName,dms_TradingName_List))))","v":""}]
[]
[null,"3.6.9.2 - PLANNED INTERRUPTIONS TO SUPPLY (SAIFI)"]
[null,null,{"$f":"CRY","v":"2016-17"}]
[null,{"$f":"INDEX(dms_FeederName_1,MATCH(dms_TradingName,dms_TradingName_List))","v":"CBD"},7.4147399906200002]
[null,{"$f":"INDEX(dms_FeederName_2,MATCH(dms_TradingName,dms_TradingName_List))","v":"Urban"},5.5593105921721104]
[null,{"$f":"INDEX(dms_FeederName_3,MATCH(dms_TradingName,dms_TradingName_List))","v":"Short rural"},25.823022590783999]
[null,{"$f":"INDEX(dms_FeederName_4,MATCH(dms_TradingName,dms_TradingName_List))","v":"Long rural"},227.73920781081301]
[null,{"$f":"IF((INDEX(dms_FeederName_5,MATCH(dms_TradingName,dms_TradingName_List))=0),\"\",(INDEX(dms_FeederName_5,MATCH(dms_TradingName,dms_TradingName_List))))","v":""}]

{"sheet":"4.1 Public lighting","index":8,"n_rows":23,"n_cols":4,"rows_kept":23,"cut":false,"hidden":false,"merged":[[9,1,10,1],[5,1,5,2]]}
[]
[null,{"$f":"dms_TradingName","v":"Ausgrid"}]
[null,{"$f":"CONCATENATE(\"Annual Reporting RIN Response \",CRY)","v":"Annual Reporting RIN Response 2016-17"}]
[null,"4.1 PUBLIC LIGHTING"]
[]
[null,"Tables 4.1.1 - 4.1.3 deliberately omitted."]
[]
[null,"4.1.4 - PUBLIC LIGHTING METRICS BY TARIFF"]
[]
[null,"Tariff categories","Number of Lights","Public Lighting Revenue"]
[null,"<insert tariff category>","0's","$0's, nominal"]
[]
[]
[]
[]
[]
[]
[]
[]
[]
[]
[null,"To enter further tariff categories - please insert new lines above this line. "]
[null,"Total ",{"$f":"SUM(C12:C21)","v":0},{"$f":"SUM(D12:D21)","v":0}]

{"sheet":"6.2 STPIS Reliability","index":9,"n_rows":98,"n_cols":8,"rows_kept":98,"cut":false,"hidden":false,"merged":[[80,1,85,1],[86,1,91,1],[92,1,97,1],[79,1,79,2],[22,1,27,1],[32,1,37,1],[38,1,43,1],[44,1,49,1],[5,1,5,2],[31,1,31,2],[68,1,73,1],[62,1,67,1],[55,1,55,2],[56,1,61,1],[16,1,21,1],[9,1,9,2],[10,1,15,1]]}
[]
[null,{"$f":"dms_TradingName","v":"Ausgrid"}]
[null,{"$f":"CONCATENATE(\"Annual Reporting RIN Response \",CRY)","v":"Annual Reporting RIN Response 2016-17"}]
[null,"6.2 RELIABILITY AND CUSTOMER SERVICE PERFORMANCE"]
[]
[null,"Did the MAIFI parameter of the STPIS apply during the period?\nThis flag is set from the response on worksheet 3.6.8 Network feeders",null,{"$f":"dms_MAIFI_Flag","v":"No"}]
[]
[]
[null,"6.2.1 - UNPLANNED MINUTES OFF SUPPLY (SAIDI)"]
[null,null,null,{"$f":"CRY","v":"2016-17"}]
[null,"Total sustained minutes off supply",{"$f":"INDEX(dms_FeederName_1,MATCH(dms_TradingName,dms_TradingName_List))","v":"CBD"},15.827789979756099]
[null,null,{"$f":"INDEX(dms_FeederName_2,MATCH(dms_TradingName,dms_TradingName_List))","v":"Urban"},83.383879632175507," "]
[null,null,{"$f":"INDEX(dms_FeederName_3,MATCH(dms_TradingName,dms_TradingName_List))","v":"Short rural"},155.416046313469]
[null,null,{"$f":"INDEX(dms_FeederName_4,MATCH(dms_TradingName,dms_TradingName_List))","v":"Long rural"},856.04438049483201]
[null,null,{"$f":"IF((INDEX(dms_FeederName_5,MATCH(dms_TradingName,dms_TradingName_List))=0),\"\",(INDEX(dms_FeederName_5,MATCH(dms_TradingName,dms_TradingName_List))))","v":""},null,"","","",""]
[null,null,"Whole Network",92.843262801132099,"","","",""]
[null,"Total of excluded events*\n\n*see 3.3 of STPIS",{"$f":"INDEX(dms_FeederName_1,MATCH(dms_TradingName,dms_TradingName_List))","v":"CBD"},0]
[null,null,{"$f":"INDEX(dms_FeederName_2,MATCH(dms_TradingName,dms_TradingName_List))","v":"Urban"},10.692171002198904]
[null,null,{"$f":"INDEX(dms_FeederName_3,MATCH(dms_TradingName,dms_TradingName_List))","v":"Short rural"},36.401993435294003]
[null,null,{"$f":"INDEX(dms_FeederName_4,MATCH(dms_TradingName,dms_TradingName_List))","v":"Long rural"},17.826745014245034]
[null,null,{"$f":"IF((INDEX(dms_FeederName_5,MATCH(dms_TradingName,dms_TradingName_List))=0),\"\",(INDEX(dms_FeederName_5,MATCH(dms_TradingName,dms_TradingName_List))))","v":""},null,null,"","",""]
[null,null,"Whole Network",13.8798624875445,null,"","",""]
[null,"Total sustained minutes off supply after removing excluded events",{"$f":"INDEX(dms_FeederName_1,MATCH(dms_TradingName,dms_TradingName_List))","v":"CBD"},15.827789979756099]
[null,null,{"$f":"INDEX(dms_FeederName_2,MATCH(dms_TradingName,dms_TradingName_List))","v":"Urban"},72.691708629976603]
[null,null,{"$f":"INDEX(dms_FeederName_3,MATCH(dms_TradingName,dms_TradingName_List))","v":"Short rural"},119.01405287817499]
[null,null,{"$f":"INDEX(dms_FeederName_4,MATCH(dms_TradingName,dms_TradingName_List))","v":"Long rural"},838.21763548058698]
[null,null,{"$f":"IF((INDEX(dms_FeederName_5,MATCH(dms_TradingName,dms_TradingName_List))=0),\"\",(INDEX(dms_FeederName_5,MATCH(dms_TradingName,dms_TradingName_List))))","v":""},null,"","","",""]
[null,null,"Whole Network",78.963400313587599,"","","",""]
[]
[]
[null,"6.2.2 - UNPLANNED INTERRUPTIONS TO SUPPLY (SAIFI)"]
[null,null,null,{"$f":"CRY","v":"2016-17"}]
[null,"Total sustained interruptions",{"$f":"INDEX(dms_FeederName_1,MATCH(dms_TradingName,dms_TradingName_List))","v":"CBD"},3.7409062237840497E-2,null,"see D18/61797 - email dated 30/4/2018"]
[null,null,{"$f":"INDEX(dms_FeederName_2,MATCH(dms_TradingName,dms_TradingName_List))","v":"Urban"},0.75534448876479399]
[null,null,{"$f":"INDEX(dms_FeederName_3,MATCH(dms_TradingName,dms_TradingName_List))","v":"Short rural"},1.3212582889392801]
[null,null,{"$f":"INDEX(dms_FeederName_4,MATCH(dms_TradingName,dms_TradingName_List))","v":"Long rural"},3.9190228144847801]
[null,null,{"$f":"IF((INDEX(dms_FeederName_5,MATCH(dms_TradingName,dms_TradingName_List))=0),\"\",(INDEX(dms_FeederName_5,MATCH(dms_TradingName,dms_TradingName_List))))","v":""},null,"","","",""]
[null,null,"Whole Network",0.82137666955947397,"","","",""]
[null,"Total of excluded events*\n\n*see 3.3 of STPIS",{"$f":"INDEX(dms_FeederName_1,MATCH(dms_TradingName,dms_TradingName_List))","v":"CBD"},0]
[null,null,{"$f":"INDEX(dms_FeederName_2,MATCH(dms_TradingName,dms_TradingName_List))","v":"Urban"},0.10329682711295504]
[null,null,{"$f":"INDEX(dms_FeederName_3,MATCH(dms_TradingName,dms_TradingName_List))","v":"Short rural"},0.15355926298615002]
[null,null,{"$f":"INDEX(dms_FeederName_4,MATCH(dms_TradingName,dms_TradingName_List))","v":"Long rural"},6.0541310541310053E-2]
[null,null,{"$f":"IF((INDEX(dms_FeederName_5,MATCH(dms_TradingName,dms_TradingName_List))=0),\"\",(INDEX(dms_FeederName_5,MATCH(dms_TradingName,dms_TradingName_List))))","v":""},null,"",null,"",""]
[null,null,"Whole Network",0.10797637293391489,"",null,"",""]
[null,"Total sustained interruptions after removing excluded events",{"$f":"INDEX(dms_FeederName_1,MATCH(dms_TradingName,dms_TradingName_List))","v":"CBD"},3.7409062237840497E-2]
[null,null,{"$f":"INDEX(dms_FeederName_2,MATCH(dms_TradingName,dms_TradingName_List))","v":"Urban"},0.65204766165183903]
[null,null,{"$f":"INDEX(dms_FeederName_3,MATCH(dms_TradingName,dms_TradingName_List))","v":"Short rural"},1.1676990259531299]
[null,null,{"$f":"INDEX(dms_FeederName_4,MATCH(dms_TradingName,dms_TradingName_List))","v":"Long rural"},3.8584815039434699]
[null,null,{"$f":"IF((INDEX(dms_FeederName_5,MATCH(dms_TradingName,dms_TradingName_List))=0),\"\",(INDEX(dms_FeederName_5,MATCH(dms_TradingName,dms_TradingName_List))))","v":""},null,"","","",""]
[null,null,"Whole Network",0.71340029662555904,"","","",""]
[]
[]
[]
[]
[null,"6.2.3 - UNPLANNED MOMENTARY INTERRUPTIONS TO SUPPLY (MAIFI)"]
[null,null,null,{"$f":"CRY","v":"2016-17"}]
[null,"Total momentary interruptions",{"$f":"INDEX(dms_FeederName_1,MATCH(dms_TradingName,dms_TradingName_List))","v":"CBD"}]
[null,null,{"$f":"INDEX(dms_FeederName_2,MATCH(dms_TradingName,dms_TradingName_List))","v":"Urban"}]
[null,null,{"$f":"INDEX(dms_FeederName_3,MATCH(dms_TradingName,dms_TradingName_List))","v":"Short rural"}]
[null,null,{"$f":"INDEX(dms_FeederName_4,MATCH(dms_TradingName,dms_TradingName_List))","v":"Long rural"}]
[null,null,{"$f":"IF((INDEX(dms_FeederName_5,MATCH(dms_TradingName,dms_TradingName_List))=0),\"\",(INDEX(dms_FeederName_5,MATCH(dms_TradingName,dms_TradingName_List))))","v":""}]
[null,null,"Whole Network"]
[null,"Total of excluded events*\n\n*see 3.3 of STPIS",{"$f":"INDEX(dms_FeederName_1,MATCH(dms_TradingName,dms_TradingName_List))","v":"CBD"}]
[null,null,{"$f":"INDEX(dms_FeederName_2,MATCH(dms_TradingName,dms_TradingName_List))","v":"Urban"}]
[null,null,{"$f":"INDEX(dms_FeederName_3,MATCH(dms_TradingName,dms_TradingName_List))","v":"Short rural"}]
[null,null,{"$f":"INDEX(dms_FeederName_4,MATCH(dms_TradingName,dms_TradingName_List))","v":"Long rural"}]
[null,null,{"$f":"IF((INDEX(dms_FeederName_5,MATCH(dms_TradingName,dms_TradingName_List))=0),\"\",(INDEX(dms_FeederName_5,MATCH(dms_TradingName,dms_TradingName_List))))","v":""}]
[null,null,"Whole Network"]
[null,"Total momentary interruptions after removing excluded events",{"$f":"INDEX(dms_FeederName_1,MATCH(dms_TradingName,dms_TradingName_List))","v":"CBD"}]
[null,null,{"$f":"INDEX(dms_FeederName_2,MATCH(dms_TradingName,dms_TradingName_List))","v":"Urban"}]
[null,null,{"$f":"INDEX(dms_FeederName_3,MATCH(dms_TradingName,dms_TradingName_List))","v":"Short rural"}]
[null,null,{"$f":"INDEX(dms_FeederName_4,MATCH(dms_TradingName,dms_TradingName_List))","v":"Long rural"}]
[null,null,{"$f":"IF((INDEX(dms_FeederName_5,MATCH(dms_TradingName,dms_TradingName_List))=0),\"\",(INDEX(dms_FeederName_5,MATCH(dms_TradingName,dms_TradingName_List))))","v":""}]
[null,null,"Whole Network"]
[]
[]
[]
[]
[null,"6.2.4 - DISTRIBUTION CUSTOMER NUMBERS"]
[null,null,null,{"$f":"CRY","v":"2016-17"}]
[null,"Customer numbers at the start of the period",{"$f":"INDEX(dms_FeederName_1,MATCH(dms_TradingName,dms_TradingName_List))","v":"CBD"},31049]
[null,null,{"$f":"INDEX(dms_FeederName_2,MATCH(dms_TradingName,dms_TradingName_List))","v":"Urban"},1443888]
[null,null,{"$f":"INDEX(dms_FeederName_3,MATCH(dms_TradingName,dms_TradingName_List))","v":"Short rural"},219655]
[null,null,{"$f":"INDEX(dms_FeederName_4,MATCH(dms_TradingName,dms_TradingName_List))","v":"Long rural"},2804]
[null,null,{"$f":"IF((INDEX(dms_FeederName_5,MATCH(dms_TradingName,dms_TradingName_List))=0),\"\",(INDEX(dms_FeederName_5,MATCH(dms_TradingName,dms_TradingName_List))))","v":""}]
[null,null,"Whole Network",1697396]
[null,"Customer numbers at the end of the period",{"$f":"INDEX(dms_FeederName_1,MATCH(dms_TradingName,dms_TradingName_List))","v":"CBD"},31279]
[null,null,{"$f":"INDEX(dms_FeederName_2,MATCH(dms_TradingName,dms_TradingName_List))","v":"Urban"},1456827]
[null,null,{"$f":"INDEX(dms_FeederName_3,MATCH(dms_TradingName,dms_TradingName_List))","v":"Short rural"},223412]
[null,null,{"$f":"INDEX(dms_FeederName_4,MATCH(dms_TradingName,dms_TradingName_List))","v":"Long rural"},2803]
[null,null,{"$f":"IF((INDEX(dms_FeederName_5,MATCH(dms_TradingName,dms_TradingName_List))=0),\"\",(INDEX(dms_FeederName_5,MATCH(dms_TradingName,dms_TradingName_List))))","v":""}]
[null,null,"Whole Network",1714321]
[null,"Average customer numbers",{"$f":"INDEX(dms_FeederName_1,MATCH(dms_TradingName,dms_TradingName_List))","v":"CBD"},{"$f":"ROUND(SUM(D81+D87)/2,0)","v":31164}]
[null,null,{"$f":"INDEX(dms_FeederName_2,MATCH(dms_TradingName,dms_TradingName_List))","v":"Urban"},{"$f":"ROUND(SUM(D82+D88)/2,0)","v":1450358}]
[null,null,{"$f":"INDEX(dms_FeederName_3,MATCH(dms_TradingName,dms_TradingName_List))","v":"Short rural"},{"$f":"ROUND(SUM(D83+D89)/2,0)","v":221534}]
[null,null,{"$f":"INDEX(dms_FeederName_4,MATCH(dms_TradingName,dms_TradingName_List))","v":"Long rural"},{"$f":"ROUND(SUM(D84+D90)/2,0)","v":2804}]
[null,null,{"$f":"IF((INDEX(dms_FeederName_5,MATCH(dms_TradingName,dms_TradingName_List))=0),\"\",(INDEX(dms_FeederName_5,MATCH(dms_TradingName,dms_TradingName_List))))","v":""},{"$f":"ROUND(SUM(D85+D91)/2,0)","v":0}]
[null,null,"Whole Network",1705859]

{"sheet":"6.6 STPIS Customer Service","index":10,"n_rows":13,"n_cols":4,"rows_kept":13,"cut":false,"hidden":false,"merged":[[8,1,9,1]]}
[]
[null,{"$f":"dms_TradingName","v":"Ausgrid"}]
[null,{"$f":"CONCATENATE(\"Annual Reporting RIN Response \",CRY)","v":"Annual Reporting RIN Response 2016-17"}]
[null,"6.6 STPIS CUSTOMER SERVICE"]
[]
[]
[null,"6.6.1 - TELEPHONE ANSWERING"]
[]
[null,null,"Number of calls \nafter removing excluded events","Total number of calls"]
[null,null,{"$f":"CRY","v":"2016-17"},{"$f":"CRY","v":"2016-17"}]
[null,"Number of calls received",174685,182890]
[null,"Number of calls answered within 30 seconds",138777]
[null,"Percentage of calls answered within 30 seconds",{"$f":"C12/C11","v":0.79444142313306809}]

{"sheet":"6.7 STPIS Daily Performance","index":11,"n_rows":381,"n_cols":16,"rows_kept":381,"cut":false,"hidden":false,"merged":[[13,14,13,15],[13,3,14,3],[6,1,6,5],[8,1,8,6],[13,4,13,5],[13,6,13,7],[13,10,13,11],[13,8,13,9],[13,12,13,13],[12,1,14,1],[12,2,12,3],[13,2,14,2],[12,4,12,13]]}
[null,null,null,null,null,null,null,null,{"$f":"CONCATENATE(IF(LEN(CRY)=4,\"1-Jan-\",\"1-Jul-\"),LEFT(CRY,4))","v":"1-Jul-2016"}]
[null,{"$f":"dms_TradingName","v":"Ausgrid"}]
[null,{"$f":"CONCATENATE(\"Annual Reporting RIN Response \",CRY)","v":"Annual Reporting RIN Response 2016-17"}]
[null,"6.7 STPIS DAILY PERFORMANCE"]
[]
[]
[null,"Did the MAIFI parameter of the STPIS apply during the period?\nThis flag is set from the response on worksheet 3.6.8 Network feeders",null,null,null,null,{"$f":"dms_MAIFI_Flag","v":"No"}]
[]
[null,"The excluded events to be removed from the data refer only to events listed in clause 3.3(a) of the STPIS, with respect to reliability data, and in clause 5.4 of the STPIS with respect to customer service parameters.\n\n*Customer service information must be reported as per the definitions in the STPIS, that is excluding: \n   • calls to payment lines and automated interactive services \n   • calls abandoned by the customer within 30 seconds of the call being queued for response by a human operator (where the time in which a telephone call is abandoned is not measured, then an estimate of the number of calls abandoned within 30 seconds will be determined by taking 20 per cent of all calls abandoned)."]
[]
[null,"6.7.1 - DAILY PERFORMANCE DATA - UNPLANNED"]
[]
[null,"Date","Customer service*",null,"MAIFI"]
[null,null,"Number of calls received\n(after removing excluded events)","Number of calls answered in 30 seconds\n(after removing excluded events)",{"$f":"INDEX(dms_FeederName_1,MATCH(dms_TradingName,dms_TradingName_List))","v":"CBD"},null,{"$f":"INDEX(dms_FeederName_2,MATCH(dms_TradingName,dms_TradingName_List))","v":"Urban"},null,{"$f":"INDEX(dms_FeederName_3,MATCH(dms_TradingName,dms_TradingName_List))","v":"Short rural"},null,{"$f":"INDEX(dms_FeederName_4,MATCH(dms_TradingName,dms_TradingName_List))","v":"Long rural"},null,{"$f":"IF((INDEX(dms_FeederName_5,MATCH(dms_TradingName,dms_TradingName_List))=0),\"Network\",(INDEX(dms_FeederName_5,MATCH(dms_TradingName,dms_TradingName_List))))","v":"Network"},null,"Network"]
[null,null,null,null,"All events","After removing excluded events","All events","After removing excluded events","All events","After removing excluded events","All events","After removing excluded events","All events","After removing excluded events","All events","After removing excluded events"]
[null,{"$f":"CONCATENATE(IF(LEN(CRY)=4,\"1-Jan-\",\"1-Jul-\"),LEFT(CRY,4))","v":"1-Jul-2016"},528,401]
[null,{"$f":"B16+1","v":"2016-07-02"},314,242]
[null,"2016-07-03",239,193]
[null,"2016-07-04",666,498]
[null,"2016-07-05",604,456]
[null,"2016-07-06",691,538]
[null,"2016-07-07",689,471]
[null,"2016-07-08",648,540]
[null,"2016-07-09",294,254]
[null,"2016-07-10",272,237]
[null,"2016-07-11",478,436]
[null,"2016-07-12",572,501]
[null,"2016-07-13",770,674]
[null,"2016-07-14",479,439]
[null,"2016-07-15",475,417]
[null,"2016-07-16",404,273]
[null,"2016-07-17",258,207]
[null,"2016-07-18",539,470]
[null,"2016-07-19",552,464]
[null,"2016-07-20",454,425]
[null,"2016-07-21",473,416]
[null,"2016-07-22",477,402]
[null,"2016-07-23",696,429]
[null,"2016-07-24",378,267]
[null,"2016-07-25",552,525]
[null,"2016-07-26",447,399]
[null,"2016-07-27",596,499]
[null,"2016-07-28",564,460]
[null,"2016-07-29",382,371]
[null,"2016-07-30",238,213]
[null,"2016-07-31",201,182]
[null,"2016-08-01",421,407]
[null,"2016-08-02",409,363]
[null,"2016-08-03",578,518]
[null,"2016-08-04",619,555]
[null,"2016-08-05",488,425]
[null,"2016-08-06",261,211]
[null,"2016-08-07",283,201]
[null,"2016-08-08",504,476]
[null,"2016-08-09",407,377]
[null,"2016-08-10",425,402]
[null,"2016-08-11",376,350]
[null,"2016-08-12",305,282]
[null,"2016-08-13",252,179]
[null,"2016-08-14",192,178]
[null,"2016-08-15",448,395]
[null,"2016-08-16",396,358]
[null,"2016-08-17",421,386]
[null,"2016-08-18",347,325]
[null,"2016-08-19",443,360]
[null,"2016-08-20",228,210]
[null,"2016-08-21",189,166]
[null,"2016-08-22",470,363]
[null,"2016-08-23",344,250]
[null,"2016-08-24",454,276]
[null,"2016-08-25",864,549]
[null,"2016-08-26",430,399]
[null,"2016-08-27",248,201]
[null,"2016-08-28",239,194]
[null,"2016-08-29",470,436]
[null,"2016-08-30",461,428]
[null,"2016-08-31",409,388]
[null,"2016-09-01",440,390]
[null,"2016-09-02",449,401]
[null,"2016-09-03",665,427]
[null,{"$f":"B80+1","v":"2016-09-04"},248,202]
[null,"2016-09-05",420,398]
[null,"2016-09-06",388,342]
[null,"2016-09-07",433,402]
[null,"2016-09-08",389,352]
[null,"2016-09-09",320,308]
[null,"2016-09-10",340,286]
[null,"2016-09-11",224,152]
[null,"2016-09-12",395,389]
[null,"2016-09-13",621,514]
[null,"2016-09-14",393,366]
[null,"2016-09-15",683,631]
[null,"2016-09-16",368,348]
[null,"2016-09-17",204,156]
[null,"2016-09-18",178,152]
[null,"2016-09-19",536,497]
[null,"2016-09-20",398,361]
[null,"2016-09-21",341,296]
[null,"2016-09-22",335,295]
[null,"2016-09-23",355,341]
[null,"2016-09-24",198,170]
[null,"2016-09-25",298,242]
[null,"2016-09-26",361,343]
[null,"2016-09-27",493,422]
[null,"2016-09-28",407,303]
[null,"2016-09-29",433,390]
[null,"2016-09-30",459,410]
[null,"2016-10-01",405,262]
[null,"2016-10-02",196,155]
[null,"2016-10-03",362,285]
[null,"2016-10-04",741,578]
[null,"2016-10-05",485,413]
[null,"2016-10-06",410,379]
[null,"2016-10-07",515,441]
[null,"2016-10-08",251,179]
[null,"2016-10-09",223,200]
[null,"2016-10-10",598,541]
[null,"2016-10-11",556,510]
[null,"2016-10-12",386,362]
[null,"2016-10-13",580,522]
[null,"2016-10-14",408,388]
[null,"2016-10-15",185,170]
[null,"2016-10-16",197,172]
[null,"2016-10-17",531,420]
[null,"2016-10-18",457,401]
[null,"2016-10-19",366,352]
[null,"2016-10-20",457,373]
[null,"2016-10-21",410,389]
[null,"2016-10-22",286,234]
[null,"2016-10-23",168,146]
[null,"2016-10-24",497,435]
[null,"2016-10-25",387,369]
[null,"2016-10-26",470,401]
[null,"2016-10-27",393,328]
[null,"2016-10-28",459,425]
[null,"2016-10-29",320,254]
[null,"2016-10-30",223,194]
[null,"2016-10-31",459,393]
[null,"2016-11-01",408,361]
[null,"2016-11-02",363,324]
[null,"2016-11-03",404,345]
[null,"2016-11-04",327,310]
[null,"2016-11-05",566,247]
[null,"2016-11-06",276,232]
[null,{"$f":"B144+1","v":"2016-11-07"},454,435]
[null,"2016-11-08",595,451]
[null,"2016-11-09",543,337]
[null,"2016-11-10",480,389]
[null,"2016-11-11",392,372]
[null,"2016-11-12",397,347]
[null,"2016-11-13",424,301]
[null,"2016-11-14",585,501]
[null,"2016-11-15",452,413]
[null,"2016-11-16",414,365]
[null,"2016-11-17",433,334]
[null,"2016-11-18",434,359]
[null,"2016-11-19",269,189]
[null,"2016-11-20",226,180]
[null,"2016-11-21",652,515]
[null,"2016-11-22",574,530]
[null,"2016-11-23",594,487]
[null,"2016-11-24",475,414]
[null,"2016-11-25",929,497]
[null,"2016-11-26",207,177]
[null,"2016-11-27",189,159]
[null,"2016-11-28",571,522]
[null,"2016-11-29",452,352]
[null,"2016-11-30",454,422]
[null,"2016-12-01",499,449]
[null,"2016-12-02",475,423]
[null,"2016-12-03",212,157]
[null,"2016-12-04",209,170]
[null,"2016-12-05",1314,957]
[null,"2016-12-06",717,596]
[null,"2016-12-07",597,466]
[null,"2016-12-08",522,445]
[null,"2016-12-09",511,475]
[null,"2016-12-10",369,304]
[null,"2016-12-11",222,193]
[null,"2016-12-12",448,429]
[null,"2016-12-13",872,717]
[null,"2016-12-14",859,543]
[null,"2016-12-15",665,548]
[null,"2016-12-16",528,480]
[null,"2016-12-17",498,320]
[null,"2016-12-18",578,340]
[null,"2016-12-19",450,393]
[null,"2016-12-20",447,413]
[null,"2016-12-21",447,388]
[null,"2016-12-22",572,363]
[null,"2016-12-23",395,336]
[null,"2016-12-24",601,372]
[null,"2016-12-25",222,174]
[null,"2016-12-26",297,224]
[null,"2016-12-27",289,198]
[null,"2016-12-28",403,341]
[null,"2016-12-29",580,478]
[null,"2016-12-30",574,476]
[null,"2016-12-31",304,214]
[null,"2017-01-01",280,248]
[null,"2017-01-02",311,241]
[null,"2017-01-03",495,424]
[null,"2017-01-04",385,362]
[null,"2017-01-05",486,367]
[null,"2017-01-06",420,348]
[null,"2017-01-07",275,207]
[null,"2017-01-08",216,185]
[null,"2017-01-09",781,463]
[null,{"$f":"B208+1","v":"2017-01-10"},505,433]
[null,"2017-01-11",1801,696]
[null,"2017-01-12",607,510]
[null,"2017-01-13",909,646]
[null,"2017-01-14",323,249]
[null,"2017-01-15",202,170]
[null,"2017-01-16",631,513]
[null,"2017-01-17",1549,787]
[null,"2017-01-18",1080,900]
[null,"2017-01-19",576,500]
[null,"2017-01-20",639,541]
[null,"2017-01-21",276,222]
[null,"2017-01-22",200,189]
[null,"2017-01-23",541,474]
[null,"2017-01-24",745,579]
[null,"2017-01-25",351,284]
[null,"2017-01-26",223,180]
[null,"2017-01-27",389,359]
[null,"2017-01-28",246,198]
[null,"2017-01-29",320,260]
[null,"2017-01-30",1183,677]
[null,"2017-01-31",912,704]
[null,"2017-02-01",699,522]
[null,"2017-02-02",558,405]
[null,"2017-02-03",388,363]
[null,"2017-02-04",766,405]
[null,"2017-02-05",1463,488]
[null,"2017-02-06",1223,832]
[null,"2017-02-07",961,760]
[null,"2017-02-08",726,609]
[null,"2017-02-09",623,518]
[null,"2017-02-10",1454,805]
[null,"2017-02-11",1673,553]
[null,"2017-02-12",822,537]
[null,"2017-02-13",558,505]
[null,"2017-02-14",578,454]
[null,"2017-02-15",552,418]
[null,"2017-02-16",480,423]
[null,"2017-02-17"]
[null,"2017-02-18",1517,1383]
[null,"2017-02-19",624,384]
[null,"2017-02-20",651,578]
[null,"2017-02-21",476,457]
[null,"2017-02-22",637,478]
[null,"2017-02-23",563,454]
[null,"2017-02-24",504,350]
[null,"2017-02-25",465,328]
[null,"2017-02-26",327,254]
[null,"2017-02-27",563,521]
[null,"2017-02-28",571,479]
[null,"2017-03-01",521,476]
[null,"2017-03-02",681,549]
[null,"2017-03-03",642,508]
[null,"2017-03-04",574,369]
[null,"2017-03-05",283,242]
[null,"2017-03-06",595,488]
[null,"2017-03-07",561,480]
[null,"2017-03-08",511,442]
[null,"2017-03-09",422,366]
[null,"2017-03-10",543,430]
[null,"2017-03-11",267,204]
[null,"2017-03-12",318,236]
[null,"2017-03-13",682,623]
[null,"2017-03-14",890,699]
[null,{"$f":"B272+1","v":"2017-03-15"},572,486]
[null,"2017-03-16",696,502]
[null,"2017-03-17",715,618]
[null,"2017-03-18",1431,678]
[null,"2017-03-19",562,417]
[null,"2017-03-20",685,578]
[null,"2017-03-21",794,589]
[null,"2017-03-22",1374,794]
[null,"2017-03-23",679,550]
[null,"2017-03-24",518,448]
[null,"2017-03-25",261,224]
[null,"2017-03-26",261,209]
[null,"2017-03-27",541,453]
[null,"2017-03-28",544,463]
[null,"2017-03-29",615,410]
[null,"2017-03-30",674,426]
[null,"2017-03-31",577,465]
[null,"2017-04-01",250,197]
[null,"2017-04-02",229,206]
[null,"2017-04-03",533,485]
[null,"2017-04-04",480,386]
[null,"2017-04-05",555,442]
[null,"2017-04-06",439,382]
[null,"2017-04-07",387,357]
[null,"2017-04-08",308,244]
[null,"2017-04-09",536,353]
[null,"2017-04-10",522,482]
[null,"2017-04-11",514,412]
[null,"2017-04-12",374,344]
[null,"2017-04-13",390,344]
[null,"2017-04-14",304,218]
[null,"2017-04-15",192,181]
[null,"2017-04-16",177,150]
[null,"2017-04-17",177,155]
[null,"2017-04-18",359,338]
[null,"2017-04-19",427,406]
[null,"2017-04-20",369,331]
[null,"2017-04-21",371,342]
[null,"2017-04-22",254,204]
[null,"2017-04-23",169,148]
[null,"2017-04-24",445,400]
[null,"2017-04-25",167,139]
[null,"2017-04-26",666,549]
[null,"2017-04-27",462,389]
[null,"2017-04-28",352,299]
[null,"2017-04-29",221,191]
[null,"2017-04-30",169,150]
[null,"2017-05-01",517,446]
[null,"2017-05-02",564,449]
[null,"2017-05-03",442,384]
[null,"2017-05-04",475,412]
[null,"2017-05-05",356,313]
[null,"2017-05-06",248,196]
[null,"2017-05-07",163,137]
[null,"2017-05-08",442,385]
[null,"2017-05-09",412,371]
[null,"2017-05-10",369,335]
[null,"2017-05-11",460,371]
[null,"2017-05-12",420,316]
[null,"2017-05-13",219,171]
[null,"2017-05-14",163,140]
[null,"2017-05-15",462,366]
[null,"2017-05-16",538,374]
[null,"2017-05-17",418,365]
[null,{"$f":"B336+1","v":"2017-05-18"},419,343]
[null,"2017-05-19",394,347]
[null,"2017-05-20",303,236]
[null,"2017-05-21",227,182]
[null,"2017-05-22",529,435]
[null,"2017-05-23",433,373]
[null,"2017-05-24",588,455]
[null,"2017-05-25",476,392]
[null,"2017-05-26"]
[null,"2017-05-27",261,219]
[null,"2017-05-28",212,179]
[null,"2017-05-29",453,413]
[null,"2017-05-30",471,427]
[null,"2017-05-31",469,415]
[null,"2017-06-01",448,375]
[null,"2017-06-02",409,363]
[null,"2017-06-03",316,217]
[null,"2017-06-04",234,206]
[null,"2017-06-05",496,401]
[null,"2017-06-06",466,399]
[null,"2017-06-07",1195,654]
[null,"2017-06-08",836,561]
[null,"2017-06-09",587,468]
[null,"2017-06-10",431,285]
[null,"2017-06-11",269,206]
[null,"2017-06-12",434,351]
[null,"2017-06-13",516,393]
[null,"2017-06-14",618,397]
[null,"2017-06-15",472,355]
[null,"2017-06-16",495,389]
[null,"2017-06-17",301,264]
[null,"2017-06-18",272,204]
[null,"2017-06-19",468,386]
[null,"2017-06-20",450,402]
[null,"2017-06-21",436,381]
[null,"2017-06-22",473,367]
[null,"2017-06-23",453,352]
[null,"2017-06-24",271,246]
[null,"2017-06-25",238,209]
[null,"2017-06-26",573,461]
[null,"2017-06-27",422,374]
[null,"2017-06-28",482,392]
[null,"2017-06-29",519,425]
[null,"2017-06-30",457,409]
[null,"2017-07-01"]

{"sheet":"6.8 STPIS Exclusions","index":12,"n_rows":44,"n_cols":15,"rows_kept":44,"cut":false,"hidden":false,"merged":[[10,11,11,11],[6,1,6,4],[10,6,10,8],[10,5,11,5],[10,4,11,4],[10,2,11,2],[10,3,11,3]]}
[]
[null,{"$f":"dms_TradingName","v":"Ausgrid"}]
[null,{"$f":"CONCATENATE(\"Annual Reporting RIN Response \",CRY)","v":"Annual Reporting RIN Response 2016-17"}]
[null,"6.8 STPIS EXCLUSIONS"]
[]
[]
[null,{"$f":"CONCATENATE(\"This information is collected to inform the application of the STPIS to \",dms_TradingName,\" in future regulatory periods. The information is also collected to monitor network performance, and may be used in performance reports.\")","v":"This information is collected to inform the application of the STPIS to Ausgrid in future regulatory periods. The information is also collected to monitor network performance, and may be used in performance reports."}]
[]
[null,"6.8.1 - STPIS EXCLUSIONS"]
[]
[null,"Date of event","Outage ID","Feeder ID / name","Feeder classification\n(drop down)","Cause of event\n(drop down)","Unplanned",null,null,"Event category","Effect on unplanned MAIFI","Please provide separate explanation to confirm the outage was not due to inadequate transmission connection planning "]
[null,"DD/MM/YYYY",null,null,null,null,"Number of  interruptions","Duration of interruption\n(mins)","Total unplanned minutes off supply","Use exclusion categories listed in section 3.3(a) of the STPIS\n(drop down)","by feeder classification",null,null,null,"Cause of Event"]
[null,null,null,null,null,null,null,null,null,null,null,null,null,null,"Weather"]
[null,null,null,null,null,null,null,null,null,null,null,null,null,null,"Equipment failure"]
[null,null,null,null,null,null,null,null,null,null,null,null,null,null,"Operational error"]
[null,null,null,null,null,null,null,null,null,null,null,null,null,null,"Vegetation"]
[null,null,null,null,null,null,null,null,null,null,null,null,null,null,"Animals"]
[null,null,null,null,null,null,null,null,null,null,null,null,null,null,"Third party impacts"]
[null,null,null,null,null,null,null,null,null,null,null,null,null,null,"Transmission failure"]
[null,null,null,null,null,null,null,null,null,null,null,null,null,null,"Load shedding"]
[null,null,null,null,null,null,null,null,null,null,null,null,null,null,"Inter-distributor connection failure"]
[null,null,null,null,null,null,null,null,null,null,null,null,null,null,"Other"]
[]
[]
[]
[]
[]
[]
[]
[]
[]
[]
[]
[]
[]
[]
[]
[]
[]
[]
[]
[]
[]
[null,"To enter further events - please insert new lines above this line. "]

{"sheet":"6.9 STPIS - GSL","index":13,"n_rows":102,"n_cols":5,"rows_kept":102,"cut":false,"hidden":false,"merged":[[64,1,64,2],[54,1,54,2],[55,1,55,2],[56,1,56,2],[61,1,61,2],[60,1,60,2],[59,1,59,2],[17,1,17,2],[15,1,15,2],[5,1,5,2],[7,1,7,2],[14,1,14,2],[16,1,16,2],[20,1,20,2],[22,1,22,2],[23,1,23,2],[24,1,24,2],[21,1,21,2],[27,1,27,2],[31,1,31,2],[32,1,32,2],[28,1,28,2],[29,1,29,2],[30,1,30,2],[33,1,33,2],[34,1,34,2],[35,1,35,2],[36,1,36,2],[37,1,37,2],[40,1,40,2],[42,1,42,2],[43,1,43,2],[44,1,44,2],[41,1,41,2],[85,1,85,2],[86,1,86,2],[45,1,45,2],[46,1,46,2],[71,1,71,2],[70,1,70,2],[77,1,77,2],[49,1,49,2],[50,1,50,2],[51,1,51,2],[53,1,53,4],[58,1,58,4],[63,1,63,4],[68,1,68,4],[66,1,66,2],[65,1,65,2],[5,4,5,5],[101,1,101,2],[69,1,69,2],[98,1,98,2],[100,1,100,2],[93,1,93,2],[94,1,94,2],[95,1,95,2],[96,1,96,2],[88,1,88,2],[89,1,89,2],[90,1,90,2],[91,1,91,2],[92,1,92,2],[83,1,83,2],[84,1,84,2]]}
[]
[null,{"$f":"dms_TradingName","v":"Ausgrid"}]
[null,{"$f":"CONCATENATE(\"Annual Reporting RIN Response \",CRY)","v":"Annual Reporting RIN Response 2016-17"}]
[null,"6.9 STPIS - GUARANTEED SERVICE LEVEL"]
[]
[null,"Did the AER's GSL Scheme apply at any time during the regulatory year?",null,"No","**IMPORTANT \nPlease ensure this flag is set. Conditional formatting on this worksheet is dependant on this response."]
[]
[null,"Instructions:\nTable 6.9.1 collects information relating to jurisdiction GSL scheme parameters. These parameters can be found in the jurisdictonal scheme relevant to NSP. Please identify each parameter in the relevant sub-tables and provide the volume and value of GSL payments. \n\nFor GSL parameters that do not fit within the provided sub-tables provided, please enter a heading and identify the relevant parameter(s). "]
[]
[null,"6.9.1 - GUARANTEED SERVICE LEVELS - JURISDICTIONAL GSL SCHEME"]
[null,null,null,{"$f":"CRY","v":"2016-17"},{"$f":"CRY","v":"2016-17"}]
[null,null,null,"Volume","Value of GSL payments"]
[null,null,null,"0's","$0's"]
[null,"Appointments"]
[]
[]
[]
[]
[null,"To enter further GSL parameters relating to appointments - please copy a row from above and \"insert copied cells\" above this row."]
[null,"Connections"]
[null,"Connections made",null,132]
[null,"Connections not made on agreed date",null,0,0]
[]
[]
[]
[null,"To enter further GSL parameters relating to connections -  please copy a row from above and \"insert copied cells\" above this row."]
[null,"Reliability of supply"]
[null,"Interruption Duration  Standards - Claims ",null,470,32640]
[null,"Interruption frequency Standards - Claims ",null,35,0]
[]
[]
[]
[]
[]
[]
[]
[]
[]
[null,"To enter further GSL parameters relating to reliability of supply -  please copy a row from above and \"insert copied cells\" above this row."]
[null,"Street lights"]
[null,"Street Lights - GSL payments",null,422,5925]
[]
[]
[]
[]
[]
[]
[null,"To enter further GSL parameters relating to street lights -  please copy a row from above and \"insert copied cells\" above this row."]
[null,"Planned interruptions"]
[null,"Planned interruptions - 4 business days notice not given",null,34]
[null,"Planned interruptions - 4 business days notice not given",null,0,0]
[]
[null,"To enter further GSL parameters relating to planned interruptions -  please copy a row from above and \"insert copied cells\" above this row."]
[null,"<NSP defined parameter category>"]
[]
[]
[]
[null,"To enter further GSL parameters - please identify the parameter and if insufficient rows  please copy a row from above and \"insert copied cells\" above this row."]
[null,"<NSP defined parameter category>"]
[]
[]
[]
[null,"To enter further GSL parameters - please identify the parameter and if insufficient rows  please copy a row from above and \"insert copied cells\" above this row."]
[null,"<NSP defined parameter category>"]
[]
[]
[]
[null,"To enter further GSL parameters - please identify the parameter and if insufficient rows  please copy a row from above and \"insert copied cells\" above this row."]
[null,"<NSP defined parameter category>"]
[]
[]
[]
[null,"To enter further GSL parameters - please identify the parameter and if insufficient rows  please copy a row from above and \"insert copied cells\" above this row."]
[]
[]
[null,"6.9.2 - GUARANTEED SERVICE LEVELS - AER GSL SCHEME"]
[]
[null,"Complete Table 6.9.2 if the AER's GSL scheme applied at any time during the regulatory year. \n\nDo not complete Table 6.9.2 if the AER's GSL scheme did not apply during the regulatory year."]
[]
[null,null,null,{"$f":"CRY","v":"2016-17"},{"$f":"CRY","v":"2016-17"}]
[null,null,null,"Volume","Value \nof GSL payments"]
[null,null,null,"0's","$0's"]
[null,"New connections "]
[null,"Number of connections made"]
[null,"Number of connections not made on or before the day agreed"]
[null,"Connections - GSL payments – 1-6 day delay"]
[null,"Connections - GSL payments – 7+ day delay"]
[null,"Reliability of supply"]
[null,"Frequency of interruptions – CBD feeders – 9 interruptions"]
[null,"Frequency of interruptions – Urban feeders – 9 interruptions"]
[null,"Frequency of interruptions – Rural (short and long) feeders – 15 interruptions"]
[null,"Interruptions – CBD feeders – 12 hours duration"]
[null,"Interruptions – Urban feeders – 12 hours duration"]
[null,"Interruptions – Rural (short and long) feeders – 18 hours duration"]
[null,"Total duration of interruptions Level 1 – 20 hours"]
[null,"Total duration of interruptions Level 2 – 30 hours"]
[null,"Total duration of interruptions Level 3 – 60 hours"]
[null,"Street lights"]
[null,"Streetlight repair 5 days – GSL payments"]
[null,"Planned interruptions"]
[null,"Notice of planned interruptions – 4 business days notice not given"]
[null,"Total ",null,null,{"$f":"SUM(E101,E99,E89:E97,E86:E87)","v":0}]

{"sheet":"7.8 Avoided TUOS Payments","index":14,"n_rows":11,"n_cols":3,"rows_kept":11,"cut":false,"hidden":false,"merged":[[6,1,7,1]]}
[]
[null,{"$f":"dms_TradingName","v":"Ausgrid"}]
[null,{"$f":"CONCATENATE(\"Annual Reporting RIN Response \",CRY)","v":"Annual Reporting RIN Response 2016-17"}]
[null,"7.8 - AVOIDED TUOS PAYMENTS"]
[]
[null,"7.8.1 - AVOIDED TUOS PAYMENTS"]
[null,"Description","Avoided TUOS Payment "]
[null,null,"$0's, nominal"]
[null,"Embedded generators",815541.30388038722]
[null,"Market network service providers"]
[null,"Other"]

{"sheet":"7.10 Juris Scheme","index":15,"n_rows":17,"n_cols":6,"rows_kept":17,"cut":false,"hidden":false,"merged":[[8,4,9,4],[8,3,9,3],[8,2,9,2],[8,1,9,1],[5,1,5,2]]}
[]
[null,{"$f":"dms_TradingName","v":"Ausgrid"}]
[null,{"$f":"CONCATENATE(\"Annual Reporting RIN Response \",CRY)","v":"Annual Reporting RIN Response 2016-17"}]
[null,"7.10 - JURISDICTIONAL SCHEMES"]
[]
[null,"Instructions\nBusiness must list each relevant jurisdictional scheme individually and report information for each scheme separately from other schemes."]
[]
[null,"7.10.1 - JURISDICTIONAL SCHEME PAYMENTS"]
[null,"Jurisdictional Scheme Name","Description","Date DNSP Became Subject to Scheme","Description of Cost Recovery Method","Total Scheme Payments  "]
[null,null,null,null,null,"$0's, nominal"]
[null,"Solar Bonus Scheme (SBS)","Solar Bonus Scheme","2010-01-01","Recovered from the Climate Change Fund. SBS credit payments are made to eligible solar PV system customers.",-101839.86533472314]
[null,"Climate Change Fund (CCF)","Climate Change Fund","2007-07-01","Recovered from the customer's CCF component of their bills.",16074624.669249654]
[]
[]
[]
[]
[null,null,null,null,"Total",{"$f":"SUM(F11:F16)","v":15972784.803914931}]

{"sheet":"7.11 DMIS-DMIA","index":16,"n_rows":19,"n_cols":5,"rows_kept":19,"cut":false,"hidden":false,"merged":[[16,5,16,7],[6,1,7,1],[6,5,7,7],[6,2,6,4],[13,5,13,7],[9,5,9,7],[10,5,10,7],[11,5,11,7],[12,5,12,7],[8,2,8,4],[15,5,15,7],[14,5,14,7]]}
[]
[null,{"$f":"dms_TradingName","v":"Ausgrid"}]
[null,{"$f":"CONCATENATE(\"Annual Reporting RIN Response \",CRY)","v":"Annual Reporting RIN Response 2016-17"}]
[null,"7.11 - DEMAND MANAGEMENT INCENTIVE SCHEME"]
[]
[null,"7.11.1 - DMIA - PROJECTS SUBMITTED FOR APPROVAL"]
[null,"Name of project",{"$f":"CONCATENATE(\"Total amount of the DMIA spent in \", CRY)","v":"Total amount of the DMIA spent in 2016-17"}]
[null,null,"Operating expenditure","Capital expenditure","Total"]
[null,null,"$0's, nominal"]
[null,"AS4755 air conditioner and pool pump load control",21518,0,{"$f":"SUM(C10:D10)","v":21518}]
[null,"Customer power factor correction",45042,0,45042]
[null,"CoolSaver Maitland ",92321,0,92321]
[null,"Winter air conditioner load control",36070,0,36070]
[null,"DMIA stakeholder engagement",37700,0,37700]
[null,"Solar and battery customer research",134983,0,{"$f":"SUM(C15:D15)","v":134983}]
[null,"Demand management for replacement projects (previously Non-residential energy efficiency program)",5552,0,{"$f":"SUM(C16:D16)","v":5552}]
[null,null,null,null,{"$f":"SUM(C17:D17)","v":0}]
[null,"To enter additional projects - please copy a row from above and \"insert copied cells\" above this row. "]
[null,"Total",{"$f":"SUM(C10:C18)","v":373186},{"$f":"SUM(D10:D18)","v":0},{"$f":"SUM(E10:E18)","v":373186}]

{"sheet":"7.12 Safety and Bushfire","index":17,"n_rows":340,"n_cols":10,"rows_kept":340,"cut":false,"hidden":false,"merged":[[139,1,139,2],[140,1,140,2],[141,1,141,2],[142,1,142,2],[143,1,143,2],[144,1,144,2],[203,6,203,7],[204,6,204,7],[205,6,205,7],[145,1,145,2],[206,6,206,7],[181,6,181,7],[182,6,182,7],[183,6,183,7],[184,6,184,7],[185,6,185,7],[186,6,186,7],[187,6,187,7],[188,6,188,7],[189,6,189,7],[117,1,118,2],[180,6,180,7],[306,6,306,7],[307,6,307,7],[118,3,118,5],[119,1,119,2],[120,1,120,2],[121,1,121,2],[122,1,122,2],[123,1,123,2],[124,1,124,2],[125,1,125,2],[126,1,126,2],[127,1,127,2],[128,1,128,2],[129,1,129,2],[130,1,130,2],[131,1,131,2],[132,1,132,2],[133,1,133,2],[134,1,134,2],[135,1,135,2],[136,1,136,2],[137,1,137,2],[138,1,138,2],[297,6,297,7],[298,6,298,7],[299,6,299,7],[300,6,300,7],[301,6,301,7],[302,6,302,7],[303,6,303,7],[275,6,275,7],[276,6,276,7],[282,6,282,7],[283,6,283,7],[284,6,284,7],[285,6,285,7],[286,6,286,7],[287,6,287,7],[280,6,280,7],[281,6,281,7],[266,6,266,7],[267,6,267,7],[268,6,268,7],[269,6,269,7],[270,6,270,7],[271,6,271,7],[304,6,304,7],[305,6,305,7],[288,6,288,7],[289,6,289,7],[290,6,290,7],[291,6,291,7],[292,6,292,7],[293,6,293,7],[294,6,294,7],[295,6,295,7],[296,6,296,7],[272,6,272,7],[273,6,273,7],[274,6,274,7],[257,6,257,7],[258,6,258,7],[259,6,259,7],[260,6,260,7],[261,6,261,7],[262,6,262,7],[263,6,263,7],[264,6,264,7],[265,6,265,7],[248,6,249,7],[250,6,250,7],[251,6,251,7],[252,6,252,7],[253,6,253,7],[254,6,254,7],[255,6,255,7],[256,6,256,7],[169,8,169,9],[170,8,170,9],[207,6,207,7],[190,6,190,7],[191,6,191,7],[192,6,192,7],[193,6,193,7],[194,6,194,7],[195,6,195,7],[196,6,196,7],[197,6,197,7],[198,6,198,7],[199,6,199,7],[200,6,200,7],[201,6,201,7],[202,6,202,7],[162,8,164,9],[171,8,171,9],[172,8,172,9],[166,8,166,9],[167,8,167,9],[71,6,71,7],[72,6,72,7],[73,6,73,7],[74,6,74,7],[75,6,75,7],[76,6,76,7],[77,6,77,7],[165,8,165,9],[168,8,168,9],[130,6,130,8],[131,6,131,8],[132,6,132,8],[127,6,127,8],[128,6,128,8],[129,6,129,8],[63,6,63,7],[64,6,64,7],[65,6,65,7],[66,6,66,7],[67,6,67,7],[50,6,50,7],[51,6,51,7],[52,6,52,7],[53,6,53,7],[54,6,54,7],[55,6,55,7],[56,6,56,7],[57,6,57,7],[58,6,58,7],[18,6,18,8],[19,6,19,8],[20,6,20,8],[21,6,21,8],[22,6,22,8],[42,6,42,8],[43,6,43,8],[44,6,44,8],[28,6,28,8],[29,6,29,8],[30,6,30,8],[31,6,31,8],[23,6,23,8],[24,6,24,8],[25,6,25,8],[26,6,26,8],[27,6,27,8],[40,6,40,8],[37,6,37,8],[41,6,41,8],[38,6,38,8],[39,6,39,8],[212,1,214,1],[212,2,214,2],[214,3,214,5],[82,9,84,9],[162,2,162,4],[162,5,162,7],[162,1,164,1],[164,5,164,7],[133,6,133,8],[134,6,134,8],[135,6,135,8],[136,6,136,8],[137,6,137,8],[138,6,138,8],[139,6,139,8],[140,6,140,8],[141,6,141,8],[142,6,142,8],[143,6,143,8],[144,6,144,8],[145,6,145,8],[212,9,214,9],[117,6,118,8],[121,6,121,8],[37,2,37,5],[5,1,5,2],[25,2,25,5],[26,2,26,5],[27,2,27,5],[28,2,28,5],[29,2,29,5],[30,2,30,5],[42,2,42,5],[31,2,31,5],[32,2,32,5],[14,1,14,4],[13,1,13,4],[33,2,33,5],[24,2,24,5],[17,2,17,5],[18,2,18,5],[19,2,19,5],[20,2,20,5],[21,2,21,5],[22,2,22,5],[23,2,23,5],[248,1,249,1],[248,2,249,2],[312,4,312,6],[10,1,10,2],[82,3,82,5],[82,1,84,1],[82,2,84,2],[11,1,11,2],[164,2,164,4],[84,3,84,5],[82,6,82,8],[84,6,84,8],[17,6,17,8],[32,6,32,8],[33,6,33,8],[34,2,34,5],[34,6,34,8],[35,2,35,5],[35,6,35,8],[36,2,36,5],[36,6,36,8],[249,3,249,5],[311,4,311,6],[43,2,43,5],[337,4,337,6],[338,4,338,6],[324,4,324,6],[313,4,313,6],[314,4,314,6],[315,4,315,6],[316,4,316,6],[317,4,317,6],[318,4,318,6],[325,4,325,6],[326,4,326,6],[321,4,321,6],[322,4,322,6],[323,4,323,6],[332,4,332,6],[333,4,333,6],[334,4,334,6],[336,4,336,6],[331,4,331,6],[335,4,335,6],[329,4,329,6],[330,4,330,6],[327,4,327,6],[328,4,328,6],[319,4,319,6],[320,4,320,6],[214,6,214,8],[212,3,212,5],[212,6,212,8],[40,2,40,5],[41,2,41,5],[38,2,38,5],[39,2,39,5],[119,6,119,8],[120,6,120,8],[44,2,44,5],[68,6,68,7],[69,6,69,7],[70,6,70,7],[122,6,122,8],[123,6,123,8],[124,6,124,8],[125,6,125,8],[126,6,126,8],[59,6,59,7],[60,6,60,7],[61,6,61,7],[62,6,62,7]]}
[]
[null,{"$f":"dms_TradingName","v":"Ausgrid"}]
[null,{"$f":"CONCATENATE(\"Annual Reporting RIN Response \",CRY)","v":"Annual Reporting RIN Response 2016-17"}]
[null,"7.12 SAFETY AND BUSHFIRE RELATED EXPENDITURE"]
[]
[null,"These templates collect information from Victorian businesses only.\n\nBushfire and safety related expenditure information is used by the AER to monitor the expenditures throughout the regulatory control period."]
[]
[null,"CPI applied to convert expected expenditure in real $ to nominal based on lagged September CPI index"]
[]
[null,"Instructions"]
[null,"For \"Exclusive of Margins & Overheads\" reported expenditure is to EXCLUDE any overheads, profit margins or management fees paid directly or indirectly to related party contractors (not including actual incurred expense of the related party contractor) for the reporting period."]
[null,"For \"Value of Margins & Overheads\" reported expenditure is to COMPRISE ONLY the sum of overheads, profit margins or management fees paid directly or indirectly to related party contractors (not including actual incurred expenses of the related party contractor) for the reporting period. "]
[]
[null,{"$f":"CONCATENATE(dms_TradingName, \" is to specify each activity in this table in accordance with the definition in Appendix F of the RIN.\")","v":"Ausgrid is to specify each activity in this table in accordance with the definition in Appendix F of the RIN."}]
[null,"All activities must be reported but the Reason for Difference is only required if there is a 10 per cent difference between the expected value and the actual value.\n\nUse median unit costs. Where unit costs are not recorded at the asset category level - provide the best estimates of the unit cost using the cost allocation method identified in this table. (As a transitional measure, the unit cost may be based on a statistically significant annual sample of actual work orders at a 5% or better confidence interval.)\n\nProvide basis of allocation where applicable."]
[]
[null,"7.12.1 - SAFETY AND BUSHFIRE RELATED ASSET GROUP DEFINITIONS AND ALLOCATION BASIS"]
[null,"Activity","Definitions",null,null,null,"Basis for allocation of cost to activity"]
[null,"Planned non-preferred services replacements"]
[null,"Planned replacement of non-preferred services due to height "]
[null,"Removal of public lighting switchwire "]
[null,"Replacement of existing SWER lines with 22kV overhead bare conductor "]
[null,"Installation of GFN and associated equipment at zone substations "]
[null,"Replacement of crossarms/insulator sets – pole top fire mitigation"]
[null,"Replacement of crossarms – based on age and condition "]
[null,"Replacement of poles – based on age and condition "]
[null,"Stake poles – based on age and condition "]
[null,"Replacement of undersized poles "]
[null,"Stake undersized poles"]
[null,"Replacement of overhead conductor – mainly steel "]
[null,"Service line clearance – overhead services requiring relocation "]
[null,"Service line clearance – overhead services requiring undergrounding "]
[null,"Replacement of 22kV distribution feeders with ABC/underground cabling"]
[null,"Replacement of SWER with covered carbon core conductor or equivalent"]
[null,"Replacement of SWER with ABC"]
[null,"Replacement of SWER with underground"]
[null,"Replacement of surge diverters (neptune configuration)"]
[null,"Replacement of surge diverters (single phase or three phase)"]
[]
[]
[]
[]
[]
[]
[]
[null,"To enter further activities - please copy row from above and \"insert copied cells\" into a row above this row. "]
[]
[null,"7.12.2 - BUSHFIRE RELATED"]
[]
[null,"7.12.2.1 - NUMBER OF ACTIVITIES"]
[null,"Activity","Units","AER expected number","Actual Number","Difference","Reasons for Difference"]
[null,"Planned non-preferred services replacements","number of services",null,null,{"$f":"D52-E52","v":0}]
[null,"Planned replacement of non-preferred services due to height ","number of services",null,null,{"$f":"D53-E53","v":0}]
[null,"Removal of public lighting switchwire ","number of spans removed",null,null,0]
[null,"Replacement of existing SWER lines with 22kV overhead bare conductor ","kms of SWER",null,null,0]
[null,"Installation of GFN and associated equipment at zone substations ","number of zone substations",null,null,{"$f":"D56-E56","v":0}]
[null,"Replacement of crossarms/insulator sets – pole top fire mitigation","number of crossarms/sets",null,null,0]
[null,"Replacement of crossarms – based on age and condition ","number of crossarms",null,null,0]
[null,"Replacement of poles – based on age and condition ","number of poles",null,null,0]
[null,"Stake poles – based on age and condition ","number of poles",null,null,0]
[null,"Replacement of undersized poles ","number of poles",null,null,0]
[null,"Stake undersized poles","number of poles",null,null,0]
[null,"Replacement of overhead conductor – mainly steel ","kms ",null,null,0]
[null,"Service line clearance – overhead services requiring relocation ","number of services",null,null,0]
[null,"Service line clearance – overhead services requiring undergrounding ","number of services",null,null,0]
[null,"Replacement of 22kV distribution feeders with ABC/underground cabling","number of feeders",null,null,0]
[null,"Replacement of SWER with covered carbon core conductor or equivalent","kms ",null,null,0]
[null,"Replacement of SWER with ABC","kms ",null,null,0]
[null,"Replacement of SWER with underground","kms ",null,null,0]
[null,"Replacement of surge diverters (neptune configuration)","number of units",null,null,{"$f":"D70-E70","v":0}]
[null,"Replacement of surge diverters (single phase or three phase)","number of units",null,null,0]
[null,{"$f":"IF(ISBLANK(B39),\"\",B39)","v":""},null,null,null,{"$f":"D72-E72","v":0}]
[null,{"$f":"IF(ISBLANK(B40),\"\",B40)","v":""},null,null,null,0]
[null,"",null,null,null,0]
[null,"",null,null,null,0]
[null,"",null,null,null,0]
[null,"",null,null,null,0]
[null,"",null,null,null,0]
[null,"To enter further activities - please copy row from above and \"insert copied cells\" into a row above this row. "]
[]
[]
[null,"7.12.2.2 - EXPENDITURE "]
[null,"Activity","Units","Exclusive of Margins & Overheads",null,null,"Value of Margins & Overheads",null,null,"Reasons for Difference"]
[null,null,null,"AER expected expenditure ","Actual expenditure","Difference  ","AER expected expenditure ","Actual expenditure","Difference  "]
[null,null,null,"$0's, Nominal",null,null,"$0's, Nominal"]
[null,"Planned non-preferred services replacements","number of services",null,null,{"$f":"D86*$C$8-E86","v":0},null,null,{"$f":"G86*$C$8-H86","v":0}]
[null,"Planned replacement of non-preferred services due to height ","number of services",null,null,{"$f":"D87*$C$8-E87","v":0},null,null,{"$f":"G87*$C$8-H87","v":0}]
[null,"Removal of public lighting switchwire ","number of spans removed",null,null,0,null,null,0]
[null,"Replacement of existing SWER lines with 22kV overhead bare conductor ","kms of SWER",null,null,0,null,null,0]
[null,"Installation of GFN and associated equipment at zone substations ","number of zone substations",null,null,0,null,null,0]
[null,"Replacement of crossarms/insulator sets – pole top fire mitigation","number of crossarms/sets",null,null,0,null,null,0]
[null,"Replacement of crossarms – based on age and condition ","number of crossarms",null,null,0,null,null,0]
[null,"Replacement of poles – based on age and condition ","number of poles",null,null,0,null,null,0]
[null,"Stake poles – based on age and condition ","number of poles",null,null,0,null,null,0]
[null,"Replacement of undersized poles ","number of poles",null,null,0,null,null,0]
[null,"Stake undersized poles","number of poles",null,null,0,null,null,0]
[null,"Replacement of overhead conductor – mainly steel ","kms ",null,null,0,null,null,0]
[null,"Service line clearance – overhead services requiring relocation ","number of services",null,null,0,null,null,0]
[null,"Service line clearance – overhead services requiring undergrounding ","number of services",null,null,0,null,null,0]
[null,"Replacement of 22kV distribution feeders with ABC/underground cabling","number of feeders",null,null,0,null,null,0]
[null,"Replacement of SWER with covered carbon core conductor or equivalent","kms ",null,null,0,null,null,0]
[null,"Replacement of SWER with ABC","kms ",null,null,0,null,null,0]
[null,"Replacement of SWER with underground","kms ",null,null,0,null,null,0]
[null,"Replacement of surge diverters (neptune configuration)","number of units",null,null,0,null,null,0]
[null,"Replacement of surge diverters (single phase or three phase)","number of units",null,null,0,null,null,0]
[null,{"$f":"IF(ISBLANK(B39),\"\",B39)","v":""},{"$f":"IF(ISBLANK(C72),\"\",C72)","v":""},null,null,0,null,null,0]
[null,"","",null,null,{"$f":"D107*$C$8-E107","v":0},null,null,{"$f":"G107*$C$8-H107","v":0}]
[null,"","",null,null,0,null,null,0]
[null,"","",null,null,0,null,null,0]
[null,"","",null,null,0,null,null,0]
[null,"","",null,null,0,null,null,0]
[null,"","",null,null,0,null,null,0]
[null,"To enter further activities - please copy row from above and \"insert copied cells\" into a row above this row. "]
[]
[]
[]
[null,"7.12.2.3 - UNIT COSTS"]
[null,"Activity",null,"AER expected ","Actual","Difference","Reasons for Difference"]
[null,null,null,"$0's, Per Unit"]
[null,"Planned non-preferred services replacements",null,null,null,{"$f":"D120*$C$8-E120","v":0}]
[null,"Planned replacement of non-preferred services due to height ",null,null,null,0]
[null,"Removal of public lighting switchwire ",null,null,null,0]
[null,"Replacement of existing SWER lines with 22kV overhead bare conductor ",null,null,null,0]
[null,"Installation of GFN and associated equipment at zone substations ",null,null,null,0]
[null,"Replacement of crossarms/insulator sets – pole top fire mitigation",null,null,null,0]
[null,"Replacement of crossarms – based on age and condition ",null,null,null,0]
[null,"Replacement of poles – based on age and condition ",null,null,null,0]
[null,"Stake poles – based on age and condition ",null,null,null,0]
[null,"Replacement of undersized poles ",null,null,null,0]
[null,"Stake undersized poles",null,null,null,0]
[null,"Replacement of overhead conductor – mainly steel ",null,null,null,0]
[null,"Service line clearance – overhead services requiring relocation ",null,null,null,0]
[null,"Service line clearance – overhead services requiring undergrounding ",null,null,null,0]
[null,"Replacement of 22kV distribution feeders with ABC/underground cabling",null,null,null,0]
[null,"Replacement of SWER with covered carbon core conductor or equivalent",null,null,null,0]
[null,"Replacement of SWER with ABC",null,null,null,0]
[null,"Replacement of SWER with underground",null,null,null,0]
[null,"Replacement of surge diverters (neptune configuration)",null,null,null,0]
[null,"Replacement of surge diverters (single phase or three phase)",null,null,null,0]
[null,{"$f":"IF(ISBLANK(B39),\"\",B39)","v":""},null,null,null,0]
[null,"",null,null,null,0]
[null,"",null,null,null,0]
[null,"",null,null,null,0]
[null,"",null,null,null,0]
[null,"",null,null,null,0]
[null,"",null,null,null,0]
[null,"To enter further activities - please copy row from above and \"insert copied cells\" into a row above this row. "]
[]
[]
[null,"7.12.2.4 - CONTINGENT PROJECT APPLICATIONS - VOLUMES APPROVED"]
[null,"Activity","Units","Volume approved under contingent project applications ","Actual volumes","Difference"]
[null,null,null,null,null,{"$f":"E152-D152","v":0}]
[null,null,null,null,null,0]
[null,null,null,null,null,0]
[null,null,null,null,null,0]
[null,null,null,null,null,0]
[null,null,null,null,null,0]
[null,null,null,null,null,0]
[null,null,null,null,null,0]
[null,"To enter further activities - please copy row from above and \"insert copied cells\" into a row above this row. "]
[]
[null,"7.12.2.5 - CONTINGENT PROJECT APPLICATIONS - EXPENDITURE APPROVED"]
[null,"Activity","Exclusive of Margins & Overheads",null,null,"Value of Margins & Overheads",null,null,"Reasons for Difference"]
[null,null,"Expenditure approved under contingent project applications","Actual expenditure ","Difference","Expenditure approved under contingent project applications","Actual expenditure","Difference"]
[null,null,"$0's, Nominal",null,null,"$0's, Nominal"]
[null,{"$f":"IF(ISBLANK(B152),\"\",B152)","v":""},null,null,{"$f":"C166-D166","v":0},null,null,{"$f":"F166-G166","v":0}]
[null,{"$f":"IF(ISBLANK(B153),\"\",B153)","v":""},null,null,{"$f":"C167-D167","v":0},null,null,{"$f":"F167-G167","v":0}]
[null,"",null,null,0,null,null,0]
[null,"",null,null,0,null,null,0]
[null,"",null,null,0,null,null,0]
[null,"",null,null,0,null,null,0]
[null,"",null,null,0,null,null,0]
[null,"",null,null,0,null,null,0]
[null,"To enter further activities - please copy row from above and \"insert copied cells\" into a row above this row. "]
[]
[]
[]
[null,"7.12.3 - SAFETY RELATED"]
[]
[null,"7.12.3.1 - NUMBER OF ACTIVITIES"]
[null,"Activity","Units","AER expected volumes","Actual units","Difference","Reasons for Difference"]
[null,"Planned non-preferred services replacements","number of services",null,null,{"$f":"D182-E182","v":0}]
[null,"Planned replacement of non-preferred services due to height ","number of services",null,null,{"$f":"D183-E183","v":0}]
[null,"Removal of public lighting switchwire ","number of spans removed",null,null,0]
[null,"Replacement of existing SWER lines with 22kV overhead bare conductor ","kms of SWER",null,null,0]
[null,"Installation of GFN and associated equipment at zone substations ","number of zone substations",null,null,0]
[null,"Replacement of crossarms/insulator sets – pole top fire mitigation","number of crossarms/sets",null,null,0]
[null,"Replacement of crossarms – based on age and condition ","number of crossarms",null,null,0]
[null,"Replacement of poles – based on age and condition ","number of poles",null,null,0]
[null,"Stake poles – based on age and condition ","number of poles",null,null,0]
[null,"Replacement of undersized poles ","number of poles",null,null,0]
[null,"Stake undersized poles","number of poles",null,null,0]
[null,"Replacement of overhead conductor – mainly steel ","kms ",null,null,0]
[null,"Service line clearance – overhead services requiring relocation ","number of services",null,null,0]
[null,"Service line clearance – overhead services requiring undergrounding ","number of services",null,null,0]
[null,"Replacement of 22kV distribution feeders with ABC/underground cabling","number of feeders",null,null,0]
[null,"Replacement of SWER with covered carbon core conductor or equivalent","kms ",null,null,0]
[null,"Replacement of SWER with ABC","kms ",null,null,{"$f":"D198-E198","v":0}]
[null,"Replacement of SWER with underground","kms ",null,null,{"$f":"D199-E199","v":0}]
[null,"Replacement of surge diverters (neptune configuration)","number of units",null,null,0]
[null,"Replacement of surge diverters (single phase or three phase)","number of units",null,null,0]
[null,{"$f":"IF(ISBLANK(B39),\"\",B39)","v":""},{"$f":"IF(ISBLANK(C72),\"\",C72)","v":""},null,null,0]
[null,"","",null,null,0]
[null,"","",null,null,{"$f":"D204-E204","v":0}]
[null,"","",null,null,{"$f":"D205-E205","v":0}]
[null,"","",null,null,{"$f":"D206-E206","v":0}]
[null,"","",null,null,0]
[null,"","",null,null,0]
[null,"To enter further activities - please copy row from above and \"insert copied cells\" into a row above this row. "]
[]
[]
[null,"7.12.3.2 - EXPENDITURE"]
[null,"Activity","Units","Exclusive of Margins & Overheads",null,null,"Value of Margins & Overheads",null,null,"Reasons for Difference"]
[null,null,null,"AER expected expenditure ","Actual expenditure","Difference  ","AER expected expenditure ","Actual expenditure","Difference  "]
[null,null,null,"$0's, Nominal",null,null,"$0's, Nominal"]
[null,"Planned non-preferred services replacements","number of services",null,null,{"$f":"D216*$C$8-E216","v":0},null,null,{"$f":"G216*$C$8-H216","v":0}]
[null,"Planned replacement of non-preferred services due to height ","number of services",null,null,{"$f":"D217*$C$8-E217","v":0},null,null,{"$f":"G217*$C$8-H217","v":0}]
[null,"Removal of public lighting switchwire ","number of spans removed",null,null,0,null,null,0]
[null,"Replacement of existing SWER lines with 22kV overhead bare conductor ","kms of SWER",null,null,0,null,null,0]
[null,"Installation of GFN and associated equipment at zone substations ","number of zone substations",null,null,0,null,null,0]
[null,"Replacement of crossarms/insulator sets – pole top fire mitigation","number of crossarms/sets",null,null,0,null,null,0]
[null,"Replacement of crossarms – based on age and condition ","number of crossarms",null,null,0,null,null,0]
[null,"Replacement of poles – based on age and condition ","number of poles",null,null,0,null,null,0]
[null,"Stake poles – based on age and condition ","number of poles",null,null,0,null,null,0]
[null,"Replacement of undersized poles ","number of poles",null,null,0,null,null,0]
[null,"Stake undersized poles","number of poles",null,null,0,null,null,0]
[null,"Replacement of overhead conductor – mainly steel ","kms ",null,null,0,null,null,0]
[null,"Service line clearance – overhead services requiring relocation ","number of services",null,null,0,null,null,0]
[null,"Service line clearance – overhead services requiring undergrounding ","number of services",null,null,0,null,null,0]
[null,"Replacement of 22kV distribution feeders with ABC/underground cabling","number of feeders",null,null,0,null,null,0]
[null,"Replacement of SWER with covered carbon core conductor or equivalent","kms ",null,null,0,null,null,0]
[null,"Replacement of SWER with ABC","kms ",null,null,{"$f":"D232-E232","v":0},null,null,{"$f":"G232-H232","v":0}]
[null,"Replacement of SWER with underground","kms ",null,null,{"$f":"D233-E233","v":0},null,null,{"$f":"G233-H233","v":0}]
[null,"Replacement of surge diverters (neptune configuration)","number of units",null,null,0,null,null,0]
[null,"Replacement of surge diverters (single phase or three phase)","number of units",null,null,0,null,null,0]
[null,{"$f":"IF(ISBLANK(B39),\"\",B39)","v":""},{"$f":"IF(ISBLANK(C72),\"\",C72)","v":""},null,null,0,null,null,0]
[null,"","",null,null,0,null,null,0]
[null,"","",null,null,{"$f":"D238-E238","v":0},null,null,{"$f":"G238-H238","v":0}]
[null,"","",null,null,{"$f":"D239-E239","v":0},null,null,{"$f":"G239-H239","v":0}]
[null,"","",null,null,{"$f":"D240-E240","v":0},null,null,{"$f":"G240-H240","v":0}]
[null,"","",null,null,0,null,null,0]
[null,"","",null,null,0,null,null,0]
[null,"To enter further activities - please copy row from above and \"insert copied cells\" into a row above this row. "]
[]
[]
[]
[]
[null,"7.12.3.3 - UNIT COSTS"]
[null,"Activity","Units","AER expected","Actual\n  ","Difference\n  ","Reasons for Difference"]
[null,null,null,"$0's per Unit"]
[null,"Planned non-preferred services replacements","number of services",null,null,{"$f":"D251*$C$8-E251","v":0}]
[null,"Planned replacement of non-preferred services due to height ","number of services",null,null,0]
[null,"Removal of public lighting switchwire ","number of spans removed",null,null,0]
[null,"Replacement of  existing SWER lines with 22kV overhead bare conductor ","kms of SWER",null,null,0]
[null,"Installation of GFN and associated equipment at zone substations ","number of zone substations",null,null,0]
[null,"Replacement of crossarms/insulator sets – pole top fire mitigation","number of crossarms/sets",null,null,0]
[null,"Replacement of crossarms – based on age and condition ","number of crossarms",null,null,0]
[null,"Replacement of poles – based on age and condition ","number of poles",null,null,0]
[null,"Stake poles – based on age and condition ","number of poles",null,null,0]
[null,"Replacement of undersized poles ","number of poles",null,null,0]
[null,"Stake undersized poles","number of poles",null,null,0]
[null,"Replacement of overhead conductor – mainly steel ","kms ",null,null,0]
[null,"Service line clearance – overhead services requiring relocation ","number of services",null,null,0]
[null,"Service line clearance – overhead services requiring undergrounding ","number of services",null,null,0]
[null,"Replacement of 22kV distribution feeders with ABC/underground cabling","number of feeders",null,null,0]
[null,"Replacement of SWER with covered carbon core conductor or equivalent","kms ",null,null,0]
[null,"Replacement of SWER with ABC","kms ",null,null,{"$f":"D267-E267","v":0}]
[null,"Replacement of SWER with underground","kms ",null,null,{"$f":"D268-E268","v":0}]
[null,"Replacement of surge diverters (neptune configuration)","number of units",null,null,0]
[null,"Replacement of surge diverters (single phase or three phase)","number of units",null,null,0]
[null,{"$f":"IF(ISBLANK(B39),\"\",B39)","v":""},{"$f":"IF(ISBLANK(C72),\"\",C72)","v":""},null,null,0]
[null,"","",null,null,0]
[null,"","",null,null,{"$f":"D273-E273","v":0}]
[null,"","",null,null,{"$f":"D274-E274","v":0}]
[null,"","",null,null,{"$f":"D275-E275","v":0}]
[null,"","",null,null,0]
[null,"","",null,null,0]
[null,"To enter further activities - please copy row from above and \"insert copied cells\" into a row above this row. "]
[]
[null,"7.12.3.4 - SAFETY IMPROVEMENT OUTCOMES REPORTED TO ESV"]
[null,"Activity","Units","Safety Improvement Programme - outcomes","Safety Improvement Target","Difference","Reasons for Difference"]
[null,"Planned non-preferred services replacements","number of services",null,null,{"$f":"D282-E282","v":0}]
[null,"Planned replacement of non-preferred services due to height ","number of services",null,null,{"$f":"D283-E283","v":0}]
[null,"Removal of public lighting switchwire ","number of spans removed",null,null,0]
[null,"Replacement of  existing SWER lines with 22kV overhead bare conductor ","kms of SWER",null,null,0]
[null,"Installation of GFN and associated equipment at zone substations ","number of zone substations",null,null,0]
[null,"Replacement of crossarms/insulator sets – pole top fire mitigation","number of crossarms/sets",null,null,0]
[null,"Replacement of crossarms – based on age and condition ","number of crossarms",null,null,0]
[null,"Replacement of poles – based on age and condition ","number of poles",null,null,0]
[null,"Stake poles – based on age and condition ","number of poles",null,null,0]
[null,"Replacement of undersized poles ","number of poles",null,null,0]
[null,"Stake undersized poles","number of poles",null,null,0]
[null,"Replacement of overhead conductor – mainly steel ","kms ",null,null,0]
[null,"Service line clearance – overhead services requiring relocation ","number of services",null,null,0]
[null,"Service line clearance – overhead services requiring undergrounding ","number of services",null,null,0]
[null,"Replacement of 22kV distribution feeders with ABC/underground cabling","number of feeders",null,null,0]
[null,"Replacement of SWER with covered carbon core conductor or equivalent","kms ",null,null,0]
[null,"Replacement of SWER with ABC","kms ",null,null,0]
[null,"Replacement of SWER with underground","kms ",null,null,{"$f":"D299-E299","v":0}]
[null,"Replacement of surge diverters (neptune configuration)","number of units",null,null,0]
[null,"Replacement of surge diverters (single phase or three phase)","number of units",null,null,0]
[null,{"$f":"IF(ISBLANK(B39),\"\",B39)","v":""},{"$f":"IF(ISBLANK(C72),\"\",C72)","v":""},null,null,0]
[null,"","",null,null,0]
[null,"","",null,null,{"$f":"D304-E304","v":0}]
[null,"","",null,null,{"$f":"D305-E305","v":0}]
[null,"","",null,null,{"$f":"D306-E306","v":0}]
[null,"","",null,null,0]
[null,"","",null,null,0]
[null,"To enter further activities - please copy row from above and \"insert copied cells\" into a row above this row. "]
[]
[null,"7.12.3.5 - SAFETY IMPROVEMENT OUTCOMES RECONCILIATION"]
[null,"Activity","Units","Difference","Reasons for Difference"]
[null,"Planned non-preferred services replacements","number of services",{"$f":"D282-E52-E182","v":0}]
[null,"Planned replacement of non-preferred services due to height ","number of services",0]
[null,"Removal of public lighting switchwire ","number of spans removed",0]
[null,"Replacement of  existing SWER lines with 22kV overhead bare conductor ","kms of SWER",0]
[null,"Installation of GFN and associated equipment at zone substations ","number of zone substations",0]
[null,"Replacement of crossarms/insulator sets – pole top fire mitigation","number of crossarms/sets",0]
[null,"Replacement of crossarms – based on age and condition ","number of crossarms",0]
[null,"Replacement of poles – based on age and condition ","number of poles",0]
[null,"Stake poles – based on age and condition ","number of poles",0]
[null,"Replacement of undersized poles ","number of poles",0]
[null,"Stake undersized poles","number of poles",0]
[null,"Replacement of overhead conductor – mainly steel ","kms ",0]
[null,"Service line clearance – overhead services requiring relocation ","number of services",0]
[null,"Service line clearance – overhead services requiring undergrounding ","number of services",0]
[null,"Replacement of 22kV distribution feeders with ABC/underground cabling","number of feeders",0]
[null,"Replacement of SWER with covered carbon core conductor or equivalent","kms ",0]
[null,"Replacement of SWER with ABC","kms ",0]
[null,"Replacement of SWER with underground","kms ",0]
[null,"Replacement of surge diverters (neptune configuration)","number of units",0]
[null,"Replacement of surge diverters (single phase or three phase)","number of units",0]
[null,{"$f":"IF(ISBLANK(B39),\"\",B39)","v":""},{"$f":"IF(ISBLANK(C72),\"\",C72)","v":""},{"$f":"D302-E73-E202","v":0}]
[null,"","",0]
[null,"","",0]
[null,"","",0]
[null,"","",0]
[null,"","",0]
[null,"","",0]
[null,"To enter further activities - please copy row from above and \"insert copied cells\" into a row above this row. "]

{"sheet":"7.13 TARC","index":18,"n_rows":9,"n_cols":3,"rows_kept":9,"cut":false,"hidden":false,"merged":[]}
[]
[null,{"$f":"dms_TradingName","v":"Ausgrid"}]
[null,{"$f":"CONCATENATE(\"Annual Reporting RIN Response \",CRY)","v":"Annual Reporting RIN Response 2016-17"}]
[null,"7.13 - TARC"]
[]
[]
[null,"7.13.1 - TOTAL ANNUAL RETAILER CHARGES"]
[null,null,"$0's"]
[null,"TARC",2517685524.9838972]

{"sheet":"8.1 Income","index":19,"n_rows":40,"n_cols":12,"rows_kept":40,"cut":false,"hidden":false,"merged":[[6,1,9,1],[6,6,6,10],[7,8,7,10],[6,11,8,11],[9,2,9,11],[6,5,8,5],[7,6,7,7],[6,2,8,2],[6,3,8,3],[6,4,8,4]]}
[]
[null,{"$f":"dms_TradingName","v":"Ausgrid"}]
[null,{"$f":"CONCATENATE(\"Annual Reporting RIN Response \",CRY)","v":"Annual Reporting RIN Response 2016-17"}]
[null,"8.1 - INCOME"]
[]
[null,"8.1.1 - INCOME STATEMENT"]
[null,"Description","Audited Statutory Accounts","Adjustments","Distribution business","Standard Control Services","Alternative Control Services",null,null,null,null,"Negotiated Services"]
[null,null,null,null,null,null,"Public Lighting",null,"Other"]
[null,null,null,null,null,null,{"$f":"IF(dms_Jurisdiction=\"Vic\",\"Energy efficient\",\"\")","v":{"$error":"#REF!"}},{"$f":"IF(dms_Jurisdiction=\"Vic\",\"Non-energy efficient\",\"\")","v":{"$error":"#REF!"}},"Connection services","Metering services","Ancillary network services"]
[null,null,"$0's, nominal"]
[]
[null,"8.1.1.1 - REVENUE"]
[null,"Distribution revenue",0,1698333540.8899999,1698333540.8899999,1548992701.1999998,41588807.079999998,null,27990855.5,64414693.029999994,15346484.079999998]
[null,"Cross boundary revenue",0,0,0,0,0,null,0,0,0]
[null,"Contributions",136032556.71000001,-11403.598678231239,136021153.11132178,117384197.26906013,13761772.135657577,null,1805.4823605863317,4870030.4396335175,3347.7846099571452]
[null,"Interest income",2539286.090000011,-13686.081610901281,2525600.0083891097,2434265.3598018708,29845.380044651989,null,2159.1081914877141,55986.049551693024,3344.110799406058]
[null,"Jurisdictional scheme amounts",0,180542787.69999999,180542787.69999999,180542787.69999999,0,null,0,0,0]
[null,"Profit from sale of fixed assets",1650016.4700000016,0,1650016.4700000016,1650016.4700000016,0,null,0,0,0]
[null,"TUOS revenue",0,530532636,530532636,530532636,0,null,0,0,0]
[null,"Pass through revenue (F-factor)",0,0,0,0,0,null,0,0,0]
[null,"Other Revenue ",2561043419.0699997,-2560649046.5292978,394372.54070199112,261891.82191537222,131950.79732154208,null,112.76864707366475,338.93098500836146,78.221832994805339]
[null,"Total revenue",{"$f":"SUM(C13:C21)","v":2701265278.3399997},-151265171.61958694,2550000106.7204123,2381798495.8207769,55512375.393023774,0,27994932.859199148,69341048.450170204,15353254.197242355,0]
[]
[null,"8.1.1.2 - EXPENDITURE"]
[null,"TUOS expenditure",0,456175432.04256493,456175432.04256493,456175432.04256493,0,null,0,0,0]
[null,"Avoided TUOS expenditure",0,815541.30388038722,815541.30388038722,815541.30388038722,0,null,0,0,0]
[null,"Cross boundary expenditure",0,0,0,0,0,null,0,0,0]
[null,"Depreciation ",468728366.7899518,-5246430.6771303415,463481936.11282146,414475667.52532429,11213342.586118657,null,1404719.4895613957,35450274.407307632,937932.10450949683]
[null,"Finance charges",1106236143.6399996,3010108.1430823803,1109246251.783082,1069131975.4658518,13108123.153946124,null,948282.64992344333,24589133.438025203,1468737.0753354053]
[null,"Impairment losses",0,0,0,0,0,null,0,0,0]
[null,"Jurisdictional scheme amounts",0,164570003.3843278,164570003.3843278,164570003.3843278,0,null,0,0,0]
[null,"Loss from sale of fixed assets",22815326.149969958,-3737397.359029986,19077928.790939972,1860636.4616787124,49904.556701878755,null,-4607.637317304494,17181477.241692383,-9481.8318157010854]
[null,"Maintenance expenditure",0,191220524.48999995,191220524.48999995,177297827.97999996,13922696.509999998,null,0,0,0]
[null,"Operating expenditure excluding maintenance expenditure",0,431345569.11319178,431345569.11319178,353839400.74250221,7109779.2224133834,null,34720941.640009388,24433492.050946329,11241955.457320465]
[null,"Other ",2162050687.6691489,-1197093693.2847209,964956994.38442802,930060729.06484008,11403036.161105104,null,824931.3209092269,21390612.101445664,1277685.7361279423]
[]
[null,"8.1.1.3 - PROFIT"]
[null,"Profit before tax (PBT)",{"$f":"C22-SUM(C25:C35)","v":-1058565245.9090705},-192324828.77575302,-1250890074.6848235,-1186428718.1501932,-1294506.7972613722,0,-9899334.6038870029,-53703940.789246991,436425.65576474555,0]
[null,"Income tax expenses (/ benefit)",92107341.829999804,-10298972.057637408,81808369.772362396,107273430.34927009,13418422.428283621,null,-9806342.6518563218,-31207777.73032577,2130637.3769907742]
[null,"Profit after tax",{"$f":"C38-C39","v":-1150672587.7390704},-182025856.71811563,-1332698444.457186,-1293702148.4994633,-14712929.225544993,0,-92991.952030681074,-22496163.058921222,-1694211.7212260286,{"$f":"L38-L39","v":0}]

{"sheet":"8.2 Capex","index":20,"n_rows":267,"n_cols":10,"rows_kept":267,"cut":false,"hidden":false,"merged":[[208,1,210,1],[146,1,148,1],[208,3,209,3],[148,2,148,3],[210,2,210,3],[146,4,147,4],[208,4,209,4],[146,3,147,3],[146,2,147,2],[208,2,209,2],[6,1,6,4],[41,1,41,4],[10,1,10,4],[7,1,7,4],[8,1,8,4],[14,1,14,4],[16,1,19,1],[16,2,16,9],[17,2,18,2],[17,3,18,3],[17,4,18,4],[17,5,18,5],[17,6,17,9],[19,2,19,3],[19,5,19,9],[83,5,84,5],[43,2,43,5],[44,2,44,5],[55,2,55,5],[56,2,56,5],[50,2,50,5],[51,2,51,5],[49,2,49,5],[83,4,84,4],[85,2,85,3],[45,2,45,5],[46,2,46,5],[47,2,47,5],[65,2,65,3],[57,2,57,5],[83,3,84,3],[63,4,64,4],[81,1,81,2],[58,2,58,5],[63,3,64,3],[63,5,64,5],[83,1,85,1],[83,2,84,2],[65,5,65,9],[48,2,48,5],[62,1,65,1],[63,2,64,2],[52,2,52,5],[53,2,53,5],[54,2,54,5],[62,2,62,9],[63,6,63,9]]}
[]
[null,{"$f":"dms_TradingName","v":"Ausgrid"}]
[null,{"$f":"CONCATENATE(\"Annual Reporting RIN Response \",CRY)","v":"Annual Reporting RIN Response 2016-17"}]
[null,"8.2 - CAPEX"]
[]
[null,"Instructions"]
[null,"Reported expenditure must EXCLUDE capital contributions (except tables 8.2.1 and 8.2.5 which should include all capital contributions)."]
[null,{"$f":"CONCATENATE(\"Forecast expenditure is to be taken from \",dms_TradingName,\"'s \",dms_DeterminationRef,\".\")","v":{"$error":"#REF!"}}]
[null,"If allocating based on assumptions then provide method in Basis of Preparation. All adjustments must be explained in Basis of Preparation with supporting documentation attached. "]
[]
[null,"For tables 8.2.1 and 8.2.3:\nReported expenditure must INCLUDE any profit margins or management fees paid directly or indirectly to related party contractors (not including actual incurred expenses of the related party contractor) for the regulatory reporting period.\n\n'Related Party Margin Expenditure' must COMPRISE ONLY profit margins or management fees paid directly or indirectly to related party contractors (not including actual incurred expenses of the related party contractor) for the regulatory reporting period."]
[]
[null,"8.2.1 - CAPEX BY PURPOSE - STANDARD CONTROL SERVICES"]
[]
[null,"Each line item in this table must INCLUDE the capital contributions. Total capital contributions should also be identified in the last item in the table. "]
[]
[null,"Description","EXPENDITURE"]
[null,null,"CPI adjusted Forecast","Actual","Difference","Related Party Margin","Voltage level"]
[null,null,null,null,null,null,"Subtransmission","HV","LV","Other "]
[null,null,"$0's, nominal",null," (%)","$0's, nominal"]
[null,"Replacement expenditure",403545890.62726021,274347496.68000001,-0.32015787286654784,0,161058746.93079007,60938598.055892594,49823110.253706411,2527041.4296109709]
[null,"Connections",38629353.194504365,8065736.5100000007,-0.79120187518056917,0,727075.35731322307,5867215.7474058867,1433632.1484905852,37813.256790303953]
[null,"Augmentation Expenditure",61161646.084150858,15698547.590000002,-0.74332692798358069,0,8617673.7691792268,3843757.7979661282,3221710.5488249916,15405.484029653255]
[null,"Non-network",71784613.626863956,38172285.310000002,-0.46823861853712356,0,0,0,0,38172285.310000002]
[null,"capitalised network overheads",140084146.0087845,118188122.04000001,-0.1563062244560596,0,49540574.32111986,41311516.616232097,26711554.529786371,624476.57286165818]
[null,"capitalised corporate overheads",6318170.5424182229,3609283.56,-0.42874546741522757,0,0,0,0,3609283.56]
[null,"Metering",0,0,1,0,0,0,0,0]
[null,"Public Lighting",0,0,1,0,0,0,0,0]
[null,"Capital Contributions",99305484.137135431,115937401.87,0.16748236894849439,0,15807218.48,60800754.740000002,39284003.649999999,45425]
[]
[]
[]
[]
[]
[]
[null,"Capital contributions included in the above"]
[null,"Total",{"$f":"SUM(C21:C35)","v":820829304.22111762},574018873.55999994,{"$f":"IF(C37=0,1,(D37-C37)/C37*1)","v":-0.30068423409336648},null,{"$f":"SUM(G21:G35)","v":235751288.85840234},{"$f":"SUM(H21:H35)","v":172761842.9574967},120474011.13080835,45031730.61329259]
[]
[]
[null,"8.2.2 - CAPEX BY PURPOSE - MATERIAL DIFFERENCE EXPLANATION"]
[]
[null,"Where the difference between forecast and actual expenditure shown in table 8.2.1 is a Material Difference please explain the main factors driving the difference."]
[]
[null,"Description","Reason for material difference"]
[null,"Replacement expenditure","Reduction in reactive requirements (i.e. conditional & functional breakdowns);\nChange in strategic options for some key major projects (i.e. CBD);\nDelays in contract procurement on ADMS project."]
[null,"Connections","Faster transition to new connection policy (will result in increased Capital Contributions refer to item below).\nMajor customer connection network projects are dependant on customer programs which have been slipping."]
[null,"Augmentation Expenditure","○ Impact of risk based assessment criteria and improved program governance of HV & LV Augmentation Programs;\n○ CBD projects delayed due to impact of light rail project and street closures restricting access to pit and duct network."]
[null,"Non-network","Building works and refurbishment deferrals;\nReduction in minor assets and mobile plant requirements."]
[null,"capitalised network overheads","More labour assessed to Opex as a result of a lower overall Capex expenditure."]
[null,"capitalised corporate overheads","More labour assessed to Opex as a result of a lower overall Capex expenditure."]
[null,"Metering","NA"]
[null,"Public Lighting","NA"]
[null,"Capital Contributions","○ Faster transition to new connection policy. Delay impact as Capital Contributions are recognised post asset commissioning;\n○ Delays in major connections."]
[]
[]
[]
[]
[]
[]
[]
[]
[null,"8.2.3 - CAPEX OTHER"]
[null,null,"EXPENDITURE"]
[null,null,"CPI adjusted Forecast","Actual","Difference","Related Party Margin","Voltage level"]
[null,null,null,null,null,null,"Subtransmission","HV","LV","Other "]
[null,null,"$0's, nominal",null," (%)","$0's, nominal"]
[null,"Public lighting"]
[null,{"$f":"IF(dms_Jurisdiction=\"Vic\",\"Energy Efficient\", \"Total\")","v":{"$error":"#REF!"}},null,{"$f":"SUM(G68:J68)","v":9817376.5099999998},{"$f":"IF(C68=0,1,((D68-C68)/C68)*1)","v":1},null,null,null,9817376.5099999998]
[null,{"$f":"IF(dms_Jurisdiction=\"Vic\",\"Non-energy efficient\", \"\")","v":{"$error":"#REF!"}},null,{"$f":"SUM(G69:J69)","v":0},{"$f":"IF(C69=0,1,((D69-C69)/C69)*1)","v":1}]
[null,"Alternative Control Services"]
[null,"Connection services",null,{"$f":"SUM(G71:J71)","v":8981143.4000000004},{"$f":"IF(C71=0,1,((D71-C71)/C71)*1)","v":1},null,null,null,8976922.7400000002,4220.66]
[null,"Metering services",null,14269325.300000001,{"$f":"IF(C72=0,1,((D72-C72)/C72)*1)","v":1},null,null,null,null,14269325.300000001]
[null,"Ancillary network services",null,844965.03,{"$f":"IF(C73=0,1,((D73-C73)/C73)*1)","v":1},null,null,null,null,844965.03]
[null,"Negotiated Services"]
[null,"Negotiated services",null,{"$f":"SUM(G75:J75)","v":0},{"$f":"IF(C75=0,1,((D75-C75)/C75)*1)","v":1}]
[null,"Total",{"$f":"SUM(C68:C69,C71:C73,C75)","v":0},{"$f":"SUM(D68:D69,D71:D73,D75)","v":33912810.240000002},{"$f":"IF(C76=0,1,((C76-#REF!)/#REF!)*1)","v":1},null,{"$f":"SUM(G68:G69,G71:G73,G75)","v":0},{"$f":"SUM(H68:H69,H71:H73,H75)","v":0},{"$f":"SUM(I68:I69,I71:I73,I75)","v":18794299.25},{"$f":"SUM(J68:J69,J71:J73,J75)","v":15118510.99}]
[]
[]
[]
[null,"8.2.4 - CAPEX BY ASSET CLASS"]
[]
[null,{"$f":"CONCATENATE(dms_TradingName, \" to enter in Table 8.2.4 each Asset Class specified in its current determination as listed in the AER's final decision in its Roll Forward Model and Post-tax Revenue Model and enter information against that Asset Class.\")","v":"Ausgrid to enter in Table 8.2.4 each Asset Class specified in its current determination as listed in the AER's final decision in its Roll Forward Model and Post-tax Revenue Model and enter information against that Asset Class."}]
[]
[null,"Asset class","CPI adjusted Forecast","Actual ","Difference","Movements in provisions \nallocated to \nas-incurred capex"]
[]
[null,null,"$0's, nominal",null," (%)","$0's, nominal"]
[null,null,null,null,{"$f":"IF(C87=0,1,((D87-C87)/C87)*1)","v":1}]
[null,"Dx Sub-transmission lines and cables ",79166493.057751253,36112239.330000006,{"$f":"IF(C88=0,1,((D88-C88)/C88)*1)","v":-0.5438443976082602},13669113.07]
[null,"Dx Cable tunnel (dx)",90157.948016503287,1944686.65,20.569774964754384]
[null,"Dx Distribution lines and cables",66692181.079820335,97160691.5,0.45685281133201389]
[null,"Dx Substations",190811002.71669802,105904890.48,-0.44497492821606466,5413004.5800000001]
[null,"Dx Transformers",42456079.685296483,8475882.9299999997,-0.80036114985587348]
[null,"Dx Ancillary substation equipment (dx)",26043560.954785809,7732357.1900000004,-0.70309908067394711]
[null,"Dx Low voltage lines and cables",111893092.96442354,72137428.370000005,-0.35530043491660263]
[null,"Dx Customer metering and load control",0,5.31,1]
[null,"Dx Customer metering (digital)",0,0,1]
[null,"Dx Total communications",0,492748.64,1]
[null,"Dx Communications (digital) - dx",0,0,1]
[null,"Dx Land and easements",5090204.5221766755,926981.38,-0.81788916811468237]
[null,"Dx System IT (dx)",16670104.370883215,3954374.83,-0.76278643840365534]
[null,"Dx Emergency spares (major plant, excludes inventory)",0,0,1]
[null,null,null,null,1]
[null,null,null,null,1]
[null,"Dx IT systems",22252607.138901435,18902511.18,-0.15054847002825497]
[null,"Dx Furniture, fittings, plant and equipment",7262052.3232428087,1290474.68,-0.82229890083968038]
[null,"Dx Motor vehicles",6248187.3321232386,1924929.14,-0.69192198670108107]
[null,"Dx Buildings",23775154.908626791,10782692.869999999,-0.54647223492590113]
[null,"Dx Land (non-system)",0,0,1]
[null,"Dx Other non-system assets",0,821084.39,1]
[null,"Dx Equity raising costs",0,0,1]
[null,null,null,null,1]
[null,null,null,null,1]
[null,null,null,null,1]
[null,null,null,null,1]
[null,"Tx Transmission and zone land easements",3188304.4400770967,18261615,4.7276886016438304]
[null,"Tx Transmission building 132/66kV",18184445.102938741,1041585.4699999999,-0.94272107484700363]
[null,"Tx Zone buildings 132/66kV",0,2687632.9800000004,{"$f":"IF(C117=0,1,((D117-C117)/C117)*1)","v":1}]
[null,"Tx Transmission transformers 132/66kV",5059371.0093522323,2005938.48,-0.60352018535663254]
[null,"Tx Zone transformers 132/66kV",6048485.6212141206,1027872.26,-0.83006122120966974]
[null,"Tx Transmission sub-station equipment 132/66kv",7335738.8818097534,33380805.059999999,3.5504352864540394]
[null,"Tx Zone sub-station equipment 132/66kV",16320510.337411458,4500733.2699999996,-0.72422839868659117]
[null,"Tx Transmission and zone emergency spares",0,0,1]
[null,"Tx Ancillary substation equipment",7400543.6718274029,4098402.44,-0.44620251947138517]
[null,"Tx 132 kV tower lines",1996455.1509221096,2299847.14,0.15196534163953637]
[null,"Tx 132kV concrete and steel pole lines",174597.4554796353,71656.240000000005,-0.58959172799423842]
[null,"Tx 132 kV wood pole lines",2118477.7618137295,2677888.7000000002,0.26406269080083822]
[null,"Tx 132kV feeder underground",39595169.86320363,32215432.530000001,-0.18637973668757327]
[null,"Tx Cable tunnel",23474.35585471422,0,-1]
[null,"Tx Network control & communication system",0,0,1]
[null,"Tx Communications (digital)",0,20700.919999999998,1]
[null,"Tx System IT",5542554.1552496087,0,-1]
[null,null,null,null,1]
[null,null,null,null,1]
[null,"Tx IT systems",3769062.0163746881,2276279.89,{"$f":"IF(C134=0,1,((D134-C134)/C134)*1)","v":-0.3960619697657658}]
[null,"Tx Furniture, fittings, plant and equipment",1230025.0921062226,98427.43,{"$f":"IF(C135=0,1,((D135-C135)/C135)*1)","v":-0.91997933161553758}]
[null,"Tx Motor vehicles",1058299.6178772245,144992.6,{"$f":"IF(C136=0,1,((D136-C136)/C136)*1)","v":-0.86299475351712651}]
[null,"Tx Buildings",4026965.905041297,822057.07,-0.7958619244898798]
[null,"Tx Land (non-system)",0,0,{"$f":"IF(C138=0,1,((D138-C138)/C138)*1)","v":1}]
[null,"Tx Other non-system assets",0,131725.70000000001,{"$f":"IF(C139=0,1,((D139-C139)/C139)*1)","v":1}]
[null,"Tx Equity raising costs",0,0,1]
[null,null,null,null,1]
[null,null,null,null,1]
[null,"Total",{"$f":"C112+C142","v":0},{"$f":"D112+D142","v":0},1]
[]
[]
[null,"8.2.5 - CAPITAL CONTRIBUTIONS BY ASSET CLASS"]
[null,"Asset class","CPI Adjusted Forecast","Actual","Difference"]
[]
[null,null,"$0's, nominal",null," (%)"]
[null,null,null,null,{"$f":"IF(C150=0,1,((D150-C150)/C150)*1)","v":1}]
[null,"Dx Sub-transmission lines and cables ",5460875.7500827555,15807218.48,{"$f":"IF(C151=0,1,((D151-C151)/C151)*1)","v":1.8946306789273595}]
[null,"Dx Cable tunnel (dx)",0,0,1]
[null,"Dx Distribution lines and cables",27235212.697623353,26544732.200000003,-2.5352491470852525E-2]
[null,"Dx Substations",10289040.81430497,26109249.389999997,1.5375785616186897]
[null,"Dx Transformers",0,8146773.1499999994,1]
[null,"Dx Ancillary substation equipment (dx)",0,0,1]
[null,"Dx Low voltage lines and cables",56320354.875124343,39284003.649999999,-0.30249012569075601]
[null,"Dx Customer metering and load control",0,0,1]
[null,"Dx Customer metering (digital)",0,0,1]
[null,"Dx Total communications",0,0,1]
[null,"Dx Communications (digital) - dx",0,45425,1]
[null,"Dx Land and easements",0,0,1]
[null,"Dx System IT (dx)",0,0,1]
[null,"Dx Emergency spares / Other (major plant, excludes inventory)",0,0,1]
[null,null,null,null,1]
[null,null,null,null,1]
[null,"Dx IT systems",null,0,1]
[null,"Dx Furniture, fittings, plant and equipment",null,0,1]
[null,"Dx Motor vehicles",null,0,1]
[null,"Dx Buildings",null,0,1]
[null,"Dx Land (non-system)",null,0,1]
[null,"Dx Other non-system assets",null,0,1]
[null,"Dx Equity raising costs",null,0,1]
[null,"Dx Sub-total ",0,0,1]
[null,null,null,null,1]
[null,null,null,null,1]
[null,null,null,null,1]
[null,"Tx Transmission and zone land easements",null,0,1]
[null,"Tx Transmission building 132/66kV",null,0,{"$f":"IF(C179=0,1,((D179-C179)/C179)*1)","v":1}]
[null,"Tx Zone buildings 132/66kV",null,0,1]
[null,"Tx Transmission transformers 132/66kV",null,0,1]
[null,"Tx Transmission sub-station equipment 132/66kv",null,0,1]
[null,"Tx Zone sub-station equipment 132/66kV",null,0,1]
[null,"Tx Transmission and zone emergency spares",null,0,1]
[null,"Tx Ancillary substation equipment",null,0,1]
[null,"Tx 132 kV tower lines",null,0,1]
[null,"Tx 132kV concrete and steel pole lines",null,0,1]
[null,"Tx 132 kV wood pole lines",null,0,1]
[null,"Tx 132kV feeder underground",null,0,{"$f":"IF(C189=0,1,((D189-C189)/C189)*1)","v":1}]
[null,"Tx Cable tunnel",null,0,1]
[null,"Tx Network control & communication system",null,0,1]
[null,"Tx Communications (digital)",null,0,1]
[null,"Tx System IT/ Other",null,0,1]
[null,null,0,0,1]
[null,null,0,0,1]
[null,"Tx IT systems",null,0,1]
[null,"Tx Furniture, fittings, plant and equipment",null,0,1]
[null,"Tx Motor vehicles",null,0,1]
[null,"Tx Buildings",null,0,{"$f":"IF(C199=0,1,((D199-C199)/C199)*1)","v":1}]
[null,"Tx Land (non-system)",null,0,1]
[null,"Tx Other non-system assets",null,0,1]
[null,"Tx Equity raising costs",null,0,1]
[null,null,0,0,1]
[null,null,0,0,1]
[null,"Total",{"$f":"SUM(dms_080205_01_Values)","v":99305484.137135416},{"$f":"SUM(dms_080205_02_Values)","v":115937401.87},0.16748236894849458]
[]
[]
[null,"8.2.6 - DISPOSALS BY ASSET CLASS"]
[null,"Asset class","CPI Adjusted Forecast","Actual","Difference"]
[]
[null,null,"$0's, nominal",null," (%)"]
[null,null,null,null,{"$f":"IF(C212=0,1,((D212-C212)/C212)*1)","v":1}]
[null,"Dx Sub-transmission lines and cables ",0,0,{"$f":"IF(C213=0,1,((D213-C213)/C213)*1)","v":1}]
[null,"Dx Cable tunnel (dx)",0,0,1]
[null,"Dx Distribution lines and cables",0,0,1]
[null,"Dx Substations",0,0,1]
[null,"Dx Transformers",0,0,1]
[null,"Dx Ancillary substation equipment (dx)",0,0,1]
[null,"Dx Low voltage lines and cables",0,0,1]
[null,"Dx Customer metering and load control",0,0,1]
[null,"Dx Customer metering (digital)",0,0,1]
[null,"Dx Total communications",0,0,1]
[null,"Dx Communications (digital) - dx",0,0,1]
[null,"Dx Land and easements",16058686.678098934,5588231.7100000009,-0.6520119096898932]
[null,"Dx System IT (dx)",0,0,1]
[null,"Dx Emergency spares / Other (major plant, excludes inventory)",0,0,1]
[null,null,null,null,1]
[null,null,null,null,1]
[null,"Dx IT systems",0,0,1]
[null,"Dx Furniture, fittings, plant and equipment",0,0,1]
[null,"Dx Motor vehicles",2771713.4372300552,3121454.1635879786,0.12618213761211941]
[null,"Dx Buildings",0,0,1]
[null,"Dx Land (non-system)",0,10732702.892663924,1]
[null,"Dx Other non-system assets",0,0,1]
[null,"Dx Equity raising costs",0,0,1]
[null,null,null,null,1]
[null,null,null,null,1]
[null,null,null,null,1]
[null,null,null,null,1]
[null,"Tx Transmission and zone land easements",50245235.786774047,2899909.09,-0.94228489438667673]
[null,"Tx Transmission building 132/66kV",0,0,1]
[null,"Tx Zone buildings 132/66kV",0,0,{"$f":"IF(C242=0,1,((D242-C242)/C242)*1)","v":1}]
[null,"Tx Transmission transformers 132/66kV",0,0,1]
[null,"Tx Transmission sub-station equipment 132/66kv",0,0,1]
[null,"Tx Zone sub-station equipment 132/66kV",0,0,1]
[null,"Tx Transmission and zone emergency spares",0,0,1]
[null,"Tx Ancillary substation equipment",0,0,1]
[null,"Tx 132 kV tower lines",0,0,1]
[null,"Tx 132kV concrete and steel pole lines",0,0,1]
[null,"Tx 132 kV wood pole lines",0,0,1]
[null,"Tx 132kV feeder underground",0,0,1]
[null,"Tx Cable tunnel",0,0,1]
[null,"Tx Network control & communication system",0,0,1]
[null,"Tx Communications (digital)",0,0,1]
[null,"Tx System IT/ Other",0,0,1]
[null,null,null,null,1]
[null,null,null,null,1]
[null,"Tx IT systems",0,0,1]
[null,"Tx Furniture, fittings, plant and equipment",0,0,1]
[null,"Tx Motor vehicles",475505.52639483154,518725.6190219089,9.0892934420261529E-2]
[null,"Tx Buildings",0,0,{"$f":"IF(C261=0,1,((D261-C261)/C261)*1)","v":1}]
[null,"Tx Land (non-system)",0,1783568.7022794276,{"$f":"IF(C262=0,1,((D262-C262)/C262)*1)","v":1}]
[null,"Tx Other non-system assets",0,0,1]
[null,"Tx Equity raising costs",0,0,{"$f":"IF(C264=0,1,((D264-C264)/C264)*1)","v":1}]
[null,null,null,null,1]
[null,null,null,null,1]
[null,"Total",{"$f":"C237+C266","v":0},{"$f":"D237+D266","v":0},1]

{"sheet":"8.4 Opex","index":21,"n_rows":86,"n_cols":14,"rows_kept":86,"cut":false,"hidden":false,"merged":[[82,2,82,7],[83,2,83,7],[6,1,6,4],[14,1,14,5],[16,2,18,2],[16,3,18,3],[16,4,18,4],[12,1,12,5],[7,1,7,4],[13,1,13,5],[19,2,19,6],[70,2,70,7],[71,2,71,7],[72,2,72,7],[68,1,68,4],[16,1,19,1],[16,13,18,13],[43,13,45,13],[19,8,19,13],[17,8,17,9],[44,8,44,9],[44,10,44,12],[17,10,17,12],[16,8,16,12],[43,8,43,12],[43,5,43,7],[17,5,18,5],[17,6,18,6],[17,7,18,7],[16,5,16,7],[41,1,41,4],[43,1,46,1],[43,2,45,2],[43,3,45,3],[43,4,45,4],[46,8,46,13],[44,6,45,6],[44,7,45,7],[84,2,84,7],[85,2,85,7],[46,2,46,4],[44,5,45,5],[73,2,73,7],[74,2,74,7],[75,2,75,7],[76,2,76,7],[77,2,77,7],[78,2,78,7],[79,2,79,7],[80,2,80,7],[81,2,81,7]]}
[]
[null,{"$f":"dms_TradingName","v":"Ausgrid"}]
[null,{"$f":"CONCATENATE(\"Annual Reporting RIN Response \",CRY)","v":"Annual Reporting RIN Response 2016-17"}]
[null,"8.4 OPEX"]
[]
[null,"Instructions"]
[]
[null,"If allocating based on assumptions then provide method in Basis of Preparation.  \n\nAll adjustments must be explained in Basis of Preparation with supporting documentation attached. "]
[]
[null,"8.4.1 - OPERATING & MAINTENANCE EXPENDITURE - BY PURPOSE"]
[]
[]
[null,{"$f":"CONCATENATE(dms_TradingName,\" is to list the operating expenditure categories identified in \", dms_TradingName,\"'s regulatory proposal at table 3.2.1.1 current opex categories and cost allocations.\")","v":"Ausgrid is to list the operating expenditure categories identified in Ausgrid's regulatory proposal at table 3.2.1.1 current opex categories and cost allocations."}]
[null,{"$f":"CONCATENATE(dms_TradingName, \" must specify any expenditure category where the expense is more than 5 per cent of the total standard control services operating expenditure.\")","v":"Ausgrid must specify any expenditure category where the expense is more than 5 per cent of the total standard control services operating expenditure."}]
[null,"Reported operating expenditure must INCLUDE any profit margins or management fees paid directly or indirectly to related party contractors (not including actual incurred expenditure of the related party contractor) for the regulatory reporting period.  "]
[]
[null,"Opex category","Audited Statutory Accounts","Adjustments","Distribution business","Standard Control Services",null,null,"Alternative Control Services",null,null,null,null,"Negotiated Services"]
[null,null,null,null,null,"CPI Adjusted Forecast","Actual","Difference","Public Lighting",null,"Other"]
[null,null,null,null,null,null,null,null,{"$f":"IF(dms_Jurisdiction=\"Vic\",\"Energy efficient\",\"\")","v":{"$error":"#REF!"}},{"$f":"IF(dms_Jurisdiction=\"Vic\",\"Non-energy efficient\",\"\")","v":{"$error":"#REF!"}},"Connection services","Metering services","Ancillary network services"]
[null,null,"$0's, nominal",null,null,null,null,"%","$0's, nominal"]
[null,"Contact Centre",null,6473510.1399999987,6473510.1399999987,null,6354397.5534239989,1,119112.586576,null,0,0,0]
[null,"Customer Operations",null,32148065.729999982,32148065.729999982,null,9187656.9699999839,1,0,null,22077001.599999998,0,883407.16]
[null,"Data Operations",null,10155567.779999973,10155567.779999973,null,7908285.7629797524,1,0,null,86.13,0,2247195.8870202205]
[null,"Engineering, Planning & Project Management",null,43676313.678859197,43676313.678859197,null,37969258.626788646,1,1580067.5225011092,null,4119850.8685352881,6998.8218577219268,137.8391764291259]
[null,"Finance Function",null,-17674861.836929183,-17674861.836929183,null,-14724061.795016907,1,-582801.20530741347,null,-1945524.6815454883,-339623.08026707219,-82851.074792302068]
[null,"Information Communication & Technology",null,57701364.331346221,57701364.331346221,null,51708512.212945789,1,332860.60095014662,null,161055.46070981998,4987961.2370637581,510974.81967671332]
[null,"Insurance",null,5283328.1709236754,5283328.1709236754,null,5007585.4694147483,1,67991.585058646902,null,48627.824152388581,132440.68722433734,26682.605073554168]
[null,"Management",null,150845197.71673906,150845197.71673906,null,133968108.24718469,1,3794898.9410353177,null,8528725.5084647872,3718144.8782303385,835320.14182391018]
[null,"Metering",null,21081597.209999941,21081597.209999941,null,1470767.7998919978,1,0,null,0,13266342.892970163,6344486.5171377826]
[null,"System Control",null,21062186.559999973,21062186.559999973,null,21062186.559999973,1,0,null,0,0,0]
[null,"Network maintenance costs",null,191220524.48999992,191220524.48999992,null,177297827.97999993,1,13922696.509999998,null,0,0,0]
[null,"Demand Management",null,799271.35999999987,799271.35999999987,null,799271.35999999987,1,0,null,0,0,0]
[null,"Operational Technology ",null,11638382.358675309,11638382.358675309,null,11199614.267346308,1,72980.776397335343,null,28975.783269960702,298026.94195640099,38784.589705304039]
[null,"Other",null,23336801.240123868,23336801.240123868,null,21278330.855552308,1,983894.91222459893,null,652769.49484934169,337041.06332740979,84764.914170210162]
[null,"Property Management",null,51482566.262830973,51482566.262830973,null,48971755.637311004,1,370627.43378977093,null,175405.96827970096,1689178.8223421087,275598.40110839217]
[null,"Training & Development",null,13336278.410622459,13336278.410622459,null,11677731.214679599,1,370146.06918786414,null,873967.68329358206,336979.78624115977,77453.657220251655]
[null,"Total",{"$f":"SUM(C21:C36)","v":0},{"$f":"SUM(D21:D36)","v":622566093.60319126},{"$f":"SUM(E21:E36)","v":622566093.60319126},{"$f":"SUM(F21:F36)","v":0},{"$f":"SUM(G21:G36)","v":531137228.72250181},{"$f":"IF(F37=0,1,((G37-F37)/F37)*1)","v":1},{"$f":"SUM(I21:I36)","v":21032475.732413374},0,34720941.640009381,24433492.050946325,11241955.457320463,0]
[]
[]
[null,"8.4.2 - OPERATING & MAINTENANCE EXPENDITURE - BY PURPOSE - MARGINS ONLY"]
[]
[null,"\"Related party margin expenditure' must COMPRISE ONLY profit margins or management fees paid directly or indirectly to related party contractors (for expenditure that is not an actual incurred expenditure of the related party contractor) for the regulatory reporting period."]
[]
[null,"Opex category","Audited Statutory Accounts","Adjustments","Distribution business","Standard Control Services",null,null,"Alternative Control Services",null,null,null,null,"Negotiated Services"]
[null,null,null,null,null,"CPI Adjusted Forecast","Actual","Difference","Public Lighting",null,"Other"]
[null,null,null,null,null,null,null,null,{"$f":"IF(dms_Jurisdiction=\"Vic\",\"Energy efficient\",\"\")","v":{"$error":"#REF!"}},{"$f":"IF(dms_Jurisdiction=\"Vic\",\"Non-energy efficient\",\"\")","v":{"$error":"#REF!"}},"Connection services","Metering services","Ancillary network services"]
[null,null,"$0's, nominal",null,null,null,"$0's, nominal","per cent","$0's, nominal"]
[null,{"$f":"IF(ISBLANK(B21),\"\",B21)","v":"Contact Centre"},null,null,null,null,null,{"$f":"IF(F48=0,1,((G48-F48)/F48)*1)","v":1}]
[null,"Customer Operations",null,null,null,null,null,1]
[null,"Data Operations",null,null,null,null,null,1]
[null,"Engineering, Planning & Project Management",null,null,null,null,null,1]
[null,"Finance Function",null,null,null,null,null,1]
[null,"Information Communication & Technology",null,null,null,null,null,1]
[null,"Insurance",null,null,null,null,null,1]
[null,"Management",null,null,null,null,null,1]
[null,"Metering",null,null,null,null,null,1]
[null,"System Control",null,null,null,null,null,1]
[null,"Network maintenance costs",null,null,null,null,null,1]
[null,"Demand Management",null,null,null,null,null,1]
[null,"Operational Technology ",null,null,null,null,null,1]
[null,"Other",null,null,null,null,null,1]
[null,"Property Management",null,null,null,null,null,1]
[null,"Training & Development",null,null,null,null,null,{"$f":"IF(F63=0,1,((G63-F63)/F63)*1)","v":1}]
[null,"Total",{"$f":"SUM(C48:C63)","v":0},{"$f":"SUM(D48:D63)","v":0},{"$f":"SUM(E48:E63)","v":0},{"$f":"SUM(F48:F63)","v":0},{"$f":"SUM(G48:G63)","v":0},1,{"$f":"SUM(I48:I63)","v":0},0,0,0,0,0]
[]
[]
[null,"8.4.3 - OPERATING & MAINTENANCE EXPENDITURE - EXPLANATION OF MATERIAL DIFFERENCE"]
[]
[null,"Where the difference between forecast and actual expenditure shown in table 8.4.1, column I is a Material Difference please explain the main factors driving the difference."]
[]
[null,"Category","Explanation"]
[null,"Contact Centre","Ausgrid would use the operating expenditure forecast from the April 2015 determination as a reference point for comparison.  On 24 May 2017, the Full Federal Court partly upheld the AER's appeal in relation to the Australian Competition Tribunal's decision to set aside the AER's April 2015 Revenue Determination. A consequence of the Tribunal's decision is that there is no distribution determination for the 2014-19 period and as such it is not strictly correct to compare Ausgrid's actual expenditure outturn with the opex determined in the April 2015 decision. Operating expenditure is in line or below management expectations for the year. The AER has not provided Ausgrid with the split of the \"CPI Adjusted Forecast\" between opex categories. As a  result Ausgrid is unable to determine in which categories were overspent. "]
[null,"Customer Operations","Ausgrid would use the operating expenditure forecast from the April 2015 determination as a reference point for comparison.  On 24 May 2017, the Full Federal Court partly upheld the AER's appeal in relation to the Australian Competition Tribunal's decision to set aside the AER's April 2015 Revenue Determination. A consequence of the Tribunal's decision is that there is no distribution determination for the 2014-19 period and as such it is not strictly correct to compare Ausgrid's actual expenditure outturn with the opex determined in the April 2015 decision. Operating expenditure is in line or below management expectations for the year. The AER has not provided Ausgrid with the split of the \"CPI Adjusted Forecast\" between opex categories. As a  result Ausgrid is unable to determine in which categories were overspent. "]
[null,"Data Operations","Ausgrid would use the operating expenditure forecast from the April 2015 determination as a reference point for comparison.  On 24 May 2017, the Full Federal Court partly upheld the AER's appeal in relation to the Australian Competition Tribunal's decision to set aside the AER's April 2015 Revenue Determination. A consequence of the Tribunal's decision is that there is no distribution determination for the 2014-19 period and as such it is not strictly correct to compare Ausgrid's actual expenditure outturn with the opex determined in the April 2015 decision. Operating expenditure is in line or below management expectations for the year. The AER has not provided Ausgrid with the split of the \"CPI Adjusted Forecast\" between opex categories. As a  result Ausgrid is unable to determine in which categories were overspent. "]
[null,"Engineering, Planning & Project Management","Ausgrid would use the operating expenditure forecast from the April 2015 determination as a reference point for comparison.  On 24 May 2017, the Full Federal Court partly upheld the AER's appeal in relation to the Australian Competition Tribunal's decision to set aside the AER's April 2015 Revenue Determination. A consequence of the Tribunal's decision is that there is no distribution determination for the 2014-19 period and as such it is not strictly correct to compare Ausgrid's actual expenditure outturn with the opex determined in the April 2015 decision. Operating expenditure is in line or below management expectations for the year. The AER has not provided Ausgrid with the split of the \"CPI Adjusted Forecast\" between opex categories. As a  result Ausgrid is unable to determine in which categories were overspent. "]
[null,"Finance Function","Ausgrid would use the operating expenditure forecast from the April 2015 determination as a reference point for comparison.  On 24 May 2017, the Full Federal Court partly upheld the AER's appeal in relation to the Australian Competition Tribunal's decision to set aside the AER's April 2015 Revenue Determination. A consequence of the Tribunal's decision is that there is no distribution determination for the 2014-19 period and as such it is not strictly correct to compare Ausgrid's actual expenditure outturn with the opex determined in the April 2015 decision. Operating expenditure is in line or below management expectations for the year. The AER has not provided Ausgrid with the split of the \"CPI Adjusted Forecast\" between opex categories. As a  result Ausgrid is unable to determine in which categories were overspent. "]
[null,"Information Communication & Technology","Ausgrid would use the operating expenditure forecast from the April 2015 determination as a reference point for comparison.  On 24 May 2017, the Full Federal Court partly upheld the AER's appeal in relation to the Australian Competition Tribunal's decision to set aside the AER's April 2015 Revenue Determination. A consequence of the Tribunal's decision is that there is no distribution determination for the 2014-19 period and as such it is not strictly correct to compare Ausgrid's actual expenditure outturn with the opex determined in the April 2015 decision. Operating expenditure is in line or below management expectations for the year. The AER has not provided Ausgrid with the split of the \"CPI Adjusted Forecast\" between opex categories. As a  result Ausgrid is unable to determine in which categories were overspent. "]
[null,"Management","Ausgrid would use the operating expenditure forecast from the April 2015 determination as a reference point for comparison.  On 24 May 2017, the Full Federal Court partly upheld the AER's appeal in relation to the Australian Competition Tribunal's decision to set aside the AER's April 2015 Revenue Determination. A consequence of the Tribunal's decision is that there is no distribution determination for the 2014-19 period and as such it is not strictly correct to compare Ausgrid's actual expenditure outturn with the opex determined in the April 2015 decision. Expenditure in this category is above management's expectations for the year. The overspend relates to the transformation program, redundancy expenditure and the career transition program. "]
[null,"Metering","Ausgrid would use the operating expenditure forecast from the April 2015 determination as a reference point for comparison.  On 24 May 2017, the Full Federal Court partly upheld the AER's appeal in relation to the Australian Competition Tribunal's decision to set aside the AER's April 2015 Revenue Determination. A consequence of the Tribunal's decision is that there is no distribution determination for the 2014-19 period and as such it is not strictly correct to compare Ausgrid's actual expenditure outturn with the opex determined in the April 2015 decision. Operating expenditure is in line or below management expectations for the year. The AER has not provided Ausgrid with the split of the \"CPI Adjusted Forecast\" between opex categories. As a  result Ausgrid is unable to determine in which categories were overspent. "]
[null,"System Control","Ausgrid would use the operating expenditure forecast from the April 2015 determination as a reference point for comparison.  On 24 May 2017, the Full Federal Court partly upheld the AER's appeal in relation to the Australian Competition Tribunal's decision to set aside the AER's April 2015 Revenue Determination. A consequence of the Tribunal's decision is that there is no distribution determination for the 2014-19 period and as such it is not strictly correct to compare Ausgrid's actual expenditure outturn with the opex determined in the April 2015 decision. Operating expenditure is in line or below management expectations for the year. The AER has not provided Ausgrid with the split of the \"CPI Adjusted Forecast\" between opex categories. As a  result Ausgrid is unable to determine in which categories were overspent. "]
[null,"Demand Management","Ausgrid would use the operating expenditure forecast from the April 2015 determination as a reference point for comparison.  On 24 May 2017, the Full Federal Court partly upheld the AER's appeal in relation to the Australian Competition Tribunal's decision to set aside the AER's April 2015 Revenue Determination. A consequence of the Tribunal's decision is that there is no distribution determination for the 2014-19 period and as such it is not strictly correct to compare Ausgrid's actual expenditure outturn with the opex determined in the April 2015 decision. Operating expenditure is in line or below management expectations for the year. The AER has not provided Ausgrid with the split of the \"CPI Adjusted Forecast\" between opex categories. As a  result Ausgrid is unable to determine in which categories were overspent. "]
[null,"Operational Technology ","Ausgrid would use the operating expenditure forecast from the April 2015 determination as a reference point for comparison.  On 24 May 2017, the Full Federal Court partly upheld the AER's appeal in relation to the Australian Competition Tribunal's decision to set aside the AER's April 2015 Revenue Determination. A consequence of the Tribunal's decision is that there is no distribution determination for the 2014-19 period and as such it is not strictly correct to compare Ausgrid's actual expenditure outturn with the opex determined in the April 2015 decision. Operating expenditure is in line or below management expectations for the year. The AER has not provided Ausgrid with the split of the \"CPI Adjusted Forecast\" between opex categories. As a  result Ausgrid is unable to determine in which categories were overspent. "]
[null,"Other","Ausgrid would use the operating expenditure forecast from the April 2015 determination as a reference point for comparison.  On 24 May 2017, the Full Federal Court partly upheld the AER's appeal in relation to the Australian Competition Tribunal's decision to set aside the AER's April 2015 Revenue Determination. A consequence of the Tribunal's decision is that there is no distribution determination for the 2014-19 period and as such it is not strictly correct to compare Ausgrid's actual expenditure outturn with the opex determined in the April 2015 decision. Operating expenditure is in line or below management expectations for the year. The AER has not provided Ausgrid with the split of the \"CPI Adjusted Forecast\" between opex categories. As a  result Ausgrid is unable to determine in which categories were overspent. "]
[null,"Property Management","Ausgrid would use the operating expenditure forecast from the April 2015 determination as a reference point for comparison.  On 24 May 2017, the Full Federal Court partly upheld the AER's appeal in relation to the Australian Competition Tribunal's decision to set aside the AER's April 2015 Revenue Determination. A consequence of the Tribunal's decision is that there is no distribution determination for the 2014-19 period and as such it is not strictly correct to compare Ausgrid's actual expenditure outturn with the opex determined in the April 2015 decision. Operating expenditure is in line or below management expectations for the year. The AER has not provided Ausgrid with the split of the \"CPI Adjusted Forecast\" between opex categories. As a  result Ausgrid is unable to determine in which categories were overspent. "]
[null,"Training & Development","Ausgrid would use the operating expenditure forecast from the April 2015 determination as a reference point for comparison.  On 24 May 2017, the Full Federal Court partly upheld the AER's appeal in relation to the Australian Competition Tribunal's decision to set aside the AER's April 2015 Revenue Determination. A consequence of the Tribunal's decision is that there is no distribution determination for the 2014-19 period and as such it is not strictly correct to compare Ausgrid's actual expenditure outturn with the opex determined in the April 2015 decision. Operating expenditure is in line or below management expectations for the year. The AER has not provided Ausgrid with the split of the \"CPI Adjusted Forecast\" between opex categories. As a  result Ausgrid is unable to determine in which categories were overspent. "]
[null,"Total","Operating and maintenance expenditure is generally in line with management expectations. The AER has not provided Ausgrid with the split of the \"CPI Adjusted Forecast\" between opex categories. As a result, we are unable to determine in which categories we have overspent."]

{"sheet":"9.5 TUoS","index":22,"n_rows":60,"n_cols":6,"rows_kept":60,"cut":false,"hidden":false,"merged":[[57,1,57,4],[51,1,51,4],[19,1,19,4],[20,1,20,4],[59,1,59,4],[53,1,53,4],[48,1,48,4],[58,1,58,4],[40,1,40,4],[44,1,44,4],[45,1,45,4],[46,1,46,4],[47,1,47,4],[41,1,41,4],[42,1,42,4],[43,1,43,4],[50,1,50,4],[54,1,54,4],[52,1,52,4],[55,1,55,4],[56,1,56,4],[5,1,5,3],[21,1,21,3],[24,2,24,5],[36,1,36,4],[25,2,25,5],[24,1,27,1],[9,1,9,4],[10,1,10,4],[11,1,11,4],[12,1,12,4],[17,1,17,4],[18,1,18,4],[13,1,13,3]]}
[]
[null,{"$f":"dms_TradingName","v":"Ausgrid"}]
[null,{"$f":"CONCATENATE(\"Annual Reporting RIN Response \",CRY)","v":"Annual Reporting RIN Response 2016-17"}]
[null,"9.5 - TUoS AUDIT (t-2)"]
[]
[null,"This template collects information for annual pricing proposals from Victorian businesses only.\n"]
[]
[null,"9.5.1 - TUOS CHARGES (AEMO)"]
[null,null,null,null,null,{"$f":"CRY","v":"2016-17"}]
[]
[]
[]
[]
[null,null,null,null,"Total",{"$f":"SUM(F10:F13)","v":0}]
[]
[null,"9.5.2 - TRANSMISSION CONNECTION FEES"]
[null,null,null,null,null,{"$f":"CRY","v":"2016-17"}]
[]
[]
[]
[]
[null,null,null,null,"Total",{"$f":"SUM(F18:F21)","v":0}]
[]
[null,"9.5.3 - CROSS BOUNDARY NETWORK CHARGES"]
[null,"Distribution Business","Amount (payable)/receivable"]
[null,null,"$0's, nominal"]
[null,null,"HV crossings","Subtransmission crossings","TUoS Adjustment","Total"]
[null,null,null,null,null,{"$f":"CRY","v":"2016-17"}]
[null,null,null,null,null,{"$f":"IF((SUM(C29:E29)=0),\"\",(SUM(C29:E29)))","v":""}]
[null,null,null,null,null,{"$f":"IF((SUM(C30:E30)=0),\"\",(SUM(C30:E30)))","v":""}]
[null,null,null,null,null,""]
[null,null,null,null,null,""]
[null,null,null,null,null,""]
[null,null,null,null,null,""]
[null,null,null,null,null,""]
[null,null,null,null,null,""]
[null,"Total",null,null,null,""]
[]
[null,"9.5.4 - PAYMENTS TO EMBEDDED GENERATORS"]
[null,"9.5.4.1 - AVOIDED TRANSMISSION COSTS",null,null,null,{"$f":"CRY","v":"2016-17"}]
[]
[]
[]
[]
[]
[]
[]
[]
[null,"Total",null,null,null,{"$f":"SUM(F41:F48)","v":0}]
[null,"9.5.4.2 - AVOIDED TUoS USAGE CHARGES",null,null,null,{"$f":"CRY","v":"2016-17"}]
[]
[]
[]
[]
[]
[]
[]
[]
[null,"Total",null,null,null,{"$f":"SUM(F51:F58)","v":0}]
[null,"Total payments to embedded generators",null,null,null,{"$f":"F59+F49","v":0}]