{"text_format":"1","workbook":"xlsx","n_sheets":25,"sheets":["AER only","Contents","Instructions","Business & other details","2.11 Labour","3.6 Quality of services","3.6.8 Network-feeders - use","3.6.8 Network-feeders - DNU","3.6.9 Network-reliability","4.1 Public lighting","6.2 STPIS Reliability","6.6 STPIS Customer Service","6.7 STPIS Daily Performance","6.8 STPIS Exclusions","6.9 STPIS - GSL","7.8 Avoided TUOS Payments","7.10 Juris Scheme","7.11 DMIS-DMIA","7.12 Safety and Bushfire","7.13 TARC","8.1 Income","8.2 Capex","8.4 Opex","9.5 TUoS","Notes - 8.4.3 table"],"not_rendered":{"charts":0,"images":4,"macros":1,"external_links":3,"defined_names":526,"comments":2,"pivot_tables":0},"unopened":[],"bounds":{"document_bytes":16777216,"sheet_cells":100000,"rows_first":2000,"rows_last":500,"rows_between":2000,"halvings":0,"cell_chars":16384,"cell_head_chars":4096},"cells_cut":0,"cells_raw":0,"read":"whole","date_system":"1900"}

{"sheet":"AER only","index":0,"n_rows":74,"n_cols":23,"rows_kept":74,"cut":false,"hidden":true,"merged":[[0,1,0,9],[18,13,18,16]]}
[null,"Data in this worksheet is used for data validation and database purposes."]
[null,"Date last modified:"]
[null,"14 April 2015","merged cell C46/47"]
[null,"17 April 2015","adjusted dms_RYE to automate based on dms_Model (NB: EB & CA refer to CRCP_y5)"]
[null,"14 May 2015","adapted this cover for use in CA & EB RINs"]
[]
[null,"October 2015","added full Trading Name for worksheet headings"]
[null,"USES NAMED RANGES FLAG","yes"]
[null,"dms_Model_List ","dms_Worksheet_List ",null,"dms_RYE_Formula_Result"]
[null,"ARR","REGULATORY REPORTING STATEMENT",null,{"$f":"LEFT(CRY,2)&RIGHT(CRY,2)","v":"2015"}]
[null,"CA","CATEGORY ANALYSIS",null,{"$f":"LEFT(CRY,2)&RIGHT(CRY,2)","v":"2015"}]
[null,"CAM/Service change Backcast","REGULATORY REPORTING STATEMENT",null,{"$f":"LEFT(dms_FRCP_FinalYear_Num,2)&RIGHT(dms_FRCP_FinalYear_Num,2)","v":"2021"}]
[null,"CPI","CPI"]
[null,"EB","ECONOMIC BENCHMARKING",null,{"$f":"LEFT(CRY,2)&RIGHT(CRY,2)","v":"2015"}]
[null,"PTRM","POST TAX REVENUE MODEL",null,{"$f":"LEFT(dms_FRCP_FinalYear_Num,2)&RIGHT(dms_FRCP_FinalYear_Num,2)","v":"2021"}]
[null,"Reset","REGULATORY REPORTING STATEMENT",null,{"$f":"LEFT(dms_FRCP_FinalYear_Num,2)&RIGHT(dms_FRCP_FinalYear_Num,2)","v":"2021"}]
[null,"RFM","ROLL FORWARD MODEL",null,{"$f":"LEFT(dms_CRCP_FinalYear_Num,2)&RIGHT(dms_CRCP_FinalYear_Num,2)","v":"2015"}]
[null,"WACC","WEIGHTED AVERAGE COST OF CAPITAL"]
[null,null,null,null,null,null,null,null,null,null,null,null,null,"Feeder Types",null,null,null,"TasNetworks (D)"]
[null,null,null,null,null,null,null,null,null,null,null,null,null,"CBD","Urban","Short rural","long rural","EXTRA"]
[null,"dms_TradingName_List","dms_TradingNameFull_List","dms_ABN_List","dms_State_List","dms_Sector_List","dms_Segment_List","dms_FormControl_List","dms_CRCPlength_List","dms_FRCPlength_List","dms_JurisdictionList","dms_663_List","dms_DeterminationRef_List","dms_CBD_flag","dms_Urban_flag","dms_ShortRural_flag","dms_LongRural_flag","dms_FeederType_5_flag","dms_FeederName_1","dms_FeederName_2","dms_FeederName_3","dms_FeederName_4","dms_FeederName_5"]
[null,"ActewAGL Distribution","ActewAGL Distribution",76670568688,"ACT","Electricity","Distribution","Revenue cap",5,6,"ACT",5,"2014-19 Distribution Determination","NO","YES","YES","NO","NO","CBD","Urban","Short rural","Long rural"]
[null,"ActewAGL Distribution (Tx Assets)","ActewAGL Distribution (Tx Assets)",76670568688,"ACT","Electricity","Distribution","Revenue cap",5,5,"ACT",5,"distribution determination",null,null,null,null,null,"CBD","Urban","Short rural","Long rural"]
[null,"AGN","AGN",78551685,"SA","Gas","Distribution","Revenue cap",5,5,"SA",5,"distribution determination",null,null,null,null,null,"CBD","Urban","Short rural","Long rural"]
[null,"Ausgrid","Ausgrid",67505337385,"NSW","Electricity","Distribution","Revenue cap",5,5,"NSW",5,"2014-19 Distribution Determination","YES","YES","YES","YES","NO","CBD","Urban","Short rural","Long rural"]
[null,"Ausgrid (Tx Assets)","Ausgrid (Tx Assets)",67505337385,"NSW","Electricity","Distribution","Revenue cap",5,5,"NSW",5,"distribution determination",null,null,null,null,null,"CBD","Urban","Short rural","Long rural"]
[null,"AusNet (D)","AusNet Electricity Services",91064651118,"Vic","Electricity","Distribution","Revenue cap",5,5,"Vic",2,"2016-20 Distribution Determination","NO","YES","YES","YES","NO","CBD","Urban","Short rural","Long rural"]
[null,"AusNet (T)","AusNet (T)",48116124362,"Vic","Electricity","Transmission","Revenue cap",5,5,"Vic",2,"distribution determination",null,null,null,null,null,"CBD","Urban","Short rural","Long rural"]
[null,"Australian Distribution Co.","Australian Distribution Co.",11222333444,"-","Electricity","Distribution","Revenue cap",5,5,"NSW",2,"distribution determination",null,null,null,null,null,"CBD","Urban","Short rural","Long rural"]
[null,"Australian Transmission Co.","Australian Transmission Co.",11222333444,"-","Electricity","Transmission","Revenue cap",5,5,"Vic",5,"distribution determination",null,null,null,null,null,"CBD","Urban","Short rural","Long rural"]
[null,"CitiPower","CitiPower",76064651056,"Vic","Electricity","Distribution","Revenue cap",5,5,"Vic",2,"2016-20 Distribution Determination","YES","YES","NO","NO","NO","CBD","Urban","Short rural","Long rural"]
[null,"Directlink","Directlink",16779340889,"NSW","Electricity","Transmission","Revenue cap",10,5,"Qld",5,"distribution determination",null,null,null,null,null,"CBD","Urban","Short rural","Long rural"]
[null,"ElectraNet","ElectraNet",41094482416,"SA","Electricity","Transmission","Revenue cap",5,5,"SA",5,"distribution determination",null,null,null,null,null,"CBD","Urban","Short rural","Long rural"]
[null,"Endeavour Energy","Endeavour Energy",59253130878,"NSW","Electricity","Distribution","Revenue cap",5,5,"NSW",5,"2014-19 Distribution Determination","NO","YES","YES","YES","NO","CBD","Urban","Short rural","Long rural"]
[null,"Energex","Energex",40078849055,"Qld","Electricity","Distribution","Revenue cap",5,5,"Qld",5,"2015-20 Distribution Determination","YES","YES","YES","NO","NO","CBD","Urban","Short rural","Long rural"]
[null,"Ergon Energy","Ergon Energy",50087646062,"Qld","Electricity","Distribution","Revenue cap",5,5,"Qld",5,"2015-20 Distribution Determination","NO","YES","YES","YES","NO","CBD","Urban","Short rural","Long rural"]
[null,"Essential Energy","Essential Energy",37428185226,"NSW","Electricity","Distribution","Revenue cap",5,5,"NSW",5,"2014-19 Distribution Determination","NO","YES","YES","YES","NO","CBD","Urban","Short rural","Long rural"]
[null,"Jemena Electricity","Jemena Electricity",82064651083,"Vic","Electricity","Distribution","Revenue cap",5,5,"Vic",2,"2016-20 Distribution Determination","NO","YES","YES","NO","NO","CBD","Urban","Short rural","Long rural"]
[null,"Murraylink","Murraylink",79181207909,"NSW","Electricity","Transmission","Revenue cap",5,5,"SA",5,"distribution determination",null,null,null,null,null,"CBD","Urban","Short rural","Long rural"]
[null,"Powercor Australia","Powercor Australia",89064651109,"Vic","Electricity","Distribution","Revenue cap",5,5,"Vic",2,"2016-20 Distribution Determination","NO","YES","YES","YES","NO","CBD","Urban","Short rural","Long rural"]
[null,"Powerlink","Queensland Electricity Transmission Corporation Limited trading as Powerlink Queensland",82078849233,"Qld","Electricity","Transmission","Revenue cap",5,5,"Qld",5,"distribution determination",null,null,null,null,null,"CBD","Urban","Short rural","Long rural"]
[null,"Qld,SA &ACT Gas Reset","Qld,SA &ACT Gas Reset",22222222222,"-","Gas","Distribution","?",5,5,"-","x","distribution determination",null,null,null,null,null,"CBD","Urban","Short rural","Long rural"]
[null,"SA Power Networks","SA Power Networks",13332330749,"SA","Electricity","Distribution","Revenue cap",5,5,"SA",5,"2015-20 Distribution Determination","YES","YES","YES","YES","NO","CBD","Urban","Short rural","Long rural"]
[null,"TasNetworks (D)","TasNetworks (D)",24167357299,"Tas","Electricity","Distribution","Revenue cap",5,5,"Tas",5,"distribution determination","YES","YES","YES","YES","YES","Critical Infrastructure","High density commercial","Urban","High density rural","Low density rural"]
[null,"TasNetworks (T)","TasNetworks (T)",24167357299,"Tas","Electricity","Transmission","Revenue cap",5,5,"Tas",5,"distribution determination",null,null,null,null,null,"CBD","Urban","Short rural","Long rural"]
[null,"TransGrid","TransGrid",19622755774,"NSW","Electricity","Transmission","Revenue cap",5,5,"NSW",5,"distribution determination",null,null,null,null,null,"CBD","Urban","Short rural","Long rural"]
[null,"United Energy","United Energy",70064651029,"Vic","Electricity","Distribution","Revenue cap",5,5,"Vic",2,"2016-20 Distribution Determination","NO","YES","YES","NO","NO","CBD","Urban","Short rural","Long rural"]
[null,"DNSP Backcasting","Victorian DNSP Backcasting",33333333666,"Vic","Electricity","Distribution","?",5,5,"-","x","distribution determination",null,null,null,null,null,"CBD","Urban","Short rural","Long rural"]
[null,"DNSP Reset ","Victorian DNSP Reset ",33333333333,"Vic","Electricity","Distribution","?",5,5,"-","x","distribution determination",null,null,null,null,null,"CBD","Urban","Short rural","Long rural"]
[]
[]
[]
[]
[null,"dms_SourceList","dms_FormControl_Choices",null,"dms_FRCPlength_Num_List","dms_FinalYear_List"]
[null,"After appeal","Revenue cap",null,1,"FRCP_y1"]
[null,"Draft decision","Revenue yield",null,2,"FRCP_y2"]
[null,"Final decision","Weighted average price cap",null,3,"FRCP_y3"]
[null,"Pass through decision",null,null,4,"FRCP_y4"]
[null,"PTRM annual update",null,null,5,"FRCP_y5"]
[null,"PTRM interim update 1",null,null,6,"FRCP_y6"]
[null,"PTRM interim update 2",null,null,7,"FRCP_y7"]
[null,"PTRM interim update 3",null,null,8,"FRCP_y8"]
[null,"PTRM interim update 4",null,null,9,"FRCP_y9"]
[null,"Regulatory proposal",null,null,10,"FRCP_y10"]
[null,"Reporting"]
[null,"Revised regulatory proposal"]
[null,"RFM annual update"]
[null,"WACC annual update"]
[]
[]
[null,"Notes"]
[null,"RFM - Base year is usually CRCP_y1","EG. Victorian 2016-20 - base year = 2011"]
[null,"RFM - Form of Control Field is not relevant"]
[null,"PTRM - capture base year input by NSP","=PTRM input'!Q7"]

{"sheet":"Contents","index":1,"n_rows":31,"n_cols":4,"rows_kept":31,"cut":false,"hidden":false,"merged":[[2,1,2,3],[3,1,3,3],[4,1,4,3]]}
[]
[]
[null,{"$f":"CONCATENATE(dms_Segment,\" Network Service Provider\")","v":"Distribution Network Service Provider"}]
[null,"Annual Reporting RIN Template"]
[null,"Table of Contents"]
[]
[]
[null,null,"Instructions"]
[null,null,"Business & other details"]
[]
[]
[null,"CATEGORY ANALYSIS","STPIS","STATUTORY ACCOUNTS"]
[]
[null,"2.11 Labour","6.2 STPIS Reliability","8.1 Income"]
[null,null,"6.6 STPIS Customer Service","8.2 Capex"]
[null,null,"6.7 STPIS Daily Performance"]
[null,null,"6.8 STPIS Exclusions","8.4 Opex"]
[null,null,"6.9 STPIS GSL"]
[]
[]
[]
[null,"NETWORK PERFORMANCE","OTHER INFORMATION","PRICING PROPOSAL"]
[null,null,null,"Victorian Businesses Only"]
[null,"3.6 Quality of services","7.8 Avoided Cost Payments"]
[null,"3.6.8 Network-feeders","7.10 Juris Scheme","9.5 TUoS"]
[null,"3.6.9 Network-reliability","7.11 DMIS-DMIA"]
[null,null,"7.12 Safety and Bushfire"]
[null,null,"7.13 TARC"]
[null,"PUBLIC LIGHTING"]
[]
[null,"4.1 Public lighting tariffs"]

{"sheet":"Instructions","index":2,"n_rows":26,"n_cols":6,"rows_kept":26,"cut":false,"hidden":false,"merged":[[17,2,17,4],[19,2,19,4],[25,2,25,4],[7,1,7,5],[8,1,8,5],[14,2,14,4],[10,2,10,4],[16,2,16,3]]}
[]
[]
[]
[]
[]
[]
[]
[null,{"$f":"CONCATENATE(dms_Segment,\" Network Service Provider\")","v":"Distribution Network Service Provider"}]
[null,"Annual Reporting RIN Template"]
[]
[null,null,{"$f":"CONCATENATE(\"This template is to be used by \",dms_TradingName, \" to fulfil its annual reporting obligations to the AER.\")","v":"This template is to be used by Endeavour Energy to fulfil its annual reporting obligations to the AER."}]
[null,null,null,null,null,"Amendments made December 2015"]
[null,null,null,null,null,"Click here for details."]
[null,null,"INSTRUCTIONS"]
[null,null,"Complete the Business & other details worksheet before entering data or values in any other worksheets. The Business & other details worksheet is linked to other cells within the workbook and automatically generates certain column headings and conditional formatting."]
[]
[null,null,"Identifying CONFIDENTIAL INFORMATION:\n\nPlease use the macro at the top of each \nworksheet to identify confidential information. \n\n"]
[null,null,"-Do this by selecting the cell or cells that contain confidential information and then run the Mark selected cells as CONFIDENTIAL macro. This will format the cells a specific colour that is identified by the AER's database which in turn marks that information as confidential.\n\n-To reverse this, select the cell or cells and run the Return cells to NON-CONFIDENTIAL macro"]
[]
[null,null,"All amounts are to be unrounded and reported in nominal terms on a one for one basis: that is 1000 is to be entered as '1000' not '1' as in previous templates.\n\nColour coding of input sheets:"]
[null,null,null,"Yellow = Input cells"]
[null,null,null,"Grey = Not applicable/No inputs required"]
[null,null,null,"Leave coloured cells blank if no information exists. \nPLEASE DO NOT ENTER TEXT into cells that are to contain numeric data."]
[]
[]
[null,null,"Returning completed responses\n\nPlease return two (2) files to the AER: \n1. A confidential version which must contain a complete set of all responses with confidential information marked using the Mark selected cells CONFIDENTIAL macro and which has been completed using the locked template file provided by the AER. \n\n2. A public version with confidential information either removed completely or aggregated in some form together with writtten consent to disclose the public version of the response.\n\nUse the drop down box on the Business and other details worksheet to identify the file as either confidential ('consolidated') or public. "]

{"sheet":"Business & other details","index":3,"n_rows":78,"n_cols":13,"rows_kept":78,"cut":false,"hidden":false,"merged":[[6,2,6,9],[11,2,11,9],[32,2,32,9],[28,6,28,7],[29,6,29,7],[19,3,19,4],[22,3,22,4],[17,3,17,4],[24,3,24,4],[28,3,28,4],[29,3,29,4],[30,3,30,4],[17,5,17,8],[18,5,18,8],[19,5,19,8],[22,5,22,8],[13,3,13,4],[14,3,14,4],[30,6,30,7],[71,4,71,9],[48,3,48,4],[50,3,50,9],[23,5,23,8],[24,5,24,8]]}
[null,null,{"$f":"(LOOKUP(dms_Model,dms_Model_List,dms_Worksheet_List))","v":"REGULATORY REPORTING STATEMENT"}]
[null,null,{"$f":"dms_TradingName","v":"Endeavour Energy"}]
[null,null,{"$f":"CONCATENATE(\"Annual Reporting RIN Response \",CRY)","v":"Annual Reporting RIN Response 2014-15"}]
[null,null,"BUSINESS & OTHER DETAILS"]
[]
[null,null,"Instructions"]
[null,null,"Complete the following business details regulatory template before entering data or values in any other regulatory templates. This regulatory template is linked to other cells within these worksheets and is used to automatically generate some column headings and to apply conditional formatting to certain cells."]
[]
[]
[null,null,"SUBMISSION PARTICULARS INPUT SHEETS"]
[]
[null,null,"ENTITY DETAILS"]
[]
[null,null,"Short name","Endeavour Energy"]
[null,null,"ACN / ABN",{"$f":"INDEX(dms_ABN_List,MATCH(dms_TradingName,dms_TradingName_List))","v":59253130878}]
[]
[]
[null,null,"Business address","Address 1",null,"51 Huntingwood Drive"]
[null,null,null,null,"Address 2"]
[null,null,null,"Suburb",null,"Huntingwood"]
[null,null,null,null,"State",{"$f":"INDEX(dms_State_List,MATCH(dms_TradingName,dms_TradingName_List))","v":"NSW"},"p/code",2148]
[]
[null,null,"Postal address","Address 1",null,"PO Box 811"]
[null,null,null,null,"Address 2"]
[null,null,null,"Suburb",null,"Seven Hills"]
[null,null,null,null,"State","NSW","p/code",1730]
[]
[]
[null,null,"Contact name/s","Jon Hocking"]
[null,null,"Contact phone/s","9853 4386",null,null,"0407 348 156"]
[null,null,"Contact email address/s","jon.hocking@endeavourenergy.com.au"]
[]
[null,null,"REGULATORY CONTROL PERIODS"]
[]
[null,null,"Forthcoming regulatory control period","2016-17",{"$f":"IF(dms_RPT=\"financial\",VALUE(LEFT(FRCP_y1,4)+1)&\"-\"&VALUE(MID(FRCP_y1,3,2)+2),VALUE(LEFT(FRCP_y1,4)+1))","v":"2017-18"},{"$f":"IF(dms_RPT=\"financial\",VALUE(LEFT(FRCP_y2,4)+1)&\"-\"&VALUE(MID(FRCP_y2,3,2)+2),VALUE(LEFT(FRCP_y2,4)+1))","v":"2018-19"},{"$f":"IF(dms_RPT=\"financial\",VALUE(LEFT(FRCP_y3,4)+1)&\"-\"&VALUE(MID(FRCP_y3,3,2)+2),VALUE(LEFT(FRCP_y3,4)+1))","v":"2019-20"},{"$f":"IF(dms_RPT=\"financial\",VALUE(LEFT(FRCP_y4,4)+1)&\"-\"&VALUE(MID(FRCP_y4,3,2)+2),VALUE(LEFT(FRCP_y4,4)+1))","v":"2020-21"},{"$f":"IF(dms_RPT=\"financial\",VALUE(LEFT(FRCP_y5,4)+1)&\"-\"&VALUE(MID(FRCP_y5,3,2)+2),VALUE(LEFT(FRCP_y5,4)+1))","v":"2021-22"},{"$f":"IF(dms_RPT=\"financial\",VALUE(LEFT(FRCP_y6,4)+1)&\"-\"&VALUE(MID(FRCP_y6,3,2)+2),VALUE(LEFT(FRCP_y6,4)+1))","v":"2022-23"},{"$f":"IF(dms_RPT=\"financial\",VALUE(LEFT(FRCP_y7,4)+1)&\"-\"&VALUE(MID(FRCP_y7,3,2)+2),VALUE(LEFT(FRCP_y7,4)+1))","v":"2023-24"},{"$f":"IF(dms_RPT=\"financial\",VALUE(LEFT(FRCP_y8,4)+1)&\"-\"&VALUE(MID(FRCP_y8,3,2)+2),VALUE(LEFT(FRCP_y8,4)+1))","v":"2024-25"},{"$f":"IF(dms_RPT=\"financial\",VALUE(LEFT(FRCP_y9,4)+1)&\"-\"&VALUE(MID(FRCP_y9,3,2)+2),VALUE(LEFT(FRCP_y9,4)+1))","v":"2025-26"}]
[]
[]
[null,null,"Current regulatory control period",{"$f":"IF(dms_RPT=\"financial\",VALUE(LEFT(CRCP_y2,4)-1)&\"-\"&TEXT(VALUE(RIGHT(CRCP_y2,2)-1),\"0#\"),VALUE(LEFT(CRCP_y2,4)-1))","v":"2011-12"},{"$f":"IF(dms_RPT=\"financial\",VALUE(LEFT(CRCP_y3,4)-1)&\"-\"&TEXT(VALUE(RIGHT(CRCP_y3,2)-1),\"0#\"),VALUE(LEFT(CRCP_y3,4)-1))","v":"2012-13"},{"$f":"IF(dms_RPT=\"financial\",VALUE(LEFT(CRCP_y4,4)-1)&\"-\"&TEXT(VALUE(RIGHT(CRCP_y4,2)-1),\"0#\"),VALUE(LEFT(CRCP_y4,4)-1))","v":"2013-14"},{"$f":"IF(dms_RPT=\"financial\",VALUE(LEFT(CRCP_y5,4)-1)&\"-\"&TEXT(VALUE(RIGHT(CRCP_y5,2)-1),\"0#\"),VALUE(LEFT(CRCP_y5,4)-1))","v":"2014-15"},{"$f":"IF(dms_RPT=\"financial\",VALUE(LEFT(FRCP_y1,4)-1)&\"-\"&TEXT(VALUE(RIGHT(FRCP_y1,2)-1),\"0#\"),VALUE(LEFT(FRCP_y1,4)-1))","v":"2015-16"}]
[]
[]
[null,null,"Previous regulatory control period",{"$f":"IF(dms_RPT=\"financial\",VALUE(LEFT(PRCP_y2,4)-1)&\"-\"&TEXT(VALUE(MID(PRCP_y2,3,2)),\"0#\"),VALUE(LEFT(PRCP_y2,4)-1))","v":"2006-07"},{"$f":"IF(dms_RPT=\"financial\",VALUE(LEFT(PRCP_y3,4)-1)&\"-\"&TEXT(VALUE(MID(PRCP_y3,3,2)),\"0#\"),VALUE(LEFT(PRCP_y3,4)-1))","v":"2007-08"},{"$f":"IF(dms_RPT=\"financial\",VALUE(LEFT(PRCP_y4,4)-1)&\"-\"&TEXT(VALUE(MID(PRCP_y4,3,2)),\"0#\"),VALUE(LEFT(PRCP_y4,4)-1))","v":"2008-09"},{"$f":"IF(dms_RPT=\"financial\",VALUE(LEFT(PRCP_y5,4)-1)&\"-\"&TEXT(VALUE(RIGHT(PRCP_y5,2)-1),\"0#\"),VALUE(LEFT(PRCP_y5,4)-1))","v":"2009-10"},{"$f":"IF(dms_RPT=\"financial\",VALUE(LEFT(CRCP_y1,4)-1)&\"-\"&TEXT(VALUE(RIGHT(CRCP_y1,2)-1),\"0#\"),VALUE(LEFT(CRCP_y1,4)-1))","v":"2010-11"}]
[]
[]
[null,null,"Current regulatory year","2014-15"]
[]
[]
[]
[]
[null,null,"Source","Reporting"]
[null,null,"Consolidated confidential or public version?","Consolidated"]
[null,null,"Amended RIN submission - amendment reason","Amended table 8.2.4 to allocate provision movements attributable to capex as reported in the Benchmarking RIN."]
[null,null,"EBSS - First application of scheme in forthcoming period?","No"]
[null,null,"Sector",{"$f":"INDEX(dms_Sector_List,MATCH(dms_TradingName,dms_TradingName_List))","v":"Electricity"},"dms_Sector","=INDEX(dms_Sector_List,MATCH(dms_TradingName,dms_TradingName_List))"]
[null,null,"Segment",{"$f":"INDEX(dms_Segment_List,MATCH(dms_TradingName,dms_TradingName_List))","v":"Distribution"},"dms_Segment","=INDEX(dms_Segment_List,MATCH(dms_TradingName,dms_TradingName_List))"]
[null,null,"Regulatory Year Ending",{"$f":"INDEX(dms_RYE_Formula_Result,MATCH(dms_Model,dms_Model_List))","v":"2015"},"dms_RYE","=INDEX(dms_RYE_Formula_Result,MATCH(dms_Model,dms_Model_List))"]
[null,null,"Reporting Period Type",{"$f":"IF(LEN(FRCP_y1)>4,\"Financial\",\"Calendar\")","v":"Financial"},"dms_RPT","=IF(LEN(FRCP_y1)>4,\"Financial\",\"Calendar\")"]
[null,null,"Model or RIN Type","ARR","dms_Model"]
[null,null,"Security Classification","Public","dms_Classification"]
[null,null,"Template - version no.",5,"dms_TemplateNumber"]
[null,null,"Dollar $ real  (the last month before the FRCP_y1)",{"$f":"CONCATENATE(IF(dms_RPT=\"Financial\",\"June \",\"December \"),VALUE((LEFT(FRCP_y1,2))&RIGHT(FRCP_y1,2))-1)","v":"June 2016"},"dms_DollarReal","=CONCATENATE(IF(dms_RPT=\"Financial\",\"June \",\"December \"),VALUE((LEFT(FRCP_y1,2))&RIGHT(FRCP_y1,2))-1)"]
[null,null,"Form of control",{"$f":"INDEX(dms_FormControl_List,MATCH(dms_TradingName,dms_TradingName_List))","v":"Revenue cap"},"dms_FormControl","=INDEX(dms_FormControl_List,MATCH(dms_TradingName,dms_TradingName_List))"]
[null,null,"RIN response - version no.",1,"dms_RINversion"]
[null,null,"Jurisdiction",{"$f":"INDEX(dms_JurisdictionList,MATCH(dms_TradingName,dms_TradingName_List))","v":"NSW"},"dms_Jurisdiction","=INDEX(dms_JurisdictionList,MATCH(dms_TradingName,dms_TradingName_List))"]
[null,null,"Length of current reg control period",{"$f":"INDEX(dms_CRCPlength_List,MATCH(dms_TradingName,dms_TradingName_List))","v":5},"dms_CRCPlength","=INDEX(dms_CRCPlength_List,MATCH(dms_TradingName,dms_TradingName_List))"]
[null,null,"Length of forthcoming reg control period",{"$f":"INDEX(dms_FRCPlength_List,MATCH(dms_TradingName,dms_TradingName_List))","v":5},"dms_FRCPlength","=INDEX(dms_FRCPlength_List,MATCH(dms_TradingName,dms_TradingName_List))"]
[null,null,"FRCP length in years",{"$f":"INDEX(dms_FRCPlength_List,MATCH(dms_TradingName,dms_TradingName_List))","v":5},"dms_FRCPlength_Num","=INDEX(dms_FRCPlength_List,MATCH(dms_TradingName,dms_TradingName_List))"]
[null,null,"FRCP Final Year Reference",{"$f":"INDEX(dms_FinalYear_List,MATCH(dms_FRCPlength_Num,dms_FRCPlength_Num_List))","v":"FRCP_y5"},"dms_FRCP_FinalYear","=INDEX(dms_FinalYear_List,MATCH(dms_FRCPlength_Num,dms_FRCPlength_Num_List))"]
[null,null,"FRCP Final Year",{"$f":"INDIRECT(dms_FRCP_FinalYear)","v":"2020-21"},"dms_FRCP_FinalYear_Num","=INDIRECT(dms_FRCP_FinalYear)"]
[null,null,"CRCP length in years",5,"dms_CRCPlength_Num","=INDEX(dms_CRCPlength_List,MATCH(dms_TradingName,dms_TradingName_List))"]
[null,null,"CRCP Final Year Reference","CRCP_y5","dms_CRCP_FinalYear","=INDEX(dms_CFinalYear_List,MATCH(dms_CRCPlength_Num,dms_CRCPlength_Num_List))"]
[null,null,"CRCP Final Year","2014-15","dms_CRCP_FinalYear_Num","=INDIRECT(dms_CRCP_FinalYear)"]
[null,null,"Backcast templates only - unit of measure ","$0s","If the cover sheet is for Backcast data ensure to apply dms_Backcast_UOM named range to this field. Otherwise, do not apply this named range."]
[null,null,"Table 6.6.3 - Public lighting repair - no. business days",{"$f":"INDEX(dms_663_List,MATCH(dms_TradingName,dms_TradingName_List))","v":5}]
[null,null,"Distribution Determination Reference",{"$f":"INDEX(dms_DeterminationRef_List,MATCH(dms_TradingName,dms_TradingName_List))","v":"2014-19 Distribution Determination"},"=dms_DeterminationRef"]
[null,null,"CBD Feeder for this business",{"$f":"INDEX(dms_CBD_flag,MATCH(dms_TradingName,dms_TradingName_List))","v":"NO"},"dms_CBD_flag_NSP"]
[null,null,"Urban Feeder for this business",{"$f":"INDEX(dms_Urban_flag,MATCH(dms_TradingName,dms_TradingName_List))","v":"YES"},"dms_Urban_flag_NSP"]
[null,null,"Short rural Feeder for this business",{"$f":"INDEX(dms_ShortRural_flag,MATCH(dms_TradingName,dms_TradingName_List))","v":"YES"},"dms_ShortRural_flag_NSP"]
[null,null,"Long rural Feeder for this business",{"$f":"INDEX(dms_LongRural_flag,MATCH(dms_TradingName,dms_TradingName_List))","v":"YES"},"dms_LongRural_flag_NSP"]

{"sheet":"2.11 Labour","index":4,"n_rows":36,"n_cols":4,"rows_kept":36,"cut":false,"hidden":false,"merged":[]}
[null,{"$f":"(LOOKUP(dms_Model,dms_Model_List,dms_Worksheet_List))","v":"REGULATORY REPORTING STATEMENT"}]
[null,{"$f":"dms_TradingName","v":"Endeavour Energy"}]
[null,{"$f":"CONCATENATE(\"Annual Reporting RIN Response \",CRY)","v":"Annual Reporting RIN Response 2014-15"}]
[null,"2.11 LABOUR "]
[]
[null,"Tables 2.11.1 and 2.11.2 deliberately omitted."]
[]
[null,"2.11.3 - LABOUR / NON-LABOUR EXPENDITURE SPLIT"]
[null,"2.11.3.1 - Opex"]
[null,null,{"$f":"CRY","v":"2014-15"}]
[null,null,"$0's, nominal"]
[null,null,"Opex "]
[null,"In-house labour expenditure",202057076.57935256]
[null,"Labour expenditure outsourced to related parties",0]
[null,"Labour expenditure outsourced to unrelated parties",67858932.710791215]
[null,"Controllable non-labour expenditure",14032596.866332211]
[null,"Uncontrollable non-labour expenditure",6347731.6222817767]
[null,"Total",{"$f":"SUM(C13:C17)","v":290296337.77875781}]
[]
[null,"Reconciliation with Opex worksheets - SCS","Opex"]
[null,"Total including margins",{"$f":"dms_Total_Actual_Opex","v":290296337.77875775},{"$f":"IF(C18=dms_Total_Actual_Opex,\"OK\",\"Error\")","v":"OK"}]
[]
[]
[null,"2.11.3.2 - Capex"]
[null,null,{"$f":"CRY","v":"2014-15"}]
[null,null,"$0's, nominal"]
[null,null,"Capex"]
[null,"In-house labour expenditure",77194784.497281745]
[null,"Labour expenditure outsourced to related parties",0]
[null,"Labour expenditure outsourced to unrelated parties",137397195.48532131]
[null,"Controllable non-labour expenditure",146610463.50308079]
[null,"Uncontrollable non-labour expenditure",111924420.88239455]
[null,"Total",{"$f":"SUM(C28:C32)","v":473126864.36807841}]
[]
[null,"Reconciliation with Capex & Opex worksheets - SCS","Capex"]
[null,"Total including margins",{"$f":"dms_Total_Actual_Capex","v":{"$error":"#REF!"}},{"$f":"IF(C33=dms_Total_Actual_Capex,\"OK\",\"Error\")","v":{"$error":"#REF!"}}]

{"sheet":"3.6 Quality of services","index":5,"n_rows":71,"n_cols":4,"rows_kept":71,"cut":false,"hidden":false,"merged":[[6,2,7,2],[24,2,25,2],[24,1,25,1]]}
[null,{"$f":"(LOOKUP(dms_Model,dms_Model_List,dms_Worksheet_List))","v":"REGULATORY REPORTING STATEMENT"}]
[null,{"$f":"dms_TradingName","v":"Endeavour Energy"}]
[null,{"$f":"CONCATENATE(\"Annual Reporting RIN Response \",CRY)","v":"Annual Reporting RIN Response 2014-15"}]
[null,"3.6 QUALITY OF SERVICES"]
[]
[null,"3.6.5 - QUALITY OF SUPPLY METRICS"]
[null,null,"Unit","Volume"]
[null,null,null,{"$f":"CRY","v":"2014-15"}]
[null,"Over voltage events - due to high voltage injection","number"]
[null,"Customers receiving over-voltage - due to high voltage injection","number"]
[null,"Over voltage events - due to lightning","number"]
[null,"Customers receiving over-voltage - due to lightning","number"]
[null,"Over voltage events - due to voltage regulation or other cause","number"]
[null,"Customers receiving over-voltage - due to voltage regulation or other cause","number"]
[null,"Voltage variations - steady state (zone sub)","number"]
[null,"Voltage variations - one minute (zone sub)","number"]
[null,"Voltage variations - 10 seconds (zone sub) Min<0.7","number"]
[null,"Voltage variations - 10 seconds (zone sub) Min<0.8","number"]
[null,"Voltage variations - 10 seconds (zone sub) Min<0.9","number"]
[null,"Voltage variations - steady state (feeder)","number"]
[null,"Voltage variations - % zone subs monitored","(per cent)"]
[null,"Voltage variations - % feeders monitored","(per cent)"]
[]
[null,"3.6.6 - COMPLAINTS - TECHNICAL QUALITY OF SUPPLY"]
[null,null,"Unit","Volume"]
[null,null,null,{"$f":"CRY","v":"2014-15"}]
[null,"3.6.6.1 - TECHNICAL QUALITY OF SUPPLY"]
[null,"Number of complaints - technical quality of supply","number",6]
[null,"3.6.6.2 - PERCENTAGE OF COMPLAINTS BY CATEGORY"]
[null,"Low voltage supply","(per cent)"]
[null,"Voltage dips","(per cent)"]
[null,"Voltage swell","(per cent)"]
[null,"Voltage spike (impulsive transient)","(per cent)"]
[null,"Waveform distortion","(per cent)"]
[null,"TV or radio interference","(per cent)"]
[null,"Solar related","(per cent)"]
[null,"Noise from appliances","(per cent)"]
[null,"Other","(per cent)"]
[null,"3.6.6.3 - PERCENTAGE OF COMPLAINTS BY LIKELY CAUSE"]
[null,"Network equipment faulty","(per cent)"]
[null,"Network interference by NSP equipment","(per cent)"]
[null,"Network interference by another customer","(per cent)"]
[null,"Network limitation","(per cent)"]
[null,"Customer internal problem","(per cent)"]
[null,"No problem identified","(per cent)"]
[null,"Environmental","(per cent)"]
[null,"Other","(per cent)"]
[]
[null,"3.6.7 - CUSTOMER SERVICE METRICS"]
[null,null,"Unit",{"$f":"CRY","v":"2014-15"}]
[null,"3.6.7.1 - TIMELY PROVISIONS OF SERVICES"]
[null,"Number of connections made","number",35]
[null,"Number of connections not made on or before agreed date","number",0]
[null,"3.6.7.2 - TIMELY REPAIR OF FAULTY STREET LIGHTS"]
[null,"Street lights - average monthly number \"out\"","number",2057]
[null,"Street lights - not repaired by \"fix by\" date","number",98]
[null,"Street lights - average number of days to repair","number",3.8]
[null,"Total number of street lights","number",199449]
[null,"3.6.7.3 - CALL CENTRE PERFORMANCE"]
[null,"Calls to call centre fault line","number",436323]
[null,"Calls to fault line answered within 30 seconds","number",187502]
[null,"Calls to fault line - average waiting time before call answered","number",44]
[null,"Call centre - number of overload events","number",0]
[null,"Percentage of calls abandoned","(per cent)",9.18]
[null,"3.6.7.4 - NUMBER OF CUSTOMER COMPLAINTS"]
[null,"Complaint - reliability of supply","number"]
[null,"Complaint - technical quality of supply","number",{"$f":"IF(ISBLANK(D28),\"\",D28)","v":6}]
[null,"Complaint - administrative process or customer service","number"]
[null,"Complaint - connection or augmentation","number"]
[null,"Complaint - other","number"]
[null,"Total number of complaints","number"]

{"sheet":"3.6.8 Network-feeders - use","index":6,"n_rows":1410,"n_cols":23,"rows_kept":1410,"cut":false,"hidden":false,"merged":[[5,1,5,4],[5,6,5,8],[10,1,12,1],[10,2,12,2],[10,3,12,3],[10,4,12,4],[10,5,10,6],[10,7,12,7],[10,8,10,9],[10,10,10,14],[10,15,10,19],[10,20,10,22],[11,5,12,5],[11,6,12,6],[11,8,12,8],[11,9,12,9],[11,10,12,10],[11,11,11,12],[11,13,11,14],[11,15,12,15],[11,16,11,17],[11,18,11,19],[11,20,12,20],[11,21,11,22]]}
[null,{"$f":"(LOOKUP(dms_Model,dms_Model_List,dms_Worksheet_List))","v":"REGULATORY REPORTING STATEMENT"},null,null,null,null,{"$f":"CONCATENATE(\"1-Jan-\",LEFT(CRY,4))","v":"1-Jan-2014"}]
[null,{"$f":"dms_TradingName","v":"Endeavour Energy"}]
[null,{"$f":"CONCATENATE(\"Annual Reporting RIN Response \",CRY)","v":"Annual Reporting RIN Response 2014-15"}]
[null,"3.6 QUALITY OF SERVICES"]
[]
[null,"Did the MAIFI parameter of the STPIS apply during the period?",null,null,null,"No","** IMPORTANT\nPlease ensure this question is answered correctly. Your response will affect other tables throughout this workbook and will determine which cells are grey and which are input cells. "]
[]
[]
[]
[null,"3.6.8 - NETWORK FEEDER RELIABILITY"]
[null,"Feeder ID / name","Description of the service area for the feeder","Feeder classification\n\n(drop down)","Number of distribution customers","Length of high voltage distribution lines",null,"Maximum demand\n(MVA)","Energy not supplied\n(MWh)",null,"Unplanned Outages",null,null,null,null,"Planned Outages",null,null,null,null,"Momentary feeder outages"]
[null,null,null,null,null,"Overhead","Underground",null,"Unplanned","Planned","Total number of unplanned outages","Unplanned customer minutes off-supply (SAIDI)",null,"Unplanned interruptions\n(SAIFI)",null,"Total number of planned outages","Planned customer minutes off-supply (SAIDI)",null,"Planned interruptions\n(SAIFI)",null,"Total number of momentary feeder outages","Momentary interruptions due to feeder outages (MAIFI)"]
[null,null,null,null,null,null,null,null,null,null,null,"Including excluded events and MEDs","After removing excluded events and MED","Including excluded events and MEDs","After removing excluded events and MED",null,"Including MEDs","After removing  MED","Including MEDs","After removing  MED",null,"Including excluded events and MEDs","After removing excluded events and MED"]
[null,10241,"katoomba","Urban",1155,10.154671345182701,0.19880168209996402,2.8866531960000001,3.2509113548957713,2.9474990999999999,6,0.27544447281962259,6.715600569646517E-3,0.10460784229055407,4.3496086421905894E-3,11,0.24907825174038564,"N/A",5.5867318243741477E-4,"N/A"]
[null,10242,"katoomba","Urban",1319,8.5342830378934789,0.80058675019263292,4.1224021659999996,11.116547324399853,1.1203425,10,0.9418871150492738,1.0771890083614602E-2,0.61058257997931498,8.2678417776682091E-3,7,9.4674482258689449E-2,"N/A",2.3496769194235795E-4,"N/A"]
[null,10244,"katoomba","Rural Short",918,22.008921845499501,3.12037990692808,2.0058533989999998,3.2363986169092493,0.63892800000000005,12,1.3223637796729553,2.6314022794297173E-2,0.4868435699380777,1.8925578101400258E-2,2,0.26465885351254986,"N/A",5.5137261148447889E-4,"N/A"]
[null,10245,"katoomba","Rural Short",891,9.8030756065375613,0.50667776687410804,1.856862389,6.2259302023041307,2.6724051000000002,10,2.5438598790903373,3.2344936819167967E-2,2.1967192553889827,2.6981209920444751E-2,14,1.1069724129903387,"N/A",2.5914512739770509E-3,"N/A"]
[null,10247,"katoomba","Urban",462,0,2.51716100052808,2.639732033,0.88006204990145331,0,5,7.456623725485563E-2,2.2661691029371668E-3,3.7110992501849245E-2,1.6874419530061454E-3,0,0,"N/A",0,"N/A"]
[null,10248,"katoomba","Urban",1141,6.2338731452425904,1.9123687265432801,2.5604733880000001,8.6820590378827251,0.45922950000000001,9,0.73561685127988374,7.8559010014411113E-3,0.44666129422937551,5.6828344256749245E-3,1,3.8807164014947944E-2,"N/A",8.6238142255439873E-5,"N/A"]
[null,10250,"katoomba","Urban",967,6.8227154008056008,5.0226860693211197,3.669522841,5.0647674904980304,8.2124433000000003,7,0.4291295760105156,6.0266851697394009E-3,0.35088792590824847,4.8177605593628849E-3,20,0.69399207608953772,"N/A",1.4672982464911076E-3,"N/A"]
[null,10251,"katoomba","Urban",1387,8.6291791650902105,1.1050036329089201,3.6369429649999998,2.9676661818543835,0.29284199999999999,11,0.25144556640539684,7.0473655731361409E-3,0.12725108147019806,5.2209495970528949E-3,2,2.4746597342865356E-2,"N/A",6.8740548174625981E-5,"N/A"]
[null,10286,"north_richmond","Rural Short",508,18.506937766097398,3.0357600000000002,2.5155093489999998,0.16097435999999998,6.8329799999999996E-2,4,6.5772696233358921E-2,4.0488521202086062E-4,6.0551489917149606E-2,3.8675602342291165E-4,3,2.8303794056203247E-2,"N/A",1.1027452229689578E-4,"N/A"]
[null,10287,"north_richmond","Urban",942,4.3854499999999996,0.74519267958397906,3.8750999510000002,4.8438433200000004,1.5746913,6,0.41041102756892228,2.5751879699248115E-3,0.41041102756892228,2.5751879699248115E-3,8,0.13306920298458963,"N/A",3.2495531864368645E-4,"N/A"]
[null,10289,"north_richmond","Rural Short",87,6.3006236594363196,0.23408000000000001,0.40829633700000001,2.4847200000000002E-3,0.88739999999999997,1,1.0152345614851432E-3,1.2086125731965989E-5,1.0152345614851432E-3,1.2086125731965989E-5,6,0.36758174098965257,"N/A",8.6381709132568368E-4,"N/A"]
[null,10290,"north_richmond","Rural Short",112,8.4610199952040297,0.53781091741404308,2.0864457230000002,2.0114400000000001E-2,0.13976549999999999,1,8.2185654977368731E-3,9.6689005855727912E-5,8.2185654977368731E-3,9.6689005855727912E-5,3,5.7894124205870284E-2,"N/A",1.3477997169620594E-4,"N/A"]
[null,16649,"north_parramatta","Urban",1819,2.4511555747226699,3.7863049985207797,3.1124260189999999,2.94434883,0.1703808,3,0.24946992481203006,2.3220551378446115E-3,0.24946992481203006,2.3220551378446115E-3,1,1.4398020272212571E-2,"N/A",2.9995875567109524E-5,"N/A"]
[null,16651,"north_parramatta","Urban",976,0,2.5065027645041202,2.0647258060000002,0.42453215999999999,0,2,3.5969924812030075E-2,1.3533834586466166E-4,3.5969924812030075E-2,1.3533834586466166E-4,0,0,"N/A",0,"N/A"]
[null,16653,"north_parramatta","Urban",1602,5.2798912100987598,1.77629552892193,3.7234415830000001,3.4667907900000006,9.3176999999999999E-3,4,0.29373558897243107,4.0263157894736843E-3,0.29373558897243107,4.0263157894736843E-3,1,7.87391733636625E-4,"N/A",8.7487970404069445E-6,"N/A"]
[null,16660,"north_parramatta","Urban",1310,6.1551917342041893,1.4604541150505499,4.5804256810000004,4.7728808999999988,0,8,0.40439849624060148,1.611528822055138E-3,0.40439849624060148,1.611528822055138E-3,0,0,"N/A",0,"N/A"]
[null,16662,"north_parramatta","Urban",397,0,2.2178539009690796,2.8142534729999999,0,0.1903473,0,0,0,0,0,2,1.6085288272862482E-2,"N/A",4.2494157053405156E-5,"N/A"]
[null,16666,"north_parramatta","Urban",2082,2.41192395218774,5.1842162283425992,4.0010373650000002,2.44071975,0.12689819999999999,3,0.20679824561403506,3.6466165413533835E-4,7.9682957393483703E-2,2.3684210526315788E-4,3,1.0723525515241656E-2,"N/A",2.8746047418479962E-5,"N/A"]
[null,17035,"st_marys","Urban",435,0,0,2.4057666100000001,3.3420768648136248,0,2,0.28316877935318557,2.4850179301363021E-3,0.28316877935318557,2.4850179301363021E-3,0,0,"N/A",0,"N/A"]
[null,17037,"st_marys","Urban",629,0,0,2.6488772620000001,1.8249024244931193,0,2,0.15462103742225064,7.9832568963854387E-4,0.15462103742225064,7.9832568963854387E-4,0,0,"N/A",0,"N/A"]
[null,17038,"st_marys","Urban",1093,0,0,2.6673582439999999,3.2823635883442153,1.5050304000000001,5,0.27810936980248241,1.5076574184380827E-3,0.27810936980248241,1.5076574184380827E-3,2,0.12718251240454437,"N/A",2.6496356750946748E-4,"N/A"]
[null,17039,"st_marys","Urban",715,0,0,6.8090034939999997,2.9859564137445949,5.3244E-3,5,0.25299526823690349,2.8497143340618192E-3,0.25299526823690349,2.8497143340618192E-3,1,4.4993813350664285E-4,"N/A",1.2498281486295635E-6,"N/A"]
[null,17058,"arndell_park","Urban",1035,4.5487823034398902,2.2499548625578698,4.3796117099999998,0,3.2762807999999999,0,0,0,0,0,7,0.27686193148442084,"N/A",6.1366562097711554E-4,"N/A"]
[null,17061,"arndell_park","Urban",849,2.1059955967099699,5.0511076288827903,4.3058783079999996,0.26858640000000006,0.528003,5,2.2756892230576441E-2,6.7669172932330828E-5,2.2756892230576441E-2,6.7669172932330828E-5,1,4.4618864906075417E-2,"N/A",1.0623539263351289E-4,"N/A"]
[null,17063,"arndell_park","Urban",1,0,2.0394800000000002,3.8840546539999998,0,9.9388799999999999E-2,0,0,0,0,0,1,8.3988451587906666E-3,"N/A",1.7497594080813889E-5,"N/A"]
[null,17067,"arndell_park","Urban",1183,2.2160423443057198,4.9060765544209399,2.9361898489999998,0.21186675000000002,1.1766924000000001,2,1.7951127819548874E-2,1.3157894736842105E-4,1.1875939849624061E-2,1.0150375939849624E-4,2,9.9436327504968058E-2,"N/A",1.9497319118621189E-4,"N/A"]
[null,17069,"arndell_park","Urban",25,0.75994000000000006,4.4333696027566605,3.429460599,0,6.2118E-3,0,0,0,0,0,1,5.2492782242441667E-4,"N/A",1.2498281486295635E-6,"N/A",null,null," "]
[null,17070,"arndell_park","Urban",3,0.49007000000000001,1.7003499999999998,3.347534596,1.73043E-3,0,1,1.4661654135338345E-4,3.7593984962406014E-6,1.4661654135338345E-4,3.7593984962406014E-6,0,0,"N/A",0,"N/A"]
[null,1949,"marayong","Urban",2,7.5889999999999999E-2,1.03736003587189,6.4418606839999999,0,2.83968E-2,0,0,0,0,0,1,2.3996700453687617E-3,"N/A",4.999312594518254E-6,"N/A"]
[null,1950,"marayong","Urban",349,3.5908574434567599,2.4231369196044303,4.1915629540000001,0.75102141000000011,0.1144746,3,6.3632832080200499E-2,4.6992481203007516E-4,6.3632832080200499E-2,4.6992481203007516E-4,3,9.6736698703928214E-3,"N/A",1.9997250378073016E-5,"N/A"]
[null,1952,"marayong","Urban",344,1.4431906443487201,3.5636192902325301,1.512392124,9.0797647267080756E-2,0,2,7.6931381248151439E-3,6.9428228957486881E-5,7.6931381248151439E-3,6.9428228957486881E-5,0,0,"N/A",0,"N/A"]
[null,1953,"marayong","Urban",24,1.51522717243575,2.8021702052175503,2.9365709010000001,0,2.30724E-2,0,0,0,0,0,2,1.9497319118621189E-3,"N/A",6.2491407431478175E-6,"N/A"]
[null,1954,"marayong","Urban",415,0.46711594702777803,5.1188992965336499,5.1441908979999997,1.1973540300000003,4.437E-3,7,0.10144987468671679,1.954887218045113E-4,9.2382205513784454E-2,1.7293233082706769E-4,1,3.7494844458886903E-4,"N/A",1.2498281486295635E-6,"N/A"]
[null,1957,"marayong","Urban",2151,10.305312150803701,3.7570194152754204,4.4100958050000001,4.6072286916094738,0.69927119999999998,7,0.39036305195116533,1.8175023041965676E-3,0.37846580884339592,1.7636175924171189E-3,3,5.9091874867205754E-2,"N/A",1.3373161190336329E-4,"N/A"]
[null,1958,"marayong","Urban",151,2.3080648368305301,1.56158,4.4773513380000001,0.14608082999999999,3.37212E-2,1,1.2377192982456141E-2,1.8922305764411027E-4,1.2377192982456141E-2,1.8922305764411027E-4,2,2.8496081788754045E-3,"N/A",7.498968891777381E-6,"N/A"]
[null,1959,"marayong","Urban",881,5.1585159320819098,1.82227862574405,4.391995874,2.2658279999999999E-2,1.06488E-2,3,1.9197994987468672E-3,1.3784461152882206E-5,1.9197994987468672E-3,1.3784461152882206E-5,1,8.998762670132857E-4,"N/A",1.2498281486295635E-6,"N/A"]
[null,1962,"marayong","Urban",1932,7.6355729467157998,3.7951808621333298,5.3427185619999999,8.4067289483905263,0.92999520000000002,7,0.71228857712151639,4.2138260166054379E-3,0.71228857712151639,4.2138260166054379E-3,6,7.8589193985826949E-2,"N/A",1.787254252540276E-4,"N/A"]
[null,19816,"west_castle_hill","Urban",953,1.7798761020357798,11.7907549423375,4.4049516139999998,2.2114926490074192,0.1703808,6,0.1873762032708054,4.6562515138911078E-3,0.1873762032708054,4.6562515138911078E-3,2,1.4398020272212571E-2,"N/A",1.8747422229443452E-4,"N/A"]
[null,19856,"springwood","Urban",1330,14.656104475711111,4.4178581847194094,3.8547137130000002,5.2486456200000005,5.6096991000000003,7,0.44470927318295739,4.9335839598997492E-3,0.20856641604010026,3.8145363408521298E-3,16,0.47404731849370713,"N/A",1.0111109722413169E-3,"N/A"]
[null,19857,"springwood","Urban",2441,21.685139266739696,3.4644151385575297,7.5230934009999997,9.4329732600000007,13.956139800000001,15,0.79924060150375953,5.418546365914787E-3,0.13061904761904763,1.244360902255639E-3,21,1.1793628376098286,"N/A",2.453412655759833E-3,"N/A"]
[null,19870,"lennox","Urban",1562,0.35143075352562697,2.7659633035981099,2.28916495,0,0.63759690000000002,0,0,0,0,0,2,5.3880091487420484E-2,"N/A",1.4872954968691806E-4,"N/A"]
[null,19871,"lennox","Urban",1732,0.29140850514683703,4.0198579200562099,2.8515964880000002,4.0774846800000004,0,2,0.34547869674185461,4.0050125313283204E-3,0.34547869674185461,4.0050125313283204E-3,0,0,"N/A",0,"N/A"]
[null,19890,"penrith_11kv","Urban",151,1.81910422223918,3.8490452544295097,4.8149626809999999,0.81229638000000004,3.19464E-2,2,6.8824561403508774E-2,3.4210526315789472E-4,1.1033834586466165E-2,1.8922305764411027E-4,3,2.6996288010398568E-3,"N/A",6.2491407431478175E-6,"N/A"]
[null,19891,"penrith_11kv","Urban",204,1.76397000825902,3.1938103899058099,3.4326995340000002,1.7557477521613886E-2,8.8739999999999999E-2,1,1.4876167363654135E-3,2.4793612272756767E-4,1.4876167363654135E-3,2.4793612272756767E-4,3,7.4989688917773802E-3,"N/A",1.7497594080813889E-5,"N/A"]
[null,19894,"penrith_11kv","Urban",1071,7.2599709830847994,0.82001243788678302,3.1002323810000001,9.6578700000000007E-3,0,2,8.1829573934837085E-4,5.0125313283208019E-6,8.1829573934837085E-4,5.0125313283208019E-6,0,0,"N/A",0,"N/A"]
[null,19898,"penrith_11kv","Urban",145,3.5060051404675603,1.3333787694307799,1.6141327889999999,0.46913705247838616,0.29106720000000003,5,3.9749225368897752E-2,6.5431951637017665E-4,3.9749225368897752E-2,6.5431951637017665E-4,4,2.4596617965029807E-2,"N/A",5.1242954093812102E-5,"N/A"]
[null,2,"","Urban",0,0,0,0,0,1.06488E-2,0,0,0,0,0,1,8.998762670132857E-4,"N/A",1.2498281486295635E-6,"N/A"]
[null,20700,"penrith_11kv","Urban",296,0,3.05799904555793,4.3820885430000001,0.39826512000000003,5.2356600000000003E-2,2,3.3744360902255639E-2,2.6441102756892228E-4,3.354636591478697E-2,2.631578947368421E-4,2,4.4243916461486543E-3,"N/A",2.1247078526702578E-5,"N/A"]
[null,20717,"penrith_11kv","Urban",4,0.17272984971535801,0.6718946122566859,2.3114564440000001,0,0.57503519999999997,0,0,0,0,0,1,4.8593318418717425E-2,"N/A",1.0123608003899464E-4,"N/A"]
[null,20718,"penrith_11kv","Urban",1777,3.1046566280988399,6.1194131066776496,0,1.7456489099999999,6.0272208000000003,6,0.14790601503759399,2.4047619047619052E-3,0.14790601503759399,2.4047619047619052E-3,7,0.50932996712951961,"N/A",1.0048618314981691E-3,"N/A"]
[null,20719,"penrith_11kv","Urban",478,0.66257943577593303,1.6959900000000001,2.9624823810000001,6.0165720000000006E-2,5.3244E-3,1,5.0977443609022555E-3,1.1278195488721805E-5,5.0977443609022555E-3,1.1278195488721805E-5,1,4.4993813350664285E-4,"N/A",1.2498281486295635E-6,"N/A"]
[null,20722,"penrith_11kv","Urban",688,0.41676613610893998,4.4967178034904096,3.021926364,8.0546340000000008E-2,0,3,6.8245614035087722E-3,1.0150375939849623E-4,6.8245614035087722E-3,1.0150375939849623E-4,0,0,"N/A",0,"N/A"]
[null,20723,"penrith_11kv","Urban",277,0.14191478908644398,6.22536149975058,4.6200550040000001,0.25344144000000002,0.78446159999999998,1,2.1473684210526315E-2,7.0175438596491223E-5,2.1473684210526315E-2,7.0175438596491223E-5,2,6.6290885003312039E-2,"N/A",1.4373023709239978E-4,"N/A"]
[null,20725,"penrith_11kv","Urban",1,0,0.59960999999999998,4.9119402059999997,0,7.0992E-3,0,0,0,0,0,1,5.9991751134219043E-4,"N/A",2.499656297259127E-6,"N/A"]
[null,25449,"kembla_grange","Rural Short",153,19.147484380339101,2.58535,0.67236480300000001,1.6015139455824177,1.779237,10,0.65436439850595107,4.030722931610658E-3,0.65436439850595107,4.030722931610658E-3,12,0.7370013906842533,"N/A",1.7276341826513674E-3,"N/A"]
[null,25450,"kembla_grange","Rural Short",1183,16.728582015851703,0.44693600337037298,2.8472143999999999,4.1798666401098856,2.1075750000000002,7,1.707856448790342,1.4587953758482949E-2,1.7064363290168361,1.4581910695616967E-2,6,0.87300663485042485,"N/A",1.9481832272451589E-3,"N/A"]
[null,25451,"kembla_grange","Rural Short",28,3.18541366056956,0.79917544175117705,0.81849793000000004,6.5590757010989084E-2,0.14819579999999999,1,2.6799801760975111E-2,1.6316269738154087E-4,2.6799801760975111E-2,1.6316269738154087E-4,2,6.1386150745271977E-2,"N/A",2.2667540694361907E-4,"N/A"]
[null,25737,"prestons","Urban",618,0,5.4649535154677693,1.809993094,0,8.4303000000000003E-2,0,0,0,0,0,2,7.1240204471885119E-3,"N/A",2.2496906675332143E-5,"N/A"]
[null,25738,"prestons","Urban",958,1.5073513551697599,5.7659671234755594,2.4768326549999999,2.9556927599999998,0.25468380000000002,4,0.25043107769423562,2.4185463659147869E-3,5.8751879699248118E-2,1.2205513784461152E-3,3,2.152204071940108E-2,"N/A",3.624501631025734E-5,"N/A"]
[null,25740,"prestons","Urban",1124,9.1569999999999999E-2,9.6320984917030099,3.4115511939999998,9.3472800000000009E-2,6.2118E-3,4,7.9197994987468667E-3,3.8847117794486211E-5,7.9197994987468667E-3,3.8847117794486211E-5,1,5.2492782242441667E-4,"N/A",1.2498281486295635E-6,"N/A"]
[null,25741,"prestons","Urban",296,1.9715400000000001,3.5676600000000001,3.671618622,1.0826280000000001E-2,1.0169604000000001,1,9.172932330827068E-4,7.5187969924812028E-6,9.172932330827068E-4,7.5187969924812028E-6,6,8.5938183499768783E-2,"N/A",2.5246528602317184E-4,"N/A"]
[null,25744,"prestons","Rural Short",604,9.1912400000000005,6.5920699999999997,1.896682237,1.9215168000000002,1.428714,9,0.78511472754851075,8.1702209948090083E-3,0.406516838994676,7.7472065941901992E-3,16,0.59180660299334054,"N/A",2.7568630574223941E-3,"N/A"]
[null,25746,"prestons","Urban",666,1.3089410434520401,4.8717511913309997,3.277611705,1.3161361243397045,3.01716E-2,8,0.1115140898510394,2.1079942471295531E-3,8.6138150001415351E-2,1.2759140466282997E-3,2,2.5496494232043095E-3,"N/A",4.999312594518254E-6,"N/A"]
[null,25747,"prestons","Urban",540,4.6360160700599895,9.6475300000000015,3.4325090079999998,1.2858426000000001,0,1,0.10894736842105263,6.7669172932330822E-4,0.10894736842105263,6.7669172932330822E-4,0,0,"N/A",0,"N/A"]
[null,25773,"parklea","Urban",1708,8.4030000000000007E-2,11.69322,10.344777369999999,0.50693275179108255,0,2,4.2951593977428572E-2,4.9372646609007519E-3,4.2951593977428572E-2,4.9372646609007519E-3,0,0,"N/A",0,"N/A"]
[null,25774,"parklea","Urban",1727,0.22036,11.988298552631001,8.0020747310000004,5.5139159515806613,0,4,0.46718520028779364,8.3874423345437731E-3,0.46718520028779364,8.3874423345437731E-3,0,0,"N/A",0,"N/A"]
[null,25775,"parklea","Urban",1062,0.46929132109773597,9.7172809772677784,5.2897524479999998,1.524419423116232,0,7,0.12916159763135288,4.1209216678971938E-3,0.11658014399726767,4.0958590112555896E-3,0,0,"N/A",0,"N/A"]
[null,25776,"parklea","Urban",2,0,3.0618300000000001,5.1902980909999998,5.0271921342685301E-4,0,2,4.2594587671583711E-5,5.0113384664064913E-6,4.2594587671583711E-5,5.0113384664064913E-6,0,0,"N/A",0,"N/A"]
[null,25777,"parklea","Urban",677,0,6.6388100000000003,8.3831259090000003,1.4908436445315634,1.7566082999999999,3,0.12631677609605177,2.5384445268984085E-3,0.12631677609605177,2.5384445268984085E-3,3,0.14844208921273327,"N/A",5.6492232318056275E-4,"N/A"]
[null,25779,"parklea","Urban",736,0,9.5499100000000006,3.9042503659999999,0.6626144221142285,1.41984E-2,2,5.6142250666747023E-2,1.0233729363488884E-3,5.6142250666747023E-2,1.0233729363488884E-3,1,1.1998350226843809E-3,"N/A",2.499656297259127E-6,"N/A"]
[null,25780,"parklea","Urban",1661,0.53885068427704008,12.001112004002,6.3780346120000004,0.4123368046743493,0.32301360000000001,4,3.4936632036001884E-2,4.2196030532242485E-3,3.4936632036001884E-2,4.2196030532242485E-3,1,2.7296246766069666E-2,"N/A",6.4991063728737296E-5,"N/A"]
[null,25781,"parklea","Urban",1885,1.3850451700436299,14.893179355223499,6.549507642,1.8140379366883763,0.70548299999999997,4,0.15370050690353132,4.7933589610298253E-3,0.14856892795616292,4.7745619685486225E-3,1,5.9616802689630176E-2,"N/A",1.9872267563210059E-4,"N/A"]
[null,25782,"parklea","Urban",1065,0,12.86566,7.5192828890000003,0.15669938311623188,1.6816230000000001,1,1.3276885851904261E-2,1.3276885851904261E-3,1.3276885851904261E-2,1.3276885851904261E-3,2,0.14210546049918138,"N/A",3.3370411568409342E-4,"N/A"]
[null,25783,"parklea","Urban",2689,6.5995516350285524,23.546788637774899,7.8107870400000001,14.31490577605461,1.9389689999999999,14,1.2128788651865137,1.661257323544332E-2,1.2122786145599471,1.6610066969779159E-2,15,0.16385247028533576,"N/A",3.1370686530602043E-4,"N/A"]
[null,25784,"parklea","Urban",1995,0,20.73405,3.6420871560000001,0.19720469535571133,0.18635399999999999,1,1.6708835590981453E-2,1.6708835590981456E-3,1.6708835590981453E-2,1.6708835590981456E-3,2,1.57478346727325E-2,"N/A",3.7494844458886902E-5,"N/A"]
[null,27027,"narellan","Urban",757,0,5.3018799999999997,4.7821922800000003,8.5486200000000012E-2,0,2,7.2431077694235591E-3,1.8796992481203009E-4,7.2431077694235591E-3,1.8796992481203009E-4,0,0,"N/A",0,"N/A"]
[null,27028,"narellan","Urban",0,0,0,0,0,1.86354E-2,0,0,0,0,0,1,1.57478346727325E-3,"N/A",3.7494844458886905E-6,"N/A"]
[null,27029,"narellan","Urban",663,1.94418,18.285234294602201,4.5916666910000004,1.5322440000000001E-2,2.39598E-2,2,1.2982456140350877E-3,3.7593984962406014E-6,1.2982456140350877E-3,3.7593984962406014E-6,2,2.024721600779893E-3,"N/A",3.7494844458886905E-6,"N/A"]
[null,27030,"narellan","Urban",1623,0,10.8395959846463,4.2677731899999998,5.713377E-2,0,1,4.8408521303258149E-3,2.031328320802005E-3,4.8408521303258149E-3,2.031328320802005E-3,0,0,"N/A",0,"N/A"]
[null,27031,"narellan","Urban",442,18.3618285362069,6.0822399999999996,1.54325727,2.3590050000000001E-2,0.35229779999999999,3,1.99874686716792E-3,8.7719298245614046E-6,1.99874686716792E-3,8.7719298245614046E-6,4,2.9770906500356201E-2,"N/A",4.999312594518254E-5,"N/A"]
[null,27033,"narellan","Urban",414,0,10.44645,1.983942957,2.3752740000000001E-2,2.7953100000000002E-2,1,2.0125313283208021E-3,1.8796992481203007E-5,2.0125313283208021E-3,1.8796992481203007E-5,1,2.3621752009098749E-3,"N/A",8.7487970404069445E-6,"N/A"]
[null,27035,"narellan","Rural Short",519,0,13.577830000000001,1.4034114870000001,0,0.27598139999999999,0,0,0,0,0,5,0.11431792144778194,"N/A",2.2054904459379156E-4,"N/A"]
[null,27038,"narellan","Urban",185,0,5.1636999999999995,3.0497431000000002,0,4.437E-3,0,0,0,0,0,1,3.7494844458886903E-4,"N/A",1.2498281486295635E-6,"N/A"]
[null,27039,"narellan","Urban",1143,0,7.4257128822412595,4.820297397,0,0.64868939999999997,0,0,0,0,0,2,5.4817462598892648E-2,"N/A",1.5247903413280676E-4,"N/A"]
[null,27040,"narellan","Urban",1198,0,14.524608756363799,3.2960926869999998,0.16476060000000001,7.5429E-3,2,1.3959899749373433E-2,8.020050125313283E-5,1.3959899749373433E-2,8.020050125313283E-5,1,6.3741235580107736E-4,"N/A",1.2498281486295635E-6,"N/A"]
[null,27142,"bossley_park","Urban",615,4.6160288668941396E-2,4.3251612569283697,2.7982493229999998,1.0500900000000001E-2,0,4,8.8972431077694232E-4,1.1278195488721805E-5,8.8972431077694232E-4,1.1278195488721805E-5,0,0,"N/A",0,"N/A"]
[null,27187,"west_castle_hill","Urban",625,1.18707391153631,7.5288737371060801,4.2062334249999997,9.0176060095190344E-2,0.48807,1,7.6404720468505891E-3,7.6404720468505895E-4,7.6404720468505891E-3,7.6404720468505895E-4,3,4.1244328904775598E-2,"N/A",1.3123195560610417E-4,"N/A"]
[null,27188,"west_castle_hill","Urban",348,0.48997087777063003,1.48236166015946,3.310382106,0.27175647274298598,0.16505639999999999,2,2.3025487378265298E-2,4.7096979045810897E-4,2.3025487378265298E-2,4.7096979045810897E-4,2,1.3948082138705929E-2,"N/A",3.1245703715739086E-5,"N/A"]
[null,27189,"west_castle_hill","Urban",70,0,2.6404552849774698,2.2400093480000001,4.582717808116238E-3,3.9933000000000003E-2,1,3.8828628434814535E-4,3.8828628434814537E-5,3.8828628434814535E-4,3.8828628434814537E-5,1,3.3745360012998214E-3,"N/A",6.2491407431478175E-6,"N/A"]
[null,27191,"west_castle_hill","Urban",1061,3.1124360993459401,6.9910473758553797,3.8310885400000001,6.1567573589053115,1.3226697000000001,5,0.52165211532086742,2.4768656674250752E-3,3.5444095270741979E-2,1.3164646649188095E-3,5,0.11177213133194186,"N/A",3.0245841196835436E-4,"N/A"]
[null,27194,"west_castle_hill","Urban",785,0,11.560986380025701,5.3629142740000004,4.6528259944689383,0.1277856,8,0.39422643783808214,2.8992101998483182E-3,0.39215500926665359,2.8979570670162381E-3,2,1.0798515204159427E-2,"N/A",4.4993813350664286E-5,"N/A"]
[null,27199,"west_castle_hill","Urban",24,0,2.0817399999999999,0,3.547910561122242E-3,0,1,3.0060873626953135E-4,3.0060873626953135E-5,3.0060873626953135E-4,3.0060873626953135E-5,0,0,"N/A",0,"N/A"]
[null,27200,"west_castle_hill","Urban",570,0.14300390040548799,3.78032937784024,4.1370726360000001,8.4262875826653358E-2,0,1,7.1394574864013785E-3,7.1394574864013774E-4,7.1394574864013785E-3,7.1394574864013774E-4,0,0,"N/A",0,"N/A"]
[null,27201,"west_castle_hill","Urban",595,1.2455345862790901,3.6938599999999999,1.353493783,4.2310396172344722E-2,0,2,3.5848915876866543E-3,3.3192274272856519E-4,3.5848915876866543E-3,3.3192274272856519E-4,0,0,"N/A",0,"N/A"]
[null,27334,"bow_bowing","Urban",1768,6.4595624757299204,8.7175692797873197,3.6944816930000002,1.4108033100000001,0.64425239999999995,13,0.11953508771929824,3.5839598997493733E-4,8.1399749373433583E-2,3.182957393483709E-4,3,5.4442514154303782E-2,"N/A",1.2873229930884504E-4,"N/A"]
[null,27335,"bow_bowing","Urban",506,4.2143944735796603,1.2695014759938499,3.257987569,5.1617099999999999E-3,0.21475079999999999,1,4.3734335839599E-4,1.2531328320802005E-6,4.3734335839599E-4,1.2531328320802005E-6,2,1.8147504718101264E-2,"N/A",3.2495531864368648E-5,"N/A"]
[null,27336,"bow_bowing","Urban",9,0.27838999999999997,1.7107075876278299,3.6580913060000002,0,7.0992E-3,0,0,0,0,0,1,5.9991751134219043E-4,"N/A",2.499656297259127E-6,"N/A"]
[null,27339,"bow_bowing","Urban",30,0,3.6387926830503501,2.0767289180000001,0,6.6555E-3,0,0,0,0,0,1,5.6242266688330349E-4,"N/A",1.2498281486295635E-6,"N/A"]
[null,27340,"bow_bowing","Urban",616,0.21356082870618801,8.6304583103329211,3.7524014719999998,0.98437803000000001,0.40066109999999999,6,8.3404761904761912E-2,8.6090225563909765E-4,8.3404761904761912E-2,8.6090225563909765E-4,4,3.3857844546374867E-2,"N/A",9.9986251890365067E-5,"N/A"]
[null,27446,"north_richmond","Rural Short",378,1.88219,2.6920600000000001,5.9228689799999996,0.52679022000000009,1.6132932,11,0.2152418131605823,3.9279908628889459E-4,0.2152418131605823,3.9279908628889459E-4,7,0.66826360511918836,"N/A",1.7460132697008498E-3,"N/A"]
[null,27447,"north_richmond","Urban",228,0.95550000000000002,0.69540000000000002,2.802250361,7.325487E-2,2.3671395,1,6.2067669172932334E-3,3.5087719298245611E-5,6.2067669172932334E-3,3.5087719298245611E-5,7,0.20003499518816165,"N/A",4.449388209121246E-4,"N/A"]
[null,27454,"north_richmond","Rural Short",481,20.915787253055498,4.64961,3.0623177890000002,6.7999243499999995,1.2774122999999999,9,2.7783887985786717,7.3967089479631855E-3,0.59250418482103462,2.036512185836269E-3,6,0.52913391615460492,"N/A",1.1946406582163708E-3,"N/A"]
[null,2806,"dundas","Urban",867,4.4491678202433906,3.4688585276395201,4.3698949049999998,4.6851009439618183,0.72544949999999997,2,0.39696104222369805,2.4072591981146238E-3,0.11541604010025062,1.0827067669172932E-3,1,6.1304070690280085E-2,"N/A",1.3623126820062241E-4,"N/A"]
[null,2807,"dundas","Urban",1231,7.51966620509259,2.6493517194118801,3.2987600449999999,4.7250661360381825,0,1,0.4003472284529937,1.8834676189279824E-3,0,0,0,0,"N/A",0,"N/A"]
[null,2809,"dundas","Urban",624,3.3598174553142099,1.6919688899508001,2.7965345930000001,1.2916698599999998,0,5,0.10944110275689223,2.5275689223057643E-3,0.10944110275689223,2.5275689223057643E-3,0,0,"N/A",0,"N/A"]
[null,2810,"dundas","Urban",1368,5.7136867603583195,1.4179289589714799,3.2583686200000002,4.1184968293611481,0,7,0.34895358997232329,3.4717072995395864E-3,0.13300872781693485,1.7624341165821927E-3,0,0,"N/A",0,"N/A"]
[null,2812,"dundas","Urban",1782,5.0243863106283397,1.3979661539866399,2.8578838320000002,9.3732184553668745,0,9,0.79417767333876221,3.8356263923698146E-3,0.24615138707498785,2.0914786967418573E-3,0,0,"N/A",0,"N/A"]
[null,2813,"dundas","Urban",851,6.1465246225001202,0.33434309482545804,3.1974004319999998,1.7723152800000004,0,4,0.15016541353383459,1.0827067669172935E-3,0.15016541353383459,1.0827067669172935E-3,0,0,"N/A",0,"N/A"]
[null,2815,"dundas","Urban",2201,8.6318324562197706,0.96999000000000002,3.9593122620000001,13.047568285632462,2.1546072000000001,8,1.1054994048366742,4.8847117794486219E-3,5.018796992481203E-3,2.3684210526315788E-4,5,0.18207496469235479,"N/A",4.1994225793953331E-4,"N/A"]
[null,2816,"dundas","Urban",733,5.6156390255151001,0.19633,3.1964478039999999,1.6559771400000001,1.2849552,6,0.14030827067669174,1.8746867167919801E-3,0.1038045112781955,9.5363408521303256E-4,1,0.10858506955293647,"N/A",2.2621889490195097E-4,"N/A"]
[null,3,"","Urban",0,0,0,0,0,3.90456E-2,0,0,0,0,0,1,3.2995463123820473E-3,"N/A",4.999312594518254E-6,"N/A"]
[null,3345,"northmead","Urban",194,0,0,0.51346646200000001,0.63567420000000008,0.42240240000000001,1,5.3859649122807017E-2,3.5087719298245611E-5,0,0,2,3.5695091924860332E-2,"N/A",9.3737111147217258E-5,"N/A"]
[null,3347,"northmead","Urban",719,0,0,3.6323703510000001,0.33545199000000003,2.3777883000000002,2,2.8422305764411029E-2,8.1453634085213028E-5,2.2655388471177946E-2,7.3934837092731829E-5,3,0.20093487145517491,"N/A",4.0244466385871947E-4,"N/A"]
[null,3348,"northmead","Urban",702,0,0,1.8069446840000001,1.3902600000000002E-3,2.3857748999999999,1,1.1779448621553885E-4,1.2531328320802005E-6,1.1779448621553885E-4,1.2531328320802005E-6,5,0.20160977865543486,"N/A",4.3743985202034726E-4,"N/A"]
[null,3351,"northmead","Urban",1866,0,0,4.1793693169999999,5.7262738800000008,0.17792369999999999,3,0.48517794486215537,2.3596491228070173E-3,2.9624060150375939E-3,1.8796992481203007E-5,3,1.5035432628013648E-2,"N/A",3.7494844458886909E-5,"N/A"]
[null,3353,"northmead","Urban",1075,0,0,4.8387783799999999,1.5722335140495807,0.76760099999999998,1,0.1332128083943446,1.333499036848321E-3,0.1332128083943446,1.333499036848321E-3,2,6.4866080913874344E-2,"N/A",1.4498006524102936E-4,"N/A"]
[null,3357,"northmead","Urban",818,0,0,4.4996428310000001,0.93906147000000006,1.5050304000000001,3,7.9565162907268172E-2,1.9824561403508772E-3,7.9565162907268172E-2,1.9824561403508772E-3,3,0.1271825124045444,"N/A",2.6496356750946743E-4,"N/A"]
[null,3358,"northmead","Urban",336,0,0,2.7344232509999999,0,0.56438639999999995,0,0,0,0,0,1,4.7693442151704138E-2,"N/A",1.3248178375473371E-4,"N/A"]
[null,3360,"northmead","Urban",1215,0,0,4.6038603289999998,0,7.7203800000000003E-2,0,0,0,0,0,3,6.5241029358463209E-3,"N/A",1.8747422229443454E-5,"N/A"]
[null,35001,"quarries","Urban",903,3.0263239282274998,3.8868299999999998,2.8622659210000001,0.73075911000000005,0,2,6.1916040100250626E-2,1.1428571428571429E-3,6.1916040100250626E-2,1.1428571428571429E-3,0,0,"N/A",0,"N/A"]
[null,35005,"quarries","Urban",667,3.0917444240023602,2.8740378186764803,2.4741652969999999,0.51129029999999998,0,1,4.3320802005012531E-2,1.2280701754385965E-4,4.3320802005012531E-2,1.2280701754385965E-4,0,0,"N/A",0,"N/A"]
[null,35009,"quarries","Urban",11,0.34894999999999998,2.4923299999999999,2.0673931639999998,0,7.0992E-3,0,0,0,0,0,1,5.9991751134219043E-4,"N/A",1.2498281486295635E-6,"N/A"]
[null,35011,"quarries","Urban",72,0,2.3580799999999997,1.8551476579999999,2.3072399999999999E-3,0,1,1.9548872180451127E-4,1.2531328320802005E-6,1.9548872180451127E-4,1.2531328320802005E-6,0,0,"N/A",0,"N/A"]
[null,35015,"quarries","Urban",15,0,2.3404499999999997,0.77924965800000001,0,1.7748E-2,0,0,0,0,0,1,1.4997937783554761E-3,"N/A",2.499656297259127E-6,"N/A"]
[null,35304,"baulkham_hills_11kv","Urban",1067,6.14331603294674,1.3451799665064901,4.3474128859999999,4.7326816799999998,4.3873056000000004,3,0.40099248120300757,2.6691729323308272E-3,0.10117167919799498,1.3370927318295739E-3,6,0.37074902200947374,"N/A",7.723937958530702E-4,"N/A"]
[null,35305,"baulkham_hills_11kv","Urban",1070,6.1007820279494798,0.29863000000000001,2.7024149519999998,2.4347297999999999,0,3,0.20629072681704261,1.4724310776942356E-3,5.9711779448621558E-3,1.3784461152882205E-4,0,0,"N/A",0,"N/A"]
[null,35306,"baulkham_hills_11kv","Urban",474,2.4651919330779002,1.96058956669664,2.2095252539999999,0.84923002767146927,0.70903260000000001,3,7.1953889767646745E-2,5.9273182957393482E-4,7.1953889767646745E-2,5.9273182957393482E-4,1,5.9916761445301274E-2,"N/A",1.1748384597117896E-4,"N/A"]
[null,35307,"baulkham_hills_11kv","Urban",517,3.95355537432529,0.67588006310026605,2.4211991830000001,0.25605927000000001,1.3311E-2,2,2.1695488721804511E-2,1.2907268170426065E-4,2.1695488721804511E-2,1.2907268170426065E-4,1,1.124845333766607E-3,"N/A",2.499656297259127E-6,"N/A"]
[null,35312,"baulkham_hills_11kv","Urban",98,1.1644826504575601,0.86194999999999999,1.341871722,0,5.67936E-2,0,0,0,0,0,2,4.7993400907375234E-3,"N/A",9.998625189036508E-6,"N/A"]
[null,35314,"baulkham_hills_11kv","Urban",425,3.09413011818947,1.43194,3.2846611509999999,2.1149700000000003E-3,0,1,1.7919799498746866E-4,1.2531328320802005E-6,1.7919799498746866E-4,1.2531328320802005E-6,0,0,"N/A",0,"N/A"]
[null,35315,"baulkham_hills_11kv","Urban",1322,3.5262409980359597,1.83851515612576,4.9610958079999996,2.5787518023285325,0.40376699999999999,5,0.21849347865340599,1.904761904761905E-3,0.21849347865340599,1.904761904761905E-3,1,3.4120308457587081E-2,"N/A",8.1238829660921626E-5,"N/A"]
[null,35325,"baulkham_hills_11kv","Urban",832,6.2066099485573005,2.3550897244721201,3.414028026,0.9630804300000001,8.7621876000000007,3,8.1600250626566409E-2,1.0952380952380953E-3,8.0944862155388472E-2,1.0902255639097746E-3,13,0.74044818837409854,"N/A",1.7935033932834235E-3,"N/A"]
[null,35326,"baulkham_hills_11kv","Urban",465,4.2110972358394498,3.1020967022611599,2.0157607299999998,0.36235500000000004,0,2,3.0701754385964911E-2,6.1654135338345864E-4,3.0701754385964911E-2,6.1654135338345864E-4,0,0,"N/A",0,"N/A"]
[null,35327,"baulkham_hills_11kv","Urban",1385,6.4703882066867804,0.54572632589070202,3.581309493,15.557541840000001,0,6,1.3181654135338348,2.2343358395989976E-3,0.36138220551378447,5.0877192982456141E-4,0,0,"N/A",0,"N/A"]
[null,35333,"baulkham_hills_11kv","Urban",1003,4.2035241793139404,1.01891544991209,3.5658769210000001,5.5367252400000009,0.35141040000000001,6,0.46911779448621554,3.8909774436090222E-3,0.28333458646616538,2.644110275689223E-3,1,2.9695916811438426E-2,"N/A",5.4992438539700794E-5,"N/A"]
[null,35335,"baulkham_hills_11kv","Urban",637,2.8404237060852,1.3130825388559999,3.555398013,0,2.271744,0,0,0,0,0,6,0.19197360362950092,"N/A",3.7619827273749861E-4,"N/A"]
[null,35388,"north_parramatta","Urban",1562,1.88454507258713,4.5791915084806201,3.3340072790000002,2.3657936100000003,2.6622E-2,2,0.20044987468671679,2.8947368421052633E-3,0.19740476190476192,2.8609022556390978E-3,1,2.249690667533214E-3,"N/A",1.8747422229443451E-5,"N/A"]
[null,35418,"wisemans","Rural Short",359,44.290416157557495,0.46059,0.99035201100000003,16.763852813918909,0.61984890000000004,17,6.849561624786876,1.4837322816695697E-2,2.7727334989132557,1.1516404884256058E-2,5,0.25675584608127228,"N/A",5.4524624913465138E-4,"N/A"]
[null,35440,"homepride","Urban",5,0,3.0442600000000004,2.9531466270000002,0,1.7748E-3,0,0,0,0,0,1,1.4997937783554761E-4,"N/A",2.499656297259127E-6,"N/A"]
[null,35441,"homepride","Urban",13,0,1.9389344541934399,4.1380252640000004,3.1443539999999999E-2,0,1,2.6641604010025064E-3,5.9649122807017548E-4,2.6641604010025064E-3,5.9649122807017548E-4,0,0,"N/A",0,"N/A"]
[null,35442,"homepride","Urban",750,0,5.5901811878298906,4.0842970479999998,1.41984E-2,0.50581799999999999,1,1.2030075187969924E-3,1.8796992481203007E-5,1.2030075187969924E-3,1.8796992481203007E-5,1,4.2744122683131068E-2,"N/A",7.1240204471885118E-5,"N/A"]
[null,35443,"homepride","Urban",445,1.7800000000000001E-3,3.2012841366029101,3.2044498789999998,0,0.41929650000000002,0,0,0,0,0,1,3.5432628013648125E-2,"N/A",7.8739173363662503E-5,"N/A"]
[null,35444,"homepride","Urban",40,1.05030952474891,2.2179230103446899,2.6673582439999999,0,1.50858E-2,0,0,0,0,0,2,1.2748247116021547E-3,"N/A",2.499656297259127E-6,"N/A"]
[null,35569,"liverpool_11kv","Urban",1078,4.8585872587063701,0.83671529903415598,3.0484094210000001,0.31910904000000001,0.3718206,3,2.7037593984962405E-2,1.1779448621553884E-4,2.7037593984962405E-2,1.1779448621553884E-4,2,3.1420679656547226E-2,"N/A",6.4991063728737296E-5,"N/A"]
[null,35570,"liverpool_11kv","Urban",809,0.57389000000000001,4.3912924264915798,4.0118973240000004,0,2.2628700000000002E-2,0,0,0,0,0,2,1.9122370674032321E-3,"N/A",2.3746734823961708E-5,"N/A"]
[null,35571,"liverpool_11kv","Urban",1818,5.69275027679556,3.3994325690778902,3.6236061739999998,6.5632649200000026,3.3295248000000002,4,0.5560948449555263,2.2560080690314662E-3,8.9010025062656647E-3,1.7543859649122806E-5,9,0.28136131281948734,"N/A",5.5992301058604445E-4,"N/A"]
[null,35572,"liverpool_11kv","Urban",1507,1.37773757029183,3.8893899999999997,2.1110235240000002,0.48409149000000001,1.2263868,1,4.1016290726817041E-2,8.897243107769424E-5,4.1016290726817041E-2,8.897243107769424E-5,4,0.10363575008436339,"N/A",2.2246941045606227E-4,"N/A"]
[null,35590,"kembla_grange","Urban",1,0,0.44341000000000003,0.184238244,5.1358572967033014E-3,8.0753400000000003E-2,2,4.3515290056643486E-4,2.5062656641604009E-6,4.3515290056643486E-4,2.5062656641604009E-6,1,6.8240616915174164E-3,"N/A",1.6247765932184324E-5,"N/A"]
[null,35693,"springwood","Rural Short",930,18.227566605696499,1.4824900000000001,1.9591746299999999,5.9266931700000001,2.6413460999999998,8,2.4215942808453037,1.1391173502377942E-2,2.05830951359387,9.4876086995932998E-3,6,1.094107052055701,"N/A",2.4199131281818793E-3,"N/A"]
[null,35694,"springwood","Urban",242,7.1969849498806096E-2,0.96466999999999992,1.143153533,9.2733299999999998E-3,0.65445750000000003,2,7.8571428571428564E-4,3.7593984962406014E-6,7.8571428571428564E-4,3.7593984962406014E-6,2,5.5304895576858179E-2,"N/A",1.162340178225494E-4,"N/A"]
[null,35695,"springwood","Rural Short",369,9.4632653660344808,0.99044546402720302,1.0153108630000001,2.7313728300000006,2.1421836000000001,8,1.1160147209011415,1.1880661594522567E-2,0.66486381957831509,9.8743647230162129E-3,13,0.88734232274902125,"N/A",1.7827714437998149E-3,"N/A"]
[null,35696,"springwood","Urban",1374,13.3097148953144,1.8630276967770201,3.7365878480000001,3.3194084399999997,12.6485559,7,0.28124812030075191,1.805764411027569E-3,0.17212531328320804,9.1854636591478687E-4,13,1.068865530989489,"N/A",2.2221944482633637E-3,"N/A"]
[null,35701,"springwood","Urban",1075,10.3836983723952,2.5449774360541602,2.520844066,1.06245444,3.4990182000000001,5,9.0020050125313278E-2,1.1278195488721805E-4,2.7745614035087719E-2,6.5162907268170419E-5,9,0.29568434340278216,"N/A",6.1366562097711565E-4,"N/A"]
[null,35702,"springwood","Urban",858,7.26268803199949,1.4393359343527299,2.0872078260000002,1.05236766,7.4532726,8,8.9165413533834559E-2,2.7869674185463655E-3,8.9165413533834559E-2,2.7869674185463655E-3,14,0.62983839722038215,"N/A",1.2723250553048956E-3,"N/A"]
[null,35761,"werrington","Urban",154,1.75723007876154,2.0468199999999999,2.8336870830000001,3.3100020000000001E-2,0,2,2.8045112781954888E-3,7.5187969924812028E-6,2.8045112781954888E-3,7.5187969924812028E-6,0,0,"N/A",0,"N/A"]
[null,35762,"werrington","Urban",517,2.5192478910721303,3.73382983732313,4.0963001600000002,1.8618983100000002,1.7748E-2,11,0.15775563909774434,9.8997493734335833E-4,0.15775563909774434,9.8997493734335833E-4,1,1.4997937783554761E-3,"N/A",4.999312594518254E-6,"N/A"]
[null,35763,"werrington","Urban",251,5.1372938452810608,1.1150205449058899,4.5434637169999998,1.1438142300000003,0.15085799999999999,4,9.6913533834586466E-2,6.3909774436090238E-4,9.6561403508771931E-2,6.3408521303258154E-4,1,1.2748247116021547E-2,"N/A",2.1247078526702578E-5,"N/A"]
[null,35764,"werrington","Urban",89,1.8973359297628001,1.8844118786516899,2.670597179,0.12152943000000001,0.17969850000000001,1,1.0296992481203008E-2,1.0150375939849624E-4,1.0296992481203008E-2,1.0150375939849624E-4,3,1.5185412005849195E-2,"N/A",3.3745360012998216E-5,"N/A"]
[null,35765,"werrington","Urban",1100,6.6994648678804598,0.247503998690801,3.3620145410000002,4.7533580999999998,0.36205920000000003,5,0.40274436090225557,1.6177944862155388E-3,0.39719423558897238,1.550125313283208E-3,1,3.0595793078451713E-2,"N/A",6.3741235580107734E-5,"N/A"]
[null,35766,"werrington","Urban",368,2.2668713413230699,0.181614088422553,1.2227932290000001,0.28784297999999997,0,4,2.4388471177944862E-2,2.4060150375939849E-4,2.4388471177944862E-2,2.4060150375939849E-4,0,0,"N/A",0,"N/A"]
[null,35767,"werrington","Urban",562,2.80627901413445,2.4381698236026002,4.7471355710000003,5.5965360000000006E-2,4.437E-3,2,4.7418546365914794E-3,3.7593984962406014E-6,0,0,1,3.7494844458886903E-4,"N/A",1.2498281486295635E-6,"N/A"]
[null,35769,"werrington","Urban",72,3.4126939042204798,1.0084030935497501,3.8105117769999999,4.7328000000000002E-4,0,1,4.0100250626566415E-5,6.2656641604010028E-6,4.0100250626566415E-5,6.2656641604010028E-6,0,0,"N/A",0,"N/A"]
[null,35771,"werrington","Urban",151,3.33826473234374,1.15123540168407,1.7389270489999999,1.0690951500000001,4.25952E-2,2,9.0582706766917293E-2,1.5288220551378448E-4,9.0582706766917293E-2,1.5288220551378448E-4,1,3.5995050680531428E-3,"N/A",7.498968891777381E-6,"N/A"]
[null,35772,"werrington","Urban",1030,0,10.218110000000001,2.0957814770000001,5.197206E-2,2.5290900000000002E-2,1,4.4035087719298243E-3,1.7543859649122806E-5,4.4035087719298243E-3,1.7543859649122806E-5,1,2.1372061341565535E-3,"N/A",3.7494844458886905E-6,"N/A"]
[null,35773,"werrington","Urban",402,3.5104779759496099,1.5724200000000002,4.1538388880000001,0.79148685000000008,0.10249469999999999,4,6.7061403508771933E-2,4.7117794486215545E-4,6.6708020050125313E-2,4.6992481203007522E-4,1,8.661309070002874E-3,"N/A",1.3748109634925199E-5,"N/A"]
[null,35815,"tahmoor","Rural Short",507,16.835467908734099,0.23451914509727398,1.8671507709999999,3.0636093607493171,0.1677186,6,1.2517636216242121,9.245696685079241E-3,1.2517636216242121,9.245696685079241E-3,3,6.9472949047044333E-2,"N/A",1.6541178344534364E-4,"N/A"]
[null,35816,"tahmoor","Rural Short",1077,33.686287219613,7.1160000000000001E-2,3.3197178599999999,3.884837588928896,0.66111299999999995,11,1.5873101943225905,1.3403747557235059E-2,1.5636516032022671,1.3313101614245313E-2,9,0.27384839703729114,"N/A",6.1876259733258197E-4,"N/A"]
[null,35818,"tahmoor","Rural Short",1365,24.814357273838102,1.18285,4.3618928309999996,2.5868862918924274,1.69518543,5,1.0569788025054476,8.8325384814338416E-3,1.0249747415672017,8.7841939785059768E-3,14,0.70218527345018344,"N/A",1.5560960368561959E-3,"N/A"]
[null,35824,"tahmoor","Rural Short",1197,13.847849120645801,0.77039000000000002,2.5911480079999998,5.2598707473363673,1.6203924000000001,11,2.1491365512575134,1.9079328850717493E-2,2.035889553148992,1.8614013010036803E-2,5,0.67120425904710568,"N/A",1.580601486255506E-3,"N/A"]
[null,35825,"tahmoor","Rural Short",1126,27.887939430139198,1.2549300000000001,3.4275553429999999,3.088385280229724,0.70992,4,1.2618868426507592,1.370044762128989E-2,1.2618868426507592,1.370044762128989E-2,2,0.29406539279172206,"N/A",9.128279901243039E-4,"N/A"]
[null,35827,"tahmoor","Rural Short",152,8.4393729843091503,0.33097000000000004,2.0005186830000001,0.98246690583773977,8.5190399999999999E-2,2,0.40142726678331697,1.8388494938174631E-3,0.40142726678331697,1.8388494938174631E-3,1,3.5287847135006649E-2,"N/A",7.3516348197930509E-5,"N/A"]
[null,35980,"maldon","Rural Short",442,30.771500033798699,0.12559999999999999,1.479240672,1.5286186042835002,0.22806180000000001,4,0.62458000837027539,5.413596614910852E-3,0.62458000837027539,5.413596614910852E-3,5,9.4468507434340709E-2,"N/A",2.1442268224396402E-4,"N/A"]
[null,35981,"maldon","Rural Short",453,12.317954947017601,1.2657730919277899,2.197331616,0.88182637299544198,1.5476255999999999,3,0.36030643738290902,3.0448432228148952E-3,0.36030643738290902,3.0448432228148952E-3,5,0.6410625562859541,"N/A",1.3355469922624044E-3,"N/A"]
[null,35982,"maldon","Rural Short",454,46.000621996382201,1.4327156863942501,2.4387275370000001,1.1854458662187792,1.6785171000000001,15,0.48436267030289032,6.2596138478421687E-3,0.42337003679652396,3.3226852949744322E-3,11,0.69528086308192782,"N/A",1.5377169498067131E-3,"N/A"]
[null,35983,"maldon","Rural Short",1045,24.1423385104668,6.7715576566590299,3.908251404,4.7142582798869626,0.46411019999999997,11,1.926204134674629,2.2062912933792266E-2,1.54634928904467,2.0872429549193616E-2,7,0.19224525053758831,"N/A",5.7587806088378905E-4,"N/A"]
[null,35988,"maldon","Rural Short",633,52.9527375354483,3.4221399999999997,2.3625173020000001,4.3398061020628989,1.8914930999999999,14,1.7732062948575193,8.3103291594645474E-3,0.71042491474282188,5.935405453133231E-3,15,0.78350048091944446,"N/A",1.7276341826513671E-3,"N/A"]
[null,35989,"maldon","Rural Short",292,35.247703609546299,0.62282000000000004,2.6403036100000001,0.95481639683409314,0.92289600000000005,19,0.39012951396482692,2.6744001638997657E-3,0.3712268133200321,2.5777111580440374E-3,7,0.38228501062923875,"N/A",8.2705891722671828E-4,"N/A"]
[null,35990,"maldon","Rural Short",1139,43.907834842829601,3.2805489716808203,3.3913554810000002,2.7888918289416571,3.6986832000000001,17,1.1395164738824022,8.7392202596872082E-3,1.1364949424494106,8.727134133955242E-3,29,1.5320806964448721,"N/A",3.3817520171048037E-3,"N/A"]
[null,41361,"parklea","Urban",1607,0,10.304575448336401,4.585188821,0.33415573838176282,0.3407616,2,2.8312476456672682E-2,2.0504205779981076E-3,2.8312476456672682E-2,2.0504205779981076E-3,1,2.8796040544425142E-2,"N/A",7.9989001512292064E-5,"N/A"]
[null,41362,"parklea","Urban",458,0.53347,6.8315600000000005,1.827140397,0.19300683987474948,0.35141040000000001,2,1.6353158070527018E-2,6.0624312534844106E-4,1.6353158070527018E-2,6.0624312534844106E-4,1,2.9695916811438426E-2,"N/A",1.2373298671432677E-4,"N/A"]
[null,41363,"parklea","Urban",544,0,4.8388299999999997,3.5216749840000001,8.5063929198396782E-2,6.5667600000000007E-2,2,7.2073294458591354E-3,6.7386577666611396E-4,7.2073294458591354E-3,6.7386577666611396E-4,2,5.5492369799152617E-3,"N/A",2.249690667533214E-5,"N/A"]
[null,41367,"parklea","Urban",738,0,8.2374899999999993,2.0207143950000002,0.10776778329408813,0.13577220000000001,1,9.1309903641870176E-3,9.1309903641870172E-4,9.1309903641870176E-3,9.1309903641870172E-4,2,1.1473422404419393E-2,"N/A",2.8746047418479959E-5,"N/A"]
[null,41533,"werrington","Rural Short",1164,18.835581060302097,3.3770290319398302,3.8722420670000002,3.95542281,1.5733602,9,1.6161506898156262,3.0396606215894462E-3,0.34529456909940237,2.3386653291354188E-3,4,0.65172242677465397,"N/A",1.4090633404603347E-3,"N/A"]
[null,41534,"werrington","Urban",274,0,3.0570300000000001,1.002736174,0,1.2127799999999999E-2,0,0,0,0,0,1,1.024859081876242E-3,"N/A",4.999312594518254E-6,"N/A"]
[null,41535,"werrington","Urban",1700,11.2285210528118,1.30899079777689,4.5461310749999999,5.6753962800000002,2.3675831999999999,12,0.48086716791979944,2.3433583959899746E-3,0.11406265664160402,1.2318295739348372E-3,7,0.20007249003262051,"N/A",4.1744260164227421E-4,"N/A"]
[null,41537,"werrington","Urban",1380,7.1927570955911095,1.87581,4.1915629540000001,4.5713079900000002,1.7024769,6,0.38731954887218045,3.0275689223057643E-3,4.0875939849624059E-2,1.299498746867168E-3,5,0.14386771818874902,"N/A",2.9495944307657697E-4,"N/A"]
[null,4368,"richmond","Rural Short",728,0,0,5.5677292820000002,12.31743655317762,4.1707800000000003E-2,6,5.0327953643413963,1.6563100272663837E-2,1.3084719883921645,1.2003956621397041E-2,3,1.7276341826513671E-2,"N/A",5.5137261148447882E-5,"N/A"]
[null,4369,"richmond","Urban",1,0,0,5.6654689100000004,3.8348108617768601E-3,0,2,3.2491733574782628E-4,1.6852082799152242E-6,1.1729702498320726E-4,1.2504243317226779E-6,0,0,"N/A",0,"N/A"]
[null,4370,"richmond","Urban",705,0,0,3.5052897829999998,3.7831207301380245,0,3,0.32053771431096539,2.080345507292762E-3,0.17354253428961453,1.7725184719724386E-3,0,0,"N/A",0,"N/A"]
[null,4372,"richmond","Urban",1049,0,0,3.2867569329999999,10.042978450912031,0.28929240000000001,6,0.85092535691087334,6.1831227446282576E-3,0.22037345164062894,3.0941510837612768E-3,2,2.4446638587194262E-2,"N/A",5.2492782242441664E-5,"N/A"]
[null,4374,"richmond","Urban",336,0,0,4.6352970510000002,0.90992000813493978,1.3914432000000001,3,7.7096053871573769E-2,6.3009603870596987E-4,5.8648512491603641E-3,6.2521216586133949E-5,2,0.11758383222306933,"N/A",2.4496631713139444E-4,"N/A"]
[null,4375,"richmond","Urban",407,0,0,4.3830411710000003,1.5903182667756206,0,3,0.13474510030787082,6.9892936071698367E-4,4.8790291651318547E-2,5.189288061652694E-4,0,0,"N/A",0,"N/A"]
[null,443,"","Urban",0,0,0,0,0,0.1277856,0,0,0,0,0,1,1.0798515204159429E-2,"N/A",2.2496906675332143E-5,"N/A"]
[null,446,"","Urban",0,0,0,0,0,3.5496E-3,0,0,0,0,0,1,2.9995875567109521E-4,"N/A",1.2498281486295635E-6,"N/A"]
[null,46395,"newton","Urban",829,3.4135568418286399,3.7702773694820997,3.5451096309999999,3.9785100000000002E-3,2.3453982,1,3.3709273182957393E-4,1.2531328320802005E-6,3.3709273182957393E-4,1.2531328320802005E-6,7,0.19819774780967614,"N/A",4.5993675869567929E-4,"N/A"]
[null,46397,"newton","Urban",1109,2.5633169220063801,3.5561384064899499,3.2126424789999999,0.11058483,10.9656018,2,9.3696741854636598E-3,2.2631578947368419E-3,9.0476190476190474E-3,2.2619047619047618E-3,10,0.92664758595693086,"N/A",1.9422329429703415E-3,"N/A"]
[null,46750,"arndell_park","Urban",95,0.96635493432181208,2.4995895460619901,2.1832327220000001,5.5018800000000007E-3,0,1,4.6616541353383461E-4,1.1654135338345865E-4,4.6616541353383461E-4,1.1654135338345865E-4,0,0,"N/A",0,"N/A"]
[null,46752,"arndell_park","Urban",1957,6.5022883341718698,2.3424999999999998,4.1153527189999997,7.3259011200000002,12.6072918,8,0.62071177944862144,2.4398496240601504E-3,8.8795739348370928E-2,1.7794486215538848E-4,12,1.0653785104548121,"N/A",2.2659384334653985E-3,"N/A"]
[null,46768,"arndell_park","Urban",96,0.77858622516866605,0.71109449202680697,2.5557102490000001,1.1358720000000001E-2,0.73742940000000001,1,9.6240601503759396E-4,1.0025062656641604E-5,9.6240601503759396E-4,1.0025062656641604E-5,4,6.2316431490670031E-2,"N/A",1.6247765932184325E-4,"N/A"]
[null,46772,"arndell_park","Urban",9,1.02925,1.3413599999999999,2.283449182,0,2.2628700000000002E-2,0,0,0,0,0,1,1.9122370674032321E-3,"N/A",3.7494844458886905E-6,"N/A"]
[null,46774,"arndell_park","Urban",772,0.88516911172591195,6.2043896708338702,3.2524623269999999,0,2.7953100000000002E-2,0,0,0,0,0,3,2.3621752009098749E-3,"N/A",4.999312594518254E-6,"N/A"]
[null,48159,"hinchinbrook","Urban",776,0,3.9380491988833,3.382591304,6.5800709999999998E-2,0,2,5.575187969924812E-3,3.3834586466165414E-5,5.575187969924812E-3,3.3834586466165414E-5,0,0,"N/A",0,"N/A"]
[null,48161,"hinchinbrook","Urban",1062,0.86324016340250098,8.7198319991827304,3.3919270579999998,0.61856217000000002,1.1212298999999999,4,5.2409774436090233E-2,1.3997493734335838E-3,5.2409774436090233E-2,1.3997493734335838E-3,3,9.4749471947607203E-2,"N/A",2.0872130082113711E-4,"N/A"]
[null,48166,"hinchinbrook","Urban",375,0.82111999999999996,5.2165942359623791,1.6389011149999999,0,0.1632816,0,0,0,0,0,1,1.379810276087038E-2,"N/A",2.8746047418479959E-5,"N/A"]
[null,48168,"hinchinbrook","Urban",725,1.7410000000000002E-2,9.8748087287234299,5.5010453259999998,4.2447300000000004E-3,7.0992E-3,1,3.5964912280701756E-4,1.2531328320802005E-6,3.5964912280701756E-4,1.2531328320802005E-6,1,5.9991751134219043E-4,"N/A",1.2498281486295635E-6,"N/A"]
[null,48178,"hinchinbrook","Urban",1006,5.7909999999999996E-2,8.1839184329258501,4.3218824570000001,1.5489271199999999,0,2,0.13123809523809524,1.2606516290726818E-3,0.13123809523809524,1.2606516290726818E-3,0,0,"N/A",0,"N/A"]
[null,48180,"hinchinbrook","Urban",522,0.2273,5.5034999999999998,3.8922472539999999,0,1.1230047000000001,0,0,0,0,0,2,9.4899451325442752E-2,"N/A",1.3998075264651111E-4,"N/A"]
[null,48185,"hinchinbrook","Rural Short",863,4.9526473789763905,8.444840000000001,1.7162545039999999,1.9416817722580642,3.1622498999999999,4,0.79335395642249884,4.6448596384471678E-3,0.42424367656825757,3.9196920945292089E-3,15,1.3098775340166269,"N/A",2.3586495046836039E-3,"N/A"]
[null,48187,"hinchinbrook","Urban",574,0,5.8113000000000001,2.6734550619999999,0.48041736774193561,0,1,4.0704988277144485E-2,3.9019207003684333E-4,4.0704988277144485E-2,3.9019207003684333E-4,0,0,"N/A",0,"N/A"]
[null,48189,"hinchinbrook","Urban",1065,0,7.0954949768622599,5.6006902089999997,9.7687950000000009E-2,0,2,8.2769423558897246E-3,2.1917293233082707E-3,1.7543859649122807E-3,1.7543859649122806E-5,0,0,"N/A",0,"N/A"]
[null,48196,"hinchinbrook","Rural Short",775,16.3092334815966,1.8111400000000002,3.1511027139999999,1.7932431300000002,0.24447869999999999,5,0.73270324331184011,5.1668187504154599E-3,0.63084137564283072,4.9976129901679366E-3,2,0.10126876964264929,"N/A",1.7766450814499875E-4,"N/A"]
[null,48203,"hinchinbrook","Urban",940,0.76833000000000007,10.481290000000001,1.8839170220000001,0,0.1171368,0,0,0,0,0,1,9.8986389371461432E-3,"N/A",2.7496219269850397E-5,"N/A"]
[null,48205,"hinchinbrook","Urban",1142,0.32488,7.5109899999999996,3.0626988399999999,0.10823322,0,1,9.1704260651629069E-3,1.0025062656641604E-4,9.1704260651629069E-3,1.0025062656641604E-4,0,0,"N/A",0,"N/A"]
[null,4857,"yennora","Urban",558,3.7464760640606403,0.49318901992804398,1.9808945469999999,3.2904805536082873,0.43305120000000003,6,0.27879710717024875,1.673213440348157E-3,0.23308282145596304,1.6130630644083073E-3,4,3.659496819187362E-2,"N/A",5.6242266688330349E-5,"N/A"]
[null,4859,"yennora","Urban",245,2.0321975240871,0.52352516055595,0.56890940800000001,1.1372241685514881,0,2,9.6355168563014029E-2,6.9861868302338852E-4,9.6355168563014029E-2,6.9861868302338852E-4,0,0,"N/A",0,"N/A"]
[null,4860,"yennora","Urban",219,2.1256423945475098,1.24379,2.5860038169999999,1.0253660536119986,6.2118E-3,2,8.687761099943897E-2,6.299020912505953E-4,8.687761099943897E-2,6.299020912505953E-4,1,5.2492782242441667E-4,"N/A",1.2498281486295635E-6,"N/A"]
[null,4866,"yennora","Urban",1027,5.1627420392921906,0.98927919036009493,3.4292700730000001,2.3962648800453459,2.5015806,2,0.20303165622349872,1.3150216841934838E-3,0.19743767126109271,1.2849464962235589E-3,3,0.21139593305920434,"N/A",3.9494569496694202E-4,"N/A"]
[null,4867,"yennora","Urban",83,0.33932000000000001,0.29281999999999997,1.5661203400000001,0.18869279274513451,1.3311E-2,1,1.5987635819190851E-2,1.0404932603566353E-4,1.5987635819190851E-2,1.0404932603566353E-4,2,1.124845333766607E-3,"N/A",3.7494844458886905E-6,"N/A"]
[null,4869,"yennora","Urban",1027,4.2418219278025102,1.8082760236864301,2.249154576,6.7392045428943899,9.2733299999999998E-3,9,0.57100192527417171,4.4503628710923296E-3,0.55371245158996119,4.4240470816186463E-3,1,7.8364224919073627E-4,"N/A",3.7494844458886905E-6,"N/A"]
[null,4870,"yennora","Urban",267,3.2377249085506801,1.5844320998543802,3.169012119,0.83056959964103594,0.71391329999999997,5,7.0372821814596989E-2,4.1867231843068799E-4,7.0372821814596989E-2,4.1867231843068799E-4,5,6.032920473434903E-2,"N/A",8.1238829660921626E-5,"N/A"]
[null,4871,"yennora","Urban",444,3.4219572548565602,0.20068081423966699,1.049033892,1.1600035936878894,0.26267040000000003,4,9.8285232493665664E-2,5.9419472543061774E-4,9.8285232493665664E-2,5.9419472543061774E-4,2,2.2196947919661047E-2,"N/A",4.6243641499293848E-5,"N/A"]
[null,4873,"yennora","Urban",1410,7.5635285914886001,1.59635356071799,3.1669163380000001,7.0279331681012671,0.47076570000000001,9,0.59546543574125188,4.8916436661273436E-3,0.59546543574125188,4.8916436661273436E-3,2,3.9782029970878999E-2,"N/A",6.3741235580107734E-5,"N/A"]
[null,4874,"yennora","Urban",22,0.66712747563245001,1.0082599999999999,1.390265222,5.0014957113168321E-2,0.35451630000000001,1,4.2376866026771053E-3,2.7579339431139725E-5,4.2376866026771053E-3,2.7579339431139725E-5,5,2.9958380722650634E-2,"N/A",4.6243641499293848E-5,"N/A"]
[null,48999,"quakers_hill","Urban",160,0.84994000000000003,4.8293800000000005,1.253086798,7.0873680000000008E-2,0.82350719999999999,3,6.0050125313283204E-3,1.5037593984962407E-5,5.240601503759398E-3,1.3784461152882206E-5,2,6.959043131569409E-2,"N/A",1.5497869043006585E-4,"N/A"]
[null,49006,"quakers_hill","Urban",1045,0,8.2330311067104009,2.0443395679999998,0.71166521999999999,6.2118E-3,5,6.0298245614035087E-2,1.4912280701754387E-4,6.0298245614035087E-2,1.4912280701754387E-4,1,5.2492782242441667E-4,"N/A",1.2498281486295635E-6,"N/A"]
[null,49008,"quakers_hill","Urban",961,2.9835960715112702,5.9803173895282802,1.8713423339999999,1.882583273291932E-2,0.79777260000000005,2,1.5950824265633084E-3,9.5191394635657517E-6,1.5950824265633084E-3,9.5191394635657517E-6,3,6.741573033707865E-2,"N/A",1.7497594080813887E-4,"N/A"]
[null,49010,"quakers_hill","Urban",668,3.1995127947337001,3.5013254945140804,1.5743129410000001,2.243643E-2,6.2118E-3,1,1.9010025062656641E-3,1.2531328320802005E-6,1.9010025062656641E-3,1.2531328320802005E-6,1,5.2492782242441667E-4,"N/A",1.2498281486295635E-6,"N/A"]
[null,49319,"bella_vista","Urban",872,0,7.04448855372046,5.34538592,0.19373791490981959,0,2,1.6415100878448621E-2,1.5443922933586465E-3,1.6415100878448621E-2,1.5443922933586465E-3,0,0,"N/A",0,"N/A"]
[null,49321,"bella_vista","Urban",1,0,3.2221199999999999,3.8230864659999999,1.478296067134268E-4,0,1,1.2525364011230476E-5,1.2525364011230477E-6,1.2525364011230476E-5,1.2525364011230477E-6,0,0,"N/A",0,"N/A"]
[null,49328,"bella_vista","Urban",710,0,6.2383042178279702,3.1398617039999999,0.10436770233967939,0,1,8.8429069919287225E-3,8.8429069919287214E-4,8.8429069919287225E-3,8.8429069919287214E-4,0,0,"N/A",0,"N/A"]
[null,49335,"bella_vista","Urban",6,0,1.5474000000000001,9.9835409E-2,8.8697764028056051E-4,0.10116360000000001,1,7.5152184067382838E-5,7.5152184067382838E-6,7.5152184067382838E-5,7.5152184067382838E-6,2,8.548824536626214E-3,"N/A",2.9995875567109524E-5,"N/A"]
[null,49337,"bella_vista","Urban",434,1.0665499999999999,7.4365899999999998,3.4631836279999999,0.68724602970691384,0.4596732,2,5.8229247027890368E-2,1.0862079108090864E-3,5.8229247027890368E-2,1.0862079108090864E-3,4,3.8844658859406835E-2,"N/A",1.4622989338965891E-4,"N/A"]
[null,49339,"bella_vista","Urban",5,0,1.6083000000000001,0.90613969999999999,7.3914803356713401E-4,0,1,6.2626820056152385E-5,6.2626820056152382E-6,6.2626820056152385E-5,6.2626820056152382E-6,0,0,"N/A",0,"N/A"]
[null,49341,"bella_vista","Urban",1175,4.6194899473666897,7.2798370215229493,5.1672444950000003,0.29608408878006065,0,2,2.5086727025479573E-2,1.8224571637008395E-3,1.787369444402594E-2,1.787369444402594E-3,0,0,"N/A",0,"N/A"]
[null,49348,"bella_vista","Urban",927,0,6.6081517659071398,3.710866894,0.16280222542334663,3.19464E-2,2,1.3793969831894362E-2,1.1936826974751503E-3,1.3793969831894362E-2,1.1936826974751503E-3,1,2.6996288010398572E-3,"N/A",1.4997937783554762E-5,"N/A"]
[null,49353,"bella_vista","Urban",73,0,5.2136499999999995,2.88131848,3.4869681290080154E-2,3.1059E-3,2,2.9544518234463908E-3,1.1900407958774686E-4,2.9544518234463908E-3,1.1900407958774686E-4,1,2.6246391121220833E-4,"N/A",1.2498281486295635E-6,"N/A"]
[null,49355,"bella_vista","Urban",4,0,0.87541000000000002,1.5535456510000001,5.9131842685370751E-4,0,1,5.0101456044921933E-5,5.0101456044921934E-6,5.0101456044921933E-5,5.0101456044921934E-6,0,0,"N/A",0,"N/A"]
[null,49357,"bella_vista","Urban",971,2.1730737503051198,7.3005656877445597,4.0096110170000001,0.38188332772545092,0.47520269999999998,5,3.2356358079567653E-2,1.3540568605883447E-3,3.2356358079567653E-2,1.3540568605883447E-3,1,4.0156978415467871E-2,"N/A",7.8739173363662503E-5,"N/A"]
[null,49362,"bella_vista","Urban",1069,0.121488287105711,8.4122299999999992,3.8716704910000002,0.19832379300601197,0.81152729999999995,3,1.6803654928905426E-2,1.2838742648203672E-3,1.6803654928905426E-2,1.2838742648203672E-3,2,6.8578070515304151E-2,"N/A",1.7622576895676845E-4,"N/A"]
[null,49364,"bella_vista","Urban",1,0,0.84951999999999994,0.49079391700000002,1.478296067134268E-4,0,1,1.2525364011230476E-5,1.2525364011230477E-6,1.2525364011230476E-5,1.2525364011230477E-6,0,0,"N/A",0,"N/A"]
[null,49366,"bella_vista","Urban",353,0,4.7831490755442196,3.4601352190000001,5.2036021563126297E-2,0.24314759999999999,1,4.4089281319531328E-3,4.408928131953133E-4,4.4089281319531328E-3,4.408928131953133E-4,2,2.0547174763470021E-2,"N/A",7.6239517066403365E-5,"N/A"]
[null,49373,"bella_vista","Urban",110,0,2.1128800000000001,1.5230615569999999,1.566993831162319E-2,0.1477521,1,1.3276885851904261E-3,1.327688585190426E-4,1.3276885851904261E-3,1.327688585190426E-4,2,1.248578320480934E-2,"N/A",5.1242954093812102E-5,"N/A"]
[null,49375,"bella_vista","Urban",0,0,1.35216,1.5790760800000001,0,0,1,0,0,0,0,0,0,"N/A",0,"N/A"]
[null,49382,"bella_vista","Urban",188,0,3.4535067202854499,2.7612873590000002,2.7791966062124224E-2,5.3244E-3,1,2.3547684341113282E-3,2.3547684341113285E-4,2.3547684341113282E-3,2.3547684341113285E-4,1,4.4993813350664285E-4,"N/A",2.499656297259127E-6,"N/A"]
[null,49391,"bella_vista","Urban",874,0,6.4122504337818498,2.5337998060000002,0.28624117705911822,0.64691460000000001,3,2.4252752999733798E-2,9.3818256814380584E-4,2.4252752999733798E-2,9.3818256814380584E-4,2,5.4667483221057106E-2,"N/A",1.2873229930884504E-4,"N/A"]
[null,49395,"bella_vista","Urban",150,0,5.9348400000000003,4.3820885430000001,2.7791966062124224E-2,0.35407260000000002,1,2.3547684341113282E-3,2.3547684341113285E-4,2.3547684341113282E-3,2.3547684341113285E-4,7,2.992088587819175E-2,"N/A",9.8736423741735519E-5,"N/A"]
[null,49397,"bella_vista","Urban",45,0,4.4344671948543199,2.7325179949999998,6.8001619088176287E-3,7.0992E-3,1,5.761667445166015E-4,5.7616674451660149E-5,5.761667445166015E-4,5.7616674451660149E-5,1,5.9991751134219043E-4,"N/A",2.499656297259127E-6,"N/A"]
[null,49914,"smithfield","Urban",650,4.0572240486388704,0.62900999999999996,2.0843499419999998,3.517062E-2,0,2,2.9799498746867171E-3,4.7619047619047614E-5,2.9799498746867171E-3,4.7619047619047614E-5,0,0,"N/A",0,"N/A"]
[null,49915,"smithfield","Urban",1099,5.2063392124689996,0.26049800218914998,2.8087282309999999,7.3373929500000008,0.63182879999999997,5,0.6216854636591479,3.7857142857142855E-3,0.30931829573934833,2.4335839598997495E-3,1,5.3392658509454953E-2,"N/A",1.1123470522803115E-4,"N/A"]
[null,49916,"smithfield","Urban",909,2.1526147939579903,4.33055307146088,3.5773084559999999,5.356938E-2,1.1784672,4,4.5388471177944863E-3,1.7543859649122806E-5,4.5388471177944863E-3,1.7543859649122806E-5,2,9.9586306882803621E-2,"N/A",2.0247216007798928E-4,"N/A"]
[null,49917,"smithfield","Urban",296,2.87676836353923,1.1864728949995,3.393641788,0,6.2118E-3,0,0,0,0,0,1,5.2492782242441667E-4,"N/A",1.2498281486295635E-6,"N/A"]
[null,49918,"smithfield","Urban",1176,1.66512806659735,6.1491708722383702,4.0105636450000004,0.59733851999999998,0.85900319999999997,10,5.0611528822055142E-2,1.2807017543859656E-3,5.0611528822055142E-2,1.2807017543859656E-3,2,7.2590018872405043E-2,"N/A",1.4373023709239981E-4,"N/A"]
[null,52237,"bonnyrigg","Urban",577,0,7.0094832164870908,2.7346137769999999,0.43303641000000004,0,1,3.669047619047619E-2,7.807017543859649E-4,3.669047619047619E-2,7.807017543859649E-4,0,0,"N/A",0,"N/A"]
[null,52238,"bonnyrigg","Urban",150,0,2.36459518623144,4.8521151710000003,8.5900320000000002E-2,0,1,7.2781954887218047E-3,3.0075187969924811E-5,7.2781954887218047E-3,3.0075187969924811E-5,0,0,"N/A",0,"N/A"]
[null,53312,"MOBILE 1","Urban",1475,0,0,0,2.93010606,0.417078,5,0.24826315789473685,4.7631578947368424E-3,0.10791729323308272,4.1879699248120305E-3,2,3.5245153791353692E-2,"N/A",8.9987626701328572E-5,"N/A"]
[null,53314,"MOBILE 1","Urban",1455,0,0,0,9.1638840000000013E-2,0.32301360000000001,2,7.7644110275689225E-3,9.8997493734335833E-4,7.7644110275689225E-3,9.8997493734335833E-4,2,2.7296246766069666E-2,"N/A",5.6242266688330356E-5,"N/A"]
[null,53803,"prestons","Urban",844,6.855E-2,6.3841260483984694,3.890151473,1.638732E-2,0.1672749,1,1.3884711779448623E-3,1.2531328320802005E-6,1.3884711779448623E-3,1.2531328320802005E-6,1,1.4135556361000362E-2,"N/A",3.624501631025734E-5,"N/A"]
[null,53807,"prestons","Urban",287,4.8194099999999995,6.1752200000000004,0.28578838299999998,0.63004669071654396,7.0992E-2,5,5.3382839342824943E-2,8.5209599340817807E-4,4.8672313027035473E-2,8.4332406358361668E-4,1,5.9991751134219045E-3,"N/A",1.2498281486295635E-5,"N/A"]
[null,5463,"parramatta","Urban",21,0,0,2.139983414,0,0.37093320000000002,0,0,0,0,0,2,3.1345689967629452E-2,"N/A",5.4992438539700794E-5,"N/A"]
[null,5464,"parramatta","Urban",856,0,0,1.6430926779999999,0.33026070000000002,7.0992E-3,1,2.7982456140350876E-2,7.2681704260651631E-5,2.7982456140350876E-2,7.2681704260651631E-5,1,5.9991751134219043E-4,"N/A",1.2498281486295635E-6,"N/A"]
[null,5469,"parramatta","Urban",31,0,0,2.6119152969999999,0,7.9865999999999999E-3,0,0,0,0,0,3,6.749072002599643E-4,"N/A",3.3745360012998216E-5,"N/A"]
[null,54695,"eastern_creek","Urban",5,1.5335699999999999,1.1576099999999998,1.007118263,0,2.92842E-2,0,0,0,0,0,1,2.4746597342865358E-3,"N/A",3.7494844458886905E-6,"N/A"]
[null,5471,"parramatta","Urban",844,0,0,2.4554937890000001,0,7.0992E-3,0,0,0,0,0,1,5.9991751134219043E-4,"N/A",2.499656297259127E-6,"N/A"]
[null,5472,"parramatta","Urban",324,0,0,3.4908098390000002,0,1.1240399999999999E-2,0,0,0,0,0,2,9.4986939295846817E-4,"N/A",9.498693929584682E-5,"N/A"]
[null,5475,"parramatta","Urban",277,0,5.1619999999999999E-2,4.0528603260000002,0,0.27509400000000001,0,0,0,0,0,1,2.324680356450988E-2,"N/A",3.8744672607516464E-5,"N/A"]
[null,5479,"parramatta","Urban",173,0,0,3.4999550670000001,0,0.22184999999999999,0,0,0,0,0,1,1.874742222944345E-2,"N/A",2.499656297259127E-5,"N/A"]
[null,5494,"dundas","Urban",841,1.63188199251013,4.8626764714996096,3.616366202,1.1107290000000001E-2,0,2,9.4110275689223062E-4,3.7593984962406014E-6,2.882205513784461E-5,1.2531328320802005E-6,0,0,"N/A",0,"N/A"]
[null,5495,"dundas","Urban",2962,4.3970454616158703,2.4773944098959602,4.0010373650000002,21.408927534633129,0,9,1.8139438805459496,1.0719511452241714E-2,1.0887809437520797,8.5263157894736822E-3,0,0,"N/A",0,"N/A"]
[null,5496,"dundas","Urban",950,6.3822077088313298,1.0650234302314401,2.4937894319999998,7.0397447206388515,1.3071402000000001,4,0.5964662095264236,4.6323027255230631E-3,0.5964662095264236,4.6323027255230631E-3,5,0.11045981177588081,"N/A",2.5121545787454226E-4,"N/A"]
[null,5498,"dundas","Urban",2053,3.17511363701382,1.5090720483312601,4.3540812820000001,1.121082E-2,1.1522889000000001,4,9.4987468671679201E-4,3.8847117794486204E-5,9.4987468671679201E-4,3.8847117794486204E-5,3,9.737411105972929E-2,"N/A",3.34953943832723E-4,"N/A"]
[null,5499,"st_marys","Urban",2,0,0,3.2351244979999998,2.4244511586456342E-2,0,2,2.0541983412263199E-3,5.0127831383945608E-6,2.0541983412263199E-3,5.0127831383945608E-6,0,0,"N/A",0,"N/A"]
[null,5500,"st_marys","Urban",741,0,0,2.6686919229999999,0,1.0883961,0,0,0,0,0,5,9.1974853457649566E-2,"N/A",1.9997250378073016E-4,"N/A"]
[null,5501,"st_marys","Rural Short",855,0,0,4.5552763030000003,2.9673767500371784,0.6815232,4,1.2124438301237981,6.0556656848224618E-3,1.2124438301237981,6.0556656848224618E-3,3,0.28230277708005319,"N/A",5.8813078558344408E-4,"N/A"]
[null,5503,"st_marys","Urban",813,0,0,2.6277289210000001,1.9818600000000002E-3,0,2,1.6791979949874687E-4,2.5062656641604009E-6,1.6791979949874687E-4,2.5062656641604009E-6,0,0,"N/A",0,"N/A"]
[null,5504,"st_marys","Urban",1728,0,0,2.409386596,6.5287919747623899,0.6531264,5,0.55317400793755755,4.2809144079932583E-3,0.54385069966688093,4.2433204230308517E-3,1,5.5192411043481521E-2,"N/A",1.1498418967391984E-4,"N/A"]
[null,5506,"st_marys","Urban",1151,0,0,3.750115165,5.4035362242801179,1.3559471999999999,7,0.45783290412306266,2.9274618274813908E-3,0.45783290412306266,2.9274618274813908E-3,4,0.11458424466635837,"N/A",5.6617215132919222E-4,"N/A"]
[null,5507,"st_marys","Urban",1224,0,0,1.88144019,10.210769011606555,9.74343015,6,0.86514198034018042,6.8385056381534588E-3,0.86514198034018042,6.8385056381534588E-3,11,0.82336803689492699,"N/A",1.6135281398807664E-3,"N/A"]
[null,5509,"st_marys","Urban",1107,0,0,3.9057745709999998,4.627344027862959,0.58213440000000005,10,0.39206739193004131,2.9299646937095613E-3,0.39206739193004131,2.9299646937095613E-3,1,4.9193235930059614E-2,"N/A",1.024859081876242E-4,"N/A"]
[null,5510,"st_marys","Urban",810,0,0,2.964578162,2.3360950983080526,2.12976E-2,4,0.19793356771815035,1.0201522342981942E-3,0.19793356771815035,1.0201522342981942E-3,1,1.7997525340265714E-3,"N/A",7.498968891777381E-6,"N/A"]
[null,5511,"st_marys","Urban",182,0,0,1.2976697859999999,0.52405999016075544,4.1707800000000003E-2,1,4.4402757244764668E-2,2.2934634889242608E-4,4.4402757244764668E-2,2.2934634889242608E-4,2,3.5245153791353687E-3,"N/A",4.999312594518254E-6,"N/A"]
[null,55163,"narellan","Urban",470,2.2402764725381297,10.223564378930901,5.7315812890000002,0.42893958000000004,0,3,3.6343358395989976E-2,1.7456140350877193E-3,3.5192982456140352E-2,1.1704260651629072E-3,0,0,"N/A",0,"N/A"]
[null,55167,"narellan","Urban",602,2.9300799999999998,7.2720699999999994,3.3723029219999998,0.41904507000000002,0.1277856,3,3.5505012531328324E-2,8.3333333333333328E-4,3.5505012531328324E-2,8.3333333333333328E-4,4,1.0798515204159427E-2,"N/A",3.3745360012998216E-5,"N/A"]
[null,55169,"narellan","Urban",1010,0.11612,9.949543341741089,4.4011411020000004,0.17435930999999999,2.48472E-2,2,1.4773182957393483E-2,1.2969924812030076E-3,1.4773182957393483E-2,1.2969924812030076E-3,1,2.0997112896976667E-3,"N/A",4.999312594518254E-6,"N/A"]
[null,55171,"narellan","Urban",1480,1.3568687831422102,16.9237581724976,2.5720954489999999,0.26987313000000002,0,3,2.2865914786967419E-2,1.799498746867168E-3,2.1952380952380952E-2,1.7982456140350877E-3,0,0,"N/A",0,"N/A"]
[null,55173,"narellan","Urban",149,0,4.1074399999999995,4.039142483,2.20371E-2,0.52179120000000001,1,1.8671679197994988E-3,1.8671679197994988E-4,1.8671679197994988E-3,1.8671679197994988E-4,1,4.4093937083650996E-2,"N/A",1.8372473784854582E-4,"N/A"]
[null,55175,"narellan","Urban",617,0,7.3963199999999993,2.875793238,8.0013899999999999E-2,0,1,6.7794486215538843E-3,6.7794486215538852E-4,6.7794486215538843E-3,6.7794486215538852E-4,0,0,"N/A",0,"N/A"]
[null,55177,"narellan","Urban",878,0,6.3541840486138295,2.533990331,0.12689820000000002,0,1,1.075187969924812E-2,1.0751879699248119E-3,1.075187969924812E-2,1.0751879699248119E-3,0,0,"N/A",0,"N/A"]
[null,55354,"emu_plains","Rural Short",1052,4.0001289637368798,3.6681731656937,3.7466857039999999,7.5284674820618269,1.8604341,15,3.0760650627862289,3.4852671278593775E-2,2.9593010020897053,3.4375269312181114E-2,7,0.7706351199848066,"N/A",1.5806014862555062E-3,"N/A"]
[null,55356,"emu_plains","Urban",606,5.3636641236820495,2.5999699999999999,2.7593821030000001,1.6285398569331411,0,8,0.1379835539603862,3.3266301987895687E-3,0.1379835539603862,3.3266301987895687E-3,0,0,"N/A",0,"N/A"]
[null,55361,"emu_plains","Urban",636,3.8473895447856696,2.1061415582764398,2.770051536,0.63841639997124411,0,4,5.4091991301041996E-2,2.4205949813426442E-3,5.4091991301041996E-2,2.4205949813426442E-3,0,0,"N/A",0,"N/A"]
[null,55363,"emu_plains","Urban",46,9.128E-2,2.1610100000000001,0.67674689200000004,2.7947179746944606E-2,0,4,2.3679194391442266E-3,9.5220798221290227E-5,2.3679194391442266E-3,9.5220798221290227E-5,0,0,"N/A",0,"N/A"]
[null,55864,"jasper_road","Urban",240,0,2.0501799999999997,2.4059571360000001,0,0.21973503,0,0,0,0,0,1,1.8568696804189423E-2,"N/A",1.0373573633625377E-4,"N/A"]
[null,55866,"jasper_road","Urban",451,3.1228325435438999,4.9669999999999999E-2,1.5849823730000001,5.1617691600000004,0.2271744,4,0.43734837092731826,1.1904761904761908E-3,3.1378446115288222E-3,6.2656641604010024E-5,1,1.9197360362950094E-2,"N/A",3.9994500756146032E-5,"N/A"]
[null,55867,"jasper_road","Urban",864,2.1809920997979897,4.1108376877686599,3.2288371539999998,4.3127640000000009E-2,0,3,3.654135338345865E-3,4.260651629072681E-5,3.654135338345865E-3,4.260651629072681E-5,0,0,"N/A",0,"N/A"]
[null,55870,"jasper_road","Urban",836,5.1306783110711303,1.0801400000000001,3.162724775,1.3539653400000002,0,3,0.11471929824561403,1.098997493734336E-3,0.11471929824561403,1.098997493734336E-3,0,0,"N/A",0,"N/A"]
[null,55874,"jasper_road","Urban",1339,5.4710014922649002,0.70446874143942495,3.3898312769999999,1.18016805,0.62650439999999996,4,9.9993734335839607E-2,3.057644110275689E-4,6.6017543859649114E-2,2.756892230576441E-4,4,5.2942720375948299E-2,"N/A",8.4988314106810312E-5,"N/A"]
[null,55875,"jasper_road","Urban",935,6.2394315499773398,1.3795510123625199,3.239125536,1.8170994000000003,5.2747055999999999,8,0.15395989974937344,1.4987468671679202E-3,0.13615914786967417,1.4624060150375943E-3,5,0.44573871092724748,"N/A",9.286223144317656E-4,"N/A"]
[null,55876,"jasper_road","Urban",1485,4.702824531908,1.9177940368547499,4.0082773380000001,1.2958867759701496,1.5036993000000001,2,0.10979839524183596,9.8879661841170066E-4,0.10979839524183596,9.8879661841170066E-4,3,0.12707002787116772,"N/A",2.5621477046906051E-4,"N/A"]
[null,55879,"jasper_road","Urban",654,4.67737142365488,1.03071,2.3343195140000002,7.2101250000000006E-2,1.5742476000000001,1,6.1090225563909771E-3,4.8872180451127818E-5,6.1090225563909771E-3,4.8872180451127818E-5,3,0.13303170814013074,"N/A",2.8871030233342914E-4,"N/A"]
[null,55880,"jasper_road","Urban",257,3.0688144405665998,7.417E-2,2.0001376319999999,0.24103263000000003,0,2,2.0422305764411029E-2,3.220551378446115E-4,2.0422305764411029E-2,3.220551378446115E-4,0,0,"N/A",0,"N/A"]
[null,55885,"jasper_road","Urban",1565,6.0035936105250203,2.7135681666914904,4.9536653099999999,23.811944369999999,2.3103459000000002,6,2.0175476190476189,7.4749373433583965E-3,6.8770676691729329E-2,3.6879699248120305E-3,6,0.1952356550974241,"N/A",3.8994638237242383E-4,"N/A"]
[null,55888,"jasper_road","Urban",229,2.4792657388857799,0.71228000000000002,1.1241009740000001,2.0903150699999999,0,2,0.17710902255639099,8.9724310776942353E-4,5.4038847117794483E-2,6.0902255639097742E-4,0,0,"N/A",0,"N/A"]
[null,55890,"jasper_road","Urban",1845,7.1640863470359797,1.5782691138988101,4.2936846700000002,1.3531057540298503,10.178478,3,0.1146464669135525,1.0249878427411817E-3,0.11386200576067029,1.0237347099091014E-3,10,0.86013173188686565,"N/A",1.6572721250828009E-3,"N/A"]
[null,57040,"north_parramatta","Urban",507,0,3.3963980653916201,3.8379474610000002,0,1.06488E-2,0,0,0,0,0,1,8.998762670132857E-4,"N/A",4.999312594518254E-6,"N/A"]
[null,57444,"meadow_flat","Rural Short",46,16.366961525490101,0,0,1.0543807102016129,0.248472,3,0.43081060963003004,5.7409097226838448E-4,4.7752940681099955E-2,2.9611008043316673E-4,5,0.10292288747710272,"N/A",2.1442268224396399E-4,"N/A"]
[null,57448,"meadow_flat","Rural Short",143,63.738378318149998,0.27376999999999996,9.4691217999999994E-2,3.2334173821572576,0.52001640000000005,16,1.3211456735861031,3.4808042108062059E-3,0.12741112116555453,9.4876086995933015E-4,3,0.21540290021993641,"N/A",4.5335081388723819E-4,"N/A"]
[null,5867,"leabons_lane","Urban",1044,3.7003621004802598,2.5301918737903404,3.0148769180000001,9.0834116100000006,1.0000998000000001,7,0.76962280701754382,4.0213032581453631E-3,0.45209649122807016,2.7268170426065158E-3,3,8.4513379410331074E-2,"N/A",1.7872542525402757E-4,"N/A"]
[null,5868,"leabons_lane","Urban",73,0,0.86755356674036899,2.5686659889999999,0,0.64292130000000003,0,0,0,0,0,1,5.4330029620927124E-2,"N/A",8.6238142255439873E-5,"N/A"]
[null,5869,"leabons_lane","Urban",1440,5.6238031075146901,1.50542939224798,3.7061037539999999,0.23758656000000003,1.1389779,4,2.0130325814536339E-2,1.5914786967418548E-4,2.0130325814536339E-2,1.5914786967418548E-4,7,9.6249265725962665E-2,"N/A",2.074714726725075E-4,"N/A"]
[null,5871,"leabons_lane","Urban",1047,4.5905233943384598,2.8151153171155903,2.6338257399999998,2.73734799,0.4543488,4,0.2319310776942356,2.7681704260651627E-3,0.23023182957393484,2.7531328320802005E-3,1,3.8394720725900187E-2,"N/A",7.9989001512292064E-5,"N/A"]
[null,5872,"leabons_lane","Urban",506,0,0,3.0865145389999999,0.65056773000000001,0,5,5.512155388471178E-2,2.5313283208020052E-4,4.5726817042606518E-3,5.8897243107769418E-5,0,0,"N/A",0,"N/A"]
[null,5874,"leabons_lane","Urban",1441,0,0,2.3739488369999999,0,0.2298366,0,0,0,0,0,1,1.9422329429703417E-2,"N/A",4.6243641499293848E-5,"N/A"]
[null,5875,"leabons_lane","Urban",921,0,0,3.3774471130000001,1.3140767099999999,0.67708619999999997,3,0.11133959899749374,3.5213032581453635E-4,0,0,3,5.7217132644261412E-2,"N/A",1.2498281486295634E-4,"N/A"]
[null,5877,"leabons_lane","Urban",446,0,0,2.104926705,0.67400988000000006,0,2,5.7107769423558899E-2,2.080200501253133E-4,2.7233082706766918E-2,1.5789473684210527E-4,0,0,"N/A",0,"N/A"]
[null,61617,"maldon","Rural Short",482,16.335255633395398,0.79039000000000004,1.886203329,1.0335329239662716,0.51469200000000004,10,0.4222923890190266,3.3109115135127485E-3,0.37408687653708023,2.9664569301517175E-3,3,0.21319740977399848,"N/A",3.6145537863982506E-4,"N/A"]
[null,6419,"moorebank","Urban",393,3.3732428185025602,1.65535530538261,3.0266895040000001,2.0349588304615387,1.0391454,10,0.17241877771351458,1.8176252597305227E-3,0.11092253711201081,1.2449435554698709E-3,4,8.7812925722713139E-2,"N/A",1.6122783117321368E-4,"N/A"]
[null,6420,"moorebank","Urban",189,2.5180288649996903,1.2558856606537498,5.5069516199999997,1.2423600000000001E-3,0,1,1.0526315789473685E-4,1.2531328320802005E-6,1.0526315789473685E-4,1.2531328320802005E-6,0,0,"N/A",0,"N/A"]
[null,6421,"moorebank","Urban",192,2.8312672749563399,2.3902236654747799,5.6054533490000003,1.3358919092597159,0,10,0.11318796562566966,8.1968666118675316E-4,4.2325583188741071E-2,5.3701133174817418E-4,0,0,"N/A",0,"N/A"]
[null,6423,"moorebank","Urban",570,3.1258443254229302,0.8566649313094461,3.8682410300000001,0.37525187999999998,0.1162494,4,3.1794486215538847E-2,1.9674185463659148E-4,3.1794486215538847E-2,1.9674185463659148E-4,2,9.8236492482283687E-3,"N/A",2.3746734823961708E-5,"N/A"]
[null,6426,"moorebank","Urban",19,1.6857759452396002,0.57832268138982201,1.131721998,0.55882536000000005,7.1879399999999996E-2,3,4.7348370927318299E-2,1.7293233082706769E-4,4.7348370927318299E-2,1.7293233082706769E-4,2,6.074164802339679E-3,"N/A",8.7487970404069445E-6,"N/A"]
[null,6430,"moorebank","Urban",745,5.0353508092349006,1.3938858476877298,2.4842631530000001,8.2676099999999999E-3,0,3,7.0050125313283204E-4,3.7593984962406014E-6,7.0050125313283204E-4,3.7593984962406014E-6,0,0,"N/A",0,"N/A"]
[null,676,"","Urban",0,0,0,0,3.13548E-3,0,1,2.6566416040100252E-4,1.2531328320802005E-6,0,0,0,0,"N/A",0,"N/A"]
[null,68179,"smithfield","Urban",861,3.2943323513215401,0.16958028226441102,2.3297469,0,0.5732604,0,0,0,0,0,1,4.8443339040881876E-2,"N/A",8.4988314106810312E-5,"N/A"]
[null,68181,"smithfield","Urban",1089,2.8631026271384297,3.5357396237439698,3.320289437,0.45970278000000003,0,5,3.8949874686716797E-2,1.3684210526315793E-3,3.8949874686716797E-2,1.3684210526315793E-3,0,0,"N/A",0,"N/A"]
[null,68186,"smithfield","Urban",502,1.7988164787805299,1.11456371859716,1.6446168830000001,0.94398654000000004,0,2,7.9982456140350877E-2,6.3408521303258143E-4,7.9982456140350877E-2,6.3408521303258143E-4,0,0,"N/A",0,"N/A"]
[null,68188,"smithfield","Urban",926,4.3921718875701998,0.36564999999999998,3.3766850110000002,0.64579056000000012,0.2781999,3,5.4716791979949879E-2,1.1967418546365916E-3,4.6208020050125316E-2,1.1528822055137846E-3,1,2.3509267475722087E-2,"N/A",4.1244328904775594E-5,"N/A"]
[null,68190,"smithfield","Urban",343,2.2418095011317201,1.6866877673152301,3.3547745679999998,0.70536467999999997,0.31325219999999998,5,5.9764411027568916E-2,1.6791979949874687E-4,1.4221804511278194E-2,1.0651629072681705E-4,4,2.6471360187974156E-2,"N/A",5.3742610391071226E-5,"N/A"]
[null,68195,"smithfield","Urban",894,3.7332806335159496,0.31055129490251199,3.024212672,1.46364798,0.15529499999999999,4,0.12401253132832081,1.2218045112781955E-3,0.12401253132832081,1.2218045112781955E-3,1,1.3123195560610416E-2,"N/A",4.3743985202034718E-5,"N/A"]
[null,68197,"smithfield","Urban",738,5.2242834373939901,0.76527000000000001,1.9408841729999999,0.81139419000000013,0.65534490000000001,5,6.8748120300751878E-2,2.7694235588972429E-4,6.5961152882205512E-2,2.7443609022556392E-4,2,5.537988526577596E-2,"N/A",9.8736423741735519E-5,"N/A"]
[null,68202,"smithfield","Urban",461,2.6544815878379899,9.0474160630946696E-2,1.1700176410000001,0.35717850000000001,1.15362E-2,2,3.0263157894736843E-2,1.7919799498746866E-4,3.0263157894736843E-2,1.7919799498746866E-4,1,9.7486595593105946E-4,"N/A",2.499656297259127E-6,"N/A"]
[null,68204,"smithfield","Urban",1052,2.0246980994620101,6.9944950476644099,3.4029775419999999,2.0070029999999999E-2,0.28574280000000002,4,1.7005012531328323E-3,5.0125313283208019E-6,1.7005012531328323E-3,5.0125313283208019E-6,1,2.4146679831523167E-2,"N/A",5.7492094836959918E-5,"N/A"]
[null,7015,"","Rural Short",0,0,0,0,1.767405E-2,0,1,7.2214601248496791E-3,6.0430628659829945E-6,7.2214601248496791E-3,6.0430628659829945E-6,0,0,"N/A",0,"N/A"]
[null,7031,"","Urban",0,0,0,0,7.5690301485148524E-3,0,2,6.4131170967605391E-4,2.1922526175660464E-6,6.2406015037593985E-4,9.3984962406015035E-7,0,0,"N/A",0,"N/A"]
[null,7033,"","Urban",0,0,0,0,7.5690301485148524E-3,0,2,6.4131170967605391E-4,2.1922526175660464E-6,6.2406015037593985E-4,9.3984962406015035E-7,0,0,"N/A",0,"N/A"]
[null,"7033/1","","Urban",0,0,0,0,7.5690301485148524E-3,0,2,6.4131170967605391E-4,2.1922526175660464E-6,6.2406015037593985E-4,9.3984962406015035E-7,0,0,"N/A",0,"N/A"]
[null,"7033/2","","Urban",0,0,0,0,7.3654200000000001E-3,0,1,6.2406015037593985E-4,9.3984962406015035E-7,6.2406015037593985E-4,9.3984962406015035E-7,0,0,"N/A",0,"N/A"]
[null,"7091/1","","Rural Short",0,0,0,0,7.251537000000001E-2,0,1,2.9629137231914623E-2,7.2516754391795934E-5,0,0,0,0,"N/A",0,"N/A"]
[null,7093,"","Rural Short",0,0,0,0,6.519432E-2,0,5,2.6637821113253041E-2,1.1481819445367689E-4,2.6637821113253041E-2,1.1481819445367689E-4,0,0,"N/A",0,"N/A"]
[null,7292,"","Rural Short",0,0,0,0,0,0.17393040000000001,0,0,0,0,0,1,7.2046021233971899E-2,"N/A",1.7153814579517121E-4,"N/A"]
[null,76225,"BYLONG","Rural Short",29,18.475243753375249,0,0,0.10438782000000001,3.5496E-3,6,4.2651937708107976E-2,1.027320687217109E-4,4.2651937708107976E-2,1.027320687217109E-4,1,1.4703269639586103E-3,"N/A",6.1263623498275427E-6,"N/A"]
[null,77674,"ilford","Rural Short",24,25.9865780426702,0.14204,9.7739626999999996E-2,2.5290900000000002E-2,2.83968E-2,2,1.0333637500830922E-2,1.8129188597948984E-4,1.0333637500830922E-2,1.8129188597948984E-4,1,1.1762615711668882E-2,"N/A",2.4505449399310171E-5,"N/A"]
[null,7910,"","Rural Short",0,0,0,0,5.1898110000000004E-2,0,1,2.1205107596734329E-2,4.8344502927863956E-5,2.1205107596734329E-2,4.8344502927863956E-5,0,0,"N/A",0,"N/A"]
[null,7911,"","Rural Short",0,0,0,0,6.4583837011884568E-5,0,1,2.638838317709383E-5,1.8467764276348721E-7,2.638838317709383E-5,1.8467764276348721E-7,0,0,"N/A",0,"N/A"]
[null,7914,"","Rural Short",0,0,0,0,4.1707799999999998E-3,0,1,1.7041437282072046E-3,6.0430628659829945E-6,1.7041437282072046E-3,6.0430628659829945E-6,0,0,"N/A",0,"N/A"]
[null,7962,"greystanes","Urban",861,5.1736808523733799,0.32750999999999997,2.686029751,6.4170999900000005,0.51424829999999999,7,0.54371052631578942,3.6115288220551381E-3,6.9124060150375949E-2,2.5125313283208021E-3,1,4.3456524727849923E-2,"N/A",7.6239517066403365E-5,"N/A"]
[null,7964,"greystanes","Urban",299,2.1468104836096398,6.8400000000000002E-2,0.90194813799999995,1.2529348500000002,0,2,0.10615914786967418,7.2932330827067671E-4,0.10615914786967418,7.2932330827067671E-4,0,0,"N/A",0,"N/A"]
[null,7966,"greystanes","Urban",526,4.3254368845285702,8.0120000000000011E-2,1.8258067179999999,0.61490904000000002,1.9558295999999999,5,5.2100250626566418E-2,1.3734335839598998E-3,3.5889724310776944E-2,1.3182957393483709E-3,7,0.16527727437477346,"N/A",3.0870755271150219E-4,"N/A"]
[null,7967,"greystanes","Urban",98,0.36502122941182896,0.28061999999999998,0.71561411200000002,7.2471000000000002E-3,0,1,6.1403508771929827E-4,1.2280701754385965E-4,6.1403508771929827E-4,1.2280701754385965E-4,0,0,"N/A",0,"N/A"]
[null,7970,"greystanes","Urban",753,5.4954084577437596,1.3660418989510499,3.8105117769999999,1.0814743800000002,1.4220584999999999,4,9.1631578947368411E-2,1.2105263157894737E-3,1.4218045112781954E-2,1.0313283208020049E-3,3,0.12017097649073252,"N/A",3.0120858381972479E-4,"N/A"]
[null,7972,"greystanes","Urban",596,4.5798371015747499,1.0726141657375798,2.8778890189999999,8.8592100000000007E-2,0.50537430000000005,2,7.506265664160401E-3,7.807017543859649E-4,7.506265664160401E-3,7.807017543859649E-4,3,4.2706627838672184E-2,"N/A",8.8737798552699011E-5,"N/A"]
[null,7973,"greystanes","Urban",308,2.0215761475688301,0.19394,1.0513201990000001,7.9540620000000006E-2,0.37093320000000002,2,6.7393483709273184E-3,4.2982456140350879E-4,6.7393483709273184E-3,4.2982456140350879E-4,1,3.1345689967629452E-2,"N/A",5.4992438539700794E-5,"N/A"]
[null,7974,"greystanes","Urban",920,4.9793923413227299,0.44084219555395499,3.948833354,0.55980150000000006,0.45523619999999998,3,4.7431077694235588E-2,1.2468671679197994E-3,2.424812030075188E-2,1.2180451127819548E-3,1,3.8469710414817962E-2,"N/A",6.7490720025996419E-5,"N/A"]
[null,7976,"greystanes","Urban",1252,5.80831254125677,0.95194723418078697,3.2884716630000002,0.32459612999999998,1.2037580999999999,4,2.750250626566416E-2,1.6779448621553885E-3,2.750250626566416E-2,1.6779448621553885E-3,5,0.10172351301696017,"N/A",2.1871992601017357E-4,"N/A"]
[null,7977,"greystanes","Urban",141,2.7456075845262498,0.686725332307216,2.368233069,3.7566600000000006E-2,1.0790784,3,3.1829573934837093E-3,1.8045112781954887E-4,3.1829573934837093E-3,1.8045112781954887E-4,4,9.1187461724012958E-2,"N/A",1.8997387859169367E-4,"N/A"]
[null,7979,"greystanes","Urban",299,6.2546884059830798,0.81906654883910501,2.3308900540000002,0.61765998,0,5,5.2333333333333329E-2,1.1127819548872181E-3,5.2333333333333329E-2,1.1127819548872181E-3,0,0,"N/A",0,"N/A"]
[null,7981,"greystanes","Urban",717,4.1921372130438002,0.28827999999999998,2.2442009110000001,0.11261106000000001,0.14375879999999999,2,9.5413533834586457E-3,9.3734335839598996E-4,9.5413533834586457E-3,9.3734335839598996E-4,1,1.2148329604679356E-2,"N/A",3.374536001299821E-5,"N/A"]
[null,811,"","Rural Short",0,0,0,0,8.5782000000000011E-3,0,1,3.504976462270137E-3,2.4172251463931978E-5,3.504976462270137E-3,2.4172251463931978E-5,0,0,"N/A",0,"N/A"]
[null,828,"","Rural Short",0,0,0,0,1.5381599999999999E-2,0,2,6.2847853806223142E-3,4.8344502927863956E-5,6.2847853806223142E-3,4.8344502927863956E-5,0,0,"N/A",0,"N/A"]
[null,845,"","Rural Short",0,0,0,0,3.0911100000000002E-3,0,1,1.2630001389904459E-3,6.0430628659829945E-6,1.2630001389904459E-3,6.0430628659829945E-6,0,0,"N/A",0,"N/A"]
[null,8610,"seven_hills","Urban",1605,8.4177838778566496,0.80939633310844394,4.2868257490000001,7.0939643400000003,1.4704218,7,0.60106015037593985,4.2030075187969923E-3,2.6903508771929825E-2,2.380952380952381E-4,4,0.1242579145367512,"N/A",2.3496769194235795E-4,"N/A"]
[null,8611,"seven_hills","Urban",140,1.2080452460772899,1.5212024308721099,2.1053077569999998,0.85959479999999999,0,4,7.2832080200501248E-2,4.8872180451127814E-4,2.8956140350877194E-2,2.3433583959899749E-4,0,0,"N/A",0,"N/A"]
[null,8614,"seven_hills","Urban",18,0,1.26573778416942,3.9819848069999999,2.1889200000000001E-2,0,1,1.8546365914786968E-3,2.2556390977443609E-5,1.8546365914786968E-3,2.2556390977443609E-5,0,0,"N/A",0,"N/A"]
[null,8615,"seven_hills","Urban",624,4.0382738103994802,0.63339230929149704,3.8105117769999999,2.1817468500000001,0.3123648,6,0.1848558897243108,1.6528822055137844E-3,1.1857142857142858E-2,1.3408521303258147E-4,1,2.6396370499056378E-2,"N/A",3.9994500756146032E-5,"N/A"]
[null,8617,"seven_hills","Urban",402,2.5950662016444497,1.62852145695748,4.0136120540000002,5.7814110000000002E-2,0,2,4.8984962406015036E-3,1.1278195488721805E-5,0,0,0,0,"N/A",0,"N/A"]
[null,8620,"seven_hills","Urban",1044,3.4577487247755596,2.7286175991881603,3.0474567929999998,14.97227196,0.18236069999999999,7,1.2685764411027569,5.2431077694235582E-3,0.36715162907268167,3.9348370927318292E-3,2,1.5410381072602517E-2,"N/A",4.1244328904775594E-5,"N/A"]
[null,8622,"seven_hills","Urban",141,1.5901968557839099,0.97277401585293899,1.4984837559999999,0,0.567936,0,0,0,0,0,7,4.7993400907375236E-2,"N/A",9.9986251890365067E-5,"N/A"]
[null,8633,"cattai","Rural Short",0,0,0,1.9056369399999999,0,0.1561824,0,0,0,0,0,1,6.469438641417885E-2,"N/A",1.3477997169620594E-4,"N/A"]
[null,8633,"old_cattai","Rural Short",0,0,0,1.2384163269999999,0,0.1561824,0,0,0,0,0,1,6.469438641417885E-2,"N/A",1.3477997169620594E-4,"N/A"]
[null,8634,"cattai","Rural Short",0,0,0,1.533540465,0,3.8193695999999999,0,0,0,0,0,5,1.5820718132194647,"N/A",5.8813078558344412E-3,"N/A"]
[null,8634,"old_cattai","Rural Short",0,0,0,2.7151801660000001,0,3.8193695999999999,0,0,0,0,0,5,1.5820718132194647,"N/A",5.8813078558344412E-3,"N/A"]
[null,8635,"cattai","Rural Short",0,0,0,2.7452832090000001,0,0.31103370000000002,0,0,0,0,0,3,0.12883740021687323,"N/A",2.7568630574223944E-4,"N/A"]
[null,8635,"old_cattai","Rural Short",0,0,0,3.4673751909999999,0,0.31103370000000002,0,0,0,0,0,3,0.12883740021687323,"N/A",2.7568630574223944E-4,"N/A"]
[null,8637,"cattai","Rural Short",0,0,0,2.5644744259999999,0,4.96944E-2,0,0,0,0,0,1,2.0584577495420545E-2,"N/A",4.2884536448792802E-5,"N/A"]
[null,8637,"old_cattai","Rural Short",0,0,0,3.0245937230000002,0,4.96944E-2,0,0,0,0,0,1,2.0584577495420545E-2,"N/A",4.2884536448792802E-5,"N/A"]
[null,8640,"kellyville","Urban",0,0,0.37076000000000003,8.2307054000000004E-2,0,2.39598E-2,0,0,0,0,0,1,2.0247216007798926E-3,"N/A",3.7494844458886905E-6,"N/A"]
[null,8641,"kellyville","Urban",798,0.17956999999999998,6.9565414215380601,4.5385100520000003,3.5081880000000003E-2,0.346086,2,2.9724310776942354E-3,1.0012531328320803E-3,2.9724310776942354E-3,1.0012531328320803E-3,1,2.9245978677931786E-2,"N/A",8.1238829660921626E-5,"N/A"]
[null,8645,"kellyville","Urban",800,0.256609553182855,6.6404700000000005,3.697530102,3.8646270000000003E-2,0,1,3.2744360902255639E-3,1.0025062656641604E-3,3.2744360902255639E-3,1.0025062656641604E-3,0,0,"N/A",0,"N/A"]
[null,8647,"kellyville","Urban",600,0,3.6350487020320901,3.4940487739999999,4.5257400000000003E-2,0.17393040000000001,2,3.8345864661654136E-3,4.2606516290726817E-5,3.8345864661654136E-3,4.2606516290726817E-5,1,1.4697979027883666E-2,"N/A",6.124157928284861E-5,"N/A"]
[null,8648,"kellyville","Urban",320,6.5959143700946496,3.0069664091300501,4.3295034809999997,2.5039063861904767,0.141984,6,0.2121519473286391,1.9083429946748962E-3,5.4032899709591478E-2,8.7325527537665038E-4,2,1.1998350226843809E-2,"N/A",1.9997250378073016E-5,"N/A"]
[null,8650,"kellyville","Urban",110,1.7864637164531101,0.43008999999999997,0.100597511,0,0.1277856,0,0,0,0,0,1,1.0798515204159429E-2,"N/A",2.2496906675332143E-5,"N/A"]
[null,8651,"kellyville","Urban",570,1.94529588929536,2.4098032206939601,2.154653884,0.13497354,2.9794455000000002,2,1.1436090225563911E-2,7.5814536340852127E-4,1.1436090225563911E-2,7.5814536340852127E-4,5,0.25177788054142558,"N/A",4.936821187086775E-4,"N/A"]
[null,8652,"kellyville","Urban",714,0.63970000000000005,8.8403799803240108,3.6323703510000001,1.0008097200000001,0.42328979999999999,2,8.479699248120301E-2,8.909774436090225E-4,8.479699248120301E-2,8.909774436090225E-4,1,3.5770081613778107E-2,"N/A",6.6240891877366857E-5,"N/A"]
[null,8675,"plumpton","Urban",849,4.8837691101973792,0.65639525023275902,2.2847828610000001,2.9491260000000002E-2,2.0652016500000001,2,2.4987468671679195E-3,1.2531328320802005E-4,2.4987468671679195E-3,1.2531328320802005E-4,3,0.1745197535338891,"N/A",3.424529127245004E-4,"N/A"]
[null,8676,"plumpton","Urban",1157,3.4910411703635402,2.1644456854438099,2.2222904680000002,0.11482956000000001,0,2,9.7293233082706761E-3,6.5162907268170433E-5,9.7293233082706761E-3,6.5162907268170433E-5,0,0,"N/A",0,"N/A"]
[null,8677,"plumpton","Urban",427,3.1515355934604998,0.72889999999999999,0.85279253600000005,0.54112173000000008,1.1616066,2,4.5848370927318298E-2,5.3634085213032578E-4,4.5848370927318298E-2,5.3634085213032578E-4,2,9.8161502793365912E-2,"N/A",1.9247353488895276E-4,"N/A"]
[null,8679,"plumpton","Urban",1155,2.97795247307696,5.9229367397888497,2.986298079,2.1685393799999999,0,15,0.18373684210526317,1.778195488721805E-3,0.18373684210526317,1.778195488721805E-3,0,0,"N/A",0,"N/A"]
[null,868,"","Rural Short",0,0,0,0,4.8330090078328974E-4,0,1,1.9747246292221973E-4,4.0234491666466437E-6,1.9747246292221973E-4,4.0234491666466437E-6,0,0,"N/A",0,"N/A"]
[null,8680,"plumpton","Urban",1412,2.9498837729044398,4.2269929991604807,3.5056708350000001,0.34552398000000001,4.6588499999999998E-2,3,2.9275689223057642E-2,1.0275689223057644E-4,2.9275689223057642E-2,1.0275689223057644E-4,1,3.9369586681831251E-3,"N/A",8.7487970404069445E-6,"N/A"]
[null,8682,"plumpton","Urban",856,3.44357433008514,4.8739260253928895,3.2366487030000002,0.10897272000000001,0,2,9.2330827067669177E-3,1.0025062656641604E-4,9.2330827067669177E-3,1.0025062656641604E-4,0,0,"N/A",0,"N/A"]
[null,8683,"plumpton","Urban",1182,2.66861355680442,5.6504007061688695,2.9209478020000001,1.0892835000000001,0.32035140000000001,2,9.229323308270676E-2,3.2832080200501253E-4,1.6290726817042606E-2,1.3032581453634084E-4,2,2.7071277699316346E-2,"N/A",8.373848595818075E-5,"N/A"]
[null,8685,"plumpton","Urban",1685,1.84724002908333,6.3183214006971706,0.268831606,0.77934426000000001,9.5839199999999999E-2,10,6.6032581453634082E-2,2.0927318295739348E-4,6.3662907268170421E-2,1.7042606516290727E-4,1,8.0988864031195703E-3,"N/A",3.374536001299821E-5,"N/A"]
[null,8686,"plumpton","Urban",763,5.1141696158804999,1.8796300000000001,1.7478817520000001,0.21331617000000003,0.51291719999999996,3,1.8073934837092732E-2,1.1779448621553886E-4,1.125062656641604E-2,7.6441102756892224E-5,1,4.3344040194473257E-2,"N/A",8.4988314106810312E-5,"N/A"]
[null,8689,"plumpton","Urban",654,3.28059495884904,0.70235000000000003,1.9951839659999999,3.0934320300000002,0.3292254,5,0.2621015037593985,9.0476190476190474E-4,0.26109398496240604,8.8972431077694232E-4,1,2.782117458849408E-2,"N/A",6.6240891877366857E-5,"N/A"]
[null,8690,"plumpton","Urban",806,4.1731886028058298,0.56546000000000007,2.9927759489999999,0.56326236000000007,0,2,4.7724310776942357E-2,1.0100250626566417E-3,4.7724310776942357E-2,1.0100250626566417E-3,0,0,"N/A",0,"N/A"]
[null,8693,"plumpton","Urban",390,3.0034355569357101,0.41948000000000002,4.1900387500000003,1.0489807500000001,0.141984,6,8.8878446115288237E-2,6.278195488721804E-4,8.8878446115288237E-2,6.278195488721804E-4,1,1.1998350226843809E-2,"N/A",2.499656297259127E-5,"N/A"]
[null,8694,"plumpton","Urban",1412,3.2077767771931001,6.8665195269135806,4.0793433820000002,0.48058626000000004,0,6,4.0719298245614037E-2,2.142857142857143E-4,4.0719298245614037E-2,2.142857142857143E-4,0,0,"N/A",0,"N/A"]
[null,8711,"horsley_park","Rural Short",460,17.171500091828399,0.63063000000000002,4.1627935899999997,1.1556906000000002,0.27154440000000002,6,0.47220493234791122,1.0315508312232973E-2,0.27201638878649254,4.7256751611987023E-3,3,0.1124800127428337,"N/A",2.2054904459379153E-4,"N/A"]
[null,8714,"horsley_park","Urban",30,5.3570544691776405,0.75931619707245601,3.6826691070000002,6.4173809999999998E-2,0,3,5.4373433583959898E-3,4.8872180451127811E-5,5.4373433583959898E-3,4.8872180451127811E-5,0,0,"N/A",0,"N/A"]
[null,8716,"horsley_park","Urban",142,8.8349299027010595,0.97487999999999997,4.508216483,6.8082954900000008,5.50188E-2,4,0.57685588972431079,1.4899749373433586E-3,0,0,4,4.6493607129019753E-3,"N/A",9.998625189036508E-6,"N/A"]
[null,8718,"horsley_park","Rural Short",425,10.6948356551119,5.9615025344591306,0.80135062700000004,0.67670165999999998,6.74424E-2,3,0.27649429837018596,2.8281534212800416E-3,0.27649429837018596,2.8281534212800416E-3,1,2.7936212315213597E-2,"N/A",4.9010898798620342E-5,"N/A"]
[null,8721,"horsley_park","Urban",13,3.7861495930101299,2.2851873971433303,3.8217527859999998,5.2356600000000005E-3,3.5496E-3,1,4.4360902255639097E-4,3.7593984962406014E-6,4.4360902255639097E-4,3.7593984962406014E-6,1,2.9995875567109521E-4,"N/A",1.2498281486295635E-6,"N/A"]
[null,87218,"kandos","Rural Short",240,46.196397243790905,0.39055000000000001,1.5156310589999999,1.9345319999999999E-2,0.49516919999999998,6,7.9043262287057572E-3,3.6258377195897967E-5,7.9043262287057572E-3,3.6258377195897967E-5,5,0.20511061147222615,"N/A",4.7785626328654835E-4,"N/A"]
[null,87220,"kandos","Rural Short",741,185.56889139741543,0.17365,1.735307063,1.7687508900000002,3.3419484000000002,23,0.72269593120577236,7.8680678515098586E-3,0.6106696317961795,7.4450534508910503E-3,25,1.3843128365670316,"N/A",3.6023010616985955E-3,"N/A"]
[null,87221,"kandos","Rural Short",291,2.0273903399330098,0.40085999999999999,0.51480014100000004,0.30773553000000003,0,1,0.12573800905250818,1.7524882311350685E-3,0.12573800905250818,1.7524882311350685E-3,0,0,"N/A",0,"N/A"]
[null,87222,"kandos","Rural Long",315,238.38033014891488,0.34896070203538299,0.76381708599999998,6.6364652699999995,3.7452717,49,1411.0471698113206,11.949685534591193,1408.7547169811319,11.940251572327043,12,798.83280757097805,"N/A",1.6782334384858042,"N/A"]
[null,87223,"kandos","Rural Short",429,5.0797239372836502,0.1172,0.82192739000000004,0.13040342999999999,0,4,5.3281685289372063E-2,1.4503350878359187E-4,1.3034886601925321E-2,5.4387565793846947E-5,0,0,"N/A",0,"N/A"]
[null,8734,"north_rocks","Urban",579,4.5392300129558798,0.95701999999999998,1.835142472,2.0376903930767103,0,2,0.17265021860573598,1.7565789647450477E-3,0.17265021860573598,1.7565789647450477E-3,0,0,"N/A",0,"N/A"]
[null,8735,"north_rocks","Urban",540,4.3095582417177205,1.1481769871138499,4.1587925529999996,0.92759061129957254,0,4,7.8593255561111394E-2,7.4923530098379952E-4,7.8593255561111394E-2,7.4923530098379952E-4,0,0,"N/A",0,"N/A"]
[null,8737,"north_rocks","Urban",712,2.6986429863028101,4.3786934931571704,4.0656255400000001,1.1583690518547889,0.40243590000000001,5,9.8146740401950497E-2,9.6222455671413662E-4,9.8146740401950497E-2,9.6222455671413662E-4,3,3.4007823924210423E-2,"N/A",1.1373436152529026E-4,"N/A"]
[null,8738,"north_rocks","Urban",1335,5.8916649755961794,1.1670529355597201,3.3778281639999999,2.2118142522391762,3.0473316000000001,4,0.18740345219363283,1.8693342059643734E-3,0.18740345219363283,1.8693342059643734E-3,4,0.25751459174363522,"N/A",5.5742335428878519E-4,"N/A"]
[null,8740,"north_rocks","Urban",2,0,0.58333000000000002,1.658334725,2.8391024771201954E-3,1.86354E-2,1,2.4055257117779196E-4,2.5057559497686718E-6,2.4055257117779196E-4,2.5057559497686718E-6,1,1.57478346727325E-3,"N/A",2.499656297259127E-6,"N/A"]
[null,8741,"north_rocks","Urban",402,2.8772245754875199,1.2837700000000001,2.8504533350000001,1.275358439139719,2.12976E-2,2,0.10805906239057067,1.0086692223746265E-3,0.10805906239057067,1.0086692223746265E-3,1,1.7997525340265714E-3,"N/A",3.7494844458886905E-6,"N/A"]
[null,8743,"north_rocks","Urban",748,4.7661594028678804,0.53388121006320999,3.807463367,1.7319296464429537,2.83968E-2,5,0.14674360397638395,1.7429171362410502E-3,0.1020769373097173,1.016100093634534E-3,1,2.3996700453687617E-3,"N/A",4.999312594518254E-6,"N/A"]
[null,8744,"north_rocks","Urban",589,3.3621534028069999,1.6489927142968399,2.7921525040000001,0.8435994195118981,2.8130579999999998,2,7.1476817424892355E-2,7.3919826003895233E-4,7.1476817424892355E-2,7.3919826003895233E-4,5,0.23771731386934297,"N/A",5.186786816812689E-4,"N/A"]
[null,8745,"north_rocks","Urban",8,0,1.1436884787959201,2.4570179940000001,1.1356409908480782E-2,1.59732E-2,1,9.6221028471116785E-4,1.0023023799074662E-5,9.6221028471116785E-4,1.0023023799074662E-5,1,1.3498144005199286E-3,"N/A",3.7494844458886905E-6,"N/A"]
[null,8762,"bonnyrigg","Urban",1581,7.4962833071155801,1.14924,5.5753503059999998,0.72793422000000008,0.44680589999999998,4,6.1676691729323302E-2,2.6190476190476186E-4,6.1343358395989971E-2,2.6065162907268168E-4,2,3.7757308370099114E-2,"N/A",6.6240891877366857E-5,"N/A"]
[null,8764,"bonnyrigg","Urban",1242,4.0053962878686198,2.6259481950260701,2.8822711079999999,0.54428678999999991,0,6,4.6116541353383458E-2,1.5914786967418545E-4,2.8213032581453634E-2,1.1278195488721803E-4,0,0,"N/A",0,"N/A"]
[null,8766,"bonnyrigg","Urban",1318,6.0729999999999999E-2,7.6844972395863298,3.404882798,0.50046402000000001,0,5,4.2403508771929825E-2,1.3909774436090226E-4,4.2403508771929825E-2,1.3909774436090226E-4,0,0,"N/A",0,"N/A"]
[null,8769,"bonnyrigg","Urban",453,0,3.3628232626585,1.085805331,0.10793742000000001,0,2,9.1453634085213037E-3,2.882205513784461E-5,9.1453634085213037E-3,2.882205513784461E-5,0,0,"N/A",0,"N/A"]
[null,8770,"bonnyrigg","Urban",927,4.8485642325179397,0.752851114961819,2.9180899189999998,0.29792975999999999,2.8986920999999999,2,2.524310776942356E-2,1.2907268170426065E-4,2.524310776942356E-2,1.2907268170426065E-4,6,0.24495381884990816,"N/A",4.2994088312856986E-4,"N/A"]
[null,8772,"bonnyrigg","Urban",358,0,2.88760126837821,1.9109716560000001,0,0.29550419999999999,0,0,0,0,0,2,2.4971566409618676E-2,"N/A",6.7490720025996433E-5,"N/A"]
[null,8773,"bonnyrigg","Urban",1329,0,0,5.705288758,2.7065700000000002E-3,0,1,2.293233082706767E-4,1.2531328320802005E-6,2.293233082706767E-4,1.2531328320802005E-6,0,0,"N/A",0,"N/A"]
[null,8774,"bonnyrigg","Urban",1598,0,0,4.7943859169999996,1.3902600000000002E-3,0,1,1.1779448621553885E-4,1.2531328320802005E-6,1.1779448621553885E-4,1.2531328320802005E-6,0,0,"N/A",0,"N/A"]
[null,8776,"bonnyrigg","Urban",496,0,2.3425159272327303,1.298241362,1.5307650000000001E-2,0,1,1.2969924812030074E-3,5.0125313283208019E-6,1.2969924812030074E-3,5.0125313283208019E-6,0,0,"N/A",0,"N/A"]
[null,8777,"bonnyrigg","Urban",690,0,4.10103784296781,2.0149986270000002,1.49379E-2,0,2,1.2656641604010025E-3,2.5062656641604009E-6,1.2656641604010025E-3,2.5062656641604009E-6,0,0,"N/A",0,"N/A"]
[null,8779,"bonnyrigg","Urban",1031,0.27132000000000001,5.98158089191584,3.6559955240000002,5.7991590000000003E-2,0.35496,1,4.9135338345864662E-3,4.1353383458646619E-5,4.9135338345864662E-3,4.1353383458646619E-5,1,2.9995875567109521E-2,"N/A",6.2491407431478172E-5,"N/A"]
[null,8780,"bonnyrigg","Urban",712,0,5.0861718622947505,5.1853444260000003,8.1197100000000005E-3,6.2118E-2,1,6.879699248120301E-4,1.2531328320802005E-6,6.879699248120301E-4,1.2531328320802005E-6,1,5.2492782242441662E-3,"N/A",1.2498281486295635E-5,"N/A"]
[null,8798,"kurrajong","Rural Short",1078,31.8742780584471,1.3285,3.0522199329999999,7.072202034720001,6.6479571000000002,12,2.8896390464331176,1.4286628159322155E-2,1.0431630585434157,1.0691005754062273E-2,13,2.7537386126239825,"N/A",5.5627370136434092E-3,"N/A"]
[null,8799,"kurrajong","Rural Short",1136,55.826098833141799,0.37280999999999997,2.8517870140000001,9.9420302700000018,3.3255314999999999,36,4.0622254183310273,2.1622078934487157E-2,1.6586273787006207,1.0714350461387852E-2,24,1.3775125743587231,"N/A",2.9161484785179097E-3,"N/A"]
[null,8801,"kurrajong","Rural Short",717,76.980609871299009,2.40994142821719,3.8122265070000001,31.263175950000004,1.7579393999999999,23,12.773856501429186,2.6353797158551837E-2,2.5976226590685219,9.0041636703146622E-3,16,0.72817942890050191,"N/A",1.684749646202574E-3,"N/A"]
[null,8802,"kurrajong","Rural Short",1053,48.052366375588399,0.92065999999999992,3.9528343920000002,6.8365042869542378,2.6848287000000002,10,2.7933350364859164,1.1007295771551497E-2,1.0891308776500523,9.3696257348701052E-3,11,1.1121185573641938,"N/A",2.5118085634292927E-3,"N/A"]
[null,9015,"kingswood","Urban",6,0,1.4746282094485401,4.2180460110000002,1.6785289322696885E-2,0,2,1.4221904764189787E-3,1.5115670651320514E-5,2.2562047516182454E-4,7.5206825053941357E-6,0,0,"N/A",0,"N/A"]
[null,9016,"kingswood","Urban",612,1.4032429715489401,2.5107900000000001,2.2215283659999998,1.7009093180332828,0,2,0.14411530161045638,1.5317212926671466E-3,2.2862874816398118E-2,7.6209582721327321E-4,0,0,"N/A",0,"N/A"]
[null,9017,"kingswood","Urban",626,4.2770632117519503,0.53445310614237407,2.4768326549999999,4.0515663391143137,0,5,0.34328267754530961,2.3714526177032098E-3,0.22003596741582282,1.589168838672792E-3,0,0,"N/A",0,"N/A"]
[null,9019,"kingswood","Urban",1061,3.6278300091742901,2.7238175344409803,3.6199861879999999,3.29602045201529,0,7,0.27926649382205426,2.7692713551446236E-3,4.9805151520175839E-2,1.411224786265075E-3,0,0,"N/A",0,"N/A"]
[null,9020,"kingswood","Urban",609,1.29561757372269,2.1888011711103101,4.6419654460000004,1.9474165975218098,0,4,0.1650014655911084,1.5593035420027885E-3,4.354961046350727E-2,7.8841224519126069E-4,0,0,"N/A",0,"N/A"]
[null,9022,"kingswood","Urban",1008,4.1480055588758198,1.3126500000000001,3.8185138510000001,3.0343001089290458,1.2068639999999999,4,0.25709135151342227,2.6247625027506893E-3,5.4272736300334586E-2,1.3374120120161653E-3,2,0.10198597692817238,"N/A",1.9997250378073016E-4,"N/A"]
[null,9025,"kingswood","Urban",2285,6.9224961841646797,8.28223956453391,6.9644723739999996,6.4076645626248085,7.0992E-3,6,0.54291107778106595,5.7840550981283576E-3,8.7955078807107276E-2,2.8954533370121808E-3,1,5.9991751134219043E-4,"N/A",1.2498281486295635E-6,"N/A"]
[null,9026,"kingswood","Urban",759,2.0010958987585101,1.29049418634327,1.8018004940000001,1.9341687216783379,0.283968,4,0.16387899445014989,1.8480268068639674E-3,3.1322907284930576E-2,9.9522472904655626E-4,1,2.3996700453687618E-2,"N/A",4.999312594518254E-5,"N/A"]
[null,9027,"kingswood","Urban",873,1.29617229323163,4.3714711321861399,4.0010373650000002,2.4665698800115043,0,5,0.20898848541328846,2.219354179524965E-3,3.3166106145577946E-2,1.0942586760305428E-3,0,0,"N/A",0,"N/A"]
[null,9029,"kingswood","Urban",816,4.0761572758736904,2.5034584241541102,3.429460599,2.3467810309818402,0,6,0.19883896954877392,2.1222441002851835E-3,3.670373437842929E-2,1.0931232065121595E-3,0,0,"N/A",0,"N/A"]
[null,9030,"kingswood","Urban",948,4.0602975297009305,3.4643610983604498,4.0054194540000001,3.0128176267763473,0.16476060000000001,7,0.25527117546878925,2.4570182895499483E-3,6.9005111939759153E-2,1.274731801500743E-3,4,1.3923085575733338E-2,"N/A",4.749346964792341E-5,"N/A"]
[null,9032,"kingswood","Urban",662,7.3530395549866299,3.5507585664202503,4.411620009,2.4943234276218571,0,11,0.21133999871398049,1.8281757153087183E-3,7.8714251670302493E-2,9.876763923517733E-4,0,0,"N/A",0,"N/A"]
[null,9033,"kingswood","Urban",1219,2.3568497265974804,1.4950600000000001,3.1436722160000001,3.6559464025147017,1.7952102000000001,4,0.30976243876380449,3.184774310068258E-3,7.0647866845916035E-2,1.6670425122406391E-3,3,0.15170414068065641,"N/A",3.1620652160327953E-4,"N/A"]
[null,9034,"kingswood","Urban",523,1.27157399160211,2.7157,1.7663627340000001,1.4575226228541796,1.2139632,2,0.12349353970238133,1.3125440682229975E-3,1.9591377926551752E-2,6.5304593088505762E-4,2,0.10258589443951456,"N/A",2.5871442676631961E-4,"N/A"]
[null,9046,"sherwood","Urban",1129,5.9361035620156599,0.288504976254227,3.5915978750000002,12.000962321807538,3.72708E-2,6,1.0168221705215994,3.8502281380208428E-3,0.49044748380480752,2.452985030251419E-3,1,3.1495669345465E-3,"N/A",8.7487970404069445E-6,"N/A"]
[null,9049,"sherwood","Urban",850,2.6086055372214298,0.76752551001440805,2.5176051309999998,4.5126309627954768,0.97658370000000005,4,0.38234793904940478,4.2926917327577255E-3,0.17348703679376568,3.2312882239857958E-3,4,8.252615265401006E-2,"N/A",1.7622576895676845E-4,"N/A"]
[null,9050,"sherwood","Urban",1717,4.7170856263702596,1.8529599688865102,3.429460599,0.47807195999999996,0.2316114,4,4.05062656641604E-2,2.380952380952381E-4,4.05062656641604E-2,2.380952380952381E-4,1,1.9572308807538963E-2,"N/A",3.624501631025734E-5,"N/A"]
[null,9052,"sherwood","Urban",1156,4.2450130187919504,0.86788123659536598,3.3341978050000001,10.128368945252138,0.40110479999999998,3,0.85816035569418292,3.6748877426678018E-3,0.72986716791979944,3.0213032581453631E-3,2,3.3895339390833758E-2,"N/A",7.9989001512292064E-5,"N/A"]
[null,9055,"sherwood","Urban",1621,2.6956004922406502,2.1066311813998899,4.1193537559999998,0.29195460000000001,0.2245122,3,2.4736842105263158E-2,2.5651629072681701E-3,4.3157894736842103E-3,1.5037593984962406E-5,1,1.8972391296196774E-2,"N/A",5.7492094836959918E-5,"N/A"]
[null,9056,"sherwood","Urban",1547,4.8137385890529201,1.8257399999999999,4.2176649599999996,2.2329646200000002,0.56971079999999996,3,0.1891954887218045,3.9273182957393488E-3,0.1891954887218045,3.9273182957393488E-3,1,4.8143380285210785E-2,"N/A",1.3373161190336329E-4,"N/A"]
[null,9057,"sherwood","Urban",846,1.2081996112025299,2.0875475358827096,1.8063731080000001,0.87172260000000013,0,2,7.3859649122807014E-2,1.3533834586466166E-4,7.3859649122807014E-2,1.3533834586466166E-4,0,0,"N/A",0,"N/A"]
[null,9059,"sherwood","Urban",964,4.8726261059632998,0.56862999922754498,2.689459212,3.031642908828029,0.42728310000000003,3,0.25686621123701991,1.4108082547769913E-3,0.14901904813421052,8.6138522050243737E-4,3,3.6107535213908089E-2,"N/A",8.8737798552699011E-5,"N/A"]
[null,9060,"sherwood","Urban",1317,1.2391849909392598,3.0059795652210299,3.5142444859999999,2.6978439000000001,0,1,0.22858395989974936,1.5463659147869674E-3,0.22858395989974936,1.5463659147869674E-3,0,0,"N/A",0,"N/A"]
[null,9062,"sherwood","Urban",835,3.0921800692830601,1.0843578563932899,4.3382676580000004,0,0.1193553,0,0,0,0,0,2,1.0086113159440578E-2,"N/A",2.9995875567109524E-5,"N/A"]
[null,9063,"sherwood","Urban",0,0,0,2.7146085900000001,0,0.1801422,0,0,0,0,0,1,1.5222906850308082E-2,"N/A",3.624501631025734E-5,"N/A"]
[null,"A045","riverstone","Urban",131,0.94711893114246193,0.98192005286696804,0.84917254900000005,0.46235220315789477,0.34431119999999998,2,3.917435603527876E-2,3.633637936341153E-4,3.917435603527876E-2,3.633637936341153E-4,5,2.909599930009624E-2,"N/A",7.1240204471885118E-5,"N/A"]
[null,"A046","riverstone","Urban",341,5.8264232857802902,1.27819686732634,2.6673582439999999,0.52570765105263195,0.70282080000000002,3,4.4542360893158522E-2,8.582682507842506E-4,4.4542360893158522E-2,8.582682507842506E-4,6,5.9391833622876852E-2,"N/A",1.2498281486295634E-4,"N/A"]
[null,"A047","riverstone","Urban",0,0,0.63958999999999999,0.23644225599999999,0,0,1,0,0,0,0,0,0,"N/A",0,"N/A"]
[null,"A048","riverstone","Urban",301,8.75111348337885,1.59856,3.5868347350000001,1.5200066842105264,6.5223900000000001E-2,12,0.12878771338509612,1.2617899103475564E-3,0.12878771338509612,1.2617899103475564E-3,1,5.5117421354563744E-3,"N/A",8.7487970404069445E-6,"N/A"]
[null,"A049","riverstone","Rural Short",215,0.77472000000000008,3.4905399999999998,0.38105117799999999,0.10773264157894742,0,1,4.4018602148748663E-2,5.8599979095316323E-4,4.4018602148748663E-2,5.8599979095316323E-4,0,0,"N/A",0,"N/A"]
[null,"A051","riverstone","Rural Short",1005,38.770147071721304,2.7155497455135702,4.3820885430000001,12.539875302631579,2.1071312999999998,14,5.1236818651379421,2.623110068189843E-2,1.9887463144034077,1.6743491982305125E-2,14,0.87282284397993004,"N/A",1.7092550956018845E-3,"N/A"]
[null,"A052","riverstone","Rural Short",482,14.8844453917577,5.1550235002954894,3.8564284440000001,3.5767871485300398,3.5615798999999999,13,1.4614435156732311,1.7676212241069765E-2,1.4556905198248153,1.479971431686186E-2,26,1.4752893174619706,"N/A",3.3327411183061832E-3,"N/A"]
[null,"A053","riverstone","Urban",237,9.3865587853589201,2.80255591399483,3.0626988399999999,0.92901108789473685,7.80912E-2,4,7.8713610250672056E-2,6.2772933543780822E-4,7.8713610250672056E-2,6.2772933543780822E-4,3,6.5990926247640955E-3,"N/A",1.4997937783554762E-5,"N/A"]
[null,"A055","riverstone","Rural Short",735,18.234348830837899,3.2649499999999998,2.9516224219999998,0.92029194000000059,2.3422923,5,0.37602312700996982,7.1475888908499935E-3,0.37602312700996982,7.1475888908499935E-3,11,0.9702320053421879,"N/A",1.8746668790472281E-3,"N/A"]
[null,"A095","luddenham","Rural Short",181,20.435463977247,5.6960000000000004E-2,2.0957814770000001,1.8170402400000003,3.5496E-2,9,0.74242653146320681,5.5354455852404229E-3,0.74242653146320681,5.5354455852404229E-3,1,1.4703269639586103E-2,"N/A",3.0631811749137715E-5,"N/A"]
[null,"A096","luddenham","Rural Short",1042,36.295200287576201,3.3158786377174203,4.7909564570000001,4.87485795,0.58834620000000004,16,1.9918237359423252,1.4467092501163284E-2,1.2105523963765796,9.5057378881912465E-3,3,0.24370669427613967,"N/A",5.0236171268585857E-4,"N/A"]
[null,"A098","luddenham","Rural Short",481,30.367167898524897,1.0643499999999999,2.3815698599999999,1.6314996900000001,0.47609010000000002,8,0.66661630780945003,3.6560530339197119E-3,0.62085219272536085,3.4868472736721877E-3,4,0.19720760404094859,"N/A",4.165926397882729E-4,"N/A"]
[null,"A314","homepride","Urban",526,3.0331892797381101,0.78393318014429403,2.1135003569999999,0.18818796000000002,3.5496E-2,1,1.594486215538847E-2,5.3884711779448621E-5,0,0,1,2.9995875567109523E-3,"N/A",6.2491407431478175E-6,"N/A"]
[null,"A315","homepride","Urban",1308,0.49621017710473503,3.0554935660348201,2.2992628060000002,0,0.33898679999999998,0,0,0,0,0,4,2.864606116658959E-2,"N/A",5.2492782242441664E-5,"N/A"]
[null,"A317","homepride","Urban",1120,1.3548498044536099,3.9935400582524601,1.869437078,1.37471571,0.96105419999999997,2,0.11647744360902255,4.4235588972431079E-4,0,0,2,8.1213833097949023E-2,"N/A",1.6497731561910238E-4,"N/A"]
[null,"A318","homepride","Urban",1051,0,4.5643966855949705,2.0957814770000001,0,0.85678469999999995,0,0,0,0,0,3,7.2402544650110617E-2,"N/A",1.2998212745747459E-4,"N/A"]
[null,"A322","homepride","Urban",1453,3.1169790297778399,1.55526579783555,2.6984139150000002,5.3687700000000001E-3,0.91624050000000001,1,4.5488721804511279E-4,3.7593984962406014E-6,4.5488721804511279E-4,3.7593984962406014E-6,2,7.7426853807601448E-2,"N/A",1.3623126820062241E-4,"N/A"]
[null,"A324","homepride","Urban",1085,5.8334842542328893,0.67646000000000006,3.548539092,3.187996879057887,0.74009159999999996,4,0.2701138308124848,2.349312372970654E-3,0.2701138308124848,2.349312372970654E-3,3,6.2541400557423354E-2,"N/A",1.3123195560610414E-4,"N/A"]
[null,"A325","homepride","Urban",1291,3.9568637806193099,1.96443520738637,2.6189647439999999,4.27583337,5.5906200000000003E-2,5,0.36228446115288221,2.587719298245614E-3,0.27653258145363407,2.1591478696741857E-3,2,4.7243504018197498E-3,"N/A",8.7487970404069445E-6,"N/A"]
[null,"A339","cabramatta","Urban",804,0.39555676188755096,2.17632319381176,2.1845664020000002,0,1.24236E-2,0,0,0,0,0,1,1.0498556448488333E-3,"N/A",2.499656297259127E-6,"N/A"]
[null,"A341","cabramatta","Urban",247,2.0228946483541601,0.52951250793123905,1.2858571990000001,0.95503467000000009,0.84169890000000003,3,8.0918546365914792E-2,3.5588972431077696E-4,3.4553884711779455E-2,2.4310776942355891E-4,5,7.1127719938508457E-2,"N/A",9.9986251890365067E-5,"N/A"]
[null,"A343","cabramatta","Urban",420,2.4655580303998601,0.86219458693083795,2.1192161249999999,0.17446284000000001,0.73742940000000001,2,1.4781954887218045E-2,3.7844611528822054E-4,1.4781954887218045E-2,3.7844611528822054E-4,5,6.2316431490670031E-2,"N/A",1.1873367411980855E-4,"N/A"]
[null,"A344","cabramatta","Urban",619,3.4445347854561099,0.148321034301994,1.58383922,2.1363631936122291,0.29772270000000001,3,0.18101060575816053,1.573091013938708E-3,0.15235271102131842,1.4765997858685325E-3,3,2.5159040631913109E-2,"N/A",4.749346964792341E-5,"N/A"]
[null,"A346","cabramatta","Urban",209,3.6799055624202803,1.08027379503819,3.647231347,0.50521161000000003,3.3277500000000002E-2,4,4.2805764411027569E-2,3.5588972431077696E-4,4.2805764411027569E-2,3.5588972431077696E-4,2,2.8121133344165177E-3,"N/A",4.999312594518254E-6,"N/A"]
[null,"A347","cabramatta","Urban",1360,6.0820832233252204,0.73314753431737301,3.6291314159999999,7.81306893,4.7755431000000002,8,0.66198872180451129,5.197994987468672E-3,0.4351741854636591,4.6290726817042605E-3,14,0.40355701091099971,"N/A",7.4989688917773817E-4,"N/A"]
[null,"A348","cabramatta","Urban",805,6.1394170734245304,1.1675890277655601,3.7144868799999999,0.22491153,0.3744828,4,1.9056390977443612E-2,8.7719298245614042E-5,1.9056390977443612E-2,8.7719298245614042E-5,2,3.1645648723300543E-2,"N/A",6.7490720025996433E-5,"N/A"]
[null,"A350","cabramatta","Urban",634,2.8806141926852802,0.792092647973621,2.216384175,3.4832747863877715,2.1244356,4,0.29513225138469662,1.2978363043570315E-3,0.11866859223682694,8.1036763267783329E-4,10,0.17952531526915044,"N/A",3.786979290347577E-4,"N/A"]
[null,"A352","cabramatta","Urban",666,0.301461530842563,2.1173664089709798,1.968891435,0,0.13843440000000001,0,0,0,0,0,1,1.1698391471172714E-2,"N/A",3.2495531864368648E-5,"N/A"]
[null,"A354","cabramatta","Urban",767,0,0,3.8105117769999999,6.9513000000000008E-4,0,1,5.8897243107769425E-5,1.2531328320802005E-6,5.8897243107769425E-5,1.2531328320802005E-6,0,0,"N/A",0,"N/A"]
[null,"AB1213","","Urban",917,0,7.9451007534039295,0,0.62026302,0,2,5.255388471177945E-2,4.7619047619047614E-5,5.255388471177945E-2,4.7619047619047614E-5,0,0,"N/A",0,"N/A"]
[null,"AB1215","","Urban",229,0,2.2835243298702697,0,7.035603E-2,0,2,5.9611528822055143E-3,2.6315789473684209E-5,5.9611528822055143E-3,2.6315789473684209E-5,0,0,"N/A",0,"N/A"]
[null,"AB1245","","Urban",1011,0,8.6711431565684194,0,6.6007770000000007E-2,0,4,5.5927318295739348E-3,2.5062656641604011E-5,5.5927318295739348E-3,2.5062656641604011E-5,0,0,"N/A",0,"N/A"]
[null,"AB1246","","Urban",743,0,5.8526229273353803,0,0.54542562000000006,0.11181240000000001,3,4.6213032581453636E-2,1.2268170426065165E-3,4.6213032581453636E-2,1.2268170426065165E-3,1,9.4487008036394995E-3,"N/A",1.7497594080813889E-5,"N/A"]
[null,"AB1263","","Urban",483,0,5.1382179889070807,0,2.2525170000000001E-2,8.4302999999999999E-3,1,1.9085213032581454E-3,1.2280701754385965E-4,1.9085213032581454E-3,1.2280701754385965E-4,1,7.1240204471885113E-4,"N/A",1.2498281486295635E-6,"N/A"]
[null,"AB1265","","Urban",462,0,2.7140535805810702,0,0.10509774000000001,0,5,8.9047619047619049E-3,7.3934837092731815E-5,2.8082706766917294E-3,3.0075187969924815E-5,0,0,"N/A",0,"N/A"]
[null,"AB12781","","Urban",0,0,0,0,0,0.93176999999999999,0,0,0,0,0,1,7.8739173363662499E-2,"N/A",2.6246391121220833E-4,"N/A"]
[null,"AB1287","","Urban",767,0,7.0403638003509803,0,2.3959800000000002E-3,0,1,2.0300751879699248E-4,1.2531328320802005E-6,2.0300751879699248E-4,1.2531328320802005E-6,0,0,"N/A",0,"N/A"]
[null,"APA2","albion_park","Urban",1467,1.5842756374855802,7.9772523305916598,3.0103043039999999,2.6834309359603599,1.3976550000000001,4,0.22736277271613445,5.2751175468425306E-3,7.5143286591084338E-2,3.4415598317828443E-3,7,0.11810876004549375,"N/A",3.9869517941283075E-4,"N/A"]
[null,"APB2","albion_park","Urban",1468,9.6075443573326389,4.8627700000000003,3.1722510540000002,3.4998700110026095,3.1050125999999998,7,0.29653833798514284,3.3241708167618361E-3,0.13505874641571181,1.379070629630846E-3,8,0.26238892152329052,"N/A",8.4238417217632577E-4,"N/A"]
[null,"APC2","albion_park","Rural Short",1512,54.841345346024305,11.2533342766466,2.746235837,4.2163935085418505,4.2262424999999997,18,1.7227810033699129,2.7519003171554517E-2,0.97460260869805726,1.8495611251199789E-2,32,1.7506080414632204,"N/A",5.5504842889437548E-3,"N/A"]
[null,"APD2","albion_park","Rural Short",628,11.3503038640571,2.0557525286844998,4.3630359839999997,3.2342260987176714,7.9173828000000004,11,1.3214761080022863,2.1718154525262181E-2,0.56433788976300492,1.2598056588006518E-2,23,3.2795642931096802,"N/A",7.9642710547758074E-3,"N/A"]
[null,"APE2","albion_park","Urban",2111,22.307106162258901,3.4691524740430801,4.2056618480000001,4.2079472283947394,4.5190844999999999,5,0.35653257792848747,4.3881707364578698E-3,0.13652521348403757,1.738723856584699E-3,16,0.38188499081376309,"N/A",1.0148604566872054E-3,"N/A"]
[null,"APF2","albion_park","Urban",440,0,0,3.5994094240000001,3.035403935949573,3.1839911999999999,7,0.25718487699552917,4.9365830640999437E-3,0.15723724631012101,3.7572508695153744E-3,11,0.26906300383697246,"N/A",6.9240479434077814E-4,"N/A"]
[null,"APG2","albion_park","Urban",1553,4.6568317343814494,5.7475596154189601,0,0,6.6555000000000003E-2,0,0,0,0,0,2,5.6242266688330354E-3,"N/A",1.4997937783554762E-5,"N/A"]
[null,"APH2","albion_park","Urban",1998,6.1041067892607597,5.3417575666118298,0,0,0.67087439999999998,0,0,0,0,0,1,5.6692204821836997E-2,"N/A",1.0498556448488333E-4,"N/A"]
[null,"AZ1205","anzac_village","Urban",1112,6.7347300464142101,2.8184672280179304,3.4612783720000002,1.1205347700000001,0.99655020000000005,1,9.4941102756892229E-2,1.3897243107769423E-3,9.4941102756892229E-2,1.3897243107769423E-3,2,8.421342065465999E-2,"N/A",1.5247903413280673E-4,"N/A"]
[null,"AZ1227","anzac_village","Urban",1022,9.9365115257234589,6.1531329443275498,4.572614132,0.90587271000000014,0.72411840000000005,3,7.6753132832080198E-2,1.2844611528822056E-3,7.6753132832080198E-2,1.2844611528822056E-3,2,6.1191586156903427E-2,"N/A",1.2748247116021547E-4,"N/A"]
[null,"AZ1253","anzac_village","Urban",1074,0,4.9663500000000003,3.187302576,3.8454000000000001E-3,0.63670950000000004,1,3.2581453634085211E-4,1.2531328320802005E-6,3.2581453634085211E-4,1.2531328320802005E-6,2,5.3805101798502702E-2,"N/A",1.024859081876242E-4,"N/A"]
[null,"AZ1257","anzac_village","Urban",1211,0,7.38931,3.6199861879999999,8.0457600000000008E-3,0,2,6.8170426065162907E-4,3.7593984962406014E-6,6.8170426065162907E-4,3.7593984962406014E-6,0,0,"N/A",0,"N/A"]
[null,"AZ1264","anzac_village","Urban",15,0.57461000000000007,1.21909,1.9523157090000001,6.4188600000000002E-3,0,1,5.4385964912280699E-4,1.7543859649122806E-5,5.4385964912280699E-4,1.7543859649122806E-5,0,0,"N/A",0,"N/A"]
[null,"AZ1272","anzac_village","Urban",1351,5.4208776136284396,4.6708599999999993,4.7631397209999999,3.3395967899999999,0.72500580000000003,4,0.28295864661654135,1.8195488721804512E-3,6.6577694235588972E-2,1.2907268170426065E-4,1,6.1266575845821201E-2,"N/A",1.0748522078214245E-4,"N/A"]
[null,"AZ1290","anzac_village","Urban",614,3.7841349672018798E-2,3.2485462739763604,1.812660452,0.13782801,0,2,1.1677944862155388E-2,6.6416040100250617E-5,1.1677944862155388E-2,6.6416040100250617E-5,0,0,"N/A",0,"N/A"]
[null,"B201","prospect","Urban",1586,6.2942229168605603,2.0756660600880399,3.2374108050000001,0.15066573,17.545672799999998,2,1.2765664160401003E-2,3.7593984962406013E-5,1.1904761904761905E-4,1.2531328320802005E-6,19,1.4826961292822241,"N/A",2.9833397907787678E-3,"N/A"]
[null,"B202","prospect","Urban",58,1.77023108512921,1.36401518946019,3.5247233929999999,0,6.2118E-2,0,0,0,0,0,1,5.2492782242441662E-3,"N/A",8.7487970404069445E-6,"N/A"]
[null,"B204","prospect","Urban",261,2.9507702065541097,2.8008289462692102,4.1294516120000004,0.34289136000000003,0,1,2.9052631578947368E-2,8.020050125313283E-5,0,0,0,0,"N/A",0,"N/A"]
[null,"B205","prospect","Urban",661,2.9134830316800699,1.4824173160185201,1.5539267029999999,2.0977840200000002,0,4,0.17774185463659148,2.9072681704260653E-4,1.0563909774436091E-3,6.2656641604010028E-6,0,0,"N/A",0,"N/A"]
[null,"B210","prospect","Urban",897,5.3196767797935802,0.93476212050720098,2.874269033,0.87564426244299665,1.2565584000000001,4,7.4191925252871604E-2,1.4240405574196077E-4,7.3560346305503177E-2,1.4115092290988056E-4,2,0.10618539950756771,"N/A",2.2121958230743273E-4,"N/A"]
[null,"B211","prospect","Urban",1076,6.2553021898191004,1.6608155180347601,4.1197348070000004,3.4386750000000001E-2,0.90381690000000003,2,2.9135338345864662E-3,1.6290726817042605E-5,3.1203007518796992E-4,1.2531328320802005E-6,6,7.6376998162752618E-2,"N/A",1.6622714376773195E-4,"N/A"]
[null,"B212","prospect","Urban",166,2.13946263473931,0.72253000000000001,1.3123402559999999,4.9694400000000003E-3,4.437E-3,1,4.2105263157894739E-4,1.2531328320802005E-6,4.2105263157894739E-4,1.2531328320802005E-6,1,3.7494844458886903E-4,"N/A",2.499656297259127E-6,"N/A"]
[null,"B214","prospect","Urban",1492,5.0370336169434902,1.5741907424880002,3.8617631600000002,0.74977905,0.24447869999999999,5,6.3527568922305766E-2,1.9548872180451127E-4,6.9636591478696736E-3,1.1403508771929824E-4,1,2.0659659296846683E-2,"N/A",3.624501631025734E-5,"N/A"]
[null,"B215","prospect","Urban",654,3.4635686682450899,1.2271158084279601,4.130213715,0,0.91490939999999998,0,0,0,0,0,3,7.731436927422479E-2,"N/A",1.5497869043006588E-4,"N/A"]
[null,"B217","prospect","Urban",1945,8.2547128735248698,1.83553428935501,3.6020767820000001,4.8905945100000006,0.59588909999999995,6,0.41437218045112784,3.7932330827067668E-3,0.4093107769423559,3.763157894736842E-3,4,5.0355576108285109E-2,"N/A",1.0123608003899464E-4,"N/A"]
[null,"B709","quakers_hill","Urban",403,0.47327745654463399,2.5946400000000001,3.9112998129999998,0.15340188000000002,0,6,1.2997493734335838E-2,9.7744360902255622E-5,1.0591478696741853E-2,7.7694235588972421E-5,0,0,"N/A",0,"N/A"]
[null,"B710","quakers_hill","Urban",1116,0.32414130736299096,5.39942202250871,3.7946981530000001,0.12325986000000001,0.45257399999999998,4,1.044360902255639E-2,1.8671679197994988E-4,4.1528822055137849E-3,1.5288220551378448E-4,1,3.8244741348064638E-2,"N/A",1.0623539263351289E-4,"N/A"]
[null,"B712","quakers_hill","Urban",363,0.30876399793297399,8.1130499999999994,0,0,8.8739999999999999E-3,0,0,0,0,0,1,7.4989688917773806E-4,"N/A",1.2498281486295635E-5,"N/A"]
[null,"B713","quakers_hill","Urban",1578,0,7.0991993748463305,4.1313568680000001,0.76303033496688777,6.2118E-3,1,6.4650328912789726E-2,1.3277537109882831E-3,6.4650328912789726E-2,1.3277537109882831E-3,1,5.2492782242441667E-4,"N/A",1.2498281486295635E-6,"N/A"]
[null,"B715","quakers_hill","Urban",302,0.95815966042104106,2.25371297241976,2.9727707630000002,1.4790000000000001E-3,0.58390920000000002,1,1.2531328320802005E-4,1.2531328320802005E-6,1.2531328320802005E-4,1.2531328320802005E-6,1,4.9343215307895164E-2,"N/A",1.1748384597117896E-4,"N/A"]
[null,"B716","quakers_hill","Urban",1143,2.0648418490328901,4.4820572131928005,2.9906801679999999,0.70452220503311225,0.20498939999999999,2,5.9693029483200252E-2,9.9555455968840484E-4,5.9693029483200252E-2,9.9555455968840484E-4,1,1.7322618140005748E-2,"N/A",8.2488657809551188E-5,"N/A"]
[null,"B718","quakers_hill","Urban",238,0,2.3004099999999998,3.9196829389999999,1.993692E-2,0,3,1.6892230576441103E-3,1.0025062656641604E-5,1.6892230576441103E-3,1.0025062656641604E-5,0,0,"N/A",0,"N/A"]
[null,"B719","quakers_hill","Urban",117,0,8.6193799999999996,2.3686141200000002,0,4.96944E-2,0,0,0,0,0,1,4.1994225793953333E-3,"N/A",9.998625189036508E-6,"N/A"]
[null,"B720","quakers_hill","Urban",1115,4.0689999999999997E-2,6.0391691226956699,4.3820885430000001,0.10051284000000001,0.21120120000000001,1,8.5162907268170433E-3,8.3959899749373436E-5,8.5162907268170433E-3,8.3959899749373436E-5,2,1.7847545962430166E-2,"N/A",6.6240891877366871E-5,"N/A"]
[null,"B743","moorebank","Urban",758,4.9809070456750497,2.05805609536253,4.7484692500000003,0.25228782000000005,0,4,2.1375939849624059E-2,2.5814536340852131E-4,2.1375939849624059E-2,2.5814536340852131E-4,0,0,"N/A",0,"N/A"]
[null,"B745","moorebank","Urban",388,1.8481382332144598,2.0540245116373699,2.9592434459999999,0.80658476027874559,0.61053120000000005,3,6.8340625081868417E-2,5.9577078584964157E-4,0,0,1,5.1592905975428378E-2,"N/A",1.0748522078214245E-4,"N/A"]
[null,"B746","moorebank","Urban",52,1.4101521499710399,1.4518565365977099,5.3042323930000004,1.4553360000000001E-2,0.17748,1,1.2330827067669173E-3,1.0025062656641604E-5,1.2330827067669173E-3,1.0025062656641604E-5,1,1.499793778355476E-2,"N/A",3.1245703715739086E-5,"N/A"]
[null,"B747","moorebank","Urban",635,4.0666047486183299,0.67828999999999995,2.5720954489999999,1.4420250000000001E-2,0,1,1.2218045112781955E-3,1.6290726817042605E-5,1.2218045112781955E-3,1.6290726817042605E-5,0,0,"N/A",0,"N/A"]
[null,"B748","seven_hills","Urban",1036,5.3334114240173802,1.5409678725742002,3.9486428290000002,3.0085818,0.27686880000000003,6,0.25491228070175437,2.7493734335839594E-3,4.3570175438596488E-2,1.5664160401002508E-4,2,2.3396782942345429E-2,"N/A",5.2492782242441664E-5,"N/A"]
[null,"B764","","Urban",1218,0,0,0,0.61971578999999999,0.1277856,5,5.2507518796992482E-2,5.6390977443609026E-4,5.2507518796992482E-2,5.6390977443609026E-4,1,1.0798515204159429E-2,"N/A",3.9994500756146032E-5,"N/A"]
[null,"B773","lennox","Urban",994,1.23817237731073,2.9235029055239203,2.2245767750000001,0.83880006000000007,0,3,7.1070175438596492E-2,1.4636591478696742E-3,7.1070175438596492E-2,1.4636591478696742E-3,0,0,"N/A",0,"N/A"]
[null,"B776","lennox","Urban",1517,4.5393804802697293,1.0238752798761901,3.7041984979999998,10.270723230000002,1.8826191000000001,3,0.87022180451127817,3.0889724310776945E-3,0,0,6,0.1590906250390571,"N/A",3.8494706977790558E-4,"N/A"]
[null,"B778","lennox","Urban",1067,0,1.80434301622565,2.8493101809999999,0,0.32301360000000001,0,0,0,0,0,1,2.7296246766069666E-2,"N/A",1.2998212745747459E-4,"N/A"]
[null,"BDA2","bomaderry","Urban",1845,12.9627667653816,3.2477014698316697,3.8105117769999999,0.67381760999999996,2.2788431999999998,8,5.709147869674186E-2,2.3182957393483709E-4,4.8610275689223062E-2,1.7293233082706769E-4,11,0.19257352114084311,"N/A",4.011948357100899E-4,"N/A"]
[null,"BDB2","bomaderry","Urban",157,3.7704342732286502,0.57710000000000006,1.679673591,3.8897699999999999E-3,3.01716E-2,2,3.2957393483709272E-4,5.0125313283208019E-6,3.2957393483709272E-4,5.0125313283208019E-6,1,2.5496494232043095E-3,"N/A",4.999312594518254E-6,"N/A"]
[null,"BDC2","bomaderry","Rural Short",962,38.866240487346793,1.29077187448873,2.7323274689999999,0.24654930000000003,0.72500580000000003,4,0.10073785797593654,3.6258377195897968E-3,9.8749690293028131E-2,3.6197946567238137E-3,9,0.30031428238854618,"N/A",7.7192165607827055E-4,"N/A"]
[null,"BDD2","bomaderry","Urban",678,3.0250034630416001,2.9806999999999997,2.4457769840000001,0.78985995000000009,0.40110479999999998,1,6.6923558897243107E-2,8.7719298245614037E-4,6.6923558897243107E-2,8.7719298245614037E-4,4,3.3895339390833765E-2,"N/A",9.498693929584682E-5,"N/A"]
[null,"BDE2","bomaderry","Urban",1317,9.0991363642137806,1.08769,2.8432133620000002,0.11342451000000001,0,4,9.6102756892230568E-3,9.0225563909774437E-5,9.6102756892230568E-3,9.0225563909774437E-5,0,0,"N/A",0,"N/A"]
[null,"BDF2","bomaderry","Rural Short",1268,44.826025457740499,3.0090300000000001,3.1183323120000002,5.6210726100000006,8.3317986000000008,14,2.2967204297826309,2.7586581983212372E-2,2.2081412142930521,2.7344859468573051E-2,19,3.4512249661518473,"N/A",9.324323496437522E-3,"N/A"]
[null,"BDG2","bomaderry","Rural Short",1590,29.861028814907201,5.5966400000000007,3.3957375700000001,0.24625350000000001,0.74541599999999997,7,0.10061699671861686,2.8402395470120075E-4,0.10061699671861686,2.8402395470120075E-4,4,0.30876866243130818,"N/A",1.0231025124211998E-3,"N/A"]
[null,"BGA2","bolong","Rural Short",730,33.901456125210402,0.39657779819257499,1.3637821649999999,0.42513390950310548,1.2552273,8,0.17370594601679457,9.307137906669009E-3,0.17370594601679457,9.307137906669009E-3,7,0.51994437262986359,"N/A",1.2313988323153361E-3,"N/A"]
[null,"BGB2","bolong","Rural Short",29,4.7752403018995704,9.1653098630885096E-2,0.973585759,0.10909731089059496,0,7,4.4576193929787469E-2,7.9191455534855838E-4,4.4576193929787469E-2,7.9191455534855838E-4,0,0,"N/A",0,"N/A"]
[null,"BJ1255","berrima_junction","Urban",2,0,0.42325999999999997,1.843906649,0,1.41984E-2,0,0,0,0,0,1,1.1998350226843809E-3,"N/A",2.499656297259127E-6,"N/A"]
[null,"BK1236","blackheath","Urban",959,8.5483075943486888,0.46502918537266996,2.1182634970000001,10.826395492629286,4.96944E-2,8,0.9173030185868053,6.4384657016937205E-3,7.4875979356637298E-2,3.4907994227747281E-3,1,4.1994225793953333E-3,"N/A",8.7487970404069445E-6,"N/A"]
[null,"BK1251","blackheath","Rural Short",942,78.481050072136313,0.36166999999999999,2.0167133580000001,15.443991885931997,2.9062350000000001,26,6.3102781520228737,4.2831788044567408E-2,2.014082817732306,3.1300202821051448E-2,23,1.2038302017411122,"N/A",2.6343358104258434E-3,"N/A"]
[null,"BK1288","blackheath","Rural Short",1388,12.7064634949843,0.27406000000000003,2.0479595540000002,16.344785077821417,5.2454213999999997,13,6.6783342634385097,4.452677927399646E-2,0.82949804036693653,2.7833753792158456E-2,4,2.1727756709898363,"N/A",4.680540835268243E-3,"N/A"]
[null,"BK1299","blackheath","Rural Short",728,14.003025791051002,0.23075000000000001,1.4215114179999999,10.950903682546688,2.5060175999999998,10,4.4744421496250384,2.8846600912068237E-2,0.90791983795046327,1.722469145823197E-2,7,1.0380508365547789,"N/A",2.156479547139295E-3,"N/A"]
[null,"BL1210","bulli","Urban",1234,6.7971921180114299,1.9859800000000001,1.619467505,2.4513389700000006,0.76538249999999997,9,0.20769799498746871,2.1303258145363405E-3,0.20759899749373434,2.1290726817042604E-3,2,6.4678606691579904E-2,"N/A",1.5622851857869543E-4,"N/A"]
[null,"BL1213","bulli","Urban",619,3.1544592903159598,1.85076,0.71980567500000003,0.64936974000000003,0.80531549999999996,1,5.5020050125313281E-2,7.7318295739348369E-4,5.5020050125313281E-2,7.7318295739348369E-4,1,6.8053142692879723E-2,"N/A",1.5122920598417718E-4,"N/A"]
[null,"BL1232","bulli","Urban",1489,19.259895029014899,1.88067206866581,2.457780096,3.591012000000001,1.7419662,13,0.30426065162907268,2.266917293233083E-3,1.5091478696741857E-2,1.3408521303258147E-4,6,0.14720475934558996,"N/A",3.2870480308957518E-4,"N/A"]
[null,"BL1243","bulli","Urban",1202,8.4698169937086298,0.12852000000000002,1.9433610059999999,0.33360324000000002,8.0686844999999998,3,2.8265664160401001E-2,1.4411027568922306E-3,2.8265664160401001E-2,1.4411027568922306E-3,9,0.68184374648485846,"N/A",1.4810463561260325E-3,"N/A"]
[null,"BL1251","bulli","Urban",1552,6.0915133399436199,3.2048594179743,2.3244121839999998,3.985905E-2,0.49161959999999999,1,3.3771929824561405E-3,6.1403508771929827E-5,3.3771929824561405E-3,6.1403508771929827E-5,3,4.154428766044669E-2,"N/A",1.0873504893077203E-4,"N/A"]
[null,"BWA2","bowral","Rural Short",1780,12.4106111559214,1.31385,2.1529391539999998,0.14457225000000001,1.1917781999999999,4,5.9070939514983767E-2,1.3053015790523267E-3,5.9070939514983767E-2,1.3053015790523267E-3,4,0.49366227814910341,"N/A",1.1885142958665436E-3,"N/A"]
[null,"BWB2","bowral","Urban",571,5.4697232221719592,0.909013410606894,3.3044758129999998,0.47675565000000003,0,3,4.0394736842105268E-2,1.2155388471177944E-4,3.8672932330827067E-2,1.0776942355889724E-4,0,0,"N/A",0,"N/A"]
[null,"BWC2","bowral","Rural Short",442,7.0158947771847,4.9210000000000004E-2,0.809924278,0.52682345885017423,1.2578895000000001,7,0.21525539426005463,9.4431806067458296E-4,0.14172340530677355,8.8993049488073593E-4,3,0.52104711785283253,"N/A",1.1578824841174057E-3,"N/A"]
[null,"BWD2","bowral","Urban",787,4.8831599981365095,0.83462999999999998,3.5702590089999999,2.4922629000000005,0.40110479999999998,5,0.21116541353383461,2.0563909774436095E-3,7.1736842105263154E-2,1.0739348370927318E-3,2,3.3895339390833765E-2,"N/A",7.1240204471885118E-5,"N/A"]
[null,"BWE2","bowral","Rural Short",898,49.8216086037324,4.4221700000000004,4.1719388190000002,7.7411053340900278,0.93132630000000005,34,3.1629470037932608,1.8211225245896783E-2,1.1794547948682308,7.4148381365611356E-3,11,0.38577703716864037,"N/A",9.0670162777447638E-4,"N/A"]
[null,"BWF2","bowral","Rural Short",136,30.217889197385599,3.6151399999999998,0.57024308700000004,1.4360609711498258,0.1304478,16,0.58676178012461044,1.38226114272887E-3,0.2597716484462706,4.3350027276953967E-4,3,5.4034515925478928E-2,"N/A",1.2252724699655086E-4,"N/A"]
[null,"BWG2","bowral","Urban",457,3.2530660454207601,1.0276443355959499,3.5573032690000002,0.36696948000000001,0,2,3.1092731829573936E-2,6.8922305764411025E-5,3.1092731829573936E-2,6.8922305764411025E-5,0,0,"N/A",0,"N/A"]
[null,"BWH2","bowral","Rural Short",1119,147.22711969642501,1.59352,2.5842890870000002,16.301641530000005,2.3631462000000001,47,6.6607061923265185,2.7441548474428781E-2,4.9298762985031335,1.9090035593640278E-2,22,0.97887017625544481,"N/A",2.2606277070863633E-3,"N/A"]
[null,"BWK2","bowral","Urban",1232,2.63E-3,14.983923051461499,0,0,2.48472E-2,0,0,0,0,0,1,2.0997112896976667E-3,"N/A",3.4995188161627778E-5,"N/A"]
[null,"BYB2","berry","Rural Short",734,38.498938995848498,1.8844700000000001,1.752454366,2.5183380836901716,3.0553181999999999,13,1.0289706124096585,1.7884123238588637E-2,1.0256590139590998,1.7859950987124704E-2,16,1.2655839342273738,"N/A",3.3327411183061832E-3,"N/A"]
[null,"BYC2","berry","Rural Short",408,52.085576373788101,0.24281999999999998,0.93490906399999996,5.3637312194597717,7.0659225000000001,25,2.1915730192989202,1.6121755633973601E-2,1.9926837342536883,1.5475147907313417E-2,45,2.9268696126301093,"N/A",6.8063885706584008E-3,"N/A"]
[null,"BYD2","berry","Rural Short",980,18.419003735073399,1.34453,1.9277379079999999,1.4122005657220964,0.22628699999999999,17,0.57701263002267589,2.3356625056420079E-2,0.57457123262481891,2.333245280495615E-2,4,9.3733343952361409E-2,"N/A",2.573072186927568E-4,"N/A"]
[null,"BYE2","berry","Rural Short",208,27.449675815611698,0.43507000000000001,1.0753264229999999,0.80614756679127764,1.3546161000000001,18,0.32938474816625524,5.1995295411330694E-3,0.29197214596295457,3.9365294021426233E-3,7,0.56111352762070466,"N/A",1.1885142958665434E-3,"N/A"]
[null,"BYF2","berry","Urban",485,2.7984800000000001,0.71135999999999999,1.3845494540000001,0.24098875825650129,1.0347084,2,2.0418588582384059E-2,1.2217629779520702E-3,2.0418588582384059E-2,1.2217629779520702E-3,5,8.7437977278124246E-2,"N/A",2.0997112896976666E-4,"N/A"]
[null,"BYG2","berry","Rural Short",625,27.700772245414502,1.8023699999999998,1.330821238,3.2713525456864812,0.87497639999999999,11,1.3366456450559105,1.9816105394828462E-2,0.67959550576331107,1.4951439787712149E-2,5,0.36243559661579744,"N/A",1.0598606865201649E-3,"N/A"]
[null,"C808","cranebrook","Urban",388,0,4.5155298448470802,5.1251382999999998E-2,2.2844141633327226E-2,0,1,1.9355472549974686E-3,4.8388681374936715E-4,1.9355472549974686E-3,4.8388681374936715E-4,0,0,"N/A",0,"N/A"]
[null,"C811","cranebrook","Urban",733,0,6.1190926796447398,4.1044927600000003,3.1857670829895395,0,2,0.26992490379003115,4.5604865991368581E-3,3.6655052937905387E-3,9.1637632344763532E-4,0,0,"N/A",0,"N/A"]
[null,"C812","cranebrook","Urban",494,3.5565308006051399,7.9482434882047501,3.6784775440000002,8.7863348467608807E-2,0.63892800000000005,2,7.4445197228711407E-3,6.6188181041703135E-4,7.4445197228711407E-3,6.6188181041703135E-4,9,5.3992576020797142E-2,"N/A",1.124845333766607E-4,"N/A"]
[null,"C814","cranebrook","Urban",1,0,0,0.73161826100000005,0,3.0615300000000002E-2,0,0,0,0,0,1,2.5871442676631963E-3,"N/A",3.7494844458886905E-6,"N/A"]
[null,"C820","castle_hill","Urban",531,0.18740457465153199,1.42397,1.222983755,0.65328909000000002,0.46899089999999999,3,5.5352130325814534E-2,5.0250626566416038E-4,5.5352130325814534E-2,5.0250626566416038E-4,2,3.9632050593043457E-2,"N/A",1.4498006524102936E-4,"N/A"]
[null,"C824","castle_hill","Urban",771,0.27907541298004002,5.3986843585965101,3.5007171690000001,4.8777420000000002E-2,1.2299363999999999,2,4.1328320802005011E-3,2.380952380952381E-5,4.1328320802005011E-3,2.380952380952381E-5,7,0.10393570884003449,"N/A",3.1120720900876128E-4,"N/A"]
[null,"C826","castle_hill","Urban",511,2.8728493440027703,0.7144189128340459,1.467047E-2,3.71396127,0,3,0.31467794486215539,2.8696741854636592E-4,2.0892230576441101E-2,7.2681704260651618E-5,0,0,"N/A",0,"N/A"]
[null,"C827","castle_hill","Urban",363,0,2.29297,4.0606718749999997,0,1.5928830000000001E-2,0,0,0,0,0,1,1.3460649160740399E-3,"N/A",3.7494844458886905E-6,"N/A"]
[null,"C832","castle_hill","Urban",1038,7.4874909950831299,5.2664978270335299,2.2552513950000002,4.0292692800000012,0.5164668,10,0.34139348370927319,3.4686716791979947E-3,0.21328822055137842,2.1854636591478694E-3,4,4.3643998950144355E-2,"N/A",9.3737111147217258E-5,"N/A"]
[null,"C836","","Urban",975,0,0,0,0.64454820000000002,0,5,5.4611528822055132E-2,3.897243107769423E-4,5.4611528822055132E-2,3.897243107769423E-4,0,0,"N/A",0,"N/A"]
[null,"C847","emu_plains","Rural Short",2,2.33691941863212,0.31515882158974395,0.254923238,1.833466645578725E-3,0.1490832,3,7.4913821513963462E-4,3.6251426153061477E-5,7.4913821513963462E-4,3.6251426153061477E-5,6,6.1753732486261634E-2,"N/A",1.286536093463784E-4,"N/A"]
[null,"C848","emu_plains","Urban",75,3.2433186427882603,0.98188158456332408,5.4137846070000002,0.11416079256362324,0,4,9.6726597226351255E-3,2.7814287696235565E-4,9.6726597226351255E-3,2.7814287696235565E-4,0,0,"N/A",0,"N/A"]
[null,"C849","emu_plains","Urban",3,0,2.2137277049894699,1.5514498699999999,3.6669332911574352E-3,0,3,3.1069334010799777E-4,1.5034711148828221E-5,3.1069334010799777E-4,1.5034711148828221E-5,0,0,"N/A",0,"N/A"]
[null,"C851","emu_plains","Urban",902,5.3699198847882297,1.3191654003933599,3.7503056909999999,2.3911149172192667,0,7,0.20259530818419158,4.5081261745305041E-3,0.20259530818419158,4.5081261745305041E-3,0,0,"N/A",0,"N/A"]
[null,"C852","emu_plains","Urban",850,7.7518262865450298,2.3296241106245601,3.843853755,3.3498885077253773,2.8538784000000001,13,0.28383064725076523,5.5858550041530857E-3,0.17100733898008855,4.5219452297169949E-3,4,0.24116683955956056,"N/A",5.0243091574908453E-4,"N/A"]
[null,"C854","emu_plains","Urban",962,4.7489738122940102,1.2925702071035101,4.1254505750000003,0.90203059335873448,0.54663839999999997,5,7.6427596489426264E-2,3.6070876328131627E-3,7.367070425884982E-2,3.5757593120111578E-3,4,4.6193648373348661E-2,"N/A",1.0123608003899464E-4,"N/A"]
[null,"C855","emu_plains","Urban",639,17.557008017063719,0.54588000000000003,2.286307066,2.3516446432624014,0.496944,7,0.19925105556846825,3.2677098929927264E-3,0.19925105556846825,3.2677098929927264E-3,1,4.199422579395333E-2,"N/A",8.7487970404069435E-5,"N/A"]
[null,"C857","emu_plains","Urban",402,5.0356679080336297,2.28580777779016,4.1041117089999997,0.64734812243853324,8.8739999999999999E-3,4,5.484876173179172E-2,1.7027185144745385E-3,5.484876173179172E-2,1.7027185144745385E-3,1,7.4989688917773806E-4,"N/A",2.499656297259127E-6,"N/A"]
[null,"C868","emu_plains","Urban",2,7.2308014319962699E-2,2.59626700253733,4.4051421389999996,1.833466645578725E-3,4.437E-2,3,1.5534667005399951E-4,7.5173555744141104E-6,1.5534667005399951E-4,7.5173555744141104E-6,2,3.7494844458886901E-3,"N/A",4.999312594518254E-6,"N/A"]
[null,"C869","emu_plains","Urban",817,4.3479766615620701,2.6303044798211301,3.7030553450000001,1.0898086481365927,5.7681E-3,7,9.2337728036842689E-2,3.1347552922565214E-3,7.6104645330075771E-2,3.0708455178204311E-3,1,4.8743297796552973E-4,"N/A",1.2498281486295635E-6,"N/A"]
[null,"C889","cambridge_park","Urban",766,0.18587999999999999,4.00064386350493,2.7740525730000001,0.10691691,1.6607691,5,9.0588972431077698E-3,1.2531328320802004E-5,9.1854636591478687E-4,3.7593984962406014E-6,4,0.14034320280961368,"N/A",3.0370824011698394E-4,"N/A"]
[null,"C890","cambridge_park","Urban",922,0,5.58919927892555,3.39097443,0.15022202999999998,0,5,1.2728070175438597E-2,4.3859649122807008E-5,1.2728070175438597E-2,4.3859649122807008E-5,0,0,"N/A",0,"N/A"]
[null,"C891","cambridge_park","Urban",835,9.0968673230316313,0.88257000000000008,2.5088409540000001,4.4528844599999999,0,3,0.37728571428571428,2.087719298245614E-3,8.0142857142857141E-2,1.0451127819548873E-3,0,0,"N/A",0,"N/A"]
[null,"C893","cambridge_park","Urban",149,0.18067,2.1468590354890398,2.286307066,0,0.18546660000000001,0,0,0,0,0,1,1.5672844983814726E-2,"N/A",4.749346964792341E-5,"N/A"]
[null,"C896","cambridge_park","Urban",708,1.7739500000000001,4.9833163943102896,2.4621621839999999,0.22111050000000002,0,7,1.8734335839598996E-2,1.1654135338345864E-4,1.6392230576441104E-2,7.7694235588972421E-5,0,0,"N/A",0,"N/A"]
[null,"C897","cambridge_park","Urban",312,2.3543701320723898,0.58574999999999999,3.2389350100000001,0.60281082000000008,0,3,5.1075187969924808E-2,7.7819548872180453E-4,5.1075187969924808E-2,7.7819548872180453E-4,0,0,"N/A",0,"N/A"]
[null,"C899","cambridge_park","Urban",566,0,5.1136081478904698,2.725278023,0.23209947,0,6,1.9665413533834587E-2,7.2681704260651631E-5,1.9665413533834587E-2,7.2681704260651631E-5,0,0,"N/A",0,"N/A"]
[null,"C900","cambridge_park","Urban",712,0.96851781055388408,4.8773137575371699,3.7893634359999999,0.37520751000000002,1.4677595999999999,7,3.1790726817042606E-2,1.1654135338345864E-4,3.1790726817042606E-2,1.1654135338345864E-4,3,0.12403294546999788,"N/A",2.5996425491494918E-4,"N/A"]
[null,"CA1206","casula","Urban",255,7.6239999999999988E-2,2.3092100000000002,0,0,1.02051E-2,0,0,0,0,0,1,8.6238142255439876E-4,"N/A",1.2498281486295635E-6,"N/A"]
[null,"CA1210","casula","Urban",1222,4.0924571247546604,4.8630236950262899,2.2586808559999998,1.2992127600000001,1.3342058999999999,4,0.11008020050125314,1.5827067669172933E-3,6.7518796992481209E-3,5.6390977443609016E-5,3,0.11274699728787292,"N/A",2.224694104560623E-4,"N/A"]
[null,"CA1213","casula","Urban",676,3.13840723866987,3.64874352390343,0.56262206400000003,4.8008340000000004E-2,3.0730662,4,4.0676691729323311E-3,3.258145363408521E-5,4.0676691729323311E-3,3.258145363408521E-5,14,0.25968929272225072,"N/A",5.474247290997487E-4,"N/A"]
[null,"CA1221","casula","Urban",578,0.22991999999999999,4.3143000000000002,2.2116210349999998,0.13537287000000001,0.57858480000000001,3,1.1469924812030075E-2,6.3909774436090222E-5,1.1469924812030075E-2,6.3909774436090222E-5,2,4.8893277174388516E-2,"N/A",1.0373573633625378E-4,"N/A"]
[null,"CA1236","casula","Urban",726,1.1637681090899801,4.45812077831265,0,0.48349988999999999,0.27686880000000003,10,4.0966165413533838E-2,1.1528822055137844E-4,4.0966165413533838E-2,1.1528822055137844E-4,3,2.3396782942345425E-2,"N/A",4.8743297796552972E-5,"N/A"]
[null,"CA1238","casula","Urban",514,0.51613999999999993,5.1387600000000004,0,3.6975000000000003E-3,0.44325629999999999,1,3.1328320802005011E-4,1.2531328320802005E-6,3.1328320802005011E-4,1.2531328320802005E-6,2,3.7457349614428016E-2,"N/A",6.9990376323255543E-5,"N/A"]
[null,"CA1251","casula","Urban",83,0,3.61232,0,3.71229E-3,0.1987776,1,3.1453634085213035E-4,1.2531328320802005E-6,3.1453634085213035E-4,1.2531328320802005E-6,1,1.6797690317581333E-2,"N/A",3.4995188161627778E-5,"N/A"]
[null,"CA1254","casula","Urban",694,0.456902907575849,4.05493068755385,3.8863409610000001,0,0.1388781,0,0,0,0,0,2,1.17358863156316E-2,"N/A",2.8746047418479962E-5,"N/A"]
[null,"CA1265","casula","Urban",717,0.25610000000000005,4.6023788057838697,2.3545152269999998,3.6058020000000003E-2,0.70282080000000002,2,3.0551378446115286E-3,3.258145363408521E-5,3.0551378446115286E-3,3.258145363408521E-5,1,5.9391833622876852E-2,"N/A",1.0998487707940159E-4,"N/A"]
[null,"CA1269","casula","Urban",539,0.34599000000000002,2.9665456169043001,4.9132738849999997,7.80912E-2,0.71701919999999997,1,6.6165413533834589E-3,5.0125313283208022E-5,6.6165413533834589E-3,5.0125313283208022E-5,2,6.0591668645561238E-2,"N/A",1.062353926335129E-4,"N/A"]
[null,"CA1280","casula","Urban",307,0.1105,4.0028800000000002,0,8.859210000000001E-3,8.1640799999999999E-2,2,7.5062656641604005E-4,5.0125313283208019E-6,7.5062656641604005E-4,5.0125313283208019E-6,1,6.8990513804351901E-3,"N/A",9.998625189036508E-6,"N/A"]
[null,"CA1284","casula","Urban",1381,3.75215581879272,5.3573301109778502,5.9682140700000001,4.1265874799999995,0.66554999999999997,10,0.34963909774436097,4.5701754385964908E-3,0.34940476190476194,4.5689223057644108E-3,2,5.6242266688330357E-2,"N/A",1.1498418967391984E-4,"N/A"]
[null,"CD1204","cawdor","Urban",317,3.4371428132388901,3.0739000000000001,3.6544713190000002,3.1059E-3,2.48472E-2,1,2.631578947368421E-4,1.2531328320802005E-6,2.631578947368421E-4,1.2531328320802005E-6,1,2.0997112896976667E-3,"N/A",4.999312594518254E-6,"N/A"]
[null,"CD1230","cawdor","Rural Short",259,33.891133311175402,5.4663199999999996,0.13336791200000001,1.7469800099999999,9.7614000000000006E-2,16,0.71380054266704551,3.3599429534865461E-3,0.35936281945141074,1.7827035454649838E-3,4,4.0433991508861782E-2,"N/A",1.6541178344534367E-4,"N/A"]
[null,"CD1234","cawdor","Rural Short",475,58.316891077777299,1.1670099999999999,3.7411604619999999,2.1612183300000001,0.49516919999999998,22,0.88305464741749706,4.2422301319200639E-3,0.46970914738426028,3.8494310456311689E-3,6,0.20511061147222609,"N/A",4.8398262563637597E-4,"N/A"]
[null,"CD1260","cawdor","Urban",1321,7.9478983418133806,2.41868598614179,1.6956777409999999,9.2570610000000011E-2,1.0994885999999999,3,7.8433583959899751E-3,6.641604010025063E-5,7.8433583959899751E-3,6.641604010025063E-5,3,9.2912224569121737E-2,"N/A",1.5747834672732501E-4,"N/A"]
[null,"CD1267","cawdor","Urban",1124,5.6556046642161002,8.4871599999999994,5.0489281039999998,4.6343577599999994,0,2,0.39266165413533832,1.4223057644110275E-3,0.39266165413533832,1.4223057644110275E-3,0,0,"N/A",0,"N/A"]
[null,"CD1271","cawdor","Rural Short",724,15.8390575090695,5.1279700000000004,4.3249308659999999,9.811686E-2,1.0284966,5,4.008967905293119E-2,1.8733494884547283E-4,4.008967905293119E-2,1.8733494884547283E-4,11,0.42602723780700735,"N/A",9.8021797597240687E-4,"N/A"]
[null,"CD1297","cawdor","Urban",770,0,0,4.3439834250000002,0.10462446000000002,0.15973200000000001,4,8.864661654135339E-3,9.7744360902255636E-5,8.864661654135339E-3,9.7744360902255636E-5,2,1.3498144005199286E-2,"N/A",5.6242266688330356E-5,"N/A"]
[null,"CJ1204","cheriton_ave","Urban",1026,5.6257736374483498,3.97995238472499,3.4309848039999999,0.17798479766783495,0.27376289999999998,3,1.5080364676721806E-2,1.3264575203037593E-3,1.5080364676721806E-2,1.3264575203037593E-3,4,2.3134319031133221E-2,"N/A",5.4992438539700787E-5,"N/A"]
[null,"CJ1241","cheriton_ave","Urban",1218,4.1601781001855995,7.2926858784815707,3.9617890939999998,0.17443893592184415,0.31857659999999999,1,1.4779929533252006E-2,1.4779929533252005E-3,1.4779929533252006E-2,1.4779929533252005E-3,2,2.6921298321480797E-2,"N/A",8.1238829660921613E-5,"N/A"]
[null,"CJ1245","cheriton_ave","Urban",1158,3.5066892486047802E-2,11.695855952425099,5.0273987130000002,0.56671565457414819,0.88118819999999998,7,4.8016902853325688E-2,1.5394095835781832E-3,4.8016902853325688E-2,1.5394095835781832E-3,2,7.4464761095349385E-2,"N/A",1.5997800302458413E-4,"N/A"]
[null,"CJ1249","cheriton_ave","Urban",690,0.94988122319488799,4.45045,4.5609920710000003,1.4049779098647297,0,7,0.11904151096679574,3.406782675626943E-3,1.7810934525692993E-2,2.5383616229953643E-3,0,0,"N/A",0,"N/A"]
[null,"CJ1253","cheriton_ave","Urban",245,0.90330723217007303,5.6867453391089704,4.0854402009999999,0.71944223325150303,0,4,6.095717939638675E-2,6.9659513262113168E-4,2.8997279647013319E-2,3.8957758876148249E-4,0,0,"N/A",0,"N/A"]
[null,"CJ1267","cheriton_ave","Urban",1314,1.8908762358248201,3.5383875926108299,4.8667856409999999,1.9625998744013029,0,5,0.1662879201385227,3.3538546704938721E-3,0.1662879201385227,3.3538546704938721E-3,0,0,"N/A",0,"N/A"]
[null,"CJ1275","cheriton_ave","Urban",1207,7.2223844322185897,0.73165999999999998,4.2176649599999996,1.2511531255235477,9.5839199999999999E-2,7,0.10600818523010939,2.8989388237628199E-3,0.10600818523010939,2.8989388237628199E-3,1,8.0988864031195703E-3,"N/A",2.2496906675332143E-5,"N/A"]
[null,"CJ1286","cheriton_ave","Urban",282,0,3.6160032530020301,3.0404073469999999,4.1687949093186336E-2,0,1,3.5321526511669921E-3,3.5321526511669925E-4,3.5321526511669921E-3,3.5321526511669925E-4,0,0,"N/A",0,"N/A"]
[null,"CLA2","culburra","Rural Short",1332,48.501490459334299,2.1328100000000001,2.443109626,1.2840086253879002,0.45035550000000002,12,0.52463453980280528,2.7719526381076758E-2,0.52463453980280528,2.7719526381076758E-2,7,0.18654773355224871,"N/A",5.6362533618413391E-4,"N/A"]
[null,"CLB2","culburra","Rural Short",2112,26.697710673137202,0.89975000000000005,0,7.4577676747645085E-4,0,1,3.047177748377129E-4,1.5235888741885615E-4,3.047177748377129E-4,1.5235888741885615E-4,0,0,"N/A",0,"N/A"]
[null,"CLC2","culburra","Rural Short",2342,18.4999372939923,0.51023000000000007,3.6529471149999999,0.5087411301748942,0.1206864,4,0.20786711508844652,3.0413654716674201E-2,0.20786711508844652,3.0413654716674201E-2,1,4.9991116774592753E-2,"N/A",2.0829631989413645E-4,"N/A"]
[null,"CLD2","culburra","Rural Short",935,8.9632853107218402,1.9895932110988499,4.2759657899999999,5.2938078298857718,3.8584152,10,2.1630029422875414,4.0064189071725223E-2,2.1630029422875414,4.0064189071725223E-2,6,1.5982454098230094,"N/A",4.5028763271232446E-3,"N/A"]
[null,"CN1206","chipping_norton","Urban",292,3.1667886298366104,0.56647000000000003,0,2.4110066400000001,0.62251109999999998,3,0.20428070175438598,1.0789473684210526E-3,2.674937343358396E-2,7.1177944862155392E-4,3,5.2605266775818331E-2,"N/A",7.8739173363662503E-5,"N/A"]
[null,"CN1210","chipping_norton","Urban",639,0.9302999999999999,5.5804326629450598,0,0.29136300000000004,0,3,2.4686716791979948E-2,5.6390977443609023E-5,8.9097744360902252E-3,2.6315789473684212E-5,0,0,"N/A",0,"N/A"]
[null,"CN1213","chipping_norton","Urban",241,2.8177020217101201,1.0291271754433899,3.7813613620000002,0.95055330000000016,0.35141040000000001,6,8.0538847117794479E-2,4.5112781954887219E-4,1.1091478696741854E-2,4.6365914786967409E-5,3,2.969591681143843E-2,"N/A",5.4992438539700794E-5,"N/A"]
[null,"CN1217","chipping_norton","Urban",635,0,5.7606599999999997,0,0,0.80575920000000001,0,0,0,0,0,3,6.8090637537338627E-2,"N/A",1.8247490969991627E-4,"N/A"]
[null,"CN1239","chipping_norton","Urban",335,2.1007225802750398,1.3416400000000002,0,0.27113028,0.30349080000000001,3,2.2972431077694234E-2,3.5213032581453635E-4,2.2972431077694234E-2,3.5213032581453635E-4,2,2.5646473609878644E-2,"N/A",3.1245703715739086E-5,"N/A"]
[null,"CN1243","chipping_norton","Urban",204,1.84620885513083,1.33756437219015,0,6.37449E-3,0,1,5.4010025062656644E-4,1.2531328320802005E-6,5.4010025062656644E-4,1.2531328320802005E-6,0,0,"N/A",0,"N/A"]
[null,"CN1247","chipping_norton","Urban",407,0,4.4486099999999995,0,0,8.6521500000000001E-2,0,0,0,0,0,1,7.3114946694829465E-3,"N/A",1.8747422229443451E-5,"N/A"]
[null,"CN1254","chipping_norton","Urban",10,0.16266999999999998,0.81228,1.794560521,2.0513730000000001E-2,0,2,1.7380952380952382E-3,2.5062656641604011E-5,1.7380952380952382E-3,2.5062656641604011E-5,0,0,"N/A",0,"N/A"]
[null,"CN1258","chipping_norton","Urban",859,0,4.1158551595046804,2.628681549,8.0383650000000001E-2,0,1,6.8107769423558897E-3,2.1303258145363408E-5,6.8107769423558897E-3,2.1303258145363408E-5,0,0,"N/A",0,"N/A"]
[null,"CN1261","chipping_norton","Urban",228,1.16468717681304,0.42803929100744303,0,0,0.4827456,0,0,0,0,0,2,4.0794390771268951E-2,"N/A",8.373848595818075E-5,"N/A"]
[null,"CR1210","corrimal","Urban",1613,6.3829620747968701,2.0075059706224301,3.0293568620000002,1.7624207700000001,6.2867853,5,0.14932706766917295,4.2055137844611533E-3,0.14932706766917295,4.2055137844611533E-3,9,0.53126445113796861,"N/A",1.2048343352788992E-3,"N/A"]
[null,"CR1214","corrimal","Urban",1239,5.7869243757085398,0.79448703503229501,2.7479505679999998,0.12306759,1.3541723999999999,3,1.0427318295739348E-2,3.5213032581453635E-4,1.0427318295739348E-2,3.5213032581453635E-4,3,0.11443426528852282,"N/A",2.8871030233342914E-4,"N/A"]
[null,"CR1228","corrimal","Urban",1560,5.0522611672377193,1.41094941232413,3.7533541000000001,null,1.1651562,0,0,0,0,0,2,9.846146154903701E-2,"N/A",2.4371648898276486E-4,"N/A"]
[null,"CR1254","corrimal","Urban",1331,5.8853097250215693,1.5465987424170802,1.143153533,0.13090629000000001,6.0294392999999999,3,1.1091478696741854E-2,2.0551378446115288E-4,6.3546365914786962E-3,1.6791979949874687E-4,7,0.50951744135181409,"N/A",1.164839834522753E-3,"N/A"]
[null,"CR1262","corrimal","Urban",1960,8.0015826641658894,0.42986328726686601,3.0484094210000001,2.6263934099999999,2.1852225000000001,7,0.22253007518796997,4.6804511278195488E-3,0.22203759398496242,4.6791979949874687E-3,4,0.184662108960018,"N/A",4.2369174238542198E-4,"N/A"]
[null,"CR1280","corrimal","Urban",2266,8.1720266204974497,0.91331070046118501,2.9721991860000001,4.1116052100000005,7.3175004000000001,9,0.34836967418546366,6.1766917293233073E-3,0.31637719298245615,6.1002506265664157E-3,6,0.61836497481596275,"N/A",1.3573133694117058E-3,"N/A"]
[null,"CS1206","claremont_meadows","Urban",108,4.8670000000000005E-2,1.75075,1.1551566449999999,0,0.47032200000000002,0,0,0,0,0,1,3.9744535126420115E-2,"N/A",1.3248178375473371E-4,"N/A"]
[null,"CS1210","claremont_meadows","Urban",131,0,0.58617327976946398,0.50870332200000001,0,0.26178299999999999,0,0,0,0,0,1,2.2121958230743272E-2,"N/A",7.3739860769144242E-5,"N/A"]
[null,"CS1213","claremont_meadows","Urban",1552,6.4012809291105208,2.9623499999999998,3.5220560349999999,4.2367581900000006,0.2981664,5,0.35897368421052633,2.2493734335839598E-3,0.35897368421052633,2.2493734335839598E-3,1,2.5196535476372E-2,"N/A",5.2492782242441664E-5,"N/A"]
[null,"CS1239","claremont_meadows","Urban",720,10.0957990808504,4.8903500000000006,3.8775767839999999,6.8229967499999997,1.9056915000000001,9,0.57810150375939851,3.1290726817042609E-3,0.38324812030075184,2.2406015037593984E-3,6,0.16104035695091923,"N/A",3.34953943832723E-4,"N/A"]
[null,"CS1243","claremont_meadows","Urban",747,4.61731913417887,3.2533411755986701,3.0484094210000001,0.82846184999999994,0.70282080000000002,2,7.0194235588972434E-2,1.7280701754385963E-3,7.0194235588972434E-2,1.7280701754385963E-3,2,5.9391833622876852E-2,"N/A",1.2373298671432677E-4,"N/A"]
[null,"CS1247","claremont_meadows","Urban",1029,4.3360431586872297,7.8030728795457396,2.3665183390000002,0.24885654000000001,0.53998290000000004,3,2.1085213032581453E-2,7.6441102756892224E-5,6.842105263157895E-3,3.7593984962406013E-5,4,4.5631225706465363E-2,"N/A",1.4123058079514066E-4,"N/A"]
[null,"CS1250","claremont_meadows","Urban",1179,3.8628368362813497,3.8515300000000003,3.5096718720000002,0.29381814000000001,0.2555712,2,2.4894736842105265E-2,2.0050125313283209E-4,2.4894736842105265E-2,2.0050125313283209E-4,1,2.1597030408318858E-2,"N/A",4.4993813350664286E-5,"N/A"]
[null,"CS1276","claremont_meadows","Urban",1636,8.5725779880613207,7.8647865124645895,3.8105117769999999,7.7543970000000004E-2,0.79244820000000005,3,6.5701754385964917E-3,8.6466165413533845E-5,6.5701754385964917E-3,8.6466165413533845E-5,7,6.6965792203572017E-2,"N/A",1.8122508155128669E-4,"N/A"]
[null,"CS1280","claremont_meadows","Urban",948,3.3907162714514101,4.8487503530136697,1.8353329970000001,6.5016840000000006E-2,0,1,5.5087719298245611E-3,3.5087719298245611E-5,5.5087719298245611E-3,3.5087719298245611E-5,0,0,"N/A",0,"N/A"]
[null,"CS1284","claremont_meadows","Urban",1153,6.2666296173565801,2.08575,4.4262904799999996,1.3072289399999999,1.9948752000000001,7,0.11075939849624061,6.7794486215538852E-4,9.1928571428571415E-2,5.3383458646616541E-4,3,0.16857682068715552,"N/A",3.5120170976490732E-4,"N/A"]
[null,"CS1287","claremont_meadows","Urban",0,0,0,0,0,0.41885280000000003,0,0,0,0,0,1,3.5395133169189234E-2,"N/A",7.3739860769144242E-5,"N/A"]
[null,"CT1202","campbelltown","Urban",845,1.0768569867004001,5.0568497568461597,4.9917704269999996,0,1.4139240000000001E-2,0,0,0,0,0,1,1.1948357100898626E-3,"N/A",4.999312594518254E-6,"N/A"]
[null,"CT1203","campbelltown","Urban",401,0,3.76410766620939,3.1436722160000001,0,0.55906199999999995,0,0,0,0,0,1,4.7243504018197498E-2,"N/A",1.1248453337666071E-4,"N/A"]
[null,"CT1206","campbelltown","Urban",1804,0,15.491090001799201,3.696196423,2.9612242200000005,0.58657139999999997,5,0.25089974937343357,2.7556390977443606E-3,0.25089974937343357,2.7556390977443606E-3,3,4.956818437464848E-2,"N/A",1.2498281486295634E-4,"N/A"]
[null,"CT1210","campbelltown","Urban",223,0,3.0455900000000002,4.5345090140000002,0,2.6622E-2,0,0,0,0,0,1,2.249690667533214E-3,"N/A",6.2491407431478175E-6,"N/A"]
[null,"CT1225","campbelltown","Rural Short",1144,6.6178417971511303,9.7123333754436292,5.7538727830000003,17.091161309999997,1.9789019999999999,9,6.9832969742384234,2.9828558306492066E-2,1.8572084675396876,1.5071398787761588E-2,18,0.81970728240692503,"N/A",2.2299958953372247E-3,"N/A"]
[null,"CT1233","campbelltown","Urban",764,0,7.9737860427512999,2.89598895,1.1033340000000001E-2,0,2,9.3483709273182959E-4,2.5062656641604009E-6,8.6967418546365916E-4,1.2531328320802005E-6,0,0,"N/A",0,"N/A"]
[null,"CT1236","campbelltown","Urban",54,0,3.5388699999999997,0,0.31783710000000004,0.248472,1,2.6929824561403509E-2,3.8471177944862157E-4,2.6929824561403509E-2,3.8471177944862157E-4,2,2.0997112896976665E-2,"N/A",3.4995188161627778E-5,"N/A"]
[null,"CT1243","campbelltown","Urban",290,0.57911000000000001,3.7003410488655799,2.7816735970000002,0,0.54087030000000003,0,0,0,0,0,3,4.5706215395383137E-2,"N/A",9.1237454849958134E-5,"N/A"]
[null,"CT1262","campbelltown","Rural Short",507,16.068279139006599,5.82964227617137,3.257987569,2.9300025300000003,0.45346140000000001,9,1.1971730551912931,6.7924026613648859E-3,1.1971730551912931,6.7924026613648859E-3,7,0.18783426964571245,"N/A",3.5532901628999749E-4,"N/A"]
[null,"CT1265","campbelltown","Urban",709,0.90323396595384398,4.7763702716422305,3.162724775,0,7.0696200000000004E-3,0,0,0,0,0,1,5.9741785504493128E-4,"N/A",2.499656297259127E-6,"N/A"]
[null,"CT1266","campbelltown","Urban",189,2.5613565942190197,3.3460727850438201,2.172182238,0.12751938000000002,0,1,1.0804511278195488E-2,1.1278195488721805E-5,0,0,0,0,"N/A",0,"N/A"]
[null,"CT1296","campbelltown","Urban",906,7.7170056146305797,8.9361339218640197,5.6586099880000003,1.8432333299999999,7.45416E-2,5,0.15617418546365916,1.149122807017544E-3,0.15436591478696743,1.1416040100250629E-3,3,6.2991338690929991E-3,"N/A",1.1248453337666072E-5,"N/A"]
[null,"CV1210","canley_vale","Urban",1711,1.5675833867975499,1.8174641395198001,4.2929225679999998,2.4607324100281311,0,5,0.20849388600203442,4.9900688437390589E-3,0.19032681074226152,2.8174180261539461E-3,0,0,"N/A",0,"N/A"]
[null,"CV1213","canley_vale","Urban",1109,1.6468624501578399,1.7322335428042299,2.9152320349999998,1.4963483935665369,0,3,0.12678318459828891,3.1894857606142553E-3,0.12264596569837882,1.8104127939775638E-3,0,0,"N/A",0,"N/A"]
[null,"CV1221","canley_vale","Urban",1403,4.3441803392646197,2.2126432585065299,3.5504443480000001,1.331186198112055,0,5,0.112789258314147,3.724766821659549E-3,0.107561318067897,1.982120072909549E-3,0,0,"N/A",0,"N/A"]
[null,"CV1236","canley_vale","Urban",1630,5.2913725027103204,1.93206286560366,3.8707178629999999,1.4340825631821283,0.23249880000000001,7,0.12150750127364796,4.2071370160280197E-3,0.11534304511278196,2.1523182957393478E-3,2,1.9647298496456737E-2,"N/A",3.4995188161627771E-5,"N/A"]
[null,"CV1239","canley_vale","Urban",1248,6.22499023481463,0.33999864441960104,2.6968897100000002,1.2746170249664357,5.85684E-2,6,0.10799624356415342,3.2591706921143481E-3,0.10330614177489174,1.6958034290271177E-3,1,4.9493194685730716E-3,"N/A",1.3748109634925199E-5,"N/A"]
[null,"CV1247","canley_vale","Urban",1725,4.0346446136736596,2.04424278768641,3.8272780279999998,1.3523950746207991,0.33543719999999999,4,0.11458625219410926,4.4381720118436586E-3,0.10810210184552292,2.2767885623148749E-3,2,2.8346102410918499E-2,"N/A",5.2492782242441664E-5,"N/A"]
[null,"CV1251","canley_vale","Urban",625,2.8072251271711797,1.64648559357416,1.2917634920000001,0.59400509133611867,0.82971899999999998,4,5.032909279081059E-2,1.5367548233361943E-3,3.4485980576441103E-2,7.6198308270676693E-4,3,7.0115359138118505E-2,"N/A",1.4622989338965891E-4,"N/A"]
[null,"CV1269","canley_vale","Urban",789,3.4014529733718102,0.16347968594862999,2.1495096930000002,0.68870035726823164,0,5,5.8352469855184927E-2,2.0476847569231064E-3,4.7224552859421301E-2,1.0284375712007294E-3,0,0,"N/A",0,"N/A"]
[null,"CV1276","canley_vale","Urban",460,2.7103926532523901,0.25983999999999996,2.6841244949999998,1.0815318366186599,0.50581799999999999,4,9.1636447153944686E-2,2.3104877009693194E-3,8.9917620756436598E-2,1.7375455684666215E-3,1,4.2744122683131068E-2,"N/A",7.4989688917773804E-5,"N/A"]
[null,"CV1280","canley_vale","Urban",1254,0.817260162741695,2.7999465000063499,3.00744642,3.7779671386652689,0.283968,13,0.32010105882228124,4.1345068778226995E-3,0.2866766382893664,2.4959573434592793E-3,1,2.3996700453687618E-2,"N/A",4.999312594518254E-5,"N/A"]
[null,"CV1284","canley_vale","Urban",1343,4.7714233645277,0.87959706071490995,3.8105117769999999,1.0860568416356355,3.3175449000000001,5,9.2019843526635683E-2,3.3785566748996618E-3,8.7070225279106891E-2,1.7286839257233959E-3,6,0.28034895201909737,"N/A",5.1117971278949144E-4,"N/A"]
[null,"CX1206","CATTAI","Rural Short",671,35.6962586274053,0.55797647968215491,0,3.3884481599999998,0.2427039,12,1.3844898748481682,1.0363852815160838E-2,0.25957372234543352,3.4687180850742393E-3,2,0.10053360616066997,"N/A",2.4505449399310172E-4,"N/A"]
[null,"CX1210","CATTAI","Rural Short",737,56.219562782335998,0.18425,0,5.7440958300000009,2.9608100999999998,17,2.3469866267018773,7.8741109143758443E-3,0.8249687271496684,4.9190531729101572E-3,33,1.2264364788119759,"N/A",2.615956723376361E-3,"N/A"]
[null,"CX1232","CATTAI","Rural Short",660,98.303911328471401,1.9950300000000001,0,7.719403859999999,4.0296833999999997,31,3.154079973893968,1.2901939218873693E-2,2.8557037448860578,1.2122384109161886E-2,16,1.6691886858340124,"N/A",4.3068327319287633E-3,"N/A"]
[null,"CX1273","CATTAI","Rural Short",543,52.262847605622298,3.3896819509568399,0,1.6170646500000003,0.74896560000000001,15,0.66071827845225084,9.674943648438775E-3,0.15609231382834074,6.5869385239214649E-3,10,0.31023898939526673,"N/A",7.964271054775805E-4,"N/A"]
[null,"CX1284","CATTAI","Rural Short",185,20.312007602624099,0.178696949251753,0,0.98742477000000006,0.31946400000000003,2,0.40345300612162271,1.2630001389904459E-3,5.3094350340526592E-2,1.3899044591760888E-4,4,0.13232942675627493,"N/A",2.8181266809206696E-4,"N/A"]
[null,"D810","wisemans","Rural Short",211,28.741270158536,0.69207995445987502,1.0477002129999999,3.9835801718918953,0.173043,7,1.6276555382302951,4.4437002057002156E-3,0.7091352981345066,3.1907371932390211E-3,3,7.1678439492982249E-2,"N/A",2.2667540694361907E-4,"N/A"]
[null,"D813","wisemans","Rural Short",306,36.0792156946492,0.89356630033279205,4.142788404,6.2625808654054005,0.92910780000000004,16,2.5588350150741723,1.074155166819493E-2,0.67701641900180687,6.1095365575088078E-3,5,0.38485808281616618,"N/A",7.9030074312775298E-4,"N/A"]
[null,"D814","wisemans","Rural Short",349,68.746340070326696,0.82953125710514697,1.154013492,23.380654978783781,1.3066964999999999,21,9.5531283221533911,2.1645612813563773E-2,6.5799698652598408,1.6946421214523853E-2,24,0.54126411360726345,"N/A",1.1885142958665434E-3,"N/A"]
[null,"D818","liverpool_11kv","Urban",42,1.93421293579556,0.95124449819884205,3.3547745679999998,0.14514906,5.3244E-3,3,1.2298245614035088E-2,1.6416040100250627E-4,1.2298245614035088E-2,1.6416040100250627E-4,1,4.4993813350664285E-4,"N/A",1.2498281486295635E-6,"N/A"]
[null,"D819","liverpool_11kv","Urban",640,0,1.6352306692465499,1.350635899,1.1439325500000002,0.3602844,3,9.6923558897243106E-2,3.7844611528822059E-4,3.41390977443609E-2,2.6065162907268173E-4,1,3.0445813700616164E-2,"N/A",7.249003262051468E-5,"N/A"]
[null,"D820","liverpool_11kv","Urban",1418,2.7103050272198104,2.91548325091237,4.1915629540000001,5.8739566699999983,1.8014220000000001,4,0.49769086933018797,1.9194305274597616E-3,9.926190476190476E-2,2.9072681704260653E-4,3,0.15222906850308082,"N/A",2.6371373936083791E-4,"N/A"]
[null,"D823","liverpool_11kv","Urban",563,1.76981812984974,2.1689865197964302,3.0617462130000002,3.647214E-2,0.58923360000000002,2,3.0902255639097746E-3,2.2556390977443609E-5,3.0902255639097746E-3,2.2556390977443609E-5,2,4.9793153441401804E-2,"N/A",8.8737798552698997E-5,"N/A"]
[null,"D824","liverpool_11kv","Urban",408,0,1.3737012547352498,0.88803977000000001,0.46308969,0,1,3.923684210526316E-2,8.6466165413533831E-5,3.923684210526316E-2,8.6466165413533831E-5,0,0,"N/A",0,"N/A"]
[null,"D826","liverpool_11kv","Urban",191,0,2.4839576914259003,2.0005186830000001,7.7203800000000006E-3,0,1,6.541353383458647E-4,1.2531328320802005E-6,6.541353383458647E-4,1.2531328320802005E-6,0,0,"N/A",0,"N/A"]
[null,"D828","liverpool_11kv","Urban",983,4.6745561080356204,0.36804000000000003,4.0010373650000002,0.13990979566029543,2.8725138000000001,4,1.1854331201592168E-2,9.2507006003279309E-5,1.1854331201592168E-2,9.2507006003279309E-5,7,0.24274162302683383,"N/A",4.4493882091212455E-4,"N/A"]
[null,"D830","liverpool_11kv","Urban",990,4.5594089058545597,1.5136435454969501,3.4071691049999999,0.1177284,1.0000998000000001,5,9.9749373433583952E-3,1.0902255639097744E-4,8.6741854636591485E-3,1.0776942355889724E-4,4,8.4513379410331088E-2,"N/A",1.6122783117321368E-4,"N/A"]
[null,"D832","liverpool_11kv","Urban",28,0.14924595771127203,1.1256806326179301,2.114071934,0,6.2118E-3,0,0,0,0,0,1,5.2492782242441667E-4,"N/A",1.2498281486295635E-6,"N/A"]
[null,"D841","carramar","Urban",461,0.79787075889276105,1.3924645481689699,1.569549801,6.0875640000000002E-2,0,1,5.1578947368421052E-3,2.1303258145363408E-5,5.1578947368421052E-3,2.1303258145363408E-5,0,0,"N/A",0,"N/A"]
[null,"D842","carramar","Urban",251,0.92980685149404996,1.88235,0.94272061399999996,2.6710740000000004E-2,1.3311E-2,2,2.2631578947368424E-3,2.882205513784461E-5,2.2631578947368424E-3,2.882205513784461E-5,1,1.124845333766607E-3,"N/A",2.499656297259127E-6,"N/A"]
[null,"D845","carramar","Urban",1455,4.8641446065490204,0.53501230538143607,4.7286545889999996,4.9209242826807396,0,6,0.41694197314455322,5.4631606688807814E-3,0.2315347049741272,4.3829601676276479E-3,0,0,"N/A",0,"N/A"]
[null,"D847","carramar","Urban",999,0,3.76240096565021,2.6429709680000002,2.3256091799999998,0,3,0.19704511278195488,1.2756892230576442E-3,0.19650000000000001,1.2744360902255639E-3,0,0,"N/A",0,"N/A"]
[null,"D848","carramar","Urban",576,0,2.3033331698809603,3.2926632260000002,4.1146963200000011,0,4,0.3486315789473684,9.160401002506265E-4,0.3486315789473684,9.160401002506265E-4,0,0,"N/A",0,"N/A"]
[null,"D851","carramar","Urban",3,0,0.95807000000000009,1.091711624,0,3.5496E-3,0,0,0,0,0,1,2.9995875567109521E-4,"N/A",2.499656297259127E-6,"N/A"]
[null,"D852","carramar","Urban",1382,5.6714774945181494,1.2586509224481299,3.4029775419999999,2.7947479800000004,3.3774443999999999,5,0.23679448621553886,1.8684210526315791E-3,0.23679448621553886,1.8684210526315791E-3,7,0.2854107560210471,"N/A",5.1992850982989836E-4,"N/A"]
[null,"DFA2","darkes_forest","Rural Short",64,18.704705957722101,0.16008864300755399,0.24654011200000001,0.60732632076923077,0.85456620000000005,8,0.24814814986981851,8.437045462891641E-4,3.8568686614662222E-2,2.2126907109291569E-4,7,0.35398121657303533,"N/A",7.8417438077792547E-4,"N/A"]
[null,"DFC2","darkes_forest","Rural Short",3,6.3371540002675903,4.7789999999999999E-2,0.788013835,2.8263690000000001E-2,0,2,1.1548293136893503E-2,2.0667275001661841E-3,5.4024982021887973E-3,1.8129188597948984E-5,0,0,"N/A",0,"N/A"]
[null,"DP1206","dapto","Urban",1511,7.7921051808416593,3.2852899999999998,2.6214415770000001,5.0349845958324035,2.3977548,5,0.42660611940876569,5.6101075933421302E-3,0.30487679610049501,3.7241426810614288E-3,8,0.2026221394558248,"N/A",8.1863743735236417E-4,"N/A"]
[null,"DP1210","dapto","Rural Short",1893,31.793594464313902,3.40234480493285,3.7329678620000002,2.0553429946168573,1.1687057999999999,8,0.83979492411273926,1.2735211528375562E-2,0.83888846468284184,1.272916846550958E-2,8,0.48410515288337247,"N/A",1.5377169498067133E-3,"N/A"]
[null,"DP1221","dapto","Urban",889,9.6324798237349007,4.1713900000000006,2.0138554740000001,0.83109696288195023,0.35895329999999998,3,7.0417504450947369E-2,1.1568067053087559E-3,7.0417504450947369E-2,1.1568067053087559E-3,7,3.033332916723951E-2,"N/A",1.0248590818762419E-4,"N/A"]
[null,"DP1236","dapto","Urban",2052,14.586526456637602,10.46391,3.160628993,5.15136029164091,1.983339,7,0.43646644430895615,5.2162507591265918E-3,0.18543636912098624,2.6911881024849873E-3,11,0.16760195473122447,"N/A",4.6743572758745669E-4,"N/A"]
[null,"DP1243","dapto","Urban",1306,2.9076371731506603,6.3331084925597896,3.4487036830000002,1.4057865900669113,0.96016679999999999,3,0.11911002913528847,1.8078422517980453E-3,0.11911002913528847,1.8078422517980453E-3,5,8.1138843409031269E-2,"N/A",2.8996013048205872E-4,"N/A"]
[null,"DP1258","dapto","Urban",1348,8.3145935028392195,0.991553611655561,2.820350291,1.5539664714369918,2.2704129000000002,5,0.13166507135290828,1.9256958311023686E-3,0.12597083576393586,1.8555203925058775E-3,6,0.1918611190961243,"N/A",6.161652772743748E-4,"N/A"]
[null,"DP1269","dapto","Urban",1638,8.4513347487730801,5.3396594182347501,3.6148419970000001,3.430682627258244,2.6604252000000002,6,0.29067620261423033,6.9398013114672936E-3,0.29067620261423033,6.9398013114672936E-3,6,0.22481908737548587,"N/A",5.8616940170726521E-4,"N/A"]
[null,"DP1273","dapto","Urban",227,0.86336000000000002,1.03904,2.3935729729999999,0.2065834542775207,0,1,1.750348269910075E-2,2.8231423708227068E-4,1.750348269910075E-2,2.8231423708227068E-4,0,0,"N/A",0,"N/A"]
[null,"DP1284","dapto","Rural Short",1124,16.750003243126898,5.7350181351942702,3.7152489819999999,1.3535882079592156,1.0564496999999999,5,0.5530641403212172,7.0910957492330154E-3,0.5530641403212172,7.0910957492330154E-3,7,0.43760606264818142,"N/A",1.5132115004074032E-3,"N/A"]
[null,"DP1295","dapto","Urban",770,6.0257344627810001,1.2305612268806698,5.2324042459999998,1.4954772640289953,0.4647018,3,0.12670937519839109,1.941084190482579E-3,0.12670937519839109,1.941084190482579E-3,4,3.9269600429940883E-2,"N/A",1.1248453337666071E-4,"N/A"]
[null,"DS1204","doonside","Urban",587,3.3833252966522602,2.5330060124590101,2.6673582439999999,0.32089511660606068,2.04102E-2,3,2.7188925373445503E-2,8.1752033083302381E-4,2.7188925373445503E-2,8.1752033083302381E-4,2,1.7247628451087975E-3,"N/A",4.999312594518254E-6,"N/A"]
[null,"DS1205","doonside","Urban",1622,7.0565135538275596,2.6737045573804799,0.73085615900000001,6.6640122030303033,0.29417310000000002,8,0.5646309996619594,6.6231439412554015E-3,0.29953325530105712,4.4953243923832199E-3,1,2.4859081876242018E-2,"N/A",4.8743297796552972E-5,"N/A"]
[null,"DS1209","doonside","Urban",682,0.64258000000000004,8.4639299999999995,0.422776282,1.981988654545452E-2,0,1,1.6793070019076189E-3,8.3965350095381076E-4,1.6793070019076189E-3,8.3965350095381076E-4,0,0,"N/A",0,"N/A"]
[null,"DS1223","doonside","Urban",1692,3.7784708684308197,9.6739514042508805,2.382141437,0.44244503290909093,1.2232809,9,3.748765362604372E-2,2.2895661613927818E-3,3.0540285204991087E-2,2.2657566375832582E-3,5,0.1033732861731512,"N/A",2.737123645498744E-4,"N/A"]
[null,"DS1226","doonside","Urban",1065,3.5132391346690302,3.1754479152289599,1.9052558879999999,1.3922639826060608,0.46765980000000001,6,0.11796428042774793,2.9194835722699502E-3,8.9678566142033622E-2,2.8743707903150627E-3,1,3.9519566059666798E-2,"N/A",7.7489345215032927E-5,"N/A"]
[null,"DS1235","doonside","Urban",1087,1.2748218837278,7.8265445338059703,4.1953734660000004,0.47342302624242427,0.23782320000000001,3,4.0112369009273036E-2,1.4296180885964161E-3,4.0112369009273036E-2,1.4296180885964161E-3,5,2.0097236629963378E-2,"N/A",7.3739860769144242E-5,"N/A"]
[null,"DS1241","doonside","Urban",719,2.8204981423010098,2.2210300000000003,0.66683956099999997,2.0504236788484849,0.46677239999999998,7,0.17372908936035869,2.3971261338134398E-3,0.17372908936035869,2.3971261338134398E-3,2,3.9444576370749024E-2,"N/A",9.3737111147217258E-5,"N/A"]
[null,"DS1242","doonside","Urban",0,0,1.1337300000000001,0,0,0,1,0,0,0,0,0,0,"N/A",0,"N/A"]
[null,"DS1245","doonside","Urban",685,1.9708750655515701,4.4634055040190699,0.66683956099999997,1.9436466121212082E-2,1.86354E-2,1,1.6468204081207143E-3,8.2341020406035846E-4,1.6468204081207143E-3,8.2341020406035846E-4,1,1.57478346727325E-3,"N/A",3.7494844458886905E-6,"N/A"]
[null,"DS1256","doonside","Urban",1941,6.98963844526308,3.0797632315065897,3.8105117769999999,0.10794756648484852,1.9753524,2,9.1462231038082452E-3,2.4377732060394609E-3,9.1462231038082452E-3,2.4377732060394609E-3,7,0.16692704753096449,"N/A",3.5995050680531424E-4,"N/A"]
[null,"DS1257","doonside","Urban",1851,3.92847301215859,6.8494893443864502,1.895729609,5.4325037341212132,5.2356600000000003E-2,10,0.46028727448448814,7.0809806006400366E-3,0.46028727448448814,7.0809806006400366E-3,2,4.4243916461486543E-3,"N/A",2.249690667533214E-5,"N/A"]
[null,"DS1271","doonside","Urban",1370,0.72385685099291397,6.8049089544081696,1.8576244909999999,0.46405128781818189,9.5839199999999999E-2,4,3.9318316736582995E-2,1.9461257868378572E-3,2.5561424506006552E-2,1.8734440825772056E-3,3,8.098886403119572E-3,"N/A",3.1245703715739086E-5,"N/A"]
[null,"DS1275","doonside","Urban",704,0,4.6698399999999998,8.2116528999999994E-2,2.0763690666666647E-2,0,1,1.7592740019984586E-3,8.7963700099923049E-4,1.7592740019984586E-3,8.7963700099923049E-4,0,0,"N/A",0,"N/A"]
[null,"DS1286","doonside","Urban",259,0.75853834446603297,2.0899051905107298,0,0.12473134460606063,0,6,1.0568285538564176E-2,3.837668294324637E-4,1.7600148618724474E-3,3.3740091464549624E-4,0,0,"N/A",0,"N/A"]
[null,"DS1290","doonside","Urban",1606,0,8.0686169391397993,1.5242047110000001,4.7278687696969753E-2,1.59732E-2,1,4.0058469108004762E-3,2.0029234554002381E-3,4.0058469108004762E-3,2.0029234554002381E-3,1,1.3498144005199286E-3,"N/A",2.499656297259127E-6,"N/A"]
[null,"ER1122","","Rural Short",1026,17.654698402733697,1.5323,0,7.4837400000000009E-3,0.12601080000000001,2,3.0577898101873955E-3,2.4172251463931978E-5,3.0577898101873955E-3,2.4172251463931978E-5,2,1.064853582632388E-2,"N/A",2.499656297259127E-5,"N/A"]
[null,"ER1132","","Urban",13,3.63774,1.8443399999999999,0,0,1.7748E-3,0,0,0,0,0,1,1.4997937783554761E-4,"N/A",1.2498281486295635E-6,"N/A"]
[null,"ER1142","","Urban",930,4.6197919880971607,2.4931300000000003,0,6.6525420000000002E-2,0.86610240000000005,2,5.6365914786967418E-3,2.882205513784461E-5,5.6365914786967418E-3,2.882205513784461E-5,2,7.3189936383747239E-2,"N/A",1.5247903413280673E-4,"N/A"]
[null,"ER1232","","Urban",1405,30.132055050134802,1.8607100000000001,0,0,0.38690639999999998,0,0,0,0,0,2,3.2695504368149379E-2,"N/A",6.9990376323255556E-5,"N/A"]
[null,"ER1252","","Urban",643,13.535718880976999,2.4001242599057302,0,8.6373600000000002E-3,1.4979312,2,7.3182957393483708E-4,6.2656641604010028E-6,7.3182957393483708E-4,6.2656641604010028E-6,3,0.12658259489320217,"N/A",2.6371373936083791E-4,"N/A"]
[null,"ER1262","","Rural Short",596,19.8953062167637,1.2733769746382,0,0.51482510999999997,9.3176999999999996E-2,4,0.21035297530200206,3.2209525075689366E-3,0.21035297530200206,3.2209525075689366E-3,2,7.8739173363662485E-3,"N/A",3.4995188161627778E-5,"N/A"]
[null,"F601","dundas","Urban",1406,4.1836894882960394,1.49641495029218,3.048599947,3.52002E-3,0.56261159999999999,1,2.9824561403508774E-4,1.2531328320802005E-6,2.9824561403508774E-4,1.2531328320802005E-6,4,4.7543462773868589E-2,"N/A",1.5497869043006588E-4,"N/A"]
[null,"F602","dundas","Urban",885,2.46380729358054,2.3043645838809597,2.020333344,8.8207560000000004E-2,0,1,7.4736842105263155E-3,5.2631578947368424E-5,0,0,0,0,"N/A",0,"N/A"]
[null,"F603","dundas","Urban",1466,0.75077249865020701,5.2283483017157693,2.4488253929999999,0.1211301,0.21963150000000001,1,1.0263157894736842E-2,1.0401002506265664E-4,1.0263157894736842E-2,1.0401002506265664E-4,1,1.8559948007149017E-2,"N/A",4.1244328904775594E-5,"N/A"]
[null,"FF1202","fairfield","Urban",615,0.18024513513907101,2.2084348590739,1.442469233,7.4689500000000002E-3,0.59988240000000004,1,6.3283208020050124E-4,1.2531328320802005E-6,0,0,1,5.0693029708415091E-2,"N/A",1.2998212745747459E-4,"N/A"]
[null,"FF1206","fairfield","Urban",1472,4.1076697762599599,2.0425245826645502,4.1789882650000001,9.953630147319263,0,3,0.84335501933664969,4.277440834878618E-3,0.21594900429905578,2.4942328148284923E-3,0,0,"N/A",0,"N/A"]
[null,"FF1217","fairfield","Urban",433,2.6962088269607203,1.79926415176045,2.2642060979999998,1.7519502213168188,2.1310910999999999,4,0.14843991497648945,6.5609591122526005E-4,4.7419199890207896E-3,5.3339018994683578E-5,5,0.18008773793603378,"N/A",3.6619964754846211E-4,"N/A"]
[null,"FF1239","fairfield","Urban",1638,5.0593147355353008,1.48023539719054,3.83413695,4.3051767300000003,0.82350719999999999,7,0.36477067669172936,4.0050125313283204E-3,0.34010150375939852,3.9185463659147865E-3,2,6.959043131569409E-2,"N/A",1.4498006524102936E-4,"N/A"]
[null,"FF1243","fairfield","Urban",95,1.63954829485665,1.13473538768493,1.016072965,0,6.6555E-3,0,0,0,0,0,1,5.6242266688330349E-4,"N/A",1.2498281486295635E-6,"N/A"]
[null,"FF1247","fairfield","Urban",214,0,1.54017,3.3073336969999998,1.5603450000000001E-2,0.80420625000000001,1,1.3220551378446115E-3,2.6441102756892228E-4,1.3220551378446115E-3,2.6441102756892228E-4,1,6.795940558173251E-2,"N/A",1.8122508155128669E-4,"N/A"]
[null,"FF1265","fairfield","Urban",389,3.3119881936951203,1.1334369892317,2.9337130170000001,0,5.3244E-3,0,0,0,0,0,2,4.4993813350664279E-4,"N/A",3.7494844458886905E-6,"N/A"]
[null,"FF1269","fairfield","Urban",482,1.4081700000000001,1.5904100000000001,1.611084379,1.6760175900000001,0.36738359999999998,4,0.14200626566416041,6.5664160401002496E-4,0.14200626566416041,6.5664160401002496E-4,1,3.1045731211958357E-2,"N/A",8.6238142255439873E-5,"N/A"]
[null,"FF1276","fairfield","Urban",472,4.8510534292075196,1.5307551801814501,2.9666739440000001,1.3891359600000002,0.60121349999999996,2,0.11769924812030075,3.8596491228070175E-4,0.11769924812030075,3.8596491228070175E-4,3,5.0805514241791756E-2,"N/A",9.998625189036508E-5,"N/A"]
[null,"FF1280","fairfield","Urban",214,4.0924760156606395,2.4982292190212902,5.0045356419999996,3.4063588500000006,0,4,0.28861528822055138,5.6390977443609015E-4,0.22717669172932334,4.4736842105263153E-4,0,0,"N/A",0,"N/A"]
[null,"FF1284","fairfield","Urban",894,3.6567886790379198,1.0079400000000001,2.1321718650000001,0.80723820000000002,0.95040539999999996,1,6.8395989974937343E-2,1.087719298245614E-3,6.8395989974937343E-2,1.087719298245614E-3,1,8.0313956830935743E-2,"N/A",1.4872954968691806E-4,"N/A"]
[null,"FT1202","figtree","Urban",1587,5.4106041782917398,5.4058228736693801,3.1657731839999999,0.11957715000000001,2.9111156999999999,4,1.013157894736842E-2,1.7042606516290727E-4,1.013157894736842E-2,1.7042606516290727E-4,4,0.24600367449475696,"N/A",6.0491682393670873E-4,"N/A"]
[null,"FT1203","figtree","Urban",331,3.4675263240879,0.96335999999999999,1.7880826510000001,0,5.7681E-3,0,0,0,0,0,1,4.8743297796552973E-4,"N/A",1.2498281486295635E-6,"N/A"]
[null,"FT1204","figtree","Urban",783,3.8448623449705401,3.6870799999999999,1.9624135650000001,0,1.0502378999999999,0,0,0,0,0,3,8.875029683418531E-2,"N/A",2.0247216007798926E-4,"N/A"]
[null,"FT1205","figtree","Urban",1146,5.4818125361792802,2.75359,2.10302145,2.05801371,1.8568845,6,0.17437218045112785,3.2305764411027569E-3,0.15568796992481204,1.6102756892230577E-3,1,0.15691592406044169,"N/A",3.4870205346764822E-4,"N/A"]
[null,"FT1206","figtree","Urban",440,12.115012796693799,0.90090999999999999,0.98311203800000002,2.2279951799999997,1.1695932,12,0.18877443609022559,2.0313283208020054E-3,0.18877443609022559,2.0313283208020054E-3,9,9.8836409993625862E-2,"N/A",2.6246391121220833E-4,"N/A"]
[null,"FT1207","figtree","Urban",921,0,5.4015354997328702,2.4387275370000001,5.0138100000000005E-3,1.8786258,2,4.24812030075188E-4,2.5062656641604009E-6,4.24812030075188E-4,2.5062656641604009E-6,3,0.15875317143892714,"N/A",3.4620239717038907E-4,"N/A"]
[null,"FT1208","figtree","Urban",1535,8.5371047178594992,1.8497373872953899,3.366396629,4.1708095800000002,2.9816639999999999,5,0.35338596491228064,3.7844611528822054E-3,0.27670551378446112,1.9887218045112781E-3,5,0.25196535476371995,"N/A",6.4741098099011386E-4,"N/A"]
[null,"FT1209","figtree","Urban",678,3.7488510960675296,1.34731355421489,3.8295643359999998,2.614872E-2,0.20055239999999999,1,2.2155388471177943E-3,4.2606516290726817E-5,2.2155388471177943E-3,4.2606516290726817E-5,3,1.6947669695416882E-2,"N/A",5.874192298558948E-5,"N/A"]
[null,"FT1210","figtree","Urban",1391,8.2344628453167399,2.06160910863187,2.89598895,0.19225521000000001,3.9014541,3,1.6289473684210527E-2,3.7969924812030072E-4,1.6289473684210527E-2,3.7969924812030072E-4,7,0.32969216732699258,"N/A",9.0612540775643347E-4,"N/A"]
[null,"GG1232","gerringong","Rural Short",950,21.911752137648801,2.14472,2.0557711040000002,2.0246647507644484,0.47298420000000002,7,0.82726006568014543,6.0075019416403292E-3,0.35350709153427318,2.9611008043316678E-4,5,0.19592106794748482,"N/A",5.4524624913465138E-4,"N/A"]
[null,"GG1258","gerringong","Urban",941,3.68932853575898,1.9645460463220901,2.0525321679999999,1.5634218040337307,1.4114097000000001,3,0.1324662064249307,1.3460138916061117E-3,3.1229323308270676E-2,1.2656641604010026E-4,8,0.11927110022371923,"N/A",4.0119483571008984E-4,"N/A"]
[null,"GG1269","gerringong","Rural Short",922,8.8857613053515312,2.0696099999999999,1.9784177140000001,6.8443457741490228,0.30038490000000001,6,2.7965389986279643,2.0160337423116643E-2,0.93235395427818635,4.8707086699822941E-3,2,0.1244264193249974,"N/A",3.185708421910322E-4,"N/A"]
[null,"GG1295","gerringong","Rural Short",251,43.647259844964296,0.29672999999999999,0.61997026600000005,2.2069820133529978,6.6220006500000004,14,0.90175328267653065,5.9526025652691331E-3,0.4346714688872908,2.8341964841460247E-3,22,2.7429868467000356,"N/A",5.4524624913465146E-3,"N/A"]
[null,"GL1207","","Rural Short",308,17.1672626505291,0.51034000000000002,0,7.2027300000000001E-3,0.2271744,2,2.9429716157337183E-3,1.2086125731965989E-5,2.9429716157337183E-3,1.2086125731965989E-5,2,9.4100925693351059E-2,"N/A",2.1442268224396399E-4,"N/A"]
[null,"GL1233","","Rural Short",531,26.202351686165102,1.00322,0,6.1322889600000003,0.37980720000000001,9,2.5055988977453332,8.4723741381081581E-3,0.47089358770599288,3.3599429534865452E-3,6,0.15732498514357129,"N/A",2.9406539279172209E-4,"N/A"]
[null,"GL1255","","Rural Short",479,17.742465833568897,0.13063,0,8.4873746099999998,0.27686880000000003,9,3.4678660132101355,1.4430834123967392E-2,0.87817789568464877,5.1486895618175123E-3,2,0.1146855031887716,"N/A",2.3892813164327418E-4,"N/A"]
[null,"GV1204","granville","Urban",203,0.65376999999999996,0.55052000000000001,3.054315715,0,5.3328303000000004,0,0,0,0,0,4,0.4506505355513617,"N/A",8.8362850108110133E-4,"N/A"]
[null,"GV1208","granville","Urban",1645,0.63317999999999997,4.8404132831239304,2.4417759459999999,6.8714339999999999E-2,1.6141806000000001,2,5.8220551378446121E-3,5.137844611528822E-5,5.8220551378446121E-3,5.137844611528822E-5,4,0.13640624414143057,"N/A",2.5496494232043093E-4,"N/A"]
[null,"GV1223","granville","Urban",1255,4.1976298819647297,1.9556099999999998,1.9582220020000001,0,2.3791194,0,0,0,0,0,6,0.20104735598855156,"N/A",3.7244878829160988E-4,"N/A"]
[null,"GV1234","granville","Urban",548,0.97909917969834204,4.1718862066067404,3.8259443489999998,1.38178533,0.54841320000000005,2,0.11707644110275689,1.3070175438596493E-3,0.11707644110275689,1.3070175438596493E-3,3,4.634362775118421E-2,"N/A",9.2487282998587682E-5,"N/A"]
[null,"GV1241","granville","Urban",822,0.78207535456489696,1.1176687651824799,0.70018153900000002,0,10.635489,0,0,0,0,0,5,0.89875142167951905,"N/A",1.7622576895676848E-3,"N/A"]
[null,"GV1245","granville","Urban",672,1.2105148330064301,3.7542201420966497,1.1759239340000001,0.21404088000000002,2.4620913,1,1.8135338345864661E-2,3.3834586466165414E-5,1.8135338345864661E-2,3.3834586466165414E-5,6,0.20805889190236343,"N/A",3.3745360012998215E-4,"N/A"]
[null,"GV1249","granville","Urban",605,1.53272553647211,1.66164,1.200501735,0.26355780000000001,0.35141040000000001,1,2.2330827067669173E-2,7.5438596491228071E-4,2.2330827067669173E-2,7.5438596491228071E-4,1,2.9695916811438426E-2,"N/A",8.2488657809551188E-5,"N/A"]
[null,"GV1256","granville","Urban",691,1.63461254048615,1.2767500000000001,1.4083651530000001,0,11.4106329,0,0,0,0,0,10,0.96425491494919446,"N/A",1.8822411918361227E-3,"N/A"]
[null,"GV1260","granville","Urban",0,0,1.2843499999999999,1.390265222,0,1.1660436000000001,0,0,0,0,0,1,9.8536451237954778E-2,"N/A",2.737123645498744E-4,"N/A"]
[null,"GV1267","granville","Urban",117,0,2.3045800000000001,3.9374018190000002,0,0.60254459999999999,0,0,0,0,0,2,5.0917998775168415E-2,"N/A",2.4246666083413532E-4,"N/A"]
[null,"GV1271","granville","Urban",1334,4.8481389980287402,0.88023000000000007,0,0.72670665000000012,0,3,6.1572681704260654E-2,1.3421052631578949E-3,6.1572681704260654E-2,1.3421052631578949E-3,0,0,"N/A",0,"N/A"]
[null,"GV1278","granville","Urban",216,0.51296015704853404,1.51468,1.3942662589999999,7.6834050000000001E-2,0.92733299999999996,1,6.5100250626566412E-3,5.5137844611528819E-5,6.5100250626566412E-3,5.5137844611528819E-5,1,7.8364224919073633E-2,"N/A",1.3748109634925199E-4,"N/A"]
[null,"GV1282","granville","Urban",2416,2.4298233219079997,6.8660715665259202,3.7470667560000002,0.223329,0.84480480000000002,1,1.8922305764411028E-2,1.8922305764411027E-4,1.8922305764411028E-2,1.8922305764411027E-4,7,7.1390183849720665E-2,"N/A",1.6497731561910238E-4,"N/A"]
[null,"GV1286","granville","Urban",107,0,2.5678700000000001,2.8247323799999999,2.6859814392059533E-2,7.5429E-3,1,2.2757887274016289E-3,1.1977835407377004E-5,2.2757887274016289E-3,1.1977835407377004E-5,1,6.3741235580107736E-4,"N/A",1.2498281486295635E-6,"N/A"]
[null,"GV1293","granville","Urban",573,1.5173598280466398,2.67584,0.79353907700000004,0.37860921000000003,0,2,3.2078947368421054E-2,9.0225563909774437E-4,3.2078947368421054E-2,9.0225563909774437E-4,0,0,"N/A",0,"N/A"]
[null,"H745","oakdale","Rural Short",564,45.234500217577299,0.68565999999999994,2.2655397769999999,2.6641079100000002,0.67398029999999998,14,1.088530870986651,8.2064793720049069E-3,1.088530870986651,8.2064793720049069E-3,10,0.27917833228164124,"N/A",5.9425714793327191E-4,"N/A"]
[null,"HBA2","helensburgh","Rural Short",808,19.385008268416001,0.36002000000000001,2.4838821019999999,5.8467532200000001,2.2300361999999998,21,2.3889315260546655,2.408764858380822E-2,1.8168468506577873,1.9126293970836181E-2,5,0.92373291510699684,"N/A",2.315764968234811E-3,"N/A"]
[null,"HBB2","helensburgh","Urban",1391,11.566831545428201,1.00478,3.5359644029999999,6.4009493100000014,2.2060764000000002,15,0.54234210526315796,4.3132832080200493E-3,0.14028195488721804,1.7894736842105265E-3,7,0.18642436664958567,"N/A",5.5867318243741488E-4,"N/A"]
[null,"HBC2","helensburgh","Urban",840,11.691501266559801,1.5551400000000002,2.6599277460000001,2.5786512899999998,2.3374115999999998,9,0.21848496240601503,2.4436090225563906E-3,8.9800751879699256E-2,1.3709273182957395E-3,7,0.19752284060941619,"N/A",4.8118383722238196E-4,"N/A"]
[null,"HKB2","huskisson","Urban",1052,10.395421425647902,3.619E-2,3.9515007120000001,2.7169446020525534,1.9247706,4,0.23020233156018455,3.8279828226987847E-3,0.23020233156018455,3.8279828226987847E-3,5,0.16265263526265139,"N/A",4.1369311719638549E-4,"N/A"]
[null,"HKC2","huskisson","Rural Short",803,13.135152088421801,0.73900999999999994,2.0163323069999999,2.7473176965542891,8.4214260000000003,10,1.1225296520017012,1.8836481618783926E-2,1.1225296520017012,1.8836481618783926E-2,6,3.4883507219918033,"N/A",8.6197918262073524E-3,"N/A"]
[null,"HKD2","huskisson","Rural Short",997,9.9531414846454211,2.0086167715034402,1.8964917109999999,1.9176051053098664,0.88030079999999999,2,0.78351644378076157,1.242005813546317E-2,0.78351644378076157,1.242005813546317E-2,3,0.36464108706173537,"N/A",1.2742833687641288E-3,"N/A"]
[null,"HKF2","huskisson","Urban",2322,14.9192937179913,0.50141205038601799,3.603791513,2.5538674882845811,4.0980131999999996,12,0.21638507088246148,4.1079489750653255E-3,0.21638507088246148,4.1079489750653255E-3,6,0.34630238342227943,"N/A",9.6236767444476392E-4,"N/A"]
[null,"HKG2","huskisson","Urban",2564,14.8299425711657,0.98316999999999999,3.887293589,8.6239994018046602,0.2582334,6,0.73069755201091469,1.0029227133276917E-2,0.36541183772520047,6.8249664816478449E-3,5,2.1821999475072178E-2,"N/A",7.4989688917773817E-5,"N/A"]
[null,"HKH2","huskisson","Rural Short",221,0,3.3715700000000002,0.35971231199999998,7.1335169062964878E-3,0,1,2.9146917593172545E-3,1.4573458796586273E-3,2.9146917593172545E-3,1.4573458796586273E-3,0,0,"N/A",0,"N/A"]
[null,"HR1206","holroyd","Urban",1430,6.4029893027608997,0.267966324627682,3.6034104619999998,5.9500170000000005E-2,0.1016073,1,5.0413533834586469E-3,3.3834586466165414E-5,5.0413533834586469E-3,3.3834586466165414E-5,2,8.5863193810850995E-3,"N/A",1.9997250378073016E-5,"N/A"]
[null,"HR1210","holroyd","Urban",604,2.3569652354376798,0.69030999999999998,1.426274558,8.2883160000000011E-2,0,3,7.0225563909774432E-3,5.7644110275689221E-5,7.0225563909774432E-3,5.7644110275689221E-5,0,0,"N/A",0,"N/A"]
[null,"HR1213","holroyd","Urban",555,3.2738958918497403,0.52809000000000006,1.553355126,0.45211551,0,1,3.8307017543859651E-2,6.9047619047619046E-4,3.8307017543859651E-2,6.9047619047619046E-4,0,0,"N/A",0,"N/A"]
[null,"HR1217","holroyd","Urban",284,0.87302921451527593,1.5858099999999999,1.950219927,0.25636986,0,1,2.1721804511278194E-2,2.0300751879699248E-4,2.1721804511278194E-2,2.0300751879699248E-4,0,0,"N/A",0,"N/A"]
[null,"HR1236","holroyd","Urban",1505,3.56465182708674,2.3285101448055898,2.9138983559999998,2.7131219700000004,0.141984,5,0.22987844611528821,2.2518796992481204E-3,0.13980200501253132,2.0814536340852128E-3,2,1.1998350226843809E-2,"N/A",3.374536001299821E-5,"N/A"]
[null,"HR1239","holroyd","Urban",859,3.1282833262526699,1.25489256206331,1.5605950980000001,1.1578795200000001,0,2,9.8105263157894751E-2,1.0902255639097744E-4,1.5789473684210527E-2,4.5112781954887219E-5,0,0,"N/A",0,"N/A"]
[null,"HR1243","holroyd","Urban",1075,3.4024443740366102,1.43455926018044,2.9074204859999999,5.6757645830321142,1.1979900000000001,2,0.48089837364134763,2.0881329537435827E-3,0.10313145634811453,7.4853395624984841E-4,4,0.10123608003899465,"N/A",1.674769719163615E-4,"N/A"]
[null,"HR1247","holroyd","Urban",786,2.23059647488056,1.0749000000000002,1.2988129390000001,1.4473641900000001,0,4,0.1226328320802005,4.1478696741854642E-4,2.9604010025062657E-2,2.5563909774436089E-4,0,0,"N/A",0,"N/A"]
[null,"HR1250","holroyd","Urban",1344,1.7706345364351401,3.03831575191106,3.0996608050000001,1.61912046,0,1,0.13718546365914788,1.587719298245614E-3,0.13718546365914788,1.587719298245614E-3,0,0,"N/A",0,"N/A"]
[null,"HR1269","holroyd","Urban",2199,5.3835344876078395,2.1600715128521202,3.708771112,4.8941884800000013,1.9274328000000001,13,0.41467669172932337,3.3809523809523803E-3,0.32871177944862162,3.1290726817042604E-3,4,0.16287760432940471,"N/A",4.0744397645323767E-4,"N/A"]
[null,"HR1273","holroyd","Urban",1482,6.15269077474938,1.03725,3.290186394,0.75211586999999991,2.0676420000000002,8,6.3725563909774435E-2,3.4335839598997496E-4,6.0022556390977443E-2,2.9072681704260647E-4,3,0.17472597517841296,"N/A",3.5495119421079599E-4,"N/A"]
[null,"HR1276","holroyd","Urban",1637,5.1308386703147102,1.7715000000000001,3.429460599,2.127114036967892,0.2240685,5,0.1802269396418609,1.5747743144268434E-3,0.17764673914060777,1.4820424848529087E-3,2,1.8934896451737886E-2,"N/A",4.749346964792341E-5,"N/A"]
[null,"HR1280","holroyd","Urban",509,2.2170911017006003,0.977198823827928,0.98234993599999998,0.26657496000000003,0.19700280000000001,4,2.2586466165413537E-2,2.4060150375939849E-4,2.2586466165413537E-2,2.4060150375939849E-4,1,1.6647710939745784E-2,"N/A",4.6243641499293848E-5,"N/A"]
[null,"HT1213","huntingwood","Urban",19,0,3.23857415354761,0,5.6038369696969693E-4,1.06488E-2,1,4.7480406303935713E-5,2.3740203151967921E-5,4.7480406303935713E-5,2.3740203151967921E-5,1,8.998762670132857E-4,"N/A",2.499656297259127E-6,"N/A"]
[null,"HT1219","huntingwood","Urban",272,0,1.4714684312205599,0,8.0223350303030364E-3,0,1,6.7971950077213282E-4,3.3985975038606641E-4,6.7971950077213282E-4,3.3985975038606641E-4,0,0,"N/A",0,"N/A"]
[null,"HT1238","huntingwood","Urban",86,5.3196427488298301,5.1972449829274705,1.529158376,5.3384838060606073E-2,0,2,4.5232111770811467E-3,2.0396147826488384E-4,4.5232111770811467E-3,2.0396147826488384E-4,0,0,"N/A",0,"N/A"]
[null,"HT1239","huntingwood","Urban",0,0,1.8172699999999999,0.110314316,0,0,1,0,0,0,0,0,0,"N/A",0,"N/A"]
[null,"HT1245","huntingwood","Urban",4,0,0.18140000000000001,0.35952178600000001,1.1797551515151516E-4,0,1,9.9958750113548886E-6,4.9979375056774443E-6,9.9958750113548886E-6,4.9979375056774443E-6,0,0,"N/A",0,"N/A"]
[null,"HT1246","huntingwood","Urban",2,0,1.1057761796176602,0,5.8987757575757582E-5,0,1,4.9979375056774443E-6,2.4989687528387221E-6,4.9979375056774443E-6,2.4989687528387221E-6,0,0,"N/A",0,"N/A"]
[null,"HT1260","huntingwood","Urban",21,0.28538999999999998,3.4764899999999996,0.31227144000000001,6.1937145454545451E-4,0,1,5.2478343809613159E-5,2.623917190480664E-5,5.2478343809613159E-5,2.623917190480664E-5,0,0,"N/A",0,"N/A"]
[null,"HT1267","huntingwood","Urban",4,0,1.0863099999999999,0,1.1797551515151516E-4,0,1,9.9958750113548886E-6,4.9979375056774443E-6,9.9958750113548886E-6,4.9979375056774443E-6,0,0,"N/A",0,"N/A"]
[null,"HT1268","huntingwood","Urban",23,0,3.36836,2.161703331,4.5829192121212125E-3,0,2,3.8830334898446356E-4,3.3750671985966038E-5,3.8830334898446356E-4,3.3750671985966038E-5,0,0,"N/A",0,"N/A"]
[null,"HT1272","huntingwood","Urban",12,0,1.8891900000000001,0,3.5392654545454548E-4,0,1,2.9987625034064662E-5,1.4993812517032331E-5,2.9987625034064662E-5,1.4993812517032331E-5,0,0,"N/A",0,"N/A"]
[null,"HT1279","huntingwood","Urban",80,3.2918421292720801,1.2065045918547701,3.2109277490000001,2.5364735757575784E-3,1.95228E-2,1,2.1491131274413032E-4,1.0745565637206502E-4,2.1491131274413032E-4,1.0745565637206502E-4,3,1.6497731561910237E-3,"N/A",6.2491407431478175E-6,"N/A"]
[null,"HT1290","huntingwood","Urban",2,0,2.7173000000000003,9.2976486999999997E-2,5.8987757575757582E-5,0,1,4.9979375056774443E-6,2.4989687528387221E-6,4.9979375056774443E-6,2.4989687528387221E-6,0,0,"N/A",0,"N/A"]
[null,"HT1291","huntingwood","Urban",7,0,2.0365799999999998,0,2.064571515151515E-4,0,1,1.7492781269871051E-5,8.7463906349355254E-6,1.7492781269871051E-5,8.7463906349355254E-6,0,0,"N/A",0,"N/A"]
[null,"HT1293","huntingwood","Urban",9,3.3534723584152197,4.0257399999999999,2.5799069979999998,7.4807044909090903E-2,5.9455800000000003E-2,3,6.3382801924597599E-3,1.876415638025545E-5,6.3382801924597599E-3,1.876415638025545E-5,2,5.0243091574908453E-3,"N/A",9.998625189036508E-6,"N/A"]
[null,"HT1294","huntingwood","Urban",431,4.53767469044561,4.9635324961028502,0.64073755499999996,1.7518611757575756E-2,0,2,1.4843237028995539E-3,5.3978089906882461E-4,1.4843237028995539E-3,5.3978089906882461E-4,0,0,"N/A",0,"N/A"]
[null,"HT1298","huntingwood","Urban",2,0,0.12642,0,5.8987757575757582E-5,0,1,4.9979375056774443E-6,2.4989687528387221E-6,4.9979375056774443E-6,2.4989687528387221E-6,0,0,"N/A",0,"N/A"]
[null,"J459","minto","Urban",1819,0.86856217847929207,16.047793715877098,4.5916666910000004,2.2864304699999991,0.57814109999999996,21,0.19372556390977447,7.9210526315789485E-3,0.16932581453634088,7.7681704260651619E-3,2,4.885578232992964E-2,"N/A",1.9247353488895276E-4,"N/A"]
[null,"J460","minto","Urban",56,0,3.8139063926972501,3.0865145389999999,0,1.41984E-2,0,0,0,0,0,1,1.1998350226843809E-3,"N/A",4.999312594518254E-6,"N/A"]
[null,"J462","minto","Urban",31,0,2.1286941008732803,3.4698520240000001,0,0.22184999999999999,0,0,0,0,0,1,1.874742222944345E-2,"N/A",3.1245703715739086E-5,"N/A"]
[null,"J464","minto","Urban",14,0,2.7699226809168498,3.3631576939999999,2.9624370000000001E-2,0,1,2.5100250626566415E-3,2.1303258145363408E-5,2.5100250626566415E-3,2.1303258145363408E-5,0,0,"N/A",0,"N/A"]
[null,"J465","minto","Urban",1273,0,10.4615798147553,4.8774550740000002,1.18055259,0,3,0.10002631578947369,1.9962406015037594E-3,9.5432330827067674E-2,1.9924812030075187E-3,0,0,"N/A",0,"N/A"]
[null,"J467","minto","Urban",25,0,1.8286347688643401,4.7631397209999999,2.3516100000000002E-2,2.6622E-2,2,1.9924812030075187E-3,1.5037593984962406E-5,1.9924812030075187E-3,1.5037593984962406E-5,1,2.249690667533214E-3,"N/A",7.498968891777381E-6,"N/A"]
[null,"J468","minto","Urban",1587,1.15917,13.3667541813114,4.4582987789999997,1.45551348,0.80753399999999997,2,0.1233233082706767,3.2694235588972432E-3,2.9649122807017543E-2,1.9862155388471179E-3,2,6.8240616915174163E-2,"N/A",2.2746872305058055E-4,"N/A"]
[null,"J469","minto","Urban",938,5.7991787947570197,2.6300853287320103,4.3512233980000001,0.24733316999999999,0.20498939999999999,4,2.0956140350877193E-2,1.8295739348370927E-4,1.2439849624060152E-2,7.6441102756892224E-5,6,1.7322618140005751E-2,"N/A",4.8743297796552978E-5,"N/A"]
[null,"J472","minto","Urban",628,1.7674317304223299,4.1388425787437697,3.8867220119999999,1.6541431800000002,null,6,0.14015288220551378,1.7293233082706766E-3,3.7739348370927323E-2,9.172932330827069E-4,0,0,"N/A",0,"N/A"]
[null,"J473","minto","Urban",1396,0,11.2841318998445,4.1915629540000001,0.20098131,0.30792779999999997,6,1.7028822055137845E-2,1.2531328320802005E-4,1.3588972431077694E-2,1.1403508771929824E-4,3,2.6021422054467509E-2,"N/A",5.7492094836959918E-5,"N/A"]
[null,"J474","minto","Urban",1106,2.0456500000000002,8.1234254688394998,3.181777334,2.3605135800000001,0.25912079999999998,11,0.20000250626566418,2.0563909774436091E-3,8.0130325814536343E-2,2.4060150375939854E-4,2,2.1896989163989952E-2,"N/A",5.874192298558948E-5,"N/A"]
[null,"J475","minto","Urban",7,0,1.62978,1.3527316810000001,1.2941250000000001E-2,0,1,1.0964912280701754E-3,6.2656641604010028E-6,1.0964912280701754E-3,6.2656641604010028E-6,0,0,"N/A",0,"N/A"]
[null,"J477","minto","Rural Short",1301,10.835954051827301,6.4674671390974696,3.9654090800000001,0.49073220000000001,0.91624050000000001,9,0.20050882589331573,8.1581348690770434E-4,5.4991872080445252E-2,5.4991872080445252E-4,4,0.3795281475718163,"N/A",9.4958616422326908E-4,"N/A"]
[null,"J478","minto","Urban",1489,2.1823261309420898,10.1223680741541,3.669522841,3.0364609499999999,1.3998735,6,0.25727443609022554,2.9398496240601504E-3,1.5135338345864661E-2,1.5664160401002508E-4,5,0.11829623426778819,"N/A",2.7496219269850398E-4,"N/A"]
[null,"J480","minto","Urban",384,0.82910554284108107,5.3670709369584806,2.2100968299999999,0,8.5190399999999999E-2,0,0,0,0,0,1,7.1990101361062856E-3,"N/A",1.4997937783554762E-5,"N/A"]
[null,"J481","minto","Urban",1427,0.50468000000000002,10.185961389714599,3.0865145389999999,0.25642902000000001,0.82616940000000005,6,2.1726817042606515E-2,1.0776942355889724E-4,2.1726817042606515E-2,1.0776942355889724E-4,5,6.9815400382447407E-2,"N/A",1.3248178375473374E-4,"N/A"]
[null,"J483","minto","Urban",1116,0.11023999999999999,12.307924231933001,3.962932248,0.29452805999999998,0,10,2.4954887218045112E-2,7.5187969924812013E-5,1.9248120300751879E-2,6.1403508771929813E-5,0,0,"N/A",0,"N/A"]
[null,"J489","kentlyn","Urban",1981,9.6146119260476901,0.59889129584165401,4.4541072159999997,1.7842212300000002,0,5,0.15117418546365916,3.9849624060150376E-4,6.0354636591478689E-2,3.1954887218045114E-4,0,0,"N/A",0,"N/A"]
[null,"J491","kentlyn","Urban",1522,7.3539246923050792,2.7979966393173199,4.8795508559999998,2.9723167200000002,0.53332740000000001,4,0.25183959899749375,3.8170426065162908E-3,0.24457142857142858,3.754385964912281E-3,3,4.5068803039582057E-2,"N/A",1.0873504893077201E-4,"N/A"]
[null,"J492","kentlyn","Urban",1114,5.0262829832892306,1.0161493931144001,2.8304481479999999,3.5887639200000003,0.1845792,2,0.30407017543859649,3.0401002506265664E-3,1.8546365914786966E-4,1.2531328320802005E-6,1,1.5597855294896951E-2,"N/A",3.2495531864368648E-5,"N/A"]
[null,"J493","kentlyn","Urban",801,7.1163866512437293E-2,3.8573636153938602,2.3244121839999998,1.5884016299999999,2.5060175999999998,8,0.1345827067669173,2.4674185463659151E-3,0.13358521303258145,2.466165413533835E-3,7,0.2117708815037932,"N/A",8.8737798552698994E-4,"N/A"]
[null,"J495","kentlyn","Urban",1020,1.1536779365163299,5.7998931535646499,3.1055670979999999,1.4259039,0,4,0.12081453634085212,1.2794486215538851E-3,0.12081453634085212,1.2794486215538851E-3,0,0,"N/A",0,"N/A"]
[null,"J496","kentlyn","Urban",974,3.1804868260881998,1.55265650750676,2.72451592,2.001087E-2,2.3057609999999999E-2,2,1.6954887218045113E-3,1.7418546365914787E-4,1.6954887218045113E-3,1.7418546365914787E-4,2,1.9484820837134893E-3,"N/A",6.2491407431478175E-6,"N/A"]
[null,"J497","kentlyn","Rural Short",938,9.7989396987514787,3.9893760359374602,2.1626559589999999,4.77811656,1.9175234999999999,13,1.9522960617359302,2.1591863620157244E-2,1.628980112280108,2.0008581149269698E-2,5,0.79428287865514091,"N/A",1.7215078203015397E-3,"N/A"]
[null,"J499","kentlyn","Urban",932,0.56356684605251206,7.8009358981708603,2.068726844,0.61752686999999995,0.87142679999999995,8,5.232205513784461E-2,2.4436090225563912E-4,5.232205513784461E-2,2.4436090225563912E-4,2,7.3639874517253873E-2,"N/A",1.4498006524102936E-4,"N/A"]
[null,"J500","kentlyn","Urban",771,1.40418169850302,4.0770204245383699,2.3274605930000001,1.81513233,0,3,0.15379323308270679,1.5726817042606518E-3,0.15379323308270679,1.5726817042606518E-3,0,0,"N/A",0,"N/A"]
[null,"J502","kentlyn","Urban",698,1.52327657980116,3.5665199860126497,1.8871559570000001,1.71182418,1.0582244999999999,4,0.14504010025062655,1.5426065162907269E-3,0.14392731829573935,1.5413533834586469E-3,1,8.942520403444526E-2,"N/A",1.9872267563210059E-4,"N/A"]
[null,"J503","kentlyn","Urban",394,0,6.3204126357953099,2.8510249110000001,0.65777046000000006,0,2,5.5731829573934834E-2,1.2656641604010026E-4,5.5731829573934834E-2,1.2656641604010026E-4,0,0,"N/A",0,"N/A"]
[null,"J504","kentlyn","Urban",1196,4.2999197746996893,1.71837739063017,4.1534578370000004,1.3502234700000002,0.141984,2,0.11440225563909774,2.1278195488721803E-3,0.11440225563909774,2.1278195488721803E-3,1,1.1998350226843809E-2,"N/A",4.999312594518254E-5,"N/A"]
[null,"J505","macquarie_fields","Urban",363,2.08468688498193,0.52107000000000003,0.84612414000000002,8.3637450000000002E-2,1.5170102999999999,1,7.086466165413534E-3,3.6340852130325816E-5,0,0,1,0.12819487320493433,"N/A",3.2870480308957518E-4,"N/A"]
[null,"J506","macquarie_fields","Urban",1196,0,5.7900785105896606,2.89598895,1.76083824,0.49516919999999998,5,0.14919298245614035,1.5889724310776941E-3,0.14919298245614035,1.5889724310776941E-3,1,4.1844246416117781E-2,"N/A",1.5497869043006585E-4,"N/A"]
[null,"J507","macquarie_fields","Urban",867,5.8904502019263898,4.9841038328324005,2.2672545070000001,0.53452538999999999,0.35318519999999998,11,4.5289473684210532E-2,2.5689223057644113E-4,4.4285714285714289E-2,2.3308270676691731E-4,3,2.9845896189273975E-2,"N/A",7.6239517066403379E-5,"N/A"]
[null,"J509","macquarie_fields","Urban",264,5.0577724123213201,1.1146170124451902,2.9424771939999999,1.5545029500000003,0,4,0.13171052631578947,7.0050125313283215E-4,4.9794486215538843E-2,3.7092731829573933E-4,0,0,"N/A",0,"N/A"]
[null,"J510","macquarie_fields","Urban",1229,2.0680459735651304,5.9666893721099896,3.3532503629999999,5.9073478500000007,0.85811579999999998,15,0.5005200501253132,2.0012531328320788E-3,0.24185714285714288,1.5751879699248119E-3,2,7.2515029183487276E-2,"N/A",1.637274874704728E-4,"N/A"]
[null,"J512","macquarie_fields","Urban",866,3.2817813508487603,1.37917,3.696196423,0.11085105000000001,0.45346140000000001,5,9.3922305764411029E-3,1.5488721804511277E-3,9.1315789473684211E-3,1.5476190476190475E-3,1,3.8319731036982413E-2,"N/A",9.1237454849958134E-5,"N/A"]
[null,"J514","macquarie_fields","Urban",1973,0,9.8093654849708898,3.304856864,2.1385896299999998,1.0063116000000001,17,0.18119924812030075,2.4862155388471171E-3,0.18119924812030075,2.4862155388471171E-3,2,8.5038307232755489E-2,"N/A",4.7243504018197499E-4,"N/A"]
[null,"J515","macquarie_fields","Urban",591,0.88593960614571599,8.8486809568476197,3.06746198,2.15934E-3,5.4131400000000003E-2,1,1.8295739348370927E-4,1.2531328320802005E-6,0,0,4,4.5743710239842025E-3,"N/A",1.1248453337666072E-5,"N/A"]
[null,"J516","macquarie_fields","Urban",1418,3.2474420213750599,2.8198110178823899,3.7036269210000001,0.90838700999999999,0.32833800000000002,9,7.6966165413533835E-2,6.3408521303258132E-4,6.9993734335839608E-2,5.601503759398496E-4,3,2.7746184899576309E-2,"N/A",6.8740548174625994E-5,"N/A"]
[null,"JBA2","jamberoo","Rural Short",622,55.069792774284203,0.24162,2.1839948250000001,4.1515370297831256,4.0904702999999998,21,1.6962812211924105,1.0515389424641492E-2,1.1963753708929838,6.5748523981894978E-3,23,1.6943680350918038,"N/A",4.0372727885363505E-3,"N/A"]
[null,"JBB2","jamberoo","Rural Short",318,44.023546663618504,2.3402034784743302,0.79525380800000001,3.2010464626543946,0.61629929999999999,20,1.3079192028906688,1.0019633427989975E-2,0.65362372264758672,4.1394980631983512E-3,5,0.25528551911731373,"N/A",6.6164713378137456E-4,"N/A"]
[null,"JS1122","","Urban",1187,27.922225222814099,8.5383600000000008,0,0.41636808000000003,0.25601489999999999,8,3.5278195488721804E-2,1.5162907268170424E-4,3.5278195488721804E-2,1.5162907268170424E-4,3,2.1634525252777745E-2,"N/A",4.999312594518254E-5,"N/A"]
[null,"JS1142","","Urban",484,0,5.1956099999999994,0,1.12404E-3,0,1,9.5238095238095241E-5,1.2531328320802005E-6,9.5238095238095241E-5,1.2531328320802005E-6,0,0,"N/A",0,"N/A"]
[null,"JS1152","","Urban",1141,1.8555166121745998,6.99540051776557,0,6.7945260000000007E-2,0.27331919999999998,1,5.7568922305764412E-3,1.5037593984962406E-5,5.7568922305764412E-3,1.5037593984962406E-5,1,2.3096824186674331E-2,"N/A",5.4992438539700794E-5,"N/A"]
[null,"JS1252","","Urban",405,21.770280653846502,1.8528499999999999,0,0.16638750000000002,1.7015895000000001,4,1.4097744360902255E-2,8.020050125313283E-5,1.4097744360902255E-2,8.020050125313283E-5,8,0.14379272849983124,"N/A",2.9370961492794739E-4,"N/A"]
[null,"KC1214","kemps_creek","Rural Short",236,12.5796886915867,1.92968859677664,2.30383542,0.99127016999999995,0.70015859999999996,7,0.40502420246677828,2.4353543349911466E-3,0.38260443923398135,2.3749237063313169E-3,4,0.29002199364083586,"N/A",5.3299352443499624E-4,"N/A"]
[null,"KC1221","kemps_creek","Rural Short",482,15.317957947881899,0.207506589271685,2.6673582439999999,0.16385841000000001,0.11891160000000001,5,6.6951093492225597E-2,3.1182204388472256E-3,6.6951093492225597E-2,3.1182204388472256E-3,2,4.9255953292613446E-2,"N/A",1.0414815994706822E-4,"N/A"]
[null,"KC1236","kemps_creek","Rural Short",275,32.263670403766795,0.43800654353501395,3.0421220770000001,1.1578943099999999,0.34431119999999998,14,0.47310534871494275,5.3964551393228151E-3,0.24635150079466273,4.6289861553429745E-3,6,0.1426217155039852,"N/A",3.0631811749137712E-4,"N/A"]
[null,"KC1262","kemps_creek","Rural Short",126,19.042723712411899,5.4549999999999994E-2,1.109239978,9.0825390000000006E-2,1.68606E-2,3,3.711044906000157E-2,1.0937943787429219E-3,3.5738673789423428E-2,1.0877513158769391E-3,1,6.9840530788033992E-3,"N/A",1.2252724699655085E-5,"N/A"]
[null,"KC1284","kemps_creek","Rural Short",836,25.146549278298298,0.25963999999999998,3.0733682729999998,2.6933921099999996,0.42905789999999999,9,1.1004961354612972,6.4962925809317201E-3,0.29068945304238003,1.4684642764338678E-3,3,0.17772577176849702,"N/A",3.1857084219103225E-4,"N/A"]
[null,"KC1288","kemps_creek","Rural Short",348,17.991497536230302,2.2257464570151302,1.9052558879999999,3.1163565300000005,1.1305476000000001,7,1.273315647302679,5.1607756875494777E-3,0.30824455066806061,2.2298901975477251E-3,8,0.46829913802081735,"N/A",1.1149979476686128E-3,"N/A"]
[null,"KMA2","kiama","Urban",1496,6.09255803349064,2.6369018419794803,2.519510387,2.6539520396775367,1.9150092000000001,6,0.22486507340677053,2.6369593375482362E-3,7.6807432425263042E-2,8.5353307061047988E-4,5,0.16182774868455585,"N/A",4.5618727424979067E-4,"N/A"]
[null,"KMB2","kiama","Urban",1419,8.6801404366154085,1.7906931131891699,3.590454722,3.6210827709938491,6.4505106000000003,8,0.30680849952754169,5.0134663883831731E-3,0.15885490467462188,3.2312934076484737E-3,8,0.54510004874329776,"N/A",1.3523140568171878E-3,"N/A"]
[null,"KMC2","kiama","Urban",396,2.9491634440360297,1.4616150170036999,1.531254157,0.49293496014389382,0.28219319999999998,3,4.1765583680625988E-2,4.9432985669062204E-4,1.4997319168568181E-3,9.308096110924076E-6,4,2.3846721075852069E-2,"N/A",6.6240891877366857E-5,"N/A"]
[null,"KMD2","kiama","Urban",1298,8.1556595932681706,3.7058905937895301,2.8916068620000002,4.9558830736503721,2.8343555999999999,7,0.41990397508734412,4.515272937231204E-3,0.16810029268720875,1.2945227900104149E-3,8,0.23951706640336956,"N/A",5.4992438539700796E-4,"N/A"]
[null,"KME2","kiama","Rural Short",945,10.850985664551201,3.87930286908863,1.875343371,4.6550917863778274,0.1144746,8,1.9020292300204389,1.978496527192938E-2,1.4264750749318047,1.4061485805768933E-2,4,4.741804458766518E-2,"N/A",1.1027452229689578E-4,"N/A"]
[null,"KMF2","kiama","Urban",1454,5.7514421584504296,1.2429609273169302,3.1124260189999999,3.5802549993799997,3.6019565999999998,7,0.30334922832605515,3.0327669603243471E-3,0.15269043412983335,1.2180085383103872E-3,8,0.30438314731724386,"N/A",7.4864706102910849E-4,"N/A"]
[null,"KVA2","kangaroo_valley","Rural Short",354,64.308526618227702,0.42307,0.98863727999999995,6.8768484220265789,3.2711782500000002,21,2.8098192923693417,1.2565639354467474E-2,2.6136675148023998,1.2438735034281832E-2,23,1.3549981927231067,"N/A",3.596174699348767E-3,"N/A"]
[null,"KVB2","kangaroo_valley","Rural Short",387,47.610862538030702,9.126999999999999E-2,1.03531605,6.074588274909269,0.71687129999999999,37,2.4820229094144626,1.6725539741935875E-2,2.1570753329848253,1.4054505955171392E-2,10,0.29694478309614103,"N/A",8.4543800427620093E-4,"N/A"]
[null,"KVC2","kangaroo_valley","Rural Short",136,38.647982176409599,0,0.38619536900000001,2.5038760507438802,0.244035,15,1.0230615539739345,5.3092934288796476E-3,0.96855312692276796,5.1098723543022088E-3,2,0.10108497877215446,"N/A",2.6955994339241188E-4,"N/A"]
[null,"KVD2","kangaroo_valley","Rural Short",101,31.513664058462201,0,0.33265767800000001,1.5328805823202805,2.6622E-2,18,0.62632141480771319,3.8636226166987647E-3,0.62632141480771319,3.8636226166987647E-3,1,1.1027452229689576E-2,"N/A",3.0631811749137715E-5,"N/A"]
[null,"KYA2","kenny_street","Urban",230,0,1.95475727957763,1.5339215159999999,0,2.2185E-3,0,0,0,0,0,1,1.8747422229443452E-4,"N/A",1.2498281486295635E-6,"N/A"]
[null,"KYB2","kenny_street","Urban",209,0,1.25807182905041,2.2171462769999999,1.13883E-3,5.3244E-3,1,9.6491228070175438E-5,1.2531328320802005E-6,9.6491228070175438E-5,1.2531328320802005E-6,1,4.4993813350664285E-4,"N/A",1.2498281486295635E-6,"N/A"]
[null,"KYC2","kenny_street","Urban",109,0,1.18357,0.990733062,0.14590335000000001,2.6622E-2,3,1.2362155388471179E-2,1.3533834586466166E-4,1.2362155388471179E-2,1.3533834586466166E-4,1,2.249690667533214E-3,"N/A",7.498968891777381E-6,"N/A"]
[null,"KYE2","kenny_street","Urban",241,0,1.5080868785040999,2.3198395700000001,4.712094E-2,4.8807E-3,2,3.9924812030075188E-3,2.2556390977443609E-5,3.9924812030075188E-3,2.2556390977443609E-5,1,4.1244328904775591E-4,"N/A",1.2498281486295635E-6,"N/A"]
[null,"KYF2","kenny_street","Urban",442,0.91897907653487299,1.7960195367985701,2.6864108029999998,4.82154E-3,0,1,4.0852130325814539E-4,2.5062656641604009E-6,4.0852130325814539E-4,2.5062656641604009E-6,0,0,"N/A",0,"N/A"]
[null,"KYH2","kenny_street","Urban",448,0.55022376101096493,1.35796400043412,2.6102005670000001,1.3769490000000001E-2,0,1,1.1666666666666668E-3,1.2531328320802005E-6,1.1666666666666668E-3,1.2531328320802005E-6,0,0,"N/A",0,"N/A"]
[null,"L503","seven_hills","Urban",20,0,1.3879000000000001,1.281856162,5.5329390000000006E-2,1.41984E-2,2,4.6879699248120301E-3,3.0075187969924815E-5,4.6879699248120301E-3,3.0075187969924815E-5,1,1.1998350226843809E-3,"N/A",2.499656297259127E-6,"N/A"]
[null,"L508","lennox","Urban",900,0,2.15464929637624,2.91847097,2.6902270499999998,0.27864359999999999,5,0.22793859649122805,1.7418546365914789E-3,0.22793859649122805,1.7418546365914789E-3,2,2.3546762320180978E-2,"N/A",7.9989001512292064E-5,"N/A"]
[null,"L509","bossley_park","Urban",994,1.9392535912094,9.4176084019100195,3.423935357,3.9028147799999999,0.58701510000000001,5,0.33067919799498746,1.3721804511278198E-3,0.3261779448621554,1.3709273182957395E-3,3,4.9605679219107371E-2,"N/A",8.8737798552699011E-5,"N/A"]
[null,"L511","bossley_park","Urban",854,0,5.2309341202405006,2.9910612190000001,1.36068E-3,0.43571339999999997,1,1.1528822055137844E-4,1.2531328320802005E-6,1.1528822055137844E-4,1.2531328320802005E-6,2,3.6819937258626936E-2,"N/A",7.6239517066403365E-5,"N/A"]
[null,"L513","bossley_park","Urban",1001,0,5.8374508324549099,3.3488682750000001,0.11435628,0,1,9.6892230576441103E-3,2.1303258145363408E-5,9.6892230576441103E-3,2.1303258145363408E-5,0,0,"N/A",0,"N/A"]
[null,"L516","bossley_park","Urban",622,0,4.5447555677995295,5.2087790729999996,0.10523085,0.4117536,2,8.9160401002506273E-3,1.1403508771929824E-4,8.9160401002506273E-3,1.1403508771929824E-4,1,3.4795215657847045E-2,"N/A",7.249003262051468E-5,"N/A"]
[null,"L517","bossley_park","Urban",1113,3.1085542464448901,3.7712044260837403,3.8105117769999999,0.2058768,0.50892389999999998,3,1.744360902255639E-2,1.0025062656641604E-4,1.744360902255639E-2,1.0025062656641604E-4,3,4.3006586594343275E-2,"N/A",1.199835022684381E-4,"N/A"]
[null,"L519","bossley_park","Urban",977,0.88655041061377993,6.8276102510958303,5.4797064600000001,0.18153246000000001,0,3,1.5380952380952381E-2,4.2606516290726817E-5,1.5380952380952381E-2,4.2606516290726817E-5,0,0,"N/A",0,"N/A"]
[null,"L520","bossley_park","Urban",260,0,2.7275009983175602,3.4725193820000002,1.0957615200000002,0.34786080000000003,1,9.2842105263157892E-2,1.8421052631578948E-4,9.2842105263157892E-2,1.8421052631578948E-4,1,2.9395958055767332E-2,"N/A",6.9990376323255556E-5,"N/A"]
[null,"L521","bossley_park","Urban",29,0.13525192221646501,3.0803699999999998,0,1.7718420000000002E-2,1.41984E-2,2,1.5012531328320803E-3,8.7719298245614029E-6,1.5037593984962406E-5,7.5187969924812028E-6,1,1.1998350226843809E-3,"N/A",4.999312594518254E-6,"N/A"]
[null,"L526","cranebrook","Urban",732,0,7.0962022825522402,4.1113516810000004,7.1229744703615386E-2,0,3,6.0351813190528195E-3,9.3642690871057258E-4,6.0351813190528195E-3,9.3642690871057258E-4,0,0,"N/A",0,"N/A"]
[null,"L528","cranebrook","Urban",593,1.33264189072212,6.4167195434922393,3.3562987729999998,3.4917211304826612E-2,0,1,2.9584789648925062E-3,7.3961974122312526E-4,2.9584789648925062E-3,7.3961974122312526E-4,0,0,"N/A",0,"N/A"]
[null,"L533","newton","Urban",314,0.153305915107317,2.9197215149488303,2.3625173020000001,0.46215792,0.46056059999999999,1,3.9157894736842107E-2,3.9348370927318297E-4,3.9157894736842107E-2,3.9348370927318297E-4,4,3.8919648548324602E-2,"N/A",8.8737798552699011E-5,"N/A"]
[null,"L534","newton","Urban",546,2.57124,1.4904200000000001,1.322247586,1.1072533500000001,0,3,9.3815789473684214E-2,1.5162907268170427E-3,1.2269423558897243E-2,9.6491228070175438E-5,0,0,"N/A",0,"N/A"]
[null,"L540","newton","Urban",318,2.5219999999999999E-2,2.05367112538269,4.5388911030000001,0,9.7613999999999999E-3,0,0,0,0,0,2,8.2488657809551183E-4,"N/A",6.2491407431478175E-6,"N/A"]
[null,"L541","newton","Urban",174,0,1.6265799999999999,2.4196749780000002,0,0.217413,0,0,0,0,0,1,1.8372473784854581E-2,"N/A",4.3743985202034718E-5,"N/A"]
[null,"L543","newton","Urban",661,1.7659809885309501,3.0809487651649303,5.3728216050000004,1.09360218,0.3318876,1,9.2659147869674191E-2,1.0889724310776943E-3,9.2659147869674191E-2,1.0889724310776943E-3,2,2.8046143655247404E-2,"N/A",7.7489345215032941E-5,"N/A"]
[null,"L544","newton","Urban",978,4.2311287876803698,0.31992000000000004,3.2389350100000001,3.5054814300000001,1.0174041,5,0.29701378446115295,2.6528822055137844E-3,5.7426065162907269E-2,9.1604010025062661E-4,2,8.5975678344227674E-2,"N/A",1.7622576895676845E-4,"N/A"]
[null,"L579","lithgow","Rural Short",830,4.07522997385247,3.3221948015790299,1.6255643239999999,12.715501289918455,0,9,5.1954410863735685,2.3368750327335295E-2,0.86879970410484619,1.002608328286864E-2,0,0,"N/A",0,"N/A"]
[null,"L580","lithgow","Urban",142,0.8654400000000001,1.28956,1.111907336,1.3162690176463623,0,3,0.11152534968645093,5.3775528238061531E-4,1.7922098677538095E-4,1.7922098677538095E-4,0,0,"N/A",0,"N/A"]
[null,"L582","lithgow","Rural Short",1242,158.49711952930801,1.4238196262952199,1.751120687,17.084379103468365,0.92910780000000004,29,6.9805258247833359,2.9883622025073525E-2,0.62252708024480208,1.3162750027674868E-2,15,0.38485808281616618,"N/A",8.331852795765459E-4,"N/A"]
[null,"L584","lithgow","Rural Short",387,32.7083656525975,3.01369776934134,2.8565501530000001,4.1375457532532121,0.54087030000000003,17,1.6905645096545052,9.1996366282313651E-3,0.14476187023897805,2.9251417114912045E-3,4,0.22404107113319327,"N/A",5.2686716208516873E-4,"N/A"]
[null,"L585","lithgow","Rural Short",742,7.7677808956948802,1.57213,1.182020753,6.6242745147089517,3.5496E-2,7,2.7066198332599853,1.3474008399137042E-2,1.6594825162909971E-2,4.5389147452738962E-3,1,1.4703269639586103E-2,"N/A",4.9010898798620342E-5,"N/A"]
[null,"L588","lithgow","Rural Short",1070,65.82188957534909,2.0231720155150699,2.7311843159999998,21.81781431523677,1.6053066,22,8.9145654837944193,3.3502458571200211E-2,2.6269625511518253,2.0299470035792216E-2,9,0.66495536945028155,"N/A",1.3049151805132669E-3,"N/A"]
[null,"L590","lithgow","Rural Short",78,0.48333999999999999,0.54039999999999999,0.128795298,0.64874771871619819,0.46765980000000001,3,0.26507256581237576,1.4145009842162794E-3,4.7141938069621765E-4,4.7141938069621765E-4,4,0.19371557750154689,"N/A",3.7983446568930765E-4,"N/A"]
[null,"L591","lithgow","Rural Short",1505,135.27572084596898,5.2946213908457107,2.7530947590000001,24.865235998265298,4.4964557999999997,29,10.159714963828304,5.3742888372507805E-2,2.1707418434045844,3.2192541076192384E-2,34,1.862536681594569,"N/A",4.1720527602325565E-3,"N/A"]
[null,"L857","lennox","Urban",8,0,1.7530760630503801,4.4110484330000004,4.437E-3,0,1,3.7593984962406017E-4,5.0125313283208019E-6,3.7593984962406017E-4,5.0125313283208019E-6,0,0,"N/A",0,"N/A"]
[null,"L940","glossodia","Rural Short",561,40.209042736170602,1.0383800000000001,3.1076628789999998,5.5616316000000001,0.65223900000000001,12,2.2724333601242459,1.1052761981882897E-2,2.2708379915276264,1.1040675856150929E-2,8,0.2701725796273946,"N/A",7.9030074312775298E-4,"N/A"]
[null,"L941","glossodia","Rural Short",651,32.387114800867103,6.4659999999999995E-2,2.7172759480000002,0.70021544755700338,0.56704860000000001,13,0.28610182348339341,9.2662003246207405E-3,0.28610182348339341,9.2662003246207405E-3,7,0.234884732492388,"N/A",5.6975169853396143E-4,"N/A"]
[null,"L942","glossodia","Rural Short",586,22.862450010252001,0.38101275056929201,4.4011411020000004,6.80103676417807,1.7969850000000001,14,2.7788433211487251,2.2948051835309253E-2,2.7334659620880588,2.0337448677204599E-2,20,0.74435302550404636,"N/A",1.7521396320506772E-3,"N/A"]
[null,"L946","glossodia","Rural Short",494,37.408091905809101,0.21230000000000002,2.4768326549999999,4.1540692483257633,0.38823750000000001,13,1.6973158632372756,1.3617357863190852E-2,1.5141808430836607,1.2094506020963137E-2,3,0.16081701168297302,"N/A",5.3299352443499613E-4,"N/A"]
[null,"L947","glossodia","Rural Short",854,19.3328801156912,0.23651,3.2753253980000001,0.95435433000000014,0,6,0.38994071755328469,8.321297566458585E-3,0.38994071755328469,8.321297566458585E-3,0,0,"N/A",0,"N/A"]
[null,"L948","glossodia","Rural Short",730,21.743770180276197,4.0259999999999997E-2,3.7234415830000001,5.1752366440888276,0.65756340000000002,13,2.1145558070701584,1.5239734643094251E-2,2.1107909789046513,1.394651918977389E-2,7,0.27237807007333253,"N/A",6.8002622083085731E-4,"N/A"]
[null,"M158","woodpark","Urban",4,0.45867440206652299,1.39624388087744,1.4197966879999999,2.9106720000000003E-2,3.9933E-3,1,2.4661654135338345E-3,1.2531328320802005E-6,2.4661654135338345E-3,1.2531328320802005E-6,1,3.3745360012998215E-4,"N/A",1.2498281486295635E-6,"N/A"]
[null,"M159","woodpark","Urban",121,1.52204384161461,0.80130359669717099,1.9525062339999999,0,0.13532849999999999,0,0,0,0,0,2,1.1435927559960505E-2,"N/A",2.499656297259127E-5,"N/A"]
[null,"M160","woodpark","Urban",47,2.9805335799882902,1.30342548902653,3.8105117769999999,1.255671E-2,0.3833568,2,1.0639097744360902E-3,8.7719298245614029E-6,1.0639097744360902E-3,8.7719298245614029E-6,2,3.2395545612478288E-2,"N/A",6.7490720025996419E-5,"N/A"]
[null,"M162","woodpark","Urban",92,1.67134344378628,2.3003449853098399,2.8885584519999998,0,0.70459559999999999,0,0,0,0,0,5,5.9541813000712408E-2,"N/A",1.237329867143268E-4,"N/A"]
[null,"M165","woodpark","Urban",50,0,1.5607295540178401,2.5324661270000002,3.9637200000000004E-2,0.18369179999999999,2,3.3583959899749372E-3,2.7568922305764413E-5,3.3583959899749372E-3,2.7568922305764413E-5,2,1.5522865605979179E-2,"N/A",1.7497594080813886E-5,"N/A"]
[null,"M166","woodpark","Urban",61,1.40768524451979,0.93760693814793006,4.0010373650000002,7.8490530000000003E-2,1.37547E-2,1,6.6503759398496244E-3,7.6441102756892224E-5,null,0,2,1.1623401782254938E-3,"N/A",2.499656297259127E-6,"N/A"]
[null,"M168","woodpark","Urban",327,2.7114219403219901,0.94328033348712303,3.452514195,0.47888541000000007,5.7694311000000003,2,4.0575187969924813E-2,4.2982456140350879E-4,4.0575187969924813E-2,4.2982456140350879E-4,14,0.4875454624989064,"N/A",9.3237179887765433E-4,"N/A"]
[null,"M169","woodpark","Urban",115,0.61989888383233094,0.72823116138620003,5.3794900009999997,0.18588072,0.2981664,2,1.5749373433583961E-2,1.4536340852130326E-4,1.5749373433583961E-2,1.4536340852130326E-4,2,2.5196535476372E-2,"N/A",4.7493469647923417E-5,"N/A"]
[null,"M388","macquarie_fields","Urban",929,2.1019338818291797,4.3885800000000001,4.4228610189999999,1.1774910600000001,0,6,9.9766917293233073E-2,1.2982456140350879E-3,9.9766917293233073E-2,1.2982456140350879E-3,0,0,"N/A",0,"N/A"]
[null,"M399","lithgow","Rural Short",1085,26.119945083677802,0.95247356633730706,1.698345099,18.530344452080932,3.2824925999999999,14,7.5713344457230747,3.0606191104454408E-2,0.33432724969960409,1.3482912955969036E-2,12,1.359684859920725,"N/A",2.9284012032175658E-3,"N/A"]
[null,"M400","lithgow","Urban",761,3.77825476996109,4.2628492256322197,3.6796206969999998,5.3410036167054749,3.72708E-2,4,0.4525346171976149,2.8630137614450014E-3,9.5375644011234093E-4,9.5375644011234093E-4,1,3.1495669345465E-3,"N/A",8.7487970404069445E-6,"N/A"]
[null,"MC1252","MOBILE NO2 (ORAN PARK)","Urban",1219,9.3532999999999991,28.792619999999999,0,4.5027571411250005,0.59544540000000001,4,0.38151134607351717,4.117802318295739E-3,0.37976071950710111,4.1065241228070174E-3,8,5.0318081263826225E-2,"N/A",1.2873229930884504E-4,"N/A"]
[null,"MC1278","MOBILE NO2 (ORAN PARK)","Urban",333,11.943539333412,8.6601299999999988,0,0.30514647887499952,0.1703808,6,2.5854568713450248E-2,4.1227286967418546E-4,2.5615220342522931E-2,4.1101973684210528E-4,5,1.4398020272212571E-2,"N/A",3.4995188161627771E-5,"N/A"]
[null,"MG1208","mittagong","Urban",812,8.0832526610589408,0.911125764764813,2.6088668880000001,1.6221819900000001,0.37980720000000001,1,0.13744486215538848,1.0213032581453635E-3,0.13744486215538848,1.0213032581453635E-3,3,3.209558685680719E-2,"N/A",7.7489345215032927E-5,"N/A"]
[null,"MG1219","mittagong","Rural Short",589,39.0933930879564,1.5840699999999999,1.9591746299999999,3.178572636162988,1.3714767000000001,11,1.2987365966481561,3.6921267334728467E-3,1.2925968447763174,3.6437822305449823E-3,9,0.56809758069950789,"N/A",1.286536093463784E-3,"N/A"]
[null,"MG1234","mittagong","Rural Short",1307,9.9355093404094497,5.8960100000000004,3.563971665,1.6607099400000001,2.2207184999999998,6,0.67855135696976654,8.2789961263967024E-3,0.67855135696976654,8.2789961263967024E-3,7,0.91987330682660562,"N/A",2.5179349257791203E-3,"N/A"]
[null,"MG1267","mittagong","Rural Short",1093,46.374633565764505,1.68705554362293,2.5374197920000001,2.0730107700000002,3.8996792999999998,16,0.84701382048477447,2.4293112721251644E-3,0.27766665256618656,1.9579523685784904E-3,15,1.6153379607790281,"N/A",3.4981529017515276E-3,"N/A"]
[null,"MG1282","mittagong","Rural Short",1378,37.963522754067199,1.9725685317008199,3.49938349,4.3652851019114385,2.2309236000000001,15,1.7836167882886951,1.7645743568670342E-2,1.7698567341428519,1.7319418173907263E-2,7,0.92410049684798634,"N/A",2.0216995754430895E-3,"N/A"]
[null,"MG1286","mittagong","Rural Short",1358,34.568724249221603,0.62212000000000001,2.6168689629999999,6.5816517180885619,2.9918691000000002,13,2.689204536471546,1.7271073670979402E-2,2.6850287800311512,1.7126040162195807E-2,11,1.2393018397466136,"N/A",2.7752421444718774E-3,"N/A"]
[null,"MM1112","mamre","Urban",950,5.9982156189310798,8.5802851965976004,3.9490238799999999,5.0951550000000005E-2,8.3415600000000006E-2,5,4.3170426065162904E-3,4.260651629072681E-5,2.7005012531328317E-3,3.0075187969924811E-5,2,7.0490307582707374E-3,"N/A",1.2498281486295635E-5,"N/A"]
[null,"MM1122","mamre","Urban",16,0,4.6444999999999999,2.182089569,5.3244E-3,4.08204E-2,1,4.5112781954887219E-4,5.0125313283208019E-6,4.5112781954887219E-4,5.0125313283208019E-6,2,3.449525690217595E-3,"N/A",6.2491407431478175E-6,"N/A"]
[null,"MM1142","mamre","Urban",878,0,10.5398546077919,2.4145307869999999,8.4303000000000004E-4,0,1,7.1428571428571434E-5,1.2531328320802005E-6,7.1428571428571434E-5,1.2531328320802005E-6,0,0,"N/A",0,"N/A"]
[null,"MM1162","mamre","Urban",496,0,6.0910123623581107,3.2099751209999998,3.32775E-3,0.1987776,1,2.8195488721804513E-4,1.2531328320802005E-6,2.8195488721804513E-4,1.2531328320802005E-6,1,1.6797690317581333E-2,"N/A",6.9990376323255556E-5,"N/A"]
[null,"MM1192","mamre","Urban",190,1.1994400000000001,14.03074,4.5297458739999996,2.5882500000000003E-3,0,1,2.1929824561403509E-4,2.1929824561403509E-4,2.1929824561403509E-4,2.1929824561403509E-4,0,0,"N/A",0,"N/A"]
[null,"MM1202","mamre","Urban",997,0,7.9136561249474795,3.9057745709999998,0.27410307,1.0719791999999999,5,2.3224310776942356E-2,1.5288220551378445E-4,2.3224310776942356E-2,1.5288220551378445E-4,2,9.0587544212670762E-2,"N/A",2.2246941045606227E-4,"N/A"]
[null,"MM1212","mamre","Urban",7,0,1.9464399999999999,0.26997475900000001,0,0.15529499999999999,0,0,0,0,0,2,1.3123195560610416E-2,"N/A",2.1247078526702578E-5,"N/A"]
[null,"MM1222","mamre","Urban",455,0,4.94773077837998,3.3942133650000001,0.37782534000000001,0.23959800000000001,6,3.2012531328320798E-2,2.2681704260651628E-4,2.1568922305764411E-2,2.0426065162907269E-4,1,2.0247216007798927E-2,"N/A",4.4993813350664286E-5,"N/A"]
[null,"MM1232","mamre","Urban",12,0,3.5761799999999999,1.5242047110000001,0,1.55295E-2,0,0,0,0,0,1,1.3123195560610416E-3,"N/A",6.2491407431478175E-6,"N/A"]
[null,"MM1252","mamre","Urban",702,0.14061000000000001,4.70638800175072,2.7599536800000002,8.8148400000000002E-2,7.0992E-3,2,7.4686716791979944E-3,4.3859649122807021E-5,7.4686716791979944E-3,4.3859649122807021E-5,1,5.9991751134219043E-4,"N/A",1.2498281486295635E-6,"N/A"]
[null,"MM1262","mamre","Urban",6,0,6.0330500000000002,1.000259341,0,2.83968E-2,0,0,0,0,0,1,2.3996700453687617E-3,"N/A",4.999312594518254E-6,"N/A"]
[null,"MM1292","mamre","Urban",10,0,2.5854200000000001,2.686029751,0,1.28673E-2,0,0,0,0,0,2,1.0873504893077202E-3,"N/A",6.2491407431478175E-6,"N/A"]
[null,"MM1332","mamre","Urban",2,0,3.0890399999999998,0,8.3933250000000001E-2,0,1,7.1115288220551381E-3,4.1353383458646619E-5,7.1115288220551381E-3,4.1353383458646619E-5,0,0,"N/A",0,"N/A"]
[null,"MM1342","mamre","Urban",5,0,3.37588,0,0,7.9865999999999999E-3,0,0,0,0,0,1,6.749072002599643E-4,"N/A",1.2498281486295635E-6,"N/A"]
[null,"MM1352","mamre","Urban",31,0.94183000000000006,3.0434399999999999,0,0,1.59732E-2,0,0,0,0,0,1,1.3498144005199286E-3,"N/A",2.499656297259127E-6,"N/A"]
[null,"MM1362","mamre","Urban",54,4.41613009853645,7.0530153739169901,0,2.0308740599999999,7.6316400000000006E-2,7,0.17207268170426065,1.3132832080200501E-3,8.3020050125313279E-3,1.3659147869674184E-4,4,6.4491132469285473E-3,"N/A",1.2498281486295635E-5,"N/A"]
[null,"MM1372","mamre","Urban",659,0,6.3457800128939894,0,1.3133520000000001E-2,0,1,1.1127819548872181E-3,1.2531328320802005E-6,1.1127819548872181E-3,1.2531328320802005E-6,0,0,"N/A",0,"N/A"]
[null,"MM1382","mamre","Urban",348,0,5.04581099777291,0,0.19994600999999998,0,3,1.6941102756892229E-2,5.3884711779448615E-5,1.6941102756892229E-2,5.3884711779448615E-5,0,0,"N/A",0,"N/A"]
[null,"MM1392","mamre","Urban",639,0,4.9486949774092199,0,1.1025057600000001,0,8,9.3413533834586476E-2,1.7531328320802007E-3,9.3413533834586476E-2,1.7531328320802007E-3,0,0,"N/A",0,"N/A"]
[null,"MR2206","mungerie_park","Urban",670,0,8.0529200000000003,1.9220221399999999,0,0.1677186,0,0,0,0,0,1,1.4173051205459249E-2,"N/A",3.374536001299821E-5,"N/A"]
[null,"MR2217","mungerie_park","Urban",283,0,2.6260599999999998,4.207186053,0,1.9948752000000001,0,0,0,0,0,1,0.16857682068715552,"N/A",3.5120170976490732E-4,"N/A"]
[null,"MR2224","mungerie_park","Urban",800,3.7029316892756001,13.999930000000001,1.263565705,0.14760420000000002,1.7477343000000001,1,1.2506265664160401E-2,6.2531328320802003E-4,0,0,7,0.14769219232355552,"N/A",2.8996013048205867E-4,"N/A"]
[null,"MR2225","mungerie_park","Urban",1695,0.30612929193794702,14.758659681849199,6.2130394520000003,0.26687075999999998,2.8476518099999999,3,2.2611528822055138E-2,2.1416040100250629E-3,2.2611528822055138E-2,2.1416040100250629E-3,9,0.2406406619089875,"N/A",4.7618452462786366E-4,"N/A"]
[null,"MR2231","mungerie_park","Urban",974,0,13.4357392824987,3.8954861890000001,0.10246512000000001,0.64070280000000002,1,8.6817042606516289E-3,2.0050125313283208E-5,8.6817042606516289E-3,2.0050125313283208E-5,3,5.4142555398632684E-2,"N/A",1.024859081876242E-4,"N/A"]
[null,"MR2232","mungerie_park","Rural Short",952,22.73736721418549,9.218467647099871,3.864239993,4.3977769200000001,1.9935441,17,1.7968926570743116,1.5609231382834076E-2,1.3917596794759457,1.3488116316874044E-2,24,0.82577238113325435,"N/A",1.6479914721036096E-3,"N/A"]
[null,"MR2244","mungerie_park","Urban",134,0,5.8643100000000006,0,0,0.93709439999999999,0,0,0,0,0,1,7.9189111497169146E-2,"N/A",1.6497731561910238E-4,"N/A"]
[null,"MR2291","mungerie_park","Urban",200,0,4.8753280065030804,2.9691507760000002,0,5.50188E-2,0,0,0,0,0,2,4.6493607129019753E-3,"N/A",2.499656297259127E-5,"N/A"]
[null,"MR2292","mungerie_park","Urban",905,1.45394366099922,6.06813,5.1575276900000002,0.20978136,0,3,1.7774436090225564E-2,1.0902255639097744E-4,1.7774436090225564E-2,1.0902255639097744E-4,0,0,"N/A",0,"N/A"]
[null,"MR2298","mungerie_park","Urban",1168,0,14.106795437757802,6.6916397310000004,1.1805673800000001,4.437E-3,2,0.10002756892230577,1.837092731829574E-3,0.10002756892230577,1.837092731829574E-3,1,3.7494844458886903E-4,"N/A",2.499656297259127E-6,"N/A"]
[null,"MR2299","mungerie_park","Urban",1463,0,11.3653770561243,7.8961425040000002,3.114774E-2,0.6868476,2,2.6390977443609023E-3,3.258145363408521E-5,2.6390977443609023E-3,3.258145363408521E-5,2,5.8042019222356925E-2,"N/A",1.4373023709239981E-4,"N/A"]
[null,"MVB2","moss_vale","Rural Short",1156,131.46766116834002,0.91342999999999996,3.16767844,12.042232196331977,1.2046455,30,4.9203493042054509,2.0773169867167998E-2,0.53737205174867375,2.3271757680119296E-3,9,0.4989922133934534,"N/A",1.0353552371208548E-3,"N/A"]
[null,"MVC2","moss_vale","Rural Short",751,73.1391591424008,0.28112999999999999,1.7737932320000001,0.38533866000000011,0.43660080000000001,15,0.15744595991032093,1.281129327588395E-3,0.15066564337468802,1.244870950392497E-3,8,0.18085021656690908,"N/A",4.0433991508861782E-4,"N/A"]
[null,"MVD2","moss_vale","Rural Short",1535,26.315080708966498,4.1588706494712593,3.9707437969999999,9.8714111295779965,4.272831,26,4.0333710636919564,2.429251615664316E-2,2.2841340003787867,4.8338537281779207E-3,19,1.7699060828651771,"N/A",3.7677128451439391E-3,"N/A"]
[null,"MVE2","moss_vale","Rural Short",483,13.238360267503399,2.38331257948618,3.2008298919999998,0.10336731000000002,0.567936,9,4.2234966370355148E-2,3.220952507568937E-3,4.1110956677282311E-2,3.2088663818369708E-3,8,0.23525231423337767,"N/A",8.6994345367551098E-4,"N/A"]
[null,"MVF2","moss_vale","Rural Short",1057,83.811164176124109,5.94726,2.3522289199999999,2.442317070000001,0.71568810000000005,22,0.99790910024836998,2.2721916376096073E-3,0.99790910024836998,2.2721916376096073E-3,10,0.29645467410815479,"N/A",6.8615258318068472E-4,"N/A"]
[null,"MVG2","moss_vale","Urban",12,2.8943963696721,1.7300899999999999,3.966361708,5.5166700000000004E-3,1.41984E-2,1,4.6741854636591479E-4,2.5062656641604009E-6,4.6741854636591479E-4,2.5062656641604009E-6,1,1.1998350226843809E-3,"N/A",4.999312594518254E-6,"N/A"]
[null,"MVH2","moss_vale","Rural Short",1534,49.355778137738895,2.3958900000000001,3.3732555500000001,9.502722900000002,6.3364796999999999,29,3.882728322022734,2.9055046259646243E-2,3.4724164395482204,2.6565304358861251E-2,20,2.6247174215366149,"N/A",5.483094303095651E-3,"N/A"]
[null,"MYB2","mount_ousley","Urban",41,0,1.7234100000000001,3.0440273329999998,0,1.15362E-2,0,0,0,0,0,3,9.7486595593105946E-4,"N/A",3.7494844458886905E-6,"N/A"]
[null,"MYC2","mount_ousley","Urban",1174,3.7366909819493497,2.3480844485783399,2.9950622560000002,2.88405E-3,1.5831215999999999,1,2.4436090225563912E-4,1.2531328320802005E-6,2.4436090225563912E-4,1.2531328320802005E-6,2,0.13378160502930847,"N/A",2.7871167714439265E-4,"N/A"]
[null,"MYE2","mount_ousley","Rural Short",398,6.3190909161141295,1.26556,0.93814799900000001,0.16359219000000003,1.2623264999999999,3,6.6842318360637906E-2,4.8344502927863956E-4,4.2730497525365757E-2,3.6862683482496268E-4,5,0.5228850265577808,"N/A",1.1272506723682678E-3,"N/A"]
[null,"MYF2","mount_ousley","Urban",4,0,2.7845500000000003,2.078443649,0,5.7681E-3,0,0,0,0,0,1,4.8743297796552973E-4,"N/A",1.2498281486295635E-6,"N/A"]
[null,"MYG2","mount_ousley","Urban",1586,5.9731857788856599,3.3419899999999996,3.2326476660000001,0.61368146999999995,4.6224666000000001,5,5.1996240601503763E-2,2.0426065162907265E-3,5.1996240601503763E-2,2.0426065162907265E-3,3,0.39062128957268377,"N/A",8.3238554698728928E-4,"N/A"]
[null,"MYK2","mount_ousley","Urban",693,1.64865558229388,2.8256300000000003,2.8007261560000001,8.3903670000000014E-2,0.85146029999999995,3,7.1090225563909771E-3,9.0225563909774437E-5,7.1090225563909771E-3,9.0225563909774437E-5,3,7.195260651660397E-2,"N/A",1.637274874704728E-4,"N/A"]
[null,"MYM2","mount_ousley","Urban",1349,7.5675876213847797,0.86777043880913007,2.5562818250000001,1.9401669900000003,3.3938613000000002,4,0.16438721804511278,3.3972431077694239E-3,0.16438721804511278,3.3972431077694239E-3,7,0.28679806526602591,"N/A",6.2241441801752246E-4,"N/A"]
[null,"MYQ2","mount_ousley","Urban",1929,8.9192329404538313,2.1011377232270601,3.345438814,0.40869207000000002,8.2519326,2,3.4627819548872181E-2,3.2330827067669169E-4,3.4627819548872181E-2,3.2330827067669169E-4,7,0.69732911724637847,"N/A",1.3960580420192227E-3,"N/A"]
[null,"NA1207","nowra","Rural Short",2040,35.130915141766003,5.9640080078367204,4.6429180739999998,5.4774469200000002,1.0781909999999999,13,2.2380362462910703,2.3519600674405818E-2,2.2380362462910703,2.3519600674405818E-2,9,0.44661181530242788,"N/A",1.1272506723682678E-3,"N/A"]
[null,"NA1214","nowra","Urban",630,3.1689600000000002,0.86269000000000007,3.539393864,0.10400328,0,1,8.8120300751879706E-3,1.2781954887218044E-4,8.8120300751879706E-3,1.2781954887218044E-4,0,0,"N/A",0,"N/A"]
[null,"NA1218","nowra","Urban",697,3.9868999999999999,1.5368900000000001,3.4071691049999999,0.9297881400000001,0.9424188,3,7.8779448621553894E-2,9.7619047619047609E-4,7.8779448621553894E-2,9.7619047619047609E-4,4,7.9639049630675793E-2,"N/A",1.9622301933484143E-4,"N/A"]
[null,"NA1225","nowra","Rural Short",437,27.966976843436402,0.72727704620466205,2.3348910909999998,1.5854880000000002E-2,0.59988240000000004,2,6.47816339233377E-3,3.0215314329914973E-5,4.9553115501060558E-3,1.2086125731965989E-5,5,0.24848525690900514,"N/A",6.1876259733258186E-4,"N/A"]
[null,"NA1270","nowra","Rural Short",756,57.961899423172099,3.8047354437188803,1.4582828569999999,1.0661519400000001,0.14553360000000001,14,0.43562022975725029,2.5743447809087557E-3,0.43562022975725029,2.5743447809087557E-3,2,6.0283405522303019E-2,"N/A",1.6541178344534364E-4,"N/A"]
[null,"NA1281","nowra","Urban",2361,5.4444999999999997,8.1154899146029607,4.3034014750000003,6.3139101600000007,1.0502378999999999,8,0.53496741854636587,3.5664160401002506E-3,0.53496741854636587,3.5664160401002506E-3,3,8.8750296834185297E-2,"N/A",1.8122508155128669E-4,"N/A"]
[null,"NA1285","nowra","Urban",362,3.57437,0.98999000000000004,3.4267932409999999,1.057485E-2,0,1,8.9598997493734334E-4,4.5238095238095237E-4,8.9598997493734334E-4,4.5238095238095237E-4,0,0,"N/A",0,"N/A"]
[null,"NA1288","nowra","Urban",429,2.1009600000000002,1.4579500000000001,2.6105816179999999,0.22745541000000002,0.40465440000000003,1,1.9271929824561402E-2,5.3759398496240596E-4,1.9271929824561402E-2,5.3759398496240596E-4,1,3.4195298146504856E-2,"N/A",7.1240204471885118E-5,"N/A"]
[null,"NE1204","","Urban",0,0,0.26392000000000004,0,0,7.0992E-3,0,0,0,0,0,1,5.9991751134219043E-4,"N/A",2.499656297259127E-6,"N/A"]
[null,"NE1212","north_eastern_creek","Urban",27,0,6.9316000000000004,2.8401649529999999,0,3.19464E-2,0,0,0,0,0,1,2.6996288010398572E-3,"N/A",9.998625189036508E-6,"N/A"]
[null,"NE1216","north_eastern_creek","Urban",17,2.43959510184881,3.7069800000000002,1.489338528,5.0300789999999998E-2,7.45416E-2,4,4.2619047619047619E-3,6.3572392519760897E-5,2.175438596491228E-3,4.4775400038557893E-5,3,6.299133869093E-3,"N/A",1.4997937783554762E-5,"N/A"]
[null,"NE1219","north_eastern_creek","Urban",12,0,5.6413500000000001,1.2734730359999999,1.06488E-3,3.9933000000000003E-2,1,9.0225563909774437E-5,1.1181800655484863E-5,9.0225563909774437E-5,1.1181800655484863E-5,2,3.374536001299821E-3,"N/A",7.498968891777381E-6,"N/A"]
[null,"NE1241","north_eastern_creek","Urban",12,0.91810999999999998,3.0884099999999997,2.613820553,1.73043E-3,1.06488E-2,1,1.4661654135338345E-4,1.8170426065162908E-5,1.4661654135338345E-4,1.8170426065162908E-5,2,8.9987626701328559E-4,"N/A",2.499656297259127E-6,"N/A"]
[null,"NE1249","north_eastern_creek","Urban",2,0,0.29477999999999999,0.60968188400000001,2.6622000000000001E-4,0,1,2.2556390977443609E-5,2.7954501638712156E-6,2.2556390977443609E-5,2.7954501638712156E-6,0,0,"N/A",0,"N/A"]
[null,"NE1275","north_eastern_creek","Urban",2,0,2.4697900000000002,0.89547026799999996,2.6622000000000001E-4,6.6555E-3,1,2.2556390977443609E-5,2.7954501638712156E-6,2.2556390977443609E-5,2.7954501638712156E-6,1,5.6242266688330349E-4,"N/A",1.2498281486295635E-6,"N/A"]
[null,"NE1279","north_eastern_creek","Urban",6,0.31547000000000003,2.0400899999999997,0.44087621300000002,3.9933000000000004E-4,1.06488E-2,1,3.3834586466165414E-5,4.1931752458068292E-6,3.3834586466165414E-5,4.1931752458068292E-6,1,8.998762670132857E-4,"N/A",3.7494844458886905E-6,"N/A"]
[null,"NE1282","north_eastern_creek","Urban",17,9.4980000000000009E-2,2.0414699999999999,1.10009475,1.1979900000000001E-3,0.1393218,1,1.0150375939849624E-4,1.2579525737420425E-5,1.0150375939849624E-4,1.2579525737420425E-5,3,1.1773381160090489E-2,"N/A",2.1247078526702578E-5,"N/A"]
[null,"NG1210","north_warragamba","Rural Short",702,38.200768682375497,2.6461900000000003,3.1055670979999999,1.9736071799999999,0.212976,9,0.80639839496250276,3.607708530991848E-3,0.80639839496250276,3.607708530991848E-3,2,8.8219617837516612E-2,"N/A",1.8379087049482629E-4,"N/A"]
[null,"NG1247","north_warragamba","Urban",873,9.2522572364975808,0.11446393213128199,3.181777334,2.1035964900000002,0,4,0.178234335839599,2.2142857142857146E-3,0.178234335839599,2.2142857142857146E-3,0,0,"N/A",0,"N/A"]
[null,"NG1262","north_warragamba","Urban",360,10.0029172995661,0.71792999999999996,2.9605771249999999,1.4746665300000004,0.42373349999999999,5,0.12494611528822056,4.9874686716791983E-4,1.0986215538847117E-2,4.8872180451127811E-5,2,3.5807576458236991E-2,"N/A",6.3741235580107734E-5,"N/A"]
[null,"NG1299","north_warragamba","Rural Short",224,20.440221984119699,0.95669999999999999,1.3336791219999999,0.15186372000000001,2.92842E-2,5,6.2050169507913387E-2,2.296363889073538E-4,6.2050169507913387E-2,2.296363889073538E-4,1,1.2130197452658534E-2,"N/A",3.6758174098965255E-5,"N/A"]
[null,"NM1210","","Urban",337,2.1739306048876603,1.51719154349347,0,0,1.06488E-2,0,0,0,0,0,1,8.998762670132857E-4,"N/A",1.2498281486295635E-6,"N/A"]
[null,"NM1221","","Urban",751,5.1020775957584803,7.5689999999999993E-2,0,0.23360805000000001,0,4,1.9793233082706765E-2,9.5238095238095241E-5,1.9793233082706765E-2,9.5238095238095241E-5,0,0,"N/A",0,"N/A"]
[null,"NM1228","","Urban",567,7.9480000000000009E-2,2.8760599999999998,0,0,1.41984,0,0,0,0,0,2,0.11998350226843808,"N/A",2.4996562972591269E-4,"N/A"]
[null,"NM1239","","Urban",1190,4.6299899399675892,1.29905887916824,0,0.79670772000000001,0.77381279999999997,2,6.7503759398496233E-2,1.4912280701754386E-3,6.7503759398496233E-2,1.4912280701754386E-3,1,6.5391008736298759E-2,"N/A",1.3623126820062241E-4,"N/A"]
[null,"NM1243","","Urban",1271,4.1208557486776796,3.27813973790628,0,8.2897949999999998E-2,0.283968,1,7.0238095238095242E-3,5.3884711779448621E-5,7.0238095238095242E-3,5.3884711779448621E-5,1,2.3996700453687618E-2,"N/A",4.999312594518254E-5,"N/A"]
[null,"NM1258","","Urban",1883,6.0696897311516205,1.0771607415584699,0,6.3493469999999996E-2,0,1,5.3796992481203012E-3,5.3884711779448621E-5,5.3796992481203012E-3,5.3884711779448621E-5,0,0,"N/A",0,"N/A"]
[null,"NN1207","nepean_11kv","Urban",273,0.31056,3.39575,0.97168050299999997,5.85684E-2,0,1,4.9624060150375944E-3,1.5037593984962406E-5,4.9624060150375944E-3,1.5037593984962406E-5,0,0,"N/A",0,"N/A"]
[null,"NN1214","nepean_11kv","Rural Short",618,3.8335746713646297,6.5064621630184902,1.886203329,0,4.437E-2,0,0,0,0,0,1,1.8379087049482629E-2,"N/A",3.0631811749137715E-5,"N/A"]
[null,"NN1233","nepean_11kv","Rural Short",1268,36.817429970028599,14.133881141258501,5.6395574289999999,4.111338990000001,0.85500989999999999,18,1.6798566585488193,1.4322058992379698E-2,1.636630629868443,1.4074293414874393E-2,11,0.35416500744353019,"N/A",8.3931164192637352E-4,"N/A"]
[null,"NN1240","nepean_11kv","Urban",729,6.49505,5.3836000000000004,4.4582987789999997,0.93870651000000005,0.54397620000000002,5,7.953508771929825E-2,9.7243107769423565E-4,7.953508771929825E-2,9.7243107769423565E-4,4,4.5968679306595345E-2,"N/A",1.2623264301158592E-4,"N/A"]
[null,"NN1251","nepean_11kv","Rural Short",177,26.967312017406499,1.7765199999999999,2.3434647430000002,0.84850230000000004,0.1575135,8,0.34669051662144434,3.8494310456311685E-3,0.3394992718109246,3.7890004169713384E-3,7,6.5245759025663319E-2,"N/A",1.4090633404603351E-4,"N/A"]
[null,"NN1255","nepean_11kv","Urban",1179,2.7600599999999997,10.09253,3.1055670979999999,0.43186800000000003,4.0376700000000001E-2,4,3.6591478696741855E-2,7.0300751879699241E-4,3.6591478696741855E-2,7.0300751879699241E-4,1,3.4120308457587082E-3,"N/A",8.7487970404069445E-6,"N/A"]
[null,"NN1262","nepean_11kv","Urban",1617,5.5462640334664206,10.6959,6.0587137249999996,2.6746407491411053,0.44236890000000001,10,0.22661799437243421,2.2599212755815921E-3,0.18987343358395989,2.2218045112781955E-3,4,3.7382359925510242E-2,"N/A",7.3739860769144242E-5,"N/A"]
[null,"NN1277","nepean_11kv","Urban",1308,9.3928658016960309,5.9564457310918897,0.304840942,0.37270800000000004,0,5,3.1578947368421054E-2,1.9924812030075188E-4,2.9917293233082707E-2,1.7794486215538848E-4,0,0,"N/A",0,"N/A"]
[null,"NN1281","nepean_11kv","Urban",2,0.46544000000000002,2.0250300000000001,2.8578837999999999E-2,1.27194E-3,0,1,1.0776942355889724E-4,1.2531328320802005E-6,1.0776942355889724E-4,1.2531328320802005E-6,0,0,"N/A",0,"N/A"]
[null,"NN1285","nepean_11kv","Urban",361,3.0795103880691097,5.8621300000000005,1.4289419160000001,0.15607651085889576,1.3311E-2,4,1.3224110890723747E-2,2.5793010132693697E-5,5.2719298245614034E-3,1.7543859649122806E-5,1,1.124845333766607E-3,"N/A",3.7494844458886905E-6,"N/A"]
[null,"NWA2","north_wollongong","Urban",1686,2.3421718346447502,3.4400766614038099,3.1667258120000001,1.8361785000000002,3.5575866,2,0.1555764411027569,2.1290726817042608E-3,0.1555764411027569,2.1290726817042608E-3,8,0.30063366287135518,"N/A",7.6989413955581105E-4,"N/A"]
[null,"NWB2","north_wollongong","Urban",880,1.1304968377489399,0.96014999999999995,2.389190884,0.23737950000000002,1.5001496999999999,2,2.0112781954887218E-2,1.7042606516290727E-4,2.0112781954887218E-2,1.7042606516290727E-4,2,0.12677006911549663,"N/A",3.1745634975190911E-4,"N/A"]
[null,"NWD2","north_wollongong","Urban",1712,1.8593653946259101,1.40517,3.914538748,4.2683496300000003,1.3466294999999999,2,0.36165037593984961,4.2142857142857138E-3,0.36165037593984961,4.2142857142857138E-3,3,0.11379685293272174,"N/A",2.66213395658097E-4,"N/A"]
[null,"NWF2","north_wollongong","Urban",2264,5.1360058851596007,3.43322103065629,3.0484094210000001,1.1639434199999998,5.3244E-3,5,9.861904761904762E-2,8.3859649122807016E-3,9.861904761904762E-2,8.3859649122807016E-3,1,4.4993813350664285E-4,"N/A",1.2498281486295635E-6,"N/A"]
[null,"NWG2","north_wollongong","Urban",29,0,1.82951,1.7271144629999999,0,1.28673E-2,0,0,0,0,0,2,1.0873504893077202E-3,"N/A",1.1248453337666072E-5,"N/A"]
[null,"OA1207","the_oaks","Rural Short",865,35.972062352185901,1.1442099999999999,3.0103043039999999,5.1813511200000004,1.8537786000000001,25,2.1170541277140904,1.4600039884214919E-2,1.8594141854857715,1.3216178487904812E-2,9,0.76787825692738432,"N/A",1.5377169498067131E-3,"N/A"]
[null,"OA1233","the_oaks","Rural Short",628,58.683636779183395,0.27991000000000005,2.457780096,6.4890829200000004,1.0347084,18,2.651381746324307,1.288985309314173E-2,2.5304237999987915,1.2672302829966342E-2,6,0.42860030999393495,"N/A",1.0659870488699925E-3,"N/A"]
[null,"OA1244","the_oaks","Rural Short",364,23.937646272795199,0.60816999999999999,1.143153533,0.26107308000000001,1.3346496000000001,9,0.10667214571033184,9.4876086995933015E-4,0.10667214571033184,9.4876086995933015E-4,8,0.55284293844843757,"N/A",1.1517561217675781E-3,"N/A"]
[null,"P608","oakdale","Rural Short",154,26.611137051467701,0,0.45306985,0.42707604000000005,1.19799E-2,10,0.17449948331812495,1.1965264474646331E-3,8.0505683500625466E-2,2.6589476610325172E-4,1,4.9623535033603101E-3,"N/A",1.8379087049482627E-5,"N/A"]
[null,"PCA2","port_central","Urban",79,5.00965014983296,2.5849899999999999,1.7575985569999999,3.3149827002274021E-2,0.11181240000000001,3,2.8087313451202393E-3,2.0172558254841794E-4,1.4458581604112294E-3,1.0278574606145215E-4,3,9.4487008036394995E-3,"N/A",2.499656297259127E-5,"N/A"]
[null,"PCB2","port_central","Urban",1069,7.2995618614383302,1.59490989912161,2.5398966249999999,3.0965479668155527,2.2708566000000001,14,0.26236551205731973,5.4933449428166154E-3,0.23145087178745463,4.1069063653011899E-3,6,0.19189861394058319,"N/A",4.2369174238542198E-4,"N/A"]
[null,"PCC2","port_central","Urban",61,0.38727482072406699,3.6096999999999997,2.954099255,2.0880189584034321E-2,0,2,1.7691447672625038E-3,1.5285996490104826E-4,7.1679964995555016E-4,7.6463382297188592E-5,0,0,"N/A",0,"N/A"]
[null,"PCD2","port_central","Urban",555,3.8374206972362801,1.1012899999999999,1.690914601,0.22385512901591786,0.67087439999999998,3,1.8966883826869223E-2,1.3895226868614813E-3,9.4267715339061767E-3,6.9694383145272058E-4,3,5.6692204821836997E-2,"N/A",1.4872954968691806E-4,"N/A"]
[null,"PCE2","port_central","Urban",1004,4.3143300684410493,0.62970999999999999,2.8769363910000001,0.34888825266181045,0.1100376,4,2.9560738616471065E-2,2.5184309338715789E-3,1.2240173079156653E-2,1.2610183283916544E-3,2,9.2987214258039505E-3,"N/A",3.6245016310257333E-5,"N/A"]
[null,"PCF2","port_central","Urban",665,2.2876571742395999,1.4763553169746002,3.389640751,0.22797059447486667,7.5428999999999996E-2,2,1.9315580573718495E-2,1.6689301085917731E-3,7.8260420798425684E-3,8.3482971491684592E-4,1,6.3741235580107736E-3,"N/A",1.2498281486295635E-5,"N/A"]
[null,"PK1221","","Urban",1319,10.902020883840599,1.24664446355526,0,0.25231740000000002,1.2104136000000001,4,2.1378446115288219E-2,8.521303258145362E-5,2.1378446115288219E-2,8.521303258145362E-5,1,0.10228593568384348,"N/A",1.5497869043006585E-4,"N/A"]
[null,"PK1225","","Urban",1599,7.6081409710924897,0.7293099999999999,0,4.0253799846983762,3.4808265,7,0.34106394999486334,3.2365600776884207E-3,0.26339101766403633,3.0109961679139845E-3,5,0.29414705477996772,"N/A",6.899051380435191E-4,"N/A"]
[null,"PK1236","","Urban",867,8.2474930872534689,2.8697900000000001,0,7.2692849999999989E-2,0.10116360000000001,5,6.1591478696741853E-3,8.5213032581453647E-5,6.1591478696741853E-3,8.5213032581453647E-5,2,8.548824536626214E-3,"N/A",2.7496219269850394E-5,"N/A"]
[null,"PK1262","","Urban",999,7.4431493058877303,0.68861761970417401,0,1.8415172153016242,0.50404320000000002,3,0.15602878183471053,1.7458960626624564E-3,5.3725523689347118E-2,5.0529455890305772E-4,3,4.2594143305295519E-2,"N/A",1.0873504893077203E-4,"N/A"]
[null,"PK1288","","Urban",1937,10.826303292477199,3.4580367895149604,0,4.0658597399999996,0.41308470000000003,5,0.34449373433583957,2.6265664160401003E-3,0.34449373433583957,2.6265664160401003E-3,1,3.4907700191223703E-2,"N/A",6.124157928284861E-5,"N/A"]
[null,"PKA2","port_kembla","Urban",987,0,0,2.7666220749999999,0,0.2413728,0,0,0,0,0,1,2.0397195385634476E-2,"N/A",4.2494157053405156E-5,"N/A"]
[null,"PKC2","port_kembla","Urban",859,0,0,2.3585162639999999,0,1.8018657,0,0,0,0,0,7,0.15226656334753971,"N/A",3.4495256902175955E-4,"N/A"]
[null,"PKD2","port_kembla","Urban",1900,0,0,3.414790129,2.2399455000000001,0,5,0.18978696741854639,2.4536340852130325E-3,0.18978696741854639,2.4536340852130325E-3,0,0,"N/A",0,"N/A"]
[null,"PKE2","port_kembla","Urban",1586,0,0,2.6065805809999998,0,4.2417720000000001,0,0,0,0,0,5,0.3584507130269588,"N/A",8.6738073514891695E-4,"N/A"]
[null,"PKF2","port_kembla","Urban",1313,0,0,3.2920916490000001,0,0.48984480000000002,0,0,0,0,0,1,4.1394308282611141E-2,"N/A",1.1498418967391984E-4,"N/A"]
[null,"R208","wentworth_falls","Rural Short",1087,10.3457540083713,0.39632999999999996,1.718921862,4.962643558774487,7.7319161999999997,8,2.0276921573454896,2.5972864978830421E-2,1.6072837044882062,1.9477064795613699E-2,15,3.2027397092428433,"N/A",6.7635040342096074E-3,"N/A"]
[null,"R210","wentworth_falls","Rural Short",1164,16.773390598592101,1.6872150652647899,2.6980328629999999,5.1634823297562011,1.7277678000000001,5,2.109753098452269,2.7488839353548306E-2,1.6552574737416923,2.0466352668989721E-2,9,0.71568164970685366,"N/A",1.5438433121565409E-3,"N/A"]
[null,"R211","wentworth_falls","Rural Short",1324,17.749871030602002,0.7828980825321451,2.463495864,6.0402150138943567,14.9074326,10,2.4679782997307602,3.1940318771000606E-2,1.9496182036168872,2.3931051629904884E-2,19,6.1750056668851743,"N/A",1.2932750920485946E-2,"N/A"]
[null,"R246","blaxland","Urban",0,0,0,0,0,0.3407616,0,0,0,0,0,1,2.8796040544425142E-2,"N/A",5.9991751134219048E-5,"N/A"]
[null,"R247","blaxland","Urban",901,5.12049758795452,0.89669634200997905,3.145958523,1.1032452600000002,2.4731838000000002,4,9.3476190476190477E-2,2.5313283208020047E-4,9.3476190476190477E-2,2.5313283208020047E-4,6,0.20899626301383561,"N/A",4.1744260164227416E-4,"N/A"]
[null,"R248","blaxland","Urban",1009,9.2540954221994998,1.22340395277617,3.0947071390000001,3.4161202500000001,5.6536254000000001,12,0.28944235588972433,3.4147869674185458E-3,0.28944235588972433,3.4147869674185458E-3,7,0.47775930809513684,"N/A",1.2460786641836747E-3,"N/A"]
[null,"R250","blaxland","Urban",1215,8.9312568265887204,0.92229668908221196,3.8105117769999999,2.7454381200000006,0.99122580000000005,9,0.23261654135338347,2.6328320802005011E-3,0.22954887218045114,2.6102756892230571E-3,5,8.3763482521153343E-2,"N/A",1.7372611265950932E-4,"N/A"]
[null,"R251","blaxland","Urban",328,1.9752269971411098,1.44519,1.400553604,6.4750619999999995E-2,0.88030079999999999,3,5.4862155388471188E-3,8.020050125313283E-5,5.4862155388471188E-3,8.020050125313283E-5,1,7.4389771406431618E-2,"N/A",1.5497869043006585E-4,"N/A"]
[null,"R253","blaxland","Urban",1061,6.8870966288735698,0.71787999999999996,4.013993106,0.17517276000000001,1.215738,3,1.4842105263157894E-2,4.2606516290726817E-5,1.4842105263157894E-2,4.2606516290726817E-5,1,0.10273587381735011,"N/A",1.712264563622502E-4,"N/A"]
[null,"R254","blaxland","Urban",1102,9.8404672395822601,2.2488883782344402,3.2779927560000002,9.9700721100000003,0.5963328,9,0.84474812030075197,5.929824561403509E-3,0.68282330827067672,5.2769423558897246E-3,3,5.0393070952744E-2,"N/A",1.0498556448488333E-4,"N/A"]
[null,"R256","blaxland","Urban",1274,9.1557813358098894,1.10086979978681,4.572614132,6.0843397800000005,2.0583243000000002,8,0.51551629072681704,4.1177944862155385E-3,0.50342606516290733,4.0576441102756888E-3,6,0.17393858344477633,"N/A",4.0369449200734899E-4,"N/A"]
[null,"R257","blaxland","Urban",607,5.2127402077019198,1.8959292106755499,3.0173537499999998,1.25785992,1.6532262,5,0.10657644110275688,1.5588972431077694E-3,9.8790726817042596E-2,1.5350877192982456E-3,4,0.13970579045381259,"N/A",2.8996013048205872E-4,"N/A"]
[null,"R260","hartley_vale","Rural Short",300,74.237701321096495,0.31985000000000002,0.67103112399999998,6.72177399,1.8209447999999999,21,2.7464572543948167,1.182627402872872E-2,0.59455882619546885,7.1126849932619859E-3,9,0.75427773251076702,"N/A",1.5744751239056786E-3,"N/A"]
[null,"R290","BYLONG","Rural Short",45,36.149616033790103,0,0,1.2586437899999998,0,12,0.51427069295801886,1.4563781507019021E-3,0.51427069295801886,1.4563781507019021E-3,0,0,"N/A",0,"N/A"]
[null,"R293","BYLONG","Rural Short",98,85.112518082321898,0,0,0.34660364999999993,0.17659259999999999,16,0.1416191782643115,1.5047226536297658E-3,0.13570906278138015,1.4926365278977998E-3,5,7.3148766456940864E-2,"N/A",2.0829631989413645E-4,"N/A"]
[null,"RBA2","robertson","Rural Short",478,66.986921133437193,1.89175,1.121814667,2.5474073059292031,0.346086,29,1.0408480388772516,7.4600630642631966E-3,0.68796040585210205,4.8525794813843448E-3,7,0.1433568789859645,"N/A",4.0433991508861782E-4,"N/A"]
[null,"RBB2","robertson","Rural Short",348,62.504743518511901,1.0320199999999999,1.2426078899999999,7.4853669000000016,3.2252553000000002,27,3.0584545471026536,7.5175702052828457E-3,1.0379081333583113,5.4447996422506782E-3,12,1.3359758376268924,"N/A",2.9222748408677382E-3,"N/A"]
[null,"RBC2","robertson","Rural Short",477,36.803135092583098,0,1.042746548,3.4233821400000006,2.3329746,19,1.3987635893376196,4.3328760749098095E-3,0.28523256727439739,1.4624212135678854E-3,9,0.96637239706179656,"N/A",2.0339523001427443E-3,"N/A"]
[null,"RBD2","robertson","Rural Short",201,39.114282125505696,0,0.73714350299999998,7.371136444070796,0.76848839999999996,19,3.0117809956225936,4.9403019367339094E-3,1.2074341759377323,3.1786510675070566E-3,9,0.31832578769703918,"N/A",7.2291075727964991E-4,"N/A"]
[null,"RBE2","robertson","Rural Short",400,42.869713082362303,1.54488,0.89985235600000002,1.7723596499999998,0.32035140000000001,27,0.72417043854507235,1.6195408480834427E-3,0.43529994742535311,1.0756651901449731E-3,6,0.1326970084972646,"N/A",3.0631811749137717E-4,"N/A"]
[null,"RD1206","","Urban",210,0.177994025254266,5.554275619597,0,0,2.2628700000000002E-2,0,0,0,0,0,2,1.9122370674032321E-3,"N/A",3.7494844458886905E-6,"N/A"]
[null,"RD1228","","Urban",830,0.89724794632921201,3.03006926506561,0,5.8864199999999998E-3,0,1,4.9874686716791983E-4,1.2531328320802005E-6,4.9874686716791983E-4,1.2531328320802005E-6,0,0,"N/A",0,"N/A"]
[null,"RD1236","","Urban",76,0.14565999999999998,3.1670100000000003,0,0,1.15362E-2,0,0,0,0,0,1,9.7486595593105946E-4,"N/A",2.499656297259127E-6,"N/A"]
[null,"RD1259","","Urban",0,0,2.4848288730596102,0,0,5.3244E-3,0,0,0,0,0,1,4.4993813350664285E-4,"N/A",1.2498281486295635E-6,"N/A"]
[null,"RD1296","","Urban",132,1.82287982763028,3.7893280735634498,0,0.25070529000000003,0.13843440000000001,2,2.1241854636591478E-2,1.6541353383458648E-4,2.1241854636591478E-2,1.6541353383458648E-4,1,1.1698391471172714E-2,"N/A",3.2495531864368648E-5,"N/A"]
[null,"RS1203","rosehill","Urban",296,3.28035692897399,1.95412016459292,3.8246106700000002,1.8074847256079405,0.17748,7,0.15314526390417732,5.1935048539462805E-4,0.10807884786407707,4.554407109585378E-4,2,1.4997937783554762E-2,"N/A",2.8746047418479959E-5,"N/A"]
[null,"RS1207","rosehill","Urban",1315,2.49841472280503,2.7556082493916603,4.5143133019999997,0.90634599000000016,0,3,7.6793233082706761E-2,1.4536340852130324E-4,9.9486215538847119E-3,2.1303258145363408E-5,0,0,"N/A",0,"N/A"]
[null,"RS1229","rosehill","Urban",0,0,1.1187499999999999,3.8836736030000001,0,1.06488E-2,0,0,0,0,0,1,8.998762670132857E-4,"N/A",2.499656297259127E-6,"N/A"]
[null,"RS1236","rosehill","Urban",0,0,0,0,0,8.8739999999999999E-3,0,0,0,0,0,1,7.4989688917773806E-4,"N/A",2.499656297259127E-6,"N/A"]
[null,"RS1262","rosehill","Urban",1158,1.6359875618844901,3.8527028940334,3.3037137099999998,3.0274390500000004,0.32567580000000002,1,0.25651002506265663,2.9285714285714284E-3,0.25651002506265663,2.9285714285714284E-3,7,2.7521215832822986E-2,"N/A",5.9991751134219048E-5,"N/A"]
[null,"RS1270","rosehill","Urban",114,2.18468900486622,1.30267741124186,4.193277685,0.14149593000000002,9.9832500000000005E-2,1,1.1988721804511278E-2,1.3157894736842105E-4,1.1988721804511278E-2,1.3157894736842105E-4,4,8.4363400032495522E-3,"N/A",1.3748109634925199E-5,"N/A"]
[null,"RS1288","rosehill","Urban",45,0.69349129449773794,1.4253153185187901,2.8363544410000001,0,0.10116360000000001,0,0,0,0,0,1,8.548824536626214E-3,"N/A",2.3746734823961705E-5,"N/A"]
[null,"RS1292","rosehill","Urban",12,0.69097215337733198,0.67286200400499196,3.7074374329999999,0,7.0992E-3,0,0,0,0,0,1,5.9991751134219043E-4,"N/A",4.999312594518254E-6,"N/A"]
[null,"RS1296","rosehill","Urban",11,1.0195937336036001,1.2166635588644101,2.367470967,0,1.24236E-2,0,0,0,0,0,1,1.0498556448488333E-3,"N/A",2.499656297259127E-6,"N/A"]
[null,"RS1299","rosehill","Urban",13,2.9515978437115402,0.52902154660973799,1.7288291929999999,0,1.06488E-2,0,0,0,0,0,1,8.998762670132857E-4,"N/A",4.999312594518254E-6,"N/A"]
[null,"RV1206","russell_vale","Urban",923,5.8932795394774899,1.65165270882625,0,0.96225219000000006,1.0338210000000001,5,8.1530075187969925E-2,1.6127819548872181E-3,7.4888471177944865E-2,1.600250626566416E-3,4,8.7362987589206478E-2,"N/A",1.9372336303758234E-4,"N/A"]
[null,"RV1220","russell_vale","Urban",1889,5.2084257051602298,5.65524,0,2.1048240600000003,1.2259431000000001,5,0.17833834586466163,5.5263157894736847E-3,0.17833834586466163,5.5263157894736847E-3,2,0.10359825523990451,"N/A",2.4496631713139444E-4,"N/A"]
[null,"RV1224","russell_vale","Urban",0,0,0,0,0,0.85190399999999999,0,0,0,0,0,1,7.1990101361062847E-2,"N/A",1.5997800302458413E-4,"N/A"]
[null,"RV1228","russell_vale","Urban",1166,5.6341593935566801,0.80971000000000004,0,0.15551685000000001,0.4627791,3,1.3176691729323309E-2,1.5802005012531327E-3,1.3176691729323309E-2,1.5802005012531327E-3,3,3.9107122770619035E-2,"N/A",1.0748522078214245E-4,"N/A"]
[null,"RV1246","russell_vale","Urban",1600,7.1192169077976697,2.0735291326341199,0,0.87879222000000012,2.9040165,5,7.4458646616541363E-2,4.1666666666666657E-3,7.4458646616541363E-2,4.1666666666666657E-3,6,0.24540375698341477,"N/A",5.9616802689630181E-4,"N/A"]
[null,"RV1280","russell_vale","Urban",1097,4.8328869632688098,2.1515512295220702,3.199115162,1.6363508099999999,4.4551917000000003,10,0.13864536340852129,1.9448621553884713E-3,0.13846365914786968,1.943609022556391E-3,8,0.37648573321168344,"N/A",8.6363125070302823E-4,"N/A"]
[null,"RV1298","russell_vale","Urban",1720,6.2208538875948793,2.7913221944123401,0,6.6787794600000003,5.6549564999999999,8,0.56588220551378454,7.5864661654135336E-3,0.56484837092731832,7.5676691729323307E-3,9,0.47787179262851359,"N/A",1.1210958493207185E-3,"N/A"]
[null,"RW1218","ringwood","Rural Short",531,132.99176469832199,0.29214999999999997,1.2245079590000001,5.4891618211926607,1.628379,25,2.2428228510494224,1.0634035014245459E-2,0.42817567527485267,6.9658958545937791E-3,19,0.6745124947160126,"N/A",1.5683487615558509E-3,"N/A"]
[null,"RW1229","ringwood","Rural Short",143,29.022319370280599,1.2150300000000001,0.97168050299999997,2.2948928828440365,0.22318109999999999,11,0.93767288449786756,3.6632295560796173E-3,0.32034984048624071,2.7688562519141342E-3,3,9.2446807858897612E-2,"N/A",2.0216995754430891E-4,"N/A"]
[null,"RW1255","ringwood","Rural Short",219,58.011899619203597,0.76812911609352297,1.1717323710000001,3.47064906529052,0.76050180000000001,13,1.4180764359239844,3.7665612083408722E-3,1.145389267159368,3.5913123852273649E-3,9,0.3150175520281322,"N/A",7.2903711962947753E-4,"N/A"]
[null,"RW1281","ringwood","Rural Short",546,139.426578581478,0.25359999999999999,1.2911919160000001,4.209665141314983,0.22539960000000001,29,1.7200318521773927,1.4616577712391133E-2,1.2029934364267536,1.0767146666759963E-2,3,9.3365762211371744E-2,"N/A",2.1442268224396399E-4,"N/A"]
[null,"RW1292","ringwood","Rural Short",1555,47.228672794106195,3.34077,2.1211213799999999,3.8966136993577973,2.0317023000000001,23,1.5921218086321662,2.1701119239923856E-2,1.1290177289604253,1.9447056790912201E-2,11,0.84157839599580964,"N/A",2.0707104742417092E-3,"N/A"]
[null,"S326","west_castle_hill","Urban",250,0,2.6260400000000002,2.3815698999999999E-2,0,0,1,0,0,0,0,0,0,"N/A",0,"N/A"]
[null,"S327","west_castle_hill","Urban",668,0.15988999999999998,6.5551854257468802,3.6201767130000002,0.13199823807114228,0,2,1.1183997694637394E-2,8.5173310279707264E-4,1.1183997694637394E-2,8.5173310279707264E-4,0,0,"N/A",0,"N/A"]
[null,"S328","west_castle_hill","Urban",321,0.67160187745077904,1.3108637569560899,2.9706749810000002,4.7453303755010057E-2,0.50404320000000002,1,4.0206418476049872E-3,4.0206418476049878E-4,4.0206418476049872E-3,4.0206418476049878E-4,1,4.2594143305295519E-2,"N/A",8.8737798552699011E-5,"N/A"]
[null,"S330","west_castle_hill","Urban",218,0,2.3977399999999998,2.0885415049999998,3.3261661510520998E-2,0,1,2.8182069025268546E-3,2.8182069025268548E-4,2.8182069025268546E-3,2.8182069025268548E-4,0,0,"N/A",0,"N/A"]
[null,"S332","west_castle_hill","Urban",30,0,0.73417999999999994,1.9687009090000001,4.4348882014028099E-3,0.102051,1,3.757609203369148E-4,3.757609203369148E-5,3.757609203369148E-4,3.757609203369148E-5,1,8.6238142255439885E-3,"N/A",2.8746047418479959E-5,"N/A"]
[null,"S336","west_castle_hill","Urban",230,0.29555026761778802,2.1495900092937998,3.8867220119999999,3.3852979937374739E-2,0,1,2.8683083585717794E-3,2.8683083585717792E-4,2.8683083585717794E-3,2.8683083585717792E-4,0,0,"N/A",0,"N/A"]
[null,"S590","rydalmere","Urban",358,0,0,3.111663917,0.96096546000000016,0.16638749999999999,5,8.142105263157895E-2,2.293233082706767E-4,1.1590225563909774E-2,5.5137844611528819E-5,1,1.4060566672082589E-2,"N/A",3.1245703715739086E-5,"N/A"]
[null,"S591","rydalmere","Urban",812,0,0,5.6835688400000004,0.34933980000000003,1.50858E-2,3,2.9598997493734337E-2,2.3433583959899749E-4,2.9598997493734337E-2,2.3433583959899749E-4,2,1.2748247116021547E-3,"N/A",3.7494844458886905E-6,"N/A"]
[null,"S594","rydalmere","Urban",1322,0,0,3.5081476669999998,6.5165481539999934,4.437E-2,3,0.55213660876328685,3.2951387088410652E-3,0.55213660876328685,3.2951387088410652E-3,2,3.7494844458886901E-3,"N/A",1.2498281486295635E-5,"N/A"]
[null,"S595","rydalmere","Urban",83,0,0,2.6075332090000001,9.8087279999999999E-2,0,2,8.3107769423558901E-3,3.6340852130325809E-5,8.3107769423558901E-3,3.6340852130325809E-5,0,0,"N/A",0,"N/A"]
[null,"S596","rydalmere","Urban",200,0,0,4.9542368860000003,0.14771294374100716,0,2,1.2515479345846629E-2,2.0711751400884337E-4,1.2515479345846629E-2,2.0711751400884337E-4,0,0,"N/A",0,"N/A"]
[null,"S598","rydalmere","Urban",1038,0,0,3.429460599,1.5131596862589931,4.592295,4,0.12820757829826365,2.7953887516553172E-3,0.12820757829826365,2.7953887516553172E-3,2,0.38807164014947942,"N/A",7.186511854619989E-4,"N/A"]
[null,"S599","rydalmere","Urban",694,0,0,3.5590179989999999,3.8306100000000003E-2,0,1,3.2456140350877192E-3,8.7719298245614029E-5,3.2456140350877192E-3,8.7719298245614029E-5,0,0,"N/A",0,"N/A"]
[null,"S602","rydalmere","Urban",130,0,0,3.6377050679999998,0,9.7613999999999999E-3,0,0,0,0,0,1,8.2488657809551183E-4,"N/A",1.2498281486295635E-6,"N/A"]
[null,"S603","rydalmere","Urban",446,0,0,5.3474817019999996,1.6384803659999994,0,4,0.13882579725174998,1.026916429003544E-3,0.13882579725174998,1.026916429003544E-3,0,0,"N/A",0,"N/A"]
[null,"S606","rydalmere","Urban",76,0,0,1.9546020159999999,0.15516189,0,2,1.3146616541353384E-2,5.6390977443609023E-5,1.3146616541353384E-2,5.6390977443609023E-5,0,0,"N/A",0,"N/A"]
[null,"S674","rydalmere","Urban",2229,0,0,4.6899778950000002,7.4443908343675407,7.8674665499999996,7,0.63075122172974185,2.7857142857142859E-3,6.3731829573934834E-2,2.6065162907268173E-4,17,0.66483983452275308,"N/A",1.4660484183424778E-3,"N/A"]
[null,"S675","rydalmere","Urban",74,0,0,5.0816985050000003,0.13532850000000002,0,1,1.1466165413533834E-2,6.2656641604010024E-5,1.1466165413533834E-2,6.2656641604010024E-5,0,0,"N/A",0,"N/A"]
[null,"S735","kenthurst","Rural Short",537,17.356210835336501,0.88530094161325501,2.6239184089999998,4.4796543600000005,0.13843440000000001,15,1.8303470531003934,1.3584805322729772E-2,0.70753388647502102,1.0339680563696904E-2,1,5.7342751594385802E-2,"N/A",1.4703269639586102E-4,"N/A"]
[null,"S737","kenthurst","Rural Short",474,14.9616201654647,0.31301000000000001,3.5214844580000002,3.5836909499999998,0.3123648,11,1.4642643477420094,5.1124311846216138E-3,0.43326343523951683,2.797938106950127E-3,3,0.1293887728283577,"N/A",2.8793903044189452E-4,"N/A"]
[null,"S738","kenthurst","Rural Short",485,18.225705821504299,0.40222000000000002,4.8892676609999999,5.48535957,0.35540369999999999,16,2.2412692849243707,1.2575613824110612E-2,0.45423286338447777,6.0309767402510301E-3,4,0.14721648726635586,"N/A",3.4920265394016998E-4,"N/A"]
[null,"S740","kenthurst","Rural Short",837,8.7497227534130904,2.7471474865168699,2.079777328,5.3283341399999999,0.6016572,9,2.1771100864762301,2.6619691924655093E-2,1.3301264813057854,2.1567691368693308E-2,2,0.24922042039098444,"N/A",5.4524624913465127E-4,"N/A"]
[null,"S741","kenthurst","Rural Short",695,25.974303287036399,2.1025694025970001,3.404882798,21.137631360000004,0.64558349999999998,18,8.6366487590570422,2.797938106950127E-2,4.4490720876969281,1.959160981151687E-2,5,0.26741571656997226,"N/A",4.9623535033603084E-4,"N/A"]
[null,"S743","kenthurst","Rural Short",280,13.9709780654987,0.61698501898325198,4.0130404779999997,6.9685599300000005,0.74896560000000001,15,2.8472918013766098,1.2370149686667187E-2,0.96733724520936204,8.6597090869536299E-3,6,0.31023898939526678,"N/A",1.1640088464672331E-3,"N/A"]
[null,"S744","kenthurst","Urban",510,6.6186225217066808,2.8139890762080602,4.6059561100000002,0.18366222000000001,2.3147829,3,1.5561403508771931E-2,8.7218045112781952E-4,1.5561403508771931E-2,8.7218045112781952E-4,7,0.19561060354201296,"N/A",2.5371511417180136E-4,"N/A"]
[null,"S764","glenmore_park","Rural Short",260,9.8427663367188707,2.2512304858665799,3.1834920640000002,0.64969512000000007,0.106488,3,0.26545966557690098,1.6739284138772895E-3,0.26545966557690098,1.6739284138772895E-3,2,4.4109808918758313E-2,"N/A",9.189543524741313E-5,"N/A"]
[null,"S765","glenmore_park","Urban",1238,7.1462100671211504,12.154414791985101,3.3260052039999999,1.25164812,0.86388390000000004,5,0.1060501253132832,1.6791979949874686E-3,8.9508771929824565E-2,1.5852130325814536E-3,7,7.3002462161452786E-2,"N/A",1.4123058079514069E-4,"N/A"]
[null,"S766","glenmore_park","Urban",995,0,5.5532506433774298,4.7391334970000001,1.56774E-3,0.26089560000000001,1,1.3283208020050126E-4,1.2531328320802005E-6,1.3283208020050126E-4,1.2531328320802005E-6,2,2.2046968541825498E-2,"N/A",5.2492782242441664E-5,"N/A"]
[null,"S768","glenmore_park","Urban",359,0,6.1028400000000005,4.1915629540000001,1.3311E-2,0,1,1.1278195488721805E-3,1.8796992481203007E-5,1.1278195488721805E-3,1.8796992481203007E-5,0,0,"N/A",0,"N/A"]
[null,"S769","glenmore_park","Urban",921,0,5.8073883412730698,4.0711507820000001,0.11224131,0,2,9.5100250626566404E-3,5.5137844611528826E-5,9.5100250626566404E-3,5.5137844611528826E-5,0,0,"N/A",0,"N/A"]
[null,"S771","glenmore_park","Urban",580,0,4.0291046820179197,3.1217617729999998,4.437E-2,4.437E-3,1,3.7593984962406013E-3,1.8796992481203007E-5,3.7593984962406013E-3,1.8796992481203007E-5,1,3.7494844458886903E-4,"N/A",1.2498281486295635E-6,"N/A"]
[null,"S772","glenmore_park","Urban",1770,0,17.052004182009,2.0197617669999999,0,0.44813700000000001,0,0,0,0,0,4,3.7869792903475766E-2,"N/A",8.7487970404069435E-5,"N/A"]
[null,"S776","glenmore_park","Urban",1019,0.8346571193583,7.9605302396259701,4.7926711869999998,5.5773090000000004E-2,0,3,4.7255639097744358E-3,3.1328320802005012E-5,4.7255639097744358E-3,3.1328320802005012E-5,0,0,"N/A",0,"N/A"]
[null,"S785","cranebrook","Urban",1189,5.5253642290543903,2.9702364685664504,4.1633651670000003,9.7403112894109078E-2,10.211311800000001,2,8.2528085675741981E-3,1.496786101793296E-3,5.9470441565466292E-3,1.4867610391366543E-3,7,0.86290635037682328,"N/A",1.7972528777293122E-3,"N/A"]
[null,"S786","cranebrook","Rural Short",579,33.344259973601297,2.32019776411975,2.871601675,2.8385537641640668,1.0919456999999999,9,1.1598079002918269,1.0909014939042514E-2,1.1308132846608405,1.0733766115929006E-2,6,0.45230933228776754,"N/A",9.3733343952361395E-4,"N/A"]
[null,"S788","cranebrook","Rural Short",745,14.465048156979298,8.3449417674893187,3.5698779580000002,0.73030196355845123,0.28174949999999999,4,0.29839490716257894,9.1387590606004324E-3,0.29839490716257894,9.1387590606004324E-3,3,0.1167072027642147,"N/A",2.2667540694361907E-4,"N/A"]
[null,"S790","cranebrook","Urban",6,3.7783955531180902,2.0583400000000003,3.880244142,3.5509028445586345E-4,1.59732E-2,1,3.0086226761618671E-5,7.5215566904046737E-6,3.0086226761618671E-5,7.5215566904046737E-6,3,6.6164713378137462E-3,"N/A",3.0631811749137715E-5,"N/A"]
[null,"SC1204","schofields","Urban",46,13.5315852460632,7.02705,2.457780096,0.37037117999999997,3.2052887999999999,7,3.1380952380952384E-2,2.9448621553884713E-4,3.1380952380952384E-2,2.9448621553884713E-4,13,0.27086275637099899,"N/A",5.774206046668584E-4,"N/A"]
[null,"SC1208","schofields","Urban",281,5.7661542560230998,9.3808074529881189,0,0.24413787094364417,1.0382579999999999,1,2.0685407818366416E-2,6.1173576142190358E-5,2.0685407818366416E-2,6.1173576142190358E-5,6,8.7737936033795344E-2,"N/A",2.3246803564509882E-4,"N/A"]
[null,"SC1238","schofields","Urban",689,10.587984666348701,1.6683599999999998,3.4304132269999998,2.7833301000000001,6.4695897000000002,8,0.23582706766917291,1.4010025062656641E-3,2.300751879699248E-2,1.5288220551378445E-4,16,0.54671232705502992,"N/A",1.4223044331404433E-3,"N/A"]
[null,"SC1241","schofields","Urban",1515,4.3680704026395301,13.432516276036299,3.5574937950000001,2.49014793,0.1135872,7,0.21098621553884711,1.8634085213032584E-3,0.21098621553884711,1.8634085213032584E-3,1,9.5986801814750469E-3,"N/A",1.9997250378073016E-5,"N/A"]
[null,"SC1271","schofields","Urban",1046,6.6864677199472196,1.7355699999999998,3.2724675140000001,0.32319108000000002,1.8728577,3,2.7383458646616541E-2,1.3571428571428571E-3,8.1165413533834593E-3,1.305764411027569E-3,9,0.15826573846096162,"N/A",3.3995325642724125E-4,"N/A"]
[null,"SC1282","schofields","Urban",0,0,0,0,0,0.1561824,0,0,0,0,0,1,1.3198185249528189E-2,"N/A",2.7496219269850397E-5,"N/A"]
[null,"SC1289","schofields","Urban",1461,4.14659045216648,10.4649730761185,4.2727268550000002,0.33925302000000007,1.6731927,4,2.8744360902255642E-2,8.7719298245614029E-5,2.647869674185464E-2,6.7669172932330814E-5,8,0.14139305845446248,"N/A",2.7746184899576307E-4,"N/A"]
[null,"SG1209","south_granville","Urban",1525,4.4201388790516205,1.6072500000000001,3.2926632260000002,0.17455157999999998,0.86743349999999997,3,1.4789473684210526E-2,1.8546365914786966E-4,1.4789473684210526E-2,1.8546365914786966E-4,1,7.3302420917123898E-2,"N/A",1.4373023709239978E-4,"N/A"]
[null,"SG1220","south_granville","Urban",1475,4.9675404652238804,1.3894300000000002,2.6673582439999999,0.10852902,2.4345819,2,9.1954887218045102E-3,6.0150375939849629E-5,6.1654135338345864E-4,7.5187969924812028E-6,4,0.20573421154591243,"N/A",4.8993263426278888E-4,"N/A"]
[null,"SG1221","south_granville","Urban",104,0.47169924364814603,1.1050199999999999,0.72971300500000003,0,0.2342736,0,0,0,0,0,1,1.9797277874292286E-2,"N/A",5.4992438539700794E-5,"N/A"]
[null,"SG1228","south_granville","Urban",92,0.40312999999999999,2.4214992045521897,0,6.486894E-2,6.2118E-3,1,5.4962406015037595E-3,1.0776942355889724E-4,5.4962406015037595E-3,1.0776942355889724E-4,1,5.2492782242441667E-4,"N/A",1.2498281486295635E-6,"N/A"]
[null,"SG1250","south_granville","Urban",1314,6.1712381812212493,1.4314987638370802,3.429460599,1.4642100000000001E-3,0,1,1.2406015037593984E-4,1.2531328320802005E-6,1.2406015037593984E-4,1.2531328320802005E-6,0,0,"N/A",0,"N/A"]
[null,"SG1257","south_granville","Urban",212,0.26041000000000003,1.5753900000000001,2.5176051309999998,0,7.0992E-3,0,0,0,0,0,1,5.9991751134219043E-4,"N/A",1.2498281486295635E-6,"N/A"]
[null,"SHA2","shellharbour","Urban",1605,0,9.3595824751418206,4.0751518200000003,1.9697057587976337,1.1571696,1,0.1668899902560351,2.0102710696894986E-3,0,0,7,9.7786554348777047E-2,"N/A",3.9369586681831244E-4,"N/A"]
[null,"SHB2","shellharbour","Urban",977,5.2729281348234096,4.6475337396713901,3.019259006,1.395003579796833,0.58568399999999998,1,0.11819640207659385,1.4237331266628822E-3,0,0,2,4.9493194685730713E-2,"N/A",1.0998487707940159E-4,"N/A"]
[null,"SHC2","shellharbour","Urban",1314,1.8238507865006399,8.3208622988373495,2.676884523,1.6000789299958431,0.36738359999999998,1,0.1355721055508822,1.6330319225719549E-3,0,0,3,3.1045731211958354E-2,"N/A",9.8736423741735505E-5,"N/A"]
[null,"SHD2","shellharbour","Urban",1184,5.1996490882765203,2.9898000000000002,2.9986822430000002,3.067152279136661,0.80930880000000005,11,0.259874862878686,4.3122118197851883E-3,0.12916165413533834,2.7581453634085212E-3,1,6.8390596293009712E-2,"N/A",1.8997387859169364E-4,"N/A"]
[null,"SHE2","shellharbour","Urban",1558,7.8041067128258499,2.8134099999999997,2.9022762950000001,6.0065359314648479,2.3675831999999999,3,0.50892409619932588,5.3319074964347868E-3,0.34744450462989473,3.3868073093037969E-3,5,0.20007249003262048,"N/A",5.8241991726137659E-4,"N/A"]
[null,"SHF2","shellharbour","Urban",210,0,3.20135984691185,2.8982752569999999,0.27507112841064374,0.64292130000000003,1,2.3306332803835463E-2,2.8073610948282208E-4,0,0,5,5.4330029620927117E-2,"N/A",1.3123195560610417E-4,"N/A"]
[null,"SHG2","shellharbour","Urban",576,0,4.9156899999999997,0.82688105599999995,1.610258928513117,0.67974840000000003,2,0.13643464039689462,1.1809446839513196E-3,8.0249730959077073E-2,5.0417013430522934E-4,5,5.7442101711014742E-2,"N/A",2.0372198822661883E-4,"N/A"]
[null,"SHH2","shellharbour","Urban",363,5.5958063775642906,6.3388,2.3425121149999999,0.46638867203265361,0.80664659999999999,4,3.9516359529033332E-2,8.7599337609193227E-4,3.2042606516290728E-3,4.3859649122807013E-4,5,6.8165627226256381E-2,"N/A",2.4121683268550577E-4,"N/A"]
[null,"SHJ2","shellharbour","Rural Short",1455,16.557971750392898,11.935310234129901,2.4434906770000002,2.0059609691435156,0.81862650000000003,9,0.81961786634499245,9.8150006129294372E-3,8.3666205379534564E-2,1.0514929386810411E-3,8,0.33909415606295445,"N/A",1.2681570064143014E-3,"N/A"]
[null,"SHK2","shellharbour","Urban",1250,7.8000665281874397,3.8809200000000001,3.388116546,1.6007881762585427,3.7452717,8,0.13563219884214789,1.6392866973936218E-3,7.1867167919799496E-3,9.3984962406015016E-5,10,0.31649398207746432,"N/A",9.1737386109409943E-4,"N/A"]
[null,"SHL2","shellharbour","Urban",0,0,3.0778000000000003,1.2769024959999999,0,0,1,0,0,0,0,0,0,"N/A",0,"N/A"]
[null,"SL1112","","Rural Short",483,19.482337983531401,2.5831751350802001,0,0.18351432000000001,0,4,7.4982324041117016E-2,3.1242635017132083E-3,6.7325763389916554E-2,3.081962061651327E-3,0,0,"N/A",0,"N/A"]
[null,"SL1122","","Urban",44,7.0321897366235602,1.3684700000000001,0,0,6.2118E-2,0,0,0,0,0,1,5.2492782242441662E-3,"N/A",8.7487970404069445E-6,"N/A"]
[null,"SL1132","","Urban",352,4.1390000000000002,10.501809999999999,0,0,0.76405140000000005,0,0,0,0,0,3,6.4566122158203246E-2,"N/A",1.0373573633625377E-4,"N/A"]
[null,"SL1142","","Rural Short",177,6.3004653884188802,1.42805,0,4.6529340000000002E-2,0,3,1.90114757763825E-2,1.2871723904543781E-3,1.90114757763825E-2,1.2871723904543781E-3,0,0,"N/A",0,"N/A"]
[null,"SN1208","south_nowra","Urban",343,9.6088142754378207,2.1051301253116397,4.0259962180000004,0.27995382907601618,4.79196E-2,3,2.3720036151570281E-2,8.8633386525882704E-4,2.3720036151570281E-2,8.8633386525882704E-4,2,4.049443201559786E-3,"N/A",2.2496906675332143E-5,"N/A"]
[null,"SN1219","south_nowra","Urban",66,8.6462146958281192,0.49892000000000003,3.582071596,0.19420961056747169,1.7131257,7,1.6455066890304841E-2,2.3630537497698197E-4,1.6455066890304841E-2,2.3630537497698197E-4,14,0.14476759445576234,"N/A",3.1870617790053868E-4,"N/A"]
[null,"SN1230","south_nowra","Rural Short",378,46.872007829023296,0.11145999999999999,1.006927737,1.6874020385083355,0.93709439999999999,13,0.68945751175752079,1.4161130983758556E-2,0.68945751175752079,1.4161130983758556E-2,6,0.3881663184850731,"N/A",9.557125265730966E-4,"N/A"]
[null,"SN1252","south_nowra","Urban",67,5.6686540786451696,3.6790400000000001,1.4380871449999999,4.1648934393081882E-3,0,2,3.528846998588584E-4,1.7644234992942882E-4,3.528846998588584E-4,1.7644234992942882E-4,0,0,"N/A",0,"N/A"]
[null,"SN1271","south_nowra","Urban",780,10.022129999999999,3.2267299999999999,1.921260038,3.2469177463909946,0.5963328,4,0.27510610081584919,2.851296021959659E-3,0.27510610081584919,2.851296021959659E-3,3,5.0393070952744E-2,"N/A",1.0498556448488333E-4,"N/A"]
[null,"SN1282","south_nowra","Rural Short",43,7.3294635057092199,5.6282299999999994,1.5546888050000001,6.8457021170199736E-2,0.17126820000000001,4,2.7970931882991601E-2,7.8137357932295693E-4,2.7970931882991601E-2,7.8137357932295693E-4,4,7.0943276011002948E-2,"N/A",2.0829631989413645E-4,"N/A"]
[null,"SWC2","south_wollongong","Urban",1777,7.1471139211881098,1.19278,2.8180639840000001,0.43101018000000002,1.3071402000000001,3,3.6518796992481201E-2,1.5914786967418548E-4,3.6518796992481201E-2,1.5914786967418548E-4,2,0.11045981177588082,"N/A",2.3996700453687619E-4,"N/A"]
[null,"SWD2","south_wollongong","Urban",264,2.28691777277511,2.4412353556357296,2.5435166109999998,0,0.23382990000000001,0,0,0,0,0,3,1.9759783029833399E-2,"N/A",4.4993813350664286E-5,"N/A"]
[null,"SWE2","south_wollongong","Urban",1374,2.2215100495123004,2.4381624935518897,3.389640751,0.34772768999999998,3.5496E-3,4,2.9462406015037593E-2,1.4035087719298247E-4,2.9462406015037593E-2,1.4035087719298247E-4,2,2.9995875567109521E-4,"N/A",2.499656297259127E-6,"N/A"]
[null,"SWH2","south_wollongong","Urban",937,3.9621154614140601,1.1364700000000001,2.991251745,1.2120257100000003,2.8840500000000002E-2,3,0.10269298245614035,1.2180451127819548E-3,8.535213032581454E-2,1.1716791979949875E-3,1,2.4371648898276485E-3,"N/A",6.2491407431478175E-6,"N/A"]
[null,"SWJ2","south_wollongong","Urban",896,2.3697161504983599,2.40713,3.087086116,0.71963703000000001,0.45922950000000001,2,6.0973684210526319E-2,2.0551378446115288E-4,6.0973684210526319E-2,2.0551378446115288E-4,2,3.8807164014947944E-2,"N/A",8.6238142255439887E-5,"N/A"]
[null,"SXA2","sussex_inlet","Urban",1297,6.7282573463914899,1.47376820514178,2.1375065809999998,0.5418981646703025,2.888487,6,4.5914156983932322E-2,3.4370283666528695E-3,4.5914156983932322E-2,3.4370283666528695E-3,3,0.24409143742735376,"N/A",8.361350314331779E-4,"N/A"]
[null,"SXB2","sussex_inlet","Rural Short",981,10.420256082636701,0.34761999999999998,1.582315015,0.27340080530986616,0.4738716,8,0.11170914496943195,8.3651629523885801E-3,0.11170914496943195,8.3651629523885801E-3,1,0.19628864968847448,"N/A",5.4524624913465127E-4,"N/A"]
[null,"SXC2","sussex_inlet","Rural Short",435,43.285888891224594,0.60170000000000001,0.76858022500000001,0.18588222319781855,1.5804594000000001,12,7.5949828292974988E-2,3.423702210229721E-3,7.5949828292974988E-2,3.423702210229721E-3,7,0.65466308070257118,"N/A",1.4335687898596452E-3,"N/A"]
[null,"SXD2","sussex_inlet","Rural Short",773,16.249894169366602,0.19981700322131998,1.3319643919999999,0.87327108440257817,2.2934852999999999,4,0.35681082231845312,1.2462904859333511E-2,0.11992880103478569,1.0136325655930058E-2,6,0.95001500958775698,"N/A",2.7139785209736012E-3,"N/A"]
[null,"SY1212","","Urban",718,0,0,0,0,6.2118E-3,0,0,0,0,0,1,5.2492782242441667E-4,"N/A",1.2498281486295635E-6,"N/A"]
[null,"SY1232","","Urban",1120,3.4434145198217703,4.2974542863476399,0,0.13381992000000001,0,1,1.1338345864661654E-2,3.0075187969924811E-5,1.1338345864661654E-2,3.0075187969924811E-5,0,0,"N/A",0,"N/A"]
[null,"SY1242","","Urban",640,1.2845355492341,3.8586889407007301,0,0.29732336999999998,0,2,2.5191729323308272E-2,3.5087719298245611E-5,2.5191729323308272E-2,3.5087719298245611E-5,0,0,"N/A",0,"N/A"]
[null,"SY1252","","Urban",0,1.3678800000000002,1.89228,0,0,0.94508099999999995,0,0,0,0,0,1,7.9864018697429109E-2,"N/A",1.7747559710539802E-4,"N/A"]
[null,"SY1352","","Urban",1291,7.18544882262524,0.60415681527952203,0,0,0.2697696,0,0,0,0,0,1,2.2796865431003236E-2,"N/A",4.749346964792341E-5,"N/A"]
[null,"SZ1112","south_windsor","Urban",998,1.2374799999999999,7.0016600000000002,4.3477939369999996,0.87710616000000008,0.13577220000000001,2,7.431578947368421E-2,1.3634085213032581E-3,7.431578947368421E-2,1.3634085213032581E-3,1,1.1473422404419393E-2,"N/A",4.2494157053405156E-5,"N/A"]
[null,"SZ1122","south_windsor","Rural Short",815,18.838373143763299,3.7118592832341801,5.3297628220000002,5.7702741299999998,0.77425650000000001,6,2.3576828479746679,1.5210389233679197E-2,2.3561781253210379,1.5204346170813215E-2,4,0.32071506901347191,"N/A",7.3516348197930504E-4,"N/A"]
[null,"SZ1132","south_windsor","Urban",223,6.4542356417243303,1.50854,5.1152310090000004,1.58440833,0.208539,5,0.13424436090225564,1.4085213032581454E-3,0.13424436090225564,1.4085213032581454E-3,2,1.7622576895676846E-2,"N/A",3.2495531864368648E-5,"N/A"]
[null,"SZ1142","south_windsor","Urban",222,0.90737999999999996,1.2922400000000001,2.2615387390000001,0,0.45257399999999998,0,0,0,0,0,1,3.8244741348064638E-2,"N/A",7.4989688917773804E-5,"N/A"]
[null,"SZ1152","south_windsor","Urban",1052,6.36259,0.74098455707659194,4.3154045869999997,0.32965431000000001,11.943516600000001,2,2.7931077694235588E-2,2.4373433583959898E-3,2.7931077694235588E-2,2.4373433583959898E-3,12,1.0092862231443178,"N/A",2.0209721163340043E-3,"N/A"]
[null,"SZ1212","south_windsor","Urban",279,0,1.7222,1.044842329,0.47913374123183861,0,2,4.0596228674444616E-2,3.4969741684174688E-4,1.7669172932330827E-4,1.2531328320802005E-6,0,0,"N/A",0,"N/A"]
[null,"SZ1242","south_windsor","Rural Short",820,27.5176505348402,10.279120093400699,4.3790401340000003,6.5830546590461152,0.61896150000000005,17,2.6897777657077699,1.9006408714615328E-2,2.1520011602680702,1.4370403495307563E-2,6,0.25638826434028267,"N/A",5.6362533618413402E-4,"N/A"]
[null,"SZ1322","south_windsor","Rural Short",1164,27.468610115964999,2.34856685348498,4.2753942130000002,5.2069431268351289,2.1062438999999999,11,2.127510794798023,1.7121474462140397E-2,1.3134838861728679,1.0104001111923567E-2,11,0.87245526223894032,"N/A",1.7888978061496425E-3,"N/A"]
[null,"SZ1332","south_windsor","Rural Short",726,24.369209999999999,4.1479499999999998,4.1915629540000001,6.7017728834554644,1.2281616,14,2.7382849795984781,1.7960902849167477E-2,1.1604674913433126,9.18545555629415E-3,12,0.50873312952967908,"N/A",1.206893382916026E-3,"N/A"]
[null,"SZ1342","south_windsor","Urban",417,5.0722500000000004,2.2445399999999998,4.4779229139999996,1.5905591730259003,5.28601995,7,0.13476551190568548,1.1317612836048848E-3,3.4298245614035085E-2,2.6566416040100247E-4,13,0.44669482946094907,"N/A",9.3487145517491337E-4,"N/A"]
[null,"SZ1352","south_windsor","Urban",1416,1.4842899999999999,7.1798351950560502,3.435176367,2.0471811764055605,0.2413728,3,0.1734543573610802,1.452678864987268E-3,9.3045112781954889E-3,3.7593984962406013E-5,1,2.0397195385634476E-2,"N/A",4.2494157053405156E-5,"N/A"]
[null,"T828","blackmans_flat","Rural Short",267,93.661315712385203,4.7952500000000002,1.2938592739999999,0.98749370594754171,0.14508989999999999,19,0.40348117273857476,4.8163211041884471E-3,0.40348117273857476,4.8163211041884471E-3,7,6.0099614651808193E-2,"N/A",1.3477997169620594E-4,"N/A"]
[null,"T829","blackmans_flat","Urban",21,5.8901251449946903,4.6200000000000005E-2,1.838571932,3.1055130354098397E-2,0,1,2.6312510785159648E-3,2.6315789473684212E-5,2.6312510785159648E-3,2.6315789473684212E-5,0,0,"N/A",0,"N/A"]
[null,"T831","blackmans_flat","Rural Short",1075,68.593664885586207,3.54658066680275,2.0193807160000001,21.887878792327868,1.4926067999999999,15,8.9431932079143515,2.1446830111373646E-2,1.7797344004523774,1.4998882033369791E-2,13,0.61827248834459569,"N/A",1.3355469922624044E-3,"N/A"]
[null,"T834","blackmans_flat","Rural Short",133,29.455506424900999,0.221433261246512,4.0772476000000002E-2,0.24389217224262338,0.25202160000000001,2,9.9652179133422975E-2,9.3063168136138128E-4,9.9652179133422975E-2,9.3063168136138128E-4,4,0.10439321444106134,"N/A",2.3892813164327418E-4,"N/A"]
[null,"T836","blackmans_flat","Rural Short",33,12.0971442849635,0.79571714705980001,0.87698928499999995,9.3185709127868915E-2,7.0992E-3,2,3.807485452812151E-2,3.9884214915487763E-4,3.807485452812151E-2,3.9884214915487763E-4,1,2.9406539279172206E-3,"N/A",6.1263623498275427E-6,"N/A"]
[null,"T838","portland","Rural Short",641,23.814027473725002,0.42908812656565998,1.6213727609999999,0.24251163000000003,1.9003671,5,9.9088101813523177E-2,2.9611008043316673E-4,9.9088101813523177E-2,2.9611008043316673E-4,9,0.787176298329341,"N/A",1.7031287332520571E-3,"N/A"]
[null,"T841","portland","Rural Short",398,20.632290296753499,0.36720999999999998,0.87813243900000004,0.77935905000000005,0.17393040000000001,9,0.31843919772297391,3.0094453072595315E-3,0.31843919772297391,3.0094453072595315E-3,2,7.2046021233971899E-2,"N/A",1.7153814579517118E-4,"N/A"]
[null,"T842","portland","Rural Short",227,42.056571296392399,0.17075000000000001,1.4405639770000001,8.4036780000000005E-2,0.1144746,3,3.4336683204515377E-2,1.9942107457743882E-4,3.4336683204515377E-2,1.9942107457743882E-4,4,4.741804458766518E-2,"N/A",1.1640088464672332E-4,"N/A"]
[null,"T865","ambarvale","Urban",826,0,6.30399982211744,3.2960926869999998,3.567003586134017,0,3,0.30222645746669047,1.060052407651431E-3,0.30222645746669047,1.060052407651431E-3,0,0,"N/A",0,"N/A"]
[null,"T868","ambarvale","Rural Short",974,39.577069822049502,3.9797037807181201,5.2775588109999996,1.9894246848697401,0.24935940000000001,11,0.812861287207995,1.1571399677872057E-2,0.29100369231141116,3.6197946567238137E-3,4,0.10329046921809237,"N/A",2.6343358104258436E-4,"N/A"]
[null,"T869","ambarvale","Urban",2139,0,9.77244188095273,4.6297718090000002,0.97023879000000002,0.85190399999999999,7,8.2206766917293242E-2,2.4686716791979949E-4,8.2206766917293242E-2,2.4686716791979949E-4,1,7.1990101361062847E-2,"N/A",1.9997250378073016E-4,"N/A"]
[null,"T870","ambarvale","Urban",815,0,6.8476207660861803,2.5149377730000002,0.41787666000000001,1.3311E-2,2,3.5406015037593989E-2,6.1403508771929827E-5,6.3909774436090227E-4,1.2531328320802005E-6,1,1.124845333766607E-3,"N/A",3.7494844458886905E-6,"N/A"]
[null,"T872","ambarvale","Urban",1126,0,7.7246169174455597,2.662976155,0.27650684513026025,0,4,2.3427978764546616E-2,1.0490931738163045E-3,2.7719298245614033E-3,1.6290726817042605E-5,0,0,"N/A",0,"N/A"]
[null,"T874","ambarvale","Urban",338,0,2.4884645150138098,1.0478907390000001,1.44269479386598,1.41984E-2,1,0.12223720168117894,4.1613806853904513E-4,0.12223720168117894,4.1613806853904513E-4,1,1.1998350226843809E-3,"N/A",9.998625189036508E-6,"N/A"]
[null,"T876","ambarvale","Urban",889,0,7.56082183397635,3.4675657169999998,4.8807000000000003E-2,0,1,4.1353383458646613E-3,1.2531328320802005E-6,4.1353383458646613E-3,1.2531328320802005E-6,0,0,"N/A",0,"N/A"]
[null,"T882","rooty_hill","Urban",656,1.5433861618872,3.7774244853482899,4.2677731899999998,0,0.3123648,0,0,0,0,0,1,2.6396370499056378E-2,"N/A",5.4992438539700794E-5,"N/A"]
[null,"T883","rooty_hill","Urban",1285,1.13082386915156,7.9581480811262697,4.0526698000000003,0,7.0992E-2,0,0,0,0,0,2,5.9991751134219045E-3,"N/A",1.4997937783554762E-5,"N/A"]
[null,"T884","rooty_hill","Urban",291,0.94238999999999995,9.38447677237974,3.3109536830000001,1.0234680000000001E-2,0.73565460000000005,2,8.6716791979949879E-4,3.7593984962406014E-6,8.6716791979949879E-4,3.7593984962406014E-6,4,6.2166452112834489E-2,"N/A",2.762120208471335E-4,"N/A"]
[null,"T887","rooty_hill","Urban",94,0.86882000000000004,3.0145900000000001,2.6955560310000002,0,0.42107129999999998,0,0,0,0,0,1,3.5582607391483674E-2,"N/A",9.1237454849958134E-5,"N/A"]
[null,"T888","rooty_hill","Urban",677,3.3128428404915398,4.5300082143989799,3.8023191760000001,1.18605447,0.35673480000000002,3,0.10049248120300752,1.0137844611528822E-3,0.10049248120300752,1.0137844611528822E-3,1,3.014585494494507E-2,"N/A",8.373848595818075E-5,"N/A"]
[null,"T889","rooty_hill","Urban",1211,4.3406084546722603,3.6084168494341502,5.0087272049999996,0.36182256000000002,1.2117446999999999,2,3.0656641604010024E-2,9.1478696741854635E-5,1.8045112781954887E-4,1.2531328320802005E-6,4,0.10239842021722013,"N/A",2.1247078526702581E-4,"N/A"]
[null,"T890","rooty_hill","Urban",1481,1.9265579273217599,6.9527342799029199,3.4780446239999998,1.1202389699999999,0.20055239999999999,2,9.491604010025062E-2,1.8571428571428573E-3,9.491604010025062E-2,1.8571428571428573E-3,4,1.6947669695416882E-2,"N/A",4.3743985202034718E-5,"N/A"]
[null,"T892","rooty_hill","Urban",58,0.85877000000000003,2.8561134733377997,2.7982493229999998,4.116057E-2,0,1,3.487468671679198E-3,7.2681704260651631E-5,3.487468671679198E-3,7.2681704260651631E-5,0,0,"N/A",0,"N/A"]
[null,"T893","rooty_hill","Urban",849,3.25922753075726,1.3775999999999999,3.7634519559999999,0.1677186,0.13311000000000001,4,1.4210526315789472E-2,1.2280701754385965E-4,1.4210526315789472E-2,1.2280701754385965E-4,1,1.1248453337666071E-2,"N/A",3.1245703715739086E-5,"N/A"]
[null,"T894","rooty_hill","Urban",1460,3.2464409283195299,7.6683159441564301,3.9217787209999999,2.1120120000000003E-2,0.30970259999999999,1,1.7894736842105263E-3,3.5087719298245611E-5,1.7894736842105263E-3,3.5087719298245611E-5,2,2.6171401432303058E-2,"N/A",7.6239517066403365E-5,"N/A"]
[null,"T895","rooty_hill","Urban",357,1.1938367758127,4.0159171222890802,5.0298755450000003,3.1946400000000003E-3,0.15973200000000001,2,2.7067669172932331E-4,4.4862155388471176E-4,2.7067669172932331E-4,4.4862155388471176E-4,1,1.3498144005199286E-2,"N/A",2.9995875567109524E-5,"N/A"]
[null,"T898","rooty_hill","Urban",44,0.216502616362727,2.2154457848836402,2.4646390170000001,0,3.19464E-2,0,0,0,0,0,2,2.6996288010398568E-3,"N/A",7.498968891777381E-6,"N/A"]
[null,"T899","rooty_hill","Urban",395,2.26925397908153,2.3959419950807401,3.1899699340000001,0.50642439000000006,1.4451309000000001,1,4.2908521303258146E-2,6.7293233082706767E-4,4.2908521303258146E-2,6.7293233082706767E-4,3,0.12212070840259465,"N/A",2.7496219269850398E-4,"N/A"]
[null,"T900","rooty_hill","Urban",331,2.28754727522568,3.49939969764878,3.259321248,7.8653219999999996E-2,0.1135872,4,6.6641604010025061E-3,6.3909774436090222E-5,6.6641604010025061E-3,6.3909774436090222E-5,2,9.5986801814750486E-3,"N/A",1.9997250378073016E-5,"N/A"]
[null,"TM1210","TOMERONG","Rural Short",464,35.129106698028103,0.14836000000000002,0,1.1859399556569163,3.0575367,5,0.48456455086651995,8.1981922565426794E-3,0.48456455086651995,8.1981922565426794E-3,8,1.2665028885798479,"N/A",3.3817520171048037E-3,"N/A"]
[null,"TM1217","TOMERONG","Rural Short",1526,15.5508178162394,5.2007299999999992,0,0.35599203696083298,0.96371640000000003,4,0.14545518993533846,1.1242451837725209E-2,0.14545518993533846,1.1242451837725209E-2,2,0.3991937707147627,"N/A",1.1088715853187854E-3,"N/A"]
[null,"TM1232","TOMERONG","Rural Short",169,22.809715798827899,0.23324,0,9.8816682910262771E-2,0.5111424,2,4.0375620489156543E-2,1.5479828344537251E-3,4.0375620489156543E-2,1.5479828344537251E-3,1,0.21172708281003988,"N/A",4.4109808918758311E-4,"N/A"]
[null,"TM1258","TOMERONG","Rural Short",1475,18.3998261064453,2.19794,0,1.9550302360634606,2.0445696,2,0.7988080203805995,1.493226453072964E-2,0.7988080203805995,1.493226453072964E-2,3,0.84690833124015952,"N/A",2.3525231423337763E-3,"N/A"]
[null,"TM1284","TOMERONG","Rural Short",893,21.2116985923297,0.52219000000000004,0,1.5911169185473479,1.8089649000000001,4,0.65011626544359469,1.9390948366078492E-2,0.65011626544359469,1.9390948366078492E-2,3,0.74931537900740675,"N/A",3.0693075372635989E-3,"N/A"]
[null,"ULB2","ulladulla","Urban",1387,9.6913594921730599,4.0588800000000003,2.7180380500000001,1.6764317100000001,3.5496E-2,5,0.14204135338345866,2.0927318295739347E-3,0.13741729323308272,1.9899749373433586E-3,1,2.9995875567109523E-3,"N/A",6.2491407431478175E-6,"N/A"]
[null,"ULC2","ulladulla","Urban",2249,8.6447842989738284,6.2327899999999996,4.6358686269999998,5.4300597599999989,1.7672570999999999,9,0.46008020050125314,9.1328320802005012E-3,7.5328320802005008E-2,3.5162907268170424E-3,6,0.14934196547974654,"N/A",3.8244741348064643E-4,"N/A"]
[null,"ULD2","ulladulla","Urban",899,3.8798843532101102,1.05387234545291,3.3513451079999999,0.10228764,0,1,8.6666666666666663E-3,1.6666666666666666E-4,8.6666666666666663E-3,1.6666666666666666E-4,0,0,"N/A",0,"N/A"]
[null,"ULE2","ulladulla","Rural Short",1473,94.526672278135095,2.4523600000000001,1.4660944060000001,4.5261984900000005,16.566870600000001,16,1.8493645719396417,1.8086887157887106E-2,0.50578623269417877,5.7046513454879471E-3,21,6.8623835225358221,"N/A",1.799312622144349E-2,"N/A"]
[null,"ULF2","ulladulla","Urban",1692,11.6502623501394,1.6365799999999999,3.2436981500000002,0.96080277000000014,0.33454980000000001,5,8.1407268170426067E-2,2.3120300751879696E-3,8.2706766917293225E-4,1.6290726817042605E-5,2,2.8271112722000724E-2,"N/A",9.1237454849958134E-5,"N/A"]
[null,"ULH2","ulladulla","Urban",693,81.628889933763702,2.0159699999999998,3.4338426879999999,2.30864505,2.0578805999999998,16,0.19560776942355887,3.7932330827067664E-3,0.19560776942355887,3.7932330827067664E-3,17,0.1739010886003175,"N/A",4.6493607129019759E-4,"N/A"]
[null,"ULJ2","ulladulla","Rural Short",1772,9.1141902277845688,0.54670000000000007,2.4413948950000002,11.197301940000001,3.1311909,11,4.5751182929556027,4.4392339813511081E-2,4.5022752131690424,4.3649043080995174E-2,8,1.2970121730819892,"N/A",3.0693075372635985E-3,"N/A"]
[null,"ULK2","ulladulla","Urban",1355,13.222423032974101,6.2505068897537406,2.1866621830000001,0.23289813000000001,2.9013542999999999,3,1.9733082706766915E-2,2.105263157894737E-4,1.9733082706766915E-2,2.105263157894737E-4,11,0.24517878791666145,"N/A",6.2116458986889299E-4,"N/A"]
[null,"ULL2","ulladulla","Rural Short",532,30.274578586613799,4.4982100000000003,2.151986526,3.9933000000000003E-2,8.4303000000000003E-2,5,1.6316269738154088E-2,6.7682304099009544E-4,1.6316269738154088E-2,6.7682304099009544E-4,1,3.4920265394016992E-2,"N/A",1.1640088464672332E-4,"N/A"]
[null,"UNB2","unanderra","Urban",181,2.7850764175120699,0.34325,2.5955300970000001,0,0.39134340000000001,0,0,0,0,0,1,3.3070452812738252E-2,"N/A",6.124157928284861E-5,"N/A"]
[null,"UND2","unanderra","Urban",38,0.69712003761794306,1.04453,1.405316743,0,6.6555000000000003E-2,0,0,0,0,0,1,5.6242266688330354E-3,"N/A",1.8747422229443451E-5,"N/A"]
[null,"UNE2","unanderra","Urban",68,2.0612545275984697,1.2965799999999998,1.705966122,0,4.437E-3,0,0,0,0,0,1,3.7494844458886903E-4,"N/A",1.2498281486295635E-6,"N/A"]
[null,"UNF2","unanderra","Urban",586,3.10803032073352,1.5630558306963902,2.3053596249999999,0.57873269999999999,2.39598E-2,2,4.9035087719298244E-2,7.2807017543859653E-4,4.4360902255639097E-4,1.2531328320802005E-6,1,2.0247216007798926E-3,"N/A",3.7494844458886905E-6,"N/A"]
[null,"UNH2","unanderra","Urban",388,4.4253512274881492,0.620367964819585,2.0470069259999999,7.3950000000000009E-5,5.9899500000000001E-2,1,6.2656641604010028E-6,1.2531328320802005E-6,6.2656641604010028E-6,1.2531328320802005E-6,1,5.0618040019497317E-3,"N/A",1.8747422229443451E-5,"N/A"]
[null,"UNJ2","unanderra","Urban",1498,6.8449313159153595,4.48428867273494,2.2049526400000001,0.85196315999999994,1.5596055,4,7.2185463659147867E-2,1.9636591478696739E-3,1.0817042606516291E-2,1.0401002506265664E-4,4,0.13179437827298746,"N/A",2.9495944307657697E-4,"N/A"]
[null,"Unknown","","Urban",0,0,0,0,0,0.21075749999999999,0,0,0,0,0,1,1.7810051117971279E-2,"N/A",3.1245703715739086E-5,"N/A"]
[null,"W111","appin","Rural Short",575,34.3776375045286,0.14146,1.7337828580000001,2.6963130050235633,1.6447959000000001,8,1.1016895872701093,1.1120341372067367E-2,1.1016895872701093,1.1120341372067367E-2,12,0.68131275692432103,"N/A",1.5315905874568859E-3,"N/A"]
[null,"W112","appin","Rural Short",302,18.622457676674902,6.6258801674324005E-2,1.181258651,1.1207416030121626,0.35318519999999998,4,0.45792508205037563,4.8727993423191215E-3,0.12378600700157791,3.0538374196582407E-3,5,0.14629753291388173,"N/A",3.3082356689068739E-4,"N/A"]
[null,"W113","appin","Urban",629,4.0118273762755301,3.9355500000000001,1.105048415,2.1926802216369481,0.71613179999999999,6,0.18578225665896897,2.4757213194739388E-3,0.11983363510508423,1.7225884873937384E-3,2,6.0516678956643463E-2,"N/A",1.0873504893077203E-4,"N/A"]
[null,"W114","appin","Rural Short",37,13.717308674338199,0.12232,0.16747199300000001,0.10392349942654261,8.1640799999999999E-2,4,4.2462220438643998E-2,6.1747809957269013E-4,4.2462220438643998E-2,6.1747809957269013E-4,3,3.3817520171048041E-2,"N/A",1.2252724699655086E-4,"N/A"]
[null,"W118","hazelbrook","Urban",720,7.0882035664794101,0.68276999999999999,1.3277728289999999,0.24434070069458494,3.72708E-2,7,2.0702593255839473E-2,9.4951290043106512E-4,2.0702593255839473E-2,9.4951290043106512E-4,1,3.1495669345465E-3,"N/A",7.498968891777381E-6,"N/A"]
[null,"W120","hazelbrook","Urban",1108,10.4189474483883,4.6416000000000004,2.4259623229999998,0.33665596210388582,5.4575100000000001E-2,5,2.852431637781792E-2,1.4731332054719048E-3,2.852431637781792E-2,1.4731332054719048E-3,3,4.6118658684430889E-3,"N/A",8.7487970404069445E-6,"N/A"]
[null,"W123","hazelbrook","Urban",1012,7.2275136413441698,1.18287663848919,2.0809204810000002,0.26438464645862703,1.4420249999999999,4,2.2400884433754008E-2,1.2839520282485967E-3,2.2400884433754008E-2,1.2839520282485967E-3,8,0.12185824449138243,"N/A",3.9244603866968287E-4,"N/A"]
[null,"W124","hazelbrook","Rural Short",1107,18.409684239977,1.68703084971768,2.5888617009999999,4.3553641101489839,2.7371853000000002,8,1.7795631590180117,1.5050583252715449E-2,1.7670902772626227,1.4905549743931856E-2,15,1.1338058800825832,"N/A",2.8303794056203247E-3,"N/A"]
[null,"W126","hazelbrook","Rural Short",82,1.20163717496317,0.14399000000000001,0.14860995900000001,1.818437497483387E-2,3.19464E-2,1,7.4299743848227863E-3,4.9533162565485345E-4,7.4299743848227863E-3,4.9533162565485345E-4,1,1.3232942675627492E-2,"N/A",3.6758174098965255E-5,"N/A"]
[null,"W127","hazelbrook","Rural Short",963,9.9431078428246895,4.0263359545228798,1.8759149479999999,1.8471997656190857,1.7313174,5,0.75474944622482676,1.0621361265110429E-2,0.75474944622482676,1.0621361265110429E-2,7,0.71715197667081221,"N/A",1.8930459660967108E-3,"N/A"]
[null,"W163","meadow_flat","Rural Short",239,67.429886375681207,0.10391,0.56281258899999997,10.585970052338707,0.46189170000000002,18,4.3253335039686371,9.3244460022117604E-3,0.98079431772748071,7.3000199421074576E-3,6,0.19132629618511415,"N/A",4.1046627743844538E-4,"N/A"]
[null,"W164","meadow_flat","Rural Short",69,30.6540388090765,0,0.229392809,2.5439563653024191,6.2118E-3,4,1.0394380151345586,1.244870950392497E-3,0.11135650630262214,8.3998573837163631E-4,1,2.5730721869275681E-3,"N/A",1.2252724699655085E-5,"N/A"]
[null,"W185","bow_bowing","Rural Short",416,2.1406199999999997,7.4381641343070592,3.3770660619999999,2.6213943900000003,0.87053939999999996,4,1.0710785054296919,5.1426464989515284E-3,2.2903208262075548E-3,1.8129188597948984E-5,11,0.36059768791084923,"N/A",7.8417438077792547E-4,"N/A"]
[null,"W187","bow_bowing","Urban",0,0,1.9887932469012302,4.1153527189999997,0,1.41984E-2,0,0,0,0,0,1,1.1998350226843809E-3,"N/A",2.499656297259127E-6,"N/A"]
[null,"W188","bow_bowing","Rural Short",417,18.440130410152399,2.01312617755136,3.936258665,5.3330150892834567,0.2498031,10,2.1790226808502933,1.1391339065744112E-2,0.59518424817907833,7.9588793578657703E-3,3,0.10347426008858721,"N/A",2.0216995754430891E-4,"N/A"]
[null,"W190","bow_bowing","Urban",218,0.82425727086676792,3.2564250630559801,3.181777334,1.6269000000000001E-3,0.25601489999999999,1,1.3784461152882205E-4,2.5062656641604009E-6,1.3784461152882205E-4,2.5062656641604009E-6,3,2.1634525252777745E-2,"N/A",5.3742610391071226E-5,"N/A"]
[null,"W193","bow_bowing","Urban",1,0,1.3155399999999999,3.1055670979999999,0,3.5496E-3,0,0,0,0,0,1,2.9995875567109521E-4,"N/A",1.2498281486295635E-6,"N/A"]
[null,"W196","bow_bowing","Urban",1050,3.6006925961449401,2.4244828329476498,2.7862462109999999,2.2881904799999999,1.7184501000000001,4,0.19387468671679198,1.5827067669172933E-3,0.19387468671679198,1.5827067669172933E-3,5,0.14521753258926898,"N/A",4.2869105497994023E-4,"N/A"]
[null,"WBB2","wombarra","Urban",1065,7.4889978184606001,5.0020000000000002E-2,1.8620065800000001,1.1034831150424926,0.77869350000000004,6,9.3496343550093355E-2,2.6500773001909873E-3,3.7008127613651624E-2,1.3797706908915352E-3,1,6.5803452025346515E-2,"N/A",1.6872680006499107E-4,"N/A"]
[null,"WBC2","wombarra","Rural Short",955,11.1782058518488,2.0938400000000001,2.3188869419999998,4.9362091324929178,3.4160463000000001,12,2.0168912851449687,2.0012723985568758E-2,0.21440083451103159,6.5265763718946757E-3,8,1.4150059119396676,"N/A",3.2163402336594601E-3,"N/A"]
[null,"WBD2","wombarra","Rural Short",838,8.2597475122927104,0.43351000000000001,1.599462318,3.7122558531161474,0.57237300000000002,13,1.5167948272477494,2.4259766740854821E-2,1.2806083830429462,1.8575705462964779E-2,1,0.23709022293832591,"N/A",5.2686716208516873E-4,"N/A"]
[null,"WBE2","wombarra","Rural Short",40,5.1621986879805597,7.8159999999999993E-2,0.115839558,0.20645014857921123,0.16638749999999999,4,8.4353700240412666E-2,8.1856572081267338E-4,1.9728038967987041E-2,3.3494949995142826E-4,2,6.892157643555985E-2,"N/A",1.5315905874568856E-4,"N/A"]
[null,"WD1210","windsor","Rural Short",280,9.2123799999999996,0.85028999999999999,1.6105128019999999,0.22631658000000002,1.2725316,4,9.2470947975271792E-2,8.2789961263967022E-4,9.2470947975271792E-2,8.2789961263967022E-4,9,0.52711221657916174,"N/A",1.1088715853187854E-3,"N/A"]
[null,"WD1221","windsor","Rural Short",135,10.8903,1.1339900000000001,1.63394745,0.54554064194107443,1.3124646,8,0.22290306931701365,6.2910344173237084E-4,0.17081186741224022,6.1701731600040486E-4,8,0.54365339492369613,"N/A",1.194640658216371E-3,"N/A"]
[null,"WD1225","windsor","Rural Short",732,14.5898619893053,1.6584300000000001,4.4832576309999999,1.3899136469319637,4.4443950000000003E-2,7,0.56790639260970588,2.203357091827634E-3,0.5436132798884542,2.1973140289616509E-3,2,1.8409718861231765E-2,"N/A",4.9010898798620342E-5,"N/A"]
[null,"WD1247","windsor","Rural Short",645,7.9635100000000003,9.5163999999999991,2.0047102460000001,1.0100727026957637,0.28041840000000001,1,0.41270675061554096,1.5493513322793165E-3,0.41270675061554096,1.5493513322793165E-3,4,0.11615583015273022,"N/A",2.5730721869275685E-4,"N/A"]
[null,"WD1251","windsor","Rural Short",1046,22.038832505235501,3.9894400000000001,6.45843641,6.4019631101642922,1.2241683000000001,10,2.6157853644642879,2.0145308078928691E-2,2.6157853644642879,2.0145308078928691E-2,15,0.50707901169522573,"N/A",1.1211243100184404E-3,"N/A"]
[null,"WD1258","windsor","Urban",767,4.52616,2.9982500000000001,5.0963689759999999,3.5939700000000002E-3,1.8954864,1,3.0451127819548871E-4,1.2531328320802005E-6,3.0451127819548871E-4,1.2531328320802005E-6,8,0.16017797552836482,"N/A",3.6369999125120296E-4,"N/A"]
[null,"WD1284","windsor","Urban",234,6.1395499999999998,1.3938499999999998,3.736016271,0.98282508000000024,1.5760224,6,8.3273182957393471E-2,3.7092731829573933E-4,8.3273182957393471E-2,3.7092731829573933E-4,3,0.13318168751796627,"N/A",2.7746184899576307E-4,"N/A"]
[null,"WD1288","windsor","Urban",119,0.86957000000000007,0.99372000000000005,2.144174977,0,0.80664659999999999,0,0,0,0,0,3,6.8165627226256395E-2,"N/A",1.3748109634925196E-4,"N/A"]
[null,"WH1209","whalan","Urban",1181,4.5815484389888601,1.34439709564692,4.0479066599999998,0.12507819806250001,0.39045600000000003,1,1.0597673872180451E-2,1.3247092340225564E-3,1.0597673872180451E-2,1.3247092340225564E-3,1,3.2995463123820477E-2,"N/A",6.8740548174625994E-5,"N/A"]
[null,"WH1213","whalan","Urban",138,0,2.81986430069293,1.7635048499999999,1.6211649133928554E-2,1.06488E-2,1,1.3735868689581079E-3,1.7169835861976317E-4,1.3735868689581079E-3,1.7169835861976317E-4,1,8.998762670132857E-4,"N/A",2.499656297259127E-6,"N/A"]
[null,"WH1220","whalan","Urban",197,0,1.7143406213300101,1.298241362,3.1283451455357103E-2,0,3,2.6505963569638346E-3,2.494009857232368E-4,2.6505963569638346E-3,2.494009857232368E-4,0,0,"N/A",0,"N/A"]
[null,"WH1224","whalan","Urban",1197,4.8067502492724694,3.7406651321870399,4.3298845320000003,0.22434910063392854,0.60076980000000002,3,1.9008737244897957E-2,1.4550395240332957E-3,1.9008737244897957E-2,1.4550395240332957E-3,4,5.0768019397332872E-2,"N/A",1.3498144005199284E-4,"N/A"]
[null,"WH1235","whalan","Urban",1164,6.4445301962296302,1.2053800000000001,2.6422088659999998,0.51408597975000003,2.0552183999999998,7,4.355767543859649E-2,1.7658247180451126E-3,4.355767543859649E-2,1.7658247180451126E-3,3,0.17367611953356413,"N/A",3.4870205346764817E-4,"N/A"]
[null,"WH1246","whalan","Urban",768,0,3.6838222746967899,3.7800276820000001,9.0879901714285657E-2,0,1,7.7001074113856012E-3,9.6251342642320048E-4,7.7001074113856012E-3,9.6251342642320048E-4,0,0,"N/A",0,"N/A"]
[null,"WH1257","whalan","Urban",256,0,3.8388579207028704,4.3453171050000003,2.9228301723214351E-2,0,1,2.4764668367346994E-3,3.095583545918371E-4,2.4764668367346994E-3,3.095583545918371E-4,0,0,"N/A",0,"N/A"]
[null,"WH1261","whalan","Urban",1056,0.46351318492579402,6.3628867368326203,2.725849599,0.25101401804464291,0.208539,2,2.1268012665592556E-2,1.2733198789384172E-3,2.1268012665592556E-2,1.2733198789384172E-3,2,1.7622576895676843E-2,"N/A",3.624501631025734E-5,"N/A"]
[null,"WH1272","whalan","Urban",86,0.1014,1.7898214729906099,3.2960926869999998,1.017665566071429E-2,0.26267040000000003,1,8.6225161117078441E-4,1.07781451396348E-4,8.6225161117078441E-4,1.07781451396348E-4,1,2.2196947919661047E-2,"N/A",4.6243641499293848E-5,"N/A"]
[null,"WH1276","whalan","Urban",62,9.2860399831023302E-2,3.3659944678968001,4.1915629540000001,7.3366587321428553E-3,0,1,6.2162325456498375E-4,7.7702906820622928E-5,6.2162325456498375E-4,7.7702906820622928E-5,0,0,"N/A",0,"N/A"]
[null,"WH1287","whalan","Urban",1624,2.1019312262202403,3.9102505666900802,2.7626210379999998,0.30790288149107103,0.44724960000000002,4,2.6088114258861404E-2,1.918752377595777E-3,2.6088114258861404E-2,1.918752377595777E-3,1,3.7794803214557998E-2,"N/A",8.9987626701328572E-5,"N/A"]
[null,"WH1294","whalan","Urban",1690,6.0244985019670203,6.2024592672838494,3.7748834919999998,0.34223298050892897,0.56971079999999996,3,2.8996848147153632E-2,2.161886720148584E-3,2.8521910803795236E-2,2.1606335873165039E-3,5,4.8143380285210785E-2,"N/A",1.5997800302458413E-4,"N/A"]
[null,"WH1298","whalan","Urban",55,0.35144430132069404,2.0344199999999999,3.618461983,6.38999308928571E-3,0,1,5.4141380236305005E-4,6.7676725295381324E-5,5.4141380236305005E-4,6.7676725295381324E-5,0,0,"N/A",0,"N/A"]
[null,"WL1214","west_liverpool_11kv","Urban",10,0.66403999999999996,0.81885000000000008,0.35113865999999999,3.4490280000000005E-2,8.8739999999999999E-3,2,2.9223057644110276E-3,2.5062656641604011E-5,2.7969924812030074E-3,1.2531328320802006E-5,1,7.4989688917773806E-4,"N/A",2.499656297259127E-6,"N/A"]
[null,"WL1217","west_liverpool_11kv","Urban",1560,7.1096637410627803,1.5522602301993,3.899106175,0.57138206999999996,1.9939878,5,4.8412280701754379E-2,3.4210526315789477E-4,4.1854636591478695E-3,1.8671679197994988E-4,3,0.16850183099823773,"N/A",3.0495806826561352E-4,"N/A"]
[null,"WL1218","west_liverpool_11kv","Urban",631,0,4.03810262608856,2.8965605270000001,5.8272599999999999E-3,8.4302999999999999E-3,1,4.9373433583959898E-4,1.2531328320802005E-6,0,0,1,7.1240204471885113E-4,"N/A",1.2498281486295635E-6,"N/A"]
[null,"WL1221","west_liverpool_11kv","Urban",133,0.80114463774336298,1.50329,2.3568015340000001,0.3737433,0,1,3.1666666666666669E-2,1.6666666666666666E-4,0,0,null,null,"N/A",0,"N/A"]
[null,"WL1236","west_liverpool_11kv","Urban",2050,8.2953905655005009,1.58011156015798,3.866907351,12.852504240242805,5.1052122000000004,10,1.0889719430627618,9.1889839172053355E-3,0.48748196812541855,4.7704375512905477E-3,5,0.43141568034395272,"N/A",8.1363812475784586E-4,"N/A"]
[null,"WL1251","west_liverpool_11kv","Urban",891,3.7134487535259,3.82062776474225,3.161962672,2.3542951606993001,1.1114685,3,0.1994756296335243,2.2586961910270173E-3,0.1994756296335243,2.2586961910270173E-3,4,9.392458536951169E-2,"N/A",1.6747697191636153E-4,"N/A"]
[null,"WL1258","west_liverpool_11kv","Urban",13,0.79948457747666302,2.08318,0.54909474700000005,4.2491670000000002E-2,7.0992E-3,1,3.6002506265664161E-3,1.6290726817042605E-5,3.6002506265664161E-3,1.6290726817042605E-5,1,5.9991751134219043E-4,"N/A",1.2498281486295635E-6,"N/A"]
[null,"WL1262","west_liverpool_11kv","Urban",30,0.241643359456684,1.8354900000000001,1.4289419160000001,0,3.5496E-2,0,0,0,0,0,1,2.9995875567109523E-3,"N/A",6.2491407431478175E-6,"N/A"]
[null,"WL1277","west_liverpool_11kv","Urban",765,1.43769917359835,3.9644585593066197,3.1688215930000001,2.0621697000000001,0,2,0.17472431077694234,9.5989974937343359E-4,0,0,0,0,"N/A",0,"N/A"]
[null,"WL1280","west_liverpool_11kv","Urban",319,3.58470586273519,2.1094242851577301,3.429460599,0.35904204000000001,1.8040841999999999,7,3.0421052631578949E-2,2.2431077694235585E-4,2.386842105263158E-2,1.992481203007519E-4,2,0.15245403756983417,"N/A",3.1620652160327953E-4,"N/A"]
[null,"WL1292","west_liverpool_11kv","Urban",2121,10.8419037242718,3.7449580381552101,5.863424996,13.93015377,0.70060230000000001,10,1.1802794486215538,5.4523809523809533E-3,0.23570551378446114,2.8045112781954888E-3,6,5.9204359400582426E-2,"N/A",1.2873229930884507E-4,"N/A"]
[null,"WL1295","west_liverpool_11kv","Urban",1050,0,5.6220633020216102,3.2324571400000002,1.7895900000000002E-3,0,2,1.5162907268170426E-4,2.5062656641604009E-6,1.5162907268170426E-4,2.5062656641604009E-6,0,0,"N/A",0,"N/A"]
[null,"WL1296","west_liverpool_11kv","Urban",137,1.26702,2.5415089919992702,1.9995660550000001,0.71963703000000012,0.425952,2,6.0973684210526312E-2,3.3333333333333338E-4,6.0973684210526312E-2,3.3333333333333338E-4,1,3.5995050680531424E-2,"N/A",7.4989688917773804E-5,"N/A"]
[null,"WL1299","west_liverpool_11kv","Urban",34,0.96508713423843806,2.8063200000000004,1.3294875589999999,2.5290900000000003E-3,0,1,2.1428571428571427E-4,4.1353383458646619E-5,2.1428571428571427E-4,4.1353383458646619E-5,0,0,"N/A",0,"N/A"]
[null,"WM1142","westmead","Urban",0,0.247703459034427,4.31572805612858,2.2550608689999998,0,0.31591439999999998,0,0,0,0,0,2,2.6696329254727473E-2,"N/A",4.999312594518254E-5,"N/A"]
[null,"WM1222","WESTMEAD","Urban",589,0.52000999999999997,2.28993,0,2.7805200000000003E-3,0,1,2.355889724310777E-4,1.2531328320802005E-6,2.355889724310777E-4,1.2531328320802005E-6,0,0,"N/A",0,"N/A"]
[null,"WM1252","WESTMEAD","Urban",362,0.76892975652135098,0.86850000000000005,0,7.059267000000001E-2,3.5496E-2,1,5.9812030075187973E-3,1.3909774436090226E-4,5.9812030075187973E-3,1.3909774436090226E-4,1,2.9995875567109523E-3,"N/A",6.2491407431478175E-6,"N/A"]
[null,"WP1201","","Urban",0,0,0,0,0,0,1,0,0,0,0,0,0,"N/A",0,"N/A"]
[null,"WP1204","","Urban",0,0,0.67807000000000006,0,0,0,1,0,0,0,0,0,0,"N/A",0,"N/A"]
[null,"WP1205","","Urban",0,0,0.81367,0,0,0,1,0,0,0,0,0,0,"N/A",0,"N/A"]
[null,"WP1209","","Urban",189,0,2.4037301169558698,0,8.897664000000001E-2,0.3465297,1,7.5388471177944864E-3,2.355889724310777E-4,7.5388471177944864E-3,2.355889724310777E-4,2,2.9283473522390673E-2,"N/A",9.1237454849958134E-5,"N/A"]
[null,"WP1212","WEST PARRAMATTA","Urban",571,0,2.92767,0,0.27024288000000002,0,1,2.2897243107769423E-2,7.1553884711779447E-4,2.2897243107769423E-2,7.1553884711779447E-4,0,0,"N/A",0,"N/A"]
[null,"WP1245","WEST PARRAMATTA","Urban",717,0,2.71522,0,0,0.30526560000000003,0,0,0,0,0,5,2.5796452987714189E-2,"N/A",1.0873504893077201E-4,"N/A"]
[null,"WP1252","WEST PARRAMATTA","Urban",3,0,0.23038999999999998,0,0,0.48984480000000002,0,0,0,0,0,1,4.1394308282611141E-2,"N/A",5.9991751134219048E-5,"N/A"]
[null,"WP1271","WEST PARRAMATTA","Urban",281,0,3.55642943936305,0,3.2212620000000004E-2,0,1,2.7293233082706769E-3,1.2531328320802005E-6,2.7293233082706769E-3,1.2531328320802005E-6,0,0,"N/A",0,"N/A"]
[null,"WP1282","WEST PARRAMATTA","Urban",87,0,1.4978199999999999,0,3.2168250000000002E-2,0,1,2.7255639097744362E-3,1.0902255639097744E-4,2.7255639097744362E-3,1.0902255639097744E-4,0,0,"N/A",0,"N/A"]
[null,"WP1286","WEST PARRAMATTA","Urban",80,0,3.7362562115023201,0,2.7065700000000002E-3,0,1,2.293233082706767E-4,1.2531328320802005E-6,2.293233082706767E-4,1.2531328320802005E-6,0,0,"N/A",0,"N/A"]
[null,"WP1290","","Urban",295,0,1.6814800000000001,0,0,3.4608600000000003E-2,0,0,0,0,0,2,2.9245978677931782E-3,"N/A",4.999312594518254E-6,"N/A"]
[null,"WQ1208","wetherill_park","Urban",107,0.81751604777703002,1.8375899999999998,3.429460599,0.25778970000000001,0.2316114,1,2.1842105263157895E-2,2.6315789473684212E-5,2.1842105263157895E-2,2.6315789473684212E-5,1,1.9572308807538963E-2,"N/A",3.624501631025734E-5,"N/A"]
[null,"WQ1212","wetherill_park","Urban",108,1.88150323691947,1.8437918054600699,3.4191722169999998,1.606194E-2,0.3744828,2,1.3609022556390978E-3,5.0125313283208019E-6,1.3609022556390978E-3,5.0125313283208019E-6,3,3.1645648723300543E-2,"N/A",5.4992438539700787E-5,"N/A"]
[null,"WQ1227","wetherill_park","Urban",214,1.6663844700278501,1.0109616281476299,2.3468942030000002,0,0.1056006,0,0,0,0,0,2,8.9237729812150831E-3,"N/A",1.7497594080813889E-5,"N/A"]
[null,"WQ1249","wetherill_park","Urban",540,2.2708191661902499,2.8691320120361103,4.1746061770000003,1.7125932600000002,9.5395499999999994E-2,4,0.14510526315789474,2.0175438596491228E-3,0.14510526315789474,2.0175438596491228E-3,3,8.0613915586606848E-3,"N/A",1.2498281486295635E-5,"N/A"]
[null,"WQ1260","wetherill_park","Urban",141,3.7066029005240599,1.6284922204734,3.0259274020000002,0.34119051,0,2,2.8908521303258144E-2,1.7167919799498748E-4,2.8908521303258144E-2,1.7167919799498748E-4,0,0,"N/A",0,"N/A"]
[null,"WQ1264","wetherill_park","Urban",247,2.3630409906129999,1.31767909002186,2.8578838320000002,4.7919600000000005E-3,6.2118E-3,1,4.0601503759398497E-4,3.7593984962406014E-6,4.0601503759398497E-4,3.7593984962406014E-6,1,5.2492782242441667E-4,"N/A",1.2498281486295635E-6,"N/A"]
[null,"WQ1271","wetherill_park","Urban",8,0.61428688961116995,0.68220000000000003,1.4474228979999999,8.2931927027027064E-3,0,2,7.0266883424778201E-4,6.5704802546907763E-6,7.0266883424778201E-4,6.5704802546907763E-6,0,0,"N/A",0,"N/A"]
[null,"WQ1275","wetherill_park","Urban",30,0.56421983916290608,2.1547837066442899,4.2079481550000004,7.7828977297297292E-2,0.32390099999999999,3,6.5943236469552255E-3,5.2326762853078694E-5,6.5943236469552255E-3,5.2326762853078694E-5,5,2.7371236454987437E-2,"N/A",4.2494157053405163E-5,"N/A"]
[null,"WQ1290","wetherill_park","Urban",91,1.6603799563717001,1.8225461397551201,4.0010373650000002,0.28010781000000001,0,1,2.3733082706766918E-2,1.1528822055137844E-4,2.3733082706766918E-2,1.1528822055137844E-4,0,0,"N/A",0,"N/A"]
[null,"WRA2","warilla","Urban",1471,11.8546781385411,3.8725977237573503,3.163486877,2.1133207739198387,2.8427859,6,0.17905825872319739,4.54883368080414E-3,2.579831131226128E-2,2.7027431037139771E-3,14,0.24022946844808843,"N/A",6.9490445063803729E-4,"N/A"]
[null,"WRB2","warilla","Urban",1302,5.8158347636179393,1.0486445078521398,2.6766939980000002,1.8796739144574923,5.7689874000000003,4,0.1592617373773762,2.3573507740275688E-3,1.864584438442381E-2,6.8547204040305765E-4,11,0.48750796765444748,"N/A",1.299821274574746E-3,"N/A"]
[null,"WRC2","warilla","Urban",1863,9.2337644682074611,1.72603,4.1425978780000001,6.1394339183998961,1.4233895999999999,4,0.52018432816319837,5.614576084805885E-3,0.32206962876446776,3.2032635526248196E-3,4,0.1202834610241092,"N/A",3.1120720900876128E-4,"N/A"]
[null,"WRD2","warilla","Urban",1620,6.9449147426155999,0.52123188393530995,2.9083731140000002,3.5826816748681853,2.9213208000000002,5,0.3035548366240301,7.7997476679484215E-3,0.13468796992481205,5.7656641604010026E-3,9,0.24686605591731137,"N/A",8.9237729812150835E-4,"N/A"]
[null,"WRE2","warilla","Urban",2011,9.6613104849127396,1.5106958825197201,3.2597022990000002,6.4124934196252372,1.9016982,13,0.54332021904196237,8.3812586627757014E-3,0.3309473684210526,5.8383458646616539E-3,8,0.16070290335078929,"N/A",3.861968979265351E-4,"N/A"]
[null,"WRF2","warilla","Urban",1440,8.9868199999999998,0.70157000000000003,3.5630190370000001,2.4562619561569603,8.1694043999999995,5,0.20811511165989349,5.3574189248854626E-3,2.0832080200501254E-2,3.1015037593984962E-3,12,0.69035507617702574,"N/A",1.7197635325142792E-3,"N/A"]
[null,"WRG2","warilla","Urban",116,0,3.39499,1.4941016680000001,0.35489087549408876,0.15085799999999999,1,3.0069331162091227E-2,3.6219971268096367E-4,0,0,1,1.2748247116021547E-2,"N/A",4.2494157053405156E-5,"N/A"]
[null,"WT1215","wilton","Rural Short",408,18.385458161467998,1.56335,2.2950712430000002,2.883695838147676,0.56882339999999998,6,1.1782525514739641,8.670425745567565E-3,0.71641751500407957,6.1867269076485536E-3,4,0.2356198959743673,"N/A",4.9623535033603095E-4,"N/A"]
[null,"WT1252","wilton","Urban",507,0.35525000000000001,10.65375,0,0.64429837168824133,0.52001640000000005,1,5.4590361272369672E-2,4.5952460915278198E-4,5.4590361272369672E-2,4.5952460915278198E-4,4,4.3943957705815447E-2,"N/A",7.6239517066403365E-5,"N/A"]
[null,"WWA2","west_wollongong","Urban",165,0.60762426130790304,0.53918689151736898,0.26025795400000001,0.18077817000000002,0,1,1.5317042606516292E-2,2.0676691729323309E-4,1.5317042606516292E-2,2.0676691729323309E-4,0,0,"N/A",0,"N/A"]
[null,"WWB2","west_wollongong","Urban",1207,8.8239139736502299,1.3013399999999999,3.351726159,0.53403732000000004,2.5691709,9,4.5248120300751878E-2,1.9924812030075188E-4,3.7879699248120305E-2,1.3408521303258147E-4,6,0.21710764769844146,"N/A",4.6743572758745674E-4,"N/A"]
[null,"WWC2","west_wollongong","Urban",551,2.8792076444279799,0.62641000000000002,1.085995856,2.0410200000000002E-3,1.2379230000000001,1,1.7293233082706766E-4,1.2531328320802005E-6,1.7293233082706766E-4,1.2531328320802005E-6,1,0.10461061604029447,"N/A",2.324680356450988E-4,"N/A"]
[null,"WWD2","west_wollongong","Urban",1302,3.62267494540307,0.980306556391904,2.6673582439999999,0.78126696000000007,1.6479018000000001,3,6.6195488721804502E-2,1.9674185463659146E-3,6.6195488721804502E-2,1.9674185463659146E-3,4,0.13925585232030596,"N/A",3.2370549049505688E-4,"N/A"]
[null,"WWE2","west_wollongong","Urban",1445,7.0528224400034798,0.58714075892324691,2.6997475940000002,6.3020190000000004E-2,0.99832500000000002,2,5.3395989974937344E-3,7.8947368421052633E-5,5.3395989974937344E-3,7.8947368421052633E-5,1,8.4363400032495525E-2,"N/A",1.8747422229443452E-4,"N/A"]
[null,"WWF2","west_wollongong","Urban",1693,7.2703061889482496,0.30141000000000001,1.7909405350000001,2.3953292400000006,4.7045510999999998,8,0.20295238095238094,2.5012531328320801E-3,0.20295238095238094,2.5012531328320801E-3,5,0.39755783579757781,"N/A",8.5363262551399195E-4,"N/A"]
[null,"WX1206","west_wetherill_11kv","Urban",45,0.37830938997726399,2.2953207586970001,3.6455166170000002,0,2.12976E-2,0,0,0,0,0,1,1.7997525340265714E-3,"N/A",3.7494844458886905E-6,"N/A"]
[null,"WX1218","west_wetherill_11kv","Urban",103,6.7310000000000009E-2,2.4765000000000001,3.8105117769999999,0,1.24236E-2,0,0,0,0,0,1,1.0498556448488333E-3,"N/A",2.499656297259127E-6,"N/A"]
[null,"WX1228","west_wetherill_11kv","Urban",45,2.3410754111369303,2.6726091014158899,1.458092331,2.1800460000000001E-2,0,1,1.8471177944862154E-3,1.3784461152882205E-5,1.8471177944862154E-3,1.3784461152882205E-5,0,0,"N/A",0,"N/A"]
[null,"WX1244","west_wetherill_11kv","Urban",182,1.96655522587644,2.0043699999999998,5.6174564609999997,0.1056006,0.346086,1,8.9473684210526309E-3,7.5187969924812026E-5,8.9473684210526309E-3,7.5187969924812026E-5,3,2.9245978677931786E-2,"N/A",6.9990376323255556E-5,"N/A"]
[null,"WX1254","west_wetherill_11kv","Urban",53,1.27918950239444,0.630896266765134,3.0295473880000001,0,1.15362E-2,0,0,0,0,0,1,9.7486595593105946E-4,"N/A",2.499656297259127E-6,"N/A"]
[null,"WX1258","west_wetherill_11kv","Urban",656,5.02414014452199,2.8899466616345797,4.1915629540000001,0.40422549000000002,0,5,3.424937343358396E-2,1.7042606516290724E-4,1.5302005012531327E-2,1.4411027568922305E-4,0,0,"N/A",0,"N/A"]
[null,"WX1270","west_wetherill_11kv","Urban",73,1.15461249681861,1.87408336846059,3.615032523,1.8990360000000001E-2,0,1,1.6090225563909774E-3,7.5187969924812028E-6,1.6090225563909774E-3,7.5187969924812028E-6,0,0,"N/A",0,"N/A"]
[null,"WX1280","west_wetherill_11kv","Urban",101,2.1714884031248398,2.39306613544916,6.7240290810000003,9.3117840000000007E-2,0.14997060000000001,2,7.8897243107769414E-3,5.7644110275689221E-5,7.8897243107769414E-3,5.7644110275689221E-5,1,1.2673257427103773E-2,"N/A",3.2495531864368648E-5,"N/A"]
[null,"WX1284","west_wetherill_11kv","Urban",109,0.48008519476216899,2.794,2.3484184080000001,0,4.25952E-2,0,0,0,0,0,1,3.5995050680531428E-3,"N/A",7.498968891777381E-6,"N/A"]
[null,"WX1288","west_wetherill_11kv","Urban",68,0.81272,1.2960799999999999,4.911559155,0,0.1845792,0,0,0,0,0,1,1.5597855294896951E-2,"N/A",3.2495531864368648E-5,"N/A"]
[null,"X213","ILFORD HALL","Rural Short",80,56.5489306983416,0.31383,0,0.19419270000000002,0.1002762,9,7.9345415430356725E-2,7.1912448105197638E-4,7.9345415430356725E-2,7.1912448105197638E-4,5,4.153673673183074E-2,"N/A",1.1027452229689578E-4,"N/A"]
[null,"X217","ILFORD HALL","Rural Short",219,136.97899501599332,0.15621000000000002,0,0.66958767000000019,0.85190399999999999,27,0.27358758513164805,2.308450014805505E-3,0.27358758513164805,2.308450014805505E-3,9,0.35287847135006645,"N/A",7.6579529372844282E-4,"N/A"]
[null,"X482","KANDOS","Rural Short",184,152.2056186179303,0.69298000000000004,0,2.1257814899999996,1.8031968,16,0.86857546879060199,3.8010865427033037E-3,0.85716012303676004,3.1303065645791909E-3,33,0.74692609769097418,"N/A",2.0829631989413649E-3,"N/A"]
[null,"X863","west_pennant_hills","Urban",636,4.3926839721033204,1.8113595206744999,2.0618679219999998,0.13859709000000001,4.2861419999999999,3,1.1743107769423557E-2,9.0225563909774437E-5,1.1743107769423557E-2,9.0225563909774437E-5,12,0.36220019747284754,"N/A",7.2115084175925815E-4,"N/A"]
[null,"X866","west_pennant_hills","Urban",834,0,8.3762588535367399,2.6060090040000001,2.9816640000000002E-2,4.96944E-2,1,2.5263157894736842E-3,2.0050125313283208E-5,2.5263157894736842E-3,2.0050125313283208E-5,1,4.1994225793953333E-3,"N/A",3.4995188161627778E-5,"N/A"]
[null,"X867","west_pennant_hills","Urban",981,1.7278101883735402,5.2119027134131999,3.5462527850000001,3.1236036300000003,0.2697696,4,0.26465789473684215,2.911027568922306E-3,0.26465789473684215,2.911027568922306E-3,3,2.2796865431003236E-2,"N/A",4.7493469647923417E-5,"N/A"]
[null,"X870","west_pennant_hills","Urban",701,0,6.2094720091822602,2.6105816179999999,0.61041288000000005,0.1122561,1,5.1719298245614033E-2,8.7593984962406018E-4,5.1719298245614033E-2,8.7593984962406018E-4,2,9.4861956480983868E-3,"N/A",2.8746047418479962E-5,"N/A"]
[null,"X871","west_pennant_hills","Urban",807,1.87138214104557,5.8647499733847601,2.7831978020000001,8.8414619999999999E-2,0,2,7.4912280701754392E-3,8.1453634085213041E-5,4.6491228070175443E-3,6.641604010025063E-5,0,0,"N/A",0,"N/A"]
[null,"X877","bringelly","Rural Short",1274,96.645854504194205,2.9178891155912101,6.5731328150000001,1.7197072500000001,0.60831270000000004,33,0.70265713474217273,3.982378428682795E-3,0.35323515370530395,2.6347754095685863E-3,9,0.25197728344840686,"N/A",6.1876259733258186E-4,"N/A"]
[null,"X879","bringelly","Rural Short",711,25.683773113218002,0.86712,4.3592254720000003,1.27656927,0.32789430000000003,6,0.52159488515159025,7.1489433704578827E-3,0.52159488515159025,7.1489433704578827E-3,3,0.13582145329567663,"N/A",3.3694992924051485E-4,"N/A"]
[null,"X881","bringelly","Rural Short",602,25.187401069569603,2.6222600000000003,3.8105117769999999,2.5949942400000006,0.86920830000000004,18,1.0602916382139123,1.6642595132917163E-2,1.0410505260486222,1.6497561624133572E-2,5,0.36004631529936471,"N/A",7.535425690287878E-4,"N/A"]
[null,"X883","bringelly","Urban",86,7.5535845707634595,0.40991000000000005,3.567401125,6.5090789999999996E-2,0.29195460000000001,3,5.5150375939849623E-3,3.1328320802005012E-5,5.5150375939849623E-3,3.1328320802005012E-5,1,2.4671607653947582E-2,"N/A",5.874192298558948E-5,"N/A"]
[null,"YYA2","yatte_yattah","Rural Short",984,41.782900318363303,0.27775006588937601,1.8433350719999999,1.09556925,0.40554180000000001,7,0.44763988179769032,3.6137515938578311E-3,4.4960387722913484E-2,5.2574646934052055E-4,5,0.16798485563227122,"N/A",4.6560353858689327E-4,"N/A"]
[null,"YYB2","yatte_yattah","Rural Short",1174,30.324560823443999,2.4746100439570702,1.856862389,1.83341277,0.58302180000000003,10,0.74911620205584994,1.2914025344605661E-2,0.74911620205584994,1.2914025344605661E-2,3,0.24150120383020174,"N/A",6.7389985848102969E-4,"N/A"]
[]
[]
[]
[]
[]
[]
[]
[]
[]
[]
[]
[]
[]
[]
[]
[]
[]
[]
[]
[]
[]
[]
[]
[]
[]
[]
[]
[]
[]
[]
[]
[]
[]
[]
[]
[]
[]
[]
[]
[null,"To enter further feeder ID's - please insert new lines above this line. "]

{"sheet":"3.6.8 Network-feeders - DNU","index":7,"n_rows":53,"n_cols":23,"rows_kept":53,"cut":false,"hidden":false,"merged":[[10,10,10,14],[11,11,11,12],[11,13,11,14],[11,18,11,19],[11,15,12,15],[11,10,12,10],[10,15,10,19],[11,16,11,17],[5,6,5,8],[5,1,5,4],[11,8,12,8],[11,9,12,9],[11,20,12,20],[10,20,10,22],[11,21,11,22],[10,1,12,1],[10,2,12,2],[10,3,12,3],[10,4,12,4],[10,7,12,7],[11,5,12,5],[11,6,12,6],[10,5,10,6],[10,8,10,9]]}
[null,{"$f":"(LOOKUP(dms_Model,dms_Model_List,dms_Worksheet_List))","v":"REGULATORY REPORTING STATEMENT"},null,null,null,null,{"$f":"CONCATENATE(\"1-Jan-\",LEFT(CRY,4))","v":"1-Jan-2014"}]
[null,{"$f":"dms_TradingName","v":"Endeavour Energy"}]
[null,{"$f":"CONCATENATE(\"Annual Reporting RIN Response \",CRY)","v":"Annual Reporting RIN Response 2014-15"}]
[null,"3.6 QUALITY OF SERVICES"]
[]
[null,"Did the MAIFI parameter of the STPIS apply during the period?",null,null,null,"No","** IMPORTANT\nPlease ensure this question is answered correctly. Your response will affect other tables throughout this workbook and will determine which cells are grey and which are input cells. "]
[]
[]
[]
[null,"3.6.8 - NETWORK FEEDER RELIABILITY"]
[null,"Feeder ID / name","Description of the service area for the feeder","Feeder classification\n\n(drop down)","Number of distribution customers","Length of high voltage distribution lines",null,"Maximum demand\n(MVA)","Energy not supplied\n(MWh)",null,"Unplanned Outages",null,null,null,null,"Planned Outages",null,null,null,null,"Momentary feeder outages"]
[null,null,null,null,null,"Overhead","Underground",null,"Unplanned","Planned","Total number of unplanned outages","Unplanned customer minutes off-supply (SAIDI)",null,"Unplanned interruptions\n(SAIFI)",null,"Total number of planned outages","Planned customer minutes off-supply (SAIDI)",null,"Planned interruptions\n(SAIFI)",null,"Total number of momentary feeder outages","Momentary interruptions due to feeder outages (MAIFI)"]
[null,null,null,null,null,null,null,null,null,null,null,"Including excluded events and MEDs","After removing excluded events and MED","Including excluded events and MEDs","After removing excluded events and MED",null,"Including MEDs","After removing  MED","Including MEDs","After removing  MED",null,"Including excluded events and MEDs","After removing excluded events and MED"]
[]
[]
[]
[]
[]
[]
[]
[]
[]
[]
[]
[]
[]
[]
[]
[]
[]
[]
[]
[]
[]
[]
[]
[]
[]
[]
[null,null,null,null,null,null,null,null,null,null,null,null,null,null,null,null,null,null,null,null,null,null," "]
[]
[]
[]
[]
[]
[]
[]
[]
[]
[]
[]
[]
[null,"To enter further feeder ID's - please insert new lines above this line. "]

{"sheet":"3.6.9 Network-reliability","index":8,"n_rows":24,"n_cols":7,"rows_kept":24,"cut":false,"hidden":false,"merged":[]}
[null,{"$f":"(LOOKUP(dms_Model,dms_Model_List,dms_Worksheet_List))","v":"REGULATORY REPORTING STATEMENT"},null,null,null,null,{"$f":"CONCATENATE(\"1-Jan-\",LEFT(CRY,4))","v":"1-Jan-2014"}]
[null,{"$f":"dms_TradingName","v":"Endeavour Energy"}]
[null,{"$f":"CONCATENATE(\"Annual Reporting RIN Response \",CRY)","v":"Annual Reporting RIN Response 2014-15"}]
[null,"3.6 QUALITY OF SERVICES"]
[]
[]
[null,"3.6.9 - NETWORK FEEDER RELIABILITY - PLANNED OUTAGES"]
[]
[]
[null,"3.6.9.1 - PLANNED MINUTES OFF SUPPLY (SAIDI)"]
[null,null,{"$f":"CRY","v":"2014-15"}]
[null,{"$f":"INDEX(dms_FeederName_1,MATCH(dms_TradingName,dms_TradingName_List))","v":"CBD"}]
[null,{"$f":"INDEX(dms_FeederName_2,MATCH(dms_TradingName,dms_TradingName_List))","v":"Urban"},68.7]
[null,{"$f":"INDEX(dms_FeederName_3,MATCH(dms_TradingName,dms_TradingName_List))","v":"Short rural"},145]
[null,{"$f":"INDEX(dms_FeederName_4,MATCH(dms_TradingName,dms_TradingName_List))","v":"Long rural"},798.8]
[null,{"$f":"IF((INDEX(dms_FeederName_5,MATCH(dms_TradingName,dms_TradingName_List))=0),\"\",(INDEX(dms_FeederName_5,MATCH(dms_TradingName,dms_TradingName_List))))","v":""}]
[]
[null,"3.6.9.2 - PLANNED INTERRUPTIONS TO SUPPLY (SAIFI)"]
[null,null,{"$f":"CRY","v":"2014-15"}]
[null,{"$f":"INDEX(dms_FeederName_1,MATCH(dms_TradingName,dms_TradingName_List))","v":"CBD"}]
[null,{"$f":"INDEX(dms_FeederName_2,MATCH(dms_TradingName,dms_TradingName_List))","v":"Urban"},0.2]
[null,{"$f":"INDEX(dms_FeederName_3,MATCH(dms_TradingName,dms_TradingName_List))","v":"Short rural"},0.3]
[null,{"$f":"INDEX(dms_FeederName_4,MATCH(dms_TradingName,dms_TradingName_List))","v":"Long rural"},1.7]
[null,{"$f":"IF((INDEX(dms_FeederName_5,MATCH(dms_TradingName,dms_TradingName_List))=0),\"\",(INDEX(dms_FeederName_5,MATCH(dms_TradingName,dms_TradingName_List))))","v":""}]

{"sheet":"4.1 Public lighting","index":9,"n_rows":23,"n_cols":4,"rows_kept":23,"cut":false,"hidden":false,"merged":[[9,1,10,1],[5,1,5,2]]}
[null,{"$f":"(LOOKUP(dms_Model,dms_Model_List,dms_Worksheet_List))","v":"REGULATORY REPORTING STATEMENT"}]
[null,{"$f":"dms_TradingName","v":"Endeavour Energy"}]
[null,{"$f":"CONCATENATE(\"Annual Reporting RIN Response \",CRY)","v":"Annual Reporting RIN Response 2014-15"}]
[null,"4.1 PUBLIC LIGHTING"]
[]
[null,"Tables 4.1.1 - 4.1.3 deliberately omitted."]
[]
[null,"4.1.4 - PUBLIC LIGHTING METRICS BY TARIFF"]
[]
[null,"Tariff categories","Number of Lights","Public Lighting Revenue"]
[null,"<insert tariff category>","0's","$0's, nominal"]
[]
[]
[]
[]
[]
[]
[]
[]
[]
[]
[null,"To enter further tariff categories - please insert new lines above this line. "]
[null,"Total ",{"$f":"SUM(C12:C21)","v":0},{"$f":"SUM(D12:D21)","v":0}]

{"sheet":"6.2 STPIS Reliability","index":10,"n_rows":98,"n_cols":8,"rows_kept":98,"cut":false,"hidden":false,"merged":[[80,1,85,1],[86,1,91,1],[92,1,97,1],[79,1,79,2],[22,1,27,1],[32,1,37,1],[38,1,43,1],[44,1,49,1],[5,1,5,2],[31,1,31,2],[68,1,73,1],[62,1,67,1],[55,1,55,2],[56,1,61,1],[16,1,21,1],[9,1,9,2],[10,1,15,1]]}
[null,{"$f":"(LOOKUP(dms_Model,dms_Model_List,dms_Worksheet_List))","v":"REGULATORY REPORTING STATEMENT"}]
[null,{"$f":"dms_TradingName","v":"Endeavour Energy"}]
[null,{"$f":"CONCATENATE(\"Annual Reporting RIN Response \",CRY)","v":"Annual Reporting RIN Response 2014-15"}]
[null,"6.2 RELIABILITY AND CUSTOMER SERVICE PERFORMANCE"]
[]
[null,"Did the MAIFI parameter of the STPIS apply during the period?\nThis flag is set from the response on worksheet 3.6.8 Network feeders",null,{"$f":"dms_MAIFI_Flag","v":"No"}]
[]
[]
[null,"6.2.1 - UNPLANNED MINUTES OFF SUPPLY (SAIDI)"]
[null,null,null,{"$f":"CRY","v":"2014-15"}]
[null,"Total sustained minutes off supply",{"$f":"INDEX(dms_FeederName_1,MATCH(dms_TradingName,dms_TradingName_List))","v":"CBD"}]
[null,null,{"$f":"INDEX(dms_FeederName_2,MATCH(dms_TradingName,dms_TradingName_List))","v":"Urban"},108.7," "]
[null,null,{"$f":"INDEX(dms_FeederName_3,MATCH(dms_TradingName,dms_TradingName_List))","v":"Short rural"},385.6]
[null,null,{"$f":"INDEX(dms_FeederName_4,MATCH(dms_TradingName,dms_TradingName_List))","v":"Long rural"},1411]
[null,null,{"$f":"IF((INDEX(dms_FeederName_5,MATCH(dms_TradingName,dms_TradingName_List))=0),\"\",(INDEX(dms_FeederName_5,MATCH(dms_TradingName,dms_TradingName_List))))","v":""},null,"","","",""]
[null,null,"Whole Network",156.69999999999999,"","","",""]
[null,"Total of excluded events*\n\n*see 3.3 of STPIS",{"$f":"INDEX(dms_FeederName_1,MATCH(dms_TradingName,dms_TradingName_List))","v":"CBD"}]
[null,null,{"$f":"INDEX(dms_FeederName_2,MATCH(dms_TradingName,dms_TradingName_List))","v":"Urban"},41.8]
[null,null,{"$f":"INDEX(dms_FeederName_3,MATCH(dms_TradingName,dms_TradingName_List))","v":"Short rural"},179.2]
[null,null,{"$f":"INDEX(dms_FeederName_4,MATCH(dms_TradingName,dms_TradingName_List))","v":"Long rural"},2.2999999999999998]
[null,null,{"$f":"IF((INDEX(dms_FeederName_5,MATCH(dms_TradingName,dms_TradingName_List))=0),\"\",(INDEX(dms_FeederName_5,MATCH(dms_TradingName,dms_TradingName_List))))","v":""},null,null,"","",""]
[null,null,"Whole Network",65.400000000000006,null,"","",""]
[null,"Total sustained minutes off supply after removing excluded events",{"$f":"INDEX(dms_FeederName_1,MATCH(dms_TradingName,dms_TradingName_List))","v":"CBD"}]
[null,null,{"$f":"INDEX(dms_FeederName_2,MATCH(dms_TradingName,dms_TradingName_List))","v":"Urban"},66.900000000000006]
[null,null,{"$f":"INDEX(dms_FeederName_3,MATCH(dms_TradingName,dms_TradingName_List))","v":"Short rural"},206.5]
[null,null,{"$f":"INDEX(dms_FeederName_4,MATCH(dms_TradingName,dms_TradingName_List))","v":"Long rural"},1408.8]
[null,null,{"$f":"IF((INDEX(dms_FeederName_5,MATCH(dms_TradingName,dms_TradingName_List))=0),\"\",(INDEX(dms_FeederName_5,MATCH(dms_TradingName,dms_TradingName_List))))","v":""},null,"","","",""]
[null,null,"Whole Network",91.3,"","","",""]
[]
[]
[null,"6.2.2 - UNPLANNED INTERRUPTIONS TO SUPPLY (SAIFI)"]
[null,null,null,{"$f":"CRY","v":"2014-15"}]
[null,"Total sustained interruptions",{"$f":"INDEX(dms_FeederName_1,MATCH(dms_TradingName,dms_TradingName_List))","v":"CBD"}]
[null,null,{"$f":"INDEX(dms_FeederName_2,MATCH(dms_TradingName,dms_TradingName_List))","v":"Urban"},1.2]
[null,null,{"$f":"INDEX(dms_FeederName_3,MATCH(dms_TradingName,dms_TradingName_List))","v":"Short rural"},2.6]
[null,null,{"$f":"INDEX(dms_FeederName_4,MATCH(dms_TradingName,dms_TradingName_List))","v":"Long rural"},11.9]
[null,null,{"$f":"IF((INDEX(dms_FeederName_5,MATCH(dms_TradingName,dms_TradingName_List))=0),\"\",(INDEX(dms_FeederName_5,MATCH(dms_TradingName,dms_TradingName_List))))","v":""},null,"","","",""]
[null,null,"Whole Network",1.4,"","","",""]
[null,"Total of excluded events*\n\n*see 3.3 of STPIS",{"$f":"INDEX(dms_FeederName_1,MATCH(dms_TradingName,dms_TradingName_List))","v":"CBD"}]
[null,null,{"$f":"INDEX(dms_FeederName_2,MATCH(dms_TradingName,dms_TradingName_List))","v":"Urban"},0.3]
[null,null,{"$f":"INDEX(dms_FeederName_3,MATCH(dms_TradingName,dms_TradingName_List))","v":"Short rural"},0.6]
[null,null,{"$f":"INDEX(dms_FeederName_4,MATCH(dms_TradingName,dms_TradingName_List))","v":"Long rural"},0]
[null,null,{"$f":"IF((INDEX(dms_FeederName_5,MATCH(dms_TradingName,dms_TradingName_List))=0),\"\",(INDEX(dms_FeederName_5,MATCH(dms_TradingName,dms_TradingName_List))))","v":""},null,"",null,"",""]
[null,null,"Whole Network",0.3,"",null,"",""]
[null,"Total sustained interruptions after removing excluded events",{"$f":"INDEX(dms_FeederName_1,MATCH(dms_TradingName,dms_TradingName_List))","v":"CBD"}]
[null,null,{"$f":"INDEX(dms_FeederName_2,MATCH(dms_TradingName,dms_TradingName_List))","v":"Urban"},0.9]
[null,null,{"$f":"INDEX(dms_FeederName_3,MATCH(dms_TradingName,dms_TradingName_List))","v":"Short rural"},2]
[null,null,{"$f":"INDEX(dms_FeederName_4,MATCH(dms_TradingName,dms_TradingName_List))","v":"Long rural"},11.9]
[null,null,{"$f":"IF((INDEX(dms_FeederName_5,MATCH(dms_TradingName,dms_TradingName_List))=0),\"\",(INDEX(dms_FeederName_5,MATCH(dms_TradingName,dms_TradingName_List))))","v":""},null,"","","",""]
[null,null,"Whole Network",1.1000000000000001,"","","",""]
[]
[]
[]
[]
[null,"6.2.3 - UNPLANNED MOMENTARY INTERRUPTIONS TO SUPPLY (MAIFI)"]
[null,null,null,{"$f":"CRY","v":"2014-15"}]
[null,"Total momentary interruptions",{"$f":"INDEX(dms_FeederName_1,MATCH(dms_TradingName,dms_TradingName_List))","v":"CBD"}]
[null,null,{"$f":"INDEX(dms_FeederName_2,MATCH(dms_TradingName,dms_TradingName_List))","v":"Urban"}]
[null,null,{"$f":"INDEX(dms_FeederName_3,MATCH(dms_TradingName,dms_TradingName_List))","v":"Short rural"}]
[null,null,{"$f":"INDEX(dms_FeederName_4,MATCH(dms_TradingName,dms_TradingName_List))","v":"Long rural"}]
[null,null,{"$f":"IF((INDEX(dms_FeederName_5,MATCH(dms_TradingName,dms_TradingName_List))=0),\"\",(INDEX(dms_FeederName_5,MATCH(dms_TradingName,dms_TradingName_List))))","v":""}]
[null,null,"Whole Network"]
[null,"Total of excluded events*\n\n*see 3.3 of STPIS",{"$f":"INDEX(dms_FeederName_1,MATCH(dms_TradingName,dms_TradingName_List))","v":"CBD"}]
[null,null,{"$f":"INDEX(dms_FeederName_2,MATCH(dms_TradingName,dms_TradingName_List))","v":"Urban"}]
[null,null,{"$f":"INDEX(dms_FeederName_3,MATCH(dms_TradingName,dms_TradingName_List))","v":"Short rural"}]
[null,null,{"$f":"INDEX(dms_FeederName_4,MATCH(dms_TradingName,dms_TradingName_List))","v":"Long rural"}]
[null,null,{"$f":"IF((INDEX(dms_FeederName_5,MATCH(dms_TradingName,dms_TradingName_List))=0),\"\",(INDEX(dms_FeederName_5,MATCH(dms_TradingName,dms_TradingName_List))))","v":""}]
[null,null,"Whole Network"]
[null,"Total momentary interruptions after removing excluded events",{"$f":"INDEX(dms_FeederName_1,MATCH(dms_TradingName,dms_TradingName_List))","v":"CBD"}]
[null,null,{"$f":"INDEX(dms_FeederName_2,MATCH(dms_TradingName,dms_TradingName_List))","v":"Urban"}]
[null,null,{"$f":"INDEX(dms_FeederName_3,MATCH(dms_TradingName,dms_TradingName_List))","v":"Short rural"}]
[null,null,{"$f":"INDEX(dms_FeederName_4,MATCH(dms_TradingName,dms_TradingName_List))","v":"Long rural"}]
[null,null,{"$f":"IF((INDEX(dms_FeederName_5,MATCH(dms_TradingName,dms_TradingName_List))=0),\"\",(INDEX(dms_FeederName_5,MATCH(dms_TradingName,dms_TradingName_List))))","v":""}]
[null,null,"Whole Network"]
[]
[]
[]
[]
[null,"6.2.4 - DISTRIBUTION CUSTOMER NUMBERS"]
[null,null,null,{"$f":"CRY","v":"2014-15"}]
[null,"Customer numbers at the start of the period",{"$f":"INDEX(dms_FeederName_1,MATCH(dms_TradingName,dms_TradingName_List))","v":"CBD"}]
[null,null,{"$f":"INDEX(dms_FeederName_2,MATCH(dms_TradingName,dms_TradingName_List))","v":"Urban"},787632]
[null,null,{"$f":"INDEX(dms_FeederName_3,MATCH(dms_TradingName,dms_TradingName_List))","v":"Short rural"},164184]
[null,null,{"$f":"INDEX(dms_FeederName_4,MATCH(dms_TradingName,dms_TradingName_List))","v":"Long rural"},317]
[null,null,{"$f":"IF((INDEX(dms_FeederName_5,MATCH(dms_TradingName,dms_TradingName_List))=0),\"\",(INDEX(dms_FeederName_5,MATCH(dms_TradingName,dms_TradingName_List))))","v":""}]
[null,null,"Whole Network",952134]
[null,"Customer numbers at the end of the period",{"$f":"INDEX(dms_FeederName_1,MATCH(dms_TradingName,dms_TradingName_List))","v":"CBD"}]
[null,null,{"$f":"INDEX(dms_FeederName_2,MATCH(dms_TradingName,dms_TradingName_List))","v":"Urban"},808368]
[null,null,{"$f":"INDEX(dms_FeederName_3,MATCH(dms_TradingName,dms_TradingName_List))","v":"Short rural"},166774]
[null,null,{"$f":"INDEX(dms_FeederName_4,MATCH(dms_TradingName,dms_TradingName_List))","v":"Long rural"},318]
[null,null,{"$f":"IF((INDEX(dms_FeederName_5,MATCH(dms_TradingName,dms_TradingName_List))=0),\"\",(INDEX(dms_FeederName_5,MATCH(dms_TradingName,dms_TradingName_List))))","v":""}]
[null,null,"Whole Network",975462]
[null,"Average customer numbers",{"$f":"INDEX(dms_FeederName_1,MATCH(dms_TradingName,dms_TradingName_List))","v":"CBD"},{"$f":"ROUND(SUM(D81+D87)/2,0)","v":0}]
[null,null,{"$f":"INDEX(dms_FeederName_2,MATCH(dms_TradingName,dms_TradingName_List))","v":"Urban"},{"$f":"ROUND(SUM(D82+D88)/2,0)","v":798000}]
[null,null,{"$f":"INDEX(dms_FeederName_3,MATCH(dms_TradingName,dms_TradingName_List))","v":"Short rural"},{"$f":"ROUND(SUM(D83+D89)/2,0)","v":165479}]
[null,null,{"$f":"INDEX(dms_FeederName_4,MATCH(dms_TradingName,dms_TradingName_List))","v":"Long rural"},{"$f":"ROUND(SUM(D84+D90)/2,0)","v":318}]
[null,null,{"$f":"IF((INDEX(dms_FeederName_5,MATCH(dms_TradingName,dms_TradingName_List))=0),\"\",(INDEX(dms_FeederName_5,MATCH(dms_TradingName,dms_TradingName_List))))","v":""},{"$f":"ROUND(SUM(D85+D91)/2,0)","v":0}]
[null,null,"Whole Network",963798]

{"sheet":"6.6 STPIS Customer Service","index":11,"n_rows":13,"n_cols":4,"rows_kept":13,"cut":false,"hidden":false,"merged":[[8,1,9,1]]}
[null,{"$f":"(LOOKUP(dms_Model,dms_Model_List,dms_Worksheet_List))","v":"REGULATORY REPORTING STATEMENT"}]
[null,{"$f":"dms_TradingName","v":"Endeavour Energy"}]
[null,{"$f":"CONCATENATE(\"Annual Reporting RIN Response \",CRY)","v":"Annual Reporting RIN Response 2014-15"}]
[null,"6.6 STPIS CUSTOMER SERVICE"]
[]
[]
[null,"6.6.1 - TELEPHONE ANSWERING"]
[]
[null,null,"Number of calls \nafter removing excluded events","Total number of calls"]
[null,null,{"$f":"CRY","v":"2014-15"},{"$f":"CRY","v":"2014-15"}]
[null,"Number of calls received",238102,436323]
[null,"Number of calls answered within 30 seconds",178831]
[null,"Percentage of calls answered within 30 seconds",{"$f":"C12/C11","v":0.75106886964410213}]

{"sheet":"6.7 STPIS Daily Performance","index":12,"n_rows":381,"n_cols":16,"rows_kept":381,"cut":false,"hidden":false,"merged":[[13,14,13,15],[13,3,14,3],[6,1,6,5],[8,1,8,6],[13,4,13,5],[13,6,13,7],[13,10,13,11],[13,8,13,9],[13,12,13,13],[12,1,14,1],[12,2,12,3],[13,2,14,2],[12,4,12,13]]}
[null,{"$f":"(LOOKUP(dms_Model,dms_Model_List,dms_Worksheet_List))","v":"REGULATORY REPORTING STATEMENT"},null,null,null,null,null,null,{"$f":"CONCATENATE(IF(LEN(CRY)=4,\"1-Jan-\",\"1-Jul-\"),LEFT(CRY,4))","v":"1-Jul-2014"}]
[null,{"$f":"dms_TradingName","v":"Endeavour Energy"}]
[null,{"$f":"CONCATENATE(\"Annual Reporting RIN Response \",CRY)","v":"Annual Reporting RIN Response 2014-15"}]
[null,"6.7 STPIS DAILY PERFORMANCE"]
[]
[]
[null,"Did the MAIFI parameter of the STPIS apply during the period?\nThis flag is set from the response on worksheet 3.6.8 Network feeders",null,null,null,null,{"$f":"dms_MAIFI_Flag","v":"No"}]
[]
[null,"The excluded events to be removed from the data refer only to events listed in clause 3.3(a) of the STPIS, with respect to reliability data, and in clause 5.4 of the STPIS with respect to customer service parameters.\n\n*Customer service information must be reported as per the definitions in the STPIS, that is excluding: \n   • calls to payment lines and automated interactive services \n   • calls abandoned by the customer within 30 seconds of the call being queued for response by a human operator (where the time in which a telephone call is abandoned is not measured, then an estimate of the number of calls abandoned within 30 seconds will be determined by taking 20 per cent of all calls abandoned)."]
[]
[null,"6.7.1 - DAILY PERFORMANCE DATA - UNPLANNED"]
[]
[null,"Date","Customer service*",null,"MAIFI"]
[null,null,"Number of calls received\n(after removing excluded events)","Number of calls answered in 30 seconds\n(after removing excluded events)",{"$f":"INDEX(dms_FeederName_1,MATCH(dms_TradingName,dms_TradingName_List))","v":"CBD"},null,{"$f":"INDEX(dms_FeederName_2,MATCH(dms_TradingName,dms_TradingName_List))","v":"Urban"},null,{"$f":"INDEX(dms_FeederName_3,MATCH(dms_TradingName,dms_TradingName_List))","v":"Short rural"},null,{"$f":"INDEX(dms_FeederName_4,MATCH(dms_TradingName,dms_TradingName_List))","v":"Long rural"},null,{"$f":"IF((INDEX(dms_FeederName_5,MATCH(dms_TradingName,dms_TradingName_List))=0),\"Network\",(INDEX(dms_FeederName_5,MATCH(dms_TradingName,dms_TradingName_List))))","v":"Network"},null,"Network"]
[null,null,null,null,"All events","After removing excluded events","All events","After removing excluded events","All events","After removing excluded events","All events","After removing excluded events","All events","After removing excluded events","All events","After removing excluded events"]
[null,{"$f":"CONCATENATE(IF(LEN(CRY)=4,\"1-Jan-\",\"1-Jul-\"),LEFT(CRY,4))","v":"1-Jul-2014"},863,641]
[null,{"$f":"B16+1","v":"2014-07-02"},780,548]
[null,"2014-07-03",782,596]
[null,"2014-07-04",935,648]
[null,"2014-07-05",357,240]
[null,"2014-07-06",130,115]
[null,"2014-07-07",832,595]
[null,"2014-07-08",888,627]
[null,"2014-07-09",760,562]
[null,"2014-07-10",796,652]
[null,"2014-07-11",752,587]
[null,"2014-07-12",207,162]
[null,"2014-07-13",128,113]
[null,"2014-07-14",737,552]
[null,"2014-07-15",796,580]
[null,"2014-07-16",765,555]
[null,"2014-07-17",869,676]
[null,"2014-07-18",666,528]
[null,"2014-07-19",198,159]
[null,"2014-07-20",134,127]
[null,"2014-07-21",886,644]
[null,"2014-07-22",726,590]
[null,"2014-07-23",671,547]
[null,"2014-07-24",662,554]
[null,"2014-07-25",678,550]
[null,"2014-07-26",318,146]
[null,"2014-07-27",139,123]
[null,"2014-07-28",744,598]
[null,"2014-07-29",796,628]
[null,"2014-07-30",736,619]
[null,"2014-07-31",794,680]
[null,"2014-08-01",700,550]
[null,"2014-08-02",356,212]
[null,"2014-08-03",165,152]
[null,"2014-08-04",802,656]
[null,"2014-08-05",719,611]
[null,"2014-08-06",836,575]
[null,"2014-08-07",687,540]
[null,"2014-08-08",600,530]
[null,"2014-08-09",440,178]
[null,"2014-08-10",122,115]
[null,"2014-08-11",862,635]
[null,"2014-08-12",855,629]
[null,"2014-08-13",700,484]
[null,"2014-08-14",696,587]
[null,"2014-08-15",682,622]
[null,"2014-08-16",206,166]
[null,"2014-08-17",280,228]
[null,"2014-08-18",1245,861]
[null,"2014-08-19",989,667]
[null,"2014-08-20",774,560]
[null,"2014-08-21",759,670]
[null,"2014-08-22",690,593]
[null,"2014-08-23",220,123]
[null,"2014-08-24",174,151]
[null,"2014-08-25",752,591]
[null,"2014-08-26",765,625]
[null,"2014-08-27",851,730]
[null,"2014-08-28",661,514]
[null,"2014-08-29",676,624]
[null,"2014-08-30",205,158]
[null,"2014-08-31",126,114]
[null,"2014-09-01",742,681]
[null,"2014-09-02",725,611]
[null,"2014-09-03",931,709]
[null,{"$f":"B80+1","v":"2014-09-04"},679,621]
[null,"2014-09-05",605,558]
[null,"2014-09-06",165,136]
[null,"2014-09-07",103,92]
[null,"2014-09-08",735,650]
[null,"2014-09-09",762,663]
[null,"2014-09-10",831,720]
[null,"2014-09-11",756,645]
[null,"2014-09-12",643,579]
[null,"2014-09-13",183,155]
[null,"2014-09-14",135,123]
[null,"2014-09-15",645,549]
[null,"2014-09-16",655,528]
[null,"2014-09-17",679,554]
[null,"2014-09-18",654,517]
[null,"2014-09-19",775,616]
[null,"2014-09-20",169,143]
[null,"2014-09-21",105,98]
[null,"2014-09-22",761,664]
[null,"2014-09-23",730,598]
[null,"2014-09-24",651,570]
[null,"2014-09-25",765,663]
[null,"2014-09-26",596,467]
[null,"2014-09-27",144,126]
[null,"2014-09-28",144,104]
[null,"2014-09-29",719,640]
[null,"2014-09-30",859,757]
[null,"2014-10-01",775,653]
[null,"2014-10-02",707,578]
[null,"2014-10-03",669,611]
[null,"2014-10-04",166,128]
[null,"2014-10-05",193,151]
[null,"2014-10-06",232,150]
[null,"2014-10-07",875,697]
[null,"2014-10-08",778,588]
[null,"2014-10-09",741,617]
[null,"2014-10-10",717,563]
[null,"2014-10-11",159,145]
[null,"2014-10-12",148,122]
[null,"2014-10-13",1210,716]
[null,"2014-10-14",0,0]
[null,"2014-10-15",0,0]
[null,"2014-10-16",942,785]
[null,"2014-10-17",678,554]
[null,"2014-10-18",237,185]
[null,"2014-10-19",137,122]
[null,"2014-10-20",837,541]
[null,"2014-10-21",757,572]
[null,"2014-10-22",728,538]
[null,"2014-10-23",740,576]
[null,"2014-10-24",699,519]
[null,"2014-10-25",334,238]
[null,"2014-10-26",152,126]
[null,"2014-10-27",0,0]
[null,"2014-10-28",921,757]
[null,"2014-10-29",899,630]
[null,"2014-10-30",768,678]
[null,"2014-10-31",1174,760]
[null,"2014-11-01",0,0]
[null,"2014-11-02",793,556]
[null,"2014-11-03",947,767]
[null,"2014-11-04",871,687]
[null,"2014-11-05",0,0]
[null,"2014-11-06",1092,468]
[null,{"$f":"B144+1","v":"2014-11-07"},809,494]
[null,"2014-11-08",266,191]
[null,"2014-11-09",164,123]
[null,"2014-11-10",884,612]
[null,"2014-11-11",857,710]
[null,"2014-11-12",961,692]
[null,"2014-11-13",879,703]
[null,"2014-11-14",1346,787]
[null,"2014-11-15",446,210]
[null,"2014-11-16",955,283]
[null,"2014-11-17",941,741]
[null,"2014-11-18",860,713]
[null,"2014-11-19",753,665]
[null,"2014-11-20",748,656]
[null,"2014-11-21",1010,769]
[null,"2014-11-22",254,192]
[null,"2014-11-23",317,169]
[null,"2014-11-24",1641,757]
[null,"2014-11-25",1130,728]
[null,"2014-11-26",783,665]
[null,"2014-11-27",929,786]
[null,"2014-11-28",730,645]
[null,"2014-11-29",681,176]
[null,"2014-11-30",517,227]
[null,"2014-12-01",1093,859]
[null,"2014-12-02",1390,878]
[null,"2014-12-03",0,0]
[null,"2014-12-04",1607,990]
[null,"2014-12-05",1503,769]
[null,"2014-12-06",1261,176]
[null,"2014-12-07",1504,161]
[null,"2014-12-08",1502,747]
[null,"2014-12-09",1092,815]
[null,"2014-12-10",934,760]
[null,"2014-12-11",1207,871]
[null,"2014-12-12",963,695]
[null,"2014-12-13",253,204]
[null,"2014-12-14",155,137]
[null,"2014-12-15",826,590]
[null,"2014-12-16",1141,674]
[null,"2014-12-17",1144,778]
[null,"2014-12-18",987,757]
[null,"2014-12-19",626,548]
[null,"2014-12-20",226,159]
[null,"2014-12-21",146,127]
[null,"2014-12-22",1207,653]
[null,"2014-12-23",1316,759]
[null,"2014-12-24",372,330]
[null,"2014-12-25",710,328]
[null,"2014-12-26",496,255]
[null,"2014-12-27",240,144]
[null,"2014-12-28",125,117]
[null,"2014-12-29",542,378]
[null,"2014-12-30",519,345]
[null,"2014-12-31",394,356]
[null,"2015-01-01",393,158]
[null,"2015-01-02",387,342]
[null,"2015-01-03",234,170]
[null,"2015-01-04",977,237]
[null,"2015-01-05",693,595]
[null,"2015-01-06",722,579]
[null,"2015-01-07",667,561]
[null,"2015-01-08",763,579]
[null,"2015-01-09",1090,707]
[null,{"$f":"B208+1","v":"2015-01-10"},313,214]
[null,"2015-01-11",260,218]
[null,"2015-01-12",833,560]
[null,"2015-01-13",712,597]
[null,"2015-01-14",871,566]
[null,"2015-01-15",790,648]
[null,"2015-01-16",739,584]
[null,"2015-01-17",347,267]
[null,"2015-01-18",221,170]
[null,"2015-01-19",825,599]
[null,"2015-01-20",826,584]
[null,"2015-01-21",776,593]
[null,"2015-01-22",770,622]
[null,"2015-01-23",934,698]
[null,"2015-01-24",258,192]
[null,"2015-01-25",377,253]
[null,"2015-01-26",120,104]
[null,"2015-01-27",863,537]
[null,"2015-01-28",879,649]
[null,"2015-01-29",1136,670]
[null,"2015-01-30",750,672]
[null,"2015-01-31",244,181]
[null,"2015-02-01",191,167]
[null,"2015-02-02",737,639]
[null,"2015-02-03",797,686]
[null,"2015-02-04",789,635]
[null,"2015-02-05",773,659]
[null,"2015-02-06",718,593]
[null,"2015-02-07",246,189]
[null,"2015-02-08",0,0]
[null,"2015-02-09",812,366]
[null,"2015-02-10",812,556]
[null,"2015-02-11",917,674]
[null,"2015-02-12",867,682]
[null,"2015-02-13",824,679]
[null,"2015-02-14",269,216]
[null,"2015-02-15",200,152]
[null,"2015-02-16",795,609]
[null,"2015-02-17",885,644]
[null,"2015-02-18",1249,760]
[null,"2015-02-19",735,638]
[null,"2015-02-20",756,603]
[null,"2015-02-21",195,158]
[null,"2015-02-22",119,107]
[null,"2015-02-23",951,587]
[null,"2015-02-24",898,515]
[null,"2015-02-25",692,607]
[null,"2015-02-26",774,623]
[null,"2015-02-27",706,609]
[null,"2015-02-28",192,162]
[null,"2015-03-01",1022,235]
[null,"2015-03-02",851,716]
[null,"2015-03-03",860,709]
[null,"2015-03-04",818,635]
[null,"2015-03-05",806,703]
[null,"2015-03-06",710,579]
[null,"2015-03-07",312,217]
[null,"2015-03-08",201,117]
[null,"2015-03-09",839,755]
[null,"2015-03-10",932,684]
[null,"2015-03-11",0,0]
[null,"2015-03-12",1567,883]
[null,"2015-03-13",847,672]
[null,"2015-03-14",255,201]
[null,{"$f":"B272+1","v":"2015-03-15"},338,247]
[null,"2015-03-16",845,559]
[null,"2015-03-17",845,585]
[null,"2015-03-18",792,636]
[null,"2015-03-19",839,694]
[null,"2015-03-20",895,640]
[null,"2015-03-21",278,192]
[null,"2015-03-22",295,231]
[null,"2015-03-23",1058,658]
[null,"2015-03-24",960,704]
[null,"2015-03-25",807,552]
[null,"2015-03-26",945,568]
[null,"2015-03-27",731,573]
[null,"2015-03-28",199,157]
[null,"2015-03-29",134,100]
[null,"2015-03-30",803,572]
[null,"2015-03-31",793,601]
[null,"2015-04-01",763,636]
[null,"2015-04-02",632,548]
[null,"2015-04-03",103,96]
[null,"2015-04-04",274,210]
[null,"2015-04-05",151,127]
[null,"2015-04-06",232,134]
[null,"2015-04-07",766,579]
[null,"2015-04-08",821,525]
[null,"2015-04-09",874,607]
[null,"2015-04-10",773,556]
[null,"2015-04-11",130,89]
[null,"2015-04-12",139,125]
[null,"2015-04-13",806,648]
[null,"2015-04-14",765,656]
[null,"2015-04-15",876,606]
[null,"2015-04-16",847,634]
[null,"2015-04-17",716,592]
[null,"2015-04-18",245,203]
[null,"2015-04-19",155,103]
[null,"2015-04-20",0,0]
[null,"2015-04-21",0,0]
[null,"2015-04-22",1645,1141]
[null,"2015-04-23",1101,846]
[null,"2015-04-24",839,665]
[null,"2015-04-25",561,326]
[null,"2015-04-26",347,318]
[null,"2015-04-27",995,851]
[null,"2015-04-28",918,802]
[null,"2015-04-29",903,767]
[null,"2015-04-30",887,755]
[null,"2015-05-01",740,612]
[null,"2015-05-02",272,211]
[null,"2015-05-03",189,174]
[null,"2015-05-04",781,701]
[null,"2015-05-05",963,876]
[null,"2015-05-06",835,784]
[null,"2015-05-07",772,651]
[null,"2015-05-08",803,689]
[null,"2015-05-09",272,182]
[null,"2015-05-10",463,225]
[null,"2015-05-11",1019,852]
[null,"2015-05-12",1094,951]
[null,"2015-05-13",979,891]
[null,"2015-05-14",847,703]
[null,"2015-05-15",778,736]
[null,"2015-05-16",188,148]
[null,"2015-05-17",150,139]
[null,{"$f":"B336+1","v":"2015-05-18"},825,733]
[null,"2015-05-19",860,717]
[null,"2015-05-20",909,741]
[null,"2015-05-21",805,654]
[null,"2015-05-22",943,789]
[null,"2015-05-23",192,141]
[null,"2015-05-24",153,135]
[null,"2015-05-25",847,768]
[null,"2015-05-26",759,689]
[null,"2015-05-27",848,751]
[null,"2015-05-28",818,772]
[null,"2015-05-29",686,637]
[null,"2015-05-30",201,187]
[null,"2015-05-31",189,166]
[null,"2015-06-01",779,704]
[null,"2015-06-02",908,735]
[null,"2015-06-03",862,657]
[null,"2015-06-04",837,705]
[null,"2015-06-05",719,641]
[null,"2015-06-06",242,172]
[null,"2015-06-07",145,125]
[null,"2015-06-08",456,304]
[null,"2015-06-09",866,781]
[null,"2015-06-10",963,756]
[null,"2015-06-11",824,671]
[null,"2015-06-12",756,647]
[null,"2015-06-13",199,165]
[null,"2015-06-14",120,112]
[null,"2015-06-15",799,757]
[null,"2015-06-16",806,724]
[null,"2015-06-17",855,672]
[null,"2015-06-18",844,750]
[null,"2015-06-19",733,640]
[null,"2015-06-20",343,76]
[null,"2015-06-21",195,48]
[null,"2015-06-22",946,730]
[null,"2015-06-23",866,715]
[null,"2015-06-24",896,742]
[null,"2015-06-25",785,677]
[null,"2015-06-26",908,822]
[null,"2015-06-27",264,217]
[null,"2015-06-28",146,123]
[null,"2015-06-29",1030,929]
[null,"2015-06-30",736,726]
[null,"2015-07-01"]

{"sheet":"6.8 STPIS Exclusions","index":13,"n_rows":44,"n_cols":15,"rows_kept":44,"cut":false,"hidden":false,"merged":[[10,11,11,11],[6,1,6,4],[10,6,10,8],[10,5,11,5],[10,4,11,4],[10,2,11,2],[10,3,11,3]]}
[null,{"$f":"(LOOKUP(dms_Model,dms_Model_List,dms_Worksheet_List))","v":"REGULATORY REPORTING STATEMENT"}]
[null,{"$f":"dms_TradingName","v":"Endeavour Energy"}]
[null,{"$f":"CONCATENATE(\"Annual Reporting RIN Response \",CRY)","v":"Annual Reporting RIN Response 2014-15"}]
[null,"6.8 STPIS EXCLUSIONS"]
[]
[]
[null,{"$f":"CONCATENATE(\"This information is collected to inform the application of the STPIS to \",dms_TradingName,\" in future regulatory periods. The information is also collected to monitor network performance, and may be used in performance reports.\")","v":"This information is collected to inform the application of the STPIS to Endeavour Energy in future regulatory periods. The information is also collected to monitor network performance, and may be used in performance reports."}]
[]
[null,"6.8.1 - STPIS EXCLUSIONS"]
[]
[null,"Date of event","Outage ID","Feeder ID / name","Feeder classification\n(drop down)","Cause of event\n(drop down)","Unplanned",null,null,"Event category","Effect on unplanned MAIFI","Please provide separate explanation to confirm the outage was not due to inadequate transmission connection planning "]
[null,"DD/MM/YYYY",null,null,null,null,"Number of  interruptions","Duration of interruption\n(mins)","Total unplanned minutes off supply","Use exclusion categories listed in section 3.3(a) of the STPIS\n(drop down)","by feeder classification",null,null,null,"Cause of Event"]
[null,"2014-12-09","1779157-1","217 Transmisison Feeder","Urban","Transmission failure",1,13,4.0000000000000002E-4,6,0,"Loss of Section 2 A Bus at Sydney West TransGrid",null,null,"Weather"]
[null,null,null,null,null,null,null,null,null,null,null,null,null,null,"Equipment failure"]
[null,null,null,null,null,null,null,null,null,null,null,null,null,null,"Operational error"]
[null,null,null,null,null,null,null,null,null,null,null,null,null,null,"Vegetation"]
[null,null,null,null,null,null,null,null,null,null,null,null,null,null,"Animals"]
[null,null,null,null,null,null,null,null,null,null,null,null,null,null,"Third party impacts"]
[null,null,null,null,null,null,null,null,null,null,null,null,null,null,"Transmission failure"]
[null,null,null,null,null,null,null,null,null,null,null,null,null,null,"Load shedding"]
[null,null,null,null,null,null,null,null,null,null,null,null,null,null,"Inter-distributor connection failure"]
[null,null,null,null,null,null,null,null,null,null,null,null,null,null,"Other"]
[]
[]
[]
[]
[]
[]
[]
[]
[]
[]
[]
[]
[]
[]
[]
[]
[]
[]
[]
[]
[]
[null,"To enter further events - please insert new lines above this line. "]

{"sheet":"6.9 STPIS - GSL","index":14,"n_rows":102,"n_cols":5,"rows_kept":102,"cut":false,"hidden":false,"merged":[[64,1,64,2],[54,1,54,2],[55,1,55,2],[56,1,56,2],[61,1,61,2],[60,1,60,2],[59,1,59,2],[17,1,17,2],[15,1,15,2],[5,1,5,2],[7,1,7,2],[14,1,14,2],[16,1,16,2],[20,1,20,2],[22,1,22,2],[23,1,23,2],[24,1,24,2],[21,1,21,2],[27,1,27,2],[31,1,31,2],[32,1,32,2],[28,1,28,2],[29,1,29,2],[30,1,30,2],[33,1,33,2],[34,1,34,2],[35,1,35,2],[36,1,36,2],[37,1,37,2],[40,1,40,2],[42,1,42,2],[43,1,43,2],[44,1,44,2],[41,1,41,2],[85,1,85,2],[86,1,86,2],[45,1,45,2],[46,1,46,2],[71,1,71,2],[70,1,70,2],[77,1,77,2],[49,1,49,2],[50,1,50,2],[51,1,51,2],[53,1,53,4],[58,1,58,4],[63,1,63,4],[68,1,68,4],[66,1,66,2],[65,1,65,2],[5,4,5,5],[101,1,101,2],[69,1,69,2],[98,1,98,2],[100,1,100,2],[93,1,93,2],[94,1,94,2],[95,1,95,2],[96,1,96,2],[88,1,88,2],[89,1,89,2],[90,1,90,2],[91,1,91,2],[92,1,92,2],[83,1,83,2],[84,1,84,2]]}
[null,{"$f":"(LOOKUP(dms_Model,dms_Model_List,dms_Worksheet_List))","v":"REGULATORY REPORTING STATEMENT"}]
[null,{"$f":"dms_TradingName","v":"Endeavour Energy"}]
[null,{"$f":"CONCATENATE(\"Annual Reporting RIN Response \",CRY)","v":"Annual Reporting RIN Response 2014-15"}]
[null,"6.9 STPIS - GUARANTEED SERVICE LEVEL"]
[]
[null,"Did the AER's GSL Scheme apply at any time during the regulatory year?",null,"No","**IMPORTANT \nPlease ensure this flag is set. Conditional formatting on this worksheet is dependant on this response."]
[]
[null,"Instructions:\nTable 6.9.1 collects information relating to jurisdiction GSL scheme parameters. These parameters can be found in the jurisdictonal scheme relevant to NSP. Please identify each parameter in the relevant sub-tables and provide the volume and value of GSL payments. \n\nFor GSL parameters that do not fit within the provided sub-tables provided, please enter a heading and identify the relevant parameter(s). "]
[]
[null,"6.9.1 - GUARANTEED SERVICE LEVELS - JURISDICTIONAL GSL SCHEME"]
[null,null,null,{"$f":"CRY","v":"2014-15"},{"$f":"CRY","v":"2014-15"}]
[null,null,null,"Volume","Value of GSL payments"]
[null,null,null,"0's","$0's"]
[null,"Appointments"]
[]
[]
[]
[]
[null,"To enter further GSL parameters relating to appointments - please copy a row from above and \"insert copied cells\" above this row."]
[null,"Connections"]
[]
[]
[]
[]
[]
[null,"To enter further GSL parameters relating to connections -  please copy a row from above and \"insert copied cells\" above this row."]
[null,"Reliability of supply"]
[]
[]
[]
[]
[]
[]
[]
[]
[]
[]
[]
[null,"To enter further GSL parameters relating to reliability of supply -  please copy a row from above and \"insert copied cells\" above this row."]
[null,"Street lights"]
[null,"Street lights","Street lights",199449,0]
[null,"Street lights \"out\" during period","Street lights \"out\" during period",24678,0]
[null,"Street lights not repaired by \"fix by\" date","Street lights not repaired by \"fix by\" date",1171,0]
[null,"Street lights not repaired in 12 business days","Street lights not repaired in 2 business days",1171,0]
[null,"Street lights – number of business days to repair","Street lights – number of business days to repair",3.8,0]
[null,"Street lights - GSL payments","Street lights - GSL payments",285,4275]
[]
[null,"To enter further GSL parameters relating to street lights -  please copy a row from above and \"insert copied cells\" above this row."]
[null,"Planned interruptions"]
[]
[]
[]
[null,"To enter further GSL parameters relating to planned interruptions -  please copy a row from above and \"insert copied cells\" above this row."]
[null,"<NSP defined parameter category>"]
[]
[]
[]
[null,"To enter further GSL parameters - please identify the parameter and if insufficient rows  please copy a row from above and \"insert copied cells\" above this row."]
[null,"<NSP defined parameter category>"]
[]
[]
[]
[null,"To enter further GSL parameters - please identify the parameter and if insufficient rows  please copy a row from above and \"insert copied cells\" above this row."]
[null,"<NSP defined parameter category>"]
[]
[]
[]
[null,"To enter further GSL parameters - please identify the parameter and if insufficient rows  please copy a row from above and \"insert copied cells\" above this row."]
[null,"<NSP defined parameter category>"]
[]
[]
[]
[null,"To enter further GSL parameters - please identify the parameter and if insufficient rows  please copy a row from above and \"insert copied cells\" above this row."]
[]
[]
[null,"6.9.2 - GUARANTEED SERVICE LEVELS - AER GSL SCHEME"]
[]
[null,"Complete Table 6.9.2 if the AER's GSL scheme applied at any time during the regulatory year. \n\nDo not complete Table 6.9.2 if the AER's GSL scheme did not apply during the regulatory year."]
[]
[null,null,null,{"$f":"CRY","v":"2014-15"},{"$f":"CRY","v":"2014-15"}]
[null,null,null,"Volume","Value \nof GSL payments"]
[null,null,null,"0's","$0's"]
[null,"New connections "]
[null,"Number of connections made"]
[null,"Number of connections not made on or before the day agreed"]
[null,"Connections - GSL payments – 1-6 day delay"]
[null,"Connections - GSL payments – 7+ day delay"]
[null,"Reliability of supply"]
[null,"Frequency of interruptions – CBD feeders – 9 interruptions"]
[null,"Frequency of interruptions – Urban feeders – 9 interruptions"]
[null,"Frequency of interruptions – Rural (short and long) feeders – 15 interruptions"]
[null,"Interruptions – CBD feeders – 12 hours duration"]
[null,"Interruptions – Urban feeders – 12 hours duration"]
[null,"Interruptions – Rural (short and long) feeders – 18 hours duration"]
[null,"Total duration of interruptions Level 1 – 20 hours"]
[null,"Total duration of interruptions Level 2 – 30 hours"]
[null,"Total duration of interruptions Level 3 – 60 hours"]
[null,"Street lights"]
[null,"Streetlight repair 5 days – GSL payments"]
[null,"Planned interruptions"]
[null,"Notice of planned interruptions – 4 business days notice not given"]
[null,"Total ",null,null,{"$f":"SUM(E101,E99,E89:E97,E86:E87)","v":0}]

{"sheet":"7.8 Avoided TUOS Payments","index":15,"n_rows":11,"n_cols":3,"rows_kept":11,"cut":false,"hidden":false,"merged":[[6,1,7,1]]}
[null,{"$f":"(LOOKUP(dms_Model,dms_Model_List,dms_Worksheet_List))","v":"REGULATORY REPORTING STATEMENT"}]
[null,{"$f":"dms_TradingName","v":"Endeavour Energy"}]
[null,{"$f":"CONCATENATE(\"Annual Reporting RIN Response \",CRY)","v":"Annual Reporting RIN Response 2014-15"}]
[null,"7.8 - AVOIDED TUOS PAYMENTS"]
[]
[null,"7.8.1 - AVOIDED TUOS PAYMENTS"]
[null,"Description","Avoided TUOS Payment "]
[null,null,"$0's, nominal"]
[null,"Embedded generators",1298805.9200000002]
[null,"Market network service providers",0]
[null,"Other",0]

{"sheet":"7.10 Juris Scheme","index":16,"n_rows":17,"n_cols":6,"rows_kept":17,"cut":false,"hidden":false,"merged":[[8,4,9,4],[8,3,9,3],[8,2,9,2],[8,1,9,1],[5,1,5,2]]}
[null,{"$f":"(LOOKUP(dms_Model,dms_Model_List,dms_Worksheet_List))","v":"REGULATORY REPORTING STATEMENT"}]
[null,{"$f":"dms_TradingName","v":"Endeavour Energy"}]
[null,{"$f":"CONCATENATE(\"Annual Reporting RIN Response \",CRY)","v":"Annual Reporting RIN Response 2014-15"}]
[null,"7.10 - JURISDICTIONAL SCHEMES"]
[]
[null,"Instructions\nBusiness must list each relevant jurisdictional scheme individually and report information for each scheme separately from other schemes."]
[]
[null,"7.10.1 - JURISDICTIONAL SCHEME PAYMENTS"]
[null,"Jurisdictional Scheme Name","Description","Date DNSP Became Subject to Scheme","Description of Cost Recovery Method","Total Scheme Payments  "]
[null,null,null,null,null,"$0's, nominal"]
[null,"Solar Bonus Scheme (established under the Electricity Supply Act 1995 (NSW)) - [Rule 6.18.7A(e)(2)]"," The NSW Government’s Solar Bonus Scheme (SBS) credits participating customers with a feed in tariff for all the electricity that their eligible solar photovoltaic (PV) system or wind turbine generates and provides to the network.","The SBS commenced 1 January 2010.","The revenue reductions arising from the Solar Bonus Scheme is funded by the Office of Environment and Heritage using the Climate Change Fund (See Below) ",0]
[null,"Climate Change Fund (established under the Energy and Utilities Administration Act 1987 (NSW)) - [Rule 6.18.7A(e)(3)].","The NSW Government's Climate Change Fund (CCF) was established to address the impacts of climate change, encourage energy and water saving activities and increase public awareness and acceptance of cliamte change.","The CCF commenced 1 July 2007","Costs are recovered in accordance with 6.18.7A of the Rules. Endeavour submits cost recovery tariffs as part of its annual pricing proposal to the AER. These cost recovery tariffs are subject to an overs and unders  account. The NSW Government requires Endeavour Energy to recover no more than 25% of CCF payments from Residential customers.",93651005.359999999]
[]
[]
[]
[]
[null,null,null,null,"Total",{"$f":"SUM(F11:F16)","v":93651005.359999999}]

{"sheet":"7.11 DMIS-DMIA","index":17,"n_rows":17,"n_cols":5,"rows_kept":17,"cut":false,"hidden":false,"merged":[[14,5,14,7],[6,1,7,1],[6,5,7,7],[6,2,6,4],[13,5,13,7],[9,5,9,7],[10,5,10,7],[11,5,11,7],[12,5,12,7],[8,2,8,4]]}
[null,{"$f":"(LOOKUP(dms_Model,dms_Model_List,dms_Worksheet_List))","v":"REGULATORY REPORTING STATEMENT"}]
[null,{"$f":"dms_TradingName","v":"Endeavour Energy"}]
[null,{"$f":"CONCATENATE(\"Annual Reporting RIN Response \",CRY)","v":"Annual Reporting RIN Response 2014-15"}]
[null,"7.11 - DEMAND MANAGEMENT INCENTIVE SCHEME"]
[]
[null,"7.11.1 - DMIA - PROJECTS SUBMITTED FOR APPROVAL"]
[null,"Name of project",{"$f":"CONCATENATE(\"Total amount of the DMIA spent in \", CRY)","v":"Total amount of the DMIA spent in 2014-15"}]
[null,null,"Operating expenditure","Capital expenditure","Total"]
[null,null,"$0's, nominal"]
[null,"Pool Pump Trial",94990,102694,{"$f":"SUM(C10:D10)","v":197684}]
[null,"Power Factor Correction Trial",181103,0,181103]
[null,null,null,null,0]
[null,null,null,null,0]
[null,null,null,null,0]
[null,null,null,null,{"$f":"SUM(C15:D15)","v":0}]
[null,"To enter additional projects - please copy a row from above and \"insert copied cells\" above this row. "]
[null,"Total",{"$f":"SUM(C10:C16)","v":276093},{"$f":"SUM(D10:D16)","v":102694},{"$f":"SUM(E10:E16)","v":378787}]

{"sheet":"7.12 Safety and Bushfire","index":18,"n_rows":340,"n_cols":10,"rows_kept":340,"cut":false,"hidden":false,"merged":[[139,1,139,2],[140,1,140,2],[141,1,141,2],[142,1,142,2],[143,1,143,2],[144,1,144,2],[203,6,203,7],[204,6,204,7],[205,6,205,7],[145,1,145,2],[206,6,206,7],[181,6,181,7],[182,6,182,7],[183,6,183,7],[184,6,184,7],[185,6,185,7],[186,6,186,7],[187,6,187,7],[188,6,188,7],[189,6,189,7],[117,1,118,2],[180,6,180,7],[306,6,306,7],[307,6,307,7],[118,3,118,5],[119,1,119,2],[120,1,120,2],[121,1,121,2],[122,1,122,2],[123,1,123,2],[124,1,124,2],[125,1,125,2],[126,1,126,2],[127,1,127,2],[128,1,128,2],[129,1,129,2],[130,1,130,2],[131,1,131,2],[132,1,132,2],[133,1,133,2],[134,1,134,2],[135,1,135,2],[136,1,136,2],[137,1,137,2],[138,1,138,2],[297,6,297,7],[298,6,298,7],[299,6,299,7],[300,6,300,7],[301,6,301,7],[302,6,302,7],[303,6,303,7],[275,6,275,7],[276,6,276,7],[282,6,282,7],[283,6,283,7],[284,6,284,7],[285,6,285,7],[286,6,286,7],[287,6,287,7],[280,6,280,7],[281,6,281,7],[266,6,266,7],[267,6,267,7],[268,6,268,7],[269,6,269,7],[270,6,270,7],[271,6,271,7],[304,6,304,7],[305,6,305,7],[288,6,288,7],[289,6,289,7],[290,6,290,7],[291,6,291,7],[292,6,292,7],[293,6,293,7],[294,6,294,7],[295,6,295,7],[296,6,296,7],[272,6,272,7],[273,6,273,7],[274,6,274,7],[257,6,257,7],[258,6,258,7],[259,6,259,7],[260,6,260,7],[261,6,261,7],[262,6,262,7],[263,6,263,7],[264,6,264,7],[265,6,265,7],[248,6,249,7],[250,6,250,7],[251,6,251,7],[252,6,252,7],[253,6,253,7],[254,6,254,7],[255,6,255,7],[256,6,256,7],[169,8,169,9],[170,8,170,9],[207,6,207,7],[190,6,190,7],[191,6,191,7],[192,6,192,7],[193,6,193,7],[194,6,194,7],[195,6,195,7],[196,6,196,7],[197,6,197,7],[198,6,198,7],[199,6,199,7],[200,6,200,7],[201,6,201,7],[202,6,202,7],[162,8,164,9],[171,8,171,9],[172,8,172,9],[166,8,166,9],[167,8,167,9],[71,6,71,7],[72,6,72,7],[73,6,73,7],[74,6,74,7],[75,6,75,7],[76,6,76,7],[77,6,77,7],[165,8,165,9],[168,8,168,9],[130,6,130,8],[131,6,131,8],[132,6,132,8],[127,6,127,8],[128,6,128,8],[129,6,129,8],[63,6,63,7],[64,6,64,7],[65,6,65,7],[66,6,66,7],[67,6,67,7],[50,6,50,7],[51,6,51,7],[52,6,52,7],[53,6,53,7],[54,6,54,7],[55,6,55,7],[56,6,56,7],[57,6,57,7],[58,6,58,7],[18,6,18,8],[19,6,19,8],[20,6,20,8],[21,6,21,8],[22,6,22,8],[42,6,42,8],[43,6,43,8],[44,6,44,8],[28,6,28,8],[29,6,29,8],[30,6,30,8],[31,6,31,8],[23,6,23,8],[24,6,24,8],[25,6,25,8],[26,6,26,8],[27,6,27,8],[40,6,40,8],[37,6,37,8],[41,6,41,8],[38,6,38,8],[39,6,39,8],[212,1,214,1],[212,2,214,2],[214,3,214,5],[82,9,84,9],[162,2,162,4],[162,5,162,7],[162,1,164,1],[164,5,164,7],[133,6,133,8],[134,6,134,8],[135,6,135,8],[136,6,136,8],[137,6,137,8],[138,6,138,8],[139,6,139,8],[140,6,140,8],[141,6,141,8],[142,6,142,8],[143,6,143,8],[144,6,144,8],[145,6,145,8],[212,9,214,9],[117,6,118,8],[121,6,121,8],[37,2,37,5],[5,1,5,2],[25,2,25,5],[26,2,26,5],[27,2,27,5],[28,2,28,5],[29,2,29,5],[30,2,30,5],[42,2,42,5],[31,2,31,5],[32,2,32,5],[14,1,14,4],[13,1,13,4],[33,2,33,5],[24,2,24,5],[17,2,17,5],[18,2,18,5],[19,2,19,5],[20,2,20,5],[21,2,21,5],[22,2,22,5],[23,2,23,5],[248,1,249,1],[248,2,249,2],[312,4,312,6],[10,1,10,2],[82,3,82,5],[82,1,84,1],[82,2,84,2],[11,1,11,2],[164,2,164,4],[84,3,84,5],[82,6,82,8],[84,6,84,8],[17,6,17,8],[32,6,32,8],[33,6,33,8],[34,2,34,5],[34,6,34,8],[35,2,35,5],[35,6,35,8],[36,2,36,5],[36,6,36,8],[249,3,249,5],[311,4,311,6],[43,2,43,5],[337,4,337,6],[338,4,338,6],[324,4,324,6],[313,4,313,6],[314,4,314,6],[315,4,315,6],[316,4,316,6],[317,4,317,6],[318,4,318,6],[325,4,325,6],[326,4,326,6],[321,4,321,6],[322,4,322,6],[323,4,323,6],[332,4,332,6],[333,4,333,6],[334,4,334,6],[336,4,336,6],[331,4,331,6],[335,4,335,6],[329,4,329,6],[330,4,330,6],[327,4,327,6],[328,4,328,6],[319,4,319,6],[320,4,320,6],[214,6,214,8],[212,3,212,5],[212,6,212,8],[40,2,40,5],[41,2,41,5],[38,2,38,5],[39,2,39,5],[119,6,119,8],[120,6,120,8],[44,2,44,5],[68,6,68,7],[69,6,69,7],[70,6,70,7],[122,6,122,8],[123,6,123,8],[124,6,124,8],[125,6,125,8],[126,6,126,8],[59,6,59,7],[60,6,60,7],[61,6,61,7],[62,6,62,7]]}
[null,{"$f":"(LOOKUP(dms_Model,dms_Model_List,dms_Worksheet_List))","v":"REGULATORY REPORTING STATEMENT"}]
[null,{"$f":"dms_TradingName","v":"Endeavour Energy"}]
[null,{"$f":"CONCATENATE(\"Annual Reporting RIN Response \",CRY)","v":"Annual Reporting RIN Response 2014-15"}]
[null,"7.12 SAFETY AND BUSHFIRE RELATED EXPENDITURE"]
[]
[null,"These templates collect information from Victorian businesses only.\n\nBushfire and safety related expenditure information is used by the AER to monitor the expenditures throughout the regulatory control period."]
[]
[null,"CPI applied to convert expected expenditure in real $ to nominal based on lagged September CPI index"]
[]
[null,"Instructions"]
[null,"For \"Exclusive of Margins & Overheads\" reported expenditure is to EXCLUDE any overheads, profit margins or management fees paid directly or indirectly to related party contractors (not including actual incurred expense of the related party contractor) for the reporting period."]
[null,"For \"Value of Margins & Overheads\" reported expenditure is to COMPRISE ONLY the sum of overheads, profit margins or management fees paid directly or indirectly to related party contractors (not including actual incurred expenses of the related party contractor) for the reporting period. "]
[]
[null,{"$f":"CONCATENATE(dms_TradingName, \" is to specify each activity in this table in accordance with the definition in Appendix F of the RIN.\")","v":"Endeavour Energy is to specify each activity in this table in accordance with the definition in Appendix F of the RIN."}]
[null,"All activities must be reported but the Reason for Difference is only required if there is a 10 per cent difference between the expected value and the actual value.\n\nUse median unit costs. Where unit costs are not recorded at the asset category level - provide the best estimates of the unit cost using the cost allocation method identified in this table. (As a transitional measure, the unit cost may be based on a statistically significant annual sample of actual work orders at a 5% or better confidence interval.)\n\nProvide basis of allocation where applicable."]
[]
[null,"7.12.1 - SAFETY AND BUSHFIRE RELATED ASSET GROUP DEFINITIONS AND ALLOCATION BASIS"]
[null,"Activity","Definitions",null,null,null,"Basis for allocation of cost to activity"]
[null,"Planned non-preferred services replacements"]
[null,"Planned replacement of non-preferred services due to height "]
[null,"Removal of public lighting switchwire "]
[null,"Replacement of existing SWER lines with 22kV overhead bare conductor "]
[null,"Installation of GFN and associated equipment at zone substations "]
[null,"Replacement of crossarms/insulator sets – pole top fire mitigation"]
[null,"Replacement of crossarms – based on age and condition "]
[null,"Replacement of poles – based on age and condition "]
[null,"Stake poles – based on age and condition "]
[null,"Replacement of undersized poles "]
[null,"Stake undersized poles"]
[null,"Replacement of overhead conductor – mainly steel "]
[null,"Service line clearance – overhead services requiring relocation "]
[null,"Service line clearance – overhead services requiring undergrounding "]
[null,"Replacement of 22kV distribution feeders with ABC/underground cabling"]
[null,"Replacement of SWER with covered carbon core conductor or equivalent"]
[null,"Replacement of SWER with ABC"]
[null,"Replacement of SWER with underground"]
[null,"Replacement of surge diverters (neptune configuration)"]
[null,"Replacement of surge diverters (single phase or three phase)"]
[]
[]
[]
[]
[]
[]
[]
[null,"To enter further activities - please copy row from above and \"insert copied cells\" into a row above this row. "]
[]
[null,"7.12.2 - BUSHFIRE RELATED"]
[]
[null,"7.12.2.1 - NUMBER OF ACTIVITIES"]
[null,"Activity","Units","AER expected number","Actual Number","Difference","Reasons for Difference"]
[null,"Planned non-preferred services replacements","number of services",null,null,{"$f":"D52-E52","v":0}]
[null,"Planned replacement of non-preferred services due to height ","number of services",null,null,{"$f":"D53-E53","v":0}]
[null,"Removal of public lighting switchwire ","number of spans removed",null,null,0]
[null,"Replacement of existing SWER lines with 22kV overhead bare conductor ","kms of SWER",null,null,0]
[null,"Installation of GFN and associated equipment at zone substations ","number of zone substations",null,null,{"$f":"D56-E56","v":0}]
[null,"Replacement of crossarms/insulator sets – pole top fire mitigation","number of crossarms/sets",null,null,0]
[null,"Replacement of crossarms – based on age and condition ","number of crossarms",null,null,0]
[null,"Replacement of poles – based on age and condition ","number of poles",null,null,0]
[null,"Stake poles – based on age and condition ","number of poles",null,null,0]
[null,"Replacement of undersized poles ","number of poles",null,null,0]
[null,"Stake undersized poles","number of poles",null,null,0]
[null,"Replacement of overhead conductor – mainly steel ","kms ",null,null,0]
[null,"Service line clearance – overhead services requiring relocation ","number of services",null,null,0]
[null,"Service line clearance – overhead services requiring undergrounding ","number of services",null,null,0]
[null,"Replacement of 22kV distribution feeders with ABC/underground cabling","number of feeders",null,null,0]
[null,"Replacement of SWER with covered carbon core conductor or equivalent","kms ",null,null,0]
[null,"Replacement of SWER with ABC","kms ",null,null,0]
[null,"Replacement of SWER with underground","kms ",null,null,0]
[null,"Replacement of surge diverters (neptune configuration)","number of units",null,null,{"$f":"D70-E70","v":0}]
[null,"Replacement of surge diverters (single phase or three phase)","number of units",null,null,0]
[null,{"$f":"IF(ISBLANK(B39),\"\",B39)","v":""},null,null,null,{"$f":"D72-E72","v":0}]
[null,{"$f":"IF(ISBLANK(B40),\"\",B40)","v":""},null,null,null,0]
[null,"",null,null,null,0]
[null,"",null,null,null,0]
[null,"",null,null,null,0]
[null,"",null,null,null,0]
[null,"",null,null,null,0]
[null,"To enter further activities - please copy row from above and \"insert copied cells\" into a row above this row. "]
[]
[]
[null,"7.12.2.2 - EXPENDITURE "]
[null,"Activity","Units","Exclusive of Margins & Overheads",null,null,"Value of Margins & Overheads",null,null,"Reasons for Difference"]
[null,null,null,"AER expected expenditure ","Actual expenditure","Difference  ","AER expected expenditure ","Actual expenditure","Difference  "]
[null,null,null,"$0's, Nominal",null,null,"$0's, Nominal"]
[null,"Planned non-preferred services replacements","number of services",null,null,{"$f":"D86*$C$8-E86","v":0},null,null,{"$f":"G86*$C$8-H86","v":0}]
[null,"Planned replacement of non-preferred services due to height ","number of services",null,null,{"$f":"D87*$C$8-E87","v":0},null,null,{"$f":"G87*$C$8-H87","v":0}]
[null,"Removal of public lighting switchwire ","number of spans removed",null,null,0,null,null,0]
[null,"Replacement of existing SWER lines with 22kV overhead bare conductor ","kms of SWER",null,null,0,null,null,0]
[null,"Installation of GFN and associated equipment at zone substations ","number of zone substations",null,null,0,null,null,0]
[null,"Replacement of crossarms/insulator sets – pole top fire mitigation","number of crossarms/sets",null,null,0,null,null,0]
[null,"Replacement of crossarms – based on age and condition ","number of crossarms",null,null,0,null,null,0]
[null,"Replacement of poles – based on age and condition ","number of poles",null,null,0,null,null,0]
[null,"Stake poles – based on age and condition ","number of poles",null,null,0,null,null,0]
[null,"Replacement of undersized poles ","number of poles",null,null,0,null,null,0]
[null,"Stake undersized poles","number of poles",null,null,0,null,null,0]
[null,"Replacement of overhead conductor – mainly steel ","kms ",null,null,0,null,null,0]
[null,"Service line clearance – overhead services requiring relocation ","number of services",null,null,0,null,null,0]
[null,"Service line clearance – overhead services requiring undergrounding ","number of services",null,null,0,null,null,0]
[null,"Replacement of 22kV distribution feeders with ABC/underground cabling","number of feeders",null,null,0,null,null,0]
[null,"Replacement of SWER with covered carbon core conductor or equivalent","kms ",null,null,0,null,null,0]
[null,"Replacement of SWER with ABC","kms ",null,null,0,null,null,0]
[null,"Replacement of SWER with underground","kms ",null,null,0,null,null,0]
[null,"Replacement of surge diverters (neptune configuration)","number of units",null,null,0,null,null,0]
[null,"Replacement of surge diverters (single phase or three phase)","number of units",null,null,0,null,null,0]
[null,{"$f":"IF(ISBLANK(B39),\"\",B39)","v":""},{"$f":"IF(ISBLANK(C72),\"\",C72)","v":""},null,null,0,null,null,0]
[null,"","",null,null,{"$f":"D107*$C$8-E107","v":0},null,null,{"$f":"G107*$C$8-H107","v":0}]
[null,"","",null,null,0,null,null,0]
[null,"","",null,null,0,null,null,0]
[null,"","",null,null,0,null,null,0]
[null,"","",null,null,0,null,null,0]
[null,"","",null,null,0,null,null,0]
[null,"To enter further activities - please copy row from above and \"insert copied cells\" into a row above this row. "]
[]
[]
[]
[null,"7.12.2.3 - UNIT COSTS"]
[null,"Activity",null,"AER expected ","Actual","Difference","Reasons for Difference"]
[null,null,null,"$0's, Per Unit"]
[null,"Planned non-preferred services replacements",null,null,null,{"$f":"D120*$C$8-E120","v":0}]
[null,"Planned replacement of non-preferred services due to height ",null,null,null,0]
[null,"Removal of public lighting switchwire ",null,null,null,0]
[null,"Replacement of existing SWER lines with 22kV overhead bare conductor ",null,null,null,0]
[null,"Installation of GFN and associated equipment at zone substations ",null,null,null,0]
[null,"Replacement of crossarms/insulator sets – pole top fire mitigation",null,null,null,0]
[null,"Replacement of crossarms – based on age and condition ",null,null,null,0]
[null,"Replacement of poles – based on age and condition ",null,null,null,0]
[null,"Stake poles – based on age and condition ",null,null,null,0]
[null,"Replacement of undersized poles ",null,null,null,0]
[null,"Stake undersized poles",null,null,null,0]
[null,"Replacement of overhead conductor – mainly steel ",null,null,null,0]
[null,"Service line clearance – overhead services requiring relocation ",null,null,null,0]
[null,"Service line clearance – overhead services requiring undergrounding ",null,null,null,0]
[null,"Replacement of 22kV distribution feeders with ABC/underground cabling",null,null,null,0]
[null,"Replacement of SWER with covered carbon core conductor or equivalent",null,null,null,0]
[null,"Replacement of SWER with ABC",null,null,null,0]
[null,"Replacement of SWER with underground",null,null,null,0]
[null,"Replacement of surge diverters (neptune configuration)",null,null,null,0]
[null,"Replacement of surge diverters (single phase or three phase)",null,null,null,0]
[null,{"$f":"IF(ISBLANK(B39),\"\",B39)","v":""},null,null,null,0]
[null,"",null,null,null,0]
[null,"",null,null,null,0]
[null,"",null,null,null,0]
[null,"",null,null,null,0]
[null,"",null,null,null,0]
[null,"",null,null,null,0]
[null,"To enter further activities - please copy row from above and \"insert copied cells\" into a row above this row. "]
[]
[]
[null,"7.12.2.4 - CONTINGENT PROJECT APPLICATIONS - VOLUMES APPROVED"]
[null,"Activity","Units","Volume approved under contingent project applications ","Actual volumes","Difference"]
[null,null,null,null,null,{"$f":"E152-D152","v":0}]
[null,null,null,null,null,0]
[null,null,null,null,null,0]
[null,null,null,null,null,0]
[null,null,null,null,null,0]
[null,null,null,null,null,0]
[null,null,null,null,null,0]
[null,null,null,null,null,0]
[null,"To enter further activities - please copy row from above and \"insert copied cells\" into a row above this row. "]
[]
[null,"7.12.2.5 - CONTINGENT PROJECT APPLICATIONS - EXPENDITURE APPROVED"]
[null,"Activity","Exclusive of Margins & Overheads",null,null,"Value of Margins & Overheads",null,null,"Reasons for Difference"]
[null,null,"Expenditure approved under contingent project applications","Actual expenditure ","Difference","Expenditure approved under contingent project applications","Actual expenditure","Difference"]
[null,null,"$0's, Nominal",null,null,"$0's, Nominal"]
[null,{"$f":"IF(ISBLANK(B152),\"\",B152)","v":""},null,null,{"$f":"C166-D166","v":0},null,null,{"$f":"F166-G166","v":0}]
[null,{"$f":"IF(ISBLANK(B153),\"\",B153)","v":""},null,null,{"$f":"C167-D167","v":0},null,null,{"$f":"F167-G167","v":0}]
[null,"",null,null,0,null,null,0]
[null,"",null,null,0,null,null,0]
[null,"",null,null,0,null,null,0]
[null,"",null,null,0,null,null,0]
[null,"",null,null,0,null,null,0]
[null,"",null,null,0,null,null,0]
[null,"To enter further activities - please copy row from above and \"insert copied cells\" into a row above this row. "]
[]
[]
[]
[null,"7.12.3 - SAFETY RELATED"]
[]
[null,"7.12.3.1 - NUMBER OF ACTIVITIES"]
[null,"Activity","Units","AER expected volumes","Actual units","Difference","Reasons for Difference"]
[null,"Planned non-preferred services replacements","number of services",null,null,{"$f":"D182-E182","v":0}]
[null,"Planned replacement of non-preferred services due to height ","number of services",null,null,{"$f":"D183-E183","v":0}]
[null,"Removal of public lighting switchwire ","number of spans removed",null,null,0]
[null,"Replacement of existing SWER lines with 22kV overhead bare conductor ","kms of SWER",null,null,0]
[null,"Installation of GFN and associated equipment at zone substations ","number of zone substations",null,null,0]
[null,"Replacement of crossarms/insulator sets – pole top fire mitigation","number of crossarms/sets",null,null,0]
[null,"Replacement of crossarms – based on age and condition ","number of crossarms",null,null,0]
[null,"Replacement of poles – based on age and condition ","number of poles",null,null,0]
[null,"Stake poles – based on age and condition ","number of poles",null,null,0]
[null,"Replacement of undersized poles ","number of poles",null,null,0]
[null,"Stake undersized poles","number of poles",null,null,0]
[null,"Replacement of overhead conductor – mainly steel ","kms ",null,null,0]
[null,"Service line clearance – overhead services requiring relocation ","number of services",null,null,0]
[null,"Service line clearance – overhead services requiring undergrounding ","number of services",null,null,0]
[null,"Replacement of 22kV distribution feeders with ABC/underground cabling","number of feeders",null,null,0]
[null,"Replacement of SWER with covered carbon core conductor or equivalent","kms ",null,null,0]
[null,"Replacement of SWER with ABC","kms ",null,null,{"$f":"D198-E198","v":0}]
[null,"Replacement of SWER with underground","kms ",null,null,{"$f":"D199-E199","v":0}]
[null,"Replacement of surge diverters (neptune configuration)","number of units",null,null,0]
[null,"Replacement of surge diverters (single phase or three phase)","number of units",null,null,0]
[null,{"$f":"IF(ISBLANK(B39),\"\",B39)","v":""},{"$f":"IF(ISBLANK(C72),\"\",C72)","v":""},null,null,0]
[null,"","",null,null,0]
[null,"","",null,null,{"$f":"D204-E204","v":0}]
[null,"","",null,null,{"$f":"D205-E205","v":0}]
[null,"","",null,null,{"$f":"D206-E206","v":0}]
[null,"","",null,null,0]
[null,"","",null,null,0]
[null,"To enter further activities - please copy row from above and \"insert copied cells\" into a row above this row. "]
[]
[]
[null,"7.12.3.2 - EXPENDITURE"]
[null,"Activity","Units","Exclusive of Margins & Overheads",null,null,"Value of Margins & Overheads",null,null,"Reasons for Difference"]
[null,null,null,"AER expected expenditure ","Actual expenditure","Difference  ","AER expected expenditure ","Actual expenditure","Difference  "]
[null,null,null,"$0's, Nominal",null,null,"$0's, Nominal"]
[null,"Planned non-preferred services replacements","number of services",null,null,{"$f":"D216*$C$8-E216","v":0},null,null,{"$f":"G216*$C$8-H216","v":0}]
[null,"Planned replacement of non-preferred services due to height ","number of services",null,null,{"$f":"D217*$C$8-E217","v":0},null,null,{"$f":"G217*$C$8-H217","v":0}]
[null,"Removal of public lighting switchwire ","number of spans removed",null,null,0,null,null,0]
[null,"Replacement of existing SWER lines with 22kV overhead bare conductor ","kms of SWER",null,null,0,null,null,0]
[null,"Installation of GFN and associated equipment at zone substations ","number of zone substations",null,null,0,null,null,0]
[null,"Replacement of crossarms/insulator sets – pole top fire mitigation","number of crossarms/sets",null,null,0,null,null,0]
[null,"Replacement of crossarms – based on age and condition ","number of crossarms",null,null,0,null,null,0]
[null,"Replacement of poles – based on age and condition ","number of poles",null,null,0,null,null,0]
[null,"Stake poles – based on age and condition ","number of poles",null,null,0,null,null,0]
[null,"Replacement of undersized poles ","number of poles",null,null,0,null,null,0]
[null,"Stake undersized poles","number of poles",null,null,0,null,null,0]
[null,"Replacement of overhead conductor – mainly steel ","kms ",null,null,0,null,null,0]
[null,"Service line clearance – overhead services requiring relocation ","number of services",null,null,0,null,null,0]
[null,"Service line clearance – overhead services requiring undergrounding ","number of services",null,null,0,null,null,0]
[null,"Replacement of 22kV distribution feeders with ABC/underground cabling","number of feeders",null,null,0,null,null,0]
[null,"Replacement of SWER with covered carbon core conductor or equivalent","kms ",null,null,0,null,null,0]
[null,"Replacement of SWER with ABC","kms ",null,null,{"$f":"D232-E232","v":0},null,null,{"$f":"G232-H232","v":0}]
[null,"Replacement of SWER with underground","kms ",null,null,{"$f":"D233-E233","v":0},null,null,{"$f":"G233-H233","v":0}]
[null,"Replacement of surge diverters (neptune configuration)","number of units",null,null,0,null,null,0]
[null,"Replacement of surge diverters (single phase or three phase)","number of units",null,null,0,null,null,0]
[null,{"$f":"IF(ISBLANK(B39),\"\",B39)","v":""},{"$f":"IF(ISBLANK(C72),\"\",C72)","v":""},null,null,0,null,null,0]
[null,"","",null,null,0,null,null,0]
[null,"","",null,null,{"$f":"D238-E238","v":0},null,null,{"$f":"G238-H238","v":0}]
[null,"","",null,null,{"$f":"D239-E239","v":0},null,null,{"$f":"G239-H239","v":0}]
[null,"","",null,null,{"$f":"D240-E240","v":0},null,null,{"$f":"G240-H240","v":0}]
[null,"","",null,null,0,null,null,0]
[null,"","",null,null,0,null,null,0]
[null,"To enter further activities - please copy row from above and \"insert copied cells\" into a row above this row. "]
[]
[]
[]
[]
[null,"7.12.3.3 - UNIT COSTS"]
[null,"Activity","Units","AER expected","Actual\n  ","Difference\n  ","Reasons for Difference"]
[null,null,null,"$0's per Unit"]
[null,"Planned non-preferred services replacements","number of services",null,null,{"$f":"D251*$C$8-E251","v":0}]
[null,"Planned replacement of non-preferred services due to height ","number of services",null,null,0]
[null,"Removal of public lighting switchwire ","number of spans removed",null,null,0]
[null,"Replacement of  existing SWER lines with 22kV overhead bare conductor ","kms of SWER",null,null,0]
[null,"Installation of GFN and associated equipment at zone substations ","number of zone substations",null,null,0]
[null,"Replacement of crossarms/insulator sets – pole top fire mitigation","number of crossarms/sets",null,null,0]
[null,"Replacement of crossarms – based on age and condition ","number of crossarms",null,null,0]
[null,"Replacement of poles – based on age and condition ","number of poles",null,null,0]
[null,"Stake poles – based on age and condition ","number of poles",null,null,0]
[null,"Replacement of undersized poles ","number of poles",null,null,0]
[null,"Stake undersized poles","number of poles",null,null,0]
[null,"Replacement of overhead conductor – mainly steel ","kms ",null,null,0]
[null,"Service line clearance – overhead services requiring relocation ","number of services",null,null,0]
[null,"Service line clearance – overhead services requiring undergrounding ","number of services",null,null,0]
[null,"Replacement of 22kV distribution feeders with ABC/underground cabling","number of feeders",null,null,0]
[null,"Replacement of SWER with covered carbon core conductor or equivalent","kms ",null,null,0]
[null,"Replacement of SWER with ABC","kms ",null,null,{"$f":"D267-E267","v":0}]
[null,"Replacement of SWER with underground","kms ",null,null,{"$f":"D268-E268","v":0}]
[null,"Replacement of surge diverters (neptune configuration)","number of units",null,null,0]
[null,"Replacement of surge diverters (single phase or three phase)","number of units",null,null,0]
[null,{"$f":"IF(ISBLANK(B39),\"\",B39)","v":""},{"$f":"IF(ISBLANK(C72),\"\",C72)","v":""},null,null,0]
[null,"","",null,null,0]
[null,"","",null,null,{"$f":"D273-E273","v":0}]
[null,"","",null,null,{"$f":"D274-E274","v":0}]
[null,"","",null,null,{"$f":"D275-E275","v":0}]
[null,"","",null,null,0]
[null,"","",null,null,0]
[null,"To enter further activities - please copy row from above and \"insert copied cells\" into a row above this row. "]
[]
[null,"7.12.3.4 - SAFETY IMPROVEMENT OUTCOMES REPORTED TO ESV"]
[null,"Activity","Units","Safety Improvement Programme - outcomes","Safety Improvement Target","Difference","Reasons for Difference"]
[null,"Planned non-preferred services replacements","number of services",null,null,{"$f":"D282-E282","v":0}]
[null,"Planned replacement of non-preferred services due to height ","number of services",null,null,{"$f":"D283-E283","v":0}]
[null,"Removal of public lighting switchwire ","number of spans removed",null,null,0]
[null,"Replacement of  existing SWER lines with 22kV overhead bare conductor ","kms of SWER",null,null,0]
[null,"Installation of GFN and associated equipment at zone substations ","number of zone substations",null,null,0]
[null,"Replacement of crossarms/insulator sets – pole top fire mitigation","number of crossarms/sets",null,null,0]
[null,"Replacement of crossarms – based on age and condition ","number of crossarms",null,null,0]
[null,"Replacement of poles – based on age and condition ","number of poles",null,null,0]
[null,"Stake poles – based on age and condition ","number of poles",null,null,0]
[null,"Replacement of undersized poles ","number of poles",null,null,0]
[null,"Stake undersized poles","number of poles",null,null,0]
[null,"Replacement of overhead conductor – mainly steel ","kms ",null,null,0]
[null,"Service line clearance – overhead services requiring relocation ","number of services",null,null,0]
[null,"Service line clearance – overhead services requiring undergrounding ","number of services",null,null,0]
[null,"Replacement of 22kV distribution feeders with ABC/underground cabling","number of feeders",null,null,0]
[null,"Replacement of SWER with covered carbon core conductor or equivalent","kms ",null,null,0]
[null,"Replacement of SWER with ABC","kms ",null,null,0]
[null,"Replacement of SWER with underground","kms ",null,null,{"$f":"D299-E299","v":0}]
[null,"Replacement of surge diverters (neptune configuration)","number of units",null,null,0]
[null,"Replacement of surge diverters (single phase or three phase)","number of units",null,null,0]
[null,{"$f":"IF(ISBLANK(B39),\"\",B39)","v":""},{"$f":"IF(ISBLANK(C72),\"\",C72)","v":""},null,null,0]
[null,"","",null,null,0]
[null,"","",null,null,{"$f":"D304-E304","v":0}]
[null,"","",null,null,{"$f":"D305-E305","v":0}]
[null,"","",null,null,{"$f":"D306-E306","v":0}]
[null,"","",null,null,0]
[null,"","",null,null,0]
[null,"To enter further activities - please copy row from above and \"insert copied cells\" into a row above this row. "]
[]
[null,"7.12.3.5 - SAFETY IMPROVEMENT OUTCOMES RECONCILIATION"]
[null,"Activity","Units","Difference","Reasons for Difference"]
[null,"Planned non-preferred services replacements","number of services",{"$f":"D282-E52-E182","v":0}]
[null,"Planned replacement of non-preferred services due to height ","number of services",0]
[null,"Removal of public lighting switchwire ","number of spans removed",0]
[null,"Replacement of  existing SWER lines with 22kV overhead bare conductor ","kms of SWER",0]
[null,"Installation of GFN and associated equipment at zone substations ","number of zone substations",0]
[null,"Replacement of crossarms/insulator sets – pole top fire mitigation","number of crossarms/sets",0]
[null,"Replacement of crossarms – based on age and condition ","number of crossarms",0]
[null,"Replacement of poles – based on age and condition ","number of poles",0]
[null,"Stake poles – based on age and condition ","number of poles",0]
[null,"Replacement of undersized poles ","number of poles",0]
[null,"Stake undersized poles","number of poles",0]
[null,"Replacement of overhead conductor – mainly steel ","kms ",0]
[null,"Service line clearance – overhead services requiring relocation ","number of services",0]
[null,"Service line clearance – overhead services requiring undergrounding ","number of services",0]
[null,"Replacement of 22kV distribution feeders with ABC/underground cabling","number of feeders",0]
[null,"Replacement of SWER with covered carbon core conductor or equivalent","kms ",0]
[null,"Replacement of SWER with ABC","kms ",0]
[null,"Replacement of SWER with underground","kms ",0]
[null,"Replacement of surge diverters (neptune configuration)","number of units",0]
[null,"Replacement of surge diverters (single phase or three phase)","number of units",0]
[null,{"$f":"IF(ISBLANK(B39),\"\",B39)","v":""},{"$f":"IF(ISBLANK(C72),\"\",C72)","v":""},{"$f":"D302-E73-E202","v":0}]
[null,"","",0]
[null,"","",0]
[null,"","",0]
[null,"","",0]
[null,"","",0]
[null,"","",0]
[null,"To enter further activities - please copy row from above and \"insert copied cells\" into a row above this row. "]

{"sheet":"7.13 TARC","index":19,"n_rows":9,"n_cols":3,"rows_kept":9,"cut":false,"hidden":false,"merged":[]}
[null,{"$f":"(LOOKUP(dms_Model,dms_Model_List,dms_Worksheet_List))","v":"REGULATORY REPORTING STATEMENT"}]
[null,{"$f":"dms_TradingName","v":"Endeavour Energy"}]
[null,{"$f":"CONCATENATE(\"Annual Reporting RIN Response \",CRY)","v":"Annual Reporting RIN Response 2014-15"}]
[null,"7.13 - TARC"]
[]
[]
[null,"7.13.1 - TOTAL ANNUAL RETAILER CHARGES"]
[null,null,"$0's"]
[null,"TARC",1303403417.8699999]

{"sheet":"8.1 Income","index":20,"n_rows":40,"n_cols":12,"rows_kept":40,"cut":false,"hidden":false,"merged":[[6,1,9,1],[6,6,6,10],[7,8,7,10],[6,11,8,11],[9,2,9,11],[6,5,8,5],[7,6,7,7],[6,2,8,2],[6,3,8,3],[6,4,8,4]]}
[null,{"$f":"(LOOKUP(dms_Model,dms_Model_List,dms_Worksheet_List))","v":"REGULATORY REPORTING STATEMENT"}]
[null,{"$f":"dms_TradingName","v":"Endeavour Energy"}]
[null,{"$f":"CONCATENATE(\"Annual Reporting RIN Response \",CRY)","v":"Annual Reporting RIN Response 2014-15"}]
[null,"8.1 - INCOME"]
[]
[null,"8.1.1 - INCOME STATEMENT"]
[null,"Description","Audited Statutory Accounts","Adjustments","Distribution business","Standard Control Services","Alternative Control Services",null,null,null,null,"Negotiated Services"]
[null,null,null,null,null,null,"Public Lighting",null,"Other"]
[null,null,null,null,null,null,{"$f":"IF(dms_Jurisdiction=\"Vic\",\"Energy efficient\",\"\")","v":""},{"$f":"IF(dms_Jurisdiction=\"Vic\",\"Non-energy efficient\",\"\")","v":""},"Connection services","Metering services","Ancillary network services"]
[null,null,"$0's, nominal"]
[]
[null,"8.1.1.1 - REVENUE"]
[null,"Distribution revenue",979685248.99356234,0,979685248.99356234,979685248.99356234,0,null,0,0,0]
[null,"Cross boundary revenue",0,0,0,0,0,null,0,0,0]
[null,"Contributions",128863647.73999998,0,128863647.73999998,111969471.25006618,16894176.489933822,null,0,0,0]
[null,"Interest income",120384.05000000002,0,120384.05000000002,120384.05000000002,0,null,0,0,0]
[null,"Jurisdictional scheme amounts",150034885.53999999,0,150034885.53999999,150034885.53999999,0,null,0,0,0]
[null,"Profit from sale of fixed assets",0,0,0,0,0,null,0,0,0]
[null,"TUOS revenue",223356285.76643786,0,223356285.76643786,223356285.76643786,0,null,0,0,0]
[null,"Pass through revenue (F-factor)",0,0,0,0,0,null,0,0,0]
[null,"Other Revenue ",94576727.460000023,-52210333.165616535,42366394.294383489,19951094.825193025,22415299.469190463,null,0,0,0]
[null,"Total revenue",{"$f":"SUM(C13:C21)","v":1576637179.55},-52210333.165616535,1524426846.3843834,1485117370.4252591,39309475.959124282,0,0,0,0,0]
[]
[null,"8.1.1.2 - EXPENDITURE"]
[null,"TUOS expenditure",211038835.72000003,0,211038835.72000003,212821123.72000003,0,null,0,0,0]
[null,"Avoided TUOS expenditure",3081094,0,3081094,1298806,0,null,0,0,0]
[null,"Cross boundary expenditure",0,0,0,0,0,null,0,0,0]
[null,"Depreciation ",209859327.7899999,-4549481.2263174923,205309846.56368241,189094320.09195939,8464031.7271711491,null,0,4657147.2268886901,3094347.5176330502]
[null,"Finance charges",241520065.76999998,0,241520065.76999998,241520065.76999998,0,null,0,0,0]
[null,"Impairment losses",0,0,0,0,0,null,0,0,0]
[null,"Jurisdictional scheme amounts",147217280.40000001,0,147217280.40000001,147217280.40000001,0,null,0,0,0]
[null,"Loss from sale of fixed assets",10731026.859999999,-4212603.3451545602,6518423.5148454402,6447021.4633492464,21763.537025076199,null,0,13810.124135619501,35828.390335512297]
[null,"Maintenance expenditure",241677342.06119895,0,241677342.06119895,241677342.06119895,0,null,0,0,0]
[null,"Operating expenditure excluding maintenance expenditure",24900387.286814578,0,24900387.286814578,24900387.286814578,0,null,0,0,0]
[null,"Other ",138738109.65198654,-43281856.409483396,95456253.242503136,24645862.707815319,13525031.236847963,null,0,17032053.6799451,40253305.617894702]
[]
[null,"8.1.1.3 - PROFIT"]
[null,"Profit before tax (PBT)",{"$f":"C22-SUM(C25:C35)","v":347873710.00999975},-166392.18466108292,347707317.82533884,395495160.92412162,17298649.458080094,0,0,-21703011.030969411,-43383481.525863267,0]
[null,"Income tax expenses (/ benefit)",104232745.72772156,-49855.777472688736,104182889.9502489,118501471.53679213,5183161.8156635603,null,0,-6502832.3935486265,-12998911.008649142]
[null,"Profit after tax",{"$f":"C38-C39","v":243640964.28227818},-116536.40718839419,243524427.87508994,276993689.38732946,12115487.642416533,0,0,-15200178.637420785,-30384570.517214127,{"$f":"L38-L39","v":0}]

{"sheet":"8.2 Capex","index":21,"n_rows":251,"n_cols":10,"rows_kept":251,"cut":false,"hidden":false,"merged":[[43,2,43,5],[6,1,6,4],[7,1,7,4],[8,1,8,4],[10,1,10,4],[14,1,14,4],[16,1,19,1],[16,2,16,9],[17,2,18,2],[17,3,18,3],[17,4,18,4],[17,5,18,5],[17,6,17,9],[19,2,19,3],[19,5,19,9],[41,1,41,4],[55,2,55,5],[44,2,44,5],[45,2,45,5],[46,2,46,5],[47,2,47,5],[48,2,48,5],[49,2,49,5],[50,2,50,5],[51,2,51,5],[52,2,52,5],[53,2,53,5],[54,2,54,5],[56,2,56,5],[57,2,57,5],[58,2,58,5],[62,1,65,1],[62,2,62,9],[63,2,64,2],[63,3,64,3],[63,4,64,4],[63,5,64,5],[63,6,63,9],[65,2,65,3],[65,5,65,9],[81,1,81,2],[83,1,85,1],[83,2,84,2],[83,3,84,3],[83,4,84,4],[83,5,84,5],[85,2,85,3],[197,1,199,1],[197,2,198,2],[197,3,198,3],[197,4,198,4],[199,2,199,3],[140,1,142,1],[140,2,141,2],[140,3,141,3],[140,4,141,4],[142,2,142,3]]}
[null,{"$f":"(LOOKUP(dms_Model,dms_Model_List,dms_Worksheet_List))","v":"REGULATORY REPORTING STATEMENT"}]
[null,{"$f":"dms_TradingName","v":"Endeavour Energy"}]
[null,{"$f":"CONCATENATE(\"Annual Reporting RIN Response \",CRY)","v":"Annual Reporting RIN Response 2015-16"}]
[null,"8.2 - CAPEX"]
[]
[null,"Instructions"]
[null,"Reported expenditure must EXCLUDE capital contributions (except tables 8.2.1 and 8.2.5 which should include all capital contributions)."]
[null,{"$f":"CONCATENATE(\"Forecast expenditure is to be taken from \",dms_TradingName,\"'s \",dms_DeterminationRef,\".\")","v":"Forecast expenditure is to be taken from Endeavour Energy's 2014-19 Distribution Determination."}]
[null,"If allocating based on assumptions then provide method in Basis of Preparation. All adjustments must be explained in Basis of Preparation with supporting documentation attached. "]
[]
[null,"For tables 8.2.1 and 8.2.3:\nReported expenditure must INCLUDE any profit margins or management fees paid directly or indirectly to related party contractors (not including actual incurred expenses of the related party contractor) for the regulatory reporting period.\n\n'Related Party Margin Expenditure' must COMPRISE ONLY profit margins or management fees paid directly or indirectly to related party contractors (not including actual incurred expenses of the related party contractor) for the regulatory reporting period."]
[]
[null,"8.2.1 - CAPEX BY PURPOSE - STANDARD CONTROL SERVICES"]
[]
[null,"Each line item in this table must INCLUDE the capital contributions. Total capital contributions should also be identified in the last item in the table. "]
[]
[null,"Description","EXPENDITURE"]
[null,null,"CPI adjusted Forecast","Actual","Difference","Related Party Margin","Voltage level"]
[null,null,null,null,null,null,"Subtransmission","HV","LV","Other "]
[null,null,"$0's, nominal",null," (%)","$0's, nominal"]
[null,{"$f":"'[3]Final Determination by purpose'!B3","v":"Augmentation"},95734425.067829996,{"$f":"SUM(G21:J21)","v":77025555.850690141},{"$f":"IF(C21=0,1,(D21-C21)/C21*1)","v":-0.19542467825846555},0,59782232.68069014,16289179.396,954143.77399999986,0]
[null,{"$f":"'[3]Final Determination by purpose'!B4","v":"Connections"},15143500.602173962,{"$f":"SUM(G22:J22)","v":12357758},{"$f":"IF(C22=0,1,(D22-C22)/C22*1)","v":-0.18395631732428153},0,0,10290375,2067382.9999999998,0]
[null,{"$f":"'[3]Final Determination by purpose'!B5","v":"Replacement"},177884270.77211195,147290066.06,-0.17198937589769403,0,50602451.408967249,46647027.920706995,43508925.055169851,6531661.6751559032]
[null,{"$f":"'[3]Final Determination by purpose'!B6","v":"Reliability improvement "},4719378.6123213377,5714178.6400000006,0.21079046827932862,0,13325.08,5700853.5600000005,0,0]
[null,{"$f":"'[3]Final Determination by purpose'!B7","v":"Other System Assets"},93120163.768733859,133765778.20103364,0.43648564164088166,0,32197602.260062449,48539603.908266492,37193746.326157406,15834825.706547294]
[null,{"$f":"'[3]Final Determination by purpose'!B8","v":"Non-Network"},50867367.250824213,37488166.350130618,-0.2630212968310604,0,0,0,0,37488166.350130618]
[null,{"$f":"'[3]Final Determination by purpose'!B9","v":"Capitalised overheads"},81467300.814333633,59485361.262901306,-0.2698253082120618,0,0,0,0,59485361.262901306]
[null,null,null,0,1]
[null,null,null,0,1]
[null,null,null,{"$f":"SUM(G30:J30)","v":0},1]
[null,null,null,0,1]
[null,null,null,0,1]
[null,null,null,0,1]
[null,null,null,0,1]
[null,null,null,0,1]
[null,"Capital contributions included in the above",null,0,1]
[null,"Total",{"$f":"SUM(C21:C35)","v":518936406.88832891},473126864.36475569,{"$f":"IF(C37=0,1,(D37-C37)/C37*1)","v":-8.8275830940940478E-2},null,{"$f":"SUM(G21:G35)","v":142595611.42971984},{"$f":"SUM(H21:H35)","v":127467039.78497347},83724198.15532726,119340014.99473512]
[]
[]
[null,"8.2.2 - CAPEX BY PURPOSE - MATERIAL DIFFERENCE EXPLANATION"]
[]
[null,"Where the difference between forecast and actual expenditure shown in table 8.2.1 is a Material Difference please explain the main factors driving the difference."]
[]
[null,"Description","Reason for material difference"]
[null,"Augmentation","$18.7m below the forecast due to lower than expected major projects and HV developments."]
[null,"Connections","$2.8m below the forecast due to lower than expected industrial & commercial and non urban developments."]
[null,"Replacement","$30.6m below the forecast due to lower than expected distribution refurbishment and transmission mains expenditure."]
[null,"Reliability improvement ","$1.0m above the forecast due to higher than expected HV reliability developments"]
[null,"Other System Assets","$40.7m above the forecast due to capital contributions $20.5m and direct capital overheads being reported in the actuals within other system assets $13.1m whereas the forecast for direct capital overheads was within capitalised overheads."]
[null,"Non-Network","$13.4m below the forecast due to buildings $5.2m, information & communication technology $4.0m, motor vehicles $2.5m and furniture & fittings $1.8m"]
[null,"Capitalised overheads","$22.0m below the forecast due to direct capital overheads being reported in the actuals within other system assets $13.1m. The remainder of the variance is due to lower indirect capitalised overheads as a result of a lower eligible operating overhead pool."]
[]
[]
[]
[]
[]
[]
[]
[]
[]
[]
[null,"8.2.3 - CAPEX OTHER"]
[null,null,"EXPENDITURE"]
[null,null,"CPI adjusted Forecast","Actual","Difference","Related Party Margin","Voltage level"]
[null,null,null,null,null,null,"Subtransmission","HV","LV","Other "]
[null,null,"$0's, nominal",null," (%)","$0's, nominal"]
[null,"Public lighting"]
[null,{"$f":"IF(dms_Jurisdiction=\"Vic\",\"Energy Efficient\", \"Total\")","v":"Total"},6400389.2306402456,{"$f":"SUM(G68:J68)","v":10252701.388118099},{"$f":"IF(C68=0,1,((D68-C68)/C68)*1)","v":0.60188716946086385},0,0,0,0,10252701.388118099]
[null,{"$f":"IF(dms_Jurisdiction=\"Vic\",\"Non-energy efficient\", \"\")","v":""},null,{"$f":"SUM(G69:J69)","v":0},{"$f":"IF(C69=0,1,((D69-C69)/C69)*1)","v":1}]
[null,"Alternative Control Services"]
[null,"Connection services",0,{"$f":"SUM(G71:J71)","v":0},{"$f":"IF(C71=0,1,((D71-C71)/C71)*1)","v":1},0,0,0,0,0]
[null,"Metering services",5381102.7225933122,4988426.3455628809,{"$f":"IF(C72=0,1,((D72-C72)/C72)*1)","v":-7.297321706603456E-2},0,0,0,0,4988426.3455628809]
[null,"Ancillary network services",0,0,{"$f":"IF(C73=0,1,((D73-C73)/C73)*1)","v":1},0,0,0,0,0]
[null,"Negotiated Services"]
[null,"Negotiated services",null,{"$f":"SUM(G75:J75)","v":0},{"$f":"IF(C75=0,1,((D75-C75)/C75)*1)","v":1},0,0,0,0,0]
[null,"Total",{"$f":"SUM(C68:C69,C71:C73,C75)","v":11781491.953233559},{"$f":"SUM(D68:D69,D71:D73,D75)","v":15241127.73368098},{"$f":"IF(C76=0,1,((C76-#REF!)/#REF!)*1)","v":{"$error":"#REF!"}},null,{"$f":"SUM(G68:G69,G71:G73,G75)","v":0},{"$f":"SUM(H68:H69,H71:H73,H75)","v":0},{"$f":"SUM(I68:I69,I71:I73,I75)","v":0},{"$f":"SUM(J68:J69,J71:J73,J75)","v":15241127.73368098}]
[]
[]
[]
[null,"8.2.4 - CAPEX BY ASSET CLASS"]
[]
[null,{"$f":"CONCATENATE(dms_TradingName, \" to enter in Table 8.2.4 each Asset Class specified in its current determination as listed in the AER's final decision in its Roll Forward Model and Post-tax Revenue Model and enter information against that Asset Class.\")","v":"Endeavour Energy to enter in Table 8.2.4 each Asset Class specified in its current determination as listed in the AER's final decision in its Roll Forward Model and Post-tax Revenue Model and enter information against that Asset Class."}]
[]
[null,"Asset class","CPI adjusted Forecast","Actual ","Difference","Movements in provisions \nallocated to \nas-incurred capex"]
[]
[null,null,"$0's, nominal",null," (%)","$0's, nominal"]
[null,{"$f":"'[3]Final Det by Asset Class'!C13","v":"Sub-transmission lines and cables"},68137537.693629235,38193108.625128746,{"$f":"IF(C87=0,1,((D87-C87)/C87)*1)","v":-0.43947037245668258},-644742.22988944862]
[null,{"$f":"'[3]Final Det by Asset Class'!C14","v":"Distribution lines and cables"},121096742.02277705,84728589.89329271,-0.30032312613863604,-1430313.0054003554]
[null,{"$f":"'[3]Final Det by Asset Class'!C15","v":"Substations"},150766628.33018291,127493055.49925916,-0.15436819864376095,-2152224.8347160947]
[null,{"$f":"'[3]Final Det by Asset Class'!C16","v":"Transformers"},5549355.546786759,20926588.805143025,2.7709944206512662,-353264.13627746445]
[null,{"$f":"'[3]Final Det by Asset Class'!C17","v":"Low Voltage lines and cables"},17597362.113055553,44766499.554050669,1.5439323954604665,-755708.3931061225]
[null,{"$f":"'[3]Final Det by Asset Class'!C18","v":"Customer metering and Load control"},525535.96443010494,760071.06015851628,0.44627791740712347,-12830.846397211457]
[null,{"$f":"'[3]Final Det by Asset Class'!C19","v":"Communication"},2270889.3155780709,5347686.391140176,1.3548864114404822,-90274.904889639685]
[null,{"$f":"'[3]Final Det by Asset Class'!C20","v":"Land"},8078006.9563818667,1191497.3141287379,-0.85250107847611845,-20113.802276707494]
[null,{"$f":"'[3]Final Det by Asset Class'!C21","v":"Easements"},0,67856.423532918154,1,-1145.4920375910883]
[null,{"$f":"'[3]Final Det by Asset Class'!C22","v":"Equity raising costs"},0,0,1,0]
[null,{"$f":"'[3]Final Det by Asset Class'!C23","v":"Emergency Spares (Major Plant, Excludes Inventory)"},1490031.6812219222,242704.3163234026,-0.83711466045851501,-4097.1192904467907]
[null,{"$f":"'[3]Final Det by Asset Class'!C24","v":"Information & Communication Technology"},15603255.352784205,11633663.527972534,-0.25440792546558866,-196389.20304783847]
[null,{"$f":"'[3]Final Det by Asset Class'!C25","v":"Furniture, fittings, plant and equipment"},4039831.4998413916,2262349.3541066619,-0.43998917920327019,-38190.977897933961]
[null,{"$f":"'[3]Final Det by Asset Class'!C26","v":"Motor Vehicles"},5375071.6776819006,2897006.2270431211,-0.46102928467504478,-48904.693073307113]
[null,{"$f":"'[3]Final Det by Asset Class'!C27","v":"Buildings"},25849208.720516734,20695147.241008252,-0.19938952620308489,-349357.14479337307]
[null,{"$f":"'[3]Final Det by Asset Class'!C28","v":"Land (non-system)"},0,0,1,0]
[null,{"$f":"'[3]Final Det by Asset Class'!C29","v":"Other non system assets"},0,0,1,0]
[null,null,null,null,1]
[null,null,null,null,1]
[null,null,null,null,1]
[null,null,null,null,1]
[null,null,null,null,1]
[null,null,null,null,1]
[null,null,null,null,1]
[null,null,null,null,1]
[null,null,null,null,1]
[null,null,null,null,1]
[null,null,null,null,1]
[null,null,null,null,1]
[null,null,null,null,1]
[null,null,null,null,1]
[null,null,null,null,1]
[null,null,null,null,1]
[null,null,null,null,1]
[null,null,null,null,1]
[null,null,null,null,1]
[null,null,null,null,1]
[null,null,null,null,1]
[null,null,null,null,1]
[null,null,null,null,1]
[null,null,null,null,1]
[null,null,null,null,1]
[null,null,null,null,1]
[null,null,null,null,1]
[null,null,null,null,1]
[null,null,null,null,1]
[null,null,null,null,1]
[null,null,null,null,1]
[null,null,null,null,1]
[null,null,null,null,1]
[null,"Total",{"$f":"SUM(C87:C136)","v":426379456.87486768},{"$f":"SUM(D87:D136)","v":361205824.2322886},-0.15285359458982098,{"$f":"SUM(F87:F136)","v":-6097556.7830935344}]
[]
[]
[null,"8.2.5 - CAPITAL CONTRIBUTIONS BY ASSET CLASS"]
[null,"Asset class","CPI Adjusted Forecast","Actual","Difference"]
[]
[null,null,"$0's, nominal",null," (%)"]
[null,"Subtransmission lines and cables",0,10224770.460000001,{"$f":"IF(C144=0,1,((D144-C144)/C144)*1)","v":1}]
[null,"Distribution lines and cables",0,34728785.508266494,1]
[null,"Substations",0,21972831.800062448,1]
[null,"Transformers",0,2233572.0500000003,1]
[null,"Low voltage lines and cables",0,42524047.534065574,1]
[null,"Customer metering and load control",0,43843.3,1]
[null,"Communications",0,0,1]
[null,"Land",0,178500,1]
[null,"Easements",0,14689.470000000001,1]
[null,null,null,null,1]
[null,null,null,null,1]
[null,null,null,null,1]
[null,null,null,null,1]
[null,null,null,null,1]
[null,null,null,null,1]
[null,null,null,null,1]
[null,null,null,null,1]
[null,{"$f":"IF(ISBLANK(B104),\"\",B104)","v":""},null,null,1]
[null,"",null,null,1]
[null,"",null,null,1]
[null,"",null,null,1]
[null,"",null,null,1]
[null,"",null,null,1]
[null,"",null,null,1]
[null,null,null,null,1]
[null,"",null,null,1]
[null,"",null,null,1]
[null,"",null,null,1]
[null,"",null,null,1]
[null,"",null,null,1]
[null,"",null,null,1]
[null,"",null,null,1]
[null,"",null,null,1]
[null,"",null,null,1]
[null,"",null,null,1]
[null,"",null,null,1]
[null,"",null,null,1]
[null,"",null,null,1]
[null,"",null,null,1]
[null,"",null,null,1]
[null,"",null,null,1]
[null,"",null,null,1]
[null,"",null,null,1]
[null,"",null,null,1]
[null,"",null,null,1]
[null,"",null,null,1]
[null,"",null,null,1]
[null,"",null,null,1]
[null,"",null,null,1]
[null,"",null,null,1]
[null,"Total",{"$f":"SUM(C183:C193)","v":0},{"$f":"SUM(D183:D193)","v":0},1]
[]
[]
[null,"8.2.6 - DISPOSALS BY ASSET CLASS"]
[null,"Asset class","CPI Adjusted Forecast","Actual","Difference"]
[]
[null,null,"$0's, nominal",null," (%)"]
[null,"System assets",0,0,{"$f":"IF(C201=0,1,((D201-C201)/C201)*1)","v":1}]
[null,"Subtransmission lines and cables",0,350516.23638721032,1]
[null,"Distribution lines and cables",0,0,1]
[null,"Substations",0,0,1]
[null,"Transformers",0,441464.19,1]
[null,"Low voltage lines and cables",0,0,1]
[null,"Customer metering and load control",0,0,1]
[null,"Communications",0,0,1]
[null,"Land",0,1515935.7,1]
[null,"Easements",0,0,1]
[null,"Emergency spares (major plant, excludes inventory)",0,0,1]
[null,null,0,0,1]
[null,"Non-system assets",0,0,1]
[null,"Information and communication technology",0,0,1]
[null,"Furniture, fittings, plant and equipment",0,0,1]
[null,"Motor vehicles",0,2095805.2784946985,1]
[null,"Buildings",0,0,1]
[null,"Land (non-system)",0,0,1]
[null,"Other non-system assets",0,0,1]
[null,{"$f":"IF(ISBLANK(B106),\"\",B106)","v":""},null,null,1]
[null,"",null,null,1]
[null,"",null,null,1]
[null,"",null,null,1]
[null,"",null,null,1]
[null,"",null,null,1]
[null,"",null,null,1]
[null,"",null,null,1]
[null,"",null,null,1]
[null,"",null,null,1]
[null,"",null,null,1]
[null,"",null,null,1]
[null,"",null,null,1]
[null,"",null,null,1]
[null,"",null,null,1]
[null,"",null,null,1]
[null,"",null,null,1]
[null,"",null,null,1]
[null,"",null,null,1]
[null,"",null,null,1]
[null,"",null,null,1]
[null,"",null,null,1]
[null,"",null,null,1]
[null,"",null,null,1]
[null,"",null,null,1]
[null,"",null,null,1]
[null,"",null,null,1]
[null,"",null,null,1]
[null,"",null,null,1]
[null,"",null,null,1]
[null,"",null,null,1]
[null,"Total",{"$f":"SUM(C201:C250)","v":0},{"$f":"SUM(D201:D250)","v":4403721.4048819095},1]

{"sheet":"8.4 Opex","index":22,"n_rows":144,"n_cols":14,"rows_kept":144,"cut":false,"hidden":false,"merged":[[6,1,6,4],[14,1,14,5],[16,2,18,2],[16,3,18,3],[16,4,18,4],[12,1,12,5],[7,1,7,4],[13,1,13,5],[16,13,18,13],[77,13,79,13],[19,8,19,13],[17,8,17,9],[78,8,78,9],[78,10,78,12],[17,10,17,12],[16,8,16,12],[77,8,77,12],[19,2,19,6],[139,2,139,7],[140,2,140,7],[141,2,141,7],[137,1,137,4],[16,1,19,1],[77,5,77,7],[17,5,18,5],[17,6,18,6],[17,7,18,7],[16,5,16,7],[75,1,75,4],[77,1,80,1],[77,2,79,2],[77,3,79,3],[77,4,79,4],[80,8,80,13],[78,6,79,6],[78,7,79,7],[142,2,142,7],[143,2,143,7],[80,2,80,4],[78,5,79,5]]}
[null,{"$f":"(LOOKUP(dms_Model,dms_Model_List,dms_Worksheet_List))","v":"REGULATORY REPORTING STATEMENT"}]
[null,{"$f":"dms_TradingName","v":"Endeavour Energy"}]
[null,{"$f":"CONCATENATE(\"Annual Reporting RIN Response \",CRY)","v":"Annual Reporting RIN Response 2014-15"}]
[null,"8.4 OPEX"]
[]
[null,"Instructions"]
[null,{"$f":"CONCATENATE(\"Forecast expenditure is to be taken from \",dms_TradingName,\"'s \",dms_DeterminationRef,\".\")","v":"Forecast expenditure is to be taken from Endeavour Energy's 2014-19 Distribution Determination."}]
[null,"If allocating based on assumptions then provide method in Basis of Preparation.  \n\nAll adjustments must be explained in Basis of Preparation with supporting documentation attached. "]
[]
[null,"8.4.1 - OPERATING & MAINTENANCE EXPENDITURE - BY PURPOSE"]
[]
[]
[null,{"$f":"CONCATENATE(dms_TradingName,\" is to list the operating expenditure categories identified in \", dms_TradingName,\"'s regulatory proposal at table 3.2.1.1 current opex categories and cost allocations.\")","v":"Endeavour Energy is to list the operating expenditure categories identified in Endeavour Energy's regulatory proposal at table 3.2.1.1 current opex categories and cost allocations."}]
[null,{"$f":"CONCATENATE(dms_TradingName, \" must specify any expenditure category where the expense is more than 5 per cent of the total standard control services operating expenditure.\")","v":"Endeavour Energy must specify any expenditure category where the expense is more than 5 per cent of the total standard control services operating expenditure."}]
[null,"Reported operating expenditure must INCLUDE any profit margins or management fees paid directly or indirectly to related party contractors (not including actual incurred expenditure of the related party contractor) for the regulatory reporting period.  "]
[]
[null,"Opex category","Audited Statutory Accounts","Adjustments","Distribution business","Standard Control Services",null,null,"Alternative Control Services",null,null,null,null,"Negotiated Services"]
[null,null,null,null,null,"CPI Adjusted Forecast","Actual","Difference","Public Lighting",null,"Other"]
[null,null,null,null,null,null,null,null,{"$f":"IF(dms_Jurisdiction=\"Vic\",\"Energy efficient\",\"\")","v":""},{"$f":"IF(dms_Jurisdiction=\"Vic\",\"Non-energy efficient\",\"\")","v":""},"Connection services","Metering services","Ancillary network services"]
[null,null,"$0's, nominal",null,null,null,null,"%","$0's, nominal"]
[null,"Vegetation management",38550816.170000002,0,38550816.170000002,32062794.7823378,38550816.170000002,{"$f":"IF(F21=0,1,((G21-F21)/F21)*1)","v":0.20235358245302471},0,null,0,0,0]
[null,"Maintenance",51788341.398346007,0,51788341.398346007,43072472.319405556,51788341.398346007,0.20235358245302459,0,null,0,0,0]
[null,"Emergency response",27014500.483026974,0,27014500.483026974,22468016.794121724,27014500.483026974,0.20235358245302454,0,null,0,0,0]
[null,"Non-network",75433434.397074893,0,75433434.397074893,62738145.831591971,75433434.397074893,0.20235358245302451,0,null,0,0,0]
[null,"network overheads",59431957.499106243,0,59431957.499106243,49429683.885379225,59431957.499106243,0.20235358245302443,0,null,0,0,0]
[null,"corporate overheads",113510722.22827855,0,113510722.22827855,94407106.099934101,113510722.22827855,0.20235358245302448,0,null,0,0,0]
[null,"Metering",17383981.011696421,0,17383981.011696421,0,0,1,0,null,0,17383981.011696421,0]
[null,"Public Lighting",13525031.236848012,0,13525031.236848012,0,0,1,13525031.236848012,null,0,0,0]
[null,"Fee and quoted",40828632.563214362,0,40828632.563214362,0,0,1,0,null,0,0,40828632.563214362]
[null,"Balancing Item",-32151577.98759149,43281856.409483403,-75433434.397074893,-62738145.831591971,-75433434.397074893,0.20235358245302451,0,null,0,0,0]
[null,null,null,null,null,null,null,1]
[null,null,null,null,null,null,null,1]
[null,null,null,null,null,null,null,1]
[null,null,null,null,null,null,null,1]
[null,null,null,null,null,null,null,1]
[null,null,null,null,null,null,null,{"$f":"IF(F36=0,1,((G36-F36)/F36)*1)","v":1}]
[null,null,null,null,null,null,null,1]
[null,null,null,null,null,null,null,1]
[null,null,null,null,null,null,null,1]
[null,null,null,null,null,null,null,1]
[null,null,null,null,null,null,null,1]
[null,null,null,null,null,null,null,{"$f":"IF(F42=0,1,((G42-F42)/F42)*1)","v":1}]
[null,null,null,null,null,null,null,1]
[null,null,null,null,null,null,null,1]
[null,null,null,null,null,null,null,1]
[null,null,null,null,null,null,null,1]
[null,null,null,null,null,null,null,1]
[null,null,null,null,null,null,null,1]
[null,null,null,null,null,null,null,1]
[null,null,null,null,null,null,null,1]
[null,null,null,null,null,null,null,1]
[null,null,null,null,null,null,null,1]
[null,null,null,null,null,null,null,1]
[null,null,null,null,null,null,null,1]
[null,null,null,null,null,null,null,1]
[null,null,null,null,null,null,null,1]
[null,null,null,null,null,null,null,1]
[null,null,null,null,null,null,null,1]
[null,null,null,null,null,null,null,1]
[null,null,null,null,null,null,null,1]
[null,null,null,null,null,null,null,1]
[null,null,null,null,null,null,null,1]
[null,null,null,null,null,null,null,1]
[null,null,null,null,null,null,null,1]
[null,null,null,null,null,null,null,1]
[null,null,null,null,null,null,null,1]
[null,null,null,null,null,null,null,1]
[null,null,null,null,null,null,null,1]
[null,null,null,null,null,null,null,1]
[null,null,null,null,null,null,null,1]
[null,"Total",{"$f":"SUM(C21:C70)","v":405315838.99999988},43281856.409483403,362033982.59051651,241440073.88117838,290296337.77875775,0.20235358245302457,{"$f":"SUM(I21:I70)","v":13525031.236848012},0,0,17383981.011696421,40828632.563214362,0]
[]
[]
[null,"8.4.2 - OPERATING & MAINTENANCE EXPENDITURE - BY PURPOSE - MARGINS ONLY"]
[]
[null,"\"Related party margin expenditure' must COMPRISE ONLY profit margins or management fees paid directly or indirectly to related party contractors (for expenditure that is not an actual incurred expenditure of the related party contractor) for the regulatory reporting period."]
[]
[null,"Opex category","Audited Statutory Accounts","Adjustments","Distribution business","Standard Control Services",null,null,"Alternative Control Services",null,null,null,null,"Negotiated Services"]
[null,null,null,null,null,"CPI Adjusted Forecast","Actual","Difference","Public Lighting",null,"Other"]
[null,null,null,null,null,null,null,null,{"$f":"IF(dms_Jurisdiction=\"Vic\",\"Energy efficient\",\"\")","v":""},{"$f":"IF(dms_Jurisdiction=\"Vic\",\"Non-energy efficient\",\"\")","v":""},"Connection services","Metering services","Ancillary network services"]
[null,null,"$0's, nominal",null,null,null,"$0's, nominal","per cent","$0's, nominal"]
[null,{"$f":"IF(ISBLANK(B21),\"\",B21)","v":"Vegetation management"},0,0,0,0,0,{"$f":"IF(F82=0,1,((G82-F82)/F82)*1)","v":1},0,null,0,0,0]
[null,"Maintenance",0,0,0,0,0,1,0,null,0,0,0]
[null,"Emergency response",0,0,0,0,0,1,0,null,0,0,0]
[null,"Non-network",0,0,0,0,0,1,0,null,0,0,0]
[null,"network overheads",0,0,0,0,0,1,0,null,0,0,0]
[null,"corporate overheads",0,0,0,0,0,1,0,null,0,0,0]
[null,"Metering",0,0,0,0,0,1,0,null,0,0,0]
[null,{"$f":"IF(ISBLANK(B27),\"\",B27)","v":"Metering"},0,0,0,0,0,{"$f":"IF(F89=0,1,((G89-F89)/F89)*1)","v":1},0,null,0,0,0]
[null,"Public Lighting",0,0,0,0,0,1,0,null,0,0,0]
[null,"Fee and quoted",0,0,0,0,0,1,0,null,0,0,0]
[null,"Balancing Item",0,0,0,0,0,1,0,null,0,0,0]
[null,"",null,null,null,null,null,1]
[null,"",null,null,null,null,null,1]
[null,"",null,null,null,null,null,1]
[null,"",null,null,null,null,null,1]
[null,"",null,null,null,null,null,1]
[null,"",null,null,null,null,null,{"$f":"IF(F98=0,1,((G98-F98)/F98)*1)","v":1}]
[null,"",null,null,null,null,null,1]
[null,"",null,null,null,null,null,1]
[null,"",null,null,null,null,null,1]
[null,"",null,null,null,null,null,1]
[null,"",null,null,null,null,null,1]
[null,"",null,null,null,null,null,{"$f":"IF(F104=0,1,((G104-F104)/F104)*1)","v":1}]
[null,"",null,null,null,null,null,1]
[null,"",null,null,null,null,null,1]
[null,"",null,null,null,null,null,1]
[null,"",null,null,null,null,null,1]
[null,"",null,null,null,null,null,1]
[null,"",null,null,null,null,null,1]
[null,"",null,null,null,null,null,1]
[null,"",null,null,null,null,null,1]
[null,"",null,null,null,null,null,1]
[null,"",null,null,null,null,null,1]
[null,"",null,null,null,null,null,1]
[null,"",null,null,null,null,null,1]
[null,"",null,null,null,null,null,1]
[null,"",null,null,null,null,null,1]
[null,"",null,null,null,null,null,1]
[null,"",null,null,null,null,null,1]
[null,"",null,null,null,null,null,1]
[null,"",null,null,null,null,null,1]
[null,"",null,null,null,null,null,1]
[null,"",null,null,null,null,null,1]
[null,"",null,null,null,null,null,1]
[null,"",null,null,null,null,null,1]
[null,"",null,null,null,null,null,1]
[null,"",null,null,null,null,null,1]
[null,"",null,null,null,null,null,1]
[null,"",null,null,null,null,null,1]
[null,"",null,null,null,null,null,1]
[null,null,null,null,null,null,null,1]
[null,"Total",{"$f":"SUM(C82:C132)","v":0},{"$f":"SUM(D82:D132)","v":0},{"$f":"SUM(E82:E132)","v":0},{"$f":"SUM(F82:F132)","v":0},{"$f":"SUM(G82:G132)","v":0},1,{"$f":"SUM(I82:I132)","v":0},{"$f":"SUM(J82:J132)","v":0},0,0,{"$f":"SUM(M82:M132)","v":0},{"$f":"SUM(N82:N132)","v":0}]
[]
[]
[null,"8.4.3 - OPERATING & MAINTENANCE EXPENDITURE - EXPLANATION OF MATERIAL DIFFERENCE"]
[]
[null,"Where the difference between forecast and actual expenditure shown in table 8.4.1, column I is a Material Difference please explain the main factors driving the difference."]
[]
[null,"Category","Explanation"]
[null,"Vegetation management","Vegetation management costs have been driven by higher actual program compliance (preventative maintenance), resulting in a higher expenditure compared to the CPI Adjusted Forecast from the April 2015 AER determination. "]
[null,"Maintenance","Increased spend associated with maintenance and repairs across all activities, in particular the transmission substation, distribution substation and distribution mains maintenance activities is driving the variance compared to the CPI Adjusted Forecast from the April 2015 AER determination. "]
[null,"Emergency response","The increase in emergency response costs have been driven by higher than expected fault and emerency activities across the network compared to the CPI Adjusted Forecast from the April 2015 AER determination. "]
[null,"Non-network","The increase in non-network costs have been driven by higher than expected fleet, IT and property expenditure"]

{"sheet":"9.5 TUoS","index":23,"n_rows":60,"n_cols":6,"rows_kept":60,"cut":false,"hidden":false,"merged":[[57,1,57,4],[51,1,51,4],[19,1,19,4],[20,1,20,4],[59,1,59,4],[53,1,53,4],[48,1,48,4],[58,1,58,4],[40,1,40,4],[44,1,44,4],[45,1,45,4],[46,1,46,4],[47,1,47,4],[41,1,41,4],[42,1,42,4],[43,1,43,4],[50,1,50,4],[54,1,54,4],[52,1,52,4],[55,1,55,4],[56,1,56,4],[5,1,5,3],[21,1,21,3],[24,2,24,5],[36,1,36,4],[25,2,25,5],[24,1,27,1],[9,1,9,4],[10,1,10,4],[11,1,11,4],[12,1,12,4],[17,1,17,4],[18,1,18,4],[13,1,13,3]]}
[null,{"$f":"(LOOKUP(dms_Model,dms_Model_List,dms_Worksheet_List))","v":"REGULATORY REPORTING STATEMENT"}]
[null,{"$f":"dms_TradingName","v":"Endeavour Energy"}]
[null,{"$f":"CONCATENATE(\"Annual Reporting RIN Response \",CRY)","v":"Annual Reporting RIN Response 2014-15"}]
[null,"9.5 - TUoS AUDIT (t-2)"]
[]
[null,"This template collects information for annual pricing proposals from Victorian businesses only.\n"]
[]
[null,"9.5.1 - TUOS CHARGES (AEMO)"]
[null,null,null,null,null,{"$f":"CRY","v":"2014-15"}]
[]
[]
[]
[]
[null,null,null,null,"Total",{"$f":"SUM(F10:F13)","v":0}]
[]
[null,"9.5.2 - TRANSMISSION CONNECTION FEES"]
[null,null,null,null,null,{"$f":"CRY","v":"2014-15"}]
[]
[]
[]
[]
[null,null,null,null,"Total",{"$f":"SUM(F18:F21)","v":0}]
[]
[null,"9.5.3 - CROSS BOUNDARY NETWORK CHARGES"]
[null,"Distribution Business","Amount (payable)/receivable"]
[null,null,"$0's, nominal"]
[null,null,"HV crossings","Subtransmission crossings","TUoS Adjustment","Total"]
[null,null,null,null,null,{"$f":"CRY","v":"2014-15"}]
[null,null,null,null,null,{"$f":"IF((SUM(C29:E29)=0),\"\",(SUM(C29:E29)))","v":""}]
[null,null,null,null,null,{"$f":"IF((SUM(C30:E30)=0),\"\",(SUM(C30:E30)))","v":""}]
[null,null,null,null,null,""]
[null,null,null,null,null,""]
[null,null,null,null,null,""]
[null,null,null,null,null,""]
[null,null,null,null,null,""]
[null,null,null,null,null,""]
[null,"Total",null,null,null,""]
[]
[null,"9.5.4 - PAYMENTS TO EMBEDDED GENERATORS"]
[null,"9.5.4.1 - AVOIDED TRANSMISSION COSTS",null,null,null,{"$f":"CRY","v":"2014-15"}]
[]
[]
[]
[]
[]
[]
[]
[]
[null,"Total",null,null,null,{"$f":"SUM(F41:F48)","v":0}]
[null,"9.5.4.2 - AVOIDED TUoS USAGE CHARGES",null,null,null,{"$f":"CRY","v":"2014-15"}]
[]
[]
[]
[]
[]
[]
[]
[]
[null,"Total",null,null,null,{"$f":"SUM(F51:F58)","v":0}]
[null,"Total payments to embedded generators",null,null,null,{"$f":"F59+F49","v":0}]

{"sheet":"Notes - 8.4.3 table","index":24,"n_rows":12,"n_cols":3,"rows_kept":12,"cut":false,"hidden":false,"merged":[[10,2,10,7],[11,2,11,7],[12,2,12,7],[13,2,13,7],[14,2,14,7],[9,2,9,7],[3,1,3,4],[5,2,5,7],[6,2,6,7],[7,2,7,7],[8,2,8,7]]}
[]
[null,"8.4.3 - OPERATING & MAINTENANCE EXPENDITURE - EXPLANATION OF MATERIAL DIFFERENCE"]
[]
[null,"Where the difference between forecast and actual expenditure shown in table 8.4.1, column I is a Material Difference please explain the main factors driving the difference."]
[]
[null,"Category","Explanation"]
[null,"Vegetation management","Vegetation management costs have been driven by higher actual program compliance (preventative maintenance), resulting in a higher expenditure compared to the CPI Adjusted Forecast from the April 2015 AER determination. "]
[null,"Maintenance","Increased spend associated with maintenance and repairs across all activities, in particular the transmission substation, distribution substation and distribution mains maintenance activities is driving the variance compared to the CPI Adjusted Forecast from the April 2015 AER determination. "]
[null,"Emergency response","The increase in emergency response costs have been driven by higher than expected fault and emerency activities across the network compared to the CPI Adjusted Forecast from the April 2015 AER determination. "]
[null,"Non-network","The increase in non-network costs have been driven by higher than expected fleet, IT and property expenditure"]
[null,"network overheads","Higher than expected overhead costs across all activities primarily driven by labour expenditure compared to the CPI Adjusted Forecast from the April 2015 AER determination. "]
[null,"corporate overheads","Higher than expected overhead costs across all activities primarily driven by labour expenditure compared to the CPI Adjusted Forecast from the April 2015 AER determination. "]