{"text_format":"1","workbook":"xlsx","n_sheets":24,"sheets":["AER only","Contents","Instructions","Business & other details","2.11 Labour","3.6 Quality of services","3.6.8 Network-feeders","3.6.9 Network-reliability","4.1 Public lighting","6.2 STPIS Reliability","6.6 STPIS Customer Service","6.7 STPIS Daily Performance","6.8 STPIS Exclusions","6.9 STPIS - GSL","7.8 Avoided TUOS Payments","7.10 Juris Scheme","7.11 DMIS-DMIA","7.12 Safety and Bushfire","7.13 TARC","8.1 Income","8.2 Capex","8.4 Opex","9.5 TUoS","unlocked"],"not_rendered":{"charts":0,"images":4,"macros":1,"external_links":0,"defined_names":386,"comments":2,"pivot_tables":0},"unopened":[],"bounds":{"document_bytes":16777216,"sheet_cells":100000,"rows_first":2000,"rows_last":500,"rows_between":2000,"halvings":0,"cell_chars":16384,"cell_head_chars":4096},"cells_cut":0,"cells_raw":0,"read":"whole","date_system":"1900"}

{"sheet":"AER only","index":0,"n_rows":74,"n_cols":23,"rows_kept":74,"cut":false,"hidden":true,"merged":[[0,1,0,9],[18,13,18,16]]}
[null,"Data in this worksheet is used for data validation and database purposes."]
[null,"Date last modified:"]
[null,"14 April 2015","merged cell C46/47"]
[null,"17 April 2015","adjusted dms_RYE to automate based on dms_Model (NB: EB & CA refer to CRCP_y5)"]
[null,"14 May 2015","adapted this cover for use in CA & EB RINs"]
[]
[null,"October 2015","added full Trading Name for worksheet headings"]
[null,"USES NAMED RANGES FLAG","yes"]
[null,"dms_Model_List ","dms_Worksheet_List ",null,"dms_RYE_Formula_Result"]
[null,"ARR","REGULATORY REPORTING STATEMENT",null,{"$f":"LEFT(CRY,2)&RIGHT(CRY,2)","v":"2016"}]
[null,"CA","CATEGORY ANALYSIS",null,{"$f":"LEFT(CRY,2)&RIGHT(CRY,2)","v":"2016"}]
[null,"CAM/Service change Backcast","REGULATORY REPORTING STATEMENT",null,{"$f":"LEFT(dms_FRCP_FinalYear_Num,2)&RIGHT(dms_FRCP_FinalYear_Num,2)","v":"2021"}]
[null,"CPI","CPI"]
[null,"EB","ECONOMIC BENCHMARKING",null,{"$f":"LEFT(CRY,2)&RIGHT(CRY,2)","v":"2016"}]
[null,"PTRM","POST TAX REVENUE MODEL",null,{"$f":"LEFT(dms_FRCP_FinalYear_Num,2)&RIGHT(dms_FRCP_FinalYear_Num,2)","v":"2021"}]
[null,"Reset","REGULATORY REPORTING STATEMENT",null,{"$f":"LEFT(dms_FRCP_FinalYear_Num,2)&RIGHT(dms_FRCP_FinalYear_Num,2)","v":"2021"}]
[null,"RFM","ROLL FORWARD MODEL",null,{"$f":"LEFT(dms_CRCP_FinalYear_Num,2)&RIGHT(dms_CRCP_FinalYear_Num,2)","v":"2015"}]
[null,"WACC","WEIGHTED AVERAGE COST OF CAPITAL"]
[null,null,null,null,null,null,null,null,null,null,null,null,null,"Feeder Types",null,null,null,"TasNetworks (D)"]
[null,null,null,null,null,null,null,null,null,null,null,null,null,"CBD","Urban","Short rural","long rural","EXTRA"]
[null,"dms_TradingName_List","dms_TradingNameFull_List","dms_ABN_List","dms_State_List","dms_Sector_List","dms_Segment_List","dms_FormControl_List","dms_CRCPlength_List","dms_FRCPlength_List","dms_JurisdictionList","dms_663_List","dms_DeterminationRef_List","dms_CBD_flag","dms_Urban_flag","dms_ShortRural_flag","dms_LongRural_flag","dms_FeederType_5_flag","dms_FeederName_1","dms_FeederName_2","dms_FeederName_3","dms_FeederName_4","dms_FeederName_5"]
[null,"ActewAGL Distribution","ActewAGL Distribution",76670568688,"ACT","Electricity","Distribution","Revenue cap",5,6,"ACT",5,"2014-19 Distribution Determination","NO","YES","YES","NO","NO","CBD","Urban","Short rural","Long rural"]
[null,"ActewAGL Distribution (Tx Assets)","ActewAGL Distribution (Tx Assets)",76670568688,"ACT","Electricity","Distribution","Revenue cap",5,5,"ACT",5,"distribution determination",null,null,null,null,null,"CBD","Urban","Short rural","Long rural"]
[null,"AGN","AGN",78551685,"SA","Gas","Distribution","Revenue cap",5,5,"SA",5,"distribution determination",null,null,null,null,null,"CBD","Urban","Short rural","Long rural"]
[null,"Ausgrid","Ausgrid",67505337385,"NSW","Electricity","Distribution","Revenue cap",5,5,"NSW",5,"2014-19 Distribution Determination","YES","YES","YES","YES","NO","CBD","Urban","Short rural","Long rural"]
[null,"Ausgrid (Tx Assets)","Ausgrid (Tx Assets)",67505337385,"NSW","Electricity","Distribution","Revenue cap",5,5,"NSW",5,"distribution determination",null,null,null,null,null,"CBD","Urban","Short rural","Long rural"]
[null,"AusNet (D)","AusNet Electricity Services",91064651118,"Vic","Electricity","Distribution","Revenue cap",5,5,"Vic",2,"2016-20 Distribution Determination","NO","YES","YES","YES","NO","CBD","Urban","Short rural","Long rural"]
[null,"AusNet (T)","AusNet (T)",48116124362,"Vic","Electricity","Transmission","Revenue cap",5,5,"Vic",2,"distribution determination",null,null,null,null,null,"CBD","Urban","Short rural","Long rural"]
[null,"Australian Distribution Co.","Australian Distribution Co.",11222333444,"-","Electricity","Distribution","Revenue cap",5,5,"NSW",2,"distribution determination",null,null,null,null,null,"CBD","Urban","Short rural","Long rural"]
[null,"Australian Transmission Co.","Australian Transmission Co.",11222333444,"-","Electricity","Transmission","Revenue cap",5,5,"Vic",5,"distribution determination",null,null,null,null,null,"CBD","Urban","Short rural","Long rural"]
[null,"CitiPower","CitiPower",76064651056,"Vic","Electricity","Distribution","Revenue cap",5,5,"Vic",2,"2016-20 Distribution Determination","YES","YES","NO","NO","NO","CBD","Urban","Short rural","Long rural"]
[null,"Directlink","Directlink",16779340889,"NSW","Electricity","Transmission","Revenue cap",10,5,"Qld",5,"distribution determination",null,null,null,null,null,"CBD","Urban","Short rural","Long rural"]
[null,"ElectraNet","ElectraNet",41094482416,"SA","Electricity","Transmission","Revenue cap",5,5,"SA",5,"distribution determination",null,null,null,null,null,"CBD","Urban","Short rural","Long rural"]
[null,"Endeavour Energy","Endeavour Energy",59253130878,"NSW","Electricity","Distribution","Revenue cap",5,5,"NSW",5,"2014-19 Distribution Determination","NO","YES","YES","YES","NO","CBD","Urban","Short rural","Long rural"]
[null,"Energex","Energex",40078849055,"Qld","Electricity","Distribution","Revenue cap",5,5,"Qld",5,"2015-20 Distribution Determination","YES","YES","YES","NO","NO","CBD","Urban","Short rural","Long rural"]
[null,"Ergon Energy","Ergon Energy",50087646062,"Qld","Electricity","Distribution","Revenue cap",5,5,"Qld",5,"2015-20 Distribution Determination","NO","YES","YES","YES","NO","CBD","Urban","Short rural","Long rural"]
[null,"Essential Energy","Essential Energy",37428185226,"NSW","Electricity","Distribution","Revenue cap",5,5,"NSW",5,"2014-19 Distribution Determination","NO","YES","YES","YES","NO","CBD","Urban","Short rural","Long rural"]
[null,"Jemena Electricity","Jemena Electricity",82064651083,"Vic","Electricity","Distribution","Revenue cap",5,5,"Vic",2,"2016-20 Distribution Determination","NO","YES","YES","NO","NO","CBD","Urban","Short rural","Long rural"]
[null,"Murraylink","Murraylink",79181207909,"NSW","Electricity","Transmission","Revenue cap",5,5,"SA",5,"distribution determination",null,null,null,null,null,"CBD","Urban","Short rural","Long rural"]
[null,"Powercor Australia","Powercor Australia",89064651109,"Vic","Electricity","Distribution","Revenue cap",5,5,"Vic",2,"2016-20 Distribution Determination","NO","YES","YES","YES","NO","CBD","Urban","Short rural","Long rural"]
[null,"Powerlink","Queensland Electricity Transmission Corporation Limited trading as Powerlink Queensland",82078849233,"Qld","Electricity","Transmission","Revenue cap",5,5,"Qld",5,"distribution determination",null,null,null,null,null,"CBD","Urban","Short rural","Long rural"]
[null,"Qld,SA &ACT Gas Reset","Qld,SA &ACT Gas Reset",22222222222,"-","Gas","Distribution","?",5,5,"-","x","distribution determination",null,null,null,null,null,"CBD","Urban","Short rural","Long rural"]
[null,"SA Power Networks","SA Power Networks",13332330749,"SA","Electricity","Distribution","Revenue cap",5,5,"SA",5,"2015-20 Distribution Determination","YES","YES","YES","YES","NO","CBD","Urban","Short rural","Long rural"]
[null,"TasNetworks (D)","TasNetworks (D)",24167357299,"Tas","Electricity","Distribution","Revenue cap",5,5,"Tas",5,"distribution determination","YES","YES","YES","YES","YES","Critical Infrastructure","High density commercial","Urban","High density rural","Low density rural"]
[null,"TasNetworks (T)","TasNetworks (T)",24167357299,"Tas","Electricity","Transmission","Revenue cap",5,5,"Tas",5,"distribution determination",null,null,null,null,null,"CBD","Urban","Short rural","Long rural"]
[null,"TransGrid","TransGrid",19622755774,"NSW","Electricity","Transmission","Revenue cap",5,5,"NSW",5,"distribution determination",null,null,null,null,null,"CBD","Urban","Short rural","Long rural"]
[null,"United Energy","United Energy",70064651029,"Vic","Electricity","Distribution","Revenue cap",5,5,"Vic",2,"2016-20 Distribution Determination","NO","YES","YES","NO","NO","CBD","Urban","Short rural","Long rural"]
[null,"DNSP Backcasting","Victorian DNSP Backcasting",33333333666,"Vic","Electricity","Distribution","?",5,5,"-","x","distribution determination",null,null,null,null,null,"CBD","Urban","Short rural","Long rural"]
[null,"DNSP Reset ","Victorian DNSP Reset ",33333333333,"Vic","Electricity","Distribution","?",5,5,"-","x","distribution determination",null,null,null,null,null,"CBD","Urban","Short rural","Long rural"]
[]
[]
[]
[]
[null,"dms_SourceList","dms_FormControl_Choices",null,"dms_FRCPlength_Num_List","dms_FinalYear_List"]
[null,"After appeal","Revenue cap",null,1,"FRCP_y1"]
[null,"Draft decision","Revenue yield",null,2,"FRCP_y2"]
[null,"Final decision","Weighted average price cap",null,3,"FRCP_y3"]
[null,"Pass through decision",null,null,4,"FRCP_y4"]
[null,"PTRM annual update",null,null,5,"FRCP_y5"]
[null,"PTRM interim update 1",null,null,6,"FRCP_y6"]
[null,"PTRM interim update 2",null,null,7,"FRCP_y7"]
[null,"PTRM interim update 3",null,null,8,"FRCP_y8"]
[null,"PTRM interim update 4",null,null,9,"FRCP_y9"]
[null,"Regulatory proposal",null,null,10,"FRCP_y10"]
[null,"Reporting"]
[null,"Revised regulatory proposal"]
[null,"RFM annual update"]
[null,"WACC annual update"]
[]
[]
[null,"Notes"]
[null,"RFM - Base year is usually CRCP_y1","EG. Victorian 2016-20 - base year = 2011"]
[null,"RFM - Form of Control Field is not relevant"]
[null,"PTRM - capture base year input by NSP","=PTRM input'!Q7"]

{"sheet":"Contents","index":1,"n_rows":31,"n_cols":4,"rows_kept":31,"cut":false,"hidden":false,"merged":[[2,1,2,3],[3,1,3,3],[4,1,4,3]]}
[]
[]
[null,{"$f":"CONCATENATE(dms_Segment,\" Network Service Provider\")","v":"Distribution Network Service Provider"}]
[null,"Annual Reporting RIN Template"]
[null,"Table of Contents"]
[]
[]
[null,null,"Instructions"]
[null,null,"Business & other details"]
[]
[]
[null,"CATEGORY ANALYSIS","STPIS","STATUTORY ACCOUNTS"]
[]
[null,"2.11 Labour","6.2 STPIS Reliability","8.1 Income"]
[null,null,"6.6 STPIS Customer Service","8.2 Capex"]
[null,null,"6.7 STPIS Daily Performance"]
[null,null,"6.8 STPIS Exclusions","8.4 Opex"]
[null,null,"6.9 STPIS GSL"]
[]
[]
[]
[null,"NETWORK PERFORMANCE","OTHER INFORMATION","PRICING PROPOSAL"]
[null,null,null,"Victorian Businesses Only"]
[null,"3.6 Quality of services","7.8 Avoided Cost Payments"]
[null,"3.6.8 Network-feeders","7.10 Juris Scheme","9.5 TUoS"]
[null,"3.6.9 Network-reliability","7.11 DMIS-DMIA"]
[null,null,"7.12 Safety and Bushfire"]
[null,null,"7.13 TARC"]
[null,"PUBLIC LIGHTING"]
[]
[null,"4.1 Public lighting tariffs"]

{"sheet":"Instructions","index":2,"n_rows":26,"n_cols":6,"rows_kept":26,"cut":false,"hidden":false,"merged":[[17,2,17,4],[19,2,19,4],[25,2,25,4],[7,1,7,5],[8,1,8,5],[14,2,14,4],[10,2,10,4],[16,2,16,3]]}
[]
[]
[]
[]
[]
[]
[]
[null,{"$f":"CONCATENATE(dms_Segment,\" Network Service Provider\")","v":"Distribution Network Service Provider"}]
[null,"Annual Reporting RIN Template"]
[]
[null,null,{"$f":"CONCATENATE(\"This template is to be used by \",dms_TradingName, \" to fulfil its annual reporting obligations to the AER.\")","v":"This template is to be used by Energex to fulfil its annual reporting obligations to the AER."}]
[null,null,null,null,null,"Amendments made December 2015"]
[null,null,null,null,null,"Click here for details."]
[null,null,"INSTRUCTIONS"]
[null,null,"Complete the Business & other details worksheet before entering data or values in any other worksheets. The Business & other details worksheet is linked to other cells within the workbook and automatically generates certain column headings and conditional formatting."]
[]
[null,null,"Identifying CONFIDENTIAL INFORMATION:\n\nPlease use the macro at the top of each \nworksheet to identify confidential information. \n\n"]
[null,null,"-Do this by selecting the cell or cells that contain confidential information and then run the Mark selected cells as CONFIDENTIAL macro. This will format the cells a specific colour that is identified by the AER's database which in turn marks that information as confidential.\n\n-To reverse this, select the cell or cells and run the Return cells to NON-CONFIDENTIAL macro"]
[]
[null,null,"All amounts are to be unrounded and reported in nominal terms on a one for one basis: that is 1000 is to be entered as '1000' not '1' as in previous templates.\n\nColour coding of input sheets:"]
[null,null,null,"Yellow = Input cells"]
[null,null,null,"Grey = Not applicable/No inputs required"]
[null,null,null,"Leave coloured cells blank if no information exists. \nPLEASE DO NOT ENTER TEXT into cells that are to contain numeric data."]
[]
[]
[null,null,"Returning completed responses\n\nPlease return two (2) files to the AER: \n1. A confidential version which must contain a complete set of all responses with confidential information marked using the Mark selected cells CONFIDENTIAL macro and which has been completed using the locked template file provided by the AER. \n\n2. A public version with confidential information either removed completely or aggregated in some form together with writtten consent to disclose the public version of the response.\n\nUse the drop down box on the Business and other details worksheet to identify the file as either confidential ('consolidated') or public. "]

{"sheet":"Business & other details","index":3,"n_rows":78,"n_cols":13,"rows_kept":78,"cut":false,"hidden":false,"merged":[[6,2,6,9],[11,2,11,9],[32,2,32,9],[28,6,28,7],[29,6,29,7],[19,3,19,4],[22,3,22,4],[17,3,17,4],[24,3,24,4],[28,3,28,4],[29,3,29,4],[30,3,30,4],[17,5,17,8],[18,5,18,8],[19,5,19,8],[22,5,22,8],[13,3,13,4],[14,3,14,4],[30,6,30,7],[71,4,71,9],[48,3,48,4],[50,3,50,9],[23,5,23,8],[24,5,24,8]]}
[null,null,{"$f":"(LOOKUP(dms_Model,dms_Model_List,dms_Worksheet_List))","v":"REGULATORY REPORTING STATEMENT"}]
[null,null,{"$f":"dms_TradingName","v":"Energex"}]
[null,null,{"$f":"CONCATENATE(\"Annual Reporting RIN Response \",CRY)","v":"Annual Reporting RIN Response 2015-16"}]
[null,null,"BUSINESS & OTHER DETAILS"]
[]
[null,null,"Instructions"]
[null,null,"Complete the following business details regulatory template before entering data or values in any other regulatory templates. This regulatory template is linked to other cells within these worksheets and is used to automatically generate some column headings and to apply conditional formatting to certain cells."]
[]
[]
[null,null,"SUBMISSION PARTICULARS INPUT SHEETS"]
[]
[null,null,"ENTITY DETAILS"]
[]
[null,null,"Short name","Energex"]
[null,null,"ACN / ABN",{"$f":"INDEX(dms_ABN_List,MATCH(dms_TradingName,dms_TradingName_List))","v":40078849055}]
[]
[]
[null,null,"Business address","Address 1",null,"26 Reddacliff Street"]
[null,null,null,null,"Address 2"]
[null,null,null,"Suburb",null,"Newstead"]
[null,null,null,null,"State",{"$f":"INDEX(dms_State_List,MATCH(dms_TradingName,dms_TradingName_List))","v":"Qld"},"p/code",4006]
[]
[null,null,"Postal address","Address 1",null,"GPO Box 1461"]
[null,null,null,null,"Address 2"]
[null,null,null,"Suburb",null,"Brisbane"]
[null,null,null,null,"State","Qld","p/code",4001]
[]
[]
[null,null,"Contact name/s","Nicola Roscoe",null,null,"Rachel Leaver"]
[null,null,"Contact phone/s","(07) 3664 5891",null,null,"(07) 3664 4115"]
[null,null,"Contact email address/s","nicolaroscoe@energex.com.au",null,null,"rachelleaver@energex.com.au"]
[]
[null,null,"REGULATORY CONTROL PERIODS"]
[]
[null,null,"Forthcoming regulatory control period","2016-17",{"$f":"IF(dms_RPT=\"financial\",VALUE(LEFT(FRCP_y1,4)+1)&\"-\"&VALUE(MID(FRCP_y1,3,2)+2),VALUE(LEFT(FRCP_y1,4)+1))","v":"2017-18"},{"$f":"IF(dms_RPT=\"financial\",VALUE(LEFT(FRCP_y2,4)+1)&\"-\"&VALUE(MID(FRCP_y2,3,2)+2),VALUE(LEFT(FRCP_y2,4)+1))","v":"2018-19"},{"$f":"IF(dms_RPT=\"financial\",VALUE(LEFT(FRCP_y3,4)+1)&\"-\"&VALUE(MID(FRCP_y3,3,2)+2),VALUE(LEFT(FRCP_y3,4)+1))","v":"2019-20"},{"$f":"IF(dms_RPT=\"financial\",VALUE(LEFT(FRCP_y4,4)+1)&\"-\"&VALUE(MID(FRCP_y4,3,2)+2),VALUE(LEFT(FRCP_y4,4)+1))","v":"2020-21"},{"$f":"IF(dms_RPT=\"financial\",VALUE(LEFT(FRCP_y5,4)+1)&\"-\"&VALUE(MID(FRCP_y5,3,2)+2),VALUE(LEFT(FRCP_y5,4)+1))","v":"2021-22"},{"$f":"IF(dms_RPT=\"financial\",VALUE(LEFT(FRCP_y6,4)+1)&\"-\"&VALUE(MID(FRCP_y6,3,2)+2),VALUE(LEFT(FRCP_y6,4)+1))","v":"2022-23"},{"$f":"IF(dms_RPT=\"financial\",VALUE(LEFT(FRCP_y7,4)+1)&\"-\"&VALUE(MID(FRCP_y7,3,2)+2),VALUE(LEFT(FRCP_y7,4)+1))","v":"2023-24"},{"$f":"IF(dms_RPT=\"financial\",VALUE(LEFT(FRCP_y8,4)+1)&\"-\"&VALUE(MID(FRCP_y8,3,2)+2),VALUE(LEFT(FRCP_y8,4)+1))","v":"2024-25"},{"$f":"IF(dms_RPT=\"financial\",VALUE(LEFT(FRCP_y9,4)+1)&\"-\"&VALUE(MID(FRCP_y9,3,2)+2),VALUE(LEFT(FRCP_y9,4)+1))","v":"2025-26"}]
[]
[]
[null,null,"Current regulatory control period",{"$f":"IF(dms_RPT=\"financial\",VALUE(LEFT(CRCP_y2,4)-1)&\"-\"&TEXT(VALUE(RIGHT(CRCP_y2,2)-1),\"0#\"),VALUE(LEFT(CRCP_y2,4)-1))","v":"2011-12"},{"$f":"IF(dms_RPT=\"financial\",VALUE(LEFT(CRCP_y3,4)-1)&\"-\"&TEXT(VALUE(RIGHT(CRCP_y3,2)-1),\"0#\"),VALUE(LEFT(CRCP_y3,4)-1))","v":"2012-13"},{"$f":"IF(dms_RPT=\"financial\",VALUE(LEFT(CRCP_y4,4)-1)&\"-\"&TEXT(VALUE(RIGHT(CRCP_y4,2)-1),\"0#\"),VALUE(LEFT(CRCP_y4,4)-1))","v":"2013-14"},{"$f":"IF(dms_RPT=\"financial\",VALUE(LEFT(CRCP_y5,4)-1)&\"-\"&TEXT(VALUE(RIGHT(CRCP_y5,2)-1),\"0#\"),VALUE(LEFT(CRCP_y5,4)-1))","v":"2014-15"},{"$f":"IF(dms_RPT=\"financial\",VALUE(LEFT(FRCP_y1,4)-1)&\"-\"&TEXT(VALUE(RIGHT(FRCP_y1,2)-1),\"0#\"),VALUE(LEFT(FRCP_y1,4)-1))","v":"2015-16"}]
[]
[]
[null,null,"Previous regulatory control period",{"$f":"IF(dms_RPT=\"financial\",VALUE(LEFT(PRCP_y2,4)-1)&\"-\"&TEXT(VALUE(MID(PRCP_y2,3,2)),\"0#\"),VALUE(LEFT(PRCP_y2,4)-1))","v":"2006-07"},{"$f":"IF(dms_RPT=\"financial\",VALUE(LEFT(PRCP_y3,4)-1)&\"-\"&TEXT(VALUE(MID(PRCP_y3,3,2)),\"0#\"),VALUE(LEFT(PRCP_y3,4)-1))","v":"2007-08"},{"$f":"IF(dms_RPT=\"financial\",VALUE(LEFT(PRCP_y4,4)-1)&\"-\"&TEXT(VALUE(MID(PRCP_y4,3,2)),\"0#\"),VALUE(LEFT(PRCP_y4,4)-1))","v":"2008-09"},{"$f":"IF(dms_RPT=\"financial\",VALUE(LEFT(PRCP_y5,4)-1)&\"-\"&TEXT(VALUE(RIGHT(PRCP_y5,2)-1),\"0#\"),VALUE(LEFT(PRCP_y5,4)-1))","v":"2009-10"},{"$f":"IF(dms_RPT=\"financial\",VALUE(LEFT(CRCP_y1,4)-1)&\"-\"&TEXT(VALUE(RIGHT(CRCP_y1,2)-1),\"0#\"),VALUE(LEFT(CRCP_y1,4)-1))","v":"2010-11"}]
[]
[]
[null,null,"Current regulatory year","2015-16"]
[]
[]
[]
[]
[null,null,"Source","Reporting"]
[null,null,"Consolidated confidential or public version?","Consolidated"]
[null,null,"Amended RIN submission - amendment reason"]
[null,null,"EBSS - First application of scheme in forthcoming period?","No"]
[null,null,"Sector",{"$f":"INDEX(dms_Sector_List,MATCH(dms_TradingName,dms_TradingName_List))","v":"Electricity"},"dms_Sector","=INDEX(dms_Sector_List,MATCH(dms_TradingName,dms_TradingName_List))"]
[null,null,"Segment",{"$f":"INDEX(dms_Segment_List,MATCH(dms_TradingName,dms_TradingName_List))","v":"Distribution"},"dms_Segment","=INDEX(dms_Segment_List,MATCH(dms_TradingName,dms_TradingName_List))"]
[null,null,"Regulatory Year Ending",{"$f":"INDEX(dms_RYE_Formula_Result,MATCH(dms_Model,dms_Model_List))","v":"2016"},"dms_RYE","=INDEX(dms_RYE_Formula_Result,MATCH(dms_Model,dms_Model_List))"]
[null,null,"Reporting Period Type",{"$f":"IF(LEN(FRCP_y1)>4,\"Financial\",\"Calendar\")","v":"Financial"},"dms_RPT","=IF(LEN(FRCP_y1)>4,\"Financial\",\"Calendar\")"]
[null,null,"Model or RIN Type","ARR","dms_Model"]
[null,null,"Security Classification","Public","dms_Classification"]
[null,null,"Template - version no.",5,"dms_TemplateNumber"]
[null,null,"Dollar $ real  (the last month before the FRCP_y1)",{"$f":"CONCATENATE(IF(dms_RPT=\"Financial\",\"June \",\"December \"),VALUE((LEFT(FRCP_y1,2))&RIGHT(FRCP_y1,2))-1)","v":"June 2016"},"dms_DollarReal","=CONCATENATE(IF(dms_RPT=\"Financial\",\"June \",\"December \"),VALUE((LEFT(FRCP_y1,2))&RIGHT(FRCP_y1,2))-1)"]
[null,null,"Form of control",{"$f":"INDEX(dms_FormControl_List,MATCH(dms_TradingName,dms_TradingName_List))","v":"Revenue cap"},"dms_FormControl","=INDEX(dms_FormControl_List,MATCH(dms_TradingName,dms_TradingName_List))"]
[null,null,"RIN response - version no.",1,"dms_RINversion"]
[null,null,"Jurisdiction",{"$f":"INDEX(dms_JurisdictionList,MATCH(dms_TradingName,dms_TradingName_List))","v":"Qld"},"dms_Jurisdiction","=INDEX(dms_JurisdictionList,MATCH(dms_TradingName,dms_TradingName_List))"]
[null,null,"Length of current reg control period",{"$f":"INDEX(dms_CRCPlength_List,MATCH(dms_TradingName,dms_TradingName_List))","v":5},"dms_CRCPlength","=INDEX(dms_CRCPlength_List,MATCH(dms_TradingName,dms_TradingName_List))"]
[null,null,"Length of forthcoming reg control period",{"$f":"INDEX(dms_FRCPlength_List,MATCH(dms_TradingName,dms_TradingName_List))","v":5},"dms_FRCPlength","=INDEX(dms_FRCPlength_List,MATCH(dms_TradingName,dms_TradingName_List))"]
[null,null,"FRCP length in years",{"$f":"INDEX(dms_FRCPlength_List,MATCH(dms_TradingName,dms_TradingName_List))","v":5},"dms_FRCPlength_Num","=INDEX(dms_FRCPlength_List,MATCH(dms_TradingName,dms_TradingName_List))"]
[null,null,"FRCP Final Year Reference",{"$f":"INDEX(dms_FinalYear_List,MATCH(dms_FRCPlength_Num,dms_FRCPlength_Num_List))","v":"FRCP_y5"},"dms_FRCP_FinalYear","=INDEX(dms_FinalYear_List,MATCH(dms_FRCPlength_Num,dms_FRCPlength_Num_List))"]
[null,null,"FRCP Final Year",{"$f":"INDIRECT(dms_FRCP_FinalYear)","v":"2020-21"},"dms_FRCP_FinalYear_Num","=INDIRECT(dms_FRCP_FinalYear)"]
[null,null,"CRCP length in years",5,"dms_CRCPlength_Num","=INDEX(dms_CRCPlength_List,MATCH(dms_TradingName,dms_TradingName_List))"]
[null,null,"CRCP Final Year Reference","CRCP_y5","dms_CRCP_FinalYear","=INDEX(dms_CFinalYear_List,MATCH(dms_CRCPlength_Num,dms_CRCPlength_Num_List))"]
[null,null,"CRCP Final Year","2014-15","dms_CRCP_FinalYear_Num","=INDIRECT(dms_CRCP_FinalYear)"]
[null,null,"Backcast templates only - unit of measure ","$0s","If the cover sheet is for Backcast data ensure to apply dms_Backcast_UOM named range to this field. Otherwise, do not apply this named range."]
[null,null,"Table 6.6.3 - Public lighting repair - no. business days",{"$f":"INDEX(dms_663_List,MATCH(dms_TradingName,dms_TradingName_List))","v":5}]
[null,null,"Distribution Determination Reference",{"$f":"INDEX(dms_DeterminationRef_List,MATCH(dms_TradingName,dms_TradingName_List))","v":"2015-20 Distribution Determination"},"=dms_DeterminationRef"]
[null,null,"CBD Feeder for this business",{"$f":"INDEX(dms_CBD_flag,MATCH(dms_TradingName,dms_TradingName_List))","v":"YES"},"dms_CBD_flag_NSP"]
[null,null,"Urban Feeder for this business",{"$f":"INDEX(dms_Urban_flag,MATCH(dms_TradingName,dms_TradingName_List))","v":"YES"},"dms_Urban_flag_NSP"]
[null,null,"Short rural Feeder for this business",{"$f":"INDEX(dms_ShortRural_flag,MATCH(dms_TradingName,dms_TradingName_List))","v":"YES"},"dms_ShortRural_flag_NSP"]
[null,null,"Long rural Feeder for this business",{"$f":"INDEX(dms_LongRural_flag,MATCH(dms_TradingName,dms_TradingName_List))","v":"NO"},"dms_LongRural_flag_NSP"]

{"sheet":"2.11 Labour","index":4,"n_rows":36,"n_cols":4,"rows_kept":36,"cut":false,"hidden":false,"merged":[]}
[null,{"$f":"(LOOKUP(dms_Model,dms_Model_List,dms_Worksheet_List))","v":"REGULATORY REPORTING STATEMENT"}]
[null,{"$f":"dms_TradingName","v":"Energex"}]
[null,{"$f":"CONCATENATE(\"Annual Reporting RIN Response \",CRY)","v":"Annual Reporting RIN Response 2015-16"}]
[null,"2.11 LABOUR "]
[]
[null,"Tables 2.11.1 and 2.11.2 deliberately omitted."]
[]
[null,"2.11.3 - LABOUR / NON-LABOUR EXPENDITURE SPLIT"]
[null,"2.11.3.1 - Opex"]
[null,null,{"$f":"CRY","v":"2015-16"}]
[null,null,"$0's, nominal"]
[null,null,"Opex "]
[null,"In-house labour expenditure",167789232.06131816]
[null,"Labour expenditure outsourced to related parties",897858.83055351151]
[null,"Labour expenditure outsourced to unrelated parties",90764749.660775959]
[null,"Controllable non-labour expenditure",76720085.557977006]
[null,"Uncontrollable non-labour expenditure",12463415.662362184]
[null,"Total",{"$f":"SUM(C13:C17)","v":348635341.77298677}]
[]
[null,"Reconciliation with Opex worksheets - SCS","Opex"]
[null,"Total including margins",{"$f":"dms_Total_Actual_Opex","v":348635341.77298665},{"$f":"IF(C18=dms_Total_Actual_Opex,\"OK\",\"Error\")","v":"OK"}]
[]
[]
[null,"2.11.3.2 - Capex"]
[null,null,{"$f":"CRY","v":"2015-16"}]
[null,null,"$0's, nominal"]
[null,null,"Capex"]
[null,"In-house labour expenditure",192723810.27000001]
[null,"Labour expenditure outsourced to related parties",2365392.2799999998]
[null,"Labour expenditure outsourced to unrelated parties",135837347.25999999]
[null,"Controllable non-labour expenditure",270469408.01999998]
[null,"Uncontrollable non-labour expenditure",7176328.3600000003]
[null,"Total",{"$f":"SUM(C28:C32)","v":608572286.18999994}]
[]
[null,"Reconciliation with Capex & Opex worksheets - SCS","Capex"]
[null,"Total including margins",{"$f":"dms_Total_Actual_Capex","v":608572286.18999994},{"$f":"IF(C33=dms_Total_Actual_Capex,\"OK\",\"Error\")","v":"OK"}]

{"sheet":"3.6 Quality of services","index":5,"n_rows":71,"n_cols":4,"rows_kept":71,"cut":false,"hidden":false,"merged":[[6,2,7,2],[24,2,25,2],[24,1,25,1]]}
[null,{"$f":"(LOOKUP(dms_Model,dms_Model_List,dms_Worksheet_List))","v":"REGULATORY REPORTING STATEMENT"}]
[null,{"$f":"dms_TradingName","v":"Energex"}]
[null,{"$f":"CONCATENATE(\"Annual Reporting RIN Response \",CRY)","v":"Annual Reporting RIN Response 2015-16"}]
[null,"3.6 QUALITY OF SERVICES"]
[]
[null,"3.6.5 - QUALITY OF SUPPLY METRICS"]
[null,null,"Unit","Volume"]
[null,null,null,{"$f":"CRY","v":"2015-16"}]
[null,"Over voltage events - due to high voltage injection","number"]
[null,"Customers receiving over-voltage - due to high voltage injection","number"]
[null,"Over voltage events - due to lightning","number"]
[null,"Customers receiving over-voltage - due to lightning","number"]
[null,"Over voltage events - due to voltage regulation or other cause","number"]
[null,"Customers receiving over-voltage - due to voltage regulation or other cause","number"]
[null,"Voltage variations - steady state (zone sub)","number"]
[null,"Voltage variations - one minute (zone sub)","number"]
[null,"Voltage variations - 10 seconds (zone sub) Min<0.7","number"]
[null,"Voltage variations - 10 seconds (zone sub) Min<0.8","number"]
[null,"Voltage variations - 10 seconds (zone sub) Min<0.9","number"]
[null,"Voltage variations - steady state (feeder)","number"]
[null,"Voltage variations - % zone subs monitored","(per cent)"]
[null,"Voltage variations - % feeders monitored","(per cent)"]
[]
[null,"3.6.6 - COMPLAINTS - TECHNICAL QUALITY OF SUPPLY"]
[null,null,"Unit","Volume"]
[null,null,null,{"$f":"CRY","v":"2015-16"}]
[null,"3.6.6.1 - TECHNICAL QUALITY OF SUPPLY"]
[null,"Number of complaints - technical quality of supply","number",1147]
[null,"3.6.6.2 - PERCENTAGE OF COMPLAINTS BY CATEGORY"]
[null,"Low voltage supply","(per cent)",7.6721883173496073]
[null,"Voltage dips","(per cent)",20.924149956408019]
[null,"Voltage swell","(per cent)",15.867480383609415]
[null,"Voltage spike (impulsive transient)","(per cent)",2.092414995640802]
[null,"Waveform distortion","(per cent)",4.0976460331299043]
[null,"TV or radio interference","(per cent)",0.34873583260680036]
[null,"Solar related","(per cent)",36.791630340017434]
[null,"Noise from appliances","(per cent)",12.205754141238012]
[null,"Other","(per cent)"]
[null,"3.6.6.3 - PERCENTAGE OF COMPLAINTS BY LIKELY CAUSE"]
[null,"Network equipment faulty","(per cent)",3.1386224934612028]
[null,"Network interference by NSP equipment","(per cent)",17.872711421098519]
[null,"Network interference by another customer","(per cent)",1.3077593722755012]
[null,"Network limitation","(per cent)",18.308631211857016]
[null,"Customer internal problem","(per cent)",23.278116826503922]
[null,"No problem identified","(per cent)",25.196163905841324]
[null,"Environmental","(per cent)",0.4359197907585004]
[null,"Other","(per cent)",10.46207497820401]
[]
[null,"3.6.7 - CUSTOMER SERVICE METRICS"]
[null,null,"Unit",{"$f":"CRY","v":"2015-16"}]
[null,"3.6.7.1 - TIMELY PROVISIONS OF SERVICES"]
[null,"Number of connections made","number",35018]
[null,"Number of connections not made on or before agreed date","number",36]
[null,"3.6.7.2 - TIMELY REPAIR OF FAULTY STREET LIGHTS"]
[null,"Street lights - average monthly number \"out\"","number",651]
[null,"Street lights - not repaired by \"fix by\" date","number",12]
[null,"Street lights - average number of days to repair","number",3.98]
[null,"Total number of street lights","number",316153]
[null,"3.6.7.3 - CALL CENTRE PERFORMANCE"]
[null,"Calls to call centre fault line","number",311678]
[null,"Calls to fault line answered within 30 seconds","number",75713]
[null,"Calls to fault line - average waiting time before call answered","number",12]
[null,"Call centre - number of overload events","number",0]
[null,"Percentage of calls abandoned","(per cent)",2]
[null,"3.6.7.4 - NUMBER OF CUSTOMER COMPLAINTS"]
[null,"Complaint - reliability of supply","number",89]
[null,"Complaint - technical quality of supply","number",{"$f":"IF(ISBLANK(D28),\"\",D28)","v":1147}]
[null,"Complaint - administrative process or customer service","number",1313]
[null,"Complaint - connection or augmentation","number",1989]
[null,"Complaint - other","number",178]
[null,"Total number of complaints","number",3569]

{"sheet":"3.6.8 Network-feeders","index":6,"n_rows":2297,"n_cols":23,"rows_kept":2297,"cut":false,"hidden":false,"merged":[[10,10,10,14],[11,11,11,12],[11,13,11,14],[11,18,11,19],[11,15,12,15],[11,10,12,10],[10,15,10,19],[11,16,11,17],[5,6,5,8],[5,1,5,4],[11,8,12,8],[11,9,12,9],[11,20,12,20],[10,20,10,22],[11,21,11,22],[10,1,12,1],[10,2,12,2],[10,3,12,3],[10,4,12,4],[10,7,12,7],[11,5,12,5],[11,6,12,6],[10,5,10,6],[10,8,10,9]]}
[null,{"$f":"(LOOKUP(dms_Model,dms_Model_List,dms_Worksheet_List))","v":"REGULATORY REPORTING STATEMENT"},null,null,null,null,{"$f":"CONCATENATE(\"1-Jan-\",LEFT(CRY,4))","v":"1-Jan-2015"}]
[null,{"$f":"dms_TradingName","v":"Energex"}]
[null,{"$f":"CONCATENATE(\"Annual Reporting RIN Response \",CRY)","v":"Annual Reporting RIN Response 2015-16"}]
[null,"3.6 QUALITY OF SERVICES"]
[]
[null,"Did the MAIFI parameter of the STPIS apply during the period?",null,null,null,"No","** IMPORTANT\nPlease ensure this question is answered correctly. Your response will affect other tables throughout this workbook and will determine which cells are grey and which are input cells. "]
[]
[]
[]
[null,"3.6.8 - NETWORK FEEDER RELIABILITY"]
[null,"Feeder ID / name","Description of the service area for the feeder","Feeder classification\n\n(drop down)","Number of distribution customers","Length of high voltage distribution lines",null,"Maximum demand\n(MVA)","Energy not supplied\n(MWh)",null,"Unplanned Outages",null,null,null,null,"Planned Outages",null,null,null,null,"Momentary feeder outages"]
[null,null,null,null,null,"Overhead","Underground",null,"Unplanned","Planned","Total number of unplanned outages","Unplanned customer minutes off-supply (SAIDI)",null,"Unplanned interruptions\n(SAIFI)",null,"Total number of planned outages","Planned customer minutes off-supply (SAIDI)",null,"Planned interruptions\n(SAIFI)",null,"Total number of momentary feeder outages","Momentary interruptions due to feeder outages (MAIFI)"]
[null,null,null,null,null,null,null,null,null,null,null,"Including excluded events and MEDs","After removing excluded events and MED","Including excluded events and MEDs","After removing excluded events and MED",null,"Including MEDs","After removing  MED","Including MEDs","After removing  MED",null,"Including excluded events and MEDs","After removing excluded events and MED"]
[null,1084,"MORNINGSIDE","URBAN",30,0.63600000000000001,1.4379999999999999,null,null,null,null,null,null,null,null,1,5.8900000000000001E-4,5.8900000000000001E-4,9.9000000000000005E-7,9.9000000000000005E-7]
[null,1129,"ROCKLEA","URBAN",387,3.5329999999999999,0.72199999999999998,null,null,null,6,0.14805399999999999,0.147924,8.1599999999999999E-4,8.1499999999999997E-4,1,8.6479999999999994E-3,8.6479999999999994E-3,3.57E-5,3.57E-5]
[null,1369,"SOUTH BRISBANE","URBAN",null,null,null,null,null,null,1,9.0000000000000002E-6,9.0000000000000002E-6,9.9000000000000005E-7,9.9000000000000005E-7]
[null,"1CCETR1","BRISBANE","CBD",49,null,null,null,null,null,null,null,null,null,null,1,0.24047099999999999,0.24047099999999999,1.2024E-2,1.2024E-2]
[null,"1QEET6","BRISBANE","CBD",1]
[null,301,null,"URBAN",1]
[null,318,"EAGLE FARM","URBAN",1,null,0.40100000000000002]
[null,3348,null,"URBAN",1]
[null,3356,null,"URBAN",1,null,null,null,null,null,null,null,null,null,null,1,4.8299999999999998E-4,4.8299999999999998E-4,9.9000000000000005E-7,9.9000000000000005E-7]
[null,3380,"KEDRON","URBAN",1,null,4.7389999999999999]
[null,3387,null,"URBAN",1,null,1.0589999999999999]
[null,"339/2","COLES CREEK","URBAN",1,23.757000000000001,null,null,null,null,2,1.237E-3,1.237E-3,1.99E-6,1.99E-6,4,1.116E-3,1.116E-3,3.9700000000000001E-6,3.9700000000000001E-6]
[null,341,"TIN CAN BAY, TOOLARA FOREST, WALLU","URBAN",34,112.66800000000001,0.23200000000000001,null,null,null,2,7.7580000000000001E-3,7.7580000000000001E-3,6.8499999999999998E-5,6.8499999999999998E-5]
[null,3702,null,"URBAN",1,17.3,0.159,null,null,null,6,1.405E-3,1.405E-3,9.9299999999999998E-6,9.9299999999999998E-6,1,1.01E-4,1.01E-4,9.9000000000000005E-7,9.9000000000000005E-7]
[null,3754,"TUGUN","URBAN",1,null,3.988,null,null,null,1,1.052E-3,1.052E-3,9.9000000000000005E-7,9.9000000000000005E-7]
[null,383,"WIVENHOE POCKET","URBAN",1,2.839,null,null,null,null,3,4.0299999999999998E-4,4.0299999999999998E-4,2.9799999999999998E-6,2.9799999999999998E-6,2,4.8979999999999996E-3,4.8979999999999996E-3,1.99E-6,1.99E-6]
[null,3941,"AMBERLEY","URBAN",1]
[null,399,null,"URBAN",1,null,null,null,null,null,1,2.0999999999999999E-5,null,9.9000000000000005E-7,null,1,1.22E-4,1.22E-4,9.9000000000000005E-7,9.9000000000000005E-7]
[null,400,"NTH STRADBROKE ISLD","URBAN",null,16.436,null,null,null,null,3,2.5999999999999998E-5,2.5999999999999998E-5,2.9799999999999998E-6,2.9799999999999998E-6,1,1.76E-4,1.76E-4,9.9000000000000005E-7,9.9000000000000005E-7]
[null,436,"EBENEZER","URBAN",1,15.112,2.8000000000000001E-2,null,null,null,null,null,null,null,null,1,4.08E-4,4.08E-4,9.9000000000000005E-7,9.9000000000000005E-7]
[null,439,"DUNWICH","URBAN",1,0.125,null,null,null,null,2,2.5000000000000001E-5,5.0000000000000004E-6,1.99E-6,9.9000000000000005E-7,1,1.35E-4,1.35E-4,9.9000000000000005E-7,9.9000000000000005E-7]
[null,449,"EAGLE FARM","URBAN",1,null,2.786]
[null,471,null,"URBAN",1,0.499,0.20599999999999999]
[null,472,null,"URBAN",1,0.51200000000000001,0.19500000000000001]
[null,"646B",null,"URBAN",1,null,1.1359999999999999,null,null,null,null,null,null,null,null,1,2.016E-3,2.016E-3,9.9000000000000005E-7,9.9000000000000005E-7]
[null,652,"BOWEN HILLS","URBAN",1,null,0.78]
[null,658,null,"URBAN",1,null,1.343]
[null,7259,null,"URBAN",2,39.887999999999998,null,null,null,null,null,null,null,null,null,1,4.7229999999999998E-3,4.7229999999999998E-3,1.99E-6,1.99E-6]
[null,"747/1",null,"URBAN",1,18.209]
[null,812,"BOWEN HILLS","URBAN",1,null,1.72]
[null,902,"CABOOLTURE","URBAN",1,2.11]
[null,904,"WOONGOOLBA","URBAN",1,34.546999999999997,null,null,null,null,1,3.6200000000000002E-4,null,9.9000000000000005E-7,null,1,1.9729999999999999E-3,1.9729999999999999E-3,9.9000000000000005E-7,9.9000000000000005E-7]
[null,910,"WYNNUM WEST","URBAN",1,1.0940000000000001]
[null,"ABT8","MORNINGSIDE","URBAN",1,null,0.16700000000000001]
[null,"ABTQPT95","MURARRIE","URBAN",1,null,2.23,4.2488000000000001]
[null,"ABY2A","AMBERLEY, MUTDAPILLY, PURGA, WILLOWBANK","RURAL",474,42.107999999999997,1.958,1.8290999999999999,null,null,8,1.8325999999999999E-2,1.8325999999999999E-2,3.8400000000000001E-4,3.8400000000000001E-4,15,7.7622999999999998E-2,7.7622999999999998E-2,3.2299999999999999E-4,3.2299999999999999E-4]
[null,"ABY5A","AMBERLEY, JEEBROPILLY, WALLOON","RURAL",27,12.968,0.20399999999999999,2.3054000000000001,null,null,2,2.5860000000000002E-3,2.5860000000000002E-3,1.3799999999999999E-4,1.3799999999999999E-4,3,9.3950000000000006E-3,9.3950000000000006E-3,7.6899999999999992E-6,7.6899999999999992E-6]
[null,"ACEGSN7","FORTITUDE VALLEY","URBAN",2,null,1.385]
[null,"ACEMLS6","FORTITUDE VALLEY","URBAN",15,null,0.80500000000000005,1.7338]
[null,"ACET1","FORTITUDE VALLEY","URBAN",3]
[null,"ACFQBI5","PINKENBA","URBAN",10,2.1480000000000001,1.1040000000000001,null,null,null,1,5.5400000000000002E-4,5.5400000000000002E-4,5.9599999999999997E-6,5.9599999999999997E-6,2,1.5950000000000001E-3,1.5950000000000001E-3,7.9400000000000002E-6,7.9400000000000002E-6]
[null,"ACHECW4","SPRING HILL","CBD",1,null,0.64100000000000001]
[null,"ACHT1","SPRING HILL","CBD",11]
[null,"ACICTC1",null,"URBAN",2,null,1.9390000000000001]
[null,"ACR1","ALBANY CREEK, EATONS HILL","URBAN",418,2.8740000000000001,0.27900000000000003,5.7159000000000004,null,null,1,5.8960000000000002E-3,5.8960000000000002E-3,5.4599999999999999E-5,5.4599999999999999E-5,1,9.3999999999999994E-5,9.3999999999999994E-5,9.9000000000000005E-7,9.9000000000000005E-7]
[null,"ACR12A","ALBANY CREEK, BRIDGEMAN DOWNS","URBAN",1408,2.4849999999999999,6.84,4.7633000000000001,null,null,1,3.5379999999999999E-3,3.5379999999999999E-3,1.7900000000000001E-5,1.7900000000000001E-5,8,4.0566999999999999E-2,4.0566999999999999E-2,1.46E-4,1.46E-4]
[null,"ACR13A","ALBANY CREEK","URBAN",1050,null,7.1310000000000002,3.2961999999999998,null,null,1,1.9220000000000001E-3,1.9220000000000001E-3,4.3699999999999998E-5,4.3699999999999998E-5,3,2.4218E-2,2.4218E-2,9.3300000000000005E-5,9.3300000000000005E-5]
[null,"ACR2","ALBANY CREEK","URBAN",1222,6.2E-2,6.56,null,null,null,1,1.1E-4,1.1E-4,9.9000000000000005E-7,9.9000000000000005E-7,2,7.6470000000000002E-3,7.6470000000000002E-3,1.17E-4,1.17E-4]
[null,"ACR3","ALBANY CREEK, BRIDGEMAN DOWNS, MCDOWALL","URBAN",1122,3.7839999999999998,6.7640000000000002,3.7343999999999999,null,null,2,4.5300000000000001E-4,4.5300000000000001E-4,1.55E-4,1.55E-4,7,1.1474E-2,1.1474E-2,6.1500000000000004E-5,6.1500000000000004E-5]
[null,"ACR4","ALBANY CREEK","URBAN",750,4.7030000000000003,0.52200000000000002,4.0964,null,null,3,9.9500000000000001E-4,9.9500000000000001E-4,1.19E-5,1.19E-5,9,2.3765000000000001E-2,2.3765000000000001E-2,9.2299999999999994E-5,9.2299999999999994E-5]
[null,"ACR5","ALBANY CREEK, BUNYA, DRAPER, EATONS HILL","RURAL",1556,26.988,5.1050000000000004,null,null,null,17,0.82978200000000002,0.51047799999999999,5.091E-3,4.6470000000000001E-3,5,0.12709000000000001,0.12709000000000001,3.59E-4,3.59E-4]
[null,"ACR6","ALBANY CREEK, BRIDGEMAN DOWNS","RURAL",925,7.282,0.89400000000000002,2.5341,null,null,5,2.4861000000000001E-2,2.4861000000000001E-2,2.23E-4,2.23E-4,7,4.5038000000000002E-2,4.5038000000000002E-2,2.6899999999999998E-4,2.6899999999999998E-4]
[null,"ACSTR1H","BRISBANE","CBD",1]
[null,"ADAMAA1","BRISBANE","URBAN",11,null,0.30599999999999999]
[null,"ADAMLS23","BRISBANE, FORTITUDE VALLEY, SPRING HILL","URBAN",31,null,2.0019999999999998,3.9630000000000001]
[null,"ADATR1H","BRISBANE","URBAN",468]
[null,"ADSTR1H","BRISBANE","CBD",1]
[null,"AECT1","BRISBANE","CBD",1]
[null,"AETT1","BRISBANE","CBD",1]
[null,"AFD10A","ROCKLEA","URBAN",118,2.41,1.4890000000000001,2.8199000000000001,null,null,null,null,null,null,null,1,2.2390000000000001E-3,2.2390000000000001E-3,5.9599999999999997E-6,5.9599999999999997E-6]
[null,"AFD11A","ROCKLEA","URBAN",48,1.6459999999999999,0.32400000000000001,1.3337000000000001,null,null,2,4.15E-3,4.15E-3,5.0599999999999997E-5,5.0599999999999997E-5]
[null,"AFD12B",null,"URBAN",2,0.79900000000000004,4.3999999999999997E-2,6.5732999999999997]
[null,"AFD14A","ROCKLEA","URBAN",17,null,null,3.3723999999999998,null,null,2,4.4000000000000002E-4,4.4000000000000002E-4,3.18E-5,3.18E-5,1,2.04E-4,2.04E-4,1.99E-6,1.99E-6]
[null,"AFD18A","ARCHERFIELD, ROCKLEA","URBAN",119,null,null,1.0098,null,null,3,2.33E-4,2.33E-4,2.9799999999999998E-6,2.9799999999999998E-6]
[null,"AFD19A","ARCHERFIELD, ROCKLEA","URBAN",19,null,null,3.22]
[null,"AFD1AOLD",null,"URBAN",null,null,null,null,null,null,2,2.5950999999999998E-2,2.5950999999999998E-2,2.31E-4,2.31E-4,1,6.7000000000000002E-4,6.7000000000000002E-4,2.9799999999999998E-6,2.9799999999999998E-6]
[null,"AFD1BOLD",null,"URBAN",null,null,null,null,null,null,3,1.5173000000000001E-2,1.5173000000000001E-2,1.1E-4,1.1E-4,1,1.37E-4,1.37E-4,9.9000000000000005E-7,9.9000000000000005E-7]
[null,"AFD20A","ROCKLEA","URBAN",154,null,null,3.4296000000000002,null,null,null,null,null,null,null,1,1.6199999999999999E-3,1.6199999999999999E-3,7.9400000000000002E-6,7.9400000000000002E-6]
[null,"AFD22B","ROCKLEA","URBAN",70,null,null,2.0387,null,null,1,1.8699999999999999E-4,1.8699999999999999E-4,9.9000000000000005E-7,9.9000000000000005E-7,2,4.5100000000000001E-4,4.5100000000000001E-4,1.99E-6,1.99E-6]
[null,"AFD23A","ROCKLEA","URBAN",14,0.377,5.6000000000000001E-2,0.72399999999999998,null,null,1,6.3E-5,6.3E-5,9.9000000000000005E-7,9.9000000000000005E-7]
[null,"AFD2OLD",null,"URBAN",null,null,null,null,null,null,2,2.6999999999999999E-5,2.6999999999999999E-5,1.99E-6,1.99E-6,1,5.2400000000000005E-4,5.2400000000000005E-4,9.9000000000000005E-7,9.9000000000000005E-7]
[null,"AFD3AOLD",null,"URBAN",null,0.63200000000000001,0.31,null,null,null,3,1.2620000000000001E-3,1.2620000000000001E-3,4.57E-5,4.57E-5]
[null,"AFD5OLD","ROCKLEA","URBAN",null,0.44600000000000001,0.30399999999999999,null,null,null,3,9.6100000000000005E-4,9.6100000000000005E-4,5.8600000000000001E-5,5.8600000000000001E-5]
[null,"AFD6OLD",null,"URBAN",null,null,null,null,null,null,1,1.5200000000000001E-4,1.5200000000000001E-4,9.9000000000000005E-7,9.9000000000000005E-7,1,4.0000000000000003E-5,4.0000000000000003E-5,9.9000000000000005E-7,9.9000000000000005E-7]
[null,"AFD7OLD",null,"URBAN",null,1.22,1.9359999999999999,null,null,null,1,1.477E-3,1.477E-3,7.25E-5,7.25E-5]
[null,"AFD8OLD",null,"URBAN",null,null,null,null,null,null,1,2.8299999999999999E-4,2.8299999999999999E-4,1.3900000000000001E-5,1.3900000000000001E-5]
[null,"AFDCIG15",null,"URBAN",1,null,null,0.49540000000000001]
[null,"AFDCIG4OLD",null,"URBAN",null,0.68,1.407,null,null,null,1,2.5630000000000002E-3,2.5630000000000002E-3,1.13E-4,1.13E-4]
[null,"AFETR1H","BRISBANE","CBD",1,null,null,null,null,null,1,6.0740000000000002E-2,null,2.5599999999999999E-4]
[null,"AFT2","BRISBANE","CBD",2,null,9.0999999999999998E-2]
[null,"AFTT1","BRISBANE","CBD",1]
[null,"AGE10","ASHGROVE, BARDON, PADDINGTON","URBAN",2212,8.3919999999999995,1.56,5.4492000000000003,null,null,9,4.4939999999999997E-3,4.4939999999999997E-3,8.6399999999999999E-5,8.6399999999999999E-5,22,5.9080000000000001E-2,5.9080000000000001E-2,2.1599999999999999E-4,2.1599999999999999E-4]
[null,"AGE16B","ASHGROVE","URBAN",763,3.76,0.73099999999999998,2.5531000000000001,null,null,4,3.0577E-2,3.0577E-2,1.63E-4,1.63E-4,7,2.1822000000000001E-2,2.1822000000000001E-2,1.26E-4,1.26E-4]
[null,"AGE2","ASHGROVE, BARDON","URBAN",525,3.14,1.8939999999999999,1.448,null,null,2,5.9789999999999999E-3,5.9789999999999999E-3,7.3499999999999998E-5,7.3499999999999998E-5,5,1.3832000000000001E-2,1.3832000000000001E-2,7.0500000000000006E-5,7.0500000000000006E-5]
[null,"AGE3","PADDINGTON","URBAN",358,1.2809999999999999,1.8420000000000001,1.2956000000000001,null,null,2,1.366E-3,1.366E-3,5.9599999999999997E-6,5.9599999999999997E-6,4,9.7319999999999993E-3,9.7319999999999993E-3,3.57E-5,3.57E-5]
[null,"AGE5B","ASHGROVE","URBAN",801,1.2210000000000001,0.76,2.0958000000000001,null,null,7,1.7937000000000002E-2,1.7937000000000002E-2,1.8799999999999999E-4,1.8799999999999999E-4,1,7.5600000000000005E-4,7.5600000000000005E-4,5.9599999999999997E-6,5.9599999999999997E-6]
[null,"AGE6A","ASHGROVE, RED HILL","URBAN",759,2.1859999999999999,1.127,1.8482000000000001,null,null,3,1.4749999999999999E-2,1.4749999999999999E-2,5.0599999999999997E-5,5.0599999999999997E-5,1,1.294E-3,1.294E-3,3.9700000000000001E-6,3.9700000000000001E-6]
[null,"AGE7A","ASHGROVE","RURAL",12,null,2.0720000000000001,0.1905,null,null,2,1.446E-3,1.446E-3,2.8200000000000001E-5,2.8200000000000001E-5]
[null,"AGE7B","ASHGROVE","URBAN",976,5.4539999999999997,0.51200000000000001,2.8961000000000001,null,null,8,3.8476000000000003E-2,3.8476000000000003E-2,1.0560000000000001E-3,1.0560000000000001E-3,6,9.1970000000000003E-3,9.1970000000000003E-3,3.4700000000000003E-5,3.4700000000000003E-5]
[null,"AGE8","ASHGROVE, THE GAP","URBAN",941,5.9480000000000004,3.1259999999999999,2.7818000000000001,null,null,7,0.240232,0.240232,1.237E-3,1.237E-3,2,7.5900000000000002E-4,7.5900000000000002E-4,8.9299999999999992E-6,8.9299999999999992E-6]
[null,"AGE9","ASHGROVE, BARDON, PADDINGTON, RED HILL","URBAN",1479,5.383,0.57799999999999996,4.0202,null,null,7,0.116392,0.116392,1.531E-3,1.531E-3,16,5.6961999999999999E-2,5.6961999999999999E-2,2.6699999999999998E-4,2.6699999999999998E-4]
[null,"AGT23A","ALGESTER, WILLAWONG","URBAN",1555,0.86,9.3770000000000007,2.9342000000000001,null,null,4,2.6145000000000002E-2,2.6145000000000002E-2,1.55E-4,1.55E-4,3,2.068E-3,2.068E-3,9.9299999999999998E-6,9.9299999999999998E-6]
[null,"AGT25A","ACACIA RIDGE, WILLAWONG","RURAL",1128,6.7530000000000001,2.3239999999999998,2.3245,null,null,9,7.7943999999999999E-2,7.7943999999999999E-2,7.3300000000000004E-4,7.3300000000000004E-4,3,0.118385,0.118385,3.6400000000000001E-4,3.6400000000000001E-4]
[null,"AGT25A","ACACIA RIDGE, WILLAWONG","URBAN",1128,6.7530000000000001,2.3239999999999998,2.3245,null,null,1,1.0900000000000001E-4,1.0900000000000001E-4,9.9000000000000005E-7,9.9000000000000005E-7,4,2.7966000000000001E-2,2.7966000000000001E-2,1.08E-4,1.08E-4]
[null,"AGT27A","ACACIA RIDGE","URBAN",44,null,3.194,1.81]
[null,"AGT29A","ACACIA RIDGE","URBAN",98,0.13700000000000001,3.4460000000000002,2.0387,null,null,2,2.1900000000000001E-4,2.1900000000000001E-4,1.99E-6,1.99E-6]
[null,"AGT31A","LARAPINTA, PALLARA, WILLAWONG","RURAL",402,17.167999999999999,9.6150000000000002,4.5918000000000001,null,null,5,0.160272,0.160272,2.0709999999999999E-3,2.0709999999999999E-3,14,0.33874599999999999,0.33874599999999999,9.6599999999999995E-4,9.6599999999999995E-4]
[null,"AGT33A","ACACIA RIDGE","URBAN",22,0.23799999999999999,1.8220000000000001,1.9244000000000001,null,null,null,null,null,null,null,2,4.4900000000000002E-4,4.4900000000000002E-4,1.99E-6,1.99E-6]
[null,"AGT35A","ACACIA RIDGE","URBAN",96,0.14199999999999999,4.1539999999999999,3.1438000000000001,null,null,null,null,null,null,null,1,1.016E-3,1.016E-3,7.9400000000000002E-6,7.9400000000000002E-6]
[null,"AGT37A","ACACIA RIDGE, ALGESTER, SUNNYBANK HILLS","URBAN",1549,4.7169999999999996,6.2240000000000002,3.4676999999999998,null,null,3,0.22373000000000001,0.22373000000000001,1.531E-3,1.531E-3,8,3.2577000000000002E-2,3.2577000000000002E-2,1.8599999999999999E-4,1.8599999999999999E-4]
[null,"AHD10A","MOOLOOLABA","URBAN",1588,4.6130000000000004,2.3780000000000001,2.9531999999999998,null,null,9,2.1836000000000001E-2,2.1836000000000001E-2,1.7899999999999999E-4,1.7899999999999999E-4,1,1.8760000000000001E-3,1.8760000000000001E-3,2.0800000000000001E-5,2.0800000000000001E-5]
[null,"AHD10B","ALEXANDRA HEADLAND, MOOLOOLABA","URBAN",945,1.6830000000000001,3.298,3.1438000000000001,null,null,2,3.0800000000000001E-4,3.0800000000000001E-4,1.99E-6,1.99E-6]
[null,"AHD12A","MAROOCHYDORE","URBAN",764,1.835,2.7629999999999999,2.8769999999999998,null,null,1,1.8539E-2,1.8539E-2,1E-4,1E-4,5,3.6346999999999997E-2,3.6346999999999997E-2,1.7000000000000001E-4,1.7000000000000001E-4]
[null,"AHD15A","MAROOCHYDORE","URBAN",762,1.768,5.9390000000000001,3.8106,null,null,2,1.5543E-2,1.5543E-2,5.3600000000000002E-5,5.3600000000000002E-5,3,8.8204000000000005E-2,8.8204000000000005E-2,2.12E-4,2.12E-4]
[null,"AHD15B","MAROOCHYDORE","URBAN",831,2.637,1.1100000000000001,3.6391,null,null,11,4.1188000000000002E-2,4.1188000000000002E-2,3.7399999999999998E-4,3.7399999999999998E-4,19,6.8900000000000003E-2,6.8900000000000003E-2,2.7599999999999999E-4,2.7599999999999999E-4]
[null,"AHD16","BUDERIM","URBAN",1353,6.3979999999999997,1.7490000000000001,2.8389000000000002,null,null,11,0.13639699999999999,0.13639699999999999,1.503E-3,1.503E-3,3,2.5673999999999999E-2,2.5673999999999999E-2,7.4400000000000006E-5,7.4400000000000006E-5]
[null,"AHD17","MAROOCHYDORE","URBAN",195,0.36399999999999999,4.2329999999999997,4.0202,null,null,1,2.055E-3,2.055E-3,9.9299999999999998E-6,9.9299999999999998E-6,1,1.5610000000000001E-3,1.5610000000000001E-3,1.29E-5,1.29E-5]
[null,"AHD18A","BUDERIM","URBAN",776,3.9249999999999998,2.645,4.0583,null,null,7,8.0218999999999999E-2,8.0218999999999999E-2,8.3000000000000001E-4,8.3000000000000001E-4,4,3.3748E-2,3.3748E-2,1.1400000000000001E-4,1.1400000000000001E-4]
[null,"AHD18B","BLI BLI, MAROOCHYDORE, MUDJIMBA, PACIFIC PARADISE, TWIN WATERS","RURAL",2339,6.3109999999999999,15.254,4.7633000000000001,null,null,7,1.1041449999999999,1.1041449999999999,1.5056999999999999E-2,1.5056999999999999E-2,2,2.9680999999999999E-2,2.9680999999999999E-2,8.9699999999999998E-5,8.9699999999999998E-5]
[null,"AHD19","ALEXANDRA HEADLAND, MAROOCHYDORE","URBAN",1178,3.3410000000000002,1.6160000000000001,null,null,null,2,1.56E-4,1.56E-4,2.9799999999999998E-6,2.9799999999999998E-6,14,5.9693000000000003E-2,5.9693000000000003E-2,2.1800000000000001E-4,2.1800000000000001E-4]
[null,"AHD20","ALEXANDRA HEADLAND, MAROOCHYDORE","URBAN",1080,2.3340000000000001,2.8029999999999999,3.4104999999999999,null,null,5,1.1860000000000001E-2,1.1860000000000001E-2,1.18E-4,1.18E-4]
[null,"AHD21","BUDERIM","URBAN",1304,2.6949999999999998,4.181,2.4769000000000001,null,null,9,9.1699999999999993E-3,9.1699999999999993E-3,1.15E-4,1.15E-4,6,4.1225999999999999E-2,4.1225999999999999E-2,1.6000000000000001E-4,1.6000000000000001E-4]
[null,"AHD22A","MAROOCHYDORE","URBAN",1141,4.2240000000000002,4.2329999999999997,4.6680000000000001,null,null,7,8.0514000000000002E-2,8.0514000000000002E-2,1.3439999999999999E-3,1.3439999999999999E-3,4,2.955E-2,2.955E-2,1.2300000000000001E-4,1.2300000000000001E-4]
[null,"AHD25A","BUDERIM, MAROOCHYDORE","URBAN",1633,3.9729999999999999,6.0149999999999997,3.5247999999999999,null,null,5,0.180261,0.180261,1.653E-3,1.653E-3,3,2.5687000000000001E-2,2.5687000000000001E-2,9.0299999999999999E-5,9.0299999999999999E-5]
[null,"AHD3A","MAROOCHYDORE","URBAN",6,null,2.2919999999999998,3.1627999999999998]
[null,"AHD4A","BUDERIM, MINYAMA, MOOLOOLABA, MOUNTAIN CREEK","URBAN",1652,8.1850000000000005,4.609,5.2396000000000003,null,null,11,0.71350800000000003,0.71350800000000003,5.0520000000000001E-3,5.0520000000000001E-3,9,9.5430000000000001E-2,9.5430000000000001E-2,4.4200000000000001E-4,4.4200000000000001E-4]
[null,"AHD4B","BUDERIM, MAROOCHYDORE","RURAL",null,3.0649999999999999,3.7989999999999999,2.6293000000000002,null,null,4,0.46263399999999999,0.46263399999999999,4.1780000000000003E-3,4.1780000000000003E-3,1,5.2300000000000003E-4,5.2300000000000003E-4,2.5600000000000001E-6,2.5600000000000001E-6]
[null,"AHD4B","BUDERIM, MAROOCHYDORE","URBAN",543,3.0649999999999999,3.7989999999999999,2.6293000000000002]
[null,"AHD5","ALEXANDRA HEADLAND, MOOLOOLABA","URBAN",1942,4.5270000000000001,1.518,3.8106,null,null,9,0.74199700000000002,0.74199700000000002,6.5919999999999998E-3,6.5919999999999998E-3,1,8.3379999999999999E-3,8.3379999999999999E-3,2.0800000000000001E-5,2.0800000000000001E-5]
[null,"AHD6","ALEXANDRA HEADLAND, MAROOCHYDORE","URBAN",639,1.8,1.671,3.1438000000000001,null,null,2,3.8699999999999997E-4,3.8699999999999997E-4,1.99E-6,1.99E-6,5,3.2230000000000002E-2,3.2230000000000002E-2,1.6100000000000001E-4,1.6100000000000001E-4]
[null,"AHD7","ALEXANDRA HEADLAND, MAROOCHYDORE","URBAN",898,3.0169999999999999,0.89900000000000002,2.4007000000000001,null,null,8,4.0568E-2,4.0568E-2,3.9500000000000001E-4,3.9500000000000001E-4,15,8.2479999999999998E-2,8.2479999999999998E-2,2.7900000000000001E-4,2.7900000000000001E-4]
[null,"AHD8","BUDERIM","URBAN",1160,5.6079999999999997,2.0960000000000001,null,null,null,6,0.13670399999999999,0.13670399999999999,1.768E-3,1.768E-3,4,5.8214000000000002E-2,5.8214000000000002E-2,2.02E-4,2.02E-4]
[null,"AHD9","MOOLOOLABA","URBAN",313,5.2880000000000003,2.2549999999999999,2.9723000000000002,null,null,2,1.1E-4,1.1E-4,1.99E-6,1.99E-6,2,3.6319999999999998E-3,3.6319999999999998E-3,1.29E-5,1.29E-5]
[null,"AHL11A","FERNY GROVE, FERNY HILLS","RURAL",1272,4.516,7.9119999999999999,3.4104999999999999,null,null,14,4.8336999999999998E-2,4.8336999999999998E-2,4.8700000000000002E-4,4.8700000000000002E-4,4,9.8159999999999997E-2,9.8159999999999997E-2,3.3599999999999998E-4,3.3599999999999998E-4]
[null,"AHL12A","ARANA HILLS, FERNY HILLS","URBAN",1719,7.9710000000000001,2.5990000000000002,4.4965000000000002,null,null,6,8.6899999999999998E-4,8.6899999999999998E-4,1.19E-5,1.19E-5,3,5.3400000000000001E-3,5.3400000000000001E-3,3.9700000000000003E-5,3.9700000000000003E-5]
[null,"AHL14A","ARANA HILLS, FERNY HILLS","URBAN",1411,5.44,0.39900000000000002,4.7442000000000002,null,null,10,0.174461,0.174461,2.0470000000000002E-3,2.0470000000000002E-3,14,4.8099000000000003E-2,4.5846999999999999E-2,2.05E-4,1.9799999999999999E-4]
[null,"AHL15B","EVERTON HILLS, EVERTON PARK, MCDOWALL","URBAN",1782,6.3949999999999996,5.077,3.9630000000000001,null,null,6,0.14308100000000001,0.14308100000000001,1.769E-3,1.769E-3,7,3.3243000000000002E-2,3.3243000000000002E-2,1.36E-4,1.36E-4]
[null,"AHL4A","KEPERRA","URBAN",204,1.2070000000000001,0.63800000000000001,1.1432]
[null,"AHL5A","ARANA HILLS, BUNYA, EVERTON HILLS, FERNY HILLS","RURAL",1200,13.878,3.6819999999999999,3.6391,null,null,9,0.28194399999999997,0.28194399999999997,3.8890000000000001E-3,3.8890000000000001E-3,1,6.4599999999999996E-3,6.4599999999999996E-3,4.6100000000000002E-5,4.6100000000000002E-5]
[null,"AHL6A","ARANA HILLS, FERNY GROVE, FERNY HILLS","URBAN",1975,7.96,3.2879999999999998,4.9729000000000001,null,null,9,1.676E-3,1.5E-3,9.9299999999999998E-6,7.9400000000000002E-6,20,9.3506000000000006E-2,8.7663000000000005E-2,3.3E-4,3.01E-4]
[null,"AHL8A","BRIDGEMAN DOWNS, BUNYA, EVERTON HILLS, MCDOWALL","URBAN",1695,8.0500000000000007,6.6550000000000002,5.4682000000000004,null,null,7,1.9517E-2,1.9517E-2,1.75E-4,1.75E-4,5,1.3904E-2,1.3904E-2,3.9700000000000003E-5,3.9700000000000003E-5]
[null,"AHL9A","EVERTON HILLS, EVERTON PARK","URBAN",1729,6.2169999999999996,1.31,4.0392999999999999,null,null,10,6.0054000000000003E-2,6.0054000000000003E-2,1.66E-4,1.66E-4,7,4.3108E-2,4.3108E-2,1.47E-4,1.47E-4]
[null,"AHS26","BRISBANE","CBD",1,null,4.9000000000000002E-2,null,null,null,1,6.0740000000000002E-2,null,2.5599999999999999E-4]
[null,"AHST1","BRISBANE","CBD",1]
[null,"AHTTR2H","BRISBANE","CBD",1,null,null,null,null,null,1,6.0740000000000002E-2,null,2.5599999999999999E-4]
[null,"AJV1","FORTITUDE VALLEY","URBAN",164,0.76,2.907,null,null,null,5,5.0439999999999999E-3,5.0439999999999999E-3,3.2799999999999998E-5,3.2799999999999998E-5,1,1.9359999999999999E-2,1.9359999999999999E-2,4.57E-5,4.57E-5]
[null,"AJVTR1","FORTITUDE VALLEY","URBAN",1]
[null,"ALY3A","ANNERLEY, FAIRFIELD","URBAN",1388,3.98,0.19500000000000001,2.5341,null,null,15,5.1285999999999998E-2,5.1285999999999998E-2,1.691E-3,1.691E-3,6,5.1505000000000002E-2,5.1505000000000002E-2,1.7699999999999999E-4,1.7699999999999999E-4]
[null,"ALY5","ANNERLEY, GREENSLOPES, WOOLLOONGABBA","URBAN",2196,4.2699999999999996,0.92700000000000005,3.2389999999999999,null,null,11,4.8709000000000002E-2,4.8709000000000002E-2,4.2099999999999999E-4,4.2099999999999999E-4,5,2.1731E-2,2.1731E-2,8.2399999999999997E-5,8.2399999999999997E-5]
[null,"ALY6","ANNERLEY, FAIRFIELD, YERONGA","URBAN",1328,6.0380000000000003,1.306,4.1726000000000001,null,null,13,8.6467000000000002E-2,8.6467000000000002E-2,9.6699999999999998E-4,9.6699999999999998E-4,14,6.7002000000000006E-2,6.7002000000000006E-2,2.5300000000000002E-4,2.5300000000000002E-4]
[null,"ALY8","ANNERLEY","URBAN",2058,4.3869999999999996,0.36099999999999999,3.0865999999999998,null,null,13,0.307618,0.307618,4.2459999999999998E-3,4.2459999999999998E-3,12,7.4649999999999994E-2,7.4649999999999994E-2,3.4699999999999998E-4,3.4699999999999998E-4]
[null,"ALY9","YERONGA","URBAN",613,3.4529999999999998,2.5539999999999998,2.0196000000000001,null,null,4,3.4099999999999999E-4,3.4099999999999999E-4,3.9700000000000001E-6,3.9700000000000001E-6,8,2.2034000000000002E-2,2.2034000000000002E-2,5.2599999999999998E-5,5.2599999999999998E-5]
[null,"ALYMRK10","ANNERLEY","RURAL",98,null,4.3860000000000001,0.32390000000000002,null,null,1,1.0900000000000001E-4,1.0900000000000001E-4,2.5600000000000001E-6,2.5600000000000001E-6]
[null,"ALYMRK10","ANNERLEY","RURAL",98,null,4.3860000000000001,null,null,null,1,1.0900000000000001E-4,1.0900000000000001E-4,2.5600000000000001E-6,2.5600000000000001E-6]
[null,"ALYMRK4","ANNERLEY","RURAL",87,null,2.2309999999999999]
[null,"ALYMRK4","ANNERLEY","RURAL",87,null,2.2309999999999999,0.4763]
[null,"AMIAST27","BRISBANE","CBD",1,null,0.158,0.99080000000000001,null,null,1,6.0740000000000002E-2,null,2.5599999999999999E-4]
[null,"AMM2","BRISBANE","URBAN",1,null,0.22500000000000001]
[null,"AMMCST26","BRISBANE","CBD",2,null,0.53600000000000003,2.7627000000000002]
[null,"AMMTR2H","BRISBANE","CBD",1]
[null,"AMPCST4","BRISBANE","CBD",7,null,0.27400000000000002,2.1339000000000001]
[null,"AMPT1","BRISBANE","CBD",1,null,null,null,null,null,null,null,null,null,null,1,8.0583000000000002E-2,8.0583000000000002E-2,2.5599999999999999E-4,2.5599999999999999E-4]
[null,"AMR1","AMAMOOR, IMBIL, KANDANGA, KANDANGA CREEK, MELAWONDI, UPPER KANDANGA","RURAL",351,62.481000000000002,0.26900000000000002,1.6576,null,null,11,0.17200599999999999,0.17200599999999999,1.9740000000000001E-3,1.9740000000000001E-3,20,0.241704,0.23863500000000001,7.4299999999999995E-4,7.2000000000000005E-4]
[null,"AMR2","AMAMOOR, CALICO CREEK, DAGUN, GILLDORA, KANDANGA, KANDANGA CREEK, KYBONG, LAGOON POCKET, LANGSHAW, MOOLOO","RURAL",688,108.486,null,1.3337000000000001,null,null,35,0.48527799999999999,0.48463600000000001,4.8110000000000002E-3,4.8089999999999999E-3,30,0.64029899999999995,0.61782099999999995,2.0349999999999999E-3,1.9659999999999999E-3]
[null,"AMR3","AMAMOOR, BOLLIER, COLES CREEK, COORAN, DAGUN, GOOMONG POCKET, GYMPIE, IMBIL, KANDANGA, KYBONG, LAGOON POCKET, TRAVESTON, TUCHEKOI","RURAL",362,96.126999999999995,1.0189999999999999,0.85740000000000005,null,null,20,0.33968900000000002,0.33968900000000002,2.6450000000000002E-3,2.6450000000000002E-3,40,0.40595500000000001,0.38697100000000001,1.83E-3,1.771E-3]
[null,"AMSPMH6","BRISBANE","CBD",1,null,0.82499999999999996]
[null,"AMSTR1H","BRISBANE","CBD",1]
[null,"AMVGSN1","FORTITUDE VALLEY","URBAN",7,null,0.59899999999999998]
[null,"AMVMLS92","FORTITUDE VALLEY","URBAN",8,null,0.46700000000000003,2.0005999999999999]
[null,"ANASPD20","SURFERS PARADISE","URBAN",1,null,0.51200000000000001,2.3435000000000001]
[null,"ANAT1","SURFERS PARADISE","URBAN",2]
[null,"ANSMST7","BRISBANE","CBD",1,null,0.72599999999999998,1.3528]
[null,"ANST1","BRISBANE","CBD",1]
[null,"APFGIS15",null,"URBAN",1,null,null,3.4296000000000002,null,null,null,null,null,null,null,1,9.3099999999999997E-4,9.3099999999999997E-4,9.9000000000000005E-7,9.9000000000000005E-7]
[null,"APHTR1H","SPRING HILL","CBD",1]
[null,"APLLYT10A",null,"URBAN",1,null,0.24]
[null,"APOMLS92","FORTITUDE VALLEY","URBAN",8,null,1.0529999999999999,1.5052000000000001]
[null,"AQECST25","BRISBANE","CBD",16,null,0.442,2.7054999999999998]
[null,"AQETR1H","BRISBANE","CBD",45,null,null,null,null,null,2,7.6498999999999998E-2,7.6498999999999998E-2,5.1199999999999998E-4,5.1199999999999998E-4]
[null,"AQM28A","BRISBANE","CBD",12,null,0.10100000000000001]
[null,"AQMCBA1","BRISBANE","CBD",1,null,0.32,null,null,null,1,6.4977999999999994E-2,6.4977999999999994E-2,2.5599999999999999E-4,2.5599999999999999E-4]
[null,"AQMMST20","BRISBANE","CBD",1,null,1.212,1.5432999999999999]
[null,"AQMT1","BRISBANE","CBD",19]
[null,"ARG10","ACACIA RIDGE, SUNNYBANK HILLS","URBAN",133,2.1560000000000001,0.96499999999999997,5.0491000000000001,null,null,2,6.3400000000000001E-3,6.3400000000000001E-3,1.37E-4,1.37E-4]
[null,"ARG3","ACACIA RIDGE, COOPERS PLAINS, ROBERTSON, SUNNYBANK","URBAN",1658,7.42,3.5630000000000002,6.2112999999999996,null,null,6,0.311309,0.311309,3.2759999999999998E-3,3.2759999999999998E-3,18,0.124553,0.124553,4.0499999999999998E-4,4.0499999999999998E-4]
[null,"ARG4","ACACIA RIDGE","URBAN",105,2.0699999999999998,0.51400000000000001,4.5727000000000002,null,null,5,5.4299999999999997E-4,5.4299999999999997E-4,4.9599999999999999E-6,4.9599999999999999E-6,4,8.2700000000000004E-4,5.7399999999999997E-4,3.9700000000000001E-6,2.9799999999999998E-6]
[null,"ARG5A","ACACIA RIDGE, SUNNYBANK, SUNNYBANK HILLS","URBAN",1584,7.8730000000000002,1.3580000000000001,3.6772,null,null,11,0.12634600000000001,4.1960999999999998E-2,1.4519999999999999E-3,8.2799999999999996E-4,8,1.6409E-2,1.2605999999999999E-2,8.7299999999999994E-5,7.25E-5]
[null,"ARG6","ACACIA RIDGE, SUNNYBANK HILLS","RURAL",129,0.753,2.4380000000000002,0.81930000000000003,null,null,null,null,null,null,null,3,8.9149999999999993E-3,8.9149999999999993E-3,2.5599999999999999E-5,2.5599999999999999E-5]
[null,"ARG7","ACACIA RIDGE","URBAN",5,null,2.1840000000000002,2.5150000000000001]
[null,"ARG8","ACACIA RIDGE","URBAN",4,null,1.4059999999999999,2.0387]
[null,"ARG9A","SUNNYBANK, SUNNYBANK HILLS","URBAN",1148,4.9870000000000001,0.90700000000000003,2.3626,null,null,3,2.1900000000000001E-4,2.1900000000000001E-4,2.9799999999999998E-6,2.9799999999999998E-6,7,6.9224999999999995E-2,6.9224999999999995E-2,2.42E-4,2.42E-4]
[null,"ARL11A","ARUNDEL, PARKWOOD","URBAN",448,2.0299999999999998,3.1190000000000002,1.7528999999999999,null,null,2,4.5684000000000002E-2,4.5684000000000002E-2,4.4499999999999997E-4,4.4499999999999997E-4]
[null,"ARL11B","ARUNDEL, HELENSVALE","URBAN",659,1.621,4.43,2.0005999999999999]
[null,"ARL12A","ARUNDEL, PARKWOOD","URBAN",785,1.1100000000000001,3.4950000000000001,2.4769000000000001,null,null,1,1.7200000000000001E-4,1.7200000000000001E-4,9.9000000000000005E-7,9.9000000000000005E-7,1,3.3470000000000001E-3,3.3470000000000001E-3,1.19E-5,1.19E-5]
[null,"ARL12B","ARUNDEL","URBAN",537,8.5999999999999993E-2,4.8239999999999998,1.9624999999999999,null,null,1,1.3100000000000001E-4,1.3100000000000001E-4,9.9000000000000005E-7,9.9000000000000005E-7]
[null,"ARL13A","ARUNDEL, LABRADOR","URBAN",786,0.27,6.9020000000000001,2.7054999999999998,null,null,2,1.6200000000000001E-4,1.6200000000000001E-4,1.99E-6,1.99E-6,1,2.0599999999999999E-4,2.0599999999999999E-4,9.9000000000000005E-7,9.9000000000000005E-7]
[null,"ARL15B","ARUNDEL, BIGGERA WATERS, LABRADOR","URBAN",395,3.835,2.5339999999999998,3.2008999999999999,null,null,2,2.8299999999999999E-4,2.8299999999999999E-4,1.99E-6,1.99E-6,3,4.5690000000000001E-3,4.5690000000000001E-3,3.18E-5,3.18E-5]
[null,"ARL2B","ARUNDEL, COOMBABAH","URBAN",177,2.3370000000000002,3.4889999999999999,4.3822000000000001]
[null,"ARL3A","ARUNDEL, PARKWOOD","URBAN",341,1.784,1.9239999999999999,1.1813,null,null,null,null,null,null,null,1,2.63E-4,2.63E-4,9.9000000000000005E-7,9.9000000000000005E-7]
[null,"ARL5B","BIGGERA WATERS, COOMBABAH, LABRADOR","URBAN",719,2.3780000000000001,3.4489999999999998,2.496,null,null,3,3.5596000000000003E-2,3.5596000000000003E-2,2.4399999999999999E-4,2.4399999999999999E-4,5,9.6265000000000003E-2,9.6265000000000003E-2,2.3900000000000001E-4,2.3900000000000001E-4]
[null,"ARL6B","ARUNDEL, COOMBABAH, LABRADOR","URBAN",268,4.3310000000000004,2.9750000000000001,4.9348000000000001,null,null,1,4.6000000000000001E-4,4.6000000000000001E-4,6.9500000000000004E-6,6.9500000000000004E-6,1,2.04E-4,2.04E-4,1.99E-6,1.99E-6]
[null,"ARLSNT3","ARUNDEL","RURAL",5,0.47,0.17499999999999999,0.1143]
[null,"ASPTR1H","BRISBANE","CBD",2]
[null,"ASTCMP24","BRISBANE","CBD",1,null,0.81299999999999994,0.91449999999999998,null,null,1,6.0740000000000002E-2,null,2.5599999999999999E-4]
[null,"ASTCPY38","BRISBANE","CBD",31,null,0.63500000000000001,1.6576,null,null,1,1.943686,null,8.1860000000000006E-3]
[null,"ASTCQE37","BRISBANE","CBD",96,null,0.45500000000000002,1.429,null,null,1,0.18222099999999999,null,7.67E-4]
[null,"ASTGAS6","BRISBANE","CBD",23,null,0.47499999999999998,1.5052000000000001,null,null,1,2.0651660000000001,null,8.6979999999999991E-3]
[null,"ASTNBH12","BRISBANE","CBD",62,null,0.38700000000000001,2.0387,null,null,1,3.6444100000000001,null,1.5349E-2]
[null,"ASTWIB19","BRISBANE","CBD",1,null,0.20399999999999999,1.9815,null,null,1,0.12148,null,5.1199999999999998E-4]
[null,"ASV1","FORTITUDE VALLEY","URBAN",15,null,0.56999999999999995]
[null,"ASVMLS23","FORTITUDE VALLEY","URBAN",25,null,0.52500000000000002,2.7435999999999998]
[null,"ASVTR1H","FORTITUDE VALLEY","URBAN",256]
[null,"ATC16A","FORTITUDE VALLEY, SPRING HILL","URBAN",375,0.66200000000000003,0.90400000000000003,2.1720999999999999,null,null,3,2.1715999999999999E-2,2.1715999999999999E-2,4.1800000000000002E-4,4.1800000000000002E-4]
[null,"ATC26A","SPRING HILL","URBAN",355,null,1.462,2.4388000000000001]
[null,"ATC7A","SPRING HILL","URBAN",376,null,1.833,2.9723000000000002]
[null,"ATCCSA4","BRISBANE, SPRING HILL","CBD",77,null,0.80600000000000005]
[null,"ATCCSQ11","SPRING HILL","CBD",157,null,0.63200000000000001,2.1149]
[null,"ATCFPV25","SPRING HILL","URBAN",39,null,0.61399999999999999,2.0387]
[null,"ATCIEA9","SPRING HILL","URBAN",71,null,0.41199999999999998,1.3528]
[null,"ATCOXG41","SPRING HILL","CBD",93,null,0.38900000000000001,1.7528999999999999]
[null,"ATCSGO42","BRISBANE, SPRING HILL","CBD",2,null,1.0249999999999999]
[null,"AVHMLS90","FORTITUDE VALLEY","URBAN",11,null,0.36299999999999999,0.91449999999999998]
[null,"AWCT1","BRISBANE","CBD",1]
[null,"BBH10A","BROADBEACH WATERS, BUNDALL, SURFERS PARADISE","URBAN",1474,7.0880000000000001,1.4379999999999999,4.0773999999999999,null,null,10,2.1728999999999998E-2,2.1728999999999998E-2,3.14E-3,3.14E-3,5,1.6605000000000002E-2,1.6605000000000002E-2,1.11E-4,1.11E-4]
[null,"BBH11A","BROADBEACH WATERS","URBAN",1,null,null,1.3337000000000001,null,null,3,5.5000000000000002E-5,5.5000000000000002E-5,2.9799999999999998E-6,2.9799999999999998E-6,1,9.5000000000000005E-5,9.5000000000000005E-5,9.9000000000000005E-7,9.9000000000000005E-7]
[null,"BBH12B","BROADBEACH WATERS, MERMAID BEACH, MERMAID WATERS","URBAN",1375,3.0739999999999998,3.1120000000000001,2.6293000000000002,null,null,7,0.40241199999999999,0.40241199999999999,4.0980000000000001E-3,4.0980000000000001E-3,6,6.3436999999999993E-2,6.3436999999999993E-2,2.2699999999999999E-4,2.2699999999999999E-4]
[null,"BBH13B","BROADBEACH, SURFERS PARADISE","URBAN",2215,1.744,1.8029999999999999,4.2869000000000002,null,null,9,2.8749E-2,2.8749E-2,4.5339999999999998E-3,4.5339999999999998E-3,5,0.163132,0.163132,4.6500000000000003E-4,4.6500000000000003E-4]
[null,"BBH14B","BROADBEACH","URBAN",1,null,0.84,3.6391,null,null,2,1.2999999999999999E-5,1.2999999999999999E-5,1.99E-6,1.99E-6]
[null,"BBH15B","SURFERS PARADISE","URBAN",11,null,1.4890000000000001,0.97170000000000001]
[null,"BBH16A","BROADBEACH, MERMAID BEACH","URBAN",1876,3.306,2.0459999999999998,5.1443000000000003,null,null,14,0.96310600000000002,0.96310600000000002,5.8960000000000002E-3,5.8960000000000002E-3,4,7.8761999999999999E-2,7.8761999999999999E-2,2.03E-4,2.03E-4]
[null,"BBH1A","MERMAID WATERS","RURAL",79,5.8000000000000003E-2,2.8149999999999999,0.32390000000000002,null,null,3,1.3879999999999999E-3,1.3879999999999999E-3,2.0799999999999999E-4,2.0799999999999999E-4]
[null,"BBH1B","BROADBEACH WATERS, MERMAID WATERS","URBAN",null,null,1.413,0.83830000000000005,null,null,1,5.0000000000000004E-6,5.0000000000000004E-6,9.9000000000000005E-7,9.9000000000000005E-7,2,8.7139999999999995E-3,8.7139999999999995E-3,1.99E-6,1.99E-6]
[null,"BBH2A","BROADBEACH, MERMAID BEACH","URBAN",554,0.68,1.2170000000000001,2.5150000000000001,null,null,1,2.013E-3,2.013E-3,5.44E-4,5.44E-4,1,4.4700999999999998E-2,4.4700999999999998E-2,8.8300000000000005E-5,8.8300000000000005E-5]
[null,"BBH3A","BROADBEACH, BROADBEACH WATERS, SURFERS PARADISE","URBAN",1447,1.2370000000000001,2.524,3.1627999999999998,null,null,11,7.4260000000000003E-3,7.4260000000000003E-3,1.534E-3,1.534E-3,3,2.6245000000000001E-2,2.6245000000000001E-2,5.5600000000000003E-5,5.5600000000000003E-5]
[null,"BBH4A","BROADBEACH","URBAN",583,null,1.2410000000000001,2.8389000000000002,null,null,2,1.924E-2,1.924E-2,6.6500000000000001E-4,6.6500000000000001E-4,1,1.9549E-2,1.9549E-2,8.5400000000000002E-5,8.5400000000000002E-5]
[null,"BBH4B","BROADBEACH","URBAN",151,null,1.0209999999999999,2.2483,null,null,3,1.4862E-2,1.4862E-2,2.7E-4,2.7E-4]
[null,"BBH5A","BROADBEACH","URBAN",2,null,0.48499999999999999,2.8008000000000002,null,null,1,1.0000000000000001E-5,1.0000000000000001E-5,1.99E-6,1.99E-6]
[null,"BBH7A","BROADBEACH","URBAN",17,null,1.077,4.1917,null,null,1,1.2999999999999999E-4,1.2999999999999999E-4,2.48E-5,2.48E-5,1,9.7E-5,9.7E-5,9.9000000000000005E-7,9.9000000000000005E-7]
[null,"BBH8A","BROADBEACH WATERS","URBAN",1274,4.0890000000000004,1.867,3.7153999999999998,null,null,6,3.7240000000000002E-2,3.7240000000000002E-2,1.9189999999999999E-3,1.9189999999999999E-3,5,5.8335999999999999E-2,5.8335999999999999E-2,2.1800000000000001E-4,2.1800000000000001E-4]
[null,"BBHORW6","BROADBEACH","URBAN",59,0.58299999999999996,1.24,2.9723000000000002,null,null,1,3.0600000000000001E-4,3.0600000000000001E-4,5.8600000000000001E-5,5.8600000000000001E-5]
[null,"BBS11A","CARINDALE, MANSFIELD","URBAN",1538,3.1779999999999999,6.1660000000000004,4.649,null,null,6,2.3543000000000001E-2,2.3428000000000001E-2,1.74E-4,1.73E-4,4,1.1313E-2,1.1313E-2,4.57E-5,4.57E-5]
[null,"BBS15A","MANSFIELD","URBAN",297,1.1990000000000001,2.9039999999999999,3.2008999999999999,null,null,2,6.9369999999999996E-3,6.9369999999999996E-3,6.1500000000000004E-5,6.1500000000000004E-5,1,4.4070000000000003E-3,4.4070000000000003E-3,1.19E-5,1.19E-5]
[null,"BBS8A","MACKENZIE, MANSFIELD, WISHART","URBAN",1438,4.2450000000000001,1.7509999999999999,4.5537000000000001,null,null,6,5.7399999999999997E-4,5.7399999999999997E-4,5.9599999999999997E-6,5.9599999999999997E-6,6,2.0889999999999999E-2,2.0889999999999999E-2,8.2399999999999997E-5,8.2399999999999997E-5]
[null,"BBSRBW7","CARINDALE, MACKENZIE, ROCHEDALE","URBAN",40,1.056,0.16700000000000001,2.1720999999999999]
[null,"BBSRDL12","BELMONT, BURBANK, CAPALABA WEST, CHANDLER, MACKENZIE, ROCHEDALE","RURAL",795,33.136000000000003,5.1509999999999998,3.0293999999999999,null,null,22,1.4836279999999999,1.4836279999999999,1.2418999999999999E-2,1.2418999999999999E-2,10,3.5570999999999998E-2,3.5570999999999998E-2,1.2E-4,1.2E-4]
[null,"BBSRDL8","ROCHEDALE","RURAL",3,0.26,null,null,null,null,1,4.5230000000000001E-3,4.5230000000000001E-3,3.0800000000000003E-5,3.0800000000000003E-5]
[null,"BCTFIS4",null,"URBAN",1,null,2.093,0.5716]
[null,"BDA12B","ANNERLEY, DUTTON PARK, HIGHGATE HILL, SOUTH BRISBANE, WOOLLOONGABBA","URBAN",1830,5.1239999999999997,4.0010000000000003,5.7159000000000004,null,null,13,3.5340999999999997E-2,3.5340999999999997E-2,2.8400000000000002E-4,2.8400000000000002E-4,22,0.15521399999999999,0.146727,4.6799999999999999E-4,4.2999999999999999E-4]
[null,"BDA13A","ANNERLEY, WOOLLOONGABBA","URBAN",429,0.158,5.069,5.1253000000000002,null,null,1,6.8999999999999997E-5,6.8999999999999997E-5,9.9000000000000005E-7,9.9000000000000005E-7,2,4.2209999999999999E-3,4.2209999999999999E-3,1.9899999999999999E-5,1.9899999999999999E-5]
[null,"BDA2B","ANNERLEY, SOUTH BRISBANE","RURAL",2,null,3.1059999999999999,0.81930000000000003]
[null,"BDA3A","DUTTON PARK, HIGHGATE HILL, WOOLLOONGABBA","URBAN",1980,3.8250000000000002,2.089,2.8199000000000001,null,null,9,7.0670999999999998E-2,7.0670999999999998E-2,7.1299999999999998E-4,7.1299999999999998E-4,5,2.6941E-2,2.6941E-2,8.9300000000000002E-5,8.9300000000000002E-5]
[null,"BDA5A","WOOLLOONGABBA","URBAN",410,1.6479999999999999,2.476,1.8482000000000001,null,null,1,4.5240000000000002E-3,4.5240000000000002E-3,5.2599999999999998E-5,5.2599999999999998E-5]
[null,"BDB1A",null,"URBAN",1,null,1.617,1.81]
[null,"BDB23A","BUNDAMBA","URBAN",1,0.14299999999999999,1.3979999999999999,0.87639999999999996]
[null,"BDB27A","BUNDAMBA, CHUWAR, KARALEE","RURAL",848,13.128,4.7060000000000004,2.8389000000000002,null,null,16,0.480827,0.47859099999999999,4.3860000000000001E-3,4.3810000000000003E-3,5,1.8037999999999998E-2,1.8037999999999998E-2,1.05E-4,1.05E-4]
[null,"BDB28A","DINMORE, RIVERVIEW","RURAL",652,6.2080000000000002,2.5470000000000002,1.9434,null,null,6,9.3229999999999997E-3,9.3229999999999997E-3,3.8999999999999999E-4,3.8999999999999999E-4,3,1.5136E-2,1.5136E-2,5.8999999999999998E-5,5.8999999999999998E-5]
[null,"BDB32A","BUNDAMBA, CHUWAR, NORTH BOOVAL, NORTH TIVOLI, TIVOLI","RURAL",621,11.99,2.9790000000000001,1.7909999999999999,null,null,7,8.1589999999999996E-3,8.1589999999999996E-3,8.9699999999999998E-5,8.9699999999999998E-5,8,3.1619000000000001E-2,2.9531999999999999E-2,1.44E-4,1.15E-4]
[null,"BDB33A","BUNDAMBA, RIVERVIEW","URBAN",7,2.883,1.135,3.2961999999999998,null,null,1,1.9000000000000001E-5,null,6.9500000000000004E-6]
[null,"BDB35A","BUNDAMBA, EBBW VALE","URBAN",1156,7.3470000000000004,1.819,3.2389999999999999,null,null,4,4.718E-3,4.718E-3,8.7299999999999994E-5,8.7299999999999994E-5,11,1.9493E-2,1.9493E-2,1.36E-4,1.36E-4]
[null,"BDB36A","BUNDAMBA, NORTH BOOVAL","RURAL",1165,7.8639999999999999,1.012,2.4388000000000001,null,null,5,6.5934999999999994E-2,6.5626000000000004E-2,5.2499999999999997E-4,5.2300000000000003E-4,7,9.5870999999999998E-2,9.5870999999999998E-2,3.4900000000000003E-4,3.4900000000000003E-4]
[null,"BDB37A","BARELLAN POINT, BUNDAMBA, KARALEE, KARANA DOWNS, RIVERVIEW","RURAL",1013,16.745000000000001,6.431,4.8776000000000002,null,null,14,2.6330200000000001,0.517903,7.8209999999999998E-3,5.2750000000000002E-3,6,7.4189000000000005E-2,7.4189000000000005E-2,3.0800000000000001E-4,3.0800000000000001E-4]
[null,"BDB4A","BUNDAMBA, DINMORE, EBBW VALE, NEW CHUM","RURAL",225,4.1239999999999997,2.5859999999999999,1.9434,null,null,1,2.8200000000000002E-4,2.8200000000000002E-4,2.5600000000000001E-6,2.5600000000000001E-6,4,1.5997999999999998E-2,1.5997999999999998E-2,6.9200000000000002E-5,6.9200000000000002E-5]
[null,"BDB6B","RIVERVIEW","URBAN",2,4.4340000000000002,1.726,8.7263000000000002,null,null,2,8.3900000000000001E-4,3.9599999999999998E-4,4.9599999999999999E-6,2.9799999999999998E-6]
[null,"BDBBRW3B",null,"URBAN",1,null,1.4530000000000001]
[null,"BDBBRW8B",null,"URBAN",1,null,1.4530000000000001]
[null,"BDBCAL2A",null,"URBAN",1,null,0.72399999999999998,4.1917,null,null,null,null,null,null,null,1,2.5300000000000002E-4,2.5300000000000002E-4,9.9000000000000005E-7,9.9000000000000005E-7]
[null,"BDL1","BUNDALL","URBAN",125,1.173,3.5089999999999999,3.0674999999999999,null,null,2,3.0067E-2,3.0067E-2,1E-4,1E-4]
[null,"BDL2","ASHMORE, BENOWA, SOUTHPORT, SURFERS PARADISE","URBAN",1413,4.1909999999999998,3.3149999999999999,3.4104999999999999,null,null,5,2.4269999999999999E-3,2.4269999999999999E-3,6.96E-4,6.96E-4,4,6.4466999999999997E-2,6.4466999999999997E-2,2.3599999999999999E-4,2.3599999999999999E-4]
[null,"BDL3","BUNDALL, SOUTHPORT, SURFERS PARADISE","URBAN",247,1.607,1.6890000000000001,2.0958000000000001,null,null,2,2.1753999999999999E-2,2.1753999999999999E-2,2.4499999999999999E-4,2.4499999999999999E-4,4,1.6309000000000001E-2,1.6309000000000001E-2,6.1500000000000004E-5,6.1500000000000004E-5]
[null,"BDL4","BENOWA, BUNDALL","URBAN",1796,4.18,2.86,5.2587000000000002,null,null,8,3.2390000000000001E-3,3.2390000000000001E-3,6.9499999999999995E-5,6.9499999999999995E-5]
[null,"BDL5","BUNDALL, SOUTHPORT","URBAN",381,1.6020000000000001,4.3620000000000001,3.4485999999999999,null,null,null,null,null,null,null,1,2.5609999999999999E-3,2.5609999999999999E-3,1.49E-5,1.49E-5]
[null,"BDL6","BUNDALL","URBAN",223,1.7749999999999999,1.4810000000000001,3.6391,null,null,null,null,null,null,null,1,8.4199999999999998E-4,8.4199999999999998E-4,3.9700000000000001E-6,3.9700000000000001E-6]
[null,"BDL7","BUNDALL, SOUTHPORT","URBAN",268,1.26,1.3560000000000001,4.4775,null,null,1,3.091E-3,3.091E-3,8.9299999999999992E-6,8.9299999999999992E-6,2,3.6200000000000002E-4,3.6200000000000002E-4,1.99E-6,1.99E-6]
[null,"BDT1","BEAUDESERT, CAINBABLE, CANUNGRA, DARLINGTON, KERRY, NINDOOINBAH, TABRAGALBA","RURAL",1125,109.78,0.58599999999999997,3.7153999999999998,null,null,24,1.163408,0.31159199999999998,3.9319999999999997E-3,1.9740000000000001E-3,38,0.19187799999999999,0.19187799999999999,6.7199999999999996E-4,6.7199999999999996E-4]
[null,"BDT2","BEAUDESERT, CRYNA, JOSEPHVILLE","RURAL",237,88.995000000000005,4.1000000000000002E-2,1.3528,null,null,3,1.8776999999999999E-2,1.8776999999999999E-2,2.1800000000000001E-4,2.1800000000000001E-4,11,4.6737000000000001E-2,4.6737000000000001E-2,1.5100000000000001E-4,1.5100000000000001E-4]
[null,"BDT3","BEAUDESERT, CEDAR VALE, GLENEAGLE, MUNDOOLUN, VERESDALE, VERESDALE SCRUB","RURAL",652,46.744999999999997,0.13400000000000001,1.6576,null,null,16,1.2121729999999999,0.13053200000000001,4.4169999999999999E-3,2.6710000000000002E-3,16,0.251747,0.251747,6.0800000000000003E-4,6.0800000000000003E-4]
[null,"BDT4","ALLENVIEW, BEAUDESERT, CEDAR VALE, GLENEAGLE, VERESDALE, WOODHILL","RURAL",1570,69.36,2.9460000000000002,5.3920000000000003,null,null,17,1.7010110000000001,0.30370000000000003,6.6010000000000001E-3,5.293E-3,25,0.108598,0.108598,4.0499999999999998E-4,4.0499999999999998E-4]
[null,"BDT5","BEAUDESERT, BIDDADDABA, TABRAGALBA","RURAL",844,28.876000000000001,3.472,1.81,null,null,11,0.18431400000000001,0.18431400000000001,2.333E-3,2.333E-3,21,0.14833499999999999,0.14641199999999999,6.2299999999999996E-4,6.1799999999999995E-4]
[null,"BDT6","BEAUDESERT","URBAN",458,4.9859999999999998,0.64900000000000002,4.0011999999999999,null,null,4,3.6204E-2,3.6204E-2,4.8899999999999996E-4,4.8899999999999996E-4,9,2.9557E-2,2.9557E-2,1.2400000000000001E-4,1.2400000000000001E-4]
[null,"BFBECC2","BRISBANE","CBD",71,null,0.42699999999999999]
[null,"BFBT1","BRISBANE","CBD",1]
[null,"BGY13A","BURPENGARY","URBAN",50,1.387,0.53500000000000003,0.93359999999999999,null,null,null,null,null,null,null,1,3.1100000000000002E-4,3.1100000000000002E-4,9.9000000000000005E-7,9.9000000000000005E-7]
[null,"BGY15A","BURPENGARY, NARANGBA","URBAN",1452,9.5269999999999992,8.5030000000000001,5.5254000000000003,null,null,6,0.167132,0.167132,1.436E-3,1.436E-3,4,5.8710000000000004E-3,5.8710000000000004E-3,6.5500000000000006E-5,6.5500000000000006E-5]
[null,"BGY17A","BURPENGARY","URBAN",1917,8.2249999999999996,3.9990000000000001,4.5918000000000001,null,null,11,5.8799999999999998E-3,5.8799999999999998E-3,6.1500000000000004E-5,6.1500000000000004E-5,12,2.2702E-2,2.2702E-2,1.4200000000000001E-4,1.4200000000000001E-4]
[null,"BGY3A","BURPENGARY","URBAN",243,2.5960000000000001,1.546,3.5247999999999999,null,null,1,1.35E-4,1.35E-4,9.9000000000000005E-7,9.9000000000000005E-7]
[null,"BGY5A","BURPENGARY, BURPENGARY EAST, DECEPTION BAY","RURAL",1383,24.501000000000001,1.2250000000000001,3.3723999999999998,null,null,6,0.28404699999999999,0.28404699999999999,3.7550000000000001E-3,3.7550000000000001E-3,5,8.8550000000000004E-2,8.8550000000000004E-2,3.5100000000000002E-4,3.5100000000000002E-4]
[null,"BGY6A","BURPENGARY, NARANGBA","URBAN",1549,2.8769999999999998,12.867000000000001,4.9348000000000001,null,null,4,3.3180000000000002E-3,3.3180000000000002E-3,3.4700000000000003E-5,3.4700000000000003E-5,4,1.4919999999999999E-2,1.4919999999999999E-2,6.5500000000000006E-5,6.5500000000000006E-5]
[null,"BHD1A","PALM BEACH","URBAN",1433,3.2160000000000002,4.0410000000000004,2.5341,null,null,5,8.3600000000000005E-4,8.3600000000000005E-4,4.9599999999999999E-6,4.9599999999999999E-6,14,9.5203999999999997E-2,9.5203999999999997E-2,2.92E-4,2.92E-4]
[null,"BHD20A","BURLEIGH HEADS, BURLEIGH WATERS","URBAN",1363,3.89,0.88600000000000001,2.9531999999999998,null,null,4,3.0384000000000001E-2,3.0384000000000001E-2,1.27E-4,1.27E-4,11,6.7599000000000006E-2,6.7599000000000006E-2,2.4399999999999999E-4,2.4399999999999999E-4]
[null,"BHD21A","BURLEIGH HEADS, ELANORA, PALM BEACH","URBAN",1168,4.8090000000000002,7.1660000000000004,3.601,null,null,7,2.7889999999999998E-3,2.7889999999999998E-3,6.8499999999999998E-5,6.8499999999999998E-5,8,0.106493,0.106493,3.0299999999999999E-4,3.0299999999999999E-4]
[null,"BHD23A","BURLEIGH HEADS, CURRUMBIN VALLEY, ELANORA, TALLEBUDGERA","RURAL",1243,28.013000000000002,3.2810000000000001,3.6962999999999999,null,null,22,1.2594080000000001,1.2594080000000001,1.4121E-2,1.4121E-2,6,2.9104000000000001E-2,2.9104000000000001E-2,4.1800000000000002E-4,4.1800000000000002E-4]
[null,"BHD2A","BURLEIGH HEADS, BURLEIGH WATERS, VARSITY LAKES","URBAN",888,2.5999999999999999E-2,6.5279999999999996,1.9053,null,null,1,1.01E-4,1.01E-4,9.9000000000000005E-7,9.9000000000000005E-7]
[null,"BHD31A","BURLEIGH HEADS","URBAN",674,3.6869999999999998,2.2120000000000002,3.3532999999999999,null,null,3,1.5461000000000001E-2,1.5461000000000001E-2,9.4300000000000002E-5,9.4300000000000002E-5,3,2.8212000000000001E-2,2.8212000000000001E-2,1.4100000000000001E-4,1.4100000000000001E-4]
[null,"BHD32B","BURLEIGH HEADS","URBAN",915,1.149,2.9239999999999999,2.4197000000000002,null,null,2,8.3280000000000003E-3,8.3280000000000003E-3,3.3699999999999999E-5,3.3699999999999999E-5,1,7.143E-3,7.143E-3,2.7800000000000001E-5,2.7800000000000001E-5]
[null,"BHD33A","BURLEIGH WATERS","URBAN",602,1.61,3.847,3.5057999999999998,null,null,2,1.6000000000000001E-4,1.6000000000000001E-4,1.99E-6,1.99E-6,1,1.1900000000000001E-4,1.1900000000000001E-4,9.9000000000000005E-7,9.9000000000000005E-7]
[null,"BHD35A","BURLEIGH HEADS, REEDY CREEK, TALLEBUDGERA, TALLEBUDGERA VALLEY","RURAL",1467,57.008000000000003,4.5730000000000004,4.2679,null,null,26,0.29569000000000001,0.23799899999999999,3.5040000000000002E-3,3.2659999999999998E-3,15,0.29891899999999999,0.29891899999999999,8.7399999999999999E-4,8.7399999999999999E-4]
[null,"BHD36A","BURLEIGH HEADS, PALM BEACH","URBAN",1202,2.2050000000000001,3.5289999999999999,2.5150000000000001,null,null,2,5.1599999999999997E-4,5.1599999999999997E-4,1.99E-6,1.99E-6,6,8.8207999999999995E-2,8.8207999999999995E-2,2.8899999999999998E-4,2.8899999999999998E-4]
[null,"BHD3A","BURLEIGH WATERS, VARSITY LAKES","URBAN",1268,2.7639999999999998,4.5709999999999997,3.0104000000000002,null,null,3,3.1E-4,3.1E-4,2.9799999999999998E-6,2.9799999999999998E-6]
[null,"BHD41A","BURLEIGH HEADS, REEDY CREEK, VARSITY LAKES","RURAL",1456,5.7969999999999997,9.1880000000000006,4.306,null,null,5,7.2579999999999997E-3,7.2579999999999997E-3,5.8999999999999998E-5,5.8999999999999998E-5,4,3.3041000000000001E-2,3.3041000000000001E-2,1.26E-4,1.26E-4]
[null,"BHD42A","BURLEIGH HEADS","URBAN",1,0.157,1.472,1.3528,null,null,null,null,null,null,null,1,1.2999999999999999E-5,1.2999999999999999E-5,9.9000000000000005E-7,9.9000000000000005E-7]
[null,"BHD44A","BURLEIGH HEADS, BURLEIGH WATERS, MIAMI","URBAN",2000,5.0759999999999996,3.6560000000000001,3.9821,null,null,8,1.0499999999999999E-3,9.4499999999999998E-4,7.9400000000000002E-6,6.9500000000000004E-6,1,1.699E-3,1.699E-3,7.9400000000000002E-6,7.9400000000000002E-6]
[null,"BHD45B","BURLEIGH WATERS","URBAN",1604,0.115,7.9850000000000003,3.5629,null,null,5,4.35E-4,4.35E-4,4.9599999999999999E-6,4.9599999999999999E-6,2,4.7359999999999998E-3,4.7359999999999998E-3,4.57E-5,4.57E-5]
[null,"BHD46A","BURLEIGH HEADS","URBAN",489,4.4859999999999998,1.0640000000000001,3.9630000000000001,null,null,3,2.4899999999999998E-4,2.4899999999999998E-4,2.9799999999999998E-6,2.9799999999999998E-6,2,1.7961000000000001E-2,1.7961000000000001E-2,8.7299999999999994E-5,8.7299999999999994E-5]
[null,"BHD4A","BURLEIGH HEADS, BURLEIGH WATERS","URBAN",18,0.63800000000000001,0.48099999999999998,2.7246000000000001,null,null,null,null,null,null,null,1,1.06E-4,1.06E-4,9.9000000000000005E-7,9.9000000000000005E-7]
[null,"BHD5A","BURLEIGH HEADS","URBAN",1306,4.1920000000000002,0.91,3.1057000000000001,null,null,5,2.5829999999999998E-3,2.5829999999999998E-3,2.6800000000000001E-5,2.6800000000000001E-5,14,0.18887399999999999,0.18887399999999999,4.8700000000000002E-4,4.8700000000000002E-4]
[null,"BHD7A","BURLEIGH HEADS, ELANORA, PALM BEACH","URBAN",1298,2.859,5.6630000000000003,3.4296000000000002,null,null,6,0.175956,0.175956,1.2819999999999999E-3,1.2819999999999999E-3,3,2.7070000000000002E-3,2.7070000000000002E-3,2.9799999999999999E-5,2.9799999999999999E-5]
[null,"BHDRCK29","BURLEIGH HEADS, VARSITY LAKES","URBAN",177,3.9319999999999999,2.36,2.8008000000000002,null,null,4,6.6699999999999995E-4,6.6699999999999995E-4,3.9700000000000001E-6,3.9700000000000001E-6,3,2.3760000000000001E-3,2.3760000000000001E-3,1.49E-5,1.49E-5]
[null,"BHL1","BALD HILLS, BRACKEN RIDGE","URBAN",656]
[null,"BHL1A",null,"URBAN",null,1.9259999999999999,1.9490000000000001,1.3337000000000001,null,null,4,9.4712000000000005E-2,9.4712000000000005E-2,1.1770000000000001E-3,1.1770000000000001E-3,1,3.97E-4,3.97E-4,7.9400000000000002E-6,7.9400000000000002E-6]
[null,"BHL2A","BALD HILLS, BRIDGEMAN DOWNS, CARSELDINE","URBAN",850,8.82,2.2370000000000001,5.0872000000000002,null,null,2,4.8479999999999999E-3,4.8479999999999999E-3,5.1600000000000001E-5,5.1600000000000001E-5,7,3.0204999999999999E-2,3.0204999999999999E-2,1.15E-4,1.15E-4]
[null,"BHL3","BALD HILLS, BRIDGEMAN DOWNS, CARSELDINE","URBAN",1393,null,null,null,null,null,1,2.0000000000000001E-4,2.0000000000000001E-4,9.9000000000000005E-7,9.9000000000000005E-7,1,7.7200000000000001E-4,7.7200000000000001E-4,1.99E-6,1.99E-6]
[null,"BHL3A",null,"URBAN",null,2.8149999999999999,5.7759999999999998,4.4013,null,null,3,8.6600000000000002E-4,8.6600000000000002E-4,1.2999999999999999E-4,1.2999999999999999E-4,7,9.5169999999999994E-3,9.5169999999999994E-3,3.3699999999999999E-5,3.3699999999999999E-5]
[null,"BHL4A","BALD HILLS, BRACKEN RIDGE","RURAL",1408,7.4880000000000004,6.2560000000000002,3.6200999999999999,null,null,7,4.2278000000000003E-2,4.2278000000000003E-2,3.8699999999999997E-4,3.8699999999999997E-4,3,1.7187000000000001E-2,1.7187000000000001E-2,5.6400000000000002E-5,5.6400000000000002E-5]
[null,"BHL5A","BALD HILLS, BRACKEN RIDGE","URBAN",1765,6.8970000000000002,6.9809999999999999,4.8204000000000002,null,null,14,0.15128,0.15128,1.8209999999999999E-3,1.8209999999999999E-3,7,2.6412000000000001E-2,2.6412000000000001E-2,9.6299999999999996E-5,9.6299999999999996E-5]
[null,"BHL6A","CARSELDINE","URBAN",782,0.218,5.3730000000000002,1.8290999999999999,null,null,null,null,null,null,null,1,1.11E-4,1.11E-4,1.99E-6,1.99E-6]
[null,"BHL7","BRACKEN RIDGE","URBAN",1103,null,null,null,null,null,1,7.0920000000000002E-3,7.0920000000000002E-3,5.0599999999999997E-5,5.0599999999999997E-5]
[null,"BHL7A",null,"URBAN",71,0.17399999999999999,5.4939999999999998,2.4197000000000002,null,null,1,6.6000000000000005E-5,6.6000000000000005E-5,9.9000000000000005E-7,9.9000000000000005E-7,10,8.3921999999999997E-2,8.3921999999999997E-2,2.5799999999999998E-4,2.5799999999999998E-4]
[null,"BIS1",null,"RURAL",null,4.2030000000000003,5.14,3.22,null,null,1,5.0000000000000001E-4,5.0000000000000001E-4,2.5600000000000001E-6,2.5600000000000001E-6]
[null,"BIS1",null,"URBAN",null,4.2030000000000003,5.14,3.22,null,null,2,0.18246200000000001,0.18246200000000001,1.2880000000000001E-3,1.2880000000000001E-3]
[null,"BIS12B","BANKSIA BEACH, WHITE PATCH","RURAL",1493,4.2809999999999997,11.461,3.6772,null,null,7,1.7833019999999999,1.026489,1.2732E-2,8.9770000000000006E-3,1,1.0660000000000001E-3,1.0660000000000001E-3,2.5600000000000001E-6,2.5600000000000001E-6]
[null,"BIS13A","BONGAREE","URBAN",1069,2.9060000000000001,4.5090000000000003,3.7153999999999998,null,null,3,0.34841,0.34841,1.062E-3,1.062E-3,3,2.4599999999999999E-3,2.4599999999999999E-3,2.2799999999999999E-5,2.2799999999999999E-5]
[null,"BIS15A","BONGAREE, WOORIM","RURAL",1141,9.6489999999999991,2.4689999999999999,3.4676999999999998,null,null,8,1.532392,0.572851,8.6379999999999998E-3,5.7190000000000001E-3,3,3.8419999999999999E-3,3.8419999999999999E-3,1.5400000000000002E-5,1.5400000000000002E-5]
[null,"BIS16A","BANKSIA BEACH, BELLARA","URBAN",1934,6.31,3.3580000000000001,3.4866999999999999,null,null,15,0.26933499999999999,0.26933499999999999,2.3579999999999999E-3,2.3579999999999999E-3,8,5.7195000000000003E-2,5.7195000000000003E-2,2.8499999999999999E-4,2.8499999999999999E-4]
[null,"BIS1A","BANKSIA BEACH, BELLARA","URBAN",1295,null,null,null,null,null,4,0.43356600000000001,0.43356600000000001,1.2880000000000001E-3,1.2880000000000001E-3,3,1.2831E-2,1.2831E-2,9.2299999999999994E-5,9.2299999999999994E-5]
[null,"BIS2B","BEACHMERE, BELLARA, WOORIM","RURAL",1164,13.074999999999999,1.5509999999999999,2.6674000000000002,null,null,9,6.3071000000000002E-2,1.9532999999999998E-2,3.77E-4,1.74E-4,4,4.8465000000000001E-2,4.8465000000000001E-2,2.7900000000000001E-4,2.7900000000000001E-4]
[null,"BIS3",null,"RURAL",null,null,null,null,null,null,10,4.4539999999999996E-3,4.4539999999999996E-3,1.3100000000000001E-4,1.3100000000000001E-4,1,1.825E-3,1.825E-3,1.03E-5,1.03E-5]
[null,"BISTPT3","BELLARA, BONGAREE, SANDSTONE POINT","RURAL",1933,7.1070000000000002,3.88,3.1819000000000002]
[null,"BKD12A","BIRKDALE","URBAN",1694,4.3120000000000003,5.8860000000000001,4.5156000000000001,null,null,13,0.27973900000000002,0.27973900000000002,1.841E-3,1.841E-3,2,3.9569999999999996E-3,3.9569999999999996E-3,2.0800000000000001E-5,2.0800000000000001E-5]
[null,"BKD13A","ALEXANDRA HILLS, BIRKDALE","URBAN",2508,11.019,2.121,5.9065000000000003,null,null,13,9.1914999999999997E-2,9.1914999999999997E-2,2.6099999999999999E-3,2.6099999999999999E-3,14,3.7058000000000001E-2,3.6379000000000002E-2,1.8200000000000001E-4,1.76E-4]
[null,"BKD15A","ALEXANDRA HILLS","URBAN",1116,7.1079999999999997,0.36,3.3532999999999999,null,null,9,1.6670000000000001E-2,1.6670000000000001E-2,2.4699999999999999E-4,2.4699999999999999E-4,17,9.6429000000000001E-2,9.6429000000000001E-2,3.3E-4,3.3E-4]
[null,"BKD16A","BIRKDALE, THORNESIDE","URBAN",1783,8.1199999999999992,3.1970000000000001,4.1917,null,null,11,2.6879999999999999E-3,2.6879999999999999E-3,1.74E-4,1.74E-4,2,4.0518999999999999E-2,4.0518999999999999E-2,1.7000000000000001E-4,1.7000000000000001E-4]
[null,"BKD2B","BIRKDALE, THORNESIDE","URBAN",1313,6.6319999999999997,2.4910000000000001,3.1057000000000001,null,null,4,0.189443,0.189443,1.3749999999999999E-3,1.3749999999999999E-3,2,6.8199999999999999E-4,6.8199999999999999E-4,6.9500000000000004E-6,6.9500000000000004E-6]
[null,"BKD3A","BIRKDALE, WELLINGTON POINT","URBAN",1874,7.117,4.2830000000000004,5.8684000000000003,null,null,9,0.18038299999999999,0.18038299999999999,1.8630000000000001E-3,1.8630000000000001E-3,5,8.8559999999999993E-3,8.8559999999999993E-3,5.0599999999999997E-5,5.0599999999999997E-5]
[null,"BKD5B","BIRKDALE, WELLINGTON POINT","RURAL",1860,7.6390000000000002,3.6360000000000001,4.1917]
[null,"BKD5B","BIRKDALE, WELLINGTON POINT","URBAN",null,7.6390000000000002,3.6360000000000001,4.1917,null,null,9,1.8282E-2,1.8037000000000001E-2,2.1100000000000001E-4,2.1000000000000001E-4,14,2.0597000000000001E-2,2.0597000000000001E-2,9.4300000000000002E-5,9.4300000000000002E-5]
[null,"BLB2A","BALMORAL, BULIMBA, HAWTHORNE","URBAN",1646,4.5819999999999999,1.2410000000000001,5.3920000000000003,null,null,9,9.9220000000000003E-3,9.9220000000000003E-3,1.7200000000000001E-4,1.7200000000000001E-4,4,5.5219999999999998E-2,5.5219999999999998E-2,1.47E-4,1.47E-4]
[null,"BLB4A","BALMORAL, BULIMBA, MORNINGSIDE","URBAN",840,3.153,0.97399999999999998,2.3054000000000001,null,null,7,0.230827,0.221691,8.5800000000000004E-4,8.3199999999999995E-4,11,3.585E-2,3.585E-2,1.1E-4,1.1E-4]
[null,"BLB5A","BULIMBA","URBAN",1069,4.4119999999999999,1.032,2.9912999999999998,null,null,6,4.4748999999999997E-2,4.4748999999999997E-2,2.0599999999999999E-4,2.0599999999999999E-4]
[null,"BLB8B","BALMORAL, BULIMBA, HAWTHORNE, MORNINGSIDE","URBAN",2190,6.4169999999999998,0.84399999999999997,5.7920999999999996,null,null,5,8.0599999999999997E-4,8.0599999999999997E-4,6.9500000000000004E-6,6.9500000000000004E-6,5,2.8218E-2,2.8218E-2,9.6299999999999996E-5,9.6299999999999996E-5]
[null,"BLB9A","BULIMBA","URBAN",1112,1.9750000000000001,2.0339999999999998,4.2679,null,null,10,0.13798199999999999,0.13798199999999999,1.3780000000000001E-3,1.3780000000000001E-3,1,7.5570000000000003E-3,7.5570000000000003E-3,2.2799999999999999E-5,2.2799999999999999E-5]
[null,"BLBNFM6","HAWTHORNE, MORNINGSIDE","URBAN",2261,6.42,2.0550000000000002,4.5918000000000001,null,null,5,7.8684000000000004E-2,7.8684000000000004E-2,1.0250000000000001E-3,1.0250000000000001E-3,9,4.2053E-2,4.2053E-2,2.0599999999999999E-4,2.0599999999999999E-4]
[null,"BLCT1","BRISBANE","CBD",35]
[null,"BLH10A","BEENLEIGH, MOUNT WARREN PARK, STAPYLTON, YATALA","URBAN",375,4.0949999999999998,2.8479999999999999,3.2389999999999999,null,null,2,2.4399999999999999E-4,2.4399999999999999E-4,1.99E-6,1.99E-6,4,1.2642E-2,1.2642E-2,1.0399999999999999E-4,1.0399999999999999E-4]
[null,"BLH10B","ALBERTON, EAGLEBY","URBAN",2247,13.895,3.778,5.0110000000000001,null,null,11,1.635E-3,1.635E-3,1.59E-5,1.59E-5,7,1.8987E-2,1.8987E-2,1.46E-4,1.46E-4]
[null,"BLH11B","BEENLEIGH","URBAN",161,0.89600000000000002,1.2290000000000001,1.5813999999999999,null,null,null,null,null,null,null,3,9.8480000000000009E-3,9.8480000000000009E-3,3.6699999999999998E-5,3.6699999999999998E-5]
[null,"BLH12A","BAHRS SCRUB, BANNOCKBURN, BEENLEIGH, BELIVAH, CEDAR CREEK, LUSCOMBE, MOUNT WARREN PARK, TAMBORINE, WINDAROO, WOLFFDENE","RURAL",1712,65.287999999999997,5.2080000000000002,4.8966000000000003,null,null,21,0.27898699999999999,0.27847499999999997,2.281E-3,2.2790000000000002E-3,28,0.41776099999999999,0.40803299999999998,1.5E-3,1.441E-3]
[null,"BLH12B","EAGLEBY","URBAN",1360,5.4169999999999998,3.1389999999999998,3.4676999999999998,null,null,14,4.0182000000000002E-2,2.1988000000000001E-2,1.7100000000000001E-4,9.3300000000000005E-5,4,2.4125000000000001E-2,2.4125000000000001E-2,1.1E-4,1.1E-4]
[null,"BLH13B","ALBERTON, BEENLEIGH, EAGLEBY, STAPYLTON","RURAL",309,29.809000000000001,3.7679999999999998,3.4104999999999999,null,null,11,8.3879999999999996E-2,5.2051E-2,9.2800000000000001E-4,8.6600000000000002E-4,4,4.9165E-2,4.9165E-2,2.05E-4,2.05E-4]
[null,"BLH14A","BEENLEIGH","URBAN",49,0.312,1.6419999999999999,2.4388000000000001]
[null,"BLH15B","MOUNT WARREN PARK","URBAN",501,2.8860000000000001,0.49199999999999999,1.7719,null,null,1,6.6000000000000005E-5,6.6000000000000005E-5,9.9000000000000005E-7,9.9000000000000005E-7]
[null,"BLH16A","BEENLEIGH","URBAN",584,3.1949999999999998,0.29799999999999999,1.0669999999999999,null,null,2,2.7604E-2,2.7604E-2,5.4799999999999998E-4,5.4799999999999998E-4,4,2.3917999999999998E-2,2.3917999999999998E-2,1.27E-4,1.27E-4]
[null,"BLH9A","BEENLEIGH","URBAN",447,1.843,0.872,2.8580000000000001,null,null,2,3.3264000000000002E-2,3.3264000000000002E-2,9.0499999999999999E-4,9.0499999999999999E-4,4,8.6719999999999992E-3,8.6719999999999992E-3,2.8799999999999999E-5,2.8799999999999999E-5]
[null,"BLH9B","MOUNT WARREN PARK","URBAN",1490,6.4569999999999999,2.8410000000000002,3.7534999999999998,null,null,10,0.140875,0.140875,3.0590000000000001E-3,3.0590000000000001E-3,3,8.8000000000000005E-3,8.8000000000000005E-3,3.57E-5,3.57E-5]
[null,"BLHSTN16","ALBERTON, GILBERTON, STAPYLTON, YATALA","RURAL",361,9.5079999999999991,2.3010000000000002,3.2389999999999999,null,null,6,7.1221000000000007E-2,7.1221000000000007E-2,9.6900000000000003E-4,9.6900000000000003E-4,9,0.244531,0.244531,5.1000000000000004E-4,5.1000000000000004E-4]
[null,"BLN13A","BEENLEIGH","URBAN",1,null,1.4390000000000001,2.496,null,null,1,1.3550000000000001E-3,1.3550000000000001E-3,1.99E-6,1.99E-6]
[null,"BLN15A","BEENLEIGH, EAGLEBY","URBAN",2156,10.901999999999999,2.3130000000000002,4.3250999999999999,null,null,15,0.13642299999999999,0.13642299999999999,2.3240000000000001E-3,2.3240000000000001E-3,11,3.2724000000000003E-2,3.2724000000000003E-2,2.12E-4,2.12E-4]
[null,"BLN16A","BAHRS SCRUB, BEENLEIGH","RURAL",1283,6.6689999999999996,0.52400000000000002,2.8769999999999998]
[null,"BLN16A","BAHRS SCRUB, BEENLEIGH","URBAN",null,6.6689999999999996,0.52400000000000002,2.8769999999999998,null,null,14,0.14938599999999999,0.14938599999999999,1.106E-3,1.106E-3,9,5.7952999999999998E-2,5.7952999999999998E-2,3.4099999999999999E-4,3.4099999999999999E-4]
[null,"BLN1B","BEENLEIGH, HOLMVIEW","URBAN",369,2.0390000000000001,1.889,1.8290999999999999,null,null,2,5.731E-3,5.731E-3,7.1500000000000003E-5,7.1500000000000003E-5]
[null,"BLN2B","BEENLEIGH","URBAN",363,3.887,0.30399999999999999,1.5242,null,null,7,9.0089999999999996E-3,8.5559999999999994E-3,6.9499999999999995E-5,6.3499999999999999E-5,3,7.025E-3,7.025E-3,4.1699999999999997E-5,4.1699999999999997E-5]
[null,"BLN5B","BEENLEIGH","URBAN",510,2.8260000000000001,1.32,2.4007000000000001,null,null,2,2.2599999999999999E-4,2.2599999999999999E-4,1.99E-6,1.99E-6,4,2.7309999999999999E-3,2.7309999999999999E-3,4.7599999999999998E-5,4.7599999999999998E-5]
[null,"BMG18A","SPRING HILL","URBAN",92,null,2.867,null,null,null,1,1.4E-5,1.4E-5,9.9000000000000005E-7,9.9000000000000005E-7,1,3.1E-4,null,3.9700000000000001E-6]
[null,"BMG18B","BRISBANE","URBAN",63,null,0.38400000000000001]
[null,"BMG2A","BRISBANE, PETRIE TERRACE, SPRING HILL","URBAN",312,0.13300000000000001,6.1669999999999998,null,null,null,2,2.4899999999999998E-4,2.4899999999999998E-4,1.99E-6,1.99E-6]
[null,"BMG3B","MILTON","URBAN",392,0.371,2.1850000000000001,null,null,null,1,1.1270000000000001E-2,1.1270000000000001E-2,1.4999999999999999E-4,1.4999999999999999E-4]
[null,"BMG44A","MILTON","URBAN",32,null,0.82799999999999996,null,null,null,1,1.5529999999999999E-3,1.5529999999999999E-3,2.6800000000000001E-5,2.6800000000000001E-5]
[null,"BMG9A","AUCHENFLOWER, BRISBANE, MILTON","URBAN",11,null,1.61]
[null,"BMG9B","BRISBANE","URBAN",104,null,0.38700000000000001]
[null,"BMT1","BELLI PARK, BLACK MOUNTAIN, BOLLIER, CARTERS RIDGE, COOROY, FEDERAL, IMBIL, RIDGEWOOD, TUCHEKOI","RURAL",639,120.52800000000001,0.89300000000000002,1.2575000000000001,null,null,46,1.3329299999999999,1.3329299999999999,9.6460000000000001E-3,9.6460000000000001E-3,29,0.15240100000000001,0.15240100000000001,7.2000000000000005E-4,7.2000000000000005E-4]
[null,"BMT2","BLACK MOUNTAIN, POMONA","RURAL",270,13.532,0.22,0.59060000000000001,null,null,6,0.31180799999999997,0.31180799999999997,7.4100000000000001E-4,7.4100000000000001E-4,4,8.4950000000000008E-3,8.4950000000000008E-3,4.6100000000000002E-5,4.6100000000000002E-5]
[null,"BMT3","BLACK MOUNTAIN, COOROY","RURAL",267,2.8250000000000002,5.2619999999999996,0.62880000000000003,null,null,4,0.182255,0.182255,1.377E-3,1.377E-3]
[null,"BMT4","BLACK MOUNTAIN, COOROY, LAKE MACDONALD","RURAL",709,14.069000000000001,1.7150000000000001,2.6865000000000001,null,null,4,0.48161199999999998,0.141406,3.617E-3,1.802E-3,5,1.9028E-2,1.9028E-2,8.2000000000000001E-5,8.2000000000000001E-5]
[null,"BMT5","BELLI PARK, BLACK MOUNTAIN, COOROY, RIDGEWOOD","RURAL",291,35.802,0.11700000000000001,0.53349999999999997,null,null,14,2.9829999999999999E-2,2.9829999999999999E-2,2.8499999999999999E-4,2.8499999999999999E-4,17,0.245669,0.245669,9.0499999999999999E-4,9.0499999999999999E-4]
[null,"BNH1B","BOONAH, BUNBURRA, BUNJURGEN, CANNON CREEK, CHARLWOOD, COOCHIN, DUGANDAN, FRENCHES CREEK, MILFORD, MT ALFORD, WALLACES CREEK","RURAL",631,115.742,1.1919999999999999,1.2766,null,null,9,0.23704800000000001,2.0986000000000001E-2,2.1220000000000002E-3,5.1500000000000005E-4,8,0.101254,0.101254,4.15E-4,4.15E-4]
[null,"BNH2B","BOONAH, COULSON, HOYA","RURAL",896,16.975999999999999,2.024,2.6674000000000002,null,null,4,0.31931100000000001,1.0897E-2,2.3349999999999998E-3,4.1E-5,10,8.6529999999999996E-2,8.6529999999999996E-2,3.5100000000000002E-4,3.5100000000000002E-4]
[null,"BNH3A","BOONAH, KENTS POCKET, MOUNT FRENCH, TEMPLIN","RURAL",158,15.932,0.2,0.2858,null,null,5,5.8906E-2,4.4600000000000004E-3,4.64E-4,5.8999999999999998E-5,4,3.4631000000000002E-2,3.4631000000000002E-2,9.2299999999999994E-5,9.2299999999999994E-5]
[null,"BNH5A","ALLANDALE, BOONAH, COULSON, MILFORD","RURAL",453,23.966000000000001,0.78700000000000003,1.2766,null,null,9,0.17705099999999999,1.6801E-2,1.266E-3,1.03E-4,3,2.2179000000000001E-2,2.2179000000000001E-2,6.41E-5,6.41E-5]
[null,"BNH6A","CARNEYS CREEK, COOCHIN, CROFTBY, DUGANDAN, FRENCHES CREEK, MAROON, MOOGERAH, MT ALFORD, TEVIOT","RURAL",293,112.233,0.13400000000000001,1.4671000000000001,null,null,18,0.13563,1.208E-2,9.0700000000000004E-4,9.7399999999999996E-5,10,6.3852000000000006E-2,6.3852000000000006E-2,2.2000000000000001E-4,2.2000000000000001E-4]
[null,"BNWT1","BRISBANE","CBD",1]
[null,"BNZ57","BRISBANE","CBD",1,null,0.08,null,null,null,1,6.0740000000000002E-2,null,2.5599999999999999E-4]
[null,"BNZCGA57","BRISBANE","CBD",3,null,0.34599999999999997,null,null,null,1,0.12148,null,5.1199999999999998E-4,null,1,2.8396000000000001E-2,2.8396000000000001E-2,2.5599999999999999E-4,2.5599999999999999E-4]
[null,"BNZT1","BRISBANE","CBD",1]
[null,"BOQTR1H",null,"CBD",11]
[null,"BPHMCT3","BRISBANE","CBD",1,null,0.154]
[null,"BPHMST2","BRISBANE","CBD",13,null,0.374,1.9244000000000001]
[null,"BPHT1","BRISBANE","CBD",3]
[null,"BPN24A","BROWNS PLAINS","URBAN",62,null,1.208,1.7528999999999999,null,null,null,null,null,null,null,2,1.6868999999999999E-2,1.6868999999999999E-2,6.5500000000000006E-5,6.5500000000000006E-5]
[null,"BPN26A","BORONIA HEIGHTS, BROWNS PLAINS, GREENBANK, PARK RIDGE, REGENTS PARK","RURAL",911,14.481,3.5539999999999998,4.3441000000000001,null,null,13,0.44119799999999998,0.44119799999999998,2.6809999999999998E-3,2.6809999999999998E-3,3,1.1322E-2,1.1322E-2,5.13E-5,5.13E-5]
[null,"BPN28A","BROWNS PLAINS, CALAMVALE, DREWVALE, PARKINSON","RURAL",1728,7.6020000000000003,10.042,5.3730000000000002,null,null,8,3.1787000000000003E-2,3.1787000000000003E-2,4.8549999999999999E-3,4.8549999999999999E-3,1,1.5899999999999999E-4,1.5899999999999999E-4,2.5600000000000001E-6,2.5600000000000001E-6]
[null,"BPN29A","FORESTDALE, HILLCREST","URBAN",1395,11.282,1.8180000000000001,4.3250999999999999,null,null,11,3.2638E-2,3.2638E-2,3.1100000000000002E-4,3.1100000000000002E-4,4,2.5926000000000001E-2,2.5926000000000001E-2,1.3100000000000001E-4,1.3100000000000001E-4]
[null,"BPN2A","PARKINSON","URBAN",35,null,4.04,4.9538000000000002,null,null,2,5.9699999999999998E-4,5.9699999999999998E-4,1.19E-5,1.19E-5]
[null,"BPN3","BORONIA HEIGHTS, BROWNS PLAINS, HILLCREST","URBAN",2130,11.286,2.105,4.4013,null,null,20,0.25216,0.25216,2.5929999999999998E-3,2.5929999999999998E-3,15,0.111749,0.111749,4.3199999999999998E-4,4.3199999999999998E-4]
[null,"BPN31A","BROWNS PLAINS, HILLCREST","URBAN",200,1.431,0.62,1.9244000000000001,null,null,3,5.9386000000000001E-2,5.9386000000000001E-2,3.8499999999999998E-4,3.8499999999999998E-4,1,9.2309999999999996E-3,9.2309999999999996E-3,2.9799999999999999E-5,2.9799999999999999E-5]
[null,"BPN32B","BROWNS PLAINS, REGENTS PARK","URBAN",2,null,2.5099999999999998,2.0005999999999999,null,null,1,6.9999999999999999E-6,6.9999999999999999E-6,1.99E-6,1.99E-6]
[null,"BPN34A","BORONIA HEIGHTS, GREENBANK, HILLCREST","URBAN",1618,13.451000000000001,2.0350000000000001,4.649,null,null,28,3.5754000000000001E-2,3.5754000000000001E-2,1.949E-3,1.949E-3,4,1.3839000000000001E-2,1.3839000000000001E-2,5.8600000000000001E-5,5.8600000000000001E-5]
[null,"BPN35A","REGENTS PARK","URBAN",862,4.5380000000000003,0.93,2.7627000000000002,null,null,18,3.4037999999999999E-2,3.4037999999999999E-2,1.0430000000000001E-3,1.0430000000000001E-3,4,5.7935E-2,5.7935E-2,1.8699999999999999E-4,1.8699999999999999E-4]
[null,"BPN36A","BROWNS PLAINS, HERITAGE PARK, REGENTS PARK","URBAN",1877,7.0570000000000004,3.3610000000000002,4.4965000000000002,null,null,21,5.0299999999999997E-2,5.0299999999999997E-2,3.8089999999999999E-3,3.8089999999999999E-3,7,3.2993000000000001E-2,3.2993000000000001E-2,1.3799999999999999E-4,1.3799999999999999E-4]
[null,"BPN4","BROWNS PLAINS, DREWVALE","URBAN",908,4.6760000000000002,2.234,5.3730000000000002,null,null,9,2.8349999999999998E-3,2.8349999999999998E-3,1.7900000000000001E-5,1.7900000000000001E-5,3,2.99E-3,2.99E-3,1.19E-5,1.19E-5]
[null,"BPN6","HERITAGE PARK, PARK RIDGE, REGENTS PARK","URBAN",1355,6.4240000000000004,5.0060000000000002,3.0293999999999999,null,null,4,1.5245999999999999E-2,1.5245999999999999E-2,1.3300000000000001E-4,1.3300000000000001E-4,4,4.2209999999999999E-3,4.2209999999999999E-3,1.6900000000000001E-5,1.6900000000000001E-5]
[null,"BPN7B","BROWNS PLAINS","URBAN",10,null,0.48099999999999998,5.1062000000000003,null,null,null,null,null,null,null,1,6.0700000000000001E-4,6.0700000000000001E-4,3.9700000000000001E-6,3.9700000000000001E-6]
[null,"BRCRFW35","BRISBANE","CBD",1,null,0.27100000000000002]
[null,"BRCT1","BRISBANE","CBD",1]
[null,"BRD10B","ALBANY CREEK, BRENDALE","RURAL",398,3.798,2.6659999999999999,1.5052000000000001,null,null,4,3.2473000000000002E-2,3.2473000000000002E-2,9.1E-4,9.1E-4,6,6.5771999999999997E-2,6.5771999999999997E-2,2.0000000000000001E-4,2.0000000000000001E-4]
[null,"BRD11A","BRENDALE, CASHMERE, WARNER","RURAL",1010,15.609,8.3089999999999993,4.2869000000000002,null,null,7,0.974692,2.0534E-2,2.784E-3,1.9699999999999999E-4,1,4.6550000000000003E-3,4.6550000000000003E-3,2.05E-5,2.05E-5]
[null,"BRD13A","BRAY PARK, BRENDALE, STRATHPINE, WARNER","RURAL",null,5.2919999999999998,12.545999999999999,6.0970000000000004,null,null,5,1.5330000000000001E-3,1.5330000000000001E-3,1.2799999999999999E-5,1.2799999999999999E-5,8,0.12037399999999999,0.12037399999999999,5.1999999999999995E-4,5.1999999999999995E-4]
[null,"BRD13A","BRAY PARK, BRENDALE, STRATHPINE, WARNER","URBAN",2292,5.2919999999999998,12.545999999999999,6.0970000000000004]
[null,"BRD14B","BRENDALE","URBAN",286,3.4239999999999999,2.6970000000000001,4.5537000000000001,null,null,5,1.915E-3,1.915E-3,2.8799999999999999E-5,2.8799999999999999E-5,4,1.1816999999999999E-2,1.1816999999999999E-2,2.8799999999999999E-5,2.8799999999999999E-5]
[null,"BRD16A","BRENDALE","URBAN",174,1.623,1.425,2.8580000000000001]
[null,"BRD2A","BRENDALE, EATONS HILL","URBAN",497,2.0459999999999998,4.3579999999999997,2.0577000000000001,null,null,3,4.8809999999999999E-3,4.8809999999999999E-3,1.8899999999999999E-5,1.8899999999999999E-5,1,4.3629999999999997E-3,4.3629999999999997E-3,1.49E-5,1.49E-5]
[null,"BRD3B","CASHMERE, CLEAR MOUNTAIN, DRAPER, EATONS HILL, WARNER","RURAL",756,34.938000000000002,2.9740000000000002,2.7054999999999998,null,null,16,1.298173,0.41354600000000002,6.8979999999999996E-3,4.9550000000000002E-3,7,8.6346000000000006E-2,8.6346000000000006E-2,2.9E-4,2.9E-4]
[null,"BRD5A","BRENDALE, CASHMERE, WARNER","RURAL",1627,6.7880000000000003,11.201000000000001,4.8204000000000002,null,null,5,8.8920000000000006E-3,8.8920000000000006E-3,2.33E-4,2.33E-4,5,6.5702999999999998E-2,6.5702999999999998E-2,2.2800000000000001E-4,2.2800000000000001E-4]
[null,"BRD7A",null,"URBAN",2,null,1.044,2.0005999999999999]
[null,"BRD8A","BRENDALE, EATONS HILL, WARNER","URBAN",1525,2.786,7.2649999999999997,4.9348000000000001,null,null,5,2.4493000000000001E-2,2.4493000000000001E-2,1.6000000000000001E-4,1.6000000000000001E-4,4,2.6789E-2,2.6789E-2,1.2300000000000001E-4,1.2300000000000001E-4]
[null,"BRT3","BRIGHTON","URBAN",1054,4.4630000000000001,0.48,1.8482000000000001,null,null,8,3.1203000000000002E-2,3.1203000000000002E-2,3.0600000000000001E-4,3.0600000000000001E-4,9,3.1036000000000001E-2,3.1036000000000001E-2,1.25E-4,1.25E-4]
[null,"BRT5","BRIGHTON, SANDGATE","URBAN",1207,4.3650000000000002,0.80700000000000005,2.6674000000000002,null,null,6,2.0936E-2,2.0936E-2,1.4100000000000001E-4,1.4100000000000001E-4,5,7.0039999999999998E-3,7.0039999999999998E-3,2.48E-5,2.48E-5]
[null,"BRT6","BRIGHTON","URBAN",1239,7.0220000000000002,1.0880000000000001,2.6865000000000001,null,null,4,0.107736,0.10760500000000001,1.237E-3,1.2359999999999999E-3,2,7.9989999999999992E-3,7.9989999999999992E-3,4.1699999999999997E-5,4.1699999999999997E-5]
[null,"BRT8","BRIGHTON, SANDGATE","URBAN",1274,4.95,0.44,2.2101999999999999,null,null,9,0.53322800000000004,0.53322800000000004,3.8670000000000002E-3,3.8670000000000002E-3,1,3.7420000000000001E-3,3.7420000000000001E-3,1.29E-5,1.29E-5]
[null,"BSC3","BOONDALL","URBAN",9,0.90600000000000003,1.3120000000000001]
[null,"BSE8","MITCHELTON","URBAN",2,null,null,null,null,null,null,null,null,null,null,2,3.9899999999999999E-4,3.9899999999999999E-4,3.9700000000000001E-6,3.9700000000000001E-6]
[null,"BSEENG15","ENOGGERA, GAYTHORNE, MITCHELTON","URBAN",1797,6.2110000000000003,1.1779999999999999,3.6200999999999999,null,null,10,6.9282999999999997E-2,6.9282999999999997E-2,2.2929999999999999E-3,2.2929999999999999E-3,2,8.5699999999999995E-3,8.5699999999999995E-3,3.4700000000000003E-5,3.4700000000000003E-5]
[null,"BSEENG15OLD",null,"URBAN",null,null,null,null,null,null,3,2.5399999999999999E-4,2.5399999999999999E-4,2.9799999999999998E-6,2.9799999999999998E-6,3,3.5560000000000001E-3,3.5560000000000001E-3,1.19E-5,1.19E-5]
[null,"BSEENG35","MITCHELTON","URBAN",90,null,0.42799999999999999,0.64780000000000004,null,null,null,null,null,null,null,1,1.2E-5,1.2E-5,9.9000000000000005E-7,9.9000000000000005E-7]
[null,"BSET1","MITCHELTON","URBAN",1]
[null,"BSET3","MITCHELTON","URBAN",1,null,null,null,null,null,null,null,null,null,null,1,2.5500000000000002E-4,2.5500000000000002E-4,9.9000000000000005E-7,9.9000000000000005E-7]
[null,"BSET4","MITCHELTON","URBAN",1,null,null,null,null,null,null,null,null,null,null,3,4.8999999999999998E-4,4.8999999999999998E-4,2.9799999999999998E-6,2.9799999999999998E-6]
[null,"BSQTR1H","BRISBANE","CBD",32]
[null,"BSQTR2H","BRISBANE","CBD",1]
[null,"BTA13A","EDENS LANDING, HOLMVIEW","URBAN",1955,5.4530000000000003,2.871,4.4203000000000001,null,null,14,0.123837,0.123837,5.8279999999999998E-3,5.8279999999999998E-3,8,5.3067000000000003E-2,5.3067000000000003E-2,1.8799999999999999E-4,1.8799999999999999E-4]
[null,"BTA15A","BETHANIA, WATERFORD","URBAN",1170,9.5419999999999998,1.319,3.5057999999999998,null,null,8,7.0889999999999998E-3,7.0889999999999998E-3,2.3319999999999999E-3,2.3319999999999999E-3,9,4.0111000000000001E-2,4.0111000000000001E-2,1.63E-4,1.63E-4]
[null,"BTA1A","BETHANIA","RURAL",1210,8.4250000000000007,1.6879999999999999,2.496,null,null,9,1.3342579999999999,2.1125000000000001E-2,9.2460000000000007E-3,6.1830000000000001E-3,11,0.24326700000000001,0.24326700000000001,1.2099999999999999E-3,1.2099999999999999E-3]
[null,"BTA3A","BAHRS SCRUB, BEENLEIGH, BETHANIA, BUCCAN, EDENS LANDING, HOLMVIEW, WATERFORD","RURAL",1732,5.5570000000000004,5.931,4.9919000000000002,null,null,9,1.025115,2.5538999999999999E-2,9.9150000000000002E-3,7.123E-3,5,1.3719E-2,1.3719E-2,6.6600000000000006E-5,6.6600000000000006E-5]
[null,"BTA5A","BETHANIA, BUCCAN, WATERFORD","RURAL",1135,25.664000000000001,10.045999999999999,2.9723000000000002,null,null,11,2.7053470000000002,0.65241400000000005,1.7956E-2,1.2921999999999999E-2,8,0.145005,0.145005,4.28E-4,4.28E-4]
[null,"BTN1","BROMELTON, JOSEPHVILLE","URBAN",6,3.512,null,null,null,null,5,2.6800000000000001E-3,2.0149999999999999E-3,1.59E-5,1.3900000000000001E-5,3,2.8839999999999998E-3,2.8839999999999998E-3,9.9299999999999998E-6,9.9299999999999998E-6]
[null,"BTN2","ALLENVIEW, BEAUDESERT, BROMELTON, GLENEAGLE, WYARALONG","RURAL",127,53.143000000000001,5.774,0.80020000000000002,null,null,10,4.7257E-2,4.7257E-2,1.023E-3,1.023E-3,14,3.7636999999999997E-2,3.7636999999999997E-2,1.6899999999999999E-4,1.6899999999999999E-4]
[null,"BTN3","BROMELTON, JOSEPHVILLE, KOORALBYN, LARAVALE","RURAL",932,38.686999999999998,4.3639999999999999,2.0387,null,null,12,0.441633,0.441633,5.2290000000000001E-3,5.2290000000000001E-3,15,0.172127,0.172127,8.1499999999999997E-4,8.1499999999999997E-4]
[null,"BTN4","BEAUDESERT, BROMELTON","URBAN",3,1.9970000000000001,0.31,2.5722,null,null,1,2.0599999999999999E-4,2.0599999999999999E-4,2.9799999999999998E-6,2.9799999999999998E-6]
[null,"BTN6","BROMELTON","URBAN",5,0.72399999999999998,0.13300000000000001,3.7534999999999998,null,null,3,1.704E-3,1.704E-3,1.29E-5,1.29E-5,1,2.4069999999999999E-3,2.4069999999999999E-3,4.9599999999999999E-6,4.9599999999999999E-6]
[null,"BTN7","BEAUDESERT, BROMELTON, ILBOGAN, JOSEPHVILLE, KOORALBYN","RURAL",62,24.957999999999998,0.48099999999999998,2.6293000000000002,null,null,11,0.17952799999999999,0.17952799999999999,8.3100000000000003E-4,8.3100000000000003E-4,12,2.7066E-2,2.7066E-2,1.1E-4,1.1E-4]
[null,"BTY11A","BIRTINYA","URBAN",2,null,0.92500000000000004,1.0479000000000001]
[null,"BTY5A","AROONA, CURRIMUNDI, LITTLE MOUNTAIN, MERIDAN PLAINS","URBAN",2892,4.6589999999999998,16.27,6.6875999999999998,null,null,8,1.0579E-2,9.6950000000000005E-3,1.12E-4,8.5400000000000002E-5,5,7.1079999999999997E-3,7.1079999999999997E-3,6.3499999999999999E-5,6.3499999999999999E-5]
[null,"BTY7A","BIRTINYA, BOKARINA, WURTULLA","URBAN",989,1.3680000000000001,4.9109999999999996,2.6293000000000002,null,null,4,6.4999999999999997E-4,6.4999999999999997E-4,3.9700000000000001E-6,3.9700000000000001E-6,5,2.6571999999999998E-2,2.6571999999999998E-2,1.3899999999999999E-4,1.3899999999999999E-4]
[null,"BTYSCH13",null,"URBAN",1,null,0.69299999999999995,1.1432]
[null,"BVL10A","BOOVAL, EAST IPSWICH, NEWTOWN","URBAN",682,1.996,0.502,1.7148000000000001,null,null,7,4.9834999999999997E-2,4.9834999999999997E-2,4.4499999999999997E-4,4.4499999999999997E-4,2,7.1799999999999998E-3,7.1799999999999998E-3,3.2799999999999998E-5,3.2799999999999998E-5]
[null,"BVL13A","EASTERN HEIGHTS, NEWTOWN, RACEVIEW, SILKSTONE","URBAN",1357,5.8739999999999997,0.754,3.9821,null,null,7,1.3773000000000001E-2,1.3773000000000001E-2,1.9599999999999999E-4,1.9599999999999999E-4,15,4.0661000000000003E-2,4.0661000000000003E-2,2.4000000000000001E-4,2.4000000000000001E-4]
[null,"BVL15A","BOOVAL","URBAN",478,1.65,1.2070000000000001,4.3822000000000001,null,null,2,3.5100000000000002E-4,3.5100000000000002E-4,4.9599999999999999E-6,4.9599999999999999E-6]
[null,"BVL2A","BASIN POCKET, BOOVAL, EAST IPSWICH, NORTH BOOVAL","URBAN",1672,7.3890000000000002,1.6E-2,3.3723999999999998,null,null,12,0.23258300000000001,0.23258300000000001,2.2239999999999998E-3,2.2239999999999998E-3,9,4.9569000000000002E-2,4.9569000000000002E-2,1.8000000000000001E-4,1.8000000000000001E-4]
[null,"BVL3A","EASTERN HEIGHTS, IPSWICH, NEWTOWN","URBAN",1262,6.2960000000000003,0.30299999999999999,3.1438000000000001,null,null,8,7.7956999999999999E-2,7.7784000000000006E-2,1.374E-3,1.3730000000000001E-3,3,5.4000000000000003E-3,5.4000000000000003E-3,3.0800000000000003E-5,3.0800000000000003E-5]
[null,"BVL5A","FLINDERS VIEW, RACEVIEW, SILKSTONE","URBAN",1960,11.718999999999999,1.74,4.8395000000000001,null,null,11,0.39530300000000002,0.38907900000000001,2.1150000000000001E-3,2.085E-3,4,1.0751999999999999E-2,1.0751999999999999E-2,4.8600000000000002E-5,4.8600000000000002E-5]
[null,"BVL9A","BOOVAL, NORTH BOOVAL","URBAN",568,3.3730000000000002,0.25700000000000001,1.0860000000000001,null,null,4,3.2490000000000002E-3,3.2490000000000002E-3,4.8600000000000002E-5,4.8600000000000002E-5]
[null,"BVLNCM7","BOOVAL, BUNDAMBA, NEW CHUM, SILKSTONE","URBAN",1284,9.4039999999999999,2.1309999999999998,4.4775,null,null,12,1.6778999999999999E-2,1.6778999999999999E-2,2.4699999999999999E-4,2.4699999999999999E-4,13,5.5067999999999999E-2,5.5067999999999999E-2,2.2100000000000001E-4,2.2100000000000001E-4]
[null,"BWH12A","BEERWAH, GLASSHOUSE MOUNTAINS, PEACHESTER","RURAL",651,44.228999999999999,2.351,2.1149,null,null,21,0.26068200000000002,0.26068200000000002,2.153E-3,2.153E-3,12,4.0362000000000002E-2,4.0362000000000002E-2,1.2300000000000001E-4,1.2300000000000001E-4]
[null,"BWH13A","BEERWAH, BOOROOBIN, CROHAMHURST, MALENY, PEACHESTER","RURAL",624,53.500999999999998,0.9,1.3337000000000001,null,null,30,2.281428,1.5712600000000001,6.5900000000000004E-3,5.7879999999999997E-3,5,9.2671000000000003E-2,9.2671000000000003E-2,3.8999999999999999E-4,3.8999999999999999E-4]
[null,"BWH16A","BEERWAH, COOCHIN CREEK, GLASSHOUSE MOUNTAINS","RURAL",1742,39.564,4.8760000000000003,5.5445000000000002,null,null,14,0.66208299999999998,0.66208299999999998,4.8339999999999998E-3,4.8339999999999998E-3,8,4.6501000000000001E-2,4.6501000000000001E-2,1.56E-4,1.56E-4]
[null,"BWH7A","BEERWAH, COOCHIN CREEK, GLASSHOUSE MOUNTAINS","RURAL",1203,27.164000000000001,7.2610000000000001,3.944,null,null,19,0.83175100000000002,0.83175100000000002,6.6080000000000002E-3,6.6080000000000002E-3,19,0.26206800000000002,0.230708,9.8400000000000007E-4,8.8900000000000003E-4]
[null,"BWH8A","BEERBURRUM, BEERWAH, GLASSHOUSE MOUNTAINS","RURAL",533,28.259,3.0070000000000001,3.3151999999999999,null,null,9,0.130162,0.130162,2.0479999999999999E-3,2.0479999999999999E-3,4,8.2389999999999998E-3,8.2389999999999998E-3,3.5899999999999998E-5,3.5899999999999998E-5]
[null,"BWSTR1H","FORTITUDE VALLEY","URBAN",1]
[null,"CABTR1H","BRISBANE","CBD",202]
[null,"CABTR2H","BRISBANE","CBD",213]
[null,"CAST1","BRISBANE","CBD",1]
[null,"CBAT1","BRISBANE","CBD",25]
[null,"CBQ1","BRISBANE","CBD",1]
[null,"CBT12A","BEERBURRUM, CABOOLTURE, ELIMBAH","RURAL",2157,57.369,5.0460000000000003,3.8868,null,null,20,0.44364500000000001,0.44364500000000001,4.3220000000000003E-3,4.3220000000000003E-3,20,0.171628,0.171628,7.8200000000000003E-4,7.8200000000000003E-4]
[null,"CBT13A","CABOOLTURE","URBAN",1054,1.708,10.055999999999999,4.5727000000000002,null,null,3,9.7630000000000008E-3,2.8519999999999999E-3,4.8600000000000002E-5,2.9799999999999999E-5,3,1.9959999999999999E-3,1.9959999999999999E-3,1.0900000000000001E-5,1.0900000000000001E-5]
[null,"CBT15A","CABOOLTURE, ELIMBAH","RURAL",912,20.573,2.6150000000000002,2.8580000000000001,null,null,10,0.61096099999999998,0.61096099999999998,3.591E-3,3.591E-3,1,4.7060000000000001E-3,4.7060000000000001E-3,3.0800000000000003E-5,3.0800000000000003E-5]
[null,"CBT4A","CABOOLTURE","RURAL",1027,5.1239999999999997,7.7149999999999999,3.0865999999999998,null,null,1,1.7349E-2,1.7349E-2,4.8699999999999998E-5,4.8699999999999998E-5,4,3.6858000000000002E-2,3.6858000000000002E-2,1.6899999999999999E-4,1.6899999999999999E-4]
[null,"CBT7A","CABOOLTURE","URBAN",1103,6.4909999999999997,1.667,4.3632,null,null,7,9.2699999999999998E-4,9.2699999999999998E-4,6.9500000000000004E-6,6.9500000000000004E-6,7,3.9640000000000002E-2,3.9640000000000002E-2,2.03E-4,2.03E-4]
[null,"CBT8A","CABOOLTURE, DONNYBROOK, ELIMBAH, MELDALE, TOORBUL","RURAL",1563,43.854999999999997,4.2309999999999999,4.0202,null,null,6,9.0530000000000003E-3,9.0530000000000003E-3,1.0430000000000001E-3,1.0430000000000001E-3,11,1.9956000000000002E-2,1.9956000000000002E-2,1.18E-4,1.18E-4]
[null,"CBW10","BELLMERE, UPPER CABOOLTURE","RURAL",1113,13.083,3.431,2.3816000000000002,null,null,11,0.78691999999999995,0.78691999999999995,8.6540000000000002E-3,8.6540000000000002E-3,5,2.0993999999999999E-2,2.0993999999999999E-2,7.6899999999999999E-5,7.6899999999999999E-5]
[null,"CBW11","CABOOLTURE, ELIMBAH, MOODLU, WAMURAN","RURAL",1157,37.569000000000003,1.655,3.22,null,null,18,0.55407300000000004,0.55407300000000004,1.0494E-2,1.0494E-2,11,6.0824999999999997E-2,4.2451000000000003E-2,2.4899999999999998E-4,1.6699999999999999E-4]
[null,"CBW12","CABOOLTURE, CABOOLTURE SOUTH","URBAN",932,4.4939999999999998,1.6259999999999999,2.7627000000000002,null,null,4,1.0961E-2,1.0961E-2,9.9400000000000009E-4,9.9400000000000009E-4,6,3.5644000000000002E-2,3.5644000000000002E-2,1.02E-4,1.02E-4]
[null,"CBW13","MOODLU, WAMURAN","RURAL",321,9.5779999999999994,4.0490000000000004,1.0098,null,null,4,0.278667,0.278667,1.6429999999999999E-3,1.6429999999999999E-3,10,0.54359500000000005,0.54359500000000005,1.1869999999999999E-3,1.1869999999999999E-3]
[null,"CBW14","CABOOLTURE","URBAN",586,3.4980000000000002,0.81200000000000006,1.3337000000000001,null,null,4,4.1714000000000001E-2,4.1714000000000001E-2,1.165E-3,1.165E-3,3,1.5968E-2,1.5968E-2,8.3399999999999994E-5,8.3399999999999994E-5]
[null,"CBW4","CABOOLTURE, CABOOLTURE SOUTH","URBAN",82,0.221,2.5859999999999999,3.4104999999999999,null,null,2,2.9740000000000001E-3,2.9740000000000001E-3,8.14E-5,8.14E-5]
[null,"CBW5","CABOOLTURE","URBAN",777,4.827,0.53400000000000003,2.2101999999999999,null,null,9,0.118147,0.118147,2.4009999999999999E-3,2.4009999999999999E-3,3,1.4659999999999999E-2,1.4659999999999999E-2,5.5600000000000003E-5,5.5600000000000003E-5]
[null,"CBW6","BELLMERE, CABOOLTURE SOUTH, MOORINA, OCEAN VIEW, ROCKSBERG, UPPER CABOOLTURE","RURAL",2243,47.398000000000003,7.8890000000000002,5.4682000000000004,null,null,29,1.0625640000000001,1.0625640000000001,2.6023000000000001E-2,2.6023000000000001E-2,14,5.2680999999999999E-2,5.2680999999999999E-2,2.61E-4,2.61E-4]
[null,"CBW7","BELLMERE, CABOOLTURE, MOODLU","RURAL",1375,19.523,1.179,3.0674999999999999,null,null,23,1.050081,1.050081,7.4799999999999997E-3,7.4799999999999997E-3,16,0.34535500000000002,0.34535500000000002,1.1019999999999999E-3,1.1019999999999999E-3]
[null,"CBW8","CABOOLTURE","URBAN",146,2.5430000000000001,0.251,2.5150000000000001,null,null,3,3.7300000000000001E-4,3.7300000000000001E-4,1.47E-4,1.47E-4]
[null,"CBW9","CABOOLTURE","URBAN",166,3.1829999999999998,2.5030000000000001,1.8482000000000001,null,null,2,1.9559999999999998E-3,1.9559999999999998E-3,1.85E-4,1.85E-4]
[null,"CCOT1","BRISBANE","CBD",1,null,null,null,null,null,1,6.0740000000000002E-2,null,2.5599999999999999E-4]
[null,"CCY12A","OXENFORD, PACIFIC PINES","URBAN",1428,1.8460000000000001,6.4740000000000002,3.2389999999999999]
[null,"CCY13A","HELENSVALE","URBAN",1289,6.4390000000000001,4.5990000000000002,4.1154999999999999,null,null,6,0.44176500000000002,0.44176500000000002,2.7230000000000002E-3,2.7230000000000002E-3,11,4.9761E-2,4.9761E-2,1.9100000000000001E-4,1.9100000000000001E-4]
[null,"CCY14B","HELENSVALE","URBAN",780,null,9.3629999999999995,3.3342999999999998,null,null,2,4.3100000000000001E-4,4.3100000000000001E-4,3.9700000000000001E-6,3.9700000000000001E-6]
[null,"CCY15A","HELENSVALE","URBAN",4,null,5,1.6386000000000001]
[null,"CCY18A","OXENFORD","URBAN",3,null,2.238,2.496]
[null,"CCY1B","COOMERA, HELENSVALE, OXENFORD, UPPER COOMERA","URBAN",835,4.649,4.516,5.5063000000000004,null,null,1,0.201789,0.201789,8.5099999999999998E-4,8.5099999999999998E-4,1,2.32E-4,2.32E-4,9.9000000000000005E-7,9.9000000000000005E-7]
[null,"CCY21A","COOMERA","RURAL",2,4.8369999999999997,1.296,1.448]
[null,"CCY24B","HELENSVALE, HOPE ISLAND","URBAN",458,4.1669999999999998,3.1739999999999999,3.6391]
[null,"CCY25A","OXENFORD, PACIFIC PINES","URBAN",2134,null,13.2,4.9538000000000002,null,null,1,7.2999999999999999E-5,7.2999999999999999E-5,9.9000000000000005E-7,9.9000000000000005E-7]
[null,"CCY26A","OXENFORD, UPPER COOMERA","RURAL",1713,7.1760000000000002,10.968999999999999,5.4301000000000004,null,null,10,1.809933,1.4903109999999999,1.8012E-2,1.3622E-2,7,0.18060899999999999,0.18060899999999999,5.3300000000000005E-4,5.3300000000000005E-4]
[null,"CCY3B","HELENSVALE","URBAN",1238,1.41,8.4689999999999994,3.7915999999999999,null,null,6,1.8849000000000001E-2,1.8849000000000001E-2,1.08E-4,1.08E-4,7,2.3570000000000001E-2,2.3570000000000001E-2,1E-4,1E-4]
[null,"CCY4A","HELENSVALE, OXENFORD","URBAN",3,null,3.282,3.0865999999999998]
[null,"CCY5A",null,"URBAN",1,null,4.5960000000000001,3.601]
[null,"CCY6A","COOMERA, HELENSVALE, OXENFORD","URBAN",816,5.0609999999999999,2.12,3.3532999999999999,null,null,1,1.4241999999999999E-2,1.4241999999999999E-2,1.1400000000000001E-4,1.1400000000000001E-4,5,3.1682000000000002E-2,3.1682000000000002E-2,9.2299999999999994E-5,9.2299999999999994E-5]
[null,"CCY7A","OXENFORD, UPPER COOMERA","RURAL",1684,5.2229999999999999,10.305,4.306,null,null,1,5.1199999999999998E-4,5.1199999999999998E-4,2.5600000000000001E-6,2.5600000000000001E-6,5,2.3380000000000001E-2,2.568E-3,7.1799999999999997E-5,1.2799999999999999E-5]
[null,"CCY8A","GAVEN, HELENSVALE, OXENFORD, PACIFIC PINES","RURAL",949,6.0940000000000003,8.3149999999999995,2.6674000000000002,null,null,5,0.22675300000000001,0.22675300000000001,2.4450000000000001E-3,2.4450000000000001E-3,9,3.8643999999999998E-2,3.8643999999999998E-2,5.4299999999999997E-4,5.4299999999999997E-4]
[null,"CCYUPC17","OXENFORD","URBAN",46,2.2999999999999998,1.4470000000000001,1.8863000000000001]
[null,"CCYUPC2","MAUDSLAND, OXENFORD, PACIFIC PINES","RURAL",1871,5.2830000000000004,11.131,4.7823000000000002,null,null,8,0.73984499999999997,0.73984499999999997,4.8989999999999997E-3,4.8989999999999997E-3,2,1.5889999999999999E-3,1.5889999999999999E-3,1.7900000000000001E-5,1.7900000000000001E-5]
[null,"CCYUPC23","MAUDSLAND, OXENFORD, UPPER COOMERA","URBAN",554,4.8079999999999998,3.0139999999999998,4.8014000000000001,null,null,3,5.13E-4,5.13E-4,2.9799999999999998E-6,2.9799999999999998E-6,2,7.1170000000000001E-3,7.1170000000000001E-3,7.9400000000000006E-5,7.9400000000000006E-5]
[null,"CDKQPT25","MORNINGSIDE","URBAN",3,null,2.6659999999999999,2.2483]
[null,"CDRSPD12","SURFERS PARADISE","URBAN",1534,2.1339999999999999,0.58099999999999996,2.0768,null,null,6,7.3099999999999999E-4,7.3099999999999999E-4,5.9599999999999997E-6,5.9599999999999997E-6,11,0.107601,0.107601,2.6499999999999999E-4,2.6499999999999999E-4]
[null,"CDRSPD9","SURFERS PARADISE","URBAN",552,1.042,0.85499999999999998,0.74309999999999998,null,null,8,6.7476999999999995E-2,6.7476999999999995E-2,9.5100000000000002E-4,9.5100000000000002E-4,13,0.14379600000000001,0.14379600000000001,4.4000000000000002E-4,4.4000000000000002E-4]
[null,"CDRT1","SURFERS PARADISE","URBAN",28,null,null,null,null,null,null,null,null,null,null,1,1.7229999999999999E-3,1.7229999999999999E-3,2.7800000000000001E-5,2.7800000000000001E-5]
[null,"CDRT2",null,"URBAN",123]
[null,"CDRT3","SURFERS PARADISE","URBAN",24,null,0.126]
[null,"CDSSRD21","CARINDALE","URBAN",5,null,2.4929999999999999,2.6674000000000002]
[null,"CDSSRD23","CARINDALE","URBAN",443,null,3.968,3.2008999999999999,null,null,2,6.2870000000000001E-3,6.2870000000000001E-3,5.7599999999999997E-5,5.7599999999999997E-5]
[null,"CDSSRD25","CARINA HEIGHTS, CARINDALE","URBAN",154,null,1.248,3.6962999999999999]
[null,"CDSSRD3","CARINDALE","URBAN",10,1.6140000000000001,0.11600000000000001,2.1720999999999999]
[null,"CEATR1","BRISBANE","CBD",148]
[null,"CFD1A","ASCOT, CLAYFIELD","URBAN",1409,4.1859999999999999,0.40400000000000003,4.0011999999999999,null,null,6,8.3250000000000008E-3,8.3250000000000008E-3,8.5400000000000002E-5,8.5400000000000002E-5,1,6.1300000000000005E-4,6.1300000000000005E-4,1.99E-6,1.99E-6]
[null,"CFD2A","CLAYFIELD, WOOLOOWIN","URBAN",1430,4.4059999999999997,0.496,2.6674000000000002,null,null,5,0.32122800000000001,0.32122800000000001,4.5310000000000003E-3,4.5310000000000003E-3,7,9.1104000000000004E-2,8.3932999999999994E-2,2.9999999999999997E-4,2.7900000000000001E-4]
[null,"CFD6A","ALBION, BOWEN HILLS, CLAYFIELD, WINDSOR, WOOLOOWIN","URBAN",2188,6.8949999999999996,0.65400000000000003,3.9821,null,null,12,0.458783,0.458783,5.0010000000000002E-3,5.0010000000000002E-3,11,0.115997,0.115997,3.5599999999999998E-4,3.5599999999999998E-4]
[null,"CFD8A","ALBION, BOWEN HILLS, CLAYFIELD","URBAN",1346,3.0840000000000001,1.7869999999999999,4.0773999999999999,null,null,12,0.120311,0.120311,1.4940000000000001E-3,1.4940000000000001E-3,17,0.16262599999999999,0.13930000000000001,5.9400000000000002E-4,5.31E-4]
[null,"CFD9A","KEDRON, WOOLOOWIN","URBAN",4,null,3.1190000000000002,2.2673000000000001]
[null,"CGARGA84","BRISBANE","CBD",1,null,0.221,null,null,null,1,0.12148,null,5.1199999999999998E-4]
[null,"CGAT1","BRISBANE","CBD",1]
[null,"CGMTR1H","FORTITUDE VALLEY","URBAN",16]
[null,"CGSCST11","BRISBANE","CBD",78,null,0.308,2.9531999999999998]
[null,"CGST1","BRISBANE","CBD",26]
[null,"CGT1","BOWEN HILLS, NEWSTEAD","URBAN",262,0.24199999999999999,1.1839999999999999,null,null,null,null,null,null,null,null,1,1.132E-3,1.132E-3,1.8899999999999999E-5,1.8899999999999999E-5]
[null,"CGT5","BOWEN HILLS, NEWSTEAD, TENERIFFE","URBAN",148,0.28599999999999998,1.609,null,null,null,1,6.7900000000000002E-4,6.7900000000000002E-4,1.8899999999999999E-5,1.8899999999999999E-5,1,4.0099999999999997E-3,4.0099999999999997E-3,4.9599999999999999E-6,4.9599999999999999E-6]
[null,"CGTMLS4","FORTITUDE VALLEY","URBAN",161,null,null,1.2194,null,null,null,null,null,null,null,1,1.8100000000000001E-4,1.8100000000000001E-4,9.9000000000000005E-7,9.9000000000000005E-7]
[null,"CHATR1H","BRISBANE","CBD",1,null,null,null,null,null,1,3.7775999999999997E-2,3.7775999999999997E-2,2.5599999999999999E-4,2.5599999999999999E-4,1,2.3019999999999998E-3,2.3019999999999998E-3,2.5599999999999999E-4,2.5599999999999999E-4]
[null,"CHL10","CAMP HILL, CARINA","URBAN",1021,3.9369999999999998,0.35299999999999998,2.1911,null,null,2,1.7000000000000001E-4,1.7000000000000001E-4,1.99E-6,1.99E-6,3,1.2976E-2,1.2976E-2,4.3699999999999998E-5,4.3699999999999998E-5]
[null,"CHL11A","MORNINGSIDE, NORMAN PARK, SEVEN HILLS","URBAN",1870,7.2779999999999996,2.9830000000000001,4.4013,null,null,10,0.203346,0.203346,3.9309999999999996E-3,3.9309999999999996E-3,13,8.0964999999999995E-2,8.0964999999999995E-2,2.9700000000000001E-4,2.9700000000000001E-4]
[null,"CHL2","CAMP HILL, COORPAROO","URBAN",1431,5.0469999999999997,0.28799999999999998,3.0104000000000002,null,null,12,0.30165799999999998,0.27846700000000002,1.6930000000000001E-3,1.562E-3,24,0.123545,0.12161,5.5400000000000002E-4,5.44E-4]
[null,"CHL3","CAMP HILL, COORPAROO, NORMAN PARK, SEVEN HILLS","URBAN",1877,6.6079999999999997,0.33200000000000002,4.0583,null,null,10,3.0047000000000001E-2,3.0047000000000001E-2,2.4499999999999999E-4,2.4499999999999999E-4,29,0.118369,0.114955,4.1100000000000002E-4,3.9199999999999999E-4]
[null,"CHL4","CANNON HILL, MORNINGSIDE, SEVEN HILLS","URBAN",1435,5.9130000000000003,1.637,3.5438999999999998,null,null,9,5.9639999999999997E-3,5.9639999999999997E-3,9.3300000000000005E-5,9.3300000000000005E-5,4,2.3864E-2,2.3864E-2,8.3399999999999994E-5,8.3399999999999994E-5]
[null,"CHL5","CAMP HILL, CARINA, CARINA HEIGHTS","URBAN",2230,6.1289999999999996,0.56299999999999994,3.8487,null,null,7,5.0268E-2,5.0268E-2,2.03E-4,2.03E-4,16,0.10342700000000001,0.10342700000000001,3.9599999999999998E-4,3.9599999999999998E-4]
[null,"CHL6A","CAMP HILL, CARINA HEIGHTS","URBAN",2020,5.6580000000000004,1.9830000000000001,3.3532999999999999,null,null,4,3.3170000000000001E-3,3.3170000000000001E-3,2.9799999999999999E-5,2.9799999999999999E-5,9,6.9792000000000007E-2,6.9792000000000007E-2,2.5000000000000001E-4,2.5000000000000001E-4]
[null,"CHL7","CAMP HILL, CANNON HILL, CARINA, SEVEN HILLS","URBAN",1511,6.7489999999999997,2.677,5.4873000000000003,null,null,11,0.38208399999999998,0.38208399999999998,4.5519999999999996E-3,4.5519999999999996E-3,9,2.4287E-2,2.4287E-2,9.8300000000000004E-5,9.8300000000000004E-5]
[null,"CHL8","CAMP HILL","URBAN",705,2.5649999999999999,0.06,1.6576,null,null,2,5.64E-3,5.64E-3,1.21E-4,1.21E-4,9,4.2497E-2,4.2497E-2,1.46E-4,1.46E-4]
[null,"CHL9","CARINA, CARINDALE","RURAL",281,1.667,2.5369999999999999,0.78120000000000001,null,null,1,2.6499999999999999E-4,2.6499999999999999E-4,2.5600000000000001E-6,2.5600000000000001E-6,1,1.1000000000000001E-3,1.1000000000000001E-3,7.6899999999999992E-6,7.6899999999999992E-6]
[null,"CHST1","BRISBANE","CBD",1]
[null,"CHTT0","BRISBANE","CBD",2]
[null,"CLD11","BELLS CREEK, CALOUNDRA WEST, LITTLE MOUNTAIN, MERIDAN PLAINS","RURAL",2414,10.175000000000001,13.09,5.3539000000000003,null,null,15,3.0249649999999999,3.0249649999999999,1.6063999999999998E-2,1.6063999999999998E-2,11,0.124073,0.124073,4.6700000000000002E-4,4.6700000000000002E-4]
[null,"CLD16A","CALOUNDRA, CURRIMUNDI, MOFFAT BEACH","URBAN",161,4.3540000000000001,1.075,1.9053,null,null,2,3.0499999999999999E-4,3.0499999999999999E-4,1.99E-6,1.99E-6]
[null,"CLD17A","CALOUNDRA, MOFFAT BEACH, SHELLY BEACH","URBAN",1633,5.8730000000000002,0.49,3.0293999999999999,null,null,12,3.4278000000000003E-2,3.4278000000000003E-2,3.5799999999999997E-4,3.5799999999999997E-4,14,0.15805900000000001,0.15805900000000001,6.6E-4,6.6E-4]
[null,"CLD18A","BELLS CREEK, LITTLE MOUNTAIN, MERIDAN PLAINS","RURAL",80,10.510999999999999,10.391999999999999,1.8482000000000001,null,null,null,null,null,null,null,2,2.1510000000000001E-3,2.1510000000000001E-3,5.8999999999999998E-5,5.8999999999999998E-5]
[null,"CLD1A","CALOUNDRA, CALOUNDRA WEST, LITTLE MOUNTAIN","RURAL",1389,3.5459999999999998,7.92,3.1246999999999998,null,null,3,0.57089999999999996,0.57089999999999996,3.532E-3,3.532E-3,6,7.3593000000000006E-2,7.3593000000000006E-2,4.2000000000000002E-4,4.2000000000000002E-4]
[null,"CLD2","CALOUNDRA, GOLDEN BEACH, PELICAN WATERS","URBAN",2170,7.2750000000000004,3.8109999999999999,5.0872000000000002,null,null,14,7.7773999999999996E-2,7.7773999999999996E-2,2.2439999999999999E-3,2.2439999999999999E-3,11,0.13353899999999999,0.13353899999999999,4.7100000000000001E-4,4.7100000000000001E-4]
[null,"CLD20A","AROONA, BATTERY HILL, CALOUNDRA, CURRIMUNDI, DICKY BEACH","RURAL",1412,9.0730000000000004,3.048,3.0104000000000002,null,null,6,0.489672,0.489672,3.686E-3,3.686E-3,6,0.218698,0.218698,8.4599999999999996E-4,8.4599999999999996E-4]
[null,"CLD20A","AROONA, BATTERY HILL, CALOUNDRA, CURRIMUNDI, DICKY BEACH","URBAN",1412,9.0730000000000004,3.048,3.0104000000000002,null,null,null,null,null,null,null,1,4.1599999999999996E-3,4.1599999999999996E-3,3.2799999999999998E-5,3.2799999999999998E-5]
[null,"CLD21A","CALOUNDRA, PELICAN WATERS","RURAL",1341,null,15.491,4.1726000000000001,null,null,2,1.312E-3,1.312E-3,7.4300000000000004E-5,7.4300000000000004E-5,6,0.109344,0.109344,4.8700000000000002E-4,4.8700000000000002E-4]
[null,"CLD22A","KINGS BEACH","URBAN",1563,2.1080000000000001,2.6280000000000001,2.8961000000000001,null,null,6,1.9222E-2,1.9222E-2,2.63E-4,2.63E-4,4,1.5089999999999999E-3,1.5089999999999999E-3,1.19E-5,1.19E-5]
[null,"CLD25A","CALOUNDRA, KINGS BEACH, MOFFAT BEACH, SHELLY BEACH","URBAN",1321,2.8940000000000001,0.65400000000000003,2.4578000000000002,null,null,13,0.433751,0.433751,3.9760000000000004E-3,3.9760000000000004E-3,2,4.4720000000000003E-3,4.4720000000000003E-3,3.2799999999999998E-5,3.2799999999999998E-5]
[null,"CLD26A","CALOUNDRA","URBAN",229,1.843,0.57099999999999995,3.0293999999999999,null,null,2,2.3424E-2,2.3424E-2,3.1199999999999999E-4,3.1199999999999999E-4]
[null,"CLD28A","BEERWAH, BELLS CREEK, COOCHIN CREEK, GOLDEN BEACH, PELICAN WATERS","RURAL",1540,24.553999999999998,12.801,5.1062000000000003,null,null,12,0.60215200000000002,0.60215200000000002,4.9449999999999997E-3,4.9449999999999997E-3,15,5.5173E-2,5.5173E-2,3.5100000000000002E-4,3.5100000000000002E-4]
[null,"CLD3","CALOUNDRA, CALOUNDRA WEST","URBAN",205,4.6619999999999999,0.90300000000000002,3.2770999999999999,null,null,null,null,null,null,null,1,1.8894000000000001E-2,1.8894000000000001E-2,4.6699999999999997E-5,4.6699999999999997E-5]
[null,"CLD30A","DICKY BEACH, MOFFAT BEACH","URBAN",982,4.0839999999999996,1.9119999999999999,1.8290999999999999,null,null,7,5.4077E-2,5.4077E-2,1.088E-3,1.088E-3,9,7.1484000000000006E-2,7.1484000000000006E-2,2.4000000000000001E-4,2.4000000000000001E-4]
[null,"CLD7A","CALOUNDRA, KINGS BEACH","URBAN",1341,0.84299999999999997,2.35,3.2008999999999999,null,null,6,6.0010000000000003E-3,6.0010000000000003E-3,3.9700000000000003E-5,3.9700000000000003E-5,1,4.8760000000000001E-3,4.8760000000000001E-3,1.59E-5,1.59E-5]
[null,"CLD8","CALOUNDRA","URBAN",523,1.208,1.5329999999999999,3.4676999999999998,null,null,2,2.2974999999999999E-2,2.2974999999999999E-2,8.7299999999999994E-5,8.7299999999999994E-5]
[null,"CLD9A","CALOUNDRA, GOLDEN BEACH","URBAN",1269,4.6459999999999999,1.2110000000000001,3.3723999999999998,null,null,7,2.4471E-2,2.4471E-2,2.33E-4,2.33E-4,4,3.5138000000000003E-2,3.5138000000000003E-2,1.2999999999999999E-4,1.2999999999999999E-4]
[null,"CLM10B","COOLUM BEACH, NORTH ARM, VALDORA, VERRIERDALE, YANDINA CREEK","RURAL",500,28.045000000000002,10.199999999999999,2.1720999999999999,null,null,4,9.1775999999999996E-2,9.1775999999999996E-2,8.6600000000000002E-4,8.6600000000000002E-4,6,6.0907000000000003E-2,6.0907000000000003E-2,1.7899999999999999E-4,1.7899999999999999E-4]
[null,"CLM3","BLI BLI, COOLUM BEACH, MARCOOLA, MOUNT COOLUM, PACIFIC PARADISE","RURAL",1298,17.172000000000001,3.6880000000000002,3.0865999999999998,null,null,8,2.0439999999999998E-3,2.0439999999999998E-3,2.05E-5,2.05E-5,6,5.1327999999999999E-2,5.1327999999999999E-2,2.8699999999999998E-4,2.8699999999999998E-4]
[null,"CLM4A","COOLUM BEACH, MOUNT COOLUM, YAROOMBA","RURAL",731,2.7240000000000002,3.7130000000000001,1.448]
[null,"CLM4A","COOLUM BEACH, MOUNT COOLUM, YAROOMBA","URBAN",null,2.7240000000000002,3.7130000000000001,1.448,null,null,6,1.1582E-2,1.1582E-2,1.7899999999999999E-4,1.7899999999999999E-4,2,1.6169999999999999E-3,1.6169999999999999E-3,6.9500000000000004E-6,6.9500000000000004E-6]
[null,"CLM5","COOLUM BEACH, POINT ARKWRIGHT, YAROOMBA","URBAN",1769,5.798,1.87,3.4296000000000002,null,null,8,1.3029000000000001E-2,1.3029000000000001E-2,1.5899999999999999E-4,1.5899999999999999E-4,7,6.5053E-2,6.5053E-2,2.5700000000000001E-4,2.5700000000000001E-4]
[null,"CLM6","COOLUM BEACH, PEREGIAN BEACH, PEREGIAN SPRINGS","RURAL",1924,10.632999999999999,1.9730000000000001,4.7633000000000001,null,null,13,0.491456,0.491456,5.9080000000000001E-3,5.9080000000000001E-3,3,2.7576E-2,2.7576E-2,7.4300000000000004E-5,7.4300000000000004E-5]
[null,"CLM7","COOLUM BEACH","URBAN",1063,3.0059999999999998,0.64800000000000002,2.2673000000000001,null,null,5,1.5598000000000001E-2,1.5566999999999999E-2,1.46E-4,1.45E-4]
[null,"CLM8","COOLUM BEACH, MOUNT COOLUM, YAROOMBA","URBAN",1512,6.1669999999999998,2.3980000000000001,2.7246000000000001,null,null,11,1.9677E-2,1.9677E-2,2.61E-4,2.61E-4,4,1.1361E-2,1.1361E-2,6.05E-5,6.05E-5]
[null,"CLM9","COOLUM BEACH, MARCOOLA, MOUNT COOLUM","URBAN",2036,8.593,6.1180000000000003,4.4394,null,null,17,4.1736000000000002E-2,4.1736000000000002E-2,2.5799999999999998E-4,2.5799999999999998E-4,11,0.107956,0.107956,3.8000000000000002E-4,3.8000000000000002E-4]
[null,"CLR3","BELMONT, CHANDLER, GUMDALE","RURAL",178,5.5410000000000004,0.17299999999999999,null,null,null,3,7.7414999999999998E-2,7.7414999999999998E-2,9.77E-4,9.77E-4,5,8.8719999999999997E-3,8.8719999999999997E-3,5.13E-5,5.13E-5]
[null,"CLR6","CHANDLER","URBAN",9,null,0.95199999999999996,null,null,null,2,2.594E-3,2.594E-3,1.6900000000000001E-5,1.6900000000000001E-5]
[null,"CLR7","CHANDLER","URBAN",1]
[null,"CLR8","CHANDLER","RURAL",58,1.4970000000000001,1.5289999999999999,null,null,null,5,4.3860999999999997E-2,4.3860999999999997E-2,4.3100000000000001E-4,4.3100000000000001E-4,2,3.4910000000000002E-3,3.4910000000000002E-3,1.2799999999999999E-5,1.2799999999999999E-5]
[null,"CLRSRD17","BELMONT, CARINDALE, CHANDLER","URBAN",822,9.7449999999999992,2.7949999999999999,4.5537000000000001,null,null,6,7.961E-2,7.961E-2,8.34E-4,8.34E-4,9,2.4381E-2,2.4381E-2,1.1900000000000001E-4,1.1900000000000001E-4]
[null,"CLTTR1H","BRISBANE","CBD",158]
[null,"CLTTR2H","BRISBANE","CBD",261]
[null,"CMA10A","COOMERA, UPPER COOMERA","RURAL",1837,2.5659999999999998,16.998000000000001,5.3158000000000003,null,null,10,2.7959999999999999E-3,2.7959999999999999E-3,2.5599999999999999E-5,2.5599999999999999E-5,8,4.7843999999999998E-2,4.7843999999999998E-2,1.18E-4,1.18E-4]
[null,"CMA11A","COOMERA, PIMPAMA, UPPER COOMERA","RURAL",1507,4.7990000000000004,8.2479999999999993,3.944]
[null,"CMA11A","COOMERA, PIMPAMA, UPPER COOMERA","URBAN",null,4.7990000000000004,8.2479999999999993,3.944,null,null,2,0.176343,null,1.4189999999999999E-3,null,10,4.3626999999999999E-2,4.3626999999999999E-2,1.06E-4,1.06E-4]
[null,"CMA13B",null,"URBAN",1,0.01,3.5289999999999999,2.8961000000000001]
[null,"CMA15A","PIMPAMA, UPPER COOMERA, WILLOW VALE","RURAL",1753,6.5309999999999997,11.065,5.2205000000000004,null,null,6,1.4E-3,1.4E-3,1.5400000000000002E-5,1.5400000000000002E-5,3,1.5858000000000001E-2,1.5858000000000001E-2,5.6400000000000002E-5,5.6400000000000002E-5]
[null,"CMA18A","UPPER COOMERA","URBAN",1589,3.8860000000000001,10.538,4.1536,null,null,5,2.8340000000000001E-3,2.8340000000000001E-3,2.58E-5,2.58E-5,4,1.6993000000000001E-2,1.6993000000000001E-2,6.05E-5,6.05E-5]
[null,"CMA19B",null,"URBAN",1,null,3.133]
[null,"CMA20A","UPPER COOMERA","URBAN",1398,0.84099999999999997,8.5060000000000002,4.0773999999999999,null,null,3,2.212E-3,2.212E-3,3.18E-5,3.18E-5]
[null,"CMA8A","PIMPAMA, UPPER COOMERA, WILLOW VALE","RURAL",1291,13.792,11.128,4.0202,null,null,9,0.70641799999999999,0.30163000000000001,6.8259999999999996E-3,3.3089999999999999E-3,3,7.1000000000000004E-3,7.1000000000000004E-3,4.1E-5,4.1E-5]
[null,"CMA9A","UPPER COOMERA","URBAN",1314,1.2629999999999999,8.0039999999999996,3.944,null,null,5,2.993E-3,2.8760000000000001E-3,2.8799999999999999E-5,2.7800000000000001E-5,2,3.3799999999999998E-4,3.3799999999999998E-4,7.9400000000000002E-6,7.9400000000000002E-6]
[null,"CMBFAC6","BRISBANE","CBD",2,null,0.20899999999999999]
[null,"CMBT1","BRISBANE","CBD",1]
[null,"CMD11A","AROONA, CALOUNDRA, CALOUNDRA WEST, CURRIMUNDI, LITTLE MOUNTAIN, MERIDAN PLAINS","RURAL",2324,7.2160000000000002,12.669,5.2587000000000002,null,null,3,0.36833399999999999,0.36833399999999999,5.7959999999999999E-3,5.7959999999999999E-3,2,3.1475000000000003E-2,3.1475000000000003E-2,1.7699999999999999E-4,1.7699999999999999E-4]
[null,"CMD13A","AROONA, BATTERY HILL, CURRIMUNDI","URBAN",1194,3.609,2.5299999999999998,2.2673000000000001,null,null,10,2.1519999999999998E-3,2.1519999999999998E-3,2.1800000000000001E-5,2.1800000000000001E-5,4,3.0977000000000001E-2,3.0977000000000001E-2,2.02E-4,2.02E-4]
[null,"CMD15A","BOKARINA, WURTULLA","URBAN",1355,6.7080000000000002,1.851,2.8199000000000001,null,null,24,0.12366199999999999,0.12366199999999999,3.5130000000000001E-3,3.5130000000000001E-3,5,7.4862999999999999E-2,7.4862999999999999E-2,2.3000000000000001E-4,2.3000000000000001E-4]
[null,"CMD3A","CURRIMUNDI","URBAN",463,null,1.9590000000000001,1.1051]
[null,"CMD5A","BATTERY HILL, CURRIMUNDI, DICKY BEACH","URBAN",1547,5.74,1.071,2.9912999999999998,null,null,16,5.3330000000000002E-2,5.3330000000000002E-2,2.8400000000000002E-4,2.8400000000000002E-4,17,0.16897000000000001,0.16897000000000001,7.0200000000000004E-4,7.0200000000000004E-4]
[null,"CMD7A","WURTULLA","URBAN",728,3.1280000000000001,2.1989999999999998,1.6194999999999999,null,null,3,2.6800000000000001E-4,2.6800000000000001E-4,2.9799999999999998E-6,2.9799999999999998E-6,1,1.0899000000000001E-2,1.0899000000000001E-2,1.7899999999999999E-4,1.7899999999999999E-4]
[null,"CMET3","MILTON","URBAN",1]
[null,"CMHVPK23","BOWEN HILLS","URBAN",30,null,1.5229999999999999,1.7909999999999999]
[null,"CMP8","BRISBANE","CBD",1,null,0.108,null,null,null,1,0.24296100000000001,null,1.023E-3]
[null,"CMPCQE8","BRISBANE","CBD",2,null,0.33400000000000002,null,null,null,2,0.23798900000000001,5.5768999999999999E-2,1.023E-3,2.5599999999999999E-4]
[null,"CMPT1","BRISBANE","CBD",2,null,null,null,null,null,1,6.0740000000000002E-2,null,2.5599999999999999E-4]
[null,"CMUT1","BRISBANE","CBD",1,null,null,null,null,null,1,6.0740000000000002E-2,null,2.5599999999999999E-4]
[null,"CMV10B","CALAMVALE, SUNNYBANK HILLS","URBAN",310,null,3.1579999999999999,null,null,null,2,3.3727E-2,3.3727E-2,3.2299999999999999E-4,3.2299999999999999E-4]
[null,"CMV11A","ALGESTER, CALAMVALE, PARKINSON","URBAN",1587,2.8940000000000001,6.0940000000000003,4.2298,null,null,1,1.03E-4,1.03E-4,9.9000000000000005E-7,9.9000000000000005E-7,2,1.026E-3,1.026E-3,5.9599999999999997E-6,5.9599999999999997E-6]
[null,"CMV12A","ALGESTER, CALAMVALE, PARKINSON","URBAN",914,0.14699999999999999,8.048,2.6674000000000002,null,null,1,6.4999999999999994E-5,6.4999999999999994E-5,9.9000000000000005E-7,9.9000000000000005E-7,2,3.0851E-2,3.0851E-2,8.2399999999999997E-5,8.2399999999999997E-5]
[null,"CMV12B","ALGESTER, CALAMVALE, PARKINSON","URBAN",2177,null,14.731999999999999,5.6588000000000003,null,null,3,3.6600000000000001E-4,3.6600000000000001E-4,2.9799999999999998E-6,2.9799999999999998E-6,2,2.2780000000000001E-3,2.2780000000000001E-3,7.9400000000000002E-6,7.9400000000000002E-6]
[null,"CMV13","CALAMVALE, STRETTON, SUNNYBANK HILLS","URBAN",1675,1.2070000000000001,7.2140000000000004,4.2679,null,null,5,4.8099999999999998E-4,4.8099999999999998E-4,4.9599999999999999E-6,4.9599999999999999E-6,5,1.9759999999999999E-3,1.9759999999999999E-3,2.1800000000000001E-5,2.1800000000000001E-5]
[null,"CMV14","ALGESTER, CALAMVALE","URBAN",1251,2.0739999999999998,5.9790000000000001,3.0104000000000002,null,null,4,0.21032200000000001,0.21032200000000001,1.2310000000000001E-3,1.2310000000000001E-3,4,1.7297E-2,1.7297E-2,6.3499999999999999E-5,6.3499999999999999E-5]
[null,"CMV7","ALGESTER, CALAMVALE","URBAN",1899,3.1070000000000002,5.484,4.4394,null,null,3,1.0315E-2,1.0315E-2,5.0599999999999997E-5,5.0599999999999997E-5,3,3.418E-3,3.418E-3,2.58E-5,2.58E-5]
[null,"CMV8","CALAMVALE, SUNNYBANK HILLS","URBAN",983,2.0590000000000002,4.8179999999999996,4.1726000000000001,null,null,9,0.113204,0.113204,1.039E-3,1.039E-3,6,9.9080000000000001E-3,9.9080000000000001E-3,4.57E-5,4.57E-5]
[null,"CMV9A","CALAMVALE, SUNNYBANK HILLS","URBAN",932,0.48499999999999999,7.55,3.9821,null,null,6,9.3156000000000003E-2,9.3156000000000003E-2,1.529E-3,1.529E-3,5,5.7893E-2,5.7893E-2,1.56E-4,1.56E-4]
[null,"CMV9B","CALAMVALE, STRETTON","URBAN",1043,null,6.282,3.3151999999999999,null,null,1,5.2506999999999998E-2,5.2506999999999998E-2,1.0349999999999999E-3,1.0349999999999999E-3,4,2.3760000000000001E-3,2.3760000000000001E-3,5.66E-5,5.66E-5]
[null,"CMY1","ATKINSONS DAM, BUARABA, CHURCHABLE, CLARENDON, COOMINYA","RURAL",239,71.081999999999994,1.014,1.6957,null,null,12,0.15479399999999999,0.15479399999999999,1.379E-3,1.379E-3,7,0.15471199999999999,0.15471199999999999,4.7399999999999997E-4,4.7399999999999997E-4]
[null,"CMY2",null,"URBAN",1,0.38600000000000001,0.02,1.448,null,null,2,1.8100000000000001E-4,1.8100000000000001E-4,1.99E-6,1.99E-6]
[null,"CMY3","COOMINYA","URBAN",1,0.33600000000000002,0.114,1.7148000000000001]
[null,"CMY4","ATKINSONS DAM, BUARABA, BUARABA CREEK, CLARENDON, COOMINYA, MOOMBRA, MOUNT HALLEN, MT TARAMPA, WIVENHOE HILL","RURAL",654,100.54600000000001,8.8999999999999996E-2,2.3626,null,null,19,0.69308000000000003,0.69308000000000003,6.8570000000000002E-3,6.8570000000000002E-3,26,0.15268200000000001,0.15268200000000001,7.3800000000000005E-4,7.3800000000000005E-4]
[null,"CNA3B","SWANBANK","URBAN",1,null,0.13500000000000001,0.64780000000000004]
[null,"CNA7A","BLACKSTONE, BUNDAMBA, NEW CHUM, SILKSTONE","RURAL",666,7.117,0.83799999999999997,2.0577000000000001,null,null,3,8.7900000000000001E-4,8.7900000000000001E-4,7.6899999999999992E-6,7.6899999999999992E-6,4,2.0268000000000001E-2,2.0268000000000001E-2,6.1500000000000004E-5,6.1500000000000004E-5]
[null,"CNA8A","BLACKSTONE, REDBANK PLAINS, RIPLEY, SOUTH RIPLEY, SWANBANK","RURAL",374,37.956000000000003,1.379,1.0098,null,null,6,9.7090000000000006E-3,2.7529999999999998E-3,4.3600000000000003E-5,3.0800000000000003E-5,7,1.7097000000000001E-2,1.7097000000000001E-2,5.13E-5,5.13E-5]
[null,"CNA9A","BLACKSTONE, FLINDERS VIEW, RACEVIEW, RIPLEY, SWANBANK","RURAL",203,15.957000000000001,1.6930000000000001,0.83830000000000005,null,null,4,9.0199000000000001E-2,2.7179999999999999E-3,7.1799999999999997E-5,1.03E-5,7,9.7973000000000005E-2,9.7973000000000005E-2,3.4099999999999999E-4,3.4099999999999999E-4]
[null,"CNB21B","CORNUBIA, SHAILER PARK","URBAN",1304,5.7880000000000003,5.69,3.4866999999999999,null,null,7,0.16312399999999999,0.16312399999999999,1.24E-3,1.24E-3,5,0.11515400000000001,0.11515400000000001,2.8299999999999999E-4,2.8299999999999999E-4]
[null,"CNB24A","CARBROOK, CORNUBIA, MOUNT COTTON","RURAL",1214,23.759,6.883,3.0485000000000002,null,null,5,0.29572700000000002,0.29572700000000002,6.2719999999999998E-3,6.2719999999999998E-3,3,3.9350000000000001E-3,3.9350000000000001E-3,2.5599999999999999E-5,2.5599999999999999E-5]
[null,"CNB25A","CORNUBIA","RURAL",793,3.6819999999999999,3.5960000000000001,2.0387,null,null,7,0.136106,0.136106,2.0349999999999999E-3,2.0349999999999999E-3]
[null,"CNB25A","CORNUBIA","URBAN",793,3.6819999999999999,3.5960000000000001,2.0387,null,null,1,1.27E-4,1.27E-4,9.9000000000000005E-7,9.9000000000000005E-7,1,7.11E-3,7.11E-3,1.8899999999999999E-5,1.8899999999999999E-5]
[null,"CNB26A","CARBROOK, CORNUBIA, REDLAND BAY","RURAL",461,23.684999999999999,0.67300000000000004,3.7725,null,null,16,0.32456000000000002,0.306751,5.2009999999999999E-3,5.1520000000000003E-3,14,9.6731999999999999E-2,9.6731999999999999E-2,4.3800000000000002E-4,4.3800000000000002E-4]
[null,"COR22A","BLACK MOUNTAIN, COORAN, FEDERAL, PINBARREN, POMONA","RURAL",745,41.103999999999999,1.599,1.2956000000000001,null,null,33,7.4373999999999996E-2,7.4373999999999996E-2,1.0920000000000001E-3,1.0920000000000001E-3,11,0.30030600000000002,0.30030600000000002,1.2359999999999999E-3,1.2359999999999999E-3]
[null,"COR23A","COMO, COORAN, COOTHARABA, KIN KIN, PINBARREN","RURAL",586,101.795,0.60199999999999998,0.91449999999999998,null,null,44,1.94868,1.94868,1.5318E-2,1.5318E-2,19,0.21851799999999999,0.21749299999999999,8.5899999999999995E-4,8.5400000000000005E-4]
[null,"COR25A","COOROY, PINBARREN, POMONA","RURAL",841,29.158000000000001,0.35399999999999998,1.9434,null,null,10,1.034008,1.034008,4.614E-3,4.614E-3,9,0.215669,0.215669,8.2299999999999995E-4,8.2299999999999995E-4]
[null,"COR26A","BOREEN POINT, COOTHARABA, KIN KIN, PINBARREN, POMONA","RURAL",896,81.102999999999994,3.3719999999999999,1.6767000000000001,null,null,42,3.092076,3.092076,1.4777999999999999E-2,1.4777999999999999E-2,16,0.25111499999999998,0.24882299999999999,1.1329999999999999E-3,1.1249999999999999E-3]
[null,"CPB1","CAPALABA","URBAN",4,null,0.98,3.7915999999999999]
[null,"CPB2","CAPALABA","URBAN",99,0.10199999999999999,2.2879999999999998,1.4098999999999999,null,null,null,null,null,null,null,1,1.66E-4,1.66E-4,9.9000000000000005E-7,9.9000000000000005E-7]
[null,"CPB3","BIRKDALE, CAPALABA","RURAL",995,5.42,0.65,2.1339000000000001,null,null,2,1.9994000000000001E-2,1.9994000000000001E-2,4.15E-4,4.15E-4,2,1.9174E-2,1.9174E-2,9.48E-5,9.48E-5]
[null,"CPB3","BIRKDALE, CAPALABA","URBAN",995,5.42,0.65,2.1339000000000001,null,null,4,6.9399999999999996E-4,6.9399999999999996E-4,2.1699999999999999E-4,2.1699999999999999E-4,3,6.7949999999999998E-3,6.7949999999999998E-3,2.7800000000000001E-5,2.7800000000000001E-5]
[null,"CPB4","CAPALABA","URBAN",1942,9.4359999999999999,0.376,3.8296999999999999,null,null,9,6.8580000000000004E-3,6.8580000000000004E-3,1.35E-4,1.35E-4,5,1.3552E-2,1.3552E-2,6.8499999999999998E-5,6.8499999999999998E-5]
[null,"CPB5","CAPALABA","URBAN",38,0.185,0.95399999999999996,0.91449999999999998,null,null,1,6.0999999999999999E-5,6.0999999999999999E-5,9.9000000000000005E-7,9.9000000000000005E-7]
[null,"CPB6","CAPALABA, CAPALABA WEST, CHANDLER","URBAN",414,8.9600000000000009,0.69599999999999995,2.9150999999999998,null,null,2,5.7300000000000005E-4,5.7300000000000005E-4,7.9400000000000002E-6,7.9400000000000002E-6,11,3.8990999999999998E-2,3.8990999999999998E-2,1.1400000000000001E-4,1.1400000000000001E-4]
[null,"CPB7",null,"URBAN",1,null,0.35899999999999999,3.5819999999999999]
[null,"CPB8","CAPALABA, CAPALABA WEST, CHANDLER, GUMDALE, RANSOME","RURAL",346,13.237,1.099,1.5813999999999999,null,null,6,0.196468,0.196468,2.8089999999999999E-3,2.8089999999999999E-3,13,0.17466999999999999,0.17466999999999999,5.31E-4,5.31E-4]
[null,"CPC1A","CAROLE PARK","URBAN",27,null,2.1850000000000001,2.8769999999999998,null,null,null,null,null,null,null,2,1.0900000000000001E-4,1.0900000000000001E-4,1.99E-6,1.99E-6]
[null,"CPC22A","CAROLE PARK","URBAN",30,null,2.298,3.7343999999999999]
[null,"CPC22B","CAROLE PARK","URBAN",1,null,0.32400000000000001,2.8008000000000002]
[null,"CPC23A","CAROLE PARK","URBAN",2,null,1.4530000000000001,3.8487,null,null,1,1.4E-5,1.4E-5,9.9000000000000005E-7,9.9000000000000005E-7]
[null,"CPC25A","CAROLE PARK","URBAN",29,2.2719999999999998,1.0229999999999999,3.601,null,null,null,null,null,null,null,4,6.2100000000000002E-4,6.2100000000000002E-4,4.9599999999999999E-6,4.9599999999999999E-6]
[null,"CPC2A","CAROLE PARK, ELLEN GROVE, FOREST LAKE","URBAN",1564,6.798,7.2130000000000001,3.8868,null,null,11,0.104794,0.104794,3.1189999999999998E-3,3.1189999999999998E-3,5,8.0490000000000006E-3,8.0490000000000006E-3,5.9599999999999999E-5,5.9599999999999999E-5]
[null,"CPC2B","CAMIRA, CAROLE PARK","URBAN",1781,12.866,0.998,4.4775,null,null,24,0.200409,0.200409,3.849E-3,3.849E-3,8,4.1834000000000003E-2,4.1834000000000003E-2,1.6699999999999999E-4,1.6699999999999999E-4]
[null,"CPC3A","CAROLE PARK","URBAN",4,null,1.2,2.0196000000000001]
[null,"CPC3B","CAROLE PARK","URBAN",32,0.65700000000000003,3.33,3.6581999999999999]
[null,"CPD1","BLANCHVIEW, FLAGSTONE CREEK, HELIDON, LILYDALE, MA MA CREEK, MIDDLE RIDGE, PRESTON, ROCKMOUNT, SILVER RIDGE, STOCKYARD, UPPER FLAGSTONE","RURAL",388,88.888999999999996,1.2549999999999999,1.0479000000000001,null,null,10,5.8120000000000003E-3,5.8120000000000003E-3,5.6400000000000002E-5,5.6400000000000002E-5,17,0.13933300000000001,0.13933300000000001,2.297E-3,2.297E-3]
[null,"CPD2","BLANCHVIEW, DERRYMORE, HELIDON, HELIDON SPA, IREDALE, LILYDALE, POSTMANS RIDGE","RURAL",101,null,null,null,null,null,null,null,null,null,null,5,2.7317000000000001E-2,2.7317000000000001E-2,9.7399999999999996E-5,9.7399999999999996E-5]
[null,"CPD2A","CARPENDALE, GRANTHAM, HELIDON, LILYDALE, VERADILLA","RURAL",81,51.326999999999998,0.161,0.78120000000000001,null,null,1,1.5200000000000001E-4,1.5200000000000001E-4,2.5600000000000001E-6,2.5600000000000001E-6,8,7.2318999999999994E-2,7.2318999999999994E-2,2.5099999999999998E-4,2.5099999999999998E-4]
[null,"CPK10","CAMIRA, GAILES, SPRINGFIELD","URBAN",921,4.7560000000000002,3.0289999999999999,2.5531000000000001,null,null,11,0.51611099999999999,8.9381000000000002E-2,2.81E-3,1.895E-3,1,8.7999999999999998E-5,8.7999999999999998E-5,9.9000000000000005E-7,9.9000000000000005E-7]
[null,"CPK11","CAMIRA, CAROLE PARK","URBAN",40,1.04,3.41,3.2961999999999998,null,null,3,4.5820000000000001E-3,4.5820000000000001E-3,4.1699999999999997E-5,4.1699999999999997E-5]
[null,"CPK12","CAROLE PARK","URBAN",2,1.137,0.78800000000000003,3.7534999999999998,null,null,1,3.8299999999999999E-4,3.8299999999999999E-4,1.99E-6,1.99E-6]
[null,"CPK13","CAMIRA, GAILES, GOODNA","RURAL",410,5.34,0.98099999999999998,1.0860000000000001,null,null,14,2.5689E-2,2.5689E-2,2.1870000000000001E-3,2.1870000000000001E-3,4,6.4616000000000007E-2,6.4616000000000007E-2,2.7700000000000001E-4,2.7700000000000001E-4]
[null,"CPK6","CAROLE PARK","URBAN",17,0.42,3.0619999999999998,2.4197000000000002,null,null,1,2.14E-3,2.14E-3,1.6900000000000001E-5,1.6900000000000001E-5]
[null,"CPK7","CAMIRA, GOODNA","URBAN",806,5.2430000000000003,0.63300000000000001,3.3151999999999999,null,null,11,0.11641600000000001,7.3908000000000001E-2,1.07E-3,9.6500000000000004E-4,9,2.5228E-2,2.5228E-2,1.36E-4,1.36E-4]
[null,"CPK8","CAMIRA, CAROLE PARK","URBAN",18,1.2090000000000001,1.7070000000000001,5.7350000000000003,null,null,2,5.2199999999999998E-3,5.2199999999999998E-3,3.3699999999999999E-5,3.3699999999999999E-5]
[null,"CPK9","CAMIRA, GAILES, GOODNA","RURAL",714,6.0389999999999997,2.15,1.9815,null,null,9,1.395513,0.50976600000000005,5.4289999999999998E-3,3.601E-3,8,9.4653000000000001E-2,9.4653000000000001E-2,4.5899999999999999E-4,4.5899999999999999E-4]
[null,"CPL23A","ACACIA RIDGE, DURACK, WILLAWONG","RURAL",976,10.814,2.528,1.8482000000000001,null,null,13,0.54538900000000001,0.54538900000000001,5.2750000000000002E-3,5.2750000000000002E-3,32,0.22264,0.22264,9.5100000000000002E-4,9.5100000000000002E-4]
[null,"CPL25A","ACACIA RIDGE","URBAN",319,1.4259999999999999,0.35499999999999998,0.66690000000000005,null,null,null,null,null,null,null,7,1.5299999999999999E-2,1.5299999999999999E-2,6.2500000000000001E-5,6.2500000000000001E-5]
[null,"CPL25B","ARCHERFIELD, COOPERS PLAINS","URBAN",236,2.0979999999999999,1.907,3.4296000000000002,null,null,2,1.8400000000000001E-3,1.8400000000000001E-3,2.7800000000000001E-5,2.7800000000000001E-5,1,5.1989999999999996E-3,5.1989999999999996E-3,8.9299999999999992E-6,8.9299999999999992E-6]
[null,"CPL26A","ACACIA RIDGE, ARCHERFIELD","URBAN",410,2.4790000000000001,4.3490000000000002,2.8769999999999998,null,null,2,1.9522999999999999E-2,1.9522999999999999E-2,4.1800000000000002E-4,4.1800000000000002E-4,5,1.2926999999999999E-2,1.2926999999999999E-2,6.4499999999999996E-5,6.4499999999999996E-5]
[null,"CPL2A","ACACIA RIDGE, COOPERS PLAINS","URBAN",317,4.0069999999999997,1.099,3.3151999999999999,null,null,4,5.9040000000000004E-3,5.9040000000000004E-3,9.9300000000000001E-5,9.9300000000000001E-5,5,2.0754000000000002E-2,2.0754000000000002E-2,9.1299999999999997E-5,9.1299999999999997E-5]
[null,"CPL3A","ACACIA RIDGE","URBAN",434,1.9079999999999999,5.8040000000000003,4.0202,null,null,6,0.10240299999999999,0.10240299999999999,1.289E-3,1.289E-3,3,6.9499999999999998E-4,6.9499999999999998E-4,5.9599999999999997E-6,5.9599999999999997E-6]
[null,"CPL5A","ACACIA RIDGE, ARCHERFIELD, COOPERS PLAINS","URBAN",134,1.823,0.875,3.2389999999999999,null,null,null,null,null,null,null,1,6.9779999999999998E-3,6.9779999999999998E-3,3.6699999999999998E-5,3.6699999999999998E-5]
[null,"CPL6A","ACACIA RIDGE, ARCHERFIELD, COOPERS PLAINS","URBAN",308,3.4209999999999998,1.052,4.0202,null,null,1,1.91E-3,1.91E-3,1.29E-5,1.29E-5,5,2.6329999999999999E-2,2.6329999999999999E-2,1.05E-4,1.05E-4]
[null,"CPR13A","COORPAROO","URBAN",916,3.6869999999999998,0.32200000000000001,3.1627999999999998,null,null,2,4.0306000000000002E-2,4.0306000000000002E-2,8.9800000000000004E-4,8.9800000000000004E-4,2,6.3689999999999997E-3,6.3689999999999997E-3,2.9799999999999999E-5,2.9799999999999999E-5]
[null,"CPR15A","COORPAROO, GREENSLOPES","URBAN",1351,4.2389999999999999,0.24199999999999999,2.4388000000000001,null,null,4,6.0600000000000003E-3,6.0600000000000003E-3,1.47E-4,1.47E-4,5,3.1123999999999999E-2,3.1123999999999999E-2,1.11E-4,1.11E-4]
[null,"CPR17A","COORPAROO","URBAN",1497,3,0.182,2.0768,null,null,4,3.3300000000000002E-4,3.3300000000000002E-4,3.9700000000000001E-6,3.9700000000000001E-6,11,5.3974000000000001E-2,5.3974000000000001E-2,2.2499999999999999E-4,2.2499999999999999E-4]
[null,"CPR21A","CAMP HILL, COORPAROO, NORMAN PARK","URBAN",1318,2.8570000000000002,0.26600000000000001,2.3435000000000001,null,null,7,1.438E-2,1.438E-2,2.0799999999999999E-4,2.0799999999999999E-4,32,0.14444699999999999,0.14426700000000001,6.9999999999999999E-4,6.9899999999999997E-4]
[null,"CPR23A","COORPAROO, GREENSLOPES","URBAN",2630,4.8330000000000002,0.91300000000000003,4.6871,null,null,5,6.4037999999999998E-2,6.4037999999999998E-2,3.4200000000000002E-4,3.4200000000000002E-4,9,9.8502000000000006E-2,9.8502000000000006E-2,3.9399999999999998E-4,3.9399999999999998E-4]
[null,"CPR4",null,"URBAN",null,null,null,null,null,null,null,null,null,null,null,2,2.7091E-2,2.7091E-2,9.7299999999999993E-5,9.7299999999999993E-5]
[null,"CPR5",null,"URBAN",null,null,null,null,null,null,null,null,null,null,null,7,1.7614999999999999E-2,1.7614999999999999E-2,6.9499999999999995E-5,6.9499999999999995E-5]
[null,"CPR6",null,"URBAN",null,null,null,null,null,null,null,null,null,null,null,1,6.5040000000000002E-3,6.5040000000000002E-3,2.3799999999999999E-5,2.3799999999999999E-5]
[null,"CPR7",null,"URBAN",null,null,null,null,null,null,null,null,null,null,null,3,2.8496E-2,2.8496E-2,8.5400000000000002E-5,8.5400000000000002E-5]
[null,"CPRGBP11","COORPAROO","URBAN",10,null,1.46,3.2389999999999999]
[null,"CPRGBP19","COORPAROO","URBAN",3,0.11600000000000001,2.1459999999999999,2.0387]
[null,"CPS12B","CAPALABA, SHELDON","RURAL",1518,26.216999999999999,1.413,3.944,null,null,16,0.32312999999999997,0.32312999999999997,4.4470000000000004E-3,4.4470000000000004E-3,19,0.196464,0.196464,9.2800000000000001E-4,9.2800000000000001E-4]
[null,"CPS13A","CAPALABA","URBAN",179,1.069,0.77600000000000002,1.5242]
[null,"CPS15A","ALEXANDRA HILLS, CAPALABA","URBAN",1734,9.7509999999999994,3.4550000000000001,4.3822000000000001,null,null,18,4.9042000000000002E-2,4.9042000000000002E-2,1.9699999999999999E-4,1.9699999999999999E-4,5,1.6458E-2,1.6458E-2,5.9599999999999999E-5,5.9599999999999999E-5]
[null,"CPS1B","CAPALABA","URBAN",237,null,1.508,2.6484000000000001,null,null,1,1.7799999999999999E-4,1.7799999999999999E-4,9.9000000000000005E-7,9.9000000000000005E-7,1,3.48E-4,3.48E-4,9.9000000000000005E-7,9.9000000000000005E-7]
[null,"CPS2B","CAPALABA","URBAN",1766,7.01,3.742,4.3441000000000001,null,null,13,0.38248900000000002,0.38248900000000002,3.6579999999999998E-3,3.6579999999999998E-3,2,6.4559999999999999E-3,6.4559999999999999E-3,3.6699999999999998E-5,3.6699999999999998E-5]
[null,"CPS5A","ALEXANDRA HILLS, CAPALABA","URBAN",1006,5.5709999999999997,1.2809999999999999,2.5912000000000002,null,null,7,1.4314E-2,1.4314E-2,2.9700000000000001E-4,2.9700000000000001E-4,5,1.854E-3,1.854E-3,1.49E-5,1.49E-5]
[null,"CPXTR1H","BRISBANE","CBD",1]
[null,"CPYT2","BRISBANE","CBD",1,null,null,null,null,null,1,6.0740000000000002E-2,null,2.5599999999999999E-4]
[null,"CPZT1","BRISBANE","CBD",1]
[null,"CQET1","BRISBANE","CBD",1,null,null,null,null,null,1,6.0740000000000002E-2,null,2.5599999999999999E-4]
[null,"CQSTR1H","BRISBANE","CBD",2,null,null,null,null,null,1,0.18222099999999999,null,7.67E-4]
[null,"CRB15A","CURRUMBIN WATERS","URBAN",394,1.9410000000000001,0.82199999999999995,1.9815,null,null,2,1.0012999999999999E-2,1.0012999999999999E-2,6.5500000000000006E-5,6.5500000000000006E-5,4,1.3783E-2,1.3783E-2,4.7599999999999998E-5,4.7599999999999998E-5]
[null,"CRB18A","CURRUMBIN WATERS","URBAN",165,2.0169999999999999,1.6120000000000001,2.153,null,null,2,1.021E-2,1.021E-2,1.64E-4,1.64E-4,2,9.9659999999999992E-3,9.9659999999999992E-3,1.8899999999999999E-5,1.8899999999999999E-5]
[null,"CRB22A","CURRUMBIN WATERS","URBAN",1872,3.6739999999999999,6.2779999999999996,3.5247999999999999,null,null,7,4.0783E-2,2.7379000000000001E-2,2.4399999999999999E-4,2.04E-4,10,0.109655,0.109655,3.2000000000000003E-4,3.2000000000000003E-4]
[null,"CRB24B","CURRUMBIN, PALM BEACH, TUGUN","URBAN",2511,6.5860000000000003,2.1,5.1062000000000003,null,null,14,0.242558,0.242558,5.1070000000000004E-3,5.1070000000000004E-3,14,0.19745599999999999,0.19745599999999999,6.5399999999999996E-4,6.5399999999999996E-4]
[null,"CRB25A","CURRUMBIN VALLEY, CURRUMBIN WATERS, TALLEBUDGERA, TALLEBUDGERA VALLEY","RURAL",1240,50.783999999999999,6.0869999999999997,2.8580000000000001,null,null,28,0.73124500000000003,0.69065799999999999,6.0260000000000001E-3,5.8780000000000004E-3,23,0.478155,0.46984999999999999,1.761E-3,1.7099999999999999E-3]
[null,"CRBTHP14","CURRUMBIN, PALM BEACH, TUGUN","URBAN",1341,6.6660000000000004,3.4580000000000002,3.6772,null,null,2,0.16875599999999999,0.16875599999999999,1.3290000000000001E-3,1.3290000000000001E-3,3,4.0299999999999997E-3,4.0299999999999997E-3,1.49E-5,1.49E-5]
[null,"CRBTHP26","CURRUMBIN WATERS, TUGUN","URBAN",1115,5.2430000000000003,1.923,3.7915999999999999,null,null,2,0.115687,0.115687,1.1069999999999999E-3,1.1069999999999999E-3,2,1.4975E-2,1.4975E-2,5.5600000000000003E-5,5.5600000000000003E-5]
[null,"CRM12A","CRESTMEAD","URBAN",15,1.425,0.94299999999999995,3.2008999999999999,null,null,null,null,null,null,null,3,2.4009999999999999E-3,2.4009999999999999E-3,7.9400000000000002E-6,7.9400000000000002E-6]
[null,"CRM13A","CRESTMEAD, HERITAGE PARK, MARSDEN, PARK RIDGE","URBAN",1792,9.5500000000000007,2.7029999999999998,4.5918000000000001,null,null,18,1.238273,0.33395999999999998,5.3540000000000003E-3,3.5720000000000001E-3,8,5.1305000000000003E-2,5.1305000000000003E-2,2.02E-4,2.02E-4]
[null,"CRM13B","CRESTMEAD","URBAN",24,1.127,2.0249999999999999,3.7534999999999998,null,null,3,1.2579999999999999E-2,3.9360000000000003E-3,8.0400000000000003E-5,5.3600000000000002E-5,3,3.1150000000000001E-3,3.1150000000000001E-3,9.9299999999999998E-6,9.9299999999999998E-6]
[null,"CRM15A","BROWNS PLAINS, HERITAGE PARK, REGENTS PARK","URBAN",1669,10.592000000000001,1.1339999999999999,3.5819999999999999,null,null,17,1.7121000000000001E-2,1.7121000000000001E-2,1.6100000000000001E-4,1.6100000000000001E-4,2,5.1650000000000003E-3,5.1650000000000003E-3,2.1800000000000001E-5,2.1800000000000001E-5]
[null,"CRM16A","BERRINBA, BROWNS PLAINS, KINGSTON, LOGAN CENTRAL, MARSDEN","RURAL",1968,11.926,8.3000000000000007,5.1253000000000002,null,null,12,3.1059999999999998E-3,2.9420000000000002E-3,3.0800000000000003E-5,2.8200000000000001E-5,4,3.6709999999999998E-3,3.6709999999999998E-3,2.8200000000000001E-5,2.8200000000000001E-5]
[null,"CRM1B","CRESTMEAD","URBAN",15,0.97599999999999998,0.876,2.8580000000000001]
[null,"CRM2B","CRESTMEAD","URBAN",8,0.20100000000000001,7.6999999999999999E-2,0.2858]
[null,"CRM3A","CRESTMEAD","URBAN",25,1.7350000000000001,1.9370000000000001,2.8580000000000001,null,null,null,null,null,null,null,5,8.763E-3,8.763E-3,1.8899999999999999E-5,1.8899999999999999E-5]
[null,"CRM5A","BERRINBA, BROWNS PLAINS, CRESTMEAD, HERITAGE PARK","URBAN",1095,6.0119999999999996,4.9809999999999999,3.5438999999999998,null,null,5,0.17491999999999999,0.17491999999999999,4.3600000000000002E-3,4.3600000000000002E-3,2,1.3960000000000001E-3,1.3960000000000001E-3,9.9299999999999998E-6,9.9299999999999998E-6]
[null,"CRM5B","CRESTMEAD","URBAN",30,0.98899999999999999,0.96899999999999997,0.83830000000000005,null,null,5,1.0115000000000001E-2,1.0115000000000001E-2,1.3999999999999999E-4,1.3999999999999999E-4,5,1.7340000000000001E-3,1.7340000000000001E-3,7.9400000000000002E-6,7.9400000000000002E-6]
[null,"CRMEDB2","CRESTMEAD, HERITAGE PARK","URBAN",21,3.0870000000000002,0.25800000000000001,1.7909999999999999,null,null,null,null,null,null,null,3,1.7619999999999999E-3,1.7619999999999999E-3,6.9500000000000004E-6,6.9500000000000004E-6]
[null,"CRTT1","BRISBANE","CBD",1]
[null,"CRY2A","COOROY, LAKE MACDONALD, POMONA, TINBEERWAH","RURAL",698,50.582000000000001,2.4220000000000002,1.7528999999999999,null,null,21,0.25730399999999998,0.25730399999999998,7.2300000000000001E-4,7.2300000000000001E-4,30,0.400038,0.400038,1.5870000000000001E-3,1.5870000000000001E-3]
[null,"CRY3A","COOROY","RURAL",990,22.042000000000002,0.85299999999999998,2.3435000000000001,null,null,10,0.44625900000000002,0.44625900000000002,2.5479999999999999E-3,2.5479999999999999E-3,18,0.154474,0.154474,6.6100000000000002E-4,6.6100000000000002E-4]
[null,"CRY5A","COOROY, EUMUNDI, TINBEERWAH","RURAL",85,16.539000000000001,0.27900000000000003,0.32390000000000002,null,null,5,0.14258999999999999,0.14258999999999999,7.1000000000000002E-4,7.1000000000000002E-4,5,3.9916E-2,3.9916E-2,1.54E-4,1.54E-4]
[null,"CRY6A","BELLI PARK, COOLOOLABIN, COOROY, EERWAH VALE, EUMUNDI","RURAL",655,60.853999999999999,2.347,1.429,null,null,18,0.514899,0.514899,2.5920000000000001E-3,2.5920000000000001E-3,24,0.27839399999999997,0.27839399999999997,1.6299999999999999E-3,1.6299999999999999E-3]
[null,"CSATR1H","BRISBANE","URBAN",1]
[null,"CSE10","CHERMSIDE, KEDRON","URBAN",880,2.4129999999999998,2.7120000000000002,1.8672,null,null,5,5.8380000000000003E-3,5.8380000000000003E-3,6.9800000000000005E-4,6.9800000000000005E-4,3,1.0128E-2,1.0128E-2,3.0800000000000003E-5,3.0800000000000003E-5]
[null,"CSE2","ASPLEY, CHERMSIDE, CHERMSIDE WEST","URBAN",1101,4.7930000000000001,4.6429999999999998,2.7818000000000001,null,null,8,0.14549999999999999,0.14549999999999999,3.3310000000000002E-3,3.3310000000000002E-3,22,0.118996,0.118996,4.3199999999999998E-4,4.3199999999999998E-4]
[null,"CSE21A","CHERMSIDE","URBAN",40,null,1.373,1.2575000000000001,null,null,1,8.3900000000000001E-4,8.3900000000000001E-4,3.8699999999999999E-5,3.8699999999999999E-5,1,1.9900000000000001E-4,1.9900000000000001E-4,9.9000000000000005E-7,9.9000000000000005E-7]
[null,"CSE23A","CHERMSIDE","URBAN",135,1.5069999999999999,2.1269999999999998,1.0098,null,null,5,1.4276E-2,1.4276E-2,3.1E-4,3.1E-4,4,1.0123E-2,1.0123E-2,3.57E-5,3.57E-5]
[null,"CSE27A","CHERMSIDE","URBAN",19,null,1.6879999999999999,1.8672,null,null,1,4.46E-4,4.46E-4,1.7900000000000001E-5,1.7900000000000001E-5,3,3.86E-4,3.86E-4,2.9799999999999998E-6,2.9799999999999998E-6]
[null,"CSE3","CHERMSIDE","URBAN",717,0.33900000000000002,3.028,4.4584000000000001,null,null,5,1.9855000000000001E-2,1.9855000000000001E-2,7.1699999999999997E-4,7.1699999999999997E-4,2,7.5490000000000002E-3,7.5490000000000002E-3,3.2799999999999998E-5,3.2799999999999998E-5]
[null,"CSE4","ASPLEY, CHERMSIDE, CHERMSIDE WEST","URBAN",1835,6.202,2.1030000000000002,3.5247999999999999,null,null,7,1.9186999999999999E-2,1.9120000000000002E-2,1.828E-3,1.8270000000000001E-3,21,0.12898399999999999,0.12898399999999999,4.4299999999999998E-4,4.4299999999999998E-4]
[null,"CSE6","CHERMSIDE, KEDRON, WAVELL HEIGHTS","URBAN",1871,6.3040000000000003,0.98699999999999999,3.5247999999999999,null,null,14,5.1688999999999999E-2,5.1688999999999999E-2,2.2139999999999998E-3,2.2139999999999998E-3,16,5.0750999999999998E-2,5.0750999999999998E-2,2.4699999999999999E-4,2.4699999999999999E-4]
[null,"CSE7","CHERMSIDE, WAVELL HEIGHTS","URBAN",1084,4.5,0.123,2.0958000000000001,null,null,6,2.426E-2,2.426E-2,1.2869999999999999E-3,1.2869999999999999E-3,26,0.16266700000000001,0.16266700000000001,5.5599999999999996E-4,5.5599999999999996E-4]
[null,"CSE9","CHERMSIDE, GEEBUNG, WAVELL HEIGHTS","URBAN",2039,8.3379999999999992,0.8,3.7915999999999999,null,null,7,0.179367,0.179367,3.601E-3,3.601E-3,45,0.23558999999999999,0.23558999999999999,8.2600000000000002E-4,8.2600000000000002E-4]
[null,"CSQOXG5","SPRING HILL","URBAN",105,null,0.89300000000000002]
[null,"CSQQAC1","BRISBANE","CBD",50,null,0.54900000000000004]
[null,"CSQT1","SPRING HILL","CBD",17,null,null,null,null,null,null,null,null,null,null,1,1.048862,1.048862,5.1159999999999999E-3,5.1159999999999999E-3]
[null,"CSQT3","SPRING HILL","CBD",null,null,null,null,null,null,null,null,null,null,null,1,0.10488599999999999,0.10488599999999999,5.1199999999999998E-4,5.1199999999999998E-4]
[null,"CSTHAW26","BRISBANE","CBD",2,null,0.57199999999999995,1.5813999999999999]
[null,"CSTHTH17","BRISBANE","CBD",60,null,0.57099999999999995,2.0768]
[null,"CSTMKT23","BRISBANE","CBD",20,null,0.57799999999999996]
[null,"CSTQEC29","BRISBANE","CBD",9,null,0.44600000000000001,2.1720999999999999]
[null,"CSTQUT18","BRISBANE","CBD",18,null,1.0389999999999999,2.0387]
[null,"CSTSAM24","BRISBANE","CBD",33,null,0.69799999999999995,1.3528]
[null,"CSTWAC30","BRISBANE","CBD",8,null,0.83499999999999996,1.4671000000000001]
[null,"CTC2","SOUTH BRISBANE","URBAN",2]
[null,"CTC5","SOUTH BRISBANE","URBAN",null,null,null,null,null,null,null,null,null,null,null,1,1.4120000000000001E-3,1.4120000000000001E-3,9.9000000000000005E-7,9.9000000000000005E-7]
[null,"CTGTR1","BRISBANE","CBD",218]
[null,"CTHT1","BRISBANE","CBD",1,null,null,null,null,null,1,0.12148,null,5.1199999999999998E-4]
[null,"CTPT1","BUNDAMBA","URBAN",1]
[null,"CTSMLS91","FORTITUDE VALLEY","URBAN",19,null,0.82099999999999995,1.7338]
[null,"CTSTR1H",null,"URBAN",33]
[null,"CTWT1","BRISBANE","CBD",1]
[null,"CVL11A","CLEVELAND","URBAN",66,1.0389999999999999,0.504,2.8389000000000002,null,null,null,null,null,null,null,1,3.97E-4,3.97E-4,7.9400000000000002E-6,7.9400000000000002E-6]
[null,"CVL13A","CLEVELAND","URBAN",3,null,0.98599999999999999,0.55249999999999999,null,null,null,null,null,null,null,1,4.17E-4,4.17E-4,2.9799999999999998E-6,2.9799999999999998E-6]
[null,"CVL15A","CLEVELAND","URBAN",50,1.167,1.419,3.2389999999999999]
[null,"CVL17A","CLEVELAND, ORMISTON, THORNLANDS","URBAN",2236,9.5150000000000006,3.823,4.7442000000000002,null,null,23,0.56147499999999995,0.56147499999999995,5.7790000000000003E-3,5.7790000000000003E-3,13,3.0016000000000001E-2,3.0016000000000001E-2,1.12E-4,1.12E-4]
[null,"CVL1A","CLEVELAND, THORNLANDS","URBAN",1048,2.1429999999999998,5.9610000000000003,3.1819000000000002,null,null,3,8.3887000000000003E-2,8.3887000000000003E-2,1.0529999999999999E-3,1.0529999999999999E-3,3,4.5600000000000003E-4,4.5600000000000003E-4,1.0900000000000001E-5,1.0900000000000001E-5]
[null,"CVL3A","ALEXANDRA HILLS, CLEVELAND, THORNLANDS","RURAL",984,8.5869999999999997,2.9430000000000001,2.5912000000000002,null,null,6,2.3153E-2,2.3153E-2,2.6699999999999998E-4,2.6699999999999998E-4,5,2.69E-2,2.69E-2,1.3300000000000001E-4,1.3300000000000001E-4]
[null,"CVL5A","ALEXANDRA HILLS, CAPALABA, THORNLANDS","RURAL",418,6.3840000000000003,2.4670000000000001,1.1813,null,null,4,9.2277999999999999E-2,9.2277999999999999E-2,1.0839999999999999E-3,1.0839999999999999E-3]
[null,"CVL7A","CAPALABA, CLEVELAND, SHELDON, THORNLANDS","RURAL",1385,29.376999999999999,2.7709999999999999,4.5346000000000002,null,null,12,0.15868299999999999,0.15868299999999999,3.8370000000000001E-3,3.8370000000000001E-3,7,3.9870000000000003E-2,3.9870000000000003E-2,1.92E-4,1.92E-4]
[null,"CVL9A","CLEVELAND, THORNLANDS","URBAN",985,5.8680000000000003,0.96,2.3054000000000001,null,null,9,2.7796999999999999E-2,2.7796999999999999E-2,1.3200000000000001E-4,1.3200000000000001E-4,3,9.2130000000000007E-3,9.2130000000000007E-3,4.2700000000000001E-5,4.2700000000000001E-5]
[null,"DBS13A","HEMMANT, MURARRIE","URBAN",4,null,1.9239999999999999,2.6674000000000002,null,null,null,null,null,null,null,1,4.5600000000000003E-4,4.5600000000000003E-4,9.9000000000000005E-7,9.9000000000000005E-7]
[null,"DBS16A","MURARRIE","URBAN",54,null,3.645,3.2961999999999998]
[null,"DBS2A","HEMMANT, MURARRIE","URBAN",14,0.68899999999999995,0.79200000000000004,1.4671000000000001,null,null,1,1.6699999999999999E-4,1.6699999999999999E-4,7.9400000000000002E-6,7.9400000000000002E-6,3,9.7799999999999992E-4,9.7799999999999992E-4,9.9299999999999998E-6,9.9299999999999998E-6]
[null,"DBS4A","MURARRIE","URBAN",103,3.2549999999999999,2.1960000000000002,4.7442000000000002,null,null,3,2.4929E-2,2.4929E-2,2.05E-4,2.05E-4,4,3.052E-3,3.052E-3,1.19E-5,1.19E-5]
[null,"DBS5A","MURARRIE","URBAN",128,0.373,3.093,3.0485000000000002,null,null,null,null,null,null,null,1,4.5899999999999999E-4,4.5899999999999999E-4,2.9799999999999998E-6,2.9799999999999998E-6]
[null,"DBY10","DECEPTION BAY, NARANGBA, NORTH LAKES","RURAL",null,4.9770000000000003,12.647,5.7159000000000004,null,null,2,0.36882300000000001,0.36882300000000001,3.4320000000000002E-3,3.4320000000000002E-3,4,2.9580000000000001E-3,2.9580000000000001E-3,2.3099999999999999E-5,2.3099999999999999E-5]
[null,"DBY10","DECEPTION BAY, NARANGBA, NORTH LAKES","URBAN",1346,4.9770000000000003,12.647,5.7159000000000004]
[null,"DBY11","DECEPTION BAY","URBAN",1240,7.6829999999999998,0.80800000000000005,2.7054999999999998,null,null,10,7.2849999999999998E-2,7.2849999999999998E-2,3.6400000000000001E-4,3.6400000000000001E-4,10,6.0422999999999998E-2,5.5834000000000002E-2,2.5700000000000001E-4,2.34E-4]
[null,"DBY4","DECEPTION BAY, NARANGBA, NORTH LAKES","URBAN",1566,1.867,8.2110000000000003,4.9348000000000001,null,null,2,1.16E-4,1.16E-4,1.99E-6,1.99E-6,1,3.39E-4,3.39E-4,1.99E-6,1.99E-6]
[null,"DBY5","DECEPTION BAY","URBAN",290,1.339,0.70699999999999996,0.70499999999999996]
[null,"DBY6","DECEPTION BAY","URBAN",1667,9.8409999999999993,0.26200000000000001,3.7153999999999998,null,null,6,2.2523000000000001E-2,2.2440000000000002E-2,1.5799999999999999E-4,1.5699999999999999E-4,9,3.6216999999999999E-2,3.6216999999999999E-2,1.84E-4,1.84E-4]
[null,"DBY7A","DECEPTION BAY, ROTHWELL","URBAN",1855,4.4329999999999998,4.5039999999999996,3.7534999999999998,null,null,12,0.15143699999999999,0.15143699999999999,2.2950000000000002E-3,2.2950000000000002E-3,3,6.4366000000000007E-2,6.4366000000000007E-2,1.5899999999999999E-4,1.5899999999999999E-4]
[null,"DBY8A","DECEPTION BAY","URBAN",1191,4.2629999999999999,2.4510000000000001,3.8487,null,null,4,6.5189999999999996E-3,6.5189999999999996E-3,6.9499999999999995E-5,6.9499999999999995E-5,20,0.11235100000000001,0.11235100000000001,4.2299999999999998E-4,4.2299999999999998E-4]
[null,"DBY9","DECEPTION BAY, ROTHWELL","URBAN",1563,7.391,5.5979999999999999,4.8395000000000001,null,null,6,0.27415,0.27415,3.0360000000000001E-3,3.0360000000000001E-3,4,2.0553999999999999E-2,2.0553999999999999E-2,7.3499999999999998E-5,7.3499999999999998E-5]
[null,"DRA11A","DARRA","URBAN",829,4.01,0.80600000000000005,1.7719,null,null,5,5.0422000000000002E-2,5.0422000000000002E-2,8.2700000000000004E-4,8.2700000000000004E-4,1,8.8620000000000001E-3,8.8620000000000001E-3,3.0800000000000003E-5,3.0800000000000003E-5]
[null,"DRA12A","DARRA, RICHLANDS","URBAN",85,0.54800000000000004,4.2519999999999998,3.1819000000000002,null,null,null,null,null,null,null,1,2.7599999999999999E-4,2.7599999999999999E-4,1.99E-6,1.99E-6]
[null,"DRA13A","RICHLANDS","RURAL",11,0.63600000000000001,2.4,0.38109999999999999]
[null,"DRA15A","DARRA, INALA, RICHLANDS","URBAN",413,3.4809999999999999,3.8610000000000002,4.4203000000000001,null,null,1,5.3999999999999998E-5,5.3999999999999998E-5,9.9000000000000005E-7,9.9000000000000005E-7,3,1.4758E-2,1.4758E-2,6.3499999999999999E-5,6.3499999999999999E-5]
[null,"DRA16A",null,"URBAN",1,null,1.542,1.5624]
[null,"DRA4A","DARRA","URBAN",null,null,null,0.97170000000000001,null,null,1,7.9999999999999996E-6,7.9999999999999996E-6,9.9000000000000005E-7,9.9000000000000005E-7]
[null,"DRA5A","DARRA, RICHLANDS","URBAN",40,1.07,2.101,2.9723000000000002,null,null,2,3.8990000000000001E-3,3.8990000000000001E-3,4.07E-5,4.07E-5]
[null,"DRA7A","DARRA","RURAL",null,2.3159999999999998,2.02,1.2766,null,null,null,null,null,null,null,7,2.4181999999999999E-2,2.4181999999999999E-2,1.2799999999999999E-4,1.2799999999999999E-4]
[null,"DRA7A","DARRA","URBAN",258,2.3159999999999998,2.02,1.2766]
[null,"DRA8A","DARRA, INALA, RICHLANDS","URBAN",238,3.681,2.5960000000000001,3.3342999999999998,null,null,1,2.5799999999999998E-4,2.5799999999999998E-4,4.9599999999999999E-6,4.9599999999999999E-6,5,1.8929999999999999E-3,1.4289999999999999E-3,1.6900000000000001E-5,1.29E-5]
[null,"DRA9A","DARRA, SUMNER","RURAL",411,2.5270000000000001,2.681,1.2575000000000001,null,null,4,0.16157299999999999,1.126E-3,1.0460000000000001E-3,7.6899999999999992E-6,2,1.2468E-2,1.2468E-2,7.9499999999999994E-5,7.9499999999999994E-5]
[null,"DRA9A","DARRA, SUMNER","URBAN",411,2.5270000000000001,2.681,1.2575000000000001,null,null,1,3.6999999999999998E-5,3.6999999999999998E-5,9.9000000000000005E-7,9.9000000000000005E-7]
[null,"DRD13A","CLONTARF, MARGATE","URBAN",2143,8.3149999999999995,0.27300000000000002,3.5819999999999999,null,null,8,3.2179999999999999E-3,3.2179999999999999E-3,3.18E-5,3.18E-5,6,3.3471000000000001E-2,3.3471000000000001E-2,1.1400000000000001E-4,1.1400000000000001E-4]
[null,"DRD15B","CLONTARF, WOODY POINT","URBAN",2217,8.4890000000000008,1.0149999999999999,5.0110000000000001,null,null,18,0.33704600000000001,0.33680300000000002,2.7910000000000001E-3,2.7899999999999999E-3,7,1.7172E-2,1.7172E-2,1.2400000000000001E-4,1.2400000000000001E-4]
[null,"DRD16A","CLONTARF, KIPPA-RING","URBAN",590,5.0869999999999997,0.65200000000000002,3.5819999999999999,null,null,4,0.15907399999999999,0.15907399999999999,5.9400000000000002E-4,5.9400000000000002E-4,5,2.7886000000000001E-2,2.7886000000000001E-2,7.5400000000000003E-5,7.5400000000000003E-5]
[null,"DRD2A","CLONTARF, KIPPA-RING, ROTHWELL","RURAL",1842,5.81,8.2370000000000001,4.0583,null,null,5,1.134E-3,1.134E-3,1.2799999999999999E-5,1.2799999999999999E-5,9,9.6586000000000005E-2,9.6586000000000005E-2,4.3800000000000002E-4,4.3800000000000002E-4]
[null,"DRD3A","CLONTARF, KIPPA-RING","URBAN",1702,9.0950000000000006,1.216,4.5918000000000001,null,null,7,2.4341999999999999E-2,2.4341999999999999E-2,2.3699999999999999E-4,2.3699999999999999E-4,7,1.3474E-2,1.3474E-2,5.5600000000000003E-5,5.5600000000000003E-5]
[null,"DRD5A","CLONTARF, MARGATE, WOODY POINT","URBAN",2813,9.3320000000000007,0.54700000000000004,4.4584000000000001,null,null,10,3.6468E-2,3.6468E-2,2.7099999999999997E-4,2.7099999999999997E-4,7,2.1248E-2,2.1248E-2,8.8300000000000005E-5,8.8300000000000005E-5]
[null,"EBAPMH5","BRISBANE","CBD",8,null,0.97499999999999998,null,null,null,1,1.2134000000000001E-2,1.2134000000000001E-2,2.5599999999999999E-4,2.5599999999999999E-4]
[null,"EBAT1","BRISBANE","CBD",1]
[null,"ECCT1","BRISBANE","CBD",29]
[null,"ECCT2","BRISBANE","CBD",1]
[null,"ECWMTS47","SPRING HILL","URBAN",128,null,0.309,null,null,null,2,2.12E-4,2.12E-4,1.99E-6,1.99E-6]
[null,"EEXT1","BRISBANE","CBD",56,null,null,null,null,null,1,3.2192289999999999,null,1.3558000000000001E-2]
[null,"EEXT3","BRISBANE","CBD",null,null,null,null,null,null,1,0.12148,null,5.1199999999999998E-4]
[null,"EEXWIB2","BRISBANE","CBD",1,null,0.72499999999999998,null,null,null,1,6.0740000000000002E-2,null,2.5599999999999999E-4]
[null,"EGETR1",null,"CBD",1,null,null,null,null,null,1,6.0740000000000002E-2,null,2.5599999999999999E-4]
[null,"EGTSQB3","BRISBANE","CBD",17,null,0.73399999999999999,null,null,null,1,1.6699919999999999,1.6699919999999999,4.3489999999999996E-3,4.3489999999999996E-3]
[null,"EGTTR1H","BRISBANE","CBD",10]
[null,"EHSTR1H","BRISBANE","CBD",1]
[null,"EMD1","EERWAH VALE, EUMUNDI","RURAL",402,12.082000000000001,1.5680000000000001,0.99080000000000001,null,null,7,0.32136799999999999,0.32136799999999999,1.1280000000000001E-3,1.1280000000000001E-3,8,5.6042000000000002E-2,5.6042000000000002E-2,1.85E-4,1.85E-4]
[null,"EMD2","BRIDGES, EERWAH VALE, EUMUNDI, NINDERRY, NORTH ARM","RURAL",470,34.746000000000002,1.0009999999999999,0.95269999999999999,null,null,18,0.419991,0.419991,4.235E-3,4.235E-3,8,0.21703900000000001,0.21703900000000001,8.1499999999999997E-4,8.1499999999999997E-4]
[null,"EMD3","DOONAN, EUMUNDI, VERRIERDALE, YANDINA CREEK","RURAL",655,42.222000000000001,1.482,1.429,null,null,15,0.60352099999999997,0.60352099999999997,4.9420000000000002E-3,4.9420000000000002E-3,7,8.7289000000000005E-2,8.7289000000000005E-2,3.4900000000000003E-4,3.4900000000000003E-4]
[null,"EMP15A","EIGHT MILE PLAINS","URBAN",44,null,2.5099999999999998,4.4775,null,null,null,null,null,null,null,1,1.2E-4,1.2E-4,9.9000000000000005E-7,9.9000000000000005E-7]
[null,"EMP21A","BURBANK, EIGHT MILE PLAINS, PRIESTDALE, ROCHEDALE, ROCHEDALE SOUTH","RURAL",2198,27.73,4.742,5.3539000000000003,null,null,12,0.12553800000000001,0.11026900000000001,4.6930000000000001E-3,4.3239999999999997E-3,34,0.30123699999999998,0.30123699999999998,1.0690000000000001E-3,1.0690000000000001E-3]
[null,"EMP22A","ALGESTER, EIGHT MILE PLAINS","URBAN",76,null,2.04,4.5346000000000002,null,null,3,1.439E-3,1.439E-3,8.9299999999999992E-6,8.9299999999999992E-6]
[null,"EMP23A","EIGHT MILE PLAINS, SUNNYBANK","URBAN",1661,1.607,6.3550000000000004,6.2493999999999996,null,null,5,3.3939999999999999E-3,3.3939999999999999E-3,1.59E-5,1.59E-5,7,2.2674E-2,2.2674E-2,1.35E-4,1.35E-4]
[null,"EMP25A","EIGHT MILE PLAINS, MACGREGOR, UPPER MT GRAVATT","RURAL",686,4.0819999999999999,3.2290000000000001,1.7719]
[null,"EMP2A","EIGHT MILE PLAINS","URBAN",1307,2.0659999999999998,4.9630000000000001,3.1627999999999998,null,null,2,4.86E-4,4.86E-4,1.8899999999999999E-5,1.8899999999999999E-5,2,2.0525999999999999E-2,2.0525999999999999E-2,6.2500000000000001E-5,6.2500000000000001E-5]
[null,"EMP3","EIGHT MILE PLAINS, RUNCORN","URBAN",978,2.1349999999999998,3.9990000000000001,4.9729000000000001,null,null,4,0.21401800000000001,0.21401800000000001,1.0430000000000001E-3,1.0430000000000001E-3,4,3.3210000000000002E-3,3.3210000000000002E-3,1.49E-5,1.49E-5]
[null,"EMP4A","EIGHT MILE PLAINS, ROCHEDALE, ROCHEDALE SOUTH","URBAN",1261,9.4510000000000005,1.571,null,null,null,9,1.2173E-2,1.2173E-2,1.312E-3,1.312E-3,18,8.0627000000000004E-2,8.0627000000000004E-2,3.5399999999999999E-4,3.5399999999999999E-4]
[null,"ENG13A","ALDERLEY, ENOGGERA","URBAN",659,3.3079999999999998,0.57799999999999996,2.3245,null,null,4,4.86E-4,3.3500000000000001E-4,3.9700000000000001E-6,2.9799999999999998E-6,6,3.1504999999999998E-2,3.1504999999999998E-2,1.21E-4,1.21E-4]
[null,"ENG17A","ALDERLEY, ASHGROVE, ENOGGERA","URBAN",1771,5.6180000000000003,0.39600000000000002,2.9342000000000001,null,null,7,3.2405000000000003E-2,3.2405000000000003E-2,2.1900000000000001E-4,2.1900000000000001E-4,14,8.1818000000000002E-2,8.1818000000000002E-2,2.9799999999999998E-4,2.9799999999999998E-4]
[null,"ENG2A","ASHGROVE, ENOGGERA, GAYTHORNE, MITCHELTON","URBAN",1569,7.0339999999999998,0.84599999999999997,3.1627999999999998,null,null,4,4.1399999999999998E-4,4.1399999999999998E-4,3.9700000000000001E-6,3.9700000000000001E-6,14,4.5142000000000002E-2,4.5142000000000002E-2,1.7899999999999999E-4,1.7899999999999999E-4]
[null,"ENG4A","ALDERLEY, ENOGGERA","URBAN",1193,2.3809999999999998,2.2090000000000001,2.0005999999999999,null,null,6,4.8299999999999998E-4,4.8299999999999998E-4,5.9599999999999997E-6,5.9599999999999997E-6,15,8.1059000000000006E-2,8.1059000000000006E-2,3.21E-4,3.21E-4]
[null,"ENG7A","ENOGGERA, EVERTON PARK","URBAN",1384,4.734,1.0029999999999999,3.8487,null,null,6,2.7188E-2,2.7188E-2,2.31E-4,2.31E-4,8,4.4533000000000003E-2,4.4533000000000003E-2,2.22E-4,2.22E-4]
[null,"ENSNSD27","NEWSTEAD","URBAN",112,null,0.74099999999999999,1.3147]
[null,"ENSTR1H","NEWSTEAD","URBAN",5]
[null,"ENSTR4H","NEWSTEAD","URBAN",3]
[null,"EPCNSD6",null,"URBAN",282,null,1.0920000000000001,1.448]
[null,"EPWTR1H","FORTITUDE VALLEY","URBAN",1]
[null,"ESK2B","ESK","RURAL",404,8.8819999999999997,0.64,0.91449999999999998,null,null,9,0.1333,0.1333,3.189E-3,3.189E-3,2,5.8339999999999998E-3,5.8339999999999998E-3,4.6100000000000002E-5,4.6100000000000002E-5]
[null,"ESK3A","BIARRA, COAL CREEK, ESK, GALLANANI, MURRUMBA, OTTABA","RURAL",118,44.338000000000001,6.4000000000000001E-2,0.30480000000000002,null,null,11,2.6633E-2,2.6633E-2,9.2000000000000003E-4,9.2000000000000003E-4,11,5.9194999999999998E-2,5.9194999999999998E-2,2.4899999999999998E-4,2.4899999999999998E-4]
[null,"ESK5A","ESK, MOUNT HALLEN, REDBANK CREEK","RURAL",632,61.058999999999997,3.1989999999999998,1.6005,null,null,17,0.50321800000000005,0.50321800000000005,8.3800000000000003E-3,8.3800000000000003E-3,6,2.8708999999999998E-2,2.8708999999999998E-2,9.48E-5,9.48E-5]
[null,"ESMT1","BRISBANE","CBD",29,null,null,null,null,null,1,5.9013000000000003E-2,5.9013000000000003E-2,2.5599999999999999E-4,2.5599999999999999E-4]
[null,"ESMWKD15","BRISBANE","CBD",2,null,0.312]
[null,"ESRFLW48","BRISBANE","CBD",4,null,0.68700000000000006]
[null,"ESRT1","BRISBANE","CBD",2]
[null,"EVLTR1H","BRISBANE","CBD",1]
[null,"EXB7","BRISBANE","CBD",3,null,null,null,null,null,1,6.6389999999999999E-3,6.6389999999999999E-3,2.5599999999999999E-4,2.5599999999999999E-4,1,2.3019999999999998E-3,2.3019999999999998E-3,7.67E-4,7.67E-4]
[null,"EXBQEC10","BRISBANE","CBD",27,null,0.32100000000000001]
[null,"EZRRWD4","EBENEZER, MOUNT FORBES, MUTDAPILLY, ROSEWOOD, THAGOONA, WALLOON, WILLOWBANK","RURAL",263,59.441000000000003,0.89,0.70499999999999996,null,null,10,4.6809999999999997E-2,4.5957999999999999E-2,7.8200000000000003E-4,7.7899999999999996E-4,13,0.243754,0.243754,6.3599999999999996E-4,6.3599999999999996E-4]
[null,"F101",null,"URBAN",1]
[null,"F1144","MORNINGSIDE","URBAN",3,null,0.39800000000000002,null,null,null,null,null,null,null,null,1,8.6700000000000004E-4,8.6700000000000004E-4,2.9799999999999998E-6,2.9799999999999998E-6]
[null,"F1173","GEEBUNG, VIRGINIA","URBAN",101,1.9019999999999999,0.98699999999999999,null,null,null,null,null,null,null,null,3,9.7999999999999997E-4,9.7999999999999997E-4,3.9700000000000001E-6,3.9700000000000001E-6]
[null,"F1207",null,"URBAN",2,null,0.28699999999999998]
[null,"F435",null,"CBD",null,null,0.151,null,null,null,1,2.0651660000000001,null,8.6979999999999991E-3]
[null,"FBSFIS12","LYTTON, PORT OF BRISBANE","URBAN",10,null,4.0229999999999997,null,null,null,1,1.9000000000000001E-4,1.9000000000000001E-4,1.19E-5,1.19E-5]
[null,"FBSFIS12","LYTTON, PORT OF BRISBANE","URBAN",10,null,4.0229999999999997,2.9531999999999998,null,null,1,1.9000000000000001E-4,1.9000000000000001E-4,1.19E-5,1.19E-5]
[null,"FBSFIS13","LYTTON, PORT OF BRISBANE","URBAN",26,null,5.6390000000000002,null,null,null,1,3.4900000000000003E-4,3.4900000000000003E-4,2.1800000000000001E-5,2.1800000000000001E-5,2,1.1050000000000001E-3,1.1050000000000001E-3,4.9599999999999999E-6,4.9599999999999999E-6]
[null,"FBSFIS13","LYTTON, PORT OF BRISBANE","URBAN",26,null,5.6390000000000002,2.2101999999999999,null,null,1,3.4900000000000003E-4,3.4900000000000003E-4,2.1800000000000001E-5,2.1800000000000001E-5,2,1.1050000000000001E-3,1.1050000000000001E-3,4.9599999999999999E-6,4.9599999999999999E-6]
[null,"FCHQPT2","MORNINGSIDE","URBAN",108,null,5.4089999999999998,2.7054999999999998]
[null,"FDS1","ANTHONY, GOOLMAN, HARRISVILLE, LIMESTONE RIDGES, MILBONG, MILORA, MUNBILLA, PEAK CROSSING, PURGA, ROADVALE, WASHPOOL, WOOLOOMAN","RURAL",547,111.422,0.52100000000000002,2.3816000000000002,null,null,18,0.113481,2.8302999999999998E-2,3.1199999999999999E-3,1.5020000000000001E-3,30,0.39018900000000001,0.39018900000000001,1.1460000000000001E-3,1.1460000000000001E-3]
[null,"FDS3","COLEYVILLE, HARRISVILLE, KENTS LAGOON, MILORA, MUNBILLA, MUTDAPILLY, PEAK CROSSING, RADFORD, SILVERDALE, WARRILL VIEW, WILSONS PLAINS","RURAL",546,101.998,null,1.7528999999999999,null,null,18,0.29602000000000001,0.294769,5.7800000000000004E-3,5.7780000000000001E-3,21,0.31988299999999997,0.31988299999999997,9.3300000000000002E-4,9.3300000000000002E-4]
[null,"FDS4","COLEYVILLE, HARRISVILLE, MOUNT FORBES, MUTDAPILLY, PEAK CROSSING, PURGA","RURAL",350,100.47499999999999,0.12,0.83830000000000005,null,null,13,0.26199899999999998,0.11788999999999999,3.64E-3,1.838E-3,30,0.202157,0.202157,6.7699999999999998E-4,6.7699999999999998E-4]
[null,"FGBSGT23","DEAGON, FITZGIBBON, TAIGUM, ZILLMERE","URBAN",2738,3.1850000000000001,9.282,5.2015000000000002,null,null,11,4.1672000000000001E-2,4.1672000000000001E-2,1.0709999999999999E-3,1.0709999999999999E-3,4,3.0660000000000001E-3,3.0660000000000001E-3,3.4700000000000003E-5,3.4700000000000003E-5]
[null,"FGSTR1H","BRISBANE","CBD",5]
[null,"FHLT1","BRISBANE","CBD",1]
[null,"FHS6","BRISBANE","CBD",3,null,0.29599999999999999]
[null,"FHST1","BRISBANE","CBD",5]
[null,"FHST2","BRISBANE","CBD",1]
[null,"FIS5A","PORT OF BRISBANE","URBAN",5,null,2.0299999999999998,2.5150000000000001,null,null,1,9.5000000000000005E-5,9.5000000000000005E-5,5.9599999999999997E-6,5.9599999999999997E-6]
[null,"FIS7A","PORT OF BRISBANE","URBAN",16,null,4.2149999999999999,1.3147,null,null,1,2.3800000000000001E-4,2.3800000000000001E-4,1.49E-5,1.49E-5,1,3.4810000000000002E-3,3.4810000000000002E-3,6.9500000000000004E-6,6.9500000000000004E-6]
[null,"FLWMHS27","BRISBANE","CBD",2,null,0.438]
[null,"FLWT1","BRISBANE","CBD",1]
[null,"FPT2",null,"URBAN",null,null,null,null,null,null,1,1.18E-4,1.18E-4,9.9000000000000005E-7,9.9000000000000005E-7]
[null,"FPTFVY1","FORTITUDE VALLEY","URBAN",73,null,0.746]
[null,"FPTRRD2",null,"URBAN",null,null,0.98499999999999999,null,null,null,1,1.0900000000000001E-4,1.0900000000000001E-4,9.9000000000000005E-7,9.9000000000000005E-7]
[null,"FPTTR1H","FORTITUDE VALLEY","URBAN",42]
[null,"FPTTR2H","FORTITUDE VALLEY","URBAN",3]
[null,"FPVTMT21","SPRING HILL","CBD",98,null,0.28699999999999998]
[null,"FPVTR1","SPRING HILL","CBD",6]
[null,"FVY2","FORTITUDE VALLEY","URBAN",65,null,6.0999999999999999E-2]
[null,"FVYMLS27","FORTITUDE VALLEY","URBAN",7,null,0.441,2.3435000000000001]
[null,"FVYT1","FORTITUDE VALLEY","URBAN",20]
[null,"GAP1A","THE GAP","URBAN",1046,3.919,4.306,2.8961000000000001,null,null,3,3.9820000000000003E-3,2.96E-3,1.49E-5,7.9400000000000002E-6,21,0.156308,0.156308,4.55E-4,4.55E-4]
[null,"GAP2A","MT COOTTHA, TOOWONG","URBAN",9,null,4.9829999999999997,1.9815]
[null,"GAP4A","THE GAP","RURAL",928,5.6310000000000002,4.5789999999999997,3.0865999999999998,null,null,3,0.13583600000000001,0.13583600000000001,2.392E-3,2.392E-3,3,3.9709999999999997E-3,3.9709999999999997E-3,2.05E-5,2.05E-5]
[null,"GAP6A","THE GAP","URBAN",1121,1.169,5.7270000000000003,2.7627000000000002,null,null,1,8.7000000000000001E-5,8.7000000000000001E-5,9.9000000000000005E-7,9.9000000000000005E-7,8,1.4541E-2,1.4541E-2,4.2700000000000001E-5,4.2700000000000001E-5]
[null,"GAP8A","THE GAP","URBAN",1577,6.492,2.4630000000000001,5.03,null,null,3,0.45203399999999999,0.45203399999999999,1.5659999999999999E-3,1.5659999999999999E-3,11,6.0644999999999998E-2,6.0644999999999998E-2,1.54E-4,1.54E-4]
[null,"GAP9A","THE GAP","URBAN",1217,5.4459999999999997,1.3140000000000001,2.8008000000000002,null,null,9,0.236814,0.236814,4.81E-3,4.81E-3,8,1.6913000000000001E-2,1.6913000000000001E-2,7.0500000000000006E-5,7.0500000000000006E-5]
[null,"GARTR1H","BRISBANE","CBD",1]
[null,"GASMMI1","BRISBANE","CBD",2]
[null,"GAST1","BRISBANE","CBD",1,null,null,null,null,null,1,6.0740000000000002E-2,null,2.5599999999999999E-4]
[null,"GBDT1","BRISBANE","CBD",1]
[null,"GBG1B","GEEBUNG","URBAN",null,0.91,3.3420000000000001,4.2679,null,null,1,4.0740000000000004E-3,4.0740000000000004E-3,3.57E-5,3.57E-5]
[null,"GBG23A","GEEBUNG","URBAN",237,1.62,1.831,1.6386000000000001,null,null,2,2.062E-3,2.062E-3,1.49E-5,1.49E-5]
[null,"GBG24A","VIRGINIA","URBAN",1,null,0.373,4.0773999999999999]
[null,"GBG25","GEEBUNG, VIRGINIA","URBAN",176,1.512,1.5629999999999999,3.3342999999999998,null,null,1,7.7899999999999996E-4,7.7899999999999996E-4,1.3900000000000001E-5,1.3900000000000001E-5,1,5.4600000000000004E-4,5.4600000000000004E-4,2.1800000000000001E-5,2.1800000000000001E-5]
[null,"GBG26","BANYO, NORTHGATE, VIRGINIA","URBAN",947,4.1950000000000003,2.5230000000000001,3.9821,null,null,7,4.8299999999999998E-4,4.8299999999999998E-4,6.9500000000000004E-6,6.9500000000000004E-6,13,7.0571999999999996E-2,7.0571999999999996E-2,1.3100000000000001E-4,1.3100000000000001E-4]
[null,"GBG27","BOONDALL, GEEBUNG, VIRGINIA","URBAN",1340,3.96,5.673,4.2298,null,null,2,3.0800000000000001E-4,3.0800000000000001E-4,1.99E-6,1.99E-6]
[null,"GBG28","VIRGINIA","URBAN",34,1.0840000000000001,0.85099999999999998,3.1246999999999998,null,null,1,5.6400000000000005E-4,5.6400000000000005E-4,1.0900000000000001E-5,1.0900000000000001E-5]
[null,"GBG2A","BANYO, NUDGEE, VIRGINIA","URBAN",1129,6.984,2.0840000000000001,3.0104000000000002,null,null,3,5.9719999999999999E-3,5.9719999999999999E-3,2.3799999999999999E-5,2.3799999999999999E-5,11,3.0707999999999999E-2,3.0707999999999999E-2,1.15E-4,1.15E-4]
[null,"GBG32A","GEEBUNG, VIRGINIA","URBAN",64,0.53400000000000003,2.3420000000000001,3.0485000000000002,null,null,null,null,null,null,null,3,5.4660000000000004E-3,5.4660000000000004E-3,2.2799999999999999E-5,2.2799999999999999E-5]
[null,"GBG33A","BOONDALL, GEEBUNG, ZILLMERE","URBAN",1101,4.2069999999999999,3.851,3.4104999999999999,null,null,8,9.59E-4,9.59E-4,7.9400000000000002E-6,7.9400000000000002E-6,9,3.8616999999999999E-2,3.8616999999999999E-2,1.5799999999999999E-4,1.5799999999999999E-4]
[null,"GBG34A","GEEBUNG","URBAN",61,0.37,2.1269999999999998,1.3337000000000001,null,null,null,null,null,null,null,4,9.6900000000000003E-4,9.6900000000000003E-4,3.9700000000000001E-6,3.9700000000000001E-6]
[null,"GBG4A","VIRGINIA","URBAN",64,0.63800000000000001,1.373,2.1149,null,null,1,4.7939999999999997E-3,4.7939999999999997E-3,1.49E-5,1.49E-5]
[null,"GBG6A","VIRGINIA","URBAN",74,0.65300000000000002,1.5580000000000001,1.9624999999999999]
[null,"GBN2","CANINA, GOOMBOORIAN, GREENS CREEK, NORTH DEEP CREEK, ROSS CREEK, VETERAN, WOLVI","RURAL",245,46.95,6.2E-2,0.36199999999999999,null,null,19,0.110359,0.110359,6.2799999999999998E-4,6.2799999999999998E-4,11,0.15284900000000001,0.15284900000000001,7.6400000000000003E-4,7.6400000000000003E-4]
[null,"GBN3","ANDERLEIGH, DOWNSFIELD, NEERDIE, ROSS CREEK, SANDY CREEK","RURAL",118,37.307000000000002,3.3000000000000002E-2,0.1905,null,null,5,3.0234E-2,3.0234E-2,1.7200000000000001E-4,1.7200000000000001E-4,4,7.2416999999999995E-2,7.2416999999999995E-2,2.9E-4,2.9E-4]
[null,"GBN4","COONDOO, DOWNSFIELD, GOOMBOORIAN, GYMPIE, KIA ORA, NEERDIE, ROSS CREEK, WILSONS POCKET, WOLVI","RURAL",732,142.55500000000001,0.115,1.2194,null,null,38,0.52029400000000003,0.52029400000000003,3.0430000000000001E-3,3.0430000000000001E-3,37,0.20550599999999999,0.20550599999999999,1.1050000000000001E-3,1.1050000000000001E-3]
[null,"GBP4","COORPAROO","URBAN",18,null,0.35,null,null,null,1,8.1119999999999994E-3,8.1119999999999994E-3,1.19E-5,1.19E-5,1,9.6299999999999999E-4,9.6299999999999999E-4,1.99E-6,1.99E-6]
[null,"GBP5","COORPAROO, GREENSLOPES","URBAN",474,1.46,1.4019999999999999,null,null,null,3,6.2850000000000003E-2,6.2850000000000003E-2,4.7899999999999999E-4,4.7899999999999999E-4,6,1.6868000000000001E-2,1.6868000000000001E-2,8.3399999999999994E-5,8.3399999999999994E-5]
[null,"GBP6","EAST BRISBANE, WOOLLOONGABBA","URBAN",794,2.63,1.1419999999999999,null,null,null,4,1.2178E-2,1.2178E-2,9.7299999999999993E-5,9.7299999999999993E-5,7,1.5904000000000001E-2,1.5904000000000001E-2,6.7500000000000001E-5,6.7500000000000001E-5]
[null,"GCISPD6","SURFERS PARADISE","URBAN",4,null,0.58699999999999997,0.66690000000000005]
[null,"GCL3","COOPERS PLAINS","URBAN",7,null,0.82099999999999995,null,null,null,null,null,null,null,null,1,2.4000000000000001E-5,2.4000000000000001E-5,1.99E-6,1.99E-6]
[null,"GCLSBK30","COOPERS PLAINS, ROBERTSON","URBAN",415,2.4129999999999998,0.441,0.80020000000000002,null,null,4,1.6500999999999998E-2,1.6500999999999998E-2,3.7500000000000001E-4,3.7500000000000001E-4,1,2.4299999999999999E-3,2.4299999999999999E-3,8.9299999999999992E-6,8.9299999999999992E-6]
[null,"GCLSBY10","SALISBURY","URBAN",394,3.9649999999999999,0.44500000000000001,5.2396000000000003,null,null,4,1.75E-4,1.75E-4,3.9700000000000001E-6,3.9700000000000001E-6,11,4.2261E-2,4.2261E-2,1.7899999999999999E-4,1.7899999999999999E-4]
[null,"GCN1",null,"URBAN",1,null,null,null,null,null,null,null,null,null,null,1,1.5E-5,1.5E-5,9.9000000000000005E-7,9.9000000000000005E-7]
[null,"GCXGCY1",null,"URBAN",1,null,3.1E-2,null,null,null,1,6.4999999999999994E-5,6.4999999999999994E-5,9.9000000000000005E-7,9.9000000000000005E-7]
[null,"GGR1","COLLEGE VIEW, CROWLEY VALE, FOREST HILL, GLENORE GROVE, LAKE CLARENDON, PLAINLAND","RURAL",530,57.970999999999997,1.2999999999999999E-2,1.9624999999999999,null,null,14,0.29330899999999999,0.29330899999999999,3.0379999999999999E-3,3.0379999999999999E-3,14,1.4605999999999999E-2,1.4605999999999999E-2,1.26E-4,1.26E-4]
[null,"GGR2","GLENORE GROVE, LAKE CLARENDON, MORTON VALE","RURAL",125,20.972999999999999,null,0.89549999999999996,null,null,5,5.3032000000000003E-2,5.3032000000000003E-2,9.6900000000000003E-4,9.6900000000000003E-4,9,1.8832999999999999E-2,1.8832999999999999E-2,1.15E-4,1.15E-4]
[null,"GGR3","GLENORE GROVE, KENTVILLE, LOCKROSE, REGENCY DOWNS","RURAL",60,18.658000000000001,2.5999999999999999E-2,0.83830000000000005,null,null,5,5.47E-3,5.47E-3,1.6899999999999999E-4,1.6899999999999999E-4,4,5.901E-3,5.901E-3,2.8200000000000001E-5,2.8200000000000001E-5]
[null,"GGR4","GLENORE GROVE, HATTON VALE, PLAINLAND, REGENCY DOWNS","RURAL",619,26.122,1.6319999999999999,2.9342000000000001,null,null,13,0.29172999999999999,0.28028799999999998,3.4940000000000001E-3,3.437E-3,14,8.3903000000000005E-2,8.3903000000000005E-2,4.64E-4,4.64E-4]
[null,"GGR5","GLENORE GROVE, GRANDCHESTER, HATTON VALE, REGENCY DOWNS, SUMMERHOLM","RURAL",755,59.777000000000001,2.2210000000000001,2.153,null,null,13,3.0032E-2,2.8597999999999998E-2,1.9740000000000001E-3,1.9710000000000001E-3,15,0.171793,0.14987600000000001,6.87E-4,5.9000000000000003E-4]
[null,"GHPPKW9",null,"URBAN",1,null,0.19800000000000001,2.6103000000000001]
[null,"GISVSP3","MURARRIE","URBAN",4,2.1339999999999999,1.3029999999999999,2.8961000000000001,null,null,1,5.7399999999999997E-4,5.7399999999999997E-4,2.9799999999999998E-6,2.9799999999999998E-6,1,5.2599999999999999E-4,5.2599999999999999E-4,9.9000000000000005E-7,9.9000000000000005E-7]
[null,"GLY11A","KEPERRA, UPPER KEDRON","URBAN",1560,5.38,8.4979999999999993,5.3349000000000002,null,null,4,1.2260999999999999E-2,1.2260999999999999E-2,5.8600000000000001E-5,5.8600000000000001E-5,8,1.3429E-2,1.3429E-2,4.1699999999999997E-5,4.1699999999999997E-5]
[null,"GLY12A","FERNY GROVE, KEPERRA","URBAN",1160,2.3039999999999998,7.2480000000000002,3.5057999999999998,null,null,7,6.1586000000000002E-2,6.1586000000000002E-2,1.2179999999999999E-3,1.2179999999999999E-3,2,2.7650000000000001E-3,2.7650000000000001E-3,1.3900000000000001E-5,1.3900000000000001E-5]
[null,"GLY15A","KEPERRA, MITCHELTON","RURAL",978,4.7210000000000001,0.186,1.7148000000000001,null,null,7,1.5010000000000001E-2,1.5010000000000001E-2,1.7699999999999999E-4,1.7699999999999999E-4,4,3.8485999999999999E-2,3.8485999999999999E-2,1.2799999999999999E-4,1.2799999999999999E-4]
[null,"GLY15A","KEPERRA, MITCHELTON","URBAN",978,4.7210000000000001,0.186,1.7148000000000001,null,null,2,5.4380000000000001E-3,5.4380000000000001E-3,5.66E-5,5.66E-5]
[null,"GLY2A","FERNY GROVE, KEPERRA, UPPER KEDRON","URBAN",976,4.13,5.8230000000000004,3.1438000000000001,null,null,3,7.332E-3,7.332E-3,8.7299999999999994E-5,8.7299999999999994E-5,5,1.1145E-2,1.1145E-2,5.1600000000000001E-5,5.1600000000000001E-5]
[null,"GLY3A","KEPERRA, MITCHELTON","URBAN",2100,7.3449999999999998,3.3969999999999998,4.4013,null,null,11,3.4069999999999999E-3,3.4069999999999999E-3,1.01E-4,1.01E-4,13,4.1831E-2,4.1831E-2,1.4300000000000001E-4,1.4300000000000001E-4]
[null,"GLY4A","KEPERRA","RURAL",null,4.5750000000000002,1.474,2.0196000000000001,null,null,4,1.1964000000000001E-2,1.1964000000000001E-2,2.13E-4,2.13E-4,16,0.197907,0.197907,8.4099999999999995E-4,8.4099999999999995E-4]
[null,"GLY4A","KEPERRA","URBAN",994,4.5750000000000002,1.474,2.0196000000000001]
[null,"GNA12A","COLLINGWOOD PARK, REDBANK PLAINS","RURAL",740,5.2149999999999999,1.581,1.8672,null,null,7,1.0651839999999999,1.7232999999999998E-2,2.0349999999999999E-3,1.6699999999999999E-4,1,1.3842E-2,1.3842E-2,7.6899999999999999E-5,7.6899999999999999E-5]
[null,"GNA13A","GOODNA","URBAN",636,3.0209999999999999,1.87,1.9053,null,null,5,2.6589999999999999E-3,2.6589999999999999E-3,3.6699999999999998E-5,3.6699999999999998E-5,8,6.7732000000000001E-2,6.7732000000000001E-2,2.4399999999999999E-4,2.4399999999999999E-4]
[null,"GNA15A","BELLBIRD PARK, GOODNA, REDBANK, REDBANK PLAINS","URBAN",437,1.379,1.627,0.97170000000000001,null,null,3,2.9799999999999998E-4,2.9799999999999998E-4,2.9799999999999998E-6,2.9799999999999998E-6]
[null,"GNA4A","COLLINGWOOD PARK, REDBANK","URBAN",843,5.4189999999999996,1.0569999999999999,2.0196000000000001,null,null,5,0.54970399999999997,5.1000000000000004E-3,8.8099999999999995E-4,4.4700000000000002E-5,12,3.6191000000000001E-2,3.6191000000000001E-2,1.5100000000000001E-4,1.5100000000000001E-4]
[null,"GNA5A","GOODNA","RURAL",1312,7.2460000000000004,2.863,2.3245,null,null,11,2.03552,0.10657,3.7659999999999998E-3,4.6099999999999998E-4,7,7.6633000000000007E-2,7.6633000000000007E-2,2.9700000000000001E-4,2.9700000000000001E-4]
[null,"GNA7A","BELLBIRD PARK, GOODNA, REDBANK PLAINS","URBAN",2082,11.395,4.0060000000000002,4.8014000000000001,null,null,22,1.1692,2.7164000000000001E-2,2.173E-3,2.5399999999999999E-4,16,8.1694000000000003E-2,8.1694000000000003E-2,3.4099999999999999E-4,3.4099999999999999E-4]
[null,"GPS3","BRISBANE","URBAN",1,null,0.14899999999999999]
[null,"GSB3","BRISBANE","CBD",1,null,0.13400000000000001]
[null,"GSBT1","BRISBANE","CBD",23]
[null,"GSETR1","FORTITUDE VALLEY","URBAN",2]
[null,"GSETR2","FORTITUDE VALLEY","URBAN",2]
[null,"GSNTR1H","FORTITUDE VALLEY","URBAN",1,null,null,null,null,null,null,null,null,null,null,1,4.3000000000000002E-5,4.3000000000000002E-5,9.9000000000000005E-7,9.9000000000000005E-7]
[null,"GTCTR1","BRISBANE","CBD",1]
[null,"GTN12A","GATTON, GRANTHAM, LOWER TENTHILL, PLACID HILLS, RINGWOOD","RURAL",568,40.875999999999998,3.7879999999999998,3.3342999999999998,null,null,8,0.11255800000000001,0.11255800000000001,1.5820000000000001E-3,1.5820000000000001E-3,10,2.1881000000000001E-2,2.1881000000000001E-2,1.05E-4,1.05E-4]
[null,"GTN13A","ADARE, GATTON, RINGWOOD, VINEGAR HILL","RURAL",733,37.959000000000003,1.623,2.1911,null,null,6,4.156E-3,4.156E-3,1.5899999999999999E-4,1.5899999999999999E-4,9,0.103159,0.103159,2.7900000000000001E-4,2.7900000000000001E-4]
[null,"GTN15A","ADARE, GATTON","RURAL",1181,23.023,1.6359999999999999,5.03,null,null,9,5.8348999999999998E-2,5.8348999999999998E-2,6.6100000000000002E-4,6.6100000000000002E-4,17,0.13034000000000001,0.13034000000000001,5.1999999999999995E-4,5.1999999999999995E-4]
[null,"GTN1B","GATTON, LOWER TENTHILL, WOODLANDS","RURAL",396,15.317,3.8679999999999999,1.7338,null,null,3,2.018E-2,2.018E-2,9.8700000000000003E-4,9.8700000000000003E-4,5,0.115203,0.115203,2.6899999999999998E-4,2.6899999999999998E-4]
[null,"GTN3A","GATTON","URBAN",1222,6.3360000000000003,0.379,3.4676999999999998,null,null,8,2.912E-2,2.912E-2,1.15E-4,1.15E-4,1,3.8499999999999998E-4,3.8499999999999998E-4,1.99E-6,1.99E-6]
[null,"GTN3B","GATTON","URBAN",1,null,0.191,9.5299999999999996E-2]
[null,"GTN5B","ADARE, CLARENDON, COLLEGE VIEW, FOREST HILL, GATTON, LAIDLEY NORTH, LAKE CLARENDON, LAWES","RURAL",395,48.887999999999998,0.64700000000000002,4.5346000000000002,null,null,5,8.0587000000000006E-2,8.0587000000000006E-2,1.0150000000000001E-3,1.0150000000000001E-3,14,2.3449000000000001E-2,2.3449000000000001E-2,1.74E-4,1.74E-4]
[null,"GVN12A","ARUNDEL, GAVEN, PARKWOOD","URBAN",1177,1.5289999999999999,7.5940000000000003,4.3441000000000001,null,null,4,0.14962600000000001,0.14962600000000001,1.17E-3,1.17E-3,1,1.8699999999999999E-4,1.8699999999999999E-4,1.99E-6,1.99E-6]
[null,"GVN13A","PACIFIC PINES","URBAN",1857,1.0609999999999999,12.689,5.4111000000000002,null,null,4,4.1599999999999997E-4,4.1599999999999997E-4,3.9700000000000001E-6,3.9700000000000001E-6]
[null,"GVN15A","HELENSVALE","URBAN",132,1.0720000000000001,2.601,2.1911,null,null,null,null,null,null,null,2,1.165E-3,1.165E-3,1.3900000000000001E-5,1.3900000000000001E-5]
[null,"GVN16A","GAVEN, NERANG, SOUTHPORT","RURAL",1081,12.945,1.641,3.6581999999999999,null,null,11,0.50498299999999996,1.3363999999999999E-2,2.8890000000000001E-3,1.15E-4,6,9.8793000000000006E-2,9.8793000000000006E-2,3.0499999999999999E-4,3.0499999999999999E-4]
[null,"GVN2A","GAVEN","URBAN",2,4.1360000000000001,0.154,1.5624,null,null,null,null,null,null,null,1,7.45E-4,7.45E-4,9.9000000000000005E-7,9.9000000000000005E-7]
[null,"GVN3A","GAVEN, MOLENDINAR, PARKWOOD","URBAN",892,2.1059999999999999,4.3029999999999999,1.9624999999999999,null,null,1,8.1000000000000004E-5,8.1000000000000004E-5,9.9000000000000005E-7,9.9000000000000005E-7]
[null,"GVN5A","ARUNDEL, GAVEN, HELENSVALE, PACIFIC PINES","RURAL",295,2.9289999999999998,2.9359999999999999,1.81,null,null,2,3.0200000000000002E-4,3.0200000000000002E-4,5.13E-6,5.13E-6,5,3.9454999999999997E-2,3.9454999999999997E-2,1.7899999999999999E-4,1.7899999999999999E-4]
[null,"GVN6B","OXENFORD, PACIFIC PINES","URBAN",1355,3.3180000000000001,10.189,4.3822000000000001,null,null,4,4.0999999999999999E-4,4.0999999999999999E-4,3.9700000000000001E-6,3.9700000000000001E-6]
[null,"GYGGYS6","GLANMIRE, GYMPIE, JONES HILL, KYBONG, LAGOON POCKET, LONG FLAT, MONKLAND, TANDUR, THE DAWN, TRAVESTON, WOONDUM","RURAL",null,103.393,0.13700000000000001,3.5247999999999999,null,null,21,0.177924,0.177924,1.4300000000000001E-3,1.4300000000000001E-3,46,0.40813300000000002,0.40813300000000002,1.389E-3,1.389E-3]
[null,"GYM2A","CALICO CREEK, DAGUN, GILLDORA, GYMPIE, JONES HILL, LAGOON POCKET, LANGSHAW, LONG FLAT, MCINTOSH CREEK, MONKLAND, MOOLOO, PIE CREEK, SOUTHSIDE, TANDUR, THE DAWN","RURAL",1422,69.100999999999999,4.5510000000000002,3.22,null,null,18,0.35578700000000002,0.35578700000000002,6.8950000000000001E-3,6.8950000000000001E-3,33,0.186667,0.185667,1.054E-3,1.0460000000000001E-3]
[null,"GYM2B","GYMPIE","URBAN",369,3.4910000000000001,0.95299999999999996,4.8966000000000003,null,null,4,1.469E-3,1.469E-3,3.6699999999999998E-4,3.6699999999999998E-4,3,3.9150000000000001E-3,3.5869999999999999E-3,2.2799999999999999E-5,2.1800000000000001E-5]
[null,"GYM3","GYMPIE, SOUTHSIDE","RURAL",940,8.3490000000000002,1.329,3.4676999999999998]
[null,"GYM3","GYMPIE, SOUTHSIDE","URBAN",null,8.3490000000000002,1.329,3.4676999999999998,null,null,7,1.9442000000000001E-2,1.9442000000000001E-2,1.856E-3,1.856E-3,15,0.162467,0.162467,5.3799999999999996E-4,5.3799999999999996E-4]
[null,"GYM4","GYMPIE","RURAL",774,5.5730000000000004,0.35,1.5624,null,null,8,3.7775999999999997E-2,3.7775999999999997E-2,2.2430000000000002E-3,2.2430000000000002E-3,21,0.165552,0.165552,6.3299999999999999E-4,6.3299999999999999E-4]
[null,"GYM5A","MONKLAND","RURAL",1,2.1309999999999998,0.29899999999999999,7.6200000000000004E-2,null,null,1,7.9999999999999996E-6,7.9999999999999996E-6,2.5600000000000001E-6,2.5600000000000001E-6]
[null,"GYM5B","GYMPIE","RURAL",444,2.8769999999999998,0.65800000000000003,1.2194,null,null,6,1.2147E-2,1.2147E-2,1.2509999999999999E-3,1.2509999999999999E-3,7,4.2872E-2,4.2872E-2,1.7699999999999999E-4,1.7699999999999999E-4]
[null,"GYM6","GYMPIE","URBAN",527,4.0149999999999997,0.13700000000000001,1.4671000000000001,null,null,6,2.728E-3,2.728E-3,1.0449999999999999E-3,1.0449999999999999E-3,4,6.9480000000000002E-3,6.9480000000000002E-3,4.1699999999999997E-5,4.1699999999999997E-5]
[null,"GYM7A","ARALUEN, CANINA, CEDAR POCKET, EAST DEEP CREEK, GOOMBOORIAN, GREENS CREEK, GYMPIE, MONKLAND, NORTH DEEP CREEK, VETERAN, VICTORY HEIGHTS","RURAL",1488,55.887,0.48699999999999999,2.6865000000000001,null,null,22,7.9489000000000004E-2,7.9489000000000004E-2,7.5929999999999999E-3,7.5929999999999999E-3,32,0.30496600000000001,0.30496600000000001,1.676E-3,1.676E-3]
[null,"GYM8A","GYMPIE, KYBONG, MONKLAND, PIE CREEK, SOUTHSIDE","RURAL",1182,20.620999999999999,1.26,2.7246000000000001,null,null,6,0.46063500000000002,0.46063500000000002,9.3310000000000008E-3,9.3310000000000008E-3,9,0.18079899999999999,0.18079899999999999,7.6400000000000003E-4,7.6400000000000003E-4]
[null,"GYM8B","GYMPIE","URBAN",453,2.9420000000000002,1.022,2.4769000000000001,null,null,5,2.0573000000000001E-2,2.0573000000000001E-2,1.34E-3,1.34E-3,6,3.4865E-2,2.5366E-2,1.44E-4,1.15E-4]
[null,"GYM9A","GYMPIE, MONKLAND","RURAL",188,5.4130000000000003,1.2210000000000001,1.1621999999999999,null,null,4,2.7369999999999998E-3,2.7369999999999998E-3,9.6599999999999995E-4,9.6599999999999995E-4]
[null,"GYM9B","CANINA, CEDAR POCKET, EAST DEEP CREEK, GREENS CREEK, MONKLAND, WOLVI","RURAL",155,29.687999999999999,0.30599999999999999,1.2194,null,null,16,5.9458999999999998E-2,5.9458999999999998E-2,1.5560000000000001E-3,1.5560000000000001E-3,10,7.3660000000000003E-2,7.3660000000000003E-2,3.0499999999999999E-4,3.0499999999999999E-4]
[null,"GYN12B","ARALUEN, GYMPIE, TWO MILE","URBAN",1076,7.1710000000000003,4.6900000000000004,4.306,null,null,3,0.11389100000000001,0.11389100000000001,1.3290000000000001E-3,1.3290000000000001E-3,6,6.7200000000000003E-3,6.7200000000000003E-3,3.2799999999999998E-5,3.2799999999999998E-5]
[null,"GYN13A","ARALUEN, BANKS POCKET, CHATSWORTH, CORELLA, GYMPIE, NORTH DEEP CREEK, TAMAREE","RURAL",1378,66.301000000000002,3.6970000000000001,3.0293999999999999,null,null,15,0.73695299999999997,0.73695299999999997,3.6419999999999998E-3,3.6419999999999998E-3,31,0.89205900000000005,0.89205900000000005,2.9220000000000001E-3,2.9220000000000001E-3]
[null,"GYN15A","GYMPIE","URBAN",3,0.83399999999999996,0.70599999999999996,2.5912000000000002]
[null,"GYN2B","GYMPIE","URBAN",412,4.21,0.255,2.0577000000000001,null,null,6,3.287E-3,3.287E-3,6.05E-5,6.05E-5,6,4.5856000000000001E-2,4.5856000000000001E-2,1.46E-4,1.46E-4]
[null,"GYN3A","FISHERMANS POCKET, GLASTONBURY, GYMPIE, LANGSHAW, MARYS CREEK, NAHRUNDA, PIE CREEK, SCRUBBY CREEK, SOUTHSIDE, THE PALMS, UPPER GLASTONBURY, WIDGEE CROSSING NTH, WIDGEE CROSSING STH","RURAL",1349,115.68600000000001,1.6659999999999999,2.7627000000000002,null,null,17,0.65222000000000002,0.65222000000000002,4.5469999999999998E-3,4.5469999999999998E-3,30,0.41525899999999999,0.41525899999999999,1.6119999999999999E-3,1.6119999999999999E-3]
[null,"GYN6A","ARALUEN, BELLS BRIDGE, CHATSWORTH, CURRA, FISHERMANS POCKET, GLASTONBURY, GYMPIE, TAMAREE, THE PALMS, TWO MILE","RURAL",881,64.281000000000006,0.626,1.8672,null,null,10,0.11571099999999999,0.11571099999999999,9.0700000000000004E-4,9.0700000000000004E-4,14,0.61831800000000003,0.61831800000000003,1.9580000000000001E-3,1.9580000000000001E-3]
[null,"GYS2A","EAST DEEP CREEK, MONKLAND","URBAN",20,2.3940000000000001,0.16,3.4104999999999999,null,null,null,null,null,null,null,2,6.8399999999999997E-3,6.8399999999999997E-3,1.7900000000000001E-5,1.7900000000000001E-5]
[null,"GYS3A","BEENAAM VALLEY, CEDAR POCKET, EAST DEEP CREEK, GREENS CREEK, MOTHAR MOUNTAIN, NEUSA VALE, WOLVI","RURAL",381,68.745000000000005,0.16300000000000001,0.85740000000000005,null,null,17,0.145179,0.145179,8.8400000000000002E-4,8.8400000000000002E-4,17,0.110208,0.110208,4.0499999999999998E-4,4.0499999999999998E-4]
[null,"GYS5A","CEDAR POCKET, GLANMIRE, MONKLAND, MOTHAR MOUNTAIN, TANDUR, WOONDUM","RURAL",266,44.231000000000002,0.19800000000000001,0.64780000000000004,null,null,9,4.3090000000000003E-3,4.3090000000000003E-3,4.3600000000000003E-5,4.3600000000000003E-5,9,4.7475000000000003E-2,4.7475000000000003E-2,2.3800000000000001E-4,2.3800000000000001E-4]
[null,"HAWT1","BRISBANE","CBD",1]
[null,"HAWT2","BRISBANE","CBD",1]
[null,"HDA10A","CLAYFIELD, HENDRA, NUNDAH","URBAN",1841,3.593,1.649,3.0674999999999999,null,null,10,7.7087000000000003E-2,7.7087000000000003E-2,8.7100000000000003E-4,8.7100000000000003E-4,8,4.5010000000000001E-2,4.5010000000000001E-2,1.7899999999999999E-4,1.7899999999999999E-4]
[null,"HDA11A","CLAYFIELD","URBAN",1809,3.3479999999999999,1.698,2.9531999999999998,null,null,6,0.102545,0.102545,1.7979999999999999E-3,1.7979999999999999E-3,10,0.107514,0.107514,2.9E-4,2.9E-4]
[null,"HDA13A","ASCOT, HENDRA","URBAN",886,4.2359999999999998,0.19900000000000001,2.5912000000000002,null,null,2,1.7699999999999999E-4,1.7699999999999999E-4,1.99E-6,1.99E-6,13,4.1949E-2,4.1949E-2,1.8799999999999999E-4,1.8799999999999999E-4]
[null,"HDA14A","BANYO, HENDRA, NORTHGATE","URBAN",147,1.333,3.6619999999999999,3.0674999999999999,null,null,2,5.8259999999999996E-3,5.8259999999999996E-3,1.47E-4,1.47E-4,8,8.829E-3,8.829E-3,3.18E-5,3.18E-5]
[null,"HDA3A","ASCOT, CLAYFIELD, HENDRA","URBAN",670,2.8759999999999999,0.248,2.8008000000000002,null,null,4,3.307E-3,3.307E-3,2.6800000000000001E-5,2.6800000000000001E-5,4,2.9957000000000001E-2,2.9957000000000001E-2,8.2399999999999997E-5,8.2399999999999997E-5]
[null,"HDA3B","ASCOT","RURAL",163,1.325,1.7370000000000001,0.64780000000000004,null,null,2,2.4167000000000001E-2,2.4167000000000001E-2,2.9700000000000001E-4,2.9700000000000001E-4,1,3.3841000000000003E-2,3.3841000000000003E-2,1.18E-4,1.18E-4]
[null,"HDA4A","HENDRA","URBAN",850,2.694,0.69399999999999995,2.3626,null,null,1,2.9220000000000001E-3,2.9220000000000001E-3,2.2799999999999999E-5,2.2799999999999999E-5,23,9.0239E-2,9.0239E-2,3.5100000000000002E-4,3.5100000000000002E-4]
[null,"HDN1","CARPENDALE, GRANTHAM, HELIDON, VERADILLA","RURAL",435,46.286999999999999,2.198,1.2575000000000001,null,null,6,1.5219999999999999E-3,1.5219999999999999E-3,3.0800000000000003E-5,3.0800000000000003E-5,1,1.1590000000000001E-3,1.1590000000000001E-3,5.13E-6,5.13E-6]
[null,"HDN2","HELIDON, HELIDON SPA, POSTMANS RIDGE","RURAL",211,23.625,0.82799999999999996,1.448,null,null,2,7.7419999999999998E-3,7.7419999999999998E-3,1.13E-4,1.13E-4,9,3.5235000000000002E-2,3.5235000000000002E-2,1.13E-4,1.13E-4]
[null,"HDN3","HELIDON","RURAL",55,8.875,0.36599999999999999,0.20960000000000001,null,null,null,null,null,null,null,5,1.9644999999999999E-2,1.9644999999999999E-2,5.6400000000000002E-5,5.6400000000000002E-5]
[null,"HDN4","HELIDON, HELIDON SPA, IREDALE","RURAL",243,10.763,0.28100000000000003,0.80020000000000002,null,null,3,8.6600000000000002E-4,8.6600000000000002E-4,7.6899999999999992E-6,7.6899999999999992E-6,3,6.7930000000000004E-3,6.7930000000000004E-3,7.1799999999999997E-5,7.1799999999999997E-5]
[null,"HHBTR1H","HAMILTON","URBAN",2,null,null,null,null,null,null,null,null,null,null,1,3.9999999999999998E-6,3.9999999999999998E-6,1.99E-6,1.99E-6]
[null,"HHBTR2H","HAMILTON","URBAN",2,null,null,null,null,null,null,null,null,null,null,1,2.0000000000000002E-5,2.0000000000000002E-5,1.99E-6,1.99E-6]
[null,"HHBTR3H","HAMILTON","URBAN",1,null,null,null,null,null,null,null,null,null,null,1,5.0000000000000004E-6,5.0000000000000004E-6,9.9000000000000005E-7,9.9000000000000005E-7]
[null,"HHBTR4H","HAMILTON","URBAN",1,null,null,null,null,null,null,null,null,null,null,1,2.9E-5,2.9E-5,9.9000000000000005E-7,9.9000000000000005E-7]
[null,"HHBTR5H","HAMILTON","URBAN",2,null,null,null,null,null,null,null,null,null,null,1,9.5000000000000005E-5,9.5000000000000005E-5,1.99E-6,1.99E-6]
[null,"HHCRBH2",null,"URBAN",1,null,0.29499999999999998]
[null,"HIS12A","HELENSVALE, HOPE ISLAND","URBAN",853,1.79,5.3520000000000003,2.8389000000000002,null,null,2,4.2200000000000001E-4,4.2200000000000001E-4,3.7700000000000002E-5,3.7700000000000002E-5,5,3.4741000000000001E-2,3.4741000000000001E-2,8.3399999999999994E-5,8.3399999999999994E-5]
[null,"HIS12B","HELENSVALE, HOPE ISLAND, OXENFORD","URBAN",998,0.83299999999999996,10.627000000000001,4.0964,null,null,4,1.174E-2,1.174E-2,1.08E-4,1.08E-4,1,1.018E-3,1.018E-3,3.7700000000000002E-5,3.7700000000000002E-5]
[null,"HIS13A","HOPE ISLAND","URBAN",660,0.55600000000000005,7.7119999999999997,3.2961999999999998,null,null,null,null,null,null,null,3,1.3107000000000001E-2,1.3107000000000001E-2,3.4700000000000003E-5,3.4700000000000003E-5]
[null,"HIS15B","HOPE ISLAND","RURAL",165,null,1.331,0.2477,null,null,1,1.41E-3,1.41E-3,5.6400000000000002E-5,5.6400000000000002E-5,2,1.784E-3,1.784E-3,2.8200000000000001E-5,2.8200000000000001E-5]
[null,"HIS1B","HELENSVALE, HOPE ISLAND","URBAN",1130,null,7.59,4.2107000000000001,null,null,null,null,null,null,null,2,2.5354999999999999E-2,2.5354999999999999E-2,1.2E-4,1.2E-4]
[null,"HIS3A","HOPE ISLAND","URBAN",250,0.62,2.605,2.5341,null,null,4,6.5929999999999999E-3,6.5929999999999999E-3,6.5500000000000006E-5,6.5500000000000006E-5]
[null,"HIS5A","HOPE ISLAND, PARADISE POINT","URBAN",905,3.4849999999999999,3.7909999999999999,2.4197000000000002,null,null,4,6.4099999999999997E-4,6.4099999999999997E-4,3.9700000000000001E-6,3.9700000000000001E-6,4,1.1162E-2,1.1162E-2,5.2599999999999998E-5,5.2599999999999998E-5]
[null,"HIS5B","HOPE ISLAND","URBAN",1095,1.0680000000000001,9.3339999999999996,4.1345000000000001,null,null,2,2.5660000000000001E-3,2.5660000000000001E-3,3.4700000000000003E-5,3.4700000000000003E-5,5,6.4809999999999998E-3,6.4809999999999998E-3,2.9799999999999999E-5,2.9799999999999999E-5]
[null,"HISSCV16","HOPE ISLAND","URBAN",287,null,3.7749999999999999,4.6299000000000001]
[null,"HISSCV2","HOPE ISLAND","URBAN",254,0.30099999999999999,5.2850000000000001,3.6581999999999999,null,null,3,3.0086000000000002E-2,3.0086000000000002E-2,4.7800000000000002E-4,4.7800000000000002E-4]
[null,"HLG1","DUNWICH","RURAL",2,11.422000000000001,0.10299999999999999,1.9434,null,null,5,7.0699999999999995E-4,5.7399999999999997E-4,2.3099999999999999E-5,1.7900000000000001E-5,1,2.8499999999999999E-4,2.8499999999999999E-4,2.5600000000000001E-6,2.5600000000000001E-6]
[null,"HMRHTN7","HAMILTON","URBAN",548,null,1.2949999999999999,2.9150999999999998,null,null,null,null,null,null,null,1,1.1316E-2,1.1316E-2,7.4400000000000006E-5,7.4400000000000006E-5]
[null,"HMRTR1H",null,"URBAN",139]
[null,"HMT10A","HEMMANT","URBAN",304,2.1059999999999999,1.2250000000000001,1.5432999999999999,null,null,null,null,null,null,null,3,1.6343E-2,1.6343E-2,7.0500000000000006E-5,7.0500000000000006E-5]
[null,"HMT2","HEMMANT","URBAN",6,8.6999999999999994E-2,1.8160000000000001]
[null,"HMT3A","HEMMANT","URBAN",113,1.7290000000000001,1.6419999999999999,2.2673000000000001,null,null,null,null,null,null,null,1,1.47E-4,1.47E-4,1.99E-6,1.99E-6]
[null,"HMT9A","HEMMANT, TINGALPA","RURAL",190,3.6869999999999998,0.22700000000000001,0.87639999999999996,null,null,1,2.0000000000000001E-4,2.0000000000000001E-4,7.6899999999999992E-6,7.6899999999999992E-6,3,1.0271000000000001E-2,1.0271000000000001E-2,5.6400000000000002E-5,5.6400000000000002E-5]
[null,"HMTPTR5","HEMMANT, MURARRIE","URBAN",281,1.8149999999999999,1.099,2.153]
[null,"HPE12A","HOLLAND PARK, HOLLAND PARK WEST, MT GRAVATT, MT GRAVATT EAST","URBAN",1576,4.6139999999999999,0.75900000000000001,3.1819000000000002,null,null,3,3.3700000000000001E-4,3.3700000000000001E-4,2.9799999999999998E-6,2.9799999999999998E-6,14,6.1668000000000001E-2,6.1668000000000001E-2,2.9100000000000003E-4,2.9100000000000003E-4]
[null,"HPE13A","CAMP HILL, COORPAROO, HOLLAND PARK","URBAN",1730,9.3840000000000003,1.861,5.4682000000000004,null,null,11,0.241457,0.241457,3.6540000000000001E-3,3.6540000000000001E-3,16,4.6226999999999997E-2,4.6226999999999997E-2,1.5699999999999999E-4,1.5699999999999999E-4]
[null,"HPE16A","CARINA HEIGHTS, CARINDALE, HOLLAND PARK, MANSFIELD, MT GRAVATT EAST","URBAN",1205,3.1139999999999999,4.4640000000000004,3.3532999999999999,null,null,5,4.28E-4,4.28E-4,4.9599999999999999E-6,4.9599999999999999E-6,1,1.8900000000000001E-4,1.8900000000000001E-4,9.9000000000000005E-7,9.9000000000000005E-7]
[null,"HPE3A","MANSFIELD, MT GRAVATT EAST","URBAN",1874,7.2229999999999999,1.7509999999999999,4.2488000000000001,null,null,13,1.0428E-2,1.0428E-2,6.9499999999999995E-5,6.9499999999999995E-5,12,4.2979999999999997E-2,4.2979999999999997E-2,1.6200000000000001E-4,1.6200000000000001E-4]
[null,"HPE5A","HOLLAND PARK","URBAN",1280,5.59,0.75,2.3435000000000001,null,null,8,3.9158999999999999E-2,3.9158999999999999E-2,5.3499999999999999E-4,5.3499999999999999E-4,11,5.3845999999999998E-2,5.3845999999999998E-2,2.5000000000000001E-4,2.5000000000000001E-4]
[null,"HPK10","GREENSLOPES, HOLLAND PARK","URBAN",1446,4.476,0.51800000000000002,3.5629,null,null,4,4.35E-4,4.35E-4,3.9700000000000001E-6,3.9700000000000001E-6,4,2.4507999999999999E-2,2.4507999999999999E-2,1.05E-4,1.05E-4]
[null,"HPK11","HOLLAND PARK","RURAL",192,1.712,0.40100000000000002,0.45729999999999998,null,null,1,8.1000000000000004E-5,8.1000000000000004E-5,2.5600000000000001E-6,2.5600000000000001E-6,2,9.8709999999999996E-3,9.8709999999999996E-3,3.3300000000000003E-5,3.3300000000000003E-5]
[null,"HPK2","GREENSLOPES","URBAN",1004,2.391,3.06,3.1819000000000002,null,null,1,3.1000000000000001E-5,3.1000000000000001E-5,9.9000000000000005E-7,9.9000000000000005E-7,3,3.5048000000000003E-2,3.5048000000000003E-2,9.2299999999999994E-5,9.2299999999999994E-5]
[null,"HPK3A","HOLLAND PARK WEST, TARRAGINDI","URBAN",1725,6.8170000000000002,0.54900000000000004,3.1438000000000001,null,null,9,2.5621000000000001E-2,2.5621000000000001E-2,2.23E-4,2.23E-4,16,9.8685999999999996E-2,9.8685999999999996E-2,4.0499999999999998E-4,4.0499999999999998E-4]
[null,"HPK5A","ANNERLEY, HOLLAND PARK WEST, TARRAGINDI","URBAN",1324,5.7480000000000002,0.4,2.6293000000000002,null,null,8,5.3434000000000002E-2,5.3434000000000002E-2,6.3199999999999997E-4,6.3199999999999997E-4,12,0.106637,0.106637,3.1799999999999998E-4,3.1799999999999998E-4]
[null,"HPK6","COORPAROO, HOLLAND PARK, HOLLAND PARK WEST","URBAN",735,3.411,0.41299999999999998,2.496,null,null,5,1.1639999999999999E-2,1.1639999999999999E-2,2.03E-4,2.03E-4,8,1.3671000000000001E-2,1.3671000000000001E-2,7.25E-5,7.25E-5]
[null,"HPK8A","HOLLAND PARK WEST, TARRAGINDI","RURAL",676,4.8,0.84299999999999997,1.6194999999999999,null,null,2,1.1320999999999999E-2,1.1320999999999999E-2,1.2300000000000001E-4,1.2300000000000001E-4,8,9.0162000000000006E-2,9.0162000000000006E-2,3.6400000000000001E-4,3.6400000000000001E-4]
[null,"HPK9","HOLLAND PARK WEST","URBAN",630,1.78,0.85,1.3147,null,null,2,1.35E-4,1.35E-4,1.99E-6,1.99E-6,9,4.7230000000000001E-2,4.7230000000000001E-2,1.3300000000000001E-4,1.3300000000000001E-4]
[null,"HSH3",null,"URBAN",153,null,null,null,null,null,2,1.3100000000000001E-4,1.3100000000000001E-4,1.99E-6,1.99E-6]
[null,"HSHT1","SPRING HILL","URBAN",1]
[null,"HSHWTC43","SPRING HILL","URBAN",67,null,0.72899999999999998]
[null,"HTHT1","BRISBANE","CBD",1]
[null,"HTL10A","EAGLE FARM","URBAN",51,0.80300000000000005,2.016,3.2008999999999999,null,null,1,1.5699999999999999E-4,null,9.9000000000000005E-7,null,1,3.1100000000000002E-4,3.1100000000000002E-4,9.9000000000000005E-7,9.9000000000000005E-7]
[null,"HTL11A","EAGLE FARM","URBAN",68,2.3E-2,1.847,1.3528]
[null,"HTL12A","EAGLE FARM","URBAN",1,null,0.97599999999999998,3.1819000000000002,null,null,null,null,null,null,null,1,1.098E-3,1.098E-3,1.99E-6,1.99E-6]
[null,"HTL14A","EAGLE FARM","URBAN",28,1.0089999999999999,0.72499999999999998,0.74309999999999998,null,null,1,1.5039999999999999E-3,1.5039999999999999E-3,1.8899999999999999E-5,1.8899999999999999E-5,1,4.065E-3,4.065E-3,1.29E-5,1.29E-5]
[null,"HTL2A","EAGLE FARM","URBAN",103,null,2.3119999999999998,2.6484000000000001]
[null,"HTL3A","EAGLE FARM","URBAN",73,0.999,2.6829999999999998,2.3626,null,null,null,null,null,null,null,2,4.6999999999999999E-4,4.6999999999999999E-4,2.9799999999999998E-6,2.9799999999999998E-6]
[null,"HTL6A","EAGLE FARM, HAMILTON","URBAN",381,3.27,4.9249999999999998,3.0674999999999999,null,null,1,1.6899999999999999E-4,1.6899999999999999E-4,9.9000000000000005E-7,9.9000000000000005E-7,7,4.2129999999999997E-3,4.2129999999999997E-3,1.59E-5,1.59E-5]
[null,"HTN1A","ASCOT, EAGLE FARM, HAMILTON","URBAN",1505,3.202,1.3049999999999999,2.9150999999999998,null,null,3,1.5200000000000001E-4,1.5200000000000001E-4,2.9799999999999998E-6,2.9799999999999998E-6,9,6.7648E-2,6.7648E-2,1.95E-4,1.95E-4]
[null,"HTN22A","EAGLE FARM, HAMILTON","URBAN",389,2.5409999999999999,3.266,2.0577000000000001,null,null,5,6.0499999999999996E-4,6.0499999999999996E-4,4.9599999999999999E-6,4.9599999999999999E-6,8,3.1390000000000001E-2,3.1390000000000001E-2,1.1400000000000001E-4,1.1400000000000001E-4]
[null,"HTN24A","HAMILTON","URBAN",71,2.6219999999999999,2.226,2.9342000000000001,null,null,7,2.1836999999999999E-2,2.1836999999999999E-2,1.7200000000000001E-4,1.7200000000000001E-4,6,1.6004999999999998E-2,1.6004999999999998E-2,7.5400000000000003E-5,7.5400000000000003E-5]
[null,"HTN27A","ALBION, HAMILTON, NEWSTEAD","URBAN",486,0.92500000000000004,4.5529999999999999,3.4676999999999998,null,null,3,3.2039999999999998E-3,3.2039999999999998E-3,6.8499999999999998E-5,6.8499999999999998E-5,2,5.7759999999999999E-3,5.7759999999999999E-3,1.8899999999999999E-5,1.8899999999999999E-5]
[null,"HTN28A","ASCOT","URBAN",1143,3.028,1.0429999999999999,2.9912999999999998,null,null,10,2.9981000000000001E-2,2.9923000000000002E-2,1.103E-3,1.1019999999999999E-3,7,6.1164999999999997E-2,6.1164999999999997E-2,1.83E-4,1.83E-4]
[null,"HTN2A","ASCOT, HAMILTON","URBAN",665,2.1429999999999998,0.54900000000000004,2.1911,null,null,1,5.8999999999999998E-5,5.8999999999999998E-5,9.9000000000000005E-7,9.9000000000000005E-7,4,1.7455999999999999E-2,1.7455999999999999E-2,6.4499999999999996E-5,6.4499999999999996E-5]
[null,"HTN3A","ALBION, ASCOT, HAMILTON","URBAN",1142,2.2770000000000001,1.413,1.81,null,null,2,2.04E-4,2.04E-4,1.99E-6,1.99E-6,5,1.2694E-2,1.2694E-2,4.4700000000000002E-5,4.4700000000000002E-5]
[null,"HTN6A","HAMILTON","RURAL",199,null,1.6180000000000001,0.26669999999999999]
[null,"HWD12A","HEATHWOOD","URBAN",9,null,0.73499999999999999,1.7148000000000001]
[null,"HWD12B","FOREST LAKE, HEATHWOOD","URBAN",26,null,2.8170000000000002,1.429,null,null,null,null,null,null,null,1,6.7999999999999999E-5,6.7999999999999999E-5,9.9000000000000005E-7,9.9000000000000005E-7]
[null,"HWD13A","FOREST LAKE, HEATHWOOD","URBAN",560,9.8000000000000004E-2,5.1509999999999998,5.2587000000000002,null,null,null,null,null,null,null,1,1.4E-5,1.4E-5,9.9000000000000005E-7,9.9000000000000005E-7]
[null,"HWD16A",null,"URBAN",1,null,0.20699999999999999,4.4013,null,null,null,null,null,null,null,1,1.21E-4,1.21E-4,9.9000000000000005E-7,9.9000000000000005E-7]
[null,"HWD1B","HEATHWOOD","URBAN",8,null,0.51700000000000002,2.5341,null,null,null,null,null,null,null,1,7.4999999999999993E-5,7.4999999999999993E-5,9.9000000000000005E-7,9.9000000000000005E-7]
[null,"HWD2B","FORESTDALE, HEATHWOOD, LARAPINTA","RURAL",270,6.7720000000000002,5.2450000000000001,1.9053,null,null,2,8.3100000000000003E-4,8.3100000000000003E-4,5.13E-6,5.13E-6,4,2.5604999999999999E-2,2.5604999999999999E-2,1.1E-4,1.1E-4]
[null,"HWD5A","DOOLANDELLA, FOREST LAKE, HEATHWOOD","RURAL",null,7.1159999999999997,8.9429999999999996,4.8395000000000001,null,null,3,0.35094399999999998,0.35094399999999998,5.1320000000000003E-3,5.1320000000000003E-3,15,7.3462E-2,7.3339000000000001E-2,2.6400000000000002E-4,2.5399999999999999E-4]
[null,"HWD5A","DOOLANDELLA, FOREST LAKE, HEATHWOOD","URBAN",1778,7.1159999999999997,8.9429999999999996,4.8395000000000001]
[null,"HWD5B","FOREST LAKE","URBAN",1599,null,9.4440000000000008,4.6299000000000001,null,null,8,0.108973,0.108973,1.606E-3,1.606E-3,4,1.8044000000000001E-2,1.8044000000000001E-2,2.2699999999999999E-4,2.2699999999999999E-4]
[null,"HWL10A","COOMBABAH, PARADISE POINT, RUNAWAY BAY","URBAN",1677,4.2160000000000002,7.4850000000000003,3.9058999999999999,null,null,7,1.3157E-2,1.3157E-2,7.5400000000000003E-5,7.5400000000000003E-5,5,2.3015000000000001E-2,2.3015000000000001E-2,1.12E-4,1.12E-4]
[null,"HWL11A","RUNAWAY BAY","URBAN",1236,3.637,3.8420000000000001,2.8389000000000002,null,null,6,4.5434000000000002E-2,4.5344000000000002E-2,2.31E-4,2.3000000000000001E-4,1,1.07E-4,1.07E-4,9.9000000000000005E-7,9.9000000000000005E-7]
[null,"HWL12A","RUNAWAY BAY","URBAN",1,null,2.2000000000000002,1.7909999999999999]
[null,"HWL13A","PARADISE POINT","URBAN",972,1.079,12.257,4.4584000000000001,null,null,3,1.5200000000000001E-3,2.2699999999999999E-4,1.59E-5,1.99E-6,1,4.6649999999999999E-3,4.6649999999999999E-3,4.6699999999999997E-5,4.6699999999999997E-5]
[null,"HWL1A","HOLLYWELL, PARADISE POINT, RUNAWAY BAY","URBAN",1388,3.9740000000000002,5.5659999999999998,4.7061000000000002,null,null,8,2.2442E-2,2.2442E-2,1.92E-4,1.92E-4,6,2.8504000000000002E-2,2.8504000000000002E-2,8.2399999999999997E-5,8.2399999999999997E-5]
[null,"HWL2A","BIGGERA WATERS, RUNAWAY BAY","URBAN",696,5.1070000000000002,5.7069999999999999,3.6391,null,null,2,8.3846000000000004E-2,8.3846000000000004E-2,7.7099999999999998E-4,7.7099999999999998E-4,2,2.32E-4,2.32E-4,1.99E-6,1.99E-6]
[null,"HWL3A","COOMBABAH","URBAN",1958,3.7709999999999999,2.6579999999999999,4.4394,null,null,5,4.5399999999999998E-4,4.5399999999999998E-4,6.9500000000000004E-6,6.9500000000000004E-6,2,4.7939999999999997E-3,4.7939999999999997E-3,3.7700000000000002E-5,3.7700000000000002E-5]
[null,"HWL4A","RUNAWAY BAY","URBAN",649,3.2000000000000001E-2,6.32,3.7343999999999999,null,null,8,2.3973999999999999E-2,2.3973999999999999E-2,1.03E-4,1.03E-4]
[null,"HWL6A","BIGGERA WATERS, COOMBABAH, RUNAWAY BAY","URBAN",1777,2.3969999999999998,4.0149999999999997,4.3441000000000001,null,null,5,7.5320999999999999E-2,7.5320999999999999E-2,8.2299999999999995E-4,8.2299999999999995E-4,4,2.9936999999999998E-2,2.9936999999999998E-2,8.8300000000000005E-5,8.8300000000000005E-5]
[null,"HWL8A","HOLLYWELL, RUNAWAY BAY","URBAN",1286,2.78,3.4489999999999998,3.6391,null,null,2,6.3500000000000004E-4,6.3500000000000004E-4,1.99E-6,1.99E-6,4,1.0522999999999999E-2,1.0522999999999999E-2,4.4700000000000002E-5,4.4700000000000002E-5]
[null,"IBL1",null,"RURAL",1,null,null,1.429,null,null,2,3.68E-4,3.68E-4,5.13E-6,5.13E-6,2,6.2430000000000003E-3,6.2430000000000003E-3,5.13E-6,5.13E-6]
[null,"IBL2","BELLA CREEK, BOLLIER, BORUMBA DAM, BROOLOO, GHEERULLA, IMBIL, LAKE BORUMBA, MOY POCKET","RURAL",703,88.105000000000004,4.9000000000000002E-2,1.2956000000000001,null,null,14,0.37193700000000002,0.37193700000000002,3.8779999999999999E-3,3.8779999999999999E-3,10,0.39126300000000003,0.39126300000000003,1.1329999999999999E-3,1.1329999999999999E-3]
[null,"IBS1","RUSSELL ISLAND","URBAN",275,6.6909999999999998,1.25,null,null,null,6,0.29114899999999999,1.4749999999999999E-2,8.6300000000000005E-4,5.9000000000000003E-4,1,4.7600000000000002E-4,4.7600000000000002E-4,1.99E-6,1.99E-6]
[null,"IDY10A","CHAPEL HILL, INDOOROOPILLY","URBAN",1116,4.5819999999999999,2.86,3.3342999999999998,null,null,2,4.3654999999999999E-2,4.3654999999999999E-2,5.8299999999999997E-4,5.8299999999999997E-4,6,1.2815999999999999E-2,1.2815999999999999E-2,6.5500000000000006E-5,6.5500000000000006E-5]
[null,"IDY14A","INDOOROOPILLY, TARINGA","URBAN",356,0.61599999999999999,1.0089999999999999,2.7054999999999998,null,null,null,null,null,null,null,1,8.1300000000000003E-4,8.1300000000000003E-4,2.9799999999999998E-6,2.9799999999999998E-6]
[null,"IDY1A","CHAPEL HILL, INDOOROOPILLY","URBAN",1132,4.8150000000000004,1.9219999999999999,2.8580000000000001,null,null,4,1.6420000000000001E-2,1.6420000000000001E-2,1.85E-4,1.85E-4,8,3.0568999999999999E-2,3.0568999999999999E-2,1.2E-4,1.2E-4]
[null,"IDY5A","INDOOROOPILLY","URBAN",299,0.75800000000000001,0.26800000000000002,1.3717999999999999,null,null,3,2.1000000000000001E-4,1.75E-4,2.9799999999999998E-6,1.99E-6]
[null,"IDY6A","INDOOROOPILLY, TARINGA, TOOWONG","URBAN",1171,2.8730000000000002,0.59399999999999997,1.9434,null,null,7,0.26318000000000003,0.26318000000000003,1.168E-3,1.168E-3,5,3.3182000000000003E-2,3.3182000000000003E-2,1.25E-4,1.25E-4]
[null,"IDY9B","INDOOROOPILLY","URBAN",777,1.968,1.6659999999999999,2.2483,null,null,2,2.49E-3,2.49E-3,7.5400000000000003E-5,7.5400000000000003E-5,3,2.8268999999999999E-2,2.8268999999999999E-2,1.2E-4,1.2E-4]
[null,"IDYISC3",null,"URBAN",1,null,4.8000000000000001E-2,2.8961000000000001]
[null,"IEAT1","SPRING HILL","CBD",22,null,null,null,null,null,1,1.6931000000000002E-2,1.6931000000000002E-2,2.5599999999999999E-4,2.5599999999999999E-4]
[null,"IFYTR1H","BRISBANE","CBD",292]
[null,"INA10A","FOREST LAKE, INALA, RICHLANDS","RURAL",900,2.944,3.7549999999999999,1.8672,null,null,6,2.1239000000000001E-2,2.1239000000000001E-2,2.5969999999999999E-3,2.5969999999999999E-3,9,0.13996,0.13996,4.7399999999999997E-4,4.7399999999999997E-4]
[null,"INA11A","FOREST LAKE, INALA","URBAN",1428,3.4249999999999998,3.444,2.3626,null,null,5,8.3280000000000003E-3,8.3280000000000003E-3,1.5510000000000001E-3,1.5510000000000001E-3,6,2.3434E-2,2.3434E-2,1.11E-4,1.11E-4]
[null,"INA1A","DOOLANDELLA, INALA","URBAN",1669,5.0810000000000004,2.3610000000000002,3.1438000000000001,null,null,11,9.9307999999999994E-2,9.9307999999999994E-2,3.558E-3,3.558E-3,18,7.2957999999999995E-2,7.2957999999999995E-2,2.8400000000000002E-4,2.8400000000000002E-4]
[null,"INA2A","DURACK, INALA","URBAN",1824,4.2969999999999997,6.3310000000000004,3.7343999999999999,null,null,4,6.3850000000000001E-3,6.3850000000000001E-3,1.817E-3,1.817E-3,9,2.2869E-2,2.2869E-2,9.6299999999999996E-5,9.6299999999999996E-5]
[null,"INA3A","DOOLANDELLA, FOREST LAKE, INALA","URBAN",2061,2.2360000000000002,7.976,4.4394,null,null,4,0.22378400000000001,0.22378400000000001,4.4019999999999997E-3,4.4019999999999997E-3,6,8.1370000000000001E-3,5.4730000000000004E-3,1.83E-4,6.1500000000000004E-5]
[null,"INA5A","INALA, RICHLANDS","URBAN",1053,2.27,4.1689999999999996,4.0392999999999999,null,null,5,4.2529999999999998E-3,4.2529999999999998E-3,9.1799999999999998E-4,9.1799999999999998E-4,2,3.6699999999999998E-4,3.6699999999999998E-4,2.9799999999999998E-6,2.9799999999999998E-6]
[null,"INA5B","RICHLANDS","URBAN",82,null,0.83599999999999997,6.0208000000000004,null,null,1,9.6000000000000002E-5,9.6000000000000002E-5,2.8799999999999999E-5,2.8799999999999999E-5]
[null,"INA7A","INALA, OXLEY, RICHLANDS","RURAL",1265,8.0210000000000008,2.036,2.4388000000000001,null,null,5,1.1712E-2,1.1712E-2,3.2399999999999998E-3,3.2399999999999998E-3,21,0.17013800000000001,0.17013800000000001,5.2499999999999997E-4,5.2499999999999997E-4]
[null,"INA9A","DOOLANDELLA, DURACK, INALA","URBAN",1447,5.2309999999999999,4.3760000000000003,4.1345000000000001,null,null,9,1.6666E-2,1.6666E-2,1.524E-3,1.524E-3,9,3.1217999999999999E-2,3.1217999999999999E-2,1.22E-4,1.22E-4]
[null,"INBSEQ1","BRISBANE","CBD",5,null,0.16200000000000001,null,null,null,1,5.4993E-2,5.4993E-2,2.5599999999999999E-4,2.5599999999999999E-4]
[null,"INBTR1H","BRISBANE","CBD",3]
[null,"Invalid Asset Type",null,"URBAN",null,null,null,null,null,null,1,7.5779999999999997E-3,7.5779999999999997E-3,7.1500000000000003E-5,7.1500000000000003E-5,4,2.9843000000000001E-2,2.9843000000000001E-2,1.1E-4,1.1E-4]
[null,"IOC2","BRISBANE","CBD",11,null,0.16900000000000001]
[null,"IOCT1","BRISBANE","CBD",21]
[null,"IPL1","BARNEY VIEW, COOCHIN, INNISPLAIN, MAROON, MT LINDESAY, OAKY CREEK, PALEN CREEK, RATHDOWNEY, RUNNING CREEK, TAMROOKUM CREEK","RURAL",498,161.15899999999999,7.3999999999999996E-2,1.4098999999999999,null,null,21,0.15649199999999999,0.15378600000000001,3.7369999999999999E-3,3.7090000000000001E-3,35,0.197883,0.19551499999999999,6.2299999999999996E-4,6.0800000000000003E-4]
[null,"IPL2A","CHRISTMAS CREEK, INNISPLAIN, JOSEPHVILLE, KNAPP CREEK, KOORALBYN, LARAVALE, TABOOBA, TAMROOKUM, TAMROOKUM CREEK","RURAL",281,101.758,3.2000000000000001E-2,1.3909,null,null,11,9.7734000000000001E-2,9.7734000000000001E-2,1.4660000000000001E-3,1.4660000000000001E-3,11,5.3843000000000002E-2,5.3843000000000002E-2,2.33E-4,2.33E-4]
[null,"IPL3","CANUNGRA, CHINGHEE CREEK, CHRISTMAS CREEK, DARLINGTON, HILLVIEW, LAMINGTON, OAKY CREEK, TABOOBA","RURAL",414,122.76,0.495,1.2956000000000001,null,null,9,4.2886000000000001E-2,4.2886000000000001E-2,1.0690000000000001E-3,1.0690000000000001E-3,27,0.13126699999999999,0.13126699999999999,4.2299999999999998E-4,4.2299999999999998E-4]
[null,"IPL4A","CHINGHEE CREEK, INNISPLAIN, MOUNT GIPPS, RATHDOWNEY, RUNNING CREEK","RURAL",126,50.19,0.13600000000000001,0.49540000000000001,null,null,10,2.7178000000000001E-2,2.5233999999999999E-2,4.9200000000000003E-4,4.5899999999999999E-4,9,1.2583E-2,1.2583E-2,5.8999999999999998E-5,5.8999999999999998E-5]
[null,"IPS12B","CHURCHILL, FLINDERS VIEW, RACEVIEW, YAMANTO","RURAL",199,2.375,0.17299999999999999,0.81930000000000003,null,null,1,0.189913,null,5.0799999999999999E-4,null,1,5.8849999999999996E-3,5.8849999999999996E-3,1.7900000000000001E-5,1.7900000000000001E-5]
[null,"IPS12B","CHURCHILL, FLINDERS VIEW, RACEVIEW, YAMANTO","URBAN",199,2.375,0.17299999999999999,0.81930000000000003,null,null,null,null,null,null,null,3,7.8519999999999996E-3,7.8519999999999996E-3,4.1699999999999997E-5,4.1699999999999997E-5]
[null,"IPS15B","AMBERLEY, CHURCHILL, ONE MILE, YAMANTO","URBAN",1154,11.257999999999999,1.9119999999999999,4.8585000000000003,null,null,14,9.0432999999999999E-2,9.0432999999999999E-2,1.317E-3,1.317E-3,5,2.5235E-2,2.5235E-2,1E-4,1E-4]
[null,"IPS16A","FLINDERS VIEW","URBAN",1226,1.1339999999999999,6.0309999999999997,2.9912999999999998,null,null,2,4.4999999999999999E-4,4.4999999999999999E-4,3.9700000000000001E-6,3.9700000000000001E-6,1,6.4599999999999998E-4,6.4599999999999998E-4,2.9799999999999998E-6,2.9799999999999998E-6]
[null,"IPS1B","AMBERLEY, CHURCHILL, LEICHHARDT, ONE MILE, RACEVIEW, WEST IPSWICH","URBAN",1866,12.042,0.72799999999999998,4.0773999999999999,null,null,12,9.6699999999999998E-4,9.6699999999999998E-4,1.19E-5,1.19E-5,7,1.7665E-2,1.7665E-2,1.2899999999999999E-4,1.2899999999999999E-4]
[null,"IPS2B","FLINDERS VIEW, RACEVIEW, RIPLEY, YAMANTO","RURAL",1506,16.135999999999999,3.9990000000000001,3.6962999999999999,null,null,8,0.40467599999999998,0.382025,3.63E-3,3.607E-3,6,6.4062999999999995E-2,6.4062999999999995E-2,1.7899999999999999E-4,1.7899999999999999E-4]
[null,"IPS5B","EASTERN HEIGHTS, IPSWICH, RACEVIEW","URBAN",2064,8.9290000000000003,2.661,4.8395000000000001,null,null,13,1.1176E-2,1.1176E-2,1.01E-4,1.01E-4,4,2.5539999999999998E-3,2.5539999999999998E-3,2.3799999999999999E-5,2.3799999999999999E-5]
[null,"JBB12B","JIMBOOMBA, SOUTH MACLEAN, STOCKLEIGH","RURAL",668,29.594999999999999,5.7809999999999997,2.2483,null,null,10,1.058961,0.30938599999999999,2.774E-3,1.0660000000000001E-3,5,5.5675000000000002E-2,5.5675000000000002E-2,1.64E-4,1.64E-4]
[null,"JBB13A","JIMBOOMBA, MUNDOOLUN, TAMBORINE","RURAL",1335,42.317,5.7290000000000001,3.601,null,null,23,2.803941,0.282497,6.7650000000000002E-3,3.558E-3,16,0.160692,0.160692,5.9000000000000003E-4,5.9000000000000003E-4]
[null,"JBB16A","JIMBOOMBA, LOGAN VILLAGE, STOCKLEIGH, TAMBORINE, YARRABILBA","RURAL",2344,32.814999999999998,6.202,4.0773999999999999,null,null,28,4.043774,0.67820499999999995,1.0599000000000001E-2,5.8669999999999998E-3,22,0.29444900000000002,0.29444900000000002,7.4799999999999997E-4,7.4799999999999997E-4]
[null,"JBB1B","CEDAR GROVE, CEDAR VALE, JIMBOOMBA, MUNDOOLUN, VERESDALE, VERESDALE SCRUB, WOODHILL","RURAL",1609,48.741,4.5549999999999997,4.649,null,null,24,0.58605300000000005,4.8297E-2,2.2920000000000002E-3,4.46E-4,12,6.3586000000000004E-2,6.3586000000000004E-2,4.7399999999999997E-4,4.7399999999999997E-4]
[null,"JBB2A","CHAMBERS FLAT, JIMBOOMBA, LOGAN VILLAGE, MUNRUBEN, STOCKLEIGH","RURAL",760,42.238999999999997,0.42899999999999999,2.2483,null,null,17,0.33640500000000001,0.266988,1.792E-3,1.6230000000000001E-3,6,2.9458000000000002E-2,2.9458000000000002E-2,1.6699999999999999E-4,1.6699999999999999E-4]
[null,"JBB3A","ALLENVIEW, CEDAR GROVE, JIMBOOMBA, KAGARU, UNDULLAH, WOODHILL","RURAL",984,67.262,4.8520000000000003,3.1246999999999998,null,null,11,0.411111,0.14573800000000001,6.8240000000000002E-3,4.7650000000000001E-3,18,0.10852100000000001,0.10816199999999999,4.1300000000000001E-4,4.0999999999999999E-4]
[null,"JBB4A","JIMBOOMBA","URBAN",524,8.4510000000000005,1.516,3.3151999999999999,null,null,4,1.8550000000000001E-2,1.8550000000000001E-2,5.2499999999999997E-4,5.2499999999999997E-4,3,1.1657000000000001E-2,1.1657000000000001E-2,4.4700000000000002E-5,4.4700000000000002E-5]
[null,"JDL10A","JAMBOREE HEIGHTS, MT OMMANEY","URBAN",201,null,2.423,1.6194999999999999,null,null,1,1.3200000000000001E-4,null,9.9000000000000005E-7]
[null,"JDL13A","JINDALEE, OXLEY, SEVENTEEN MILE ROCKS, SINNAMON PARK","URBAN",464,1.0449999999999999,3.8170000000000002,4.306,null,null,2,2.7669999999999999E-3,2.7669999999999999E-3,2.7800000000000001E-5,2.7800000000000001E-5,2,2.934E-3,2.934E-3,6.1500000000000004E-5,6.1500000000000004E-5]
[null,"JDL2A","JINDALEE, MT OMMANEY","URBAN",859,3.5150000000000001,2.63,2.4388000000000001,null,null,2,1.3827000000000001E-2,1.3827000000000001E-2,9.6299999999999996E-5,9.6299999999999996E-5,3,1.0436000000000001E-2,1.0436000000000001E-2,4.3699999999999998E-5,4.3699999999999998E-5]
[null,"JDL5A","JINDALEE","URBAN",480,3.3140000000000001,0.11,3.5438999999999998,null,null,2,1.098E-3,1.098E-3,6.7500000000000001E-5,6.7500000000000001E-5,7,1.0198E-2,1.0198E-2,4.1699999999999997E-5,4.1699999999999997E-5]
[null,"JDL6OLD",null,"URBAN",null,null,null,null,null,null,null,null,null,null,null,1,1.2359999999999999E-3,1.2359999999999999E-3,4.9599999999999999E-6,4.9599999999999999E-6]
[null,"JDL7A","JINDALEE, MT OMMANEY, WESTLAKE","URBAN",940,null,5.8339999999999996,2.7054999999999998,null,null,9,7.8220000000000008E-3,7.8220000000000008E-3,6.4499999999999996E-5,6.4499999999999996E-5,2,1.7825000000000001E-2,1.7825000000000001E-2,1.21E-4,1.21E-4]
[null,"JDL9A","JINDALEE, KENMORE","URBAN",309,1.762,1.01,0.89549999999999996,null,null,4,7.1649000000000004E-2,7.1649000000000004E-2,6.1499999999999999E-4,6.1499999999999999E-4,2,4.1079999999999997E-3,4.1079999999999997E-3,3.2799999999999998E-5,3.2799999999999998E-5]
[null,"JHCT0","CAROLE PARK","URBAN",1]
[null,"JHDMDH11","PINKENBA","URBAN",29,1.3680000000000001,0.93600000000000005,2.2101999999999999,null,null,1,3.8699999999999997E-4,null,9.9299999999999998E-6,null,2,1.585E-3,1.585E-3,4.9599999999999999E-6,4.9599999999999999E-6]
[null,"JHDMDH7","PINKENBA","URBAN",6,1.1619999999999999,1.4350000000000001,2.6103000000000001]
[null,"JNST2","BRISBANE","CBD",1,null,null,null,null,null,null,null,null,null,null,1,1.3047E-2,1.3047E-2,2.5599999999999999E-4,2.5599999999999999E-4]
[null,"KBN13A","BRASSALL, KARRABIN, WULKURAKA","RURAL",974,12.105,1.2749999999999999,3.0674999999999999,null,null,10,0.37935000000000002,0.37935000000000002,4.9699999999999996E-3,4.9699999999999996E-3,4,3.0169999999999999E-2,3.0169999999999999E-2,1.6699999999999999E-4,1.6699999999999999E-4]
[null,"KBN15A","KARRABIN, LEICHHARDT, WULKURAKA","URBAN",94,5.3680000000000003,1.1160000000000001,5.2205000000000004,null,null,1,2.22E-4,2.22E-4,7.9400000000000002E-6,7.9400000000000002E-6,4,3.307E-3,3.307E-3,1.29E-5,1.29E-5]
[null,"KBN1B","BLACKSOIL, BRASSALL, KARRABIN, MUIRLEA","RURAL",1751,13.568,7.5659999999999998,4.7633000000000001,null,null,10,0.28463100000000002,0.28463100000000002,4.463E-3,4.463E-3,12,5.9591999999999999E-2,5.9591999999999999E-2,2.9999999999999997E-4,2.9999999999999997E-4]
[null,"KBN2A","KARRABIN, ROSEWOOD, THAGOONA, WALLOON","RURAL",765,24.646999999999998,1.3080000000000001,2.6674000000000002,null,null,12,9.8639999999999995E-3,9.8639999999999995E-3,1E-4,1E-4,28,0.46300799999999998,0.46300799999999998,1.505E-3,1.505E-3]
[null,"KBN3A","KARRABIN","URBAN",1,0.42299999999999999,0.26300000000000001,4.1917]
[null,"KBN5A","BLACKSOIL, BORALLON, FAIRNEY VIEW, HAIGSLEA, IRONBARK, KARRABIN, PINE MOUNTAIN, THAGOONA, WALLOON, WANORA","RURAL",1014,102.557,2.887,2.9531999999999998,null,null,29,2.8782960000000002,0.66318699999999997,1.3117E-2,4.0860000000000002E-3,19,0.19181100000000001,0.19181100000000001,6.5099999999999999E-4,6.5099999999999999E-4]
[null,"KBR1A","ARATULA, CHARLWOOD, CLUMBER, FASSIFERN VALLEY, FRAZERVIEW, KALBAR, MOOGERAH, MORWINCHA, MT ALFORD, MT EDWARDS, TAROME, TEMPLIN","RURAL",581,115.107,0.89200000000000002,1.6005,null,null,23,0.94406599999999996,0.55154899999999996,5.4780000000000002E-3,3.6679999999999998E-3,22,0.139124,0.139124,5.0799999999999999E-4,5.0799999999999999E-4]
[null,"KBR2A","ARATULA, BOONAH, CHARLWOOD, FRAZERVIEW, KALBAR, MORWINCHA, MOUNT WALKER, TAROME","RURAL",375,74.710999999999999,0.10199999999999999,1.9244000000000001,null,null,4,0.13555800000000001,2.5300000000000002E-4,9.9200000000000004E-4,2.5600000000000001E-6,21,0.13994599999999999,0.13994599999999999,4.26E-4,4.26E-4]
[null,"KBR3A","ARATULA, FASSIFERN, FRAZERVIEW, KALBAR, ROSEVALE, SILVERDALE","RURAL",391,51.298000000000002,0.63400000000000001,2.0387,null,null,6,0.14096900000000001,1.1745E-2,1.059E-3,9.7399999999999996E-5,10,3.9233999999999998E-2,2.3328999999999999E-2,1.2799999999999999E-4,8.7200000000000005E-5]
[null,"KBR5A","COULSON, HOYA, KALBAR, KULGUN, OBUM OBUM, ROADVALE, TEVIOTVILLE, WYARALONG","RURAL",219,50.209000000000003,0.17,0.45729999999999998,null,null,5,0.16071099999999999,8.7699999999999996E-4,1.1230000000000001E-3,1.03E-5,14,0.18023700000000001,0.18023700000000001,5.13E-4,5.13E-4]
[null,"KBR6A","ANTHONY, BLANTYRE, KALBAR, KENTS LAGOON, MILORA, MUNBILLA, OBUM OBUM, ROADVALE, SILVERDALE","RURAL",374,78.569999999999993,0.14599999999999999,1.1432,null,null,15,0.25023400000000001,0.121907,1.5070000000000001E-3,5.5400000000000002E-4,28,0.16014800000000001,0.16014800000000001,5.3300000000000005E-4,5.3300000000000005E-4]
[null,"KCY1","KILCOY, WINYA","RURAL",644,7.468,4.2000000000000003E-2,1.9815]
[null,"KCY1","KILCOY, WINYA","URBAN",null,7.468,4.2000000000000003E-2,1.9815,null,null,3,6.0499999999999996E-4,6.0499999999999996E-4,2.9799999999999998E-6,2.9799999999999998E-6,5,1.2496999999999999E-2,1.2496999999999999E-2,6.4499999999999996E-5,6.4499999999999996E-5]
[null,"KCY2","JIMNA, KILCOY, MOUNT KILCOY, SANDY CREEK, SHEEP STATION CREEK, WINYA","RURAL",347,114.839,null,0.83830000000000005,null,null,18,4.4056999999999999E-2,4.4056999999999999E-2,1.3300000000000001E-4,1.3300000000000001E-4,12,0.155612,0.155612,5.5099999999999995E-4,5.5099999999999995E-4]
[null,"KCY3","KILCOY, WINYA","URBAN",5,0.86699999999999999,0.25700000000000001,4.4203000000000001,null,null,null,null,null,null,null,1,1.2520000000000001E-3,1.2520000000000001E-3,2.9799999999999998E-6,2.9799999999999998E-6]
[null,"KCY4","KILCOY, MOUNT ARCHER, MT DELANEY, NEURUM, ROYSTON, SANDY CREEK, STONY CREEK, VILLENEUVE, WINYA, WOODFORD","RURAL",722,115.011,2.2309999999999999,1.5052000000000001,null,null,15,8.3024000000000001E-2,8.2624000000000003E-2,1.9380000000000001E-3,1.9350000000000001E-3,14,9.844E-2,9.844E-2,4.4900000000000002E-4,4.4900000000000002E-4]
[null,"KCY5","GREGORS CREEK, HARLIN, HAZELDEAN, KILCOY, WINYA, WOOLMAR","RURAL",573,54.884,1.39,1.6957,null,null,6,0.14819299999999999,0.14819299999999999,7.2499999999999995E-4,7.2499999999999995E-4,14,0.14208799999999999,0.14208799999999999,5.2300000000000003E-4,5.2300000000000003E-4]
[null,"KGST1","BRISBANE","CBD",1]
[null,"KKMPRL1","BRISBANE","CBD",81,null,0.58299999999999996]
[null,"KKMT1","BRISBANE","CBD",1]
[null,"KLG10A","GRIFFIN, MURRUMBA DOWNS","URBAN",2367,5.2009999999999996,11.942,5.7920999999999996,null,null,6,0.226799,0.226799,2.379E-3,2.379E-3,5,3.5260000000000001E-3,3.5260000000000001E-3,1.7799999999999999E-4,1.7799999999999999E-4]
[null,"KLG11A","KALLANGUR","URBAN",1813,8.2970000000000006,1.591,4.1154999999999999,null,null,8,7.3369999999999998E-3,7.2139999999999999E-3,6.9499999999999995E-5,6.8499999999999998E-5,5,2.5173000000000001E-2,2.5173000000000001E-2,8.5400000000000002E-5,8.5400000000000002E-5]
[null,"KLG13A","KALLANGUR, PETRIE","URBAN",1526,8.6159999999999997,1.8089999999999999,4.1345000000000001,null,null,15,3.9946000000000002E-2,3.9946000000000002E-2,3.7599999999999998E-4,3.7599999999999998E-4,7,5.9866000000000003E-2,5.9866000000000003E-2,2.3900000000000001E-4,2.3900000000000001E-4]
[null,"KLG14A","KALLANGUR, MURRUMBA DOWNS, PETRIE","URBAN",985,6.3739999999999997,5.6120000000000001,4.2488000000000001,null,null,3,0.13053699999999999,0.13053699999999999,1.755E-3,1.755E-3,5,6.4310000000000001E-3,6.4310000000000001E-3,2.9799999999999999E-5,2.9799999999999999E-5]
[null,"KLG16A","KALLANGUR","RURAL",2138,7.3330000000000002,3.8050000000000002,4.8966000000000003,null,null,4,0.36557299999999998,0.36557299999999998,5.496E-3,5.496E-3]
[null,"KLG16A","KALLANGUR","URBAN",2138,7.3330000000000002,3.8050000000000002,4.8966000000000003,null,null,6,1.1025999999999999E-2,2.346E-3,8.2399999999999997E-5,2.1800000000000001E-5,6,2.4801E-2,2.4801E-2,1.3899999999999999E-4,1.3899999999999999E-4]
[null,"KLG17A","KALLANGUR, MURRUMBA DOWNS","URBAN",594,1.6659999999999999,1.1020000000000001,2.6865000000000001,null,null,1,5.1500000000000001E-3,5.1500000000000001E-3,5.8600000000000004E-4,5.8600000000000004E-4,1,1.5100000000000001E-4,1.5100000000000001E-4,9.9000000000000005E-7,9.9000000000000005E-7]
[null,"KLG4A","KALLANGUR, PETRIE","RURAL",772,5.9,null,1.9244000000000001,null,null,5,0.183616,0.183616,2.8860000000000001E-3,2.8860000000000001E-3,6,6.5567E-2,6.5567E-2,3.0800000000000001E-4,3.0800000000000001E-4]
[null,"KLG5A","KALLANGUR, KURWONGBAH, PETRIE","RURAL",1373,12.493,2.5030000000000001,3.3342999999999998,null,null,6,1.71105,0.66512499999999997,1.0579E-2,7.0590000000000002E-3,7,4.5955000000000003E-2,4.5955000000000003E-2,2.4899999999999998E-4,2.4899999999999998E-4]
[null,"KLG7A","GRIFFIN, KALLANGUR, MURRUMBA DOWNS","URBAN",1914,6.7069999999999999,5.82,5.3349000000000002,null,null,13,6.8782999999999997E-2,6.7686999999999997E-2,4.2099999999999999E-4,4.17E-4,4,1.6011000000000001E-2,1.6011000000000001E-2,6.2500000000000001E-5,6.2500000000000001E-5]
[null,"KMR17A","CHAPEL HILL, KENMORE","URBAN",591,3.508,0.64100000000000001,3.9630000000000001,null,null,5,4.9390000000000003E-2,4.9390000000000003E-2,6.5300000000000004E-4,6.5300000000000004E-4,7,2.3781E-2,2.3781E-2,7.9400000000000006E-5,7.9400000000000006E-5]
[null,"KMR17B","CHAPEL HILL, KENMORE","URBAN",1834,10.371,4.1230000000000002,4.9919000000000002,null,null,20,0.33802599999999999,0.170016,5.7120000000000001E-3,3.9509999999999997E-3,19,7.2633000000000003E-2,7.2633000000000003E-2,2.9999999999999997E-4,2.9999999999999997E-4]
[null,"KMR18A","KENMORE, KENMORE HILLS","RURAL",430,2.4830000000000001,2.61,1.4861]
[null,"KMR18A","KENMORE, KENMORE HILLS","URBAN",null,2.4830000000000001,2.61,1.4861,null,null,null,null,null,null,null,2,1.0280000000000001E-3,1.0280000000000001E-3,7.9400000000000002E-6,7.9400000000000002E-6]
[null,"KMR19A","BROOKFIELD, KENMORE, PINJARRA HILLS, PULLENVALE","RURAL",710,8.2159999999999993,1.177,2.2673000000000001]
[null,"KMR19A","BROOKFIELD, KENMORE, PINJARRA HILLS, PULLENVALE","URBAN",null,8.2159999999999993,1.177,2.2673000000000001,null,null,7,3.8453000000000001E-2,3.8453000000000001E-2,7.0899999999999999E-4,7.0899999999999999E-4,12,7.9339999999999994E-2,7.9339999999999994E-2,1.9000000000000001E-4,1.9000000000000001E-4]
[null,"KMR21A","CHAPEL HILL, KENMORE HILLS","URBAN",1056,1.792,5.9370000000000003,3.22,null,null,5,0.31257099999999999,0.137017,2.1150000000000001E-3,1.0740000000000001E-3,1,5.2570000000000004E-3,5.2570000000000004E-3,1.59E-5,1.59E-5]
[null,"KMR21B","KENMORE","URBAN",39,null,0.874,0.81930000000000003,null,null,3,9.8139999999999998E-3,3.287E-3,7.8399999999999995E-5,3.9700000000000003E-5]
[null,"KMR22A","FIG TREE POCKET, KENMORE","URBAN",855,6.6890000000000001,2.71,2.9342000000000001,null,null,6,5.8019999999999999E-3,5.7270000000000003E-3,3.0800000000000003E-5,2.9799999999999999E-5,10,2.9083000000000001E-2,2.8451000000000001E-2,1.05E-4,1.03E-4]
[null,"KMR24A","KENMORE","URBAN",771,4.4560000000000004,0.48399999999999999,1.9434,null,null,13,3.2119000000000002E-2,3.2119000000000002E-2,2.6600000000000001E-4,2.6600000000000001E-4,10,3.3431000000000002E-2,3.3431000000000002E-2,1.4799999999999999E-4,1.4799999999999999E-4]
[null,"KMR25A","BROOKFIELD, KENMORE HILLS, MT COOTTHA, PULLENVALE, UPPER BROOKFIELD","RURAL",1090,48.247999999999998,5.5759999999999996,4.3441000000000001,null,null,28,0.56959499999999996,0.56959499999999996,2.5609999999999999E-3,2.5609999999999999E-3,27,0.25717699999999999,0.243981,8.3299999999999997E-4,8.0199999999999998E-4]
[null,"KMR27A","BROOKFIELD, KENMORE","URBAN",949,7.0220000000000002,4.2370000000000001,3.5629,null,null,3,3.6499999999999998E-4,3.6499999999999998E-4,2.9799999999999998E-6,2.9799999999999998E-6,2,3.2820000000000002E-3,3.2820000000000002E-3,1.49E-5,1.49E-5]
[null,"KMR28A","CHAPEL HILL, KENMORE HILLS","URBAN",592,1.1719999999999999,4.4569999999999999,1.7528999999999999,null,null,3,7.4131000000000002E-2,7.4131000000000002E-2,1.1689999999999999E-3,1.1689999999999999E-3,1,4.163E-3,4.163E-3,1.7900000000000001E-5,1.7900000000000001E-5]
[null,"KMR29A","KENMORE","URBAN",805,3.8050000000000002,2.91,2.0958000000000001,null,null,3,4.6760000000000003E-2,4.6760000000000003E-2,7.9500000000000003E-4,7.9500000000000003E-4,5,7.7229999999999998E-3,7.7229999999999998E-3,3.57E-5,3.57E-5]
[null,"KMS3","SUNNYBANK","URBAN",1]
[null,"KRA1","COOLANGATTA","URBAN",620,1.7430000000000001,0.33300000000000002,2.3435000000000001,null,null,6,2.8681999999999999E-2,2.8681999999999999E-2,8.3600000000000005E-4,8.3600000000000005E-4]
[null,"KRA10","BILINGA, COOLANGATTA","URBAN",1164,3.234,0.95799999999999996,1.8672,null,null,4,2.836E-3,2.836E-3,1.1590000000000001E-3,1.1590000000000001E-3,2,1.9723000000000001E-2,1.9723000000000001E-2,1.34E-4,1.34E-4]
[null,"KRA2","COOLANGATTA","URBAN",835,1.9219999999999999,1.6479999999999999,3.9821,null,null,1,1.8829999999999999E-3,1.8829999999999999E-3,8.25E-4,8.25E-4]
[null,"KRA3","BILINGA, TUGUN","URBAN",1301,3.2109999999999999,2.5630000000000002,2.0387,null,null,12,4.0029999999999996E-3,4.0029999999999996E-3,1.307E-3,1.307E-3,22,8.9459999999999998E-2,8.9459999999999998E-2,2.9999999999999997E-4,2.9999999999999997E-4]
[null,"KRA4","COOLANGATTA","URBAN",283,1.6E-2,3.5419999999999998,2.0958000000000001,null,null,1,6.3900000000000003E-4,6.3900000000000003E-4,2.7999999999999998E-4,2.7999999999999998E-4,2,2.519E-3,2.519E-3,1.59E-5,1.59E-5]
[null,"KRA7","COOLANGATTA","URBAN",1249,3.855,0.77800000000000002,3.0485000000000002,null,null,5,0.14116799999999999,0.14116799999999999,1.8860000000000001E-3,1.8860000000000001E-3,4,4.5685000000000003E-2,4.5685000000000003E-2,1.0900000000000001E-4,1.0900000000000001E-4]
[null,"KRN1","GORDON PARK, KEDRON, STAFFORD","URBAN",2272,3.097,3.9710000000000001,4.2679,null,null,3,1.5113E-2,1.5113E-2,2.32E-3,2.32E-3,14,0.16311400000000001,0.16311400000000001,5.2099999999999998E-4,5.2099999999999998E-4]
[null,"KRN10","KEDRON, STAFFORD, STAFFORD HEIGHTS","URBAN",1567,5.72,0.81699999999999995,2.9531999999999998,null,null,15,0.39903100000000002,0.39903100000000002,5.1260000000000003E-3,5.1260000000000003E-3,6,3.5628E-2,3.5628E-2,1.63E-4,1.63E-4]
[null,"KRN11","CLAYFIELD, LUTWYCHE, WAVELL HEIGHTS, WOOLOOWIN","URBAN",1337,5.7560000000000002,1.403,3.6391,null,null,8,1.1218000000000001E-2,1.1218000000000001E-2,1.333E-3,1.333E-3,17,8.6277999999999994E-2,8.6277999999999994E-2,3.7100000000000002E-4,3.7100000000000002E-4]
[null,"KRN12","GORDON PARK, LUTWYCHE, WOOLOOWIN","URBAN",1944,2.63,2.1840000000000002,2.4197000000000002,null,null,22,0.66284799999999999,0.66284799999999999,9.2630000000000004E-3,9.2630000000000004E-3,10,0.13630600000000001,0.13630600000000001,4.6099999999999998E-4,4.6099999999999998E-4]
[null,"KRN13B","GORDON PARK, LUTWYCHE, WINDSOR","URBAN",91,null,3.0379999999999998,null,null,null,1,6.6000000000000005E-5,6.6000000000000005E-5,9.9000000000000005E-7,9.9000000000000005E-7]
[null,"KRN18",null,"URBAN",null,4.6239999999999997,0.22800000000000001,2.8008000000000002,null,null,7,0.10007000000000001,0.10007000000000001,1.4859999999999999E-3,1.4859999999999999E-3,27,0.107903,0.107903,5.2099999999999998E-4,5.2099999999999998E-4]
[null,"KRN18A","GORDON PARK, GRANGE, LUTWYCHE, WINDSOR","URBAN",1377,null,null,null,null,null,1,9.5000000000000005E-5,9.5000000000000005E-5,9.9000000000000005E-7,9.9000000000000005E-7]
[null,"KRN2","KEDRON, WAVELL HEIGHTS","URBAN",2074,6.6580000000000004,1.232,4.0583,null,null,8,0.29992999999999997,0.29992999999999997,3.46E-3,3.46E-3,18,9.2355999999999994E-2,9.0776999999999997E-2,3.1199999999999999E-4,3.0699999999999998E-4]
[null,"KRN5A","KEDRON","URBAN",804,4.2919999999999998,2.0609999999999999,3.601,null,null,6,6.5853999999999996E-2,6.5853999999999996E-2,2.715E-3,2.715E-3,6,1.8466E-2,1.8466E-2,8.9300000000000002E-5,8.9300000000000002E-5]
[null,"KRN5B","STAFFORD","URBAN",333,0.91800000000000004,3.585,1.9053,null,null,4,4.2888000000000003E-2,4.2888000000000003E-2,8.2899999999999998E-4,8.2899999999999998E-4]
[null,"KRN6A","LUTWYCHE","URBAN",34,null,1.786,null,null,null,2,6.1729999999999997E-3,6.1729999999999997E-3,1.21E-4,1.21E-4]
[null,"KRNQNP7","BOWEN HILLS, LUTWYCHE, WINDSOR","URBAN",945,0.14599999999999999,6.4390000000000001,4.7442000000000002,null,null,5,9.4766000000000003E-2,9.4766000000000003E-2,8.3199999999999995E-4,8.3199999999999995E-4,6,3.0044000000000001E-2,3.0044000000000001E-2,1.46E-4,1.46E-4]
[null,"KSN1","CHAMBERS FLAT, CRESTMEAD, MARSDEN, WATERFORD WEST","URBAN",1641,10.638,0.61599999999999999,4.2298,null,null,20,2.6211999999999999E-2,2.6211999999999999E-2,1.322E-3,1.322E-3,12,7.2641999999999998E-2,7.2641999999999998E-2,3.3300000000000002E-4,3.3300000000000002E-4]
[null,"KSN14","MARSDEN","URBAN",1091,5.1310000000000002,1.117,3.1057000000000001,null,null,9,0.122696,0.122696,1.366E-3,1.366E-3,5,2.1406000000000001E-2,2.1406000000000001E-2,8.3399999999999994E-5,8.3399999999999994E-5]
[null,"KSN15","LOGANLEA, MEADOWBROOK, WATERFORD WEST","RURAL",1047,7.55,1.4179999999999999,2.3816000000000002,null,null,7,1.6733999999999999E-2,1.6733999999999999E-2,2.9999999999999997E-4,2.9999999999999997E-4,5,5.6014000000000001E-2,5.6014000000000001E-2,2.9E-4,2.9E-4]
[null,"KSN2A","LOGAN RESERVE, WATERFORD WEST","URBAN",1053,3.6930000000000001,1.617,2.1339000000000001,null,null,8,7.7899999999999996E-4,7.7899999999999996E-4,7.9400000000000002E-6,7.9400000000000002E-6,8,4.6362E-2,4.6362E-2,2.4899999999999998E-4,2.4899999999999998E-4]
[null,"KSN3","KINGSTON, LOGANLEA","URBAN",624,8.8119999999999994,1.94,3.9058999999999999,null,null,15,4.0459000000000002E-2,4.0459000000000002E-2,1.4999999999999999E-4,1.4999999999999999E-4,4,2.0470000000000002E-3,2.0470000000000002E-3,1.49E-5,1.49E-5]
[null,"KSN4","LOGANLEA","URBAN",1056,3.6640000000000001,0.96499999999999997,2.0005999999999999,null,null,7,3.0490000000000001E-3,3.0490000000000001E-3,3.3699999999999999E-5,3.3699999999999999E-5,1,3.1E-4,3.1E-4,1.99E-6,1.99E-6]
[null,"KSN5","MARSDEN","RURAL",1911,11.629,0.96799999999999997,3.7534999999999998,null,null,15,0.73297800000000002,0.73297800000000002,5.0549999999999996E-3,5.0549999999999996E-3,4,5.1766E-2,5.1766E-2,2.0799999999999999E-4,2.0799999999999999E-4]
[null,"KSN6","BRIDGEMAN DOWNS, KINGSTON, LOGANLEA","URBAN",867,6.8719999999999999,2.351,4.6680000000000001,null,null,13,0.19789799999999999,0.19789799999999999,1.142E-3,1.142E-3,7,2.9950999999999998E-2,2.9950999999999998E-2,1.15E-4,1.15E-4]
[null,"KSN7","LOGAN RESERVE, WATERFORD, WATERFORD WEST","RURAL",1769,18.626999999999999,2.2770000000000001,4.3250999999999999,null,null,13,8.1600000000000006E-2,8.1600000000000006E-2,4.3300000000000001E-4,4.3300000000000001E-4,16,9.1277999999999998E-2,9.1277999999999998E-2,4.4099999999999999E-4,4.4099999999999999E-4]
[null,"KSN8","CHAMBERS FLAT, CRESTMEAD, LOGAN RESERVE, MARSDEN, PARK RIDGE, WATERFORD WEST","RURAL",1662,23.986999999999998,3.3929999999999998,4.0392999999999999,null,null,19,2.44129,0.21778400000000001,8.1510000000000003E-3,4.1469999999999996E-3,25,0.170541,0.170541,6.8400000000000004E-4,6.8400000000000004E-4]
[null,"KTETR1","FORTITUDE VALLEY","URBAN",32]
[null,"KVG10A","KELVIN GROVE, RED HILL","URBAN",2,null,0.1,0.40010000000000001]
[null,"KVG10B","KELVIN GROVE","URBAN",90,0.56799999999999995,0.51800000000000002,0.64780000000000004]
[null,"KVG11A","KELVIN GROVE","URBAN",260,null,1.127,1.5432999999999999]
[null,"KVG1A","KELVIN GROVE","URBAN",13,null,0.58599999999999997,0.68589999999999995]
[null,"KVG2A","PADDINGTON, RED HILL","URBAN",675,1.627,0.75,1.5242,null,null,2,1.1E-4,1.1E-4,1.99E-6,1.99E-6,7,4.8915E-2,4.8915E-2,1.7000000000000001E-4,1.7000000000000001E-4]
[null,"KVG31A","KELVIN GROVE","URBAN",3,null,0.33,1.5624,null,null,null,null,null,null,null,1,8.0000000000000007E-5,8.0000000000000007E-5,2.9799999999999998E-6,2.9799999999999998E-6]
[null,"KVG32A","KELVIN GROVE, NEWMARKET, RED HILL","URBAN",1358,2.7589999999999999,0.16,2.0768,null,null,7,9.5699999999999995E-4,9.5699999999999995E-4,4.1699999999999997E-5,4.1699999999999997E-5,10,2.5999999999999999E-2,2.5999999999999999E-2,1.3899999999999999E-4,1.3899999999999999E-4]
[null,"KVG33A","KELVIN GROVE","URBAN",1,null,1.6020000000000001,1.4098999999999999,null,null,null,null,null,null,null,1,2.4000000000000001E-5,2.4000000000000001E-5,9.9000000000000005E-7,9.9000000000000005E-7]
[null,"KVG39A","KELVIN GROVE","URBAN",106,null,1.125,1.1241000000000001,null,null,null,null,null,null,null,1,6.2000000000000003E-5,6.2000000000000003E-5,9.9000000000000005E-7,9.9000000000000005E-7]
[null,"KVG3A","KELVIN GROVE","URBAN",68,null,0.57699999999999996,1.1813]
[null,"KVG40A","PADDINGTON, RED HILL","URBAN",1894,3.9620000000000002,2.4780000000000002,3.8487,null,null,9,3.2405000000000003E-2,3.2405000000000003E-2,1.026E-3,1.026E-3,15,4.3268000000000001E-2,4.3268000000000001E-2,1.94E-4,1.94E-4]
[null,"KVG41A","KELVIN GROVE","URBAN",1,null,1.5860000000000001,1.6194999999999999]
[null,"KVG9A","KELVIN GROVE","URBAN",1186,2.4359999999999999,2.024,2.1720999999999999,null,null,8,9.4870000000000006E-3,9.4870000000000006E-3,6.5399999999999996E-4,6.5399999999999996E-4,13,8.7229000000000001E-2,8.7072999999999998E-2,3.8900000000000002E-4,3.88E-4]
[null,"KWA10A","BIRTINYA, BOKARINA, WARANA","URBAN",569,2.7269999999999999,5.4989999999999997,4.8585000000000003,null,null,1,1.22E-4,1.22E-4,9.9000000000000005E-7,9.9000000000000005E-7,1,5.0215000000000003E-2,5.0215000000000003E-2,9.8300000000000004E-5,9.8300000000000004E-5]
[null,"KWA11A","BIRTINYA, BOKARINA","URBAN",372,null,6.3330000000000002,5.1062000000000003,null,null,null,null,null,null,null,1,5.7200000000000003E-4,5.7200000000000003E-4,3.9700000000000001E-6,3.9700000000000001E-6]
[null,"KWA12A","BUDDINA, WARANA","URBAN",2294,9.8859999999999992,0.98399999999999999,4.3250999999999999,null,null,37,0.57112600000000002,0.57112600000000002,7.5139999999999998E-3,7.5139999999999998E-3,24,0.72598099999999999,0.72598099999999999,2.3839999999999998E-3,2.3839999999999998E-3]
[null,"KWA13A","BUDDINA","URBAN",4,null,3.05,4.0011999999999999,null,null,1,4.8999999999999998E-5,4.8999999999999998E-5,9.9000000000000005E-7,9.9000000000000005E-7,2,1.63E-4,1.63E-4,1.99E-6,1.99E-6]
[null,"KWA1A","BUDDINA, MINYAMA, PARREARRA, WARANA","URBAN",1501,5.6959999999999997,3.7519999999999998,4.5156000000000001,null,null,29,0.65732999999999997,0.65719499999999997,4.6350000000000002E-3,4.6350000000000002E-3,7,0.121683,0.121683,3.9199999999999999E-4,3.9199999999999999E-4]
[null,"KWA2A","BOKARINA, WARANA, WURTULLA","URBAN",819,5.2249999999999996,0.71299999999999997,2.1149,null,null,18,0.31638699999999997,0.31638699999999997,9.8700000000000003E-4,9.8700000000000003E-4,4,5.2086E-2,5.2086E-2,1.8799999999999999E-4,1.8799999999999999E-4]
[null,"KWA3A","BUDDINA, MINYAMA","URBAN",669,4.258,2.9089999999999998,2.2483,null,null,3,3.8299999999999999E-4,3.8299999999999999E-4,2.9799999999999998E-6,2.9799999999999998E-6]
[null,"KWA4A","PARREARRA, WARANA","URBAN",1968,null,6.2569999999999997,4.3822000000000001,null,null,3,2.4899999999999998E-4,2.4899999999999998E-4,2.9799999999999998E-6,2.9799999999999998E-6,4,2.0136999999999999E-2,2.0136999999999999E-2,2.32E-4,2.32E-4]
[null,"KWA6A","BOKARINA, WARANA","URBAN",332,2.5339999999999998,1.954,1.6957,null,null,4,2.1779999999999998E-3,2.1779999999999998E-3,8.9299999999999992E-6,8.9299999999999992E-6,1,1.4899999999999999E-4,1.4899999999999999E-4,2.9799999999999998E-6,2.9799999999999998E-6]
[null,"KWH1","COOLABINE, KENILWORTH, KIDAMAN CREEK, MAPLETON, OBI OBI","RURAL",542,64.268000000000001,0.41299999999999998,1.1621999999999999,null,null,10,0.360211,0.360211,3.8549999999999999E-3,3.8549999999999999E-3,10,0.28614400000000001,0.23046900000000001,6.7199999999999996E-4,5.1800000000000001E-4]
[null,"KWH2","CAMBROON, CONONDALE, CURRAMORE, KENILWORTH","RURAL",789,110.048,0.159,1.6194999999999999,null,null,19,0.88461400000000001,0.17124900000000001,9.1839999999999995E-3,6.365E-3,7,0.144811,0.144811,5.6599999999999999E-4,5.6599999999999999E-4]
[null,"KWH3","BELLI PARK, BROOLOO, COOLABINE, GHEERULLA, KENILWORTH, MOY POCKET","RURAL",367,78.343999999999994,0.27800000000000002,2.1339000000000001,null,null,18,0.287242,0.287242,3.7829999999999999E-3,3.7829999999999999E-3,20,0.197767,0.197767,8.5599999999999999E-4,8.5599999999999999E-4]
[null,"LAWT1","BRISBANE","CBD",1]
[null,"LAWTKS5","BRISBANE","CBD",64,null,0.32]
[null,"LBCTR1H","SPRING HILL","URBAN",106,null,null,null,null,null,1,3.3199999999999999E-4,3.3199999999999999E-4,1.07E-4,1.07E-4]
[null,"LBCVPK5","FORTITUDE VALLEY, SPRING HILL","URBAN",126,null,1.903,1.8672]
[null,"LBCVPK5OLD",null,"URBAN",null,null,null,null,null,null,2,5.3700000000000004E-4,5.3700000000000004E-4,1.3200000000000001E-4,1.3200000000000001E-4]
[null,"LBH1B","BALD KNOB, LANDSBOROUGH, MALENY, MOUNT MELLUM","RURAL",1035,33.030999999999999,0.82099999999999995,2.0196000000000001,null,null,23,1.894296,1.628735,7.6620000000000004E-3,6.8180000000000003E-3,21,0.20945,0.20945,9.59E-4,9.59E-4]
[null,"LBH3A","GLENVIEW, LANDSBOROUGH, MOOLOOLAH VALLEY","RURAL",785,20.901,0.89600000000000002,2.0196000000000001,null,null,13,8.1425999999999998E-2,8.1425999999999998E-2,1.059E-3,1.059E-3,12,0.231351,0.231351,8.3100000000000003E-4,8.3100000000000003E-4]
[null,"LBH5A","BELLS CREEK, GLENVIEW, LANDSBOROUGH, MERIDAN PLAINS, MOOLOOLAH VALLEY, PALMVIEW","RURAL",844,42.915999999999997,7.8310000000000004,2.9342000000000001,null,null,15,0.60794099999999995,0.60794099999999995,6.5830000000000003E-3,6.5830000000000003E-3,25,0.22244,0.22244,1.1559999999999999E-3,1.1559999999999999E-3]
[null,"LBH6A","BEERWAH, LANDSBOROUGH","RURAL",1487,29.456,2.9990000000000001,4.1726000000000001,null,null,21,0.33096300000000001,0.33096300000000001,4.5580000000000004E-3,4.5580000000000004E-3,9,0.131186,0.131186,5.8399999999999999E-4,5.8399999999999999E-4]
[null,"LBS10A","HEMMANT","URBAN",33,0.95299999999999996,1.7,2.7054999999999998,null,null,3,5.0799999999999999E-4,5.0799999999999999E-4,2.9799999999999998E-6,2.9799999999999998E-6,4,9.0860000000000003E-3,9.0860000000000003E-3,2.6800000000000001E-5,2.6800000000000001E-5]
[null,"LBS12A","HEMMANT","RURAL",50,1.861,3.9710000000000001,1.2575000000000001]
[null,"LBS12A","HEMMANT","URBAN",null,1.861,3.9710000000000001,1.2575000000000001,null,null,1,5.9100000000000005E-4,5.9100000000000005E-4,6.9500000000000004E-6,6.9500000000000004E-6]
[null,"LBS13A","LYTTON","URBAN",40,null,2.5470000000000002,3.4104999999999999,null,null,null,null,null,null,null,2,1.8699999999999999E-4,1.8699999999999999E-4,2.9799999999999998E-6,2.9799999999999998E-6]
[null,"LBS2A","HEMMANT, LYTTON","URBAN",41,0.373,3.5539999999999998,2.3245,null,null,1,3.8969999999999999E-3,3.8969999999999999E-3,4.07E-5,4.07E-5,1,1.2780000000000001E-3,1.2780000000000001E-3,3.9700000000000001E-6,3.9700000000000001E-6]
[null,"LBS4A","LYTTON","URBAN",40,null,5.3920000000000003,2.4578000000000002,null,null,1,5.7499999999999999E-4,5.7499999999999999E-4,5.9599999999999997E-6,5.9599999999999997E-6]
[null,"LBS5A","LYTTON, PORT OF BRISBANE, WYNNUM","RURAL",266,3.1459999999999999,7.2880000000000003,2.2483,null,null,1,4.5136000000000003E-2,4.5136000000000003E-2,6.9200000000000002E-4,6.9200000000000002E-4,7,0.102061,0.102061,2.92E-4,2.92E-4]
[null,"LBS6A","LYTTON","URBAN",2,0.03,9.9000000000000005E-2,3.8100000000000002E-2]
[null,"LBS8B","WYNNUM, WYNNUM WEST","URBAN",181,1.863,0.83299999999999996,1.2575000000000001]
[null,"LBS9A","HEMMANT","URBAN",1,null,2.81,5.5826000000000002]
[null,"LCSTR1H",null,"URBAN",2]
[null,"LDR1","RUNAWAY BAY","RURAL",526,2.8159999999999998,1.113,1.6767000000000001,null,null,1,6.8400000000000004E-4,6.8400000000000004E-4,2.5600000000000001E-6,2.5600000000000001E-6,2,7.4310000000000001E-3,7.4310000000000001E-3,1E-4,1E-4]
[null,"LDR1","RUNAWAY BAY","URBAN",526,2.8159999999999998,1.113,1.6767000000000001,null,null,1,5.8E-5,5.8E-5,9.9000000000000005E-7,9.9000000000000005E-7]
[null,"LDR10A","ARUNDEL, LABRADOR","URBAN",2376,4.9690000000000003,1.206,3.6581999999999999,null,null,11,3.7333999999999999E-2,3.7333999999999999E-2,1.08E-4,1.08E-4,18,9.3688999999999995E-2,9.3688999999999995E-2,3.3599999999999998E-4,3.3599999999999998E-4]
[null,"LDR10B","BIGGERA WATERS, LABRADOR","URBAN",3,null,2.36,3.601,null,null,null,null,null,null,null,1,5.5999999999999999E-5,5.5999999999999999E-5,1.99E-6,1.99E-6]
[null,"LDR11","LABRADOR","URBAN",376,1.486,0.29799999999999999,0.55249999999999999]
[null,"LDR2A","BIGGERA WATERS, LABRADOR","URBAN",128,2.3079999999999998,0.83299999999999996,1.7909999999999999]
[null,"LDR2B","LABRADOR","URBAN",966,1.496,1.552,1.7719,null,null,null,null,null,null,null,1,1.2390000000000001E-3,1.2390000000000001E-3,1.19E-5,1.19E-5]
[null,"LDR3","BIGGERA WATERS, LABRADOR, RUNAWAY BAY","URBAN",2115,3.4369999999999998,1.1459999999999999,3.7725,null,null,7,3.4049000000000003E-2,3.4049000000000003E-2,1.74E-4,1.74E-4,1,5.2028999999999999E-2,5.2028999999999999E-2,1.4300000000000001E-4,1.4300000000000001E-4]
[null,"LDR5A",null,"URBAN",null,null,null,null,null,null,2,6.1200000000000002E-4,6.1200000000000002E-4,1.99E-6,1.99E-6,2,2.9599999999999998E-4,2.9599999999999998E-4,1.99E-6,1.99E-6]
[null,"LDR6","BIGGERA WATERS, LABRADOR","URBAN",1713,1.9730000000000001,1.4319999999999999,3.1627999999999998,null,null,6,7.8849999999999996E-3,7.8849999999999996E-3,5.4599999999999999E-5,5.4599999999999999E-5,9,7.4783000000000002E-2,7.4783000000000002E-2,3.0600000000000001E-4,3.0600000000000001E-4]
[null,"LDR8","BIGGERA WATERS, LABRADOR, RUNAWAY BAY","RURAL",1211,3.6150000000000002,1,5.2777000000000003,null,null,null,null,null,null,null,4,2.1198999999999999E-2,2.1198999999999999E-2,1.05E-4,1.05E-4]
[null,"LDR8","BIGGERA WATERS, LABRADOR, RUNAWAY BAY","URBAN",1211,3.6150000000000002,1,5.2777000000000003,null,null,5,0.10499799999999999,0.10499799999999999,9.6400000000000001E-4,9.6400000000000001E-4,1,6.9829999999999996E-3,6.9829999999999996E-3,3.4700000000000003E-5,3.4700000000000003E-5]
[null,"LGL11A","KINGSTON, LOGAN CENTRAL, SLACKS CREEK","URBAN",1184,8.0009999999999994,0.92300000000000004,2.9912999999999998,null,null,15,0.36722300000000002,0.36722300000000002,2.7859999999999998E-3,2.7859999999999998E-3,3,1.7118999999999999E-2,1.7118999999999999E-2,6.5500000000000006E-5,6.5500000000000006E-5]
[null,"LGL13A","LOGANLEA, MEADOWBROOK","URBAN",530,2.7909999999999999,3.73,3.1438000000000001,null,null,5,3.6640000000000002E-3,3.6640000000000002E-3,4.7599999999999998E-5,4.7599999999999998E-5,6,3.7490000000000002E-3,3.7490000000000002E-3,3.0800000000000003E-5,3.0800000000000003E-5]
[null,"LGL15A","KINGSTON, LOGANLEA, MEADOWBROOK, SLACKS CREEK","RURAL",1043,5.6680000000000001,2.48,2.1149,null,null,2,4.8899999999999996E-4,3.8900000000000002E-4,5.13E-6,2.5600000000000001E-6,2,1.292E-3,1.292E-3,1.2799999999999999E-5,1.2799999999999999E-5]
[null,"LGL15A","KINGSTON, LOGANLEA, MEADOWBROOK, SLACKS CREEK","URBAN",1043,5.6680000000000001,2.48,2.1149,null,null,1,6.2000000000000003E-5,6.2000000000000003E-5,9.9000000000000005E-7,9.9000000000000005E-7,2,5.1520000000000003E-3,5.1520000000000003E-3,2.48E-5,2.48E-5]
[null,"LGL3A","LOGANLEA, MEADOWBROOK","URBAN",736,5.5019999999999998,1.218,2.2292000000000001,null,null,1,6.3999999999999997E-5,6.3999999999999997E-5,9.9000000000000005E-7,9.9000000000000005E-7,4,1.1128000000000001E-2,1.1128000000000001E-2,6.05E-5,6.05E-5]
[null,"LGL5A","MEADOWBROOK","URBAN",470,1.855,2.181,4.1154999999999999,null,null,null,null,null,null,null,5,2.3009999999999999E-2,2.3009999999999999E-2,8.2399999999999997E-5,8.2399999999999997E-5]
[null,"LGL7A","MEADOWBROOK","URBAN",3,null,2.3519999999999999,2.8961000000000001]
[null,"LGV2B","CHAMBERS FLAT, LOGAN RESERVE, LOGAN VILLAGE, PARK RIDGE, PARK RIDGE SOUTH","RURAL",655,29.181000000000001,4.0529999999999999,2.7627000000000002,null,null,15,0.90659500000000004,3.2740999999999999E-2,1.758E-3,3.9500000000000001E-4,12,0.14383899999999999,0.14383899999999999,5.2800000000000004E-4,5.2800000000000004E-4]
[null,"LGV3A","BUCCAN, CHAMBERS FLAT, LOGAN RESERVE, LOGAN VILLAGE","RURAL",191,9.94,0.51800000000000002,0.68589999999999995,null,null,5,1.0573000000000001E-2,4.7930000000000004E-3,8.4599999999999996E-5,2.8200000000000001E-5,12,0.17163,0.17163,5.7899999999999998E-4,5.7899999999999998E-4]
[null,"LGV5B","LOGAN VILLAGE","RURAL",855,16.277000000000001,1.6990000000000001,2.3816000000000002,null,null,11,1.8687370000000001,0.35128100000000001,4.3699999999999998E-3,2.2659999999999998E-3,14,0.156637,0.156637,4.46E-4,4.46E-4]
[null,"LGV6A","BUCCAN, LOGAN VILLAGE, WATERFORD","RURAL",842,35.613,2.0030000000000001,2.2864,null,null,12,0.62317400000000001,0.31433499999999998,3.0170000000000002E-3,2.3280000000000002E-3,11,7.5412999999999994E-2,7.3629E-2,2.3800000000000001E-4,2.23E-4]
[null,"LHM1A","LOGANHOLME, TANAH MERAH","URBAN",1608,5.1539999999999999,5.6760000000000002,4.0202,null,null,8,0.170598,0.170598,1.673E-3,1.673E-3,6,0.105839,0.105839,3.3599999999999998E-4,3.3599999999999998E-4]
[null,"LHM2","LOGANHOLME, SHAILER PARK","URBAN",580,4.42,1.0580000000000001,2.9342000000000001,null,null,8,4.2909999999999997E-3,4.2909999999999997E-3,4.2700000000000001E-5,4.2700000000000001E-5,7,3.56E-2,3.56E-2,8.4400000000000005E-5,8.4400000000000005E-5]
[null,"LHM3","LOGANHOLME","RURAL",1486,8.5760000000000005,4.1550000000000002,3.6772,null,null,10,0.15898300000000001,0.15898300000000001,6.2500000000000001E-4,6.2500000000000001E-4,11,0.106757,0.106757,4.84E-4,4.84E-4]
[null,"LHM4A","LOGANHOLME","URBAN",129,2.5179999999999998,0.68400000000000005,2.5150000000000001,null,null,4,1.1893000000000001E-2,1.1893000000000001E-2,1.4999999999999999E-4,1.4999999999999999E-4,2,1.5770000000000001E-3,1.5770000000000001E-3,1.99E-6,1.99E-6]
[null,"LHM5","CORNUBIA, LOGANHOLME","RURAL",909,7.6150000000000002,0.42699999999999999,2.3435000000000001,null,null,9,0.292325,0.292325,2.4680000000000001E-3,2.4680000000000001E-3,4,3.9630000000000004E-3,3.9630000000000004E-3,2.5599999999999999E-5,2.5599999999999999E-5]
[null,"LHM6","SHAILER PARK","URBAN",5,null,3.4260000000000002,4.2488000000000001,null,null,null,null,null,null,null,3,2.7799999999999998E-4,2.7799999999999998E-4,2.9799999999999998E-6,2.9799999999999998E-6]
[null,"LHM7","LOGANHOLME","URBAN",252,2.0659999999999998,1.2250000000000001,4.0964,null,null,null,null,null,null,null,11,2.9304E-2,2.9304E-2,2.0000000000000001E-4,2.0000000000000001E-4]
[null,"LHM8A","CARBROOK, CORNUBIA, LOGANHOLME","RURAL",475,6.8209999999999997,1.982,2.6293000000000002,null,null,4,9.4737000000000002E-2,9.4737000000000002E-2,1.328E-3,1.328E-3,2,1.9789000000000001E-2,1.9789000000000001E-2,1.03E-4,1.03E-4]
[null,"LHM8B","LOGANHOLME","URBAN",104,1.512,1.415,null,null,null,1,6.8840000000000004E-3,6.8840000000000004E-3,1.03E-4,1.03E-4,2,8.0500000000000005E-4,8.0500000000000005E-4,1.99E-6,1.99E-6]
[null,"LHM9","LOGANHOLME, SHAILER PARK","URBAN",2,null,3.238,3.9821]
[null,"LLY1","BLENHEIM, LAIDLEY, LAIDLEY CREEK WEST, LAIDLEY SOUTH, MULGOWIE, THORNTON, TOWNSON","RURAL",486,115.706,1.484,2.3626,null,null,21,0.57555199999999995,0.32341300000000001,4.9680000000000002E-3,4.3699999999999998E-3,15,0.24059900000000001,0.24059900000000001,4.8999999999999998E-4,4.8999999999999998E-4]
[null,"LLY2B","LAIDLEY","RURAL",1082,11.417999999999999,1.994,3.4104999999999999,null,null,4,0.275704,0.27466800000000002,5.4980000000000003E-3,5.496E-3,4,2.0038E-2,2.0038E-2,1.7200000000000001E-4,1.7200000000000001E-4]
[null,"LLY2B","LAIDLEY","URBAN",1082,11.417999999999999,1.994,3.4104999999999999,null,null,2,6.4019999999999997E-3,6.4019999999999997E-3,7.3499999999999998E-5,7.3499999999999998E-5,2,5.9199999999999999E-3,5.9199999999999999E-3,2.7800000000000001E-5,2.7800000000000001E-5]
[null,"LLY3","BLENHEIM, FOREST HILL, GLEN CAIRN, GLENCAIRN, LAIDLEY, LAIDLEY CREEK WEST, LAIDLEY HEIGHTS, MOUNT BERRYMAN, ROCKSIDE, THORNTON","RURAL",711,78.837999999999994,0.70099999999999996,1.6386000000000001,null,null,16,0.310224,0.30703200000000003,3.9779999999999998E-3,3.9579999999999997E-3,10,3.5118000000000003E-2,3.5118000000000003E-2,3.1300000000000002E-4,3.1300000000000002E-4]
[null,"LLY4","FOREST HILL, LAIDLEY, LAIDLEY HEIGHTS, LAIDLEY NORTH, PLAINLAND, SUMMERHOLM","RURAL",921,47.201999999999998,2.2879999999999998,2.2292000000000001,null,null,21,0.46636300000000003,0.45656600000000003,5.7210000000000004E-3,5.7159999999999997E-3,12,0.20078299999999999,0.20078299999999999,8.1999999999999998E-4,8.1999999999999998E-4]
[null,"LLY5","CALVERT, GRANDCHESTER, HIDDENVALE, LAIDLEY, LAIDLEY SOUTH, LOWER MOUNT WALKER, MT MORT, SUMMERHOLM","RURAL",620,88.637,0.495,1.5052000000000001,null,null,20,0.204933,0.20002500000000001,3.2659999999999998E-3,3.2499999999999999E-3,4,6.1720000000000004E-3,6.1720000000000004E-3,5.8999999999999998E-5,5.8999999999999998E-5]
[null,"LMDNGE10",null,"URBAN",1,null,3.4449999999999998,5.4492000000000003]
[null,"LNCTR1","MUDGEERABA","URBAN",1,null,null,null,null,null,1,1.73E-4,1.73E-4,9.9000000000000005E-7,9.9000000000000005E-7]
[null,"LPZMUF16","BRISBANE","CBD",1,null,0.10100000000000001,null,null,null,1,3.6556999999999999E-2,3.6556999999999999E-2,2.5599999999999999E-4,2.5599999999999999E-4]
[null,"LPZT1","BRISBANE","CBD",3]
[null,"LRE4A","CHURCHABLE, GLENORE GROVE, KENTVILLE, LOCKROSE, LOCKYER WATERS, LYNFORD, MORTON VALE, SPRING CREEK, WITHCOTT","RURAL",298,41.28,0.28699999999999998,0.7621,null,null,9,0.17870800000000001,0.17870800000000001,1.6100000000000001E-3,1.6100000000000001E-3,7,4.3110000000000002E-2,4.3110000000000002E-2,1.74E-4,1.74E-4]
[null,"LRE6A","ATKINSONS DAM, COOMINYA, KENTVILLE, LOCKROSE, LOCKYER WATERS, LYNFORD, MT TARAMPA","RURAL",377,49.878999999999998,0.72599999999999998,1.6194999999999999,null,null,14,8.9492000000000002E-2,8.9492000000000002E-2,1.225E-3,1.225E-3,19,0.105999,0.105999,3.5399999999999999E-4,3.5399999999999999E-4]
[null,"LRE7A","BRIGHTVIEW, HATTON VALE, KENSINGTON GROVE, LOCKROSE, REGENCY DOWNS","RURAL",730,19.395,0.67800000000000005,2.0005999999999999,null,null,9,5.4462999999999998E-2,5.4462999999999998E-2,1.9430000000000001E-3,1.9430000000000001E-3,11,0.11808200000000001,0.11808200000000001,7.1500000000000003E-4,7.1500000000000003E-4]
[null,"LRE8A","BRIGHTVIEW, HATTON VALE, KENSINGTON GROVE, LOCKROSE, MT TARAMPA, PRENZLAU, REGENCY DOWNS","RURAL",1207,45.761000000000003,8.1259999999999994,3.6200999999999999,null,null,7,8.1007999999999997E-2,8.1007999999999997E-2,3.0019999999999999E-3,3.0019999999999999E-3,20,0.113763,0.113763,6.4599999999999998E-4,6.4599999999999998E-4]
[null,"LSNTR1",null,"URBAN",31]
[null,"LTA12A","MANLY WEST, WYNNUM WEST","URBAN",1452,6.0209999999999999,1.018,2.8769999999999998,null,null,11,0.30076399999999998,0.30076399999999998,1.4499999999999999E-3,1.4499999999999999E-3,9,2.4426E-2,2.4426E-2,9.7299999999999993E-5,9.7299999999999993E-5]
[null,"LTA15A","LOTA, MANLY, MANLY WEST","URBAN",1302,5.0960000000000001,1.4059999999999999,3.0293999999999999,null,null,4,6.5170000000000002E-3,6.5170000000000002E-3,8.5400000000000002E-5,8.5400000000000002E-5,4,5.7956000000000001E-2,5.7956000000000001E-2,1.5899999999999999E-4,1.5899999999999999E-4]
[null,"LTA16A","LOTA, MANLY WEST, WAKERLEY","URBAN",1210,2.1150000000000002,4.9669999999999996,3.7534999999999998,null,null,2,1.3799999999999999E-4,1.3799999999999999E-4,1.99E-6,1.99E-6,4,2.3415999999999999E-2,2.3415999999999999E-2,7.7399999999999998E-5,7.7399999999999998E-5]
[null,"LTA3A","BIRKDALE, LOTA, RANSOME, THORNESIDE","RURAL",1866,14.554,0.99199999999999999,3.7153999999999998,null,null,11,1.8709E-2,1.8709E-2,3.59E-4,3.59E-4,2,2.1049999999999999E-2,2.1049999999999999E-2,6.6600000000000006E-5,6.6600000000000006E-5]
[null,"LTA4A","GUMDALE, RANSOME, WAKERLEY","URBAN",1438,8.0730000000000004,8.3140000000000001,5.1443000000000003,null,null,4,2.647E-3,2.647E-3,5.7599999999999997E-5,5.7599999999999997E-5,3,1.2168E-2,1.2168E-2,4.1699999999999997E-5,4.1699999999999997E-5]
[null,"LTA5A","MANLY, MANLY WEST","URBAN",1336,3.1819999999999999,4.6059999999999999,2.8008000000000002,null,null,4,0.16417499999999999,0.16417499999999999,1.2489999999999999E-3,1.2489999999999999E-3,4,1.11E-2,1.11E-2,5.8600000000000001E-5,5.8600000000000001E-5]
[null,"LTA8A","MANLY, MANLY WEST, WYNNUM, WYNNUM WEST","URBAN",2008,7.89,0.96499999999999997,4.306,null,null,5,4.4700000000000002E-4,4.4700000000000002E-4,4.9599999999999999E-6,4.9599999999999999E-6,10,3.7366999999999997E-2,3.7366999999999997E-2,1.3200000000000001E-4,1.3200000000000001E-4]
[null,"LTN2","JOYNER, KURWONGBAH, LAWNTON, PETRIE, WHITESIDE","RURAL",1780,10.583,5.5049999999999999,5.6397000000000004,null,null,13,0.80829300000000004,0.80829300000000004,1.3823999999999999E-2,1.3823999999999999E-2,8,3.5899E-2,3.5899E-2,1.26E-4,1.26E-4]
[null,"LTN3","LAWNTON, PETRIE","URBAN",1858,11.624000000000001,1.101,4.2488000000000001,null,null,19,0.12688199999999999,0.12688199999999999,4.1609999999999998E-3,4.1609999999999998E-3,6,4.8878999999999999E-2,4.8878999999999999E-2,1.5100000000000001E-4,1.5100000000000001E-4]
[null,"LTN4","BRAY PARK, STRATHPINE","URBAN",1575,7.766,0.79700000000000004,4.6680000000000001,null,null,7,7.2357000000000005E-2,7.1872000000000005E-2,3.3029999999999999E-3,3.3019999999999998E-3,3,2.4659999999999999E-3,2.4659999999999999E-3,2.2799999999999999E-5,2.2799999999999999E-5]
[null,"LTN5","BRAY PARK, BRENDALE, STRATHPINE","URBAN",1971,9.2560000000000002,2.012,4.7252000000000001,null,null,9,0.37891399999999997,0.37891399999999997,8.1949999999999992E-3,8.1949999999999992E-3,9,4.6275999999999998E-2,4.6275999999999998E-2,1.7000000000000001E-4,1.7000000000000001E-4]
[null,"LTN6","LAWNTON, STRATHPINE","URBAN",1909,12.815,0.72499999999999998,4.9157000000000002,null,null,8,0.17441100000000001,0.17441100000000001,3.813E-3,3.813E-3,19,6.7311999999999997E-2,6.7311999999999997E-2,3.0400000000000002E-4,3.0400000000000002E-4]
[null,"LTN7","BRAY PARK, LAWNTON, STRATHPINE","URBAN",873,4.7960000000000003,2.282,4.5156000000000001,null,null,8,6.5634999999999999E-2,6.5634999999999999E-2,1.6689999999999999E-3,1.6689999999999999E-3,5,4.1278000000000002E-2,4.1278000000000002E-2,1.2400000000000001E-4,1.2400000000000001E-4]
[null,"LTN8","BRAY PARK, CASHMERE, JOYNER, LAWNTON, WARNER","RURAL",1577,12.519,7.7679999999999998,4.4584000000000001,null,null,1,3.7100000000000002E-4,3.7100000000000002E-4,2.5600000000000001E-6,2.5600000000000001E-6,1,2.6450000000000002E-3,2.6450000000000002E-3,7.6899999999999992E-6,7.6899999999999992E-6]
[null,"LTN8","BRAY PARK, CASHMERE, JOYNER, LAWNTON, WARNER","URBAN",1577,12.519,7.7679999999999998,4.4584000000000001,null,null,3,0.109523,0.109523,3.0730000000000002E-3,3.0730000000000002E-3,4,3.2620000000000003E-2,3.2620000000000003E-2,1.7899999999999999E-4,1.7899999999999999E-4]
[null,"LTN9","BRAY PARK, JOYNER, WARNER","URBAN",1612,7.2309999999999999,5.3579999999999997,6.5162000000000004,null,null,12,0.36826999999999999,0.36826999999999999,4.8589999999999996E-3,4.8589999999999996E-3,4,8.2179999999999996E-3,8.2179999999999996E-3,7.0500000000000006E-5,7.0500000000000006E-5]
[null,"LWD1","COOMINYA, LOWOOD, PATRICK ESTATE, WIVENHOE POCKET","RURAL",702,27.259,0.83699999999999997,2.8961000000000001,null,null,16,0.10875799999999999,0.10875799999999999,3.9940000000000002E-3,3.9940000000000002E-3,9,3.9516000000000003E-2,3.9516000000000003E-2,1.7200000000000001E-4,1.7200000000000001E-4]
[null,"LYT1","LYTTON","URBAN",9,1.7470000000000001,0.38900000000000001,4.9919000000000002,null,null,1,1.84E-4,1.84E-4,1.99E-6,1.99E-6,3,4.1850000000000004E-3,4.1850000000000004E-3,1.19E-5,1.19E-5]
[null,"LYT4A","LYTTON","URBAN",2,null,7.0000000000000001E-3,2.6674000000000002,null,null,1,1.66E-4,1.66E-4,1.99E-6,1.99E-6,1,6.4999999999999997E-4,6.4999999999999997E-4,9.9000000000000005E-7,9.9000000000000005E-7]
[null,"MAATR1","BRISBANE","URBAN",1]
[null,"MACMHS1","BRISBANE","CBD",56,null,0.315]
[null,"MACTR1H","BRISBANE","CBD",2]
[null,"MAI11","MERMAID BEACH, MERMAID WATERS, MIAMI","URBAN",1620,3.702,0.371,3.7153999999999998,null,null,9,5.0196999999999999E-2,5.0196999999999999E-2,5.1609999999999998E-3,5.1609999999999998E-3,22,0.20751700000000001,0.19280700000000001,6.7699999999999998E-4,6.38E-4]
[null,"MAI13",null,"URBAN",88,null,null,3.7534999999999998,null,null,3,3.4299999999999999E-3,3.4299999999999999E-3,2.6200000000000003E-4,2.6200000000000003E-4]
[null,"MAI13A","BURLEIGH WATERS, MIAMI","URBAN",1730,2.92,8.0269999999999992,null,null,null,6,8.3725999999999995E-2,8.3725999999999995E-2,5.2570000000000004E-3,5.2570000000000004E-3,3,2.905E-3,2.905E-3,8.6399999999999999E-5,8.6399999999999999E-5]
[null,"MAI14","MIAMI","URBAN",1748,3.161,1.256,3.9058999999999999,null,null,15,9.0388999999999997E-2,9.0388999999999997E-2,5.7289999999999997E-3,5.7289999999999997E-3,1,3.5584999999999999E-2,3.5584999999999999E-2,7.4400000000000006E-5,7.4400000000000006E-5]
[null,"MAI17","BURLEIGH HEADS, MIAMI","URBAN",1789,5.1360000000000001,0.83099999999999996,3.8487,null,null,9,6.7304000000000003E-2,6.7304000000000003E-2,5.4539999999999996E-3,5.4539999999999996E-3,2,3.6939E-2,3.6939E-2,9.9300000000000001E-5,9.9300000000000001E-5]
[null,"MAI5","MERMAID BEACH, MERMAID WATERS, MIAMI","URBAN",1873,3.5059999999999998,1.071,4.0202,null,null,11,5.6515999999999997E-2,5.6515999999999997E-2,5.6820000000000004E-3,5.6820000000000004E-3,3,7.4310000000000001E-3,7.4310000000000001E-3,2.8799999999999999E-5,2.8799999999999999E-5]
[null,"MAI7","MERMAID BEACH, MERMAID WATERS, MIAMI","URBAN",1439,0.995,5.2619999999999996,3.0865999999999998,null,null,5,3.4887000000000001E-2,3.4887000000000001E-2,4.287E-3,4.287E-3,6,1.9952000000000001E-2,1.9952000000000001E-2,5.9599999999999999E-5,5.9599999999999999E-5]
[null,"MAI8","MERMAID BEACH, MERMAID WATERS, MIAMI, ROBINA","URBAN",1262,0.78,6.4470000000000001,3.601,null,null,9,0.344829,0.344829,5.1190000000000003E-3,5.1190000000000003E-3]
[null,"MAK6","SURFERS PARADISE","URBAN",138,null,0.20499999999999999]
[null,"MAK7","SURFERS PARADISE","URBAN",18,null,0.245]
[null,"MAKT1","SURFERS PARADISE","URBAN",1]
[null,"MBF27A","BRISBANE","CBD",1,null,0.107]
[null,"MBFT1","BRISBANE","CBD",3]
[null,"MBG1","ASHWELL, MARBURG, MINDEN, ROSEWOOD, TALLEGALLA, THE BLUFF","RURAL",299,45.125,null,0.64780000000000004,null,null,12,0.15110299999999999,0.15110299999999999,3.4600000000000001E-4,3.4600000000000001E-4,14,5.5647000000000002E-2,5.5647000000000002E-2,3.0200000000000002E-4,3.0200000000000002E-4]
[null,"MBG2","HAIGSLEA, MARBURG, MT MARROW, ROSEWOOD, TALLEGALLA, THAGOONA, WALLOON","RURAL",464,52.901000000000003,0.20899999999999999,2.0005999999999999,null,null,12,0.44260899999999997,0.44260899999999997,2.617E-3,2.617E-3,13,9.4041E-2,9.4041E-2,3.4299999999999999E-4,3.4299999999999999E-4]
[null,"MBG4","FAIRNEY VIEW, FERNVALE, GLAMORGAN VALE, HAIGSLEA, LARK HILL, MARBURG, VERNOR, WANORA","RURAL",416,71.489000000000004,0.14000000000000001,1.2575000000000001,null,null,24,0.66640100000000002,0.66605000000000003,2.5530000000000001E-3,2.5509999999999999E-3,10,5.2181999999999999E-2,5.2181999999999999E-2,1.6899999999999999E-4,1.6899999999999999E-4]
[null,"MCN1","MOUNT COTTON, SHELDON, THORNLANDS","RURAL",86,14.568,1.903,1.7148000000000001,null,null,2,3.0400000000000002E-4,3.0400000000000002E-4,5.13E-6,5.13E-6,7,4.4118999999999998E-2,4.4118999999999998E-2,1.4100000000000001E-4,1.4100000000000001E-4]
[null,"MCN2","MOUNT COTTON","RURAL",67,7.694,1.6379999999999999,1.3717999999999999,null,null,4,0.12805,0.12805,2.13E-4,2.13E-4]
[null,"MCN3","CORNUBIA, MOUNT COTTON","URBAN",52,8.6989999999999998,0.17499999999999999,3.22,null,null,1,6.8430000000000001E-3,6.8430000000000001E-3,5.1600000000000001E-5,5.1600000000000001E-5,4,3.5149999999999999E-3,3.5149999999999999E-3,1.0900000000000001E-5,1.0900000000000001E-5]
[null,"MCN4","MOUNT COTTON","RURAL",976,1.4410000000000001,8.1519999999999992,2.5341,null,null,3,2.1555999999999999E-2,2.1555999999999999E-2,2.4919999999999999E-3,2.4919999999999999E-3,1,1.1950000000000001E-2,1.1950000000000001E-2,3.5899999999999998E-5,3.5899999999999998E-5]
[null,"MCW11","CHUWAR, KARANA DOWNS, KHOLO, LAKE MANCHESTER, MOUNT CROSBY, MUIRLEA","RURAL",904,45.000999999999998,4.3970000000000002,2.9342000000000001,null,null,13,0.13105900000000001,0.12948100000000001,9.5600000000000004E-4,9.5399999999999999E-4,10,0.109774,0.109774,5.1800000000000001E-4,5.1800000000000001E-4]
[null,"MCW4","CHUWAR, KARANA DOWNS, MOUNT CROSBY","RURAL",1275,10.489000000000001,6.4029999999999996,3.4485999999999999,null,null,6,0.20243900000000001,0.20243900000000001,3.3579999999999999E-3,3.3579999999999999E-3,2,3.9619000000000001E-2,3.9619000000000001E-2,1.1E-4,1.1E-4]
[null,"MCW5","MOUNT CROSBY","RURAL",1,1.208,0.27]
[null,"MCW5","MOUNT CROSBY","URBAN",null,1.208,0.27,null,null,null,null,null,null,null,null,1,3.7199999999999999E-4,3.7199999999999999E-4,9.9000000000000005E-7,9.9000000000000005E-7]
[null,"MCW7","CHUWAR, KARALEE","RURAL",832,18.731999999999999,2.4500000000000002,2.7818000000000001,null,null,11,1.4067E-2,1.4067E-2,2.0000000000000001E-4,2.0000000000000001E-4,7,8.3686999999999998E-2,8.3686999999999998E-2,2.9E-4,2.9E-4]
[null,"MCWWTP6A",null,"URBAN",1]
[null,"MDH12A",null,"URBAN",1,null,1.5249999999999999,3.1819000000000002]
[null,"MDH1A","PINKENBA","URBAN",9,1.069,1.833,1.2384999999999999]
[null,"MDH3A","EAGLE FARM, PINKENBA","URBAN",79,0.83199999999999996,5.24,3.5438999999999998,null,null,1,5.5430000000000002E-3,5.5430000000000002E-3,7.8399999999999995E-5,7.8399999999999995E-5,1,1.2509999999999999E-3,1.2509999999999999E-3,6.9500000000000004E-6,6.9500000000000004E-6]
[null,"MDH4A","PINKENBA","RURAL",138,4.2279999999999998,1.2170000000000001,1.3717999999999999]
[null,"MDH4A","PINKENBA","URBAN",null,4.2279999999999998,1.2170000000000001,1.3717999999999999,null,null,null,null,null,null,null,6,6.012E-2,6.012E-2,1.56E-4,1.56E-4]
[null,"MDH5A","EAGLE FARM, PINKENBA","URBAN",64,0.61599999999999999,2.573,3.2389999999999999,null,null,5,1.6521000000000001E-2,1.6521000000000001E-2,2.52E-4,2.52E-4,1,1.2E-5,1.2E-5,9.9000000000000005E-7,9.9000000000000005E-7]
[null,"MDH5B","EAGLE FARM, PINKENBA","URBAN",38,1.099,3.69,2.2292000000000001,null,null,4,1.1476999999999999E-2,1.1476999999999999E-2,1.45E-4,1.45E-4,1,9.9299999999999996E-4,9.9299999999999996E-4,3.9700000000000001E-6,3.9700000000000001E-6]
[null,"MDH8B","PINKENBA","URBAN",5,null,0.91200000000000003,3.1627999999999998]
[null,"MDH9A","PINKENBA","URBAN",34,1.3340000000000001,0.62,1.3909,null,null,null,null,null,null,null,1,2.72E-4,2.72E-4,9.9000000000000005E-7,9.9000000000000005E-7]
[null,"MDHQBI2","PINKENBA","URBAN",3,2.0259999999999998,1.8779999999999999,3.2389999999999999,null,null,null,null,null,null,null,1,1.06E-4,1.06E-4,9.9000000000000005E-7,9.9000000000000005E-7]
[null,"MDR10A","MOLENDINAR","URBAN",629,1.1499999999999999,3.9830000000000001,2.0387,null,null,4,0.11706,0.11706,1.596E-3,1.596E-3]
[null,"MDR12B","ASHMORE, MOLENDINAR, SOUTHPORT","URBAN",274,1.7929999999999999,1.9570000000000001,3.0865999999999998,null,null,4,3.0182E-2,3.0182E-2,5.4199999999999995E-4,5.4199999999999995E-4,2,1.4652999999999999E-2,1.4652999999999999E-2,2.6800000000000001E-5,2.6800000000000001E-5]
[null,"MDR24A","ASHMORE","URBAN",1072,2.9740000000000002,3.762,2.5722,null,null,9,0.100213,0.100213,1.075E-3,1.075E-3,3,3.6250999999999999E-2,3.6250999999999999E-2,1.54E-4,1.54E-4]
[null,"MDR25A","MOLENDINAR, NERANG","URBAN",208,5.0839999999999996,0.309,2.8389000000000002,null,null,1,1.9737999999999999E-2,1.9737999999999999E-2,2.0599999999999999E-4,2.0599999999999999E-4]
[null,"MDR2A","BENOWA","URBAN",397,3.4249999999999998,3.6549999999999998,3.4676999999999998,null,null,3,9.4200000000000002E-4,9.4200000000000002E-4,5.9599999999999997E-6,5.9599999999999997E-6]
[null,"MDR30A","ASHMORE, BENOWA, CARRARA","URBAN",1452,2.8090000000000002,6.5049999999999999,4.8776000000000002,null,null,10,0.140287,0.140287,1.498E-3,1.498E-3,6,2.9998E-2,2.9998E-2,1.83E-4,1.83E-4]
[null,"MDR31A","MOLENDINAR","URBAN",306,1.946,2.294,2.9531999999999998,null,null,2,7.9249999999999998E-3,7.9249999999999998E-3,4.2700000000000001E-5,4.2700000000000001E-5,2,2.8140000000000001E-3,2.8140000000000001E-3,6.9500000000000004E-6,6.9500000000000004E-6]
[null,"MDR33A","ASHMORE, BENOWA","URBAN",1346,3.4140000000000001,4.6529999999999996,3.9821,null,null,6,3.3057000000000003E-2,3.3057000000000003E-2,1.66E-4,1.66E-4,5,1.9259999999999999E-2,1.9259999999999999E-2,1.11E-4,1.11E-4]
[null,"MDR35A","SOUTHPORT","URBAN",1,null,5.4630000000000001,3.9249000000000001,null,null,1,3.4099999999999999E-4,3.4099999999999999E-4,9.9000000000000005E-7,9.9000000000000005E-7,1,7.1500000000000003E-4,7.1500000000000003E-4,9.9000000000000005E-7,9.9000000000000005E-7]
[null,"MDR3A","ASHMORE, CARRARA, MOLENDINAR, NERANG","URBAN",732,4.8650000000000002,4.8540000000000001,3.4866999999999999,null,null,5,6.4300000000000002E-4,6.4300000000000002E-4,4.9599999999999999E-6,4.9599999999999999E-6,4,1.2389000000000001E-2,1.2389000000000001E-2,4.6699999999999997E-5,4.6699999999999997E-5]
[null,"MDR4A","MOLENDINAR","URBAN",426,1.4159999999999999,6.6269999999999998,2.1720999999999999,null,null,1,1.2400000000000001E-4,1.2400000000000001E-4,9.9000000000000005E-7,9.9000000000000005E-7,2,6.4899999999999995E-4,6.4899999999999995E-4,1.0900000000000001E-5,1.0900000000000001E-5]
[null,"MDR6A","MOLENDINAR, SOUTHPORT","URBAN",670,3.923,2.9470000000000001,3.2961999999999998,null,null,5,0.121388,0.121388,1.333E-3,1.333E-3,5,2.2891000000000002E-2,2.2891000000000002E-2,9.8300000000000004E-5,9.8300000000000004E-5]
[null,"MDR8A","BENOWA, CARRARA","RURAL",null,4.2460000000000004,7.0469999999999997,4.0202,null,null,4,5.3592000000000001E-2,5.3592000000000001E-2,9.5399999999999999E-4,9.5399999999999999E-4,4,6.888E-3,6.888E-3,1.7900000000000001E-5,1.7900000000000001E-5]
[null,"MDR8A","BENOWA, CARRARA","URBAN",369,4.2460000000000004,7.0469999999999997,4.0202]
[null,"MDRMLD11","MOLENDINAR","URBAN",907,4.0679999999999996,3.3690000000000002,3.3915000000000002,null,null,5,7.5791999999999998E-2,7.5791999999999998E-2,9.3099999999999997E-4,9.3099999999999997E-4,5,1.9465E-2,1.9465E-2,1.06E-4,1.06E-4]
[null,"MEX3","BRISBANE, MILTON","URBAN",26,null,1.5169999999999999,null,null,null,null,null,null,null,null,1,1.9900000000000001E-4,1.9900000000000001E-4,1.99E-6,1.99E-6]
[null,"MEXMST8","BRISBANE","CBD",1,null,0.72499999999999998,1.0288999999999999,null,null,null,null,null,null,null,1,5.0396999999999997E-2,5.0396999999999997E-2,2.5599999999999999E-4,2.5599999999999999E-4]
[null,"MEXTR1H","BRISBANE","CBD",3]
[null,"MEXTR2H","BRISBANE","CBD",1]
[null,"MFD11A","MORAYFIELD","RURAL",4,3.1240000000000001,2.08,1.4671000000000001]
[null,"MFD12A","BURPENGARY, BURPENGARY EAST, CABOOLTURE, MORAYFIELD","RURAL",1653,9.8140000000000001,7.641,4.5537000000000001,null,null,8,1.6930000000000001E-3,1.6930000000000001E-3,2.05E-5,2.05E-5,6,1.5834000000000001E-2,1.5834000000000001E-2,9.2299999999999994E-5,9.2299999999999994E-5]
[null,"MFD13A","BURPENGARY","RURAL",524,7.3970000000000002,4.3040000000000003,1.6005,null,null,8,0.35494799999999999,0.35494799999999999,3.2529999999999998E-3,3.2529999999999998E-3,3,2.1874999999999999E-2,2.1874999999999999E-2,1E-4,1E-4]
[null,"MFD2A","BURPENGARY, CABOOLTURE SOUTH, MORAYFIELD","URBAN",793,6.891,2.169,4.2679,null,null,4,3.7844000000000003E-2,3.7844000000000003E-2,9.7799999999999992E-4,9.7799999999999992E-4,6,9.2790000000000008E-3,9.2790000000000008E-3,5.1600000000000001E-5,5.1600000000000001E-5]
[null,"MFD3A","BURPENGARY, BURPENGARY EAST","RURAL",964,23.539000000000001,1.35,3.5629,null,null,29,0.49630600000000002,0.49630600000000002,7.0109999999999999E-3,7.0109999999999999E-3,8,5.9576999999999998E-2,5.9576999999999998E-2,2.61E-4,2.61E-4]
[null,"MFD5A","BURPENGARY, MORAYFIELD","RURAL",515,11.555999999999999,0.185,1.6194999999999999,null,null,10,0.912435,7.5881000000000004E-2,2.699E-3,1.377E-3,4,8.0027000000000001E-2,8.0027000000000001E-2,2.3800000000000001E-4,2.3800000000000001E-4]
[null,"MFD8A","BURPENGARY, MORAYFIELD","RURAL",2255,35.162999999999997,4.702,6.6494999999999997,null,null,16,0.94414799999999999,0.94414799999999999,1.6497999999999999E-2,1.6497999999999999E-2,9,0.118577,0.118577,4.9200000000000003E-4,4.9200000000000003E-4]
[null,"MFD9A","BURPENGARY","URBAN",916,7.84,0.29299999999999998,2.3435000000000001,null,null,4,8.0929999999999995E-3,8.0929999999999995E-3,5.4599999999999999E-5,5.4599999999999999E-5,6,2.0055E-2,2.0055E-2,9.2299999999999994E-5,9.2299999999999994E-5]
[null,"MFN12A","CABOOLTURE, CABOOLTURE SOUTH, MELDALE, MORAYFIELD","RURAL",1671,16.312000000000001,3.9860000000000002,5.0872000000000002,null,null,13,0.78107300000000002,0.78107300000000002,9.0379999999999992E-3,9.0379999999999992E-3,10,5.2651000000000003E-2,5.2651000000000003E-2,2.41E-4,2.41E-4]
[null,"MFN13A","MORAYFIELD, UPPER CABOOLTURE","RURAL",1840,15.888,4.6970000000000001,4.7061000000000002,null,null,9,0.111553,0.111553,1.2639999999999999E-3,1.2639999999999999E-3,10,0.14108799999999999,7.1695999999999996E-2,7.0699999999999995E-4,4.3300000000000001E-4]
[null,"MFN15A","BEACHMERE, CABOOLTURE, NINGI","RURAL",846,16.544,2.871,2.3816000000000002,null,null,7,2.9166999999999998E-2,2.9166999999999998E-2,2.8699999999999998E-4,2.8699999999999998E-4,25,0.38455,0.38455,1.2639999999999999E-3,1.2639999999999999E-3]
[null,"MFN16A","MORAYFIELD","URBAN",6,null,1.1850000000000001,1.9434]
[null,"MFN1B","CABOOLTURE, CABOOLTURE SOUTH, MORAYFIELD","URBAN",591,3.9209999999999998,1.921,2.4769000000000001,null,null,6,4.0665E-2,4.0665E-2,1.1609999999999999E-3,1.1609999999999999E-3,6,2.4787E-2,2.4787E-2,1.27E-4,1.27E-4]
[null,"MFN2A","CABOOLTURE SOUTH, MORAYFIELD","URBAN",573,2.5289999999999999,2.016,5.1062000000000003,null,null,10,0.17205200000000001,0.17205200000000001,2.8289999999999999E-3,2.8289999999999999E-3,2,1.2472E-2,1.2472E-2,3.8699999999999999E-5,3.8699999999999999E-5]
[null,"MFN3A","MORAYFIELD","URBAN",5,null,0.65500000000000003,3.8106,null,null,1,6.9999999999999999E-6,6.9999999999999999E-6,3.9700000000000001E-6,3.9700000000000001E-6]
[null,"MFN5A","CABOOLTURE SOUTH, MORAYFIELD, UPPER CABOOLTURE","RURAL",2333,11.797000000000001,5.2859999999999996,5.1443000000000003,null,null,15,0.60509199999999996,0.60509199999999996,2.1135000000000001E-2,2.1135000000000001E-2,2,8.25E-4,8.25E-4,1.5400000000000002E-5,1.5400000000000002E-5]
[null,"MGCTR1H","BRISBANE","CBD",5]
[null,"MGL10A","ANSTEAD, MOGGILL, PINJARRA HILLS, PULLENVALE","RURAL",408,12.88,1.0069999999999999,1.4098999999999999,null,null,12,0.63836199999999999,0.15539900000000001,2.3579999999999999E-3,1.315E-3,16,0.43669599999999997,0.43669599999999997,1.0610000000000001E-3,1.0610000000000001E-3]
[null,"MGL13A","PINJARRA HILLS, PULLENVALE","URBAN",377,7.1769999999999996,2.3929999999999998,2.8199000000000001,null,null,6,2.6540000000000001E-3,2.6540000000000001E-3,8.14E-5,8.14E-5,14,3.7117999999999998E-2,3.6865000000000002E-2,9.1299999999999997E-5,8.8300000000000005E-5]
[null,"MGL1A","PULLENVALE, UPPER BROOKFIELD","RURAL",698,16.568000000000001,8.1989999999999998,3.0293999999999999,null,null,10,0.316633,0.245869,7.4799999999999997E-4,6.2799999999999998E-4,3,6.7822999999999994E-2,6.7822999999999994E-2,1.64E-4,1.64E-4]
[null,"MGL1B","PINJARRA HILLS","URBAN",2]
[null,"MGL2A","ANSTEAD, BELLBOWRIE, MOGGILL, PINJARRA HILLS","RURAL",1049,16.242999999999999,6.5090000000000003,3.6581999999999999,null,null,13,1.1838299999999999,0.40232099999999998,4.3400000000000001E-3,2.9120000000000001E-3,6,6.6541000000000003E-2,6.6541000000000003E-2,1.95E-4,1.95E-4]
[null,"MGL4A","BELLBOWRIE, MOGGILL","RURAL",1046,null,null,2.8199000000000001,null,null,null,null,null,null,null,7,0.114968,0.114968,4.4299999999999998E-4,4.4299999999999998E-4]
[null,"MGL4A","BELLBOWRIE, MOGGILL","URBAN",1046,null,null,2.8199000000000001,null,null,4,0.45398899999999998,6.1499999999999999E-4,1.0430000000000001E-3,8.9299999999999992E-6]
[null,"MGL6A","PINJARRA HILLS","RURAL",30,2.0129999999999999,0.84599999999999997,0.15240000000000001]
[null,"MGL6A","PINJARRA HILLS","URBAN",null,2.0129999999999999,0.84599999999999997,0.15240000000000001,null,null,1,2.062E-3,2.062E-3,3.0800000000000003E-5,3.0800000000000003E-5]
[null,"MGL9A","BELLBOWRIE","URBAN",1351,0.11899999999999999,11.393000000000001,4.8204000000000002,null,null,4,8.9619999999999995E-3,8.9619999999999995E-3,5.5600000000000003E-5,5.5600000000000003E-5,5,1.8304999999999998E-2,1.8304999999999998E-2,6.8499999999999998E-5,6.8499999999999998E-5]
[null,"MGP1","MUDGEERABA","RURAL",585,10.72,1.208,1.7338,null,null,1,3.4E-5,3.4E-5,2.5600000000000001E-6,2.5600000000000001E-6,9,0.12145,0.12145,4.5100000000000001E-4,4.5100000000000001E-4]
[null,"MGP12A","AUSTINVILLE, BONOGIN, MUDGEERABA","RURAL",975,15.916,7.8659999999999997,2.9723000000000002,null,null,15,0.23976,0.23976,2.4169999999999999E-3,2.4169999999999999E-3,7,0.10552400000000001,0.10552400000000001,4.5399999999999998E-4,4.5399999999999998E-4]
[null,"MGP13A","AUSTINVILLE, MUDGEERABA, NATURAL BRIDGE, NERANWOOD, NUMINBAH VALLEY, SPRINGBROOK","RURAL",1035,90.009,4.3490000000000002,2.5531000000000001,null,null,46,1.4770589999999999,1.3945190000000001,8.3049999999999999E-3,8.1359999999999991E-3,37,0.32498100000000002,0.32498100000000002,1.307E-3,1.307E-3]
[null,"MGP15A","GILSTON, MUDGEERABA, TALLAI","RURAL",956,18.437999999999999,3.9380000000000002,3.0865999999999998,null,null,13,0.43250300000000003,0.429948,5.0860000000000002E-3,5.0600000000000003E-3,9,0.22625100000000001,0.22625100000000001,8.1800000000000004E-4,8.1800000000000004E-4]
[null,"MGP16A","MUDGEERABA","URBAN",629,3.0670000000000002,0.67700000000000005,1.6576,null,null,6,2.9150000000000001E-3,5.3899999999999998E-4,6.1500000000000004E-5,4.9599999999999999E-6,1,1.328E-3,1.328E-3,5.9599999999999997E-6,5.9599999999999997E-6]
[null,"MGP17A","BONOGIN, MUDGEERABA, REEDY CREEK","RURAL",null,0.38,13.266999999999999,5.0681000000000003,null,null,1,2.99E-4,2.99E-4,2.5600000000000001E-6,2.5600000000000001E-6,1,3.2062E-2,3.2062E-2,3.0200000000000002E-4,3.0200000000000002E-4]
[null,"MGP17A","BONOGIN, MUDGEERABA, REEDY CREEK","URBAN",1635,0.38,13.266999999999999,5.0681000000000003]
[null,"MGP2A","MUDGEERABA, TALLAI","RURAL",762,5.9770000000000003,1.2589999999999999,2.153,null,null,11,3.4002999999999999E-2,3.4002999999999999E-2,3.9350000000000001E-3,3.9350000000000001E-3,5,0.15138799999999999,0.15138799999999999,5.9999999999999995E-4,5.9999999999999995E-4]
[null,"MGP4","BONOGIN, MUDGEERABA","RURAL",814,18.007999999999999,4.3559999999999999,2.4769000000000001,null,null,11,4.7975999999999998E-2,4.7975999999999998E-2,3.4600000000000001E-4,3.4600000000000001E-4,13,0.19119900000000001,0.19119900000000001,6.4599999999999998E-4,6.4599999999999998E-4]
[null,"MHL12A","MANGO HILL, NORTH LAKES","RURAL",null,null,16.707999999999998,5.8684000000000003,null,null,4,5.5676999999999997E-2,5.5676999999999997E-2,1.6699999999999999E-4,1.6699999999999999E-4,5,2.2502999999999999E-2,2.2502999999999999E-2,1.6899999999999999E-4,1.6899999999999999E-4]
[null,"MHL12A","MANGO HILL, NORTH LAKES","URBAN",1003,null,16.707999999999998,5.8684000000000003]
[null,"MHL13A","NORTH LAKES","URBAN",2058,null,15.702,5.8684000000000003,null,null,1,1.07E-4,1.07E-4,9.9000000000000005E-7,9.9000000000000005E-7,3,3.2759999999999998E-3,3.2759999999999998E-3,2.2799999999999999E-5,2.2799999999999999E-5]
[null,"MHL1B","KIPPA-RING, MANGO HILL, ROTHWELL","RURAL",2276,13.628,11.506,6.0778999999999996,null,null,7,1.15E-2,1.1473000000000001E-2,8.7200000000000005E-5,8.4599999999999996E-5,9,5.2940000000000001E-2,5.2940000000000001E-2,2.2599999999999999E-4,2.2599999999999999E-4]
[null,"MHL22B","MANGO HILL, NORTH LAKES","URBAN",6,null,2.343,2.2864]
[null,"MHL23A",null,"URBAN",1,null,1.0920000000000001,1.9244000000000001]
[null,"MHL25A","NORTH LAKES","URBAN",958,null,8.1720000000000006,5.0491000000000001,null,null,1,9.7999999999999997E-5,9.7999999999999997E-5,9.9000000000000005E-7,9.9000000000000005E-7,2,5.5999999999999995E-4,5.5999999999999995E-4,3.9700000000000001E-6,3.9700000000000001E-6]
[null,"MHL27A","MANGO HILL","URBAN",1209,null,8.09,3.7534999999999998,null,null,3,3.28E-4,3.28E-4,2.9799999999999998E-6,2.9799999999999998E-6]
[null,"MHL2A","GRIFFIN, KALLANGUR, MANGO HILL, MURRUMBA DOWNS","RURAL",1679,11.227,8.0579999999999998,4.0202,null,null,3,1.209E-3,1.209E-3,7.6899999999999992E-6,7.6899999999999992E-6,11,9.4589000000000006E-2,9.4589000000000006E-2,2.31E-4,2.31E-4]
[null,"MHL3A","MANGO HILL, NORTH LAKES","URBAN",1950,1.516,11.315,5.1634000000000002,null,null,6,8.5899999999999995E-4,7.0299999999999996E-4,5.9599999999999997E-6,4.9599999999999999E-6,1,8.7550000000000006E-3,8.7550000000000006E-3,1.7900000000000001E-5,1.7900000000000001E-5]
[null,"MHPWED19","SOUTH BRISBANE","URBAN",7,null,2.6850000000000001,1.8290999999999999,null,null,1,6.3999999999999997E-5,6.3999999999999997E-5,6.9500000000000004E-6,6.9500000000000004E-6,2,7.5900000000000002E-4,7.5900000000000002E-4,2.9799999999999998E-6,2.9799999999999998E-6]
[null,"MHPWED5","SOUTH BRISBANE","URBAN",89,7.4999999999999997E-2,2.9540000000000002,1.9053,null,null,1,1.067E-3,1.067E-3,1.16E-4,1.16E-4,3,3.2504999999999999E-2,3.2504999999999999E-2,1.7900000000000001E-5,1.7900000000000001E-5]
[null,"MKTT1","BRISBANE","CBD",5]
[null,"MLB11A","BUDERIM, MOUNTAIN CREEK","RURAL",null,2.5030000000000001,14.112,5.9635999999999996,null,null,5,0.78754400000000002,0.78754400000000002,5.6010000000000001E-3,5.6010000000000001E-3,4,3.6350000000000002E-3,3.6350000000000002E-3,6.9200000000000002E-5,6.9200000000000002E-5]
[null,"MLB11A","BUDERIM, MOUNTAIN CREEK","URBAN",2182,2.5030000000000001,14.112,5.9635999999999996]
[null,"MLB12A","BUDERIM, SIPPY DOWNS","RURAL",2099,11.893000000000001,6.0590000000000002,5.0491000000000001,null,null,11,0.324212,0.324212,5.4209999999999996E-3,5.4209999999999996E-3,9,5.9526000000000003E-2,5.9526000000000003E-2,4.26E-4,4.26E-4]
[null,"MLB13A","SIPPY DOWNS","URBAN",1343,null,9.7759999999999998,4.6871]
[null,"MLB2A","SIPPY DOWNS","URBAN",1790,null,10.468,3.7915999999999999,null,null,4,1.6479999999999999E-3,1.6479999999999999E-3,3.2799999999999998E-5,3.2799999999999998E-5,2,1.0208999999999999E-2,1.0208999999999999E-2,3.3699999999999999E-5,3.3699999999999999E-5]
[null,"MLB3A","MOUNTAIN CREEK, SIPPY DOWNS","RURAL",2197,1.5609999999999999,14.836,5.0110000000000001,null,null,14,1.5661000000000001E-2,1.5433000000000001E-2,1.03E-4,1E-4,3,0.19387699999999999,0.19387699999999999,8.0699999999999999E-4,8.0699999999999999E-4]
[null,"MLB4A","BUDERIM","URBAN",1628,3.7519999999999998,5.8529999999999998,4.1917,null,null,4,6.3199999999999997E-4,6.3199999999999997E-4,3.9700000000000001E-6,3.9700000000000001E-6,1,7.3899999999999997E-4,7.3899999999999997E-4,1.19E-5,1.19E-5]
[null,"MLB6A","BUDERIM, GLENVIEW, ILKLEY, PALMVIEW, SIPPY DOWNS, TANAWHA","RURAL",946,14.94,8.1549999999999994,4.4394,null,null,3,8.6799999999999996E-4,8.6799999999999996E-4,1.5400000000000002E-5,1.5400000000000002E-5,2,7.5700000000000003E-3,7.5700000000000003E-3,1.7900000000000001E-5,1.7900000000000001E-5]
[null,"MLB8A","BUDERIM, CHEVALLUM, FOREST GLEN, ILKLEY, MONS, SIPPY DOWNS, TANAWHA","RURAL",532,24.248999999999999,3.589,4.0583,null,null,7,0.23606199999999999,0.23551800000000001,2.8890000000000001E-3,2.8860000000000001E-3,17,0.15398899999999999,0.152784,5.6599999999999999E-4,5.6099999999999998E-4]
[null,"MLET1","BRISBANE","CBD",2,null,null,null,null,null,null,null,null,null,null,1,0.475825,0.475825,7.67E-4,7.67E-4]
[null,"MLGT1","BRISBANE","CBD",1]
[null,"MLS11A","NEW FARM","URBAN",1925,5.6000000000000001E-2,5.0069999999999997,4.0011999999999999,null,null,5,2.1874000000000001E-2,2.1874000000000001E-2,2.03E-4,2.03E-4]
[null,"MLS12B","FORTITUDE VALLEY, NEW FARM","URBAN",1392,null,2.915,2.3816000000000002,null,null,7,0.12837399999999999,0.12837399999999999,1.248E-3,1.248E-3,2,3.3960000000000001E-3,3.3960000000000001E-3,1.0900000000000001E-5,1.0900000000000001E-5]
[null,"MLS14A","FORTITUDE VALLEY","URBAN",220,null,1.008,2.3245,null,null,null,null,null,null,null,2,1.807E-3,1.807E-3,1.7900000000000001E-5,1.7900000000000001E-5]
[null,"MLS15A","EAST BRISBANE, NEW FARM","RURAL",1000,null,4.5720000000000001,1.1432]
[null,"MLS15A","EAST BRISBANE, NEW FARM","URBAN",null,null,4.5720000000000001,1.1432,null,null,3,0.11486399999999999,0.11486399999999999,1.1770000000000001E-3,1.1770000000000001E-3,2,2.4933E-2,2.4933E-2,6.5500000000000006E-5,6.5500000000000006E-5]
[null,"MLS26B","FORTITUDE VALLEY, NEW FARM, TENERIFFE","URBAN",1290,1.6040000000000001,1.544,2.9150999999999998,null,null,3,0.118405,0.118405,1.354E-3,1.354E-3,6,3.2428999999999999E-2,3.2428999999999999E-2,1.1E-4,1.1E-4]
[null,"MLS2A","BOWEN HILLS, BRISBANE, FORTITUDE VALLEY","URBAN",285,0.25600000000000001,2.37,3.2389999999999999]
[null,"MLS6A","BRISBANE, FORTITUDE VALLEY, SPRING HILL","URBAN",225,null,2.3540000000000001,2.7435999999999998]
[null,"MLS90B","FORTITUDE VALLEY","URBAN",62,null,1.22,2.1149,null,null,null,null,null,null,null,1,4.9100000000000001E-4,4.9100000000000001E-4,4.4700000000000002E-5,4.4700000000000002E-5]
[null,"MLS9A","FORTITUDE VALLEY","URBAN",607,null,2.1259999999999999,2.8199000000000001,null,null,2,2.3283999999999999E-2,2.3283999999999999E-2,6.0400000000000004E-4,6.0400000000000004E-4]
[null,"MLS9B","NEW FARM","URBAN",1824,null,4.3109999999999999,3.2389999999999999,null,null,4,7.1634000000000003E-2,7.1634000000000003E-2,1.854E-3,1.854E-3]
[null,"MLSMYV26","FORTITUDE VALLEY","URBAN",27,null,0.48599999999999999,1.5242,null,null,1,1.699E-3,1.699E-3,2.6800000000000001E-5,2.6800000000000001E-5]
[null,"MLT15A","MILTON","URBAN",637,0.46700000000000003,1.536,2.6103000000000001,null,null,2,1.11E-4,1.11E-4,1.99E-6,1.99E-6]
[null,"MLT15B","MILTON","URBAN",98,0.88900000000000001,0.76100000000000001,1.6386000000000001,null,null,1,6.6399999999999999E-4,6.6399999999999999E-4,1.19E-5,1.19E-5,2,1.4619999999999999E-2,1.4619999999999999E-2,3.18E-5,3.18E-5]
[null,"MLT19A","AUCHENFLOWER, MILTON","URBAN",1054,1.131,2.669,2.5912000000000002,null,null,1,1.36E-4,1.36E-4,9.9000000000000005E-7,9.9000000000000005E-7]
[null,"MLT21B","MILTON, PADDINGTON","URBAN",1515,4.3769999999999998,0.53400000000000003,3.7725,null,null,7,0.11984300000000001,0.11984300000000001,1.7570000000000001E-3,1.7570000000000001E-3,16,8.5681999999999994E-2,8.5681999999999994E-2,2.8800000000000001E-4,2.8800000000000001E-4]
[null,"MLT24A","MILTON, PADDINGTON","URBAN",888,2.855,1.355,2.6865000000000001,null,null,9,1.5412E-2,1.5412E-2,1.031E-3,1.031E-3,10,7.2006000000000001E-2,7.2006000000000001E-2,2.5900000000000001E-4,2.5900000000000001E-4]
[null,"MLT3B","MILTON","URBAN",154,null,2.0169999999999999,2.7627000000000002,null,null,2,4.6000000000000001E-4,4.6000000000000001E-4,1.6900000000000001E-5,1.6900000000000001E-5]
[null,"MLT42A","BRISBANE, MILTON, PADDINGTON","URBAN",470,0.56899999999999995,3.383,2.0387,null,null,3,7.0114999999999997E-2,7.0114999999999997E-2,4.6900000000000002E-4,4.6900000000000002E-4,2,5.7060000000000001E-3,5.7060000000000001E-3,1.7900000000000001E-5,1.7900000000000001E-5]
[null,"MLT5A","BRISBANE, MILTON","URBAN",97,null,0.81699999999999995,1.9244000000000001,null,null,null,null,null,null,null,1,2.2790000000000002E-3,2.2790000000000002E-3,6.9500000000000004E-6,6.9500000000000004E-6]
[null,"MLT8B","RED HILL","RURAL",83,null,2.4169999999999998,0.2858]
[null,"MLT8B","RED HILL","URBAN",null,null,2.4169999999999998,0.2858,null,null,1,2.43E-4,2.43E-4,9.9000000000000005E-7,9.9000000000000005E-7,7,5.8219999999999999E-3,5.8219999999999999E-3,4.07E-5,4.07E-5]
[null,"MLTWHP12","AUCHENFLOWER, MILTON","URBAN",83,null,2.7730000000000001,1.6576]
[null,"MLTWHP5","AUCHENFLOWER","URBAN",1,null,2.5489999999999999,1.7719]
[null,"MLTWHP6","MILTON","URBAN",1,null,2.379,2.2101999999999999]
[null,"MLY1","BELLTHORPE, BOOROOBIN, MALENY, REESVILLE, STANMORE, WOOTHA","RURAL",790,71.265000000000001,0.59399999999999997,1.5432999999999999,null,null,28,0.87642399999999998,0.87642399999999998,8.3560000000000006E-3,8.3560000000000006E-3,16,0.308917,0.308917,8.0999999999999996E-4,8.0999999999999996E-4]
[null,"MLY3","CONONDALE, CURRAMORE, ELAMAN CREEK, MALENY, REESVILLE, WITTA","RURAL",2087,81.733999999999995,2.1480000000000001,3.9249000000000001,null,null,45,1.9329769999999999,1.91245,2.1926999999999999E-2,2.1905999999999998E-2,12,0.19763,0.19763,8.3799999999999999E-4,8.3799999999999999E-4]
[null,"MLY4","MALENY, MONTVILLE, NORTH MALENY, WITTA","RURAL",639,35.396000000000001,0.72299999999999998,1.1813,null,null,13,0.203874,0.13728899999999999,4.3730000000000002E-3,4.019E-3,8,0.119933,0.119933,3.7399999999999998E-4,3.7399999999999998E-4]
[null,"MLY6","BALD KNOB, BALMORAL RIDGE, DIAMOND VALLEY, EUDLO, MALENY, MONTVILLE, MOOLOOLAH VALLEY","RURAL",572,36.609000000000002,0.114,1.5242,null,null,17,0.31710100000000002,0.31710100000000002,4.8419999999999999E-3,4.8419999999999999E-3,12,0.13173199999999999,0.13173199999999999,5.5599999999999996E-4,5.5599999999999996E-4]
[null,"MMC19B","BENOWA, BROADBEACH WATERS, BUNDALL","URBAN",1114,4.97,4.7750000000000004,4.2679,null,null,6,1.1181E-2,1.1181E-2,8.6399999999999999E-5,8.6399999999999999E-5,8,9.1354000000000005E-2,9.1354000000000005E-2,2.1599999999999999E-4,2.1599999999999999E-4]
[null,"MMC20A","CLEAR ISLAND WATERS","URBAN",839,0.79900000000000004,3.92,2.2673000000000001,null,null,3,2.0397999999999999E-2,2.0397999999999999E-2,5.0599999999999997E-5,5.0599999999999997E-5]
[null,"MMC21A","CLEAR ISLAND WATERS, MERRIMAC","RURAL",7,1.6439999999999999,3.5179999999999998,0.70499999999999996,null,null,1,3.3500000000000001E-4,3.3500000000000001E-4,2.5600000000000001E-6,2.5600000000000001E-6,5,7.0410000000000004E-3,7.0410000000000004E-3,2.5599999999999999E-5,2.5599999999999999E-5]
[null,"MMC22A","BENOWA, CARRARA","URBAN",1535,2.7909999999999999,12.504,6.6685999999999996,null,null,8,5.5183999999999997E-2,5.5183999999999997E-2,1.4300000000000001E-4,1.4300000000000001E-4,10,6.6221000000000002E-2,6.6221000000000002E-2,2.04E-4,2.04E-4]
[null,"MMC24A","CLEAR ISLAND WATERS, MERMAID WATERS, ROBINA","URBAN",1063,0.53300000000000003,8.9269999999999996,3.2581000000000002,null,null,6,2.5140000000000002E-3,2.5140000000000002E-3,4.07E-5,4.07E-5,1,5.8999999999999998E-5,5.8999999999999998E-5,9.9000000000000005E-7,9.9000000000000005E-7]
[null,"MMC28A","BROADBEACH WATERS, CARRARA, CLEAR ISLAND WATERS, MERRIMAC, NERANG","URBAN",822,1.891,6.4119999999999999,2.9150999999999998,null,null,3,3.2899999999999997E-4,3.2899999999999997E-4,2.9799999999999998E-6,2.9799999999999998E-6]
[null,"MMC30A","BROADBEACH WATERS, MERMAID WATERS","URBAN",326,0.121,3.444,1.1241000000000001,null,null,1,1.64E-4,1.64E-4,9.9000000000000005E-7,9.9000000000000005E-7,1,4.4549999999999998E-3,4.4549999999999998E-3,2.1800000000000001E-5,2.1800000000000001E-5]
[null,"MMC31A","MERMAID WATERS","URBAN",40,null,1.6970000000000001,2.6484000000000001,null,null,null,null,null,null,null,1,1.3100000000000001E-4,1.3100000000000001E-4,3.9700000000000001E-6,3.9700000000000001E-6]
[null,"MMC32A","CLEAR ISLAND WATERS, MERRIMAC","URBAN",10,0.97799999999999998,4.8849999999999998,2.2101999999999999,null,null,null,null,null,null,null,1,5.0000000000000001E-4,5.0000000000000001E-4,3.9700000000000001E-6,3.9700000000000001E-6]
[null,"MMC33A","BROADBEACH WATERS, BUNDALL, SURFERS PARADISE","URBAN",1570,3.8250000000000002,8.9049999999999994,5.9255000000000004,null,null,14,1.6406E-2,1.6406E-2,1.34E-4,1.34E-4,16,0.28287699999999999,0.28287699999999999,6.38E-4,6.38E-4]
[null,"MMIT1","BRISBANE","CBD",33,null,null,null,null,null,1,0.24296100000000001,null,1.023E-3]
[null,"MOMTR1H","BRISBANE","CBD",3]
[null,"MOREXMEA","VERADILLA","RURAL",1,null,1.7999999999999999E-2,null,null,null,null,null,null,null,null,1,5.1E-5,5.1E-5,2.5600000000000001E-6,2.5600000000000001E-6]
[null,"MPATR1H","BRISBANE","CBD",1,null,null,null,null,null,1,6.0740000000000002E-2,null,2.5599999999999999E-4]
[null,"MRB1","GLEN ESK","RURAL",2,0.77800000000000002,0.02,9.5299999999999996E-2,null,null,4,8.4999999999999995E-4,8.4999999999999995E-4,1.03E-5,1.03E-5]
[null,"MRB2","ESK, GLEN ESK, MOOMBRA, MURRUMBA, TOOGOOLAWAH, WIVENHOE POCKET","RURAL",48,34.881999999999998,7.3999999999999996E-2,0.13339999999999999,null,null,11,3.3079999999999998E-2,3.3022999999999997E-2,6.6100000000000002E-4,6.5899999999999997E-4,2,2.9228000000000001E-2,2.9228000000000001E-2,7.1799999999999997E-5,7.1799999999999997E-5]
[null,"MRD6",null,"URBAN",null,null,0.64900000000000002,null,null,null,6,1.23E-3,1.109E-3,2.6600000000000001E-4,2.6400000000000002E-4,1,7.7399999999999995E-4,null,9.9299999999999998E-6]
[null,"MRDSAH1","SPRING HILL","URBAN",1,null,0.375]
[null,"MRDT1","SPRING HILL","URBAN",1,null,null,null,null,null,null,null,null,null,null,1,1.01E-4,1.01E-4,9.9000000000000005E-7,9.9000000000000005E-7]
[null,"MRDVPK17",null,"URBAN",null,null,2.4049999999999998,0.68589999999999995,null,null,1,1.7200000000000001E-4,1.7200000000000001E-4,5.5600000000000003E-5,5.5600000000000003E-5]
[null,"MRE1","MURARRIE","URBAN",320,1.1040000000000001,3.3079999999999998,3.5438999999999998,null,null,2,1.6000000000000001E-4,1.6000000000000001E-4,1.99E-6,1.99E-6,1,1.2260000000000001E-3,1.2260000000000001E-3,1.8899999999999999E-5,1.8899999999999999E-5]
[null,"MRE2","CANNON HILL, MURARRIE","URBAN",708,5.1790000000000003,3.052,4.6871,null,null,5,2.8289999999999999E-3,2.8289999999999999E-3,1.7900000000000001E-5,1.7900000000000001E-5,11,2.9936999999999998E-2,2.9936999999999998E-2,1.4200000000000001E-4,1.4200000000000001E-4]
[null,"MRE3","CANNON HILL, MURARRIE, TINGALPA","URBAN",691,3.089,1.1100000000000001,3.7343999999999999,null,null,3,9.6150000000000003E-3,9.6150000000000003E-3,7.4400000000000006E-5,7.4400000000000006E-5,5,6.038E-3,6.038E-3,1.9899999999999999E-5,1.9899999999999999E-5]
[null,"MRE4A","MURARRIE","URBAN",14,null,2.492,4.4203000000000001]
[null,"MRE5A","MURARRIE","URBAN",1,null,1.6080000000000001,3.4296000000000002]
[null,"MRE7A","MURARRIE","URBAN",43,null,null,1.5242]
[null,"MRE8","MURARRIE, TINGALPA","URBAN",226,2.5870000000000002,1.863,4.9919000000000002,null,null,3,1.6429999999999999E-3,1.6429999999999999E-3,2.2599999999999999E-4,2.2599999999999999E-4]
[null,"MRK1","YEERONGPILLY","URBAN",37,0.40500000000000003,1.6060000000000001,0.66690000000000005]
[null,"MRK2","MOOROOKA","URBAN",714,2.4670000000000001,0.106,2.5912000000000002,null,null,2,2.33E-4,2.33E-4,1.99E-6,1.99E-6,14,4.8334000000000002E-2,4.6864999999999997E-2,2.33E-4,2.2800000000000001E-4]
[null,"MRK3","MOOROOKA, YEERONGPILLY, YERONGA","URBAN",1274,4.0339999999999998,1.861,2.5912000000000002,null,null,5,1.7706E-2,1.7706E-2,1.46E-4,1.46E-4,16,0.115837,0.115837,4.3600000000000003E-4,4.3600000000000003E-4]
[null,"MRK5A","ANNERLEY, MOOROOKA, TARRAGINDI","URBAN",1615,6.6859999999999999,0.32400000000000001,3.1819000000000002,null,null,11,3.4679000000000001E-2,3.4280999999999999E-2,4.95E-4,4.9399999999999997E-4,14,4.5938E-2,4.5938E-2,2.1499999999999999E-4,2.1499999999999999E-4]
[null,"MRK6","ANNERLEY, MOOROOKA, YEERONGPILLY, YERONGA","URBAN",1842,4.6589999999999998,0.70099999999999996,3.1057000000000001,null,null,7,2.0877E-2,2.0877E-2,2.33E-4,2.33E-4,8,1.9595999999999999E-2,1.9595999999999999E-2,8.8300000000000005E-5,8.8300000000000005E-5]
[null,"MRK7A","MOOROOKA, YEERONGPILLY","URBAN",66,0.438,2.2989999999999999,3.1819000000000002]
[null,"MRK8","MOOROOKA, YEERONGPILLY","URBAN",149,1.1339999999999999,0.80200000000000005,1.0288999999999999,null,null,2,1.36E-4,null,1.99E-6,null,6,3.5705000000000001E-2,2.2804999999999999E-2,1.46E-4,7.0500000000000006E-5]
[null,"MRK9","MOOROOKA","URBAN",1147,2.9620000000000002,0.28299999999999997,2.1720999999999999,null,null,8,7.5160000000000001E-3,7.5160000000000001E-3,1.3899999999999999E-4,1.3899999999999999E-4,19,7.7170000000000002E-2,6.2772999999999995E-2,3.1500000000000001E-4,2.6600000000000001E-4]
[null,"MST20B","BRISBANE, SPRING HILL","URBAN",267,null,2.0590000000000002,1.3717999999999999]
[null,"MSTSEQ30","BRISBANE","CBD",11,null,0.63100000000000001,1.8482000000000001]
[null,"MSTSGI11","BRISBANE","CBD",1,null,0.877,1.2194]
[null,"MSV1","CAFFEY, LEFT HAND BRANCH, MT SYLVIA, UPPER TENTHILL","RURAL",124,29.724,null,0.55249999999999999,null,null,3,2.0591999999999999E-2,2.0591999999999999E-2,3.3100000000000002E-4,3.3100000000000002E-4,7,6.2673000000000006E-2,6.2673000000000006E-2,1.8699999999999999E-4,1.8699999999999999E-4]
[null,"MSV2","BLACK DUCK CREEK, EAST HALDON, JUNCTION VIEW, LEFT HAND BRANCH, MT SYLVIA, WOODBINE","RURAL",138,49.82,null,0.93359999999999999,null,null,4,8.1355999999999998E-2,8.1355999999999998E-2,4.26E-4,4.26E-4,4,2.3400000000000001E-3,2.3400000000000001E-3,1.5400000000000002E-5,1.5400000000000002E-5]
[null,"MTB13A","TAMBORINE MOUNTAIN","RURAL",1525,21.463999999999999,1.2849999999999999,3.6200999999999999,null,null,24,0.45905600000000002,0.45905600000000002,4.5760000000000002E-3,4.5760000000000002E-3,10,8.7040000000000006E-2,8.7040000000000006E-2,3.2600000000000001E-4,3.2600000000000001E-4]
[null,"MTB15A","BEECHMONT, BENOBBLE, BINNA BURRA, CANUNGRA, FERNY GLEN, FLYING FOX, ILLINBAH, LOWER BEECHMONT, PINE CREEK, SARABAH, TAMBORINE MOUNTAIN, WITHEREN","RURAL",767,91.745999999999995,2.5779999999999998,3.3151999999999999,null,null,25,0.68084999999999996,0.68084999999999996,7.5700000000000003E-3,7.5700000000000003E-3,18,0.212841,0.21230199999999999,7.4299999999999995E-4,7.3800000000000005E-4]
[null,"MTB16A","BENOBBLE, BOYLAND, WONGLEPONG","RURAL",381,28.713999999999999,2.387,1.3337000000000001,null,null,8,5.4587999999999998E-2,5.4587999999999998E-2,1.0920000000000001E-3,1.0920000000000001E-3,6,6.698E-3,6.698E-3,7.1799999999999997E-5,7.1799999999999997E-5]
[null,"MTB17A","GUANABA, MAUDSLAND, TAMBORINE MOUNTAIN","RURAL",476,30.981000000000002,1.9119999999999999,1.2766,null,null,18,7.2306999999999996E-2,7.1551000000000003E-2,5.0500000000000002E-4,5.0000000000000001E-4,11,0.11719400000000001,0.11719400000000001,3.8200000000000002E-4,3.8200000000000002E-4]
[null,"MTB1B","TAMBORINE MOUNTAIN","RURAL",1455,24.544,0.56799999999999995,null,null,null,21,0.24183299999999999,0.24183299999999999,6.9569999999999996E-3,6.9569999999999996E-3,9,0.42569400000000002,0.42569400000000002,1.1019999999999999E-3,1.1019999999999999E-3]
[null,"MTB2A","BENOBBLE, BIDDADDABA, BOYLAND, CANUNGRA, SARABAH, TABRAGALBA, WONGLEPONG","RURAL",683,71.164000000000001,0.44500000000000001,2.0768,null,null,15,4.9027000000000001E-2,4.5241999999999997E-2,1.9919999999999998E-3,1.9889999999999999E-3,6,4.7281999999999998E-2,4.7281999999999998E-2,1.6100000000000001E-4,1.6100000000000001E-4]
[null,"MTB3A","CLAGIRABA, GUANABA, MAUDSLAND, MOUNT NATHAN, TAMBORINE MOUNTAIN","RURAL",1062,32.816000000000003,4.2779999999999996,2.8389000000000002,null,null,13,0.79277299999999995,0.41649399999999998,8.9460000000000008E-3,8.1259999999999995E-3,14,0.237485,0.237485,7.3099999999999999E-4,7.3099999999999999E-4]
[null,"MTG11A","UPPER MT GRAVATT, WISHART","URBAN",826,5.0030000000000001,0.39700000000000002,1.8863000000000001,null,null,3,1.2113000000000001E-2,1.2113000000000001E-2,9.4300000000000002E-5,9.4300000000000002E-5,7,1.2670000000000001E-2,1.2670000000000001E-2,6.3499999999999999E-5,6.3499999999999999E-5]
[null,"MTG12B","MT GRAVATT","URBAN",536,1.8540000000000001,0.22500000000000001,1.3909,null,null,3,7.2870000000000001E-3,7.2870000000000001E-3,1.5300000000000001E-4,1.5300000000000001E-4,2,1.98E-3,1.98E-3,9.9299999999999998E-6,9.9299999999999998E-6]
[null,"MTG13A","UPPER MT GRAVATT, WISHART","URBAN",1855,5.0190000000000001,4.0970000000000004,4.1345000000000001,null,null,13,0.26624100000000001,0.26624100000000001,1.977E-3,1.977E-3,27,0.16816999999999999,0.16816999999999999,6.7199999999999996E-4,6.7199999999999996E-4]
[null,"MTG15A","MANSFIELD, WISHART","URBAN",708,2.7330000000000001,2.4870000000000001,1.6005,null,null,4,7.7800000000000005E-4,7.7800000000000005E-4,1.29E-5,1.29E-5,10,7.2454000000000005E-2,7.2454000000000005E-2,2.6400000000000002E-4,2.6400000000000002E-4]
[null,"MTG16A","MT GRAVATT EAST","URBAN",657,2.9569999999999999,0.249,1.2384999999999999,null,null,6,1.2286999999999999E-2,1.2286999999999999E-2,1.3300000000000001E-4,1.3300000000000001E-4,14,4.1471000000000001E-2,4.1471000000000001E-2,1.8599999999999999E-4,1.8599999999999999E-4]
[null,"MTG3A","MACGREGOR, MT GRAVATT, NATHAN, UPPER MT GRAVATT","URBAN",1152,6.85,2.742,4.1726000000000001,null,null,9,1.7923000000000001E-2,1.7923000000000001E-2,2.05E-4,2.05E-4,7,2.1972999999999999E-2,2.1972999999999999E-2,7.3499999999999998E-5,7.3499999999999998E-5]
[null,"MTG4B","HOLLAND PARK WEST, MT GRAVATT, NATHAN","URBAN",1501,9.42,1.82,4.1536,null,null,7,3.7989999999999999E-3,3.7989999999999999E-3,2.1800000000000001E-5,2.1800000000000001E-5,5,1.5923E-2,1.5923E-2,6.4499999999999996E-5,6.4499999999999996E-5]
[null,"MTG5A","MT GRAVATT EAST","URBAN",530,2.1019999999999999,0.51400000000000001,2.153,null,null,null,null,null,null,null,6,1.4063000000000001E-2,1.4063000000000001E-2,6.1500000000000004E-5,6.1500000000000004E-5]
[null,"MTG7A","MANSFIELD, MT GRAVATT EAST, UPPER MT GRAVATT","URBAN",1672,8.2240000000000002,1.8460000000000001,4.5918000000000001,null,null,6,1.5523E-2,1.5523E-2,1.92E-4,1.92E-4,8,2.6023999999999999E-2,2.6023999999999999E-2,1.15E-4,1.15E-4]
[null,"MTG8A","MT GRAVATT, MT GRAVATT EAST","URBAN",1049,3.1920000000000002,0.68899999999999995,2.2673000000000001,null,null,3,3.0049999999999999E-3,3.0049999999999999E-3,2.2799999999999999E-5,2.2799999999999999E-5,14,8.5447999999999996E-2,8.5447999999999996E-2,3.01E-4,3.01E-4]
[null,"MTN2",null,"URBAN",1,null,3.7010000000000001,3.5438999999999998]
[null,"MTN7A",null,"URBAN",1,null,3.8860000000000001]
[null,"MTNQBI9","PINKENBA","URBAN",10,2.9649999999999999,0.35699999999999998,4.0773999999999999]
[null,"MTNWLP5","PINKENBA","RURAL",101,3.444,3.2669999999999999,1.8672,null,null,2,8.2899999999999998E-4,8.2899999999999998E-4,5.13E-6,5.13E-6,6,9.7970000000000002E-3,7.7669999999999996E-3,3.8399999999999998E-5,3.3300000000000003E-5]
[null,"MTS62","SPRING HILL","CBD",1]
[null,"MTST1","SPRING HILL","CBD",14]
[null,"MUF17","BRISBANE","CBD",10,null,8.3000000000000004E-2]
[null,"MUFT1","BRISBANE","CBD",6]
[null,"MYSTR1H","BRISBANE","CBD",3]
[null,"MYV4","FORTITUDE VALLEY","URBAN",1,null,null,null,null,null,1,1.26E-4,1.26E-4,1.99E-6,1.99E-6]
[null,"MYVT1","FORTITUDE VALLEY","URBAN",125,null,null,null,null,null,1,7.5519999999999997E-3,7.5519999999999997E-3,1.1900000000000001E-4,1.1900000000000001E-4]
[null,"NBHT1","BRISBANE","CBD",1]
[null,"NBR11A","DIDDILLIBAH, KIELS MOUNTAIN, NAMBOUR, ROSEMOUNT, WOOMBYE","RURAL",1424,24.721,1.516,2.8961000000000001,null,null,23,0.772845,0.772845,5.7749999999999998E-3,5.7749999999999998E-3,40,0.63923200000000002,0.62902499999999995,2.0990000000000002E-3,2.0430000000000001E-3]
[null,"NBR12A","BURNSIDE, DULONG, FLAXTON, HIGHWORTH, IMAGE FLAT, KUREELPA, MAPLETON, NAMBOUR, PERWILLOWEN","RURAL",1835,51.494999999999997,5.0960000000000001,4.1726000000000001,null,null,22,2.1355369999999998,0.87504499999999996,1.1655E-2,6.9490000000000003E-3,44,1.712728,1.712423,5.4270000000000004E-3,5.424E-3]
[null,"NBR13A","BURNSIDE, NAMBOUR","URBAN",1295,7.5410000000000004,4.0679999999999996,4.0011999999999999,null,null,8,0.10531600000000001,0.10531600000000001,1.346E-3,1.346E-3,12,4.5415999999999998E-2,4.5415999999999998E-2,1.7000000000000001E-4,1.7000000000000001E-4]
[null,"NBR15A","IMAGE FLAT, KIAMBA, KULANGOOR, NAMBOUR, YANDINA","RURAL",560,25.96,1.216,1.6767000000000001,null,null,5,0.54756000000000005,0.54756000000000005,2.689E-3,2.689E-3,12,0.13178599999999999,0.13178599999999999,5.1000000000000004E-4,5.1000000000000004E-4]
[null,"NBR16A","NAMBOUR","URBAN",366,1.6859999999999999,0.747,1.1813,null,null,1,4.2400000000000001E-4,4.2400000000000001E-4,9.9000000000000005E-7,9.9000000000000005E-7,2,7.5750000000000001E-3,7.5750000000000001E-3,6.5500000000000006E-5,6.5500000000000006E-5]
[null,"NBR17A","NAMBOUR","URBAN",56,0.99,1.421,2.3816000000000002]
[null,"NBR2B","NAMBOUR","URBAN",670,3.7719999999999998,1.7290000000000001,4.4775,null,null,7,1.6778999999999999E-2,1.6778999999999999E-2,1.17E-4,1.17E-4,4,3.3727E-2,3.3727E-2,1.16E-4,1.16E-4]
[null,"NBR3B","NAMBOUR","URBAN",1330,6.3410000000000002,1.95,4.6871,null,null,6,2.9960000000000001E-2,2.9960000000000001E-2,1.3190000000000001E-3,1.3190000000000001E-3,2,6.1399999999999996E-4,6.1399999999999996E-4,4.9599999999999999E-6,4.9599999999999999E-6]
[null,"NBR4A","BLI BLI, IMAGE FLAT, MAROOCHY RIVER, NAMBOUR, NORTH ARM, PARKLANDS, VALDORA, YANDINA, YANDINA CREEK","RURAL",869,45.506999999999998,2.3290000000000002,3.6772,null,null,15,0.35333599999999998,0.35333599999999998,4.4520000000000002E-3,4.4520000000000002E-3,29,0.58454099999999998,0.58454099999999998,2.0149999999999999E-3,2.0149999999999999E-3]
[null,"NBR5A","COOLOOLABIN, IMAGE FLAT, KIAMBA, KUREELPA, NAMBOUR, YANDINA","RURAL",1353,31.815999999999999,0.96699999999999997,2.9912999999999998,null,null,17,0.76982499999999998,0.76982499999999998,8.4229999999999999E-3,8.4229999999999999E-3,18,0.79862699999999998,0.79862699999999998,2.7070000000000002E-3,2.7070000000000002E-3]
[null,"NBR7A","BLI BLI, NAMBOUR, ROSEMOUNT","RURAL",2430,48.969000000000001,5.4909999999999997,6.1542000000000003,null,null,14,0.63122999999999996,0.63122999999999996,1.4367E-2,1.4367E-2,17,0.19780200000000001,0.19780200000000001,9.5399999999999999E-4,9.5399999999999999E-4]
[null,"NBR8A","NAMBOUR","URBAN",1,null,1.841,3.3915000000000002]
[null,"NBTTR1H","BRISBANE","CBD",1]
[null,"NDC3",null,"CBD",1,null,null,null,null,null,2,7.8712000000000004E-2,1.7971000000000001E-2,5.1199999999999998E-4,2.5599999999999999E-4]
[null,"NDH1","NORTHGATE, NUNDAH, VIRGINIA, WAVELL HEIGHTS","URBAN",1184,2.2349999999999999,0.374,2.7435999999999998,null,null,3,4.1529999999999996E-3,4.1529999999999996E-3,1.1770000000000001E-3,1.1770000000000001E-3,3,9.0130000000000002E-3,9.0130000000000002E-3,3.3699999999999999E-5,3.3699999999999999E-5]
[null,"NDH10","NORTHGATE, NUNDAH, VIRGINIA, WAVELL HEIGHTS","URBAN",783,3.1150000000000002,1.7450000000000001,1.9815,null,null,7,5.4328000000000001E-2,5.4328000000000001E-2,1.5839999999999999E-3,1.5839999999999999E-3,2,1.3025E-2,1.3025E-2,5.1600000000000001E-5,5.1600000000000001E-5]
[null,"NDH12","NUNDAH","URBAN",807,2.2090000000000001,1.91,1.4861,null,null,6,1.848E-3,1.848E-3,9.0799999999999995E-4,9.0799999999999995E-4,3,1.4335000000000001E-2,1.4335000000000001E-2,4.6699999999999997E-5,4.6699999999999997E-5]
[null,"NDH5A","HENDRA, NORTHGATE, NUNDAH","URBAN",2474,4.6719999999999997,1.0720000000000001,3.2008999999999999,null,null,9,2.6703000000000001E-2,2.6703000000000001E-2,2.5110000000000002E-3,2.5110000000000002E-3,13,7.5348999999999999E-2,7.5348999999999999E-2,2.81E-4,2.81E-4]
[null,"NDH6","NUNDAH, WAVELL HEIGHTS","URBAN",1949,5.625,0.59199999999999997,3.4296000000000002,null,null,10,2.2966E-2,2.2966E-2,2.1580000000000002E-3,2.1580000000000002E-3,5,2.0792000000000001E-2,2.0792000000000001E-2,7.25E-5,7.25E-5]
[null,"NDH7","NORTHGATE, NUNDAH, VIRGINIA","URBAN",1585,4.5979999999999999,1.9119999999999999,3.4485999999999999,null,null,2,2.366E-3,2.366E-3,1.5510000000000001E-3,1.5510000000000001E-3,4,1.044E-2,1.044E-2,3.6699999999999998E-5,3.6699999999999998E-5]
[null,"NDH8","NUNDAH, WAVELL HEIGHTS","URBAN",1271,2.863,1.8260000000000001,2.7054999999999998,null,null,7,0.213476,0.213476,5.1029999999999999E-3,5.1029999999999999E-3,4,2.3279000000000001E-2,2.3279000000000001E-2,7.4400000000000006E-5,7.4400000000000006E-5]
[null,"NDH9","NUNDAH","URBAN",339,0.65600000000000003,1.2629999999999999,2.7818000000000001,null,null,2,3.6304000000000003E-2,3.6304000000000003E-2,3.2200000000000002E-4,3.2200000000000002E-4,1,1.1670000000000001E-3,1.1670000000000001E-3,6.9500000000000004E-6,6.9500000000000004E-6]
[null,"NGE12","BANYO, NUDGEE","URBAN",877,4.1479999999999997,2.7120000000000002,2.7435999999999998,null,null,2,1.2096000000000001E-2,1.2096000000000001E-2,1.2899999999999999E-4,1.2899999999999999E-4,4,1.8438E-2,1.8438E-2,6.1500000000000004E-5,6.1500000000000004E-5]
[null,"NGE13","BANYO, NORTHGATE","URBAN",204,2.2770000000000001,2.7040000000000002,4.5156000000000001,null,null,3,4.3070000000000001E-3,4.3070000000000001E-3,3.2799999999999998E-5,3.2799999999999998E-5]
[null,"NGE2A","NORTHGATE","URBAN",287,1.3759999999999999,1.353,1.4671000000000001,null,null,1,7.7000000000000001E-5,7.7000000000000001E-5,9.9000000000000005E-7,9.9000000000000005E-7,1,2.2629999999999998E-3,2.2629999999999998E-3,5.9599999999999997E-6,5.9599999999999997E-6]
[null,"NGE2B","BANYO","URBAN",48,null,4.8330000000000002,4.5537000000000001]
[null,"NGE4A","BANYO, NORTHGATE","URBAN",174,1.51,2.7730000000000001,2.8199000000000001,null,null,null,null,null,null,null,2,2.6359999999999999E-3,2.6359999999999999E-3,1.7900000000000001E-5,1.7900000000000001E-5]
[null,"NGE4B","BANYO, NUDGEE, NUDGEE BEACH","RURAL",552,6.2679999999999998,4.9539999999999997,2.5912000000000002,null,null,1,4.6099999999999998E-4,4.6099999999999998E-4,2.5600000000000001E-6,2.5600000000000001E-6,1,3.0499999999999999E-4,3.0499999999999999E-4,2.5600000000000001E-6,2.5600000000000001E-6]
[null,"NGE4B","BANYO, NUDGEE, NUDGEE BEACH","URBAN",552,6.2679999999999998,4.9539999999999997,2.5912000000000002,null,null,null,null,null,null,null,3,0.109736,0.109736,2.41E-4,2.41E-4]
[null,"NGE7","BANYO, NORTHGATE, NUDGEE","URBAN",1077,4.24,2.9249999999999998,2.6484000000000001,null,null,3,0.123712,0.123712,2.013E-3,2.013E-3,6,2.2391999999999999E-2,2.2391999999999999E-2,6.6500000000000004E-5,6.6500000000000004E-5]
[null,"NGI1B","DONNYBROOK, MELDALE, NINGI, TOORBUL","RURAL",1280,35.350999999999999,1.0069999999999999,3.1627999999999998,null,null,11,0.16772799999999999,0.16772799999999999,3.571E-3,3.571E-3,2,2.0053000000000001E-2,2.0053000000000001E-2,1E-4,1E-4]
[null,"NGI2B","BEACHMERE, NINGI","RURAL",727,17.451000000000001,1.974,2.3054000000000001,null,null,9,7.3627999999999999E-2,7.3627999999999999E-2,2.0070000000000001E-3,2.0070000000000001E-3,11,6.5046999999999994E-2,6.5046999999999994E-2,3.9500000000000001E-4,3.9500000000000001E-4]
[null,"NGI3A","BEACHMERE, CABOOLTURE, NINGI","RURAL",1378,33.911000000000001,1.587,3.3723999999999998,null,null,10,0.74324999999999997,0.74324999999999997,1.3804E-2,1.3804E-2,31,0.80367,0.80367,2.65E-3,2.65E-3]
[null,"NIP1A","COALFALLS, SADLIERS CROSSING, WOODEND","URBAN",930,5.4580000000000002,0.33400000000000002,2.7054999999999998,null,null,9,4.7107999999999997E-2,4.7107999999999997E-2,3.9300000000000001E-4,3.9300000000000001E-4]
[null,"NIP2A","BRASSALL, NORTH IPSWICH","URBAN",1045,7.77,1.5029999999999999,3.1057000000000001,null,null,6,1.5734000000000001E-2,1.5734000000000001E-2,1.35E-4,1.35E-4,9,1.5502E-2,1.5502E-2,8.9300000000000002E-5,8.9300000000000002E-5]
[null,"NIP3A","EAST IPSWICH, NORTH IPSWICH","RURAL",544,4.0679999999999996,0.59699999999999998,1.2384999999999999,null,null,5,0.149225,0.149225,1.397E-3,1.397E-3]
[null,"NIP4A","BRASSALL, CHUWAR, KHOLO, MUIRLEA, NORTH IPSWICH, PINE MOUNTAIN, TIVOLI","RURAL",1486,35.228999999999999,0.39800000000000002,3.601,null,null,22,2.6818999999999999E-2,2.6818999999999999E-2,1.6899999999999999E-4,1.6899999999999999E-4,18,0.207617,0.207617,7.1500000000000003E-4,7.1500000000000003E-4]
[null,"NIP5A","CHUWAR, MOORES POCKET, NORTH IPSWICH, TIVOLI","URBAN",1258,7.6790000000000003,0.432,2.8389000000000002,null,null,8,6.4599999999999996E-3,6.051E-3,8.8300000000000005E-5,8.7299999999999994E-5,7,2.4427000000000001E-2,2.4427000000000001E-2,1.34E-4,1.34E-4]
[null,"NIP5B","BRASSALL","URBAN",962,5.2370000000000001,0.56000000000000005,3.3151999999999999,null,null,2,9.7929999999999996E-3,9.7929999999999996E-3,3.3699999999999999E-5,3.3699999999999999E-5,3,4.8690000000000001E-3,4.8690000000000001E-3,2.9799999999999999E-5,2.9799999999999999E-5]
[null,"NIP6A","NORTH IPSWICH","URBAN",304,2.105,0.31900000000000001,1.4671000000000001,null,null,4,4.3899999999999999E-4,3.6699999999999998E-4,3.9700000000000001E-6,2.9799999999999998E-6,3,3.225E-3,3.225E-3,2.0800000000000001E-5,2.0800000000000001E-5]
[null,"NIP6B",null,"URBAN",1,0.11700000000000001,4.2999999999999997E-2,0.7621]
[null,"NIP7A","NORTH IPSWICH","URBAN",11,null,2.2970000000000002,3.6772,null,null,null,null,null,null,null,1,2.4239999999999999E-3,2.4239999999999999E-3,1.0900000000000001E-5,1.0900000000000001E-5]
[null,"NMC13A","JIMBOOMBA, NORTH MACLEAN","RURAL",843,8.3689999999999998,8.1829999999999998,2.8769999999999998,null,null,3,5.5050000000000003E-3,5.5050000000000003E-3,7.9499999999999994E-5,7.9499999999999994E-5,4,5.9256000000000003E-2,5.9256000000000003E-2,1.95E-4,1.95E-4]
[null,"NMC15A","CHAMBERS FLAT, GREENBANK, MUNRUBEN, NORTH MACLEAN, SOUTH MACLEAN, STOCKLEIGH","RURAL",401,23.861999999999998,0.29399999999999998,2.1911,null,null,8,0.142433,0.142433,1.238E-3,1.238E-3,6,5.6214E-2,5.6214E-2,2.92E-4,2.92E-4]
[null,"NMC16A","GREENBANK, MUNRUBEN, PARK RIDGE, PARK RIDGE SOUTH","RURAL",911,23.646999999999998,1.5720000000000001,2.9531999999999998,null,null,15,6.7089999999999997E-3,6.7089999999999997E-3,9.7399999999999996E-5,9.7399999999999996E-5]
[null,"NMC1B","GREENBANK, NORTH MACLEAN","RURAL",696,27.338999999999999,6.65,2.4388000000000001,null,null,10,3.3536000000000003E-2,3.3536000000000003E-2,2.2599999999999999E-4,2.2599999999999999E-4]
[null,"NMC2A","GREENBANK, NEW BEITH","RURAL",989,20.202000000000002,7.859,3.5819999999999999,null,null,9,0.40566099999999999,1.1785E-2,2.6150000000000001E-3,8.7200000000000005E-5,5,2.0022000000000002E-2,2.0022000000000002E-2,1.6699999999999999E-4,1.6699999999999999E-4]
[null,"NMC3A","GREENBANK, MUNRUBEN, PARK RIDGE, PARK RIDGE SOUTH","RURAL",1026,36.926000000000002,2.1429999999999998,4.0773999999999999,null,null,28,1.389165,0.145897,1.0133E-2,4.875E-3,18,0.300589,0.300589,9.6900000000000003E-4,9.6900000000000003E-4]
[null,"NMC3B","GREENBANK, NEW BEITH","RURAL",1256,11.648,16.625,4.2298,null,null,11,1.1548320000000001,6.9191000000000003E-2,9.495E-3,3.2200000000000002E-3,2,1.4196E-2,1.4196E-2,1.3300000000000001E-4,1.3300000000000001E-4]
[null,"NMC5A","GREENBANK, JIMBOOMBA, NORTH MACLEAN, SHAILER PARK, SOUTH MACLEAN","RURAL",1085,31.617999999999999,4.8010000000000002,3.1627999999999998,null,null,13,0.35590699999999997,0.35590699999999997,5.8700000000000002E-3,5.8700000000000002E-3,15,0.29294999999999999,0.29294999999999999,8.1499999999999997E-4,8.1499999999999997E-4]
[null,"NMET1","BRISBANE","CBD",1,null,null,null,null,null,1,3.5815E-2,3.5815E-2,2.5599999999999999E-4,2.5599999999999999E-4]
[null,"NMEWGC5","BRISBANE","CBD",1,null,0.30599999999999999]
[null,"NMK11A","ALDERLEY, ASHGROVE, KELVIN GROVE, NEWMARKET","URBAN",1209,4.5170000000000003,2.8879999999999999,3.4485999999999999,null,null,9,0.118825,0.118825,1.2130000000000001E-3,1.2130000000000001E-3,4,1.2565E-2,1.2565E-2,5.7599999999999997E-5,5.7599999999999997E-5]
[null,"NMK12A","ALDERLEY, GRANGE, NEWMARKET, STAFFORD","URBAN",1515,6.3310000000000004,0.872,4.4584000000000001,null,null,8,7.6000000000000004E-4,7.6000000000000004E-4,7.9400000000000002E-6,7.9400000000000002E-6,23,9.0244000000000005E-2,9.0244000000000005E-2,3.4299999999999999E-4,3.4299999999999999E-4]
[null,"NMK16A","HERSTON, KELVIN GROVE","URBAN",1208,5.4029999999999996,4.84,2.2292000000000001,null,null,6,4.5582999999999999E-2,4.5582999999999999E-2,6.7100000000000005E-4,6.7100000000000005E-4,5,6.0750999999999999E-2,5.4517000000000003E-2,2.3499999999999999E-4,1.9599999999999999E-4]
[null,"NMK17A","WILSTON, WINDSOR","URBAN",1008,2.7349999999999999,0.11,1.9624999999999999,null,null,3,4.8799999999999999E-4,4.8799999999999999E-4,2.9799999999999998E-6,2.9799999999999998E-6,4,2.7174E-2,2.7174E-2,1.0399999999999999E-4,1.0399999999999999E-4]
[null,"NMK3A","WINDSOR","URBAN",770,2.391,2.831,4.2107000000000001,null,null,5,1.2253999999999999E-2,1.2253999999999999E-2,3.9700000000000003E-5,3.9700000000000003E-5,3,7.685E-3,7.685E-3,5.9599999999999999E-5,5.9599999999999999E-5]
[null,"NMK4A","GRANGE, LUTWYCHE, WILSTON, WINDSOR","URBAN",1263,5.5389999999999997,0.33800000000000002,3.3342999999999998,null,null,2,1.13E-4,1.13E-4,1.99E-6,1.99E-6,13,3.0453000000000001E-2,2.9524000000000002E-2,1.47E-4,1.3899999999999999E-4]
[null,"NMK5A","KELVIN GROVE, NEWMARKET, WILSTON","URBAN",519,2.2490000000000001,0.30599999999999999,1.5624,null,null,2,2.6499999999999999E-4,2.6499999999999999E-4,1.99E-6,1.99E-6,2,8.652E-3,8.652E-3,2.7800000000000001E-5,2.7800000000000001E-5]
[null,"NMK9A","ALDERLEY, GRANGE, NEWMARKET","URBAN",1335,4.5789999999999997,0.66100000000000003,3.6962999999999999,null,null,6,3.3278000000000002E-2,3.3278000000000002E-2,3.3700000000000001E-4,3.3700000000000001E-4,10,3.6413000000000001E-2,3.6413000000000001E-2,2.05E-4,2.05E-4]
[null,"NPD1","JOYNER, KURWONGBAH, WHITESIDE","URBAN",3,2.2810000000000001,0.17699999999999999,1.0669999999999999,null,null,null,null,null,null,null,1,1.6100000000000001E-3,1.6100000000000001E-3,9.9000000000000005E-7,9.9000000000000005E-7]
[null,"NPDTR1","JOYNER","URBAN",1]
[null,"NPM33","BRISBANE","CBD",1,null,0.24099999999999999]
[null,"NPMT1","BRISBANE","CBD",2]
[null,"NRA12A","NARANGBA","URBAN",68,2.4319999999999999,0.61699999999999999,1.1051,null,null,5,6.5139999999999998E-3,6.5139999999999998E-3,2.8799999999999999E-5,2.8799999999999999E-5,3,2.81E-3,2.81E-3,1.8899999999999999E-5,1.8899999999999999E-5]
[null,"NRA13A","DAKABIN, KALLANGUR, KURWONGBAH, NARANGBA","RURAL",2801,14.439,7.1970000000000001,5.0491000000000001,null,null,15,1.1945049999999999,4.2735000000000002E-2,1.4655E-2,7.4999999999999997E-3,10,4.2984000000000001E-2,3.6686000000000003E-2,1.6699999999999999E-4,1.44E-4]
[null,"NRA15A","BURPENGARY, NARANGBA","RURAL",1803,8.4719999999999995,10.074999999999999,4.5537000000000001,null,null,10,0.59051799999999999,0.59051799999999999,4.7039999999999998E-3,4.7039999999999998E-3,10,8.2369999999999999E-2,8.2369999999999999E-2,3.8699999999999997E-4,3.8699999999999997E-4]
[null,"NRA16A","DAKABIN, KURWONGBAH, NARANGBA","RURAL",273,17.838000000000001,1.5169999999999999,0.97170000000000001,null,null,4,0.66203299999999998,2.0822E-2,1.407E-3,6.9999999999999999E-4,4,1.0501999999999999E-2,1.0501999999999999E-2,8.7200000000000005E-5,8.7200000000000005E-5,null,null," "]
[null,"NRA1A","KURWONGBAH, MOORINA, MORAYFIELD, NARANGBA","RURAL",821,47.243000000000002,1.518,3.4866999999999999,null,null,23,0.73290900000000003,0.73290900000000003,7.3289999999999996E-3,7.3289999999999996E-3,14,0.20967,0.20443,8.1300000000000003E-4,7.7200000000000001E-4]
[null,"NRA2A","NARANGBA","URBAN",51,1.8140000000000001,1.117,3.5629,null,null,3,1.1774E-2,1.1774E-2,1.47E-4,1.47E-4,3,1.276E-3,1.276E-3,9.9299999999999998E-6,9.9299999999999998E-6]
[null,"NRA3B","NARANGBA","URBAN",112,5.165,3.766,5.1634000000000002,null,null,3,1.1140000000000001E-2,1.1140000000000001E-2,3.1799999999999998E-4,3.1799999999999998E-4,13,5.1089999999999998E-3,5.1089999999999998E-3,3.18E-5,3.18E-5]
[null,"NRA5A","NARANGBA","RURAL",1162,9.9480000000000004,5.0350000000000001,3.0674999999999999,null,null,8,0.58670900000000004,0.58670900000000004,1.2125E-2,1.2125E-2,9,6.4231999999999997E-2,6.4231999999999997E-2,3.6400000000000001E-4,3.6400000000000001E-4]
[null,"NRG10","NERANG","URBAN",1487,7.6230000000000002,3.742,3.8296999999999999,null,null,7,1.3705E-2,1.3705E-2,7.0500000000000006E-5,7.0500000000000006E-5,7,4.0750000000000001E-2,4.0750000000000001E-2,2.04E-4,2.04E-4]
[null,"NRG12A","CARRARA, NERANG","URBAN",1308,1.7170000000000001,4.4630000000000001,3.22,null,null,12,0.13541500000000001,0.13541500000000001,2.7300000000000002E-4,2.7300000000000002E-4,2,3.4940000000000001E-3,3.4940000000000001E-3,5.7599999999999997E-5,5.7599999999999997E-5]
[null,"NRG13A","CARRARA","URBAN",1584,1.4379999999999999,11.888999999999999,4.4203000000000001,null,null,null,null,null,null,null,3,4.4050000000000001E-3,4.4050000000000001E-3,2.58E-5,2.58E-5]
[null,"NRG14A","CARRARA, REEDY CREEK, WORONGARY","RURAL",653,12.15,5.0220000000000002,3.2008999999999999,null,null,10,0.69349700000000003,0.19228999999999999,1.5410000000000001E-3,9.8400000000000007E-4,9,0.11901,0.11901,3.59E-4,3.59E-4]
[null,"NRG15A","HIGHLAND PARK, NERANG","URBAN",1004,0.25,5.3680000000000003,2.7435999999999998,null,null,4,8.52E-4,7.4399999999999998E-4,3.3699999999999999E-5,3.2799999999999998E-5,2,7.5909999999999997E-3,7.5909999999999997E-3,5.0599999999999997E-5,5.0599999999999997E-5]
[null,"NRG16A","ADVANCETOWN, BEECHMONT, CLAGIRABA, GILSTON, LOWER BEECHMONT, MOUNT NATHAN, NERANG","RURAL",1954,36.564999999999998,6.4260000000000002,4.4965000000000002,null,null,17,0.199185,0.19866200000000001,2.3280000000000002E-3,2.3249999999999998E-3,13,0.15259,0.15259,6.1300000000000005E-4,6.1300000000000005E-4]
[null,"NRG17A","ASHMORE, MOLENDINAR, NERANG","URBAN",1521,4.694,3.5830000000000002,2.7246000000000001,null,null,4,0.407414,0.407414,1.5100000000000001E-3,1.5100000000000001E-3,4,2.4885000000000001E-2,2.4885000000000001E-2,9.5299999999999999E-5,9.5299999999999999E-5]
[null,"NRG20A","NERANG","URBAN",342,2.8769999999999998,1.284,2.9531999999999998]
[null,"NRG21A","HIGHLAND PARK, WORONGARY","URBAN",733,null,6.2069999999999999,2.2292000000000001,null,null,3,2.42E-4,2.42E-4,2.9799999999999998E-6,2.9799999999999998E-6]
[null,"NRG22A","NERANG","URBAN",1070,6.5069999999999997,4.9539999999999997,3.601,null,null,10,0.38689000000000001,8.3475999999999995E-2,2.1350000000000002E-3,1.075E-3,5,2.836E-2,2.836E-2,1.3200000000000001E-4,1.3200000000000001E-4]
[null,"NRG2A","HIGHLAND PARK, WORONGARY","URBAN",1011,null,5.7859999999999996,2.6103000000000001,null,null,4,4.1199999999999999E-4,4.1199999999999999E-4,3.9700000000000001E-6,3.9700000000000001E-6]
[null,"NRG4","CARRARA, HIGHLAND PARK, NERANG","URBAN",1069,2.105,7.117,4.9157000000000002,null,null,1,8.8999999999999995E-5,8.8999999999999995E-5,9.9000000000000005E-7,9.9000000000000005E-7,2,2.7900000000000001E-4,2.7900000000000001E-4,2.9799999999999998E-6,2.9799999999999998E-6]
[null,"NRG5A","NERANG","URBAN",376,3.371,0.51800000000000002,5.0491000000000001,null,null,3,5.3399999999999997E-4,5.3399999999999997E-4,4.9599999999999999E-6,4.9599999999999999E-6,3,2.689E-3,2.4600000000000002E-4,2.7800000000000001E-5,4.9599999999999999E-6]
[null,"NRG6","CARRARA, NERANG, WORONGARY","URBAN",921,5.3879999999999999,3.0630000000000002,3.601,null,null,6,5.1349999999999998E-3,5.1349999999999998E-3,5.5600000000000003E-5,5.5600000000000003E-5]
[null,"NRG8B","NERANG","URBAN",266,1.637,1.9259999999999999,2.7054999999999998,null,null,1,3.5500000000000001E-4,3.5500000000000001E-4,9.9000000000000005E-7,9.9000000000000005E-7,5,5.2890000000000003E-3,5.2890000000000003E-3,3.4700000000000003E-5,3.4700000000000003E-5]
[null,"NRG9","ADVANCETOWN, GILSTON, HIGHLAND PARK, NERANG","RURAL",2133,32.921999999999997,7.8170000000000002,5.6207000000000003,null,null,15,2.3536950000000001,0.117437,6.1260000000000004E-3,6.6399999999999999E-4,10,9.1867000000000004E-2,9.1867000000000004E-2,3.8699999999999997E-4,3.8699999999999997E-4]
[null,"NSD1A","FORTITUDE VALLEY, NEWSTEAD, TENERIFFE","URBAN",335,1.155,1.7230000000000001,4.0583,null,null,2,1.66E-4,1.66E-4,1.99E-6,1.99E-6,5,5.3747999999999997E-2,5.3747999999999997E-2,1.45E-4,1.45E-4]
[null,"NSD29A","NEW FARM, NEWSTEAD","URBAN",607,null,4.9610000000000003,2.5722,null,null,3,5.2304000000000003E-2,5.2304000000000003E-2,5.6400000000000005E-4,5.6400000000000005E-4,1,5.9000000000000003E-4,5.9000000000000003E-4,1.99E-6,1.99E-6]
[null,"NSD2B","BOWEN HILLS, NEWSTEAD","URBAN",523,2.7770000000000001,5.1719999999999997,2.0005999999999999,null,null,1,1.7799999999999999E-4,1.7799999999999999E-4,9.9000000000000005E-7,9.9000000000000005E-7,3,4.7959999999999999E-3,4.7959999999999999E-3,1.7900000000000001E-5,1.7900000000000001E-5]
[null,"NSD30B","BOWEN HILLS, HERSTON, WINDSOR","URBAN",1128,3.3180000000000001,5.125,4.7823000000000002,null,null,8,3.7932E-2,3.7932E-2,1.1950000000000001E-3,1.1950000000000001E-3,8,3.6166999999999998E-2,3.6166999999999998E-2,1.4999999999999999E-4,1.4999999999999999E-4]
[null,"NSD3A","BOWEN HILLS","URBAN",216,0.72399999999999998,2.4489999999999998,3.0485000000000002,null,null,2,3.9599999999999998E-4,1.2799999999999999E-4,1.59E-5,9.9000000000000005E-7,2,6.1799999999999995E-4,6.1799999999999995E-4,2.9799999999999998E-6,2.9799999999999998E-6]
[null,"NSD6B","NEWSTEAD, TENERIFFE","URBAN",1388,null,2.5169999999999999,4.4203000000000001,null,null,1,6.8999999999999997E-5,6.8999999999999997E-5,9.9000000000000005E-7,9.9000000000000005E-7,2,2.2046E-2,2.2046E-2,6.7500000000000001E-5,6.7500000000000001E-5]
[null,"NSD8A","FORTITUDE VALLEY, NEW FARM, NEWSTEAD, TENERIFFE","URBAN",1303,0.56799999999999995,5.08,3.5057999999999998,null,null,1,2.24E-4,2.24E-4,9.9000000000000005E-7,9.9000000000000005E-7,2,7.2900000000000005E-4,7.2900000000000005E-4,9.9299999999999998E-6,9.9299999999999998E-6]
[null,"NSD9A","FORTITUDE VALLEY, NEWSTEAD","URBAN",582,0.34300000000000003,3.3479999999999999,2.0577000000000001,null,null,3,3.7976000000000003E-2,3.7976000000000003E-2,5.8100000000000003E-4,5.8100000000000003E-4,1,9.6780000000000008E-3,9.6780000000000008E-3,2.58E-5,2.58E-5]
[null,"NSW16A","SLACKS CREEK, SPRINGWOOD","URBAN",776,3.5150000000000001,1.069,3.3915000000000002,null,null,7,3.3021000000000002E-2,3.3021000000000002E-2,2.7900000000000001E-4,2.7900000000000001E-4,10,4.8575E-2,4.8575E-2,1.95E-4,1.95E-4]
[null,"NSW17","DAISY HILL, SPRINGWOOD","URBAN",1336,8.9049999999999994,1.9850000000000001,4.3250999999999999,null,null,9,1.1422E-2,1.1422E-2,5.8600000000000001E-5,5.8600000000000001E-5,16,0.102119,9.4298999999999994E-2,4.0400000000000001E-4,3.7800000000000003E-4]
[null,"NSW19","UNDERWOOD","URBAN",104,1.0640000000000001,2.4220000000000002,4.2679,null,null,1,5.8999999999999998E-5,5.8999999999999998E-5,9.9000000000000005E-7,9.9000000000000005E-7]
[null,"NSW22B","EIGHT MILE PLAINS, KURABY, UNDERWOOD","URBAN",1676,6.0469999999999997,7.4,4.9919000000000002,null,null,5,0.111612,0.111612,1.0169999999999999E-3,1.0169999999999999E-3,7,1.5862999999999999E-2,1.5862999999999999E-2,6.7500000000000001E-5,6.7500000000000001E-5]
[null,"NSW24","ROCHEDALE SOUTH, SPRINGWOOD","URBAN",584,1.9139999999999999,1.2050000000000001,3.8868,null,null,5,2.0240000000000002E-3,2.0240000000000002E-3,9.9299999999999998E-6,9.9299999999999998E-6,4,1.8728999999999999E-2,1.8728999999999999E-2,4.3699999999999998E-5,4.3699999999999998E-5]
[null,"NSW25","UNDERWOOD","URBAN",377,3.5720000000000001,0.58699999999999997,3.1438000000000001,null,null,3,1.7260000000000001E-3,1.8799999999999999E-4,3.2799999999999998E-5,1.99E-6]
[null,"NSW26","SLACKS CREEK, SPRINGWOOD","URBAN",1164,5.5529999999999999,0.55700000000000005,3.2008999999999999,null,null,12,1.315E-3,1.315E-3,1.19E-5,1.19E-5,10,5.2894999999999998E-2,5.2894999999999998E-2,1.94E-4,1.94E-4]
[null,"NSW28","PRIESTDALE, ROCHEDALE SOUTH, SPRINGWOOD","RURAL",1150,6.9539999999999997,2.9950000000000001,2.6674000000000002]
[null,"NSW28","PRIESTDALE, ROCHEDALE SOUTH, SPRINGWOOD","URBAN",null,6.9539999999999997,2.9950000000000001,2.6674000000000002,null,null,8,0.25986599999999999,0.25986599999999999,1.0820000000000001E-3,1.0820000000000001E-3,4,2.5989999999999999E-2,2.5989999999999999E-2,1.1400000000000001E-4,1.1400000000000001E-4]
[null,"NSW31A","SLACKS CREEK, UNDERWOOD","URBAN",129,1.91,0.41099999999999998,2.7435999999999998,null,null,null,null,null,null,null,1,1.47E-4,1.47E-4,1.99E-6,1.99E-6]
[null,"NSW33A","UNDERWOOD, WOODRIDGE","URBAN",706,4.2839999999999998,3.0249999999999999,4.7633000000000001,null,null,9,9.8770999999999998E-2,9.8770999999999998E-2,8.2700000000000004E-4,8.2700000000000004E-4,3,1.0430000000000001E-3,1.0430000000000001E-3,3.9700000000000001E-6,3.9700000000000001E-6]
[null,"NSW35A","SLACKS CREEK","URBAN",297,2.4049999999999998,0.32100000000000001,3.0865999999999998,null,null,1,2.1150000000000001E-3,2.1150000000000001E-3,3.3699999999999999E-5,3.3699999999999999E-5,2,6.6649999999999999E-3,6.6649999999999999E-3,2.8799999999999999E-5,2.8799999999999999E-5]
[null,"NSW3A","KURABY, UNDERWOOD","URBAN",2114,2.6349999999999998,9.1319999999999997,4.8204000000000002,null,null,3,1.44E-4,1.44E-4,2.9799999999999998E-6,2.9799999999999998E-6,3,1.351E-3,1.351E-3,2.3799999999999999E-5,2.3799999999999999E-5]
[null,"NSW5A","ROCHEDALE SOUTH, SPRINGWOOD","URBAN",1229,7.5960000000000001,1.222,2.9723000000000002,null,null,7,6.7599999999999995E-4,6.7599999999999995E-4,6.9500000000000004E-6,6.9500000000000004E-6,3,3.2182000000000002E-2,3.2182000000000002E-2,1.2400000000000001E-4,1.2400000000000001E-4]
[null,"NSW7A","SPRINGWOOD","URBAN",155,0.92800000000000005,0.68200000000000005,2.1911,null,null,null,null,null,null,null,2,8.2369999999999995E-3,8.2369999999999995E-3,2.0800000000000001E-5,2.0800000000000001E-5]
[null,"NSW8A","ROCHEDALE, ROCHEDALE SOUTH, UNDERWOOD","URBAN",1809,8.2330000000000005,1.137,4.1345000000000001,null,null,8,0.318351,0.318351,4.0959999999999998E-3,4.0959999999999998E-3,5,2.3236E-2,2.3236E-2,9.0299999999999999E-5,9.0299999999999999E-5]
[null,"NVL10","NOOSA HEADS, NOOSAVILLE","URBAN",593,1.409,8.2680000000000007,4.0202,null,null,7,0.19528000000000001,0.19528000000000001,2.0769999999999999E-3,2.0769999999999999E-3]
[null,"NVL12","NOOSA HEADS, NOOSAVILLE","URBAN",505,3.8660000000000001,1.2370000000000001,1.5242,null,null,6,4.8952000000000002E-2,4.8952000000000002E-2,5.0299999999999997E-4,5.0299999999999997E-4,6,5.9542999999999999E-2,5.9542999999999999E-2,2.5399999999999999E-4,2.5399999999999999E-4]
[null,"NVL14A","NOOSA NORTH SHORE, NOOSAVILLE","URBAN",1705,2.9790000000000001,2.7160000000000002,3.6391,null,null,4,4.0460000000000001E-3,4.0460000000000001E-3,5.3600000000000002E-5,5.3600000000000002E-5]
[null,"NVL15A","NOOSAVILLE","RURAL",344,0.57199999999999995,5.09,0.68589999999999995,null,null,1,3.1500000000000001E-4,3.1500000000000001E-4,2.5600000000000001E-6,2.5600000000000001E-6]
[null,"NVL16A","NOOSA HEADS","URBAN",304,null,7.5650000000000004,2.8199000000000001]
[null,"NVL19A","NOOSAVILLE","URBAN",744,2.0710000000000002,4.2169999999999996,4.0583]
[null,"NVL24A","NOOSA HEADS, SUNSHINE BEACH","URBAN",1355,5.3209999999999997,5.0060000000000002,2.9531999999999998,null,null,16,0.36083700000000002,0.36083700000000002,1.518E-3,1.518E-3,7,7.0438000000000001E-2,7.0438000000000001E-2,2.7500000000000002E-4,2.7500000000000002E-4]
[null,"NVL26A","NOOSAVILLE","URBAN",590,null,3.3290000000000002,1.7148000000000001]
[null,"NVL27A","NOOSA HEADS","URBAN",1075,1.8140000000000001,4.5279999999999996,3.1057000000000001,null,null,6,2.3515999999999999E-2,2.3515999999999999E-2,3.48E-4,3.48E-4]
[null,"NVL28A","NOOSA HEADS, NOOSAVILLE","URBAN",1459,0.47499999999999998,4.3159999999999998,3.5247999999999999,null,null,1,2.32E-4,2.32E-4,9.9000000000000005E-7,9.9000000000000005E-7]
[null,"NVL3","NOOSA HEADS, NOOSAVILLE, SUNRISE BEACH, SUNSHINE BEACH","URBAN",2233,4.7069999999999999,11.605,4.6680000000000001,null,null,17,0.58714100000000002,0.58714100000000002,4.6220000000000002E-3,4.6220000000000002E-3,4,4.8476999999999999E-2,4.8476999999999999E-2,1.73E-4,1.73E-4]
[null,"NVL5","NOOSA HEADS, NOOSAVILLE","RURAL",1395,5.45,3.4630000000000001,2.3626,null,null,8,5.9322E-2,5.9322E-2,4.08E-4,4.08E-4,2,1.3424E-2,1.3424E-2,8.9699999999999998E-5,8.9699999999999998E-5]
[null,"NVL6","NOOSA HEADS, NOOSAVILLE","URBAN",540,2.2189999999999999,1.9179999999999999,3.3532999999999999,null,null,null,null,null,null,null,4,2.0407000000000002E-2,2.0407000000000002E-2,8.8300000000000005E-5,8.8300000000000005E-5]
[null,"NVL8B","NOOSAVILLE, TEWANTIN","RURAL",478,1.236,2.5249999999999999,0.83830000000000005,null,null,1,4.8999999999999998E-4,4.8999999999999998E-4,2.5600000000000001E-6,2.5600000000000001E-6]
[null,"NVL9","CASTAWAYS BEACH, MARCUS BEACH, NOOSA HEADS, PEREGIAN BEACH, SUNRISE BEACH, SUNSHINE BEACH","RURAL",1512,11.571,3.9910000000000001,3.4104999999999999,null,null,17,0.592499,0.592499,2.8300000000000001E-3,2.8300000000000001E-3,9,0.23655200000000001,0.23655200000000001,9.2800000000000001E-4,9.2800000000000001E-4]
[null,"OCDPCB5","SURFERS PARADISE","URBAN",5,null,0.61499999999999999]
[null,"OCDSPD25","SURFERS PARADISE","URBAN",16,null,0.65,3.1627999999999998]
[null,"OCDTR1H",null,"URBAN",38]
[null,"OCDTR5H","SURFERS PARADISE","URBAN",64,null,0.111]
[null,"ORE2","BROADBEACH","URBAN",176,null,0.40899999999999997,null,null,null,2,1.286E-3,1.286E-3,1.95E-4,1.95E-4]
[null,"ORE3","BROADBEACH","URBAN",1,null,0.56399999999999995,null,null,null,1,5.0000000000000004E-6,5.0000000000000004E-6,9.9000000000000005E-7,9.9000000000000005E-7]
[null,"ORWPGS2",null,"URBAN",250,null,0.13,null,null,null,1,1.299E-3,1.299E-3,2.4800000000000001E-4,2.4800000000000001E-4]
[null,"OSCSTC3",null,"URBAN",1,null,0.186]
[null,"OXL10A","OXLEY","URBAN",123,2.0840000000000001,1.5960000000000001,3.2770999999999999]
[null,"OXL11A","DURACK, INALA, OXLEY","URBAN",1522,3.629,3.2130000000000001,4.2107000000000001,null,null,5,8.6568999999999993E-2,8.6568999999999993E-2,1.6069999999999999E-3,1.6069999999999999E-3,5,1.0286E-2,1.0286E-2,5.66E-5,5.66E-5]
[null,"OXL4A","DARRA, OXLEY","URBAN",1039,4.0599999999999996,2.2130000000000001,1.9624999999999999,null,null,3,3.01E-4,3.01E-4,2.9799999999999998E-6,2.9799999999999998E-6,4,1.3936E-2,1.3936E-2,5.2599999999999998E-5,5.2599999999999998E-5]
[null,"OXL5A","ARCHERFIELD, OXLEY, ROCKLEA","URBAN",47,2.282,3.8290000000000002,2.2292000000000001]
[null,"OXL5B","OXLEY","URBAN",25,null,0.60199999999999998,0.66690000000000005,null,null,2,3.8499999999999998E-4,3.8499999999999998E-4,1.99E-6,1.99E-6]
[null,"OXL8A","OXLEY, ROCKLEA","URBAN",85,2.4350000000000001,1.228,2.9342000000000001]
[null,"OXL8B","CORINDA, OXLEY, SEVENTEEN MILE ROCKS","URBAN",1671,8.01,3.6070000000000002,4.1154999999999999,null,null,6,0.129803,0.129803,1.016E-3,1.016E-3,5,2.1295000000000001E-2,2.1295000000000001E-2,7.0500000000000006E-5,7.0500000000000006E-5]
[null,"PAH26",null,"URBAN",1]
[null,"PAST1","BRISBANE","CBD",1]
[null,"PBH1","CURRUMBIN WATERS, ELANORA","RURAL",1424,6.577,5.7,3.4104999999999999,null,null,4,0.18920799999999999,0.18920799999999999,3.5860000000000002E-3,3.5860000000000002E-3,8,0.28613100000000002,0.28613100000000002,9.6599999999999995E-4,9.6599999999999995E-4]
[null,"PBH2B","ELANORA, PALM BEACH","URBAN",2277,3.7269999999999999,6.4240000000000004,4.2488000000000001,null,null,14,5.6558999999999998E-2,5.6558999999999998E-2,3.7399999999999998E-4,3.7399999999999998E-4,24,0.13158800000000001,0.13158800000000001,5.0199999999999995E-4,5.0199999999999995E-4]
[null,"PBH3","PALM BEACH","URBAN",1111,2.887,0.67300000000000004,3.0293999999999999,null,null,5,3.8600000000000001E-3,3.8600000000000001E-3,2.6800000000000001E-5,2.6800000000000001E-5]
[null,"PBH4","ELANORA, PALM BEACH","URBAN",1030,0.53,4.9450000000000003,2.2292000000000001,null,null,6,6.8800000000000003E-4,6.8800000000000003E-4,5.9599999999999997E-6,5.9599999999999997E-6,7,3.4702999999999998E-2,3.4702999999999998E-2,1.8100000000000001E-4,1.8100000000000001E-4]
[null,"PBH5","CURRUMBIN WATERS","RURAL",1,0.25,1.4610000000000001,0.13339999999999999]
[null,"PBH6","PALM BEACH","URBAN",2278,5.181,0.29899999999999999,4.0392999999999999,null,null,16,0.76351199999999997,0.76351199999999997,4.8560000000000001E-3,4.8560000000000001E-3,6,2.2595000000000001E-2,2.2595000000000001E-2,9.9300000000000001E-5,9.9300000000000001E-5]
[null,"PBH7A","ELANORA","URBAN",36,null,1.133,null,null,null,null,null,null,null,null,1,2.0601999999999999E-2,2.0601999999999999E-2,3.4700000000000003E-5,3.4700000000000003E-5]
[null,"PBH8A","CURRUMBIN WATERS, ELANORA","URBAN",1473,2.9569999999999999,3.6880000000000002,null,null,null,7,0.173736,0.173736,1.467E-3,1.467E-3,1,3.127E-3,3.127E-3,6.9499999999999995E-5,6.9499999999999995E-5]
[null,"PCB1","SURFERS PARADISE","URBAN",2,null,0.14099999999999999]
[null,"PCH4","CHERMSIDE","URBAN",1,null,null,null,null,null,1,5.3999999999999998E-5,5.3999999999999998E-5,9.9000000000000005E-7,9.9000000000000005E-7]
[null,"PDAPDC4",null,"URBAN",1]
[null,"PDBPDD14",null,"URBAN",1]
[null,"PGN1B","DOONAN, PEREGIAN BEACH, WEYBA DOWNS","RURAL",1641,18.024000000000001,1.135,3.1438000000000001,null,null,14,0.33054,0.33054,2.189E-3,2.189E-3,13,0.27484799999999998,0.27484799999999998,1.1100000000000001E-3,1.1100000000000001E-3]
[null,"PGN2B","PEREGIAN SPRINGS","RURAL",791,null,7.0789999999999997,null,null,null,8,0.56774599999999997,0.439276,6.3879999999999996E-3,5.5649999999999996E-3,2,2.8990000000000001E-3,2.8990000000000001E-3,6.6600000000000006E-5,6.6600000000000006E-5]
[null,"PGN3A","PEREGIAN SPRINGS","URBAN",434,null,2.7970000000000002,1.0098,null,null,1,2.03E-4,2.03E-4,9.9000000000000005E-7,9.9000000000000005E-7]
[null,"PGN6A","PEREGIAN SPRINGS","URBAN",1467,null,9.3140000000000001,4.9729000000000001,null,null,4,0.34962900000000002,0.19298299999999999,3.2200000000000002E-3,2.1320000000000002E-3,2,1.7229999999999999E-3,1.7229999999999999E-3,3.57E-5,3.57E-5]
[null,"PGS3","BROADBEACH, BROADBEACH WATERS","URBAN",139,null,0.42799999999999999,null,null,null,3,2.4511000000000002E-2,2.4511000000000002E-2,4.1199999999999999E-4,4.1199999999999999E-4]
[null,"PHST1","BRISBANE","CBD",34]
[null,"PHST2","BRISBANE","CBD",84]
[null,"PKW11A","SOUTHPORT","URBAN",1,null,1.9590000000000001,3.4485999999999999]
[null,"PKW13A",null,"URBAN",1,null,1.145,0.7621]
[null,"PKW15A","SOUTHPORT","RURAL",4,null,5.5E-2]
[null,"PKW4A","PARKWOOD, SOUTHPORT","URBAN",566,null,4.8710000000000004,1.6576]
[null,"PKW5A","SOUTHPORT","RURAL",1,null,0.76600000000000001,0.17150000000000001]
[null,"PKW7A","SOUTHPORT","RURAL",2,null,0.13500000000000001,3.8100000000000002E-2]
[null,"PKW8A","SOUTHPORT","RURAL",1,null,null,0.30480000000000002]
[null,"PLRT1","BRISBANE","CBD",1]
[null,"PLRTTE22","BRISBANE","CBD",1,null,0.29299999999999998]
[null,"PMBT0","SOUTH BRISBANE","URBAN",11]
[null,"PMBTR1H",null,"URBAN",2,null,null,null,null,null,1,1.2E-4,1.2E-4,9.9000000000000005E-7,9.9000000000000005E-7]
[null,"PMBWED19","SOUTH BRISBANE, WEST END","URBAN",361,null,2.3570000000000002,2.496,null,null,2,2.7950000000000002E-3,2.7950000000000002E-3,2.9399999999999999E-4,2.9399999999999999E-4,3,2.6394000000000001E-2,2.6394000000000001E-2,1.01E-4,1.01E-4]
[null,"PMBWED4","SOUTH BRISBANE","URBAN",118,null,1.1850000000000001,1.448,null,null,1,1.12E-4,1.12E-4,9.9000000000000005E-7,9.9000000000000005E-7,1,1.56E-4,1.56E-4,9.9000000000000005E-7,9.9000000000000005E-7]
[null,"PMBWED7","SOUTH BRISBANE","URBAN",155,null,2.19,4.4203000000000001]
[null,"PPE12B","STEIGLITZ","RURAL",2,11.22,1.1970000000000001,0.20960000000000001]
[null,"PPE13A","GILBERTON, NORWELL, PIMPAMA, WOONGOOLBA","RURAL",138,29.401,0.59399999999999997,0.45729999999999998,null,null,5,0.173239,2.3954E-2,1.036E-3,3.3799999999999998E-4,6,1.2685999999999999E-2,1.2685999999999999E-2,9.2299999999999994E-5,9.2299999999999994E-5]
[null,"PPE15A","PIMPAMA","URBAN",3,null,1.105,0.5716]
[null,"PPE16A","JACOBS WELL, NORWELL, STEIGLITZ, WOONGOOLBA","RURAL",368,23.013000000000002,2.1949999999999998,0.99080000000000001,null,null,9,0.20507500000000001,0.19845099999999999,1.379E-3,1.348E-3,6,0.168213,0.168213,4.7899999999999999E-4,4.7899999999999999E-4]
[null,"PPE2B","PIMPAMA","URBAN",1,null,0.7,0.55249999999999999]
[null,"PPE3A","JACOBS WELL","RURAL",795,5.7430000000000003,9.5549999999999997,2.2673000000000001,null,null,6,2.408E-3,2.408E-3,5.38E-5,5.38E-5,1,5.104E-3,5.104E-3,2.8200000000000001E-5,2.8200000000000001E-5]
[null,"PPE5A","COOMERA, PIMPAMA","RURAL",1955,2.6179999999999999,14.304,4.7633000000000001,null,null,4,1.047E-3,1.047E-3,1.03E-5,1.03E-5,9,0.31896200000000002,0.31896200000000002,7.1299999999999998E-4,7.1299999999999998E-4]
[null,"PPE6A","COOMERA, PIMPAMA","RURAL",2030,19.574000000000002,8.2759999999999998,4.3441000000000001,null,null,14,5.3441000000000002E-2,5.2784999999999999E-2,7.6099999999999996E-4,7.5600000000000005E-4,16,5.6506000000000001E-2,5.6506000000000001E-2,1.7699999999999999E-4,1.7699999999999999E-4]
[null,"PQSRGA85","BRISBANE","CBD",2,null,0.14399999999999999,null,null,null,1,6.0740000000000002E-2,null,2.5599999999999999E-4]
[null,"PQST1","BRISBANE","CBD",2,null,null,null,null,null,1,0.12148,null,5.1199999999999998E-4]
[null,"PRG1","POSTMANS RIDGE, PRINCE HENRY HEIGHTS, REDWOOD, WITHCOTT","RURAL",453,22.111999999999998,0.42299999999999999,1.3528,null,null,9,1.298E-2,1.298E-2,1.46E-4,1.46E-4,2,1.1499000000000001E-2,1.1499000000000001E-2,3.5899999999999998E-5,3.5899999999999998E-5]
[null,"PRG2A","BALLARD, BLANCHVIEW, BLUE MOUNTAIN HTS, HELIDON SPA, LOCKYER, MURPHYS CREEK, POSTMANS RIDGE, SILVER RIDGE, SPRING BLUFF, UPPER LOCKYER, WITHCOTT","RURAL",927,99.370999999999995,2.3580000000000001,null,null,null,20,0.84639900000000001,0.84602599999999994,7.4570000000000001E-3,7.4539999999999997E-3,12,0.168434,0.161056,5.3799999999999996E-4,4.5399999999999998E-4]
[null,"PRG2B","LOCKYER, MURPHYS CREEK, POSTMANS RIDGE, WITHCOTT","RURAL",199,29.882000000000001,1.2030000000000001,3.601,null,null,9,0.116631,0.116631,1.5430000000000001E-3,1.5430000000000001E-3,1,1.7000000000000001E-2,1.7000000000000001E-2,3.8399999999999998E-5,3.8399999999999998E-5]
[null,"PRLT1","BRISBANE","CBD",126]
[null,"PTR1","MURARRIE","URBAN",2]
[null,"PTR2","MURARRIE","URBAN",3,null,1.774,null,null,null,1,2.7900000000000001E-4,2.7900000000000001E-4,2.9799999999999998E-6,2.9799999999999998E-6]
[null,"PWC2","CHEVALLUM, KIELS MOUNTAIN, PALMWOODS, WOOMBYE","RURAL",1029,18.219000000000001,2.294,3.3532999999999999,null,null,8,0.205182,0.205182,3.009E-3,3.009E-3,7,5.6501000000000003E-2,5.6501000000000003E-2,2.5599999999999999E-4,2.5599999999999999E-4]
[null,"PWC3","DIAMOND VALLEY, EUDLO, LANDERS SHOOT, MOOLOOLAH VALLEY, PALMWOODS","RURAL",1289,45.923000000000002,4.0519999999999996,3.9058999999999999,null,null,37,0.83917600000000003,0.83917600000000003,1.072E-2,1.072E-2,15,0.173763,0.173763,7.9000000000000001E-4,7.9000000000000001E-4]
[null,"PWC4","COES CREEK, DULONG, FLAXTON, HUNCHY, LANDERS SHOOT, MONTVILLE, NORTH MALENY, PALMWOODS, PERWILLOWEN, TOWEN MOUNTAIN, WEST WOOMBYE, WOOMBYE","RURAL",1811,87.415000000000006,0.88,3.8296999999999999,null,null,54,2.7080109999999999,2.1383190000000001,1.4482999999999999E-2,1.2914E-2,34,0.63745300000000005,0.63745300000000005,2.225E-3,2.225E-3]
[null,"PWC5","BURNSIDE, COES CREEK, HUNCHY, PALMWOODS, WEST WOOMBYE, WOOMBYE","RURAL",2032,31.321000000000002,2.9980000000000002,5.3730000000000002,null,null,19,0.27092100000000002,0.27092100000000002,6.4799999999999996E-3,6.4799999999999996E-3,31,0.56771400000000005,0.56313899999999995,2.5170000000000001E-3,2.4840000000000001E-3]
[null,"PWC6","CHEVALLUM, EUDLO, ILKLEY, PALMWOODS, TANAWHA","RURAL",1496,46.039000000000001,2.68,3.7534999999999998,null,null,21,0.95735499999999996,0.95735499999999996,6.2779999999999997E-3,6.2779999999999997E-3,13,9.1805999999999999E-2,9.1805999999999999E-2,4.3600000000000003E-4,4.3600000000000003E-4]
[null,"QACTR1H",null,"CBD",3]
[null,"QAGSGC1","BRISBANE","CBD",2]
[null,"QAGTR1H","BRISBANE","CBD",10]
[null,"QAP4","FORTITUDE VALLEY","URBAN",11,null,0.877,null,null,null,3,6.6080000000000002E-3,6.6080000000000002E-3,6.2500000000000001E-5,6.2500000000000001E-5]
[null,"QAPTR1H","BRISBANE","URBAN",2,null,null,null,null,null,1,2.05E-4,2.05E-4,1.99E-6,1.99E-6,1,8.1000000000000004E-5,8.1000000000000004E-5,1.99E-6,1.99E-6]
[null,"QBIQBX8",null,"URBAN",1]
[null,"QCHWRD4",null,"URBAN",1,null,2.0550000000000002,1.5813999999999999]
[null,"QEATR1H","BRISBANE","CBD",17]
[null,"QEATR2","BRISBANE","CBD",3]
[null,"QEATR3H","BRISBANE","CBD",1]
[null,"QECT1","BRISBANE","CBD",1]
[null,"QEETR1H",null,"CBD",19]
[null,"QEHT1","COOPERS PLAINS","URBAN",1]
[null,"QEN1","NATHAN","URBAN",1,null,7.1999999999999995E-2]
[null,"QEN10","MACGREGOR, ROBERTSON","URBAN",306,null,2.9910000000000001,null,null,null,1,6.0999999999999999E-5,6.0999999999999999E-5,9.9000000000000005E-7,9.9000000000000005E-7,2,6.045E-3,6.045E-3,2.48E-5,2.48E-5]
[null,"QGP4","SOUTH BRISBANE","URBAN",61,null,1.19]
[null,"QMR1",null,"URBAN",1]
[null,"QNPTR1","BOWEN HILLS","URBAN",1]
[null,"QPT1","MORNINGSIDE, MURARRIE","URBAN",4,1.1359999999999999,1.3340000000000001,1.1621999999999999]
[null,"QPT21","CANNON HILL, MURARRIE","URBAN",1035,1.907,2.5470000000000002,2.6293000000000002,null,null,3,5.5909999999999996E-3,5.5909999999999996E-3,7.5400000000000003E-5,7.5400000000000003E-5,3,9.1799999999999998E-4,9.1799999999999998E-4,9.9299999999999998E-6,9.9299999999999998E-6]
[null,"QPT22A","CAMP HILL, HAWTHORNE, MORNINGSIDE","URBAN",2093,4.3890000000000002,2.847,4.0392999999999999,null,null,9,0.74318700000000004,0.74318700000000004,1.076E-2,1.076E-2,6,6.0713999999999997E-2,6.0713999999999997E-2,2.1900000000000001E-4,2.1900000000000001E-4]
[null,"QPT24A","CANNON HILL, MORNINGSIDE, MURARRIE","URBAN",268,1.125,1.087,0.80020000000000002,null,null,null,null,null,null,null,2,4.6160000000000003E-3,4.6160000000000003E-3,4.9599999999999999E-5,4.9599999999999999E-5]
[null,"QPT25B","CANNON HILL","URBAN",171,0.33700000000000002,3.1789999999999998,3.5057999999999998,null,null,1,1.03E-4,1.03E-4,9.9000000000000005E-7,9.9000000000000005E-7,3,7.6629999999999997E-3,7.6629999999999997E-3,2.9799999999999999E-5,2.9799999999999999E-5]
[null,"QPT5",null,"URBAN",null,4.0659999999999998,0.94199999999999995,3.9821,null,null,6,0.15606100000000001,0.15606100000000001,1.093E-3,1.093E-3,4,1.1405999999999999E-2,1.1405999999999999E-2,4.8600000000000002E-5,4.8600000000000002E-5]
[null,"QPT5A","CANNON HILL, MORNINGSIDE","URBAN",1084]
[null,"QPT6","MORNINGSIDE","URBAN",60,2.0339999999999998,0.85799999999999998,2.4197000000000002,null,null,3,8.1860000000000006E-3,8.1860000000000006E-3,9.6299999999999996E-5,9.6299999999999996E-5,1,7.1500000000000003E-4,7.1500000000000003E-4,5.9599999999999997E-6,5.9599999999999997E-6]
[null,"QRHT7","BALD HILLS","URBAN",1,null,6.0000000000000001E-3]
[null,"QRRRBK14",null,"URBAN",1,0.22900000000000001,7.2999999999999995E-2]
[null,"QSC1","BRISBANE","CBD",3]
[null,"QUBSTL6",null,"URBAN",1,null,null,4.6871]
[null,"RBA12A","ROBINA","URBAN",80,null,1.405,1.5052000000000001,null,null,null,null,null,null,null,2,8.8099999999999995E-4,8.8099999999999995E-4,1.99E-6,1.99E-6]
[null,"RBA15A","ROBINA","URBAN",470,null,4.2140000000000004,2.8008000000000002,null,null,null,null,null,null,null,1,8.8999999999999995E-4,8.8999999999999995E-4,9.9000000000000005E-7,9.9000000000000005E-7]
[null,"RBA1A","MUDGEERABA, REEDY CREEK, ROBINA","RURAL",1589,6.7830000000000004,7.6109999999999998,2.9912999999999998,null,null,3,0.41574699999999998,1.805E-3,4.0220000000000004E-3,7.6899999999999992E-6,4,1.1804E-2,1.1804E-2,3.3300000000000003E-5,3.3300000000000003E-5]
[null,"RBA33A","ROBINA","URBAN",15,null,1.6220000000000001,2.5341,null,null,1,1.11E-4,1.11E-4,9.9000000000000005E-7,9.9000000000000005E-7]
[null,"RBA34A","ROBINA","URBAN",439,null,7.2869999999999999,4.0964,null,null,3,3.0176999999999999E-2,3.0176999999999999E-2,4.06E-4,4.06E-4,2,5.019E-3,5.019E-3,2.2799999999999999E-5,2.2799999999999999E-5]
[null,"RBA35A","BONOGIN, MUDGEERABA, ROBINA","URBAN",662,3.5910000000000002,3.157,3.1246999999999998,null,null,2,1.2300000000000001E-4,1.2300000000000001E-4,1.99E-6,1.99E-6,5,3.8103999999999999E-2,3.8103999999999999E-2,2.22E-4,2.22E-4]
[null,"RBA37A","MERRIMAC, MUDGEERABA, ROBINA, WORONGARY","URBAN",1271,6.2140000000000004,2.5510000000000002,3.5247999999999999,null,null,8,0.19167500000000001,1.342E-2,1.462E-3,2.0100000000000001E-4,4,1.4324E-2,1.4324E-2,5.8600000000000001E-5,5.8600000000000001E-5]
[null,"RBA41A","ROBINA","URBAN",954,null,5.4829999999999997,4.5727000000000002,null,null,3,1.977E-3,1.977E-3,3.7700000000000002E-5,3.7700000000000002E-5]
[null,"RBA42A","CLEAR ISLAND WATERS, MERRIMAC, ROBINA","RURAL",465,0.125,6.3680000000000003,2.6865000000000001,null,null,3,5.2790999999999998E-2,5.2790999999999998E-2,1.13E-4,1.13E-4]
[null,"RBA43A","GILSTON, MERRIMAC, TALLAI, WORONGARY","RURAL",1047,23.57,2.1949999999999998,3.6391,null,null,21,6.207E-2,6.1684999999999997E-2,3.8200000000000002E-4,3.79E-4,12,0.18363399999999999,0.18363399999999999,5.3799999999999996E-4,5.3799999999999996E-4]
[null,"RBA4A","ROBINA","URBAN",1201,null,6.05,3.2770999999999999,null,null,null,null,null,null,null,3,1.8423999999999999E-2,1.8423999999999999E-2,2.7700000000000001E-4,2.7700000000000001E-4]
[null,"RBA6A","ROBINA","URBAN",1,null,0.86499999999999999,0.95269999999999999]
[null,"RBA9A","ROBINA","URBAN",347,null,5.1280000000000001,1.9244000000000001,null,null,2,3.0800000000000001E-4,3.0800000000000001E-4,1.99E-6,1.99E-6]
[null,"RBARHP14","MERRIMAC, MUDGEERABA, ROBINA","URBAN",1738,1.177,9.1259999999999994,4.3250999999999999,null,null,5,1.9973999999999999E-2,1.9973999999999999E-2,7.64E-5,7.64E-5,1,6.0140000000000002E-3,6.0140000000000002E-3,7.25E-5,7.25E-5]
[null,"RBK11A","COLLINGWOOD PARK, REDBANK, RIVERVIEW","RURAL",1012,12.861000000000001,0.65800000000000003,2.2864,null,null,9,1.572346,0.22006400000000001,5.5339999999999999E-3,2.9529999999999999E-3,13,5.7953999999999999E-2,5.7953999999999999E-2,2.6699999999999998E-4,2.6699999999999998E-4]
[null,"RBK12A","GOODNA, REDBANK","RURAL",25,4.3540000000000001,2.7,1.6767000000000001]
[null,"RBK12A","GOODNA, REDBANK","URBAN",null,4.3540000000000001,2.7,1.6767000000000001,null,null,4,1.655E-3,1.655E-3,2.8799999999999999E-5,2.8799999999999999E-5,1,2.41E-4,2.41E-4,2.9799999999999998E-6,2.9799999999999998E-6]
[null,"RBK4A","GOODNA, REDBANK","URBAN",723,6.085,3.508,3.0674999999999999,null,null,10,0.621757,0.14188300000000001,2.264E-3,1.5460000000000001E-3,3,6.2760000000000003E-3,6.2760000000000003E-3,3.8699999999999999E-5,3.8699999999999999E-5]
[null,"RBK8A","REDBANK","RURAL",3,1.9970000000000001,0.222,0.53349999999999997,null,null,null,null,null,null,null,2,1.9380000000000001E-3,1.9380000000000001E-3,5.13E-6,5.13E-6]
[null,"RBK9A","COLLINGWOOD PARK, REDBANK","URBAN",296,2.1139999999999999,1.0209999999999999,3.7915999999999999,null,null,1,2.918E-3,2.918E-3,4.9599999999999999E-6,4.9599999999999999E-6,3,1.7139999999999999E-2,1.7139999999999999E-2,6.8499999999999998E-5,6.8499999999999998E-5]
[null,"RBWT6","ROCHEDALE","URBAN",1,null,null,null,null,null,null,null,null,null,null,1,1.11E-4,1.11E-4,9.9000000000000005E-7,9.9000000000000005E-7]
[null,"RBY10","ALEXANDRA HILLS, CAPALABA, CLEVELAND, ORMISTON","URBAN",735,4.8849999999999998,0.78700000000000003,2.153,null,null,5,7.2099999999999996E-4,7.2099999999999996E-4,1.02E-4,1.02E-4,2,2.8999999999999998E-3,2.8999999999999998E-3,1.49E-5,1.49E-5]
[null,"RBY12","ORMISTON, WELLINGTON POINT","URBAN",1702,7.9749999999999996,4.3109999999999999,3.8868,null,null,7,0.136349,0.136349,1.688E-3,1.688E-3,7,2.4513E-2,2.4513E-2,1.16E-4,1.16E-4]
[null,"RBY13","CLEVELAND","URBAN",972,4.8159999999999998,0.86899999999999999,2.1339000000000001,null,null,20,0.230874,0.230874,2.1719999999999999E-3,2.1719999999999999E-3,4,1.3573999999999999E-2,1.3573999999999999E-2,4.9599999999999999E-5,4.9599999999999999E-5]
[null,"RBY15","ORMISTON","URBAN",1312,4.84,2.1419999999999999,3.0293999999999999,null,null,9,1.8388999999999999E-2,1.8388999999999999E-2,1.8000000000000001E-4,1.8000000000000001E-4,5,1.9699000000000001E-2,1.9699000000000001E-2,9.1299999999999997E-5,9.1299999999999997E-5]
[null,"RBY16","CLEVELAND, ORMISTON","URBAN",301,0.41,1.6779999999999999,2.6293000000000002,null,null,1,1.5455E-2,1.5455E-2,2.9799999999999998E-4,2.9799999999999998E-4]
[null,"RBY18","CLEVELAND, ORMISTON","URBAN",332,3.4380000000000002,1.224,2.0577000000000001,null,null,2,1.18E-4,1.18E-4,1.99E-6,1.99E-6,4,1.2849999999999999E-3,1.2849999999999999E-3,1.7900000000000001E-5,1.7900000000000001E-5]
[null,"RBY2A","CLEVELAND","URBAN",1092,2.3170000000000002,2.5960000000000001,2.8389000000000002,null,null,3,2.9500000000000001E-4,2.9500000000000001E-4,2.9799999999999998E-6,2.9799999999999998E-6,1,1.0822999999999999E-2,1.0822999999999999E-2,4.6699999999999997E-5,4.6699999999999997E-5]
[null,"RBY3","CLEVELAND","URBAN",1576,4.7649999999999997,2.7450000000000001,3.3151999999999999,null,null,4,5.3639999999999998E-3,5.3639999999999998E-3,8.6399999999999999E-5,8.6399999999999999E-5,9,1.8728000000000002E-2,1.8728000000000002E-2,1.1400000000000001E-4,1.1400000000000001E-4]
[null,"RBY6","ALEXANDRA HILLS, CLEVELAND, ORMISTON","URBAN",1265,6.6550000000000002,1.9970000000000001,3.4866999999999999,null,null,3,1.8100000000000001E-4,1.8100000000000001E-4,2.9799999999999998E-6,2.9799999999999998E-6,9,3.6177000000000001E-2,3.6177000000000001E-2,1.44E-4,1.44E-4]
[null,"RBY7A","CLEVELAND","URBAN",479,2.488,1.4610000000000001,2.3816000000000002,null,null,3,3.862E-3,3.862E-3,6.2500000000000001E-5,6.2500000000000001E-5]
[null,"RBY9A","CLEVELAND, ORMISTON","URBAN",881,0.29899999999999999,8.4710000000000001,3.3342999999999998,null,null,3,1.0272E-2,1.0272E-2,1.7900000000000001E-5,1.7900000000000001E-5,5,1.2404E-2,1.2404E-2,4.8600000000000002E-5,4.8600000000000002E-5]
[null,"RCF10A","KIPPA-RING, REDCLIFFE","URBAN",659,3.7010000000000001,0.313,3.9058999999999999,null,null,4,8.8229999999999992E-3,8.5559999999999994E-3,6.5700000000000003E-4,6.5600000000000001E-4,7,5.7664E-2,5.7664E-2,1.92E-4,1.92E-4]
[null,"RCF11A","REDCLIFFE","URBAN",2,null,0.54500000000000004,2.2101999999999999,null,null,null,null,null,null,null,1,4.28E-4,4.28E-4,9.9000000000000005E-7,9.9000000000000005E-7]
[null,"RCF12A","REDCLIFFE","URBAN",926,0.88300000000000001,1.569,3.2008999999999999,null,null,2,7.9690000000000004E-3,7.9690000000000004E-3,8.8300000000000005E-5,8.8300000000000005E-5,4,1.5613E-2,1.5613E-2,8.4400000000000005E-5,8.4400000000000005E-5]
[null,"RCF1A","MARGATE, REDCLIFFE, WOODY POINT","URBAN",1798,4.7130000000000001,1.613,3.0104000000000002,null,null,7,6.4260000000000003E-3,6.4260000000000003E-3,1.5200000000000001E-4,1.5200000000000001E-4,8,4.7722000000000001E-2,4.7722000000000001E-2,1.7799999999999999E-4,1.7799999999999999E-4]
[null,"RCF2A","KIPPA-RING, MARGATE, REDCLIFFE","URBAN",1336,5.5659999999999998,0.53400000000000003,2.6674000000000002,null,null,13,0.14070199999999999,0.14070199999999999,1.439E-3,1.439E-3,20,0.116595,0.116595,4.2099999999999999E-4,4.2099999999999999E-4]
[null,"RCF3A","REDCLIFFE","URBAN",378,1.371,0.97599999999999998,1.0860000000000001,null,null,4,1.6823999999999999E-2,1.6823999999999999E-2,1.3200000000000001E-4,1.3200000000000001E-4,1,3.6909999999999998E-3,3.6909999999999998E-3,2.58E-5,2.58E-5]
[null,"RCF5A","REDCLIFFE","URBAN",646,2.0819999999999999,0.64800000000000002,2.1911,null,null,2,8.7101999999999999E-2,8.7101999999999999E-2,6.3299999999999999E-4,6.3299999999999999E-4,2,1.8134000000000001E-2,1.8134000000000001E-2,5.66E-5,5.66E-5]
[null,"RCF7A","REDCLIFFE","URBAN",458,1.6870000000000001,1.7410000000000001,2.4578000000000002,null,null,1,1.5827999999999998E-2,1.5827999999999998E-2,6.6500000000000004E-5,6.6500000000000004E-5,3,6.5459999999999997E-3,3.6280000000000001E-3,2.8799999999999999E-5,1.6900000000000001E-5]
[null,"RCF9A","MARGATE, REDCLIFFE","URBAN",1410,3.1179999999999999,1.0509999999999999,2.4578000000000002,null,null,3,3.8999999999999999E-4,3.8999999999999999E-4,2.9799999999999998E-6,2.9799999999999998E-6,4,1.2663000000000001E-2,1.2663000000000001E-2,4.4700000000000002E-5,4.4700000000000002E-5]
[null,"RCN10A","EIGHT MILE PLAINS, RUNCORN, SUNNYBANK, SUNNYBANK HILLS","URBAN",1517,6.7220000000000004,2.665,3.0674999999999999,null,null,7,9.0399999999999994E-3,9.0399999999999994E-3,1.06E-4,1.06E-4,2,3.4719999999999998E-3,3.4719999999999998E-3,1.6900000000000001E-5,1.6900000000000001E-5]
[null,"RCN11","RUNCORN","URBAN",2,0.66800000000000004,0.30599999999999999,null,null,null,null,null,null,null,null,3,8.1000000000000004E-5,8.1000000000000004E-5,2.9799999999999998E-6,2.9799999999999998E-6]
[null,"RCN12A","RUNCORN, STRETTON","URBAN",1317,1.4510000000000001,5.9379999999999997,3.1246999999999998,null,null,5,0.135045,0.135045,1.225E-3,1.225E-3,3,3.3050000000000002E-3,3.3050000000000002E-3,3.18E-5,3.18E-5]
[null,"RCN2A","EIGHT MILE PLAINS, RUNCORN","URBAN",1688,2.4020000000000001,4.5990000000000002,4.3822000000000001,null,null,4,1.0871E-2,1.0871E-2,3.9700000000000003E-5,3.9700000000000003E-5,4,7.36E-4,7.36E-4,1.3900000000000001E-5,1.3900000000000001E-5]
[null,"RCN3A","RUNCORN, SUNNYBANK HILLS","URBAN",1327,0.34699999999999998,6.8220000000000001,2.5912000000000002,null,null,10,2.807E-3,2.807E-3,2.7800000000000001E-5,2.7800000000000001E-5,2,2.3354E-2,2.3354E-2,6.2500000000000001E-5,6.2500000000000001E-5]
[null,"RCN4A","KARAWATHA, KURABY, RUNCORN, WOODRIDGE","URBAN",1479,6.6379999999999999,3.8370000000000002,2.9912999999999998,null,null,9,8.9020000000000002E-2,8.9020000000000002E-2,1.475E-3,1.475E-3,2,3.7060000000000001E-3,3.7060000000000001E-3,1.59E-5,1.59E-5]
[null,"RCN6A","BRIDGEMAN DOWNS, KURABY, RUNCORN, STRETTON","RURAL",911,4.7960000000000003,2.754,1.8290999999999999]
[null,"RCN6A","BRIDGEMAN DOWNS, KURABY, RUNCORN, STRETTON","URBAN",null,4.7960000000000003,2.754,1.8290999999999999,null,null,3,3.6200000000000002E-4,3.6200000000000002E-4,2.9799999999999998E-6,2.9799999999999998E-6,3,3.725E-3,3.725E-3,5.7599999999999997E-5,5.7599999999999997E-5]
[null,"RCN6B","RUNCORN","URBAN",6]
[null,"RCN8A","RUNCORN, SUNNYBANK, SUNNYBANK HILLS","URBAN",1807,2.2050000000000001,4.5709999999999997,3.1438000000000001,null,null,6,2.3432999999999999E-2,2.3432999999999999E-2,2.8299999999999999E-4,2.8299999999999999E-4,3,4.0173E-2,4.0173E-2,9.9300000000000001E-5,9.9300000000000001E-5]
[null,"RCN9","RUNCORN","URBAN",1,0.33300000000000002,0.16700000000000001,4.9538000000000002]
[null,"RGAT1","BRISBANE","CBD",1,null,null,null,null,null,2,0.14994499999999999,2.8464E-2,7.67E-4,2.5599999999999999E-4]
[null,"RHG3",null,"URBAN",1]
[null,"RHG6","GREENSLOPES","URBAN",838,2.0259999999999998,0.104,null,null,null,2,1.0399999999999999E-4,1.0399999999999999E-4,9.9000000000000005E-7,9.9000000000000005E-7,2,4.0949999999999997E-3,4.0949999999999997E-3,2.8799999999999999E-5,2.8799999999999999E-5]
[null,"RHP1","ROBINA","URBAN",2,null,0.30299999999999999]
[null,"RIP1","FORTITUDE VALLEY","URBAN",13,null,1.8720000000000001]
[null,"RIS1","RUSSELL ISLAND","RURAL",800,10.737,0.48699999999999999,0.99080000000000001,null,null,10,2.988378,1.5278999999999999E-2,3.4629999999999999E-3,8.0199999999999998E-4,7,0.53533600000000003,0.53533600000000003,1.864E-3,1.864E-3]
[null,"RIS2","KARRAGARRA ISLAND, LAMB ISLAND, MACLEAY ISLAND, RUSSELL ISLAND","RURAL",2643,26.215,4.1859999999999999,3.5438999999999998,null,null,34,12.36769,1.454985,2.3677E-2,1.6379999999999999E-2,6,7.7811000000000005E-2,7.7811000000000005E-2,6.2779999999999997E-3,6.2779999999999997E-3]
[null,"RIS4","RUSSELL ISLAND","RURAL",610,18.369,1.0720000000000001,0.72399999999999998,null,null,7,0.71934299999999995,0.71934299999999995,3.3549999999999999E-3,3.3549999999999999E-3,4,2.6558999999999999E-2,2.6558999999999999E-2,1.6699999999999999E-4,1.6699999999999999E-4]
[null,"RLA11A","SALISBURY","URBAN",54,1.5920000000000001,0.315,2.0387,null,null,null,null,null,null,null,4,3.0820000000000001E-3,2.421E-3,1.6900000000000001E-5,1.0900000000000001E-5]
[null,"RLA12A","ARCHERFIELD, MOOROOKA, ROCKLEA","URBAN",529,4.391,3.5350000000000001,3.0485000000000002,null,null,3,5.5138E-2,5.4919999999999997E-2,5.2800000000000004E-4,5.2700000000000002E-4,5,1.4612E-2,1.4612E-2,5.0599999999999997E-5,5.0599999999999997E-5]
[null,"RLA15A","SALISBURY","URBAN",22,1.2769999999999999,0.33,1.0479000000000001,null,null,null,null,null,null,null,2,3.7950000000000002E-3,3.7950000000000002E-3,1.0900000000000001E-5,1.0900000000000001E-5]
[null,"RLA4A","COOPERS PLAINS, SALISBURY","RURAL",676,6.5919999999999996,2.4980000000000002,5.6588000000000003,null,null,5,0.41946099999999997,1.1953E-2,3.578E-3,1.13E-4,12,0.228687,0.228687,7.1000000000000002E-4,7.1000000000000002E-4]
[null,"RLA4A","COOPERS PLAINS, SALISBURY","URBAN",676,6.5919999999999996,2.4980000000000002,5.6588000000000003,null,null,1,4.5000000000000003E-5,4.5000000000000003E-5,9.9000000000000005E-7,9.9000000000000005E-7,2,6.3619999999999996E-3,6.3619999999999996E-3,3.2799999999999998E-5,3.2799999999999998E-5]
[null,"RLA5A","MOOROOKA, ROCKLEA","URBAN",1450,4.1390000000000002,0.27500000000000002,2.8199000000000001,null,null,2,9.3860000000000002E-3,9.3860000000000002E-3,5.8600000000000001E-5,5.8600000000000001E-5,11,0.118474,0.118474,3.8699999999999997E-4,3.8699999999999997E-4]
[null,"RLA7A","MOOROOKA, ROCKLEA, YEERONGPILLY","URBAN",163,3.9529999999999998,3.6219999999999999,1.4671000000000001,null,null,4,3.9033999999999999E-2,3.9033999999999999E-2,4.7800000000000002E-4,4.7800000000000002E-4,5,1.2031E-2,1.2031E-2,6.05E-5,6.05E-5]
[null,"RLA8A","MOOROOKA, TARRAGINDI","URBAN",1540,7.0039999999999996,0.20899999999999999,2.6674000000000002,null,null,7,3.8163999999999997E-2,3.8163999999999997E-2,3.4000000000000002E-4,3.4000000000000002E-4,32,0.13212199999999999,0.12947700000000001,5.4299999999999997E-4,5.1900000000000004E-4]
[null,"RLB11B","REDLAND BAY","URBAN",1985,5.2149999999999999,6.9109999999999996,5.7159000000000004,null,null,4,5.5460000000000002E-2,5.5460000000000002E-2,5.1000000000000004E-4,5.1000000000000004E-4,10,3.4748000000000001E-2,3.4748000000000001E-2,1.36E-4,1.36E-4]
[null,"RLB12B","MOUNT COTTON, VICTORIA POINT","RURAL",132,8.3079999999999998,0.19,0.49540000000000001,null,null,null,null,null,null,null,1,5.032E-3,5.032E-3,3.3300000000000003E-5,3.3300000000000003E-5]
[null,"RLB13B","REDLAND BAY","RURAL",2212,30.247,8.8149999999999995,5.5063000000000004,null,null,16,1.389008,0.74355199999999999,1.3745E-2,1.2119E-2,25,0.128136,0.128136,4.3600000000000003E-4,4.3600000000000003E-4]
[null,"RLB15A","REDLAND BAY, VICTORIA POINT","URBAN",1215,6.8150000000000004,1.4450000000000001,2.7054999999999998,null,null,11,5.9138000000000003E-2,5.9138000000000003E-2,1.217E-3,1.217E-3,5,4.1931000000000003E-2,4.1931000000000003E-2,1.2999999999999999E-4,1.2999999999999999E-4]
[null,"RLB16A","CARBROOK, MOUNT COTTON, REDLAND BAY","RURAL",387,29.108000000000001,3.512,1.7148000000000001,null,null,8,0.20232,0.20206399999999999,2.2279999999999999E-3,2.202E-3,3,7.9080000000000001E-3,7.9080000000000001E-3,2.8200000000000001E-5,2.8200000000000001E-5]
[null,"RNAVPK7",null,"URBAN",1]
[null,"RPN1","COLLINGWOOD PARK","URBAN",986,1.7310000000000001,5.4160000000000004,2.9150999999999998]
[null,"RPN2A","BELLBIRD PARK, REDBANK PLAINS","URBAN",870,4.101,1.2789999999999999,3.1627999999999998,null,null,4,0.112582,6.8729999999999998E-3,1.6899999999999999E-4,8.6399999999999999E-5,3,2.0740000000000001E-2,2.0740000000000001E-2,5.3600000000000002E-5,5.3600000000000002E-5]
[null,"RPN3A","BELLBIRD PARK, REDBANK PLAINS","URBAN",1989,9.6110000000000007,2.5510000000000002,4.2488000000000001,null,null,18,6.7640000000000006E-2,5.9221000000000003E-2,2.7799999999999998E-4,2.5500000000000002E-4,11,5.4414999999999998E-2,5.3459E-2,2.63E-4,2.5999999999999998E-4]
[null,"RPN4A","REDBANK PLAINS, SWANBANK","RURAL",2699,16.106999999999999,13.231,3.6772,null,null,10,3.4169999999999999E-3,3.4169999999999999E-3,2.8200000000000001E-5,2.8200000000000001E-5,10,2.631E-2,2.631E-2,1E-4,1E-4]
[null,"RPN5A","BELLBIRD PARK, REDBANK PLAINS","RURAL",1152,7.8319999999999999,0.96099999999999997,2.6293000000000002,null,null,8,7.3788999999999993E-2,7.3788999999999993E-2,4.0200000000000001E-4,4.0200000000000001E-4,12,0.18234,0.18234,6.9700000000000003E-4,6.9700000000000003E-4]
[null,"RPN7A","COLLINGWOOD PARK, NEW CHUM, REDBANK PLAINS","RURAL",20,7.7690000000000001,0.17399999999999999,1.3717999999999999,null,null,1,2.5219999999999999E-3,2.5219999999999999E-3,2.05E-5,2.05E-5,1,1.4E-3,1.4E-3,7.6899999999999992E-6,7.6899999999999992E-6]
[null,"RPN8","AUGUSTINE HEIGHTS, BELLBIRD PARK, REDBANK PLAINS","RURAL",1244,3.9489999999999998,7.6139999999999999,3.0293999999999999,null,null,5,1.647E-3,1.647E-3,1.2799999999999999E-5,1.2799999999999999E-5,5,2.3954E-2,2.3954E-2,1.08E-4,1.08E-4]
[null,"RRD2","FORTITUDE VALLEY","URBAN",91]
[null,"RRDVPK22","BOWEN HILLS, FORTITUDE VALLEY","URBAN",663,null,1.4590000000000001,3.4296000000000002,null,null,5,1.3727E-2,3.3700000000000001E-4,9.8300000000000004E-5,3.9700000000000001E-6]
[null,"RSD4","BRISBANE","CBD",1,null,null,null,null,null,1,2.878E-2,null,2.5599999999999999E-4]
[null,"RST11A","IPSWICH","URBAN",97,null,2.25,3.6581999999999999,null,null,1,4.8000000000000001E-5,4.8000000000000001E-5,9.9000000000000005E-7,9.9000000000000005E-7]
[null,"RST15A","IPSWICH, WEST IPSWICH","URBAN",168,null,2.1800000000000002,3.0865999999999998,null,null,2,2.686E-3,2.686E-3,1.3900000000000001E-5,1.3900000000000001E-5,1,1.2999999999999999E-5,1.2999999999999999E-5,9.9000000000000005E-7,9.9000000000000005E-7]
[null,"RST16A","IPSWICH","URBAN",656,6.2439999999999998,1.226,3.3342999999999998,null,null,8,0.13878099999999999,0.13878099999999999,7.4100000000000001E-4,7.4100000000000001E-4,3,8.6180000000000007E-3,8.6180000000000007E-3,3.2799999999999998E-5,3.2799999999999998E-5]
[null,"RST18A","IPSWICH","URBAN",83,null,0.60199999999999998,1.6767000000000001,null,null,null,null,null,null,null,1,7.5699999999999997E-4,7.5699999999999997E-4,6.9500000000000004E-6,6.9500000000000004E-6]
[null,"RST20A","COALFALLS, LEICHHARDT, SADLIERS CROSSING, WEST IPSWICH, WULKURAKA","RURAL",1356,9.3550000000000004,1.2769999999999999,3.8487,null,null,2,1.5055000000000001E-2,1.5055000000000001E-2,2.23E-4,2.23E-4,1,3.2299999999999998E-3,3.2299999999999998E-3,3.8399999999999998E-5,3.8399999999999998E-5]
[null,"RST20A","COALFALLS, LEICHHARDT, SADLIERS CROSSING, WEST IPSWICH, WULKURAKA","URBAN",1356,9.3550000000000004,1.2769999999999999,3.8487,null,null,5,4.2999999999999999E-4,4.2999999999999999E-4,4.9599999999999999E-6,4.9599999999999999E-6,3,4.5942999999999998E-2,4.5942999999999998E-2,1.46E-4,1.46E-4]
[null,"RST2A","IPSWICH","URBAN",259,0.67400000000000004,1.952,3.8296999999999999,null,null,3,2.013E-3,2.013E-3,9.9299999999999998E-6,9.9299999999999998E-6,1,4.5110000000000003E-3,4.5110000000000003E-3,1.49E-5,1.49E-5]
[null,"RST4A","IPSWICH","URBAN",1,null,0.436,2.496]
[null,"RST5A","IPSWICH, WEST IPSWICH, WOODEND","URBAN",466,1.454,2.448,3.0865999999999998,null,null,3,4.1997E-2,4.1997E-2,4.3600000000000003E-4,4.3600000000000003E-4,2,7.1299999999999998E-4,7.1299999999999998E-4,2.9799999999999998E-6,2.9799999999999998E-6]
[null,"RST8A","IPSWICH, WEST IPSWICH","URBAN",328,2.8149999999999999,1.7729999999999999,2.7246000000000001,null,null,3,1.5298000000000001E-2,1.5298000000000001E-2,7.3499999999999998E-5,7.3499999999999998E-5,1,1E-4,1E-4,9.9000000000000005E-7,9.9000000000000005E-7]
[null,"RST9A","EAST IPSWICH, IPSWICH","URBAN",322,2.4009999999999998,1.2210000000000001,2.4007000000000001,null,null,3,2.2179999999999999E-3,2.2179999999999999E-3,4.2700000000000001E-5,4.2700000000000001E-5,2,1.6570000000000001E-3,1.6570000000000001E-3,6.9500000000000004E-6,6.9500000000000004E-6]
[null,"RWD1","CALVERT, COLEYVILLE, EBENEZER, LANEFIELD, LOWER MOUNT WALKER, MERRYVALE, MOORANG, MOUNT FORBES, MOUNT WALKER, MT MORT, MT WALKER WEST, ROSEVALE, ROSEWOOD, TAROME","RURAL",468,192.93299999999999,0.24399999999999999,1.7338,null,null,35,0.56459300000000001,0.55502099999999999,5.1190000000000003E-3,4.96E-3,28,0.29978100000000002,0.29978100000000002,9.0499999999999999E-4,9.0499999999999999E-4]
[null,"RWD2","ASHWELL, CALVERT, LANEFIELD, MOUNT WALKER, ROSEWOOD, TALLEGALLA, THAGOONA, THE BLUFF","RURAL",1301,52.154000000000003,1.1160000000000001,3.5247999999999999,null,null,18,1.0007299999999999,1.0007299999999999,1.0499E-2,1.0499E-2,22,0.19739399999999999,0.165906,5.9699999999999998E-4,5.2499999999999997E-4]
[null,"SABTR1H","SPRING HILL","URBAN",1,null,null,null,null,null,1,3.0000000000000001E-6,3.0000000000000001E-6,9.9000000000000005E-7,9.9000000000000005E-7]
[null,"SABWTC6","SPRING HILL","URBAN",1,null,0.47799999999999998,null,null,null,1,1.2E-5,1.2E-5,3.9700000000000001E-6,3.9700000000000001E-6]
[null,"SAMTR1H","BRISBANE","CBD",7]
[null,"SAMTR2H","BRISBANE","CBD",1]
[null,"SARSHW7","CORINDA, ROCKLEA, SHERWOOD","URBAN",266,2.399,2.3980000000000001,1.3717999999999999]
[null,"SARSHW9","ROCKLEA, SHERWOOD","URBAN",391,2.6030000000000002,1.544,2.7435999999999998,null,null,2,3.9300000000000001E-4,3.9300000000000001E-4,1.99E-6,1.99E-6,3,2.2844E-2,2.2844E-2,8.7299999999999994E-5,8.7299999999999994E-5]
[null,"SBH11","REDCLIFFE, SCARBOROUGH","URBAN",1775,4.7240000000000002,0.63800000000000001,2.5722,null,null,16,3.8521E-2,3.8521E-2,3.1100000000000002E-4,3.1100000000000002E-4,8,3.2148999999999997E-2,3.2148999999999997E-2,1.2E-4,1.2E-4]
[null,"SBH13A","KIPPA-RING, REDCLIFFE","URBAN",531,3.4020000000000001,1.494,3.1246999999999998,null,null,3,0.112709,0.112709,1.0549999999999999E-3,1.0549999999999999E-3]
[null,"SBH4","SCARBOROUGH","URBAN",1409,5.4710000000000001,1.4159999999999999,2.9723000000000002,null,null,5,6.5620000000000001E-3,6.5620000000000001E-3,6.6500000000000004E-5,6.6500000000000004E-5,9,5.1434000000000001E-2,5.1434000000000001E-2,2.14E-4,2.14E-4]
[null,"SBH6","SCARBOROUGH","URBAN",2186,6.4850000000000003,0.999,3.5247999999999999,null,null,12,1.7403999999999999E-2,1.7403999999999999E-2,2.3000000000000001E-4,2.3000000000000001E-4,8,4.3108E-2,4.3108E-2,1.85E-4,1.85E-4]
[null,"SBH8","KIPPA-RING, REDCLIFFE","URBAN",648,2.7280000000000002,1.6859999999999999,1.9624999999999999,null,null,5,7.8810000000000009E-3,7.6039999999999996E-3,1.07E-4,1.06E-4,2,2.0579999999999999E-3,2.0579999999999999E-3,6.9500000000000004E-6,6.9500000000000004E-6]
[null,"SBH9","KIPPA-RING, NEWPORT, SCARBOROUGH","URBAN",1172,4.5999999999999999E-2,6.9589999999999996,3.944,null,null,3,3.3399999999999999E-4,3.3399999999999999E-4,2.9799999999999998E-6,2.9799999999999998E-6,4,1.0318000000000001E-2,1.0318000000000001E-2,6.5500000000000006E-5,6.5500000000000006E-5]
[null,"SBK10A",null,"RURAL",null,null,null,null,null,null,1,2.02E-4,2.02E-4,2.5600000000000001E-6,2.5600000000000001E-6]
[null,"SBK11A","MACGREGOR, ROBERTSON, SUNNYBANK","URBAN",547,null,null,3.1627999999999998]
[null,"SBK21","EIGHT MILE PLAINS, MACGREGOR, ROBERTSON, SUNNYBANK","RURAL",1545,9.0790000000000006,1.361,2.153]
[null,"SBK21","EIGHT MILE PLAINS, MACGREGOR, ROBERTSON, SUNNYBANK","URBAN",null,9.0790000000000006,1.361,2.153,null,null,12,0.226468,0.13883599999999999,2.225E-3,1.5709999999999999E-3,3,1.1252E-2,1.1252E-2,3.57E-5,3.57E-5]
[null,"SBK22A","NATHAN, ROBERTSON, SALISBURY","RURAL",816,2.827,2.8809999999999998,1.2194,null,null,2,1.34E-4,1.34E-4,5.13E-6,5.13E-6,15,0.19836599999999999,0.18010399999999999,8.2799999999999996E-4,7.6099999999999996E-4]
[null,"SBK4",null,"URBAN",null,null,null,null,null,null,2,4.9649999999999998E-3,4.9649999999999998E-3,7.3499999999999998E-5,7.3499999999999998E-5]
[null,"SBK4OLD",null,"URBAN",null,1.206,3.2850000000000001,null,null,null,2,1.5788E-2,1.5788E-2,8.4400000000000005E-5,8.4400000000000005E-5]
[null,"SBK9",null,"URBAN",null,null,null,null,null,null,1,6.1342000000000001E-2,6.1342000000000001E-2,8.7600000000000004E-4,8.7600000000000004E-4,2,8.4670000000000006E-3,8.4670000000000006E-3,2.58E-5,2.58E-5]
[null,"SBTWED11",null,"URBAN",2,null,1.389,2.9723000000000002,null,null,null,null,null,null,null,1,8.6200000000000003E-4,8.6200000000000003E-4,1.99E-6,1.99E-6]
[null,"SBY11A","NATHAN, SALISBURY, TARRAGINDI","URBAN",1022,5.3710000000000004,2.0870000000000002,3.0865999999999998,null,null,2,1.5529999999999999E-3,1.5529999999999999E-3,2.1800000000000001E-5,2.1800000000000001E-5,9,1.9703999999999999E-2,1.9703999999999999E-2,6.6500000000000004E-5,6.6500000000000004E-5]
[null,"SBY14A","SALISBURY","URBAN",970,4.0730000000000004,0.79900000000000004,1.9815,null,null,5,3.28E-4,3.1300000000000002E-4,4.9599999999999999E-6,3.9700000000000001E-6,28,0.109543,0.10308100000000001,4.8700000000000002E-4,4.57E-4]
[null,"SBY15A","SALISBURY","URBAN",40,0.65300000000000002,0.54300000000000004,1.0288999999999999,null,null,null,null,null,null,null,2,1.1100000000000001E-3,1.1100000000000001E-3,1.99E-6,1.99E-6]
[null,"SBY3A","NATHAN, SALISBURY","URBAN",493,2.5710000000000002,0.84299999999999997,2.0768,null,null,5,9.0562000000000004E-2,9.0562000000000004E-2,6.0700000000000001E-4,6.0700000000000001E-4,20,8.2419000000000006E-2,8.2419000000000006E-2,3.3399999999999999E-4,3.3399999999999999E-4]
[null,"SBY3B","SALISBURY","URBAN",1,null,0.39900000000000002,null,null,null,1,1.0900000000000001E-4,1.0900000000000001E-4,9.9000000000000005E-7,9.9000000000000005E-7]
[null,"SBY4",null,"URBAN",14]
[null,"SBY4OLD",null,"URBAN",null,null,null,null,null,null,1,4.156E-3,4.156E-3,1.3900000000000001E-5,1.3900000000000001E-5]
[null,"SBY6A","MOOROOKA, SALISBURY","URBAN",268,2.306,0.68200000000000005,1.6576,null,null,3,1.366E-3,1.366E-3,7.9400000000000002E-6,7.9400000000000002E-6,5,7.927E-3,7.927E-3,3.2799999999999998E-5,3.2799999999999998E-5]
[null,"SBY7A","SALISBURY","URBAN",4,null,2.1789999999999998,4.4965000000000002,null,null,null,null,null,null,null,1,3.2439999999999999E-3,3.2439999999999999E-3,9.9000000000000005E-7,9.9000000000000005E-7]
[null,"SCBTR1H","BRISBANE","CBD",5]
[null,"SCCT1","BRISBANE","CBD",1]
[null,"SCV4","HOPE ISLAND","URBAN",395,null,4.2779999999999996,null,null,null,6,8.0709000000000003E-2,8.0709000000000003E-2,8.03E-4,8.03E-4]
[null,"SCV5","HOPE ISLAND","URBAN",209,null,2.1890000000000001,null,null,null,2,2.4674000000000001E-2,2.4674000000000001E-2,4.0000000000000002E-4,4.0000000000000002E-4]
[null,"SCV7","COOMERA, HOPE ISLAND","URBAN",396,null,7.9530000000000003,null,null,null,1,1.0399999999999999E-4,1.0399999999999999E-4,9.9000000000000005E-7,9.9000000000000005E-7,2,6.8859999999999998E-3,6.8859999999999998E-3,9.1299999999999997E-5,9.1299999999999997E-5]
[null,"SDM1","BRYDEN, CROSSDALE, MOUNT BYRON, SOMERSET DAM, TOOLOORUM","RURAL",185,72.165999999999997,0.03,0.34300000000000003,null,null,9,0.21098600000000001,0.21098600000000001,2.8730000000000001E-3,2.8730000000000001E-3,4,2.5607999999999999E-2,2.5607999999999999E-2,8.7200000000000005E-5,8.7200000000000005E-5]
[null,"SDS4","SURFERS PARADISE","URBAN",66,null,0.46800000000000003]
[null,"SDS5","SURFERS PARADISE","URBAN",64,null,0.16200000000000001]
[null,"SDSSPD8","SURFERS PARADISE","URBAN",null,null,0.55100000000000005,1.4098999999999999,null,null,null,null,null,null,null,1,7.6109999999999997E-3,7.6109999999999997E-3,2.6800000000000001E-5,2.6800000000000001E-5]
[null,"SDST1",null,"URBAN",null,null,null,null,null,null,1,8.7000000000000001E-5,8.7000000000000001E-5,9.9000000000000005E-7,9.9000000000000005E-7]
[null,"SFC11A","SPRINGFIELD LAKES","URBAN",2460,null,0.72799999999999998,null,null,null,1,1.5899999999999999E-4,1.5899999999999999E-4,9.9000000000000005E-7,9.9000000000000005E-7]
[null,"SFC12A","SPRINGFIELD CENTRAL, SPRINGFIELD LAKES","RURAL",2124,null,13.412000000000001,4.1345000000000001]
[null,"SFC12A","SPRINGFIELD CENTRAL, SPRINGFIELD LAKES","URBAN",null,null,13.412000000000001,4.1345000000000001,null,null,5,5.1900000000000004E-4,5.1900000000000004E-4,4.9599999999999999E-6,4.9599999999999999E-6,1,2.1259999999999999E-3,2.1259999999999999E-3,1.7900000000000001E-5,1.7900000000000001E-5]
[null,"SFC3A","SPRINGFIELD CENTRAL, SPRINGFIELD LAKES","URBAN",6,null,null,1.2384999999999999]
[null,"SFC6A","SPRINGFIELD CENTRAL, SPRINGFIELD LAKES","URBAN",9,null,1.605,0.83830000000000005,null,null,null,null,null,null,null,3,5.1199999999999998E-4,5.1199999999999998E-4,1.99E-6,1.99E-6]
[null,"SFD10","EVERTON PARK, STAFFORD HEIGHTS","URBAN",1339,5.5890000000000004,1.4610000000000001,2.4769000000000001,null,null,13,8.8369000000000003E-2,8.8369000000000003E-2,3.6900000000000002E-4,3.6900000000000002E-4,9,3.3520000000000001E-2,3.3520000000000001E-2,1.3899999999999999E-4,1.3899999999999999E-4]
[null,"SFD11","STAFFORD, STAFFORD HEIGHTS","URBAN",597,1.6279999999999999,2.1589999999999998,4.8776000000000002,null,null,5,3.6184000000000001E-2,3.6184000000000001E-2,1.1E-4,1.1E-4]
[null,"SFD2A","ASPLEY, BRIDGEMAN DOWNS, CHERMSIDE WEST, MCDOWALL, STAFFORD HEIGHTS","URBAN",1788,2.96,11.82,4.3632,null,null,8,3.0064E-2,3.0064E-2,1.07E-4,1.07E-4,2,1.1704000000000001E-2,1.1704000000000001E-2,4.8600000000000002E-5,4.8600000000000002E-5]
[null,"SFD3","EVERTON PARK, MCDOWALL, STAFFORD HEIGHTS","URBAN",1309,3.95,4.508,4.5727000000000002,null,null,9,0.75403100000000001,0.75403100000000001,6.4070000000000004E-3,6.4070000000000004E-3,2,9.7630000000000008E-3,9.7630000000000008E-3,3.57E-5,3.57E-5]
[null,"SFD4","EVERTON PARK, STAFFORD","URBAN",1304,6.0170000000000003,0.72699999999999998,3.1057000000000001,null,null,5,5.0900000000000001E-4,5.0900000000000001E-4,4.9599999999999999E-6,4.9599999999999999E-6,15,7.5088000000000002E-2,6.8751000000000007E-2,2.7300000000000002E-4,2.52E-4]
[null,"SFD5","CHERMSIDE WEST, MCDOWALL, STAFFORD HEIGHTS","URBAN",813,3.149,1.8580000000000001,2.2292000000000001,null,null,3,1.1705999999999999E-2,1.1705999999999999E-2,8.0900000000000004E-4,8.0900000000000004E-4,5,3.1230999999999998E-2,3.1230999999999998E-2,1.34E-4,1.34E-4]
[null,"SFD6B","STAFFORD, STAFFORD HEIGHTS","URBAN",740,3.0190000000000001,0.98199999999999998,2.5722,null,null,5,5.4954000000000003E-2,5.4954000000000003E-2,7.3899999999999997E-4,7.3899999999999997E-4,5,1.6442999999999999E-2,1.6442999999999999E-2,5.4599999999999999E-5,5.4599999999999999E-5]
[null,"SFD7A","ASPLEY, CHERMSIDE WEST, STAFFORD HEIGHTS","URBAN",1075,4.1779999999999999,2.4569999999999999,2.3626,null,null,6,2.1884000000000001E-2,2.1884000000000001E-2,7.9400000000000006E-5,7.9400000000000006E-5,20,6.3367000000000007E-2,6.0634E-2,2.6600000000000001E-4,2.4800000000000001E-4]
[null,"SFD8","MCDOWALL, STAFFORD HEIGHTS","URBAN",647,1.63,2.919,1.5624,null,null,2,4.4499999999999997E-4,4.4499999999999997E-4,1.99E-6,1.99E-6,1,7.6940000000000003E-3,7.6940000000000003E-3,2.2799999999999999E-5,2.2799999999999999E-5]
[null,"SFD9","CHERMSIDE, CHERMSIDE WEST, KEDRON, STAFFORD HEIGHTS","URBAN",862,4.0039999999999996,1.0529999999999999,1.7719,null,null,3,3.2720000000000002E-3,3.2720000000000002E-3,1.29E-5,1.29E-5,7,2.6915000000000001E-2,2.6915000000000001E-2,1.18E-4,1.18E-4]
[null,"SGBTR1H","BRISBANE","CBD",1,null,null,null,null,null,null,null,null,null,null,1,0.19544600000000001,0.19544600000000001,1.023E-3,1.023E-3]
[null,"SGC3","BRISBANE","CBD",1,null,0.13600000000000001]
[null,"SGC4","BRISBANE","CBD",1]
[null,"SGIT1","BRISBANE","CBD",1,null,null,null,null,null,null,null,null,null,null,1,1.6372000000000001E-2,1.6372000000000001E-2,2.5599999999999999E-4,2.5599999999999999E-4]
[null,"SGMT1","BRISBANE","CBD",1]
[null,"SGOTR1H","BRISBANE","URBAN",2]
[null,"SGOTR2H","BRISBANE","URBAN",1]
[null,"SGT22A","BOONDALL, DEAGON","URBAN",1657,7.0209999999999999,2.3679999999999999,3.3151999999999999,null,null,11,2.7400000000000001E-2,2.7400000000000001E-2,1.5699999999999999E-4,1.5699999999999999E-4,7,3.6039000000000002E-2,3.6039000000000002E-2,1.4799999999999999E-4,1.4799999999999999E-4]
[null,"SGT24A","BRACKEN RIDGE, BRIGHTON","URBAN",1560,5.9109999999999996,3.3220000000000001,3.7343999999999999,null,null,5,8.1779999999999995E-3,8.1779999999999995E-3,1.7899999999999999E-4,1.7899999999999999E-4,3,1.867E-3,1.867E-3,9.9299999999999998E-6,9.9299999999999998E-6]
[null,"SGT26A","BOONDALL, TAIGUM","RURAL",null,0.55100000000000005,3.2850000000000001,0.70499999999999996,null,null,3,8.0999999999999996E-4,8.0999999999999996E-4,7.6899999999999992E-6,7.6899999999999992E-6,3,1.528E-2,1.528E-2,6.1500000000000004E-5,6.1500000000000004E-5]
[null,"SGT26A","BOONDALL, TAIGUM","URBAN",387,0.55100000000000005,3.2850000000000001,0.70499999999999996]
[null,"SGT3","BRACKEN RIDGE, DEAGON, SANDGATE","RURAL",268,2.6389999999999998,1.278,0.85740000000000005,null,null,5,3.5823000000000001E-2,3.5823000000000001E-2,2.92E-4,2.92E-4,2,4.9319999999999998E-3,4.9319999999999998E-3,5.13E-5,5.13E-5]
[null,"SGT4","DEAGON, SANDGATE","URBAN",1413,5.694,2.0089999999999999,3.6962999999999999,null,null,15,0.31862400000000002,0.31862400000000002,2.9150000000000001E-3,2.9150000000000001E-3,3,1.8006999999999999E-2,1.8006999999999999E-2,7.4400000000000006E-5,7.4400000000000006E-5]
[null,"SGT5","BRACKEN RIDGE","URBAN",1120,4.4809999999999999,2.0699999999999998,2.5150000000000001,null,null,7,5.8564999999999999E-2,5.8564999999999999E-2,1.186E-3,1.186E-3,8,5.5410000000000001E-2,5.5410000000000001E-2,2.13E-4,2.13E-4]
[null,"SGT6","BRACKEN RIDGE","URBAN",1030,1.0669999999999999,5.0739999999999998,2.5531000000000001,null,null,1,1.1609999999999999E-3,1.1609999999999999E-3,4.4700000000000002E-5,4.4700000000000002E-5,2,2.1020000000000001E-3,2.1020000000000001E-3,1.6900000000000001E-5,1.6900000000000001E-5]
[null,"SGT7","DEAGON, SANDGATE, SHORNCLIFFE","URBAN",2034,10.339,1.17,4.0583,null,null,9,0.27798499999999998,0.27798499999999998,2.1189999999999998E-3,2.1189999999999998E-3,7,3.2916000000000001E-2,3.2916000000000001E-2,1.21E-4,1.21E-4]
[null,"SGT9","BOONDALL, TAIGUM, ZILLMERE","URBAN",1484,3.7,6.1120000000000001,4.6109,null,null,2,4.28E-4,4.28E-4,1.0900000000000001E-5,1.0900000000000001E-5,7,7.6109999999999997E-3,7.6109999999999997E-3,6.1500000000000004E-5,6.1500000000000004E-5]
[null,"SHDTR1H","BRISBANE","CBD",2]
[null,"SHW10A","CHELMER, GRACEVILLE, SHERWOOD","URBAN",1234,7.2619999999999996,0.43,3.0104000000000002,null,null,20,6.6137000000000001E-2,6.6137000000000001E-2,7.7700000000000002E-4,7.7700000000000002E-4,9,3.2543999999999997E-2,3.2543999999999997E-2,1.3200000000000001E-4,1.3200000000000001E-4]
[null,"SHW12","FIG TREE POCKET","URBAN",630,4.6619999999999999,3.1760000000000002,2.7627000000000002,null,null,4,2.869E-3,2.869E-3,7.64E-5,7.64E-5,6,2.0858999999999999E-2,2.0858999999999999E-2,1.21E-4,1.21E-4]
[null,"SHW3","CORINDA, SHERWOOD","URBAN",1123,5.3280000000000003,0.26200000000000001,3.4104999999999999,null,null,7,1.1899E-2,1.1899E-2,1.93E-4,1.93E-4,3,4.3769999999999998E-3,4.3769999999999998E-3,2.2799999999999999E-5,2.2799999999999999E-5]
[null,"SHW4","FIG TREE POCKET, INDOOROOPILLY","URBAN",611,4.9690000000000003,1.04,1.7528999999999999,null,null,1,8.1727999999999995E-2,8.1727999999999995E-2,5.8699999999999996E-4,5.8699999999999996E-4,6,4.5030000000000001E-3,4.5030000000000001E-3,2.6800000000000001E-5,2.6800000000000001E-5]
[null,"SHW5A","CHELMER, GRACEVILLE, SHERWOOD","URBAN",898,6.306,0.55100000000000005,3.3342999999999998,null,null,23,9.3136999999999998E-2,9.3136999999999998E-2,8.1099999999999998E-4,8.1099999999999998E-4,2,6.3500000000000004E-4,6.3500000000000004E-4,2.9799999999999998E-6,2.9799999999999998E-6]
[null,"SHW6",null,"URBAN",36,null,null,null,null,null,null,null,null,null,null,1,1.382E-3,1.382E-3,1.19E-5,1.19E-5]
[null,"SHW6A","GRACEVILLE, SHERWOOD","URBAN",1176,5.3780000000000001,0.27800000000000002,3.0485000000000002,null,null,3,2.4899999999999998E-4,2.4899999999999998E-4,2.9799999999999998E-6,2.9799999999999998E-6,10,4.7613999999999997E-2,4.7613999999999997E-2,2.03E-4,2.03E-4]
[null,"SHW6B","CORINDA, SHERWOOD","URBAN",1398,4.0419999999999998,1.2350000000000001,2.5531000000000001,null,null,6,6.4499999999999996E-4,6.4499999999999996E-4,5.9599999999999997E-6,5.9599999999999997E-6,3,3.1995999999999997E-2,3.1995999999999997E-2,1.35E-4,1.35E-4]
[null,"SHW81","CORINDA, SHERWOOD","URBAN",1072,3.7480000000000002,0.22500000000000001,2.153,null,null,9,0.22908400000000001,0.22908400000000001,2.2009999999999998E-3,2.2009999999999998E-3,5,8.5839999999999996E-3,8.5839999999999996E-3,4.07E-5,4.07E-5]
[null,"SIS1","POINT LOOKOUT","RURAL",1200,24.001000000000001,2.9430000000000001,3.1627999999999998,null,null,10,1.9884850000000001,1.9884850000000001,8.1620000000000009E-3,8.1620000000000009E-3,4,5.6734E-2,5.6734E-2,3.3100000000000002E-4,3.3100000000000002E-4]
[null,"SIS2","AMITY, DUNWICH, NTH STRADBROKE ISLD","RURAL",1003,40.045999999999999,0.56000000000000005,1.7909999999999999,null,null,9,0.46265299999999998,0.46265299999999998,4.5700000000000003E-3,4.5700000000000003E-3,5,4.3123000000000002E-2,4.3123000000000002E-2,2.2599999999999999E-4,2.2599999999999999E-4]
[null,"SMF11A","CAMP MOUNTAIN, ENOGGERA RESERVOIR, FERNY HILLS, HIGHVALE, JOLLYS LOOKOUT, MOUNT NEBO, SAMFORD VALLEY, UPPER KEDRON, WIGHTS MOUNTAIN","RURAL",668,44.738999999999997,1.5349999999999999,1.8290999999999999,null,null,19,0.84629900000000002,0.38666800000000001,2.2279999999999999E-3,1.689E-3,26,0.57245199999999996,0.57245199999999996,1.3179999999999999E-3,1.3179999999999999E-3]
[null,"SMF11A","CAMP MOUNTAIN, ENOGGERA RESERVOIR, FERNY HILLS, HIGHVALE, JOLLYS LOOKOUT, MOUNT NEBO, SAMFORD VALLEY, UPPER KEDRON, WIGHTS MOUNTAIN","URBAN",668,44.738999999999997,1.5349999999999999,1.8290999999999999,null,null,null,null,null,null,null,1,1.591E-3,1.591E-3,6.9500000000000004E-6,6.9500000000000004E-6]
[null,"SMF12A","CASHMERE, CEDAR CREEK, CLEAR MOUNTAIN, CLOSEBURN, KOBBLE CREEK, MOUNT SAMSON, SAMFORD VALLEY, SAMSONVALE, YUGAR","RURAL",911,58.192,3.9159999999999999,3.1246999999999998,null,null,20,2.8524660000000002,0.47215499999999999,4.3220000000000003E-3,1.9889999999999999E-3,12,0.26060100000000003,0.26060100000000003,8.5400000000000005E-4,8.5400000000000005E-4]
[null,"SMF13A","CAMP MOUNTAIN, SAMFORD VILLAGE","RURAL",51,null,null,0.15240000000000001]
[null,"SMF15A","HIGHVALE, SAMFORD VALLEY, SAMFORD VILLAGE","RURAL",492,null,null,1.8290999999999999,null,null,2,0.23370299999999999,0.23370299999999999,1.2769999999999999E-3,1.2769999999999999E-3,3,5.5413999999999998E-2,5.5413999999999998E-2,1.2799999999999999E-4,1.2799999999999999E-4]
[null,"SMF1B","BUNYA, CAMP MOUNTAIN, DRAPER, FERNY HILLS, MOUNT SAMSON, SAMFORD VALLEY, SAMFORD VILLAGE","RURAL",806,19.619,3.823,3.5057999999999998,null,null,10,0.14704800000000001,0.14704800000000001,1.023E-3,1.023E-3,14,0.16103300000000001,0.16103300000000001,6.3599999999999996E-4,6.3599999999999996E-4]
[null,"SMF2A",null,"RURAL",null,null,null,null,null,null,11,0.23433200000000001,0.23433200000000001,4.8580000000000003E-3,4.8580000000000003E-3,7,0.129722,0.129722,4.08E-4,4.08E-4]
[null,"SMF3A","CEDAR CREEK, CLOSEBURN, HIGHVALE, MT GLORIOUS, SAMFORD VALLEY","RURAL",792,29.559000000000001,6.8479999999999999,2.0196000000000001,null,null,18,1.2624979999999999,0.457596,5.2519999999999997E-3,3.225E-3,13,0.47680400000000001,0.47680400000000001,1.6919999999999999E-3,1.6919999999999999E-3]
[null,"SMF5A","HIGHVALE, MOUNT NEBO, SAMFORD VALLEY, WIGHTS MOUNTAIN","RURAL",785,35.198,2.3199999999999998,1.9624999999999999,null,null,24,0.26985700000000001,0.26959499999999997,3.0400000000000002E-3,3.0379999999999999E-3,32,0.43119000000000002,0.43119000000000002,1.5120000000000001E-3,1.5120000000000001E-3]
[null,"SMF5B",null,"RURAL",null,5.298,4.4009999999999998,null,null,null,2,2.9E-4,2.9E-4,5.13E-6,5.13E-6,2,6.293E-3,6.293E-3,2.5599999999999999E-5,2.5599999999999999E-5]
[null,"SMF6A",null,"RURAL",null,null,null,null,null,null,8,0.129468,0.129468,2.0170000000000001E-3,2.0170000000000001E-3,24,0.41849399999999998,0.41849399999999998,1.1969999999999999E-3,1.1969999999999999E-3]
[null,"SMR10A","SUMNER","URBAN",250,0.61899999999999999,4.1740000000000004,2.6674000000000002]
[null,"SMR10B","MIDDLE PARK, WESTLAKE","URBAN",1401,null,10.217000000000001,4.2298,null,null,2,3.0200000000000002E-4,3.0200000000000002E-4,1.99E-6,1.99E-6,2,1.3665E-2,1.3665E-2,6.8499999999999998E-5,6.8499999999999998E-5]
[null,"SMR12A","JAMBOREE HEIGHTS, MIDDLE PARK, MT OMMANEY, SUMNER","URBAN",1208,0.81100000000000005,6.7960000000000003,3.5629,null,null,4,1.2297000000000001E-2,1.2297000000000001E-2,4.7599999999999998E-5,4.7599999999999998E-5,3,2.4570000000000002E-2,2.4570000000000002E-2,1.2E-4,1.2E-4]
[null,"SMR12B","DARRA","URBAN",115,0.9,2.113,3.2389999999999999,null,null,null,null,null,null,null,1,4.2499999999999998E-4,4.2499999999999998E-4,3.9700000000000001E-6,3.9700000000000001E-6]
[null,"SMR13B","MT OMMANEY, SINNAMON PARK","URBAN",581,null,5.2430000000000003,2.8199000000000001,null,null,2,2.04E-4,2.04E-4,1.99E-6,1.99E-6]
[null,"SMR15A","DARRA, JAMBOREE HEIGHTS, RIVERHILLS, SUMNER","URBAN",1407,0.40500000000000003,8.42,3.2961999999999998,null,null,9,1.0104E-2,1.0104E-2,6.4499999999999996E-5,6.4499999999999996E-5,4,3.6518000000000002E-2,3.4257000000000003E-2,1.93E-4,1.5899999999999999E-4]
[null,"SMR1A","MIDDLE PARK, WESTLAKE","URBAN",918,0.105,7.38,3.2389999999999999,null,null,2,6.8581000000000003E-2,6.8581000000000003E-2,9.0600000000000001E-4,9.0600000000000001E-4,1,1.55E-4,1.55E-4,1.99E-6,1.99E-6]
[null,"SMR3B","DARRA","URBAN",68,0.36099999999999999,2.4220000000000002,3.5057999999999998,null,null,null,null,null,null,null,3,1.003E-3,1.003E-3,1.29E-5,1.29E-5]
[null,"SMR4A","DARRA, SEVENTEEN MILE ROCKS, SINNAMON PARK","URBAN",1302,0.58499999999999996,8.6310000000000002,4.8585000000000003,null,null,null,null,null,null,null,3,3.4840000000000001E-3,3.4840000000000001E-3,3.18E-5,3.18E-5]
[null,"SMR6A","JAMBOREE HEIGHTS, MT OMMANEY","URBAN",70,0.84,3.0870000000000002,2.8769999999999998]
[null,"SMR7A","MIDDLE PARK, RIVERHILLS, WESTLAKE","URBAN",1191,3.5999999999999997E-2,9.0779999999999994,2.8008000000000002,null,null,5,3.5599999999999998E-4,2.7999999999999998E-4,4.9599999999999999E-6,3.9700000000000001E-6,1,4.3870000000000003E-3,4.3870000000000003E-3,2.58E-5,2.58E-5]
[null,"SMR7B","DARRA, SUMNER","URBAN",211,0.82799999999999996,2.085,2.4578000000000002,null,null,null,null,null,null,null,1,1.126E-3,1.126E-3,1.3900000000000001E-5,1.3900000000000001E-5]
[null,"SMR9A","DARRA, SEVENTEEN MILE ROCKS, SINNAMON PARK","URBAN",1076,4.3479999999999999,5.5679999999999996,3.8677999999999999,null,null,3,1.0352999999999999E-2,1.0352999999999999E-2,1.2899999999999999E-4,1.2899999999999999E-4,5,5.5812E-2,5.5812E-2,1.01E-4,1.01E-4]
[null,"SOLSPH5","SURFERS PARADISE","URBAN",11,null,0.13100000000000001]
[null,"SOLTR1H","SURFERS PARADISE","URBAN",4]
[null,"SPC2B","ADARE, ATKINSONS DAM, BUARABA, BUARABA CREEK, CHURCHABLE, CLARENDON, COOMINYA, GATTON, LAKE CLARENDON, MORTON VALE, SPRING CREEK","RURAL",448,92.944999999999993,4.0650000000000004,3.4676999999999998,null,null,5,0.34989799999999999,0.34989799999999999,2.2659999999999998E-3,2.2659999999999998E-3,9,9.6530000000000001E-3,9.6530000000000001E-3,2.8200000000000001E-5,2.8200000000000001E-5]
[null,"SPD11A","SURFERS PARADISE","URBAN",1864,5.3940000000000001,1.1279999999999999,4.0202,null,null,7,1.4973999999999999E-2,1.4973999999999999E-2,8.5400000000000002E-5,8.5400000000000002E-5,10,5.4329000000000002E-2,5.4329000000000002E-2,2.9599999999999998E-4,2.9599999999999998E-4]
[null,"SPD12B","SURFERS PARADISE","URBAN",748,0.56499999999999995,1.0980000000000001,2.7054999999999998,null,null,1,2.8699999999999998E-4,2.8699999999999998E-4,9.9000000000000005E-7,9.9000000000000005E-7]
[null,"SPD19A","MAIN BEACH, SURFERS PARADISE","URBAN",177,6.2E-2,4.0419999999999998,2.8389000000000002,null,null,null,null,null,null,null,1,5.4770000000000001E-3,5.4770000000000001E-3,3.0800000000000003E-5,3.0800000000000003E-5]
[null,"SPD1A","SURFERS PARADISE","URBAN",42,null,0.80700000000000005,3.8677999999999999]
[null,"SPD1B","MAIN BEACH","URBAN",1,null,5.2190000000000003,3.22]
[null,"SPD21A","SURFERS PARADISE","URBAN",1,null,1.278,2.8769999999999998]
[null,"SPD28A","SURFERS PARADISE","URBAN",1,null,0.45500000000000002,4.0011999999999999]
[null,"SPD29",null,"URBAN",160]
[null,"SPD29A","SURFERS PARADISE","URBAN",1040,0.17499999999999999,4.5890000000000004,3.6391,null,null,4,4.2400000000000001E-4,4.2400000000000001E-4,3.9700000000000001E-6,3.9700000000000001E-6,1,1.7387E-2,null,5.7599999999999997E-5]
[null,"SPD2B","SURFERS PARADISE","URBAN",976,null,3.1419999999999999,3.1819000000000002,null,null,1,1.2E-4,1.2E-4,9.9000000000000005E-7,9.9000000000000005E-7,3,4.4679999999999997E-3,4.4679999999999997E-3,2.7800000000000001E-5,2.7800000000000001E-5]
[null,"SPD3A","SURFERS PARADISE","URBAN",587,null,2.41,1.7909999999999999,null,null,1,1.6899999999999999E-4,1.6899999999999999E-4,3.3699999999999999E-5,3.3699999999999999E-5,4,8.0144999999999994E-2,8.0144999999999994E-2,2.41E-4,2.41E-4]
[null,"SPD4A","MAIN BEACH, SURFERS PARADISE","RURAL",1011,null,5.7949999999999999,3.6962999999999999,null,null,2,5.22E-4,5.22E-4,5.13E-6,5.13E-6]
[null,"SPD4A","MAIN BEACH, SURFERS PARADISE","URBAN",1011,null,5.7949999999999999,3.6962999999999999,null,null,null,null,null,null,null,1,8.2590000000000007E-3,8.2590000000000007E-3,1.9899999999999999E-5,1.9899999999999999E-5]
[null,"SPD4B","SURFERS PARADISE","URBAN",301,null,2.1949999999999998,3.5438999999999998,null,null,1,1.27E-4,1.27E-4,9.9000000000000005E-7,9.9000000000000005E-7,1,5.4199999999999995E-4,5.4199999999999995E-4,1.29E-5,1.29E-5]
[null,"SPD5A","SURFERS PARADISE","URBAN",788,null,2.262,1.9244000000000001,null,null,1,2.6499999999999999E-4,2.6499999999999999E-4,9.9000000000000005E-7,9.9000000000000005E-7]
[null,"SPD5B","SURFERS PARADISE","URBAN",70,null,1.72,3.1438000000000001,null,null,null,null,null,null,null,1,1.56E-4,1.56E-4,9.9000000000000005E-7,9.9000000000000005E-7]
[null,"SPD6B","SURFERS PARADISE","URBAN",187,null,1.024,1.9624999999999999,null,null,null,null,null,null,null,1,1.2999999999999999E-5,1.2999999999999999E-5,9.9000000000000005E-7,9.9000000000000005E-7]
[null,"SPD7B","MAIN BEACH, SURFERS PARADISE","URBAN",22,null,3.3109999999999999,1.3337000000000001]
[null,"SPDSPH27","SURFERS PARADISE","URBAN",23,null,0.81599999999999995,1.6386000000000001]
[null,"SPDSPH8","SURFERS PARADISE","URBAN",1,null,1.34,1.5242,null,null,1,2.42E-4,2.42E-4,9.9000000000000005E-7,9.9000000000000005E-7]
[null,"SPE1","BRENDALE","URBAN",213,2.464,1.2949999999999999,2.5722]
[null,"SPE20A","BRENDALE, STRATHPINE","URBAN",680,3.363,2.4990000000000001,5.3539000000000003,null,null,3,8.8400000000000002E-4,8.8400000000000002E-4,3.57E-5,3.57E-5,1,5.7799999999999995E-4,5.7799999999999995E-4,5.9599999999999997E-6,5.9599999999999997E-6]
[null,"SPE22A","BRENDALE","URBAN",302,2.9380000000000002,2.1139999999999999,4.2869000000000002]
[null,"SPE24","BRENDALE","URBAN",68,1.159,1.371,3.3151999999999999]
[null,"SPE5","BRENDALE","URBAN",258,2.1659999999999999,2.1070000000000002,3.6962999999999999,null,null,null,null,null,null,null,2,6.96E-4,6.96E-4,3.9700000000000001E-6,3.9700000000000001E-6]
[null,"SPE9","BRENDALE, STRATHPINE","URBAN",984,3.931,6.7060000000000004,4.6299000000000001,null,null,2,1.9599999999999999E-4,1.9599999999999999E-4,1.99E-6,1.99E-6,4,2.8709999999999999E-3,2.8709999999999999E-3,1.6900000000000001E-5,1.6900000000000001E-5]
[null,"SPEWSP29","STRATHPINE","URBAN",33,1.962,6.2E-2,0.66690000000000005,null,null,null,null,null,null,null,2,6.8000000000000005E-4,6.8000000000000005E-4,2.9799999999999998E-6,2.9799999999999998E-6]
[null,"SPF12B",null,"URBAN",null,null,14.073,6.1731999999999996,null,null,4,1.325E-3,1.325E-3,3.6699999999999998E-5,3.6699999999999998E-5,2,1.9599999999999999E-2,1.9599999999999999E-2,7.64E-5,7.64E-5]
[null,"SPF15A","AUGUSTINE HEIGHTS, BROOKWATER","URBAN",824,null,8.2579999999999991,4.4013,null,null,1,9.2999999999999997E-5,9.2999999999999997E-5,9.9000000000000005E-7,9.9000000000000005E-7,6,7.0920000000000002E-3,7.0920000000000002E-3,4.9599999999999999E-5,4.9599999999999999E-5]
[null,"SPF17B","SPRINGFIELD","URBAN",1020,0.73499999999999999,6.6989999999999998,3.5819999999999999,null,null,2,0.10237,0.10237,1.013E-3,1.013E-3]
[null,"SPF1B","AUGUSTINE HEIGHTS, SPRINGFIELD","RURAL",803,null,9.5830000000000002,2.8008000000000002,null,null,1,1.6100000000000001E-4,1.6100000000000001E-4,2.5600000000000001E-6,2.5600000000000001E-6]
[null,"SPFSTC2","BROOKWATER","URBAN",1,0.746,0.81399999999999995,2.8389000000000002]
[null,"SPHT1","SURFERS PARADISE","URBAN",1]
[null,"SPO11A","LABRADOR, SOUTHPORT","URBAN",2007,2.254,3.8039999999999998,4.2869000000000002,null,null,8,0.45750000000000002,0.45750000000000002,2.281E-3,2.281E-3,2,5.6564000000000003E-2,5.6564000000000003E-2,2.1000000000000001E-4,2.1000000000000001E-4]
[null,"SPO16A","ASHMORE, SOUTHPORT","URBAN",940,4.5830000000000002,4.3529999999999998,4.8966000000000003,null,null,1,1.84E-4,1.84E-4,9.9000000000000005E-7,9.9000000000000005E-7,1,2.8310000000000002E-3,2.8310000000000002E-3,3.0800000000000003E-5,3.0800000000000003E-5]
[null,"SPO31A","SOUTHPORT","URBAN",424,2.1949999999999998,1.2669999999999999,4.0011999999999999,null,null,1,3.8000000000000002E-5,3.8000000000000002E-5,9.9000000000000005E-7,9.9000000000000005E-7]
[null,"SPO32A","LABRADOR, SOUTHPORT","URBAN",1834,5.5039999999999996,2.0289999999999999,3.5057999999999998,null,null,11,0.17063999999999999,0.17063999999999999,1.856E-3,1.856E-3,27,0.128634,0.128634,4.6700000000000002E-4,4.6700000000000002E-4]
[null,"SPO33A","MAIN BEACH","URBAN",12,null,3.7810000000000001,3.3723999999999998]
[null,"SPO3A","ASHMORE, SOUTHPORT","URBAN",1160,4.2649999999999997,1.9370000000000001,3.5247999999999999,null,null,3,4.5199999999999998E-4,4.5199999999999998E-4,2.9799999999999998E-6,2.9799999999999998E-6]
[null,"SPO40A","SOUTHPORT","URBAN",21,null,0.70099999999999996,0.78120000000000001]
[null,"SPO41A","LABRADOR, SOUTHPORT","URBAN",2210,5.3360000000000003,1.603,3.5819999999999999,null,null,7,7.8100000000000001E-4,7.8100000000000001E-4,6.9500000000000004E-6,6.9500000000000004E-6,24,0.24537700000000001,0.24537700000000001,7.85E-4,7.85E-4]
[null,"SPO47A","SOUTHPORT","URBAN",1291,2.8719999999999999,1.4590000000000001,3.2961999999999998,null,null,2,1.8200000000000001E-4,1.8200000000000001E-4,1.99E-6,1.99E-6,4,4.9769999999999997E-3,4.9769999999999997E-3,2.3799999999999999E-5,2.3799999999999999E-5]
[null,"SPO49A","SOUTHPORT","URBAN",118,null,2.5510000000000002,2.6484000000000001]
[null,"SPO49B","MAIN BEACH","URBAN",997,null,4.7279999999999998,2.0005999999999999,null,null,1,2.4699999999999999E-4,2.4699999999999999E-4,9.9000000000000005E-7,9.9000000000000005E-7]
[null,"SPO4A","SOUTHPORT","URBAN",13,null,1.2370000000000001,4.8585000000000003]
[null,"SPO51A","SOUTHPORT","URBAN",1386,4.9630000000000001,0.64800000000000002,2.9723000000000002,null,null,10,6.032E-3,6.032E-3,6.1500000000000004E-5,6.1500000000000004E-5,5,1.8582999999999999E-2,1.8582999999999999E-2,6.6500000000000004E-5,6.6500000000000004E-5]
[null,"SPO52A","SOUTHPORT","URBAN",41,null,1.2889999999999999,2.5912000000000002,null,null,null,null,null,null,null,1,8.7999999999999998E-5,8.7999999999999998E-5,9.9000000000000005E-7,9.9000000000000005E-7]
[null,"SPO55A","SOUTHPORT","URBAN",557,0.39300000000000002,1.5609999999999999,2.7627000000000002,null,null,3,4.17E-4,4.17E-4,2.9799999999999998E-6,2.9799999999999998E-6,2,2.2579999999999999E-2,2.2579999999999999E-2,6.5500000000000006E-5,6.5500000000000006E-5]
[null,"SPO5A","MAIN BEACH","URBAN",839,null,3.238,3.4866999999999999,null,null,null,null,null,null,null,1,3.1399999999999999E-4,3.1399999999999999E-4,9.9000000000000005E-7,9.9000000000000005E-7]
[null,"SPO60A","ASHMORE, SOUTHPORT","URBAN",1287,5.8179999999999996,0.94699999999999995,3.3342999999999998,null,null,null,null,null,null,null,7,2.7161999999999999E-2,2.7161999999999999E-2,9.6299999999999996E-5,9.6299999999999996E-5]
[null,"SPO60B","SOUTHPORT","URBAN",87,0.60799999999999998,0.53900000000000003,1.2575000000000001]
[null,"SPO61A","SOUTHPORT","URBAN",282,1.2529999999999999,0.85,2.8580000000000001,null,null,null,null,null,null,null,1,1.2555E-2,1.2555E-2,2.3799999999999999E-5,2.3799999999999999E-5]
[null,"SPO67B","LABRADOR, SOUTHPORT","URBAN",1492,5.4660000000000002,2.403,3.601,null,null,12,1.2494E-2,1.2494E-2,1.9100000000000001E-4,1.9100000000000001E-4,4,5.0099999999999997E-3,5.0099999999999997E-3,1.0900000000000001E-5,1.0900000000000001E-5]
[null,"SPO69A","SOUTHPORT","URBAN",2230,1.4410000000000001,1.823,3.2581000000000002,null,null,4,2.8200000000000002E-4,2.8200000000000002E-4,3.9700000000000001E-6,3.9700000000000001E-6,4,4.4995E-2,4.4995E-2,1.3200000000000001E-4,1.3200000000000001E-4]
[null,"SPO7A","SOUTHPORT","URBAN",530,null,2.5209999999999999,2.1720999999999999]
[null,"SPO8A","SOUTHPORT","URBAN",797,3.6280000000000001,3.306,2.4769000000000001,null,null,6,2.7740999999999998E-2,2.7740999999999998E-2,1.47E-4,1.47E-4]
[null,"SPO9A","MAIN BEACH","URBAN",103,null,6.5780000000000003,2.9912999999999998]
[null,"SPOSSS15","SOUTHPORT","URBAN",165,null,2.4750000000000001,4.2869000000000002,null,null,1,9.3999999999999994E-5,9.3999999999999994E-5,9.9000000000000005E-7,9.9000000000000005E-7]
[null,"SPOSSS35","SOUTHPORT","URBAN",74,0.17399999999999999,1.419,2.4769000000000001]
[null,"SPOWEL13","SOUTHPORT","URBAN",13,null,1.573,2.3816000000000002]
[null,"SPST0",null,"URBAN",1,null,null,null,null,null,null,null,null,null,null,1,1.268E-3,1.268E-3,9.9000000000000005E-7,9.9000000000000005E-7]
[null,"SQBT1","BRISBANE","CBD",2]
[null,"SRD14A","CARINA, CARINDALE","URBAN",1646,3.6509999999999998,6.9059999999999997,4.306,null,null,6,9.0399999999999996E-4,9.0399999999999996E-4,1.59E-5,1.59E-5,6,2.0368000000000001E-2,2.0368000000000001E-2,9.6299999999999996E-5,9.6299999999999996E-5]
[null,"SRD18A","CARINA, CARINDALE","URBAN",1095,2.0299999999999998,4.9669999999999996,3.2389999999999999,null,null,4,7.4739999999999997E-3,7.4739999999999997E-3,4.57E-5,4.57E-5,4,3.5609999999999999E-3,3.5609999999999999E-3,6.4499999999999996E-5,6.4499999999999996E-5]
[null,"SRD19A","CARINA HEIGHTS, CARINDALE","URBAN",2011,2.9319999999999999,9.0030000000000001,4.4394,null,null,6,8.7699999999999996E-4,8.7699999999999996E-4,1.59E-5,1.59E-5,7,2.8739000000000001E-2,2.8739000000000001E-2,1.05E-4,1.05E-4]
[null,"SRD4A","CARINDALE","URBAN",864,1.4910000000000001,4.306,3.0104000000000002,null,null,2,1.3899999999999999E-4,1.3899999999999999E-4,1.99E-6,1.99E-6,4,1.9650000000000002E-3,1.9650000000000002E-3,1.59E-5,1.59E-5]
[null,"SRTTR1","NEWSTEAD","URBAN",2]
[null,"SSC31",null,"URBAN",1]
[null,"SSS4","SOUTHPORT","URBAN",30,null,0.104]
[null,"SSSTR1H",null,"URBAN",21,null,null,null,null,null,1,1.3100000000000001E-4,1.3100000000000001E-4,9.9000000000000005E-7,9.9000000000000005E-7]
[null,"STC1","SPRINGFIELD CENTRAL","URBAN",2,null,1.7070000000000001]
[null,"STC7","CAMIRA, SPRINGFIELD, SPRINGFIELD CENTRAL, SPRINGFIELD LAKES","URBAN",1672,0.78800000000000003,13.21,null,null,null,1,1.4999999999999999E-4,1.4999999999999999E-4,9.9000000000000005E-7,9.9000000000000005E-7,3,2.7780000000000001E-3,2.7780000000000001E-3,2.0800000000000001E-5,2.0800000000000001E-5]
[null,"STL1A","ST LUCIA","URBAN",1731,3.3149999999999999,0.65500000000000003,2.153,null,null,13,1.4047E-2,1.3872000000000001E-2,2.63E-4,2.6200000000000003E-4,13,0.24055000000000001,0.24055000000000001,6.7199999999999996E-4,6.7199999999999996E-4]
[null,"STL2","ST LUCIA","URBAN",1001,1.881,0.97499999999999998,1.9434,null,null,null,null,null,null,null,5,5.0694999999999997E-2,5.0694999999999997E-2,1.6699999999999999E-4,1.6699999999999999E-4]
[null,"STL3","ST LUCIA","URBAN",242,1.167,0.27600000000000002,0.99080000000000001,null,null,2,1.3787000000000001E-2,1.3787000000000001E-2,8.9300000000000002E-5,8.9300000000000002E-5,2,3.7290000000000001E-3,3.7290000000000001E-3,2.58E-5,2.58E-5]
[null,"STL5","ST LUCIA","URBAN",96,null,1.1919999999999999,1.1241000000000001,null,null,null,null,null,null,null,1,2.9889999999999999E-3,2.9889999999999999E-3,9.9000000000000005E-7,9.9000000000000005E-7]
[null,"STT13A","ALBERTON, STEIGLITZ, WOONGOOLBA","RURAL",83,21.736000000000001,0.63600000000000001,3.0485000000000002,null,null,6,9.0840000000000001E-3,8.5800000000000008E-3,3.8399999999999998E-5,3.5899999999999998E-5,10,2.8443E-2,2.8443E-2,1.08E-4,1.08E-4]
[null,"STT1B","ALBERTON, GILBERTON, ORMEAU, STAPYLTON, WOONGOOLBA","RURAL",90,17.161000000000001,0.52600000000000002,1.81,null,null,2,1.0285000000000001E-2,7.7710000000000001E-3,2.3800000000000001E-4,2.31E-4,3,9.0499999999999999E-4,9.0499999999999999E-4,1.2799999999999999E-5,1.2799999999999999E-5]
[null,"STT2B","STAPYLTON","URBAN",7,2.3639999999999999,2.246,4.7252000000000001,null,null,null,null,null,null,null,3,3.9800000000000002E-4,3.9800000000000002E-4,3.9700000000000001E-6,3.9700000000000001E-6]
[null,"STT5B","ORMEAU, STAPYLTON","URBAN",44,0.71599999999999997,1.8959999999999999,1.8672,null,null,null,null,null,null,null,1,3.8189999999999999E-3,3.8189999999999999E-3,1.29E-5,1.29E-5]
[null,"TAB1","ALBION","URBAN",4,null,1.921]
[null,"TAB3","ALBION","URBAN",166,0.72699999999999998,0.82299999999999995,null,null,null,4,3.2881000000000001E-2,3.2881000000000001E-2,3.8699999999999997E-4,3.8699999999999997E-4,1,9.2500000000000004E-4,9.2500000000000004E-4,9.9000000000000005E-7,9.9000000000000005E-7]
[null,"TABT1","ALBION","URBAN",7]
[null,"TATTR1H","BRISBANE","CBD",27]
[null,"TAXT1","BRISBANE","CBD",1]
[null,"TBV1","BOYLAND, TAMBORINE","RURAL",45,9.6440000000000001,0.28499999999999998,0.1905,null,null,1,3.6400000000000001E-4,3.6400000000000001E-4,1.08E-4,1.08E-4]
[null,"TBV2","BEAUDESERT, BIRNAM, BOYLAND, MUNDOOLUN, TABRAGALBA, TAMBORINE","RURAL",282,48.780999999999999,0.38500000000000001,0.78120000000000001,null,null,7,2.3567000000000001E-2,2.3567000000000001E-2,8.7399999999999999E-4,8.7399999999999999E-4,8,2.6041000000000002E-2,2.5184999999999999E-2,1.4899999999999999E-4,1.3799999999999999E-4]
[null,"TBV3","TAMBORINE","RURAL",369,19.986000000000001,9.2999999999999999E-2,1.0288999999999999,null,null,5,9.7657999999999995E-2,9.7657999999999995E-2,1.8760000000000001E-3,1.8760000000000001E-3,12,0.18447,0.18447,4.28E-4,4.28E-4]
[null,"TBV4","TAMBORINE","RURAL",542,41.628,3.3490000000000002,2.0196000000000001,null,null,9,2.3487000000000001E-2,2.2581E-2,1.5529999999999999E-3,1.5510000000000001E-3,15,0.101845,0.101845,3.97E-4,3.97E-4]
[null,"TCB1","TIN CAN BAY, WALLU","RURAL",1469,21.061,1.3640000000000001,2.5341,null,null,7,0.41998600000000003,0.41998600000000003,7.4999999999999997E-3,7.4999999999999997E-3,6,6.5519999999999997E-3,6.5519999999999997E-3,8.2000000000000001E-5,8.2000000000000001E-5]
[null,"TCB2","INSKIP, RAINBOW BEACH","RURAL",1227,25.951000000000001,2.242,2.9342000000000001,null,null,5,1.1159000000000001E-2,1.1159000000000001E-2,6.2880000000000002E-3,6.2880000000000002E-3]
[null,"TCB3","COOLOOLA COVE, RAINBOW BEACH, TIN CAN BAY","RURAL",1444,28.300999999999998,1.3660000000000001,2.6103000000000001,null,null,6,6.5988000000000005E-2,6.5988000000000005E-2,4.0350000000000004E-3,4.0350000000000004E-3,7,3.2585000000000003E-2,3.2585000000000003E-2,2.7700000000000001E-4,2.7700000000000001E-4]
[null,"TCDT1","BRISBANE","CBD",11]
[null,"TGP2A","MANLY WEST, TINGALPA, WAKERLEY","URBAN",1050,2.4609999999999999,3.121,3.3151999999999999,null,null,null,null,null,null,null,4,9.6139999999999993E-3,9.6139999999999993E-3,3.7700000000000002E-5,3.7700000000000002E-5]
[null,"TGP3A","BELMONT, TINGALPA","URBAN",1209,1.3129999999999999,5.1239999999999997,3.4866999999999999,null,null,2,5.8600000000000004E-4,5.8600000000000004E-4,3.9700000000000001E-6,3.9700000000000001E-6,3,7.7999999999999999E-4,7.7999999999999999E-4,8.9299999999999992E-6,8.9299999999999992E-6]
[null,"TGP5B","HEMMANT, MANLY WEST, TINGALPA, WYNNUM WEST","URBAN",1852,5.9829999999999997,5.774,5.8112000000000004,null,null,1,7.9999999999999996E-6,7.9999999999999996E-6,9.9000000000000005E-7,9.9000000000000005E-7,3,3.447E-3,3.447E-3,1.0900000000000001E-5,1.0900000000000001E-5]
[null,"TGP6A","BELMONT, CARINDALE, TINGALPA","URBAN",1452,3.06,5.93,3.3151999999999999,null,null,8,8.1609999999999999E-3,8.1609999999999999E-3,1.15E-4,1.15E-4,3,6.3249999999999999E-3,6.3249999999999999E-3,2.48E-5,2.48E-5]
[null,"TGP8A","TINGALPA","URBAN",837,3.1040000000000001,1.4810000000000001,3.6581999999999999,null,null,6,0.30957200000000001,0.30957200000000001,3.63E-3,3.63E-3,1,2.8800000000000001E-4,2.8800000000000001E-4,4.9599999999999999E-6,4.9599999999999999E-6]
[null,"TGP9A","BELMONT, GUMDALE, TINGALPA, WAKERLEY","URBAN",1161,6.524,5.4889999999999999,5.1253000000000002,null,null,5,0.19937099999999999,0.19937099999999999,2.4060000000000002E-3,2.4060000000000002E-3,15,3.5256000000000003E-2,3.5256000000000003E-2,1.8900000000000001E-4,1.8900000000000001E-4]
[null,"TGW1","CABOONBAH, COAL CREEK, COOEEIMBARDI, CRESSBROOK, FULHAM, LOWER CRESSBROOK, MOUNT BEPPO, SCRUB CREEK, SOMERSET DAM, TOOGOOLAWAH","RURAL",375,125.009,null,1.0669999999999999,null,null,20,0.388488,0.388488,4.0549999999999996E-3,4.0549999999999996E-3,29,0.27039299999999999,0.27039299999999999,1.784E-3,1.784E-3]
[null,"TGW2","BIARRA, ESKDALE, IVORY CREEK, MOUNT BEPPO, OTTABA, TOOGOOLAWAH","RURAL",254,108.36799999999999,0.31,0.80020000000000002,null,null,24,8.8705000000000006E-2,8.8705000000000006E-2,2.3040000000000001E-3,2.3040000000000001E-3,22,0.30052400000000001,0.30052400000000001,1.5E-3,1.5E-3]
[null,"TGW3","BRAEMORE, COLINTON, GREGORS CREEK, HARLIN, MOORE, SCRUB CREEK, YIMBUN","RURAL",213,115.05500000000001,0.36799999999999999,1.2384999999999999,null,null,12,5.2526000000000003E-2,5.2526000000000003E-2,1.7279999999999999E-3,1.7279999999999999E-3,7,0.12805,0.12805,8.6600000000000002E-4,8.6600000000000002E-4]
[null,"TGW4","BIARRA, TOOGOOLAWAH","RURAL",639,21.305,0.214,1.4671000000000001,null,null,7,0.13111400000000001,0.13111400000000001,5.0650000000000001E-3,5.0650000000000001E-3,23,0.34261399999999997,0.34261399999999997,2.6329999999999999E-3,2.6329999999999999E-3]
[null,"TGW5","AVOCA, AVOCA VALE, BRAEMORE, COLINTON, EMU CREEK, HARLIN, IVORY CREEK, LINVILLE, MOORE, MT STANLEY","RURAL",416,126.419,0.24299999999999999,0.97170000000000001,null,null,24,0.31364700000000001,0.31364700000000001,4.6860000000000001E-3,4.6860000000000001E-3,9,6.2893000000000004E-2,6.2893000000000004E-2,1.1379999999999999E-3,1.1379999999999999E-3]
[null,"THL1","GRANTHAM, LOWER TENTHILL, MA MA CREEK, ROPELEY, VERADILLA, WINWILL","RURAL",298,50.165999999999997,null,1.429,null,null,5,5.254E-3,5.254E-3,3.5899999999999998E-5,3.5899999999999998E-5,19,0.14469000000000001,0.14469000000000001,4.08E-4,4.08E-4]
[null,"THL2","CAFFEY, INGOLDSBY, LOWER TENTHILL, ROPELEY, UPPER TENTHILL","RURAL",171,36.012999999999998,0.17,1.3909,null,null,3,4.0232999999999998E-2,4.0232999999999998E-2,5.7200000000000003E-4,5.7200000000000003E-4,6,2.3706000000000001E-2,2.3706000000000001E-2,1E-4,1E-4]
[null,"THL3","FORDSDALE, LOWER TENTHILL, MA MA CREEK, MT WHITESTONE, UPPER TENTHILL, WEST HALDON, WINWILL","RURAL",245,80.048000000000002,0.10199999999999999,0.78120000000000001,null,null,8,0.14607400000000001,0.14607400000000001,7.2000000000000005E-4,7.2000000000000005E-4,12,0.290607,0.290607,1.1529999999999999E-3,1.1529999999999999E-3]
[null,"THL4","BLENHEIM, GLEN CAIRN, GLENCAIRN, LOWER TENTHILL, ROCKSIDE, ROPELEY, UPPER TENTHILL, WOODLANDS","RURAL",155,38.299999999999997,0.185,0.40010000000000001,null,null,1,7.1199999999999996E-4,7.1199999999999996E-4,2.5600000000000001E-6,2.5600000000000001E-6,1,1.0460000000000001E-3,1.0460000000000001E-3,5.13E-6,5.13E-6]
[null,"THP2","TUGUN","URBAN",1,null,0.38500000000000001]
[null,"TKST1","BRISBANE","CBD",17]
[null,"TLFTR2B",null,"URBAN",1,null,null,null,null,null,null,null,null,null,null,1,4.5589999999999997E-3,4.5589999999999997E-3,9.9000000000000005E-7,9.9000000000000005E-7]
[null,"TMH12A","SHAILER PARK, TANAH MERAH","URBAN",414,4.1619999999999999,0.70299999999999996,2.9912999999999998,null,null,5,5.3220000000000003E-3,5.3220000000000003E-3,6.3499999999999999E-5,6.3499999999999999E-5,4,2.9489999999999999E-2,2.9489999999999999E-2,1.06E-4,1.06E-4]
[null,"TMH13A","SHAILER PARK","URBAN",328,2.4239999999999999,1.51,2.1149,null,null,1,8.6000000000000003E-5,8.6000000000000003E-5,9.9000000000000005E-7,9.9000000000000005E-7,3,3.2036000000000002E-2,3.2036000000000002E-2,1.6799999999999999E-4,1.6799999999999999E-4]
[null,"TMH15A","DAISY HILL, SHAILER PARK, SLACKS CREEK","URBAN",1707,10.862,0.51300000000000001,4.7633000000000001,null,null,19,7.0489999999999997E-2,7.0489999999999997E-2,1.7949999999999999E-3,1.7949999999999999E-3,3,2.0865000000000002E-2,2.0865000000000002E-2,6.6500000000000004E-5,6.6500000000000004E-5]
[null,"TMH16A","TANAH MERAH","URBAN",564,3.2839999999999998,6.6000000000000003E-2,1.3337000000000001,null,null,4,5.22E-4,5.22E-4,3.9700000000000001E-6,3.9700000000000001E-6,7,2.9111000000000001E-2,2.9111000000000001E-2,1.3100000000000001E-4,1.3100000000000001E-4]
[null,"TMH1B","DAISY HILL, SLACKS CREEK, TANAH MERAH","URBAN",2,null,1.9850000000000001,0.83830000000000005]
[null,"TMH2A","MEADOWBROOK, TANAH MERAH","RURAL",454,3.1949999999999998,3.0859999999999999,1.4671000000000001,null,null,2,1.1473000000000001E-2,3.57E-4,1.3799999999999999E-4,2.5600000000000001E-6,2,5.7513000000000002E-2,5.7513000000000002E-2,2.1499999999999999E-4,2.1499999999999999E-4]
[null,"TMH3A","SHAILER PARK","URBAN",865,6.048,1.35,2.4388000000000001,null,null,15,4.3359999999999996E-3,4.1920000000000004E-3,7.5400000000000003E-5,7.4400000000000006E-5,8,0.102571,0.102571,3.2299999999999999E-4,3.2299999999999999E-4]
[null,"TMH5A","SHAILER PARK","URBAN",1351,6.827,2.0470000000000002,3.7153999999999998,null,null,10,7.4479999999999998E-3,7.4479999999999998E-3,5.9599999999999999E-5,5.9599999999999999E-5,10,6.6202999999999998E-2,6.6202999999999998E-2,2.33E-4,2.33E-4]
[null,"TMTT1","SPRING HILL","CBD",23]
[null,"TMTWTC1","SPRING HILL","URBAN",40,null,0.30399999999999999]
[null,"TOTT1","BRISBANE","CBD",1,null,null,null,null,null,1,6.0740000000000002E-2,null,2.5599999999999999E-4]
[null,"TPT1","NINGI, SANDSTONE POINT","URBAN",1746,2.081,6.5659999999999998,3.8677999999999999,null,null,4,1.511E-3,1.511E-3,3.6699999999999998E-5,3.6699999999999998E-5,1,3.395E-3,3.395E-3,1.19E-5,1.19E-5]
[null,"TPT4","GODWIN BEACH, NINGI","RURAL",718,5.4589999999999996,4.5650000000000004,1.3528,null,null,3,3.1474000000000002E-2,3.1474000000000002E-2,2.5399999999999999E-4,2.5399999999999999E-4,2,7.8937999999999994E-2,7.8937999999999994E-2,1.8699999999999999E-4,1.8699999999999999E-4]
[null,"TPT5","NINGI","RURAL",564,12.092000000000001,0.155,1.81,null,null,7,0.35895199999999999,0.35895199999999999,2.9989999999999999E-3,2.9989999999999999E-3,2,3.1497999999999998E-2,3.1497999999999998E-2,1.64E-4,1.64E-4]
[null,"TRG13A","ST LUCIA, TARINGA","URBAN",1376,2.891,0.217,2.8580000000000001,null,null,6,2.8497999999999999E-2,2.8497999999999999E-2,2.8699999999999998E-4,2.8699999999999998E-4,7,5.7487999999999997E-2,5.7487999999999997E-2,2.14E-4,2.14E-4]
[null,"TRG15A","INDOOROOPILLY","URBAN",529,2.673,0.65800000000000003,3.944,null,null,6,0.14503099999999999,0.14503099999999999,7.1699999999999997E-4,7.1699999999999997E-4,3,4.7010000000000003E-3,4.7010000000000003E-3,1.6900000000000001E-5,1.6900000000000001E-5]
[null,"TRG17A","ST LUCIA, TARINGA","RURAL",224,6.5339999999999998,9.4E-2,1.1621999999999999,null,null,null,null,null,null,null,5,3.6761000000000002E-2,3.6761000000000002E-2,1.74E-4,1.74E-4]
[null,"TRG3B","INDOOROOPILLY, ST LUCIA, TARINGA","URBAN",391,2.9790000000000001,2.0939999999999999,2.1911,null,null,8,5.7446999999999998E-2,5.7446999999999998E-2,5.5800000000000001E-4,5.5800000000000001E-4,6,1.281E-2,1.281E-2,5.0599999999999997E-5,5.0599999999999997E-5]
[null,"TRG3OLD",null,"URBAN",365,null,null,null,null,null,1,6.4999999999999994E-5,6.4999999999999994E-5,9.9000000000000005E-7,9.9000000000000005E-7,4,2.0407999999999999E-2,2.0407999999999999E-2,5.0599999999999997E-5,5.0599999999999997E-5]
[null,"TRG7A","TARINGA, TOOWONG","URBAN",1891,2.4940000000000002,0.85599999999999998,2.6865000000000001,null,null,6,5.8900000000000001E-4,5.8900000000000001E-4,5.9599999999999997E-6,5.9599999999999997E-6,9,0.108209,0.108209,4.5300000000000001E-4,4.5300000000000001E-4]
[null,"TRG8A","INDOOROOPILLY, TARINGA","URBAN",1586,3.5430000000000001,0.246,3.0485000000000002,null,null,10,6.0621000000000001E-2,6.0621000000000001E-2,8.4500000000000005E-4,8.4500000000000005E-4,7,2.3106000000000002E-2,2.3106000000000002E-2,1.05E-4,1.05E-4]
[null,"TRP1","COOLANA, MINDEN, PRENZLAU, TARAMPA","RURAL",699,55.115000000000002,2.8980000000000001,1.7528999999999999,null,null,21,9.9440000000000001E-2,9.9440000000000001E-2,3.8939999999999999E-3,3.8939999999999999E-3,23,0.12490800000000001,0.12490800000000001,5.1800000000000001E-4,5.1800000000000001E-4]
[null,"TRP2","CLARENDON, LOWOOD, PATRICK ESTATE, TARAMPA","RURAL",403,21.384,1.0289999999999999,1.1051,null,null,7,5.1725E-2,5.1725E-2,1.1999999999999999E-3,1.1999999999999999E-3,9,2.0754999999999999E-2,2.0754999999999999E-2,2.2599999999999999E-4,2.2599999999999999E-4]
[null,"TRP3","CLARENDON, COOMINYA, LOWOOD, PATRICK ESTATE, RIFLE RANGE, TARAMPA","RURAL",280,39.588000000000001,null,0.89549999999999996,null,null,9,0.343893,0.343893,2.2279999999999999E-3,2.2279999999999999E-3,9,3.4338E-2,3.4338E-2,2.1800000000000001E-4,2.1800000000000001E-4]
[null,"TRP4","GLAMORGAN VALE, LOWOOD, TARAMPA","RURAL",713,19.535,2.12,2.1149,null,null,3,6.087E-2,6.087E-2,1.838E-3,1.838E-3,8,7.4565999999999993E-2,7.4565999999999993E-2,2.92E-4,2.92E-4]
[null,"TRP5","BRIGHTVIEW, CLARENDON, LOWOOD, MT TARAMPA, RIFLE RANGE, TARAMPA","RURAL",286,49.444000000000003,4.3999999999999997E-2,1.3909,null,null,21,8.9358000000000007E-2,8.9015999999999998E-2,1.041E-3,1.0380000000000001E-3,25,0.110544,0.110544,3.97E-4,3.97E-4]
[null,"TSN13A","ROCKLEA","URBAN",1,0.38500000000000001,1.1539999999999999,3.3915000000000002,null,null,null,null,null,null,null,2,2.0820000000000001E-3,2.0820000000000001E-3,1.99E-6,1.99E-6]
[null,"TSN15A","GRACEVILLE, TENNYSON, YEERONGPILLY","URBAN",345,2.399,1.6379999999999999,2.6674000000000002,null,null,2,4.4900000000000002E-4,4.4900000000000002E-4,1.99E-6,1.99E-6,1,4.705E-3,4.705E-3,1.49E-5,1.49E-5]
[null,"TSN5A","TENNYSON, YEERONGPILLY","URBAN",69,0.82299999999999995,1.218,4.2488000000000001,null,null,1,2.4000000000000001E-5,2.4000000000000001E-5,1.19E-5,1.19E-5,2,3.2499999999999999E-4,3.2499999999999999E-4,1.99E-6,1.99E-6]
[null,"TSN7A","ROCKLEA","URBAN",1,1.0049999999999999,2.3090000000000002,4.0583,null,null,null,null,null,null,null,1,1.426E-3,1.426E-3,9.9000000000000005E-7,9.9000000000000005E-7]
[null,"TSTT1","NUNDAH","URBAN",1,null,null,null,null,null,1,9.9999999999999995E-7,9.9999999999999995E-7,9.9000000000000005E-7,9.9000000000000005E-7]
[null,"TTET1","BRISBANE","CBD",4]
[null,"TTET2","BRISBANE","CBD",1]
[null,"TTF77","BRISBANE","CBD",1,null,1.0089999999999999,1.0669999999999999]
[null,"TTF81","CORINDA, OXLEY","URBAN",205,1.534,5.1760000000000002,3.1438000000000001,null,null,1,3.6373999999999997E-2,3.6373999999999997E-2,2.24E-4,2.24E-4,2,1.9646E-2,1.9646E-2,1.16E-4,1.16E-4]
[null,"TTW3","BRISBANE","CBD",1]
[null,"TVCT1","TOOWONG","URBAN",9,null,null,null,null,null,null,null,null,null,null,1,4.84E-4,4.84E-4,3.9700000000000001E-6,3.9700000000000001E-6]
[null,"TWG10","TOOWONG","URBAN",651,1.123,2.58,2.3054000000000001,null,null,2,9.1219999999999999E-3,9.1219999999999999E-3,1.47E-4,1.47E-4,7,1.8324E-2,1.8324E-2,6.05E-5,6.05E-5]
[null,"TWG11","AUCHENFLOWER, BARDON, TOOWONG","URBAN",1228,7.4080000000000004,1.262,3.5057999999999998,null,null,10,6.8662000000000001E-2,6.8662000000000001E-2,1.2279999999999999E-3,1.2279999999999999E-3,9,4.4525000000000002E-2,4.4525000000000002E-2,1.4200000000000001E-4,1.4200000000000001E-4]
[null,"TWG13A","INDOOROOPILLY, TARINGA, TOOWONG","URBAN",1087,5.7939999999999996,0.66600000000000004,4.8585000000000003,null,null,7,6.8120000000000003E-3,6.8120000000000003E-3,6.2500000000000001E-5,6.2500000000000001E-5,3,7.9810000000000002E-3,7.9810000000000002E-3,3.4700000000000003E-5,3.4700000000000003E-5]
[null,"TWG13B","TOOWONG","URBAN",465,0.36699999999999999,1.8220000000000001,3.1246999999999998,null,null,1,1.54E-4,1.54E-4,9.9000000000000005E-7,9.9000000000000005E-7,6,1.2848999999999999E-2,1.2848999999999999E-2,8.7299999999999994E-5,8.7299999999999994E-5]
[null,"TWG14A","TOOWONG","URBAN",534,1.224,0.54700000000000004,1.3909,null,null,2,2.0000000000000001E-4,2.0000000000000001E-4,1.99E-6,1.99E-6,5,0.136433,0.136433,3.4400000000000001E-4,3.4400000000000001E-4]
[null,"TWG15A","TARINGA, TOOWONG","URBAN",628,2.2109999999999999,0.129,1.7148000000000001,null,null,3,6.2621999999999997E-2,6.2621999999999997E-2,7.4899999999999999E-4,7.4899999999999999E-4,3,1.1494000000000001E-2,1.1494000000000001E-2,5.2599999999999998E-5,5.2599999999999998E-5]
[null,"TWG16","BARDON, MT COOTTHA, TOOWONG","RURAL",432,8.6920000000000002,1.1859999999999999,2.5150000000000001,null,null,2,0.21231800000000001,0.21231800000000001,2.104E-3,2.104E-3,3,4.7847000000000001E-2,4.7847000000000001E-2,2.6699999999999998E-4,2.6699999999999998E-4]
[null,"TWG17","AUCHENFLOWER, BARDON, PADDINGTON","URBAN",1877,7.0490000000000004,4.55,3.3532999999999999,null,null,5,1.2577E-2,1.2577E-2,1.17E-4,1.17E-4,40,0.37136400000000003,0.37136400000000003,1.294E-3,1.294E-3]
[null,"TWG18","AUCHENFLOWER, TOOWONG","URBAN",1088,3.593,0.442,3.0674999999999999,null,null,4,4.1899999999999999E-4,4.1899999999999999E-4,3.9700000000000001E-6,3.9700000000000001E-6,13,7.7982999999999997E-2,7.7982999999999997E-2,2.9300000000000002E-4,2.9300000000000002E-4]
[null,"TWG19","TOOWONG","URBAN",909,1.341,1.268,4.7633000000000001,null,null,1,9.6000000000000002E-5,null,9.9000000000000005E-7,null,7,6.1046999999999997E-2,6.1046999999999997E-2,2.2699999999999999E-4,2.2699999999999999E-4]
[null,"TWG21","INDOOROOPILLY, TARINGA, TOOWONG","URBAN",914,3.36,0.32300000000000001,1.7148000000000001,null,null,9,0.25554199999999999,0.25554199999999999,2.9520000000000002E-3,2.9520000000000002E-3,4,8.1550000000000008E-3,8.1550000000000008E-3,4.4700000000000002E-5,4.4700000000000002E-5]
[null,"TWT11A","COOROIBAH, NOOSAVILLE, RINGTAIL CREEK, TEWANTIN","RURAL",1427,28.806000000000001,4.8840000000000003,4.0392999999999999,null,null,23,0.541412,0.541412,6.5129999999999997E-3,6.5129999999999997E-3,19,0.25918799999999997,0.253805,1.077E-3,1.041E-3]
[null,"TWT12A","DOONAN, NOOSAVILLE, TINBEERWAH","RURAL",1023,36.174999999999997,4.048,3.1057000000000001,null,null,22,0.68946700000000005,0.68946700000000005,7.267E-3,7.267E-3,20,0.222437,0.222437,1.371E-3,1.371E-3]
[null,"TWT13A","NOOSAVILLE, TEWANTIN","URBAN",2464,3.3849999999999998,13.468999999999999,5.1634000000000002,null,null,10,8.7085999999999997E-2,8.6900000000000005E-2,2.4729999999999999E-3,2.4719999999999998E-3,8,4.3438999999999998E-2,4.3438999999999998E-2,2.1900000000000001E-4,2.1900000000000001E-4]
[null,"TWT15A","DOONAN, NOOSAVILLE, TINBEERWAH, VERRIERDALE, WEYBA DOWNS","RURAL",892,33.298999999999999,5.758,2.0768,null,null,24,0.53307800000000005,0.53307800000000005,4.5469999999999998E-3,4.5469999999999998E-3,5,5.8123000000000001E-2,5.8123000000000001E-2,3.6400000000000001E-4,3.6400000000000001E-4]
[null,"TWT2B","NOOSAVILLE","URBAN",6,null,2.1349999999999998,3.5819999999999999,null,null,null,null,null,null,null,1,3.6900000000000002E-4,null,1.99E-6]
[null,"TWT3A","NOOSAVILLE, TEWANTIN","RURAL",1449,10.819000000000001,5.798,4.7252000000000001,null,null,5,0.81156099999999998,0.81156099999999998,3.3100000000000002E-4,3.3100000000000002E-4,2,1.1622E-2,1.1622E-2,7.4300000000000004E-5,7.4300000000000004E-5]
[null,"TWT5B","NOOSA NORTH SHORE, NOOSAVILLE, TEWANTIN","URBAN",736,2.8460000000000001,3.0009999999999999,2.8961000000000001,null,null,7,2.588E-3,2.588E-3,7.8399999999999995E-5,7.8399999999999995E-5]
[null,"TWT6B","COOROIBAH, NOOSA NORTH SHORE, RINGTAIL CREEK, TEEWAH, TEWANTIN","RURAL",1554,34.981000000000002,13.724,2.9912999999999998,null,null,16,1.180059,1.180059,6.3540000000000003E-3,6.3540000000000003E-3,8,0.19311400000000001,0.19311400000000001,1.01E-3,1.01E-3]
[null,"UMG12A","MT GRAVATT, UPPER MT GRAVATT, WISHART","URBAN",767,0.56999999999999995,3.7749999999999999,2.6865000000000001,null,null,1,1.1443999999999999E-2,1.1443999999999999E-2,6.2500000000000001E-5,6.2500000000000001E-5,3,1.1908999999999999E-2,1.1908999999999999E-2,4.2700000000000001E-5,4.2700000000000001E-5]
[null,"UMG1A","UPPER MT GRAVATT","URBAN",240,9.2999999999999999E-2,1.7330000000000001,3.4296000000000002,null,null,1,7.1000000000000005E-5,7.1000000000000005E-5,9.9000000000000005E-7,9.9000000000000005E-7,1,3.0200000000000002E-4,3.0200000000000002E-4,9.9000000000000005E-7,9.9000000000000005E-7]
[null,"UMG1B","UPPER MT GRAVATT, WISHART","URBAN",2136,6.2850000000000001,4.3460000000000001,4.7633000000000001,null,null,1,7.1000000000000005E-5,7.1000000000000005E-5,9.9000000000000005E-7,9.9000000000000005E-7,11,9.3664999999999998E-2,9.3664999999999998E-2,3.2899999999999997E-4,3.2899999999999997E-4]
[null,"UMG2A","COOPERS PLAINS, ROBERTSON, SALISBURY","RURAL",1036,4.5270000000000001,4.8280000000000003,2.3435000000000001,null,null,2,5.3200000000000003E-4,5.3200000000000003E-4,5.13E-6,5.13E-6,5,2.0681000000000001E-2,2.0681000000000001E-2,1.05E-4,1.05E-4]
[null,"UMG2A","COOPERS PLAINS, ROBERTSON, SALISBURY","URBAN",1036,4.5270000000000001,4.8280000000000003,2.3435000000000001,null,null,1,1.2300000000000001E-4,1.2300000000000001E-4,9.9000000000000005E-7,9.9000000000000005E-7]
[null,"UMG3A","UPPER MT GRAVATT","URBAN",406,1.385,0.90300000000000002,2.8769999999999998,null,null,1,1.5300000000000001E-4,1.5300000000000001E-4,9.9000000000000005E-7,9.9000000000000005E-7,5,1.7873E-2,1.7873E-2,9.3300000000000005E-5,9.3300000000000005E-5]
[null,"UMG5A","MACGREGOR, UPPER MT GRAVATT","URBAN",895,3.4329999999999998,4.18,5.03,null,null,6,1.0036E-2,1.0036E-2,1.22E-4,1.22E-4,16,4.9798000000000002E-2,4.9798000000000002E-2,2.04E-4,2.04E-4]
[null,"UPC1","CEDAR CREEK, OXENFORD, TAMBORINE MOUNTAIN, UPPER COOMERA, WONGAWALLAN","RURAL",595,46.069000000000003,5.7889999999999997,null,null,null,17,0.154642,0.116748,2.4169999999999999E-3,2.1870000000000001E-3,7,7.8480999999999995E-2,7.8480999999999995E-2,2.33E-4,2.33E-4]
[null,"UPC2","GUANABA, MAUDSLAND, OXENFORD, UPPER COOMERA","RURAL",973,11.772,7.84,null,null,null,6,1.7541999999999999E-2,1.7541999999999999E-2,8.61E-4,8.61E-4,6,0.25341799999999998,0.25341799999999998,6.5899999999999997E-4,6.5899999999999997E-4]
[null,"VPK11B",null,"URBAN",6]
[null,"VPK21A","BOWEN HILLS, FORTITUDE VALLEY","URBAN",6,null,0.56999999999999995,0.55249999999999999]
[null,"VPK30A","FORTITUDE VALLEY, SPRING HILL","URBAN",336,null,null,2.153,null,null,6,0.115576,0.115576,1.15E-3,1.15E-3,1,1.6329999999999999E-3,1.6329999999999999E-3,4.9599999999999999E-6,4.9599999999999999E-6]
[null,"VPK34A","HERSTON","RURAL",7,0.22700000000000001,0.625,0.1143]
[null,"VPK34A","HERSTON","URBAN",null,0.22700000000000001,0.625,0.1143,null,null,1,2.1999999999999999E-5,2.1999999999999999E-5,6.9500000000000004E-6,6.9500000000000004E-6]
[null,"VPK35A","BOWEN HILLS, FORTITUDE VALLEY","URBAN",668,null,1.6950000000000001,3.1438000000000001,null,null,1,1.7750000000000001E-3,1.7750000000000001E-3,5.7300000000000005E-4,5.7300000000000005E-4]
[null,"VPK40A","HERSTON","URBAN",1,null,0.505,0.49540000000000001,null,null,1,3.0000000000000001E-6,3.0000000000000001E-6,9.9000000000000005E-7,9.9000000000000005E-7]
[null,"VPK42A","BOWEN HILLS, FORTITUDE VALLEY, NEWSTEAD","URBAN",110,0.17100000000000001,4.8360000000000003,2.2292000000000001,null,null,1,3.0499999999999999E-4,3.0499999999999999E-4,9.8300000000000004E-5,9.8300000000000004E-5]
[null,"VPK9A","BOWEN HILLS, HERSTON","URBAN",754,null,0.81799999999999995,2.8961000000000001,null,null,4,2.049E-3,2.049E-3,3.9700000000000001E-6,3.9700000000000001E-6,2,1.3344E-2,1.3344E-2,4.8600000000000002E-5,4.8600000000000002E-5]
[null,"VPT12A","VICTORIA POINT","URBAN",1145,6.1260000000000003,1.8560000000000001,3.22,null,null,3,4.1599999999999997E-4,4.1599999999999997E-4,2.9799999999999998E-6,2.9799999999999998E-6,2,5.3200000000000003E-4,5.3200000000000003E-4,3.9700000000000001E-6,3.9700000000000001E-6]
[null,"VPT13A","MOUNT COTTON, THORNLANDS, VICTORIA POINT","RURAL",1118,10.061999999999999,6.3710000000000004,2.1911,null,null,3,7.2939000000000004E-2,7.2939000000000004E-2,2.8479999999999998E-3,2.8479999999999998E-3,6,6.6102999999999995E-2,6.6102999999999995E-2,1.9000000000000001E-4,1.9000000000000001E-4]
[null,"VPT16A","VICTORIA POINT","URBAN",2050,6.9809999999999999,4.7910000000000004,5.0681000000000003,null,null,6,5.6800000000000004E-4,5.6800000000000004E-4,5.9599999999999997E-6,5.9599999999999997E-6,8,1.3832000000000001E-2,1.3832000000000001E-2,8.6399999999999999E-5,8.6399999999999999E-5]
[null,"VPT1B","COOCHIEMUDLO ISLAND, VICTORIA POINT","RURAL",2239,8.7309999999999999,6.2779999999999996,3.5819999999999999,null,null,11,0.68123100000000003,6.3432000000000002E-2,1.892E-3,2.05E-4,3,1.7023E-2,1.7023E-2,7.9499999999999994E-5,7.9499999999999994E-5]
[null,"VPT2A","VICTORIA POINT","URBAN",197,1.139,1.784,4.7823000000000002]
[null,"VPT3A","THORNLANDS, VICTORIA POINT","RURAL",1953,9.3689999999999998,7.5519999999999996,5.7539999999999996,null,null,11,2.4837229999999999,2.4837229999999999,2.8334999999999999E-2,2.8334999999999999E-2,8,3.7726999999999997E-2,3.7726999999999997E-2,1.85E-4,1.85E-4]
[null,"VPT5B","VICTORIA POINT","URBAN",43,null,1.2090000000000001,1.8290999999999999]
[null,"VSL10A","ROBINA, VARSITY LAKES","URBAN",1187,null,8.0519999999999996,3.4676999999999998,null,null,4,5.5599999999999996E-4,5.5599999999999996E-4,6.9500000000000004E-6,6.9500000000000004E-6]
[null,"VSL10B","BURLEIGH WATERS, VARSITY LAKES","URBAN",1256,null,5.4210000000000003,2.8008000000000002,null,null,3,3.6099999999999999E-4,3.6099999999999999E-4,2.9799999999999998E-6,2.9799999999999998E-6]
[null,"VSL11A","BURLEIGH WATERS, ROBINA, VARSITY LAKES","URBAN",603,null,7.7080000000000002,3.4866999999999999,null,null,1,9.5000000000000005E-5,9.5000000000000005E-5,9.9000000000000005E-7,9.9000000000000005E-7]
[null,"VSL12A","CLEAR ISLAND WATERS, ROBINA","URBAN",1678,null,13.878,null,null,null,4,2.6440000000000001E-3,2.6440000000000001E-3,2.2799999999999999E-5,2.2799999999999999E-5]
[null,"VSL13A","VARSITY LAKES","URBAN",1255,null,9.2539999999999996,3.3342999999999998,null,null,2,8.5000000000000006E-5,8.5000000000000006E-5,1.99E-6,1.99E-6]
[null,"VSL1A","ROBINA, VARSITY LAKES","URBAN",1300,null,6.5209999999999999,3.6581999999999999,null,null,null,null,null,null,null,1,8.4519999999999994E-3,8.4519999999999994E-3,6.4499999999999996E-5,6.4499999999999996E-5]
[null,"VSL1B","MERMAID WATERS, ROBINA, VARSITY LAKES","URBAN",1364,null,6.2279999999999998,6.9352999999999998,null,null,2,4.8000000000000001E-4,4.8000000000000001E-4,9.9299999999999998E-6,9.9299999999999998E-6,1,3.0000000000000001E-6,3.0000000000000001E-6,9.9000000000000005E-7,9.9000000000000005E-7]
[null,"VSL2A","VARSITY LAKES","URBAN",723,null,2.819,3.8677999999999999,null,null,3,4.28E-4,4.28E-4,6.9500000000000004E-6,6.9500000000000004E-6,7,2.2423999999999999E-2,2.2423999999999999E-2,2.12E-4,2.12E-4]
[null,"VSL3A","REEDY CREEK, ROBINA, VARSITY LAKES","URBAN",896,1.915,5.6680000000000001,3.3532999999999999,null,null,2,0.23991699999999999,0.23991699999999999,8.8999999999999995E-4,8.8999999999999995E-4,7,2.0931999999999999E-2,2.0931999999999999E-2,2.8400000000000002E-4,2.8400000000000002E-4]
[null,"VSL4A","ROBINA, VARSITY LAKES","URBAN",143,null,2.1440000000000001,1.7338,null,null,2,1.601E-3,1.601E-3,3.8699999999999999E-5,3.8699999999999999E-5]
[null,"VSL6A","VARSITY LAKES","URBAN",186,null,2.266,2.5531000000000001,null,null,1,9.2999999999999997E-5,9.2999999999999997E-5,9.9000000000000005E-7,9.9000000000000005E-7]
[null,"VSL8A","VARSITY LAKES","URBAN",333,null,2.63,4.0202]
[null,"VSP1",null,"URBAN",1,null,null,14.9757]
[null,"WACT2","BRISBANE","CBD",1]
[null,"WAGTR1H","BOWEN HILLS","URBAN",14]
[null,"WBSTR1H","NORTHGATE","URBAN",1]
[null,"WCL10A","DARRA, WACOL","URBAN",109,1.72,4.2249999999999996,2.4197000000000002,null,null,4,3.329E-2,8.9099999999999997E-4,1.05E-4,2.9799999999999998E-6,1,6.3699999999999998E-4,6.3699999999999998E-4,2.9799999999999998E-6,2.9799999999999998E-6]
[null,"WCL11A","WACOL","URBAN",156,2.0350000000000001,3.262,3.1057000000000001,null,null,1,4.3000000000000002E-5,4.3000000000000002E-5,9.9000000000000005E-7,9.9000000000000005E-7,5,1.2231000000000001E-2,1.2231000000000001E-2,9.9299999999999998E-6,9.9299999999999998E-6]
[null,"WCL13A","RIVERHILLS, SUMNER, WACOL","URBAN",139,5.3639999999999999,2.84,4.649,null,null,null,null,null,null,null,3,3.0079999999999998E-3,3.0079999999999998E-3,9.9299999999999998E-6,9.9299999999999998E-6]
[null,"WCL16A","WACOL","URBAN",1,0.33400000000000002,0.46300000000000002,1.7148000000000001,null,null,null,null,null,null,null,1,2.2100000000000001E-4,2.2100000000000001E-4,9.9000000000000005E-7,9.9000000000000005E-7]
[null,"WCL17A","RICHLANDS, WACOL","URBAN",100,1.645,2.964,2.7627000000000002,null,null,null,null,null,null,null,2,6.711E-3,6.711E-3,4.2700000000000001E-5,4.2700000000000001E-5]
[null,"WCL19A","WACOL","RURAL",120,8.9779999999999998,11.315,3.0293999999999999,null,null,2,0.14369100000000001,2.6400000000000002E-4,3.1300000000000002E-4,2.5600000000000001E-6,4,4.7879999999999997E-3,4.7879999999999997E-3,2.3099999999999999E-5,2.3099999999999999E-5]
[null,"WCL2","WACOL","URBAN",12,null,3.3010000000000002,2.9150999999999998]
[null,"WCL3","RICHLANDS, WACOL","URBAN",39,1.5840000000000001,1.7669999999999999,1.1432,null,null,2,1.4999999999999999E-4,1.4999999999999999E-4,1.99E-6,1.99E-6,2,9.1200000000000005E-4,9.1200000000000005E-4,2.9799999999999998E-6,2.9799999999999998E-6]
[null,"WCL5A","MOGGILL, WACOL","URBAN",369,6.492,4.04,4.0011999999999999,null,null,3,1.75E-3,1.75E-3,3.6999999999999999E-4,3.6999999999999999E-4,3,7.6199999999999998E-4,7.6199999999999998E-4,6.9500000000000004E-6,6.9500000000000004E-6]
[null,"WCL6","WACOL","URBAN",3,6.4000000000000001E-2,0.79300000000000004,1.6576,null,null,1,7.9999999999999996E-6,7.9999999999999996E-6,1.99E-6,1.99E-6,1,2.0999999999999999E-5,2.0999999999999999E-5,9.9000000000000005E-7,9.9000000000000005E-7]
[null,"WCL7","WACOL","URBAN",15,0.126,1.607,2.4007000000000001,null,null,1,6.0000000000000002E-5,6.0000000000000002E-5,1.49E-5,1.49E-5,1,1.9000000000000001E-5,1.9000000000000001E-5,9.9000000000000005E-7,9.9000000000000005E-7]
[null,"WCS1","CHERMSIDE","URBAN",null,null,null,null,null,null,1,5.5000000000000002E-5,5.5000000000000002E-5,9.9000000000000005E-7,9.9000000000000005E-7]
[null,"WDLT1","GAYTHORNE","URBAN",1,null,null,null,null,null,null,null,null,null,null,1,1.7000000000000001E-4,1.7000000000000001E-4,9.9000000000000005E-7,9.9000000000000005E-7]
[null,"WED10","HIGHGATE HILL, WEST END","URBAN",1230,2.2309999999999999,0.76700000000000002,1.7148000000000001,null,null,6,0.128441,0.128441,2.6800000000000001E-4,2.6800000000000001E-4,3,3.0356000000000001E-2,3.0356000000000001E-2,8.3399999999999994E-5,8.3399999999999994E-5]
[null,"WED15B","SOUTH BRISBANE","URBAN",108,null,2.2509999999999999,4.7061000000000002,null,null,null,null,null,null,null,1,6.4840000000000002E-3,6.4840000000000002E-3,2.2799999999999999E-5,2.2799999999999999E-5]
[null,"WED16A","WEST END","URBAN",1109,1.6120000000000001,2.226,3.0293999999999999,null,null,3,8.1920000000000007E-2,8.1920000000000007E-2,1.0970000000000001E-3,1.0970000000000001E-3,3,1.629E-3,1.629E-3,7.9400000000000002E-6,7.9400000000000002E-6]
[null,"WED16B","SOUTH BRISBANE, WEST END","URBAN",340,0.42699999999999999,1.222,1.8290999999999999,null,null,1,3.4559999999999999E-3,3.4559999999999999E-3,3.4400000000000001E-4,3.4400000000000001E-4,2,7.5299999999999998E-4,7.5299999999999998E-4,1.99E-6,1.99E-6]
[null,"WED17A","SOUTH BRISBANE","URBAN",144,null,1.776,3.0104000000000002,null,null,1,1.44E-4,1.44E-4,9.9000000000000005E-7,9.9000000000000005E-7,1,1.7000000000000001E-4,1.7000000000000001E-4,9.9000000000000005E-7,9.9000000000000005E-7]
[null,"WED17B","SOUTH BRISBANE","URBAN",186,null,2.847,3.3532999999999999]
[null,"WED18A","SOUTH BRISBANE","URBAN",131,null,0.95099999999999996,1.5624,null,null,2,1.8649999999999999E-3,1.8649999999999999E-3,1.65E-4,1.65E-4]
[null,"WED20A","WEST END","URBAN",973,2.3330000000000002,1.3420000000000001,2.153,null,null,5,8.1860000000000006E-3,8.1860000000000006E-3,8.6799999999999996E-4,8.6799999999999996E-4,6,5.5855000000000002E-2,5.5855000000000002E-2,1.4999999999999999E-4,1.4999999999999999E-4]
[null,"WED21A","SOUTH BRISBANE, WEST END","URBAN",112,null,1.1950000000000001,2.5912000000000002,null,null,2,8.6929999999999993E-3,8.6929999999999993E-3,1.75E-4,1.75E-4,3,1.2623000000000001E-2,4.0800000000000003E-3,3.3699999999999999E-5,1.49E-5]
[null,"WED21B","SOUTH BRISBANE, WEST END","URBAN",363,null,2.8029999999999999,1.7909999999999999,null,null,3,4.6046999999999998E-2,4.6046999999999998E-2,4.2000000000000002E-4,4.2000000000000002E-4,2,1.779E-3,1.779E-3,4.9599999999999999E-6,4.9599999999999999E-6]
[null,"WED22A","SOUTH BRISBANE","URBAN",1,null,0.81399999999999995,3.4104999999999999]
[null,"WED22B","SOUTH BRISBANE","URBAN",379,null,3.524,3.9821,null,null,1,5.1679999999999999E-3,5.1679999999999999E-3,5.6300000000000002E-4,5.6300000000000002E-4,1,3.8299999999999999E-4,3.8299999999999999E-4,1.99E-6,1.99E-6]
[null,"WED3A","SOUTH BRISBANE, WEST END","URBAN",796,2.6160000000000001,0.78400000000000003,5.1634000000000002,null,null,7,3.1689999999999999E-3,3.1689999999999999E-3,2.2799999999999999E-5,2.2799999999999999E-5,6,1.7690999999999998E-2,1.7690999999999998E-2,4.57E-5,4.57E-5]
[null,"WED4B","SOUTH BRISBANE","URBAN",107,null,3.52,3.6962999999999999,null,null,1,4.0000000000000003E-5,4.0000000000000003E-5,9.9000000000000005E-7,9.9000000000000005E-7]
[null,"WED5A","SOUTH BRISBANE","URBAN",58,null,1.81,4.3632,null,null,1,7.2900000000000005E-4,7.2900000000000005E-4,7.9400000000000006E-5,7.9400000000000006E-5,1,1.7699999999999999E-4,1.7699999999999999E-4,1.99E-6,1.99E-6]
[null,"WED6A","HIGHGATE HILL, SOUTH BRISBANE, WEST END","URBAN",1462,3.407,2.0750000000000002,4.5727000000000002,null,null,6,2.3611E-2,2.3611E-2,2.23E-4,2.23E-4,8,5.7957000000000002E-2,5.7957000000000002E-2,2.05E-4,2.05E-4]
[null,"WEL3","SOUTHPORT","URBAN",123,0.54600000000000004,0.50900000000000001,null,null,null,3,1.8E-3,1.8E-3,3.4700000000000003E-5,3.4700000000000003E-5,1,1.0462000000000001E-2,1.0462000000000001E-2,1.9899999999999999E-5,1.9899999999999999E-5]
[null,"WELTR2H","SOUTHPORT","URBAN",1,null,null,null,null,null,null,null,null,null,null,1,2.1999999999999999E-5,2.1999999999999999E-5,9.9000000000000005E-7,9.9000000000000005E-7]
[null,"WEXWRD8",null,"URBAN",1,null,0.51600000000000001,1.2575000000000001]
[null,"WFD1B","CEDARTON, COMMISSIONERS FLAT, PEACHESTER, STANMORE, WOODFORD","RURAL",313,66.435000000000002,0.20100000000000001,0.81930000000000003,null,null,13,0.59541200000000005,0.59541200000000005,4.117E-3,4.117E-3,4,1.5292999999999999E-2,1.5292999999999999E-2,1.4899999999999999E-4,1.4899999999999999E-4]
[null,"WFD2B","STANMORE, STONY CREEK, WOODFORD","RURAL",857,63.628,0.94099999999999995,2.9912999999999998,null,null,19,0.36437999999999998,0.36437999999999998,7.4110000000000001E-3,7.4110000000000001E-3,29,0.14002000000000001,0.14002000000000001,5.5900000000000004E-4,5.5900000000000004E-4]
[null,"WFD3A","WOODFORD","RURAL",312,15.005000000000001,2.4540000000000002,3.4866999999999999,null,null,3,6.561E-3,6.561E-3,8.5400000000000005E-4,8.5400000000000005E-4,1,1.7260999999999999E-2,1.7260999999999999E-2,3.3300000000000003E-5,3.3300000000000003E-5]
[null,"WFD5A","D'AGUILAR, DELANEYS CREEK, MOUNT DELANEY, MOUNT MEE, MT DELANEY, NEURUM, WOODFORD","RURAL",590,72.534000000000006,1.2,1.1432,null,null,14,0.61576200000000003,0.61576200000000003,4.6470000000000001E-3,4.6470000000000001E-3,5,3.0821000000000001E-2,3.0821000000000001E-2,1E-4,1E-4]
[null,"WFD6A","BRACALBA, D'AGUILAR","RURAL",432,17.888000000000002,2.2839999999999998,1.9244000000000001,null,null,7,0.14263799999999999,0.126364,2.4250000000000001E-3,2.32E-3,5,3.0346999999999999E-2,3.0346999999999999E-2,1.13E-4,1.13E-4]
[null,"WFP8","BRISBANE","CBD",5,null,0.3]
[null,"WFPT1","BRISBANE","CBD",1]
[null,"WGCT1","BRISBANE","CBD",1,null,null,null,null,null,null,null,null,null,null,1,0.115886,0.115886,2.5599999999999999E-4,2.5599999999999999E-4]
[null,"WHITR1H","SOUTHPORT","URBAN",281,null,null,null,null,null,null,null,null,null,null,3,3.7399999999999998E-3,3.7399999999999998E-3,2.8499999999999999E-4,2.8499999999999999E-4]
[null,"WHITR2H","SOUTHPORT","URBAN",1]
[null,"WHO1","ENGLAND CREEK, FAIRNEY VIEW, FERNVALE, VERNOR, WIVENHOE POCKET","RURAL",603,65.073999999999998,1.0009999999999999,2.2673000000000001,null,null,18,2.225546,2.2202850000000001,7.1180000000000002E-3,7.0699999999999999E-3,15,0.18724499999999999,0.18201300000000001,6.7400000000000001E-4,6.4099999999999997E-4]
[null,"WHO2","FERNVALE","RURAL",898,17.228999999999999,2.9670000000000001,2.9150999999999998,null,null,14,2.6708720000000001,2.6708720000000001,7.0850000000000002E-3,7.0850000000000002E-3,3,5.1392E-2,5.1392E-2,2.5900000000000001E-4,2.5900000000000001E-4]
[null,"WHO9","BRYDEN, DUNDAS, FERNVALE, SPLIT YARD CREEK, WIVENHOE, WIVENHOE POCKET","RURAL",61,55.933,0.53800000000000003,0.15240000000000001,null,null,7,8.8107000000000005E-2,8.8107000000000005E-2,6.6600000000000003E-4,6.6600000000000003E-4,8,6.1747999999999997E-2,6.1747999999999997E-2,1.8200000000000001E-4,1.8200000000000001E-4]
[null,"WHP10","AUCHENFLOWER","URBAN",1]
[null,"WHSTR1H","BRISBANE","CBD",17,null,null,null,null,null,1,1.093323,null,4.6049999999999997E-3]
[null,"WIB2","BRISBANE","CBD",1,null,0.11600000000000001,null,null,null,1,0.12148,null,5.1199999999999998E-4]
[null,"WIBT1","BRISBANE","CBD",8,null,null,null,null,null,1,0.48592099999999999,null,2.0470000000000002E-3]
[null,"WKDT2","BRISBANE","CBD",1]
[null,"WLDT1","GEEBUNG","URBAN",1,null,null,null,null,null,null,null,null,null,null,2,6.1399999999999996E-4,6.1399999999999996E-4,1.99E-6,1.99E-6]
[null,"WMD10A","KULUIN, MAROOCHYDORE","URBAN",1253,5.8490000000000002,1.6859999999999999,3.5247999999999999,null,null,6,1.5009999999999999E-3,1.5009999999999999E-3,5.9599999999999997E-6,5.9599999999999997E-6,6,2.9000000000000001E-2,2.9000000000000001E-2,1.21E-4,1.21E-4]
[null,"WMD11A","BLI BLI, MARCOOLA, MUDJIMBA, PACIFIC PARADISE, TWIN WATERS","RURAL",1089,5.95,15.842000000000001,4.8585000000000003,null,null,5,1.111E-3,1.111E-3,1.2799999999999999E-5,1.2799999999999999E-5,6,0.13934199999999999,0.13934199999999999,5.4299999999999997E-4,5.4299999999999997E-4]
[null,"WMD13A","BUDERIM, FOREST GLEN, KUNDA PARK, MONS","RURAL",988,9.02,6.069,2.9531999999999998,null,null,10,1.3919000000000001E-2,1.3919000000000001E-2,1.92E-4,1.92E-4,6,3.6257999999999999E-2,3.6257999999999999E-2,2.41E-4,2.41E-4]
[null,"WMD14A","MARCOOLA, MUDJIMBA, TWIN WATERS","RURAL",1647,5.27,12.794,3.5629,null,null,3,2.2207000000000001E-2,2.2207000000000001E-2,2.03E-4,2.03E-4,14,0.34605200000000003,0.26415899999999998,1.6169999999999999E-3,1.366E-3]
[null,"WMD1A","KUNDA PARK, MAROOCHYDORE","URBAN",144,3.2650000000000001,1.157,3.3151999999999999,null,null,3,3.3915000000000001E-2,3.3915000000000001E-2,1.4999999999999999E-4,1.4999999999999999E-4,3,1.6169999999999999E-3,1.6169999999999999E-3,5.9599999999999997E-6,5.9599999999999997E-6]
[null,"WMD2A","BUDERIM","URBAN",1472,9.4930000000000003,3.0219999999999998,3.5247999999999999,null,null,14,0.70783200000000002,0.70783200000000002,7.5030000000000001E-3,7.5030000000000001E-3,4,4.5145999999999999E-2,4.5145999999999999E-2,1.5200000000000001E-4,1.5200000000000001E-4]
[null,"WMD3A","BUDERIM, KULUIN, MAROOCHYDORE","URBAN",1377,8.0090000000000003,1.099,3.2581000000000002,null,null,5,1.0499999999999999E-3,1.0499999999999999E-3,3.6699999999999998E-5,3.6699999999999998E-5,5,4.3534000000000003E-2,4.3534000000000003E-2,1.3200000000000001E-4,1.3200000000000001E-4]
[null,"WMD4A","BLI BLI, BUDERIM, DIDDILLIBAH, KULUIN, ROSEMOUNT","RURAL",1459,22.082000000000001,2.9809999999999999,4.0583,null,null,9,1.7822999999999999E-2,1.7603000000000001E-2,1E-4,9.7399999999999996E-5,20,0.24588199999999999,0.2359,9.6100000000000005E-4,9.0499999999999999E-4]
[null,"WMD6A","BUDERIM, MONS, TANAWHA","RURAL",1821,11.714,2.83,3.5819999999999999]
[null,"WMD6A","BUDERIM, MONS, TANAWHA","URBAN",null,11.714,2.83,3.5819999999999999,null,null,13,0.21501400000000001,0.21501400000000001,3.0400000000000002E-3,3.0400000000000002E-3,11,7.2118000000000002E-2,7.2118000000000002E-2,2.4399999999999999E-4,2.4399999999999999E-4]
[null,"WMD8B","BUDERIM, FOREST GLEN, KIELS MOUNTAIN, KUNDA PARK, MONS, WOOMBYE","RURAL",800,15.936,6.6360000000000001,4.5537000000000001,null,null,7,0.14940800000000001,0.14940800000000001,1.928E-3,1.928E-3,5,0.112276,0.112276,5.5900000000000004E-4,5.5900000000000004E-4]
[null,"WMR1","CAMPBELLS POCKET, MOUNT MEE, MT PLEASANT, OCEAN VIEW, WAMURAN, WAMURAN BASIN","RURAL",786,76.557000000000002,6.6660000000000004,1.3909,null,null,24,1.6314489999999999,1.6302030000000001,1.0566000000000001E-2,1.0560999999999999E-2,3,4.0911000000000003E-2,4.0911000000000003E-2,9.7399999999999996E-5,9.7399999999999996E-5]
[null,"WMR2","BELLMERE, WAMURAN, WAMURAN BASIN","RURAL",240,27.814,1.2470000000000001,0.59060000000000001,null,null,12,0.58894899999999994,0.58894899999999994,2.3760000000000001E-3,2.3760000000000001E-3,4,3.6517000000000001E-2,3.6517000000000001E-2,2.31E-4,2.31E-4]
[null,"WMR3","D'AGUILAR, ELIMBAH, WAMURAN","RURAL",365,43.427,0.56499999999999995,1.6767000000000001,null,null,4,0.32233800000000001,2.0303000000000002E-2,4.64E-4,3.0800000000000003E-5,6,3.1285E-2,2.9829000000000001E-2,1.26E-4,1.15E-4]
[null,"WMR4","BRACALBA, WAMURAN","RURAL",46,13.698,0.64600000000000002,0.1143,null,null,2,2.7126999999999998E-2,2.7126999999999998E-2,1.26E-4,1.26E-4,8,6.9475999999999996E-2,5.5280999999999997E-2,2.2599999999999999E-4,1.5899999999999999E-4]
[null,"WNM1A","WYNNUM, WYNNUM WEST","URBAN",1641,5.2830000000000004,3.4969999999999999,5.0872000000000002,null,null,10,0.52270300000000003,0.316834,4.9800000000000001E-3,3.3479999999999998E-3,14,8.5616999999999999E-2,8.5616999999999999E-2,3.0899999999999998E-4,3.0899999999999998E-4]
[null,"WNM2A","MANLY, WYNNUM","URBAN",2146,7.5270000000000001,0.56200000000000006,4.0964,null,null,13,0.59957899999999997,0.59957899999999997,6.3E-3,6.3E-3,18,9.7464999999999996E-2,9.7464999999999996E-2,3.1599999999999998E-4,3.1599999999999998E-4]
[null,"WNM3","WYNNUM","URBAN",1403,5.2770000000000001,0.69199999999999995,2.3816000000000002,null,null,7,5.3049999999999998E-3,5.3049999999999998E-3,2.6800000000000001E-5,2.6800000000000001E-5,7,2.6190999999999999E-2,2.6190999999999999E-2,9.4300000000000002E-5,9.4300000000000002E-5]
[null,"WNM4","WYNNUM","URBAN",1126,4.68,0.95599999999999996,2.153,null,null,3,2.4627E-2,2.4627E-2,1.7000000000000001E-4,1.7000000000000001E-4,9,2.1225000000000001E-2,2.1225000000000001E-2,8.3399999999999994E-5,8.3399999999999994E-5]
[null,"WNM5","HEMMANT, LYTTON, WYNNUM, WYNNUM WEST","URBAN",1956,9.5549999999999997,3.2410000000000001,3.7725,null,null,17,0.30865799999999999,0.30865799999999999,4.1110000000000001E-3,4.1110000000000001E-3,11,5.0493999999999997E-2,5.0493999999999997E-2,1.56E-4,1.56E-4]
[null,"WNM6","WYNNUM, WYNNUM WEST","URBAN",1002,2.9929999999999999,1.9490000000000001,1.6767000000000001,null,null,1,7.9059999999999998E-3,7.9059999999999998E-3,1.34E-4,1.34E-4,5,2.1579999999999998E-2,2.1579999999999998E-2,6.1500000000000004E-5,6.1500000000000004E-5]
[null,"WNM7A","WYNNUM","URBAN",1131,3.4750000000000001,1.196,3.5438999999999998,null,null,6,7.4440000000000001E-3,7.4440000000000001E-3,7.4400000000000006E-5,7.4400000000000006E-5,6,1.9387999999999999E-2,1.9387999999999999E-2,7.5400000000000003E-5,7.5400000000000003E-5]
[null,"WQUTR1H","BRISBANE","CBD",1,null,null,null,null,null,1,6.0740000000000002E-2,null,2.5599999999999999E-4]
[null,"WRD11A","KANGAROO POINT, WOOLLOONGABBA","URBAN",235,3.3000000000000002E-2,1.0900000000000001,2.0958000000000001,null,null,1,7.4999999999999993E-5,7.4999999999999993E-5,9.9000000000000005E-7,9.9000000000000005E-7,2,4.8329999999999996E-3,4.8329999999999996E-3,1.8899999999999999E-5,1.8899999999999999E-5]
[null,"WRD13B","SOUTH BRISBANE, WOOLLOONGABBA","URBAN",15,null,2.157,3.1057000000000001]
[null,"WRD15A","EAST BRISBANE, KANGAROO POINT","URBAN",1000,1.5369999999999999,0.93100000000000005,2.4388000000000001,null,null,2,1.0900000000000001E-4,1.0900000000000001E-4,1.99E-6,1.99E-6,8,6.9503999999999996E-2,6.9503999999999996E-2,2.33E-4,2.33E-4]
[null,"WRD15B","WOOLLOONGABBA","URBAN",535,0.40300000000000002,2.109,4.0011999999999999,null,null,3,7.9570000000000005E-3,7.9570000000000005E-3,1.25E-4,1.25E-4,1,9.6000000000000002E-5,9.6000000000000002E-5,9.9000000000000005E-7,9.9000000000000005E-7]
[null,"WRD17A","EAST BRISBANE, WOOLLOONGABBA","URBAN",428,8.5000000000000006E-2,1.57,2.1149,null,null,3,1.866E-3,1.866E-3,4.6699999999999997E-5,4.6699999999999997E-5,2,1.1609E-2,1.1609E-2,5.4599999999999999E-5,5.4599999999999999E-5]
[null,"WRD17B",null,"URBAN",2,null,null,null,null,null,1,4.8999999999999998E-5,4.8999999999999998E-5,9.9000000000000005E-7,9.9000000000000005E-7]
[null,"WRD19A","COORPAROO, EAST BRISBANE","URBAN",1310,4.4580000000000002,0.49199999999999999,4.5918000000000001,null,null,10,4.5790999999999998E-2,4.5790999999999998E-2,1.3259999999999999E-3,1.3259999999999999E-3,8,2.6089000000000001E-2,2.6089000000000001E-2,1.1E-4,1.1E-4]
[null,"WRD20A","EAST BRISBANE, NORMAN PARK","URBAN",1212,2.2650000000000001,3.1150000000000002,3.6581999999999999,null,null,11,4.1408E-2,4.1408E-2,4.6200000000000001E-4,4.6200000000000001E-4,9,4.2277000000000002E-2,4.2277000000000002E-2,1.5899999999999999E-4,1.5899999999999999E-4]
[null,"WRD21A","KANGAROO POINT, SOUTH BRISBANE, WOOLLOONGABBA","URBAN",840,1.4870000000000001,4.0970000000000004,3.2389999999999999,null,null,11,7.9806000000000002E-2,7.9806000000000002E-2,1.1050000000000001E-3,1.1050000000000001E-3,5,1.9161000000000001E-2,1.9161000000000001E-2,6.8499999999999998E-5,6.8499999999999998E-5]
[null,"WRD22B","KANGAROO POINT","URBAN",811,0.39100000000000001,4.1130000000000004,2.4769000000000001,null,null,5,7.6010000000000001E-3,7.3289999999999996E-3,8.3399999999999994E-5,8.2399999999999997E-5,11,7.5657000000000002E-2,7.5657000000000002E-2,2.5599999999999999E-4,2.5599999999999999E-4]
[null,"WRD24A","GREENSLOPES, WOOLLOONGABBA","URBAN",264,0.50900000000000001,2.5379999999999998,1.8863000000000001,null,null,1,8.8999999999999995E-5,8.8999999999999995E-5,9.9000000000000005E-7,9.9000000000000005E-7,3,1.2819000000000001E-2,1.2819000000000001E-2,2.9799999999999999E-5,2.9799999999999999E-5]
[null,"WRD25A","SOUTH BRISBANE, WOOLLOONGABBA","URBAN",170,null,3.6240000000000001,2.3054000000000001,null,null,1,6.6000000000000005E-5,6.6000000000000005E-5,9.9000000000000005E-7,9.9000000000000005E-7,1,1.052E-3,1.052E-3,1.99E-6,1.99E-6]
[null,"WRD25B","KANGAROO POINT","URBAN",1216,0.439,5.2229999999999999,4.1917,null,null,3,2.2957999999999999E-2,2.2957999999999999E-2,1.1400000000000001E-4,1.1400000000000001E-4,7,3.8358999999999997E-2,3.8358999999999997E-2,1.37E-4,1.37E-4]
[null,"WRD3A","EAST BRISBANE, WOOLLOONGABBA","URBAN",63,null,1.575,1.9624999999999999,null,null,1,1.15E-4,1.15E-4,9.9000000000000005E-7,9.9000000000000005E-7,1,1.836E-3,1.836E-3,4.9599999999999999E-6,4.9599999999999999E-6]
[null,"WRD5A","EAST BRISBANE, KANGAROO POINT","URBAN",153,null,1.625,0.45729999999999998]
[null,"WRD9A","KANGAROO POINT","URBAN",548,null,3.516,3.3723999999999998,null,null,null,null,null,null,null,1,4.9779999999999998E-3,4.9779999999999998E-3,1.6900000000000001E-5,1.6900000000000001E-5]
[null,"WRG11A","KINGSTON, LOGAN CENTRAL, WOODRIDGE","URBAN",857,5.4210000000000003,1.1559999999999999,3.0674999999999999,null,null,6,4.86E-4,4.86E-4,5.9599999999999997E-6,5.9599999999999997E-6,5,1.3561999999999999E-2,1.3561999999999999E-2,5.5600000000000003E-5,5.5600000000000003E-5]
[null,"WRG12A","BERRINBA, LOGAN CENTRAL, WOODRIDGE","URBAN",1489,6.41,1.1419999999999999,2.6103000000000001,null,null,11,4.5335E-2,4.5335E-2,1.7000000000000001E-4,1.7000000000000001E-4,6,4.1431999999999997E-2,4.1431999999999997E-2,8.4400000000000005E-5,8.4400000000000005E-5]
[null,"WRG15A","KINGSTON, LOGAN CENTRAL, WOODRIDGE","URBAN",1337,6.1440000000000001,0.57099999999999995,2.7818000000000001,null,null,14,1.2864E-2,1.2864E-2,2.2100000000000001E-4,2.2100000000000001E-4,3,6.4409999999999997E-3,6.4409999999999997E-3,3.4700000000000003E-5,3.4700000000000003E-5]
[null,"WRG16A","SLACKS CREEK","URBAN",33,0.222,3.468,3.1057000000000001]
[null,"WRG18A","LOGAN CENTRAL","URBAN",6,null,3.1160000000000001,3.944,null,null,1,2.34E-4,2.34E-4,1.99E-6,1.99E-6]
[null,"WRG19A","DAISY HILL, SLACKS CREEK, SPRINGWOOD, WOODRIDGE","URBAN",797,3.7559999999999998,1.992,3.7153999999999998,null,null,4,5.9500000000000004E-4,5.9500000000000004E-4,3.9700000000000001E-6,3.9700000000000001E-6,7,5.5292000000000001E-2,5.5292000000000001E-2,1.6799999999999999E-4,1.6799999999999999E-4]
[null,"WRG1A","SLACKS CREEK, WOODRIDGE","URBAN",2735,9.6929999999999996,1.0740000000000001,4.9157000000000002,null,null,12,5.3109999999999997E-3,5.3109999999999997E-3,7.25E-5,7.25E-5,3,1.5363E-2,1.5363E-2,5.9599999999999999E-5,5.9599999999999999E-5]
[null,"WRG2A","KINGSTON, LOGAN CENTRAL, SLACKS CREEK","URBAN",1467,9.0500000000000007,0.218,3.0674999999999999,null,null,11,1.8485999999999999E-2,1.8485999999999999E-2,9.1299999999999997E-5,9.1299999999999997E-5,4,1.9495999999999999E-2,1.9495999999999999E-2,7.8399999999999995E-5,7.8399999999999995E-5]
[null,"WRG4A","SLACKS CREEK","URBAN",632,2.2389999999999999,0.72499999999999998,1.1432,null,null,4,7.012E-3,7.012E-3,9.5299999999999999E-5,9.5299999999999999E-5,2,6.3359999999999996E-3,6.3359999999999996E-3,3.0800000000000003E-5,3.0800000000000003E-5]
[null,"WRG5A","BERRINBA, KARAWATHA, LOGAN CENTRAL, WOODRIDGE","URBAN",1085,8.1370000000000005,3.4590000000000001,4.9538000000000002,null,null,7,9.8211000000000007E-2,9.8211000000000007E-2,1.1169999999999999E-3,1.1169999999999999E-3,4,1.5692999999999999E-2,1.5692999999999999E-2,5.66E-5,5.66E-5]
[null,"WRG6A","WOODRIDGE","URBAN",743,3.2370000000000001,0.13400000000000001,1.448,null,null,5,4.8299999999999998E-4,4.4000000000000002E-4,4.9599999999999999E-6,3.9700000000000001E-6,5,1.8110000000000001E-2,1.8110000000000001E-2,9.0299999999999999E-5,9.0299999999999999E-5]
[null,"WRG8A","DAISY HILL, KINGSTON, LOGANLEA, SLACKS CREEK","URBAN",1276,10.151999999999999,1.2090000000000001,3.5057999999999998,null,null,7,1.3946999999999999E-2,1.3776999999999999E-2,1.08E-4,1.07E-4,8,4.5765E-2,4.5765E-2,2.03E-4,2.03E-4]
[null,"WRG9A","SLACKS CREEK, SPRINGWOOD","URBAN",733,4.7969999999999997,0.34100000000000003,3.3915000000000002,null,null,9,4.5593000000000002E-2,4.5593000000000002E-2,1.034E-3,1.034E-3,3,5.9589999999999999E-3,5.9589999999999999E-3,1.59E-5,1.59E-5]
[null,"WSE1B","KURWONGBAH, WHITESIDE","URBAN",2,5.7009999999999996,2.4900000000000002,3.8677999999999999,null,null,1,2.5000000000000001E-5,2.5000000000000001E-5,9.9000000000000005E-7,9.9000000000000005E-7,2,7.2599999999999997E-4,7.2599999999999997E-4,1.99E-6,1.99E-6]
[null,"WSE3A","ARMSTRONG CREEK, DAYBORO, KING SCRUB, LACEYS CREEK, MT PLEASANT, OCEAN VIEW, RUSH CREEK","RURAL",1133,98.117000000000004,5.782,3.1438000000000001,null,null,41,1.185038,1.1840999999999999,8.7869999999999997E-3,8.7849999999999994E-3,27,0.46152199999999999,0.46132200000000001,1.261E-3,1.253E-3]
[null,"WSE5A","ARMSTRONG CREEK, DAYBORO, KOBBLE CREEK, KURWONGBAH, LACEYS CREEK, MOUNT SAMSON, PETRIE, RUSH CREEK, SAMSONVALE, WHITESIDE","RURAL",648,69.12,1.4590000000000001,1.6005,null,null,22,0.80427099999999996,0.140737,2.8630000000000001E-3,1.794E-3,25,0.126968,0.126968,5.3799999999999996E-4,5.3799999999999996E-4]
[null,"WSE6A","KURWONGBAH, WHITESIDE","RURAL",402,21.117000000000001,2.3090000000000002,1.2956000000000001,null,null,10,7.6730999999999994E-2,7.6730999999999994E-2,2.5219999999999999E-3,2.5219999999999999E-3,3,3.2890000000000003E-2,3.2890000000000003E-2,1E-4,1E-4]
[null,"WSO12B","ELLEN GROVE, FOREST LAKE","RURAL",905,3.2949999999999999,4.8540000000000001,2.0768,null,null,5,0.279248,0.279248,3.722E-3,3.722E-3,3,1.0266000000000001E-2,1.0266000000000001E-2,6.41E-5,6.41E-5]
[null,"WSO13A","CAROLE PARK, ELLEN GROVE, GAILES, WACOL","RURAL",721,5.0250000000000004,3.0960000000000001,1.8863000000000001,null,null,null,null,null,null,null,7,4.1695000000000003E-2,4.1695000000000003E-2,1.8200000000000001E-4,1.8200000000000001E-4]
[null,"WSO15A","WACOL","URBAN",48,1.101,1.7829999999999999,2.7818000000000001,null,null,1,9.2999999999999997E-5,9.2999999999999997E-5,9.9000000000000005E-7,9.9000000000000005E-7,3,6.6E-4,6.6E-4,8.9299999999999992E-6,8.9299999999999992E-6]
[null,"WSO16A","WACOL","URBAN",15,null,2.2530000000000001,2.5912000000000002]
[null,"WSO16B","WACOL","URBAN",2,null,1.804,3.7343999999999999]
[null,"WSO2B","WACOL","URBAN",16,0.47099999999999997,0.86199999999999999,2.5150000000000001,null,null,null,null,null,null,null,1,1.1400000000000001E-4,1.1400000000000001E-4,9.9000000000000005E-7,9.9000000000000005E-7]
[null,"WSO3A","ELLEN GROVE, FOREST LAKE, RICHLANDS, WACOL","URBAN",1144,3.5179999999999998,7.03,4.6871,null,null,2,2.2900000000000001E-4,2.2900000000000001E-4,1.99E-6,1.99E-6,2,4.5100000000000001E-3,4.5100000000000001E-3,7.5400000000000003E-5,7.5400000000000003E-5]
[null,"WSO5A","WACOL","URBAN",58,0.217,2.5459999999999998,3.3532999999999999,null,null,null,null,null,null,null,1,5.8500000000000002E-4,5.8500000000000002E-4,9.9000000000000005E-7,9.9000000000000005E-7]
[null,"WSS11A","EAGLE FARM","URBAN",3,3.4000000000000002E-2,1.476,2.6293000000000002]
[null,"WSS3A","EAGLE FARM, PINKENBA","URBAN",11,2.0790000000000002,1.7889999999999999,3.0674999999999999,null,null,null,null,null,null,null,1,4.8799999999999999E-4,4.8799999999999999E-4,9.9000000000000005E-7,9.9000000000000005E-7]
[null,"WSS9B",null,"URBAN",1,null,0.157]
[null,"WTRT2","BRISBANE","CBD",1]
[null,"WTWT1","BRISBANE","CBD",9,null,null,null,null,null,2,6.4588469999999996,0.20260900000000001,2.8396000000000001E-2,2.0470000000000002E-3]
[null,"YDA1B","NINDERRY, YANDINA","RURAL",400,13.212999999999999,2.7090000000000001,1.8290999999999999,null,null,11,0.328679,0.328679,3.1120000000000002E-3,3.1120000000000002E-3,4,0.220503,0.220503,6.6600000000000003E-4,6.6600000000000003E-4]
[null,"YDA2B","BRIDGES, NORTH ARM, YANDINA","RURAL",177,9.6050000000000004,0.97599999999999998,0.36199999999999999,null,null,2,1.0394E-2,1.0394E-2,4.9200000000000003E-4,4.9200000000000003E-4,2,9.3609999999999995E-3,9.3609999999999995E-3,5.13E-5,5.13E-5]
[null,"YDA3A","MAROOCHY RIVER, YANDINA","RURAL",394,13.923999999999999,3.2330000000000001,1.2194,null,null,7,1.3011E-2,1.3011E-2,1.036E-3,1.036E-3,12,9.1389999999999999E-2,9.1389999999999999E-2,3.5100000000000002E-4,3.5100000000000002E-4]
[null,"YDA5A","BRIDGES, COOLOOLABIN, KIAMBA, YANDINA","RURAL",918,22.053000000000001,0.53400000000000003,2.0005999999999999,null,null,19,0.37773099999999998,0.37773099999999998,1.0470999999999999E-2,1.0470999999999999E-2,9,0.149252,0.149252,3.8200000000000002E-4,3.8200000000000002E-4]
[null,"YDA6A","YANDINA","URBAN",1,0.498,0.83699999999999997,2.0577000000000001]
[null,"YMT3A","DEEBING HEIGHTS, YAMANTO","URBAN",943,2.4620000000000002,3.9,3.5438999999999998,null,null,6,8.4900000000000004E-4,5.8500000000000002E-4,5.9599999999999997E-6,4.9599999999999999E-6,2,3.2629999999999998E-3,3.2629999999999998E-3,1.29E-5,1.29E-5]
[null,"YMT5A","DEEBING HEIGHTS, GOOLMAN, PURGA, YAMANTO","RURAL",834,44.066000000000003,3.1429999999999998,3.7915999999999999,null,null,14,4.0024999999999998E-2,2.7234000000000001E-2,1.92E-4,1.54E-4,7,1.6518000000000001E-2,1.6518000000000001E-2,1.05E-4,1.05E-4]
[null,"YMT6A","DEEBING HEIGHTS, YAMANTO","RURAL",854,6.5620000000000003,3.2080000000000002,2.1720999999999999,null,null,4,1.421E-3,1.421E-3,1.2799999999999999E-5,1.2799999999999999E-5,3,1.0597000000000001E-2,1.0597000000000001E-2,7.1799999999999997E-5,7.1799999999999997E-5]
[null,"YMT6A","DEEBING HEIGHTS, YAMANTO","URBAN",854,6.5620000000000003,3.2080000000000002,2.1720999999999999,null,null,null,null,null,null,null,1,3.9849999999999998E-3,3.9849999999999998E-3,1.0900000000000001E-5,1.0900000000000001E-5]
[null,"YTA22B","BANNOCKBURN, LUSCOMBE, WINDAROO, YATALA","RURAL",1147,17.699000000000002,7.7569999999999997,5.7159000000000004,null,null,6,0.96680299999999997,0.327343,5.8500000000000002E-3,2.9299999999999999E-3,4,2.0965000000000001E-2,2.0965000000000001E-2,7.4300000000000004E-5,7.4300000000000004E-5]
[null,"YTA25A","STAPYLTON, YATALA","URBAN",127,0.88,4.2880000000000003,2.3054000000000001,null,null,null,null,null,null,null,1,4.7899999999999999E-4,4.7899999999999999E-4,6.9500000000000004E-6,6.9500000000000004E-6]
[null,"YTA2B","BEENLEIGH, KINGSHOLME, ORMEAU, ORMEAU HILLS, YATALA","RURAL",1865,12.853999999999999,10.523999999999999,6.1731999999999996,null,null,6,0.12621499999999999,0.12621499999999999,4.0470000000000002E-3,4.0470000000000002E-3,12,8.7401999999999994E-2,8.7401999999999994E-2,3.77E-4,3.77E-4]
[null,"YTA33A","LUSCOMBE, ORMEAU, YATALA","RURAL",175,11.656000000000001,0.34599999999999997,3.5438999999999998,null,null,3,0.118965,0.118965,4.5600000000000003E-4,4.5600000000000003E-4,4,4.7990000000000003E-3,4.7990000000000003E-3,6.6600000000000006E-5,6.6600000000000006E-5]
[null,"YTA34A","GILBERTON, ORMEAU, STAPYLTON, YATALA","URBAN",140,3.3420000000000001,4.7759999999999998,3.5819999999999999,null,null,3,3.5944999999999998E-2,3.5944999999999998E-2,3.3700000000000001E-4,3.3700000000000001E-4,6,5.3600000000000002E-3,5.3600000000000002E-3,4.07E-5,4.07E-5]
[null,"YTA35A","ORMEAU","URBAN",74,null,4.1509999999999998,4.0392999999999999,null,null,2,6.4099999999999997E-4,6.4099999999999997E-4,1.99E-6,1.99E-6,4,3.3379999999999998E-3,3.3379999999999998E-3,4.1699999999999997E-5,4.1699999999999997E-5]
[null,"YTA37A","YATALA","URBAN",144,3.2679999999999998,5.984,4.4775,null,null,3,1.6957E-2,1.6957E-2,1.4799999999999999E-4,1.4799999999999999E-4,2,5.44E-4,5.44E-4,4.9599999999999999E-6,4.9599999999999999E-6]
[null,"YTA39A","KINGSHOLME, ORMEAU, ORMEAU HILLS","RURAL",512,30.814,1.611,1.7719,null,null,12,0.138596,9.9426E-2,1.405E-3,1.253E-3,4,5.8022999999999998E-2,4.3083999999999997E-2,2.03E-4,1.64E-4]
[null,"YTA3A","YATALA","URBAN",141,2.8079999999999998,0.78100000000000003,4.0392999999999999,null,null,null,null,null,null,null,1,8.3100000000000003E-4,8.3100000000000003E-4,8.9299999999999992E-6,8.9299999999999992E-6]
[null,"YTA41A","ORMEAU, PIMPAMA, YATALA","RURAL",1542,4.8899999999999997,12.272,4.8776000000000002,null,null,4,1.0330000000000001E-3,1.0330000000000001E-3,1.03E-5,1.03E-5,2,1.9781E-2,1.9781E-2,1.3300000000000001E-4,1.3300000000000001E-4]
[null,"YTA43A","ORMEAU, YATALA","URBAN",1526,4.4749999999999996,13.195,5.1253000000000002,null,null,6,0.17383000000000001,0.17383000000000001,1.573E-3,1.573E-3,1,2.2369999999999998E-3,2.2369999999999998E-3,2.2799999999999999E-5,2.2799999999999999E-5]
[null,"YTA45A","ORMEAU, YATALA","URBAN",817,2.0430000000000001,5.125,4.3632,null,null,3,9.5999999999999992E-3,9.5999999999999992E-3,2.04E-4,2.04E-4,3,9.1399999999999999E-4,9.1399999999999999E-4,3.9700000000000001E-6,3.9700000000000001E-6]
[null,"YTA5A","YATALA","URBAN",1,null,1.66,5.0110000000000001]
[null,"ZMR10","ASPLEY, ZILLMERE","URBAN",1409,7.7690000000000001,0.56599999999999995,4.0202,null,null,9,2.7955000000000001E-2,2.7955000000000001E-2,1.5640000000000001E-3,1.5640000000000001E-3,9,4.3077999999999998E-2,4.3077999999999998E-2,2.03E-4,2.03E-4]
[null,"ZMR11A","ASPLEY","URBAN",300,1.552,2.8690000000000002,3.4104999999999999,null,null,null,null,null,null,null,1,7.1000000000000005E-5,7.1000000000000005E-5,9.9000000000000005E-7,9.9000000000000005E-7]
[null,"ZMR2A","ASPLEY, BRIDGEMAN DOWNS, CARSELDINE, ZILLMERE","URBAN",671,0.96499999999999997,5.601,3.5629,null,null,1,8.2459999999999999E-3,8.2459999999999999E-3,4.07E-5,4.07E-5,1,6.2500000000000001E-4,6.2500000000000001E-4,8.9299999999999992E-6,8.9299999999999992E-6]
[null,"ZMR3","ASPLEY, GEEBUNG, ZILLMERE","URBAN",1505,6.77,0.88400000000000001,2.8769999999999998,null,null,5,6.9833000000000006E-2,6.9833000000000006E-2,1.4959999999999999E-3,1.4959999999999999E-3,16,5.9815E-2,5.9815E-2,2.03E-4,2.03E-4]
[null,"ZMR4A","ASPLEY, CARSELDINE, FITZGIBBON, ZILLMERE","URBAN",2387,2.46,12.15,5.2205000000000004,null,null,5,5.6039999999999996E-3,5.6039999999999996E-3,3.3699999999999999E-5,3.3699999999999999E-5,14,3.9487000000000001E-2,3.9487000000000001E-2,1.4300000000000001E-4,1.4300000000000001E-4]
[null,"ZMR5","ASPLEY, BRIDGEMAN DOWNS","URBAN",2097,7.085,3.5019999999999998,3.9821,null,null,4,0.23014399999999999,0.23014399999999999,4.1739999999999998E-3,4.1739999999999998E-3,7,2.6114999999999999E-2,2.6114999999999999E-2,8.14E-5,8.14E-5]
[null,"ZMR6A","GEEBUNG, ZILLMERE","URBAN",791,6.8010000000000002,2.468,3.0485000000000002,null,null,2,3.6099999999999999E-4,3.6099999999999999E-4,1.99E-6,1.99E-6,7,3.2990999999999999E-2,3.2990999999999999E-2,1E-4,1E-4]
[null,"ZMR7A","ZILLMERE","URBAN",867,1.637,1.8029999999999999,1.1432,null,null,4,5.8820000000000001E-3,5.8820000000000001E-3,2.2799999999999999E-5,2.2799999999999999E-5,12,9.1763999999999998E-2,9.1763999999999998E-2,3.5399999999999999E-4,3.5399999999999999E-4]
[null,"ZMR8A","ASPLEY","URBAN",52,1.2509999999999999,0.90500000000000003,3.4676999999999998]
[null,"ZMR9","ZILLME","URBAN",2030,5.1360000000000001,1.4350000000000001,3.1438000000000001,null,null,11,2.9908000000000001E-2,2.9839999999999998E-2,3.1599999999999998E-4,3.1500000000000001E-4,22,9.2411999999999994E-2,9.2411999999999994E-2,3.2699999999999998E-4,3.2699999999999998E-4]
[]
[null,"To enter further feeder ID's - please insert new lines above this line. "]

{"sheet":"3.6.9 Network-reliability","index":7,"n_rows":24,"n_cols":7,"rows_kept":24,"cut":false,"hidden":false,"merged":[]}
[null,{"$f":"(LOOKUP(dms_Model,dms_Model_List,dms_Worksheet_List))","v":"REGULATORY REPORTING STATEMENT"},null,null,null,null,{"$f":"CONCATENATE(\"1-Jan-\",LEFT(CRY,4))","v":"1-Jan-2015"}]
[null,{"$f":"dms_TradingName","v":"Energex"}]
[null,{"$f":"CONCATENATE(\"Annual Reporting RIN Response \",CRY)","v":"Annual Reporting RIN Response 2015-16"}]
[null,"3.6 QUALITY OF SERVICES"]
[]
[]
[null,"3.6.9 - NETWORK FEEDER RELIABILITY - PLANNED OUTAGES"]
[]
[]
[null,"3.6.9.1 - PLANNED MINUTES OFF SUPPLY (SAIDI)"]
[null,null,{"$f":"CRY","v":"2015-16"}]
[null,{"$f":"INDEX(dms_FeederName_1,MATCH(dms_TradingName,dms_TradingName_List))","v":"CBD"},"2.375"]
[null,{"$f":"INDEX(dms_FeederName_2,MATCH(dms_TradingName,dms_TradingName_List))","v":"Urban"},27.385000000000002]
[null,{"$f":"INDEX(dms_FeederName_3,MATCH(dms_TradingName,dms_TradingName_List))","v":"Short rural"},55.103999999999999]
[null,{"$f":"INDEX(dms_FeederName_4,MATCH(dms_TradingName,dms_TradingName_List))","v":"Long rural"}]
[null,{"$f":"IF((INDEX(dms_FeederName_5,MATCH(dms_TradingName,dms_TradingName_List))=0),\"\",(INDEX(dms_FeederName_5,MATCH(dms_TradingName,dms_TradingName_List))))","v":""}]
[]
[null,"3.6.9.2 - PLANNED INTERRUPTIONS TO SUPPLY (SAIFI)"]
[null,null,{"$f":"CRY","v":"2015-16"}]
[null,{"$f":"INDEX(dms_FeederName_1,MATCH(dms_TradingName,dms_TradingName_List))","v":"CBD"},"0.0220"]
[null,{"$f":"INDEX(dms_FeederName_2,MATCH(dms_TradingName,dms_TradingName_List))","v":"Urban"},0.1045]
[null,{"$f":"INDEX(dms_FeederName_3,MATCH(dms_TradingName,dms_TradingName_List))","v":"Short rural"},0.21510000000000001]
[null,{"$f":"INDEX(dms_FeederName_4,MATCH(dms_TradingName,dms_TradingName_List))","v":"Long rural"}]
[null,{"$f":"IF((INDEX(dms_FeederName_5,MATCH(dms_TradingName,dms_TradingName_List))=0),\"\",(INDEX(dms_FeederName_5,MATCH(dms_TradingName,dms_TradingName_List))))","v":""}]

{"sheet":"4.1 Public lighting","index":8,"n_rows":23,"n_cols":4,"rows_kept":23,"cut":false,"hidden":false,"merged":[[9,1,10,1],[5,1,5,2]]}
[null,{"$f":"(LOOKUP(dms_Model,dms_Model_List,dms_Worksheet_List))","v":"REGULATORY REPORTING STATEMENT"}]
[null,{"$f":"dms_TradingName","v":"Energex"}]
[null,{"$f":"CONCATENATE(\"Annual Reporting RIN Response \",CRY)","v":"Annual Reporting RIN Response 2015-16"}]
[null,"4.1 PUBLIC LIGHTING"]
[]
[null,"Tables 4.1.1 - 4.1.3 deliberately omitted."]
[]
[null,"4.1.4 - PUBLIC LIGHTING METRICS BY TARIFF"]
[]
[null,"Tariff categories","Number of Lights","Public Lighting Revenue"]
[null,"<insert tariff category>","0's","$0's, nominal"]
[]
[]
[]
[]
[]
[]
[]
[]
[]
[]
[null,"To enter further tariff categories - please insert new lines above this line. "]
[null,"Total ",{"$f":"SUM(C12:C21)","v":0},{"$f":"SUM(D12:D21)","v":0}]

{"sheet":"6.2 STPIS Reliability","index":9,"n_rows":98,"n_cols":8,"rows_kept":98,"cut":false,"hidden":false,"merged":[[80,1,85,1],[86,1,91,1],[92,1,97,1],[79,1,79,2],[22,1,27,1],[32,1,37,1],[38,1,43,1],[44,1,49,1],[5,1,5,2],[31,1,31,2],[68,1,73,1],[62,1,67,1],[55,1,55,2],[56,1,61,1],[16,1,21,1],[9,1,9,2],[10,1,15,1]]}
[null,{"$f":"(LOOKUP(dms_Model,dms_Model_List,dms_Worksheet_List))","v":"REGULATORY REPORTING STATEMENT"}]
[null,{"$f":"dms_TradingName","v":"Energex"}]
[null,{"$f":"CONCATENATE(\"Annual Reporting RIN Response \",CRY)","v":"Annual Reporting RIN Response 2015-16"}]
[null,"6.2 RELIABILITY AND CUSTOMER SERVICE PERFORMANCE"]
[]
[null,"Did the MAIFI parameter of the STPIS apply during the period?\nThis flag is set from the response on worksheet 3.6.8 Network feeders",null,{"$f":"dms_MAIFI_Flag","v":"No"}]
[]
[]
[null,"6.2.1 - UNPLANNED MINUTES OFF SUPPLY (SAIDI)"]
[null,null,null,{"$f":"CRY","v":"2015-16"}]
[null,"Total sustained minutes off supply",{"$f":"INDEX(dms_FeederName_1,MATCH(dms_TradingName,dms_TradingName_List))","v":"CBD"},26.336548136775001]
[null,null,{"$f":"INDEX(dms_FeederName_2,MATCH(dms_TradingName,dms_TradingName_List))","v":"Urban"},58.502848713690703," "]
[null,null,{"$f":"INDEX(dms_FeederName_3,MATCH(dms_TradingName,dms_TradingName_List))","v":"Short rural"},205.091957305237]
[null,null,{"$f":"INDEX(dms_FeederName_4,MATCH(dms_TradingName,dms_TradingName_List))","v":"Long rural"}]
[null,null,{"$f":"IF((INDEX(dms_FeederName_5,MATCH(dms_TradingName,dms_TradingName_List))=0),\"\",(INDEX(dms_FeederName_5,MATCH(dms_TradingName,dms_TradingName_List))))","v":""},null,"","","",""]
[null,null,"Whole Network",99.218177470000001,"","","",""]
[null,"Total of excluded events*\n\n*see 3.3 of STPIS",{"$f":"INDEX(dms_FeederName_1,MATCH(dms_TradingName,dms_TradingName_List))","v":"CBD"},23.960407606375099]
[null,null,{"$f":"INDEX(dms_FeederName_2,MATCH(dms_TradingName,dms_TradingName_List))","v":"Urban"},6.0843499999999997]
[null,null,{"$f":"INDEX(dms_FeederName_3,MATCH(dms_TradingName,dms_TradingName_List))","v":"Short rural"},74.452830000000006]
[null,null,{"$f":"INDEX(dms_FeederName_4,MATCH(dms_TradingName,dms_TradingName_List))","v":"Long rural"}]
[null,null,{"$f":"IF((INDEX(dms_FeederName_5,MATCH(dms_TradingName,dms_TradingName_List))=0),\"\",(INDEX(dms_FeederName_5,MATCH(dms_TradingName,dms_TradingName_List))))","v":""},null,null,"","",""]
[null,null,"Whole Network",25.165500000000002,null,"","",""]
[null,"Total sustained minutes off supply after removing excluded events",{"$f":"INDEX(dms_FeederName_1,MATCH(dms_TradingName,dms_TradingName_List))","v":"CBD"},2.3761405303999199]
[null,null,{"$f":"INDEX(dms_FeederName_2,MATCH(dms_TradingName,dms_TradingName_List))","v":"Urban"},52.418498978767801]
[null,null,{"$f":"INDEX(dms_FeederName_3,MATCH(dms_TradingName,dms_TradingName_List))","v":"Short rural"},130.63912628145701]
[null,null,{"$f":"INDEX(dms_FeederName_4,MATCH(dms_TradingName,dms_TradingName_List))","v":"Long rural"}]
[null,null,{"$f":"IF((INDEX(dms_FeederName_5,MATCH(dms_TradingName,dms_TradingName_List))=0),\"\",(INDEX(dms_FeederName_5,MATCH(dms_TradingName,dms_TradingName_List))))","v":""},null,"","","",""]
[null,null,"Whole Network",74.052679999999995,"","","",""]
[]
[]
[null,"6.2.2 - UNPLANNED INTERRUPTIONS TO SUPPLY (SAIFI)"]
[null,null,null,{"$f":"CRY","v":"2015-16"}]
[null,"Total sustained interruptions",{"$f":"INDEX(dms_FeederName_1,MATCH(dms_TradingName,dms_TradingName_List))","v":"CBD"},0.11102583781018199]
[null,null,{"$f":"INDEX(dms_FeederName_2,MATCH(dms_TradingName,dms_TradingName_List))","v":"Urban"},0.68851339]
[null,null,{"$f":"INDEX(dms_FeederName_3,MATCH(dms_TradingName,dms_TradingName_List))","v":"Short rural"},1.5586643010000001]
[null,null,{"$f":"INDEX(dms_FeederName_4,MATCH(dms_TradingName,dms_TradingName_List))","v":"Long rural"}]
[null,null,{"$f":"IF((INDEX(dms_FeederName_5,MATCH(dms_TradingName,dms_TradingName_List))=0),\"\",(INDEX(dms_FeederName_5,MATCH(dms_TradingName,dms_TradingName_List))))","v":""},null,"","","",""]
[null,null,"Whole Network",0.92912085,"","","",""]
[null,"Total of excluded events*\n\n*see 3.3 of STPIS",{"$f":"INDEX(dms_FeederName_1,MATCH(dms_TradingName,dms_TradingName_List))","v":"CBD"},0.10104886]
[null,null,{"$f":"INDEX(dms_FeederName_2,MATCH(dms_TradingName,dms_TradingName_List))","v":"Urban"},1.9105E-2]
[null,null,{"$f":"INDEX(dms_FeederName_3,MATCH(dms_TradingName,dms_TradingName_List))","v":"Short rural"},0.182563]
[null,null,{"$f":"INDEX(dms_FeederName_4,MATCH(dms_TradingName,dms_TradingName_List))","v":"Long rural"}]
[null,null,{"$f":"IF((INDEX(dms_FeederName_5,MATCH(dms_TradingName,dms_TradingName_List))=0),\"\",(INDEX(dms_FeederName_5,MATCH(dms_TradingName,dms_TradingName_List))))","v":""},null,"",null,"",""]
[null,null,"Whole Network",6.4834000000000003E-2,"",null,"",""]
[null,"Total sustained interruptions after removing excluded events",{"$f":"INDEX(dms_FeederName_1,MATCH(dms_TradingName,dms_TradingName_List))","v":"CBD"},9.9769762087490391E-3]
[null,null,{"$f":"INDEX(dms_FeederName_2,MATCH(dms_TradingName,dms_TradingName_List))","v":"Urban"},0.66940859185092905]
[null,null,{"$f":"INDEX(dms_FeederName_3,MATCH(dms_TradingName,dms_TradingName_List))","v":"Short rural"},1.3761015897750499]
[null,null,{"$f":"INDEX(dms_FeederName_4,MATCH(dms_TradingName,dms_TradingName_List))","v":"Long rural"}]
[null,null,{"$f":"IF((INDEX(dms_FeederName_5,MATCH(dms_TradingName,dms_TradingName_List))=0),\"\",(INDEX(dms_FeederName_5,MATCH(dms_TradingName,dms_TradingName_List))))","v":""},null,"","","",""]
[null,null,"Whole Network",0.86428678000000003,"","","",""]
[]
[]
[]
[]
[null,"6.2.3 - UNPLANNED MOMENTARY INTERRUPTIONS TO SUPPLY (MAIFI)"]
[null,null,null,{"$f":"CRY","v":"2015-16"}]
[null,"Total momentary interruptions",{"$f":"INDEX(dms_FeederName_1,MATCH(dms_TradingName,dms_TradingName_List))","v":"CBD"}]
[null,null,{"$f":"INDEX(dms_FeederName_2,MATCH(dms_TradingName,dms_TradingName_List))","v":"Urban"}]
[null,null,{"$f":"INDEX(dms_FeederName_3,MATCH(dms_TradingName,dms_TradingName_List))","v":"Short rural"}]
[null,null,{"$f":"INDEX(dms_FeederName_4,MATCH(dms_TradingName,dms_TradingName_List))","v":"Long rural"}]
[null,null,{"$f":"IF((INDEX(dms_FeederName_5,MATCH(dms_TradingName,dms_TradingName_List))=0),\"\",(INDEX(dms_FeederName_5,MATCH(dms_TradingName,dms_TradingName_List))))","v":""}]
[null,null,"Whole Network"]
[null,"Total of excluded events*\n\n*see 3.3 of STPIS",{"$f":"INDEX(dms_FeederName_1,MATCH(dms_TradingName,dms_TradingName_List))","v":"CBD"}]
[null,null,{"$f":"INDEX(dms_FeederName_2,MATCH(dms_TradingName,dms_TradingName_List))","v":"Urban"}]
[null,null,{"$f":"INDEX(dms_FeederName_3,MATCH(dms_TradingName,dms_TradingName_List))","v":"Short rural"}]
[null,null,{"$f":"INDEX(dms_FeederName_4,MATCH(dms_TradingName,dms_TradingName_List))","v":"Long rural"}]
[null,null,{"$f":"IF((INDEX(dms_FeederName_5,MATCH(dms_TradingName,dms_TradingName_List))=0),\"\",(INDEX(dms_FeederName_5,MATCH(dms_TradingName,dms_TradingName_List))))","v":""}]
[null,null,"Whole Network"]
[null,"Total momentary interruptions after removing excluded events",{"$f":"INDEX(dms_FeederName_1,MATCH(dms_TradingName,dms_TradingName_List))","v":"CBD"}]
[null,null,{"$f":"INDEX(dms_FeederName_2,MATCH(dms_TradingName,dms_TradingName_List))","v":"Urban"}]
[null,null,{"$f":"INDEX(dms_FeederName_3,MATCH(dms_TradingName,dms_TradingName_List))","v":"Short rural"}]
[null,null,{"$f":"INDEX(dms_FeederName_4,MATCH(dms_TradingName,dms_TradingName_List))","v":"Long rural"}]
[null,null,{"$f":"IF((INDEX(dms_FeederName_5,MATCH(dms_TradingName,dms_TradingName_List))=0),\"\",(INDEX(dms_FeederName_5,MATCH(dms_TradingName,dms_TradingName_List))))","v":""}]
[null,null,"Whole Network"]
[]
[]
[]
[]
[null,"6.2.4 - DISTRIBUTION CUSTOMER NUMBERS"]
[null,null,null,{"$f":"CRY","v":"2015-16"}]
[null,"Customer numbers at the start of the period",{"$f":"INDEX(dms_FeederName_1,MATCH(dms_TradingName,dms_TradingName_List))","v":"CBD"},3842]
[null,null,{"$f":"INDEX(dms_FeederName_2,MATCH(dms_TradingName,dms_TradingName_List))","v":"Urban"},1005101]
[null,null,{"$f":"INDEX(dms_FeederName_3,MATCH(dms_TradingName,dms_TradingName_List))","v":"Short rural"},380666]
[null,null,{"$f":"INDEX(dms_FeederName_4,MATCH(dms_TradingName,dms_TradingName_List))","v":"Long rural"}]
[null,null,{"$f":"IF((INDEX(dms_FeederName_5,MATCH(dms_TradingName,dms_TradingName_List))=0),\"\",(INDEX(dms_FeederName_5,MATCH(dms_TradingName,dms_TradingName_List))))","v":""}]
[null,null,"Whole Network",1389609]
[null,"Customer numbers at the end of the period",{"$f":"INDEX(dms_FeederName_1,MATCH(dms_TradingName,dms_TradingName_List))","v":"CBD"},3975]
[null,null,{"$f":"INDEX(dms_FeederName_2,MATCH(dms_TradingName,dms_TradingName_List))","v":"Urban"},1009785]
[null,null,{"$f":"INDEX(dms_FeederName_3,MATCH(dms_TradingName,dms_TradingName_List))","v":"Short rural"},399570]
[null,null,{"$f":"INDEX(dms_FeederName_4,MATCH(dms_TradingName,dms_TradingName_List))","v":"Long rural"}]
[null,null,{"$f":"IF((INDEX(dms_FeederName_5,MATCH(dms_TradingName,dms_TradingName_List))=0),\"\",(INDEX(dms_FeederName_5,MATCH(dms_TradingName,dms_TradingName_List))))","v":""}]
[null,null,"Whole Network",1413330]
[null,"Average customer numbers",{"$f":"INDEX(dms_FeederName_1,MATCH(dms_TradingName,dms_TradingName_List))","v":"CBD"},{"$f":"ROUND(SUM(D81+D87)/2,0)","v":3909}]
[null,null,{"$f":"INDEX(dms_FeederName_2,MATCH(dms_TradingName,dms_TradingName_List))","v":"Urban"},{"$f":"ROUND(SUM(D82+D88)/2,0)","v":1007443}]
[null,null,{"$f":"INDEX(dms_FeederName_3,MATCH(dms_TradingName,dms_TradingName_List))","v":"Short rural"},{"$f":"ROUND(SUM(D83+D89)/2,0)","v":390118}]
[null,null,{"$f":"INDEX(dms_FeederName_4,MATCH(dms_TradingName,dms_TradingName_List))","v":"Long rural"},{"$f":"ROUND(SUM(D84+D90)/2,0)","v":0}]
[null,null,{"$f":"IF((INDEX(dms_FeederName_5,MATCH(dms_TradingName,dms_TradingName_List))=0),\"\",(INDEX(dms_FeederName_5,MATCH(dms_TradingName,dms_TradingName_List))))","v":""},{"$f":"ROUND(SUM(D85+D91)/2,0)","v":0}]
[null,null,"Whole Network",1401470]

{"sheet":"6.6 STPIS Customer Service","index":10,"n_rows":13,"n_cols":4,"rows_kept":13,"cut":false,"hidden":false,"merged":[[8,1,9,1]]}
[null,{"$f":"(LOOKUP(dms_Model,dms_Model_List,dms_Worksheet_List))","v":"REGULATORY REPORTING STATEMENT"}]
[null,{"$f":"dms_TradingName","v":"Energex"}]
[null,{"$f":"CONCATENATE(\"Annual Reporting RIN Response \",CRY)","v":"Annual Reporting RIN Response 2015-16"}]
[null,"6.6 STPIS CUSTOMER SERVICE"]
[]
[]
[null,"6.6.1 - TELEPHONE ANSWERING"]
[]
[null,null,"Number of calls \nafter removing excluded events","Total number of calls"]
[null,null,{"$f":"CRY","v":"2015-16"},{"$f":"CRY","v":"2015-16"}]
[null,"Number of calls received",82788,84713]
[null,"Number of calls answered within 30 seconds",75713]
[null,"Percentage of calls answered within 30 seconds",{"$f":"C12/C11","v":0.91454075469874863}]

{"sheet":"6.7 STPIS Daily Performance","index":11,"n_rows":381,"n_cols":16,"rows_kept":381,"cut":false,"hidden":false,"merged":[[13,14,13,15],[13,3,14,3],[6,1,6,5],[8,1,8,6],[13,4,13,5],[13,6,13,7],[13,10,13,11],[13,8,13,9],[13,12,13,13],[12,1,14,1],[12,2,12,3],[13,2,14,2],[12,4,12,13]]}
[null,{"$f":"(LOOKUP(dms_Model,dms_Model_List,dms_Worksheet_List))","v":"REGULATORY REPORTING STATEMENT"},null,null,null,null,null,null,{"$f":"CONCATENATE(IF(LEN(CRY)=4,\"1-Jan-\",\"1-Jul-\"),LEFT(CRY,4))","v":"1-Jul-2015"}]
[null,{"$f":"dms_TradingName","v":"Energex"}]
[null,{"$f":"CONCATENATE(\"Annual Reporting RIN Response \",CRY)","v":"Annual Reporting RIN Response 2015-16"}]
[null,"6.7 STPIS DAILY PERFORMANCE"]
[]
[]
[null,"Did the MAIFI parameter of the STPIS apply during the period?\nThis flag is set from the response on worksheet 3.6.8 Network feeders",null,null,null,null,{"$f":"dms_MAIFI_Flag","v":"No"}]
[]
[null,"The excluded events to be removed from the data refer only to events listed in clause 3.3(a) of the STPIS, with respect to reliability data, and in clause 5.4 of the STPIS with respect to customer service parameters.\n\n*Customer service information must be reported as per the definitions in the STPIS, that is excluding: \n   • calls to payment lines and automated interactive services \n   • calls abandoned by the customer within 30 seconds of the call being queued for response by a human operator (where the time in which a telephone call is abandoned is not measured, then an estimate of the number of calls abandoned within 30 seconds will be determined by taking 20 per cent of all calls abandoned)."]
[]
[null,"6.7.1 - DAILY PERFORMANCE DATA - UNPLANNED"]
[]
[null,"Date","Customer service*",null,"MAIFI"]
[null,null,"Number of calls received\n(after removing excluded events)","Number of calls answered in 30 seconds\n(after removing excluded events)",{"$f":"INDEX(dms_FeederName_1,MATCH(dms_TradingName,dms_TradingName_List))","v":"CBD"},null,{"$f":"INDEX(dms_FeederName_2,MATCH(dms_TradingName,dms_TradingName_List))","v":"Urban"},null,{"$f":"INDEX(dms_FeederName_3,MATCH(dms_TradingName,dms_TradingName_List))","v":"Short rural"},null,{"$f":"INDEX(dms_FeederName_4,MATCH(dms_TradingName,dms_TradingName_List))","v":"Long rural"},null,{"$f":"IF((INDEX(dms_FeederName_5,MATCH(dms_TradingName,dms_TradingName_List))=0),\"Network\",(INDEX(dms_FeederName_5,MATCH(dms_TradingName,dms_TradingName_List))))","v":"Network"},null,"Network"]
[null,null,null,null,"All events","After removing excluded events","All events","After removing excluded events","All events","After removing excluded events","All events","After removing excluded events","All events","After removing excluded events","All events","After removing excluded events"]
[null,{"$f":"CONCATENATE(IF(LEN(CRY)=4,\"1-Jan-\",\"1-Jul-\"),LEFT(CRY,4))","v":"1-Jul-2015"},229,225]
[null,{"$f":"B16+1","v":"2015-07-02"},207,195]
[null,"2015-07-03",231,197]
[null,"2015-07-04",138,133]
[null,"2015-07-05",97,92]
[null,"2015-07-06",189,189]
[null,"2015-07-07",188,184]
[null,"2015-07-08",212,205]
[null,"2015-07-09",209,208]
[null,"2015-07-10",192,187]
[null,"2015-07-11",150,144]
[null,"2015-07-12",228,196]
[null,"2015-07-13",350,334]
[null,"2015-07-14",286,271]
[null,"2015-07-15",337,280]
[null,"2015-07-16",308,282]
[null,"2015-07-17",617,592]
[null,"2015-07-18",251,186]
[null,"2015-07-19",156,128]
[null,"2015-07-20",311,300]
[null,"2015-07-21",240,232]
[null,"2015-07-22",231,216]
[null,"2015-07-23",298,292]
[null,"2015-07-24",212,202]
[null,"2015-07-25",163,152]
[null,"2015-07-26",160,140]
[null,"2015-07-27",205,201]
[null,"2015-07-28",297,266]
[null,"2015-07-29",212,207]
[null,"2015-07-30",220,210]
[null,"2015-07-31",182,169]
[null,"2015-08-01",147,137]
[null,"2015-08-02",111,101]
[null,"2015-08-03",204,199]
[null,"2015-08-04",172,166]
[null,"2015-08-05",158,153]
[null,"2015-08-06",163,160]
[null,"2015-08-07",222,211]
[null,"2015-08-08",121,106]
[null,"2015-08-09",99,95]
[null,"2015-08-10",176,175]
[null,"2015-08-11",181,176]
[null,"2015-08-12",297,289]
[null,"2015-08-13",238,225]
[null,"2015-08-14",133,127]
[null,"2015-08-15",204,178]
[null,"2015-08-16",92,92]
[null,"2015-08-17",198,186]
[null,"2015-08-18",168,158]
[null,"2015-08-19",184,173]
[null,"2015-08-20",194,179]
[null,"2015-08-21",160,149]
[null,"2015-08-22",135,131]
[null,"2015-08-23",86,82]
[null,"2015-08-24",183,178]
[null,"2015-08-25",212,204]
[null,"2015-08-26",140,138]
[null,"2015-08-27",147,141]
[null,"2015-08-28",206,204]
[null,"2015-08-29",164,137]
[null,"2015-08-30",161,135]
[null,"2015-08-31",250,245]
[null,"2015-09-01",163,159]
[null,"2015-09-02",181,170]
[null,"2015-09-03",336,317]
[null,{"$f":"B80+1","v":"2015-09-04"},225,211]
[null,"2015-09-05",113,111]
[null,"2015-09-06",86,85]
[null,"2015-09-07",196,195]
[null,"2015-09-08",238,224]
[null,"2015-09-09",205,196]
[null,"2015-09-10",174,170]
[null,"2015-09-11",253,243]
[null,"2015-09-12",356,277]
[null,"2015-09-13",140,129]
[null,"2015-09-14",178,169]
[null,"2015-09-15",163,155]
[null,"2015-09-16",217,206]
[null,"2015-09-17",238,212]
[null,"2015-09-18",233,221]
[null,"2015-09-19",149,140]
[null,"2015-09-20",67,66]
[null,"2015-09-21",236,224]
[null,"2015-09-22",219,210]
[null,"2015-09-23",195,186]
[null,"2015-09-24",127,124]
[null,"2015-09-25",159,152]
[null,"2015-09-26",148,135]
[null,"2015-09-27",223,199]
[null,"2015-09-28",245,240]
[null,"2015-09-29",348,313]
[null,"2015-09-30",229,220]
[null,"2015-10-01",200,188]
[null,"2015-10-02",194,186]
[null,"2015-10-03",132,123]
[null,"2015-10-04",123,123]
[null,"2015-10-05",122,114]
[null,"2015-10-06",226,224]
[null,"2015-10-07",182,169]
[null,"2015-10-08",271,264]
[null,"2015-10-09",195,190]
[null,"2015-10-10",141,125]
[null,"2015-10-11",75,67]
[null,"2015-10-12",201,195]
[null,"2015-10-13",227,221]
[null,"2015-10-14",380,370]
[null,"2015-10-15",161,159]
[null,"2015-10-16",175,159]
[null,"2015-10-17",155,151]
[null,"2015-10-18",96,85]
[null,"2015-10-19",193,193]
[null,"2015-10-20",174,155]
[null,"2015-10-21",179,170]
[null,"2015-10-22",490,436]
[null,"2015-10-23",236,228]
[null,"2015-10-24",154,148]
[null,"2015-10-25",68,66]
[null,"2015-10-26",250,244]
[null,"2015-10-27",461,434]
[null,"2015-10-28",371,353]
[null,"2015-10-29",245,233]
[null,"2015-10-30",205,204]
[null,"2015-10-31",166,141]
[null,"2015-11-01",147,140]
[null,"2015-11-02",225,212]
[null,"2015-11-03",250,231]
[null,"2015-11-04",314,301]
[null,"2015-11-05",281,263]
[null,"2015-11-06",357,312]
[null,{"$f":"B144+1","v":"2015-11-07"},418,323]
[null,"2015-11-08",242,209]
[null,"2015-11-09",310,293]
[null,"2015-11-10",251,245]
[null,"2015-11-11",159,158]
[null,"2015-11-12",179,175]
[null,"2015-11-13",173,166]
[null,"2015-11-14",469,375]
[null,"2015-11-15",200,172]
[null,"2015-11-16",217,212]
[null,"2015-11-17",267,255]
[null,"2015-11-18",209,198]
[null,"2015-11-19",227,222]
[null,"2015-11-20",245,234]
[null,"2015-11-21",278,243]
[null,"2015-11-22",129,114]
[null,"2015-11-23",402,361]
[null,"2015-11-24",272,270]
[null,"2015-11-25",328,298]
[null,"2015-11-26",234,219]
[null,"2015-11-27",247,237]
[null,"2015-11-28",154,144]
[null,"2015-11-29",0,0]
[null,"2015-11-30",688,584]
[null,"2015-12-01",376,346]
[null,"2015-12-02",240,232]
[null,"2015-12-03",323,304]
[null,"2015-12-04",239,223]
[null,"2015-12-05",131,115]
[null,"2015-12-06",107,100]
[null,"2015-12-07",236,220]
[null,"2015-12-08",214,186]
[null,"2015-12-09",281,261]
[null,"2015-12-10",0,0]
[null,"2015-12-11",809,714]
[null,"2015-12-12",243,205]
[null,"2015-12-13",205,185]
[null,"2015-12-14",235,231]
[null,"2015-12-15",231,225]
[null,"2015-12-16",266,244]
[null,"2015-12-17",234,222]
[null,"2015-12-18",199,193]
[null,"2015-12-19",152,135]
[null,"2015-12-20",90,87]
[null,"2015-12-21",303,281]
[null,"2015-12-22",179,177]
[null,"2015-12-23",224,217]
[null,"2015-12-24",273,256]
[null,"2015-12-25",89,85]
[null,"2015-12-26",102,101]
[null,"2015-12-27",171,171]
[null,"2015-12-28",140,130]
[null,"2015-12-29",150,148]
[null,"2015-12-30",196,191]
[null,"2015-12-31",128,126]
[null,"2016-01-01",123,115]
[null,"2016-01-02",124,120]
[null,"2016-01-03",128,122]
[null,"2016-01-04",264,262]
[null,"2016-01-05",307,284]
[null,"2016-01-06",278,262]
[null,"2016-01-07",224,204]
[null,"2016-01-08",195,187]
[null,"2016-01-09",124,106]
[null,{"$f":"B208+1","v":"2016-01-10"},131,125]
[null,"2016-01-11",221,198]
[null,"2016-01-12",307,276]
[null,"2016-01-13",194,186]
[null,"2016-01-14",289,273]
[null,"2016-01-15",270,249]
[null,"2016-01-16",248,194]
[null,"2016-01-17",136,121]
[null,"2016-01-18",218,214]
[null,"2016-01-19",235,230]
[null,"2016-01-20",259,242]
[null,"2016-01-21",189,187]
[null,"2016-01-22",276,264]
[null,"2016-01-23",317,254]
[null,"2016-01-24",174,157]
[null,"2016-01-25",235,227]
[null,"2016-01-26",168,144]
[null,"2016-01-27",203,193]
[null,"2016-01-28",300,278]
[null,"2016-01-29",938,849]
[null,"2016-01-30",614,481]
[null,"2016-01-31",411,333]
[null,"2016-02-01",618,476]
[null,"2016-02-02",571,411]
[null,"2016-02-03",411,369]
[null,"2016-02-04",368,354]
[null,"2016-02-05",285,275]
[null,"2016-02-06",226,204]
[null,"2016-02-07",119,116]
[null,"2016-02-08",285,269]
[null,"2016-02-09",319,293]
[null,"2016-02-10",282,261]
[null,"2016-02-11",185,171]
[null,"2016-02-12",207,190]
[null,"2016-02-13",188,152]
[null,"2016-02-14",126,120]
[null,"2016-02-15",271,251]
[null,"2016-02-16",275,252]
[null,"2016-02-17",264,237]
[null,"2016-02-18",302,273]
[null,"2016-02-19",288,261]
[null,"2016-02-20",270,226]
[null,"2016-02-21",147,140]
[null,"2016-02-22",214,199]
[null,"2016-02-23",395,317]
[null,"2016-02-24",277,237]
[null,"2016-02-25",231,209]
[null,"2016-02-26",247,238]
[null,"2016-02-27",179,165]
[null,"2016-02-28",132,124]
[null,"2016-02-29",233,224]
[null,"2016-03-01",312,280]
[null,"2016-03-02",334,301]
[null,"2016-03-03",294,279]
[null,"2016-03-04",256,242]
[null,"2016-03-05",144,134]
[null,"2016-03-06",135,122]
[null,"2016-03-07",238,225]
[null,"2016-03-08",216,204]
[null,"2016-03-09",226,207]
[null,"2016-03-10",246,213]
[null,"2016-03-11",272,241]
[null,"2016-03-12",193,151]
[null,"2016-03-13",206,195]
[null,{"$f":"B272+1","v":"2016-03-14"},254,246]
[null,"2016-03-15",206,196]
[null,"2016-03-16",201,189]
[null,"2016-03-17",261,250]
[null,"2016-03-18",270,236]
[null,"2016-03-19",326,272]
[null,"2016-03-20",146,141]
[null,"2016-03-21",257,246]
[null,"2016-03-22",205,187]
[null,"2016-03-23",191,176]
[null,"2016-03-24",275,255]
[null,"2016-03-25",143,138]
[null,"2016-03-26",145,133]
[null,"2016-03-27",123,115]
[null,"2016-03-28",126,114]
[null,"2016-03-29",219,198]
[null,"2016-03-30",233,184]
[null,"2016-03-31",152,139]
[null,"2016-04-01",202,174]
[null,"2016-04-02",137,129]
[null,"2016-04-03",101,95]
[null,"2016-04-04",167,156]
[null,"2016-04-05",237,216]
[null,"2016-04-06",183,178]
[null,"2016-04-07",160,159]
[null,"2016-04-08",170,166]
[null,"2016-04-09",114,111]
[null,"2016-04-10",82,79]
[null,"2016-04-11",199,193]
[null,"2016-04-12",214,187]
[null,"2016-04-13",207,183]
[null,"2016-04-14",187,168]
[null,"2016-04-15",174,162]
[null,"2016-04-16",126,112]
[null,"2016-04-17",86,83]
[null,"2016-04-18",175,162]
[null,"2016-04-19",182,173]
[null,"2016-04-20",255,249]
[null,"2016-04-21",121,108]
[null,"2016-04-22",178,163]
[null,"2016-04-23",144,137]
[null,"2016-04-24",128,123]
[null,"2016-04-25",118,112]
[null,"2016-04-26",257,248]
[null,"2016-04-27",214,206]
[null,"2016-04-28",248,228]
[null,"2016-04-29",257,220]
[null,"2016-04-30",252,221]
[null,"2016-05-01",242,211]
[null,"2016-05-02",168,152]
[null,"2016-05-03",278,235]
[null,"2016-05-04",183,168]
[null,"2016-05-05",196,154]
[null,"2016-05-06",172,156]
[null,"2016-05-07",113,110]
[null,"2016-05-08",70,63]
[null,"2016-05-09",227,194]
[null,"2016-05-10",264,245]
[null,"2016-05-11",237,199]
[null,"2016-05-12",193,174]
[null,"2016-05-13",158,139]
[null,"2016-05-14",175,154]
[null,"2016-05-15",147,136]
[null,"2016-05-16",256,214]
[null,{"$f":"B336+1","v":"2016-05-17"},168,152]
[null,"2016-05-18",168,158]
[null,"2016-05-19",226,221]
[null,"2016-05-20",163,163]
[null,"2016-05-21",113,107]
[null,"2016-05-22",88,88]
[null,"2016-05-23",270,253]
[null,"2016-05-24",194,184]
[null,"2016-05-25",244,234]
[null,"2016-05-26",168,164]
[null,"2016-05-27",243,240]
[null,"2016-05-28",177,158]
[null,"2016-05-29",94,90]
[null,"2016-05-30",216,212]
[null,"2016-05-31",204,204]
[null,"2016-06-01",221,214]
[null,"2016-06-02",220,205]
[null,"2016-06-03",255,228]
[null,"2016-06-04",817,590]
[null,"2016-06-05",721,436]
[null,"2016-06-06",579,539]
[null,"2016-06-07",262,253]
[null,"2016-06-08",356,304]
[null,"2016-06-09",210,206]
[null,"2016-06-10",209,204]
[null,"2016-06-11",148,125]
[null,"2016-06-12",131,123]
[null,"2016-06-13",305,301]
[null,"2016-06-14",218,211]
[null,"2016-06-15",157,151]
[null,"2016-06-16",214,209]
[null,"2016-06-17",195,189]
[null,"2016-06-18",125,105]
[null,"2016-06-19",443,335]
[null,"2016-06-20",492,438]
[null,"2016-06-21",317,305]
[null,"2016-06-22",198,185]
[null,"2016-06-23",263,256]
[null,"2016-06-24",0,0]
[null,"2016-06-25",793,508]
[null,"2016-06-26",205,183]
[null,"2016-06-27",275,259]
[null,"2016-06-28",340,307]
[null,"2016-06-29",227,217]
[null,"2016-06-30",244,235]

{"sheet":"6.8 STPIS Exclusions","index":12,"n_rows":44,"n_cols":15,"rows_kept":44,"cut":false,"hidden":false,"merged":[[10,11,11,11],[6,1,6,4],[10,6,10,8],[10,5,11,5],[10,4,11,4],[10,2,11,2],[10,3,11,3]]}
[null,{"$f":"(LOOKUP(dms_Model,dms_Model_List,dms_Worksheet_List))","v":"REGULATORY REPORTING STATEMENT"}]
[null,{"$f":"dms_TradingName","v":"Energex"}]
[null,{"$f":"CONCATENATE(\"Annual Reporting RIN Response \",CRY)","v":"Annual Reporting RIN Response 2015-16"}]
[null,"6.8 STPIS EXCLUSIONS"]
[]
[]
[null,{"$f":"CONCATENATE(\"This information is collected to inform the application of the STPIS to \",dms_TradingName,\" in future regulatory periods. The information is also collected to monitor network performance, and may be used in performance reports.\")","v":"This information is collected to inform the application of the STPIS to Energex in future regulatory periods. The information is also collected to monitor network performance, and may be used in performance reports."}]
[]
[null,"6.8.1 - STPIS EXCLUSIONS"]
[]
[null,"Date of event","Outage ID","Feeder ID / name","Feeder classification\n(drop down)","Cause of event\n(drop down)","Unplanned",null,null,"Event category","Effect on unplanned MAIFI","Please provide separate explanation to confirm the outage was not due to inadequate transmission connection planning "]
[null,"DD/MM/YYYY",null,null,null,null,"Number of  interruptions","Duration of interruption\n(mins)","Total unplanned minutes off supply","Use exclusion categories listed in section 3.3(a) of the STPIS\n(drop down)","by feeder classification",null,null,null,"Cause of Event"]
[null,null,null,null,null,null,null,null,null,null,null,null,null,null,"Weather"]
[null,null,null,null,null,null,null,null,null,null,null,null,null,null,"Equipment failure"]
[null,null,null,null,null,null,null,null,null,null,null,null,null,null,"Operational error"]
[null,null,null,null,null,null,null,null,null,null,null,null,null,null,"Vegetation"]
[null,null,null,null,null,null,null,null,null,null,null,null,null,null,"Animals"]
[null,null,null,null,null,null,null,null,null,null,null,null,null,null,"Third party impacts"]
[null,null,null,null,null,null,null,null,null,null,null,null,null,null,"Transmission failure"]
[null,null,null,null,null,null,null,null,null,null,null,null,null,null,"Load shedding"]
[null,null,null,null,null,null,null,null,null,null,null,null,null,null,"Inter-distributor connection failure"]
[null,null,null,null,null,null,null,null,null,null,null,null,null,null,"Other"]
[]
[]
[]
[]
[]
[]
[]
[]
[]
[]
[]
[]
[]
[]
[]
[]
[]
[]
[]
[]
[]
[null,"To enter further events - please insert new lines above this line. "]

{"sheet":"6.9 STPIS - GSL","index":13,"n_rows":102,"n_cols":5,"rows_kept":102,"cut":false,"hidden":false,"merged":[[64,1,64,2],[54,1,54,2],[55,1,55,2],[56,1,56,2],[61,1,61,2],[60,1,60,2],[59,1,59,2],[17,1,17,2],[15,1,15,2],[5,1,5,2],[7,1,7,2],[14,1,14,2],[16,1,16,2],[20,1,20,2],[22,1,22,2],[23,1,23,2],[24,1,24,2],[21,1,21,2],[27,1,27,2],[31,1,31,2],[32,1,32,2],[28,1,28,2],[29,1,29,2],[30,1,30,2],[33,1,33,2],[34,1,34,2],[35,1,35,2],[36,1,36,2],[37,1,37,2],[40,1,40,2],[42,1,42,2],[43,1,43,2],[44,1,44,2],[41,1,41,2],[85,1,85,2],[86,1,86,2],[45,1,45,2],[46,1,46,2],[71,1,71,2],[70,1,70,2],[77,1,77,2],[49,1,49,2],[50,1,50,2],[51,1,51,2],[53,1,53,4],[58,1,58,4],[63,1,63,4],[68,1,68,4],[66,1,66,2],[65,1,65,2],[5,4,5,5],[101,1,101,2],[69,1,69,2],[98,1,98,2],[100,1,100,2],[93,1,93,2],[94,1,94,2],[95,1,95,2],[96,1,96,2],[88,1,88,2],[89,1,89,2],[90,1,90,2],[91,1,91,2],[92,1,92,2],[83,1,83,2],[84,1,84,2]]}
[null,{"$f":"(LOOKUP(dms_Model,dms_Model_List,dms_Worksheet_List))","v":"REGULATORY REPORTING STATEMENT"}]
[null,{"$f":"dms_TradingName","v":"Energex"}]
[null,{"$f":"CONCATENATE(\"Annual Reporting RIN Response \",CRY)","v":"Annual Reporting RIN Response 2015-16"}]
[null,"6.9 STPIS - GUARANTEED SERVICE LEVEL"]
[]
[null,"Did the AER's GSL Scheme apply at any time during the regulatory year?",null,"No","**IMPORTANT \nPlease ensure this flag is set. Conditional formatting on this worksheet is dependant on this response."]
[]
[null,"Instructions:\nTable 6.9.1 collects information relating to jurisdiction GSL scheme parameters. These parameters can be found in the jurisdictonal scheme relevant to NSP. Please identify each parameter in the relevant sub-tables and provide the volume and value of GSL payments. \n\nFor GSL parameters that do not fit within the provided sub-tables provided, please enter a heading and identify the relevant parameter(s). "]
[]
[null,"6.9.1 - GUARANTEED SERVICE LEVELS - JURISDICTIONAL GSL SCHEME"]
[null,null,null,{"$f":"CRY","v":"2015-16"},{"$f":"CRY","v":"2015-16"}]
[null,null,null,"Volume","Value of GSL payments"]
[null,null,null,"0's","$0's"]
[null,"Appointments"]
[null,"Not attending at or within the specified timeframe",null,244,13803]
[null,"Not attending at or within the specified timeframe - Retailer Error",null,8,451]
[]
[]
[null,"To enter further GSL parameters relating to appointments - please copy a row from above and \"insert copied cells\" above this row."]
[null,"Connections"]
[null,"Connections not completed within either 5 business days or a date specified with the customer",null,36,4322]
[]
[]
[]
[]
[null,"To enter further GSL parameters relating to connections -  please copy a row from above and \"insert copied cells\" above this row."]
[null,"Reliability of supply"]
[null,"Reliability Duration - more than 8 hours on CBD, or 18 for an urban feeder or short rural feeder",null,6110,696500]
[null,"Reliability Frequency - 10 or more intteruptions for a CBD or urban feeder, or 16 for a short rural feeder",null,0,0]
[]
[]
[]
[]
[]
[]
[]
[]
[]
[null,"To enter further GSL parameters relating to reliability of supply -  please copy a row from above and \"insert copied cells\" above this row."]
[null,"Street lights"]
[]
[]
[]
[]
[]
[]
[]
[null,"To enter further GSL parameters relating to street lights -  please copy a row from above and \"insert copied cells\" above this row."]
[null,"Planned interruptions"]
[null,"Planned interruptions - 4 business days notice not given (Residential)",null,1448,40354]
[null,"Planned interruptions - 4 business days notice not given (Business)",null,144,9963]
[]
[null,"To enter further GSL parameters relating to planned interruptions -  please copy a row from above and \"insert copied cells\" above this row."]
[null,"Hot Water"]
[null,"Not attending by the end of the next business day",null,1,171]
[]
[]
[null,"To enter further GSL parameters - please identify the parameter and if insufficient rows  please copy a row from above and \"insert copied cells\" above this row."]
[null,"Wrongful Disconnections"]
[null,"Customer disconnected in error",null,79,11216]
[null,"Customer disconnected in error - Retailer Error",null,30,4058]
[]
[null,"To enter further GSL parameters - please identify the parameter and if insufficient rows  please copy a row from above and \"insert copied cells\" above this row."]
[null,"Reconnection"]
[null,"Failiure to reconnect a premise within specified timeframes",null,44,4234]
[null,"Failiure to reconnect a premise within specified timeframes - Retailer Error",null,94,10300]
[]
[null,"To enter further GSL parameters - please identify the parameter and if insufficient rows  please copy a row from above and \"insert copied cells\" above this row."]
[null,"<NSP defined parameter category>"]
[]
[]
[]
[null,"To enter further GSL parameters - please identify the parameter and if insufficient rows  please copy a row from above and \"insert copied cells\" above this row."]
[]
[]
[null,"6.9.2 - GUARANTEED SERVICE LEVELS - AER GSL SCHEME"]
[]
[null,"Complete Table 6.9.2 if the AER's GSL scheme applied at any time during the regulatory year. \n\nDo not complete Table 6.9.2 if the AER's GSL scheme did not apply during the regulatory year."]
[]
[null,null,null,{"$f":"CRY","v":"2015-16"},{"$f":"CRY","v":"2015-16"}]
[null,null,null,"Volume","Value \nof GSL payments"]
[null,null,null,"0's","$0's"]
[null,"New connections "]
[null,"Number of connections made"]
[null,"Number of connections not made on or before the day agreed"]
[null,"Connections - GSL payments – 1-6 day delay"]
[null,"Connections - GSL payments – 7+ day delay"]
[null,"Reliability of supply"]
[null,"Frequency of interruptions – CBD feeders – 9 interruptions"]
[null,"Frequency of interruptions – Urban feeders – 9 interruptions"]
[null,"Frequency of interruptions – Rural (short and long) feeders – 15 interruptions"]
[null,"Interruptions – CBD feeders – 12 hours duration"]
[null,"Interruptions – Urban feeders – 12 hours duration"]
[null,"Interruptions – Rural (short and long) feeders – 18 hours duration"]
[null,"Total duration of interruptions Level 1 – 20 hours"]
[null,"Total duration of interruptions Level 2 – 30 hours"]
[null,"Total duration of interruptions Level 3 – 60 hours"]
[null,"Street lights"]
[null,"Streetlight repair 5 days – GSL payments"]
[null,"Planned interruptions"]
[null,"Notice of planned interruptions – 4 business days notice not given"]
[null,"Total ",null,null,{"$f":"SUM(E101,E99,E89:E97,E86:E87)","v":0}]

{"sheet":"7.8 Avoided TUOS Payments","index":14,"n_rows":11,"n_cols":3,"rows_kept":11,"cut":false,"hidden":false,"merged":[[6,1,7,1]]}
[null,{"$f":"(LOOKUP(dms_Model,dms_Model_List,dms_Worksheet_List))","v":"REGULATORY REPORTING STATEMENT"}]
[null,{"$f":"dms_TradingName","v":"Energex"}]
[null,{"$f":"CONCATENATE(\"Annual Reporting RIN Response \",CRY)","v":"Annual Reporting RIN Response 2015-16"}]
[null,"7.8 - AVOIDED TUOS PAYMENTS"]
[]
[null,"7.8.1 - AVOIDED TUOS PAYMENTS"]
[null,"Description","Avoided TUOS Payment "]
[null,null,"$0's, nominal"]
[null,"Embedded generators",496413.81]
[null,"Market network service providers"]
[null,"Other"]

{"sheet":"7.10 Juris Scheme","index":15,"n_rows":17,"n_cols":6,"rows_kept":17,"cut":false,"hidden":false,"merged":[[8,4,9,4],[8,3,9,3],[8,2,9,2],[8,1,9,1],[5,1,5,2]]}
[null,{"$f":"(LOOKUP(dms_Model,dms_Model_List,dms_Worksheet_List))","v":"REGULATORY REPORTING STATEMENT"}]
[null,{"$f":"dms_TradingName","v":"Energex"}]
[null,{"$f":"CONCATENATE(\"Annual Reporting RIN Response \",CRY)","v":"Annual Reporting RIN Response 2015-16"}]
[null,"7.10 - JURISDICTIONAL SCHEMES"]
[]
[null,"Instructions\nBusiness must list each relevant jurisdictional scheme individually and report information for each scheme separately from other schemes."]
[]
[null,"7.10.1 - JURISDICTIONAL SCHEME PAYMENTS"]
[null,"Jurisdictional Scheme Name","Description","Date DNSP Became Subject to Scheme","Description of Cost Recovery Method","Total Scheme Payments  "]
[null,null,null,null,null,"$0's, nominal"]
[null,"Solar PV","Feed In Tariff Payment",42186,"DUOS Tariff",186933987.80000001]
[null,"Australian Energy Market Commission (AEMC) Levy","AEMC Recovery Funding",42486,"DUOS Tariff",144409]
[]
[]
[]
[]
[null,null,null,null,"Total",{"$f":"SUM(F11:F16)","v":187078396.80000001}]

{"sheet":"7.11 DMIS-DMIA","index":16,"n_rows":17,"n_cols":5,"rows_kept":17,"cut":false,"hidden":false,"merged":[[14,5,14,7],[6,1,7,1],[6,5,7,7],[6,2,6,4],[13,5,13,7],[9,5,9,7],[10,5,10,7],[11,5,11,7],[12,5,12,7],[8,2,8,4]]}
[null,{"$f":"(LOOKUP(dms_Model,dms_Model_List,dms_Worksheet_List))","v":"REGULATORY REPORTING STATEMENT"}]
[null,{"$f":"dms_TradingName","v":"Energex"}]
[null,{"$f":"CONCATENATE(\"Annual Reporting RIN Response \",CRY)","v":"Annual Reporting RIN Response 2015-16"}]
[null,"7.11 - DEMAND MANAGEMENT INCENTIVE SCHEME"]
[]
[null,"7.11.1 - DMIA - PROJECTS SUBMITTED FOR APPROVAL"]
[null,"Name of project",{"$f":"CONCATENATE(\"Total amount of the DMIA spent in \", CRY)","v":"Total amount of the DMIA spent in 2015-16"}]
[null,null,"Operating expenditure","Capital expenditure","Total"]
[null,null,"$0's, nominal"]
[null,"Battery Energy Storage System Trial",52679.83,154371.95000000001,{"$f":"SUM(C10:D10)","v":207051.78000000003}]
[null,"LV System Static-State Estimation Project",5432.03,null,5432.03]
[null,"Real Time Tariff Study Project",9090.36,null,9090.36]
[null,"Sml Business Customer Load Profile Project",250832.61,null,250832.61]
[null,null,null,null,0]
[null,null,null,null,{"$f":"SUM(C15:D15)","v":0}]
[null,"To enter additional projects - please copy a row from above and \"insert copied cells\" above this row. "]
[null,"Total",{"$f":"SUM(C10:C16)","v":318034.82999999996},{"$f":"SUM(D10:D16)","v":154371.95000000001},{"$f":"SUM(E10:E16)","v":472406.78}]

{"sheet":"7.12 Safety and Bushfire","index":17,"n_rows":340,"n_cols":10,"rows_kept":340,"cut":false,"hidden":false,"merged":[[139,1,139,2],[140,1,140,2],[141,1,141,2],[142,1,142,2],[143,1,143,2],[144,1,144,2],[203,6,203,7],[204,6,204,7],[205,6,205,7],[145,1,145,2],[206,6,206,7],[181,6,181,7],[182,6,182,7],[183,6,183,7],[184,6,184,7],[185,6,185,7],[186,6,186,7],[187,6,187,7],[188,6,188,7],[189,6,189,7],[117,1,118,2],[180,6,180,7],[306,6,306,7],[307,6,307,7],[118,3,118,5],[119,1,119,2],[120,1,120,2],[121,1,121,2],[122,1,122,2],[123,1,123,2],[124,1,124,2],[125,1,125,2],[126,1,126,2],[127,1,127,2],[128,1,128,2],[129,1,129,2],[130,1,130,2],[131,1,131,2],[132,1,132,2],[133,1,133,2],[134,1,134,2],[135,1,135,2],[136,1,136,2],[137,1,137,2],[138,1,138,2],[297,6,297,7],[298,6,298,7],[299,6,299,7],[300,6,300,7],[301,6,301,7],[302,6,302,7],[303,6,303,7],[275,6,275,7],[276,6,276,7],[282,6,282,7],[283,6,283,7],[284,6,284,7],[285,6,285,7],[286,6,286,7],[287,6,287,7],[280,6,280,7],[281,6,281,7],[266,6,266,7],[267,6,267,7],[268,6,268,7],[269,6,269,7],[270,6,270,7],[271,6,271,7],[304,6,304,7],[305,6,305,7],[288,6,288,7],[289,6,289,7],[290,6,290,7],[291,6,291,7],[292,6,292,7],[293,6,293,7],[294,6,294,7],[295,6,295,7],[296,6,296,7],[272,6,272,7],[273,6,273,7],[274,6,274,7],[257,6,257,7],[258,6,258,7],[259,6,259,7],[260,6,260,7],[261,6,261,7],[262,6,262,7],[263,6,263,7],[264,6,264,7],[265,6,265,7],[248,6,249,7],[250,6,250,7],[251,6,251,7],[252,6,252,7],[253,6,253,7],[254,6,254,7],[255,6,255,7],[256,6,256,7],[169,8,169,9],[170,8,170,9],[207,6,207,7],[190,6,190,7],[191,6,191,7],[192,6,192,7],[193,6,193,7],[194,6,194,7],[195,6,195,7],[196,6,196,7],[197,6,197,7],[198,6,198,7],[199,6,199,7],[200,6,200,7],[201,6,201,7],[202,6,202,7],[162,8,164,9],[171,8,171,9],[172,8,172,9],[166,8,166,9],[167,8,167,9],[71,6,71,7],[72,6,72,7],[73,6,73,7],[74,6,74,7],[75,6,75,7],[76,6,76,7],[77,6,77,7],[165,8,165,9],[168,8,168,9],[130,6,130,8],[131,6,131,8],[132,6,132,8],[127,6,127,8],[128,6,128,8],[129,6,129,8],[63,6,63,7],[64,6,64,7],[65,6,65,7],[66,6,66,7],[67,6,67,7],[50,6,50,7],[51,6,51,7],[52,6,52,7],[53,6,53,7],[54,6,54,7],[55,6,55,7],[56,6,56,7],[57,6,57,7],[58,6,58,7],[18,6,18,8],[19,6,19,8],[20,6,20,8],[21,6,21,8],[22,6,22,8],[42,6,42,8],[43,6,43,8],[44,6,44,8],[28,6,28,8],[29,6,29,8],[30,6,30,8],[31,6,31,8],[23,6,23,8],[24,6,24,8],[25,6,25,8],[26,6,26,8],[27,6,27,8],[40,6,40,8],[37,6,37,8],[41,6,41,8],[38,6,38,8],[39,6,39,8],[212,1,214,1],[212,2,214,2],[214,3,214,5],[82,9,84,9],[162,2,162,4],[162,5,162,7],[162,1,164,1],[164,5,164,7],[133,6,133,8],[134,6,134,8],[135,6,135,8],[136,6,136,8],[137,6,137,8],[138,6,138,8],[139,6,139,8],[140,6,140,8],[141,6,141,8],[142,6,142,8],[143,6,143,8],[144,6,144,8],[145,6,145,8],[212,9,214,9],[117,6,118,8],[121,6,121,8],[37,2,37,5],[5,1,5,2],[25,2,25,5],[26,2,26,5],[27,2,27,5],[28,2,28,5],[29,2,29,5],[30,2,30,5],[42,2,42,5],[31,2,31,5],[32,2,32,5],[14,1,14,4],[13,1,13,4],[33,2,33,5],[24,2,24,5],[17,2,17,5],[18,2,18,5],[19,2,19,5],[20,2,20,5],[21,2,21,5],[22,2,22,5],[23,2,23,5],[248,1,249,1],[248,2,249,2],[312,4,312,6],[10,1,10,2],[82,3,82,5],[82,1,84,1],[82,2,84,2],[11,1,11,2],[164,2,164,4],[84,3,84,5],[82,6,82,8],[84,6,84,8],[17,6,17,8],[32,6,32,8],[33,6,33,8],[34,2,34,5],[34,6,34,8],[35,2,35,5],[35,6,35,8],[36,2,36,5],[36,6,36,8],[249,3,249,5],[311,4,311,6],[43,2,43,5],[337,4,337,6],[338,4,338,6],[324,4,324,6],[313,4,313,6],[314,4,314,6],[315,4,315,6],[316,4,316,6],[317,4,317,6],[318,4,318,6],[325,4,325,6],[326,4,326,6],[321,4,321,6],[322,4,322,6],[323,4,323,6],[332,4,332,6],[333,4,333,6],[334,4,334,6],[336,4,336,6],[331,4,331,6],[335,4,335,6],[329,4,329,6],[330,4,330,6],[327,4,327,6],[328,4,328,6],[319,4,319,6],[320,4,320,6],[214,6,214,8],[212,3,212,5],[212,6,212,8],[40,2,40,5],[41,2,41,5],[38,2,38,5],[39,2,39,5],[119,6,119,8],[120,6,120,8],[44,2,44,5],[68,6,68,7],[69,6,69,7],[70,6,70,7],[122,6,122,8],[123,6,123,8],[124,6,124,8],[125,6,125,8],[126,6,126,8],[59,6,59,7],[60,6,60,7],[61,6,61,7],[62,6,62,7]]}
[null,{"$f":"(LOOKUP(dms_Model,dms_Model_List,dms_Worksheet_List))","v":"REGULATORY REPORTING STATEMENT"}]
[null,{"$f":"dms_TradingName","v":"Energex"}]
[null,{"$f":"CONCATENATE(\"Annual Reporting RIN Response \",CRY)","v":"Annual Reporting RIN Response 2015-16"}]
[null,"7.12 SAFETY AND BUSHFIRE RELATED EXPENDITURE"]
[]
[null,"These templates collect information from Victorian businesses only.\n\nBushfire and safety related expenditure information is used by the AER to monitor the expenditures throughout the regulatory control period."]
[]
[null,"CPI applied to convert expected expenditure in real $ to nominal based on lagged September CPI index"]
[]
[null,"Instructions"]
[null,"For \"Exclusive of Margins & Overheads\" reported expenditure is to EXCLUDE any overheads, profit margins or management fees paid directly or indirectly to related party contractors (not including actual incurred expense of the related party contractor) for the reporting period."]
[null,"For \"Value of Margins & Overheads\" reported expenditure is to COMPRISE ONLY the sum of overheads, profit margins or management fees paid directly or indirectly to related party contractors (not including actual incurred expenses of the related party contractor) for the reporting period. "]
[]
[null,{"$f":"CONCATENATE(dms_TradingName, \" is to specify each activity in this table in accordance with the definition in Appendix F of the RIN.\")","v":"Energex is to specify each activity in this table in accordance with the definition in Appendix F of the RIN."}]
[null,"All activities must be reported but the Reason for Difference is only required if there is a 10 per cent difference between the expected value and the actual value.\n\nUse median unit costs. Where unit costs are not recorded at the asset category level - provide the best estimates of the unit cost using the cost allocation method identified in this table. (As a transitional measure, the unit cost may be based on a statistically significant annual sample of actual work orders at a 5% or better confidence interval.)\n\nProvide basis of allocation where applicable."]
[]
[null,"7.12.1 - SAFETY AND BUSHFIRE RELATED ASSET GROUP DEFINITIONS AND ALLOCATION BASIS"]
[null,"Activity","Definitions",null,null,null,"Basis for allocation of cost to activity"]
[null,"Planned non-preferred services replacements"]
[null,"Planned replacement of non-preferred services due to height "]
[null,"Removal of public lighting switchwire "]
[null,"Replacement of existing SWER lines with 22kV overhead bare conductor "]
[null,"Installation of GFN and associated equipment at zone substations "]
[null,"Replacement of crossarms/insulator sets – pole top fire mitigation"]
[null,"Replacement of crossarms – based on age and condition "]
[null,"Replacement of poles – based on age and condition "]
[null,"Stake poles – based on age and condition "]
[null,"Replacement of undersized poles "]
[null,"Stake undersized poles"]
[null,"Replacement of overhead conductor – mainly steel "]
[null,"Service line clearance – overhead services requiring relocation "]
[null,"Service line clearance – overhead services requiring undergrounding "]
[null,"Replacement of 22kV distribution feeders with ABC/underground cabling"]
[null,"Replacement of SWER with covered carbon core conductor or equivalent"]
[null,"Replacement of SWER with ABC"]
[null,"Replacement of SWER with underground"]
[null,"Replacement of surge diverters (neptune configuration)"]
[null,"Replacement of surge diverters (single phase or three phase)"]
[]
[]
[]
[]
[]
[]
[]
[null,"To enter further activities - please copy row from above and \"insert copied cells\" into a row above this row. "]
[]
[null,"7.12.2 - BUSHFIRE RELATED"]
[]
[null,"7.12.2.1 - NUMBER OF ACTIVITIES"]
[null,"Activity","Units","AER expected number","Actual Number","Difference","Reasons for Difference"]
[null,"Planned non-preferred services replacements","number of services",null,null,{"$f":"D52-E52","v":0}]
[null,"Planned replacement of non-preferred services due to height ","number of services",null,null,{"$f":"D53-E53","v":0}]
[null,"Removal of public lighting switchwire ","number of spans removed",null,null,0]
[null,"Replacement of existing SWER lines with 22kV overhead bare conductor ","kms of SWER",null,null,0]
[null,"Installation of GFN and associated equipment at zone substations ","number of zone substations",null,null,{"$f":"D56-E56","v":0}]
[null,"Replacement of crossarms/insulator sets – pole top fire mitigation","number of crossarms/sets",null,null,0]
[null,"Replacement of crossarms – based on age and condition ","number of crossarms",null,null,0]
[null,"Replacement of poles – based on age and condition ","number of poles",null,null,0]
[null,"Stake poles – based on age and condition ","number of poles",null,null,0]
[null,"Replacement of undersized poles ","number of poles",null,null,0]
[null,"Stake undersized poles","number of poles",null,null,0]
[null,"Replacement of overhead conductor – mainly steel ","kms ",null,null,0]
[null,"Service line clearance – overhead services requiring relocation ","number of services",null,null,0]
[null,"Service line clearance – overhead services requiring undergrounding ","number of services",null,null,0]
[null,"Replacement of 22kV distribution feeders with ABC/underground cabling","number of feeders",null,null,0]
[null,"Replacement of SWER with covered carbon core conductor or equivalent","kms ",null,null,0]
[null,"Replacement of SWER with ABC","kms ",null,null,0]
[null,"Replacement of SWER with underground","kms ",null,null,0]
[null,"Replacement of surge diverters (neptune configuration)","number of units",null,null,{"$f":"D70-E70","v":0}]
[null,"Replacement of surge diverters (single phase or three phase)","number of units",null,null,0]
[null,{"$f":"IF(ISBLANK(B39),\"\",B39)","v":""},null,null,null,{"$f":"D72-E72","v":0}]
[null,{"$f":"IF(ISBLANK(B40),\"\",B40)","v":""},null,null,null,0]
[null,"",null,null,null,0]
[null,"",null,null,null,0]
[null,"",null,null,null,0]
[null,"",null,null,null,0]
[null,"",null,null,null,0]
[null,"To enter further activities - please copy row from above and \"insert copied cells\" into a row above this row. "]
[]
[]
[null,"7.12.2.2 - EXPENDITURE "]
[null,"Activity","Units","Exclusive of Margins & Overheads",null,null,"Value of Margins & Overheads",null,null,"Reasons for Difference"]
[null,null,null,"AER expected expenditure ","Actual expenditure","Difference  ","AER expected expenditure ","Actual expenditure","Difference  "]
[null,null,null,"$0's, Nominal",null,null,"$0's, Nominal"]
[null,"Planned non-preferred services replacements","number of services",null,null,{"$f":"D86*$C$8-E86","v":0},null,null,{"$f":"G86*$C$8-H86","v":0}]
[null,"Planned replacement of non-preferred services due to height ","number of services",null,null,{"$f":"D87*$C$8-E87","v":0},null,null,{"$f":"G87*$C$8-H87","v":0}]
[null,"Removal of public lighting switchwire ","number of spans removed",null,null,0,null,null,0]
[null,"Replacement of existing SWER lines with 22kV overhead bare conductor ","kms of SWER",null,null,0,null,null,0]
[null,"Installation of GFN and associated equipment at zone substations ","number of zone substations",null,null,0,null,null,0]
[null,"Replacement of crossarms/insulator sets – pole top fire mitigation","number of crossarms/sets",null,null,0,null,null,0]
[null,"Replacement of crossarms – based on age and condition ","number of crossarms",null,null,0,null,null,0]
[null,"Replacement of poles – based on age and condition ","number of poles",null,null,0,null,null,0]
[null,"Stake poles – based on age and condition ","number of poles",null,null,0,null,null,0]
[null,"Replacement of undersized poles ","number of poles",null,null,0,null,null,0]
[null,"Stake undersized poles","number of poles",null,null,0,null,null,0]
[null,"Replacement of overhead conductor – mainly steel ","kms ",null,null,0,null,null,0]
[null,"Service line clearance – overhead services requiring relocation ","number of services",null,null,0,null,null,0]
[null,"Service line clearance – overhead services requiring undergrounding ","number of services",null,null,0,null,null,0]
[null,"Replacement of 22kV distribution feeders with ABC/underground cabling","number of feeders",null,null,0,null,null,0]
[null,"Replacement of SWER with covered carbon core conductor or equivalent","kms ",null,null,0,null,null,0]
[null,"Replacement of SWER with ABC","kms ",null,null,0,null,null,0]
[null,"Replacement of SWER with underground","kms ",null,null,0,null,null,0]
[null,"Replacement of surge diverters (neptune configuration)","number of units",null,null,0,null,null,0]
[null,"Replacement of surge diverters (single phase or three phase)","number of units",null,null,0,null,null,0]
[null,{"$f":"IF(ISBLANK(B39),\"\",B39)","v":""},{"$f":"IF(ISBLANK(C72),\"\",C72)","v":""},null,null,0,null,null,0]
[null,"","",null,null,{"$f":"D107*$C$8-E107","v":0},null,null,{"$f":"G107*$C$8-H107","v":0}]
[null,"","",null,null,0,null,null,0]
[null,"","",null,null,0,null,null,0]
[null,"","",null,null,0,null,null,0]
[null,"","",null,null,0,null,null,0]
[null,"","",null,null,0,null,null,0]
[null,"To enter further activities - please copy row from above and \"insert copied cells\" into a row above this row. "]
[]
[]
[]
[null,"7.12.2.3 - UNIT COSTS"]
[null,"Activity",null,"AER expected ","Actual","Difference","Reasons for Difference"]
[null,null,null,"$0's, Per Unit"]
[null,"Planned non-preferred services replacements",null,null,null,{"$f":"D120*$C$8-E120","v":0}]
[null,"Planned replacement of non-preferred services due to height ",null,null,null,0]
[null,"Removal of public lighting switchwire ",null,null,null,0]
[null,"Replacement of existing SWER lines with 22kV overhead bare conductor ",null,null,null,0]
[null,"Installation of GFN and associated equipment at zone substations ",null,null,null,0]
[null,"Replacement of crossarms/insulator sets – pole top fire mitigation",null,null,null,0]
[null,"Replacement of crossarms – based on age and condition ",null,null,null,0]
[null,"Replacement of poles – based on age and condition ",null,null,null,0]
[null,"Stake poles – based on age and condition ",null,null,null,0]
[null,"Replacement of undersized poles ",null,null,null,0]
[null,"Stake undersized poles",null,null,null,0]
[null,"Replacement of overhead conductor – mainly steel ",null,null,null,0]
[null,"Service line clearance – overhead services requiring relocation ",null,null,null,0]
[null,"Service line clearance – overhead services requiring undergrounding ",null,null,null,0]
[null,"Replacement of 22kV distribution feeders with ABC/underground cabling",null,null,null,0]
[null,"Replacement of SWER with covered carbon core conductor or equivalent",null,null,null,0]
[null,"Replacement of SWER with ABC",null,null,null,0]
[null,"Replacement of SWER with underground",null,null,null,0]
[null,"Replacement of surge diverters (neptune configuration)",null,null,null,0]
[null,"Replacement of surge diverters (single phase or three phase)",null,null,null,0]
[null,{"$f":"IF(ISBLANK(B39),\"\",B39)","v":""},null,null,null,0]
[null,"",null,null,null,0]
[null,"",null,null,null,0]
[null,"",null,null,null,0]
[null,"",null,null,null,0]
[null,"",null,null,null,0]
[null,"",null,null,null,0]
[null,"To enter further activities - please copy row from above and \"insert copied cells\" into a row above this row. "]
[]
[]
[null,"7.12.2.4 - CONTINGENT PROJECT APPLICATIONS - VOLUMES APPROVED"]
[null,"Activity","Units","Volume approved under contingent project applications ","Actual volumes","Difference"]
[null,null,null,null,null,{"$f":"E152-D152","v":0}]
[null,null,null,null,null,0]
[null,null,null,null,null,0]
[null,null,null,null,null,0]
[null,null,null,null,null,0]
[null,null,null,null,null,0]
[null,null,null,null,null,0]
[null,null,null,null,null,0]
[null,"To enter further activities - please copy row from above and \"insert copied cells\" into a row above this row. "]
[]
[null,"7.12.2.5 - CONTINGENT PROJECT APPLICATIONS - EXPENDITURE APPROVED"]
[null,"Activity","Exclusive of Margins & Overheads",null,null,"Value of Margins & Overheads",null,null,"Reasons for Difference"]
[null,null,"Expenditure approved under contingent project applications","Actual expenditure ","Difference","Expenditure approved under contingent project applications","Actual expenditure","Difference"]
[null,null,"$0's, Nominal",null,null,"$0's, Nominal"]
[null,{"$f":"IF(ISBLANK(B152),\"\",B152)","v":""},null,null,{"$f":"C166-D166","v":0},null,null,{"$f":"F166-G166","v":0}]
[null,{"$f":"IF(ISBLANK(B153),\"\",B153)","v":""},null,null,{"$f":"C167-D167","v":0},null,null,{"$f":"F167-G167","v":0}]
[null,"",null,null,0,null,null,0]
[null,"",null,null,0,null,null,0]
[null,"",null,null,0,null,null,0]
[null,"",null,null,0,null,null,0]
[null,"",null,null,0,null,null,0]
[null,"",null,null,0,null,null,0]
[null,"To enter further activities - please copy row from above and \"insert copied cells\" into a row above this row. "]
[]
[]
[]
[null,"7.12.3 - SAFETY RELATED"]
[]
[null,"7.12.3.1 - NUMBER OF ACTIVITIES"]
[null,"Activity","Units","AER expected volumes","Actual units","Difference","Reasons for Difference"]
[null,"Planned non-preferred services replacements","number of services",null,null,{"$f":"D182-E182","v":0}]
[null,"Planned replacement of non-preferred services due to height ","number of services",null,null,{"$f":"D183-E183","v":0}]
[null,"Removal of public lighting switchwire ","number of spans removed",null,null,0]
[null,"Replacement of existing SWER lines with 22kV overhead bare conductor ","kms of SWER",null,null,0]
[null,"Installation of GFN and associated equipment at zone substations ","number of zone substations",null,null,0]
[null,"Replacement of crossarms/insulator sets – pole top fire mitigation","number of crossarms/sets",null,null,0]
[null,"Replacement of crossarms – based on age and condition ","number of crossarms",null,null,0]
[null,"Replacement of poles – based on age and condition ","number of poles",null,null,0]
[null,"Stake poles – based on age and condition ","number of poles",null,null,0]
[null,"Replacement of undersized poles ","number of poles",null,null,0]
[null,"Stake undersized poles","number of poles",null,null,0]
[null,"Replacement of overhead conductor – mainly steel ","kms ",null,null,0]
[null,"Service line clearance – overhead services requiring relocation ","number of services",null,null,0]
[null,"Service line clearance – overhead services requiring undergrounding ","number of services",null,null,0]
[null,"Replacement of 22kV distribution feeders with ABC/underground cabling","number of feeders",null,null,0]
[null,"Replacement of SWER with covered carbon core conductor or equivalent","kms ",null,null,0]
[null,"Replacement of SWER with ABC","kms ",null,null,{"$f":"D198-E198","v":0}]
[null,"Replacement of SWER with underground","kms ",null,null,{"$f":"D199-E199","v":0}]
[null,"Replacement of surge diverters (neptune configuration)","number of units",null,null,0]
[null,"Replacement of surge diverters (single phase or three phase)","number of units",null,null,0]
[null,{"$f":"IF(ISBLANK(B39),\"\",B39)","v":""},{"$f":"IF(ISBLANK(C72),\"\",C72)","v":""},null,null,0]
[null,"","",null,null,0]
[null,"","",null,null,{"$f":"D204-E204","v":0}]
[null,"","",null,null,{"$f":"D205-E205","v":0}]
[null,"","",null,null,{"$f":"D206-E206","v":0}]
[null,"","",null,null,0]
[null,"","",null,null,0]
[null,"To enter further activities - please copy row from above and \"insert copied cells\" into a row above this row. "]
[]
[]
[null,"7.12.3.2 - EXPENDITURE"]
[null,"Activity","Units","Exclusive of Margins & Overheads",null,null,"Value of Margins & Overheads",null,null,"Reasons for Difference"]
[null,null,null,"AER expected expenditure ","Actual expenditure","Difference  ","AER expected expenditure ","Actual expenditure","Difference  "]
[null,null,null,"$0's, Nominal",null,null,"$0's, Nominal"]
[null,"Planned non-preferred services replacements","number of services",null,null,{"$f":"D216*$C$8-E216","v":0},null,null,{"$f":"G216*$C$8-H216","v":0}]
[null,"Planned replacement of non-preferred services due to height ","number of services",null,null,{"$f":"D217*$C$8-E217","v":0},null,null,{"$f":"G217*$C$8-H217","v":0}]
[null,"Removal of public lighting switchwire ","number of spans removed",null,null,0,null,null,0]
[null,"Replacement of existing SWER lines with 22kV overhead bare conductor ","kms of SWER",null,null,0,null,null,0]
[null,"Installation of GFN and associated equipment at zone substations ","number of zone substations",null,null,0,null,null,0]
[null,"Replacement of crossarms/insulator sets – pole top fire mitigation","number of crossarms/sets",null,null,0,null,null,0]
[null,"Replacement of crossarms – based on age and condition ","number of crossarms",null,null,0,null,null,0]
[null,"Replacement of poles – based on age and condition ","number of poles",null,null,0,null,null,0]
[null,"Stake poles – based on age and condition ","number of poles",null,null,0,null,null,0]
[null,"Replacement of undersized poles ","number of poles",null,null,0,null,null,0]
[null,"Stake undersized poles","number of poles",null,null,0,null,null,0]
[null,"Replacement of overhead conductor – mainly steel ","kms ",null,null,0,null,null,0]
[null,"Service line clearance – overhead services requiring relocation ","number of services",null,null,0,null,null,0]
[null,"Service line clearance – overhead services requiring undergrounding ","number of services",null,null,0,null,null,0]
[null,"Replacement of 22kV distribution feeders with ABC/underground cabling","number of feeders",null,null,0,null,null,0]
[null,"Replacement of SWER with covered carbon core conductor or equivalent","kms ",null,null,0,null,null,0]
[null,"Replacement of SWER with ABC","kms ",null,null,{"$f":"D232-E232","v":0},null,null,{"$f":"G232-H232","v":0}]
[null,"Replacement of SWER with underground","kms ",null,null,{"$f":"D233-E233","v":0},null,null,{"$f":"G233-H233","v":0}]
[null,"Replacement of surge diverters (neptune configuration)","number of units",null,null,0,null,null,0]
[null,"Replacement of surge diverters (single phase or three phase)","number of units",null,null,0,null,null,0]
[null,{"$f":"IF(ISBLANK(B39),\"\",B39)","v":""},{"$f":"IF(ISBLANK(C72),\"\",C72)","v":""},null,null,0,null,null,0]
[null,"","",null,null,0,null,null,0]
[null,"","",null,null,{"$f":"D238-E238","v":0},null,null,{"$f":"G238-H238","v":0}]
[null,"","",null,null,{"$f":"D239-E239","v":0},null,null,{"$f":"G239-H239","v":0}]
[null,"","",null,null,{"$f":"D240-E240","v":0},null,null,{"$f":"G240-H240","v":0}]
[null,"","",null,null,0,null,null,0]
[null,"","",null,null,0,null,null,0]
[null,"To enter further activities - please copy row from above and \"insert copied cells\" into a row above this row. "]
[]
[]
[]
[]
[null,"7.12.3.3 - UNIT COSTS"]
[null,"Activity","Units","AER expected","Actual\n  ","Difference\n  ","Reasons for Difference"]
[null,null,null,"$0's per Unit"]
[null,"Planned non-preferred services replacements","number of services",null,null,{"$f":"D251*$C$8-E251","v":0}]
[null,"Planned replacement of non-preferred services due to height ","number of services",null,null,0]
[null,"Removal of public lighting switchwire ","number of spans removed",null,null,0]
[null,"Replacement of  existing SWER lines with 22kV overhead bare conductor ","kms of SWER",null,null,0]
[null,"Installation of GFN and associated equipment at zone substations ","number of zone substations",null,null,0]
[null,"Replacement of crossarms/insulator sets – pole top fire mitigation","number of crossarms/sets",null,null,0]
[null,"Replacement of crossarms – based on age and condition ","number of crossarms",null,null,0]
[null,"Replacement of poles – based on age and condition ","number of poles",null,null,0]
[null,"Stake poles – based on age and condition ","number of poles",null,null,0]
[null,"Replacement of undersized poles ","number of poles",null,null,0]
[null,"Stake undersized poles","number of poles",null,null,0]
[null,"Replacement of overhead conductor – mainly steel ","kms ",null,null,0]
[null,"Service line clearance – overhead services requiring relocation ","number of services",null,null,0]
[null,"Service line clearance – overhead services requiring undergrounding ","number of services",null,null,0]
[null,"Replacement of 22kV distribution feeders with ABC/underground cabling","number of feeders",null,null,0]
[null,"Replacement of SWER with covered carbon core conductor or equivalent","kms ",null,null,0]
[null,"Replacement of SWER with ABC","kms ",null,null,{"$f":"D267-E267","v":0}]
[null,"Replacement of SWER with underground","kms ",null,null,{"$f":"D268-E268","v":0}]
[null,"Replacement of surge diverters (neptune configuration)","number of units",null,null,0]
[null,"Replacement of surge diverters (single phase or three phase)","number of units",null,null,0]
[null,{"$f":"IF(ISBLANK(B39),\"\",B39)","v":""},{"$f":"IF(ISBLANK(C72),\"\",C72)","v":""},null,null,0]
[null,"","",null,null,0]
[null,"","",null,null,{"$f":"D273-E273","v":0}]
[null,"","",null,null,{"$f":"D274-E274","v":0}]
[null,"","",null,null,{"$f":"D275-E275","v":0}]
[null,"","",null,null,0]
[null,"","",null,null,0]
[null,"To enter further activities - please copy row from above and \"insert copied cells\" into a row above this row. "]
[]
[null,"7.12.3.4 - SAFETY IMPROVEMENT OUTCOMES REPORTED TO ESV"]
[null,"Activity","Units","Safety Improvement Programme - outcomes","Safety Improvement Target","Difference","Reasons for Difference"]
[null,"Planned non-preferred services replacements","number of services",null,null,{"$f":"D282-E282","v":0}]
[null,"Planned replacement of non-preferred services due to height ","number of services",null,null,{"$f":"D283-E283","v":0}]
[null,"Removal of public lighting switchwire ","number of spans removed",null,null,0]
[null,"Replacement of  existing SWER lines with 22kV overhead bare conductor ","kms of SWER",null,null,0]
[null,"Installation of GFN and associated equipment at zone substations ","number of zone substations",null,null,0]
[null,"Replacement of crossarms/insulator sets – pole top fire mitigation","number of crossarms/sets",null,null,0]
[null,"Replacement of crossarms – based on age and condition ","number of crossarms",null,null,0]
[null,"Replacement of poles – based on age and condition ","number of poles",null,null,0]
[null,"Stake poles – based on age and condition ","number of poles",null,null,0]
[null,"Replacement of undersized poles ","number of poles",null,null,0]
[null,"Stake undersized poles","number of poles",null,null,0]
[null,"Replacement of overhead conductor – mainly steel ","kms ",null,null,0]
[null,"Service line clearance – overhead services requiring relocation ","number of services",null,null,0]
[null,"Service line clearance – overhead services requiring undergrounding ","number of services",null,null,0]
[null,"Replacement of 22kV distribution feeders with ABC/underground cabling","number of feeders",null,null,0]
[null,"Replacement of SWER with covered carbon core conductor or equivalent","kms ",null,null,0]
[null,"Replacement of SWER with ABC","kms ",null,null,0]
[null,"Replacement of SWER with underground","kms ",null,null,{"$f":"D299-E299","v":0}]
[null,"Replacement of surge diverters (neptune configuration)","number of units",null,null,0]
[null,"Replacement of surge diverters (single phase or three phase)","number of units",null,null,0]
[null,{"$f":"IF(ISBLANK(B39),\"\",B39)","v":""},{"$f":"IF(ISBLANK(C72),\"\",C72)","v":""},null,null,0]
[null,"","",null,null,0]
[null,"","",null,null,{"$f":"D304-E304","v":0}]
[null,"","",null,null,{"$f":"D305-E305","v":0}]
[null,"","",null,null,{"$f":"D306-E306","v":0}]
[null,"","",null,null,0]
[null,"","",null,null,0]
[null,"To enter further activities - please copy row from above and \"insert copied cells\" into a row above this row. "]
[]
[null,"7.12.3.5 - SAFETY IMPROVEMENT OUTCOMES RECONCILIATION"]
[null,"Activity","Units","Difference","Reasons for Difference"]
[null,"Planned non-preferred services replacements","number of services",{"$f":"D282-E52-E182","v":0}]
[null,"Planned replacement of non-preferred services due to height ","number of services",0]
[null,"Removal of public lighting switchwire ","number of spans removed",0]
[null,"Replacement of  existing SWER lines with 22kV overhead bare conductor ","kms of SWER",0]
[null,"Installation of GFN and associated equipment at zone substations ","number of zone substations",0]
[null,"Replacement of crossarms/insulator sets – pole top fire mitigation","number of crossarms/sets",0]
[null,"Replacement of crossarms – based on age and condition ","number of crossarms",0]
[null,"Replacement of poles – based on age and condition ","number of poles",0]
[null,"Stake poles – based on age and condition ","number of poles",0]
[null,"Replacement of undersized poles ","number of poles",0]
[null,"Stake undersized poles","number of poles",0]
[null,"Replacement of overhead conductor – mainly steel ","kms ",0]
[null,"Service line clearance – overhead services requiring relocation ","number of services",0]
[null,"Service line clearance – overhead services requiring undergrounding ","number of services",0]
[null,"Replacement of 22kV distribution feeders with ABC/underground cabling","number of feeders",0]
[null,"Replacement of SWER with covered carbon core conductor or equivalent","kms ",0]
[null,"Replacement of SWER with ABC","kms ",0]
[null,"Replacement of SWER with underground","kms ",0]
[null,"Replacement of surge diverters (neptune configuration)","number of units",0]
[null,"Replacement of surge diverters (single phase or three phase)","number of units",0]
[null,{"$f":"IF(ISBLANK(B39),\"\",B39)","v":""},{"$f":"IF(ISBLANK(C72),\"\",C72)","v":""},{"$f":"D302-E73-E202","v":0}]
[null,"","",0]
[null,"","",0]
[null,"","",0]
[null,"","",0]
[null,"","",0]
[null,"","",0]
[null,"To enter further activities - please copy row from above and \"insert copied cells\" into a row above this row. "]

{"sheet":"7.13 TARC","index":18,"n_rows":9,"n_cols":3,"rows_kept":9,"cut":false,"hidden":false,"merged":[]}
[null,{"$f":"(LOOKUP(dms_Model,dms_Model_List,dms_Worksheet_List))","v":"REGULATORY REPORTING STATEMENT"}]
[null,{"$f":"dms_TradingName","v":"Energex"}]
[null,{"$f":"CONCATENATE(\"Annual Reporting RIN Response \",CRY)","v":"Annual Reporting RIN Response 2015-16"}]
[null,"7.13 - TARC"]
[]
[]
[null,"7.13.1 - TOTAL ANNUAL RETAILER CHARGES"]
[null,null,"$0's"]
[null,"TARC",2038613158.8399999]

{"sheet":"8.1 Income","index":19,"n_rows":40,"n_cols":12,"rows_kept":40,"cut":false,"hidden":false,"merged":[[6,1,9,1],[6,6,6,10],[7,8,7,10],[6,11,8,11],[9,2,9,11],[6,5,8,5],[7,6,7,7],[6,2,8,2],[6,3,8,3],[6,4,8,4]]}
[null,{"$f":"(LOOKUP(dms_Model,dms_Model_List,dms_Worksheet_List))","v":"REGULATORY REPORTING STATEMENT"}]
[null,{"$f":"dms_TradingName","v":"Energex"}]
[null,{"$f":"CONCATENATE(\"Annual Reporting RIN Response \",CRY)","v":"Annual Reporting RIN Response 2015-16"}]
[null,"8.1 - INCOME"]
[]
[null,"8.1.1 - INCOME STATEMENT"]
[null,"Description","Audited Statutory Accounts","Adjustments","Distribution business","Standard Control Services","Alternative Control Services",null,null,null,null,"Negotiated Services"]
[null,null,null,null,null,null,"Public Lighting",null,"Other"]
[null,null,null,null,null,null,{"$f":"IF(dms_Jurisdiction=\"Vic\",\"Energy efficient\",\"\")","v":""},{"$f":"IF(dms_Jurisdiction=\"Vic\",\"Non-energy efficient\",\"\")","v":""},"Connection services","Metering services","Ancillary network services"]
[null,null,"$0's, nominal"]
[]
[null,"8.1.1.1 - REVENUE"]
[null,"Distribution revenue",1559679618.8000002,130260891.23,1689940510.03,1559679618.8000002,38358467.049999997,null,15963263.01,66248259.080000006,9690902.0899999999]
[null,"Cross boundary revenue",0,null,0,0,0,null,0,0,0]
[null,"Contributions",89106200.329999998,17813734.349999998,106919934.68000005,23966209.395755574,9574453.9242444672,null,55692842.590000004,14080188.23,3606240.54]
[null,"Interest income",12149993.93,-12149993.93,0,0,0,null,0,0,0]
[null,"Jurisdictional scheme amounts",202184484.50999999,null,202184484.50999999,202184484.50999999,0,null,0,0,0]
[null,"Profit from sale of fixed assets",1532001.9999999981,-1532001.9999999981,0,0,0,null,0,0,0]
[null,"TUOS revenue",454084883.52999997,null,454084883.52999997,454084883.52999997,0,null,0,0,0]
[null,"Pass through revenue (F-factor)",0,null,0,0,0,null,0,0,0]
[null,"Other Revenue ",256901726.79000008,-255753593.75999922,1148133.03,1148133.03,0,null,0,0,0]
[null,"Total revenue",{"$f":"SUM(C13:C21)","v":2575638909.8900003},-121360964.10999921,2454277945.7800002,2241063329.2657561,47932920.97424446,0,71656105.600000009,80328447.310000002,13297142.629999999,0]
[]
[null,"8.1.1.2 - EXPENDITURE"]
[null,"TUOS expenditure",432722877.36000007,null,432722877.36000001,432722877.36000001,0,null,0,0,0]
[null,"Avoided TUOS expenditure",496413.81,null,496413.81,496413.81,0,null,0,0,0]
[null,"Cross boundary expenditure",351943.72,null,351943.72,351943.72,0,null,0,0,0]
[null,"Depreciation ",413116576.25999993,-226731026.05863017,186385550.20136976,158578343.12198707,8172252.8545347257,null,0,19634954.224847961,0]
[null,"Finance charges",314116418.44,-6246242.5852940269,307870175.85470593,290581986.85541373,3983261.5812807195,null,2790323.1177001223,10476853.027257495,37751.273053890523]
[null,"Impairment losses",4039012.63,-4039012.63,0,0,0,null,0,0,0]
[null,"Jurisdictional scheme amounts",186933987.80000001,144409,187078396.80000001,187078396.80000001,0,null,0,0,0]
[null,"Loss from sale of fixed assets",0,10741738.979999997,10741738.979999997,10741738.979999997,0,null,0,0,0]
[null,"Maintenance expenditure",234084233.25999999,0,234084233.25999999,216420785.64999998,17663447.609999999,null,0,0,0]
[null,"Operating expenditure excluding maintenance expenditure",231829193.64000005,-35295756.430000007,196533437.20999989,132214556.12298667,2778682.7787940805,null,31404942.942927588,19863740.516286995,10271514.849004555]
[null,"Other ",37146756.939997278,-37146756.939997278,0,0,0,null,0,0,0]
[]
[null,"8.1.1.3 - PROFIT"]
[null,"Profit before tax (PBT)",{"$f":"C22-SUM(C25:C35)","v":720801496.03000283},177211682.55392227,898013178.58392453,811876286.84536839,15335276.149634935,0,37460839.539372295,30352899.541607551,2987876.5079415534,0]
[null,"Income tax expenses (/ benefit)",219950689,-949331.92476224748,219001357.07523775,206840736.19939321,2727717.0567802265,null,1984877.3846256742,7421172.3229380148,26854.111500626881]
[null,"Profit after tax",{"$f":"C38-C39","v":500850807.03000283},178161014.47868451,679011821.50868678,605035550.64597511,12607559.092854708,0,35475962.154746622,22931727.218669537,2961022.3964409265,{"$f":"L38-L39","v":0}]

{"sheet":"8.2 Capex","index":20,"n_rows":251,"n_cols":10,"rows_kept":251,"cut":false,"hidden":false,"merged":[[197,1,199,1],[140,1,142,1],[197,3,198,3],[142,2,142,3],[199,2,199,3],[140,4,141,4],[197,4,198,4],[140,3,141,3],[140,2,141,2],[197,2,198,2],[6,1,6,4],[41,1,41,4],[10,1,10,4],[7,1,7,4],[8,1,8,4],[14,1,14,4],[16,1,19,1],[16,2,16,9],[17,2,18,2],[17,3,18,3],[17,4,18,4],[17,5,18,5],[17,6,17,9],[19,2,19,3],[19,5,19,9],[83,5,84,5],[43,2,43,5],[44,2,44,5],[55,2,55,5],[56,2,56,5],[50,2,50,5],[51,2,51,5],[49,2,49,5],[83,4,84,4],[85,2,85,3],[45,2,45,5],[46,2,46,5],[47,2,47,5],[65,2,65,3],[57,2,57,5],[83,3,84,3],[63,4,64,4],[81,1,81,2],[58,2,58,5],[63,3,64,3],[63,5,64,5],[83,1,85,1],[83,2,84,2],[65,5,65,9],[48,2,48,5],[62,1,65,1],[63,2,64,2],[52,2,52,5],[53,2,53,5],[54,2,54,5],[62,2,62,9],[63,6,63,9]]}
[null,{"$f":"(LOOKUP(dms_Model,dms_Model_List,dms_Worksheet_List))","v":"REGULATORY REPORTING STATEMENT"}]
[null,{"$f":"dms_TradingName","v":"Energex"}]
[null,{"$f":"CONCATENATE(\"Annual Reporting RIN Response \",CRY)","v":"Annual Reporting RIN Response 2015-16"}]
[null,"8.2 - CAPEX"]
[]
[null,"Instructions"]
[null,"Reported expenditure must EXCLUDE capital contributions (except tables 8.2.1 and 8.2.5 which should include all capital contributions)."]
[null,{"$f":"CONCATENATE(\"Forecast expenditure is to be taken from \",dms_TradingName,\"'s \",dms_DeterminationRef,\".\")","v":"Forecast expenditure is to be taken from Energex's 2015-20 Distribution Determination."}]
[null,"If allocating based on assumptions then provide method in Basis of Preparation. All adjustments must be explained in Basis of Preparation with supporting documentation attached. "]
[]
[null,"For tables 8.2.1 and 8.2.3:\nReported expenditure must INCLUDE any profit margins or management fees paid directly or indirectly to related party contractors (not including actual incurred expenses of the related party contractor) for the regulatory reporting period.\n\n'Related Party Margin Expenditure' must COMPRISE ONLY profit margins or management fees paid directly or indirectly to related party contractors (not including actual incurred expenses of the related party contractor) for the regulatory reporting period."]
[]
[null,"8.2.1 - CAPEX BY PURPOSE - STANDARD CONTROL SERVICES"]
[]
[null,"Each line item in this table must INCLUDE the capital contributions. Total capital contributions should also be identified in the last item in the table. "]
[]
[null,"Description","EXPENDITURE"]
[null,null,"CPI adjusted Forecast","Actual","Difference","Related Party Margin","Voltage level"]
[null,null,null,null,null,null,"Subtransmission","HV","LV","Other "]
[null,null,"$0's, nominal",null," (%)","$0's, nominal"]
[null,"Asset replacement",200061523.59299999,{"$f":"SUM(G21:J21)","v":185809461.96000001},{"$f":"IF(C21=0,1,(D21-C21)/C21*1)","v":-7.1238393955221566E-2},0,23530589.190000001,70664184.019999996,49315997.380000003,42298691.369999997]
[null,"Augmentation",89664400.961999997,{"$f":"SUM(G22:J22)","v":100768270.29000001},{"$f":"IF(C22=0,1,(D22-C22)/C22*1)","v":0.12383810306953211},0,38819586.980000004,20725392.420000002,4027669.32,37195621.57]
[null,"Connections and customer-initiated works",88127982.449999988,115292315.53,0.3082373194622024,0,294164.77,48634686.269999996,66363464.49000001]
[null,"Non-network",55522426.490999997,38185589.060000002,-0.31224927523313917,0,null,null,null,38185589.060000002]
[null,"Capitalised overheads",180551255.24699998,168516649.34999999,-6.665478941443112E-2,0,null,null,null,168516649.34999999]
[null,null,null,{"$f":"SUM(G26:J26)","v":0},1]
[null,null,null,0,1]
[null,null,null,0,1]
[null,null,null,0,1]
[null,null,null,{"$f":"SUM(G30:J30)","v":0},1]
[null,null,null,0,1]
[null,null,null,0,1]
[null,null,null,0,1]
[null,null,null,0,1]
[null,null,null,0,1]
[null,"Capital contributions included in the above",30464082.449999996,79659051.98120901,1.6148515095424782,null,null,null,null,79659051.98120901]
[null,"Total",{"$f":"SUM(C21:C35)","v":613927588.74300003},608572286.18999994,{"$f":"IF(C37=0,1,(D37-C37)/C37*1)","v":-8.7230198661782388E-3},null,{"$f":"SUM(G21:G35)","v":62644340.940000005},{"$f":"SUM(H21:H35)","v":140024262.70999998},119707131.19000001,286196551.35000002]
[]
[]
[null,"8.2.2 - CAPEX BY PURPOSE - MATERIAL DIFFERENCE EXPLANATION"]
[]
[null,"Where the difference between forecast and actual expenditure shown in table 8.2.1 is a Material Difference please explain the main factors driving the difference."]
[]
[null,"Description","Reason for material difference"]
[null,"Augmentation ($11.1M overpsend)","Higher than forecast spend due to a number of substantial projects that commenced in previous years being completed in 2015/16, as a result of project delays. Further, there was increased spend in the LV fusing program."]
[null,"Connections and customer-initiated works ($27.2M overspend)","Higher level of customer driven Subdivsion work than forecast"]
[null,"Office Equipment & Furniture ($3.2M overspend)","Major projects in 2015/16 were at final construction stage, which is largely office fit-out stage, thus higher expenditure in this category. Additionally, by increasing expenditure on office equipment and furniture fit-out rather than new construction, net project savings were enabled overall."]
[null,"Motor Vehicles ($11.0M underspend)","Motor Vehicle variance is driven by savings being sought through fleet optimisation, more effective procurement and operational improvements.\n"]
[null,"Plant & Equipment ($2.3M underspend)","Plant and Equipment underspend is driven by cancellation of projects requiring specialised equipment.\n"]
[null,"Buildings ($4.5M underspend)","Buildings underspend driven by replacement of some major projects building expenditure with office furniture fit-out to achieve the same objective, providing a net saving. Also, slower than planned start to the Security Program and fewer base CAPEX projects than originally anticipated.\n"]
[null,"Land ($1.7M underspend)","Purchase of Inner North Hub site less than originally forecast"]
[]
[]
[]
[]
[]
[]
[]
[]
[]
[]
[null,"8.2.3 - CAPEX OTHER"]
[null,null,"EXPENDITURE"]
[null,null,"CPI adjusted Forecast","Actual","Difference","Related Party Margin","Voltage level"]
[null,null,null,null,null,null,"Subtransmission","HV","LV","Other "]
[null,null,"$0's, nominal",null," (%)","$0's, nominal"]
[null,"Public lighting"]
[null,{"$f":"IF(dms_Jurisdiction=\"Vic\",\"Energy Efficient\", \"Total\")","v":"Total"},10212682.381586634,{"$f":"SUM(G68:J68)","v":10124972.928458499},{"$f":"IF(C68=0,1,((D68-C68)/C68)*1)","v":-8.5882875674537888E-3},null,null,null,10124972.928458499]
[null,{"$f":"IF(dms_Jurisdiction=\"Vic\",\"Non-energy efficient\", \"\")","v":""},null,{"$f":"SUM(G69:J69)","v":0},{"$f":"IF(C69=0,1,((D69-C69)/C69)*1)","v":1}]
[null,"Alternative Control Services"]
[null,"Connection services",0,{"$f":"SUM(G71:J71)","v":2092302.0603734599},{"$f":"IF(C71=0,1,((D71-C71)/C71)*1)","v":1},null,null,null,null,2092302.0603734599]
[null,"Metering services",8548217.0973982103,9512497.1573236398,{"$f":"IF(C72=0,1,((D72-C72)/C72)*1)","v":0.11280481636561664},null,null,null,9512497.1573236398]
[null,"Ancillary network services",0,912663.3478444051,{"$f":"IF(C73=0,1,((D73-C73)/C73)*1)","v":1},null,null,null,null,912663.3478444051]
[null,"Negotiated Services"]
[null,"Negotiated services",0,{"$f":"SUM(G75:J75)","v":0},{"$f":"IF(C75=0,1,((D75-C75)/C75)*1)","v":1}]
[null,"Total",{"$f":"SUM(C68:C69,C71:C73,C75)","v":18760899.478984844},{"$f":"SUM(D68:D69,D71:D73,D75)","v":22642435.494000003},{"$f":"IF(C76=0,1,((D76-C76)/C76)*1)","v":0.20689498493199057},null,{"$f":"SUM(G68:G69,G71:G73,G75)","v":0},{"$f":"SUM(H68:H69,H71:H73,H75)","v":0},{"$f":"SUM(I68:I69,I71:I73,I75)","v":19637470.08578214},{"$f":"SUM(J68:J69,J71:J73,J75)","v":3004965.408217865}]
[]
[]
[]
[null,"8.2.4 - CAPEX BY ASSET CLASS"]
[]
[null,{"$f":"CONCATENATE(dms_TradingName, \" to enter in Table 8.2.4 each Asset Class specified in its current determination as listed in the AER's final decision in its Roll Forward Model and Post-tax Revenue Model and enter information against that Asset Class.\")","v":"Energex to enter in Table 8.2.4 each Asset Class specified in its current determination as listed in the AER's final decision in its Roll Forward Model and Post-tax Revenue Model and enter information against that Asset Class."}]
[]
[null,"Asset class","CPI adjusted Forecast","Actual ","Difference","Movements in provisions \nallocated to \nas-incurred capex"]
[]
[null,null,"$0's, nominal",null," (%)","$0's, nominal"]
[null,"OH Sub-transmission lines",19870788.515026424,25830707.824197233,{"$f":"IF(C87=0,1,((D87-C87)/C87)*1)","v":0.29993370945817666},-44434.005796816098]
[null,"UG Sub-transmission cables",36899989.806211427,16222925.796351796,{"$f":"IF(C88=0,1,((D88-C88)/C88)*1)","v":-0.56035419300790779},-27906.690896063963]
[null,"OH Distribution Lines",147708548.62896115,149049914.00286117,9.0811627786655073E-3,-256395.79015384184]
[null,"UG Distribution Cables",68007810.304383665,35907939.440109976,-0.47200271146216549,-61768.868282383359]
[null,"Distribution Equipment",43226904.948126346,19596114.503731515,-0.54666857302766703,-33709.253009250009]
[null,"Substation Bays",44722744.51607018,28081871.367195342,-0.3720897124928299,-48306.45925801999]
[null,"Substation Establishment",22736131.120389029,26863606.200159464,0.18153814551452196,-46210.798470768081]
[null,"Distribution Substation Switchgear",0,4643734.4585281331,1,-7988.1560061556829]
[null,"Zone Transformers",44170966.286881156,20992710.872632165,-0.52473960528078756,-36111.679283198711]
[null,"Distribution Transformers",52325112.257124066,93861610.947518438,0.79381575879446253,-161460.82381194472]
[null,"Low Voltage Services",19496054.700412408,28187379.186904509,0.44579914347020427,-48487.953900151901]
[null,"Load Control & Network Metering Devices",1363149.1962613203,3733664.1172563792,1.7389988766428641,-6422.6522230305982]
[null,"Communications - Pilot Wires",5960208.5384304738,22192434.745797969,2.7234325951356717,-38175.445320801846]
[null,"Streetlighting (Residual Rate 2 Assets)",0,0,1,0]
[null,"Systems Buildings",12704180.776983984,9527186.9113999996,-0.250074673948257,-16388.675112183239]
[null,"Systems Easements",0,1562911.4195999997,1,-2688.5215670846496]
[null,"System Land",2222716.2280659149,-351318.47,-1.1580581747521133,604.3383339997074]
[null,"Control Centre - SCADA",1256466.7548213317,0,-1,0]
[null,"IT Systems",1997685.4022958523,2215491.7055000002,0.10902933112182359,-3811.0907356850339]
[null,"Office Equipment & Furniture",502449.27087658586,3699923.6135000004,6.363775465421651,-6364.6117794739557]
[null,"Motor Vehicles",27206178.151760332,16201069.504500002,-0.40450770357644894,-27869.093684038293]
[null,"Plant & Equipment",6757518.5611492377,4475673.6570000006,-0.33767497395688517,-7699.0576709438546]
[null,"Research & Development",0,0,1,0]
[null,"Buildings",19177829.94311744,12935775.7535,-0.32548282095167891,-22252.132567536228]
[null,"Easements",0,0,1,0]
[null,"Land",5150072.7919142665,3481906.6459999997,-0.32391117821350529,-5989.578804627462]
[null,null,null,null,1]
[null,null,null,null,1]
[null,null,null,null,1]
[null,null,null,null,1]
[null,null,null,null,{"$f":"IF(C117=0,1,((D117-C117)/C117)*1)","v":1}]
[null,null,null,null,1]
[null,null,null,null,1]
[null,null,null,null,1]
[null,null,null,null,1]
[null,null,null,null,1]
[null,null,null,null,1]
[null,null,null,null,1]
[null,null,null,null,1]
[null,null,null,null,1]
[null,null,null,null,1]
[null,null,null,null,1]
[null,null,null,null,1]
[null,null,null,null,1]
[null,null,null,null,1]
[null,null,null,null,1]
[null,null,null,null,1]
[null,null,null,null,1]
[null,null,null,null,1]
[null,null,null,null,1]
[null,"Total",{"$f":"SUM(C87:C136)","v":583463506.69926238},{"$f":"SUM(D87:D136)","v":528913234.2042442},-9.3493889281297093E-2,{"$f":"SUM(F87:F136)","v":-909836.99999999953}]
[]
[]
[null,"8.2.5 - CAPITAL CONTRIBUTIONS BY ASSET CLASS"]
[null,"Asset class","CPI Adjusted Forecast","Actual","Difference"]
[]
[null,null,"$0's, nominal",null," (%)"]
[null,{"$f":"IF(ISBLANK(B87),\"\",B87)","v":"OH Sub-transmission lines"},1051687.3456812061,1418530.2392017487,{"$f":"IF(C144=0,1,((D144-C144)/C144)*1)","v":0.34881364221695438}]
[null,"UG Sub-transmission cables",2277447.3446106608,2084416.1351603391,{"$f":"IF(C145=0,1,((D145-C145)/C145)*1)","v":-8.4757704676294607E-2}]
[null,"OH Distribution Lines",2187025.621539725,5031816.2210395085,1.3007577833024992]
[null,"UG Distribution Cables",19448285.871261679,45282391.423295453,1.3283487153080307]
[null,"Distribution Equipment",101581.71599273566,75591.110861586087,-0.2558590872102241]
[null,"Substation Bays",1417.0463116050021,258519.94774806971,181.43577900799863]
[null,"Substation Establishment",1358.611412157373,66710.296814300586,48.101822800361759]
[null,"Distribution Substation Switchgear",0,1892790.0193269853,1]
[null,"Zone Transformers",6708.7616331764511,906931.74627774709,134.18616338859766]
[null,"Distribution Transformers",5174031.8390476517,21810254.30138294,3.2153305159013872]
[null,"Low Voltage Services",48671.121015227611,18553.566916599142,-0.61879721424960943]
[null,"Load Control & Network Metering Devices",152573.52245775925,248688.94928004584,0.62996138041511518]
[null,"Communications - Pilot Wires",13293.939624335586,539060.53635184176,39.54934440690927]
[null,"Streetlighting (Residual Rate 2 Assets)",0,0,1]
[null,"Systems Buildings",0,0,1]
[null,"Systems Easements",0,0,1]
[null,"System Land",0,24797.487551834351,1]
[null,"Control Centre - SCADA",0,0,1]
[null,"IT Systems",0,0,1]
[null,"Office Equipment & Furniture",0,0,1]
[null,"Motor Vehicles",0,0,1]
[null,"Plant & Equipment",0,0,1]
[null,"Research & Development",0,0,1]
[null,"Buildings",0,0,1]
[null,"Easements",0,0,1]
[null,"Land",0,0,1]
[null,"",null,null,1]
[null,"",null,null,1]
[null,"",null,null,1]
[null,"",null,null,{"$f":"IF(C173=0,1,((D173-C173)/C173)*1)","v":1}]
[null,"",null,null,1]
[null,"",null,null,1]
[null,{"$f":"IF(ISBLANK(B119),\"\",B119)","v":""},null,null,1]
[null,"",null,null,1]
[null,"",null,null,1]
[null,"",null,null,1]
[null,"",null,null,1]
[null,"",null,null,1]
[null,"",null,null,1]
[null,"",null,null,{"$f":"IF(C183=0,1,((D183-C183)/C183)*1)","v":1}]
[null,"",null,null,1]
[null,"",null,null,1]
[null,"",null,null,1]
[null,"",null,null,1]
[null,"",null,null,1]
[null,"",null,null,1]
[null,"",null,null,1]
[null,"",null,null,1]
[null,"",null,null,1]
[null,"",null,null,1]
[null,"Total",{"$f":"SUM(C144:C193)","v":30464082.74058792},{"$f":"SUM(D144:D193)","v":79659051.98120901},1.6148514846001789]
[]
[]
[null,"8.2.6 - DISPOSALS BY ASSET CLASS"]
[null,"Asset class","CPI Adjusted Forecast","Actual","Difference"]
[]
[null,null,"$0's, nominal",null," (%)"]
[null,{"$f":"IF(ISBLANK(B87),\"\",B87)","v":"OH Sub-transmission lines"},0,0,{"$f":"IF(C201=0,1,((D201-C201)/C201)*1)","v":1}]
[null,"UG Sub-transmission cables",0,0,{"$f":"IF(C202=0,1,((D202-C202)/C202)*1)","v":1}]
[null,"OH Distribution Lines",0,0,1]
[null,"UG Distribution Cables",0,23039.83,1]
[null,"Distribution Equipment",711899.99999999988,0,-1]
[null,"Substation Bays",610200,0,-1]
[null,"Substation Establishment",0,0,1]
[null,"Distribution Substation Switchgear",0,0,1]
[null,"Zone Transformers",915299.99999999988,0,-1]
[null,"Distribution Transformers",4881600,0,-1]
[null,"Low Voltage Services",1118700,0,-1]
[null,"Load Control & Network Metering Devices",0,0,1]
[null,"Communications - Pilot Wires",0,0,1]
[null,"Streetlighting (Residual Rate 2 Assets)",0,0,1]
[null,"Systems Buildings",0,0,1]
[null,"Systems Easements",0,0,1]
[null,"System Land",0,4462686.6499999994,1]
[null,"Control Centre - SCADA",0,0,1]
[null,"IT Systems",0,457646.63,1]
[null,"Office Equipment & Furniture",0,0,1]
[null,"Motor Vehicles",5434004.4391799998,5823017.5899999691,7.1588670045082278E-2]
[null,"Plant & Equipment",0,17242.5,1]
[null,"Research & Development",0,0,1]
[null,"Buildings",509096.95348347002,1681756.3,2.3034106538895354]
[null,"Easements",0,0,1]
[null,"Land",5283273.665274905,0,-1]
[null,"",null,null,1]
[null,"",null,null,1]
[null,"",null,null,1]
[null,"",null,null,1]
[null,"",null,null,{"$f":"IF(C231=0,1,((D231-C231)/C231)*1)","v":1}]
[null,"",null,null,1]
[null,{"$f":"IF(ISBLANK(B119),\"\",B119)","v":""},null,null,1]
[null,"",null,null,1]
[null,"",null,null,1]
[null,"",null,null,1]
[null,"",null,null,1]
[null,"",null,null,1]
[null,"",null,null,1]
[null,"",null,null,1]
[null,"",null,null,1]
[null,"",null,null,1]
[null,"",null,null,1]
[null,"",null,null,1]
[null,"",null,null,1]
[null,"",null,null,1]
[null,"",null,null,1]
[null,"",null,null,1]
[null,"",null,null,1]
[null,"",null,null,1]
[null,"Total",{"$f":"SUM(C201:C250)","v":19464075.057938375},{"$f":"SUM(D201:D250)","v":12465389.49999997},-0.35956938807035721]

{"sheet":"8.4 Opex","index":21,"n_rows":149,"n_cols":14,"rows_kept":149,"cut":false,"hidden":false,"merged":[[6,1,6,4],[14,1,14,5],[16,2,18,2],[16,3,18,3],[16,4,18,4],[12,1,12,5],[7,1,7,4],[13,1,13,5],[16,1,19,1],[16,13,18,13],[77,13,79,13],[19,8,19,13],[17,8,17,9],[78,8,78,9],[78,10,78,12],[17,10,17,12],[16,8,16,12],[77,8,77,12],[77,5,77,7],[17,5,18,5],[17,6,18,6],[17,7,18,7],[16,5,16,7],[19,2,19,6],[75,1,75,4],[77,1,80,1],[77,2,79,2],[77,3,79,3],[77,4,79,4],[80,8,80,13],[78,6,79,6],[78,7,79,7],[152,2,152,7],[137,1,137,4],[150,2,150,7],[151,2,151,7],[153,2,153,7],[154,2,154,7],[80,2,80,4],[78,5,79,5],[141,2,141,7],[142,2,142,7],[143,2,143,7],[144,2,144,7],[145,2,145,7],[146,2,146,7],[147,2,147,7],[148,2,148,7],[149,2,149,7],[139,2,139,7],[140,2,140,7]]}
[null,{"$f":"(LOOKUP(dms_Model,dms_Model_List,dms_Worksheet_List))","v":"REGULATORY REPORTING STATEMENT"}]
[null,{"$f":"dms_TradingName","v":"Energex"}]
[null,{"$f":"CONCATENATE(\"Annual Reporting RIN Response \",CRY)","v":"Annual Reporting RIN Response 2015-16"}]
[null,"8.4 OPEX"]
[]
[null,"Instructions"]
[null,{"$f":"CONCATENATE(\"Forecast expenditure is to be taken from \",dms_TradingName,\"'s \",dms_DeterminationRef,\".\")","v":"Forecast expenditure is to be taken from Energex's 2015-20 Distribution Determination."}]
[null,"If allocating based on assumptions then provide method in Basis of Preparation.  \n\nAll adjustments must be explained in Basis of Preparation with supporting documentation attached. "]
[]
[null,"8.4.1 - OPERATING & MAINTENANCE EXPENDITURE - BY PURPOSE"]
[]
[]
[null,{"$f":"CONCATENATE(dms_TradingName,\" is to list the operating expenditure categories identified in \", dms_TradingName,\"'s regulatory proposal at table 3.2.1.1 current opex categories and cost allocations.\")","v":"Energex is to list the operating expenditure categories identified in Energex's regulatory proposal at table 3.2.1.1 current opex categories and cost allocations."}]
[null,{"$f":"CONCATENATE(dms_TradingName, \" must specify any expenditure category where the expense is more than 5 per cent of the total standard control services operating expenditure.\")","v":"Energex must specify any expenditure category where the expense is more than 5 per cent of the total standard control services operating expenditure."}]
[null,"Reported operating expenditure must INCLUDE any profit margins or management fees paid directly or indirectly to related party contractors (not including actual incurred expenditure of the related party contractor) for the regulatory reporting period.  "]
[]
[null,"Opex category","Audited Statutory Accounts","Adjustments","Distribution business","Standard Control Services",null,null,"Alternative Control Services",null,null,null,null,"Negotiated Services"]
[null,null,null,null,null,"CPI Adjusted Forecast","Actual","Difference","Public Lighting",null,"Other"]
[null,null,null,null,null,null,null,null,{"$f":"IF(dms_Jurisdiction=\"Vic\",\"Energy efficient\",\"\")","v":""},{"$f":"IF(dms_Jurisdiction=\"Vic\",\"Non-energy efficient\",\"\")","v":""},"Connection services","Metering services","Ancillary network services"]
[null,null,"$0's, nominal",null,null,null,null,"%","$0's, nominal"]
[null,"Inspection",21360732.260000002,0,21360732.259999998,22529758.519248299,21360732.259999998,{"$f":"IF(F21=0,1,((G21-F21)/F21)*1)","v":-5.1888095393900643E-2}]
[null,"Planned maintenance",70730680.860000014,0,70730680.859999985,79275224.283180177,70730680.859999985,-0.10778327655886669]
[null,"Corrective repair",49841896.750000007,0,49841896.75,42424512.767649859,49841896.75,0.17483722259754858]
[null,"Vegetation",67674585.790000007,0,67674585.789999992,67990979.957609013,67674585.789999992,-4.6534726783800792E-3]
[null,"Emergency response/storms",6812889.9900000021,0,6812889.9900000002,12278398.585108031,6812889.9900000002,-0.4451320387771841]
[null,"Other network maintenance costs ",17663447.609999988,0,17663447.609999999,null,null,1,17663447.609999999]
[null,"Network operating costs",31732147.120000005,0,31732147.119999997,29112414.493401621,31732147.119999997,8.9986786468437496E-2]
[null,"Network billing and other energy market services (including meter reading)",18661883.490000002,0,18661883.489999998,3374958.9320388343,2545048.3432161957,-0.24590242593597555,107528.82709308947,null,133962.59937215652,15795524.963500869,79818.756817688263]
[null,"Customer services (inc call centre)",15690452.349999998,0,15690452.349999998,20045662.427184463,14800961.836459868,-0.26163767896301171,198537.98387535679,null,247344.503916377,296233.08004846709,147374.94569992993]
[null,"DSM initiatives",10076427.110000001,0,10076427.110000001,16551572.6315456,10076427.110000001,-0.39121028954098508]
[null,"Levies",8977985,-144409,8833576,8955664.8225188199,8833576,-1.3632580599915968E-2]
[null,"Debt raising costs",0,4911680.1399999987,4911680.1399999987,6659499.279232014,4718784.6929867947,-0.29142049647748081,44234.441583266816,null,null,148661.00542993777]
[null,"Other operating costs (inc self insurance)",146690298.57000035,-40063027.569999993,106627270.99999991,39166039.670390494,59507611.02032382,0.51936758276103023,2428381.5262423675,null,31023635.829639059,3623321.4673077185,10044321.156486936]
[null,null,null,null,null,null,null,1]
[null,null,null,null,null,null,null,1]
[null,null,null,null,null,null,null,{"$f":"IF(F36=0,1,((G36-F36)/F36)*1)","v":1}]
[null,null,null,null,null,null,null,1]
[null,null,null,null,null,null,null,1]
[null,null,null,null,null,null,null,1]
[null,null,null,null,null,null,null,1]
[null,null,null,null,null,null,null,1]
[null,null,null,null,null,null,null,{"$f":"IF(F42=0,1,((G42-F42)/F42)*1)","v":1}]
[null,null,null,null,null,null,null,1]
[null,null,null,null,null,null,null,1]
[null,null,null,null,null,null,null,1]
[null,null,null,null,null,null,null,1]
[null,null,null,null,null,null,null,1]
[null,null,null,null,null,null,null,1]
[null,null,null,null,null,null,null,1]
[null,null,null,null,null,null,null,1]
[null,null,null,null,null,null,null,1]
[null,null,null,null,null,null,null,1]
[null,null,null,null,null,null,null,1]
[null,null,null,null,null,null,null,1]
[null,null,null,null,null,null,null,1]
[null,null,null,null,null,null,null,1]
[null,null,null,null,null,null,null,1]
[null,null,null,null,null,null,null,1]
[null,null,null,null,null,null,null,1]
[null,null,null,null,null,null,null,1]
[null,null,null,null,null,null,null,1]
[null,null,null,null,null,null,null,1]
[null,null,null,null,null,null,null,1]
[null,null,null,null,null,null,null,1]
[null,null,null,null,null,null,null,1]
[null,null,null,null,null,null,null,1]
[null,null,null,null,null,null,null,1]
[null,null,null,null,null,null,null,1]
[null,null,null,null,null,null,null,1]
[null,null,null,null,null,null,null,1]
[null,"Total",{"$f":"SUM(C21:C70)","v":465913426.90000039},-35295756.429999992,430617670.46999991,348364686.36910731,348635341.77298665,7.7693122888056881E-4,{"$f":"SUM(I21:I70)","v":20442130.388794083},0,31404942.932927594,19863740.516286992,10271514.859004553,0]
[]
[]
[null,"8.4.2 - OPERATING & MAINTENANCE EXPENDITURE - BY PURPOSE - MARGINS ONLY"]
[]
[null,"\"Related party margin expenditure' must COMPRISE ONLY profit margins or management fees paid directly or indirectly to related party contractors (for expenditure that is not an actual incurred expenditure of the related party contractor) for the regulatory reporting period."]
[]
[null,"Opex category","Audited Statutory Accounts","Adjustments","Distribution business","Standard Control Services",null,null,"Alternative Control Services",null,null,null,null,"Negotiated Services"]
[null,null,null,null,null,"CPI Adjusted Forecast","Actual","Difference","Public Lighting",null,"Other"]
[null,null,null,null,null,null,null,null,{"$f":"IF(dms_Jurisdiction=\"Vic\",\"Energy efficient\",\"\")","v":""},{"$f":"IF(dms_Jurisdiction=\"Vic\",\"Non-energy efficient\",\"\")","v":""},"Connection services","Metering services","Ancillary network services"]
[null,null,"$0's, nominal",null,null,null,"$0's, nominal","per cent","$0's, nominal"]
[null,{"$f":"IF(ISBLANK(B21),\"\",B21)","v":"Inspection"},null,null,null,null,null,{"$f":"IF(F82=0,1,((G82-F82)/F82)*1)","v":1}]
[null,"Planned maintenance",null,null,null,null,null,1]
[null,"Corrective repair",null,null,null,null,null,1]
[null,"Vegetation",null,null,null,null,null,1]
[null,"Emergency response/storms",null,null,null,null,null,1]
[null,"Other network maintenance costs ",null,null,null,null,null,1]
[null,"Network operating costs",null,null,null,null,null,1]
[null,{"$f":"IF(ISBLANK(B27),\"\",B27)","v":"Network operating costs"},null,null,null,null,null,{"$f":"IF(F89=0,1,((G89-F89)/F89)*1)","v":1}]
[null,"Network billing and other energy market services (including meter reading)",null,null,null,null,null,1]
[null,"Customer services (inc call centre)",null,null,null,null,null,1]
[null,"DSM initiatives",null,null,null,null,null,1]
[null,"Levies",null,null,null,null,null,1]
[null,"Debt raising costs",null,null,null,null,null,1]
[null,"Other operating costs (inc self insurance)",null,null,null,null,null,1]
[null,"",null,null,null,null,null,1]
[null,"",null,null,null,null,null,1]
[null,"",null,null,null,null,null,{"$f":"IF(F98=0,1,((G98-F98)/F98)*1)","v":1}]
[null,"",null,null,null,null,null,1]
[null,"",null,null,null,null,null,1]
[null,"",null,null,null,null,null,1]
[null,"",null,null,null,null,null,1]
[null,"",null,null,null,null,null,1]
[null,"",null,null,null,null,null,{"$f":"IF(F104=0,1,((G104-F104)/F104)*1)","v":1}]
[null,"",null,null,null,null,null,1]
[null,"",null,null,null,null,null,1]
[null,"",null,null,null,null,null,1]
[null,"",null,null,null,null,null,1]
[null,"",null,null,null,null,null,1]
[null,"",null,null,null,null,null,1]
[null,"",null,null,null,null,null,1]
[null,"",null,null,null,null,null,1]
[null,"",null,null,null,null,null,1]
[null,"",null,null,null,null,null,1]
[null,"",null,null,null,null,null,1]
[null,"",null,null,null,null,null,1]
[null,"",null,null,null,null,null,1]
[null,"",null,null,null,null,null,1]
[null,"",null,null,null,null,null,1]
[null,"",null,null,null,null,null,1]
[null,"",null,null,null,null,null,1]
[null,"",null,null,null,null,null,1]
[null,"",null,null,null,null,null,1]
[null,"",null,null,null,null,null,1]
[null,"",null,null,null,null,null,1]
[null,"",null,null,null,null,null,1]
[null,"",null,null,null,null,null,1]
[null,"",null,null,null,null,null,1]
[null,"",null,null,null,null,null,1]
[null,"",null,null,null,null,null,1]
[null,"",null,null,null,null,null,1]
[null,null,null,null,null,null,null,1]
[null,"Total",{"$f":"SUM(C82:C132)","v":0},{"$f":"SUM(D82:D132)","v":0},{"$f":"SUM(E82:E132)","v":0},{"$f":"SUM(F82:F132)","v":0},{"$f":"SUM(G82:G132)","v":0},1,{"$f":"SUM(I82:I132)","v":0},{"$f":"SUM(J82:J132)","v":0},0,0,{"$f":"SUM(M82:M132)","v":0},{"$f":"SUM(N82:N132)","v":0}]
[]
[]
[null,"8.4.3 - OPERATING & MAINTENANCE EXPENDITURE - EXPLANATION OF MATERIAL DIFFERENCE"]
[]
[null,"Where the difference between forecast and actual expenditure shown in table 8.4.1, column I is a Material Difference please explain the main factors driving the difference."]
[]
[null,"Category","Explanation"]
[null,"Planned maintenance ($8.5M underspend)","Underspend due to a lower than anticipated cross arm replacements and business efficiencies through joint working initiatives."]
[null,"Corrective repair ($7.4M overspend)","Above forecast levels of 11kV underground, LV overhead, LV underground, bulk zone substation corrective maintenance and relay corrective maintenance."]
[null,"Emergency response/storms ($5.5M underspend)","Underspend due to less severe storm and emergency response events than forecast."]
[null,"Network billing and other energy market services (including meter reading) ($0.8M underspend)","The underspend is due to a reduction of FTE's and efficiency initiatives."]
[null,"Customer Services ($3.0M underspend)","Underspend primarily due to lower than forecast loss of supply, cold water complaints and customer inquiry expenditure."]
[null,"Call centre ($2.2M underspend)","Call centre underspend is the result of the concerted effort to find efficiencies which has led to cross skilling of employees and a reduction of FTEs compared to forecast."]
[null,"DSM initiatives ($6.5M underspend)","The underspend is due to a board approved decision to reduce demand management expenditure through the following initiatives:\n• Discontinuing incentives for energy efficient pool pumps, given the sustained growth in uptake of these products driven by ongoing industry support; \n• Reducing incentives for the PeakSmart program, for off-peak load control connections (pools and hot water) and for Business DM programs; \n• Deferral of a number of load control projects\n"]
[null,"Debt raising costs ($1.9M underspend)","Energex operated on a reduced level of borrowings compared to plan. As a result Debt Raising Costs are $1.9M below forecast. "]
[null,"Other operating costs (inc self Insurance)","The overspend in Other Operating Costs is primarily attributable to corporate restructuring costs $9.8M (redundancy payments). In addition, spending was incurred on merger related activities/professional fees $6.5M which were not included in the Final Determination. "]

{"sheet":"9.5 TUoS","index":22,"n_rows":60,"n_cols":6,"rows_kept":60,"cut":false,"hidden":false,"merged":[[57,1,57,4],[51,1,51,4],[19,1,19,4],[20,1,20,4],[59,1,59,4],[53,1,53,4],[48,1,48,4],[58,1,58,4],[40,1,40,4],[44,1,44,4],[45,1,45,4],[46,1,46,4],[47,1,47,4],[41,1,41,4],[42,1,42,4],[43,1,43,4],[50,1,50,4],[54,1,54,4],[52,1,52,4],[55,1,55,4],[56,1,56,4],[5,1,5,3],[21,1,21,3],[24,2,24,5],[36,1,36,4],[25,2,25,5],[24,1,27,1],[9,1,9,4],[10,1,10,4],[11,1,11,4],[12,1,12,4],[17,1,17,4],[18,1,18,4],[13,1,13,3]]}
[null,{"$f":"(LOOKUP(dms_Model,dms_Model_List,dms_Worksheet_List))","v":"REGULATORY REPORTING STATEMENT"}]
[null,{"$f":"dms_TradingName","v":"Energex"}]
[null,{"$f":"CONCATENATE(\"Annual Reporting RIN Response \",CRY)","v":"Annual Reporting RIN Response 2015-16"}]
[null,"9.5 - TUoS AUDIT (t-2)"]
[]
[null,"This template collects information for annual pricing proposals from Victorian businesses only.\n"]
[]
[null,"9.5.1 - TUOS CHARGES (AEMO)"]
[null,null,null,null,null,{"$f":"CRY","v":"2015-16"}]
[]
[]
[]
[]
[null,null,null,null,"Total",{"$f":"SUM(F10:F13)","v":0}]
[]
[null,"9.5.2 - TRANSMISSION CONNECTION FEES"]
[null,null,null,null,null,{"$f":"CRY","v":"2015-16"}]
[]
[]
[]
[]
[null,null,null,null,"Total",{"$f":"SUM(F18:F21)","v":0}]
[]
[null,"9.5.3 - CROSS BOUNDARY NETWORK CHARGES"]
[null,"Distribution Business","Amount (payable)/receivable"]
[null,null,"$0's, nominal"]
[null,null,"HV crossings","Subtransmission crossings","TUoS Adjustment","Total"]
[null,null,null,null,null,{"$f":"CRY","v":"2015-16"}]
[null,null,null,null,null,{"$f":"IF((SUM(C29:E29)=0),\"\",(SUM(C29:E29)))","v":""}]
[null,null,null,null,null,{"$f":"IF((SUM(C30:E30)=0),\"\",(SUM(C30:E30)))","v":""}]
[null,null,null,null,null,""]
[null,null,null,null,null,""]
[null,null,null,null,null,""]
[null,null,null,null,null,""]
[null,null,null,null,null,""]
[null,null,null,null,null,""]
[null,"Total",null,null,null,""]
[]
[null,"9.5.4 - PAYMENTS TO EMBEDDED GENERATORS"]
[null,"9.5.4.1 - AVOIDED TRANSMISSION COSTS",null,null,null,{"$f":"CRY","v":"2015-16"}]
[]
[]
[]
[]
[]
[]
[]
[]
[null,"Total",null,null,null,{"$f":"SUM(F41:F48)","v":0}]
[null,"9.5.4.2 - AVOIDED TUoS USAGE CHARGES",null,null,null,{"$f":"CRY","v":"2015-16"}]
[]
[]
[]
[]
[]
[]
[]
[]
[null,"Total",null,null,null,{"$f":"SUM(F51:F58)","v":0}]
[null,"Total payments to embedded generators",null,null,null,{"$f":"F59+F49","v":0}]

{"sheet":"unlocked","index":23,"n_rows":0,"n_cols":0,"rows_kept":0,"cut":false,"hidden":false,"merged":[]}