{"text_format":"1","workbook":"xlsx","n_sheets":12,"sheets":["Contents","1.0 Business & other details","3.1 Revenue","3.2 Opex","3.2.3 Provisions","3.3 Assets (RAB)","3.4 Operational data","3.5 Physical assets","3.6 Quality of service","3.7 Operating environment","3.7.4 Weather stations","Unlocked worksheet"],"not_rendered":{"charts":0,"images":1,"macros":1,"external_links":4,"defined_names":23,"comments":0,"pivot_tables":0},"unopened":[],"bounds":{"document_bytes":16777216,"sheet_cells":100000,"rows_first":2000,"rows_last":500,"rows_between":2000,"halvings":0,"cell_chars":16384,"cell_head_chars":4096},"cells_cut":0,"cells_raw":0,"read":"whole","date_system":"1900"}

{"sheet":"Contents","index":0,"n_rows":12,"n_cols":2,"rows_kept":12,"cut":false,"hidden":false,"merged":[]}
[null,"REGULATORY REPORTING STATEMENT"]
[null,{"$f":"TradingName","v":"Ergon Energy"}]
[null,{"$f":"CONCATENATE(\"Benchmarking RIN response \",CRY)","v":"Benchmarking RIN response 2013-14"}]
[]
[null,"CONTENTS"]
[]
[]
[]
[]
[]
[]
[null,"3.             ECONOMIC BENCHMARKING"]

{"sheet":"1.0 Business & other details","index":1,"n_rows":50,"n_cols":7,"rows_kept":50,"cut":false,"hidden":false,"merged":[[23,4,23,7],[7,1,7,8],[11,1,11,8],[13,2,13,7],[14,2,14,4],[17,2,17,3],[17,4,17,7],[18,4,18,7],[19,2,19,3],[19,4,19,7],[22,2,22,3],[22,4,22,7],[30,2,30,3],[30,5,30,6],[48,2,48,8],[24,2,24,3],[24,4,24,7],[28,2,28,3],[28,5,28,6],[29,2,29,3],[29,5,29,6],[33,2,33,3]]}
[null,"REGULATORY REPORTING STATEMENT"]
[null,{"$f":"TradingName","v":"Ergon Energy"}]
[null,{"$f":"CONCATENATE(\"Benchmarking RIN response \",CRY)","v":"Benchmarking RIN response 2013-14"}]
[null,"1.2 BUSINESS & OTHER DETAILS"]
[]
[]
[null,"Instructions"]
[null,"Complete the following business details regulatory template before entering data or values in any other regulatory template. This regulatory template is linked to other cells within the spreadsheet and automatically generates column headings."]
[]
[null,"TABLE 1.2.1 - SUBMISSION PARTICULARS INPUT SHEET"]
[]
[null,"Entity details"]
[]
[null,"Trading name","Ergon Energy"]
[null,"ACN / ABN",50087646062]
[]
[]
[null,"Business address","Address 1",null,"420 Flinders Street"]
[null,null,null,"Address 2"]
[null,null,"Suburb",null,"Townsville"]
[null,null,null,"State","Qld","p/code",4810]
[]
[null,"Postal address","Address 1",null,"PO Box 264"]
[null,null,null,"Address 2"]
[null,null,"Suburb",null,"Fortitude Valley "]
[null,null,null,"State","Qld","p/code",4006]
[]
[]
[null,"Contact name/s","Jenny Doyle",null,null,"Group Manager Regulatory Affairs"]
[null,"Contact phone/s","(07) 3851 6416"]
{"$rows_left_out":21}
{"sheet":"3.1 Revenue","index":2,"n_rows":43,"n_cols":6,"rows_kept":43,"cut":false,"hidden":false,"merged":[[8,4,8,5]]}
[null,null,"REGULATORY REPORTING STATEMENT"]
[null,null,{"$f":"TradingName","v":"Ergon Energy"}]
[null,null,{"$f":"CONCATENATE(\"Benchmarking RIN response \",CRY)","v":"Benchmarking RIN response 2013-14"}]
[null,null,"3.1 REVENUE"]
[]
[]
[]
[null,null,null,null,"Standard control services","Alternative control services"]
[null,null,null,null,"Actual\n($000s)"]
[null,null,null,null,{"$f":"CRY","v":"2013-14"},{"$f":"CRY","v":"2013-14"}]
[]
[null,null,"TABLE 3.1.1 - REVENUE GROUPING BY CHARGEABLE QUANTITY"]
["ED_REV311_00001","DREV0101","Revenue from Fixed Customer Charges ",null,310756.71283121884,0]
["ED_REV311_00002","DREV0102","Revenue from Energy Delivery charges where time of use is not a determinant",null,748825.12767336518,0]
["ED_REV311_00003","DREV0103","Revenue from On–Peak Energy Delivery charges ",null,0,0]
["ED_REV311_00004","DREV0104","Revenue from Shoulder period Energy Delivery Charges",null,0,0]
["ED_REV311_00005","DREV0105","Revenue from Off–Peak Energy Delivery charges ",null,0,0]
["ED_REV311_00006","DREV0106","Revenue from controlled load customer charges",null,36430.222157002514,0]
["ED_REV311_00007","DREV0107","Revenue from unmetered supplies",null,1280.7638539154639,0]
["ED_REV311_00008","DREV0108","Revenue from Contracted Maximum Demand charges",null,393858.04092521634,0]
["ED_REV311_00009","DREV0109","Revenue from Measured Maximum Demand charges",null,28973.28439007901,0]
["ED_REV311_00010","DREV0110","Revenue from metering charges",null,0,425]
["ED_REV311_00011","DREV0111","Revenue from connection charges",null,59990.599099999992,29227.779470000001]
["ED_REV311_00012","DREV0112","Revenue from public lighting charges",null,18783.4996392024,35840.932000000001]
["ED_REV311_00013","DREV0113","Revenue from other Sources",null,0,21343]
[null,"DREV01","Total revenue by chargeable quantity","$'000",{"$f":"SUM(E13:E25)","v":1598898.2505699997},{"$f":"SUM(F13:F25)","v":86836.711470000009}]
[]
[null,null,"TABLE 3.1.2 REVENUE GROUPING BY CUSTOMER TYPE OR CLASS"]
["ED_REV312_00001","DREV0201","Revenue from residential Customers ",null,822612.48859681876,0]
["ED_REV312_00002","DREV0202","Revenue from Non residential customers not on demand tariffs ",null,175601.13005440604,0]
{"$rows_left_out":14}
{"sheet":"3.2 Opex","index":3,"n_rows":219,"n_cols":6,"rows_kept":219,"cut":false,"hidden":false,"merged":[[11,4,11,5]]}
[null,null,"REGULATORY REPORTING STATEMENT",null,null,"Worksheet navigation"]
[null,null,{"$f":"TradingName","v":"Ergon Energy"}]
[null,null,{"$f":"CONCATENATE(\"Benchmarking RIN response \",CRY)","v":"Benchmarking RIN response 2013-14"}]
[null,null,"3.2 OPERATING EXPENDITURE"]
[]
[]
[null,null,"Instructions"]
[null,null,{"$f":"CONCATENATE(TradingName, \" must fill in opex in table 3.2.1 for opex categories reported in response to its annual reporting RIN.\")","v":"Ergon Energy must fill in opex in table 3.2.1 for opex categories reported in response to its annual reporting RIN."}]
[]
[]
[null,null,null,null,"Standard control services","Alternative control services"]
[null,null,null,null,"Actual\n($000s)"]
[null,null,null,null,{"$f":"CRY","v":"2013-14"},{"$f":"CRY","v":"2013-14"}]
[]
[null,null,"TABLE 3.2.1 - OPEX CATEGORIES"]
[]
[null,null,"Table 3.2.1.1 Current opex categories  and cost allocations"]
[null,"DOPEX0101","Preventative maintenance",null,71824,6555]
[null,"DOPEX0102","Corrective maintenance",null,105324,5307]
[null,"DOPEX0103","Forced maintenance",null,67886,503]
[null,"DOPEX0104","Other network maintenance",null,0,0]
[null,"DOPEX0105","Network operating costs",null,34466,0]
[null,"DOPEX0106","Meter reading",null,12905,0]
[null,"DOPEX0107","Customer service (incl Call Centre)",null,28766.110739999989,30326.944630000005]
[null,"DOPEX0108","Other operating costs",null,6577,0]
[null,"DOPEX0109","Training",null,18606,0]
[null,"DOPEX0110","Feed-in tariff",null,120083,0]
[null,"DOPEX0111","Debt raising costs",null,0,0]
[null,"DOPEX0112","Over absorbed overheads",null,9102,0]
[null,"DOPEX0113","Non network alternatives",null,0,0]
{"$rows_left_out":190}
{"sheet":"3.2.3 Provisions","index":4,"n_rows":373,"n_cols":5,"rows_kept":373,"cut":false,"hidden":false,"merged":[]}
[null,null,"REGULATORY REPORTING STATEMENT"]
[null,null,{"$f":"TradingName","v":"Ergon Energy"}]
[null,null,{"$f":"CONCATENATE(\"Benchmarking RIN response \",CRY)","v":"Benchmarking RIN response 2013-14"}]
[null,null,"3.2 OPERATING EXPENDITURE"]
[]
[null,null,"Instructions"]
[null,null,{"$f":"CONCATENATE(TradingName, \" must fill in opex in table 3.2.3 for opex categories reported in response to its annual reporting RIN.\")","v":"Ergon Energy must fill in opex in table 3.2.3 for opex categories reported in response to its annual reporting RIN."}]
[]
[null,null,"TABLE 3.2.3 - PROVISIONS"]
[null,null,"For each provision report:"]
[null,null,null,null,"$000's"]
[null,null,null,null,{"$f":"CRY","v":"2013-14"}]
[]
[null,"DOPEX03A","Provision name"]
[null,null,"Restructuring"]
[null,"DOPEX0301A","Opening balance (the carrying amount at the beginning of the period)",null,3811.491]
[null,null,"Additional provisions made in the period, including increases to existing provisions"]
[null,"DOPEX0302A","Opex component",null,211.35092831599997]
[null,"DOPEX0303A","Capex component",null,0]
[null,"DOPEX0304A","Other component",null,0]
[null,null,"Amounts used (that is, incurred and charged against the provision) during the period"]
[null,"DOPEX0305A","Opex component",null,-2026.8641272139996]
[null,"DOPEX0306A","Capex component",null,0]
[null,"DOPEX0307A","Other component",null,0]
[null,null,"Unused amounts reversed during the period"]
[null,"DOPEX0308A","Opex component",null,0]
[null,"DOPEX0309A","Capex component",null,0]
[null,"DOPEX0310A","Other component",null,0]
[null,null,"The increase during the period in the discounted amount arising from the passage of time and the effect of any change in the discount rate"]
[null,"DOPEX0311A","Opex component",null,0]
{"$rows_left_out":344}
{"sheet":"3.3 Assets (RAB)","index":5,"n_rows":138,"n_cols":7,"rows_kept":138,"cut":false,"hidden":false,"merged":[[116,4,116,6],[7,4,7,6]]}
[null,null,"REGULATORY REPORTING STATEMENT"]
[null,null,{"$f":"TradingName","v":"Ergon Energy"}]
[null,null,{"$f":"CONCATENATE(\"Benchmarking RIN response \",CRY)","v":"Benchmarking RIN response 2013-14"}]
[null,null,"3.3 ASSETS"]
[]
[]
[null,null,null,null,"Network services","Standard control services","Alternative control services"]
[null,null,null,null,"Actual\n($000's)"]
[null,null,null,null,{"$f":"CRY","v":"2013-14"},{"$f":"CRY","v":"2013-14"},"2013-14"]
[]
[null,null,"TABLE 3.3.1 - REGULATORY ASSET BASE VALUES"]
[null,null,"For total asset base:"]
["ED_RAB331_00001","DRAB0101","Opening value",null,{"$f":"(VLOOKUP($B13,'[1]3.3 Assets (RAB) C'!$B$13:$AJ$137,COLUMN(L1),FALSE))/1000","v":7395283.6409888724},{"$f":"(VLOOKUP($B13,'[1]3.3 Assets (RAB) C'!$B$13:$AJ$137,COLUMN(W1),FALSE))/1000","v":9006786.2871483192},{"$f":"(VLOOKUP($B13,'[1]3.3 Assets (RAB) C'!$B$13:$AJ$137,COLUMN(AH1),FALSE))/1000","v":78817.273312891863}]
["ED_RAB331_00002","DRAB0102","Inflation addition",null,{"$f":"(VLOOKUP($B14,'[1]3.3 Assets (RAB) C'!$B$13:$AJ$137,COLUMN(L2),FALSE))/1000","v":216681.81068097398},{"$f":"(VLOOKUP($B14,'[1]3.3 Assets (RAB) C'!$B$13:$AJ$137,COLUMN(W2),FALSE))/1000","v":263898.83821344579},{"$f":"(VLOOKUP($B14,'[1]3.3 Assets (RAB) C'!$B$13:$AJ$137,COLUMN(AH2),FALSE))/1000","v":2201.1854340695431}]
["ED_RAB331_00003","DRAB0103","Straight line depreciation",null,{"$f":"(VLOOKUP($B15,'[1]3.3 Assets (RAB) C'!$B$13:$AJ$137,COLUMN(L3),FALSE))/1000","v":-327118.75480831484},{"$f":"(VLOOKUP($B15,'[1]3.3 Assets (RAB) C'!$B$13:$AJ$137,COLUMN(W3),FALSE))/1000","v":-412886.77216772921},{"$f":"(VLOOKUP($B15,'[1]3.3 Assets (RAB) C'!$B$13:$AJ$137,COLUMN(AH3),FALSE))/1000","v":-9924.7845495495822}]
["ED_RAB331_00004","DRAB0104","Regulatory depreciation",null,{"$f":"SUM(E15+E14)","v":-110436.94412734086},{"$f":"SUM(F15+F14)","v":-148987.93395428342},{"$f":"SUM(G15+G14)","v":-7723.5991154800395}]
["ED_RAB331_00005","DRAB0105","Actual additions (recognised in RAB)",null,{"$f":"(VLOOKUP($B17,'[1]3.3 Assets (RAB) C'!$B$13:$AJ$137,COLUMN(L5),FALSE))/1000","v":613523.02217440377},{"$f":"(VLOOKUP($B17,'[1]3.3 Assets (RAB) C'!$B$13:$AJ$137,COLUMN(W5),FALSE))/1000","v":758752.29984990065},{"$f":"(VLOOKUP($B17,'[1]3.3 Assets (RAB) C'!$B$13:$AJ$137,COLUMN(AH5),FALSE))/1000","v":8841.2718220277038}]
["ED_RAB331_00006","DRAB0106","Disposals ",null,{"$f":"(VLOOKUP($B18,'[1]3.3 Assets (RAB) C'!$B$13:$AJ$137,COLUMN(L6),FALSE))/1000","v":-10212.273265345124},{"$f":"(VLOOKUP($B18,'[1]3.3 Assets (RAB) C'!$B$13:$AJ$137,COLUMN(W6),FALSE))/1000","v":-10212.273265345124},{"$f":"(VLOOKUP($B18,'[1]3.3 Assets (RAB) C'!$B$13:$AJ$137,COLUMN(AH6),FALSE))/1000","v":0}]
["ED_RAB331_00007","DRAB0107","Closing value for overhead distribution asset value",null,{"$f":"SUM(E13+E14+E15+E17+E18)","v":7888157.4457705906},{"$f":"SUM(F13+F14+F15+F17+F18)","v":9606338.3797785919},{"$f":"SUM(G13+G14+G15+G17+G18)","v":79934.946019439521}]
[]
[null,null,"TABLE 3.3.2 - ASSET VALUE ROLL FORWARD"]
[null,null,"For overhead network assets less than 33kV:"]
["ED_RAB3321_00001","DRAB0201","Opening value",null,{"$f":"(VLOOKUP($B23,'[1]3.3 Assets (RAB) C'!$B$13:$AJ$137,COLUMN(L11),FALSE))/1000","v":2480224.0714551983},{"$f":"(VLOOKUP($B23,'[1]3.3 Assets (RAB) C'!$B$13:$AJ$137,COLUMN(W11),FALSE))/1000","v":2949379.665089861},{"$f":"(VLOOKUP($B23,'[1]3.3 Assets (RAB) C'!$B$13:$AJ$137,COLUMN(AH11),FALSE))/1000","v":0}]
["ED_RAB3321_00002","DRAB0202","Inflation addition",null,{"$f":"(VLOOKUP($B24,'[1]3.3 Assets (RAB) C'!$B$13:$AJ$137,COLUMN(L12),FALSE))/1000","v":72670.565293637323},{"$f":"(VLOOKUP($B24,'[1]3.3 Assets (RAB) C'!$B$13:$AJ$137,COLUMN(W12),FALSE))/1000","v":86416.824187132937},{"$f":"(VLOOKUP($B24,'[1]3.3 Assets (RAB) C'!$B$13:$AJ$137,COLUMN(AH12),FALSE))/1000","v":0}]
["ED_RAB3321_00003","DRAB0203","Straight line depreciation",null,{"$f":"(VLOOKUP($B25,'[1]3.3 Assets (RAB) C'!$B$13:$AJ$137,COLUMN(L13),FALSE))/1000","v":-79588.368843603937},{"$f":"(VLOOKUP($B25,'[1]3.3 Assets (RAB) C'!$B$13:$AJ$137,COLUMN(W13),FALSE))/1000","v":-109668.59951732113},{"$f":"(VLOOKUP($B25,'[1]3.3 Assets (RAB) C'!$B$13:$AJ$137,COLUMN(AH13),FALSE))/1000","v":0}]
["ED_RAB3321_00004","DRAB0204","Regulatory depreciation",null,{"$f":"SUM(E25+E24)","v":-6917.8035499666148},{"$f":"SUM(F25+F24)","v":-23251.775330188189},{"$f":"SUM(G25+G24)","v":0}]
["ED_RAB3321_00005","DRAB0205","Actual additions (recognised in RAB)",null,{"$f":"(VLOOKUP($B27,'[1]3.3 Assets (RAB) C'!$B$13:$AJ$137,COLUMN(L15),FALSE))/1000","v":193326.53977456034},{"$f":"(VLOOKUP($B27,'[1]3.3 Assets (RAB) C'!$B$13:$AJ$137,COLUMN(W15),FALSE))/1000","v":236895.32307720941},{"$f":"(VLOOKUP($B27,'[1]3.3 Assets (RAB) C'!$B$13:$AJ$137,COLUMN(AH15),FALSE))/1000","v":0}]
["ED_RAB3321_00006","DRAB0206","Disposals ",null,{"$f":"(VLOOKUP($B28,'[1]3.3 Assets (RAB) C'!$B$13:$AJ$137,COLUMN(L16),FALSE))/1000","v":-304.37402332477751},{"$f":"(VLOOKUP($B28,'[1]3.3 Assets (RAB) C'!$B$13:$AJ$137,COLUMN(W16),FALSE))/1000","v":-304.37402332477751},{"$f":"(VLOOKUP($B28,'[1]3.3 Assets (RAB) C'!$B$13:$AJ$137,COLUMN(AH16),FALSE))/1000","v":0}]
["ED_RAB3321_00007","DRAB0207","Closing value for overhead distribution asset value",null,{"$f":"SUM(E23+E24+E25+E27+E28)","v":2666328.4336564671},{"$f":"SUM(F23+F24+F25+F27+F28)","v":3162718.8388135573},{"$f":"SUM(G23+G24+G25+G27+G28)","v":0}]
[null,null,"For underground network assets less than 33kV:"]
{"$rows_left_out":109}
{"sheet":"3.4 Operational data","index":6,"n_rows":130,"n_cols":5,"rows_kept":130,"cut":false,"hidden":false,"merged":[]}
[null,null,"REGULATORY REPORTING STATEMENT"]
[null,null,{"$f":"TradingName","v":"Ergon Energy"}]
[null,null,{"$f":"CONCATENATE(\"Benchmarking RIN response \",CRY)","v":"Benchmarking RIN response 2013-14"}]
[null,null,"3.4 OPERATIONAL DATA"]
[]
[]
[null,null,null,null,"Standard control services"]
[null,null,null,null,"Actual"]
[null,null,null,null,{"$f":"CRY","v":"2013-14"}]
[null,null,null,"Unit"]
[null,null,"TABLE 3.4.1 - ENERGY DELIVERY"]
["ED_OPD3410_00001","DOPED01","Total energy delivered","GWh",13716.244895035559]
[]
[]
[null,null,"Table 3.4.1.1 Energy grouping - delivery by chargeable quantity"]
["ED_OPD3411_00001","DOPED0201","Energy Delivery where time of use is not a determinant","GWh",12785.988396828019]
["ED_OPD3411_00002","DOPED0202","Energy Delivery at On-peak times","GWh",0]
["ED_OPD3411_00003","DOPED0203","Energy Delivery at Shoulder times ","GWh",0]
["ED_OPD3411_00004","DOPED0204","Energy Delivery at Off-peak times","GWh",0]
["ED_OPD3411_00005","DOPED0205","Controlled load energy deliveries","GWh",846.0221603095398]
["ED_OPD3411_00005","DOPED0206","Energy Delivery to unmetered supplies","GWh",84.234337897999993]
[]
[null,null,"Table 3.4.1.2 Energy - received from TNSP and other DNSPs by time of receipt"]
["ED_OPD3412_00001","DOPED0301","Energy into DNSP network  at On-peak times","GWh",0]
["ED_OPD3412_00002","DOPED0302","Energy into DNSP network  at Shoulder times ","GWh",0]
["ED_OPD3412_00003","DOPED0303","Energy into DNSP network  at Off-peak times","GWh",0]
["ED_OPD3412_00004","DOPED0304","Energy received from TNSP and other DNSPs not included in the above categories","GWh",12954.433850206671]
[]
[null,null,"Table 3.4.1.3 Energy - received into DNSP system from embedded generation by time of receipt"]
["ED_OPD3413_00001","DOPED0401","Energy into DNSP network  at On-peak times from non-residential embedded generation","GWh",0]
{"$rows_left_out":101}
{"sheet":"3.5 Physical assets","index":7,"n_rows":95,"n_cols":5,"rows_kept":95,"cut":false,"hidden":false,"merged":[]}
[null,null,"REGULATORY REPORTING STATEMENT"]
[null,null,{"$f":"TradingName","v":"Ergon Energy"}]
[null,null,{"$f":"CONCATENATE(\"Benchmarking RIN response \",CRY)","v":"Benchmarking RIN response 2013-14"}]
[null,null,"3.5 PHYSICAL ASSETS"]
[]
[]
[]
[null,null,null,null,"Actual"]
[null,null,null,null,{"$f":"CRY","v":"2013-14"}]
[null,null,null,"Unit"]
[null,null,"TABLE 3.5.1 - NETWORK CAPACITIES"]
[null,null,"Circuit length"]
[null,null,"Table 3.5.1.1 Overhead network length of circuit at each voltage"]
["ED_PHA3511_00001","DPA0101","Overhead low voltage distribution","km",{"$f":"'[2]3.5 Physical assets_CON_Recast'!K13","v":16269.9878992256}]
["ED_PHA3511_00002","DPA0102","Overhead 2.2 kV","km",{"$f":"'[2]3.5 Physical assets_CON_Recast'!K14","v":0}]
["ED_PHA3511_00003","DPA0103","Overhead 6.6kv","km",{"$f":"'[2]3.5 Physical assets_CON_Recast'!K15","v":13.869708546343}]
["ED_PHA3511_00004","DPA0104","Overhead 7.6 kV","km",{"$f":"'[2]3.5 Physical assets_CON_Recast'!K16","v":0}]
["ED_PHA3511_00005","DPA0105","Overhead 11 kV","km",{"$f":"'[2]3.5 Physical assets_CON_Recast'!K17","v":34516.278178926601}]
["ED_PHA3511_00006","DPA0106","Overhead SWER","km",{"$f":"'[2]3.5 Physical assets_CON_Recast'!K18","v":62418.436787662897}]
["ED_PHA3511_00007","DPA0107","Overhead 22 kV","km",{"$f":"'[2]3.5 Physical assets_CON_Recast'!K19","v":14595.6082314532}]
["ED_PHA3511_00008","DPA0108","Overhead 33 kV","km",{"$f":"'[2]3.5 Physical assets_CON_Recast'!K20","v":4058.7885095225301}]
["ED_PHA3511_00009","DPA0109","Overhead 44 kV","km",{"$f":"'[2]3.5 Physical assets_CON_Recast'!K21","v":0}]
["ED_PHA3511_00010","DPA0110","Overhead 66 kV","km",{"$f":"'[2]3.5 Physical assets_CON_Recast'!K22","v":7836.3389152908503}]
["ED_PHA3511_00011","DPA0111","Overhead 110kV","km",{"$f":"'[2]3.5 Physical assets_CON_Recast'!K23","v":504.81396174215098}]
["ED_PHA3511_00012","DPA0112","Overhead 132 kV","km",{"$f":"'[2]3.5 Physical assets_CON_Recast'!K24","v":2404.1120478256398}]
["ED_PHA3511_00013","DPA0113","Overhead 220kV","km",{"$f":"'[2]3.5 Physical assets_CON_Recast'!K25","v":0}]
["ED_PHA3511_00014","DPA0114","Other ","km",{"$f":"'[2]3.5 Physical assets_CON_Recast'!K26","v":2.3590224832609901E-2}]
[null,"DPA01","Total overhead circuit km","km",{"$f":"SUM(E14:E27)","v":142618.25783042065}]
[]
[null,null,"Table 3.5.1.2 Underground network circuit length at each voltage"]
{"$rows_left_out":66}
{"sheet":"3.6 Quality of service","index":8,"n_rows":32,"n_cols":5,"rows_kept":32,"cut":false,"hidden":false,"merged":[]}
[null,null,"REGULATORY REPORTING STATEMENT"]
[null,null,{"$f":"TradingName","v":"Ergon Energy"}]
[null,null,{"$f":"CONCATENATE(\"Benchmarking RIN response \",CRY)","v":"Benchmarking RIN response 2013-14"}]
[null,null,"3.6 QUALITY OF SERVICE DATA"]
[]
[]
[]
[null,null,null,null,"Actual"]
[null,null,null,null,{"$f":"CRY","v":"2013-14"}]
[null,null,null,"Unit"]
[null,null,"TABLE 3.6.1 - RELIABILITY"]
[null,null,"Table 3.6.1.1 Inclusive of MEDs"]
["ED_QOS3611_00001","DQS0101","Whole of network unplanned SAIDI","minutes/customer",327.24170000000004]
["ED_QOS3611_00002","DQS0102","Whole of network unplanned SAIDI excluding excluded outages","minutes/customer",325.67060000000004]
["ED_QOS3611_00003","DQS0103","Whole of network unplanned SAIFI","interruptions/customer",2.6623000000000001]
["ED_QOS3611_00004","DQS0104","Whole of network unplanned SAIFI excluding excluded outages","interruptions/customer",2.6314000000000002]
[null,null,"Table 3.6.1.2 Exclusive of MEDs"]
["ED_QOS3612_00001","DQS0105","Whole of network unplanned SAIDI","minutes/customer",229.54250000000002]
["ED_QOS3612_00002","DQS0106","Whole of network unplanned SAIDI excluding excluded outages","minutes/customer",228.05540000000002]
["ED_QOS3612_00003","DQS0107","Whole of network unplanned SAIFI","interruptions/customer",2.3479000000000001]
["ED_QOS3612_00004","DQS0108","Whole of network unplanned SAIFI excluding excluded outages","interruptions/customer",2.3170000000000002]
[]
[null,null,"TABLE 3.6.2 - ENERGY NOT SUPPLIED"]
["ED_QOS362_00001","DQS0201","Energy Not Supplied (planned)","GWh",1.4897653834302755]
["ED_QOS362_00002","DQS0202","Energy Not Supplied (unplanned)","GWh",6.1264410306965722]
[null,"DQS02","Total","GWh",{"$f":"SUM(E24:E25)","v":7.6162064141268475}]
[]
[null,null,"TABLE 3.6.3 - SYSTEM LOSSES"]
["ED_QOS363_00001","DQS03","System losses","%",4.8652482899147073E-2]
[]
{"$rows_left_out":3}
{"sheet":"3.7 Operating environment","index":9,"n_rows":33,"n_cols":5,"rows_kept":33,"cut":false,"hidden":false,"merged":[]}
[null,null,"REGULATORY REPORTING STATEMENT"]
[null,null,{"$f":"TradingName","v":"Ergon Energy"}]
[null,null,{"$f":"CONCATENATE(\"Benchmarking RIN response \",CRY)","v":"Benchmarking RIN response 2013-14"}]
[null,null,"3.7 OPERATING ENVIRONMENT FACTORS"]
[]
[]
[]
[null,null,null,null,"Actual"]
[null,null,null,null,{"$f":"CRY","v":"2013-14"}]
[]
[null,null,"TABLE 3.7.1 - DENSITY FACTORS"]
["ED_OEF371_00001","DOEF0101","Customer density","Customer / km",5.0895875233456795]
["ED_OEF371_00002","DOEF0102","Energy density","MWh/customer",18.999411154870362]
["ED_OEF371_00003","DOEF0103","Demand density","kVA / customer",4.7468826617539106]
[]
[null,null,"TABLE 3.7.2 - TERRAIN FACTORS"]
["ED_OEF372_00001","DOEF0201","Rural proportion","%",0.9]
["ED_OEF372_00002","DOEF0202","Urban and CBD vegetation maintenance spans","Number of spans",126444.48911926229]
["ED_OEF372_00003","DOEF0203","Rural vegetation maintenance spans","Number of spans",182652.48687350837]
["ED_OEF372_00004","DOEF0204","Total vegetation maintenance spans","Number of spans",309096.97599277063]
["ED_OEF372_00005","DOEF0205","Total number of spans","Number of spans",1030702.9859590832]
["ED_OEF372_00006","DOEF0206","Average urban and CBD vegetation maintenance span cycle","Years",1.7]
["ED_OEF372_00007","DOEF0207","Average rural vegetation maintenance span cycle","Years",2.7]
["ED_OEF372_00008","DOEF0208","Average number of trees per urban and CBD vegetation maintenance span","Trees",2.6]
["ED_OEF372_00009","DOEF0209","Average number of trees per rural vegetation maintenance span","Trees",6.8]
["ED_OEF372_00010","DOEF0210","Average number of defects per urban and CBD vegetation maintenance span","Defects",0.52873980995898018]
["ED_OEF372_00011","DOEF0211","Average number of defects per rural vegetation maintenance span","Defects",0.37177402966876644]
["ED_OEF372_00012","DOEF0212","Tropical proportion","Spans",536375.94339233567]
["ED_OEF372_00013","DOEF0213","Standard vehicle access","km",50958.472354672034]
["ED_OEF372_00014","DOEF0214","Bushfire risk","Spans",4210.8066720718562]
{"$rows_left_out":4}
{"sheet":"3.7.4 Weather stations","index":10,"n_rows":1100,"n_cols":6,"rows_kept":1100,"cut":false,"hidden":false,"merged":[]}
[null,null,"REGULATORY REPORTING STATEMENT"]
[null,null,{"$f":"TradingName","v":"Ergon Energy"}]
[null,null,{"$f":"CONCATENATE(\"Benchmarking RIN response \",CRY)","v":"Benchmarking RIN response 2013-14"}]
[null,null,"3.7 OPERATING ENVIRONMENT FACTORS"]
[]
[]
[null,null,"TABLE 3.7.4  - WEATHER STATIONS"]
[]
[null,null,"Weather Station ID","Post code","Suburb","Materiality"]
["ED_OEF374_00001",null,45000,4474,"ADAVALE","No"]
["ED_OEF374_00002",null,33295,4807,"ALVA","Yes"]
["ED_OEF374_00003",null,41175,4378,"APPLETHORPE","Yes"]
["ED_OEF374_00004",null,31193,4883,"ATHERTON","No"]
["ED_OEF374_00005",null,33002,4807,"MCDESME","Yes"]
["ED_OEF374_00006",null,45009,4871,"DURHAM","Yes"]
["ED_OEF374_00007",null,39004,4702,"BARALABA","No"]
["ED_OEF374_00008",null,36007,4725,"BARCALDINE","No"]
["ED_OEF374_00009",null,38000,4829,"BEDOURIE","No"]
["ED_OEF374_00010",null,39006,4715,"DAKENBA","No"]
["ED_OEF374_00011",null,38026,4482,"BIRDSVILLE","Yes"]
["ED_OEF374_00012",null,38002,4482,"BIRDSVILLE","No"]
["ED_OEF374_00013",null,36034,4472,"BLACKALL","Yes"]
["ED_OEF374_00014",null,36143,4472,"BLACKALL","No"]
["ED_OEF374_00015",null,35134,4702,"STEWARTON","Yes"]
["ED_OEF374_00016",null,35290,4717,"BLACKWATER","No"]
["ED_OEF374_00017",null,44010,4488,"BOLLON","No"]
["ED_OEF374_00018",null,32061,4860,"STOTERS HILL","No"]
["ED_OEF374_00019",null,38003,4829,"BOULIA","No"]
["ED_OEF374_00020",null,33257,4805,"BOWEN","No"]
["ED_OEF374_00021",null,33007,4805,"BOWEN","No"]
{"$rows_left_out":1071}
{"sheet":"Unlocked worksheet","index":11,"n_rows":0,"n_cols":0,"rows_kept":0,"cut":false,"hidden":false,"merged":[]}