{"text_format":"1","workbook":"xlsx","n_sheets":24,"sheets":["AER only","Contents","Instructions","Business & other details","2.11 Labour","3.6 Quality of services","3.6.8 Network-feeders","3.6.9 Network-reliability","4.1 Public lighting","6.2 STPIS Reliability","6.6 STPIS Customer Service","6.7 STPIS Daily Performance","6.8 STPIS Exclusions","6.9 STPIS - GSL","7.8 Avoided TUOS Payments","7.10 Juris Scheme","7.11 DMIS-DMIA","7.12 Safety and Bushfire","7.13 TARC","8.1 Income","8.2 Capex","8.4 Opex","9.5 TUoS","unlocked"],"not_rendered":{"charts":0,"images":4,"macros":1,"external_links":0,"defined_names":375,"comments":2,"pivot_tables":0},"unopened":[],"bounds":{"document_bytes":16777216,"sheet_cells":100000,"rows_first":2000,"rows_last":500,"rows_between":2000,"halvings":0,"cell_chars":16384,"cell_head_chars":4096},"cells_cut":0,"cells_raw":0,"read":"whole","date_system":"1900"}

{"sheet":"AER only","index":0,"n_rows":74,"n_cols":23,"rows_kept":74,"cut":false,"hidden":true,"merged":[[0,1,0,9],[18,13,18,16]]}
[null,"Data in this worksheet is used for data validation and database purposes."]
[null,"Date last modified:"]
[null,"14 April 2015","merged cell C46/47"]
[null,"17 April 2015","adjusted dms_RYE to automate based on dms_Model (NB: EB & CA refer to CRCP_y5)"]
[null,"14 May 2015","adapted this cover for use in CA & EB RINs"]
[]
[null,"October 2015","added full Trading Name for worksheet headings"]
[null,"USES NAMED RANGES FLAG","yes"]
[null,"dms_Model_List ","dms_Worksheet_List ",null,"dms_RYE_Formula_Result"]
[null,"ARR","REGULATORY REPORTING STATEMENT",null,{"$f":"LEFT(CRY,2)&RIGHT(CRY,2)","v":"2017"}]
[null,"CA","CATEGORY ANALYSIS",null,{"$f":"LEFT(CRY,2)&RIGHT(CRY,2)","v":"2017"}]
[null,"CAM/Service change Backcast","REGULATORY REPORTING STATEMENT",null,{"$f":"LEFT(dms_FRCP_FinalYear_Num,2)&RIGHT(dms_FRCP_FinalYear_Num,2)","v":"2021"}]
[null,"CPI","CPI"]
[null,"EB","ECONOMIC BENCHMARKING",null,{"$f":"LEFT(CRY,2)&RIGHT(CRY,2)","v":"2017"}]
[null,"PTRM","POST TAX REVENUE MODEL",null,{"$f":"LEFT(dms_FRCP_FinalYear_Num,2)&RIGHT(dms_FRCP_FinalYear_Num,2)","v":"2021"}]
[null,"Reset","REGULATORY REPORTING STATEMENT",null,{"$f":"LEFT(dms_FRCP_FinalYear_Num,2)&RIGHT(dms_FRCP_FinalYear_Num,2)","v":"2021"}]
[null,"RFM","ROLL FORWARD MODEL",null,{"$f":"LEFT(dms_CRCP_FinalYear_Num,2)&RIGHT(dms_CRCP_FinalYear_Num,2)","v":"2015"}]
[null,"WACC","WEIGHTED AVERAGE COST OF CAPITAL"]
[null,null,null,null,null,null,null,null,null,null,null,null,null,"Feeder Types",null,null,null,"TasNetworks (D)"]
[null,null,null,null,null,null,null,null,null,null,null,null,null,"CBD","Urban","Short rural","long rural","EXTRA"]
[null,"dms_TradingName_List","dms_TradingNameFull_List","dms_ABN_List","dms_State_List","dms_Sector_List","dms_Segment_List","dms_FormControl_List","dms_CRCPlength_List","dms_FRCPlength_List","dms_JurisdictionList","dms_663_List","dms_DeterminationRef_List","dms_CBD_flag","dms_Urban_flag","dms_ShortRural_flag","dms_LongRural_flag","dms_FeederType_5_flag","dms_FeederName_1","dms_FeederName_2","dms_FeederName_3","dms_FeederName_4","dms_FeederName_5"]
[null,"ActewAGL Distribution","ActewAGL Distribution",76670568688,"ACT","Electricity","Distribution","Revenue cap",5,6,"ACT",5,"2014-19 Distribution Determination","NO","YES","YES","NO","NO","CBD","Urban","Short rural","Long rural"]
[null,"ActewAGL Distribution (Tx Assets)","ActewAGL Distribution (Tx Assets)",76670568688,"ACT","Electricity","Distribution","Revenue cap",5,5,"ACT",5,"distribution determination",null,null,null,null,null,"CBD","Urban","Short rural","Long rural"]
[null,"AGN","AGN",78551685,"SA","Gas","Distribution","Revenue cap",5,5,"SA",5,"distribution determination",null,null,null,null,null,"CBD","Urban","Short rural","Long rural"]
[null,"Ausgrid","Ausgrid",67505337385,"NSW","Electricity","Distribution","Revenue cap",5,5,"NSW",5,"2014-19 Distribution Determination","YES","YES","YES","YES","NO","CBD","Urban","Short rural","Long rural"]
[null,"Ausgrid (Tx Assets)","Ausgrid (Tx Assets)",67505337385,"NSW","Electricity","Distribution","Revenue cap",5,5,"NSW",5,"distribution determination",null,null,null,null,null,"CBD","Urban","Short rural","Long rural"]
[null,"AusNet (D)","AusNet Electricity Services",91064651118,"Vic","Electricity","Distribution","Revenue cap",5,5,"Vic",2,"2016-20 Distribution Determination","NO","YES","YES","YES","NO","CBD","Urban","Short rural","Long rural"]
[null,"AusNet (T)","AusNet (T)",48116124362,"Vic","Electricity","Transmission","Revenue cap",5,5,"Vic",2,"distribution determination",null,null,null,null,null,"CBD","Urban","Short rural","Long rural"]
[null,"Australian Distribution Co.","Australian Distribution Co.",11222333444,"-","Electricity","Distribution","Revenue cap",5,5,"NSW",2,"distribution determination",null,null,null,null,null,"CBD","Urban","Short rural","Long rural"]
[null,"Australian Transmission Co.","Australian Transmission Co.",11222333444,"-","Electricity","Transmission","Revenue cap",5,5,"Vic",5,"distribution determination",null,null,null,null,null,"CBD","Urban","Short rural","Long rural"]
[null,"CitiPower","CitiPower",76064651056,"Vic","Electricity","Distribution","Revenue cap",5,5,"Vic",2,"2016-20 Distribution Determination","YES","YES","NO","NO","NO","CBD","Urban","Short rural","Long rural"]
[null,"Directlink","Directlink",16779340889,"NSW","Electricity","Transmission","Revenue cap",10,5,"Qld",5,"distribution determination",null,null,null,null,null,"CBD","Urban","Short rural","Long rural"]
[null,"ElectraNet","ElectraNet",41094482416,"SA","Electricity","Transmission","Revenue cap",5,5,"SA",5,"distribution determination",null,null,null,null,null,"CBD","Urban","Short rural","Long rural"]
[null,"Endeavour Energy","Endeavour Energy",59253130878,"NSW","Electricity","Distribution","Revenue cap",5,5,"NSW",5,"2014-19 Distribution Determination","NO","YES","YES","YES","NO","CBD","Urban","Short rural","Long rural"]
[null,"Energex","Energex",40078849055,"Qld","Electricity","Distribution","Revenue cap",5,5,"Qld",5,"2015-20 Distribution Determination","YES","YES","YES","NO","NO","CBD","Urban","Short rural","Long rural"]
[null,"Ergon Energy","Ergon Energy",50087646062,"Qld","Electricity","Distribution","Revenue cap",5,5,"Qld",5,"2015-20 Distribution Determination","NO","YES","YES","YES","NO","CBD","Urban","Short rural","Long rural"]
[null,"Essential Energy","Essential Energy",37428185226,"NSW","Electricity","Distribution","Revenue cap",5,5,"NSW",5,"2014-19 Distribution Determination","NO","YES","YES","YES","NO","CBD","Urban","Short rural","Long rural"]
[null,"Jemena Electricity","Jemena Electricity",82064651083,"Vic","Electricity","Distribution","Revenue cap",5,5,"Vic",2,"2016-20 Distribution Determination","NO","YES","YES","NO","NO","CBD","Urban","Short rural","Long rural"]
[null,"Murraylink","Murraylink",79181207909,"NSW","Electricity","Transmission","Revenue cap",5,5,"SA",5,"distribution determination",null,null,null,null,null,"CBD","Urban","Short rural","Long rural"]
[null,"Powercor Australia","Powercor Australia",89064651109,"Vic","Electricity","Distribution","Revenue cap",5,5,"Vic",2,"2016-20 Distribution Determination","NO","YES","YES","YES","NO","CBD","Urban","Short rural","Long rural"]
[null,"Powerlink","Queensland Electricity Transmission Corporation Limited trading as Powerlink Queensland",82078849233,"Qld","Electricity","Transmission","Revenue cap",5,5,"Qld",5,"distribution determination",null,null,null,null,null,"CBD","Urban","Short rural","Long rural"]
[null,"Qld,SA &ACT Gas Reset","Qld,SA &ACT Gas Reset",22222222222,"-","Gas","Distribution","?",5,5,"-","x","distribution determination",null,null,null,null,null,"CBD","Urban","Short rural","Long rural"]
[null,"SA Power Networks","SA Power Networks",13332330749,"SA","Electricity","Distribution","Revenue cap",5,5,"SA",5,"2015-20 Distribution Determination","YES","YES","YES","YES","NO","CBD","Urban","Short rural","Long rural"]
[null,"TasNetworks (D)","TasNetworks (D)",24167357299,"Tas","Electricity","Distribution","Revenue cap",5,5,"Tas",5,"distribution determination","YES","YES","YES","YES","YES","Critical Infrastructure","High density commercial","Urban","High density rural","Low density rural"]
[null,"TasNetworks (T)","TasNetworks (T)",24167357299,"Tas","Electricity","Transmission","Revenue cap",5,5,"Tas",5,"distribution determination",null,null,null,null,null,"CBD","Urban","Short rural","Long rural"]
[null,"TransGrid","TransGrid",19622755774,"NSW","Electricity","Transmission","Revenue cap",5,5,"NSW",5,"distribution determination",null,null,null,null,null,"CBD","Urban","Short rural","Long rural"]
[null,"United Energy","United Energy",70064651029,"Vic","Electricity","Distribution","Revenue cap",5,5,"Vic",2,"2016-20 Distribution Determination","NO","YES","YES","NO","NO","CBD","Urban","Short rural","Long rural"]
[null,"DNSP Backcasting","Victorian DNSP Backcasting",33333333666,"Vic","Electricity","Distribution","?",5,5,"-","x","distribution determination",null,null,null,null,null,"CBD","Urban","Short rural","Long rural"]
[null,"DNSP Reset ","Victorian DNSP Reset ",33333333333,"Vic","Electricity","Distribution","?",5,5,"-","x","distribution determination",null,null,null,null,null,"CBD","Urban","Short rural","Long rural"]
[]
[]
[]
[]
[null,"dms_SourceList","dms_FormControl_Choices",null,"dms_FRCPlength_Num_List","dms_FinalYear_List"]
[null,"After appeal","Revenue cap",null,1,"FRCP_y1"]
[null,"Draft decision","Revenue yield",null,2,"FRCP_y2"]
[null,"Final decision","Weighted average price cap",null,3,"FRCP_y3"]
[null,"Pass through decision",null,null,4,"FRCP_y4"]
[null,"PTRM annual update",null,null,5,"FRCP_y5"]
[null,"PTRM interim update 1",null,null,6,"FRCP_y6"]
[null,"PTRM interim update 2",null,null,7,"FRCP_y7"]
[null,"PTRM interim update 3",null,null,8,"FRCP_y8"]
[null,"PTRM interim update 4",null,null,9,"FRCP_y9"]
[null,"Regulatory proposal",null,null,10,"FRCP_y10"]
[null,"Reporting"]
[null,"Revised regulatory proposal"]
[null,"RFM annual update"]
[null,"WACC annual update"]
[]
[]
[null,"Notes"]
[null,"RFM - Base year is usually CRCP_y1","EG. Victorian 2016-20 - base year = 2011"]
[null,"RFM - Form of Control Field is not relevant"]
[null,"PTRM - capture base year input by NSP","=PTRM input'!Q7"]

{"sheet":"Contents","index":1,"n_rows":31,"n_cols":4,"rows_kept":31,"cut":false,"hidden":false,"merged":[[2,1,2,3],[3,1,3,3],[4,1,4,3]]}
[]
[]
[null,{"$f":"CONCATENATE(dms_Segment,\" Network Service Provider\")","v":"Distribution Network Service Provider"}]
[null,"Annual Reporting RIN Template"]
[null,"Table of Contents"]
[]
[]
[null,null,"Instructions"]
[null,null,"Business & other details"]
[]
[]
[null,"CATEGORY ANALYSIS","STPIS","STATUTORY ACCOUNTS"]
[]
[null,"2.11 Labour","6.2 STPIS Reliability","8.1 Income"]
[null,null,"6.6 STPIS Customer Service","8.2 Capex"]
[null,null,"6.7 STPIS Daily Performance"]
[null,null,"6.8 STPIS Exclusions","8.4 Opex"]
[null,null,"6.9 STPIS GSL"]
[]
[]
[]
[null,"NETWORK PERFORMANCE","OTHER INFORMATION","PRICING PROPOSAL"]
[null,null,null,"Victorian Businesses Only"]
[null,"3.6 Quality of services","7.8 Avoided Cost Payments"]
[null,"3.6.8 Network-feeders","7.10 Juris Scheme","9.5 TUoS"]
[null,"3.6.9 Network-reliability","7.11 DMIS-DMIA"]
[null,null,"7.12 Safety and Bushfire"]
[null,null,"7.13 TARC"]
[null,"PUBLIC LIGHTING"]
[]
[null,"4.1 Public lighting tariffs"]

{"sheet":"Instructions","index":2,"n_rows":26,"n_cols":6,"rows_kept":26,"cut":false,"hidden":false,"merged":[[17,2,17,4],[19,2,19,4],[25,2,25,4],[7,1,7,5],[8,1,8,5],[14,2,14,4],[10,2,10,4],[16,2,16,3]]}
[]
[]
[]
[]
[]
[]
[]
[null,{"$f":"CONCATENATE(dms_Segment,\" Network Service Provider\")","v":"Distribution Network Service Provider"}]
[null,"Annual Reporting RIN Template"]
[]
[null,null,{"$f":"CONCATENATE(\"This template is to be used by \",dms_TradingName, \" to fulfil its annual reporting obligations to the AER.\")","v":"This template is to be used by Ergon Energy to fulfil its annual reporting obligations to the AER."}]
[null,null,null,null,null,"Amendments made December 2015"]
[null,null,null,null,null,"Click here for details."]
[null,null,"INSTRUCTIONS"]
[null,null,"Complete the Business & other details worksheet before entering data or values in any other worksheets. The Business & other details worksheet is linked to other cells within the workbook and automatically generates certain column headings and conditional formatting."]
[]
[null,null,"Identifying CONFIDENTIAL INFORMATION:\n\nPlease use the macro at the top of each \nworksheet to identify confidential information. \n\n"]
[null,null,"-Do this by selecting the cell or cells that contain confidential information and then run the Mark selected cells as CONFIDENTIAL macro. This will format the cells a specific colour that is identified by the AER's database which in turn marks that information as confidential.\n\n-To reverse this, select the cell or cells and run the Return cells to NON-CONFIDENTIAL macro"]
[]
[null,null,"All amounts are to be unrounded and reported in nominal terms on a one for one basis: that is 1000 is to be entered as '1000' not '1' as in previous templates.\n\nColour coding of input sheets:"]
[null,null,null,"Yellow = Input cells"]
[null,null,null,"Grey = Not applicable/No inputs required"]
[null,null,null,"Leave coloured cells blank if no information exists. \nPLEASE DO NOT ENTER TEXT into cells that are to contain numeric data."]
[]
[]
[null,null,"Returning completed responses\n\nPlease return two (2) files to the AER: \n1. A confidential version which must contain a complete set of all responses with confidential information marked using the Mark selected cells CONFIDENTIAL macro and which has been completed using the locked template file provided by the AER. \n\n2. A public version with confidential information either removed completely or aggregated in some form together with writtten consent to disclose the public version of the response.\n\nUse the drop down box on the Business and other details worksheet to identify the file as either confidential ('consolidated') or public. "]

{"sheet":"Business & other details","index":3,"n_rows":78,"n_cols":13,"rows_kept":78,"cut":false,"hidden":false,"merged":[[6,2,6,9],[11,2,11,9],[32,2,32,9],[28,6,28,7],[29,6,29,7],[19,3,19,4],[22,3,22,4],[17,3,17,4],[24,3,24,4],[28,3,28,4],[29,3,29,4],[30,3,30,4],[17,5,17,8],[18,5,18,8],[19,5,19,8],[22,5,22,8],[13,3,13,4],[14,3,14,4],[30,6,30,7],[71,4,71,9],[48,3,48,4],[50,3,50,9],[23,5,23,8],[24,5,24,8]]}
[null,null,{"$f":"(LOOKUP(dms_Model,dms_Model_List,dms_Worksheet_List))","v":"REGULATORY REPORTING STATEMENT"}]
[null,null,{"$f":"dms_TradingName","v":"Ergon Energy"}]
[null,null,{"$f":"CONCATENATE(\"Annual Reporting RIN Response \",CRY)","v":"Annual Reporting RIN Response 2016-17"}]
[null,null,"BUSINESS & OTHER DETAILS"]
[]
[null,null,"Instructions"]
[null,null,"Complete the following business details regulatory template before entering data or values in any other regulatory templates. This regulatory template is linked to other cells within these worksheets and is used to automatically generate some column headings and to apply conditional formatting to certain cells."]
[]
[]
[null,null,"SUBMISSION PARTICULARS INPUT SHEETS"]
[]
[null,null,"ENTITY DETAILS"]
[]
[null,null,"Short name","Ergon Energy"]
[null,null,"ACN / ABN",{"$f":"INDEX(dms_ABN_List,MATCH(dms_TradingName,dms_TradingName_List))","v":50087646062}]
[]
[]
[null,null,"Business address","Address 1",null,"420 Flinders Street"]
[null,null,null,null,"Address 2"]
[null,null,null,"Suburb",null,"TOWNSVILLE"]
[null,null,null,null,"State",{"$f":"INDEX(dms_State_List,MATCH(dms_TradingName,dms_TradingName_List))","v":"Qld"},"p/code",4810]
[]
[null,null,"Postal address","Address 1",null,"GPO Box 1461"]
[null,null,null,null,"Address 2"]
[null,null,null,"Suburb",null,"BRISBANE"]
[null,null,null,null,"State","Qld","p/code",4001]
[]
[]
[null,null,"Contact name/s","Jenny Doyle",null,null,"General Manager Regulation and Pricing"]
[null,null,"Contact phone/s","(07) 3851 6416"]
[null,null,"Contact email address/s"," jenny.doyle@energyq.com.au"]
[]
[null,null,"REGULATORY CONTROL PERIODS"]
[]
[null,null,"Forthcoming regulatory control period","2016-17",{"$f":"IF(dms_RPT=\"financial\",VALUE(LEFT(FRCP_y1,4)+1)&\"-\"&VALUE(MID(FRCP_y1,3,2)+2),VALUE(LEFT(FRCP_y1,4)+1))","v":"2017-18"},{"$f":"IF(dms_RPT=\"financial\",VALUE(LEFT(FRCP_y2,4)+1)&\"-\"&VALUE(MID(FRCP_y2,3,2)+2),VALUE(LEFT(FRCP_y2,4)+1))","v":"2018-19"},{"$f":"IF(dms_RPT=\"financial\",VALUE(LEFT(FRCP_y3,4)+1)&\"-\"&VALUE(MID(FRCP_y3,3,2)+2),VALUE(LEFT(FRCP_y3,4)+1))","v":"2019-20"},{"$f":"IF(dms_RPT=\"financial\",VALUE(LEFT(FRCP_y4,4)+1)&\"-\"&VALUE(MID(FRCP_y4,3,2)+2),VALUE(LEFT(FRCP_y4,4)+1))","v":"2020-21"},{"$f":"IF(dms_RPT=\"financial\",VALUE(LEFT(FRCP_y5,4)+1)&\"-\"&VALUE(MID(FRCP_y5,3,2)+2),VALUE(LEFT(FRCP_y5,4)+1))","v":"2021-22"},{"$f":"IF(dms_RPT=\"financial\",VALUE(LEFT(FRCP_y6,4)+1)&\"-\"&VALUE(MID(FRCP_y6,3,2)+2),VALUE(LEFT(FRCP_y6,4)+1))","v":"2022-23"},{"$f":"IF(dms_RPT=\"financial\",VALUE(LEFT(FRCP_y7,4)+1)&\"-\"&VALUE(MID(FRCP_y7,3,2)+2),VALUE(LEFT(FRCP_y7,4)+1))","v":"2023-24"},{"$f":"IF(dms_RPT=\"financial\",VALUE(LEFT(FRCP_y8,4)+1)&\"-\"&VALUE(MID(FRCP_y8,3,2)+2),VALUE(LEFT(FRCP_y8,4)+1))","v":"2024-25"},{"$f":"IF(dms_RPT=\"financial\",VALUE(LEFT(FRCP_y9,4)+1)&\"-\"&VALUE(MID(FRCP_y9,3,2)+2),VALUE(LEFT(FRCP_y9,4)+1))","v":"2025-26"}]
[]
[]
[null,null,"Current regulatory control period",{"$f":"IF(dms_RPT=\"financial\",VALUE(LEFT(CRCP_y2,4)-1)&\"-\"&TEXT(VALUE(RIGHT(CRCP_y2,2)-1),\"0#\"),VALUE(LEFT(CRCP_y2,4)-1))","v":"2011-12"},{"$f":"IF(dms_RPT=\"financial\",VALUE(LEFT(CRCP_y3,4)-1)&\"-\"&TEXT(VALUE(RIGHT(CRCP_y3,2)-1),\"0#\"),VALUE(LEFT(CRCP_y3,4)-1))","v":"2012-13"},{"$f":"IF(dms_RPT=\"financial\",VALUE(LEFT(CRCP_y4,4)-1)&\"-\"&TEXT(VALUE(RIGHT(CRCP_y4,2)-1),\"0#\"),VALUE(LEFT(CRCP_y4,4)-1))","v":"2013-14"},{"$f":"IF(dms_RPT=\"financial\",VALUE(LEFT(CRCP_y5,4)-1)&\"-\"&TEXT(VALUE(RIGHT(CRCP_y5,2)-1),\"0#\"),VALUE(LEFT(CRCP_y5,4)-1))","v":"2014-15"},{"$f":"IF(dms_RPT=\"financial\",VALUE(LEFT(FRCP_y1,4)-1)&\"-\"&TEXT(VALUE(RIGHT(FRCP_y1,2)-1),\"0#\"),VALUE(LEFT(FRCP_y1,4)-1))","v":"2015-16"}]
[]
[]
[null,null,"Previous regulatory control period",{"$f":"IF(dms_RPT=\"financial\",VALUE(LEFT(PRCP_y2,4)-1)&\"-\"&TEXT(VALUE(MID(PRCP_y2,3,2)),\"0#\"),VALUE(LEFT(PRCP_y2,4)-1))","v":"2006-07"},{"$f":"IF(dms_RPT=\"financial\",VALUE(LEFT(PRCP_y3,4)-1)&\"-\"&TEXT(VALUE(MID(PRCP_y3,3,2)),\"0#\"),VALUE(LEFT(PRCP_y3,4)-1))","v":"2007-08"},{"$f":"IF(dms_RPT=\"financial\",VALUE(LEFT(PRCP_y4,4)-1)&\"-\"&TEXT(VALUE(MID(PRCP_y4,3,2)),\"0#\"),VALUE(LEFT(PRCP_y4,4)-1))","v":"2008-09"},{"$f":"IF(dms_RPT=\"financial\",VALUE(LEFT(PRCP_y5,4)-1)&\"-\"&TEXT(VALUE(RIGHT(PRCP_y5,2)-1),\"0#\"),VALUE(LEFT(PRCP_y5,4)-1))","v":"2009-10"},{"$f":"IF(dms_RPT=\"financial\",VALUE(LEFT(CRCP_y1,4)-1)&\"-\"&TEXT(VALUE(RIGHT(CRCP_y1,2)-1),\"0#\"),VALUE(LEFT(CRCP_y1,4)-1))","v":"2010-11"}]
[]
[]
[null,null,"Current regulatory year","2016-17"]
[]
[]
[]
[]
[null,null,"Source","Reporting"]
[null,null,"Consolidated confidential or public version?","Consolidated"]
[null,null,"Amended RIN submission - amendment reason"]
[null,null,"EBSS - First application of scheme in forthcoming period?","No"]
[null,null,"Sector",{"$f":"INDEX(dms_Sector_List,MATCH(dms_TradingName,dms_TradingName_List))","v":"Electricity"},"dms_Sector","=INDEX(dms_Sector_List,MATCH(dms_TradingName,dms_TradingName_List))"]
[null,null,"Segment",{"$f":"INDEX(dms_Segment_List,MATCH(dms_TradingName,dms_TradingName_List))","v":"Distribution"},"dms_Segment","=INDEX(dms_Segment_List,MATCH(dms_TradingName,dms_TradingName_List))"]
[null,null,"Regulatory Year Ending",{"$f":"INDEX(dms_RYE_Formula_Result,MATCH(dms_Model,dms_Model_List))","v":"2017"},"dms_RYE","=INDEX(dms_RYE_Formula_Result,MATCH(dms_Model,dms_Model_List))"]
[null,null,"Reporting Period Type",{"$f":"IF(LEN(FRCP_y1)>4,\"Financial\",\"Calendar\")","v":"Financial"},"dms_RPT","=IF(LEN(FRCP_y1)>4,\"Financial\",\"Calendar\")"]
[null,null,"Model or RIN Type","ARR","dms_Model"]
[null,null,"Security Classification","Public","dms_Classification"]
[null,null,"Template - version no.",5,"dms_TemplateNumber"]
[null,null,"Dollar $ real  (the last month before the FRCP_y1)",{"$f":"CONCATENATE(IF(dms_RPT=\"Financial\",\"June \",\"December \"),VALUE((LEFT(FRCP_y1,2))&RIGHT(FRCP_y1,2))-1)","v":"June 2016"},"dms_DollarReal","=CONCATENATE(IF(dms_RPT=\"Financial\",\"June \",\"December \"),VALUE((LEFT(FRCP_y1,2))&RIGHT(FRCP_y1,2))-1)"]
[null,null,"Form of control",{"$f":"INDEX(dms_FormControl_List,MATCH(dms_TradingName,dms_TradingName_List))","v":"Revenue cap"},"dms_FormControl","=INDEX(dms_FormControl_List,MATCH(dms_TradingName,dms_TradingName_List))"]
[null,null,"RIN response - version no.",1,"dms_RINversion"]
[null,null,"Jurisdiction",{"$f":"INDEX(dms_JurisdictionList,MATCH(dms_TradingName,dms_TradingName_List))","v":"Qld"},"dms_Jurisdiction","=INDEX(dms_JurisdictionList,MATCH(dms_TradingName,dms_TradingName_List))"]
[null,null,"Length of current reg control period",{"$f":"INDEX(dms_CRCPlength_List,MATCH(dms_TradingName,dms_TradingName_List))","v":5},"dms_CRCPlength","=INDEX(dms_CRCPlength_List,MATCH(dms_TradingName,dms_TradingName_List))"]
[null,null,"Length of forthcoming reg control period",{"$f":"INDEX(dms_FRCPlength_List,MATCH(dms_TradingName,dms_TradingName_List))","v":5},"dms_FRCPlength","=INDEX(dms_FRCPlength_List,MATCH(dms_TradingName,dms_TradingName_List))"]
[null,null,"FRCP length in years",{"$f":"INDEX(dms_FRCPlength_List,MATCH(dms_TradingName,dms_TradingName_List))","v":5},"dms_FRCPlength_Num","=INDEX(dms_FRCPlength_List,MATCH(dms_TradingName,dms_TradingName_List))"]
[null,null,"FRCP Final Year Reference",{"$f":"INDEX(dms_FinalYear_List,MATCH(dms_FRCPlength_Num,dms_FRCPlength_Num_List))","v":"FRCP_y5"},"dms_FRCP_FinalYear","=INDEX(dms_FinalYear_List,MATCH(dms_FRCPlength_Num,dms_FRCPlength_Num_List))"]
[null,null,"FRCP Final Year",{"$f":"INDIRECT(dms_FRCP_FinalYear)","v":"2020-21"},"dms_FRCP_FinalYear_Num","=INDIRECT(dms_FRCP_FinalYear)"]
[null,null,"CRCP length in years",5,"dms_CRCPlength_Num","=INDEX(dms_CRCPlength_List,MATCH(dms_TradingName,dms_TradingName_List))"]
[null,null,"CRCP Final Year Reference","CRCP_y5","dms_CRCP_FinalYear","=INDEX(dms_CFinalYear_List,MATCH(dms_CRCPlength_Num,dms_CRCPlength_Num_List))"]
[null,null,"CRCP Final Year","2014-15","dms_CRCP_FinalYear_Num","=INDIRECT(dms_CRCP_FinalYear)"]
[null,null,"Backcast templates only - unit of measure ","$0s","If the cover sheet is for Backcast data ensure to apply dms_Backcast_UOM named range to this field. Otherwise, do not apply this named range."]
[null,null,"Table 6.6.3 - Public lighting repair - no. business days",{"$f":"INDEX(dms_663_List,MATCH(dms_TradingName,dms_TradingName_List))","v":5}]
[null,null,"Distribution Determination Reference",{"$f":"INDEX(dms_DeterminationRef_List,MATCH(dms_TradingName,dms_TradingName_List))","v":"2015-20 Distribution Determination"},"=dms_DeterminationRef"]
[null,null,"CBD Feeder for this business",{"$f":"INDEX(dms_CBD_flag,MATCH(dms_TradingName,dms_TradingName_List))","v":"NO"},"dms_CBD_flag_NSP"]
[null,null,"Urban Feeder for this business",{"$f":"INDEX(dms_Urban_flag,MATCH(dms_TradingName,dms_TradingName_List))","v":"YES"},"dms_Urban_flag_NSP"]
[null,null,"Short rural Feeder for this business",{"$f":"INDEX(dms_ShortRural_flag,MATCH(dms_TradingName,dms_TradingName_List))","v":"YES"},"dms_ShortRural_flag_NSP"]
[null,null,"Long rural Feeder for this business",{"$f":"INDEX(dms_LongRural_flag,MATCH(dms_TradingName,dms_TradingName_List))","v":"YES"},"dms_LongRural_flag_NSP"]

{"sheet":"2.11 Labour","index":4,"n_rows":36,"n_cols":4,"rows_kept":36,"cut":false,"hidden":false,"merged":[]}
[null,{"$f":"(LOOKUP(dms_Model,dms_Model_List,dms_Worksheet_List))","v":"REGULATORY REPORTING STATEMENT"}]
[null,{"$f":"dms_TradingName","v":"Ergon Energy"}]
[null,{"$f":"CONCATENATE(\"Annual Reporting RIN Response \",CRY)","v":"Annual Reporting RIN Response 2016-17"}]
[null,"2.11 LABOUR "]
[]
[null,"Tables 2.11.1 and 2.11.2 deliberately omitted."]
[]
[null,"2.11.3 - LABOUR / NON-LABOUR EXPENDITURE SPLIT"]
[null,"2.11.3.1 - Opex"]
[null,null,{"$f":"CRY","v":"2016-17"}]
[null,null,"$0's, nominal"]
[null,null,"Opex "]
[null,"In-house labour expenditure",183569398]
[null,"Labour expenditure outsourced to related parties",7046166]
[null,"Labour expenditure outsourced to unrelated parties",80199123]
[null,"Controllable non-labour expenditure",84626609]
[null,"Uncontrollable non-labour expenditure",""]
[null,"Total",{"$f":"SUM(C13:C17)","v":355441296}]
[]
[null,"Reconciliation with Opex worksheets - SCS","Opex"]
[null,"Total including margins",{"$f":"dms_Total_Actual_Opex","v":355441296},{"$f":"IF(C18=dms_Total_Actual_Opex,\"OK\",\"Error\")","v":"OK"}]
[]
[]
[null,"2.11.3.2 - Capex"]
[null,null,{"$f":"CRY","v":"2016-17"}]
[null,null,"$0's, nominal"]
[null,null,"Capex"]
[null,"In-house labour expenditure",206374958]
[null,"Labour expenditure outsourced to related parties",8865819]
[null,"Labour expenditure outsourced to unrelated parties",65382654]
[null,"Controllable non-labour expenditure",235222581]
[null,"Uncontrollable non-labour expenditure",""]
[null,"Total",{"$f":"SUM(C28:C32)","v":515846012}]
[]
[null,"Reconciliation with Capex & Opex worksheets - SCS","Capex"]
[null,"Total including margins",{"$f":"dms_Total_Actual_Capex","v":515846011.99999994},{"$f":"IF(C33=dms_Total_Actual_Capex,\"OK\",\"Error\")","v":"OK"}]

{"sheet":"3.6 Quality of services","index":5,"n_rows":71,"n_cols":4,"rows_kept":71,"cut":false,"hidden":false,"merged":[[6,2,7,2],[24,2,25,2],[24,1,25,1]]}
[null,{"$f":"(LOOKUP(dms_Model,dms_Model_List,dms_Worksheet_List))","v":"REGULATORY REPORTING STATEMENT"}]
[null,{"$f":"dms_TradingName","v":"Ergon Energy"}]
[null,{"$f":"CONCATENATE(\"Annual Reporting RIN Response \",CRY)","v":"Annual Reporting RIN Response 2016-17"}]
[null,"3.6 QUALITY OF SERVICES"]
[]
[null,"3.6.5 - QUALITY OF SUPPLY METRICS"]
[null,null,"Unit","Volume"]
[null,null,null,{"$f":"CRY","v":"2016-17"}]
[null,"Over voltage events - due to high voltage injection","number"]
[null,"Customers receiving over-voltage - due to high voltage injection","number"]
[null,"Over voltage events - due to lightning","number"]
[null,"Customers receiving over-voltage - due to lightning","number"]
[null,"Over voltage events - due to voltage regulation or other cause","number"]
[null,"Customers receiving over-voltage - due to voltage regulation or other cause","number"]
[null,"Voltage variations - steady state (zone sub)","number"]
[null,"Voltage variations - one minute (zone sub)","number"]
[null,"Voltage variations - 10 seconds (zone sub) Min<0.7","number"]
[null,"Voltage variations - 10 seconds (zone sub) Min<0.8","number"]
[null,"Voltage variations - 10 seconds (zone sub) Min<0.9","number"]
[null,"Voltage variations - steady state (feeder)","number"]
[null,"Voltage variations - % zone subs monitored","(per cent)"]
[null,"Voltage variations - % feeders monitored","(per cent)"]
[]
[null,"3.6.6 - COMPLAINTS - TECHNICAL QUALITY OF SUPPLY"]
[null,null,"Unit","Volume"]
[null,null,null,{"$f":"CRY","v":"2016-17"}]
[null,"3.6.6.1 - TECHNICAL QUALITY OF SUPPLY"]
[null,"Number of complaints - technical quality of supply","number",257]
[null,"3.6.6.2 - PERCENTAGE OF COMPLAINTS BY CATEGORY"]
[null,"Low voltage supply","(per cent)"]
[null,"Voltage dips","(per cent)"]
[null,"Voltage swell","(per cent)"]
[null,"Voltage spike (impulsive transient)","(per cent)"]
[null,"Waveform distortion","(per cent)"]
[null,"TV or radio interference","(per cent)"]
[null,"Solar related","(per cent)"]
[null,"Noise from appliances","(per cent)"]
[null,"Other","(per cent)"]
[null,"3.6.6.3 - PERCENTAGE OF COMPLAINTS BY LIKELY CAUSE"]
[null,"Network equipment faulty","(per cent)"]
[null,"Network interference by NSP equipment","(per cent)"]
[null,"Network interference by another customer","(per cent)"]
[null,"Network limitation","(per cent)"]
[null,"Customer internal problem","(per cent)"]
[null,"No problem identified","(per cent)"]
[null,"Environmental","(per cent)"]
[null,"Other","(per cent)"]
[]
[null,"3.6.7 - CUSTOMER SERVICE METRICS"]
[null,null,"Unit",{"$f":"CRY","v":"2016-17"}]
[null,"3.6.7.1 - TIMELY PROVISIONS OF SERVICES"]
[null,"Number of connections made","number",7715]
[null,"Number of connections not made on or before agreed date","number",147]
[null,"3.6.7.2 - TIMELY REPAIR OF FAULTY STREET LIGHTS"]
[null,"Street lights - average monthly number \"out\"","number",638]
[null,"Street lights - not repaired by \"fix by\" date","number",3706]
[null,"Street lights - average number of days to repair","number",8.4700000000000006]
[null,"Total number of street lights","number",140134]
[null,"3.6.7.3 - CALL CENTRE PERFORMANCE"]
[null,"Calls to call centre fault line","number",401667]
[null,"Calls to fault line answered within 30 seconds","number",92245]
[null,"Calls to fault line - average waiting time before call answered","number",25]
[null,"Call centre - number of overload events","number",0]
[null,"Percentage of calls abandoned","(per cent)",6.8000000000000005E-2]
[null,"3.6.7.4 - NUMBER OF CUSTOMER COMPLAINTS"]
[null,"Complaint - reliability of supply","number",274]
[null,"Complaint - technical quality of supply","number",{"$f":"IF(ISBLANK(D28),\"\",D28)","v":257}]
[null,"Complaint - administrative process or customer service","number",940]
[null,"Complaint - connection or augmentation","number",783]
[null,"Complaint - other","number",3489]
[null,"Total number of complaints","number",5743]

{"sheet":"3.6.8 Network-feeders","index":6,"n_rows":1600,"n_cols":23,"rows_kept":1600,"cut":false,"hidden":false,"merged":[[10,10,10,14],[11,11,11,12],[11,13,11,14],[11,18,11,19],[11,15,12,15],[11,10,12,10],[10,15,10,19],[11,16,11,17],[5,6,5,8],[5,1,5,4],[11,8,12,8],[11,9,12,9],[11,20,12,20],[10,20,10,22],[11,21,11,22],[10,1,12,1],[10,2,12,2],[10,3,12,3],[10,4,12,4],[10,7,12,7],[11,5,12,5],[11,6,12,6],[10,5,10,6],[10,8,10,9]]}
[null,{"$f":"(LOOKUP(dms_Model,dms_Model_List,dms_Worksheet_List))","v":"REGULATORY REPORTING STATEMENT"},null,null,null,null,{"$f":"CONCATENATE(\"1-Jan-\",LEFT(CRY,4))","v":"1-Jan-2016"}]
[null,{"$f":"dms_TradingName","v":"Ergon Energy"}]
[null,{"$f":"CONCATENATE(\"Annual Reporting RIN Response \",CRY)","v":"Annual Reporting RIN Response 2016-17"}]
[null,"3.6 QUALITY OF SERVICES"]
[]
[null,"Did the MAIFI parameter of the STPIS apply during the period?",null,null,null,"No","** IMPORTANT\nPlease ensure this question is answered correctly. Your response will affect other tables throughout this workbook and will determine which cells are grey and which are input cells. "]
[]
[]
[]
[null,"3.6.8 - NETWORK FEEDER RELIABILITY"]
[null,"Feeder ID / name","Description of the service area for the feeder","Feeder classification\n\n(drop down)","Number of distribution customers","Length of high voltage distribution lines",null,"Maximum demand\n(MVA)","Energy not supplied\n(MWh)",null,"Unplanned Outages",null,null,null,null,"Planned Outages",null,null,null,null,"Momentary feeder outages"]
[null,null,null,null,null,"Overhead","Underground",null,"Unplanned","Planned","Total number of unplanned outages","Unplanned customer minutes off-supply (SAIDI)",null,"Unplanned interruptions\n(SAIFI)",null,"Total number of planned outages","Planned customer minutes off-supply (SAIDI)",null,"Planned interruptions\n(SAIFI)",null,"Total number of momentary feeder outages","Momentary interruptions due to feeder outages (MAIFI)"]
[null,null,null,null,null,null,null,null,null,null,null,"Including excluded events and MEDs","After removing excluded events and MED","Including excluded events and MEDs","After removing excluded events and MED",null,"Including MEDs","After removing  MED","Including MEDs","After removing  MED",null,"Including excluded events and MEDs","After removing excluded events and MED"]
[null,10020655,"FN","RURAL SHORT",721,100.22023,0.84138999999999997,2.9670000000000001,3.9148396969353918,1.1407449300042982,42,336.99662999999998,246.33904000000001,3.2510399999999997,2.2496499999999999,128,98.197429999999997,98.197429999999997,0.77670000000000006,0.77670000000000006]
[null,10020657,"FN","RURAL SHORT",729,8.8127899999999997,1.26867,2.4990000000000001,3.9756510732946011,0.37396014183940268,35,262.35428000000002,253.31182000000001,3.15089,2.0905299999999998,29,24.67773,24.67773,2.2016499999999999,2.2016499999999999]
[null,10020658,"FN","RURAL SHORT",0,0,0,0.35000000000000003,0,0,"",0,0,0,0,"",0,0,0,0]
[null,10020659,"FN","RURAL LONG",965,216.75306,0.88015999999999994,1.298,5.9483881920198431,0.70353937609291872,68,656.53332,652.41083000000003,5.6901599999999997,4.7088099999999997,108,77.650790000000001,77.13991,2.61347,2.59171]
[null,10020660,"FN","RURAL SHORT",794,12.871329999999999,11.12219,2.1920000000000002,0.10916024080252827,0.303861378069888,18,5.5026700000000002,5.5026700000000002,5.7929999999999995E-2,5.7929999999999995E-2,24,15.31738,15.31738,0.12090999999999999,0.12090999999999999]
[null,10020661,"FN","URBAN",1409,4.4917899999999999,9.460700000000001,5.23,6.0934944033897658,0.4357628302440133,19,291.69855999999999,291.69855999999999,1.47197,1.47197,31,20.86018,20.86018,0.16891,0.16891]
[null,10020662,"FN","RURAL SHORT",465,35.248829999999998,2.5814699999999999,1.2870000000000001,6.5545910475345837,0.26755014336310995,17,556.21806000000004,556.21806000000004,2.2408600000000001,2.2408600000000001,22,22.70412,22.70412,0.17848999999999998,0.17848999999999998]
[null,10020663,"FN","URBAN",677,0,11.278509999999999,5.7490000000000006,0.69962729005763213,0.40990749967336954,9,14.04008,14.04008,0.16544,0.16544,24,8.2260000000000009,8.2260000000000009,0.10044,0.10044]
[null,10020669,"FN","RURAL LONG",351,1130.5045,0.16616,1.161,16.032167299223243,1.3919306073589073,41,1435.0166200000001,1237.2706599999999,12.53276,10.994300000000001,34,124.58974000000001,124.58974000000001,1.10541,1.10541]
[null,10020670,"FN","RURAL LONG",168,450.76065999999997,0,0.55200000000000005,8.917670427316299,1.5098759080661324,34,870.43025999999998,501.17291999999998,11.648809999999999,9.4166699999999999,34,147.375,147.375,1.18452,1.18452]
[null,10020671,"FN","RURAL LONG",147,329.05374,0,0.52500000000000002,25.800465351140563,3.6639260204977573,39,1811.11995,1443.39796,18.95918,16.72109,24,257.19727999999998,257.19727999999998,1.7823099999999998,1.7823099999999998]
[null,10020673,"FN","RURAL LONG",572,470.44948999999997,0,2.6340000000000003,22.766274810847886,6.6323180092095138,48,1246.1721700000001,922.47875999999997,15.501749999999999,13.48776,28,363.03744,362.98498999999998,3.56643,3.5646899999999997]
[null,10020674,"FN","RURAL LONG",71,885.02805000000001,0,0.68400000000000005,173.07949688032448,14.501280940365177,43,6858.1561000000002,6321.2713599999997,21.69014,19.549300000000002,11,574.60329000000002,574.60329000000002,4.1831000000000005,4.1831000000000005]
[null,10020675,"FN","RURAL SHORT",385,76.873409999999993,0.23818,3.1859999999999999,35.617668317337156,14.948923942136821,38,1492.2775799999999,1166.25991,20.898700000000002,18.9039,35,626.31680000000006,626.31680000000006,4.09091,4.09091]
[null,10020677,"FN","URBAN",15,9.2321299999999997,0.19770000000000001,2.9950000000000001,232.7157188003489,19.754936025707707,6,257.59222,215.46110999999999,2.3333299999999997,2.2000000000000002,1,21.866669999999999,21.866669999999999,0.13333,0.13333]
[null,10020679,"FN","RURAL SHORT",1268,92.392290000000003,3.0136799999999999,3.1180000000000003,2.0973214454501994,0.19519484161045708,34,224.19937999999999,223.08114,3.5836000000000001,3.5749199999999997,31,20.865929999999999,20.850159999999999,0.30835999999999997,0.30757000000000001]
[null,10020689,"FN","RURAL SHORT",168,76.760930000000002,5.2589999999999998E-2,0.75,5.7058045279575236,1.3726606475152561,27,766.32619,374.75923,3.65476,2.6488099999999997,30,184.35714000000002,184.35714000000002,1.0357099999999999,1.0357099999999999]
[null,10020700,"FN","RURAL SHORT",11,4.5470199999999998,3.7440000000000001E-2,0.115,0.52706339354922105,2.2648804188481669E-2,1,63.466670000000001,63.466670000000001,1,1,1,2.7272699999999999,2.7272699999999999,9.0909999999999991E-2,9.0909999999999991E-2]
[null,10020711,"FN","RURAL SHORT",7,8.9164899999999996,4.5569999999999999E-2,5.2000000000000005E-2,0.16770659099960175,0.36553695432441008,1,54.4,54.4,0.85714000000000001,0.85714000000000001,2,118.57142999999999,118.57142999999999,0.85714000000000001,0.85714000000000001]
[null,10020722,"FN","RURAL SHORT",508,154.34406000000001,0.12214999999999999,1.006,0.49522030837315167,1.2393904000234268,26,72.08005,71.712959999999995,1.1161399999999999,1.1122000000000001,36,180.39510999999999,180.39510999999999,0.97637999999999991,0.97637999999999991]
[null,10020744,"FN","RURAL LONG",65,350.63236999999998,0.16098999999999999,0.34400000000000003,4.658103464305789,0.64872986880932648,11,343.66230999999999,329.05718000000002,6.0461499999999999,5.0615399999999999,5,47.861539999999998,47.861539999999998,0.69230999999999998,0.69230999999999998]
[null,10020755,"FN","RURAL LONG",414,291.01474999999999,2.4129999999999999E-2,1.7020000000000002,4.23925321556277,0.34344841911364438,31,318.62754000000001,303.28433999999999,5.0217399999999994,4.0024199999999999,12,25.81401,25.81401,0.30918000000000001,0.30918000000000001]
[null,10020761,"FN","RURAL SHORT",896,7.3888199999999999,2.0833399999999997,2.6640000000000001,5.3081132965570356E-3,8.5708131173211369E-2,9,0.40421999999999997,0.40421999999999997,1.004E-2,1.004E-2,14,6.5267900000000001,6.5267900000000001,0.12164999999999999,0.12164999999999999]
[null,10020764,"FN","RURAL SHORT",2050,58.500929999999997,18.075009999999999,5.343,5.3538585038854718,1.3051977757121429,48,529.20668000000001,462.11347999999998,4.5356100000000001,3.7473199999999998,154,129.01337999999998,129.01337999999998,0.76927000000000001,0.76927000000000001]
[null,10020765,"FN","RURAL SHORT",438,87.474759999999989,0.80042999999999997,0.91700000000000004,3.370597938111342,0.58996999062602673,20,392.55209000000002,392.31693000000001,4.2442899999999995,4.2420099999999996,46,68.710049999999995,67.97945,0.38812999999999998,0.35844999999999999]
[null,10020767,"FN","RURAL SHORT",1364,121.41431,8.4908199999999994,4.077,0.83933569416558396,0.30864593223894204,42,68.718989999999991,51.0533,0.6371,0.52932999999999997,124,25.26979,25.15249,0.22213999999999998,0.21628]
[null,10020768,"FN","RURAL SHORT",229,17.6995,0.32850999999999997,0.86499999999999999,0.34762037840437199,1.1842611241019496,7,40.252549999999999,39.833109999999998,0.34060999999999997,0.33623999999999998,28,137.131,137.131,0.65066000000000002,0.65066000000000002]
[null,10020770,"FN","RURAL SHORT",118,81.527019999999993,0.75366999999999995,6.8630000000000004,3.3870522593475267,20.38750291612083,12,70.347880000000004,59.515679999999996,0.66101999999999994,0.62712000000000001,11,423.44123999999999,423.44123999999999,1.3898299999999999,1.3898299999999999]
[null,10020771,"FN","RURAL LONG",388,201.73849000000001,0.45888999999999996,3.125,5.9478588767883007,0.57100323706199718,47,410.51233000000002,311.04180000000002,4.3299000000000003,3.3453599999999999,34,39.409790000000001,39.409790000000001,0.37886999999999998,0.37886999999999998]
[null,10020772,"FN","RURAL LONG",857,216.37308999999999,0.32140000000000002,2.7829999999999999,2.9528843325921503,2.4301228110383808,54,360.59422000000001,247.95148,3.8203,2.4037299999999999,112,296.75671,296.66919000000001,1.2660399999999998,1.26254]
[null,10020773,"FN","RURAL SHORT",591,100.1773,2.9588199999999998,1.2310000000000001,3.2330013310539343,2.1120703476701631E-2,24,327.64274999999998,327.64274999999998,1.7242000000000002,1.7242000000000002,9,2.1404399999999999,2.1404399999999999,2.3689999999999999E-2,2.3689999999999999E-2]
[null,10020774,"FN","RURAL SHORT",1806,37.944240000000001,2.5015399999999999,5.0270000000000001,2.8830079834223574,2.7240463623151623,43,225.95126999999999,225.91011,2.3416399999999999,2.3410899999999999,63,213.49290000000002,203.69224,0.72370000000000001,0.69047999999999998]
[null,10020775,"FN","RURAL SHORT",1108,113.44793,1.1270099999999998,3.6080000000000001,9.5777714569257792,2.0911404446475257,55,681.79168000000004,681.68940999999995,5.7752699999999999,5.7725599999999995,79,148.85740000000001,148.85740000000001,0.75541999999999998,0.75541999999999998]
[null,10020776,"FN","RURAL SHORT",319,20.542870000000001,0.60933999999999999,4.8690000000000007,7.2429041673937533,2.5461302472168779,9,329.82137,295.19817,3.1567399999999997,2.1786799999999999,31,115.94356999999999,115.8652,0.49842999999999998,0.49215999999999999]
[null,10020777,"FN","RURAL SHORT",1829,87.484800000000007,3.3207199999999997,5.7780000000000005,4.0163038071462021,1.2513120435835898,56,367.83618999999999,337.51060999999999,5.0082000000000004,4.0142199999999999,100,114.60235,114.58595,0.60688999999999993,0.60633999999999999]
[null,10020778,"FN","RURAL SHORT",623,128.95533,2.5503,2.5060000000000002,0.30875013438172272,1.7236767599154497,35,46.359789999999997,45.946149999999996,0.43498999999999999,0.42857000000000001,17,258.81540999999999,258.81540999999999,0.80096000000000001,0.80096000000000001]
[null,10020779,"FN","RURAL SHORT",600,88.268940000000001,0.56763999999999992,2.419,3.6386491390287365,0.97925661138856956,50,363.20600000000002,328.58341999999999,2.335,1.3333299999999999,82,97.748329999999996,97.523330000000001,0.47832999999999998,0.45832999999999996]
[null,10020780,"FN","RURAL SHORT",657,57.102509999999995,1.3361799999999999,1.518,1.8678428090984214,0.29448551014636776,24,201.51933,98.603400000000008,2.6255699999999997,1.62253,68,31.77169,29.28463,0.23440000000000003,0.21765999999999999]
[null,10020781,"FN","RURAL SHORT",290,16.59554,0.21306,0.79600000000000004,1.3910363949831441,1.5001747443591791,5,156.81068999999999,156.81068999999999,2.28966,2.28966,14,169.11378999999999,169.11378999999999,0.57240999999999997,0.57240999999999997]
[null,10020782,"FN","RURAL SHORT",1276,13.615119999999999,17.648989999999998,4.9000000000000004,1.0255326497272927,0.38990333749546102,13,66.84393,66.84393,1.1873,1.1873,85,25.413789999999999,25.413789999999999,0.20610999999999999,0.20610999999999999]
[null,10020783,"FN","URBAN",2086,6.2538899999999993,2.3660699999999997,7.843,3.3242172082470569,4.1853681698246996,28,150.13184999999999,150.11444,1.5278,1.5273299999999999,226,189.02406999999999,189.02406999999999,0.71092999999999995,0.71092999999999995]
[null,10020784,"FN","RURAL SHORT",846,6.5471300000000001,1.26166,1.278,2.5259019444492024E-2,0.23461071652554633,19,2.1082199999999998,2.0999399999999997,2.2459999999999997E-2,2.128E-2,39,19.58156,19.58156,0.29314000000000001,0.29314000000000001]
[null,10020785,"FN","RURAL SHORT",878,6.1086499999999999,4.7906599999999999,2.113,0.78231962200443661,1.1599284980173893E-2,8,99.721549999999993,32.950469999999996,1.2084299999999999,0.20272999999999999,4,1.47855,1.47855,3.3029999999999997E-2,3.3029999999999997E-2]
[null,10020786,"FN","URBAN",2565,8.2752400000000002,5.6481599999999998,6,1.1093790628999034,0.65287837313667141,31,99.275739999999999,99.275739999999999,0.72553999999999996,0.72553999999999996,58,58.42456,58.42456,0.3614,0.3614]
[null,10020787,"FN","RURAL SHORT",1481,151.3485,0.86050000000000004,2.448,0.57536269948955987,5.7636153545139623E-2,43,98.478639999999999,98.478639999999999,0.60566999999999993,0.60566999999999993,38,9.86496,9.7758299999999991,0.14787,0.14651999999999998]
[null,10020788,"FN","URBAN",332,5.5659999999999994E-2,8.2244899999999994,5.7240000000000002,7.9500229950239226E-2,0.12988780619162443,3,0.73558999999999997,0.73558999999999997,9.0399999999999994E-3,9.0399999999999994E-3,1,1.20181,1.20181,3.0099999999999997E-3,3.0099999999999997E-3]
[null,10020794,"FN","URBAN",126,3.6005000000000003,0.72930000000000006,1.4360000000000002,9.0850758815772273E-2,4.459885431915897E-2,3,2.5220899999999999,2.5220899999999999,2.3809999999999998E-2,2.3809999999999998E-2,5,1.2381,1.2381,6.3489999999999991E-2,6.3489999999999991E-2]
[null,10020795,"FN","URBAN",573,4.3789499999999997,0.4788,4.2,0.66305641332503762,0.69714018105647091,21,37.669229999999999,37.207619999999999,0.49389,0.48690999999999995,57,39.605579999999996,39.605579999999996,0.31064999999999998,0.31064999999999998]
[null,10020796,"FN","URBAN",2210,8.0278000000000009,5.6358699999999997,6.2250000000000005,1.3897558912191923,0.35472642838420293,26,164.18290000000002,156.14201,1.1398200000000001,1.07511,29,41.906649999999999,41.906649999999999,0.22896,0.22896]
[null,10020797,"FN","RURAL SHORT",847,24.365219999999997,4.3279800000000002,2.6,2.3083601607069029,0.33535898567116351,20,211.23348999999999,211.10480000000001,4.1050800000000001,4.1039000000000003,84,30.688039999999997,30.688039999999997,0.3412,0.3412]
[null,10020798,"FN","RURAL SHORT",1816,18.938219999999998,14.032649999999999,9.68,1.3153576882016174,0.59168091013412294,25,72.3005,72.3005,1.2158599999999999,1.2158599999999999,55,32.522579999999998,32.522579999999998,0.30175999999999997,0.30175999999999997]
[null,10020799,"FN","RURAL SHORT",1071,92.51406999999999,3.7693599999999998,2.8000000000000003,7.6654847099896779,0.11298068234362556,56,591.24494000000004,588.05313000000001,5.1129799999999994,5.0961699999999999,17,8.7142900000000001,8.7142900000000001,5.2289999999999996E-2,5.2289999999999996E-2]
[null,10020800,"FN","URBAN",432,7.1068899999999999,3.3126899999999999,8.3260000000000005,0.53044502034370911,0.15923737393357618,7,8.1659699999999997,8.0623799999999992,1.6199999999999999E-2,1.389E-2,21,2.45139,2.45139,5.5559999999999998E-2,5.5559999999999998E-2]
[null,10020802,"FN","RURAL SHORT",1504,4.0803399999999996,5.0668099999999994,3.7070000000000003,1.0908158786006929E-2,0.22450701461531941,14,0.94282999999999995,0.89362999999999992,1.3300000000000001E-2,1.2629999999999999E-2,75,19.404920000000001,19.205449999999999,0.17552999999999999,0.17221]
[null,10020803,"FN","URBAN",759,5.2054200000000002,4.4526199999999996,6.0760000000000005,5.5905761525165669,0.2739633376159849,12,155.82980000000001,155.76391999999998,2.0592899999999998,2.0566499999999999,54,7.6363599999999998,7.6363599999999998,0.16996,0.16996]
[null,10020804,"FN","RURAL SHORT",1750,63.10812,11.310609999999999,3.153,6.7629150934881554,1.5215439418409478,68,839.82050000000004,839.42540000000008,4.6405699999999994,4.6377100000000002,51,188.94570999999999,188.61657,0.76342999999999994,0.75829000000000002]
[null,10020805,"FN","URBAN",427,5.36416,5.0507900000000001,6.73,0.48049556929470122,0.70676048338662556,7,11.067169999999999,2.36436,9.1329999999999995E-2,2.81E-2,50,16.278690000000001,16.278690000000001,0.17563999999999999,0.17563999999999999]
[null,10020806,"FN","RURAL LONG",1631,247.71536,5.3739499999999998,3.1220000000000003,0.56216663660747856,0.21885287988915164,87,92.933719999999994,33.436579999999999,1.0300399999999998,0.48558999999999997,51,36.17933,36.17933,0.21765999999999999,0.21765999999999999]
[null,10020807,"FN","URBAN",1162,7.4491199999999997,1.22159,5.0670000000000002,5.0801633056940035E-2,1.0539158932321402,11,3.2247299999999997,3.2247299999999997,7.0569999999999994E-2,7.0569999999999994E-2,37,66.89931,66.89931,0.34853999999999996,0.34853999999999996]
[null,10020808,"FN","URBAN",3015,20.030889999999999,3.5298099999999999,8.7249999999999996,0.20907168735162523,1.1358435782439091,54,20.806950000000001,20.782409999999999,0.16252,0.16219,82,113.03989,100.2578,0.48125999999999997,0.4073]
[null,10020809,"FN","URBAN",1129,6.6229699999999996,1.6116199999999998,5.7440000000000007,5.8364082632246704E-2,0.11129370206765715,11,3.2366000000000001,3.2366000000000001,3.6319999999999998E-2,3.6319999999999998E-2,79,6.1718299999999999,6.1718299999999999,0.14437999999999998,0.14437999999999998]
[null,10020810,"FN","URBAN",309,0,4.0263200000000001,2.8960000000000004,3.0638742906463317,0.14270833289850238,1,64.547359999999998,64.547359999999998,0.99675999999999998,0.99675999999999998,5,3.0064699999999998,3.0064699999999998,3.56E-2,3.56E-2]
[null,10020811,"FN","URBAN",96,0,1.27765,2.5860000000000003,0,0.45235990629082717,"",0,0,0,0,2,3.375,3.375,0.28125,0.28125]
[null,10020812,"FN","URBAN",187,0,1.7673599999999998,3.72,0,0.37642237246113558,"",0,0,0,0,6,5.3101599999999998,5.3101599999999998,5.8819999999999997E-2,5.8819999999999997E-2]
[null,10020813,"FN","URBAN",115,0,2.3125,2.3010000000000002,0,0.1564425463233996,"",0,0,0,0,2,1.11304,1.11304,1.7389999999999999E-2,1.7389999999999999E-2]
[null,10020814,"FN","URBAN",137,0,2.5889199999999999,3.6190000000000002,1.7003886626539972E-2,9.043149344832109E-2,1,0.16058,0,7.3000000000000001E-3,0,3,0.85400999999999994,0.85400999999999994,3.6500000000000005E-2,3.6500000000000005E-2]
[null,10020815,"FN","URBAN",105,0,2.2330899999999998,6.601,0.1372431473179074,2.6180530335325827,1,0.47619,0.47619,0.23810000000000001,0.23810000000000001,17,9.0838099999999997,9.0838099999999997,0.53332999999999997,0.53332999999999997]
[null,10020816,"FN","URBAN",313,0,2.8553599999999997,2.84,3.1362649808054241E-2,3.4228665549233532E-2,2,0.61181999999999992,0.61181999999999992,6.3899999999999998E-3,6.3899999999999998E-3,5,0.66772999999999993,0.66772999999999993,7.0289999999999991E-2,7.0289999999999991E-2]
[null,10020817,"FN","RURAL SHORT",1447,118.21285,2.6587799999999997,4.867,2.3181247363197746,3.2324999474623803,58,167.63830000000002,167.59228999999999,4.5107099999999996,4.5093299999999994,202,233.76256999999998,233.76256999999998,1.19143,1.19143]
[null,10020818,"FN","URBAN",372,0,5.9725000000000001,4.5880000000000001,0,2.0021353088402458,"",0,0,0,0,11,30.838709999999999,30.838709999999999,0.29300999999999999,0.29300999999999999]
[null,10020820,"FN","URBAN",167,0,2.35134,4.2280000000000006,8.0625682594713532E-2,0.90592421092306052,1,0.70718999999999999,0.70718999999999999,5.9899999999999997E-3,5.9899999999999997E-3,4,7.94611,7.94611,4.1919999999999999E-2,4.1919999999999999E-2]
[null,10020821,"FN","URBAN",4,0,1.2275700000000001,3.2080000000000002,0,0,"",0,0,0,0,"",0,0,0,0]
[null,10020822,"FN","URBAN",292,0,2.6532499999999999,3.9950000000000001,0,1.0049053474976479,"",0,0,0,0,9,20.198629999999998,20.198629999999998,9.9319999999999992E-2,9.9319999999999992E-2]
[null,10020824,"FN","RURAL SHORT",558,69.508780000000002,0.45570000000000005,1.2850000000000001,0.43253036111960264,3.7342814988442337E-2,16,67.980909999999994,67.980909999999994,1.2741899999999999,1.2741899999999999,11,5.8691800000000001,5.8691800000000001,0.16128999999999999,0.16128999999999999]
[null,10020825,"FN","RURAL SHORT",2562,54.047759999999997,14.64799,6.6080000000000005,5.0419128249075547,0.25009842903647811,36,551.20528999999999,551.14575000000002,3.2537099999999999,3.25332,36,27.341919999999998,27.341919999999998,0.17954999999999999,0.17954999999999999]
[null,10020826,"FN","RURAL SHORT",2961,12.912149999999999,21.93121,7.242,1.9973611498267549,1.0167939230573844,30,178.34317999999999,178.34317999999999,1.9983099999999998,1.9983099999999998,34,90.78891999999999,90.78891999999999,0.34076000000000001,0.34076000000000001]
[null,10020827,"FN","RURAL SHORT",1331,13.562200000000001,1.7894099999999999,3.3260000000000001,3.3149448885732915,1.5688662113294476,23,100.58878,100.51326,2.3839199999999998,2.3831699999999998,28,47.605719999999998,47.605719999999998,0.29375999999999997,0.29375999999999997]
[null,10020828,"FN","RURAL LONG",1315,221.59038000000001,1.478,2.8660000000000001,1.4331279998638744,0.12155185449864866,69,219.83010999999999,219.83010999999999,2.49125,2.49125,48,18.645060000000001,18.620719999999999,0.15970000000000001,0.15894]
[null,10020829,"FN","RURAL SHORT",2380,22.14986,18.999510000000001,6.8730000000000002,5.2949652167406045,2.859090624477692E-2,35,576.13470000000007,574.19904999999994,3.2773099999999999,3.2542,28,3.1109199999999997,3.1109199999999997,2.3109999999999999E-2,2.3109999999999999E-2]
[null,10020830,"FN","URBAN",178,1.39944,12.81575,10.663,26.880360808422832,0.10656436691073755,3,357.11124000000001,357.11124000000001,1.97753,1.97753,5,1.4157299999999999,1.4157299999999999,3.3709999999999997E-2,3.3709999999999997E-2]
[null,10020831,"FN","RURAL SHORT",2971,31.223800000000001,3.0049799999999998,6.7629999999999999,2.0639739224039229,0.62481768794372128,40,197.79145,197.73466999999999,2.2564799999999998,2.2561399999999998,35,59.876529999999995,59.876529999999995,0.25480000000000003,0.25480000000000003]
[null,10020832,"FN","URBAN",1497,10.55841,14.61622,10.402000000000001,6.0241302180361043,2.0809372654777185,26,375.39994000000002,372.0532,2.25251,2.24248,20,129.67577,129.67577,0.40881999999999996,0.40881999999999996]
[null,10020833,"FN","RURAL SHORT",1954,13.821289999999999,9.1011399999999991,5.9729999999999999,0.27750720551692304,1.6493752439437646,16,15.161949999999999,15.161949999999999,0.15301999999999999,0.15301999999999999,24,90.115659999999991,90.115659999999991,0.46110999999999996,0.46110999999999996]
[null,10020834,"FN","RURAL SHORT",598,7.9636899999999997,1.4948699999999999,2.1590000000000003,0.11554827916734731,2.1124737116674908,7,7.7428900000000001,7.7428900000000001,3.177E-2,3.177E-2,13,141.55686,141.55686,0.70067000000000002,0.70067000000000002]
[null,10020835,"FN","URBAN",1230,3.61382,4.6383999999999999,3.0710000000000002,0.33059209469973327,0.78282155937406461,10,38.183369999999996,38.183369999999996,0.17154,0.17154,23,90.415849999999992,90.415849999999992,0.53251999999999999,0.53251999999999999]
[null,10020836,"FN","RURAL SHORT",883,179.91289,1.0107599999999999,3.5,3.2947826170236474,9.7699304999677522E-2,55,340.21620999999999,139.30754999999999,4.5413399999999999,3.52095,22,10.088339999999999,10.0419,7.3609999999999995E-2,7.2480000000000003E-2]
[null,10020837,"FN","RURAL SHORT",492,147.14859000000001,0.32948,4.0140000000000002,0.962738913736507,1.2244484324597864,45,70.551149999999993,70.173369999999991,1.5365899999999999,1.5325199999999999,31,89.729669999999999,89.729669999999999,0.58943000000000001,0.58943000000000001]
[null,10020838,"FN","URBAN",931,5.9567299999999994,3.6405599999999998,5.1560000000000006,3.5942526813187703,0.15048876573417541,11,166.55840000000001,166.54764999999998,2.97959,2.9785200000000001,57,6.9736799999999999,6.9522000000000004,0.15251999999999999,0.15145]
[null,10020839,"FN","URBAN",1057,6.4160499999999994,2.45574,2.99,0.36831698774411964,6.2769770210263183E-3,19,27.86768,27.833839999999999,0.34059,0.33964,15,0.47492999999999996,0.47492999999999996,2.7439999999999999E-2,2.7439999999999999E-2]
[null,10020840,"FN","RURAL SHORT",2097,31.245739999999998,2.8495699999999999,5.0040000000000004,2.5798958162854482,2.1901605638485307E-2,31,203.29031000000001,68.651439999999994,2.41249,1.40916,120,1.7258,1.7258,8.0589999999999995E-2,8.0589999999999995E-2]
[null,10020841,"FN","RURAL SHORT",655,107.38306,3.37581,2.3760000000000003,1.4526819677857845,0.10799882793289904,25,156.59140000000002,156.59140000000002,2.1679399999999998,2.1679399999999998,27,11.6417,11.6417,0.12060999999999999,0.12060999999999999]
[null,10020842,"FN","RURAL SHORT",1017,118.97453999999999,5.9190699999999996,1.8030000000000002,1.4768854911617688,0.816625086010622,53,231.09127999999998,231.09127999999998,4.6489699999999994,4.6489699999999994,128,127.77898999999999,127.77898999999999,0.84168999999999994,0.84168999999999994]
[null,10020844,"FN","RURAL SHORT",630,162.49137999999999,1.891,1.036,4.1976972098097969,8.7366794301805856E-2,33,631.39631999999995,627.64804000000004,5.5555599999999998,5.5492099999999995,28,13.141269999999999,13.141269999999999,0.1,0.1]
[null,10020845,"FN","RURAL SHORT",92,15.500689999999999,0.28848000000000001,0.216,0.7488622027799835,0.77956789721486974,7,127.23931,126.23314999999999,3.03261,3.0217399999999999,10,132.45652000000001,132.45652000000001,0.54347999999999996,0.54347999999999996]
[null,10020846,"FN","RURAL SHORT",1160,24.22221,5.3085100000000001,5.9870000000000001,5.6660271801202136,0.24891608501601903,20,320.38323000000003,317.01785999999998,3.1301699999999997,3.07931,82,14.074859999999999,14.074859999999999,0.24051999999999998,0.24051999999999998]
[null,10020847,"FN","RURAL SHORT",1746,137.62304,5.18215,3.4540000000000002,3.0047613458491611,0.18203948613734475,52,405.17894999999999,405.08186000000001,3.9335599999999999,3.9318399999999998,116,24.547229999999999,24.393739999999998,0.14260999999999999,0.13574]
[null,10020848,"FN","RURAL SHORT",99,77.010109999999997,0.19575999999999999,0.2,6.0483798876354005,1.2010713233959847,27,733.30538999999999,733.30538999999999,4.6666699999999999,4.6666699999999999,12,145.61785,145.61785,0.61615999999999993,0.61615999999999993]
[null,10020850,"FN","RURAL SHORT",1416,132.26812999999999,4.0068799999999998,2.4750000000000001,0.89588952370086294,0.14480348451929451,39,142.73205999999999,139.43210000000002,1.68008,1.6278199999999998,17,23.06992,23.06992,8.403999999999999E-2,8.403999999999999E-2]
[null,10020855,"FN","RURAL SHORT",629,137.17940999999999,0.41458999999999996,3.3450000000000002,5.7476957706354126,0.78758134133630442,41,523.68579999999997,522.20339000000001,4.1844200000000003,4.1812399999999998,72,71.758349999999993,71.519869999999997,0.48013,0.47536]
[null,10020856,"FN","RURAL SHORT",139,64.671279999999996,7.1050000000000002E-2,0.88800000000000001,7.3460012431498232,0,16,699.27458000000001,698.50108,4.0791399999999998,4.0719399999999997,"",0,0,0,0]
[null,10020857,"FN","RURAL SHORT",224,90.323209999999989,3.9820000000000001E-2,2.7370000000000001,3.3398404294266451,7.3797522106123711E-2,41,357.40751,331.53980999999999,3.6383899999999998,3.4910699999999997,5,7.8973199999999997,7.8973199999999997,7.1429999999999993E-2,7.1429999999999993E-2]
[null,10020858,"FN","RURAL SHORT",0,0,4.9360000000000001E-2,0,0,0,"",0,0,0,0,"",0,0,0,0]
[null,10128810,"FN","RURAL SHORT",274,88.306820000000002,0.13770000000000002,0.55900000000000005,1.7208061264525034,0.46893538984935179,34,339.71940000000001,339.71940000000001,3.5766399999999998,3.5766399999999998,17,92.576639999999998,92.576639999999998,0.58028999999999997,0.58028999999999997]
[null,10129302,"FN","RURAL SHORT",1,7.4437699999999998,0.50651000000000002,0.154,26.695783939044393,0,3,1304.6333299999999,1304.6333299999999,3,3,"",0,0,0,0]
[null,10129324,"FN","RURAL SHORT",1095,86.544269999999997,1.2825599999999999,2.2320000000000002,1.9682547645503778,1.0493887466861234,42,268.43466000000001,268.43466000000001,3.21279,3.21279,85,143.11780999999999,143.05936,0.90959000000000001,0.90501999999999994]
[null,10129677,"FN","RURAL SHORT",2,38.864000000000004,0.16830000000000001,0.754,0.21230109144461615,1.7194848350035903,2,27.533329999999999,23.33333,2,1,6,223,223,5,5]
[null,10129863,"FN","URBAN",24,1.7760199999999999,2.0536499999999998,1.4420000000000002,3.5633130910086943,12.111753856137925,2,7.6125000000000007,7.6125000000000007,8.3330000000000001E-2,8.3330000000000001E-2,2,25.875,25.875,0.25,0.25]
[null,10130404,"FN","RURAL SHORT",612,3.3677099999999998,1.6734899999999999,0.83000000000000007,0.60119613082664924,0.94910687917463532,7,51.290520000000001,0.79357,0.25817000000000001,9.7999999999999997E-3,26,80.972219999999993,80.972219999999993,0.49020000000000002,0.49020000000000002]
[null,10130408,"FN","RURAL SHORT",282,4.4838499999999994,5.5930099999999996,2.1779999999999999,2.7676306068628942,1.0817371150695099,6,86.916609999999991,86.916609999999991,0.26595999999999997,0.26595999999999997,7,33.971629999999998,33.971629999999998,0.15248,0.15248]
[null,10130452,"FN","URBAN",834,1.5386799999999998,5.2698099999999997,2.766,1.7030055112183928E-2,1.5390843481088816E-2,8,0.97117999999999993,0.89923999999999993,9.5899999999999996E-3,8.3899999999999999E-3,22,0.87770000000000004,0.87770000000000004,3.8370000000000001E-2,3.8370000000000001E-2]
[null,10131875,"FN","RURAL SHORT",10,11.34193,6.3909999999999995E-2,0.22,13.907397521987605,13.33334151583451,4,501.69166999999999,277.63499999999999,3,1.8,3,480.98333000000002,480.98333000000002,2.9,2.9]
[null,10131881,"FN","RURAL SHORT",6,3.3835000000000002,0.21842,7.0000000000000007E-2,6.3969016547331687,3.2942612932443116,3,706.79444000000001,121.51667,5.3333300000000001,1,2,363.98333000000002,363.98333000000002,2,2]
[null,10132616,"FN","URBAN",328,0,2.8296299999999999,4.7110000000000003,9.0888509738244458,1.6068697040284016E-2,4,113.81498999999999,35.769559999999998,1.9359799999999998,0.93901999999999997,5,0.20121999999999998,0.20121999999999998,1.524E-2,1.524E-2]
[null,10132684,"FN","RURAL LONG",168,234.26393000000002,0.1905,1.135,5.6921312417742991,1.6416975676593994,24,253.04534000000001,248.97033999999999,3.625,2.65476,13,72.982140000000001,72.982140000000001,0.55952000000000002,0.55952000000000002]
[null,10132687,"FN","RURAL SHORT",35,97.484719999999996,0.21597999999999998,0.82100000000000006,14.145390653259366,7.6726295269805203,15,279.07094999999998,274.87094999999999,3.11429,2.11429,5,151.37143,151.37143,0.88571,0.88571]
[null,10134499,"FN","RURAL SHORT",1928,9.2325699999999991,8.624979999999999,4.8899999999999997,1.252381470782014,1.1849755180129735,21,118.32975,118.28414000000001,1.1006199999999999,1.09907,51,111.96098000000001,111.96098000000001,0.44190999999999997,0.44190999999999997]
[null,10134518,"FN","URBAN",2589,2.0829299999999997,17.68666,7.3380000000000001,3.6771992958409393E-3,7.1428389123373959E-2,10,0.37695000000000001,0.36265999999999998,3.8599999999999997E-3,3.48E-3,70,7.3221299999999996,7.3221299999999996,4.1329999999999999E-2,4.1329999999999999E-2]
[null,10134605,"FN","URBAN",2873,6.2584799999999996,20.6813,9.1130000000000013,1.4687612977403364,0.22714554537399712,14,109.83485,109.83485,1.07101,1.07101,73,16.986079999999998,16.986079999999998,0.12426,0.12426]
[null,10135223,"FN","RURAL SHORT",10,9.6379000000000001,0,0.1,0.80805964795557783,0.60861232873811488,4,212.43333000000001,212.43333000000001,4,4,3,160,160,1.2,1.2]
[null,20001080,"NQ","URBAN",160,0,3.2517499999999999,2.056,7.1262714319079504E-2,6.9982912396746446,2,1.8245799999999999,1.8245799999999999,1.2500000000000001E-2,1.2500000000000001E-2,5,179.18124999999998,179.18124999999998,0.99374999999999991,0.99374999999999991]
[null,20001081,"NQ","URBAN",602,4.1611399999999996,0.98220999999999992,2.766,1.0455085707429533E-2,0.15743526042121347,5,0.54766999999999999,0.54435,8.3099999999999997E-3,6.6400000000000001E-3,10,8.24695,8.24695,4.8169999999999998E-2,4.8169999999999998E-2]
[null,20001108,"NQ","URBAN",843,4.9786399999999995,1.13453,3.2920000000000003,1.8197602928151915,1.7479253553038401,18,117.61435,117.53725,2.04033,2.03796,55,112.97153,112.97153,0.47567999999999999,0.47567999999999999]
[null,20001141,"NQ","URBAN",42,0,1.7159,1.325,0,0,"",0,0,0,0,"",0,0,0,0]
[null,20001148,"NQ","URBAN",1223,7.9684200000000001,0.73375999999999997,2.952,0.53326071132003316,0.25555638099240674,23,64.302750000000003,64.244209999999995,1.1365499999999999,1.1357299999999999,33,30.816029999999998,30.816029999999998,0.24284999999999998,0.24284999999999998]
[null,20001165,"NQ","URBAN",108,0.87362999999999991,2.4672899999999998,3.4950000000000001,2.2972940533928381,1.1519919088636647E-2,2,31.39059,31.39059,0.17593,0.17593,2,0.15740999999999999,0.15740999999999999,1.8519999999999998E-2,1.8519999999999998E-2]
[null,20001178,"NQ","URBAN",1215,8.9793299999999991,0.42230000000000001,3.4870000000000001,2.8066347334427675E-2,1.7781022898108857E-3,12,2.9619499999999999,2.9619499999999999,6.6669999999999993E-2,6.6669999999999993E-2,8,0.18764999999999998,0.18764999999999998,6.5799999999999999E-3,6.5799999999999999E-3]
[null,20001196,"NQ","URBAN",442,3.9618000000000002,0.63751999999999998,1.871,3.6627411703679384,2.1666108671478956E-2,10,287.30210999999997,287.00927999999999,0.93664999999999998,0.93438999999999994,9,1.6994699999999998,1.6994699999999998,3.8460000000000001E-2,3.8460000000000001E-2]
[null,20001246,"NQ","RURAL SHORT",62,7.72987,0.32628999999999997,0.60599999999999998,1.0080009842067357,0,7,70.223119999999994,70.223119999999994,4.0806499999999994,4.0806499999999994,"",0,0,0,0]
[null,20001263,"NQ","RURAL SHORT",329,46.343989999999998,6.8650000000000003E-2,2.762,3.8453350122262315,0.80227490617053632,46,403.75162,402.07015999999999,6.32219,6.2948300000000001,8,84.237079999999992,84.237079999999992,0.46200999999999998,0.46200999999999998]
[null,20001353,"NQ","RURAL SHORT",212,77.435379999999995,0.37010000000000004,3.0290000000000004,42.473505984372409,0.30976923937348083,47,2638.7853,363.77217000000002,7.3915099999999994,5.3820800000000002,2,19.245279999999998,19.245279999999998,0.13208,0.13208]
[null,20001488,"NQ","RURAL SHORT",601,76.412409999999994,9.4119999999999995E-2,3.347,4.2840060019474198,1.1028616336066632,86,471.34290000000004,388.70357999999999,9.1014999999999997,8.0948399999999996,22,121.34110000000001,82.439269999999993,0.55574000000000001,0.43926999999999999]
[null,20001649,"NQ","RURAL SHORT",465,110.68196,0.31018999999999997,4.1370000000000005,19.034654926596758,0.73014092006987241,94,2082.7847299999999,904.30677000000003,14.78065,12.774189999999999,16,79.892510000000001,79.892510000000001,0.66021999999999992,0.66021999999999992]
[null,20001859,"NQ","RURAL SHORT",91,41.589569999999995,0,0.48200000000000004,3.7654644231584951,0,13,724.68132000000003,724.68132000000003,4.8571399999999993,4.8571399999999993,"",0,0,0,0]
[null,20001962,"NQ","RURAL SHORT",306,74.753230000000002,1.8550000000000001E-2,1.4040000000000001,5.5344169788224384,1.1058793794724165E-3,49,605.14891,545.07914000000005,13.140519999999999,11.124179999999999,2,0.12092,0.12092,6.5399999999999998E-3,6.5399999999999998E-3]
[null,20002064,"NQ","RURAL SHORT",97,63.619629999999994,0,1.6060000000000001,9.031370782225121,0.17519258798599779,23,669.63282000000004,612.86890000000005,11.804119999999999,9.8969100000000001,2,12.98969,12.98969,6.1859999999999998E-2,6.1859999999999998E-2]
[null,20002143,"NQ","RURAL SHORT",1,8.3106600000000004,0,0,21.652465085942296,1.483651780233272,6,14433.5,431.75,6,4,3,989,989,3,3]
[null,20002149,"NQ","RURAL SHORT",2,13.35168,0,0,99.503559266254584,9.1838369963369964,6,12308.15,542.4,5.5,4.5,4,1136,1136,4,4]
[null,20002267,"NQ","RURAL SHORT",504,33.30209,0,1.149,8.433088471001458,1.522099961215009,28,933.18832999999995,933.18832999999995,4.4424599999999996,4.4424599999999996,74,168.43247,168.43247,0.57340999999999998,0.57340999999999998]
[null,20002331,"NQ","RURAL SHORT",998,65.803200000000004,0.64412000000000003,3.16,6.6257314043377402,0.27224837588393025,42,774.61675000000002,771.94771000000003,4.8316599999999994,4.6603199999999996,57,31.828659999999999,31.828659999999999,0.22846,0.22846]
[null,20002437,"NQ","RURAL SHORT",272,23.613009999999999,0.13025999999999999,1,59.311032279861344,0.21488252257700305,80,7572.1755499999999,22.787009999999999,1.1617599999999999,0.15808999999999998,13,27.433819999999997,27.433819999999997,0.16911999999999999,0.16911999999999999]
[null,20002494,"NQ","RURAL SHORT",397,168.41976,1.1200299999999999,1.516,140.80311606999717,0.5180475711637802,183,11570.830599999999,638.87330000000009,7.1284599999999996,4.4156199999999997,16,42.57179,42.57179,0.22417999999999999,0.22417999999999999]
[null,20002622,"NQ","RURAL SHORT",1286,9.4235799999999994,7.3802300000000001,3.2590000000000003,71.84803321730314,0.12434815528620267,110,6624.9029499999997,362.76621,2.2760499999999997,1.28227,37,11.46579,11.46579,8.2429999999999989E-2,8.2429999999999989E-2]
[null,20002652,"NQ","RURAL SHORT",906,10.073879999999999,3.5834099999999998,3.5660000000000003,102.78642163393327,0.62095297079557099,113,6506.4660599999997,372.09735000000001,3.1931599999999998,2.1920500000000001,35,39.306840000000001,39.306840000000001,0.22627,0.22627]
[null,20002698,"NQ","RURAL SHORT",1600,13.212400000000001,2.0573000000000001,3.7280000000000002,59.676711523352502,7.1994451365412548E-2,194,7135.3400300000003,66.047479999999993,1.2875000000000001,0.28437999999999997,74,8.6081299999999992,8.6081299999999992,8.5000000000000006E-2,8.5000000000000006E-2]
[null,20002744,"NQ","URBAN",1,1.4105000000000001,0.48885999999999996,4.32,0,0,"",0,0,0,0,"",0,0,0,0]
[null,20002752,"NQ","RURAL SHORT",1966,0.46027999999999997,24.230519999999999,5.2,0.30072299496318206,6.4757179526077416E-2,5,34.554929999999999,34.554929999999999,1.05748,1.05748,27,7.4410000000000007,7.4410000000000007,7.6300000000000007E-2,7.6300000000000007E-2]
[null,20002914,"NQ","URBAN",329,10.780569999999999,2.5677499999999998,4.4000000000000004,1.6877861788957355E-2,0.80062345727590778,1,0.47415999999999997,0.47415999999999997,9.1199999999999996E-3,9.1199999999999996E-3,8,22.4924,22.4924,9.1189999999999993E-2,9.1189999999999993E-2]
[null,20002948,"NQ","RURAL SHORT",1062,7.6000099999999993,8.9676799999999997,3.1,0.24105833769293925,0.120801191201429,8,29.943719999999999,29.943719999999999,0.12994,0.12994,3,15.005649999999999,15.005649999999999,8.3799999999999999E-2,8.3799999999999999E-2]
[null,20002985,"NQ","URBAN",51,3.4615199999999997,0.61880999999999997,1.82,0.21877113934235615,3.0750475916003905,1,2.4509799999999999,2.4509799999999999,9.8040000000000002E-2,9.8040000000000002E-2,5,34.450980000000001,34.450980000000001,0.17646999999999999,0.17646999999999999]
[null,20003026,"NQ","RURAL SHORT",1324,8.793429999999999,10.29162,4.4409999999999998,3.6432770826658564E-2,8.5067000500793737E-3,6,3.8618299999999999,3.8618299999999999,6.1179999999999998E-2,6.1179999999999998E-2,8,0.90170000000000006,0.90170000000000006,1.9639999999999998E-2,1.9639999999999998E-2]
[null,20003061,"NQ","URBAN",259,5.4897299999999998,2.49315,2.782,0.75533079458649122,0.48849557525551485,9,17.11609,17.11609,1.0115799999999999,1.0115799999999999,14,11.0695,11.0695,9.6529999999999991E-2,9.6529999999999991E-2]
[null,20003088,"NQ","RURAL SHORT",1106,20.048400000000001,7.8475199999999994,3.7,1.1086237302085076,0.18821637725867066,18,102.89601,102.89601,1.17269,1.17269,7,17.469149999999999,17.469149999999999,9.4939999999999997E-2,9.4939999999999997E-2]
[null,20003281,"NQ","RURAL SHORT",548,4.7562199999999999,1.33684,1.41,0.74501089708609758,5.9428493740022901E-3,10,86.93016999999999,76.747689999999992,1.25912,1.1770099999999999,5,0.69342999999999999,0.69342999999999999,1.6420000000000001E-2,1.6420000000000001E-2]
[null,20003294,"NQ","URBAN",1022,7.82517,0.16827999999999999,3.226,0.81155760539715638,0.58277207809929144,28,77.092739999999992,47.531100000000002,2.67319,2.0616399999999997,21,55.359589999999997,55.359589999999997,0.26418999999999998,0.26418999999999998]
[null,20003306,"NQ","URBAN",478,4.66195,1.0778000000000001,1.86,2.3107019482286071,5.8599209130942603E-2,6,156.16179,156.16179,1.0041799999999999,1.0041799999999999,8,3.9602499999999998,3.9602499999999998,6.4849999999999991E-2,6.4849999999999991E-2]
[null,20003317,"NQ","URBAN",861,4.7099799999999998,1.03894,3.218,3.1440995836936929E-2,0.4027936308283534,11,2.0720099999999997,2.0720099999999997,2.2069999999999999E-2,2.2069999999999999E-2,7,26.544719999999998,26.544719999999998,0.24273999999999998,0.24273999999999998]
[null,20003329,"NQ","URBAN",24,0,2.22654,3.7750000000000004,0,0.63991279845219473,"",0,0,0,0,1,0.58333000000000002,0.58333000000000002,4.1669999999999999E-2,4.1669999999999999E-2]
[null,20003349,"NQ","URBAN",985,5.0861399999999994,0.91056999999999999,3.4950000000000001,0.54865645372679939,0.27032796153292193,20,43.575519999999997,43.575519999999997,0.51371,0.51371,5,21.470050000000001,21.470050000000001,9.7459999999999991E-2,9.7459999999999991E-2]
[null,20003387,"NQ","URBAN",189,0,4.0920699999999997,3.206,0,0,"",0,0,0,0,"",0,0,0,0]
[null,20003411,"NQ","URBAN",382,0.13457,4.5655599999999996,2.323,0.44210233150321282,0.62012942405707905,8,25.814400000000003,25.788219999999999,1.23298,1.23037,8,36.209420000000001,36.209420000000001,0.10994999999999999,0.10994999999999999]
[null,20003435,"NQ","RURAL LONG",437,218.46684999999999,3.2279999999999996E-2,2.3520000000000003,16.768957620556876,8.5582779458752523,27,828.47891000000004,352.47246000000001,5.22654,3.2677299999999998,24,422.82609000000002,422.82609000000002,1.85812,1.85812]
[null,20003471,"NQ","RURAL SHORT",256,6.7616299999999994,8.7609999999999993E-2,0,15.075829635611504,4.4174068533671891,15,695.91711999999995,192.87884,3.4648399999999997,1.39453,14,203.91243,203.91243,0.84375,0.84375]
[null,20003493,"NQ","RURAL SHORT",2,1.2706,0,1.7000000000000001E-2,48.016042932666366,170.38640962230215,2,486.11667,0,2,0,4,1725,1725,4,4]
[null,20003547,"NQ","URBAN",1,3.5319999999999997E-2,0.30441000000000001,1.5,59078.087768196507,0,9,3976.7833300000002,3145.4500000000003,9,7,"",0,0,0,0]
[null,20003550,"NQ","RURAL SHORT",340,49.35201,0.96173999999999993,0.68500000000000005,9.8318883179122452,9.2392469569625185E-2,28,1582.1319100000001,878.84793999999999,9.1176499999999994,7.1382399999999997,2,14.867649999999999,14.867649999999999,0.11764999999999999,0.11764999999999999]
[null,20003792,"NQ","RURAL SHORT",1102,113.80987,0.1908,3.1190000000000002,73.620279353765611,1.1266558030544651,110,6900.20345,288.90031999999997,3.35209,2.3593500000000001,28,105.598,105.598,0.48910999999999999,0.48910999999999999]
[null,20003866,"NQ","RURAL LONG",83,582.21843999999999,0.32685999999999998,8.7490000000000006,3777.9428480980346,99.999342646113348,14,12355.319680000001,1060.36627,5.5421699999999996,4.4216899999999999,18,327.03613999999999,327.03613999999999,1.25301,1.25301]
[null,20003945,"NQ","URBAN",2,1.44356,7.3899999999999999E-3,9.4720000000000013,1.4770361429297085,0,3,72.183329999999998,72.183329999999998,3,3,"",0,0,0,0]
[null,20003949,"NQ","RURAL LONG",189,370.36732000000001,0,0.503,11.350204647029493,4.6844725977203439,19,1179.8316600000001,1179.8316600000001,3.4391499999999997,3.4391499999999997,35,486.9418,486.9418,1.5873000000000002,1.5873000000000002]
[null,20003983,"NQ","RURAL SHORT",73,138.81754000000001,0,0.40200000000000002,16.840756010104503,6.2170040363550791,5,936.95547999999997,936.95547999999997,2.0411000000000001,2.0411000000000001,3,345.89040999999997,345.89040999999997,1.0411000000000001,1.0411000000000001]
[null,20004054,"NQ","RURAL LONG",784,363.77039000000002,0.37351999999999996,2.0340000000000003,1.2083902878085353,3.1253937354173533E-2,27,123.09220000000001,123.09220000000001,1.32908,1.32908,53,3.1836699999999998,3.1326499999999999,0.10458999999999999,9.9489999999999995E-2]
[null,20004081,"NQ","RURAL SHORT",649,32.99192,3.8640000000000001E-2,3.9060000000000001,5.9764293828481678,1.4046232493566468,24,661.39291000000003,137.99068,2.5608599999999999,1.0308199999999998,41,155.4453,155.36825999999999,0.79198999999999997,0.78737000000000001]
[null,20004307,"NQ","RURAL LONG",299,652.17314999999996,8.2239999999999994E-2,0.91400000000000003,31.178127588797725,3.8086364374038375,22,907.70608000000004,860.48194000000001,2.8060199999999997,2.04013,15,110.88294,110.88294,1.0568599999999999,1.0568599999999999]
[null,20004592,"NQ","RURAL SHORT",624,48.241600000000005,0.22832,2.23,0.40941117282580064,2.2299491746412832,38,25.341239999999999,21.25582,0.19711999999999999,0.13782,46,138.02671000000001,138.02671000000001,0.54005999999999998,0.54005999999999998]
[null,20004679,"NQ","RURAL SHORT",1,0.24246999999999999,0,0,1.5885581465010683,1.7784188034188033,4,585.96667000000002,204.56666999999999,4,2,4,656,656,4,4]
[null,20004700,"NQ","URBAN",467,3.1765300000000001,2.2046399999999999,3.1220000000000003,1.9283320648007813,1.9203128355393891E-2,7,64.723159999999993,64.723159999999993,0.33190999999999998,0.33190999999999998,16,0.64454,0.64454,3.4259999999999999E-2,3.4259999999999999E-2]
[null,20004715,"NQ","URBAN",48,0.69843,1.17292,1.4000000000000001,0,0,"",0,0,0,0,"",0,0,0,0]
[null,20004751,"NQ","URBAN",883,5.4592299999999998,1.76108,2.1800000000000002,0.13193656098467138,0.53658943805519788,9,14.578200000000001,14.578200000000001,0.11890999999999999,0.11890999999999999,22,59.289919999999995,59.289919999999995,0.48583999999999999,0.48583999999999999]
[null,20004796,"NQ","RURAL SHORT",1335,153.88533000000001,5.3048199999999994,5.5979999999999999,0.59218683323931109,0.32359415656223117,30,54.838039999999999,54.838039999999999,0.87490999999999997,0.87490999999999997,15,29.96566,29.96566,0.11161,0.11161]
[null,20004893,"NQ","URBAN",1232,5.5394199999999998,3.8997099999999998,4.4249999999999998,1.6434256160438601E-2,0.82882669381563245,14,0.90808,0.88934999999999997,1.136E-2,1.055E-2,19,45.797080000000001,45.797080000000001,0.21590999999999999,0.21590999999999999]
[null,20004903,"NQ","RURAL SHORT",1143,34.850819999999999,13.284289999999999,3.7240000000000002,1.1235211344803679,0.21133442390906929,18,124.51721999999999,124.51721999999999,2.0070000000000001,2.0070000000000001,10,23.421700000000001,23.421700000000001,0.17848,0.17848]
[null,20004937,"NQ","RURAL LONG",311,777.19025999999997,0.26690000000000003,2.2000000000000002,24.977570786540639,4.7455451630095613,23,1479.1429800000001,991.36510999999996,3.85209,1.8456599999999999,19,281.02571999999998,281.02571999999998,0.95497999999999994,0.95497999999999994]
[null,20004955,"NQ","RURAL SHORT",283,32.594549999999998,0.31566,1.9000000000000001,17.311397530320722,8.281736182598868,26,698.60676999999998,202.76855,4.4028299999999998,2.3568899999999999,35,334.21201000000002,334.21201000000002,1.3144899999999999,1.3144899999999999]
[null,20005039,"NQ","RURAL SHORT",2,15.124549999999999,0,0,2.8486133879781421E-4,6.2537947783849425E-3,4,37.533329999999999,22.325000000000003,2,1,3,824,824,3,3]
[null,20005133,"NQ","RURAL LONG",1136,252.07753,0.54123999999999994,4.032,10.905306251389202,0.11280661592404122,47,757.37647000000004,488.99266,6.5950699999999998,4.6012300000000002,20,7.8344499999999995,7.8344499999999995,9.6829999999999999E-2,9.6829999999999999E-2]
[null,20005188,"NQ","RURAL SHORT",531,24.302589999999999,1.41811,5.234,5.5766479892071086,2.3400309068485678,17,337.73878999999999,29.91142,3.1581899999999998,0.15631,21,141.71940000000001,141.71940000000001,1.03013,1.03013]
[null,20005242,"NQ","URBAN",156,3.19998,0.89824999999999999,2.58,37.644813885754367,0.68433716654984,13,507.77692000000002,151.30458999999999,3.69231,0.77564,2,9.2307699999999997,9.2307699999999997,6.4100000000000004E-2,6.4100000000000004E-2]
[null,20005265,"NQ","RURAL SHORT",1210,20.01895,0.48740999999999995,4.2620000000000005,9.5048326522787825,0.55131946910915031,39,649.51211999999998,361.77321000000001,6.1280999999999999,4.1487600000000002,16,37.674379999999999,37.674379999999999,0.11156999999999999,0.11156999999999999]
[null,20005314,"NQ","RURAL SHORT",791,13.286949999999999,0.40838999999999998,2.1830000000000003,12.357384665984224,2.7788627729419559,25,815.14036999999996,526.59064000000001,5.5031599999999994,3.5082199999999997,17,183.30441999999999,183.30441999999999,0.88368999999999998,0.88368999999999998]
[null,20005336,"NQ","URBAN",824,6.9130499999999993,1.08944,5.1160000000000005,8.4211126775096368,2.2286941009684949,21,515.14572999999996,243.85651000000001,3.5424799999999999,1.3932,24,136.33616999999998,136.33616999999998,0.89319999999999999,0.89319999999999999]
[null,20005357,"NQ","URBAN",672,5.5729099999999994,1.40618,2.77,2.871917311161106,3.6024858317064996E-3,5,265.73212000000001,8.6946200000000005,2.1428599999999998,0.12797999999999998,10,0.33332999999999996,0.25892999999999999,1.6369999999999999E-2,1.3389999999999999E-2]
[null,20005412,"NQ","URBAN",1655,12.01577,0.38614999999999999,5.157,4.0597195228169438,3.1960421018311994E-2,38,324.42777999999998,62.226859999999995,2.76254,0.78911999999999993,40,2.5540799999999999,2.5540799999999999,9.2449999999999991E-2,9.2449999999999991E-2]
[null,20005447,"NQ","RURAL SHORT",578,10.18304,1.42597,2.2250000000000001,3.8422589282237292,1.8579262820710587,23,346.79322000000002,346.72575000000001,3.7543299999999999,3.7526000000000002,52,167.69203999999999,167.69203999999999,0.74047999999999992,0.74047999999999992]
[null,20005482,"NQ","RURAL SHORT",1330,42.471060000000001,1.40496,4.1970000000000001,1.1019709148307539,1.3381310070247543,74,152.91258999999999,150.52162999999999,3.80301,3.7571399999999997,81,185.68283,185.68283,0.85940000000000005,0.85940000000000005]
[null,20005577,"NQ","URBAN",932,9.0588099999999994,0.21878999999999998,3.012,0.4340059317648276,0.68682414748824416,44,58.603539999999995,56.248959999999997,1.3980699999999999,1.3948499999999999,78,92.741419999999991,92.741419999999991,0.36695,0.36695]
[null,20005605,"NQ","RURAL SHORT",620,10.94449,0.43160999999999999,3.7760000000000002,2.2486405504677376,0.20866841949502296,29,161.50312,157.08366000000001,2.5145200000000001,2.4387099999999999,17,14.9871,14.9871,5.645E-2,5.645E-2]
[null,20005628,"NQ","RURAL SHORT",465,12.84399,0.35548999999999997,1.4710000000000001,0.53412084375086144,6.2361084749201108E-2,24,77.987309999999994,77.987309999999994,2.2752699999999999,2.2752699999999999,7,9.1053800000000003,9.1053800000000003,0.17418999999999998,0.17418999999999998]
[null,20005659,"NQ","RURAL SHORT",1,0,0,0,11.990219211861872,9.5149642786265805,4,585.96667000000002,204.56666999999999,4,2,4,465,465,4,4]
[null,20005787,"NQ","RURAL SHORT",46,72.681649999999991,0,0,13.86970164092242,0,6,1932.575,1924.3036199999999,4.9565199999999994,4.9347799999999999,"",0,0,0,0]
[null,20005832,"NQ","URBAN",674,3.8425000000000002,3.8752299999999997,4.4080000000000004,6.9766011292202057,0.29543842457596781,10,300.47057000000001,1.4067799999999999,1.0089000000000001,1.6319999999999998E-2,42,12.724039999999999,12.724039999999999,8.6050000000000001E-2,8.6050000000000001E-2]
[null,20005851,"NQ","URBAN",409,5.4549300000000001,1.65639,3.6880000000000002,0.49289685590091092,2.680529262490627E-2,12,27.199959999999997,27.199959999999997,0.19314999999999999,0.19314999999999999,23,1.47922,1.4425399999999999,6.8459999999999993E-2,6.6009999999999999E-2]
[null,20005887,"NQ","RURAL SHORT",298,1.8766,0.92840999999999996,0.48300000000000004,1.0303343292959906E-2,0.1053519059860565,1,1.7147699999999999,1.7147699999999999,2.349E-2,2.349E-2,21,17.533559999999998,17.533559999999998,0.17450000000000002,0.17450000000000002]
[null,20005919,"NQ","URBAN",482,4.2521899999999997,0.43967000000000001,4.1669999999999998,6.4674520019015578,0.14188182340629371,15,238.81766999999999,238.79276999999999,0.32780000000000004,0.32572999999999996,15,5.2391399999999999,5.2391399999999999,6.2239999999999997E-2,6.2239999999999997E-2]
[null,20005944,"NQ","URBAN",957,6.6797399999999998,0.69250999999999996,2.4140000000000001,1.0995129336811968E-2,1.0391717573945415E-2,8,1.2416199999999999,1.2416199999999999,1.149E-2,1.149E-2,57,1.1734799999999999,1.01674,7.9409999999999994E-2,7.4189999999999992E-2]
[null,20005962,"NQ","URBAN",174,7.8533499999999998,1.4493199999999999,2.8620000000000001,6.2654297485621804,3.9954629691613537,9,103.65018999999999,103.65018999999999,1.1379299999999999,1.1379299999999999,9,66.097700000000003,66.097700000000003,0.41953999999999997,0.41953999999999997]
[null,20005978,"NQ","URBAN",1200,8.6670400000000001,0.65860000000000007,3.8410000000000002,2.7921257082267132,0.31922260605788094,31,246.78307999999998,246.73849000000001,3.1983299999999999,3.1975000000000002,23,28.21461,26.93544,0.24750000000000003,0.22333]
[null,20006009,"NQ","URBAN",34,2.3679000000000001,0.39067999999999997,2.3940000000000001,7.5361728019008902,47.018607572213071,2,18.700979999999998,18.700979999999998,0.32352999999999998,0.32352999999999998,3,116.67646999999999,116.67646999999999,0.76471,0.76471]
[null,20006023,"NQ","RURAL SHORT",392,3.5271399999999997,0.17013999999999999,0.9860000000000001,0.46581681411347253,0.1887932141560234,11,50.076909999999998,49.946809999999999,0.49234999999999995,0.48980000000000001,31,20.295919999999999,20.295919999999999,0.33928999999999998,0.33928999999999998]
[null,20006136,"NQ","RURAL SHORT",294,50.784300000000002,0.33080999999999999,1.45,16.00806830989827,1.4020149427310308E-2,26,2019.4956299999999,504.87630000000001,10.43197,8.4863900000000001,4,1.76871,1.76871,1.7010000000000001E-2,1.7010000000000001E-2]
[null,20006212,"NQ","RURAL SHORT",240,96.193049999999999,0,1.45,31.730469066098355,4.7781301326081085,60,3726.3857600000001,698.76639,12.39583,11.37083,25,561.13750000000005,561.13750000000005,2.3666700000000001,2.3666700000000001]
[null,20006350,"NQ","RURAL SHORT",247,130.11440000000002,0,0.85,56.998732302133668,10.170976924278072,12,4683.5394100000003,265.93212,2.14575,1.1498000000000002,18,835.74089000000004,835.74089000000004,2.6437200000000001,2.6437200000000001]
[null,20006383,"NQ","RURAL LONG",185,503.86453999999998,0.64063999999999999,0.46,18.811713678261899,1.8222712115546706E-2,16,2008.8477499999999,2008.8477499999999,3.6756799999999998,3.6756799999999998,1,1.9459499999999998,1.9459499999999998,1.081E-2,1.081E-2]
[null,20006478,"NQ","RURAL SHORT",53,31.927519999999998,0,0.624,64.542131027712585,13.082813901173333,9,3753.6295599999999,90.497479999999996,2.1320799999999998,1.13208,17,760.86792000000003,760.86792000000003,2.6037699999999999,2.6037699999999999]
[null,20006518,"NQ","RURAL SHORT",173,129.69567000000001,0,0.624,46.552118336248284,4.5015639102705327E-2,23,4614.7422000000006,284.33179000000001,3.21387,2.2023099999999998,27,4.4624299999999995,4.4624299999999995,0.15606999999999999,0.15606999999999999]
[null,20006599,"NQ","RURAL SHORT",1,1.1193,0,0.05,1.7724790927483975,5.5488352793040292,4,75.066670000000002,44.65,4,2,1,235,235,1,1]
[null,20006666,"NQ","RURAL SHORT",1016,9.5500000000000007,3.3169299999999997,3.702,5.0508482042445291,0.119816748073326,49,566.26805999999999,64.576970000000003,2.02854,1.2372000000000001,88,13.433069999999999,13.433069999999999,0.1565,0.1565]
[null,20006697,"NQ","RURAL SHORT",255,51.668089999999999,8.1919999999999993E-2,3.3720000000000003,17.134509553070806,1.6484206308762104,43,1172.37745,985.96464000000003,10.01961,9.0235299999999992,37,112.78824,112.78824,0.91764999999999997,0.91764999999999997]
[null,20006799,"NQ","RURAL SHORT",370,93.436859999999996,0.11792,2.7040000000000002,1.1846653552493447,0.47923385494362514,53,120.43977,113.71338,1.75135,1.7459499999999999,42,48.721619999999994,48.721619999999994,0.22972999999999999,0.22972999999999999]
[null,20006948,"NQ","RURAL SHORT",382,93.201340000000002,0.14604,3.0390000000000001,10.906370783344578,0.11845963075870297,58,1037.8163199999999,175.43075999999999,2.5366499999999998,1.53403,53,11.27225,11.27225,0.15445,0.15445]
[null,20007111,"NQ","RURAL SHORT",303,73.052939999999992,5.8229999999999997E-2,2.9010000000000002,14.637656734519426,0.51257827478674134,44,1306.8326199999999,95.596639999999994,1.7755799999999999,0.52805000000000002,23,45.76238,45.76238,0.19802,0.19802]
[null,20007229,"NQ","RURAL SHORT",294,14.246989999999998,1.31332,2.6,0.39206169270394597,4.6241654844039557,17,26.5733,26.5733,0.51361000000000001,0.51361000000000001,54,313.41836999999998,313.41836999999998,1.4489799999999999,1.4489799999999999]
[null,20007292,"NQ","URBAN",1021,6.4790799999999997,1.3864000000000001,3.3820000000000001,0.44057332938686228,7.3858989450010584E-2,16,37.911119999999997,36.716989999999996,0.28794999999999998,0.25268999999999997,16,6.3555299999999999,6.3555299999999999,4.7009999999999996E-2,4.7009999999999996E-2]
[null,20007314,"NQ","URBAN",989,6.4632800000000001,1.76979,3.7090000000000001,1.4348471340532511,3.3407827152055015E-2,21,93.661540000000002,93.563040000000001,0.41052,0.40848999999999996,49,2.1807400000000001,2.1069299999999997,7.9879999999999993E-2,6.9769999999999999E-2]
[null,20007334,"NQ","URBAN",1326,6.4456000000000007,0.64012000000000002,3.39,0.10915761020670035,3.7005558859182679E-3,13,10.433309999999999,7.2443900000000001,0.10632999999999999,6.6369999999999998E-2,14,0.35370000000000001,0.35370000000000001,1.584E-2,1.584E-2]
[null,20007358,"NQ","URBAN",745,3.8981699999999999,0.81190999999999991,3.1990000000000003,0.11845542291937938,3.9963891034303688E-3,12,15.08559,14.964789999999999,0.16241999999999998,0.16106999999999999,7,0.50895000000000001,0.50895000000000001,9.4000000000000004E-3,9.4000000000000004E-3]
[null,20007373,"NQ","URBAN",726,5.0241000000000007,3.6684299999999999,3.637,1.2720094254367191,0.93793560493575467,12,70.840789999999998,70.662100000000009,1.0165299999999999,1.01515,94,52.23554,51.873280000000001,0.49448999999999999,0.47933999999999999]
[null,20007392,"NQ","RURAL SHORT",583,4.0026599999999997,0.27371000000000001,1.21,7.9785509510330709E-3,2.5039507034859767E-2,8,1.1832799999999999,1.1832799999999999,1.372E-2,1.372E-2,8,3.7135499999999997,3.7135499999999997,0.11491999999999999,0.11491999999999999]
[null,20007427,"NQ","URBAN",1295,4.8989000000000003,0.94956999999999991,2.8530000000000002,0.20814792517843039,0.50732936740892132,24,27.82375,27.82375,0.27876000000000001,0.27876000000000001,17,67.816220000000001,67.816220000000001,0.48880000000000001,0.48880000000000001]
[null,20007445,"NQ","URBAN",262,2.9035000000000002,0.93177999999999994,2.3410000000000002,1.2907212389395253,0.73170499710549353,5,44.624939999999995,44.586770000000001,0.49617999999999995,0.49236999999999997,5,25.297709999999999,25.297709999999999,0.50381999999999993,0.50381999999999993]
[null,20007497,"NQ","RURAL SHORT",26,33.539209999999997,9.9500000000000005E-2,0.45400000000000001,17.191349821030087,2.9006096955697411,16,1694.8384599999999,1576.05513,7.9615399999999994,6.9615399999999994,3,285.96154000000001,285.96154000000001,2.9615399999999998,2.9615399999999998]
[null,20007576,"NQ","RURAL SHORT",1,3.0449999999999998E-2,2.8479999999999998E-2,0,3404.9999176381152,267.40836849507735,4,445.66667000000001,328.56666999999999,4,3,2,35,35,2,2]
[null,20007634,"NQ","RURAL LONG",284,1285.17975,0,0.55000000000000004,38.158397722344013,6.0374237467025926,69,3765.8606799999998,3676.7945399999999,6.6619699999999993,6.5281699999999994,38,595.83467999999993,595.83467999999993,2.1971799999999999,2.1971799999999999]
[null,20007716,"NQ","RURAL SHORT",714,40.83954,1.13889,2.2000000000000002,1.9282098879174661,0.68679021724416134,38,151.48674,143.16237000000001,2.4495800000000001,2.3767499999999999,24,53.956579999999995,53.865549999999999,0.21848999999999999,0.21428999999999998]
[null,20007736,"NQ","RURAL LONG",93,477.17748,0,0.35500000000000004,8.1357541345601962,16.62558055798786,13,797.11470000000008,797.11470000000008,3.7957000000000001,3.7957000000000001,39,1628.9202499999999,1628.9202499999999,6.3225799999999994,6.3225799999999994]
[null,20008110,"NQ","RURAL SHORT",479,10.661900000000001,5.1593299999999997,3.1230000000000002,4.235160654412793E-2,1.6469567233895945,5,1.9545599999999999,1.9545599999999999,1.67E-2,1.67E-2,40,76.008349999999993,76.008349999999993,0.39665999999999996,0.39665999999999996]
[null,20008154,"NQ","RURAL SHORT",448,8.8528299999999991,0.62180999999999997,1.7610000000000001,0.6099746881315089,1.7495329861487405,12,61.115700000000004,55.771609999999995,0.9508899999999999,0.87722999999999995,54,175.29240999999999,175.28125,0.96651999999999993,0.96428999999999998]
[null,20008189,"NQ","URBAN",198,15.194609999999999,0.12506999999999999,1.0900000000000001,1.681092941889708,0,11,211.03359,211.03359,2.88889,2.88889,"",0,0,0,0]
[null,20008226,"NQ","RURAL SHORT",331,82.551349999999999,4.7279999999999996E-2,3.3000000000000003,7.393745675553296,0.22565012402343534,61,994.27754000000004,993.7002,9.8942599999999992,9.8882199999999987,5,30.34441,30.34441,0.12386999999999999,0.12386999999999999]
[null,20008373,"NQ","RURAL SHORT",245,51.205859999999994,4.2109999999999995E-2,1.9000000000000001,11.000967424094851,0.95384324567484802,37,1510.7221099999999,1510.7221099999999,9.8530599999999993,9.8530599999999993,5,130.98776000000001,130.98776000000001,0.51429000000000002,0.51429000000000002]
[null,20008471,"NQ","RURAL SHORT",131,36.159149999999997,0.27429999999999999,1.6400000000000001,23.700871268820638,0.41457140948532806,34,1204.05242,1204.05242,8.2748100000000004,8.2748100000000004,6,21.061069999999997,21.061069999999997,0.25190999999999997,0.25190999999999997]
[null,20008686,"NQ","RURAL LONG",49,299.37311999999997,0.19857999999999998,0,35.917997049550969,22.687881648325462,15,2526.6200699999999,2522.90544,9.4898000000000007,9.4693899999999989,16,1595.9591800000001,1595.9591800000001,9.1632699999999989,9.1632699999999989]
[null,20008745,"NQ","RURAL LONG",36,397.66919000000001,0.19822999999999999,0,33.779947545746012,16.821733818400073,23,1840.1569400000001,1840.1569400000001,7.63889,7.63889,9,916.36111000000005,720.86111000000005,6.86111,6.36111]
[null,20008784,"NQ","RURAL LONG",35,329.21447999999998,0.19761999999999999,0,67.559203077547593,31.953106309825362,27,3130.6485699999998,2794.6961900000001,10.8,10.485709999999999,23,1480.68571,1302.8571400000001,9.1714299999999991,8.6285699999999999]
[null,20008837,"NQ","RURAL LONG",34,263.89387999999997,0.20465,0,21.5513208260741,1.5882939636240778,12,2252.4289199999998,2252.4289199999998,8.9705899999999996,8.9705899999999996,4,166,166,4,4]
[null,20008889,"NQ","URBAN",1,0,0.10984999999999999,2.97,763.81801054852326,0,5,242.9,242.9,5,5,"",0,0,0,0]
[null,20008892,"NQ","RURAL SHORT",498,84.47936,0.57950999999999997,5.2270000000000003,6.2371076731786399,0.96381161351222322,77,342.02992,341.98293000000001,5.8353399999999995,5.8333300000000001,70,52.853409999999997,52.853409999999997,0.39960000000000001,0.39960000000000001]
[null,20009032,"NQ","URBAN",0,3.7730899999999998,0.32933000000000001,3.4590000000000001,0,0,"",0,0,0,0,"",0,0,0,0]
[null,20009035,"NQ","RURAL SHORT",84,58.354239999999997,2.2409999999999999E-2,1.35,44.941433396261154,6.6102262420339111,17,1909.8079399999999,467.34127000000001,7.6785699999999997,6.6785699999999997,7,280.90476000000001,280.90476000000001,1.8809499999999999,1.8809499999999999]
[null,20009089,"NQ","URBAN",1,3.5463399999999998,0.18819,1.7290000000000001,24281.186903384812,101656.36759493672,4,795.86667,795.86667,4,4,2,3332,3332,2,2]
[null,20009094,"NQ","URBAN",0,3.62418,0.19860999999999998,3.6980000000000004,0,0,"",0,0,0,0,"",0,0,0,0]
[null,20009098,"NQ","RURAL SHORT",7,5.6996799999999999,9.5019999999999993E-2,0.95000000000000007,2.8397392277564952,1.704728514323784,4,609.68332999999996,609.68332999999996,4,4,1,366,366,1,1]
[null,20009306,"NQ","RURAL SHORT",312,99.018450000000001,6.0979999999999999E-2,1.006,3.3111402742455671,6.0440984938346105,38,469.38697000000002,469.38697000000002,3.47756,3.47756,5,856.81090000000006,856.81090000000006,3.0352600000000001,3.0352600000000001]
[null,20009481,"NQ","RURAL SHORT",0,0,0,0,0,0,"",0,0,0,0,"",0,0,0,0]
[null,20009483,"NQ","RURAL SHORT",0,0,0,0,0,0,"",0,0,0,0,"",0,0,0,0]
[null,20009493,"NQ","RURAL SHORT",17,13.46393,0,0,1.3009408732000443,0,5,117.74412,92.332349999999991,2.23529,1.1764699999999999,"",0,0,0,0]
[null,20009512,"NQ","RURAL SHORT",4,0,0,2.6,670.7412484573664,6210.3449696729967,2,232.88333,232.88333,1.75,1.75,1,2156.25,2156.25,1.25,1.25]
[null,20009515,"NQ","RURAL SHORT",371,5.7244799999999998,3.7339999999999998E-2,0.91800000000000004,2.1987320180151553,3.1959740743287972E-4,15,333.80270000000002,333.80270000000002,2.0269499999999998,2.0269499999999998,1,4.8520000000000001E-2,4.8520000000000001E-2,2.7000000000000001E-3,2.7000000000000001E-3]
[null,20009612,"NQ","RURAL SHORT",1,0,0,1.6870000000000001,1334.8336685040258,2808.9741526019689,1,272.76666999999998,272.76666999999998,1,1,1,574,574,1,1]
[null,20009615,"NQ","RURAL SHORT",599,37.041559999999997,0.15307999999999999,0.83600000000000008,2.3010180062318324,9.5651298289133692E-5,20,401.49993999999998,401.49993999999998,3.1285499999999997,3.1285499999999997,1,1.669E-2,1.669E-2,1.6699999999999998E-3,1.6699999999999998E-3]
[null,20009684,"NQ","RURAL SHORT",199,45.188749999999999,0.48895,1.075,1.6519369691244439,0.24791349554513251,25,230.63936000000001,230.63936000000001,4.3266299999999998,4.3266299999999998,1,34.61307,34.61307,0.10553,0.10553]
[null,20009806,"NQ","RURAL SHORT",238,77.363979999999998,5.142E-2,1.52,4.1908620273018347,2.7178769863490824,27,275.28550000000001,274.81274999999999,3.1470599999999997,3.1428599999999998,3,178.52940999999998,178.52940999999998,0.94538,0.94538]
[null,20009872,"NQ","RURAL SHORT",6,21.175169999999998,0,0,40.401496682938429,33.536841680129243,6,1442.0138899999999,1031.6166699999999,5.1666699999999999,3,4,1197,1197,4,4]
[null,20009878,"NQ","RURAL SHORT",122,20.037990000000001,0.30008999999999997,0.374,75.130377425548829,0.7714099822187348,57,7902.4505499999996,539.71762000000001,3.4590199999999998,2.5655699999999997,6,81.13933999999999,81.13933999999999,0.45901999999999998,0.45901999999999998]
[null,20009882,"NQ","RURAL SHORT",96,22.08925,0.32181999999999999,1.6620000000000001,289.60660668156044,8.3714585828550431E-2,55,9081.0619800000004,120.72743,2.1354199999999999,1.1666699999999999,1,2.625,2.625,1.0419999999999999E-2,1.0419999999999999E-2]
[null,20009956,"NQ","RURAL SHORT",62,44.259589999999996,0.21076,1.68,813.05001896470287,0.78927406648044929,94,18359.464250000001,47.22231,1.87097,0.35483999999999999,3,17.822579999999999,17.822579999999999,8.0649999999999999E-2,8.0649999999999999E-2]
[null,20010102,"NQ","RURAL SHORT",125,123.56377000000001,1.47353,1.782,352.22516544954931,1.6606953090220982,124,13818.413199999999,595.3836,4.4880000000000004,3.44,7,65.152000000000001,65.152000000000001,0.26400000000000001,0.26400000000000001]
[null,20010278,"NQ","RURAL SHORT",0,0,0,0,0,0,"",0,0,0,0,"",0,0,0,0]
[null,20010282,"NQ","URBAN",260,0.11131999999999999,2.2950900000000001,3.29,5.0365728397042321E-2,1.046284852608738,1,1.1051299999999999,1.1051299999999999,3.8499999999999997E-3,3.8499999999999997E-3,22,22.957689999999999,22.957689999999999,0.45384999999999998,0.45384999999999998]
[null,20010292,"NQ","RURAL SHORT",0,0,0,3.6760000000000002,0,0,"",0,0,0,0,"",0,0,0,0]
[null,20010294,"NQ","URBAN",6,0,3.1608499999999999,2.6710000000000003,154.21814781542835,3.1338843727688528,1,82.016669999999991,82.016669999999991,1,1,1,1.6666699999999999,1.6666699999999999,0.16666999999999998,0.16666999999999998]
[null,20010298,"NQ","URBAN",320,2.0582499999999997,0.37041999999999997,1.246,0.49671535682899526,4.5374108710390514E-2,5,52.272449999999999,52.272449999999999,1.0875000000000001,1.0875000000000001,7,4.7750000000000004,4.7750000000000004,3.4380000000000001E-2,3.4380000000000001E-2]
[null,20010317,"NQ","URBAN",76,0,2.2725499999999998,1.274,9.7153483650324013,2.9290229158172667,4,135.33924999999999,135.33924999999999,0.31578999999999996,0.31578999999999996,8,40.802630000000001,40.802630000000001,0.32894999999999996,0.32894999999999996]
[null,20010324,"NQ","URBAN",0,0,3.4900499999999997,2.1840000000000002,0,0,"",0,0,0,0,"",0,0,0,0]
[null,20010327,"NQ","URBAN",696,5.4233000000000002,0.55876999999999999,1.8360000000000001,0.83096289023345671,0.34201146966683821,16,90.734290000000001,90.734290000000001,1.50431,1.50431,13,37.344830000000002,37.344830000000002,0.19397,0.19397]
[null,20010359,"NQ","URBAN",293,1.1004499999999999,1.05314,0.92700000000000005,0.31103700878904017,2.4941456372380846E-2,4,18.940100000000001,18.940100000000001,0.16381999999999999,0.16381999999999999,17,1.51877,1.51877,5.8019999999999995E-2,5.8019999999999995E-2]
[null,20010374,"NQ","URBAN",13,0,1.1840000000000002,1.5550000000000002,2.7371953440468788,0,1,8.7487199999999987,8.7487199999999987,7.6920000000000002E-2,7.6920000000000002E-2,"",0,0,0,0]
[null,20010376,"NQ","URBAN",738,2.0410399999999997,2.6517299999999997,3.0300000000000002,6.9288596997023406,1.1052076010277567,9,403.30689000000001,403.30689000000001,2.0677499999999998,2.0677499999999998,48,64.330619999999996,64.330619999999996,0.57994999999999997,0.57994999999999997]
[null,20010404,"NQ","RURAL SHORT",0,0,0,1.5960000000000001,0,0,"",0,0,0,0,"",0,0,0,0]
[null,20010414,"NQ","URBAN",194,0,2.3808799999999999,1.159,3.7935384801586161E-2,4.7080607676886529E-2,1,0.95111999999999997,0.95111999999999997,5.1500000000000001E-3,5.1500000000000001E-3,7,1.18041,1.18041,6.1859999999999998E-2,6.1859999999999998E-2]
[null,20010419,"NQ","URBAN",32,0,2.23739,2.2360000000000002,0,0,"",0,0,0,0,"",0,0,0,0]
[null,20010437,"NQ","RURAL SHORT",6,11.83433,0,0,8.9850603790164545,7.0615329627596308,7,981.01666999999998,599.61667,6.1666699999999999,4.1666699999999999,5,771,771,5,5]
[null,20010444,"NQ","RURAL SHORT",48,59.129709999999996,0.23494999999999999,0.74,45.103204438224601,2.2602156526887152,12,1336.5871500000001,1250.37222,7.0208300000000001,6.6666699999999999,1,66.979169999999996,66.979169999999996,2.0829999999999998E-2,2.0829999999999998E-2]
[null,20010480,"NQ","RURAL SHORT",105,95.528919999999999,8.4219999999999989E-2,1.9580000000000002,22.419514195644965,0.76110385311203721,24,842.45810000000006,762.61683000000005,6.4952399999999999,5.9714299999999998,2,28.6,28.6,1.9049999999999997E-2,1.9049999999999997E-2]
[null,20010573,"NQ","RURAL SHORT",23,81.924469999999999,0,0,1.9388287642116526,8.639982680940486,6,184.06811999999999,171.33767999999998,2.13043,2.0434799999999997,5,820.26086999999995,820.26086999999995,3,3]
[null,20010596,"NQ","RURAL SHORT",42,98.321359999999999,0,0,2.3855549438904444,2.0525767083028814,5,256.13213999999999,109.59166999999999,2.4523799999999998,1.2857099999999999,4,220.38094999999998,220.38094999999998,1,1]
[null,20010627,"NQ","RURAL SHORT",1,1.6811199999999999,0,2.5000000000000001E-2,2.625993584642532,0,3,231.11667,96.933329999999998,3,1,"",0,0,0,0]
[null,20010631,"NQ","RURAL SHORT",81,38.751480000000001,0.12964999999999999,1.1000000000000001,9.5743566956982242,17.83033228793726,17,315.04239000000001,315.04239000000001,6.2222200000000001,6.2222200000000001,21,586.70370000000003,586.70370000000003,4.4321000000000002,4.4321000000000002]
[null,20010674,"NQ","URBAN",16,5.9155600000000002,8.9209999999999998E-2,2.1,39.547356655155923,5.8930879726028875,6,234.87813,172.31563,3.9375,3.125,2,35,35,2,2]
[null,20010686,"NQ","RURAL SHORT",138,79.841089999999994,0.52872999999999992,1.4000000000000001,9.1212540586149533,2.3050478827730649,31,588.45761000000005,267.20832999999999,4.4637700000000002,4.2391299999999994,5,148.71014,148.71014,2.4492799999999999,2.4492799999999999]
[null,20010779,"NQ","RURAL SHORT",208,115.06220999999999,6.0679999999999998E-2,2.34,12.432268709138683,1.4465892595701995,59,717.86314000000004,716.95295999999996,6.3317299999999994,6.3269199999999994,12,83.528849999999991,83.528849999999991,2.4855799999999997,2.4855799999999997]
[null,20010920,"NQ","RURAL LONG",33,308.21161999999998,0,0,14.995187433432289,0.39392773468570347,13,1353.06717,859.90656999999999,8,7.7272699999999999,5,35.545449999999995,35.545449999999995,0.39393999999999996,0.39393999999999996]
[null,20010961,"NQ","RURAL SHORT",204,68.910039999999995,0.54013,0.84400000000000008,6.3953401928515996,4.3624049122667419,15,823.73374000000001,552.34942999999998,4.9019599999999999,3.90686,25,561.88724999999999,561.88724999999999,2.3970599999999997,2.3970599999999997]
[null,20011096,"NQ","RURAL SHORT",20,161.97476,0,0,13.897212765432693,0,7,1728.4150000000002,1728.4150000000002,4.75,4.75,"",0,0,0,0]
[null,20011122,"NQ","RURAL SHORT",2,0,0,0,6.6311457826741256,0,5,324.06666999999999,293.65000000000003,5,3,"",0,0,0,0]
[null,20011126,"NQ","RURAL LONG",38,406.20776999999998,0,0,15.739925665873733,1.618453568114727,15,996.07411999999999,971.05657999999994,4.2631600000000001,4.2368399999999999,1,102.42104999999999,102.42104999999999,0.73683999999999994,0.73683999999999994]
[null,20011182,"NQ","URBAN",721,2.61775,1.2564899999999999,2.0169999999999999,1.1489482308729411,4.1391155724679406E-2,3,116.47134,116.47134,1.0055499999999999,1.0055499999999999,65,4.1959099999999996,4.1959099999999996,0.15256999999999998,0.15256999999999998]
[null,20011211,"NQ","URBAN",74,0,1.3603699999999999,2.6190000000000002,23.037922002081629,1.0602653137873115,2,144.46485999999999,144.46485999999999,1,1,5,6.6486499999999999,6.6486499999999999,8.1079999999999999E-2,8.1079999999999999E-2]
[null,20011217,"NQ","URBAN",422,0,3.1050199999999997,3.2910000000000004,2.2927112012723869,0.26258117190317154,2,57.644079999999995,57.644079999999995,0.97630000000000006,0.97630000000000006,9,6.6019000000000005,6.6019000000000005,0.10427,0.10427]
[null,20011222,"NQ","RURAL SHORT",0,0,0,0,0,0,"",0,0,0,0,"",0,0,0,0]
[null,20011224,"NQ","URBAN",45,0,0.79530999999999996,0.83100000000000007,0.34095597318922138,0.22317097956841805,1,3.6666699999999999,3.6666699999999999,1,1,5,2.4,2.4,0.11111,0.11111]
[null,20011228,"NQ","RURAL SHORT",107,0,3.3693599999999999,0,0.52268471437432118,5.8036556764793161,1,3.7009300000000001,3.7009300000000001,1.00935,1.00935,6,41.09346,41.09346,0.28971999999999998,0.28971999999999998]
[null,20011230,"NQ","URBAN",15,0,1.0061599999999999,0.53500000000000003,1.0316375482838858,6.1898196625945312,1,3.6666699999999999,3.6666699999999999,1,1,1,22,22,0.4,0.4]
[null,20011235,"NQ","URBAN",180,0,1.25935,2.4470000000000001,1.5736882541820807,0.2548801613733957,2,38.691849999999995,38.691849999999995,1.3,1.3,6,6.2666699999999995,2.8222199999999997,0.12222,7.7780000000000002E-2]
[null,20011243,"NQ","URBAN",383,1.5688599999999999,2.7031000000000001,2.0640000000000001,0.30848808068626232,0.13542060151830043,7,10.952439999999999,10.952439999999999,1.1122699999999999,1.1122699999999999,56,4.8079200000000002,4.8079200000000002,0.17493,0.17493]
[null,20011334,"NQ","RURAL SHORT",1,0,0,0,5930.8564690373596,57234.268697257387,2,72.433329999999998,48.433329999999998,2,1,2,699,699,2,2]
[null,20011420,"NQ","RURAL SHORT",47,146.03542999999999,0,0,4.783905117621754,0,6,442.8766,411.81277,6.1276599999999997,4.0851100000000002,"",0,0,0,0]
[null,20011458,"NQ","RURAL SHORT",4,4.8960099999999995,0,0.19700000000000001,84.919939342766412,0,6,803.52500000000009,773.10833000000002,5.5,3.5,"",0,0,0,0]
[null,20011464,"NQ","RURAL SHORT",102,29.737549999999999,2.998E-2,1.125,30.845093431798706,0,10,567.81012999999996,537.98987,5.9313699999999994,3.9705899999999996,"",0,0,0,0]
[null,20011487,"NQ","RURAL SHORT",310,5.0496299999999996,0,0.91900000000000004,4.7995995411088499,0.67027974952255587,13,317.53757999999999,317.15000000000003,3.0967699999999998,3.09355,7,44.34516,44.34516,0.29676999999999998,0.29676999999999998]
[null,20011515,"NQ","RURAL SHORT",60,80.574289999999991,0,0.27,6.9004529366645482,7.1420562068825832,19,693.56638999999996,693.56638999999996,3.6166700000000001,3.6166700000000001,16,717.85,582.78332999999998,2.8000000000000003,2.15]
[null,20011545,"NQ","RURAL LONG",31,204.18459000000001,9.7669999999999993E-2,0,33.648238899567758,5.7670197389768196,11,2355.64032,2355.64032,4.3548399999999994,4.3548399999999994,18,403.73656,403.73656,5.03226,5.03226]
[null,20011598,"NQ","RURAL SHORT",0,0,0,0,0,0,"",0,0,0,0,"",0,0,0,0]
[null,20011656,"NQ","RURAL SHORT",1596,13.0281,1.4626599999999998,3.9080000000000004,1.2273906714838458,0.74050396658693607,48,149.04894999999999,148.9906,2.1748099999999999,2.1741899999999998,166,89.923559999999995,89.923559999999995,0.50187999999999999,0.50187999999999999]
[null,20011700,"NQ","RURAL SHORT",509,40.121409999999997,0.50885000000000002,1.871,3.9558810348887312,0.35938510900344423,16,374.74763999999999,374.74763999999999,2.9567799999999997,2.9567799999999997,16,34.045189999999998,34.045189999999998,0.15717,0.15717]
[null,20011701,"NQ","RURAL SHORT",81,25.485589999999998,0.56869000000000003,1.0980000000000001,68.469654314936975,2.3158844898639939,15,1448.33107,1448.33107,4.09877,4.09877,5,48.987649999999995,48.987649999999995,0.30863999999999997,0.30863999999999997]
[null,20011759,"NQ","RURAL SHORT",586,8.370239999999999,0.21933,2.129,2.300681952450558,1.0510572082481271,21,217.11942999999999,216.83564000000001,2.14676,2.1450499999999999,86,99.190129999999996,99.190129999999996,0.66723999999999994,0.66723999999999994]
[null,20011824,"NQ","RURAL LONG",31,224.36091999999999,0,0,88.740712162216795,8.2404869682378461,16,5493.1645200000003,5448.1871000000001,6.1612900000000002,6.1290299999999993,4,510.09676999999999,510.09676999999999,2.6774199999999997,2.6774199999999997]
[null,20011865,"NQ","RURAL SHORT",637,31.723100000000002,0.93701999999999996,1.4330000000000001,3.6757821267664559,3.091773128076067,27,560.92899,560.70330000000001,2.1397200000000001,2.13815,5,471.80848000000003,471.80848000000003,2.0376799999999999,2.0376799999999999]
[null,20011943,"NQ","RURAL SHORT",0,0,0,1.647,0,0,"",0,0,0,0,"",0,0,0,0]
[null,20011981,"NQ","URBAN",409,1.9729000000000001,2.5071000000000003,1.482,0.56445672468925556,4.7125082782904147E-4,12,58.571639999999995,58.571639999999995,0.46454999999999996,0.46454999999999996,2,4.8899999999999999E-2,4.8899999999999999E-2,4.8899999999999994E-3,4.8899999999999994E-3]
[null,20011984,"NQ","URBAN",960,0,7.9676,4.25,1.6348057472632557E-2,0.17775279830763968,10,1.15682,1.15682,1.354E-2,1.354E-2,5,12.57813,12.57813,8.2290000000000002E-2,8.2290000000000002E-2]
[null,20011987,"NQ","RURAL SHORT",1,0,0,2.2850000000000001,0,0,"",0,0,0,0,"",0,0,0,0]
[null,20012043,"NQ","RURAL LONG",21,202.58102,0,0,17.931465022762492,4.9994526425019838,13,1473.2738099999999,1442.8571400000001,9.1904799999999991,8.1904799999999991,9,410.76190000000003,410.76190000000003,1.6190499999999999,1.6190499999999999]
[null,20012178,"NQ","RURAL SHORT",381,60.985169999999997,0.80784999999999996,2.31,6.9327872261533772,1.0939406820125912,15,516.90913999999998,516.90913999999998,1.64042,1.64042,19,81.564300000000003,81.564300000000003,0.97112999999999994,0.97112999999999994]
[null,20012368,"NQ","RURAL SHORT",0,0,0,0,0,0,"",0,0,0,0,"",0,0,0,0]
[null,20012370,"NQ","RURAL SHORT",891,9.1443599999999989,0.43341999999999997,2.4450000000000003,1.2390293051297905,7.5111112608917271E-2,19,126.46902,126.46902,3.1178499999999998,3.1178499999999998,23,7.6666699999999999,7.6666699999999999,7.1829999999999991E-2,7.1829999999999991E-2]
[null,20012410,"NQ","RURAL SHORT",305,41.973219999999998,2.1974100000000001,1.3680000000000001,8.0754874449803626,0.43005685839118207,15,495.30086999999997,495.30086999999997,3.1737699999999998,3.1737699999999998,7,26.377050000000001,26.377050000000001,0.10163999999999999,0.10163999999999999]
[null,20012466,"NQ","URBAN",1,0,0.35360000000000003,6.4039999999999999,0,0,"",0,0,0,0,"",0,0,0,0]
[null,20012469,"NQ","URBAN",2,0,1.1287799999999999,2.4359999999999999,0,0,"",0,0,0,0,"",0,0,0,0]
[null,20012587,"NQ","RURAL SHORT",958,105.30217,0.53671999999999997,2.528,0.30872012816947525,2.3256469126411581,30,38.23601,38.162939999999999,0.21920999999999999,0.21815999999999999,51,288.03906999999998,288.03906999999998,1.8371599999999999,1.8371599999999999]
[null,20012863,"NQ","URBAN",0,0,0.35526999999999997,6.3879999999999999,0,0,"",0,0,0,0,"",0,0,0,0]
[null,20012865,"NQ","URBAN",5,1.9356,1.1441699999999999,4.806,2256.0478014278538,1060.3967683150183,2,343.38666999999998,343.38666999999998,1.2,1.2,1,161.4,161.4,0.2,0.2]
[null,20012872,"NQ","URBAN",0,0,0.35687999999999998,6.7,0,0,"",0,0,0,0,"",0,0,0,0]
[null,20012874,"NQ","RURAL SHORT",418,8.620239999999999,1.0205299999999999,1.655,6.7666843366814753,6.9048391153902246E-3,10,497.03214000000003,497.03214000000003,2.6411499999999997,2.6411499999999997,4,0.50717999999999996,0.50717999999999996,1.196E-2,1.196E-2]
[null,20012961,"NQ","RURAL SHORT",1,0,0,0,1024.5243802742616,18492.148575949366,4,545.5,545.5,4,4,4,9846,9846,4,4]
[null,20013025,"NQ","RURAL SHORT",2,0,0,1.1000000000000001E-2,0,0,"",0,0,0,0,"",0,0,0,0]
[null,20013028,"NQ","RURAL SHORT",0,0,7.886E-2,0,0,0,"",0,0,0,0,"",0,0,0,0]
[null,20013064,"NQ","RURAL SHORT",951,71.230779999999996,0.43848999999999999,2.2000000000000002,1.9801068350362336,2.0591789992077003,46,328.38999000000001,328.38999000000001,4.7381700000000002,4.7381700000000002,49,341.50367999999997,341.50367999999997,2.0073599999999998,2.0073599999999998]
[null,20013230,"NQ","RURAL SHORT",345,12.54904,0,1.4890000000000001,0.59172398275348626,0.25836969538741661,10,44.11609,44.11609,1.0695699999999999,1.0695699999999999,16,19.262800000000002,19.262800000000002,3.0289899999999998,3.0289899999999998]
[null,20013246,"NQ","URBAN",248,3.2618899999999997,0,1.325,0.93646027862229919,0.41323974832424548,7,47.110479999999995,47.021769999999997,1.0564499999999999,1.0524199999999999,11,20.78884,20.78884,3,3]
[null,20013260,"NQ","RURAL SHORT",5,14.01412,0,0,129.53521762055411,0,21,3168.07,1356.49667,15.4,3,"",0,0,0,0]
[null,20013273,"NQ","RURAL SHORT",66,55.313209999999998,9.0389999999999998E-2,1.147,9.1934817138672766,1.0578513714505946,15,869.07120999999995,869.07120999999995,5.7272699999999999,5.7272699999999999,2,100,100,0.28787999999999997,0.28787999999999997]
[null,20013453,"NQ","RURAL SHORT",218,102.69134,6.9609999999999991E-2,0.57800000000000007,2.6469807749794514,1.8770869922635942,22,316.86406999999997,307.23838000000001,2.38991,2.3348599999999999,15,224.70183,224.70183,0.91283999999999998,0.91283999999999998]
[null,20013575,"NQ","RURAL SHORT",5,2.8368599999999997,0,0,1.1589394246180946,5.0330493203641353,4,75.066670000000002,44.65,4,2,1,326,326,1,1]
[null,20020666,"NQ","RURAL LONG",31,305.70810999999998,0.10889,0,7.4701793657337436,0.9333055913273538,4,772.21397999999999,772.21397999999999,2.03226,2.03226,6,96.478489999999994,96.478489999999994,3.5483899999999999,3.5483899999999999]
[null,20020964,"NQ","URBAN",43,5.1372099999999996,1.4109099999999999,3.476,0,2.1905142668112174,"",0,0,0,0,3,27.953489999999999,27.953489999999999,0.11627999999999999,0.11627999999999999]
[null,25266407,"NQ","RURAL SHORT",0,0,0,0,0,0,"",0,0,0,0,"",0,0,0,0]
[null,25266408,"NQ","RURAL SHORT",797,13.73048,11.964749999999999,1.724,0.77166712634767543,7.8841964605183334E-2,13,82.465220000000002,82.465220000000002,2.3149299999999999,2.3149299999999999,11,8.4255499999999994,8.4255499999999994,0.28231000000000001,0.28231000000000001]
[null,25266410,"NQ","URBAN",1,0,0.36251,0.315,0,0,"",0,0,0,0,"",0,0,0,0]
[null,25266411,"NQ","RURAL SHORT",0,0,0,0,0,0,"",0,0,0,0,"",0,0,0,0]
[null,25267698,"NQ","URBAN",1,0,0.10730000000000001,1.9380000000000002,0,0,"",0,0,0,0,"",0,0,0,0]
[null,25267699,"NQ","URBAN",3,0,0.36337999999999998,4.4130000000000003,0,0,"",0,0,0,0,"",0,0,0,0]
[null,25267702,"NQ","URBAN",0,0,0.13033999999999998,2.8029999999999999,0,0,"",0,0,0,0,"",0,0,0,0]
[null,25267704,"NQ","URBAN",746,0,5.0740499999999997,2.528,0,0.25699569157175522,"",0,0,0,0,4,20.502679999999998,20.502679999999998,0.14476999999999998,0.14476999999999998]
[null,25267731,"NQ","RURAL SHORT",501,49.84449,0.18578,1.5050000000000001,0.16823492672963963,1.1315383592582235,24,19.407679999999999,14.10629,0.24750000000000003,0.20757999999999999,62,130.53493,130.38722999999999,0.89222000000000001,0.88023999999999991]
[null,25267735,"NQ","RURAL SHORT",420,112.84289,0.41578999999999999,0.8580000000000001,0.46516645223033404,9.6723866069792521,37,76.73433,76.501429999999999,0.82380999999999993,0.82142999999999999,43,1595.5667100000001,1595.5667100000001,4.6785699999999997,4.6785699999999997]
[null,25267746,"NQ","RURAL SHORT",397,6.5614599999999994,0.78311999999999993,1.7710000000000001,0.95940641677924643,1.127550159207438,10,87.089500000000001,80.174480000000003,1.32494,1.2745599999999999,33,102.35263999999999,102.32241999999999,0.51637,0.51134000000000002]
[null,25267801,"NQ","URBAN",23,0,0.58679999999999999,0.53700000000000003,0,0,"",0,0,0,0,"",0,0,0,0]
[null,25267831,"NQ","RURAL SHORT",848,2.7539799999999999,5.5733799999999993,2.411,0.62664924924561349,5.7695878893992067E-3,9,61.094519999999996,61.094519999999996,0.77829999999999999,0.77829999999999999,4,0.5625,0.5625,7.0799999999999995E-3,7.0799999999999995E-3]
[null,25267832,"NQ","URBAN",688,1.27386,5.2054799999999997,2.8090000000000002,3.4337964677120993,0.38893387462948115,9,293.79948999999999,293.79948999999999,5.27616,5.27616,7,33.277619999999999,33.277619999999999,0.19621999999999998,0.19621999999999998]
[null,25267833,"NQ","URBAN",0,0,4.9489999999999999E-2,3.7440000000000002,0,0,"",0,0,0,0,"",0,0,0,0]
[null,25267834,"NQ","RURAL SHORT",0,0,0,0,0,0,"",0,0,0,0,"",0,0,0,0]
[null,25267835,"NQ","URBAN",0,0,0.48361999999999999,2.7570000000000001,0,0,"",0,0,0,0,"",0,0,0,0]
[null,25267836,"NQ","RURAL SHORT",845,14.09108,5.7052100000000001,4.383,2.7088533439122873E-3,0.14189583174208525,1,0.16777,0.16777,2.3699999999999997E-3,2.3699999999999997E-3,4,8.7881699999999991,8.7881699999999991,8.1659999999999996E-2,8.1659999999999996E-2]
[null,25267837,"NQ","RURAL SHORT",191,0,3.23725,0,5.5776710694119258E-4,1.6733723468145289E-3,1,7.8530000000000003E-2,7.8530000000000003E-2,5.2399999999999999E-3,5.2399999999999999E-3,1,0.2356,0.2356,5.2399999999999999E-3,5.2399999999999999E-3]
[null,25267866,"NQ","RURAL SHORT",0,0,0.49520999999999998,0,0,0,"",0,0,0,0,"",0,0,0,0]
[null,25267868,"NQ","RURAL SHORT",0,0,0,0,0,0,"",0,0,0,0,"",0,0,0,0]
[null,25267872,"NQ","RURAL SHORT",0,0,0,0,0,0,"",0,0,0,0,"",0,0,0,0]
[null,25267897,"NQ","RURAL LONG",43,223.66422,0.10224999999999999,0,3.5425341835636996,1.0028541971679488,5,383.13410999999996,383.13410999999996,3.0465100000000001,3.0465100000000001,6,108.46124,108.46124,4.0465099999999996,4.0465099999999996]
[null,25267901,"NQ","RURAL LONG",44,418.98225000000002,9.4779999999999989E-2,0,24.023815210642624,0.35490834154467099,9,2459.41023,2459.41023,4.1136400000000002,4.1136400000000002,4,36.333329999999997,36.333329999999997,3.15909,3.15909]
[null,25268197,"NQ","RURAL SHORT",1136,16.251939999999998,15.62218,3.1640000000000001,4.7078829859936828,2.3064057499380883E-3,29,442.98570000000001,442.94871999999998,2.81074,2.80986,8,0.21701999999999999,0.21701999999999999,9.6799999999999994E-3,9.6799999999999994E-3]
[null,25268279,"NQ","URBAN",322,0.67006999999999994,3.6081000000000003,2.6070000000000002,0.22037602360556249,3.2538318615774525E-2,7,4.8587499999999997,4.8587499999999997,4.3479999999999998E-2,4.3479999999999998E-2,9,0.71738999999999997,0.71738999999999997,4.6579999999999996E-2,4.6579999999999996E-2]
[null,25268404,"NQ","URBAN",156,2.6836799999999998,0,1.0900000000000001,14.941625539886465,3.8248308106184883,13,764.49315999999999,764.49315999999999,5.94231,5.94231,7,195.69871999999998,195.69871999999998,4.2628199999999996,4.2628199999999996]
[null,25268407,"NQ","RURAL SHORT",139,18.51519,0,0.73699999999999999,11.803398498526835,3.3009524433687871,19,819.25959,819.25959,7.8848899999999995,7.8848899999999995,8,229.11510999999999,229.11510999999999,4.3093500000000002,4.3093500000000002]
[null,25268413,"NQ","RURAL LONG",132,935.52793999999994,0.65050000000000008,0,28.488631490360131,3.2880921958084657,44,2007.0710899999999,1931.9454499999999,7.9166699999999999,7.5833299999999992,15,231.65152,231.65152,4.4621199999999996,4.4621199999999996]
[null,25272934,"NQ","RURAL SHORT",24,89.700969999999998,0,0,17.185020330725315,2.220067709482564,8,1802.7916700000001,1802.7916700000001,2.875,2.875,6,232.89582999999999,232.89582999999999,3.5833299999999997,3.5833299999999997]
[null,25272938,"NQ","RURAL LONG",66,383.44088999999997,0,0,12.685143523565777,0.25152300669004118,18,1522.9338399999999,1522.9338399999999,6.8030299999999997,6.8030299999999997,5,30.19697,30.19697,3.1969699999999999,3.1969699999999999]
[null,25272945,"NQ","RURAL SHORT",16,67.375209999999996,0,0,9.782061763213445,1.2856224388715793,8,1245.4677099999999,1245.4677099999999,2.75,2.75,4,163.6875,163.6875,4.5625,4.5625]
[null,25273020,"NQ","RURAL SHORT",1063,7.6636799999999994,0.23013999999999998,1.6040000000000001,4.0283410656770791,6.2145053944246048E-2,19,338.49509,57.336419999999997,2.9181599999999999,1.0291599999999999,16,5.2219499999999996,5.2219499999999996,0.13547000000000001,0.13547000000000001]
[null,25273220,"NQ","RURAL SHORT",979,12.512509999999999,5.8013499999999993,3.0630000000000002,0.38587718290402007,0.15430690449324674,30,40.721499999999999,32.133469999999996,0.58223000000000003,0.53217999999999999,88,16.28396,16.051069999999999,0.15117,0.14401999999999998]
[null,25273274,"NQ","RURAL SHORT",21,134.40159,0,0,14.905487386877461,11.440610688913026,4,1040.6420599999999,1040.6420599999999,2.09524,2.09524,11,798.73810000000003,798.73810000000003,6.3333300000000001,6.3333300000000001]
[null,25273293,"NQ","RURAL LONG",62,361.01120000000003,0,0,21.467657707360775,0.24817769823306318,21,2246.2395200000001,2033.3145199999999,5.2258100000000001,4.2096799999999996,4,25.967739999999999,25.967739999999999,3.1451599999999997,3.1451599999999997]
[null,25273297,"NQ","RURAL LONG",60,291.63072999999997,0,0,39.287082140805516,4.5188246464798629,14,3340.7294400000001,3340.7294400000001,5.1833299999999998,5.1833299999999998,7,384.25278000000003,384.25278000000003,5.0833300000000001,5.0833300000000001]
[null,25273350,"NQ","RURAL SHORT",296,2.9666799999999998,0.16322999999999999,0.69600000000000006,0.2549092990568439,1.8198096990737715,9,31.840319999999998,31.840319999999998,0.22635,0.22635,20,227.30957000000001,227.30957000000001,1.5033799999999999,1.5033799999999999]
[null,25273354,"NQ","URBAN",985,4.7479300000000002,0.50642999999999994,3.1819999999999999,1.8199255137699144,0.25668467980980869,25,164.24032,114.33171,2.3319799999999997,2.0304599999999997,16,23.164669999999997,23.164669999999997,0.2,0.2]
[null,25273358,"NQ","URBAN",908,2.7432699999999999,3.0275599999999998,3.7450000000000001,0.2372179592699995,0.62216767499845727,9,25.827289999999998,25.827289999999998,0.28304000000000001,0.28304000000000001,19,67.738990000000001,67.738990000000001,0.36232999999999999,0.36232999999999999]
[null,25273362,"NQ","RURAL SHORT",626,4.9938399999999996,2.4160200000000001,1.8410000000000002,0.21178289000918785,1.1921031235908189E-2,8,19.808869999999999,19.808869999999999,0.18370999999999998,0.18370999999999998,11,1.1150199999999999,1.1150199999999999,2.5559999999999999E-2,2.5559999999999999E-2]
[null,25273540,"NQ","URBAN",188,2.6956799999999999,4.3223699999999994,3.9610000000000003,0.15279576832611985,1.3299434409983439,6,3.4258899999999999,3.4258899999999999,4.2549999999999998E-2,4.2549999999999998E-2,8,29.819149999999997,29.819149999999997,0.18084999999999998,0.18084999999999998]
[null,25274644,"NQ","URBAN",23,0,3.4121099999999998,2.37,0,1.7780296376446039,"",0,0,0,0,3,7.3304299999999998,7.3304299999999998,0.13042999999999999,0.13042999999999999]
[null,25274647,"NQ","URBAN",713,7.29697,3.0626199999999999,4.7350000000000003,6.0136972114574681,0.80641983645837056,31,259.95886000000002,194.76683,4.2917299999999994,3.29874,17,34.859749999999998,34.859749999999998,0.14446000000000001,0.14446000000000001]
[null,25274650,"NQ","URBAN",1249,2.1370299999999998,9.5938099999999995,4.9729999999999999,7.7765662848575973E-2,7.1623331374346844E-2,4,6.3476499999999998,6.3476499999999998,4.7239999999999997E-2,4.7239999999999997E-2,13,5.8462800000000001,5.8462800000000001,5.1240000000000001E-2,5.1240000000000001E-2]
[null,25275177,"NQ","URBAN",590,6.7564599999999997,1.0894200000000001,3.2610000000000001,1.019005157721778,0.59985037775907124,17,51.690309999999997,51.690309999999997,1.05254,1.05254,58,30.428159999999998,30.32986,0.52881,0.52202999999999999]
[null,25275672,"NQ","URBAN",499,3.4237000000000002,3.1870799999999999,2.0550000000000002,2.6134276033179704,1.4873822221464934,10,144.73781,144.73781,2.0861700000000001,2.0861700000000001,35,82.374749999999992,82.374749999999992,0.50500999999999996,0.50500999999999996]
[null,25276003,"NQ","RURAL LONG",49,322.53901999999999,0,0,23.83552048016394,0.48830049860546265,13,2215.52279,2215.52279,6.34694,6.34694,5,45.38776,45.38776,0.57142999999999999,0.57142999999999999]
[null,25276037,"NQ","URBAN",9,0,2.8344199999999997,2.2240000000000002,0,0,"",0,0,0,0,"",0,0,0,0]
[null,25279698,"NQ","URBAN",898,0,6.05063,3.4260000000000002,0.13397533424700719,0.16270933300196189,5,14.73048,14.73048,0.13807999999999998,0.13807999999999998,5,17.889759999999999,17.889759999999999,9.3539999999999998E-2,9.3539999999999998E-2]
[null,25279704,"NQ","RURAL SHORT",1,0,0,3.5950000000000002,0,0,"",0,0,0,0,"",0,0,0,0]
[null,25279705,"NQ","RURAL SHORT",216,3.0723599999999998,0.88300999999999996,0.59200000000000008,0,0,"",0,0,0,0,"",0,0,0,0]
[null,25279706,"NQ","RURAL SHORT",0,0,0,0,0,0,"",0,0,0,0,"",0,0,0,0]
[null,25279910,"NQ","URBAN",28,1.8472599999999999,1.29152,0.94500000000000006,0,5.0196228988308365,"",0,0,0,0,9,124.92857000000001,124.92857000000001,0.32142999999999999,0.32142999999999999]
[null,25280122,"NQ","RURAL SHORT",910,38.010190000000001,2.00421,2.7730000000000001,1.4826857479165942,1.3476498936802195,28,154.18319,153.66678999999999,1.19451,1.1912099999999999,27,140.14093,140.14093,0.41537999999999997,0.41537999999999997]
[null,25280514,"NQ","RURAL SHORT",499,29.486159999999998,5.4121600000000001,1.34,68.603905105276937,5.314781912612173E-2,97,7571.5615600000001,181.63146,2.1843699999999999,1.1963899999999998,3,5.8657300000000001,5.8657300000000001,6.0099999999999997E-3,6.0099999999999997E-3]
[null,25280567,"NQ","RURAL SHORT",1,2.5949999999999997E-2,0,0,2754.6018004115226,57.199279835390946,6,14784.5,431.75,6,4,1,307,307,1,1]
[null,25280582,"NQ","URBAN",3,0,3.7325000000000004,4.9930000000000003,0,0,"",0,0,0,0,"",0,0,0,0]
[null,30053744,"MK","RURAL SHORT",647,152.03989000000001,3.00332,3.2490000000000001,136.19734312608489,1.2934027614099407E-2,107,16486.961719999999,304.18349000000001,6.1932,4.6135999999999999,17,1.56569,1.56569,3.091E-2,3.091E-2]
[null,30053745,"MK","RURAL SHORT",847,114.56796,0.56987999999999994,2.8640000000000003,161.3250086927998,1.2810044333557478,191,17957.6001,748.81938000000002,8.8972800000000003,7.9067299999999996,33,142.59268,142.59268,0.59267999999999998,0.59267999999999998]
[null,30053746,"MK","RURAL SHORT",1130,15.570089999999999,1.7946099999999998,3.1240000000000001,96.190568489169337,1.7644922274139827,107,10509.496359999999,144.89937,5.14602,4.1522100000000002,43,192.78318999999999,192.78318999999999,0.90795999999999999,0.90795999999999999]
[null,30053747,"MK","RURAL SHORT",261,136.4418,0.45400999999999997,2.0489999999999999,219.22849569502688,3.7652666700751616,56,20433.46443,276.67502999999999,3.0728,2.0383100000000001,10,350.94636000000003,350.94636000000003,1.19157,1.19157]
[null,30053748,"MK","URBAN",1067,0.53542999999999996,8.3316299999999988,3.2320000000000002,232.18116468448358,0.25538598680656932,43,14608.41496,236.73982000000001,6.3786299999999994,4.4067499999999997,14,16.06842,16.06842,0.16025999999999999,0.16025999999999999]
[null,30053749,"MK","URBAN",810,1.89977,6.7774599999999996,3.298,300.1368300727334,0.33342951069657373,53,16363.84981,261.9135,7.0555599999999998,5.0629599999999995,12,18.179009999999998,18.179009999999998,0.18024999999999999,0.18024999999999999]
[null,30053750,"MK","URBAN",614,3.5057700000000001,2.90462,3.1480000000000001,132.78139836088707,0.66262231880313205,47,12144.998809999999,158.29262,7.13192,5.12378,10,60.607489999999999,60.607489999999999,0.42507999999999996,0.42507999999999996]
[null,30053751,"MK","RURAL SHORT",72,5.3826299999999998,0,0.25,261.34810988131653,5.2231258050456573,19,17786.66574,2375.5374999999999,9.6666699999999999,7.5416699999999999,2,355.47221999999999,355.47221999999999,1.0833299999999999,1.0833299999999999]
[null,30053752,"MK","RURAL LONG",702,199.11559,2.81867,1.7610000000000001,120.1391805775459,1.4052678723587626,129,15585.536969999999,276.47195999999997,7.7920199999999999,5.0199400000000001,32,182.30401000000001,182.30401000000001,0.97720999999999991,0.97720999999999991]
[null,30053753,"MK","RURAL SHORT",105,0,8.9344000000000001,0.222,73.357880579204974,0.2632330893891297,27,17095.047620000001,552.06635000000006,8.3047599999999999,6.2666699999999995,1,61.342859999999995,61.342859999999995,0.54286000000000001,0.54286000000000001]
[null,30053755,"MK","RURAL SHORT",124,54.995309999999996,8.233E-2,0.29799999999999999,58.890263734501708,0.82808914638498454,22,9897.7205599999998,117.97070000000001,5.5,3.5725799999999999,26,139.17741999999998,139.17741999999998,1.12097,1.12097]
[null,30053756,"MK","RURAL SHORT",393,187.71573000000001,0,1.7120000000000002,78.581189817819748,0.34219351879313831,62,12571.74733,425.36424999999997,8.4198500000000003,6.55471,68,54.745549999999994,54.745549999999994,0.50890999999999997,0.50890999999999997]
[null,30053764,"MK","RURAL SHORT",1,1.0431299999999999,0.11688999999999999,0,227432.62515964799,25372.106548874825,9,26577.916669999999,3596.55,9,7,1,2965,2965,1,1]
[null,30053765,"MK","RURAL LONG",819,212.97594000000001,0.42441999999999996,2.3320000000000003,80.122869016483591,0.49422140394135461,85,10925.737510000001,604.40711999999996,8.5787499999999994,7.5811999999999999,161,67.393159999999995,67.393159999999995,0.41025999999999996,0.41025999999999996]
[null,30053766,"MK","RURAL SHORT",1,1.1322699999999999,0,0,1016949.512079619,184296.54544303799,9,25399.383330000001,2234.5666700000002,9,6,2,4603,4603,2,2]
[null,30053767,"MK","RURAL SHORT",2,1.11425,27.154539999999997,0,271.48273426434139,47.093957607008768,8,13267.46667,1040.28333,4,3,2,2301.5,2301.5,1,1]
[null,30053769,"MK","RURAL SHORT",607,86.67989,0.44488999999999995,1.4570000000000001,56.857001785037717,1.9832248428759305,65,6185.3645500000002,380.61457999999999,4.3822099999999997,3.14662,53,215.75124,215.75124,2.2290000000000001,2.2290000000000001]
[null,30053770,"MK","RURAL LONG",843,210.17504,1.22455,1.927,51.947536468961708,1.0212223301326799,84,5879.9647699999996,246.60408999999999,3.2597899999999997,2.1577699999999997,81,115.59260999999999,115.59260999999999,1.5480399999999999,1.5480399999999999]
[null,30053771,"MK","RURAL SHORT",872,98.768219999999999,3.4273499999999997,2.581,106.89646701114852,1.1500713267178508,52,6819.0269500000004,320.18002999999999,3.7052799999999997,2.7282099999999998,16,73.364139999999992,73.364139999999992,1.1857800000000001,1.1857800000000001]
[null,30053772,"MK","RURAL SHORT",657,7.6129599999999993,3.5787799999999996,3.0860000000000003,33.336421280674465,2.1062840211608105,22,1667.3792699999999,141.91961000000001,3.0928499999999999,2.10046,20,105.34947,105.34947,1.53881,1.53881]
[null,30053773,"MK","RURAL SHORT",248,75.911069999999995,0,0.83700000000000008,83.665860638497719,0.18361453527497512,32,12773.188980000001,686.09328000000005,9.5362899999999993,8.5403199999999995,26,28.032259999999997,28.032259999999997,0.25,0.25]
[null,30053774,"MK","RURAL SHORT",536,67.503720000000001,1.00207,1.2830000000000001,60.866222756635736,0.31009944377838494,44,6795.4521500000001,108.71545,2.0951499999999998,1.09701,24,34.621269999999996,34.621269999999996,0.44775999999999999,0.44775999999999999]
[null,30053775,"MK","RURAL SHORT",409,7.6291399999999996,2.6222300000000001,1.0820000000000001,0.17871726225290585,1.4929412395020216,17,16.109089999999998,6.0868799999999998,5.3789999999999998E-2,4.8899999999999999E-2,36,134.56968000000001,134.56968000000001,0.77261999999999997,0.77261999999999997]
[null,30053776,"MK","RURAL SHORT",302,103.74441,0.24767999999999998,0.71300000000000008,85.364014791612803,0.64885416203013335,41,10529.56954,972.10843999999997,4.8311299999999999,2.8311299999999999,8,80.035539999999997,80.035539999999997,1.13245,1.13245]
[null,30053777,"MK","RURAL SHORT",284,116.45723,0,0.75800000000000001,84.061432798513849,0.57530326266033271,31,10756.76461,826.68362999999999,6.4577499999999999,4.4753499999999997,10,73.617609999999999,73.617609999999999,1.3063399999999998,1.3063399999999998]
[null,30053778,"MK","RURAL LONG",480,548.21555999999998,3.55965,1.5880000000000001,31.578861482293796,3.4061470914086232,42,1687.11608,110.71938,0.97916999999999998,0.79582999999999993,33,181.97507000000002,181.97507000000002,0.67708000000000002,0.67708000000000002]
[null,30053779,"MK","RURAL LONG",113,263.85591999999997,1.5406799999999998,1.589,313.58351701672979,9.6794189220804263,22,8612.9979399999993,1354.35988,3.7699099999999999,2.6991199999999997,10,265.85840999999999,265.85840999999999,1.2300899999999999,1.2300899999999999]
[null,30053780,"MK","RURAL SHORT",224,0,4.1669299999999998,1.0330000000000001,3.4371346557233671,1.0705276571211155,6,171.85804000000002,139.67254,1.3125,1.3080399999999999,3,53.526789999999998,53.526789999999998,0.19195999999999999,0.19195999999999999]
[null,30053781,"MK","RURAL LONG",167,229.46976999999998,3.4370399999999997,1.4470000000000001,72.166473573483103,1.616934183711725,13,4034.4892199999999,311.57425000000001,2.0778399999999997,1.12575,7,90.395209999999992,90.395209999999992,0.34731000000000001,0.34731000000000001]
[null,30053782,"MK","RURAL SHORT",630,10.06916,0.57713999999999999,2.4119999999999999,80.800185256253783,0.27039277680367541,14,5705.8377799999998,14.0854,2.03016,1.04603,35,19.09423,19.09423,0.18253999999999998,0.18253999999999998]
[null,30053783,"MK","URBAN",1024,10.87215,4.0205700000000002,4.4460000000000006,43.315368795264924,2.4429582337031533E-2,27,3650.02495,128.11232000000001,3.2724599999999997,2.1543000000000001,54,2.0585899999999997,2.0585899999999997,0.10253999999999999,0.10253999999999999]
[null,30053784,"MK","RURAL LONG",192,527.11132999999995,2.01986,1.139,6.1902151989163423,7.5784349488414895,24,261.79305999999997,259.88889,2.1510400000000001,2.1406299999999998,32,320.50286,320.50286,1.6458299999999999,1.6458299999999999]
[null,30053785,"MK","RURAL SHORT",56,117.63603000000001,1.22109,0.89300000000000002,314.99508995083818,25.428202650541611,9,6742.0839299999998,165.38750000000002,2.0892900000000001,1.10714,8,544.25951999999995,544.25951999999995,4.125,4.125]
[null,30053801,"MK","URBAN",4,4.82125,0.70565,2.59,6091.0720279699653,6645.4574515363574,1,212.41667000000001,212.41667000000001,1,1,1,231.75,231.75,0.75,0.75]
[null,30053803,"MK","URBAN",5,0.36632999999999999,0,2.0499999999999998,669.59040412099728,6768.3411369904716,2,29.580000000000002,9.2333299999999987,1.8,1,1,299,299,1,1]
[null,30053807,"MK","RURAL SHORT",188,48.727089999999997,2.4539999999999999E-2,0.99299999999999999,51.954012322909492,0.39711425583556437,19,7109.9463699999997,380.10070999999999,7.0744699999999998,6.0585100000000001,6,54.345389999999995,54.345389999999995,1.0266,1.0266]
[null,30053808,"MK","RURAL SHORT",306,137.43565000000001,9.4549999999999995E-2,1.1950000000000001,76.656212348421036,0.83221378199521268,46,11122.97947,364.12653,4.1993499999999999,3.20261,10,120.75599,120.75599,1.3627499999999999,1.3627499999999999]
[null,30053811,"MK","URBAN",173,1.5822000000000001,0.54650999999999994,2.9930000000000003,5.8374679342445184,2.1043689808803081,7,134.88256000000001,56.643159999999995,0.30635999999999997,0.28902,6,48.624279999999999,48.624279999999999,0.32948,0.32948]
[null,30053812,"MK","URBAN",603,3.5749899999999997,0.75766999999999995,2.7570000000000001,13.263178839064297,0.15009772362343377,20,922.32272,13.732419999999999,0.97677999999999998,0.49917,15,10.437809999999999,10.437809999999999,8.2919999999999994E-2,8.2919999999999994E-2]
[null,30053813,"MK","RURAL SHORT",177,0,2.056,0,5.194814262506525,0.76457265901842864,6,112.05009,72.820619999999991,0.94914999999999994,0.34462999999999999,23,16.491530000000001,16.491530000000001,0.25423999999999997,0.25423999999999997]
[null,30053814,"MK","URBAN",1506,6.6683199999999996,3.01586,2.956,20.575171737605135,6.7858224494552352E-2,53,2331.0405700000001,128.98642999999998,3.20452,1.8904399999999999,21,7.6879200000000001,7.6879200000000001,7.5029999999999999E-2,7.5029999999999999E-2]
[null,30053815,"MK","URBAN",344,1.26831,1.8764299999999998,2.9170000000000003,0.12635252593220186,3.7224287309220686E-2,6,6.5025699999999995,5.6870199999999995,7.5579999999999994E-2,4.9419999999999999E-2,17,1.9157000000000002,1.9157000000000002,5.8139999999999997E-2,5.8139999999999997E-2]
[null,30053816,"MK","URBAN",177,1.01766,0.34326999999999996,2.7310000000000003,1.6217217385077467,3.7264710107851456E-2,5,101.05235,82.272030000000001,5.0849999999999999E-2,3.9549999999999995E-2,5,2.3220299999999998,2.3220299999999998,3.9549999999999995E-2,3.9549999999999995E-2]
[null,30053817,"MK","RURAL SHORT",1382,7.6416299999999993,0.60287999999999997,2.0569999999999999,16.99271852911145,5.8391865171809443E-2,53,2040.8188,120.73086000000001,4.0484799999999996,2.05572,18,7.0128399999999997,7.0128399999999997,4.4139999999999999E-2,4.4139999999999999E-2]
[null,30053818,"MK","URBAN",87,0.51617000000000002,2.1868099999999999,2.8000000000000003,0,1.0077754020555623,"",0,0,0,0,4,9.4482800000000005,9.4482800000000005,0.17240999999999998,0.17240999999999998]
[null,30053819,"MK","RURAL SHORT",861,8.5244400000000002,3.9656000000000002,2.6850000000000001,36.770950811956958,9.882453481256924E-2,27,3014.6963599999999,10.171659999999999,1.0882699999999998,8.0140000000000003E-2,49,8.1022099999999995,8.1022099999999995,7.5490000000000002E-2,7.5490000000000002E-2]
[null,30053820,"MK","URBAN",491,3.5922699999999996,0.45183999999999996,1.57,13.956856594496386,2.6613564748440271E-2,35,1236.8335,82.09147999999999,0.74744999999999995,0.40121999999999997,39,2.3584499999999999,2.3584499999999999,0.11813,0.11813]
[null,30053821,"MK","URBAN",101,0.47515999999999997,0.91782999999999992,3.2010000000000001,12.532797695055857,0.72169917489963054,3,54.332180000000001,54.332180000000001,1.0198,1.0198,2,3.1287099999999999,3.1287099999999999,0.11881,0.11881]
[null,30053822,"MK","RURAL SHORT",510,58.960239999999999,5.1414200000000001,3.2640000000000002,60.26230627610034,9.451889306778936,35,4795.9347099999995,92.987219999999994,2.2705899999999999,1.2725499999999998,27,752.22218999999996,752.22218999999996,0.70783999999999991,0.70783999999999991]
[null,30053823,"MK","URBAN",183,5.7473700000000001,2.4750000000000001,2.9650000000000003,237.34383968195849,0.95243632525493427,6,4497.7932600000004,55.880689999999994,2.85792,1.8633899999999999,9,18.04918,18.04918,0.11474999999999999,0.11474999999999999]
[null,30053824,"MK","URBAN",989,4.56698,0.90204999999999991,3.0660000000000003,54.738582106674791,4.9037347239745857E-2,55,4442.4816300000002,135.27882,1.9433799999999999,0.76744000000000001,102,3.9797799999999999,3.9797799999999999,0.13042999999999999,0.13042999999999999]
[null,30053825,"MK","URBAN",74,1.6776899999999999,5.1366000000000005,2.8010000000000002,3.3336387804539371,4.9268187319539223,1,50.683329999999998,0,1,0,7,74.905410000000003,74.905410000000003,0.58107999999999993,0.58107999999999993]
[null,30053826,"MK","URBAN",68,5.4433799999999994,4.8897899999999996,4.4750000000000005,87.433379112560729,3.5010704075845507E-2,5,1138.48407,16.41667,1.23529,0.25,2,0.45587999999999995,0.45587999999999995,2.9409999999999999E-2,2.9409999999999999E-2]
[null,30053827,"MK","URBAN",17,0,2.1218300000000001,2.9410000000000003,38.641173553177076,19.077856677023469,2,66.720590000000001,16.03725,1.0588199999999999,5.8819999999999997E-2,3,32.941179999999996,32.941179999999996,0.17646999999999999,0.17646999999999999]
[null,30053828,"MK","URBAN",555,3.5474899999999998,6.0818099999999999,3.036,4.3452618126112084,1.0701359682816982E-2,9,193.14873999999998,2.2029399999999999,1.1531499999999999,0.11711999999999999,12,0.47567999999999999,0.47567999999999999,2.342E-2,2.342E-2]
[null,30053829,"MK","RURAL SHORT",757,9.8642899999999987,1.2868000000000002,1.7010000000000001,41.860491290529168,3.729166157079467E-3,27,5516.1564699999999,757.14899000000003,5.2245699999999999,4.2206099999999998,9,0.49140999999999996,0.49140999999999996,1.321E-2,1.321E-2]
[null,30053830,"MK","RURAL SHORT",1566,11.151389999999999,2.1246399999999999,3.69,43.874734578281803,5.4959805409652118E-2,73,4668.5086199999996,416.01760000000002,6.3454699999999997,4.34483,26,5.84802,5.84802,6.2579999999999997E-2,6.2579999999999997E-2]
[null,30053831,"MK","URBAN",89,6.7961599999999995,3.3442000000000003,3.7250000000000001,800.40147078924656,13.968152410266374,17,6006.3962499999998,320.03277000000003,4.4943799999999996,3.49438,11,104.82022000000001,104.82022000000001,1.20225,1.20225]
[null,30053832,"MK","URBAN",1331,11.77529,0.59006999999999998,4.1390000000000002,28.116909940616718,0.10036675585151704,37,2630.5106099999998,29.857800000000001,2.145,1.0263,33,9.3899299999999997,9.3899299999999997,5.4089999999999999E-2,5.4089999999999999E-2]
[null,30053833,"MK","RURAL SHORT",1579,14.670869999999999,11.710700000000001,4.6269999999999998,42.603583241723832,2.6132483635410923E-2,34,3695.2528200000002,152.56789000000001,2.6497799999999998,1.63205,13,2.2666200000000001,2.2666200000000001,5.636E-2,5.636E-2]
[null,30053834,"MK","RURAL SHORT",1377,1.5336399999999999,7.7794099999999995,2.9530000000000003,0.13405784756731584,7.8327818120126139E-2,14,16.79927,11.62823,0.15395999999999999,0.15251000000000001,65,9.8155400000000004,9.8155400000000004,0.19897999999999999,0.19897999999999999]
[null,30053835,"MK","RURAL SHORT",1675,12.95833,2.2662599999999999,4.3130000000000006,40.935535272941834,0.3460525394043919,44,4820.2200199999997,18.85792,1.13493,0.17133999999999999,59,40.748200000000004,40.748200000000004,0.32357999999999998,0.32357999999999998]
[null,30053836,"MK","RURAL SHORT",504,2.1187399999999998,4.2439399999999994,1.423,26.838663702371807,0.34858048129467034,3,2824.4940499999998,0.49404999999999999,1.00397,3.9699999999999996E-3,8,36.684519999999999,36.684519999999999,0.38491999999999998,0.38491999999999998]
[null,30053837,"MK","RURAL SHORT",655,79.721909999999994,3.3192599999999999,1.8640000000000001,62.441071620145671,0.82676919132149695,87,7753.9437399999997,566.45668999999998,5.8305299999999995,4.8213699999999999,22,102.66835,102.66835,0.34198000000000001,0.34198000000000001]
[null,30053838,"MK","RURAL SHORT",717,111.98448,2.07911,1.9450000000000001,96.360634958342942,1.1169468549183439,67,10644.59881,476.90091000000001,5.6108799999999999,4.5941399999999994,9,123.38494,123.38494,0.37237999999999999,0.37237999999999999]
[null,30053839,"MK","RURAL SHORT",269,56.010179999999998,0.1835,1.3130000000000002,61.552457320152449,1.7971042029146931,32,7635.0248499999998,302.03438999999997,3.7174700000000001,1.7620799999999999,8,222.9145,222.9145,0.56877,0.56877]
[null,30053840,"MK","RURAL SHORT",751,67.516849999999991,0.37778,2.5870000000000002,49.087360230489217,0.21834632533376494,47,3958.3468000000003,391.33240000000001,4.9147799999999995,3.91744,14,17.607189999999999,17.607189999999999,0.12250000000000001,0.12250000000000001]
[null,30053841,"MK","RURAL SHORT",321,48.256409999999995,0.39145999999999997,4.0970000000000004,53.430075664827413,0.5379807390892789,46,6443.7806300000002,158.50815,2.7725899999999997,1.7694699999999999,8,64.881619999999998,64.881619999999998,0.20560999999999999,0.20560999999999999]
[null,30053842,"MK","RURAL SHORT",117,30.30593,0.20662,1.657,7.1632966523755846,8.1088917160653646E-4,16,755.03161999999998,688.86980000000005,6.4102600000000001,3.39316,1,8.546999999999999E-2,8.546999999999999E-2,8.5500000000000003E-3,8.5500000000000003E-3]
[null,30053843,"MK","RURAL SHORT",421,31.549049999999998,1.33297,2.8720000000000003,261.59661445849883,1.3703299732632541E-3,18,4533.8857900000003,253.72577000000001,6.3895499999999998,4.3895499999999998,1,2.375E-2,2.375E-2,2.3799999999999997E-3,2.3799999999999997E-3]
[null,30053845,"MK","RURAL SHORT",403,128.46064999999999,0.70423000000000002,2.2170000000000001,92.83633209399683,2.1986711460802768,46,10417.90926,429.90955000000002,10.99752,9.0496299999999987,9,246.73052000000001,246.73052000000001,0.56823999999999997,0.56823999999999997]
[null,30053846,"MK","RURAL SHORT",308,79.493529999999993,0.35094999999999998,2.3620000000000001,89.656307133054696,2.2328204954522852,40,10762.401239999999,110.72927,8.1688299999999998,6.5876599999999996,14,268.02922000000001,268.02922000000001,0.90908999999999995,0.90908999999999995]
[null,30053847,"MK","RURAL SHORT",405,118.31689,0.31846999999999998,2.5060000000000002,94.103323648313008,1.3756111972673575,68,11451.730579999999,1073.5744,11.59259,9.5925899999999995,13,167.40246999999999,167.40246999999999,0.61480999999999997,0.61480999999999997]
[null,30053848,"MK","RURAL SHORT",283,76.553039999999996,0.27584999999999998,1.8390000000000002,115.9269399355,5.8177632474318034E-3,38,11899.434160000001,814.69564000000003,8.9505299999999988,7.94346,3,0.59716999999999998,0.59716999999999998,1.413E-2,1.413E-2]
[null,30053862,"MK","RURAL SHORT",457,148.74885,0,2.5329999999999999,61.530154309514138,1.7432407957694289,44,9481.3744000000006,334.99081000000001,5.8315099999999997,4.8337000000000003,66,268.62144000000001,268.62144000000001,1.4048099999999999,1.4048099999999999]
[null,30053863,"MK","RURAL SHORT",278,113.83595,9.153E-2,0.76500000000000001,43.959713501870432,1.2942808981796206,28,7722.5446599999996,104.48795,6.0179899999999993,5.0287799999999994,55,227.37050000000002,227.37050000000002,0.99280999999999997,0.99280999999999997]
[null,30053864,"MK","RURAL SHORT",528,103.07146,2.477E-2,1.1360000000000001,84.086386813380841,0.10632206270459646,54,11421.109280000001,613.00647000000004,11.95265,10.965909999999999,12,14.441289999999999,14.441289999999999,0.46590999999999999,0.46590999999999999]
[null,30053865,"MK","RURAL SHORT",838,102.93941,2.0086599999999999,2.8930000000000002,81.256645644135659,0.5444893494553934,49,7969.0913700000001,679.29265999999996,9.4212399999999992,8.4283999999999999,51,53.399760000000001,53.399760000000001,0.33293999999999996,0.33293999999999996]
[null,30053866,"MK","RURAL SHORT",143,73.598829999999992,4.6789999999999998E-2,2.3620000000000001,142.29559688166904,2.0694487146451719,18,9269.6371799999997,490.62412999999998,5.6713299999999993,4.6853099999999994,8,134.81119000000001,134.81119000000001,0.88112000000000001,0.88112000000000001]
[null,30053867,"MK","RURAL SHORT",194,98.084279999999993,0,0.30099999999999999,82.385002673195189,3.6105142963591605,32,11936.443209999999,1153.2250000000001,9.10825,8.10825,27,523.11340000000007,523.11340000000007,2.0618599999999998,2.0618599999999998]
[null,30053868,"MK","RURAL SHORT",16,7.00305,0,0,395.38642914650558,54.52761513226195,7,10622.89479,486.89479,6.0625,5.0625,5,1465,1465,5,5]
[null,30053871,"MK","RURAL SHORT",138,30.20307,0.18747,0.82500000000000007,1.8003825229420802,3.982572649854724E-3,10,196.54890999999998,132.08514,5.0941999999999998,3.0797099999999999,1,0.43478,0.43478,7.2499999999999995E-3,7.2499999999999995E-3]
[null,30053872,"MK","RURAL SHORT",1477,7.8164899999999999,5.2707600000000001,3.6350000000000002,25.976813631032094,0.1740134867696049,38,3138.3261299999999,7.6399799999999995,1.05619,5.2129999999999996E-2,54,21.023019999999999,21.023019999999999,0.20920999999999998,0.20920999999999998]
[null,30053875,"MK","URBAN",1,1.6817099999999998,0,0.54400000000000004,27837.231464830045,4395.7185759493668,6,10601.116669999999,476.11667,6,5,5,1674,1674,5,5]
[null,30053878,"MK","RURAL SHORT",1181,7.4306699999999992,10.136949999999999,3.371,19.151777758812045,1.0125495307498831,41,2175.6499600000002,540.59803999999997,2.6232000000000002,2.1634199999999999,30,115.02605,115.02605,0.47841,0.47841]
[null,30053880,"MK","RURAL SHORT",1,0,0,0,1809.1331561181435,3967.8021434599154,4,348.85,348.85,4,4,1,765.1,765.1,1,1]
[null,30053882,"MK","RURAL SHORT",443,99.853249999999989,0.69410000000000005,1.6850000000000001,175.87801973660243,1.1236731510753188,43,10396.431490000001,678.31763999999998,4.6659100000000002,3.6636599999999997,61,66.422119999999993,66.422119999999993,0.38374999999999998,0.38374999999999998]
[null,30053883,"MK","RURAL SHORT",203,58.534149999999997,0,1.3540000000000001,57.674378211710568,0.29760718293418165,17,8039.0949099999998,211.26199,2.0541899999999997,1.0492599999999999,2,41.482759999999999,41.482759999999999,1.1379299999999999,1.1379299999999999]
[null,30053884,"MK","RURAL SHORT",163,1.43275,1.38659,0.28600000000000003,1.3910575470118909,0,5,135.59663,107.69417,0.98773,0.98160000000000003,"",0,0,0,0]
[null,30053885,"MK","RURAL SHORT",325,0,4.3060200000000002,1.2630000000000001,3.8686478160307947,7.7121961195168259E-2,5,175.18378999999999,153.50137999999998,4.0030799999999997,3.0092300000000001,9,3.4923099999999998,3.4923099999999998,0.25845999999999997,0.25845999999999997]
[null,30053886,"MK","URBAN",117,0.30640000000000001,1.33717,4.7090000000000005,10.054978108823406,9.190213711428423E-2,2,224.42976999999999,224.42976999999999,1.01709,1.01709,7,2.0512799999999998,2.0512799999999998,9.4019999999999992E-2,9.4019999999999992E-2]
[null,30184151,"MK","RURAL SHORT",733,3.8667799999999999,5.4001599999999996,2.0620000000000003,173.82198083877839,0.36922886432368707,53,12415.36132,279.55072999999999,9.4065499999999993,7.3833599999999997,16,26.372439999999997,26.372439999999997,0.21964999999999998,0.21964999999999998]
[null,30185760,"MK","URBAN",247,0.99905999999999995,2.97309,1.4730000000000001,62.227097611334067,0.15755385476692005,10,2782.8240900000001,110.48116999999999,0.57894999999999996,0.21052999999999999,24,7.0458799999999995,7.0458799999999995,0.11335999999999999,0.11335999999999999]
[null,30186258,"MK","URBAN",649,2.3584499999999999,5.1169099999999998,3.0640000000000001,3.3641622627485068,3.1052736618757559,11,179.81115,179.81115,1.0154099999999999,1.0154099999999999,10,165.97381000000001,165.97381000000001,0.90908999999999995,0.90908999999999995]
[null,30186511,"MK","URBAN",199,0.63190999999999997,4.4636199999999997,2.9510000000000001,2.8000122359958728,1.190683624113845,8,86.749249999999989,36.065909999999995,1.61809,0.61808999999999992,12,36.889449999999997,1.25126,0.23618,5.5279999999999996E-2]
[null,30186550,"MK","URBAN",68,0.75410999999999995,5.1746799999999995,3.718,703.20660985534914,1.8045570447974546,1,5954.1382400000002,0,0.97058999999999995,0,2,15.279409999999999,1.1617599999999999,5.8819999999999997E-2,1.4709999999999999E-2]
[null,30187133,"MK","URBAN",112,0.14096999999999998,1.2753099999999999,2.1870000000000003,1077.6196723363364,1.3705916147481505,26,12179.76354,592.77039000000002,9.1785699999999988,7.1428599999999998,2,15.491069999999999,15.491069999999999,5.357E-2,5.357E-2]
[null,30187348,"MK","RURAL SHORT",478,34.840219999999995,4.0814599999999999,2.7090000000000001,2.7619746405359726,6.204680566141779E-3,13,108.02748,107.92287,2.0251000000000001,2.0230099999999998,4,0.24267999999999998,0.24267999999999998,8.369999999999999E-3,8.369999999999999E-3]
[null,30187418,"MK","RURAL SHORT",0,0,0,10.125,0,0,"",0,0,0,0,"",0,0,0,0]
[null,30187535,"MK","RURAL SHORT",1493,8.5430499999999991,5.6661199999999994,3.8680000000000003,46.120582156378056,0.38528504284919407,58,4786.0394800000004,236.22483,3.7896899999999998,1.7716000000000001,42,39.981919999999995,39.981919999999995,0.28600000000000003,0.28600000000000003]
[null,30188733,"MK","RURAL SHORT",148,10.69777,0.85412999999999994,0.48700000000000004,2.2708578180090324,2.7823806292458643E-3,8,248.15235999999999,134.14278999999999,5.0675699999999999,3.0878399999999999,1,0.30404999999999999,0.30404999999999999,6.7599999999999995E-3,6.7599999999999995E-3]
[null,30189394,"MK","RURAL SHORT",2009,6.69543,12.222769999999999,5.266,0.7037576607244137,1.3491431709926859E-2,30,69.222269999999995,20.668019999999999,0.15181999999999998,0.13488999999999998,20,1.3270299999999999,1.3270299999999999,4.9779999999999998E-2,4.9779999999999998E-2]
[null,40000959,"CA","URBAN",4,0,0.32983999999999997,1.6880000000000002,13.249129971590909,48.427854378918497,1,3.625,3.625,0.75,0.75,1,13.25,13.25,0.25,0.25]
[null,40000960,"CA","RURAL SHORT",566,109.10575,4.09544,2.5310000000000001,1.7898708528629066,0.25815304060434369,18,110.02746999999999,110.02746999999999,0.80918999999999996,0.80918999999999996,56,15.869259999999999,15.869259999999999,0.15017999999999998,0.15017999999999998]
[null,40000961,"CA","RURAL LONG",754,271.15402999999998,0.51560000000000006,1.9690000000000001,1.8536480209375308,0.19748767932673944,51,154.43155999999999,154.23752999999999,1.42971,1.42706,110,16.453139999999998,16.453139999999998,0.23077,0.23077]
[null,40000962,"CA","RURAL LONG",306,254.08010999999999,0.33016000000000001,1.4950000000000001,4.0970004449374517,0.53338441295158279,32,248.48235,247.91355999999999,1.6372499999999999,1.6307199999999999,28,32.349669999999996,32.349669999999996,0.24182999999999999,0.24182999999999999]
[null,40000963,"CA","RURAL LONG",168,244.45588000000001,0,0.24400000000000002,1.5566015623999523,5.2629651796811512,19,221.16705999999999,218.73115000000001,1.34524,1.32738,24,747.77936999999997,747.77936999999997,2.6607099999999999,2.6607099999999999]
[null,40000964,"CA","RURAL LONG",86,228.23960000000002,0,0.219,2.1324930878610333,1.8033108406300857,10,300.21472999999997,300.21472999999997,1.7093,1.7093,16,253.87209000000001,253.87209000000001,1.0697699999999999,1.0697699999999999]
[null,40000965,"CA","RURAL SHORT",924,54.956099999999999,2.1323300000000001,4.3,3.3439600058997847,0.52511752717985727,45,199.65424000000002,185.63414999999998,5.2997800000000002,4.30844,86,31.352629999999998,31.352629999999998,0.25324999999999998,0.25324999999999998]
[null,40000966,"CA","RURAL LONG",683,1325.89599,0.82917999999999992,3.9780000000000002,107.96308607489995,31.396385993975695,142,891.48596999999995,877.31532000000004,8.1171299999999995,7.1127399999999996,122,259.25006999999999,259.25006999999999,1.4392399999999999,1.4392399999999999]
[null,40000967,"CA","RURAL SHORT",258,172.26017999999999,0.17323,0.755,2.5185624485919922,0.55192464084813353,55,318.11770000000001,49.668409999999994,0.33332999999999996,0.21317999999999998,27,69.713179999999994,69.713179999999994,0.43411,0.43411]
[null,40000968,"CA","RURAL SHORT",0,0,0,0,0,0,"",0,0,0,0,"",0,0,0,0]
[null,40000969,"CA","RURAL SHORT",605,25.845400000000001,0.13233,1.6660000000000001,9.7557912786275014E-2,7.5829616033486341E-3,16,10.186059999999999,6.1893699999999994,2.81E-2,2.3139999999999997E-2,9,0.79174,0.79174,1.653E-2,1.653E-2]
[null,40000970,"CA","RURAL SHORT",1507,123.62638,9.9936399999999992,3.6920000000000002,0.74366451891529972,0.42822638978400734,25,87.99812,74.843279999999993,2.1035200000000001,2.07498,44,50.672200000000004,50.672200000000004,0.34970000000000001,0.34970000000000001]
[null,40000973,"CA","RURAL LONG",554,394.48672999999997,0.21814,2.286,2.9388840082394743,3.3654937298421292,58,204.50604999999999,136.50018,1.76173,0.75992999999999999,122,234.19224,234.19224,1.45126,1.45126]
[null,40000974,"CA","RURAL LONG",681,688.85317999999995,0,2.153,2.0125055563387035,0.54456906770914959,73,190.94112000000001,120.28231,3.45228,2.3906000000000001,38,51.667249999999996,51.529219999999995,0.33185999999999999,0.32745999999999997]
[null,40000975,"CA","RURAL LONG",164,227.58487,0,2.915,62.391862783401734,74.527884703715102,43,485.78922999999998,417.63434999999998,3.6402399999999999,2.6463399999999999,40,580.28150000000005,580.28150000000005,2.7256100000000001,2.7256100000000001]
[null,40000977,"CA","RURAL LONG",756,615.20335999999998,0.23454,1.9790000000000001,2.938513752296525,0.71837845094213093,114,327.73088999999999,322.60068000000001,3.5370399999999997,2.5343899999999997,31,80.120369999999994,80.120369999999994,0.31878000000000001,0.31878000000000001]
[null,40000978,"CA","RURAL LONG",779,680.14238999999998,6.719E-2,3.9130000000000003,13.542909671144621,2.9405755032204746,120,993.55243999999993,961.72018000000003,15.872909999999999,13.884469999999999,73,215.7303,215.46854999999999,0.94094999999999995,0.93710000000000004]
[null,40000979,"CA","RURAL LONG",246,351.68620000000004,0.11506,0.82300000000000006,21.137988430526438,0.39640628485324941,55,1993.5825199999999,347.58794,3.64228,1.8821099999999999,18,37.386179999999996,37.386179999999996,0.22358,0.22358]
[null,40000982,"CA","RURAL SHORT",1049,13.63274,0.75673999999999997,2.8610000000000002,8.4351694993655496E-2,0.39356984104972298,20,10.0258,9.9835899999999995,0.23641999999999999,0.23546,171,46.778579999999998,46.778579999999998,0.3775,0.3775]
[null,40000984,"CA","RURAL SHORT",216,143.59,0.13053000000000001,1.0330000000000001,4.2623662346613038,7.9166732581815555,34,245.94830000000002,238.88965999999999,1.85185,1.8148099999999998,34,456.81018999999998,456.81018999999998,1.43981,1.43981]
[null,40000985,"CA","RURAL LONG",661,408.04507999999998,0.26977999999999996,1.851,1.8940689839376483,2.9320176702536087,87,188.51116999999999,188.34523000000002,0.91376999999999997,0.91073999999999999,55,291.81518,291.81518,1.6823000000000001,1.6823000000000001]
[null,40000998,"CA","RURAL SHORT",1106,106.04427,0.37304999999999999,3.7050000000000001,1.215399588055831,0.21574366919358468,35,97.563029999999998,71.727589999999992,3.4367099999999997,1.4493699999999998,38,17.318259999999999,17.318259999999999,0.11663999999999999,0.11663999999999999]
[null,40000999,"CA","RURAL SHORT",53,90.603659999999991,0.18520999999999999,0.29100000000000004,16.796905627193645,0.19231402247699506,15,739.92704000000003,714.41760999999997,5.3962300000000001,3.4339599999999999,6,8.4717000000000002,8.4717000000000002,0.15093999999999999,0.15093999999999999]
[null,40001000,"CA","RURAL SHORT",0,0,0,0,0,0,"",0,0,0,0,"",0,0,0,0]
[null,40001001,"CA","URBAN",1013,7.1743000000000006,2.2090700000000001,5.2830000000000004,1.5944376573571256E-2,4.1479956935502389E-2,8,1.03667,1.02285,8.879999999999999E-3,7.9000000000000008E-3,41,2.6969399999999997,2.6969399999999997,0.21026999999999998,0.21026999999999998]
[null,40001002,"CA","RURAL SHORT",721,8.3165599999999991,1.18848,2.3290000000000002,0.36699357543481292,0.48149904779342906,14,14.07672,13.38777,6.9349999999999995E-2,6.3800000000000009E-2,26,18.468789999999998,18.468789999999998,0.14285999999999999,0.14285999999999999]
[null,40001003,"CA","RURAL SHORT",510,173.73975000000002,2.0707399999999998,1.57,5.3082857823513709,0.37294739489348583,17,413.10167000000001,56.713200000000001,2.70784,2.3509799999999998,12,29.023529999999997,29.023529999999997,0.16471,0.16471]
[null,40001004,"CA","URBAN",1572,15.68009,0.59844999999999993,5.1740000000000004,1.1606241701528579,0.22785675874240097,50,108.90422,108.21987,2.13232,2.1278600000000001,51,21.38036,21.38036,0.13231999999999999,0.13231999999999999]
[null,40001005,"CA","RURAL LONG",360,796.46435999999994,0.14560999999999999,2.516,25.391962069675433,0.63719033048586682,71,942.22824000000003,920.61769000000004,5.1000000000000005,5,11,23.644439999999999,23.644439999999999,0.11667,0.11667]
[null,40001006,"CA","RURAL SHORT",1361,28.872349999999997,3.98332,6.7510000000000003,4.3626068408348671,0.67379717212061507,32,263.82681000000002,263.81871999999998,4.1278499999999996,4.1271100000000001,45,40.747599999999998,40.747599999999998,0.21748999999999999,0.21748999999999999]
[null,40001009,"CA","RURAL LONG",1267,234.71018000000001,10.836729999999999,5.0940000000000003,3.5082961891415914,2.2862999884311805,52,212.47126,212.41546,2.2904499999999999,2.28966,27,138.46409,138.46409,0.64088000000000001,0.64088000000000001]
[null,40001010,"CA","RURAL LONG",1324,2111.1566600000001,1.0343499999999999,4.7350000000000003,6.7848071397980556,0.60559284664962365,136,518.05728999999997,397.20370000000003,4.9131399999999994,2.7734099999999997,119,46.240339999999996,46.240339999999996,0.42674000000000001,0.42674000000000001]
[null,40001011,"CA","RURAL LONG",526,315.74684999999999,1.5181399999999998,5.9660000000000002,2.8930178565625813,0.1134989822039227,50,105.68888,56.594359999999995,0.73573999999999995,0.50190000000000001,13,4.1463900000000002,4.1463900000000002,3.6119999999999999E-2,3.6119999999999999E-2]
[null,40001014,"CA","RURAL SHORT",133,29.95092,1.41404,0.5,2.0910783135729893,0.17473734980828279,8,249.05714,249.05714,3.5188000000000001,3.5188000000000001,2,20.81203,20.81203,8.2709999999999992E-2,8.2709999999999992E-2]
[null,40001029,"CA","RURAL SHORT",1055,34.061749999999996,2.1532199999999997,4.0990000000000002,1.0709257159831143,6.8481944951872264E-2,45,87.247159999999994,20.89348,1.19716,0.18198999999999999,51,5.5791499999999994,2.04739,8.4359999999999991E-2,5.8769999999999996E-2]
[null,40001030,"CA","RURAL SHORT",17,34.95843,0.10757,1.0430000000000001,131.50373025689075,2.6611887232992384,5,761.57843000000003,89.195100000000011,3.1176499999999998,1.11765,1,15.411759999999999,15.411759999999999,5.8819999999999997E-2,5.8819999999999997E-2]
[null,40001031,"CA","RURAL SHORT",6,8.4523299999999999,0.15356999999999998,1.0920000000000001,749.24012785015896,0,5,949.32777999999996,449.11111,3.3333299999999997,2.3333299999999997,"",0,0,0,0]
[null,40001032,"CA","RURAL SHORT",31,136.59673000000001,2.3755599999999997,2.6080000000000001,541.44520856792872,35.673112260527567,16,890.60375999999997,406.52312000000001,3.74194,2.7741899999999999,3,58.677419999999998,58.677419999999998,0.32257999999999998,0.32257999999999998]
[null,40001033,"CA","RURAL LONG",95,395.38886000000002,0,0.32500000000000001,40.785924317090149,4.3110578796821066,18,2375.3501799999999,1880.39895,6.0210499999999998,5.0315799999999999,4,251.07368,251.07368,1.02105,1.02105]
[null,40001034,"CA","RURAL SHORT",65,169.91971000000001,0,1.609,85.82031620944673,29.292353980458007,8,1013.28436,1013.28436,1.30769,1.30769,25,345.85615000000001,341.71769,2.2307699999999997,2.1846199999999998]
[null,40001035,"CA","RURAL SHORT",1238,20.44387,1.1734,6.2530000000000001,2.7550594658039933,0.13425145758465409,51,157.07978,156.94758999999999,1.2245599999999999,1.22132,75,7.65435,7.65435,0.12197,0.12197]
[null,40001037,"CA","RURAL SHORT",5,45.439389999999996,0,7.3000000000000009E-2,3.97021735648537,11.305990130197396,3,47.406669999999998,47.406669999999998,2.2000000000000002,2.2000000000000002,1,135,135,0.6,0.6]
[null,40001038,"CA","RURAL LONG",627,641.23496,0.55650999999999995,2.9940000000000002,28.608842306912319,0.66498712043362818,69,1290.34745,1253.11457,6.9075000000000006,6.8708099999999996,60,29.992979999999999,29.992979999999999,0.24560999999999999,0.24560999999999999]
[null,40001039,"CA","RURAL SHORT",103,141.94413,0,1.5070000000000001,31.659662762432379,2.8708605618394798,24,935.76845000000003,906.09060999999997,9.4077699999999993,8.3980599999999992,16,84.854370000000003,84.854370000000003,0.80582999999999994,0.80582999999999994]
[null,40001040,"CA","RURAL SHORT",660,84.442369999999997,1.59565,2.5780000000000003,4.2373928388395257,3.0864451778537751,21,194.82548,156.57474999999999,2.35,1.3697000000000001,20,141.90758,141.90758,0.37273000000000001,0.37273000000000001]
[null,40001041,"CA","RURAL LONG",74,214.32986,7.17E-2,0.189,0.91783584079240377,1.3829616680413384,8,72.27770000000001,72.27770000000001,1.09459,1.09459,5,108.90541,108.90541,1.27027,1.27027]
[null,40001042,"CA","RURAL LONG",497,349.27066000000002,1.1987000000000001,1.6600000000000001,57.879783921512789,2.6537038472016912,34,454.43122,454.39299,3.4205199999999998,3.4185099999999999,8,20.83501,20.83501,0.22333999999999998,0.22333999999999998]
[null,40001045,"CA","RURAL SHORT",296,75.959109999999995,0.19946,0.92300000000000004,2.3561575337415808,2.4335578187478207E-2,9,165.6397,165.59577999999999,1.98986,1.9864899999999999,4,1.7108099999999999,1.7108099999999999,2.3649999999999997E-2,2.3649999999999997E-2]
[null,40001046,"CA","RURAL SHORT",198,9.8416399999999999,0.12271,1.222,1.6435423925036963,0.1374557993160905,10,49.820369999999997,49.820369999999997,1.08586,1.08586,4,4.1666699999999999,4.1666699999999999,4.5449999999999997E-2,4.5449999999999997E-2]
[null,40001052,"CA","RURAL LONG",50,242.62547999999998,0,1.3010000000000002,163.5975767190738,50.552003986121115,17,914.49200000000008,424.27967000000001,4.22,3.24,6,282.58,282.58,1.28,1.28]
[null,40001053,"CA","RURAL SHORT",791,186.09816999999998,0.84710000000000008,3.782,4.6538571303033081,1.4925402589750354,24,272.60246999999998,239.9308,3.1188400000000001,3.0885000000000002,60,87.426439999999999,87.426439999999999,0.56763999999999992,0.56763999999999992]
[null,40001054,"CA","RURAL SHORT",372,9.94041,2.38958,3.2,12.913126350487433,2.9876207101332621E-2,13,284.66079999999999,280.79028,5.0860199999999995,5.0833300000000001,5,0.65860000000000007,0.65860000000000007,1.3439999999999999E-2,1.3439999999999999E-2]
[null,40001057,"CA","RURAL SHORT",0,0,0.22574,0,0,0,"",0,0,0,0,"",0,0,0,0]
[null,40001059,"CA","RURAL SHORT",52,197.14042999999998,0.1341,0.215,5.7951593653981837,0.48506908498751433,9,531.40769,511.21537999999998,5.2884599999999997,4.3269199999999994,10,44.480129999999996,44.480129999999996,0.48076999999999998,0.48076999999999998]
[null,40001060,"CA","RURAL SHORT",765,11.42717,0.31175999999999998,2.5630000000000002,0.83966293162828964,4.8727672826321906E-2,18,59.57911,38.575189999999999,3.1647099999999999,2.1647099999999999,38,3.4575199999999997,3.4575199999999997,9.4119999999999995E-2,9.4119999999999995E-2]
[null,40001061,"CA","RURAL LONG",511,1494.03052,8.6389999999999995E-2,1.647,28.332836078974346,1.4899531306622082,68,2248.32348,2227.9810200000002,9.7808200000000003,8.8121299999999998,111,118.23372000000001,118.23372000000001,0.71820000000000006,0.71820000000000006]
[null,40001062,"CA","RURAL LONG",661,2034.69506,7.8750000000000001E-2,2.57,18.640090941874014,1.0841092155502039,65,1307.9087500000001,1267.7577200000001,6.6762499999999996,5.6172499999999994,59,76.068079999999995,76.068079999999995,0.56731999999999994,0.56731999999999994]
[null,40001063,"CA","RURAL LONG",75,296.99302,0.53733999999999993,0.29200000000000004,2.3800341514828331,1.3099823523126115,13,277.03244000000001,256.03244000000001,4.6399999999999997,3.64,7,152.47999999999999,152.47999999999999,0.73332999999999993,0.73332999999999993]
[null,40001064,"CA","RURAL SHORT",0,0,0,0,0,0,"",0,0,0,0,"",0,0,0,0]
[null,40001065,"CA","RURAL SHORT",814,19.56944,1.6621699999999999,3.6940000000000004,3.0650797936272198,3.8932829464537869E-2,26,186.17923999999999,165.26400000000001,7.1633899999999997,6.1670799999999995,30,2.3648599999999997,2.3648599999999997,6.0200000000000004E-2,6.0200000000000004E-2]
[null,40001066,"CA","RURAL LONG",405,1895.8828599999999,5.7909999999999996E-2,1.345,13.958632951315689,1.2175739534960675,70,1084.2114000000001,1063.26325,8.4024699999999992,7.4049399999999999,45,94.572839999999999,93.195059999999998,0.86913999999999991,0.85185]
[null,40001067,"CA","URBAN",802,6.2442500000000001,0.52642,4.069,4.9243625289477349,0.15333674211686274,22,288.71173999999996,136.49430999999998,7.4800499999999994,5.5062299999999995,56,8.9900199999999995,8.9900199999999995,0.24812999999999999,0.24812999999999999]
[null,40001068,"CA","RURAL LONG",224,744.93559000000005,8.3519999999999997E-2,0.57700000000000007,29.128182287719543,0.12555740491006498,32,2377.9072900000001,2356.2709100000002,10.772319999999999,9.7723199999999988,14,10.25,10.25,9.8209999999999992E-2,9.8209999999999992E-2]
[null,40001071,"CA","RURAL SHORT",0,0,0.23061999999999999,0,0,0,"",0,0,0,0,"",0,0,0,0]
[null,40001072,"CA","RURAL LONG",255,763.14822000000004,7.1550000000000002E-2,0.73399999999999999,5.2031021580949455,2.0315273683715298,35,459.02327000000002,438.02327000000002,9.6509799999999988,8.6509799999999988,51,179.22352999999998,179.22352999999998,0.89411999999999991,0.89411999999999991]
[null,40001090,"CA","URBAN",570,7.2511599999999996,0.79620999999999997,4.17,0.71884968765498469,7.3115006294758519E-2,16,34.894120000000001,26.539649999999998,0.37367999999999996,0.35964999999999997,13,3.5491199999999998,3.5491199999999998,7.3679999999999995E-2,7.3679999999999995E-2]
[null,40001091,"CA","URBAN",1234,8.554079999999999,0.66708000000000001,4.5579999999999998,0.59331811194829598,8.6765109926573811E-2,20,49.845769999999995,35.826619999999998,0.34360000000000002,0.34116999999999997,45,7.2893000000000008,7.2893000000000008,7.374E-2,7.374E-2]
[null,40001093,"CA","URBAN",335,2.1199499999999998,0.17374000000000001,1.3640000000000001,0.10172068955391148,2.3020243555152097E-2,7,9.2727899999999988,1.3235299999999999,2.0900000000000002E-2,1.7909999999999999E-2,31,2.0985100000000001,2.0985100000000001,0.10447999999999999,0.10447999999999999]
[null,40001094,"CA","URBAN",1368,8.9384399999999999,0.80541999999999991,4.5289999999999999,1.6951094831270519,3.5552035904845181E-2,37,142.99467999999999,99.91865,1.52339,1.51389,121,2.9990699999999997,2.9208599999999998,0.10525999999999999,0.10234]
[null,40001095,"CA","URBAN",272,1.8537599999999999,0.46040000000000003,3.77,0.72620737653822975,4.6761094388389289E-2,2,58.694849999999995,58.694849999999995,0.31617999999999996,0.31617999999999996,19,3.7794099999999999,3.29779,0.11029,9.9260000000000001E-2]
[null,40001096,"CA","URBAN",1065,6.46706,1.5341399999999998,4.3380000000000001,0.50365607886435826,0.1312134354643861,24,33.248529999999995,32.217559999999999,0.27605999999999997,0.27323999999999998,98,8.6619700000000002,8.6619700000000002,0.14365999999999998,0.14365999999999998]
[null,40001097,"CA","URBAN",1212,7.6966899999999994,1.62168,3.5990000000000002,0.6652902652568351,0.51499317215072649,31,86.611800000000002,86.611800000000002,1.07673,1.07673,46,67.045149999999992,67.045149999999992,0.44966999999999996,0.44966999999999996]
[null,40001098,"CA","RURAL SHORT",616,3.3709499999999997,0.82340000000000002,0.81600000000000006,0.78289787131994104,1.3589898605267596E-3,14,102.87205,102.87205,1.3620099999999999,1.3620099999999999,5,0.17856999999999998,0.17856999999999998,1.136E-2,1.136E-2]
[null,40001099,"CA","URBAN",1288,3.0543299999999998,8.4840799999999987,4.0860000000000003,0.71607575585182537,0.13979404074556995,9,80.278689999999997,80.278689999999997,0.99146000000000001,0.99146000000000001,17,15.6722,15.6722,0.25233,0.25233]
[null,40001100,"CA","RURAL SHORT",1336,8.4248899999999995,7.0910000000000002,3.5030000000000001,0.86663624282802565,0.62405970181600678,20,109.10187000000001,109.07611,1.18638,1.18563,17,78.56362,78.56362,0.33233999999999997,0.33233999999999997]
[null,40001101,"CA","URBAN",624,5.7603799999999996,0.65410000000000001,2.2450000000000001,1.056914889060971,0.3401721539964353,18,104.18407999999999,104.00588,1.1618599999999999,1.1602599999999998,7,33.532049999999998,33.532049999999998,0.21153999999999998,0.21153999999999998]
[null,40001102,"CA","RURAL SHORT",1,0,0,4.2050000000000001,0,0,"",0,0,0,0,"",0,0,0,0]
[null,40001104,"CA","URBAN",110,10.355129999999999,0.23688999999999999,3.2510000000000003,84.7748246159763,0,9,553.49423999999999,111.79424,1.29091,1.2454499999999999,"",0,0,0,0]
[null,40001105,"CA","URBAN",1489,11.06054,1.12605,3.7710000000000004,0.8022398034846705,2.1285668337805687E-2,27,116.45925,114.11167,1.26797,1.2505000000000002,9,3.0899899999999998,3.0899899999999998,4.9700000000000001E-2,4.9700000000000001E-2]
[null,40001106,"CA","RURAL SHORT",352,105.10951,0.13092999999999999,2.0150000000000001,13.801440721440981,10.181574986272654,27,795.26770999999997,781.69834000000003,2.7102299999999997,2.6619299999999999,42,586.68352000000004,586.68352000000004,1.9943199999999999,1.9943199999999999]
[null,40001107,"CA","URBAN",924,7.8815299999999997,6.8379999999999996E-2,2.375,5.5536698671519069,1.1011127435901189E-2,61,743.20770000000005,211.21548000000001,2.7575799999999999,1.63636,5,1.4735399999999998,1.4735399999999998,3.7879999999999997E-2,3.7879999999999997E-2]
[null,40001108,"CA","RURAL SHORT",0,0,0,0,0,0,"",0,0,0,0,"",0,0,0,0]
[null,40001109,"CA","RURAL SHORT",1243,9.49268,3.7940199999999997,3.629,0.15262495526371714,0.18789547655843925,12,16.945619999999998,16.915849999999999,0.14802999999999999,0.14721999999999999,2,20.861629999999998,20.861629999999998,0.42638999999999999,0.42638999999999999]
[null,40001110,"CA","RURAL SHORT",1483,131.85954000000001,6.1105199999999993,4.1349999999999998,0.14437545158318602,3.55685819284609E-2,22,15.576649999999999,15.576649999999999,0.10181999999999999,0.10181999999999999,12,3.8374899999999998,3.8374899999999998,2.6969999999999997E-2,2.6969999999999997E-2]
[null,40001111,"CA","RURAL LONG",623,352.9135,1.48614,1.7590000000000001,2.1039696608167491,0.25673371352158386,50,189.52753000000001,165.05545999999998,1.8443000000000001,1.8105899999999999,25,23.126809999999999,23.126809999999999,0.17013999999999999,0.17013999999999999]
[null,40001112,"CA","RURAL SHORT",219,59.948740000000001,0.43049999999999999,0.43,0.30277809757843233,3.9228085863555084,5,38.663550000000001,38.663550000000001,0.29224,0.29224,31,500.92694,500.92694,1.7625599999999999,1.7625599999999999]
[null,40001115,"CA","RURAL SHORT",788,78.857529999999997,0.24127999999999999,1.4330000000000001,0.48843602814680775,1.046538360355793,30,68.440550000000002,68.440550000000002,0.41243999999999997,0.41243999999999997,24,146.64286999999999,146.64286999999999,0.85914000000000001,0.85914000000000001]
[null,40001116,"CA","RURAL LONG",963,1032.02998,0.42110000000000003,3.0569999999999999,18.952286384662248,0.84754586345219318,152,1830.6667500000001,1496.0933399999999,7.3271000000000006,6.8598099999999995,40,81.867379999999997,81.867379999999997,1.82762,1.82762]
[null,40001117,"CA","RURAL SHORT",192,11.798069999999999,0.82901999999999998,2.0670000000000002,0.55913283433148275,0,5,30.181339999999999,29.696959999999997,0.24478999999999998,0.23957999999999999,"",0,0,0,0]
[null,40001118,"CA","RURAL LONG",709,526.27778000000001,0.17806999999999998,1.9610000000000001,16.986238218374343,1.6828887816612013,115,1597.6307000000002,526.23236999999995,2.9887199999999998,2.8787000000000003,68,158.28312,158.28312,0.87305999999999995,0.87305999999999995]
[null,40001119,"CA","RURAL SHORT",607,41.656309999999998,3.8027799999999998,2.5940000000000003,3.5517842392185903,0.39626758553762409,24,249.59343999999999,6.1286100000000001,0.10213999999999999,4.4479999999999999E-2,15,27.846789999999999,27.846789999999999,0.14826999999999999,0.14826999999999999]
[null,40001120,"CA","RURAL SHORT",1244,51.224559999999997,14.824689999999999,4.6100000000000003,1.4619327452545174,0.24139334943301416,17,153.93722,153.93722,1.0442099999999999,1.0442099999999999,11,25.418009999999999,25.418009999999999,0.18006,0.18006]
[null,40001121,"CA","URBAN",728,7.7476199999999995,2.55871,3.3820000000000001,8.2197804118588472E-2,0.14891580247869771,9,7.8633699999999997,7.8633699999999997,5.4949999999999999E-2,5.4949999999999999E-2,10,14.24588,14.24588,9.4779999999999989E-2,9.4779999999999989E-2]
[null,40001122,"CA","URBAN",7,2.4243299999999999,2.3353999999999999,3.9290000000000003,0,0,"",0,0,0,0,"",0,0,0,0]
[null,40001123,"CA","RURAL SHORT",92,9.7896299999999989,1.90998,3.3580000000000001,0.14836666531104412,0.92737669653010912,3,1.58768,1.58768,3.261E-2,3.261E-2,7,9.9239099999999993,9.9239099999999993,8.6959999999999996E-2,8.6959999999999996E-2]
[null,40001124,"CA","URBAN",3,3.6361499999999998,5.6079999999999998E-2,1.8180000000000001,0,0,"",0,0,0,0,"",0,0,0,0]
[null,40001126,"CA","RURAL SHORT",433,53.97954,1.1515,1.492,0.24991071770295048,0.14155850488400012,9,13.83799,13.592459999999999,0.10624,0.10392999999999999,2,7.8383399999999996,7.8383399999999996,3.0019999999999998E-2,3.0019999999999998E-2]
[null,40001128,"CA","URBAN",278,0,2.5468500000000001,4.5129999999999999,2.8516027302482251E-3,4.7472240771416665,1,3.5969999999999995E-2,3.5969999999999995E-2,3.6000000000000003E-3,3.6000000000000003E-3,31,59.88129,59.88129,0.43524999999999997,0.43524999999999997]
[null,40001129,"CA","URBAN",989,9.3978799999999989,1.53155,3.617,3.7121509838321849,0.48347592298983422,47,363.35253,129.47183999999999,0.9909,0.96258999999999995,21,47.323560000000001,47.323560000000001,0.16077,0.16077]
[null,40001130,"CA","URBAN",756,6.5304599999999997,1.3083099999999999,3.38,0.21599225145614834,4.5125342139026255E-2,14,19.12698,18.903219999999997,0.26190000000000002,0.25925999999999999,16,3.9960299999999997,3.9960299999999997,4.233E-2,4.233E-2]
[null,40001131,"CA","RURAL SHORT",564,8.3690599999999993,2.5957599999999998,2.4710000000000001,8.3183785016915142,2.9432747455242197E-2,32,407.89882,54.31371,1.45567,1.4184399999999999,29,1.44326,1.44326,5.851E-2,5.851E-2]
[null,40001132,"CA","URBAN",1026,8.2316099999999999,1.02603,3.5140000000000002,2.0986897119988645E-2,0.30254633098841421,11,2.0568900000000001,2.0568900000000001,7.2120000000000004E-2,7.2120000000000004E-2,18,29.652049999999999,29.652049999999999,0.15983999999999998,0.15983999999999998]
[null,40001133,"CA","URBAN",453,3.6283399999999997,0.63319999999999999,1.294,1.344280641518163,4.4429121098576198E-3,13,139.59555,1.15625,2.87E-2,6.62E-3,10,0.46137,0.46137,2.2079999999999999E-2,2.2079999999999999E-2]
[null,40001134,"CA","URBAN",113,0.81933,1.8884099999999999,0.996,0.42067947380729204,0.49760444295926237,2,24.853539999999999,24.853539999999999,1.0442499999999999,1.0442499999999999,11,29.398229999999998,29.398229999999998,0.26549,0.26549]
[null,40001135,"CA","RURAL SHORT",1494,34.686749999999996,3.0461299999999998,4.5790000000000006,1.3798495939527684,0.27656206607130551,38,122.78539000000001,50.818059999999996,0.38285999999999998,0.29518,43,24.609769999999997,24.609769999999997,0.17604,0.17604]
[null,40001137,"CA","RURAL SHORT",0,0,0,0,0,0,"",0,0,0,0,"",0,0,0,0]
[null,40001138,"CA","RURAL SHORT",45,45.446179999999998,0.12243999999999999,1.4320000000000002,122.22523121848742,4.4171004863367358,18,1063.17815,1043.0114799999999,10.088889999999999,7.0888899999999992,1,38.422219999999996,38.422219999999996,2.222E-2,2.222E-2]
[null,40001139,"CA","RURAL LONG",383,249.07678999999999,0.31674999999999998,2.2600000000000002,13.781665512409328,1.8084527216595647,46,518.25561000000005,513.20979,6.9268899999999993,4.9347300000000001,21,68.006349999999998,68.006349999999998,0.36814999999999998,0.36814999999999998]
[null,40001140,"CA","RURAL SHORT",383,53.513179999999998,0.53725000000000001,2.496,26.484038561437817,0.77647794633542211,61,1196.3594399999999,169.66131000000001,0.76761999999999997,0.62924000000000002,38,35.075719999999997,34.819839999999999,0.28460000000000002,0.27937000000000001]
[null,40001142,"CA","URBAN",402,5.3732299999999995,0.30701000000000001,3.327,72.417431551388461,0.1430447582367918,104,2056.5127299999999,80.550039999999996,0.39055000000000001,0.16666999999999998,55,4.0621900000000002,4.0373099999999997,0.14924999999999999,0.14676999999999998]
[null,40001143,"CA","URBAN",91,0,1.34649,3.419,1.7819684111298178E-2,3.2931595657756465,1,0.16483999999999999,0.16483999999999999,1.099E-2,1.099E-2,15,30.463189999999997,30.463189999999997,0.56043999999999994,0.56043999999999994]
[null,40001144,"CA","URBAN",177,0,1.11507,2.669,0,0.58357762670020241,"",0,0,0,0,14,21.254239999999999,21.254239999999999,0.20904,0.20904]
[null,40001145,"CA","URBAN",517,5.73576,0.39588000000000001,2.1110000000000002,24.607101023827159,6.3423610726584187E-2,95,1524.1528000000001,204.85368,1.34816,1.1934199999999999,59,3.9284299999999996,3.7156699999999998,0.15087,0.14313000000000001]
[null,40001146,"CA","URBAN",294,2.9693499999999999,1.01353,3.3220000000000001,1.6014421376756323,1.3463623656779375,16,59.634749999999997,59.634749999999997,1.3231299999999999,1.3231299999999999,38,50.136049999999997,50.136049999999997,0.39116000000000001,0.39116000000000001]
[null,40001148,"CA","URBAN",105,0,1.29359,2.077,2.2636552064787878,3.5086858360816797,1,36.86,36.86,1.08571,1.08571,13,57.133330000000001,57.133330000000001,0.37142999999999998,0.37142999999999998]
[null,40001153,"CA","URBAN",438,2.4545300000000001,0.77635999999999994,1.1740000000000002,0.73004989590069547,8.3956129961373417E-4,6,81.399619999999999,81.399619999999999,1.00685,1.00685,5,9.3609999999999999E-2,9.3609999999999999E-2,1.142E-2,1.142E-2]
[null,40001154,"CA","RURAL SHORT",0,0,0,0,0,0,"",0,0,0,0,"",0,0,0,0]
[null,40001156,"CA","RURAL SHORT",771,7.6809699999999994,0.13488999999999998,1.4520000000000002,0.17552337454501915,4.5694709011813536E-2,12,22.295009999999998,22.191869999999998,0.13100000000000001,0.12970000000000001,7,5.8041499999999999,5.8041499999999999,2.205E-2,2.205E-2]
[null,40001157,"CA","RURAL SHORT",13,8.0170300000000001,5.9800000000000006E-2,2.3250000000000002,11758.434844534508,454.73253683598512,9,9688.7615399999995,31.684619999999999,2.2307699999999997,1.15385,2,374.69231000000002,374.69231000000002,1.15385,1.15385]
[null,40001162,"CA","URBAN",1,6.0149999999999995E-2,0,3.512,957.79240255216246,0,3,43.266669999999998,30.566669999999998,3,2,"",0,0,0,0]
[null,40001168,"CA","RURAL SHORT",0,0,0,0,0,0,"",0,0,0,0,"",0,0,0,0]
[null,40001169,"CA","RURAL SHORT",0,0,0,0,0,0,"",0,0,0,0,"",0,0,0,0]
[null,40001170,"CA","RURAL SHORT",429,45.994459999999997,2.8913000000000002,1.397,1.2090413259416888,0.38387158685545741,16,113.84806,33.043079999999996,2.7179500000000001,1.6130499999999999,11,36.146850000000001,36.146850000000001,0.35663999999999996,0.35663999999999996]
[null,40001171,"CA","RURAL SHORT",0,1.5979999999999998E-2,3.0619999999999998E-2,0,0,0,"",0,0,0,0,"",0,0,0,0]
[null,40001174,"CA","RURAL SHORT",779,11.78937,1.0809,2.5020000000000002,2.442488843232411,0.94900364311126761,25,202.81005999999999,190.41980999999998,2.2079599999999999,1.2323499999999998,11,78.79974,78.79974,0.30295,0.30295]
[null,40001175,"CA","URBAN",1741,9.3410200000000003,3.22268,4.2140000000000004,0.20787173810511256,0.45045506420055664,29,28.65756,16.208769999999998,1.6381399999999999,0.66110999999999998,26,62.100519999999996,62.100519999999996,0.66513,0.66513]
[null,40001176,"CA","RURAL SHORT",655,46.040199999999999,5.1482099999999997,1.802,0.30575444605954416,0.33969804490164751,8,32.318979999999996,19.948600000000003,2.0045799999999998,1.0305299999999999,12,35.9069,35.9069,0.20152999999999999,0.20152999999999999]
[null,40001177,"CA","RURAL SHORT",1920,17.902349999999998,4.8083399999999994,5.431,4.7518813528865591,0.81633176754618586,28,534.39669000000004,238.53547,4.1864599999999994,2.15781,40,91.804689999999994,91.804689999999994,0.6,0.6]
[null,40001178,"CA","RURAL SHORT",1627,27.992139999999999,10.01516,5.8380000000000001,3.2247013203411119,0.69571715610885243,23,213.98835,167.62487999999999,4.0516299999999994,2.0596199999999998,10,46.167179999999995,46.167179999999995,0.24892,0.24892]
[null,40001179,"CA","URBAN",253,7.0870899999999999,0.80557000000000001,2.8210000000000002,3.2557811982246871,0.17569043712765733,9,137.41033999999999,124.16179,4.0158100000000001,3.0395300000000001,5,7.4150199999999993,7.4150199999999993,8.6959999999999996E-2,8.6959999999999996E-2]
[null,40001180,"CA","URBAN",597,8.3618899999999989,0.80430000000000001,4.5540000000000003,1.1362561841856054,1.0309521807260682E-2,16,40.799109999999999,27.449109999999997,3.1859299999999999,2.1859299999999999,7,0.37018000000000001,0.37018000000000001,1.1729999999999999E-2,1.1729999999999999E-2]
[null,40001182,"CA","URBAN",0,0,0.27177999999999997,2.911,0,0,"",0,0,0,0,"",0,0,0,0]
[null,40001183,"CA","RURAL SHORT",112,46.843820000000001,0.68635000000000002,0.72100000000000009,0.96209672666584023,3.8218957804784896E-3,8,56.18929,41.801639999999999,1.3035699999999999,0.30357000000000001,2,0.22320999999999999,0.22320999999999999,1.7860000000000001E-2,1.7860000000000001E-2]
[null,40001184,"CA","RURAL SHORT",644,34.17933,2.5146000000000002,3.1640000000000001,0.57432847560164435,0.16386055057234294,15,38.494949999999996,18.807269999999999,1.19255,0.13508999999999999,28,10.98292,10.98292,6.9879999999999998E-2,6.9879999999999998E-2]
[null,40001185,"CA","RURAL SHORT",1,0.22622999999999999,0,0,3584.3330337271095,0,8,440.83332999999999,436.13333,8,6,"",0,0,0,0]
[null,40001186,"CA","RURAL SHORT",0,0,0.15336,0,0,0,"",0,0,0,0,"",0,0,0,0]
[null,40001187,"CA","RURAL SHORT",0,0,0,0,0,0,"",0,0,0,0,"",0,0,0,0]
[null,40001188,"CA","RURAL SHORT",0,0,0,0,0,0,"",0,0,0,0,"",0,0,0,0]
[null,40001189,"CA","RURAL SHORT",1272,12.968439999999999,0.52134999999999998,3.427,1.7497741694401501,9.6083015733374771E-2,24,188.59617,175.95072999999999,4.3710699999999996,3.3875799999999998,26,10.35613,10.31997,8.097E-2,7.9399999999999998E-2]
[null,40001190,"CA","URBAN",659,3.4324000000000003,0.64217000000000002,3.9790000000000001,1.1015470304734365,1.9528228128257712E-2,6,53.49785,41.183279999999996,1.96055,0.9909,23,0.94840999999999998,0.94840999999999998,3.9449999999999999E-2,3.9449999999999999E-2]
[null,40001191,"CA","URBAN",967,8.8392800000000005,0.87383999999999995,3.1220000000000003,3.1055851651716457,2.9407733682119595E-2,16,265.48516000000001,1.85124,2.9844899999999996,1.3439999999999999E-2,28,2.51396,2.51396,5.2739999999999995E-2,5.2739999999999995E-2]
[null,40001193,"CA","RURAL SHORT",1828,11.098419999999999,8.6022099999999995,5.2620000000000005,1.1646387368471007,0.50596731817770613,23,136.87074000000001,133.75928999999999,2.8369800000000001,2.8216600000000001,24,59.462319999999998,59.462319999999998,0.34026000000000001,0.34026000000000001]
[null,40001194,"CA","URBAN",1252,9.1502999999999997,0.59338000000000002,4.431,0.27826144369818007,0.29786386815131782,12,19.65532,7.2624599999999999,1.1094199999999999,0.13497999999999999,58,21.039960000000001,21.039960000000001,0.14616999999999999,0.14616999999999999]
[null,40001195,"CA","URBAN",473,7.1528700000000001,2.6956899999999999,3.2870000000000004,0.94030030239800633,0.54560985520377825,11,52.831289999999996,40.560890000000001,1.1902699999999999,0.22410000000000002,21,30.655389999999997,30.655389999999997,0.20718999999999999,0.20718999999999999]
[null,40001200,"CA","RURAL SHORT",1485,11.46082,3.00332,3.4770000000000003,0.67727945615021301,5.079818292999131E-2,19,93.807760000000002,82.186539999999994,2.1515200000000001,1.15825,31,7.0358899999999993,7.0358899999999993,0.15353999999999998,0.15353999999999998]
[null,40001201,"CA","RURAL SHORT",820,49.708509999999997,4.6244899999999998,3.5170000000000003,1.8811677397043747,0.56486724028098112,17,154.16365999999999,147.49760000000001,2.2853699999999999,1.7256099999999999,15,46.291460000000001,46.291460000000001,0.38901999999999998,0.38901999999999998]
[null,40001202,"CA","URBAN",2243,10.88072,4.2658199999999997,4.6630000000000003,1.2796309919890538,0.32400231794320983,29,128.58517000000001,39.976649999999999,2.4364699999999999,1.02318,16,32.557739999999995,32.557739999999995,0.18636,0.18636]
[null,40001203,"CA","URBAN",0,0,5.8889999999999998E-2,3.5000000000000003E-2,0,0,"",0,0,0,0,"",0,0,0,0]
[null,40001204,"CA","RURAL SHORT",1627,162.14755,2.69204,4.0670000000000002,0.37966539684490203,0.52969351039706414,41,47.279779999999995,47.09207,2.0165899999999999,2.0147499999999998,72,65.962800000000001,65.939449999999994,0.42654999999999998,0.42593999999999999]
[null,40001205,"CA","RURAL SHORT",2,0,0,0,13.407573611001167,0,1,655.23333000000002,655.23333000000002,1,1,"",0,0,0,0]
[null,40001206,"CA","RURAL SHORT",76,29.567519999999998,0,0.504,4.3453150121135318,2.5784430328082496E-2,11,547.70547999999997,473.20943,6.0789499999999999,5.0131600000000001,8,3.25,3.25,0.10525999999999999,0.10525999999999999]
[null,40001207,"CA","RURAL SHORT",155,161.78286,0,0.434,15.648975674778431,7.7093106516813004,41,1658.7524699999999,812.55440999999996,8.2258099999999992,6.2193499999999995,26,817.16773999999998,817.16773999999998,3.4516099999999996,3.4516099999999996]
[null,40001208,"CA","RURAL LONG",675,288.70663000000002,0.25261,1.4360000000000002,9.6292501102030297,1.6064654416940872E-2,59,1408.3823,169.37116,5.7925899999999997,2.8296299999999999,34,2.3496299999999999,2.3496299999999999,7.7039999999999997E-2,7.7039999999999997E-2]
[null,40001210,"CA","RURAL LONG",574,266.39857000000001,0.13880000000000001,1.123,12.156885765958121,0.65742741552114692,82,1344.4102499999999,1133.2573500000001,17.184670000000001,12.09756,23,72.703829999999996,72.703829999999996,0.35713999999999996,0.35713999999999996]
[null,40001215,"CA","URBAN",821,4.23963,1.7879,4.4540000000000006,0.38888783362691531,0.56885185986984521,14,20.32572,20.32572,1.1425099999999999,1.1425099999999999,56,29.731769999999997,29.731769999999997,0.26917999999999997,0.26917999999999997]
[null,40001222,"CA","RURAL SHORT",0,0,0,5.1260000000000003,0,0,"",0,0,0,0,"",0,0,0,0]
[null,40001225,"CA","URBAN",1,5.6000000000000001E-2,0,3.4570000000000003,6002.3776601617437,0,5,394.55,381.85,5,4,"",0,0,0,0]
[null,40001226,"CA","RURAL SHORT",1844,71.395269999999996,5.3080799999999995,4.4550000000000001,1.3875284544074713,0.96134736312063029,54,190.40994000000001,189.16370999999998,2.78959,2.78254,69,131.92528999999999,131.92528999999999,0.68113000000000001,0.68113000000000001]
[null,40001227,"CA","RURAL SHORT",414,157.11452,5.5239999999999997E-2,0.97,3.4945627313859262,2.4005531967827789,34,371.00427000000002,234.2655,8.9855099999999997,5.9686000000000003,63,254.85748999999998,254.85748999999998,1.4879199999999999,1.4879199999999999]
[null,40001230,"CA","RURAL SHORT",1131,16.247209999999999,3.4746199999999998,3.488,0.1676526214705856,6.4248723321839785E-2,17,14.6691,1.7099499999999999,1.0256399999999999,2.1219999999999999E-2,15,5.6215700000000002,5.6215700000000002,0.13350999999999999,0.13350999999999999]
[null,40001231,"CA","RURAL SHORT",126,9.2987500000000001,8.4253999999999998,3.7050000000000001,22.56160383368216,1.0259958793763928,8,253.23347000000001,240.20132000000001,4.0872999999999999,3.11111,3,11.51587,11.51587,0.10317,0.10317]
[null,40001232,"CA","RURAL SHORT",1063,63.310829999999996,13.542009999999999,3.5920000000000001,0.97758717825513408,0.33913471215443669,19,78.057779999999994,65.216430000000003,1.2916299999999998,0.29444999999999999,9,27.07902,27.07902,0.18626999999999999,0.18626999999999999]
[null,40001236,"CA","URBAN",634,6.3732499999999996,1.1896899999999999,3.0130000000000003,0.28711406484803503,4.9893308778912676E-3,5,15.97466,3.5970800000000001,0.99053999999999998,2.5239999999999999E-2,10,0.27760000000000001,0.27760000000000001,1.7350000000000001E-2,1.7350000000000001E-2]
[null,40001237,"CA","RURAL SHORT",2001,7.4994299999999994,2.3860399999999999,4.6500000000000004,0.71886521539440495,0.12792724096127264,38,73.801059999999993,70.127160000000003,2.6166899999999997,2.56372,32,13.133429999999999,13.10745,7.5459999999999999E-2,7.4959999999999999E-2]
[null,40001246,"CA","RURAL SHORT",242,131.55965,0.58730000000000004,3.7510000000000003,5.939985063076894,5.1958237962196861E-2,40,89.284570000000002,89.284570000000002,0.73966999999999994,0.73966999999999994,12,0.78098999999999996,0.78098999999999996,4.9589999999999995E-2,4.9589999999999995E-2]
[null,40001247,"CA","URBAN",964,11.26418,1.42164,4.3470000000000004,0.37077352262789204,2.1351889294196586E-2,16,26.984019999999997,26.984019999999997,1.0228200000000001,1.0228200000000001,130,1.5539399999999999,1.5539399999999999,0.13485,0.13485]
[null,40200482,"CA","RURAL SHORT",27,49.242759999999997,0,2.1190000000000002,108.23638438236863,0.74174526754478032,19,1091.70679,1074.5567900000001,10.407409999999999,9.4074099999999987,2,7.4814799999999995,7.4814799999999995,7.4069999999999997E-2,7.4069999999999997E-2]
[null,40200483,"CA","RURAL LONG",84,286.63761,0.19272999999999998,0.30599999999999999,32.241014658604108,12.051872883257966,17,1483.89444,1483.89444,8.4642900000000001,8.4642900000000001,16,554.68810000000008,554.68810000000008,4.3809499999999995,4.3809499999999995]
[null,40216323,"CA","RURAL LONG",650,2383.4395199999999,0,2.093,10.597786882889034,3.6140496636111452,90,835.26068999999995,814.32530999999994,9.2769199999999987,8.2799999999999994,122,284.84000000000003,275.61846000000003,1.36154,1.33385]
[null,40216325,"CA","RURAL SHORT",730,17.48865,9.1139999999999999E-2,2.133,1.905266595190517,0.25479525075566523,18,142.44728000000001,121.61989,7.15205,6.1602699999999997,66,19.049769999999999,19.049769999999999,0.17807999999999999,0.17807999999999999]
[null,40219767,"CA","RURAL SHORT",1,38.154309999999995,0,5.5620000000000003,0.47644967047356102,0.77079441054495768,2,261.41667000000001,193.53332999999998,2,1,2,422.91667000000001,422.91667000000001,2,2]
[null,40223073,"CA","RURAL LONG",715,630.38198999999997,0.29042000000000001,2.4010000000000002,16.704597137852716,1.0800912909252105,71,1455.36214,1336.52881,5.3510499999999999,5.2139899999999999,50,94.101280000000003,94.101280000000003,0.41818,0.41818]
[null,40223076,"CA","RURAL LONG",287,695.97284999999999,9.6019999999999994E-2,1.075,36.904738440340971,6.041058929091867,56,2625.8027900000002,2621.8645799999999,10.425089999999999,10.22997,17,429.82636000000002,429.82636000000002,2.22648,2.22648]
[null,50000011,"WB","RURAL SHORT",91,184.62832,8.4600000000000009E-2,0.19900000000000001,8.3678995983888687,2.2691206262834691,13,1066.6043999999999,1008.4044,6.4175800000000001,5.4175800000000001,1,289.23077000000001,289.23077000000001,0.76922999999999997,0.76922999999999997]
[null,50000013,"WB","RURAL SHORT",0,0,0,0.19900000000000001,0,0,"",0,0,0,0,"",0,0,0,0]
[null,50000015,"WB","RURAL SHORT",244,111.92068999999999,0,1.9440000000000002,17.835317181216769,1.738355157462246,44,1119.84078,787.97473000000002,7.5041000000000002,4.4180299999999999,6,109.14753999999999,109.14753999999999,0.34015999999999996,0.34015999999999996]
[null,50000016,"WB","RURAL SHORT",445,88.021200000000007,5.8100000000000001E-3,1.1970000000000001,5.7450795913486346,0.30860321302920829,36,749.29951000000005,347.40749,7.68764,4.2966299999999995,11,40.24944,40.24944,0.19550999999999999,0.19550999999999999]
[null,50000017,"WB","URBAN",1,1.37273,5.9800000000000001E-3,0.69700000000000006,557.36610482208164,215.2454071329114,6,363.08332999999999,228.13333,6,3,1,140.21666999999999,140.21666999999999,1,1]
[null,50000020,"WB","RURAL SHORT",724,133.79311999999999,2.5007899999999998,3.1930000000000001,9.2247801043386009,1.8698000187880228,58,812.97930000000008,75.289729999999992,2.6574599999999999,0.63260000000000005,53,164.78536,164.78536,1.0414399999999999,1.0414399999999999]
[null,50000021,"WB","RURAL SHORT",328,77.701359999999994,0.80145999999999995,1.1870000000000001,4.5295393696195418,0.81930450297694946,21,471.25554,79.872,1.45427,0.44816999999999996,13,85.240849999999995,85.240849999999995,0.57316999999999996,0.57316999999999996]
[null,50000022,"WB","RURAL SHORT",821,74.987529999999992,1.61843,2.6190000000000002,4.0563862618103554,1.0476795671438246,28,316.59420999999998,22.522919999999999,1.59683,0.45066999999999996,152,81.769649999999999,60.761119999999998,0.83921999999999997,0.74542999999999993]
[null,50000025,"WB","RURAL LONG",803,287.91973000000002,0.82104999999999995,1.3,7.3996948317587457,1.0551532490431403,55,1014.49907,784.55439999999999,8.8841799999999989,8.678700000000001,134,144.66164000000001,139.62055000000001,0.68492999999999993,0.66001999999999994]
[null,50000026,"WB","RURAL SHORT",67,45.824079999999995,5.3169999999999995E-2,0.19400000000000001,11.224228035877216,1.4913931355299419,15,1482.9594500000001,1482.9594500000001,11.14925,11.14925,10,197.04478,197.04478,1.1194,1.1194]
[null,50000027,"WB","RURAL SHORT",143,83.171059999999997,7.5889999999999999E-2,0.73699999999999999,17.845367543250838,3.5418683532101864,16,542.31502999999998,542.31502999999998,8.0139899999999997,8.0139899999999997,13,107.63625,107.63625,0.95104999999999995,0.95104999999999995]
[null,50000028,"WB","RURAL SHORT",111,112.61587,0.13388999999999998,0.12300000000000001,7.5625162411205489,2.5027096730240248,22,1290.27928,514.57357000000002,8.4684699999999999,7.81081,43,427,427,2.0540499999999997,2.0540499999999997]
[null,50000030,"WB","RURAL SHORT",843,5.11348,1.9053099999999998,1.5,8.6930326226414764E-2,0.33960301401977283,16,12.93318,12.93318,0.2586,0.2586,34,50.524909999999998,50.524909999999998,0.77935999999999994,0.77935999999999994]
[null,50000031,"WB","RURAL SHORT",1021,27.338159999999998,2.8768599999999998,2.6760000000000002,2.3599321007183778,1.688433282029594,25,125.21516,124.94954,1.6062699999999999,1.6043099999999999,21,89.586239999999989,89.586239999999989,0.37023,0.37023]
[null,50000032,"WB","RURAL SHORT",579,47.583569999999995,1.6340899999999998,1.758,0.82528910428148372,0.11800733543677243,15,95.191879999999998,95.191879999999998,1.0293600000000001,1.0293600000000001,8,13.611400000000001,13.611400000000001,5.3539999999999997E-2,5.3539999999999997E-2]
[null,50000033,"WB","RURAL SHORT",1133,10.420389999999999,5.0090399999999997,3.173,4.9734203791641701E-2,6.5204251342920377E-2,13,4.6000299999999994,2.9936699999999998,4.6779999999999995E-2,4.2369999999999998E-2,19,6.0308899999999994,6.0308899999999994,4.0600000000000004E-2,4.0600000000000004E-2]
[null,50000034,"WB","RURAL SHORT",1847,8.8193000000000001,4.2916400000000001,2.867,0.31286230307921142,1.8974470575555805E-2,22,48.448100000000004,48.448100000000004,7.0379999999999998E-2,7.0379999999999998E-2,176,2.9382799999999998,2.9382799999999998,0.10449,0.10449]
[null,50000035,"WB","RURAL SHORT",1059,6.16181,1.80416,1.595,0.18347577076000049,1.0212039535298119E-2,21,28.790779999999998,27.99633,0.40698999999999996,0.40510000000000002,39,1.60246,1.60246,3.9660000000000001E-2,3.9660000000000001E-2]
[null,50000036,"WB","RURAL SHORT",1255,32.167020000000001,1.36049,3.6720000000000002,0.77341201639499446,2.5475655970178841,29,61.850459999999998,51.516669999999998,0.73546,0.70836999999999994,38,203.73113000000001,203.73113000000001,0.57450000000000001,0.57450000000000001]
[null,50000037,"WB","RURAL SHORT",379,7.9970099999999995,1.85402,2.194,1.0611657484458825,0.706299027980546,9,60.992700000000006,60.992700000000006,1.8258599999999998,1.8258599999999998,28,40.596000000000004,40.596000000000004,0.21107999999999999,0.21107999999999999]
[null,50000040,"WB","RURAL LONG",340,248.81177,0.10922999999999999,1.0110000000000001,50.701862448580783,0.37881659824443648,56,829.43167000000005,769.51274999999998,5.9352899999999993,4.9205899999999998,10,6.1970599999999996,6.1970599999999996,0.05,0.05]
[null,50000043,"WB","RURAL SHORT",69,42.052529999999997,0,0.73299999999999998,6.4364981822863845,1.2082978593496256,18,336.29034000000001,323.23406,7.6087000000000007,7.5942000000000007,2,63.130429999999997,63.130429999999997,0.42029,0.42029]
[null,50000044,"WB","RURAL LONG",508,597.48906999999997,0,0.92400000000000004,6.7117513335312671,0.73866494346740741,56,757.20135000000005,747.56826999999998,8.5551199999999987,8.54331,35,83.334149999999994,83.334149999999994,0.53937000000000002,0.53937000000000002]
[null,50000046,"WB","RURAL SHORT",197,78.231489999999994,0.19863999999999998,1.5530000000000002,5.0576558032410883,1.6181172339694814,22,268.83697000000001,71.457949999999997,5.2588799999999996,1.23858,8,86.010149999999996,86.010149999999996,0.38070999999999999,0.38070999999999999]
[null,50000047,"WB","URBAN",1,4.4161099999999998,8.1549999999999997E-2,5.6059999999999999,69348.760725766828,8829.9937927499468,4,6424.51667,4,4,1,2,818.01666999999998,818.01666999999998,2,2]
[null,50000049,"WB","RURAL SHORT",113,45.047959999999996,5.3939999999999995E-2,1.8760000000000001,6.5455003445151574,10.885543645482601,24,255.11651999999998,63.71593,4.1681400000000002,1.19469,29,424.27345000000003,424.27345000000003,2.2477899999999997,2.2477899999999997]
[null,50000050,"WB","RURAL SHORT",488,116.18653,0.90171000000000001,4.0330000000000004,8.4667676270790846,1.426720581703572,36,554.98152000000005,208.0514,5.15984,1.52664,13,93.518990000000002,93.518990000000002,0.33810999999999997,0.33810999999999997]
[null,50000052,"WB","RURAL SHORT",329,59.368200000000002,5.2269999999999997E-2,2.1140000000000003,2.0137565466512242,4.3007833358594754,18,126.93662999999999,74.71544999999999,2.4650499999999997,0.46200999999999998,22,271.09877999999998,271.09877999999998,2.16717,2.16717]
[null,50000053,"WB","RURAL LONG",542,246.96350999999999,5.3629999999999997E-2,1.0330000000000001,7.3291242100318783,0.1550769405579572,38,1003.82106,96.292310000000001,5.0203000000000007,0.83948,33,21.239850000000001,21.239850000000001,0.16605,0.16605]
[null,50000054,"WB","RURAL SHORT",659,195.48278999999999,0.49645,2.262,4.0698265029661069,3.0390643132264117,42,327.20951000000002,48.553819999999995,6.1062199999999995,2.1077399999999997,34,244.33738,244.32676000000001,2.0956000000000001,2.0940799999999999]
[null,50000055,"WB","RURAL SHORT",0,0,0,0,0,0,"",0,0,0,0,"",0,0,0,0]
[null,50000057,"WB","RURAL LONG",637,237.45625000000001,0.79730999999999996,1.97,10.334976721453064,3.842951201443408,65,1084.1257700000001,890.68508999999995,5.6326499999999999,5.5415999999999999,95,403.12063999999998,403.12063999999998,1.53061,1.53061]
[null,50000058,"WB","RURAL SHORT",94,61.81176,2.334E-2,0.80400000000000005,17.584426311471699,4.491830626409065E-2,11,1012.0078000000001,822.26277000000005,3.4574499999999997,3.2127699999999999,6,2.5851099999999998,2.5851099999999998,6.3829999999999998E-2,6.3829999999999998E-2]
[null,50000059,"WB","RURAL SHORT",1086,156.40472,1.1429999999999999E-2,1.6420000000000001,4.8263066106442825,0.37867145307463324,33,752.44605999999999,369.57115999999996,5.1869199999999998,4.1942899999999996,34,59.036829999999995,59.008289999999995,0.46960999999999997,0.46776999999999996]
[null,50000061,"WB","RURAL SHORT",197,92.627319999999997,9.423999999999999E-2,1.502,5.3358102636344666,0.16667521288897302,22,321.26963000000001,292.08105,3.3857899999999996,2.2335000000000003,4,10.03553,10.03553,6.5989999999999993E-2,6.5989999999999993E-2]
[null,50000062,"WB","URBAN",1,0.93310999999999999,8.446999999999999E-2,4.9530000000000003,955.19572339020726,3054.9967970142602,3,54.716670000000001,34.683329999999998,3,1,1,175,175,1,1]
[null,50000063,"WB","RURAL SHORT",54,12.83109,7.3959999999999998E-2,0.127,2.400940024803341,2.5521109694575106,6,247.19506000000001,230.35802000000001,3.0185199999999996,2.0185200000000001,4,262.75925999999998,262.75925999999998,0.92592999999999992,0.92592999999999992]
[null,50000065,"WB","RURAL LONG",571,369.85293000000001,0.18285999999999999,1.657,27.996757653102531,10.152351676020464,56,148.62398999999999,147.68284,5.1418599999999994,5.1278499999999996,64,53.894919999999999,53.894919999999999,0.33450000000000002,0.33450000000000002]
[null,50000066,"WB","RURAL SHORT",974,128.74059,0.31774999999999998,3.3460000000000001,1.6826494055663108,0.90642332278378657,57,163.11732000000001,163.03194999999999,4.2484599999999997,4.24641,144,87.869369999999989,87.810850000000002,0.46920000000000001,0.46611999999999998]
[null,50000067,"WB","RURAL SHORT",157,61.559979999999996,0.29413,1.33,5.0493599346116129,0.19832564599675992,34,280.24320999999998,280.24320999999998,8.3312100000000004,8.3312100000000004,11,11.00722,11.00722,0.15923999999999999,0.15923999999999999]
[null,50000068,"WB","RURAL SHORT",160,101.62993,0.30198999999999998,0.88800000000000001,3.7632888759447809,5.65665460934957E-2,23,399.17115000000001,399.17115000000001,5.75,5.75,6,6,6,6.8749999999999992E-2,6.8749999999999992E-2]
[null,50000073,"WB","RURAL SHORT",1591,123.44701000000001,4.5962800000000001,3.44,7.685952541580785,0.2238229103336439,31,771.54737999999998,82.662819999999996,2.0157099999999999,0.32055,149,22.468259999999997,22.468259999999997,0.19422,0.19422]
[null,50000074,"WB","RURAL SHORT",1708,91.794319999999999,11.097339999999999,2.6160000000000001,3.8317313569074498,2.9969944568662078E-2,28,574.23784999999998,39.078119999999998,1.24356,0.23945999999999998,149,4.4914100000000001,4.4914100000000001,0.10187,0.10187]
[null,50000075,"WB","RURAL SHORT",1101,57.62509,0.43772,2.0190000000000001,4.6361543596788213,0.22394709041467653,27,506.06160999999997,23.265739999999997,1.1653,0.16621,21,24.445049999999998,24.445049999999998,0.10898999999999999,0.10898999999999999]
[null,50000084,"WB","RURAL SHORT",205,79.548109999999994,0,0.378,3.4262800138148877,1.4614452297857334,21,552.70609999999999,416.37162999999998,6.2731699999999995,5.8536599999999996,22,235.75121999999999,235.75121999999999,0.95121999999999995,0.95121999999999995]
[null,50000085,"WB","RURAL SHORT",217,90.266639999999995,0.12948999999999999,0.46600000000000003,1.4793175737753486,1.3518779754215313,19,201.12665000000001,201.12665000000001,3.50691,3.50691,34,183.80007999999998,183.80007999999998,1.02765,1.02765]
[null,50000086,"WB","RURAL SHORT",182,4.6996000000000002,0,0.32400000000000001,0.80792744807965766,0.10945386856326296,8,120.73929,120.73929,3.0494499999999998,3.0494499999999998,57,16.357139999999998,16.357139999999998,0.39010999999999996,0.39010999999999996]
[null,50000090,"WB","URBAN",1164,8.3341899999999995,1.14696,4.6790000000000003,4.1738074401916947,0.12094636313353015,10,274.74244999999996,274.74244999999996,5.0137499999999999,5.0137499999999999,91,7.9613399999999999,7.9613399999999999,9.8799999999999999E-2,9.8799999999999999E-2]
[null,50000092,"WB","RURAL SHORT",1733,20.03547,3.1471299999999998,3.6430000000000002,6.0653115234514079,1.2436447310783217E-2,43,625.32010000000002,625.27557000000002,6.2671700000000001,6.2660099999999996,20,1.28217,1.28217,1.6729999999999998E-2,1.6729999999999998E-2]
[null,50000093,"WB","RURAL LONG",1051,273.84571,3.48027,4.2690000000000001,16.73300972693373,2.510866568222295,55,976.78946999999994,824.37936999999999,5.4605100000000002,4.4605100000000002,116,146.57184000000001,146.57184000000001,0.99429000000000001,0.99429000000000001]
[null,50000094,"WB","RURAL LONG",1524,588.83978000000002,1.64794,2.6270000000000002,7.0962602321724013,1.0532586570483402,138,834.62815000000001,834.20808999999997,12.6601,12.65748,114,123.87924,122.80838,0.59185999999999994,0.58923999999999999]
[null,50000095,"WB","RURAL LONG",1424,253.61457000000001,7.1027499999999995,3.161,2.2735543420075515,1.3820280927301529,64,271.52093000000002,191.85269,3.5400299999999998,3.2900299999999998,111,165.04973999999999,165.04973999999999,0.72121000000000002,0.72121000000000002]
[null,50000096,"WB","URBAN",943,11.412329999999999,1.4854000000000001,4.9279999999999999,3.1658294143612413,2.1417799018528125E-2,16,173.98921999999999,173.98921999999999,3.78261,3.78261,12,1.17709,1.17709,3.2869999999999996E-2,3.2869999999999996E-2]
[null,50000108,"WB","RURAL SHORT",1417,41.55115,3.60283,3.4910000000000001,3.9368738444500346,4.022183260101541E-2,27,526.62635999999998,97.324379999999991,2.1693699999999998,1.16161,30,5.3803799999999997,5.3803799999999997,7.0569999999999994E-2,7.0569999999999994E-2]
[null,50000109,"WB","RURAL SHORT",1057,48.349829999999997,0.49623,2.8740000000000001,2.940763740015869,0.18010511854000133,24,299.77483000000001,190.76657,1.2090799999999999,1.1021799999999999,28,18.35951,18.35951,0.12298999999999999,0.12298999999999999]
[null,50000110,"WB","URBAN",497,2.6699699999999997,2.84544,4.7520000000000007,0.15882690545773698,1.4480978649645133,9,4.4108000000000001,4.4108000000000001,2.4139999999999998E-2,2.4139999999999998E-2,8,40.215289999999996,33.734409999999997,0.17504999999999998,0.11267999999999999]
[null,50000111,"WB","URBAN",1069,4.9239299999999995,0.78600000000000003,4.0979999999999999,2.4411771930297432E-2,0.26949640448362677,15,1.3792499999999999,0.90927999999999998,1.6840000000000001E-2,1.2159999999999999E-2,13,15.226379999999999,15.2217,0.23948,0.23854]
[null,50000112,"WB","URBAN",1,0,7.5079999999999994E-2,2.0230000000000001,0,0,"",0,0,0,0,"",0,0,0,0]
[null,50000113,"WB","RURAL SHORT",810,64.361639999999994,0.77970000000000006,3.4570000000000003,1.3817804594691701,0.17153479153256068,23,125.0973,82.365139999999997,1.2963,1.2370399999999999,17,15.529629999999999,15.529629999999999,8.2720000000000002E-2,8.2720000000000002E-2]
[null,50000116,"WB","RURAL SHORT",238,183.43597,0.14610000000000001,0.84800000000000009,5.4024481113588427,1.1522454059634579,44,451.54622000000001,451.54622000000001,7.5798299999999994,7.5798299999999994,23,96.306719999999999,96.306719999999999,0.74370000000000003,0.74370000000000003]
[null,50000117,"WB","RURAL LONG",285,304.98678000000001,0.15314,1.6560000000000001,38.267631929299441,9.8331089686372763,87,1863.80251,1724.5066099999999,9.8000000000000007,9.4912299999999998,98,478.91579000000002,478.75088,2.5473699999999999,2.54386]
[null,50000118,"WB","RURAL LONG",395,229.98146,0.18051,1.7650000000000001,40.853148386946572,4.4172682393966198,52,1941.5373400000001,1893.2337600000001,9.187339999999999,8.1316500000000005,68,209.92975000000001,209.36013,1.33924,1.3265799999999999]
[null,50000120,"WB","RURAL SHORT",488,13.48706,0.10865999999999999,2.5580000000000003,4.2149565517281857,8.6028428302466747E-3,27,295.04255000000001,295.04255000000001,7.4569700000000001,7.4569700000000001,12,0.60219,0.60219,2.4589999999999997E-2,2.4589999999999997E-2]
[null,50000124,"WB","RURAL SHORT",1258,147.55696,0.76912999999999998,2.8860000000000001,2.0272112887034406,0.56260086796548125,56,245.01632000000001,242.47609,3.66852,3.62798,61,67.998040000000003,67.998040000000003,0.39030000000000004,0.39030000000000004]
[null,50000125,"WB","RURAL LONG",742,315.64515,5.2729999999999999E-2,2.2170000000000001,3.6642074391114785,0.23456025860306687,83,391.78217000000001,376.49775,4.6320800000000002,4.2102399999999998,16,25.079509999999999,25.0593,0.21159,0.21023999999999998]
[null,50000126,"WB","RURAL SHORT",850,11.5106,0.18753999999999998,2.548,0.90087461844657035,0.79463628707313483,18,84.362839999999991,84.362839999999991,2.0011799999999997,2.0011799999999997,112,74.414100000000005,74.31410000000001,0.34823999999999999,0.34470999999999996]
[null,50000127,"WB","RURAL LONG",820,310.07103999999998,0.70857999999999999,2.0569999999999999,5.0301182948218806,0.24948804090047627,62,408.93455,408.93455,4.24756,4.24756,88,20.282679999999999,20.282679999999999,0.27194999999999997,0.27194999999999997]
[null,50000128,"WB","RURAL SHORT",143,27.242339999999999,0.13936999999999999,0.40500000000000003,1.2765832369964849,1.1067582089552238E-3,10,161.32062999999999,161.32062999999999,3.6993,3.6993,1,0.13985999999999998,0.13985999999999998,6.9899999999999997E-3,6.9899999999999997E-3]
[null,50000129,"WB","RURAL SHORT",698,136.58305000000001,7.0649999999999991E-2,1.0130000000000001,1.3297056357758572,0.44220704398158567,24,227.815,226.95826,5.1375399999999996,5.1318099999999998,38,75.762180000000001,75.762180000000001,0.32234999999999997,0.32234999999999997]
[null,50000130,"WB","RURAL LONG",688,267.93473999999998,0.24231,2.29,7.3135651323398605,5.3978387999889588,83,548.98204999999996,547.48760000000004,6.6991299999999994,6.6918599999999993,86,405.18086,401.45411999999999,1.8314000000000001,1.8168599999999999]
[null,50000133,"WB","RURAL LONG",181,236.35946000000001,0.18489,0.19,60.672575941451726,6.4332440417053203,41,3133.5745900000002,626.88627999999994,8.0331499999999991,6.1326000000000001,3,332.25967000000003,332.25967000000003,1.1326000000000001,1.1326000000000001]
[null,50000137,"WB","RURAL SHORT",313,63.060559999999995,1.07775,3.044,2.3808865490045688,4.5343576919506869,23,136.69111000000001,22.799949999999999,2.1405799999999999,0.14057999999999998,13,260.32587999999998,260.32587999999998,2.2076699999999998,2.2076699999999998]
[null,50000138,"WB","RURAL SHORT",1306,71.693640000000002,3.92889,3.0680000000000001,5.0351302482669187,2.3993858040205454,63,559.42778999999996,72.566549999999992,4.1217499999999996,1.0612599999999999,24,266.58359000000002,266.58359000000002,2.1255699999999997,2.1255699999999997]
[null,50000139,"WB","RURAL SHORT",913,81.016570000000002,1.2229399999999999,2.556,3.9632093130658621,1.7364617218124139E-2,53,455.8784,95.961370000000002,4.09748,1.1150100000000001,21,1.9974099999999999,1.9974099999999999,3.943E-2,3.943E-2]
[null,50000140,"WB","RURAL SHORT",1151,46.225839999999998,3.4247799999999997,2.694,1.4305180388700967,2.1642714517013089E-2,38,152.06336999999999,8.3302300000000002,2.0443099999999998,4.7779999999999996E-2,26,2.3006099999999998,2.3006099999999998,2.954E-2,2.954E-2]
[null,50000142,"WB","RURAL SHORT",1323,39.797049999999999,0.33594999999999997,2.7560000000000002,3.6442000920035502,1.1722109374473435,36,380.83002999999997,303.05462,4.2131499999999997,3.2124000000000001,32,122.49961999999999,107.85941,0.59334999999999993,0.52683000000000002]
[null,50000143,"WB","RURAL SHORT",441,140.29570000000001,7.1129999999999999E-2,0.64900000000000002,4.3517287118879313,4.6193188578494935,30,663.20446000000004,662.96663000000001,4.13605,4.1337899999999994,46,703.98526000000004,703.98526000000004,3.3378699999999997,3.3378699999999997]
[null,50000144,"WB","RURAL SHORT",1043,151.78448,0.24221999999999999,1.651,1.4670503401991093,0.87727182519936897,64,213.03622999999999,213.03622999999999,4.0843699999999998,4.0843699999999998,11,127.39214,127.39214,0.372,0.372]
[null,50000145,"WB","RURAL LONG",594,200.14057,0.17038,1.399,21.13774442572419,3.5741212139446228,60,204.79348999999999,204.53171,2.6649799999999999,2.6616200000000001,61,34.627949999999998,34.493269999999995,0.26599,0.25757999999999998]
[null,50000148,"WB","RURAL SHORT",494,185.12177,4.6829999999999997E-2,1.0620000000000001,2.7646281810098055,0.2505129581403685,22,404.62837000000002,212.27564000000001,2.82389,2.7024299999999997,20,36.664839999999998,36.664839999999998,0.18825999999999998,0.18825999999999998]
[null,50000149,"WB","RURAL SHORT",278,82.027909999999991,5.7529999999999998E-2,1.7710000000000001,3.6534080915362841,0.13227703291388651,29,159.73855,158.84118999999998,1.3992799999999999,1.39568,12,5.7835700000000001,5.7835700000000001,9.7119999999999998E-2,9.7119999999999998E-2]
[null,50000150,"WB","RURAL SHORT",732,152.21494999999999,0.70982999999999996,1.2010000000000001,2.5372375641836316,1.1962038725135296,51,352.01144999999997,96.682289999999995,2.2472699999999999,1.7431699999999999,25,165.95902000000001,165.95902000000001,0.58879999999999999,0.58879999999999999]
[null,50000151,"WB","RURAL SHORT",381,75.395669999999996,3.0959999999999998E-2,1.9370000000000001,14.273858478060108,0.19956852322578589,32,810.58835999999997,177.14798999999999,2.9396299999999997,2.1548599999999998,17,11.333159999999999,11.333159999999999,7.8739999999999991E-2,7.8739999999999991E-2]
[null,50000153,"WB","RURAL SHORT",974,27.21818,11.993219999999999,5.3820000000000006,8.8826700427720631E-2,0.72985273404942774,17,5.6330399999999994,5.5459100000000001,5.5439999999999996E-2,5.339E-2,72,46.284389999999995,46.284389999999995,0.15914,0.15914]
[null,50000154,"WB","RURAL SHORT",1377,121.69242,7.3451000000000004,3.1040000000000001,2.3567062940308721,0.35225200116937455,21,221.55081000000001,221.55081000000001,1.0755299999999999,1.0755299999999999,23,33.114739999999998,33.114739999999998,0.12781000000000001,0.12781000000000001]
[null,50000155,"WB","URBAN",398,3.8768000000000002,3.0649899999999999,4.0449999999999999,0.87761213126243998,0.3386431049230253,3,29.093129999999999,29.093129999999999,0.99748999999999999,0.99748999999999999,37,11.226129999999999,11.226129999999999,0.23618,0.23618]
[null,50000156,"WB","RURAL SHORT",64,1.6567000000000001,1.7925599999999999,1,0.57407133287210343,4.3964074831000295E-2,3,5.7127599999999994,5.7127599999999994,4.6879999999999998E-2,4.6879999999999998E-2,3,0.4375,0.29687999999999998,4.6879999999999998E-2,3.125E-2]
[null,50000159,"WB","RURAL LONG",607,202.01187999999999,0,0.86299999999999999,3.4967826383314975,9.5245904228556902E-2,57,567.33103000000006,455.37056999999999,9.5156499999999991,8.5189500000000002,9,15.453049999999999,15.453049999999999,0.22075999999999998,0.22075999999999998]
[null,50000160,"WB","RURAL LONG",285,279.52026999999998,0,0.57900000000000007,8.0599488744591188,3.0447450789869754,54,937.14356999999995,825.88742999999999,9.7087699999999995,8.6947399999999995,7,354.01754,354.01754,1.40351,1.40351]
[null,50000161,"WB","RURAL SHORT",96,77.377020000000002,0,1.4E-2,4.1194042029116682,2.7044654873014564,20,685.33853999999997,573.04687999999999,9.0416699999999999,8.0208300000000001,7,449.9375,449.9375,2.1979199999999999,2.1979199999999999]
[null,50000165,"WB","URBAN",517,5.0132099999999999,1.27719,3.7830000000000004,4.0697159818511202E-3,3.3314966687791284E-2,4,0.49406999999999995,0.49406999999999995,7.7399999999999995E-3,7.7399999999999995E-3,19,4.0444899999999997,4.0444899999999997,5.2219999999999996E-2,5.2219999999999996E-2]
[null,50000166,"WB","URBAN",793,4.7673100000000002,0.63363000000000003,2.8860000000000001,1.6097513934468018E-2,0.16546048754715414,8,1.0628199999999999,1.0628199999999999,1.009E-2,1.009E-2,23,10.924339999999999,10.924339999999999,8.4489999999999996E-2,8.4489999999999996E-2]
[null,50000167,"WB","URBAN",1728,12.36617,0.65616999999999992,4.1260000000000003,0.22366251251355515,0.42505429418830337,25,21.122809999999998,20.84778,0.10994999999999999,0.10822,322,40.142359999999996,40.142359999999996,0.39524999999999999,0.39524999999999999]
[null,50000168,"WB","RURAL SHORT",375,33.735859999999995,1.6593399999999998,3.6550000000000002,2.3426778845962226,0.12735256965770034,12,108.26191,100.99507,1.05067,1.0453299999999999,35,5.8853299999999997,5.8853299999999997,9.3329999999999996E-2,9.3329999999999996E-2]
[null,50000169,"WB","RURAL SHORT",1809,12.876339999999999,0.42235,3.012,1.1756494101060926,9.3025460689231038E-2,35,155.44163,154.94596000000001,2.2155899999999997,2.2117199999999997,109,12.299609999999999,11.70426,0.14316999999999999,0.13764999999999999]
[null,50000170,"WB","RURAL SHORT",1566,48.249220000000001,0.58556999999999992,2.528,2.1683507002769167,0.38838681275153508,32,323.92261999999999,200.64212000000001,1.43614,1.2682,143,58.019800000000004,58.000639999999997,0.28032999999999997,0.27968999999999999]
[null,50000173,"WB","RURAL SHORT",249,7.6250299999999998,1.8747399999999999,1.58,4.0029913820273704,0.41460088939241913,9,209.50295,11.43347,2.0923699999999998,7.6310000000000003E-2,28,21.698800000000002,21.698800000000002,0.25301000000000001,0.25301000000000001]
[null,50000174,"WB","RURAL SHORT",514,67.965919999999997,1.0596699999999999,2.3820000000000001,7.7560264547625168,0.89937720117519104,32,739.27895999999998,385.63531,3.9844399999999998,1.48638,54,85.725679999999997,85.725679999999997,0.52334999999999998,0.52334999999999998]
[null,50000175,"WB","RURAL SHORT",500,46.608909999999995,1.3421799999999999,2.1470000000000002,1.3739868253918437,0.80430498485989788,19,112.52170000000001,21.6799,1.44,0.434,71,65.868000000000009,65.868000000000009,0.45,0.45]
[null,50000177,"WB","RURAL SHORT",313,91.102919999999997,0.31624999999999998,2.5150000000000001,16.596713944686996,1.0890484991851492,46,744.16214000000002,380.15276999999998,4.5079899999999995,3.58466,38,48.830669999999998,48.830669999999998,0.36102000000000001,0.36102000000000001]
[null,50000178,"WB","URBAN",1039,7.8523799999999992,1.17675,2.9530000000000003,8.5881345896878111E-2,0.34096857926310575,22,11.07541,11.07156,0.20693,0.20596999999999999,139,43.971910000000001,43.971910000000001,0.25986999999999999,0.25986999999999999]
[null,50000179,"WB","RURAL SHORT",302,30.891409999999997,0.52680000000000005,1.147,6.6601614595594612,2.9827157177571615,25,768.25893999999994,365.55727999999999,4.0894000000000004,2.0893999999999999,34,344.06043,343.65755999999999,1.4702000000000002,1.4635799999999999]
[null,50000180,"WB","RURAL SHORT",1354,59.058300000000003,6.2992799999999995,3.121,4.5138559967216425,0.85118631828987412,28,376.81810999999999,358.83503999999999,5.2208299999999994,4.5834599999999996,84,71.057299999999998,71.057299999999998,0.49482999999999999,0.49482999999999999]
[null,50000184,"WB","RURAL SHORT",284,103.10160999999999,2.495E-2,1.4790000000000001,17.781288568100361,1.5015219757240539,28,1806.43228,1337.97406,7.5598599999999996,6.5422500000000001,11,152.54225,152.54225,0.61971999999999994,0.61971999999999994]
[null,50000185,"WB","RURAL SHORT",766,77.151800000000009,0.12739,2.62,6.2306284435711605,0.20792442554846174,28,489.28030999999999,124.25006999999999,3.3668399999999998,1.9282000000000001,13,16.327939999999998,16.301829999999999,7.5719999999999996E-2,7.440999999999999E-2]
[null,50000186,"WB","RURAL SHORT",73,20.5139,2.495E-2,0.44,7.332038694493157,0.11425471408454912,13,720.84474999999998,587.52008999999998,2.3013699999999999,1.2876699999999999,9,11.23288,11.23288,0.15067999999999998,0.15067999999999998]
[null,50000187,"WB","RURAL SHORT",583,108.66001,0.13241999999999998,1.5570000000000002,0.24456857297155851,1.3216093029004448E-2,22,27.424759999999999,20.962260000000001,1.08748,1.0325899999999999,29,1.4819899999999999,1.4819899999999999,4.9739999999999999E-2,4.9739999999999999E-2]
[null,50000192,"WB","URBAN",1481,6.6448899999999993,1.2950199999999998,2.91,0.22696604043757962,0.47333096728797186,24,26.34057,14.457100000000001,0.19378999999999999,0.1391,42,54.932479999999998,54.932479999999998,0.42065999999999998,0.42065999999999998]
[null,50000193,"WB","RURAL SHORT",1761,6.7739399999999996,3.8350899999999997,2.8610000000000002,3.1102851814793723E-2,2.6745745842179067E-2,33,4.6377600000000001,4.5892799999999996,8.6879999999999999E-2,8.5749999999999993E-2,45,3.98807,3.9375399999999998,3.6909999999999998E-2,3.4069999999999996E-2]
[null,50000194,"WB","RURAL SHORT",1667,7.5947000000000005,4.9953500000000002,3.5310000000000001,0.58364227339566654,0.19834943639401797,41,58.29036,58.29036,1.1121799999999999,1.1121799999999999,32,19.809839999999998,19.806839999999998,0.26815,0.26755000000000001]
[null,50000195,"WB","URBAN",1707,6.0104600000000001,0.83074999999999999,3.4970000000000003,0.52650581919886053,2.310721021647813E-2,28,52.965679999999999,52.909909999999996,1.0128899999999998,1.01172,62,2.3245499999999999,1.6889299999999998,0.12126999999999999,0.11892]
[null,50000196,"WB","RURAL SHORT",1939,14.178329999999999,8.5889600000000002,3.6970000000000001,0.52694545983705177,0.17952535609525103,22,66.501750000000001,64.310490000000001,1.1444000000000001,1.1093299999999999,39,22.65652,22.643629999999998,0.22175999999999998,0.21970000000000001]
[null,50000204,"WB","URBAN",733,5.7200099999999994,5.4200699999999999,2.6360000000000001,2.1063441420555121E-2,0.51628937257976459,10,1.0789,0.94300000000000006,1.3639999999999999E-2,1.2279999999999999E-2,21,26.44509,26.421900000000001,0.28648999999999997,0.28512999999999999]
[null,50000205,"WB","URBAN",318,1.3281499999999999,0.18783999999999998,1.671,2.1043659253464523E-2,1.4823579089602074E-2,3,0.83479999999999999,0.83479999999999999,9.4299999999999991E-3,9.4299999999999991E-3,5,0.58804999999999996,0.58804999999999996,6.2890000000000001E-2,6.2890000000000001E-2]
[null,50000206,"WB","URBAN",1010,8.4341899999999992,2.2253699999999998,4.1459999999999999,4.2521864753266474,8.993999447581956E-2,14,247.20314999999999,161.12180000000001,3.05545,2.0564399999999998,9,5.2287099999999995,5.2287099999999995,2.673E-2,2.673E-2]
[null,50000207,"WB","URBAN",55,3.0559699999999999,0.28108,5.194,0.21768488839188438,0,1,3.0427299999999997,3.0427299999999997,1.8179999999999998E-2,1.8179999999999998E-2,"",0,0,0,0]
[null,50000208,"WB","RURAL SHORT",1672,17.23038,1.6121399999999999,3.7150000000000003,0.60782360181474404,0.12533395330352587,23,61.716809999999995,61.669469999999997,1.0645899999999999,1.0640000000000001,32,12.72608,12.72608,0.14951999999999999,0.14951999999999999]
[null,50000209,"WB","RURAL SHORT",1005,5.5996199999999998,0.12010999999999999,1.6020000000000001,0.41262930036320239,3.0140002589069598E-2,19,51.408760000000001,1.63073,1.00299,1.891E-2,19,3.75509,3.75509,3.7809999999999996E-2,3.7809999999999996E-2]
[null,50000211,"WB","RURAL SHORT",2742,47.910299999999999,4.4096000000000002,5.3810000000000002,1.3839786994522838,0.1044130170155647,49,192.5162,29.842579999999998,3.3880399999999997,1.3687099999999999,47,14.52421,14.371039999999999,6.4919999999999992E-2,6.3089999999999993E-2]
[null,50000212,"WB","URBAN",257,2.4113899999999999,0.83273999999999992,2.081,4.8952881850509132E-2,0.20737653093414929,4,1.8655000000000002,1.5773000000000001,1.5559999999999999E-2,1.167E-2,4,7.9027199999999995,7.9027199999999995,0.14007999999999998,0.14007999999999998]
[null,50000213,"WB","URBAN",470,3.70486,0.65786999999999995,3.5780000000000003,2.8975290441424679E-2,0.17296651430673152,6,1.2726199999999999,1.2726199999999999,1.277E-2,1.277E-2,20,7.5968399999999994,7.5968399999999994,0.10851,0.10851]
[null,50000214,"WB","URBAN",478,4.9282399999999997,1.1910000000000001,5.2370000000000001,0.7265661931034314,0.22606123126747069,8,33.825029999999998,33.825029999999998,0.33472999999999997,0.33472999999999997,11,10.5242,10.5242,0.12761999999999998,0.12761999999999998]
[null,50000229,"WB","RURAL LONG",1534,316.63000999999997,0,2.8340000000000001,3.590569283783239,1.4247283458299251,73,490.49124,480.27512999999999,4.2607599999999994,4.1668799999999999,101,194.62562,194.57346999999999,0.79660999999999993,0.79335]
[null,50000230,"WB","RURAL SHORT",203,129.58403999999999,9.0500000000000011E-2,0.22900000000000001,5.7841979668031067,5.5316970556150897,30,678.60378000000003,678.60378000000003,4.7832499999999998,4.7832499999999998,55,648.98030000000006,648.88176999999996,2.3004899999999999,2.2955700000000001]
[null,50000232,"WB","RURAL SHORT",791,65.719920000000002,0.74521999999999999,2.5470000000000002,10.138339630687277,0.71663368875727285,34,925.55760999999995,729.57811000000004,9.4096099999999989,6.3843199999999998,15,65.423509999999993,65.423509999999993,0.33627999999999997,0.33627999999999997]
[null,50000233,"WB","RURAL SHORT",368,177.24725000000001,9.8650000000000002E-2,1.361,18.220585815966245,5.5541548844217754,70,1666.57591,1466.39348,13.09511,9.7934799999999989,46,508.01992999999999,507.96014000000002,1.9103299999999999,1.9076099999999998]
[null,50000234,"WB","RURAL SHORT",354,108.72161,0.29039999999999999,1.8240000000000001,25.031091453501102,10.14485249315765,28,1472.70499,411.60131999999999,8.63842,4.8502799999999997,22,596.87269000000003,596.87269000000003,2.1610199999999997,2.1610199999999997]
[null,50000235,"WB","RURAL SHORT",339,186.21764999999999,0.15745999999999999,1.7310000000000001,9.9356171164096132,2.1309579846903395,34,681.07610999999997,459.29897,9.4247800000000002,6.1032399999999996,10,146.07492999999999,146.07492999999999,0.54571999999999998,0.54571999999999998]
[null,50000236,"WB","RURAL LONG",838,328.42189000000002,0.15237000000000001,1.637,6.2496361157946962,0.19744996595518685,156,899.41569000000004,704.23616000000004,8.5525099999999998,5.5238699999999996,52,28.415989999999997,28.415989999999997,0.23865999999999998,0.23865999999999998]
[null,50000238,"WB","RURAL SHORT",57,30.198400000000003,8.1489999999999993E-2,0.27300000000000002,1.366026993372752,1.6066437600997785,12,171.84620000000001,171.84620000000001,2.4386000000000001,2.4386000000000001,2,202.11579,202.11579,1.17544,1.17544]
[null,50000239,"WB","RURAL SHORT",391,5.5967599999999997,0.14868000000000001,1.4930000000000001,1.1685969078692571,1.8416053915859174,9,93.051490000000001,93.051490000000001,1.9872099999999999,1.9872099999999999,7,146.64091999999999,146.64091999999999,0.80050999999999994,0.80050999999999994]
[null,50000240,"WB","RURAL LONG",1497,206.15575999999999,0.18206,2.258,2.5805192346668377,1.5459908335967907,95,376.18732,357.00479999999999,4.8877799999999993,4.6599899999999996,23,225.37407999999999,222.39479,1.2117599999999999,1.1984000000000001]
[null,50000241,"WB","RURAL LONG",500,245.89255,7.5229999999999991E-2,0.69100000000000006,1.9247014143201713,2.519235765334535,55,303.17223000000001,303.17223000000001,3.0780000000000003,3.0780000000000003,27,396.82120000000003,396.82120000000003,1.9220000000000002,1.9220000000000002]
[null,50011904,"WB","RURAL SHORT",3,1.7674599999999998,0.12620000000000001,2.8000000000000001E-2,1.4991833926151761,3.6835059311876939,4,198.1,198.1,4,4,2,486.73333000000002,486.73333000000002,2,2]
[null,50080258,"WB","URBAN",1,2.179E-2,2.828E-2,6.0129999999999999,9200.5698678479439,0,1,188.21666999999999,0,1,0,"",0,0,0,0]
[null,50080259,"WB","RURAL SHORT",1026,63.067609999999995,1.9312099999999999,2.2840000000000003,1.6803544201862287E-2,0.14800287140533619,11,1.3888699999999998,1.3888699999999998,1.072E-2,1.072E-2,10,12.232939999999999,12.232939999999999,5.3609999999999998E-2,5.3609999999999998E-2]
[null,50080424,"WB","RURAL SHORT",128,2.37561,3.4380599999999997,1.5210000000000001,0,0.2978165594611073,"",0,0,0,0,1,8.0078099999999992,8.0078099999999992,3.9059999999999997E-2,3.9059999999999997E-2]
[null,50082888,"WB","RURAL SHORT",1280,9.1384600000000002,4.9642099999999996,3.5110000000000001,3.7351919657469264,0.1132467019355631,24,273.16444000000001,273.09758999999997,1.1328099999999999,1.1312499999999999,137,8.2820299999999989,8.2820299999999989,0.12031,0.12031]
[null,60026640,"SW","RURAL SHORT",401,8.5511599999999994,6.4030000000000004E-2,1.3460000000000001,10.227828206783842,2.2335950380000122,16,822.99114999999995,822.99114999999995,8.279300000000001,8.279300000000001,15,179.72818000000001,179.1995,1.23691,1.2269299999999999]
[null,60026641,"SW","RURAL LONG",697,827.11305000000004,0.19313,4.8890000000000002,6.9503730789031541,4.1120954379259427,121,553.71896000000004,273.60746,4.1434699999999998,3.1363000000000003,107,327.60043000000002,325.69292000000002,1.6714499999999999,1.6599699999999999]
[null,60026644,"SW","RURAL LONG",320,2550.65254,0,1.2970000000000002,34.08837596143843,4.5246423546779972,108,2373.6614100000002,2371.1896900000002,9.1375000000000011,9.1312499999999996,57,315.0625,315.0625,2.1718799999999998,2.1718799999999998]
[null,60026647,"SW","RURAL SHORT",706,13.156039999999999,2.8942000000000001,2.5060000000000002,0.27144396808824728,0.23781023352547856,23,19.965339999999998,19.781939999999999,0.20680000000000001,0.20396999999999998,92,17.491500000000002,17.37819,0.22095999999999999,0.21387999999999999]
[null,60026649,"SW","URBAN",947,8.7240000000000002,1.0048900000000001,3.6620000000000004,5.4000920231763514,0.82653981450455694,29,297.91980000000001,297.91980000000001,2.1520600000000001,2.1520600000000001,37,45.599700000000006,45.540569999999995,0.22913999999999998,0.22491999999999998]
[null,60026650,"SW","RURAL LONG",570,1137.5266899999999,3.074E-2,2.5620000000000003,7.0448035986324564,4.4167620190036097,91,504.85041000000001,479.00680999999997,3.9771899999999998,3.91228,66,316.51756999999998,316.51756999999998,1.76667,1.76667]
[null,60026651,"SW","URBAN",118,1.2437399999999998,0.87483,2.1390000000000002,2.9069436347481353E-2,0.29264455347294294,1,0.71638000000000002,0.71638000000000002,8.4700000000000001E-3,8.4700000000000001E-3,8,7.2118599999999997,7.2118599999999997,8.4749999999999992E-2,8.4749999999999992E-2]
[null,60026652,"SW","RURAL SHORT",717,62.060359999999996,1.7682,2.1179999999999999,0.34466596263905042,2.0162945996570921E-2,31,32.805320000000002,32.478149999999999,0.25105,0.24686,46,1.9191099999999999,1.9191099999999999,6.9739999999999996E-2,6.9739999999999996E-2]
[null,60026656,"SW","RURAL SHORT",64,64.339449999999999,0,0.67500000000000004,16.524365622653139,20.662047276389337,13,710.91588999999999,710.91588999999999,6.625,6.625,4,888.92839000000004,888.92839000000004,3.0156299999999998,3.0156299999999998]
[null,60026657,"SW","RURAL SHORT",147,136.75612999999998,0,0.48800000000000004,2.8503498667120866,1.684772708598173,12,267.33991000000003,53.9754,2.0068000000000001,0.30612,12,158.01813999999999,158.01813999999999,0.57142999999999999,0.57142999999999999]
[null,60026658,"SW","RURAL SHORT",66,109.68705,0,0.153,4.1623484710629324,6.5644925427348486,9,341.9452,91.028539999999992,2.6818200000000001,0.68181999999999998,25,539.28611000000001,537.31641000000002,2.3333299999999997,2.3181799999999999]
[null,60026660,"SW","RURAL SHORT",1148,22.311519999999998,2.54291,2.6220000000000003,1.8942378868548415,8.0015983605485425E-2,31,240.27940000000001,240.27940000000001,2.2108000000000003,2.2108000000000003,10,10.14983,10.14983,5.0519999999999995E-2,5.0519999999999995E-2]
[null,60026662,"SW","RURAL LONG",212,583.74918000000002,0,0.75,19.328568681384446,4.1342228379014045,57,1798.69623,1546.59599,8.594339999999999,6.5849099999999998,7,384.72641999999996,384.72641999999996,1.2688699999999999,1.2688699999999999]
[null,60026666,"SW","RURAL LONG",1434,3095.11672,0.42266999999999999,4.7050000000000001,9.5231890473910585,0.73681732370305197,299,686.86635000000001,682.81601999999998,4.6673599999999995,4.6311,71,53.143439999999998,53.143439999999998,0.37726999999999999,0.37726999999999999]
[null,60026667,"SW","RURAL LONG",1133,1636.84303,0.31417999999999996,4.4169999999999998,12.141762516166006,1.7701621926187132,161,963.47834999999998,941.25501999999994,9.7034399999999987,9.6460699999999999,77,140.46666999999999,140.46666999999999,0.56133999999999995,0.56133999999999995]
[null,60026669,"SW","RURAL SHORT",156,169.38455999999999,0.83640999999999999,5.5609999999999999,15.780177282359773,0.71306491883266399,33,1262.82329,1262.82329,10.41667,10.41667,5,57.063679999999998,57.063679999999998,0.18590000000000001,0.18590000000000001]
[null,60026670,"SW","RURAL LONG",714,1010.94831,0.50312999999999997,2.9650000000000003,9.0111741135376882,2.0275806350835044,131,1048.1698200000001,1005.30728,8.558819999999999,8.4551800000000004,103,235.84593999999998,235.54622000000001,1.03922,1.03782]
[null,60026671,"SW","RURAL SHORT",254,3.34361,0.44481999999999999,0.90200000000000002,7.0894641171903343,2.7042402512835791E-3,15,639.90886,639.90886,9.0078699999999987,9.0078699999999987,2,0.24409,0.24409,7.8700000000000003E-3,7.8700000000000003E-3]
[null,60026672,"SW","RURAL SHORT",210,8.1088699999999996,0.29424,0.60699999999999998,5.4677971880607261,0,17,579.93705999999997,579.93705999999997,7.9333299999999998,7.9333299999999998,"",0,0,0,0]
[null,60026673,"SW","RURAL SHORT",52,154.63103000000001,0.21848999999999999,1.139,36.353906745755616,3.9037107495347473E-2,10,465.63269000000003,462.20576999999997,3.5384599999999997,3.5192299999999999,3,0.5,0.5,5.7689999999999998E-2,5.7689999999999998E-2]
[null,60026674,"SW","RURAL SHORT",25,8.7656600000000005,0.24245999999999998,0,1.4171048739887815,1.126504424778761,6,139.48333,139.48333,6,6,1,110.88,110.88,0.36,0.36]
[null,60026675,"SW","RURAL LONG",416,981.62675000000002,0.50773000000000001,6.9820000000000002,16.725900206153135,6.1851114230790198,86,942.98501999999996,942.87684000000002,9.3581699999999994,9.35337,45,348.70873,348.70873,1.18269,1.18269]
[null,60026676,"SW","RURAL LONG",383,1573.95137,0.40803999999999996,8.1150000000000002,27.398813311423524,14.026944242459738,71,678.21806000000004,678.21806000000004,9.6161899999999996,9.6161899999999996,59,347.21674999999999,347.21674999999999,2.29765,2.29765]
[null,60026677,"SW","RURAL SHORT",767,21.476329999999997,1.5850899999999999,4.5550000000000006,4.9624402991573016,8.1060719149703822E-2,33,240.08607000000001,197.17577,9.1316799999999994,8.1290700000000005,10,3.92177,3.76532,3.39E-2,3.2590000000000001E-2]
[null,60026678,"SW","RURAL SHORT",1110,23.171019999999999,3.1114099999999998,2.9710000000000001,2.6003276667766766,9.9863010111148537E-2,42,257.97332,213.63279,8.2216199999999997,7.2324299999999999,12,9.9072099999999992,9.9072099999999992,4.8649999999999999E-2,4.8649999999999999E-2]
[null,60026680,"SW","RURAL SHORT",147,17.309549999999998,1.529E-2,1.0510000000000002,1.2903648092612787,0.61454684603662191,12,111.59841,111.59841,6.1428599999999998,6.1428599999999998,5,53.149659999999997,53.149659999999997,0.31972999999999996,0.31972999999999996]
[null,60026681,"SW","RURAL SHORT",43,40.566949999999999,1.0023599999999999,0.45500000000000002,23.662060465469288,25.441217766939374,14,855.61202000000003,855.61202000000003,6.1627899999999993,6.1627899999999993,5,919.94574,919.94574,3.2093000000000003,3.2093000000000003]
[null,60026682,"SW","RURAL LONG",160,229.27,0.14074,1.871,7.1601805508121439,6.1453993504623536,36,682.57760000000007,682.57760000000007,4.8937499999999998,4.8937499999999998,32,585.83884999999998,585.83884999999998,2.3250000000000002,2.3250000000000002]
[null,60026685,"SW","URBAN",213,3.31643,0.12841,1.46,2.4403010475242932,0.78545728951698501,8,66.717140000000001,66.717140000000001,0.34271999999999997,0.34271999999999997,15,21.47418,21.47418,0.12207,0.12207]
[null,60026686,"SW","RURAL SHORT",180,17.244709999999998,2.4010000000000002,1.373,0.81526274708893898,2.264052730086915E-2,8,33.408429999999996,33.408429999999996,0.35000000000000003,0.35000000000000003,6,0.92777999999999994,0.92777999999999994,3.3329999999999999E-2,3.3329999999999999E-2]
[null,60026687,"SW","RURAL SHORT",611,10.18216,0.31849,2.8720000000000003,0.88655968253355288,8.7956821108834266E-3,9,92.876429999999999,92.876429999999999,0.99673,0.99673,24,0.92143999999999993,0.92143999999999993,3.9279999999999995E-2,3.9279999999999995E-2]
[null,60026688,"SW","RURAL SHORT",879,17.843730000000001,0.74771999999999994,3.3340000000000001,2.814843272906618,0.10965246536615228,38,274.19936000000001,274.04415999999998,2.1968099999999997,2.1956799999999999,38,10.68146,10.68146,7.3950000000000002E-2,7.3950000000000002E-2]
[null,60026690,"SW","URBAN",348,6.95749,0.61876999999999993,2.335,3.7344407838152565,0.76294376743874703,10,201.88147000000001,201.88147000000001,1.41954,1.41954,10,41.244250000000001,41.244250000000001,0.18103,0.18103]
[null,60026691,"SW","RURAL SHORT",718,6.38774,0.56253999999999993,0.441,2.3368196940122177,8.5527574374621718E-3,19,173.14213000000001,173.14213000000001,1.6754899999999999,1.6754899999999999,23,0.63370000000000004,0.63370000000000004,3.3430000000000001E-2,3.3430000000000001E-2]
[null,60026692,"SW","RURAL SHORT",561,40.181699999999999,1.24075,1.9430000000000001,1.5032055821925163,0.20019421147728528,12,119.22964999999999,119.22964999999999,1.1497299999999999,1.1497299999999999,41,15.878789999999999,15.878789999999999,0.14082,0.14082]
[null,60026693,"SW","RURAL SHORT",236,6.1558899999999994,2.1059999999999999E-2,1.052,5.2384108474949294,0.27112696538410569,9,409.50445000000002,409.50445000000002,3.9237299999999999,3.9237299999999999,2,21.19492,21.19492,0.22880999999999999,0.22880999999999999]
[null,60026694,"SW","RURAL SHORT",306,39.442639999999997,5.9269999999999996E-2,0.86199999999999999,5.472941247965962,0.46657131693763465,27,476.51029,476.51029,4.3300700000000001,4.3300700000000001,14,40.622769999999996,40.622769999999996,0.26796999999999999,0.26796999999999999]
[null,60026695,"SW","RURAL SHORT",18,8.0547299999999993,0,0.54100000000000004,17.382648166448654,8.3450650829497146,4,410.11667,410.11667,4,4,2,196.88889,196.88889,1,1]
[null,60026696,"SW","RURAL LONG",178,883.91230000000007,0,0.68400000000000005,10.772198056822681,2.9351325273721529,52,874.42967999999996,874.42967999999996,7.6629199999999997,7.6629199999999997,24,238.25843,238.25843,1.22472,1.22472]
[null,60026697,"SW","RURAL SHORT",604,18.875629999999997,0.50022999999999995,2.855,8.4436123201484428,1.7749085272307175,20,476.34317999999996,476.34317999999996,3.6225199999999997,3.6225199999999997,20,100.13079,100.13079,0.43708999999999998,0.43708999999999998]
[null,60026698,"SW","URBAN",500,3.8200799999999999,2.6510400000000001,3.4860000000000002,6.1023864216098442E-2,0.44247892515458087,3,2.3657699999999999,2.3657699999999999,5.2000000000000005E-2,5.2000000000000005E-2,7,17.154,17.154,0.20600000000000002,0.20600000000000002]
[null,60026699,"SW","RURAL SHORT",1018,22.51492,0.22713999999999998,3.101,6.1333271685575808,2.8957019652351055,47,550.62807999999995,550.62807999999995,4.7701399999999996,4.7701399999999996,63,259.96571999999998,221.87141,1.16994,1.04322]
[null,60026701,"SW","RURAL LONG",517,1463.65266,0.74883999999999995,2.8970000000000002,32.16087069937705,4.5115984735805288,105,1366.6950400000001,1363.17634,8.9767899999999994,8.9690499999999993,28,191.72301999999999,183.13500999999999,1.3771799999999998,1.2998099999999999]
[null,60026702,"SW","RURAL SHORT",148,183.67644000000001,0.59721999999999997,2.4370000000000003,40.515372784534499,1.0812131109560326,50,1675.6126099999999,1217.192,11.55405,10.53378,6,44.71622,44.71622,0.30404999999999999,0.30404999999999999]
[null,60026703,"SW","RURAL SHORT",673,155.72945999999999,0.34914999999999996,1.603,2.7492044708084857,0.6220737511768254,69,306.14163000000002,305.56947000000002,1.8454699999999999,1.8380399999999999,19,69.271919999999994,69.271919999999994,0.41752999999999996,0.41752999999999996]
[null,60026704,"SW","URBAN",746,3.7626599999999999,0.70967999999999998,4.0179999999999998,6.6947249717112703E-2,5.4696641532519415E-3,4,2.6415799999999998,2.6415799999999998,5.4959999999999995E-2,5.4959999999999995E-2,2,0.21581999999999998,0.21581999999999998,2.6800000000000001E-3,2.6800000000000001E-3]
[null,60026705,"SW","RURAL SHORT",73,86.26643,0,0.42600000000000005,2.7308285890867499,8.8634762082262664E-3,28,426.27352000000002,422.68561999999997,6.2876699999999994,6.2602699999999993,3,1.3835599999999999,1.3835599999999999,4.1100000000000005E-2,4.1100000000000005E-2]
[null,60026709,"SW","URBAN",1,0.10699,0.18873999999999999,2.3690000000000002,1.7737393301126878,2.7129583847126018,1,86.683329999999998,86.683329999999998,1,1,1,132.58332999999999,132.58332999999999,1,1]
[null,60026710,"SW","URBAN",1,0.61685999999999996,0.24804999999999999,2.456,390.32019153651549,597.0000317263889,1,86.683329999999998,86.683329999999998,1,1,1,132.58332999999999,132.58332999999999,1,1]
[null,60026711,"SW","RURAL SHORT",499,28.393629999999998,0.18048,1.2330000000000001,2.6727026249801299E-2,0.19934225229315158,8,2.77224,2.77224,2.2040000000000001E-2,2.2040000000000001E-2,39,20.67662,20.67662,0.15431,0.15431]
[null,60026712,"SW","RURAL LONG",344,351.31355000000002,0.11381999999999999,1.1640000000000001,15.725647693002397,3.0622531553813319,56,1334.3172,1071.6091100000001,8.8255800000000004,7.8081399999999999,28,259.83140000000003,259.83140000000003,1.1191899999999999,1.1191899999999999]
[null,60026713,"SW","RURAL SHORT",103,39.493500000000004,0.12065999999999999,0.442,1.6118878591916186,0.65346140307548861,15,213.49934999999999,213.49934999999999,3.65049,3.65049,6,86.552909999999997,86.552909999999997,0.66990000000000005,0.66990000000000005]
[null,60026715,"SW","RURAL SHORT",108,115.89868,0,0.57000000000000006,3.2530765741053127,0.52905991543428021,22,271.40062,271.40062,2.1018499999999998,2.1018499999999998,5,44.138889999999996,44.138889999999996,1.3333299999999999,1.3333299999999999]
[null,60026716,"SW","RURAL LONG",344,1422.14258,2.41709,1.284,13.802300151643125,2.0956063032997916,70,1129.5703000000001,1128.4747600000001,5.7441899999999997,5.7412799999999997,34,171.50290999999999,171.50290999999999,0.84011999999999998,0.84011999999999998]
[null,60026717,"SW","RURAL SHORT",838,5.7374899999999993,4.0259999999999997E-2,1.6240000000000001,0.72003410467993023,1.2119271454543721E-2,9,92.238230000000001,92.238230000000001,2.3627699999999998,2.3627699999999998,37,1.5525099999999998,1.5525099999999998,4.5349999999999994E-2,4.5349999999999994E-2]
[null,60026718,"SW","RURAL SHORT",1019,104.58677,6.3184499999999995,3.48,2.3262184581771961,1.2634527843427557,25,209.46038999999999,209.46038999999999,2.7919499999999999,2.7919499999999999,33,113.76546,113.76546,0.55347999999999997,0.55347999999999997]
[null,60026719,"SW","RURAL SHORT",0,0,0,1.9570000000000001,0,0,"",0,0,0,0,"",0,0,0,0]
[null,60026722,"SW","RURAL SHORT",134,3.2279899999999997,0.10644999999999999,0.60899999999999999,7.3415636830517714,0.99960259333139878,5,760.75684000000001,376.44639000000001,2.99254,2.00746,13,103.58208999999999,103.58208999999999,0.55969999999999998,0.55969999999999998]
[null,60026724,"SW","RURAL SHORT",650,12.335759999999999,0.22636999999999999,2.1150000000000002,4.0883864290688274,2.9770364891357894E-2,20,316.91678999999999,316.91678999999999,3.3615399999999998,3.3615399999999998,15,2.30769,2.30769,5.0769999999999996E-2,5.0769999999999996E-2]
[null,60026725,"SW","RURAL SHORT",312,186.68741,0,1.5980000000000001,9.2934949490869592,3.6734396272336478,64,1201.36159,1196.1551300000001,11.128209999999999,11.108969999999999,24,474.86217999999997,474.86217999999997,1.4102599999999998,1.4102599999999998]
[null,60026729,"SW","RURAL SHORT",774,139.88915,1.0390699999999999,4.2650000000000006,1.5323895535964933,3.2320750141857588,30,96.430880000000002,95.897849999999991,2.0607199999999999,2.0568499999999998,17,203.38943,203.38943,1.0232600000000001,1.0232600000000001]
[null,60026730,"SW","URBAN",978,8.4500499999999992,2.2828299999999997,5.7440000000000007,4.2534747236485337,8.6907918287359911E-3,21,207.68181999999999,207.68181999999999,1.3803699999999999,1.3803699999999999,15,0.42433999999999999,0.42433999999999999,1.84E-2,1.84E-2]
[null,60026731,"SW","RURAL SHORT",848,132.34054,1.0472599999999999,1.591,1.7351116632694485,0.74485546576960504,23,233.73446999999999,233.73446999999999,2.7877399999999999,2.7877399999999999,13,100.33844000000001,100.33844000000001,0.36202999999999996,0.36202999999999996]
[null,60026733,"SW","RURAL LONG",573,207.82295999999999,0.55186999999999997,1.1140000000000001,4.4869144653917798,0.38113662587567693,47,791.43025,791.05831999999998,4.0942400000000001,4.0925000000000002,17,67.227279999999993,67.227279999999993,0.30540999999999996,0.30540999999999996]
[null,60026734,"SW","RURAL LONG",682,219.18081000000001,5.65761,1.377,7.2465276271560954,0.25437120515218326,68,1105.35132,1102.9857,7.6393000000000004,7.6334299999999997,59,38.80059,38.752200000000002,0.26978999999999997,0.26393]
[null,60026735,"SW","RURAL SHORT",385,196.64375000000001,0,1.083,1.9147717432973099,1.9840187366957265,53,213.8203,213.8203,1.37662,1.37662,36,221.55303000000001,221.55303000000001,1.1792199999999999,1.1792199999999999]
[null,60026740,"SW","RURAL SHORT",2523,74.989170000000001,4.3283699999999996,5.3719999999999999,0.21951416738373425,5.4747153916779798E-2,51,27.31231,27.304309999999997,0.34204999999999997,0.34165999999999996,15,6.8117299999999998,6.8117299999999998,5.7869999999999998E-2,5.7869999999999998E-2]
[null,60026741,"SW","RURAL SHORT",133,118.66506,0.15781000000000001,1.7570000000000001,21.801056799311883,0.79070528811528129,37,696.54723999999999,694.15038000000004,5.6240600000000001,5.6090200000000001,6,25.263159999999999,24.06015,0.18045,0.16541]
[null,60026742,"SW","RURAL SHORT",172,134.11716999999999,0,0.375,1.5660010994367994,0.16472267956084188,34,289.68390999999997,286.44448,2.1104699999999998,2.0930200000000001,3,30.470929999999999,30.470929999999999,0.18604999999999999,0.18604999999999999]
[null,60026743,"SW","RURAL SHORT",84,107.63988000000001,0,0.626,15.315417169943,9.2635044117089826,31,1244.25298,1239.68552,6.9761899999999999,6.9642900000000001,18,752.58433000000002,752.58433000000002,2.2857099999999999,2.2857099999999999]
[null,60026744,"SW","RURAL SHORT",0,0,1.42666,0,0,0,"",0,0,0,0,"",0,0,0,0]
[null,60026745,"SW","RURAL SHORT",343,118.51036999999999,0.13247,0.93800000000000006,4.7097410363257701,0.43971307285673739,72,796.3569,641.57030999999995,6.6268199999999995,5.6239099999999995,7,74.349850000000004,74.349850000000004,0.31778000000000001,0.31778000000000001]
[null,60026746,"SW","URBAN",238,4.63856,3.8828199999999997,4.9110000000000005,1.2370152227350228,1.3367111712160313,8,40.49671,40.49671,0.14706,0.14706,9,43.7605,43.7605,0.22269,0.22269]
[null,60026747,"SW","RURAL LONG",620,250.53649000000001,0.92060000000000008,2.0550000000000002,8.1320055768334623,0.21652656778149923,106,1106.86301,952.27503000000002,10.248389999999999,9.25,32,29.47185,29.47185,0.2,0.2]
[null,60026749,"SW","RURAL SHORT",291,3.9472,0.17450000000000002,0.92600000000000005,4.9584974146435457,2.2973574953049174,14,436.95796000000001,436.80865,5.6048099999999996,5.6013700000000002,8,202.45017000000001,202.36426,2.1271499999999999,2.12371]
[null,60026750,"SW","RURAL SHORT",543,128.29786000000001,1.1521599999999999,1.599,4.3316320368161545,8.5274607459263404E-3,36,560.34890000000007,560.34890000000007,5.9189699999999998,5.9189699999999998,15,1.1031299999999999,1.1031299999999999,3.3149999999999999E-2,3.3149999999999999E-2]
[null,60026751,"SW","RURAL LONG",694,215.50240000000002,3.3404599999999998,1.6720000000000002,5.5316237975183276,0.30869028875735616,38,664.83465000000001,664.43573000000004,4.2953899999999994,4.2939499999999997,30,37.100859999999997,37.100859999999997,0.16571,0.16571]
[null,60026752,"SW","RURAL SHORT",356,7.6006399999999994,0,1.2330000000000001,5.5434810995785373,2.3143846429485198,15,412.32252,412.15492,5.0898899999999996,5.0870799999999994,15,172.14326,172.08708000000001,2.02528,2.0224699999999998]
[null,60026754,"SW","RURAL SHORT",1394,19.924810000000001,3.6553599999999999,5.5390000000000006,0.6144424806965294,1.0148220931508642,41,30.10923,30.042369999999998,1.2639899999999999,1.2632699999999999,121,49.728839999999998,49.459829999999997,0.28981000000000001,0.28910000000000002]
[null,60026755,"SW","RURAL LONG",1697,204.04115999999999,0.64400000000000002,3.7050000000000001,1.0632929544856837,0.7743377165222014,82,132.86806999999999,132.83565999999999,2.3848000000000003,2.3842099999999999,80,96.760500000000008,96.760500000000008,0.55450999999999995,0.55450999999999995]
[null,60026756,"SW","RURAL SHORT",42,43.557809999999996,0,0.52,17.591603906142755,3.3131489852957556,12,1144.8579400000001,604.73095000000001,4.7142900000000001,3.7619000000000002,6,215.61904999999999,215.61904999999999,1.3333299999999999,1.3333299999999999]
[null,60026757,"SW","RURAL LONG",144,905.59952999999996,5.2900000000000003E-2,0.505,28.043822461958886,5.4700594384918579,29,2090.73171,2090.73171,9.32639,9.32639,5,407.80556000000001,407.80556000000001,3.04861,3.04861]
[null,60026758,"SW","RURAL SHORT",370,161.86440000000002,5.0779999999999999E-2,1.361,9.370478257864832,0.42730007201288994,35,852.09365000000003,695.06671000000006,7.9837799999999994,6.9756799999999997,28,38.85604,36.626309999999997,0.18648999999999999,0.17837999999999998]
[null,60026759,"SW","URBAN",190,0.52495999999999998,0.66160000000000008,4.6420000000000003,0.5922780234702858,0.13699604889003397,4,22.572279999999999,22.572279999999999,2.1049999999999999E-2,2.1049999999999999E-2,5,5.22105,5.22105,0.17368,0.17368]
[null,60026760,"SW","RURAL SHORT",91,43.741430000000001,6.9870000000000002E-2,0.32900000000000001,4.2680860081336451,1.3499969963349089E-2,16,587.14450999999997,587.14450999999997,3.3186799999999996,3.3186799999999996,4,1.85714,1.85714,5.4949999999999999E-2,5.4949999999999999E-2]
[null,60026761,"SW","URBAN",759,2.3497300000000001,0.84330000000000005,1.2850000000000001,0.46324828604687202,9.6951063576648636E-2,17,82.015739999999994,82.015739999999994,1.9828699999999999,1.9828699999999999,20,17.16469,17.16469,6.8510000000000001E-2,6.8510000000000001E-2]
[null,60026762,"SW","URBAN",888,4.8206600000000002,1.37565,2.089,0.25992222863833381,1.2941602765015724E-3,8,34.378189999999996,34.378189999999996,0.19707,0.19707,8,0.17116999999999999,0.17116999999999999,1.014E-2,1.014E-2]
[null,60026763,"SW","URBAN",1534,4.5917699999999995,1.1072599999999999,4.7350000000000003,4.7399080656366784E-2,0.13989779683778611,21,4.4741099999999996,4.3367599999999999,0.18448999999999999,0.18382999999999999,30,13.20528,13.20528,0.12190000000000001,0.12190000000000001]
[null,60026764,"SW","RURAL SHORT",81,81.559820000000002,0,0.624,18.993394752432383,0.78601427651557276,28,1291.44136,938.98189000000002,6.2592599999999994,5.2592599999999994,4,53.44444,53.44444,0.28394999999999998,0.28394999999999998]
[null,60026765,"SW","URBAN",938,3.33013,1.9994099999999999,4.1829999999999998,3.5731606208008042,9.2280769573588967E-2,24,193.47063,193.47063,2.2036199999999999,2.2036199999999999,115,4.9965899999999994,4.9731299999999994,0.20468999999999998,0.20362]
[null,60026766,"SW","RURAL LONG",503,1729.6883800000001,3.499E-2,1.4650000000000001,16.867578686523228,3.2772698138890344,46,1525.91859,1525.59944,10.79125,10.789259999999999,42,296.47686999999996,296.47686999999996,2.61233,2.61233]
[null,60026767,"SW","URBAN",1105,7.85121,1.46218,3.738,3.2189166288593496,4.9720788648000828E-2,11,163.16773999999998,162.90733,2.1411799999999999,2.13937,24,2.5203599999999997,2.5203599999999997,3.0769999999999999E-2,3.0769999999999999E-2]
[null,60026768,"SW","URBAN",768,7.1364799999999997,0.96143000000000001,3.2670000000000003,0.77548304214922892,0.15805745889815762,6,32.561979999999998,32.561979999999998,0.19921999999999998,0.19921999999999998,9,6.6367199999999995,6.6367199999999995,4.4269999999999997E-2,4.4269999999999997E-2]
[null,60026770,"SW","URBAN",1082,8.4346899999999998,1.5056799999999999,4.4750000000000005,0.46038947309161105,4.285573826870491E-2,19,32.402029999999996,32.176519999999996,0.32901999999999998,0.27263999999999999,88,3.0161699999999998,2.6659000000000002,0.14232999999999998,0.12847]
[null,60026771,"SW","RURAL LONG",406,236.79847999999998,4.8135000000000003,1.883,13.280577866141199,1.8530831822224958,73,1135.6998799999999,968.23254999999995,5.1059099999999997,4.99261,25,158.46798000000001,158.46798000000001,0.65764,0.65764]
[null,60026773,"SW","RURAL SHORT",335,119.52736,0,0.88400000000000001,0.63928785922271802,0.13512762070817239,27,113.24517,113.24517,0.97611999999999999,0.97611999999999999,7,23.936869999999999,23.936869999999999,0.12536999999999998,0.12536999999999998]
[null,60026774,"SW","RURAL SHORT",1466,126.55115000000001,2.7613699999999999,3.19,0.68047478467203137,0.50930087609503516,57,89.337059999999994,88.687259999999995,0.59072000000000002,0.58867999999999998,33,66.864260000000002,66.864260000000002,0.21214,0.21214]
[null,60026775,"SW","RURAL SHORT",223,147.65085999999999,0,0.38900000000000001,0.50015732586126516,0.66848440914095841,24,85.425190000000001,84.95187,0.61434999999999995,0.60987000000000002,10,114.17489,114.17489,0.41255999999999998,0.41255999999999998]
[null,60026776,"SW","RURAL SHORT",58,46.043569999999995,0.78015999999999996,2.9580000000000002,124.3256262000552,0.19261231384798266,17,1034.98017,1033.21351,7.8620699999999992,7.8275899999999998,4,1.6034499999999998,1.6034499999999998,6.8970000000000004E-2,6.8970000000000004E-2]
[null,60026777,"SW","URBAN",933,4.8559899999999994,0.37378999999999996,4.3360000000000003,0.15623654742716014,8.3476961407033621E-3,11,16.068169999999999,1.6541599999999999,0.13505,1.072E-2,11,0.85851999999999995,0.85851999999999995,1.6080000000000001E-2,1.6080000000000001E-2]
[null,60026778,"SW","RURAL SHORT",110,62.299489999999999,0,0.32500000000000001,5.3341827014112582,5.0693884224925068,25,833.36500000000001,829.35605999999996,6.2,6.1818200000000001,10,791.99590999999998,791.99590999999998,3.6818199999999996,3.6818199999999996]
[null,60026779,"SW","RURAL SHORT",1324,11.099259999999999,1.40829,3.1360000000000001,3.1719874649497366,0.44244871600118885,18,376.44736,376.40749,1.1850499999999999,1.1842899999999998,51,52.509239999999998,52.509239999999998,0.18731,0.18731]
[null,60026780,"SW","URBAN",49,0,0.74420000000000008,4.5339999999999998,0,4.6251464765007952,"",0,0,0,0,3,12.836729999999999,12.836729999999999,0.14285999999999999,0.14285999999999999]
[null,60026781,"SW","URBAN",1834,9.185319999999999,3.15015,4.0830000000000002,0.10400919037034716,1.9352699614573088E-2,11,12.65274,2.2665799999999998,6.4339999999999994E-2,2.1259999999999998E-2,160,2.35426,2.2997399999999999,9.2689999999999995E-2,9.1600000000000001E-2]
[null,60026782,"SW","RURAL SHORT",648,2.9535100000000001,2.6959599999999999,1.4390000000000001,1.4586398416448152,1.6947656455126104E-3,11,130.15965,130.15965,2.8534000000000002,2.8534000000000002,5,0.15123,0.15123,7.7199999999999994E-3,7.7199999999999994E-3]
[null,60026783,"SW","RURAL LONG",1577,298.38914,0.91691,2.633,0.77285728577682,2.7071587334648716E-2,127,90.40701,90.342619999999997,0.81484000000000001,0.81357000000000002,86,3.1667699999999996,3.1319000000000004,6.7220000000000002E-2,6.4680000000000001E-2]
[null,60026784,"SW","URBAN",308,0.85253999999999996,3.48712,4.4980000000000002,3.6726094195575598,0.47643723750442052,2,107.48496,107.48496,0.76298999999999995,0.76298999999999995,12,13.943719999999999,13.943719999999999,0.18831000000000001,0.18831000000000001]
[null,60026785,"SW","URBAN",172,0,1.0898099999999999,1.3540000000000001,5.2620711745329114,0.53686837126404285,14,228.28188,228.28188,2.0174400000000001,2.0174400000000001,4,23.290700000000001,23.290700000000001,0.18023,0.18023]
[null,60026786,"SW","RURAL SHORT",1148,145.85892999999999,4.7437100000000001,2.6840000000000002,1.4118985853352017,1.0804834254731219,77,213.59093000000001,213.53779,3.16899,3.16812,49,163.4547,163.4547,0.85192000000000001,0.85192000000000001]
[null,60026787,"SW","RURAL LONG",147,1078.6543899999999,3.6979999999999999E-2,0.63400000000000001,14.048060186628902,3.8326570041510166,46,1195.3443299999999,1192.63356,9.4421799999999987,9.4285699999999988,20,326.11939000000001,295.50713999999999,2.5850299999999997,2.4761899999999999]
[null,60026788,"SW","URBAN",924,12.21114,0.78743999999999992,4.3719999999999999,1.9673882546409354,3.6302557447396709E-2,22,123.9958,123.59769,2.8603899999999998,2.8582299999999998,60,2.2879899999999997,2.2879899999999997,6.8179999999999991E-2,6.8179999999999991E-2]
[null,60026790,"SW","RURAL SHORT",732,38.806379999999997,0.87742999999999993,1.994,8.0680029153535564,1.4294156056089733,32,818.11027000000001,817.91144999999995,6.19536,6.1912599999999998,68,144.94535999999999,144.94535999999999,0.59836,0.59836]
[null,60026791,"SW","URBAN",860,5.6667800000000002,0.10682,4.9870000000000001,0.32875641557706564,0.10850042084284471,10,36.990679999999998,36.990679999999998,1.2744199999999999,1.2744199999999999,163,12.20814,12.20814,0.24301999999999999,0.24301999999999999]
[null,60026792,"SW","RURAL SHORT",96,77.057249999999996,0,1.2590000000000001,18.654981013878459,1.0498503804884768E-2,31,888.45902999999998,811.63193999999999,7.0104199999999999,6.0104199999999999,2,0.5,0.5,2.0829999999999998E-2,2.0829999999999998E-2]
[null,60026793,"SW","URBAN",1792,7.7187399999999995,0.35450999999999999,3.8450000000000002,0.31985860818599932,2.0007434491179314E-3,19,41.305579999999999,39.365100000000005,0.23102999999999999,0.21930999999999998,16,0.25836999999999999,0.25836999999999999,1.9529999999999999E-2,1.9529999999999999E-2]
[null,60026794,"SW","RURAL LONG",477,214.85486,0.52737000000000001,1.232,6.3221095067861297,0.2338287999157061,55,611.0326,611.0326,3.3543000000000003,3.3543000000000003,23,22.59958,22.59958,0.15722999999999998,0.15722999999999998]
[null,60026797,"SW","URBAN",5,0.89485999999999999,0.29458999999999996,6.7990000000000004,523.83277701827114,0,1,31.876669999999997,31.876669999999997,0.2,0.2,"",0,0,0,0]
[null,60026798,"SW","RURAL SHORT",623,9.278039999999999,1.1796199999999999,2.617,0.84324446598935343,0.30439790271048456,13,49.543529999999997,48.625009999999996,0.18941,0.1862,14,17.884429999999998,17.884429999999998,7.3840000000000003E-2,7.3840000000000003E-2]
[null,60026799,"SW","URBAN",743,1.2896099999999999,4.7534399999999994,2.5169999999999999,0.57986912330203499,4.2977521531540111E-4,5,63.562609999999999,63.562609999999999,2.13863,2.13863,2,4.7109999999999999E-2,4.7109999999999999E-2,2.6899999999999997E-3,2.6899999999999997E-3]
[null,60026801,"SW","RURAL SHORT",658,12.828249999999999,4.01511,1.06,0.45880763319105328,0.12329110265472519,9,32.852959999999996,32.852959999999996,0.19148999999999999,0.19148999999999999,15,8.8282699999999998,7.3997000000000002,8.8149999999999992E-2,8.206999999999999E-2]
[null,60026802,"SW","RURAL SHORT",191,61.743400000000001,9.9589999999999998E-2,2.645,11.70201195159532,0.36106257799463332,27,397.40340000000003,396.94092000000001,2.89005,2.8848199999999999,10,12.26178,12.26178,0.34554999999999997,0.34554999999999997]
[null,60026803,"SW","RURAL SHORT",13,4.0641799999999995,2.44136,2.6000000000000002E-2,4.0173750790195415,0,1,7.69231,7.69231,0.30768999999999996,0.30768999999999996,"",0,0,0,0]
[null,60026805,"SW","URBAN",844,2.2171499999999997,0.22092999999999999,2.1459999999999999,1.0627923525633123,0.20161756357446403,10,70.276029999999992,70.276029999999992,0.97630000000000006,0.97630000000000006,29,13.33175,13.33175,7.4639999999999998E-2,7.4639999999999998E-2]
[null,60026806,"SW","URBAN",1825,8.0131300000000003,0.85610000000000008,3.113,0.13635057710826337,1.3689765314437122E-3,17,20.138200000000001,20.138200000000001,0.25096000000000002,0.25096000000000002,8,0.20218999999999998,0.20218999999999998,4.3800000000000002E-3,4.3800000000000002E-3]
[null,60026807,"SW","RURAL SHORT",226,133.95954,0.23710999999999999,0.72799999999999998,1.2705876829792773,0.37758274400939951,28,159.60199,159.60199,1.46018,1.46018,24,47.429200000000002,47.429200000000002,0.29203999999999997,0.29203999999999997]
[null,60026808,"SW","URBAN",123,0.62426999999999999,1.7585199999999999,1.3070000000000002,5.1922307736651921E-2,2.09707611200851,2,2.12669,2.12669,7.3169999999999999E-2,7.3169999999999999E-2,14,85.89430999999999,85.89430999999999,0.31706999999999996,0.31706999999999996]
[null,60026809,"SW","RURAL SHORT",824,22.444389999999999,0.74219000000000002,2.952,1.1224831318963766,1.4857849984871024E-2,17,127.71642,127.71642,2.0024299999999999,2.0024299999999999,18,1.6905299999999999,1.6699000000000002,2.6700000000000002E-2,2.5489999999999999E-2]
[null,60026812,"SW","RURAL SHORT",220,112.21137,2.4879999999999999E-2,0.93300000000000005,6.3615613207545794,0.39349319585090137,28,640.94363999999996,640.94363999999996,3.1,3.1,7,39.645449999999997,39.645449999999997,1.3136399999999999,1.3136399999999999]
[null,60026815,"SW","RURAL SHORT",89,101.05875,0.72476999999999991,0.30199999999999999,8.5194065673878949,4.5472978744328971,12,822.42864999999995,820.71516999999994,6.2247199999999996,6.2134799999999997,5,438.97753,438.97753,2.0337100000000001,2.0337100000000001]
[null,60026816,"SW","RURAL LONG",467,217.11354,5.0990000000000001E-2,1.1260000000000001,1.6684597651397421,1.8976768047640731,59,266.49436000000003,215.17950999999999,2.8051399999999997,2.6274099999999998,33,303.10599999999999,302.03640000000001,1.09636,1.08351]
[null,60026817,"SW","URBAN",189,0,1.3095699999999999,2.3850000000000002,0.96325680406558967,0.14776671807556768,2,25.730159999999998,25.081659999999999,0.38094999999999996,0.37565999999999999,3,3.9470899999999998,3.9470899999999998,2.6459999999999997E-2,2.6459999999999997E-2]
[null,60026818,"SW","URBAN",403,1.96377,1.03674,1.9260000000000002,0.66004306063227758,1.0671323931432399,10,61.684739999999998,61.684739999999998,1.1464000000000001,1.1464000000000001,70,99.729529999999997,79.18610000000001,0.67245999999999995,0.51364999999999994]
[null,60026819,"SW","RURAL LONG",1166,321.45143000000002,1.5145299999999999,3.6420000000000003,5.176915571538653,1.5145282826814437,83,601.26422000000002,596.62816999999995,5.6552299999999995,5.6389399999999998,100,175.90235999999999,175.90235999999999,0.87992999999999999,0.87992999999999999]
[null,60026820,"SW","URBAN",1607,8.9880399999999998,2.38748,3.84,0.12561128387586926,8.131030734022128E-2,18,17.89686,17.89686,0.19974999999999998,0.19974999999999998,15,11.58494,11.58494,7.281E-2,7.281E-2]
[null,60026821,"SW","RURAL LONG",1594,318.85077999999999,0.60732999999999993,4.6110000000000007,1.6237820879336045,0.93551292989181323,190,176.64310999999998,164.64796999999999,2.6606000000000001,2.5527000000000002,54,101.76976000000001,101.76976000000001,0.64993999999999996,0.64993999999999996]
[null,60026822,"SW","URBAN",1389,11.393139999999999,4.1042100000000001,5.4260000000000002,0.23865752875644602,1.6988917110006514E-2,18,15.878409999999999,15.84098,0.23182,0.2311,34,1.1303099999999999,1.1303099999999999,3.2399999999999998E-2,3.2399999999999998E-2]
[null,60026823,"SW","URBAN",1323,5.3821899999999996,0.79537999999999998,2.5030000000000001,0.9600848764390163,7.8645936115872256E-2,19,97.190879999999993,97.190879999999993,0.65078999999999998,0.65078999999999998,15,7.9614499999999992,7.9614499999999992,4.233E-2,4.233E-2]
[null,60026824,"SW","RURAL SHORT",642,187.62854999999999,0.68589,1.7150000000000001,1.6433489437742339,2.1868433392022242,41,135.31507999999999,135.20967999999999,2.2492199999999998,2.2476599999999998,41,180.06698,180.06698,0.71183999999999992,0.71183999999999992]
[null,60026825,"SW","RURAL SHORT",127,67.199339999999992,0.10085,0.34900000000000003,2.7930635188442201,6.6393179679174921,17,476.11010000000005,476.11010000000005,3.9448799999999999,3.9448799999999999,27,1131.74882,1131.74882,3.54331,3.54331]
[null,60026826,"SW","RURAL SHORT",57,66.092060000000004,0.12035,0.89600000000000002,15.852803020625744,0.33399467673752459,19,1132.4801199999999,919.24327000000005,7.4386000000000001,6.4561399999999995,4,23.859649999999998,23.859649999999998,0.26316000000000001,0.26316000000000001]
[null,60026828,"SW","URBAN",489,7.7759999999999996E-2,0,3.7680000000000002,4.7787629196353798E-3,1.7079944055364693,1,0.23354,0.23354,2.0399999999999997E-3,2.0399999999999997E-3,8,83.470349999999996,83.470349999999996,0.30265999999999998,0.30265999999999998]
[null,60026829,"SW","RURAL SHORT",186,142.30376000000001,7.2730000000000003E-2,1.333,5.6853549764242919,2.5568126254253807,26,290.29372999999998,287.36649,3.6075299999999997,3.60215,12,130.55063000000001,130.55063000000001,0.77956999999999999,0.77956999999999999]
[null,60026830,"SW","RURAL SHORT",291,65.214429999999993,0.26656999999999997,1.734,3.904113631994647,5.5578131371590311,21,241.01608999999999,241.01608999999999,1.7628899999999998,1.7628899999999998,14,343.10537999999997,215.04066,1.6048099999999998,1.1958800000000001]
[null,60026831,"SW","RURAL SHORT",61,56.75009,0,0.16,3.0740315915994798,0.39638207749914744,10,493.25765000000001,294.75710000000004,3.0819699999999997,2.5245899999999999,2,63.603279999999998,63.603279999999998,0.44261999999999996,0.44261999999999996]
[null,60026832,"SW","RURAL SHORT",48,63.817419999999998,0,0.65700000000000003,5.2130014153444844,0.58626371500434005,9,376.42395999999997,376.42395999999997,3.7291699999999999,3.7291699999999999,2,42.333329999999997,42.333329999999997,0.1875,0.1875]
[null,60026833,"SW","RURAL SHORT",615,62.231879999999997,0.25228,1.504,8.3876306881810798,1.1223810312402188E-2,22,1041.3721399999999,886.87621000000001,6.3918699999999999,5.3951199999999995,14,1.3935,1.3935,2.7639999999999998E-2,2.7639999999999998E-2]
[null,60026836,"SW","URBAN",1513,8.1440599999999996,0.66018999999999994,3.4340000000000002,0.10894344110173193,1.7554868816972904E-3,15,13.494689999999999,13.494689999999999,0.19100999999999999,0.19100999999999999,16,0.21744999999999998,0.21744999999999998,1.0579999999999999E-2,1.0579999999999999E-2]
[null,60026837,"SW","RURAL SHORT",1171,16.91573,1.1804299999999999,2.339,3.1565125385551869,0.15788396842709085,8,300.19643000000002,300.19301000000002,1.0631899999999999,1.0623400000000001,20,15.015369999999999,15.015369999999999,0.12639,0.12639]
[null,60026838,"SW","URBAN",407,8.9898399999999992,2.36226,3.5390000000000001,2.0228510759157152,1.5225100180223928E-2,7,38.194099999999999,38.194099999999999,0.80343999999999993,0.80343999999999993,2,0.28747,0.28747,4.9099999999999994E-3,4.9099999999999994E-3]
[null,60026839,"SW","RURAL SHORT",38,104.63995,0.13430999999999998,3.33,166.44544080578041,165.87888320092679,18,872.07367999999997,502.47368,4.3157899999999998,3.36842,10,869.10526000000004,869.10526000000004,3.86842,3.86842]
[null,60026840,"SW","RURAL SHORT",2260,10.336169999999999,2.6271199999999997,3.24,1.0690816690128622,6.2020828939729413E-4,25,131.95276999999999,131.95188999999999,0.97920000000000007,0.97875999999999996,14,7.6549999999999993E-2,7.6549999999999993E-2,7.0799999999999995E-3,7.0799999999999995E-3]
[null,60026841,"SW","RURAL SHORT",241,16.447900000000001,0.54832999999999998,3.83,23.907092912167347,7.0561902600353292,6,322.31957,322.31957,1.0165999999999999,1.0165999999999999,42,95.132779999999997,95.132779999999997,0.38588999999999996,0.38588999999999996]
[null,60026842,"SW","URBAN",1293,9.0281199999999995,1.56498,5.73,0.2408503078037301,4.1063892596258235E-2,8,20.077069999999999,20.077069999999999,0.33951999999999999,0.33951999999999999,19,3.4230499999999999,3.4230499999999999,2.4749999999999998E-2,2.4749999999999998E-2]
[null,60026844,"SW","URBAN",1135,8.1594800000000003,0.43891999999999998,3.496,0.12357561518296167,0.20066291241746204,9,13.20712,13.20712,0.96387999999999996,0.96387999999999996,36,21.445809999999998,21.445809999999998,0.15330000000000002,0.15330000000000002]
[null,60026845,"SW","URBAN",840,4.3875299999999999,0.3624,3.484,0.16874558635132322,0.23213005314781149,5,9.2581499999999988,9.2581499999999988,6.429E-2,6.429E-2,9,12.735709999999999,12.735709999999999,4.2859999999999995E-2,4.2859999999999995E-2]
[null,60026847,"SW","RURAL LONG",370,240.11743000000001,0.10438,1.9140000000000001,11.310414272313752,1.5230846520911112,49,979.64085999999998,979.06676000000004,9.5918899999999994,9.5891900000000003,29,131.92053999999999,131.92053999999999,0.87026999999999999,0.87026999999999999]
[null,60026888,"SW","RURAL LONG",494,1354.26622,0.18753,1.2850000000000001,10.342123469730007,3.6772552846061801,140,741.52486999999996,491.07155999999998,4.3744899999999998,2.3724699999999999,53,263.65728999999999,263.65728999999999,1.5789499999999999,1.5789499999999999]
[null,60026889,"SW","RURAL LONG",184,521.47212000000002,0.31624999999999998,1.1140000000000001,25.262677362702338,1.1224801367305188,55,1457.0269000000001,1203.5098700000001,8.8858699999999988,6.8152200000000001,8,64.739130000000003,64.739130000000003,0.35325999999999996,0.35325999999999996]
[null,60026890,"SW","RURAL SHORT",305,16.904219999999999,2.7585799999999998,1.405,7.3252995944128463,0.25687713290916525,10,614.55922999999996,365.77956,3.3377000000000003,1.3311499999999998,6,21.550819999999998,21.550819999999998,0.16066,0.16066]
[null,60026891,"SW","RURAL LONG",394,571.03557000000001,0.23132,2.6970000000000001,15.499462618361541,1.0759122242143064,57,1019.38054,758.91120999999998,5.2994899999999996,3.2233499999999999,22,70.761420000000001,68.670050000000003,0.30202999999999997,0.29694999999999999]
[null,60026892,"SW","RURAL LONG",365,576.26732000000004,0,0.73399999999999999,6.2212126221498512,1.3260368309548303,56,782.35886000000005,521.4221,5.6164399999999999,3.5506799999999998,38,166.75794999999999,166.45658,0.96711999999999998,0.9643799999999999]
[null,60026893,"SW","RURAL SHORT",71,172.26650999999998,5.1240000000000001E-2,4.3540000000000001,26.837396502600516,1.1854705175278807E-2,17,637.70681000000002,294.08967000000001,4.4225399999999997,1.9295799999999999,1,0.28169,0.28169,1.4079999999999999E-2,1.4079999999999999E-2]
[null,60026984,"SW","RURAL SHORT",1090,22.12846,0.48821999999999999,3.2470000000000003,0.91432197776477786,0.41059601843644938,24,85.54674,85.54674,1.1284399999999999,1.1284399999999999,12,38.416609999999999,38.196419999999996,0.17155999999999999,0.17063999999999999]
[null,60026985,"SW","RURAL SHORT",98,54.569929999999999,5.382E-2,0.24500000000000002,9.111811501561581,1.3285820525705836,21,1248.07024,1248.07024,9.9387799999999995,9.9387799999999995,8,181.97959,181.97959,1.65306,1.65306]
[null,60026986,"SW","RURAL SHORT",210,6.0578199999999995,2.0363599999999997,1.5,0.36471000993234021,0.60622722090057368,10,16.824919999999999,16.824919999999999,0.20476,0.20476,5,27.966669999999997,27.966669999999997,0.15714,0.15714]
[null,60026987,"SW","RURAL SHORT",272,25.790489999999998,0.61344999999999994,1.7210000000000001,3.3494047820944028,0.10073378852821392,12,149.86966999999999,43.093319999999999,4.0441199999999995,2.0257399999999999,9,4.5073499999999997,4.5073499999999997,4.7789999999999999E-2,4.7789999999999999E-2]
[null,60026988,"SW","RURAL SHORT",449,12.74785,8.5379999999999998E-2,0.94600000000000006,9.154197783238585,0.21598744648158508,30,1222.5942500000001,1222.38526,10.42094,10.418709999999999,8,28.846329999999998,28.846329999999998,0.14698999999999998,0.14698999999999998]
[null,60026989,"SW","RURAL SHORT",594,5.8844399999999997,2.92963,1.6120000000000001,1.9872484257075036,8.0626522472388527E-3,14,199.58622,96.344219999999993,2.1279499999999998,0.17845,23,0.80975999999999992,0.80975999999999992,3.8719999999999997E-2,3.8719999999999997E-2]
[null,60026990,"SW","RURAL LONG",235,298.34465,0.27596999999999999,0.56000000000000005,2.3105861821052107,2.2957784412834319,53,272.90298000000001,271.23007000000001,7.0638299999999994,7.05532,64,271.15404000000001,271.15404000000001,2.1744699999999999,2.1744699999999999]
[null,60026992,"SW","RURAL LONG",197,332.76283000000001,6.8349999999999994E-2,0,13.980447821597528,2.1244100594221584,31,1679.8232700000001,1465.6680200000001,8.0101499999999994,6.6751299999999993,14,255.25888,255.25888,1.0355300000000001,1.0355300000000001]
[null,60026994,"SW","RURAL LONG",402,736.29686000000004,0,1.931,7.663372245295121,2.9622768832717656,61,536.89100000000008,497.24283000000003,8.1169200000000004,8.0323399999999996,45,207.53523999999999,207.53523999999999,1.4005000000000001,1.4005000000000001]
[null,60026995,"SW","RURAL SHORT",170,8.22241,8.6870000000000003E-2,0.72899999999999998,25.425221690646609,11.914617471987361,10,1134.5846099999999,970.31618000000003,7.0411799999999998,6.0470600000000001,6,531.68235000000004,531.68235000000004,2.0941199999999998,2.0941199999999998]
[null,60026996,"SW","RURAL SHORT",43,27.441279999999999,9.1539999999999996E-2,0.95500000000000007,1.7119186963203721,0,9,127.63798,127.63798,5.9767399999999995,5.9767399999999995,"",0,0,0,0]
[null,60026997,"SW","RURAL LONG",456,232.87057999999999,0,0.96900000000000008,5.4720528433137527,3.0331843786532398,45,781.79583000000002,781.63476000000003,5.4057000000000004,5.4013200000000001,21,433.35307,433.35307,1.7894699999999999,1.7894699999999999]
[null,60026998,"SW","RURAL SHORT",126,50.427839999999996,3.6909999999999998E-2,0.61899999999999999,2.3241175796993576,9.322200836065081E-2,20,149.58598000000001,147.85423,6.1587299999999994,6.1507899999999998,2,6,6,2.3809999999999998E-2,2.3809999999999998E-2]
[null,60027001,"SW","RURAL SHORT",103,78.540779999999998,6.2659999999999993E-2,1.0550000000000002,2.2983783990976381,5.8819680914505312,20,166.45565999999999,166.45565999999999,6.2330100000000002,6.2330100000000002,14,425.99029000000002,425.99029000000002,1.32039,1.32039]
[null,60027002,"SW","RURAL LONG",202,331.77814999999998,0.35247999999999996,7.3970000000000002,45.489298513095214,29.849700460996679,53,380.63918999999999,379.72681999999998,6.8663400000000001,6.8564400000000001,26,249.77227999999999,249.77227999999999,0.84653,0.84653]
[null,60027003,"SW","RURAL LONG",371,446.91268000000002,0.27598,5.2919999999999998,7.6108330706518377,19.514697647678254,38,251.08922000000001,251.08922000000001,2.5552600000000001,2.5552600000000001,30,643.80997000000002,643.80997000000002,2.8113199999999998,2.8113199999999998]
[null,60300323,"SW","RURAL LONG",52,334.99034,0.22645999999999999,8.4960000000000004,68.327164814231026,20.294258314853181,20,504.50864999999999,446.92980999999997,8.61538,8.3269199999999994,15,149.84711999999999,149.84711999999999,0.82691999999999999,0.82691999999999999]
[null,60322051,"SW","RURAL SHORT",296,5.0217200000000002,0.16572999999999999,1.0350000000000001,4.3822152078451344,0.11012875944599616,14,273.83722,273.83722,7.6959499999999998,7.6959499999999998,4,6.8817599999999999,6.8817599999999999,4.054E-2,4.054E-2]
[null,60322052,"SW","RURAL SHORT",246,5.9259499999999994,5.6129999999999999E-2,1.07,2.3788731666531819,3.3997314775692651,12,167.18563999999998,167.18563999999998,6.12195,6.12195,23,238.93089000000001,238.93089000000001,0.75609999999999999,0.75609999999999999]
[null,60322053,"SW","RURAL SHORT",632,16.586069999999999,0.24601999999999999,1.395,2.4835509568755478,1.5742444303224804E-2,24,164.75029000000001,164.75029000000001,6.1914599999999993,6.1914599999999993,2,1.0443,1.0443,4.7499999999999999E-3,4.7499999999999999E-3]
[null,60325532,"SW","RURAL SHORT",397,1.9743000000000002,4.3093199999999996,1.1860000000000002,1.5890232657637142,0,2,93.75273,93.75273,2,2,"",0,0,0,0]
[null,60327170,"SW","RURAL LONG",98,381.60352,1.4E-2,0,20.156324657347234,7.6224347242973645,19,982.03129000000001,982.03129000000001,10.816329999999999,10.816329999999999,6,371.37074999999999,371.37074999999999,1.5918399999999999,1.5918399999999999]
[null,60327522,"SW","URBAN",1705,7.8270299999999997,1.3871599999999999,5.1260000000000003,0.10956517765840883,1.3567868089899855E-2,14,12.176969999999999,12.176969999999999,0.43401999999999996,0.43401999999999996,10,1.5079199999999999,1.5079199999999999,1.056E-2,1.056E-2]
[null,60330584,"SW","URBAN",49,7.1153199999999996,0.76174999999999993,3.5790000000000002,2.5205557384911872,51.589530180564573,2,8.1483000000000008,8.1483000000000008,4.0819999999999995E-2,4.0819999999999995E-2,9,166.77551,166.77551,0.97958999999999996,0.97958999999999996]
[null,60330968,"SW","RURAL SHORT",1514,29.542759999999998,22.293100000000003,4.093,0.93391186994875586,0.22256915976856731,23,105.67456,105.67456,4.1750299999999996,4.1750299999999996,18,25.184279999999998,25.184279999999998,0.1255,0.1255]
[null,60331113,"SW","RURAL SHORT",873,32.625879999999995,8.4690599999999989,5.6880000000000006,3.0621693409728445,0.38421663836976405,26,405.79861,405.68806999999998,2.0125999999999999,2.01145,20,50.916379999999997,50.916379999999997,0.21648999999999999,0.21648999999999999]
[null,60331115,"SW","URBAN",144,2.27122,2.3991000000000002,4.74,8.6373851110789157E-2,3.2108807927357863,2,1.68669,1.68669,1.389E-2,1.389E-2,5,62.701389999999996,62.701389999999996,1.0416699999999999,1.0416699999999999]
[null,80075911,"CA","RURAL SHORT",1,1.0369999999999999E-2,0,0,38925.979461626841,0,2,1025.3833299999999,1012.68333,2,1,"",0,0,0,0]
[null,80076113,"NQ","URBAN",218,2.0446200000000001,1.4184299999999999,3.6960000000000002,16.162758766343977,3.0688865039134776E-3,5,241.58134999999999,0.63462999999999992,1.95872,9.1699999999999993E-3,1,4.5870000000000001E-2,4.5870000000000001E-2,4.5899999999999995E-3,4.5899999999999995E-3]
[null,80076128,"NQ","RURAL SHORT",3,0,0.17910000000000001,0,26.236053254080012,0,1,15.33333,15.33333,0.66666999999999998,0.66666999999999998,"",0,0,0,0]
[null,80076236,"CA","RURAL SHORT",1,0,5.6059999999999999E-2,0,0,2627.1805379746838,"",0,0,0,0,1,97,97,1,1]
[null,80077050,"FN","RURAL SHORT",0,0,0,0,0,0,"",0,0,0,0,"",0,0,0,0]
[null,80077053,"MK","URBAN",0,0.10594999999999999,0,2.99,0,0,"",0,0,0,0,"",0,0,0,0]
[null,80077055,"CA","RURAL SHORT",3,0,0,0,0,0,"",0,0,0,0,"",0,0,0,0]
[null,80077090,"CA","RURAL SHORT",1,8.3481199999999998,0,0,392.16036305174049,0,1,44.533329999999999,44.533329999999999,1,1,"",0,0,0,0]
[null,80077106,"MK","RURAL SHORT",0,0.33067999999999997,0,0,0,0,"",0,0,0,0,"",0,0,0,0]
[null,81669225,"FN","RURAL SHORT",105,44.854700000000001,0,0.12,0.32649256305307101,1.1756284502028025,5,49.240629999999996,45.04063,2.11429,1.11429,11,177.30475999999999,177.30475999999999,5.0571399999999995,5.0571399999999995]
[null,81669226,"FN","RURAL SHORT",240,22.744730000000001,0,0.30499999999999999,4.2709249752201419,1.0176679600623706,14,458.91985999999997,454.99986000000001,5.2708300000000001,4.3375000000000004,44,109.35056,109.35056,4.6166700000000001,4.6166700000000001]
[null,82536638,"SW","RURAL SHORT",63,112.81533999999999,1.5921099999999999,1.6E-2,5.2065465127687656,2.3153373072585977,15,457.98942,454.29101000000003,4.8254000000000001,4.80952,5,203.66667000000001,203.66667000000001,0.76190000000000002,0.76190000000000002]
[null,82552955,"WB","RURAL SHORT",2470,35.101889999999997,18.434169999999998,3.7770000000000001,9.566649624651447,0.20955839912794766,36,1148.6321499999999,600.00804000000005,5.0392700000000001,3.6720599999999997,194,25.160900000000002,25.069400000000002,0.217,0.21335999999999999]
[null,82554035,"WB","RURAL SHORT",2604,12.960989999999999,6.7025199999999998,3.9010000000000002,0.13418703182213573,5.892540741103152E-2,54,23.340889999999998,20.26623,0.20929,0.18203,348,10.249659999999999,9.9501200000000001,0.16091,0.15053999999999998]
[null,82554082,"WB","RURAL SHORT",1075,3.0323099999999998,8.3516000000000012,2.4540000000000002,6.8448913909334788E-3,2.0453034197298495E-2,3,0.60114999999999996,0.58904999999999996,3.0700000000000002E-2,2.9769999999999998E-2,26,1.7962799999999999,1.7962799999999999,2.605E-2,2.605E-2]
[null,82554089,"WB","URBAN",539,3.58752,3.2833299999999999,3.1420000000000003,0.39457838120445904,0.74214651496262107,8,15.070279999999999,15.070279999999999,0.13358,0.13358,46,28.345079999999999,27.918369999999999,0.33394999999999997,0.30612]
[null,82556060,"WB","RURAL SHORT",302,26.224959999999999,0.60865000000000002,0.91500000000000004,0.23857160474166364,0.36050259821029484,19,29.617719999999998,28.04156,0.18212,0.17550000000000002,28,44.75497,44.75497,0.36754999999999999,0.36754999999999999]
[null,82556063,"WB","RURAL SHORT",4,0.19611999999999999,0.15984999999999999,0,0,0,"",0,0,0,0,"",0,0,0,0]
[null,82556066,"WB","RURAL SHORT",1667,52.527829999999994,7.4597099999999994,2.7840000000000003,0.15251929511758472,0.26580668099451787,34,22.291069999999998,22.065189999999998,1.12178,1.1211799999999998,61,38.848300000000002,38.448250000000002,0.39171999999999996,0.38331999999999999]
[null,82556069,"WB","RURAL SHORT",2517,19.498989999999999,10.31128,4.3980000000000006,0.26346450794508808,0.1138874669149874,42,37.933509999999998,37.458289999999998,1.1736199999999999,1.1720299999999999,32,16.397469999999998,16.397469999999998,7.3900000000000007E-2,7.3900000000000007E-2]
[null,82561111,"CA","RURAL SHORT",1585,11.91789,9.78233,4.82,0.9644126433861302,5.3337279658900137E-2,14,106.59473,106.59473,0.89210999999999996,0.89210999999999996,14,5.89527,5.89527,8.8959999999999997E-2,8.8959999999999997E-2]
[null,82561236,"CA","RURAL SHORT",544,20.351669999999999,3.3042699999999998,3.35,0.45673155971024887,6.8816567535221099E-2,15,18.812809999999999,3.8275099999999997,0.10846,0.10661999999999999,5,2.8345599999999997,2.8345599999999997,7.7210000000000001E-2,7.7210000000000001E-2]
[null,82561856,"NQ","RURAL LONG",305,729.43633,0.25033,1.0010000000000001,6.1239980152920079,8.8154756659630564,37,527.63656000000003,355.12623000000002,2.4688499999999998,1.9377000000000002,36,759.53115000000003,759.33443,2.6557399999999998,2.65246]
[null,82561865,"NQ","RURAL SHORT",907,57.744569999999996,0.19058999999999998,2.323,1.2573076536389867,2.3049233489629217,40,116.94309,116.7998,4.1212799999999996,4.1201799999999995,86,214.38257999999999,201.07276999999999,0.92061999999999999,0.87981999999999994]
[null,82563086,"MK","RURAL SHORT",292,79.796179999999993,0.44161999999999996,2.4450000000000003,102.42989092619203,0.39498390467705358,60,11822.457420000001,883.19417999999996,11,8.9691799999999997,7,45.589039999999997,45.589039999999997,0.22602999999999998,0.22602999999999998]
[null,82563096,"MK","URBAN",17,0,2.8427599999999997,4.82,48.228948446115012,116.972779329665,7,29.128429999999998,23.58137,0.41175999999999996,0.35293999999999998,7,70.647059999999996,70.647059999999996,0.88234999999999997,0.88234999999999997]
[null,82563099,"MK","URBAN",1118,5.7702799999999996,2.5611099999999998,2.944,32.780958597407292,0.31479930224857844,46,2977.3027999999999,23.066309999999998,1.11896,0.13505999999999999,161,28.591379999999997,28.591379999999997,0.49195,0.49195]
[null,82563102,"MK","URBAN",168,1.35385,0.41782999999999998,1.345,35.9935701149316,4.5158401213238206E-2,13,2002.1135899999999,33.188000000000002,0.53571000000000002,0.15475999999999998,8,2.5119000000000002,2.5119000000000002,5.357E-2,5.357E-2]
[null,82563105,"MK","RURAL SHORT",162,1.99874,4.92171,1.726,3.7928002738168203E-2,5.7158527491326654E-2,2,1.0772599999999999,1.0772599999999999,1.235E-2,1.235E-2,12,1.6234599999999999,1.6234599999999999,7.4069999999999997E-2,7.4069999999999997E-2]
[null,82563108,"MK","URBAN",1213,5.4939299999999998,1.61419,4.4030000000000005,15.057144925004778,0.28315137663693196,42,1610.0840800000001,55.437429999999999,2.0486399999999998,1.0544099999999998,46,30.277819999999998,30.277819999999998,0.16570000000000001,0.16570000000000001]
[null,82563111,"MK","URBAN",77,2.4917000000000002,1.3158000000000001,1.6260000000000001,73.138651418589802,10.732069701303072,3,1216.95758,0.91211999999999993,0.22077999999999998,1.299E-2,12,178.57142999999999,178.57142999999999,0.71428999999999998,0.71428999999999998]
[null,82563114,"MK","RURAL SHORT",767,2.7946499999999999,8.2743500000000001,4.05,32.619617791396678,2.8426848855618487E-2,30,2327.8966500000001,343.98358999999999,3.8370299999999999,2.3024800000000001,88,2.02868,2.02868,0.11473,0.11473]
[null,82563117,"MK","URBAN",304,5.2997899999999998,4.1282100000000002,2.6670000000000003,14.104277222995808,2.6538565712306856,15,609.64452000000006,7.1374499999999994,0.16775999999999999,2.632E-2,14,114.71053000000001,114.71053000000001,0.78617999999999999,0.78617999999999999]
[null,82563120,"MK","URBAN",225,0.76870000000000005,2.1377999999999999,3.1910000000000003,0.95577030404916885,1.1882337868182216,4,15.558149999999999,15.558149999999999,0.12,0.12,6,19.342219999999998,19.342219999999998,0.11556,0.11556]
[null,82563123,"MK","URBAN",516,2.0111599999999998,0.59287999999999996,1.7890000000000001,73.231881989729359,0.11035199917399131,30,4964.2950300000002,1147.9678899999999,2.4263599999999999,1.44767,28,7.48062,7.48062,0.34883999999999998,0.34883999999999998]
[null,82563612,"CA","RURAL LONG",1743,972.7586,1.8894499999999999,5.51,9.1134718883271422,2.3523573233625057,137,637.70227999999997,591.25445999999999,3.5169199999999998,3.4308699999999996,40,164.60287,164.60287,1.2168699999999999,1.2168699999999999]
[null,82563748,"NQ","URBAN",1,3.1263000000000001,0.1004,2.0460000000000003,305512.92074639595,5561.2989873417728,2,23732.15,22.683329999999998,39,1,1,432,432,1,1]
[null,82563751,"NQ","RURAL SHORT",2,7.1798599999999997,7.2099999999999997E-2,1.0530000000000002,612952.26491212379,17179.593797468355,2,15413.366669999999,438.96667000000002,25,1,1,432,432,1,1]
[null,82564200,"NQ","RURAL SHORT",779,11.19314,0.21617,2.6390000000000002,1.8947329853319286,0.10942863727600873,14,175.70400000000001,175.70400000000001,2.97818,2.97818,65,10.147629999999999,10.147629999999999,0.15148,0.15148]
[null,82564420,"NQ","RURAL SHORT",1225,9.5796399999999995,4.2728000000000002,3.7330000000000001,1.3724999678476073,7.2224572078409474E-2,23,110.04807,108.87255999999999,1.99837,1.9975499999999999,12,5.7910199999999996,5.7910199999999996,5.3879999999999997E-2,5.3879999999999997E-2]
[null,82564423,"NQ","URBAN",5,0,2.0030799999999997,1.381,0,0,"",0,0,0,0,"",0,0,0,0]
[null,82564426,"NQ","RURAL SHORT",0,0,0,0,0,0,"",0,0,0,0,"",0,0,0,0]
[null,82564429,"NQ","URBAN",0,0,1.8541099999999999,2.931,0,0,"",0,0,0,0,"",0,0,0,0]
[null,82564432,"NQ","RURAL SHORT",0,0,0,0,0,0,"",0,0,0,0,"",0,0,0,0]
[null,82564435,"NQ","RURAL SHORT",0,0,0,0,0,0,"",0,0,0,0,"",0,0,0,0]
[null,82564438,"NQ","URBAN",19,0.56835999999999998,6.1818499999999998,3.84,0,24.948607795438903,"",0,0,0,0,8,74.157889999999995,74.157889999999995,0.52632000000000001,0.52632000000000001]
[null,82564441,"NQ","RURAL SHORT",0,0,0,0,0,0,"",0,0,0,0,"",0,0,0,0]
[null,82564444,"NQ","RURAL SHORT",3,0.84292,1.4945299999999999,0.21100000000000002,0,0,"",0,0,0,0,"",0,0,0,0]
[null,82564447,"NQ","URBAN",9,0,2.7733300000000001,1.248,0,1.7185030957122891,"",0,0,0,0,2,5.7777799999999999,5.7777799999999999,0.22222,0.22222]
[null,82564453,"NQ","RURAL SHORT",0,0,0,0,0,0,"",0,0,0,0,"",0,0,0,0]
[null,82566422,"CA","RURAL SHORT",1,3.6670000000000001E-2,0,0,19754.615385226512,0,2,1025.3833299999999,1012.68333,2,1,"",0,0,0,0]
[null,82604748,"SW","RURAL SHORT",72,1.6602399999999999,0.50627,0.61099999999999999,0,7.1279077690531585,"",0,0,0,0,2,246.70832999999999,246.70832999999999,1.3055599999999998,1.3055599999999998]
[null,82610438,"SW","URBAN",313,1.0597300000000001,2.3728199999999999,3.7950000000000004,0.25813272508479701,5.85925797186575E-2,2,8.5014399999999988,8.5014399999999988,6.0700000000000004E-2,6.0700000000000004E-2,7,1.9297099999999998,1.9297099999999998,0.12140999999999999,0.12140999999999999]
[null,82640307,"NQ","RURAL SHORT",0,0,0,0,0,0,"",0,0,0,0,"",0,0,0,0]
[null,82647120,"MK","RURAL SHORT",943,9.9633699999999994,7.0785,3.12,4.1364109395322144,2.4931047014982423E-2,19,331.30049000000002,314.80124999999998,2.85154,2.3160099999999999,21,1.9968199999999998,1.9968199999999998,3.8179999999999999E-2,3.8179999999999999E-2]
[null,82647125,"MK","URBAN",816,1.02773,4.7199799999999996,2.504,7.7395075091419345,3.0124505398559111E-3,14,925.64745000000005,2.8719600000000001,1.0049000000000001,1.593E-2,20,0.36029,0.36029,2.4510000000000001E-2,2.4510000000000001E-2]
[null,82647129,"MK","URBAN",472,0,6.36334,2.9820000000000002,2.3960470295565615,0.57114133964053104,6,104.31095000000001,104.30671,1.00424,1.0021199999999999,13,24.864409999999999,24.864409999999999,0.25635999999999998,0.25635999999999998]
[null,82647133,"MK","RURAL SHORT",15,0,6.9658199999999999,1.6280000000000001,0,0,"",0,0,0,0,"",0,0,0,0]
[null,82647141,"MK","URBAN",1692,7.2721199999999993,3.2053599999999998,3.8810000000000002,35.214761127579067,0.78550599611737382,66,4041.3841499999999,103.49011,2.2901899999999999,0.35342999999999997,53,90.147750000000002,90.147750000000002,1.2700899999999999,1.2700899999999999]
[null,82647144,"MK","URBAN",606,0.52851999999999999,4.7583599999999997,2.6510000000000002,0.22228683121954065,0.32392429426065278,9,14.03482,1.2156199999999999,1.4849999999999999E-2,9.9000000000000008E-3,23,20.45204,20.45204,0.21947,0.21947]
[null,82647147,"MK","URBAN",1015,0,7.6822000000000008,1.8230000000000002,1.0077711631133588E-2,1.7473751851482332E-2,4,1.35348,1.35348,0.14876999999999999,0.14876999999999999,28,2.3468,2.3468,6.1079999999999995E-2,6.1079999999999995E-2]
[null,82649838,"MK","RURAL SHORT",1295,15.019459999999999,20.82694,3.7330000000000001,163.43448037057092,0.8605802785769624,66,17276.708060000001,111.45336,6.18919,4.1791499999999999,29,90.972200000000001,90.972200000000001,0.33590999999999999,0.33590999999999999]
[null,82649845,"MK","RURAL SHORT",675,48.903079999999996,6.5902699999999994,3.7010000000000001,385.58576776667155,3.4118758201179804,212,14374.39551,275.16388000000001,7.3481499999999995,5.3318500000000002,12,127.19259,127.19259,0.79406999999999994,0.79406999999999994]
[null,82651966,"NQ","RURAL SHORT",4,7.0173399999999999,0,0,20.448920743250575,74.487255993150683,2,529.56667000000004,244,2,1,3,1929,1929,3,3]
[null,82652346,"MK","URBAN",94,0.45316000000000001,5.22973,2.056,0,0.1998265759577125,"",0,0,0,0,2,2.3723399999999999,2.3723399999999999,4.2549999999999998E-2,4.2549999999999998E-2]
[null,82652356,"MK","RURAL SHORT",189,12.57587,3.12906,1.0030000000000001,4.0130822676928082,6.3885883433152874E-3,12,382.21904999999998,172.06031999999999,1.20106,1.1746000000000001,4,0.60846999999999996,0.60846999999999996,2.1159999999999998E-2,2.1159999999999998E-2]
[null,82699749,"WB","RURAL SHORT",1415,90.238419999999991,3.4119599999999997,2.3199999999999998,1.0630926827645091,4.8296358024988377E-2,29,165.49396999999999,4.9719099999999994,0.19080999999999998,5.3000000000000005E-2,10,7.5184000000000006,7.5184000000000006,8.4100000000000008E-2,8.4100000000000008E-2]
[null,82736041,"NQ","URBAN",111,1.7914399999999999,7.7539999999999998E-2,1.45,7.2011377420301752,1.84878848232971,4,562.42763000000002,67.55210000000001,3.0630599999999997,1.0270299999999999,11,144.39520000000002,144.39520000000002,0.59458999999999995,0.59458999999999995]
[null,82756081,"MK","RURAL SHORT",5,14.095429999999999,6.9199999999999998E-2,2.0940000000000003,34.413077072735511,233.49003141478735,3,30.066669999999998,30.066669999999998,3,3,1,204,204,0.6,0.6]
[null,82756092,"MK","RURAL SHORT",1,0,0,3.7530000000000001,0,0,"",0,0,0,0,"",0,0,0,0]
[null,82758072,"WB","RURAL SHORT",1,0,0.3029,0,579.83987691062669,0,1,28337,28337,1,1,"",0,0,0,0]
[null,82772948,"MK","RURAL SHORT",0,0,0,0,0,0,"",0,0,0,0,"",0,0,0,0]
[null,82772961,"MK","URBAN",74,9.4699999999999993E-3,3.8240599999999998,1.718,890.88306311650956,0,18,14208.89279,1043.1603600000001,7.5,4.8918900000000001,"",0,0,0,0]
[null,82772968,"MK","RURAL SHORT",0,0,0,0,0,0,"",0,0,0,0,"",0,0,0,0]
[null,82772975,"MK","RURAL SHORT",0,0,0,0,0,0,"",0,0,0,0,"",0,0,0,0]
[null,82772982,"MK","RURAL SHORT",1068,3.05646,7.8635299999999999,2.5980000000000003,183.08558736657557,0.35618589561795139,26,16478.864229999999,1219.2993799999999,8.23034,6.2256599999999995,16,32.058990000000001,32.058990000000001,0.37546999999999997,0.37546999999999997]
[null,82773001,"MK","RURAL SHORT",268,12.44116,3.2939799999999999,0.77,244.3413905273546,4.2184100174401866,49,18658.434580000001,1320.99515,10.011189999999999,7.00373,2,322.12687,322.12687,0.97387999999999997,0.97387999999999997]
[null,82773016,"WB","RURAL SHORT",2018,8.9607399999999995,1.29725,2.6470000000000002,1.096444769334542,7.4784196823018498E-2,30,174.17920000000001,174.06086999999999,1.278,1.2775000000000001,195,11.88008,11.88008,0.18731,0.18731]
[null,82841186,"SW","RURAL SHORT",1350,33.185099999999998,4.2030799999999999,4.6660000000000004,1.9276078625265327,0.39138323913689704,33,155.25788,114.01035,8.0392600000000005,7.0533299999999999,15,31.523700000000002,31.523700000000002,0.14815,0.14815]
[null,82841189,"SW","RURAL SHORT",0,0,0,0,0,0,"",0,0,0,0,"",0,0,0,0]
[null,82842116,"NQ","RURAL SHORT",1,9.8539999999999989E-2,6.5519999999999995E-2,0,0,0,"",0,0,0,0,"",0,0,0,0]
[null,82842119,"NQ","RURAL SHORT",1,0.10170999999999999,4.1639999999999996E-2,0,0,1358.0838607594937,"",0,0,0,0,1,270,270,1,1]
[null,82843815,"NQ","URBAN",580,2.9025399999999997,0.60238999999999998,2.2960000000000003,1.3784109547220447E-2,2.7478108857409828E-2,5,0.80003000000000002,0.77760999999999991,8.6199999999999992E-3,6.9000000000000008E-3,5,1.59483,1.59483,7.9309999999999992E-2,7.9309999999999992E-2]
[null,82888836,"WB","URBAN",1574,6.4059200000000001,3.4174499999999997,2.9470000000000001,1.040707765598333,9.6494509065807615E-2,17,102.6028,102.6028,1.08704,1.08704,25,9.5133399999999995,9.4866599999999988,7.4329999999999993E-2,6.9889999999999994E-2]
[null,82889011,"FN","RURAL SHORT",1150,89.883319999999998,6.8083199999999993,3.371,1.7348536384567244,0.51037984102322953,44,179.01657,178.64877999999999,2.2504299999999997,2.24783,122,52.665219999999998,52.665219999999998,0.35913,0.35913]
[null,82889348,"NQ","RURAL SHORT",940,6.2643499999999994,2.6661000000000001,2.3690000000000002,3.4095251180468704,0.11654782683509425,8,469.62484000000001,469.62484000000001,1.1138299999999999,1.1138299999999999,4,16.053190000000001,16.053190000000001,0.21808999999999998,0.21808999999999998]
[null,82889352,"NQ","URBAN",840,2.1545000000000001,5.6662599999999994,2.798,2.8650700562460236,0.6727382081586698,6,285.18876999999998,219.25200000000001,2.1607099999999999,1.1476199999999999,6,66.964289999999991,66.964289999999991,0.59643000000000002,0.59643000000000002]
[null,82906218,"WB","URBAN",94,0.69101999999999997,1.7131099999999999,3.448,0,8.9392720360939367E-3,"",0,0,0,0,1,5.3189999999999994E-2,5.3189999999999994E-2,1.064E-2,1.064E-2]
[null,82906978,"NQ","URBAN",280,0,4.0921199999999995,1.7690000000000001,4.7823650905925434E-2,2.8825530699498021,5,1.3905399999999999,1.3905399999999999,1.7860000000000001E-2,1.7860000000000001E-2,3,83.81429,83.81429,0.55000000000000004,0.55000000000000004]
[null,82907503,"SW","RURAL SHORT",1166,13.1485,5.14513,3.8960000000000004,1.0478656150683572,3.1935095974984814E-3,12,117.06791,117.06791,0.85592000000000001,0.85592000000000001,13,0.35677999999999999,0.35677999999999999,1.115E-2,1.115E-2]
[null,82909162,"FN","URBAN",1258,0,17.58587,6.0449999999999999,1.5319550459541389,7.2161268868366948E-2,8,72.160479999999993,72.160479999999993,0.22733999999999999,0.22733999999999999,11,3.3990499999999999,3.3990499999999999,6.835999999999999E-2,6.835999999999999E-2]
[null,82912265,"NQ","RURAL SHORT",1,0,3.88245,0.80900000000000005,0,0,"",0,0,0,0,"",0,0,0,0]
[null,82912268,"NQ","URBAN",439,3.3164099999999999,2.64676,1.7750000000000001,0.59142117931797822,5.4329658983584536E-2,7,47.287430000000001,47.287430000000001,0.33712999999999999,0.33712999999999999,42,4.34396,4.34396,0.16172999999999998,0.16172999999999998]
[null,82912271,"NQ","RURAL SHORT",0,0,0,0,0,0,"",0,0,0,0,"",0,0,0,0]
[null,82912274,"NQ","RURAL SHORT",998,9.0490300000000001,0.44522999999999996,2.0960000000000001,0.19503637984705391,0.52905941807578372,15,25.13205,25.13205,0.18235999999999999,0.18235999999999999,154,68.17367999999999,68.17367999999999,0.53506999999999993,0.53506999999999993]
[null,82912277,"NQ","RURAL SHORT",597,8.5001300000000004,8.4316700000000004,1.7770000000000001,2.388751532883115,2.4421694705186268E-2,22,244.44954999999999,244.44954999999999,1.1323300000000001,1.1323300000000001,89,2.4991599999999998,2.4991599999999998,0.16918,0.16918]
[null,82912280,"NQ","URBAN",1370,3.6755,2.0716600000000001,2.3850000000000002,6.9673883268850462E-2,0.10542131903361804,11,9.0718199999999989,8.958219999999999,4.3799999999999999E-2,4.3069999999999997E-2,114,13.726279999999999,13.726279999999999,0.23065999999999998,0.23065999999999998]
[null,82912283,"NQ","RURAL SHORT",0,0,0,0,0,0,"",0,0,0,0,"",0,0,0,0]
[null,82912286,"NQ","RURAL SHORT",0,0,0,0,0,0,"",0,0,0,0,"",0,0,0,0]
[null,82912289,"NQ","URBAN",1389,5.57111,1.25291,3.536,1.1663885057851631,0.37088565112853128,10,127.64020000000001,127.39735999999999,1.0424799999999999,1.04104,197,40.586749999999995,40.586749999999995,0.35420999999999997,0.35420999999999997]
[null,82912292,"NQ","RURAL SHORT",0,0,0,0,0,0,"",0,0,0,0,"",0,0,0,0]
[null,82912317,"NQ","URBAN",1608,6.56602,3.6263199999999998,3.5870000000000002,1.4731012286973159E-2,0.18983942781988622,18,1.7483499999999998,1.6781599999999999,1.9900000000000001E-2,1.9279999999999999E-2,19,22.531089999999999,22.531089999999999,0.14427999999999999,0.14427999999999999]
[null,82912323,"NQ","URBAN",1285,4.09877,6.0695499999999996,3.2830000000000004,6.9115679198443691E-2,2.9004859359111481E-2,11,9.4407399999999999,9.4204899999999991,8.7160000000000001E-2,8.6379999999999998E-2,10,3.9618699999999998,3.9618699999999998,0.19144,0.19144]
[null,82912329,"NQ","RURAL SHORT",986,13.168379999999999,2.0966899999999997,3.4790000000000001,0.28164604380270736,0.25919076143454844,21,24.321469999999998,14.68759,0.20790999999999998,0.14807000000000001,9,22.382349999999999,22.382349999999999,7.7079999999999996E-2,7.7079999999999996E-2]
[null,82912338,"NQ","URBAN",601,0,6.6872799999999994,2.782,6.1162162630168382E-3,0.69053184093831843,3,0.43992999999999999,0.37670999999999999,6.6600000000000001E-3,4.9899999999999996E-3,5,49.668889999999998,49.668889999999998,0.40432999999999997,0.40432999999999997]
[null,82912341,"NQ","URBAN",90,0,3.0545100000000001,2.2989999999999999,0,0,"",0,0,0,0,"",0,0,0,0]
[null,82912886,"SW","URBAN",308,3.2955000000000001,1.3334699999999999,3.37,3.7488408405836791,1.2277854070449623E-2,7,59.482029999999995,58.74145,1.01623,1.0097399999999999,1,0.19480999999999998,0.19480999999999998,6.4900000000000001E-3,6.4900000000000001E-3]
[null,82912904,"SW","URBAN",1598,5.0901699999999996,8.0251699999999992,5.6430000000000007,0.21760941234292608,0.12441336214458393,7,21.551600000000001,21.551600000000001,1.1076299999999999,1.1076299999999999,13,12.32165,12.32165,8.1349999999999992E-2,8.1349999999999992E-2]
[null,82912996,"NQ","URBAN",294,0,1.6339699999999999,1.325,1.9666441433456552,0.3056709138290255,1,62.040819999999997,62.040819999999997,0.96938999999999997,0.96938999999999997,1,9.6428599999999989,9.6428599999999989,0.35713999999999996,0.35713999999999996]
[null,82914179,"NQ","RURAL SHORT",884,9.0282699999999991,8.0717400000000001,2.74,6.0336123196579943E-3,6.8474333333820539E-2,8,0.75435999999999992,0.75435999999999992,9.049999999999999E-3,9.049999999999999E-3,31,8.5610900000000001,8.5610900000000001,8.7100000000000011E-2,8.7100000000000011E-2]
[null,82914276,"NQ","RURAL SHORT",427,5.7470099999999995,4.6140799999999995,1.415,0.45848806389705604,0.61503161156294595,7,31.800349999999998,31.800349999999998,9.3679999999999999E-2,9.3679999999999999E-2,6,42.658079999999998,42.658079999999998,0.30912999999999996,0.30912999999999996]
[null,82914279,"NQ","RURAL SHORT",657,0,9.113669999999999,1.7510000000000001,1.3994360638867198E-2,7.7407168440555188E-2,3,1.9754699999999998,1.9754699999999998,7.7629999999999991E-2,7.7629999999999991E-2,11,10.92694,10.92694,0.27854000000000001,0.27854000000000001]
[null,82914282,"NQ","RURAL SHORT",442,20.217649999999999,1.6882599999999999,1.21,0.30351777412752967,2.4259469270971123E-2,14,37.49615,37.49615,0.34842000000000001,0.34842000000000001,26,2.9969799999999998,2.9969799999999998,6.5610000000000002E-2,6.5610000000000002E-2]
[null,82914591,"CA","URBAN",622,3.8352399999999998,4.1355399999999998,3.3030000000000004,2.2699059930672028,0.49894981778597525,13,117.30348000000001,117.30348000000001,1.32315,1.32315,7,25.784569999999999,25.784569999999999,0.14790999999999999,0.14790999999999999]
[null,82915225,"WB","RURAL SHORT",0,0,0,0,0,0,"",0,0,0,0,"",0,0,0,0]
[null,82915228,"WB","URBAN",252,1.69316,0.94003999999999999,3.2490000000000001,0.14694214282450233,3.4278276216032157,5,3.6105199999999997,3.6105199999999997,2.7779999999999999E-2,2.7779999999999999E-2,20,84.225259999999992,84.225259999999992,0.55555999999999994,0.55555999999999994]
[null,82915231,"WB","URBAN",411,2.8181499999999997,0.87524999999999997,3.0609999999999999,1.3216219741555575,1.4996709859542516E-2,11,51.461149999999996,50.595619999999997,1.1630199999999999,1.15815,10,0.58394000000000001,0.58394000000000001,2.92E-2,2.92E-2]
[null,82915234,"WB","URBAN",0,0.50597000000000003,0.25051999999999996,0.30299999999999999,0,0,"",0,0,0,0,"",0,0,0,0]
[null,82915237,"WB","URBAN",243,3.3591199999999999,0.80353999999999992,2.1160000000000001,1.9114377122733527E-2,1.0770814181810713,2,0.57833000000000001,0.57833000000000001,8.2299999999999995E-3,8.2299999999999995E-3,25,32.588479999999997,32.588479999999997,0.21811,0.21811]
[null,82915256,"WB","URBAN",188,3.8794399999999998,0.35365999999999997,4.008,0,0.17520438986478401,"",0,0,0,0,10,4.5819999999999999,4.5819999999999999,6.3829999999999998E-2,6.3829999999999998E-2]
[null,82915259,"WB","URBAN",2782,15.946389999999999,1.31331,5.3980000000000006,0.60845767920689342,7.3127771155093405E-2,40,73.556479999999993,73.384799999999998,1.2893599999999998,1.2882799999999999,556,8.8404199999999999,8.8404199999999999,0.23257,0.23257]
[null,82915262,"WB","RURAL SHORT",0,0,0,0,0,0,"",0,0,0,0,"",0,0,0,0]
[null,82915265,"WB","RURAL SHORT",0,0,0,0,0,0,"",0,0,0,0,"",0,0,0,0]
[null,82915268,"WB","URBAN",110,0.58035999999999999,1.6038599999999998,1.8470000000000002,3.8185353519274233E-2,0.14314136531677715,1,0.80514999999999992,0.80514999999999992,9.0899999999999991E-3,9.0899999999999991E-3,7,3.0181800000000001,3.0181800000000001,6.3640000000000002E-2,6.3640000000000002E-2]
[null,82915271,"WB","URBAN",1065,6.6643099999999995,0.96880999999999995,2.8770000000000002,5.3962383194212163E-2,0.10956303138745367,13,4.7853399999999997,0.82440999999999998,1.7839999999999998E-2,1.0329999999999999E-2,135,9.715959999999999,9.715959999999999,0.16807999999999998,0.16807999999999998]
[null,82915274,"WB","RURAL SHORT",0,0,0,0,0,0,"",0,0,0,0,"",0,0,0,0]
[null,82917283,"SW","RURAL SHORT",0,0,0,0,0,0,"",0,0,0,0,"",0,0,0,0]
[null,82917286,"SW","RURAL SHORT",449,22.857589999999998,2.76905,1.6740000000000002,1.132119506905684,0.48397316292967707,20,63.506349999999998,63.399849999999994,0.70823999999999998,0.70600999999999992,19,27.148519999999998,26.7699,0.11803999999999999,0.11581]
[null,82917289,"SW","URBAN",255,4.3281900000000002,0.87287999999999999,1.681,0.14316307685108218,2.1760778202641544E-2,9,7.2497400000000001,3.2941799999999999,3.5289999999999995E-2,3.1370000000000002E-2,5,1.1019600000000001,1.1019600000000001,1.9609999999999999E-2,1.9609999999999999E-2]
[null,82920982,"FN","URBAN",1085,9.5108699999999988,3.7039899999999997,3.9380000000000002,0.30371526053564912,0.14712349564248084,10,18.560169999999999,18.560169999999999,0.11335999999999999,0.11335999999999999,12,8.9907799999999991,8.9907799999999991,9.7700000000000009E-2,9.7700000000000009E-2]
[null,82920985,"FN","URBAN",1486,3.8562099999999999,1.15326,3.407,2.6680639900971759,0.4143095666799233,10,231.94053,231.94053,1.0356699999999999,1.0356699999999999,73,36.016819999999996,36.016819999999996,0.29879,0.29879]
[null,82921002,"FN","URBAN",1810,8.3131299999999992,2.9020099999999998,4.7540000000000004,2.7673742626070315,0.85261126657093966,25,279.67890999999997,279.64905999999996,3.0668500000000001,3.0663,21,86.167379999999994,86.167379999999994,0.62043999999999999,0.62043999999999999]
[null,82921005,"FN","URBAN",389,0,8.3948900000000002,4.0979999999999999,6.2888740159201106E-3,5.6904984612101535E-2,1,0.24176999999999998,0.24176999999999998,2.5699999999999998E-3,2.5699999999999998E-3,25,2.1876599999999997,2.1876599999999997,0.15681,0.15681]
[null,82921008,"FN","URBAN",625,0,4.5985000000000005,4.1520000000000001,7.5856162497413768E-2,0.19727068755460889,2,0.81520000000000004,0.81520000000000004,3.2000000000000002E-3,3.2000000000000002E-3,13,2.12,2.12,5.6000000000000001E-2,5.6000000000000001E-2]
[null,82921011,"FN","URBAN",1377,8.8823699999999999,1.15395,3.6710000000000003,0.2811814969425589,0.38250055656503323,23,28.805579999999999,28.722379999999998,1.0748,1.07335,12,39.185189999999999,39.185189999999999,0.22366999999999998,0.22366999999999998]
[null,82921014,"FN","URBAN",153,0,5.6123399999999997,3.1580000000000004,1.5898648206547673E-3,5.8824511869483226E-3,1,0.13072,0,6.5399999999999998E-3,0,2,0.48365999999999998,0.48365999999999998,1.307E-2,1.307E-2]
[null,82921017,"FN","URBAN",2086,8.1022800000000004,4.7089099999999995,4.6989999999999998,0.90898109947454542,0.15349369289022935,17,59.645289999999996,59.645289999999996,1.1912799999999999,1.1912799999999999,204,10.071909999999999,10.071909999999999,0.17018,0.17018]
[null,82921882,"SW","URBAN",1092,7.3898199999999994,2.14364,4.9249999999999998,3.6323968060826259,0.11433749493524589,20,366.23424999999997,366.22696999999999,1.3791199999999999,1.3782099999999999,26,11.52801,11.52801,8.3330000000000001E-2,8.3330000000000001E-2]
[null,82934570,"NQ","RURAL SHORT",349,68.638869999999997,2.3533200000000001,2.355,37.540849464770154,3.3459596208811915,16,1190.0925,433.30854999999997,3.1031499999999999,1.08596,13,106.07116000000001,106.07116000000001,0.32378000000000001,0.32378000000000001]
[null,82935792,"NQ","RURAL SHORT",1,0,8.4682099999999991,1.4370000000000001,0,2969.3795094936709,"",0,0,0,0,1,231,231,1,1]
[null,82962852,"NQ","RURAL SHORT",113,29.232029999999998,0.38783999999999996,1.35,3.6614843323168036,1.8356606851962343,11,139.00708,137.55028999999999,1.07965,1.0708,3,69.690269999999998,69.690269999999998,0.52212000000000003,0.52212000000000003]
[null,82962855,"NQ","RURAL SHORT",65,52.171019999999999,0.64757999999999993,0.752,5.365557305131448,1.0247062082089731,17,375.39462000000003,375.39462000000003,2.69231,2.69231,3,71.692309999999992,71.692309999999992,0.32307999999999998,0.32307999999999998]
[null,82962940,"NQ","RURAL SHORT",37,25.185879999999997,0.34847,0.70300000000000007,7.0457819866201161,5.1498813387726274,7,169.72386999999998,169.72386999999998,1.6756799999999998,1.6756799999999998,1,124.05405,124.05405,0.48648999999999998,0.48648999999999998]
[null,82980894,"SW","RURAL SHORT",644,79.215760000000003,3.0201899999999999,2.2789999999999999,2.7011451889291007,0.65010662927388163,47,282.36725999999999,280.95947000000001,2.75,2.7391299999999998,15,67.95962999999999,67.95962999999999,0.24067999999999998,0.24067999999999998]
[null,82982249,"NQ","RURAL SHORT",153,11.547559999999999,2.8462499999999999,4.1029999999999998,1.8475809722051812,0.64591547893575896,3,26.379300000000001,26.366229999999998,1,0.99346000000000001,6,9.2222200000000001,9.2222200000000001,5.2289999999999996E-2,5.2289999999999996E-2]
[null,82987762,"SW","RURAL SHORT",1059,73.389960000000002,14.442489999999999,3.1420000000000003,3.6535907959477729,0.18559452762094628,35,529.29157999999995,529.27836000000002,4.4079299999999995,4.4069899999999995,28,26.886869999999998,26.886869999999998,0.19735999999999998,0.19735999999999998]
[null,82988070,"SW","URBAN",1119,3.4839199999999999,4.00101,4.101,4.8123463913130647E-3,0.43286851665057363,4,0.23104,0.23104,3.5699999999999998E-3,3.5699999999999998E-3,15,20.781949999999998,20.781949999999998,8.5789999999999991E-2,8.5789999999999991E-2]
[null,82988107,"SW","RURAL SHORT",1883,7.0857899999999994,7.0037699999999994,3.6230000000000002,0.61293094847778884,4.7196600375163229E-4,13,84.829520000000002,84.829520000000002,2.0037199999999999,2.0037199999999999,7,6.5320000000000003E-2,6.5320000000000003E-2,4.2499999999999994E-3,4.2499999999999994E-3]
[null,82991938,"SW","RURAL SHORT",662,8.3778600000000001,3.6231,2.109,0.94085717209584485,3.2581696080532258E-3,16,86.803849999999997,86.803849999999997,0.61026999999999998,0.61026999999999998,21,0.30060000000000003,0.30060000000000003,3.1719999999999998E-2,3.1719999999999998E-2]
[null,83004280,"CA","URBAN",1,0,2.9279999999999997E-2,10.735000000000001,0,43316.16008438819,"",0,0,0,0,1,368,368,1,1]
[null,83016237,"CA","RURAL LONG",178,210.57391000000001,0,0.42500000000000004,1.6995762685302778,2.5181873408848268,12,227.78567000000001,92.351399999999998,3.6629199999999997,3.5393299999999996,14,337.5,337.5,1.4157299999999999,1.4157299999999999]
[null,83022292,"CA","RURAL LONG",877,344.85075999999998,0.42354999999999998,0.58300000000000007,3.889125638441945,3.9194206578043236,52,428.86905999999999,288.56851,6.1858599999999999,4.7742300000000002,74,432.20981,432.20981,2.17218,2.17218]
[null,83022295,"CA","RURAL SHORT",892,11.63228,4.40116,2.137,0.26877260072906911,2.073642890798531E-2,9,24.150019999999998,24.065269999999998,2.1670400000000001,2.1659199999999998,10,1.8632299999999999,1.8632299999999999,4.8209999999999996E-2,4.8209999999999996E-2]
[null,83022298,"CA","RURAL SHORT",308,9.0516000000000005,4.5530299999999997,1.3720000000000001,1.3352582631622993,1.8713782063703082,8,78.294479999999993,54.135709999999996,3.9155799999999998,2.9220799999999998,12,109.73052,109.73052,0.60714000000000001,0.60714000000000001]
[null,83022301,"CA","RURAL SHORT",457,36.821529999999996,0.13652,0,1.1811130112390047,0.33504322281468668,14,152.68135999999998,13.91893,3.0765899999999999,2.0612699999999999,12,43.310719999999996,43.310719999999996,0.30852999999999997,0.30852999999999997]
[null,83029792,"WB","RURAL SHORT",1737,28.416339999999998,4.38504,4.1320000000000006,0.20329877857660553,0.4149310446700355,24,19.18552,19.18552,0.14910999999999999,0.14910999999999999,45,39.15748,39.15748,0.29705999999999999,0.29705999999999999]
[null,83031320,"FN","RURAL SHORT",152,12.325100000000001,0.31590000000000001,0.441,3.4347413373093598,3.7536319269326087E-3,7,270.89900999999998,270.89900999999998,2.1710499999999997,2.1710499999999997,2,0.29604999999999998,0.29604999999999998,1.316E-2,1.316E-2]
[null,83031323,"FN","RURAL SHORT",45,77.723230000000001,0.19144999999999998,0.12,3.5803357838670413,0,5,526.92741000000001,526.92741000000001,3.0222199999999999,3.0222199999999999,"",0,0,0,0]
[null,83832366,"MK","RURAL SHORT",1336,56.125029999999995,2.1265000000000001,4.5,25.361710708867761,1.0928286906241262,59,3291.4725800000001,267.41377,3.67889,2.6826300000000001,32,141.82858999999999,141.82858999999999,1.5741000000000001,1.5741000000000001]
[null,83850808,"SW","RURAL SHORT",885,42.009,6.48726,2.2130000000000001,0.2303213496821743,0.82398689216474319,17,33.663129999999995,33.663129999999995,2.0745800000000001,2.0745800000000001,34,120.43164,120.43164,0.53445999999999994,0.53445999999999994]
[null,83850831,"SW","RURAL SHORT",1570,30.654969999999999,7.4178699999999997,4.1580000000000004,6.1477242785172583,0.20336849903826437,48,903.49572000000001,903.49572000000001,10.333119999999999,10.333119999999999,58,29.887900000000002,29.887900000000002,0.1535,0.1535]
[null,83858040,"NQ","RURAL SHORT",159,0,0.29998999999999998,0,0,2.7167615515009268E-3,"",0,0,0,0,1,0.11950000000000001,0.11950000000000001,6.2899999999999996E-3,6.2899999999999996E-3]
[null,83864041,"FN","RURAL SHORT",1227,140.45875999999998,0.82906999999999997,3.0510000000000002,2.2978973380952885,1.848025290350092,53,244.81360000000001,244.81360000000001,2.9331700000000001,2.9331700000000001,155,196.88508999999999,196.77913999999998,1.18011,1.17848]
[null,83864058,"FN","RURAL SHORT",979,51.488669999999999,8.4341899999999992,1.9350000000000001,7.1737064387868683,1.4946981674826043,25,350.58181999999999,343.85327000000001,2.1389199999999997,2.0847799999999999,58,73.046480000000003,73.046480000000003,0.59345999999999999,0.59345999999999999]
[null,83868946,"CA","RURAL SHORT",902,186.27355,0.30080999999999997,1.9000000000000001,3.7949903306147013,0.15114690803974073,48,485.42698000000001,241.12853000000001,3.1862499999999998,2.7915699999999997,9,19.333589999999997,19.333589999999997,7.6499999999999999E-2,7.6499999999999999E-2]
[null,83868949,"CA","RURAL SHORT",1830,41.12764,7.93607,3.2710000000000004,0.55778546211979441,0.14487610268143325,43,70.132589999999993,62.427759999999999,1.7393399999999999,1.5683099999999999,15,18.21585,18.21585,0.12514,0.12514]
[null,83868952,"CA","RURAL SHORT",837,30.977429999999998,5.1509399999999994,2.3180000000000001,2.347471021108694,0.54541080303375356,31,226.93152000000001,207.8237,3.9641599999999997,3.9068099999999997,11,52.725209999999997,52.725209999999997,0.17920999999999998,0.17920999999999998]
[null,83873146,"NQ","RURAL SHORT",0,0,0,0,0,0,"",0,0,0,0,"",0,0,0,0]
[null,83873150,"NQ","URBAN",1030,0,8.5559000000000012,3.39,0.39530358130147231,0.26556002655246064,6,24.392250000000001,24.392250000000001,0.20096999999999998,0.20096999999999998,8,16.386409999999998,16.386409999999998,0.21164999999999998,0.21164999999999998]
[null,83877341,"CA","URBAN",1202,6.6022699999999999,0.20507,3.419,0.7960142929143309,0.43200616936050762,20,85.665539999999993,85.665539999999993,1.14642,1.14642,18,46.491679999999995,46.491679999999995,0.19966999999999999,0.19966999999999999]
[null,83877378,"CA","URBAN",1,0,0.30841999999999997,2.2330000000000001,0,0,"",0,0,0,0,"",0,0,0,0]
[null,83877381,"CA","URBAN",735,3.9308299999999998,1.9626699999999999,3.4860000000000002,2.9097205992482573,7.5946974079476481E-2,22,181.45004999999998,181.34528,1.3551,1.3537399999999999,7,4.7360499999999996,4.7360499999999996,5.0339999999999996E-2,5.0339999999999996E-2]
[null,83877404,"CA","URBAN",1029,7.0790899999999999,0.59834999999999994,2.5910000000000002,1.6263722782209893,4.9507622068920849E-2,37,206.20441,3.8847399999999999,3.984E-2,1.4579999999999999E-2,31,6.2769699999999995,6.2769699999999995,0.23421,0.23421]
[null,83879351,"MK","RURAL SHORT",962,58.515719999999995,1.8937000000000002,1.7810000000000001,55.832744955904261,0.11772445792532234,49,8198.1011400000007,509.67585000000003,4.1444900000000002,3.1486499999999999,16,17.28586,17.28586,1.0270299999999999,1.0270299999999999]
[null,83879448,"NQ","RURAL SHORT",308,3.0224899999999999,5.8437599999999996,2.3069999999999999,0.19519340425262355,0.18756684507936158,6,9.2916100000000004,9.2916100000000004,5.1949999999999996E-2,5.1949999999999996E-2,4,8.9285699999999988,8.7337699999999998,2.597E-2,2.273E-2]
[null,83879451,"NQ","URBAN",1247,7.2196899999999999,1.3085899999999999,3.4290000000000003,0.55739024112054913,1.7522053282727854,26,60.822519999999997,22.946619999999999,1.24298,0.24778999999999998,75,191.20094999999998,191.20094999999998,1.1611899999999999,1.1611899999999999]
[null,83896573,"FN","RURAL SHORT",2889,25.619800000000001,23.706759999999999,7.7640000000000002,0.24110948702674148,0.1876587062486039,37,21.802519999999998,21.63185,0.16302999999999998,0.16199,93,16.969189999999998,16.969189999999998,0.15611,0.15611]
[null,83897499,"NQ","RURAL SHORT",0,0,0,0,0,0,"",0,0,0,0,"",0,0,0,0]
[null,83897502,"NQ","RURAL SHORT",1055,8.8024299999999993,1.7858099999999999,2.9079999999999999,1.998479794884279,0.92836029412565635,23,217.06550000000001,217.00825,2.0720399999999999,2.0710899999999999,125,100.83414,100.83414,0.44455,0.44455]
[null,83897505,"NQ","RURAL SHORT",1756,17.602679999999999,5.8188199999999997,5.1360000000000001,4.1918400158373545,0.8138569770339229,70,497.9889,497.87529000000001,4.5803000000000003,4.5791599999999999,236,96.685879999999997,96.685879999999997,0.53928999999999994,0.53928999999999994]
[null,83897508,"NQ","RURAL SHORT",0,0,0,0,0,0,"",0,0,0,0,"",0,0,0,0]
[null,83897511,"NQ","RURAL SHORT",0,0,0,0,0,0,"",0,0,0,0,"",0,0,0,0]
[null,83900896,"FN","URBAN",2657,11.642349999999999,15.88913,9.8920000000000012,1.3048706068560383,0.49189707412357792,19,132.63127,128.72302999999999,2.7297699999999998,2.6992799999999999,27,49.998010000000001,49.998010000000001,0.28265000000000001,0.28265000000000001]
[null,83909005,"MK","URBAN",310,3.6094000000000004,3.8484699999999998,3.5980000000000003,2.6512838098738905,9.5534184280884962E-2,6,50.043600000000005,7.73543,0.99676999999999993,0.99031999999999998,10,1.8032299999999999,1.8032299999999999,3.5479999999999998E-2,3.5479999999999998E-2]
[null,83909007,"MK","RURAL SHORT",1410,134.69900000000001,6.8602400000000001,4.6219999999999999,43.70262544554344,0.32116292280643277,18,4239.2072600000001,7.2164799999999998,2.0517699999999999,1.0815599999999999,43,31.153189999999999,31.153189999999999,0.28226999999999997,0.28226999999999997]
[null,83915972,"NQ","RURAL SHORT",33,13.182779999999999,0.9309099999999999,0,2.8425730090005152,0,2,93.518689999999992,93.518689999999992,6.0609999999999997E-2,6.0609999999999997E-2,"",0,0,0,0]
[null,83921739,"SW","RURAL SHORT",128,189.67732000000001,0.52939000000000003,0,50.548475449338234,5.6309991041978416,25,617.01628000000005,617.01628000000005,3.5859399999999999,3.5859399999999999,9,68.734380000000002,68.734380000000002,0.28905999999999998,0.28905999999999998]
[null,83922680,"WB","RURAL SHORT",0,0,0,0,0,0,"",0,0,0,0,"",0,0,0,0]
[null,83922695,"WB","RURAL SHORT",0,0,0,0,0,0,"",0,0,0,0,"",0,0,0,0]
[null,83922716,"WB","RURAL SHORT",146,122.11948,0.23326,0.23600000000000002,2.8026376344065498,0.28414450116273698,39,595.39383999999995,585.67670999999996,7.3835599999999992,7.3698600000000001,12,60.363809999999994,60.363809999999994,0.59588999999999992,0.59588999999999992]
[null,83924123,"NQ","RURAL SHORT",0,0,0,0,0,0,"",0,0,0,0,"",0,0,0,0]
[null,83924127,"NQ","URBAN",1178,0,12.559379999999999,4.3340000000000005,0.22475003782031247,9.0949261827258709E-2,7,20.75311,20.75311,0.12817999999999999,0.12817999999999999,10,8.3981300000000001,8.3981300000000001,8.5739999999999997E-2,8.5739999999999997E-2]
[null,83946269,"MK","RURAL SHORT",1096,25.570459999999997,3.84606,2.7869999999999999,1.0148308248151807,2.5274036079694895E-3,36,130.42528999999999,117.52253999999999,1.0958000000000001,1.0894200000000001,14,0.32482,0.32482,1.3689999999999999E-2,1.3689999999999999E-2]
[null,83950986,"MK","RURAL SHORT",94,15.137559999999999,0.21339,1.611,34.56047080357714,22.352051444595602,4,374.60514000000001,374.60514000000001,3.8617000000000004,3.8617000000000004,6,242.2766,242.2766,1.24468,1.24468]
[null,83999830,"FN","RURAL SHORT",0,0,0,0,0,0,"",0,0,0,0,"",0,0,0,0]
[null,84000793,"SW","RURAL LONG",99,206.10641000000001,1.20034,0,12.307710062104292,14.452417409763974,22,344.06448,342.54023999999998,6.4848499999999998,6.4747499999999993,10,404.02020000000005,404.02020000000005,1.2020199999999999,1.2020199999999999]
[null,84023546,"NQ","RURAL SHORT",303,135.72178,0.22064999999999999,1.3480000000000001,164.98179934354337,1.6314252925565607,180,13400.54862,568.61902999999995,3.76898,2.74587,13,132.51155,132.51155,0.46534999999999999,0.46534999999999999]
[null,84026518,"NQ","RURAL SHORT",307,13.239329999999999,0.9961000000000001,1.645,5.4239303961980703,5.3691696715076377E-3,5,273.11743000000001,12.396469999999999,2.25407,0.23779,5,0.27035999999999999,0.27035999999999999,1.6289999999999999E-2,1.6289999999999999E-2]
[null,84026521,"NQ","RURAL SHORT",0,0,0.36373,0,0,0,"",0,0,0,0,"",0,0,0,0]
[null,84026533,"NQ","RURAL SHORT",0,0,0.48270999999999997,0,0,0,"",0,0,0,0,"",0,0,0,0]
[null,84041077,"NQ","RURAL SHORT",355,153.69341,5.953E-2,0,3.0187123816905377,2.6787227474326425,56,564.95947999999999,562.88905999999997,5.0704199999999995,4.7746499999999994,34,501.32958000000002,501.32958000000002,1.99437,1.99437]
[null,84057540,"MK","RURAL SHORT",10,8.8249700000000004,4.965E-2,0,0,1.7520486870897156,"",0,0,0,0,1,117,117,0.5,0.5]
[null,84064137,"CA","URBAN",727,4.7955499999999995,0.43295,2.0790000000000002,0.41356212682132015,0.18585953813515851,16,49.681359999999998,49.681359999999998,0.57772000000000001,0.57772000000000001,22,22.327369999999998,22.327369999999998,0.21045,0.21045]
[null,84064752,"CA","URBAN",864,6.4714099999999997,0.57394999999999996,4.3769999999999998,0.27853443763267438,0.42434223959394812,16,19.26933,17.24221,0.10880000000000001,0.10417,33,29.356479999999998,29.356479999999998,0.21643999999999999,0.21643999999999999]
[null,84119333,"CA","RURAL SHORT",3,4.3609599999999995,0.59512999999999994,1.3860000000000001,0,2822.3237938953757,"",0,0,0,0,1,913.16666999999995,913.16666999999995,0.66666999999999998,0.66666999999999998]
[null,84119480,"CA","RURAL SHORT",284,172.89794999999998,8.3455099999999991,0.874,248.58993563699732,243.50243585634567,19,359.90204999999997,358.36601999999999,2.1760600000000001,2.1690100000000001,24,352.53649999999999,352.53649999999999,1.2042299999999999,1.2042299999999999]
[null,84195233,"NQ","URBAN",139,0,2.5741099999999997,2.1419999999999999,1.0003576931009461,0.2327241000962211,1,29.34712,29.34712,0.97121999999999997,0.97121999999999997,7,6.8273399999999995,6.8273399999999995,7.193999999999999E-2,7.193999999999999E-2]
[null,84195246,"NQ","URBAN",146,0,2.01362,2.1960000000000002,0.9558759914068683,3.6013660139172517E-2,4,30.905019999999997,30.905019999999997,1.0137,1.0137,4,1.16438,1.16438,2.7400000000000001E-2,2.7400000000000001E-2]
[null,84195249,"NQ","URBAN",4,0,1.4764599999999999,0.61399999999999999,21.39261406044054,0,1,30.216669999999997,30.216669999999997,1,1,"",0,0,0,0]
[null,84228730,"CA","RURAL SHORT",0,7.2329999999999992E-2,0,0,0,0,"",0,0,0,0,"",0,0,0,0]
[null,84231747,"MK","URBAN",41,0,4.1262599999999994,1.6020000000000001,0,1.2085464440165565,"",0,0,0,0,1,5.9024399999999995,5.9024399999999995,0.26828999999999997,0.26828999999999997]
[null,84242385,"NQ","RURAL SHORT",0,0,0,0,0,0,"",0,0,0,0,"",0,0,0,0]
[null,84242391,"NQ","RURAL SHORT",0,0,0,0,0,0,"",0,0,0,0,"",0,0,0,0]
[null,84247259,"CA","URBAN",544,4.1836000000000002,1.4844899999999999,3.9220000000000002,0.33577534676430743,3.7177197293040108E-2,4,13.066149999999999,0.62295,0.98529,5.5100000000000001E-3,20,1.44669,1.44669,6.25E-2,6.25E-2]
[null,84255558,"MK","RURAL SHORT",694,76.579939999999993,1.6228399999999998,1.788,138.85759531043377,0.41135896008628492,101,14548.563179999999,573.79435999999998,7.3573499999999994,6.3602299999999996,21,43.099419999999995,43.099419999999995,0.24351999999999999,0.24351999999999999]
[null,84291346,"CA","RURAL SHORT",0,0,0,9.1440000000000001,0,0,"",0,0,0,0,"",0,0,0,0]
[null,84326662,"FN","URBAN",2496,0,14.377709999999999,6.8680000000000003,1.6597586854935071,0.28097780324438681,9,156.44296,156.44296,1.0272399999999999,1.0272399999999999,8,26.483969999999999,26.483969999999999,0.11738999999999999,0.11738999999999999]
[null,84326665,"FN","RURAL SHORT",2416,15.584200000000001,4.8205900000000002,5.2149999999999999,4.0587821396561283,0.7215346371164193,41,437.76501999999999,437.67788999999999,2.2164699999999997,2.21523,32,77.822019999999995,77.822019999999995,0.39404,0.39404]
[null,84332230,"CA","RURAL SHORT",71,51.34883,0,0.24600000000000002,10.645414800405261,2.6734929834420651,4,1197.3554000000001,1197.3554000000001,1.02817,1.02817,1,300.70423,300.70423,0.98591999999999991,0.98591999999999991]
[null,84332376,"CA","RURAL SHORT",367,90.179450000000003,0.15281,0.91600000000000004,3.5023401542589707,2.7583949411188417E-2,17,327.28606000000002,146.59395999999998,0.86375999999999997,0.84195999999999993,2,2.5776599999999998,2.5776599999999998,1.09E-2,1.09E-2]
[null,84332614,"WB","RURAL SHORT",1673,58.586559999999999,12.660449999999999,3.3980000000000001,7.656652460890831E-2,0.34290244494900335,33,5.8722599999999998,5.8722599999999998,5.6779999999999997E-2,5.6779999999999997E-2,31,26.298859999999998,26.284520000000001,0.10640000000000001,0.1046]
[null,84333873,"WB","RURAL SHORT",0,0,0,0,0,0,"",0,0,0,0,"",0,0,0,0]
[null,84336483,"MK","URBAN",544,7.2359499999999999,8.9550799999999988,5.2560000000000002,153.86481877483067,1.5505213245110255E-2,8,5910.2926200000002,149.33017999999998,2.0018400000000001,0.99631999999999998,4,0.59558999999999995,0.59558999999999995,1.2869999999999999E-2,1.2869999999999999E-2]
[null,84375978,"WB","RURAL SHORT",551,78.02704,2.37887,2.2589999999999999,1.9314379798007042,3.9451988418377573,22,109.14400999999999,109.14400999999999,1.5934699999999999,1.5934699999999999,49,222.94002,222.94002,1.03085,1.03085]
[null,84382900,"FN","URBAN",975,2.8245100000000001,3.2710599999999999,2.4,1.6519555416970124,0.19228639981734941,11,201.34063,201.34063,1.12513,1.12513,7,23.4359,23.4359,0.11795,0.11795]
[null,84410770,"FN","URBAN",480,2.0149699999999999,2.8516000000000004,3.1,6.8755793978289874E-3,0.51648675423219736,4,0.66377999999999993,0.33416999999999997,8.3299999999999989E-3,4.1700000000000001E-3,4,49.862500000000004,49.862500000000004,0.21457999999999999,0.21457999999999999]
[null,84436738,"FN","RURAL SHORT",0,0,4.3929999999999997E-2,0,0,0,"",0,0,0,0,"",0,0,0,0]
[null,84510814,"WB","RURAL SHORT",0,0,0,0,0,0,"",0,0,0,0,"",0,0,0,0]
[null,84510817,"WB","URBAN",744,2.8316399999999997,2.6779799999999998,3.4850000000000003,8.7893302486020841E-2,0.15623643534777165,7,6.6351000000000004,6.6351000000000004,7.2579999999999992E-2,7.2579999999999992E-2,53,11.79435,11.79435,0.17338999999999999,0.17338999999999999]
[null,84510820,"WB","RURAL SHORT",1377,4.3795299999999999,6.4384699999999997,2.7490000000000001,2.8709155618177572E-3,0.25340727057925982,5,0.36962,0.36962,4.3600000000000002E-3,4.3600000000000002E-3,42,32.62527,32.003630000000001,0.36165999999999998,0.28394999999999998]
[null,84510823,"WB","URBAN",388,1.5498299999999998,2.7530000000000001,1.5190000000000001,1.7342048066019209,0.18960496411104352,8,60.135269999999998,60.135269999999998,0.43298999999999999,0.43298999999999999,50,6.5747399999999994,6.5747399999999994,0.19588,0.19588]
[null,84528118,"MK","URBAN",1,8.6699999999999999E-2,0,7.9,18568.587841772151,179337.74753270042,7,228.3,79.25,8,2,6,2204.9500000000003,2204.9500000000003,6,6]
[null,84571892,"WB","URBAN",5,0,5.8821699999999995,2.637,0,0,"",0,0,0,0,"",0,0,0,0]
[null,84572597,"MK","URBAN",14,1.0528299999999999,0.22800999999999999,4.8420000000000005,124.40708006343891,75.237591635086744,1,95.998809999999992,95.998809999999992,0.92857000000000001,0.92857000000000001,3,58.057139999999997,58.057139999999997,0.78571000000000002,0.78571000000000002]
[null,84577061,"NQ","RURAL SHORT",0,0,0.12439,0,0,0,"",0,0,0,0,"",0,0,0,0]
[null,84579665,"NQ","RURAL SHORT",102,89.259339999999995,0.28850000000000003,1.5,22.603515243328651,4.2510126399146584,17,1163.6864399999999,1045.52304,7.2941199999999995,6.3039199999999997,6,218.85293999999999,218.85293999999999,2.8823499999999997,2.8823499999999997]
[null,84587749,"CA","URBAN",114,1.6799299999999999,2.1248899999999997,3.4820000000000002,0.19960977117243378,0,4,2.7646199999999999,2.7646199999999999,3.5089999999999996E-2,3.5089999999999996E-2,"",0,0,0,0]
[null,84587754,"CA","URBAN",1,0,0.45093999999999995,3.673,19118.511503851161,0,1,779.38333,779.38333,1,1,"",0,0,0,0]
[null,84588730,"CA","URBAN",1,0.53259000000000001,0.21631999999999998,1.2670000000000001,5454.0281777021628,0,1,277.68333000000001,0,1,0,"",0,0,0,0]
[null,84653782,"NQ","RURAL SHORT",57,27.938479999999998,0,0.22,2.7294675531659358,0,6,472.73480000000001,472.73480000000001,4.4912299999999998,4.4912299999999998,"",0,0,0,0]
[null,84653808,"NQ","RURAL SHORT",20,179.55091999999999,0,0,26.144302179077638,8.3112315068703744,8,756.68832999999995,756.68832999999995,4.2,4.2,5,240.55,240.55,2.5500000000000003,2.5500000000000003]
[null,84653811,"NQ","RURAL SHORT",10,115.43916,0,0,30.018152350190356,3.0904737721198989,6,1078.1566700000001,1078.1566700000001,4.2,4.2,2,111,111,2,2]
[null,84653816,"NQ","RURAL SHORT",27,100.96742,0,0,6.107819522266861,1.6343595981761365,5,399.45801999999998,399.45801999999998,4.0740699999999999,4.0740699999999999,2,106.88889,106.88889,1.9259299999999999,1.9259299999999999]
[null,84658974,"MK","RURAL SHORT",0,1.1375,0.85942999999999992,0,0,0,"",0,0,0,0,"",0,0,0,0]
[null,84659987,"FN","RURAL SHORT",1157,15.243449999999999,3.3822399999999999,5,1.6655880106590801,3.8299880033101226,23,87.863200000000006,83.671229999999994,0.91703000000000001,0.87295,30,202.03976,202.03976,0.75627,0.75627]
[null,84659990,"FN","URBAN",0,0,2.46387,4.0999999999999996,0,0,"",0,0,0,0,"",0,0,0,0]
[null,84666984,"SW","URBAN",592,2.4595499999999997,1.4090399999999998,3.085,4.8345022041709216,4.4044926941767308E-2,4,243.99980000000002,243.99980000000002,2.62331,2.62331,7,2.2229700000000001,2.2229700000000001,7.2639999999999996E-2,7.2639999999999996E-2]
[null,84667056,"SW","URBAN",821,4.0026700000000002,0.40858,1.7050000000000001,3.0639022208993163,2.6125634045426381E-3,12,465.67838,119.44994,2.2898899999999998,1.2947599999999999,11,0.39707999999999999,0.39707999999999999,1.7049999999999999E-2,1.7049999999999999E-2]
[null,84668557,"SW","RURAL SHORT",993,253.09790000000001,0.5091,2.4630000000000001,3.3552881084681565,0.8920694935081146,58,467.07565,466.99140999999997,3.00806,3.00705,28,124.18127,103.01208,0.51460000000000006,0.43706]
[null,84670103,"SW","RURAL SHORT",233,1.8580099999999999,0.44246999999999997,0,1.8323288838934144,4.3466646416854826E-2,1,114.16159,114.16159,0.99141999999999997,0.99141999999999997,7,2.7081499999999998,2.7081499999999998,6.4379999999999993E-2,6.4379999999999993E-2]
[null,84670339,"SW","RURAL SHORT",433,143.71839,0.29158999999999996,2.1219999999999999,0.92139436006927999,0.31194656323703401,26,116.85527,116.54226,2.6905299999999999,2.6882199999999998,17,39.562429999999999,39.562429999999999,0.17782999999999999,0.17782999999999999]
[null,84706956,"FN","RURAL SHORT",3,30.048569999999998,0,2.5000000000000001E-2,9.9302526493055563,5.8412317811043124,7,1738.5611100000001,1734.3611100000001,5,4,7,1022.66667,1022.66667,6.3333300000000001,6.3333300000000001]
[null,84737242,"NQ","RURAL SHORT",1386,10.12697,8.8215799999999991,4.4160000000000004,2.1888150222408815,0.97941891766781919,20,250.05200000000002,250.04982999999999,2.1103899999999998,2.1096699999999999,67,111.88961,111.88961,0.55050999999999994,0.55050999999999994]
[null,84737245,"NQ","RURAL SHORT",816,10.053709999999999,7.2038099999999998,2.621,2.6198672035389157,5.1609178896797579E-2,10,344.03348,344.03348,3.1850499999999999,3.1850499999999999,22,6.7771699999999999,6.7771699999999999,0.11520000000000001,0.11520000000000001]
[null,84738836,"NQ","URBAN",73,0,5.4301499999999994,2.262,0.34836343723062047,1.4466616649949293,2,2.8401799999999997,2.621,2.7400000000000001E-2,1.37E-2,7,11.79452,11.79452,0.23287999999999998,0.23287999999999998]
[null,84928162,"NQ","RURAL SHORT",157,95.487920000000003,0.51744000000000001,0.40100000000000002,13.91834975720894,3.4457230153126681,26,1147.08737,1147.08737,5.8853499999999999,5.8853499999999999,3,283.98088999999999,283.98088999999999,0.67515999999999998,0.67515999999999998]
[null,84947451,"CA","URBAN",790,4.7918899999999995,1.03647,4.2930000000000001,4.2541313935681542,0.23315609027598283,14,133.26405,133.12649999999999,1.40886,1.4075899999999999,23,7.3038000000000007,7.18987,5.6959999999999997E-2,5.4429999999999999E-2]
[null,84962745,"CA","RURAL LONG",855,376.16448000000003,4.95974,0,1.2445455316202156,0.68913025680662221,51,128.50237999999999,115.30387999999999,1.5731000000000002,0.57075999999999993,16,71.154389999999992,71.154389999999992,0.59531999999999996,0.59531999999999996]
[null,84965669,"SW","RURAL SHORT",1502,11.26346,7.6103000000000005,3.2250000000000001,0.14290888712312125,3.3041953274038456E-3,17,15.232909999999999,15.232909999999999,0.20838999999999999,0.20838999999999999,6,0.35220000000000001,0.35220000000000001,8.6599999999999993E-3,8.6599999999999993E-3]
[null,84965685,"SW","RURAL SHORT",1294,110.06294,10.60594,3.5210000000000004,2.7735899299467635,0.94445237320675923,64,317.87522000000001,170.64668,4.07883,3.3299799999999999,67,108.24167,108.24167,0.51776999999999995,0.51776999999999995]
[null,84965737,"SW","RURAL SHORT",0,0,0,0,0,0,"",0,0,0,0,"",0,0,0,0]
[null,84965765,"SW","RURAL SHORT",721,69.617840000000001,5.5523099999999994,3.81,0.30216041777331992,0.20537483470986623,24,24.042189999999998,23.878159999999998,0.20804,0.20665999999999998,12,16.341190000000001,16.341190000000001,9.5700000000000007E-2,9.5700000000000007E-2]
[null,84982802,"SW","RURAL SHORT",117,118.92097,1.39689,0,11.71979457825414,3.2085948742021375,22,464.75754999999998,444.11054000000001,2.9145300000000001,2.1709399999999999,7,127.23931999999999,127.23931999999999,0.53845999999999994,0.53845999999999994]
[null,84997626,"SW","RURAL SHORT",0,0,0.57024999999999992,0,0,0,"",0,0,0,0,"",0,0,0,0]
[null,84997629,"SW","RURAL SHORT",0,0,0,0,0,0,"",0,0,0,0,"",0,0,0,0]
[null,84998125,"SW","URBAN",3,0,3.4610000000000002E-2,0.45600000000000002,0,0,"",0,0,0,0,"",0,0,0,0]
[null,84998156,"SW","RURAL SHORT",0,0,0.66298999999999997,0,0,0,"",0,0,0,0,"",0,0,0,0]
[null,84998159,"SW","URBAN",303,3.3329899999999997,1.90347,4.3639999999999999,3.3796443427635374E-2,0.24007376677324063,3,0.63464999999999994,0.63464999999999994,9.9000000000000008E-3,9.9000000000000008E-3,10,4.5082499999999994,4.5082499999999994,4.6200000000000005E-2,4.6200000000000005E-2]
[null,85005859,"CA","RURAL SHORT",1285,8.0560899999999993,13.047239999999999,3.9470000000000001,0.14671105447106178,0.17350188273731801,7,12.984539999999999,9.6449999999999994E-2,0.98987999999999998,3.8899999999999998E-3,9,15.355639999999999,15.355639999999999,0.12218,0.12218]
[null,85018902,"CA","URBAN",749,8.9334100000000003,2.4965799999999998,3.4750000000000001,1.3418742758579931,0.55633020011966039,9,79.750979999999998,68.1447,2.12283,1.1308399999999998,18,33.064109999999999,33.064109999999999,0.18157999999999999,0.18157999999999999]
[null,85018905,"CA","RURAL SHORT",733,1.6059099999999999,5.9600099999999996,0,0.54554989203565674,4.7665302565681197E-4,8,59.333109999999998,59.311279999999996,1.3547099999999999,1.35334,5,5.1839999999999997E-2,5.1839999999999997E-2,6.8199999999999997E-3,6.8199999999999997E-3]
[null,85068151,"MK","RURAL SHORT",687,131.87308999999999,1.3729899999999999,3.0060000000000002,181.48946266745926,1.6028657666019721,131,19840.04811,125.43455,3.5429399999999998,2.5283799999999998,41,175.22192999999999,175.22192999999999,0.7409,0.7409]
[null,85081013,"WB","RURAL SHORT",1888,106.73199,5.0918599999999996,4.577,6.2087023587772894,0.62354844233411622,65,780.19382999999993,150.57232999999999,2.4910000000000001,2.1091099999999998,73,78.355930000000001,78.355930000000001,0.38452999999999998,0.38452999999999998]
[null,85081026,"WB","RURAL SHORT",0,0,0.26504,0,0,0,"",0,0,0,0,"",0,0,0,0]
[null,85088208,"FN","RURAL SHORT",0,0,0.14288999999999999,0,0,0,"",0,0,0,0,"",0,0,0,0]
[null,85153112,"NQ","RURAL SHORT",0,0,0,0,0,0,"",0,0,0,0,"",0,0,0,0]
[null,85153140,"NQ","RURAL SHORT",0,0,0,0,0,0,"",0,0,0,0,"",0,0,0,0]
[null,85161016,"MK","RURAL SHORT",1042,40.598529999999997,4.9135599999999995,0,61.88576978834876,0.1250003841670784,25,6561.0596400000004,203.96942999999999,4.11036,3.1122799999999997,12,13.252400000000002,13.252400000000002,0.12955999999999998,0.12955999999999998]
[null,85161019,"MK","RURAL SHORT",1,0.47898999999999997,0.77030999999999994,0,60804.632238132923,5164.8063924050639,4,7487.55,187.65,4,3,2,636,636,2,2]
[null,85161218,"MK","RURAL SHORT",615,74.857339999999994,0.65273999999999999,0,109.38885702470691,3.2498664569991438,59,8027.00648,529.84333000000004,5.1561000000000003,4.1122000000000005,40,238.47674999999998,238.47674999999998,0.86503999999999992,0.86503999999999992]
[null,85206371,"SW","RURAL SHORT",707,143.43638999999999,0.45717999999999998,0,9.7983001916217261E-4,1.4676171117380184E-2,2,0.14873,0.14873,2.8300000000000001E-3,2.8300000000000001E-3,5,2.2277199999999997,2.2277199999999997,1.273E-2,1.273E-2]
[null,85211010,"FN","RURAL SHORT",0,0,0,0,0,0,"",0,0,0,0,"",0,0,0,0]
[null,85212266,"FN","RURAL SHORT",0,1.43408,5.9429999999999997E-2,0,0,0,"",0,0,0,0,"",0,0,0,0]
[null,85221077,"SW","RURAL SHORT",568,29.549409999999998,3.2753099999999997,0,6.4135702929478082,1.2666760461536763E-2,22,650.74134000000004,404.74340000000001,3.3961299999999999,2.2165499999999998,25,1.28521,1.28521,6.6900000000000001E-2,6.6900000000000001E-2]
[null,85221946,"CA","RURAL SHORT",313,20.79476,15.968689999999999,0,0.23255613982016676,0.85603189250055089,2,26.64686,26.64686,0.28753999999999996,0.28753999999999996,5,98.086259999999996,98.086259999999996,0.52715999999999996,0.52715999999999996]
[]
[]
[]
[]
[]
[]
[]
[]
[]
[]
[]
[]
[]
[]
[]
[]
[]
[]
[]
[]
[]
[]
[]
[]
[]
[]
[]
[]
[]
[]
[]
[]
[]
[]
[]
[]
[]
[]
[]
[]
[]
[]
[]
[]
[]
[]
[]
[]
[]
[]
[]
[]
[]
[]
[]
[]
[]
[]
[]
[]
[]
[]
[]
[]
[]
[]
[]
[]
[]
[]
[]
[]
[]
[]
[]
[]
[]
[]
[]
[]
[]
[]
[]
[]
[]
[]
[]
[]
[]
[]
[]
[]
[]
[]
[]
[]
[]
[]
[]
[]
[]
[]
[]
[]
[]
[]
[]
[]
[]
[]
[]
[]
[]
[]
[]
[]
[]
[]
[]
[]
[]
[]
[]
[]
[]
[]
[]
[]
[]
[]
[]
[]
[]
[]
[]
[]
[]
[]
[]
[]
[]
[]
[]
[]
[]
[]
[]
[]
[]
[]
[]
[]
[]
[]
[]
[]
[]
[]
[]
[]
[]
[]
[]
[]
[]
[]
[]
[]
[]
[]
[]
[]
[]
[]
[]
[]
[]
[]
[]
[]
[]
[]
[]
[]
[]
[]
[]
[]
[]
[]
[]
[]
[]
[]
[]
[]
[]
[]
[]
[]
[]
[]
[]
[]
[]
[]
[]
[]
[]
[]
[]
[]
[]
[]
[]
[]
[]
[]
[]
[]
[]
[]
[]
[]
[]
[]
[]
[]
[]
[]
[]
[]
[]
[]
[]
[]
[]
[]
[]
[]
[]
[]
[]
[]
[]
[]
[]
[]
[]
[]
[]
[]
[]
[]
[]
[]
[]
[]
[]
[]
[]
[]
[]
[]
[]
[]
[]
[]
[]
[]
[]
[]
[]
[]
[]
[]
[]
[]
[]
[]
[]
[null,null,null,null,null,null,null,null,null,null,null,null,null,null,null,null,null,null,null,null,null,null," "]
[]
[]
[]
[]
[]
[]
[]
[]
[]
[]
[]
[]
[]
[null,"To enter further feeder ID's - please insert new lines above this line. "]

{"sheet":"3.6.9 Network-reliability","index":7,"n_rows":24,"n_cols":7,"rows_kept":24,"cut":false,"hidden":false,"merged":[]}
[null,{"$f":"(LOOKUP(dms_Model,dms_Model_List,dms_Worksheet_List))","v":"REGULATORY REPORTING STATEMENT"},null,null,null,null,{"$f":"CONCATENATE(\"1-Jan-\",LEFT(CRY,4))","v":"1-Jan-2016"}]
[null,{"$f":"dms_TradingName","v":"Ergon Energy"}]
[null,{"$f":"CONCATENATE(\"Annual Reporting RIN Response \",CRY)","v":"Annual Reporting RIN Response 2016-17"}]
[null,"3.6 QUALITY OF SERVICES"]
[]
[]
[null,"3.6.9 - NETWORK FEEDER RELIABILITY - PLANNED OUTAGES"]
[]
[]
[null,"3.6.9.1 - PLANNED MINUTES OFF SUPPLY (SAIDI)"]
[null,null,{"$f":"CRY","v":"2016-17"}]
[null,{"$f":"INDEX(dms_FeederName_1,MATCH(dms_TradingName,dms_TradingName_List))","v":"CBD"}]
[null,{"$f":"INDEX(dms_FeederName_2,MATCH(dms_TradingName,dms_TradingName_List))","v":"Urban"},27.859300000000001]
[null,{"$f":"INDEX(dms_FeederName_3,MATCH(dms_TradingName,dms_TradingName_List))","v":"Short rural"},66.910200000000003]
[null,{"$f":"INDEX(dms_FeederName_4,MATCH(dms_TradingName,dms_TradingName_List))","v":"Long rural"},157.00110000000001]
[null,{"$f":"IF((INDEX(dms_FeederName_5,MATCH(dms_TradingName,dms_TradingName_List))=0),\"\",(INDEX(dms_FeederName_5,MATCH(dms_TradingName,dms_TradingName_List))))","v":""}]
[]
[null,"3.6.9.2 - PLANNED INTERRUPTIONS TO SUPPLY (SAIFI)"]
[null,null,{"$f":"CRY","v":"2016-17"}]
[null,{"$f":"INDEX(dms_FeederName_1,MATCH(dms_TradingName,dms_TradingName_List))","v":"CBD"}]
[null,{"$f":"INDEX(dms_FeederName_2,MATCH(dms_TradingName,dms_TradingName_List))","v":"Urban"},0.21590000000000001]
[null,{"$f":"INDEX(dms_FeederName_3,MATCH(dms_TradingName,dms_TradingName_List))","v":"Short rural"},0.37909999999999999]
[null,{"$f":"INDEX(dms_FeederName_4,MATCH(dms_TradingName,dms_TradingName_List))","v":"Long rural"},0.91520000000000001]
[null,{"$f":"IF((INDEX(dms_FeederName_5,MATCH(dms_TradingName,dms_TradingName_List))=0),\"\",(INDEX(dms_FeederName_5,MATCH(dms_TradingName,dms_TradingName_List))))","v":""}]

{"sheet":"4.1 Public lighting","index":8,"n_rows":23,"n_cols":4,"rows_kept":23,"cut":false,"hidden":false,"merged":[[9,1,10,1],[5,1,5,2]]}
[null,{"$f":"(LOOKUP(dms_Model,dms_Model_List,dms_Worksheet_List))","v":"REGULATORY REPORTING STATEMENT"}]
[null,{"$f":"dms_TradingName","v":"Ergon Energy"}]
[null,{"$f":"CONCATENATE(\"Annual Reporting RIN Response \",CRY)","v":"Annual Reporting RIN Response 2016-17"}]
[null,"4.1 PUBLIC LIGHTING"]
[]
[null,"Tables 4.1.1 - 4.1.3 deliberately omitted."]
[]
[null,"4.1.4 - PUBLIC LIGHTING METRICS BY TARIFF"]
[]
[null,"Tariff categories","Number of Lights","Public Lighting Revenue"]
[null,"<insert tariff category>","0's","$0's, nominal"]
[]
[]
[]
[]
[]
[]
[]
[]
[]
[]
[null,"To enter further tariff categories - please insert new lines above this line. "]
[null,"Total ",{"$f":"SUM(C12:C21)","v":0},{"$f":"SUM(D12:D21)","v":0}]

{"sheet":"6.2 STPIS Reliability","index":9,"n_rows":98,"n_cols":8,"rows_kept":98,"cut":false,"hidden":false,"merged":[[80,1,85,1],[86,1,91,1],[92,1,97,1],[79,1,79,2],[22,1,27,1],[32,1,37,1],[38,1,43,1],[44,1,49,1],[5,1,5,2],[31,1,31,2],[68,1,73,1],[62,1,67,1],[55,1,55,2],[56,1,61,1],[16,1,21,1],[9,1,9,2],[10,1,15,1]]}
[null,{"$f":"(LOOKUP(dms_Model,dms_Model_List,dms_Worksheet_List))","v":"REGULATORY REPORTING STATEMENT"}]
[null,{"$f":"dms_TradingName","v":"Ergon Energy"}]
[null,{"$f":"CONCATENATE(\"Annual Reporting RIN Response \",CRY)","v":"Annual Reporting RIN Response 2016-17"}]
[null,"6.2 RELIABILITY AND CUSTOMER SERVICE PERFORMANCE"]
[]
[null,"Did the MAIFI parameter of the STPIS apply during the period?\nThis flag is set from the response on worksheet 3.6.8 Network feeders",null,{"$f":"dms_MAIFI_Flag","v":"No"}]
[]
[]
[null,"6.2.1 - UNPLANNED MINUTES OFF SUPPLY (SAIDI)"]
[null,null,null,{"$f":"CRY","v":"2016-17"}]
[null,"Total sustained minutes off supply",{"$f":"INDEX(dms_FeederName_1,MATCH(dms_TradingName,dms_TradingName_List))","v":"CBD"}]
[null,null,{"$f":"INDEX(dms_FeederName_2,MATCH(dms_TradingName,dms_TradingName_List))","v":"Urban"},454.2355," "]
[null,null,{"$f":"INDEX(dms_FeederName_3,MATCH(dms_TradingName,dms_TradingName_List))","v":"Short rural"},1158.9699000000001]
[null,null,{"$f":"INDEX(dms_FeederName_4,MATCH(dms_TradingName,dms_TradingName_List))","v":"Long rural"},1078.3675000000001]
[null,null,{"$f":"IF((INDEX(dms_FeederName_5,MATCH(dms_TradingName,dms_TradingName_List))=0),\"\",(INDEX(dms_FeederName_5,MATCH(dms_TradingName,dms_TradingName_List))))","v":""},null,"","","",""]
[null,null,"Whole Network",934.75279999999998,"","","",""]
[null,"Total of excluded events*\n\n*see 3.3 of STPIS",{"$f":"INDEX(dms_FeederName_1,MATCH(dms_TradingName,dms_TradingName_List))","v":"CBD"}]
[null,null,{"$f":"INDEX(dms_FeederName_2,MATCH(dms_TradingName,dms_TradingName_List))","v":"Urban"},374.81029999999998]
[null,null,{"$f":"INDEX(dms_FeederName_3,MATCH(dms_TradingName,dms_TradingName_List))","v":"Short rural"},945.83399999999995]
[null,null,{"$f":"INDEX(dms_FeederName_4,MATCH(dms_TradingName,dms_TradingName_List))","v":"Long rural"},453.8886]
[null,null,{"$f":"IF((INDEX(dms_FeederName_5,MATCH(dms_TradingName,dms_TradingName_List))=0),\"\",(INDEX(dms_FeederName_5,MATCH(dms_TradingName,dms_TradingName_List))))","v":""},null,null,"","",""]
[null,null,"Whole Network",717.2568,null,"","",""]
[null,"Total sustained minutes off supply after removing excluded events",{"$f":"INDEX(dms_FeederName_1,MATCH(dms_TradingName,dms_TradingName_List))","v":"CBD"}]
[null,null,{"$f":"INDEX(dms_FeederName_2,MATCH(dms_TradingName,dms_TradingName_List))","v":"Urban"},79.425200000000004]
[null,null,{"$f":"INDEX(dms_FeederName_3,MATCH(dms_TradingName,dms_TradingName_List))","v":"Short rural"},213.136]
[null,null,{"$f":"INDEX(dms_FeederName_4,MATCH(dms_TradingName,dms_TradingName_List))","v":"Long rural"},624.47889999999995]
[null,null,{"$f":"IF((INDEX(dms_FeederName_5,MATCH(dms_TradingName,dms_TradingName_List))=0),\"\",(INDEX(dms_FeederName_5,MATCH(dms_TradingName,dms_TradingName_List))))","v":""},null,"","","",""]
[null,null,"Whole Network",217.49600000000001,"","","",""]
[]
[]
[null,"6.2.2 - UNPLANNED INTERRUPTIONS TO SUPPLY (SAIFI)"]
[null,null,null,{"$f":"CRY","v":"2016-17"}]
[null,"Total sustained interruptions",{"$f":"INDEX(dms_FeederName_1,MATCH(dms_TradingName,dms_TradingName_List))","v":"CBD"}]
[null,null,{"$f":"INDEX(dms_FeederName_2,MATCH(dms_TradingName,dms_TradingName_List))","v":"Urban"},1.1617]
[null,null,{"$f":"INDEX(dms_FeederName_3,MATCH(dms_TradingName,dms_TradingName_List))","v":"Short rural"},2.7189999999999999]
[null,null,{"$f":"INDEX(dms_FeederName_4,MATCH(dms_TradingName,dms_TradingName_List))","v":"Long rural"},5.5419999999999998]
[null,null,{"$f":"IF((INDEX(dms_FeederName_5,MATCH(dms_TradingName,dms_TradingName_List))=0),\"\",(INDEX(dms_FeederName_5,MATCH(dms_TradingName,dms_TradingName_List))))","v":""},null,"","","",""]
[null,null,"Whole Network",2.5533999999999999,"","","",""]
[null,"Total of excluded events*\n\n*see 3.3 of STPIS",{"$f":"INDEX(dms_FeederName_1,MATCH(dms_TradingName,dms_TradingName_List))","v":"CBD"}]
[null,null,{"$f":"INDEX(dms_FeederName_2,MATCH(dms_TradingName,dms_TradingName_List))","v":"Urban"},0.24]
[null,null,{"$f":"INDEX(dms_FeederName_3,MATCH(dms_TradingName,dms_TradingName_List))","v":"Short rural"},0.45810000000000001]
[null,null,{"$f":"INDEX(dms_FeederName_4,MATCH(dms_TradingName,dms_TradingName_List))","v":"Long rural"},0.64990000000000003]
[null,null,{"$f":"IF((INDEX(dms_FeederName_5,MATCH(dms_TradingName,dms_TradingName_List))=0),\"\",(INDEX(dms_FeederName_5,MATCH(dms_TradingName,dms_TradingName_List))))","v":""},null,"",null,"",""]
[null,null,"Whole Network",0.41249999999999998,"",null,"",""]
[null,"Total sustained interruptions after removing excluded events",{"$f":"INDEX(dms_FeederName_1,MATCH(dms_TradingName,dms_TradingName_List))","v":"CBD"}]
[null,null,{"$f":"INDEX(dms_FeederName_2,MATCH(dms_TradingName,dms_TradingName_List))","v":"Urban"},0.92179999999999995]
[null,null,{"$f":"INDEX(dms_FeederName_3,MATCH(dms_TradingName,dms_TradingName_List))","v":"Short rural"},2.2608999999999999]
[null,null,{"$f":"INDEX(dms_FeederName_4,MATCH(dms_TradingName,dms_TradingName_List))","v":"Long rural"},4.8921000000000001]
[null,null,{"$f":"IF((INDEX(dms_FeederName_5,MATCH(dms_TradingName,dms_TradingName_List))=0),\"\",(INDEX(dms_FeederName_5,MATCH(dms_TradingName,dms_TradingName_List))))","v":""},null,"","","",""]
[null,null,"Whole Network",2.1408999999999998,"","","",""]
[]
[]
[]
[]
[null,"6.2.3 - UNPLANNED MOMENTARY INTERRUPTIONS TO SUPPLY (MAIFI)"]
[null,null,null,{"$f":"CRY","v":"2016-17"}]
[null,"Total momentary interruptions",{"$f":"INDEX(dms_FeederName_1,MATCH(dms_TradingName,dms_TradingName_List))","v":"CBD"}]
[null,null,{"$f":"INDEX(dms_FeederName_2,MATCH(dms_TradingName,dms_TradingName_List))","v":"Urban"}]
[null,null,{"$f":"INDEX(dms_FeederName_3,MATCH(dms_TradingName,dms_TradingName_List))","v":"Short rural"}]
[null,null,{"$f":"INDEX(dms_FeederName_4,MATCH(dms_TradingName,dms_TradingName_List))","v":"Long rural"}]
[null,null,{"$f":"IF((INDEX(dms_FeederName_5,MATCH(dms_TradingName,dms_TradingName_List))=0),\"\",(INDEX(dms_FeederName_5,MATCH(dms_TradingName,dms_TradingName_List))))","v":""}]
[null,null,"Whole Network"]
[null,"Total of excluded events*\n\n*see 3.3 of STPIS",{"$f":"INDEX(dms_FeederName_1,MATCH(dms_TradingName,dms_TradingName_List))","v":"CBD"}]
[null,null,{"$f":"INDEX(dms_FeederName_2,MATCH(dms_TradingName,dms_TradingName_List))","v":"Urban"}]
[null,null,{"$f":"INDEX(dms_FeederName_3,MATCH(dms_TradingName,dms_TradingName_List))","v":"Short rural"}]
[null,null,{"$f":"INDEX(dms_FeederName_4,MATCH(dms_TradingName,dms_TradingName_List))","v":"Long rural"}]
[null,null,{"$f":"IF((INDEX(dms_FeederName_5,MATCH(dms_TradingName,dms_TradingName_List))=0),\"\",(INDEX(dms_FeederName_5,MATCH(dms_TradingName,dms_TradingName_List))))","v":""}]
[null,null,"Whole Network"]
[null,"Total momentary interruptions after removing excluded events",{"$f":"INDEX(dms_FeederName_1,MATCH(dms_TradingName,dms_TradingName_List))","v":"CBD"}]
[null,null,{"$f":"INDEX(dms_FeederName_2,MATCH(dms_TradingName,dms_TradingName_List))","v":"Urban"}]
[null,null,{"$f":"INDEX(dms_FeederName_3,MATCH(dms_TradingName,dms_TradingName_List))","v":"Short rural"}]
[null,null,{"$f":"INDEX(dms_FeederName_4,MATCH(dms_TradingName,dms_TradingName_List))","v":"Long rural"}]
[null,null,{"$f":"IF((INDEX(dms_FeederName_5,MATCH(dms_TradingName,dms_TradingName_List))=0),\"\",(INDEX(dms_FeederName_5,MATCH(dms_TradingName,dms_TradingName_List))))","v":""}]
[null,null,"Whole Network"]
[]
[]
[]
[]
[null,"6.2.4 - DISTRIBUTION CUSTOMER NUMBERS"]
[null,null,null,{"$f":"CRY","v":"2016-17"}]
[null,"Customer numbers at the start of the period",{"$f":"INDEX(dms_FeederName_1,MATCH(dms_TradingName,dms_TradingName_List))","v":"CBD"}]
[null,null,{"$f":"INDEX(dms_FeederName_2,MATCH(dms_TradingName,dms_TradingName_List))","v":"Urban"},204397]
[null,null,{"$f":"INDEX(dms_FeederName_3,MATCH(dms_TradingName,dms_TradingName_List))","v":"Short rural"},414569]
[null,null,{"$f":"INDEX(dms_FeederName_4,MATCH(dms_TradingName,dms_TradingName_List))","v":"Long rural"},78005]
[null,null,{"$f":"IF((INDEX(dms_FeederName_5,MATCH(dms_TradingName,dms_TradingName_List))=0),\"\",(INDEX(dms_FeederName_5,MATCH(dms_TradingName,dms_TradingName_List))))","v":""}]
[null,null,"Whole Network",696971]
[null,"Customer numbers at the end of the period",{"$f":"INDEX(dms_FeederName_1,MATCH(dms_TradingName,dms_TradingName_List))","v":"CBD"}]
[null,null,{"$f":"INDEX(dms_FeederName_2,MATCH(dms_TradingName,dms_TradingName_List))","v":"Urban"},222202]
[null,null,{"$f":"INDEX(dms_FeederName_3,MATCH(dms_TradingName,dms_TradingName_List))","v":"Short rural"},401366]
[null,null,{"$f":"INDEX(dms_FeederName_4,MATCH(dms_TradingName,dms_TradingName_List))","v":"Long rural"},75460]
[null,null,{"$f":"IF((INDEX(dms_FeederName_5,MATCH(dms_TradingName,dms_TradingName_List))=0),\"\",(INDEX(dms_FeederName_5,MATCH(dms_TradingName,dms_TradingName_List))))","v":""}]
[null,null,"Whole Network",699028]
[null,"Average customer numbers",{"$f":"INDEX(dms_FeederName_1,MATCH(dms_TradingName,dms_TradingName_List))","v":"CBD"},{"$f":"ROUND(SUM(D81+D87)/2,0)","v":0}]
[null,null,{"$f":"INDEX(dms_FeederName_2,MATCH(dms_TradingName,dms_TradingName_List))","v":"Urban"},{"$f":"ROUND(SUM(D82+D88)/2,0)","v":213300}]
[null,null,{"$f":"INDEX(dms_FeederName_3,MATCH(dms_TradingName,dms_TradingName_List))","v":"Short rural"},{"$f":"ROUND(SUM(D83+D89)/2,0)","v":407968}]
[null,null,{"$f":"INDEX(dms_FeederName_4,MATCH(dms_TradingName,dms_TradingName_List))","v":"Long rural"},{"$f":"ROUND(SUM(D84+D90)/2,0)","v":76733}]
[null,null,{"$f":"IF((INDEX(dms_FeederName_5,MATCH(dms_TradingName,dms_TradingName_List))=0),\"\",(INDEX(dms_FeederName_5,MATCH(dms_TradingName,dms_TradingName_List))))","v":""},{"$f":"ROUND(SUM(D85+D91)/2,0)","v":0}]
[null,null,"Whole Network",698000]

{"sheet":"6.6 STPIS Customer Service","index":10,"n_rows":13,"n_cols":4,"rows_kept":13,"cut":false,"hidden":false,"merged":[[8,1,9,1]]}
[null,{"$f":"(LOOKUP(dms_Model,dms_Model_List,dms_Worksheet_List))","v":"REGULATORY REPORTING STATEMENT"}]
[null,{"$f":"dms_TradingName","v":"Ergon Energy"}]
[null,{"$f":"CONCATENATE(\"Annual Reporting RIN Response \",CRY)","v":"Annual Reporting RIN Response 2016-17"}]
[null,"6.6 STPIS CUSTOMER SERVICE"]
[]
[]
[null,"6.6.1 - TELEPHONE ANSWERING"]
[]
[null,null,"Number of calls \nafter removing excluded events","Total number of calls"]
[null,null,{"$f":"CRY","v":"2016-17"},{"$f":"CRY","v":"2016-17"}]
[null,"Number of calls received",115015,128301]
[null,"Number of calls answered within 30 seconds",92245]
[null,"Percentage of calls answered within 30 seconds",{"$f":"C12/C11","v":0.80202582271877576}]

{"sheet":"6.7 STPIS Daily Performance","index":11,"n_rows":381,"n_cols":16,"rows_kept":381,"cut":false,"hidden":false,"merged":[[13,14,13,15],[13,3,14,3],[6,1,6,5],[8,1,8,6],[13,4,13,5],[13,6,13,7],[13,10,13,11],[13,8,13,9],[13,12,13,13],[12,1,14,1],[12,2,12,3],[13,2,14,2],[12,4,12,13]]}
[null,{"$f":"(LOOKUP(dms_Model,dms_Model_List,dms_Worksheet_List))","v":"REGULATORY REPORTING STATEMENT"},null,null,null,null,null,null,{"$f":"CONCATENATE(IF(LEN(CRY)=4,\"1-Jan-\",\"1-Jul-\"),LEFT(CRY,4))","v":"1-Jul-2016"}]
[null,{"$f":"dms_TradingName","v":"Ergon Energy"}]
[null,{"$f":"CONCATENATE(\"Annual Reporting RIN Response \",CRY)","v":"Annual Reporting RIN Response 2016-17"}]
[null,"6.7 STPIS DAILY PERFORMANCE"]
[]
[]
[null,"Did the MAIFI parameter of the STPIS apply during the period?\nThis flag is set from the response on worksheet 3.6.8 Network feeders",null,null,null,null,{"$f":"dms_MAIFI_Flag","v":"No"}]
[]
[null,"The excluded events to be removed from the data refer only to events listed in clause 3.3(a) of the STPIS, with respect to reliability data, and in clause 5.4 of the STPIS with respect to customer service parameters.\n\n*Customer service information must be reported as per the definitions in the STPIS, that is excluding: \n   • calls to payment lines and automated interactive services \n   • calls abandoned by the customer within 30 seconds of the call being queued for response by a human operator (where the time in which a telephone call is abandoned is not measured, then an estimate of the number of calls abandoned within 30 seconds will be determined by taking 20 per cent of all calls abandoned)."]
[]
[null,"6.7.1 - DAILY PERFORMANCE DATA - UNPLANNED"]
[]
[null,"Date","Customer service*",null,"MAIFI"]
[null,null,"Number of calls received\n(after removing excluded events)","Number of calls answered in 30 seconds\n(after removing excluded events)",{"$f":"INDEX(dms_FeederName_1,MATCH(dms_TradingName,dms_TradingName_List))","v":"CBD"},null,{"$f":"INDEX(dms_FeederName_2,MATCH(dms_TradingName,dms_TradingName_List))","v":"Urban"},null,{"$f":"INDEX(dms_FeederName_3,MATCH(dms_TradingName,dms_TradingName_List))","v":"Short rural"},null,{"$f":"INDEX(dms_FeederName_4,MATCH(dms_TradingName,dms_TradingName_List))","v":"Long rural"},null,{"$f":"IF((INDEX(dms_FeederName_5,MATCH(dms_TradingName,dms_TradingName_List))=0),\"Network\",(INDEX(dms_FeederName_5,MATCH(dms_TradingName,dms_TradingName_List))))","v":"Network"},null,"Network"]
[null,null,null,null,"All events","After removing excluded events","All events","After removing excluded events","All events","After removing excluded events","All events","After removing excluded events","All events","After removing excluded events","All events","After removing excluded events"]
[null,{"$f":"CONCATENATE(IF(LEN(CRY)=4,\"1-Jan-\",\"1-Jul-\"),LEFT(CRY,4))","v":"1-Jul-2016"},190,173]
[null,{"$f":"B16+1","v":"2016-07-02"},88,77]
[null,"2016-07-03",86,82]
[null,"2016-07-04",276,188]
[null,"2016-07-05",280,248]
[null,"2016-07-06",252,230]
[null,"2016-07-07",196,160]
[null,"2016-07-08",198,178]
[null,"2016-07-09",111,99]
[null,"2016-07-10",100,89]
[null,"2016-07-11",241,172]
[null,"2016-07-12",250,176]
[null,"2016-07-13",257,169]
[null,"2016-07-14",264,202]
[null,"2016-07-15",344,296]
[null,"2016-07-16",410,298]
[null,"2016-07-17",196,185]
[null,"2016-07-18",301,250]
[null,"2016-07-19",304,267]
[null,"2016-07-20",244,190]
[null,"2016-07-21",234,214]
[null,"2016-07-22",234,223]
[null,"2016-07-23",182,158]
[null,"2016-07-24",80,80]
[null,"2016-07-25",238,212]
[null,"2016-07-26",238,158]
[null,"2016-07-27",269,230]
[null,"2016-07-28",260,236]
[null,"2016-07-29",210,207]
[null,"2016-07-30",116,111]
[null,"2016-07-31",137,127]
[null,"2016-08-01",284,220]
[null,"2016-08-02",222,212]
[null,"2016-08-03",262,225]
[null,"2016-08-04",274,257]
[null,"2016-08-05",221,195]
[null,"2016-08-06",143,127]
[null,"2016-08-07",125,118]
[null,"2016-08-08",258,211]
[null,"2016-08-09",326,276]
[null,"2016-08-10",255,200]
[null,"2016-08-11",224,206]
[null,"2016-08-12",252,245]
[null,"2016-08-13",128,84]
[null,"2016-08-14",153,134]
[null,"2016-08-15",280,239]
[null,"2016-08-16",379,261]
[null,"2016-08-17",277,208]
[null,"2016-08-18",264,205]
[null,"2016-08-19",267,247]
[null,"2016-08-20",246,177]
[null,"2016-08-21",159,135]
[null,"2016-08-22",402,298]
[null,"2016-08-23",357,261]
[null,"2016-08-24",352,256]
[null,"2016-08-25",267,208]
[null,"2016-08-26",215,173]
[null,"2016-08-27",194,154]
[null,"2016-08-28",129,119]
[null,"2016-08-29",246,206]
[null,"2016-08-30",203,193]
[null,"2016-08-31",219,197]
[null,"2016-09-01",206,191]
[null,"2016-09-02",374,290]
[null,"2016-09-03",184,142]
[null,{"$f":"B80+1","v":"2016-09-04"},109,101]
[null,"2016-09-05",268,190]
[null,"2016-09-06",241,192]
[null,"2016-09-07",264,198]
[null,"2016-09-08",331,232]
[null,"2016-09-09",239,214]
[null,"2016-09-10",154,116]
[null,"2016-09-11",123,105]
[null,"2016-09-12",232,198]
[null,"2016-09-13",222,214]
[null,"2016-09-14",220,199]
[null,"2016-09-15",301,206]
[null,"2016-09-16",276,239]
[null,"2016-09-17",130,111]
[null,"2016-09-18",164,121]
[null,"2016-09-19",318,266]
[null,"2016-09-20",197,182]
[null,"2016-09-21",206,182]
[null,"2016-09-22",264,233]
[null,"2016-09-23",189,177]
[null,"2016-09-24",115,105]
[null,"2016-09-25",118,108]
[null,"2016-09-26",247,234]
[null,"2016-09-27",315,298]
[null,"2016-09-28",385,345]
[null,"2016-09-29",199,192]
[null,"2016-09-30",230,221]
[null,"2016-10-01",131,110]
[null,"2016-10-02",80,76]
[null,"2016-10-03",277,233]
[null,"2016-10-04",298,276]
[null,"2016-10-05",226,203]
[null,"2016-10-06",279,268]
[null,"2016-10-07",318,309]
[null,"2016-10-08",136,121]
[null,"2016-10-09",122,108]
[null,"2016-10-10",243,227]
[null,"2016-10-11",236,232]
[null,"2016-10-12",220,204]
[null,"2016-10-13",232,217]
[null,"2016-10-14",261,252]
[null,"2016-10-15",146,127]
[null,"2016-10-16",154,121]
[null,"2016-10-17",512,340]
[null,"2016-10-18",277,260]
[null,"2016-10-19",258,215]
[null,"2016-10-20",264,224]
[null,"2016-10-21",218,198]
[null,"2016-10-22",172,155]
[null,"2016-10-23",219,202]
[null,"2016-10-24",251,240]
[null,"2016-10-25",249,237]
[null,"2016-10-26",274,264]
[null,"2016-10-27",294,245]
[null,"2016-10-28",516,377]
[null,"2016-10-29",191,178]
[null,"2016-10-30",126,122]
[null,"2016-10-31",262,228]
[null,"2016-11-01",271,250]
[null,"2016-11-02",288,280]
[null,"2016-11-03",344,333]
[null,"2016-11-04",267,243]
[null,"2016-11-05",207,162]
[null,"2016-11-06",272,195]
[null,{"$f":"B144+1","v":"2016-11-07"},436,398]
[null,"2016-11-08",474,433]
[null,"2016-11-09",477,412]
[null,"2016-11-10",431,342]
[null,"2016-11-11",436,334]
[null,"2016-11-12",0,0]
[null,"2016-11-13",0,0]
[null,"2016-11-14",734,465]
[null,"2016-11-15",326,245]
[null,"2016-11-16",318,273]
[null,"2016-11-17",331,278]
[null,"2016-11-18",307,266]
[null,"2016-11-19",170,139]
[null,"2016-11-20",152,147]
[null,"2016-11-21",301,267]
[null,"2016-11-22",311,299]
[null,"2016-11-23",264,238]
[null,"2016-11-24",347,313]
[null,"2016-11-25",260,244]
[null,"2016-11-26",265,233]
[null,"2016-11-27",320,291]
[null,"2016-11-28",498,424]
[null,"2016-11-29",415,398]
[null,"2016-11-30",433,412]
[null,"2016-12-01",419,403]
[null,"2016-12-02",409,340]
[null,"2016-12-03",580,336]
[null,"2016-12-04",674,409]
[null,"2016-12-05",517,458]
[null,"2016-12-06",561,517]
[null,"2016-12-07",679,534]
[null,"2016-12-08",612,478]
[null,"2016-12-09",660,530]
[null,"2016-12-10",300,250]
[null,"2016-12-11",241,195]
[null,"2016-12-12",392,373]
[null,"2016-12-13",347,286]
[null,"2016-12-14",310,290]
[null,"2016-12-15",396,321]
[null,"2016-12-16",267,259]
[null,"2016-12-17",306,216]
[null,"2016-12-18",416,327]
[null,"2016-12-19",430,389]
[null,"2016-12-20",412,336]
[null,"2016-12-21",384,364]
[null,"2016-12-22",331,312]
[null,"2016-12-23",437,345]
[null,"2016-12-24",174,159]
[null,"2016-12-25",264,209]
[null,"2016-12-26",319,241]
[null,"2016-12-27",259,202]
[null,"2016-12-28",315,311]
[null,"2016-12-29",219,208]
[null,"2016-12-30",245,225]
[null,"2016-12-31",227,199]
[null,"2017-01-01",308,241]
[null,"2017-01-02",427,262]
[null,"2017-01-03",577,522]
[null,"2017-01-04",517,463]
[null,"2017-01-05",405,389]
[null,"2017-01-06",354,326]
[null,"2017-01-07",343,246]
[null,"2017-01-08",320,195]
[null,"2017-01-09",359,327]
[null,{"$f":"B208+1","v":"2017-01-10"},391,378]
[null,"2017-01-11",475,396]
[null,"2017-01-12",503,413]
[null,"2017-01-13",704,463]
[null,"2017-01-14",748,456]
[null,"2017-01-15",915,439]
[null,"2017-01-16",646,564]
[null,"2017-01-17",483,449]
[null,"2017-01-18",447,337]
[null,"2017-01-19",610,477]
[null,"2017-01-20",460,390]
[null,"2017-01-21",263,201]
[null,"2017-01-22",336,239]
[null,"2017-01-23",504,432]
[null,"2017-01-24",353,300]
[null,"2017-01-25",446,381]
[null,"2017-01-26",402,240]
[null,"2017-01-27",418,395]
[null,"2017-01-28",265,208]
[null,"2017-01-29",261,216]
[null,"2017-01-30",454,396]
[null,"2017-01-31",364,349]
[null,"2017-02-01",446,398]
[null,"2017-02-02",850,442]
[null,"2017-02-03",325,311]
[null,"2017-02-04",202,189]
[null,"2017-02-05",239,224]
[null,"2017-02-06",408,390]
[null,"2017-02-07",424,379]
[null,"2017-02-08",416,385]
[null,"2017-02-09",386,338]
[null,"2017-02-10",298,283]
[null,"2017-02-11",279,222]
[null,"2017-02-12",499,232]
[null,"2017-02-13",644,500]
[null,"2017-02-14",959,532]
[null,"2017-02-15",811,619]
[null,"2017-02-16",466,408]
[null,"2017-02-17",372,327]
[null,"2017-02-18",362,211]
[null,"2017-02-19",322,222]
[null,"2017-02-20",403,373]
[null,"2017-02-21",360,296]
[null,"2017-02-22",407,347]
[null,"2017-02-23",460,407]
[null,"2017-02-24",342,313]
[null,"2017-02-25",268,219]
[null,"2017-02-26",361,266]
[null,"2017-02-27",476,364]
[null,"2017-02-28",342,290]
[null,"2017-03-01",362,267]
[null,"2017-03-02",475,292]
[null,"2017-03-03",412,334]
[null,"2017-03-04",214,161]
[null,"2017-03-05",260,243]
[null,"2017-03-06",377,338]
[null,"2017-03-07",354,256]
[null,"2017-03-08",411,215]
[null,"2017-03-09",449,294]
[null,"2017-03-10",238,184]
[null,"2017-03-11",164,130]
[null,"2017-03-12",164,156]
[null,"2017-03-13",388,240]
[null,"2017-03-14",934,346]
[null,{"$f":"B272+1","v":"2017-03-15"},825,402]
[null,"2017-03-16",458,384]
[null,"2017-03-17",381,282]
[null,"2017-03-18",372,188]
[null,"2017-03-19",608,338]
[null,"2017-03-20",448,354]
[null,"2017-03-21",555,372]
[null,"2017-03-22",441,356]
[null,"2017-03-23",339,277]
[null,"2017-03-24",351,280]
[null,"2017-03-25",304,176]
[null,"2017-03-26",193,159]
[null,"2017-03-27",0,0]
[null,"2017-03-28",0,0]
[null,"2017-03-29",0,0]
[null,"2017-03-30",0,0]
[null,"2017-03-31",1655,1372]
[null,"2017-04-01",815,606]
[null,"2017-04-02",637,517]
[null,"2017-04-03",786,757]
[null,"2017-04-04",613,539]
[null,"2017-04-05",574,540]
[null,"2017-04-06",473,403]
[null,"2017-04-07",508,457]
[null,"2017-04-08",327,270]
[null,"2017-04-09",261,228]
[null,"2017-04-10",512,367]
[null,"2017-04-11",383,318]
[null,"2017-04-12",320,249]
[null,"2017-04-13",441,317]
[null,"2017-04-14",195,176]
[null,"2017-04-15",133,131]
[null,"2017-04-16",162,151]
[null,"2017-04-17",165,154]
[null,"2017-04-18",374,316]
[null,"2017-04-19",352,314]
[null,"2017-04-20",325,226]
[null,"2017-04-21",312,266]
[null,"2017-04-22",228,171]
[null,"2017-04-23",177,165]
[null,"2017-04-24",293,169]
[null,"2017-04-25",107,98]
[null,"2017-04-26",445,273]
[null,"2017-04-27",281,197]
[null,"2017-04-28",235,194]
[null,"2017-04-29",99,91]
[null,"2017-04-30",140,112]
[null,"2017-05-01",128,116]
[null,"2017-05-02",228,195]
[null,"2017-05-03",309,191]
[null,"2017-05-04",327,213]
[null,"2017-05-05",263,170]
[null,"2017-05-06",137,117]
[null,"2017-05-07",145,121]
[null,"2017-05-08",286,235]
[null,"2017-05-09",363,235]
[null,"2017-05-10",255,231]
[null,"2017-05-11",235,203]
[null,"2017-05-12",329,224]
[null,"2017-05-13",168,122]
[null,"2017-05-14",91,87]
[null,"2017-05-15",273,194]
[null,"2017-05-16",268,225]
[null,"2017-05-17",214,168]
[null,{"$f":"B336+1","v":"2017-05-18"},386,238]
[null,"2017-05-19",320,249]
[null,"2017-05-20",159,123]
[null,"2017-05-21",123,105]
[null,"2017-05-22",568,302]
[null,"2017-05-23",289,249]
[null,"2017-05-24",460,326]
[null,"2017-05-25",349,206]
[null,"2017-05-26",269,228]
[null,"2017-05-27",156,132]
[null,"2017-05-28",130,130]
[null,"2017-05-29",273,205]
[null,"2017-05-30",259,192]
[null,"2017-05-31",332,258]
[null,"2017-06-01",271,218]
[null,"2017-06-02",250,222]
[null,"2017-06-03",120,103]
[null,"2017-06-04",83,76]
[null,"2017-06-05",316,230]
[null,"2017-06-06",344,292]
[null,"2017-06-07",317,250]
[null,"2017-06-08",378,266]
[null,"2017-06-09",315,221]
[null,"2017-06-10",128,105]
[null,"2017-06-11",118,112]
[null,"2017-06-12",343,258]
[null,"2017-06-13",277,201]
[null,"2017-06-14",290,178]
[null,"2017-06-15",217,207]
[null,"2017-06-16",276,265]
[null,"2017-06-17",236,143]
[null,"2017-06-18",200,156]
[null,"2017-06-19",467,219]
[null,"2017-06-20",267,199]
[null,"2017-06-21",264,218]
[null,"2017-06-22",290,238]
[null,"2017-06-23",209,197]
[null,"2017-06-24",144,127]
[null,"2017-06-25",69,67]
[null,"2017-06-26",261,200]
[null,"2017-06-27",238,205]
[null,"2017-06-28",330,251]
[null,"2017-06-29",274,235]
[null,"2017-06-30",252,212]
[null,"2017-07-01"]

{"sheet":"6.8 STPIS Exclusions","index":12,"n_rows":44,"n_cols":15,"rows_kept":44,"cut":false,"hidden":false,"merged":[[10,11,11,11],[6,1,6,4],[10,6,10,8],[10,5,11,5],[10,4,11,4],[10,2,11,2],[10,3,11,3]]}
[null,{"$f":"(LOOKUP(dms_Model,dms_Model_List,dms_Worksheet_List))","v":"REGULATORY REPORTING STATEMENT"}]
[null,{"$f":"dms_TradingName","v":"Ergon Energy"}]
[null,{"$f":"CONCATENATE(\"Annual Reporting RIN Response \",CRY)","v":"Annual Reporting RIN Response 2016-17"}]
[null,"6.8 STPIS EXCLUSIONS"]
[]
[]
[null,{"$f":"CONCATENATE(\"This information is collected to inform the application of the STPIS to \",dms_TradingName,\" in future regulatory periods. The information is also collected to monitor network performance, and may be used in performance reports.\")","v":"This information is collected to inform the application of the STPIS to Ergon Energy in future regulatory periods. The information is also collected to monitor network performance, and may be used in performance reports."}]
[]
[null,"6.8.1 - STPIS EXCLUSIONS"]
[]
[null,"Date of event","Outage ID","Feeder ID / name","Feeder classification\n(drop down)","Cause of event\n(drop down)","Unplanned",null,null,"Event category","Effect on unplanned MAIFI","Please provide separate explanation to confirm the outage was not due to inadequate transmission connection planning "]
[null,"DD/MM/YYYY",null,null,null,null,"Number of  interruptions","Duration of interruption\n(mins)","Total unplanned minutes off supply","Use exclusion categories listed in section 3.3(a) of the STPIS\n(drop down)","by feeder classification",null,null,null,"Cause of Event"]
[null,null,null,null,null,null,null,null,null,null,null,null,null,null,"Weather"]
[null,null,null,null,null,null,null,null,null,null,null,null,null,null,"Equipment failure"]
[null,null,null,null,null,null,null,null,null,null,null,null,null,null,"Operational error"]
[null,null,null,null,null,null,null,null,null,null,null,null,null,null,"Vegetation"]
[null,null,null,null,null,null,null,null,null,null,null,null,null,null,"Animals"]
[null,null,null,null,null,null,null,null,null,null,null,null,null,null,"Third party impacts"]
[null,null,null,null,null,null,null,null,null,null,null,null,null,null,"Transmission failure"]
[null,null,null,null,null,null,null,null,null,null,null,null,null,null,"Load shedding"]
[null,null,null,null,null,null,null,null,null,null,null,null,null,null,"Inter-distributor connection failure"]
[null,null,null,null,null,null,null,null,null,null,null,null,null,null,"Other"]
[]
[]
[]
[]
[]
[]
[]
[]
[]
[]
[]
[]
[]
[]
[]
[]
[]
[]
[]
[]
[]
[null,"To enter further events - please insert new lines above this line. "]

{"sheet":"6.9 STPIS - GSL","index":13,"n_rows":102,"n_cols":5,"rows_kept":102,"cut":false,"hidden":false,"merged":[[64,1,64,2],[54,1,54,2],[55,1,55,2],[56,1,56,2],[61,1,61,2],[60,1,60,2],[59,1,59,2],[17,1,17,2],[15,1,15,2],[5,1,5,2],[7,1,7,2],[14,1,14,2],[16,1,16,2],[20,1,20,2],[22,1,22,2],[23,1,23,2],[24,1,24,2],[21,1,21,2],[27,1,27,2],[31,1,31,2],[32,1,32,2],[28,1,28,2],[29,1,29,2],[30,1,30,2],[33,1,33,2],[34,1,34,2],[35,1,35,2],[36,1,36,2],[37,1,37,2],[40,1,40,2],[42,1,42,2],[43,1,43,2],[44,1,44,2],[41,1,41,2],[85,1,85,2],[86,1,86,2],[45,1,45,2],[46,1,46,2],[71,1,71,2],[70,1,70,2],[77,1,77,2],[49,1,49,2],[50,1,50,2],[51,1,51,2],[53,1,53,4],[58,1,58,4],[63,1,63,4],[68,1,68,4],[66,1,66,2],[65,1,65,2],[5,4,5,5],[101,1,101,2],[69,1,69,2],[98,1,98,2],[100,1,100,2],[93,1,93,2],[94,1,94,2],[95,1,95,2],[96,1,96,2],[88,1,88,2],[89,1,89,2],[90,1,90,2],[91,1,91,2],[92,1,92,2],[83,1,83,2],[84,1,84,2]]}
[null,{"$f":"(LOOKUP(dms_Model,dms_Model_List,dms_Worksheet_List))","v":"REGULATORY REPORTING STATEMENT"}]
[null,{"$f":"dms_TradingName","v":"Ergon Energy"}]
[null,{"$f":"CONCATENATE(\"Annual Reporting RIN Response \",CRY)","v":"Annual Reporting RIN Response 2016-17"}]
[null,"6.9 STPIS - GUARANTEED SERVICE LEVEL"]
[]
[null,"Did the AER's GSL Scheme apply at any time during the regulatory year?",null,"No","**IMPORTANT \nPlease ensure this flag is set. Conditional formatting on this worksheet is dependant on this response."]
[]
[null,"Instructions:\nTable 6.9.1 collects information relating to jurisdiction GSL scheme parameters. These parameters can be found in the jurisdictonal scheme relevant to NSP. Please identify each parameter in the relevant sub-tables and provide the volume and value of GSL payments. \n\nFor GSL parameters that do not fit within the provided sub-tables provided, please enter a heading and identify the relevant parameter(s). "]
[]
[null,"6.9.1 - GUARANTEED SERVICE LEVELS - JURISDICTIONAL GSL SCHEME"]
[null,null,null,{"$f":"CRY","v":"2016-17"},{"$f":"CRY","v":"2016-17"}]
[null,null,null,"Volume","Value of GSL payments"]
[null,null,null,"0's","$0's"]
[null,"Appointments"]
[null,"Failure to attend Appointments on time",null,157,8949]
[]
[]
[]
[null,"To enter further GSL parameters relating to appointments - please copy a row from above and \"insert copied cells\" above this row."]
[null,"Connections"]
[null,"Connection not provided by the agreed date",null,28,7052]
[]
[]
[]
[]
[null,"To enter further GSL parameters relating to connections -  please copy a row from above and \"insert copied cells\" above this row."]
[null,"Reliability of supply"]
[null,"Interuption duration",null,3445,392730]
[null,"Interuption frequency",null,143,16302]
[]
[]
[]
[]
[]
[]
[]
[]
[]
[null,"To enter further GSL parameters relating to reliability of supply -  please copy a row from above and \"insert copied cells\" above this row."]
[null,"Street lights"]
[]
[]
[]
[]
[]
[]
[]
[null,"To enter further GSL parameters relating to street lights -  please copy a row from above and \"insert copied cells\" above this row."]
[null,"Planned interruptions"]
[null,"Notice of a planned interruption to supply not given to residential customer",null,974,28089]
[null,"Notice of a planned interruption to supply not given to business customer",null,349,24263]
[]
[null,"To enter further GSL parameters relating to planned interruptions -  please copy a row from above and \"insert copied cells\" above this row."]
[null,"Wrongful disconnections"]
[null,"Wrongful disconnections",null,103,14626]
[]
[]
[null,"To enter further GSL parameters - please identify the parameter and if insufficient rows  please copy a row from above and \"insert copied cells\" above this row."]
[null,"Customer Reconnections"]
[null,"Reconnection not provided within the required time",null,4,456]
[]
[]
[null,"To enter further GSL parameters - please identify the parameter and if insufficient rows  please copy a row from above and \"insert copied cells\" above this row."]
[null,"Hot Water Supply"]
[null,"Failure to attend to customer's premises within the time required concerning loss of hot water supply",null,1,57]
[]
[]
[null,"To enter further GSL parameters - please identify the parameter and if insufficient rows  please copy a row from above and \"insert copied cells\" above this row."]
[null,"<NSP defined parameter category>"]
[]
[]
[]
[null,"To enter further GSL parameters - please identify the parameter and if insufficient rows  please copy a row from above and \"insert copied cells\" above this row."]
[]
[]
[null,"6.9.2 - GUARANTEED SERVICE LEVELS - AER GSL SCHEME"]
[]
[null,"Complete Table 6.9.2 if the AER's GSL scheme applied at any time during the regulatory year. \n\nDo not complete Table 6.9.2 if the AER's GSL scheme did not apply during the regulatory year."]
[]
[null,null,null,{"$f":"CRY","v":"2016-17"},{"$f":"CRY","v":"2016-17"}]
[null,null,null,"Volume","Value \nof GSL payments"]
[null,null,null,"0's","$0's"]
[null,"New connections "]
[null,"Number of connections made"]
[null,"Number of connections not made on or before the day agreed"]
[null,"Connections - GSL payments – 1-6 day delay"]
[null,"Connections - GSL payments – 7+ day delay"]
[null,"Reliability of supply"]
[null,"Frequency of interruptions – CBD feeders – 9 interruptions"]
[null,"Frequency of interruptions – Urban feeders – 9 interruptions"]
[null,"Frequency of interruptions – Rural (short and long) feeders – 15 interruptions"]
[null,"Interruptions – CBD feeders – 12 hours duration"]
[null,"Interruptions – Urban feeders – 12 hours duration"]
[null,"Interruptions – Rural (short and long) feeders – 18 hours duration"]
[null,"Total duration of interruptions Level 1 – 20 hours"]
[null,"Total duration of interruptions Level 2 – 30 hours"]
[null,"Total duration of interruptions Level 3 – 60 hours"]
[null,"Street lights"]
[null,"Streetlight repair 5 days – GSL payments"]
[null,"Planned interruptions"]
[null,"Notice of planned interruptions – 4 business days notice not given"]
[null,"Total ",null,null,{"$f":"SUM(E101,E99,E89:E97,E86:E87)","v":0}]

{"sheet":"7.8 Avoided TUOS Payments","index":14,"n_rows":11,"n_cols":3,"rows_kept":11,"cut":false,"hidden":false,"merged":[[6,1,7,1]]}
[null,{"$f":"(LOOKUP(dms_Model,dms_Model_List,dms_Worksheet_List))","v":"REGULATORY REPORTING STATEMENT"}]
[null,{"$f":"dms_TradingName","v":"Ergon Energy"}]
[null,{"$f":"CONCATENATE(\"Annual Reporting RIN Response \",CRY)","v":"Annual Reporting RIN Response 2016-17"}]
[null,"7.8 - AVOIDED TUOS PAYMENTS"]
[]
[null,"7.8.1 - AVOIDED TUOS PAYMENTS"]
[null,"Description","Avoided TUOS Payment "]
[null,null,"$0's, nominal"]
[null,"Embedded generators",3138604.78]
[null,"Market network service providers"]
[null,"Other"]

{"sheet":"7.10 Juris Scheme","index":15,"n_rows":17,"n_cols":6,"rows_kept":17,"cut":false,"hidden":false,"merged":[[8,4,9,4],[8,3,9,3],[8,2,9,2],[8,1,9,1],[5,1,5,2]]}
[null,{"$f":"(LOOKUP(dms_Model,dms_Model_List,dms_Worksheet_List))","v":"REGULATORY REPORTING STATEMENT"}]
[null,{"$f":"dms_TradingName","v":"Ergon Energy"}]
[null,{"$f":"CONCATENATE(\"Annual Reporting RIN Response \",CRY)","v":"Annual Reporting RIN Response 2016-17"}]
[null,"7.10 - JURISDICTIONAL SCHEMES"]
[]
[null,"Instructions\nBusiness must list each relevant jurisdictional scheme individually and report information for each scheme separately from other schemes."]
[]
[null,"7.10.1 - JURISDICTIONAL SCHEME PAYMENTS"]
[null,"Jurisdictional Scheme Name","Description","Date DNSP Became Subject to Scheme","Description of Cost Recovery Method","Total Scheme Payments  "]
[null,null,null,null,null,"$0's, nominal"]
[null,"Queensland Solar Bonus Scheme (SBS)","The SBS obligates Ergon Energy to pay a Feed in Tariff (FIT) for energy supplied into our distribution network from specific micro-embedded generators (PVs).  The scheme operates under Section 44A of the Electricity Act 1994 (Qld).",42145,"Consistent with clause 6.18.7A of the NER, Ergon Energy passes through jurisdictional scheme amounts (including any under or over recovery of these amounts) to customers in our tariffs.  Attachment 14 of the AER's final distribution determination sets out the requirements Ergon Energy must comply with under clause 6.18.7A of the NER.  Specifically, Ergon Energy must:  \n• earn jurisdictional scheme revenue amounts in the year it incurs those amounts; and\n• apply a true-up to account for any under or over recovery of actual revenue (which in practice occurs on a two year lag through adjustments to tariffs)\nOnce the total jurisdictional revenue to be recovered through tariffs for a particular year is determined (i.e. forecast amount for year t plus under /over recovery amounts for year t-2), this amount is allocated to tariff classes and converted to tariffs consistent with the method outlined in our approved Pricing Proposal.  \nFor the 2016-17 regulatory year, this method is outlined in section 4.13 of our approved 2016-17 Pricing Proposal.\nIt is also important to note actual FIT payments incurred by Ergon Energy in 2014-15 (which were recovered in network tariffs in 2016-17) were recovered through an adjustment made in the Total Annual Revenue (TAR) as a cost pass through amount.  These amounts are therefore accounted for and recovered through our DUOS revenue in 2016-17.  \n\nAs part of our 2018-19 annual Pricing Proposal, we will apply a true-up to account for any difference between our actual 2016-17 jurisdictional scheme revenue and our actual 2016-17 jurisdictional scheme payments (for both the FIT and the energy industry levy).  The detail of how this is to occur will need to be worked through with the AER, in light of the direction received from Queensland Government on 31 May 2017, not to pass through jurisdictional scheme charges to customers in our network tariffs until 2020.     \n\n",100153303.98000017]
[null,"Energy Industry Levy","Ergon Energy is obligated under our Distribution Authority to pay a proportion of the Queensland Government's funding commitments for the AEMC in relation to the Energy Industry Levy.",42482,"Refer above.  ",83936]
[]
[]
[]
[]
[null,null,null,null,"Total",{"$f":"SUM(F11:F16)","v":100237239.98000017}]

{"sheet":"7.11 DMIS-DMIA","index":16,"n_rows":27,"n_cols":5,"rows_kept":27,"cut":false,"hidden":false,"merged":[[24,5,24,7],[6,1,7,1],[6,5,7,7],[6,2,6,4],[23,5,23,7],[9,5,9,7],[20,5,20,7],[21,5,21,7],[22,5,22,7],[8,2,8,4]]}
[null,{"$f":"(LOOKUP(dms_Model,dms_Model_List,dms_Worksheet_List))","v":"REGULATORY REPORTING STATEMENT"}]
[null,{"$f":"dms_TradingName","v":"Ergon Energy"}]
[null,{"$f":"CONCATENATE(\"Annual Reporting RIN Response \",CRY)","v":"Annual Reporting RIN Response 2016-17"}]
[null,"7.11 - DEMAND MANAGEMENT INCENTIVE SCHEME"]
[]
[null,"7.11.1 - DMIA - PROJECTS SUBMITTED FOR APPROVAL"]
[null,"Name of project",{"$f":"CONCATENATE(\"Total amount of the DMIA spent in \", CRY)","v":"Total amount of the DMIA spent in 2016-17"}]
[null,null,"Operating expenditure","Capital expenditure","Total"]
[null,null,"$0's, nominal"]
[null,"URBAN LV STATCOM DMIA                   ",0,0,{"$f":"SUM(C10:D10)","v":0}]
[null,"LARGE_LV_STATCOM                        ",0,0]
[null,"SOLAR ENERGY MANAGEMENT SYSTEM          ",0,0]
[null,"CTIP LED STREETLIGHT TRIAL              ",0,0]
[null,"DEMAND RESPONSE AUTOMATION SYSTEM       ",0,0]
[null,"MD K MULTI LED STREETLIGHTS REMOVING BAR",0,0]
[null,"CENTRALISED ENERGY STORAGE SYSTEM",20663,0]
[null,"IoT LOAD CONTROL",114398,0]
[null,"FEEDER OF FUTURE RESEARCH",975,0]
[null,"ARC CUSTOMER RESPONSE AND RISK MANAGEMENT",45155,0]
[null,"FEEDER OF FUTURE PROBE READ",35187,0]
[null,"FEEDER OF FUTURE CONNECTED METER INSTALL",352279,0,352279]
[null,"ADMD CALCULATOR DEVELOPER PILOT",29653,0,29653]
[null,"GRID ADVOCACY",175887,0,175887]
[null,"HOME ENERGY MANAGEMENT SYSTEM ",20538,0,20538]
[null,null,null,null,{"$f":"SUM(C25:D25)","v":0}]
[null,"To enter additional projects - please copy a row from above and \"insert copied cells\" above this row. "]
[null,"Total",{"$f":"SUM(C10:C26)","v":794735},{"$f":"SUM(D10:D26)","v":0},{"$f":"SUM(E10:E26)","v":578357}]

{"sheet":"7.12 Safety and Bushfire","index":17,"n_rows":310,"n_cols":9,"rows_kept":310,"cut":false,"hidden":false,"merged":[[214,3,214,4],[215,3,215,4],[84,3,84,4],[85,3,85,4],[140,1,140,2],[141,1,141,2],[142,1,142,2],[143,1,143,2],[144,1,144,2],[145,1,145,2],[146,1,146,2],[118,1,119,2],[213,1,215,1],[213,2,215,2],[163,2,163,4],[163,1,165,1],[307,6,307,7],[308,6,308,7],[120,1,120,2],[121,1,121,2],[122,1,122,2],[123,1,123,2],[124,1,124,2],[125,1,125,2],[126,1,126,2],[127,1,127,2],[128,1,128,2],[129,1,129,2],[130,1,130,2],[131,1,131,2],[132,1,132,2],[133,1,133,2],[134,1,134,2],[135,1,135,2],[136,1,136,2],[137,1,137,2],[138,1,138,2],[139,1,139,2],[298,6,298,7],[299,6,299,7],[281,6,281,7],[282,6,282,7],[305,6,305,7],[306,6,306,7],[289,6,289,7],[290,6,290,7],[291,6,291,7],[292,6,292,7],[293,6,293,7],[294,6,294,7],[295,6,295,7],[296,6,296,7],[297,6,297,7],[300,6,300,7],[301,6,301,7],[302,6,302,7],[303,6,303,7],[304,6,304,7],[283,6,283,7],[284,6,284,7],[285,6,285,7],[286,6,286,7],[287,6,287,7],[288,6,288,7],[170,8,170,9],[171,8,171,9],[163,8,165,9],[172,8,172,9],[173,8,173,9],[167,8,167,9],[168,8,168,9],[166,8,166,9],[169,8,169,9],[18,6,18,8],[23,2,23,5],[19,6,19,8],[20,6,20,8],[21,6,21,8],[22,6,22,8],[42,6,42,8],[43,6,43,8],[44,6,44,8],[28,6,28,8],[29,6,29,8],[30,6,30,8],[31,6,31,8],[23,6,23,8],[24,6,24,8],[25,6,25,8],[26,6,26,8],[27,6,27,8],[40,6,40,8],[37,6,37,8],[41,6,41,8],[38,6,38,8],[39,6,39,8],[37,2,37,5],[5,1,5,2],[25,2,25,5],[26,2,26,5],[27,2,27,5],[28,2,28,5],[29,2,29,5],[30,2,30,5],[42,2,42,5],[31,2,31,5],[32,2,32,5],[14,1,14,4],[13,1,13,4],[33,2,33,5],[24,2,24,5],[17,2,17,5],[18,2,18,5],[19,2,19,5],[20,2,20,5],[21,2,21,5],[22,2,22,5],[249,1,250,1],[249,2,250,2],[10,1,10,2],[83,1,85,1],[83,2,85,2],[11,1,11,2],[165,2,165,4],[17,6,17,8],[32,6,32,8],[33,6,33,8],[34,2,34,5],[34,6,34,8],[35,2,35,5],[35,6,35,8],[36,2,36,5],[36,6,36,8],[43,2,43,5],[40,2,40,5],[41,2,41,5],[38,2,38,5],[39,2,39,5],[44,2,44,5],[163,5,163,7],[165,5,165,7]]}
[null,{"$f":"(LOOKUP(dms_Model,dms_Model_List,dms_Worksheet_List))","v":"REGULATORY REPORTING STATEMENT"}]
[null,{"$f":"dms_TradingName","v":"Ergon Energy"}]
[null,{"$f":"CONCATENATE(\"Annual Reporting RIN Response \",CRY)","v":"Annual Reporting RIN Response 2016-17"}]
[null,"7.12 SAFETY AND BUSHFIRE RELATED EXPENDITURE"]
[]
[null,"These templates collect information from Victorian businesses only.\n\nBushfire and safety related expenditure information is used by the AER to monitor the expenditures throughout the regulatory control period."]
[]
[null,"CPI applied to convert expected expenditure in real $ to nominal based on lagged September CPI index"]
[]
[null,"Instructions"]
[null,"For \"Exclusive of Margins & Overheads\" reported expenditure is to EXCLUDE any overheads, profit margins or management fees paid directly or indirectly to related party contractors (not including actual incurred expense of the related party contractor) for the reporting period."]
[null,"For \"Value of Margins & Overheads\" reported expenditure is to COMPRISE ONLY the sum of overheads, profit margins or management fees paid directly or indirectly to related party contractors (not including actual incurred expenses of the related party contractor) for the reporting period. "]
[]
[null,{"$f":"CONCATENATE(dms_TradingName, \" is to specify each activity in this table in accordance with the definition in Appendix F of the RIN.\")","v":"Ergon Energy is to specify each activity in this table in accordance with the definition in Appendix F of the RIN."}]
[null,"All activities must be reported but the Reason for Difference is only required if there is a 10 per cent difference between the expected value and the actual value.\n\nUse median unit costs. Where unit costs are not recorded at the asset category level - provide the best estimates of the unit cost using the cost allocation method identified in this table. (As a transitional measure, the unit cost may be based on a statistically significant annual sample of actual work orders at a 5% or better confidence interval.)\n\nProvide basis of allocation where applicable."]
[]
[null,"7.12.1 - SAFETY AND BUSHFIRE RELATED ASSET GROUP DEFINITIONS AND ALLOCATION BASIS"]
[null,"Activity","Definitions",null,null,null,"Basis for allocation of cost to activity"]
[null,"Planned non-preferred services replacements"]
[null,"Planned replacement of non-preferred services due to height "]
[null,"Removal of public lighting switchwire "]
[null,"Replacement of existing SWER lines with 22kV overhead bare conductor "]
[null,"Installation of GFN and associated equipment at zone substations "]
[null,"Replacement of crossarms/insulator sets – pole top fire mitigation"]
[null,"Replacement of crossarms – based on age and condition "]
[null,"Replacement of poles – based on age and condition "]
[null,"Stake poles – based on age and condition "]
[null,"Replacement of undersized poles "]
[null,"Stake undersized poles"]
[null,"Replacement of overhead conductor – mainly steel "]
[null,"Service line clearance – overhead services requiring relocation "]
[null,"Service line clearance – overhead services requiring undergrounding "]
[null,"Replacement of 22kV distribution feeders with ABC/underground cabling"]
[null,"Replacement of SWER with covered carbon core conductor or equivalent"]
[null,"Replacement of SWER with ABC"]
[null,"Replacement of SWER with underground"]
[null,"Replacement of surge diverters (neptune configuration)"]
[null,"Replacement of surge diverters (single phase or three phase)"]
[]
[]
[]
[]
[]
[]
[]
[null,"To enter further activities - please copy row from above and \"insert copied cells\" into a row above this row. "]
[]
[]
[null,"7.12.2 - BUSHFIRE RELATED"]
[]
[null,"7.12.2.1 - NUMBER OF ACTIVITIES"]
[null,"Activity","Units","Actual Number"]
[null,"Planned non-preferred services replacements","number of services"]
[null,"Planned replacement of non-preferred services due to height ","number of services"]
[null,"Removal of public lighting switchwire ","number of spans removed"]
[null,"Replacement of existing SWER lines with 22kV overhead bare conductor ","kms of SWER"]
[null,"Installation of GFN and associated equipment at zone substations ","number of zone substations"]
[null,"Replacement of crossarms/insulator sets – pole top fire mitigation","number of crossarms/sets"]
[null,"Replacement of crossarms – based on age and condition ","number of crossarms"]
[null,"Replacement of poles – based on age and condition ","number of poles"]
[null,"Stake poles – based on age and condition ","number of poles"]
[null,"Replacement of undersized poles ","number of poles"]
[null,"Stake undersized poles","number of poles"]
[null,"Replacement of overhead conductor – mainly steel ","kms "]
[null,"Service line clearance – overhead services requiring relocation ","number of services"]
[null,"Service line clearance – overhead services requiring undergrounding ","number of services"]
[null,"Replacement of 22kV distribution feeders with ABC/underground cabling","number of feeders"]
[null,"Replacement of SWER with covered carbon core conductor or equivalent","kms "]
[null,"Replacement of SWER with ABC","kms "]
[null,"Replacement of SWER with underground","kms "]
[null,"Replacement of surge diverters (neptune configuration)","number of units"]
[null,"Replacement of surge diverters (single phase or three phase)","number of units"]
[null,{"$f":"IF(ISBLANK(B39),\"\",B39)","v":""}]
[null,""]
[null,""]
[null,""]
[null,""]
[null,""]
[null,""]
[null,"To enter further activities - please copy row from above and \"insert copied cells\" into a row above this row. "]
[]
[]
[null,"7.12.2.2 - EXPENDITURE "]
[null,"Activity","Units","Exclusive of Margins & Overheads","Value of Margins & Overheads"]
[null,null,null,"Actual expenditure"]
[null,null,null,"$0's, Nominal"]
[null,"Planned non-preferred services replacements","number of services"]
[null,"Planned replacement of non-preferred services due to height ","number of services"]
[null,"Removal of public lighting switchwire ","number of spans removed"]
[null,"Replacement of existing SWER lines with 22kV overhead bare conductor ","kms of SWER"]
[null,"Installation of GFN and associated equipment at zone substations ","number of zone substations"]
[null,"Replacement of crossarms/insulator sets – pole top fire mitigation","number of crossarms/sets"]
[null,"Replacement of crossarms – based on age and condition ","number of crossarms"]
[null,"Replacement of poles – based on age and condition ","number of poles"]
[null,"Stake poles – based on age and condition ","number of poles"]
[null,"Replacement of undersized poles ","number of poles"]
[null,"Stake undersized poles","number of poles"]
[null,"Replacement of overhead conductor – mainly steel ","kms "]
[null,"Service line clearance – overhead services requiring relocation ","number of services"]
[null,"Service line clearance – overhead services requiring undergrounding ","number of services"]
[null,"Replacement of 22kV distribution feeders with ABC/underground cabling","number of feeders"]
[null,"Replacement of SWER with covered carbon core conductor or equivalent","kms "]
[null,"Replacement of SWER with ABC","kms "]
[null,"Replacement of SWER with underground","kms "]
[null,"Replacement of surge diverters (neptune configuration)","number of units"]
[null,"Replacement of surge diverters (single phase or three phase)","number of units"]
[null,{"$f":"IF(ISBLANK(B39),\"\",B39)","v":""},{"$f":"IF(ISBLANK(C73),\"\",C73)","v":""}]
[null,"",""]
[null,"",""]
[null,"",""]
[null,"",""]
[null,"",""]
[null,"",""]
[null,"To enter further activities - please copy row from above and \"insert copied cells\" into a row above this row. "]
[]
[]
[]
[null,"7.12.2.3 - UNIT COSTS"]
[null,"Activity",null,"Actual"]
[null,null,null,"$0's, Per Unit"]
[null,"Planned non-preferred services replacements"]
[null,"Planned replacement of non-preferred services due to height "]
[null,"Removal of public lighting switchwire "]
[null,"Replacement of existing SWER lines with 22kV overhead bare conductor "]
[null,"Installation of GFN and associated equipment at zone substations "]
[null,"Replacement of crossarms/insulator sets – pole top fire mitigation"]
[null,"Replacement of crossarms – based on age and condition "]
[null,"Replacement of poles – based on age and condition "]
[null,"Stake poles – based on age and condition "]
[null,"Replacement of undersized poles "]
[null,"Stake undersized poles"]
[null,"Replacement of overhead conductor – mainly steel "]
[null,"Service line clearance – overhead services requiring relocation "]
[null,"Service line clearance – overhead services requiring undergrounding "]
[null,"Replacement of 22kV distribution feeders with ABC/underground cabling"]
[null,"Replacement of SWER with covered carbon core conductor or equivalent"]
[null,"Replacement of SWER with ABC"]
[null,"Replacement of SWER with underground"]
[null,"Replacement of surge diverters (neptune configuration)"]
[null,"Replacement of surge diverters (single phase or three phase)"]
[null,{"$f":"IF(ISBLANK(B39),\"\",B39)","v":""}]
[null,""]
[null,""]
[null,""]
[null,""]
[null,""]
[null,""]
[null,"To enter further activities - please copy row from above and \"insert copied cells\" into a row above this row. "]
[]
[]
[null,"7.12.2.4 - CONTINGENT PROJECT APPLICATIONS - VOLUMES APPROVED"]
[null,"Activity","Units","Volume approved under contingent project applications ","Actual volumes","Difference"]
[null,null,null,null,null,{"$f":"E153-D153","v":0}]
[null,null,null,null,null,0]
[null,null,null,null,null,0]
[null,null,null,null,null,0]
[null,null,null,null,null,0]
[null,null,null,null,null,0]
[null,null,null,null,null,0]
[null,null,null,null,null,0]
[null,"To enter further activities - please copy row from above and \"insert copied cells\" into a row above this row. "]
[]
[null,"7.12.2.5 - CONTINGENT PROJECT APPLICATIONS - EXPENDITURE APPROVED"]
[null,"Activity","Exclusive of Margins & Overheads",null,null,"Value of Margins & Overheads",null,null,"Reasons for Difference"]
[null,null,"Expenditure approved under contingent project applications","Actual expenditure ","Difference","Expenditure approved under contingent project applications","Actual expenditure","Difference"]
[null,null,"$0's, Nominal",null,null,"$0's, Nominal"]
[null,{"$f":"IF(ISBLANK(B153),\"\",B153)","v":""},null,null,{"$f":"C167-D167","v":0},null,null,{"$f":"F167-G167","v":0}]
[null,{"$f":"IF(ISBLANK(B154),\"\",B154)","v":""},null,null,{"$f":"C168-D168","v":0},null,null,{"$f":"F168-G168","v":0}]
[null,"",null,null,0,null,null,0]
[null,"",null,null,0,null,null,0]
[null,"",null,null,0,null,null,0]
[null,"",null,null,0,null,null,0]
[null,"",null,null,0,null,null,0]
[null,"",null,null,0,null,null,0]
[null,"To enter further activities - please copy row from above and \"insert copied cells\" into a row above this row. "]
[]
[]
[]
[null,"7.12.3 - SAFETY RELATED"]
[]
[null,"7.12.3.1 - NUMBER OF ACTIVITIES"]
[null,"Activity","Units","Actual units"]
[null,"Planned non-preferred services replacements","number of services"]
[null,"Planned replacement of non-preferred services due to height ","number of services"]
[null,"Removal of public lighting switchwire ","number of spans removed"]
[null,"Replacement of existing SWER lines with 22kV overhead bare conductor ","kms of SWER"]
[null,"Installation of GFN and associated equipment at zone substations ","number of zone substations"]
[null,"Replacement of crossarms/insulator sets – pole top fire mitigation","number of crossarms/sets"]
[null,"Replacement of crossarms – based on age and condition ","number of crossarms"]
[null,"Replacement of poles – based on age and condition ","number of poles"]
[null,"Stake poles – based on age and condition ","number of poles"]
[null,"Replacement of undersized poles ","number of poles"]
[null,"Stake undersized poles","number of poles"]
[null,"Replacement of overhead conductor – mainly steel ","kms "]
[null,"Service line clearance – overhead services requiring relocation ","number of services"]
[null,"Service line clearance – overhead services requiring undergrounding ","number of services"]
[null,"Replacement of 22kV distribution feeders with ABC/underground cabling","number of feeders"]
[null,"Replacement of SWER with covered carbon core conductor or equivalent","kms "]
[null,"Replacement of SWER with ABC","kms "]
[null,"Replacement of SWER with underground","kms "]
[null,"Replacement of surge diverters (neptune configuration)","number of units"]
[null,"Replacement of surge diverters (single phase or three phase)","number of units"]
[null,{"$f":"IF(ISBLANK(B39),\"\",B39)","v":""},{"$f":"IF(ISBLANK(C73),\"\",C73)","v":""}]
[null,"",""]
[null,"",""]
[null,"",""]
[null,"",""]
[null,"",""]
[null,"",""]
[null,"To enter further activities - please copy row from above and \"insert copied cells\" into a row above this row. "]
[]
[]
[null,"7.12.3.2 - EXPENDITURE"]
[null,"Activity","Units","Exclusive of Margins & Overheads","Value of Margins & Overheads"]
[null,null,null,"Actual expenditure"]
[null,null,null,"$0's, Nominal"]
[null,"Planned non-preferred services replacements","number of services"]
[null,"Planned replacement of non-preferred services due to height ","number of services"]
[null,"Removal of public lighting switchwire ","number of spans removed"]
[null,"Replacement of existing SWER lines with 22kV overhead bare conductor ","kms of SWER"]
[null,"Installation of GFN and associated equipment at zone substations ","number of zone substations"]
[null,"Replacement of crossarms/insulator sets – pole top fire mitigation","number of crossarms/sets"]
[null,"Replacement of crossarms – based on age and condition ","number of crossarms"]
[null,"Replacement of poles – based on age and condition ","number of poles"]
[null,"Stake poles – based on age and condition ","number of poles"]
[null,"Replacement of undersized poles ","number of poles"]
[null,"Stake undersized poles","number of poles"]
[null,"Replacement of overhead conductor – mainly steel ","kms "]
[null,"Service line clearance – overhead services requiring relocation ","number of services"]
[null,"Service line clearance – overhead services requiring undergrounding ","number of services"]
[null,"Replacement of 22kV distribution feeders with ABC/underground cabling","number of feeders"]
[null,"Replacement of SWER with covered carbon core conductor or equivalent","kms "]
[null,"Replacement of SWER with ABC","kms "]
[null,"Replacement of SWER with underground","kms "]
[null,"Replacement of surge diverters (neptune configuration)","number of units"]
[null,"Replacement of surge diverters (single phase or three phase)","number of units"]
[null,{"$f":"IF(ISBLANK(B39),\"\",B39)","v":""},{"$f":"IF(ISBLANK(C73),\"\",C73)","v":""}]
[null,"",""]
[null,"",""]
[null,"",""]
[null,"",""]
[null,"",""]
[null,"",""]
[null,"To enter further activities - please copy row from above and \"insert copied cells\" into a row above this row. "]
[]
[]
[]
[]
[null,"7.12.3.3 - UNIT COSTS"]
[null,"Activity","Units","Actual\n  "]
[null,null,null,"$0's per Unit"]
[null,"Planned non-preferred services replacements","number of services"]
[null,"Planned replacement of non-preferred services due to height ","number of services"]
[null,"Removal of public lighting switchwire ","number of spans removed"]
[null,"Replacement of  existing SWER lines with 22kV overhead bare conductor ","kms of SWER"]
[null,"Installation of GFN and associated equipment at zone substations ","number of zone substations"]
[null,"Replacement of crossarms/insulator sets – pole top fire mitigation","number of crossarms/sets"]
[null,"Replacement of crossarms – based on age and condition ","number of crossarms"]
[null,"Replacement of poles – based on age and condition ","number of poles"]
[null,"Stake poles – based on age and condition ","number of poles"]
[null,"Replacement of undersized poles ","number of poles"]
[null,"Stake undersized poles","number of poles"]
[null,"Replacement of overhead conductor – mainly steel ","kms "]
[null,"Service line clearance – overhead services requiring relocation ","number of services"]
[null,"Service line clearance – overhead services requiring undergrounding ","number of services"]
[null,"Replacement of 22kV distribution feeders with ABC/underground cabling","number of feeders"]
[null,"Replacement of SWER with covered carbon core conductor or equivalent","kms "]
[null,"Replacement of SWER with ABC","kms "]
[null,"Replacement of SWER with underground","kms "]
[null,"Replacement of surge diverters (neptune configuration)","number of units"]
[null,"Replacement of surge diverters (single phase or three phase)","number of units"]
[null,{"$f":"IF(ISBLANK(B39),\"\",B39)","v":""},{"$f":"IF(ISBLANK(C73),\"\",C73)","v":""}]
[null,"",""]
[null,"",""]
[null,"",""]
[null,"",""]
[null,"",""]
[null,"",""]
[null,"To enter further activities - please copy row from above and \"insert copied cells\" into a row above this row. "]
[]
[null,"7.12.3.4 - SAFETY IMPROVEMENT OUTCOMES REPORTED TO ESV"]
[null,"Activity","Units","Safety Improvement Programme - outcomes","Safety Improvement Target","Difference","Reasons for Difference"]
[null,"Planned non-preferred services replacements","number of services",null,null,{"$f":"D283-E283","v":0}]
[null,"Planned replacement of non-preferred services due to height ","number of services",null,null,{"$f":"D284-E284","v":0}]
[null,"Removal of public lighting switchwire ","number of spans removed",null,null,0]
[null,"Replacement of  existing SWER lines with 22kV overhead bare conductor ","kms of SWER",null,null,0]
[null,"Installation of GFN and associated equipment at zone substations ","number of zone substations",null,null,0]
[null,"Replacement of crossarms/insulator sets – pole top fire mitigation","number of crossarms/sets",null,null,0]
[null,"Replacement of crossarms – based on age and condition ","number of crossarms",null,null,0]
[null,"Replacement of poles – based on age and condition ","number of poles",null,null,0]
[null,"Stake poles – based on age and condition ","number of poles",null,null,0]
[null,"Replacement of undersized poles ","number of poles",null,null,0]
[null,"Stake undersized poles","number of poles",null,null,0]
[null,"Replacement of overhead conductor – mainly steel ","kms ",null,null,0]
[null,"Service line clearance – overhead services requiring relocation ","number of services",null,null,0]
[null,"Service line clearance – overhead services requiring undergrounding ","number of services",null,null,0]
[null,"Replacement of 22kV distribution feeders with ABC/underground cabling","number of feeders",null,null,0]
[null,"Replacement of SWER with covered carbon core conductor or equivalent","kms ",null,null,0]
[null,"Replacement of SWER with ABC","kms ",null,null,0]
[null,"Replacement of SWER with underground","kms ",null,null,{"$f":"D300-E300","v":0}]
[null,"Replacement of surge diverters (neptune configuration)","number of units",null,null,0]
[null,"Replacement of surge diverters (single phase or three phase)","number of units",null,null,0]
[null,{"$f":"IF(ISBLANK(B39),\"\",B39)","v":""},{"$f":"IF(ISBLANK(C73),\"\",C73)","v":""},null,null,0]
[null,"","",null,null,0]
[null,"","",null,null,{"$f":"D305-E305","v":0}]
[null,"","",null,null,{"$f":"D306-E306","v":0}]
[null,"","",null,null,{"$f":"D307-E307","v":0}]
[null,"","",null,null,0]
[null,"","",null,null,0]
[null,"To enter further activities - please copy row from above and \"insert copied cells\" into a row above this row. "]

{"sheet":"7.13 TARC","index":18,"n_rows":9,"n_cols":3,"rows_kept":9,"cut":false,"hidden":false,"merged":[]}
[null,{"$f":"(LOOKUP(dms_Model,dms_Model_List,dms_Worksheet_List))","v":"REGULATORY REPORTING STATEMENT"}]
[null,{"$f":"dms_TradingName","v":"Ergon Energy"}]
[null,{"$f":"CONCATENATE(\"Annual Reporting RIN Response \",CRY)","v":"Annual Reporting RIN Response 2016-17"}]
[null,"7.13 - TARC"]
[]
[]
[null,"7.13.1 - TOTAL ANNUAL RETAILER CHARGES"]
[null,null,"$0's"]
[null,"TARC",2093722464]

{"sheet":"8.1 Income","index":19,"n_rows":40,"n_cols":12,"rows_kept":40,"cut":false,"hidden":false,"merged":[[6,1,9,1],[6,6,6,10],[7,8,7,10],[6,11,8,11],[9,2,9,11],[6,5,8,5],[7,6,7,7],[6,2,8,2],[6,3,8,3],[6,4,8,4]]}
[null,{"$f":"(LOOKUP(dms_Model,dms_Model_List,dms_Worksheet_List))","v":"REGULATORY REPORTING STATEMENT"}]
[null,{"$f":"dms_TradingName","v":"Ergon Energy"}]
[null,{"$f":"CONCATENATE(\"Annual Reporting RIN Response \",CRY)","v":"Annual Reporting RIN Response 2016-17"}]
[null,"8.1 - INCOME"]
[]
[null,"8.1.1 - INCOME STATEMENT"]
[null,"Description","Audited Statutory Accounts","Adjustments","Distribution business","Standard Control Services","Alternative Control Services",null,null,null,null,"Negotiated Services"]
[null,null,null,null,null,null,"Public Lighting",null,"Other"]
[null,null,null,null,null,null,{"$f":"IF(dms_Jurisdiction=\"Vic\",\"Energy efficient\",\"\")","v":""},{"$f":"IF(dms_Jurisdiction=\"Vic\",\"Non-energy efficient\",\"\")","v":""},"Connection services","Metering services","Ancillary network services"]
[null,null,"$0's, nominal"]
[]
[null,"8.1.1.1 - REVENUE"]
[null,"Distribution revenue",1587403464.3999999,-9256916.5500000007,1578146547.8500001,1500905751.7900002,31938161.57,null,0,45302634.489999987,0]
[null,"Cross boundary revenue",0,5425915.5100000007,5425915.5100000007,5425915.5100000007,0,null,0,0,0]
[null,"Contributions",48458721.680000007,-8829214.0300000012,39629507.650000006,9320548.5700000003,5073841.17,null,18102367.989999998,7132749.9200000018,0]
[null,"Interest income",8789185.75,-8789185.75,0,0,0,null,0,0,0]
[null,"Jurisdictional scheme amounts",106860917.76000001,-90395.549999999988,106770522.21000001,106770522.21000001,0,null,0,0,""]
[null,"Profit from sale of fixed assets",1277855.53,-1277855.53,0,"",0,null,0,0,""]
[null,"TUOS revenue",394196905.73000002,-3062232.31,391134673.41999996,391134673.41999996,0,null,0,0,""]
[null,"Pass through revenue (F-factor)",0,"","","",0,null,0,0,""]
[null,"Other Revenue ",426053506.06999999,-400882845.40000004,25170660.670000002,0,0,null,11024612.600000001,1407330.42,12738717.650000002]
[null,"Total revenue",{"$f":"SUM(C13:C21)","v":2573040556.9200001},-426762729.61000001,2146277827.3100004,2013557411.5,37012002.740000002,0,29126980.59,53842714.829999991,12738717.650000002,0]
[]
[null,"8.1.1.2 - EXPENDITURE"]
[null,"TUOS expenditure",383829967.11999995,-5259435.1500000004,378570531.96999997,378570531.96999997,0,null,0,0,0]
[null,"Avoided TUOS expenditure",3086515.93,52088.851818181109,3138604.78,3138604.78,0,null,0,0,0]
[null,"Cross boundary expenditure",0,5259435.1500000004,5259435.1500000004,5259435.1500000004,0,null,0,0,0]
[null,"Depreciation ",440553764.94999999,-22291914.640000001,418261850.31,401767779.60000002,9959446.8399999999,null,1422299.29,5112324.58,0]
[null,"Finance charges",-11337320.93,11337320.93,0,0,0,null,0,0,0]
[null,"Impairment losses",0,0,0,0,0,null,0,0,0]
[null,"Jurisdictional scheme amounts",100267732.34999999,-30492.37000000001,100237239.98000017,100237239.98000017,0,null,0,0,""]
[null,"Loss from sale of fixed assets",4969784.09,-4969784.09,0,0,0,null,0,0,0]
[null,"Maintenance expenditure",285614026.00999999,-11259341.880000003,274354684.13,256616521.95000002,11510908.370000001,null,0,6227253.8100000005,0]
[null,"Operating expenditure excluding maintenance expenditure",272851690.28000009,-108037848.01000006,164813842.26999998,98824774.169999987,1486103.3099999996,null,9101062.2200000025,31988746.339999989,23413156.230000004]
[null,"Other ",59497510.920000002,-59497510.920000002,0,0,0,null,0,0,0]
[]
[null,"8.1.1.3 - PROFIT"]
[null,"Profit before tax (PBT)",{"$f":"C22-SUM(C25:C35)","v":1033706886.1999998},-232065247.48181814,801641638.72000027,769142523.89999986,14055544.220000003,0,18603619.079999998,10514390.100000001,-10674438.580000002,0]
[null,"Income tax expenses (/ benefit)",262432938.80000001,-58915700.090000004,203517238.71000001,195266506.97,3568359.49,null,4723004.6500000004,2669346.92,-2709979.32]
[null,"Profit after tax",{"$f":"C38-C39","v":771273947.39999986},-173149547.39181814,598124400.01000023,573876016.92999983,10487184.730000002,0,13880614.429999998,7845043.1800000016,-7964459.2600000016,{"$f":"L38-L39","v":0}]

{"sheet":"8.2 Capex","index":20,"n_rows":251,"n_cols":10,"rows_kept":251,"cut":false,"hidden":false,"merged":[[197,1,199,1],[140,1,142,1],[197,3,198,3],[142,2,142,3],[199,2,199,3],[140,4,141,4],[197,4,198,4],[140,3,141,3],[140,2,141,2],[197,2,198,2],[6,1,6,4],[41,1,41,4],[10,1,10,4],[7,1,7,4],[8,1,8,4],[14,1,14,4],[16,1,19,1],[16,2,16,9],[17,2,18,2],[17,3,18,3],[17,4,18,4],[17,5,18,5],[17,6,17,9],[19,2,19,3],[19,5,19,9],[83,5,84,5],[43,2,43,5],[44,2,44,5],[55,2,55,5],[56,2,56,5],[50,2,50,5],[51,2,51,5],[49,2,49,5],[83,4,84,4],[85,2,85,3],[45,2,45,5],[46,2,46,5],[47,2,47,5],[65,2,65,3],[57,2,57,5],[83,3,84,3],[63,4,64,4],[81,1,81,2],[58,2,58,5],[63,3,64,3],[63,5,64,5],[83,1,85,1],[83,2,84,2],[65,5,65,9],[48,2,48,5],[62,1,65,1],[63,2,64,2],[52,2,52,5],[53,2,53,5],[54,2,54,5],[62,2,62,9],[63,6,63,9]]}
[null,{"$f":"(LOOKUP(dms_Model,dms_Model_List,dms_Worksheet_List))","v":"REGULATORY REPORTING STATEMENT"}]
[null,{"$f":"dms_TradingName","v":"Ergon Energy"}]
[null,{"$f":"CONCATENATE(\"Annual Reporting RIN Response \",CRY)","v":"Annual Reporting RIN Response 2016-17"}]
[null,"8.2 - CAPEX"]
[]
[null,"Instructions"]
[null,"Reported expenditure must EXCLUDE capital contributions (except tables 8.2.1 and 8.2.5 which should include all capital contributions)."]
[null,{"$f":"CONCATENATE(\"Forecast expenditure is to be taken from \",dms_TradingName,\"'s \",dms_DeterminationRef,\".\")","v":"Forecast expenditure is to be taken from Ergon Energy's 2015-20 Distribution Determination."}]
[null,"If allocating based on assumptions then provide method in Basis of Preparation. All adjustments must be explained in Basis of Preparation with supporting documentation attached. "]
[]
[null,"For tables 8.2.1 and 8.2.3:\nReported expenditure must INCLUDE any profit margins or management fees paid directly or indirectly to related party contractors (not including actual incurred expenses of the related party contractor) for the regulatory reporting period.\n\n'Related Party Margin Expenditure' must COMPRISE ONLY profit margins or management fees paid directly or indirectly to related party contractors (not including actual incurred expenses of the related party contractor) for the regulatory reporting period."]
[]
[null,"8.2.1 - CAPEX BY PURPOSE - STANDARD CONTROL SERVICES"]
[]
[null,"Each line item in this table must INCLUDE the capital contributions. Total capital contributions should also be identified in the last item in the table. "]
[]
[null,"Description","EXPENDITURE"]
[null,null,"CPI adjusted Forecast","Actual","Difference","Related Party Margin","Voltage level"]
[null,null,null,null,null,null,"Subtransmission","HV","LV","Other "]
[null,null,"$0's, nominal",null," (%)","$0's, nominal"]
[null,"Augmentation capex",119693627,{"$f":"SUM(G21:J21)","v":47851348},{"$f":"IF(C21=0,1,(D21-C21)/C21*1)","v":-0.60021808011549349},2325,3846504,20335557,2837879,20831408]
[null,"Customer connections capex",81164796,{"$f":"SUM(G22:J22)","v":51127218},{"$f":"IF(C22=0,1,(D22-C22)/C22*1)","v":-0.37008135891821869},24,16560,38439211,11937158,734289]
[null,"Asset replacement capex (repex)",160960547,165176499,2.6192455720220682E-2,1918,4756362,105702306,27494419,27223412]
[null,"Metering",3129245,944395,-0.69820356028371056,0,0,0,0,944395]
[null,"Non-network capex",82924996,65390620,-0.21144862038944204,0,0,0,0,65390620]
[null,"Capitalised overheads",204574401,{"$f":"SUM(G26:J26)","v":185355931.99999994},-9.3943665023856329E-2,0,5386578,104163687,26714247,49091419.99999994]
[null,null,null,0,1]
[null,null,null,0,1]
[null,null,null,0,1]
[null,null,null,{"$f":"SUM(G30:J30)","v":0},1]
[null,null,null,0,1]
[null,null,null,0,1]
[null,null,null,0,1]
[null,null,null,0,1]
[null,null,null,0,1]
[null,"Capital contributions included in the above",null,0,1]
[null,"Total",{"$f":"SUM(C21:C35)","v":652447612},515846011.99999994,{"$f":"IF(C37=0,1,(D37-C37)/C37*1)","v":-0.20936792086841152},null,{"$f":"SUM(G21:G35)","v":14006004},{"$f":"SUM(H21:H35)","v":268640761},68983703,164215543.99999994]
[]
[]
[null,"8.2.2 - CAPEX BY PURPOSE - MATERIAL DIFFERENCE EXPLANATION"]
[]
[null,"Where the difference between forecast and actual expenditure shown in table 8.2.1 is a Material Difference please explain the main factors driving the difference."]
[]
[null,"Description","Reason for material difference"]
[null,"Augmentation capex","Main drivers of reduction in Augmentation: \n- Subtransmission investment needs were lower than the 2016/17 forecast levels owing to improved customer reliability and a changing customer load shape. \n- Distribution investment needs were lower than the 2016/17 forecast levels owing to distributed PV generation softening day-peaking load profiles, changing customer energy use and network improvements.",{"$error":"#N/A"},{"$error":"#N/A"},{"$error":"#N/A"}]
[null,"Customer connection capex","Customer Connection Capex was materially lower than the 16-17 CPI adjusted forecast. The 16/17 forecast was for similar levels to those experienced in the prior year, which were within 3% of forecast. The main driver of reduction in Customer Connections Capex against the forecast level was Commercial & Industrial connection requests with a significant reduction in C&I connection projects completed for 16/17 when compared to the previous financial year.   ",{"$error":"#N/A"},{"$error":"#N/A"},{"$error":"#N/A"}]
[null,"Metering","SCS meter expenditure lower than 16-17 Forecast due to slowing of program to bring back within allowances for period and assess metering impacts and implications of Power of Choice reforms on metering strategies.",{"$error":"#N/A"},{"$error":"#N/A"},{"$error":"#N/A"}]
[null,"Non-network capex","Non-network capital expenditure is below forecast due principally to lower than anticipated augmentation and connections activity which has resulted in reduced vehicle usage and consequently fewer replacement vehicles being required. Property expenditure is lower than anticipated due to earlier completion of major building works.",{"$error":"#N/A"},{"$error":"#N/A"},{"$error":"#N/A"}]
[]
[]
[]
[]
[]
[]
[]
[]
[]
[]
[]
[]
[]
[null,"8.2.3 - CAPEX OTHER"]
[null,null,"EXPENDITURE"]
[null,null,"CPI adjusted Forecast","Actual","Difference","Related Party Margin","Voltage level"]
[null,null,null,null,null,null,"Subtransmission","HV","LV","Other "]
[null,null,"$0's, nominal",null," (%)","$0's, nominal"]
[null,"Public lighting"]
[null,{"$f":"IF(dms_Jurisdiction=\"Vic\",\"Energy Efficient\", \"Total\")","v":"Total"},10825796.125461252,{"$f":"SUM(G68:J68)","v":7915512.46832202},{"$f":"IF(C68=0,1,((D68-C68)/C68)*1)","v":-0.26882860377303053},0,0,0,0,7915512.46832202]
[null,{"$f":"IF(dms_Jurisdiction=\"Vic\",\"Non-energy efficient\", \"\")","v":""},null,{"$f":"SUM(G69:J69)","v":0},{"$f":"IF(C69=0,1,((D69-C69)/C69)*1)","v":1}]
[null,"Alternative Control Services"]
[null,"Connection services",null,{"$f":"SUM(G71:J71)","v":18568247.243400007},{"$f":"IF(C71=0,1,((D71-C71)/C71)*1)","v":1},1398,90669.49250721249,9576291.7891159244,5146804.2562222751,3754481.705554598]
[null,"Metering services",15284084,15484381.08,{"$f":"IF(C72=0,1,((D72-C72)/C72)*1)","v":1.3104944987216772E-2},0,0,0,"",15484381.08]
[null,"Ancillary network services",null,0,{"$f":"IF(C73=0,1,((D73-C73)/C73)*1)","v":1},0,0,0,"",0]
[null,"Negotiated Services"]
[null,"Negotiated services",null,{"$f":"SUM(G75:J75)","v":0},{"$f":"IF(C75=0,1,((D75-C75)/C75)*1)","v":1},0,0,0,0,0]
[null,"Total",{"$f":"SUM(C68:C69,C71:C73,C75)","v":26109880.125461251},{"$f":"SUM(D68:D69,D71:D73,D75)","v":41968140.791722029},{"$f":"IF(C76=0,1,((D76-C76)/C76)*1)","v":0.60736627629310613},null,{"$f":"SUM(G68:G69,G71:G73,G75)","v":90669.49250721249},{"$f":"SUM(H68:H69,H71:H73,H75)","v":9576291.7891159244},{"$f":"SUM(I68:I69,I71:I73,I75)","v":5146804.2562222751},{"$f":"SUM(J68:J69,J71:J73,J75)","v":27154375.253876619}]
[]
[]
[]
[null,"8.2.4 - CAPEX BY ASSET CLASS"]
[]
[null,{"$f":"CONCATENATE(dms_TradingName, \" to enter in Table 8.2.4 each Asset Class specified in its current determination as listed in the AER's final decision in its Roll Forward Model and Post-tax Revenue Model and enter information against that Asset Class.\")","v":"Ergon Energy to enter in Table 8.2.4 each Asset Class specified in its current determination as listed in the AER's final decision in its Roll Forward Model and Post-tax Revenue Model and enter information against that Asset Class."}]
[]
[null,"Asset class","CPI adjusted Forecast","Actual ","Difference","Movements in provisions \nallocated to \nas-incurred capex"]
[]
[null,null,"$0's, nominal",null," (%)","$0's, nominal"]
[null,"Overhead Sub-Transmission Lines",22179122,17468730.949999999,{"$f":"IF(C87=0,1,((D87-C87)/C87)*1)","v":-0.21237950943233916},17990.875574284961]
[null,"Underground Sub-Transmission Cables",770293,1019547,{"$f":"IF(C88=0,1,((D88-C88)/C88)*1)","v":0.32358336373302105},1047.8047807855417]
[null,"Overhead Distribution Lines",201630793,214210546.38999999,6.2390040741445607E-2,223466.19262981144]
[null,"Underground Distribution Cables",41401027,21684936.059999999,-0.47622226714327648,23218.800834485326]
[null,"Distribution Equipment  ",17831837,2106761.38,-0.88185393462266404,2165.5352390841895]
[null,"Substation Bays",39966689,47575320,0.19037431396931578,48998.383828439604]
[null,"Substation Establishment",11988236,4845427,-0.59581818375947893,4983.7663253028986]
[null,"Distribution Substation Switchgear",10297133,23282420.27,1.2610585169677813,24205.200206675912]
[null,"Zone Transformers",28164386,9455343,-0.66428016573839033,9717.4045789818229]
[null,"Distribution Transformers",75258495,51895459,-0.31043719383439705,56981.212741768119]
[null,"Low Voltage Services",37390192,10034143,-0.73163702930436947,11532.218609264821]
[null,"Metering",4453532,1566096,-0.64834742402210199,1609.5016962337277]
[null,"Communications – Pilot Wires ",24861866,8786975,-0.64656816185880817,9030.6717058212544]
[null,"Generation Assets",3780633,2967944,-0.21496109249429923,3050.2024999430341]
[null,"Street Lighting",0,0,1,0]
[null,"Other Equipment",18354219,0,-1,0]
[null,"Control Centre - SCADA",3116587,5182289,0.66280902795269314,5361.3532068715895]
[null,"Land & Easements (System)",3329082,663637,-0.80065465494691934,682.0299967048818]
[null,"Metering Type 5-6",0,0,1,""]
[null,"Communications",0,4935993,1,5384.5980941066136]
[null,"IT Systems",6212707,9237574,0.48688389779205749,10974.117373649702]
[null,"Office Equipment & Furniture",1929861,1187745,-0.38454375729650997,1459.5232790152168]
[null,"Motor Vehicles",36223589,21720283,-0.4003829107049553,24306.035819148317]
[null,"Plant & Equipment",7213757,11750024,0.62883557070192408,13148.840947681485]
[null,"Buildings",56093577,27621772,-0.50757691918987446,33942.14093881852]
[null,"Land & Easements",0,2093,1,2.5727373248332781]
[null,"Land Improvements",0,7324404,1,9000.3629657324509]
[null,"Equity Raising Costs",null,0,1,0]
[null,null,null,null,1]
[null,null,null,null,1]
[null,null,null,null,{"$f":"IF(C117=0,1,((D117-C117)/C117)*1)","v":1}]
[null,null,null,null,1]
[null,null,null,null,1]
[null,null,null,null,1]
[null,null,null,null,1]
[null,null,null,null,1]
[null,null,null,null,1]
[null,null,null,null,1]
[null,null,null,null,1]
[null,null,null,null,1]
[null,null,null,null,1]
[null,null,null,null,1]
[null,null,null,null,1]
[null,null,null,null,1]
[null,null,null,null,1]
[null,null,null,null,1]
[null,null,null,null,1]
[null,null,null,null,1]
[null,null,null,null,1]
[null,null,null,null,1]
[null,"Total",{"$f":"SUM(C87:C136)","v":652447613},{"$f":"SUM(D87:D136)","v":506525463.04999995},-0.22365343522223913,{"$f":"SUM(F87:F136)","v":542259.34660993633}]
[]
[]
[null,"8.2.5 - CAPITAL CONTRIBUTIONS BY ASSET CLASS"]
[null,"Asset class","CPI Adjusted Forecast","Actual","Difference"]
[]
[null,null,"$0's, nominal",null," (%)"]
[null,{"$f":"IF(ISBLANK(B87),\"\",B87)","v":"Overhead Sub-Transmission Lines"},1424175,36961.050000000003,{"$f":"IF(C144=0,1,((D144-C144)/C144)*1)","v":-0.9740473958607615}]
[null,"Underground Sub-Transmission Cables",41280,0,{"$f":"IF(C145=0,1,((D145-C145)/C145)*1)","v":-1}]
[null,"Overhead Distribution Lines",9226179,3229145.61,-0.65000184691842644]
[null,"Underground Distribution Cables",4654370,907692.94000000006,-0.80498049360063773]
[null,"Distribution Equipment  ",123841,372.62,-0.99699114186739457]
[null,"Substation Bays",1300334,101661,-0.921819317190814]
[null,"Substation Establishment",51601,3936,-0.92372240848045584]
[null,"Distribution Substation Switchgear",1114572,270007.73,-0.75774761074206065]
[null,"Zone Transformers",237363,0,-1]
[null,"Distribution Transformers",10526513,3549068,-0.66284485660161152]
[null,"Low Voltage Services",2910271,1187071,-0.59210980695612192]
[null,"Metering",0,0,1]
[null,"Communications – Pilot Wires ",10320,155,-0.98498062015503873]
[null,"Generation Assets",0,0,1]
[null,"Street Lighting",0,0,1]
[null,"Other Equipment",0,0,1]
[null,"Control Centre - SCADA",0,34478,1]
[null,"Land & Easements (System)",0,0,1]
[null,"Metering Type 5-6",0,0,1]
[null,"Communications",0,0,1]
[null,"IT Systems",0,0,1]
[null,"Office Equipment & Furniture",0,0,1]
[null,"Motor Vehicles",0,0,1]
[null,"Plant & Equipment",0,0,1]
[null,"Buildings",0,0,1]
[null,"Land & Easements",0,0,1]
[null,"Land Improvements",0,0,1]
[null,"Equity Raising Costs",0,0,1]
[null,"",null,null,1]
[null,"",null,null,{"$f":"IF(C173=0,1,((D173-C173)/C173)*1)","v":1}]
[null,"",null,null,1]
[null,"",null,null,1]
[null,{"$f":"IF(ISBLANK(B119),\"\",B119)","v":""},null,null,1]
[null,"",null,null,1]
[null,"",null,null,1]
[null,"",null,null,1]
[null,"",null,null,1]
[null,"",null,null,1]
[null,"",null,null,1]
[null,"",null,null,{"$f":"IF(C183=0,1,((D183-C183)/C183)*1)","v":1}]
[null,"",null,null,1]
[null,"",null,null,1]
[null,"",null,null,1]
[null,"",null,null,1]
[null,"",null,null,1]
[null,"",null,null,1]
[null,"",null,null,1]
[null,"",null,null,1]
[null,"",null,null,1]
[null,"",null,null,1]
[null,"Total",{"$f":"SUM(C144:C193)","v":31620819},{"$f":"SUM(D144:D193)","v":9320548.9499999993},-0.70524011569719303]
[]
[]
[null,"8.2.6 - DISPOSALS BY ASSET CLASS"]
[null,"Asset class","CPI Adjusted Forecast","Actual","Difference"]
[]
[null,null,"$0's, nominal",null," (%)"]
[null,{"$f":"IF(ISBLANK(B87),\"\",B87)","v":"Overhead Sub-Transmission Lines"},0,0,{"$f":"IF(C201=0,1,((D201-C201)/C201)*1)","v":1}]
[null,"Underground Sub-Transmission Cables",0,0,{"$f":"IF(C202=0,1,((D202-C202)/C202)*1)","v":1}]
[null,"Overhead Distribution Lines",0,0,1]
[null,"Underground Distribution Cables",0,0,1]
[null,"Distribution Equipment  ",0,0,1]
[null,"Substation Bays",0,0,1]
[null,"Substation Establishment",0,0,1]
[null,"Distribution Substation Switchgear",0,0,1]
[null,"Zone Transformers",0,0,1]
[null,"Distribution Transformers",0,0,1]
[null,"Low Voltage Services",0,0,1]
[null,"Metering",0,0,1]
[null,"Communications – Pilot Wires ",0,0,1]
[null,"Generation Assets",0,302025,1]
[null,"Street Lighting",0,0,1]
[null,"Other Equipment",0,0,1]
[null,"Control Centre - SCADA",0,0,1]
[null,"Land & Easements (System)",0,0,1]
[null,"Metering Type 5-6",0,0,1]
[null,"Communications",0,0,1]
[null,"IT Systems",0,0,1]
[null,"Office Equipment & Furniture",0,0,1]
[null,"Motor Vehicles",7224077,6129722,-0.15148717268655912]
[null,"Plant & Equipment",0,958438,1]
[null,"Buildings",0,234724,1]
[null,"Land & Easements",0,877978,1]
[null,"Land Improvements",0,50104,1]
[null,"Equity Raising Costs",0,0,1]
[null,"",null,null,1]
[null,"",null,null,1]
[null,"",null,null,{"$f":"IF(C231=0,1,((D231-C231)/C231)*1)","v":1}]
[null,"",null,null,1]
[null,{"$f":"IF(ISBLANK(B119),\"\",B119)","v":""},null,null,1]
[null,"",null,null,1]
[null,"",null,null,1]
[null,"",null,null,1]
[null,"",null,null,1]
[null,"",null,null,1]
[null,"",null,null,1]
[null,"",null,null,1]
[null,"",null,null,1]
[null,"",null,null,1]
[null,"",null,null,1]
[null,"",null,null,1]
[null,"",null,null,1]
[null,"",null,null,1]
[null,"",null,null,1]
[null,"",null,null,1]
[null,"",null,null,1]
[null,"",null,null,1]
[null,"Total",{"$f":"SUM(C201:C250)","v":7224077},{"$f":"SUM(D201:D250)","v":8552991},0.18395623413205589]

{"sheet":"8.4 Opex","index":21,"n_rows":151,"n_cols":14,"rows_kept":151,"cut":false,"hidden":false,"merged":[[6,1,6,4],[14,1,14,5],[16,2,18,2],[16,3,18,3],[16,4,18,4],[12,1,12,5],[7,1,7,4],[13,1,13,5],[16,1,19,1],[16,13,18,13],[77,13,79,13],[19,8,19,13],[17,8,17,9],[78,8,78,9],[78,10,78,12],[17,10,17,12],[16,8,16,12],[77,8,77,12],[77,5,77,7],[17,5,18,5],[17,6,18,6],[17,7,18,7],[16,5,16,7],[19,2,19,6],[75,1,75,4],[77,1,80,1],[77,2,79,2],[77,3,79,3],[77,4,79,4],[80,8,80,13],[78,6,79,6],[78,7,79,7],[152,2,152,7],[137,1,137,4],[150,2,150,7],[151,2,151,7],[153,2,153,7],[154,2,154,7],[80,2,80,4],[78,5,79,5],[141,2,141,7],[142,2,142,7],[143,2,143,7],[144,2,144,7],[145,2,145,7],[146,2,146,7],[147,2,147,7],[148,2,148,7],[149,2,149,7],[139,2,139,7],[140,2,140,7]]}
[null,{"$f":"(LOOKUP(dms_Model,dms_Model_List,dms_Worksheet_List))","v":"REGULATORY REPORTING STATEMENT"}]
[null,{"$f":"dms_TradingName","v":"Ergon Energy"}]
[null,{"$f":"CONCATENATE(\"Annual Reporting RIN Response \",CRY)","v":"Annual Reporting RIN Response 2016-17"}]
[null,"8.4 OPEX"]
[]
[null,"Instructions"]
[null,{"$f":"CONCATENATE(\"Forecast expenditure is to be taken from \",dms_TradingName,\"'s \",dms_DeterminationRef,\".\")","v":"Forecast expenditure is to be taken from Ergon Energy's 2015-20 Distribution Determination."}]
[null,"If allocating based on assumptions then provide method in Basis of Preparation.  \n\nAll adjustments must be explained in Basis of Preparation with supporting documentation attached. "]
[]
[null,"8.4.1 - OPERATING & MAINTENANCE EXPENDITURE - BY PURPOSE"]
[]
[]
[null,{"$f":"CONCATENATE(dms_TradingName,\" is to list the operating expenditure categories identified in \", dms_TradingName,\"'s regulatory proposal at table 3.2.1.1 current opex categories and cost allocations.\")","v":"Ergon Energy is to list the operating expenditure categories identified in Ergon Energy's regulatory proposal at table 3.2.1.1 current opex categories and cost allocations."}]
[null,{"$f":"CONCATENATE(dms_TradingName, \" must specify any expenditure category where the expense is more than 5 per cent of the total standard control services operating expenditure.\")","v":"Ergon Energy must specify any expenditure category where the expense is more than 5 per cent of the total standard control services operating expenditure."}]
[null,"Reported operating expenditure must INCLUDE any profit margins or management fees paid directly or indirectly to related party contractors (not including actual incurred expenditure of the related party contractor) for the regulatory reporting period.  "]
[]
[null,"Opex category","Audited Statutory Accounts","Adjustments","Distribution business","Standard Control Services",null,null,"Alternative Control Services",null,null,null,null,"Negotiated Services"]
[null,null,null,null,null,"CPI Adjusted Forecast","Actual","Difference","Public Lighting",null,"Other"]
[null,null,null,null,null,null,null,null,{"$f":"IF(dms_Jurisdiction=\"Vic\",\"Energy efficient\",\"\")","v":""},{"$f":"IF(dms_Jurisdiction=\"Vic\",\"Non-energy efficient\",\"\")","v":""},"Connection services","Metering services","Ancillary network services"]
[null,null,"$0's, nominal",null,null,null,null,"%","$0's, nominal"]
[null,"Preventative Maintenance",102525905,-4427224,98098681,74531576,86803808,{"$f":"IF(F21=0,1,((G21-F21)/F21)*1)","v":0.16465815777194889},7085724.3899999997,null,0,4209148.42,0]
[null,"Corrective Maintenance",99640506,-5459765,94180741,109835622,87737452,-0.20119310654971298,4425183.9800000004,null,0,2018105.39,0]
[null,"Forced Maintenance",83447615,-1372353,82075262,71859479,82075262,0.14216333241158066,0,null,0,0,0]
[null,"Other Network Maintenance",0,0,0,0,0,1,0,null,0,0,0]
[null,"Network Operating Costs",45649434,-4202844,41446590,36693524,41446590,0.12953419246404352,0,null,0,0,0]
[null,"Meter reading",12101244,-193198,11908047,0,0,1,0,null,0,11908046.779999999,0]
[null,"Customer service (incl Call Centre)",67643087,-5459617,62183469,10857285,11083667,2.0850700704642091E-2,1486103.31,null,9101062.2200000007,17099480.32,23413156.23]
[null,"Other Operating Costs",108983756,-98172189,10811567,9344212,7830348,-0.16201087903399453,0,null,0,2981219.24,0]
[null,"Training",18392830,0,18392830,21500005,18392830,-0.14451973383262004,0,null,0,0,0]
[null,"Feed-in-Tariff",0,0,0,114957326,0,-1,0,null,0,0,0]
[null,"AEMC Levy",0,0,0,0,0,1,0,null,0,0,0]
[null,"Debt Raising Costs",0,0,0,5055224,0,-1,"                 -  ",null,0,"                   -  ","                   -  "]
[null,"Over Absorbed Overheads",0,0,0,0,0,1,0,null,0,0,0]
[null,"Non-Network Alternatives",4879145,-10000,4869145,8180240,4869145,-0.40476746403528502,0,null,0,0,0]
[null,"Corporate Restructuring",14897325,0,14897325,2160534,14897325,5.8952050743010753,0,null,0,0,0]
[null,"Not Proceeding Network Initiated Capital Works",304869,0,304869,0,304869,{"$f":"IF(F36=0,1,((G36-F36)/F36)*1)","v":1},0,null,0,0,0]
[null,null,null,null,null,null,null,1]
[null,null,null,null,null,null,null,1]
[null,null,null,null,null,null,null,1]
[null,null,null,null,null,null,null,1]
[null,null,null,null,null,null,null,1]
[null,null,null,null,null,null,null,{"$f":"IF(F42=0,1,((G42-F42)/F42)*1)","v":1}]
[null,null,null,null,null,null,null,1]
[null,null,null,null,null,null,null,1]
[null,null,null,null,null,null,null,1]
[null,null,null,null,null,null,null,1]
[null,null,null,null,null,null,null,1]
[null,null,null,null,null,null,null,1]
[null,null,null,null,null,null,null,1]
[null,null,null,null,null,null,null,1]
[null,null,null,null,null,null,null,1]
[null,null,null,null,null,null,null,1]
[null,null,null,null,null,null,null,1]
[null,null,null,null,null,null,null,1]
[null,null,null,null,null,null,null,1]
[null,null,null,null,null,null,null,1]
[null,null,null,null,null,null,null,1]
[null,null,null,null,null,null,null,1]
[null,null,null,null,null,null,null,1]
[null,null,null,null,null,null,null,1]
[null,null,null,null,null,null,null,1]
[null,null,null,null,null,null,null,1]
[null,null,null,null,null,null,null,1]
[null,null,null,null,null,null,null,1]
[null,null,null,null,null,null,null,1]
[null,null,null,null,null,null,null,1]
[null,null,null,null,null,null,null,1]
[null,null,null,null,null,null,null,1]
[null,null,null,null,null,null,null,1]
[null,null,null,null,null,null,null,1]
[null,"Total",{"$f":"SUM(C21:C70)","v":558465716},-119297190,439168526,464975027,355441296,-0.23556906207782208,{"$f":"SUM(I21:I70)","v":12997011.680000002},0,9101062.2200000007,38216000.149999999,23413156.23,0]
[]
[]
[null,"8.4.2 - OPERATING & MAINTENANCE EXPENDITURE - BY PURPOSE - MARGINS ONLY"]
[]
[null,"\"Related party margin expenditure' must COMPRISE ONLY profit margins or management fees paid directly or indirectly to related party contractors (for expenditure that is not an actual incurred expenditure of the related party contractor) for the regulatory reporting period."]
[]
[null,"Opex category","Audited Statutory Accounts","Adjustments","Distribution business","Standard Control Services",null,null,"Alternative Control Services",null,null,null,null,"Negotiated Services"]
[null,null,null,null,null,"CPI Adjusted Forecast","Actual","Difference","Public Lighting",null,"Other"]
[null,null,null,null,null,null,null,null,{"$f":"IF(dms_Jurisdiction=\"Vic\",\"Energy efficient\",\"\")","v":""},{"$f":"IF(dms_Jurisdiction=\"Vic\",\"Non-energy efficient\",\"\")","v":""},"Connection services","Metering services","Ancillary network services"]
[null,null,"$0's, nominal",null,null,null,"$0's, nominal","per cent","$0's, nominal"]
[null,{"$f":"IF(ISBLANK(B21),\"\",B21)","v":"Preventative Maintenance"},0,0,0,0,0,{"$f":"IF(F82=0,1,((G82-F82)/F82)*1)","v":1},0,null,0,0,0]
[null,"Corrective Maintenance",0,0,0,0,0,1,0,null,0,0,0]
[null,"Forced Maintenance",188,0,188,0,188,1,0,null,0,0,0]
[null,"Other Network Maintenance",0,0,0,0,0,1,0,null,0,0,0]
[null,"Network Operating Costs",0,0,0,0,0,1,0,null,0,0,0]
[null,"Meter reading",0,0,0,0,0,1,0,null,0,0,0]
[null,"Customer service (incl Call Centre)",0,0,0,0,0,1,0,null,0,0,0]
[null,{"$f":"IF(ISBLANK(B27),\"\",B27)","v":"Customer service (incl Call Centre)"},null,null,null,null,null,{"$f":"IF(F89=0,1,((G89-F89)/F89)*1)","v":1}]
[null,"Other Operating Costs",3082,0,3082,0,0,1,0,null,0,0,3082]
[null,"Training",202134,33050,169084,0,169084,1,0,null,0,0,0]
[null,"Feed-in-Tariff",0,0,0,0,0,1,0,null,0,0,0]
[null,"AEMC Levy",0,0,0,0,0,1,0,null,0,0,0]
[null,"Debt Raising Costs",0,0,0,0,0,1,0,null,0,0,0]
[null,"Over Absorbed Overheads",0,0,0,0,0,1,0,null,0,0,0]
[null,"Non-Network Alternatives",0,0,0,0,0,1,0,null,0,0,0]
[null,"Corporate Restructuring",0,0,0,0,0,1,0,null,0,0,0]
[null,"Not Proceeding Network Initiated Capital Works",0,0,0,0,0,{"$f":"IF(F98=0,1,((G98-F98)/F98)*1)","v":1},0,null,0,0,0]
[null,"",null,null,null,null,null,1]
[null,"",null,null,null,null,null,1]
[null,"",null,null,null,null,null,1]
[null,"",null,null,null,null,null,1]
[null,"",null,null,null,null,null,1]
[null,"",null,null,null,null,null,{"$f":"IF(F104=0,1,((G104-F104)/F104)*1)","v":1}]
[null,"",null,null,null,null,null,1]
[null,"",null,null,null,null,null,1]
[null,"",null,null,null,null,null,1]
[null,"",null,null,null,null,null,1]
[null,"",null,null,null,null,null,1]
[null,"",null,null,null,null,null,1]
[null,"",null,null,null,null,null,1]
[null,"",null,null,null,null,null,1]
[null,"",null,null,null,null,null,1]
[null,"",null,null,null,null,null,1]
[null,"",null,null,null,null,null,1]
[null,"",null,null,null,null,null,1]
[null,"",null,null,null,null,null,1]
[null,"",null,null,null,null,null,1]
[null,"",null,null,null,null,null,1]
[null,"",null,null,null,null,null,1]
[null,"",null,null,null,null,null,1]
[null,"",null,null,null,null,null,1]
[null,"",null,null,null,null,null,1]
[null,"",null,null,null,null,null,1]
[null,"",null,null,null,null,null,1]
[null,"",null,null,null,null,null,1]
[null,"",null,null,null,null,null,1]
[null,"",null,null,null,null,null,1]
[null,"",null,null,null,null,null,1]
[null,"",null,null,null,null,null,1]
[null,"",null,null,null,null,null,1]
[null,null,null,null,null,null,null,1]
[null,"Total",{"$f":"SUM(C82:C132)","v":205404},{"$f":"SUM(D82:D132)","v":33050},{"$f":"SUM(E82:E132)","v":172354},{"$f":"SUM(F82:F132)","v":0},{"$f":"SUM(G82:G132)","v":169272},1,{"$f":"SUM(I82:I132)","v":0},{"$f":"SUM(J82:J132)","v":0},0,0,{"$f":"SUM(M82:M132)","v":3082},{"$f":"SUM(N82:N132)","v":0}]
[]
[]
[null,"8.4.3 - OPERATING & MAINTENANCE EXPENDITURE - EXPLANATION OF MATERIAL DIFFERENCE"]
[]
[null,"Where the difference between forecast and actual expenditure shown in table 8.4.1, column I is a Material Difference please explain the main factors driving the difference."]
[]
[null,"Category","Explanation"]
[null,"Preventive Mtce","Variance is attributable to a variety of factors including;\n• A trade off in the CPI adjusted forecast categories between preventive and corrective maintenance\n• Higher levels of facility costs (local council rates and electricity charges) than forecast for substation and communication sites ","Preventive Mtce","Preventive Mtce","Preventive Mtce","Preventive Mtce","Preventive Mtce"]
[null,"Corrective Mtce","Variance is attributable to a variety of factors including;\n• A trade off in the CPI adjusted forecast categories between preventive and corrective maintenance\n• Efficiencies in the vegetation management program reflective of improved processes, analysis and application of ROAMES information and management intervention.  \n• Reduced number of non-compliance instances against acceptance criteria identified during the routine maintenance process resulting in less non-routine maintenance work across several asset classes","Corrective Mtce","Corrective Mtce","Corrective Mtce","Corrective Mtce","Corrective Mtce"]
[null,"Forced Mtce","Attributed to impact of Tropical Cyclone Debbie during March 2017\nNote all forecasts were exclusive of major events at request of AER","Forced Mtce","Forced Mtce","Forced Mtce","Forced Mtce","Forced Mtce"]
[null,"Network Operations","Variance is attributable to a variety of factors including;\n• Direct impact of TC Debbie on Operational Control Centre costs\n• Higher than forecast costs associated with data carrier services for remorely accessed equipment","Network Operations","Network Operations","Network Operations","Network Operations","Network Operations"]
[null,"Other Operating Costs","Other operating costs have declined in alignment with the reduction in total operating costs.","Other Operating Costs","Other Operating Costs","Other Operating Costs","Other Operating Costs","Other Operating Costs"]
[null,"Training","Training costs have decreased in alignment with a reduction in staff numbers.","Training","Training","Training","Training","Training"]
[null,"Feed-in-Tariff","Excluded from table 8.4.1 for FY2017 as per AER advice in May 2017. FY2016 excluded by restatement. Included in Income statement 8.1.1 under \"Jurisdictional Scheme\".","Feed-in-Tariff","Feed-in-Tariff","Feed-in-Tariff","Feed-in-Tariff","Feed-in-Tariff"]
[null,"Debt Raising Costs","The key driver of the debt raising costs variance was the restructure of our debt as part of the energy industry merger to form Energy Queensland Limited on 30 June 2016.  Under the Regulation our debt service payment and debt raising costs for the June quarter were transferred to the State of Queensland (for both Ergon Energy and Energex).  Accordingly, we were not required to pay Queensland Treasury Corporation's (QTC) Administration Fees for April to June 2016.   ","Debt Raising Costs","Debt Raising Costs","Debt Raising Costs","Debt Raising Costs","Debt Raising Costs"]
[null,"Non-Network Alternatives","With lower customer demand, there was a reduced need for Non-Network Alternative solutions.","Non-Network Alternatives","Non-Network Alternatives","Non-Network Alternatives","Non-Network Alternatives","Non-Network Alternatives"]
[null,"Corporate Restructuring","Ergon Energy experienced significant organisational change during the year to transition workforce levels therefore a voluntary retrenchment program was offered, resulting in redundancies exceeding AER approved forecasts, to achieve required support cost savings. ","Corporate Restructuring","Corporate Restructuring","Corporate Restructuring","Corporate Restructuring","Corporate Restructuring"]
[null,"Not Proceeding Network Initiated Capital Works","There were a number of projects written off as considered no longer necessary.","Not Proceeding Network Initiated Capital Works","Not Proceeding Network Initiated Capital Works","Not Proceeding Network Initiated Capital Works","Not Proceeding Network Initiated Capital Works","Not Proceeding Network Initiated Capital Works"]

{"sheet":"9.5 TUoS","index":22,"n_rows":60,"n_cols":6,"rows_kept":60,"cut":false,"hidden":false,"merged":[[57,1,57,4],[51,1,51,4],[19,1,19,4],[20,1,20,4],[59,1,59,4],[53,1,53,4],[48,1,48,4],[58,1,58,4],[40,1,40,4],[44,1,44,4],[45,1,45,4],[46,1,46,4],[47,1,47,4],[41,1,41,4],[42,1,42,4],[43,1,43,4],[50,1,50,4],[54,1,54,4],[52,1,52,4],[55,1,55,4],[56,1,56,4],[5,1,5,3],[21,1,21,3],[24,2,24,5],[36,1,36,4],[25,2,25,5],[24,1,27,1],[9,1,9,4],[10,1,10,4],[11,1,11,4],[12,1,12,4],[17,1,17,4],[18,1,18,4],[13,1,13,3]]}
[null,{"$f":"(LOOKUP(dms_Model,dms_Model_List,dms_Worksheet_List))","v":"REGULATORY REPORTING STATEMENT"}]
[null,{"$f":"dms_TradingName","v":"Ergon Energy"}]
[null,{"$f":"CONCATENATE(\"Annual Reporting RIN Response \",CRY)","v":"Annual Reporting RIN Response 2016-17"}]
[null,"9.5 - TUoS AUDIT (t-2)"]
[]
[null,"This template collects information for annual pricing proposals from Victorian businesses only.\n"]
[]
[null,"9.5.1 - TUOS CHARGES (AEMO)"]
[null,null,null,null,null,{"$f":"CRY","v":"2016-17"}]
[]
[]
[]
[]
[null,null,null,null,"Total",{"$f":"SUM(F10:F13)","v":0}]
[]
[null,"9.5.2 - TRANSMISSION CONNECTION FEES"]
[null,null,null,null,null,{"$f":"CRY","v":"2016-17"}]
[]
[]
[]
[]
[null,null,null,null,"Total",{"$f":"SUM(F18:F21)","v":0}]
[]
[null,"9.5.3 - CROSS BOUNDARY NETWORK CHARGES"]
[null,"Distribution Business","Amount (payable)/receivable"]
[null,null,"$0's, nominal"]
[null,null,"HV crossings","Subtransmission crossings","TUoS Adjustment","Total"]
[null,null,null,null,null,{"$f":"CRY","v":"2016-17"}]
[null,null,null,null,null,{"$f":"IF((SUM(C29:E29)=0),\"\",(SUM(C29:E29)))","v":""}]
[null,null,null,null,null,{"$f":"IF((SUM(C30:E30)=0),\"\",(SUM(C30:E30)))","v":""}]
[null,null,null,null,null,""]
[null,null,null,null,null,""]
[null,null,null,null,null,""]
[null,null,null,null,null,""]
[null,null,null,null,null,""]
[null,null,null,null,null,""]
[null,"Total",null,null,null,""]
[]
[null,"9.5.4 - PAYMENTS TO EMBEDDED GENERATORS"]
[null,"9.5.4.1 - AVOIDED TRANSMISSION COSTS",null,null,null,{"$f":"CRY","v":"2016-17"}]
[]
[]
[]
[]
[]
[]
[]
[]
[null,"Total",null,null,null,{"$f":"SUM(F41:F48)","v":0}]
[null,"9.5.4.2 - AVOIDED TUoS USAGE CHARGES",null,null,null,{"$f":"CRY","v":"2016-17"}]
[]
[]
[]
[]
[]
[]
[]
[]
[null,"Total",null,null,null,{"$f":"SUM(F51:F58)","v":0}]
[null,"Total payments to embedded generators",null,null,null,{"$f":"F59+F49","v":0}]

{"sheet":"unlocked","index":23,"n_rows":0,"n_cols":0,"rows_kept":0,"cut":false,"hidden":false,"merged":[]}