{"text_format":"1","workbook":"xlsx","n_sheets":23,"sheets":["AER only","Contents","Instructions","Business & other details","2.11 Labour","3.6 Quality of services","3.6.8 Network-feeders","3.6.9 Network-reliability","4.1 Public lighting","6.2 STPIS Reliability","6.6 STPIS Customer Service","6.7 STPIS Daily Performance","6.8 STPIS Exclusions","6.9 STPIS - GSL","7.8 Avoided TUOS Payments","7.10 Juris Scheme","7.11 DMIS-DMIA","7.12 Safety and Bushfire","7.13 TARC","8.1 Income","8.2 Capex","8.4 Opex","9.5 TUoS"],"not_rendered":{"charts":0,"images":5,"macros":1,"external_links":0,"defined_names":387,"comments":3,"pivot_tables":0},"unopened":[],"bounds":{"document_bytes":16777216,"sheet_cells":100000,"rows_first":2000,"rows_last":500,"rows_between":2000,"halvings":0,"cell_chars":16384,"cell_head_chars":4096},"cells_cut":0,"cells_raw":0,"read":"whole","date_system":"1900"}

{"sheet":"AER only","index":0,"n_rows":74,"n_cols":23,"rows_kept":74,"cut":false,"hidden":true,"merged":[[0,1,0,9],[18,13,18,16]]}
[null,"Data in this worksheet is used for data validation and database purposes."]
[null,"Date last modified:"]
[null,"14 April 2015","merged cell C46/47"]
[null,"17 April 2015","adjusted dms_RYE to automate based on dms_Model (NB: EB & CA refer to CRCP_y5)"]
[null,"14 May 2015","adapted this cover for use in CA & EB RINs"]
[]
[null,"October 2015","added full Trading Name for worksheet headings"]
[null,"USES NAMED RANGES FLAG","yes"]
[null,"dms_Model_List ","dms_Worksheet_List ",null,"dms_RYE_Formula_Result"]
[null,"ARR","REGULATORY REPORTING STATEMENT",null,{"$f":"LEFT(CRY,2)&RIGHT(CRY,2)","v":"2015"}]
[null,"CA","CATEGORY ANALYSIS",null,{"$f":"LEFT(CRY,2)&RIGHT(CRY,2)","v":"2015"}]
[null,"CAM/Service change Backcast","REGULATORY REPORTING STATEMENT",null,{"$f":"LEFT(dms_FRCP_FinalYear_Num,2)&RIGHT(dms_FRCP_FinalYear_Num,2)","v":"2021"}]
[null,"CPI","CPI"]
[null,"EB","ECONOMIC BENCHMARKING",null,{"$f":"LEFT(CRY,2)&RIGHT(CRY,2)","v":"2015"}]
[null,"PTRM","POST TAX REVENUE MODEL",null,{"$f":"LEFT(dms_FRCP_FinalYear_Num,2)&RIGHT(dms_FRCP_FinalYear_Num,2)","v":"2021"}]
[null,"Reset","REGULATORY REPORTING STATEMENT",null,{"$f":"LEFT(dms_FRCP_FinalYear_Num,2)&RIGHT(dms_FRCP_FinalYear_Num,2)","v":"2021"}]
[null,"RFM","ROLL FORWARD MODEL",null,{"$f":"LEFT(dms_CRCP_FinalYear_Num,2)&RIGHT(dms_CRCP_FinalYear_Num,2)","v":"2015"}]
[null,"WACC","WEIGHTED AVERAGE COST OF CAPITAL"]
[null,null,null,null,null,null,null,null,null,null,null,null,null,"Feeder Types",null,null,null,"TasNetworks (D)"]
[null,null,null,null,null,null,null,null,null,null,null,null,null,"CBD","Urban","Short rural","long rural","EXTRA"]
[null,"dms_TradingName_List","dms_TradingNameFull_List","dms_ABN_List","dms_State_List","dms_Sector_List","dms_Segment_List","dms_FormControl_List","dms_CRCPlength_List","dms_FRCPlength_List","dms_JurisdictionList","dms_663_List","dms_DeterminationRef_List","dms_CBD_flag","dms_Urban_flag","dms_ShortRural_flag","dms_LongRural_flag","dms_FeederType_5_flag","dms_FeederName_1","dms_FeederName_2","dms_FeederName_3","dms_FeederName_4","dms_FeederName_5"]
[null,"ActewAGL Distribution","ActewAGL Distribution",76670568688,"ACT","Electricity","Distribution","Revenue cap",5,6,"ACT",5,"2014-19 Distribution Determination","NO","YES","YES","NO","NO","CBD","Urban","Short rural","Long rural"]
[null,"ActewAGL Distribution (Tx Assets)","ActewAGL Distribution (Tx Assets)",76670568688,"ACT","Electricity","Distribution","Revenue cap",5,5,"ACT",5,"distribution determination",null,null,null,null,null,"CBD","Urban","Short rural","Long rural"]
[null,"AGN","AGN",78551685,"SA","Gas","Distribution","Revenue cap",5,5,"SA",5,"distribution determination",null,null,null,null,null,"CBD","Urban","Short rural","Long rural"]
[null,"Ausgrid","Ausgrid",67505337385,"NSW","Electricity","Distribution","Revenue cap",5,5,"NSW",5,"2014-19 Distribution Determination","YES","YES","YES","YES","NO","CBD","Urban","Short rural","Long rural"]
[null,"Ausgrid (Tx Assets)","Ausgrid (Tx Assets)",67505337385,"NSW","Electricity","Distribution","Revenue cap",5,5,"NSW",5,"distribution determination",null,null,null,null,null,"CBD","Urban","Short rural","Long rural"]
[null,"AusNet (D)","AusNet Electricity Services",91064651118,"Vic","Electricity","Distribution","Revenue cap",5,5,"Vic",2,"2016-20 Distribution Determination","NO","YES","YES","YES","NO","CBD","Urban","Short rural","Long rural"]
[null,"AusNet (T)","AusNet (T)",48116124362,"Vic","Electricity","Transmission","Revenue cap",5,5,"Vic",2,"distribution determination",null,null,null,null,null,"CBD","Urban","Short rural","Long rural"]
[null,"Australian Distribution Co.","Australian Distribution Co.",11222333444,"-","Electricity","Distribution","Revenue cap",5,5,"NSW",2,"distribution determination",null,null,null,null,null,"CBD","Urban","Short rural","Long rural"]
[null,"Australian Transmission Co.","Australian Transmission Co.",11222333444,"-","Electricity","Transmission","Revenue cap",5,5,"Vic",5,"distribution determination",null,null,null,null,null,"CBD","Urban","Short rural","Long rural"]
[null,"CitiPower","CitiPower",76064651056,"Vic","Electricity","Distribution","Revenue cap",5,5,"Vic",2,"2016-20 Distribution Determination","YES","YES","NO","NO","NO","CBD","Urban","Short rural","Long rural"]
[null,"Directlink","Directlink",16779340889,"NSW","Electricity","Transmission","Revenue cap",10,5,"Qld",5,"distribution determination",null,null,null,null,null,"CBD","Urban","Short rural","Long rural"]
[null,"ElectraNet","ElectraNet",41094482416,"SA","Electricity","Transmission","Revenue cap",5,5,"SA",5,"distribution determination",null,null,null,null,null,"CBD","Urban","Short rural","Long rural"]
[null,"Endeavour Energy","Endeavour Energy",59253130878,"NSW","Electricity","Distribution","Revenue cap",5,5,"NSW",5,"2014-19 Distribution Determination","NO","YES","YES","YES","NO","CBD","Urban","Short rural","Long rural"]
[null,"Energex","Energex",40078849055,"Qld","Electricity","Distribution","Revenue cap",5,5,"Qld",5,"2015-20 Distribution Determination","YES","YES","YES","NO","NO","CBD","Urban","Short rural","Long rural"]
[null,"Ergon Energy","Ergon Energy",50087646062,"Qld","Electricity","Distribution","Revenue cap",5,5,"Qld",5,"2015-20 Distribution Determination","NO","YES","YES","YES","NO","CBD","Urban","Short rural","Long rural"]
[null,"Essential Energy","Essential Energy",37428185226,"NSW","Electricity","Distribution","Revenue cap",5,5,"NSW",5,"2014-19 Distribution Determination","NO","YES","YES","YES","NO","CBD","Urban","Short rural","Long rural"]
[null,"Jemena Electricity","Jemena Electricity",82064651083,"Vic","Electricity","Distribution","Revenue cap",5,5,"Vic",2,"2016-20 Distribution Determination","NO","YES","YES","NO","NO","CBD","Urban","Short rural","Long rural"]
[null,"Murraylink","Murraylink",79181207909,"NSW","Electricity","Transmission","Revenue cap",5,5,"SA",5,"distribution determination",null,null,null,null,null,"CBD","Urban","Short rural","Long rural"]
[null,"Powercor Australia","Powercor Australia",89064651109,"Vic","Electricity","Distribution","Revenue cap",5,5,"Vic",2,"2016-20 Distribution Determination","NO","YES","YES","YES","NO","CBD","Urban","Short rural","Long rural"]
[null,"Powerlink","Queensland Electricity Transmission Corporation Limited trading as Powerlink Queensland",82078849233,"Qld","Electricity","Transmission","Revenue cap",5,5,"Qld",5,"distribution determination",null,null,null,null,null,"CBD","Urban","Short rural","Long rural"]
[null,"Qld,SA &ACT Gas Reset","Qld,SA &ACT Gas Reset",22222222222,"-","Gas","Distribution","?",5,5,"-","x","distribution determination",null,null,null,null,null,"CBD","Urban","Short rural","Long rural"]
[null,"SA Power Networks","SA Power Networks",13332330749,"SA","Electricity","Distribution","Revenue cap",5,5,"SA",5,"2015-20 Distribution Determination","YES","YES","YES","YES","NO","CBD","Urban","Short rural","Long rural"]
[null,"TasNetworks (D)","TasNetworks (D)",24167357299,"Tas","Electricity","Distribution","Revenue cap",5,5,"Tas",5,"distribution determination","YES","YES","YES","YES","YES","Critical Infrastructure","High density commercial","Urban","High density rural","Low density rural"]
[null,"TasNetworks (T)","TasNetworks (T)",24167357299,"Tas","Electricity","Transmission","Revenue cap",5,5,"Tas",5,"distribution determination",null,null,null,null,null,"CBD","Urban","Short rural","Long rural"]
[null,"TransGrid","TransGrid",19622755774,"NSW","Electricity","Transmission","Revenue cap",5,5,"NSW",5,"distribution determination",null,null,null,null,null,"CBD","Urban","Short rural","Long rural"]
[null,"United Energy","United Energy",70064651029,"Vic","Electricity","Distribution","Revenue cap",5,5,"Vic",2,"2016-20 Distribution Determination","NO","YES","YES","NO","NO","CBD","Urban","Short rural","Long rural"]
[null,"DNSP Backcasting","Victorian DNSP Backcasting",33333333666,"Vic","Electricity","Distribution","?",5,5,"-","x","distribution determination",null,null,null,null,null,"CBD","Urban","Short rural","Long rural"]
[null,"DNSP Reset ","Victorian DNSP Reset ",33333333333,"Vic","Electricity","Distribution","?",5,5,"-","x","distribution determination",null,null,null,null,null,"CBD","Urban","Short rural","Long rural"]
[]
[]
[]
[]
[null,"dms_SourceList","dms_FormControl_Choices",null,"dms_FRCPlength_Num_List","dms_FinalYear_List"]
[null,"After appeal","Revenue cap",null,1,"FRCP_y1"]
[null,"Draft decision","Revenue yield",null,2,"FRCP_y2"]
[null,"Final decision","Weighted average price cap",null,3,"FRCP_y3"]
[null,"Pass through decision",null,null,4,"FRCP_y4"]
[null,"PTRM annual update",null,null,5,"FRCP_y5"]
[null,"PTRM interim update 1",null,null,6,"FRCP_y6"]
[null,"PTRM interim update 2",null,null,7,"FRCP_y7"]
[null,"PTRM interim update 3",null,null,8,"FRCP_y8"]
[null,"PTRM interim update 4",null,null,9,"FRCP_y9"]
[null,"Regulatory proposal",null,null,10,"FRCP_y10"]
[null,"Reporting"]
[null,"Revised regulatory proposal"]
[null,"RFM annual update"]
[null,"WACC annual update"]
[]
[]
[null,"Notes"]
[null,"RFM - Base year is usually CRCP_y1","EG. Victorian 2016-20 - base year = 2011"]
[null,"RFM - Form of Control Field is not relevant"]
[null,"PTRM - capture base year input by NSP","=PTRM input'!Q7"]

{"sheet":"Contents","index":1,"n_rows":31,"n_cols":4,"rows_kept":31,"cut":false,"hidden":false,"merged":[[2,1,2,3],[3,1,3,3],[4,1,4,3]]}
[]
[]
[null,{"$f":"CONCATENATE(dms_Segment,\" Network Service Provider\")","v":"Distribution Network Service Provider"}]
[null,"Annual Reporting RIN Template"]
[null,"Table of Contents"]
[]
[]
[null,null,"Instructions"]
[null,null,"Business & other details"]
[]
[]
[null,"CATEGORY ANALYSIS","STPIS","STATUTORY ACCOUNTS"]
[]
[null,"2.11 Labour","6.2 STPIS Reliability","8.1 Income"]
[null,null,"6.6 STPIS Customer Service","8.2 Capex"]
[null,null,"6.7 STPIS Daily Performance"]
[null,null,"6.8 STPIS Exclusions","8.4 Opex"]
[null,null,"6.9 STPIS GSL"]
[]
[]
[]
[null,"NETWORK PERFORMANCE","OTHER INFORMATION","PRICING PROPOSAL"]
[null,null,null,"Victorian Businesses Only"]
[null,"3.6 Quality of services","7.8 Avoided Cost Payments"]
[null,"3.6.8 Network-feeders","7.10 Juris Scheme","9.5 TUoS"]
[null,"3.6.9 Network-reliability","7.11 DMIS-DMIA"]
[null,null,"7.12 Safety and Bushfire"]
[null,null,"7.13 TARC"]
[null,"PUBLIC LIGHTING"]
[]
[null,"4.1 Public lighting tariffs"]

{"sheet":"Instructions","index":2,"n_rows":26,"n_cols":6,"rows_kept":26,"cut":false,"hidden":false,"merged":[[17,2,17,4],[19,2,19,4],[25,2,25,4],[7,1,7,5],[8,1,8,5],[14,2,14,4],[10,2,10,4],[16,2,16,3]]}
[]
[]
[]
[]
[]
[]
[]
[null,{"$f":"CONCATENATE(dms_Segment,\" Network Service Provider\")","v":"Distribution Network Service Provider"}]
[null,"Annual Reporting RIN Template"]
[]
[null,null,{"$f":"CONCATENATE(\"This template is to be used by \",dms_TradingName, \" to fulfil its annual reporting obligations to the AER.\")","v":"This template is to be used by Essential Energy to fulfil its annual reporting obligations to the AER."}]
[null,null,null,null,null,"Amendments made December 2015"]
[null,null,null,null,null,"Click here for details."]
[null,null,"INSTRUCTIONS"]
[null,null,"Complete the Business & other details worksheet before entering data or values in any other worksheets. The Business & other details worksheet is linked to other cells within the workbook and automatically generates certain column headings and conditional formatting."]
[]
[null,null,"Identifying CONFIDENTIAL INFORMATION:\n\nPlease use the macro at the top of each \nworksheet to identify confidential information. \n\n"]
[null,null,"-Do this by selecting the cell or cells that contain confidential information and then run the Mark selected cells as CONFIDENTIAL macro. This will format the cells a specific colour that is identified by the AER's database which in turn marks that information as confidential.\n\n-To reverse this, select the cell or cells and run the Return cells to NON-CONFIDENTIAL macro"]
[]
[null,null,"All amounts are to be unrounded and reported in nominal terms on a one for one basis: that is 1000 is to be entered as '1000' not '1' as in previous templates.\n\nColour coding of input sheets:"]
[null,null,null,"Yellow = Input cells"]
[null,null,null,"Grey = Not applicable/No inputs required"]
[null,null,null,"Leave coloured cells blank if no information exists. \nPLEASE DO NOT ENTER TEXT into cells that are to contain numeric data."]
[]
[]
[null,null,"Returning completed responses\n\nPlease return two (2) files to the AER: \n1. A confidential version which must contain a complete set of all responses with confidential information marked using the Mark selected cells CONFIDENTIAL macro and which has been completed using the locked template file provided by the AER. \n\n2. A public version with confidential information either removed completely or aggregated in some form together with writtten consent to disclose the public version of the response.\n\nUse the drop down box on the Business and other details worksheet to identify the file as either confidential ('consolidated') or public. "]

{"sheet":"Business & other details","index":3,"n_rows":78,"n_cols":13,"rows_kept":78,"cut":false,"hidden":false,"merged":[[13,3,13,4],[14,3,14,4],[30,6,30,7],[71,4,71,9],[48,3,48,4],[50,3,50,9],[23,5,23,8],[24,5,24,8],[6,2,6,9],[11,2,11,9],[32,2,32,9],[28,6,28,7],[29,6,29,7],[19,3,19,4],[22,3,22,4],[17,3,17,4],[24,3,24,4],[28,3,28,4],[29,3,29,4],[30,3,30,4],[17,5,17,8],[18,5,18,8],[19,5,19,8],[22,5,22,8]]}
[null,null,{"$f":"(LOOKUP(dms_Model,dms_Model_List,dms_Worksheet_List))","v":"REGULATORY REPORTING STATEMENT"}]
[null,null,{"$f":"dms_TradingName","v":"Essential Energy"}]
[null,null,{"$f":"CONCATENATE(\"Annual Reporting RIN Response \",CRY)","v":"Annual Reporting RIN Response 2014-15"}]
[null,null,"BUSINESS & OTHER DETAILS"]
[]
[null,null,"Instructions"]
[null,null,"Complete the following business details regulatory template before entering data or values in any other regulatory templates. This regulatory template is linked to other cells within these worksheets and is used to automatically generate some column headings and to apply conditional formatting to certain cells."]
[]
[]
[null,null,"SUBMISSION PARTICULARS INPUT SHEETS"]
[]
[null,null,"ENTITY DETAILS"]
[]
[null,null,"Short name","Essential Energy"]
[null,null,"ACN / ABN",{"$f":"INDEX(dms_ABN_List,MATCH(dms_TradingName,dms_TradingName_List))","v":37428185226}]
[]
[]
[null,null,"Business address","Address 1",null,"8 Buller Street"]
[null,null,null,null,"Address 2"]
[null,null,null,"Suburb",null,"Port Macquarie"]
[null,null,null,null,"State",{"$f":"INDEX(dms_State_List,MATCH(dms_TradingName,dms_TradingName_List))","v":"NSW"},"p/code",2444]
[]
[null,null,"Postal address","Address 1",null,"PO Box 5730"]
[null,null,null,null,"Address 2"]
[null,null,null,"Suburb",null,"Port Macquarie "]
[null,null,null,null,"State","NSW","p/code",2444]
[]
[]
[null,null,"Contact name/s","Natalie Lindsay",null,null,"Catherine Waddell"]
[null,null,"Contact phone/s","02 6589 8419",null,null,"02 6338 3553"]
[null,null,"Contact email address/s","natalie.lindsay@essentialenergy.com.au",null,null,"catherine.waddell@essentialenergy.com.au"]
[]
[null,null,"REGULATORY CONTROL PERIODS"]
[]
[null,null,"Forthcoming regulatory control period","2016-17",{"$f":"IF(dms_RPT=\"financial\",VALUE(LEFT(FRCP_y1,4)+1)&\"-\"&VALUE(MID(FRCP_y1,3,2)+2),VALUE(LEFT(FRCP_y1,4)+1))","v":"2017-18"},{"$f":"IF(dms_RPT=\"financial\",VALUE(LEFT(FRCP_y2,4)+1)&\"-\"&VALUE(MID(FRCP_y2,3,2)+2),VALUE(LEFT(FRCP_y2,4)+1))","v":"2018-19"},{"$f":"IF(dms_RPT=\"financial\",VALUE(LEFT(FRCP_y3,4)+1)&\"-\"&VALUE(MID(FRCP_y3,3,2)+2),VALUE(LEFT(FRCP_y3,4)+1))","v":"2019-20"},{"$f":"IF(dms_RPT=\"financial\",VALUE(LEFT(FRCP_y4,4)+1)&\"-\"&VALUE(MID(FRCP_y4,3,2)+2),VALUE(LEFT(FRCP_y4,4)+1))","v":"2020-21"},{"$f":"IF(dms_RPT=\"financial\",VALUE(LEFT(FRCP_y5,4)+1)&\"-\"&VALUE(MID(FRCP_y5,3,2)+2),VALUE(LEFT(FRCP_y5,4)+1))","v":"2021-22"},{"$f":"IF(dms_RPT=\"financial\",VALUE(LEFT(FRCP_y6,4)+1)&\"-\"&VALUE(MID(FRCP_y6,3,2)+2),VALUE(LEFT(FRCP_y6,4)+1))","v":"2022-23"},{"$f":"IF(dms_RPT=\"financial\",VALUE(LEFT(FRCP_y7,4)+1)&\"-\"&VALUE(MID(FRCP_y7,3,2)+2),VALUE(LEFT(FRCP_y7,4)+1))","v":"2023-24"},{"$f":"IF(dms_RPT=\"financial\",VALUE(LEFT(FRCP_y8,4)+1)&\"-\"&VALUE(MID(FRCP_y8,3,2)+2),VALUE(LEFT(FRCP_y8,4)+1))","v":"2024-25"},{"$f":"IF(dms_RPT=\"financial\",VALUE(LEFT(FRCP_y9,4)+1)&\"-\"&VALUE(MID(FRCP_y9,3,2)+2),VALUE(LEFT(FRCP_y9,4)+1))","v":"2025-26"}]
[]
[]
[null,null,"Current regulatory control period",{"$f":"IF(dms_RPT=\"financial\",VALUE(LEFT(CRCP_y2,4)-1)&\"-\"&TEXT(VALUE(RIGHT(CRCP_y2,2)-1),\"0#\"),VALUE(LEFT(CRCP_y2,4)-1))","v":"2011-12"},{"$f":"IF(dms_RPT=\"financial\",VALUE(LEFT(CRCP_y3,4)-1)&\"-\"&TEXT(VALUE(RIGHT(CRCP_y3,2)-1),\"0#\"),VALUE(LEFT(CRCP_y3,4)-1))","v":"2012-13"},{"$f":"IF(dms_RPT=\"financial\",VALUE(LEFT(CRCP_y4,4)-1)&\"-\"&TEXT(VALUE(RIGHT(CRCP_y4,2)-1),\"0#\"),VALUE(LEFT(CRCP_y4,4)-1))","v":"2013-14"},{"$f":"IF(dms_RPT=\"financial\",VALUE(LEFT(CRCP_y5,4)-1)&\"-\"&TEXT(VALUE(RIGHT(CRCP_y5,2)-1),\"0#\"),VALUE(LEFT(CRCP_y5,4)-1))","v":"2014-15"},{"$f":"IF(dms_RPT=\"financial\",VALUE(LEFT(FRCP_y1,4)-1)&\"-\"&TEXT(VALUE(RIGHT(FRCP_y1,2)-1),\"0#\"),VALUE(LEFT(FRCP_y1,4)-1))","v":"2015-16"}]
[]
[]
[null,null,"Previous regulatory control period",{"$f":"IF(dms_RPT=\"financial\",VALUE(LEFT(PRCP_y2,4)-1)&\"-\"&TEXT(VALUE(MID(PRCP_y2,3,2)),\"0#\"),VALUE(LEFT(PRCP_y2,4)-1))","v":"2006-07"},{"$f":"IF(dms_RPT=\"financial\",VALUE(LEFT(PRCP_y3,4)-1)&\"-\"&TEXT(VALUE(MID(PRCP_y3,3,2)),\"0#\"),VALUE(LEFT(PRCP_y3,4)-1))","v":"2007-08"},{"$f":"IF(dms_RPT=\"financial\",VALUE(LEFT(PRCP_y4,4)-1)&\"-\"&TEXT(VALUE(MID(PRCP_y4,3,2)),\"0#\"),VALUE(LEFT(PRCP_y4,4)-1))","v":"2008-09"},{"$f":"IF(dms_RPT=\"financial\",VALUE(LEFT(PRCP_y5,4)-1)&\"-\"&TEXT(VALUE(RIGHT(PRCP_y5,2)-1),\"0#\"),VALUE(LEFT(PRCP_y5,4)-1))","v":"2009-10"},{"$f":"IF(dms_RPT=\"financial\",VALUE(LEFT(CRCP_y1,4)-1)&\"-\"&TEXT(VALUE(RIGHT(CRCP_y1,2)-1),\"0#\"),VALUE(LEFT(CRCP_y1,4)-1))","v":"2010-11"}]
[]
[]
[null,null,"Current regulatory year","2014-15"]
[]
[]
[]
[]
[null,null,"Source","Reporting"]
[null,null,"Consolidated confidential or public version?","Consolidated"]
[null,null,"Amended RIN submission - amendment reason","Corrected data errors in Table 7.13.1."]
[null,null,"EBSS - First application of scheme in forthcoming period?","No"]
[null,null,"Sector",{"$f":"INDEX(dms_Sector_List,MATCH(dms_TradingName,dms_TradingName_List))","v":"Electricity"},"dms_Sector","=INDEX(dms_Sector_List,MATCH(dms_TradingName,dms_TradingName_List))"]
[null,null,"Segment",{"$f":"INDEX(dms_Segment_List,MATCH(dms_TradingName,dms_TradingName_List))","v":"Distribution"},"dms_Segment","=INDEX(dms_Segment_List,MATCH(dms_TradingName,dms_TradingName_List))"]
[null,null,"Regulatory Year Ending",{"$f":"INDEX(dms_RYE_Formula_Result,MATCH(dms_Model,dms_Model_List))","v":"2015"},"dms_RYE","=INDEX(dms_RYE_Formula_Result,MATCH(dms_Model,dms_Model_List))"]
[null,null,"Reporting Period Type",{"$f":"IF(LEN(FRCP_y1)>4,\"Financial\",\"Calendar\")","v":"Financial"},"dms_RPT","=IF(LEN(FRCP_y1)>4,\"Financial\",\"Calendar\")"]
[null,null,"Model or RIN Type","ARR","dms_Model"]
[null,null,"Security Classification","Public","dms_Classification"]
[null,null,"Template - version no.",5,"dms_TemplateNumber"]
[null,null,"Dollar $ real  (the last month before the FRCP_y1)",{"$f":"CONCATENATE(IF(dms_RPT=\"Financial\",\"June \",\"December \"),VALUE((LEFT(FRCP_y1,2))&RIGHT(FRCP_y1,2))-1)","v":"June 2016"},"dms_DollarReal","=CONCATENATE(IF(dms_RPT=\"Financial\",\"June \",\"December \"),VALUE((LEFT(FRCP_y1,2))&RIGHT(FRCP_y1,2))-1)"]
[null,null,"Form of control",{"$f":"INDEX(dms_FormControl_List,MATCH(dms_TradingName,dms_TradingName_List))","v":"Revenue cap"},"dms_FormControl","=INDEX(dms_FormControl_List,MATCH(dms_TradingName,dms_TradingName_List))"]
[null,null,"RIN response - version no.",1,"dms_RINversion"]
[null,null,"Jurisdiction",{"$f":"INDEX(dms_JurisdictionList,MATCH(dms_TradingName,dms_TradingName_List))","v":"NSW"},"dms_Jurisdiction","=INDEX(dms_JurisdictionList,MATCH(dms_TradingName,dms_TradingName_List))"]
[null,null,"Length of current reg control period",{"$f":"INDEX(dms_CRCPlength_List,MATCH(dms_TradingName,dms_TradingName_List))","v":5},"dms_CRCPlength","=INDEX(dms_CRCPlength_List,MATCH(dms_TradingName,dms_TradingName_List))"]
[null,null,"Length of forthcoming reg control period",{"$f":"INDEX(dms_FRCPlength_List,MATCH(dms_TradingName,dms_TradingName_List))","v":5},"dms_FRCPlength","=INDEX(dms_FRCPlength_List,MATCH(dms_TradingName,dms_TradingName_List))"]
[null,null,"FRCP length in years",{"$f":"INDEX(dms_FRCPlength_List,MATCH(dms_TradingName,dms_TradingName_List))","v":5},"dms_FRCPlength_Num","=INDEX(dms_FRCPlength_List,MATCH(dms_TradingName,dms_TradingName_List))"]
[null,null,"FRCP Final Year Reference",{"$f":"INDEX(dms_FinalYear_List,MATCH(dms_FRCPlength_Num,dms_FRCPlength_Num_List))","v":"FRCP_y5"},"dms_FRCP_FinalYear","=INDEX(dms_FinalYear_List,MATCH(dms_FRCPlength_Num,dms_FRCPlength_Num_List))"]
[null,null,"FRCP Final Year",{"$f":"INDIRECT(dms_FRCP_FinalYear)","v":"2020-21"},"dms_FRCP_FinalYear_Num","=INDIRECT(dms_FRCP_FinalYear)"]
[null,null,"CRCP length in years",5,"dms_CRCPlength_Num","=INDEX(dms_CRCPlength_List,MATCH(dms_TradingName,dms_TradingName_List))"]
[null,null,"CRCP Final Year Reference","CRCP_y5","dms_CRCP_FinalYear","=INDEX(dms_CFinalYear_List,MATCH(dms_CRCPlength_Num,dms_CRCPlength_Num_List))"]
[null,null,"CRCP Final Year","2014-15","dms_CRCP_FinalYear_Num","=INDIRECT(dms_CRCP_FinalYear)"]
[null,null,"Backcast templates only - unit of measure ","$0s","If the cover sheet is for Backcast data ensure to apply dms_Backcast_UOM named range to this field. Otherwise, do not apply this named range."]
[null,null,"Table 6.6.3 - Public lighting repair - no. business days",{"$f":"INDEX(dms_663_List,MATCH(dms_TradingName,dms_TradingName_List))","v":5}]
[null,null,"Distribution Determination Reference",{"$f":"INDEX(dms_DeterminationRef_List,MATCH(dms_TradingName,dms_TradingName_List))","v":"2014-19 Distribution Determination"},"=dms_DeterminationRef"]
[null,null,"CBD Feeder for this business",{"$f":"INDEX(dms_CBD_flag,MATCH(dms_TradingName,dms_TradingName_List))","v":"NO"},"dms_CBD_flag_NSP"]
[null,null,"Urban Feeder for this business",{"$f":"INDEX(dms_Urban_flag,MATCH(dms_TradingName,dms_TradingName_List))","v":"YES"},"dms_Urban_flag_NSP"]
[null,null,"Short rural Feeder for this business",{"$f":"INDEX(dms_ShortRural_flag,MATCH(dms_TradingName,dms_TradingName_List))","v":"YES"},"dms_ShortRural_flag_NSP"]
[null,null,"Long rural Feeder for this business",{"$f":"INDEX(dms_LongRural_flag,MATCH(dms_TradingName,dms_TradingName_List))","v":"YES"},"dms_LongRural_flag_NSP"]

{"sheet":"2.11 Labour","index":4,"n_rows":36,"n_cols":4,"rows_kept":36,"cut":false,"hidden":false,"merged":[]}
[null,{"$f":"(LOOKUP(dms_Model,dms_Model_List,dms_Worksheet_List))","v":"REGULATORY REPORTING STATEMENT"}]
[null,{"$f":"dms_TradingName","v":"Essential Energy"}]
[null,{"$f":"CONCATENATE(\"Annual Reporting RIN Response \",CRY)","v":"Annual Reporting RIN Response 2014-15"}]
[null,"2.11 LABOUR "]
[]
[null,"Tables 2.11.1 and 2.11.2 deliberately omitted."]
[]
[null,"2.11.3 - LABOUR / NON-LABOUR EXPENDITURE SPLIT"]
[null,"2.11.3.1 - Opex"]
[null,null,{"$f":"CRY","v":"2014-15"}]
[null,null,"$0's, nominal"]
[null,null,"Opex "]
[null,"In-house labour expenditure",244086338.90547946]
[null,"Labour expenditure outsourced to related parties"]
[null,"Labour expenditure outsourced to unrelated parties",5059450.0092513645]
[null,"Controllable non-labour expenditure",{"$f":"dms_Total_Actual_Opex-SUM('2.11 Labour'!C13:C15,'2.11 Labour'!C17)","v":138871586.77623704}]
[null,"Uncontrollable non-labour expenditure",3282491.3330000001]
[null,"Total",{"$f":"SUM(C13:C17)","v":391299867.02396786}]
[]
[null,"Reconciliation with Opex worksheets - SCS","Opex"]
[null,"Total including margins",{"$f":"dms_Total_Actual_Opex","v":391299867.02396786},{"$f":"IF(C18=dms_Total_Actual_Opex,\"OK\",\"Error\")","v":"OK"}]
[]
[]
[null,"2.11.3.2 - Capex"]
[null,null,{"$f":"CRY","v":"2014-15"}]
[null,null,"$0's, nominal"]
[null,null,"Capex"]
[null,"In-house labour expenditure",189611389.49423245]
[null,"Labour expenditure outsourced to related parties"]
[null,"Labour expenditure outsourced to unrelated parties",3930286.9248338039]
[null,"Controllable non-labour expenditure",{"$f":"dms_Total_Actual_Capex-SUM(C28:C30,C32)","v":430095915.13736588}]
[null,"Uncontrollable non-labour expenditure"]
[null,"Total",{"$f":"SUM(C28:C32)","v":623637591.55643213}]
[]
[null,"Reconciliation with Capex & Opex worksheets - SCS","Capex"]
[null,"Total including margins",{"$f":"dms_Total_Actual_Capex","v":623637591.55643213},{"$f":"IF(C33=dms_Total_Actual_Capex,\"OK\",\"Error\")","v":"OK"}]

{"sheet":"3.6 Quality of services","index":5,"n_rows":71,"n_cols":4,"rows_kept":71,"cut":false,"hidden":false,"merged":[[6,2,7,2],[24,2,25,2],[24,1,25,1]]}
[null,{"$f":"(LOOKUP(dms_Model,dms_Model_List,dms_Worksheet_List))","v":"REGULATORY REPORTING STATEMENT"}]
[null,{"$f":"dms_TradingName","v":"Essential Energy"}]
[null,{"$f":"CONCATENATE(\"Annual Reporting RIN Response \",CRY)","v":"Annual Reporting RIN Response 2014-15"}]
[null,"3.6 QUALITY OF SERVICES"]
[]
[null,"3.6.5 - QUALITY OF SUPPLY METRICS"]
[null,null,"Unit","Volume"]
[null,null,null,{"$f":"CRY","v":"2014-15"}]
[null,"Over voltage events - due to high voltage injection","number"]
[null,"Customers receiving over-voltage - due to high voltage injection","number"]
[null,"Over voltage events - due to lightning","number"]
[null,"Customers receiving over-voltage - due to lightning","number"]
[null,"Over voltage events - due to voltage regulation or other cause","number"]
[null,"Customers receiving over-voltage - due to voltage regulation or other cause","number"]
[null,"Voltage variations - steady state (zone sub)","number"]
[null,"Voltage variations - one minute (zone sub)","number"]
[null,"Voltage variations - 10 seconds (zone sub) Min<0.7","number"]
[null,"Voltage variations - 10 seconds (zone sub) Min<0.8","number"]
[null,"Voltage variations - 10 seconds (zone sub) Min<0.9","number"]
[null,"Voltage variations - steady state (feeder)","number"]
[null,"Voltage variations - % zone subs monitored","(per cent)"]
[null,"Voltage variations - % feeders monitored","(per cent)"]
[]
[null,"3.6.6 - COMPLAINTS - TECHNICAL QUALITY OF SUPPLY"]
[null,null,"Unit","Volume"]
[null,null,null,{"$f":"CRY","v":"2014-15"}]
[null,"3.6.6.1 - TECHNICAL QUALITY OF SUPPLY"]
[null,"Number of complaints - technical quality of supply","number",1043]
[null,"3.6.6.2 - PERCENTAGE OF COMPLAINTS BY CATEGORY"]
[null,"Low voltage supply","(per cent)"]
[null,"Voltage dips","(per cent)"]
[null,"Voltage swell","(per cent)"]
[null,"Voltage spike (impulsive transient)","(per cent)"]
[null,"Waveform distortion","(per cent)"]
[null,"TV or radio interference","(per cent)"]
[null,"Solar related","(per cent)"]
[null,"Noise from appliances","(per cent)"]
[null,"Other","(per cent)"]
[null,"3.6.6.3 - PERCENTAGE OF COMPLAINTS BY LIKELY CAUSE"]
[null,"Network equipment faulty","(per cent)"]
[null,"Network interference by NSP equipment","(per cent)"]
[null,"Network interference by another customer","(per cent)"]
[null,"Network limitation","(per cent)"]
[null,"Customer internal problem","(per cent)"]
[null,"No problem identified","(per cent)"]
[null,"Environmental","(per cent)"]
[null,"Other","(per cent)"]
[]
[null,"3.6.7 - CUSTOMER SERVICE METRICS"]
[null,null,"Unit",{"$f":"CRY","v":"2014-15"}]
[null,"3.6.7.1 - TIMELY PROVISIONS OF SERVICES"]
[null,"Number of connections made","number",9690]
[null,"Number of connections not made on or before agreed date","number","Not Available"]
[null,"3.6.7.2 - TIMELY REPAIR OF FAULTY STREET LIGHTS"]
[null,"Street lights - average monthly number \"out\"","number",565.70000000000005]
[null,"Street lights - not repaired by \"fix by\" date","number",227]
[null,"Street lights - average number of days to repair","number",3.56]
[null,"Total number of street lights","number",154009]
[null,"3.6.7.3 - CALL CENTRE PERFORMANCE"]
[null,"Calls to call centre fault line","number",264070.3924999999]
[null,"Calls to fault line answered within 30 seconds","number",182345.07940000008]
[null,"Calls to fault line - average waiting time before call answered","number",41]
[null,"Call centre - number of overload events","number",2]
[null,"Percentage of calls abandoned","(per cent)",8.4500000000000006E-2]
[null,"3.6.7.4 - NUMBER OF CUSTOMER COMPLAINTS"]
[null,"Complaint - reliability of supply","number"]
[null,"Complaint - technical quality of supply","number",{"$f":"IF(ISBLANK(D28),\"\",D28)","v":1043}]
[null,"Complaint - administrative process or customer service","number"]
[null,"Complaint - connection or augmentation","number"]
[null,"Complaint - other","number"]
[null,"Total number of complaints","number"]

{"sheet":"3.6.8 Network-feeders","index":6,"n_rows":1467,"n_cols":23,"rows_kept":1467,"cut":false,"hidden":false,"merged":[[5,6,5,8],[5,1,5,4],[11,8,12,8],[11,9,12,9],[11,20,12,20],[10,20,10,22],[11,21,11,22],[10,1,12,1],[10,2,12,2],[10,3,12,3],[10,4,12,4],[10,7,12,7],[11,5,12,5],[11,6,12,6],[10,5,10,6],[10,8,10,9],[5,10,5,14],[10,10,10,14],[11,11,11,12],[11,13,11,14],[11,18,11,19],[11,15,12,15],[11,10,12,10],[10,15,10,19],[11,16,11,17]]}
[null,{"$f":"(LOOKUP(dms_Model,dms_Model_List,dms_Worksheet_List))","v":"REGULATORY REPORTING STATEMENT"},null,null,null,null,{"$f":"CONCATENATE(\"1-Jan-\",LEFT(CRY,4))","v":"1-Jan-2014"}]
[null,{"$f":"dms_TradingName","v":"Essential Energy"}]
[null,{"$f":"CONCATENATE(\"Annual Reporting RIN Response \",CRY)","v":"Annual Reporting RIN Response 2014-15"}]
[null,"3.6 QUALITY OF SERVICES"]
[]
[null,"Did the MAIFI parameter of the STPIS apply during the period?",null,null,null,"No","** IMPORTANT\nPlease ensure this question is answered correctly. Your response will affect other tables throughout this workbook and will determine which cells are grey and which are input cells. "]
[]
[]
[]
[null,"3.6.8 - NETWORK FEEDER RELIABILITY"]
[null,"Feeder ID / name","Description of the service area for the feeder","Feeder classification\n\n(drop down)","Number of distribution customers","Length of high voltage distribution lines",null,"Maximum demand\n(MVA)","Energy not supplied\n(MWh)",null,"Unplanned Outages",null,null,null,null,"Planned Outages",null,null,null,null,"Momentary feeder outages"]
[null,null,null,null,null,"Overhead","Underground",null,"Unplanned","Planned","Total number of unplanned outages","Unplanned customer minutes off-supply (SAIDI)",null,"Unplanned interruptions\n(SAIFI)",null,"Total number of planned outages","Planned customer minutes off-supply (SAIDI)",null,"Planned interruptions\n(SAIFI)",null,"Total number of momentary feeder outages","Momentary interruptions due to feeder outages (MAIFI)"]
[null,null,null,null,null,null,null,null,null,null,null,"Including excluded events and MEDs","After removing excluded events and MED","Including excluded events and MEDs","After removing excluded events and MED",null,"Including MEDs","After removing  MED","Including MEDs","After removing  MED",null,"Including excluded events and MEDs","After removing excluded events and MED"]
[null,"ADA12 Adaminaby","COOMA","Short Rural",341,131988,328,0.81799999999999995,5.7335004412965542,0.32502617857622318,23,0.261650640067909,0.261650640067909,1.41225154323584E-3,1.41225154323584E-3,4,1.4832702732654499E-2,1.4832702732654499E-2,6.1503148555053198E-5,6.1503148555053198E-5]
[null,"ADA22 Illawong","COOMA","Short Rural",364,165426,255,0.76100000000000001,3.7199231867305667,0.28155435322385947,26,0.278088226846821,0.27255990609745701,1.55266439182379E-3,1.51901172563329E-3,7,2.1048002047010499E-2,7.6751287649645603E-3,1.03278872101882E-4,5.3380091198725398E-5]
[null,"ADE22 Rural West","TUMUT","Short Rural",262,156532,0,0.57100000000000006,2.8858974807483295,0.37168937078024272,41,0.18212706898622499,0.18212706898622499,1.37279669321939E-3,1.37279669321939E-3,8,2.3457068771544201E-2,2.3457068771544201E-2,1.2532717064048601E-4,1.2532717064048601E-4]
[null,"ADE32 Adelong Town","TUMUT","Short Rural",535,37864,0,1.2110000000000001,3.8979267220156668,3.1974531094361578,18,0.21941886487236101,0.21941886487236101,2.0609356949768801E-3,2.0609356949768801E-3,8,0.17998838402798001,0.17998838402798001,4.1543636193790601E-4,4.1543636193790601E-4]
[null,"AFD2A04 Ashford and Rural","INVERELL","Short Rural",389,119726,31,0.7316182611170936,9.8988907671702986,0.27342916424015667,49,0.47468246098466499,0.465909559039831,2.3916601730559301E-3,2.37541405834328E-3,3,1.31117750098782E-2,1.31117750098782E-2,4.7577907372777001E-5,4.7577907372777001E-5]
[null,"AHY2T04 Northern","MOREE","Long Rural",235,398415,0,0.91452282639636728,3.5235415042736116,3.9494392255797388,45,0.15893690067067401,9.2605174735666998E-2,1.5863170580143E-3,1.0443930886707099E-3,36,0.17814793131838999,0.172960778977992,6.45202841445463E-4,6.2779628996761797E-4]
[null,"AHY2T05 Gins","MOREE","Short Rural",163,45422,79,5.7919779005103251,1.1947777521988932,1.3355404480456638E-2,18,6.7893673820952696E-2,2.6828137574420301E-2,9.7592731952452297E-4,4.3980553400688898E-4,2,7.5892564443405205E-4,7.5892564443405205E-4,4.1775723546828597E-5,4.1775723546828597E-5]
[null,"ALJ8B1 North St","ALBURY","Urban",139,1438,419,4.6869294852813814,0,3.8104557239260766,0,0,0,0,0,4,4.13231532084046E-2,4.1044648384759103E-2,1.48535905944279E-4,1.4621503241390001E-4]
[null,"ALJ8B2 Olive St CBD","ALBURY","Urban",491,85,4639,5.8681881360433552,3.045435775478853E-3,1.7815799286551275,2,4.7577907372777001E-5,4.7577907372777001E-5,2.3208735303793598E-6,2.3208735303793598E-6,3,2.7833075813074499E-2,2.7833075813074499E-2,1.97274250082246E-4,1.97274250082246E-4]
[null,"ALJ8B3 East Albury","ALBURY","Urban",2237,18099,2827,6.0206086071094171,0.81935707581267514,23.98537701968878,4,3.1288856499809399E-2,3.1288856499809399E-2,2.21643422151229E-4,2.21643422151229E-4,18,0.91593157832745098,0.91593157832745098,2.90573366003496E-3,2.90573366003496E-3]
[null,"ALJ8B4 Young St Sth Albury","ALBURY","Urban",639,3014,4495,4.3820885431492593,3.5683615159299966E-3,2.7061466743202334,1,1.0908105592783E-4,1.0908105592783E-4,1.1604367651896799E-6,1.1604367651896799E-6,12,8.2724055680076902E-2,8.2584803268254098E-2,2.4949390451578198E-4,2.48333467750592E-4]
[null,"ALJ8B5 Kiewa St CBD","ALBURY","Urban",898,1157,6570,7.354287728937452,1.3792511580333895,4.5822533265940012E-2,5,4.5128225361461501E-2,4.5128225361461501E-2,1.06760182397451E-3,1.06760182397451E-3,2,1.49928430062507E-3,1.49928430062507E-3,1.04439308867071E-5,1.04439308867071E-5]
[null,"ALJ8B6 Newmarket","ALBURY","Urban",1613,13536,7677,6.5921853736071467,2.8141305082718113,2.172093890175073,6,0.16788502856705201,0.16788502856705201,2.00291385671739E-3,2.00291385671739E-3,11,0.12958249225843599,0.12958249225843599,5.3612178551763301E-4,5.3612178551763301E-4]
[null,"ALJ8B7 Macauley St CBD","ALBURY","Urban",479,1279,6500,6.9732365512722998,4.4970849034558273E-2,1.1016128365426987,1,9.0514067684795195E-4,9.0514067684795195E-4,1.50856779474659E-5,1.50856779474659E-5,5,2.2172465272479298E-2,2.2172465272479298E-2,7.1947079441760307E-5,7.1947079441760307E-5]
[null,"ALJ8B8 West Albury","ALBURY","Urban",3126,11661,9544,9.0690180284306408,1.2806291708985431,5.3748675276969511,17,0.10054256220956399,7.7937254023669397E-2,1.04787439896628E-3,7.5544433413848302E-4,20,0.42198238573034103,0.42198238573034103,1.4876799329731701E-3,1.4876799329731701E-3]
[null,"ALU12 Lavington East","ALBURY","Urban",1821,9600,4333,5.2204011340125964,8.5549878906415451,2.5334252195636031,15,0.50059153264105505,0.50059153264105505,4.6765601637144202E-3,4.6765601637144202E-3,5,0.14824231544268601,0.14824231544268601,3.9919024722525102E-4,3.9919024722525102E-4]
[null,"ALU22 West Albury/Howlong","ALBURY","Short Rural",1148,112803,4005,3.3151452456868311,1.9882846574392681,1.9032050656971722,30,0.14714802357311199,0.14714802357311199,1.7325320904282E-3,1.7325320904282E-3,17,0.14085149368519301,0.134863639976814,5.4656571640433998E-4,5.2335698110054704E-4]
[null,"ALU32 Lavington West/Jindera","ALBURY","Long Rural",3610,648191,12114,6.5159751380741202,39.219518478953574,9.0341697150885132,123,1.99203708291727,1.9521714382859401,1.54570177123266E-2,1.4894205881209601E-2,86,0.45886338700160001,0.45878679817509699,1.5689105065364499E-3,1.5677500697712601E-3]
[null,"ALU42 Lavington CBD","ALBURY","Urban",1252,5390,1510,5.9062932538098716,17.445982131750906,1.2886940301566219,7,0.64258837741349095,0.64258837741349095,3.0554300027444302E-3,3.0554300027444302E-3,3,4.7466505443318797E-2,4.7466505443318797E-2,1.3345022799681299E-4,1.3345022799681299E-4]
[null,"ALU52 Fallon St","ALBURY","Urban",660,8147,2656,3.0484094213212236,2.5040184333899247,3.4572451370573569,8,8.7051324377469194E-2,8.7051324377469194E-2,9.17905481265039E-4,9.17905481265039E-4,16,0.120189917080991,0.120189917080991,7.2759385177393102E-4,7.2759385177393102E-4]
[null,"ALU62 Thurgoona","ALBURY","Short Rural",3290,92781,28633,7.0875519045718463,1.3332145925647236,1.7274316578828897,18,0.10320692502244,0.103107127460634,4.0035068399044003E-4,3.9919024722525102E-4,28,0.133724091073398,0.13055841957796099,6.4752371497584296E-4,6.3824022085432505E-4]
[null,"ALU72 Lavington","ALBURY","Urban",3698,18765,1544,5.8681881360433552,18.600033410078264,3.576514316426763,25,1.5616032362260499,1.54531070404279,1.65408656510137E-2,1.6420180227434002E-2,9,0.30027345692371699,0.30027345692371699,1.0850083754523499E-3,1.0850083754523499E-3]
[null,"ALU82 Nth Albury","ALBURY","Urban",2779,14776,1852,6.2873444314750246,2.5078615433631923,10.33000257983907,14,0.14230552095197599,0.14230552095197599,4.4328684430245899E-4,4.4328684430245899E-4,12,0.58616330014290796,0.58616330014290796,1.8079604801655199E-3,1.8079604801655199E-3]
[null,"ALU8B10 Ettamogah","ALBURY","Long Rural",659,201238,7075,7.2399723756379064,9.8578863083866057,5.3320478701392018,38,0.23880396103485399,0.238675152553918,9.9565474453274698E-4,9.9449430776755803E-4,23,0.12916705589649799,0.12916705589649799,4.03831994286009E-4,4.03831994286009E-4]
[null,"ALU92 Thurgoona Industrial","ALBURY","Urban",73,3365,5651,3.8867220121845603,0,6.2115787262847229E-2,0,0,0,0,0,2,2.11199491264522E-4,2.11199491264522E-4,2.3208735303793598E-6,2.3208735303793598E-6]
[null,"ANN8B1 No.1 72 Line","WEST WYALONG","Long Rural",410,411866,0,0.91,2.172475208099228,7.4724429812336144,41,9.5897333838510193E-2,9.5043252379330506E-2,5.3496134875244395E-4,5.2567785463092603E-4,50,0.32984834832134102,0.32984834832134102,1.3368231534985099E-3,1.3368231534985099E-3]
[null,"ANN8B2 No.2 Weethalle 71 Line","WEST WYALONG","Long Rural",243,359902,0,0.56999999999999995,1.3939202687267209,1.4435430910146119,41,6.3890166981048296E-2,6.3890166981048296E-2,2.6109827216767802E-4,2.6109827216767802E-4,6,6.6164623040820103E-2,6.6164623040820103E-2,3.1099705307083498E-4,3.1099705307083498E-4,null,null," "]
[null,"APA3B1 Fdr No.1 Line 83","TEMORA","Short Rural",123,188470,0,0.34,0.12982758415451495,0.59713661507604343,9,7.7180649252765804E-3,7.7180649252765804E-3,5.4540527963915103E-5,5.4540527963915103E-5,2,3.5498921083917598E-2,3.5498921083917598E-2,1.5781940006579699E-4,1.5781940006579699E-4]
[null,"APA3B2 Fdr No.2 Line 82","TEMORA","Short Rural",46,92594,51,0.25,1.7885644876425445E-2,0.16441434713374628,7,1.39832630205357E-3,1.39832630205357E-3,1.8566988243034899E-5,1.8566988243034899E-5,2,1.28541580480061E-2,1.28541580480061E-2,5.2219654433535699E-5,5.2219654433535699E-5]
[null,"APA3B3 Fdr No.3 Line 81","TEMORA","Short Rural",105,195114,0,0.4,0.26144555043891426,0.46044529512115034,16,1.6805445233477E-2,1.6805445233477E-2,8.8193194154415798E-5,8.8193194154415798E-5,3,2.95969396961628E-2,2.95969396961628E-2,1.21845860344917E-4,1.21845860344917E-4]
[null,"APA3B4 Ariah Park Town","TEMORA","Short Rural",209,7519,43,0.4,0,1.4640847930594458,0,0,0,0,0,2,5.6078106677791402E-2,5.6078106677791402E-2,2.30926916272747E-4,2.30926916272747E-4]
[null,"ARD No.1 Line 141 Nth","TEMORA","Short Rural",22,31031,0,0.11,0.31069138512735844,0.3842299858542767,6,1.27323121876612E-2,1.27323121876612E-2,3.9454850016449201E-5,3.9454850016449201E-5,7,1.5745966466858798E-2,1.46772042061191E-2,6.9626205911380896E-5,6.6144895615811896E-5]
[null,"ARD No.2 Ardlethan Town Sth","TEMORA","Short Rural",349,99709,0,0.69,0.85522249486114466,3.6566269263262079,17,3.5047511182258802E-2,3.5047511182258802E-2,1.24166733875296E-4,1.24166733875296E-4,23,0.14985068079923899,0.149634839560914,6.8929943852267096E-4,6.8697856499229197E-4]
[null,"ASM3B1 Dobney Ave","WAGGA WAGGA","Urban",699,3757,860,2.59,7.5242576552361412E-2,6.5954978113668172,3,2.08414443028067E-3,2.08414443028067E-3,1.97274250082246E-5,1.97274250082246E-5,8,0.18268872038057701,0.18268872038057701,7.6240695472962097E-4,7.6240695472962097E-4]
[null,"ASM3B10 Moorong St","WAGGA WAGGA","Short Rural",364,19614,653,2.2000000000000002,0.48425203254730215,1.5632759235276541,9,1.0713152216231101E-2,1.0713152216231101E-2,9.3995377980364195E-5,9.3995377980364195E-5,6,3.4584496912948098E-2,3.4584496912948098E-2,2.1235992802971199E-4,2.1235992802971199E-4]
[null,"ASM3B2 Kincaid St","WAGGA WAGGA","Urban",892,5972,981,2.59,1.3721991962560329,0.27458986836371868,6,8.7031596952461002E-2,8.7031596952461002E-2,1.08152706515678E-3,1.08152706515678E-3,2,1.74158349719667E-2,1.74158349719667E-2,5.2219654433535699E-5,5.2219654433535699E-5]
[null,"ASM3B3 Turvey Pk","WAGGA WAGGA","Short Rural",1674,12036,2195,3.18,0.56434112758850452,1.822073490787834,5,4.0429616899208501E-2,4.0429616899208501E-2,1.55498526535417E-4,1.55498526535417E-4,6,0.130534050405892,0.130534050405892,5.6281183111699595E-4,5.6281183111699595E-4]
[null,"ASM3B4 Fernleigh Rd West","WAGGA WAGGA","Short Rural",1199,6785,4908,2.74,2.3169674666300497,1.6709771257225168,6,0.183379180255865,0.183379180255865,1.596760988901E-3,1.596760988901E-3,6,0.132251496818373,0.132251496818373,4.5140990165878599E-4,4.5140990165878599E-4]
[null,"ASM3B7 Chaston St","WAGGA WAGGA","Urban",361,3148,821,2.77,5.0567451423846513E-2,0.41229691218267311,1,1.61880928743961E-3,1.61880928743961E-3,3.5973539720880099E-5,3.5973539720880099E-5,4,1.3198807767267401E-2,1.3198807767267401E-2,6.38240220854325E-5,6.38240220854325E-5]
[null,"ASM3B8 Urana St","WAGGA WAGGA","Short Rural",924,7890,1524,2.12,0,2.9339623859201001,0,0,0,0,0,6,0.129929462851228,0.129929462851228,5.6861401494294396E-4,5.6861401494294396E-4]
[null,"ASM3B9 Ashmont Sth","WAGGA WAGGA","Short Rural",1071,10924,2604,2.8,0.27839312842864539,0.74418701202806059,6,1.8848974376976E-2,1.8848974376976E-2,1.19524986814537E-4,1.19524986814537E-4,2,5.0386164344536001E-2,5.0386164344536001E-2,2.5993783540248901E-4,2.5993783540248901E-4]
[null,"ATA3B1 Attunga","TAMWORTH","Short Rural",406,108828,13,1.760456440813007,9.1712520356312499,0.49543422824907263,54,0.50618947959632998,0.13108293699582599,1.4888403697383599E-3,4.8506256784928699E-4,6,2.7344531934929701E-2,2.7344531934929701E-2,1.0908105592783E-4,1.0908105592783E-4]
[null,"ATA3B2 Somerton","TAMWORTH","Short Rural",275,166916,0,1.5394467577672177,5.6694350639330651,0.47764896483816283,70,0.311686352509357,0.15757802921863701,1.8126022272262801E-3,1.22658166080549E-3,6,2.6259523559477301E-2,2.6259523559477301E-2,1.4621503241390001E-4,1.4621503241390001E-4]
[null,"AVE3B1 Alstonville Nth","BALLINA","Short Rural",476,39305,5153,0.92,2.3377823524136967,2.255087508895536,14,0.18626982823795199,0.17979923283525501,6.5680720909736001E-4,6.4288196791508401E-4,32,0.17968086828520499,0.17968086828520499,6.4636327821065303E-4,6.4636327821065303E-4]
[null,"AVE3B2 Alstonville 2","BALLINA","Urban",512,4257,1101,1.05,5.9687550546225175E-3,1.2644890739247985,1,3.7482107515626701E-4,3.7482107515626701E-4,1.1604367651896799E-6,1.1604367651896799E-6,3,7.9406366968399603E-2,7.9406366968399603E-2,3.0403443247969698E-4,3.0403443247969698E-4]
[null,"AVE3B3 Wollongbar","BALLINA","Short Rural",1301,44734,5642,2.67,3.7098007586455588,0.64138759815285751,24,0.17577367769681199,0.17577367769681199,1.7093233551243999E-3,1.7093233551243999E-3,9,3.0389518006787401E-2,3.01632328375754E-2,1.2996891770124399E-4,1.2880848093605501E-4]
[null,"AVE3B4 Rous/Uralba","BALLINA","Short Rural",420,57528,976,0.96,1.414163054301232,1.2766261140860728,21,0.106812402051884,0.10593743273093099,1.19408943138018E-3,1.18828724755423E-3,13,9.6424172129906296E-2,9.6424172129906296E-2,3.6437714426955999E-4,3.6437714426955999E-4]
[null,"AVE3B5 Alstonville 1","BALLINA","Urban",1057,8074,1788,1.83,2.7437545272321331,4.094170755740028,8,0.14561508660629699,0.14561508660629699,1.6083653565529001E-3,1.6083653565529001E-3,7,0.21728366122441201,0.21728366122441201,8.0534311504163901E-4,8.0534311504163901E-4]
[null,"AVE3B6 Wardell","BALLINA","Short Rural",961,118687,1519,1.64,9.9154187415779855,0.44480012332863433,55,0.64960437809582805,0.39821780121602202,4.5315055680657098E-3,3.4522993764393001E-3,8,2.9140888047443299E-2,2.9140888047443299E-2,1.4041284858795199E-4,1.4041284858795199E-4]
[null,"AVE3B7 Alstonville East","BALLINA","Short Rural",1273,44309,6525,2.3099999999999996,0.77404950492022917,2.642769549981971,21,6.5727138380343594E-2,6.5727138380343594E-2,1.8868701801984199E-3,1.8868701801984199E-3,22,0.22440642208914599,0.22440642208914599,7.8445525326822495E-4,7.8445525326822495E-4]
[null,"BAL3B10 Airport","BALLINA","Urban",473,5877,2829,3.6999999999999997,0.33388878474236261,0.58883155940833742,2,4.9863967800200604E-3,4.9863967800200604E-3,1.03278872101882E-4,1.03278872101882E-4,1,8.7937898066074108E-3,8.7937898066074108E-3,2.0887861773414299E-5,2.0887861773414299E-5]
[null,"BAL3B11 Ballina East No.1","BALLINA","Short Rural",2311,11144,4076,3.34,5.8453356502082912,0.75033762479515342,17,0.49169214308881598,0.44816880177361201,6.4961250115318399E-3,6.2315454290685903E-3,4,6.3116155658666795E-2,6.3116155658666795E-2,2.9359050159299E-4,2.9359050159299E-4]
[null,"BAL3B12 Ballina Central No.3","BALLINA","Urban",1115,5754,848,2.48,2.5441146753577177,0.22220737197306234,5,0.13307424648489199,0.13307424648489199,1.61880928743961E-3,1.61880928743961E-3,3,1.1622934640139901E-2,1.1622934640139901E-2,1.14883239753779E-4,1.14883239753779E-4]
[null,"BAL3B13 Ballina Heights","BALLINA","Short Rural",554,4967,4403,1.07,6.6493396051203642E-3,0.78958182671621879,4,5.6629314141256497E-4,5.6629314141256497E-4,5.8021838259484103E-6,5.8021838259484103E-6,5,6.7244989669211705E-2,6.7244989669211705E-2,3.6089583397399101E-4,3.6089583397399101E-4]
[null,"BAL3B2 Ballina CBD West","BALLINA","Short Rural",905,7977,3351,2.8099999999999996,6.0804131794646929E-3,0.10710565647881386,3,3.4348928249614599E-4,3.4348928249614599E-4,3.4813102955690501E-6,3.4813102955690501E-6,1,6.0505172936990001E-3,6.0505172936990001E-3,2.5529608834173001E-5,2.5529608834173001E-5]
[null,"BAL3B3 Ballina Central No.2","BALLINA","Urban",1431,5649,467,3.26,1.2478856689419595,3.1714281056975979,8,7.37852112778207E-2,7.37852112778207E-2,1.91007891550222E-3,1.91007891550222E-3,2,0.18752077907082701,0.18752077907082701,4.5257033842397598E-4,4.5257033842397598E-4]
[null,"BAL3B4 Ballina Nth","BALLINA","Short Rural",145,28475,3583,1.21,1.5369529827405812E-2,0.83963620427197849,3,1.0316282842536299E-3,1.0316282842536299E-3,3.3652666190500797E-5,3.3652666190500797E-5,4,5.63577719382021E-2,5.63577719382021E-2,1.6826333095250399E-4,1.6826333095250399E-4]
[null,"BAL3B5 Ballina East No.2","BALLINA","Short Rural",2011,10444,11950,3.26,1.1396712784158882,0.16643628468396393,10,8.3990092190898799E-2,8.3990092190898799E-2,2.4229919657160598E-3,2.4229919657160598E-3,2,1.22658166080549E-2,1.22658166080549E-2,5.9182275024673801E-5,5.9182275024673801E-5]
[null,"BAL3B6 Ballina West","BALLINA","Short Rural",379,40366,1596,0.61,0.74388988632926067,1.8505282963135217,10,5.5428262089285203E-2,5.5428262089285203E-2,7.2759385177393102E-4,7.2759385177393102E-4,5,0.13788541731336801,0.13788541731336801,4.2007810899866502E-4,4.2007810899866502E-4]
[null,"BAL3B7 Ballina Central No.1","BALLINA","Urban",589,2752,1386,2.98,0.12914508382848572,0,1,2.7943317305767499E-3,2.7943317305767499E-3,6.4984458850622198E-5,6.4984458850622198E-5,0,0,0,0,0]
[null,"BAL3B8 Ballina CBD Nth","BALLINA","Urban",767,2236,2146,2.71,0.17884227424729471,0.36508257805548172,1,1.22310035050993E-2,1.22310035050993E-2,1.4389415888352099E-4,1.4389415888352099E-4,1,2.4967957439821199E-2,2.4967957439821199E-2,1.8915119272591799E-4,1.8915119272591799E-4]
[null,"BAL3B9 Lennox Head","BALLINA","Short Rural",1386,14391,6310,3.0199999999999996,3.2734822958747571,0.43663131391886112,7,0.21532368352800599,0.21532368352800599,2.3057878524318999E-3,2.3057878524318999E-3,2,2.87208099384446E-2,2.87208099384446E-2,1.0443930886707101E-4,1.0443930886707101E-4]
[null,"BAR12 East Barham","BARHAM","Short Rural",121,40192,267,0.80020747309682139,0.43902183210422002,0.77472027199997018,9,1.24155129507644E-2,1.24155129507644E-2,1.8915119272591799E-4,1.8915119272591799E-4,2,2.1909046126781202E-2,2.1909046126781202E-2,9.2834941215174605E-5,9.2834941215174605E-5]
[null,"BAR22 Wakool","BARHAM","Long Rural",620,546367,320,3.1246196568542546,2.4510473588818344,1.2066490704913404,38,7.2935771565701898E-2,7.2935771565701898E-2,2.25124732446798E-4,2.25124732446798E-4,37,3.5906234388499103E-2,2.4487536619032701E-2,1.9147206625629799E-4,1.24166733875296E-4]
[null,"BAR32 Gonn","BARHAM","Short Rural",251,133983,48,2.0576763593918259,0.97960627084996066,7.3307210736446846,20,2.3291126314122099E-2,2.3291126314122099E-2,2.4021041039426399E-4,2.4021041039426399E-4,23,0.17429528125796001,0.17429528125796001,5.3031960169168499E-4,5.3031960169168499E-4]
[null,"BAR42 Barham","BARHAM","Short Rural",962,20859,616,2.9721991857881935,3.0925970297972909,3.2747772943743816,3,0.11648000074268,0.11648000074268,1.0792061916263999E-3,1.0792061916263999E-3,6,0.123341663335246,0.123341663335246,5.0130868256194295E-4,5.0130868256194295E-4]
[null,"BAT12 Rural Nth","TUMUT","Short Rural",177,49319,0,0.52,3.9882449865516518,4.6102533267366308,33,0.13637104733479599,0.13454335942962201,9.9797561806312706E-4,9.8405037688085008E-4,20,0.157639532367192,0.157639532367192,4.90864751675235E-4,4.90864751675235E-4]
[null,"BAT22 Industrial","TUMUT","Short Rural",8,2087,206,0.76,8.0740673007574509E-2,6.3485609824504184E-3,3,2.87788317767041E-3,2.87788317767041E-3,2.7850482364552401E-5,2.7850482364552401E-5,1,2.2628516921198799E-4,2.2628516921198799E-4,1.1604367651896799E-6,1.1604367651896799E-6]
[null,"BAT32 Rural Sth/Kunama","TUMUT","Short Rural",256,72618,51,0.3,4.0424890508287312,0.84214938046494836,40,0.15816404978505799,0.15816404978505799,1.3960054285231901E-3,1.3960054285231901E-3,7,3.2949441510795797E-2,3.2949441510795797E-2,1.8566988243034899E-4,1.8566988243034899E-4]
[null,"BAT42 Batlow Town","TUMUT","Short Rural",536,6808,0,1.06,3.8479907726171301,2.6205264881750736,8,0.221113102549538,0.221113102549538,1.96229856993575E-3,1.96229856993575E-3,13,0.150580595524544,0.150580595524544,5.4308440610877095E-4,5.4308440610877095E-4]
[null,"BBA3B1 Burindi","BARRABA","Long Rural",267,367821,0,0.62873444314750238,9.2122405937646992,3.6677492415256956,61,0.56583941063737597,6.2515049414298501E-2,1.20801467256246E-3,6.1851279584610103E-4,17,0.22528255184686399,0.218579869091129,1.1476719607726E-3,1.0896501225131101E-3]
[null,"BBA3B2 Gladstone","BARRABA","Short Rural",98,140665,0,0.22863070659909182,2.9790365951301307,0.32841599499849006,19,0.20273526549922899,2.25774577035305E-2,4.2588029282461298E-4,2.17001675090471E-4,9,2.2350012097553301E-2,2.2350012097553301E-2,1.4621503241390001E-4,1.4621503241390001E-4]
[null,"BBA3B3 Cobbadah","BARRABA","Long Rural",207,237945,0,0.55252420761447185,5.8584178815719596,0.97332975873085281,52,0.42804450739169198,8.5839828394611198E-2,1.10937754752134E-3,7.0554555323532704E-4,9,7.1116206717884503E-2,5.3941742593077199E-2,4.1543636193790601E-4,3.5741452367842199E-4]
[null,"BBA3B4 Barraba","BARRABA","Short Rural",797,73500,0,1.6004149461936428,30.145023335897335,3.4555557473881522,13,1.59537078565631,7.6074753015539995E-2,2.8941292923830701E-3,1.13374671959032E-3,7,0.182879032010068,0.182879032010068,1.1499928343029701E-3,1.1499928343029701E-3]
[null,"BBI0101 M1 Maules Ck","GUNNEDAH","Long Rural",260,263636,528,1.8099930939094766,259.06087692628972,191.53069628727278,75,0.549339160273144,0.54571395581869098,2.3661305642217602E-3,2.34756357597873E-3,12,0.40614126344873702,0.40614126344873702,9.9217343423717796E-4,9.9217343423717796E-4]
[null,"BBI0201 M2 Willala","GUNNEDAH","Short Rural",75,141029,0,0.43820885431492596,0.79381547071438263,0,25,5.0849178613846698E-2,5.0812044637360602E-2,3.6321670750437098E-4,3.62056270739181E-4]
[null,"BBI0301 M3 Gunnedah Rd","GUNNEDAH","Short Rural",88,94108,0,0.66683956091401775,1.5138189318262099,0.12120134217476623,30,6.8194226943136899E-2,6.8025963612184395E-2,4.14275925172717E-4,4.1311548840752702E-4,3,5.4598549802174498E-3,5.4598549802174498E-3,3.3652666190500797E-5,3.3652666190500797E-5]
[null,"BBI0401 M4 Wean","GUNNEDAH","Short Rural",99,181629,2174,1.8099930939094766,1.2766264891398262,0.10015914933135989,37,9.9335707973767201E-2,9.9264921331090605E-2,5.0943173991826996E-4,5.0827130315308101E-4,10,7.7934933150139102E-3,7.7934933150139102E-3,1.03278872101882E-4,1.03278872101882E-4]
[null,"BBI1101 M11 Ghoolendaadi","GUNNEDAH","Short Rural",54,99826,207,3.2389350101538001,0.6553395106387736,0.25280507965450438,25,3.7523883239173599E-2,3.7523883239173599E-2,2.5993783540248901E-4,2.5993783540248901E-4,6,1.44752882089761E-2,1.44752882089761E-2,6.03427117898635E-5,6.03427117898635E-5]
[null,"BBI2601 M26 Boggabri Town","GUNNEDAH","Short Rural",294,5025,0,0.80020747309682139,2.9510489922078103,1.0652669722347083,10,0.175792244685055,0.17573190197326499,1.4760755653212799E-3,1.4749151285560901E-3,3,6.3457324067632603E-2,6.3457324067632603E-2,2.1584123832528099E-4,2.1584123832528099E-4]
[null,"BBI2801 M28 Boggabri Town","GUNNEDAH","Short Rural",270,7317,154,0.74304979644704838,0.94380798925548637,0.66530559103611109,5,4.2747009119292301E-2,4.2747009119292301E-2,5.4772615316953002E-4,5.4772615316953002E-4,2,3.01330614816805E-2,3.01330614816805E-2,1.18364550049348E-4,1.18364550049348E-4]
[null,"BBN3B1 Byrnes Rd","WAGGA WAGGA","Short Rural",16,4374,193,1.05,1.501223065498351E-2,0,2,6.03427117898635E-4,6.03427117898635E-4,2.0887861773414299E-5,2.0887861773414299E-5,0,0,0,0,0]
[null,"BBN3B2 Heinz","WAGGA WAGGA","Urban",1,378,491,0.8,0,0,0,0,0,0,0,0,0,0,0,0]
[null,"BBN3B3 Bomen Rd","WAGGA WAGGA","Short Rural",105,7718,588,1.88,9.9726414821106946E-2,5.8155557001805219E-2,5,2.12127840676674E-3,2.12127840676674E-3,1.14883239753779E-4,1.14883239753779E-4,2,1.2370255916921999E-3,1.2370255916921999E-3,5.8021838259484103E-6,5.8021838259484103E-6]
[null,"BBN3B5 Harefield","WAGGA WAGGA","Short Rural",8,4501,1600,2.42,0.43580573966642444,0,2,3.55093650148043E-4,3.55093650148043E-4,1.39252411822762E-5,1.39252411822762E-5,0,0,0,0,0]
[null,"BBN3B6 Cargills Abattoir","WAGGA WAGGA","Urban",1,2,472,6.21,0,0,0,0,0,0,0,0,0,0,0,0]
[null,"BBN3B7 Dampier St","WAGGA WAGGA","Short Rural",5,4787,1774,1.35,0.1136202925976901,0,1,5.9182275024673801E-5,5.9182275024673801E-5,3.4813102955690501E-6,3.4813102955690501E-6,0,0,0,0,0]
[null,"BBS3B10 Sunbird","COFFS HARBOUR","Short Rural",656,1127,3912,3.3341978045700884,0.63755175512027995,0.48929803284774509,3,5.8457002046430201E-2,5.8457002046430201E-2,9.6896469893338404E-4,9.6896469893338404E-4,3,4.4863645778998297E-2,4.4759206470131201E-2,1.19524986814537E-4,1.18364550049348E-4]
[null,"BBS3B3 Pine Ck Way","COFFS HARBOUR","Short Rural",338,21533,2163,1.0478907385791707,2.6054062704757599,0.60254420891085703,16,0.222416273036846,0.158415864563104,1.34726708438522E-3,1.0896501225131101E-3,5,5.14375200537978E-2,5.14375200537978E-2,2.27445605977178E-4,2.27445605977178E-4]
[null,"BBS3B4 Boambee Valley","COFFS HARBOUR","Short Rural",575,20619,2719,1.0669432974624282,1.3694225591025178,0.60379590657838234,24,0.11726677686947801,0.10959628985157401,1.9460524552231001E-3,1.9193624096237301E-3,5,5.1704420509791502E-2,5.1704420509791502E-2,2.6690045599362701E-4,2.6690045599362701E-4]
[null,"BBS3B5 Boambee Industrial","COFFS HARBOUR","Short Rural",317,8077,2772,4.4201936609157748,5.0713549124401771,4.4929662551784819,9,7.8529076773916198E-2,1.94906959081259E-2,1.1557950181289201E-3,4.7926038402333902E-4,2,6.9572825820182205E-2,6.9572825820182205E-2,1.4273372211833101E-4,1.4273372211833101E-4]
[null,"BBS3B6 Linden Ave","COFFS HARBOUR","Short Rural",1306,4330,4045,4.0010373654841063,3.6346693449800744,1.5334683635079736,7,0.32153613977228701,0.123761741444245,6.3255408070489599E-3,4.8158125755371796E-3,9,0.13565621828743901,0.13565621828743901,6.8465769146191201E-4,6.8465769146191201E-4]
[null,"BBS3B7 Toormina Town","COFFS HARBOUR","Urban",753,3562,1905,1.3336791218280355,2.7796418425054483,1.0672563069430405,6,0.26140114616339299,0.26140114616339299,8.4247709152770903E-4,8.4247709152770903E-4,2,0.100366175821256,0.100366175821256,5.0478999285751198E-4,5.0478999285751198E-4]
[null,"BBS3B8 Sth Coffs Interconnector","COFFS HARBOUR","Urban",5,1641,690,3.9248271299510757,5.1319168125369919E-3,2.046935001364187E-2,2,5.1059217668346E-4,5.1059217668346E-4,1.16043676518968E-5,1.16043676518968E-5,1,2.0365665229078898E-3,2.0365665229078898E-3,5.8021838259484103E-6,5.8021838259484103E-6]
[null,"BBS3B9 Bongil Bongil","COFFS HARBOUR","Short Rural",62,2003,494,9.5262794416288238E-2,0,0,0,0,0,0,0,0,0,0,0,0]
[null,"BBYF2 Deep Ck","MORUYA","Short Rural",2199,45300,20110,2.8570000000000002,3.9013123242315233,2.1001866193851577,18,0.24443556065631999,0.24356407264566199,2.4496820113154199E-3,2.4438798274894701E-3,9,0.131586566551919,0.131586566551919,4.42126407537269E-4,4.42126407537269E-4]
[null,"BBYG2 Batehaven","MORUYA","Short Rural",1680,10211,927,3.048,1.7006526634180272,2.4971714536650684,9,0.101521970839385,0.101521970839385,4.4560771783283798E-4,4.4560771783283798E-4,4,0.14907086729303201,0.14907086729303201,3.6089583397399101E-4,3.6089583397399101E-4]
[null,"BBYH2 Nelligen","MORUYA","Short Rural",1244,76068,39080,2.476,3.1054571410772889,2.9508395432624535,20,0.213935801156839,0.213935801156839,8.1462660916315703E-4,8.1462660916315703E-4,11,0.20328415208916301,0.20328415208916301,9.17905481265039E-4,9.17905481265039E-4]
[null,"BBYJ2 Catalina","MORUYA","Short Rural",2440,10935,9934,4.1909999999999998,6.5197051662174372,4.9563120592470638,10,0.55332874187186598,0.55295740210700495,5.6791775288383001E-3,5.6780170920731196E-3,19,0.42064324170331202,0.39648294825206298,1.4435833358959599E-3,1.3379835902637E-3]
[null,"BBYK2 Batemans Bay","MORUYA","Urban",904,3399,1889,4.3819999999999997,9.2531927351745275E-3,0.96852953168542921,2,2.4949390451578198E-4,2.4949390451578198E-4,2.3208735303793598E-6,2.3208735303793598E-6,1,2.6114468963828599E-2,2.6114468963828599E-2,1.34610664762003E-4,1.34610664762003E-4]
[null,"BBYL2 Surfside","MORUYA","Short Rural",2227,17570,12442,4.0389999999999997,9.8028752163179149,3.6951574850501037,26,0.68782452339411504,0.63548302310023497,5.7325576200370296E-3,5.2312489374750897E-3,10,0.25927290513603501,0.25923809203307902,1.19989161520613E-3,1.1987311784409399E-3]
[null,"BCW Blue Cow Pump Stn","JINDABYNE","Short Rural",36,0,2502,5.48,0.32296477557432213,9.4964701665329665E-2,4,4.4201036386075001E-3,4.4201036386075001E-3,4.9898780903156303E-5,4.9898780903156303E-5,1,1.29968917701244E-3,1.29968917701244E-3,9.2834941215174595E-6,9.2834941215174595E-6]
[null,"BDA2D06 Bundarra Nth","INVERELL","Short Rural",290,188478,0,0.9335753852796248,3.7496935104283917,7.7198912858232758,35,0.18243458472900001,9.8318004930695799E-2,1.1650785122504399E-3,8.4827927535365802E-4,19,0.375597407352179,0.375597407352179,9.7244600922895405E-4,9.7244600922895405E-4]
[null,"BDA2D08 Bundarra Sth","INVERELL","Long Rural",226,267793,89,0.63254495492415397,4.2084664597786059,1.7326853829311071,47,0.25001378018658699,0.116274603435241,1.0652809504441299E-3,9.5271858422072905E-4,22,0.10293422238262,0.10293422238262,3.7250020162588802E-4,3.7250020162588802E-4]
[null,"BEE1341 Yoogali","GRIFFITH","Short Rural",616,12299,3698,2.8006439999999997,2.4725329349980716,0.22513933853842047,13,0.14705518863189701,0.129999089057139,1.1766828799023401E-3,1.1639180754852499E-3,1,1.3390279833523699E-2,1.3390279833523699E-2,4.0615286781638899E-5,4.0615286781638899E-5]
[null,"BEE1342 Rossetto Rd","GRIFFITH","Short Rural",233,38762,46,1.5622639999999999,2.1604986076647092,1.2218555163549332,22,5.6505147407381197E-2,4.7996825045010398E-2,4.8158125755371801E-4,4.7461863696258001E-4,7,3.19561076397935E-2,3.19561076397935E-2,1.6826333095250399E-4,1.6826333095250399E-4]
[null,"BEE1346 Beelbangera","GRIFFITH","Short Rural",253,32657,18,1.2002760000000001,4.22401203138753E-2,4.3604305056836594E-2,5,1.97622381111803E-3,1.97622381111803E-3,2.2048298538604E-5,2.2048298538604E-5,4,2.0400478332034599E-3,2.0400478332034599E-3,3.7133976486069797E-5,3.7133976486069797E-5]
[null,"BEE1347 Collina No.1","GRIFFITH","Urban",1011,2013,8756,3.7722959999999999,1.4307016958262666,0.5295163847554808,6,0.132495188539062,0.132495188539062,4.5953295901511398E-4,4.5953295901511398E-4,2,4.9037736823385601E-2,4.9037736823385601E-2,1.4041284858795199E-4,1.4041284858795199E-4]
[null,"BERA2 Bermagui","BEGA","Short Rural",769,6362,329,1.2570000000000001,0.46661911767274539,7.2329682540194842,6,2.47497953279655E-2,2.47497953279655E-2,1.0583183298529899E-3,1.0583183298529899E-3,4,0.38364155500847402,0.38364155500847402,1.2579134534656199E-3,1.2579134534656199E-3]
[null,"BERB2 Wallaga Lake","BEGA","Short Rural",839,34066,0,1.2570000000000001,3.096311387020533,5.7859278557854834,24,0.226303736200231,0.21401238998334199,2.6620419393451299E-3,2.64115407757172E-3,10,0.42288288466012802,0.42288288466012802,1.39832630205357E-3,1.39832630205357E-3]
[null,"BERC2 Nutleys Ck","BEGA","Short Rural",130,36158,0,0.19,0.30955543887507014,1.0834945729759267,12,2.13241859971256E-2,2.13241859971256E-2,2.9823224865374798E-4,2.9823224865374798E-4,5,7.4638132300235194E-2,7.4638132300235194E-2,3.0519486924488598E-4,3.0519486924488598E-4]
[null,"BERD2 Cuttagee","BEGA","Short Rural",303,42201,355,0.57100000000000006,2.5376479739921169,2.8979410402512862,15,0.12914616803472501,0.12914616803472501,6.3824022085432505E-4,6.3824022085432505E-4,8,0.147482229361487,0.147482229361487,4.6533514284106199E-4,4.6533514284106199E-4]
[null,"BET1 Mt Ulandra Line 43","JUNEE","Short Rural",7,12272,81,0.62,0,8.5302009748169025E-2,0,0,0,0,0,1,1.5491830815282299E-3,1.5491830815282299E-3,5.8021838259484103E-6,5.8021838259484103E-6]
[null,"BET2 Bethungra Lines 41 and 42","JUNEE","Short Rural",138,111346,0,0.3,7.4172493590136848E-2,1.0887196289448082,8,4.3887718459473804E-3,4.3887718459473804E-3,2.5529608834173001E-5,2.5529608834173001E-5,7,6.4419326145974801E-2,6.4419326145974801E-2,1.93792939786677E-4,1.93792939786677E-4]
[null,"58 Bullocks Flat - Thredbo","JINDABYNE","Short Rural",2,13230,0,9.9329999999999998,0,0,0,0,0,0,0,0,0,0,0,0]
[null,"59 Bullocks Flat - Thredbo","JINDABYNE","Short Rural",1,13172,0,6.9640000000000004,0,6.1447348316293051E-3,0,0,0,0,0,1,2.5181477804616103E-4,2.5181477804616103E-4,1.1604367651896799E-6,1.1604367651896799E-6]
[null,"BFTCB4 Crackenback","JINDABYNE","Short Rural",154,353,2287,0.79900000000000004,0,0,0,0,0,0,0,0,0,0,0,0]
[null,"BGA2K09 Abbotts Ln/Gineoi","WARIALDA","Long Rural",131,210287,0,0.34294605989863763,1.9210820510194184,0.3613906342349148,63,0.14874478456201301,0.123107255108678,7.1482904735684397E-4,6.1851279584610103E-4,9,2.7981611719018799E-2,2.7981611719018799E-2,1.2532717064048601E-4,1.2532717064048601E-4]
[null,"BGA2K13 Horton Valley","WARIALDA","Short Rural",137,133895,0,0.37343015411184993,0.76294744023400596,0.20971837369257917,16,5.9073193968746003E-2,5.7669065482866398E-2,4.7461863696258001E-4,4.61853832545494E-4,4,1.6237991655299201E-2,1.6237991655299201E-2,6.4984458850622198E-5,6.4984458850622198E-5]
[null,"BGA2K17 Bingara Town/Keera Rd","WARIALDA","Short Rural",836,150131,199,1.9052558883257651,9.5720395494700341,0.28515710589094478,37,0.52610025361345503,0.52591690460455498,3.2561855631222502E-3,3.2550251263570602E-3,4,1.5672858950651802E-2,1.5672858950651802E-2,1.05599745632261E-4,1.05599745632261E-4]
[null,"BHL32 Sth","BROKEN HILL","Short Rural",2051,40404,583,5.0599999999999996,7.1253512346590897,13.677346125889468,16,0.44589086440354397,0.44589086440354397,5.6397226788218596E-3,5.6397226788218596E-3,35,0.85590218446418898,0.85563296313466497,3.0461465086229198E-3,3.0449860718577298E-3]
[null,"BHL42 Railwaytown","BROKEN HILL","Short Rural",4401,32911,2329,12.87,18.918960753576783,63.515536728727319,38,0.97116256616665397,0.97108365646662098,7.1134773706127497E-3,7.1123169338475596E-3,69,3.2604281199357801,3.1895416796973999,9.8486268261648406E-3,9.5445923936851394E-3]
[null,"BHL52 Talc2","BROKEN HILL","Urban",114,6515,636,2.5299999999999998,0.25049159152040051,0.67782680516030658,2,5.9124253186414299E-3,5.9124253186414299E-3,7.3107516206950005E-5,7.3107516206950005E-5,3,1.5998941681670101E-2,1.5998941681670101E-2,4.1775723546828597E-5,4.1775723546828597E-5]
[null,"BHL72 West","BROKEN HILL","Short Rural",4226,98376,308,9.66,8.284897134659003,18.765197134356217,42,0.63789557113506401,0.63655874798156498,6.5437029189046201E-3,6.5228150571312003E-3,47,1.4448261636714801,1.4448261636714801,5.29159164926495E-3,5.29159164926495E-3]
[null,"BHL82 Cockburn","BROKEN HILL","Long Rural",84,228498,80,7.1,0.53153826118223624,8.4818716105514262,14,1.7115281849782601E-2,1.6665032384888999E-2,1.2300629711010599E-4,1.20685423579727E-4,12,0.27311227399768701,0.26733794065410299,7.1598948412203401E-4,6.9742249587899895E-4]
[null,"BJK12 Burrinjuck Village","YASS","Short Rural",33,3722,2648,0.248,8.5556543102839486E-2,0.97625245780437364,2,3.0182960262583598E-3,9.3995377980364195E-5,6.38240220854325E-5,3.1331792660121401E-5,4,3.4440602754064603E-2,3.4440602754064603E-2,1.13722802988589E-4,1.13722802988589E-4]
[null,"BJN8B1 M42 Burren Town","NARRABRI","Short Rural",113,3466,0,0.34294605989863763,1.6309779720726219,0,8,5.5991073920402201E-2,5.5991073920402201E-2,6.7305332381001597E-4,6.7305332381001597E-4,0,0,0,0,0]
[null,"BJN8B2 M9 Carbeen/Merah Nth","NARRABRI","Long Rural",135,272346,0,0.83831259086333665,6.857967701579847,1.9755644026945989,77,0.30131552913885701,0.30073415031949702,1.5897983683098599E-3,1.58515662124911E-3,23,8.6799509599422994E-2,8.4554064458780998E-2,3.0403443247969698E-4,2.9359050159299E-4]
[null,"BJN8B3 M37 Yarran","NARRABRI","Long Rural",304,328076,0,0.99073306192939781,15.902943865064175,0.37893488403330239,72,0.82377085087285096,0.82377085087285096,4.2344337561771497E-3,4.2344337561771497E-3,3,1.96287878831835E-2,1.96287878831835E-2,1.6130071036136599E-4,1.6130071036136599E-4]
[null,"BJN8B4 M31 Cryon","NARRABRI","Short Rural",37,92735,224,0.2553042890356525,2.3778291068193056,1.9346324501063727E-2,17,0.12479917191232399,0.12479917191232399,3.9802981046006098E-4,3.9802981046006098E-4,3,1.01538216954097E-3,1.01538216954097E-3,1.6246114712655499E-5,1.6246114712655499E-5]
[null,"BJN8B5 M30 Collarenebri","NARRABRI","Long Rural",95,242405,106,0.6569322302947237,5.1472646327835427,0.13443414675029916,26,0.21015973992291201,0.21015973992291201,7.2991472530431001E-4,7.2991472530431001E-4,6,5.4888658993471999E-3,5.4888658993471999E-3,3.4813102955690502E-5,3.4813102955690502E-5]
[null,"BKE4B1 M81 Enngonia","BOURKE","Long Rural",142,555986,0,0.76019709944198022,4.1726611935961433,2.4123073102954642,33,0.17634113127498899,0.17634113127498899,1.3240583490814299E-3,1.3240583490814299E-3,23,0.101946690695444,0.101946690695444,3.1563880013159399E-4,3.1563880013159399E-4]
[null,"BKE4B2 M82 Wanaaring","BOURKE","Long Rural",316,1828630,0,1.7032987641632338,12.701175433473697,8.3035316684097573,70,0.48102076659613102,0.47494588013036299,2.91849846445205E-3,2.8871666717919298E-3,36,0.31447256118257799,0.31447256118257799,1.1720411328415799E-3,1.1720411328415799E-3]
[null,"BKE4B3 M83 Louth","BOURKE","Long Rural",134,607890,0,0.80020747309682139,4.8616210535406355,2.4376677189076319,24,0.176063786888109,0.175933817970408,1.5213325991636701E-3,1.51901172563329E-3,24,8.8280226911805093E-2,8.8280226911805093E-2,3.6437714426955999E-4,3.6437714426955999E-4]
[null,"BKE8B1 M86 Bourke No.1","BOURKE","Short Rural",414,25776,259,1.3413001453813385,2.4361955516780931,3.3201197633712738,13,0.12150005018889,0.12150005018889,1.8613405713642499E-3,1.8613405713642499E-3,4,0.16558388246168099,0.16558388246168099,4.9434606197080501E-4,4.9434606197080501E-4]
[null,"BKE8B2 M80 Brewarrina","BOURKE","Short Rural",28,92287,0,0.24006224192904638,0.7480509013316935,1.3000032823225565,22,1.6839097899667501E-2,1.6839097899667501E-2,1.8218857213477999E-4,1.8218857213477999E-4,13,2.9263894344553398E-2,2.9263894344553398E-2,1.0908105592783E-4,1.0908105592783E-4]
[null,"BKE8B3 M87 Bourke No.2","BOURKE","Short Rural",957,52581,799,4.6488243675148659,9.888812734062256,8.7249336109366613,25,0.40965506597373103,0.30017946154573699,7.5358763531418E-3,6.5030876321229801E-3,8,0.36144007881686502,0.36144007881686502,1.1557950181289201E-3,1.1557950181289201E-3]
[null,"BLH3B1 Crawford/Girvan/Booral","BULAHDELAH","Short Rural",166,72562,0,0.32389350101538,10.502612985945094,1.1761825288912939E-2,25,0.69943585366660299,0.205383382197391,8.6684626359669298E-4,6.8813900175748103E-4,1,7.8329481650303502E-4,7.8329481650303502E-4,1.04439308867071E-5,1.04439308867071E-5]
[null,"BLH3B2 Bulahdelah Nth/Markwell/Newells Ck","BULAHDELAH","Short Rural",333,52905,835,1.3908367984778083,11.838439561194113,1.2347586684925642,29,0.73250482016421303,9.79954035099731E-2,1.20569379903208E-3,8.2855185034543303E-4,9,7.6400835746558302E-2,7.6400835746558302E-2,5.8021838259484097E-4,5.8021838259484097E-4]
[null,"BLH3B3 Bulahdelah Central/Wootton/Seal Rocks","BULAHDELAH","Long Rural",949,224362,3607,1.8671507705592496,48.142393779223383,9.5384066453257788,56,2.6151742192726499,2.6151742192726499,4.47116285627584E-3,4.47116285627584E-3,62,0.51814197827778397,0.50661768076268499,1.5561457021193599E-3,1.51901172563329E-3]
[null,"BMR668 Oxley Hwy","TAMWORTH","Short Rural",128,100518,79,0.25149377725900096,2.3587155643582882,0.99174146680133535,24,0.14160113583550599,0.137466499641135,3.7946282221702602E-4,3.7482107515626701E-4,2,5.9537368674821803E-2,5.9537368674821803E-2,1.3577110152719301E-4,1.3577110152719301E-4]
[null,"BMR669 Bendemeer","TAMWORTH","Short Rural",196,55578,0,0.39629322477175905,3.7005709820120187,0.64520884904856579,20,0.21425840257756201,0.21402631522452401,5.38442659048012E-4,5.3728222228282304E-4,2,3.7356780344986198E-2,3.7356780344986198E-2,1.20685423579727E-4,1.20685423579727E-4]
[null,"BMR670 Watsons Ck","TAMWORTH","Short Rural",152,149010,0,0.30484094213212237,3.8338837427359231,0.93596920408356088,48,0.29420321220501,0.209479723978511,9.1326373420428004E-4,7.4964215031253403E-4,3,7.1824073144650197E-2,7.1824073144650197E-2,1.7406551477845201E-4,1.7406551477845201E-4]
[null,"BMU1417 Koorawatha/Murringo","YOUNG","Long Rural",683,308877,0,1.65,13.065843510623214,9.2748243561698409,72,0.62081046064117595,0.62057721285137302,2.5494795731217301E-3,2.54715869959135E-3,48,0.44068398463813802,0.43907445884481999,1.6687080683427599E-3,1.664066321282E-3]
[null,"BNG8B1 Alcheringa Drive","BURONGA","Long Rural",611,269116,2914,5.4890400000000001,2.4489446148242582,10.865113649280627,36,9.0684651889278101E-2,9.0684651889278101E-2,1.1035753636953901E-3,1.1035753636953901E-3,12,0.40233619129567999,0.40233619129567999,8.6684626359669298E-4,8.6684626359669298E-4]
[null,"BNG8B2 Sturt Hwy","BURONGA","Short Rural",846,15479,1291,2.3319999999999999,1.111489590833209,0.6553054882191367,12,3.8800363680882202E-2,3.8800363680882202E-2,1.1569554548941101E-3,1.1569554548941101E-3,8,2.2875689952184201E-2,2.2875689952184201E-2,1.27648044170865E-4,1.27648044170865E-4]
[null,"BNG8B4 Silver City Hwy","BURONGA","Short Rural",292,12565,3062,1.2624,3.282180833859287E-2,0.51818999263312815,2,1.06179964014856E-3,1.06179964014856E-3,3.21440983957542E-4,3.21440983957542E-4,7,1.67636695099301E-2,1.67636695099301E-2,9.7476688275933304E-5,9.7476688275933304E-5]
[null,"BNK24787 Old Bar No.2","TAREE","Short Rural",431,17411,1275,0.7621023553303059,0,0.38394796049258023,0,0,0,0,0,3,2.71623433627949E-2,2.71623433627949E-2,7.5428389737329307E-5,7.5428389737329307E-5]
[null,"BNK24792 Old Bar No.1","TAREE","Short Rural",2032,12738,5190,3.0484094213212236,2.1969761161905037,0.52366094984976463,10,0.17740873309896399,0.17740873309896399,2.61330359520716E-3,2.61330359520716E-3,2,4.2286315723511998E-2,4.2286315723511998E-2,1.1024149269302E-4,1.1024149269302E-4]
[null,"BNK24796 Islands","TAREE","Short Rural",534,88574,583,0.99073306192939781,3.9959230339782068,0.99947525912694224,39,0.24615068619527,0.24559251611121399,2.0214808449604302E-3,2.01567866113448E-3,9,6.1568133013903799E-2,6.0036356483853401E-2,1.7058420448288301E-4,1.65942457422125E-4]
[null,"BNK24798 Koorainghat","TAREE","Short Rural",426,76338,159,0.81926003198007891,0.83700821971826789,0.82387055097427442,24,5.9515320376283203E-2,5.9268147345297797E-2,8.9121543566567595E-4,8.8773412537010703E-4,17,5.8581168780305497E-2,5.8581168780305497E-2,2.21643422151229E-4,2.21643422151229E-4]
[null,"BNY3B1 Kings Plains","BLAYNEY","Short Rural",219,96568,803,1.1000000000000001,0.76383851352762888,0.63720145198690581,43,5.5176447311239003E-2,5.51045002317972E-2,3.7482107515626701E-4,3.7366063839107801E-4,5,4.6028724291248699E-2,4.6028724291248699E-2,1.6710289418731401E-4,1.6710289418731401E-4]
[null,"BNY3B2 Blayney Town","BLAYNEY","Short Rural",618,79416,961,1.43,2.7788111203121013,0.85300562795745505,25,0.115080514003861,0.115080514003861,1.16855982254601E-3,1.16855982254601E-3,12,3.53260160059043E-2,3.53260160059043E-2,1.13722802988589E-4,1.13722802988589E-4]
[null,"BNY3B3 Hill St","BLAYNEY","Short Rural",7,3392,1366,0.57999999999999996,0,0,0,0,0,0,0,0,0,0,0,0]
[null,"BNY3B4 Millthorpe","BLAYNEY","Long Rural",1002,202280,974,2.38,3.9389503244836881,1.5048852284638186,61,0.27579984554586701,0.27576155113261502,2.9335841423995201E-3,2.93126326886914E-3,10,0.10536997915275401,0.10536997915275401,4.8738344137966598E-4,4.8738344137966598E-4]
[null,"BNY3B5 Industrial","BLAYNEY","Short Rural",35,2848,269,0.48,3.6905306862873646E-2,0.21742722277297241,2,5.4540527963915103E-4,5.4540527963915103E-4,5.8021838259484103E-6,5.8021838259484103E-6,2,3.2132494028102301E-3,2.41370847159454E-3,2.32087353037936E-5,1.8566988243034899E-5]
[null,"BNY3B6 Blayney Town West","BLAYNEY","Short Rural",1092,67878,1966,2.86,0.29736756123019681,0.28809482696809213,23,2.1025953748471899E-2,2.1025953748471899E-2,3.4348928249614599E-4,3.4348928249614599E-4,6,2.0370306976139702E-2,2.0370306976139702E-2,1.7406551477845201E-4,1.7406551477845201E-4]
[null,"BNY3B7 Friskies","BLAYNEY","Urban",7,2678,679,5.24,4.5277813115433933E-2,0,2,6.1967323261128999E-4,6.1967323261128999E-4,9.2834941215174595E-6,9.2834941215174595E-6,0,0,0,0,0]
[null,"BODA2 Nerrigundah","MORUYA","Short Rural",129,42969,0,0.8,1.2841508661268559,1.4659595494398225,7,5.2784787138183097E-2,5.2784787138183097E-2,2.8662788100185103E-4,2.8662788100185103E-4,10,6.0257999906004597E-2,6.0257999906004597E-2,1.90311629491108E-4,1.90311629491108E-4]
[null,"BODB2 Bodalla","MORUYA","Short Rural",152,38345,846,0.30499999999999999,0.30800334611748098,0.36841593838724851,7,1.2755520922965001E-2,1.2755520922965001E-2,2.00755560377815E-4,2.00755560377815E-4,9,1.52574225887139E-2,1.52574225887139E-2,7.0786642676570595E-5,7.0786642676570595E-5]
[null,"BODC2 Potato Pt","MORUYA","Short Rural",608,30131,1337,0.876,2.1488097661101802,3.0698130993475927,17,0.159511316869443,0.159511316869443,1.8996349846155101E-3,1.8996349846155101E-3,11,0.22787960932735901,0.22787960932735901,1.0989336166346299E-3,1.0989336166346299E-3]
[null,"BOM8B1 Timber Mill","BOMBALA","Short Rural",3,5970,429,2.702,3.0609158304628563E-2,0,2,4.1891767223347498E-4,4.1891767223347498E-4,2.3208735303793598E-6,2.3208735303793598E-6,0,0,0,0,0]
[null,"BOM8B2 Nimmitabel","BOMBALA","Long Rural",201,256687,0,1.446,1.1980020745295759,1.32794167590782,31,8.8051620869062694E-2,8.8051620869062694E-2,5.9994580760306499E-4,5.9994580760306499E-4,28,9.7602015446573806E-2,9.6808276699184001E-2,4.9550649873599396E-4,4.83902131084097E-4]
[null,"BOM8B3 Southern Rural","BOMBALA","Long Rural",669,471076,345,1.256,5.4187297532655423,0.64928610779668006,91,0.29456758934927901,0.29456758934927901,1.98898861553511E-3,1.98898861553511E-3,26,3.52958446500094E-2,3.52958446500094E-2,2.9939268541893802E-4,2.9939268541893802E-4]
[null,"BOM8B4 Bombala","BOMBALA","Short Rural",772,22435,49,1.218,3.1931142239400283,4.4676843631781127,12,0.152894506434332,0.152894506434332,1.7754682507402099E-3,1.7754682507402099E-3,18,0.213924196789188,0.213924196789188,9.1558460773465903E-4,9.1558460773465903E-4]
[null,"BOM8B5 Cathcart","BOMBALA","Short Rural",153,83931,0,0.28500000000000003,0.41368308035974788,0.27288262202866409,13,2.75313622541252E-2,2.75313622541252E-2,2.6457958246324699E-4,2.6457958246324699E-4,3,1.8160835375218499E-2,1.8160835375218499E-2,1.4969634270946901E-4,1.4969634270946901E-4]
[null,"BON3B1 Peacock Ck","BONALBO","Short Rural",153,17659,44,0.39,10.845246036455345,0,7,0.392284488035607,0.101274797808399,5.1059217668346E-4,3.41168408965767E-4,0,0,0,0,0]
[null,"BON3B2 Old Bonalbo","BONALBO","Short Rural",297,109674,0,0.56000000000000005,13.208940870166414,9.1878043081935496E-3,19,0.86418654253087801,0.30705388894272001,1.4900008065035499E-3,1.16739938578082E-3,1,6.0110624436825503E-4,6.0110624436825503E-4,8.1230573563277697E-6,8.1230573563277697E-6]
[null,"BON3B3 Bottle Ck","BONALBO","Short Rural",53,39529,0,0.12,2.4269206580589069,0.17560974949545297,9,0.138962302631464,3.8316461549798099E-2,1.8566988243034899E-4,1.27648044170865E-4,2,1.00551845703686E-2,1.00551845703686E-2,3.0171355894931699E-5,3.0171355894931699E-5]
[null,"BOO1012 Rye Pk","BOOROWA","Long Rural",741,593363,0,1.08,12.443122114287878,3.4041706067021091,107,0.573685123606823,0.57322094890074704,2.6898924217096799E-3,2.6864111114141098E-3,45,0.156947912055139,0.154762809626287,8.7845063124858901E-4,8.6800670036188204E-4]
[null,"BOO1022 Galong","BOOROWA","Short Rural",133,122937,0,0.31,70.889888815192592,10.073585091172619,24,8.0772201041027794E-2,8.0772201041027794E-2,4.0615286781638902E-4,4.0615286781638902E-4,5,1.1477880044491099E-2,1.1477880044491099E-2,6.7305332381001595E-5,6.7305332381001595E-5]
[null,"BOO1032 Boorowa Town","BOOROWA","Short Rural",790,19988,106,1.6500000000000001,9.682678768012801,10.154333473821987,12,0.46595017432661301,0.46595017432661301,1.96345900670094E-3,1.96345900670094E-3,12,0.48864715701695799,0.48864715701695799,1.44474377266115E-3,1.44474377266115E-3]
[null,"BOO1042 Kenyu","BOOROWA","Long Rural",239,227413,0,0.47000000000000003,5.0496977863203183,4.1940951283753884,36,0.16807650063330801,0.16807650063330801,1.1987311784409399E-3,1.1987311784409399E-3,32,0.13959822197878799,0.13959822197878799,6.1619192231572096E-4,6.1619192231572096E-4]
[null,"BOU3B1 Deakin Ave","WAGGA WAGGA","Short Rural",926,3378,6646,2.59,5.8680538213588807E-4,1.5082335395297559,1,5.6861401494294398E-5,5.6861401494294398E-5,1.1604367651896799E-6,1.1604367651896799E-6,5,0.14614772708151899,0.14614772708151899,4.82741694318908E-4,4.82741694318908E-4]
[null,"BOU3B2 Bourke St","WAGGA WAGGA","Short Rural",1353,7592,4614,1.52,8.1413912486343817E-2,1.3692748492815878,4,7.7760867635360597E-3,7.7760867635360597E-3,1.3925241182276201E-4,1.3925241182276201E-4,4,0.13078354431040801,0.13078354431040801,4.6417470607587299E-4,4.6417470607587299E-4]
[null,"BOU3B4 Tolland","WAGGA WAGGA","Short Rural",1238,7045,4433,1.42,6.691122969138226E-2,0.669269120108412,1,5.9414362377711704E-3,5.9414362377711704E-3,3.7133976486069797E-5,3.7133976486069797E-5,4,5.9428287618894002E-2,5.9428287618894002E-2,2.4717303098540202E-4,2.4717303098540202E-4]
[null,"BOU3B6 Glenfield Rd","WAGGA WAGGA","Short Rural",1259,4222,5933,1.4,2.8982865828206111E-2,3.6690551601185986,2,2.4891368613318698E-3,2.4891368613318698E-3,3.2492229425311099E-5,3.2492229425311099E-5,13,0.31510964096666699,0.31510964096666699,1.1105379842865301E-3,1.1105379842865301E-3]
[null,"BOU3B8 Mangoplah Rd","WAGGA WAGGA","Short Rural",653,8822,12614,1.1200000000000001,0.20107302635624016,8.1814773740483099E-2,3,1.9635750503774599E-2,1.9635750503774599E-2,6.7305332381001595E-5,6.7305332381001595E-5,5,7.9896071283309597E-3,7.9896071283309597E-3,6.7305332381001595E-5,6.7305332381001595E-5]
[null,"BPM3B10 Port Sth","PORT MACQUARIE","Urban",705,8715,953,3.905774571067818,1.6908129195796899,2.4450576729311746,7,2.61075063432375E-2,2.61075063432375E-2,1.49928430062507E-3,1.49928430062507E-3,4,3.7753649718681101E-2,3.7753649718681101E-2,2.5297521481135101E-4,2.5297521481135101E-4]
[null,"BPM3B2 Buller St","PORT MACQUARIE","Urban",661,2173,1529,1.4860995928940968,0.16282806430672411,0.64261383187783894,2,9.3624038215503504E-3,9.3624038215503504E-3,9.4227465333402197E-4,9.4227465333402197E-4,3,3.69494670404047E-2,3.69494670404047E-2,3.5045190308728399E-4,3.5045190308728399E-4]
[null,"BPM3B3 Oxley","PORT MACQUARIE","Urban",1407,6558,2715,3.6199861878189532,4.0006094014059466,6.0575072418001383,5,0.197861431085432,0.197861431085432,4.5129385798226701E-3,4.5129385798226701E-3,9,0.29959112010578498,0.29959112010578498,1.6362158389174499E-3,1.6362158389174499E-3]
[null,"BPM3B4 Hastings River Dr","PORT MACQUARIE","Urban",995,8873,2393,2.3815698604072062,1.1438614205215518,2.7093025954599375,4,4.3573240096107399E-2,4.3573240096107399E-2,2.2790978068325399E-3,2.2790978068325399E-3,3,0.103205764585675,0.103205764585675,4.2007810899866502E-4,4.2007810899866502E-4]
[null,"BPM3B6 Widderson St","PORT MACQUARIE","Urban",1250,5942,2115,3.7152489822352415,0.62599990819200269,0.67280164602929771,4,5.1081265966884601E-2,5.1081265966884601E-2,1.9669403169965101E-3,1.9669403169965101E-3,5,5.4900263361123899E-2,5.4900263361123899E-2,8.5640233270998503E-4,8.5640233270998503E-4]
[null,"BPM3B7 Gore St","PORT MACQUARIE","Urban",938,3772,2728,3.6199861878189532,0.25963043552042991,4.6805044917872793,2,1.1198214784080399E-2,1.1198214784080399E-2,1.16043676518968E-3,1.16043676518968E-3,5,0.20187654229298799,0.20187654229298799,7.3687734589544796E-4,7.3687734589544796E-4]
[null,"BPM3B9 Nth Shore","PORT MACQUARIE","Short Rural",1959,21113,8951,3.2389350101538001,4.4605484653238507,3.4856775730899319,11,0.33550895886193599,0.33550895886193599,4.7519885534517501E-3,4.7519885534517501E-3,16,0.26218212010636599,0.26218212010636599,1.3228979123162401E-3,1.3228979123162401E-3]
[null,"BPO3 Bullocks Portal","JINDABYNE","Short Rural",2,1200,931,0.218,0,0,0,0,0,0,0,0,0,0,0,0]
[null,"BPT3B1 Fraser Dr","TWEED HEADS","Urban",2576,2712,11771,4.58,5.5716871607224583,5.1908436485441563,9,0.51920841966499398,0.51920841966499398,8.4398565932245605E-3,8.4398565932245605E-3,22,0.48371878207519697,0.48371878207519697,1.9681007537617002E-3,1.9681007537617002E-3]
[null,"BPT3B2 Shallow Bay","TWEED HEADS","Urban",264,954,3113,3.82,0,0,0,0,0,0,0,0,0,0,0,0]
[null,"BPT3B3 Fingal","TWEED HEADS","Short Rural",1888,12312,2707,3.13,3.9665366311846433,0.93745737208365754,4,0.32559186626662501,0.32559186626662501,4.8250960696586999E-3,4.8250960696586999E-3,7,7.6950882773258206E-2,7.6950882773258206E-2,2.2280385891641899E-4,2.2280385891641899E-4]
[null,"BPT3B4 Terranora","TWEED HEADS","Urban",752,4777,1995,1.53,2.4375513926010162,0.53708284703819964,5,0.22214705170732199,0.22214705170732199,1.9518546390490501E-3,1.9518546390490501E-3,1,4.8947222755700799E-2,4.8947222755700799E-2,1.2880848093605501E-4,1.2880848093605501E-4]
[null,"BPT3B5 Pioneer Pde","TWEED HEADS","Short Rural",233,2290,1209,0.69000000000000006,9.753227207610278E-2,0,1,4.4096597077207898E-3,4.4096597077207898E-3,4.6417470607587303E-5,4.6417470607587303E-5,0,0,0,0,0]
[null,"BPT3B7 Darlington Dr","TWEED HEADS","Urban",1327,632,5283,2.1199999999999997,0.22569490178370366,1.2510075260127158,3,1.85228916459577E-2,1.85228916459577E-2,3.96869373694871E-4,3.96869373694871E-4,1,0.102670803236922,0.102670803236922,5.0827130315308101E-4,5.0827130315308101E-4]
[null,"BRD12 No.1 Balranald","BALRANALD","Short Rural",407,34918,131,1.5432999999999999,1.3978060684810425,0.30952327356951587,7,6.8960115208162004E-2,9.1140703537997605E-3,5.7789750906446198E-4,9.97975618063127E-5,7,1.5270187393130999E-2,1.5270187393130999E-2,1.0443930886707101E-4,1.0443930886707101E-4]
[null,"BRD22 No.2 Moulamein","BALRANALD","Long Rural",728,1359823,125,2.6368800000000001,16.344806035862742,5.6446653493180676,53,0.75351452779797301,0.64553472636030795,2.5947366069641298E-3,1.8126022272262801E-3,36,0.26022562372025598,0.26022562372025598,8.2855185034543303E-4,8.2855185034543303E-4]
[null,"BRE8B1 M54 Walgett","BOURKE","Short Rural",47,160806,34,0.27054633614225859,0.54507387367626747,4.3182235134293229E-3,10,3.1053287836475901E-2,3.1053287836475901E-2,1.62461147126555E-4,1.62461147126555E-4,1,2.4601259422021301E-4,2.4601259422021301E-4,2.3208735303793598E-6,2.3208735303793598E-6]
[null,"BRE8B2 M51 Goodooga","BOURKE","Long Rural",163,698927,0,0.80020747309682139,6.1049852248722924,0.35993431946196258,35,0.33948577565624199,0.33948577565624199,9.2834941215174597E-4,9.2834941215174597E-4,19,2.0015213325991599E-2,2.0015213325991599E-2,1.06760182397451E-4,1.06760182397451E-4]
[null,"BRE8B4 M56 Brewarrina","BOURKE","Long Rural",456,416322,53,1.5584993166504757,1.6057940327545903,1.8463536576594386,20,9.1521326796979802E-2,9.1344940408670999E-2,1.02698653719287E-3,1.0258261004276799E-3,13,0.10523188717769601,0.10335894223868,3.82944132512595E-4,3.75981511921457E-4]
[null,"BRE8B5 M57 Brewarrina","BOURKE","Short Rural",240,6914,0,0.9030912910664125,1.3286918632644964,0.42344730104390543,6,5.2637411669004E-2,5.2637411669004E-2,5.4308440610877095E-4,5.4308440610877095E-4,3,1.6775273877582E-2,1.6775273877582E-2,6.6144895615811896E-5,6.6144895615811896E-5]
[null,"BRE8B6 M80 Bourke","BOURKE","Short Rural",29,78989,0,0.22100968304578872,0.22069511818818346,0.21317890724310418,5,8.5524189594479594E-3,8.5524189594479594E-3,1.0095799857150201E-4,1.0095799857150201E-4,8,8.2611493313853503E-3,8.2611493313853503E-3,3.2492229425311099E-5,3.2492229425311099E-5]
[null,"BRE8B7 M53 Collerina","BOURKE","Long Rural",49,301051,0,0.31436722157375119,0.57905610168174937,1.4522349810635478E-2,15,4.4604868380360999E-2,4.4604868380360999E-2,2.7154220305438602E-4,2.7154220305438602E-4,8,1.1186610416428499E-3,1.1186610416428499E-3,9.2834941215174595E-6,9.2834941215174595E-6]
[null,"BRI Braidwood","GOULBURN","Long Rural",1345,945911,5343,1.8,5.6945038071538283,5.1428266104944624,180,0.41225444432775599,0.411439817718593,5.9762493407268602E-3,5.96928672013572E-3,55,0.37231569218022298,0.37231569218022298,2.0945883611673799E-3,2.0945883611673799E-3]
[null,"BRL20408 Deep Ck","STROUD","Short Rural",457,124042,298,1.0097856208126554,32.004225117865097,8.458850960200999E-2,52,2.2281964085642598,0.175546232090834,1.9332876508060101E-3,1.3890428079320501E-3,2,5.8892165833376404E-3,5.8892165833376404E-3,7.1947079441760307E-5,7.1947079441760307E-5]
[null,"BRL20420 Stroud Sth","STROUD","Short Rural",206,33505,496,1.1622060918787165,4.6012510076359678,0,20,0.28902186204843799,4.6496380307620197E-2,7.5312346060810403E-4,5.24517417865736E-4,0,0,0,0,0]
[null,"BRO3B1 Brogo Pumps","BEGA","Short Rural",174,67970,0,0.53300000000000003,0.52413339339849774,0.48986237377741265,18,3.0809596115786101E-2,3.0809596115786101E-2,4.4328684430245899E-4,4.4328684430245899E-4,5,2.87950778914168E-2,2.87950778914168E-2,1.3693153829238199E-4,1.3693153829238199E-4]
[null,"BRO3B2 Mumbulla","BEGA","Short Rural",85,31377,0,0.26600000000000001,0.40753103973295673,6.4898174984618348E-2,14,1.6031433911095499E-2,1.6031433911095499E-2,1.8218857213477999E-4,1.8218857213477999E-4,1,2.5529608834173002E-3,2.5529608834173002E-3,9.2834941215174595E-6,9.2834941215174595E-6]
[null,"BTA3B1 M12 Edgeroi","NARRABRI","Long Rural",142,217642,0,0.55252420761447185,3.0253154867921328,0.34194829608834076,64,0.18293241210126701,0.18293241210126701,8.2042879298910504E-4,8.2042879298910504E-4,4,2.0676662282149798E-2,2.0676662282149798E-2,6.8465769146191306E-5,6.8465769146191306E-5]
[null,"BTA3B2 M13 Millie","NARRABRI","Short Rural",194,159959,94,0.80020747309682139,2.8425127729881141,0.65213642723435516,41,0.12255720808197799,0.12255720808197799,5.7325576200370303E-4,5.7325576200370303E-4,6,2.8117382820545999E-2,2.8117382820545999E-2,8.4711883858846798E-5,8.4711883858846798E-5]
[null,"BTH102 Rocket St","BATHURST","Urban",1404,6656,251,2.38,2.6833739478364587,0.79168009962912056,10,0.17335068573109499,0.17335068573109499,3.7226811427284998E-3,3.7226811427284998E-3,2,5.1143929552204898E-2,5.1143929552204898E-2,2.8546744423666202E-4,2.8546744423666202E-4]
[null,"BTH112 Durham St","BATHURST","Short Rural",1176,8868,2527,3.05,0.61798065265175806,0.25338055762824357,4,3.8010106243787999E-2,3.8010106243787999E-2,2.9475093835817901E-4,2.9475093835817901E-4,1,1.55846657564974E-2,1.55846657564974E-2,5.3380091198725398E-5,5.3380091198725398E-5]
[null,"BTH22 Piper St","BATHURST","Urban",1630,8441,1950,4.0999999999999996,0.72620709559022201,0.3744259085658781,2,3.0478871637706999E-2,3.0478871637706999E-2,2.2628516921198799E-4,2.2628516921198799E-4,1,1.5714634674198698E-2,1.5714634674198698E-2,7.0786642676570595E-5,7.0786642676570595E-5]
[null,"BTH32 Gormans Hill","BATHURST","Urban",348,5114,2543,3.14,0.37720446233824451,1.011640607433351,7,1.35979980144927E-2,1.35979980144927E-2,1.20685423579727E-4,1.20685423579727E-4,4,3.6469046219616101E-2,3.6469046219616101E-2,1.34610664762003E-4,1.34610664762003E-4]
[null,"BTH42 Brilliant St","BATHURST","Urban",130,10122,179,3.62,1.4741135487709318E-2,3.8117212622178749,1,1.72905078013263E-4,1.72905078013263E-4,1.1604367651896799E-6,1.1604367651896799E-6,1,4.4709307689228102E-2,4.4709307689228102E-2,1.2996891770124399E-4,1.2996891770124399E-4]
[null,"BTH52 Turon West","BATHURST","Urban",257,1998,2023,2.1,1.9104607077885219E-3,1.4194288863253315,1,5.1059217668346001E-5,5.1059217668346001E-5,1.1604367651896799E-6,1.1604367651896799E-6,4,3.7935838290815899E-2,3.7935838290815899E-2,1.7174464124807299E-4,1.7174464124807299E-4]
[null,"BTH62 Mitchell College","BATHURST","Urban",506,6541,1186,1.71,0.62821188278993889,0.8572226662009319,4,2.5109530725174301E-2,2.5109530725174301E-2,6.4172153114989397E-4,6.4172153114989397E-4,5,3.42630559289906E-2,3.42630559289906E-2,1.7522595154364199E-4,1.7522595154364199E-4]
[null,"BTH72 City Central","BATHURST","Urban",593,997,2482,2.67,0,2.0823485071050909,0,0,0,0,0,3,4.2224812574956999E-2,4.2224812574956999E-2,1.8566988243034899E-4,1.8566988243034899E-4]
[null,"BTH82 Lloyds Rd","BATHURST","Long Rural",1254,301419,815,2.67,8.4623632655871042,0.67167032549187111,71,0.53210667431007697,0.53210667431007697,4.0359990693297097E-3,4.0359990693297097E-3,23,4.2234096069078499E-2,4.19973669689798E-2,2.30926916272747E-4,2.28606042742367E-4]
[null,"BTH92 Lagoon/Trunkey","BATHURST","Long Rural",608,295165,898,1.33,3.5130206457511415,8.2290685391859153,49,0.20531491642824501,0.205032930294304,2.1955463597388798E-3,2.1920650494433101E-3,33,0.480939536022568,0.480939536022568,1.55730613888455E-3,1.55730613888455E-3]
[null,"BTS8B10 Tingha","INVERELL","Short Rural",952,164903,289,1.928118958985674,15.288003583841268,6.7096298572963029,48,1.0001502765610899,0.85153430048001499,5.6954236435509597E-3,5.0049637682631001E-3,19,0.43894797123741403,0.394363990718827,1.2834430622997901E-3,1.15463458136373E-3]
[null,"BTS8B11 Inverell West","INVERELL","Short Rural",2420,34898,953,5.029875545180019,24.619948774903559,5.1929820586902524,25,1.9403442667751301,1.13062398425519,1.42594469706508E-2,8.7299657845219796E-3,21,0.40926864053092299,0.40926864053092299,1.4830381859124099E-3,1.4830381859124099E-3]
[null,"BTS8B12 Inverell Central","INVERELL","Urban",376,4369,1278,2.2405809246710993,4.7979896947404859,5.864716266381599,3,0.108674903060014,0.108674903060014,5.4888658993471995E-4,5.4888658993471995E-4,9,0.13283635694802801,0.13283635694802801,4.7809994725814899E-4,4.7809994725814899E-4]
[null,"BTS8B2 Inverell CBD","INVERELL","Urban",214,2213,1678,2.4806431666001458,3.0994956639069571,3.7396247069196482,2,4.9462456679445002E-2,8.4665466388239193E-3,4.4560771783283798E-4,2.2280385891641899E-4,8,5.9677781523409801E-2,5.9677781523409801E-2,2.28606042742367E-4,2.28606042742367E-4]
[null,"BTS8B3 Abattoir","INVERELL","Short Rural",49,13955,959,4.2906362605096229,0.25259514086715229,0.12214837783561235,6,1.8261793373790001E-2,1.8261793373790001E-2,3.5973539720880201E-5,3.5973539720880201E-5,2,8.8309237830934799E-3,8.8309237830934799E-3,4.0615286781638899E-5,4.0615286781638899E-5]
[null,"BTS8B4 Wallangra/Bukkulla","INVERELL","Long Rural",638,473651,370,1.6842462052799763,10.151345693215234,1.2225145360732075,121,0.76865358583663701,0.67661006249532196,5.0212098829757502E-3,4.74966767992137E-3,19,9.2568040759180903E-2,9.11058904350419E-2,3.4697059279171501E-4,3.2956404131386999E-4]
[null,"BTS8B5 Kings Plains","INVERELL","Long Rural",315,276865,459,1.0326486914725648,6.6815879029125993,0.62596590900963478,53,0.38335144581717701,0.29277703542059202,1.84277358312122E-3,1.7476177683756599E-3,15,3.5914357445855499E-2,3.5207651455854999E-2,1.19524986814537E-4,1.13722802988589E-4]
[null,"BTS8B6 Inverell East","INVERELL","Short Rural",2197,42486,830,5.9939350246728562,20.685314436743095,5.0474675274768162,32,1.2847822063268199,1.1489101468010501,1.09197099604349E-2,1.0405636473455901E-2,19,0.313502436046879,0.301927079314112,1.5631083227104999E-3,1.36003188880231E-3]
[null,"BTS8B8 Delungra","INVERELL","Long Rural",669,300434,132,1.5584993166504757,10.698589475976183,3.1953974315049676,84,0.63557469760468399,0.63153637766182402,2.8709205570792702E-3,2.83842832765396E-3,30,0.18983004823355401,0.18983004823355401,7.7749263267708701E-4,7.7749263267708701E-4]
[null,"BTS8B9 Guyra Rd","INVERELL","Short Rural",123,134764,197,1.7680774643663097,2.3384299211977666,1.1644595132302544,18,0.17147425948178399,9.1824200792694294E-2,4.9898780903156299E-4,3.9570893692968102E-4,12,8.5388418492952395E-2,8.5388418492952395E-2,2.5529608834173E-4,2.5529608834173E-4]
[null,"BUL4806 Naval Base","WAGGA WAGGA","Short Rural",2,8058,128,0.2,8.0804786327731609E-2,6.2235795555671408E-2,3,1.1058962372257699E-3,1.1058962372257699E-3,4.6417470607587298E-6,4.6417470607587298E-6,1,8.5176058564922705E-4,8.5176058564922705E-4,2.3208735303793598E-6,2.3208735303793598E-6]
[null,"BUN3B1 Wamboin","QUEANBEYAN","Long Rural",892,253265,5058,1.83,3.7322141279269045,2.9976064180740267,58,0.146011955979992,0.146011955979992,2.6724858702318402E-3,2.6724858702318402E-3,17,0.117272579053304,0.117272579053304,4.3284291341575098E-4,4.3284291341575098E-4]
[null,"BUN3B2 Bungendore","QUEANBEYAN","Short Rural",1132,32063,5302,2.52,7.6412914166668724,0.21360777735839034,11,0.46792059595390501,0.46792059595390501,4.5814043489688597E-3,4.5814043489688597E-3,5,1.30804432172181E-2,1.30804432172181E-2,2.30926916272747E-4,2.30926916272747E-4]
[null,"BUN3B3 Gundaroo Rd","QUEANBEYAN","Long Rural",774,242318,3605,2.84,1.3024473547828226,1.0042297117946668,60,9.7779562271647802E-2,9.7634507675999099E-2,2.18974417591293E-3,2.18742330238255E-3,17,7.5391255760843295E-2,7.5391255760843295E-2,4.6649557960625198E-4,4.6649557960625198E-4]
[null,"BUN5242 Defence HQ","QUEANBEYAN","Short Rural",1,0,27415,1.56,0,0,0,0,0,0,0,0,0,0,0,0]
[null,"BWA3B1 Abbotts Falls/Krambach","TAREE","Long Rural",872,301366,481,2.438727537056979,9.5309444352094346,17.843126686042275,91,0.384863494922219,0.38289655460522198,2.8152195923501701E-3,2.8059360982286498E-3,68,0.72051286663274405,0.71398192851825604,2.2582099450591201E-3,2.2257177156338099E-3]
[null,"BWA3B2 Pumps No.1","TAREE","Urban",1,0,82,2.0767289182750837,0,0,0,0,0,0,0,0,0,0,0,0]
[null,"BWA3B2 Pumps No.2","TAREE","Urban",1,0,82,2.0767289182750837,0,0,0,0,0,0,0,0,0,0,0,0]
[null,"BYA7881 Yarras","PORT MACQUARIE","Short Rural",346,144985,0,0.80020747309682139,1.4990564072575685,2.2225056261658862,33,8.5147047645792895E-2,8.4062039270340602E-2,1.2022124887365101E-3,1.1975707416757499E-3,7,0.126239273937925,0.126239273937925,6.1503148555053103E-4,6.1503148555053103E-4]
[null,"BYA7882 Comboyne","PORT MACQUARIE","Short Rural",445,158480,0,1.3336791218280355,5.0402621067413618,3.8468593609110115,48,0.27778071110404501,0.27046183642599397,2.9347445791647101E-3,2.9208193379824301E-3,18,0.21200947612662499,0.20074395601016301,6.8233681793153302E-4,6.1387104878534197E-4]
[null,"BYR8A1 M85","BOURKE","Short Rural",41,127817,0,5.7157676649772955E-2,0.39618017784071791,0.71875173671673498,11,1.6470079008337201E-2,1.6470079008337201E-2,1.48535905944279E-4,1.48535905944279E-4,3,2.98800862668691E-2,2.98800862668691E-2,7.7749263267708703E-5,7.7749263267708703E-5]
[null,"CAR2217 Uardry","HAY","Short Rural",69,43690,0,0.36198799999999998,0.94936290772641996,1.7360640886751435,10,3.4324559077545599E-2,3.33149790918306E-2,3.7250020162588802E-4,3.0519486924488598E-4,5,6.2768024629109895E-2,6.2768024629109895E-2,1.65942457422125E-4,1.65942457422125E-4]
[null,"CAR2218 Wyvern","HAY","Short Rural",26,44552,0,0.45724799999999999,0.51496682479068867,1.7094167556664368,7,1.27787296582688E-2,1.23957855257562E-2,1.3925241182276201E-4,1.13722802988589E-4,9,4.24186055147436E-2,4.24186055147436E-2,1.02118435336692E-4,1.02118435336692E-4]
[null,"CB 82574 Seaham","DUNGOG","Short Rural",116,9073,225,0.41915629543166832,11.347909396500521,0.34625722359983019,7,0.465043873213,7.62871129435697E-3,3.7133976486069799E-4,2.41370847159454E-4,3,1.4189820764739401E-2,8.4178082946859498E-3,1.8566988243034899E-4,4.5257033842397598E-5]
[null,"CB 82578 East Seaham","DUNGOG","Short Rural",142,28208,270,0.4953665309646989,21.131828036224302,2.6738941045211613,15,0.86599450301104297,5.3217630051598797E-3,5.0595042962270104E-4,5.9182275024673801E-5,7,0.10957772286333101,0.10957772286333101,3.4348928249614599E-4,3.4348928249614599E-4]
[null,"CBB42 Tambar Springs","COONABARABRAN","Long Rural",765,703098,199,1.3717842395945505,25.43615246694641,29.217606123313971,193,0.89656737002673104,0.87654867539044301,3.5126420882291699E-3,3.4198071470139899E-3,28,1.0298551368764199,0.34037118890808099,2.6736463069970298E-3,1.08152706515678E-3]
[null,"CBB52 Baradine","COONABARABRAN","Long Rural",1189,498704,40,2.6292531258895555,26.852262320455974,53.254357446012555,118,0.87929542921364701,0.87729947797752095,5.1279700653732102E-3,5.1163656977213099E-3,72,1.7438498301990899,0.65531720829085605,4.6742392901840402E-3,2.1665354406091401E-3]
[null,"CBB62 Coonabarabran","COONABARABRAN","Short Rural",1326,14702,566,2.9340940680216776,14.510555205166863,41.826555005364916,16,0.66655719879848396,0.66655719879848396,3.5903913514968798E-3,3.5903913514968798E-3,9,1.92134559605544,0.62952882205804594,4.80304777112009E-3,1.83000877870413E-3]
[null,"CBB72 Binnaway","COONABARABRAN","Long Rural",835,459078,3,1.7528354172597038,19.590265352775283,32.251810935134635,134,0.74547386145197303,0.71969824002357996,4.6092548313334198E-3,4.4433123739112904E-3,74,1.2272872063587299,0.4400851992673,3.2503833792963E-3,1.43894158883521E-3]
[null,"CBC72 Central","COBAR","Long Rural",219,1276895,32,0.74304979644704838,5.0312019865195907,2.131613925577561,41,0.21576929124583899,0.21576929124583899,1.6431784595085899E-3,1.6431784595085899E-3,7,9.1416887488112802E-2,9.1416887488112802E-2,3.9454850016449201E-4,3.9454850016449201E-4]
[null,"CBL3B1 Premer","QUIRINDI","Long Rural",222,219028,0,0.64016597847745693,4.8652540662427715,5.5731984708237707,48,0.26393089831150601,0.25356239581453699,1.1244632254687999E-3,1.0989336166346299E-3,31,0.30233555305545901,0.30233555305545901,9.6200207834224697E-4,9.6200207834224697E-4]
[null,"CBL3B2 Spring Ridge","QUIRINDI","Short Rural",141,86094,0,0.64016597847745693,2.8065225514008327,1.297289901735289,27,0.13073712683979999,0.13073712683979999,7.2295210471317196E-4,7.2295210471317196E-4,8,6.0432065420783103E-2,6.03183426177945E-2,1.8102813536959001E-4,1.7870726183921099E-4]
[null,"CBP142 22kV Chesney","COBAR","Short Rural",4,10997,711,3.7190594940118933,8.0419571068328314E-3,4.5986402610903192E-2,1,3.2956404131386999E-4,3.2956404131386999E-4,2.3208735303793598E-6,2.3208735303793598E-6,1,1.88454930666804E-3,1.88454930666804E-3,2.3208735303793598E-6,2.3208735303793598E-6]
[null,"CBP142 33kV Chesney","COBAR","Short Rural",3,35407,24,1.4999999999999999E-2,4.0209785534164157E-3,2.2993201305451596E-2,1,1.6478202065693499E-4,1.6478202065693499E-4,1.1604367651896799E-6,1.1604367651896799E-6,1,9.4227465333402197E-4,9.4227465333402197E-4,1.1604367651896799E-6,1.1604367651896799E-6]
[null,"CBR22 Cobar Town Nth","COBAR","Short Rural",1276,20093,172,3.0484094213212236,7.8722553926100867,7.3885737482359133,19,0.46269166788996002,0.46269166788996002,1.1586961100418999E-2,1.1586961100418999E-2,17,0.43426328801634401,0.43426328801634401,1.42501634765293E-3,1.42501634765293E-3]
[null,"CBR32 Cobar Town Sth","COBAR","Short Rural",938,26146,2031,2.8578838324886475,5.5886827956407759,1.9385169801009463,21,0.304186449695937,0.30410057737531299,7.4697314575259801E-3,7.46857102076079E-3,6,0.105511552438107,9.7098385890481406E-2,3.8062325898221601E-4,3.2260142072273199E-4]
[null,"CBR42 Margretvale","COBAR","Long Rural",316,1121076,10,1.1431535329954587,14.172110947917984,12.770089758633619,46,0.51037633544513505,0.51037633544513505,3.4511389396741101E-3,3.4511389396741101E-3,59,0.45988573179173198,0.45898407242518002,1.8288483419389399E-3,1.82420659487818E-3]
[null,"CBY1392 Calrose Ave","DARLINGTON POINT","Short Rural",10,1819,268,3.43,0.22507145689100877,0,2,3.3710688028760301E-3,3.3710688028760301E-3,2.2048298538604E-5,2.2048298538604E-5,0,0,0,0,0]
[null,"CBY802 Bull Rd","DARLINGTON POINT","Short Rural",66,40328,0,0.21,1.4091669040402355,4.0412375495892157,9,4.8347276948097699E-2,4.8197580605388299E-2,2.34408226568316E-4,2.3324778980312599E-4,13,0.138651305578394,0.138651305578394,4.0499243105119898E-4,4.0499243105119898E-4]
[null,"CBY804 Channel Nine Rd","DARLINGTON POINT","Short Rural",51,64971,0,0.25,0.30361334762739495,0.47881776590647107,5,1.73845031793066E-2,1.73845031793066E-2,1.12562366223399E-4,1.12562366223399E-4,10,2.74164790143714E-2,2.74164790143714E-2,9.6316251510743605E-5,9.6316251510743605E-5]
[null,"CBY806 Coleambally Town","DARLINGTON POINT","Short Rural",379,4699,0,1.05,2.8488811202821749,3.6795786124119462E-2,7,0.12668256078222701,0.12668256078222701,8.7961106801377905E-4,8.7961106801377905E-4,1,1.6362158389174499E-3,1.6362158389174499E-3,1.16043676518968E-5,1.16043676518968E-5]
[null,"CBY808 Jimmy Cull Rd","DARLINGTON POINT","Short Rural",87,38437,0,0.72,1.5761030233735795,6.0331950675231019E-2,7,3.9652124266531398E-2,3.9652124266531398E-2,2.62258708932868E-4,2.62258708932868E-4,1,1.5178512888681E-3,1.5178512888681E-3,1.39252411822762E-5,1.39252411822762E-5]
[null,"CCN3B1 Walbundrie","CULCAIRN","Long Rural",595,414796,12,1.6956777406099306,5.290150300305676,1.0165934649938373,37,0.282139311594098,0.282139311594098,1.8474153301819699E-3,1.8474153301819699E-3,17,5.4217926543192303E-2,5.4217926543192303E-2,4.1775723546828597E-4,4.1775723546828597E-4]
[null,"CCN3B2 Culcairn Nth","CULCAIRN","Short Rural",29,24014,0,0.19052558883257648,0.12350450184114252,0,3,5.45173192286113E-3,5.45173192286113E-3,6.38240220854325E-5,6.38240220854325E-5,0,0,0,0,0]
[null,"CCN3B3 Holbrook","CULCAIRN","Short Rural",267,85113,0,0.78115491421356364,0.57166592229487645,5.0862040178120231E-2,17,3.7406679125889401E-2,3.7406679125889401E-2,4.8622300461447702E-4,4.8622300461447702E-4,2,3.32813264256401E-3,3.32813264256401E-3,1.74065514778452E-5,1.74065514778452E-5]
[null,"CCN3B4 Hurricane Hill","CULCAIRN","Short Rural",722,93752,123,2.2482019482244029,4.8265484935049026,4.35237489173611,14,0.14574737639752799,0.14574737639752799,1.30665179760358E-3,1.30665179760358E-3,15,0.13142874715185299,0.13142874715185299,4.7461863696258001E-4,4.7461863696258001E-4]
[null,"CDN32 Condobolin Town No.2","CONDOBOLIN","Short Rural",702,21064,451,2.1339999999999999,10.898866322251614,8.624414633727244E-2,15,0.51883707990013295,0.51880458767070703,4.7682346681644002E-3,4.7670742313992102E-3,2,4.1056252752410998E-3,4.1056252752410998E-3,1.27648044170865E-5,1.27648044170865E-5]
[null,"CDN42 Burcher","CONDOBOLIN","Long Rural",236,412104,0,0.76200000000000001,8.1384235430533742,0.49625852303072676,55,0.30572750972010898,0.30568573399656201,1.8276879051737499E-3,1.8265274684085601E-3,11,1.8642416632772201E-2,1.8642416632772201E-2,5.5700964729104699E-5,5.5700964729104699E-5]
[null,"CDN52 Tottenham","CONDOBOLIN","Long Rural",333,564311,561,0.72399999999999998,10.299188140885658,2.6874886076276074,111,0.42332036932060502,0.38147618000463002,3.14478363366404E-3,2.74675382320398E-3,80,0.110461975678406,0.108792107173298,4.0615286781638902E-4,3.9802981046006098E-4]
[null,"CDN62 Tallebung","CONDOBOLIN","Long Rural",233,922744,0,2.21,26.281851748187449,4.7473764661932343,79,0.45467769158956001,0.45456048747627598,2.2524077612331699E-3,2.2512473244679799E-3,35,8.21299120562997E-2,8.21299120562997E-2,3.8642544280816402E-4,3.8642544280816402E-4]
[null,"CDN72 Kiacatoo","CONDOBOLIN","Long Rural",317,375148,0,0.99,7.760699914594543,0.55538804438558387,65,0.28302240397240702,0.28302240397240702,1.8334900889997001E-3,1.8334900889997001E-3,9,2.0254263299620701E-2,2.0254263299620701E-2,1.69423767717694E-4,1.69423767717694E-4]
[null,"CDN82 Condobolin Town No.1","CONDOBOLIN","Urban",857,8912,212,2.972,10.194319776912709,1.1519241919965075,17,0.47190089405850599,0.47044106460789697,3.9594102428272002E-3,3.9199553928107502E-3,2,5.33232297972311E-2,5.33232297972311E-2,1.7754682507402101E-4,1.7754682507402101E-4]
[null,"CFL Braidwood","QUEANBEYAN","Long Rural",2164,700368,2908,2.4319999999999999,6.011572627507098,10.135643830367034,163,0.33884173325156097,0.33877442791918,2.4578050686717501E-3,2.4566446319065601E-3,65,0.57129462387053198,0.57129462387053198,3.4940750999861302E-3,3.4940750999861302E-3]
[null,"CFN3B11 Coffs Harbour East No.2","COFFS HARBOUR","Urban",409,3231,1241,3.4294605989863771,1.234998237000144,3.9496641730476325,3,2.1772114588488801E-2,2.1772114588488801E-2,8.3319359740619198E-4,8.3319359740619198E-4,3,6.9629687221676506E-2,6.9629687221676506E-2,2.30926916272747E-4,2.30926916272747E-4]
[null,"CFN3B12 Korora Bay","COFFS HARBOUR","Short Rural",1284,7063,9413,3.2960926868035734,0.27710116144082569,2.1600959491571108,9,2.24300822343514E-2,1.29841269657074E-2,1.51204910504216E-3,1.4888403697383599E-3,17,0.17484997003172101,0.160018427735831,9.5736033128148801E-4,8.7264844742264099E-4]
[null,"CFN3B13 Karangi Dam","COFFS HARBOUR","Short Rural",2320,129270,6738,3.8867220121845603,6.3254541507995423,8.2550116894328127,63,0.54024365690758702,0.53809452801845503,4.2773699164891698E-3,4.2657655488372703E-3,45,0.70504308411600003,0.70233926645310796,2.4496820113154199E-3,2.4380776436635199E-3]
[null,"CFN3B15 Park Beach Plaza No.2","COFFS HARBOUR","Urban",200,152,2350,3.8105117766515302,1.9035254278112916,0.6969407586996339,1,3.4626272636494898E-2,3.4626272636494898E-2,6.1503148555053198E-5,6.1503148555053198E-5,2,1.2677771659697299E-2,1.2677771659697299E-2,7.6588826502519005E-5,7.6588826502519005E-5]
[null,"CFN3B20 Ocean","COFFS HARBOUR","Urban",1507,4313,5551,3.2389350101538001,1.340024509561329,1.9938690473481597,9,9.02169958729067E-2,9.02169958729067E-2,6.7073245027963601E-4,6.7073245027963601E-4,9,0.134237004123612,0.134237004123612,6.1271061202015204E-4,6.1271061202015204E-4]
[null,"CFN3B21 Nth Interconnector","COFFS HARBOUR","Short Rural",938,5112,205,1.2574688862950048,0.23500698221313354,0.24990491607342075,6,2.1508695442790798E-2,2.1508695442790798E-2,2.5413565157654002E-4,2.5413565157654002E-4,3,2.2872208641888599E-2,2.2872208641888599E-2,1.8799075596072899E-4,1.8799075596072899E-4]
[null,"CFN3B22 Korora Moonee","COFFS HARBOUR","Short Rural",471,25940,1609,0.99073306192939781,4.2063748519951085,1.2168781497308969,17,0.29741994291811602,0.29741994291811602,1.89615367431994E-3,1.89615367431994E-3,10,8.6041744391754202E-2,8.6041744391754202E-2,3.2028054719235202E-4,3.2028054719235202E-4]
[null,"CFN3B5 Nth West","COFFS HARBOUR","Short Rural",1228,9718,253,2.0957814771583414,1.2610953184379043,0.165512144130849,11,0.107825463347895,0.107825463347895,7.5428389737329299E-4,7.5428389737329299E-4,3,1.4151526351488201E-2,1.4151526351488201E-2,1.05599745632261E-4,1.05599745632261E-4]
[null,"CFN3B6 Nth Central","COFFS HARBOUR","Urban",326,2059,2817,2.819778714722132,3.5297286341576771E-3,3.6622895539738209,1,8.35514470936571E-5,8.35514470936571E-5,1.1604367651896799E-6,1.1604367651896799E-6,9,8.668926810673E-2,8.668926810673E-2,2.9707181188855898E-4,2.9707181188855898E-4]
[null,"CFN3B7 Park Beach Plaza No.1","COFFS HARBOUR","Urban",1588,5356,1941,2.6292531258895555,1.5720515147995575,0.77223723661575971,7,0.11391311461808,0.11391311461808,9.1674504449984896E-4,9.1674504449984896E-4,2,5.5957421254211701E-2,5.5957421254211701E-2,3.5393321338285301E-4,3.5393321338285301E-4]
[null,"CFN3B8 Nth Jetty","COFFS HARBOUR","Urban",400,3396,385,0.95262794416288255,5.8451202124021537E-3,3.112785911930145E-3,2,1.9611381331705599E-4,1.9611381331705599E-4,2.3208735303793598E-6,2.3208735303793598E-6,1,1.0443930886707101E-4,1.0443930886707101E-4,1.1604367651896799E-6,1.1604367651896799E-6]
[null,"CHD3B1 Crescent Head","KEMPSEY","Short Rural",768,9467,1474,1.2384163274117472,6.2710198907271995,4.2886276379663437,6,0.41479464040675601,0.41477839429204399,2.6214266525634898E-3,2.6202662157982998E-3,2,0.28366992768738297,0.28366992768738297,5.4424484287396099E-4,5.4424484287396099E-4]
[null,"CHD3B2 Beranghi","KEMPSEY","Short Rural",379,85984,6531,1.2384163274117472,4.098062490546635,3.1416308612948405,26,0.25342662471300897,0.25342662471300897,1.49232168003393E-3,1.49232168003393E-3,5,0.19428032322805699,0.19428032322805699,5.6049095758661598E-4,5.6049095758661598E-4]
[null,"CHI2524 Estella","WAGGA WAGGA","Short Rural",402,5761,4514,0.56999999999999995,0.10455649988776851,0.40962930414734428,3,9.3856125568541494E-3,9.3856125568541494E-3,3.9222762663411302E-4,3.9222762663411302E-4,7,3.6770759778565497E-2,3.6770759778565497E-2,1.9263250302148699E-4,1.9263250302148699E-4]
[null,"CHI2526 Olympic Hwy","WAGGA WAGGA","Short Rural",107,39794,1524,0.247,0.43709512617764029,1.4146066355749101,5,2.22827067651723E-2,2.22827067651723E-2,3.8178369574740501E-4,3.8178369574740501E-4,8,7.2115342772712795E-2,7.2115342772712795E-2,2.9475093835817901E-4,2.9475093835817901E-4]
[null,"CHI2527 Euberta - Ganmurra","WAGGA WAGGA","Short Rural",12,49639,0,0.6,0.14410131909659699,0.15606153567489553,5,3.4673850543867702E-3,3.4673850543867702E-3,2.6690045599362699E-5,2.6690045599362699E-5,2,3.75517337215381E-3,3.75517337215381E-3,8.1230573563277697E-6,8.1230573563277697E-6]
[null,"CHI2535 Coolamon Rd","WAGGA WAGGA","Short Rural",27,29771,1684,1.65,0.14841753016128315,0,4,6.1700422805135401E-3,6.1700422805135401E-3,6.1503148555053198E-5,6.1503148555053198E-5,0,0,0,0,0]
[null,"CHI2538 Farrer Rd","WAGGA WAGGA","Short Rural",879,101616,7264,0.86,1.9873725766912587,2.2350140560266354,18,0.167033267981403,0.167033267981403,3.1714736792634E-3,3.1714736792634E-3,15,0.18784686180184501,0.18784686180184501,6.4056109438470404E-4,6.4056109438470404E-4]
[null,"CHS3B1 Toormina","COFFS HARBOUR","Urban",131,4760,1603,0,3.5778531141515799,0.19244962762479229,10,5.2445939602747703E-2,5.2344981604176201E-2,6.1271061202015204E-4,6.11550175254962E-4,1,2.8210217761761198E-3,2.8210217761761198E-3,1.27648044170865E-5,1.27648044170865E-5]
[null,"CHS3B11 Sth Jetty No.2","COFFS HARBOUR","Short Rural",1217,10044,6544,2.8578838324886475,5.6739623165337498,2.1845332144478817,14,0.216158037562178,0.216158037562178,4.5686395445517797E-3,4.5686395445517797E-3,10,8.3223043489108403E-2,8.3223043489108403E-2,3.8178369574740501E-4,3.8178369574740501E-4]
[null,"CHS3B12 Sth Interconnector","COFFS HARBOUR","Urban",1027,5616,1163,2.5339903314732672,0.69898558406600597,1.2380254976945135,8,6.13522917755785E-2,6.13522917755785E-2,2.8059360982286498E-3,2.8059360982286498E-3,6,0.108665619565892,9.0986365448227399E-2,5.5120746346509905E-4,4.8738344137966598E-4]
[null,"CHS3B2 City Centre","COFFS HARBOUR","Urban",559,1006,2817,3.0103043035547086,1.4789500134301374,4.10843688060781,3,3.068078763485E-2,3.068078763485E-2,1.2509508328744799E-3,1.2509508328744799E-3,6,8.5229438656121398E-2,8.5229438656121398E-2,1.8334900889997E-4,1.8334900889997E-4]
[null,"CHS3B3 Sth Jetty No.1","COFFS HARBOUR","Urban",1254,7973,1509,2.667358243656071,2.3987909847233393,1.7852852029826163,7,0.175842143465958,0.174518085116876,5.7000653906117199E-3,5.6989049538465298E-3,9,0.13086941663103199,0.13086941663103199,6.6957201351444705E-4,6.6957201351444705E-4]
[null,"CHS3B4 Sth East","COFFS HARBOUR","Urban",639,3852,967,3.2008298923872855,0.14655826605394962,1.0144828246005968,2,4.49553202834483E-3,4.49553202834483E-3,7.3687734589544796E-4,7.3687734589544796E-4,1,3.1118272295326498E-2,3.1118272295326498E-2,7.4267952972139595E-5,7.4267952972139595E-5]
[null,"CHS3B5 Boambee No.1","COFFS HARBOUR","Urban",97,5150,984,3.2008298923872855,1.7098212093664473,0.58377659469143783,5,2.3900355615846702E-2,2.3900355615846702E-2,3.9338806339930203E-4,3.9338806339930203E-4,2,8.1601913328138397E-3,8.1601913328138397E-3,3.9454850016449201E-5,3.9454850016449201E-5]
[null,"CHS3B6 Sth Central","COFFS HARBOUR","Urban",799,3481,1793,4.1915629543166828,0.13227134894745074,0.9070111045990028,3,5.7940607685920799E-3,5.7940607685920799E-3,9.3415159597769399E-4,9.3415159597769399E-4,5,3.97310339665643E-2,3.97310339665643E-2,1.19524986814537E-4,1.19524986814537E-4]
[null,"CHS3B7 Sawtell","COFFS HARBOUR","Short Rural",1122,12514,3627,2.0957814771583414,14.280443967136895,1.4390235142305552,9,0.47152723342011499,0.14440359062343899,4.8239356328935099E-3,3.5381716970633399E-3,3,4.7515243787456703E-2,4.7515243787456703E-2,1.2880848093605501E-4,1.2880848093605501E-4]
[null,"CHS3B8 West No.1","COFFS HARBOUR","Short Rural",326,3348,1033,0.70494467868053301,1.7856062068863868E-2,0,1,1.4900008065035499E-3,1.4900008065035499E-3,3.7250020162588802E-4,3.7250020162588802E-4,0,0,0,0,0]
[null,"CHS3B9 Bonville","COFFS HARBOUR","Short Rural",457,14221,3081,1.6385200639601578,2.0785234495194982,1.130035030487428,8,0.113925879422497,3.3521536836034302E-2,1.5897983683098599E-3,6.03427117898635E-4,6,6.1938312341999299E-2,6.1938312341999299E-2,1.8334900889997E-4,1.8334900889997E-4]
[null,"CLA3B1 Werris Ck","QUIRINDI","Short Rural",15,14053,0,0,0.13265512077129862,0,3,8.9040312993004297E-3,8.9040312993004297E-3,4.6417470607587303E-5,4.6417470607587303E-5,0,0,0,0,0]
[null,"CLA3B2 Gowrie","QUIRINDI","Short Rural",255,134199,0,0.97168050304614006,1.6878426261005022,0.55732916981118319,39,0.107721024039028,0.107721024039028,6.59128082627739E-4,6.59128082627739E-4,8,3.5569707726594103E-2,3.5569707726594103E-2,1.2300629711010599E-4,1.2300629711010599E-4]
[null,"CLA3B3 Piallaway","QUIRINDI","Short Rural",135,137231,0,0.43820885431492596,0.10457465032083793,8.6276981715420024E-3,21,8.3829951917302609E-3,8.3829951917302609E-3,8.4711883858846798E-5,8.4711883858846798E-5,2,6.9162031205305104E-4,6.9162031205305104E-4,2.3208735303793598E-6,2.3208735303793598E-6]
[null,"CLN3B1 Grong Grong 94/95 Line","COOLAMON","Long Rural",398,266587,0,0,3.6133589317514083,3.9126103497268017,33,0.14807753342202901,0.13945316738314001,1.0687622607397E-3,9.8288994011566091E-4,14,0.16034102915655399,0.16034102915655399,4.2704072958980302E-4,4.2704072958980302E-4]
[null,"CLN3B2 Marrar 91 Line","COOLAMON","Long Rural",272,219530,226,0,0.51451535433504303,4.5034110295752523,18,2.1085136023496501E-2,2.1085136023496501E-2,2.5181477804616103E-4,2.5181477804616103E-4,33,0.18455238182547101,0.18361242804566799,6.90459875287861E-4,6.8697856499229197E-4]
[null,"CLN3B3 Rannock 92 Line","COOLAMON","Long Rural",422,150010,174,0,1.1182851058557806,0.66473571508063567,14,4.5827968730870902E-2,2.4459686136668098E-2,6.2083366937648002E-4,5.1755479727459805E-4,8,2.7241253062827799E-2,2.7241253062827799E-2,1.0792061916264001E-4,1.0792061916264001E-4]
[null,"CLN3B4 Ganmain 93 Line","COOLAMON","Short Rural",868,174176,0,0,2.2268858830829124,3.6648954174360502,30,9.1259068088046999E-2,9.1259068088046999E-2,1.2509508328744799E-3,1.2509508328744799E-3,23,0.150189528334675,0.14821678583385201,5.8950187671635802E-4,5.8137881936003101E-4]
[null,"CLY1523 Coleambally 132 - Darlington Point (Bore Pumpers)","DARLINGTON POINT","Short Rural",61,88902,103,3.03,0.82543760939619459,1.0595626040799127,19,1.5964128578714501E-2,1.5964128578714501E-2,1.2880848093605501E-4,1.2880848093605501E-4,8,2.04921528364846E-2,2.04921528364846E-2,8.2391010328467402E-5,8.2391010328467402E-5]
[null,"CLY1526 Coleambally 132 - Coleambally - Egansford","DARLINGTON POINT","Short Rural",18,60140,46,5.6,0.73155050514601128,4.1233811187279264E-2,8,1.7602665291162299E-2,1.7602665291162299E-2,6.1503148555053198E-5,6.1503148555053198E-5,2,9.9217343423717796E-4,9.9217343423717796E-4,2.3208735303793598E-6,2.3208735303793598E-6]
[null,"CLY1530 Coleambally 132 - Darlington Point (Kidman Way)","DARLINGTON POINT","Short Rural",4,26477,186,5.94,3.5581938347264606E-2,0,4,6.2083366937648002E-4,6.2083366937648002E-4,9.2834941215174595E-6,9.2834941215174595E-6,0,0,0,0,0]
[null,"CMK4005 West","MOLONG","Short Rural",156,198402,0,1.0256000000000001,2.6374508999841551,7.7675102556762745,61,0.167142349037331,0.16655748890767499,1.2161377299187901E-3,1.21381685638841E-3,42,0.49224799229934202,0.49224799229934202,1.61880928743961E-3,1.61880928743961E-3]
[null,"CMK4006 East","MOLONG","Short Rural",247,99654,0,0.5,0.55102950815673435,3.5793950303464017,17,2.9371814963715999E-2,1.9549878183150599E-2,5.4076353257839196E-4,4.8506256784928699E-4,18,0.190794371185427,0.17763153695788,5.8834143995116896E-4,5.3960309581320203E-4]
[null,"CMK4022 Yeoval","MOLONG","Short Rural",352,179498,0,0.74099999999999999,4.4472412990226999,7.6300899373063942,23,0.22538583071896601,0.22538583071896601,1.1453510872422199E-3,1.1453510872422199E-3,37,0.38669234326415802,0.38094818127646901,1.3228979123162401E-3,1.2846034990649799E-3]
[null,"CNA3B1 Pine Ridge","QUIRINDI","Short Rural",81,83095,0,0.38105117766515295,0.11835210533509845,0.62023803354547413,11,7.9768423239138693E-3,7.6913748796772104E-3,7.6588826502519005E-5,7.4267952972139703E-5,3,4.1803574029193102E-2,4.1803574029193102E-2,1.7754682507402101E-4,1.7754682507402101E-4]
[null,"CNA3B2 Caroona","QUIRINDI","Short Rural",55,29243,0,0.4953665309646989,0.16615814954773186,0.15263034129084971,11,6.1004160746021604E-3,6.1004160746021604E-3,3.1331792660121401E-5,3.1331792660121401E-5,3,5.6037491391009702E-3,5.6037491391009702E-3,6.4984458850622198E-5,6.4984458850622198E-5]
[null,"CNA3B3 Feedlot","QUIRINDI","Short Rural",28,29146,86,0.510608578071305,7.9359927219746315E-2,7.5726286843005405E-2,5,3.0159751527279802E-3,3.0159751527279802E-3,1.50856779474659E-5,1.50856779474659E-5,3,2.87788317767041E-3,2.7641603746818202E-3,3.3652666190500797E-5,3.2492229425311099E-5]
[null,"CNB22 Rural Sth","COONAMBLE","Long Rural",284,518022,905,0.91833333817301877,3.8401982612549244,1.3568299035234335,46,0.26860745847522099,0.26278670766103002,2.0609356949768801E-3,1.9657798802313201E-3,14,9.4905160404273006E-2,9.4905160404273006E-2,6.4636327821065303E-4,6.4636327821065303E-4]
[null,"CNB32 Coonamble Town No.2","COONAMBLE","Short Rural",599,7284,161,1.7947510468028707,7.5052636706016091,2.1148650653790804,13,0.32547582259010599,0.32547582259010599,2.2175946582774801E-3,2.2175946582774801E-3,3,9.1713959300001299E-2,9.1713959300001299E-2,7.7285088561632805E-4,7.7285088561632805E-4]
[null,"CNB42 Rural Nth","COONAMBLE","Long Rural",508,1008811,0,1.0707538092390798,9.2046199737547383,11.346985443366279,77,0.62674841556865202,0.61435263004289598,3.9408432545841596E-3,3.8839818530898699E-3,57,0.77262344001035099,0.74796531918683595,3.1157727145342999E-3,3.0043707850760902E-3]
[null,"CNB52 Coonamble Town No.1","COONAMBLE","Short Rural",874,15325,120,2.5861943428133936,5.6726528100852036,2.198630220606558,11,0.291719877527504,0.291719877527504,3.0797991748134201E-3,3.0797991748134201E-3,2,0.113065995779491,0.113065995779491,1.05367658279223E-3,1.05367658279223E-3]
[null,"CNK3B1 Harrington","TAREE","Short Rural",77,16599,59,0.15242047106606119,0.55344772842748791,0.13903359197146867,10,2.8685996835488899E-2,2.8685996835488899E-2,1.9495337655186699E-4,1.9495337655186699E-4,1,7.2063123118279301E-3,7.2063123118279301E-3,3.4813102955690502E-5,3.4813102955690502E-5]
[null,"CNK3B2 Jones Island","TAREE","Short Rural",148,37142,47,0.28578838324886469,1.009842625595043,0.83073501345423295,17,6.0271925147186899E-2,6.0271925147186899E-2,5.3031960169168499E-4,5.3031960169168499E-4,16,4.95819816662596E-2,4.95819816662596E-2,2.32087353037936E-4,2.32087353037936E-4]
[null,"CNK3B3 Coopernook/Moorland","TAREE","Short Rural",503,61630,2154,0.80020747309682139,3.7200210545999028,4.834172588879226,31,0.23902560445700599,0.238640339450963,2.0934279244021899E-3,2.0887861773414302E-3,20,0.31061410893832198,0.31061410893832198,1.1047358004605799E-3,1.1047358004605799E-3]
[null,"CNK3B4 Lansdowne","TAREE","Short Rural",641,130757,235,1.4479944751275813,5.8505459704644736,5.1164196083738318,32,0.41584483567925301,0.41504065300097598,3.63564838533927E-3,3.6298462015133298E-3,16,0.36366463609573402,0.36366463609573402,1.04207221514033E-3,1.04207221514033E-3]
[null,"COBD2 Sth Cobargo","BEGA","Long Rural",741,210646,0,1.181,4.3078901781954047,2.4001681870833638,98,0.26621115655510402,0.26621115655510402,2.46708856279326E-3,2.46708856279326E-3,16,0.148321225142719,0.13270754846709201,7.5892564443405205E-4,6.7885550763596399E-4]
[null,"COBE2 Cobargo Town","BEGA","Short Rural",261,7600,105,0.41899999999999998,1.1671303391871686,0,6,4.7886583552317397E-2,4.7886583552317397E-2,6.4984458850622195E-4,6.4984458850622195E-4,0,0,0,0,0]
[null,"COO102 Northern Rural","COOMA","Long Rural",929,585962,87,2.177,2.9351534028037021,6.8656575794772516,119,0.193727955327826,0.18943549973338999,1.5897983683098599E-3,1.5503435182934199E-3,62,0.45315171724333603,0.446793684206862,1.74529689484528E-3,1.71628597571554E-3]
[null,"COO12 Nimmitabel","COOMA","Short Rural",282,115044,1012,2.15,2.8476332192804645,0.44136549219564042,53,6.0824293047417197E-2,6.0824293047417197E-2,4.1775723546828597E-4,4.1775723546828597E-4,5,9.4273882804009803E-3,9.4273882804009803E-3,4.5257033842397598E-5,4.5257033842397598E-5]
[null,"COO22 Polo Flat","COOMA","Short Rural",892,105371,760,1.5429999999999999,5.5011178225506061,4.853409067285769,20,0.26148469761048698,0.26148469761048698,2.3046274156667099E-3,2.3046274156667099E-3,21,0.23069714979323899,0.23069714979323899,7.5660477090367295E-4,7.5660477090367295E-4]
[null,"COO32 Victoria St","COOMA","Urban",898,8559,2055,2.153,0.99789851502964111,0.20227511431699191,7,6.7965620900394499E-2,6.7965620900394499E-2,1.0664413872093199E-3,1.0664413872093199E-3,2,1.37767052763319E-2,1.37767052763319E-2,7.4267952972139595E-5,7.4267952972139595E-5]
[null,"COO52 Commissioner St","COOMA","Urban",410,3352,2124,3.5620000000000003,2.4077815471322587E-3,0.63721492759383569,1,6.2663585320242801E-5,6.2663585320242801E-5,1.1604367651896799E-6,1.1604367651896799E-6,3,1.65838018113257E-2,1.65838018113257E-2,3.7133976486069797E-5,3.7133976486069797E-5]
[null,"COO62 SMA","COOMA","Urban",467,6945,968,2.54,0.76744958518893014,7.3680978322351098,3,2.4491017929328202E-2,2.4491017929328202E-2,1.34610664762003E-4,1.34610664762003E-4,8,0.235132339109794,0.235132339109794,5.7325576200370303E-4,5.7325576200370303E-4]
[null,"COO82 Cooma Nth","COOMA","Short Rural",930,8678,971,1.881,1.3748175819390733,1.049747365455556,11,0.109032317583692,0.109032317583692,1.7220881595414899E-3,1.7220881595414899E-3,4,8.3252054408238199E-2,8.3252054408238199E-2,2.62258708932868E-4,2.62258708932868E-4]
[null,"COO92 Western Rural","COOMA","Long Rural",606,291992,442,1.95,1.2686806732026539,2.0612367248599535,46,7.0249360454287799E-2,6.9616922417259405E-2,2.7502351334995499E-4,2.69221329524006E-4,27,0.114134758040231,0.107101350806417,3.8178369574740501E-4,3.6321670750437098E-4]
[null,"COW102 Wyangala","COWRA","Long Rural",1065,438996,0,2.38156985,3.0049344058309693,2.6427260220962836,73,0.16845596345552499,0.16838053506578801,1.5166908521029099E-3,1.5155304153377199E-3,35,0.14815064093823599,0.14815064093823599,4.8622300461447702E-4,4.8622300461447702E-4]
[null,"COW32 Woodstock","COWRA","Long Rural",800,387547,95,1.5432572627999999,3.2326513162707959,0.71673519927290941,79,0.169864733688466,0.150348508171506,1.8520570772427301E-3,1.71628597571554E-3,23,3.7661975214231098E-2,3.7661975214231098E-2,1.9959512361262499E-4,1.9959512361262499E-4]
[null,"COW42 Lachlan","COWRA","Short Rural",245,117089,353,1.8480982035999998,0.76700367976371453,0.28965677520309752,17,2.29047008713139E-2,2.29047008713139E-2,1.4737546917908999E-4,1.4737546917908999E-4,9,8.6498956477238896E-3,8.6498956477238896E-3,5.9182275024673801E-5,5.9182275024673801E-5]
[null,"COW52 Cowra Town Nth","COWRA","Short Rural",1557,15274,3425,3.7152489659999999,5.2822021959334109E-2,0.55778201784777581,4,3.9686937369487101E-3,3.9686937369487101E-3,9.7476688275933304E-5,9.7476688275933304E-5,3,4.1908013338060199E-2,4.1908013338060199E-2,1.65942457422125E-4,1.65942457422125E-4]
[null,"COW62 Cowra Town Centre","COWRA","Urban",1415,10223,933,3.8295643188000001,0.72806536126861532,6.7306440207389322,15,3.2318163910532598E-2,3.20605469486605E-2,9.5155814745553999E-4,9.5039771069034995E-4,19,0.298767210002501,0.298767210002501,1.02814697395806E-3,1.02814697395806E-3]
[null,"COW72 Cowra Town Sth","COWRA","Short Rural",925,7937,563,2.1910442620000001,5.3146165489790649,4.108300459629552,11,0.23762843859171701,0.23762843859171701,1.4900008065035499E-3,1.4900008065035499E-3,10,0.18369133774570101,0.18369133774570101,7.5892564443405205E-4,7.5892564443405205E-4]
[null,"COW82 Cowra Town West","COWRA","Short Rural",715,24437,410,3.6199861719999999,1.8925931419252211,1.0674632901378327,8,6.9403402052464494E-2,6.9403402052464494E-2,1.6687080683427599E-3,1.6687080683427599E-3,3,3.9145013400143501E-2,3.9145013400143501E-2,1.38091975057572E-4,1.38091975057572E-4]
[null,"COW92 Broula","COWRA","Long Rural",372,251818,0,1.809993086,3.558532141953858,2.3871749963830902,51,0.15278542537840401,0.15278542537840401,7.0206424293975704E-4,7.0206424293975704E-4,49,0.102493256411848,0.101291043923112,4.56051648719545E-4,4.5140990165878599E-4]
[null,"CPD2C03 Copeton Dam","INVERELL","Short Rural",39,31858,26,1.0669432974624282,0.94485790136812098,0.18208012522256312,5,1.8360430498831199E-2,1.8360430498831199E-2,8.1230573563277703E-5,8.1230573563277703E-5,2,3.5381716970633399E-3,3.5381716970633399E-3,3.9454850016449201E-5,3.9454850016449201E-5]
[null,"CPM3B10 Lighthouse Beach","PORT MACQUARIE","Short Rural",1652,5783,5978,3.0484094213212236,0.3416946935867245,1.6006142785075441,3,3.0553139590679099E-2,3.0553139590679099E-2,1.18364550049348E-4,1.18364550049348E-4,4,0.14312130799790401,0.14312130799790401,7.4500040325177605E-4,7.4500040325177605E-4]
[null,"CPM3B3 Livingstone Rd","PORT MACQUARIE","Short Rural",989,4613,2601,1.5813623873103848,0.19020939346562871,1.941688805023456,2,1.7197672860111101E-2,1.7197672860111101E-2,1.1140192945820901E-4,1.1140192945820901E-4,6,0.17555667602172101,0.17555667602172101,8.0418267827645005E-4,8.0418267827645005E-4]
[null,"CPM3B4 Major Innes","PORT MACQUARIE","Short Rural",1726,6567,13233,2.7626210380723593,0.17762528585674978,2.3684637261112687,3,1.51982403136893E-2,1.51982403136893E-2,1.9611381331705599E-4,1.9611381331705599E-4,15,0.202654034925665,0.20048169730123,1.6095257933180899E-3,1.56426875947569E-3]
[null,"CPM3B5 Shelley Beach","PORT MACQUARIE","Short Rural",2126,13317,4716,3.905774571067818,2.0931245388796054,3.1985704094389309,9,0.19141984660186401,0.19141984660186401,3.5428134441241E-3,3.5428134441241E-3,11,0.29251477671165899,0.29251477671165899,1.2451486490485299E-3,1.2451486490485299E-3]
[null,"CPM3B6 Emerald Downs","PORT MACQUARIE","Short Rural",1259,4790,9521,3.0484094213212236,2.3182584486054552,4.3531804325798236,6,0.19177377981524699,0.19177377981524699,3.0194564630235498E-3,3.0194564630235498E-3,9,0.36010905784719199,0.27710533690670502,1.61068623008328E-3,1.2938869931865E-3]
[null,"CPM3B7 Thrumster","PORT MACQUARIE","Short Rural",227,19023,9727,1.7528354172597038,0.29887280352813977,1.0765801166117093,8,1.4242040419172999E-2,5.2498159257181199E-3,3.1563880013159301E-4,9.6316251510743605E-5,4,5.1301748952270701E-2,5.1301748952270701E-2,1.86830319195539E-4,1.86830319195539E-4]
[null,"CPM3B8 Ocean Dr","PORT MACQUARIE","Short Rural",524,1344,2399,1.7147302994931886,4.2962646578640573E-2,0.59834899191183977,2,3.3629457455196998E-3,3.3629457455196998E-3,1.3693153829238199E-4,1.3693153829238199E-4,5,4.6836388279820798E-2,4.6836388279820798E-2,5.5933052082142703E-4,5.5933052082142703E-4]
[null,"CPM3B9 Lake Rd East","PORT MACQUARIE","Short Rural",180,2101,1709,0.7621023553303059,0,0.20535419203476254,0,0,0,0,0,4,1.79206249648243E-2,1.79206249648243E-2,2.0887861773414299E-4,2.0887861773414299E-4]
[null,"CRA12 Corowa Town No.1","COROWA","Short Rural",1613,26436,2181,3.4294605989863771,4.7205651984836461,0.45851946642005348,10,0.30531671510523101,0.30531671510523101,2.1839419920869798E-3,2.1839419920869798E-3,4,2.9656121971187499E-2,2.9656121971187499E-2,2.6690045599362701E-4,2.6690045599362701E-4]
[null,"CRA22 Rural","COROWA","Long Rural",615,459227,362,1.7909405350262191,1.7538470379076276,0.9710735213181082,59,7.9279879360993899E-2,7.8283064179695994E-2,5.6745357817775404E-4,5.5933052082142703E-4,31,4.3895841516830097E-2,3.8451072214560102E-2,4.96666935501184E-4,4.7926038402333902E-4]
[null,"CRA32 Corowa Town No.2","COROWA","Urban",1651,16370,2687,7.0494467868053308,0.1221933268256867,3.9822978698864806,7,4.3319104444530798E-3,4.3319104444530798E-3,8.9353630919605497E-5,8.9353630919605497E-5,11,0.14117757641621201,0.14117757641621201,6.9162031205305104E-4,6.9162031205305104E-4]
[null,"CRA42 Corurgan","COROWA","Short Rural",154,105698,496,3.5437759522859231,0.54500460267101292,0.75111900249798091,21,2.7069508421579701E-2,2.7026572261267701E-2,2.6109827216767802E-4,2.5993783540248901E-4,15,3.73068815640831E-2,3.5320213822078401E-2,2.5181477804616103E-4,2.41370847159454E-4]
[null,"CRA52 Howlong","COROWA","Short Rural",1487,133665,1461,5.6776625472107796,2.8045670684046731,1.1473607960924057,25,0.15611123714743799,0.155795598347306,2.0493313273249802E-3,2.0470104537946001E-3,12,6.3865797808979302E-2,6.3865797808979302E-2,2.48333467750592E-4,2.48333467750592E-4]
[null,"CRO5502 Narrawa Bevendale","CROOKWELL","Long Rural",563,232207,7,0.88900000000000001,2.9514715164901024,0.32040870491758883,47,0.17828950460374299,0.17819666966252801,8.8541325183972804E-4,8.8309237830934797E-4,10,1.93549248065987E-2,1.93549248065987E-2,1.2300629711010599E-4,1.2300629711010599E-4]
[null,"CRO5512 Woodhouselee","CROOKWELL","Long Rural",584,200241,57,0.96399999999999997,3.8065831667892587,6.2351009456051827,49,0.18972328805115701,0.18972328805115701,9.8869212394160893E-4,9.8869212394160893E-4,27,0.31076264484426702,0.31076264484426702,1.2370255916921999E-3,1.2370255916921999E-3]
[null,"CRO5522 Tuena Redground","CROOKWELL","Long Rural",668,441708,234,1.2030000000000001,5.1743303589318748,1.2905086113413924,154,0.320345531651203,0.31758485258681701,2.4067458510034002E-3,2.3162317833186098E-3,30,7.9896071283309597E-2,7.9896071283309597E-2,4.4792859136321702E-4,4.4792859136321702E-4]
[null,"CRO5532 Binda Bigga","CROOKWELL","Long Rural",518,385460,55,0.63600000000000001,3.5007481502348279,1.3023767288579167,65,0.17253954043222799,0.17253954043222799,9.1906591803022795E-4,9.1906591803022795E-4,17,6.4189559666467305E-2,6.4189559666467305E-2,2.30926916272747E-4,2.30926916272747E-4]
[null,"CRO5542 Crookwell Town and Biala","CROOKWELL","Long Rural",873,217337,462,1.8800000000000001,5.310064146521202,7.3190538984075975,32,0.27991359387846398,0.27991359387846398,1.5758731271275899E-3,1.5758731271275899E-3,22,0.38581505306967401,0.38581505306967401,1.23354428139663E-3,1.23354428139663E-3]
[null,"CSO3B1 Casino Nth","CASINO","Short Rural",1821,14326,1176,3.6399999999999997,3.4357594095483281,2.4801063208185008,19,0.28723362899328098,0.19075375589864499,5.1384139962599102E-3,3.05194869244886E-3,12,0.207339878583501,0.207339878583501,9.17905481265039E-4,9.17905481265039E-4]
[null,"CSO3B2 Kyogle Rd","CASINO","Long Rural",979,274763,835,3.51,11.488496716097853,1.6512890711190251,91,0.83948200423675501,0.79805325128271798,5.0107659520890503E-3,4.7369028755042796E-3,19,0.12066221484442299,0.104062166918385,6.8465769146191201E-4,5.4772615316953002E-4]
[null,"CSO3B3 Leeville","CASINO","Short Rural",432,192936,58,1.34,4.1080179010756588,0.81303837821907554,59,0.312567124014136,0.29761141498437199,1.87758668607691E-3,1.7812704345661599E-3,9,6.1861723515496798E-2,6.1861723515496798E-2,1.7406551477845201E-4,1.7406551477845201E-4]
[null,"CSO3B4 Casino Central No.1","CASINO","Urban",892,8191,1301,3.57,7.7358560893707899,4.16991698791331,14,0.382768906561051,0.38262037065510701,5.5341229331895897E-3,5.5329624964243996E-3,6,0.206326817287491,0.206326817287491,5.7093488847332404E-4,5.7093488847332404E-4]
[null,"CSO3B6 Casino East","CASINO","Short Rural",1448,73439,2285,3.7199999999999998,11.21465960577642,9.8285788549622666,23,0.756170767553492,0.50609084247128899,8.1300199769189108E-3,6.5065689424185502E-3,17,0.66271151135864503,0.66271151135864503,1.9123997890326001E-3,1.9123997890326001E-3]
[null,"CSO3B7 Tatham/Clovass","CASINO","Short Rural",634,122780,605,2.0099999999999998,7.7400912158876478,2.4412399075916418,55,0.36549116356414202,0.20664709783468299,3.9628915531227599E-3,3.2735921146000899E-3,10,0.115276627817178,0.107579450753675,3.3420578837462802E-4,3.1331792660121402E-4]
[null,"CSO3B8 Casino West","CASINO","Urban",187,7174,311,4.84,2.6151662388912689,1.5329969335590923,3,2.3216858361149999E-2,2.3216858361149999E-2,4.28201166354993E-4,4.28201166354993E-4,2,1.3609602382144601E-2,1.3609602382144601E-2,4.5257033842397598E-5,4.5257033842397598E-5]
[null,"CSO3B9 Casino Central No.2","CASINO","Urban",849,8119,2465,4.79,1.4755960628457447,3.6758459831512318,2,6.0577120016431799E-2,6.0577120016431799E-2,9.4691640039478104E-4,9.4691640039478104E-4,8,0.15090319694526599,0.15090319694526599,4.8738344137966598E-4,4.8738344137966598E-4]
[null,"CST5342 Bourke St/Citizen St","GOULBURN","Urban",1322,5153,2579,3.1430000000000002,3.8455850835080012E-3,0.36128377537445289,2,1.9959512361262499E-4,1.9959512361262499E-4,2.3208735303793598E-6,2.3208735303793598E-6,2,1.8751497688700099E-2,1.8751497688700099E-2,2.32087353037936E-4,2.32087353037936E-4]
[null,"CST5352 Auburn St East","GOULBURN","Urban",333,130,2068,3.867,3.7788424552934227E-2,0,2,6.3011716349799696E-4,6.3011716349799696E-4,7.1947079441760307E-5,7.1947079441760307E-5,0,0,0,0,0]
[null,"CST5362 Sth Goulburn/Collector","GOULBURN","Long Rural",2159,293526,3736,3.4,5.1494459851238172,4.0027406523254117,91,0.39352731581112499,0.39318846827568998,5.7081884479680501E-3,5.7058675744376701E-3,17,0.30589461261429601,0.30589461261429601,1.14883239753779E-3,1.14883239753779E-3]
[null,"CST5372 Tarago","GOULBURN","Short Rural",498,142960,717,0.79300000000000004,1.6094718866317144,0.70554562415415645,35,8.52781770002594E-2,7.5868195271336203E-2,1.26719694758713E-3,1.0826875019219701E-3,7,3.7383470390585601E-2,3.7383470390585601E-2,2.1235992802971199E-4,2.1235992802971199E-4]
[null,"CST5382 Deccan St/Kingsdale","GOULBURN","Short Rural",1029,53036,3510,1.796,2.3097964888754534,1.0354982096392042,27,0.18562810670680199,0.18562810670680199,2.7235450879001801E-3,2.7235450879001801E-3,11,8.3218401742047698E-2,8.3218401742047698E-2,3.48131029556905E-4,3.48131029556905E-4]
[null,"CST5392 Sloane St/Grafton St","GOULBURN","Short Rural",392,2288,1652,0.89600000000000002,4.9669002242242528E-2,0,2,1.9460524552231001E-3,1.9460524552231001E-3,1.50856779474659E-5,1.50856779474659E-5,0,0,0,0,0]
[null,"CST5402 Auburn St West","GOULBURN","Urban",224,65,1560,1.7730000000000001,0,0.94497146609612326,0,0,0,0,0,3,1.8282681235563401E-2,1.8282681235563401E-2,1.2300629711010599E-4,1.2300629711010599E-4]
[null,"CTM3B1 Coota Nth","COOTAMUNDRA","Short Rural",1648,22831,332,3.74,9.5744784491280974,10.224083461402067,14,0.53850648307009796,0.53850648307009796,4.61505701515937E-3,4.61505701515937E-3,25,0.57504283462209504,0.57504283462209504,2.4229919657160598E-3,2.4229919657160598E-3]
[null,"CTM3B2 Rural","COOTAMUNDRA","Long Rural",792,449697,0,1.53,4.8021820659369894,2.2564646130183239,73,0.27438063138204,0.27438063138204,2.5958970437293199E-3,2.5958970437293199E-3,34,0.128926845486104,0.128926845486104,6.7189288704482604E-4,6.7189288704482604E-4]
[null,"CTM3B3 Coota Sth","COOTAMUNDRA","Short Rural",1590,15654,1555,3.57,7.3512577922727891,10.935798185996202,10,0.42176422361848598,0.42176422361848598,3.87353792220316E-3,3.87353792220316E-3,27,0.62742030845569596,0.62700255122022797,2.1781398082610301E-3,2.17581893473065E-3]
[null,"CTM3B4 Conkey","COOTAMUNDRA","Short Rural",288,198396,265,1.36,4.8146659009235071,5.5247048971759414,24,8.9727291557996594E-2,8.9648381857963699E-2,8.1462660916315703E-4,8.1346617239796699E-4,15,0.102959751991455,0.10271257896046899,4.0151112075563001E-4,4.0035068399044003E-4]
[null,"CUD3B1 Chinderah","TWEED HEADS","Short Rural",1054,16361,727,2.86,2.3986965059840295,0.55452226409781813,9,0.13676675627172599,0.13676675627172599,3.6379692588696501E-3,3.6379692588696501E-3,3,3.16172601043581E-2,3.16172601043581E-2,8.9353630919605497E-5,8.9353630919605497E-5]
[null,"CUD3B3 Duranbah","TWEED HEADS","Short Rural",565,38512,355,1.1300000000000001,2.1377358487018157,3.1405368814813635,22,0.12826539652994601,0.126706929954296,2.2930230480148099E-3,2.26749343918064E-3,15,0.18843404280503101,0.18843404280503101,6.9974336940937804E-4,6.9974336940937804E-4]
[null,"CUD3B4 Kingscliff No.1","TWEED HEADS","Urban",2014,7175,2753,3.6799999999999997,4.8832534111303447,3.3282175309246318,12,0.305226201037547,0.305226201037547,5.1175261344864999E-3,5.1175261344864999E-3,9,0.208029178022024,0.208029178022024,8.3319359740619198E-4,8.3319359740619198E-4]
[null,"CUD3B5 Salt No.1","TWEED HEADS","Short Rural",484,5107,7254,1.03,2.8027530212428785E-2,6.9416713004761904E-2,5,2.4438798274894701E-3,2.4438798274894701E-3,5.4540527963915103E-4,5.4540527963915103E-4,2,6.0528381672293801E-3,6.0528381672293801E-3,4.6417470607587303E-5,4.6417470607587303E-5]
[null,"CUD3B6 Chinderah No.2","TWEED HEADS","Urban",96,5461,2197,0.63,7.8945378403988797E-2,6.5675137404835318E-3,2,4.7427050593302298E-3,4.7427050593302298E-3,2.00755560377815E-4,2.00755560377815E-4,1,3.9454850016449201E-4,3.9454850016449201E-4,2.3208735303793598E-6,2.3208735303793598E-6]
[null,"CUD3B7 Kingscliff No.2","TWEED HEADS","Short Rural",1164,9449,6453,2.0799999999999996,0.70784694883714316,1.0767867542373988,8,6.0636302291456501E-2,6.0636302291456501E-2,1.6350554021522599E-3,1.6350554021522599E-3,4,9.22407975913975E-2,9.22407975913975E-2,4.69976889901821E-4,4.69976889901821E-4]
[null,"CUD3B8 Salt No.2","TWEED HEADS","Short Rural",380,1206,13230,2.5,0.26021126335603018,0.54187551139473011,3,1.72986308586826E-2,1.72986308586826E-2,4.3284291341575098E-4,4.3284291341575098E-4,4,3.60234385017833E-2,3.60234385017833E-2,1.7870726183921099E-4,1.7870726183921099E-4]
[null,"CWD13 Cargo","CANOWINDRA","Long Rural",660,428566,0,1.98,1.8215847813191586,3.6570711847435149,83,0.102942345439977,0.102942345439977,1.1360675931207001E-3,1.1360675931207001E-3,34,0.206670306569987,0.206670306569987,7.7169044885113801E-4,7.7169044885113801E-4]
[null,"CWD23 Rivers Rd","CANOWINDRA","Short Rural",145,82854,1138,1.1399999999999999,0.87752474214182263,0.56428068533514608,23,2.9530794800546999E-2,2.9504104754947701E-2,2.23964295681609E-4,2.2280385891641899E-4,10,1.8989387225564001E-2,1.8989387225564001E-2,8.35514470936571E-5,8.35514470936571E-5]
[null,"CWD33 Eugowra","CANOWINDRA","Short Rural",113,97277,0,1.07,0.39173147540396053,0.38240838930228904,15,1.4042445295560301E-2,1.4042445295560301E-2,1.62461147126556E-4,1.62461147126556E-4,8,1.37082395071857E-2,1.37082395071857E-2,5.4540527963915001E-5,5.4540527963915001E-5]
[null,"CWD53 Canowindra No.1","CANOWINDRA","Short Rural",475,11143,325,2.95,0.65948588669274022,2.7081683449806358E-2,9,2.6110987653533001E-2,2.6110987653533001E-2,2.69221329524006E-4,2.69221329524006E-4,1,1.0722435710352699E-3,1.0722435710352699E-3,6.96262059113809E-6,6.96262059113809E-6]
[null,"CWD63 Canowindra No.2","CANOWINDRA","Short Rural",567,23732,243,0,0.51700279311329145,0,12,2.9772165647706499E-2,2.9772165647706499E-2,3.35366225139818E-4,3.35366225139818E-4,0,0,0,0,0]
[null,"DBS3B1 Rural Sth","DUBBO","Long Rural",828,454786,4585,3.0484094213212236,2.5738929602925507,2.9201783816156026,60,0.14749383372913899,0.14614656664475401,1.79751654927882E-3,1.7766286875054E-3,30,0.167337302413883,0.16724562790943301,6.1967323261128999E-4,6.1851279584609995E-4]
[null,"DBS3B2 Boundary Rd","DUBBO","Urban",1423,8720,3882,4.1915629543166828,1.5736039848391816,11.965869955567255,17,8.5953551197599704E-2,7.9228820143325496E-2,3.62056270739181E-4,2.9707181188855898E-4,34,0.653600922315141,0.586823588662301,2.2001881067996399E-3,1.94373158169272E-3]
[null,"DBS3B8 Margaret Cres","DUBBO","Short Rural",1949,14168,1768,4.3820885431492593,0.38219235457507778,10.380014062553267,14,2.7607951080627701E-2,2.7607951080627701E-2,3.2724316778349002E-4,3.2724316778349002E-4,34,0.74980809276995697,0.74980809276995697,2.3104295994926601E-3,2.3104295994926601E-3]
[null,"DBS3B9 Keswick","DUBBO","Urban",1315,2582,7977,3.2389350101538001,0.13866537074701452,0.95170404242869144,3,1.3108293699582701E-2,1.3108293699582701E-2,8.00701367980881E-5,8.00701367980881E-5,13,8.9966341531625693E-2,6.8789531003679197E-2,4.3632422371132001E-4,3.56254086913232E-4]
[null,"DBW3B2 Rural Sth/Minore Rd","DUBBO","Short Rural",1970,23998,15400,5.334716487312142,0.20176294118265803,1.0110646085060855,9,1.8003015975152699E-2,1.8003015975152699E-2,1.2300629711010599E-4,1.2300629711010599E-4,11,9.0215835436141506E-2,9.0215835436141506E-2,3.2028054719235202E-4,3.2028054719235202E-4]
[null,"DBW3B3 West/Nth","DUBBO","Short Rural",904,136795,1997,2.2863070659909175,1.4540669355070994,2.1961106317190122,47,0.10342044538723499,0.103399557525461,1.31245398142953E-3,1.3112935446643399E-3,30,0.15619826990482699,0.15619826990482699,6.0458755466382395E-4,6.0458755466382395E-4]
[null,"DBW3B4 West/Sth","DUBBO","Urban",1135,9854,1829,3.4294605989863771,1.6698383226364166,0.54916044463826763,11,7.8785533299023103E-2,7.8785533299023103E-2,1.4969634270946899E-3,1.4969634270946899E-3,3,2.5910232093155201E-2,2.5910232093155201E-2,8.8193194154415798E-5,8.8193194154415798E-5]
[null,"DBW3B5 Rural West","DUBBO","Short Rural",353,112006,2374,1.7147302994931886,0.44474562085455149,1.8359842024075346,28,1.7175624561572501E-2,1.5385070632884801E-2,5.0130868256194198E-4,4.9318562520561497E-4,25,7.0903846789854799E-2,6.9580948877538504E-2,2.7502351334995499E-4,2.7038176628919598E-4]
[null,"DEN12 Mathoura/Moama","DENILIQUIN","Long Rural",1063,417641,6051,3.8105117766515302,3.7210579958312646,0.69366627669385283,34,0.192899403477481,0.192899403477481,1.20801467256246E-3,1.20801467256246E-3,13,3.59596144796979E-2,3.59596144796979E-2,1.7406551477845201E-4,1.7406551477845201E-4]
[null,"DEN22 Macauley St","DENILIQUIN","Urban",1590,13483,41,6.0968188426424472,0.93254644375816576,2.1969731429184479E-2,10,4.7286637744714401E-2,4.7286637744714401E-2,4.8738344137966598E-4,4.8738344137966598E-4,1,1.11401929458209E-3,1.11401929458209E-3,4.6417470607587298E-6,4.6417470607587298E-6]
[null,"DEN32 Industrial","DENILIQUIN","Urban",386,21992,200,6.8589211979727542,0.65781519133894828,0,7,1.19327712564455E-2,1.19327712564455E-2,1.2532717064048601E-4,1.2532717064048601E-4,0,0,0,0,0]
[null,"DEN42 Crispe St","DENILIQUIN","Short Rural",1766,29672,1390,6.5921853736071467,2.085532686555406,8.3961258863939001,17,8.1753930544378295E-2,8.1753930544378295E-2,4.63014269310683E-4,4.63014269310683E-4,9,0.32913235883721897,0.32913235883721897,1.04091177837515E-3,1.04091177837515E-3]
[null,"DEN52 Caldwell","DENILIQUIN","Long Rural",544,414350,1710,1.7528354172597038,3.4608418259444238,0.11306200280503097,49,0.155795598347306,0.155638939384005,9.9913605482831601E-4,9.9797561806312597E-4,12,5.0896756521219503E-3,5.0896756521219503E-3,3.3652666190500797E-5,3.3652666190500797E-5]
[null,"DEN62 Nth Rural","DENILIQUIN","Long Rural",818,867924,1681,2.8578838324886475,7.3649147123761614,7.1268883737967013,86,0.30738925516785998,0.307321949835479,1.81840441105223E-3,1.81724397428704E-3,73,0.29745475602107102,0.26807249712646802,9.8753168717641889E-4,9.0398024008276202E-4]
[null,"DNO112 Dunedoo No.2","DUNEDOO","Long Rural",878,583617,212,1.3260580982747321,35.610949426251025,42.35118589837279,158,1.0723329246661899,1.0723329246661899,9.3136654774123896E-3,9.3136654774123896E-3,47,1.2752979566449201,0.46695395212850199,3.5729848000190302E-3,1.74413645808009E-3]
[null,"DNO122 Craboon","DUNEDOO","Long Rural",1154,484530,8,2.2672545071076602,38.200771249124969,45.809170494777909,119,1.3331677776881701,1.33316429637787,7.9118578650632498E-3,7.9106974282980597E-3,26,1.5986931161150399,0.50703659843491899,4.0267155752081998E-3,1.5538248285889801E-3]
[null,"DNO132 Dunedoo No.1","DUNEDOO","Short Rural",364,5794,0,0.86117566152324587,3.4265591976725709,11.736654728871047,3,0.169553736635395,0.169553736635395,8.1578704592834696E-4,8.1578704592834696E-4,9,0.58075566481712404,0.20703932546131701,1.5155304153377199E-3,6.3940065761951498E-4]
[null,"DNO142 Merrygoen","DUNEDOO","Long Rural",738,468711,341,1.3070055393914746,21.301679641657199,32.051318109179604,118,0.77223701456754301,0.76607045359732495,4.9399793094124797E-3,4.1415988149619797E-3,67,1.1619372099270699,0.47043178111377598,3.2074472189842799E-3,1.63273452862188E-3]
[null,"DOR3B1 Nth Dorrigo","DORRIGO","Long Rural",431,216405,441,0.57157676649772937,3.4763549270528111,1.7287044438330093,78,0.25700076994979398,0.13919787129479799,2.0063951670129601E-3,1.0826875019219701E-3,26,0.12780006138710501,0.12780006138710501,4.96666935501184E-4,4.96666935501184E-4]
[null,"DOR3B2 Peaks Rd","DORRIGO","Short Rural",133,31135,0,0.74304979644704838,0.9753124165312177,0.33743011376954452,23,6.4795307657896303E-2,1.0912747339843799E-2,4.3748466047650999E-4,4.6417470607587303E-5,5,2.2417317429934299E-2,2.2417317429934299E-2,8.35514470936571E-5,8.35514470936571E-5]
[null,"DOR3B3 Dorrigo Town","DORRIGO","Short Rural",342,4071,189,0.66683956091401775,3.9534316505125666,0,6,0.13064777320887999,3.1776239941189097E-2,1.62461147126555E-3,8.11145298867588E-4,0,0,0,0,0]
[null,"DOR3B4 Fernbrook/Deervale","DORRIGO","Short Rural",310,92366,0,0.78115491421356364,1.4549530260666201,3.0056628206642193,20,8.6590630981688899E-2,2.5071236311923099E-2,7.3339603559987904E-4,2.4021041039426399E-4,22,0.178880166917224,0.178880166917224,7.32235598834689E-4,7.32235598834689E-4]
[null,"DOR3B5 Mountain Top","DORRIGO","Short Rural",342,33534,35,0.4953665309646989,2.4016558827836127,0.29603764425680945,39,0.14488517188099301,4.70208977254859E-2,1.15463458136373E-3,3.8758587957335401E-4,2,1.78591218162692E-2,1.78591218162692E-2,8.5872320624036497E-5,8.5872320624036497E-5]
[null,"DOR3B6 Leigh/Megan","DORRIGO","Short Rural",133,67803,53,0.57157676649772937,2.8012135088246128,2.3575544824681538,35,0.18802208775338899,0.124258408379746,9.2138679156060705E-4,6.3591934732394595E-4,31,0.15824295948509101,0.154099039796599,6.0110624436825503E-4,5.8253925612521996E-4]
[null,"DPR1097 Bringagee","DARLINGTON POINT","Short Rural",31,71947,57,2.92,1.0167883013054921,0.78273308394884455,13,1.72812243072047E-2,1.72812243072047E-2,1.5433808977022799E-4,1.5433808977022799E-4,5,1.33032470761345E-2,1.33032470761345E-2,6.2663585320242801E-5,6.2663585320242801E-5]
[null,"DPT930 River","DARLINGTON POINT","Short Rural",19,35207,16,0.42,9.8602527804908802E-2,8.6205133958092789E-2,6,3.1749549895589702E-3,3.1749549895589702E-3,3.2492229425311099E-5,3.2492229425311099E-5,1,2.7757647423337201E-3,2.7757647423337201E-3,9.2834941215174595E-6,9.2834941215174595E-6]
[null,"DPT931 Waddi","DARLINGTON POINT","Short Rural",101,53080,162,2.99,0.51581429800420053,0.35242371796913902,8,1.5756410397745502E-2,1.5756410397745502E-2,1.5665896330060701E-4,1.5665896330060701E-4,4,1.0765371870664699E-2,1.0765371870664699E-2,3.7133976486069797E-5,3.7133976486069797E-5]
[null,"DPT933 Kooba","DARLINGTON POINT","Short Rural",4,15045,72,0.36,7.4862658815530187E-3,0,2,2.9010919129742E-4,2.9010919129742E-4,6.96262059113809E-6,6.96262059113809E-6,0,0,0,0,0]
[null,"DPT934 Darlington Point Town","DARLINGTON POINT","Short Rural",500,13850,594,1.22,0.39055214441489611,0.41113486590217407,5,2.2679576138867098E-2,2.2679576138867098E-2,6.2779628996761797E-4,6.2779628996761797E-4,5,2.38748260070125E-2,2.38748260070125E-2,1.4621503241390001E-4,1.4621503241390001E-4]
[null,"DTN23 Wentworth","BURONGA","Long Rural",1228,364053,722,4.1896399999999998,5.2531243862496444,0.8361637631899127,46,0.21880499382357499,0.20230126214904801,5.7592476656363901E-3,4.4595584886239501E-3,27,3.4828188633637902E-2,3.4828188633637902E-2,2.32087353037936E-4,2.32087353037936E-4]
[null,"DTN24 Mourquong","BURONGA","Short Rural",454,115384,1161,9.9561200000000003,7.8282106764963268,3.8345310206524301,33,0.143269843903849,0.13447257278694599,2.1920650494433101E-3,1.7290507801326299E-3,22,7.0178573811611203E-2,7.0178573811611203E-2,3.21440983957542E-4,3.21440983957542E-4]
[null,"DTN25 Dareton","BURONGA","Short Rural",954,81853,135,3.4268200000000002,1.9677310271580684,4.6649773139046244,40,6.7681313892923006E-2,4.6333919160493599E-2,3.2944799763735102E-3,2.2779373700673499E-3,31,0.16045475195954301,0.16045475195954301,5.0130868256194295E-4,5.0130868256194295E-4]
[null,"DUG3B1 Clarencetown","DUNGOG","Short Rural",776,122913,2634,2.3053596248741757,47.581935514860469,4.7728915292948058,70,3.1372164255182402,0.64208358742063298,6.6574257218932099E-3,5.7859377112357601E-3,31,0.31469072329443398,0.31469072329443398,1.61880928743961E-3,1.61880928743961E-3]
[null,"DUG3B4 Dungog Town 2","DUNGOG","Short Rural",16,3837,552,0.20957814771583416,0.32990359787273088,0,3,6.8929943852267103E-3,6.8929943852267103E-3,1.97274250082246E-5,1.97274250082246E-5,0,0,0,0,0]
[null,"DUG3B5 Dungog Town","DUNGOG","Short Rural",1092,67233,1247,2.4958852137067522,20.792486469903107,0.98688142071537632,24,1.01835404809662,0.386207280696309,4.9991615844371499E-3,3.7702590501012801E-3,2,4.8334512143680598E-2,4.8334512143680598E-2,2.7154220305438602E-4,2.7154220305438602E-4]
[null,"DUG3B6 Sandy Ck/Wallarobba","DUNGOG","Short Rural",622,113952,793,1.7528354172597038,31.71789379817827,4.2651122119868221,28,1.10148541708128,0.21447772512618299,2.0481708905597902E-3,1.7743078139750199E-3,11,0.148116988272046,0.148116988272046,4.3748466047650999E-4,4.3748466047650999E-4]
[null,"DUG3B7 Salisbury","DUNGOG","Short Rural",361,121531,158,0.62873444314750238,9.4462744428396661,0.56395645373269587,34,0.71313597011643204,0.17552186291876501,1.3635131990978799E-3,9.6780426216819498E-4,4,4.2575264478044203E-2,4.2575264478044203E-2,2.8778831776704101E-4,2.8778831776704101E-4]
[null,"DUN3B1 Tullera","LISMORE","Short Rural",551,53059,482,1.19,6.296634630946234,3.7771192278659167,18,0.50547000880191295,0.23826319750227601,2.6295497099198201E-3,2.0052347302477701E-3,12,0.30321284324994202,0.30321284324994202,8.1346617239796699E-4,8.1346617239796699E-4]
[null,"DUN3B2 Bullfrog Ck","LISMORE","Short Rural",467,54372,1934,1.4,5.2616581865502372,3.5216684783999499,25,0.355167918101015,0.129598738373149,1.0850083754523499E-3,5.5700964729104695E-4,8,0.23771663178587199,0.23428173896091001,6.4636327821065303E-4,6.2779628996761797E-4]
[null,"DUN3B3 Nimbin","LISMORE","Short Rural",679,80021,323,1.0900000000000001,10.596791269310316,1.1609062265168024,40,0.52154321843655504,0.19622637568328,1.9936303625958701E-3,1.23354428139663E-3,11,5.7136425007644397E-2,5.7136425007644397E-2,2.3672910009869499E-4,2.3672910009869499E-4]
[null,"DUN3B4 Mt Nardi","LISMORE","Short Rural",678,115504,16,1.1100000000000001,6.4779460533923965,9.1558905205871763,37,0.50340211048634498,0.175700570180605,1.78359130809654E-3,1.0165426063061601E-3,21,0.71150555646134095,0.68170437989450505,1.93676896110158E-3,1.82304615811299E-3]
[null,"DUN3B5 Rosebank","LISMORE","Short Rural",845,119916,645,1.19,12.28267298734832,8.2660153521359092,52,0.89592796936911101,0.48568108064513299,6.7026827557355997E-3,5.74416198768893E-3,31,0.60294321576755106,0.60294321576755106,1.9123997890326001E-3,1.9123997890326001E-3]
[null,"EGA1208 Morundah","DARLINGTON POINT","Short Rural",58,56139,99,0.76,1.6154014011106177,0.61687953931721184,15,7.2022507831497606E-2,7.2022507831497606E-2,3.1215748983602501E-4,3.1215748983602501E-4,2,2.7503511771760698E-2,2.7503511771760698E-2,9.0514067684795195E-5,9.0514067684795195E-5]
[null,"EGA1211 Horticultural","DARLINGTON POINT","Short Rural",51,26323,98,0.86,1.0184027963061704,1.1757664523343492,6,2.4504943170510499E-2,2.4504943170510499E-2,2.13520364794902E-4,2.13520364794902E-4,2,2.82914483353244E-2,2.82914483353244E-2,6.03427117898635E-5,6.03427117898635E-5]
[null,"ELI3B10 Tregeagle","LISMORE","Short Rural",461,50383,140,0.69000000000000006,0.30074425293231277,0.17516490809816673,14,2.3007979743415799E-2,2.2724833172709499E-2,8.5176058564922705E-4,8.4943971211884697E-4,5,1.3400723764410399E-2,1.19072416476113E-2,5.8021838259484103E-5,4.7577907372777001E-5]
[null,"ELI3B3 Ross St","LISMORE","Short Rural",480,3888,942,0.75,0.35110070267123017,2.5300289278556347,4,2.8893715016457901E-2,2.8893715016457901E-2,7.4616084001696598E-4,7.4616084001696598E-4,7,0.208207885283863,0.208207885283863,5.0827130315308101E-4,5.0827130315308101E-4]
[null,"ELI3B4 Lynwood","LISMORE","Short Rural",542,63917,1801,1.26,1.8910016079177179,0.10914939408888426,22,0.14133423537951201,0.138758065760791,1.88222843313766E-3,1.87062406548577E-3,5,8.1578704592834596E-3,8.1578704592834596E-3,6.4984458850622198E-5,6.4984458850622198E-5]
[null,"ELI3B5 Oliver Ave","LISMORE","Short Rural",1130,4762,7967,2.5799999999999996,3.7259813078176278,1.2776502981388722,11,0.211682232958841,0.207623025154208,4.3469961224005503E-3,4.3087017091492904E-3,5,7.2586480099379805E-2,7.2586480099379805E-2,3.75981511921457E-4,3.75981511921457E-4]
[null,"ELI3B6 Nth Lismore","LISMORE","Short Rural",860,24371,2564,1.3800000000000001,1.4317418121958343,0.32343334021212877,19,0.110479382229884,0.110479382229884,1.7545803889667999E-3,1.7545803889667999E-3,6,2.4957513508934499E-2,2.4957513508934499E-2,8.4711883858846798E-5,8.4711883858846798E-5]
[null,"ELI3B7 Sth Lismore","LISMORE","Short Rural",854,6521,1249,2.0799999999999996,1.3608528015402512,0,6,9.0508265500969201E-2,9.0508265500969201E-2,2.1572519464876198E-3,2.1572519464876198E-3,0,0,0,0,0]
[null,"ELI3B8 Bexhill","LISMORE","Short Rural",792,55960,1451,1.43,3.2868010952224345,4.8095362467437317,30,0.263288016343591,0.26138025830161998,4.3934135930081396E-3,4.3794883518258601E-3,17,0.38526616647973999,0.38526616647973999,1.1128588578169099E-3,1.1128588578169099E-3]
[null,"ELI3B9 Central Lismore","LISMORE","Short Rural",784,3693,3404,1.0900000000000001,1.9818382406234833,1.3456480391963128,6,0.17700258023114701,0.17700258023114701,2.07021918909839E-3,2.07021918909839E-3,7,0.1201829544604,0.1201829544604,4.3864509724169998E-4,4.3864509724169998E-4]
[null,"ELL8B1 Wentworth","BURONGA","Short Rural",33,29125,250,0.47249999999999998,0.12129111516683669,5.9896846995968686E-3,5,3.4778289852734801E-3,2.74675382320398E-3,1.21845860344917E-4,8.7032757389226195E-5,1,1.7174464124807299E-4,1.7174464124807299E-4,2.3208735303793598E-6,2.3208735303793598E-6]
[null,"ELL8B2 Pooncarie","BURONGA","Long Rural",367,653810,310,3.58189,9.0461556902477334,6.7606467277828958E-2,20,0.30185165092437499,0.29351739407678301,2.1189575332363599E-3,1.7220881595414899E-3,8,2.25588907152874E-3,2.25588907152874E-3,1.39252411822762E-5,1.39252411822762E-5]
[null,"EME1E08 Rocky Ck","GLEN INNES","Short Rural",60,78844,0,0.15242047106606119,1.6145640570246183E-2,0.7136796161932728,11,1.3287000961421901E-3,1.3287000961421901E-3,1.27648044170865E-5,1.27648044170865E-5,7,5.8732025559780202E-2,5.8732025559780202E-2,2.4485215745502303E-4,2.4485215745502303E-4]
[null,"EME1E09 Rosevalley","GLEN INNES","Short Rural",219,19698,469,0.36199861878189532,0.54578117769860257,0.74257486264897676,7,2.90260048076895E-2,2.48983312339098E-2,1.3228979123162401E-4,6.2663585320242801E-5,4,3.9491983992935298E-2,3.9491983992935298E-2,1.90311629491108E-4,1.90311629491108E-4]
[null,"EME1E10 Deepwater","GLEN INNES","Short Rural",334,151546,0,0.53347164873121411,1.6976286715337863,0.7844034779425143,39,8.8084113098488001E-2,8.6581347487567406E-2,5.1523392374421895E-4,5.1291305021383899E-4,11,4.06999986654977E-2,4.06999986654977E-2,1.5665896330060701E-4,1.5665896330060701E-4]
[null,"EME2E04 Torrington","GLEN INNES","Short Rural",127,77277,0,0.30484094213212237,0.65264217462230856,0.48056316678704314,18,4.3584844463759299E-2,4.0515489219832598E-2,1.8915119272591799E-4,1.6014027359617601E-4,6,3.20930391780858E-2,3.20930391780858E-2,2.0191599714300499E-4,2.0191599714300499E-4]
[null,"ESH3B1 Kiah/Nethercote","BEGA","Short Rural",356,102301,5521,0.70399999999999996,7.0026589691558492,6.9154311334328655,23,0.15632243663870199,0.106858819522492,1.47955687561684E-3,1.0838479386871601E-3,15,0.154375223746714,0.154375223746714,6.2431497967204905E-4,6.2431497967204905E-4]
[null,"ESH3B2 Wharf","BEGA","Short Rural",978,8084,830,2.0190000000000001,3.2886479186703705,4.4484973219085101E-2,6,0.143694563759908,8.2135714240125692E-3,2.1398453950097701E-3,1.05599745632261E-3,1,1.94373158169272E-3,1.94373158169272E-3,7.7749263267708703E-5,7.7749263267708703E-5]
[null,"ESH3B5 Boydtown","BEGA","Short Rural",59,10020,77,0.45700000000000002,0.30778774496453881,1.8535284089024783E-2,2,1.26023432699599E-2,4.7519885534517501E-3,6.7305332381001595E-5,3.4813102955690501E-6,4,7.5892564443405205E-4,7.5892564443405205E-4,1.27648044170865E-5,1.27648044170865E-5]
[null,"ESH3B6 Eden Town","BEGA","Short Rural",1016,33866,2511,2.476,3.1421280760714527,0.38854382265933102,14,0.159872212703417,2.1705969692873001E-2,1.38672193440167E-3,2.6341914569805798E-4,5,1.9769200731771401E-2,1.9769200731771401E-2,2.2048298538604E-4,2.2048298538604E-4]
[null,"ETH3B10 Ebsworth/Bridge","TAMWORTH","Urban",368,4304,633,3.1246196568542546,0.30738048342792884,1.046784326243737E-2,2,9.9159321585458298E-3,9.9159321585458298E-3,4.0267155752081999E-4,4.0267155752081999E-4,2,3.3768709867019699E-4,3.3768709867019699E-4,2.3208735303793598E-6,2.3208735303793598E-6]
[null,"ETH3B11 Coles/White","TAMWORTH","Urban",54,49,1944,3.0293568624379663,7.417549786733528E-2,6.9085022523498435E-2,1,1.0652809504441299E-3,1.0652809504441299E-3,6.2663585320242801E-5,6.2663585320242801E-5,1,9.9217343423717796E-4,9.9217343423717796E-4,2.2048298538604E-5,2.2048298538604E-5]
[null,"ETH3B12 Mathews/Denison","TAMWORTH","Urban",1023,6806,388,4.8298236769058143,1.098925940371289,0.26484559778347938,8,7.0270248316061198E-2,7.0270248316061198E-2,1.29504742995169E-3,1.29504742995169E-3,2,1.6935414151178201E-2,1.6935414151178201E-2,6.38240220854325E-5,6.38240220854325E-5]
[null,"ETH3B13 Armidale/Crawford","TAMWORTH","Long Rural",1102,226995,1386,4.2582469104080847,10.332831647714114,1.6281740228676442,86,0.57155456170593499,0.55583760615820599,7.1111564970823696E-3,7.0357281073450397E-3,14,9.00614973463712E-2,9.00614973463712E-2,3.3652666190500799E-4,3.3652666190500799E-4]
[null,"ETH3B14 King George Ave","TAMWORTH","Short Rural",31,34287,4893,5.3394796270329561,0.70297863256625881,8.2830112218263183E-2,10,2.30950125008051E-2,2.30950125008051E-2,2.25124732446798E-4,2.25124732446798E-4,2,2.7212242143698001E-3,2.7212242143698001E-3,1.97274250082246E-5,1.97274250082246E-5]
[null,"ETH3B2 Tamworth CBD","TAMWORTH","Short Rural",94,24,1654,2.9493361151282844,0.13667320755198992,0.47027340232942721,2,1.94257114492753E-3,1.94257114492753E-3,8.35514470936571E-5,8.35514470936571E-5,1,6.6841157674925704E-3,6.6841157674925704E-3,1.8566988243034899E-5,1.8566988243034899E-5]
[null,"ETH3B3 Carthage/Roderick","TAMWORTH","Urban",1329,6629,707,2.3482278823615053,1.4803526660176924,3.3096806768283846,7,0.11964799311164701,0.11945303973509599,3.11693315129949E-3,3.1157727145342999E-3,12,0.26750156223799498,0.26750156223799498,1.14186977694665E-3,1.14186977694665E-3]
[null,"ETH3B4 Byrnes/Murray","TAMWORTH","Urban",130,1520,501,2.8769363913719048,7.3525508322315872E-2,1.1821523134947374,1,1.48535905944279E-3,1.48535905944279E-3,7.4267952972139595E-5,7.4267952972139595E-5,1,2.3881788627603699E-2,2.3881788627603699E-2,5.6861401494294398E-5,5.6861401494294398E-5]
[null,"ETH3B5 Kable Ave","TAMWORTH","Urban",395,248,2990,4.1105895790628377,1.4848843492946948,4.0593834802273081,5,2.1674637900212901E-2,2.1674637900212901E-2,5.24517417865736E-4,5.24517417865736E-4,12,5.9254222104115503E-2,5.9254222104115503E-2,4.1659679870309599E-4,4.1659679870309599E-4]
[null,"ETH3B6 Chelmsford/Carthage","TAMWORTH","Short Rural",1598,9705,1328,4.3154045870578575,2.7298742753664778,1.9382930134541654,10,0.23486079690674,0.23486079690674,7.4395601016310504E-3,7.4395601016310504E-3,7,0.16675824446805301,0.16675824446805301,8.8541325183972696E-4,8.8541325183972696E-4]
[null,"ETH3B7 TCC/Calala","TAMWORTH","Short Rural",3,6522,206,2.4682590033260285,2.8449630126911738,0.6772660578372115,8,1.4818777491472201E-3,1.4818777491472201E-3,1.6246114712655499E-5,1.6246114712655499E-5,1,3.5277277661766298E-4,3.5277277661766298E-4,1.1604367651896799E-6,1.1604367651896799E-6]
[null,"ETH3B8 Scott/Goonoo","TAMWORTH","Short Rural",1988,8338,1305,4.5440352936569486,15.68142234337633,1.006077286344476,34,1.31319782139602,1.31319782139602,1.9464005862526501E-2,1.9464005862526501E-2,6,8.4251190463066505E-2,8.4251190463066505E-2,4.69976889901821E-4,4.69976889901821E-4]
[null,"ETH3B9 Hill/Marius","TAMWORTH","Urban",417,2179,3258,4.5440352936569486,1.0318699978199981,0,2,1.75109907867123E-2,1.75109907867123E-2,5.0478999285751198E-4,5.0478999285751198E-4,0,0,0,0,0]
[null,"EUB1180 Millwood Rd","WAGGA WAGGA","Short Rural",112,111552,1586,0.67,1.3732398833822239,1.291291864069616,20,6.5902364331887203E-2,5.2874140769102698E-2,5.2799872816130502E-4,4.0151112075563001E-4,4,6.1969644134659399E-2,6.1969644134659399E-2,1.41573285353141E-4,1.41573285353141E-4]
[null,"EUB1201 The Gap","WAGGA WAGGA","Short Rural",52,41279,469,0.53,0.73003975326075465,0.57314443635751011,5,4.5955616775041799E-2,3.9679974748896001E-2,2.0539730743857399E-4,1.4505459564871E-4,3,3.6079139466512401E-2,3.6079139466512401E-2,8.2391010328467402E-5,8.2391010328467402E-5]
[null,"EUB417 Collingullie","WAGGA WAGGA","Short Rural",172,80172,190,0.8,1.5937187553053247,3.4346960341610098,14,0.100152655456461,7.8847036447578095E-2,1.00029649159351E-3,8.0302224151126002E-4,18,0.21584355919881101,0.21437096494378599,7.5776520766886201E-4,7.5428389737329299E-4]
[null,"EUC1412 Eucumbene Cove No.2","JINDABYNE","Short Rural",49,3323,760,0.112,2.3880648262240811,0.62577186656302319,4,9.7864274155506595E-2,9.7864274155506595E-2,2.1932254862084999E-4,2.1932254862084999E-4,1,2.56444920739268E-2,2.56444920739268E-2,5.6861401494294398E-5,5.6861401494294398E-5]
[null,"EUC1412 Eucumbene Town No.3","JINDABYNE","Short Rural",77,69567,0,0.27600000000000002,1.421699086136464,0.93598186693398644,22,5.82620486698784E-2,5.82620486698784E-2,2.5877739863729903E-4,2.5877739863729903E-4,3,3.8357076836579802E-2,3.8357076836579802E-2,9.1674504449984893E-5,9.1674504449984893E-5]
[null,"EUC76 Snowy Hydro Happy Jack No.1","JINDABYNE","Short Rural",1,5,0,9.8000000000000004E-2,0,0,0,0,0,0,0,0,0,0,0,0]
[null,"EUL32 Dubbo Nth/East Town","DUBBO","Short Rural",1474,4787,7946,3.6199861878189532,1.7051251510825127,2.1554999324108879,13,0.158194221140953,0.158194221140953,1.8741053757813399E-3,1.8741053757813399E-3,9,0.19997806774513799,0.19997806774513799,7.4616084001696598E-4,7.4616084001696598E-4]
[null,"EUL42 Rural East","DUBBO","Long Rural",1479,311207,28005,4.572614131981835,5.9846733983827898,0.90400434877530378,44,0.484338455307809,0.48420964682687301,4.6022922107422804E-3,4.5999713372119003E-3,13,7.3160896298148703E-2,7.3160896298148703E-2,2.8662788100185103E-4,2.8662788100185103E-4]
[null,"EUL52 Rural Sth","DUBBO","Long Rural",599,340622,2771,1.3336791218280355,2.5255111506017243,1.9385323768574012,38,0.15878256258090401,0.141641751122287,1.7951956757484399E-3,1.4621503241390001E-3,13,0.121878352574342,0.121878352574342,3.8526500604297399E-4,3.8526500604297399E-4]
[null,"EUL62 Dubbo Sth/East Town","DUBBO","Urban",1314,1798,8301,4.9536653096469889,2.2286561763669863,0,2,0.12660481151896,0.12660481151896,1.4900008065035499E-3,1.4900008065035499E-3,0,0,0,0,0]
[null,"EUL72 Sth Dubbo","DUBBO","Short Rural",1001,9991,3575,2.667358243656071,3.0247611147789661,3.5553489618058638,5,0.18303453053660301,0.17611020435871699,2.3301570245008799E-3,2.2709747494762101E-3,9,0.21514149495587101,0.21514149495587101,8.2971228711062296E-4,8.2971228711062296E-4]
[null,"EUL82 Hawthorn St","DUBBO","Short Rural",105,2473,4010,1.3336791218280355,0.23119293074295769,0.10209229672030523,1,6.8639834660969698E-3,6.8639834660969698E-3,7.5428389737329307E-5,7.5428389737329307E-5,2,3.0310608306754498E-3,3.0310608306754498E-3,1.04439308867071E-5,1.04439308867071E-5]
[null,"EWE3B1 Brunswick No.1","EWINGSDALE","Short Rural",1068,23563,4559,1.8,6.3884116981016126,0.43973611529274603,11,0.32044881052330498,0.31868958838727701,2.78620867322043E-3,2.7815669261596699E-3,6,2.2057582032725499E-2,2.2057582032725499E-2,1.8102813536959001E-4,1.8102813536959001E-4]
[null,"EWE3B10 Suffolk Park","EWINGSDALE","Short Rural",94,7871,3363,0.2,0,0.11421238694382732,0,0,0,0,0,2,8.9701761949162392E-3,8.9701761949162392E-3,4.6417470607587303E-5,4.6417470607587303E-5]
[null,"EWE3B11 Byron No.3","EWINGSDALE","Short Rural",699,4738,4732,1.8,0.8637346549828413,2.6071964360801823,6,2.8391245897130799E-2,2.8391245897130799E-2,1.9959512361262499E-4,1.9959512361262499E-4,5,8.56994155460232E-2,8.56994155460232E-2,3.96869373694871E-4,3.96869373694871E-4]
[null,"EWE3B2 Byron Sth","EWINGSDALE","Short Rural",253,9183,518,1.57,1.3020451919364486,0.21311410129271441,3,4.0553783633083797E-2,4.0553783633083797E-2,2.8894875453223099E-4,2.8894875453223099E-4,1,6.6376982968849802E-3,6.6376982968849802E-3,6.03427117898635E-5,6.03427117898635E-5]
[null,"EWE3B3 Northern","EWINGSDALE","Short Rural",165,38887,761,0.29000000000000004,1.2829774599275614,0.80370012656372736,17,9.70368827419264E-2,9.70368827419264E-2,5.8137881936003101E-4,5.8137881936003101E-4,9,6.0787159070931102E-2,6.0787159070931102E-2,2.2048298538604E-4,2.2048298538604E-4]
[null,"EWE3B4 Byron No.2","EWINGSDALE","Urban",962,7375,3576,3.09,0.86164901713391762,0.53881362605851868,3,1.9874800477403701E-2,1.9874800477403701E-2,1.93792939786677E-4,1.93792939786677E-4,3,1.24282777551815E-2,1.24282777551815E-2,5.9182275024673801E-5,5.9182275024673801E-5]
[null,"EWE3B5 Bangalow","EWINGSDALE","Short Rural",261,14525,4135,0.67,0.22790082342853274,1.9571680842308279,10,1.6063926140520799E-2,1.5893341936037898E-2,3.7017932809550898E-4,3.6669801779994001E-4,11,0.13795388308251499,0.13795388308251499,5.4424484287396099E-4,5.4424484287396099E-4]
[null,"EWE3B6 Byron No.1","EWINGSDALE","Urban",453,7656,611,2.2199999999999998,2.5182381714257267,0.90434018800490035,4,6.2921202282114994E-2,6.2921202282114994E-2,1.62461147126555E-4,1.62461147126555E-4,2,2.2596024691773499E-2,2.2596024691773499E-2,1.6710289418731401E-4,1.6710289418731401E-4]
[null,"EWE3B7 Brunswick No.2","EWINGSDALE","Short Rural",2113,21455,19204,3.4,9.6448550300294276,1.2013061820309092,23,0.72835393785513003,0.72835393785513003,7.2829011383304396E-3,7.2829011383304396E-3,15,9.0719464992233795E-2,8.10646311058556E-2,1.3170957284902899E-3,1.1964103049105601E-3]
[null,"EWE3B8 Federal","EWINGSDALE","Short Rural",861,104926,1833,1.51,11.181200636430603,2.7372654532988578,60,0.84980641013664704,0.844936057033146,8.4503005241112691E-3,8.4340544093986104E-3,26,0.20804078238967599,0.20408833476744001,8.5176058564922705E-4,8.3667490770176101E-4]
[null,"EWE3B9 Lavertys Gap","EWINGSDALE","Short Rural",304,38414,916,0.57999999999999996,2.8344605141265844,1.449428497491315,21,0.23000204817089101,0.21985983084313299,8.8773412537010703E-4,8.7612975771821002E-4,10,0.11761374746227,0.10668243313418301,6.1967323261128999E-4,5.5004702669990901E-4]
[null,"FBS102 Rural East No.2","FORBES","Short Rural",111,73239,106,0.66683955800000005,0.54103900656285364,0.88755603803632643,23,1.6638342339289701E-2,1.6638342339289701E-2,1.5781940006579699E-4,1.5781940006579699E-4,6,2.7294633154026499E-2,1.9525509011081601E-2,1.34610664762003E-4,5.9182275024673801E-5]
[null,"FBS32 Abattoir","FORBES","Short Rural",4,1850,105,0,3.054396479673648E-3,2.9346162255687886E-3,1,1.18364550049348E-4,1.18364550049348E-4,1.1604367651896799E-6,1.1604367651896799E-6,1,1.13722802988589E-4,1.13722802988589E-4,1.1604367651896799E-6,1.1604367651896799E-6]
[null,"FBS42 Rural Sth","FORBES","Long Rural",366,292129,84,1.1431535279999998,0.74834979160289616,1.1656362596781764,48,4.0377397244775001E-2,4.0377397244775001E-2,3.0171355894931701E-4,3.0171355894931701E-4,21,6.2892191362985198E-2,6.2892191362985198E-2,2.25124732446798E-4,2.25124732446798E-4]
[null,"FBS52 Forbes Town No.3","FORBES","Short Rural",1639,15591,1101,3.9057745539999997,0.69804674473795258,0.55515056667744234,7,4.10585736259413E-2,4.10585736259413E-2,2.9126962806260998E-4,2.9126962806260998E-4,4,3.2653530135672501E-2,6.1955718893477096E-3,1.14883239753779E-4,2.2048298538604E-5]
[null,"FBS62 Rural West","FORBES","Short Rural",248,133637,238,1.1050484104,0.57339768234514354,0.45469271386596688,40,1.6166044575857502E-2,1.6166044575857502E-2,1.48535905944279E-4,1.48535905944279E-4,5,1.2819344945050401E-2,1.2819344945050401E-2,5.5700964729104699E-5,5.5700964729104699E-5]
[null,"FBS72 Forbes Town No.2","FORBES","Short Rural",1097,65957,794,2.7054633495999996,2.7304375037243069,8.5191793107556162,20,0.11650901166180901,0.11650901166180901,1.37859887704534E-3,1.37859887704534E-3,12,0.36351726062655498,0.36351726062655498,8.5640233270998503E-4,8.5640233270998503E-4]
[null,"FBS82 Forbes Town No.1","FORBES","Short Rural",1030,19911,305,2.5149377615999997,0.67121806659420968,1.800441515470725,16,3.6824139869764197E-2,3.6824139869764197E-2,1.76386388308832E-4,1.76386388308832E-4,13,9.8775217016180597E-2,8.9166800600410004E-2,4.1195505164233698E-4,3.7017932809550898E-4]
[null,"FBS92 Rural East No.1","FORBES","Short Rural",329,126981,655,1.524204704,3.3181147622288014,3.5702006749984143,49,9.7863113718741498E-2,9.7728503053979496E-2,9.9565474453274698E-4,9.9449430776755803E-4,29,0.105298032073312,0.104304698202309,3.8062325898221601E-4,3.7133976486069799E-4]
[null,"FFD3381 Nabiac","FORSTER","Long Rural",1141,244029,1007,2.6292531258895555,25.038410741617891,15.958796012910899,88,1.49940382561188,1.49940382561188,6.2443102334856799E-3,6.2443102334856799E-3,27,0.95567885840872802,0.95567885840872802,3.07631786451785E-3,3.07631786451785E-3]
[null,"FFD3382 Tuncurry Rd","FORSTER","Short Rural",321,45338,3746,2.1338865949248564,1.6578365587530615,1.7915923713474955,15,0.11717858367532399,0.115897461486554,9.3531203274288403E-4,9.1674504449984896E-4,12,0.126632662001324,0.126632662001324,3.3304535160943901E-4,3.3304535160943901E-4]
[null,"FFD3383 Hallidays Pt","FORSTER","Short Rural",29,14677,3169,1.3527316807112932,5.8550505452126551E-3,0.14113937579206851,1,5.8253925612521996E-4,5.8253925612521996E-4,2.3208735303793598E-6,2.3208735303793598E-6,5,1.4042445295560301E-2,1.4042445295560301E-2,7.8909700032898402E-5,7.8909700032898402E-5]
[null,"FHL3B1 Elizabeth Ave Sth","WAGGA WAGGA","Short Rural",13,818,141,1.67,0,0,0,0,0,0,0,0,0,0,0,0]
[null,"FHL3B2 Ladysmith","WAGGA WAGGA","Short Rural",608,64730,1676,1.6,0.3720933330455653,1.1062479402506242,11,2.4275176691003E-2,2.4275176691003E-2,1.48535905944279E-4,1.48535905944279E-4,8,7.2171043737441903E-2,6.9852491080592896E-2,3.1099705307083498E-4,2.7966526041071303E-4]
[null,"FHL3B5 RAAF","WAGGA WAGGA","Urban",296,1497,890,3.08,0,0,0,0,0,0,0,0,0,0,0,0]
[null,"FHL3B6 Gregadoo","WAGGA WAGGA","Short Rural",227,20241,2040,0.85,0.56462392696866315,0.4090057105225009,6,2.58011510372274E-2,2.58011510372274E-2,3.3652666190500799E-4,3.3652666190500799E-4,1,1.8689994540145E-2,1.8689994540145E-2,4.8738344137966598E-5,4.8738344137966598E-5]
[null,"FIN22 Rural Nth","BERRIGAN","Long Rural",515,336499,449,5.410926722845173,1.6212084623024463,0.97150694944896254,53,5.6526035269154597E-2,5.5922608151255999E-2,4.3748466047650999E-4,4.3516378694613003E-4,20,3.3873149175886803E-2,3.3873149175886803E-2,1.6362158389174501E-4,1.6362158389174501E-4]
[null,"FIN32 Finley Town","BERRIGAN","Urban",867,7444,0,2.3625173015239485,0.26358845646861845,3.515278480764398,4,1.14511899988918E-2,1.14511899988918E-2,6.1503148555053103E-5,6.1503148555053103E-5,7,0.15271579917249301,0.15271579917249301,5.5468877376066796E-4,5.5468877376066796E-4]
[null,"FIN42 Berrigan","BERRIGAN","Long Rural",1295,426891,6637,4.3439834253827438,3.8849448751307927,3.2349684616762091,85,0.182583120634945,0.182583120634945,1.07456444456565E-3,1.07456444456565E-3,39,0.152035783228091,0.152035783228091,5.5468877376066796E-4,5.5468877376066796E-4]
[null,"FIN52 Tocumwal","BERRIGAN","Long Rural",1705,316385,6463,6.0968188426424472,8.8460655000090878,1.7142026645037092,82,0.42706741963540201,0.42212047770539901,5.9367944907104103E-3,5.9031418245199096E-3,9,8.2757708346267403E-2,8.2757708346267403E-2,4.3400335018094102E-4,4.3400335018094102E-4]
[null,"FOR17253 Townsend St/Tuncurry","FORSTER","Urban",1077,3181,687,2.3815698604072062,2.8898567842879701,0.8967109778182909,3,0.122907659985065,0.122907659985065,2.3835371156996099E-3,2.3835371156996099E-3,3,3.8137754287958903E-2,3.8137754287958903E-2,1.7870726183921099E-4,1.7870726183921099E-4]
[null,"FOR17254 Water St","FORSTER","Urban",314,763,2176,2.2100968304578874,0.56246793464561295,0,2,1.8072642181064101E-2,1.8072642181064101E-2,4.56051648719545E-4,4.56051648719545E-4,0,0,0,0,0]
[null,"FOR17255 Strand St/RSL","FORSTER","Urban",784,4891,749,1.5813623873103848,0.28178693170400942,0.9701892813427957,5,2.36520221480961E-2,2.36520221480961E-2,2.9591137512336899E-4,2.9591137512336899E-4,6,8.14336499971859E-2,7.5842665662502098E-2,6.8697856499229197E-4,6.0226668113344496E-4]
[null,"FOR17256 Sunset Ave/Kularoo Dr","FORSTER","Short Rural",502,3495,1460,1.8099930939094766,1.1206227298624227,1.3320299284332635,4,3.4766685485082903E-2,3.4766685485082903E-2,2.21643422151229E-4,2.21643422151229E-4,1,4.1325474081935001E-2,4.1325474081935001E-2,1.34610664762003E-4,1.34610664762003E-4]
[null,"FOR17259 Strand St/Tuncurry","FORSTER","Urban",768,2623,1617,1.2193637685284895,0.25018795085169104,0.7213712192912527,3,1.5574221825610701E-2,1.5574221825610701E-2,1.31129354466434E-4,1.31129354466434E-4,6,4.4905421502545097E-2,4.4870608399589403E-2,4.2471985605942397E-4,4.2355941929423399E-4]
[null,"FOR17260 Pioneer Pk","FORSTER","Urban",1074,1068,3954,4.7440871619311551,0.47935321357657523,0.78797981390809924,3,4.741312535212E-2,4.741312535212E-2,3.1099705307083498E-4,3.1099705307083498E-4,3,7.7939574897199798E-2,5.2228937927657197E-2,4.03831994286009E-4,2.69221329524006E-4]
[null,"FOR17261 South St/Forster Keys","FORSTER","Short Rural",2379,11869,5541,3.6390387467022109,4.0060880862250778,6.2812561548954839,12,0.32090370173525901,0.32090370173525901,8.2008066195954805E-3,8.2008066195954805E-3,9,0.50315377701859398,0.50315377701859398,1.7348529639585699E-3,1.7348529639585699E-3]
[null,"FOR17262 Wells St","FORSTER","Short Rural",2042,26657,4180,3.1627247746207696,9.0630492379068599,13.670118980410537,11,0.78691886052072302,0.78691886052072302,5.2254467536491404E-3,5.2254467536491404E-3,27,1.1869376595963199,1.18690284649336,3.48827291616018E-3,3.48711247939499E-3]
[null,"GAN4951 West Ganmurra","WAGGA WAGGA","Short Rural",74,97426,25,0.28699999999999998,0.6922869535316335,0.9402162810452559,23,4.8574722554074898E-2,4.7495516362448503E-2,3.2724316778349002E-4,3.2028054719235202E-4,9,6.5970830101033398E-2,6.5970830101033398E-2,1.7754682507402101E-4,1.7754682507402101E-4]
[null,"GAN4952 East Ganmurra","WAGGA WAGGA","Short Rural",115,90800,58,0.34,0.84868879534714226,1.0996089198919743,10,4.73388573991479E-2,4.70638338857979E-2,3.8410456927778498E-4,3.82944132512595E-4,5,6.1334885224100598E-2,6.1334885224100598E-2,1.2880848093605501E-4,1.2880848093605501E-4]
[null,"GBN5702 Kingsdale","GOULBURN","Short Rural",278,66288,3212,1.2770000000000001,0.32705697102265918,0.11858331187138188,20,2.6586766727260801E-2,2.6524103141940598E-2,3.7366063839107801E-4,3.7250020162588802E-4,1,9.6397482084306894E-3,9.6397482084306894E-3,4.5257033842397598E-5,4.5257033842397598E-5]
[null,"GBN5712 Fitzroy St","GOULBURN","Short Rural",322,96,2667,0.92,7.9099294131816919E-2,0.43328050848097954,1,7.5381972266721697E-3,7.5381972266721697E-3,2.69221329524006E-4,2.69221329524006E-4,7,4.1291821415744501E-2,4.1291821415744501E-2,2.41370847159454E-4,2.41370847159454E-4]
[null,"GBN5722 Bradford Dr","GOULBURN","Short Rural",580,3400,395,0.93300000000000005,0.27471806418175893,0,4,2.59287990813983E-2,2.59287990813983E-2,2.1003905449933199E-4,2.1003905449933199E-4,0,0,0,0,0]
[null,"GBN5732 McDermott Dr","GOULBURN","Short Rural",592,1414,2871,0.86099999999999999,2.0741448273447829E-3,0,1,1.65942457422125E-4,1.65942457422125E-4,1.1604367651896799E-6,1.1604367651896799E-6,0,0,0,0,0]
[null,"GBN5742 Marys Mt Rd","GOULBURN","Short Rural",179,128,2351,0.22500000000000001,3.6808590358432897E-2,0,2,3.4186467102487999E-3,3.4186467102487999E-3,2.00755560377815E-4,2.00755560377815E-4,0,0,0,0,0]
[null,"GBN5752 Gibson St","GOULBURN","Short Rural",1227,3129,5179,1.9430000000000001,3.9064940767725067E-3,0.26710807291496569,2,3.6785845456512901E-4,1.1140192945820901E-4,2.3208735303793598E-6,1.1604367651896799E-6,1,2.5152466885486401E-2,2.5152466885486401E-2,9.8637125041123002E-5,9.8637125041123002E-5]
[null,"GBN6212 Towrang","GOULBURN","Short Rural",463,160246,1314,1.0660000000000001,1.8426047848045517,4.6745898111862294,54,9.5921703010579104E-2,9.5830028506129095E-2,9.0049892978719299E-4,8.9933849302200404E-4,20,0.243348231407337,0.243348231407337,8.3899578123214E-4,8.3899578123214E-4]
[null,"GBN6222 Taralga","GOULBURN","Long Rural",860,483850,35,1.3180000000000001,5.6024388027965761,8.8135116121394397,142,0.31952510285821401,0.31952510285821401,2.3104295994926601E-3,2.3104295994926601E-3,75,0.50266291226691895,0.49671451340855699,1.8056396066351401E-3,1.7801099978009701E-3]
[null,"GDG3B2 Tumblong","GUNDAGAI","Short Rural",238,145454,0,0.36099999999999999,1.1768158288833288,0.99740089849990343,37,4.8226591524517998E-2,4.7887743989082597E-2,7.1482904735684397E-4,7.1250817382646498E-4,12,4.0874064180276198E-2,4.0874064180276198E-2,2.6457958246324802E-4,2.6457958246324802E-4]
[null,"GDG3B3 Town East","GUNDAGAI","Short Rural",108,30481,0,1.9790000000000001,0.86043277693036024,0.57836962643331136,10,3.5261031547053699E-2,3.5261031547053699E-2,3.8642544280816402E-4,3.8642544280816402E-4,4,2.3701920928999299E-2,2.3300409808243602E-2,8.2391010328467402E-5,8.00701367980881E-5]
[null,"GDG3B6 Town Sth","GUNDAGAI","Short Rural",193,5299,140,0,0.21905838091006591,1.4312984645139857,3,8.9771388155073795E-3,8.9771388155073795E-3,2.1932254862084999E-4,2.1932254862084999E-4,9,5.8655436733277701E-2,4.0269476625612401E-2,2.25124732446798E-4,1.4621503241390001E-4]
[null,"GDG3B7 Town West","GUNDAGAI","Short Rural",901,13343,254,3.387,2.4385819088951721,1.026991902643003,6,9.9934493344604997E-2,9.9934493344604997E-2,2.1294014641230698E-3,2.1294014641230698E-3,2,4.2086720599899402E-2,4.2086720599899402E-2,1.5781940006579699E-4,1.5781940006579699E-4]
[null,"GDG8B1 Brungle","GUNDAGAI","Short Rural",239,108830,0,0.25,1.7070186629267714,3.4304610410717227,27,6.9954609515929606E-2,6.9954609515929606E-2,7.35716909130259E-4,7.35716909130259E-4,35,0.140582272355669,0.14035946849675299,5.7209532523851299E-4,5.6861401494294396E-4]
[null,"GDG8B8 Burra/ Coolac","GUNDAGAI","Long Rural",411,247847,20,1.5,2.3353673537740276,5.0132258033478516,65,9.5704701335488696E-2,9.5470293108920301E-2,1.17436200637196E-3,1.17320156960677E-3,31,0.20544488534594599,0.20544488534594599,6.6260939292330802E-4,6.6260939292330802E-4]
[null,"GDH6101 M61 Kelvin","GUNNEDAH","Long Rural",209,245674,135,0.89547026751310954,4.3521647398871641,2.9758132129006083,89,0.24641990752479401,0.24552172946853701,1.8613405713642499E-3,1.85785926106868E-3,11,0.16849077655848099,0.16849077655848099,4.9898780903156299E-4,4.9898780903156299E-4]
[null,"GDH6201 M62 Carroll","GUNNEDAH","Short Rural",259,140267,222,1.2384163274117472,3.1467921071265046,4.5084269399735462,47,0.155982428666501,9.5240526629412806E-2,7.4732127678215504E-4,6.8001594440115403E-4,38,0.223476912240229,0.223476912240229,5.9994580760306597E-4,5.9994580760306597E-4]
[null,"GDH6301 M63 Curlewis","GUNNEDAH","Short Rural",371,114699,0,1.3336791218280355,2.2244469235298077,2.9514844346393456,39,0.14957449684912399,0.13601711412141301,1.4482250829567201E-3,1.4238559108877399E-3,6,0.198461376893035,0.198461376893035,4.28201166354993E-4,4.28201166354993E-4]
[null,"GDH6501 M65 Wandobah","GUNNEDAH","Short Rural",286,144664,1520,1.1050484152289437,1.1260830205892725,3.21963460880922,70,9.5220799204404502E-2,9.3403555230117494E-2,5.3148003845687405E-4,5.2915916492649495E-4,25,0.27225006948115099,0.27225006948115099,7.3339603559987904E-4,7.3339603559987904E-4]
[null,"GDH6601 M66 Mullaley/Tambar Springs","GUNNEDAH","Short Rural",49,55479,0,0.83831259086333665,7.194572293813857E-2,2.0053031344734358E-2,9,4.7670742313992102E-3,4.7670742313992102E-3,7.0786642676570595E-5,7.0786642676570595E-5,2,1.3287000961421901E-3,1.3287000961421901E-3,5.8021838259484103E-6,5.8021838259484103E-6]
[null,"GDH6801 M68 Quia","GUNNEDAH","Short Rural",109,109945,0,0.36199861878189532,1.9087294205748109,1.0071091174931857,60,0.11932655212769,0.113347981913433,6.5680720909736001E-4,5.8950187671635802E-4,13,6.2960657132131406E-2,6.2960657132131406E-2,3.1563880013159399E-4,3.1563880013159399E-4]
[null,"GDH6901 M69 Emerald Hill","GUNNEDAH","Short Rural",125,103627,0,0.55252420761447185,1.2689459068923052,2.1121953607365977,21,5.8586970964131499E-2,5.8586970964131499E-2,3.3072447807905899E-4,3.3072447807905899E-4,11,9.7519624436245303E-2,9.7519624436245303E-2,2.5877739863729903E-4,2.5877739863729903E-4]
[null,"GDH8B1 M70 Industrial/CBD","GUNNEDAH","Short Rural",965,20039,318,6.8589211979727542,26.263627166553874,21.65802256166873,24,0.88424121070688599,0.73087672738265197,1.07189544000571E-2,9.6826843687427104E-3,21,0.72918016883194503,0.72918016883194503,1.88222843313766E-3,1.88222843313766E-3]
[null,"GDH8B15 Sth Gunnedah","GUNNEDAH","Short Rural",101,375,2411,0.34294605989863763,0.1610876856618409,9.6699579764418578E-2,6,1.35318531188769E-2,1.35318531188769E-2,2.34408226568316E-4,2.34408226568316E-4,3,8.1230573563277706E-3,8.1230573563277706E-3,2.9010919129742099E-5,2.9010919129742099E-5]
[null,"GDH8B2 M73 Pullaming","GUNNEDAH","Long Rural",324,296976,296,2.5149377725900095,15.725677309323441,6.59503267237094,57,0.65623163246182603,0.445012413772296,2.4705698730888301E-3,2.1607332567831899E-3,22,0.27521034366914998,0.27521034366914998,5.7325576200370303E-4,5.7325576200370303E-4]
[null,"GDH8B3 M71 Abattoir/Coal Loader","GUNNEDAH","Urban",33,10187,810,3.6199861878189532,1.1631995923401026,6.862836909266476,6,3.3176887116773001E-3,1.9669403169965101E-3,4.9898780903156303E-5,4.8738344137966699E-5,5,1.95742473552196E-2,1.95742473552196E-2,5.3380091198725398E-5,5.3380091198725398E-5]
[null,"GDH8B6 M72 Preston Colliery","GUNNEDAH","Short Rural",38,11558,286,0.30484094213212237,0.26707989025395279,0.59183640865680798,6,2.2972006203694901E-2,2.2972006203694901E-2,1.7174464124807299E-4,1.7174464124807299E-4,4,5.0904879578575798E-2,5.0904879578575798E-2,1.2880848093605501E-4,1.2880848093605501E-4]
[null,"GDH8B7 M74 Blackjack Colliery","GUNNEDAH","Short Rural",239,182315,0,0.19052558883257648,3.9559482978642952,0.77830540207366361,68,0.20985918680072799,0.186536728693946,1.08732924898273E-3,1.0652809504441299E-3,13,4.1288340105448899E-2,4.1288340105448899E-2,1.2880848093605501E-4,1.2880848093605501E-4]
[null,"GDH8B8 M75 East Gunnedah","GUNNEDAH","Short Rural",2090,36205,2059,5.5252420761447185,16.11171879085331,3.3257493529883737,35,1.0961346431569901,1.05797019882343,1.4616861494329199E-2,1.45193848060533E-2,10,0.22626196047668401,0.22626196047668401,7.04385116470137E-4,7.04385116470137E-4]
[null,"GDH8B9 M60 Gunnedah CBD","GUNNEDAH","Urban",1268,11908,263,7.0494467868053308,7.5111545665569546,8.0945526012510296,12,0.43521484616379902,0.23966964686168599,5.3229234419250697E-3,3.8955862207417599E-3,19,0.46901836913377398,0.46901836913377398,1.14070934018146E-3,1.14070934018146E-3]
[null,"GDI4B1 Waggamba East","GOONDIWINDI","Long Rural",1349,1041908,206,5.2013485751293382,25.65582146539651,4.6566730155896598,168,1.13534580145275,1.1332871866312999,1.02710258086939E-2,1.02408544527989E-2,35,0.20607152119914901,0.197152404221901,6.5541468497913296E-3,5.0676273535833396E-3]
[null,"GDI4B2 Waggamba Nth","GOONDIWINDI","Long Rural",257,679608,0,1.9433610060922804,3.05903697764708,3.6665501703350252,48,0.106638336537106,9.4266920183418604E-2,4.8738344137966598E-4,4.5373077518916498E-4,30,0.12781630750181799,0.12607565235403301,7.6008608119924198E-4,4.69976889901821E-4]
[null,"GDI4B3 Toobeah Rd","GOONDIWINDI","Short Rural",25,65249,0,0.29773953382108997,1.4256007569018172E-3,0.49247781619085568,1,6.1503148555053198E-5,0,0,0,3,2.1246436733857899E-2,2.10723712190794E-2,8.7032757389226195E-5,5.8021838259484103E-5]
[null,"GDI4B4 Goodar Rd","GOONDIWINDI","Short Rural",25,42774,0,0.20510945663230645,4.366434159324006E-3,4.8230547250049573E-3,2,1.7754682507402101E-4,1.7754682507402101E-4,3.4813102955690501E-6,3.4813102955690501E-6,2,1.9611381331705599E-4,2.2048298538604E-5,3.0171355894931699E-5,1.1604367651896799E-6]
[null,"GDI8B1 Boobera/Tulloona","GOONDIWINDI","Long Rural",120,291437,46,1.6004149461936428,3.1108540266267908,0.59607832035871466,47,0.12839072370058599,6.17317545977955E-2,7.5312346060810295E-4,5.1523392374421895E-4,13,2.46012594220213E-2,2.2412675682873501E-2,3.6437714426955999E-4,9.1674504449984893E-5]
[null,"GDI8B2 Boggabilla","GOONDIWINDI","Long Rural",630,296907,353,3.9629322477175912,8.159821603207936,6.5094145950336815,54,0.38137290113252797,0.35484763755382298,3.0739969909874699E-3,3.0136542791976001E-3,28,0.30423634847684,0.293307355022283,2.2083111641559598E-3,8.5408145917960604E-4]
[null,"GDI8B3 Talwood","GOONDIWINDI","Long Rural",511,765713,427,2.7969156440622234,10.492412560179277,1.7985051643080581,76,0.38885887870476699,0.34933440248240599,2.25588907152874E-3,2.1398453950097701E-3,22,6.6654327355730097E-2,5.78930297785481E-2,1.3507483946807899E-3,2.5645652510691998E-4]
[null,"GDI8B4 Goondiwindi Town Nth","GOONDIWINDI","Short Rural",1915,27622,599,6.4397649025410848,22.045677553741186,1.4224540655269389,19,1.1596627538672999,1.1596627538672999,9.92173434237178E-3,9.92173434237178E-3,10,7.4824962619430696E-2,4.3068450103249903E-2,4.3957344665385197E-3,1.6362158389174501E-4]
[null,"GDI8B5 Macintyre Gin","GOONDIWINDI","Short Rural",134,16785,1025,5.4871369583782021,2.0520601482180179,1.0624702281499854,7,4.9664372676587999E-2,4.9664372676587999E-2,4.3284291341575098E-4,4.3284291341575098E-4,5,2.5714118279838199E-2,2.3625332102496701E-2,3.8410456927778498E-4,1.05599745632261E-4]
[null,"GDI8B6 Goondiwindi Town Sth","GOONDIWINDI","Urban",662,7304,471,4.4964038964488058,2.2735299455777671,1.0319427089080069,17,9.7882841143749705E-2,9.6513525760825905E-2,9.4227465333402197E-4,9.1906591803022795E-4,6,4.4428481992052203E-2,1.4304704004493201E-2,1.61764885067442E-3,4.8738344137966598E-5]
[null,"GDL3B1 Oxley Hwy","TAMWORTH","Short Rural",912,13466,5117,2.8407365294937152,1.2658515379553772,2.0568916274585809,5,9.40650041862756E-2,9.40650041862756E-2,6.3824022085432505E-4,6.3824022085432505E-4,10,0.152846928526959,0.152846928526959,8.9353630919605505E-4,8.9353630919605505E-4]
[null,"GDL3B2 Phoenix St","TAMWORTH","Short Rural",6,64,1249,0.52585062517791115,0,1.1870587708166208E-3,0,0,0,0,0,1,1.6246114712655499E-5,1.6246114712655499E-5,1.1604367651896799E-6,1.1604367651896799E-6]
[null,"GDL3B5 Industrial","TAMWORTH","Short Rural",75,22434,2642,3.6942911674636583,0.17977213390454946,0.15304084835382575,5,3.6913493500683801E-3,3.6913493500683801E-3,9.0514067684795195E-5,9.0514067684795195E-5,10,3.14246276013366E-3,3.0937244159956901E-3,4.8738344137966598E-5,4.6417470607587303E-5]
[null,"GDL3B6 Cargill","TAMWORTH","Urban",4,919,663,2.9550518827932608,0,3.8417973143636166,0,0,0,0,0,1,1.6025631727269499E-3,1.6025631727269499E-3,1.1604367651896799E-6,1.1604367651896799E-6]
[null,"GDL3B8 Rural","TAMWORTH","Short Rural",155,78949,175,3.3989765047731644,1.424504526009915,3.8706342736216368,25,7.06961286088858E-2,5.6902016781076099E-2,5.1987567080497802E-4,3.8874631633854399E-4,37,0.19209406036243901,0.19209406036243901,7.3455647236506897E-4,7.3455647236506897E-4]
[null,"GDL3B9 TRC Effluent Treatment","TAMWORTH","Short Rural",211,14159,1785,3.6371334908138855,0.13649559866319363,1.7382692331381284,5,2.8593161894273798E-3,2.8593161894273798E-3,2.4369172068983299E-5,2.4369172068983299E-5,14,3.6413345254887E-2,3.6375050841635802E-2,3.56254086913232E-4,3.5277277661766298E-4]
[null,"GDM5422 Michelago","QUEANBEYAN","Long Rural",1681,356853,15885,3.69,12.327332382694642,13.123125851817406,106,0.68302959868035096,0.58945197793545501,6.49844588506222E-3,5.8300343083129598E-3,49,0.72712271444726395,0.70290439915775504,2.2106320376863399E-3,2.1282410273578802E-3]
[null,"GDM5482 Dam Site/Treatment Works","QUEANBEYAN","Short Rural",4,2254,492,9.5000000000000001E-2,3.3093163323869268,22.146120224350923,1,7.0090380617456797E-4,7.0090380617456797E-4,4.6417470607587298E-6,4.6417470607587298E-6,3,4.6904854048966998E-3,4.6904854048966998E-3,1.04439308867071E-5,1.04439308867071E-5]
[null,"GFH3B1 Blumer Ave","GRIFFITH","Urban",815,5964,3719,3.0864240000000001,11.519376912594874,3.7892605666104138,8,0.71178057997469102,0.104347634362621,1.9460524552231001E-3,1.0095799857150201E-3,13,0.23413784480202701,0.23413784480202701,1.11401929458209E-3,1.11401929458209E-3]
[null,"GFH3B10 Ricemill","GRIFFITH","Short Rural",316,9515,913,2.6863319999999997,0.12173167955911926,3.2679327639905664,4,2.2965043583103801E-3,2.2965043583103801E-3,2.5529608834173001E-5,2.5529608834173001E-5,12,6.1650524024232198E-2,6.1650524024232198E-2,2.9243006482780002E-4,2.9243006482780002E-4]
[null,"GFH3B2 Wakaden St","GRIFFITH","Urban",972,9068,2224,3.1816840000000002,11.696981755434653,3.9756505126706307,9,0.80767675337643596,0.10250602121626499,2.3301570245008799E-3,1.23354428139663E-3,9,0.27451872335709698,0.27451872335709698,1.12098191517323E-3,1.12098191517323E-3]
[null,"GFH3B3 Banna Ln","GRIFFITH","Urban",62,48,943,2.9340079999999999,0,0,0,0,0,0,0,0,0,0,0,0]
[null,"GFH3B4 Coolah St","GRIFFITH","Urban",910,6446,1158,3.4674640000000001,1.0009820342686926,6.0153011139868422,9,4.2468504295646803E-2,3.9480379625283397E-2,2.0307643390819399E-4,2.00755560377815E-4,9,0.255210216021106,0.255210216021106,9.8985256070679897E-4,9.8985256070679897E-4]
[null,"GFH3B5 Jensen Rd","GRIFFITH","Short Rural",463,31663,1484,3.9056599999999997,12.459006926004195,7.6092451045523264,16,0.35364542506508601,6.3386537424955994E-2,1.00841954894983E-3,5.24517417865736E-4,11,0.21598629292093,0.21598629292093,7.9257831062455304E-4,7.9257831062455304E-4]
[null,"GFH3B6 Illilliwa","GRIFFITH","Urban",1485,7166,518,3.7341920000000002,15.032892219551075,4.1043593116173902,19,1.3743145445082601,0.13183954176672999,3.5903913514968798E-3,1.8984745478503201E-3,21,0.37522258627702298,0.37522258627702298,2.0307643390819401E-3,2.0307643390819401E-3]
[null,"GFH3B7 Railway St","GRIFFITH","Urban",455,3291,757,3.3340999999999998,3.7588514571643232,2.3633753197798439,10,0.11834714349787,0.11834714349787,7.1482904735684397E-4,7.1482904735684397E-4,3,7.4410686694258002E-2,7.4410686694258002E-2,4.1775723546828597E-4,4.1775723546828597E-4]
[null,"GFH3B8 Canal St","GRIFFITH","Urban",353,1513,1618,3.867556,2.7521057394697926E-3,0.47121420222141297,1,4.7577907372777001E-5,4.7577907372777001E-5,1.1604367651896799E-6,1.1604367651896799E-6,1,8.1462660916315696E-3,8.1462660916315696E-3,4.5257033842397598E-5,4.5257033842397598E-5]
[null,"GFH3B9 Harris Rd","GRIFFITH","Short Rural",136,3092,1977,1.8670960000000001,1.3512809723789936,0.54246380643710779,2,4.1463566056992501E-2,0,4.0615286781638899E-5,0,3,1.66453049598808E-2,1.66453049598808E-2,6.2663585320242801E-5,6.2663585320242801E-5]
[null,"GGB112 Gulargambone","COONAMBLE","Long Rural",469,343551,0,1.3146265629447778,6.4708230505408091,1.4066290475006247,53,0.32822953903390201,0.32703661003928702,2.1108344758800301E-3,2.0980696714629401E-3,8,7.13506149444528E-2,7.13506149444528E-2,6.17352359080911E-4,6.17352359080911E-4]
[null,"GGB122 Warrumbungles","COONAMBLE","Long Rural",165,271655,0,0.45726141319818364,3.2020519254642927,0.58527438522299513,31,0.236657153019253,0.21295987383731499,1.13490715635551E-3,9.5736033128148801E-4,10,4.3256440859210599E-2,4.3256440859210599E-2,4.1311548840752702E-4,4.1311548840752702E-4]
[null,"GGG12 Flour Mill","MUDGEE","Short Rural",425,7789,288,1.0669432974624282,1.0878709127977348,2.7143674948528882,6,5.8605537952374498E-2,5.8605537952374498E-2,1.02930741072325E-3,1.02930741072325E-3,9,0.146227797218317,0.146227797218317,3.7714194868664698E-4,3.7714194868664698E-4]
[null,"GGG22 Tallawang","MUDGEE","Short Rural",155,77258,1032,2.4768326548234945,10.059107929881645,0.52427243976613147,35,0.122413313923094,0.122413313923094,1.05483701955742E-3,1.05483701955742E-3,4,6.38008133501287E-3,6.38008133501287E-3,7.8909700032898402E-5,7.8909700032898402E-5]
[null,"GGG32 Gulgong","MUDGEE","Short Rural",852,52991,1065,1.9814661238587956,1.9365108363663253,2.9897809148575361,27,0.100564610508103,0.100305833109466,3.0739969909874699E-3,3.0705156806919002E-3,9,0.15526179743531901,0.15526179743531901,4.8738344137966598E-4,4.8738344137966598E-4]
[null,"GID12 Gilgandra Town No.1","GILGANDRA","Urban",652,10519,109,1.7528354172597038,2.504012614237825,2.0923832701155245,10,9.9216182986952603E-2,9.9216182986952603E-2,1.54570177123266E-3,1.54570177123266E-3,6,8.2906244252211603E-2,8.2906244252211603E-2,2.8662788100185103E-4,2.8662788100185103E-4]
[null,"GID22 Rural Nth/Sth/West","GILGANDRA","Long Rural",581,727515,536,2.0005186827420531,7.3672540733014769,5.5241762938272307,141,0.41756808427556003,0.40196137022052397,3.9060301516284702E-3,3.7981095324658301E-3,89,0.313104406236419,0.31156566708577799,1.22193991374474E-3,1.2114959828580299E-3]
[null,"GID32 Rural East","GILGANDRA","Long Rural",490,529213,0,1.5432572695438698,4.3654196402340952,0.50711190629197467,113,0.24131630663149001,0.24040652420758099,1.89615367431994E-3,1.88338886990285E-3,16,2.8032670936687199E-2,2.8032670936687199E-2,1.8799075596072801E-4,1.8799075596072801E-4]
[null,"GID42 Town No.2","GILGANDRA","Short Rural",760,10433,651,2.3568015338589712,1.7128191351037532,5.3526692443357335,9,0.10442306275235901,0.10442306275235901,1.14186977694665E-3,1.14186977694665E-3,16,0.32632874361252101,0.32632874361252101,8.9585718272643501E-4,8.9585718272643501E-4]
[null,"GLR3B1 Gloucester No.1","GLOUCESTER","Urban",316,1985,159,0.78115491421356364,8.9373931949535773E-2,1.5030591028026934,2,4.3272686973923197E-3,4.3272686973923197E-3,8.00701367980881E-5,8.00701367980881E-5,2,7.2774470855340501E-2,7.2774470855340501E-2,2.76183950115144E-4,2.76183950115144E-4]
[null,"GLR3B2 Stratford","GLOUCESTER","Short Rural",321,87020,1811,0.7621023553303059,0.85177761697082732,2.5809055739026885,18,4.94357666338456E-2,4.94357666338456E-2,4.1659679870309599E-4,4.1659679870309599E-4,16,0.149791498524215,0.149791498524215,4.7926038402333902E-4,4.7926038402333902E-4]
[null,"GLR3B3 Invergordon","GLOUCESTER","Short Rural",914,98221,2354,1.9243084472090224,1.2371774480086337,4.5905692632336992,17,6.2875945248272599E-2,6.2808639915891598E-2,3.42328845730956E-4,3.41168408965767E-4,30,0.23330233033108999,0.23330233033108999,8.3899578123214E-4,8.3899578123214E-4]
[null,"GLR3B5 Barrington","GLOUCESTER","Long Rural",1055,396889,849,2.7245159203058438,5.3911087025795954,11.159579811317315,117,0.26747487219239602,0.25480986533711603,2.8813644879659801E-3,2.78504823645524E-3,71,0.55367223115436204,0.51568881495617303,2.2999856686059502E-3,2.1862628656173599E-3]
[null,"GLR3B6 Gloucester No.2","GLOUCESTER","Urban",483,3247,120,1.1241009741122014,0,2.8707344518854767,0,0,0,0,0,5,0.156978083411034,0.156978083411034,7.0322467970494696E-4,7.0322467970494696E-4]
[null,"GLR3B7 Gangat/Coolongolook","GLOUCESTER","Long Rural",534,226072,194,1.1241009741122014,8.4587844890315953,3.521558228186203,41,0.57991782947265702,0.122897216054178,9.7128557246376401E-4,5.3380091198725304E-4,17,0.24143118987124401,0.24143118987124401,6.4056109438470502E-4,6.4056109438470502E-4]
[null,"GLS5/3 Rockvale","ARMIDALE","Short Rural",804,146318,1471,1.8671507705592496,4.3283765268602066,0.95351756410876976,24,0.37543146489475698,8.71023835951375E-2,1.79867698604401E-3,8.80771504778968E-4,11,8.2705488691833806E-2,8.2705488691833806E-2,3.3420578837462802E-4,3.3420578837462802E-4]
[null,"GLS5/4 Ben Venue","ARMIDALE","Short Rural",836,7340,999,3.7724066588850143,0.20473626571414766,0.29915658245083443,5,1.8189846294348298E-2,1.8189846294348298E-2,2.23964295681609E-4,2.23964295681609E-4,1,2.6578643669904499E-2,2.6578643669904499E-2,6.4984458850622198E-5,6.4984458850622198E-5]
[null,"GLS5/5 City Sth","ARMIDALE","Short Rural",794,11428,1656,3.9629322477175912,1.4479488445080747E-2,0.96283454469398111,2,1.30665179760358E-3,1.30665179760358E-3,4.6417470607587298E-6,4.6417470607587298E-6,8,8.6887702793577395E-2,8.6887702793577395E-2,3.2492229425311098E-4,3.2492229425311098E-4]
[null,"GLS5/6 ACAE","ARMIDALE","Short Rural",446,3472,1393,2.553042890356525,8.2812002277010809E-3,4.2419790928285455,2,2.9243006482780002E-4,2.9243006482780002E-4,2.3208735303793598E-6,2.3208735303793598E-6,6,0.14979497983451001,0.14979497983451001,5.1871523403978798E-4,5.1871523403978798E-4]
[null,"GLS5/7 City Nth","ARMIDALE","Urban",1093,6422,617,2.1338865949248564,0.16697687052326307,0.99310363130425927,6,1.06423655735546E-2,1.06423655735546E-2,9.8637125041123002E-5,9.8637125041123002E-5,2,6.3296023357271206E-2,6.3296023357271206E-2,2.07718180968953E-4,2.07718180968953E-4]
[null,"GLS5/8 City","ARMIDALE","Urban",726,3655,1291,4.8584025152307007,7.1239953025301643E-3,0.13494441643456956,2,3.21440983957542E-4,3.21440983957542E-4,2.3208735303793598E-6,2.3208735303793598E-6,1,6.08881170695026E-3,6.08881170695026E-3,6.1503148555053198E-5,6.1503148555053198E-5]
[null,"GLS5/9 Gara Dangersleigh","ARMIDALE","Short Rural",547,190880,1144,1.4670470340108388,5.1913336936729131,5.7748749272695532,46,0.318140701797342,0.185138402391892,1.6756706889338999E-3,1.0525161460270399E-3,32,0.35390188159019298,0.35390188159019298,1.3310209696725699E-3,1.3310209696725699E-3]
[null,"GNF12 Rural No.1","GRENFELL","Long Rural",696,562264,398,1.6194674980000001,12.324204712101569,4.2561102704592333,138,0.64335078436822002,0.61052667002806504,2.8477118217754799E-3,2.6295497099198201E-3,33,0.22217838349998201,0.22217838349998201,9.1326373420428004E-4,9.1326373420428004E-4]
[null,"GNF22 Grenfell Town No.1","GRENFELL","Short Rural",699,14817,0,1.2003112043999999,0.61770404301035131,5.883826347114117,7,3.2751006823948402E-2,3.2751006823948402E-2,2.0307643390819399E-4,2.0307643390819399E-4,20,0.31196369689623799,0.29736424195338601,1.12794453576437E-3,1.0826875019219701E-3]
[null,"GNF32 Grenfell Town No.2","GRENFELL","Short Rural",391,3333,0,0.95262793999999995,0.22938937304288978,1.255706547564633,2,9.1047868596782506E-3,9.1047868596782506E-3,9.5155814745553893E-5,9.5155814745553893E-5,3,4.9840759064896899E-2,4.9840759064896899E-2,1.93792939786677E-4,1.93792939786677E-4]
[null,"GNF42 Rural No.2","GRENFELL","Long Rural",567,492031,43,1.2384163219999997,4.0304851160635922,2.2282876796159168,115,0.24055738098705601,0.240375192414921,1.0919709960434899E-3,1.0908105592783001E-3,47,0.13299417634809399,0.13299417634809399,5.7209532523851299E-4,5.7209532523851299E-4]
[null,"GNG5212 Jerrawa/Dalton","YASS","Long Rural",465,305854,145,0.87,6.0372636450588892,4.8690704877202906,63,0.32349379659516297,0.32335222330980901,4.0905395972936302E-3,4.0882187237632501E-3,7,0.260898677044066,0.260898677044066,9.8637125041122994E-4,9.8637125041122994E-4]
[null,"GNG5222 Collector/Cullerin Rd","YASS","Short Rural",160,88327,691,0.34,7.6497112910132401,9.7523097443738642,28,9.76994921348497E-2,9.76994921348497E-2,1.29504742995169E-3,1.29504742995169E-3,4,0.124553159318104,0.124553159318104,3.62056270739181E-4,3.62056270739181E-4]
[null,"GNI3B1 Matherson/Wellingrove","GLEN INNES","Short Rural",143,154297,0,0.32389350101538,1.8157732206994419,1.9668822734486955,34,0.134226560192725,0.132873490924514,7.0090380617456797E-4,6.8697856499229197E-4,12,0.145396924494441,0.145396924494441,5.0246911932713201E-4,5.0246911932713201E-4]
[null,"GNI3B3 Red Range/Kookabookra","GLEN INNES","Long Rural",509,363651,0,0.80020747309682139,2.2275435379055204,1.7301584898984281,91,0.17193843418786001,0.146073459128547,2.5657256878343902E-3,2.3371196450920201E-3,4,0.13354654424832399,0.13354654424832399,6.31277600263187E-4,6.31277600263187E-4]
[null,"GNI3B4 Glen Innes Southern Town","GLEN INNES","Short Rural",1572,35335,804,2.8388312736053898,7.571399688413897,2.5076742382401567,15,0.44659873083030999,0.44659873083030999,5.1500183639118097E-3,5.1500183639118097E-3,12,0.147915072274903,0.147915072274903,6.3940065761951498E-4,6.3940065761951498E-4]
[null,"GNI3B5 Dundee/Rangers Valley","GLEN INNES","Long Rural",202,232212,10,0.66683956091401775,3.0302223203025087,0.58471195842653323,55,0.147430009707054,0.14422952510865999,1.1163401681124701E-3,1.0792061916263999E-3,10,2.8448107298625101E-2,2.8448107298625101E-2,4.5489121195435502E-4,4.5489121195435502E-4]
[null,"GNI3B6 Shannon Vale/Glen Elgin","GLEN INNES","Short Rural",114,131261,24,1.2384163274117472,1.6158274046593502,0.45590217438051012,24,0.112811860127915,9.6800153641827702E-2,8.4711883858846798E-4,7.6240695472962097E-4,7,3.1829620032387797E-2,3.1829620032387797E-2,2.9243006482780002E-4,2.9243006482780002E-4]
[null,"GNI3B7 Glen Innes Northern Town","GLEN INNES","Short Rural",471,37362,2,1.1622060918787165,0.73113382273925598,0.87781765172827297,14,4.0095411110833902E-2,3.7737403603968503E-2,6.1038973848977305E-4,5.8718100318597903E-4,3,4.8139558767128797E-2,4.8139558767128797E-2,1.41573285353141E-4,1.41573285353141E-4]
[null,"GNI3B8 Glen Innes Central Town","GLEN INNES","Short Rural",1384,14025,742,2.7245159203058438,3.6204869534962412,4.7224738523026115,9,0.16878784837037,0.16878784837037,3.05078825568367E-3,3.05078825568367E-3,10,0.22016270483884701,0.17776382674911201,8.84252815074538E-4,7.6008608119924198E-4]
[null,"GOU32 Goulburn No.3","GOULBURN","Short Rural",1134,25434,1396,5.2010000000000005,1.5193251562017747,1.9955163686996131,7,9.0143888356699703E-2,9.0143888356699703E-2,2.3974623568818799E-3,2.3974623568818799E-3,6,0.118397042278773,4.6159853645715197E-2,4.2936160312018201E-4,1.4041284858795199E-4]
[null,"GOU42 Goulburn No.4","GOULBURN","Short Rural",2052,28598,811,5.2583520000000004,8.8946516330465766,0.40972721202873291,16,0.41158023056718102,0.411459545143601,3.95360805900125E-3,3.95244762223606E-3,1,1.8959215869669001E-2,1.8959215869669001E-2,4.8738344137966598E-5,4.8738344137966598E-5]
[null,"GRN3B1 Central","GRAFTON","Urban",1217,7613,1738,4.8599999999999994,0.72134492785328341,3.2612411945265314,2,2.97872513256539E-2,2.97872513256539E-2,2.7038176628919598E-4,2.7038176628919598E-4,8,0.134669847037028,0.134669847037028,8.0766398857201897E-4,8.0766398857201897E-4]
[null,"GRN3B2 Carrs Ck/Copmanhurst","GRAFTON","Long Rural",606,293450,904,0.88,2.4218519648808745,0.4095370832339516,34,0.17059232754024001,0.14760523565859701,2.34756357597873E-3,1.65014108009973E-3,13,2.88472975458503E-2,2.88472975458503E-2,1.69423767717694E-4,1.69423767717694E-4]
[null,"GRN3B3 Grafton Rural","GRAFTON","Short Rural",493,75612,1388,0.86,1.4264687946505863,0.6959657846845676,26,0.107791810681704,3.20721513163124E-2,1.18712681078904E-3,6.2779628996761797E-4,5,5.2590994198396399E-2,5.2590994198396399E-2,2.13520364794902E-4,2.13520364794902E-4]
[null,"GRN3B4 Grafton Interconnector","GRAFTON","Urban",1057,7136,1276,1.72,1.5012742324624735,1.385970095151569,5,0.12613019288199701,0.12613019288199701,2.7502351334995501E-3,2.7502351334995501E-3,6,0.116442866766193,0.116442866766193,4.2936160312018201E-4,4.2936160312018201E-4]
[null,"GRN3B5 Koolkhan","GRAFTON","Short Rural",328,13299,1696,2.3699999999999997,6.6921987355285815,1.3570858865221625E-2,12,0.14077258398515999,0.119280134657082,1.6895959301161799E-3,8.6336495330112297E-4,1,2.8546744423666202E-4,2.8546744423666202E-4,2.3208735303793598E-6,2.3208735303793598E-6]
[null,"GRN3B6 Grafton East","GRAFTON","Short Rural",1641,12214,1341,4.2299999999999995,0.10614979037845002,3.9558369334944818,5,8.9550905169687792E-3,8.9550905169687792E-3,2.9010919129742099E-5,2.9010919129742099E-5,11,0.33372536755384002,0.33372536755384002,1.36003188880231E-3,1.36003188880231E-3]
[null,"GRN3B7 Grafton West","GRAFTON","Urban",1157,6536,2702,5.17,0.79232730090364289,5.6862547031978989,4,3.9855200700439603E-2,3.9855200700439603E-2,1.45866901384343E-3,1.45866901384343E-3,12,0.286026774757483,0.286026774757483,1.2497903961092901E-3,1.2497903961092901E-3]
[null,"GRS3B1 Allyn River","DUNGOG","Short Rural",319,66049,191,0.4953665309646989,18.044910135962642,0.39482642879512891,21,1.0794928195074101,0.13776357145302301,1.43429984177445E-3,1.08036662839159E-3,4,2.3619529918670799E-2,2.3619529918670799E-2,3.5741452367842199E-4,3.5741452367842199E-4]
[null,"GRS3B2 Paterson River","DUNGOG","Short Rural",444,120769,44,1.200311209645232,23.235127345375734,1.7326388287685308,61,1.3388086608037499,0.35099150618309699,2.1421662685401498E-3,1.64433889627378E-3,6,9.9834695782798702E-2,9.9834695782798702E-2,7.8561569003341499E-4,7.8561569003341499E-4]
[null,"GRS3B3 Gresford Rd","DUNGOG","Short Rural",181,75561,1430,0.66683956091401775,8.6656994591196579,1.2792650738209781,55,0.68851614370616798,0.197520262676466,1.65710370069087E-3,1.4540272667826701E-3,9,0.101641495826199,0.101641495826199,4.5024946489359699E-4,4.5024946489359699E-4]
[null,"79C Griffith 132 - Darlington Point","GRIFFITH","Short Rural",103,128331,1310,6.8587199999999999,2.0011013618373013,3.0061488997488417,19,5.1639436050940901E-2,5.1639436050940901E-2,4.2355941929423399E-4,4.2355941929423399E-4,5,7.7575197752930203E-2,7.7575197752930203E-2,2.3556866333350501E-4,2.3556866333350501E-4]
[null,"79F Griffith 132 - Yenda","GRIFFITH","Short Rural",4,14334,909,17.032488000000001,2.4595606673113949E-2,0,2,5.9182275024673798E-4,5.9182275024673798E-4,4.6417470607587298E-6,4.6417470607587298E-6,0,0,0,0,0]
[null,"79L Griffith 132 - Beelbangera - Yenda","GRIFFITH","Short Rural",20,20042,1298,12.174227999999999,0,9.8596339806755598E-2,0,0,0,0,0,1,1.8938328007895599E-3,1.8938328007895599E-3,6.96262059113809E-6,6.96262059113809E-6]
[null,"79P Griffith 132 - Goolgowi","GRIFFITH","Long Rural",641,985206,899,8.8591800000000003,11.960509158423248,4.8829780771369764,67,0.48329174134560798,0.17966230129696201,2.98580379683305E-3,1.6478202065693501E-3,46,0.19730790274843599,0.19730790274843599,6.2199410614166898E-4,6.2199410614166898E-4]
[null,"GUE112 Maryvale","WELLINGTON","Short Rural",300,130833,0,0.75829184355365442,1.0054943833218994,0.40408673436250253,18,6.16458822771715E-2,6.16458822771715E-2,7.6472782826000104E-4,7.6472782826000104E-4,8,2.4774164500034501E-2,2.4726586592661699E-2,1.0095799857150201E-4,9.97975618063127E-5]
[null,"GUE122 Geurie","WELLINGTON","Short Rural",137,26150,0,0.39057745710678182,0.31093182823950388,3.8129197704754439E-2,5,2.0676662282149798E-2,2.0676662282149798E-2,3.2608273101830101E-4,3.2608273101830101E-4,3,2.5355543319394601E-3,2.5355543319394601E-3,3.4813102955690502E-5,3.4813102955690502E-5]
[null,"GUE132 Ponto","WELLINGTON","Short Rural",66,54883,0,0.567766254721078,1.7349736232588633,2.9238460669582425E-2,22,5.9356340539452199E-2,5.9286714333540901E-2,5.5236790023028897E-4,5.5120746346509905E-4,1,1.00029649159351E-3,1.00029649159351E-3,9.2834941215174595E-6,9.2834941215174595E-6]
[null,"GYA3B1 Ben Lomond","GUYRA","Long Rural",227,218767,0,0.36199861878189532,1.7825583099985169,4.3285265426185369,62,0.115237172967161,9.6043548870924006E-2,1.04091177837514E-3,9.7244600922895405E-4,16,0.27982656112107501,0.167242146599137,7.7749263267708701E-4,5.2103610757016697E-4]
[null,"GYA3B2 Abattoir","GUYRA","Short Rural",5,2307,0,3.8105117766515297E-2,0,7.9810011808605114E-2,0,0,0,0,0,2,1.6675476315775701E-3,1.6675476315775701E-3,5.8021838259484103E-6,5.8021838259484103E-6]
[null,"GYA3B3 Guyra Town/Black Mtn","GUYRA","Short Rural",1336,191512,877,3.3532503634533466,2.9734704581812585,9.0577430805497556,45,0.153742785709685,0.15149734056904299,6.8117638116634298E-4,6.7653463410558402E-4,46,0.46832906969525201,0.43210603606985598,1.9460524552231001E-3,1.8404527095908401E-3]
[null,"GYA3B4 East of Guyra","GUYRA","Long Rural",206,317142,234,0.55252420761447185,1.1143746731313426,1.7599853236186798,41,7.9441180071355297E-2,7.0532507024994098E-2,6.1851279584609995E-4,5.3148003845687405E-4,22,0.125465262615543,0.12498600223152,4.82741694318908E-4,4.7809994725814899E-4]
[null,"GYA8K1 Wandsworth","GUYRA","Long Rural",153,219204,1335,0.38105117766515295,0.92465994528652073,0.32038881310004813,27,6.4751211060819103E-2,2.1870751713529899E-2,2.7154220305438602E-4,2.0655774420376299E-4,6,2.2435884418177302E-2,2.2435884418177302E-2,1.31129354466434E-4,1.31129354466434E-4]
[null,"HAM3B1 Copland St","WAGGA WAGGA","Short Rural",301,7438,1209,3.48,0,5.3625551080134337E-2,0,0,0,0,0,2,8.1230573563277695E-4,8.1230573563277695E-4,1.6246114712655499E-5,1.6246114712655499E-5]
[null,"HAM3B2 Day St/Morgan St","WAGGA WAGGA","Urban",402,1605,1523,4.22,0,1.1303349799422,0,0,0,0,0,3,3.6457441851964201E-2,3.6457441851964201E-2,2.7270263981957503E-4,2.7270263981957503E-4]
[null,"HAM3B3 Waterworks","WAGGA WAGGA","Urban",1,0,510,0.8,8.2246214835151477E-3,3.925772934914968E-2,2,1.12562366223399E-4,1.12562366223399E-4,2.3208735303793598E-6,2.3208735303793598E-6,1,5.3728222228282304E-4,5.3728222228282304E-4,1.1604367651896799E-6,1.1604367651896799E-6]
[null,"HAM3B4 East Wagga Industrial","WAGGA WAGGA","Short Rural",285,11261,507,3.6,0.67102601814255947,1.4525685885689286,6,1.0216485280730001E-2,1.0216485280730001E-2,4.6417470607587303E-5,4.6417470607587303E-5,3,2.2115603870985E-2,2.2115603870985E-2,9.0514067684795195E-5,9.0514067684795195E-5]
[null,"HAM3B5 Edward St","WAGGA WAGGA","Urban",350,3324,2085,3.8,0.57108522731649258,0.23189749507380289,4,1.05622954367565E-2,1.05622954367565E-2,4.5489121195435502E-4,4.5489121195435502E-4,1,4.2889742841410597E-3,4.2889742841410597E-3,6.4984458850622198E-5,6.4984458850622198E-5]
[null,"HAM3B6 North Wagga","WAGGA WAGGA","Short Rural",312,15756,336,0.85,0.10438237527715261,0.72243941744580731,6,6.36731653059579E-3,6.36731653059579E-3,6.9742249587899895E-4,6.9742249587899895E-4,3,4.4068746594843403E-2,4.4068746594843403E-2,1.1024149269302E-4,1.1024149269302E-4]
[null,"HAM3B7 Tarcutta St","WAGGA WAGGA","Urban",290,3665,1533,2.72,2.3061392328820078,0.24513083529842852,5,8.5776004372525694E-2,8.5776004372525694E-2,9.7592731952452297E-4,9.7592731952452297E-4,3,9.1175516640953306E-3,9.1175516640953306E-3,4.8738344137966699E-5,4.8738344137966699E-5]
[null,"HAM3B8 Lake Albert Rd","WAGGA WAGGA","Short Rural",778,8684,1039,3.47,3.4753764035544803E-2,2.0908526420241533,2,1.94953376551867E-3,1.94953376551867E-3,8.7961106801377905E-4,8.7961106801377905E-4,4,0.117287664731252,0.117287664731252,3.5857496044361202E-4,3.5857496044361202E-4]
[null,"HAN3B2 Bartter No.4","GRIFFITH","Urban",1,615,597,7.6207999999999998E-2,0,0,0,0,0,0,0,0,0,0,0,0]
[null,"HAN3B3 Bartter No.2","GRIFFITH","Urban",1,794,364,3.4674640000000001,0,0,0,0,0,0,0,0,0,0,0,0]
[null,"HAN3B4 Hanwood Ave","GRIFFITH","Short Rural",496,27201,274,2.9721120000000001,7.1823358797346506,1.3109009503674083,18,0.26812123547060601,0.109157644754333,1.9460524552231001E-3,1.3960054285231901E-3,6,4.8936778824814099E-2,4.8936778824814099E-2,1.5085677947465899E-4,1.5085677947465899E-4]
[null,"HAN3B5 Old Willbriggie Rd","GRIFFITH","Short Rural",38,7657,74,0.400092,0.59805139534710994,0,4,1.3838208424887E-2,3.3594644352241301E-3,9.0514067684795195E-5,4.9898780903156303E-5,0,0,0,0,0]
[null,"HAN3B6 Bartter No.1","GRIFFITH","Urban",1,612,299,3.7151399999999999,0,0,0,0,0,0,0,0,0,0,0,0]
[null,"HAN3B7 Bartter No.3","GRIFFITH","Urban",1,1197,339,2.1719279999999999,0,0,0,0,0,0,0,0,0,0,0,0]
[null,"HAN3B8 Millis Rd","GRIFFITH","Short Rural",60,22352,144,1.9242519999999999,1.2673952101122135,0.68083092605680962,11,3.0095927505194402E-2,1.28634415421276E-2,2.2048298538604E-4,1.5665896330060701E-4,1,1.6167205012622698E-2,1.6167205012622698E-2,6.2663585320242801E-5,6.2663585320242801E-5]
[null,"HAN3B9 McWilliams Wines","GRIFFITH","Urban",1,553,1939,2.210032,0,0,0,0,0,0,0,0,0,0,0,0]
[null,"HAT12 Booligal","HAY","Long Rural",114,359697,0,0.51440399999999997,0.81011453053806481,8.6067222487946404E-2,18,3.62961411416029E-2,3.4503266339384803E-2,2.83146570706282E-4,1.6362158389174501E-4,3,3.8561313707253099E-3,3.8561313707253099E-3,1.74065514778452E-5,1.74065514778452E-5]
[null,"HAT22 Hay 132 - Hay Town (Maude)","HAY","Long Rural",218,483330,0,2.4577080000000002,14.181250720377585,2.3968021544276388,57,0.40827298578638999,0.40484389514525498,1.71164422865478E-3,1.4830381859124099E-3,23,6.9003051368474094E-2,6.9003051368474094E-2,3.56254086913232E-4,3.56254086913232E-4]
[null,"HAT32 Hay 132 - Hay Town","HAY","Short Rural",8,12293,42,4.4581679999999997,2.3571595591930061E-2,0.25013024099350223,4,3.2260142072273199E-4,2.3556866333350501E-4,1.50856779474659E-5,9.2834941215174595E-6,2,3.42328845730956E-3,3.42328845730956E-3,1.27648044170865E-5,1.27648044170865E-5]
[null,"HAT42 Hay 132 - Carrathool","HAY","Long Rural",143,474911,0,3.372204,3.3647311730097784,6.7960846483056203,35,0.102445678504476,0.100217639915311,8.2274966651948403E-4,6.7421376057520503E-4,60,0.20691980047450301,0.204854223032465,6.76534634105585E-4,6.6493026645368799E-4]
[null,"HAY1305 Irrigation Area","HAY","Short Rural",88,18531,0,0.41914400000000002,7.4405893904087292E-2,0.54448400910629602,4,3.3269722057988199E-3,1.8996349846155101E-3,1.06760182397451E-4,1.16043676518968E-5,15,2.4345963333679499E-2,2.1917169184137501E-2,1.21845860344917E-4,1.13722802988589E-4]
[null,"HAY1306 Hay Town East","HAY","Short Rural",736,12134,21,2.0957199999999996,0.28412105781785096,0.10062503748304787,2,1.17366574431284E-2,1.7870726183921099E-4,7.7169044885113899E-4,1.1604367651896799E-6,3,4.1566844929094397E-3,4.1566844929094397E-3,2.7850482364552401E-5,2.7850482364552401E-5]
[null,"HAY2036 East Rural","HAY","Short Rural",52,24371,0,0.41914400000000002,7.8415118867177197E-2,3.0940058970853688,5,2.6295497099198201E-3,1.81144179046109E-3,8.2391010328467402E-5,2.7850482364552401E-5,7,0.103753490738844,0.103753490738844,3.2840360454868E-4,3.2840360454868E-4]
[null,"HAY355 Hay Town West","HAY","Short Rural",813,22645,0,2.1147719999999999,0.30760136989448922,0.53068580692676481,8,1.73752196851851E-2,3.9199553928107502E-3,9.3995377980364298E-4,4.2936160312018201E-5,5,2.9976402518379901E-2,2.9976402518379901E-2,2.7038176628919598E-4,2.7038176628919598E-4]
[null,"HEN3B1 Yerong Ck","CULCAIRN","Short Rural",211,143799,0,0.55252420761447185,0.37312432084500075,0.44467015521277187,13,2.0812433383676901E-2,2.0812433383676901E-2,2.5993783540248901E-4,2.5993783540248901E-4,10,2.4803175419164301E-2,2.4803175419164301E-2,1.13722802988589E-4,1.13722802988589E-4]
[null,"HEN3B3 Henty","CULCAIRN","Long Rural",950,442577,247,2.2291493893411447,1.4223913482294179,2.3656079339556606,37,7.8641639140139594E-2,7.8641639140139594E-2,7.9605962092012196E-4,7.9605962092012196E-4,12,0.130790506930999,0.130790506930999,5.7441619876889296E-4,5.7441619876889296E-4]
[null,"HGE3B1 Grafton Rd","ARMIDALE","Short Rural",201,166426,140,0.40010373654841069,3.775549091717993,2.9944367204631939,38,0.300324516141385,0.23164638706716401,1.0304678474884401E-3,9.8172950335047109E-4,29,0.23819125042283401,0.22071507273907801,6.9974336940937804E-4,6.1271061202015204E-4]
[null,"HGE3B2 Treatment Plant","ARMIDALE","Short Rural",2,1890,19,0.19052558883257648,0,0,0,0,0,0,0,0,0,0,0,0]
[null,"HGE3B3 Elenora Mine","ARMIDALE","Short Rural",17,17796,0,1.4289419162443238,0.49782544414122826,0.30343017794183197,7,2.27666088962564E-2,2.27666088962564E-2,1.06760182397451E-4,1.06760182397451E-4,2,1.38765028381382E-2,1.38765028381382E-2,3.5973539720880099E-5,3.5973539720880099E-5]
[null,"HGN3B1 Crowdy Head","TAREE","Short Rural",989,15099,594,1.6575726228434156,4.7880817756388785,1.1178741471842142,4,0.32768761506455801,0.32768761506455801,2.2605308185895002E-3,2.2605308185895002E-3,3,7.6505275055425398E-2,7.6505275055425398E-2,2.3904997362907501E-4,2.3904997362907501E-4]
[null,"HGN3B2 Coopernook","TAREE","Short Rural",32,6441,461,0.11431535329954591,0.4400031807412017,0,6,1.47932478826381E-2,1.47932478826381E-2,7.7749263267708703E-5,7.7749263267708703E-5,0,0,0,0,0]
[null,"HGN3B3 Harrington Waters","TAREE","Short Rural",817,1430,7219,1.5623098284271273,3.2511999818389565,0.21398181451918769,3,0.25653775568048298,0.25653775568048298,1.7789495610357801E-3,1.7789495610357801E-3,1,1.6884354933509899E-2,1.6884354933509899E-2,5.8021838259484103E-5,5.8021838259484103E-5]
[null,"HIL1108 Hillston Town","HILLSTON","Short Rural",682,12552,0,1.600368,5.2477337318635513,3.5309528560957255,4,0.24923628755391,0.23800906185069901,1.5027656109206399E-3,7.5428389737329299E-4,6,0.16769935868462199,0.16769935868462199,5.97624934072686E-4,5.97624934072686E-4]
[null,"HIL1111 Hillston 132 - Merriwagga","HILLSTON","Long Rural",177,510796,0,0.74302800000000002,2.8173542832598288,0.94610293957451441,21,0.14432003917634501,0.141587210594324,5.3960309581320203E-4,3.5741452367842199E-4,18,4.8464481061381903E-2,4.8464481061381903E-2,2.2628516921198799E-4,2.2628516921198799E-4]
[null,"HIL1114 Lower Lachlan","HILLSTON","Short Rural",80,87374,20,2.2862399999999998,21.614443306691722,9.3380166798096411,15,0.136976795326225,0.13412792306768401,3.2260142072273199E-4,2.4021041039426399E-4,10,5.9177633277613002E-2,4.1631829387944998E-2,2.6109827216767802E-4,1.79867698604401E-4]
[null,"HIL1117 Hillston 132 - Ivanhoe","HILLSTON","Long Rural",94,424718,1491,4.4581679999999997,179.70068445474803,68.509568570851783,28,0.140484795667393,0.13347691804241299,4.42126407537269E-4,3.0403443247969698E-4,6,5.3558798460564598E-2,3.0895468436410101E-2,2.1932254862084999E-4,1.14883239753779E-4]
[null,"HIL1401 Upper Lachlan","HILLSTON","Long Rural",188,270744,0,3.200736,13.202600141715175,5.5028227275876977,44,0.32958144786534699,0.32615119678744697,5.8486012965560004E-4,3.7946282221702602E-4,43,0.13736902295285899,0.13736902295285899,5.69774451708134E-4,5.69774451708134E-4]
[null,"HLP3B1 Tallwoods","FORSTER","Short Rural",535,6927,8213,0.91452282639636728,0.62749252099999731,4.1043127659169718,4,5.3052848030941901E-2,5.3052848030941901E-2,6.03427117898635E-4,6.03427117898635E-4,5,0.34700888720496598,0.34700888720496598,1.5410600241719001E-3,1.5410600241719001E-3]
[null,"HLP3B3 Rainbow Flat","FORSTER","Short Rural",165,18620,1832,0.36199861878189532,0.68837557854114773,0.47813716086814256,4,5.4029935787231601E-2,5.4029935787231601E-2,2.5529608834173E-4,2.5529608834173E-4,1,3.7528524986234303E-2,3.7528524986234303E-2,1.13722802988589E-4,1.13722802988589E-4]
[null,"HLP3B5 Hallidays Point","FORSTER","Short Rural",13,4983,1201,0.45726141319818364,4.8926624759908135E-3,0.2055609782315575,3,3.2840360454868E-4,3.2840360454868E-4,3.4813102955690501E-6,3.4813102955690501E-6,3,1.37975931381053E-2,1.37975931381053E-2,3.8294413251259502E-5,3.8294413251259502E-5]
[null,"HLP3B7 Darawank","FORSTER","Short Rural",48,3081,1844,0.19052558883257648,0,8.5494866795195315E-2,0,0,0,0,0,2,6.6841157674925704E-3,6.6841157674925704E-3,9.2834941215174605E-5,9.2834941215174605E-5]
[null,"HOL1843 Holbrook Nth","CULCAIRN","Long Rural",333,218242,63,1.8290456527927346,6.4374041354355205,2.300969979120163,37,0.34624067806641101,0.34624067806641101,2.0446895802642201E-3,2.0446895802642201E-3,14,0.123759420570714,0.123759420570714,5.6281183111699595E-4,5.6281183111699595E-4]
[null,"HOL1845 Bardwell St","CULCAIRN","Short Rural",192,96660,1172,0.60968188426424474,0.54310177151002192,1.6301170431195684,25,3.4162097930419098E-2,3.4162097930419098E-2,3.6669801779994001E-4,3.6669801779994001E-4,9,0.102537353008926,8.8759487295828401E-2,3.3884753543538698E-4,2.9243006482780002E-4]
[null,"HOL1853 Young St","CULCAIRN","Short Rural",654,8160,418,1.6766251817266733,5.2881432292408386,0.37443298390940444,9,0.25368424167488202,0.245172438002215,2.9208193379824301E-3,2.8685996835488901E-3,2,1.79624006883711E-2,1.79624006883711E-2,6.7305332381001595E-5,6.7305332381001595E-5]
[null,"HOL1890 Wantagong/Woomargama","CULCAIRN","Long Rural",332,298664,872,0.95262794416288255,5.1108415628799859,2.1219734366092466,44,0.34205150134407603,0.34205150134407603,1.43429984177445E-3,1.43429984177445E-3,24,0.14201657219744401,0.14201657219744401,5.97624934072686E-4,5.97624934072686E-4]
[null,"HPT3B1 Hastings Pt","TWEED HEADS","Short Rural",872,2736,11662,2.0099999999999998,5.5096198758299462,0.21012910282516933,4,0.37479786642096402,0.37479786642096402,2.0330852126123201E-3,2.0330852126123201E-3,2,1.4294260073606501E-2,1.4294260073606501E-2,5.9182275024673801E-5,5.9182275024673801E-5]
[null,"HPT3B2 Bogangar Beach","TWEED HEADS","Short Rural",859,5632,2813,2.0199999999999996,6.3385018361804608,1.3206237730392691,4,0.37653155894815699,0.37653155894815699,1.8416131463560299E-3,1.8416131463560299E-3,2,7.8450167073883303E-2,7.8450167073883303E-2,2.41370847159454E-4,2.41370847159454E-4]
[null,"HPT3B3 Round Mtn","TWEED HEADS","Short Rural",682,85193,115,1.45,7.0944087775285825,5.3174073126395287,34,0.48619167282181702,0.48524011467436101,2.8883271085571199E-3,2.8836853614963602E-3,17,0.36441079693575101,0.36441079693575101,1.16043676518968E-3,1.16043676518968E-3]
[null,"HPT3B4 Pottsville","TWEED HEADS","Short Rural",1947,7429,10700,3.15,13.962577471647936,0.1088402396853051,9,1.1504419233311001,1.1504419233311001,7.0867873250133901E-3,7.0867873250133901E-3,3,8.9678553213858592E-3,8.9678553213858592E-3,9.1674504449984893E-5,9.1674504449984893E-5]
[null,"HPT3B5 Bogangar","TWEED HEADS","Short Rural",1268,7314,6985,2.23,5.5138559158159666,3.8782351200305785,5,0.468253641305515,0.468253641305515,1.53989958740671E-3,1.53989958740671E-3,7,0.32935168138583998,0.32935168138583998,1.0107404224802101E-3,1.0107404224802101E-3]
[null,"HPT3B6 Koala Beach","TWEED HEADS","Short Rural",438,1024,6575,0.81,2.316983245282386,0.45339572833519864,3,0.19959164230233001,0.19959164230233001,7.2991472530431001E-4,7.2991472530431001E-4,3,3.90568202059891E-2,3.90568202059891E-2,5.8021838259484103E-5,5.8021838259484103E-5]
[null,"IVA10215 Ivanhoe Town","HILLSTON","Short Rural",186,5500,40,0.49535199999999996,4.8585407354411725,3.6322949821887738,4,0.19278103892743201,0.189978584139498,4.0847374134676801E-4,2.21643422151229E-4,10,0.144125085799793,0.103079276978269,5.9182275024673798E-4,4.0267155752081999E-4]
[null,"IVA1144 Lake Morrison","HILLSTON","Long Rural",51,241754,0,0.22862399999999999,1.1860599388023543,0.51477064479913504,6,6.7912240809195806E-2,6.7041913235303494E-2,1.2648760740567499E-4,6.8465769146191306E-5,2,2.9475093835817898E-2,1.6884354933509899E-2,1.16043676518968E-4,5.8021838259484103E-5]
[null,"IVA1325 Nth SWER","HILLSTON","Long Rural",40,268654,0,0.13370000000000001,0.84699794637097636,0.42589944905007682,3,5.1796095014241497E-2,5.1099832955127697E-2,9.8637125041123002E-5,5.2219654433535699E-5,3,2.60448427579172E-2,1.59722516360708E-2,1.3925241182276201E-4,9.2834941215174605E-5]
[null,"IVA1326 Nth West SWER","HILLSTON","Long Rural",42,230293,0,0.17189999999999997,1.4786545343851436,0.52919549392713472,6,6.7906438625369797E-2,6.7192770014778205E-2,1.17204113284158E-4,6.9626205911380896E-5,3,2.4303027173367499E-2,1.3978621273474901E-2,9.6316251510743605E-5,4.8738344137966699E-5]
[null,"IVA1365 Nth East SWER","HILLSTON","Short Rural",18,91243,0,7.640000000000001E-2,0.45715578654543526,0.20638435962736254,4,2.22420914783906E-2,2.19461801032673E-2,4.1775723546828597E-5,2.2048298538604E-5,2,1.00412593291863E-2,5.7604081024015801E-3,3.9454850016449201E-5,1.97274250082246E-5]
[null,"JER12 Finley Rd","BERRIGAN","Long Rural",265,358251,303,3.0865145390877395,4.2666578036058969,2.0725539179641062,38,0.18912682355384899,0.189002656819974,1.18712681078904E-3,1.1848059372586699E-3,15,9.1869457826536702E-2,9.1869457826536702E-2,3.14478363366404E-4,3.14478363366404E-4]
[null,"JER22 Jerilderie Town","BERRIGAN","Short Rural",624,127512,301,2.1719917126913719,4.6691489450064072,0.71184409763840506,24,0.180234396622201,0.179823602007324,1.6965585507073199E-3,1.69307724041175E-3,12,2.74779821629265E-2,2.74779821629265E-2,1.27648044170865E-4,1.27648044170865E-4]
[null,"JER32 Coleambally","BERRIGAN","Long Rural",312,459025,54,2.59114800812304,3.7013502508124758,6.77118870128845,43,0.16917195293964701,0.119096785648182,9.8637125041122994E-4,9.2718897538655604E-4,28,0.30948036221873199,0.308665735609569,1.0699226975048901E-3,1.06760182397451E-3]
[null,"JER42 Hartwood","BERRIGAN","Long Rural",156,282851,0,0.83831259086333665,2.2402185131498413,0.12107837446383424,31,9.6789709710941002E-2,9.6789709710941002E-2,6.2431497967204905E-4,6.2431497967204905E-4,5,5.2312489374750897E-3,4.9875572167852496E-3,2.6690045599362699E-5,2.5529608834173001E-5]
[null,"JGG3B1 Fdr 1 Nth/West","HARDEN","Short Rural",167,107247,136,0.27,2.7721188536474055,1.2712180171191003,17,9.9384446317905106E-2,9.9384446317905106E-2,6.3243803702837703E-4,6.3243803702837703E-4,5,4.5574993516059599E-2,4.5574993516059599E-2,2.30926916272747E-4,2.30926916272747E-4]
[null,"JGG3B2 Water Pump","HARDEN","Short Rural",1,2665,919,1.05,0,0,0,0,0,0,0,0,0,0,0,0]
[null,"JGG3B4 Fdr 4 Sth/East","HARDEN","Short Rural",159,137487,408,0.88,2.2993483632243916,1.2933212901189608,28,6.9749212208490993E-2,6.9686548623170794E-2,5.0362955609232205E-4,5.0246911932713201E-4,9,3.9232046157532799E-2,3.9232046157532799E-2,3.2028054719235202E-4,3.2028054719235202E-4]
[null,"JIN22 Jindabyne East","JINDABYNE","Long Rural",664,331085,3074,1.903,3.8636238368550697,1.4954513504842548,52,0.24242220286871599,0.22243484002508901,2.1294014641230698E-3,2.04120826996865E-3,21,9.3831756396472496E-2,9.3831756396472496E-2,3.6669801779994001E-4,3.6669801779994001E-4]
[null,"JIN2442 Jindabyne 66/33/11 - Bullocks Flat","JINDABYNE","Short Rural",110,43689,107,3.468,1.5702932122448245,0.16816293687754966,13,9.0427034927406003E-2,9.0427034927406003E-2,5.0362955609232205E-4,5.0362955609232205E-4,5,9.6838448055079004E-3,9.6838448055079004E-3,3.9454850016449201E-5,3.9454850016449201E-5]
[null,"JIN32 Cobbon Cres","JINDABYNE","Urban",923,7537,577,4.0529999999999999,3.2135059512159043,2.5541495839498567,6,0.15023594580528199,0.15023594580528199,1.6095257933180899E-3,1.6095257933180899E-3,7,0.119410103574783,0.119410103574783,1.55962701241493E-3,1.55962701241493E-3]
[null,"JIN62 Kurrajong St","JINDABYNE","Urban",612,2381,2894,3.044,2.6816507986036009,0.46206367350661304,6,0.179514925827783,0.179514925827783,2.1061927288192699E-3,2.1061927288192699E-3,4,3.0931441976130999E-2,3.0931441976130999E-2,7.8097394297265603E-4,7.8097394297265603E-4]
[null,"JIN72 Kosciuszko Rd","JINDABYNE","Urban",456,4097,1329,4.2279999999999998,4.2033591905478476,0.92021865989436913,3,0.16554906935872499,0.16554906935872499,6.0690842819420402E-4,6.0690842819420402E-4,3,3.62427610504042E-2,3.62427610504042E-2,6.2663585320242804E-4,6.2663585320242804E-4]
[null,"JIN82 Waste Point","JINDABYNE","Short Rural",526,157989,2210,3.048,8.1688549433779922,0.51321117914954617,57,0.30473185497557598,0.30473185497557598,2.3243548406749301E-3,2.3243548406749301E-3,14,1.91448857520994E-2,1.91448857520994E-2,6.2547541643723898E-4,6.2547541643723898E-4]
[null,"JNR4081 Quarry","TAREE","Short Rural",430,54492,770,1.1431535329954587,3.7700652430617989,5.9168480183989676,27,0.249408032195158,0.249408032195158,2.58545311284261E-3,2.58545311284261E-3,22,0.391428085702897,0.391428085702897,1.2776408784738399E-3,1.2776408784738399E-3]
[null,"JRF Line 131/132","JUNEE","Short Rural",70,108367,0,0.3,3.6175811061671462E-2,0.89981503379672434,6,2.0713796258635801E-3,2.0713796258635801E-3,1.16043676518968E-5,1.16043676518968E-5,14,5.1522231937656697E-2,5.1522231937656697E-2,2.1003905449933199E-4,2.1003905449933199E-4]
[null,"JUN1 Illabo 31/32 Lines","JUNEE","Long Rural",283,276619,0,0.72,2.5485075338554628,1.486544444497897,35,0.10443930886707101,0.10443930886707101,6.9510162234861898E-4,6.9510162234861898E-4,25,6.0919448862162801E-2,6.0919448862162801E-2,2.8430700747147198E-4,2.8430700747147198E-4]
[null,"JUN2 Junee Sth","JUNEE","Short Rural",761,10403,143,2.2599999999999998,0.81555072758412639,0.22891261004097377,7,3.3421739274228E-2,3.3421739274228E-2,2.8778831776704101E-4,2.8778831776704101E-4,3,9.3809708097933892E-3,9.3809708097933892E-3,1.38091975057572E-4,1.38091975057572E-4]
[null,"JUN3 Old Junee/Marrar 33/34 Lines","JUNEE","Long Rural",218,208835,0,0.72,0.6512003084008251,1.7459825114443841,30,2.66865642890671E-2,2.66865642890671E-2,1.6826333095250399E-4,1.6826333095250399E-4,10,7.1551370504830597E-2,6.8269655332874199E-2,2.9939268541893802E-4,2.83146570706282E-4]
[null,"JUN4 Junee Nth","JUNEE","Short Rural",1148,18548,2208,3.33,1.0721854362433727,0.45969412560677492,12,4.3938777677142098E-2,4.3938777677142098E-2,4.63014269310683E-4,4.63014269310683E-4,4,1.88385304460893E-2,1.88385304460893E-2,1.2996891770124399E-4,1.2996891770124399E-4]
[null,"JYE3B2 Kalkite","JINDABYNE","Short Rural",1028,131019,1212,2.6070000000000002,1.3070082410655592,5.9902204173474143,25,7.5072135650416094E-2,7.5072135650416094E-2,1.08848968574792E-3,1.08848968574792E-3,20,0.34406718000521003,0.34406718000521003,9.9333387100236799E-4,9.9333387100236799E-4]
[null,"JYE3B3 Tyrolean","JINDABYNE","Short Rural",441,26073,1725,1.5980000000000001,0,2.008599199932938,0,0,0,0,0,2,0.122615229920237,0.122615229920237,3.7133976486069799E-4,3.7133976486069799E-4]
[null,"KEW3B1 Herons Ck","PORT MACQUARIE","Short Rural",245,42448,1132,2.0957814771583414,0.61216467978688205,1.148029398121327,9,2.97837700153584E-2,2.76671333556524E-2,4.2239898252904401E-4,1.5781940006579699E-4,13,5.5855302818874998E-2,5.5855302818874998E-2,3.4697059279171501E-4,3.4697059279171501E-4]
[null,"KEW3B2 Lorne","PORT MACQUARIE","Short Rural",493,79211,242,0.72399723756379064,2.0149299253702813,4.9496142255261519,19,0.14095477255729499,0.136740066226126,2.0458500170294101E-3,1.51901172563329E-3,43,0.34625112199729702,0.34625112199729702,1.23354428139663E-3,1.23354428139663E-3]
[null,"KEW3B3 Middle Brother","PORT MACQUARIE","Short Rural",416,39949,1337,0.95262794416288255,2.0412840050844361,1.5300931944644751,13,0.13820917917085601,0.134597899957586,1.55730613888455E-3,1.1058962372257699E-3,9,0.103597992212309,0.103597992212309,5.5120746346509905E-4,5.5120746346509905E-4]
[null,"KIN12I2 BH3 SWER","BROKEN HILL","Short Rural",7,20205,0,0.1,0.32678235839841857,0.40482968905345068,3,5.2231258801187603E-3,5.2231258801187603E-3,1.97274250082246E-5,1.97274250082246E-5,3,6.4705954026976703E-3,6.4705954026976703E-3,2.7850482364552401E-5,2.7850482364552401E-5]
[null,"KIS7681 Bellangry","PORT MACQUARIE","Short Rural",472,84442,16,0.80020747309682139,3.5196208518940049,2.2020214616099973E-2,21,0.24075233436360799,0.240469187792901,2.21643422151229E-3,2.21411334798191E-3,2,1.50624692121621E-3,1.50624692121621E-3,6.96262059113809E-6,6.96262059113809E-6]
[null,"KIS7682 Pappinbarra","PORT MACQUARIE","Short Rural",490,163151,17,0.68589211979727527,4.2546978483047226,1.1357145077560682,35,0.30978091534091601,0.30966951341145799,1.8137626639914699E-3,1.81144179046109E-3,4,8.2690403013886402E-2,8.2690403013886402E-2,4.2936160312018201E-4,4.2936160312018201E-4]
[null,"KIS7683 Water Pumping Stn","PORT MACQUARIE","Urban",1,109,28,1.6004149461936428,0,0,0,0,0,0,0,0,0,0,0,0]
[null,"KKN3B1 Coaldale","GRAFTON","Short Rural",480,147533,644,1.91,4.3785902143140847,0.32538729016633006,56,0.31661936919817901,0.31271101817301999,3.0531091292140501E-3,3.0473069453881099E-3,8,2.3529015850986001E-2,2.3529015850986001E-2,1.21845860344917E-4,1.21845860344917E-4]
[null,"KKN3B2 Junction Hill","GRAFTON","Urban",363,4362,1595,0.81,0.69053432580351759,0.89646995363633086,3,5.53551545730782E-2,5.53551545730782E-2,5.0362955609232205E-4,5.0362955609232205E-4,2,7.1863527994666596E-2,7.1863527994666596E-2,1.93792939786677E-4,1.93792939786677E-4]
[null,"KOO1707 Red Hill Rd","WAGGA WAGGA","Short Rural",973,3699,5209,1.52,0,0,0,0,0,0,0,0,0,0,0,0]
[null,"KOO1708 Vincent Rd","WAGGA WAGGA","Short Rural",820,42029,1930,3.24,2.3684648889436195,1.0085959440693515,16,0.18512215627718001,0.176951521013479,1.9866677420047399E-3,1.92980634051044E-3,6,7.8833111206395898E-2,7.8833111206395898E-2,2.9475093835817901E-4,2.9475093835817901E-4]
[null,"KOO1709 Cochrane St","WAGGA WAGGA","Short Rural",1258,7608,1507,3.99,0.41783344930002975,0.97195456415287618,9,3.2214885038430799E-2,3.2214885038430799E-2,2.9707181188855898E-4,2.9707181188855898E-4,6,7.4937524985654105E-2,4.8078055618573701E-2,4.2007810899866502E-4,3.3768709867019699E-4]
[null,"KOO1711 Kooringal Rd","WAGGA WAGGA","Short Rural",1728,11288,2061,4.75,0.40192616138887688,0.57896600162774126,9,3.55998790824891E-2,3.55998790824891E-2,3.8410456927778498E-4,3.8410456927778498E-4,6,5.1280861090497197E-2,5.1280861090497197E-2,1.6130071036136599E-4,1.6130071036136599E-4]
[null,"KOO1713 Lake Albert","WAGGA WAGGA","Short Rural",987,101478,2242,2.855,1.6912876926415075,0.7556393906225759,29,0.14299249951696799,0.142570100534439,1.53873915064152E-3,1.53757871387633E-3,5,6.3886685670752799E-2,4.46826176436287E-2,2.4949390451578198E-4,1.6826333095250399E-4]
[null,"KOO1714 Plumpton Rd","WAGGA WAGGA","Short Rural",1068,68366,6522,3.5,0.90637585632469619,2.6845126766013108,7,4.5274440393875501E-2,4.5274440393875501E-2,4.3632422371132001E-4,4.3632422371132001E-4,13,0.13409427040149399,0.13409427040149399,4.3864509724169998E-4,4.3864509724169998E-4]
[null,"KOR22 The Lakes","TOOLEYBUC","Short Rural",54,68360,0,0.60324,0.31597582293290533,4.8736192724180095E-2,4,8.6069594874118704E-3,8.6069594874118704E-3,3.8294413251259502E-5,3.8294413251259502E-5,1,1.327539659377E-3,1.327539659377E-3,1.50856779474659E-5,1.50856779474659E-5]
[null,"KOR23 Speewa","TOOLEYBUC","Short Rural",303,178877,2654,1.7078199999999999,0.24310590048279654,7.761655070842183,10,8.0812816327809501E-3,8.0812816327809501E-3,3.7133976486069797E-5,3.7133976486069797E-5,45,0.25801151037227399,0.25782235917954799,9.6200207834224599E-4,9.6084164157705595E-4]
[null,"KOR24 Tooleybuc","TOOLEYBUC","Long Rural",640,206103,39,2.4657100000000001,0.19405064920920154,2.2159790746917198,20,6.8117638116634398E-3,6.8117638116634398E-3,6.38240220854325E-5,6.38240220854325E-5,13,7.7787557680959907E-2,6.8469250456486802E-2,2.7270263981957503E-4,2.41370847159454E-4]
[null,"KPT17 Keepit No.1","GUNNEDAH","Short Rural",1,35,0,0.21529391538081147,0,0,0,0,0,0,0,0,0,0,0,0]
[null,"KPT28 Keepit No.2","GUNNEDAH","Short Rural",13,9202,0,0.22291493893411449,0.19784090793949999,6.3889907885049608E-3,2,3.1621901851418802E-3,3.1621901851418802E-3,1.50856779474659E-5,1.50856779474659E-5,3,1.02118435336692E-4,3.8294413251259502E-5,3.8294413251259502E-5,1.27648044170865E-5]
[null,"KTE3B3 Bushland Dr West","TAREE","Short Rural",537,21796,1495,1.2384163274117472,1.0271400933283303,3.5555791744299473E-2,8,8.2700846944773101E-2,8.2700846944773101E-2,8.9353630919605505E-4,8.9353630919605505E-4,2,2.8627974997229499E-3,2.8627974997229499E-3,1.50856779474659E-5,1.50856779474659E-5]
[null,"KTE3B4 Kundle Kundle","TAREE","Short Rural",630,31112,1744,1.6194675050769001,0.54389097293181388,0.38210959215766827,8,4.5859300523531002E-2,4.5859300523531002E-2,4.9550649873599396E-4,4.9550649873599396E-4,3,3.2218366348726303E-2,3.2218366348726303E-2,1.6710289418731401E-4,1.6710289418731401E-4]
[null,"KTE3B5 High St","TAREE","Short Rural",877,6396,970,2.324412183757433,1.2848748878344449,1.3372940464467846,3,4.30928192753188E-2,4.30928192753188E-2,9.7592731952452297E-4,9.7592731952452297E-4,3,4.4850880974581203E-2,4.4850880974581203E-2,1.86830319195539E-4,1.86830319195539E-4]
[null,"KTE3B6 Cundletown","TAREE","Short Rural",1498,35464,1857,3.3532503634533466,7.7979323396855689,2.280044910696867,19,0.48498946033307999,0.476112119079379,5.3809452801845603E-3,5.2765059713174804E-3,6,0.141806533142944,0.141806533142944,3.9919024722525102E-4,3.9919024722525102E-4]
[null,"KTE3B7 Ronald Rd","TAREE","Urban",416,2194,871,1.0478907385791707,0.75284757269389502,0,2,5.0571834226966303E-2,5.0571834226966303E-2,3.4000797220057701E-4,3.4000797220057701E-4,0,0,0,0,0]
[null,"KTE3B8 Bushland Dr East","TAREE","Short Rural",1260,5499,2937,2.3625173015239485,0.93571219920955817,1.1067058336045481,8,8.1332691998614398E-2,8.1332691998614398E-2,1.9460524552231001E-3,1.9460524552231001E-3,1,9.6195566087163897E-2,9.6195566087163897E-2,2.3672910009869499E-4,2.3672910009869499E-4]
[null,"KTL3B1 Kootingal","TAMWORTH","Short Rural",573,136409,107,1.928118958985674,7.394193410282357,0.36226603363849275,42,0.47463604351405803,0.47279675124123199,2.0307643390819401E-3,2.0238017184908098E-3,5,2.3253992337636E-2,2.3253992337636E-2,1.69423767717694E-4,1.69423767717694E-4]
[null,"KTL3B2 Moonbi","TAMWORTH","Short Rural",895,70204,105,2.2100968304578874,12.723115677490267,0.36078738991394943,38,0.97232184249507803,0.97147008190942896,3.6762636721209101E-3,3.67394279859053E-3,4,2.75719775409068E-2,2.75719775409068E-2,7.8909700032898402E-5,7.8909700032898402E-5]
[null,"KTL3B3 Tintinhull","TAMWORTH","Short Rural",298,39056,956,0.92214384994967036,4.3846047377670221,0.13861232713579838,22,0.278203110086574,0.278203110086574,1.19989161520613E-3,1.19989161520613E-3,3,8.7949502433725991E-3,8.7949502433725991E-3,3.4813102955690502E-5,3.4813102955690502E-5]
[null,"KTL3B4 Porcupine Lane","TAMWORTH","Short Rural",554,84026,1416,1.977655612082144,5.2232622410265233,0.70730067169118194,52,0.48658041913815497,0.475146635690741,2.0690587523332E-3,2.0110369140737198E-3,7,6.58895995274702E-2,2.9739673418281199E-2,3.2840360454868E-4,2.17001675090471E-4]
[null,"KYG3B1 Nth Kyogle No.1","KYOGLE","Long Rural",1063,219384,231,1.64,1.8685598024044858,2.1302957772851414,43,0.14150714045752499,0.14070759952631001,2.6980154790660102E-3,2.69221329524006E-3,26,0.16132856084373001,0.16132856084373001,6.1271061202015204E-4,6.1271061202015204E-4]
[null,"KYG3B2 Kyogle Town No.1","KYOGLE","Urban",535,4710,142,1.99,1.7586269647349568,0.41156977081045487,6,6.0270764710421698E-2,6.0270764710421698E-2,1.27996175200422E-3,1.27996175200422E-3,1,1.4105108880880599E-2,1.4105108880880599E-2,6.38240220854325E-5,6.38240220854325E-5]
[null,"KYG3B3 Kyogle Town No.2","KYOGLE","Short Rural",490,9582,210,0.88,1.316980815562512,3.5409787536435235E-2,7,0.103324129135724,0.103324129135724,1.9390898346319601E-3,1.9390898346319601E-3,1,2.7780856158641002E-3,2.7780856158641002E-3,6.96262059113809E-6,6.96262059113809E-6]
[null,"KYG3B4 Nth Kyogle No.2","KYOGLE","Short Rural",602,188612,1632,1.34,2.3829276469703826,0.12979387274773682,40,0.13471046232380901,0.13441455094868601,1.7406551477845201E-3,1.73833427425414E-3,4,7.3374416662943601E-3,7.3374416662943601E-3,2.9010919129742099E-5,2.9010919129742099E-5]
[null,"KYG3B5 Casino Rd","KYOGLE","Long Rural",637,207022,43,1.62,2.6241338228592475,0.80675399946742188,51,0.17120271727872899,0.15565518549871801,1.67915199922947E-3,1.6269323447959301E-3,6,5.2633930358708399E-2,5.2633930358708399E-2,1.3925241182276201E-4,1.3925241182276201E-4]
[null,"KYG3B6 Bentley","KYOGLE","Short Rural",233,82381,0,0.5,0.59722973415568348,0,15,4.2228293885252503E-2,4.1931222073364E-2,4.7809994725814899E-4,4.7577907372777E-4,0,0,0,0,0]
[null,"KYW2198 Kywong Nth","NARRANDERA","Short Rural",39,41937,97,0.28999999999999998,6.9025340337107582E-2,0.51896401015197868,8,2.0748609361591502E-3,1.2706782578826999E-3,5.1059217668346001E-5,1.27648044170865E-5,11,1.55997514344449E-2,1.48338631694197E-2,5.8021838259484103E-5,5.5700964729104699E-5]
[null,"KYW2199 Kywong Sth","NARRANDERA","Short Rural",63,102684,98,0.2,0.60039000698443756,0.59154819843360873,10,3.3489044606609002E-2,3.0541535223027199E-2,2.0887861773414299E-4,8.9353630919605497E-5,5,3.2995858981403399E-2,3.2995858981403399E-2,1.6014027359617601E-4,1.6014027359617601E-4]
[null,"LCO22 Lake Cargelligo","LAKE CARGELLIGO","Long Rural",1247,777097,374,2.25,23.351317406238774,8.3685638610195348,107,0.95300637253849596,0.94728309841258096,9.2672480068048003E-3,9.2034239847193708E-3,26,0.34153510698356598,0.34117769245988799,1.9332876508060101E-3,1.9321272140408201E-3]
[null,"LCO32 Brotherony","LAKE CARGELLIGO","Short Rural",229,195991,130,0.48,4.0522161475144465,3.9627291976321972,36,0.16521022182329001,0.164064870736048,1.1813246269631E-3,1.15927632842449E-3,18,0.161561808633534,0.15034734773474001,6.6725113998406698E-4,6.31277600263187E-4]
[null,"LEE3B1 Stony Pt","LEETON","Short Rural",3,15563,138,4.17,2.3147646030924091E-2,0,1,3.1679923689678299E-4,3.1679923689678299E-4,3.4813102955690501E-6,3.4813102955690501E-6,0,0,0,0,0]
[null,"LEE3B2 Parkview","LEETON","Urban",787,9075,400,2.69,1.1586893123180479,4.5634502527248317,12,8.8492586839834797E-2,8.47954353059404E-2,7.8097394297265603E-4,7.1250817382646498E-4,16,0.34852441762030401,0.34852441762030401,1.1708806960763899E-3,1.1708806960763899E-3]
[null,"LEE3B3 Leeton CBD","LEETON","Urban",909,4850,519,2.86,0.13811881582992097,2.089297427659734,3,4.7218171975568204E-3,4.7218171975568204E-3,4.9898780903156303E-5,4.9898780903156303E-5,4,7.1426043334190101E-2,7.1426043334190101E-2,2.6574001922843703E-4,2.6574001922843703E-4]
[null,"LEE3B4 Industrial Estate","LEETON","Urban",67,0,0,2.19,1.0342075274073048,1.7522063042048399,3,1.49348211679912E-2,1.49348211679912E-2,1.4737546917908999E-4,1.4737546917908999E-4,2,2.5303323664960999E-2,2.5303323664960999E-2,6.9626205911380896E-5,6.9626205911380896E-5]
[null,"LEE3B5 Wamoon","LEETON","Short Rural",1064,135086,876,0,4.3308614277689212,9.3917675090072699,43,0.20507006427079,0.194347628560438,1.59792142566619E-3,1.55846657564974E-3,29,0.444708379339816,0.444708379339816,1.3484275211504101E-3,1.3484275211504101E-3]
[null,"LEE3B6 Calrose St","LEETON","Urban",240,2648,834,4.8600000000000003,2.6125477823267781E-2,0.68836015484175206,3,1.7394947110193301E-3,1.7394947110193301E-3,3.0171355894931699E-5,3.0171355894931699E-5,1,4.5832610477931697E-2,4.5832610477931697E-2,1.05599745632261E-4,1.05599745632261E-4]
[null,"LEE3B7 Corbie Hill","LEETON","Short Rural",739,57690,810,3.49,2.5329302157830571,4.716589704301362,17,0.136222511428852,0.13420335145742199,1.2033729255017001E-3,1.1975707416757499E-3,17,0.25366103293957798,0.17989438864999999,9.1906591803022795E-4,6.9858293264418898E-4]
[null,"LEE3B8 Leeton Nth","LEETON","Urban",895,8142,1868,2.88,0.61557771293813046,3.1701152303334679,9,3.44208753290563E-2,3.44208753290563E-2,3.6437714426955999E-4,3.6437714426955999E-4,7,0.17726135762978501,0.176916707910523,6.4636327821065303E-4,6.45202841445463E-4]
[null,"LGR8B1 M46 Lightning Ridge","WALGETT","Short Rural",374,11826,0,1.2384163274117472,0.48091224239532493,5.1599515956235908,2,1.8220017650243201E-2,1.8220017650243201E-2,5.4540527963915103E-5,5.4540527963915103E-5,15,0.19549181921091499,0.194034310633836,7.4035865619101698E-4,7.3107516206950005E-4]
[null,"LGR8B2 M34 Goodooga","WALGETT","Long Rural",390,390656,621,0.91452282639636728,1.7005970521166478,2.5854778645130674,9,6.7678993019392605E-2,6.7478237459014795E-2,2.9707181188855898E-4,2.9591137512336899E-4,13,0.102894767532604,0.102362127057382,3.7714194868664698E-4,3.75981511921457E-4]
[null,"LGR8B3 M45 Lightning Ridge Town","WALGETT","Short Rural",509,16352,0,1.1126694387822467,3.3964071216074372E-2,3.2336716969424941,4,1.8079604801655199E-3,1.8079604801655199E-3,4.6417470607587298E-6,4.6417470607587298E-6,8,0.17213338756441099,0.17213338756441099,5.8253925612521996E-4,5.8253925612521996E-4]
[null,"LHD3B3 Dufficys Ln","BALLINA","Short Rural",165,7256,3008,0.37,0.37623491848089252,0,3,3.36839979831609E-2,3.36839979831609E-2,3.5973539720880098E-4,3.5973539720880098E-4,0,0,0,0,0]
[null,"LHD3B4 Knockrow","BALLINA","Short Rural",548,64308,3279,1.1300000000000001,4.7247743411864001,2.4424997468023055,46,0.30677654455584003,0.271061782233597,1.8868701801984199E-3,1.39832630205357E-3,17,0.158589930077883,0.158589930077883,5.0362955609232205E-4,5.0362955609232205E-4]
[null,"LHD3B5 Lennox West","BALLINA","Short Rural",639,7998,3589,1.1499999999999999,4.3611007520381415E-3,0,4,3.8178369574740501E-4,3.8178369574740501E-4,4.6417470607587298E-6,4.6417470607587298E-6,0,0,0,0,0]
[null,"LHD3B6 Lennox Central","BALLINA","Short Rural",1458,6486,6888,2.46,4.7470830167487046,0.88174784074250412,12,0.29824153214787003,0.29824153214787003,2.2303594626945701E-3,2.2303594626945701E-3,3,5.5396930296624999E-2,5.5396930296624999E-2,4.4096597077207902E-4,4.4096597077207902E-4]
[null,"LHD3B7 Tintenbar","BALLINA","Short Rural",348,25785,5531,0.69000000000000006,3.4618012195598107,2.9273027994495022,21,0.26402373325272199,0.26402373325272199,1.9321272140408201E-3,1.9321272140408201E-3,11,0.22325875012837301,0.22325875012837301,6.76534634105585E-4,6.76534634105585E-4]
[null,"LHD3B8 Midgen Flat","BALLINA","Short Rural",15,6323,1414,0.02,2.8271596983494126E-2,0,4,8.0186180474606998E-4,8.0186180474606998E-4,9.2834941215174595E-6,9.2834941215174595E-6,0,0,0,0,0]
[null,"LIU3B3 East Lismore","LISMORE","Short Rural",1095,5186,2044,1.68,1.9512474789016023,0.67566020305676067,8,0.117829588700595,0.117829588700595,1.47839643885166E-3,1.47839643885166E-3,4,4.0800956664069202E-2,4.0800956664069202E-2,1.62461147126555E-4,1.62461147126555E-4]
[null,"LIU3B4 Base Hospital","LISMORE","Urban",811,4740,854,3.4699999999999998,9.680743027054314E-3,2.0811030072418575,3,7.4383996648658601E-4,7.4383996648658601E-4,2.0887861773414299E-5,2.0887861773414299E-5,4,0.15990586536960799,0.15990586536960799,4.7229776343220102E-4,4.7229776343220102E-4]
[null,"LIU3B5 Lismore Heights","LISMORE","Short Rural",1962,11335,3881,2.48,0.64457828420482466,3.4543750092203118,7,5.8027640443309998E-2,5.8027640443309998E-2,2.3556866333350498E-3,2.3556866333350498E-3,10,0.31097732564582697,0.30672316446464098,9.3995377980364201E-4,8.4943971211884697E-4]
[null,"LIU3B6 Cynthia Wilson","LISMORE","Urban",1180,5767,3778,1.66,0.65591701094215482,0.60823672403654283,6,5.6527195705919797E-2,3.9594102428272E-2,3.4464971926133602E-4,2.7038176628919598E-4,6,5.24180891203831E-2,4.8856708688015997E-2,5.3960309581320203E-4,4.3168247665056197E-4]
[null,"LIU3B7 University","LISMORE","Urban",246,2441,2630,3.21,0.36899369138232707,1.1168089932879128E-3,3,2.3004498433120298E-2,2.3004498433120298E-2,1.7754682507402101E-4,1.7754682507402101E-4,1,6.9626205911380896E-5,6.9626205911380896E-5,1.1604367651896799E-6,1.1604367651896799E-6]
[null,"LIU3B8 Lismore Square No.1","LISMORE","Urban",855,5016,2265,3.76,0,1.4016246275382092,0,0,0,0,0,3,7.3563567855669504E-2,7.3563567855669504E-2,2.1584123832528099E-4,2.1584123832528099E-4]
[null,"LIU3B9 Tanalawn","LISMORE","Short Rural",364,4967,4229,0.84,0.1587529362444115,0,1,1.0918549523669699E-2,1.0918549523669699E-2,1.12562366223399E-4,1.12562366223399E-4,0,0,0,0,0]
[null,"LKC7781 Cathie Sth","PORT MACQUARIE","Short Rural",1080,8112,2035,2.0005186827420531,3.2588239209220244,2.8491204064714387E-3,7,0.23891536296431201,0.23891536296431201,4.0174320810866804E-3,4.0174320810866804E-3,3,2.0887861773414299E-4,2.0887861773414299E-4,3.4813102955690501E-6,3.4813102955690501E-6]
[null,"LKC7782 Bonny Hills","PORT MACQUARIE","Short Rural",100,4043,586,0.4953665309646989,0.31166849848432049,0,6,1.8426575394447E-2,1.8426575394447E-2,4.0615286781638902E-4,4.0615286781638902E-4,0,0,0,0,0]
[null,"LKC7784 Cathie Nth","PORT MACQUARIE","Short Rural",1721,18234,4742,2.5720954492397827,3.2434441869248674,2.5553861572318883,9,0.270977070349738,0.270977070349738,4.7067315196093499E-3,4.7067315196093499E-3,8,0.21349251431253699,0.21349251431253699,1.7545803889667999E-3,1.7545803889667999E-3]
[null,"LOC3781 Boree Ck","LOCKHART","Short Rural",126,128016,0,0.32,0.16510705158052449,0.70268429996681125,11,8.2657910784461105E-3,8.2657910784461105E-3,1.7406551477845201E-4,1.7406551477845201E-4,6,3.5178640536725203E-2,3.5178640536725203E-2,1.31129354466434E-4,1.31129354466434E-4]
[null,"LOC3786 Urana","LOCKHART","Long Rural",553,607243,0,1.5,2.4129659221095854,3.6985388685902363,55,0.12906493746116199,0.116563552189773,1.01422173277578E-3,9.3879334303845305E-4,50,0.19782777841924101,0.19490463820772899,8.6916713712707197E-4,8.5640233270998503E-4]
[null,"LOC3794 Lockhart","LOCKHART","Long Rural",784,301394,494,2.14,2.6845233222619305,2.5693565223115065,37,0.122210237489186,0.122210237489186,7.4383996648658601E-4,7.4383996648658601E-4,25,0.116967384184059,0.116967384184059,5.0130868256194295E-4,5.0130868256194295E-4]
[null,"LRN3B1 Alma St","PORT MACQUARIE","Short Rural",242,6632,159,0.57157676649772937,5.5128854939805336E-2,0,2,2.5518004466521102E-3,3.6089583397399101E-4,2.7502351334995499E-4,1.1604367651896799E-6,0,0,0,0,0]
[null,"LRN3B3 Lake St","PORT MACQUARIE","Urban",537,2159,1043,0.99073306192939781,0.77640895860396608,1.2783004460854661,3,3.33683591830293E-2,2.8568792722204799E-2,7.5428389737329299E-4,1.5433808977022799E-4,2,5.4938557774375098E-2,5.4938557774375098E-2,1.7058420448288301E-4,1.7058420448288301E-4]
[null,"LRN3B4 The Parade","PORT MACQUARIE","Urban",955,5054,194,1.4289419162443238,0.12976464619653716,4.5917235095040455E-2,3,9.0119519184630702E-3,3.5973539720880098E-4,1.0838479386871601E-3,2.3208735303793598E-6,2,3.1888802307412502E-3,3.1888802307412502E-3,4.6417470607587303E-5,4.6417470607587303E-5]
[null,"LRN3B5 Kew Rd","PORT MACQUARIE","Short Rural",1587,17480,5587,2.667358243656071,3.0448896358741599,0.59729407523282352,13,0.25971619198033802,0.24543817802144399,5.6803379656034901E-3,3.8955862207417599E-3,5,5.0946655302122598E-2,5.0946655302122598E-2,1.8334900889997E-4,1.8334900889997E-4]
[null,"LRN3B6 Dunbogan","PORT MACQUARIE","Short Rural",1096,14768,9312,1.7147302994931886,2.1028291688186931,1.0088357801585388,7,0.123360230323489,0.113501159566438,3.9037092780980901E-3,2.6713254334666502E-3,4,5.9182275024673797E-2,5.9182275024673797E-2,7.2759385177393102E-4,7.2759385177393102E-4]
[null,"MAH3B1 Tathra 2","BEGA","Short Rural",1193,108703,3677,2.762,4.6703980878348634,7.9032433460157945,26,0.32052539934980701,0.166010923191271,4.54891211954355E-3,3.1935219778020099E-3,17,0.54239278579671801,0.54239278579671801,1.92168328315411E-3,1.92168328315411E-3]
[null,"MAH3B2 Bega","BEGA","Urban",836,5400,918,4.1909999999999998,3.4059007608355358,4.6529355660811982,7,0.10852288584377399,4.0139507707911103E-3,1.84973620371235E-3,9.3299115921250395E-4,6,0.14825740112063401,0.14825740112063401,5.4888658993471995E-4,5.4888658993471995E-4]
[null,"MAH3B3 Glebe","BEGA","Short Rural",1410,40042,2677,3.2189999999999999,5.0963683284505388,8.3332756719429799,15,0.29053855290054098,0.109566118495679,4.7995664608245303E-3,3.2120889660450401E-3,19,0.47507120730100399,0.47050140731968698,1.5805148741883501E-3,1.5677500697712601E-3]
[null,"MAH3B4 Nth Bega","BEGA","Short Rural",600,181822,680,3.048,17.079009404456851,13.942433981662889,51,0.31267504463329898,0.23660841467511501,2.4589655054369402E-3,1.79171436545287E-3,45,0.25525199174465302,0.25525199174465302,8.9237587243086501E-4,8.9237587243086501E-4]
[null,"MAH3B5 Factory","BEGA","Urban",251,2614,951,2.4950000000000001,2.3406170279128906,0.48919519681653317,4,4.7460703259492802E-2,1.50717527062836E-2,6.8001594440115403E-4,3.9338806339930203E-4,2,9.9194134688413999E-3,9.9194134688413999E-3,6.38240220854325E-5,6.38240220854325E-5]
[null,"MAH3B6 Tathra 1","BEGA","Short Rural",950,42104,309,1.657,2.8369704984548538,0.3088919955702974,8,0.17795413837860299,5.5217062598020603E-2,2.5309125848786999E-3,1.44474377266115E-3,3,1.93758126683721E-2,1.93758126683721E-2,1.2996891770124399E-4,1.2996891770124399E-4]
[null,"MAH3B7 Candelo","BEGA","Short Rural",765,163970,1257,1.829,5.5740646855882829,7.3333543194791071,69,0.29909445317028399,0.20546809408125,2.6550793187539901E-3,1.8265274684085601E-3,44,0.39349482358170002,0.39349482358170002,2.0481708905597902E-3,2.0481708905597902E-3]
[null,"MAR5515 Binalong","YASS","Long Rural",708,288304,359,1.47,1.0713076169817111,0.99049161140811737,38,4.3902804137421203E-2,4.3902804137421203E-2,3.2492229425311098E-4,3.2492229425311098E-4,12,4.0590917609569899E-2,4.0590917609569899E-2,2.5529608834173E-4,2.5529608834173E-4]
[null,"MBL112 Mumbil","WELLINGTON","Short Rural",176,37809,0,0.47250346030478974,0.11459397644252191,2.2896576159408668,5,5.62579743763958E-3,5.62579743763958E-3,8.5872320624036497E-5,8.5872320624036497E-5,9,0.112406867696864,0.112406867696864,3.6089583397399101E-4,3.6089583397399101E-4]
[null,"MBL122 Stuart Town","WELLINGTON","Long Rural",365,231814,0,0.6782710962439723,0.89244445785392534,6.7661139399685357,28,4.6900212301906198E-2,3.2631481837133901E-2,5.4772615316953002E-4,5.1987567080497802E-4,40,0.35557639184236201,0.35557639184236201,9.9565474453274698E-4,9.9565474453274698E-4]
[null,"MBL142 Neurea","WELLINGTON","Short Rural",62,46560,0,0.28578838324886469,0.11323989225771632,7.5878185719319632E-2,7,5.4621758537478299E-3,5.4621758537478299E-3,2.4369172068983299E-5,2.4369172068983299E-5,2,3.66001755740826E-3,3.66001755740826E-3,2.5529608834173001E-5,2.5529608834173001E-5]
[null,"MBM6212 Euroka Ave","YASS","Long Rural",619,248611,4361,2.4380000000000002,0.76370252894263069,3.1873984191707523,45,4.6501022054680902E-2,4.6345523528145499E-2,6.9394118558343003E-4,6.9278074881823999E-4,22,0.19407724679414801,0.19407724679414801,8.2042879298910504E-4,8.2042879298910504E-4]
[null,"MBM6222 Patemans Ln","YASS","Long Rural",1208,264461,14061,4.0389999999999997,4.2226389545102592,5.6360069941885644,64,0.30665701956902502,0.30665701956902502,3.35482268816337E-3,3.35482268816337E-3,19,0.40929881188681799,0.40929881188681799,2.0238017184908098E-3,2.0238017184908098E-3]
[null,"MCR3B1 Paterson","DUNGOG","Short Rural",553,76793,1388,1.9624135649755379,46.194848256583576,0.31483253452891408,55,2.7838970831841698,0.41216741157036701,4.7589511740428903E-3,3.5520969382456199E-3,7,1.8973141110851299E-2,1.8973141110851299E-2,8.9353630919605497E-5,8.9353630919605497E-5]
[null,"MCR3B3 Hilldale","DUNGOG","Short Rural",202,40522,78,0.57157676649772937,7.3031889545125006,3.6496292531471504,9,0.54983466677187998,7.9431896577233704E-3,6.9858293264418898E-4,2.4369172068983299E-4,5,0.274769377698378,0.274769377698378,7.51963023842914E-4,7.51963023842914E-4]
[null,"MCR3B4 Vacy","DUNGOG","Short Rural",224,27731,78,0.59062932538098711,25.377975514439829,3.0073200263366391,26,1.50160981590251,7.2487842974338704E-2,1.3704758196890099E-3,7.3803778266063799E-4,12,0.177942534010951,0.177942534010951,5.6165139435180602E-4,5.6165139435180602E-4]
[null,"MCV3B10 Warrell Ck","NAMBUCCA HEADS","Short Rural",618,102481,3048,0.83831259086333665,4.4233308764264985,3.0059618675567972,29,0.33800505834385902,0.33314282829771502,2.3452427024483499E-3,2.3057878524318999E-3,14,0.22969801373841101,0.22969801373841101,1.0792061916263999E-3,1.0792061916263999E-3]
[null,"MCV3B2 Taylors Arm West","NAMBUCCA HEADS","Short Rural",524,167636,1111,0.47631397208144127,2.3049286996165312,14.380789037741062,46,0.18855936997567099,0.18805109867251801,2.0992301082281301E-3,2.09690923469775E-3,20,1.17644963211253,1.17644963211253,3.1122914042387298E-3,3.1122914042387298E-3]
[null,"MCV3B3 Industrial","NAMBUCCA HEADS","Short Rural",228,3260,2544,0.64778700203076001,0.26870877724916992,1.9592197281799608,3,7.5625663987411596E-3,7.5625663987411596E-3,5.5700964729104699E-5,5.5700964729104699E-5,3,5.5140473771518102E-2,5.5140473771518102E-2,1.7174464124807299E-4,1.7174464124807299E-4]
[null,"MCV3B4 Bowraville Town","NAMBUCCA HEADS","Short Rural",702,47902,2787,2.2482019482244029,1.4357302180097831,1.0633214112315714,20,8.2183292147498505E-2,8.2183292147498505E-2,6.7537419734039496E-4,6.7537419734039496E-4,6,6.0866068770964003E-2,6.0866068770964003E-2,2.23964295681609E-4,2.23964295681609E-4]
[null,"MCV3B5 Scotts Head","NAMBUCCA HEADS","Short Rural",993,44381,3274,1.3146265629447778,2.402052293754763,1.9216974262701756,13,0.18050942013555099,0.180117192508917,2.0911070508718098E-3,2.0887861773414302E-3,14,0.144411713680795,0.144411713680795,1.1511532710681599E-3,1.1511532710681599E-3]
[null,"MCV3B6 Macksville Town No.1","NAMBUCCA HEADS","Short Rural",371,5595,2005,0.72399723756379064,0.71419375272834462,2.1205818906642508,3,2.1096740391148401E-2,2.0383071780556799E-2,4.6417470607587299E-4,4.5837252224992399E-4,4,6.2640376584938998E-2,6.2640376584938998E-2,2.14680801560091E-4,2.14680801560091E-4]
[null,"MCV3B7 Macksville Town No.2","NAMBUCCA HEADS","Urban",698,5409,1224,2.0957814771583414,0.44870210950241335,6.1732877076366412E-2,2,2.27480419080133E-2,2.27480419080133E-2,1.4621503241390001E-4,1.4621503241390001E-4,2,3.12969795571657E-3,3.12969795571657E-3,1.6246114712655499E-5,1.6246114712655499E-5]
[null,"MCV3B8 Macksville Nth","NAMBUCCA HEADS","Short Rural",566,32090,1979,2.7054633614225865,3.1278472699414688,2.0401853492654558,13,0.218201566705677,0.218201566705677,2.7154220305438599E-3,2.7154220305438599E-3,25,0.14232524837698399,0.14102555919997201,5.8834143995116896E-4,5.7673707229927195E-4]
[null,"MCV3B9 Bowraville Rural","NAMBUCCA HEADS","Long Rural",755,224780,3627,1.0478907385791707,4.3189267258618838,4.7427785561481723,71,0.35733677441515399,0.33886610242363002,2.4972599186882001E-3,2.3835371156996099E-3,70,0.39240517345918702,0.388974922381286,1.4818777491472201E-3,1.47143381826052E-3]
[null,"MDA12 Mill","MOLONG","Urban",1,1521,739,7.4,0,5.0534787671907576E-2,0,0,0,0,0,1,6.9162031205305104E-4,6.9162031205305104E-4,1.1604367651896799E-6,1.1604367651896799E-6]
[null,"MDA22 Sth","MOLONG","Short Rural",172,92643,558,0.97299999999999998,2.4618307902965535,1.3711300392853261,32,3.3434504078645101E-2,3.3214021093259098E-2,2.8778831776704101E-4,2.8546744423666202E-4,12,1.8621528770998801E-2,1.8621528770998801E-2,1.1140192945820901E-4,1.1140192945820901E-4]
[null,"MDA42 West","MOLONG","Short Rural",421,137781,347,2.431,1.0306489459070856,3.0173297194655415,39,5.1034848496276999E-2,5.1034848496276999E-2,4.0847374134676801E-4,4.0847374134676801E-4,21,0.14940971482846699,0.14828177029270301,6.9394118558343003E-4,6.8349725469672295E-4]
[null,"MDA52 Monument","MOLONG","Short Rural",430,160350,743,1.248,1.9623528918617383,2.1609889756265024,47,9.9783636565130396E-2,9.9783636565130396E-2,1.53177653005038E-3,1.53177653005038E-3,14,0.109884078169341,0.10935607944118,3.3420578837462802E-4,3.2608273101830101E-4]
[null,"MDI3B1 Ardglen","QUIRINDI","Long Rural",290,229087,102,0.98997095957406744,0.72551794818700888,3.709195996798385,54,4.56829141352222E-2,4.4680296770098299E-2,4.7461863696258001E-4,4.68816453136632E-4,21,0.23355298467237101,0.23355298467237101,7.2991472530431001E-4,7.2991472530431001E-4]
[null,"MDI3B3 Murrurundi","QUIRINDI","Short Rural",553,24662,47,1.4177009065032016,1.4219347187946063,4.1944573782754899,15,7.7869948691288396E-2,7.7869948691288396E-2,8.3319359740619198E-4,8.3319359740619198E-4,3,0.229702655485472,0.229702655485472,6.4056109438470502E-4,6.4056109438470502E-4]
[null,"MDI3B4 Blandford","QUIRINDI","Short Rural",355,187035,315,0.97663416835578698,0.76127258155985755,2.4346148355955082,16,4.9461296242679802E-2,4.9461296242679802E-2,2.25124732446798E-4,2.25124732446798E-4,6,0.15818145633653599,0.15818145633653599,4.5373077518916601E-4,4.5373077518916601E-4]
[null,"MEN8B1 Menindee","MENINDEE","Short Rural",502,106235,354,0.75,3.6192161571677932,0.70167828084852246,27,0.165228788811533,0.165228788811533,1.20569379903208E-3,1.20569379903208E-3,4,3.2033856903061202E-2,3.2033856903061202E-2,9.0514067684795195E-5,9.0514067684795195E-5]
[null,"MGA3B1 Turners Flat","KEMPSEY","Short Rural",380,134515,0,0.55252420761447185,4.6249715799260382,1.4601587738394781,33,0.30881079020521701,0.30726392799722002,1.7789495610357801E-3,1.76502431985351E-3,13,9.7495255264176295E-2,9.7495255264176295E-2,7.3339603559987904E-4,7.3339603559987904E-4]
[null,"MGA3B2 Willawarrin","KEMPSEY","Long Rural",643,307511,95,0.78115491421356364,4.9559146831012946,8.5617549083805358,67,0.29732014535630902,0.24939062564368,2.5982179172596999E-3,1.8288483419389399E-3,29,0.51364528581267399,0.51351995864203404,2.2396429568160899E-3,2.2384825200508999E-3]
[null,"MGE3B1 Mallanganee/Casino Rd","BONALBO","Short Rural",221,106679,24,0.31,8.8201782076088744,1.1264842278535967,28,0.60099484243879697,0.19626234922300101,1.1430302137118401E-3,9.0978242390871102E-4,22,7.6757089833471501E-2,7.6757089833471501E-2,2.9707181188855898E-4,2.9707181188855898E-4]
[null,"MGE3B2 Bonalbo Rd","BONALBO","Short Rural",52,41689,50,0.44,1.9372347573484607,2.3759293325379238E-2,10,0.126597848898368,3.8824732852951203E-2,1.8218857213477999E-4,1.2300629711010599E-4,2,1.55266439182379E-3,1.55266439182379E-3,6.96262059113809E-6,6.96262059113809E-6]
[null,"MGE3B3 Mallanganee Town","BONALBO","Urban",52,938,51,0.12,3.1640296982581386,0,3,0.12718038815449401,3.2716193720992701E-2,1.65942457422125E-4,1.1140192945820901E-4,0,0,0,0,0]
[null,"MGE3B4 Deep Ck/Tenterfield Rd","BONALBO","Long Rural",491,286400,23,0.61,25.842493895309772,3.3545728718609777,44,1.3887329713157399,0.50438732129999098,2.9417071997558399E-3,2.4311150230723801E-3,20,0.180269209725156,0.180269209725156,5.6281183111699595E-4,5.6281183111699595E-4]
[null,"MGH21 Balpool","MOULAMEIN","Short Rural",9,25543,62,0.62189000000000005,0.25315919060391157,9.6190330102860336E-2,5,7.5161489281335703E-3,7.5161489281335703E-3,3.9454850016449201E-5,3.9454850016449201E-5,2,2.8558348791318101E-3,2.8558348791318101E-3,9.2834941215174595E-6,9.2834941215174595E-6]
[null,"MGI2U23 Boomi Rd","MOREE","Long Rural",212,355509,790,3.0103043035547086,14.367366667816297,0.34501822919305208,51,0.49463733159886702,0.39834660969695801,2.7908504202811902E-3,2.0864653038110501E-3,3,1.18782307284816E-2,1.18782307284816E-2,2.41370847159454E-4,2.41370847159454E-4]
[null,"MGI2U24 Mungindi Town","MOREE","Short Rural",415,7237,0,0.9335753852796248,9.1524344349086473,12.651738806863763,16,0.38482636094573303,0.206048312463845,3.2039659086887098E-3,1.8938328007895599E-3,14,0.53195929884089799,0.53195929884089799,2.2663330024154499E-3,2.2663330024154499E-3]
[null,"MGI2U30 Curragundi","MOREE","Long Rural",178,414331,79,2.2100968304578874,4.666526079496303,2.2349233647680711,42,0.24881736988167599,0.20668655268469899,1.85669882430349E-3,1.47143381826052E-3,27,0.11916525141732801,0.11916525141732801,3.42328845730956E-4,3.42328845730956E-4]
[null,"33kV Tarcutta","WAGGA WAGGA","Short Rural",4,14300,0,0.8,0,2.57116093415641E-2,0,0,0,0,0,1,1.05367658279223E-3,1.05367658279223E-3,2.3208735303793598E-6,2.3208735303793598E-6]
[null,"MGY2221 Lower Tarcutta","WAGGA WAGGA","Short Rural",44,31302,58,0.31,0.25224288988654636,0.28007269385548178,5,1.45147430589925E-2,1.45147430589925E-2,6.38240220854325E-5,6.38240220854325E-5,1,1.6116145794954299E-2,1.6116145794954299E-2,4.2936160312018201E-5,4.2936160312018201E-5]
[null,"MGY2223 Borambula","WAGGA WAGGA","Short Rural",118,108308,0,0.54,0.47827072344809207,0.18707950760670178,11,3.2102322672207403E-2,3.2102322672207403E-2,1.3693153829238199E-4,1.3693153829238199E-4,3,1.2557086236117501E-2,1.2557086236117501E-2,6.8465769146191198E-5,6.8465769146191198E-5]
[null,"MLA3B1 Rushes Ck","BARRABA","Short Rural",108,106913,0,0.47631397208144127,5.1191507586956337,0.27273027667840916,29,0.29141352222149403,8.5905973290227006E-2,7.9025743709417297E-4,5.5584921052585703E-4,2,1.5525483481472801E-2,8.7462118992346297E-3,1.13722802988589E-4,8.7032757389226195E-5]
[null,"MLA3B2 Halls Ck","BARRABA","Short Rural",147,100498,0,0.68589211979727527,5.0838396496769818,0.19736694532736576,26,0.33887306504422099,6.17421985286822E-2,6.2431497967204905E-4,3.0867617954045501E-4,2,1.31558716069554E-2,1.31558716069554E-2,3.1331792660121401E-5,3.1331792660121401E-5]
[null,"MLA3B3 West/Nth Rural","BARRABA","Short Rural",300,187279,0,0.57157676649772937,14.342116976238584,2.8296649031731289,41,0.63191351961051101,5.2422730867443902E-2,1.3089726711339601E-3,6.4868415174103202E-4,35,0.124675005178449,0.12434428070037,4.9318562520561497E-4,4.9202518844042504E-4]
[null,"MLA3B4 Manilla","BARRABA","Short Rural",1138,15791,82,2.4577800959402367,43.776017737390724,3.1254517457489022,15,2.46860293277184,0.235597674252635,5.1163656977213099E-3,2.5935761701989398E-3,9,0.17624945677053899,0.156682172035911,5.5004702669990901E-4,4.9782737226637403E-4]
[null,"MLN3B1 Iluka/Harwood Sugar Mill","MACLEAN","Short Rural",592,26326,2045,1.93,45.54077754843798,6.8759050794228695,10,0.219584807329783,0.21905332729132601,2.7432725129084099E-3,2.7409516393780298E-3,7,3.3153678381469202E-2,3.3153678381469202E-2,9.8637125041123002E-5,9.8637125041123002E-5]
[null,"MLN3B2 Maclean Town","MACLEAN","Urban",790,5333,773,2.92,1.0204576448897966,9.6206056838860749E-4,3,3.6926258305100899E-2,3.6926258305100899E-2,2.9591137512336899E-4,2.9591137512336899E-4,1,3.4813102955690502E-5,3.4813102955690502E-5,1.1604367651896799E-6,1.1604367651896799E-6]
[null,"MLN3B3 Ashby/Tullymorgan","MACLEAN","Short Rural",749,115865,1815,1.1100000000000001,2.4123327656739044,2.7546258675296738,25,0.17898924797315199,0.17837189561407099,1.08616881221754E-3,1.0838479386871601E-3,18,0.20438656701609401,0.20438656701609401,7.1482904735684397E-4,7.1482904735684397E-4]
[null,"MLN3B4 Townsend","MACLEAN","Short Rural",1263,77047,2797,2.86,9.641836490329208,2.6852895472412115,39,0.43803470750321,0.43650641228345499,4.2263106988208203E-3,4.2158667679341203E-3,11,0.121994396250861,0.121994396250861,3.9338806339930203E-4,3.9338806339930203E-4]
[null,"MLN3B5 Woodford Dale-Leigh","MACLEAN","Short Rural",777,113326,3991,1.19,8.5232601275718274,3.9727930894365802,47,0.62168542996212905,0.62080233758381997,6.46015147181096E-3,6.4543492879850098E-3,10,0.28977498550904601,0.28977498550904601,1.1105379842865301E-3,1.1105379842865301E-3]
[null,"MLN3B6 South Arm","MACLEAN","Short Rural",311,49101,1012,0.52,1.3330622937041499,0.30405952041551282,12,9.0890049196716699E-2,9.0580212580411004E-2,7.0322467970494696E-4,6.9974336940937804E-4,7,2.0731202810113699E-2,1.6378404503887199E-2,6.1503148555053198E-5,4.8738344137966699E-5]
[null,"MLO22 East","MOLONG","Short Rural",566,91241,381,1.2450000000000001,0.43367440130629481,0.83827674576219868,29,2.8441144678033901E-2,2.8441144678033901E-2,2.2976647950755699E-4,2.2976647950755699E-4,13,5.49756917508612E-2,5.4446532585934702E-2,3.3072447807905899E-4,3.2724316778349002E-4]
[null,"MLO52 West","MOLONG","Short Rural",784,163513,279,2.0710000000000002,2.4399283586739582,3.6245025623585652,53,9.6526290565242895E-2,9.6526290565242895E-2,1.1824850637282901E-3,1.1824850637282901E-3,35,0.143389368890663,0.143389368890663,6.0574799142901399E-4,6.0574799142901399E-4]
[null,"MLS3B1 Uralla Rd/Bundarra Rd","ARMIDALE","Short Rural",549,81574,1940,1.2574688862950048,1.3692294164638246,1.3687602949794093,34,0.104996318514362,0.104305858639075,1.0119008592453999E-3,1.0060986754194499E-3,10,0.104960344974642,0.104960344974642,4.21238545763855E-4,4.21238545763855E-4]
[null,"MLS3B2 Armidale CBD","ARMIDALE","Urban",512,2642,1656,3.6961964233519837,0.45296209526389775,2.1522661252121171,3,1.22692979183505E-2,4.2994182150277701E-3,7.6588826502519005E-5,3.7133976486069797E-5,2,5.8298022209599301E-2,5.8298022209599301E-2,1.6130071036136599E-4,1.6130071036136599E-4]
[null,"MLS3B3 City Sth","ARMIDALE","Short Rural",829,32752,3184,1.9624135649755379,0.60530626937916931,3.9927202968276667,16,5.2992505319151999E-2,5.2992505319151999E-2,4.03831994286009E-4,4.03831994286009E-4,7,0.349549083283966,0.346856869988726,9.7592731952452297E-4,9.6432295187262596E-4]
[null,"MLS3B4 City West","ARMIDALE","Urban",845,6766,980,2.9531466269049358,1.8191736077370229,1.1279530325314882,3,6.8435597790296301E-2,2.88159657531902E-2,1.2184586034491699E-3,2.9707181188855898E-4,4,4.2432530755925901E-2,4.2432530755925901E-2,1.19524986814537E-4,1.19524986814537E-4]
[null,"MLS3B5 City Central","ARMIDALE","Urban",530,3048,953,2.1719917126913719,8.0503093388747782E-2,0.11565233134721517,1,2.2245572788686199E-3,2.2245572788686199E-3,3.1331792660121401E-5,3.1331792660121401E-5,1,3.19584285133238E-3,3.19584285133238E-3,9.3995377980364195E-5,9.3995377980364195E-5]
[null,"MLS3B6 Airport","ARMIDALE","Short Rural",191,21682,1458,0.80020747309682139,0.87805314269040546,0.63777700751378108,11,4.6596177869426499E-2,4.6408187113465803E-2,5.1175261344865003E-4,5.0943173991826996E-4,5,3.3845298693522298E-2,3.3845298693522298E-2,1.20685423579727E-4,1.20685423579727E-4]
[null,"MNE3B3 Crystal Waters","COFFS HARBOUR","Short Rural",1234,27112,7388,2.5339903314732672,1.7289041810929937,0.32908278542757169,11,0.121736779288989,0.121736779288989,6.3243803702837703E-4,6.3243803702837703E-4,7,2.3171601327307601E-2,2.3171601327307601E-2,1.1140192945820901E-4,1.1140192945820901E-4]
[null,"MNE3B6 Emerald Beach","COFFS HARBOUR","Short Rural",1130,16371,5403,1.9052558883257651,0.8183280463744298,0.74480526766350053,4,7.2975226415718297E-2,7.2975226415718297E-2,1.4168932902965999E-3,1.4168932902965999E-3,6,6.6418758692396607E-2,4.7619683096323799E-2,2.3904997362907501E-4,1.4505459564871E-4]
[null,"MNE3B8 Bucca Rd","COFFS HARBOUR","Urban",1,0,627,0.20957814771583416,0,0,0,0,0,0,0,0,0,0,0,0]
[null,"MOA22 Northern Rural","DENILIQUIN","Short Rural",166,125378,390,1.7528354172597038,0.237945410096425,0.87355039221091113,13,7.2179166794798201E-3,7.2179166794798201E-3,2.5297521481135101E-4,2.5297521481135101E-4,19,2.64985735331064E-2,2.64985735331064E-2,1.24166733875296E-4,1.24166733875296E-4]
[null,"MOA23 Moama West","DENILIQUIN","Short Rural",1145,29973,2472,5.5252420761447185,0.63762327144832343,1.6381597486906274,11,3.2305399106115601E-2,3.2305399106115601E-2,1.67218937863833E-3,1.67218937863833E-3,7,8.2997918756661598E-2,3.8026352358500701E-2,4.42126407537269E-4,2.5065434128097099E-4]
[null,"MOA24 Perricoota","DENILIQUIN","Long Rural",371,212737,3195,2.0576763593918259,0.26461572387707283,0.35372488665044183,25,1.05309636440964E-2,1.04207221514033E-2,4.7345820019738998E-4,4.7229776343219999E-4,13,1.4077258398516E-2,1.4077258398516E-2,8.8193194154415798E-5,8.8193194154415798E-5]
[null,"MOA25 Moama East","DENILIQUIN","Short Rural",1963,32266,4142,6.4016597847745711,0.55555953549490322,1.1349097397515573,14,3.1949145019202298E-2,3.1828459595622603E-2,2.3115900362578501E-3,2.30926916272747E-3,6,6.5266444984563299E-2,1.8191006731113499E-2,1.86830319195539E-4,5.5700964729104699E-5]
[null,"MON1012 Monteagle Rural","YOUNG","Short Rural",290,166709,0,0.8,8.2220409898706013,0.34303503016250236,35,0.365753422273075,0.36016707968545197,1.8218857213477999E-3,1.7731473772098301E-3,8,1.5259743462244299E-2,1.5259743462244299E-2,7.5428389737329307E-5,7.5428389737329307E-5]
[null,"MON121 Agility Gas Supply","YOUNG","Urban",1,0,11,0.32,9.2639759325319453,0,5,9.8869212394160893E-4,9.8869212394160893E-4,5.8021838259484103E-6,5.8021838259484103E-6,0,0,0,0,0]
[null,"MON131 Transmission Pipeline of Australia","YOUNG","Urban",1,0,11,0,0,0,0,0,0,0,0,0,0,0,0,0]
[null,"MOU12 Moulamein","MOULAMEIN","Long Rural",415,280674,0,1.5925,3.6964273852629441,3.2367300177225724,34,0.150883469520258,0.133315617332051,7.3339603559987904E-4,6.8349725469672295E-4,39,0.132119207027141,0.132119207027141,5.6861401494294396E-4,5.6861401494294396E-4]
[null,"MOU22 Balranald/Tooleybuc","MOULAMEIN","Long Rural",200,362531,72,4.88645,1.0998557267280369,0.9342314665389797,22,4.1990404348388598E-2,4.1631829387944998E-2,2.9126962806260998E-4,2.9010919129742E-4,11,3.5667184414870101E-2,3.5667184414870101E-2,1.4969634270946901E-4,1.4969634270946901E-4]
[null,"MPTA2 Mogo","MORUYA","Short Rural",349,40698,268,0.60899999999999999,2.045387557067166,8.6609023009520214E-4,11,8.2215784376923798E-2,8.2215784376923798E-2,7.2991472530431001E-4,7.2991472530431001E-4,1,3.4813102955690502E-5,3.4813102955690502E-5,1.1604367651896799E-6,1.1604367651896799E-6]
[null,"MPTB2 Tomakin/Rosedale","MORUYA","Short Rural",662,19317,622,1.333,0.42353926809110692,4.5989419780180141,4,3.5131062629352401E-2,3.5131062629352401E-2,7.6936957532075902E-4,7.6936957532075902E-4,6,0.38146573607374301,0.38146573607374301,1.67683112569909E-3,1.67683112569909E-3]
[null,"MPTC2 Broulee","MORUYA","Short Rural",1665,7513,5209,2.1710000000000003,2.8535983970104795,0.99828572625685541,10,0.240118735889814,8.8932392373841707E-2,3.8271204515955698E-3,1.95069420228386E-3,5,8.4001696558550706E-2,8.4001696558550706E-2,5.2219654433535701E-4,5.2219654433535701E-4]
[null,"MPTD2 Surf Beach","MORUYA","Short Rural",1983,41822,11670,3.62,10.828337139059723,0.50418127947132085,25,0.87608566112113295,0.86149200836210704,8.7775436918947607E-3,8.6661417624365501E-3,9,4.0791673169947702E-2,3.2645407078316098E-2,2.25124732446798E-4,1.62461147126555E-4]
[null,"MRE2M16 Industrial","MOREE","Urban",105,10941,670,3.5056708345194076,6.5420520391428303,0.9746148356214438,7,4.3612694946123798E-2,3.8174888264444998E-2,4.4792859136321702E-4,4.2239898252904401E-4,5,6.4972854482970299E-3,6.4972854482970299E-3,3.2492229425311099E-5,3.2492229425311099E-5]
[null,"MRE2M17 Western Rural","MOREE","Long Rural",346,360417,376,3.4675657167528922,4.6517910943411209,0.61292269529069177,59,0.26144060101340899,0.25703094130568899,2.0771818096895298E-3,1.9646194434661301E-3,17,3.4447565374655702E-2,3.4447565374655702E-2,2.11199491264522E-4,2.11199491264522E-4]
[null,"MRE2M18 Northern/Amaroo","MOREE","Short Rural",1549,30030,587,3.6199861878189532,2.764568012849439,4.5614731737773564,26,0.20536713608267901,0.20436916046461601,2.1839419920869798E-3,2.1607332567831899E-3,24,0.33885101674568302,0.333837929920063,1.67683112569909E-3,1.5631083227104999E-3]
[null,"MRE2M19 Moree Western Town","MOREE","Short Rural",1048,14101,235,3.0103043035547086,5.0571778637167508,8.8559081943680873,17,0.29408252678142999,0.29401522144904901,5.1244887550776401E-3,5.1233283183124501E-3,29,0.51498442983970305,0.51498442983970305,1.9251645934496801E-3,1.9251645934496801E-3]
[null,"MRE2M34 Southern Rural","MOREE","Long Rural",314,579055,0,1.3336791218280355,11.71333090837968,2.3888574251341086,110,0.63750102263490005,0.58607046520169304,3.1993241616279501E-3,3.0299003939102602E-3,31,0.130014174735087,0.1239799035561,4.28201166354993E-4,4.0963417811195799E-4]
[null,"MRE2M35 Eastern Rural","MOREE","Long Rural",402,273280,1337,0.95262794416288255,14.698291672355197,1.5276178239703104,78,0.80240024740511795,0.77705282714307999,7.0508137852925102E-3,6.5413820453742401E-3,17,8.3394788130356501E-2,8.3394788130356501E-2,3.8642544280816402E-4,3.8642544280816402E-4]
[null,"MRE2M36 Moree Eastern Town","MOREE","Urban",757,10520,564,3.0484094213212236,1.4382272510732592,4.4711073639373682,5,5.0349030368049899E-2,5.0349030368049899E-2,1.2648760740567499E-4,1.2648760740567499E-4,6,0.15652319219908001,0.15652319219908001,3.8410456927778498E-4,3.8410456927778498E-4]
[null,"MRE2M37 Gingham Rd","MOREE","Short Rural",202,198109,84,2.5149377725900095,3.7542879139944474,2.7532627581295346,51,0.154688541673315,0.15433344802316701,1.0455535254358999E-3,1.0258261004276799E-3,28,0.113443137728178,0.113443137728178,4.8506256784928699E-4,4.8506256784928699E-4]
[null,"MRE2M38 Tareelaroi","MOREE","Long Rural",195,346301,2537,1.7528354172597038,13.814340217642568,0.55314553989983439,73,0.57515539698831897,0.50174384634888902,3.2863569190171799E-3,3.0728365542222798E-3,10,2.3030028041954399E-2,2.3030028041954399E-2,1.0792061916264001E-4,1.0792061916264001E-4]
[null,"MRE2M54 Moree Central Town","MOREE","Urban",967,8783,457,4.7250346030478969,3.1107613182520528,3.5128514409326712,8,0.105065944720274,0.10469576539217799,2.0644170052724399E-3,2.0609356949768801E-3,9,0.11864653618328901,0.11864653618328901,3.56254086913232E-4,3.56254086913232E-4]
[null,"MRH3B2 McMahons Reef","HARDEN","Short Rural",176,171699,2184,0.59,2.8065089303431305,2.8202846158586712,29,7.9435377887529302E-2,7.9435377887529302E-2,4.7926038402333902E-4,4.7926038402333902E-4,19,7.9825284640633001E-2,7.9825284640633001E-2,2.9243006482780002E-4,2.9243006482780002E-4]
[null,"MRH3B3 No.1 Town Sth","HARDEN","Short Rural",525,21174,180,1.37,6.0565244355509487E-2,3.6528813620052647,14,4.2762094797239797E-3,4.2762094797239797E-3,4.9898780903156303E-5,4.9898780903156303E-5,18,0.25791171281046799,0.25791171281046799,8.2739141358024299E-4,8.2739141358024299E-4]
[null,"MRH3B4 No.2 Town Nth","HARDEN","Short Rural",668,9070,128,1.41,0.108942755554591,5.8977010786153645,5,4.5210616371790004E-3,4.5210616371790004E-3,3.8294413251259502E-5,3.8294413251259502E-5,20,0.24475119945645099,0.24475119945645099,8.2971228711062296E-4,8.2971228711062296E-4]
[null,"MRH3B5 Galong","HARDEN","Short Rural",363,138614,120,1.05,1.5568237759156318,2.8193109830840926,28,6.6202917454071405E-2,3.4690096658580402E-2,6.7885550763596399E-4,4.24719856059423E-4,13,0.119889363958807,9.3591545986078301E-2,4.2007810899866502E-4,3.1912011042716301E-4]
[null,"MRH3B6 Kingsvale","HARDEN","Long Rural",350,213208,439,1.41,1.0798015856699064,0.68137385340615619,35,3.8736539658796802E-2,3.8736539658796802E-2,1.5781940006579699E-4,1.5781940006579699E-4,12,2.44434400219555E-2,2.44434400219555E-2,1.1024149269302E-4,1.1024149269302E-4]
[null,"MRN8B2 Brayton Rd","GOULBURN","Short Rural",253,156786,4887,0.68500000000000005,0.59685900965716554,1.5140981637518134,33,4.32912539621663E-2,4.32912539621663E-2,1.6362158389174501E-4,1.6362158389174501E-4,17,0.10982025414725601,0.107480813628634,3.48131029556905E-4,3.2376185748792099E-4]
[null,"MRN8B3 Marulan Town","GOULBURN","Long Rural",956,218510,1391,0.93600000000000005,2.7995842304446845,15.483903605839501,73,0.17037068411808801,0.17021518559155299,1.28112218876941E-3,1.27880131523903E-3,42,0.94228393682814304,0.94228393682814304,2.9219797747476201E-3,2.9219797747476201E-3]
[null,"MSS W390 Khancoban Town","TUMBARUMBA","Short Rural",269,5390,3823,0.495,0.29630647593626208,0.15594034432157872,2,1.21428103109448E-2,1.21428103109448E-2,6.8465769146191306E-5,6.8465769146191306E-5,4,6.3905252658995803E-3,6.2419893599552998E-3,2.9243006482780002E-4,2.9126962806260998E-4]
[null,"MSS W490 Swampy Plains","TUMBARUMBA","Short Rural",26,12627,469,3.7999999999999999E-2,0,0.42480788914333106,0,0,0,0,0,2,1.7408872351375601E-2,1.7408872351375601E-2,5.6861401494294398E-5,5.6861401494294398E-5]
[null,"MSS W590 Murray 1 PS Aux","TUMBARUMBA","Short Rural",1,1501,0,5.7000000000000002E-2,0,0,0,0,0,0,0,0,0,0,0,0]
[null,"MSW3B1 Trail St","WAGGA WAGGA","Urban",789,1959,1869,3.08,0.27682662071399788,5.2474498627544905,3,1.1427981263588001E-2,1.1427981263588001E-2,8.9353630919605497E-5,8.9353630919605497E-5,5,0.21662569357854899,0.21662569357854899,5.9298318701192802E-4,5.9298318701192802E-4]
[null,"MSW3B2 Morrow St","WAGGA WAGGA","Urban",87,48,640,0.87,0.183070831894633,1.9635481457260724,1,2.8082569717590299E-3,2.8082569717590299E-3,2.5529608834173001E-5,2.5529608834173001E-5,5,3.0120296677263399E-2,3.0120296677263399E-2,9.2834941215174605E-5,9.2834941215174605E-5]
[null,"MSW3B3 Esplanade","WAGGA WAGGA","Urban",760,6770,563,1.94,0.26709750112367475,2.2234750616761003,3,1.8741053757813399E-2,1.8741053757813399E-2,1.9959512361262499E-4,1.9959512361262499E-4,6,0.15601143958563099,0.15601143958563099,6.62609392923309E-4,6.62609392923309E-4]
[null,"MSW3B4 Johnston St","WAGGA WAGGA","Urban",346,805,2873,2.8,2.4993672631525787,2.4154127460532906,3,5.6898535470780498E-2,5.6898535470780498E-2,4.1543636193790601E-4,4.1543636193790601E-4,5,5.49872961185131E-2,5.49872961185131E-2,1.7754682507402101E-4,1.7754682507402101E-4]
[null,"MSW3B5 Tompson St","WAGGA WAGGA","Urban",135,131,1764,2.7,1.7118006155275135E-2,0,1,2.5065434128097099E-4,2.5065434128097099E-4,1.1604367651896799E-6,1.1604367651896799E-6,0,0,0,0,0]
[null,"MSW3B6 Forsyth St","WAGGA WAGGA","Urban",706,2939,1259,2.68,0.53138795060014499,1.478692698521233,4,2.01219735083891E-2,2.01219735083891E-2,2.1003905449933199E-4,2.1003905449933199E-4,3,5.5993394793932498E-2,5.5993394793932498E-2,2.9126962806260998E-4,2.9126962806260998E-4]
[null,"MTG11B1 T1 SWER","BROKEN HILL","Long Rural",35,237172,0,0.12,5.0055912005861153E-2,0.9250452948093465,2,1.3507483946807899E-3,1.3507483946807899E-3,1.04439308867071E-5,1.04439308867071E-5,12,2.49621552559952E-2,2.49621552559952E-2,1.4041284858795199E-4,1.4041284858795199E-4]
[null,"MTG4B1 Tibooburra Backbone Line","BROKEN HILL","Long Rural",335,1903597,2333,0.93899999999999995,46.786274346783514,7.2325458242879952,32,1.1363484188178701,1.1363484188178701,2.6028596643204601E-3,2.6028596643204601E-3,12,0.17566459664088399,0.17403998516961799,5.0014824579675302E-4,4.83902131084097E-4]
[null,"MTG8B1 Royal Flying Doctor Base","BROKEN HILL","Short Rural",4,8595,0,0.1,4.3154755014515589E-4,0,1,4.2936160312018201E-5,4.2936160312018201E-5,1.1604367651896799E-6,1.1604367651896799E-6,0,0,0,0,0]
[null,"MUA5005 East","BLAYNEY","Long Rural",581,260206,0,1.1599999999999999,5.0174233844784313,3.3637388942162576,63,0.34860100644680603,0.34850817150559099,3.7238415794936899E-3,3.7226811427284998E-3,23,0.233706162325376,0.23014130058271301,1.18712681078904E-3,1.17320156960677E-3]
[null,"MUA5006 West","BLAYNEY","Short Rural",321,155085,0,0.99,1.9187783820330857,1.292722816933177,80,0.107899731300867,0.107787168934644,9.7012513569857397E-4,9.6896469893338502E-4,5,7.2694400718542496E-2,7.2694400718542496E-2,4.0267155752081999E-4,4.0267155752081999E-4]
[null,"MUA5027 Mine","BLAYNEY","Short Rural",184,69752,44,0,0.73134893457266659,0.91975019063116914,30,4.5416013679228602E-2,4.5416013679228602E-2,3.41168408965767E-4,3.41168408965767E-4,8,5.7115537145870997E-2,5.7115537145870997E-2,3.2376185748792099E-4,3.2376185748792099E-4]
[null,"MUD32 Cudgegong","MUDGEE","Short Rural",2142,21734,9211,5.0679806629465345,4.8828743725986072,5.5011439887879776,20,0.41107428013755798,0.41107428013755798,3.2712712410697098E-3,3.2712712410697098E-3,18,0.46312451080337602,0.46303863848275201,1.5863170580143E-3,1.50044473739026E-3]
[null,"MUD42 Abattoir No.2","MUDGEE","Long Rural",1035,585866,955,2.324412183757433,9.4219544073751145,3.334795588278225,162,0.381584100623793,0.37336704788948499,3.1366605763077102E-3,2.5668861245995802E-3,52,0.13505743291660099,0.130332134408749,6.7653463410558402E-4,6.5448633556698004E-4]
[null,"MUD52 Mudgee West","MUDGEE","Urban",1708,10503,1754,5.6014523116777495,5.3290741391914915,1.5938132968032953E-2,8,0.23280218208529299,0.23280218208529299,3.8352435089519001E-3,3.8352435089519001E-3,1,6.9626205911380902E-4,6.9626205911380902E-4,2.3208735303793598E-6,2.3208735303793598E-6]
[null,"MUD62 Mudgee East","MUDGEE","Long Rural",1098,366364,2549,2.2863070659909175,22.348081811035819,6.2038459114040361,86,0.95161384842026897,0.94229554119579495,4.7461863696257999E-3,4.6904854048966903E-3,47,0.26416878784837,0.26385663035853402,9.5155814745553902E-4,9.4807683715996999E-4]
[null,"MUD72 Eurunderee","MUDGEE","Short Rural",455,121942,1317,1.5242047106606118,2.246759642619562,3.9977683868368969,66,8.8737438997289794E-2,7.7153959207166403E-2,1.25443214317005E-3,6.62609392923309E-4,35,0.15789482845553399,0.15789482845553399,6.1387104878534197E-4,6.1387104878534197E-4]
[null,"MUD82 Abattoir No.1","MUDGEE","Short Rural",327,130782,345,1.6156569933002489,4.8918995922014794,1.8029632778092812,53,0.19598848614641601,0.194997473148944,1.06760182397451E-3,1.05599745632261E-3,30,7.22337073227622E-2,7.22337073227622E-2,2.7502351334995499E-4,2.7502351334995499E-4]
[null,"MUD92 Industrial","MUDGEE","Short Rural",1879,13289,2233,5.029875545180019,17.050894858635186,2.6900820220372115,12,0.79817277626953198,0.79709705138820097,6.3510704158831303E-3,6.3441077952919901E-3,11,0.125925956011324,0.125925956011324,4.9202518844042504E-4,4.9202518844042504E-4]
[null,"MUL3B1 Goonengerry","EWINGSDALE","Short Rural",565,80349,1191,1.3,8.9520617933158366,5.3628816264369359,46,0.71464685878471002,0.71189662365120998,2.46708856279326E-3,2.4520028848457999E-3,28,0.428121096218195,0.428121096218195,1.1453510872422199E-3,1.1453510872422199E-3]
[null,"MUL3B2 Main Arm","EWINGSDALE","Short Rural",721,88625,1773,1.21,5.1335581603363512,0.52154643276960355,36,0.41944335008810602,0.41219410161596598,1.7394947110193301E-3,1.6431784595085899E-3,13,4.2613558891295499E-2,3.9515192728239099E-2,2.1584123832528099E-4,1.9843468684743599E-4]
[null,"MUL3B3 Mullumbimby West","EWINGSDALE","Short Rural",1174,22101,3234,2.75,0.6413145854941138,4.4329690797030619,11,2.7672935539478302E-2,2.7672935539478302E-2,2.9591137512336899E-4,2.9591137512336899E-4,9,0.19128407550033699,0.19128407550033699,3.69018891330319E-4,3.69018891330319E-4]
[null,"MUL3B5 Ocean Shores","EWINGSDALE","Short Rural",1698,44851,6386,2.6199999999999997,29.653263657746002,5.6731023384316952,24,1.83919131482707,1.83919131482707,1.0436968266116E-2,1.0436968266116E-2,20,0.35186415463052001,0.31913983785217098,1.3089726711339601E-3,1.1697202593112001E-3]
[null,"MUL3B6 Mullumbimby East","EWINGSDALE","Short Rural",527,14559,4654,0.92,5.918092637800617E-2,1.0951062094256805,3,3.0484673821532899E-3,3.0484673821532899E-3,1.50856779474659E-5,1.50856779474659E-5,3,5.64099915926356E-2,5.64099915926356E-2,3.0287399571450699E-4,3.0287399571450699E-4]
[null,"MUN12662 Aglime/Boral","GOULBURN","Short Rural",2,2254,13,1.33,7.7158820103080299E-3,5.3248064862345568E-2,1,1.05599745632261E-4,1.05599745632261E-4,1.1604367651896799E-6,1.1604367651896799E-6,1,7.2875428853911997E-4,7.2875428853911997E-4,1.1604367651896799E-6,1.1604367651896799E-6]
[null,"MUN7292 Blue Circle Cement","GOULBURN","Urban",3,3873,500,7.1450000000000005,1.3389810203942565,9.1400008783433826,1,2.13520364794902E-4,2.13520364794902E-4,2.3208735303793598E-6,2.3208735303793598E-6,1,1.4575085770782399E-3,1.4575085770782399E-3,2.3208735303793598E-6,2.3208735303793598E-6]
[null,"MUR1483 Yarmawl","LEETON","Short Rural",73,59053,24,0.51,1.4289872953436504,3.1365121269238987,10,3.6774241088861001E-2,3.63379168651497E-2,2.17001675090471E-4,2.1584123832528099E-4,11,8.07165000762987E-2,8.07165000762987E-2,2.4601259422021301E-4,2.4601259422021301E-4]
[null,"MUR823 Colando","LEETON","Short Rural",55,15958,22,0.3,0.86327828394217709,1.9249414132714839,9,2.8485241275111099E-2,2.8485241275111099E-2,1.5665896330060701E-4,1.5665896330060701E-4,10,6.3516506342657306E-2,6.06873615091248E-2,2.2976647950755699E-4,2.0307643390819399E-4]
[null,"MUR825 Rice Shed","LEETON","Short Rural",5,1157,84,1.31,3.6004349269862276E-2,0,1,1.02118435336692E-3,1.02118435336692E-3,4.6417470607587298E-6,4.6417470607587298E-6,0,0,0,0,0]
[null,"MWA8B1 Barooga","COROWA","Short Rural",1029,155926,1258,3.6961964233519837,1.1485089451417405,0.80490544254561591,35,5.5463075192240897E-2,4.7356263950625699E-2,2.5297521481135101E-4,2.25124732446798E-4,7,3.8869989886793598E-2,3.8869989886793598E-2,1.8450944566515901E-4,1.8450944566515901E-4]
[null,"MWA8B2 Edward St","COROWA","Urban",794,8838,1117,4.1534578365501673,0.1844488543182996,0.24169004617218665,5,9.4865705554256496E-3,9.3925751774452896E-3,8.9353630919605505E-4,8.9237587243086599E-4,3,1.24305986287119E-2,1.24305986287119E-2,1.8102813536959001E-4,1.8102813536959001E-4]
[null,"MWA8B3 ADI and Romney St","COROWA","Urban",395,9728,0,5.715767664977295,0.52696281826419855,0.17629491652955084,4,3.9771649253346003E-2,3.9771649253346003E-2,1.16043676518968E-4,1.16043676518968E-4,1,1.33055679496649E-2,1.33055679496649E-2,1.13722802988589E-4,1.13722802988589E-4]
[null,"MWA8B4 North St and Rural","COROWA","Long Rural",613,308370,1340,2.0957814771583414,3.8585658957796811,1.5785094272138069,33,0.195808618447811,0.195808618447811,1.1824850637282901E-3,1.1824850637282901E-3,42,8.0103789464278596E-2,8.0103789464278596E-2,4.0151112075563001E-4,4.0151112075563001E-4]
[null,"MWB8B1 M30 Merrywinebone","WALGETT","Long Rural",459,611809,0,1.2460373509650504,11.596001625383073,2.035609082094203,59,0.57531321638838395,0.56931375831235398,3.96521242665314E-3,3.9512871854708699E-3,46,0.10099281167445801,8.8088754845548803E-2,4.2704072958980302E-4,3.7366063839107801E-4]
[null,"MWB8B2 M29 Moomin Cotton Gin","WALGETT","Urban",1,932,627,2.2367704128944483,0.15465679985496542,0,6,2.1166366597059798E-3,2.1166366597059798E-3,6.96262059113809E-6,6.96262059113809E-6,0,0,0,0,0]
[null,"MWN3B1 Uki","MURWILLUMBAH","Long Rural",2029,262375,2565,2.6199999999999997,13.803552089939247,13.713479017222177,92,0.95799741106557701,0.95111834192153299,9.1976218008934206E-3,9.1767339391200103E-3,29,0.9517461382115,0.87426609627331497,3.02293777331912E-3,2.8419096379495301E-3]
[null,"MWN3B2 Murwillumbah Town No.2","MURWILLUMBAH","Urban",637,3176,1092,4.2,2.4115978720417464,4.1139506517259408E-2,2,5.7821082699106303E-2,5.7821082699106303E-2,7.5428389737329299E-4,7.5428389737329299E-4,1,9.8637125041122994E-4,9.8637125041122994E-4,3.9454850016449201E-5,3.9454850016449201E-5]
[null,"MWN3B3 Boat Harbour","MURWILLUMBAH","Short Rural",1050,105752,2673,2.1599999999999997,7.6901047199835899,7.5642061434621146,73,0.63212123779148,0.63212123779148,5.6269578744047701E-3,5.6269578744047701E-3,28,0.62177246271951803,0.620446083496907,1.8787471228421E-3,1.8683031919553899E-3]
[null,"MWN3B4 Bray Pk","MURWILLUMBAH","Short Rural",805,8886,2318,3.7199999999999998,2.8766971454909984,1.3936376970780104,8,0.22443543300827601,0.22443543300827601,1.7128046654199701E-3,1.7128046654199701E-3,7,0.10872944358797799,0.10872944358797799,3.2840360454868E-4,3.2840360454868E-4]
[null,"MWN3B5 Tumbulgum","MURWILLUMBAH","Short Rural",891,89093,1733,1.81,81.238449629492933,73.718067692514609,44,0.57207211650320999,0.56732244882328797,4.4421519371461004E-3,4.4363497533201597E-3,24,0.51911442428701304,0.51911442428701304,1.4435833358959599E-3,1.4435833358959599E-3]
[null,"MWN3B6 Murwillumbah Town No.1","MURWILLUMBAH","Short Rural",1858,12131,1746,3.03,5.0510939803100037,0.29965081992162002,12,0.380853025461723,0.38079036187640303,2.1781398082610301E-3,2.1769793714958401E-3,4,2.2593703818243101E-2,2.2593703818243101E-2,1.6130071036136599E-4,1.6130071036136599E-4]
[null,"MWN3B7 Norco","MURWILLUMBAH","Short Rural",1057,71358,780,2.5799999999999996,6.5383074322137515,2.1933516890866334,27,0.36257498597322102,0.28778715733027599,3.2875173557823699E-3,2.1189575332363599E-3,15,0.12163001910659101,0.106959777521063,4.7926038402333902E-4,4.2239898252904401E-4]
[null,"MWN3B8 Industrial","MURWILLUMBAH","Short Rural",653,53495,1909,2.73,22.451081099640856,3.6440709123732313,37,0.67831010235632505,0.67749315487363104,6.1793257746350604E-3,6.16656097021797E-3,8,0.110097598534136,0.110097598534136,3.9919024722525102E-4,3.9919024722525102E-4]
[null,"MWN3B9 Racecourse Rd","MURWILLUMBAH","Short Rural",529,78846,175,0.94000000000000006,6.2366612729709958,2.5407654512248836,36,0.49140087346075301,0.49083341988257501,2.9428676365210299E-3,2.9393863262254598E-3,13,0.200192748546698,0.200192748546698,6.11550175254962E-4,6.11550175254962E-4]
[null,"MYT3B2 Kiora","MORUYA","Short Rural",1027,85574,2496,2.3050000000000002,1.5385969700206892,2.5812086008703066,34,0.11098881396980199,0.11098881396980199,1.5352578403459501E-3,1.5352578403459501E-3,11,0.186199041595276,0.186199041595276,8.0186180474606998E-4,8.0186180474606998E-4]
[null,"MYT3B3 Moruya","MORUYA","Short Rural",962,9277,1129,2.8759999999999999,9.0419698183387105,0.39483906612678099,7,0.33802710664239799,0.33802710664239799,4.4224245121378802E-3,4.4224245121378802E-3,2,1.47607556532128E-2,1.47607556532128E-2,5.6861401494294398E-5,5.6861401494294398E-5]
[null,"MYT3B6 Moruya Nth","MORUYA","Short Rural",1077,54478,2812,2.1909999999999998,3.8393770615106306,10.06070076385028,18,0.198692303809308,0.198692303809308,3.2793942984260401E-3,3.2793942984260401E-3,5,0.520653163437655,0.520653163437655,1.47259425502571E-3,1.47259425502571E-3]
[null,"MYT3B7 Bergalia","MORUYA","Short Rural",560,73153,1126,0.99,2.6828189302669223,2.5606876598930257,20,0.20504917640901699,0.20504917640901699,1.4435833358959599E-3,1.4435833358959599E-3,9,0.19571462306983101,0.19571462306983101,6.4056109438470404E-4,6.4056109438470404E-4]
[null,"NAN3B1 Eurongilly","GUNDAGAI","Short Rural",119,111046,0,0.78,1.1551853340828324,1.6724907665144964,25,6.2837650835021297E-2,6.2837650835021297E-2,6.4172153114989397E-4,6.4172153114989397E-4,15,9.0977081954105907E-2,7.2063123118279296E-2,9.5736033128148801E-4,8.9121543566567595E-4]
[null,"NAN3B2 Mundarlo","GUNDAGAI","Short Rural",58,48278,0,0.437,1.1659852843192582,0.98063917731694838,9,3.36828375463957E-2,3.36828375463957E-2,2.7966526041071303E-4,2.7966526041071303E-4,3,2.8328582311810499E-2,2.8328582311810499E-2,6.38240220854325E-5,6.38240220854325E-5]
[null,"NAN3B3 Nangus/Kimo/Cooba","GUNDAGAI","Short Rural",117,68423,0,0.32300000000000001,0.7510766951265152,1.3011604777935382,15,4.4044377422774401E-2,4.4044377422774401E-2,4.21238545763855E-4,4.21238545763855E-4,8,7.63021986215172E-2,7.63021986215172E-2,2.4717303098540202E-4,2.4717303098540202E-4]
[null,"NARC2 Dalmeny","MORUYA","Short Rural",1084,16746,280,1.677,3.6477473051354017,3.0538973676049022,12,0.26693758997011302,0.26693758997011302,2.7629999379166301E-3,2.7629999379166301E-3,8,0.22348039355052501,0.22348039355052501,8.9121543566567595E-4,8.9121543566567595E-4]
[null,"NARD2 Narooma","MORUYA","Short Rural",1132,12943,2021,2.133,2.2822051149630975,4.5450361335770424,5,0.10019791249030301,0.10019791249030301,1.43197896824407E-3,1.43197896824407E-3,8,0.19954522483172199,0.19954522483172199,6.4056109438470404E-4,6.4056109438470404E-4]
[null,"NARE2 Kianga/Narooma Sth","MORUYA","Short Rural",1207,10915,2574,1.7710000000000001,2.2343988448864747,4.712528591405114,9,0.13904237276826301,0.13904237276826301,1.8891910537288E-3,1.8891910537288E-3,4,0.29325165405755399,0.29325165405755399,1.0583183298529899E-3,1.0583183298529899E-3]
[null,"NARF2 Tilba","MORUYA","Short Rural",1151,127238,11313,1.6,5.6222619798060922,2.6954328075696408,34,0.36631275279389702,0.36625241008210702,4.3968949033037098E-3,4.3922531562429496E-3,11,0.175618179170276,0.175618179170276,1.0722435710352699E-3,1.0722435710352699E-3]
[null,"NBI3B1 M14 Spring Ck","NARRABRI","Short Rural",80,110896,10,0.38105117766515295,1.6000760158784118,3.2299556292054686E-2,44,0.100428839406576,0.100374298878612,5.4424484287396099E-4,5.4308440610877095E-4,3,2.0272830287863699E-3,2.0272830287863699E-3,1.6246114712655499E-5,1.6246114712655499E-5]
[null,"NBI3B2 M5 Eulah Ck/Turrawan","NARRABRI","Short Rural",318,134771,8,1.6575726228434156,0.94477509110857227,0.55045300722708257,48,7.6982214565918305E-2,7.4222695938297306E-2,7.6472782825999996E-4,7.4151909295620702E-4,7,4.4852041411346397E-2,4.4852041411346397E-2,2.30926916272747E-4,2.30926916272747E-4]
[null,"NBI8B1 M8 Wee Waa","NARRABRI","Short Rural",51,59957,435,4.9536653096469889,2.2617139706281644,0.37082255777226381,30,5.3592451126755099E-2,4.9378905232351403E-2,3.1099705307083498E-4,2.5877739863729903E-4,7,8.7868271860162706E-3,8.7868271860162706E-3,2.5529608834173001E-5,2.5529608834173001E-5]
[null,"NBI8B2 M18 Myall Vale","NARRABRI","Short Rural",67,53466,357,0.85355463796994269,1.2076139732713138,9.8331389199480479E-2,26,3.8079732449699401E-2,3.5426974004475802E-2,2.27445605977178E-4,2.2048298538604E-4,3,3.1006870365868299E-3,3.1006870365868299E-3,1.6246114712655499E-5,1.6246114712655499E-5]
[null,"NBI8B3 Narrabri Town No.1","NARRABRI","Short Rural",610,18114,495,3.3494398516766952,0.97590454718481112,1.0826171214171183,12,4.3277328720983999E-2,4.0421493841852202E-2,8.8541325183972804E-4,8.5872320624036499E-4,13,4.8009589849427499E-2,4.8009589849427499E-2,2.3904997362907501E-4,2.3904997362907501E-4]
[null,"NBI8B5 M6 Wee Waa","NARRABRI","Long Rural",395,360442,1687,1.4403734515742781,17.148500215921043,2.0872671943556202,85,0.44420242891019301,0.44420242891019301,3.13085839248176E-3,3.13085839248176E-3,10,5.4067069763717703E-2,5.4067069763717703E-2,2.1932254862084999E-4,2.1932254862084999E-4]
[null,"NBI8B6 Narrabri Town No.2","NARRABRI","Short Rural",1314,29338,1942,6.5921853736071467,11.690997225135455,3.0668882692294286,22,0.72288131807049505,0.72288131807049505,6.7479397895779999E-3,6.7479397895779999E-3,16,0.189632773983472,0.16492939612611399,7.4616084001696598E-4,5.7905794582965105E-4]
[null,"NBI8B7 Narrabri Town No.3","NARRABRI","Urban",1455,12936,108,5.9977455364495071,4.8089419380895242,1.1387334108688587,14,0.21653285863733401,0.111280083597865,3.4244488940747501E-3,1.8288483419389399E-3,5,5.1273898469906098E-2,5.1273898469906098E-2,2.7734438688033398E-4,2.7734438688033398E-4]
[null,"NBI8B8 M16 Mt Dowe","NARRABRI","Short Rural",110,113140,92,0.80020747309682139,0.83586603759879219,3.025917363999495E-2,35,5.2795231069069803E-2,5.2738369667575502E-2,4.8854387814485601E-4,4.8738344137966598E-4,2,1.91123935226741E-3,1.91123935226741E-3,1.24166733875296E-4,1.24166733875296E-4]
[null,"NDA3B2 May St","NARRANDERA","Short Rural",1143,188259,1762,3.37,1.126613888953939,1.23511271476564,37,5.5717210843817401E-2,3.0721402921631599E-2,1.664066321282E-3,4.1427592517271603E-4,11,6.1083070446054502E-2,6.1083070446054502E-2,2.1584123832528099E-4,2.1584123832528099E-4]
[null,"NDA3B3 Gillenbah","NARRANDERA","Long Rural",248,257949,4642,1.1399999999999999,1.2409079866270845,0.86238324639221886,20,4.3828536184449103E-2,3.8933813908878998E-2,3.8410456927778498E-4,1.2648760740567499E-4,26,3.04591442126988E-2,3.04591442126988E-2,1.2532717064048601E-4,1.2532717064048601E-4]
[null,"NDA3B4 Larmer St","NARRANDERA","Short Rural",933,21558,360,2.38,0.84478191309025197,0.31333064533926841,16,5.1492060581761798E-2,3.48931730924886E-2,1.20685423579727E-3,1.79867698604401E-4,3,1.9098468281491799E-2,1.9098468281491799E-2,6.9626205911380896E-5,6.9626205911380896E-5]
[null,"NDA3B5 Audley St","NARRANDERA","Urban",469,4685,658,2.74,0.32383114990003331,2.5748380053313569,6,1.5115849303360801E-2,5.6687335979516001E-3,5.5352833699547804E-4,3.7133976486069797E-5,8,0.120188756644226,8.7887999285171006E-2,4.28201166354993E-4,3.1795967366197298E-4]
[null,"NDA3B6 Paynters Siding","NARRANDERA","Short Rural",162,61592,155,0.7,0.4867208255812594,1.9427345068202371,7,1.8514768588601401E-2,1.54233650461361E-2,2.6341914569805798E-4,9.1674504449984893E-5,5,7.3901254954339704E-2,7.3901254954339704E-2,2.4717303098540202E-4,2.4717303098540202E-4]
[null,"NDA3B7 Sandigo","NARRANDERA","Short Rural",103,115786,121,0.51,0.25005700458773,1.3318957310120203,12,9.0525672052447093E-3,7.1308839220906002E-3,1.5433808977022799E-4,4.7577907372777001E-5,26,4.8217308030396498E-2,4.8217308030396498E-2,1.65942457422125E-4,1.65942457422125E-4]
[null,"NDL615 Nundle","TAMWORTH","Short Rural",425,122748,18,0.91452282639636728,4.8865043181188232,12.443532087005597,32,0.25617685984650901,0.25264100902297598,2.5680465613647698E-3,2.55876306724325E-3,24,0.652356934102858,0.652356934102858,2.2907021744844299E-3,2.2907021744844299E-3]
[null,"NDL616 Woolomin","TAMWORTH","Long Rural",520,204112,0,1.3108160511681262,7.2075234621724666,17.479036805213827,59,0.41665830185165098,0.41278476392944802,2.1398453950097701E-3,2.1247597170623101E-3,31,1.0104421902315599,0.89420123946250896,3.1795967366197299E-3,2.8105778452894099E-3]
[null,"NER3B1 Nericon Village","GRIFFITH","Short Rural",87,12735,0,0.59061199999999991,1.8337967676106572,0.83353430486546165,7,7.9936686570091203E-2,3.5258710673523298E-2,4.0035068399044003E-4,2.0307643390819399E-4,6,3.6334435554854098E-2,3.6334435554854098E-2,1.41573285353141E-4,1.41573285353141E-4]
[null,"NER3B2 New Farm Rd","GRIFFITH","Short Rural",69,24989,0,1.219328,2.5339141286238345,1.7625194204043739,8,5.8439595494952402E-2,2.4272855817472599E-2,3.1795967366197298E-4,1.6710289418731401E-4,9,4.0648939447829401E-2,4.0648939447829401E-2,1.52017216239848E-4,1.52017216239848E-4]
[null,"NER3B3 Lakes Rd","GRIFFITH","Short Rural",4,2176,0,3.8103999999999999E-2,0.1312730222827766,1.1285043061781692E-2,6,3.1587088748463101E-3,1.06063920338337E-3,1.8566988243034899E-5,9.2834941215174595E-6,1,2.7154220305438602E-4,2.7154220305438602E-4,2.3208735303793598E-6,2.3208735303793598E-6]
[null,"NGN3B1 Glenreagh","COFFS HARBOUR","Short Rural",578,92120,512,1.6194675050769001,1.8357656842465682,1.4601600862074939,30,0.12364685820449101,0.12364685820449101,1.4145724167662201E-3,1.4145724167662201E-3,9,9.8348176286590802E-2,9.8194998633585703E-2,8.4711883858846798E-4,8.4479796505808899E-4]
[null,"NGN3B2 Coramba","COFFS HARBOUR","Short Rural",430,47614,53,0.97168050304614006,1.1056937699945062,3.9054531551634644,18,7.7798001611846704E-2,7.6884737877642398E-2,1.45170639325229E-3,1.44706464619153E-3,9,0.27479258643368198,0.27319814631831102,6.1038973848977305E-4,6.03427117898635E-4]
[null,"NGN3B3 Nana Glen","COFFS HARBOUR","Short Rural",452,71523,1414,0.64778700203076001,6.1617352091981319,2.0948204828460941,29,0.44465732012214798,0.33883709150449998,3.4302510779006998E-3,3.2979612866690798E-3,9,0.15117125783802501,0.15117125783802501,8.0186180474606998E-4,8.0186180474606998E-4]
[null,"NHD3B1 Nambucca Central","NAMBUCCA HEADS","Short Rural",2071,10722,3594,3.4294605989863771,6.899575191363982,1.5548721014268341,6,0.50996205951996199,0.50996205951996199,4.8308982534846501E-3,4.8308982534846501E-3,4,0.11492385504056001,0.11492385504056001,2.6330310202153902E-3,2.6330310202153902E-3]
[null,"NHD3B2 Nambucca Nth","NAMBUCCA HEADS","Short Rural",1395,11183,1037,2.4958852137067522,1.810557692582366E-3,2.3506151012615804,2,9.8637125041123002E-5,9.8637125041123002E-5,2.3208735303793598E-6,2.3208735303793598E-6,4,0.12805883878574201,0.12805883878574201,5.2567785463092603E-4,5.2567785463092603E-4]
[null,"NHD3B3 Newee Ck Interconnector","NAMBUCCA HEADS","Short Rural",175,19169,0,0.32389350101538,0.70570832935138139,1.658219715408372,3,1.53398135990424E-2,1.53398135990424E-2,1.8218857213477999E-4,1.8218857213477999E-4,6,3.60443263635567E-2,2.8472476470694001E-2,1.0792061916264001E-4,9.0514067684795195E-5]
[null,"NHD3B4 Valla","NAMBUCCA HEADS","Short Rural",1187,75728,3651,1.8480982116759919,0.74321546804546013,9.2019095196138565,28,5.3715457423865201E-2,5.22788367085604E-2,1.6675476315775701E-3,1.664066321282E-3,32,0.66506255624491895,0.66506255624491895,2.1073531655844599E-3,2.1073531655844599E-3]
[null,"NME8B1 Rural Sth","NARROMINE","Long Rural",1123,783266,379,3.8867220121845603,10.123239443832531,4.2344926416257653,109,0.53717894341072103,0.53627380273387304,4.54891211954355E-3,4.5349868783612799E-3,103,0.224698852153974,0.221809364608651,8.7729019448339995E-4,8.70327573892262E-4]
[null,"NME8B2 Narromine Town Sth","NARROMINE","Short Rural",1113,12399,234,2.9340940680216776,0.65901909325252372,1.0518926066112815,15,4.5199012004138103E-2,4.5199012004138103E-2,4.1311548840752702E-4,4.1311548840752702E-4,4,7.2144353691842494E-2,7.2144353691842494E-2,2.27445605977178E-4,2.27445605977178E-4]
[null,"NME8B3 Trangie Rural","NARROMINE","Long Rural",306,404842,586,2.8845574149252085,2.4106562559965723,0.44260084475571321,32,0.11533464965543699,8.7877555354284306E-2,9.8056906658528105E-4,8.6568582683150305E-4,11,2.1175650091181299E-2,2.1175650091181299E-2,8.9353630919605497E-5,8.9353630919605497E-5]
[null,"NME8B4 Narromine Town Nth","NARROMINE","Short Rural",677,7368,520,2.0195712416253109,5.558574499985805E-2,2.5545670549221962,3,2.1978672332692599E-3,2.1978672332692599E-3,3.8294413251259502E-5,3.8294413251259502E-5,6,0.10100789735240499,0.10100789735240499,3.7017932809550898E-4,3.7017932809550898E-4]
[null,"NME8B5 River East","NARROMINE","Short Rural",223,129278,166,1.2574688862950048,0.32965077729561254,5.0932576510857606E-2,22,1.1115823773752E-2,7.5439994104981199E-3,1.5317765300503801E-4,1.0792061916264001E-4,6,1.71744641248073E-3,1.71744641248073E-3,2.32087353037936E-5,2.32087353037936E-5]
[null,"NME8B6 River West","NARROMINE","Long Rural",284,242210,644,2.6444951729961619,3.5451496507262026,0.25380942116173033,49,0.12871332512130901,7.8234325835558005E-2,8.0186180474606998E-4,5.6629314141256497E-4,10,9.2150283523712694E-3,9.2150283523712694E-3,4.1775723546828597E-5,4.1775723546828597E-5]
[null,"NSK3B1 Sea St","KEMPSEY","Urban",922,6733,306,1.9814661238587956,0.26299463987259408,2.9753072318020264,3,1.9352603933068299E-2,1.9352603933068299E-2,7.4267952972139703E-5,7.4267952972139703E-5,8,0.21893960448833699,0.21893960448833699,9.1094286067389997E-4,9.1094286067389997E-4]
[null,"NSK3B2 Frederickton","KEMPSEY","Short Rural",1066,120385,2340,1.7147302994931886,2.4327231905704529,4.8209866775168022,33,0.175757431582099,0.175757431582099,1.9564963861097998E-3,1.9564963861097998E-3,25,0.34830277419815298,0.33719275260822701,1.39832630205357E-3,1.27880131523903E-3]
[null,"NSK3B3 Aldavilla","KEMPSEY","Short Rural",1071,79872,4057,2.6483056847728137,4.5549223678271771,5.6260571162536044,35,0.33192088838396999,0.33192088838396999,6.5019271953577901E-3,6.5019271953577901E-3,13,0.40997534652092299,0.40997534652092299,1.25907389023081E-3,1.25907389023081E-3]
[null,"NSK3B4 Cochrane St","KEMPSEY","Urban",820,6744,3116,2.6483056847728137,3.1656719028593998,1.1909466149203825,7,0.17323580249134199,0.17323580249134199,1.2834430622997901E-3,1.2834430622997901E-3,3,6.5172449606582902E-2,6.5172449606582902E-2,3.0171355894931701E-4,3.0171355894931701E-4]
[null,"NSK3B5 Hospital","KEMPSEY","Urban",313,2129,285,0.39057745710678182,0,1.4095097298780079,0,0,0,0,0,3,0.116518295155931,0.116518295155931,3.42328845730956E-4,3.42328845730956E-4]
[null,"NVE12 Nevertire","WARREN","Long Rural",302,563708,0,1.1050484152289437,5.0305571026775668,7.0018128456107505,48,0.25016579740282602,0.24628413642326699,1.46447119766938E-3,1.44706464619153E-3,71,0.34819485357898999,0.34075993522442,1.4482250829567201E-3,1.41225154323584E-3]
[null,"NVE22 Gin Gin","WARREN","Short Rural",112,151593,80,0.91452282639636728,1.6306503230147831,0.84689723767017377,28,5.3881399881287297E-2,5.3881399881287297E-2,3.4000797220057701E-4,3.4000797220057701E-4,16,2.79839325925492E-2,2.79839325925492E-2,1.38091975057572E-4,1.38091975057572E-4]
[null,"NVE32 Auscott/Warren Town","WARREN","Short Rural",1059,71524,914,4.9155601918804734,2.2723309905317524,2.6704413401318252,26,0.106513009366465,4.27887848428391E-2,1.5515039550586E-3,3.4464971926133602E-4,13,0.125173992987481,0.125173992987481,5.7905794582965105E-4,5.7905794582965105E-4]
[null,"NVE42 Warren Rural Nth","WARREN","Long Rural",454,797003,595,2.2863070659909175,9.9633804878187142,4.9306866550144806,99,0.52183448806461796,0.50378969636591797,3.1633506219070702E-3,3.04962781891848E-3,33,0.25824591859884199,0.25808345745171601,1.30084961377763E-3,1.29968917701244E-3]
[null,"NYM70 Kangaroo Ck","GRAFTON","Short Rural",40,52571,0,0.12,0.26776415361562833,1.3823199199421852,6,2.2951118341921501E-2,2.2951118341921501E-2,1.65942457422125E-4,1.65942457422125E-4,9,0.118484075036162,0.118484075036162,3.8758587957335401E-4,3.8758587957335401E-4]
[null,"NYM71 Nymboida Rural","GRAFTON","Short Rural",100,35285,0,0.18000000000000002,1.2005363792612538,2.1073164478346427,10,8.6555817878733204E-2,8.6555817878733204E-2,5.5700964729104695E-4,5.5700964729104695E-4,7,0.15193250435599001,0.15193250435599001,4.6533514284106302E-4,4.6533514284106302E-4]
[null,"NYM72 Blaxland Ck","GRAFTON","Short Rural",98,34680,0,0.31,0.67699553199422535,2.1892256443100888,8,5.6602624095657098E-2,5.6602624095657098E-2,3.42328845730956E-4,3.42328845730956E-4,7,0.183038011846899,0.183038011846899,5.5933052082142703E-4,5.5933052082142703E-4]
[null,"NYN42 Nyngan Nth","NYNGAN","Short Rural",316,47840,336,1.2993845158381716,0.19716936010144839,1.1354840578499243,10,1.00412593291863E-2,1.00412593291863E-2,9.8637125041123002E-5,9.8637125041123002E-5,7,5.7826884882932202E-2,5.7826884882932202E-2,1.6362158389174501E-4,1.6362158389174501E-4]
[null,"NYN52 Nyngan West","NYNGAN","Long Rural",712,1899714,0,2.324412183757433,172.3069238597468,43.204653736055029,79,0.88117649721002,0.87618661911970397,3.5706639264886501E-3,3.5474551911848602E-3,70,0.220948320528881,0.20624326584039701,9.4343509009921103E-4,9.0630111361314199E-4]
[null,"NYN62 Nyngan Sth","NYNGAN","Short Rural",843,36768,42,3.4980498109661045,1.1308004289528411,2.0489891569008369,20,5.14491244214497E-2,5.14491244214497E-2,1.2555925799352401E-3,1.2555925799352401E-3,7,9.3224847968278304E-2,9.3224847968278304E-2,3.0171355894931701E-4,3.0171355894931701E-4]
[null,"OBE32 CSR Pineboard","OBERON","Urban",2,435,154,7.24,0,0,0,0,0,0,0,0,0,0,0,0]
[null,"OBE82 Oberon Urban","OBERON","Short Rural",2,1565,78,0.09,0,0,0,0,0,0,0,0,0,0,0,0]
[null,"OBR3B1 Industrial","OBERON","Long Rural",248,279303,162,0.51,4.4821304028805775,2.8988093785828104,43,0.315259337309377,0.17559613087173701,2.0934279244021899E-3,1.25327170640486E-3,65,0.203893381390888,0.185203386850743,9.0746155037833105E-4,7.97220057685312E-4]
[null,"OBR3B2 Black Springs","OBERON","Long Rural",450,317370,146,0.99,3.02993164294679,6.764130017423855,43,0.21699355203311399,0.210467255665687,1.7418155845497099E-3,1.25907389023081E-3,59,0.48442432762843302,0.48442432762843302,3.1366605763077102E-3,3.1366605763077102E-3]
[null,"OBR3B5 Oberon Town","OBERON","Short Rural",1333,14158,271,2.1,21.234184892411498,5.5057056751946432,16,0.20368566320991899,0.18400001392524101,4.8343795637802202E-3,3.35714356169375E-3,3,5.2812637620547602E-2,5.2812637620547602E-2,2.04236870673384E-4,2.04236870673384E-4]
[null,"OBR3B6 Interconnector No.1","OBERON","Short Rural",2,667,112,1.18,2.5436973660356191E-3,0,2,3.4813102955690502E-5,1.16043676518968E-5,4.6417470607587298E-6,2.3208735303793598E-6,0,0,0,0,0]
[null,"OBR3B7 Jenolan Caves","OBERON","Short Rural",330,153127,1784,1.18,8.8957885500560092,3.8077742495010751,55,0.36628490231153199,0.331130630946876,1.5294556565199999E-3,1.1233027887036101E-3,51,0.15678545090801299,0.156221478640131,7.6820913855556996E-4,7.6472782826000104E-4]
[null,"OBR3B8 Tarana Duckmaloi","OBERON","Long Rural",563,227116,1353,0.9,5.1022368055108567,3.6827103177746663,80,0.45170929434420498,0.44295147807731899,3.1761154263241602E-3,2.5668861245995802E-3,28,0.32603631354769302,0.32603631354769302,1.17436200637196E-3,1.17436200637196E-3]
[null,"OES5512 Gilmore Rd","QUEANBEYAN","Urban",633,6656,361,3.24,0.2654477393764304,0,3,5.7186323788547501E-3,5.7186323788547501E-3,1.18364550049348E-4,1.18364550049348E-4,0,0,0,0,0]
[null,"OES5522 Lorn Rd","QUEANBEYAN","Short Rural",910,6796,5620,1.143,1.2075406685127235,0.30069114181007711,4,5.5157880322995997E-2,5.5157880322995997E-2,1.01306129601059E-3,1.01306129601059E-3,2,1.3734929552785101E-2,1.3734929552785101E-2,1.72905078013263E-4,1.72905078013263E-4]
[null,"OES5532 Frederick St","QUEANBEYAN","Urban",1699,7558,1233,2.8570000000000002,0.16041655062056798,2.4396650269891142,6,1.3904353320502799E-2,1.3904353320502799E-2,1.8218857213477999E-4,1.8218857213477999E-4,5,0.21146174997345499,0.21146174997345499,9.59681204811867E-4,9.59681204811867E-4]
[null,"OES5542 Uriarra","QUEANBEYAN","Urban",1276,3892,979,1.333,7.1715097641129903E-3,0.62333987571317251,1,6.0110624436825503E-4,6.0110624436825503E-4,1.1604367651896799E-6,1.1604367651896799E-6,1,5.2247504915900203E-2,5.2247504915900203E-2,1.55498526535417E-4,1.55498526535417E-4]
[null,"OES5552 Crawford St","QUEANBEYAN","Urban",1065,2006,2870,4,0,1.1044150725582571,0,0,0,0,0,3,5.7549540496051897E-2,5.7549540496051897E-2,7.1482904735684397E-4,7.1482904735684397E-4]
[null,"OES5562 Collett St","QUEANBEYAN","Urban",1661,8904,835,4.7629999999999999,0.23079738986409551,0.29230079758260458,7,1.00679493747857E-2,1.00679493747857E-2,1.9843468684743599E-4,1.9843468684743599E-4,3,1.2750879175904201E-2,1.2750879175904201E-2,2.2976647950755699E-4,2.2976647950755699E-4]
[null,"OES5572 Yass Rd","QUEANBEYAN","Short Rural",473,17107,1858,3.43,7.3354623228115284E-2,1.0366645100832787E-2,3,1.4041284858795199E-3,1.4041284858795199E-3,4.9898780903156303E-5,4.9898780903156303E-5,1,1.9843468684743599E-4,1.9843468684743599E-4,1.04439308867071E-5,1.04439308867071E-5]
[null,"OES5582 Sutton","QUEANBEYAN","Urban",1,1843,105,0,0,0,0,0,0,0,0,0,0,0,0,0]
[null,"OKY3B1 Wollomombi","ARMIDALE","Short Rural",92,79040,0,0.22863070659909182,2.3873385399375602,0.85022103591990605,23,0.175135437475957,0.15874774947794901,8.0070136798088103E-4,7.7517175914670802E-4,11,6.23723156921802E-2,6.23723156921802E-2,1.72905078013263E-4,1.72905078013263E-4]
[null,"OKY3B2 Jeogla","ARMIDALE","Short Rural",156,107266,29,0.41915629543166832,4.8160723774715528,7.784229525819969E-2,35,0.28467022417897597,0.28467022417897597,1.29504742995169E-3,1.29504742995169E-3,2,4.6011317739770904E-3,4.6011317739770904E-3,2.0887861773414299E-5,2.0887861773414299E-5]
[null,"OKY3B3 Oaky Dam","ARMIDALE","Short Rural",5,679,0,0,0.56342896657688912,0,5,7.7111023046854401E-3,7.7111023046854401E-3,2.9010919129742099E-5,2.9010919129742099E-5,0,0,0,0,0]
[null,"OPM3B1 Granite St","PORT MACQUARIE","Urban",1337,5437,3401,1.9052558883257651,0.25603172940679708,0.93610216105025745,5,2.2793298941855701E-2,2.2793298941855701E-2,2.2048298538604E-4,2.2048298538604E-4,5,8.3336766292097006E-2,7.1326245772383806E-2,4.42126407537269E-4,3.8874631633854399E-4]
[null,"OPM3B2 Pacific Dr","PORT MACQUARIE","Urban",1256,4261,668,2.0957814771583414,6.3146072742108102E-3,1.1499833794875127,4,5.2567785463092603E-4,5.2567785463092603E-4,4.6417470607587298E-6,4.6417470607587298E-6,5,9.5733712254618394E-2,9.5733712254618394E-2,4.7926038402333902E-4,4.7926038402333902E-4]
[null,"OPM3B3 Lord St","PORT MACQUARIE","Urban",529,1966,947,1.7337828583764461,0.23912279919300275,0.66681854113195782,1,9.4691640039478095E-3,9.4691640039478095E-3,5.5700964729104695E-4,5.5700964729104695E-4,2,2.6405738591891201E-2,2.6405738591891201E-2,1.2300629711010599E-4,1.2300629711010599E-4]
[null,"OPM3B4 Hill St","PORT MACQUARIE","Urban",1315,3906,3686,4.8393499563474434,3.8659004762803292E-3,1.674295286782262,2,1.3693153829238199E-4,1.3693153829238199E-4,2.3208735303793598E-6,2.3208735303793598E-6,4,5.9304120885018699E-2,5.9304120885018699E-2,3.9802981046006098E-4,3.9802981046006098E-4]
[null,"OPM3B5 Kennedy Dr","PORT MACQUARIE","Urban",571,2669,239,0.9335753852796248,0.16967614544580376,0.70099588373513821,5,1.6517656915709899E-2,1.6517656915709899E-2,2.7966526041071303E-4,2.7966526041071303E-4,3,6.8240644413744403E-2,6.8240644413744403E-2,2.6341914569805798E-4,2.6341914569805798E-4]
[null,"OPM3B6 Grant St","PORT MACQUARIE","Urban",755,1775,2087,3.0103043035547086,0,0.80728855538788946,0,0,0,0,0,2,2.2077309457733701E-2,2.2077309457733701E-2,1.5317765300503801E-4,1.5317765300503801E-4]
[null,"OPM3B7 Port East","PORT MACQUARIE","Urban",1827,3387,2280,3.905774571067818,0.95543823574257358,0.14740430341574451,2,6.5746865805351801E-2,6.5746865805351801E-2,2.0992301082281301E-3,2.0992301082281301E-3,3,1.0143377764523001E-2,1.0143377764523001E-2,9.2834941215174605E-5,9.2834941215174605E-5]
[null,"OPM3B8 Koala St","PORT MACQUARIE","Short Rural",541,2994,1271,0.85736514974659428,0.31582216528913637,0.64168648849019982,3,2.9707181188855899E-2,2.9707181188855899E-2,1.03278872101882E-4,1.03278872101882E-4,4,6.0358957904576099E-2,6.0358957904576099E-2,5.7557663553408202E-4,5.7557663553408202E-4]
[null,"ORI825 Suma Pk","ORANGE","Urban",6,5527,856,2.15,1.8585818589583727E-3,0,1,2.9010919129742099E-5,2.9010919129742099E-5,1.1604367651896799E-6,1.1604367651896799E-6,0,0,0,0,0]
[null,"ORI826 Clover Hill","ORANGE","Short Rural",216,6794,6394,1.83,6.948568913690148E-2,2.861791315532855E-2,4,2.3104295994926601E-3,2.3104295994926601E-3,8.1230573563277697E-6,8.1230573563277697E-6,3,9.5155814745553902E-4,9.5155814745553902E-4,3.2492229425311099E-5,3.2492229425311099E-5]
[null,"ORI827 Clergate Rd Nth","ORANGE","Short Rural",453,125945,1370,1.04,1.3992983009467121,1.5877290669198045,48,7.6979893692387905E-2,7.6979893692387905E-2,6.6493026645368799E-4,6.6493026645368799E-4,21,8.7346075315827401E-2,8.7346075315827401E-2,4.68816453136632E-4,4.68816453136632E-4]
[null,"ORI828 Clifton Grove","ORANGE","Short Rural",205,23947,1417,1.65,0.39085202893544918,0.4548385827686387,12,2.7346852808460099E-2,2.7346852808460099E-2,2.7850482364552402E-4,2.7850482364552402E-4,4,3.1823817848561801E-2,3.1823817848561801E-2,1.16043676518968E-4,1.16043676518968E-4]
[null,"ORI829 Clergate Rd Sth","ORANGE","Short Rural",1509,7048,8228,2.71,8.6887881135831166E-2,2.0945498081783816E-2,9,7.8561569003341505E-3,7.8561569003341505E-3,7.7749263267708703E-5,7.7749263267708703E-5,2,1.8938328007895599E-3,1.8938328007895599E-3,6.96262059113809E-6,6.96262059113809E-6]
[null,"ORI830 Leeds Pde","ORANGE","Short Rural",1324,33720,4124,2.65,3.4121430939644735,0.52368979442704688,40,0.26374754930260702,0.26374754930260702,2.53323345840908E-3,2.53323345840908E-3,7,4.0479515680111697E-2,4.0479515680111697E-2,1.5317765300503801E-4,1.5317765300503801E-4]
[null,"ORI831 Abattoirs","ORANGE","Short Rural",245,137223,1745,2.06,4.0505811689216493,6.2980859111590339,84,0.27483784346752399,0.27483784346752399,1.5886379315446699E-3,1.5886379315446699E-3,28,0.42733432009139599,0.425409155497946,1.3147748549599101E-3,1.3043309240731999E-3]
[null,"ORI832 Kearneys Dr","ORANGE","Short Rural",588,195,5145,0.82699999999999996,1.2871224240420594E-3,0.512894450380314,1,1.2532717064048601E-4,1.2532717064048601E-4,2.0887861773414299E-5,2.0887861773414299E-5,5,4.99405566267032E-2,4.99405566267032E-2,2.3556866333350501E-4,2.3556866333350501E-4]
[null,"ORN3B1 William St Nth","ORANGE","Short Rural",885,80385,1825,2.31,3.8075698421347992,0.12602905420979246,55,0.26231092858730198,5.4998900486165E-2,2.1990276700344499E-3,2.9823224865374798E-4,5,8.6823878771492002E-3,8.1973253092999104E-3,4.0615286781638899E-5,3.9454850016449201E-5]
[null,"ORN3B3 Byng St West","ORANGE","Urban",162,352,1878,1.78,1.9363359665425384,0,2,3.3484402859548297E-2,1.15591106180544E-2,3.3188491484424898E-4,1.6826333095250399E-4,0,0,0,0,0]
[null,"ORN3B4 Metro Plaza","ORANGE","Urban",400,79,1689,3.71,3.0171220036445816,2.7620141708952701,3,5.3977716132798101E-2,7.3107516206950005E-4,4.0267155752081999E-4,2.3208735303793598E-6,3,4.9413718335307E-2,4.9413718335307E-2,3.1563880013159399E-4,3.1563880013159399E-4]
[null,"ORN3B5 Peisley St Nth","ORANGE","Urban",960,3960,661,1.8759999999999999,3.1555528668800883,0.60190985417190079,6,0.24370564593101601,9.4922566955750798E-2,1.6408575859782101E-3,5.2103610757016697E-4,2,4.6485936376733497E-2,4.6485936376733497E-2,1.4621503241390001E-4,1.4621503241390001E-4]
[null,"ORN3B6 Byng St East","ORANGE","Short Rural",1031,5495,963,2.86,2.3704494665818276,2.2979121466546646,11,0.18194952216115101,3.2364581381140199E-2,1.61300710361366E-3,4.7113732666701099E-4,4,0.176381746561771,0.12828396351818899,5.6397226788218598E-4,4.10794614877147E-4]
[null,"ORN3B7 Peisley St Sth","ORANGE","Urban",258,392,2103,2.113,1.6017315997658161,0.53848686305238436,5,3.8314140676267698E-2,9.1987822376586106E-3,5.7325576200370303E-4,3.49291466322094E-4,1,1.28808480936055E-2,1.28808480936055E-2,8.7032757389226195E-5,8.7032757389226195E-5]
[null,"ORN3B8 Prince St","ORANGE","Urban",543,1145,3221,2.61,1.7764213040689161,2.0329128415887912,5,0.106434099666432,2.9044571795932599E-2,8.3319359740619198E-4,2.37889536863885E-4,3,0.12180176374783901,0.12180176374783901,2.5181477804616103E-4,2.5181477804616103E-4]
[null,"ORN3B9 William St Sth","ORANGE","Urban",681,2148,1190,2.4700000000000002,2.2677863929047142,0,5,0.10850896060259201,1.0008767099761E-2,9.2834941215174597E-4,1.6478202065693499E-4,0,0,0,0,0]
[null,"ORS3B1 Bloom Field No.1","ORANGE","Urban",1,0,2747,0.1938,6.7831929760949785E-4,0,1,9.2834941215174595E-6,9.2834941215174595E-6,1.1604367651896799E-6,1.1604367651896799E-6,0,0,0,0,0]
[null,"ORS3B2 Jeager Ave","ORANGE","Short Rural",962,146036,4302,3.14,5.0027594052421414,3.4040754827707391,74,0.283209234291603,0.27905719154575398,2.7397912026128398E-3,2.70729897318753E-3,41,0.19270677097445901,0.18856401172273199,8.07663988572018E-4,7.4848171354734497E-4]
[null,"ORS3B4 Anson St Nth","ORANGE","Urban",1023,4412,2815,4.0999999999999996,1.8545040146141663,3.8393655050623128,10,7.8350369512076995E-2,7.8350369512076995E-2,2.7107802834831001E-3,2.7107802834831001E-3,5,0.162208171911744,0.162208171911744,4.2007810899866502E-4,4.2007810899866502E-4]
[null,"ORS3B5 Lords Place","ORANGE","Urban",1220,6789,2498,3.17,1.6128961198972709,0.19526587407957305,12,0.103520242949041,0.103520242949041,6.6957201351444705E-4,6.6957201351444705E-4,1,1.25327170640486E-2,1.25327170640486E-2,6.2663585320242801E-5,6.2663585320242801E-5]
[null,"ORS3B6 Peisley St Sth","ORANGE","Short Rural",1242,188785,1302,4.4000000000000004,6.8344282051501271,6.6634484472379629,75,0.27812536082330702,0.26768375081013002,1.3890428079320501E-3,1.3356627167333201E-3,26,0.27116738197922902,0.27116738197922902,1.04671396220109E-3,1.04671396220109E-3]
[null,"ORS3B7 Anson St Sth","ORANGE","Short Rural",2175,44762,5776,4.5999999999999996,2.4550392252691733,1.2499626654958871,34,0.191361824763605,0.191361824763605,2.8453909482450998E-3,2.8453909482450998E-3,14,9.7430270805325694E-2,9.7430270805325694E-2,5.2103610757016697E-4,5.2103610757016697E-4]
[null,"ORS3B8 Edward St","ORANGE","Urban",444,3019,1973,1.8,0.67880139677298457,1.5050109214342937,6,2.7199477339280999E-2,2.7199477339280999E-2,1.97274250082246E-4,1.97274250082246E-4,3,6.0305577813377399E-2,6.0305577813377399E-2,4.14275925172717E-4,4.14275925172717E-4]
[null,"ORS3B9 Peisley St Nth","ORANGE","Urban",352,1630,1174,3,0.64972258881390255,0,2,1.74564502587484E-2,1.74564502587484E-2,3.7946282221702602E-4,3.7946282221702602E-4,0,0,0,0,0]
[null,"ORS8 Email (Electrolux)","ORANGE","Urban",1,0,545,3.61,0,0,0,0,0,0,0,0,0,0,0,0]
[null,"ORW3B1 Manning Rd","ORANGE","Short Rural",472,114416,1903,1.73,2.1574640842505377,0.90348382245406755,50,0.15053185718040599,6.9903550298261299E-2,1.0908105592783001E-3,5.8137881936003101E-4,7,6.3038406395399094E-2,6.3038406395399094E-2,2.62258708932868E-4,2.62258708932868E-4]
[null,"ORW3B2 Mountain View","ORANGE","Short Rural",1366,7365,3736,3.1,5.3759214382044123,0.65359220345055691,17,0.48564974885247297,0.29194268138641999,5.3008751433864703E-3,3.7992699692310202E-3,4,5.90441830496162E-2,5.90441830496162E-2,3.8642544280816402E-4,3.8642544280816402E-4]
[null,"ORW3B3 Coogal Pk/Aux TX1","ORANGE","Short Rural",263,992,2095,0.74,0.80092751451022726,0,8,7.7824691657446002E-2,3.9654445140061799E-2,6.5332589880179098E-4,3.5277277661766298E-4,0,0,0,0,0]
[null,"ORW3B4 Glendale Cres/Redgum Ave","ORANGE","Short Rural",356,192,2771,0.85299999999999998,0.50745326518149891,0.52963714194842004,2,5.0488282779872697E-2,1.90311629491108E-4,4.3748466047650999E-4,4.7577907372777001E-5,3,5.2695433507263502E-2,2.19485009767976E-2,1.9263250302148699E-4,1.0908105592783E-4]
[null,"ORW3B5 March Rd","ORANGE","Short Rural",232,682,1576,0.495,0.38229587674913579,0,1,3.34205788374628E-2,0,2.6109827216767802E-4,0,0,0,0,0,0]
[null,"ORW3B6 Bel-Air/Aux TX2","ORANGE","Urban",1581,6513,8447,3.8759999999999999,3.2107313224321654,0.67346613027616375,9,0.27206439959872097,4.5424136736584901E-2,2.01683909789967E-3,2.5993783540248901E-4,6,5.7066798801733001E-2,4.82973781671946E-2,3.55093650148043E-4,2.48333467750592E-4]
[null,"ORW3B7 Cargo Rd","ORANGE","Short Rural",650,142378,1605,2.52,6.593864312479055,2.5370905127103298,76,0.37142447674455698,0.281343251973178,2.34756357597873E-3,1.6489806433345399E-3,22,0.142911268943405,0.142911268943405,5.6861401494294396E-4,5.6861401494294396E-4]
[null,"ORW3B8 Northern Distributor Sth","ORANGE","Short Rural",372,108886,2260,1.357,3.7953979163487199,1.4518690495730753,62,0.28602445388395298,0.233190928401632,2.2802582435977299E-3,1.87062406548577E-3,20,0.10941410127944,0.10941410127944,4.0499243105119898E-4,4.0499243105119898E-4]
[null,"OUR2557 East/West","WAGGA WAGGA","Short Rural",258,139210,336,0.76,3.959577103638277,1.5084445031609381,13,7.6822074292322198E-2,7.6822074292322198E-2,5.9530406054230701E-4,5.9530406054230701E-4,6,2.9266215218083799E-2,2.9266215218083799E-2,3.1679923689678299E-4,3.1679923689678299E-4]
[null,"OUR2580 SWTWS Pumping Stn","WAGGA WAGGA","Short Rural",3,6522,0,1.522,0,1.3046094687637788E-2,0,0,0,0,0,1,4.2007810899866502E-4,4.2007810899866502E-4,1.1604367651896799E-6,1.1604367651896799E-6]
[null,"OXY3B1 Hallsville","TAMWORTH","Short Rural",450,12426,2031,0.83259682319835926,7.0959029495382075E-2,0.333504813432976,11,6.2733211526154204E-3,6.00874157015217E-3,1.03278872101882E-4,9.8637125041123002E-5,6,2.9484377329939401E-2,2.9484377329939401E-2,1.5085677947465899E-4,1.5085677947465899E-4]
[null,"OXY3B2 Johnston/Peel","TAMWORTH","Urban",373,4006,1164,3.7705014029966888,0,4.7436200299865012,0,0,0,0,0,9,0.370167723727857,0.370167723727857,1.0351095945492E-3,1.0351095945492E-3]
[null,"OXY3B3 Alexandra/Fiona","TAMWORTH","Short Rural",1253,7184,8726,3.5799758141641123,1.7276392883154332,1.2011035153091485,4,0.11590210323361499,2.1605011694301499E-2,2.79897347763751E-3,1.41225154323584E-3,8,8.0578408101241103E-2,8.0578408101241103E-2,3.1912011042716301E-4,3.1912011042716301E-4]
[null,"OXY3B5 Dampier/Westdale","TAMWORTH","Urban",159,6165,1746,3.1436722157375123,2.1482385729948685,1.9037090925572213,4,3.0706317243684202E-2,3.0706317243684202E-2,3.35366225139818E-4,3.35366225139818E-4,2,2.7211081706932899E-2,2.7211081706932899E-2,4.4096597077207899E-5,4.4096597077207899E-5]
[null,"OXY3B6 Carrol/Manilla","TAMWORTH","Short Rural",969,33440,2184,2.4425380488336303,2.5378963784937461,0.88927081295312305,24,0.21991205049756599,0.13210760265948901,1.0049382386542599E-3,7.9025743709417405E-4,7,7.7056482518890496E-2,7.7056482518890496E-2,3.4348928249614599E-4,3.4348928249614599E-4]
[null,"OXY3B8 Avro/Plain","TAMWORTH","Urban",293,8210,748,6.2339972666019028,0.94582601187735471,0.28381791668491729,6,1.5654291962408799E-2,1.5654291962408799E-2,1.0095799857150201E-4,1.0095799857150201E-4,3,4.6974480254878296E-3,4.6974480254878296E-3,6.38240220854325E-5,6.38240220854325E-5]
[null,"OXY3B9 Forest Hills","TAMWORTH","Short Rural",1091,38521,12484,3.4294605989863771,3.5752456734905551,3.4865946853823049,13,0.28126666314667498,0.23451846806100901,3.5520969382456199E-3,3.4198071470139899E-3,12,0.27429243818788501,0.27429243818788501,1.14883239753779E-3,1.14883239753779E-3]
[null,"PAM3B1 Bald Hills No.3","BEGA","Long Rural",1730,351075,1617,2.9340000000000002,12.600756213149328,3.3231242344336276,86,0.78267514327042398,0.54973022746301203,6.6887575145533297E-3,4.7635929211036401E-3,26,0.20641036873458399,0.20641036873458399,1.05483701955742E-3,1.05483701955742E-3]
[null,"PAM3B2 Pambula No.4","BEGA","Short Rural",1077,17354,925,2.915,5.0169486817325408,13.613850465210882,10,0.21641797539758001,7.5615220056524907E-2,2.68060892758817E-3,1.46679207119976E-3,25,0.58726571506983805,0.58726571506983805,1.6141675403788501E-3,1.6141675403788501E-3]
[null,"PAM3B3 Merimbula No.5","BEGA","Short Rural",2362,16011,4491,4.0579999999999998,5.5929195634937692,18.283568012796461,4,0.31308003706435,2.70729897318753E-3,2.7096198467179101E-3,5.6861401494294398E-5,13,1.0234762159781701,1.0234762159781701,2.6225870893286799E-3,2.6225870893286799E-3]
[null,"PAM3B4 Merimbula No.6","BEGA","Short Rural",1404,16411,6628,3.2389999999999999,5.6772747144194815,1.0728162247399733,10,0.38677589471125101,0.19979936048329899,3.36990836611084E-3,1.79867698604401E-3,10,7.3087788781941707E-2,7.16859811695926E-2,3.5161233985247402E-4,3.4697059279171501E-4]
[null,"PAM3B5 Merimbula No.7","BEGA","Short Rural",1770,15856,18665,3.6390000000000002,5.9846885585031835,5.4953751120029306,10,0.24525598944930899,3.5138025249943599E-3,2.0586148214465001E-3,4.4096597077207899E-5,12,0.225203642146831,0.22109337512452901,9.4807683715996999E-4,8.5872320624036499E-4]
[null,"PCR12 Gobarralong","GUNDAGAI","Short Rural",11,17798,0,0.02,5.1599090860599182E-2,1.1010294252352093E-2,5,5.13377224919915E-3,5.13377224919915E-3,4.8738344137966598E-5,4.8738344137966598E-5,1,1.09545230633906E-3,1.09545230633906E-3,4.6417470607587298E-6,4.6417470607587298E-6]
[null,"PCR22 Nanangroe","GUNDAGAI","Short Rural",9,21733,0,0.08,7.4446032149735164E-2,5.7027837900978269E-2,5,3.0948848527608801E-3,3.0948848527608801E-3,2.9010919129742099E-5,2.9010919129742099E-5,2,2.3707723112825199E-3,2.3707723112825199E-3,1.27648044170865E-5,1.27648044170865E-5]
[null,"PCR32 Adjungbilly","GUNDAGAI","Short Rural",47,53460,0,0.152,0.75370783427201782,0.20226985838798986,10,3.8778315382343602E-2,3.8778315382343602E-2,2.7966526041071303E-4,2.7966526041071303E-4,5,1.0406796910221099E-2,1.0406796910221099E-2,7.1947079441760307E-5,7.1947079441760307E-5]
[null,"PER3B1 Smiggins","JINDABYNE","Short Rural",146,11769,5024,2.8919999999999999,0.64473638443684744,1.2410621079864792,10,1.21474520580056E-2,9.0270375964105407E-3,7.0786642676570595E-5,4.8738344137966598E-5,5,2.3382800818572101E-2,2.3382800818572101E-2,1.03278872101882E-4,1.03278872101882E-4]
[null,"PER3B2 Ski Centre","JINDABYNE","Urban",41,130,758,1.294,0,0.41374915903845977,0,0,0,0,0,1,6.1828070849306296E-3,6.1828070849306296E-3,2.0887861773414299E-5,2.0887861773414299E-5]
[null,"PER3B3 Snowmaker","JINDABYNE","Urban",1,76,1429,3.9580000000000002,0,0,0,0,0,0,0,0,0,0,0,0]
[null,"PER3B4 Lift Circuit","JINDABYNE","Urban",2,0,1101,0.58899999999999997,0,0,0,0,0,0,0,0,0,0,0,0]
[null,"PER3B5 Sth Perisher","JINDABYNE","Short Rural",92,264,21166,2.5110000000000001,1.4039824970756238,0,1,2.2363937338735599E-2,2.2363937338735599E-2,2.7850482364552401E-5,2.7850482364552401E-5,0,0,0,0,0]
[null,"PER3B6 Nth Perisher","JINDABYNE","Short Rural",27,72,8223,0.70399999999999996,0,0.4711775421019973,0,0,0,0,0,3,6.4485471041590596E-3,6.4485471041590596E-3,2.4369172068983299E-5,2.4369172068983299E-5]
[null,"PHS3B1 Cobborah Rd - Hospital","DUBBO","Urban",499,4731,2712,3.0484094213212236,0.2968728109437857,8.4950251128515751E-3,5,1.2166019046248601E-2,1.2166019046248601E-2,8.8193194154415798E-5,8.8193194154415798E-5,1,3.48131029556905E-4,3.48131029556905E-4,1.1604367651896799E-6,1.1604367651896799E-6]
[null,"PHS3B2 Wingewarra St","DUBBO","Urban",834,5461,3860,4.9536653096469889,2.8418973845029973,3.2161598742248541,5,0.116462594191202,0.116462594191202,1.1569554548941101E-3,1.1569554548941101E-3,12,0.13180008691671399,0.13180008691671399,5.1639436050940899E-4,5.1639436050940899E-4]
[null,"PHS3B3 Erskine St OH Nth - Nth Dubbo","DUBBO","Short Rural",647,8977,647,3.8105117766515302,0.384541470108415,15.726726724420613,9,1.5758731271275899E-2,1.5758731271275899E-2,2.0539730743857399E-4,2.0539730743857399E-4,24,0.64449033327163696,0.56897375034015296,2.24080339358128E-3,2.0388873964382699E-3]
[null,"PHS3B4 Erskine St UG - Dubbo CBD Via Macquarie St","DUBBO","Urban",173,483,3947,3.0484094213212236,0,0.41229188547706308,0,0,0,0,0,2,1.6895959301161799E-2,1.6895959301161799E-2,7.8909700032898402E-5,7.8909700032898402E-5]
[null,"PHS3B5 Erskine St - Dubbo CBD Via Brisbane St","DUBBO","Urban",180,719,2507,2.4768326548234945,0,0.20297446669640026,0,0,0,0,0,1,8.3180107328796396E-3,8.3180107328796396E-3,3.7133976486069797E-5,3.7133976486069797E-5]
[null,"PHS3B6 Talbragar St Auto Port - Dubbo CBD","DUBBO","Urban",305,64,3081,3.6199861878189532,5.2102820692156446E-3,0,1,2.13520364794902E-4,2.13520364794902E-4,1.1604367651896799E-6,1.1604367651896799E-6,0,0,0,0,0]
[null,"PHS3B7 Fitzroy St - Rural Nth","DUBBO","Short Rural",420,20989,1420,3.6199861878189532,0.37457397397600167,1.4843640547189318,7,1.53502575299291E-2,1.53502575299291E-2,1.03278872101882E-4,1.03278872101882E-4,9,6.0830095231243102E-2,6.0830095231243102E-2,2.0655774420376299E-4,2.0655774420376299E-4]
[null,"PHS3B8 Fitzroy St Sth","DUBBO","Urban",1036,7812,1459,3.2389350101538001,1.7519290290233793,1.8355767096345921,14,7.1795062225520401E-2,7.1795062225520401E-2,2.7374703290824602E-3,2.7374703290824602E-3,7,7.5222992429890806E-2,7.5222992429890806E-2,3.00553122184128E-4,3.00553122184128E-4]
[null,"PIN2J01 Pindari Dam","INVERELL","Short Rural",12,16185,0,0.25987690316763434,2.8225542468953454E-3,0,1,2.8082569717590301E-4,2.8082569717590301E-4,1.1604367651896799E-6,1.1604367651896799E-6,0,0,0,0,0]
[null,"PKH22 Rural East","PEAK HILL","Short Rural",52,28393,0,0.190525588,0.31138405120880791,0.62713628269787225,9,1.0753767503012801E-2,1.0186313924834999E-2,2.1235992802971199E-4,2.0887861773414299E-4,4,2.1658391785500199E-2,2.1658391785500199E-2,6.4984458850622198E-5,6.4984458850622198E-5]
[null,"PKH32 Peak Hill","PEAK HILL","Short Rural",568,14557,14,1.1050484104,1.4869123424871342,0.53852030785596217,16,6.5049443309472793E-2,6.4873056921164005E-2,1.8938328007895599E-3,1.8926723640243701E-3,3,2.35591872068809E-2,2.35591872068809E-2,8.2391010328467402E-5,8.2391010328467402E-5]
[null,"PKH42 Rural West","PEAK HILL","Short Rural",93,172392,0,0.22863070560000001,1.487057821673659,1.7300916117865988,38,8.5339680148814406E-2,8.5339680148814406E-2,7.2875428853911997E-4,7.2875428853911997E-4,9,9.9286969629629199E-2,9.9286969629629199E-2,2.8546744423666202E-4,2.8546744423666202E-4]
[null,"PKH52 Alectown","PEAK HILL","Long Rural",176,215248,73,0.49536652879999998,1.7192026572032575,0.42142416929432208,51,9.4017426278902902E-2,9.4017426278902902E-2,1.02002391660173E-3,1.02002391660173E-3,4,2.3046274156667101E-2,2.3046274156667101E-2,6.9626205911380896E-5,6.9626205911380896E-5]
[null,"PKT3B10 Tichbourne","PARKES","Long Rural",854,285119,140,4.5726141119999992,1.7730856890877407,1.9481165696210914,54,8.9070484348899207E-2,8.8845359616452402E-2,1.57123138006683E-3,1.5689105065364499E-3,13,9.7863113718741401E-2,9.7863113718741401E-2,3.1215748983602398E-4,3.1215748983602398E-4]
[null,"PKT3B2 Parkes Town No.2","PARKES","Short Rural",1811,27918,953,4.667876906,2.4033149437169081,5.7085769775047384,17,0.14855911467958299,0.14828060985593799,2.3696118745173298E-3,2.3684514377521398E-3,10,0.35287141374270398,0.35287141374270398,9.8056906658528105E-4,9.8056906658528105E-4]
[null,"PKT3B3 Telescope","PARKES","Short Rural",161,156429,60,0.95262793999999995,0.20008586310673104,0.13165632155943063,22,1.0532124080861601E-2,1.0532124080861601E-2,5.8021838259484103E-5,5.8021838259484103E-5,6,6.9301283617127802E-3,6.6620674689539597E-3,2.6690045599362699E-5,2.5529608834173001E-5]
[null,"PKT3B4 Cooks Myall","PARKES","Long Rural",258,302435,35,0.8002074696,5.2024468544631235,0.45631097414280891,65,0.322461007874144,0.322461007874144,1.1569554548941101E-3,1.1569554548941101E-3,8,2.8283325277968101E-2,2.8283325277968101E-2,1.1140192945820901E-4,1.1140192945820901E-4]
[null,"PKT3B7 Nelungaloo","PARKES","Short Rural",10,4421,303,0.41915629359999995,0.26070159737619519,0.24992696808540218,6,5.4470901758003698E-3,5.4470901758003698E-3,1.74065514778452E-5,1.74065514778452E-5,4,5.2219654433535703E-3,5.2219654433535703E-3,1.6246114712655499E-5,1.6246114712655499E-5]
[null,"PKT3B8 Parkes Town No.1","PARKES","Urban",1192,6964,1411,4.8584024939999999,1.0777991248769883,4.9730255625008555,3,3.7894062567269099E-2,3.7894062567269099E-2,6.2663585320242801E-5,6.2663585320242801E-5,5,0.17484532828466001,0.17484532828466001,4.4676815459802801E-4,4.4676815459802801E-4]
[null,"PKT3B9 Parkes Town No.3","PARKES","Short Rural",2111,41323,1634,4.9536652879999989,0.75516001222189988,13.312155798086005,18,4.7233257653515603E-2,4.7233257653515603E-2,4.4676815459802801E-4,4.4676815459802801E-4,43,0.83264006906919596,0.76523029737932702,2.4995807922185802E-3,2.3104295994926601E-3]
[null,"PPM3B1 Boomerang Beach","FORSTER","Short Rural",1098,26480,1044,2.1910442715746297,16.388151049155457,10.743705493577888,21,1.1976891062257999,0.40425671414206898,5.4598549802174498E-3,4.1961393429258897E-3,8,0.78517820537293803,0.78326348471037499,2.26865387594583E-3,2.24312426711166E-3]
[null,"PPM3B2 Coomba Park","FORSTER","Short Rural",682,67203,470,1.0097856208126554,23.849368791002483,3.7247331460416468,24,2.0678078015003298,0.47704859154888701,3.4720268014475299E-3,2.64115407757172E-3,5,0.32294491000522801,0.32294491000522801,9.0862198714352098E-4,9.0862198714352098E-4]
[null,"PPM3B3 Smiths Lake","FORSTER","Short Rural",834,10428,807,1.409889357361066,28.439719045992778,8.656624809366356,13,2.2808697937729798,0.342740800782599,5.6687335979516001E-3,4.71021282990492E-3,14,0.69426262656738802,0.69426262656738802,2.3765744951084701E-3,2.3765744951084701E-3]
[null,"PPM3B4 Pacific Palms","FORSTER","Short Rural",315,35068,1908,0.68589211979727527,12.149970079697548,3.4631311054765752,16,0.90103273069918099,0.105495306323394,1.65710370069087E-3,9.4111421656883204E-4,16,0.25682322312472,0.25682322312472,7.6472782825999996E-4,7.6472782825999996E-4]
[null,"PPTW150 Providence Portal","COOMA","Short Rural",3,1120,0,0.124,0.10373156583835723,0,5,1.9924699258306801E-3,1.9924699258306801E-3,1.16043676518968E-5,1.16043676518968E-5,0,0,0,0,0]
[null,"PPTW190 Tantangara","COOMA","Short Rural",1,17428,87,0.114,0.20129125156561875,0,2,2.7548768805603099E-3,2.7548768805603099E-3,2.3208735303793598E-6,2.3208735303793598E-6,0,0,0,0,0]
[null,"PSK3B1 Dondingalong","KEMPSEY","Short Rural",1012,141656,539,1.9433610060922801,3.3655982154425041,15.332624420102423,45,0.23855446713033901,0.221726973598323,2.7119407202482902E-3,2.4508424480806099E-3,43,1.0867803623928001,1.07721836344763,3.7737403603968502E-3,3.7366063839107799E-3]
[null,"PSK3B2 Kundabung","KEMPSEY","Short Rural",733,110883,1000,1.2384163274117472,5.666888543953708,23.622764953992977,34,0.27927999540467002,0.27908272115458799,2.4032645407078301E-3,2.40210410394264E-3,18,1.16419541987213,1.16419541987213,3.0832804851089902E-3,3.0832804851089902E-3]
[null,"PSK3B3 East","KEMPSEY","Short Rural",510,26439,514,1.9052558883257651,1.0574782324312828,0.44805833684529822,6,9.1593273876421605E-2,9.1593273876421605E-2,1.19989161520613E-3,1.19989161520613E-3,4,3.8808486738238501E-2,3.8808486738238501E-2,1.4041284858795199E-4,1.4041284858795199E-4]
[null,"PSK3B4 Industrial","KEMPSEY","Urban",167,4766,221,1.1050484152289437,0.78982032114826295,1.1936077171880941,3,7.2272001736013404E-3,7.2272001736013404E-3,1.8218857213477999E-4,1.8218857213477999E-4,2,1.0922030833965301E-2,1.0922030833965301E-2,6.03427117898635E-5,6.03427117898635E-5]
[null,"PSK3B5 Central","KEMPSEY","Urban",604,2850,1610,1.8099930939094766,0.14162873159009212,2.8230795633073158,3,4.5349868783612799E-3,4.5349868783612799E-3,8.9353630919605497E-5,8.9353630919605497E-5,4,9.0395703134745806E-2,9.0395703134745806E-2,3.7830238545183599E-4,3.7830238545183599E-4]
[null,"PSK3B6 Elbow St","KEMPSEY","Urban",504,3763,1113,1.6194675050769001,1.6258346811125244,0.66224007773826754,2,3.8759748394100603E-2,3.8759748394100603E-2,5.0246911932713201E-4,5.0246911932713201E-4,2,1.5787742190405601E-2,1.5787742190405601E-2,1.2880848093605501E-4,1.2880848093605501E-4]
[null,"PYB12 Eugowra","FORBES","Short Rural",517,169542,0,1.43,1.5495455491695393,7.9707631185887315,26,6.7149833854466198E-2,6.7149833854466198E-2,5.8486012965560004E-4,5.8486012965560004E-4,54,0.34541444708959601,0.34541444708959601,1.3646736358630699E-3,1.3646736358630699E-3]
[null,"PYB22 Gooloogong","FORBES","Short Rural",236,105527,211,1.42894191,0.64740787162707081,3.8674886638901658,19,2.5694390854829899E-2,2.5694390854829899E-2,4.1311548840752702E-4,4.1311548840752702E-4,31,0.15349329180516999,0.15349329180516999,5.2683829139611499E-4,5.2683829139611499E-4]
[null,"PYB32 Forbes","FORBES","Long Rural",162,200689,0,0.89547026359999993,0.57172340672173116,5.1799216775339936,32,2.12081423206066E-2,2.12081423206066E-2,2.13520364794902E-4,2.13520364794902E-4,43,0.19214976132716799,0.191157587892931,6.1851279584609995E-4,6.1503148555053103E-4]
[null,"QDI3B1 West Rural","QUIRINDI","Short Rural",258,163342,172,1.6385200639601578,1.5410561008145156,2.2178538095195495,26,6.0862587460668402E-2,6.0862587460668402E-2,7.7053001208594895E-4,7.7053001208594895E-4,12,8.7592087910047606E-2,8.7592087910047606E-2,1.79867698604401E-4,1.79867698604401E-4]
[null,"QDI3B2 Industrial","QUIRINDI","Short Rural",535,52854,401,1.4594260104575361,3.0759103766742251,2.0296440026515596,24,0.16016928451530599,0.15978634038279299,2.1444871420705299E-3,2.1433267053053398E-3,4,0.105687938826416,0.105687938826416,3.1563880013159399E-4,3.1563880013159399E-4]
[null,"QDI3B3 Quirindi","QUIRINDI","Short Rural",878,9688,216,2.3701383250772516,3.6382683258123105,0.22138616185977664,9,0.154529561836484,0.154529561836484,1.17436200637196E-3,1.17436200637196E-3,3,9.4030191083319895E-3,9.4030191083319895E-3,3.8294413251259502E-5,3.8294413251259502E-5]
[null,"QDI3B4 East Rural","QUIRINDI","Long Rural",865,213401,166,2.7797683410672911,5.5163085888894097,4.6282987425444979,54,0.36721441216044898,0.36224774280543698,3.80739302658735E-3,3.76677773980571E-3,33,0.30810060290492097,0.28752373818457799,9.4807683715997096E-4,8.8773412537010703E-4]
[null,"QSH5232 Southbar","QUEANBEYAN","Urban",136,2111,602,4.38,0,0,0,0,0,0,0,0,0,0,0,0]
[null,"QSH5242 Queenbar St","QUEANBEYAN","Short Rural",1064,9032,2480,2.48,3.6637929682800139,0.88942145861235333,9,0.29242310220720902,0.29231402115128102,2.6759671805274099E-3,2.6748067437622198E-3,6,7.0988558673713606E-2,6.1695781058074599E-2,5.5120746346509905E-4,4.4560771783283798E-4]
[null,"QSH5252 Dane St","QUEANBEYAN","Short Rural",1008,102681,4046,2.86,0.33820495808436429,2.9129407139238519,21,3.0442898097986101E-2,3.0442898097986101E-2,1.72905078013263E-4,1.72905078013263E-4,10,0.262203007968139,0.262203007968139,8.5872320624036499E-4,8.5872320624036499E-4]
[null,"QSH5262 Cassia Cres","QUEANBEYAN","Urban",1725,5399,1812,3.79,1.7323325941396881,7.6804212274323325,5,9.3852644258245896E-2,9.3852644258245896E-2,1.9959512361262502E-3,1.9959512361262502E-3,8,0.416102452641125,0.416102452641125,1.4366207153048299E-3,1.4366207153048299E-3]
[null,"QSH5272 Banksia Cres","QUEANBEYAN","Short Rural",2045,4507,14378,5.75,0.12055269558816029,1.1979969595066049,4,1.15370623195158E-2,1.15370623195158E-2,1.5085677947465899E-4,1.5085677947465899E-4,13,0.114649991963975,0.114649991963975,1.35422970497636E-3,1.35422970497636E-3]
[null,"QSH5282 Oleria St","QUEANBEYAN","Urban",2041,7272,2042,4.04,1.3806691597014802,6.5589340510153917,3,9.7015994880153E-2,9.7015994880153E-2,2.40210410394264E-3,2.40210410394264E-3,13,0.46087906566273401,0.46087906566273401,1.57239181683202E-3,1.57239181683202E-3]
[null,"QSH5292 Cameron Rd","QUEANBEYAN","Urban",698,3226,2011,1.77,1.4385133484634069,3.7969211857332699,6,6.4642130004891205E-2,6.4642130004891205E-2,1.17320156960677E-3,1.17320156960677E-3,5,0.170621338459369,0.170621338459369,6.31277600263187E-4,6.31277600263187E-4]
[null,"QSH5302 Karri Cres","QUEANBEYAN","Short Rural",1385,7050,11346,3.45,0.96885759934623428,1.1189054423730589,4,8.3276423580307193E-2,8.3276423580307193E-2,1.9518546390490501E-3,1.9518546390490501E-3,4,9.6173517788625304E-2,9.6173517788625304E-2,5.8137881936003101E-4,5.8137881936003101E-4]
[null,"QSH5312 Wirilda Cres","QUEANBEYAN","Urban",1350,5279,9649,3.37,0.22667596676188892,2.2665938779193029,4,1.90392860064671E-2,1.90392860064671E-2,1.3345022799681299E-4,1.3345022799681299E-4,7,0.190378934823489,0.190378934823489,6.6260939292330802E-4,6.6260939292330802E-4]
[null,"QUI3B1 Quira","BEGA","Short Rural",176,96460,315,0.97099999999999997,1.2566641506597234,1.5946261945438975,25,5.5843698451223098E-2,5.5490925674605403E-2,5.3264047522206398E-4,5.3031960169168499E-4,11,7.0862071066307902E-2,7.0862071066307902E-2,4.2355941929423399E-4,4.2355941929423399E-4]
[null,"QUI3B2 Mogilla","BEGA","Short Rural",176,111552,0,0.47600000000000003,0.89324039246216647,1.3674588141543416,8,4.7530329465404197E-2,4.7530329465404197E-2,4.4328684430245899E-4,4.4328684430245899E-4,16,7.2764026924453801E-2,6.6804023698439602E-2,4.63014269310683E-4,4.4444728106764799E-4]
[null,"QUI3B3 Bemboka","BEGA","Short Rural",345,65516,0,0.68500000000000005,5.1381677704219504,3.0564242730468769,26,0.25510809758576902,0.25510809758576902,1.5770335638927799E-3,1.5770335638927799E-3,8,0.15175031578385501,0.139270978811005,8.2739141358024299E-4,7.8329481650303502E-4]
[null,"RAG3B10 Industrial","BATHURST","Short Rural",72,4083,2497,0.91,0.58957246784592454,3.7711466592473229E-2,2,8.2727536990372403E-3,8.2727536990372403E-3,1.4969634270946901E-4,1.4969634270946901E-4,1,5.2915916492649495E-4,5.2915916492649495E-4,2.3208735303793598E-6,2.3208735303793598E-6]
[null,"RAG3B11 Gilmour St","BATHURST","Short Rural",1512,12446,9470,3.33,2.66897569989142,0.87745831907809679,6,0.177534060269604,0.177534060269604,3.3606248719893201E-3,3.3606248719893201E-3,6,5.8366487978745399E-2,5.8366487978745399E-2,1.7754682507402101E-4,1.7754682507402101E-4]
[null,"RAG3B12 Mars Australia No.2","BATHURST","Urban",1,0,71,2.61,0,0,0,0,0,0,0,0,0,0,0,0]
[null,"RAG3B2 Kelso Industrial No.2","BATHURST","Urban",96,6866,1053,2.82,1.8432384772630344,1.3781585076419091E-2,4,1.10195075222412E-2,1.10195075222412E-2,2.0307643390819399E-4,2.0307643390819399E-4,1,8.2391010328467402E-5,8.2391010328467402E-5,1.1604367651896799E-6,1.1604367651896799E-6]
[null,"RAG3B3 Raglan Industrial","BATHURST","Short Rural",249,101717,531,1.1000000000000001,6.318089055632619,10.172460700732957,28,6.9117934608227904E-2,6.9117934608227904E-2,9.1906591803022795E-4,9.1906591803022795E-4,8,0.11128356490815999,0.11128356490815999,2.5181477804616103E-4,2.5181477804616103E-4]
[null,"RAG3B4 Mars Australia No.1","BATHURST","Urban",1,0,222,4.29,0,0,0,0,0,0,0,0,0,0,0,0]
[null,"RAG3B5 OConnell","BATHURST","Long Rural",572,246858,3073,1.41,1.9005036802858575,0.47907685676694428,40,0.15504015401316701,0.15502622877198499,1.9321272140408201E-3,1.93096677727563E-3,13,3.9082349814823301E-2,3.9082349814823301E-2,1.9495337655186699E-4,1.9495337655186699E-4]
[null,"RAG3B6 Limekilns","BATHURST","Long Rural",1126,274623,4005,2.48,4.4597012463546779,4.0107065128449424,90,0.358118908794892,0.35755841783730602,3.8027512795265899E-3,3.7992699692310202E-3,96,0.32206413850044902,0.31503189170339901,2.3266757142053102E-3,2.2709747494762101E-3]
[null,"RAG3B7 View St","BATHURST","Short Rural",1678,8139,10683,3.77,2.6524279484425861,0.48664346551842214,13,0.20955051062118801,0.20955051062118801,3.9013884045677101E-3,3.9013884045677101E-3,3,3.8446430467499397E-2,3.8446430467499397E-2,1.7522595154364199E-4,1.7522595154364199E-4]
[null,"RAG3B8 Raglan","BATHURST","Urban",297,3175,294,0.51,0.98879115953154351,0.16176678709856881,4,6.7178844773595897E-2,6.7178844773595897E-2,7.6704870179038003E-4,7.6704870179038003E-4,1,1.0990496603111501E-2,1.0990496603111501E-2,4.7577907372777001E-5,4.7577907372777001E-5]
[null,"RAG3B9 Devro","BATHURST","Urban",1,3273,419,2.19,0,0,0,0,0,0,0,0,0,0,0,0]
[null,"RBV Euston","BALRANALD","Long Rural",559,207634,1134,5.1166,2.2545114721069766,0.98789644137174693,13,9.5086188539642597E-2,2.7618395011514401E-3,6.2315454290685901E-4,1.97274250082246E-5,23,4.1665482054135498E-2,3.8764390141161301E-2,2.5645652510691998E-4,2.3904997362907501E-4]
[null,"RCF10 Brooms Head","MACLEAN","Short Rural",309,15833,0,0.88,5.030358705165491,0.96036906162719593,20,0.37722550013374001,0.33734244895093601,3.56834305295827E-3,3.3188491484424901E-3,4,7.2017866084436902E-2,7.2017866084436902E-2,4.49089028128407E-4,4.49089028128407E-4]
[null,"RGL3B11 Raleigh/Repton","DORRIGO","Short Rural",590,26526,3702,2.2863070659909175,8.2945065309946102,3.2984086128272607,27,0.58613080791348204,0.583937582427274,6.3510704158831303E-3,6.3487495423527503E-3,13,0.233081847345704,0.233081847345704,8.3899578123214E-4,8.3899578123214E-4]
[null,"RGL3B5 Urunga No.1","DORRIGO","Short Rural",1249,15179,557,2.2863070659909175,1.8144995780792859,0.5181724065939376,12,0.108081919873002,9.4950417438115303E-2,1.8485757669471599E-3,1.7418155845497099E-3,3,3.0865297080515199E-2,3.0865297080515199E-2,1.9263250302148699E-4,1.9263250302148699E-4]
[null,"RGL3B6 Bellingen Town","DORRIGO","Short Rural",1180,31181,1914,2.667358243656071,10.574498599701364,3.5767777207717923,25,0.50459155817066403,0.50459155817066403,4.5013342121707801E-3,4.5013342121707801E-3,26,0.170675878987333,0.16704951409611499,7.5080258707772396E-4,7.2295210471317196E-4]
[null,"RGL3B7 Bellingen Rural","DORRIGO","Short Rural",1441,168753,3350,3.2389350101538001,9.3133114229632703,1.5409552020619046,97,0.73531771888303299,0.70554903454562201,6.6144895615811898E-3,6.0203459378040704E-3,19,0.12166367177278201,0.114427188105059,6.45202841445463E-4,6.2431497967204905E-4]
[null,"RGL3B8 Kalang/Valla","DORRIGO","Short Rural",948,114462,6151,1.2384163274117472,10.714434227572484,10.260464819967908,57,0.66096041227997404,0.66069583269751098,4.2007810899866499E-3,4.1996206532214598E-3,55,0.63295559182565098,0.62380322705860003,2.3986227936470699E-3,2.3626492539261901E-3]
[null,"RKF3B1 Nelson St","PORT MACQUARIE","Short Rural",1190,15591,3041,2.2291493893411447,4.7776273598682167E-2,4.5380545841526843,5,2.4055854142382102E-3,2.4055854142382102E-3,3.7133976486069797E-5,3.7133976486069797E-5,4,0.228495801249674,0.228495801249674,9.6548338863781502E-4,9.6548338863781502E-4]
[null,"RKF3B2 Cameron St","PORT MACQUARIE","Short Rural",931,13077,2218,1.5242047106606118,0.91891376572072236,0.93630214645661536,8,6.9481151315732195E-2,6.9481151315732195E-2,1.2892452461257401E-3,1.2892452461257401E-3,2,7.0795926170692094E-2,7.0795926170692094E-2,2.8546744423666202E-4,2.8546744423666202E-4]
[null,"RKF3B3 Telegraph Point","PORT MACQUARIE","Short Rural",484,93241,948,0.85736514974659428,2.7626965744902585,3.2268162938928411,38,0.21589577885324501,0.21580642522232499,2.3765744951084701E-3,2.37541405834328E-3,39,0.252165229949248,0.252165229949248,9.3415159597769399E-4,9.3415159597769399E-4]
[null,"RKF3B4 Wauchope Town","PORT MACQUARIE","Urban",1199,10324,2622,2.7626210380723593,0.51004981918380177,0.60900869777871325,9,2.3511609299508199E-2,2.3208735303793599E-2,2.5065434128097099E-4,2.4717303098540202E-4,5,2.8073286223468798E-2,2.8073286223468798E-2,1.7522595154364199E-4,1.7522595154364199E-4]
[null,"RKF3B5 King Creek","PORT MACQUARIE","Short Rural",872,69943,8664,1.7528354172597038,5.0353539329872357,8.7869144039415978,24,0.41678711033258697,0.33601606972832399,4.9481023667687996E-3,4.5779230386732896E-3,29,0.72731186563998995,0.72526949693325604,2.8987710394438298E-3,2.8871666717919298E-3]
[null,"RVL3K1 Rappville","CASINO","Long Rural",348,228316,342,1.26,1.3706055405185757,2.944600082739143,23,8.3720870861374794E-2,8.3720870861374794E-2,9.3763290627326302E-4,9.3763290627326302E-4,21,0.17986537773087,0.17012583196063299,5.8253925612522105E-4,5.5700964729104695E-4]
[null,"RWR2447 Bartters","DARLINGTON POINT","Short Rural",1,23887,781,1.73,0.18192676907530647,0,1,2.9010919129742099E-5,2.9010919129742099E-5,1.1604367651896799E-6,1.1604367651896799E-6,0,0,0,0,0]
[null,"RWR2448 Boondilla","DARLINGTON POINT","Short Rural",10,11066,18,1.73,6.3948633987266648E-2,0,3,1.8137626639914699E-3,1.8137626639914699E-3,2.2048298538604E-5,2.2048298538604E-5,0,0,0,0,0]
[null,"SCK3B1 Dam Pumping Stn","GRAFTON","Short Rural",1,331,6123,0.84,4.163184689078292E-2,0.11132915472015879,3,5.69774451708134E-4,5.69774451708134E-4,3.4813102955690501E-6,3.4813102955690501E-6,4,1.5236534726940499E-3,1.5236534726940499E-3,4.6417470607587298E-6,4.6417470607587298E-6]
[null,"SFP3B1 Byron No.4","EWINGSDALE","Short Rural",2362,11888,7092,4.01,10.014098172039631,8.1967473162103239,24,0.64800065448633604,0.42874773207139699,8.8831434375270194E-3,6.0946138907762102E-3,13,0.53040199270201305,0.53040199270201305,1.77778912427059E-3,1.77778912427059E-3]
[null,"SFP3B3 Suffolk No.1","EWINGSDALE","Short Rural",1093,43106,2759,1.87,23.244199932090069,2.3116994538831093,22,1.8229614462291299,1.73414625796857,7.7053001208594899E-3,6.4717558394628604E-3,13,0.18129851713587999,0.18125326010203699,1.02118435336692E-3,1.02002391660173E-3]
[null,"SFP3B4 Talofa","EWINGSDALE","Short Rural",1285,83390,4050,3.8899999999999997,7.6837986426488403,5.8978630151452327,35,0.40417548356850602,0.296691188629576,4.1740910443872903E-3,2.7212242143698001E-3,42,0.31023348567934,0.310163859473429,1.08152706515678E-3,1.08036662839159E-3]
[null,"SFP3B5 Suffolk No.2","EWINGSDALE","Short Rural",1029,4339,6250,2.1399999999999997,0.96626932327735127,0.18891075246656547,3,8.4320816668977894E-2,3.36990836611084E-3,1.2184586034491699E-3,4.5257033842397598E-5,7,1.6485164686284599E-2,1.6485164686284599E-2,2.5181477804616103E-4,2.5181477804616103E-4]
[null,"SGN3B1 Armidale Rd","GRAFTON","Long Rural",1517,245556,1016,3.03,14.483341720771298,3.9085598378706159,57,0.94434255164959002,0.94072198894219805,9.7209787819939608E-3,9.6931282996294103E-3,19,0.25484583887683598,0.20274686986688001,9.9797561806312706E-4,7.1482904735684397E-4]
[null,"SGN3B2 Clarenza","GRAFTON","Short Rural",559,63572,1021,1.66,8.7706276959461764,1.1648503543247979,18,0.34990649780764499,0.23330929295168101,3.80855346335254E-3,3.1877197939760601E-3,5,4.6472011135551203E-2,4.6472011135551203E-2,1.69423767717694E-4,1.69423767717694E-4]
[null,"SGN3B3 Waterview Hts","GRAFTON","Short Rural",820,124229,9,1.99,2.2503164964760747,4.5717611530302633E-2,44,0.19546164785501999,0.18806270304017,2.7537164437951198E-3,2.66668368640589E-3,5,3.9710146104790902E-3,3.9710146104790902E-3,1.39252411822762E-5,1.39252411822762E-5]
[null,"SGN3B4 Ulmarra","GRAFTON","Long Rural",980,206076,291,1.57,9.8498464881796561,1.8081696786555435,69,0.62351543874083304,0.619580397670075,5.3925496478364502E-3,5.3565761081155704E-3,15,0.114460840771249,0.111912521634893,3.8178369574740501E-4,3.6785845456512901E-4]
[null,"SGN3B5 Interconnector","GRAFTON","Urban",475,2942,1981,3.4899999999999998,5.0688168269065796,1.5053809124586917,6,0.114102265810806,1.8529854266548799E-2,1.0710831342700801E-3,5.4076353257839196E-4,1,3.3887074417069098E-2,3.3887074417069098E-2,1.0792061916264001E-4,1.0792061916264001E-4]
[null,"SGN3B6 Rushforth Rd","GRAFTON","Short Rural",1772,78595,3131,3.15,4.2705110126677326,1.7637938063619729,32,0.37113900930032101,0.37113900930032101,8.9284004713694205E-3,8.9284004713694205E-3,7,0.15328673406096599,0.15328673406096599,6.4056109438470502E-4,6.4056109438470502E-4]
[null,"SGN3B7 Grafton Sth Town","GRAFTON","Short Rural",682,7872,2809,5.1499999999999995,5.9692020975767361,4.4951913831226247E-3,6,0.184914438096211,2.8285646151498499E-2,1.4876799329731701E-3,7.6588826502519E-4,1,1.3925241182276201E-4,1.3925241182276201E-4,1.1604367651896799E-6,1.1604367651896799E-6]
[null,"SLI3B1 City Centre No.2","LISMORE","Urban",139,1150,1530,2.1199999999999997,0.85027718619806714,0.4486022211018702,4,1.41294780529496E-2,1.41294780529496E-2,4.2936160312018201E-5,4.2936160312018201E-5,3,7.45464577957852E-3,7.45464577957852E-3,6.1503148555053198E-5,6.1503148555053198E-5]
[null,"SLI3B10 Jiggi","LISMORE","Short Rural",939,182625,726,1.4,10.373789570790175,3.842909995283792,50,0.770354786134405,0.76906554088828005,2.8593161894273798E-3,2.85119313207105E-3,24,0.28537344885868099,0.28537344885868099,9.4807683715996999E-4,9.4807683715996999E-4]
[null,"SLI3B2 Sth Gundurimba","LISMORE","Short Rural",650,140522,265,1.57,4.4764119899376764,2.8110232714401322,51,0.22207394419111501,0.22207394419111501,1.49116124326874E-3,1.49116124326874E-3,32,0.13945432781990499,0.13405829686177301,5.69774451708134E-4,5.3380091198725402E-4]
[null,"SLI3B3 Ballina St","LISMORE","Urban",523,4149,614,2.0999999999999996,1.2923584771676784E-3,1.5516199472261483,1,4.1775723546828597E-5,4.1775723546828597E-5,1.1604367651896799E-6,1.1604367651896799E-6,3,5.0156397865028401E-2,5.0156397865028401E-2,2.5645652510691998E-4,2.5645652510691998E-4]
[null,"SLI3B4 Lismore West","LISMORE","Urban",472,4973,863,3.4499999999999997,3.0323355794554359,2.8882830161149453,4,7.2500607778755805E-2,7.2500607778755805E-2,5.4772615316953002E-4,5.4772615316953002E-4,4,6.9056431459672801E-2,6.9056431459672801E-2,1.8334900889997E-4,1.8334900889997E-4]
[null,"SLI3B5 Carrington St Sth","LISMORE","Urban",308,3462,868,3.07,1.08624268348212E-2,0,2,2.0307643390819399E-4,2.0307643390819399E-4,2.3208735303793598E-6,2.3208735303793598E-6,0,0,0,0,0]
[null,"SLI3B6 Caniaba","LISMORE","Short Rural",423,88278,1737,1.24,1.6129574409005829,0.44688921792379077,27,0.112315193192414,0.112315193192414,6.1387104878534197E-4,6.1387104878534197E-4,4,3.1118272295326498E-2,3.1118272295326498E-2,9.7476688275933304E-5,9.7476688275933304E-5]
[null,"SLI3B7 Lismore Square No.2","LISMORE","Urban",520,3566,1013,2.1599999999999997,0.16140101255037126,0.83760614138376477,4,7.8526755900385804E-3,7.8526755900385804E-3,6.9626205911380896E-5,6.9626205911380896E-5,2,4.0752218319931303E-2,4.0752218319931303E-2,1.5085677947465899E-4,1.5085677947465899E-4]
[null,"SLI3B8 Carrington St Nth","LISMORE","Short Rural",1083,19999,970,4.22,3.5768842518216668,3.9253900069529695,12,0.13908646936534,0.10735084471093199,2.5576026304780599E-3,1.3031704873080099E-3,10,0.152638049909225,0.152638049909225,4.6649557960625198E-4,4.6649557960625198E-4]
[null,"SLI3B9 City Centre No.1","LISMORE","Urban",439,1505,2038,3.42,0.52603786233746552,8.717832198189388,4,7.5730103296278604E-3,7.5730103296278604E-3,2.32087353037936E-5,2.32087353037936E-5,6,0.12550471746556,0.12550471746556,2.69221329524006E-4,2.69221329524006E-4]
[null,"SMN3B1 Yarrahapinni/Frederickton","KEMPSEY","Short Rural",420,92615,108,0.53347164873121411,2.2710065875062284,4.5087050127961694,34,0.10712920128878101,3.1931738467724499E-2,1.08732924898273E-3,6.1619192231572096E-4,28,0.212687171197495,0.201599197906108,8.4479796505808802E-4,7.8793656356379398E-4]
[null,"SMN3B2 Smithtown/Gladstone","KEMPSEY","Short Rural",1223,105853,4662,2.3815698604072062,4.5236890241044021,1.9968499427604181,39,0.24386694664137701,0.22746881471248201,2.5982179172596999E-3,2.42763371277681E-3,12,0.107647916522821,0.107647916522821,5.9298318701192802E-4,5.9298318701192802E-4]
[null,"SMN3B3 Kinchella","KEMPSEY","Short Rural",204,36098,3916,0.26673582436560705,1.1424740317688609,2.5403006278308617,27,5.0725011879971402E-2,5.0093734279708202E-2,7.2643341500874098E-4,7.2179166794798203E-4,14,0.112787490955846,0.112787490955846,4.0963417811195799E-4,4.0963417811195799E-4]
[null,"SMN3B4 Nestles","KEMPSEY","Urban",4,1528,148,1.8480982116759919,0,2.7447098133402781,0,0,0,0,0,2,1.4296580947136899E-3,1.4296580947136899E-3,9.2834941215174595E-6,9.2834941215174595E-6]
[null,"SRG3B1 Blackville","QUIRINDI","Long Rural",183,207793,0,0.81926003198007891,5.6912768969904803,1.274081175775821,33,0.31665766361143,0.312303704868438,1.9727425008224599E-3,1.96229856993575E-3,3,7.0888761111907297E-2,7.0888761111907297E-2,1.9263250302148699E-4,1.9263250302148699E-4]
[null,"STF8B1 Nimmitabel","COOMA","Short Rural",468,193234,56,0.56000000000000005,3.3263120331881728,0.72170901683749356,56,0.136314185933302,0.136314185933302,1.2892452461257401E-3,1.2892452461257401E-3,23,2.95760518343894E-2,2.9520350869660299E-2,1.5781940006579699E-4,1.5665896330060701E-4]
[null,"STH3B1 Coorigal St","TAMWORTH","Short Rural",733,13509,7236,3.7724066588850143,0.10209425578862746,0.97973201718527136,4,5.9739284671964802E-3,5.9739284671964802E-3,9.1674504449984893E-5,9.1674504449984893E-5,9,5.7327897073900701E-2,5.7049392250255203E-2,2.1003905449933199E-4,2.00755560377815E-4]
[null,"STH3B10 Hillvue","TAMWORTH","Short Rural",1669,7853,443,3.1436722157375123,1.3996534767259916,7.4405017982423907,13,0.13472322712822701,0.13472322712822701,2.44155895395909E-3,2.44155895395909E-3,13,0.71618327706182106,0.65162585894078795,2.3115900362578501E-3,2.0992301082281301E-3]
[null,"STH3B11 Robert St","TAMWORTH","Urban",1463,5678,1496,3.1627247746207696,0.89783877951468016,6.481398872889764E-2,13,6.94440173392461E-2,6.94440173392461E-2,1.9541755125794202E-3,1.9541755125794202E-3,2,5.0130868256194304E-3,5.0130868256194304E-3,1.39252411822762E-5,1.39252411822762E-5]
[null,"STH3B12 Bandalong St","TAMWORTH","Urban",433,1020,3069,1.9433610060922801,3.0712487427753737E-3,0,1,2.8894875453223099E-4,2.8894875453223099E-4,1.1604367651896799E-6,1.1604367651896799E-6,0,0,0,0,0]
[null,"STH3B2 The Heights","TAMWORTH","Urban",607,3254,6593,1.8366666763460375,0.35203684450291461,0.19540761100089393,3,3.0455662902403199E-2,3.0455662902403199E-2,1.24166733875296E-4,1.24166733875296E-4,3,1.6905242795283298E-2,7.4732127678215502E-3,1.65942457422125E-4,1.2880848093605501E-4]
[null,"STH3B3 Warral","TAMWORTH","Long Rural",872,210426,662,2.9721991857881935,6.7285608016125895,4.1567224716361162,67,0.50151175899585099,0.49999622858051301,3.9826189781309897E-3,3.9779772310702304E-3,28,0.309820370190932,0.30944322824224602,1.12214235193842E-3,1.12098191517323E-3]
[null,"STH3B4 Coledale","TAMWORTH","Short Rural",1241,8897,1014,3.1055670979709968,3.9283361658528162,2.024484487277292,18,0.29686989589141599,0.29686989589141599,3.27707342489566E-3,3.27707342489566E-3,7,0.15299314355937299,0.15299314355937299,6.2083366937648002E-4,6.2083366937648002E-4]
[null,"STH3B5 Taminda","TAMWORTH","Urban",182,5262,532,4.3058783076162293,6.9543412664570259E-2,0,4,1.49812386385988E-3,1.49812386385988E-3,1.39252411822762E-5,1.39252411822762E-5,0,0,0,0,0]
[null,"STH3B6 Country Ln","TAMWORTH","Short Rural",31,20666,901,1.5661203402037789,2.1808530594841453E-2,9.933900813939852E-3,2,7.6936957532075902E-4,7.6936957532075902E-4,2.3208735303793598E-6,2.3208735303793598E-6,1,3.5045190308728399E-4,3.5045190308728399E-4,1.1604367651896799E-6,1.1604367651896799E-6]
[null,"STH3B8 Phillip St","TAMWORTH","Urban",829,7775,483,2.4006224192904639,4.8066642346703402E-2,1.9974428647404066,10,3.6252044544525701E-3,3.6252044544525701E-3,1.16043676518968E-5,1.16043676518968E-5,4,0.150647900856925,0.150647900856925,5.7093488847332404E-4,5.7093488847332404E-4]
[null,"STH3B9 Winton","TAMWORTH","Short Rural",323,165174,563,1.3146265629447778,3.1896117671029445,1.40484375618274,62,0.23915441293794201,0.178442682256748,1.39368455499281E-3,1.19292899461499E-3,16,0.10533400561303299,8.5075100566351203E-2,5.2335698110054704E-4,4.2355941929423399E-4]
[null,"STL3B2 Lyons Rd","COFFS HARBOUR","Short Rural",445,2208,2024,2.1910442715746297,7.0955703339322176E-2,5.6764562671457758E-3,1,6.96262059113809E-3,6.96262059113809E-3,1.16043676518968E-4,1.16043676518968E-4,2,5.5700964729104695E-4,5.5700964729104695E-4,1.27648044170865E-5,1.27648044170865E-5]
[null,"STL3B4 Crossmaglen","COFFS HARBOUR","Short Rural",508,40626,1795,2.8578838324886475,1.4386405090346746,1.4111843641856385,19,0.103184876723901,0.103184876723901,7.4848171354734497E-4,7.4848171354734497E-4,10,0.10121561553337401,0.10121561553337401,5.9646449730749705E-4,5.9646449730749705E-4]
[null,"STL3B5 Bayldon","COFFS HARBOUR","Urban",1020,9671,1024,3.3341978045700884,3.7628955370393151,1.6587903128783041E-2,7,0.15531169621622201,0.147539090762981,1.1987311784409399E-3,1.15927632842449E-3,3,6.8465769146191201E-4,5.4540527963915103E-4,3.4813102955690501E-6,2.3208735303793598E-6]
[null,"STL3B7 Sawtell Town","COFFS HARBOUR","Short Rural",2264,10530,856,3.2389350101538001,5.856511357475962,4.1828038030610202,12,0.41980424592207999,0.41980424592207999,1.09638065575121E-2,1.09638065575121E-2,10,0.29983017007941398,0.29983017007941398,1.02002391660173E-3,1.02002391660173E-3]
[null,"STL3B8 Industrial","COFFS HARBOUR","Urban",82,32,320,0.95262794416288255,0,0.13963479109021107,0,0,0,0,0,1,1.3892748952850901E-2,1.3892748952850901E-2,9.5155814745553893E-5,9.5155814745553893E-5]
[null,"STR3B1 Stroud Nth","STROUD","Short Rural",436,65032,1060,1.3146265629447778,4.7785510228541641,4.0243727330250927,27,0.23276272723527699,0.215944517197383,1.5503435182934199E-3,1.0443930886707099E-3,11,0.19602678055966699,0.19602678055966699,9.8869212394160893E-4,9.8869212394160893E-4]
[null,"STR3B2 Wards River","STROUD","Short Rural",325,131366,17,1.6004149461936428,4.2427041667444803,2.3374842049997677,35,0.299881229297083,5.0513812388706898E-2,4.4792859136321702E-4,3.48131029556905E-4,7,0.165217184443881,0.165217184443881,4.63014269310683E-4,4.63014269310683E-4]
[null,"SUN4B1 Sunset Strip Backbone - Wilcannia","MENINDEE","Long Rural",98,776736,0,1.609,0.49447097682927288,1.8289396530321855,17,1.34181303158883E-2,1.34181303158883E-2,8.1230573563277703E-5,8.1230573563277703E-5,15,4.9630720010397499E-2,4.9630720010397499E-2,1.8218857213477999E-4,1.8218857213477999E-4]
[null,"SUN4B2 Tandou","MENINDEE","Long Rural",29,210906,51,1.306,0.43920536737923149,0.59644893523852338,11,8.9945453669852196E-3,8.9945453669852196E-3,6.03427117898635E-5,6.03427117898635E-5,3,1.2214757390386599E-2,1.2214757390386599E-2,4.1775723546828597E-5,4.1775723546828597E-5]
[null,"SUN8B1 Sunset Strip","MENINDEE","Short Rural",182,73282,282,0.747,4.1263769922434923,6.7760083934503896,5,5.9189237645264903E-2,5.9189237645264903E-2,3.6321670750437E-4,3.6321670750437E-4,3,9.7195862578757397E-2,9.7195862578757397E-2,3.3188491484424898E-4,3.3188491484424898E-4]
[null,"SUT5323 Gundaroo","QUEANBEYAN","Long Rural",836,270645,870,1.51,3.1673450878809417,3.2523174934480528,63,0.207322472032023,0.207322472032023,2.0017534199522E-3,2.0017534199522E-3,27,0.21288444544757801,0.21288444544757801,9.4807683715996999E-4,9.4807683715996999E-4]
[null,"SUT5333 Eagle Hawk","QUEANBEYAN","Short Rural",570,115999,1460,1.53,1.9281263659300285,0.21581917143231477,27,0.150461070537729,0.150461070537729,1.70352117129845E-3,1.70352117129845E-3,21,1.6841418773197898E-2,1.6841418773197898E-2,1.3228979123162401E-4,1.3228979123162401E-4]
[null,"SWR3B1 Jerseyville","KEMPSEY","Short Rural",469,4435,1540,0.81926003198007891,3.208329851224696E-3,3.8472768978669164E-2,1,1.3693153829238199E-4,1.3693153829238199E-4,1.1604367651896799E-6,1.1604367651896799E-6,2,1.6420180227433999E-3,1.6420180227433999E-3,1.6246114712655499E-5,1.6246114712655499E-5]
[null,"SWR3B3 Gregory St","KEMPSEY","Short Rural",1398,6171,4036,2.0005186827420531,2.8140841147111519,1.0228081644808487,4,0.17986653816763601,0.17986653816763601,3.1552275645507499E-3,3.1552275645507499E-3,2,6.5374365603725906E-2,6.5374365603725906E-2,3.1215748983602398E-4,3.1215748983602398E-4]
[null,"SWR3B4 Arakoon","KEMPSEY","Short Rural",263,7346,3769,0.4953665309646989,0.26542056795588398,0.45172034098822239,3,1.8771225113708299E-2,1.8771225113708299E-2,1.7754682507402101E-4,1.7754682507402101E-4,3,3.1946824145671897E-2,3.1946824145671897E-2,1.7870726183921099E-4,1.7870726183921099E-4]
[null,"SWR3B5 Mitchell St","KEMPSEY","Urban",1095,5610,1002,2.0005186827420531,0.94648082878767559,1.460651453024173,2,6.8024803175419202E-2,6.8024803175419202E-2,9.0514067684795195E-5,9.0514067684795195E-5,3,0.104978911962885,0.104978911962885,3.7017932809550898E-4,3.7017932809550898E-4]
[null,"SWR3B6 Stuarts Pt","KEMPSEY","Short Rural",811,60534,4841,1.3527316807112932,6.8300368523393349,1.3362078356398093,30,0.42193712869649902,0.42166094474638399,4.8691926667358996E-3,4.86803222997072E-3,8,8.2546508855002795E-2,8.2546508855002795E-2,6.2895672673280801E-4,6.2895672673280801E-4]
[null,"SWT12 Stewarts Mt","BATHURST","Long Rural",1613,505567,1548,3.43,21.336514715291397,10.066978399953211,110,1.5968758721407601,1.59670644837304,1.0305838911649601E-2,1.03046784748844E-2,87,0.75343677853470503,0.751184370773472,3.5068399044032202E-3,3.4963959735165098E-3]
[null,"SWT22 Mt Panorama","BATHURST","Short Rural",418,78113,2233,1.75,0.42159320394113703,0.76409135186213517,19,1.9799372087666401E-2,1.9799372087666401E-2,2.8778831776704101E-4,2.8778831776704101E-4,15,3.5884186089960503E-2,3.5884186089960503E-2,1.65942457422125E-4,1.65942457422125E-4]
[null,"SWT32 Suttor St","BATHURST","Short Rural",1579,307,11797,3.39,5.1068182199696228E-2,4.8325061971098128E-2,3,4.6231800725156898E-3,4.6231800725156898E-3,4.7577907372777001E-5,4.7577907372777001E-5,1,4.3748466047650999E-3,4.3748466047650999E-3,6.7305332381001595E-5,6.7305332381001595E-5]
[null,"SWT42 Simplot","BATHURST","Urban",679,9854,663,5.33,6.2060390743511791,0.16623288327694816,7,0.209986834844899,0.209986834844899,1.81724397428704E-3,1.81724397428704E-3,2,5.62463700087439E-3,5.62463700087439E-3,6.4984458850622198E-5,6.4984458850622198E-5]
[null,"SWT52 Bathurst Gaol","BATHURST","Urban",655,7777,4133,4.1900000000000004,6.9787673022291292,0,6,0.242154141975957,0.242154141975957,1.47143381826052E-3,1.47143381826052E-3,0,0,0,0,0]
[null,"SWT72 Mitchell College","BATHURST","Short Rural",98,2432,4545,0.4,0,0,0,0,0,0,0,0,0,0,0,0]
[null,"SWT82 Eglinton","BATHURST","Short Rural",1774,9039,13108,3.52,2.2718500026239474,0.37181846776951077,10,0.21540607453833499,0.21540607453833499,6.2663585320242802E-3,6.2663585320242802E-3,3,3.5254068926462503E-2,3.5254068926462503E-2,2.9475093835817901E-4,2.9475093835817901E-4]
[null,"TAL1414 Talbingo Town","TUMUT","Short Rural",338,15295,1876,0.68400000000000005,5.4509260513446893,4.4946683514069949,14,0.329602335727121,0.29933582401744402,3.3745501131716002E-3,3.0008894747805201E-3,12,0.27178009259124902,0.12948501557016001,7.6704870179038003E-4,3.9454850016449201E-4]
[null,"TAR436 Tarcutta","WAGGA WAGGA","Short Rural",133,36109,213,0.55000000000000004,9.8213625956556031E-3,1.0484022347799258,2,5.0478999285751198E-4,5.0478999285751198E-4,2.3208735303793598E-6,2.3208735303793598E-6,2,5.3884881191582898E-2,5.3884881191582898E-2,1.6362158389174501E-4,1.6362158389174501E-4]
[null,"TAR437 Oberne Ck","WAGGA WAGGA","Short Rural",124,63020,210,0.32,0.10326129023605271,1.0292113539762815,7,4.4386706268505303E-3,4.4386706268505303E-3,1.8566988243034899E-5,1.8566988243034899E-5,1,4.4240491236091403E-2,4.4240491236091403E-2,1.2532717064048601E-4,1.2532717064048601E-4]
[null,"TAR438 Humula","WAGGA WAGGA","Short Rural",170,135877,209,0.32,0.99657174732526099,2.1508883070100193,28,5.6919423332553898E-2,5.6919423332553898E-2,2.00755560377815E-4,2.00755560377815E-4,8,0.122848477710041,0.122848477710041,4.2588029282461298E-4,4.2588029282461298E-4]
[null,"TAR439 Keajura","WAGGA WAGGA","Short Rural",111,133893,202,0.32,1.2237690769174341,1.5946704743899007,9,5.5965544311568E-2,5.5965544311568E-2,1.7058420448288301E-4,1.7058420448288301E-4,6,7.2927648508345599E-2,7.2927648508345599E-2,2.8546744423666202E-4,2.8546744423666202E-4]
[null,"TDL3B1 Gap Rd","TRUNDLE","Short Rural",25,56171,28,9.5262793999999998E-2,0.36268336671814583,5.0095065191669522E-2,6,2.0591950398290901E-2,2.0591950398290901E-2,4.4096597077207899E-5,4.4096597077207899E-5,2,2.8442305114799102E-3,2.8442305114799102E-3,2.0887861773414299E-5,2.0887861773414299E-5]
[null,"TDL3B2 Numulla","TRUNDLE","Short Rural",100,183255,0,0.23815698499999999,0.48548438355449819,0.92569180732315326,39,2.9688614200612799E-2,2.9538917857903399E-2,1.9843468684743599E-4,1.97274250082246E-4,11,5.66084262794831E-2,5.66084262794831E-2,2.8198613394109299E-4,2.8198613394109299E-4]
[null,"TDL3B3 Sth West Rural","TRUNDLE","Short Rural",12,17026,0,7.6210235200000004E-2,2.4114439712903619E-2,0,6,1.5758731271275899E-3,1.5758731271275899E-3,6.96262059113809E-6,6.96262059113809E-6,0,0,0,0,0]
[null,"TDL8B1 Bogan Gate","TRUNDLE","Long Rural",214,206149,273,0.49536652879999998,2.6472788610372806,3.2588901135951933,39,0.10959745028834,0.10959745028834,8.3319359740619198E-4,8.3319359740619198E-4,31,0.134918180504778,0.134918180504778,4.3748466047650999E-4,4.3748466047650999E-4]
[null,"TDL8B2 Tullamore/Tottenham","TRUNDLE","Long Rural",850,1037995,0,1.98,8.6680802482060013,10.620570296144498,85,0.38438307410143002,0.38363227151435197,1.5155304153377199E-3,1.51204910504216E-3,104,0.470965582025763,0.46540244817344401,1.75109907867123E-3,1.7429760213149E-3]
[null,"TDL8B4 Trundle Town","TRUNDLE","Short Rural",334,45706,15,0.68589211679999995,8.8538913299321093E-2,0.31581723037292786,11,3.7331250736152102E-3,3.7331250736152102E-3,3.8294413251259502E-5,3.8294413251259502E-5,4,1.33160118805516E-2,8.5930342462296003E-3,3.9454850016449201E-5,2.6690045599362699E-5]
[null,"TEA3B1 North Arm Cove","BULAHDELAH","Short Rural",903,93035,835,2.1338865949248564,104.08270200369371,2.2651897015114657,51,4.3794918331361599,0.50301452460677099,5.83583649213891E-3,4.39109271947775E-3,8,9.5312473708854498E-2,5.2830044172025498E-2,3.41168408965767E-4,2.5297521481135101E-4]
[null,"TEA3B3 Mineral Deposits","BULAHDELAH","Short Rural",1210,20644,1600,2.0195712416253109,78.635255000830668,2.8076379119082926,23,3.7620640456655101,0.48633788785423099,5.8602056642078904E-3,4.4676815459802803E-3,12,0.13432287644423599,0.13056306132502199,1.10821711075615E-3,1.0246656636624901E-3]
[null,"TEA3B4 Tea Gardens","BULAHDELAH","Short Rural",992,7462,3630,2.2482019482244029,11.654594233061585,0.84637259299987933,9,0.61999583403201297,0.201412367586912,5.6803379656034901E-3,3.38267317052792E-3,4,4.5024946489359702E-2,4.5024946489359702E-2,1.4621503241390001E-4,1.4621503241390001E-4]
[null,"TEA3B8 Hawks Nest","BULAHDELAH","Short Rural",1282,12726,2982,2.59114800812304,33.868991244860077,1.5256495980899347,18,2.4505244884069501,0.26235386474761402,4.7241380710871996E-3,3.2608273101830099E-3,4,0.11038538685190299,0.108296600674562,3.8410456927778498E-4,3.3188491484424898E-4]
[null,"TEM1 No.1 Lines 26/27","TEMORA","Long Rural",190,244699,0,0.38,0.22272214157034093,0.2104358654351465,30,1.54825473211607E-2,1.54825473211607E-2,9.5155814745553893E-5,9.5155814745553893E-5,5,1.46284658619811E-2,1.46284658619811E-2,5.6861401494294398E-5,5.6861401494294398E-5]
[null,"TEM2 No.2 Lines 21/22/23/24/25","TEMORA","Long Rural",492,573400,1530,1.2,0.61999174437149884,1.863417279731407,47,3.9086991561884103E-2,3.7689825696595701E-2,7.1250817382646498E-4,7.0786642676570603E-4,50,0.117477976360743,0.113253986535452,4.0731330458157803E-4,3.9106718986892298E-4]
[null,"TEM3 Temora West","TEMORA","Short Rural",1187,20608,954,2.9,9.5102883734921068E-2,0.39898879080799332,6,4.1822141017436101E-3,4.1822141017436101E-3,4.6417470607587303E-5,4.6417470607587303E-5,3,1.7545803889668001E-2,1.7545803889668001E-2,5.9182275024673801E-5,5.9182275024673801E-5]
[null,"TEM4 Temora East","TEMORA","Short Rural",1226,15822,477,2.7,3.8433198481440103,3.0910412109193963,7,0.236152363026396,0.236152363026396,3.1563880013159399E-4,3.1563880013159399E-4,13,0.189928685358595,0.189928685358595,6.9278074881823999E-4,6.9278074881823999E-4]
[null,"TFD102 No.10","TENTERFIELD","Short Rural",398,113240,49,0.6801763521322981,1.2794045090698047,2.72793510640069,80,8.6230895584480105E-2,5.46182772271828E-2,1.3646736358630699E-3,9.8288994011566091E-4,45,0.18386076151341799,0.18386076151341799,1.4308185314788799E-3,1.4308185314788799E-3]
[null,"TFD112 No.11","TENTERFIELD","Short Rural",803,51323,1449,0.52013485751293387,0.18018731603953114,1.7813010152029456,24,7.7958141885442799E-3,6.5819973321558801E-3,6.6144895615811896E-5,6.03427117898635E-5,14,7.7068086886542306E-2,7.7068086886542306E-2,4.2007810899866502E-4,4.2007810899866502E-4]
[null,"TFD32 No.3","TENTERFIELD","Long Rural",629,243622,40,2.0995919889349928,5.9994715657067212,1.1699564888342171,60,0.41105339227578502,0.18525676694194201,2.32203396714455E-3,1.29852874024725E-3,15,8.0159490429007704E-2,8.0159490429007704E-2,3.0519486924488598E-4,3.0519486924488598E-4]
[null,"TFD62 No.6","TENTERFIELD","Long Rural",1249,229210,64,1.7985615585795223,8.5838474658114166,2.064203012509489,82,0.53862832893044299,0.33063860575843501,4.8889200917441302E-3,3.4244488940747501E-3,46,0.12952679129370701,0.12952679129370701,8.7612975771821002E-4,8.7612975771821002E-4]
[null,"THA2222 Filtration Plant","GRIFFITH","Urban",4,3406,457,1.7908879999999998,0.12972856566781615,3.9342519261350857E-2,1,1.7754682507402099E-3,null,3.4813102955690501E-6,null,1,5.3844265904801297E-4,5.3844265904801297E-4,2.3208735303793598E-6,2.3208735303793598E-6]
[null,"THA2223 West End","GRIFFITH","Urban",1324,9289,2587,3.2388400000000002,15.454535151967448,5.4381166687186337E-2,13,1.1806248835936901,3.3343990010960299E-2,1.8137626639914699E-3,3.1795967366197298E-4,2,4.1543636193790597E-3,9.6316251510743603E-4,3.7133976486069797E-5,1.16043676518968E-5]
[null,"THA2224 Bromley Rd","GRIFFITH","Short Rural",96,77167,28,2.0576159999999999,1.8862887914172677,1.2985438718597839,10,4.73168091006093E-2,4.0708121722854004E-3,1.2532717064048601E-4,2.9010919129742099E-5,11,3.2573459998874399E-2,3.2573459998874399E-2,1.2300629711010599E-4,1.2300629711010599E-4]
[null,"THA2225 Hillston Rd","GRIFFITH","Short Rural",254,24373,66,3.0864240000000001,6.1456537198737697,6.025050923099343,7,0.15835900316161,3.86251377293386E-2,4.6649557960625198E-4,2.11199491264522E-4,22,0.155251353504432,0.155251353504432,6.1387104878534197E-4,6.1387104878534197E-4]
[null,"THA2229 Three Way Bridge","GRIFFITH","Short Rural",534,23363,1249,2.9530599999999998,9.0273827328004295,0.87399914903900311,19,0.40661124033863899,8.5332717528223301E-2,8.8773412537010703E-4,2.9823224865374798E-4,5,3.9366656822294802E-2,3.9366656822294802E-2,1.9611381331705599E-4,1.9611381331705599E-4]
[null,"THA2230 Brown Rd","GRIFFITH","Short Rural",126,84959,36,1.0669120000000001,5.8355475637370944,3.6005600328020857,21,0.126289172718828,6.7936609981264703E-2,4.5837252224992399E-4,3.2724316778349002E-4,29,7.7921007908956799E-2,7.6798865557018398E-2,3.5161233985247402E-4,3.4348928249614599E-4]
[null,"THA2231 Lakes Rd","GRIFFITH","Short Rural",390,37806,1839,1.7337320000000001,7.2377937473747114,6.1254681637314947,10,0.25052205148973999,5.8817897880404202E-2,1.0594787666181799E-3,6.5332589880179098E-4,22,0.21202108049427601,0.198478783444513,7.9838049445050095E-4,7.4151909295620702E-4]
[null,"THA2232 Mansell Rd","GRIFFITH","Short Rural",388,29807,1804,2.152876,7.9659643774921429,2.890535969461224,15,0.34276400951790198,3.4309473399598098E-2,7.6240695472962097E-4,3.4348928249614599E-4,19,0.12437561249303,0.12437561249303,4.8738344137966701E-4,4.8738344137966701E-4]
[null,"THN3B1 Boyds Bay","TWEED HEADS","Urban",151,1476,1839,1.1300000000000001,0,7.4263350565874631E-2,0,0,0,0,0,2,2.86627881001851E-3,2.86627881001851E-3,2.6690045599362699E-5,2.6690045599362699E-5]
[null,"THN3B2 Hospital","TWEED HEADS","Urban",824,1767,1499,4.3099999999999996,1.1559851209941975E-3,0.23412427684393772,1,7.1947079441760307E-5,7.1947079441760307E-5,1.1604367651896799E-6,1.1604367651896799E-6,3,1.45716044604868E-2,1.45716044604868E-2,1.5085677947465899E-4,1.5085677947465899E-4]
[null,"THN3B3 Interconnector","TWEED HEADS","Urban",312,1364,349,0.54,8.0383403422432845E-2,1.1699630084357404,1,7.0113589352760602E-3,7.0113589352760602E-3,1.3228979123162401E-4,1.3228979123162401E-4,2,0.102048809130781,0.102048809130781,3.0171355894931701E-4,3.0171355894931701E-4]
[null,"THN3B4 Commercial","TWEED HEADS","Urban",802,2020,1944,3.4699999999999998,0,3.1769800293651147,0,0,0,0,0,3,0.119169893164389,0.119169893164389,2.8778831776704101E-4,2.8778831776704101E-4]
[null,"THN3B5 Point Danger","TWEED HEADS","Urban",294,1069,652,1.85,3.8882900245097414E-3,0.86417245794729258,1,1.2996891770124399E-4,1.2996891770124399E-4,1.1604367651896799E-6,1.1604367651896799E-6,1,2.8885591959101599E-2,2.8885591959101599E-2,1.4737546917908999E-4,1.4737546917908999E-4]
[null,"THN3B6 Green Bank","TWEED HEADS","Short Rural",1132,644,3139,1.41,6.9882702555806508E-3,1.4530198829863739,3,4.5024946489359699E-4,4.5024946489359699E-4,3.4813102955690501E-6,3.4813102955690501E-6,1,9.3617075594912405E-2,9.3617075594912405E-2,2.4253128392464401E-4,2.4253128392464401E-4]
[null,"THN3B7 Sth Tweed","TWEED HEADS","Short Rural",1042,3755,3756,3.4299999999999997,1.2887349603396137,0,3,7.8838913390221796E-2,7.8838913390221796E-2,1.1569554548941101E-3,1.1569554548941101E-3,0,0,0,0,0]
[null,"THN3B8 Tugun Bypass","TWEED HEADS","Urban",1286,4062,2729,2.5,1.4600952100034819,1.5387017069319004,6,8.2770473150684504E-2,8.2413058627006E-2,3.21440983957542E-4,3.2028054719235202E-4,4,8.7226550329012803E-2,5.1842512484849002E-2,4.0267155752081999E-4,2.5645652510691998E-4]
[null,"THN3B9 Tweed CBD","TWEED HEADS","Urban",212,1135,1159,2.3699999999999997,0,0,0,0,0,0,0,0,0,0,0,0]
[null,"THR Sewerage Treatment","JINDABYNE","Urban",17,172,0,0.253,0,0,0,0,0,0,0,0,0,0,0,0]
[null,"THRR31 Briars","JINDABYNE","Urban",344,46,2129,2.3780000000000001,0,1.347002076939336,0,0,0,0,0,2,5.3125955547148801E-2,3.4483538914376603E-2,1.4041284858795199E-4,8.8193194154415798E-5]
[null,"THRR47 Snow Maker No.1","JINDABYNE","Urban",2,0,459,5.1379999999999999,0,0,0,0,0,0,0,0,0,0,0,0]
[null,"THRR48 Merritts","JINDABYNE","Urban",6,0,3467,1.103,0.70002551513300104,0,2,9.5805659334060097E-3,9.5805659334060097E-3,6.96262059113809E-6,6.96262059113809E-6,0,0,0,0,0]
[null,"THRR51 Snow Maker No.2","JINDABYNE","Urban",1,0,464,4.2809999999999997,0,0,0,0,0,0,0,0,0,0,0,0]
[null,"THRR55 Mowamba","JINDABYNE","Urban",318,104,3264,2.4740000000000002,0,0.95478170847973742,0,0,0,0,0,2,3.7431048297958402E-2,3.7431048297958402E-2,1.9495337655186699E-4,1.9495337655186699E-4]
[null,"THRR84 Gun Barrel","JINDABYNE","Urban",164,237,5476,2.1880000000000002,0,0.88297110752397567,0,0,0,0,0,2,4.2959369047321998E-2,4.2959369047321998E-2,1.4041284858795199E-4,1.4041284858795199E-4]
[null,"TMT12 Tumut Nth","TUMUT","Urban",1260,10881,1692,4,6.3847758239156249,4.6692515948249076,13,0.227634757169904,0.227634757169904,2.8709205570792702E-3,2.8709205570792702E-3,16,0.16647161658705101,0.16647161658705101,7.2643341500874098E-4,7.2643341500874098E-4]
[null,"TMT22 Tumut Sth","TUMUT","Short Rural",1925,17023,2249,4.26,0.31519767998463311,1.6150474784226998,10,2.57709796813325E-2,2.57709796813325E-2,1.9959512361262499E-4,1.9959512361262499E-4,8,0.13204842038446399,0.13204842038446399,4.0615286781638902E-4,4.0615286781638902E-4]
[null,"TMT32 Gilmore West","TUMUT","Urban",28,1022,0,4.76,0,0,0,0,0,0,0,0,0,0,0,0]
[null,"TMT42 Pyneboard West","TUMUT","Urban",1,1055,0,3.5,1.5998681606903675,0,1,3.3884753543538698E-4,3.3884753543538698E-4,1.1604367651896799E-6,1.1604367651896799E-6,0,0,0,0,0]
[null,"TMT52 Adelong","TUMUT","Short Rural",125,83938,0,0.19,1.1901031984975763,0.41127282792303621,25,7.6736201971698101E-2,7.6736201971698101E-2,5.4424484287396099E-4,5.4424484287396099E-4,8,2.65183009581146E-2,2.65183009581146E-2,1.1140192945820901E-4,1.1140192945820901E-4]
[null,"TMT62 Gocup","TUMUT","Long Rural",922,365115,830,3.12,74.232099594296741,61.501068417219699,135,0.52710635228887404,0.52699495035941601,2.64115407757172E-3,2.63999364080653E-3,49,0.436706007407068,0.42965867493207099,1.2904056828909299E-3,1.2613947637611801E-3]
[null,"TMT72 Pyneboard East","TUMUT","Urban",2,1000,0,2,0.50060652591451427,0,1,1.5781940006579699E-4,1.5781940006579699E-4,2.3208735303793598E-6,2.3208735303793598E-6,0,0,0,0,0]
[null,"TMT82 Gilmore East","TUMUT","Short Rural",62,13966,0,3.74,1.1085266127176552,1.0444482982060917E-2,8,2.7342211061399301E-2,2.7342211061399301E-2,1.2532717064048601E-4,1.2532717064048601E-4,1,2.5761696187210899E-4,2.5761696187210899E-4,3.4813102955690501E-6,3.4813102955690501E-6]
[null,"TNA3B1 Bilambil Hts","TWEED HEADS","Short Rural",1872,50198,2476,3.32,6.7340777540239589,1.6046278127866938,40,0.53865153766574703,0.51978051499023203,1.08663298692362E-2,9.4297091539313604E-3,11,0.12835242928733501,0.12835242928733501,4.7229776343220102E-4,4.7229776343220102E-4]
[null,"TNA3B2 Banora Tie","TWEED HEADS","Short Rural",1294,10842,6767,2.3499999999999996,1.0846026461134359,8.0025185041924136E-3,7,9.3894419981792807E-2,9.3894419981792807E-2,1.5677500697712601E-3,1.5677500697712601E-3,1,6.9278074881823999E-4,6.9278074881823999E-4,3.4813102955690501E-6,3.4813102955690501E-6]
[null,"TPT3B1 Cairncross Landfill","PORT MACQUARIE","Short Rural",114,17627,1946,0.26673582436560705,0.41185128718037806,0.74259530122652739,7,2.1796483760557799E-2,2.1796483760557799E-2,1.31129354466434E-4,1.31129354466434E-4,4,3.9300511926679001E-2,3.9300511926679001E-2,1.69423767717694E-4,1.69423767717694E-4]
[null,"TPT3B2 Telegraph Pt","PORT MACQUARIE","Short Rural",397,81274,1288,0.51441908984795648,0.82935447047904798,2.7989827207997884,31,4.7514083350691502E-2,4.7514083350691502E-2,4.63014269310683E-4,4.63014269310683E-4,30,0.160354954397736,0.160354954397736,7.1366861059165405E-4,7.1366861059165405E-4]
[null,"TPT3B3 Rollands Plains","PORT MACQUARIE","Short Rural",369,116666,735,0.62873444314750238,5.0993796095484125,4.7492315513639367,27,0.28758756220666298,0.28259420280605202,1.8949932375547499E-3,1.8683031919553899E-3,9,0.26784040977342999,0.26784040977342999,1.0710831342700801E-3,1.0710831342700801E-3]
[null,"TSH3B1 Terranora Heights","TWEED HEADS","Short Rural",1599,36089,7182,2.5199999999999996,6.7341023724022939,2.6058290737931054,25,0.57881773541925696,0.553490042582227,1.2297148400715101E-2,1.0443930886707101E-2,9,0.223979381359556,0.14015987337314001,6.8233681793153302E-4,4.5373077518916601E-4]
[null,"TSH3B10 Vintage Lakes","TWEED HEADS","Urban",910,561,6201,3.78,5.735743236046944,1.8642404439632254,5,0.19206272856977899,0.19206272856977899,2.4972599186882001E-3,2.4972599186882001E-3,3,6.2424535346613803E-2,6.2424535346613803E-2,2.8198613394109299E-4,2.8198613394109299E-4]
[null,"TSH3B2 Terranora Inlet","TWEED HEADS","Urban",610,2206,399,0.84,0.56403719681587949,1.3786137765580295,2,4.6523070353219599E-2,4.6523070353219599E-2,7.04385116470137E-4,7.04385116470137E-4,3,0.113711198620937,0.113711198620937,3.7366063839107801E-4,3.7366063839107801E-4]
[null,"TSH3B4 Industrial","TWEED HEADS","Urban",362,1996,1514,1.72,2.8873266390368402,2.4651317425893708E-3,3,4.0775427055235E-2,4.0775427055235E-2,5.2219654433535701E-4,5.2219654433535701E-4,1,3.4813102955690502E-5,3.4813102955690502E-5,1.1604367651896799E-6,1.1604367651896799E-6]
[null,"TSH3B5 West Tweed","TWEED HEADS","Urban",1984,9277,2283,3.17,7.5668610600324717,1.0504877199602434,10,0.64175866512638002,0.64175866512638002,1.1786556224031601E-2,1.1786556224031601E-2,3,8.9093693084202993E-2,8.9093693084202993E-2,2.7966526041071303E-4,2.7966526041071303E-4]
[null,"TSH3B6 Airport","TWEED HEADS","Short Rural",2,0,3115,0.81,0.18433326912538106,0,2,2.5227895275223701E-3,2.5227895275223701E-3,3.4813102955690501E-6,3.4813102955690501E-6,0,0,0,0,0]
[null,"TSH3B7 Crystal Waters","TWEED HEADS","Short Rural",514,2509,1792,1.03,1.0032402486985912,0,4,7.4513965566359905E-2,7.4513965566359905E-2,8.1578704592834696E-4,8.1578704592834696E-4,0,0,0,0,0]
[null,"TSH3B8 Hillcrest","TWEED HEADS","Short Rural",1414,7305,3721,4.58,0.3890124452037097,1.6161871643924708,1,3.37269341434729E-2,3.37269341434729E-2,1.60604448302252E-3,1.60604448302252E-3,6,0.140121578959889,0.140121578959889,6.31277600263187E-4,6.31277600263187E-4]
[null,"TSH3B9 Tweed City","TWEED HEADS","Urban",207,880,1606,1.57,0.86589988062155421,0,3,1.9814457765613799E-2,1.9814457765613799E-2,4.42126407537269E-4,4.42126407537269E-4,0,0,0,0,0]
[null,"TUM12 Ournie","TUMBARUMBA","Short Rural",206,157114,0,2.8000000000000003,5.0774870797257181,2.654206885734872,38,0.233641177866525,0.233641177866525,1.69887942423769E-3,1.69887942423769E-3,29,0.122133648662684,0.122133648662684,4.5953295901511398E-4,4.5953295901511398E-4]
[null,"TUM22 Tooma","TUMBARUMBA","Long Rural",473,296384,176,2.6,11.970869148288964,4.9038126379474596,87,0.60214483527310003,0.59898380552472297,4.1880162855695603E-3,4.16596798703096E-3,29,0.246665920119014,0.23224865374829801,9.5503945775110804E-4,8.7845063124858901E-4]
[null,"TUM32 Tumbarumba Town","TUMBARUMBA","Short Rural",857,43607,0,1.1200000000000001,15.106702763812043,3.0441110593303686,18,0.77079575210517703,0.77079575210517703,5.8613661009730804E-3,5.8613661009730804E-3,14,0.155320979710343,0.155320979710343,5.1175261344865003E-4,5.1175261344865003E-4]
[null,"TUM42 Laurel Hill","TUMBARUMBA","Long Rural",348,209746,2479,0.69500000000000006,7.350893245066799,0.76450458778796315,57,0.37359913524252297,0.37351906510572502,2.9161775909216699E-3,2.9150171541564799E-3,9,3.8854904208846103E-2,3.4878087414541098E-2,2.8778831776704101E-4,2.6109827216767899E-4]
[null,"TUM52 Industrial","TUMBARUMBA","Urban",1,3711,0,5.8529999999999998,0,0,0,0,0,0,0,0,0,0,0,0]
[null,"TUN3B2 Beach St","FORSTER","Short Rural",1280,6840,2853,2.0195712416253109,1.8964657073863085,9.6715031656123909,13,0.121707768369859,0.121707768369859,2.0087160405433402E-3,2.0087160405433402E-3,11,0.62067933128671005,0.62067933128671005,2.0446895802642201E-3,2.0446895802642201E-3]
[null,"TUN3B3 South St","FORSTER","Short Rural",551,2362,1105,0.89547026751310954,1.3761486843289759E-2,1.371439697513344,2,1.1360675931207001E-3,9.4923727392516003E-4,2.3208735303793598E-6,1.1604367651896799E-6,3,0.113218012995731,0.113218012995731,3.55093650148043E-4,3.55093650148043E-4]
[null,"TUN3B4 Tuncurry West","FORSTER","Urban",826,1733,2966,1.3146265629447778,0,0.34037585478049315,0,0,0,0,0,3,1.8496201600358302E-2,1.8496201600358302E-2,3.3768709867019699E-4,3.3768709867019699E-4]
[null,"TUN3B5 Banksia Gardens","FORSTER","Short Rural",1930,31967,16457,4.5154564553320622,9.095420797565188,2.7012142414636005,15,0.67943804689208898,0.67943804689208898,5.6954236435509597E-3,5.6954236435509597E-3,12,0.20178370735177301,0.20178370735177301,8.0302224151126002E-4,8.0302224151126002E-4]
[null,"TUN3B6 Tuncurry Town","FORSTER","Urban",894,3122,793,1.6956777406099306,1.6598628503771089,3.8870023908388549,3,7.6326567793586195E-2,7.6326567793586195E-2,1.1372280298858901E-3,1.1372280298858901E-3,6,0.178738593631871,0.178738593631871,5.4772615316953002E-4,5.4772615316953002E-4]
[null,"TURA2 Tuross","MORUYA","Short Rural",1906,19694,590,2.5300000000000002,4.1132305063119103,8.2580427707079949,14,0.33340624744341302,0.33340624744341302,4.8320586902498401E-3,4.8320586902498401E-3,12,0.66937241839083395,0.56324467403041201,3.96637286341833E-3,3.6495736265215501E-3]
[null,"TXS2X04 Glen Lyon","TEXAS","Long Rural",161,301496,89,0.80020747309682139,9.7802500915738459,0.11335750916382878,65,0.46976336953702602,0.46706187274766497,2.0760213729243398E-3,2.0516522008553599E-3,5,5.4447693022699898E-3,5.4447693022699898E-3,2.4369172068983299E-5,2.4369172068983299E-5]
[null,"TXS2X08 Bonshaw","TEXAS","Long Rural",256,284106,0,1.2193637685284895,15.748991663018394,1.1198585359134396,79,0.67183138389627095,0.61849306842109197,3.06355306010076E-3,2.79897347763751E-3,20,4.77717003125636E-2,4.4107041008094601E-2,1.9495337655186699E-4,1.86830319195539E-4]
[null,"TXS2X18 Texas Town","TEXAS","Short Rural",508,19612,0,1.0669432974624282,22.94402911127867,1.817870803401261E-3,12,1.0545341455617101,1.0504981464923799,4.3562796165220697E-3,4.3133434562100496E-3,1,8.35514470936571E-5,8.35514470936571E-5,1.1604367651896799E-6,1.1604367651896799E-6]
[null,"TXS3X06 Yelarbon","TEXAS","Long Rural",328,496798,0,2.0005186827420531,18.68355843526346,7.2601603967582022,97,0.81605394638434003,0.81563154740181099,4.7276193813827697E-3,4.7241380710871996E-3,65,0.31710675263955901,0.31136607196216498,1.7151255389503499E-3,1.6953981139421299E-3]
[null,"UBV3B1 Woodenbong","BONALBO","Short Rural",330,58740,38,0.57999999999999996,27.236355603635776,0,17,1.29685074868479,0.65256233141029596,2.6144640319723501E-3,2.2477660141724102E-3,0,0,0,0,0]
[null,"UBV3B2 Boomi Ck","BONALBO","Short Rural",21,21560,38,0.12,0.6680822614139067,0,4,6.6469817910064996E-2,2.5715278716603399E-2,9.2834941215174605E-5,6.9626205911380896E-5,0,0,0,0,0]
[null,"UBV3B3 South Boomi","BONALBO","Short Rural",10,7871,27,0.04,0.43462845219403706,0,4,2.6578643669904499E-2,1.0286111486641301E-2,3.7133976486069797E-5,2.7850482364552401E-5,0,0,0,0,0]
[null,"UBV3B4 Urbenville","BONALBO","Short Rural",228,70389,54,0.37,15.465589181061871,0,16,0.74906309236670499,0.31511080140343201,1.11982147840804E-3,8.6916713712707197E-4,0,0,0,0,0]
[null,"ULG3B1 Ulong/Lowanna/Timmsvale","COFFS HARBOUR","Short Rural",319,68625,0,0.30484094213212237,2.1760167661673209,0.69827660144559922,12,0.146960032817152,0.140726166514553,9.6548338863781599E-4,9.6084164157705704E-4,3,4.7158989700543497E-2,4.7158989700543497E-2,3.7714194868664698E-4,3.7714194868664698E-4]
[null,"ULN27 Summervale","MUDGEE","Short Rural",65,76428,0,0.22863070659909182,2.8004996670620597,0.29406692859741518,7,0.128072764026924,0.128072764026924,3.55093650148043E-4,3.55093650148043E-4,4,1.34483016717832E-2,1.34483016717832E-2,8.35514470936571E-5,8.35514470936571E-5]
[null,"ULN28 Ulan/Gulgong","MUDGEE","Short Rural",282,113421,191,0.70494467868053301,6.5096204167077563,1.9729658140332629,48,0.30882355500963499,0.26983404013602602,1.7336925271933801E-3,1.42037460059217E-3,22,9.3599669043434502E-2,9.3599669043434502E-2,4.0035068399044003E-4,4.0035068399044003E-4]
[null,"ULN29 Linburn","MUDGEE","Long Rural",729,280784,629,1.4708575457874908,35.03793700795017,6.2204910028195961,110,1.16114347117968,1.15832244940351,5.5619734155541497E-3,5.5329624964243996E-3,20,0.20614462871535599,0.20614462871535599,8.3203316064100195E-4,8.3203316064100195E-4]
[null,"UMA590 Upper Manilla","BARRABA","Short Rural",73,52409,602,0.72399723756379064,5.1913838452615746,1.1890073934286911,24,0.16257835123983999,1.11726851752463E-2,3.0403443247969698E-4,1.4621503241390001E-4,8,3.7236094921406497E-2,3.7236094921406497E-2,1.8334900889997E-4,1.8334900889997E-4]
[null,"UMA591 Namoi River","BARRABA","Short Rural",43,63174,0,0.19052558883257648,1.8019817488961498,0.52795763895038283,8,8.6592951855219299E-2,5.7337180568022197E-3,1.4505459564871E-4,5.2219654433535699E-5,10,2.5370628997342E-2,2.5370628997342E-2,1.48535905944279E-4,1.48535905944279E-4]
[null,"UNI8/1 Duval","ARMIDALE","Short Rural",776,5976,1350,2.0957814771583414,9.5790610394688641E-2,0.45163623560087485,3,8.2565075843245902E-3,8.2565075843245902E-3,5.4540527963915103E-5,5.4540527963915103E-5,4,3.8928011725053099E-2,3.8928011725053099E-2,2.32087353037936E-4,2.32087353037936E-4]
[null,"UNI8/2 City Central","ARMIDALE","Short Rural",710,4382,1556,0.85736514974659428,0.32270219078970513,1.0431981758717828,5,2.5198884356093899E-2,2.5198884356093899E-2,2.6457958246324802E-4,2.6457958246324802E-4,4,8.1460340042785295E-2,8.1460340042785295E-2,2.7850482364552402E-4,2.7850482364552402E-4]
[null,"UNI8/4 City Nth","ARMIDALE","Short Rural",883,18836,1902,1.9052558883257651,0.22289234475280095,1.8173621656900978,5,1.8508966404775399E-2,1.7360134007237599E-2,2.23964295681609E-4,2.0655774420376299E-4,10,0.150913640876153,0.150913640876153,4.7926038402333902E-4,4.7926038402333902E-4]
[null,"UNI8/5 UNE No.1","ARMIDALE","Short Rural",1,2030,3426,1.6194675050769001,0,1.1779768156487517E-2,0,0,0,0,0,1,4.82741694318908E-4,4.82741694318908E-4,1.1604367651896799E-6,1.1604367651896799E-6]
[null,"UNI8/6 Dumaresq/Booralong","ARMIDALE","Short Rural",500,88561,336,0.66683956091401775,2.8023892080509829,0.82316509238399072,30,0.22517231035417101,4.4912384123136299E-2,1.75690126249718E-3,3.5393321338285301E-4,4,6.6141414305516302E-2,6.6141414305516302E-2,3.7482107515626701E-4,3.7482107515626701E-4]
[null,"UNI8/7 City West","ARMIDALE","Short Rural",496,4307,256,0.95262794416288255,1.242950200864992E-3,1.2665662546814271,1,1.02118435336692E-4,1.02118435336692E-4,2.3208735303793598E-6,2.3208735303793598E-6,4,0.10405868560808899,0.10405868560808899,4.1311548840752702E-4,4.1311548840752702E-4]
[null,"UNI8/8 Tilbuster/Puddledock","ARMIDALE","Short Rural",348,164929,172,0.85736514974659428,1.6597596810531887,1.5869347981734847,39,0.10825018320395401,0.10604419291332901,1.15231370783335E-3,1.1476719607726E-3,8,0.103500515524033,0.103500515524033,3.5857496044361202E-4,3.5857496044361202E-4]
[null,"UNI8/9 UNE No.2","ARMIDALE","Urban",1,1134,922,1.1431535329954587,0,0,0,0,0,0,0,0,0,0,0,0]
[null,"UQT8B1 The Rock","WAGGA WAGGA","Long Rural",923,447971,168,2.12,7.6822494268043071,3.9289774314442294,48,0.31482301308566502,0.29205060200558303,1.81144179046109E-3,1.55266439182379E-3,32,0.161011761606834,0.16077619294350001,6.5796764586255004E-4,6.5680720909736001E-4]
[null,"UQT8B2 Uranquinty Nth","WAGGA WAGGA","Short Rural",542,44989,512,1.21,1.6484879398992232,7.7349185825039912,7,6.7555986722282496E-2,6.7555986722282496E-2,7.3455647236506897E-4,7.3455647236506897E-4,12,0.316981425468918,0.316981425468918,1.12214235193842E-3,1.12214235193842E-3]
[null,"UQT8B4 Kapooka","WAGGA WAGGA","Short Rural",1,12535,4365,1.86,0,0,0,0,0,0,0,0,0,0,0,0]
[null,"UQT8B5 Uranquinty East","WAGGA WAGGA","Short Rural",104,113290,167,0.38,0.8893724958148066,1.4860630597415021,21,3.6446997921077501E-2,3.6446997921077501E-2,2.41370847159454E-4,2.41370847159454E-4,8,6.0899721437154497E-2,6.0899721437154497E-2,1.8334900889997E-4,1.8334900889997E-4]
[null,"URA3B1 Kentucky Salisbury","ARMIDALE","Short Rural",394,160598,70,0.91452282639636728,13.736370657229863,6.0943876494604723,54,0.56292439348321899,0.14138761547071099,2.2582099450591201E-3,1.38672193440167E-3,13,0.249751521477654,0.249751521477654,6.5680720909736001E-4,6.5680720909736001E-4]
[null,"URA3B2 Gostwyck/Arding","ARMIDALE","Long Rural",461,249550,379,1.1241009741122014,8.1509482790307146,6.8634705896773012,75,0.33403056242308499,0.14184250668266499,2.1189575332363599E-3,1.34030446379408E-3,19,0.281268984020206,0.27978942714458899,8.2042879298910504E-4,8.1462660916315703E-4]
[null,"URA3B3 Uralla Town Sth East","ARMIDALE","Short Rural",595,6212,0,1.3146265629447778,1.5373163779223724,7.1789758223686082,7,6.3000111982147805E-2,1.33914402702889E-2,8.4015621799733004E-4,1.7870726183921099E-4,1,0.294198570457949,0.294198570457949,6.6260939292330802E-4,6.6260939292330802E-4]
[null,"URA3B4 Balala Town/Nth West","ARMIDALE","Short Rural",652,113912,0,1.4479944751275813,7.6093337945856749,9.2609082602758956,36,0.31183488841530199,9.9999477803455694E-2,1.5491830815282299E-3,7.0670599000051599E-4,11,0.37951736274498998,0.37951736274498998,1.0246656636624901E-3,1.0246656636624901E-3]
[null,"WAR2123 Warrawidgee Sth","GRIFFITH","Short Rural",50,64730,0,0.97165200000000007,1.1707442482665269,1.3005053676867158,15,3.9900457734281997E-2,1.45193848060533E-2,2.4485215745502303E-4,1.34610664762003E-4,5,4.4322882246419899E-2,4.4322882246419899E-2,1.4041284858795199E-4,1.4041284858795199E-4]
[null,"WAR2124 Warrawidgee Nth","GRIFFITH","Short Rural",55,60273,0,0.552508,2.4391387393514532,1.7025894412734057,24,7.6653810961369695E-2,5.0336265563632798E-2,5.1639436050940801E-4,4.0267155752081999E-4,3,5.3506578806131098E-2,5.3506578806131098E-2,1.7174464124807299E-4,1.7174464124807299E-4]
[null,"WBG3B1 Kooba Settlers Rd","GRIFFITH","Short Rural",18,6370,63,0.64776800000000001,0.43484579696419201,2.1623361360725616E-3,6,1.40018300087787E-2,8.9121543566567599E-3,8.2391010328467402E-5,6.2663585320242801E-5,1,6.9626205911380896E-5,6.9626205911380896E-5,1.1604367651896799E-6,1.1604367651896799E-6]
[null,"WBG3B2 Pellizer Rd","GRIFFITH","Short Rural",51,42572,262,0.30483199999999999,1.5470105945430597,0.26276585332340618,13,4.4175506777240803E-2,3.0403443247969699E-2,2.76183950115144E-4,2.2280385891641899E-4,5,7.5033841237164799E-3,7.5033841237164799E-3,4.1775723546828597E-5,4.1775723546828597E-5]
[null,"WBG3B3 Kidman Way Sth","GRIFFITH","Short Rural",21,16449,221,0.152416,0.40832242367337174,0,5,1.6297173930323899E-2,1.03093202219451E-2,9.5155814745553893E-5,7.1947079441760307E-5,0,0,0,0,0]
[null,"WBG3B4 Kidman Way Nth","GRIFFITH","Short Rural",14,8140,185,0.62871600000000005,12.234291675038222,0.26370939826897238,7,1.71199235968434E-2,1.38266040572351E-2,8.35514470936571E-5,7.0786642676570595E-5,1,3.69018891330319E-4,3.69018891330319E-4,3.4813102955690501E-6,3.4813102955690501E-6]
[null,"WBN3B2 Evans Head Sth","WOODBURN","Short Rural",1018,21299,880,1.72,21.305535781147672,1.425777111739277,7,1.2700028836853601,1.2700028836853601,4.58952740632519E-3,4.58952740632519E-3,6,8.4989228245727105E-2,8.4989228245727105E-2,5.0595042962270104E-4,5.0595042962270104E-4]
[null,"WBN3B3 Coraki","WOODBURN","Short Rural",869,104089,51,1.62,14.954218606785187,7.933043411728101,29,0.92519302415043003,0.92519302415043003,5.9750889039616702E-3,5.9750889039616702E-3,34,0.49080440896344601,0.49080440896344601,1.53177653005038E-3,1.53177653005038E-3]
[null,"WBN3B4 Broadwater","WOODBURN","Short Rural",336,31555,163,0.57999999999999996,9.2981140957590895,0.30248519008870789,23,0.50595391093299702,0.50595391093299702,3.0925639792305001E-3,3.0925639792305001E-3,3,1.64596350774504E-2,1.64596350774504E-2,7.0786642676570595E-5,7.0786642676570595E-5]
[null,"WBN3B5 Evans Head Nth","WOODBURN","Short Rural",957,15180,983,1.62,25.508358405650085,10.725131274966177,12,1.4728147380110901,1.4728147380110901,6.7282123645697797E-3,6.7282123645697797E-3,16,0.61925315450229201,0.55705026257782897,2.02844346555156E-3,1.8218857213477999E-3]
[null,"WBN3B6 Swan Bay","WOODBURN","Short Rural",403,146986,1963,0.79,9.0447753525458854,0.82558531199790297,31,0.66187831776123895,0.56362413685262802,2.5634048143040101E-3,2.1166366597059798E-3,14,6.04146588693052E-2,6.04146588693052E-2,2.21643422151229E-4,2.21643422151229E-4]
[null,"WBN3B7 Gap Rd","WOODBURN","Short Rural",16,12529,356,0,0.28571578389144309,8.7792668141188898E-2,4,2.0423687067338402E-2,2.0423687067338402E-2,7.4267952972139595E-5,7.4267952972139595E-5,1,6.2756420261457996E-3,0,1.8566988243034899E-5,0]
[null,"WBN3B8 Woodburn/Aux TX2","WOODBURN","Short Rural",370,38075,36,0.88,8.3147138984240918,5.2908447898779007,17,0.442768129068419,0.44147656294876297,1.8857097434332301E-3,1.88454930666804E-3,16,0.28174360265716802,0.23785124245063399,9.4343509009921201E-4,8.1810791945872605E-4]
[null,"WCK516 Dewhurst/Gordon","QUIRINDI","Short Rural",685,56678,201,2.1529391538081146,1.5325111234584847,1.2419813592650377,12,9.7222552624356806E-2,9.7222552624356806E-2,1.1233027887036101E-3,1.1233027887036101E-3,8,7.8791335482849001E-2,7.8791335482849001E-2,2.2280385891641899E-4,2.2280385891641899E-4]
[null,"WCK519 Russell/Henry","QUIRINDI","Short Rural",256,60035,3,1.0097856208126554,0.27227531240315789,0.17378752260219568,10,1.54245254829013E-2,1.54245254829013E-2,1.17204113284158E-4,1.17204113284158E-4,2,9.8451455158692601E-3,9.8451455158692601E-3,7.6588826502519005E-5,7.6588826502519005E-5]
[null,"WGA3B1 West Woolgoolga","COFFS HARBOUR","Short Rural",861,24146,1390,1.1812586507619742,1.3068987762792605,2.9207318415093235,16,0.104621497439206,0.104621497439206,1.1499928343029801E-3,1.1499928343029801E-3,9,0.23381408294453901,0.15766390153926099,7.18310357652413E-4,5.5004702669990901E-4]
[null,"WGA3B2 Double Crossing","COFFS HARBOUR","Short Rural",996,23419,1071,1.5242047106606118,3.65910053397063,3.0999015194774708,13,0.28937231395152502,0.28937231395152502,2.4345963333679498E-3,2.4345963333679498E-3,12,0.24514922926691099,0.24357103526625401,1.16043676518968E-3,1.1557950181289201E-3]
[null,"WGA3B3 Wooli","COFFS HARBOUR","Short Rural",1277,161980,1009,2.667358243656071,15.760981758314747,8.5127001471426933,34,1.0101671667182099,1.0101671667182099,6.1352291775578502E-3,6.1352291775578502E-3,25,0.54560371432599797,0.54560371432599797,1.8358109625300799E-3,1.8358109625300799E-3]
[null,"WGA3B4 Hearnes Lake","COFFS HARBOUR","Short Rural",208,4126,151,0.38105117766515295,9.2006339316545518E-2,0.17011588779882142,1,1.55962701241493E-3,1.55962701241493E-3,6.96262059113809E-6,6.96262059113809E-6,1,2.8836853614963602E-3,2.8836853614963602E-3,8.1230573563277697E-6,8.1230573563277697E-6]
[null,"WGA3B5 East Woolgoolga","COFFS HARBOUR","Short Rural",1275,10506,370,2.2863070659909175,25.916099227725994,2.2920509471284727,25,1.2842832185177899,1.2842832185177899,1.3936845549928099E-2,1.3936845549928099E-2,9,0.113583550576766,0.113479111267899,5.5468877376066796E-4,5.5352833699547804E-4]
[null,"WGA3B6 Corindi","COFFS HARBOUR","Short Rural",1858,24571,2494,3.0484094213212236,7.5015313522176497,1.7238165894995994,17,0.62259869369633303,0.60666473647351404,9.2324349038491096E-3,9.1523647670510196E-3,11,0.143070248780236,0.143070248780236,4.9782737226637403E-4,4.9782737226637403E-4]
[null,"WGM4981 Mt George/Elands","TAREE","Long Rural",1239,466365,417,3.8105117766515302,4.6659492656186794,10.310999137860971,108,0.31507830917400698,0.31407685224564802,2.16305413031357E-3,2.1537706361920502E-3,72,0.69627250304469601,0.69488462067352896,1.86366144489463E-3,1.8590196978338701E-3]
[null,"WGM4982 Bungay/The Bight","TAREE","Short Rural",1233,36101,498,5.4299792817284294,3.6966617700573461,3.9770445436482444,17,0.19305026025695601,0.19305026025695601,1.9065976052066501E-3,1.9065976052066501E-3,13,0.207692651360119,0.207692651360119,6.6609070321887803E-4,6.6609070321887803E-4]
[null,"WGM4983 Wingham/Hillside","TAREE","Short Rural",1314,139865,704,4.3820885431492593,2.2655797413184131,4.3806929420398086,42,0.182590083255536,0.18182303455374499,2.7780856158641002E-3,2.77112299527296E-3,116,0.35305360231483901,0.35213337596004401,1.2451486490485299E-3,1.2428277755181501E-3]
[null,"WGM4984 Wingham Town","TAREE","Urban",286,4488,208,3.1436722157375123,1.568554752781336E-2,2.8536878881635603E-2,5,8.4131665476251997E-4,8.4131665476251997E-4,5.8021838259484103E-6,5.8021838259484103E-6,2,1.53061609328519E-3,1.53061609328519E-3,4.6417470607587298E-6,4.6417470607587298E-6]
[null,"WGN32 Geurie","WELLINGTON","Long Rural",384,392439,2625,2.0367185446202432,2.4838186762964929,0.97919130590309578,55,0.141982919531253,8.9711045443283996E-2,9.8056906658528105E-4,7.7749263267708701E-4,34,5.5973667368924299E-2,5.57891579232591E-2,2.7966526041071303E-4,2.7850482364552402E-4]
[null,"WGN42 Wellington Town No.2","WELLINGTON","Short Rural",1099,13393,311,2.6044847993413205,0.54406855441793645,1.559553574877661,13,4.5310413933596298E-2,4.5310413933596298E-2,1.36583407262826E-3,1.36583407262826E-3,5,0.12988072450709001,0.116831613082532,4.61853832545494E-4,3.8642544280816402E-4]
[null,"WGN52 Nth","WELLINGTON","Short Rural",1280,22746,3743,4.1763209072100764,3.8108055008945279,0.67811630346790897,9,0.16020873936532201,0.16020873936532201,2.9811620497722899E-3,2.9811620497722899E-3,2,2.8508450010414899E-2,2.8508450010414899E-2,9.7476688275933304E-5,9.7476688275933304E-5]
[null,"WGN62 Wellington Town No.1","WELLINGTON","Short Rural",275,4156,351,0.54985684937081569,0,4.5427681822791575E-2,0,0,0,0,0,2,2.6051805378508402E-3,2.6051805378508402E-3,1.16043676518968E-5,1.16043676518968E-5]
[null,"WGN72 Yeoval","WELLINGTON","Long Rural",365,314039,236,1.0574170180207996,2.2726762805270191,0.16740783543223881,51,0.15433925020699299,0.153994600487732,1.16623894901563E-3,1.1650785122504399E-3,11,1.13687989885633E-2,1.13687989885633E-2,7.4267952972139703E-5,7.4267952972139703E-5]
[null,"WGN82 Neurea","WELLINGTON","Short Rural",281,155009,0,0.75257607588867714,0.71943066996819871,0.42136828352361316,14,3.04405772244557E-2,3.04405772244557E-2,3.62056270739181E-4,3.62056270739181E-4,8,1.7828950460374301E-2,1.7473856810226202E-2,1.3925241182276201E-4,1.38091975057572E-4]
[null,"WGT8B10 M34 Lightning Ridge","WALGETT","Short Rural",40,127513,30,0.16766251817266731,0.53573098868589908,0.17313504159764409,9,2.92070329430591E-2,2.92070329430591E-2,1.38091975057572E-4,1.38091975057572E-4,4,9.4389926480528807E-3,9.4389926480528807E-3,3.9454850016449201E-5,3.9454850016449201E-5]
[null,"WGT8B2 M38/M39 Pilliga","WALGETT","Long Rural",107,283077,164,0.5944398371576386,1.5212194118054096,1.1783652633680135E-2,22,8.4491400873460798E-2,8.4491400873460798E-2,2.8430700747147198E-4,2.8430700747147198E-4,2,6.5448633556698102E-4,6.5448633556698102E-4,4.6417470607587298E-6,4.6417470607587298E-6]
[null,"WGT8B3 M40 Walgett Town","WALGETT","Short Rural",467,8450,347,1.4899101046707484,1.6141518384253037,1.4548151776684528,14,7.44373767398573E-2,7.4233139869184006E-2,8.2623097681505404E-4,8.2391010328467396E-4,5,6.7089491142676302E-2,6.7089491142676302E-2,2.27445605977178E-4,2.27445605977178E-4]
[null,"WGT8B4 M43 Walgett Town","WALGETT","Short Rural",471,11881,139,1.8290456527927346,0.88240044193821199,1.5472450604516261,9,3.6999365821307799E-2,3.6999365821307799E-2,1.05483701955742E-3,1.05483701955742E-3,7,6.4876538231459599E-2,6.4876538231459599E-2,2.23964295681609E-4,2.23964295681609E-4]
[null,"WGT8B5 M35 Cumborah","WALGETT","Long Rural",115,352242,137,0.62873444314750238,1.5122613811917218,0.51178458271672489,19,7.9033866766773694E-2,7.7563593385278407E-2,3.6553758103475002E-4,3.55093650148043E-4,3,2.6746907000856999E-2,2.6746907000856999E-2,1.1024149269302E-4,1.1024149269302E-4]
[null,"WGT8B6 M32 Come-By-Chance","WALGETT","Long Rural",131,316850,136,0.73542877289374542,1.7231308530958549,0.24518387548799589,23,9.4081250300988295E-2,9.4081250300988295E-2,4.3632422371132098E-4,4.3632422371132098E-4,10,1.33867985232282E-2,1.33867985232282E-2,9.8637125041123002E-5,9.8637125041123002E-5]
[null,"WGT8B7 M36 Carinda","WALGETT","Long Rural",175,323166,47,0.51441908984795648,9.1163171136716183,0.64025428674826546,25,0.36233245468929598,0.36233245468929598,1.60372360949214E-3,1.60372360949214E-3,4,2.5447217823844501E-2,2.5447217823844501E-2,1.4505459564871E-4,1.4505459564871E-4]
[null,"WGT8B8 M54 Brewarrina","WALGETT","Long Rural",46,245007,51,0.33913554812198615,0.40274898595586767,0.40769095961348595,8,2.1372924341263599E-2,2.1372924341263599E-2,1.4969634270946901E-4,1.4969634270946901E-4,18,2.1635183050196401E-2,2.1635183050196401E-2,1.0095799857150201E-4,1.0095799857150201E-4]
[null,"WGT8B9 M33 Collarenebri","WALGETT","Long Rural",79,307180,34,0.44201936609157744,1.5430354149565011,0.74232533942696566,21,9.9857904518102503E-2,9.9857904518102503E-2,3.6785845456512901E-4,3.6785845456512901E-4,29,4.8039761205322502E-2,4.8039761205322502E-2,2.0191599714300499E-4,2.0191599714300499E-4]
[null,"WHI716 Stanbridge","LEETON","Short Rural",208,71748,17,1.1000000000000001,3.3113450558721871,4.9640985382303464,29,0.11386785758423799,0.11386785758423799,6.3011716349799804E-4,6.3011716349799804E-4,14,0.170701408596167,0.170701408596167,5.7557663553408202E-4,5.7557663553408202E-4]
[null,"WHI717 Wilga Rd","LEETON","Short Rural",119,81809,38,2.69,1.3047994082435379,0.40297568343005336,13,4.2736565188405601E-2,4.2736565188405601E-2,2.9010919129742098E-4,2.9010919129742098E-4,2,1.3198807767267401E-2,1.3198807767267401E-2,1.2880848093605501E-4,1.2880848093605501E-4]
[null,"WHI718 Whitton Village","LEETON","Short Rural",179,4946,77,1.22,1.1581727854009394,0.4122990725024841,2,5.9222890311455403E-2,5.9222890311455403E-2,4.0151112075563001E-4,4.0151112075563001E-4,3,2.10828151499661E-2,2.10828151499661E-2,2.0655774420376299E-4,2.0655774420376299E-4]
[null,"WHI719 Whitton Sth","LEETON","Short Rural",38,43653,159,1.45,0.6756557833143636,0,19,1.62577190803074E-2,1.62577190803074E-2,1.0443930886707101E-4,1.0443930886707101E-4,0,0,0,0,0]
[null,"WJL3B1 Grudgery","FORBES","Short Rural",181,145322,0,1.2193637632000001,0.54349327820328153,0.41084483846334652,27,1.9508102459603702E-2,1.9508102459603702E-2,9.5155814745553893E-5,9.5155814745553893E-5,9,1.4746830412030501E-2,1.4746830412030501E-2,9.8637125041123002E-5,9.8637125041123002E-5]
[null,"WJL3B2 Warroo","FORBES","Short Rural",100,112046,0,0.64778699919999994,0.50580464223206023,2.3178726647543176E-2,13,2.1473882339835101E-2,2.1473882339835101E-2,1.1024149269302E-4,1.1024149269302E-4,3,9.8405037688085095E-4,9.8405037688085095E-4,3.4813102955690501E-6,3.4813102955690501E-6]
[null,"WJL3B3 West Plain","FORBES","Long Rural",170,317490,15,0.89547026359999993,13.046774159864396,3.567202678672567,57,0.56851189650760803,0.56851189650760803,2.7827273629248599E-3,2.7827273629248599E-3,29,0.15544050469715801,0.15544050469715801,6.0110624436825503E-4,6.0110624436825503E-4]
[null,"WLA4/1 Fennings Mill","WALCHA","Short Rural",19,4596,4,7.6210235533030593E-2,9.2412689022991403E-3,0.21947240961614109,4,3.4697059279171501E-4,1.4621503241390001E-4,9.2834941215174595E-6,3.4813102955690501E-6,2,8.2402614696119297E-3,8.2402614696119297E-3,2.2048298538604E-5,2.2048298538604E-5]
[null,"WLA4/2 Uralla Rd/Wollun","WALCHA","Short Rural",191,182891,401,0.4953665309646989,1.1572167869583634,1.9607704305555336,28,8.63411370771731E-2,8.3116283306711003E-2,2.8778831776704101E-4,2.83146570706282E-4,12,0.146295102550698,0.146295102550698,5.5120746346509905E-4,5.5120746346509905E-4]
[null,"WLA4/3 Walcha Town Sth","WALCHA","Short Rural",198,5192,269,0.55252420761447185,5.5729381192888812E-3,2.9620490112050648,1,1.9959512361262499E-4,1.9959512361262499E-4,1.1604367651896799E-6,1.1604367651896799E-6,2,0.106085968636876,0.106085968636876,2.5877739863729903E-4,2.5877739863729903E-4]
[null,"WLA4/4 Walcha Town West","WALCHA","Short Rural",370,6437,273,0.91452282639636728,0.49022371411591892,3.8071155691255707,5,2.9303349194569801E-2,3.6797449824164802E-3,4.6649557960625198E-4,4.9898780903156303E-5,3,0.227572093584583,0.227572093584583,6.0690842819420402E-4,6.0690842819420402E-4]
[null,"WLA4/5 Walcha Town East","WALCHA","Short Rural",363,5951,75,0.80020747309682139,0.12517563496829792,4.064074780772609,1,6.92316574112164E-3,6.92316574112164E-3,2.2048298538604E-5,2.2048298538604E-5,2,0.22477428054371101,0.22477428054371101,4.82741694318908E-4,4.82741694318908E-4]
[null,"WLC2B1 Wilcannia","WILCANNIA","Short Rural",363,29664,0,1.353,0.69497982036379069,0.56338634750913097,4,2.81301476249631E-2,2.81301476249631E-2,1.8566988243034899E-4,1.8566988243034899E-4,3,2.2803742872742401E-2,2.2803742872742401E-2,1.0792061916264001E-4,1.0792061916264001E-4]
[null,"WLC4B1 White Cliffs","WILCANNIA","Long Rural",255,777049,0,0.48499999999999999,0.76928363757206064,8.5747125854726908E-2,5,2.70683479848145E-2,2.70683479848145E-2,3.9802981046006098E-4,3.9802981046006098E-4,2,3.0171355894931702E-3,3.0171355894931702E-3,3.7133976486069797E-5,3.7133976486069797E-5]
[null,"WLGR4236 Limestone","INVERELL","Short Rural",71,124177,0,0.27054633614225859,1.7328668422548332,1.8999259912866613E-3,32,0.10478163771280199,0.10383472131240799,8.8889456213529598E-4,8.7612975771821002E-4,1,1.14883239753779E-4,1.14883239753779E-4,1.1604367651896799E-6,1.1604367651896799E-6]
[null,"WLS9/1 Ingleba","WALCHA","Short Rural",100,115236,0,0.30484094213212237,0.18819519339206855,1.4896950059073344,20,1.57598917080411E-2,1.5657773272704401E-2,9.3995377980364304E-5,9.2834941215174605E-5,18,0.12475043356818601,0.114741666468425,3.75981511921457E-4,3.49291466322094E-4]
[null,"WLS9/4 Tia","WALCHA","Long Rural",304,338042,0,0.57157676649772937,1.4164865510328941,2.1290436208607497,81,0.11259833976312,4.7059192138737202E-2,5.2799872816130502E-4,2.8546744423666202E-4,14,0.169240418708794,0.169240418708794,4.7926038402333902E-4,4.7926038402333902E-4]
[null,"WLS9/5 Uralla/Walcha Rd/Wollun","WALCHA","Short Rural",157,91849,0,0.26673582436560705,0.9082189289925926,2.0567397025247303,29,5.4577661940401097E-2,1.31581924804858E-2,1.8915119272591799E-4,1.02118435336692E-4,14,0.12359579898682301,0.12359579898682301,5.4192396934358102E-4,5.4192396934358102E-4]
[null,"WLS9/8 Oorundumby","WALCHA","Long Rural",296,357682,0,0.83831259086333665,0.56994608852689721,3.2219974512320082,69,4.3565117038751003E-2,4.3565117038751003E-2,5.9646449730749597E-4,5.9646449730749597E-4,29,0.24628065511297101,0.24628065511297101,7.5428389737329299E-4,7.5428389737329299E-4]
[null,"WMN1 Tammit Stn","BALRANALD","Short Rural",4,1953,0,9.7799999999999998E-2,1.7607697353412732E-2,0,1,6.8233681793153302E-4,0,4.6417470607587298E-6,0,0,0,0,0,0]
[null,"WNA2V04 Collymongle","MOREE","Short Rural",26,44946,235,2.553042890356525,1.5724055650460118,1.3579609054013782E-2,7,2.5798830163696999E-2,2.5798830163696999E-2,1.0908105592783E-4,1.0908105592783E-4,1,2.2280385891641899E-4,2.2280385891641899E-4,1.1604367651896799E-6,1.1604367651896799E-6]
[null,"WNA2V05 Bullarah","MOREE","Short Rural",48,113229,0,0.34294605989863763,1.9262547324823174,6.4493735750590234E-3,18,8.9073965659194801E-2,8.9073965659194801E-2,4.2355941929423399E-4,4.2355941929423399E-4,1,2.9823224865374798E-4,2.9823224865374798E-4,1.1604367651896799E-6,1.1604367651896799E-6]
[null,"WOO8642 Woodlawn","GOULBURN","Long Rural",556,316220,690,3.65,4.9218658711629262,13.106157456531657,60,0.26354795417899401,0.26354795417899401,2.17581893473065E-3,2.17581893473065E-3,30,0.70178689855287701,0.69697340685086995,2.0655774420376299E-3,2.0516522008553599E-3]
[null,"WRA2W08 Northern","WARIALDA","Long Rural",156,245335,0,0.70113416690388142,2.5542181707360299,0.24810930294384276,40,0.13781347023392701,0.12759350364290101,1.0316282842536299E-3,9.59681204811867E-4,5,1.33867985232282E-2,1.33867985232282E-2,7.0786642676570595E-5,7.0786642676570595E-5]
[null,"WRA2W09 Gravesend","WARIALDA","Long Rural",347,241992,0,0.49155601918804737,7.6923251230616003,0.88336047743030122,74,0.42195917699503699,0.42105751762848498,2.8337865805931998E-3,2.8291448335324401E-3,7,4.8456358004025597E-2,4.8456358004025597E-2,2.0191599714300499E-4,2.0191599714300499E-4]
[null,"WRA2W10 Kooloona/Gragin","WARIALDA","Short Rural",85,141154,0,0.13336791218280353,1.0642325904978629,1.0062591059668786,30,6.9829282345289095E-2,6.9744570461430302E-2,5.3031960169168499E-4,5.2915916492649495E-4,18,6.6025370628997299E-2,6.6025370628997299E-2,2.6109827216767802E-4,2.6109827216767802E-4]
[null,"WRA2W11 Warialda Town","WARIALDA","Short Rural",715,9934,33,1.5242047106606118,4.3615906335447816,1.8200902004852992,5,0.198150379839964,0.198150379839964,1.6292532183263099E-3,1.6292532183263099E-3,3,8.2688082140356001E-2,8.2688082140356001E-2,2.34408226568316E-4,2.34408226568316E-4]
[null,"WTE3681 Taree Sth","TAREE","Urban",1080,4954,966,3.4866182756361499,1.9462410581172147,2.9908321652939653,6,9.0487377639195898E-2,9.0487377639195898E-2,1.3878823711668601E-3,1.3878823711668601E-3,2,0.139053977135914,0.139053977135914,4.0731330458157803E-4,4.0731330458157803E-4]
[null,"WTE3682 Taree West","TAREE","Short Rural",485,14188,1550,2.59114800812304,3.8480403990123291,0.80669203258935429,12,0.22700347956964001,0.22700347956964001,2.2338407729901402E-3,2.2338407729901402E-3,5,4.7588351303663699E-2,4.7588351303663699E-2,2.9126962806260998E-4,2.9126962806260998E-4]
[null,"WTE3683 Taree CBD","TAREE","Urban",212,1453,1742,2.819778714722132,0.88421220022696889,0.958534310748409,2,1.30050148274808E-2,1.30050148274808E-2,2.13520364794902E-4,2.13520364794902E-4,2,1.40981462602894E-2,1.40981462602894E-2,5.2219654433535699E-5,5.2219654433535699E-5]
[null,"WTE3684 Edinburgh Dr","TAREE","Short Rural",477,42087,1592,2.2863070659909175,5.3254146392705035,2.4056269236224552,24,0.13401420026469599,0.13401420026469599,1.6663871948123801E-3,1.6663871948123801E-3,10,6.0537665166415303E-2,5.1270417159610497E-2,3.3420578837462802E-4,2.9591137512336899E-4]
[null,"WTE3685 Tinonee","TAREE","Short Rural",619,54539,0,1.1622060918787165,2.4398604826165058,0.85483735315903198,18,0.18850134813741201,0.186412561960071,1.6304136550915E-3,1.6025631727269499E-3,9,6.6043937617240395E-2,6.6043937617240395E-2,2.7734438688033398E-4,2.7734438688033398E-4]
[null,"WTE3686 Spence St","TAREE","Urban",2011,8731,2487,3.3151452456868311,2.0090772166267894,1.6118952668348545,11,0.18385611976635799,0.18385611976635799,2.8221822129413099E-3,2.8221822129413099E-3,4,0.14750891940708599,0.14750891940708599,5.1755479727459805E-4,5.1755479727459805E-4]
[null,"WTE3687 Kolodong","TAREE","Urban",595,9774,2499,4.363035984266002,3.479340385734039,2.5509733056140504,8,9.7658876848068094E-2,9.7658876848068094E-2,1.4424228991307699E-3,1.4424228991307699E-3,3,7.1601269285733807E-2,7.1601269285733807E-2,2.0655774420376299E-4,2.0655774420376299E-4]
[null,"WTE3688 Taree Central","TAREE","Urban",352,1204,1144,2.59114800812304,1.1190683409053355,0,1,2.50445462663237E-2,2.50445462663237E-2,3.7946282221702602E-4,3.7946282221702602E-4,0,0,0,0,0]
[null,"WTR2Z07 Moomin Ck","MOREE","Short Rural",36,72826,0,0.48774550741139588,1.786654067643364,0.79273607910110044,13,7.0541790519115605E-2,7.0541790519115605E-2,3.41168408965767E-4,3.41168408965767E-4,7,3.1299300430696099E-2,2.8125505877902301E-2,1.03278872101882E-4,8.5872320624036497E-5]
[null,"WTR2Z08 Poison Gate","MOREE","Long Rural",88,211675,329,3.5818810700524382,39.892139719899284,5.5273511387025538,24,0.29872427384218903,0.29852467871857602,1.0989336166346299E-3,1.0966127431042501E-3,8,4.1390458540785602E-2,4.1390458540785602E-2,1.4621503241390001E-4,1.4621503241390001E-4]
[null,"WTR2Z09 Gins","MOREE","Urban",3,0,392,2.0957814771583414,0.16681608525941399,0,6,4.0139507707911103E-3,4.0139507707911103E-3,2.0887861773414299E-5,2.0887861773414299E-5,0,0,0,0,0]
[null,"WWA8B1 M6 Culgoora","NARRABRI","Short Rural",49,42994,453,0.95262794416288255,0.30561732554962406,0.10063877464535829,16,7.4743732045867402E-3,7.4743732045867402E-3,5.2219654433535699E-5,5.2219654433535699E-5,2,2.4612863789673198E-3,2.4612863789673198E-3,1.74065514778452E-5,1.74065514778452E-5]
[null,"WWA8B2 M7 Yarrie Lake","NARRABRI","Short Rural",128,168883,483,0.4953665309646989,5.0956560082709652,1.0270253275448957,29,0.26232137251818799,0.26232137251818799,1.02930741072325E-3,1.02930741072325E-3,14,5.2870659458807097E-2,5.2870659458807097E-2,1.69423767717694E-4,1.69423767717694E-4]
[null,"WWA8B3 M9 Merah North/Doreen Ln","NARRABRI","Short Rural",146,143435,419,4.3820885431492593,6.0478570537347771,3.4987537163056404,84,0.176760048947223,0.176760048947223,1.3310209696725699E-3,1.3310209696725699E-3,13,0.102257687748515,0.102257687748515,3.0287399571450699E-4,3.0287399571450699E-4]
[null,"WWA8B4 M8/M21 Spring Plains Rd","NARRABRI","Short Rural",103,120190,0,2.3625173015239485,5.1019690877218489,7.2716486766154054,44,0.120815392497428,0.120412720939907,7.0322467970494696E-4,6.9858293264418898E-4,31,0.172193730276201,0.172193730276201,5.6861401494294396E-4,5.6861401494294396E-4]
[null,"WWA8B5 M20/M23 Wee Waa Town/Airport","NARRABRI","Short Rural",369,77503,2,1.6004149461936428,3.0121001940618357,1.0595718888772472,45,0.135017978066585,0.135017978066585,1.65130151686492E-3,1.65130151686492E-3,10,4.7495516362448503E-2,4.7495516362448503E-2,2.34408226568316E-4,2.34408226568316E-4]
[null,"WWA8B6 M25 Wee Waa Town","NARRABRI","Short Rural",617,9010,0,1.5775518755337332,2.7453284603409225,2.1164085014450604,12,0.13194049976530201,0.13194049976530201,1.1697202593112001E-3,1.1697202593112001E-3,5,0.10171460334240599,0.10171460334240599,3.8410456927778498E-4,3.8410456927778498E-4]
[null,"WWA8B7 M22 Qld Cotton","NARRABRI","Long Rural",77,223873,621,2.831210250052087,2.1418286804355833,0.13345234542875201,43,0.100682975058152,8.8383505783906996E-2,3.34205788374629E-4,2.7734438688033398E-4,4,6.2733211526154204E-3,6.2733211526154204E-3,1.97274250082246E-5,1.97274250082246E-5]
[null,"WWA8B8 M24 Tulladunna Ln/Helebah","NARRABRI","Short Rural",26,39449,65,0.51822960162460807,2.0790868492556251,1.6916150027596317,40,4.8430828395191403E-2,4.8430828395191403E-2,3.14478363366404E-4,3.14478363366404E-4,20,3.9404951235546E-2,3.5255229363227697E-2,1.13722802988589E-4,1.0095799857150201E-4]
[null,"WWL8B1 West Wyalong Nth East Town","WEST WYALONG","Short Rural",1036,17444,389,2.4,0.41806111157907072,7.7318169996772124,3,2.0969092346977601E-2,2.0969092346977601E-2,9.5155814745553893E-5,9.5155814745553893E-5,6,0.38781216474256602,0.38781216474256602,1.6095257933180899E-3,1.6095257933180899E-3]
[null,"WWL8B2 Lines 63/64","WEST WYALONG","Long Rural",553,838047,0,2.1,4.2494514115256328,2.5969452631686085,77,0.26319634183914098,0.26295381055521699,1.7209277227763001E-3,1.7151255389503499E-3,15,0.16084581914941101,0.16084581914941101,7.8097394297265603E-4,7.8097394297265603E-4]
[null,"WWL8B3 Lines 61/62/65","WEST WYALONG","Long Rural",549,693958,9,1.2,1.6797730942543569,3.5384181975332449,76,9.1713959300001299E-2,7.8921304400550299E-2,8.3551447093657097E-4,7.1482904735684397E-4,19,0.19319415441583901,0.18992520404829999,8.2158922975429497E-4,8.11145298867588E-4]
[null,"WWL8B4 West Wyalong Sth West Town","WEST WYALONG","Short Rural",810,34192,1337,2.9,0.34756381677319159,12.486949631799382,6,1.46864877002406E-2,1.46864877002406E-2,1.13722802988589E-4,1.13722802988589E-4,22,0.52764247407439202,0.52764247407439202,2.2071507273907802E-3,2.2071507273907802E-3]
[null,"YAM3B1 Angourie","MACLEAN","Short Rural",365,7834,294,0.79,1.3863598791643277,0.5903727799608498,10,0.102591893536889,0.102591893536889,1.5352578403459501E-3,1.5352578403459501E-3,1,4.3688123335861202E-2,4.3688123335861202E-2,4.2007810899866502E-4,4.2007810899866502E-4]
[null,"YAM3B2 Yamba Nth","MACLEAN","Urban",532,2721,225,1.1300000000000001,0.10954877358569308,1.5516539398624665,3,4.57676260190811E-3,4.57676260190811E-3,6.8813900175748103E-4,6.8813900175748103E-4,3,6.4825479013791196E-2,6.4825479013791196E-2,6.1503148555053201E-4,6.1503148555053201E-4]
[null,"YAM3B3 Yamba Sth","MACLEAN","Short Rural",871,4109,1854,1.45,8.3072749543637752,3.7521196055024806,10,0.53840320419799603,0.53840320419799603,3.0345421409710199E-3,3.0345421409710199E-3,8,0.24317880763961899,0.24317880763961899,1.57935443742316E-3,1.57935443742316E-3]
[null,"YAM3B4 Yamba West","MACLEAN","Short Rural",1900,5944,7907,4.08,3.7556708131448255,3.8711336034884765,10,0.235306404624573,0.20482753298686601,6.8813900175748203E-3,6.7618650307602803E-3,7,0.24254056741876501,0.24254056741876501,2.3904997362907401E-3,2.3904997362907401E-3]
[null,"YAM3B5 Yamba Rural","MACLEAN","Short Rural",1014,36240,2345,2.75,1.1864398219165424,1.7487286458201552,14,7.1463177310676196E-2,7.1463177310676196E-2,2.5518004466521102E-3,2.5518004466521102E-3,9,0.105331684739502,0.105331684739502,1.0838479386871601E-3,1.0838479386871601E-3]
[null,"YAM3B6 Iluka","MACLEAN","Short Rural",1708,54392,7567,2.69,10.425768333108831,3.9863411016037866,13,0.675309212881544,0.51674597284926105,8.7137196698093208E-3,6.3731187144217298E-3,8,0.25820762418559101,0.25820762418559101,2.09574879793257E-3,2.09574879793257E-3]
[null,"YAN2313 Regulator Rd","LEETON","Short Rural",108,18575,155,0.48,0.20340129622533576,0.75129762510491715,4,6.6748322733710501E-3,6.6748322733710501E-3,2.7850482364552401E-5,2.7850482364552401E-5,8,2.465463951322E-2,2.1267324595631298E-2,1.41573285353141E-4,1.17204113284158E-4]
[null,"YAN2314 Leeton Rd","LEETON","Short Rural",307,20761,10,1.39,8.501765560481922E-2,1.1840507996417917,5,4.7287798181479598E-3,4.7287798181479598E-3,4.5257033842397598E-5,4.5257033842397598E-5,12,6.5858267734810003E-2,6.5858267734810003E-2,3.2608273101830101E-4,3.2608273101830101E-4]
[null,"YAN2318 Back Yanco Rd","LEETON","Short Rural",237,9110,1100,0.69,0.116451726410276,0.41333771268492719,4,6.1503148555053103E-3,6.1503148555053103E-3,1.24166733875296E-4,1.24166733875296E-4,6,2.18301364267483E-2,2.18301364267483E-2,1.05599745632261E-4,1.05599745632261E-4]
[null,"YAN2319 Euroley Rd","LEETON","Short Rural",47,18157,6,0.61,0.36776237734101452,1.0684001581071563,6,7.9513127150797006E-3,7.9513127150797006E-3,6.2663585320242801E-5,6.2663585320242801E-5,12,2.3099654247865802E-2,2.3099654247865802E-2,8.8193194154415798E-5,8.8193194154415798E-5]
[null,"YAR3B1 University","DUBBO","Short Rural",97,8610,3492,2.667358243656071,0.14693326522533923,0.20273964961380952,2,9.6548338863781502E-4,9.6548338863781502E-4,9.2834941215174595E-6,9.2834941215174595E-6,2,1.33218140643776E-3,1.33218140643776E-3,1.39252411822762E-5,1.39252411822762E-5]
[null,"YAR3B2 Troy","DUBBO","Long Rural",544,363467,971,2.4768326548234945,2.8908604456013345,3.1384092726449571,50,0.15185823640301699,0.151279178457188,1.0838479386871601E-3,1.08152706515678E-3,39,0.16486209079373301,0.16486209079373301,5.5933052082142703E-4,5.5933052082142703E-4]
[null,"YAR3B3 Fletchers No. 1","DUBBO","Urban",1,0,1019,4.0010373654841063,0,0,0,0,0,0,0,0,0,0,0,0]
[null,"YAS6232 Wee Jasper","YASS","Long Rural",406,325085,301,0.86,4.4624810465101286,4.7365993826415096,51,0.216568832177055,0.213304523556576,1.28808480936055E-3,1.27299913141308E-3,20,0.229872079253189,0.229872079253189,7.6124651796443104E-4,7.6124651796443104E-4]
[null,"YAS6242 Yass Town Sth","YASS","Short Rural",1501,15913,2433,3.35,3.542201166506743,0.13129940111296187,18,0.20818699742208999,0.20818699742208999,4.0174320810866804E-3,4.0174320810866804E-3,1,7.7169044885113903E-3,7.7169044885113903E-3,2.2048298538604E-5,2.2048298538604E-5]
[null,"YAS6252 Gunning","YASS","Urban",251,2502,0,3.5049999999999999,3.8373074566596226,2.2688288737827116,10,0.16336164605634301,0.16336164605634301,2.0377269596730798E-3,2.0377269596730798E-3,1,9.9182530320762102E-2,9.9182530320762102E-2,2.6806089275881699E-4,2.6806089275881699E-4]
[null,"YAS6252 Gunning","YASS","Short Rural",34,45974,63,3.5049999999999999,0.18829999368219444,0.31711044490708168,14,8.0162971739303202E-3,7.9431896577233704E-3,1.2648760740567499E-4,1.2300629711010599E-4,1,1.3862577596955901E-2,1.3862577596955901E-2,3.8294413251259502E-5,3.8294413251259502E-5]
[null,"YAS6262 Hall","YASS","Long Rural",609,246614,3190,2.0950000000000002,4.307311251219426,6.2865399961301742,55,0.27806269723798599,0.27380389430974,1.90891847873703E-3,1.8671427551901999E-3,22,0.40583374770596198,0.40583374770596198,1.2613947637611801E-3,1.2613947637611801E-3]
[null,"YAS6272 Yass Town Nth","YASS","Short Rural",1333,35950,1335,3.4290000000000003,2.6587026089511332E-2,6.9912675006365639,7,1.43197896824407E-3,1.43197896824407E-3,1.50856779474659E-5,1.50856779474659E-5,6,0.37655012593640003,0.37655012593640003,8.7264844742264099E-4,8.7264844742264099E-4]
[null,"YAS6282 Kangiara","YASS","Long Rural",340,229098,170,2.5529999999999999,1.2451211674101907,0.86896194580223241,43,6.5168968296287405E-2,6.4347379066533095E-2,3.4116840896576602E-4,3.2608273101830101E-4,9,4.5480998138079202E-2,4.5480998138079202E-2,2.7386307658476501E-4,2.7386307658476501E-4]
[null,"YEN3B2 East Yenda","GRIFFITH","Short Rural",171,25247,149,1.543212,0.86659418321583126,1.6828914394760621,10,2.2992894065468401E-2,2.2992894065468401E-2,5.4656571640433998E-4,5.4656571640433998E-4,5,4.46512858509686E-2,4.46512858509686E-2,1.69423767717694E-4,1.69423767717694E-4]
[null,"YEN3B3 Bilbul","GRIFFITH","Short Rural",222,47971,10,1.5622639999999999,1.1920019609878354,1.9552855517213636,14,4.19439868777811E-2,4.0349546762410399E-2,7.1598948412203401E-4,7.1482904735684397E-4,12,6.8802295808096298E-2,6.8802295808096298E-2,3.1563880013159399E-4,3.1563880013159399E-4]
[null,"YEN3B5 Yenda Town","GRIFFITH","Urban",396,4637,674,2.7434879999999997,3.1760166025086654,0.11039373705835753,8,0.18078328321213499,0.18078328321213499,1.86482188165982E-3,1.86482188165982E-3,3,6.2837650835021299E-3,6.2837650835021299E-3,7.7749263267708703E-5,7.7749263267708703E-5]
[null,"YEN3B6 East Mirrool","GRIFFITH","Short Rural",149,46188,47,1.295536,0.66609360794143457,0.25408934258663457,18,1.73520109498813E-2,1.73520109498813E-2,3.7017932809550898E-4,3.7017932809550898E-4,2,6.61913130864195E-3,6.61913130864195E-3,2.7850482364552401E-5,2.7850482364552401E-5]
[null,"YEN3B7 Mt Bingar","GRIFFITH","Short Rural",298,59956,16,2.4386559999999999,0.99836784629060082,7.7103758736644474,13,3.2372704438496602E-2,3.2372704438496602E-2,7.2295210471317196E-4,7.2295210471317196E-4,18,0.25001378018658699,0.24739815571784901,1.02234479013211E-3,1.0107404224802101E-3]
[null,"YLI2H03 North Star","GOONDIWINDI","Short Rural",120,143503,47,0.4953665309646989,1.4653609027380876,2.4834657556360988,24,5.5653386821732001E-2,5.4064748890187302E-2,3.4581015602652498E-4,3.2840360454868E-4,14,9.4320300274617394E-2,9.4320300274617394E-2,3.1563880013159399E-4,3.1563880013159399E-4]
[null,"YLI2H08 Yetman","WARIALDA","Long Rural",198,261104,0,0.87641770862985191,4.598590598747645,1.7403398064122577,38,0.18735599705017,0.180793727143022,1.85089664047754E-3,1.6408575859782101E-3,31,7.0905007226619896E-2,6.7479397895780002E-2,1.0594787666181799E-3,7.6936957532075902E-4]
[null,"YLI2H13 Gunyerwarildi","WARIALDA","Short Rural",52,111306,0,0.45726141319818364,1.7699157060634723,0.45194705851880135,24,8.7908887146944406E-2,8.7170849364283695E-2,3.7017932809550898E-4,3.6785845456512901E-4,7,2.2447488785829198E-2,2.2447488785829198E-2,8.2391010328467402E-5,8.2391010328467402E-5]
[null,"YLI2H18 Croppa Ck","WARIALDA","Long Rural",133,204222,0,0.7621023553303059,1.9697272593811943,1.4536833099350792,37,6.8779087072792497E-2,6.5047122435942406E-2,5.2799872816130502E-4,5.0014824579675302E-4,6,5.0759824982927103E-2,5.0759824982927103E-2,1.6826333095250399E-4,1.6826333095250399E-4]
[null,"7L3 Kamarah","LEETON","Long Rural",629,777903,50,6.3,32.687412479983564,1.0408671103273273,60,1.33954901945994,1.33835957177563,5.1836710301023103E-3,5.1732270992156E-3,12,4.2655334614842298E-2,4.2655334614842298E-2,1.76386388308832E-4,1.76386388308832E-4]
[null,"7L5 Yanco 132 - Murrami","LEETON","Short Rural",19,33206,56,10.6,0.11281393349866883,0,2,4.6231800725156898E-3,4.6231800725156898E-3,2.5529608834173001E-5,2.5529608834173001E-5,0,0,0,0,0]
[null,"7L6 Yanco 132 - Whitton","LEETON","Short Rural",45,77996,304,7.5,3.4546435458929686E-2,3.8340880009336768E-2,4,1.4157328535314101E-3,1.4157328535314101E-3,8.1230573563277697E-6,8.1230573563277697E-6,2,1.57123138006683E-3,1.57123138006683E-3,5.8021838259484103E-6,5.8021838259484103E-6]
[null,"YOU3B1 Berthong","YOUNG","Long Rural",552,217270,292,1.85,3.9608274313468264,1.0442585534741564,32,0.170601611034361,0.169357622822078,9.3299115921250395E-4,9.2486810185617705E-4,27,4.49785290187521E-2,4.49785290187521E-2,1.9147206625629799E-4,1.9147206625629799E-4]
[null,"YOU3B10 Young Sth","YOUNG","Short Rural",1,349,84,0,0,0,0,0,0,0,0,0,0,0,0,0]
[null,"YOU3B2 Young Nth","YOUNG","Short Rural",134,7824,135,1.55,0.35847737573318356,0.29241908634004704,6,2.0957487979325701E-2,2.0957487979325701E-2,2.4485215745502303E-4,2.4485215745502303E-4,4,1.7095554424774399E-2,1.7095554424774399E-2,8.9353630919605497E-5,8.9353630919605497E-5]
[null,"YOU3B3 Bribaree","YOUNG","Long Rural",689,387214,57,1.6,4.6755192803320904,2.6457028958971525,70,0.180709015259163,0.17148354297590501,1.55266439182379E-3,1.37859887704534E-3,36,0.10225652731175,0.10225652731175,5.5933052082142703E-4,5.5933052082142703E-4]
[null,"YOU3B4 Young Town 7","YOUNG","Urban",1198,11717,890,3.7,0.12073376907728499,2.1192464482086768,4,5.41343750960987E-3,5.3542552345851903E-3,1.3577110152719301E-4,1.34610664762003E-4,6,9.5022364517557106E-2,9.5022364517557106E-2,4.3052203988537199E-4,4.3052203988537199E-4]
[null,"YOU3B6 Murringo","YOUNG","Short Rural",1131,65713,759,2.2999999999999998,0.53672544365305808,3.9185592995083316,27,4.1516946148191299E-2,4.1516946148191299E-2,7.4616084001696598E-4,7.4616084001696598E-4,35,0.30310956437784098,0.30310956437784098,1.1557950181289201E-3,1.1557950181289201E-3]
[null,"YOU3B7 Young Town 6","YOUNG","Short Rural",1648,37816,589,3.3,1.9907031365719861,1.1469434479741953,21,0.14564525796219199,0.14551760991802101,2.0330852126123201E-3,2.0307643390819401E-3,7,8.3913503364396305E-2,8.3913503364396305E-2,2.9243006482780002E-4,2.9243006482780002E-4]
[null,"YOU3B8 Young Town 5","YOUNG","Short Rural",707,21860,1306,5,0.84569447493271643,0.98057150393206705,16,2.2788657194795E-2,2.2788657194795E-2,2.76183950115144E-4,2.76183950115144E-4,3,2.64231451433691E-2,2.64231451433691E-2,1.3925241182276201E-4,1.3925241182276201E-4]
[null,"YOU3B9 Weedallion","YOUNG","Long Rural",313,236596,37,0.61,4.7962837491515202,3.0358545961410504,46,0.200148651949621,9.4632457764453407E-2,1.22658166080549E-3,9.0514067684795195E-4,39,0.12668604209252299,0.12668604209252299,4.8854387814485601E-4,4.8854387814485601E-4]
[null,"To enter further feeder ID's - please insert new lines above this line. "]

{"sheet":"3.6.9 Network-reliability","index":7,"n_rows":24,"n_cols":7,"rows_kept":24,"cut":false,"hidden":false,"merged":[]}
[null,{"$f":"(LOOKUP(dms_Model,dms_Model_List,dms_Worksheet_List))","v":"REGULATORY REPORTING STATEMENT"},null,null,null,null,{"$f":"CONCATENATE(\"1-Jan-\",LEFT(CRY,4))","v":"1-Jan-2014"}]
[null,{"$f":"dms_TradingName","v":"Essential Energy"}]
[null,{"$f":"CONCATENATE(\"Annual Reporting RIN Response \",CRY)","v":"Annual Reporting RIN Response 2014-15"}]
[null,"3.6 QUALITY OF SERVICES"]
[]
[]
[null,"3.6.9 - NETWORK FEEDER RELIABILITY - PLANNED OUTAGES"]
[]
[]
[null,"3.6.9.1 - PLANNED MINUTES OFF SUPPLY (SAIDI)"]
[null,null,{"$f":"CRY","v":"2014-15"}]
[null,{"$f":"INDEX(dms_FeederName_1,MATCH(dms_TradingName,dms_TradingName_List))","v":"CBD"}]
[null,{"$f":"INDEX(dms_FeederName_2,MATCH(dms_TradingName,dms_TradingName_List))","v":"Urban"},92.357582373957896]
[null,{"$f":"INDEX(dms_FeederName_3,MATCH(dms_TradingName,dms_TradingName_List))","v":"Short rural"},173.50489067033601]
[null,{"$f":"INDEX(dms_FeederName_4,MATCH(dms_TradingName,dms_TradingName_List))","v":"Long rural"},280.14077818684001]
[null,{"$f":"IF((INDEX(dms_FeederName_5,MATCH(dms_TradingName,dms_TradingName_List))=0),\"\",(INDEX(dms_FeederName_5,MATCH(dms_TradingName,dms_TradingName_List))))","v":""}]
[]
[null,"3.6.9.2 - PLANNED INTERRUPTIONS TO SUPPLY (SAIFI)"]
[null,null,{"$f":"CRY","v":"2014-15"}]
[null,{"$f":"INDEX(dms_FeederName_1,MATCH(dms_TradingName,dms_TradingName_List))","v":"CBD"}]
[null,{"$f":"INDEX(dms_FeederName_2,MATCH(dms_TradingName,dms_TradingName_List))","v":"Urban"},0.37495037713378299]
[null,{"$f":"INDEX(dms_FeederName_3,MATCH(dms_TradingName,dms_TradingName_List))","v":"Short rural"},0.65254741108551995]
[null,{"$f":"INDEX(dms_FeederName_4,MATCH(dms_TradingName,dms_TradingName_List))","v":"Long rural"},1.1102880628044201]
[null,{"$f":"IF((INDEX(dms_FeederName_5,MATCH(dms_TradingName,dms_TradingName_List))=0),\"\",(INDEX(dms_FeederName_5,MATCH(dms_TradingName,dms_TradingName_List))))","v":""}]

{"sheet":"4.1 Public lighting","index":8,"n_rows":23,"n_cols":4,"rows_kept":23,"cut":false,"hidden":false,"merged":[[9,1,10,1],[5,1,5,2]]}
[null,{"$f":"(LOOKUP(dms_Model,dms_Model_List,dms_Worksheet_List))","v":"REGULATORY REPORTING STATEMENT"}]
[null,{"$f":"dms_TradingName","v":"Essential Energy"}]
[null,{"$f":"CONCATENATE(\"Annual Reporting RIN Response \",CRY)","v":"Annual Reporting RIN Response 2014-15"}]
[null,"4.1 PUBLIC LIGHTING"]
[]
[null,"Tables 4.1.1 - 4.1.3 deliberately omitted."]
[]
[null,"4.1.4 - PUBLIC LIGHTING METRICS BY TARIFF"]
[]
[null,"Tariff categories","Number of Lights","Public Lighting Revenue"]
[null,"<insert tariff category>","0's","$0's, nominal"]
[]
[]
[]
[]
[]
[]
[]
[]
[]
[]
[null,"To enter further tariff categories - please insert new lines above this line. "]
[null,"Total ",{"$f":"SUM(C12:C21)","v":0},{"$f":"SUM(D12:D21)","v":0}]

{"sheet":"6.2 STPIS Reliability","index":9,"n_rows":98,"n_cols":8,"rows_kept":98,"cut":false,"hidden":false,"merged":[[5,1,5,2],[31,1,31,2],[68,1,73,1],[62,1,67,1],[55,1,55,2],[56,1,61,1],[16,1,21,1],[9,1,9,2],[10,1,15,1],[80,1,85,1],[86,1,91,1],[92,1,97,1],[79,1,79,2],[22,1,27,1],[32,1,37,1],[38,1,43,1],[44,1,49,1]]}
[null,{"$f":"(LOOKUP(dms_Model,dms_Model_List,dms_Worksheet_List))","v":"REGULATORY REPORTING STATEMENT"}]
[null,{"$f":"dms_TradingName","v":"Essential Energy"}]
[null,{"$f":"CONCATENATE(\"Annual Reporting RIN Response \",CRY)","v":"Annual Reporting RIN Response 2014-15"}]
[null,"6.2 RELIABILITY AND CUSTOMER SERVICE PERFORMANCE"]
[]
[null,"Did the MAIFI parameter of the STPIS apply during the period?\nThis flag is set from the response on worksheet 3.6.8 Network feeders",null,{"$f":"dms_MAIFI_Flag","v":"No"}]
[]
[]
[null,"6.2.1 - UNPLANNED MINUTES OFF SUPPLY (SAIDI)"]
[null,null,null,{"$f":"CRY","v":"2014-15"}]
[null,"Total sustained minutes off supply",{"$f":"INDEX(dms_FeederName_1,MATCH(dms_TradingName,dms_TradingName_List))","v":"CBD"}]
[null,null,{"$f":"INDEX(dms_FeederName_2,MATCH(dms_TradingName,dms_TradingName_List))","v":"Urban"},95.554135935312701," "]
[null,null,{"$f":"INDEX(dms_FeederName_3,MATCH(dms_TradingName,dms_TradingName_List))","v":"Short rural"},294.46665146121802]
[null,null,{"$f":"INDEX(dms_FeederName_4,MATCH(dms_TradingName,dms_TradingName_List))","v":"Long rural"},528.94742050670402]
[null,null,{"$f":"IF((INDEX(dms_FeederName_5,MATCH(dms_TradingName,dms_TradingName_List))=0),\"\",(INDEX(dms_FeederName_5,MATCH(dms_TradingName,dms_TradingName_List))))","v":""},null,"","","",""]
[null,null,"Whole Network",287.12009302061102,null,"","",""]
[null,"Total of excluded events*\n\n*see 3.3 of STPIS",{"$f":"INDEX(dms_FeederName_1,MATCH(dms_TradingName,dms_TradingName_List))","v":"CBD"}]
[null,null,{"$f":"INDEX(dms_FeederName_2,MATCH(dms_TradingName,dms_TradingName_List))","v":"Urban"},23.356250391759499]
[null,null,{"$f":"INDEX(dms_FeederName_3,MATCH(dms_TradingName,dms_TradingName_List))","v":"Short rural"},87.081436391373302]
[null,null,{"$f":"INDEX(dms_FeederName_4,MATCH(dms_TradingName,dms_TradingName_List))","v":"Long rural"},40.159728812557901]
[null,null,{"$f":"IF((INDEX(dms_FeederName_5,MATCH(dms_TradingName,dms_TradingName_List))=0),\"\",(INDEX(dms_FeederName_5,MATCH(dms_TradingName,dms_TradingName_List))))","v":""},null,null,"","",""]
[null,null,"Whole Network",65.551603752620395,null,"","",""]
[null,"Total sustained minutes off supply after removing excluded events",{"$f":"INDEX(dms_FeederName_1,MATCH(dms_TradingName,dms_TradingName_List))","v":"CBD"}]
[null,null,{"$f":"INDEX(dms_FeederName_2,MATCH(dms_TradingName,dms_TradingName_List))","v":"Urban"},72.197885543553298]
[null,null,{"$f":"INDEX(dms_FeederName_3,MATCH(dms_TradingName,dms_TradingName_List))","v":"Short rural"},207.385215069845]
[null,null,{"$f":"INDEX(dms_FeederName_4,MATCH(dms_TradingName,dms_TradingName_List))","v":"Long rural"},488.78769169414602]
[null,null,{"$f":"IF((INDEX(dms_FeederName_5,MATCH(dms_TradingName,dms_TradingName_List))=0),\"\",(INDEX(dms_FeederName_5,MATCH(dms_TradingName,dms_TradingName_List))))","v":""},null,null,"","",""]
[null,null,"Whole Network",221.568489267991,null,"","",""]
[]
[]
[null,"6.2.2 - UNPLANNED INTERRUPTIONS TO SUPPLY (SAIFI)"]
[null,null,null,{"$f":"CRY","v":"2014-15"}]
[null,"Total sustained interruptions",{"$f":"INDEX(dms_FeederName_1,MATCH(dms_TradingName,dms_TradingName_List))","v":"CBD"}]
[null,null,{"$f":"INDEX(dms_FeederName_2,MATCH(dms_TradingName,dms_TradingName_List))","v":"Urban"},1.0552328618290501]
[null,null,{"$f":"INDEX(dms_FeederName_3,MATCH(dms_TradingName,dms_TradingName_List))","v":"Short rural"},2.2114018426011799]
[null,null,{"$f":"INDEX(dms_FeederName_4,MATCH(dms_TradingName,dms_TradingName_List))","v":"Long rural"},3.4722405828462199]
[null,null,{"$f":"IF((INDEX(dms_FeederName_5,MATCH(dms_TradingName,dms_TradingName_List))=0),\"\",(INDEX(dms_FeederName_5,MATCH(dms_TradingName,dms_TradingName_List))))","v":""},null,null,"","",""]
[null,null,"Whole Network",2.15266241908129,null,"","",""]
[null,"Total of excluded events*\n\n*see 3.3 of STPIS",{"$f":"INDEX(dms_FeederName_1,MATCH(dms_TradingName,dms_TradingName_List))","v":"CBD"}]
[null,null,{"$f":"INDEX(dms_FeederName_2,MATCH(dms_TradingName,dms_TradingName_List))","v":"Urban"},8.6463926787990197E-2]
[null,null,{"$f":"INDEX(dms_FeederName_3,MATCH(dms_TradingName,dms_TradingName_List))","v":"Short rural"},0.216825326792498]
[null,null,{"$f":"INDEX(dms_FeederName_4,MATCH(dms_TradingName,dms_TradingName_List))","v":"Long rural"},0.19539232447961499]
[null,null,{"$f":"IF((INDEX(dms_FeederName_5,MATCH(dms_TradingName,dms_TradingName_List))=0),\"\",(INDEX(dms_FeederName_5,MATCH(dms_TradingName,dms_TradingName_List))))","v":""},null,"",null,"",""]
[null,null,"Whole Network",0.18449668086074,"",null,"",""]
[null,"Total sustained interruptions after removing excluded events",{"$f":"INDEX(dms_FeederName_1,MATCH(dms_TradingName,dms_TradingName_List))","v":"CBD"}]
[null,null,{"$f":"INDEX(dms_FeederName_2,MATCH(dms_TradingName,dms_TradingName_List))","v":"Urban"},0.96876893504105699]
[null,null,{"$f":"INDEX(dms_FeederName_3,MATCH(dms_TradingName,dms_TradingName_List))","v":"Short rural"},1.9945765158086799]
[null,null,{"$f":"INDEX(dms_FeederName_4,MATCH(dms_TradingName,dms_TradingName_List))","v":"Long rural"},3.2768482583666101]
[null,null,{"$f":"IF((INDEX(dms_FeederName_5,MATCH(dms_TradingName,dms_TradingName_List))=0),\"\",(INDEX(dms_FeederName_5,MATCH(dms_TradingName,dms_TradingName_List))))","v":""},null,"","","",""]
[null,null,"Whole Network",1.96816573822055,"","","",""]
[]
[]
[]
[]
[null,"6.2.3 - UNPLANNED MOMENTARY INTERRUPTIONS TO SUPPLY (MAIFI)"]
[null,null,null,{"$f":"CRY","v":"2014-15"}]
[null,"Total momentary interruptions",{"$f":"INDEX(dms_FeederName_1,MATCH(dms_TradingName,dms_TradingName_List))","v":"CBD"}]
[null,null,{"$f":"INDEX(dms_FeederName_2,MATCH(dms_TradingName,dms_TradingName_List))","v":"Urban"}]
[null,null,{"$f":"INDEX(dms_FeederName_3,MATCH(dms_TradingName,dms_TradingName_List))","v":"Short rural"}]
[null,null,{"$f":"INDEX(dms_FeederName_4,MATCH(dms_TradingName,dms_TradingName_List))","v":"Long rural"}]
[null,null,{"$f":"IF((INDEX(dms_FeederName_5,MATCH(dms_TradingName,dms_TradingName_List))=0),\"\",(INDEX(dms_FeederName_5,MATCH(dms_TradingName,dms_TradingName_List))))","v":""}]
[null,null,"Whole Network"]
[null,"Total of excluded events*\n\n*see 3.3 of STPIS",{"$f":"INDEX(dms_FeederName_1,MATCH(dms_TradingName,dms_TradingName_List))","v":"CBD"}]
[null,null,{"$f":"INDEX(dms_FeederName_2,MATCH(dms_TradingName,dms_TradingName_List))","v":"Urban"}]
[null,null,{"$f":"INDEX(dms_FeederName_3,MATCH(dms_TradingName,dms_TradingName_List))","v":"Short rural"}]
[null,null,{"$f":"INDEX(dms_FeederName_4,MATCH(dms_TradingName,dms_TradingName_List))","v":"Long rural"}]
[null,null,{"$f":"IF((INDEX(dms_FeederName_5,MATCH(dms_TradingName,dms_TradingName_List))=0),\"\",(INDEX(dms_FeederName_5,MATCH(dms_TradingName,dms_TradingName_List))))","v":""}]
[null,null,"Whole Network"]
[null,"Total momentary interruptions after removing excluded events",{"$f":"INDEX(dms_FeederName_1,MATCH(dms_TradingName,dms_TradingName_List))","v":"CBD"}]
[null,null,{"$f":"INDEX(dms_FeederName_2,MATCH(dms_TradingName,dms_TradingName_List))","v":"Urban"}]
[null,null,{"$f":"INDEX(dms_FeederName_3,MATCH(dms_TradingName,dms_TradingName_List))","v":"Short rural"}]
[null,null,{"$f":"INDEX(dms_FeederName_4,MATCH(dms_TradingName,dms_TradingName_List))","v":"Long rural"}]
[null,null,{"$f":"IF((INDEX(dms_FeederName_5,MATCH(dms_TradingName,dms_TradingName_List))=0),\"\",(INDEX(dms_FeederName_5,MATCH(dms_TradingName,dms_TradingName_List))))","v":""}]
[null,null,"Whole Network"]
[]
[]
[]
[]
[null,"6.2.4 - DISTRIBUTION CUSTOMER NUMBERS"]
[null,null,null,{"$f":"CRY","v":"2014-15"}]
[null,"Customer numbers at the start of the period",{"$f":"INDEX(dms_FeederName_1,MATCH(dms_TradingName,dms_TradingName_List))","v":"CBD"}]
[null,null,{"$f":"INDEX(dms_FeederName_2,MATCH(dms_TradingName,dms_TradingName_List))","v":"Urban"},190232]
[null,null,{"$f":"INDEX(dms_FeederName_3,MATCH(dms_TradingName,dms_TradingName_List))","v":"Short rural"},531745]
[null,null,{"$f":"INDEX(dms_FeederName_4,MATCH(dms_TradingName,dms_TradingName_List))","v":"Long rural"},134220]
[null,null,{"$f":"IF((INDEX(dms_FeederName_5,MATCH(dms_TradingName,dms_TradingName_List))=0),\"\",(INDEX(dms_FeederName_5,MATCH(dms_TradingName,dms_TradingName_List))))","v":""}]
[null,null,"Whole Network",856197]
[null,"Customer numbers at the end of the period",{"$f":"INDEX(dms_FeederName_1,MATCH(dms_TradingName,dms_TradingName_List))","v":"CBD"}]
[null,null,{"$f":"INDEX(dms_FeederName_2,MATCH(dms_TradingName,dms_TradingName_List))","v":"Urban"},192656]
[null,null,{"$f":"INDEX(dms_FeederName_3,MATCH(dms_TradingName,dms_TradingName_List))","v":"Short rural"},538047]
[null,null,{"$f":"INDEX(dms_FeederName_4,MATCH(dms_TradingName,dms_TradingName_List))","v":"Long rural"},136589]
[null,null,{"$f":"IF((INDEX(dms_FeederName_5,MATCH(dms_TradingName,dms_TradingName_List))=0),\"\",(INDEX(dms_FeederName_5,MATCH(dms_TradingName,dms_TradingName_List))))","v":""}]
[null,null,"Whole Network",867292]
[null,"Average customer numbers",{"$f":"INDEX(dms_FeederName_1,MATCH(dms_TradingName,dms_TradingName_List))","v":"CBD"},{"$f":"ROUND(SUM(D81+D87)/2,0)","v":0}]
[null,null,{"$f":"INDEX(dms_FeederName_2,MATCH(dms_TradingName,dms_TradingName_List))","v":"Urban"},{"$f":"ROUND(SUM(D82+D88)/2,0)","v":191444}]
[null,null,{"$f":"INDEX(dms_FeederName_3,MATCH(dms_TradingName,dms_TradingName_List))","v":"Short rural"},{"$f":"ROUND(SUM(D83+D89)/2,0)","v":534896}]
[null,null,{"$f":"INDEX(dms_FeederName_4,MATCH(dms_TradingName,dms_TradingName_List))","v":"Long rural"},{"$f":"ROUND(SUM(D84+D90)/2,0)","v":135405}]
[null,null,{"$f":"IF((INDEX(dms_FeederName_5,MATCH(dms_TradingName,dms_TradingName_List))=0),\"\",(INDEX(dms_FeederName_5,MATCH(dms_TradingName,dms_TradingName_List))))","v":""},{"$f":"ROUND(SUM(D85+D91)/2,0)","v":0}]
[null,null,"Whole Network",861745]

{"sheet":"6.6 STPIS Customer Service","index":10,"n_rows":13,"n_cols":4,"rows_kept":13,"cut":false,"hidden":false,"merged":[[8,1,9,1]]}
[null,{"$f":"(LOOKUP(dms_Model,dms_Model_List,dms_Worksheet_List))","v":"REGULATORY REPORTING STATEMENT"}]
[null,{"$f":"dms_TradingName","v":"Essential Energy"}]
[null,{"$f":"CONCATENATE(\"Annual Reporting RIN Response \",CRY)","v":"Annual Reporting RIN Response 2014-15"}]
[null,"6.6 STPIS CUSTOMER SERVICE"]
[]
[]
[null,"6.6.1 - TELEPHONE ANSWERING"]
[]
[null,null,"Number of calls \nafter removing excluded events","Total number of calls"]
[null,null,{"$f":"CRY","v":"2014-15"},{"$f":"CRY","v":"2014-15"}]
[null,"Number of calls received",264070.3924999999,282277.25009999989]
[null,"Number of calls answered within 30 seconds",182345.07940000008]
[null,"Percentage of calls answered within 30 seconds",{"$f":"C12/C11","v":0.69051694009959919}]

{"sheet":"6.7 STPIS Daily Performance","index":11,"n_rows":381,"n_cols":16,"rows_kept":381,"cut":false,"hidden":false,"merged":[[13,14,13,15],[13,3,14,3],[6,1,6,5],[8,1,8,6],[13,4,13,5],[13,6,13,7],[13,10,13,11],[13,8,13,9],[13,12,13,13],[12,1,14,1],[12,2,12,3],[13,2,14,2],[12,4,12,13]]}
[null,{"$f":"(LOOKUP(dms_Model,dms_Model_List,dms_Worksheet_List))","v":"REGULATORY REPORTING STATEMENT"},null,null,null,null,null,null,{"$f":"CONCATENATE(IF(LEN(CRY)=4,\"1-Jan-\",\"1-Jul-\"),LEFT(CRY,4))","v":"1-Jul-2014"}]
[null,{"$f":"dms_TradingName","v":"Essential Energy"}]
[null,{"$f":"CONCATENATE(\"Annual Reporting RIN Response \",CRY)","v":"Annual Reporting RIN Response 2014-15"}]
[null,"6.7 STPIS DAILY PERFORMANCE"]
[]
[]
[null,"Did the MAIFI parameter of the STPIS apply during the period?\nThis flag is set from the response on worksheet 3.6.8 Network feeders",null,null,null,null,{"$f":"dms_MAIFI_Flag","v":"No"}]
[]
[null,"The excluded events to be removed from the data refer only to events listed in clause 3.3(a) of the STPIS, with respect to reliability data, and in clause 5.4 of the STPIS with respect to customer service parameters.\n\n*Customer service information must be reported as per the definitions in the STPIS, that is excluding: \n   • calls to payment lines and automated interactive services \n   • calls abandoned by the customer within 30 seconds of the call being queued for response by a human operator (where the time in which a telephone call is abandoned is not measured, then an estimate of the number of calls abandoned within 30 seconds will be determined by taking 20 per cent of all calls abandoned)."]
[]
[null,"6.7.1 - DAILY PERFORMANCE DATA - UNPLANNED"]
[]
[null,"Date","Customer service*",null,"MAIFI"]
[null,null,"Number of calls received\n(after removing excluded events)","Number of calls answered in 30 seconds\n(after removing excluded events)",{"$f":"INDEX(dms_FeederName_1,MATCH(dms_TradingName,dms_TradingName_List))","v":"CBD"},null,{"$f":"INDEX(dms_FeederName_2,MATCH(dms_TradingName,dms_TradingName_List))","v":"Urban"},null,{"$f":"INDEX(dms_FeederName_3,MATCH(dms_TradingName,dms_TradingName_List))","v":"Short rural"},null,{"$f":"INDEX(dms_FeederName_4,MATCH(dms_TradingName,dms_TradingName_List))","v":"Long rural"},null,{"$f":"IF((INDEX(dms_FeederName_5,MATCH(dms_TradingName,dms_TradingName_List))=0),\"Network\",(INDEX(dms_FeederName_5,MATCH(dms_TradingName,dms_TradingName_List))))","v":"Network"},null,"Network"]
[null,null,null,null,"All events","After removing excluded events","All events","After removing excluded events","All events","After removing excluded events","All events","After removing excluded events","All events","After removing excluded events","All events","After removing excluded events"]
[null,{"$f":"CONCATENATE(IF(LEN(CRY)=4,\"1-Jan-\",\"1-Jul-\"),LEFT(CRY,4))","v":"1-Jul-2014"},650.99800000000005,603.98689999999999]
[null,{"$f":"B16+1","v":"2014-07-02"},963.00239999999997,907.00040000000001]
[null,"2014-07-03",512.0077,483.99689999999998]
[null,"2014-07-04",443.99160000000001,396.99770000000001]
[null,"2014-07-05",189.0001,138.9992]
[null,"2014-07-06",236.00409999999999,217.99760000000001]
[null,"2014-07-07",548.00639999999999,472.00849999999997]
[null,"2014-07-08",527,497.98570000000001]
[null,"2014-07-09",784.97760000000005,565.02380000000005]
[null,"2014-07-10",1182.0230999999999,848.01350000000002]
[null,"2014-07-11",535.99969999999996,413.99590000000001]
[null,"2014-07-12",261,238.00760000000002]
[null,"2014-07-13",401.99,346.00650000000002]
[null,"2014-07-14",629.99760000000003,488.98250000000002]
[null,"2014-07-15",687.9991,581.01819999999998]
[null,"2014-07-16",809.99480000000005,739.97630000000004]
[null,"2014-07-17",632.99810000000002,568.00200000000007]
[null,"2014-07-18",1116.9787000000001,689.99549999999999]
[null,"2014-07-19",473.00240000000002,385.00310000000002]
[null,"2014-07-20",935.99329999999998,583.01599999999996]
[null,"2014-07-21",608.99180000000001,481.00900000000001]
[null,"2014-07-22",743.00649999999996,595.98230000000001]
[null,"2014-07-23",601.98699999999997,510.99179999999996]
[null,"2014-07-24",534,440.00130000000001]
[null,"2014-07-25",573.01020000000005,422.98680000000002]
[null,"2014-07-26",1064.9919,644.02110000000005]
[null,"2014-07-27",262.99149999999997,209.9999]
[null,"2014-07-28",488.99419999999998,407.00139999999999]
[null,"2014-07-29",641.99569999999994,547.00440000000003]
[null,"2014-07-30",832.9855,675.99950000000001]
[null,"2014-07-31",1049.9979000000001,753.02260000000001]
[null,"2014-08-01",903.98739999999998,687.00540000000001]
[null,"2014-08-02",370,327.99639999999999]
[null,"2014-08-03",488.98969999999997,437.00060000000008]
[null,"2014-08-04",652.98130000000003,430.9889]
[null,"2014-08-05",630.99519999999995,553.00570000000005]
[null,"2014-08-06",608.00670000000002,527.01120000000003]
[null,"2014-08-07",593.99800000000005,510.99400000000003]
[null,"2014-08-08",466.00779999999997,400.99190000000004]
[null,"2014-08-09",299.99020000000002,207.0025]
[null,"2014-08-10",242.0016,234.99619999999999]
[null,"2014-08-11",471,393.99]
[null,"2014-08-12",497.00319999999999,457.0147]
[null,"2014-08-13",583.00360000000001,496.99309999999997]
[null,"2014-08-14",755.97820000000002,507.01230000000004]
[null,"2014-08-15",565.99570000000006,462.98700000000002]
[null,"2014-08-16",511.01530000000002,420.00649999999996]
[null,"2014-08-17",1095.0314000000001,817.01029999999992]
[null,"2014-08-18",1126.0009,771.01589999999999]
[null,"2014-08-19",894.98209999999995,627.00570000000005]
[null,"2014-08-20",673.01670000000001,491.99360000000001]
[null,"2014-08-21",862.97609999999997,746.98579999999993]
[null,"2014-08-22",429.99509999999998,259.99649999999997]
[null,"2014-08-23",402.00560000000002,322.0111]
[null,"2014-08-24",269.99860000000001,241.00239999999999]
[null,"2014-08-25",697.02139999999997,547.01690000000008]
[null,"2014-08-26",648.99080000000004,592.97949999999992]
[null,"2014-08-27",918.02559999999994,717.00429999999994]
[null,"2014-08-28",843.98289999999997,611.00670000000002]
[null,"2014-08-29",402.99860000000001,336.99590000000001]
[null,"2014-08-30",260.9984,207.00020000000001]
[null,"2014-08-31",169.99799999999999,161.00310000000002]
[null,"2014-09-01",605.99829999999997,494.01580000000001]
[null,"2014-09-02",723.98609999999996,645.01130000000001]
[null,"2014-09-03",935.02099999999996,746.00890000000004]
[null,{"$f":"B80+1","v":"2014-09-04"},548.98760000000004,490.99350000000004]
[null,"2014-09-05",448.98939999999993,324.00650000000002]
[null,"2014-09-06",163.00369999999998,145.9957]
[null,"2014-09-07",340.99289999999996,313.00099999999998]
[null,"2014-09-08",658.0104,546.99749999999995]
[null,"2014-09-09",766.98470000000009,635.01089999999999]
[null,"2014-09-10",999.00139999999999,730.01409999999998]
[null,"2014-09-11",445.9957,377.00600000000003]
[null,"2014-09-12",419,353.00569999999999]
[null,"2014-09-13",148.99700000000001,139.99809999999999]
[null,"2014-09-14",561.01819999999998,412.01730000000003]
[null,"2014-09-15",1052.0248000000001,534.00609999999995]
[null,"2014-09-16",615.99720000000002,421.00080000000003]
[null,"2014-09-17",527.99149999999997,427.98820000000001]
[null,"2014-09-18",663.00220000000002,493.99940000000004]
[null,"2014-09-19",390.00149999999996,287.00749999999999]
[null,"2014-09-20",339.99560000000002,274.9923]
[null,"2014-09-21",187,166.99680000000004]
[null,"2014-09-22",459.00399999999996,353.99240000000003]
[null,"2014-09-23",502.00969999999995,420.00069999999999]
[null,"2014-09-24",705.01639999999998,554.98760000000004]
[null,"2014-09-25",868.98529999999994,699.0077]
[null,"2014-09-26",464.0068,372.00220000000002]
[null,"2014-09-27",184,166.00300000000001]
[null,"2014-09-28",417.98910000000001,381.00819999999999]
[null,"2014-09-29",593.00639999999999,361.00470000000001]
[null,"2014-09-30",669.99549999999999,515.99390000000005]
[null,"2014-10-01",511.01240000000001,350.99779999999998]
[null,"2014-10-02",473.99419999999998,296.99869999999999]
[null,"2014-10-03",409.99860000000001,371.9991]
[null,"2014-10-04",328.99759999999998,253.00990000000002]
[null,"2014-10-05",189,187.005]
[null,"2014-10-06",399.02030000000002,310.00200000000001]
[null,"2014-10-07",756.00329999999997,530.98839999999996]
[null,"2014-10-08",643.97119999999995,372.99549999999999]
[null,"2014-10-09",512.9932,416.9907]
[null,"2014-10-10",437.99459999999999,341.9941]
[null,"2014-10-11",404.9982,321.00190000000003]
[null,"2014-10-12",545.0086,463.98569999999995]
[null,"2014-10-13",2236.9771999999998,1335.0037]
[null,"2014-10-14",943.96400000000006,797.98789999999997]
[null,"2014-10-15",949.00210000000004,820.00970000000007]
[null,"2014-10-16",561.01599999999996,475.99770000000001]
[null,"2014-10-17",594.00199999999995,416.98680000000002]
[null,"2014-10-18",352.99419999999998,283.99299999999999]
[null,"2014-10-19",151.99510000000001,146.9984]
[null,"2014-10-20",582.99839999999995,452.99290000000002]
[null,"2014-10-21",572.02390000000003,283.9984]
[null,"2014-10-22",775.01490000000001,492.00350000000003]
[null,"2014-10-23",790.99710000000005,466.98470000000003]
[null,"2014-10-24",683.00409999999999,424.99569999999994]
[null,"2014-10-25",677.97900000000004,445.00570000000005]
[null,"2014-10-26",473.0129,434.01220000000006]
[null,"2014-10-27",1483.0110999999999,971.01779999999985]
[null,"2014-10-28",700.00099999999998,531.99959999999987]
[null,"2014-10-29",797.00829999999996,549.98630000000003]
[null,"2014-10-30",561.00630000000001,456.99099999999999]
[null,"2014-10-31",843.99099999999999,567.00540000000001]
[null,"2014-11-01",1491.0488999999998,854.97700000000009]
[null,"2014-11-02",494.0179,397.99399999999997]
[null,"2014-11-03",535.98929999999996,396.99369999999999]
[null,"2014-11-04",740.02219999999988,638.00689999999997]
[null,"2014-11-05",0,0]
[null,"2014-11-06",0,0]
[null,{"$f":"B144+1","v":"2014-11-07"},827.02260000000001,607.97950000000003]
[null,"2014-11-08",297.99419999999998,225.0077]
[null,"2014-11-09",271.99900000000002,243.00050000000002]
[null,"2014-11-10",866.02300000000002,600.00839999999994]
[null,"2014-11-11",951.00970000000007,819.99700000000007]
[null,"2014-11-12",673.99199999999996,543.00610000000006]
[null,"2014-11-13",831.99680000000001,618.0059]
[null,"2014-11-14",921.98320000000001,662.00919999999996]
[null,"2014-11-15",780.01419999999996,541.01499999999999]
[null,"2014-11-16",924.01229999999987,667.02549999999997]
[null,"2014-11-17",866.01239999999996,610.99739999999997]
[null,"2014-11-18",722.98910000000001,518.98270000000002]
[null,"2014-11-19",843.01960000000008,673.9905]
[null,"2014-11-20",815.98399999999992,523.99290000000008]
[null,"2014-11-21",729.99270000000001,476.00509999999997]
[null,"2014-11-22",590.0068,422.0129]
[null,"2014-11-23",1391.9986000000001,976.00080000000003]
[null,"2014-11-24",2748,967]
[null,"2014-11-25",1253.0058000000001,1020.9683]
[null,"2014-11-26",682.99759999999992,568.98779999999999]
[null,"2014-11-27",987.03320000000008,670.02560000000017]
[null,"2014-11-28",715.99530000000004,398.00290000000001]
[null,"2014-11-29",732.98790000000008,522.99779999999998]
[null,"2014-11-30",823.01839999999993,535.00630000000001]
[null,"2014-12-01",1267.9871999999998,694.98700000000008]
[null,"2014-12-02",1463.0344,851.00210000000004]
[null,"2014-12-03",1718.0266999999999,926.9688000000001]
[null,"2014-12-04",2086.9834999999998,1069.0381]
[null,"2014-12-05",2379.9704000000002,897.00459999999998]
[null,"2014-12-06",2267.0499,884.95609999999999]
[null,"2014-12-07",1282.9772,856.98219999999992]
[null,"2014-12-08",1581.9433000000001,749.98910000000001]
[null,"2014-12-09",833.00909999999999,482.01210000000003]
[null,"2014-12-10",1656.0514000000001,964.97850000000005]
[null,"2014-12-11",0,0]
[null,"2014-12-12",0,0]
[null,"2014-12-13",428.99340000000001,321.00100000000003]
[null,"2014-12-14",416.00800000000004,367.00319999999999]
[null,"2014-12-15",1121.0368999999998,518.99290000000008]
[null,"2014-12-16",2235.9996000000001,1093.0160000000001]
[null,"2014-12-17",1088.0019,820.01289999999995]
[null,"2014-12-18",0,0]
[null,"2014-12-19",0,0]
[null,"2014-12-20",404.99649999999997,251.0042]
[null,"2014-12-21",698.97699999999998,499.00909999999999]
[null,"2014-12-22",787.01859999999988,560.98210000000006]
[null,"2014-12-23",1591.9911999999999,1084.0022000000001]
[null,"2014-12-24",832.01710000000003,669.00320000000011]
[null,"2014-12-25",746.97260000000006,607.99599999999998]
[null,"2014-12-26",513.99649999999997,424.99880000000002]
[null,"2014-12-27",619.01350000000002,361.99250000000001]
[null,"2014-12-28",635.97519999999997,444.99900000000002]
[null,"2014-12-29",1213.9969999999998,770.00040000000013]
[null,"2014-12-30",637.00279999999998,557.98540000000003]
[null,"2014-12-31",489.99279999999999,406.99760000000003]
[null,"2015-01-01",671.98169999999993,509.99599999999998]
[null,"2015-01-02",1510.0315000000001,1049.0378000000001]
[null,"2015-01-03",470.01600000000002,382.99220000000003]
[null,"2015-01-04",957.00119999999993,427.99619999999999]
[null,"2015-01-05",1099.9949999999999,668.01340000000005]
[null,"2015-01-06",1053.0084999999999,728.03290000000004]
[null,"2015-01-07",1026.9879000000001,624.01070000000004]
[null,"2015-01-08",1020.0329,600.98009999999999]
[null,"2015-01-09",935.00380000000007,479.99779999999998]
[null,{"$f":"B208+1","v":"2015-01-10"},605.99379999999996,477.01240000000007]
[null,"2015-01-11",582.00580000000002,492.98689999999999]
[null,"2015-01-12",982.97210000000007,652.98870000000011]
[null,"2015-01-13",658.99800000000005,448.99659999999994]
[null,"2015-01-14",857.98259999999993,697.02960000000007]
[null,"2015-01-15",760.00810000000001,369.01029999999997]
[null,"2015-01-16",798.01139999999998,379.00969999999995]
[null,"2015-01-17",395.00759999999997,368.0093]
[null,"2015-01-18",365.012,328.00319999999999]
[null,"2015-01-19",799.01620000000003,516.00339999999994]
[null,"2015-01-20",1684.9728000000002,1082.999]
[null,"2015-01-21",1180.0273,725.971]
[null,"2015-01-22",887.99530000000004,604.0073000000001]
[null,"2015-01-23",731.98979999999995,483.99009999999993]
[null,"2015-01-24",1415.0334,506.97109999999998]
[null,"2015-01-25",693.99990000000003,474.98779999999999]
[null,"2015-01-26",1851.9873,659.9516000000001]
[null,"2015-01-27",2108.9757,631.03340000000003]
[null,"2015-01-28",985.00980000000004,501.00409999999999]
[null,"2015-01-29",896.01799999999992,616.9842000000001]
[null,"2015-01-30",518.00080000000003,306.99640000000005]
[null,"2015-01-31",680.99,512.01880000000006]
[null,"2015-02-01",459.00080000000003,413.01210000000003]
[null,"2015-02-02",1239.9997000000001,576.00009999999997]
[null,"2015-02-03",695.00729999999999,289.99789999999996]
[null,"2015-02-04",460.99680000000001,363.99569999999994]
[null,"2015-02-05",579.00260000000003,428.01030000000003]
[null,"2015-02-06",446.00220000000002,352.99590000000001]
[null,"2015-02-07",299.00330000000002,216.00989999999999]
[null,"2015-02-08",399.99549999999999,279.99130000000002]
[null,"2015-02-09",880.01119999999992,582.02390000000003]
[null,"2015-02-10",739.0021999999999,575.0080999999999]
[null,"2015-02-11",1170.9863,537.0073000000001]
[null,"2015-02-12",1568.0673000000002,792.00970000000007]
[null,"2015-02-13",1246.9988000000001,689.98119999999994]
[null,"2015-02-14",831.00289999999995,550.00110000000006]
[null,"2015-02-15",711.9946000000001,623.01369999999997]
[null,"2015-02-16",0,0]
[null,"2015-02-17",1329.0309000000002,914.04070000000002]
[null,"2015-02-18",993.00610000000006,672.01210000000003]
[null,"2015-02-19",865.97900000000004,709.01689999999996]
[null,"2015-02-20",1034.011,788.98079999999993]
[null,"2015-02-21",1088.9765,789.98480000000018]
[null,"2015-02-22",587.98009999999999,512.9969000000001]
[null,"2015-02-23",972.00409999999988,741.00569999999993]
[null,"2015-02-24",1045.9937,798.99109999999996]
[null,"2015-02-25",1189.0160000000001,685.01649999999995]
[null,"2015-02-26",1060.9657000000002,742.01920000000007]
[null,"2015-02-27",1910.9704999999999,857.0517000000001]
[null,"2015-02-28",587.01639999999998,517.98750000000007]
[null,"2015-03-01",1204.0145,607.9849999999999]
[null,"2015-03-02",1413.9735000000001,726.00360000000001]
[null,"2015-03-03",692.98540000000003,485.00130000000001]
[null,"2015-03-04",647.99109999999996,458.01650000000001]
[null,"2015-03-05",632.99479999999994,480.99520000000001]
[null,"2015-03-06",450.99559999999997,312.00310000000002]
[null,"2015-03-07",529.99220000000003,422.00079999999997]
[null,"2015-03-08",194.00020000000001,175.00560000000002]
[null,"2015-03-09",831.00739999999996,572.00319999999999]
[null,"2015-03-10",870.03039999999987,573.00720000000001]
[null,"2015-03-11",886.00439999999992,618.98860000000002]
[null,"2015-03-12",957.98469999999998,506.99770000000001]
[null,"2015-03-13",684.98669999999993,528.99929999999995]
[null,"2015-03-14",436.99869999999999,411.99090000000001]
[null,{"$f":"B272+1","v":"2015-03-15"},728.9778,667.9976999999999]
[null,"2015-03-16",608.00520000000006,438.99510000000004]
[null,"2015-03-17",535.0068,457.00009999999997]
[null,"2015-03-18",1259.9932000000001,859.01610000000005]
[null,"2015-03-19",897.01919999999996,695.97219999999982]
[null,"2015-03-20",744.00700000000006,389.99709999999999]
[null,"2015-03-21",891.00249999999994,557.01940000000002]
[null,"2015-03-22",839.00639999999999,706.98660000000007]
[null,"2015-03-23",944.01519999999994,478.00270000000006]
[null,"2015-03-24",1428.0063,756.00589999999988]
[null,"2015-03-25",784.99770000000001,563.98680000000002]
[null,"2015-03-26",981.00150000000008,591.99120000000005]
[null,"2015-03-27",600.0127,289.00570000000005]
[null,"2015-03-28",443.00099999999998,309.9948]
[null,"2015-03-29",333,257.99830000000003]
[null,"2015-03-30",590.00660000000005,346.98509999999999]
[null,"2015-03-31",545.01249999999993,322.9948]
[null,"2015-04-01",750.00520000000006,447.0181]
[null,"2015-04-02",572.99389999999994,419.98270000000002]
[null,"2015-04-03",326.0043,302.99379999999996]
[null,"2015-04-04",530.98929999999996,433.012]
[null,"2015-04-05",384,346.99949999999995]
[null,"2015-04-06",1318.0309999999999,948.99329999999998]
[null,"2015-04-07",1705.0144999999998,747.95960000000002]
[null,"2015-04-08",953.99919999999997,537.01220000000012]
[null,"2015-04-09",684.01109999999994,486.99950000000001]
[null,"2015-04-10",458.99559999999997,404.00300000000004]
[null,"2015-04-11",203.00290000000001,196.9965]
[null,"2015-04-12",807.00319999999999,676.99680000000001]
[null,"2015-04-13",634.01199999999994,340.98810000000003]
[null,"2015-04-14",746.98689999999999,485.00689999999992]
[null,"2015-04-15",823.02440000000001,667.98849999999993]
[null,"2015-04-16",814.0204,733.99879999999996]
[null,"2015-04-17",647.98850000000004,455.99609999999996]
[null,"2015-04-18",328,313.99219999999997]
[null,"2015-04-19",448.99919999999997,335.99]
[null,"2015-04-20",891.99080000000004,597.01319999999998]
[null,"2015-04-21",0,0]
[null,"2015-04-22",1177.0219000000002,1070.0020999999999]
[null,"2015-04-23",666.00400000000002,482.00579999999997]
[null,"2015-04-24",782.00980000000004,520.99660000000006]
[null,"2015-04-25",800.97289999999998,609.0136]
[null,"2015-04-26",581.98610000000008,449.01589999999999]
[null,"2015-04-27",544.00150000000008,294.00570000000005]
[null,"2015-04-28",681.00239999999997,279.99119999999994]
[null,"2015-04-29",474.0068,397.00749999999999]
[null,"2015-04-30",738.99579999999992,579.00990000000002]
[null,"2015-05-01",926.02210000000002,556.01429999999993]
[null,"2015-05-02",1144.9954999999998,869.99199999999996]
[null,"2015-05-03",448,435.99520000000001]
[null,"2015-05-04",647.98609999999996,469.00509999999997]
[null,"2015-05-05",788.98820000000001,573.99220000000014]
[null,"2015-05-06",685.99180000000001,544.00790000000006]
[null,"2015-05-07",508.99,441.00679999999994]
[null,"2015-05-08",470.00040000000001,389.00440000000003]
[null,"2015-05-09",319,305.9923]
[null,"2015-05-10",341.99739999999997,326.99879999999996]
[null,"2015-05-11",599.01679999999999,305.99899999999997]
[null,"2015-05-12",618.98260000000005,417.98459999999994]
[null,"2015-05-13",625.00540000000001,419.01179999999999]
[null,"2015-05-14",526.00139999999999,372.00599999999997]
[null,"2015-05-15",590.0068,380.99509999999998]
[null,"2015-05-16",289.99379999999996,248.99950000000001]
[null,"2015-05-17",426.00400000000002,345.00200000000001]
[null,{"$f":"B336+1","v":"2015-05-18"},649.99680000000001,280.99850000000004]
[null,"2015-05-19",1173.9808,704.98349999999994]
[null,"2015-05-20",894.98719999999992,580.99430000000007]
[null,"2015-05-21",659.01530000000002,403.97829999999999]
[null,"2015-05-22",823.99840000000006,395.0222]
[null,"2015-05-23",283.0009,256.00310000000002]
[null,"2015-05-24",319.00029999999998,311.00839999999999]
[null,"2015-05-25",660.01110000000006,429.01050000000004]
[null,"2015-05-26",579.01589999999999,468.00279999999998]
[null,"2015-05-27",599.00340000000006,493.99329999999998]
[null,"2015-05-28",556.99630000000002,393.00789999999995]
[null,"2015-05-29",511.00420000000003,303.99629999999996]
[null,"2015-05-30",460.00440000000003,405.99540000000002]
[null,"2015-05-31",347.99810000000002,306.00010000000003]
[null,"2015-06-01",801.00170000000003,609.99329999999998]
[null,"2015-06-02",883.01919999999996,787.02430000000004]
[null,"2015-06-03",538.00019999999995,415.00169999999997]
[null,"2015-06-04",709.99839999999995,467.00879999999995]
[null,"2015-06-05",757.00350000000003,540.98159999999996]
[null,"2015-06-06",370.00700000000001,315.00099999999998]
[null,"2015-06-07",194.0008,182.99790000000002]
[null,"2015-06-08",319.99950000000001,312.99639999999999]
[null,"2015-06-09",717.01859999999999,536.99489999999992]
[null,"2015-06-10",424.00020000000001,350.99020000000007]
[null,"2015-06-11",481.99990000000003,391.00730000000004]
[null,"2015-06-12",573.00329999999997,305.9889]
[null,"2015-06-13",248.00189999999998,213.00119999999998]
[null,"2015-06-14",244.0042,217.9939]
[null,"2015-06-15",922.00619999999992,480.9855]
[null,"2015-06-16",951.00259999999992,544.01620000000003]
[null,"2015-06-17",767.00299999999993,640.00559999999996]
[null,"2015-06-18",632.01049999999998,430.00330000000002]
[null,"2015-06-19",500.00289999999995,248.00130000000001]
[null,"2015-06-20",368.99869999999999,344.00240000000002]
[null,"2015-06-21",378.00919999999996,334.98970000000003]
[null,"2015-06-22",514.00279999999998,343.00240000000002]
[null,"2015-06-23",519.00350000000003,418.99770000000001]
[null,"2015-06-24",551.00009999999997,472.00689999999997]
[null,"2015-06-25",617.00969999999995,559.99829999999997]
[null,"2015-06-26",743.99379999999996,593.00369999999998]
[null,"2015-06-27",517.99160000000006,431.99519999999995]
[null,"2015-06-28",712.02340000000004,661.99940000000004]
[null,"2015-06-29",771.99479999999994,572.9973]
[null,"2015-06-30",710.0068,500.98699999999997]
[null,"2015-07-01"]

{"sheet":"6.8 STPIS Exclusions","index":12,"n_rows":44,"n_cols":15,"rows_kept":44,"cut":false,"hidden":false,"merged":[[10,11,11,11],[6,1,6,4],[10,6,10,8],[10,5,11,5],[10,4,11,4],[10,2,11,2],[10,3,11,3]]}
[null,{"$f":"(LOOKUP(dms_Model,dms_Model_List,dms_Worksheet_List))","v":"REGULATORY REPORTING STATEMENT"}]
[null,{"$f":"dms_TradingName","v":"Essential Energy"}]
[null,{"$f":"CONCATENATE(\"Annual Reporting RIN Response \",CRY)","v":"Annual Reporting RIN Response 2014-15"}]
[null,"6.8 STPIS EXCLUSIONS"]
[]
[]
[null,{"$f":"CONCATENATE(\"This information is collected to inform the application of the STPIS to \",dms_TradingName,\" in future regulatory periods. The information is also collected to monitor network performance, and may be used in performance reports.\")","v":"This information is collected to inform the application of the STPIS to Essential Energy in future regulatory periods. The information is also collected to monitor network performance, and may be used in performance reports."}]
[]
[null,"6.8.1 - STPIS EXCLUSIONS"]
[]
[null,"Date of event","Outage ID","Feeder ID / name","Feeder classification\n(drop down)","Cause of event\n(drop down)","Unplanned",null,null,"Event category","Effect on unplanned MAIFI","Please provide separate explanation to confirm the outage was not due to inadequate transmission connection planning "]
[null,"DD/MM/YYYY",null,null,null,null,"Number of  interruptions","Duration of interruption\n(mins)","Total unplanned minutes off supply","Use exclusion categories listed in section 3.3(a) of the STPIS\n(drop down)","by feeder classification",null,null,null,"Cause of Event"]
[null,null,null,null,null,null,null,null,null,null,null,null,null,null,"Weather"]
[null,null,null,null,null,null,null,null,null,null,null,null,null,null,"Equipment failure"]
[null,null,null,null,null,null,null,null,null,null,null,null,null,null,"Operational error"]
[null,null,null,null,null,null,null,null,null,null,null,null,null,null,"Vegetation"]
[null,null,null,null,null,null,null,null,null,null,null,null,null,null,"Animals"]
[null,null,null,null,null,null,null,null,null,null,null,null,null,null,"Third party impacts"]
[null,null,null,null,null,null,null,null,null,null,null,null,null,null,"Transmission failure"]
[null,null,null,null,null,null,null,null,null,null,null,null,null,null,"Load shedding"]
[null,null,null,null,null,null,null,null,null,null,null,null,null,null,"Inter-distributor connection failure"]
[null,null,null,null,null,null,null,null,null,null,null,null,null,null,"Other"]
[]
[]
[]
[]
[]
[]
[]
[]
[]
[]
[]
[]
[]
[]
[]
[]
[]
[]
[]
[]
[]
[null,"To enter further events - please insert new lines above this line. "]

{"sheet":"6.9 STPIS - GSL","index":13,"n_rows":102,"n_cols":5,"rows_kept":102,"cut":false,"hidden":false,"merged":[[5,4,5,5],[101,1,101,2],[69,1,69,2],[98,1,98,2],[100,1,100,2],[93,1,93,2],[94,1,94,2],[95,1,95,2],[96,1,96,2],[88,1,88,2],[89,1,89,2],[90,1,90,2],[91,1,91,2],[92,1,92,2],[83,1,83,2],[84,1,84,2],[85,1,85,2],[86,1,86,2],[45,1,45,2],[46,1,46,2],[71,1,71,2],[70,1,70,2],[77,1,77,2],[49,1,49,2],[50,1,50,2],[51,1,51,2],[53,1,53,4],[58,1,58,4],[63,1,63,4],[68,1,68,4],[66,1,66,2],[65,1,65,2],[40,1,40,2],[42,1,42,2],[43,1,43,2],[44,1,44,2],[41,1,41,2],[33,1,33,2],[34,1,34,2],[35,1,35,2],[36,1,36,2],[37,1,37,2],[27,1,27,2],[31,1,31,2],[32,1,32,2],[28,1,28,2],[29,1,29,2],[30,1,30,2],[20,1,20,2],[22,1,22,2],[23,1,23,2],[24,1,24,2],[21,1,21,2],[17,1,17,2],[15,1,15,2],[5,1,5,2],[7,1,7,2],[14,1,14,2],[16,1,16,2],[64,1,64,2],[54,1,54,2],[55,1,55,2],[56,1,56,2],[61,1,61,2],[60,1,60,2],[59,1,59,2]]}
[null,{"$f":"(LOOKUP(dms_Model,dms_Model_List,dms_Worksheet_List))","v":"REGULATORY REPORTING STATEMENT"}]
[null,{"$f":"dms_TradingName","v":"Essential Energy"}]
[null,{"$f":"CONCATENATE(\"Annual Reporting RIN Response \",CRY)","v":"Annual Reporting RIN Response 2014-15"}]
[null,"6.9 STPIS - GUARANTEED SERVICE LEVEL"]
[]
[null,"Did the AER's GSL Scheme apply at any time during the regulatory year?",null,"No","**IMPORTANT \nPlease ensure this flag is set. Conditional formatting on this worksheet is dependant on this response."]
[]
[null,"Instructions:\nTable 6.9.1 collects information relating to jurisdiction GSL scheme parameters. These parameters can be found in the jurisdictonal scheme relevant to NSP. Please identify each parameter in the relevant sub-tables and provide the volume and value of GSL payments. \n\nFor GSL parameters that do not fit within the provided sub-tables provided, please enter a heading and identify the relevant parameter(s). "]
[]
[null,"6.9.1 - GUARANTEED SERVICE LEVELS - JURISDICTIONAL GSL SCHEME"]
[null,null,null,{"$f":"CRY","v":"2014-15"},{"$f":"CRY","v":"2014-15"}]
[null,null,null,"Volume","Value of GSL payments"]
[null,null,null,"0's","$0's"]
[null,"Appointments"]
[]
[]
[]
[]
[null,"To enter further GSL parameters relating to appointments - please copy a row from above and \"insert copied cells\" above this row."]
[null,"Connections"]
[]
[]
[]
[]
[]
[null,"To enter further GSL parameters relating to connections -  please copy a row from above and \"insert copied cells\" above this row."]
[null,"Reliability of supply"]
[null,"Network Reliability - Duration of Interruption",null,53,4240]
[null,"Network Reliability - Frequency of Interruption",null,1,80]
[]
[]
[]
[]
[]
[]
[]
[]
[]
[null,"To enter further GSL parameters relating to reliability of supply -  please copy a row from above and \"insert copied cells\" above this row."]
[null,"Street lights"]
[null,"Repairs not made by agreed date",null,44,660]
[]
[]
[]
[]
[]
[]
[null,"To enter further GSL parameters relating to street lights -  please copy a row from above and \"insert copied cells\" above this row."]
[null,"Planned interruptions"]
[]
[]
[]
[null,"To enter further GSL parameters relating to planned interruptions -  please copy a row from above and \"insert copied cells\" above this row."]
[null,"<NSP defined parameter category>"]
[]
[]
[]
[null,"To enter further GSL parameters - please identify the parameter and if insufficient rows  please copy a row from above and \"insert copied cells\" above this row."]
[null,"<NSP defined parameter category>"]
[]
[]
[]
[null,"To enter further GSL parameters - please identify the parameter and if insufficient rows  please copy a row from above and \"insert copied cells\" above this row."]
[null,"<NSP defined parameter category>"]
[]
[]
[]
[null,"To enter further GSL parameters - please identify the parameter and if insufficient rows  please copy a row from above and \"insert copied cells\" above this row."]
[null,"<NSP defined parameter category>"]
[]
[]
[]
[null,"To enter further GSL parameters - please identify the parameter and if insufficient rows  please copy a row from above and \"insert copied cells\" above this row."]
[]
[]
[null,"6.9.2 - GUARANTEED SERVICE LEVELS - AER GSL SCHEME"]
[]
[null,"Complete Table 6.9.2 if the AER's GSL scheme applied at any time during the regulatory year. \n\nDo not complete Table 6.9.2 if the AER's GSL scheme did not apply during the regulatory year."]
[]
[null,null,null,{"$f":"CRY","v":"2014-15"},{"$f":"CRY","v":"2014-15"}]
[null,null,null,"Volume","Value \nof GSL payments"]
[null,null,null,"0's","$0's"]
[null,"New connections "]
[null,"Number of connections made"]
[null,"Number of connections not made on or before the day agreed"]
[null,"Connections - GSL payments – 1-6 day delay"]
[null,"Connections - GSL payments – 7+ day delay"]
[null,"Reliability of supply"]
[null,"Frequency of interruptions – CBD feeders – 9 interruptions"]
[null,"Frequency of interruptions – Urban feeders – 9 interruptions"]
[null,"Frequency of interruptions – Rural (short and long) feeders – 15 interruptions"]
[null,"Interruptions – CBD feeders – 12 hours duration"]
[null,"Interruptions – Urban feeders – 12 hours duration"]
[null,"Interruptions – Rural (short and long) feeders – 18 hours duration"]
[null,"Total duration of interruptions Level 1 – 20 hours"]
[null,"Total duration of interruptions Level 2 – 30 hours"]
[null,"Total duration of interruptions Level 3 – 60 hours"]
[null,"Street lights"]
[null,"Streetlight repair 5 days – GSL payments"]
[null,"Planned interruptions"]
[null,"Notice of planned interruptions – 4 business days notice not given"]
[null,"Total ",null,null,{"$f":"SUM(E101,E99,E89:E97,E86:E87)","v":0}]

{"sheet":"7.8 Avoided TUOS Payments","index":14,"n_rows":11,"n_cols":3,"rows_kept":11,"cut":false,"hidden":false,"merged":[[6,1,7,1]]}
[null,{"$f":"(LOOKUP(dms_Model,dms_Model_List,dms_Worksheet_List))","v":"REGULATORY REPORTING STATEMENT"}]
[null,{"$f":"dms_TradingName","v":"Essential Energy"}]
[null,{"$f":"CONCATENATE(\"Annual Reporting RIN Response \",CRY)","v":"Annual Reporting RIN Response 2014-15"}]
[null,"7.8 - AVOIDED TUOS PAYMENTS"]
[]
[null,"7.8.1 - AVOIDED TUOS PAYMENTS"]
[null,"Description","Avoided TUOS Payment "]
[null,null,"$0's, nominal"]
[null,"Embedded generators",{"$f":"'8.1 Income'!C26","v":2172414}]
[null,"Market network service providers"]
[null,"Other"]

{"sheet":"7.10 Juris Scheme","index":15,"n_rows":17,"n_cols":6,"rows_kept":17,"cut":false,"hidden":false,"merged":[[8,4,9,4],[8,3,9,3],[8,2,9,2],[8,1,9,1],[5,1,5,2]]}
[null,{"$f":"(LOOKUP(dms_Model,dms_Model_List,dms_Worksheet_List))","v":"REGULATORY REPORTING STATEMENT"}]
[null,{"$f":"dms_TradingName","v":"Essential Energy"}]
[null,{"$f":"CONCATENATE(\"Annual Reporting RIN Response \",CRY)","v":"Annual Reporting RIN Response 2014-15"}]
[null,"7.10 - JURISDICTIONAL SCHEMES"]
[]
[null,"Instructions\nBusiness must list each relevant jurisdictional scheme individually and report information for each scheme separately from other schemes."]
[]
[null,"7.10.1 - JURISDICTIONAL SCHEME PAYMENTS"]
[null,"Jurisdictional Scheme Name","Description","Date DNSP Became Subject to Scheme","Description of Cost Recovery Method","Total Scheme Payments  "]
[null,null,null,null,null,"$0's, nominal"]
[null,"Climate Change Levy (net)","Amounts recovered through NUOS tariffs to recover amounts paid to NSW Office Environment and Heritage (OEH) contributing to the Fund",null,"Component of NUOS tariffs, 25 per cent from Residnetial customers",4129010.9999999986]
[null,"NSW Solar Bonus Scheme","Amounts paid through tariffs to eligible customers for 60c or 20c solar rebate,\nless amounts reimbursed by NSW Office Environment and Heritage (OEH)","Jan-10","Invoices issued to OEH",-1293662.5799999982]
[null,"QLD Solar Scheme (net)","Amounts paid through tariffs to eligible customers for QLD solar rebate,\nless amounts recovered by componet of NUOS tariff","2013-07-01","Component of NUOS tariffs",1166192.1120130713]
[]
[]
[]
[null,null,null,null,"Total",{"$f":"SUM(F11:F16)","v":4001540.5320130717}]

{"sheet":"7.11 DMIS-DMIA","index":16,"n_rows":17,"n_cols":5,"rows_kept":17,"cut":false,"hidden":false,"merged":[[14,5,14,7],[6,1,7,1],[6,5,7,7],[6,2,6,4],[13,5,13,7],[9,5,9,7],[10,5,10,7],[11,5,11,7],[12,5,12,7],[8,2,8,4]]}
[null,{"$f":"(LOOKUP(dms_Model,dms_Model_List,dms_Worksheet_List))","v":"REGULATORY REPORTING STATEMENT"}]
[null,{"$f":"dms_TradingName","v":"Essential Energy"}]
[null,{"$f":"CONCATENATE(\"Annual Reporting RIN Response \",CRY)","v":"Annual Reporting RIN Response 2014-15"}]
[null,"7.11 - DEMAND MANAGEMENT INCENTIVE SCHEME"]
[]
[null,"7.11.1 - DMIA - PROJECTS SUBMITTED FOR APPROVAL"]
[null,"Name of project",{"$f":"CONCATENATE(\"Total amount of the DMIA spent in \", CRY)","v":"Total amount of the DMIA spent in 2014-15"}]
[null,null,"Operating expenditure","Capital expenditure","Total"]
[null,null,"$0's, nominal"]
[null,"Grid Interactive Inverter program 5kVA based",null,2039.0806009873409,{"$f":"SUM(C10:D10)","v":2039.0806009873409}]
[null,"Conservation Voltage Reduction through low voltage regulators",null,205727.97921923781,205727.97921923781]
[null,"Switched Reactors",null,294973.8601797747,294973.8601797747]
[null,null,null,null,0]
[null,null,null,null,0]
[null,null,null,null,{"$f":"SUM(C15:D15)","v":0}]
[null,"To enter additional projects - please copy a row from above and \"insert copied cells\" above this row. "]
[null,"Total",{"$f":"SUM(C10:C16)","v":0},{"$f":"SUM(D10:D16)","v":502740.91999999981},{"$f":"SUM(E10:E16)","v":502740.91999999981}]

{"sheet":"7.12 Safety and Bushfire","index":17,"n_rows":340,"n_cols":10,"rows_kept":340,"cut":false,"hidden":false,"merged":[[319,4,319,6],[320,4,320,6],[214,6,214,8],[212,3,212,5],[212,6,212,8],[40,2,40,5],[41,2,41,5],[38,2,38,5],[39,2,39,5],[119,6,119,8],[120,6,120,8],[44,2,44,5],[68,6,68,7],[69,6,69,7],[70,6,70,7],[122,6,122,8],[123,6,123,8],[124,6,124,8],[125,6,125,8],[126,6,126,8],[59,6,59,7],[60,6,60,7],[61,6,61,7],[62,6,62,7],[337,4,337,6],[338,4,338,6],[324,4,324,6],[313,4,313,6],[314,4,314,6],[315,4,315,6],[316,4,316,6],[317,4,317,6],[318,4,318,6],[325,4,325,6],[326,4,326,6],[321,4,321,6],[322,4,322,6],[323,4,323,6],[332,4,332,6],[333,4,333,6],[334,4,334,6],[336,4,336,6],[331,4,331,6],[335,4,335,6],[329,4,329,6],[330,4,330,6],[327,4,327,6],[328,4,328,6],[248,1,249,1],[248,2,249,2],[312,4,312,6],[10,1,10,2],[82,3,82,5],[82,1,84,1],[82,2,84,2],[11,1,11,2],[164,2,164,4],[84,3,84,5],[82,6,82,8],[84,6,84,8],[17,6,17,8],[32,6,32,8],[33,6,33,8],[34,2,34,5],[34,6,34,8],[35,2,35,5],[35,6,35,8],[36,2,36,5],[36,6,36,8],[249,3,249,5],[311,4,311,6],[43,2,43,5],[37,2,37,5],[5,1,5,2],[25,2,25,5],[26,2,26,5],[27,2,27,5],[28,2,28,5],[29,2,29,5],[30,2,30,5],[42,2,42,5],[31,2,31,5],[32,2,32,5],[14,1,14,4],[13,1,13,4],[33,2,33,5],[24,2,24,5],[17,2,17,5],[18,2,18,5],[19,2,19,5],[20,2,20,5],[21,2,21,5],[22,2,22,5],[23,2,23,5],[212,1,214,1],[212,2,214,2],[214,3,214,5],[82,9,84,9],[162,2,162,4],[162,5,162,7],[162,1,164,1],[164,5,164,7],[133,6,133,8],[134,6,134,8],[135,6,135,8],[136,6,136,8],[137,6,137,8],[138,6,138,8],[139,6,139,8],[140,6,140,8],[141,6,141,8],[142,6,142,8],[143,6,143,8],[144,6,144,8],[145,6,145,8],[212,9,214,9],[117,6,118,8],[121,6,121,8],[18,6,18,8],[19,6,19,8],[20,6,20,8],[21,6,21,8],[22,6,22,8],[42,6,42,8],[43,6,43,8],[44,6,44,8],[28,6,28,8],[29,6,29,8],[30,6,30,8],[31,6,31,8],[23,6,23,8],[24,6,24,8],[25,6,25,8],[26,6,26,8],[27,6,27,8],[40,6,40,8],[37,6,37,8],[41,6,41,8],[38,6,38,8],[39,6,39,8],[63,6,63,7],[64,6,64,7],[65,6,65,7],[66,6,66,7],[67,6,67,7],[50,6,50,7],[51,6,51,7],[52,6,52,7],[53,6,53,7],[54,6,54,7],[55,6,55,7],[56,6,56,7],[57,6,57,7],[58,6,58,7],[162,8,164,9],[171,8,171,9],[172,8,172,9],[166,8,166,9],[167,8,167,9],[71,6,71,7],[72,6,72,7],[73,6,73,7],[74,6,74,7],[75,6,75,7],[76,6,76,7],[77,6,77,7],[165,8,165,9],[168,8,168,9],[130,6,130,8],[131,6,131,8],[132,6,132,8],[127,6,127,8],[128,6,128,8],[129,6,129,8],[248,6,249,7],[250,6,250,7],[251,6,251,7],[252,6,252,7],[253,6,253,7],[254,6,254,7],[255,6,255,7],[256,6,256,7],[169,8,169,9],[170,8,170,9],[207,6,207,7],[190,6,190,7],[191,6,191,7],[192,6,192,7],[193,6,193,7],[194,6,194,7],[195,6,195,7],[196,6,196,7],[197,6,197,7],[198,6,198,7],[199,6,199,7],[200,6,200,7],[201,6,201,7],[202,6,202,7],[272,6,272,7],[273,6,273,7],[274,6,274,7],[257,6,257,7],[258,6,258,7],[259,6,259,7],[260,6,260,7],[261,6,261,7],[262,6,262,7],[263,6,263,7],[264,6,264,7],[265,6,265,7],[304,6,304,7],[305,6,305,7],[288,6,288,7],[289,6,289,7],[290,6,290,7],[291,6,291,7],[292,6,292,7],[293,6,293,7],[294,6,294,7],[295,6,295,7],[296,6,296,7],[138,1,138,2],[297,6,297,7],[298,6,298,7],[299,6,299,7],[300,6,300,7],[301,6,301,7],[302,6,302,7],[303,6,303,7],[275,6,275,7],[276,6,276,7],[282,6,282,7],[283,6,283,7],[284,6,284,7],[285,6,285,7],[286,6,286,7],[287,6,287,7],[280,6,280,7],[281,6,281,7],[266,6,266,7],[267,6,267,7],[268,6,268,7],[269,6,269,7],[270,6,270,7],[271,6,271,7],[117,1,118,2],[180,6,180,7],[306,6,306,7],[307,6,307,7],[118,3,118,5],[119,1,119,2],[120,1,120,2],[121,1,121,2],[122,1,122,2],[123,1,123,2],[124,1,124,2],[125,1,125,2],[126,1,126,2],[127,1,127,2],[128,1,128,2],[129,1,129,2],[130,1,130,2],[131,1,131,2],[132,1,132,2],[133,1,133,2],[134,1,134,2],[135,1,135,2],[136,1,136,2],[137,1,137,2],[206,6,206,7],[181,6,181,7],[182,6,182,7],[183,6,183,7],[184,6,184,7],[185,6,185,7],[186,6,186,7],[187,6,187,7],[188,6,188,7],[189,6,189,7],[139,1,139,2],[140,1,140,2],[141,1,141,2],[142,1,142,2],[143,1,143,2],[144,1,144,2],[203,6,203,7],[204,6,204,7],[205,6,205,7],[145,1,145,2]]}
[null,{"$f":"(LOOKUP(dms_Model,dms_Model_List,dms_Worksheet_List))","v":"REGULATORY REPORTING STATEMENT"}]
[null,{"$f":"dms_TradingName","v":"Essential Energy"}]
[null,{"$f":"CONCATENATE(\"Annual Reporting RIN Response \",CRY)","v":"Annual Reporting RIN Response 2014-15"}]
[null,"7.12 SAFETY AND BUSHFIRE RELATED EXPENDITURE"]
[]
[null,"These templates collect information from Victorian businesses only.\n\nBushfire and safety related expenditure information is used by the AER to monitor the expenditures throughout the regulatory control period."]
[]
[null,"CPI applied to convert expected expenditure in real $ to nominal based on lagged September CPI index"]
[]
[null,"Instructions"]
[null,"For \"Exclusive of Margins & Overheads\" reported expenditure is to EXCLUDE any overheads, profit margins or management fees paid directly or indirectly to related party contractors (not including actual incurred expense of the related party contractor) for the reporting period."]
[null,"For \"Value of Margins & Overheads\" reported expenditure is to COMPRISE ONLY the sum of overheads, profit margins or management fees paid directly or indirectly to related party contractors (not including actual incurred expenses of the related party contractor) for the reporting period. "]
[]
[null,{"$f":"CONCATENATE(dms_TradingName, \" is to specify each activity in this table in accordance with the definition in Appendix F of the RIN.\")","v":"Essential Energy is to specify each activity in this table in accordance with the definition in Appendix F of the RIN."}]
[null,"All activities must be reported but the Reason for Difference is only required if there is a 10 per cent difference between the expected value and the actual value.\n\nUse median unit costs. Where unit costs are not recorded at the asset category level - provide the best estimates of the unit cost using the cost allocation method identified in this table. (As a transitional measure, the unit cost may be based on a statistically significant annual sample of actual work orders at a 5% or better confidence interval.)\n\nProvide basis of allocation where applicable."]
[]
[null,"7.12.1 - SAFETY AND BUSHFIRE RELATED ASSET GROUP DEFINITIONS AND ALLOCATION BASIS"]
[null,"Activity","Definitions",null,null,null,"Basis for allocation of cost to activity"]
[null,"Planned non-preferred services replacements"]
[null,"Planned replacement of non-preferred services due to height "]
[null,"Removal of public lighting switchwire "]
[null,"Replacement of existing SWER lines with 22kV overhead bare conductor "]
[null,"Installation of GFN and associated equipment at zone substations "]
[null,"Replacement of crossarms/insulator sets – pole top fire mitigation"]
[null,"Replacement of crossarms – based on age and condition "]
[null,"Replacement of poles – based on age and condition "]
[null,"Stake poles – based on age and condition "]
[null,"Replacement of undersized poles "]
[null,"Stake undersized poles"]
[null,"Replacement of overhead conductor – mainly steel "]
[null,"Service line clearance – overhead services requiring relocation "]
[null,"Service line clearance – overhead services requiring undergrounding "]
[null,"Replacement of 22kV distribution feeders with ABC/underground cabling"]
[null,"Replacement of SWER with covered carbon core conductor or equivalent"]
[null,"Replacement of SWER with ABC"]
[null,"Replacement of SWER with underground"]
[null,"Replacement of surge diverters (neptune configuration)"]
[null,"Replacement of surge diverters (single phase or three phase)"]
[]
[]
[]
[]
[]
[]
[]
[null,"To enter further activities - please copy row from above and \"insert copied cells\" into a row above this row. "]
[]
[null,"7.12.2 - BUSHFIRE RELATED"]
[]
[null,"7.12.2.1 - NUMBER OF ACTIVITIES"]
[null,"Activity","Units","AER expected number","Actual Number","Difference","Reasons for Difference"]
[null,"Planned non-preferred services replacements","number of services",null,null,{"$f":"D52-E52","v":0}]
[null,"Planned replacement of non-preferred services due to height ","number of services",null,null,{"$f":"D53-E53","v":0}]
[null,"Removal of public lighting switchwire ","number of spans removed",null,null,0]
[null,"Replacement of existing SWER lines with 22kV overhead bare conductor ","kms of SWER",null,null,0]
[null,"Installation of GFN and associated equipment at zone substations ","number of zone substations",null,null,{"$f":"D56-E56","v":0}]
[null,"Replacement of crossarms/insulator sets – pole top fire mitigation","number of crossarms/sets",null,null,0]
[null,"Replacement of crossarms – based on age and condition ","number of crossarms",null,null,0]
[null,"Replacement of poles – based on age and condition ","number of poles",null,null,0]
[null,"Stake poles – based on age and condition ","number of poles",null,null,0]
[null,"Replacement of undersized poles ","number of poles",null,null,0]
[null,"Stake undersized poles","number of poles",null,null,0]
[null,"Replacement of overhead conductor – mainly steel ","kms ",null,null,0]
[null,"Service line clearance – overhead services requiring relocation ","number of services",null,null,0]
[null,"Service line clearance – overhead services requiring undergrounding ","number of services",null,null,0]
[null,"Replacement of 22kV distribution feeders with ABC/underground cabling","number of feeders",null,null,0]
[null,"Replacement of SWER with covered carbon core conductor or equivalent","kms ",null,null,0]
[null,"Replacement of SWER with ABC","kms ",null,null,0]
[null,"Replacement of SWER with underground","kms ",null,null,0]
[null,"Replacement of surge diverters (neptune configuration)","number of units",null,null,{"$f":"D70-E70","v":0}]
[null,"Replacement of surge diverters (single phase or three phase)","number of units",null,null,0]
[null,{"$f":"IF(ISBLANK(B39),\"\",B39)","v":""},null,null,null,{"$f":"D72-E72","v":0}]
[null,{"$f":"IF(ISBLANK(B40),\"\",B40)","v":""},null,null,null,0]
[null,"",null,null,null,0]
[null,"",null,null,null,0]
[null,"",null,null,null,0]
[null,"",null,null,null,0]
[null,"",null,null,null,0]
[null,"To enter further activities - please copy row from above and \"insert copied cells\" into a row above this row. "]
[]
[]
[null,"7.12.2.2 - EXPENDITURE "]
[null,"Activity","Units","Exclusive of Margins & Overheads",null,null,"Value of Margins & Overheads",null,null,"Reasons for Difference"]
[null,null,null,"AER expected expenditure ","Actual expenditure","Difference  ","AER expected expenditure ","Actual expenditure","Difference  "]
[null,null,null,"$0's, Nominal",null,null,"$0's, Nominal"]
[null,"Planned non-preferred services replacements","number of services",null,null,{"$f":"D86*$C$8-E86","v":0},null,null,{"$f":"G86*$C$8-H86","v":0}]
[null,"Planned replacement of non-preferred services due to height ","number of services",null,null,{"$f":"D87*$C$8-E87","v":0},null,null,{"$f":"G87*$C$8-H87","v":0}]
[null,"Removal of public lighting switchwire ","number of spans removed",null,null,0,null,null,0]
[null,"Replacement of existing SWER lines with 22kV overhead bare conductor ","kms of SWER",null,null,0,null,null,0]
[null,"Installation of GFN and associated equipment at zone substations ","number of zone substations",null,null,0,null,null,0]
[null,"Replacement of crossarms/insulator sets – pole top fire mitigation","number of crossarms/sets",null,null,0,null,null,0]
[null,"Replacement of crossarms – based on age and condition ","number of crossarms",null,null,0,null,null,0]
[null,"Replacement of poles – based on age and condition ","number of poles",null,null,0,null,null,0]
[null,"Stake poles – based on age and condition ","number of poles",null,null,0,null,null,0]
[null,"Replacement of undersized poles ","number of poles",null,null,0,null,null,0]
[null,"Stake undersized poles","number of poles",null,null,0,null,null,0]
[null,"Replacement of overhead conductor – mainly steel ","kms ",null,null,0,null,null,0]
[null,"Service line clearance – overhead services requiring relocation ","number of services",null,null,0,null,null,0]
[null,"Service line clearance – overhead services requiring undergrounding ","number of services",null,null,0,null,null,0]
[null,"Replacement of 22kV distribution feeders with ABC/underground cabling","number of feeders",null,null,0,null,null,0]
[null,"Replacement of SWER with covered carbon core conductor or equivalent","kms ",null,null,0,null,null,0]
[null,"Replacement of SWER with ABC","kms ",null,null,0,null,null,0]
[null,"Replacement of SWER with underground","kms ",null,null,0,null,null,0]
[null,"Replacement of surge diverters (neptune configuration)","number of units",null,null,0,null,null,0]
[null,"Replacement of surge diverters (single phase or three phase)","number of units",null,null,0,null,null,0]
[null,{"$f":"IF(ISBLANK(B39),\"\",B39)","v":""},{"$f":"IF(ISBLANK(C72),\"\",C72)","v":""},null,null,0,null,null,0]
[null,"","",null,null,{"$f":"D107*$C$8-E107","v":0},null,null,{"$f":"G107*$C$8-H107","v":0}]
[null,"","",null,null,0,null,null,0]
[null,"","",null,null,0,null,null,0]
[null,"","",null,null,0,null,null,0]
[null,"","",null,null,0,null,null,0]
[null,"","",null,null,0,null,null,0]
[null,"To enter further activities - please copy row from above and \"insert copied cells\" into a row above this row. "]
[]
[]
[]
[null,"7.12.2.3 - UNIT COSTS"]
[null,"Activity",null,"AER expected ","Actual","Difference","Reasons for Difference"]
[null,null,null,"$0's, Per Unit"]
[null,"Planned non-preferred services replacements",null,null,null,{"$f":"D120*$C$8-E120","v":0}]
[null,"Planned replacement of non-preferred services due to height ",null,null,null,0]
[null,"Removal of public lighting switchwire ",null,null,null,0]
[null,"Replacement of existing SWER lines with 22kV overhead bare conductor ",null,null,null,0]
[null,"Installation of GFN and associated equipment at zone substations ",null,null,null,0]
[null,"Replacement of crossarms/insulator sets – pole top fire mitigation",null,null,null,0]
[null,"Replacement of crossarms – based on age and condition ",null,null,null,0]
[null,"Replacement of poles – based on age and condition ",null,null,null,0]
[null,"Stake poles – based on age and condition ",null,null,null,0]
[null,"Replacement of undersized poles ",null,null,null,0]
[null,"Stake undersized poles",null,null,null,0]
[null,"Replacement of overhead conductor – mainly steel ",null,null,null,0]
[null,"Service line clearance – overhead services requiring relocation ",null,null,null,0]
[null,"Service line clearance – overhead services requiring undergrounding ",null,null,null,0]
[null,"Replacement of 22kV distribution feeders with ABC/underground cabling",null,null,null,0]
[null,"Replacement of SWER with covered carbon core conductor or equivalent",null,null,null,0]
[null,"Replacement of SWER with ABC",null,null,null,0]
[null,"Replacement of SWER with underground",null,null,null,0]
[null,"Replacement of surge diverters (neptune configuration)",null,null,null,0]
[null,"Replacement of surge diverters (single phase or three phase)",null,null,null,0]
[null,{"$f":"IF(ISBLANK(B39),\"\",B39)","v":""},null,null,null,0]
[null,"",null,null,null,0]
[null,"",null,null,null,0]
[null,"",null,null,null,0]
[null,"",null,null,null,0]
[null,"",null,null,null,0]
[null,"",null,null,null,0]
[null,"To enter further activities - please copy row from above and \"insert copied cells\" into a row above this row. "]
[]
[]
[null,"7.12.2.4 - CONTINGENT PROJECT APPLICATIONS - VOLUMES APPROVED"]
[null,"Activity","Units","Volume approved under contingent project applications ","Actual volumes","Difference"]
[null,null,null,null,null,{"$f":"E152-D152","v":0}]
[null,null,null,null,null,0]
[null,null,null,null,null,0]
[null,null,null,null,null,0]
[null,null,null,null,null,0]
[null,null,null,null,null,0]
[null,null,null,null,null,0]
[null,null,null,null,null,0]
[null,"To enter further activities - please copy row from above and \"insert copied cells\" into a row above this row. "]
[]
[null,"7.12.2.5 - CONTINGENT PROJECT APPLICATIONS - EXPENDITURE APPROVED"]
[null,"Activity","Exclusive of Margins & Overheads",null,null,"Value of Margins & Overheads",null,null,"Reasons for Difference"]
[null,null,"Expenditure approved under contingent project applications","Actual expenditure ","Difference","Expenditure approved under contingent project applications","Actual expenditure","Difference"]
[null,null,"$0's, Nominal",null,null,"$0's, Nominal"]
[null,{"$f":"IF(ISBLANK(B152),\"\",B152)","v":""},null,null,{"$f":"C166-D166","v":0},null,null,{"$f":"F166-G166","v":0}]
[null,{"$f":"IF(ISBLANK(B153),\"\",B153)","v":""},null,null,{"$f":"C167-D167","v":0},null,null,{"$f":"F167-G167","v":0}]
[null,"",null,null,0,null,null,0]
[null,"",null,null,0,null,null,0]
[null,"",null,null,0,null,null,0]
[null,"",null,null,0,null,null,0]
[null,"",null,null,0,null,null,0]
[null,"",null,null,0,null,null,0]
[null,"To enter further activities - please copy row from above and \"insert copied cells\" into a row above this row. "]
[]
[]
[]
[null,"7.12.3 - SAFETY RELATED"]
[]
[null,"7.12.3.1 - NUMBER OF ACTIVITIES"]
[null,"Activity","Units","AER expected volumes","Actual units","Difference","Reasons for Difference"]
[null,"Planned non-preferred services replacements","number of services",null,null,{"$f":"D182-E182","v":0}]
[null,"Planned replacement of non-preferred services due to height ","number of services",null,null,{"$f":"D183-E183","v":0}]
[null,"Removal of public lighting switchwire ","number of spans removed",null,null,0]
[null,"Replacement of existing SWER lines with 22kV overhead bare conductor ","kms of SWER",null,null,0]
[null,"Installation of GFN and associated equipment at zone substations ","number of zone substations",null,null,0]
[null,"Replacement of crossarms/insulator sets – pole top fire mitigation","number of crossarms/sets",null,null,0]
[null,"Replacement of crossarms – based on age and condition ","number of crossarms",null,null,0]
[null,"Replacement of poles – based on age and condition ","number of poles",null,null,0]
[null,"Stake poles – based on age and condition ","number of poles",null,null,0]
[null,"Replacement of undersized poles ","number of poles",null,null,0]
[null,"Stake undersized poles","number of poles",null,null,0]
[null,"Replacement of overhead conductor – mainly steel ","kms ",null,null,0]
[null,"Service line clearance – overhead services requiring relocation ","number of services",null,null,0]
[null,"Service line clearance – overhead services requiring undergrounding ","number of services",null,null,0]
[null,"Replacement of 22kV distribution feeders with ABC/underground cabling","number of feeders",null,null,0]
[null,"Replacement of SWER with covered carbon core conductor or equivalent","kms ",null,null,0]
[null,"Replacement of SWER with ABC","kms ",null,null,{"$f":"D198-E198","v":0}]
[null,"Replacement of SWER with underground","kms ",null,null,{"$f":"D199-E199","v":0}]
[null,"Replacement of surge diverters (neptune configuration)","number of units",null,null,0]
[null,"Replacement of surge diverters (single phase or three phase)","number of units",null,null,0]
[null,{"$f":"IF(ISBLANK(B39),\"\",B39)","v":""},{"$f":"IF(ISBLANK(C72),\"\",C72)","v":""},null,null,0]
[null,"","",null,null,0]
[null,"","",null,null,{"$f":"D204-E204","v":0}]
[null,"","",null,null,{"$f":"D205-E205","v":0}]
[null,"","",null,null,{"$f":"D206-E206","v":0}]
[null,"","",null,null,0]
[null,"","",null,null,0]
[null,"To enter further activities - please copy row from above and \"insert copied cells\" into a row above this row. "]
[]
[]
[null,"7.12.3.2 - EXPENDITURE"]
[null,"Activity","Units","Exclusive of Margins & Overheads",null,null,"Value of Margins & Overheads",null,null,"Reasons for Difference"]
[null,null,null,"AER expected expenditure ","Actual expenditure","Difference  ","AER expected expenditure ","Actual expenditure","Difference  "]
[null,null,null,"$0's, Nominal",null,null,"$0's, Nominal"]
[null,"Planned non-preferred services replacements","number of services",null,null,{"$f":"D216*$C$8-E216","v":0},null,null,{"$f":"G216*$C$8-H216","v":0}]
[null,"Planned replacement of non-preferred services due to height ","number of services",null,null,{"$f":"D217*$C$8-E217","v":0},null,null,{"$f":"G217*$C$8-H217","v":0}]
[null,"Removal of public lighting switchwire ","number of spans removed",null,null,0,null,null,0]
[null,"Replacement of existing SWER lines with 22kV overhead bare conductor ","kms of SWER",null,null,0,null,null,0]
[null,"Installation of GFN and associated equipment at zone substations ","number of zone substations",null,null,0,null,null,0]
[null,"Replacement of crossarms/insulator sets – pole top fire mitigation","number of crossarms/sets",null,null,0,null,null,0]
[null,"Replacement of crossarms – based on age and condition ","number of crossarms",null,null,0,null,null,0]
[null,"Replacement of poles – based on age and condition ","number of poles",null,null,0,null,null,0]
[null,"Stake poles – based on age and condition ","number of poles",null,null,0,null,null,0]
[null,"Replacement of undersized poles ","number of poles",null,null,0,null,null,0]
[null,"Stake undersized poles","number of poles",null,null,0,null,null,0]
[null,"Replacement of overhead conductor – mainly steel ","kms ",null,null,0,null,null,0]
[null,"Service line clearance – overhead services requiring relocation ","number of services",null,null,0,null,null,0]
[null,"Service line clearance – overhead services requiring undergrounding ","number of services",null,null,0,null,null,0]
[null,"Replacement of 22kV distribution feeders with ABC/underground cabling","number of feeders",null,null,0,null,null,0]
[null,"Replacement of SWER with covered carbon core conductor or equivalent","kms ",null,null,0,null,null,0]
[null,"Replacement of SWER with ABC","kms ",null,null,{"$f":"D232-E232","v":0},null,null,{"$f":"G232-H232","v":0}]
[null,"Replacement of SWER with underground","kms ",null,null,{"$f":"D233-E233","v":0},null,null,{"$f":"G233-H233","v":0}]
[null,"Replacement of surge diverters (neptune configuration)","number of units",null,null,0,null,null,0]
[null,"Replacement of surge diverters (single phase or three phase)","number of units",null,null,0,null,null,0]
[null,{"$f":"IF(ISBLANK(B39),\"\",B39)","v":""},{"$f":"IF(ISBLANK(C72),\"\",C72)","v":""},null,null,0,null,null,0]
[null,"","",null,null,0,null,null,0]
[null,"","",null,null,{"$f":"D238-E238","v":0},null,null,{"$f":"G238-H238","v":0}]
[null,"","",null,null,{"$f":"D239-E239","v":0},null,null,{"$f":"G239-H239","v":0}]
[null,"","",null,null,{"$f":"D240-E240","v":0},null,null,{"$f":"G240-H240","v":0}]
[null,"","",null,null,0,null,null,0]
[null,"","",null,null,0,null,null,0]
[null,"To enter further activities - please copy row from above and \"insert copied cells\" into a row above this row. "]
[]
[]
[]
[]
[null,"7.12.3.3 - UNIT COSTS"]
[null,"Activity","Units","AER expected","Actual\n  ","Difference\n  ","Reasons for Difference"]
[null,null,null,"$0's per Unit"]
[null,"Planned non-preferred services replacements","number of services",null,null,{"$f":"D251*$C$8-E251","v":0}]
[null,"Planned replacement of non-preferred services due to height ","number of services",null,null,0]
[null,"Removal of public lighting switchwire ","number of spans removed",null,null,0]
[null,"Replacement of  existing SWER lines with 22kV overhead bare conductor ","kms of SWER",null,null,0]
[null,"Installation of GFN and associated equipment at zone substations ","number of zone substations",null,null,0]
[null,"Replacement of crossarms/insulator sets – pole top fire mitigation","number of crossarms/sets",null,null,0]
[null,"Replacement of crossarms – based on age and condition ","number of crossarms",null,null,0]
[null,"Replacement of poles – based on age and condition ","number of poles",null,null,0]
[null,"Stake poles – based on age and condition ","number of poles",null,null,0]
[null,"Replacement of undersized poles ","number of poles",null,null,0]
[null,"Stake undersized poles","number of poles",null,null,0]
[null,"Replacement of overhead conductor – mainly steel ","kms ",null,null,0]
[null,"Service line clearance – overhead services requiring relocation ","number of services",null,null,0]
[null,"Service line clearance – overhead services requiring undergrounding ","number of services",null,null,0]
[null,"Replacement of 22kV distribution feeders with ABC/underground cabling","number of feeders",null,null,0]
[null,"Replacement of SWER with covered carbon core conductor or equivalent","kms ",null,null,0]
[null,"Replacement of SWER with ABC","kms ",null,null,{"$f":"D267-E267","v":0}]
[null,"Replacement of SWER with underground","kms ",null,null,{"$f":"D268-E268","v":0}]
[null,"Replacement of surge diverters (neptune configuration)","number of units",null,null,0]
[null,"Replacement of surge diverters (single phase or three phase)","number of units",null,null,0]
[null,{"$f":"IF(ISBLANK(B39),\"\",B39)","v":""},{"$f":"IF(ISBLANK(C72),\"\",C72)","v":""},null,null,0]
[null,"","",null,null,0]
[null,"","",null,null,{"$f":"D273-E273","v":0}]
[null,"","",null,null,{"$f":"D274-E274","v":0}]
[null,"","",null,null,{"$f":"D275-E275","v":0}]
[null,"","",null,null,0]
[null,"","",null,null,0]
[null,"To enter further activities - please copy row from above and \"insert copied cells\" into a row above this row. "]
[]
[null,"7.12.3.4 - SAFETY IMPROVEMENT OUTCOMES REPORTED TO ESV"]
[null,"Activity","Units","Safety Improvement Programme - outcomes","Safety Improvement Target","Difference","Reasons for Difference"]
[null,"Planned non-preferred services replacements","number of services",null,null,{"$f":"D282-E282","v":0}]
[null,"Planned replacement of non-preferred services due to height ","number of services",null,null,{"$f":"D283-E283","v":0}]
[null,"Removal of public lighting switchwire ","number of spans removed",null,null,0]
[null,"Replacement of  existing SWER lines with 22kV overhead bare conductor ","kms of SWER",null,null,0]
[null,"Installation of GFN and associated equipment at zone substations ","number of zone substations",null,null,0]
[null,"Replacement of crossarms/insulator sets – pole top fire mitigation","number of crossarms/sets",null,null,0]
[null,"Replacement of crossarms – based on age and condition ","number of crossarms",null,null,0]
[null,"Replacement of poles – based on age and condition ","number of poles",null,null,0]
[null,"Stake poles – based on age and condition ","number of poles",null,null,0]
[null,"Replacement of undersized poles ","number of poles",null,null,0]
[null,"Stake undersized poles","number of poles",null,null,0]
[null,"Replacement of overhead conductor – mainly steel ","kms ",null,null,0]
[null,"Service line clearance – overhead services requiring relocation ","number of services",null,null,0]
[null,"Service line clearance – overhead services requiring undergrounding ","number of services",null,null,0]
[null,"Replacement of 22kV distribution feeders with ABC/underground cabling","number of feeders",null,null,0]
[null,"Replacement of SWER with covered carbon core conductor or equivalent","kms ",null,null,0]
[null,"Replacement of SWER with ABC","kms ",null,null,0]
[null,"Replacement of SWER with underground","kms ",null,null,{"$f":"D299-E299","v":0}]
[null,"Replacement of surge diverters (neptune configuration)","number of units",null,null,0]
[null,"Replacement of surge diverters (single phase or three phase)","number of units",null,null,0]
[null,{"$f":"IF(ISBLANK(B39),\"\",B39)","v":""},{"$f":"IF(ISBLANK(C72),\"\",C72)","v":""},null,null,0]
[null,"","",null,null,0]
[null,"","",null,null,{"$f":"D304-E304","v":0}]
[null,"","",null,null,{"$f":"D305-E305","v":0}]
[null,"","",null,null,{"$f":"D306-E306","v":0}]
[null,"","",null,null,0]
[null,"","",null,null,0]
[null,"To enter further activities - please copy row from above and \"insert copied cells\" into a row above this row. "]
[]
[null,"7.12.3.5 - SAFETY IMPROVEMENT OUTCOMES RECONCILIATION"]
[null,"Activity","Units","Difference","Reasons for Difference"]
[null,"Planned non-preferred services replacements","number of services",{"$f":"D282-E52-E182","v":0}]
[null,"Planned replacement of non-preferred services due to height ","number of services",0]
[null,"Removal of public lighting switchwire ","number of spans removed",0]
[null,"Replacement of  existing SWER lines with 22kV overhead bare conductor ","kms of SWER",0]
[null,"Installation of GFN and associated equipment at zone substations ","number of zone substations",0]
[null,"Replacement of crossarms/insulator sets – pole top fire mitigation","number of crossarms/sets",0]
[null,"Replacement of crossarms – based on age and condition ","number of crossarms",0]
[null,"Replacement of poles – based on age and condition ","number of poles",0]
[null,"Stake poles – based on age and condition ","number of poles",0]
[null,"Replacement of undersized poles ","number of poles",0]
[null,"Stake undersized poles","number of poles",0]
[null,"Replacement of overhead conductor – mainly steel ","kms ",0]
[null,"Service line clearance – overhead services requiring relocation ","number of services",0]
[null,"Service line clearance – overhead services requiring undergrounding ","number of services",0]
[null,"Replacement of 22kV distribution feeders with ABC/underground cabling","number of feeders",0]
[null,"Replacement of SWER with covered carbon core conductor or equivalent","kms ",0]
[null,"Replacement of SWER with ABC","kms ",0]
[null,"Replacement of SWER with underground","kms ",0]
[null,"Replacement of surge diverters (neptune configuration)","number of units",0]
[null,"Replacement of surge diverters (single phase or three phase)","number of units",0]
[null,{"$f":"IF(ISBLANK(B39),\"\",B39)","v":""},{"$f":"IF(ISBLANK(C72),\"\",C72)","v":""},{"$f":"D302-E73-E202","v":0}]
[null,"","",0]
[null,"","",0]
[null,"","",0]
[null,"","",0]
[null,"","",0]
[null,"","",0]
[null,"To enter further activities - please copy row from above and \"insert copied cells\" into a row above this row. "]

{"sheet":"7.13 TARC","index":18,"n_rows":9,"n_cols":4,"rows_kept":9,"cut":false,"hidden":false,"merged":[]}
[null,{"$f":"(LOOKUP(dms_Model,dms_Model_List,dms_Worksheet_List))","v":"REGULATORY REPORTING STATEMENT"}]
[null,{"$f":"dms_TradingName","v":"Essential Energy"}]
[null,{"$f":"CONCATENATE(\"Annual Reporting RIN Response \",CRY)","v":"Annual Reporting RIN Response 2014-15"}]
[null,"7.13 - TARC"]
[]
[]
[null,"7.13.1 - TOTAL ANNUAL RETAILER CHARGES"]
[null,null,"$0's"]
[null,"TARC",1879463676.2,"Note - GST inclusive"]

{"sheet":"8.1 Income","index":19,"n_rows":40,"n_cols":12,"rows_kept":40,"cut":false,"hidden":false,"merged":[[6,1,9,1],[6,6,6,10],[7,8,7,10],[6,11,8,11],[9,2,9,11],[6,5,8,5],[7,6,7,7],[6,2,8,2],[6,3,8,3],[6,4,8,4]]}
[null,{"$f":"(LOOKUP(dms_Model,dms_Model_List,dms_Worksheet_List))","v":"REGULATORY REPORTING STATEMENT"}]
[null,{"$f":"dms_TradingName","v":"Essential Energy"}]
[null,{"$f":"CONCATENATE(\"Annual Reporting RIN Response \",CRY)","v":"Annual Reporting RIN Response 2014-15"}]
[null,"8.1 - INCOME"]
[]
[null,"8.1.1 - INCOME STATEMENT"]
[null,"Description","Audited Statutory Accounts","Adjustments","Distribution business","Standard Control Services","Alternative Control Services",null,null,null,null,"Negotiated Services"]
[null,null,null,null,null,null,"Public Lighting",null,"Other"]
[null,null,null,null,null,null,{"$f":"IF(dms_Jurisdiction=\"Vic\",\"Energy efficient\",\"\")","v":""},{"$f":"IF(dms_Jurisdiction=\"Vic\",\"Non-energy efficient\",\"\")","v":""},"Connection services","Metering services","Ancillary network services"]
[null,null,"$0's, nominal"]
[]
[null,"8.1.1.1 - REVENUE"]
[null,"Distribution revenue",1374500631.297987,0,1374500631.297987,1364877764.297987,9622867]
[null,"Cross boundary revenue",0,0,0,0,0]
[null,"Contributions",170756543,170756543,0,0,0]
[null,"Interest income",{"$f":"SUM(D16:E16)","v":171974.70699999997},1194.4505360935009,{"$f":"SUM(F16:G16,I16:K16)","v":170780.25646390647},165739.79302011887,2958.2886283707981,null,null,2021.6078154168031,60.567]
[null,"Jurisdictional scheme amounts",166159852.53201306,0,166159852.53201306,166159852.53201306,0]
[null,"Profit from sale of fixed assets",0,0,0,0,0]
[null,"TUOS revenue",271179476,0,271179476,271179476,0]
[null,"Pass through revenue (F-factor)",0,0,0,0,0]
[null,"Other Revenue ",{"$f":"D21+E21","v":66602619.396999992},53223488.736999996,{"$f":"SUM(F21+G21+I21+J21+K21)","v":13379130.659999998},13296972.659999998,82158,null,null,null,0]
[null,"Total revenue",{"$f":"SUM(C13:C21)","v":2049371096.9340003},223981226.18753609,1825389870.746464,1815679805.2830203,9707983.2886283714,0,0,2021.6078154168031,60.567,0]
[]
[null,"8.1.1.2 - EXPENDITURE"]
[null,"TUOS expenditure",298975470,0,298975470,298975470,0]
[null,"Avoided TUOS expenditure",2172414,0,2172414,2172414,0]
[null,"Cross boundary expenditure",0,0,0,0,0]
[null,"Depreciation ",352097320,6644514,345452806,315907387,14236402,null,null,10785087,4523930]
[null,"Finance charges",328666296,111287.4,{"$f":"SUM(F29)","v":328555008.60000002},{"$f":"C29-D29","v":328555008.60000002},0,null,null,0,0]
[null,"Impairment losses",32038267.84,7338286.9054700006,24699980.934530001,21479724.533810001,284220.77957000001,null,null,1849500.3241600001,1086535.2969900002]
[null,"Jurisdictional scheme amounts",162158312,0,162158312,162158312,0]
[null,"Loss from sale of fixed assets",3452687,-296107,3748794.0000000005,3387369,32168.999999999996,null,null,174628,154628]
[null,"Maintenance expenditure",{"$f":"SUM(D33:E33)","v":364507558.02589017},0,{"$f":"SUM(F33:G33,I33:K33)","v":364507558.02589017},352657271.1479612,11850286.877928946]
[null,"Operating expenditure excluding maintenance expenditure",{"$f":"SUM(D34:E34)","v":128850902.72553726},9167349.9148800634,{"$f":"SUM(F34:G34,I34:K34)","v":119683552.81065719},38642595.876006722,0,null,null,43938908.368230119,37102048.566420346]
[null,"Other ",{"$f":"D35+E35","v":-4773015.2459999993},0,{"$f":"SUM(F35:G35,I35:K35)","v":-4773015.2459999993},-4773015.2459999993,0]
[null,null,null,null,null,{"$f":"F31-F17","v":-4001540.5320130587}]
[null,"8.1.1.3 - PROFIT"]
[null,"Profit before tax (PBT)",{"$f":"C22-SUM(C25:C35)","v":381224884.58857274},201015894.96718603,180208989.62138653,296517268.37124252,-16695095.368870577,0,0,-56746102.084574707,-42867081.296410345,0]
[null,"Income tax expenses (/ benefit)",114926741.45400006,{"$f":"(dms_080101_03_audited_Values/$C$38)*D38","v":60599668.917128995},{"$f":"(dms_080101_03_audited_Values/$C$38)*E38","v":54327072.536871009},{"$f":"(dms_080101_03_audited_Values/$C$38)*F38","v":89390186.255878076},{"$f":"(dms_080101_03_audited_Values/$C$38)*G38","v":-5033021.1551609086},null,null,{"$f":"(dms_080101_03_audited_Values/$C$38)*J38","v":-17107080.010882631},{"$f":"(dms_080101_03_audited_Values/$C$38)*K38","v":-12923012.552963411}]
[null,"Profit after tax",{"$f":"C38-C39","v":266298143.13457268},140416226.05005705,125881917.08451551,207127082.11536443,-11662074.213709667,0,0,-39639022.073692076,-29944068.743446931,{"$f":"L38-L39","v":0}]

{"sheet":"8.2 Capex","index":20,"n_rows":251,"n_cols":10,"rows_kept":251,"cut":false,"hidden":false,"merged":[[62,1,65,1],[63,2,64,2],[52,2,52,5],[53,2,53,5],[54,2,54,5],[62,2,62,9],[63,6,63,9],[85,2,85,3],[45,2,45,5],[46,2,46,5],[47,2,47,5],[65,2,65,3],[57,2,57,5],[83,3,84,3],[63,4,64,4],[81,1,81,2],[58,2,58,5],[63,3,64,3],[63,5,64,5],[83,1,85,1],[83,2,84,2],[65,5,65,9],[48,2,48,5],[83,5,84,5],[43,2,43,5],[44,2,44,5],[55,2,55,5],[56,2,56,5],[50,2,50,5],[51,2,51,5],[49,2,49,5],[83,4,84,4],[6,1,6,4],[41,1,41,4],[10,1,10,4],[7,1,7,4],[8,1,8,4],[14,1,14,4],[16,1,19,1],[16,2,16,9],[17,2,18,2],[17,3,18,3],[17,4,18,4],[17,5,18,5],[17,6,17,9],[19,2,19,3],[19,5,19,9],[140,4,141,4],[197,4,198,4],[140,3,141,3],[140,2,141,2],[197,2,198,2],[197,1,199,1],[140,1,142,1],[197,3,198,3],[142,2,142,3],[199,2,199,3]]}
[null,{"$f":"(LOOKUP(dms_Model,dms_Model_List,dms_Worksheet_List))","v":"REGULATORY REPORTING STATEMENT"}]
[null,{"$f":"dms_TradingName","v":"Essential Energy"}]
[null,{"$f":"CONCATENATE(\"Annual Reporting RIN Response \",CRY)","v":"Annual Reporting RIN Response 2014-15"}]
[null,"8.2 - CAPEX"]
[]
[null,"Instructions"]
[null,"Reported expenditure must EXCLUDE capital contributions (except tables 8.2.1 and 8.2.5 which should include all capital contributions)."]
[null,{"$f":"CONCATENATE(\"Forecast expenditure is to be taken from \",dms_TradingName,\"'s \",dms_DeterminationRef,\".\")","v":"Forecast expenditure is to be taken from Essential Energy's 2014-19 Distribution Determination."}]
[null,"If allocating based on assumptions then provide method in Basis of Preparation. All adjustments must be explained in Basis of Preparation with supporting documentation attached. "]
[]
[null,"For tables 8.2.1 and 8.2.3:\nReported expenditure must INCLUDE any profit margins or management fees paid directly or indirectly to related party contractors (not including actual incurred expenses of the related party contractor) for the regulatory reporting period.\n\n'Related Party Margin Expenditure' must COMPRISE ONLY profit margins or management fees paid directly or indirectly to related party contractors (not including actual incurred expenses of the related party contractor) for the regulatory reporting period."]
[]
[null,"8.2.1 - CAPEX BY PURPOSE - STANDARD CONTROL SERVICES"]
[]
[null,"Each line item in this table must INCLUDE the capital contributions. Total capital contributions should also be identified in the last item in the table. "]
[]
[null,"Description","EXPENDITURE"]
[null,null,"CPI adjusted Forecast","Actual","Difference","Related Party Margin","Voltage level"]
[null,null,null,null,null,null,"Subtransmission","HV","LV","Other "]
[null,null,"$0's, nominal",null," (%)","$0's, nominal"]
[null,"Replacement expenditure",146568086.66036507,{"$f":"SUM(G21:J21)","v":152900919.09327412},{"$f":"IF(C21=0,1,(D21-C21)/C21*1)","v":4.3207444247967831E-2},null,38686409.032003172,88469671.073173776,19408643.65962686,6336195.3284702804]
[null,"Connections",101368028.80899301,{"$f":"SUM(G22:J22)","v":166439704.63908091},{"$f":"IF(C22=0,1,(D22-C22)/C22*1)","v":0.64193490388080798},null,35931990.532860801,45671332.733763359,35216741.067408681,49619640.305048078]
[null,"Augmentation Expenditure",137097872.96799925,121054119.75658146,-0.11702408552438047,null,40725105.402619019,56458631.374208994,19476120.071791045,4394262.9079623837]
[null,"Non-network",83225249.965686262,52925673.024407603,-0.36406711849794576,null,0,0,0,52925673.024407603]
[null,"capitalised network overheads",54924076.398766369,78934021.266094998,0.43714790382652496,null,22555572.829264235,42210728.61676877,11152077.67600093,3015642.1440610676]
[null,"capitalised corporate overheads",77892326.529159591,{"$f":"SUM(G26:J26)","v":51383153.776993081},-0.34033099193978494,null,14682850.925676491,27477636.69917044,7259593.6830227589,1963072.4691233858]
[null,null,null,0,1]
[null,null,null,0,1]
[null,null,null,0,1]
[null,null,null,{"$f":"SUM(G30:J30)","v":0},1]
[null,null,null,0,1]
[null,null,null,0,1]
[null,null,null,0,1]
[null,null,null,0,1]
[null,null,null,0,1]
[null,"Capital contributions included in the above",91350703.126159117,159526464.63908091,0.74630801055541118,null,35084767.132860802,40402616.133763358,34419441.067408681,49619640.305048078]
[null,"Total",{"$f":"SUM(C21:C35)","v":601075641.33096945},623637591.55643213,{"$f":"IF(C37=0,1,(D37-C37)/C37*1)","v":3.7535958328811098E-2},null,{"$f":"SUM(G21:G35)","v":152581928.72242373},{"$f":"SUM(H21:H35)","v":260288000.49708533},92513176.157850251,118254486.1790728]
[]
[]
[null,"8.2.2 - CAPEX BY PURPOSE - MATERIAL DIFFERENCE EXPLANATION"]
[]
[null,"Where the difference between forecast and actual expenditure shown in table 8.2.1 is a Material Difference please explain the main factors driving the difference."]
[]
[null,"Description","Reason for material difference"]
[null,{"$f":"B21","v":"Replacement expenditure"},"Augmentation capex is below forecast due to the difficulty in splitting projects into capex drivers. At times a project may have more than one driver; that is a project may deliver both augmentation and replacement capex benefits. This means that replacement capex will have an element of augmentation capex due to single projects addressing multiple drivers."]
[null,{"$f":"B22","v":"Connections"},"Connections capex is above forecast predominantly due to capital contributions. The higher capital contributions in 2014-15 is driven by the inclusion of a backlog of capital contributions relating to prior years."]
[null,{"$f":"B23","v":"Augmentation Expenditure"},"Not applicable."]
[null,{"$f":"B24","v":"Non-network"},"Non-network system capex is significantly below forecast due a deliberate decision to defer capital expenditure in response to the significant revenue reductions  outlined in the AER's final determination for the 2014-19 regulatory control period handed down in April 2015.   Despite the continued and ongoing removal of significant amounts of cost from the business, Essential Energy continues to experience negative cash flows and high levels of debt."]
[]
[]
[]
[]
[]
[]
[]
[]
[]
[]
[]
[]
[]
[null,"8.2.3 - CAPEX OTHER"]
[null,null,"EXPENDITURE"]
[null,null,"CPI adjusted Forecast","Actual","Difference","Related Party Margin","Voltage level"]
[null,null,null,null,null,null,"Subtransmission","HV","LV","Other "]
[null,null,"$0's, nominal",null," (%)","$0's, nominal"]
[null,"Public lighting"]
[null,{"$f":"IF(dms_Jurisdiction=\"Vic\",\"Energy Efficient\", \"Total\")","v":"Total"},null,{"$f":"SUM(G68:J68)","v":2826618.5043100398},{"$f":"IF(C68=0,1,((D68-C68)/C68)*1)","v":1},null,null,null,null,2826618.5043100398]
[null,{"$f":"IF(dms_Jurisdiction=\"Vic\",\"Non-energy efficient\", \"\")","v":""},null,{"$f":"SUM(G69:J69)","v":0},{"$f":"IF(C69=0,1,((D69-C69)/C69)*1)","v":1}]
[null,"Alternative Control Services"]
[null,"Connection services",null,{"$f":"SUM(G71:J71)","v":0},{"$f":"IF(C71=0,1,((D71-C71)/C71)*1)","v":1}]
[null,"Metering services",null,7001835.5669112373,{"$f":"IF(C72=0,1,((D72-C72)/C72)*1)","v":1},null,null,null,null,7001835.5669112373]
[null,"Ancillary network services",null,0,{"$f":"IF(C73=0,1,((D73-C73)/C73)*1)","v":1}]
[null,"Negotiated Services"]
[null,"Negotiated services",null,{"$f":"SUM(G75:J75)","v":0},{"$f":"IF(C75=0,1,((D75-C75)/C75)*1)","v":1},null,null,null,null,0]
[null,"Total",{"$f":"SUM(C68:C69,C71:C73,C75)","v":0},{"$f":"SUM(D68:D69,D71:D73,D75)","v":9828454.0712212771},{"$f":"IF(C76=0,1,((C76-#REF!)/#REF!)*1)","v":1},null,{"$f":"SUM(G68:G69,G71:G73,G75)","v":0},{"$f":"SUM(H68:H69,H71:H73,H75)","v":0},{"$f":"SUM(I68:I69,I71:I73,I75)","v":0},{"$f":"SUM(J68:J69,J71:J73,J75)","v":9828454.0712212771}]
[]
[]
[]
[null,"8.2.4 - CAPEX BY ASSET CLASS"]
[]
[null,{"$f":"CONCATENATE(dms_TradingName, \" to enter in Table 8.2.4 each Asset Class specified in its current determination as listed in the AER's final decision in its Roll Forward Model and Post-tax Revenue Model and enter information against that Asset Class.\")","v":"Essential Energy to enter in Table 8.2.4 each Asset Class specified in its current determination as listed in the AER's final decision in its Roll Forward Model and Post-tax Revenue Model and enter information against that Asset Class."}]
[]
[null,"Asset class","CPI adjusted Forecast","Actual ","Difference","Movements in provisions \nallocated to \nas-incurred capex"]
[]
[null,null,"$0's, nominal",null," (%)","$0's, nominal"]
[null,"Sub-transmission lines and cables",59676064.450994514,48190608.248547606,{"$f":"IF(C87=0,1,((D87-C87)/C87)*1)","v":-0.19246336547341639},-807315.8681683779]
[null,"Distribution lines and cables",204371594.76778635,192323669.00298446,{"$f":"IF(C88=0,1,((D88-C88)/C88)*1)","v":-5.8951077709654978E-2},-3221913.0542962519]
[null,"Substations",59676769.462576471,66122911.615520857,0.10801761239751402,-1107727.7863226389]
[null,"Transformers",50369286.103551202,16837876.697300203,-0.66571142853436083,-282077.47397342097]
[null,"Low voltage lines and cables",27065303.930365477,58415876.7206707,1.158330712670548,-978615.25188336952]
[null,"Customer metering and load control",6464267.8721459555,7178911.9731992101,0.11055298375437107,-120265.12556670948]
[null,"Communications",16945202.910786856,8530517.2611404322,-0.49658217101017205,-142907.96897776195]
[null,"Land",347204.47212957626,1037240.5007588947,1.987405359144677,-17376.429677971693]
[null,"Easements",1583994.2687877244,12547841.879324473,6.9216460100753334,-210208.42501508936]
[null,"IT systems",37851321.311516874,22160294.607719999,-0.41454369781861822]
[null,"Furniture, fittings, plant and equipment",5332628.3648927649,9775777.3105050996,0.83320056107110385]
[null,"Motor vehicles",25284827.264887672,16636201.0481,-0.34204806408931948]
[null,"Buildings",14756473.024388943,4353400.0580824995,-0.70498370099092356]
[null,null,null,null,1]
[null,null,null,null,1]
[null,null,null,null,1]
[null,null,null,null,1]
[null,null,null,null,1]
[null,null,null,null,1]
[null,null,null,null,1]
[null,null,null,null,1]
[null,null,null,null,1]
[null,null,null,null,1]
[null,null,null,null,1]
[null,null,null,null,1]
[null,null,null,null,1]
[null,null,null,null,1]
[null,null,null,null,1]
[null,null,null,null,1]
[null,null,null,null,1]
[null,null,null,null,{"$f":"IF(C117=0,1,((D117-C117)/C117)*1)","v":1}]
[null,null,null,null,1]
[null,null,null,null,1]
[null,null,null,null,1]
[null,null,null,null,1]
[null,null,null,null,1]
[null,null,null,null,1]
[null,null,null,null,1]
[null,null,null,null,1]
[null,null,null,null,1]
[null,null,null,null,1]
[null,null,null,null,1]
[null,null,null,null,1]
[null,null,null,null,1]
[null,null,null,null,1]
[null,null,null,null,1]
[null,null,null,null,1]
[null,null,null,null,1]
[null,null,null,null,1]
[null,null,null,null,1]
[null,"Total",{"$f":"SUM(C87:C136)","v":509724938.2048105},{"$f":"SUM(D87:D136)","v":464111126.92385441},-8.9487109344899646E-2,{"$f":"SUM(F87:F136)","v":-6888407.3838815922}]
[]
[]
[null,"8.2.5 - CAPITAL CONTRIBUTIONS BY ASSET CLASS"]
[null,"Asset class","CPI Adjusted Forecast","Actual","Difference"]
[]
[null,null,"$0's, nominal",null," (%)"]
[null,{"$f":"IF(ISBLANK(B87),\"\",B87)","v":"Sub-transmission lines and cables"},10607460.465698307,35084767.132860802,{"$f":"IF(C144=0,1,((D144-C144)/C144)*1)","v":2.3075557760800112}]
[null,"Distribution lines and cables",32563595.080238022,40402616.133763358,{"$f":"IF(C145=0,1,((D145-C145)/C145)*1)","v":0.24072959494213306}]
[null,"Substations",18774070.305647075,24966871.194505773,0.32985925737137345]
[null,"Transformers",11292798.314357167,24636900.862977006,1.1816471150161898]
[null,"Low voltage lines and cables",18110766.82311406,34419441.067408681,0.90049606422410022]
[null,"Customer metering and load control",0,12750.717565299999,1]
[null,"Communications",0,null,1]
[null,"Land",0,null,1]
[null,"Easements",2012.1371044933899,3117.5299999999997,0.54936261203976089]
[null,{"$f":"IF(ISBLANK(B96),\"\",B96)","v":"IT systems"},0,null,1]
[null,{"$f":"IF(ISBLANK(B97),\"\",B97)","v":"Furniture, fittings, plant and equipment"},0,null,1]
[null,"Motor vehicles",0,null,1]
[null,"Buildings",0,null,1]
[null,"",null,null,1]
[null,"",null,null,1]
[null,"",null,null,1]
[null,"",null,null,1]
[null,"",null,null,1]
[null,"",null,null,1]
[null,"",null,null,1]
[null,"",null,null,1]
[null,"",null,null,1]
[null,"",null,null,1]
[null,"",null,null,1]
[null,"",null,null,1]
[null,"",null,null,1]
[null,"",null,null,1]
[null,"",null,null,1]
[null,"",null,null,1]
[null,"",null,null,{"$f":"IF(C173=0,1,((D173-C173)/C173)*1)","v":1}]
[null,"",null,null,1]
[null,"",null,null,1]
[null,{"$f":"IF(ISBLANK(B119),\"\",B119)","v":""},null,null,1]
[null,"",null,null,1]
[null,"",null,null,1]
[null,"",null,null,1]
[null,"",null,null,1]
[null,"",null,null,1]
[null,"",null,null,1]
[null,"",null,null,{"$f":"IF(C183=0,1,((D183-C183)/C183)*1)","v":1}]
[null,"",null,null,1]
[null,"",null,null,1]
[null,"",null,null,1]
[null,"",null,null,1]
[null,"",null,null,1]
[null,"",null,null,1]
[null,"",null,null,1]
[null,"",null,null,1]
[null,"",null,null,1]
[null,"",null,null,1]
[null,"Total",{"$f":"SUM(C144:C193)","v":91350703.126159117},{"$f":"SUM(D144:D193)","v":159526464.63908091},0.74630801055541118]
[]
[]
[null,"8.2.6 - DISPOSALS BY ASSET CLASS"]
[null,"Asset class","CPI Adjusted Forecast","Actual","Difference"]
[]
[null,null,"$0's, nominal",null," (%)"]
[null,{"$f":"IF(ISBLANK(B87),\"\",B87)","v":"Sub-transmission lines and cables"},null,null,{"$f":"IF(C201=0,1,((D201-C201)/C201)*1)","v":1}]
[null,"Distribution lines and cables",null,null,{"$f":"IF(C202=0,1,((D202-C202)/C202)*1)","v":1}]
[null,"Substations",null,null,1]
[null,"Transformers",null,null,1]
[null,"Low voltage lines and cables",null,null,1]
[null,"Customer metering and load control",null,null,1]
[null,"Communications",null,null,1]
[null,"Land",null,347492.9790986412,1]
[null,"Easements",null,null,1]
[null,{"$f":"IF(ISBLANK(B96),\"\",B96)","v":"IT systems"},null,null,1]
[null,{"$f":"IF(ISBLANK(B97),\"\",B97)","v":"Furniture, fittings, plant and equipment"},null,36954.312610252666,1]
[null,"Motor vehicles",null,11716612.708291106,1]
[null,"Buildings",null,null,1]
[null,"",null,null,1]
[null,"",null,null,1]
[null,"",null,null,1]
[null,"",null,null,1]
[null,"",null,null,1]
[null,"",null,null,1]
[null,"",null,null,1]
[null,"",null,null,1]
[null,"",null,null,1]
[null,"",null,null,1]
[null,"",null,null,1]
[null,"",null,null,1]
[null,"",null,null,1]
[null,"",null,null,1]
[null,"",null,null,1]
[null,"",null,null,1]
[null,"",null,null,1]
[null,"",null,null,{"$f":"IF(C231=0,1,((D231-C231)/C231)*1)","v":1}]
[null,"",null,null,1]
[null,{"$f":"IF(ISBLANK(B119),\"\",B119)","v":""},null,null,1]
[null,"",null,null,1]
[null,"",null,null,1]
[null,"",null,null,1]
[null,"",null,null,1]
[null,"",null,null,1]
[null,"",null,null,1]
[null,"",null,null,1]
[null,"",null,null,1]
[null,"",null,null,1]
[null,"",null,null,1]
[null,"",null,null,1]
[null,"",null,null,1]
[null,"",null,null,1]
[null,"",null,null,1]
[null,"",null,null,1]
[null,"",null,null,1]
[null,"",null,null,1]
[null,"Total",{"$f":"SUM(C201:C250)","v":0},{"$f":"SUM(D201:D250)","v":12101060},1]

{"sheet":"8.4 Opex","index":21,"n_rows":144,"n_cols":14,"rows_kept":144,"cut":false,"hidden":false,"merged":[[140,2,143,7],[80,8,80,13],[78,6,79,6],[78,7,79,7],[80,2,80,4],[78,5,79,5],[19,2,19,6],[139,2,139,7],[137,1,137,4],[16,1,19,1],[77,5,77,7],[17,5,18,5],[17,6,18,6],[17,7,18,7],[16,5,16,7],[75,1,75,4],[77,1,80,1],[77,2,79,2],[77,3,79,3],[77,4,79,4],[16,13,18,13],[77,13,79,13],[19,8,19,13],[17,8,17,9],[78,8,78,9],[78,10,78,12],[17,10,17,12],[16,8,16,12],[77,8,77,12],[6,1,6,4],[14,1,14,5],[16,2,18,2],[16,3,18,3],[16,4,18,4],[12,1,12,5],[7,1,7,4],[13,1,13,5]]}
[null,{"$f":"(LOOKUP(dms_Model,dms_Model_List,dms_Worksheet_List))","v":"REGULATORY REPORTING STATEMENT"}]
[null,{"$f":"dms_TradingName","v":"Essential Energy"}]
[null,{"$f":"CONCATENATE(\"Annual Reporting RIN Response \",CRY)","v":"Annual Reporting RIN Response 2014-15"}]
[null,"8.4 OPEX"]
[]
[null,"Instructions"]
[null,{"$f":"CONCATENATE(\"Forecast expenditure is to be taken from \",dms_TradingName,\"'s \",dms_DeterminationRef,\".\")","v":"Forecast expenditure is to be taken from Essential Energy's 2014-19 Distribution Determination."}]
[null,"If allocating based on assumptions then provide method in Basis of Preparation.  \n\nAll adjustments must be explained in Basis of Preparation with supporting documentation attached. "]
[]
[null,"8.4.1 - OPERATING & MAINTENANCE EXPENDITURE - BY PURPOSE"]
[]
[]
[null,{"$f":"CONCATENATE(dms_TradingName,\" is to list the operating expenditure categories identified in \", dms_TradingName,\"'s regulatory proposal at table 3.2.1.1 current opex categories and cost allocations.\")","v":"Essential Energy is to list the operating expenditure categories identified in Essential Energy's regulatory proposal at table 3.2.1.1 current opex categories and cost allocations."}]
[null,{"$f":"CONCATENATE(dms_TradingName, \" must specify any expenditure category where the expense is more than 5 per cent of the total standard control services operating expenditure.\")","v":"Essential Energy must specify any expenditure category where the expense is more than 5 per cent of the total standard control services operating expenditure."}]
[null,"Reported operating expenditure must INCLUDE any profit margins or management fees paid directly or indirectly to related party contractors (not including actual incurred expenditure of the related party contractor) for the regulatory reporting period.  "]
[]
[null,"Opex category","Audited Statutory Accounts","Adjustments","Distribution business","Standard Control Services",null,null,"Alternative Control Services",null,null,null,null,"Negotiated Services"]
[null,null,null,null,null,"CPI Adjusted Forecast","Actual","Difference","Public Lighting",null,"Other"]
[null,null,null,null,null,null,null,null,{"$f":"IF(dms_Jurisdiction=\"Vic\",\"Energy efficient\",\"\")","v":""},{"$f":"IF(dms_Jurisdiction=\"Vic\",\"Non-energy efficient\",\"\")","v":""},"Connection services","Metering services","Ancillary network services"]
[null,null,"$0's, nominal",null,null,null,null,"%","$0's, nominal"]
[null,"Inspections",28291865.014261682,null,28291865.014261682,null,28291865.014261682,{"$f":"IF(F21=0,1,((G21-F21)/F21)*1)","v":1}]
[null,"Maintenance and repair",78584159.851637527,null,78584159.851637527,null,78584159.851637527,1]
[null,"Vegetation management",136821290.23099962,null,136821290.23099962,null,136821290.23099962,1]
[null,"Emergency response",62827846.020090498,null,62827846.020090498,null,62827846.020090498,1]
[null,"Other network costs",186833299.63222837,9167349.9148800634,177665949.71734831,null,84774705.906978577,1,11850286.877928946,null,null,43938908.368230119,37102048.566420346]
[null,null,null,null,null,null,null,1]
[null,null,null,null,null,null,null,1]
[null,null,null,null,null,null,null,1]
[null,null,null,null,null,null,null,1]
[null,null,null,null,null,null,null,1]
[null,null,null,null,null,null,null,1]
[null,null,null,null,null,null,null,1]
[null,null,null,null,null,null,null,1]
[null,null,null,null,null,null,null,1]
[null,null,null,null,null,null,null,1]
[null,null,null,null,null,null,null,{"$f":"IF(F36=0,1,((G36-F36)/F36)*1)","v":1}]
[null,null,null,null,null,null,null,1]
[null,null,null,null,null,null,null,1]
[null,null,null,null,null,null,null,1]
[null,null,null,null,null,null,null,1]
[null,null,null,null,null,null,null,1]
[null,null,null,null,null,null,null,{"$f":"IF(F42=0,1,((G42-F42)/F42)*1)","v":1}]
[null,null,null,null,null,null,null,1]
[null,null,null,null,null,null,null,1]
[null,null,null,null,null,null,null,1]
[null,null,null,null,null,null,null,1]
[null,null,null,null,null,null,null,1]
[null,null,null,null,null,null,null,1]
[null,null,null,null,null,null,null,1]
[null,null,null,null,null,null,null,1]
[null,null,null,null,null,null,null,1]
[null,null,null,null,null,null,null,1]
[null,null,null,null,null,null,null,1]
[null,null,null,null,null,null,null,1]
[null,null,null,null,null,null,null,1]
[null,null,null,null,null,null,null,1]
[null,null,null,null,null,null,null,1]
[null,null,null,null,null,null,null,1]
[null,null,null,null,null,null,null,1]
[null,null,null,null,null,null,null,1]
[null,null,null,null,null,null,null,1]
[null,null,null,null,null,null,null,1]
[null,null,null,null,null,null,null,1]
[null,null,null,null,null,null,null,1]
[null,null,null,null,null,null,null,1]
[null,null,null,null,null,null,null,1]
[null,null,null,null,null,null,null,1]
[null,null,null,null,null,null,null,1]
[null,null,null,null,null,null,null,1]
[null,null,null,null,null,null,null,1]
[null,"Total",{"$f":"SUM(C21:C70)","v":493358460.74921769},9167349.9148800634,484191110.83433759,324090385.40452957,391299867.02396786,0.20737881975593761,{"$f":"SUM(I21:I70)","v":11850286.877928946},0,0,43938908.368230119,37102048.566420346,0]
[]
[]
[null,"8.4.2 - OPERATING & MAINTENANCE EXPENDITURE - BY PURPOSE - MARGINS ONLY"]
[]
[null,"\"Related party margin expenditure' must COMPRISE ONLY profit margins or management fees paid directly or indirectly to related party contractors (for expenditure that is not an actual incurred expenditure of the related party contractor) for the regulatory reporting period."]
[]
[null,"Opex category","Audited Statutory Accounts","Adjustments","Distribution business","Standard Control Services",null,null,"Alternative Control Services",null,null,null,null,"Negotiated Services"]
[null,null,null,null,null,"CPI Adjusted Forecast","Actual","Difference","Public Lighting",null,"Other"]
[null,null,null,null,null,null,null,null,{"$f":"IF(dms_Jurisdiction=\"Vic\",\"Energy efficient\",\"\")","v":""},{"$f":"IF(dms_Jurisdiction=\"Vic\",\"Non-energy efficient\",\"\")","v":""},"Connection services","Metering services","Ancillary network services"]
[null,null,"$0's, nominal",null,null,null,"$0's, nominal","per cent","$0's, nominal"]
[null,{"$f":"IF(ISBLANK(B21),\"\",B21)","v":"Inspections"},null,null,null,null,null,{"$f":"IF(F82=0,1,((G82-F82)/F82)*1)","v":1}]
[null,"Maintenance and repair",null,null,null,null,null,1]
[null,"Vegetation management",null,null,null,null,null,1]
[null,{"$f":"IF(ISBLANK(B24),\"\",B24)","v":"Emergency response"},null,null,null,null,null,1]
[null,{"$f":"IF(ISBLANK(B25),\"\",B25)","v":"Other network costs"},null,null,null,null,null,1]
[null,"",null,null,null,null,null,1]
[null,"",null,null,null,null,null,1]
[null,{"$f":"IF(ISBLANK(B27),\"\",B27)","v":""},null,null,null,null,null,{"$f":"IF(F89=0,1,((G89-F89)/F89)*1)","v":1}]
[null,"",null,null,null,null,null,1]
[null,"",null,null,null,null,null,1]
[null,"",null,null,null,null,null,1]
[null,"",null,null,null,null,null,1]
[null,"",null,null,null,null,null,1]
[null,"",null,null,null,null,null,1]
[null,"",null,null,null,null,null,1]
[null,"",null,null,null,null,null,1]
[null,"",null,null,null,null,null,{"$f":"IF(F98=0,1,((G98-F98)/F98)*1)","v":1}]
[null,"",null,null,null,null,null,1]
[null,"",null,null,null,null,null,1]
[null,"",null,null,null,null,null,1]
[null,"",null,null,null,null,null,1]
[null,"",null,null,null,null,null,1]
[null,"",null,null,null,null,null,{"$f":"IF(F104=0,1,((G104-F104)/F104)*1)","v":1}]
[null,"",null,null,null,null,null,1]
[null,"",null,null,null,null,null,1]
[null,"",null,null,null,null,null,1]
[null,"",null,null,null,null,null,1]
[null,"",null,null,null,null,null,1]
[null,"",null,null,null,null,null,1]
[null,"",null,null,null,null,null,1]
[null,"",null,null,null,null,null,1]
[null,"",null,null,null,null,null,1]
[null,"",null,null,null,null,null,1]
[null,"",null,null,null,null,null,1]
[null,"",null,null,null,null,null,1]
[null,"",null,null,null,null,null,1]
[null,"",null,null,null,null,null,1]
[null,"",null,null,null,null,null,1]
[null,"",null,null,null,null,null,1]
[null,"",null,null,null,null,null,1]
[null,"",null,null,null,null,null,1]
[null,"",null,null,null,null,null,1]
[null,"",null,null,null,null,null,1]
[null,"",null,null,null,null,null,1]
[null,"",null,null,null,null,null,1]
[null,"",null,null,null,null,null,1]
[null,"",null,null,null,null,null,1]
[null,"",null,null,null,null,null,1]
[null,"",null,null,null,null,null,1]
[null,"",null,null,null,null,null,1]
[null,null,null,null,null,null,null,1]
[null,"Total",{"$f":"SUM(C82:C132)","v":0},{"$f":"SUM(D82:D132)","v":0},{"$f":"SUM(E82:E132)","v":0},{"$f":"SUM(F82:F132)","v":0},{"$f":"SUM(G82:G132)","v":0},1,{"$f":"SUM(I82:I132)","v":0},{"$f":"SUM(J82:J132)","v":0},0,0,{"$f":"SUM(M82:M132)","v":0},{"$f":"SUM(N82:N132)","v":0}]
[]
[]
[null,"8.4.3 - OPERATING & MAINTENANCE EXPENDITURE - EXPLANATION OF MATERIAL DIFFERENCE"]
[]
[null,"Where the difference between forecast and actual expenditure shown in table 8.4.1, column I is a Material Difference please explain the main factors driving the difference."]
[]
[null,"Category","Explanation"]
[null,{"$f":"B21","v":"Inspections"},"The Australian Energy Regulator's (AER) final determination for the 2014-19 regulatory control period handed down in April 2015 delivered unsustainable revenue reductions. A key driver of these reductions was unprecedented and retrospective reductions to operating cost allowances. In its final determination, where the AER provided a total operating cost allowance,  it did not provide individual category forecasts. Essential Energy's operating costs for 2014-15 were 21% above the AER's total opex allowance.   The AER’s final decision to cut average prices by approximately 25% from 1 July 2015, places Essential Energy in an extremely difficult financial position. Despite the continued and ongoing removal of significant amounts of cost from the business, Essential Energy continues to experience negative cash flows and high levels of debt."]
[null,{"$f":"B22","v":"Maintenance and repair"}]
[null,{"$f":"B23","v":"Vegetation management"}]
[null,{"$f":"B24","v":"Emergency response"}]

{"sheet":"9.5 TUoS","index":22,"n_rows":60,"n_cols":6,"rows_kept":60,"cut":false,"hidden":false,"merged":[[5,1,5,3],[21,1,21,3],[24,2,24,5],[36,1,36,4],[25,2,25,5],[24,1,27,1],[9,1,9,4],[10,1,10,4],[11,1,11,4],[12,1,12,4],[17,1,17,4],[18,1,18,4],[13,1,13,3],[50,1,50,4],[54,1,54,4],[52,1,52,4],[55,1,55,4],[56,1,56,4],[57,1,57,4],[51,1,51,4],[19,1,19,4],[20,1,20,4],[59,1,59,4],[53,1,53,4],[48,1,48,4],[58,1,58,4],[40,1,40,4],[44,1,44,4],[45,1,45,4],[46,1,46,4],[47,1,47,4],[41,1,41,4],[42,1,42,4],[43,1,43,4]]}
[null,{"$f":"(LOOKUP(dms_Model,dms_Model_List,dms_Worksheet_List))","v":"REGULATORY REPORTING STATEMENT"}]
[null,{"$f":"dms_TradingName","v":"Essential Energy"}]
[null,{"$f":"CONCATENATE(\"Annual Reporting RIN Response \",CRY)","v":"Annual Reporting RIN Response 2014-15"}]
[null,"9.5 - TUoS AUDIT (t-2)"]
[]
[null,"This template collects information for annual pricing proposals from Victorian businesses only.\n"]
[]
[null,"9.5.1 - TUOS CHARGES (AEMO)"]
[null,null,null,null,null,{"$f":"CRY","v":"2014-15"}]
[]
[]
[]
[]
[null,null,null,null,"Total",{"$f":"SUM(F10:F13)","v":0}]
[]
[null,"9.5.2 - TRANSMISSION CONNECTION FEES"]
[null,null,null,null,null,{"$f":"CRY","v":"2014-15"}]
[]
[]
[]
[]
[null,null,null,null,"Total",{"$f":"SUM(F18:F21)","v":0}]
[]
[null,"9.5.3 - CROSS BOUNDARY NETWORK CHARGES"]
[null,"Distribution Business","Amount (payable)/receivable"]
[null,null,"$0's, nominal"]
[null,null,"HV crossings","Subtransmission crossings","TUoS Adjustment","Total"]
[null,null,null,null,null,{"$f":"CRY","v":"2014-15"}]
[null,null,null,null,null,{"$f":"IF((SUM(C29:E29)=0),\"\",(SUM(C29:E29)))","v":""}]
[null,null,null,null,null,{"$f":"IF((SUM(C30:E30)=0),\"\",(SUM(C30:E30)))","v":""}]
[null,null,null,null,null,""]
[null,null,null,null,null,""]
[null,null,null,null,null,""]
[null,null,null,null,null,""]
[null,null,null,null,null,""]
[null,null,null,null,null,""]
[null,"Total",null,null,null,""]
[]
[null,"9.5.4 - PAYMENTS TO EMBEDDED GENERATORS"]
[null,"9.5.4.1 - AVOIDED TRANSMISSION COSTS",null,null,null,{"$f":"CRY","v":"2014-15"}]
[]
[]
[]
[]
[]
[]
[]
[]
[null,"Total",null,null,null,{"$f":"SUM(F41:F48)","v":0}]
[null,"9.5.4.2 - AVOIDED TUoS USAGE CHARGES",null,null,null,{"$f":"CRY","v":"2014-15"}]
[]
[]
[]
[]
[]
[]
[]
[]
[null,"Total",null,null,null,{"$f":"SUM(F51:F58)","v":0}]
[null,"Total payments to embedded generators",null,null,null,{"$f":"F59+F49","v":0}]