{"text_format":"1","workbook":"xlsx","n_sheets":23,"sheets":["AER only","Instructions","Contents","Business & other details","2.11 Labour","3.6 Quality of services","3.6.8 Network-feeders","3.6.9 Network-reliability","4.1 Public lighting","6.2 STPIS Reliability","6.6 STPIS Customer Service","6.7 STPIS Daily Performance","6.8 STPIS Exclusions","6.9 STPIS - GSL","7.8 Avoided TUOS Payments","7.10 Juris Scheme","7.11 DMIS-DMIA","7.12 Safety and Bushfire","7.13 TARC","8.1 Income","8.2 Capex","8.4 Opex","9.5 TUoS"],"not_rendered":{"charts":0,"images":12,"macros":1,"external_links":1,"defined_names":575,"comments":3,"pivot_tables":0},"unopened":[],"bounds":{"document_bytes":16777216,"sheet_cells":100000,"rows_first":2000,"rows_last":500,"rows_between":2000,"halvings":0,"cell_chars":16384,"cell_head_chars":4096},"cells_cut":0,"cells_raw":0,"read":"whole","date_system":"1900"}

{"sheet":"AER only","index":0,"n_rows":149,"n_cols":39,"rows_kept":149,"cut":false,"hidden":true,"merged":[[54,35,56,35],[0,1,0,11],[4,27,4,37],[5,27,5,30],[5,33,5,37],[52,24,52,28],[52,29,52,32],[53,1,53,5],[53,14,53,21],[53,24,53,28],[53,29,53,32],[54,2,54,3],[57,35,61,35],[65,35,66,35],[71,14,71,15],[71,24,71,27],[109,1,109,8]]}
[null,"Data in these columns used for data validation and database purposes."]
[null,"Date last modified:","2017-01-16","added (Albury and Victora) for AGN"]
[null,null,"2016-10-17","updated TransGrid's correct legal name, corrected TasNetworks (T) to June financial year"]
[null,null,"2017-02-01","inserted Power and Water, added NRs (dms_FeederCat_1 and dms_FeederCat_2)"]
[null,null,"2017-03-03","inserted AEMO as a business",null,null,null,null,null,null,null,null,null,null,null,null,null,null,null,null,null,null,null,null,null,null,null,"FOR ELECTRICITY BUSINESSES ONLY"]
[null,null,null,null,null,null,null,null,null,null,null,null,null,null,null,null,null,null,null,null,null,null,null,null,null,null,null,"Feeder Types",null,null,null,"TasNetworks (D)","MAIFI flag","Feeder Names"]
[null,null,null,null,null,null,null,null,null,null,null,null,null,null,null,null,null,null,null,null,null,null,null,null,null,null,null,"CBD","Urban","Short rural","long rural","EXTRA"]
[null,"dms_TradingName_List","dms_TradingNameFull_List","dms_ABN_List","dms_JurisdictionList","dms_Sector_List","dms_Segment_List","dms_FormControl_List","dms_RPT_List","dms_RPTMonth_List","dms_CRCPlength_List","dms_FRCPlength_List","dms_663_List","dms_DeterminationRef_List","dms_Addr1_List","dms_Addr2_List","dms_Suburb_List","dms_State_List","dms_PostCode_List","dms_PAddr1_List","dms_PAddr2_List","dms_PSuburb_List","dms_PState_List","dms_PPostCode_List","dms_ContactName1_List","dms_ContactPh1_List","dms_ContactEmail_List","dms_CBD_flag","dms_Urban_flag","dms_ShortRural_flag","dms_LongRural_flag","dms_FeederType_5_flag","dms_MAIFI_flag_List","dms_FeederName_1","dms_FeederName_2","dms_FeederName_3","dms_FeederName_4","dms_FeederName_5","Column1"]
[null,"ActewAGL Distribution","ActewAGL Distribution",76670568688,"ACT","Electricity","Distribution","Revenue cap","Financial","June",5,5,5,"2014-19 Distribution Determination","40 Bunda Street",null,"CANBERRA","ACT","2600","GPO BOX 366",null,"CANBERRA","ACT",2601,"Robert Walker","02 6248 3847","robert.walker@actewagle.com.au","NO","YES","YES","NO","NO",null,"CBD","Urban","Short rural","Long rural",null,"ActewAGL Distribution"]
[null,"ActewAGL Distribution (Tx Assets)","ActewAGL Distribution (Tx Assets)",76670568688,"ACT","Electricity","Distribution","Revenue cap","Financial","June",5,5,5,"distribution determination","40 Bunda Street",null,"CANBERRA","ACT","2600","GPO BOX 366",null,"CANBERRA","ACT",2601,"Robert Walker","02 6248 3847","robert.walker@actewagle.com.au",null,null,null,null,null,null,"CBD","Urban","Short rural","Long rural",null,"ActewAGL Distribution (Tx Assets)"]
[null,"ActewAGL Gas","ActewAGL Gas",76670568688,"ACT","Gas","Distribution","Weighted average price cap","Financial","June",5,5,"x",null,"40 Bunda Street",null,"CANBERRA","ACT","2600","GPO BOX 366",null,"CANBERRA","ACT",2601,"Philip Deamer","02 6248 3438","GasAAReview@actewagl.com.au",null,null,null,null,null,null,null,null,null,null,null,"ActewAGL Gas"]
[null,"AEMO","Australian Energy Market Operator Ltd",94072010327,"Vic","Electricity","Transmission","-","Financial","March",5,5,"x","-","Level 22","530 Collins Street","MELBOURNE","VIC","3000","GPO Box 2008",null,"MELBOURNE","VIC","3001",null,null,null,null,null,null,null,null,null,null,null,null,null,null,"AEMO"]
[null,"AGN (Albury and Victoria)","Australian Gas Networks Limited (reporting data for Albury and Victoria)",19078551685,"Vic","Gas","Distribution","Weighted average price cap","Calendar","December",5,5,"x",null,"Level 6","400 King William Street","ADELAIDE","SA","5000","PO Box 6468","Halifax Street","ADELAIDE","SA","5000","Craig de Laine","08 8418 1129 ","craig.delaine@agn.com.au",null,null,null,null,null,null,"CBD","Urban","Short rural","Long rural",null,"AGN (Albury)"]
[null,"AGN (Albury)","Australian Gas Networks Limited (reporting data for Albury)",19078551685,"Vic","Gas","Distribution","Weighted average price cap","Calendar","December",5,5,"x",null,"Level 6","400 King William Street","ADELAIDE","SA","5000","PO Box 6468","Halifax Street","ADELAIDE","SA","5000","Craig de Laine","08 8418 1129 ","craig.delaine@agn.com.au",null,null,null,null,null,null,"CBD","Urban","Short rural","Long rural"]
[null,"AGN (SA)","Australian Gas Networks Limited (reporting data for SA)",19078551685,"SA","Gas","Distribution","Weighted average price cap","Financial","June",5,5,5,"distribution determination","Level 6","400 King William Street","ADELAIDE","SA","5000","PO Box 6468","Halifax Street","ADELAIDE","SA","5000","Craig de Laine","08 8418 1129 ","craig.delaine@agn.com.au",null,null,null,null,null,null,null,null,null,null,null,"AGN (SA)"]
[null,"AGN (Victoria)","Australian Gas Networks Limited (reporting data for Victoria)",19078551685,"Vic","Gas","Distribution","Weighted average price cap","Calendar","December",5,5,"x",null,"Level 6","400 King William Street","ADELAIDE","SA","5000","PO Box 6468","Halifax Street","ADELAIDE","SA","5000","Craig de Laine","08 8418 1129 ","craig.delaine@agn.com.au",null,null,null,null,null,null,null,null,null,null,null,"AGN (Victoria)"]
[null,"Amadeus","APT Pipelines (NT) Pty Ltd",39009737393,"NT","Gas","Transmission","Weighted average price cap","Financial","June",5,5,"x","n/a","Level 19, HSBC Building","580 George Street","SYDNEY","NSW","2000","Level 19, HSBC Building","580 George Street","SYDNEY","NSW","2000","Alexandra Curran","02 9275 0020","alexandra.curran@apa.com.au",null,null,null,null,null,null,null,null,null,null,null,"Amadeus"]
[null,"APA GasNet","APA GasNet Australia (Operations) Pty Ltd","065083009","Vic","Gas","Transmission","Weighted average price cap","Calendar","December",5,5,"x",null,"Level 19, HSBC Building","580 George Street","SYDNEY","NSW","2000","PO Box R41",null,"ROYAL EXCHANGE","NSW","1225","Alexandra Curran","02 9275 0020","alexandra.curran@apa.com.au",null,null,null,null,null,null,null,null,null,null,null,"APA GasNet"]
[null,"Ausgrid","Ausgrid",78508211731,"NSW","Electricity","Distribution","Revenue cap","Financial","June",5,5,5,"2014-19 Distribution Determination","570 George St",null,"SYDNEY","NSW",2000,"GPO Box 4009",null,"SYDNEY","NSW","2001","John Thomson","(02) 9269 2312","john.thomson@ausgrid.com.au","YES","YES","YES","YES","NO",null,"CBD","Urban","Short rural","Long rural",null,"Ausgrid"]
[null,"Ausgrid (Tx Assets)","Ausgrid (Tx Assets)",67505337385,"NSW","Electricity","Distribution","Revenue cap","Financial","June",5,5,5,"distribution determination","570 George St",null,"SYDNEY","NSW",2000,"GPO Box 4009",null,"SYDNEY","NSW","2001","John Thomson","(02) 9269 2312","john.thomson@ausgrid.com.au",null,null,null,null,null,null,"CBD","Urban","Short rural","Long rural",null,"Ausgrid (Tx Assets)"]
[null,"AusNet (D)","AusNet Electricity Services Pty Ltd",91064651118,"Vic","Electricity","Distribution","Revenue cap","Calendar","December",5,5,2,"2016-20 Distribution Determination","Level 32","2 Southbank Boulevard","SOUTHBANK","Vic","3006","Locked Bag 14051",null,"MELBOURNE CITY MAIL CENTRE","VIC",8001,null,null,null,null,"YES","YES","YES","NO",null,"CBD","Urban","Short rural","Long rural",null,"AusNet (D)"]
[null,"AusNet (Gas)","AusNet Gas Services","086015036","Vic","Gas","Distribution","Weighted average price cap","Calendar","December",5,5,"X",null,"Level 19, HSBC Building","580 George Street","SYDNEY","NSW","2000","PO Box R41",null,"ROYAL EXCHANGE","NSW","1225","Alexandra Curran","02 9275 0020","alexandra.curran@apa.com.au",null,null,null,null,null,null,null,null,null,null,null,"AusNet (Gas)"]
[null,"AusNet (T)","Ausnet Services (Transmission) Ltd",48116124362,"Vic","Electricity","Transmission","Revenue cap","Financial","March",5,5,2,"transmission determination","Level 32","2 Southbank Boulevard","SOUTHBANK","Vic","3006","Locked Bag 14051",null,"MELBOURNE CITY MAIL CENTRE","Vic","8001","Clare Thompson","03 9695 6670","clare.e.thompson@ausnetservices.com.au",null,null,null,null,null,null,"CBD","Urban","Short rural","Long rural",null,"AusNet (T)"]
[null,"Australian Distribution Co.","Australian Distribution Co.",11222333444,"-","Electricity","Distribution","Revenue cap","Financial","June",5,5,2,"distribution determination","123 Straight Street",null,"SYDNEY","NSW","2000","PO Box 123",null,"SYDNEY","NSW",2000,"Bob Smith","02 1234 5678","bob@auselec.net.au",null,null,null,null,null,null,"CBD","Urban","Short rural","Long rural",null,"Australian Distribution Co."]
[null,"Australian Distribution Co. (Vic)","Australian Distribution Co. (Victoria)",11222333444,"Vic","Electricity","Distribution","Revenue cap","Calendar","December",5,5,2,"distribution determination","123 Straight Street",null,"MELBOURNE","Vic","3000","PO Box 123",null,"MELBOURNE","VIC","3000","Bob Smith","02 1234 5678","bob@auselec.net.au",null,null,null,null,null,null,"CBD","Urban","Short rural","Long rural",null,"Australian Distribution Co. (Vic)"]
[null,"Australian Transmission Co.","Australian Transmission Co.",11222333444,"-","Electricity","Transmission","Revenue cap","Financial","June",5,5,5,"transmission determination","123 Straight Street",null,"SYDNEY","NSW","2000","PO Box 123",null,"SYDNEY","NSW",2000,"Bob Smith","02 1234 5678","bob@auselec.net.au",null,null,null,null,null,null,"CBD","Urban","Short rural","Long rural",null,"Australian Transmission Co."]
[null,"Central Ranges Pipeline (D)","Central Ranges Pipeline Pty Ltd",108218355,"NSW","Gas","Distribution","Weighted average price cap","Financial","June",15,5,5,"distribution determination","Level 19","580 George Street","SYDNEY","NSW","2000","PO Box R41",null,"ROYAL EXCHANGE","NSW","1225","Scott Young","02 9275 0031","scott.young@apa.com.au"]
[null,"Central Ranges Pipeline (T)","Central Ranges Pipeline Pty Ltd",108218355,"NSW","Gas","Distribution","Weighted average price cap","Financial","June",14,5,5,"transmission determination","Level 19","580 George Street","SYDNEY","NSW","2000","PO Box R41",null,"ROYAL EXCHANGE","NSW","1225","Scott Young","02 9275 0031","scott.young@apa.com.au"]
[null,"CitiPower","CitiPower",76064651056,"Vic","Electricity","Distribution","Revenue cap","Calendar","December",5,5,2,"2016-20 Distribution Determination","40 Market Street",null,"MELBOURNE","Vic","3000","Locked Bag 14090",null,"MELBOURNE","VIC",8001,"Hannah Williams","03 9683 4088","hwilliams@powercor.com.au","YES","YES","NO","NO","NO",null,"CBD","Urban","Short rural","Long rural",null,"CitiPower"]
[null,"Directlink","Directlink",16779340889,"Qld","Electricity","Transmission","Revenue cap","Financial","June",9,5,5,"transmission determination","Level 19, HSBC Building","580 George Street","SYDNEY","NSW","2000","PO Box R41",null,"ROYAL EXCHANGE","NSW","1225","Scott Young","02 9275 0031","scott.young@apa.com.au",null,null,null,null,null,null,"CBD","Urban","Short rural","Long rural",null,"Directlink"]
[null,"ElectraNet","ElectraNet",41094482416,"SA","Electricity","Transmission","Revenue cap","Financial","June",5,5,5,"transmission determination","52-55 East Terrace","Rymill Park","ADELAIDE","SA","5000","PO Box 7096","Hutt Street Post Office","ADELAIDE","SA",5000,"Bill Jackson","08 8404 7969","jackson.bill@electranet.com.au",null,null,null,null,null,null,"CBD","Urban","Short rural","Long rural",null,"ElectraNet"]
[null,"Endeavour Energy","Endeavour Energy",11247365823,"NSW","Electricity","Distribution","Revenue cap","Financial","June",5,5,5,"2014-19 Distribution Determination","51 Huntingwood Drive",null,"HUNTINGWOOD","NSW","2148","PO Box 811",null,"SEVEN HILLS","NSW","1730","Jon Hocking","02 9853 4386 / 0407 348 156","Jon.Hocking@Endeavourenergy.com.au","NO","YES","YES","YES","NO",null,"CBD","Urban","Short rural","Long rural",null,"Endeavour Energy"]
[null,"Energex","Energex",40078849055,"Qld","Electricity","Distribution","Revenue cap","Financial","June",5,5,5,"2015-20 Distribution Determination","26 Reddacliff Street",null,"NEWSTEAD","Qld","4006","26 Reddacliff Street",null,"NEWSTEAD","QLD","4006","Nicola Roscoe","07 3664 5891","nicolaroscoe@energex.com.au","YES","YES","YES","NO","NO",null,"CBD","Urban","Short rural","Long rural",null,"Energex"]
[null,"Ergon Energy","Ergon Energy",50087646062,"Qld","Electricity","Distribution","Revenue cap","Financial","June",5,5,5,"2015-20 Distribution Determination","22 Walker Street",null,"TOWNSVILLE","Qld","4810","Po Box 264",null,"FORTITUDE VALLEY","QLD",4006,"Jenny Doyle, Group Manager Regulatory Affairs","(07) 3851 6416","jenny.doyle@ergon.com.au","NO","YES","YES","YES","NO",null,"CBD","Urban","Short rural","Long rural",null,"Ergon Energy"]
[null,"Essential Energy","Essential Energy",37428185226,"NSW","Electricity","Distribution","Revenue cap","Financial","June",5,5,5,"2014-19 Distribution Determination","8 Buller Street",null,"PORT MACQUARIE","NSW","2444","PO Box 5730",null,"PORT MACQUARIE","NSW","2444","Catherine Waddell","02 6338 3553","catherine.waddell@essentialenergy.com.au",null,null,"YES","YES","NO",null,"CBD","Urban","Short rural","Long rural",null,"Essential Energy"]
[null,"Jemena Electricity","Jemena Electricity",82064651083,"Vic","Electricity","Distribution","Revenue cap","Calendar","December",5,5,2,"2016-20 Distribution Determination","Level 16","567 Collins Street","MELBOURNE","VIC","3000","PO Box 16182",null,"MELBOURNE","VIC",8001,"Matthew Serpell","03 9173 8231","matthew.serpell@jemena.com.au",null,null,"YES","NO","NO",null,"CBD","Urban","Short rural","Long rural",null,"Jemena Electricity"]
[null,"JGN","Jemena Gas Networks (NSW) Ltd","003 004 322","NSW","Gas","Distribution","Weighted average price cap","Financial","June",5,5,null,null,null,null,null,null,null,null,null,null,null,null,null,null,null,null,null,null,null,null,null,null,null,null,null,null,"JGN"]
[null,"Multinet Gas","Multinet Gas (DB No.1) Pty Ltd (ACN 086 026 986), Multinet Gas (DB No.2) Pty Ltd (ACN 086 230 122)","086026986","Vic","Gas","Distribution","Weighted average price cap","Calendar","December",5,5,"x",null,"43-45 Centreway",null,"MT WAVERLEY","Vic","3149",null,null,null,null,null,"Andrew Schille","03 8846 9860","andrew.schille@ue.com.au",null,null,null,null,null,null,null,null,null,null,null,"Multinet Gas"]
[null,"Murraylink","Murraylink",79181207909,"SA","Electricity","Transmission","Revenue cap","Financial","June",5,5,5,"transmission determination","Level 19","580 George Street","SYDNEY","NSW","2000","PO Box R41",null,"ROYAL EXCHANGE","NSW","1225","Scott Young","02 9275 0031","scott.young@apa.com.au",null,null,null,null,null,null,"CBD","Urban","Short rural","Long rural",null,"Murraylink"]
[null,"Power and Water","Power and Water Corporation",15947352360,"NT","Electricity","Distribution","Revenue cap","Financial","June",5,5,"x","distribution determination","GPO Box 1921",null,"DARWIN","NT","0801","GPO Box 1921",null,"DARWIN","NT","0801","Jodi Triggs","08 8985 8456","jodi.triggs@powerwater.com.au","YES","YES","YES","YES","NO"]
[null,"Powercor Australia","Powercor Australia",89064651109,"Vic","Electricity","Distribution","Revenue cap","Calendar","December",5,5,2,"2016-20 Distribution Determination","40 Market Street",null,"MELBOURNE","Vic","3000","Locked bag 14090",null,"MELBOURNE","VIC",8001,"Hannah Williams","03 9683 4088","hwilliams@powercor.com.au",null,null,"YES","YES","NO",null,"CBD","Urban","Short rural","Long rural",null,"Powercor Australia"]
[null,"Powerlink","Queensland Electricity Transmission Corporation Limited trading as Powerlink Queensland",82078849233,"Qld","Electricity","Transmission","Revenue cap","Financial","June",5,5,5,"transmission determination","33 Harold St",null,"VIRGINIA","Qld","4014","PO Box 1193",null,"VIRGINIA","QLD",4014,"Jennifer Harris","07 3860 2667","jharris@powerlink.com.au",null,null,null,null,null,null,"CBD","Urban","Short rural","Long rural",null,"Powerlink"]
[null,"Roma to Brisbane Pipeline","APT Petroleum Pipelines Limited t/a Roma to Brisbane Pipeline","009 737 393","Qld","Gas","Transmission","Weighted average price cap","Financial","June",5,5,"x","n/a","580 George Street",null,"SYDNEY","NSW","2000","PO Box R41",null,"ROYAL EXCHANGE","NSW","1225","Mark Allen","02 9275 0010","mark.allen@apa.com.au",null,null,null,null,null,null,"CBD","Urban","Short rural","Long rural",null,"Roma to Brisbane Pipeline"]
[null,"SA Power Networks","SA Power Networks",13332330749,"SA","Electricity","Distribution","Revenue cap","Financial","June",5,5,5,"2015-20 Distribution Determination","1 Anzac Highway",null,"KESWICK","SA","5035","GPO Box 77",null,"ADELAIDE","SA","5000","Richard Sibly","08 8404 5613","richard.sibly@sapowernetworks.com.au",null,null,"YES","YES","NO",null,"CBD","Urban","Short rural","Long rural",null,"SA Power Networks"]
[null,"TasNetworks (D)","TasNetworks (D)",24167357299,"Tas","Electricity","Distribution","Revenue cap","Financial","June",5,5,5,"distribution determination","1-7 Maria Street",null,"LENAH VALLEY","Tas","7008","PO Box 606",null,"MOONAH","Tas","7009","John Sayers","03 6271 6469","john.sayers@tasnetworks.com.au",null,null,"YES","YES","YES",null,"Critical Infrastructure","High density commercial","Urban","High density rural","Low density rural","TasNetworks (D)"]
[null,"TasNetworks (T)","TasNetworks (T)",24167357299,"Tas","Electricity","Transmission","Revenue cap","Financial","June",5,5,5,"transmission determination","1-7 Maria Street",null,"LENAH VALLEY","Tas","7008","PO Box 606",null,"MOONAH","Tas","7009","John Sayers","03 6271 6469","john.sayers@tasnetworks.com.au",null,null,null,null,null,null,"CBD","Urban","Short rural","Long rural",null,"TasNetworks (T)"]
[null,"TransGrid","NSW Electricity Networks Operations Pty Ltd trading as TransGrid",609169959,"NSW","Electricity","Transmission","Revenue cap","Financial","June",5,4,5,"transmission determination","180 Thomas Street",null,"SYDNEY","NSW","2000","PO Box A1000",null,"SYDNEY SOUTH","NSW","1235","Garrie Chubb","0408 210 221","garrie.chubb@transgrid.com.au",null,null,null,null,null,null,"CBD","Urban","Short rural","Long rural",null,"TransGrid"]
[null,"United Energy","United Energy",70064651029,"Vic","Electricity","Distribution","Revenue cap","Calendar","December",5,5,2,"2016-20 Distribution Determination","Level 3","6 Nexus Court","MULGRAVE","Vic","3149","PO Box 449",null,"MOUNT WAVERLEY","VIC",3170,"Mathew Abraham","03 8846 9758","mathew.abraham@ue.com.au",null,null,"YES","NO","NO",null,"CBD","Urban","Short rural","Long rural",null,"United Energy"]
[null,"Western Power (D)","Western Power (D)",18540492861,"WA","Electricity","Distribution","Revenue cap","Financial","June",12,4,"x","distribution determination","363 Wellington Street",null,"PERTH","WA","6000","GPO Box L921",null,"PERTH","WA",6842,"Judy Hunter","08 9326 6239","judy.hunter@westernpower.com.au",null,null,"YES","YES","NO","NO","CBD","Urban","Short rural","Long rural",null,"Western Power (D)"]
[null,"Western Power (T)","Western Power (T)",18540492861,"WA","Electricity","Transmission","Revenue cap","Financial","June",12,4,"x","transmission determination","363 Wellington Street",null,"PERTH","WA","6000","GPO Box L921",null,"PERTH","WA",6842,"Judy Hunter","08 9326 6239","judy.hunter@westernpower.com.au",null,null,"YES","YES","NO",null,"CBD","Urban","Short rural","Long rural",null,"Western Power (T)"]
[]
[]
[null,null,null,null,null,null,null,null,null,null,null,null,null,null,null,null,null,null,null,null,null,null,null,null,"For EB & Reset RINs only",null,null,null,null,"For AARs only"]
[null,"The Reg Year Ending (dms_RYE) must be set to the last year of the regulatory period. For forecast data is is usually (FRCP_y5) for actual it is a single year (CRY). For historical actual data the RYE will need to be set manually in the business details sheet by setting the dms_Multiyear_flag to 1 and putting the correct value in 'dms_Specified_FinalYear. See cells C67:C68",null,null,null,null,{"$f":"IF(dms_RPT=\"financial\",VALUE(LEFT(CRCP_y1,4)-1)&\"-\"&TEXT(VALUE(RIGHT(CRCP_y1,2)-1),\"00\"),VALUE(LEFT(CRCP_y1,4)-1))","v":2011},null,null,null,null,null,null,"Drop down selector box for CA & Reset RINs.","For CA & Reset RINs only",null,null,null,null,null,null,null,null,null,"for DNSP only",null,null,null,null,"For DNSPs only",null,null,null,null,null,"Reason for interruption","dms_Reason_Interruption_Detailed","dms_Reason_Interruption","dms_STPIS_Exclusion_List"]
[null,"dms_Model_List ","DELETE NR 'CRY' IF NOT AN ANNUAL RIN (EB, CA , ARR)",null,"dms_RYE_Formula_Result",null,null,null,null,null,null,null,null,"dms_0203_ProjectType","dms_020303_01_UOM","dms_020501_01_UOM","dms_020501_02_UOM","dms_020501_03_UOM","dms_020501_04_UOM","dms_020603_01_UOM","dms_020701_01_UOM","dms_020701_02_UOM","dms_040102_01_UOM","dms_040102_04_UOM","dms_030601_01_UOM","dms_030601_02_UOM","dms_030701_01_UOM","dms_030702_01_UOM","dms_030703_01_UOM","dms_030605_UOM","dms_03060703_UOM",null,null,null,null,"Animal","Animal impact","Animal","Weather"]
[null,"ARR","ANNUAL REPORTING STATEMENT",null,{"$f":"LEFT(dms_SingleYear_FinalYear_Result,2)&RIGHT(dms_SingleYear_FinalYear_Result,2)","v":"2017"},"=LEFT(dms_SingleYear_FinalYear_Result,2)&RIGHT(dms_SingleYear_FinalYear_Result,2)",null,"Formula errors are OK",null,null,null,null,null,"New line on new route - single circuit","Circuit line length in km","0's","0's","0's","0's","0's","km","km","0's","days","minutes/customer","minutes/customer","Customer / km","%","km","number","number",null,null,null,null,null,"Animal nesting/burrowing, etc and other","Asset failure","Equipment failure"]
[null,"CA","CATEGORY ANALYSIS",null,{"$f":"LEFT(dms_SingleYear_FinalYear_Result,2)&RIGHT(dms_SingleYear_FinalYear_Result,2)","v":"2017"},"=LEFT(dms_SingleYear_FinalYear_Result,2)&RIGHT(dms_SingleYear_FinalYear_Result,2)",null,"Formula errors are OK",null,null,null,null,null,"New line on new route - dual circuit","Circuit line length in km","0's","0's","0's","0's","0's","0's","0's","0's","0's","minutes/customer","minutes/customer","MWh/customer","Number of spans",null,"number","number",null,null,null,null,null,"Other","Other","Operational error"]
[null,"CPI","CPI",null,null,null,null,null,null,null,null,null,null,"New line on new route - other","Circuit line length in km","MVA added","MVA added","MVA added","MVA added","0's","km","km","0's","$0s","interruptions/customer","interruptions/customer","kVA / customer","Number of spans",null,"number","number",null,null,null,null,"Asset failure","LV","Overloads","Vegetation"]
[null,"EB","ECONOMIC BENCHMARKING",null,{"$f":"LEFT(dms_SingleYear_FinalYear_Result,2)&RIGHT(dms_SingleYear_FinalYear_Result,2)","v":"2017"},"=LEFT(dms_SingleYear_FinalYear_Result,2)&RIGHT(dms_SingleYear_FinalYear_Result,2)",null,"Formula errors are OK",null,null,null,null,null,"Line rebuild over existing route - single circuit","Circuit line length in km","0's","0's","0's","0's","0's","km","km","$0s","0's","interruptions/customer","interruptions/customer",null,"Number of spans",null,"number","number",null,null,null,null,null,"Distribution substation","Planned","Animals"]
[null,"PTRM","POST TAX REVENUE MODEL",null,{"$f":"LEFT(dms_MultiYear_FinalYear_Result,2)&RIGHT(dms_MultiYear_FinalYear_Result,2)","v":"2021"},"=LEFT(dms_MultiYear_FinalYear_Result,2)&RIGHT(dms_MultiYear_FinalYear_Result,2)",null,null,null,null,null,null,null,"Line rebuild over existing route - dual circuit","Number","total spend $0s","total spend $0s","total spend $0s","total spend $0s","(per cent)","0's","0's",null,null,null,null,null,"Number of spans",null,"number","(per cent)",null,null,null,null,null,"HV","Network business","Third party impacts"]
[null,"Reset","REGULATORY REPORTING STATEMENT",null,{"$f":"LEFT(dms_MultiYear_FinalYear_Result,2)&RIGHT(dms_MultiYear_FinalYear_Result,2)","v":"2021"},"=LEFT(dms_MultiYear_FinalYear_Result,2)&RIGHT(dms_MultiYear_FinalYear_Result,2)",null,"Formula errors are OK",null,null,null,null,null,"Reconductor - Single circuit","Number","net circuit km added","net circuit km added","net circuit km added","net circuit km added",null,"years","years",null,null,null,null,null,"Years",null,"number",null,null,null,null,null,null,"Zone substation","Third party","Transmission failure"]
[null,"RFM","ROLL FORWARD MODEL",null,{"$f":"LEFT(dms_CRCP_FinalYear_Result,2)&RIGHT(dms_CRCP_FinalYear_Result,2)","v":"2017"},"=LEFT(dms_CRCP_FinalYear_Result,2)&RIGHT(dms_CRCP_FinalYear_Result,2)",null,null,null,null,null,null,null,"Reconductor - Dual circuit","Number","total spend $0s","total spend $0s","total spend $0s","total spend $0s",null,null,null,null,null,null,null,null,"Years",null,"number",null,null,null,null,null,null,"Subtransmission","Unknown","Load shedding"]
[null,"WACC","WEIGHTED AVERAGE COST OF CAPITAL",null,{"$f":"LEFT(dms_MultiYear_FinalYear_Result,2)&RIGHT(dms_MultiYear_FinalYear_Result,2)","v":"2021"},"=LEFT(dms_MultiYear_FinalYear_Result,2)&RIGHT(dms_MultiYear_FinalYear_Result,2)",null,null,null,null,null,null,null,"Other",null,"net circuit km added","net circuit km added","net circuit km added","net circuit km added",null,null,null,null,null,null,null,null,"Trees",null,"number",null,null,null,null,null,"Other","insert description of 'other'","Vegetation","Inter-distributor connection failure"]
[null,null,null,null,null,null,null,null,null,null,null,null,null,null,null,"total spend $0s","total spend $0s","total spend $0s","total spend $0s",null,null,null,null,null,null,null,null,"Trees",null,"number",null,null,null,null,null,"Overloads","-","Weather","Other"]
[null,"dms_DataQuality_List",null,null,null,null,null,null,null,null,null,null,null,null,null,"0's",null,"$0s",null,null,null,null,null,null,null,null,null,"Defects",null,"number",null,null,null,null,null,"Planned","-","2 - STPIS Exclusion (3.3)(a)"]
[null,"Actual",null,null,null,null,null,null,null,null,null,null,null,null,null,"0's",null,null,null,null,null,null,null,null,null,null,null,"Defects",null,"number",null,null,null,null,null,"Network business","Network error","3 - STPIS Exclusion (3.3)(a)"]
[null,"Estimate",null,null,null,null,null,null,null,null,null,null,null,null,null,"0's",null,null,null,null,null,null,null,null,null,null,null,"Spans",null,"number",null,null,null,null,null,null,"Switching and protection error","4 - STPIS Exclusion (3.3)(a)"]
[null,"Consolidated",null,null,null,null,null,null,null,null,null,null,null,null,null,"$0s",null,null,null,null,null,null,null,null,null,null,null,"km",null,"(per cent)",null,null,null,null,null,"Third party","Fire","5 - STPIS Exclusion (3.3)(a)"]
[null,"Recast",null,null,null,null,null,null,null,null,null,null,null,null,null,null,null,null,null,null,null,null,null,null,null,null,null,"Spans",null,"(per cent)",null,null,null,null,null,null,"Other","6 - STPIS Exclusion (3.3)(a)"]
[null,"Public",null,null,null,null,null,null,null,null,null,null,null,null,null,null,null,null,null,null,null,null,null,null,null,null,null,null,null,null,null,null,null,null,null,null,"Dig-in","7 - STPIS Exclusion (3.3)(a)"]
[null,null,null,null,null,null,null,null,null,null,null,null,null,null,null,null,null,null,null,null,null,null,null,null,null,null,null,null,null,null,null,null,null,null,null,null,"Unauthorised access"]
[null,"For all files either AER or business needs to be able to specify the type of submission","For PTRM & RFM templates we must provide a choice in case they change their form of control - otherwise it is drawn from the business specific lookup table above.",null,null,null,null,null,null,null,null,null,null,null,"For PTRM files - this field set the text for the named range \"DMS_Xfactor\" which in all cases is simply the text \"x factors\" - this saves putting in each old gas PTRM file ",null,null,null,null,null,null,null,null,null,"for TNSP only",null,null,null,null,null,null,null,null,null,null,null,"Vehicle impact"]
[null,"dms_SourceList","dms_FormControl_Choices",null,null,null,null,null,null,null,null,null,null,null,"DMS_Xfactor",null,null,null,null,null,null,null,null,null,"dms_030601_01_UOM",null,"dms_030701_01_UOM","dms_030702_01_UOM",null,null,null,null,null,null,null,"Unknown","Unknown"]
[null,"After appeal","Revenue cap",null,null,null,null,null,null,null,null,null,null,null,"x factors",null,null,null,null,null,null,null,null,null,"%",null,"Number of spans","km",null,null,null,null,null,null,null,"Vegetation","Blow-in/Fall-in - NSP responsibility"]
[null,"Draft decision","Revenue yield",null,null,null,null,null,null,null,null,null,null,null,null,null,null,null,null,null,null,null,null,null,"number",null,"Years","%",null,null,null,null,null,null,null,null,"Grow-in - NSP responsibility"]
[null,"Final decision","Weighted average price cap",null,null,null,null,null,null,null,null,null,null,null,null,null,null,null,null,null,null,null,null,null,"number",null,"Trees","km",null,null,null,null,null,null,null,null,"Blow-in/Fall-in - Other responsible party"]
[null,"PTRM update 1",null,null,null,null,null,null,null,null,null,null,null,null,null,null,null,null,null,null,null,null,null,null,"%",null,"Defects","number",null,null,null,null,null,null,null,null,"Grow-in - Other responsible party"]
[null,"PTRM update 2",null,null,null,null,null,null,null,null,null,null,null,null,null,null,null,null,null,null,null,null,null,null,"number",null,"Number of spans",null,null,null,null,null,null,null,null,"Weather"]
[null,"PTRM update 3",null,null,null,null,null,null,null,null,null,null,null,null,null,null,null,null,null,null,null,null,null,null,"number",null,"km",null,null,null,null,null,null,null,null,"2 - STPIS Exclusion (3.3)(a)"]
[null,"PTRM update 4",null,null,null,null,null,null,null,null,null,null,null,null,null,null,null,null,null,null,null,null,null,null,"%",null,"km",null,null,null,null,null,null,null,null,"3 - STPIS Exclusion (3.3)(a)"]
[null,"PTRM update 5",null,null,null,null,null,null,null,null,null,null,null,null,null,null,null,null,null,null,null,null,null,null,"number",null,"Number of spans",null,null,null,null,null,null,null,null,"4 - STPIS Exclusion (3.3)(a)"]
[null,"PTRM update 6",null,null,null,null,null,null,null,null,null,null,null,null,null,null,null,null,null,null,null,null,null,null,"number",null,null,null,null,null,null,null,null,null,null,"5 - STPIS Exclusion (3.3)(a)"]
[null,"PTRM update 7",null,null,null,null,null,null,null,null,null,null,null,null,null,null,null,null,null,null,null,null,null,null,"%",null,null,null,null,null,null,null,null,null,null,"6 - STPIS Exclusion (3.3)(a)"]
[null,"Regulatory proposal",null,null,null,null,null,null,null,null,null,null,null,null,null,null,null,null,null,null,null,null,null,null,"number",null,null,null,null,null,null,null,null,null,null,"7 - STPIS Exclusion (3.3)(a)"]
[null,"Reporting",null,null,null,null,null,null,null,null,null,null,null,null,null,null,null,null,null,null,null,null,null,null,"%"]
[null,"Revised regulatory proposal",null,null,null,null,null,null,null,null,null,null,null,null,null,null,null,null,null,null,null,null,null,null,"number"]
[null,null,null,null,null,null,null,null,null,null,null,null,null,null,null,null,null,null,null,null,null,null,null,null,"%"]
[null,null,null,null,null,null,null,null,null,null,null,null,null,null,null,null,null,null,null,null,null,null,null,null,"number"]
[]
[]
[]
[null,"These are indeces and lookup values for various dates. All step from the value placed in FRCP_y1 on the business and other details worksheet",null,null,null,null,null,null,null,null,null,"These date tables are currently used in the Recast templates to provide column headings and conditional formatting"]
[null,"dms_FRCPlength_Num_List","dms_FinalYear_List","dms_CRCPlength_Num_List","dms_CFinalYear_List","dms_FRCP_years",null,"dms_CRCP_years",null,"dms_CRCP_index",null,"CRY from input cell on business sheet","CRY - financial","dms_FinYears","CRY calendar","dms_CalYears"]
[null,1,"dms_FRCP_y1",1,"CRCP_y1",{"$f":"FRCP_y1","v":2017},"dms_FRCP_y1",{"$f":"IF(dms_RPT=\"financial\",VALUE(LEFT(dms_FRCP_y1,4)-1)&\"-\"&TEXT(VALUE(MID(dms_FRCP_y1,3,2)),\"00\"),VALUE(LEFT(dms_FRCP_y1,4)-1))","v":2016},"dms_CRCP_yZ",1,null,{"$f":"CRY","v":2017},{"$f":"VALUE(LEFT(CRY,4))&\"-\"&TEXT(MID(CRY,3,2)+1,\"00\")","v":"2017-18"},"dms_CRYf_y1",{"$f":"VALUE(LEFT(CRY,4)+1)","v":2018},"dms_CRYc_y1"]
[null,2,"dms_FRCP_y2",2,"CRCP_y2",{"$f":"IF(dms_RPT=\"financial\",VALUE(LEFT(dms_FRCP_y1,4)+1)&\"-\"&TEXT(VALUE(RIGHT(dms_FRCP_y1,2)+1),\"00\"),VALUE(LEFT(dms_FRCP_y1,4)+1))","v":2018},"dms_FRCP_y2",{"$f":"IF(dms_RPT=\"financial\",VALUE(LEFT(dms_CRCP_yZ,4)-1)&\"-\"&TEXT(VALUE(MID(dms_CRCP_yZ,3,2)),\"00\"),VALUE(LEFT(dms_CRCP_yZ,4)-1))","v":2015},"dms_CRCP_yY",2,null,null,{"$f":"VALUE(LEFT(dms_CRYf_y1,4)+1)&\"-\"&TEXT(MID(dms_CRYf_y1,3,2)+2,\"00\")","v":"2018-19"},"dms_CRYf_y2",{"$f":"VALUE(LEFT(dms_CRYc_y1,4)+1)","v":2019},"dms_CRYc_y2"]
[null,3,"dms_FRCP_y3",3,"CRCP_y3",{"$f":"IF(dms_RPT=\"financial\",VALUE(LEFT(dms_FRCP_y2,4)+1)&\"-\"&TEXT(VALUE(RIGHT(dms_FRCP_y2,2)+1),\"00\"),VALUE(LEFT(dms_FRCP_y2,4)+1))","v":2019},"dms_FRCP_y3",{"$f":"IF(dms_RPT=\"financial\",VALUE(LEFT(dms_CRCP_yY,4)-1)&\"-\"&TEXT(VALUE(MID(dms_CRCP_yY,3,2)),\"00\"),VALUE(LEFT(dms_CRCP_yY,4)-1))","v":2014},"dms_CRCP_yX",3,null,null,{"$f":"VALUE(LEFT(dms_CRYf_y2,4)+1)&\"-\"&TEXT(MID(dms_CRYf_y2,3,2)+2,\"00\")","v":"2019-20"},"dms_CRYf_y3",{"$f":"VALUE(LEFT(dms_CRYc_y2,4)+1)","v":2020},"dms_CRYc_y3"]
[null,4,"dms_FRCP_y4",4,"CRCP_y4",{"$f":"IF(dms_RPT=\"financial\",VALUE(LEFT(dms_FRCP_y3,4)+1)&\"-\"&TEXT(VALUE(RIGHT(dms_FRCP_y3,2)+1),\"00\"),VALUE(LEFT(dms_FRCP_y3,4)+1))","v":2020},"dms_FRCP_y4",{"$f":"IF(dms_RPT=\"financial\",VALUE(LEFT(dms_CRCP_yX,4)-1)&\"-\"&TEXT(VALUE(MID(dms_CRCP_yX,3,2)),\"00\"),VALUE(LEFT(dms_CRCP_yX,4)-1))","v":2013},"dms_CRCP_yW",4,null,null,{"$f":"VALUE(LEFT(dms_CRYf_y3,4)+1)&\"-\"&TEXT(MID(dms_CRYf_y3,3,2)+2,\"00\")","v":"2020-21"},"dms_CRYf_y4",{"$f":"VALUE(LEFT(dms_CRYc_y3,4)+1)","v":2021},"dms_CRYc_y4"]
[null,5,"dms_FRCP_y5",5,"CRCP_y5",{"$f":"IF(dms_RPT=\"financial\",VALUE(LEFT(dms_FRCP_y4,4)+1)&\"-\"&TEXT(VALUE(RIGHT(dms_FRCP_y4,2)+1),\"00\"),VALUE(LEFT(dms_FRCP_y4,4)+1))","v":2021},"dms_FRCP_y5",{"$f":"IF(dms_RPT=\"financial\",VALUE(LEFT(dms_CRCP_yW,4)-1)&\"-\"&TEXT(VALUE(MID(dms_CRCP_yW,3,2)),\"00\"),VALUE(LEFT(dms_CRCP_yW,4)-1))","v":2012},"dms_CRCP_yV",5,null,null,{"$f":"VALUE(LEFT(dms_CRYf_y4,4)+1)&\"-\"&TEXT(MID(dms_CRYf_y4,3,2)+2,\"00\")","v":"2021-22"},"dms_CRYf_y5",{"$f":"VALUE(LEFT(dms_CRYc_y4,4)+1)","v":2022},"dms_CRYc_y5"]
[null,6,"dms_FRCP_y6",6,"CRCP_y6",{"$f":"IF(dms_RPT=\"financial\",VALUE(LEFT(dms_FRCP_y5,4)+1)&\"-\"&TEXT(VALUE(RIGHT(dms_FRCP_y5,2)+1),\"00\"),VALUE(LEFT(dms_FRCP_y5,4)+1))","v":2022},"dms_FRCP_y6",{"$f":"IF(dms_RPT=\"financial\",VALUE(LEFT(dms_CRCP_yV,4)-1)&\"-\"&TEXT(VALUE(MID(dms_CRCP_yV,3,2)),\"00\"),VALUE(LEFT(dms_CRCP_yV,4)-1))","v":2011},"dms_CRCP_yU",6,null,null,{"$f":"VALUE(LEFT(dms_CRYf_y5,4)+1)&\"-\"&TEXT(MID(dms_CRYf_y5,3,2)+2,\"00\")","v":"2022-23"},"dms_CRYf_y6",{"$f":"VALUE(LEFT(dms_CRYc_y5,4)+1)","v":2023},"dms_CRYc_y6"]
[null,7,"dms_FRCP_y7",7,"CRCP_y7",{"$f":"IF(dms_RPT=\"financial\",VALUE(LEFT(dms_FRCP_y6,4)+1)&\"-\"&TEXT(VALUE(RIGHT(dms_FRCP_y6,2)+1),\"00\"),VALUE(LEFT(dms_FRCP_y6,4)+1))","v":2023},"dms_FRCP_y7",{"$f":"IF(dms_RPT=\"financial\",VALUE(LEFT(dms_CRCP_yU,4)-1)&\"-\"&TEXT(VALUE(MID(dms_CRCP_yU,3,2)),\"00\"),VALUE(LEFT(dms_CRCP_yU,4)-1))","v":2010},"dms_CRCP_yT",7,null,null,{"$f":"VALUE(LEFT(dms_CRYf_y6,4)+1)&\"-\"&TEXT(MID(dms_CRYf_y6,3,2)+2,\"00\")","v":"2023-24"},"dms_CRYf_y7",{"$f":"VALUE(LEFT(dms_CRYc_y6,4)+1)","v":2024},"dms_CRYc_y7"]
[null,8,"dms_FRCP_y8",8,"CRCP_y8",{"$f":"IF(dms_RPT=\"financial\",VALUE(LEFT(dms_FRCP_y7,4)+1)&\"-\"&TEXT(VALUE(RIGHT(dms_FRCP_y7,2)+1),\"00\"),VALUE(LEFT(dms_FRCP_y7,4)+1))","v":2024},"dms_FRCP_y8",{"$f":"IF(dms_RPT=\"financial\",VALUE(LEFT(dms_CRCP_yT,4)-1)&\"-\"&TEXT(VALUE(MID(dms_CRCP_yT,3,2)),\"00\"),VALUE(LEFT(dms_CRCP_yT,4)-1))","v":2009},"dms_CRCP_yS",8,null,null,{"$f":"VALUE(LEFT(dms_CRYf_y7,4)+1)&\"-\"&TEXT(MID(dms_CRYf_y7,3,2)+2,\"00\")","v":"2024-25"},"dms_CRYf_y8",{"$f":"VALUE(LEFT(dms_CRYc_y7,4)+1)","v":2025},"dms_CRYc_y8"]
[null,9,"dms_FRCP_y9",9,"CRCP_y9",{"$f":"IF(dms_RPT=\"financial\",VALUE(LEFT(dms_FRCP_y8,4)+1)&\"-\"&TEXT(VALUE(RIGHT(dms_FRCP_y8,2)+1),\"00\"),VALUE(LEFT(dms_FRCP_y8,4)+1))","v":2025},"dms_FRCP_y9",{"$f":"IF(dms_RPT=\"financial\",VALUE(LEFT(dms_CRCP_yS,4)-1)&\"-\"&TEXT(VALUE(MID(dms_CRCP_yS,3,2)),\"00\"),VALUE(LEFT(dms_CRCP_yS,4)-1))","v":2008},"dms_CRCP_yR",9,null,null,{"$f":"VALUE(LEFT(dms_CRYf_y8,4)+1)&\"-\"&TEXT(MID(dms_CRYf_y8,3,2)+2,\"00\")","v":"2025-26"},"dms_CRYf_y9",{"$f":"VALUE(LEFT(dms_CRYc_y8,4)+1)","v":2026},"dms_CRYc_y9"]
[null,10,"dms_FRCP_y10",10,"CRCP_y10",{"$f":"IF(dms_RPT=\"financial\",VALUE(LEFT(dms_FRCP_y9,4)+1)&\"-\"&TEXT(VALUE(RIGHT(dms_FRCP_y9,2)+1),\"00\"),VALUE(LEFT(dms_FRCP_y9,4)+1))","v":2026},"dms_FRCP_y10",{"$f":"IF(dms_RPT=\"financial\",VALUE(LEFT(dms_CRCP_yR,4)-1)&\"-\"&TEXT(VALUE(MID(dms_CRCP_yR,3,2)),\"00\"),VALUE(LEFT(dms_CRCP_yR,4)-1))","v":2007},"dms_CRCP_yQ",10,null,null,{"$f":"VALUE(LEFT(dms_CRYf_y9,4)+1)&\"-\"&TEXT(MID(dms_CRYf_y9,3,2)+2,\"00\")","v":"2026-27"},"dms_CRYf_y10",{"$f":"VALUE(LEFT(dms_CRYc_y9,4)+1)","v":2027},"dms_CRYc_y10"]
[null,11,"dms_FRCP_y11",11,"CRCP_y11",{"$f":"IF(dms_RPT=\"financial\",VALUE(LEFT(dms_FRCP_y10,4)+1)&\"-\"&TEXT(VALUE(RIGHT(dms_FRCP_y10,2)+1),\"00\"),VALUE(LEFT(dms_FRCP_y10,4)+1))","v":2027},"dms_FRCP_y11",{"$f":"IF(dms_RPT=\"financial\",VALUE(LEFT(dms_CRCP_yQ,4)-1)&\"-\"&TEXT(VALUE(MID(dms_CRCP_yQ,3,2)),\"00\"),VALUE(LEFT(dms_CRCP_yQ,4)-1))","v":2006},"dms_CRCP_yP",11,null,null,{"$f":"VALUE(LEFT(dms_CRYf_y10,4)+1)&\"-\"&TEXT(MID(dms_CRYf_y10,3,2)+2,\"00\")","v":"2027-28"},"dms_CRYf_y11",{"$f":"VALUE(LEFT(dms_CRYc_y10,4)+1)","v":2028},"dms_CRYc_y11"]
[null,12,"dms_FRCP_y12",12,"CRCP_y12",{"$f":"IF(dms_RPT=\"financial\",VALUE(LEFT(dms_FRCP_y11,4)+1)&\"-\"&TEXT(VALUE(RIGHT(dms_FRCP_y11,2)+1),\"00\"),VALUE(LEFT(dms_FRCP_y11,4)+1))","v":2028},"dms_FRCP_y12",{"$f":"IF(dms_RPT=\"financial\",VALUE(LEFT(dms_CRCP_yP,4)-1)&\"-\"&TEXT(VALUE(MID(dms_CRCP_yP,3,2)),\"00\"),VALUE(LEFT(dms_CRCP_yP,4)-1))","v":2005},"dms_CRCP_yO",12,null,null,{"$f":"VALUE(LEFT(dms_CRYf_y11,4)+1)&\"-\"&TEXT(MID(dms_CRYf_y11,3,2)+2,\"00\")","v":"2028-29"},"dms_CRYf_y12",{"$f":"VALUE(LEFT(dms_CRYc_y11,4)+1)","v":2029},"dms_CRYc_y12"]
[null,13,"dms_FRCP_y13",13,"CRCP_y13",{"$f":"IF(dms_RPT=\"financial\",VALUE(LEFT(dms_FRCP_y12,4)+1)&\"-\"&TEXT(VALUE(RIGHT(dms_FRCP_y12,2)+1),\"00\"),VALUE(LEFT(dms_FRCP_y12,4)+1))","v":2029},"dms_FRCP_y13",{"$f":"IF(dms_RPT=\"financial\",VALUE(LEFT(dms_CRCP_yO,4)-1)&\"-\"&TEXT(VALUE(MID(dms_CRCP_yO,3,2)),\"00\"),VALUE(LEFT(dms_CRCP_yO,4)-1))","v":2004},"dms_CRCP_yN",13,null,null,{"$f":"VALUE(LEFT(dms_CRYf_y12,4)+1)&\"-\"&TEXT(MID(dms_CRYf_y12,3,2)+2,\"00\")","v":"2029-30"},"dms_CRYf_y13",{"$f":"VALUE(LEFT(dms_CRYc_y12,4)+1)","v":2030},"dms_CRYc_y13"]
[null,14,"dms_FRCP_y14",14,"CRCP_y14",{"$f":"IF(dms_RPT=\"financial\",VALUE(LEFT(dms_FRCP_y13,4)+1)&\"-\"&TEXT(VALUE(RIGHT(dms_FRCP_y13,2)+1),\"00\"),VALUE(LEFT(dms_FRCP_y13,4)+1))","v":2030},"dms_FRCP_y14",{"$f":"IF(dms_RPT=\"financial\",VALUE(LEFT(dms_CRCP_yN,4)-1)&\"-\"&TEXT(VALUE(MID(dms_CRCP_yN,3,2)),\"00\"),VALUE(LEFT(dms_CRCP_yN,4)-1))","v":2003},"dms_CRCP_yM",14,null,null,{"$f":"VALUE(LEFT(dms_CRYf_y13,4)+1)&\"-\"&TEXT(MID(dms_CRYf_y13,3,2)+2,\"00\")","v":"2030-31"},"dms_CRYf_y14",{"$f":"VALUE(LEFT(dms_CRYc_y13,4)+1)","v":2031},"dms_CRYc_y14"]
[null,15,"dms_FRCP_y15",15,"CRCP_y15",{"$f":"IF(dms_RPT=\"financial\",VALUE(LEFT(dms_FRCP_y14,4)+1)&\"-\"&TEXT(VALUE(RIGHT(dms_FRCP_y14,2)+1),\"00\"),VALUE(LEFT(dms_FRCP_y14,4)+1))","v":2031},"dms_FRCP_y15",{"$f":"IF(dms_RPT=\"financial\",VALUE(LEFT(dms_CRCP_yM,4)-1)&\"-\"&TEXT(VALUE(MID(dms_CRCP_yM,3,2)),\"00\"),VALUE(LEFT(dms_CRCP_yM,4)-1))","v":2002},"dms_CRCP_yL",15,null,null,{"$f":"VALUE(LEFT(dms_CRYf_y14,4)+1)&\"-\"&TEXT(MID(dms_CRYf_y14,3,2)+2,\"00\")","v":"2031-32"},"dms_CRYf_y15",{"$f":"VALUE(LEFT(dms_CRYc_y14,4)+1)","v":2032},"dms_CRYc_y15"]
[null,null,null,null,null,null,null,null,null,null,null,null,{"$f":"VALUE(LEFT(dms_CRYf_y15,4)+1)&\"-\"&TEXT(MID(dms_CRYf_y15,3,2)+2,\"00\")","v":"2032-33"},"dms_CRYf_y16",{"$f":"VALUE(LEFT(dms_CRYc_y15,4)+1)","v":2033},"dms_CRYc_y16"]
[null,"These are drop down lists for businesses to select the correct FRCP_y1 on the business and other details worksheet.\nThis also populates the column headings in the worksheets",null,null,null,null,null,null,null,null,null,null,{"$f":"VALUE(LEFT(dms_CRYf_y16,4)+1)&\"-\"&TEXT(MID(dms_CRYf_y16,3,2)+2,\"00\")","v":"2033-34"},"dms_CRYf_y17",{"$f":"VALUE(LEFT(dms_CRYc_y16,4)+1)","v":2034},"dms_CRYc_y17"]
[null,"dms_RCP_fyear_list","dms_CRY_ListF","dms_CRY_ListC","dms_RCP_cyear_list","dms_FRCP_fyear_list","dms_FRCP_ListF","dms_FRCP_ListC","dms_FRCP_cyear_list",null,null,null,{"$f":"VALUE(LEFT(dms_CRYf_y17,4)+1)&\"-\"&TEXT(MID(dms_CRYf_y17,3,2)+2,\"00\")","v":"2034-35"},"dms_CRYf_y18",{"$f":"VALUE(LEFT(dms_CRYc_y17,4)+1)","v":2035},"dms_CRYc_y18"]
[null,"dms_fy1","2005-06","2006","dms_cy1","dms_frcp_fy1","2015-16",2016,"dms_crcp_cy1",null,null,null,{"$f":"VALUE(LEFT(dms_CRYf_y18,4)+1)&\"-\"&TEXT(MID(dms_CRYf_y18,3,2)+2,\"00\")","v":"2035-36"},"dms_CRYf_y19",{"$f":"VALUE(LEFT(dms_CRYc_y18,4)+1)","v":2036},"dms_CRYc_y19"]
[null,"dms_fy2","2006-07","2007","dms_cy2","dms_frcp_fy2","2016-17",2017,"dms_crcp_cy2",null,null,null,{"$f":"VALUE(LEFT(dms_CRYf_y19,4)+1)&\"-\"&TEXT(MID(dms_CRYf_y19,3,2)+2,\"00\")","v":"2036-37"},"dms_CRYf_y20",{"$f":"VALUE(LEFT(dms_CRYc_y19,4)+1)","v":2037},"dms_CRYc_y20"]
[null,"dms_fy3","2007-08","2008","dms_cy3","dms_frcp_fy3","2017-18",2018,"dms_crcp_cy3"]
[null,"dms_fy4","2008-09","2009","dms_cy4","dms_frcp_fy4","2018-19",2019,"dms_crcp_cy4"]
[null,"dms_fy5","2009-10",2010,"dms_cy5","dms_frcp_fy5","2019-20",2020,"dms_crcp_cy5"]
[null,"dms_fy6","2010-11",2011,"dms_cy6","dms_frcp_fy6","2020-21",2021,"dms_crcp_cy6"]
[null,"dms_fy7","2011-12",2012,"dms_cy7","dms_frcp_fy7","2021-22",2022,"dms_crcp_cy7"]
[null,"dms_fy8","2012-13",2013,"dms_cy8","dms_frcp_fy8","2022-23",2023,"dms_crcp_cy8",null,null,"2005-06","2006"]
[null,"dms_fy9","2013-14",2014,"dms_cy9","dms_frcp_fy9","2023-24",2024,"dms_crcp_cy9",null,null,"2006-07","2007"]
[null,"dms_fy10","2014-15",2015,"dms_cy10","dms_frcp_fy10","2024-25",2025,"dms_crcp_cy10",null,null,"2007-08","2008"]
[null,"dms_fy11","2015-16",2016,"dms_cy11","dms_frcp_fy11","2025-26",2026,"dms_crcp_cy11",null,null,"2008-09","2009"]
[null,"dms_fy12","2016-17",2017,"dms_cy12","dms_frcp_fy12","2026-27",2027,"dms_crcp_cy12",null,null,"2009-10",2010]
[null,"dms_fy13","2017-18",2018,"dms_cy13","dms_frcp_fy13","2027-28",2028,"dms_crcp_cy13",null,null,"2010-11",2011]
[null,"dms_fy14","2018-19",2019,"dms_cy14","dms_frcp_fy14","2028-29",2029,"dms_crcp_cy14",null,null,"2011-12",2012]
[null,"dms_fy15","2019-20",2020,"dms_cy15","dms_frcp_fy15","2029-30",2030,"dms_crcp_cy15",null,null,"2012-13",2013]
[null,"dms_fy16","2020-21",2021,"dms_cy16",null,null,null,null,null,null,"2013-14",2014]
[null,"dms_fy17","2021-22",2022,"dms_cy17",null,null,null,null,null,null,"2014-15",2015]
[null,"dms_fy18","2022-23",2023,"dms_cy18",null,null,null,null,null,null,"2015-16",2016]
[null,"dms_fy19","2023-24",2024,"dms_cy19",null,null,null,null,null,null,"2016-17",2017]
[null,"dms_fy20","2024-25",2025,"dms_cy20",null,null,null,null,null,null,"2017-18",2018]
[null,null,null,null,null,null,null,null,null,null,null,"2018-19",2019]
[null,null,null,null,null,null,null,null,null,null,null,"2019-20",2020]
[null,null,null,null,null,null,null,null,null,null,null,"2020-21",2021]
[null,null,null,null,null,null,null,null,null,null,null,"2021-22",2022]
[null,null,null,null,null,null,null,null,null,null,null,"2022-23",2023]
[null,null,null,null,null,null,null,null,null,null,null,"2023-24",2024]
[null,null,null,null,null,null,null,null,null,null,null,"2024-25",2025]
[null,null,null,null,null,null,null,null,null,null,null,"2025-26",2026]
[null,null,null,null,null,null,null,null,null,null,null,"2026-27",2027]
[null,null,null,null,null,null,null,null,null,null,null,"2027-28",2028]
[null,null,null,null,null,null,null,null,null,null,null,"2028-29",2029]
[null,null,null,null,null,null,null,null,null,null,null,"2029-30",2030]
[null,null,null,null,null,null,null,null,null,null,null,"2030-31",2031]
[null,null,null,null,null,null,null,null,null,null,null,"2031-32",2032]
[null,null,null,null,null,null,null,null,null,null,null,"2032-33",2033]
[null,null,null,null,null,null,null,null,null,null,null,"2033-34",2034]
[null,null,null,null,null,null,null,null,null,null,null,"2034-35",2035]
[null,null,null,null,null,null,null,null,null,null,null,"2035-36",2036]

{"sheet":"Instructions","index":1,"n_rows":27,"n_cols":4,"rows_kept":27,"cut":false,"hidden":false,"merged":[[7,2,7,3],[1,1,1,5],[2,1,2,5],[3,2,3,4],[4,2,4,4],[5,2,5,4],[24,2,24,4],[25,2,25,3],[26,2,26,4],[8,2,8,4],[10,2,10,4],[12,2,12,4],[20,2,20,4],[22,2,22,4]]}
[]
[null,{"$f":"CONCATENATE(dms_Segment,\" Network Service Provider\")","v":"Distribution Network Service Provider"}]
[null,{"$f":"IF(dms_Model=\"Reset\",\"Regulatory Proposal RIN Template\",\"Annual Reporting RIN\")","v":"Annual Reporting RIN"}]
[null,null,{"$f":"CONCATENATE(\"This template is to be used by \",dms_TradingName,\" to fulfil its reporting obligations to the AER.\")","v":"This template is to be used by Powercor Australia to fulfil its reporting obligations to the AER."}]
[null,null,"INSTRUCTIONS"]
[null,null,"Complete the Business & other details worksheet before entering data or values in any other worksheets. The Business & other details worksheet is linked to other worksheets within the workbook and automatically generates certain column headings and conditional formatting."]
[]
[null,null,"Identifying CONFIDENTIAL INFORMATION:\n\nPlease use the macro at the top of each \nworksheet to identify confidential information. \n\n"]
[null,null,"-Do this by selecting the cell or cells that contain confidential information and then run the Mark selected cells as CONFIDENTIAL macro. This will format the cells a specific colour that is identified by the AER's database which in turn marks that information as confidential.\n\n-To reverse this, select the cell or cells and run the Return cells to NON-CONFIDENTIAL macro."]
[]
[null,null,"UNITS OF MEASURE\n\nAll amounts are to be unrounded and reported on a one for one basis: that is 1000 is to be entered as '1000'. Applicable units of measure may be identified in the table column headings or row descriptors.\n\n"]
[]
[null,null,"COLOUR CODING OF INPUT / NON-INPUT CELLS:"]
[null,null,null,"Yellow = Input cell (mandatory)"]
[null,null,null,"Darker yellow = input cell (mandatory)"]
[null,null,null,"Orange = input cell (if data available)"]
[null,null,null,"Grey = Not applicable/No inputs required"]
[null,null,null," \nPLEASE DO NOT ENTER TEXT into cells that are to contain numeric data."]
[]
[]
[null,null,"WORKSHEET NAVIGATION\n\nMany tables in the worksheets have been \"grouped\" to allow for easy navigation. To ungroup or group data use the outline symbols in the left margin (for Row groupings) or above the columns (for column groupings). \n\n\n\n"]
[]
[null,null,"RETURNING COMPLETED RESPONSES\n\nPlease return two (2) files to the AER: \n1. A confidential version which must contain a complete set of all responses with confidential information marked using the Mark selection CONFIDENTIAL macro and which has been completed using the locked template file provided by the AER. \n\n2. A public version with confidential information either removed completely or aggregated in some form together with writtten consent to disclose the public version of the response.\n\nUse the drop down box on the Business and other details worksheet to identify the file as either confidential ('consolidated') or public. "]
[]
[null,null,"SUBMITTING AMENDED DATA TO THE AER\n\nIf an NSP wishes to correct data previously submitted to the AER it should resubmit that data using the original completed submission as the starting point. Please make any necessary changes to the data. Data that is not being amended should be left unchanged. \n\nNSPs must identify the reason for the amendments in the Amendment Reason box on the  Business and other details worksheet. NSPs may provide further details regarding any amendments in the Amendments worksheet. \n\n."]
[null,null,"NSP may use Amended Data macro \nto highlight cells that contain amended data.\nNB: if data is also CONFIDENTIAL, re-apply \nthe Confidentiality macro after applying the \nAmended macro"]
[null,null,"Please resubmit two (2) files - a confidential version and a public version of the amended submission to the AER"]

{"sheet":"Contents","index":2,"n_rows":31,"n_cols":4,"rows_kept":31,"cut":false,"hidden":false,"merged":[[2,1,2,3],[3,1,3,3],[4,1,4,3]]}
[]
[]
[null,{"$f":"CONCATENATE(dms_Segment,\" Network Service Provider\")","v":"Distribution Network Service Provider"}]
[null,"Annual Reporting RIN Template"]
[null,"Table of Contents"]
[]
[]
[null,null,"Instructions"]
[null,null,"Business & other details"]
[]
[]
[null,"CATEGORY ANALYSIS","STPIS","STATUTORY ACCOUNTS"]
[]
[null,"2.11 Labour","6.2 STPIS Reliability","8.1 Income"]
[null,null,"6.6 STPIS Customer Service","8.2 Capex"]
[null,null,"6.7 STPIS Daily Performance"]
[null,null,"6.8 STPIS Exclusions","8.4 Opex"]
[null,null,"6.9 STPIS GSL"]
[]
[]
[]
[null,"NETWORK PERFORMANCE","OTHER INFORMATION","PRICING PROPOSAL"]
[null,null,null,"Victorian Businesses Only"]
[null,"3.6 Quality of services","7.8 Avoided Cost Payments"]
[null,"3.6.8 Network-feeders","7.10 Juris Scheme","9.5 TUoS"]
[null,"3.6.9 Network-reliability","7.11 DMIS-DMIA"]
[null,null,"7.12 Safety and Bushfire"]
[null,null,"7.13 TARC"]
[null,"PUBLIC LIGHTING"]
[]
[null,"4.1 Public lighting tariffs"]

{"sheet":"Business & other details","index":3,"n_rows":103,"n_cols":12,"rows_kept":103,"cut":false,"hidden":false,"merged":[[7,1,7,8],[11,1,11,8],[13,2,13,4],[14,2,14,4],[17,2,17,3],[17,4,17,7],[84,4,84,8],[18,4,18,7],[19,2,19,3],[19,4,19,7],[22,2,22,3],[22,4,22,7],[23,4,23,7],[50,4,50,8],[24,2,24,3],[24,4,24,7],[32,1,32,8],[49,2,49,3],[51,2,51,8]]}
[null,{"$f":"(LOOKUP(dms_Model,dms_Model_List,dms_Worksheet_List))","v":"ANNUAL REPORTING STATEMENT"}]
[null,{"$f":"dms_TradingName","v":"Powercor Australia"}]
[null,{"$f":"CONCATENATE(\"Annual Reporting RIN Response \",CRY)","v":"Annual Reporting RIN Response 2017"}]
[null,"BUSINESS & OTHER DETAILS"]
[]
[]
[null,"Instructions"]
[null,"Complete the following business details regulatory template before entering data or values in any other regulatory template. This regulatory template is linked to other cells within the spreadsheet and automatically generates column headings and conditional formatting to distinguish business specific input and non-input cells. "]
[]
[null,"SUBMISSION PARTICULARS INPUT SHEETS"]
[]
[null,"ENTITY DETAILS"]
[]
[null,"Short name","Powercor Australia",null,null,"Select business name from drop down list first"]
[null,"ACN / ABN",{"$f":"INDEX(dms_ABN_List,MATCH(dms_TradingName,dms_TradingName_List))","v":89064651109}]
[]
[]
[null,"Business address","Address 1",null,{"$f":"INDEX(dms_Addr1_List,MATCH(dms_TradingName,dms_TradingName_List))","v":"40 Market Street"}]
[null,null,null,"Address 2",{"$f":"IF(ISBLANK(INDEX(dms_Addr2_List,MATCH(dms_TradingName,dms_TradingName_List))),\"\",INDEX(dms_Addr2_List,MATCH(dms_TradingName,dms_TradingName_List)))","v":""}]
[null,null,"Suburb",null,{"$f":"INDEX(dms_Suburb_List,MATCH(dms_TradingName,dms_TradingName_List))","v":"MELBOURNE"}]
[null,null,null,"State",{"$f":"INDEX(dms_State_List,MATCH(dms_TradingName,dms_TradingName_List))","v":"Vic"},"p/code",{"$f":"INDEX(dms_PostCode_List,MATCH(dms_TradingName,dms_TradingName_List))","v":"3000"}]
[]
[null,"Postal address","Address 1",null,{"$f":"INDEX(dms_PAddr1_List,MATCH(dms_TradingName,dms_TradingName_List))","v":"Locked bag 14090"}]
[null,null,null,"Address 2",{"$f":"IF(ISBLANK(INDEX(dms_PAddr2_List,MATCH(dms_TradingName,dms_TradingName_List))),\"\",INDEX(dms_PAddr2_List,MATCH(dms_TradingName,dms_TradingName_List)))","v":""}]
[null,null,"Suburb",null,{"$f":"INDEX(dms_PSuburb_List,MATCH(dms_TradingName,dms_TradingName_List))","v":"MELBOURNE"}]
[null,null,null,"State",{"$f":"INDEX(dms_PState_List,MATCH(dms_TradingName,dms_TradingName_List))","v":"VIC"},"p/code",{"$f":"INDEX(dms_PPostCode_List,MATCH(dms_TradingName,dms_TradingName_List))","v":8001}]
[]
[]
[null,"Contact name/s","Mark de Villiers"]
[null,"Contact phone/s"]
[null,"Contact email address/s"]
[]
[null,"REGULATORY CONTROL PERIODS"]
[]
[null,"Forthcoming regulatory control period",2017,{"$f":"dms_FRCP_y2","v":2018},{"$f":"dms_FRCP_y3","v":2019},{"$f":"dms_FRCP_y4","v":2020},{"$f":"dms_FRCP_y5","v":2021},{"$f":"dms_FRCP_y6","v":2022},{"$f":"dms_FRCP_y7","v":2023},{"$f":"dms_FRCP_y8","v":2024},{"$f":"dms_FRCP_y9","v":2025},{"$f":"dms_FRCP_y10","v":2026}]
[]
[]
[null,"Current regulatory control period",{"$f":"dms_CRCP_FirstYear_Result","v":2012},{"$f":"IF(dms_RPT=\"financial\",VALUE(LEFT(CRCP_y1,4)+1)&\"-\"&TEXT(MID(CRCP_y1,3,2)+2,\"00\"),VALUE(LEFT(CRCP_y1,4)+1))","v":2013},{"$f":"IF(dms_RPT=\"financial\",VALUE(LEFT(CRCP_y2,4)+1)&\"-\"&TEXT(VALUE(MID(CRCP_y2,3,2)+2),\"00\"),VALUE(LEFT(CRCP_y2,4)+1))","v":2014},{"$f":"IF(dms_RPT=\"financial\",VALUE(LEFT(CRCP_y3,4)+1)&\"-\"&TEXT(VALUE(MID(CRCP_y3,3,2)+2),\"00\"),VALUE(LEFT(CRCP_y3,4)+1))","v":2015},{"$f":"IF(dms_RPT=\"financial\",VALUE(LEFT(CRCP_y4,4)+1)&\"-\"&TEXT(VALUE(MID(CRCP_y4,3,2)+2),\"00\"),VALUE(LEFT(CRCP_y4,4)+1))","v":2016},{"$f":"IF(dms_RPT=\"financial\",VALUE(LEFT(CRCP_y5,4)+1)&\"-\"&TEXT(VALUE(MID(CRCP_y5,3,2)+2),\"00\"),VALUE(LEFT(CRCP_y5,4)+1))","v":2017},{"$f":"IF(dms_RPT=\"financial\",VALUE(LEFT(CRCP_y6,4)+1)&\"-\"&TEXT(VALUE(MID(CRCP_y6,3,2)+2),\"00\"),VALUE(LEFT(CRCP_y6,4)+1))","v":2018},{"$f":"IF(dms_RPT=\"financial\",VALUE(LEFT(CRCP_y7,4)+1)&\"-\"&TEXT(VALUE(MID(CRCP_y7,3,2)+2),\"00\"),VALUE(LEFT(CRCP_y7,4)+1))","v":2019},{"$f":"IF(dms_RPT=\"financial\",VALUE(LEFT(CRCP_y8,4)+1)&\"-\"&TEXT(VALUE(MID(CRCP_y8,3,2)+2),\"00\"),VALUE(LEFT(CRCP_y8,4)+1))","v":2020},{"$f":"IF(dms_RPT=\"financial\",VALUE(LEFT(CRCP_y9,4)+1)&\"-\"&TEXT(VALUE(MID(CRCP_y9,3,2)+2),\"00\"),VALUE(LEFT(CRCP_y9,4)+1))","v":2021}]
[]
[]
[null,"Previous regulatory control period",{"$f":"IF(dms_RPT=\"financial\",VALUE(LEFT(PRCP_y2,4)-1)&\"-\"&TEXT(VALUE(MID(PRCP_y2,3,2)),\"00\"),VALUE(LEFT(PRCP_y2,4)-1))","v":2007},{"$f":"IF(dms_RPT=\"financial\",VALUE(LEFT(PRCP_y3,4)-1)&\"-\"&TEXT(VALUE(MID(PRCP_y3,3,2)),\"00\"),VALUE(LEFT(PRCP_y3,4)-1))","v":2008},{"$f":"IF(dms_RPT=\"financial\",VALUE(LEFT(PRCP_y4,4)-1)&\"-\"&TEXT(VALUE(MID(PRCP_y4,3,2)),\"00\"),VALUE(LEFT(PRCP_y4,4)-1))","v":2009},{"$f":"IF(dms_RPT=\"financial\",VALUE(LEFT(PRCP_y5,4)-1)&\"-\"&TEXT(VALUE(RIGHT(PRCP_y5,2)-1),\"00\"),VALUE(LEFT(PRCP_y5,4)-1))","v":2010},{"$f":"IF(dms_RPT=\"financial\",VALUE(LEFT(CRCP_y1,4)-1)&\"-\"&TEXT(VALUE(RIGHT(CRCP_y1,2)-1),\"00\"),VALUE(LEFT(CRCP_y1,4)-1))","v":2011}]
[]
[]
[null,"Commencing regulatory year",2017,"CRY"]
[]
[null,"Last completed regulatory year",2017,"dms_FinalYear"]
[]
[]
[]
[null,"Source","Reporting"]
[null,"Data quality (actual, estimate, public, consolidated)","Consolidated",null,"Use Consolidated for the Consolidated Confidential version\nUse Public for the Consolidated Public version"]
[null,"Amended RIN submission - amendment reason","Updated on 7 December 2018 - see D19/5923 (AB) THEN public version sent on 22 January 2019 - see D19/32572 & D19/33063"]
[null,"Submission Date","30/04/2018","dms_SubmissionDate","Please enter date this file submitted to AER (dd/mm/yyyy)"]
[null,"EBSS - First application of scheme in forthcoming period?","No"]
[null,"Sector",{"$f":"INDEX(dms_Sector_List,MATCH(dms_TradingName,dms_TradingName_List))","v":"Electricity"},"dms_Sector","=INDEX(dms_Sector_List,MATCH(dms_TradingName,dms_TradingName_List))"]
[null,"Segment",{"$f":"INDEX(dms_Segment_List,MATCH(dms_TradingName,dms_TradingName_List))","v":"Distribution"},"dms_Segment","=INDEX(dms_Segment_List,MATCH(dms_TradingName,dms_TradingName_List))"]
[null,"Regulatory Year Ending",{"$f":"IF(dms_MultiYear_Flag=1,LEFT(dms_Specified_FinalYear,2)&RIGHT(dms_Specified_FinalYear,2),INDEX(dms_RYE_Formula_Result,MATCH(dms_Model,dms_Model_List)))","v":"2017"},"dms_RYE","=IF(dms_MultiYear_Flag=1,LEFT(dms_Specified_FinalYear,2)&RIGHT(dms_Specified_FinalYear,2),INDEX(dms_RYE_Formula_Result,MATCH(dms_Model,dms_Model_List)))"]
[null,"Reporting Period Type",{"$f":"INDEX(dms_RPT_List,MATCH(dms_TradingName,dms_TradingName_List))","v":"Calendar"},"dms_RPT","=INDEX(dms_RPT_List,MATCH(dms_TradingName,dms_TradingName_List))"]
[null,"Model or RIN Type","ARR","dms_Model","Drop down selection"]
[null,"Security Classification","Public","dms_Classification","Always Public"]
[null,"Template - version no.",5,"dms_TemplateNumber"]
[null,"Dollar $ real month",{"$f":"INDEX(dms_RPTMonth_List,MATCH(dms_TradingName,dms_TradingName_List))","v":"December"},"dms_RPTMonth","=INDEX(dms_RPTMonth_List,MATCH(dms_TradingName,dms_TradingName_List))"]
[null,"Dollar $ real  (the last month before the FRCP_y1)",{"$f":"CONCATENATE(dms_RPTMonth)&\" \"&VALUE((LEFT(dms_CRCP_FinalYear_Result,2)&RIGHT(dms_CRCP_FinalYear_Result,2)))","v":"December 2017"},"dms_DollarReal","=IF(SUM(dms_SingleYear_Model)>0,CONCATENATE(dms_RPTMonth)&\" \"&VALUE((LEFT(CRY,2))&RIGHT(CRY,2)),CONCATENATE(dms_RPTMonth)&\" \"&VALUE((LEFT(dms_CRCP_FinalYear_Result,2)&RIGHT(dms_CRCP_FinalYear_Result,2))))"]
[null,"Dollar $ real previous year (PRCP_y5)","June 2014","dms_DollarReal_Prev","=IF(SUM(dms_SingleYear_Model)>0,CONCATENATE(dms_RPTMonth)&\" \"&VALUE(((LEFT(CRY,2))&RIGHT(CRY,2))-1),CONCATENATE(dms_RPTMonth)&\" \"&VALUE(((LEFT(dms_CRCP_FirstYear_Result,2)&RIGHT(dms_CRCP_FirstYear_Result,2))))-1)"]
[null,"Form of control",{"$f":"INDEX(dms_FormControl_List,MATCH(dms_TradingName,dms_TradingName_List))","v":"Revenue cap"},"dms_FormControl","=INDEX(dms_FormControl_List,MATCH(dms_TradingName,dms_TradingName_List))"]
[null,"Calendar Year for table 3.6 data",{"$f":"IF(dms_RPT=\"Calendar\",dms_RYE,VALUE(dms_RYE)-1)","v":"2017"},"dms_0306_Year","=IF(dms_RPT=\"Calendar\",dms_RYE,VALUE(dms_RYE)-1)"]
[null,"RIN response - version no.",1,"dms_RINversion"]
[null,"Jurisdiction",{"$f":"INDEX(dms_JurisdictionList,MATCH(dms_TradingName,dms_TradingName_List))","v":"Vic"},"dms_Jurisdiction","=INDEX(dms_JurisdictionList,MATCH(dms_TradingName,dms_TradingName_List))"]
[null,"Backcast Multiyear EB, CA or ARR?",0,"dms_MultiYear_Flag","1=y, 0-n"]
[null,null,2013,"dms_Specified_FinalYear","The result here is returned to dms_CRCP_FinalYear_Result if dms_MultiYear_Flag is set to 1"]
[null,"Single Year Model T/F",{"$f":"IF(dms_Model=\"EB\",1,0)","v":0},"dms_EB"]
[null,null,{"$f":"IF(dms_Model=\"CA\",1,0)","v":0},"dms_CA","=dms_SingleYear_Model"]
[null,null,{"$f":"IF(dms_Model=\"ARR\",1,0)","v":1},"dms_ARR"]
[null,"Single Year Final Year Reference","CRY","dms_SingleYear_FinalYear_Ref","This is the reference for EB, CA & ARR RINs"]
[null,"Single Year Final Year Result",{"$f":"INDIRECT(dms_SingleYear_FinalYear_Ref)","v":2017},"dms_SingleYear_FinalYear_Result","=INDIRECT(dms_SingleYear_FinalYear_Ref)",null,null,null,"Formula errors OK"]
[null,"FRCP length in years",{"$f":"INDEX(dms_FRCPlength_List,MATCH(dms_TradingName,dms_TradingName_List))","v":5},"dms_FRCPlength_Num","=INDEX(dms_FRCPlength_List,MATCH(dms_TradingName,dms_TradingName_List))"]
[null,"Multi Year Final Year Reference",{"$f":"INDEX(dms_FinalYear_List,MATCH(dms_FRCPlength_Num,dms_FRCPlength_Num_List))","v":"dms_FRCP_y5"},"dms_MultiYear_FinalYear_Ref","=INDEX(dms_FinalYear_List,MATCH(dms_FRCPlength_Num,dms_FRCPlength_Num_List))"]
[null,"Multi Year Final Year Result",{"$f":"IF(dms_MultiYear_Flag=0,INDIRECT(dms_MultiYear_FinalYear_Ref),dms_Specified_FinalYear)","v":2021},"dms_MultiYear_FinalYear_Result","=IF(dms_MultiYear_Flag=0,INDIRECT(dms_MultiYear_FinalYear_Ref),dms_Specified_FinalYear)",null,null,null,"Formula errors OK"]
[null,"CRCP length in years",{"$f":"INDEX(dms_CRCPlength_List,MATCH(dms_TradingName,dms_TradingName_List))","v":5},"dms_CRCPlength_Num","=INDEX(dms_CRCPlength_List,MATCH(dms_TradingName,dms_TradingName_List))"]
[null,"CRCP Final Year Reference",{"$f":"INDEX(dms_CFinalYear_List,MATCH(dms_CRCPlength_Num,dms_CRCPlength_Num_List))","v":"CRCP_y5"},"dms_CRCP_FinalYear_Ref","=INDEX(dms_CFinalYear_List,MATCH(dms_CRCPlength_Num,dms_CRCPlength_Num_List))"]
[null,"CRCP First Year Result",{"$f":"INDEX(dms_CRCP_years,MATCH(dms_CRCPlength_Num,dms_CRCP_index))","v":2012},"dms_CRCP_FirstYear_Result","=INDEX(dms_CRCP_years,MATCH(dms_CRCPlength_Num,dms_CRCP_index))"]
[null,"CRCP Final Year Result",{"$f":"IF(dms_MultiYear_Flag=0,(IF(SUM(dms_SingleYear_Model)>0,CRY,dms_CRCP_yZ)),dms_Specified_FinalYear)","v":2017},"dms_CRCP_FinalYear_Result","=IF(dms_MultiYear_Flag=0,(IF(SUM(dms_SingleYear_Model)>0,CRY,dms_CRCP_yZ)),dms_Specified_FinalYear)"]
[null,"Table 6.6.3 - Public lighting repair - no. business days",{"$f":"INDEX(dms_663_List,MATCH(dms_TradingName,dms_TradingName_List))","v":2},"dms_663"]
[null,"Distribution Determination Reference",{"$f":"INDEX(dms_DeterminationRef_List,MATCH(dms_TradingName,dms_TradingName_List))","v":"2016-20 Distribution Determination"},"dms_DeterminationRef"]
[null,"Backcast templates only - unit of measure ","$0s","dms_Backcast_UOM","If the cover sheet is for Backcast data ensure to apply dms_Backcast_UOM named range to this field. Otherwise, do not apply this named range."]
[null,"EB/CA Unit of Measure for Monetary Values","$0s","dms_dollar_nom_UOM","If the cover sheet is attached to an EB files make sure this field is set"]
[null,"Is this Submission File a Subset File","NO","dms_Partial"]
[null,"discard this record?","NO","dms_DISCARD","If record is to be discarded from DB set this flag to YES"]
[null,"CBD Feeder for this business",{"$f":"INDEX(dms_CBD_flag,MATCH(dms_TradingName,dms_TradingName_List))","v":0},"dms_CBD_flag_NSP"]
[null,"Urban Feeder for this business",{"$f":"INDEX(dms_Urban_flag,MATCH(dms_TradingName,dms_TradingName_List))","v":0},"dms_Urban_flag_NSP"]
[null,"Short rural Feeder for this business",{"$f":"INDEX(dms_ShortRural_flag,MATCH(dms_TradingName,dms_TradingName_List))","v":"YES"},"dms_ShortRural_flag_NSP"]
[null,"Long rural Feeder for this business",{"$f":"INDEX(dms_LongRural_flag,MATCH(dms_TradingName,dms_TradingName_List))","v":"YES"},"dms_LongRural_flag_NSP"]
[null,"USES NAMED RANGES FLAG","yes","dms_Defined_Names_Used"]
[]
[]
[null,"REGULATORY YEARS FOR MULTI RYE SUBMISSIONS"]
[null,"Multiple RYE flag","NO","dms_Multi_RYE_flag"]
[null,null,"Manually specify RYE","Named ranges to apply"]
[null,null,2013,"dms_RYE_01"]
[null,null,2014,"dms_RYE_02"]
[null,null,2015,"dms_RYE_03"]
[null,null,2016,"dms_RYE_04"]
[null,null,2017,"dms_RYE_05"]

{"sheet":"2.11 Labour","index":4,"n_rows":36,"n_cols":4,"rows_kept":36,"cut":false,"hidden":false,"merged":[]}
[null,{"$f":"(LOOKUP(dms_Model,dms_Model_List,dms_Worksheet_List))","v":"ANNUAL REPORTING STATEMENT"}]
[null,{"$f":"dms_TradingName","v":"Powercor Australia"}]
[null,{"$f":"CONCATENATE(\"Annual Reporting RIN Response \",CRY)","v":"Annual Reporting RIN Response 2017"}]
[null,"2.11 LABOUR "]
[]
[null,"Tables 2.11.1 and 2.11.2 deliberately omitted."]
[]
[null,"2.11.3 - LABOUR / NON-LABOUR EXPENDITURE SPLIT"]
[null,"2.11.3.1 - Opex"]
[null,null,{"$f":"CRY","v":2017}]
[null,null,"$0's, nominal"]
[null,null,"Opex "]
[null,"In-house labour expenditure"]
[null,"Labour expenditure outsourced to related parties"]
[null,"Labour expenditure outsourced to unrelated parties"]
[null,"Controllable non-labour expenditure"]
[null,"Uncontrollable non-labour expenditure"]
[null,"Total",{"$f":"SUM(C13:C17)","v":0}]
[]
[null,"Reconciliation with Opex worksheets - SCS","Opex"]
[null,"Total including margins",{"$f":"dms_Total_Actual_Opex","v":214079760.14771},{"$f":"IF(ROUND(C18,0)=ROUND(dms_Total_Actual_Opex,0),\"OK\",\"Error\")","v":"Error"}]
[]
[]
[null,"2.11.3.2 - Capex"]
[null,null,{"$f":"CRY","v":2017}]
[null,null,"$0's, nominal"]
[null,null,"Capex"]
[null,"In-house labour expenditure"]
[null,"Labour expenditure outsourced to related parties"]
[null,"Labour expenditure outsourced to unrelated parties"]
[null,"Controllable non-labour expenditure"]
[null,"Uncontrollable non-labour expenditure"]
[null,"Total",{"$f":"SUM(C28:C32)","v":0}]
[]
[null,"Reconciliation with Capex & Opex worksheets - SCS","Capex"]
[null,"Total including margins",{"$f":"dms_Total_Actual_Capex","v":424257598.98000002},{"$f":"IF(ROUND(C33,0)=ROUND(dms_Total_Actual_Capex,0),\"OK\",\"Error\")","v":"Error"}]

{"sheet":"3.6 Quality of services","index":5,"n_rows":74,"n_cols":4,"rows_kept":74,"cut":false,"hidden":false,"merged":[]}
[null,{"$f":"(LOOKUP(dms_Model,dms_Model_List,dms_Worksheet_List))","v":"ANNUAL REPORTING STATEMENT"}]
[null,{"$f":"dms_TradingName","v":"Powercor Australia"}]
[null,{"$f":"CONCATENATE(\"Annual Reporting RIN Response \",CRY)","v":"Annual Reporting RIN Response 2017"}]
[null,"3.6 QUALITY OF SERVICES"]
[]
[null,"3.6.5 - QUALITY OF SUPPLY METRICS"]
[null,null,null,"Volume"]
[null,null,"Units",{"$f":"CRY","v":2017}]
[null,"Over voltage events - due to high voltage injection","number",1]
[null,"Customers receiving over-voltage - due to high voltage injection","number",82]
[null,"Over voltage events - due to lightning","number",0]
[null,"Customers receiving over-voltage - due to lightning","number",70]
[null,"Over voltage events - due to voltage regulation or other cause","number",11]
[null,"Customers receiving over-voltage - due to voltage regulation or other cause","number",304]
[null,"Voltage variations - steady state (zone sub)","number",2814]
[null,"Voltage variations - one minute (zone sub)","number",28]
[null,"Voltage variations - 10 seconds (zone sub) Min<0.7","number",754]
[null,"Voltage variations - 10 seconds (zone sub) Min<0.8","number",298]
[null,"Voltage variations - 10 seconds (zone sub) Min<0.9","number",837]
[null,"Voltage variations - steady state (feeder)","number",53290]
[null,"Voltage variations - % zone subs monitored","(per cent)",1]
[null,"Voltage variations - % feeders monitored","(per cent)",0.95]
[]
[null,"3.6.6 - COMPLAINTS - TECHNICAL QUALITY OF SUPPLY"]
[null,null,null,"Volume"]
[null,null,"Units",{"$f":"CRY","v":2017}]
[null,"3.6.6.1 - TECHNICAL QUALITY OF SUPPLY"]
[null,"Number of complaints - technical quality of supply","number",5]
[null,"3.6.6.2 - PERCENTAGE OF COMPLAINTS BY CATEGORY"]
[null,"Low voltage supply","(per cent)",0.4]
[null,"Voltage dips","(per cent)",0]
[null,"Voltage swell","(per cent)",0.4]
[null,"Voltage spike (impulsive transient)","(per cent)",0.2]
[null,"Waveform distortion","(per cent)",0]
[null,"TV or radio interference","(per cent)",0]
[null,"Solar related","(per cent)",0]
[null,"Noise from appliances","(per cent)",0]
[null,"Other","(per cent)",0]
[null,"3.6.6.3 - PERCENTAGE OF COMPLAINTS BY LIKELY CAUSE"]
[null,"Network equipment faulty","(per cent)",0]
[null,"Network interference by NSP equipment","(per cent)",0]
[null,"Network interference by another customer","(per cent)",0]
[null,"Network limitation","(per cent)",0]
[null,"Customer internal problem","(per cent)",0.2]
[null,"No problem identified","(per cent)",0.2]
[null,"Environmental","(per cent)",0]
[null,"Other","(per cent)",0.6]
[]
[]
[]
[null,"3.6.7 - CUSTOMER SERVICE METRICS"]
[null,null,null,"Volume"]
[null,null,"Unit",{"$f":"CRY","v":2017}]
[null,"3.6.7.1 - TIMELY PROVISIONS OF SERVICES"]
[null,"Number of connections made","number",89298]
[null,"Number of connections not made on or before agreed date","number",2826]
[null,"3.6.7.2 - TIMELY REPAIR OF FAULTY STREET LIGHTS"]
[null,"Street lights - average monthly number \"out\"","number",575]
[null,"Street lights - not repaired by \"fix by\" date","number",6]
[null,"Street lights - average number of days to repair","number",2.91]
[null,"Total number of street lights","number",170676]
[null,"3.6.7.3 - CALL CENTRE PERFORMANCE"]
[null,"Calls to call centre fault line","number",226194]
[null,"Calls to fault line answered within 30 seconds","number",62417]
[null,"Calls to fault line - average waiting time before call answered","number",16]
[null,"Call centre - number of overload events","number",0]
[null,"Percentage of calls abandoned","(per cent)",7.1000000000000004E-3]
[null,"3.6.7.4 - NUMBER OF CUSTOMER COMPLAINTS"]
[null,"Complaint - reliability of supply","number",58]
[null,"Complaint - technical quality of supply","number",5]
[null,"Complaint - administrative process or customer service","number",24]
[null,"Complaint - connection or augmentation","number",153]
[null,"Complaint - other","number",38]
[null,"Total number of complaints","number",278]

{"sheet":"3.6.8 Network-feeders","index":6,"n_rows":426,"n_cols":23,"rows_kept":426,"cut":false,"hidden":false,"merged":[[10,10,10,14],[11,11,11,12],[11,13,11,14],[11,18,11,19],[11,15,12,15],[11,10,12,10],[10,15,10,19],[11,16,11,17],[5,6,5,8],[5,1,5,4],[11,8,12,8],[11,9,12,9],[11,20,12,20],[10,20,10,22],[11,21,11,22],[10,1,12,1],[10,2,12,2],[10,3,12,3],[10,4,12,4],[10,7,12,7],[11,5,12,5],[11,6,12,6],[10,5,10,6],[10,8,10,9]]}
[null,{"$f":"(LOOKUP(dms_Model,dms_Model_List,dms_Worksheet_List))","v":"ANNUAL REPORTING STATEMENT"}]
[null,{"$f":"dms_TradingName","v":"Powercor Australia"}]
[null,{"$f":"CONCATENATE(\"Annual Reporting RIN Response \",CRY)","v":"Annual Reporting RIN Response 2017"}]
[null,"3.6 QUALITY OF SERVICES"]
[]
[null,"Did the MAIFI parameter of the STPIS apply during the period?",null,null,null,"Yes","** IMPORTANT\nPlease ensure this question is answered correctly. Your response will affect other tables throughout this workbook and will determine which cells are grey and which are input cells. "]
[]
[]
[]
[null,"3.6.8 - NETWORK FEEDER RELIABILITY"]
[null,"Feeder ID / name","Description of the service area for the feeder","Feeder classification\n\n(drop down)","Number of distribution customers","Length of high voltage distribution lines",null,"Maximum demand\n(MVA)","Energy not supplied\n(MWh)",null,"Unplanned Outages",null,null,null,null,"Planned Outages",null,null,null,null,"Momentary feeder outages"]
[null,null,null,null,null,"Overhead","Underground",null,"Unplanned","Planned","Total number of unplanned outages","Unplanned customer minutes off-supply (SAIDI)",null,"Unplanned interruptions\n(SAIFI)",null,"Total number of planned outages","Planned customer minutes off-supply (SAIDI)",null,"Planned interruptions\n(SAIFI)",null,"Total number of momentary feeder outages","Momentary interruptions due to feeder outages (MAIFI)"]
[null,null,null,null,null,null,null,null,null,null,null,"Including excluded events and MEDs","After removing excluded events and MED","Including excluded events and MEDs","After removing excluded events and MED",null,"Including MEDs","After removing  MED","Including MEDs","After removing  MED",null,"Including excluded events and MEDs","After removing excluded events and MED"]
[null,"AC024","Sunshine CSC","Rural Short",2,1.65943,7.1734000000000006E-2,0.13700000000000001,0,0,0,0,0,0,0,0,0,0,0,0,0,0,0]
[null,"AC025","Sunshine CSC","Rural Short",4,0.78386999999999996,1.2062740000000001,0.13700000000000001,0,0.372,0,0,0,0,0,1,228.75,228.75,1,1,0,0,0]
[null,"AC026","Sunshine CSC","Rural Short","-",0.32194,0.14679,0,0,0,0,0,0,0,0,0,0,0,0,0,0,0,0]
[null,"AC031","Sunshine CSC","Urban",11,3.5700799999999999,1.168428,1.82,0.32900000000000001,3.9470000000000001,1,20.818181818181799,20.818181818181799,9.0909090909089996E-2,9.0909090909089996E-2,3,250.09090909090901,250.09090909090901,0.27272727272726999,0.27272727272726999,0,0,0]
[null,"AC032","Sunshine CSC","Rural Short","-",0.35203000000000001,0.251336,0,0,0,0,0,0,0,0,0,0,0,0,0,0,0,0]
[null,"AC033","Sunshine CSC","Urban","-",0,0,0,0,0,0,0,0,0,0,0,0,0,0,0,0,0,0]
[null,"AL002","Sunshine CSC","Urban",288,6.5724,1.7108699999999999,3.645,2.5999999999999999E-2,1.2999999999999999E-2,0,1.0902777777777799,1.0902777777777799,1.041666666667E-2,1.041666666667E-2,1,0.54513888888888995,0.54513888888888995,3.4722222222199998E-3,3.4722222222199998E-3,1,0.99305555555556002,0.99305555555556002]
[null,"AL004","Sunshine CSC","Urban","-",0,0,0,0,0,0,0,0,0,0,0,0,0,0,0,0,0,0]
[null,"AL005","Sunshine CSC","Urban","-",0,0.80469000000000002,0,0,0,0,0,0,0,0,0,0,0,0,0,0,0,0]
[null,"AL006","Sunshine CSC","Urban",1964,9.7683099999999996,0.29792999999999997,4.1230000000000002,0.374,0.255,2,15.8564154786151,15.8564154786151,7.8411405295319994E-2,7.8411405295319994E-2,1,10.814663951120201,10.814663951120201,3.004073319756E-2,3.004073319756E-2,0,0,0]
[null,"AL007","Sunshine CSC","Urban",947,4.4406100000000004,1.3572200000000001,2.4700000000000002,2.2480000000000002,7.2999999999999995E-2,4,161.907074973601,161.907074973601,1.14572333685322,1.14572333685322,2,5.2798310454065502,5.2798310454065502,2.006335797254E-2,2.006335797254E-2,0,0,0]
[null,"AL011","Sunshine CSC","Urban",126,3.6488900000000002,0.99922999999999995,3.8439999999999999,0.505,1.145,1,16.7460317460318,16.7460317460318,0.42063492063491997,0.42063492063491997,3,37.928571428571402,37.928571428571402,0.20634920634921,0.20634920634921,0,0,0]
[null,"AL012","Sunshine CSC","Urban",1358,6.3167,0.22570999999999999,2.988,4.4960000000000004,0.215,6,226.04639175257699,226.04639175257699,1.0795287187039699,1.0795287187039699,2,10.795287187039801,10.795287187039801,4.1237113402060002E-2,4.1237113402060002E-2,0,0,0]
[null,"AL013","Sunshine CSC","Urban",2,0,0.84216000000000002,1.8129999999999999,0,0,0,0,0,0,0,0,0,0,0,0,0,0,0]
[null,"AL014","Sunshine CSC","Urban",2233,12.14648,1.5397970000000001,5.4779999999999998,0.76900000000000002,1.3919999999999999,6,21.4823107926556,21.4823107926556,0.10210479175996,0.10210479175996,11,38.889386475593398,38.889386475593398,0.14106583072100001,0.14106583072100001,1,1.00537393640842,1.00537393640842]
[null,"ART023","Horsham CSC","Rural Long",1008,220.1217,1.9583930000000001,5.0549999999999997,4.2990000000000004,1.673,9,102.157738095238,102.157738095238,0.38988095238095,0.38988095238095,12,39.7638888888889,39.7638888888889,9.8214285714290001E-2,9.8214285714290001E-2,0,0,0]
[null,"ART031","Horsham CSC","Rural Short",1464,182.38321999999999,0.56511,5.0940000000000003,0.55200000000000005,4.9000000000000002E-2,18,19.202868852459002,19.202868852459002,0.11475409836066,0.11475409836066,2,1.68989071038251,1.68989071038251,2.73224043716E-3,2.73224043716E-3,0,0,0]
[null,"ART033","Horsham CSC","Rural Long",1916,914.60496000000001,1.0312300000000001,4.5810000000000004,5.32,6.1829999999999998,67,207.00104384133601,207.00104384133601,1.9728601252609601,1.9728601252609601,39,240.58663883089801,240.58663883089801,0.72599164926931004,0.72599164926931004,1,1,1]
[null,"ART034","Horsham CSC","Rural Short",2333,25.69059,1.02332,5.3310000000000004,5.8999999999999997E-2,0.17399999999999999,2,1.53236176596657,1.53236176596657,1.2430347192460001E-2,1.2430347192460001E-2,8,4.5117873981997398,4.5117873981997398,0.12730390055721999,0.12730390055721999,1,0.99957136733818996,0.99957136733818996]
[null,"BAN001","Ballarat CSC","Urban",2677,11.80217,5.8108899999999997,8.8460000000000001,2.1339999999999999,7.5999999999999998E-2,4,33.993276055285797,33.993276055285797,0.12177810982443001,0.12177810982443001,2,1.21404557340306,1.21404557340306,3.100485618229E-2,3.100485618229E-2,2,1.9988793425476299,1.9988793425476299]
[null,"BAN002","Ballarat CSC","Urban",1062,16.748480000000001,2.811817,9.6359999999999992,13.427,2.1749999999999998,3,161.27495291902099,161.27495291902099,1.1092278719397399,1.1092278719397399,2,26.123352165724999,26.123352165724999,0.17137476459510001,0.17137476459510001,5,5.0809792843691204,5.0809792843691204]
[null,"BAN003","Ballarat CSC","Urban",509,7.7552599999999998,1.693346,11.452,1.1930000000000001,0,2,9.6286836935167006,9.6286836935167006,8.8408644400790007E-2,8.8408644400790007E-2,0,0,0,0,0,1,1,1]
[null,"BAN004","Ballarat CSC","Urban",1212,11.232699999999999,5.6152499999999996,8.7669999999999995,3.694,2.1000000000000001E-2,2,53.870462046204601,53.870462046204601,0.99669966996699999,0.99669966996699999,1,0.30115511551155,0.30115511551155,8.2508250825000001E-4,8.2508250825000001E-4,2,2.00907590759076,2.00907590759076]
[null,"BAN005","Ballarat CSC","Urban",1713,7.8592599999999999,1.20855,8.3719999999999999,11.340999999999999,4.9660000000000002,12,194.633975481611,194.633975481611,1.90776415645067,1.90776415645067,9,85.218914185639207,85.218914185639207,0.33274956217162999,0.33274956217162999,2,1.9906596614127301,1.9906596614127301]
[null,"BAN006","Ballarat CSC","Rural Long",5023,412.48509999999999,5.7599400000000003,8.7669999999999995,19.331,0.37,68,281.78857256619602,281.78857256619602,1.78538721879354,1.78538721879354,20,5.3947839936293098,5.3947839936293098,7.5054748158470005E-2,7.5054748158470005E-2,3,3.0023890105514601,3.0023890105514601]
[null,"BAN007","Ballarat CSC","Rural Short",4508,32.757080000000002,3.32077,8.8460000000000001,1.504,0.24199999999999999,14,23.4838065661047,23.4838065661047,0.20874001774622999,0.20874001774622999,2,3.7761756876663699,3.7761756876663699,1.131322094055E-2,1.131322094055E-2,0,0,0]
[null,"BAN008","Ballarat CSC","Rural Long",3546,245.71859000000001,5.5744069999999999,9.32,8.8420000000000005,10.468,52,145.12831359278101,140.148618161309,2.01212633953751,1.98815566835871,44,171.804568527919,171.804568527919,0.76254935138183999,0.76254935138183999,0,0,0]
[null,"BAN009","Ballarat CSC","Rural Long",3174,358.73579999999998,5.5224659999999997,9.1219999999999999,46.652999999999999,4.5140000000000002,37,655.917139256459,284.71455576559498,3.1947069943289099,2.20069313169502,19,63.466288594833003,63.466288594833003,0.27536231884057999,0.27536231884057999,4,3.99464398235666,2.0085066162570899]
[null,"BAN011","Ballarat CSC","Rural Long",3815,570.94545000000005,26.855436999999998,10.347,36.944000000000003,3.165,125,753.64508519003903,685.50956749672298,5.4144167758846704,5.19659239842726,77,64.556487549148102,64.556487549148102,0.51192660550459002,0.51192660550459002,5,5.0013106159895102,5.0013106159895102]
[null,"BAN013","Ballarat CSC","Urban",544,4.9554200000000002,1.6700429999999999,7.5430000000000001,0.65400000000000003,0,1,11.297794117647101,11.297794117647101,0.10845588235294,0.10845588235294,0,0,0,0,0,0,0,0]
[null,"BAN015","Ballarat CSC","Rural Short",5025,48.240360000000003,6.2799620000000003,7.4240000000000004,5.181,0.41499999999999998,16,98.608557213930396,98.215522388059696,1.2501492537313399,1.24935323383084,6,7.8937313432835801,7.8937313432835801,5.5920398009950002E-2,5.5920398009950002E-2,2,2.00736318407959,2.00736318407959]
[null,"BAS011","Ballarat CSC","Rural Long",3604,992.89574000000005,11.455500000000001,10.898999999999999,14.567,4.5410000000000004,75,311.48085460599299,311.48085460599299,1.62791342952275,1.62791342952275,69,97.096281908989994,97.096281908989994,1.6320754716981101,1.6320754716981101,2,1.98557158712542,1.98557158712542]
[null,"BAS012","Ballarat CSC","Urban",2298,8.0256100000000004,3.2243599999999999,8.1750000000000007,6.19,6.3E-2,7,113.81070496083601,5.7493472584856402,1.0822454308094001,8.1810269799829999E-2,3,1.16362053959965,1.16362053959965,7.8328981723199999E-3,7.8328981723199999E-3,1,0.99956483899043003,0.99956483899043003]
[null,"BAS013","Ballarat CSC","Rural Short",4368,41.414900000000003,9.7225839999999994,10.939,19.510999999999999,4.7690000000000001,21,231.36240842490801,25.396978021978001,1.1481227106227101,0.13507326007326001,12,56.547161172161204,56.547161172161204,0.18223443223443,0.18223443223443,4,3.99565018315019,2.9832875457875501]
[null,"BAS014","Ballarat CSC","Urban",2638,12.13162,2.1823299999999999,8.4510000000000005,5.3630000000000004,7.0000000000000001E-3,11,85.716451857467803,85.716451857467803,1.2338893100833901,1.2338893100833901,1,0.1194086429113,0.1194086429113,2.3881728582259999E-2,2.3881728582259999E-2,0,0,0]
[null,"BAS021","Ballarat CSC","Rural Long",5670,550.91818000000001,14.240716000000001,10.544,5.444,8.4730000000000008,64,80.197883597883603,68.515343915343905,1.08253968253968,1.0500881834215201,110,124.817107583774,124.817107583774,0.53421516754849996,0.53421516754849996,0,0,0]
[null,"BAS022","Ballarat CSC","Rural Long",6613,541.65287999999998,12.255592999999999,11.215,12.798999999999999,7.1,82,173.54453349463199,67.798124905489203,1.4959927415696299,0.90322092847421998,85,96.2676546196885,96.2676546196885,0.64509299863904002,0.64509299863904002,1,0.99228791773779002,0.99228791773779002]
[null,"BAS023","Ballarat CSC","Rural Short",4253,113.01955,3.50509,9.1219999999999999,10.824999999999999,1.3759999999999999,26,171.11756407241899,170.98495179873001,1.3348224782506499,1.33435222196097,8,21.746531859863602,21.746531859863602,6.6776393134259995E-2,6.6776393134259995E-2,1,0.99412179637902998,0.99412179637902998]
[null,"BAS024","Ballarat CSC","Rural Short",4529,17.66686,18.082640999999999,10.189,1.2310000000000001,0.99099999999999999,17,14.714285714285699,14.714285714285699,0.16891145948333,0.16891145948333,4,11.842570103775699,11.842570103775699,5.9615809229409997E-2,5.9615809229409997E-2,1,1.02472952086553,1.02472952086553]
[null,"BAS034","Ballarat CSC","Urban",3449,19.471579999999999,1.4573700000000001,6.8710000000000004,0.61499999999999999,1.5269999999999999,9,11.6535227602203,10.026964337489099,0.10321832415193,8.7271672948680004E-2,6,28.9298347347057,28.9298347347057,0.10031893302406,0.10031893302406,0,0,0]
[null,"BBD013","Mildura CSC","Rural Short",99,82.950429999999997,0.42836299999999999,11.097,37.792000000000002,4.4649999999999999,11,806.84848484848499,806.84848484848499,3.0404040404040402,3.0404040404040402,5,95.323232323232304,95.323232323232304,0.40404040404039998,0.40404040404039998,11,15.6767676767677,12.8282828282828]
[null,"BBD014","Mildura CSC","Rural Long",95,210.28443999999999,1.1547000000000001,9.1620000000000008,10.391999999999999,0,13,213.389473684211,213.389473684211,0.48421052631578998,0.48421052631578998,0,0,0,0,0,8,9.1368421052631703,9.1368421052631703]
[null,"BBD021","Mildura CSC","Rural Short",210,81.781139999999994,0.48240300000000003,6.0030000000000001,3.6619999999999999,0,3,100.938095238095,100.938095238095,0.85714285714285998,0.85714285714285998,0,0,0,0,0,7,6.9666666666666597,6.9666666666666597]
[null,"BBD022","Mildura CSC","Urban",5,4.2670199999999996,0.35674899999999998,5.2519999999999998,0.52400000000000002,0,1,21.4,21.4,0.2,0.2,0,0,0,0,0,7,7,7]
[null,"BET001","Bendigo CSC","Rural Long",5036,415.05507999999998,11.0634,13.585000000000001,26.132000000000001,6.0129999999999999,31,393.29924543288303,60.812748212867398,1.6193407466243099,0.26270849880857999,68,90.502978554408301,90.502978554408301,0.38621922160444999,0.38621922160444999,0,0,0]
[null,"BET002","Bendigo CSC","Urban",3862,17.48657,0.61165000000000003,12.23,9.9760000000000009,5.6559999999999997,17,149.22604867944099,149.196530295184,1.4847229414811001,1.48446400828586,25,84.601242879337093,84.601242879337093,0.32573795960641999,0.32573795960641999,5,5.9805800103573299,5.9805800103573299]
[null,"BET003","Bendigo CSC","Urban",301,10.99884,1.0423199999999999,3.665,0,0.01,0,0,0,0,0,1,0.44186046511628002,0.44186046511628002,3.32225913621E-3,3.32225913621E-3,0,0,0]
[null,"BET004","Bendigo CSC","Rural Short",3155,192.69565,5.0221,9.9589999999999996,8.7230000000000008,9.6000000000000002E-2,34,155.14389857369301,137.256101426307,1.3175911251981001,1.30142630744849,11,1.71378763866878,1.71378763866878,4.9128367670360003E-2,4.9128367670360003E-2,2,2.0012678288430998,2.0012678288430998]
[null,"BET005","Bendigo CSC","Rural Long",3362,329.02656000000002,6.9209699999999996,10.836,2.5939999999999999,4.3440000000000003,46,41.484830458060699,23.783164782867299,0.56751933372992003,0.55145746579416999,13,69.460440214158197,69.460440214158197,0.26769779892920997,0.26769779892920997,3,3.0154669839381301,2.0047590719809598]
[null,"BET006","Bendigo CSC","Rural Short",4518,63.104640000000003,5.0708130000000002,12.867000000000001,1.0209999999999999,7.4720000000000004,14,12.0509074811864,5.1208499335989401,4.8694112439130001E-2,4.3160690571050001E-2,21,88.156706507304094,88.156706507304094,0.29924745462593999,0.29924745462593999,3,2.9962372731297,2.9962372731297]
[null,"BET007","Bendigo CSC","Rural Short",3340,136.51084,3.2737599999999998,7.2110000000000003,10.973000000000001,2.6669999999999998,18,261.26257485029902,261.26257485029902,1.96047904191617,1.96047904191617,40,63.500598802395203,63.500598802395203,0.27425149700599,0.27425149700599,1,1.0029940119760501,1.0029940119760501]
[null,"BET008","Bendigo CSC","Urban",2350,13.458500000000001,3.515603,9.92,0.187,0.27800000000000002,2,3.0923404255319098,3.0923404255319098,3.2765957446809997E-2,3.2765957446809997E-2,2,4.5851063829787204,4.5851063829787204,3.0638297872340001E-2,3.0638297872340001E-2,0,0,0]
[null,"BGO011","Bendigo CSC","Urban",579,0.98651999999999995,3.9961030000000002,4.6210000000000004,0.29299999999999998,0.32900000000000001,1,10.941278065630399,8.59240069084629,0.99654576856649002,0.99481865284974003,3,12.3039723661485,12.3039723661485,6.3903281519859995E-2,6.3903281519859995E-2,0,0,0]
[null,"BGO012","Bendigo CSC","Urban",2458,11.33141,1.585663,7.25,3.9359999999999999,1.0209999999999999,6,87.226606997559003,87.226606997559003,2.0349877949552502,2.0349877949552502,5,22.619609438567899,22.619609438567899,0.11269324654189999,0.11269324654189999,3,3.0069161920260399,3.0069161920260399]
[null,"BGO013","Bendigo CSC","Rural Short",3850,175.74069,14.065989999999999,10.358000000000001,9.5589999999999993,1.6359999999999999,18,174.25246753246799,14.7890909090909,2.0454545454545401,1.0319480519480499,18,29.813506493506502,29.813506493506502,0.12467532467532,0.12467532467532,1,1.0018181818181799,1.0018181818181799]
[null,"BGO021","Bendigo CSC","Urban",259,3.8219999999999997E-2,2.906863,0,0,0,0,0,0,0,0,0,0,0,0,0,0,0,0]
[null,"BGO022","Bendigo CSC","Urban",4429,18.686620000000001,2.5572430000000002,9.2420000000000009,0.67400000000000004,1.6E-2,8,13.4635357868593,13.4635357868593,0.10295777827952,0.10295777827952,1,0.32738767216075998,0.32738767216075998,3.2738767216080003E-2,3.2738767216080003E-2,2,2.0045156920298099,2.0045156920298099]
[null,"BGO023","Bendigo CSC","Rural Long",2776,547.61918000000003,4.0704000000000002,11.752000000000001,4.3170000000000002,4.0540000000000003,51,47.6873198847262,47.675792507204598,1.0482708933717599,1.0367435158501399,19,44.778458213256499,44.778458213256499,0.28350144092218998,0.28350144092218998,1,0.9963976945245,0.9963976945245]
[null,"BGO024","Bendigo CSC","Urban",590,0,5.93377,9.8000000000000007,0.33800000000000002,8.9999999999999993E-3,3,6.8033898305084701,6.8033898305084701,1.05932203389831,1.05932203389831,1,0.1864406779661,0.1864406779661,3.38983050847E-3,3.38983050847E-3,1,0.98474576271185998,0.98474576271185998]
[null,"BLT016","Sunshine CSC","Urban",601,10.182169999999999,7.17441,11.61,0.186,1.022,1,2.3061564059900199,2.3061564059900199,1.164725457571E-2,1.164725457571E-2,2,12.685524126455901,12.685524126455901,4.8252911813639998E-2,4.8252911813639998E-2,0,0,0]
[null,"BLT017","Sunshine CSC","Urban",982,10.663639999999999,3.2886099999999998,7.306,5.024,0.185,8,98.546843177189402,98.546843177189402,0.47148676171079001,0.47148676171079001,5,3.62423625254582,3.62423625254582,2.24032586558E-2,2.24032586558E-2,1,0.99898167006109995,0.99898167006109995]
[null,"BLT019","#","Urban","-",3.9246699999999999,4.3242999999999997E-2,12.795,0,0,0,0,0,0,0,0,0,0,0,0,0,0,0]
[null,"BLT020","Sunshine CSC","Urban",65,7.3750900000000001,0.850047,6.7530000000000001,2.4329999999999998,0,2,48.861538461538501,48.861538461538501,0.35384615384614998,0.35384615384614998,0,0,0,0,0,0,0,0]
[null,"BLT021","Sunshine CSC","Urban",1061,10.15944,1.07338,5.2130000000000001,0.23799999999999999,0.49,3,6.4919886899151704,6.4919886899151704,1.885014137606E-2,1.885014137606E-2,4,13.347785108388299,13.347785108388299,4.052780395853E-2,4.052780395853E-2,2,2,2]
[null,"BLT022","Sunshine CSC","Urban",1333,12.4001,4.8992800000000001,5.2519999999999998,4.234,2.0419999999999998,14,99.390847711928004,99.390847711928004,2.4111027756939301,2.4111027756939301,6,47.929482370592702,47.929482370592702,9.9774943735930002E-2,9.9774943735930002E-2,0,0,0]
[null,"BLT023","#","Urban","-",3.5054699999999999,1.0100119999999999,13.901,0,0,0,0,0,0,0,0,0,0,0,0,0,0,0]
[null,"BLT030","Sunshine CSC","Urban",2248,10.263299999999999,0.14731,5.3310000000000004,2.657,0.17100000000000001,8,79.435943060498204,79.435943060498204,1.1712633451957299,1.1712633451957299,2,5.1023131672597897,5.1023131672597897,2.402135231317E-2,2.402135231317E-2,0,0,0]
[null,"BLT031","Sunshine CSC","Urban",1159,3.0680399999999999,1.5179,3.5150000000000001,1.365,0.10299999999999999,3,63.165660051768803,63.165660051768803,1.0647109577221701,1.0647109577221701,1,4.7886108714409001,4.7886108714409001,3.192407247627E-2,3.192407247627E-2,0,0,0]
[null,"BLT19-BLT23","Sunshine CSC","Urban",1,{"$error":"#N/A"},{"$error":"#N/A"},26.696000000000002,0,0,0,0,0,0,0,0,0,0,0,0,0,0,0]
[null,"BMH003","Sunshine CSC","Rural Long",2874,319.97201000000001,3.6709000000000001,5.3440000000000003,3.1360000000000001,14.113,43,65.852818371607498,64.942588726513605,1.23173277661795,1.2223382045929001,40,296.326374391093,296.326374391093,1.1812804453723,1.1812804453723,1,0.98886569241474997,0.98886569241474997]
[null,"BMH004","Sunshine CSC","Rural Short",3337,23.80162,8.2834599999999998,6.3490000000000002,4.0810000000000004,1.1559999999999999,10,108.460293676955,108.460293676955,1.0848067126161201,1.0848067126161201,5,30.730596344021599,30.730596344021599,0.17350913994605999,0.17350913994605999,3,2.9772250524423201,2.9772250524423201]
[null,"BMH005","Sunshine CSC","Rural Short",4032,62.944980000000001,9.6316100000000002,10.207000000000001,1.802,2.379,13,25.801587301587301,25.801587301587301,1.078125,1.078125,14,34.0659722222222,34.0659722222222,0.17931547619047999,0.17931547619047999,1,0.98338293650793995,0.98338293650793995]
[null,"BMH006","Sunshine CSC","Rural Long",1587,228.21193,19.072410000000001,8.2780000000000005,27.832999999999998,6.2960000000000003,29,438.24133585381202,393.65721487082499,4.13043478260869,3.2892249527410198,16,99.125393824826702,99.125393824826702,0.39571518588532001,0.39571518588532001,2,1.9886578449905501,1.9886578449905501]
[null,"CDN001","Warrnambool CSC","Rural Long",1764,288.91696000000002,0.10176,7.4640000000000004,27.006,12.522,46,537.19387755102002,76.9166666666667,1.65249433106576,1.3010204081632599,23,249.08673469387799,249.08673469387799,1.3928571428571399,1.3928571428571399,1,1.0005668934240399,1.0005668934240399]
[null,"CDN002","Warrnambool CSC","Rural Long",513,203.66585000000001,0.10248,2.2909999999999999,7.4119999999999999,2.9790000000000001,25,573.06822612085796,42.214424951267098,0.76998050682260999,0.34892787524365998,27,230.288499025341,230.288499025341,1.21247563352827,1.21247563352827,0,0,0]
[null,"CDN003","Warrnambool CSC","Urban",1665,15.988860000000001,8.3820000000000006E-2,5.0549999999999997,0.17399999999999999,3.1840000000000002,2,5.6702702702702696,5.6702702702702696,4.8648648648649997E-2,4.8648648648649997E-2,2,104.065465465465,104.065465465465,1.0096096096096101,1.0096096096096101,0,0,0]
[null,"CDN004","Warrnambool CSC","Rural Long",782,383.39400000000001,0.17777000000000001,2.2509999999999999,1.121,5.976,41,98.608695652173907,98.608695652173907,0.64322250639386003,0.64322250639386003,42,525.50127877237901,525.50127877237901,2.1969309462915598,2.1969309462915598,0,0,0]
[null,"CDN006","Warrnambool CSC","Rural Long",994,433.32909999999998,0.25638,3.3570000000000002,5.0149999999999997,7.5119999999999996,32,283.82595573440602,283.82595573440602,3.5442655935613701,3.5442655935613701,9,425.13480885311901,425.13480885311901,1.49798792756539,1.49798792756539,0,0,0]
[null,"CHA003","Bendigo CSC","Rural Short",1149,69.531030000000001,1.0200499999999999,4.0650000000000004,1.0209999999999999,10.46,22,44.485639686684102,44.414273281113999,0.33855526544822001,0.33768494342907002,32,455.91993037423799,455.91993037423799,1.77806788511749,1.77806788511749,1,0.98781549173194005,0.98781549173194005]
[null,"CHA005","Bendigo CSC","Rural Long",1333,303.37563,0.26232,5.6440000000000001,3.2170000000000001,21.738,69,82.165791447862006,80.2873218304576,0.56489122280570003,0.56339084771193004,63,555.23930982745696,555.23930982745696,2.1035258814703699,2.1035258814703699,3,3.0075018754688698,3.0075018754688698]
[null,"CHA006","Bendigo CSC","Rural Long",1859,895.75968,1.2449999999999999E-2,8.0410000000000004,5.2670000000000003,8.0519999999999996,61,209.10112963959099,112.418504572351,1.12426035502959,0.97579343733190005,149,319.66810112963998,319.66810112963998,1.37278106508876,1.37278106508876,3,2.9962345346960801,1.9989241527703101]
[null,"CHM011","Horsham CSC","Rural Long",1533,810.12546999999995,0.10736999999999999,3.7970000000000002,4.7450000000000001,0.74299999999999999,48,245.996738421396,245.996738421396,1.9249836921069801,1.9249836921069801,10,38.499021526418801,38.499021526418801,0.21004566210046,0.21004566210046,5,5.0052185257664696,5.0052185257664696]
[null,"CLC001","Ballarat CSC","Urban",1676,8.3909000000000002,1.16797,6.0819999999999999,9.7000000000000003E-2,0.155,1,2.3860381861575202,1.7255369928401001,3.9379474940329999E-2,3.8782816229119998E-2,9,3.8221957040572798,3.8221957040572798,1.909307875895E-2,1.909307875895E-2,1,1,1]
[null,"CLC002","Ballarat CSC","Urban",2916,15.33839,0.98716000000000004,7.3449999999999998,0.47199999999999998,0.376,4,8.7095336076817595,8.6100823045267507,0.10528120713306,0.10493827160494,16,6.9317558299039801,6.9317558299039801,8.8134430727019999E-2,8.8134430727019999E-2,2,2.0034293552812099,2.0034293552812099]
[null,"CLC003","Ballarat CSC","Rural Long",1550,529.29147,0.31991999999999998,10.86,18.763000000000002,27.324999999999999,47,202.39161290322599,198.92516129032299,3.3425806451612798,3.3387096774193501,77,294.75290322580599,294.75290322580599,1.1470967741935501,1.1470967741935501,2,1.99741935483871,1.99741935483871]
[null,"CLC004","Ballarat CSC","Rural Long",2216,219.23739,2.27745,6.95,1.73,11.180999999999999,42,34.107851985559599,33.1493682310469,0.23555956678699999,0.23285198555957001,62,220.459386281588,220.459386281588,0.96074007220216995,0.96074007220216995,2,2.0126353790613698,2.0126353790613698]
[null,"CLC005","Ballarat CSC","Rural Short",2189,69.529039999999995,15.869866999999999,10.148999999999999,37.533999999999999,14.872,18,944.65829145728605,565.38967565098199,5.5541343079031398,4.55687528551851,24,374.31566925536799,374.31566925536799,1.27455459113751,1.27455459113751,3,2.9972590223846498,2.9972590223846498]
[null,"CLC006","Ballarat CSC","Rural Long",2719,509.84777000000003,15.060287000000001,7.5819999999999999,31.942,19.649999999999999,68,592.75616035307098,295.99558661272499,2.6432511952923901,1.63515998528871,49,364.65685913939001,364.65685913939001,1.0643618977565299,1.0643618977565299,4,4.0003677822728996,3.0007355645457801]
[null,"CLC007","Ballarat CSC","Rural Long",3408,356.29507000000001,10.210813,11.334,15.723000000000001,22.573,58,339.96068075117398,175.581572769953,2.8518192488262999,2.0774647887323998,122,488.06103286385002,488.06103286385002,2.6041666666666701,2.6041666666666701,4,4.0149647887324003,4.0149647887324003]
[null,"CME014","Shepparton CSC","Rural Short",3509,91.788849999999996,8.5300100000000008,9.8330000000000002,9.5939999999999994,1.696,34,318.444286121402,217.11940723852999,4.0775149615274904,3.0743801652892699,34,56.283556568823002,56.283556568823002,0.22969506982046001,0.22969506982046001,1,1.0025648332858399,1.0025648332858399]
[null,"CME015","Shepparton CSC","Rural Short",1158,97.890370000000004,3.5394999999999999,8.1349999999999998,14.105,0.34899999999999998,32,298.33074265975802,186.79620034542299,3.2849740932642399,2.26770293609672,6,7.3799654576856604,7.3799654576856604,0.14766839378238,0.14766839378238,7,7.0250431778928997,7.0250431778928997]
[null,"CME016","Shepparton CSC","Rural Long",2107,285.70321999999999,9.6998270000000009,6.6340000000000003,11.487,1.071,43,318.94447081158,206.712387280494,4.23777883246321,3.2130991931656401,11,29.7489321309919,29.7489321309919,0.11390602752729,0.11390602752729,7,7.02373042240154,7.02373042240154]
[null,"CME021","Shepparton CSC","Rural Short",1772,25.038129999999999,3.6987899999999998,7.1479999999999997,23.838999999999999,3.4000000000000002E-2,11,543.91986455981896,443.09085778781002,5.0406320541760596,4.0423250564334099,2,0.78442437923250996,0.78442437923250996,5.6433408577879998E-2,5.6433408577879998E-2,1,0.99887133182844001,0.99887133182844001]
[null,"CME022","Shepparton CSC","Urban",666,16.726379999999999,0.24559,11.571,45.265000000000001,0.26400000000000001,5,403.34684684684697,302.04354354354399,4.03453453453454,3.0315315315315301,2,2.3528528528528501,2.3528528528528501,1.9519519519519999E-2,1.9519519519519999E-2,0,0,0]
[null,"CMN001","Bendigo CSC","Rural Long",4617,398.78233999999998,5.9553130000000003,8.7639999999999993,30.776,18.116,55,577.81394845137504,74.674680528481701,1.4509421702404199,0.41823695040068998,188,340.12973792506,340.12973792506,1.6426250812215699,1.6426250812215699,3,2.9954515919428202,2.9954515919428202]
[null,"CMN002","Bendigo CSC","Rural Long",1340,262.31101000000001,5.6106170000000004,2.5099999999999998,0.52600000000000002,7.9249999999999998,22,24.7022388059702,24.7022388059702,0.15,0.15,58,371.957462686567,371.957462686567,2.0074626865671599,2.0074626865671599,1,1.0044776119403001,1.0044776119403001]
[null,"CMN003","Bendigo CSC","Rural Long",2891,234.58904000000001,25.472602999999999,6.6929999999999996,37.42,3.0670000000000002,38,837.31234866828095,402.909028017987,2.6648218609477698,2.2704946385333802,54,68.634382566585998,68.634382566585998,0.38256658595642001,0.38256658595642001,1,0.60843998616396,0]
[null,"CMN004","Bendigo CSC","Rural Long",1681,220.18727000000001,21.65896,4.5019999999999998,2.3130000000000002,4.5519999999999996,22,74.440809042236793,74.440809042236793,1.2522308149910799,1.2522308149910799,47,146.46995835812001,146.46995835812001,1.58001189767995,1.58001189767995,4,3.9881023200475898,2.9922665080309399]
[null,"CMN005","Bendigo CSC","Urban",1023,18.863440000000001,0.92068000000000005,7.6890000000000001,1.948,1.8360000000000001,7,45.682306940371497,45.682306940371497,0.44770283479960998,0.44770283479960998,18,43.063538611925701,43.063538611925701,0.70869990224829005,0.70869990224829005,1,0.99706744868035002,0.99706744868035002]
[null,"COB011","Warrnambool CSC","Rural Long",721,258.74531000000002,0,4.9359999999999999,20.388999999999999,12.451000000000001,40,679.39112343966701,193.29680998613,2.4424410540915402,1.44660194174757,35,414.86546463245497,414.86546463245497,2.2815533980582501,2.2815533980582501,10,10.002773925104,9.0041608876560293]
[null,"COB012","Warrnambool CSC","Urban",35,11.571429999999999,0.660084,6.4370000000000003,0,13.425000000000001,0,0,0,0,0,1,213,213,1,1,0,0,0]
[null,"COB021","Warrnambool CSC","Rural Short",14,38.801360000000003,0.14898700000000001,4.8570000000000002,0.30399999999999999,0,1,6.0714285714285703,6.0714285714285703,7.1428571428569995E-2,7.1428571428569995E-2,0,0,0,0,0,0,0,0]
[null,"CRO013","Geelong CSC","Rural Long",4705,213.52726000000001,2.6947899999999998,9.32,3.1859999999999999,7.2969999999999997,30,55.692029755579199,55.692029755579199,1.12943676939426,1.12943676939426,86,127.549202975558,127.549202975558,0.70393198724760997,0.70393198724760997,1,1.0093517534537699,1.0093517534537699]
[null,"CRO014","Geelong CSC","Urban",2,1.03647,8.4700000000000001E-3,3.0009999999999999,0,5.6890000000000001,0,0,0,0,0,2,450,450,2,2,0,0,0]
[null,"CRO021","Geelong CSC","Urban",592,4.39534,0.46632000000000001,1.8959999999999999,3.8029999999999999,5.0000000000000001E-3,6,252.29729729729701,252.29729729729701,2.2854729729729701,2.2854729729729701,1,0.33783783783783999,0.33783783783783999,3.3783783783800001E-3,3.3783783783800001E-3,0,0,0]
[null,"CRO022","Geelong CSC","Urban",4103,19.820720000000001,2.80131,8.4510000000000005,1.948,8.4930000000000003,13,34.816719473555899,34.7245917621253,0.88301242992932005,0.88276870582500999,23,151.82183767974701,151.82183767974701,0.50499634413842998,0.50499634413842998,0,0,0]
[null,"CRO023","Geelong CSC","Urban",298,4.0522600000000004,0.35038999999999998,1.659,0.65200000000000002,1.17,2,98.785234899328898,98.785234899328898,1.0335570469798701,1.0335570469798701,3,177.09060402684599,177.09060402684599,0.75838926174497001,0.75838926174497001,0,0,0]
[null,"CRO024","Geelong CSC","Rural Short","-",0.37453999999999998,0.37606000000000001,0.158,0,0,0,0,0,0,0,0,0,0,0,0,0,0,0]
[null,"CRO031","Geelong CSC","Urban",1,0.90486999999999995,0,6.2,14.733000000000001,0,2,265,265,2.0000000000000102,2.0000000000000102,0,0,0,0,0,1,1,1]
[null,"CRO032","Geelong CSC","Rural Short",7,2.0276900000000002,0.17641999999999999,0.158,2E-3,6.2E-2,1,5,5,1,1,1,190,190,1,1,0,0,0]
[null,"CRO033","Geelong CSC","Urban",19,1.97634,0.28910000000000002,2.4089999999999998,2.5000000000000001E-2,9.9440000000000008,1,1,1,1,1,2,395.47368421052602,395.47368421052602,1.7894736842105201,1.7894736842105201,0,0,0]
[null,"CRO034","Geelong CSC","Urban",1129,6.5589000000000004,0.27599000000000001,4.226,0.37,0.96499999999999997,3,14.1532329495128,14.1532329495128,7.9716563330380005E-2,7.9716563330380005E-2,14,36.954827280779398,36.954827280779398,0.21523472099203,0.21523472099203,0,0,0]
[null,"CTN001","Bendigo CSC","Rural Long",1643,857.44046000000003,1.1999200000000001,6.7720000000000002,14.621,6.9219999999999997,20,375.82471089470499,182.41509433962301,3.1022519780888702,2.10529519172246,66,177.93791844187501,177.93791844187501,0.79793061472914995,0.79793061472914995,0,0,0]
[null,"CTN002","Bendigo CSC","Rural Long",1135,514.69991000000005,1.0767500000000001,2.5499999999999998,3.5790000000000002,2.778,12,253.004405286344,58.1762114537445,1.5022026431718101,0.50308370044052997,41,196.403524229075,196.403524229075,0.68634361233480001,0.68634361233480001,0,0,0]
[null,"CTN003","Bendigo CSC","Rural Long",1217,775.37418000000002,1.1703600000000001,2.8679999999999999,5.6989999999999998,1.698,26,319.373048479869,108.618734593262,1.73623664749383,0.72801972062449005,12,95.1626951520132,95.1626951520132,0.28430566967954002,0.28430566967954002,0,0,0]
[null,"CTN004","Bendigo CSC","Rural Long",1223,231.64545000000001,0.19778000000000001,3.4260000000000002,8.827,3.593,8,322.62796402289501,122.97710547833201,1.1668029435813601,0.16353229762877999,21,131.30498773507799,131.30498773507799,0.46688470973016999,0.46688470973016999,3,3,3]
[null,"CTN005","Bendigo CSC","Rural Short",653,8.0317299999999996,0.50256999999999996,1.673,2.69,7.0000000000000001E-3,5,273.911179173047,10.719754977029099,1.1531393568146999,0.15620214395099999,1,0.67993874425726997,0.67993874425726997,9.1883614088800001E-3,9.1883614088800001E-3,0,0,0]
[null,"CTN006","Bendigo CSC","Rural Long",1974,989.94780000000003,0.75214999999999999,5.7370000000000001,15.95,3.4350000000000001,35,383.806990881459,177.54103343464999,1.80040526849038,0.80395136778116005,41,82.657548125633198,82.657548125633198,0.35460992907800998,0.35460992907800998,0,0,0]
[null,"DDL011","Geelong CSC","Rural Short",4505,36.098509999999997,7.5317129999999999,9.4779999999999998,1.569,0.159,22,33.061487236403998,33.061487236403998,0.22397336293007999,0.22397336293007999,3,3.3544950055493898,3.3544950055493898,1.2874583795779999E-2,1.2874583795779999E-2,2,2.02441731409544,2.02441731409544]
[null,"DDL012","Geelong CSC","Rural Short",4093,53.235259999999997,8.0256100000000004,9.5960000000000001,8.032,2.8239999999999998,33,202.42707060835599,202.085023210359,1.34326899584657,1.3430246762765701,10,71.187148790618096,71.187148790618096,0.59516247251404997,0.59516247251404997,2,1.99926704129001,1.99926704129001]
[null,"DDL013","Geelong CSC","Rural Short",4570,67.993480000000005,5.8377299999999996,9.0039999999999996,8.3930000000000007,6.4000000000000001E-2,21,188.58205689277901,188.58205689277901,2.4689277899343498,2.4689277899343498,6,1.4479212253829301,1.4479212253829301,1.225382932166E-2,1.225382932166E-2,4,4.0231947483588701,4.0231947483588701]
[null,"DDL014","Geelong CSC","Rural Short",4109,50.86365,7.5150730000000001,7.819,3.379,0.34799999999999998,19,88.724020442930197,88.724020442930197,1.17376490630323,1.17376490630323,6,9.1482112436115806,9.1482112436115806,3.9669019226090001E-2,3.9669019226090001E-2,3,2.9975663178388898,2.9975663178388898]
[null,"DDL021","Geelong CSC","Rural Short",3504,66.180459999999997,3.728707,7.6609999999999996,0.23899999999999999,3.5000000000000003E-2,16,5.7711187214611899,5.7711187214611899,3.5673515981739998E-2,3.5673515981739998E-2,6,0.84132420091324001,0.84132420091324001,2.9680365296800001E-2,2.9680365296800001E-2,2,1.99543378995434,1.99543378995434]
[null,"DDL022","Geelong CSC","Urban",4448,20.644279999999998,3.2143199999999998,7.5819999999999999,1.2010000000000001,0.52200000000000002,9,33.09375,33.09375,0.21425359712229999,0.21425359712229999,5,14.3914118705036,14.3914118705036,4.2266187050359998E-2,4.2266187050359998E-2,1,0.99775179856115004,0.99775179856115004]
[null,"DDL023","Geelong CSC","Rural Short",1569,37.983960000000003,1.2824359999999999,7.8979999999999997,2.1789999999999998,7.4999999999999997E-2,8,121.865519439133,121.865519439133,0.91204588910133999,0.91204588910133999,2,4.1848311026131304,4.1848311026131304,1.4021669853409999E-2,1.4021669853409999E-2,6,5.1708094327597003,5.1708094327597003]
[null,"DDL024","Geelong CSC","Rural Short",3134,59.156080000000003,9.0723800000000008,7.4240000000000004,1.909,4.5999999999999999E-2,18,57.6480536056158,57.608168474792599,1.0433950223356701,1.04307594128909,1,1.3895979578813,1.3895979578813,4.14805360562E-3,4.14805360562E-3,1,1.0076579451180601,1.0076579451180601]
[null,"DLF001","Citipower CSC","Urban",1441,1.286E-2,5.2280179999999996,3.823,3.0000000000000001E-3,0,1,9.5072866065229994E-2,9.5072866065229994E-2,1.3879250520500001E-3,1.3879250520500001E-3,0,0,0,0,0,0,0,0]
[null,"DLF004","Citipower CSC","Urban","-",0,2.3024070000000001,0,0,0,0,0,0,0,0,0,0,0,0,0,0,0,0]
[null,"ECA001","Shepparton CSC","Rural Short",2203,23.33334,2.4371200000000002,7.306,0.29899999999999999,0.20699999999999999,9,6.4049024058102599,6.4049024058102599,6.1733999092150001E-2,6.1733999092150001E-2,2,4.4348615524285098,4.4348615524285098,5.1293690422149998E-2,5.1293690422149998E-2,0,0,0]
[null,"ECA003","Shepparton CSC","Rural Short",2463,61.035719999999998,3.2255600000000002,8.9250000000000007,2.2639999999999998,7.0819999999999999,20,42.253755582622802,42.253755582622802,0.17986195696304999,0.17986195696304999,21,132.17661388550499,132.17661388550499,0.59317904993909998,0.59317904993909998,2,2.00527811611855,2.00527811611855]
[null,"ECA005","Shepparton CSC","Rural Short",853,150.64511999999999,2.90741,7.306,7.0389999999999997,5.9240000000000004,32,118.805392731536,118.805392731536,1.16998827667057,1.16998827667057,10,99.985932004689303,99.985932004689303,0.41969519343493999,0.41969519343493999,2,1.9917936694021099,1.9917936694021099]
[null,"ECA007","Shepparton CSC","Rural Short",1,25.96067,0.98081300000000005,6.1210000000000004,0,20.248999999999999,0,0,0,0,0,1,554,554,1,1,0,0,0]
[null,"ECA010","Shepparton CSC","Rural Short",1783,88.054540000000003,4.6359399999999997,7.1870000000000003,5.0250000000000004,4.968,34,119.80650588895099,107.280426247897,1.3011777902411601,1.2249018508132301,6,118.443634324173,118.443634324173,0.42793045429052001,0.42793045429052001,1,1.0005608524957901,1.0005608524957901]
[null,"ECA012","Shepparton CSC","Rural Long",2001,286.78762999999998,6.8849299999999998,5.766,1.087,2.4079999999999999,37,28.0939530234883,28.0939530234883,0.15492253873063,0.15492253873063,29,62.253873063468298,62.253873063468298,0.29685157421288999,0.29685157421288999,7,7.0019990004997696,7.0019990004997696]
[null,"EHK021","Bendigo CSC","Urban",298,10.13907,4.57782,9.202,13.407,0.23400000000000001,3,306.98322147650998,54.5,2.0234899328859002,1.02013422818792,3,5.3590604026845599,5.3590604026845599,1.342281879195E-2,1.342281879195E-2,0,0,0]
[null,"EHK022","Bendigo CSC","Rural Short",3508,47.316969999999998,10.92869,11.712,8.1809999999999992,1.383,11,99.243158494868894,58.909350057012503,1.23945267958951,1.09692132269099,6,16.774515393386601,16.774515393386601,9.1220068415049996E-2,9.1220068415049996E-2,0,0,0]
[null,"EHK023","Bendigo CSC","Rural Long",2862,280.4486,6.5169300000000003,8.2859999999999996,30.027999999999999,6.8040000000000003,36,532.43256464011199,161.15443745632399,3.1691125087351599,2.07197763801538,35,120.64360587002101,120.64360587002101,0.53249475890984999,0.53249475890984999,5,4.9678546470999203,4.9678546470999203]
[null,"EHK024","Bendigo CSC","Rural Long",2798,849.87338,4.09131,10.436999999999999,23.928999999999998,3.74,67,347.65761258041499,29.652609006433199,0.44067190850608001,0.19478198713367001,286,54.342744817727002,54.342744817727002,0.75553967119371002,0.75553967119371002,1,0.99606862044317002,0.99606862044317002]
[null,"EHK031","Bendigo CSC","Rural Short",3800,29.36036,6.3956099999999996,8.2070000000000007,7.38,0.17499999999999999,5,166.365789473684,166.365789473684,1.0289473684210499,1.0289473684210499,3,3.9360526315789501,3.9360526315789501,3.1315789473680002E-2,3.1315789473680002E-2,1,1.00842105263158,1.00842105263158]
[null,"EHK032","Bendigo CSC","Rural Short",131,2.5964999999999998,0.21643999999999999,0.79700000000000004,0,0.183,0,0,0,0,0,1,59.618320610687,59.618320610687,0.41984732824427001,0.41984732824427001,0,0,0]
[null,"EHK033","Bendigo CSC","Urban",1231,7.5624599999999997,1.5900799999999999,6.1749999999999998,1.73,0.32100000000000001,5,36.197400487408601,36.197400487408601,0.12103980503656001,0.12103980503656001,3,6.7262388302193301,6.7262388302193301,6.8237205523959996E-2,6.8237205523959996E-2,2,2.0008123476848101,2.0008123476848101]
[null,"EHK034","Bendigo CSC","Urban",866,3.4682300000000001,2.65171,7.29,9.98,0,3,194.64896073903,194.64896073903,2.0127020785219401,2.0127020785219401,0,0,0,0,0,0,0,0]
[null,"ETSA001","Warrnambool CSC","Rural Long",310,29.642099999999999,0,0.75,1.0429999999999999,3.0000000000000001E-3,10,697.86774193548399,668.77419354838696,7.0290322580645199,6.0258064516129197,1,1.95483870967742,1.95483870967742,0.97741935483871001,0.97741935483871001,0,0,0]
[null,"ETSA003","Mildura CSC","Rural Short",46,26.20918,0,0,0,0,3,517.93478260869597,517.93478260869597,2.9565217391304301,2.9565217391304301,0,0,0,0,0,0,0,0]
[null,"FNS011","Geelong CSC","Rural Short",2059,59.074629999999999,2.71041,8.2140000000000004,0.78500000000000003,2.0470000000000002,18,10.7304516755707,10.7304516755707,6.7022826614860004E-2,6.7022826614860004E-2,21,27.980087421078199,27.980087421078199,0.17435648372997001,0.17435648372997001,0,0,0]
[null,"FNS012","Geelong CSC","Rural Short",4187,30.513629999999999,7.81914,10.939,0.73599999999999999,0.55400000000000005,5,68.070456173871506,68.070456173871506,0.86983520420349003,0.86983520420349003,17,51.209219011225201,51.209219011225201,0.23334129448291999,0.23334129448291999,0,0,0]
[null,"FNS013","Geelong CSC","Urban",3,7.9570000000000002E-2,0,3.12,0,1.0999999999999999E-2,0,0,0,0,0,1,36,36,1,1,0,0,0]
[null,"FNS021","Geelong CSC","Rural Short",2718,71.487669999999994,7.7414300000000003,7.78,2.488,0.42299999999999999,21,37.0540838852097,37.0540838852097,0.36681383370124998,0.36681383370124998,7,6.2980132450331103,6.2980132450331103,4.0470934510669999E-2,4.0470934510669999E-2,0,0,0]
[null,"FNS022","Geelong CSC","Rural Short",1652,152.22989000000001,8.2655100000000008,7.266,7.2320000000000002,3.9140000000000001,32,137.15556900726401,137.15556900726401,4.0726392251816002,4.0726392251816002,17,74.2215496368039,74.2215496368039,0.50242130750604996,0.50242130750604996,0,0,0]
[null,"FNS023","Geelong CSC","Urban","-",6.658E-2,0,12.614000000000001,0,0,0,0,0,0,0,0,0,0,0,0,0,0,0]
[null,"FNS032","Geelong CSC","Rural Short",230,41.353389999999997,2.5929199999999999,4.1470000000000002,0.36499999999999999,0.13600000000000001,18,239.195652173913,239.195652173913,3.09565217391305,3.09565217391305,16,89.408695652173904,89.408695652173904,0.41304347826087001,0.41304347826087001,1,0.99565217391303995,0.99565217391303995]
[null,"GB011","Geelong CSC","Urban",5,0.21473999999999999,2.3392599999999999,5.45,1.577,6.8220000000000001,1,52.4,52.4,0.4,0.4,2,226.6,226.6,1,1,0,0,0]
[null,"GB012","Geelong CSC","Rural Short",23,4.0652100000000004,0.72328000000000003,1.1060000000000001,0.65600000000000003,0.75600000000000001,4,59.478260869565197,59.478260869565197,0.60869565217390997,0.60869565217390997,5,68.608695652173907,68.608695652173907,1.1739130434782601,1.1739130434782601,0,0,0]
[null,"GB014","Geelong CSC","Urban",476,2.4831300000000001,1.7843,3.3570000000000002,4.1000000000000002E-2,1.012,1,3.4285714285714302,3.4285714285714302,1.260504201681E-2,1.260504201681E-2,3,84.460084033613498,84.460084033613498,0.85924369747898999,0.85924369747898999,0,0,0]
[null,"GB031","Geelong CSC","Urban",576,10.09966,0.96453,7.78,4.1520000000000001,5.3999999999999999E-2,10,139.802083333333,139.802083333333,1.7847222222222201,1.7847222222222201,2,1.8315972222222201,1.8315972222222201,5.2083333333299998E-3,5.2083333333299998E-3,2,1.9670138888888899,1.9670138888888899]
[null,"GB032","Geelong CSC","Urban",3,1.0026999999999999,0.20544000000000001,3.1589999999999998,1.913,0,1,88.3333333333333,88.3333333333333,0.33333333333332998,0.33333333333332998,0,0,0,0,0,0,0,0]
[null,"GCY012","Geelong CSC","Urban",701,0.66978000000000004,3.7913589999999999,6.0819999999999999,3.641,0,1,92.078459343794606,92.078459343794606,0.99286733238230995,0.99286733238230995,0,0,0,0,0,0,0,0]
[null,"GCY013","Geelong CSC","Urban",456,0.20132,2.6338710000000001,6.516,0.16300000000000001,0,1,4.3662280701754401,4.3662280701754401,2.412280701754E-2,2.412280701754E-2,0,0,0,0,0,0,0,0]
[null,"GCY014","Geelong CSC","Urban",3376,17.23348,2.5542699999999998,10.663,9.1270000000000007,0,19,142.15195497630299,142.15195497630299,2.2621445497630299,2.2621445497630299,1,4.7393364928899999E-3,4.7393364928899999E-3,5.9241706161000001E-4,5.9241706161000001E-4,1,0.28169431279620999,0.28169431279620999]
[null,"GCY021","Geelong CSC","Urban",295,0,2.029372,2.9220000000000002,0.03,0,0,1.8881355932203401,1.8881355932203401,6.7796610169499998E-3,6.7796610169499998E-3,0,0,0,0,0,0,0,0]
[null,"GCY022","Geelong CSC","Urban",640,1.2236400000000001,2.7623160000000002,7.9379999999999997,0.22,5.1999999999999998E-2,2,4.5812499999999998,4.5812499999999998,0.12812499999999999,0.12812499999999999,3,1.0796874999999999,1.0796874999999999,8.9062500000000003E-2,8.9062500000000003E-2,1,0.98906249999999996,0.98906249999999996]
[null,"GCY023","Geelong CSC","Urban",3361,12.944459999999999,2.331515,9.9120000000000008,0.23300000000000001,0.64400000000000002,6,3.27967866706337,3.2564712883070501,1.7851829812560002E-2,1.7554299315679998E-2,2,9.0511752454626606,9.0511752454626606,3.2728354656350003E-2,3.2728354656350003E-2,3,2.9869086581374602,2.9869086581374602]
[null,"GCY024","Geelong CSC","Urban",2265,8.1962299999999999,1.4778199999999999,5.9240000000000004,0.627,0.22800000000000001,8,26.630022075055201,26.630022075055201,0.20971302428256,0.20971302428256,3,9.68520971302428,9.68520971302428,2.8697571743929999E-2,2.8697571743929999E-2,0,0,0]
[null,"GL011","Geelong CSC","Urban",1128,5.1080300000000003,0.71787699999999999,2.5270000000000001,4.9000000000000002E-2,8.8999999999999996E-2,2,3.08687943262411,3.08687943262411,1.950354609929E-2,1.950354609929E-2,1,5.5851063829787204,5.5851063829787204,1.8617021276600001E-2,1.8617021276600001E-2,1,0.99911347517730997,0.99911347517730997]
[null,"GL012","Geelong CSC","Rural Long",4084,236.31799000000001,16.947050999999998,11.531000000000001,21.503,17.492999999999999,60,278.868021547502,278.868021547502,3.7580803134182199,3.7580803134182199,77,226.866797257591,226.866797257591,0.71523016650342996,0.71523016650342996,2,2.0352595494613102,2.0352595494613102]
[null,"GL013","Geelong CSC","Urban",2118,7.7624700000000004,1.14364,4.1859999999999999,0.27800000000000002,0.29799999999999999,2,13.9721435316336,13.9721435316336,5.7601510859300001E-2,5.7601510859300001E-2,2,15.007082152974499,15.007082152974499,4.390934844193E-2,4.390934844193E-2,1,1,1]
[null,"GL014","Geelong CSC","Urban",2303,11.29928,0.29962,3.5150000000000001,5.8000000000000003E-2,0.48399999999999999,5,2.9318280503690799,2.8154580981328698,2.5618758141549999E-2,2.518454190187E-2,8,24.356491532783298,24.356491532783298,0.14937038645244999,0.14937038645244999,2,2,2]
[null,"GL015","Geelong CSC","Rural Long",4245,385.68432000000001,10.021850000000001,11.334,11.265000000000001,6.0339999999999998,61,151.94299175500601,151.94299175500601,0.99905771495877005,0.99905771495877005,63,81.380918727915201,81.380918727915201,0.43062426383981001,0.43062426383981001,2,2.0096584216725502,2.0096584216725502]
[null,"GL021","Geelong CSC","Urban",4349,15.1797,7.9550000000000001,9.4380000000000006,4.2930000000000001,0.76200000000000001,9,88.495976086456693,88.386065762244201,1.6750977236146201,1.67486778569786,6,15.7141871694642,15.7141871694642,5.219590710508E-2,5.219590710508E-2,0,0,0]
[null,"GL022","Geelong CSC","Urban",3714,11.107860000000001,0.75558999999999998,7.5030000000000001,2.573,2.226,12,60.378836833602598,60.378836833602598,0.89499192245557002,0.89499192245557002,8,52.249865374259599,52.249865374259599,0.16720516962842999,0.16720516962842999,0,0,0]
[null,"GL023","Geelong CSC","Urban",2026,7.9639300000000004,1.68788,5.2919999999999998,0.27600000000000002,0.32300000000000001,4,7.2773938795656496,7.2773938795656496,5.6762092793679997E-2,5.6762092793679997E-2,2,8.5251727541954594,8.5251727541954594,2.1717670286280001E-2,2.1717670286280001E-2,1,1.01431391905232,1.01431391905232]
[null,"GL024","Geelong CSC","Urban",1652,5.9709500000000002,1.8862669999999999,5.8840000000000003,0.43099999999999999,0,2,11.0605326876513,11.0605326876513,0.12832929782082,0.12832929782082,0,0,0,0,0,0,0,0]
[null,"GLE011","Geelong CSC","Urban",303,6.7544500000000003,1.7286999999999999,4.2629999999999999,1.48,0.35199999999999998,3,71.194719471947195,71.194719471947195,1.06930693069307,1.06930693069307,2,16.920792079207899,16.920792079207899,1.08580858085808,1.08580858085808,0,0,0]
[null,"GLE012","Geelong CSC","Urban",4557,18.578849999999999,3.12032,7.8879999999999999,1.32,0.20799999999999999,11,21.176651305683599,21.176651305683599,0.29295589203423,0.29295589203423,4,3.3339916611806002,3.3339916611806002,9.6115865701120004E-2,9.6115865701120004E-2,2,2.0048277375466301,2.0048277375466301]
[null,"GLE013","Geelong CSC","Rural Short",4558,34.822809999999997,6.3883999999999999,5.298,0.438,0.89,11,14.0912681000439,14.0912681000439,8.6880210618690001E-2,8.6880210618690001E-2,11,28.616937253181199,28.616937253181199,9.4120228170249995E-2,9.4120228170249995E-2,1,0.65247915752523,0.65247915752523]
[null,"GLE021","Geelong CSC","Urban",567,3.9384100000000002,0.84948000000000001,6.5730000000000004,0.51500000000000001,3.4000000000000002E-2,3,16.733686067019399,16.733686067019399,0.14462081128748,0.14462081128748,1,1.1146384479717799,1.1146384479717799,3.52733686067E-3,3.52733686067E-3,1,1.00529100529101,1.00529100529101]
[null,"GLE023","Geelong CSC","Urban",1,2.41642,0.48370000000000002,2.589,0,0,0,0,0,0,0,0,0,0,0,0,0,0,0]
[null,"GLE024","Geelong CSC","Rural Short",3163,34.199309999999997,5.8286899999999999,8.6850000000000005,2.464,0.88300000000000001,4,63.5188112551375,63.5188112551375,1.4577932342712601,1.4577932342712601,10,22.7613025608599,22.7613025608599,8.3465064811890005E-2,8.3465064811890005E-2,0,0,0]
[null,"GLE031","Geelong CSC","Rural Short",3510,30.528780000000001,5.72966,8.5649999999999995,4.4969999999999999,0.39700000000000002,12,59.625925925925898,48.090883190883197,0.52792022792022997,0.51595441595442004,6,5.2623931623931597,5.2623931623931597,1.737891737892E-2,1.737891737892E-2,0,0,0]
[null,"GLE032","Geelong CSC","Urban",2670,12.17937,0.93042000000000002,5.4980000000000002,0.873,6.6000000000000003E-2,11,22.434456928839001,22.434456928839001,0.19438202247191,0.19438202247191,2,1.68539325842697,1.68539325842697,2.0599250936329999E-2,2.0599250936329999E-2,1,0.99850187265918,0.99850187265918]
[null,"GLE033","Geelong CSC","Urban",557,6.7631500000000004,0.95430000000000004,3.944,0.93899999999999995,0,2,42.7468581687612,42.7468581687612,0.40035906642729002,0.40035906642729002,0,0,0,0,0,1,1,1]
[null,"GSB011","Bendigo CSC","Rural Short",2265,84.071870000000004,9.1902600000000003,6.5069999999999997,2.4279999999999999,0.86599999999999999,6,49.3222958057395,10.792494481236201,1.0419426048565099,4.5916114790290001E-2,13,17.598675496688699,17.598675496688699,0.14348785871965,0.14348785871965,0,0,0]
[null,"GSB012","Bendigo CSC","Rural Short",2005,188.75851,2.72994,5.3410000000000002,7.8689999999999998,6.01,26,221.644887780549,221.644887780549,4.8533665835411597,4.8533665835411597,32,169.271820448878,169.271820448878,0.66284289276807995,0.66284289276807995,0,0,0]
[null,"GSB013","Bendigo CSC","Rural Short",2345,45.62482,7.2549270000000003,6.1509999999999998,0.82199999999999995,1.7000000000000001E-2,12,18.097228144989302,18.097228144989302,1.0985074626865701,1.0985074626865701,4,0.38166311300639999,0.38166311300639999,4.7761194029849997E-2,4.7761194029849997E-2,0,0,0]
[null,"GSB014","Bendigo CSC","Rural Short",1985,83.038669999999996,9.3308199999999992,5.577,5.9249999999999998,2.4580000000000002,13,157.15365239294701,155.445843828715,3.1581863979848901,3.1531486146095702,33,65.198488664987394,65.198488664987394,0.35969773299747998,0.35969773299747998,0,0,0]
[null,"HSM001","Horsham CSC","Rural Long",1147,495.48223999999999,1.21462,2.9079999999999999,2.0019999999999998,4.7859999999999996,28,109.94158674803801,109.94158674803801,2.1272885789014802,2.1272885789014802,9,262.80819529206599,262.80819529206599,0.64167393199651002,0.64167393199651002,4,4.0156931124673001,4.0156931124673001]
[null,"HSM002","Horsham CSC","Rural Long",1389,680.18323999999996,2.4037500000000001,3.4260000000000002,1.5649999999999999,0.745,36,95.535637149028105,95.535637149028105,1.1907847372210201,1.1907847372210201,6,45.465082793376503,45.465082793376503,0.28725701943844001,0.28725701943844001,1,0.99856011519078003,0.99856011519078003]
[null,"HSM003","Horsham CSC","Rural Long",1671,1001.67132,0.37597000000000003,5.4580000000000002,2.8929999999999998,1.532,31,99.208856971873104,99.208856971873104,2.1472172351885099,2.1472172351885099,13,52.512866546977897,52.512866546977897,0.19150209455416001,0.19150209455416001,1,1.00299222022741,1.00299222022741]
[null,"HSM004","Horsham CSC","Rural Long",2043,1086.07404,0.86936999999999998,4.8600000000000003,5.2569999999999997,7.952,51,175.60058737151201,175.60058737151201,2.6759667156142899,2.6759667156142899,42,265.61135584924102,265.61135584924102,0.91287322564855999,0.91287322564855999,2,2.00293685756241,2.00293685756241]
[null,"HSM005","Horsham CSC","Rural Long",1662,417.43610000000001,0.55898999999999999,5.617,1.9850000000000001,5.6870000000000003,21,66.362815884476504,66.362815884476504,1.1853188929001199,1.1853188929001199,19,190.175090252708,190.175090252708,0.53850782190131996,0.53850782190131996,1,0.99879663056558998,0.99879663056558998]
[null,"HSM006","Horsham CSC","Rural Long",3040,287.92281000000003,5.2366000000000001,10.039,5.4470000000000001,6.6079999999999997,26,94.4759868421053,94.4759868421053,2.4361842105263101,2.4361842105263101,20,114.623355263158,114.623355263158,0.38848684210526002,0.38848684210526002,0,0,0]
[null,"HSM009","Horsham CSC","Urban",3154,17.973780000000001,3.969713,7.569,1.9710000000000001,0.308,10,45.318960050729203,45.318960050729203,1.10336081166772,1.10336081166772,7,7.0837032339885901,7.0837032339885901,4.8826886493340001E-2,4.8826886493340001E-2,3,2.99587824984147,2.99587824984147]
[null,"HSM010","Horsham CSC","Urban",2956,20.855820000000001,2.3433199999999998,11.314,8.4179999999999993,8.1129999999999995,14,121.75,121.75,2.20602165087957,2.20602165087957,17,117.346075778078,117.346075778078,0.43775372124493001,0.43775372124493001,0,0,0]
[null,"HTN001","Warrnambool CSC","Rural Long",786,302.35566,7.2539999999999993E-2,5.2130000000000001,28.747,8.4779999999999998,52,784.40076335877905,784.40076335877905,3.77099236641221,3.77099236641221,20,231.34478371501299,231.34478371501299,0.99618320610686995,0.99618320610686995,3,2.9987277353689601,2.9987277353689601]
[null,"HTN002","Warrnambool CSC","Rural Long",1890,1184.1869200000001,6.6993999999999998,4.5810000000000004,3.5129999999999999,5.8999999999999997E-2,91,147.839682539683,147.71746031746,2.2476190476190401,2.2470899470899499,5,2.4788359788359799,2.4788359788359799,4.2328042328040001E-2,4.2328042328040001E-2,1,0.99788359788360004,0.99788359788360004]
[null,"HTN003","Warrnambool CSC","Rural Long",1845,524.96001999999999,0.65025999999999995,4.4630000000000001,4.3109999999999999,2.0179999999999998,49,178.07317073170699,177.985365853659,1.13712737127371,1.13658536585366,7,83.332249322493197,83.332249322493197,0.26233062330623003,0.26233062330623003,1,0.99783197831977999,0.99783197831977999]
[null,"HTN004","Warrnambool CSC","Rural Long",3317,372.03615000000002,1.677943,8.1750000000000007,2.8010000000000002,6.73,19,46.641543563460999,46.623153451914398,0.56135061802833996,0.56104914078987,37,112.089538739825,112.089538739825,0.43382574615616998,0.43382574615616998,2,2.0042206813385599,2.0042206813385599]
[null,"HTN005","Warrnambool CSC","Rural Long",3005,442.73996,2.7019899999999999,7.2270000000000003,1.82,6.0000000000000001E-3,39,34.5078202995008,34.5078202995008,0.169384359401,0.169384359401,3,0.10881863560732,0.10881863560732,4.99168053245E-3,4.99168053245E-3,7,7.0232945091514196,7.0232945091514196]
[null,"HTN006","Warrnambool CSC","Rural Long",2422,580.28354000000002,0.22756000000000001,6.8319999999999999,2.5019999999999998,9.24,56,71.6655656482246,71.648224607762202,3.1044591246903401,3.1040462427745701,49,264.67630057803501,264.67630057803501,1.16184971098266,1.16184971098266,2,2.00165152766309,2.00165152766309]
[null,"HYT011","Warrnambool CSC","Rural Short",171,107.93796,1.3146899999999999,2.3690000000000002,4.16,1.764,12,407.62573099415198,407.62573099415198,1.4678362573099399,1.4678362573099399,7,172.836257309942,172.836257309942,1.6374269005847999,1.6374269005847999,6,5.9941520467836398,5.9941520467836398]
[null,"KGT002","Mildura CSC","Rural Short",2212,55.655610000000003,0.64602000000000004,7.69,1.0740000000000001,8.1820000000000004,9,23.679475587703401,23.679475587703401,0.10804701627486001,0.10804701627486001,37,180.342676311031,180.342676311031,0.64104882459312995,0.64104882459312995,4,4.0067811934900703,4.0067811934900703]
[null,"KGT003","Mildura CSC","Rural Long",1269,450.94513000000001,0.38235999999999998,4.2679999999999998,14.451000000000001,6.6829999999999998,56,551.72576832151299,145.63829787233999,1.2427107959022801,0.90307328605200998,52,255.141055949567,255.141055949567,0.98975571315997002,0.98975571315997002,1,0.99921197793537997,0.99921197793537997]
[null,"KGT004","Mildura CSC","Rural Long",1184,662.63004000000001,0.18321000000000001,3.6240000000000001,2.9990000000000001,7.7679999999999998,37,140.044763513514,137.940033783784,0.82432432432432001,0.82179054054054002,13,362.73141891891902,362.73141891891902,1.2407094594594601,1.2407094594594601,3,2.2449324324324298,2.2449324324324298]
[null,"KRT012","Warrnambool CSC","Rural Long",1077,302.8655,0.18695999999999999,4.3840000000000003,1.0069999999999999,2.6419999999999999,29,45.815227483751201,45.815227483751201,0.42246982358403001,0.42246982358403001,38,120.185701021356,120.185701021356,0.45496750232125999,0.45496750232125999,1,1.00742804085423,1.00742804085423]
[null,"KRT013","Warrnambool CSC","Rural Long",2380,569.64117999999996,2.19638,7.1870000000000003,6.867,2.3420000000000001,84,115.21554621848701,115.04831932773099,0.71386554621848997,0.71302521008402997,19,39.2920168067227,39.2920168067227,0.14033613445377999,0.14033613445377999,0,0,0]
[null,"KRT022","Warrnambool CSC","Rural Short",2897,100.06952,0.49423,7.74,4.2119999999999997,2.89,55,64.222989299275099,64.044874007594103,0.38798757335174999,0.38729720400414003,11,44.064894718674502,44.064894718674502,0.18674490852605999,0.18674490852605999,1,1.0031066620642,1.0031066620642]
[null,"KRT023","Warrnambool CSC","Rural Short",1575,27.059360000000002,2.5888200000000001,8.0960000000000001,0.42599999999999999,2.2789999999999999,7,6.9714285714285698,6.9714285714285698,4.2539682539679997E-2,4.2539682539679997E-2,21,37.275555555555599,37.275555555555599,0.27238095238095,0.27238095238095,2,2.0019047619047599,2.0019047619047599]
[null,"KRT031","Warrnambool CSC","Urban",163,25.145320000000002,0.50498299999999996,7.8979999999999997,0.99099999999999999,1.0589999999999999,5,18.214723926380401,18.214723926380401,0.22085889570552,0.22085889570552,6,19.466257668711702,19.466257668711702,0.15950920245399,0.15950920245399,2,2.0122699386503098,2.0122699386503098]
[null,"KYM001","Shepparton CSC","Rural Long",1671,452.45490000000001,0.79079999999999995,5.2919999999999998,1.38,6.4249999999999998,45,40.853381208857002,39.171154997007797,0.36624775583482999,0.36445242369837999,91,190.245362058648,190.245362058648,0.80789946140035995,0.80789946140035995,1,1,1]
[null,"KYM002","Shepparton CSC","Rural Short",1059,43.161490000000001,0.93757999999999997,4.3049999999999997,0.53700000000000003,7.1890000000000001,12,18.114258734655301,18.114258734655301,0.13597733711047999,0.13597733711047999,17,242.68083097261601,242.68083097261601,0.72237960339942997,0.72237960339942997,3,3.01227573182247,3.01227573182247]
[null,"KYM003","Shepparton CSC","Rural Long",1154,232.18332000000001,2.0762700000000001,5.766,16.579000000000001,2.734,41,538.97400346620498,101.712305025997,2.36221837088388,1.33622183708838,38,88.882149046793799,88.882149046793799,0.35181975736568,0.35181975736568,2,2.00259965337955,2.00259965337955]
[null,"KYM004","Shepparton CSC","Rural Long",1516,294.80385999999999,1.0970800000000001,5.8049999999999997,9.4329999999999998,0.60299999999999998,64,254.87203166226899,174.01451187335101,1.00395778364116,0.92941952506596004,12,16.3007915567282,16.3007915567282,0.11147757255937001,0.11147757255937001,10,10.0105540897097,8.0085751978892006]
[null,"KYM005","Shepparton CSC","Urban",1966,12.57246,2.0886999999999998,5.9630000000000001,0.35899999999999999,0.20499999999999999,6,12.5427263479146,12.5427263479146,7.2227873855539998E-2,7.2227873855539998E-2,4,7.1642929806714104,7.1642929806714104,8.9521871820959997E-2,8.9521871820959997E-2,2,2.0096642929806698,2.0096642929806698]
[null,"KYM006","Shepparton CSC","Rural Short",470,105.88961,0.34081899999999998,6.9109999999999996,9.8460000000000001,0.433,15,176.20851063829801,67.3,0.62553191489362003,0.50425531914893995,13,7.7574468085106396,7.7574468085106396,5.9574468085110001E-2,5.9574468085110001E-2,3,3,3]
[null,"LV001","Sunshine CSC","Urban",7032,13.580249999999999,22.563544,15.795999999999999,14.597,0.24199999999999999,16,147.76251422070499,147.76251422070499,2.32366325369739,2.32366325369739,7,2.4500853242320799,2.4500853242320799,1.8060295790669999E-2,1.8060295790669999E-2,1,1.06797497155859,1.06797497155859]
[null,"LV002","Sunshine CSC","Rural Short",3181,3.0663,10.81367,3.5539999999999998,14.994,0.872,16,365.51744734360301,365.51744734360301,3.3215969820811,3.3215969820811,25,21.2681546683433,21.2681546683433,0.14020748192391999,0.14020748192391999,4,6.3410877082678399,6.3410877082678399]
[null,"LV003","Sunshine CSC","Rural Short",6587,23.134150000000002,27.457599999999999,12.045,7.7130000000000001,0.96699999999999997,13,92.362228632154199,92.362228632154199,1.0646728404432999,1.0646728404432999,6,11.5817519356308,11.5817519356308,3.9168058296640003E-2,3.9168058296640003E-2,2,1.9960528313344501,1.9960528313344501]
[null,"LV004","Sunshine CSC","Urban",6032,16.134889999999999,21.544460000000001,13.664,7.0519999999999996,0.63200000000000001,13,89.663295755968207,89.663295755968207,1.10377984084881,1.10377984084881,5,8.0354774535808993,8.0354774535808993,3.2161803713530002E-2,3.2161803713530002E-2,0,0,0]
[null,"LV005","Sunshine CSC","Urban",2636,6.9389500000000002,15.86858,9.7940000000000005,0.32700000000000001,0,8,4.8892261001517499,4.8892261001517499,6.8285280728379999E-2,6.8285280728379999E-2,0,0,0,0,0,0,0,0]
[null,"LV006","Sunshine CSC","Urban",5632,20.289400000000001,16.872613000000001,13.228999999999999,8.8070000000000004,0.13,8,103.076704545455,103.076704545455,0.76580255681817999,0.76580255681817999,2,1.517578125,1.517578125,4.4389204545499999E-3,4.4389204545499999E-3,1,0.97478693181817999,0.97478693181817999]
[null,"LV007","Sunshine CSC","Urban",2813,2.9068999999999998,17.397787000000001,6.9109999999999996,0.27800000000000002,0.71499999999999997,3,6.6718805545680802,6.6718805545680802,7.7141841450410004E-2,7.7141841450410004E-2,4,17.1663704230359,17.1663704230359,0.26839672947032001,0.26839672947032001,1,1.0462140063988601,1.0462140063988601]
[null,"LV008","Sunshine CSC","Urban",3318,8.5127000000000006,19.281839999999999,11.294,9.0960000000000001,0.52400000000000002,5,130.50301386377299,130.50301386377299,1.7763713080168799,1.7763713080168799,1,7.5226039783001797,7.5226039783001797,3.1344183242920001E-2,3.1344183242920001E-2,0,0,0]
[null,"LV009","Sunshine CSC","Urban",4199,15.24526,4.7770299999999999,8.8849999999999998,0.20100000000000001,4.0000000000000001E-3,3,4.9516551559895197,4.9516551559895197,2.9768992617290001E-2,2.9768992617290001E-2,1,8.9306977851870001E-2,8.9306977851870001E-2,2.3815194093999999E-4,2.3815194093999999E-4,0,0,0]
[null,"LV010","Sunshine CSC","Urban",3082,1.2531699999999999,20.025580000000001,8.2929999999999993,0.20100000000000001,7.0000000000000001E-3,3,4.5811161583387401,4.5811161583387401,2.3685918234910001E-2,2.3685918234910001E-2,1,0.15574302401038001,0.15574302401038001,6.4892926671000003E-4,6.4892926671000003E-4,0,0,0]
[null,"LVN001","Sunshine CSC","Urban",1,0,2.0885359999999999,12.551,0,0,1,222,222,2,2,0,0,0,0,0,0,0,0]
[null,"LVN021","Sunshine CSC","Urban",28,4.4438000000000004,1.8431310000000001,13.055,0,12.987,0,0,0,0,0,2,188.642857142857,188.642857142857,0.14285714285713999,0.14285714285713999,0,0,0]
[null,"LVN022","Sunshine CSC","Urban",4585,24.359369999999998,4.1138820000000003,14.340999999999999,8.0909999999999993,2.331,11,72.629007633587804,72.629007633587804,1.4191930207197401,1.4191930207197401,5,20.924754634678301,20.924754634678301,7.9389312977100002E-2,7.9389312977100002E-2,1,1.00109051254089,1.00109051254089]
[null,"LVN023","Sunshine CSC","Urban",139,4.9834500000000004,1.88401,9.7430000000000003,0.05,0.186,1,0.63309352517985995,0.63309352517985995,1.438848920863E-2,1.438848920863E-2,2,2.3525179856115099,2.3525179856115099,1.438848920863E-2,1.438848920863E-2,0,0,0]
[null,"LVN024","Sunshine CSC","Rural Short",155,3.08358,2.3720759999999999,1.6279999999999999,26.843,18.850999999999999,3,232.53548387096799,232.53548387096799,2.0129032258064501,2.0129032258064501,19,163.30322580645199,163.30322580645199,3.1548387096774202,3.1548387096774202,1,2.8903225806451598,2.8903225806451598]
[null,"LVN031","Sunshine CSC","Urban",52,4.6815199999999999,1.9406570000000001,12.938000000000001,2.794,59.847999999999999,1,18.384615384615401,18.384615384615401,1.9230769230769999E-2,1.9230769230769999E-2,10,393.80769230769198,393.80769230769198,1.09615384615385,1.09615384615385,0,0,0]
[null,"LVN032","Sunshine CSC","Urban",212,8.1642700000000001,1.0832189999999999,15.355,9.4090000000000007,30.439,7,67.334905660377402,67.334905660377402,1.1179245283018899,1.1179245283018899,17,217.84905660377399,217.84905660377399,0.42924528301886999,0.42924528301886999,1,1.0613207547169801,1.0613207547169801]
[null,"LVN033","Sunshine CSC","Urban",144,5.7308500000000002,0.595916,6.7809999999999997,1.3009999999999999,3.03,2,19.1319444444444,19.1319444444444,6.9444444444440007E-2,6.9444444444440007E-2,5,44.5486111111111,44.5486111111111,0.36805555555556002,0.36805555555556002,0,0,0]
[null,"LVN034","Sunshine CSC","Urban",88,6.2370400000000004,1.187317,10.327,25.541,25.654,3,195.32954545454501,195.32954545454501,1.3068181818181901,1.3068181818181901,8,196.19318181818201,196.19318181818201,0.94318181818182001,0.94318181818182001,2,2.1818181818181799,2.1818181818181799]
[null,"MBN012","Mildura CSC","Urban",2236,16.283429999999999,6.3138300000000003,9.2010000000000005,5.6859999999999999,0.439,4,116.147584973166,115.202146690519,1.03085867620751,1.0245974955277299,6,8.9754025044722692,8.9754025044722692,2.951699463327E-2,2.951699463327E-2,4,4.0487477638640401,3.0366726296958899]
[null,"MBN013","Mildura CSC","Rural Short",461,39.296720000000001,0.44762000000000002,2.7639999999999998,9.9600000000000009,2E-3,9,799.12364425162696,59.3731019522777,1.8004338394793999,0.96963123644252003,1,0.14967462039046001,0.14967462039046001,2.1691973969599999E-3,2.1691973969599999E-3,1,1.0043383947939299,1.0043383947939299]
[null,"MBN014","Mildura CSC","Rural Short",815,87.135620000000003,0.70381000000000005,4.2649999999999997,11.657999999999999,4.9189999999999996,15,457.96564417177899,64.330061349693295,1.45644171779142,0.68711656441718005,16,193.22331288343599,193.22331288343599,0.85889570552146999,0.85889570552146999,1,1.00245398773006,1.00245398773006]
[null,"MBN023","Mildura CSC","Urban",3184,32.469569999999997,7.3802000000000003,12.124000000000001,0.54600000000000004,1.036,9,8.8030778894472395,8.6375628140703498,7.6947236180900005E-2,7.6005025125629996E-2,21,16.697550251256299,16.697550251256299,0.26507537688442001,0.26507537688442001,2,2.0018844221105501,2.0018844221105501]
[null,"MBN031","Mildura CSC","Rural Short",1301,117.8681,2.97397,6.9109999999999996,9.3480000000000008,0.21099999999999999,15,206.36894696387401,65.495772482705604,0.81475787855494997,0.71329746348962997,5,4.6617986164488903,4.6617986164488903,2.7671022290550001E-2,2.7671022290550001E-2,3,2.9946195234434998,1.9930822444273599]
[null,"MBN032","Mildura CSC","Rural Short",2134,54.983960000000003,5.9604299999999997,9.32,1.1100000000000001,0.9,15,26.327085285848199,26.327085285848199,0.31162136832240001,0.31162136832240001,16,21.3406747891284,21.3406747891284,0.19962511715089001,0.19962511715089001,2,1.9967197750702901,1.9967197750702901]
[null,"MDA022","Mildura CSC","Urban",1766,7.5201399999999996,3.09361,10.821,0.25800000000000001,0.69499999999999995,4,4.2904869762174398,4.2904869762174398,1.5288788221970001E-2,1.5288788221970001E-2,6,11.5430351075878,11.5430351075878,6.9648924122309996E-2,6.9648924122309996E-2,0,0,0]
[null,"MDA023","Mildura CSC","Rural Short",1814,69.471320000000006,5.18919,9.5570000000000004,2.0590000000000002,1.9630000000000001,12,37.228224917309802,7.07993384785006,0.10915104740904,7.0562293274529994E-2,7,35.498897464167598,35.498897464167598,0.27728776185226001,0.27728776185226001,2,2.02370452039691,1.0121278941565599]
[null,"MDA024","Mildura CSC","Rural Short",1269,29.888760000000001,2.3735300000000001,9.2409999999999997,1.512,0.69399999999999995,13,28.4097714736013,9.9550827423167796,0.10007880220646,7.2498029944840003E-2,6,13.0401891252955,13.0401891252955,0.11899133175729,0.11899133175729,4,4.0346729708431699,0]
[null,"MDA031","Mildura CSC","Urban",1806,9.6597399999999993,3.41506,6.7130000000000001,2.4449999999999998,1.5860000000000001,7,57.174972314507201,24.320044296788499,1.1323366555924701,1.0487264673311201,6,37.071982281284598,37.071982281284598,0.15116279069767,0.15116279069767,1,1.00498338870432,1.00498338870432]
[null,"MDA032","Mildura CSC","Urban",2033,11.07138,2.3949699999999998,8.4510000000000005,14.932,0.42599999999999999,7,292.87899655681298,292.87899655681298,2.0605017215936998,2.0605017215936998,2,8.3595671421544502,8.3595671421544502,8.4604033448110003E-2,8.4604033448110003E-2,2,1.9950811608460399,1.9950811608460399]
[null,"MDA033","Mildura CSC","Urban",1234,5.6834899999999999,2.9672700000000001,4.5410000000000004,0.51700000000000002,8.9999999999999993E-3,4,18.1758508914101,18.1758508914101,0.19286871961102001,0.19286871961102001,1,0.33225283630469998,0.33225283630469998,1.6207455429500001E-3,1.6207455429500001E-3,0,0,0]
[null,"MDA034","Mildura CSC","Urban",1545,4.5402300000000002,5.3854040000000003,5.6470000000000002,2.5750000000000002,0.22700000000000001,6,71.228478964401305,38.455016181229801,7.1844660194170004E-2,4.5307443365700001E-2,2,6.2686084142394796,6.2686084142394796,5.1132686084139997E-2,5.1132686084139997E-2,1,1.0019417475728201,1.0019417475728201]
[null,"MLN011","Sunshine CSC","Rural Short",4679,61.949460000000002,9.1670499999999997,8.2569999999999997,10.519,2.7930000000000001,21,182.793118187647,182.793118187647,2.1162641590083302,2.1162641590083302,21,48.543705920068398,48.543705920068398,0.18016670228681,0.18016670228681,0,0,0]
[null,"MLN012","Sunshine CSC","Rural Short",3204,103.10464,10.704610000000001,6.859,3.3820000000000001,1.179,17,79.735955056179805,79.735955056179805,1.07397003745318,1.07397003745318,27,27.805867665418202,27.805867665418202,0.12890137328340001,0.12890137328340001,0,0,0]
[null,"MLN013","Sunshine CSC","Rural Short",4021,16.576879999999999,19.517189999999999,9.4930000000000003,6.5510000000000002,1E-3,5,100.256901268341,100.256901268341,1.0387963193235501,1.0387963193235501,2,1.4424272569010001E-2,1.4424272569010001E-2,4.9738870928000005E-4,4.9738870928000005E-4,2,1.99999999999999,1.99999999999999]
[null,"MLN014","Sunshine CSC","Rural Short",3052,16.444790000000001,8.7883530000000007,6.0430000000000001,2.9239999999999999,1.6830000000000001,14,76.914482306684107,76.914482306684107,1.15661861074705,1.15661861074705,15,44.271625163826997,44.271625163826997,0.13335517693316001,0.13335517693316001,3,3.01572739187417,3.01572739187417]
[null,"MLN021","Sunshine CSC","Rural Short",1813,87.269779999999997,14.444003,5.6349999999999998,7.524,2.9470000000000001,25,164.66188637617199,164.66188637617199,1.15278543849973,1.15278543849973,20,64.492002206287907,64.492002206287907,0.44787644787644998,0.44787644787644998,1,1.16436845008274,1.16436845008274]
[null,"MLN022","Sunshine CSC","Rural Short",3606,20.215140000000002,13.85439,7.95,3.0880000000000001,0.63300000000000001,11,69.933998890737698,69.933998890737698,1.6835829173599599,1.6835829173599599,10,14.325013865779299,14.325013865779299,4.9916805324460002E-2,4.9916805324460002E-2,0,0,0]
[null,"MLN023","Sunshine CSC","Rural Short",3757,11.87424,13.21823,7.5209999999999999,0.19800000000000001,0.27300000000000002,3,4.2462070801171103,4.2462070801171103,1.4107000266170001E-2,1.4107000266170001E-2,2,5.8578653180729301,5.8578653180729301,4.8176736758050002E-2,4.8176736758050002E-2,2,2.0404578120841101,2.0404578120841101]
[null,"MLN024","Sunshine CSC","Urban",925,3.9748399999999999,3.3462670000000001,6.5519999999999996,2.4209999999999998,0,1,49.663783783783799,49.663783783783799,0.32540540540541002,0.32540540540541002,0,0,0,0,0,0,0,0]
[null,"MNA013","Shepparton CSC","Urban",641,34.886539999999997,1.395853,11.018000000000001,4.2430000000000003,0.88300000000000001,6,42.438377535101402,42.438377535101402,0.51794071762870997,0.51794071762870997,5,8.83463338533541,8.83463338533541,3.120124804992E-2,3.120124804992E-2,3,3.0031201248049899,3.0031201248049899]
[null,"MNA014","Shepparton CSC","Rural Long",1635,231.01156,3.97377,10.148999999999999,13.32,7.9169999999999998,39,223.58409785932699,202.047706422018,1.49724770642202,1.4782874617737001,22,132.88501529051999,132.88501529051999,0.41529051987768001,0.41529051987768001,4,4.0061162079510702,3.0024464831804298]
[null,"MNA021","Shepparton CSC","Rural Short",1761,146.85239000000001,1.915033,8.609,32.593000000000004,0.72899999999999998,24,595.26178307779696,337.64111300397502,6.1521862578080801,4.1521862578080597,6,13.3089153889835,13.3089153889835,3.6342986939239999E-2,3.6342986939239999E-2,12,12.001703577512799,11.002271436683699]
[null,"MNA022","Shepparton CSC","Urban",2088,12.87284,2.7163400000000002,5.9240000000000004,0.24399999999999999,3.786,2,7.9588122605363996,5.8544061302681998,4.5019157088120001E-2,3.8793103448279999E-2,14,123.55316091954001,123.55316091954001,0.42193486590037999,0.42193486590037999,0,0,0]
[null,"MNA024","Shepparton CSC","Rural Short",1943,32.107590000000002,6.8828199999999997,8.0559999999999992,4.0529999999999999,1.746,10,87.054554812146193,42.425115800308802,0.42614513638703,0.36284096757591,6,37.496139989706599,37.496139989706599,0.13432835820896,0.13432835820896,6,6.0123520329387397,4]
[null,"MNA034","Shepparton CSC","Rural Long",1628,322.46631000000002,4.4491699999999996,6.556,8.8569999999999993,8.8960000000000008,62,243.35442260442301,121.40724815724801,2.2843980343980301,1.1068796068796101,48,244.423832923833,244.423832923833,0.80282555282555002,0.80282555282555002,6,5.99815724815726,4.9975429975430004]
[null,"MRO002","Bendigo CSC","Urban",2,0.77773999999999999,0,0.91600000000000004,0,0,0,0,0,0,0,0,0,0,0,0,4,4,4]
[null,"MRO004","Bendigo CSC","Rural Short",1816,16.242090000000001,0.34764,4.4619999999999997,0.36199999999999999,2.8250000000000002,7,16.283590308370002,16.283590308370002,1.1161894273127799,1.1161894273127799,10,127.115088105727,127.115088105727,0.75440528634361004,0.75440528634361004,0,0,0]
[null,"MRO005","Bendigo CSC","Rural Long",2045,548.01783999999998,2.1895500000000001,5.3380000000000001,6.4660000000000002,0.443,45,173.62591687041601,111.65183374083099,1.39168704156479,0.84547677261613996,33,11.882151589242,11.882151589242,0.15550122249389001,0.15550122249389001,1,0.99951100244499003,0.99951100244499003]
[null,"MRO006","Bendigo CSC","Urban",1068,5.49573,0.54947000000000001,4.5019999999999998,0.38,1.857,1,12.9747191011236,12.9747191011236,8.8014981273409995E-2,8.8014981273409995E-2,7,63.431647940074903,63.431647940074903,0.22846441947566001,0.22846441947566001,0,0,0]
[null,"MRO007","Bendigo CSC","Rural Long",1841,517.98235,0.13028999999999999,3.9039999999999999,12.733000000000001,6.4,37,509.75176534492101,487.98587724062997,2.01412275936991,1.9918522542096699,121,256.21347093970701,256.21347093970701,0.96795219989136005,0.96795219989136005,2,1.9994568169473099,1.9994568169473099]
[null,"MRO008","Bendigo CSC","Rural Long",2770,298.39024000000001,0.61824999999999997,6.6130000000000004,8.5630000000000006,0.14000000000000001,35,292.44945848375397,262.89711191335698,1.3028880866426,1.22527075812274,18,4.7880866425992803,4.7880866425992803,4.5848375451259998E-2,4.5848375451259998E-2,0,0,0]
[null,"NHL015","Horsham CSC","Rural Long",1580,1044.5853,0.41181000000000001,3.9359999999999999,2.742,0.55800000000000005,33,190.707594936709,190.707594936709,1.34430379746835,1.34430379746835,9,38.815189873417701,38.815189873417701,0.36518987341772002,0.36518987341772002,3,3,3]
[null,"NHL016","Horsham CSC","Rural Long",1366,290.28512000000001,0.48932999999999999,4.1310000000000002,2.7149999999999999,0.11,13,115.744509516837,115.744509516837,1.09590043923866,1.09590043923866,11,4.67423133235725,4.67423133235725,1.0131771595900401,1.0131771595900401,5,4.9926793557833102,4.9926793557833102]
[null,"NHL031","Horsham CSC","Rural Long",1362,911.28471000000002,0.44078699999999998,5.3390000000000004,5.4640000000000004,0.24299999999999999,45,155.52202643171799,155.52202643171799,1.24008810572687,1.24008810572687,8,6.9229074889867803,6.9229074889867803,1.0367107195301,1.0367107195301,6,5.9992657856093698,5.9992657856093698]
[null,"NKA001","Shepparton CSC","Rural Long",1117,381.53273999999999,0.36742999999999998,3.5539999999999998,22.515000000000001,3.8050000000000002,43,901.39928379588196,125.521038495971,1.66875559534467,0.79677708146822002,52,152.346463742167,152.346463742167,0.56222023276634003,0.56222023276634003,1,0.98836168307967998,0]
[null,"NKA002","Shepparton CSC","Rural Long",1647,285.62556999999998,1.45157,5.1340000000000003,12.208,5.8999999999999997E-2,35,392.62295081967198,167.624165148755,3.1165755919854301,2.0928961748633901,5,1.8913175470552499,1.8913175470552499,1.275045537341E-2,1.275045537341E-2,6,6.0188221007893201,4.0115361262902196]
[null,"NKA003","Shepparton CSC","Rural Short",646,118.57992,0.45722000000000002,5.6470000000000002,1.5609999999999999,7.0999999999999994E-2,19,34.964396284829697,34.964396284829697,0.43808049535603999,0.43808049535603999,3,1.58049535603715,1.58049535603715,2.4767801857590001E-2,2.4767801857590001E-2,4,3.9798761609907101,3.9798761609907101]
[null,"NKA004","Shepparton CSC","Rural Short",2425,71.59057,2.3273299999999999,8.6880000000000006,2.4550000000000001,0.85199999999999998,17,38.148453608247401,37.614020618556701,1.10226804123711,1.0973195876288699,4,13.237113402061899,13.237113402061899,7.4226804123709994E-2,7.4226804123709994E-2,5,4.9987628865979401,4.9987628865979401]
[null,"NKA005","Shepparton CSC","Rural Short",653,180.16058000000001,0.46211000000000002,3.5939999999999999,15.590999999999999,0.73899999999999999,42,726.68606431853004,276.38284839203698,3.0980091883614098,2.0980091883614098,4,34.447166921898898,34.447166921898898,0.11638591117917001,0.11638591117917001,3,3,1.99693721286371]
[null,"NKA006","Shepparton CSC","Rural Long",1373,415.36617000000001,2.6695199999999999,6.9109999999999996,13.353999999999999,0.5,66,258.14056809905298,141.906773488711,3.2935178441369302,2.2796795338674398,18,9.6656955571740699,9.6656955571740699,0.12017479970867,0.12017479970867,6,5.9832483612527101,5.9832483612527101]
[null,"OYN001","Mildura CSC","Rural Long",921,884.81883000000005,5.5809999999999998E-2,2.093,2.6179999999999999,3.5999999999999997E-2,47,258.02280130293201,224.72095548317,2.99348534201954,2.5559174809989198,6,3.5928338762215,3.5928338762215,3.5830618892509998E-2,3.5830618892509998E-2,3,3.00651465798046,3.00651465798046]
[null,"OYN003","Mildura CSC","Rural Long",364,410.02951999999999,0.26257000000000003,0.59199999999999997,0.94899999999999995,1.722,9,245.27197802197799,104.321428571429,2.0906593406593399,1.9972527472527499,13,444.95604395604403,444.95604395604403,1.29395604395604,1.29395604395604,4,4.0027472527472598,4.0027472527472598]
[null,"OYN005","Mildura CSC","Rural Long",1307,1020.32128,0.97504000000000002,4.226,5.6070000000000002,2.8650000000000002,41,277.15837796480503,250.37949502677901,4.2555470543228804,4.23641928079571,54,141.590665646519,141.590665646519,0.66794185156847996,0.66794185156847996,2,1.98928844682479,1.98928844682479]
[null,"OYN007","Mildura CSC","Rural Short",645,9.47987,0,2.488,0.80200000000000005,2.4E-2,7,66.665116279069807,66.665116279069807,1.3193798449612399,1.3193798449612399,1,1.9844961240310099,1.9844961240310099,6.2015503876E-3,6.2015503876E-3,2,1.9922480620155001,1.9922480620155001]
[null,"PLD001","Warrnambool CSC","Rural Long",1853,310.66131999999999,1.2157100000000001,5.6870000000000003,7.4370000000000003,6.7279999999999998,58,234.522935779817,234.07015650296799,2.5018888289260701,2.5002698327037201,19,212.15704263356699,212.15704263356699,1.3005936319481901,1.3005936319481901,1,0.99784133837021005,0.99784133837021005]
[null,"PLD002","Warrnambool CSC","Urban",16,3.76973,0.35844999999999999,1.4219999999999999,4.0970000000000004,1.39,2,703.75,703.75,2,2,4,238.75,238.75,1.25,1.25,0,0,0]
[null,"PLD003","Warrnambool CSC","Rural Long",1109,451.70035999999999,1.1175299999999999,1.619,3.0990000000000002,2.7280000000000002,28,202.97565374211001,202.929666366096,1.5256988277727701,1.52479711451759,22,178.700631199279,178.700631199279,0.76284941388637995,0.76284941388637995,0,0,0]
[null,"PLD004","Warrnambool CSC","Rural Short",2848,27.15043,1.281417,6.516,1.827,0.186,14,34.9799859550562,34.9799859550562,0.35709269662921,0.35709269662921,3,3.56601123595506,3.56601123595506,2.6685393258430001E-2,2.6685393258430001E-2,0,0,0]
[null,"PLD005","Warrnambool CSC","Urban",165,7.5547899999999997,3.6188630000000002,5.5289999999999999,4.944,8.7720000000000002,3,153.363636363636,153.363636363636,2.9636363636363598,2.9636363636363598,8,272.11515151515198,272.11515151515198,1.9636363636363701,1.9636363636363701,0,0,0]
[null,"PLD006","Warrnambool CSC","Rural Short",3283,137.30232000000001,1.6489529999999999,5.173,10.08,8.6679999999999993,58,311.83368869935998,311.575997563204,2.0268047517514498,2.0204081632653099,23,268.13250076149899,268.13250076149899,0.87907401766676996,0.87907401766676996,0,0,0]
[null,"RCT011","Mildura CSC","Rural Short",1033,43.682189999999999,0.83087999999999995,4.6989999999999998,25.89,1.044,18,1135.12778315586,124.290416263311,2.2739593417231299,1.2681510164569201,4,45.779283639883801,45.779283639883801,0.10454985479187,0.10454985479187,4,4.0145208131655297,4.0145208131655297]
[null,"RCT012","Mildura CSC","Urban",1,0.23677999999999999,9.8999999999999999E-4,2.0139999999999998,0,2.415,0,0,0,0,0,1,375,375,1,1,0,0,0]
[null,"RCT013","Mildura CSC","Rural Short",634,136.60352,0.41640300000000002,9.3989999999999991,0.98599999999999999,45.433,16,16.9889589905363,16.9889589905363,0.15141955835962001,0.15141955835962001,18,782.78864353312304,782.78864353312304,2.0473186119873801,2.0473186119873801,3,3.0047318611987399,3.0047318611987399]
[null,"RCT014","Mildura CSC","Rural Short",358,78.275329999999997,1.4573400000000001,11.492000000000001,13.172000000000001,36.997,15,215.96648044692699,170.07821229050299,1.2150837988826799,0.59497206703910999,31,606.61173184357494,606.61173184357494,0.80446927374302002,0.80446927374302002,1,1.0083798882681601,1.0083798882681601]
[null,"RCT015","Mildura CSC","Rural Short",21,8.6257800000000007,8.6830000000000004E-2,2.4089999999999998,2.8069999999999999,9.7000000000000003E-2,3,386.42857142857099,24.428571428571399,1.1428571428571399,0.14285714285713999,1,13.3333333333333,13.3333333333333,4.7619047619050003E-2,4.7619047619050003E-2,0,0,0]
[null,"RCT021","Mildura CSC","Rural Short",890,66.649420000000006,0.11353000000000001,6.1210000000000004,18.972999999999999,1.8620000000000001,11,584.30561797752796,41.153932584269697,1.31460674157304,0.31460674157302998,11,57.341573033707903,57.341573033707903,0.30449438202246998,0.30449438202246998,0,0,0]
[null,"RCT022","Mildura CSC","Rural Short",843,182.06737000000001,0.49802999999999997,7.1319999999999997,1.1060000000000001,11.683999999999999,11,24.964412811387898,24.964412811387898,0.20284697508897001,0.20284697508897001,30,263.68327402135202,263.68327402135202,0.86714116251482998,0.86714116251482998,3,3.00593119810202,1.9988137603795999]
[null,"RCT023","Mildura CSC","Rural Long",2482,564.82340999999997,5.6863700000000001,8.6880000000000006,5.9050000000000002,6.484,50,132.698630136986,132.698630136986,2.1539081385979002,2.1539081385979002,28,145.70346494762299,145.70346494762299,0.55801772763900004,0.55801772763900004,1,0.99879129734085004,0.99879129734085004]
[null,"RVL001","Mildura CSC","Rural Short",670,55.198779999999999,0.59028999999999998,4.66,2.339,2.4140000000000001,22,84.362686567164204,55.8611940298508,3.0656716417910501,1.7701492537313499,10,87.083582089552195,87.083582089552195,0.26268656716417998,0.26268656716417998,1,0.70298507462686999,0.70298507462686999]
[null,"RVL004","Mildura CSC","Urban",752,22.689170000000001,0.35315000000000002,7.306,1.72,1.6E-2,9,44.344414893617,37.440159574468098,0.65558510638297995,0.34175531914893997,1,0.41888297872340002,0.41888297872340002,1.196808510638E-2,1.196808510638E-2,2,0.62898936170213005,0.62898936170213005]
[null,"RVL006","Mildura CSC","Urban",309,13.86687,0.20024,6.319,10.128,0,4,412.44012944983803,13.7022653721683,1.90614886731391,0.11003236245955,0,0,0,0,0,0,0,0]
[null,"RVL008","Mildura CSC","Rural Short",173,31.398630000000001,0.32025999999999999,3.7120000000000002,0.67400000000000004,0.71299999999999997,3,33.075144508670498,6.2947976878612701,1.28901734104046,8.6705202312140003E-2,3,35.005780346820799,35.005780346820799,0.12716763005779999,0.12716763005779999,0,0,0]
[null,"SA001","Sunshine CSC","Urban",1932,9.0902499999999993,0.88034999999999997,3.262,0.46800000000000003,4.0000000000000001E-3,7,22.7324016563147,22.7324016563147,0.13561076604555,0.13561076604555,1,0.20186335403726999,0.20186335403726999,1.0351966873700001E-3,1.0351966873700001E-3,0,0,0]
[null,"SA002","Sunshine CSC","Rural Short",2604,26.910160000000001,0.78637999999999997,7.577,0.93300000000000005,2E-3,9,28.436251920122899,28.436251920122899,0.14400921658985999,0.14400921658985999,1,4.7235023041470002E-2,4.7235023041470002E-2,3.8402457757000003E-4,3.8402457757000003E-4,1,0.99846390168971,0.99846390168971]
[null,"SA003","Sunshine CSC","Urban",3054,3.9262199999999998,11.402290000000001,6.9790000000000001,1.569,0.28299999999999997,6,34.942698100851302,34.942698100851302,0.15324165029469999,0.15324165029469999,3,6.3094302554027504,6.3094302554027504,6.8107400130980003E-2,6.8107400130980003E-2,0,0,0]
[null,"SA004","Sunshine CSC","Urban",2625,9.7574799999999993,0.37830000000000003,4.2389999999999999,0.25700000000000001,0,3,7.5230476190476203,7.5230476190476203,4.4952380952380001E-2,4.4952380952380001E-2,0,0,0,0,0,0,0,0]
[null,"SA005","Sunshine CSC","Urban",3620,5.8801699999999997,7.0924569999999996,7.5979999999999999,1.2569999999999999,0.503,5,23.061602209944699,23.061602209944699,0.48342541436463998,0.48342541436463998,1,9.2179558011049707,9.2179558011049707,3.0386740331490001E-2,3.0386740331490001E-2,0,0,0]
[null,"SA006","Sunshine CSC","Rural Short",2202,12.26207,8.8145699999999998,5.9189999999999996,0.1,0.36399999999999999,2,2.7979109900090799,2.06993642143506,7.7202543142600001E-3,6.81198910082E-3,2,10.188010899182601,10.188010899182601,7.0390554041780004E-2,7.0390554041780004E-2,0,0,0]
[null,"SA007","Sunshine CSC","Urban",7003,12.793150000000001,15.906039,12.242000000000001,0.47399999999999998,4.9000000000000002E-2,6,4.8549193202912999,4.8549193202912999,1.670712551764E-2,1.670712551764E-2,1,0.49764386691418,0.49764386691418,5.8546337283999998E-3,5.8546337283999998E-3,0,0,0]
[null,"SA008","Sunshine CSC","Urban","-",{"$error":"#N/A"},{"$error":"#N/A"},0,0,0,0,0,0,0,0,0,0,0,0,0,0,0,0]
[null,"SA009","Sunshine CSC","Urban",3746,11.841810000000001,12.34196,7.59,2.3730000000000002,0.68100000000000005,3,43.842231713828099,43.842231713828099,0.61185264281900997,0.61185264281900997,3,12.585424452749599,12.585424452749599,3.6038441003739999E-2,3.6038441003739999E-2,0,0,0]
[null,"SA010","Sunshine CSC","Urban",2555,4.4425699999999999,11.0425,6.4740000000000002,0.82899999999999996,0,3,19.6594911937378,19.6594911937378,0.83992172211350002,0.83992172211350002,0,0,0,0,0,0,0,0]
[null,"SA011","Sunshine CSC","Urban",5056,5.8446699999999998,23.816600000000001,9.8729999999999993,3.1509999999999998,1.327,3,78.922666139240505,78.922666139240505,0.92681962025316,0.92681962025316,2,33.2229034810127,33.2229034810127,9.315664556962E-2,9.315664556962E-2,1,0.96677215189873,0.96677215189873]
[null,"SA012","Sunshine CSC","Urban",270,8.4762299999999993,4.28444,9.0619999999999994,13.233000000000001,5.3999999999999999E-2,1,254.38148148148099,254.38148148148099,1.01111111111111,1.01111111111111,2,1.0407407407407401,1.0407407407407401,7.4074074074100002E-3,7.4074074074100002E-3,0,0,0]
[null,"SHL001","Mildura CSC","Rural Long",350,417.53381000000002,0.66829000000000005,1.208,3.806,1.0900000000000001,26,468.32857142857102,244.38285714285701,1.6085714285714301,1.4,6,134.171428571429,134.171428571429,0.68857142857143006,0.68857142857143006,1,0.98,0.98]
[null,"SHL002","Mildura CSC","Rural Long",1255,359.79799000000003,0.79095000000000004,9.5790000000000006,24.53,0.89900000000000002,32,511.11075697211197,303.22709163346599,3.0215139442230998,2.4749003984063802,13,18.741832669322701,18.741832669322701,0.18326693227092,0.18326693227092,4,4.0446215139442199,4.0446215139442199]
[null,"SHL004","Mildura CSC","Rural Short",1422,178.59809000000001,2.1604299999999999,9.0380000000000003,5.7869999999999999,2.4660000000000002,44,133.84106891701799,39.634317862166,1.2841068917018299,0.63080168776371004,35,57.035864978903,57.035864978903,0.29465541490857999,0.29465541490857999,4,3.9992967651195501,3.9992967651195501]
[null,"SHL005","Mildura CSC","Rural Short",1411,128.27635000000001,0.84967000000000004,6.08,13.867000000000001,8.8569999999999993,48,470.97023387668298,438.10985116938298,2.9199149539333802,2.7987243090007099,39,300.83345145287001,300.83345145287001,0.87880935506733004,0.87880935506733004,5,4.7873848334514602,4.7873848334514602]
[null,"SHL007","Mildura CSC","Urban",2021,15.940480000000001,1.5085599999999999,10.004,0.24199999999999999,0,5,4.4116773874319604,4.2632360217713998,3.9089559623949999E-2,3.6615536862940001E-2,0,0,0,0,0,3,3.0069272637308302,3.0069272637308302]
[null,"SHL008","Mildura CSC","Urban",2553,19.673860000000001,1.94251,10.042,2.5750000000000002,4.819,9,44.357226792009399,43.661574618096402,0.17822169996083001,0.17508813160987,10,83.023110066588302,83.023110066588302,0.24324324324324001,0.24324324324324001,3,3.0144927536231898,3.0144927536231898]
[null,"SHN011","Shepparton CSC","Rural Long",1487,319.97228999999999,5.72105,5.6079999999999997,40.642000000000003,4.4000000000000004,64,1197.2656355077299,315.96906523201102,4.1284465366509799,2.7269670477471402,68,129.62004034969701,129.62004034969701,0.49428379287155,0.49428379287155,2,1.2488231338264999,1]
[null,"SHN012","Shepparton CSC","Urban",2546,10.55034,0.40927000000000002,7.306,1.804,1.4999999999999999E-2,6,48.328750981932401,48.318146111547499,0.35349567949725003,0.35310290652003001,1,0.40455616653574,0.40455616653574,4.0455616653569997E-2,4.0455616653569997E-2,1,0.99882168106834002,0.99882168106834002]
[null,"SHN014","Shepparton CSC","Urban",351,11.418799999999999,0.90691699999999997,5.3310000000000004,0.73,0,1,21.920227920227902,0.2962962962963,0.19943019943019999,2.8490028489999999E-3,0,0,0,0,0,2,2.0085470085470098,1.002849002849]
[null,"SHN021","Shepparton CSC","Rural Short",2186,31.48976,6.4832799999999997,5.9240000000000004,2.7469999999999999,0.13400000000000001,13,90.424977127172895,90.424977127172895,1.08462946020128,1.08462946020128,3,4.4011893870082304,4.4011893870082304,6.2214089661480003E-2,6.2214089661480003E-2,4,4.0233302836230704,3.0086916742909402]
[null,"SHN022","Shepparton CSC","Urban",1852,8.1544100000000004,2.7644199999999999,7.8979999999999997,1.7000000000000001E-2,1.577,2,0.41360691144708001,0.41360691144708001,2.6997840172800001E-3,2.6997840172800001E-3,2,39.157667386609099,39.157667386609099,0.12041036717063,0.12041036717063,1,0.98488120950323998,0.98488120950323998]
[null,"SHN023","Shepparton CSC","Urban",968,6.2410500000000004,2.1239300000000001,4.2649999999999997,0.24299999999999999,7.5999999999999998E-2,5,11.870867768595,11.870867768595,8.3677685950410002E-2,8.3677685950410002E-2,1,3.6983471074380199,3.6983471074380199,2.376033057851E-2,2.376033057851E-2,0,0,0]
[null,"SHN024","Shepparton CSC","Rural Short",1084,150.46440999999999,1.1892100000000001,5.3710000000000004,34.255000000000003,8.2219999999999995,33,917.55166051660501,109.238007380074,2.9926199261992701,1.9916974169741699,34,220.22416974169701,220.22416974169701,0.75830258302582998,0.75830258302582998,9,8.9760147601475992,8.9760147601475992]
[null,"SHP011","Shepparton CSC","Rural Short",786,134.18684999999999,0.43014999999999998,5.0940000000000003,10.164,16.094000000000001,33,176.10559796437701,67.944020356234105,0.72137404580152997,0.61959287531806995,23,278.85241730279898,278.85241730279898,1.0814249363867701,1.0814249363867701,2,1.9923664122137399,1.9923664122137399]
[null,"SHP012","Shepparton CSC","Rural Long",2238,374.96678000000003,0.77073400000000003,7.78,9.4890000000000008,4.7770000000000001,44,192.11617515639,179.12064343163499,1.3235031277926701,1.25067024128686,38,96.722520107238594,96.722520107238594,0.38650580875781998,0.38650580875781998,3,2.99731903485254,0]
[null,"SHP014","Shepparton CSC","Rural Long",1672,301.62038000000001,0.187557,5.5289999999999999,9.7119999999999997,0.158,38,286.79964114832501,96.780502392344502,1.0909090909090899,0.43062200956938002,7,4.6686602870813401,4.6686602870813401,6.4593301435410005E-2,6.4593301435410005E-2,6,6.0101674641148399,6.0101674641148399]
[null,"SHP021","Shepparton CSC","Rural Long",711,371.69349999999997,3.56366,3.238,4.5069999999999997,0.46,34,228.81153305203901,116.36708860759499,1.90154711673699,1.5007032348804501,9,23.3727144866385,23.3727144866385,0.10126582278481,0.10126582278481,5,4.9859353023909998,3.9887482419128002]
[null,"SSE011","Sunshine CSC","Urban",1111,8.7815600000000007,2.2722340000000001,12.666,26.984999999999999,0.04,6,266.25562556255602,266.25562556255602,3.04050405040504,3.04050405040504,2,0.39243924392439,0.39243924392439,6.3006300630099998E-3,6.3006300630099998E-3,1,0.99549954995500001,0.99549954995500001]
[null,"SSE012","Sunshine CSC","Urban",2964,10.961320000000001,3.7443170000000001,5.8849999999999998,5.7720000000000002,0.219,9,148.38090418353599,148.38090418353599,3.0593792172739498,3.0593792172739498,5,5.6336032388664004,5.6336032388664004,2.0580296896089999E-2,2.0580296896089999E-2,0,0,0]
[null,"SSE013","Sunshine CSC","Urban",1996,6.4406400000000001,3.8058429999999999,8.6519999999999992,2.117,0.53,6,38.004509018036103,35.640280561122204,1.08366733466934,1.07815631262525,2,9.5165330661322596,9.5165330661322596,3.306613226453E-2,3.306613226453E-2,1,1.00350701402806,1.00350701402806]
[null,"SSE014","Sunshine CSC","Urban",3785,15.881130000000001,4.0458600000000002,11.302,3.71,1.171,14,38.927344782034403,38.927344782034403,1.09749009247028,1.09749009247028,2,12.2853368560106,12.2853368560106,3.5138705416119999E-2,3.5138705416119999E-2,1,1.00211360634082,1.00211360634082]
[null,"SSE031","Sunshine CSC","Urban",5591,22.90522,9.3806170000000009,11.029,7.032,1.4999999999999999E-2,5,84.328921480951493,84.328921480951493,1.37971740296906,1.37971740296906,2,0.17635485601859999,0.17635485601859999,1.2520121624E-3,1.2520121624E-3,2,1.99373993918797,1.99373993918797]
[null,"SSE032","Sunshine CSC","Urban",2735,16.959430000000001,3.4299010000000001,9.9380000000000006,13.462999999999999,1.194,12,193.99012797075,193.99012797075,2.1608775137111502,2.1608775137111502,9,17.201096892138899,17.201096892138899,6.2888482632540002E-2,6.2888482632540002E-2,3,2.99451553930529,2.99451553930529]
[null,"SSE033","Sunshine CSC","Urban",1341,9.4721600000000006,1.8469899999999999,5.8070000000000004,0.95,7.0000000000000001E-3,8,23.961968680089502,23.961968680089502,0.12080536912752,0.12080536912752,1,0.18269947800149,0.18269947800149,7.4571215510999998E-4,7.4571215510999998E-4,2,2.0007457121551102,2.0007457121551102]
[null,"SSE034","Sunshine CSC","Urban",2420,12.5701,1.009927,10.717000000000001,2.0720000000000001,0.67800000000000005,8,20.521074380165299,20.521074380165299,0.12396694214876,0.12396694214876,2,6.7107438016528898,6.7107438016528898,1.652892561983E-2,1.652892561983E-2,0,0,0]
[null,"STL004","Horsham CSC","Urban",1575,15.187200000000001,0.12345,5.0590000000000002,3.2290000000000001,0.56999999999999995,2,108.92126984127,108.92126984127,1.0095238095238099,1.0095238095238099,6,19.215238095238099,19.215238095238099,0.1168253968254,0.1168253968254,1,0.99873015873016002,0.99873015873016002]
[null,"STL005","Horsham CSC","Rural Long",2456,226.09063,0.77406299999999995,6.9320000000000004,3.4039999999999999,3.4140000000000001,17,79.130293159609096,79.130293159609096,1.62011400651466,1.62011400651466,18,79.359934853420199,79.359934853420199,0.42711726384365001,0.42711726384365001,0,0,0]
[null,"STL006","Horsham CSC","Rural Long",1627,931.09415999999999,3.5891500000000001,4.5019999999999998,6.1440000000000001,12.436,27,202.16226183159199,202.16226183159199,1.3681622618315901,1.3681622618315901,61,409.17824216349101,409.17824216349101,1.3116164720344199,1.3116164720344199,0,0,0]
[null,"STL007","Horsham CSC","Rural Long",817,353.57533999999998,0.96231,5.976,0.63600000000000001,2.3660000000000001,20,52.5361077111383,52.5361077111383,0.22399020807833001,0.22399020807833001,37,195.50305997551999,195.50305997551999,0.82252141982864002,0.82252141982864002,0,0,0]
[null,"STN011","Shepparton CSC","Rural Long",1033,290.29237000000001,1.1104000000000001,5.8449999999999998,16.408000000000001,3.1030000000000002,44,443.008712487899,236.88770571152,1.33881897386254,1.18296224588577,48,83.765730880929297,83.765730880929297,0.46757018393029998,0.46757018393029998,2,2.00096805421104,2.00096805421104]
[null,"STN012","Shepparton CSC","Urban",3185,16.162610000000001,12.790614,9.952,0.11799999999999999,0.88300000000000001,6,2.1309262166404999,2.1309262166404999,1.915227629513E-2,1.915227629513E-2,11,16.002511773940299,16.002511773940299,0.12025117739403,0.12025117739403,0,0,0]
[null,"STN013","Shepparton CSC","Urban",3,0.18267,0.96709000000000001,6.7530000000000001,0,0,0,0,0,0,0,0,0,0,0,0,0,0,0]
[null,"STN014","Shepparton CSC","Urban",656,4.3732600000000001,2.1585589999999999,7.3449999999999998,0.33400000000000002,1.0189999999999999,1,7.3887195121951201,7.3887195121951201,4.5731707317069999E-2,4.5731707317069999E-2,6,22.577743902439,22.577743902439,0.19664634146342,0.19664634146342,1,0.96189024390244005,0.96189024390244005]
[null,"STN021","Shepparton CSC","Rural Short",1876,122.62947,4.0937700000000001,5.5679999999999996,16.048999999999999,4.258,49,465.92590618336902,310.28997867803798,2.37633262260128,1.36140724946695,36,123.62526652452,123.62526652452,0.53518123667378004,0.53518123667378004,2,2.0031982942430702,0.99786780383796003]
[null,"STN022","Shepparton CSC","Urban",2867,13.614879999999999,0.84282299999999999,7.8979999999999997,6.3E-2,0.12,2,1.4464597139867501,1.4464597139867501,1.325427275898E-2,1.325427275898E-2,3,2.7540983606557399,2.7540983606557399,3.3135681897450003E-2,3.3135681897450003E-2,2,1.9993024066969001,1.9993024066969001]
[null,"STN023","Shepparton CSC","Urban",284,1.33161,2.727357,4.7779999999999996,0.26800000000000002,1.1459999999999999,1,10.6795774647887,10.6795774647887,1.408450704225E-2,1.408450704225E-2,3,45.630281690140798,45.630281690140798,0.22887323943662,0.22887323943662,0,0,0]
[null,"STN024","Shepparton CSC","Rural Long",1212,219.75104999999999,2.4855200000000002,9.2799999999999994,12.88,0.77200000000000002,20,203.246699669967,126.918316831683,0.99834983498350005,0.95049504950495001,11,12.182343234323399,12.182343234323399,0.12376237623762,0.12376237623762,6,6.0231023102310202,6.0231023102310202]
[null,"SU011","Sunshine CSC","Rural Short","-",0.31802000000000002,0.20485999999999999,0,0,0,0,0,0,0,0,0,0,0,0,0,0,0,0]
[null,"SU012","Sunshine CSC","Urban",3054,9.9774499999999993,13.270989,8.5709999999999997,0.152,0.48099999999999998,2,2.90406024885396,2.90406024885396,1.440733464309E-2,1.440733464309E-2,3,9.1663392272429594,9.1663392272429594,2.9796987557299998E-2,2.9796987557299998E-2,0,0,0]
[null,"SU013","Sunshine CSC","Urban",86,4.9545599999999999,8.9846599999999999,8.4930000000000003,4.3849999999999998,9.4629999999999992,7,50.848837209302303,50.848837209302303,0.74418604651163001,0.74418604651163001,6,109.732558139535,109.732558139535,0.73255813953488003,0.73255813953488003,0,0,0]
[null,"SU015","Sunshine CSC","Rural Short",5201,8.3187099999999994,32.906353000000003,10.616,8.8859999999999992,0.30599999999999999,9,89.182657181311299,89.182657181311299,1.05575850797923,1.05575850797923,5,3.0715247067871601,3.0715247067871601,1.172851374736E-2,1.172851374736E-2,0,0,0]
[null,"SU021","Sunshine CSC","Urban",3428,14.32554,2.6471200000000001,9.5150000000000006,4.7779999999999996,0.13,8,58.445157526254398,58.445157526254398,0.85151691948658004,0.85151691948658004,1,1.59159859976663,1.59159859976663,9.0431738623099993E-3,9.0431738623099993E-3,0,0,0]
[null,"SU022","Sunshine CSC","Urban",4501,8.3073899999999998,15.10938,9.7899999999999991,0.58199999999999996,2.355,11,9.6416351921795194,9.6416351921795194,5.3321484114640001E-2,5.3321484114640001E-2,5,39.040213285936503,39.040213285936503,0.17329482337258001,0.17329482337258001,0,0,0]
[null,"SU023","Sunshine CSC","Urban",2866,0.31268000000000001,18.742010000000001,10.419,0.92100000000000004,0,1,9.3715980460572208,9.3715980460572208,1.0467550593159999E-2,1.0467550593159999E-2,0,0,0,0,0,0,0,0]
[null,"SU024","#","Urban","-",0,2.8614799999999998,0,0,0,0,0,0,0,0,0,0,0,0,0,0,0,0]
[null,"SU032","Sunshine CSC","Urban","-",0,3.3193000000000001,2.6339999999999999,0,0,0,0,0,0,0,0,0,0,0,0,0,0,0]
[null,"SU033","Sunshine CSC","Rural Short","-",0,0.11330999999999999,0,0,0,0,0,0,0,0,0,0,0,0,0,0,0,0]
[null,"SU034","Sunshine CSC","Urban",171,7.3571600000000004,4.4832039999999997,19.187000000000001,11.871,0.30099999999999999,5,99.204678362573105,99.204678362573105,1.6081871345029199,1.6081871345029199,3,2.5146198830409401,2.5146198830409401,2.9239766081870001E-2,2.9239766081870001E-2,1,0.48538011695907002,0.48538011695907002]
[null,"SU035","Sunshine CSC","Urban",7481,18.815570000000001,26.433,15.727,17.245000000000001,0.46300000000000002,12,157.966849351691,157.966849351691,1.4351022590562701,1.4351022590562701,11,4.2454217350621599,4.2454217350621599,2.285790669697E-2,2.285790669697E-2,0,0,0]
[null,"TNA011","Sunshine CSC","Urban",5,4.0078699999999996,2.6357900000000001,3.5619999999999998,0,0,0,0,0,0,0,0,0,0,0,0,0,0,0]
[null,"TNA013","Sunshine CSC","Rural Short",2508,16.790099999999999,33.604047999999999,9.6460000000000008,6.4000000000000001E-2,0,4,7.1076555023923396,7.1076555023923396,3.6283891547050001E-2,3.6283891547050001E-2,0,0,0,0,0,0,0,0]
[null,"TNA014","Sunshine CSC","Urban",25,4.6782000000000004,3.5490599999999999,7.5119999999999996,0,0,0,0,0,0,0,0,0,0,0,0,0,0,0]
[null,"TNA021","Sunshine CSC","Urban",8,10.989039999999999,2.2831399999999999,7.5270000000000001,0,-0.754,0,0,0,0,0,1,78,78,0.25,0.25,0,0,0]
[null,"TNA023","Sunshine CSC","Rural Short",1074,89.18817,23.570933,11.071,1E-3,5.1999999999999998E-2,1,0.11266294227188001,0.11266294227188001,9.3109869646000002E-4,9.3109869646000002E-4,1,4.3342644320297996,4.3342644320297996,0.22811918063315001,0.22811918063315001,0,0,0]
[null,"TNA024","Sunshine CSC","Urban",172,0,11.405810000000001,8.19,0,0,0,0,0,0,0,0,0,0,0,0,0,0,0]
[null,"TRG001","Warrnambool CSC","Rural Short",429,117.31831,5.6030000000000003E-2,1.9350000000000001,0.23,4.2080000000000002,13,19.426573426573398,19.2610722610723,0.13286713286713001,0.13053613053613,15,355.11655011655,355.11655011655,1.5757575757575799,1.5757575757575799,1,1.0023310023309999,1.0023310023309999]
[null,"TRG002","Warrnambool CSC","Rural Long",1994,722.67115999999999,2.43167,8.3330000000000002,7.1150000000000002,0.89300000000000002,59,184.662988966901,184.662988966901,1.57773319959879,1.57773319959879,24,23.187562688064201,23.187562688064201,0.11334002006018,0.11334002006018,3,2.9994984954864599,2.9994984954864599]
[null,"TRG003","Warrnambool CSC","Rural Long",1674,342.14319999999998,1.28485,8.6489999999999991,37.006,9.2100000000000009,76,737.75746714456398,340.31362007168502,4.3357228195937898,3.6236559139784998,44,183.611111111111,183.611111111111,0.72580645161290003,0.72580645161290003,3,3.0041816009557998,3.0041816009557998]
[null,"TRG004","Warrnambool CSC","Rural Short",1570,160.03626,0,5.8049999999999997,4.859,3.278,19,148.192993630573,5.8369426751592401,0.35477707006369003,4.5222929936309997E-2,35,99.957961783439501,99.957961783439501,0.56369426751592,0.56369426751592,0,0,0]
[null,"TRG005","Warrnambool CSC","Rural Long",1101,239.18299999999999,0.79796,5.5289999999999999,18.405000000000001,12.987,45,504.62034514078101,490.780199818347,4.0535876475930896,4.0227066303360504,35,356.068119891008,356.068119891008,1.4486830154405099,1.4486830154405099,1,0.99545867393278997,0.99545867393278997]
[null,"WBE011","Sunshine CSC","Urban",2466,10.30935,1.274553,6.9349999999999996,0.36799999999999999,0.187,2,7.5770478507704802,5.9874290348742898,5.7177615571779999E-2,4.2984590429849999E-2,2,3.8605028386050302,3.8605028386050302,1.297648012976E-2,1.297648012976E-2,1,0.99635036496350005,0.99635036496350005]
[null,"WBE012","Sunshine CSC","Urban",4814,8.6631199999999993,19.432510000000001,9.5749999999999993,2.99,0.54300000000000004,3,64.116950560864197,64.116950560864197,1.06626506024096,1.06626506024096,4,11.6501869547154,11.6501869547154,6.3772330702120003E-2,6.3772330702120003E-2,0,0,0]
[null,"WBE013","Sunshine CSC","Urban",5835,9.6016700000000004,27.897600000000001,11.9,0.27700000000000002,1.2929999999999999,6,3.6053127677806298,3.6053127677806298,4.2330762639250001E-2,4.2330762639250001E-2,9,16.8565552699229,16.8565552699229,6.6838046272490001E-2,6.6838046272490001E-2,1,1.00685518423308,1.00685518423308]
[null,"WBE014","Sunshine CSC","Rural Short",4276,12.55345,20.149100000000001,7.859,0.57299999999999995,5.8000000000000003E-2,9,13.004911131899,13.004911131899,8.3956969130029993E-2,8.3956969130029993E-2,2,1.3189897100093499,1.3189897100093499,6.0804490177699998E-3,6.0804490177699998E-3,0,0,0]
[null,"WBE021","Sunshine CSC","Urban",2752,6.9091800000000001,7.2933240000000001,9.93,1.506,1.631,4,22.984738372092998,22.984738372092998,0.94876453488372003,0.94876453488372003,2,24.8913517441861,24.8913517441861,6.1409883720930002E-2,6.1409883720930002E-2,0,0,0]
[null,"WBE022","Sunshine CSC","Urban",1465,8.7898599999999991,3.5659040000000002,6.62,2.0859999999999999,0.75900000000000001,8,48.088737201365198,48.088737201365198,1.18430034129693,1.18430034129693,5,17.486006825938599,17.486006825938599,8.1228668941979998E-2,8.1228668941979998E-2,2,1.9972696245733801,1.9972696245733801]
[null,"WBE023","Sunshine CSC","Rural Short",4217,46.753549999999997,15.565530000000001,8.3930000000000007,0.872,0.32800000000000001,14,30.527389139198501,30.4434432060707,1.03462176903012,1.0343846336258,2,11.474507944036,11.474507944036,6.2840882143699997E-2,6.2840882143699997E-2,1,1.0007114062129501,1.0007114062129501]
[null,"WBE024","Sunshine CSC","Urban",3156,15.18798,3.1894900000000002,14.58,10.584,5.0709999999999997,14,113.876108998733,113.876108998733,1.18472750316857,1.18472750316857,14,54.564955640050698,54.564955640050698,0.23003802281369001,0.23003802281369001,1,1.00126742712294,1.00126742712294]
[null,"WBE031","Sunshine CSC","Urban",4680,16.471979999999999,9.1526599999999991,8.3140000000000001,3.972,6.0999999999999999E-2,9,131.602564102564,131.602564102564,0.87649572649573004,0.87649572649573004,2,2.0160256410256401,2.0160256410256401,5.1282051282100002E-3,5.1282051282100002E-3,0,0,0]
[null,"WBE032","Sunshine CSC","Urban",3644,5.8398300000000001,8.8284000000000002,5.5170000000000003,0.04,0.84,5,0.98929747530186996,0.86306256860593,7.9582875960500007E-3,7.6838638858400003E-3,5,20.915203073545499,20.915203073545499,6.7233809001100001E-2,6.7233809001100001E-2,0,0,0]
[null,"WBE033","Sunshine CSC","Urban",2593,23.629110000000001,1.9155800000000001,8.1959999999999997,3.68,0.60399999999999998,10,118.825298881604,118.825298881604,1.0431932124951799,1.0431932124951799,5,19.519089857308099,19.519089857308099,8.1758580794450003E-2,8.1758580794450003E-2,4,4.0084843810258404,4.0084843810258404]
[null,"WBE034","Sunshine CSC","Rural Short",3262,56.007980000000003,13.738177,10.954000000000001,10.324,0.73,27,138.548743102391,138.444819129368,1.2247087676272199,1.22440220723483,4,9.7998160637645597,9.7998160637645597,3.0042918454940001E-2,3.0042918454940001E-2,0,0,0]
[null,"WBL002","Warrnambool CSC","Rural Short",1876,159.03457,1.3965799999999999,13.901,30.968,8.1010000000000009,40,232.194562899787,231.17910447761199,2.8251599147121498,2.8171641791044699,25,60.741471215351801,60.741471215351801,0.26599147121534999,0.26599147121534999,4,4.0447761194029903,4.0447761194029903]
[null,"WBL003","Warrnambool CSC","Urban",1889,12.831440000000001,7.5324,6.9109999999999996,1.0589999999999999,1.593,8,23.338803599788299,21.1026998411858,1.0275277924827899,0.99258867125463002,5,35.096876654314499,35.096876654314499,0.22763366860772999,0.22763366860772999,0,0,0]
[null,"WBL004","Warrnambool CSC","Urban",1992,19.322870000000002,3.5529999999999999,8.3330000000000002,3.4670000000000001,4.2130000000000001,17,44.045682730923701,43.627008032128501,0.38955823293172998,0.38905622489960001,13,53.519578313253,53.519578313253,0.38554216867469998,0.38554216867469998,0,0,0]
[null,"WBL005","Warrnambool CSC","Rural Short",2245,158.05571,4.2851299999999997,5.766,6.343,1.4830000000000001,31,196.97594654788401,194.639198218263,2.0182628062360801,1.9910913140311799,12,46.064587973273902,46.064587973273902,0.1532293986637,0.1532293986637,1,1.00935412026726,1.00935412026726]
[null,"WBL006","Warrnambool CSC","Rural Short",2794,14.02178,0.70806999999999998,4.1859999999999999,3.1480000000000001,3.5550000000000002,12,133.07730851825301,133.07730851825301,1.5637079455977101,1.5637079455977101,4,150.28954903364399,150.28954903364399,0.55476020042949004,0.55476020042949004,0,0,0]
[null,"WBL008","Warrnambool CSC","Urban",2290,10.857889999999999,1.085793,5.0149999999999997,3.4910000000000001,1.647,12,98.553275109170301,98.553275109170301,1.28427947598253,1.28427947598253,4,46.485152838428,46.485152838428,0.14803493449781999,0.14803493449781999,1,0.99781659388646005,0.99781659388646005]
[null,"WBL010","Warrnambool CSC","Urban",1132,5.6507899999999998,1.29511,9.1219999999999999,0.501,5.6970000000000001,3,9.2676678445229701,9.2676678445229701,6.4487632508829995E-2,6.4487632508829995E-2,4,105.40901060070701,105.40901060070701,0.43727915194346001,0.43727915194346001,1,0.99646643109540001,0.99646643109540001]
[null,"WBL012","Warrnambool CSC","Rural Long",2606,264.26222000000001,3.0964900000000002,9.6359999999999992,7.4050000000000002,7.6929999999999996,89,113.926323867997,110.879125095932,1.69263238679969,1.6830391404451299,53,118.358403683807,118.358403683807,0.66768994627781997,0.66768994627781997,0,0,0]
[null,"WIN011","Ballarat CSC","Rural Long",1536,216.00869,143.95235,4.3840000000000003,3.8780000000000001,6.6310000000000002,20,153.146484375,153.146484375,2.6158854166666701,2.6158854166666701,68,261.84830729166703,261.84830729166703,1.2962239583333299,1.2962239583333299,1,1.0045572916666701,1.0045572916666701]
[null,"WIN012","Ballarat CSC","Rural Long",1011,163.18059,70.079266000000004,3.87,0.97799999999999998,3.1339999999999999,31,135.03659742828901,135.03659742828901,0.62413452027695004,0.62413452027695004,41,432.51533135509402,432.51533135509402,2.24629080118694,2.24629080118694,1,1,1]
[null,"WIN013","Ballarat CSC","Rural Short",808,134.02277000000001,6.1190499999999997,2.2909999999999999,2.19,2.8079999999999998,13,137.04455445544599,5.3972772277227703,1.0185643564356499,2.351485148515E-2,34,175.67574257425699,175.67574257425699,1.0074257425742601,1.0074257425742601,1,1.0074257425742601,1.0074257425742601]
[null,"WMN013","Mildura CSC","Rural Short",106,21.498139999999999,0.22222,5.0940000000000003,5.4960000000000004,16.940999999999999,5,200.78301886792499,200.78301886792499,1.5471698113207499,1.5471698113207499,5,618.89622641509402,618.89622641509402,3.6698113207547198,3.6698113207547198,0,0,0]
[null,"WMN014","Mildura CSC","Rural Short",180,69.675970000000007,1.228256,8.4510000000000005,2.6680000000000001,35.954000000000001,7,56.3611111111111,6.2277777777777796,0.35555555555556001,8.8888888888890003E-2,5,759.39444444444405,759.39444444444405,3.0722222222222202,3.0722222222222202,0,0,0]
[null,"WMN021","Mildura CSC","Rural Short",81,105.68581,0.78130299999999997,8.3719999999999999,72.831000000000003,43.761000000000003,10,1268.0493827160501,449.72839506172801,2.9999999999999898,2.0370370370370399,6,761.91358024691397,761.91358024691397,3.7901234567901398,3.7901234567901398,0,0,0]
[null,"WND011","Bendigo CSC","Rural Short",269,81.153030000000001,3.3335599999999999,1.0780000000000001,1.708,0.32700000000000001,13,320.12639405204499,213.32713754646801,3.1449814126394,2.1486988847583701,5,61.234200743494398,61.234200743494398,0.31226765799256001,0.31226765799256001,3,2.9888475836431199,2.9888475836431199]
[null,"WND012","Bendigo CSC","Rural Long",3675,273.38252999999997,8.97499,7.9039999999999999,32.31,1.6990000000000001,42,560.149387755102,227.887074829932,5.0604081632652997,4.0476190476190501,33,29.4508843537415,29.4508843537415,0.20435374149659999,0.20435374149659999,5,4.9912925170067899,4.9912925170067899]
[null,"WND013","Bendigo CSC","Rural Long",2640,564.96139000000005,11.36708,6.2119999999999997,42.667999999999999,2.286,65,992.95530303030296,174.02575757575801,3.4143939393939502,2.3882575757575801,17,53.208712121212102,53.208712121212102,0.15568181818182,0.15568181818182,1,0.99659090909090997,0]
[null,"WND014","Bendigo CSC","Rural Short",2224,35.024290000000001,2.6134599999999999,4.6399999999999997,5.6909999999999998,7.0000000000000007E-2,6,167.176258992806,167.176258992806,4.0170863309352702,4.0170863309352702,1,2.0476618705036,2.0476618705036,2.9676258992810001E-2,2.9676258992810001E-2,2,2.0058453237410099,2.0058453237410099]
[null,"WND021","Bendigo CSC","Rural Short",727,22.5168,3.60853,1.3280000000000001,1.0609999999999999,1.6060000000000001,8,100.32187070151301,100.32187070151301,1.43603851444291,1.43603851444291,10,151.909215955983,151.909215955983,0.69325997248967997,0.69325997248967997,0,0,0]
[null,"WND022","Bendigo CSC","Rural Short",136,12.790660000000001,0.28388999999999998,0.41399999999999998,0.113,0,6,51.838235294117702,51.838235294117702,1.09558823529412,1.09558823529412,0,0,0,0,0,1,1,1]
[null,"WND023","Bendigo CSC","Rural Long",1428,208.78629000000001,4.9793399999999997,4.3019999999999996,24.536000000000001,0.11,43,642.42086834733902,361.04481792717098,7.5315126050419998,5.5238095238095299,5,2.8830532212885198,2.8830532212885198,1.330532212885E-2,1.330532212885E-2,1,0.99299719887954996,0.99299719887954996]
[null,"WND024","Bendigo CSC","Rural Long",2424,306.26954999999998,74.534283000000002,5.6040000000000001,10.016999999999999,3.4710000000000001,66,254.61716171617201,253.73556105610601,3.0268151815181499,3.0259900990099,35,88.228960396039597,88.228960396039597,0.92656765676567998,0.92656765676567998,3,3.0115511551155101,3.0115511551155101]
[null,"WPD011","Geelong CSC","Rural Short",3636,129.99451999999999,8.9194870000000002,10.189,4.5309999999999997,0.33,33,91.0563806380638,91.039878987898803,2.5874587458745801,2.5866336633663298,23,6.6237623762376199,6.6237623762376199,5.4730473047299999E-2,5.4730473047299999E-2,1,1.0539053905390501,1.0539053905390501]
[null,"WPD012","Geelong CSC","Urban",3537,19.114570000000001,9.8041400000000003,12.715999999999999,4.907,1.071,7,59.957873904438799,9.2711337291489997,0.92705682782019005,9.6126661012159997E-2,3,13.0884930732259,13.0884930732259,6.3895957025730005E-2,6.3895957025730005E-2,0,0,0]
[null,"WPD013","Geelong CSC","Urban",53,4.9558600000000004,2.5955859999999999,5.8449999999999998,0,0,0,0,0,0,0,0,0,0,0,0,0,0,0]
[null,"WPD014","Geelong CSC","Rural Short",2369,171.53009,5.7208600000000001,8.3719999999999999,17.696000000000002,1.2529999999999999,57,632.83284086112303,308.32123258758998,2.3727311101730701,1.3735753482482,28,44.808780075981403,44.808780075981403,0.58421274799494005,0.58421274799494005,1,0.18319966230477,0.18319966230477]
[null,"WPD021","Geelong CSC","Rural Short",3865,97.834280000000007,6.8413339999999998,9.6750000000000007,19.888000000000002,12.016,42,424.853298835705,180.10090556274301,3.7298835705045201,2.8532988357050502,40,256.69573091849901,256.69573091849901,0.78369987063389002,0.78369987063389002,1,1.00051746442432,1.00051746442432]
[null,"WPD022","Geelong CSC","Rural Short",5023,58.733139999999999,32.175159999999998,10.268000000000001,0.27800000000000002,2.2080000000000002,16,4.4656579733227204,4.4656579733227204,1.5329484371890001E-2,1.5329484371890001E-2,16,35.494127015727599,35.494127015727599,0.30380250846107998,0.30380250846107998,0,0,0]
[null,"WPD024","Geelong CSC","Rural Short",5211,82.558620000000005,21.049403000000002,13.545,25.451000000000001,3.2930000000000001,47,293.16714642103199,207.97735559393601,3.4960660142007298,2.94818652849741,29,37.931682978315102,37.931682978315102,0.24179620034541999,0.24179620034541999,1,0.99059681443101,0.99059681443101]
[null,"WPD031","Geelong CSC","Urban",3539,8.5961200000000009,6.8385100000000003,10.505000000000001,6.8710000000000004,1.4E-2,6,212.83837242158799,87.903362531788602,2.4340209098615402,1.42752189884148,1,0.44504097202600001,0.44504097202600001,1.41282848262E-3,1.41282848262E-3,0,0,0]
[null,"WPD032","Geelong CSC","Rural Short",4993,35.103529999999999,10.720146,12.4,2.5369999999999999,4.9359999999999999,23,30.402363308632101,30.402363308632101,0.26216703384738999,0.26216703384738999,5,59.149208892449401,59.149208892449401,0.14199879831764001,0.14199879831764001,5,4.9833767274183796,4.9833767274183796]
[null,"WPD033","Geelong CSC","Urban",1796,8.0259400000000003,6.1150200000000003,9.32,0.94899999999999995,0,12,18.147550111358601,18.147550111358601,0.17538975501114001,0.17538975501114001,0,0,0,0,0,7,7.0005567928730601,7.0005567928730601]

{"sheet":"3.6.9 Network-reliability","index":7,"n_rows":22,"n_cols":3,"rows_kept":22,"cut":false,"hidden":false,"merged":[]}
[null,{"$f":"(LOOKUP(dms_Model,dms_Model_List,dms_Worksheet_List))","v":"ANNUAL REPORTING STATEMENT"}]
[null,{"$f":"dms_TradingName","v":"Powercor Australia"}]
[null,{"$f":"CONCATENATE(\"Annual Reporting RIN Response \",CRY)","v":"Annual Reporting RIN Response 2017"}]
[null,"3.6 QUALITY OF SERVICES"]
[]
[]
[null,"3.6.9 - NETWORK FEEDER RELIABILITY - PLANNED OUTAGES"]
[null,null,{"$f":"CRY","v":2017}]
[null,"3.6.9.1 - PLANNED MINUTES OFF SUPPLY (SAIDI)"]
[null,{"$f":"INDEX(dms_FeederName_1,MATCH(dms_TradingName,dms_TradingName_List))","v":"CBD"},"0"]
[null,{"$f":"INDEX(dms_FeederName_2,MATCH(dms_TradingName,dms_TradingName_List))","v":"Urban"},18.654896264370599]
[null,{"$f":"INDEX(dms_FeederName_3,MATCH(dms_TradingName,dms_TradingName_List))","v":"Short rural"},51.832321079218602]
[null,{"$f":"INDEX(dms_FeederName_4,MATCH(dms_TradingName,dms_TradingName_List))","v":"Long rural"},140.308486021568]
[null,{"$f":"IF((INDEX(dms_FeederName_5,MATCH(dms_TradingName,dms_TradingName_List))=0),\"\",(INDEX(dms_FeederName_5,MATCH(dms_TradingName,dms_TradingName_List))))","v":""}]
[]
[null,null,{"$f":"CRY","v":2017}]
[null,"3.6.9.2 - PLANNED INTERRUPTIONS TO SUPPLY (SAIFI)"]
[null,{"$f":"INDEX(dms_FeederName_1,MATCH(dms_TradingName,dms_TradingName_List))","v":"CBD"},"0"]
[null,{"$f":"INDEX(dms_FeederName_2,MATCH(dms_TradingName,dms_TradingName_List))","v":"Urban"},8.8435699200119997E-2]
[null,{"$f":"INDEX(dms_FeederName_3,MATCH(dms_TradingName,dms_TradingName_List))","v":"Short rural"},0.22288813618711001]
[null,{"$f":"INDEX(dms_FeederName_4,MATCH(dms_TradingName,dms_TradingName_List))","v":"Long rural"},0.67042626577211994]
[null,{"$f":"IF((INDEX(dms_FeederName_5,MATCH(dms_TradingName,dms_TradingName_List))=0),\"\",(INDEX(dms_FeederName_5,MATCH(dms_TradingName,dms_TradingName_List))))","v":""}]

{"sheet":"4.1 Public lighting","index":8,"n_rows":52,"n_cols":4,"rows_kept":52,"cut":false,"hidden":false,"merged":[[5,1,5,2]]}
[null,{"$f":"(LOOKUP(dms_Model,dms_Model_List,dms_Worksheet_List))","v":"ANNUAL REPORTING STATEMENT"}]
[null,{"$f":"dms_TradingName","v":"Powercor Australia"}]
[null,{"$f":"CONCATENATE(\"Annual Reporting RIN Response \",CRY)","v":"Annual Reporting RIN Response 2017"}]
[null,"4.1 PUBLIC LIGHTING"]
[]
[null,"Tables 4.1.1 - 4.1.3 deliberately omitted."]
[]
[null,"4.1.4 - PUBLIC LIGHTING METRICS BY TARIFF"]
[null,null,"Number of Lights","Public Lighting Revenue"]
[null,"Tariff categories","0's","$0's, nominal"]
[null,"Category P LED High Output",50,506]
[null,"Category P LED Standard Output",59480,1326857]
[null,"Compact Fluoro 32W",5160,184848]
[null,"Compact Fluoro 42W",5036,185990]
[null,"Fluorescent T5 (2X14W)",12286,466171]
[null,"Fluorescent T5 (2X24W)",1848,68181]
[null,"Mercury vapour 125 watt",791,53221]
[null,"Mercury vapour 250 watt",241,17498]
[null,"Mercury vapour 400 watt",80,6716]
[null,"Mercury vapour 50 watt",176,12355]
[null,"Mercury vapour 80 watt",39231,1981859]
[null,"Metal halide 150 watt",87,10650]
[null,"Metal halide 250 watt",351,43312]
[null,"Metal halide 70 watt",8,795]
[null,"Sodium 150 watt",28923,2653631]
[null,"Sodium 250 watt",13854,1293222]
[null,"Sodium 400 watt",755,94070]
[]
[]
[]
[]
[]
[]
[]
[]
[]
[]
[]
[]
[]
[]
[]
[]
[]
[]
[]
[]
[]
[]
[]
[null,"To enter further tariff categories - please insert new lines above this line. "]
[null,"Total ",{"$f":"SUM(C11:C50)","v":168357},{"$f":"SUM(D11:D50)","v":8399882}]

{"sheet":"6.2 STPIS Reliability","index":9,"n_rows":94,"n_cols":4,"rows_kept":94,"cut":false,"hidden":false,"merged":[[76,1,81,1],[82,1,87,1],[88,1,93,1],[75,1,75,2],[22,1,27,1],[32,1,37,1],[38,1,43,1],[44,1,49,1],[5,1,5,2],[31,1,31,2],[66,1,71,1],[60,1,65,1],[53,1,53,2],[54,1,59,1],[16,1,21,1],[9,1,9,2],[10,1,15,1]]}
[null,{"$f":"(LOOKUP(dms_Model,dms_Model_List,dms_Worksheet_List))","v":"ANNUAL REPORTING STATEMENT"}]
[null,{"$f":"dms_TradingName","v":"Powercor Australia"}]
[null,{"$f":"CONCATENATE(\"Annual Reporting RIN Response \",CRY)","v":"Annual Reporting RIN Response 2017"}]
[null,"6.2 RELIABILITY AND CUSTOMER SERVICE PERFORMANCE"]
[]
[null,"Did the MAIFI parameter of the STPIS apply during the period?\nNB:This flag is set from the response on worksheet 3.6.8 Network feeders",null,{"$f":"dms_MAIFI_Flag","v":"Yes"}]
[]
[]
[null,"6.2.1 - UNPLANNED MINUTES OFF SUPPLY (SAIDI)"]
[null,null,null,{"$f":"CRY","v":2017}]
[null,"Total sustained minutes off supply",{"$f":"INDEX(dms_FeederName_1,MATCH(dms_TradingName,dms_TradingName_List))","v":"CBD"},0]
[null,null,{"$f":"INDEX(dms_FeederName_2,MATCH(dms_TradingName,dms_TradingName_List))","v":"Urban"},60.256553358626199]
[null,null,{"$f":"INDEX(dms_FeederName_3,MATCH(dms_TradingName,dms_TradingName_List))","v":"Short rural"},139.50220092270899]
[null,null,{"$f":"INDEX(dms_FeederName_4,MATCH(dms_TradingName,dms_TradingName_List))","v":"Long rural"},285.58491600327898]
[null,null,{"$f":"IF((INDEX(dms_FeederName_5,MATCH(dms_TradingName,dms_TradingName_List))=0),\"\",(INDEX(dms_FeederName_5,MATCH(dms_TradingName,dms_TradingName_List))))","v":""}]
[null,null,"Whole Network",146.096738443248]
[null,"Total of excluded events*\n\n*see 3.3 of STPIS",{"$f":"INDEX(dms_FeederName_1,MATCH(dms_TradingName,dms_TradingName_List))","v":"CBD"},0]
[null,null,{"$f":"INDEX(dms_FeederName_2,MATCH(dms_TradingName,dms_TradingName_List))","v":"Urban"},4.1137412677630962]
[null,null,{"$f":"INDEX(dms_FeederName_3,MATCH(dms_TradingName,dms_TradingName_List))","v":"Short rural"},40.107330569101393]
[null,null,{"$f":"INDEX(dms_FeederName_4,MATCH(dms_TradingName,dms_TradingName_List))","v":"Long rural"},117.62394791863699]
[null,null,{"$f":"IF((INDEX(dms_FeederName_5,MATCH(dms_TradingName,dms_TradingName_List))=0),\"\",(INDEX(dms_FeederName_5,MATCH(dms_TradingName,dms_TradingName_List))))","v":""}]
[null,null,"Whole Network",46.001232938474004]
[null,"Total sustained minutes off supply after removing excluded events",{"$f":"INDEX(dms_FeederName_1,MATCH(dms_TradingName,dms_TradingName_List))","v":"CBD"},0]
[null,null,{"$f":"INDEX(dms_FeederName_2,MATCH(dms_TradingName,dms_TradingName_List))","v":"Urban"},56.142812090863103]
[null,null,{"$f":"INDEX(dms_FeederName_3,MATCH(dms_TradingName,dms_TradingName_List))","v":"Short rural"},99.394870353607601]
[null,null,{"$f":"INDEX(dms_FeederName_4,MATCH(dms_TradingName,dms_TradingName_List))","v":"Long rural"},167.96096808464199]
[null,null,{"$f":"IF((INDEX(dms_FeederName_5,MATCH(dms_TradingName,dms_TradingName_List))=0),\"\",(INDEX(dms_FeederName_5,MATCH(dms_TradingName,dms_TradingName_List))))","v":""}]
[null,null,"Whole Network",100.095505504774]
[]
[]
[null,"6.2.2 - UNPLANNED INTERRUPTIONS TO SUPPLY (SAIFI)"]
[null,null,null,{"$f":"CRY","v":2017}]
[null,"Total sustained interruptions",{"$f":"INDEX(dms_FeederName_1,MATCH(dms_TradingName,dms_TradingName_List))","v":"CBD"},0]
[null,null,{"$f":"INDEX(dms_FeederName_2,MATCH(dms_TradingName,dms_TradingName_List))","v":"Urban"},0.74764830866167997]
[null,null,{"$f":"INDEX(dms_FeederName_3,MATCH(dms_TradingName,dms_TradingName_List))","v":"Short rural"},1.31652042514673]
[null,null,{"$f":"INDEX(dms_FeederName_4,MATCH(dms_TradingName,dms_TradingName_List))","v":"Long rural"},1.99506643575452]
[null,null,{"$f":"IF((INDEX(dms_FeederName_5,MATCH(dms_TradingName,dms_TradingName_List))=0),\"\",(INDEX(dms_FeederName_5,MATCH(dms_TradingName,dms_TradingName_List))))","v":""}]
[null,null,"Whole Network",1.2677730788702799]
[null,"Total of excluded events*\n\n*see 3.3 of STPIS",{"$f":"INDEX(dms_FeederName_1,MATCH(dms_TradingName,dms_TradingName_List))","v":"CBD"},0]
[null,null,{"$f":"INDEX(dms_FeederName_2,MATCH(dms_TradingName,dms_TradingName_List))","v":"Urban"},3.5167859634369969E-2]
[null,null,{"$f":"INDEX(dms_FeederName_3,MATCH(dms_TradingName,dms_TradingName_List))","v":"Short rural"},0.16092285455660993]
[null,null,{"$f":"INDEX(dms_FeederName_4,MATCH(dms_TradingName,dms_TradingName_List))","v":"Long rural"},0.32901100713596998]
[null,null,{"$f":"IF((INDEX(dms_FeederName_5,MATCH(dms_TradingName,dms_TradingName_List))=0),\"\",(INDEX(dms_FeederName_5,MATCH(dms_TradingName,dms_TradingName_List))))","v":""}]
[null,null,"Whole Network",0.15484271533603988]
[null,"Total sustained interruptions after removing excluded events",{"$f":"INDEX(dms_FeederName_1,MATCH(dms_TradingName,dms_TradingName_List))","v":"CBD"},0]
[null,null,{"$f":"INDEX(dms_FeederName_2,MATCH(dms_TradingName,dms_TradingName_List))","v":"Urban"},0.71248044902731]
[null,null,{"$f":"INDEX(dms_FeederName_3,MATCH(dms_TradingName,dms_TradingName_List))","v":"Short rural"},1.15559757059012]
[null,null,{"$f":"INDEX(dms_FeederName_4,MATCH(dms_TradingName,dms_TradingName_List))","v":"Long rural"},1.66605542861855]
[null,null,{"$f":"IF((INDEX(dms_FeederName_5,MATCH(dms_TradingName,dms_TradingName_List))=0),\"\",(INDEX(dms_FeederName_5,MATCH(dms_TradingName,dms_TradingName_List))))","v":""}]
[null,null,"Whole Network",1.11293036353424]
[]
[]
[null,"6.2.3 - UNPLANNED MOMENTARY INTERRUPTIONS TO SUPPLY (MAIFI)"]
[null,null,null,{"$f":"CRY","v":2017}]
[null,"Total momentary interruptions",{"$f":"INDEX(dms_FeederName_1,MATCH(dms_TradingName,dms_TradingName_List))","v":"CBD"},0]
[null,null,{"$f":"INDEX(dms_FeederName_2,MATCH(dms_TradingName,dms_TradingName_List))","v":"Urban"},1.1939392781032301]
[null,null,{"$f":"INDEX(dms_FeederName_3,MATCH(dms_TradingName,dms_TradingName_List))","v":"Short rural"},2.30650129938389]
[null,null,{"$f":"INDEX(dms_FeederName_4,MATCH(dms_TradingName,dms_TradingName_List))","v":"Long rural"},4.7287315840282496]
[null,null,{"$f":"IF((INDEX(dms_FeederName_5,MATCH(dms_TradingName,dms_TradingName_List))=0),\"\",(INDEX(dms_FeederName_5,MATCH(dms_TradingName,dms_TradingName_List))))","v":""}]
[null,null,"Whole Network",2.4954813245713701]
[null,"Total of excluded events*\n\n*see 3.3 of STPIS",{"$f":"INDEX(dms_FeederName_1,MATCH(dms_TradingName,dms_TradingName_List))","v":"CBD"},0]
[null,null,{"$f":"INDEX(dms_FeederName_2,MATCH(dms_TradingName,dms_TradingName_List))","v":"Urban"},8.3332536959701553E-3]
[null,null,{"$f":"INDEX(dms_FeederName_3,MATCH(dms_TradingName,dms_TradingName_List))","v":"Short rural"},0.14431556048704985]
[null,null,{"$f":"INDEX(dms_FeederName_4,MATCH(dms_TradingName,dms_TradingName_List))","v":"Long rural"},0.34776049170704937]
[null,null,{"$f":"IF((INDEX(dms_FeederName_5,MATCH(dms_TradingName,dms_TradingName_List))=0),\"\",(INDEX(dms_FeederName_5,MATCH(dms_TradingName,dms_TradingName_List))))","v":""}]
[null,null,"Whole Network",0.14337097217009998]
[null,"Total momentary interruptions after removing excluded events",{"$f":"INDEX(dms_FeederName_1,MATCH(dms_TradingName,dms_TradingName_List))","v":"CBD"},0]
[null,null,{"$f":"INDEX(dms_FeederName_2,MATCH(dms_TradingName,dms_TradingName_List))","v":"Urban"},1.1856060244072599]
[null,null,{"$f":"INDEX(dms_FeederName_3,MATCH(dms_TradingName,dms_TradingName_List))","v":"Short rural"},2.1621857388968402]
[null,null,{"$f":"INDEX(dms_FeederName_4,MATCH(dms_TradingName,dms_TradingName_List))","v":"Long rural"},4.3809710923212002]
[null,null,{"$f":"IF((INDEX(dms_FeederName_5,MATCH(dms_TradingName,dms_TradingName_List))=0),\"\",(INDEX(dms_FeederName_5,MATCH(dms_TradingName,dms_TradingName_List))))","v":""}]
[null,null,"Whole Network",2.3521103524012701]
[]
[]
[null,"6.2.4 - DISTRIBUTION CUSTOMER NUMBERS"]
[null,null,null,{"$f":"CRY","v":2017}]
[null,"Customer numbers at the start of the period",{"$f":"INDEX(dms_FeederName_1,MATCH(dms_TradingName,dms_TradingName_List))","v":"CBD"},0]
[null,null,{"$f":"INDEX(dms_FeederName_2,MATCH(dms_TradingName,dms_TradingName_List))","v":"Urban"},312209]
[null,null,{"$f":"INDEX(dms_FeederName_3,MATCH(dms_TradingName,dms_TradingName_List))","v":"Short rural"},268096]
[null,null,{"$f":"INDEX(dms_FeederName_4,MATCH(dms_TradingName,dms_TradingName_List))","v":"Long rural"},204832]
[null,null,{"$f":"IF((INDEX(dms_FeederName_5,MATCH(dms_TradingName,dms_TradingName_List))=0),\"\",(INDEX(dms_FeederName_5,MATCH(dms_TradingName,dms_TradingName_List))))","v":""}]
[null,null,"Whole Network",785137]
[null,"Customer numbers at the end of the period",{"$f":"INDEX(dms_FeederName_1,MATCH(dms_TradingName,dms_TradingName_List))","v":"CBD"},0]
[null,null,{"$f":"INDEX(dms_FeederName_2,MATCH(dms_TradingName,dms_TradingName_List))","v":"Urban"},315551]
[null,null,{"$f":"INDEX(dms_FeederName_3,MATCH(dms_TradingName,dms_TradingName_List))","v":"Short rural"},279794]
[null,null,{"$f":"INDEX(dms_FeederName_4,MATCH(dms_TradingName,dms_TradingName_List))","v":"Long rural"},207401]
[null,null,{"$f":"IF((INDEX(dms_FeederName_5,MATCH(dms_TradingName,dms_TradingName_List))=0),\"\",(INDEX(dms_FeederName_5,MATCH(dms_TradingName,dms_TradingName_List))))","v":""}]
[null,null,"Whole Network",802746]
[null,"Average customer numbers",{"$f":"INDEX(dms_FeederName_1,MATCH(dms_TradingName,dms_TradingName_List))","v":"CBD"},0]
[null,null,{"$f":"INDEX(dms_FeederName_2,MATCH(dms_TradingName,dms_TradingName_List))","v":"Urban"},313880]
[null,null,{"$f":"INDEX(dms_FeederName_3,MATCH(dms_TradingName,dms_TradingName_List))","v":"Short rural"},273945]
[null,null,{"$f":"INDEX(dms_FeederName_4,MATCH(dms_TradingName,dms_TradingName_List))","v":"Long rural"},206117]
[null,null,{"$f":"IF((INDEX(dms_FeederName_5,MATCH(dms_TradingName,dms_TradingName_List))=0),\"\",(INDEX(dms_FeederName_5,MATCH(dms_TradingName,dms_TradingName_List))))","v":""},{"$f":"ROUND(SUM(D81+D87)/2,0)","v":0}]
[null,null,"Whole Network",793942]

{"sheet":"6.6 STPIS Customer Service","index":10,"n_rows":12,"n_cols":4,"rows_kept":12,"cut":false,"hidden":false,"merged":[]}
[null,{"$f":"(LOOKUP(dms_Model,dms_Model_List,dms_Worksheet_List))","v":"ANNUAL REPORTING STATEMENT"}]
[null,{"$f":"dms_TradingName","v":"Powercor Australia"}]
[null,{"$f":"CONCATENATE(\"Annual Reporting RIN Response \",CRY)","v":"Annual Reporting RIN Response 2017"}]
[null,"6.6 STPIS CUSTOMER SERVICE"]
[]
[]
[null,"6.6.1 - TELEPHONE ANSWERING"]
[null,null,"Number of calls \nafter removing excluded events","Total number of calls"]
[null,null,{"$f":"CRY","v":2017},{"$f":"CRY","v":2017}]
[null,"Number of calls received",72608,75599]
[null,"Number of calls answered within 30 seconds",60808]
[null,"Percentage of calls answered within 30 seconds",0.83750000000000002]

{"sheet":"6.7 STPIS Daily Performance","index":11,"n_rows":380,"n_cols":14,"rows_kept":380,"cut":false,"hidden":false,"merged":[[6,1,6,5],[8,1,8,6],[12,4,12,5],[12,6,12,7],[12,10,12,11],[12,8,12,9],[12,12,12,13],[11,1,13,1],[11,2,11,3],[12,2,13,2],[11,4,11,13],[12,3,13,3]]}
[null,{"$f":"(LOOKUP(dms_Model,dms_Model_List,dms_Worksheet_List))","v":"ANNUAL REPORTING STATEMENT"},null,null,null,null,null,null,{"$f":"CONCATENATE(IF(LEN(CRY)=4,\"1-Jan-\",\"1-Jul-\"),LEFT(CRY,4))","v":"1-Jan-2017"}]
[null,{"$f":"dms_TradingName","v":"Powercor Australia"}]
[null,{"$f":"CONCATENATE(\"Annual Reporting RIN Response \",CRY)","v":"Annual Reporting RIN Response 2017"}]
[null,"6.7 STPIS DAILY PERFORMANCE"]
[]
[]
[null,"Did the MAIFI parameter of the STPIS apply during the period?\nThis flag is set from the response on worksheet 3.6.8 Network feeders",null,null,null,null,{"$f":"dms_MAIFI_Flag","v":"Yes"}]
[]
[null,"The excluded events to be removed from the data refer only to events listed in clause 3.3(a) of the STPIS, with respect to reliability data, and in clause 5.4 of the STPIS with respect to customer service parameters.\n\n*Customer service information must be reported as per the definitions in the STPIS, that is excluding: \n   • calls to payment lines and automated interactive services \n   • calls abandoned by the customer within 30 seconds of the call being queued for response by a human operator (where the time in which a telephone call is abandoned is not measured, then an estimate of the number of calls abandoned within 30 seconds will be determined by taking 20 per cent of all calls abandoned)."]
[]
[null,"6.7.1 - DAILY PERFORMANCE DATA - UNPLANNED"]
[null,"Date","Customer service*",null,"MAIFI"]
[null,null,"Number of calls received\n(after removing excluded events)","Number of calls answered in 30 seconds\n(after removing excluded events)",{"$f":"INDEX(dms_FeederName_1,MATCH(dms_TradingName,dms_TradingName_List))","v":"CBD"},null,{"$f":"INDEX(dms_FeederName_2,MATCH(dms_TradingName,dms_TradingName_List))","v":"Urban"},null,{"$f":"INDEX(dms_FeederName_3,MATCH(dms_TradingName,dms_TradingName_List))","v":"Short rural"},null,{"$f":"INDEX(dms_FeederName_4,MATCH(dms_TradingName,dms_TradingName_List))","v":"Long rural"},null,{"$f":"IF((INDEX(dms_FeederName_5,MATCH(dms_TradingName,dms_TradingName_List))=0),\"Network\",(INDEX(dms_FeederName_5,MATCH(dms_TradingName,dms_TradingName_List))))","v":"Network"}]
[null,null,null,null,"All events","After removing excluded events","All events","After removing excluded events","All events","After removing excluded events","All events","After removing excluded events","All events","After removing excluded events"]
[null,{"$f":"CONCATENATE(IF(LEN(CRY)=4,\"1-Jan-\",\"1-Jul-\"),LEFT(CRY,4))","v":"1-Jan-2017"},69,60,0,0,1.207620977119E-2,1.207620977119E-2,6.4312202528699998E-3,6.4312202528699998E-3,1.703704781725E-2,1.703704781725E-2,1.141633020082E-2,1.141633020082E-2]
[null,{"$f":"B15+1","v":"2017-01-02"},131,123,0,0,0,0,3.79230297544E-3,3.79230297544E-3,2.2315039851999999E-4,2.2315039851999999E-4,1.3664333444999999E-3,1.3664333444999999E-3]
[null,"2017-01-03",144,142,0,0,4.1156589354700004E-3,4.1156589354700004E-3,1.7191286828E-3,1.7191286828E-3,1.2748679289219999E-2,1.2748679289219999E-2,5.5299620421199996E-3,5.5299620421199996E-3]
[null,"2017-01-04",250,212,0,0,0,0,1.308143779017E-2,1.308143779017E-2,7.4706872547199996E-3,7.4706872547199996E-3,6.4530916656399999E-3,6.4530916656399999E-3]
[null,"2017-01-05",445,373,0,0,9.98015436907E-3,9.98015436907E-3,2.07317429264E-3,2.07317429264E-3,0.13733936809628,0.13733936809628,4.0315450897820002E-2,4.0315450897820002E-2]
[null,"2017-01-06",211,202,0,0,0,0,0,0,2.913568029339E-2,2.913568029339E-2,7.5638697392300001E-3,7.5638697392300001E-3]
[null,"2017-01-07",255,240,0,0,0,0,0,0,3.2987450216000002E-4,3.2987450216000002E-4,8.5638218830000001E-5,8.5638218830000001E-5]
[null,"2017-01-08",111,105,0,0,0,0,1.0402371010600001E-2,1.0402371010600001E-2,1.223931424912E-2,1.223931424912E-2,6.7666786728100004E-3,6.7666786728100004E-3]
[null,"2017-01-09",180,177,0,0,9.1200708453999992E-3,9.1200708453999992E-3,2.060034455573E-2,2.060034455573E-2,1.7890840646359998E-2,1.7890840646359998E-2,1.535820703795E-2,1.535820703795E-2]
[null,"2017-01-10",152,148,0,0,1.466601682578E-2,1.466601682578E-2,2.988947937046E-2,2.988947937046E-2,2.2640063258289999E-2,2.2640063258289999E-2,2.1988872069090001E-2,2.1988872069090001E-2]
[null,"2017-01-11",271,262,0,0,0,0,0,0,6.4034462183300001E-3,6.4034462183300001E-3,1.6623889536800001E-3,1.6623889536800001E-3]
[null,"2017-01-12",174,173,0,0,0,0,0,0,0,0,0,0]
[null,"2017-01-13",298,289,0,0,1.31592779121E-2,1.31592779121E-2,1.8392121937689999E-2,1.8392121937689999E-2,8.5136728130000006E-3,8.5136728130000006E-3,1.3758787362819999E-2,1.3758787362819999E-2]
[null,"2017-01-14",105,103,0,0,1.0110759644880001E-2,1.0110759644880001E-2,7.0261628755799999E-3,7.0261628755799999E-3,2.7069113559300001E-3,2.7069113559300001E-3,7.1243441749599999E-3,7.1243441749599999E-3]
[null,"2017-01-15",88,87,0,0,2.4063225695470002E-2,2.4063225695470002E-2,0,0,2.2290784373650001E-2,2.2290784373650001E-2,1.530027530169E-2,1.530027530169E-2]
[null,"2017-01-16",216,205,0,0,0,0,1.8917715420330002E-2,1.8917715420330002E-2,1.5567165844409999E-2,1.5567165844409999E-2,1.056876371156E-2,1.056876371156E-2]
[null,"2017-01-17",249,221,0,0,5.3994132319100004E-3,5.3994132319100004E-3,3.9164014366199996E-3,3.9164014366199996E-3,1.865246265869E-2,1.865246265869E-2,8.3283167808100005E-3,8.3283167808100005E-3]
[null,"2017-01-18",163,157,0,0,0,0,8.2817473063300003E-3,8.2817473063300003E-3,1.3097958174000001E-4,1.3097958174000001E-4,2.8915492709399998E-3,2.8915492709399998E-3]
[null,"2017-01-19",193,184,0,0,0,0,8.3583963558900003E-3,8.3583963558900003E-3,6.2094023935000005E-4,6.2094023935000005E-4,3.0451943105999999E-3,3.0451943105999999E-3]
[null,"2017-01-20",468,384,0,0,3.5964233267400001E-3,3.5964233267400001E-3,8.9058895669700006E-3,8.9058895669700006E-3,4.0225284880589997E-2,4.0225284880589997E-2,1.493757225725E-2,1.493757225725E-2]
[null,"2017-01-21",108,92,0,0,0,0,0,0,8.25656474515E-3,8.25656474515E-3,2.1434742417900002E-3,2.1434742417900002E-3]
[null,"2017-01-22",99,93,0,0,0,0,3.5039565509000002E-4,3.5039565509000002E-4,1.4766735067109999E-2,1.4766735067109999E-2,3.9544706928399996E-3,3.9544706928399996E-3]
[null,"2017-01-23",223,214,0,0,7.3298229183599998E-3,7.3298229183599998E-3,6.2414226063999998E-4,6.2414226063999998E-4,6.7139163379999998E-3,6.7139163379999998E-3,4.8561907616499998E-3,4.8561907616499998E-3]
[null,"2017-01-24",223,209,0,0,3.2922085989239999E-2,3.2922085989239999E-2,2.0563845008320002E-2,2.0563845008320002E-2,2.1873590150339999E-2,2.1873590150339999E-2,2.578969772228E-2,2.578969772228E-2]
[null,"2017-01-25",159,146,0,0,0,0,1.2052150553329999E-2,1.2052150553329999E-2,2.5322719136100002E-3,2.5322719136100002E-3,4.8158904233800001E-3,4.8158904233800001E-3]
[null,"2017-01-26",68,67,0,0,1.922127400668E-2,1.922127400668E-2,2.3542208076599998E-3,2.3542208076599998E-3,6.3064243060000002E-5,6.3064243060000002E-5,8.4278082409199994E-3,8.4278082409199994E-3]
[null,"2017-01-27",232,219,0,0,2.8264892983309999E-2,2.8264892983309999E-2,1.476041697083E-2,1.476041697083E-2,2.4206967143500001E-3,2.4206967143500001E-3,1.6895916820099999E-2,1.6895916820099999E-2]
[null,"2017-01-28",114,105,0,0,4.6476365223299997E-3,4.6476365223299997E-3,5.2194352790000005E-4,5.2194352790000005E-4,2.7166135471999998E-4,2.7166135471999998E-4,2.08806127666E-3,2.08806127666E-3]
[null,"2017-01-29",121,113,0,0,0,0,2.1355885187020002E-2,2.1355885187020002E-2,3.0217474616640001E-2,3.0217474616640001E-2,1.521337769729E-2,1.521337769729E-2]
[null,"2017-01-30",204,198,0,0,0,0,2.0658743831599999E-3,2.0658743831599999E-3,3.7479564759699997E-2,3.7479564759699997E-2,1.044282515446E-2,1.044282515446E-2]
[null,"2017-01-31",169,165,0,0,0,0,8.8000408794900002E-3,8.8000408794900002E-3,6.3258286884100004E-3,6.3258286884100004E-3,4.6786173961399996E-3,4.6786173961399996E-3]
[null,"2017-02-01",156,151,0,0,3.3447692586999998E-3,3.3447692586999998E-3,1.0241773002010001E-2,1.0241773002010001E-2,1.8341992539010001E-2,1.8341992539010001E-2,9.6179276054799995E-3,9.6179276054799995E-3]
[null,"2017-02-02",149,145,0,0,0,0,0,0,3.0561902406000001E-4,3.0561902406000001E-4,7.9341290970000005E-5,7.9341290970000005E-5]
[null,"2017-02-03",165,161,0,0,0,0,1.882281659707E-2,1.882281659707E-2,0,0,6.4946513894800001E-3,6.4946513894800001E-3]
[null,"2017-02-04",133,129,0,0,1.7803728939899999E-2,1.7803728939899999E-2,8.6138931877200002E-3,8.6138931877200002E-3,3.2308296828800001E-3,3.2308296828800001E-3,1.0849606693890001E-2,1.0849606693890001E-2]
[null,"2017-02-05",212,178,0,0,0,0,1.457061932432E-2,1.457061932432E-2,8.0761039880860003E-2,8.0761039880860003E-2,2.599371818477E-2,2.599371818477E-2]
[null,"2017-02-06",275,262,0,0,0,0,0,0,1.9588724113339999E-2,1.9588724113339999E-2,5.0853989355699996E-3,5.0853989355699996E-3]
[null,"2017-02-07",236,224,0,0,0,0,0,0,1.021640737561E-2,1.021640737561E-2,2.65226601246E-3,2.65226601246E-3]
[null,"2017-02-08",421,342,0,0,8.6868435890299998E-3,8.6868435890299998E-3,0,0,1.885620867473E-2,1.885620867473E-2,8.32957616638E-3,8.32957616638E-3]
[null,"2017-02-09",392,325,0,0,9.1391838125899991E-3,9.1391838125899991E-3,0,0,3.5092825714690003E-2,3.5092825714690003E-2,1.2723572423490001E-2,1.2723572423490001E-2]
[null,"2017-02-10",266,226,0,0,0,0,0,0,0,0,0,0]
[null,"2017-02-11",124,112,0,0,8.2695438053299996E-3,8.2695438053299996E-3,0,0,2.641906674622E-2,2.641906674622E-2,1.0127978761720001E-2,1.0127978761720001E-2]
[null,"2017-02-12",127,122,0,0,0,0,0,0,1.140977689811E-2,1.140977689811E-2,2.9620748629200001E-3,2.9620748629200001E-3]
[null,"2017-02-13",183,165,0,0,0,0,0,0,1.4383498513140001E-2,1.4383498513140001E-2,3.7340782179199998E-3,3.7340782179199998E-3]
[null,"2017-02-14",163,158,0,0,0,0,1.8103775513180001E-2,1.8103775513180001E-2,2.7845288858500002E-3,2.7845288858500002E-3,6.9694397497300003E-3,6.9694397497300003E-3]
[null,"2017-02-15",168,159,0,0,0,0,0,0,1.1424330184969999E-2,1.1424330184969999E-2,2.9658530196299999E-3,2.9658530196299999E-3]
[null,"2017-02-16",250,231,0,0,0,0,2.38342044559E-3,2.38342044559E-3,1.4810394927690001E-2,1.4810394927690001E-2,4.6672829260099996E-3,4.6672829260099996E-3]
[null,"2017-02-17",164,152,0,0,0,0,0,0,1.323378885121E-2,1.323378885121E-2,3.4356038376E-3,3.4356038376E-3]
[null,"2017-02-18",98,95,0,0,0,0,0,0,2.3547218139219998E-2,2.3547218139219998E-2,6.1130575614800004E-3,6.1130575614800004E-3]
[null,"2017-02-19",123,103,0,0,0,0,8.0153006102700007E-3,8.0153006102700007E-3,2.0170855587730002E-2,2.0170855587730002E-2,8.0021359179299999E-3,8.0021359179299999E-3]
[null,"2017-02-20",168,164,0,0,0,0,8.6467427803899998E-3,8.6467427803899998E-3,3.3957669339999998E-4,3.3957669339999998E-4,3.0716414075899999E-3,3.0716414075899999E-3]
[null,"2017-02-21",183,172,0,0,0,0,0,0,2.1344820728E-4,2.1344820728E-4,5.5412965120000002E-5,5.5412965120000002E-5]
[null,"2017-02-22",210,192,0,0,8.1421240240399997E-3,8.1421240240399997E-3,0,0,0,0,3.21898951939E-3,3.21898951939E-3]
[null,"2017-02-23",160,154,0,0,0,0,0,0,3.4452481092849999E-2,3.4452481092849999E-2,8.9441563250099998E-3,8.9441563250099998E-3]
[null,"2017-02-24",110,109,0,0,1.2522179005679999E-2,1.2522179005679999E-2,0,0,7.4852405415800002E-3,7.4852405415800002E-3,6.8938766154799996E-3,6.8938766154799996E-3]
[null,"2017-02-25",83,83,0,0,1.116515833501E-2,1.116515833501E-2,1.469836774024E-2,1.469836774024E-2,2.1247798815400001E-3,2.1247798815400001E-3,1.0037303000610001E-2,1.0037303000610001E-2]
[null,"2017-02-26",131,108,0,0,8.0656721552699994E-3,8.0656721552699994E-3,5.5223815224700002E-3,5.5223815224700002E-3,6.6460009993000004E-4,6.6460009993000004E-4,5.2667504577900001E-3,5.2667504577900001E-3]
[null,"2017-02-27",551,301,0,0,8.2759147943900005E-3,8.2759147943900005E-3,1.4315122492480001E-2,1.4315122492480001E-2,3.581078786644E-2,3.581078786644E-2,1.7507978207590001E-2,1.7507978207590001E-2]
[null,"2017-02-28",226,199,0,0,2.0323455114799999E-3,2.0323455114799999E-3,0,0,3.0329049815900001E-2,3.0329049815900001E-2,8.6771665839699991E-3,8.6771665839699991E-3]
[null,"2017-03-01",201,192,0,0,0,0,0,0,4.7055627513000001E-4,4.7055627513000001E-4,1.2216040038E-4,1.2216040038E-4]
[null,"2017-03-02",190,186,0,0,5.7211481796500003E-3,5.7211481796500003E-3,2.4775892778930001E-2,2.4775892778930001E-2,4.8268401418500003E-3,4.8268401418500003E-3,1.20636543843E-2,1.20636543843E-2]
[null,"2017-03-03",197,182,0,0,5.7275191687100003E-3,5.7275191687100003E-3,1.0092124857650001E-2,1.0092124857650001E-2,2.9446150413099999E-3,2.9446150413099999E-3,6.5110234018999997E-3,6.5110234018999997E-3]
[null,"2017-03-04",166,132,0,0,9.2060791977700007E-3,9.2060791977700007E-3,1.37968289193E-3,1.37968289193E-3,4.7400055302490002E-2,4.7400055302490002E-2,1.6421128459849998E-2,1.6421128459849998E-2]
[null,"2017-03-05",78,72,0,0,0,0,0,0,0,0,0,0]
[null,"2017-03-06",185,174,0,0,0,0,0,0,5.0936504009399999E-3,5.0936504009399999E-3,1.3223548495199999E-3,1.3223548495199999E-3]
[null,{"$f":"B79+1","v":"2017-03-07"},221,213,0,0,0,0,2.3797704908500002E-3,2.3797704908500002E-3,1.7517306283619999E-2,1.7517306283619999E-2,5.3687606890399997E-3,5.3687606890399997E-3]
[null,"2017-03-08",181,177,0,0,1.41117407772E-2,1.41117407772E-2,0,0,6.5683834694100001E-3,6.5683834694100001E-3,7.2842861424800001E-3,7.2842861424800001E-3]
[null,"2017-03-09",191,175,0,0,8.6741016109000008E-3,8.6741016109000008E-3,3.2991940899930003E-2,3.2991940899930003E-2,6.4859148438699997E-3,6.4859148438699997E-3,1.6496691594110002E-2,1.6496691594110002E-2]
[null,"2017-03-10",379,284,0,0,0,0,1.2957339329E-3,1.2957339329E-3,3.090147909905E-2,3.090147909905E-2,8.4693679647599995E-3,8.4693679647599995E-3]
[null,"2017-03-11",116,109,0,0,0,0,0,0,1.0133938750069999E-2,1.0133938750069999E-2,2.6308564577499998E-3,2.6308564577499998E-3]
[null,"2017-03-12",314,186,0,0,3.5231569524999998E-3,3.5231569524999998E-3,0,0,7.1422680812460004E-2,7.1422680812460004E-2,1.9934814202849999E-2,1.9934814202849999E-2]
[null,"2017-03-13",95,92,0,0,0,0,1.5220311268100001E-3,1.5220311268100001E-3,5.1033525921799997E-3,5.1033525921799997E-3,1.8500374037499999E-3,1.8500374037499999E-3]
[null,"2017-03-14",193,186,0,0,0,0,4.2339474990500002E-3,4.2339474990500002E-3,2.914538248463E-2,2.914538248463E-2,9.0272757727000007E-3,9.0272757727000007E-3]
[null,"2017-03-15",198,190,0,0,0,0,2.3359710339599998E-3,2.3359710339599998E-3,3.0071941748039999E-2,3.0071941748039999E-2,8.6129379198499993E-3,8.6129379198499993E-3]
[null,"2017-03-16",259,227,0,0,1.4685129793E-3,1.4685129793E-3,0,0,3.2351956689420001E-2,3.2351956689420001E-2,8.9794191210000006E-3,8.9794191210000006E-3]
[null,"2017-03-17",174,162,0,0,0,0,0,0,4.0652181295099997E-3,4.0652181295099997E-3,1.0553651084700001E-3,1.0553651084700001E-3]
[null,"2017-03-18",137,116,0,0,0,0,4.2302975443099999E-3,4.2302975443099999E-3,5.2052256001999999E-3,5.2052256001999999E-3,2.8109485943999999E-3,2.8109485943999999E-3]
[null,"2017-03-19",127,121,0,0,0,0,5.2741846001100002E-3,5.2741846001100002E-3,7.6162201232999997E-4,7.6162201232999997E-4,2.01753568469E-3,2.01753568469E-3]
[null,"2017-03-20",285,256,0,0,0,0,3.04406225363E-3,3.04406225363E-3,2.472118327924E-2,2.472118327924E-2,7.4681564358399996E-3,7.4681564358399996E-3]
[null,"2017-03-21",413,354,0,0,0,0,4.2302975443099999E-3,4.2302975443099999E-3,3.0634668839960001E-2,3.0634668839960001E-2,9.4126477574100007E-3,9.4126477574100007E-3]
[null,"2017-03-22",276,260,0,0,0,0,7.9021520133200004E-3,7.9021520133200004E-3,1.072092132008E-2,1.072092132008E-2,5.5098118729799998E-3,5.5098118729799998E-3]
[null,"2017-03-23",208,192,0,0,0,0,0,0,2.9329724118190001E-2,2.9329724118190001E-2,7.6142451620700002E-3,7.6142451620700002E-3]
[null,"2017-03-24",209,189,0,0,4.2590061894199997E-3,4.2590061894199997E-3,1.0840365579469999E-2,1.0840365579469999E-2,8.5136728130000006E-3,8.5136728130000006E-3,7.6343953312099999E-3,7.6343953312099999E-3]
[null,"2017-03-25",102,96,0,0,0,0,4.03319998832E-3,4.03319998832E-3,1.9908896424260001E-2,1.9908896424260001E-2,6.5601394391700003E-3,6.5601394391700003E-3]
[null,"2017-03-26",109,104,0,0,3.12497013599E-3,3.12497013599E-3,3.0550121178499999E-3,3.0550121178499999E-3,8.3390333706900004E-3,8.3390333706900004E-3,4.4544467645100004E-3,4.4544467645100004E-3]
[null,"2017-03-27",454,426,0,0,0,0,2.1855928986479999E-2,2.1855928986479999E-2,4.6366771935439997E-2,4.6366771935439997E-2,1.9578408086260001E-2,1.9578408086260001E-2]
[null,"2017-03-28",184,165,0,0,1.028596184415E-2,1.028596184415E-2,1.674599234969E-2,1.674599234969E-2,0,0,9.8446170082499996E-3,9.8446170082499996E-3]
[null,"2017-03-29",180,167,0,0,4.5648136645000002E-3,4.5648136645000002E-3,0,0,3.8857275915800001E-3,3.8857275915800001E-3,2.8134673655399998E-3,2.8134673655399998E-3]
[null,"2017-03-30",191,184,0,0,1.9144822137910002E-2,1.9144822137910002E-2,5.4530323823999997E-3,5.4530323823999997E-3,3.4088648921360001E-2,3.4088648921360001E-2,1.830013173173E-2,1.830013173173E-2]
[null,"2017-03-31",190,163,0,0,1.3796376818520001E-2,1.3796376818520001E-2,9.2708850409999998E-4,9.2708850409999998E-4,2.26061055889E-3,2.26061055889E-3,6.3611565189599997E-3,6.3611565189599997E-3]
[null,"2017-04-01",152,123,0,0,0,0,2.0658743831599999E-3,2.0658743831599999E-3,1.3500599110309999E-2,1.3500599110309999E-2,4.21768227717E-3,4.21768227717E-3]
[null,"2017-04-02",153,144,0,0,6.7468774189800001E-3,6.7468774189800001E-3,5.4311326539599998E-3,5.4311326539599998E-3,3.4180819738140002E-2,3.4180819738140002E-2,1.341497510195E-2,1.341497510195E-2]
[null,"2017-04-03",173,158,0,0,1.076378602396E-2,1.076378602396E-2,3.9346512103200001E-3,3.9346512103200001E-3,2.9349128500700001E-3,2.9349128500700001E-3,6.3750097602400004E-3,6.3750097602400004E-3]
[null,"2017-04-04",160,154,0,0,0,0,0,0,1.2612848612E-4,1.2612848612E-4,3.2744024849999998E-5,3.2744024849999998E-5]
[null,"2017-04-05",236,208,0,0,0,0,3.025082488977E-2,3.025082488977E-2,1.399055976792E-2,1.399055976792E-2,1.406985559885E-2,1.406985559885E-2]
[null,"2017-04-06",290,250,0,0,0,0,9.7818787047000005E-4,9.7818787047000005E-4,1.2758381480500001E-3,1.2758381480500001E-3,6.6873373818E-4,6.6873373818E-4]
[null,"2017-04-07",162,135,0,0,8.1007125951300003E-3,8.1007125951300003E-3,0,0,2.006898257972E-2,2.006898257972E-2,8.4126956140600003E-3,8.4126956140600003E-3]
[null,"2017-04-08",193,171,0,0,0,0,1.3982976611089999E-2,1.3982976611089999E-2,2.404688098807E-2,2.404688098807E-2,1.106748039766E-2,1.106748039766E-2]
[null,"2017-04-09",0,0,0,0,0,0,4.3295763132540001E-2,4.3295763132540001E-2,0.17560966144203999,0.17560966144203999,6.0528589311849998E-2,6.0528589311849998E-2]
[null,"2017-04-10",958,783,0,0,0,0,1.1650655531870001E-2,1.1650655531870001E-2,3.308447212803E-2,3.308447212803E-2,1.260896833653E-2,1.260896833653E-2]
[null,"2017-04-11",284,246,0,0,0,0,2.5038689520300002E-3,2.5038689520300002E-3,0,0,8.6393850168000003E-4,8.6393850168000003E-4]
[null,"2017-04-12",257,244,0,0,0,0,1.6300697871349999E-2,1.6300697871349999E-2,7.4706872546999998E-4,7.4706872546999998E-4,5.8183613378700004E-3,5.8183613378700004E-3]
[null,"2017-04-13",226,205,0,0,0,0,1.7592781849499999E-3,1.7592781849499999E-3,5.4768869549200001E-3,5.4768869549200001E-3,2.0288701548299998E-3,2.0288701548299998E-3]
[null,"2017-04-14",128,116,0,0,0,0,1.0876865126900001E-3,1.0876865126900001E-3,1.6949728096090001E-2,1.6949728096090001E-2,4.7755900851100003E-3,4.7755900851100003E-3]
[null,"2017-04-15",91,91,0,0,9.5755965634899999E-3,9.5755965634899999E-3,1.3986626565829999E-2,1.3986626565829999E-2,2.48861205303E-3,2.48861205303E-3,9.2577433321799994E-3,9.2577433321799994E-3]
[null,"2017-04-16",61,59,0,0,0,0,1.01833737262E-3,1.01833737262E-3,9.3335079727800002E-3,9.3335079727800002E-3,2.77442641284E-3,2.77442641284E-3]
[null,"2017-04-17",89,85,0,0,1.095173020136E-2,1.095173020136E-2,1.5293310363E-3,1.5293310363E-3,8.1013296852999999E-4,8.1013296852999999E-4,5.0677675375699997E-3,5.0677675375699997E-3]
[null,"2017-04-18",318,240,0,0,0,0,0,0,3.9342385477799998E-3,3.9342385477799998E-3,1.0213616980500001E-3,1.0213616980500001E-3]
[null,"2017-04-19",188,175,0,0,0,0,0,0,1.8919272917999999E-4,1.8919272917999999E-4,4.9116037270000002E-5,4.9116037270000002E-5]
[null,"2017-04-20",294,225,0,0,5.7816725757600003E-3,5.7816725757600003E-3,5.9968756387399997E-3,5.9968756387399997E-3,7.0631952226399997E-3,7.0631952226399997E-3,6.1886206957300002E-3,6.1886206957300002E-3]
[null,"2017-04-21",301,250,0,0,0,0,1.2614243583379999E-2,1.2614243583379999E-2,1.746879532742E-2,1.746879532742E-2,8.8874839743199995E-3,8.8874839743199995E-3]
[null,"2017-04-22",245,139,0,0,0,0,7.9423015154599999E-3,7.9423015154599999E-3,2.32998122626E-2,2.32998122626E-2,8.7892518997800002E-3,8.7892518997800002E-3]
[null,"2017-04-23",96,92,0,0,2.01641803882E-3,2.01641803882E-3,0,0,3.6868326712000002E-4,3.6868326712000002E-4,8.9290436981999996E-4,8.9290436981999996E-4]
[null,"2017-04-24",245,220,0,0,9.2283776594900002E-3,9.2283776594900002E-3,2.02937483575E-3,2.02937483575E-3,2.3474451704920001E-2,2.3474451704920001E-2,1.044282515446E-2,1.044282515446E-2]
[null,"2017-04-25",172,169,0,0,3.91178728542E-3,3.91178728542E-3,0,0,7.0583441270199998E-3,7.0583441270199998E-3,3.3789314869100001E-3,3.3789314869100001E-3]
[null,"2017-04-26",350,305,0,0,0,0,1.222734838088E-2,1.222734838088E-2,2.332891883632E-2,2.332891883632E-2,1.0275326873520001E-2,1.0275326873520001E-2]
[null,"2017-04-27",220,201,0,0,8.2822857834600003E-3,8.2822857834600003E-3,9.1139369871800005E-3,9.1139369871800005E-3,5.0451394447399997E-3,5.0451394447399997E-3,7.7288492490300001E-3,7.7288492490300001E-3]
[null,"2017-04-28",190,173,0,0,0,0,0,0,2.65354930411E-3,2.65354930411E-3,6.8888390732E-4,6.8888390732E-4]
[null,"2017-04-29",118,112,0,0,0,0,0,0,1.3296853094270001E-2,1.3296853094270001E-2,3.4519758500200001E-3,3.4519758500200001E-3]
[null,"2017-04-30",110,108,0,0,0,0,7.9532513796800007E-3,7.9532513796800007E-3,2.3057257481600001E-2,2.3057257481600001E-2,8.7300607779500008E-3,8.7300607779500008E-3]
[null,"2017-05-01",229,208,0,0,0,0,0,0,2.2082187261989999E-2,2.2082187261989999E-2,5.7327231190400004E-3,5.7327231190400004E-3]
[null,"2017-05-02",185,178,0,0,0,0,1.7256986013370001E-2,1.7256986013370001E-2,1.7949053794E-4,1.7949053794E-4,6.0009722456600004E-3,6.0009722456600004E-3]
[null,"2017-05-03",184,162,0,0,0,0,0,0,6.0299118555899997E-3,6.0299118555899997E-3,1.56541626471E-3,1.56541626471E-3]
[null,"2017-05-04",355,265,0,0,0,0,0,0,1.159896962729E-2,1.159896962729E-2,3.0111909001799999E-3,3.0111909001799999E-3]
[null,"2017-05-05",138,122,0,0,0,0,0,0,3.43457569892E-3,3.43457569892E-3,8.9164498425E-4,8.9164498425E-4]
[null,"2017-05-06",165,128,0,0,4.6731204785900003E-3,4.6731204785900003E-3,0,0,7.4512828722399999E-3,7.4512828722399999E-3,3.78193486962E-3,3.78193486962E-3]
[null,"2017-05-07",108,103,0,0,0,0,2.3250211697399999E-3,2.3250211697399999E-3,0,0,8.0222860871000004E-4,8.0222860871000004E-4]
[null,"2017-05-08",204,184,0,0,0,0,0,0,3.8808764959600002E-3,3.8808764959600002E-3,1.0075084567699999E-3,1.0075084567699999E-3]
[null,"2017-05-09",155,144,0,0,0,0,0,0,2.116533018982E-2,2.116533018982E-2,5.4946992461299997E-3,5.4946992461299997E-3]
[null,{"$f":"B143+1","v":"2017-05-10"},180,162,0,0,6.43788444937E-3,6.43788444937E-3,0,0,1.8341992539010001E-2,1.8341992539010001E-2,7.30695508275E-3,7.30695508275E-3]
[null,"2017-05-11",166,149,0,0,0,0,5.5844307530600002E-3,5.5844307530600002E-3,0,0,1.92685992358E-3,1.92685992358E-3]
[null,"2017-05-12",179,155,0,0,0,0,8.1284492072299999E-3,8.1284492072299999E-3,6.6217455212300002E-3,6.6217455212300002E-3,4.5237129709199998E-3,4.5237129709199998E-3]
[null,"2017-05-13",86,81,0,0,0,0,0,0,1.1642629488E-4,1.1642629488E-4,3.0225253699999999E-5,3.0225253699999999E-5]
[null,"2017-05-14",111,93,0,0,0,0,2.321371215E-3,2.321371215E-3,1.873493128423E-2,1.873493128423E-2,5.6647162982100003E-3,5.6647162982100003E-3]
[null,"2017-05-15",171,153,0,0,0,0,0,0,3.3763625514800001E-3,3.3763625514800001E-3,8.7653235739000004E-4,8.7653235739000004E-4]
[null,"2017-05-16",163,146,0,0,0,0,0,0,4.4533057791099999E-3,4.4533057791099999E-3,1.15611595415E-3,1.15611595415E-3]
[null,"2017-05-17",134,122,0,0,0,0,0,0,5.3066134986589998E-2,5.3066134986589998E-2,1.377641876081E-2,1.377641876081E-2]
[null,"2017-05-18",184,158,0,0,0,0,0,0,1.76094771004E-3,1.76094771004E-3,4.5715696225999999E-4,4.5715696225999999E-4]
[null,"2017-05-19",157,144,0,0,0,0,0,0,1.0163045323790001E-2,1.0163045323790001E-2,2.6384127711800002E-3,2.6384127711800002E-3]
[null,"2017-05-20",88,81,0,0,0,0,5.9494262270999999E-4,5.9494262270999999E-4,2.1344820728E-4,2.1344820728E-4,2.6069281319000001E-4,2.6069281319000001E-4]
[null,"2017-05-21",77,74,0,0,1.3911054621669999E-2,1.3911054621669999E-2,0,0,1.309310707823E-2,1.309310707823E-2,8.8988184444599994E-3,8.8988184444599994E-3]
[null,"2017-05-22",224,196,0,0,0,0,5.4530323823999997E-3,5.4530323823999997E-3,8.8872071757400001E-3,8.8872071757400001E-3,4.1887164090400001E-3,4.1887164090400001E-3]
[null,"2017-05-23",143,120,0,0,5.7147771905799996E-3,5.7147771905799996E-3,0,0,7.62592231455E-3,7.62592231455E-3,4.2390918318800002E-3,4.2390918318800002E-3]
[null,"2017-05-24",122,107,0,0,0,0,0,0,1.6668364550129999E-2,1.6668364550129999E-2,4.3272488218400003E-3,4.3272488218400003E-3]
[null,"2017-05-25",165,133,0,0,0,0,0,0,0,0,0,0]
[null,"2017-05-26",139,120,0,0,0,0,0,0,0,0,0,0]
[null,"2017-05-27",131,111,0,0,1.06586647044E-2,1.06586647044E-2,0,0,3.5510019938E-3,3.5510019938E-3,5.1357743584099997E-3,5.1357743584099997E-3]
[null,"2017-05-28",177,163,0,0,8.4925284225700007E-3,8.4925284225700007E-3,0,0,8.6883122553199996E-3,8.6883122553199996E-3,5.6130814897999998E-3,5.6130814897999998E-3]
[null,"2017-05-29",195,144,0,0,0,0,1.0949864222E-4,1.0949864222E-4,1.68818127574E-3,1.68818127574E-3,4.7604774582999998E-4,4.7604774582999998E-4]
[null,"2017-05-30",213,174,0,0,0,0,1.0822115805760001E-2,1.0822115805760001E-2,8.1013296852999999E-4,8.1013296852999999E-4,3.9443956082700002E-3,3.9443956082700002E-3]
[null,"2017-05-31",199,164,0,0,0,0,4.7960405290999996E-3,4.7960405290999996E-3,1.2612848612E-4,1.2612848612E-4,1.6875766650999999E-3,1.6875766650999999E-3]
[null,"2017-06-01",193,152,0,0,1.455133902263E-2,1.455133902263E-2,0,0,3.8760254003399998E-3,3.8760254003399998E-3,6.7591223593799999E-3,6.7591223593799999E-3]
[null,"2017-06-02",167,122,0,0,0,0,7.2999094811000004E-4,7.2999094811000004E-4,0,0,2.5187711419000003E-4,2.5187711419000003E-4]
[null,"2017-06-03",96,84,0,0,0,0,0,0,1.4553286860000001E-4,1.4553286860000001E-4,3.7781567130000002E-5,3.7781567130000002E-5]
[null,"2017-06-04",94,87,0,0,9.1359983180599996E-3,9.1359983180599996E-3,0,0,9.7021912399999999E-5,9.7021912399999999E-5,3.63710552895E-3,3.63710552895E-3]
[null,"2017-06-05",210,185,0,0,0,0,3.0477122083699998E-3,3.0477122083699998E-3,8.5379282910999998E-4,8.5379282910999998E-4,1.27323881225E-3,1.27323881225E-3]
[null,"2017-06-06",197,159,0,0,0,0,1.0876865126900001E-3,1.0876865126900001E-3,3.6286195237200001E-3,3.6286195237200001E-3,1.31731730723E-3,1.31731730723E-3]
[null,"2017-06-07",169,136,0,0,0,0,0,0,8.3923954224999998E-4,8.3923954224999998E-4,2.1787370378000001E-4,2.1787370378000001E-4]
[null,"2017-06-08",185,140,0,0,1.455133902263E-2,1.455133902263E-2,0,0,1.7949053794E-4,1.7949053794E-4,5.79947055431E-3,5.79947055431E-3]
[null,"2017-06-09",194,148,0,0,0,0,0,0,3.880876496E-4,3.880876496E-4,1.0075084568E-4,1.0075084568E-4]
[null,"2017-06-10",257,150,0,0,0,0,0,0,5.7242928315000003E-4,5.7242928315000003E-4,1.4860749737000001E-4,1.4860749737000001E-4]
[null,"2017-06-11",115,102,0,0,0,0,4.2266475895699996E-3,4.2266475895699996E-3,1.5232440246599999E-3,1.5232440246599999E-3,1.85381556046E-3,1.85381556046E-3]
[null,"2017-06-12",66,65,0,0,0,0,0,0,3.63347061934E-3,3.63347061934E-3,9.4327979264999999E-4,9.4327979264999999E-4]
[null,"2017-06-13",196,145,0,0,0,0,1.5165561947030001E-2,1.5165561947030001E-2,2.5225697224000001E-4,2.5225697224000001E-4,5.2982350970599999E-3,5.2982350970599999E-3]
[null,"2017-06-14",147,112,0,0,0,0,5.9494262270999999E-4,5.9494262270999999E-4,0,0,2.0527984806999999E-4,2.0527984806999999E-4]
[null,"2017-06-15",186,159,0,0,0,0,0,0,1.8434163356000001E-4,1.8434163356000001E-4,4.7856651699999999E-5,4.7856651699999999E-5]
[null,"2017-06-16",228,134,0,0,0,0,0,0,3.0076792844000003E-4,3.0076792844000003E-4,7.8081905399999995E-5,7.8081905399999995E-5]
[null,"2017-06-17",175,137,0,0,0,0,5.4639822466199996E-3,5.4639822466199996E-3,6.4713615570099999E-3,6.4713615570099999E-3,3.56532055141E-3,3.56532055141E-3]
[null,"2017-06-18",95,91,0,0,0,0,0,0,1.037164243544E-2,1.037164243544E-2,2.6925663507300001E-3,2.6925663507300001E-3]
[null,"2017-06-19",148,126,0,0,0,0,3.9419511198100004E-3,3.9419511198100004E-3,1.9283105089279998E-2,1.9283105089279998E-2,6.3661940612400004E-3,6.3661940612400004E-3]
[null,"2017-06-20",175,136,0,0,9.1678532633800002E-3,9.1678532633800002E-3,1.1234560691450001E-2,1.1234560691450001E-2,9.8671284909700001E-3,9.8671284909700001E-3,1.006249071203E-2,1.006249071203E-2]
[null,"2017-06-21",160,136,0,0,0,0,1.9954302566650001E-2,1.9954302566650001E-2,0,0,6.8850609164799997E-3,6.8850609164799997E-3]
[null,"2017-06-22",161,127,0,0,0,0,1.12783601483E-3,1.12783601483E-3,0,0,3.8915014142999998E-4,3.8915014142999998E-4]
[null,"2017-06-23",218,173,0,0,0,0,0,0,3.2211274916399998E-3,3.2211274916399998E-3,8.3623201911999998E-4,8.3623201911999998E-4]
[null,"2017-06-24",101,81,0,0,0,0,0,0,0,0,0,0]
[null,"2017-06-25",63,58,0,0,2.0482729841399998E-3,2.0482729841399998E-3,0,0,9.8913839690699997E-3,9.8913839690699997E-3,3.3776721013400002E-3,3.3776721013400002E-3]
[null,"2017-06-26",225,189,0,0,0,0,1.6457645925190001E-2,1.6457645925190001E-2,1.2612848612E-4,1.2612848612E-4,5.7113135643400001E-3,5.7113135643400001E-3]
[null,"2017-06-27",207,144,0,0,0,0,0,0,6.3064243060000002E-5,6.3064243060000002E-5,1.6372012420000001E-5,1.6372012420000001E-5]
[null,"2017-06-28",169,120,0,0,0,0,0,0,7.2232813780999999E-3,7.2232813780999999E-3,1.87522511517E-3,1.87522511517E-3]
[null,"2017-06-29",224,167,0,0,0,0,1.2409846118000001E-4,1.2409846118000001E-4,1.9889492042000001E-4,1.9889492042000001E-4,9.4453917819999999E-5,9.4453917819999999E-5]
[null,"2017-06-30",149,115,0,0,6.0524396109899996E-3,6.0524396109899996E-3,0,0,5.14216135714E-3,5.14216135714E-3,3.7277812900600002E-3,3.7277812900600002E-3]
[null,"2017-07-01",140,116,0,0,0,0,6.3144217011999997E-4,6.3144217011999997E-4,0,0,2.1787370378000001E-4,2.1787370378000001E-4]
[null,"2017-07-02",126,114,0,0,0,0,0,0,0,0,0,0]
[null,"2017-07-03",232,179,0,0,0,0,0,0,8.6203969166400007E-3,8.6203969166400007E-3,2.2379281596099998E-3,2.2379281596099998E-3]
[null,"2017-07-04",202,156,0,0,5.7211481796500003E-3,5.7211481796500003E-3,2.3469208981800002E-3,2.3469208981800002E-3,4.5187955699789999E-2,4.5187955699789999E-2,1.4802818001150001E-2,1.4802818001150001E-2]
[null,"2017-07-05",208,174,0,0,1.8714780376080001E-2,1.8714780376080001E-2,9.5446316465700003E-3,9.5446316465700003E-3,6.87400249346E-3,6.87400249346E-3,1.247673285158E-2,1.247673285158E-2]
[null,"2017-07-06",168,117,0,0,0,0,3.35430840658E-3,3.35430840658E-3,1.03861957223E-2,1.03861957223E-2,3.8537198471599999E-3,3.8537198471599999E-3]
[null,"2017-07-07",150,124,0,0,5.8103420265499996E-3,5.8103420265499996E-3,0,0,7.68413546199E-3,7.68413546199E-3,4.2919860258600001E-3,4.2919860258600001E-3]
[null,"2017-07-08",119,86,0,0,0,0,0,0,0,0,0,0]
[null,"2017-07-09",150,122,0,0,0,0,1.097176395013E-2,1.097176395013E-2,1.0449259965359999E-2,1.0449259965359999E-2,6.4984295461900004E-3,6.4984295461900004E-3]
[null,"2017-07-10",176,146,0,0,0,0,2.91996379245E-3,2.91996379245E-3,6.75757619858E-3,6.75757619858E-3,2.7618325571300002E-3,2.7618325571300002E-3]
[null,"2017-07-11",179,137,0,0,0,0,0,0,1.048806873032E-2,1.048806873032E-2,2.72279160443E-3,2.72279160443E-3]
[null,"2017-07-12",169,153,0,0,0,0,0,0,6.4422549832879997E-2,6.4422549832879997E-2,1.6724640382450001E-2,1.6724640382450001E-2]
[null,{"$f":"B207+1","v":"2017-07-13"},184,157,0,0,0,0,2.5184687710000001E-4,2.5184687710000001E-4,2.9106573720000001E-4,2.9106573720000001E-4,1.6246073865000001E-4,1.6246073865000001E-4]
[null,"2017-07-14",204,166,0,0,1.06586647044E-2,1.06586647044E-2,0,0,1.1642629488E-4,1.1642629488E-4,4.24412937416E-3,4.24412937416E-3]
[null,"2017-07-15",111,88,0,0,0,0,0,0,0,0,0,0]
[null,"2017-07-16",113,100,0,0,0,0,0,0,3.8178122528999998E-3,3.8178122528999998E-3,9.9113644435000004E-4,9.9113644435000004E-4]
[null,"2017-07-17",235,160,0,0,0,0,2.6794317750460001E-2,2.6794317750460001E-2,1.1681438252830001E-2,1.1681438252830001E-2,1.2277749931360001E-2,1.2277749931360001E-2]
[null,"2017-07-18",227,149,0,0,0,0,8.1758986188999998E-4,8.1758986188999998E-4,2.4740587662000003E-4,2.4740587662000003E-4,3.4633103202E-4,3.4633103202E-4]
[null,"2017-07-19",219,185,0,0,0,0,0,0,7.8393705218299994E-3,7.8393705218299994E-3,2.0351670826800001E-3,2.0351670826800001E-3]
[null,"2017-07-20",198,170,0,0,7.8490585270899992E-3,7.8490585270899992E-3,1.2008351096449999E-2,1.2008351096449999E-2,9.2170816779000003E-4,9.2170816779000003E-4,7.4857878338299997E-3,7.4857878338299997E-3]
[null,"2017-07-21",184,162,0,0,0,0,6.5297690308599998E-3,6.5297690308599998E-3,2.42554781E-5,2.42554781E-5,2.25933771432E-3,2.25933771432E-3]
[null,"2017-07-22",112,95,0,0,0,0,0,0,1.7755009969E-3,1.7755009969E-3,4.6093511897000002E-4,4.6093511897000002E-4]
[null,"2017-07-23",91,83,0,0,0,0,6.85461500277E-3,6.85461500277E-3,8.1304362590300001E-3,8.1304362590300001E-3,4.4758563192199997E-3,4.4758563192199997E-3]
[null,"2017-07-24",197,173,0,0,0,0,0,0,2.6729536865900002E-3,2.6729536865900002E-3,6.9392144960000004E-4,6.9392144960000004E-4]
[null,"2017-07-25",177,122,0,0,1.4137224733450001E-2,1.4137224733450001E-2,0,0,2.4255478099999999E-4,2.4255478099999999E-4,5.6521224425000001E-3,5.6521224425000001E-3]
[null,"2017-07-26",189,120,0,0,3.5072294798399999E-3,3.5072294798399999E-3,1.9596607002069999E-2,1.9596607002069999E-2,2.1490353596400002E-3,2.1490353596400002E-3,8.7061324520999999E-3,8.7061324520999999E-3]
[null,"2017-07-27",137,88,0,0,1.2082580760250001E-2,1.2082580760250001E-2,0,0,2.3479302800499999E-3,2.3479302800499999E-3,5.3863920870299998E-3,5.3863920870299998E-3]
[null,"2017-07-28",170,134,0,0,0,0,1.78117791339E-3,1.78117791339E-3,9.2170816779000003E-4,9.2170816779000003E-4,8.5386341711999995E-4,8.5386341711999995E-4]
[null,"2017-07-29",788,394,0,0,1.4299684954590001E-2,1.4299684954590001E-2,4.6569772534820003E-2,4.6569772534820003E-2,8.7271210202800008E-3,8.7271210202800008E-3,2.3987516970219998E-2,2.3987516970219998E-2]
[null,"2017-07-30",191,173,0,0,0,0,3.025812479925E-2,3.025812479925E-2,0,0,1.0440306383320001E-2,1.0440306383320001E-2]
[null,"2017-07-31",200,141,0,0,1.8507723231499999E-3,1.8507723231499999E-3,1.407787543434E-2,1.407787543434E-2,1.171539592217E-2,1.171539592217E-2,8.6305693178400002E-3,8.6305693178400002E-3]
[null,"2017-08-01",311,168,0,0,0,0,1.085496539843E-2,1.085496539843E-2,3.69168376678E-3,3.69168376678E-3,4.7038051075600001E-3,4.7038051075600001E-3]
[null,"2017-08-02",148,95,0,0,0,0,0,0,1.297182968773E-2,1.297182968773E-2,3.3675970167699998E-3,3.3675970167699998E-3]
[null,"2017-08-03",190,120,0,0,1.8740264332339999E-2,1.8740264332339999E-2,9.8548778000000001E-5,9.8548778000000001E-5,1.123998855141E-2,1.123998855141E-2,1.0360965092350001E-2,1.0360965092350001E-2]
[null,"2017-08-04",228,93,0,0,0,0,0,0,6.4131484095699999E-3,6.4131484095699999E-3,1.66490772482E-3,1.66490772482E-3]
[null,"2017-08-05",193,128,0,0,1.3770892862259999E-2,1.3770892862259999E-2,0,0,3.80811006166E-3,3.80811006166E-3,6.4329414965000001E-3,6.4329414965000001E-3]
[null,"2017-08-06",90,70,0,0,5.7275191687100003E-3,5.7275191687100003E-3,1.167985517E-4,1.167985517E-4,1.7973309271899999E-2,1.7973309271899999E-2,6.9706991353099997E-3,6.9706991353099997E-3]
[null,"2017-08-07",256,148,0,0,1.8061753997E-3,1.8061753997E-3,0,0,1.1157519925999999E-4,1.1157519925999999E-4,7.4303748687000004E-4,7.4303748687000004E-4]
[null,"2017-08-08",148,117,0,0,0,0,0,0,0,0,0,0]
[null,"2017-08-09",145,91,0,0,3.9340857471400004E-3,3.9340857471400004E-3,1.6475895698889999E-2,1.6475895698889999E-2,1.407787948908E-2,1.407787948908E-2,1.0894944574439999E-2,1.0894944574439999E-2]
[null,"2017-08-10",172,116,0,0,0,0,0,0,1.8434163356000001E-4,1.8434163356000001E-4,4.7856651699999999E-5,4.7856651699999999E-5]
[null,"2017-08-11",142,98,0,0,0,0,0,0,0,0,0,0]
[null,"2017-08-12",171,134,0,0,0,0,5.8180278564500002E-3,5.8180278564500002E-3,1.98894920418E-3,1.98894920418E-3,2.5238086842199999E-3,2.5238086842199999E-3]
[null,"2017-08-13",115,104,0,0,0,0,0,0,2.54197410485E-3,2.54197410485E-3,6.5991803918999999E-4,6.5991803918999999E-4]
[null,"2017-08-14",198,132,0,0,0,0,0,0,1.8434163356000001E-4,1.8434163356000001E-4,4.7856651699999999E-5,4.7856651699999999E-5]
[null,"2017-08-15",196,132,0,0,0,0,0,0,2.1829930289800001E-3,2.1829930289800001E-3,5.6672350693999995E-4,5.6672350693999995E-4]
[null,"2017-08-16",260,215,0,0,0,0,5.7267789879399999E-3,5.7267789879399999E-3,3.1148884975670001E-2,3.1148884975670001E-2,1.006249071203E-2,1.006249071203E-2]
[null,"2017-08-17",223,159,0,0,0,0,1.5110812625899999E-3,1.5110812625899999E-3,1.922974303747E-2,1.922974303747E-2,5.5135900296999999E-3,5.5135900296999999E-3]
[null,"2017-08-18",181,121,0,0,1.338544802388E-2,1.338544802388E-2,0,0,5.5302490067400002E-3,5.5302490067400002E-3,6.7276377201100001E-3,6.7276377201100001E-3]
[null,"2017-08-19",119,108,0,0,3.78755299867E-3,3.78755299867E-3,1.27018424972E-3,1.27018424972E-3,8.4409063787000002E-4,8.4409063787000002E-4,2.15480871193E-3,2.15480871193E-3]
[null,"2017-08-20",128,107,0,0,0,0,1.01687739072E-2,1.01687739072E-2,2.9203595632099999E-3,2.9203595632099999E-3,4.2667983144399997E-3,4.2667983144399997E-3]
[null,"2017-08-21",260,188,0,0,0,0,0,0,1.7852031881400001E-3,1.7852031881400001E-3,4.6345389012000002E-4,4.6345389012000002E-4]
[null,"2017-08-22",174,126,0,0,1.62141671684E-3,1.62141671684E-3,0,0,2.0083535866600001E-3,2.0083535866600001E-3,1.162412882E-3,1.162412882E-3]
[null,"2017-08-23",175,129,0,0,0,0,0,0,2.0330941743190001E-2,2.0330941743190001E-2,5.2780849279299999E-3,5.2780849279299999E-3]
[null,"2017-08-24",219,192,0,0,0,0,4.0368499430600002E-3,4.0368499430600002E-3,0,0,1.3928804414899999E-3,1.3928804414899999E-3]
[null,"2017-08-25",149,126,0,0,0,0,2.7776155575699999E-3,2.7776155575699999E-3,1.1157519925999999E-4,1.1157519925999999E-4,9.8735828763999996E-4,9.8735828763999996E-4]
[null,"2017-08-26",80,67,0,0,0,0,0,0,7.9218391473699998E-3,7.9218391473699998E-3,2.0565766373899998E-3,2.0565766373899998E-3]
[null,"2017-08-27",101,95,0,0,1.8157318833000001E-3,1.8157318833000001E-3,0,0,1.6493725108000001E-4,1.6493725108000001E-4,7.6066888485999999E-4,7.6066888485999999E-4]
[null,"2017-08-28",194,168,0,0,0,0,0,0,1.7852031881400001E-3,1.7852031881400001E-3,4.6345389012000002E-4,4.6345389012000002E-4]
[null,"2017-08-29",161,145,0,0,0,0,6.79256577218E-3,6.79256577218E-3,0,0,2.3437165475699998E-3,2.3437165475699998E-3]
[null,"2017-08-30",140,119,0,0,0,0,0,0,2.10052440344E-3,2.10052440344E-3,5.4531395223E-4,5.4531395223E-4]
[null,"2017-08-31",134,118,0,0,0,0,0,0,3.66257719306E-3,3.66257719306E-3,9.5083610607999997E-4,9.5083610607999997E-4]
[null,"2017-09-01",151,142,0,0,5.0107828989899997E-3,5.0107828989899997E-3,0,0,6.9613222146200004E-3,6.9613222146200004E-3,3.7882317974700002E-3,3.7882317974700002E-3]
[null,"2017-09-02",117,94,0,0,3.5677538759999999E-4,3.5677538759999999E-4,3.0915116652600002E-3,3.0915116652600002E-3,6.2045512979099996E-3,6.2045512979099996E-3,2.8185049078299999E-3,2.8185049078299999E-3]
[null,"2017-09-03",109,97,0,0,0,0,0,0,9.6488291880699999E-3,9.6488291880699999E-3,2.5049179006500001E-3,2.5049179006500001E-3]
[null,"2017-09-04",301,265,0,0,7.27885500585E-3,7.27885500585E-3,3.3221888048589998E-2,3.3221888048589998E-2,1.09440717186E-2,1.09440717186E-2,1.7181797344709999E-2,1.7181797344709999E-2]
[null,"2017-09-05",247,219,0,0,0,0,5.1719858673799999E-3,5.1719858673799999E-3,6.6411499037099999E-3,6.6411499037099999E-3,3.5086482007200001E-3,3.5086482007200001E-3]
[null,"2017-09-06",199,183,0,0,1.5927472660000002E-5,1.5927472660000002E-5,1.2738342044600001E-3,1.2738342044600001E-3,7.2766434299000005E-4,7.2766434299000005E-4,6.3473032776999996E-4,6.3473032776999996E-4]
[null,"2017-09-07",140,128,0,0,0,0,0,0,5.6903351622000003E-3,5.6903351622000003E-3,1.47725927475E-3,1.47725927475E-3]
[null,"2017-09-08",143,141,0,0,7.8267600653699997E-3,7.8267600653699997E-3,0,0,6.6508520949499998E-3,6.6508520949499998E-3,4.8209279656599999E-3,4.8209279656599999E-3]
[null,"2017-09-09",89,78,0,0,0,0,0,0,0,0,0,0]
[null,"2017-09-10",240,183,0,0,8.7473679851399998E-3,8.7473679851399998E-3,0,0,9.7701065785699998E-3,9.7701065785699998E-3,5.9946753178100002E-3,5.9946753178100002E-3]
[null,"2017-09-11",209,183,0,0,0,0,0,0,1.0187300801999999E-4,1.0187300801999999E-4,2.6447096990000002E-5,2.6447096990000002E-5]
[null,"2017-09-12",159,151,0,0,0,0,6.4385201623500003E-3,6.4385201623500003E-3,7.2232813780999999E-3,7.2232813780999999E-3,4.0967812623599999E-3,4.0967812623599999E-3]
[null,"2017-09-13",269,249,0,0,0,0,2.4016702192900001E-3,2.4016702192900001E-3,2.3915901406300001E-3,2.3915901406300001E-3,1.44955279218E-3,1.44955279218E-3]
[null,"2017-09-14",191,180,0,0,0,0,0,0,0,0,0,0]
[null,{"$f":"B271+1","v":"2017-09-15"},255,224,0,0,0,0,0,0,2.0685071723450001E-2,2.0685071723450001E-2,5.3700200746100001E-3,5.3700200746100001E-3]
[null,"2017-09-16",131,119,0,0,0,0,0,0,4.1767933287699998E-3,4.1767933287699998E-3,1.0843309766E-3,1.0843309766E-3]
[null,"2017-09-17",92,90,0,0,0,0,6.2049230590000004E-4,6.2049230590000004E-4,1.1899737555730001E-2,1.1899737555730001E-2,3.30336835265E-3,3.30336835265E-3]
[null,"2017-09-18",302,247,0,0,0,0,1.285149064152E-2,1.285149064152E-2,0,0,4.4342965953800004E-3,4.4342965953800004E-3]
[null,"2017-09-19",160,157,0,0,9.13281282353E-3,9.13281282353E-3,0,0,0,0,3.61065843196E-3,3.61065843196E-3]
[null,"2017-09-20",170,166,0,0,0,0,0,0,9.2655926340999995E-3,9.2655926340999995E-3,2.4054264405500001E-3,2.4054264405500001E-3]
[null,"2017-09-21",128,127,0,0,0,0,0,0,0,0,0,0]
[null,"2017-09-22",130,124,0,0,0,0,8.5116944549900007E-3,8.5116944549900007E-3,0,0,2.9368871515E-3,2.9368871515E-3]
[null,"2017-09-23",243,148,0,0,1.292036582219E-2,1.292036582219E-2,5.44573247292E-3,5.44573247292E-3,3.5849596631399999E-3,3.5849596631399999E-3,7.9177570846699994E-3,7.9177570846699994E-3]
[null,"2017-09-24",127,103,0,0,0,0,1.543565859783E-2,1.543565859783E-2,2.0956733078200001E-3,2.0956733078200001E-3,5.86999614628E-3,5.86999614628E-3]
[null,"2017-09-25",209,206,0,0,0,0,0,0,5.3168007994599999E-3,5.3168007994599999E-3,1.3802865857799999E-3,1.3802865857799999E-3]
[null,"2017-09-26",184,177,0,0,0,0,4.5701083306570002E-2,4.5701083306570002E-2,1.256433765566E-2,1.256433765566E-2,1.903057536289E-2,1.903057536289E-2]
[null,"2017-09-27",239,169,0,0,0,0,0,0,2.3285258976E-4,2.3285258976E-4,6.0450507410000002E-5,6.0450507410000002E-5]
[null,"2017-09-28",185,181,0,0,0,0,0,0,9.2170816779000003E-4,9.2170816779000003E-4,2.3928325848000001E-4,2.3928325848000001E-4]
[null,"2017-09-29",113,109,0,0,7.8618005052199999E-3,7.8618005052199999E-3,1.773148012965E-2,1.773148012965E-2,2.7166135471999998E-4,2.7166135471999998E-4,9.2967842848800004E-3,9.2967842848800004E-3]
[null,"2017-09-30",88,86,0,0,3.4403340946699999E-3,3.4403340946699999E-3,0,0,2.2101591644469998E-2,2.2101591644469998E-2,7.09789707797E-3,7.09789707797E-3]
[null,"2017-10-01",62,59,0,0,0,0,0,0,1.5863082677200001E-3,1.5863082677200001E-3,4.1181908170999999E-4,4.1181908170999999E-4]
[null,"2017-10-02",169,168,0,0,0,0,0,0,1.8715526901750001E-2,1.8715526901750001E-2,4.8587095327899997E-3,4.8587095327899997E-3]
[null,"2017-10-03",180,178,0,0,6.3263921407500003E-3,6.3263921407500003E-3,3.9529009840300004E-3,3.9529009840300004E-3,9.3432101640200001E-3,9.3432101640200001E-3,6.2906309269799999E-3,6.2906309269799999E-3]
[null,"2017-10-04",162,156,0,0,3.4371486001300001E-3,3.4371486001300001E-3,0,0,5.3410562775600004E-3,5.3410562775600004E-3,2.7454605447100001E-3,2.7454605447100001E-3]
[null,"2017-10-05",160,146,0,0,0,0,7.2597599789799997E-3,7.2597599789799997E-3,1.5746656382340001E-2,1.5746656382340001E-2,6.5928834640200003E-3,6.5928834640200003E-3]
[null,"2017-10-06",145,135,0,0,0,0,0,0,3.6771304799199998E-3,3.6771304799199998E-3,9.5461426279000005E-4,9.5461426279000005E-4]
[null,"2017-10-07",84,67,0,0,0,0,0,0,2.3285258976E-4,2.3285258976E-4,6.0450507410000002E-5,6.0450507410000002E-5]
[null,"2017-10-08",243,205,0,0,0,0,6.7232166321100004E-3,6.7232166321100004E-3,2.3775219633350001E-2,2.3775219633350001E-2,8.4920369050300003E-3,8.4920369050300003E-3]
[null,"2017-10-09",253,240,0,0,3.5900523376800001E-3,3.5900523376800001E-3,7.11376178935E-3,7.11376178935E-3,0,0,3.8738700163000002E-3,3.8738700163000002E-3]
[null,"2017-10-10",209,191,0,0,3.2011034553060001E-2,3.2011034553060001E-2,4.5135340321780001E-2,4.5135340321780001E-2,3.1585483581470002E-2,3.1585483581470002E-2,3.6428987025810003E-2,3.6428987025810003E-2]
[null,"2017-10-11",203,190,0,0,2.3923063936060002E-2,2.3923063936060002E-2,3.7083540164100002E-3,3.7083540164100002E-3,1.6828450705590001E-2,1.6828450705590001E-2,1.5106329923760001E-2,1.5106329923760001E-2]
[null,"2017-10-12",170,147,0,0,0,0,2.33232107922E-3,2.33232107922E-3,0,0,8.0474737984999995E-4,8.0474737984999995E-4]
[null,"2017-10-13",129,124,0,0,0,0,0,0,3.5073421332199998E-3,3.5073421332199998E-3,9.1053576781000001E-4,9.1053576781000001E-4]
[null,"2017-10-14",196,101,0,0,3.8831178346299998E-3,3.8831178346299998E-3,0,0,2.4580501506269999E-2,2.4580501506269999E-2,7.9164976990999999E-3,7.9164976990999999E-3]
[null,"2017-10-15",100,87,0,0,0,0,0,0,0,0,0,0]
[null,"2017-10-16",188,179,0,0,3.4339631056E-3,3.4339631056E-3,6.9203141881000003E-3,6.9203141881000003E-3,4.3087431296360001E-2,4.3087431296360001E-2,1.493127532939E-2,1.493127532939E-2]
[null,"2017-10-17",233,208,0,0,1.9348693787969998E-2,1.9348693787969998E-2,3.5003065961980002E-2,3.5003065961980002E-2,1.660044921145E-2,1.660044921145E-2,2.403663300749E-2,2.403663300749E-2]
[null,"2017-10-18",390,339,0,0,5.7179626851199998E-3,5.7179626851199998E-3,3.2594095833199999E-3,3.2594095833199999E-3,4.4731952711520001E-2,4.4731952711520001E-2,1.4998022764649999E-2,1.4998022764649999E-2]
[null,"2017-10-19",220,203,0,0,0,0,7.4167080328200003E-3,7.4167080328200003E-3,2.5798126506869998E-2,2.5798126506869998E-2,9.2564839466099998E-3,9.2564839466099998E-3]
[null,"2017-10-20",182,172,0,0,0,0,0,0,4.9966284884999995E-4,4.9966284884999995E-4,1.2971671381E-4,1.2971671381E-4]
[null,"2017-10-21",90,87,0,0,0,0,1.85782696295E-3,1.85782696295E-3,8.6980144465599995E-3,8.6980144465599995E-3,2.8991055843699998E-3,2.8991055843699998E-3]
[null,"2017-10-22",102,99,0,0,0,0,0,0,1.5717549808600001E-3,1.5717549808600001E-3,4.0804092498999999E-4,4.0804092498999999E-4]
[null,"2017-10-23",196,170,0,0,0,0,0,0,7.3639631510800004E-3,7.3639631510800004E-3,1.91174729673E-3,1.91174729673E-3]
[null,"2017-10-24",305,226,0,0,1.7727277071130001E-2,1.7727277071130001E-2,1.384062837621E-2,1.384062837621E-2,3.69168376678E-3,3.69168376678E-3,1.2742463207049999E-2,1.2742463207049999E-2]
[null,"2017-10-25",253,236,0,0,5.2560659780000001E-4,5.2560659780000001E-4,1.1011913452269999E-2,1.1011913452269999E-2,3.3394942247710002E-2,3.3394942247710002E-2,1.267697515736E-2,1.267697515736E-2]
[null,"2017-10-26",193,183,0,0,0,0,5.3909831518099997E-3,5.3909831518099997E-3,1.6867259470550001E-2,1.6867259470550001E-2,6.2389961185700003E-3,6.2389961185700003E-3]
[null,"2017-10-27",163,137,0,0,0,0,0,0,3.1284715653030003E-2,3.1284715653030003E-2,8.1217775471700004E-3,8.1217775471700004E-3]
[null,"2017-10-28",146,113,0,0,2.5961780436599999E-2,2.5961780436599999E-2,4.1419686395889999E-2,4.1419686395889999E-2,7.3358267964820006E-2,7.3358267964820006E-2,4.3599928466900001E-2,4.3599928466900001E-2]
[null,"2017-10-29",158,133,0,0,0,0,1.767673080854E-2,1.767673080854E-2,1.615899951004E-2,1.615899951004E-2,1.029421765709E-2,1.029421765709E-2]
[null,"2017-10-30",240,195,0,0,0,0,2.5232137121499999E-2,2.5232137121499999E-2,2.6205618538949999E-2,2.6205618538949999E-2,1.5509333306470001E-2,1.5509333306470001E-2]
[null,"2017-10-31",202,188,0,0,0,0,7.3729085759000003E-4,7.3729085759000003E-4,1.0148492036929999E-2,1.0148492036929999E-2,2.8890304997999999E-3,2.8890304997999999E-3]
[null,"2017-11-01",155,143,0,0,1.8953692466E-3,1.8953692466E-3,4.0404998978009997E-2,4.0404998978009997E-2,0,0,1.469073268534E-2,1.469073268534E-2]
[null,"2017-11-02",176,152,0,0,0,0,3.9127514818800002E-3,3.9127514818800002E-3,2.6389960172499998E-3,2.6389960172499998E-3,2.0351670826800001E-3,2.0351670826800001E-3]
[null,"2017-11-03",167,153,0,0,0,0,1.09863637691E-3,1.09863637691E-3,8.3632888487900001E-3,8.3632888487900001E-3,2.5502557812099999E-3,2.5502557812099999E-3]
[null,"2017-11-04",139,126,0,0,0,0,0,0,3.43942679454E-3,3.43942679454E-3,8.9290436981999996E-4,8.9290436981999996E-4]
[null,"2017-11-05",131,107,0,0,0,0,1.2668992904490001E-2,1.2668992904490001E-2,3.1633994537669997E-2,3.1633994537669997E-2,1.2583780625109999E-2,1.2583780625109999E-2]
[null,"2017-11-06",121,117,0,0,8.5530528186800008E-3,8.5530528186800008E-3,0,0,0,0,3.38145025805E-3,3.38145025805E-3]
[null,"2017-11-07",63,63,0,0,0,0,9.8986772564E-3,9.8986772564E-3,0,0,3.4154536684600002E-3,3.4154536684600002E-3]
[null,"2017-11-08",217,193,0,0,0,0,0,0,0,0,0,0]
[null,"2017-11-09",167,155,0,0,0,0,0,0,7.0631952226399997E-3,7.0631952226399997E-3,1.83366539133E-3,1.83366539133E-3]
[null,"2017-11-10",182,164,0,0,2.0514584786699998E-3,2.0514584786699998E-3,0,0,1.376255827379E-2,1.376255827379E-2,4.3839211725400003E-3,4.3839211725400003E-3]
[null,"2017-11-11",101,85,0,0,0,0,2.089599088971E-2,2.089599088971E-2,2.301359762102E-2,2.301359762102E-2,1.318450754246E-2,1.318450754246E-2]
[null,"2017-11-12",154,145,0,0,0,0,7.4459076707399999E-3,7.4459076707399999E-3,7.0631952226399997E-3,7.0631952226399997E-3,4.4028119560999999E-3,4.4028119560999999E-3]
[null,"2017-11-13",238,217,0,0,1.8010786084489999E-2,1.8010786084489999E-2,2.0585744736799998E-3,2.0585744736799998E-3,1.4029368532879999E-2,1.4029368532879999E-2,1.1473002551519999E-2,1.1473002551519999E-2]
[null,"2017-11-14",300,251,0,0,1.5927472660000002E-5,1.5927472660000002E-5,1.3548631996959999E-2,1.3548631996959999E-2,1.6008615545800001E-3,1.6008615545800001E-3,5.0967334057100003E-3,5.0967334057100003E-3]
[null,"2017-11-15",367,294,0,0,0,0,8.1065494787900001E-3,8.1065494787900001E-3,9.5906160406300008E-3,9.5906160406300008E-3,5.28690062692E-3,5.28690062692E-3]
[null,"2017-11-16",410,277,0,0,2.2897334696729998E-2,2.2897334696729998E-2,1.44173212252E-3,1.44173212252E-3,5.020398857082E-2,5.020398857082E-2,2.258330205859E-2,2.258330205859E-2]
[null,"2017-11-17",338,293,0,0,8.9544251297299995E-3,8.9544251297299995E-3,2.384515432009E-2,2.384515432009E-2,1.6202659370620001E-2,1.6202659370620001E-2,1.5974046582150001E-2,1.5974046582150001E-2]
[null,{"$f":"B335+1","v":"2017-11-18"},269,154,0,0,0,0,1.546485823576E-2,1.546485823576E-2,3.4151713164419999E-2,3.4151713164419999E-2,1.42020910838E-2,1.42020910838E-2]
[null,"2017-11-19",119,97,0,0,0,0,3.7959529301799999E-3,3.7959529301799999E-3,4.9529686279600003E-3,4.9529686279600003E-3,2.5955936617599999E-3,2.5955936617599999E-3]
[null,"2017-11-20",319,233,0,0,0,0,6.2414226063999998E-4,6.2414226063999998E-4,1.160382072291E-2,1.160382072291E-2,3.2278052183899999E-3,3.2278052183899999E-3]
[null,"2017-11-21",270,225,0,0,6.2913517008900003E-3,6.2913517008900003E-3,0,0,1.925884961118E-2,1.925884961118E-2,7.4870472194000001E-3,7.4870472194000001E-3]
[null,"2017-11-22",230,212,0,0,2.03871650054E-3,2.03871650054E-3,2.9188688060270002E-2,2.9188688060270002E-2,1.9748810268800002E-2,1.9748810268800002E-2,1.600427183586E-2,1.600427183586E-2]
[null,"2017-11-23",289,261,0,0,0,0,9.4898823254999998E-4,9.4898823254999998E-4,2.3818879493929999E-2,2.3818879493929999E-2,6.5110234018999997E-3,6.5110234018999997E-3]
[null,"2017-11-24",296,263,0,0,2.0527326764839999E-2,2.0527326764839999E-2,1.876076736648E-2,1.876076736648E-2,2.1631035369339999E-2,2.1631035369339999E-2,2.0204322715030001E-2,2.0204322715030001E-2]
[null,"2017-11-25",276,241,0,0,3.5597901396199998E-2,3.5597901396199998E-2,2.8947791047389999E-2,2.8947791047389999E-2,0.10925637555242,0.10925637555242,5.242570254824E-2,5.242570254824E-2]
[null,"2017-11-26",703,495,0,0,1.8730707848740001E-2,1.8730707848740001E-2,2.8560895844890001E-2,2.8560895844890001E-2,0.15418237208874,0.15418237208874,5.728693085218E-2,5.728693085218E-2]
[null,"2017-11-27",333,300,0,0,4.9375165247499998E-3,4.9375165247499998E-3,5.2533798580900001E-2,5.2533798580900001E-2,4.6531709186519998E-2,4.6531709186519998E-2,3.2158410554659997E-2,3.2158410554659997E-2]
[null,"2017-11-28",228,212,0,0,0,0,1.072721698251E-2,1.072721698251E-2,1.555261255755E-2,1.555261255755E-2,7.7389243336000004E-3,7.7389243336000004E-3]
[null,"2017-11-29",389,312,0,0,0,0,4.14634858528E-3,4.14634858528E-3,1.05074731128E-2,1.05074731128E-2,4.1584911553399998E-3,4.1584911553399998E-3]
[null,"2017-11-30",667,448,0,0,4.2876756402000001E-3,4.2876756402000001E-3,2.0133150348940001E-2,2.0133150348940001E-2,0.10392987256172,0.10392987256172,3.562298026039E-2,3.562298026039E-2]
[null,"2017-12-01",572,460,0,0,0,0,1.305588810699E-2,1.305588810699E-2,5.2663494050130003E-2,5.2663494050130003E-2,1.8176711945780001E-2,1.8176711945780001E-2]
[null,"2017-12-02",276,238,0,0,7.3170809402299999E-3,7.3170809402299999E-3,5.9859257745000004E-4,5.9859257745000004E-4,5.2634387476399999E-3,5.2634387476399999E-3,4.4657812346500002E-3,4.4657812346500002E-3]
[null,"2017-12-03",164,149,0,0,7.21833060974E-3,7.21833060974E-3,0,0,7.62592231455E-3,7.62592231455E-3,4.8335218213700001E-3,4.8335218213700001E-3]
[null,"2017-12-04",216,198,0,0,0,0,0,0,0,0,0,0]
[null,"2017-12-05",245,194,0,0,0,0,6.4604198907900002E-3,6.4604198907900002E-3,2.5225697224000001E-4,2.5225697224000001E-4,2.2946005103000001E-3,2.2946005103000001E-3]
[null,"2017-12-06",137,125,0,0,0,0,0,0,8.1352873546500001E-3,8.1352873546500001E-3,2.1119896025100001E-3,2.1119896025100001E-3]
[null,"2017-12-07",212,194,0,0,9.1105143617999996E-4,9.1105143617999996E-4,0,0,1.248672012574E-2,1.248672012574E-2,3.6018427329699999E-3,3.6018427329699999E-3]
[null,"2017-12-08",262,162,0,0,0,0,0,0,3.110522511509E-2,3.110522511509E-2,8.0751802810399998E-3,8.0751802810399998E-3]
[null,"2017-12-09",132,103,0,0,0,0,2.3432709434399999E-3,2.3432709434399999E-3,1.487345917075E-2,1.487345917075E-2,4.6698016971500004E-3,4.6698016971500004E-3]
[null,"2017-12-10",120,110,0,0,3.4148501384100001E-3,3.4148501384100001E-3,4.8507898502099999E-3,4.8507898502099999E-3,0,0,3.0237847558900002E-3,3.0237847558900002E-3]
[null,"2017-12-11",189,154,0,0,2.200858172227E-2,2.200858172227E-2,1.1752854264610001E-2,1.1752854264610001E-2,1.6542236063999999E-3,1.6542236063999999E-3,1.318576692803E-2,1.318576692803E-2]
[null,"2017-12-12",209,184,0,0,0,0,5.9658510234469997E-2,5.9658510234469997E-2,1.30494472177E-3,1.30494472177E-3,2.0923431876060002E-2,2.0923431876060002E-2]
[null,"2017-12-13",287,209,0,0,0,0,8.1320991619700002E-3,8.1320991619700002E-3,7.4706872547199996E-3,7.4706872547199996E-3,4.7453648314100001E-3,4.7453648314100001E-3]
[null,"2017-12-14",182,150,0,0,0,0,1.4008526294269999E-2,1.4008526294269999E-2,1.6648960167649999E-2,1.6648960167649999E-2,9.1557331009299997E-3,9.1557331009299997E-3]
[null,"2017-12-15",163,156,0,0,4.9343310302200002E-3,4.9343310302200002E-3,0,0,2.6462726606800002E-2,2.6462726606800002E-2,8.8207365390600007E-3,8.8207365390600007E-3]
[null,"2017-12-16",175,161,0,0,9.37491040797E-3,9.37491040797E-3,0,0,1.4771586162729999E-2,1.4771586162729999E-2,7.5412007989500004E-3,7.5412007989500004E-3]
[null,"2017-12-17",123,119,0,0,1.8953692466E-3,1.8953692466E-3,3.7959529301799999E-3,3.7959529301799999E-3,4.4533057791099999E-3,4.4533057791099999E-3,3.2152113626800001E-3,3.2152113626800001E-3]
[null,"2017-12-18",281,221,0,0,0,0,0,0,7.9024347648900001E-3,7.9024347648900001E-3,2.05153909511E-3,2.05153909511E-3]
[null,"2017-12-19",0,0,0,0,8.3332536959699992E-3,8.3332536959699992E-3,0.10101979735451,0.10101979735451,0.17215083026502001,0.17215083026502001,8.2842382858250005E-2,8.2842382858250005E-2]
[null,"2017-12-20",1884,1204,0,0,1.465008935312E-2,1.465008935312E-2,1.6410196513559999E-2,1.6410196513559999E-2,2.2518785867789999E-2,2.2518785867789999E-2,1.730017958838E-2,1.730017958838E-2]
[null,"2017-12-21",283,244,0,0,0,0,1.317268665869E-2,1.317268665869E-2,2.3241599115160001E-2,2.3241599115160001E-2,1.0578838796130001E-2,1.0578838796130001E-2]
[null,"2017-12-22",408,237,0,0,2.5483956257E-4,2.5483956257E-4,1.5355359593540001E-2,1.5355359593540001E-2,0,0,5.39898594274E-3,5.39898594274E-3]
[null,"2017-12-23",132,90,0,0,0,0,2.2567670160890001E-2,2.2567670160890001E-2,1.010483217635E-2,1.010483217635E-2,1.041008112962E-2,1.041008112962E-2]
[null,"2017-12-24",157,130,0,0,0,0,0,0,9.4838919369900007E-3,9.4838919369900007E-3,2.46209879124E-3,2.46209879124E-3]
[null,"2017-12-25",83,79,0,0,0,0,2.0695243379000002E-3,2.0695243379000002E-3,9.0181867574799998E-3,9.0181867574799998E-3,3.0552693951699998E-3,3.0552693951699998E-3]
[null,"2017-12-26",94,89,0,0,7.2151451151999998E-3,7.2151451151999998E-3,4.8584547551609999E-2,4.8584547551609999E-2,1.6061977597640002E-2,1.6061977597640002E-2,2.3786015278870001E-2,2.3786015278870001E-2]
[null,"2017-12-27",257,217,0,0,0,0,0,0,1.8788293336050001E-2,1.8788293336050001E-2,4.87760031636E-3,4.87760031636E-3]
[null,"2017-12-28",223,202,0,0,0,0,1.0030075627060001E-2,1.0030075627060001E-2,1.0133938750069999E-2,1.0133938750069999E-2,6.0916480067700002E-3,6.0916480067700002E-3]
[null,"2017-12-29",293,255,0,0,0,0,4.1748182322540003E-2,4.1748182322540003E-2,5.1310038372169998E-2,5.1310038372169998E-2,2.772537334485E-2,2.772537334485E-2]
[null,"2017-12-30",83,81,0,0,3.4403340946699999E-3,3.4403340946699999E-3,0,0,4.8996065760999999E-4,4.8996065760999999E-4,1.48733435931E-3,1.48733435931E-3]
[null,"2017-12-31",79,77,0,0,0,0,9.0883873039999995E-4,9.0883873039999995E-4,1.43107320788E-3,1.43107320788E-3,6.8510575061000003E-4,6.8510575061000003E-4]
[null,"2018-01-01"]

{"sheet":"6.8 STPIS Exclusions","index":12,"n_rows":448,"n_cols":12,"rows_kept":448,"cut":false,"hidden":false,"merged":[[9,11,10,11],[6,1,6,4],[9,6,9,8],[9,5,10,5],[9,4,10,4],[9,2,10,2],[9,3,10,3]]}
[null,{"$f":"(LOOKUP(dms_Model,dms_Model_List,dms_Worksheet_List))","v":"ANNUAL REPORTING STATEMENT"}]
[null,{"$f":"dms_TradingName","v":"Powercor Australia"}]
[null,{"$f":"CONCATENATE(\"Annual Reporting RIN Response \",CRY)","v":"Annual Reporting RIN Response 2017"}]
[null,"6.8 STPIS EXCLUSIONS"]
[]
[]
[null,{"$f":"CONCATENATE(\"This information is collected to inform the application of the STPIS to \",dms_TradingName,\" in future regulatory periods. The information is also collected to monitor network performance, and may be used in performance reports.\")","v":"This information is collected to inform the application of the STPIS to Powercor Australia in future regulatory periods. The information is also collected to monitor network performance, and may be used in performance reports."}]
[]
[null,"6.8.1 - STPIS EXCLUSIONS"]
[null,"Date of event","Outage ID","Feeder ID / name","Feeder classification\n(drop down)","Cause of event\n(drop down)","Unplanned",null,null,"Event category","Effect on unplanned MAIFI","Please provide separate explanation to confirm the outage was not due to inadequate transmission connection planning "]
[null,"DD/MM/YYYY",null,null,null,null,"Number of  interruptions","Duration of interruption\n(mins)","Total unplanned minutes off supply","Use exclusion categories listed in section 3.3(a) of the STPIS\n(drop down)","by feeder classification"]
[null,"8/02/2017","955986-1","ETSA001","Rural Long","Load shedding",311,29,9019,"3.3 a) (4)",0,"Load shedding at the direction of the Australian Energy Mark"]
[null,"9/04/2017","980241-1","CME014","Rural Short","Other",1,86,86,"3.3 b)",0,"Threshold exceeded due to storm activity on the network"]
[null,"9/04/2017","980245-1","NKA004","Rural Short","Equipment failure",12,108,1296,"3.3 b)",0,"Threshold exceeded due to storm activity on the network"]
[null,"9/04/2017","980304-1","BET004","Rural Short","Other",37,0,0,"3.3 b)",1.3504832539999999E-4,"Threshold exceeded due to storm activity on the network"]
[null,"9/04/2017","980305-1","BET004","Rural Short","Weather",1,39,39,"3.3 b)",0,"Threshold exceeded due to storm activity on the network"]
[null,"9/04/2017","980306-1","CLC003","Rural Long","Other",46,0,0,"3.3 b)",2.2315039851999999E-4,"Threshold exceeded due to storm activity on the network"]
[null,"9/04/2017","980333-1","CLC003","Rural Long","Other",16,0,0,"3.3 b)",7.7617529919999997E-5,"Threshold exceeded due to storm activity on the network"]
[null,"9/04/2017","980343-1","WIN013","Rural Short","Other",42,0,0,"3.3 b)",1.532980991E-4,"Threshold exceeded due to storm activity on the network"]
[null,"9/04/2017","980345-1","WIN013","Rural Short","Other",798,0,0,"3.3 b)",2.9126638829699999E-3,"Threshold exceeded due to storm activity on the network"]
[null,"9/04/2017","980352-1","BAN015","Rural Short","Equipment failure",3,617,1851,"3.3 b)",0,"Threshold exceeded due to storm activity on the network"]
[null,"9/04/2017","980353-1","CTN003","Rural Long","Weather",14,412,5768,"3.3 b)",0,"Threshold exceeded due to storm activity on the network"]
[null,"9/04/2017","980354-1","EHK024","Rural Long","Other",86,0,0,"3.3 b)",4.1719422331999999E-4,"Threshold exceeded due to storm activity on the network"]
[null,"9/04/2017","980357-1","BMH003","Rural Long","Other",37,0,0,"3.3 b)",1.7949053794E-4,"Threshold exceeded due to storm activity on the network"]
[null,"9/04/2017","980358-1","BET001","Rural Long","Other",570,0,0,"3.3 b)",2.7651245033700001E-3,"Threshold exceeded due to storm activity on the network"]
[null,"9/04/2017","980377-1","STL005","Rural Long","Other",654,0,0,"3.3 b)",3.1726165354400001E-3,"Threshold exceeded due to storm activity on the network"]
[null,"9/04/2017","980393-1","CHA006","Rural Long","Other",182,0,0,"3.3 b)",8.8289940282999997E-4,"Threshold exceeded due to storm activity on the network"]
[null,"9/04/2017","980396-1","CHA006","Rural Long","Weather",1,121,121,"3.3 b)",0,"Threshold exceeded due to storm activity on the network"]
[null,"9/04/2017","980399-1","WND013","Rural Long","Other",21,0,0,"3.3 b)",1.0187300801999999E-4,"Threshold exceeded due to storm activity on the network"]
[null,"9/04/2017","980404-1","WBL002","Rural Short","Equipment failure",15,127,1905,"3.3 b)",0,"Threshold exceeded due to storm activity on the network"]
[null,"9/04/2017","980407-1","WIN013","Rural Short","Weather",1,137,137,"3.3 b)",0,"Threshold exceeded due to storm activity on the network"]
[null,"9/04/2017","980408-1","CLC007","Rural Long","Other",55,0,0,"3.3 b)",2.668102591E-4,"Threshold exceeded due to storm activity on the network"]
[null,"9/04/2017","980411-1","KYM001","Rural Long","Weather",1,107,107,"3.3 b)",0,"Threshold exceeded due to storm activity on the network"]
[null,"9/04/2017","980412-1","TRG005","Rural Long","Equipment failure",21,103,2163,"3.3 b)",0,"Threshold exceeded due to storm activity on the network"]
[null,"9/04/2017","980413-1","PLD001","Rural Long","Other",1,87,87,"3.3 b)",0,"Threshold exceeded due to storm activity on the network"]
[null,"9/04/2017","980415-1","CLC003","Rural Long","Other",16,0,0,"3.3 b)",7.7617529919999997E-5,"Threshold exceeded due to storm activity on the network"]
[null,"9/04/2017","980423-1","WIN013","Rural Short","Weather",1,55,55,"3.3 b)",0,"Threshold exceeded due to storm activity on the network"]
[null,"9/04/2017","980424-1","TRG005","Rural Long","Weather",1,22,22,"3.3 b)",0,"Threshold exceeded due to storm activity on the network"]
[null,"9/04/2017","980427-1","TRG005","Rural Long","Equipment failure",10,1152,11520,"3.3 b)",0,"Threshold exceeded due to storm activity on the network"]
[null,"9/04/2017","980431-1","CLC003","Rural Long","Weather",1,713,713,"3.3 b)",0,"Threshold exceeded due to storm activity on the network"]
[null,"9/04/2017","980432-1","CLC003","Rural Long","Weather",2,647,1294,"3.3 b)",0,"Threshold exceeded due to storm activity on the network"]
[null,"9/04/2017","980433-1","HTN004","Rural Long","Weather",1,61,61,"3.3 b)",0,"Threshold exceeded due to storm activity on the network"]
[null,"9/04/2017","980436-1","WND013","Rural Long","Weather",1,85,85,"3.3 b)",0,"Threshold exceeded due to storm activity on the network"]
[null,"9/04/2017","980438-1","BET005","Rural Long","Weather",1,47,47,"3.3 b)",0,"Threshold exceeded due to storm activity on the network"]
[null,"9/04/2017","980451-1","SHL002","Rural Long","Equipment failure",25,103.6,2590,"3.3 b)",0,"Threshold exceeded due to storm activity on the network"]
[null,"9/04/2017","980453-1","BMH003","Rural Long","Weather",2,308,616,"3.3 b)",0,"Threshold exceeded due to storm activity on the network"]
[null,"9/04/2017","980458-1","BET002","Urban","Equipment failure",1,114,114,"3.3 b)",0,"Threshold exceeded due to storm activity on the network"]
[null,"9/04/2017","980460-1","CHA003","Rural Short","Equipment failure",1,82,82,"3.3 b)",0,"Threshold exceeded due to storm activity on the network"]
[null,"9/04/2017","980468-1","CLC006","Rural Long","Weather",2,978,1956,"3.3 b)",0,"Threshold exceeded due to storm activity on the network"]
[null,"9/04/2017","980478-1","WBL012","Rural Long","Equipment failure",2,463,926,"3.3 b)",0,"Threshold exceeded due to storm activity on the network"]
[null,"9/04/2017","980480-1","NKA002","Rural Long","Weather",18,74,1332,"3.3 b)",0,"Threshold exceeded due to storm activity on the network"]
[null,"9/04/2017","980483-1","SHL007","Urban","Equipment failure",5,60,300,"3.3 b)",0,"Threshold exceeded due to storm activity on the network"]
[null,"9/04/2017","980484-1","WBE023","Rural Short","Equipment failure",1,354,354,"3.3 b)",0,"Threshold exceeded due to storm activity on the network"]
[null,"9/04/2017","980495-1","PLD006","Rural Short","Weather",3,120,360,"3.3 b)",0,"Threshold exceeded due to storm activity on the network"]
[null,"9/04/2017","980502-1","TRG003","Rural Long","Weather",1,1639,1639,"3.3 b)",0,"Threshold exceeded due to storm activity on the network"]
[null,"9/04/2017","980505-1","TRG003","Rural Long","Other",1312,0,0,"3.3 b)",6.3646374533699998E-3,"Threshold exceeded due to storm activity on the network"]
[null,"9/04/2017","980513-1","CLC006","Rural Long","Weather",22,149,3278,"3.3 b)",0,"Threshold exceeded due to storm activity on the network"]
[null,"9/04/2017","980535-1","WIN013","Rural Short","Weather",2,124,248,"3.3 b)",0,"Threshold exceeded due to storm activity on the network"]
[null,"9/04/2017","980536-1","CLC006","Rural Long","Weather",111,1257.6666666666699,139601,"3.3 b)",0,"Threshold exceeded due to storm activity on the network"]
[null,"9/04/2017","980552-1","TRG005","Rural Long","Vegetation",1,1092,1092,"3.3 b)",0,"Threshold exceeded due to storm activity on the network"]
[null,"9/04/2017","980554-1","BAS021","Rural Long","Equipment failure",4,450,1800,"3.3 b)",0,"Threshold exceeded due to storm activity on the network"]
[null,"9/04/2017","980559-1","KYM006","Rural Short","Other",5,240,1200,"3.3 b)",0,"Threshold exceeded due to storm activity on the network"]
[null,"9/04/2017","980567-1","TRG003","Rural Long","Vegetation",2,1002,2004,"3.3 b)",0,"Threshold exceeded due to storm activity on the network"]
[null,"9/04/2017","980571-1","EHK024","Rural Long","Animals",1,209,209,"3.3 b)",0,"Threshold exceeded due to storm activity on the network"]
[null,"9/04/2017","980572-1","KRT022","Rural Short","Equipment failure",2,258,516,"3.3 b)",0,"Threshold exceeded due to storm activity on the network"]
[null,"9/04/2017","980573-1","BAS021","Rural Long","Other",461,0,0,"3.3 b)",2.2363550808000001E-3,"Threshold exceeded due to storm activity on the network"]
[null,"9/04/2017","980588-1","PLD003","Rural Long","Other",1,51,51,"3.3 b)",0,"Threshold exceeded due to storm activity on the network"]
[null,"9/04/2017","980605-1","CMN001","Rural Long","Other",28,0,0,"3.3 b)",1.3583067735999999E-4,"Threshold exceeded due to storm activity on the network"]
[null,"9/04/2017","980609-1","CLC006","Rural Long","Weather",1533,0,0,"3.3 b)",7.4367295853800001E-3,"Threshold exceeded due to storm activity on the network"]
[null,"9/04/2017","980619-1","WND013","Rural Long","Other",75,0,0,"3.3 b)",3.6383217149999999E-4,"Threshold exceeded due to storm activity on the network"]
[null,"9/04/2017","980620-1","CDN002","Rural Long","Weather",80,842.2,67376,"3.3 b)",0,"Threshold exceeded due to storm activity on the network"]
[null,"9/04/2017","980623-1","CMN001","Rural Long","Weather",121,262,31702,"3.3 b)",0,"Threshold exceeded due to storm activity on the network"]
[null,"9/04/2017","980625-1","BAN008","Rural Long","Weather",28,309,8652,"3.3 b)",0,"Threshold exceeded due to storm activity on the network"]
[null,"9/04/2017","980626-1","WND013","Rural Long","Other",870,0,0,"3.3 b)",4.22045318935E-3,"Threshold exceeded due to storm activity on the network"]
[null,"9/04/2017","980630-1","CLC004","Rural Long","Weather",6,354,2124,"3.3 b)",0,"Threshold exceeded due to storm activity on the network"]
[null,"9/04/2017","980632-1","WBL012","Rural Long","Weather",23,305,7015,"3.3 b)",0,"Threshold exceeded due to storm activity on the network"]
[null,"9/04/2017","980633-1","BAN011","Rural Long","Other",632,0,0,"3.3 b)",3.0658924318099998E-3,"Threshold exceeded due to storm activity on the network"]
[null,"9/04/2017","980637-1","BAS023","Rural Short","Weather",2,282,564,"3.3 b)",0,"Threshold exceeded due to storm activity on the network"]
[null,"9/04/2017","980643-1","WBL003","Urban","Equipment failure",66,64,4224,"3.3 b)",0,"Threshold exceeded due to storm activity on the network"]
[null,"9/04/2017","980650-1","BMH006","Rural Long","Other",25,0,0,"3.3 b)",1.212773905E-4,"Threshold exceeded due to storm activity on the network"]
[null,"9/04/2017","980667-1","CLC006","Rural Long","Weather",2718,0,0,"3.3 b)",1.3185277895010001E-2,"Threshold exceeded due to storm activity on the network"]
[null,"9/04/2017","980671-1","WND013","Rural Long","Weather",17,289,4913,"3.3 b)",0,"Threshold exceeded due to storm activity on the network"]
[null,"9/04/2017","980675-1","BAS022","Rural Long","Weather",22,490,10780,"3.3 b)",0,"Threshold exceeded due to storm activity on the network"]
[null,"9/04/2017","980678-1","CRO022","Urban","Weather",1,378,378,"3.3 b)",0,"Threshold exceeded due to storm activity on the network"]
[null,"9/04/2017","980679-1","CLC001","Urban","Equipment failure",1,1107,1107,"3.3 b)",0,"Threshold exceeded due to storm activity on the network"]
[null,"9/04/2017","980681-1","CMN003","Rural Long","Weather",1,939,939,"3.3 b)",0,"Threshold exceeded due to storm activity on the network"]
[null,"9/04/2017","980683-1","HTN003","Rural Long","Equipment failure",1,162,162,"3.3 b)",0,"Threshold exceeded due to storm activity on the network"]
[null,"9/04/2017","980688-1","CMN003","Rural Long","Vegetation",1,360,360,"3.3 b)",0,"Threshold exceeded due to storm activity on the network"]
[null,"9/04/2017","980691-1","BAN008","Rural Long","Weather",57,158,9006,"3.3 b)",0,"Threshold exceeded due to storm activity on the network"]
[null,"9/04/2017","980693-1","CMN001","Rural Long","Weather",1,241,241,"3.3 b)",0,"Threshold exceeded due to storm activity on the network"]
[null,"9/04/2017","980694-1","MRO005","Rural Long","Weather",30,263,7890,"3.3 b)",0,"Threshold exceeded due to storm activity on the network"]
[null,"9/04/2017","980696-1","WBL005","Rural Short","Equipment failure",61,86,5246,"3.3 b)",0,"Threshold exceeded due to storm activity on the network"]
[null,"9/04/2017","980711-1","PLD001","Rural Long","Animals",1,455,455,"3.3 b)",0,"Threshold exceeded due to storm activity on the network"]
[null,"9/04/2017","980712-1","BAS021","Rural Long","Other",2184,0,0,"3.3 b)",1.059479283396E-2,"Threshold exceeded due to storm activity on the network"]
[null,"9/04/2017","980715-1","CLC007","Rural Long","Weather",2486,0,0,"3.3 b)",1.205982371119E-2,"Threshold exceeded due to storm activity on the network"]
[null,"9/04/2017","980718-1","BAS012","Urban","Weather",1,141,141,"3.3 b)",0,"Threshold exceeded due to storm activity on the network"]
[null,"9/04/2017","980719-1","BAS021","Rural Long","Vegetation",180,358,64440,"3.3 b)",0,"Threshold exceeded due to storm activity on the network"]
[null,"9/04/2017","980722-1","CLC002","Urban","Weather",1,290,290,"3.3 b)",0,"Threshold exceeded due to storm activity on the network"]
[null,"9/04/2017","980728-1","CMN001","Rural Long","Weather",7,350,2450,"3.3 b)",0,"Threshold exceeded due to storm activity on the network"]
[null,"9/04/2017","980734-1","BAN011","Rural Long","Equipment failure",31,1055,32705,"3.3 b)",0,"Threshold exceeded due to storm activity on the network"]
[null,"9/04/2017","980741-1","KGT004","Rural Long","Equipment failure",2,1199,2398,"3.3 b)",0,"Threshold exceeded due to storm activity on the network"]
[null,"9/04/2017","980745-1","WBL004","Urban","Equipment failure",1,834,834,"3.3 b)",0,"Threshold exceeded due to storm activity on the network"]
[null,"9/04/2017","980746-1","BAS013","Rural Short","Weather",1,178,178,"3.3 b)",0,"Threshold exceeded due to storm activity on the network"]
[null,"9/04/2017","980751-1","BAS013","Rural Short","Weather",1,492,492,"3.3 b)",0,"Threshold exceeded due to storm activity on the network"]
[null,"9/04/2017","980754-1","STN021","Rural Short","Vegetation",18,174,3132,"3.3 b)",0,"Threshold exceeded due to storm activity on the network"]
[null,"9/04/2017","980756-1","BET004","Rural Short","Weather",1,65,65,"3.3 b)",0,"Threshold exceeded due to storm activity on the network"]
[null,"9/04/2017","980762-1","BAS013","Rural Short","Weather",1,134,134,"3.3 b)",0,"Threshold exceeded due to storm activity on the network"]
[null,"9/04/2017","980764-1","TRG005","Rural Long","Weather",1,441,441,"3.3 b)",0,"Threshold exceeded due to storm activity on the network"]
[null,"9/04/2017","980775-1","GSB011","Rural Short","Other",321,0,0,"3.3 b)",1.1716354717199999E-3,"Threshold exceeded due to storm activity on the network"]
[null,"9/04/2017","980783-1","WND023","Rural Long","Weather",3,209,627,"3.3 b)",0,"Threshold exceeded due to storm activity on the network"]
[null,"9/04/2017","980784-1","CLC003","Rural Long","Equipment failure",3,1122,3366,"3.3 b)",0,"Threshold exceeded due to storm activity on the network"]
[null,"9/04/2017","980792-1","WPD021","Rural Short","Weather",3387,0,0,"3.3 b)",1.2362396706279999E-2,"Threshold exceeded due to storm activity on the network"]
[null,"9/04/2017","980801-1","GL021","Urban","Weather",1,478,478,"3.3 b)",0,"Threshold exceeded due to storm activity on the network"]
[null,"9/04/2017","980802-1","CLC007","Rural Long","Weather",555,0,0,"3.3 b)",2.6923580690699999E-3,"Threshold exceeded due to storm activity on the network"]
[null,"9/04/2017","980808-1","DDL012","Rural Short","Equipment failure",1,1400,1400,"3.3 b)",0,"Threshold exceeded due to storm activity on the network"]
[null,"9/04/2017","980814-1","CLC007","Rural Long","Weather",1,1501,1501,"3.3 b)",0,"Threshold exceeded due to storm activity on the network"]
[null,"9/04/2017","980822-1","GLE031","Rural Short","Weather",42,964,40488,"3.3 b)",0,"Threshold exceeded due to storm activity on the network"]
[null,"9/04/2017","981904-1","CTN002","Rural Long","Other",15,0,0,"3.3 b)",7.2766434300000003E-5,"Threshold exceeded due to storm activity on the network"]
[null,"9/04/2017","F-8393-b","SHN011","Rural Long","Weather",966,18,17388,"3.3 b)",0,"Threshold exceeded due to storm activity on the network"]
[null,"9/04/2017","F-8394-b","BMH003","Rural Long","Equipment failure",25,80,2000,"3.3 b)",0,"Threshold exceeded due to storm activity on the network"]
[null,"9/04/2017","F-8395-b","WIN013","Rural Short","Weather",800,132.41374999999999,105931,"3.3 b)",0,"Threshold exceeded due to storm activity on the network"]
[null,"9/04/2017","F-8396-b","OYN001","Rural Long","Equipment failure",402,76.261194029850799,30657,"3.3 b)",0,"Threshold exceeded due to storm activity on the network"]
[null,"9/04/2017","F-8396-b.1","OYN001","Rural Long","Other",543,0,0,"3.3 b)",2.6341449216299999E-3,"Threshold exceeded due to storm activity on the network"]
[null,"9/04/2017","F-8399-b","MNA021","Rural Short","Other",1760,19,33440,"3.3 b)",0,"Threshold exceeded due to storm activity on the network"]
[null,"9/04/2017","F-8401-b","CLC006","Rural Long","Weather",137,585.357664233577,80194,"3.3 b)",0,"Threshold exceeded due to storm activity on the network"]
[null,"9/04/2017","F-8402-b","COB011","Rural Long","Other",720,0,0,"3.3 b)",3.49278884636E-3,"Threshold exceeded due to storm activity on the network"]
[null,"9/04/2017","F-8402-b.1","COB011","Rural Long","Weather",718,488.12534818941498,350474,"3.3 b)",0,"Threshold exceeded due to storm activity on the network"]
[null,"9/04/2017","F-8403-b","TRG003","Rural Long","Weather",652,635.95092024539895,414640,"3.3 b)",0,"Threshold exceeded due to storm activity on the network"]
[null,"9/04/2017","F-8404-b","CDN002","Rural Long","Vegetation",136,1507,204952,"3.3 b)",0,"Threshold exceeded due to storm activity on the network"]
[null,"9/04/2017","F-8405-b","CDN001","Rural Long","Weather",277,1424.6678700361001,394633,"3.3 b)",0,"Threshold exceeded due to storm activity on the network"]
[null,"9/04/2017","F-8406-b","TRG003","Rural Long","Weather",537,460.03351955307301,247038,"3.3 b)",0,"Threshold exceeded due to storm activity on the network"]
[null,"9/04/2017","F-8407-b","CDN001","Rural Long","Other",578,0,0,"3.3 b)",2.8039332683299999E-3,"Threshold exceeded due to storm activity on the network"]
[null,"9/04/2017","F-8407-b.1","CDN001","Rural Long","Weather",340,1225.5294117647099,416680,"3.3 b)",0,"Threshold exceeded due to storm activity on the network"]
[null,"9/04/2017","F-8408-b","CLC006","Rural Long","Weather",17,2793,47481,"3.3 b)",0,"Threshold exceeded due to storm activity on the network"]
[null,"9/04/2017","F-8409-b","RCT014","Rural Short","Vegetation",222,74,16428,"3.3 b)",0,"Threshold exceeded due to storm activity on the network"]
[null,"9/04/2017","F-8410-b","BAS022","Rural Long","Weather",3438,0,0,"3.3 b)",1.6678066741369998E-2,"Threshold exceeded due to storm activity on the network"]
[null,"9/04/2017","F-8410-b.1","BAS022","Rural Long","Weather",3135,133.22360446571,417656,"3.3 b)",0,"Threshold exceeded due to storm activity on the network"]
[null,"9/04/2017","F-8411-b","BAS013","Rural Short","Weather",4422,0,0,"3.3 b)",1.614009986276E-2,"Threshold exceeded due to storm activity on the network"]
[null,"9/04/2017","F-8412-b","BAS013","Rural Short","Weather",4422,203.26843057440101,898853,"3.3 b)",0,"Threshold exceeded due to storm activity on the network"]
[null,"9/04/2017","F-8413-b","BAS021","Rural Long","Other",461,0,0,"3.3 b)",2.2363550808000001E-3,"Threshold exceeded due to storm activity on the network"]
[null,"9/04/2017","F-8414-b","TRG004","Rural Short","Weather",486,459.87448559670798,223499,"3.3 b)",0,"Threshold exceeded due to storm activity on the network"]
[null,"9/04/2017","F-8415-b","BAS012","Urban","Weather",2298,108,248184,"3.3 b)",0,"Threshold exceeded due to storm activity on the network"]
[null,"9/04/2017","F-8417-b","BAN009","Rural Long","Weather",3152,0,0,"3.3 b)",1.529065339407E-2,"Threshold exceeded due to storm activity on the network"]
[null,"9/04/2017","F-8418-b","BAN009","Rural Long","Weather",3152,0,0,"3.3 b)",1.529065339407E-2,"Threshold exceeded due to storm activity on the network"]
[null,"9/04/2017","F-8418-b.1","BAN009","Rural Long","Weather",3155,373.43803486529299,1178197,"3.3 b)",0,"Threshold exceeded due to storm activity on the network"]
[null,"9/04/2017","F-8420-b","CLC006","Rural Long","Weather",1533,0,0,"3.3 b)",7.4367295853800001E-3,"Threshold exceeded due to storm activity on the network"]
[null,"9/04/2017","F-8423-b","WND011","Rural Short","Vegetation",268,107.19776119402999,28729,"3.3 b)",0,"Threshold exceeded due to storm activity on the network"]
[null,"9/04/2017","F-8424-b","WND013","Rural Long","Other",2631,0,0,"3.3 b)",1.2763232576080001E-2,"Threshold exceeded due to storm activity on the network"]
[null,"9/04/2017","F-8425-b","BAN011","Rural Long","Weather",632,120.30379746835401,76032,"3.3 b)",0,"Threshold exceeded due to storm activity on the network"]
[null,"9/04/2017","F-8426-b","BAS021","Rural Long","Other",461,0,0,"3.3 b)",2.2363550808000001E-3,"Threshold exceeded due to storm activity on the network"]
[null,"9/04/2017","F-8427-b","CLC006","Rural Long","Weather",2452,217.937194127243,534382,"3.3 b)",0,"Threshold exceeded due to storm activity on the network"]
[null,"9/04/2017","F-8427-b.1","CLC006","Rural Long","Weather",1533,0,0,"3.3 b)",7.4367295853800001E-3,"Threshold exceeded due to storm activity on the network"]
[null,"9/04/2017","F-8430-b","BAS022","Rural Long","Weather",763,355,270865,"3.3 b)",0,"Threshold exceeded due to storm activity on the network"]
[null,"9/04/2017","F-8431-b","CMN004","Rural Long","Other",1674,0,0,"3.3 b)",8.1207340677900003E-3,"Threshold exceeded due to storm activity on the network"]
[null,"9/04/2017","F-8432-b","GSB011","Rural Short","Equipment failure",2256,38.683510638297903,87270,"3.3 b)",0,"Threshold exceeded due to storm activity on the network"]
[null,"9/04/2017","F-8433-b","CLC007","Rural Long","Weather",2268,86.174162257495595,195443,"3.3 b)",0,"Threshold exceeded due to storm activity on the network"]
[null,"9/04/2017","F-8434-b","MRO008","Rural Long","Weather",210,385.54285714285697,80964,"3.3 b)",0,"Threshold exceeded due to storm activity on the network"]
[null,"9/04/2017","F-8435-b","BAN011","Rural Long","Weather",168,900,151200,"3.3 b)",0,"Threshold exceeded due to storm activity on the network"]
[null,"9/04/2017","F-8436-b","KYM004","Rural Long","Weather",1518,0,0,"3.3 b)",7.3639631510800004E-3,"Threshold exceeded due to storm activity on the network"]
[null,"9/04/2017","F-8437-b","CLC005","Rural Short","Weather",2183,380.31103985341298,830219,"3.3 b)",0,"Threshold exceeded due to storm activity on the network"]
[null,"9/04/2017","F-8438-b","WPD021","Rural Short","Weather",3388,279.21133412042502,945968,"3.3 b)",0,"Threshold exceeded due to storm activity on the network"]
[null,"9/04/2017","F-8439-b","EHK021","Urban","Weather",299,251.638795986622,75240,"3.3 b)",0,"Threshold exceeded due to storm activity on the network"]
[null,"9/04/2017","F-8440-b","WPD024","Rural Short","Other",2855,0,0,"3.3 b)",1.04206207843E-2,"Threshold exceeded due to storm activity on the network"]
[null,"9/04/2017","F-8441-b","SHP021","Rural Long","Other",229,0,0,"3.3 b)",1.11090089697E-3,"Threshold exceeded due to storm activity on the network"]
[null,"9/04/2017","F-8442-b","WPD024","Rural Short","Weather",2855,155.490017513135,443924,"3.3 b)",0,"Threshold exceeded due to storm activity on the network"]
[null,"9/04/2017","F-8443-b","CLC007","Rural Long","Weather",300,1181,354300,"3.3 b)",0,"Threshold exceeded due to storm activity on the network"]
[null,"9/04/2017","F-8446-b","SHP014","Rural Long","Weather",1032,221,228072,"3.3 b)",0,"Threshold exceeded due to storm activity on the network"]
[null,"9/04/2017","F-8448-b","BET001","Rural Long","Weather",1758,117,205686,"3.3 b)",0,"Threshold exceeded due to storm activity on the network"]
[null,"9/04/2017","J-117265-b","WPD014","Rural Short","Weather",2367,324.78580481622299,768768,"3.3 b)",0,"Threshold exceeded due to storm activity on the network"]
[null,"19/12/2017","1061653-1","MNA034","Rural Long","Animals",78,158,12324,"3.3 b)",0,"Threshold exceeded due to storm activity on the network"]
[null,"19/12/2017","1061656-1","GSB014","Rural Short","Equipment failure",10,339,3390,"3.3 b)",0,"Threshold exceeded due to storm activity on the network"]
[null,"19/12/2017","1061661-1","ART031","Rural Short","Other",36,0,0,"3.3 b)",1.3139837066E-4,"Threshold exceeded due to storm activity on the network"]
[null,"19/12/2017","1061662-1","MRO007","Rural Long","Other",46,0,0,"3.3 b)",2.2315039851999999E-4,"Threshold exceeded due to storm activity on the network"]
[null,"19/12/2017","1061664-1","SHN012","Urban","Third party impacts",1,27,27,"3.3 b)",0,"Threshold exceeded due to storm activity on the network"]
[null,"19/12/2017","1061667-1","CME014","Rural Short","Animals",2,123,246,"3.3 b)",0,"Threshold exceeded due to storm activity on the network"]
[null,"19/12/2017","1061668-1","MRO007","Rural Long","Animals",1,135,135,"3.3 b)",0,"Threshold exceeded due to storm activity on the network"]
[null,"19/12/2017","1061671-1","GCY023","Urban","Other",1,78,78,"3.3 b)",0,"Threshold exceeded due to storm activity on the network"]
[null,"19/12/2017","1061672-1","MNA014","Rural Long","Animals",1,66,66,"3.3 b)",0,"Threshold exceeded due to storm activity on the network"]
[null,"19/12/2017","1061676-1","TRG001","Rural Short","Animals",1,71,71,"3.3 b)",0,"Threshold exceeded due to storm activity on the network"]
[null,"19/12/2017","1061678-1","RVL008","Rural Short","Animals",1,79,79,"3.3 b)",0,"Threshold exceeded due to storm activity on the network"]
[null,"19/12/2017","1061679-1","MNA014","Rural Long","Animals",1,93,93,"3.3 b)",0,"Threshold exceeded due to storm activity on the network"]
[null,"19/12/2017","1061683-1","HTN006","Rural Long","Animals",1,42,42,"3.3 b)",0,"Threshold exceeded due to storm activity on the network"]
[null,"19/12/2017","1061684-1","DDL024","Rural Short","Animals",1,125,125,"3.3 b)",0,"Threshold exceeded due to storm activity on the network"]
[null,"19/12/2017","1061685-1","KRT013","Rural Long","Equipment failure",2,199,398,"3.3 b)",0,"Threshold exceeded due to storm activity on the network"]
[null,"19/12/2017","1061703-1","OYN001","Rural Long","Weather",1,14,14,"3.3 b)",0,"Threshold exceeded due to storm activity on the network"]
[null,"19/12/2017","1061716-1","MRO008","Rural Long","Other",3,93,279,"3.3 b)",0,"Threshold exceeded due to storm activity on the network"]
[null,"19/12/2017","1061720-1","BAN015","Rural Short","Equipment failure",1,124,124,"3.3 b)",0,"Threshold exceeded due to storm activity on the network"]
[null,"19/12/2017","1061731-1","HTN002","Rural Long","Equipment failure",1,231,231,"3.3 b)",0,"Threshold exceeded due to storm activity on the network"]
[null,"19/12/2017","1061766-1","WPD011","Rural Short","Weather",3,20,60,"3.3 b)",0,"Threshold exceeded due to storm activity on the network"]
[null,"19/12/2017","1061771-1","PLD006","Rural Short","Equipment failure",18,27,486,"3.3 b)",0,"Threshold exceeded due to storm activity on the network"]
[null,"19/12/2017","1061821-1","MRO005","Rural Long","Other",1087,0,0,"3.3 b)",5.2731409388799997E-3,"Threshold exceeded due to storm activity on the network"]
[null,"19/12/2017","1061825-1","CLC007","Rural Long","Other",35,81,2835,"3.3 b)",0,"Threshold exceeded due to storm activity on the network"]
[null,"19/12/2017","1061848-1","BAS034","Urban","Weather",55,102,5610,"3.3 b)",0,"Threshold exceeded due to storm activity on the network"]
[null,"19/12/2017","1061854-1","SHN024","Rural Short","Animals",1,212,212,"3.3 b)",0,"Threshold exceeded due to storm activity on the network"]
[null,"19/12/2017","1061871-1","MDA023","Rural Short","Equipment failure",1,2870,2870,"3.3 b)",0,"Threshold exceeded due to storm activity on the network"]
[null,"19/12/2017","1061884-1","CDN001","Rural Long","Weather",2,225,450,"3.3 b)",0,"Threshold exceeded due to storm activity on the network"]
[null,"19/12/2017","1061906-1","RCT022","Rural Short","Weather",849,0,0,"3.3 b)",3.0988115747399999E-3,"Threshold exceeded due to storm activity on the network"]
[null,"19/12/2017","1061943-1","MDA024","Rural Short","Weather",24,275,6600,"3.3 b)",0,"Threshold exceeded due to storm activity on the network"]
[null,"19/12/2017","1061951-1","CLC007","Rural Long","Equipment failure",35,175,6125,"3.3 b)",0,"Threshold exceeded due to storm activity on the network"]
[null,"19/12/2017","1061980-1","GL014","Urban","Equipment failure",1,268,268,"3.3 b)",0,"Threshold exceeded due to storm activity on the network"]
[null,"19/12/2017","1061981-1","RVL001","Rural Short","Weather",868,22,19096,"3.3 b)",0,"Threshold exceeded due to storm activity on the network"]
[null,"19/12/2017","1061992-1","MDA024","Rural Short","Weather",1280,0,0,"3.3 b)",4.6719420679199996E-3,"Threshold exceeded due to storm activity on the network"]
[null,"19/12/2017","1062002-1","RVL004","Urban","Weather",236,22,5192,"3.3 b)",0,"Threshold exceeded due to storm activity on the network"]
[null,"19/12/2017","1062004-1","RVL008","Rural Short","Weather",207,22,4554,"3.3 b)",0,"Threshold exceeded due to storm activity on the network"]
[null,"19/12/2017","1062006-1","EHK024","Rural Long","Other",41,0,0,"3.3 b)",1.9889492042000001E-4,"Threshold exceeded due to storm activity on the network"]
[null,"19/12/2017","1062008-1","WND023","Rural Long","Weather",61,0,0,"3.3 b)",2.9591683281999999E-4,"Threshold exceeded due to storm activity on the network"]
[null,"19/12/2017","1062009-1","BBD013","Rural Short","Weather",141,0,0,"3.3 b)",5.1464361841999995E-4,"Threshold exceeded due to storm activity on the network"]
[null,"19/12/2017","1062021-1","WBE034","Rural Short","Other",2035,0,0,"3.3 b)",7.4276578970400003E-3,"Threshold exceeded due to storm activity on the network"]
[null,"19/12/2017","1062024-1","MBN031","Rural Short","Weather",1,289,289,"3.3 b)",0,"Threshold exceeded due to storm activity on the network"]
[null,"19/12/2017","1062031-1","MBN023","Urban","Weather",1,260,260,"3.3 b)",0,"Threshold exceeded due to storm activity on the network"]
[null,"19/12/2017","1062040-1","MDA031","Urban","Weather",78,262,20436,"3.3 b)",0,"Threshold exceeded due to storm activity on the network"]
[null,"19/12/2017","1062051-1","MBN014","Rural Short","Weather",24,1483,35592,"3.3 b)",0,"Threshold exceeded due to storm activity on the network"]
[null,"19/12/2017","1062052-1","WND023","Rural Long","Weather",62,1155,71610,"3.3 b)",0,"Threshold exceeded due to storm activity on the network"]
[null,"19/12/2017","1062069-1","SA006","Rural Short","Equipment failure",1,1068,1068,"3.3 b)",0,"Threshold exceeded due to storm activity on the network"]
[null,"19/12/2017","1062072-1","MDA031","Urban","Weather",43,253,10879,"3.3 b)",0,"Threshold exceeded due to storm activity on the network"]
[null,"19/12/2017","1062080-1","SHL001","Rural Long","Weather",16,471,7536,"3.3 b)",0,"Threshold exceeded due to storm activity on the network"]
[null,"19/12/2017","1062085-1","WBE011","Urban","Equipment failure",35,112,3920,"3.3 b)",0,"Threshold exceeded due to storm activity on the network"]
[null,"19/12/2017","1062092-1","MBN012","Urban","Weather",14,151,2114,"3.3 b)",0,"Threshold exceeded due to storm activity on the network"]
[null,"19/12/2017","1062104-1","SHL001","Rural Long","Weather",1,477,477,"3.3 b)",0,"Threshold exceeded due to storm activity on the network"]
[null,"19/12/2017","1062105-1","SHP012","Rural Long","Weather",152,152,23104,"3.3 b)",0,"Threshold exceeded due to storm activity on the network"]
[null,"19/12/2017","1062113-1","CDN001","Rural Long","Equipment failure",1,166,166,"3.3 b)",0,"Threshold exceeded due to storm activity on the network"]
[null,"19/12/2017","1062120-1","WMN014","Rural Short","Weather",48,188,9024,"3.3 b)",0,"Threshold exceeded due to storm activity on the network"]
[null,"19/12/2017","1062124-1","OYN005","Rural Long","Weather",25,1400,35000,"3.3 b)",0,"Threshold exceeded due to storm activity on the network"]
[null,"19/12/2017","1062128-1","SHL008","Urban","Weather",8,222,1776,"3.3 b)",0,"Threshold exceeded due to storm activity on the network"]
[null,"19/12/2017","1062133-1","MBN023","Urban","Weather",1,184,184,"3.3 b)",0,"Threshold exceeded due to storm activity on the network"]
[null,"19/12/2017","1062149-1","SHL001","Rural Long","Weather",21,1236,25956,"3.3 b)",0,"Threshold exceeded due to storm activity on the network"]
[null,"19/12/2017","1062156-1","CTN003","Rural Long","Weather",12,1277,15324,"3.3 b)",0,"Threshold exceeded due to storm activity on the network"]
[null,"19/12/2017","1062160-1","ECA010","Rural Short","Weather",134,166,22244,"3.3 b)",0,"Threshold exceeded due to storm activity on the network"]
[null,"19/12/2017","1062161-1","SHL001","Rural Long","Weather",1,446,446,"3.3 b)",0,"Threshold exceeded due to storm activity on the network"]
[null,"19/12/2017","1062162-1","OYN003","Rural Long","Weather",34,1509,51306,"3.3 b)",0,"Threshold exceeded due to storm activity on the network"]
[null,"19/12/2017","1062163-1","CHA006","Rural Long","Other",1854,0,0,"3.3 b)",8.9939312793800002E-3,"Threshold exceeded due to storm activity on the network"]
[null,"19/12/2017","1062165-1","SHP021","Rural Long","Equipment failure",1,1551,1551,"3.3 b)",0,"Threshold exceeded due to storm activity on the network"]
[null,"19/12/2017","1062166-1","SHL001","Rural Long","Weather",32,1358,43456,"3.3 b)",0,"Threshold exceeded due to storm activity on the network"]
[null,"19/12/2017","1062181-1","CHA006","Rural Long","Weather",30,1340,40200,"3.3 b)",0,"Threshold exceeded due to storm activity on the network"]
[null,"19/12/2017","1062192-1","CTN001","Rural Long","Weather",661,0,0,"3.3 b)",3.20657420478E-3,"Threshold exceeded due to storm activity on the network"]
[null,"19/12/2017","1062194-1","EHK024","Rural Long","Weather",252,0,0,"3.3 b)",1.22247609623E-3,"Threshold exceeded due to storm activity on the network"]
[null,"19/12/2017","1062199-1","CTN002","Rural Long","Weather",475,0,0,"3.3 b)",2.3042704194700002E-3,"Threshold exceeded due to storm activity on the network"]
[null,"19/12/2017","1062200-1","KGT003","Rural Long","Weather",1,1347,1347,"3.3 b)",0,"Threshold exceeded due to storm activity on the network"]
[null,"19/12/2017","1062202-1","MBN023","Urban","Weather",1,83,83,"3.3 b)",0,"Threshold exceeded due to storm activity on the network"]
[null,"19/12/2017","1062211-1","KYM004","Rural Long","Weather",167,0,0,"3.3 b)",8.1013296852999999E-4,"Threshold exceeded due to storm activity on the network"]
[null,"19/12/2017","1062218-1","CHA006","Rural Long","Other",18,0,0,"3.3 b)",8.7319721159999998E-5,"Threshold exceeded due to storm activity on the network"]
[null,"19/12/2017","1062219-1","KGT003","Rural Long","Weather",1,1550,1550,"3.3 b)",0,"Threshold exceeded due to storm activity on the network"]
[null,"19/12/2017","1062222-1","SHP021","Rural Long","Weather",55,347,19085,"3.3 b)",0,"Threshold exceeded due to storm activity on the network"]
[null,"19/12/2017","1062228-1","EHK024","Rural Long","Other",26,0,0,"3.3 b)",1.2612848612E-4,"Threshold exceeded due to storm activity on the network"]
[null,"19/12/2017","1062229-1","EHK024","Rural Long","Weather",697,0,0,"3.3 b)",3.3812136471E-3,"Threshold exceeded due to storm activity on the network"]
[null,"19/12/2017","1062230-1","CHA005","Rural Long","Vegetation",1,1373,1373,"3.3 b)",0,"Threshold exceeded due to storm activity on the network"]
[null,"19/12/2017","1062233-1","SHL004","Rural Short","Weather",7,1488,10416,"3.3 b)",0,"Threshold exceeded due to storm activity on the network"]
[null,"19/12/2017","1062239-1","MDA034","Urban","Weather",41,1235,50635,"3.3 b)",0,"Threshold exceeded due to storm activity on the network"]
[null,"19/12/2017","1062242-1","MNA021","Rural Short","Weather",1760,0,0,"3.3 b)",6.4239203433900001E-3,"Threshold exceeded due to storm activity on the network"]
[null,"19/12/2017","1062245-1","KYM004","Rural Long","Weather",66,1222,80652,"3.3 b)",0,"Threshold exceeded due to storm activity on the network"]
[null,"19/12/2017","1062247-1","CTN001","Rural Long","Weather",1638,194,317772,"3.3 b)",0,"Threshold exceeded due to storm activity on the network"]
[null,"19/12/2017","1062248-1","CTN002","Rural Long","Weather",1134,195,221130,"3.3 b)",0,"Threshold exceeded due to storm activity on the network"]
[null,"19/12/2017","1062249-1","CTN003","Rural Long","Weather",1201,196,235396,"3.3 b)",0,"Threshold exceeded due to storm activity on the network"]
[null,"19/12/2017","1062251-1","CTN004","Rural Long","Weather",1227,199,244173,"3.3 b)",0,"Threshold exceeded due to storm activity on the network"]
[null,"19/12/2017","1062252-1","CTN005","Rural Short","Weather",651,264,171864,"3.3 b)",0,"Threshold exceeded due to storm activity on the network"]
[null,"19/12/2017","1062253-1","CTN006","Rural Long","Weather",1967,207,407169,"3.3 b)",0,"Threshold exceeded due to storm activity on the network"]
[null,"19/12/2017","1062259-1","WND024","Rural Long","Weather",1,1116,1116,"3.3 b)",0,"Threshold exceeded due to storm activity on the network"]
[null,"19/12/2017","1062260-1","MNA024","Rural Short","Weather",1955,0,0,"3.3 b)",7.1356615177999997E-3,"Threshold exceeded due to storm activity on the network"]
[null,"19/12/2017","1062263-1","MNA024","Rural Short","Weather",1955,0,0,"3.3 b)",7.1356615177999997E-3,"Threshold exceeded due to storm activity on the network"]
[null,"19/12/2017","1062266-1","SHP011","Rural Short","Other",637,0,0,"3.3 b)",2.3250211697399999E-3,"Threshold exceeded due to storm activity on the network"]
[null,"19/12/2017","1062267-1","CHA006","Rural Long","Equipment failure",30,1049.5,31485,"3.3 b)",0,"Threshold exceeded due to storm activity on the network"]
[null,"19/12/2017","1062275-1","NKA005","Rural Short","Other",655,0,0,"3.3 b)",2.3907203550700001E-3,"Threshold exceeded due to storm activity on the network"]
[null,"19/12/2017","1062277-1","STN021","Rural Short","Weather",1886,0,0,"3.3 b)",6.8838146407000003E-3,"Threshold exceeded due to storm activity on the network"]
[null,"19/12/2017","1062284-1","KYM004","Rural Long","Vegetation",29,672,19488,"3.3 b)",0,"Threshold exceeded due to storm activity on the network"]
[null,"19/12/2017","1062285-1","NKA001","Rural Long","Weather",1104,0,0,"3.3 b)",5.3556095644200002E-3,"Threshold exceeded due to storm activity on the network"]
[null,"19/12/2017","1062289-1","CME022","Urban","Weather",668,101,67468,"3.3 b)",0,"Threshold exceeded due to storm activity on the network"]
[null,"19/12/2017","1062292-1","CHA006","Rural Long","Weather",3,360,1080,"3.3 b)",0,"Threshold exceeded due to storm activity on the network"]
[null,"19/12/2017","1062294-1","CME014","Rural Short","Weather",3517,101,355217,"3.3 b)",0,"Threshold exceeded due to storm activity on the network"]
[null,"19/12/2017","1062295-1","CME015","Rural Short","Weather",1165,101,117665,"3.3 b)",0,"Threshold exceeded due to storm activity on the network"]
[null,"19/12/2017","1062296-1","CME016","Rural Long","Weather",2137,101,215837,"3.3 b)",0,"Threshold exceeded due to storm activity on the network"]
[null,"19/12/2017","1062297-1","CME021","Rural Short","Weather",1769,101,178669,"3.3 b)",0,"Threshold exceeded due to storm activity on the network"]
[null,"19/12/2017","1062316-1","EHK024","Rural Long","Vegetation",1,511,511,"3.3 b)",0,"Threshold exceeded due to storm activity on the network"]
[null,"19/12/2017","1062324-1","EHK022","Rural Short","Weather",109,526,57334,"3.3 b)",0,"Threshold exceeded due to storm activity on the network"]
[null,"19/12/2017","1062326-1","BET004","Rural Short","Weather",905,0,0,"3.3 b)",3.3032090402099999E-3,"Threshold exceeded due to storm activity on the network"]
[null,"19/12/2017","1062341-1","BET004","Rural Short","Weather",905,0,0,"3.3 b)",3.3032090402099999E-3,"Threshold exceeded due to storm activity on the network"]
[null,"19/12/2017","1062349-1","EHK024","Rural Long","Weather",2,1396,2792,"3.3 b)",0,"Threshold exceeded due to storm activity on the network"]
[null,"19/12/2017","1062350-1","MNA034","Rural Long","Other",776,0,0,"3.3 b)",3.7644502010799998E-3,"Threshold exceeded due to storm activity on the network"]
[null,"19/12/2017","1062377-1","SHP011","Rural Short","Weather",79,1060,83740,"3.3 b)",0,"Threshold exceeded due to storm activity on the network"]
[null,"19/12/2017","1062381-1","CHA006","Rural Long","Weather",36,1123,40428,"3.3 b)",0,"Threshold exceeded due to storm activity on the network"]
[null,"19/12/2017","1062384-1","NKA006","Rural Long","Weather",26,327,8502,"3.3 b)",0,"Threshold exceeded due to storm activity on the network"]
[null,"19/12/2017","1062394-1","STN024","Rural Long","Weather",58,1595,92510,"3.3 b)",0,"Threshold exceeded due to storm activity on the network"]
[null,"19/12/2017","1062397-1","MBN031","Rural Short","Weather",27,961,25947,"3.3 b)",0,"Threshold exceeded due to storm activity on the network"]
[null,"19/12/2017","1062403-1","WBE034","Rural Short","Equipment failure",1,339,339,"3.3 b)",0,"Threshold exceeded due to storm activity on the network"]
[null,"19/12/2017","1062405-1","WND024","Rural Long","Other",84,0,0,"3.3 b)",4.0749203207999997E-4,"Threshold exceeded due to storm activity on the network"]
[null,"19/12/2017","1062408-1","SHL002","Rural Long","Weather",4,246,984,"3.3 b)",0,"Threshold exceeded due to storm activity on the network"]
[null,"19/12/2017","1062410-1","WND013","Rural Long","Other",16,0,0,"3.3 b)",7.7617529919999997E-5,"Threshold exceeded due to storm activity on the network"]
[null,"19/12/2017","1062425-1","MNA024","Rural Short","Weather",123,705,86715,"3.3 b)",0,"Threshold exceeded due to storm activity on the network"]
[null,"19/12/2017","1062427-1","WND013","Rural Long","Other",43,0,0,"3.3 b)",2.0859711165999999E-4,"Threshold exceeded due to storm activity on the network"]
[null,"19/12/2017","1062429-1","KYM006","Rural Short","Weather",51,940,47940,"3.3 b)",0,"Threshold exceeded due to storm activity on the network"]
[null,"19/12/2017","1062443-1","BET006","Rural Short","Weather",1,1454,1454,"3.3 b)",0,"Threshold exceeded due to storm activity on the network"]
[null,"19/12/2017","1062446-1","KYM004","Rural Long","Weather",17,1233,20961,"3.3 b)",0,"Threshold exceeded due to storm activity on the network"]
[null,"19/12/2017","1062450-1","NKA001","Rural Long","Weather",12,1729,20748,"3.3 b)",0,"Threshold exceeded due to storm activity on the network"]
[null,"19/12/2017","1062452-1","BGO011","Urban","Weather",1,1360,1360,"3.3 b)",0,"Threshold exceeded due to storm activity on the network"]
[null,"19/12/2017","1062454-1","CHA006","Rural Long","Weather",2,1251,2502,"3.3 b)",0,"Threshold exceeded due to storm activity on the network"]
[null,"19/12/2017","1062456-1","MNA034","Rural Long","Other",1,359,359,"3.3 b)",0,"Threshold exceeded due to storm activity on the network"]
[null,"19/12/2017","1062463-1","GSB012","Rural Short","Other",26,0,0,"3.3 b)",9.4898823250000002E-5,"Threshold exceeded due to storm activity on the network"]
[null,"19/12/2017","1062464-1","MNA014","Rural Long","Vegetation",1,1453,1453,"3.3 b)",0,"Threshold exceeded due to storm activity on the network"]
[null,"19/12/2017","1062466-1","GSB012","Rural Short","Other",14,0,0,"3.3 b)",5.1099366369999998E-5,"Threshold exceeded due to storm activity on the network"]
[null,"19/12/2017","1062471-1","STN011","Rural Long","Weather",59,1526,90034,"3.3 b)",0,"Threshold exceeded due to storm activity on the network"]
[null,"19/12/2017","1062481-1","SHP011","Rural Short","Vegetation",1,1275,1275,"3.3 b)",0,"Threshold exceeded due to storm activity on the network"]
[null,"19/12/2017","1062484-1","SSE013","Urban","Equipment failure",11,429,4719,"3.3 b)",0,"Threshold exceeded due to storm activity on the network"]
[null,"19/12/2017","1062488-1","WBE032","Urban","Third party impacts",1,460,460,"3.3 b)",0,"Threshold exceeded due to storm activity on the network"]
[null,"19/12/2017","1062489-1","EHK024","Rural Long","Weather",1,343,343,"3.3 b)",0,"Threshold exceeded due to storm activity on the network"]
[null,"19/12/2017","1062502-1","NKA006","Rural Long","Weather",27,205,5535,"3.3 b)",0,"Threshold exceeded due to storm activity on the network"]
[null,"19/12/2017","1062514-1","BET004","Rural Short","Vegetation",1,316,316,"3.3 b)",0,"Threshold exceeded due to storm activity on the network"]
[null,"19/12/2017","1062526-1","BET005","Rural Long","Weather",53,1122,59466,"3.3 b)",0,"Threshold exceeded due to storm activity on the network"]
[null,"19/12/2017","1062534-1","MNA014","Rural Long","Weather",7,1149,8043,"3.3 b)",0,"Threshold exceeded due to storm activity on the network"]
[null,"19/12/2017","1062545-1","WND024","Rural Long","Weather",1,1021,1021,"3.3 b)",0,"Threshold exceeded due to storm activity on the network"]
[null,"19/12/2017","1062553-1","MNA022","Urban","Weather",13,338,4394,"3.3 b)",0,"Threshold exceeded due to storm activity on the network"]
[null,"19/12/2017","1062561-1","KYM006","Rural Short","Weather",1,2047,2047,"3.3 b)",0,"Threshold exceeded due to storm activity on the network"]
[null,"19/12/2017","1062569-1","CHA006","Rural Long","Other",2,736,1472,"3.3 b)",0,"Threshold exceeded due to storm activity on the network"]
[null,"19/12/2017","1062573-1","KYM004","Rural Long","Weather",1,1479,1479,"3.3 b)",0,"Threshold exceeded due to storm activity on the network"]
[null,"19/12/2017","1062580-1","SHP012","Rural Long","Weather",3,164,492,"3.3 b)",0,"Threshold exceeded due to storm activity on the network"]
[null,"19/12/2017","1062583-1","SHP014","Rural Long","Weather",72,1245,89640,"3.3 b)",0,"Threshold exceeded due to storm activity on the network"]
[null,"19/12/2017","1062587-1","NKA001","Rural Long","Weather",287,802,230174,"3.3 b)",0,"Threshold exceeded due to storm activity on the network"]
[null,"19/12/2017","1062599-1","STN011","Rural Long","Weather",2,1287,2574,"3.3 b)",0,"Threshold exceeded due to storm activity on the network"]
[null,"19/12/2017","1062622-1","SA006","Rural Short","Equipment failure",1,535,535,"3.3 b)",0,"Threshold exceeded due to storm activity on the network"]
[null,"19/12/2017","1062626-1","CME016","Rural Long","Weather",22,938,20636,"3.3 b)",0,"Threshold exceeded due to storm activity on the network"]
[null,"19/12/2017","1062632-1","EHK022","Rural Short","Weather",1,883,883,"3.3 b)",0,"Threshold exceeded due to storm activity on the network"]
[null,"19/12/2017","1062638-1","CME015","Rural Short","Weather",13,884,11492,"3.3 b)",0,"Threshold exceeded due to storm activity on the network"]
[null,"19/12/2017","1062644-1","MNA014","Rural Long","Weather",21,1217,25557,"3.3 b)",0,"Threshold exceeded due to storm activity on the network"]
[null,"19/12/2017","1062654-1","ECA010","Rural Short","Weather",2,45,90,"3.3 b)",0,"Threshold exceeded due to storm activity on the network"]
[null,"19/12/2017","1062660-1","MBN013","Rural Short","Weather",1,1393,1393,"3.3 b)",0,"Threshold exceeded due to storm activity on the network"]
[null,"19/12/2017","1062670-1","MDA023","Rural Short","Weather",69,751,51819,"3.3 b)",0,"Threshold exceeded due to storm activity on the network"]
[null,"19/12/2017","1062678-1","SHL001","Rural Long","Weather",2,255,510,"3.3 b)",0,"Threshold exceeded due to storm activity on the network"]
[null,"19/12/2017","1062679-1","KYM001","Rural Long","Weather",2,1352,2704,"3.3 b)",0,"Threshold exceeded due to storm activity on the network"]
[null,"19/12/2017","1062684-1","EHK022","Rural Short","Weather",156,148,23088,"3.3 b)",0,"Threshold exceeded due to storm activity on the network"]
[null,"19/12/2017","1062725-1","MDA031","Urban","Weather",29,927,26883,"3.3 b)",0,"Threshold exceeded due to storm activity on the network"]
[null,"19/12/2017","1062735-1","SHP021","Rural Long","Weather",2,1508,3016,"3.3 b)",0,"Threshold exceeded due to storm activity on the network"]
[null,"19/12/2017","1062746-1","KGT004","Rural Long","Weather",1,94,94,"3.3 b)",0,"Threshold exceeded due to storm activity on the network"]
[null,"19/12/2017","1062769-1","NKA002","Rural Long","Weather",15,1394,20910,"3.3 b)",0,"Threshold exceeded due to storm activity on the network"]
[null,"19/12/2017","1062770-1","CHA005","Rural Long","Weather",1,1131,1131,"3.3 b)",0,"Threshold exceeded due to storm activity on the network"]
[null,"19/12/2017","1062775-1","EHK024","Rural Long","Equipment failure",1,978,978,"3.3 b)",0,"Threshold exceeded due to storm activity on the network"]
[null,"19/12/2017","1062783-1","MNA034","Rural Long","Weather",32,880,28160,"3.3 b)",0,"Threshold exceeded due to storm activity on the network"]
[null,"19/12/2017","1062785-1","NKA002","Rural Long","Weather",1653,0,0,"3.3 b)",8.0188610597700001E-3,"Threshold exceeded due to storm activity on the network"]
[null,"19/12/2017","1062795-1","MNA021","Rural Short","Weather",2,1525,3050,"3.3 b)",0,"Threshold exceeded due to storm activity on the network"]
[null,"19/12/2017","1062804-1","PLD001","Rural Long","Equipment failure",1,297,297,"3.3 b)",0,"Threshold exceeded due to storm activity on the network"]
[null,"19/12/2017","1062815-1","EHK024","Rural Long","Weather",1,124,124,"3.3 b)",0,"Threshold exceeded due to storm activity on the network"]
[null,"19/12/2017","1062816-1","CHA006","Rural Long","Weather",1,30,30,"3.3 b)",0,"Threshold exceeded due to storm activity on the network"]
[null,"19/12/2017","1062818-1","KYM003","Rural Long","Other",25,283,7075,"3.3 b)",0,"Threshold exceeded due to storm activity on the network"]
[null,"19/12/2017","1062819-1","MRO008","Rural Long","Weather",1,591,591,"3.3 b)",0,"Threshold exceeded due to storm activity on the network"]
[null,"19/12/2017","1062821-1","MDA031","Urban","Vegetation",1,1138,1138,"3.3 b)",0,"Threshold exceeded due to storm activity on the network"]
[null,"19/12/2017","1062822-1","CTN002","Rural Long","Other",475,0,0,"3.3 b)",2.3042704194700002E-3,"Threshold exceeded due to storm activity on the network"]
[null,"19/12/2017","1062824-1","CTN002","Rural Long","Other",475,0,0,"3.3 b)",2.3042704194700002E-3,"Threshold exceeded due to storm activity on the network"]
[null,"19/12/2017","1062828-1","SHP012","Rural Long","Weather",2236,0,0,"3.3 b)",1.08470498062E-2,"Threshold exceeded due to storm activity on the network"]
[null,"19/12/2017","1062835-1","SHP021","Rural Long","Weather",132,0,0,"3.3 b)",6.4034462182999997E-4,"Threshold exceeded due to storm activity on the network"]
[null,"19/12/2017","1062840-1","SHP012","Rural Long","Weather",8,686,5488,"3.3 b)",0,"Threshold exceeded due to storm activity on the network"]
[null,"19/12/2017","1062854-1","BET006","Rural Short","Weather",24,1244,29856,"3.3 b)",0,"Threshold exceeded due to storm activity on the network"]
[null,"19/12/2017","1062982-1","MDA024","Rural Short","Equipment failure",11,1529,16819,"3.3 b)",0,"Threshold exceeded due to storm activity on the network"]
[null,"19/12/2017","1063251-1","MBN031","Rural Short","Weather",1,1098,1098,"3.3 b)",0,"Threshold exceeded due to storm activity on the network"]
[null,"19/12/2017","1063261-1","MBN014","Rural Short","Weather",3,1653,4959,"3.3 b)",0,"Threshold exceeded due to storm activity on the network"]
[null,"19/12/2017","F-100-c","KYM004","Rural Long","Other",1517,0,0,"3.3 b)",7.3591120554600004E-3,"Threshold exceeded due to storm activity on the network"]
[null,"19/12/2017","F-101-c","BGO023","Rural Long","Other",43,0,0,"3.3 b)",2.0859711165999999E-4,"Threshold exceeded due to storm activity on the network"]
[null,"19/12/2017","F-102-c","CMN003","Rural Long","Weather",1138,1102.4261862917399,1254561,"3.3 b)",0,"Threshold exceeded due to storm activity on the network"]
[null,"19/12/2017","F-103-c","CMN003","Rural Long","Weather",1759,0,0,"3.3 b)",8.5330771954800003E-3,"Threshold exceeded due to storm activity on the network"]
[null,"19/12/2017","F-104-c","BET005","Rural Long","Weather",44,0,0,"3.3 b)",2.1344820728E-4,"Threshold exceeded due to storm activity on the network"]
[null,"19/12/2017","F-105-c","BGO023","Rural Long","Weather",32,1,32,"3.3 b)",0,"Threshold exceeded due to storm activity on the network"]
[null,"19/12/2017","F-10543-b","GSB014","Rural Short","Other",1214,0,0,"3.3 b)",4.4310450550400001E-3,"Threshold exceeded due to storm activity on the network"]
[null,"19/12/2017","F-10544-b","MNA034","Rural Long","Other",1629,0,0,"3.3 b)",7.9024347648900001E-3,"Threshold exceeded due to storm activity on the network"]
[null,"19/12/2017","F-10546-b","MNA034","Rural Long","Animals",1628,47.382063882063903,77138,"3.3 b)",0,"Threshold exceeded due to storm activity on the network"]
[null,"19/12/2017","F-10547-b","MRO005","Rural Long","Vegetation",1087,109.334866605336,118847,"3.3 b)",0,"Threshold exceeded due to storm activity on the network"]
[null,"19/12/2017","F-10548-b","MBN031","Rural Short","Weather",103,1514,155942,"3.3 b)",0,"Threshold exceeded due to storm activity on the network"]
[null,"19/12/2017","F-10549-b","MBN013","Rural Short","Weather",382,889.08900523560203,339632,"3.3 b)",0,"Threshold exceeded due to storm activity on the network"]
[null,"19/12/2017","F-10550-b","MBN031","Rural Short","Weather",1303,0,0,"3.3 b)",4.7558910269500003E-3,"Threshold exceeded due to storm activity on the network"]
[null,"19/12/2017","F-10552-b","MBN014","Rural Short","Weather",298,227.12751677852401,67684,"3.3 b)",0,"Threshold exceeded due to storm activity on the network"]
[null,"19/12/2017","F-10553-b","MDA024","Rural Short","Weather",1280,0,0,"3.3 b)",4.6719420679199996E-3,"Threshold exceeded due to storm activity on the network"]
[null,"19/12/2017","F-10554-b","MDA023","Rural Short","Weather",1835,0,0,"3.3 b)",6.6976669489300002E-3,"Threshold exceeded due to storm activity on the network"]
[null,"19/12/2017","F-10556-b","RCT021","Rural Short","Weather",890,543.15168539325805,483405,"3.3 b)",0,"Threshold exceeded due to storm activity on the network"]
[null,"19/12/2017","F-10557-b","RCT015","Rural Short","Weather",21,362,7602,"3.3 b)",0,"Threshold exceeded due to storm activity on the network"]
[null,"19/12/2017","F-10558-b","RCT011","Rural Short","Weather",1039,1005,1044195,"3.3 b)",0,"Threshold exceeded due to storm activity on the network"]
[null,"19/12/2017","F-10563-b","RVL006","Urban","Weather",555,222,123210,"3.3 b)",0,"Threshold exceeded due to storm activity on the network"]
[null,"19/12/2017","F-10564-b","WPD012","Urban","Equipment failure",2939,61,179279,"3.3 b)",0,"Threshold exceeded due to storm activity on the network"]
[null,"19/12/2017","F-10564-b","WPD031","Urban","Equipment failure",3562,124.128298708591,442145,"3.3 b)",0,"Threshold exceeded due to storm activity on the network"]
[null,"19/12/2017","F-10565-b","WMN021","Rural Short","Weather",78,849.79487179487205,66284,"3.3 b)",0,"Threshold exceeded due to storm activity on the network"]
[null,"19/12/2017","F-10569-b","MBN012","Urban","Weather",2263,0,0,"3.3 b)",7.2087741261399997E-3,"Threshold exceeded due to storm activity on the network"]
[null,"19/12/2017","F-10570-b","BMH006","Rural Long","Vegetation",1335,53,70755,"3.3 b)",0,"Threshold exceeded due to storm activity on the network"]
[null,"19/12/2017","F-10571-b","MDA024","Rural Short","Weather",1280,0,0,"3.3 b)",4.6719420679199996E-3,"Threshold exceeded due to storm activity on the network"]
[null,"19/12/2017","F-10572-b","BBD013","Rural Short","Weather",141,0,0,"3.3 b)",5.1464361841999995E-4,"Threshold exceeded due to storm activity on the network"]
[null,"19/12/2017","F-10573-b","MDA024","Rural Short","Weather",1280,0,0,"3.3 b)",4.6719420679199996E-3,"Threshold exceeded due to storm activity on the network"]
[null,"19/12/2017","F-10576-b","RCT013","Rural Short","Weather",277,0,0,"3.3 b)",1.0110374631400001E-3,"Threshold exceeded due to storm activity on the network"]
[null,"19/12/2017","F-10577-b","SHL002","Rural Long","Equipment failure",94,1193.08510638298,112150,"3.3 b)",0,"Threshold exceeded due to storm activity on the network"]
[null,"19/12/2017","F-10578-b","WND023","Rural Long","Weather",30,1672,50160,"3.3 b)",0,"Threshold exceeded due to storm activity on the network"]
[null,"19/12/2017","F-10579-b","SHL002","Rural Long","Weather",351,323,113373,"3.3 b)",0,"Threshold exceeded due to storm activity on the network"]
[null,"19/12/2017","F-10580-b","EHK024","Rural Long","Weather",1337,0,0,"3.3 b)",6.4859148438699997E-3,"Threshold exceeded due to storm activity on the network"]
[null,"19/12/2017","F-10582-b","WND013","Rural Long","Weather",2655,793.13596986817299,2105776,"3.3 b)",0,"Threshold exceeded due to storm activity on the network"]
[null,"19/12/2017","F-10582-b","WND023","Rural Long","Weather",1441,4,5764,"3.3 b)",0,"Threshold exceeded due to storm activity on the network"]
[null,"19/12/2017","F-10583-b","EHK023","Rural Long","Weather",232,148,34336,"3.3 b)",0,"Threshold exceeded due to storm activity on the network"]
[null,"19/12/2017","F-10584-b","SHL002","Rural Long","Equipment failure",212,149.985849056604,31797,"3.3 b)",0,"Threshold exceeded due to storm activity on the network"]
[null,"19/12/2017","F-10585-b","SHL004","Rural Short","Weather",355,70,24850,"3.3 b)",0,"Threshold exceeded due to storm activity on the network"]
[null,"19/12/2017","F-10586-b","SHL004","Rural Short","Weather",567,174.06701940035299,98696,"3.3 b)",0,"Threshold exceeded due to storm activity on the network"]
[null,"19/12/2017","F-10587-b","EHK024","Rural Long","Weather",2,1504,3008,"3.3 b)",0,"Threshold exceeded due to storm activity on the network"]
[null,"19/12/2017","F-10588-b","SHL005","Rural Short","Weather",171,271.14619883040899,46366,"3.3 b)",0,"Threshold exceeded due to storm activity on the network"]
[null,"19/12/2017","F-10589-b","BBD014","Rural Long","Weather",103,0,0,"3.3 b)",4.9966284884999995E-4,"Threshold exceeded due to storm activity on the network"]
[null,"19/12/2017","F-10590-b","SHP012","Rural Long","Weather",2236,0,0,"3.3 b)",1.08470498062E-2,"Threshold exceeded due to storm activity on the network"]
[null,"19/12/2017","F-10591-b","SHP021","Rural Long","Weather",227,248,56296,"3.3 b)",0,"Threshold exceeded due to storm activity on the network"]
[null,"19/12/2017","F-10594-b","KGT003","Rural Long","Weather",429,1194.4708624708601,512428,"3.3 b)",0,"Threshold exceeded due to storm activity on the network"]
[null,"19/12/2017","F-10595-b.1","CHA006","Rural Long","Weather",171,365,62415,"3.3 b)",0,"Threshold exceeded due to storm activity on the network"]
[null,"19/12/2017","F-10596-b","SHP021","Rural Long","Weather",709,0,0,"3.3 b)",3.43942679454E-3,"Threshold exceeded due to storm activity on the network"]
[null,"19/12/2017","F-10598-b","MNA034","Rural Long","Other",776,0,0,"3.3 b)",3.7644502010799998E-3,"Threshold exceeded due to storm activity on the network"]
[null,"19/12/2017","F-10599-b","CHA005","Rural Long","Other",103,0,0,"3.3 b)",4.9966284884999995E-4,"Threshold exceeded due to storm activity on the network"]
[null,"19/12/2017","F-106-c.1","BET004","Rural Short","Weather",48,1167,56016,"3.3 b)",0,"Threshold exceeded due to storm activity on the network"]
[null,"19/12/2017","F-10600-b","CHA005","Rural Long","Weather",312,0,0,"3.3 b)",1.5135418334200001E-3,"Threshold exceeded due to storm activity on the network"]
[null,"19/12/2017","F-10601-b","CHA006","Rural Long","Weather",1044,0,0,"3.3 b)",5.0645438272200003E-3,"Threshold exceeded due to storm activity on the network"]
[null,"19/12/2017","F-10603-b","NKA002","Rural Long","Weather",235,546.98297872340402,128541,"3.3 b)",0,"Threshold exceeded due to storm activity on the network"]
[null,"19/12/2017","F-10604-b","CTN002","Rural Long","Weather",475,0,0,"3.3 b)",2.3042704194700002E-3,"Threshold exceeded due to storm activity on the network"]
[null,"19/12/2017","F-10606-b","KYM003","Rural Long","Weather",407,538.429975429975,219141,"3.3 b)",0,"Threshold exceeded due to storm activity on the network"]
[null,"19/12/2017","F-10607-b","KYM003","Rural Long","Other",752,370.191489361702,278384,"3.3 b)",0,"Threshold exceeded due to storm activity on the network"]
[null,"19/12/2017","F-10609-b","EHK024","Rural Long","Weather",679,1298.69366715758,881813,"3.3 b)",0,"Threshold exceeded due to storm activity on the network"]
[null,"19/12/2017","F-10610-b","MNA014","Rural Long","Weather",1641,0,0,"3.3 b)",7.9606479123299993E-3,"Threshold exceeded due to storm activity on the network"]
[null,"19/12/2017","F-10612-b","SHP014","Rural Long","Weather",139,0,0,"3.3 b)",6.7430229117E-4,"Threshold exceeded due to storm activity on the network"]
[null,"19/12/2017","F-10613-b","SHN021","Rural Short","Weather",2218,0,0,"3.3 b)",8.0955996145600003E-3,"Threshold exceeded due to storm activity on the network"]
[null,"19/12/2017","F-10614-b","MNA021","Rural Short","Weather",1760,237.03409090909099,417180,"3.3 b)",0,"Threshold exceeded due to storm activity on the network"]
[null,"19/12/2017","F-10617-b.1","SHN011","Rural Long","Weather",1118,1156.6189624329199,1293100,"3.3 b)",0,"Threshold exceeded due to storm activity on the network"]
[null,"19/12/2017","F-10618-b","SHN014","Urban","Weather",353,0,0,"3.3 b)",1.1244795698300001E-3,"Threshold exceeded due to storm activity on the network"]
[null,"19/12/2017","F-10621-b","NKA005","Rural Short","Weather",653,450.30321592649301,294048,"3.3 b)",0,"Threshold exceeded due to storm activity on the network"]
[null,"19/12/2017","F-10622-b","SHN024","Rural Short","Weather",1084,808.11808118081206,876000,"3.3 b)",0,"Threshold exceeded due to storm activity on the network"]
[null,"19/12/2017","F-10625-b","NKA002","Rural Long","Weather",1418,155,219790,"3.3 b)",0,"Threshold exceeded due to storm activity on the network"]
[null,"19/12/2017","F-10628-b","MRO007","Rural Long","Weather",40,998.4,39936,"3.3 b)",0,"Threshold exceeded due to storm activity on the network"]
[null,"19/12/2017","F-10629-b","STN011","Rural Long","Weather",55,1092,60060,"3.3 b)",0,"Threshold exceeded due to storm activity on the network"]
[null,"19/12/2017","F-10632-b","CMN001","Rural Long","Weather",4639,493.33929726234101,2288601,"3.3 b)",0,"Threshold exceeded due to storm activity on the network"]
[null,"19/12/2017","F-10633-b","WND023","Rural Long","Weather",1331,205.59278737791101,273644,"3.3 b)",0,"Threshold exceeded due to storm activity on the network"]
[null,"19/12/2017","F-10634-b","WND013","Rural Long","Weather",20,1580,31600,"3.3 b)",0,"Threshold exceeded due to storm activity on the network"]
[null,"19/12/2017","F-10635-b","WND012","Rural Long","Weather",3722,328.06663084363203,1221064,"3.3 b)",0,"Threshold exceeded due to storm activity on the network"]
[null,"19/12/2017","F-10636-b","WND013","Rural Long","Weather",16,1225,19600,"3.3 b)",0,"Threshold exceeded due to storm activity on the network"]
[null,"19/12/2017","F-10639-b","MNA034","Rural Long","Weather",149,352,52448,"3.3 b)",0,"Threshold exceeded due to storm activity on the network"]
[null,"19/12/2017","F-10641-b","SHP012","Rural Long","Weather",2236,0,0,"3.3 b)",1.08470498062E-2,"Threshold exceeded due to storm activity on the network"]
[null,"19/12/2017","F-10647-b","SHN014","Urban","Weather",69,110,7590,"3.3 b)",0,"Threshold exceeded due to storm activity on the network"]
[null,"19/12/2017","F-10648-b","BBD014","Rural Long","Weather",95,0,0,"3.3 b)",4.6085408389E-4,"Threshold exceeded due to storm activity on the network"]
[null,"19/12/2017","F-10649-b","NKA006","Rural Long","Weather",40,1365.55,54622,"3.3 b)",0,"Threshold exceeded due to storm activity on the network"]
[null,"19/12/2017","F-10651-b.1","MBN014","Rural Short","Weather",302,703.90066225165594,212578,"3.3 b)",0,"Threshold exceeded due to storm activity on the network"]
[null,"19/12/2017","F-10652-b","SHP021","Rural Long","Weather",132,0,0,"3.3 b)",6.4034462182999997E-4,"Threshold exceeded due to storm activity on the network"]
[null,"19/12/2017","F-10654-b","NKA002","Rural Long","Weather",1653,0,0,"3.3 b)",8.0188610597700001E-3,"Threshold exceeded due to storm activity on the network"]
[null,"19/12/2017","F-10658-b","SHN011","Rural Long","Other",370,0,0,"3.3 b)",1.7949053793799999E-3,"Threshold exceeded due to storm activity on the network"]
[null,"19/12/2017","F-10675-b","MNA034","Rural Long","Weather",29,969,28101,"3.3 b)",0,"Threshold exceeded due to storm activity on the network"]
[null,"19/12/2017","F-10692-b","STN011","Rural Long","Weather",45,1339,60255,"3.3 b)",0,"Threshold exceeded due to storm activity on the network"]
[null,"19/12/2017","F-63-d","NKA006","Rural Long","Weather",1299,70,90930,"3.3 b)",0,"Threshold exceeded due to storm activity on the network"]
[null,"19/12/2017","F-64-d","EHK022","Rural Short","Weather",234,257.20512820512801,60186,"3.3 b)",0,"Threshold exceeded due to storm activity on the network"]
[null,"19/12/2017","F-85-c","BET001","Rural Long","Weather",5074,289.459203783997,1468716,"3.3 b)",0,"Threshold exceeded due to storm activity on the network"]
[null,"19/12/2017","F-87-c","BET005","Rural Long","Weather",1357,0,0,"3.3 b)",6.5829367562699999E-3,"Threshold exceeded due to storm activity on the network"]
[null,"19/12/2017","F-88-c","BGO013","Rural Short","Weather",3902,157.338288057406,613934,"3.3 b)",0,"Threshold exceeded due to storm activity on the network"]
[null,"19/12/2017","F-89-c","BET004","Rural Short","Weather",905,0,0,"3.3 b)",3.3032090402099999E-3,"Threshold exceeded due to storm activity on the network"]
[null,"19/12/2017","F-91-c","NKA001","Rural Long","Weather",675,912.19851851851899,615734,"3.3 b)",0,"Threshold exceeded due to storm activity on the network"]
[null,"19/12/2017","F-93-c","STN021","Rural Short","Weather",1886,153.15005302226899,288841,"3.3 b)",0,"Threshold exceeded due to storm activity on the network"]
[null,"19/12/2017","F-94-c","BET005","Rural Long","Weather",3398,0,0,"3.3 b)",1.648402291658E-2,"Threshold exceeded due to storm activity on the network"]
[null,"19/12/2017","F-97-c","BET004","Rural Short","Weather",905,0,0,"3.3 b)",3.3032090402099999E-3,"Threshold exceeded due to storm activity on the network"]
[null,"19/12/2017","F-98-c","EHK023","Rural Long","Weather",2908,353.59766162310899,1028262,"3.3 b)",0,"Threshold exceeded due to storm activity on the network"]
[null,"19/12/2017","J-142394-b","MRO008","Rural Long","Weather",1,26,26,"3.3 b)",0,"Threshold exceeded due to storm activity on the network"]
[null,"To enter further events - please insert new lines above this line. "]

{"sheet":"6.9 STPIS - GSL","index":13,"n_rows":116,"n_cols":5,"rows_kept":116,"cut":false,"hidden":false,"merged":[[77,1,77,2],[65,1,65,2],[66,1,66,2],[67,1,67,2],[73,1,73,2],[72,1,72,2],[71,1,71,2],[17,1,17,2],[15,1,15,2],[5,1,5,2],[7,1,7,2],[14,1,14,2],[16,1,16,2],[21,1,21,2],[23,1,23,2],[24,1,24,2],[25,1,25,2],[22,1,22,2],[29,1,29,2],[33,1,33,2],[34,1,34,2],[30,1,30,2],[31,1,31,2],[32,1,32,2],[35,1,35,2],[36,1,36,2],[37,1,37,2],[38,1,38,2],[39,1,39,2],[43,1,43,2],[45,1,45,2],[46,1,46,2],[47,1,47,2],[44,1,44,2],[99,1,99,2],[100,1,100,2],[48,1,48,2],[49,1,49,2],[85,1,85,2],[84,1,84,2],[91,1,91,2],[53,1,53,2],[54,1,54,2],[61,1,61,2],[64,1,64,4],[70,1,70,4],[76,1,76,4],[82,1,82,4],[79,1,79,2],[78,1,78,2],[5,4,5,5],[115,1,115,2],[83,1,83,2],[112,1,112,2],[114,1,114,2],[107,1,107,2],[108,1,108,2],[109,1,109,2],[110,1,110,2],[102,1,102,2],[103,1,103,2],[104,1,104,2],[105,1,105,2],[106,1,106,2],[97,1,97,2],[98,1,98,2],[60,1,60,2],[55,1,55,2],[56,1,56,2],[57,1,57,2],[58,1,58,2],[59,1,59,2]]}
[null,{"$f":"(LOOKUP(dms_Model,dms_Model_List,dms_Worksheet_List))","v":"ANNUAL REPORTING STATEMENT"}]
[null,{"$f":"dms_TradingName","v":"Powercor Australia"}]
[null,{"$f":"CONCATENATE(\"Annual Reporting RIN Response \",CRY)","v":"Annual Reporting RIN Response 2017"}]
[null,"6.9 STPIS - GUARANTEED SERVICE LEVEL"]
[]
[null,"Did the AER's GSL Scheme apply at any time during the regulatory year?",null,"No","**IMPORTANT \nPlease ensure this flag is set. Conditional formatting on this worksheet is dependant on this response."]
[]
[null,"Instructions:\nTable 6.9.1 collects information relating to jurisdiction GSL scheme parameters. These parameters can be found in the jurisdictonal scheme relevant to NSP. Please identify each parameter in the relevant sub-tables and provide the volume and value of GSL payments. \n\nFor GSL parameters that do not fit within the provided sub-tables provided, please enter a heading and identify the relevant parameter(s). "]
[]
[null,"6.9.1 - GUARANTEED SERVICE LEVELS - JURISDICTIONAL GSL SCHEME"]
[null,null,null,{"$f":"CRY","v":2017},{"$f":"CRY","v":2017}]
[null,null,null,"Volume","Value of GSL payments"]
[null,null,null,"0's","$0's"]
[null,"Appointments"]
[null,"Customer arranged appointments Central",null,3542]
[null,"Appointments not met within 15 minutes of agreed time",null,7]
[null,"Appointments - GSL payments",null,7,210]
[]
[null,"To enter further GSL parameters relating to appointments - please copy a row from above and \"insert copied cells\" above this row."]
[]
[null,"Connections"]
[null,"Connections made",null,89298]
[null,"Connections not made on agreed date",null,2826,630420]
[null,"Connections - GSL payments - 1-4 day delay",null,1776,262920]
[null,"Connections - GSL payments - 5+ day delay",null,1050,367500]
[]
[null,"To enter further GSL parameters relating to connections -  please copy a row from above and \"insert copied cells\" above this row."]
[]
[null,"Reliability of supply"]
[null,"Supply restoration payments - 20 hours",null,10285,1234200]
[null,"Supply restoration payments - 30 hours",null,2605,468900]
[null,"Supply restoration payments - 60 hours",null,3,1080]
[null,"Supply restoration payments - CBD/Urban feeders 12 hours duration",null,673,53840]
[null,"Supply restoration payments - Rural (long/short) feeders 18 hours duration",null,1247,99760]
[null,"Low reliability payments - 10 events (prior 2016) / 8 events (2017)",null,1526,183120]
[null,"Low reliability payments - 15 events (prior 2016) / 12 events (2017)",null,187,33660]
[null,"Low reliability payments - 30 events (prior 2016) / 24 events (2017)",null,0,0]
[null,"Low reliability payments over 24 momentary events",null,0,0]
[null,"Low reliability payments over 36 momentary events",null,0,0]
[]
[null,"To enter further GSL parameters relating to reliability of supply -  please copy a row from above and \"insert copied cells\" above this row."]
[]
[null,"Street lights"]
[null,"Streetlights",null,170676,0]
[null,"Street lights \"out\" during period",null,6894,0]
[null,"Street lights not repaired by \"fix by\" date",null,34,0]
[null,"Street lights not repaired in 2 business days",null,39,0]
[null,"Number of business days to repair",null,1.85,0]
[null,"GSL payments",null,40,1000]
[]
[null,"To enter further GSL parameters relating to street lights -  please copy a row from above and \"insert copied cells\" above this row."]
[]
[null,"Planned interruptions"]
[null,"Notice of planned interruptions - 4 business days notice not given (customers affected)",null,328,0]
[]
[]
[]
[]
[]
[]
[]
[]
[null,"To enter further GSL parameters relating to planned interruptions -  please copy a row from above and \"insert copied cells\" above this row."]
[]
[null,"<NSP defined parameter category>"]
[]
[]
[]
[null,"To enter further GSL parameters - please identify the parameter and if insufficient rows  please copy a row from above and \"insert copied cells\" above this row."]
[]
[null,"<NSP defined parameter category>"]
[]
[]
[]
[null,"To enter further GSL parameters - please identify the parameter and if insufficient rows  please copy a row from above and \"insert copied cells\" above this row."]
[]
[null,"<NSP defined parameter category>"]
[]
[]
[]
[null,"To enter further GSL parameters - please identify the parameter and if insufficient rows  please copy a row from above and \"insert copied cells\" above this row."]
[]
[null,"<NSP defined parameter category>"]
[]
[]
[]
[null,"To enter further GSL parameters - please identify the parameter and if insufficient rows  please copy a row from above and \"insert copied cells\" above this row."]
[]
[]
[null,"6.9.2 - GUARANTEED SERVICE LEVELS - AER GSL SCHEME"]
[]
[null,"Complete Table 6.9.2 if the AER's GSL scheme applied at any time during the regulatory year. \n\nDo not complete Table 6.9.2 if the AER's GSL scheme did not apply during the regulatory year."]
[]
[null,null,null,{"$f":"CRY","v":2017},{"$f":"CRY","v":2017}]
[null,null,null,"Volume","Value \nof GSL payments"]
[null,null,null,"0's","$0's"]
[null,"New connections "]
[null,"Number of connections made"]
[null,"Number of connections not made on or before the day agreed"]
[null,"Connections - GSL payments – 1-6 day delay"]
[null,"Connections - GSL payments – 7+ day delay"]
[null,"Reliability of supply"]
[null,"Frequency of interruptions – CBD feeders – 9 interruptions"]
[null,"Frequency of interruptions – Urban feeders – 9 interruptions"]
[null,"Frequency of interruptions – Rural (short and long) feeders – 15 interruptions"]
[null,"Interruptions – CBD feeders – 12 hours duration"]
[null,"Interruptions – Urban feeders – 12 hours duration"]
[null,"Interruptions – Rural (short and long) feeders – 18 hours duration"]
[null,"Total duration of interruptions Level 1 – 20 hours"]
[null,"Total duration of interruptions Level 2 – 30 hours"]
[null,"Total duration of interruptions Level 3 – 60 hours"]
[null,"Street lights"]
[null,"Streetlight repair 5 days – GSL payments"]
[null,"Planned interruptions"]
[null,"Notice of planned interruptions – 4 business days notice not given"]
[null,"Total ",null,null,{"$f":"SUM(E115,E113,E103:E111,E100:E101)","v":0}]

{"sheet":"7.8 Avoided TUOS Payments","index":14,"n_rows":11,"n_cols":3,"rows_kept":11,"cut":false,"hidden":false,"merged":[]}
[null,{"$f":"(LOOKUP(dms_Model,dms_Model_List,dms_Worksheet_List))","v":"ANNUAL REPORTING STATEMENT"}]
[null,{"$f":"dms_TradingName","v":"Powercor Australia"}]
[null,{"$f":"CONCATENATE(\"Annual Reporting RIN Response \",CRY)","v":"Annual Reporting RIN Response 2017"}]
[null,"7.8 - AVOIDED TUOS PAYMENTS"]
[]
[null,"7.8.1 - AVOIDED TUOS PAYMENTS"]
[null,null,"Avoided TUOS Payment "]
[null,null,"$0's, nominal"]
[null,"Embedded generators",2210381.2400000002]
[null,"Market network service providers",0]
[null,"Other",0]

{"sheet":"7.10 Juris Scheme","index":15,"n_rows":17,"n_cols":6,"rows_kept":17,"cut":false,"hidden":false,"merged":[[8,4,9,4],[8,3,9,3],[8,2,9,2],[8,1,9,1],[5,1,5,2]]}
[null,{"$f":"(LOOKUP(dms_Model,dms_Model_List,dms_Worksheet_List))","v":"ANNUAL REPORTING STATEMENT"}]
[null,{"$f":"dms_TradingName","v":"Powercor Australia"}]
[null,{"$f":"CONCATENATE(\"Annual Reporting RIN Response \",CRY)","v":"Annual Reporting RIN Response 2017"}]
[null,"7.10 - JURISDICTIONAL SCHEMES"]
[]
[null,"Instructions\nBusiness must list each relevant jurisdictional scheme individually and report information for each scheme separately from other schemes."]
[]
[null,"7.10.1 - JURISDICTIONAL SCHEME PAYMENTS"]
[null,"Jurisdictional Scheme Name","Description","Date DNSP Became Subject to Scheme","Description of Cost Recovery Method","Total Scheme Payments  "]
[null,null,null,null,null,"$0's, nominal"]
[null,"Premium feed-in tariff","PFiT","2009-11-01",null,26906090.34]
[null,"Transitional feed-in tariff","TFiT","2012-01-01",null,1503477.51]
[]
[]
[]
[]
[null,null,null,null,"Total",{"$f":"SUM(F11:F16)","v":28409567.850000001}]

{"sheet":"7.11 DMIS-DMIA","index":16,"n_rows":46,"n_cols":5,"rows_kept":46,"cut":false,"hidden":false,"merged":[[6,2,6,4],[8,2,8,4]]}
[null,{"$f":"(LOOKUP(dms_Model,dms_Model_List,dms_Worksheet_List))","v":"ANNUAL REPORTING STATEMENT"}]
[null,{"$f":"dms_TradingName","v":"Powercor Australia"}]
[null,{"$f":"CONCATENATE(\"Annual Reporting RIN Response \",CRY)","v":"Annual Reporting RIN Response 2017"}]
[null,"7.11 - DEMAND MANAGEMENT INCENTIVE SCHEME"]
[]
[null,"7.11.1 - DMIA - PROJECTS SUBMITTED FOR APPROVAL"]
[null,null,{"$f":"CONCATENATE(\"Total amount of the DMIA spent in \", CRY)","v":"Total amount of the DMIA spent in 2017"}]
[null,null,"Operating expenditure","Capital expenditure","Total"]
[null,"Name of project","$0's, nominal"]
[null,"AC Analystics Tool",56903,null,{"$f":"SUM(C10:D10)","v":56903}]
[null,null,null,null,0]
[null,null,null,null,0]
[null,null,null,null,0]
[null,null,null,null,0]
[null,null,null,null,0]
[null,null,null,null,0]
[null,null,null,null,0]
[null,null,null,null,0]
[null,null,null,null,0]
[null,null,null,null,0]
[null,null,null,null,0]
[null,null,null,null,0]
[null,null,null,null,0]
[null,null,null,null,0]
[null,null,null,null,0]
[null,null,null,null,0]
[null,null,null,null,0]
[null,null,null,null,0]
[null,null,null,null,0]
[null,null,null,null,0]
[null,null,null,null,0]
[null,null,null,null,0]
[null,null,null,null,0]
[null,null,null,null,0]
[null,null,null,null,0]
[null,null,null,null,0]
[null,null,null,null,0]
[null,null,null,null,0]
[null,null,null,null,0]
[null,null,null,null,0]
[null,null,null,null,0]
[null,null,null,null,0]
[null,null,null,null,0]
[null,null,null,null,0]
[null,"To enter additional projects - please copy an existing row and insert above this row. "]
[null,"Total",{"$f":"SUM(C10:C45)","v":56903},{"$f":"SUM(D10:D45)","v":0},{"$f":"SUM(E10:E45)","v":56903}]

{"sheet":"7.12 Safety and Bushfire","index":17,"n_rows":343,"n_cols":7,"rows_kept":343,"cut":false,"hidden":false,"merged":[[139,1,139,2],[140,1,140,2],[134,1,134,2],[87,1,89,1],[87,2,89,2],[148,1,148,2],[149,1,149,2],[121,1,122,2],[138,1,138,2],[43,2,43,5],[141,1,141,2],[142,1,142,2],[300,6,300,7],[44,2,44,5],[45,2,45,5],[46,2,46,5],[48,6,48,8],[47,6,47,8],[47,2,47,5],[88,3,88,4],[89,3,89,4],[167,2,167,3],[168,2,168,3],[217,3,217,4],[218,3,218,4],[143,1,143,2],[144,1,144,2],[145,1,145,2],[295,6,295,7],[296,6,296,7],[297,6,297,7],[298,6,298,7],[48,2,48,5],[216,1,218,1],[285,6,285,7],[286,6,286,7],[287,6,287,7],[123,1,123,2],[124,1,124,2],[125,1,125,2],[126,1,126,2],[127,1,127,2],[128,1,128,2],[129,1,129,2],[130,1,130,2],[131,1,131,2],[166,1,168,1],[132,1,132,2],[133,1,133,2],[284,6,284,7],[216,2,218,2],[135,1,135,2],[136,1,136,2],[137,1,137,2],[250,1,251,1],[146,1,146,2],[147,1,147,2],[38,2,38,5],[29,6,29,8],[30,6,30,8],[31,6,31,8],[23,6,23,8],[24,6,24,8],[25,6,25,8],[26,6,26,8],[27,6,27,8],[37,6,37,8],[38,6,38,8],[24,2,24,5],[23,2,23,5],[31,2,31,5],[32,2,32,5],[33,2,33,5],[34,2,34,5],[34,6,34,8],[35,2,35,5],[35,6,35,8],[36,2,36,5],[36,6,36,8],[37,2,37,5],[40,2,40,5],[41,2,41,5],[39,2,39,5],[42,2,42,5],[40,6,40,8],[41,6,41,8],[39,6,39,8],[5,1,5,2],[25,2,25,5],[26,2,26,5],[27,2,27,5],[28,2,28,5],[29,2,29,5],[30,2,30,5],[11,1,11,2],[10,1,10,2],[17,2,17,5],[18,2,18,5],[19,2,19,5],[20,2,20,5],[21,2,21,5],[22,2,22,5],[14,1,14,4],[13,1,13,4],[18,6,18,8],[19,6,19,8],[28,6,28,8],[303,6,303,7],[304,6,304,7],[305,6,305,7],[299,6,299,7],[20,6,20,8],[21,6,21,8],[22,6,22,8],[42,6,42,8],[301,6,301,7],[17,6,17,8],[32,6,32,8],[33,6,33,8],[341,4,341,6],[327,4,327,6],[316,4,316,6],[317,4,317,6],[318,4,318,6],[319,4,319,6],[320,4,320,6],[321,4,321,6],[328,4,328,6],[329,4,329,6],[324,4,324,6],[325,4,325,6],[326,4,326,6],[335,4,335,6],[336,4,336,6],[337,4,337,6],[322,4,322,6],[323,4,323,6],[339,4,339,6],[334,4,334,6],[338,4,338,6],[340,4,340,6],[332,4,332,6],[333,4,333,6],[330,4,330,6],[331,4,331,6],[250,2,251,2],[315,4,315,6],[314,4,314,6],[288,6,288,7],[289,6,289,7],[290,6,290,7],[309,6,309,7],[310,6,310,7],[283,6,283,7],[307,6,307,7],[308,6,308,7],[291,6,291,7],[292,6,292,7],[293,6,293,7],[294,6,294,7],[302,6,302,7],[306,6,306,7]]}
[null,{"$f":"(LOOKUP(dms_Model,dms_Model_List,dms_Worksheet_List))","v":"ANNUAL REPORTING STATEMENT"}]
[null,{"$f":"dms_TradingName","v":"Powercor Australia"}]
[null,{"$f":"CONCATENATE(\"Annual Reporting RIN Response \",CRY)","v":"Annual Reporting RIN Response 2017"}]
[null,"7.12 SAFETY AND BUSHFIRE RELATED EXPENDITURE"]
[]
[null,"These templates collect information from Victorian businesses only.\n\nBushfire and safety related expenditure information is used by the AER to monitor the expenditures throughout the regulatory control period."]
[]
[null,"CPI applied to convert expected expenditure in real $ to nominal based on lagged September CPI index"]
[]
[null,"Instructions"]
[null,"For \"Exclusive of Margins & Overheads\" reported expenditure is to EXCLUDE any overheads, profit margins or management fees paid directly or indirectly to related party contractors (not including actual incurred expense of the related party contractor) for the reporting period."]
[null,"For \"Value of Margins & Overheads\" reported expenditure is to COMPRISE ONLY the sum of overheads, profit margins or management fees paid directly or indirectly to related party contractors (not including actual incurred expenses of the related party contractor) for the reporting period. "]
[]
[null,{"$f":"CONCATENATE(dms_TradingName, \" is to specify each activity in this table in accordance with the definition in Appendix F of the RIN.\")","v":"Powercor Australia is to specify each activity in this table in accordance with the definition in Appendix F of the RIN."}]
[null,"All activities must be reported but the Reason for Difference is only required if there is a 10 per cent difference between the expected value and the actual value.\n\nUse median unit costs. Where unit costs are not recorded at the asset category level - provide the best estimates of the unit cost using the cost allocation method identified in this table. (As a transitional measure, the unit cost may be based on a statistically significant annual sample of actual work orders at a 5% or better confidence interval.)\n\nProvide basis of allocation where applicable."]
[]
[null,"7.12.1 - SAFETY AND BUSHFIRE RELATED ASSET GROUP DEFINITIONS AND ALLOCATION BASIS"]
[null,"Activity","Definitions",null,null,null,"Basis for allocation of cost to activity"]
[null,"Planned non-preferred services replacements"]
[null,"Planned replacement of non-preferred services due to height "]
[null,"Removal of public lighting switchwire "]
[null,"Replacement of existing SWER lines with 22kV overhead bare conductor "]
[null,"Installation of GFN and associated equipment at zone substations ","Installation of ground fault neutralizer equipment at a specific zone substation",null,null,null,"Actual costs are captured from the SAP accounting system at a project level based on the labour material and contract work undertaken."]
[null,"Replacement of crossarms/insulator sets – pole top fire mitigation"]
[null,"Replacement of crossarms – based on age and condition "]
[null,"Replacement of poles – based on age and condition ",null,null,null,null,"Actual costs are captured at a composite project level including these and other physicals.  Costs are allocated to function codes for settlement based on allocation rules. Allocation to voltages for poles is based on actual physicals completed."]
[null,"Stake poles – based on age and condition "]
[null,"Replacement of undersized poles "]
[null,"Stake undersized poles"]
[null,"Replacement of overhead conductor – mainly steel "]
[null,"Service line clearance – overhead services requiring relocation "]
[null,"Service line clearance – overhead services requiring undergrounding "]
[null,"Replacement of 22kV distribution feeders with ABC/underground cabling"]
[null,"Replacement of SWER with covered carbon core conductor or equivalent","Route length of SWER line replaced by covered carbon core conductor or equivalent - completed projects (not WIP)",null,null,null,"Actual costs are captured from the SAP accounting system at a project level based on the labour material and contract work undertaken."]
[null,"Replacement of SWER with ABC","Route length of SWER line replaced by ABC",null,null,null,"Actual costs are captured from the SAP accounting system at a project level based on the labour material and contract work undertaken."]
[null,"Replacement of SWER with underground","Route length of SWER line replaced by underground cable - completed projects (not WIP)",null,null,null,"Actual costs are captured from the SAP accounting system at a project level based on the labour material and contract work undertaken."]
[null,"Replacement of surge diverters (neptune configuration)","Number of individual surge diverters replaced using neptune configuration",null,null,null,"Actual costs are captured from the SAP accounting system at a project level based on the labour material and contract work undertaken."]
[null,"Replacement of surge diverters (single phase or three phase)","Number of individual surge arresters replaced on a like-for-like basis",null,null,null,"Actual costs are captured from the SAP accounting system at a project level based on the labour material and contract work undertaken."]
[null,"Armour Rods and Vibration Dampers","Number of spans treated with armour rods and/or vibration dampers",null,null,null,"Actual costs are captured from the SAP accounting system at a project level based on the labour material and contract work undertaken."]
[null,"SWER ACRS","Number of new generation SWER ACRs installed",null,null,null,"Actual costs are captured from the SAP accounting system at a project level based on the labour material and contract work undertaken."]
[null,"Multicircuit Clearances (LBRA Survey)","Number of line kilometers surveyed",null,null,null,"Actual costs are captured from the SAP accounting system at a project level based on the labour material and contract work undertaken."]
[null,"Multicircuit Clearances (HBRA)","Number of poles treated with HV spreaders",null,null,null,"Actual costs are captured from the SAP accounting system at a project level based on the labour material and contract work undertaken."]
[]
[]
[]
[]
[]
[]
[]
[null,"To enter further activities - please copy row from above and \"insert copied cells\" into a row above this row. "]
[]
[]
[null,"7.12.2 - BUSHFIRE RELATED"]
[]
[null,"7.12.2.1 - NUMBER OF ACTIVITIES"]
[null,"Activity","Units","Number of Activities"]
[null,"Planned non-preferred services replacements","number of services",0]
[null,"Planned replacement of non-preferred services due to height ","number of services",0]
[null,"Removal of public lighting switchwire ","number of spans removed",0]
[null,"Replacement of existing SWER lines with 22kV overhead bare conductor ","kms of SWER",0]
[null,"Installation of GFN and associated equipment at zone substations ","number of zone substations",0]
[null,"Replacement of crossarms/insulator sets – pole top fire mitigation","number of crossarms/sets",0]
[null,"Replacement of crossarms – based on age and condition ","number of crossarms",0]
[null,"Replacement of poles – based on age and condition ","number of poles",0]
[null,"Stake poles – based on age and condition ","number of poles",0]
[null,"Replacement of undersized poles ","number of poles",0]
[null,"Stake undersized poles","number of poles",0]
[null,"Replacement of overhead conductor – mainly steel ","kms ",0]
[null,"Service line clearance – overhead services requiring relocation ","number of services",0]
[null,"Service line clearance – overhead services requiring undergrounding ","number of services",0]
[null,"Replacement of 22kV distribution feeders with ABC/underground cabling","number of feeders",4]
[null,"Replacement of SWER with covered carbon core conductor or equivalent","kms ",0]
[null,"Replacement of SWER with ABC","kms ",0]
[null,"Replacement of SWER with underground","kms ",82]
[null,"Replacement of surge diverters (neptune configuration)","number of units",0]
[null,"Replacement of surge diverters (single phase or three phase)","number of units",0]
[null,{"$f":"IF(ISBLANK(B39),\"\",B39)","v":"Armour Rods and Vibration Dampers"},"number of units",18121]
[null,{"$f":"IF(ISBLANK(B40),\"\",B40)","v":"SWER ACRS"},"number of units",145]
[null,{"$f":"IF(ISBLANK(B41),\"\",B41)","v":"Multicircuit Clearances (LBRA Survey)"},"kms",0]
[null,{"$f":"IF(ISBLANK(B42),\"\",B42)","v":"Multicircuit Clearances (HBRA)"},"number of units",0]
[null,{"$f":"IF(ISBLANK(B43),\"\",B43)","v":""}]
[null,{"$f":"IF(ISBLANK(B48),\"\",B48)","v":""}]
[null,{"$f":"IF(ISBLANK(B49),\"\",B49)","v":""}]
[null,"To enter further activities - please copy row from above and \"insert copied cells\" into a row above this row. "]
[]
[]
[null,"7.12.2.2 - EXPENDITURE "]
[null,"Activity","Units","Exclusive of \nMargins & Overheads","Value of \nMargins & Overheads"]
[null,null,null,"Actual Expenditure"]
[null,null,null,"$0's, Nominal"]
[null,"Planned non-preferred services replacements","number of services",0,0]
[null,"Planned replacement of non-preferred services due to height ","number of services",0,0]
[null,"Removal of public lighting switchwire ","number of spans removed",0,0]
[null,"Replacement of existing SWER lines with 22kV overhead bare conductor ","kms of SWER",0,0]
[null,"Installation of GFN and associated equipment at zone substations ","number of zone substations",0,0]
[null,"Replacement of crossarms/insulator sets – pole top fire mitigation","number of crossarms/sets",0,0]
[null,"Replacement of crossarms – based on age and condition ","number of crossarms",0,0]
[null,"Replacement of poles – based on age and condition ","number of poles",0,0]
[null,"Stake poles – based on age and condition ","number of poles",0,0]
[null,"Replacement of undersized poles ","number of poles",0,0]
[null,"Stake undersized poles","number of poles",0,0]
[null,"Replacement of overhead conductor – mainly steel ","kms ",0,0]
[null,"Service line clearance – overhead services requiring relocation ","number of services",0,0]
[null,"Service line clearance – overhead services requiring undergrounding ","number of services",0,0]
[null,"Replacement of 22kV distribution feeders with ABC/underground cabling","number of feeders",4344460,969062]
[null,"Replacement of SWER with covered carbon core conductor or equivalent","kms ",0,0]
[null,"Replacement of SWER with ABC","kms ",0,0]
[null,"Replacement of SWER with underground","kms ",9256859,1975602]
[null,"Replacement of surge diverters (neptune configuration)","number of units",0,0]
[null,"Replacement of surge diverters (single phase or three phase)","number of units",0,0]
[null,{"$f":"IF(ISBLANK(B39),\"\",B39)","v":"Armour Rods and Vibration Dampers"},"number of units",7995836,2056371]
[null,{"$f":"IF(ISBLANK(B40),\"\",B40)","v":"SWER ACRS"},"number of units",5257583,1044986]
[null,{"$f":"IF(ISBLANK(B41),\"\",B41)","v":"Multicircuit Clearances (LBRA Survey)"},"kms ",430,106]
[null,{"$f":"IF(ISBLANK(B42),\"\",B42)","v":"Multicircuit Clearances (HBRA)"},"number of units",10602,12493]
[null,{"$f":"IF(ISBLANK(B43),\"\",B43)","v":""},{"$f":"IF(ISBLANK(C81),\"\",C81)","v":""}]
[null,{"$f":"IF(ISBLANK(B48),\"\",B48)","v":""},{"$f":"IF(ISBLANK(C82),\"\",C82)","v":""}]
[null,{"$f":"IF(ISBLANK(B49),\"\",B49)","v":""},{"$f":"IF(ISBLANK(C83),\"\",C83)","v":""}]
[null,"To enter further activities - please copy row from above and \"insert copied cells\" into a row above this row. "]
[]
[]
[null,"7.12.2.3 - UNIT COSTS"]
[null,"Activity",null,"Actual"]
[null,null,null,"$0's, Per Unit"]
[null,"Planned non-preferred services replacements",null,0]
[null,"Planned replacement of non-preferred services due to height ",null,0]
[null,"Removal of public lighting switchwire ",null,0]
[null,"Replacement of existing SWER lines with 22kV overhead bare conductor ",null,0]
[null,"Installation of GFN and associated equipment at zone substations ",null,0]
[null,"Replacement of crossarms/insulator sets – pole top fire mitigation",null,0]
[null,"Replacement of crossarms – based on age and condition ",null,0]
[null,"Replacement of poles – based on age and condition ",null,0]
[null,"Stake poles – based on age and condition ",null,0]
[null,"Replacement of undersized poles ",null,0]
[null,"Stake undersized poles",null,0]
[null,"Replacement of overhead conductor – mainly steel ",null,0]
[null,"Service line clearance – overhead services requiring relocation ",null,0]
[null,"Service line clearance – overhead services requiring undergrounding ",null,0]
[null,"Replacement of 22kV distribution feeders with ABC/underground cabling",null,1328380]
[null,"Replacement of SWER with covered carbon core conductor or equivalent",null,0]
[null,"Replacement of SWER with ABC",null,0]
[null,"Replacement of SWER with underground",null,136981]
[null,"Replacement of surge diverters (neptune configuration)",null,0]
[null,"Replacement of surge diverters (single phase or three phase)",null,0]
[null,{"$f":"IF(ISBLANK(B39),\"\",B39)","v":"Armour Rods and Vibration Dampers"},null,555]
[null,{"$f":"IF(ISBLANK(B40),\"\",B40)","v":"SWER ACRS"},null,43466]
[null,{"$f":"IF(ISBLANK(B41),\"\",B41)","v":"Multicircuit Clearances (LBRA Survey)"},null,0]
[null,{"$f":"IF(ISBLANK(B42),\"\",B42)","v":"Multicircuit Clearances (HBRA)"},null,0]
[null,{"$f":"IF(ISBLANK(B43),\"\",B43)","v":""}]
[null,{"$f":"IF(ISBLANK(B48),\"\",B48)","v":""}]
[null,{"$f":"IF(ISBLANK(B49),\"\",B49)","v":""}]
[null,"To enter further activities - please copy row from above and \"insert copied cells\" into a row above this row. "]
[]
[]
[null,"7.12.2.4 - CONTINGENT PROJECT APPLICATIONS - VOLUMES APPROVED"]
[null,"Activity","Units","Volume approved under contingent project applications ","Actual volumes","Difference"]
[null,null,null,null,null,{"$f":"E156-D156","v":0}]
[null,null,null,null,null,0]
[null,null,null,null,null,0]
[null,null,null,null,null,0]
[null,null,null,null,null,0]
[null,null,null,null,null,0]
[null,null,null,null,null,0]
[null,null,null,null,null,0]
[null,"To enter further activities - please copy row from above and \"insert copied cells\" into a row above this row. "]
[]
[null,"7.12.2.5 - CONTINGENT PROJECT APPLICATIONS - EXPENDITURE APPROVED"]
[null,"Activity","Exclusive of \nMargins & Overheads","Value of \nMargins & Overheads"]
[null,null,"Actual Expenditure"]
[null,null,"$0's, Nominal"]
[null,"REFCL",33327453.859999999,5899709.5599999996]
[]
[]
[]
[]
[]
[]
[]
[null,"To enter further activities - please copy row from above and \"insert copied cells\" into a row above this row. "]
[]
[]
[]
[null,"7.12.3 - SAFETY RELATED"]
[]
[null,"7.12.3.1 - NUMBER OF ACTIVITIES"]
[null,"Activity","Units","Number of Activities"]
[null,"Planned non-preferred services replacements","number of services",0]
[null,"Planned replacement of non-preferred services due to height ","number of services",0]
[null,"Removal of public lighting switchwire ","number of spans removed",0]
[null,"Replacement of existing SWER lines with 22kV overhead bare conductor ","kms of SWER",0]
[null,"Installation of GFN and associated equipment at zone substations ","number of zone substations",0]
[null,"Replacement of crossarms/insulator sets – pole top fire mitigation","number of crossarms/sets",0]
[null,"Replacement of crossarms – based on age and condition ","number of crossarms",5688]
[null,"Replacement of poles – based on age and condition ","number of poles",1153]
[null,"Stake poles – based on age and condition ","number of poles",623]
[null,"Replacement of undersized poles ","number of poles",0]
[null,"Stake undersized poles","number of poles",0]
[null,"Replacement of overhead conductor – mainly steel ","kms ",278]
[null,"Service line clearance – overhead services requiring relocation ","number of services",0]
[null,"Service line clearance – overhead services requiring undergrounding ","number of services",0]
[null,"Replacement of 22kV distribution feeders with ABC/underground cabling","number of feeders",0]
[null,"Replacement of SWER with covered carbon core conductor or equivalent","kms ",0]
[null,"Replacement of SWER with ABC","kms ",0]
[null,"Replacement of SWER with underground","kms ",0]
[null,"Replacement of surge diverters (neptune configuration)","number of units",0]
[null,"Replacement of surge diverters (single phase or three phase)","number of units",0]
[null,{"$f":"IF(ISBLANK(B39),\"\",B39)","v":"Armour Rods and Vibration Dampers"},"number of units",0]
[null,{"$f":"IF(ISBLANK(B40),\"\",B40)","v":"SWER ACRS"},"number of units",0]
[null,{"$f":"IF(ISBLANK(B41),\"\",B41)","v":"Multicircuit Clearances (LBRA Survey)"},"kms ",0]
[null,{"$f":"IF(ISBLANK(B42),\"\",B42)","v":"Multicircuit Clearances (HBRA)"},"number of units",0]
[null,{"$f":"IF(ISBLANK(B43),\"\",B43)","v":""},{"$f":"IF(ISBLANK(C81),\"\",C81)","v":""}]
[null,{"$f":"IF(ISBLANK(B48),\"\",B48)","v":""},{"$f":"IF(ISBLANK(C82),\"\",C82)","v":""}]
[null,{"$f":"IF(ISBLANK(B49),\"\",B49)","v":""},{"$f":"IF(ISBLANK(C83),\"\",C83)","v":""}]
[null,"To enter further activities - please copy row from above and \"insert copied cells\" into a row above this row. "]
[]
[]
[null,"7.12.3.2 - EXPENDITURE"]
[null,"Activity","Units","Exclusive of \nMargins & Overheads","Value of \nMargins & Overheads"]
[null,null,null,"Actual Expenditure"]
[null,null,null,"$0's, Nominal"]
[null,"Planned non-preferred services replacements","number of services",0,0]
[null,"Planned replacement of non-preferred services due to height ","number of services",0,0]
[null,"Removal of public lighting switchwire ","number of spans removed",0,0]
[null,"Replacement of existing SWER lines with 22kV overhead bare conductor ","kms of SWER",0,0]
[null,"Installation of GFN and associated equipment at zone substations ","number of zone substations",0,0]
[null,"Replacement of crossarms/insulator sets – pole top fire mitigation","number of crossarms/sets",0,0]
[null,"Replacement of crossarms – based on age and condition ","number of crossarms",14339303,2729164]
[null,"Replacement of poles – based on age and condition ","number of poles",10007348,1904673]
[null,"Stake poles – based on age and condition ","number of poles",847269,161259]
[null,"Replacement of undersized poles ","number of poles",0,0]
[null,"Stake undersized poles","number of poles",0,0]
[null,"Replacement of overhead conductor – mainly steel ","kms ",6501673,1237447]
[null,"Service line clearance – overhead services requiring relocation ","number of services",0,0]
[null,"Service line clearance – overhead services requiring undergrounding ","number of services",0,0]
[null,"Replacement of 22kV distribution feeders with ABC/underground cabling","number of feeders",0,0]
[null,"Replacement of SWER with covered carbon core conductor or equivalent","kms ",0,0]
[null,"Replacement of SWER with ABC","kms ",0,0]
[null,"Replacement of SWER with underground","kms ",0,0]
[null,"Replacement of surge diverters (neptune configuration)","number of units",0,0]
[null,"Replacement of surge diverters (single phase or three phase)","number of units",0,0]
[null,{"$f":"IF(ISBLANK(B39),\"\",B39)","v":"Armour Rods and Vibration Dampers"},"number of units",0,0]
[null,{"$f":"IF(ISBLANK(B40),\"\",B40)","v":"SWER ACRS"},"number of units",0,0]
[null,{"$f":"IF(ISBLANK(B41),\"\",B41)","v":"Multicircuit Clearances (LBRA Survey)"},"kms ",0,0]
[null,{"$f":"IF(ISBLANK(B42),\"\",B42)","v":"Multicircuit Clearances (HBRA)"},"number of units",0,0]
[null,{"$f":"IF(ISBLANK(B43),\"\",B43)","v":""},{"$f":"IF(ISBLANK(C81),\"\",C81)","v":""}]
[null,{"$f":"IF(ISBLANK(B48),\"\",B48)","v":""},{"$f":"IF(ISBLANK(C82),\"\",C82)","v":""}]
[null,{"$f":"IF(ISBLANK(B49),\"\",B49)","v":""},{"$f":"IF(ISBLANK(C83),\"\",C83)","v":""}]
[null,"To enter further activities - please copy row from above and \"insert copied cells\" into a row above this row. "]
[]
[]
[null,"7.12.3.3 - UNIT COSTS"]
[null,"Activity","Units","Actual"]
[null,null,null,"$0's, Per Unit"]
[null,"Planned non-preferred services replacements","number of services",0]
[null,"Planned replacement of non-preferred services due to height ","number of services",0]
[null,"Removal of public lighting switchwire ","number of spans removed",0]
[null,"Replacement of  existing SWER lines with 22kV overhead bare conductor ","kms of SWER",0]
[null,"Installation of GFN and associated equipment at zone substations ","number of zone substations",0]
[null,"Replacement of crossarms/insulator sets – pole top fire mitigation","number of crossarms/sets",0]
[null,"Replacement of crossarms – based on age and condition ","number of crossarms",3000.8]
[null,"Replacement of poles – based on age and condition ","number of poles",10331.299999999999]
[null,"Stake poles – based on age and condition ","number of poles",1618.8]
[null,"Replacement of undersized poles ","number of poles",0]
[null,"Stake undersized poles","number of poles",0]
[null,"Replacement of overhead conductor – mainly steel ","kms ",27794.799999999999]
[null,"Service line clearance – overhead services requiring relocation ","number of services",0]
[null,"Service line clearance – overhead services requiring undergrounding ","number of services"]
[null,"Replacement of 22kV distribution feeders with ABC/underground cabling","number of feeders",0]
[null,"Replacement of SWER with covered carbon core conductor or equivalent","kms ",0]
[null,"Replacement of SWER with ABC","kms ",0]
[null,"Replacement of SWER with underground","kms ",0]
[null,"Replacement of surge diverters (neptune configuration)","number of units",0]
[null,"Replacement of surge diverters (single phase or three phase)","number of units",0]
[null,{"$f":"IF(ISBLANK(B39),\"\",B39)","v":"Armour Rods and Vibration Dampers"},"number of units",0]
[null,{"$f":"IF(ISBLANK(B40),\"\",B40)","v":"SWER ACRS"},"number of units",0]
[null,{"$f":"IF(ISBLANK(B41),\"\",B41)","v":"Multicircuit Clearances (LBRA Survey)"},"kms ",0]
[null,{"$f":"IF(ISBLANK(B42),\"\",B42)","v":"Multicircuit Clearances (HBRA)"},"number of units",0]
[null,{"$f":"IF(ISBLANK(B43),\"\",B43)","v":""},{"$f":"IF(ISBLANK(C81),\"\",C81)","v":""}]
[null,{"$f":"IF(ISBLANK(B48),\"\",B48)","v":""},{"$f":"IF(ISBLANK(C82),\"\",C82)","v":""}]
[null,{"$f":"IF(ISBLANK(B49),\"\",B49)","v":""},{"$f":"IF(ISBLANK(C83),\"\",C83)","v":""}]
[null,"To enter further activities - please copy row from above and \"insert copied cells\" into a row above this row. "]
[]
[]
[null,"7.12.4 - SAFETY IMPROVEMENT OUTCOMES REPORTED TO ESV"]
[null,"Activity","Units","Safety Improvement Programme - outcomes","Safety Improvement Target","Difference","Reasons for Difference"]
[null,"Planned non-preferred services replacements","number of services",0,0,{"$f":"D285-E285","v":0},0]
[null,"Planned replacement of non-preferred services due to height ","number of services",0,0,0,0]
[null,"Removal of public lighting switchwire ","number of spans removed",0,0,0,0]
[null,"Replacement of  existing SWER lines with 22kV overhead bare conductor ","kms of SWER",0,0,0,0]
[null,"Installation of GFN and associated equipment at zone substations ","number of zone substations",0,0,0,"Do not have a specific safety improvement target"]
[null,"Replacement of crossarms/insulator sets – pole top fire mitigation","number of crossarms/sets",0,0,0,0]
[null,"Replacement of crossarms – based on age and condition ","number of crossarms",5688,0,5688,"Do not have a specific safety improvement target"]
[null,"Replacement of poles – based on age and condition ","number of poles",1153,0,1153,"Do not have a specific safety improvement target"]
[null,"Stake poles – based on age and condition ","number of poles",623,0,623,"Do not have a specific safety improvement target"]
[null,"Replacement of undersized poles ","number of poles",0,0,0,0]
[null,"Stake undersized poles","number of poles",0,0,0,0]
[null,"Replacement of overhead conductor – mainly steel ","kms ",278.43740000000003,0,278.43740000000003,"Do not have a specific safety improvement target"]
[null,"Service line clearance – overhead services requiring relocation ","number of services",0,0,0,0]
[null,"Service line clearance – overhead services requiring undergrounding ","number of services",0,0,0,0]
[null,"Replacement of 22kV distribution feeders with ABC/underground cabling","number of feeders",4,0,4,"Do not have a specific safety improvement target"]
[null,"Replacement of SWER with covered carbon core conductor or equivalent","kms ",0,0,0,"Do not have a specific safety improvement target"]
[null,"Replacement of SWER with ABC","kms ",0,0,0,0]
[null,"Replacement of SWER with underground","kms ",82,0,82,"Do not have a specific safety improvement target"]
[null,"Replacement of surge diverters (neptune configuration)","number of units",0,0,0,0]
[null,"Replacement of surge diverters (single phase or three phase)","number of units",0,0,0,"Do not have a specific safety improvement target"]
[null,{"$f":"IF(ISBLANK(B39),\"\",B39)","v":"Armour Rods and Vibration Dampers"},"number of units",18121,0,18121,"Do not have a specific safety improvement target"]
[null,{"$f":"IF(ISBLANK(B40),\"\",B40)","v":"SWER ACRS"},"number of units",145,0,145,"Do not have a specific safety improvement target"]
[null,{"$f":"IF(ISBLANK(B41),\"\",B41)","v":"Multicircuit Clearances (LBRA Survey)"},"kms ",0,0,0,"Do not have a specific safety improvement target"]
[null,{"$f":"IF(ISBLANK(B42),\"\",B42)","v":"Multicircuit Clearances (HBRA)"},"number of units",0,0,0,"Do not have a specific safety improvement target"]
[null,{"$f":"IF(ISBLANK(B43),\"\",B43)","v":""},{"$f":"IF(ISBLANK(C81),\"\",C81)","v":""},null,null,0]
[null,{"$f":"IF(ISBLANK(B48),\"\",B48)","v":""},{"$f":"IF(ISBLANK(C82),\"\",C82)","v":""},null,null,0]
[null,{"$f":"IF(ISBLANK(B49),\"\",B49)","v":""},{"$f":"IF(ISBLANK(C83),\"\",C83)","v":""},null,null,0]
[null,"To enter further activities - please copy row from above and \"insert copied cells\" into a row above this row. "]
[]
[null,"7.12.5 - RECONCILIATION OF VOLUME OF OUTCOMES REPORTED TO ESV AND AER"]
[null,"Activity","Units","Difference","Reasons for Difference"]
[null,"Planned non-preferred services replacements","number of services",{"$f":"D285-D57-D186","v":0}]
[null,"Planned replacement of non-preferred services due to height ","number of services",0]
[null,"Removal of public lighting switchwire ","number of spans removed",0]
[null,"Replacement of  existing SWER lines with 22kV overhead bare conductor ","kms of SWER",0]
[null,"Installation of GFN and associated equipment at zone substations ","number of zone substations",0]
[null,"Replacement of crossarms/insulator sets – pole top fire mitigation","number of crossarms/sets",0]
[null,"Replacement of crossarms – based on age and condition ","number of crossarms",0]
[null,"Replacement of poles – based on age and condition ","number of poles",0]
[null,"Stake poles – based on age and condition ","number of poles",0]
[null,"Replacement of undersized poles ","number of poles",0]
[null,"Stake undersized poles","number of poles",0]
[null,"Replacement of overhead conductor – mainly steel ","kms ",0.4374000000000251]
[null,"Service line clearance – overhead services requiring relocation ","number of services",0]
[null,"Service line clearance – overhead services requiring undergrounding ","number of services",0]
[null,"Replacement of 22kV distribution feeders with ABC/underground cabling","number of feeders",0]
[null,"Replacement of SWER with covered carbon core conductor or equivalent","kms ",0]
[null,"Replacement of SWER with ABC","kms ",0]
[null,"Replacement of SWER with underground","kms ",0]
[null,"Replacement of surge diverters (neptune configuration)","number of units",0]
[null,"Replacement of surge diverters (single phase or three phase)","number of units",0]
[null,{"$f":"IF(ISBLANK(B39),\"\",B39)","v":"Armour Rods and Vibration Dampers"},"number of units",0]
[null,{"$f":"IF(ISBLANK(B40),\"\",B40)","v":"SWER ACRS"},"number of units",0]
[null,{"$f":"IF(ISBLANK(B41),\"\",B41)","v":"Multicircuit Clearances (LBRA Survey)"},"kms ",0]
[null,{"$f":"IF(ISBLANK(B42),\"\",B42)","v":"Multicircuit Clearances (HBRA)"},"number of units",0]
[null,{"$f":"IF(ISBLANK(B43),\"\",B43)","v":""},{"$f":"IF(ISBLANK(C81),\"\",C81)","v":""},0]
[null,{"$f":"IF(ISBLANK(B48),\"\",B48)","v":""},{"$f":"IF(ISBLANK(C82),\"\",C82)","v":""},0]
[null,{"$f":"IF(ISBLANK(B49),\"\",B49)","v":""},{"$f":"IF(ISBLANK(C83),\"\",C83)","v":""},0]
[null,"To enter further activities - please copy row from above and \"insert copied cells\" into a row above this row. "]

{"sheet":"7.13 TARC","index":18,"n_rows":9,"n_cols":3,"rows_kept":9,"cut":false,"hidden":false,"merged":[]}
[null,{"$f":"(LOOKUP(dms_Model,dms_Model_List,dms_Worksheet_List))","v":"ANNUAL REPORTING STATEMENT"}]
[null,{"$f":"dms_TradingName","v":"Powercor Australia"}]
[null,{"$f":"CONCATENATE(\"Annual Reporting RIN Response \",CRY)","v":"Annual Reporting RIN Response 2017"}]
[null,"7.13 - TARC"]
[]
[]
[null,"7.13.1 - TOTAL ANNUAL RETAILER CHARGES"]
[null,null,"$0's"]
[null,"TARC",932398704]

{"sheet":"8.1 Income","index":19,"n_rows":39,"n_cols":12,"rows_kept":39,"cut":false,"hidden":false,"merged":[[6,6,6,10],[7,8,7,10],[6,11,8,11],[9,2,9,11],[6,5,8,5],[7,6,7,7],[6,2,8,2],[6,3,8,3],[6,4,8,4]]}
[null,{"$f":"(LOOKUP(dms_Model,dms_Model_List,dms_Worksheet_List))","v":"ANNUAL REPORTING STATEMENT"}]
[null,{"$f":"dms_TradingName","v":"Powercor Australia"}]
[null,{"$f":"CONCATENATE(\"Annual Reporting RIN Response \",CRY)","v":"Annual Reporting RIN Response 2017"}]
[null,"8.1 - INCOME"]
[]
[null,"8.1.1 - INCOME STATEMENT"]
[null,null,"Audited Statutory Accounts","Adjustments","Distribution business","Standard Control Services","Alternative Control Services",null,null,null,null,"Negotiated Services"]
[null,null,null,null,null,null,"Public Lighting",null,"Other"]
[null,null,null,null,null,null,{"$f":"IF(dms_Jurisdiction=\"Vic\",\"Energy efficient\",\"\")","v":"Energy efficient"},{"$f":"IF(dms_Jurisdiction=\"Vic\",\"Non-energy efficient\",\"\")","v":"Non-energy efficient"},"Connection services","Metering services","Ancillary network services"]
[null,null,"$0's, nominal"]
[null,"8.1.1.1 - REVENUE"]
[null,"Distribution revenue",727680765,5253193,732933958,628568882,5342314,3057567,12588180,73993124,9357037,26854]
[null,"Cross boundary revenue",5479744,-5479744,"-","-","-","-","-","-","-","-"]
[null,"Contributions",101046480,-101046480,"-","-","-","-","-","-","-","-"]
[null,"Interest Income",8907,"-",8907,8907,"-","-","-","-","-","-"]
[null,"Jurisdictional scheme amounts",31097237,-31097237,"-","-","-","-","-","-","-","-"]
[null,"Profit from sale of fixed assets",-3741543,3741543,"-","-","-","-","-","-","-","-"]
[null,"TUOS revenue",162914618,-162914618,"-","-","-","-","-","-","-","-"]
[null,"Pass through revenue (F-factor)","-","-","-","-","-","-","-","-","-","-"]
[null,"Other Revenue",303040780,-297646871,5393909,5147805,"-","-","-",89462,156642,"-"]
[null,"Total revenue",{"$f":"SUM(C12:C20)","v":1327526988},-589190214,738336774,633725594,5342314,3057567,12588180,74082586,9513679,26854]
[]
[null,"8.1.1.2 - EXPENDITURE"]
[null,"TUOS expenditure",160704237,-160704237,"-","-","-","-","-","-","-","-"]
[null,"Avoided TUOS expenditure",2210381,-2210381,"-","-","-","-","-","-","-","-"]
[null,"Cross boundary expenditure",5479744,-5479744,"-","-","-","-","-","-","-","-"]
[null,"Depreciation",216087793,10284163,226371956,185725446,611566,600245,"-",39434699,"-","-"]
[null,"Finance charges",31407631,-31456956,-49325,-49325,"-","-","-","-","-","-"]
[null,"Impairment losses","-",0,"-","-","-","-","-","-","-","-"]
[null,"Jurisdictional scheme amounts",31097237,-31097237,"-","-","-","-","-","-","-","-"]
[null,"Loss from sale of fixed assets",0,3741543,3741543,3741543,"-","-","-","-","-","-"]
[null,"Maintenance expenditure",110087153,{"$f":"E32-C32","v":20503577.295355245},{"$f":"SUM(F32:K32)","v":130590730.29535525},{"$f":"'[1]8.1 Income'!$F$36","v":115703637.29535525},3661058,"-","-",8515323,2710712,"-"]
[null,"Operating expenditure excluding maintenance expenditure",410540427,-286512820,124027607,98376123,396467,388959,15461505,6273282,2445007,686264]
[null,"Other",66808,0,66808,66808,"-","-","-","-","-","-"]
[]
[null,"8.1.1.3 - PROFIT"]
[null,"Profit before tax (PBT)",{"$f":"C21-SUM(C24:C34)","v":359845577},-106258122.29535526,253587454.70464474,230161361.70464474,673223,2068363,-2873325,19859282,4357960,-659410]
[null,"Income tax expenses (/ benefit)",74347486,-21953929.031452879,52393556.968547121,47553505.477926187,139094.21364758917,427343.28004653507,-593656.01209251489,4103114.7382007479,900395.58854591683,-136240.31772734559]
[null,"Profit after tax",{"$f":"C37-C38","v":285498091},-84304193.263902381,201193897.73609763,182607856.22671854,534128.7863524108,1641019.7199534648,-2279668.9879074851,15756167.261799252,3457564.4114540834,-523169.68227265438]

{"sheet":"8.2 Capex","index":20,"n_rows":248,"n_cols":10,"rows_kept":248,"cut":false,"hidden":false,"merged":[[140,2,140,3],[196,2,196,3],[6,1,6,4],[41,1,41,4],[10,1,10,4],[7,1,7,4],[8,1,8,4],[14,1,14,4],[16,2,16,9],[17,2,18,2],[17,3,18,3],[17,4,18,4],[17,5,18,5],[17,6,17,9],[19,2,19,3],[19,5,19,9],[43,2,43,5],[44,2,44,5],[55,2,55,5],[56,2,56,5],[50,2,50,5],[51,2,51,5],[49,2,49,5],[45,2,45,5],[46,2,46,5],[47,2,47,5],[81,1,81,2],[58,2,58,5],[63,3,64,3],[63,5,64,5],[65,5,65,9],[65,2,65,3],[57,2,57,5],[63,4,64,4],[48,2,48,5],[63,2,64,2],[52,2,52,5],[53,2,53,5],[54,2,54,5],[62,2,62,9],[63,6,63,9]]}
[null,{"$f":"(LOOKUP(dms_Model,dms_Model_List,dms_Worksheet_List))","v":"ANNUAL REPORTING STATEMENT"}]
[null,{"$f":"dms_TradingName","v":"Powercor Australia"}]
[null,{"$f":"CONCATENATE(\"Annual Reporting RIN Response \",CRY)","v":"Annual Reporting RIN Response 2017"}]
[null,"8.2 - CAPEX"]
[]
[null,"Instructions"]
[null,"Reported expenditure must EXCLUDE capital contributions (except tables 8.2.1 and 8.2.5 which should include all capital contributions)."]
[null,{"$f":"CONCATENATE(\"Forecast expenditure is to be taken from \",dms_TradingName,\"'s \",dms_DeterminationRef,\".\")","v":"Forecast expenditure is to be taken from Powercor Australia's 2016-20 Distribution Determination."}]
[null,"If allocating based on assumptions then provide method in Basis of Preparation. All adjustments must be explained in Basis of Preparation with supporting documentation attached. "]
[]
[null,"For tables 8.2.1 and 8.2.3:\nReported expenditure must INCLUDE any profit margins or management fees paid directly or indirectly to related party contractors (not including actual incurred expenses of the related party contractor) for the regulatory reporting period.\n\n'Related Party Margin Expenditure' must COMPRISE ONLY profit margins or management fees paid directly or indirectly to related party contractors (not including actual incurred expenses of the related party contractor) for the regulatory reporting period."]
[]
[null,"8.2.1 - CAPEX BY PURPOSE - STANDARD CONTROL SERVICES"]
[]
[null,"Each line item in this table must INCLUDE the capital contributions. Total capital contributions should also be identified in the last item in the table. "]
[]
[null,null,"EXPENDITURE"]
[null,null,"CPI adjusted Forecast","Actual","Difference","Related Party Margin","Voltage level"]
[null,null,null,null,null,null,"Subtransmission","HV","LV","Other "]
[null,"Description","$0's, nominal",null," (%)","$0's, nominal"]
[null,"Replacement Capex",115390605,{"$f":"SUM(G21:J21)","v":84276212.979999989},{"$f":"IF(C21=0,1,(D21-C21)/C21*1)","v":-0.26964406694981807},null,{"$f":"'[1]8.2 Capex'!G24","v":15492709.106404385},{"$f":"'[1]8.2 Capex'!H24","v":47284943.357662357},{"$f":"'[1]8.2 Capex'!I24","v":20908380.53305785},{"$f":"'[1]8.2 Capex'!J24","v":590179.9828753965}]
[null,"Augmentation Capex",54874652,77151918,0.40596641961392305,null,6971803,48245038,21332914,602163]
[null,"Connections Capex",176893245,169437439,-4.2148619072480693E-2,null,31148112,95066442,42036327,1186558]
[null,"VBRC",72474213,16378407,-0.77401055738266522,null,3010884,9189450,4063376,114697]
[null,"IT Capex",40589675,22819871,-0.43779123631810307,null,null,null,null,22819871]
[null,"Other Capex",17857875,54193751,2.0347256322490779,null,null,null,null,54193751]
[null,null,null,0,1]
[null,null,null,0,1]
[null,null,null,0,1]
[null,null,null,0,1]
[null,null,null,0,1]
[null,null,null,0,1]
[null,null,null,0,1]
[null,null,null,0,1]
[null,null,null,0,1]
[null,"Capital contributions included in the above",85489004,91026953,6.4779664528551537E-2,null,15045457,52233174,23096381,651941]
[null,"Total",{"$f":"SUM(C21:C35)","v":478080265},{"$f":"SUM(D21:D35)","v":424257598.98000002},-0.11258081531560392,{"$f":"SUM(F21:F35)","v":0},{"$f":"SUM(G21:G35)","v":56623508.106404386},{"$f":"SUM(H21:H35)","v":199785873.35766235},{"$f":"SUM(I21:I35)","v":88340997.533057854},{"$f":"SUM(J21:J35)","v":79507219.982875392}]
[]
[]
[null,"8.2.2 - CAPEX BY PURPOSE - MATERIAL DIFFERENCE EXPLANATION"]
[]
[null,"Where the difference between forecast and actual expenditure shown in table 8.2.1 is a Material Difference please explain the main factors driving the difference."]
[]
[null,"Description","Reason for material difference"]
[null,"Replacement Capex","The allowance reflects a more conservative maintenance expenditure outcome compared with actual expenditure. In addition a review of maintenance replacement policies since 2014 have resulted in spend reductions. CTN transformer replacement works have not occurred in Repex as the transformer was replaced as part a network planning augmentation project. Together these factors have contributed to a lower spend."]
[null,"Augmentation Capex","Expenditure is less than forecast at the 2016-20 Distribution Determination largely as a result of a large customer (Australian Vinyls) shutting down in Laverton which deferred the works on the LVN21 feeder. In addition the RBE ZSS land purchase was deferred due to external delays related to land availability and landowner negotiations."]
[null,"VBRC","Reduced expenditure on Armour Rod and Vibration Dampers Program and SWER ACR due to efficiency. This is partially offset by higher spend on REFCL Tranche 1"]
[null,"IT Capex","Underspend mainly due to the deferral of CRM billing and technological innovation and synergies resulting in changes of solutions resulting in a lower cost."]
[null,"Other Capex","Expenditure is less than forecast at the 2016-20 Distribution Determination which was based on the 2011-2014 average as a result of:"]
[null,null,"1. Higher property expenditure on depot construction and refurbishment; and"]
[null,null,"2. Higher fleet expenditure driven by in-sourcing resources and a catch up on existing fleet replacement"]
[]
[]
[]
[]
[]
[]
[]
[]
[]
[]
[null,"8.2.3 - CAPEX OTHER"]
[null,null,"EXPENDITURE"]
[null,null,"CPI adjusted Forecast","Actual","Difference","Related Party Margin","Voltage level"]
[null,null,null,null,null,null,"Subtransmission","HV","LV","Other "]
[null,null,"$0's, nominal",null," (%)","$0's, nominal"]
[null,"Public lighting"]
[null,{"$f":"IF(dms_Jurisdiction=\"Vic\",\"Energy Efficient\", \"Total\")","v":"Energy Efficient"},70755,{"$f":"SUM(G68:J68)","v":1077401},{"$f":"IF(C68=0,1,((D68-C68)/C68)*1)","v":14.227206557840436},null,null,null,null,1077401]
[null,{"$f":"IF(dms_Jurisdiction=\"Vic\",\"Non-energy efficient\", \"\")","v":"Non-energy efficient"},2000730,{"$f":"SUM(G69:J69)","v":1057458},{"$f":"IF(C69=0,1,((D69-C69)/C69)*1)","v":-0.47146391567078016},null,null,null,null,1057458]
[null,"Alternative Control Services"]
[null,"Connection services",null,{"$f":"SUM(G71:J71)","v":0},{"$f":"IF(C71=0,1,((D71-C71)/C71)*1)","v":1}]
[null,"Metering services",null,{"$f":"SUM(G72:J72)","v":0},{"$f":"IF(C72=0,1,((D72-C72)/C72)*1)","v":1}]
[null,"Ancillary network services",null,{"$f":"SUM(G73:J73)","v":0},{"$f":"IF(C73=0,1,((D73-C73)/C73)*1)","v":1}]
[null,"Negotiated Services"]
[null,"Negotiated services",null,{"$f":"SUM(G75:J75)","v":0},{"$f":"IF(C75=0,1,((D75-C75)/C75)*1)","v":1}]
[null,"Total",{"$f":"SUM(C68:C69,C71:C73,C75)","v":2071485},{"$f":"SUM(D68:D69,D71:D73,D75)","v":2134859},{"$f":"IF(C76=0,1,((D76-C76)/C76)*1)","v":3.059351141813723E-2},null,{"$f":"SUM(G68:G69,G71:G73,G75)","v":0},{"$f":"SUM(H68:H69,H71:H73,H75)","v":0},{"$f":"SUM(I68:I69,I71:I73,I75)","v":0},{"$f":"SUM(J68:J69,J71:J73,J75)","v":2134859}]
[]
[]
[]
[null,"8.2.4 - CAPEX BY ASSET CLASS"]
[]
[null,{"$f":"CONCATENATE(dms_TradingName, \" to enter in Table 8.2.4 each Asset Class specified in its current determination as listed in the AER's final decision in its Roll Forward Model and Post-tax Revenue Model and enter information against that Asset Class.\")","v":"Powercor Australia to enter in Table 8.2.4 each Asset Class specified in its current determination as listed in the AER's final decision in its Roll Forward Model and Post-tax Revenue Model and enter information against that Asset Class."}]
[]
[null,null,"CPI adjusted Forecast","Actual ","Difference","Movements in provisions \nallocated to \nas-incurred capex"]
[null,"Asset class","$0's, nominal",null," (%)","$0's, nominal"]
[null,"Subtransmission",51536697,{"$f":"'[1]8.2 Capex'!D90","v":41672791.323638029},{"$f":"IF(C86=0,1,((D86-C86)/C86)*1)","v":-0.19139576749285991},-293374]
[null,"Distribution system assets",347727035,{"$f":"'[1]8.2 Capex'!D91","v":183739170.36387563},-0.47159941025616364,-1297530]
[null,"Standard metering",0,null,1,0]
[null,"Public lighting",0,null,1,0]
[null,"SCADA/Network control",6985358,17437538,1.4962984001678941,-113871]
[null,"Non-network general assets - IT",40699233,22819871,-0.43930464242409678,-149019]
[null,"Non-network general assets - Other",17537803,42235242,1.4082401883519846,-275805]
[null,"VBRC",13405028,13367523,-2.797830784090865E-3,-87293]
[null,"Supervisory cables",0,null,1,0]
[null,"Old SWER ACRs",0,null,1,0]
[null,"Land",189110,11958509,62.235730527206385,-78092]
[null,null,null,null,1]
[null,null,null,null,1]
[null,null,null,null,1]
[null,null,null,null,1]
[null,null,null,null,1]
[null,null,null,null,1]
[null,null,null,null,1]
[null,null,null,null,1]
[null,null,null,null,1]
[null,null,null,null,1]
[null,null,null,null,1]
[null,null,null,null,1]
[null,null,null,null,1]
[null,null,null,null,1]
[null,null,null,null,1]
[null,null,null,null,1]
[null,null,null,null,1]
[null,null,null,null,1]
[null,null,null,null,1]
[null,null,null,null,1]
[null,null,null,null,1]
[null,null,null,null,{"$f":"IF(C118=0,1,((D118-C118)/C118)*1)","v":1}]
[null,null,null,null,1]
[null,null,null,null,1]
[null,null,null,null,1]
[null,null,null,null,1]
[null,null,null,null,1]
[null,null,null,null,1]
[null,null,null,null,1]
[null,null,null,null,1]
[null,null,null,null,1]
[null,null,null,null,1]
[null,null,null,null,1]
[null,null,null,null,1]
[null,null,null,null,1]
[null,null,null,null,1]
[null,null,null,null,1]
[null,null,null,null,1]
[null,null,null,null,1]
[null,"Total",{"$f":"SUM(C86:C135)","v":478080264},{"$f":"SUM(D86:D135)","v":333230644.68751365},-0.30298180079754633,{"$f":"SUM(F86:F135)","v":-2294984}]
[]
[]
[null,"8.2.5 - CAPITAL CONTRIBUTIONS BY ASSET CLASS"]
[null,null,"CPI Adjusted Forecast","Actual","Difference"]
[null,"Asset class","$0's, nominal",null," (%)"]
[null,"Subtransmission",12910955,15045457,{"$f":"IF(C142=0,1,((D142-C142)/C142)*1)","v":0.16532487333431184}]
[null,"Distribution system assets",72578049,75981496,4.6893613797747584E-2]
[null,"Standard metering",0,null,1]
[null,"Public lighting",0,null,1]
[null,"SCADA/Network control",0,null,1]
[null,"Non-network general assets - IT",0,null,1]
[null,"Non-network general assets - Other",0,null,1]
[null,"VBRC",0,null,1]
[null,"Supervisory cables",0,null,1]
[null,"Old SWER ACRs",0,null,1]
[null,"Land",0,null,1]
[null,null,null,null,1]
[null,null,null,null,1]
[null,null,null,null,1]
[null,null,null,null,1]
[null,null,null,null,1]
[null,null,null,null,1]
[null,null,null,null,1]
[null,null,null,null,1]
[null,null,null,null,1]
[null,null,null,null,1]
[null,null,null,null,1]
[null,null,null,null,1]
[null,null,null,null,1]
[null,null,null,null,1]
[null,null,null,null,1]
[null,null,null,null,1]
[null,null,null,null,1]
[null,{"$f":"IF(ISBLANK(B114),\"\",B114)","v":""},null,null,1]
[null,"",null,null,1]
[null,"",null,null,1]
[null,"",null,null,1]
[null,"",null,null,{"$f":"IF(C174=0,1,((D174-C174)/C174)*1)","v":1}]
[null,"",null,null,1]
[null,"",null,null,1]
[null,"",null,null,1]
[null,"",null,null,1]
[null,"",null,null,1]
[null,"",null,null,1]
[null,"",null,null,1]
[null,"",null,null,1]
[null,"",null,null,1]
[null,"",null,null,1]
[null,"",null,null,1]
[null,"",null,null,1]
[null,"",null,null,1]
[null,"",null,null,1]
[null,"",null,null,1]
[null,"",null,null,1]
[null,"",null,null,1]
[null,"Total",{"$f":"SUM(C142:C191)","v":85489004},{"$f":"SUM(D142:D191)","v":91026953},6.4779664528551537E-2]
[]
[]
[null,"8.2.6 - DISPOSALS BY ASSET CLASS"]
[null,null,"CPI Adjusted Forecast","Actual","Difference"]
[null,"Asset class","$0's, nominal",null," (%)"]
[null,"Subtransmission",0,null,{"$f":"IF(C198=0,1,((D198-C198)/C198)*1)","v":1}]
[null,"Distribution system assets",0,null,1]
[null,"Standard metering",0,null,1]
[null,"Public lighting",0,null,1]
[null,"SCADA/Network control",0,null,1]
[null,"Non-network general assets - IT",0,null,1]
[null,"Non-network general assets - Other",2122978,2561858,0.20672847292812266]
[null,"VBRC",0,null,1]
[null,"Supervisory cables",0,null,1]
[null,"Old SWER ACRs",0,null,1]
[null,"Land",0,null,1]
[null,null,null,null,1]
[null,null,null,null,1]
[null,null,null,null,1]
[null,null,null,null,1]
[null,null,null,null,1]
[null,null,null,null,1]
[null,null,null,null,1]
[null,null,null,null,1]
[null,null,null,null,1]
[null,null,null,null,1]
[null,null,null,null,1]
[null,null,null,null,1]
[null,null,null,null,1]
[null,null,null,null,1]
[null,null,null,null,1]
[null,null,null,null,1]
[null,null,null,null,1]
[null,{"$f":"IF(ISBLANK(B114),\"\",B114)","v":""},null,null,1]
[null,"",null,null,1]
[null,"",null,null,1]
[null,"",null,null,1]
[null,"",null,null,{"$f":"IF(C230=0,1,((D230-C230)/C230)*1)","v":1}]
[null,"",null,null,1]
[null,"",null,null,1]
[null,"",null,null,1]
[null,"",null,null,1]
[null,"",null,null,1]
[null,"",null,null,1]
[null,"",null,null,1]
[null,"",null,null,1]
[null,"",null,null,1]
[null,"",null,null,1]
[null,"",null,null,1]
[null,"",null,null,1]
[null,"",null,null,1]
[null,"",null,null,1]
[null,"",null,null,1]
[null,"",null,null,1]
[null,"",null,null,1]
[null,"Total",{"$f":"SUM(C198:C247)","v":2122978},{"$f":"SUM(D198:D247)","v":2561858},0.20672847292812266]

{"sheet":"8.4 Opex","index":21,"n_rows":142,"n_cols":14,"rows_kept":142,"cut":false,"hidden":false,"merged":[[153,2,153,7],[154,2,154,7],[143,2,143,7],[144,2,144,7],[145,2,145,7],[146,2,146,7],[148,2,148,7],[149,2,149,7],[150,2,150,7],[151,2,151,7],[152,2,152,7],[6,1,6,4],[13,1,13,5],[15,2,17,2],[15,3,17,3],[15,4,17,4],[11,1,11,5],[7,1,7,4],[12,1,12,5],[16,5,17,5],[15,5,15,7],[16,7,17,7],[74,1,74,4],[18,2,18,6],[15,13,17,13],[76,13,78,13],[18,8,18,13],[16,8,16,9],[77,8,77,9],[77,10,77,12],[16,10,16,12],[15,8,15,12],[76,8,76,12],[76,5,76,7],[76,2,78,2],[76,3,78,3],[76,4,78,4],[16,6,17,6],[79,8,79,13],[77,6,78,6],[77,7,78,7],[156,2,156,7],[157,2,157,7],[79,2,79,4],[77,5,78,5],[137,2,137,7],[138,2,138,7],[155,2,155,7],[135,1,135,4],[139,2,139,7],[140,2,140,7],[141,2,141,7],[142,2,142,7],[147,2,147,7]]}
[null,{"$f":"(LOOKUP(dms_Model,dms_Model_List,dms_Worksheet_List))","v":"ANNUAL REPORTING STATEMENT"}]
[null,{"$f":"dms_TradingName","v":"Powercor Australia"}]
[null,{"$f":"CONCATENATE(\"Annual Reporting RIN Response \",CRY)","v":"Annual Reporting RIN Response 2017"}]
[null,"8.4 OPEX"]
[]
[null,"Instructions"]
[null,{"$f":"CONCATENATE(\"Forecast expenditure is to be taken from \",dms_TradingName,\"'s \",dms_DeterminationRef,\".\")","v":"Forecast expenditure is to be taken from Powercor Australia's 2016-20 Distribution Determination."}]
[null,"If allocating based on assumptions then provide method in Basis of Preparation.  \n\nAll adjustments must be explained in Basis of Preparation with supporting documentation attached. "]
[]
[null,"8.4.1 - OPERATING & MAINTENANCE EXPENDITURE - BY PURPOSE"]
[]
[null,{"$f":"CONCATENATE(dms_TradingName,\" is to list the operating expenditure categories identified in \", dms_TradingName,\"'s regulatory proposal at table 3.2.1.1 current opex categories and cost allocations.\")","v":"Powercor Australia is to list the operating expenditure categories identified in Powercor Australia's regulatory proposal at table 3.2.1.1 current opex categories and cost allocations."}]
[null,{"$f":"CONCATENATE(dms_TradingName, \" must specify any expenditure category where the expense is more than 5 per cent of the total standard control services operating expenditure.\")","v":"Powercor Australia must specify any expenditure category where the expense is more than 5 per cent of the total standard control services operating expenditure."}]
[null,"Reported operating expenditure must INCLUDE any profit margins or management fees paid directly or indirectly to related party contractors (not including actual incurred expenditure of the related party contractor) for the regulatory reporting period.  "]
[]
[null,null,"Audited Statutory Accounts","Adjustments","Distribution business","Standard Control Services",null,null,"Alternative Control Services",null,null,null,null,"Negotiated Services"]
[null,null,null,null,null,"CPI Adjusted Forecast","Actual","Difference","Public Lighting",null,"Other"]
[null,null,null,null,null,null,null,null,{"$f":"IF(dms_Jurisdiction=\"Vic\",\"Energy efficient\",\"\")","v":"Energy efficient"},{"$f":"IF(dms_Jurisdiction=\"Vic\",\"Non-energy efficient\",\"\")","v":"Non-energy efficient"},"Connection services","Metering services","Ancillary network services"]
[null,"Opex category","$0's, nominal",null,null,null,null,"%","$0's, nominal"]
[null,"Routine",32031059.489999998,null,32031059.489999998,58164787.350000001,32031059.489999998,{"$f":"IF(F20=0,1,((G20-F20)/F20)*1)","v":-0.44930496698532163}]
[null,"Condition based",38171376.130000003,{"$f":"E21-C21","v":12672938.030000001},{"$f":"'[1]8.4 Opex'!D24","v":50844314.160000004},41581946.549999997,{"$f":"E21","v":50844314.160000004},0.22274973584660163]
[null,"Emergency",20290742.129999999,{"$f":"E22-C22","v":7830638.897710003},{"$f":"'[1]8.4 Opex'!D25","v":28121381.027710002},26928997.27,{"$f":"E22","v":28121381.027710002},4.4278802725356822E-2]
[null,"SCADA/Network Control",225566.12,null,225566.12,1024515.69,225566.12,-0.77983146358646782]
[null,"Other - Standard Control Services",4481316.49,null,4481316.49,3916759.51,4481316.49,0.14413879089553816]
[null,"Network Operating Costs",907820.72,3841000,4748820.72,24460511.82,4748820.72,-0.80585767154237742]
[null,"Billing & Revenue Collection",3862950.46,0,3862950.46,6902914.9800000004,3862950.46,-0.44038852119833011]
[null,"Advertising/Marketing",39824.949999999997,null,39824.949999999997,13112.02,39824.949999999997,2.0372856356228861]
[null,"Customer Service",5083616.1900000004,null,5083616.1900000004,8203435.6500000004,5083616.1900000004,-0.38030644636067812]
[null,"Regulatory",0,null,0,4261267.3099999996,0,-1]
[null,"Regulatory Reset",0,null,0,784939.79,0,-1]
[null,"IT",29451584.82,null,29451584.82,25666845.059999999,29451584.82,0.14745636836754264]
[null,"Licence fee",2506999.5499999998,null,2506999.5499999998,19972.16,2506999.5499999998,124.52470789338759]
[null,"GSL payments",3051107.17,null,3051107.17,3116230.13,3051107.17,-2.0897994462302425E-2]
[null,"Non-network alternatives costs",0,null,0,0,0,1]
[null,"Debt Raising Costs",0,null,0,0,0,1]
[null,"Other Operating - Standard Control Services",352690829.30000001,-303059611,49631219,30090767.960000001,49631219,0.64938359386424904]
[null,"Public Lighting",4446483.79,null,4446483.79,null,null,1,2244096.65,2202387.13]
[null,"Connection Services",5541685.96,9919818.9100000001,15461504.869999999,null,null,1,null,null,15461504.869999999]
[null,"Metering Services",14283568.16,505036.92,14788605.08,null,null,1,null,null,null,14788605.08]
[null,"Ancillary Network Services",2874784.74,2280934.58,5155719.32,null,null,1,null,null,null,null,5155719.32]
[null,"Negotiated Services",686263.76,null,686263.76,null,null,1,null,null,null,null,null,686263.76]
[null,null,null,null,null,null,null,1]
[null,null,null,null,null,null,null,1]
[null,null,null,null,null,null,null,1]
[null,null,null,null,null,null,null,1]
[null,null,null,null,null,null,null,1]
[null,null,null,null,null,null,null,1]
[null,null,null,null,null,null,null,1]
[null,null,null,null,null,null,null,1]
[null,null,null,null,null,null,null,1]
[null,null,null,null,null,null,null,1]
[null,null,null,null,null,null,null,{"$f":"IF(F52=0,1,((G52-F52)/F52)*1)","v":1}]
[null,null,null,null,null,null,null,1]
[null,null,null,null,null,null,null,1]
[null,null,null,null,null,null,null,1]
[null,null,null,null,null,null,null,1]
[null,null,null,null,null,null,null,1]
[null,null,null,null,null,null,null,1]
[null,null,null,null,null,null,null,1]
[null,null,null,null,null,null,null,1]
[null,null,null,null,null,null,null,1]
[null,null,null,null,null,null,null,1]
[null,null,null,null,null,null,null,1]
[null,null,null,null,null,null,null,1]
[null,null,null,null,null,null,null,1]
[null,null,null,null,null,null,null,1]
[null,null,null,null,null,null,null,1]
[null,null,null,null,null,null,null,1]
[null,null,null,null,null,null,null,1]
[null,"Total",{"$f":"SUM(C20:C69)","v":520627579.93000001},{"$f":"SUM(D20:D69)","v":-266009243.66228998},{"$f":"SUM(E20:E69)","v":254618336.96770999},{"$f":"SUM(F20:F69)","v":235137003.25},{"$f":"SUM(G20:G69)","v":214079760.14771},-8.9553081017630112E-2,{"$f":"SUM(I20:I69)","v":2244096.65},2202387.13,15461504.869999999,14788605.08,5155719.32,686263.76]
[]
[]
[null,"8.4.2 - OPERATING & MAINTENANCE EXPENDITURE - BY PURPOSE - MARGINS ONLY"]
[]
[null,"\"Related party margin expenditure' must COMPRISE ONLY profit margins or management fees paid directly or indirectly to related party contractors (for expenditure that is not an actual incurred expenditure of the related party contractor) for the regulatory reporting period."]
[]
[null,null,"Audited Statutory Accounts","Adjustments","Distribution business","Standard Control Services",null,null,"Alternative Control Services",null,null,null,null,"Negotiated Services"]
[null,null,null,null,null,"CPI Adjusted Forecast","Actual","Difference","Public Lighting",null,"Other"]
[null,null,null,null,null,null,null,null,{"$f":"IF(dms_Jurisdiction=\"Vic\",\"Energy efficient\",\"\")","v":"Energy efficient"},{"$f":"IF(dms_Jurisdiction=\"Vic\",\"Non-energy efficient\",\"\")","v":"Non-energy efficient"},"Connection services","Metering services","Ancillary network services"]
[null,"Opex category","$0's, nominal",null,null,null,"$0's, nominal","per cent","$0's, nominal"]
[null,"Routine",null,null,null,null,null,{"$f":"IF(F81=0,1,((G81-F81)/F81)*1)","v":1}]
[null,"Condition based",null,null,null,null,null,1]
[null,"Emergency",null,null,null,null,null,1]
[null,"SCADA/Network Control",null,null,null,null,null,1]
[null,"Other - Standard Control Services",null,null,null,null,null,1]
[null,"Network Operating Costs",null,null,null,null,null,1]
[null,"Billing & Revenue Collection",null,null,null,null,null,1]
[null,"Advertising/Marketing",null,null,null,null,null,1]
[null,"Customer Service",null,null,null,null,null,1]
[null,"Regulatory",null,null,null,null,null,1]
[null,"Regulatory Reset",null,null,null,null,null,1]
[null,"IT",null,null,null,null,null,1]
[null,"Licence fee",null,null,null,null,null,1]
[null,"GSL payments",null,null,null,null,null,1]
[null,"Non-network alternatives costs",null,null,null,null,null,1]
[null,"Debt Raising Costs",null,null,null,null,null,1]
[null,"Other Operating - Standard Control Services",null,null,null,null,null,1]
[null,"Public Lighting",null,null,null,null,null,1]
[null,"Connection Services",null,null,null,null,null,1]
[null,"Metering Services",null,null,null,null,null,1]
[null,"Ancillary Network Services",null,null,null,null,null,1]
[null,"Negotiated Services",null,null,null,null,null,1]
[null,null,null,null,null,null,null,1]
[null,null,null,null,null,null,null,1]
[null,null,null,null,null,null,null,1]
[null,null,null,null,null,null,null,1]
[null,null,null,null,null,null,null,1]
[null,null,null,null,null,null,null,1]
[null,null,null,null,null,null,null,1]
[null,null,null,null,null,null,null,1]
[null,null,null,null,null,null,null,1]
[null,null,null,null,null,null,null,1]
[null,null,null,null,null,null,null,{"$f":"IF(F113=0,1,((G113-F113)/F113)*1)","v":1}]
[null,null,null,null,null,null,null,1]
[null,null,null,null,null,null,null,1]
[null,null,null,null,null,null,null,1]
[null,null,null,null,null,null,null,1]
[null,null,null,null,null,null,null,1]
[null,null,null,null,null,null,null,1]
[null,null,null,null,null,null,null,1]
[null,null,null,null,null,null,null,1]
[null,null,null,null,null,null,null,1]
[null,null,null,null,null,null,null,1]
[null,null,null,null,null,null,null,1]
[null,null,null,null,null,null,null,1]
[null,null,null,null,null,null,null,1]
[null,null,null,null,null,null,null,1]
[null,null,null,null,null,null,null,1]
[null,null,null,null,null,null,null,1]
[null,null,null,null,null,null,null,1]
[null,"Total",{"$f":"SUM(C81:C130)","v":0},{"$f":"SUM(D81:D130)","v":0},{"$f":"SUM(E81:E130)","v":0},{"$f":"SUM(F81:F130)","v":0},{"$f":"SUM(G81:G130)","v":0},1,{"$f":"SUM(I81:I130)","v":0},0,0,0,0,0]
[]
[]
[null,"8.4.3 - OPERATING & MAINTENANCE EXPENDITURE - EXPLANATION OF MATERIAL DIFFERENCE"]
[]
[null,"Where the difference between forecast and actual expenditure shown in table 8.4.1, column I is a Material Difference please explain the main factors driving the difference."]
[]
[null,"Category","Explanation"]
[null,"Routine","Lower than forecast expenditure due to efficiences realised in vegetation management and asset inspection"]
[null,"SCADA/Network Control","The absolute expenditure variance is not material."]
[null,"Other - Standard Control Services","The absolute expenditure variance is not material."]
[null,"Operating Expenditure","Impacted by internal restructuring between areas of the business. Total expenditure in these categories combined is not materially different than AER Forecast."]

{"sheet":"9.5 TUoS","index":22,"n_rows":67,"n_cols":6,"rows_kept":67,"cut":false,"hidden":false,"merged":[[64,1,64,4],[58,1,58,4],[24,1,24,4],[25,1,25,4],[66,1,66,4],[60,1,60,4],[55,1,55,4],[65,1,65,4],[47,1,47,4],[51,1,51,4],[52,1,52,4],[53,1,53,4],[54,1,54,4],[48,1,48,4],[49,1,49,4],[50,1,50,4],[57,1,57,4],[61,1,61,4],[59,1,59,4],[62,1,62,4],[63,1,63,4],[5,1,5,3],[26,1,26,3],[30,2,30,5],[42,1,42,4],[31,2,31,5],[9,1,9,4],[12,1,12,4],[13,1,13,4],[14,1,14,4],[20,1,20,4],[23,1,23,4],[15,1,15,3],[10,1,10,4],[11,1,11,4],[21,1,21,4],[22,1,22,4]]}
[null,{"$f":"(LOOKUP(dms_Model,dms_Model_List,dms_Worksheet_List))","v":"ANNUAL REPORTING STATEMENT"}]
[null,{"$f":"dms_TradingName","v":"Powercor Australia"}]
[null,{"$f":"CONCATENATE(\"Annual Reporting RIN Response \",CRY)","v":"Annual Reporting RIN Response 2017"}]
[null,"9.5 - TUoS AUDIT (t-2)"]
[]
[null,"This template collects information for annual pricing proposals from Victorian businesses only.\n"]
[]
[null,"9.5.1 - TUOS CHARGES (AEMO)"]
[null,null,null,null,null,{"$f":"CRY","v":2017}]
[null,"AEMO (Locational & Non-Locational)",null,null,null,75116921]
[null,"AEMO (TUoS Common Service Charge)",null,null,null,63999476]
[null,"Grid equalisation",null,null,null,-3802200]
[null,"Adjustment",null,null,null,0]
[]
[]
[null,null,null,null,"Total",{"$f":"SUM(F10:F15)","v":135314197}]
[]
[]
[null,"9.5.2 - TRANSMISSION CONNECTION FEES"]
[null,null,null,null,null,{"$f":"CRY","v":2017}]
[null,"Ausnet Services (Connection)",null,null,null,15035319]
[null,"Ausnet Services (Augmentation)",null,null,null,3715697]
[]
[]
[]
[]
[null,null,null,null,"Total",{"$f":"SUM(F21:F26)","v":18751016}]
[]
[]
[null,"9.5.3 - CROSS BOUNDARY NETWORK CHARGES"]
[null,null,"Amount (payable)/receivable"]
[null,null,"$0's, nominal"]
[null,null,"HV crossings","Subtransmission crossings","TUoS Adjustment","Total"]
[null,"Distribution Business",null,null,null,{"$f":"CRY","v":2017}]
[null,"Jemena",null,-5538553,null,{"$f":"IF((SUM(C35:E35)=0),\"\",(SUM(C35:E35)))","v":-5538553}]
[null,"SAPN",null,-536727,null,-536727]
[null,null,null,null,null,""]
[null,null,null,null,null,""]
[null,null,null,null,null,""]
[null,null,null,null,null,""]
[null,null,null,null,null,""]
[null,null,null,null,null,""]
[null,"Total",null,null,null,{"$f":"SUM(F35:F42)","v":-6075280}]
[]
[]
[null,"9.5.4 - PAYMENTS TO EMBEDDED GENERATORS"]
[null,"9.5.4.1 - AVOIDED TRANSMISSION COSTS",null,null,null,{"$f":"CRY","v":2017}]
[null,"Avoided Transmission Cost",null,null,null,2210381]
[]
[]
[]
[]
[]
[]
[]
[null,"Total",null,null,null,{"$f":"SUM(F48:F55)","v":2210381}]
[null,"9.5.4.2 - AVOIDED TUoS USAGE CHARGES",null,null,null,{"$f":"CRY","v":2017}]
[null,null,null,null,null,0]
[]
[]
[]
[]
[]
[]
[]
[null,"Total",null,null,null,{"$f":"SUM(F58:F65)","v":0}]
[null,"Total payments to embedded generators",null,null,null,{"$f":"F66+F56","v":2210381}]