{"text_format":"1","workbook":"xlsx","n_sheets":18,"sheets":["AER only","Instructions","Contents","Business & other details","2.1 Expenditure summary","2.2 Repex","2.3 Augex","2.5 Connections","2.6 Non-network","2.7 Vegetation management","2.8 Maintenance","2.10 Overheads","2.11 Labour","2.12 Input tables","5.2 Asset Age Profile","5.3 MD - Network level","5.4 MD & utilisation-Spatial","Amendments"],"not_rendered":{"charts":0,"images":6,"macros":1,"external_links":0,"defined_names":671,"comments":2,"pivot_tables":0},"unopened":[],"bounds":{"document_bytes":16777216,"sheet_cells":100000,"rows_first":2000,"rows_last":500,"rows_between":2000,"halvings":0,"cell_chars":16384,"cell_head_chars":4096},"cells_cut":0,"cells_raw":0,"read":"whole","date_system":"1900"}

{"sheet":"AER only","index":0,"n_rows":150,"n_cols":41,"rows_kept":150,"cut":false,"hidden":true,"merged":[[58,35,62,35],[66,35,67,35],[72,14,72,15],[72,24,72,27],[110,1,110,8],[55,35,57,35],[0,1,0,11],[4,27,4,37],[6,27,6,30],[6,33,6,37],[53,24,53,28],[53,29,53,32],[54,1,54,5],[54,14,54,21],[54,24,54,28],[54,29,54,32],[55,2,55,3]]}
[null,"Data in these columns used for data validation and database purposes."]
[null,"Date last modified:","2017-01-16","added (Albury and Victora) for AGN"]
[null,null,"2016-10-17","updated TransGrid's correct legal name, corrected TasNetworks (T) to June financial year"]
[null,null,"2017-02-01","inserted Power and Water, added NRs (dms_FeederCat_1 and dms_FeederCat_2)"]
[null,null,"2017-03-03","inserted AEMO as a business",null,null,null,null,null,null,null,null,null,null,null,null,null,null,null,null,null,null,null,null,null,null,null,"FOR ELECTRICITY BUSINESSES ONLY"]
[null,null,"2018-03-28","major changes to accommodate STPIS"]
[null,null,"Template Version",5,null,null,null,null,null,null,null,null,null,null,null,null,null,null,null,null,null,null,null,null,null,null,null,"Feeder Types",null,null,null,"TasNetworks (D)","MAIFI flag","Feeder Names"]
[null,null,null,null,null,null,null,null,null,null,null,null,null,null,null,null,null,null,null,null,null,null,null,null,null,null,null,"CBD","Urban","Short rural","long rural","EXTRA"]
[null,"dms_TradingName_List","dms_TradingNameFull_List","dms_ABN_List","dms_JurisdictionList","dms_Sector_List","dms_Segment_List","dms_FormControl_List","dms_RPT_List","dms_RPTMonth_List","dms_CRCPlength_List","dms_FRCPlength_List","dms_663_List","dms_DeterminationRef_List","dms_Addr1_List","dms_Addr2_List","dms_Suburb_List","dms_State_List","dms_PostCode_List","dms_PAddr1_List","dms_PAddr2_List","dms_PSuburb_List","dms_PState_List","dms_PPostCode_List","dms_ContactName1_List","dms_ContactPh1_List","dms_ContactEmail_List","dms_CBD_flag","dms_Urban_flag","dms_ShortRural_flag","dms_LongRural_flag","dms_FeederType_5_flag","dms_MAIFI_flag_List","dms_FeederName_1","dms_FeederName_2","dms_FeederName_3","dms_FeederName_4","dms_FeederName_5","Column1"]
[null,"ActewAGL Distribution","ActewAGL Distribution",76670568688,"ACT","Electricity","Distribution","Revenue cap","Financial","June",5,5,5,"2014-19 Distribution Determination","40 Bunda Street",null,"CANBERRA","ACT",2600,"GPO BOX 366",null,"CANBERRA","ACT",2601,"Robert Walker","02 6248 3847","robert.walker@actewagle.com.au","NO","YES","YES","NO","NO",null,"CBD","Urban","Short rural","Long rural",null,"ActewAGL Distribution"]
[null,"ActewAGL Distribution (Tx Assets)","ActewAGL Distribution (Tx Assets)",76670568688,"ACT","Electricity","Distribution","Revenue cap","Financial","June",5,5,5,"distribution determination","40 Bunda Street",null,"CANBERRA","ACT",2600,"GPO BOX 366",null,"CANBERRA","ACT",2601,"Robert Walker","02 6248 3847","robert.walker@actewagle.com.au","NO","YES","YES","NO","NO",null,"CBD","Urban","Short rural","Long rural",null,"ActewAGL Distribution (Tx Assets)"]
[null,"ActewAGL Gas","ActewAGL Gas",76670568688,"ACT","Gas","Distribution","Weighted average price cap","Financial","June",5,5,"x",null,"40 Bunda Street",null,"CANBERRA","ACT",2600,"GPO BOX 366",null,"CANBERRA","ACT",2601,"Philip Deamer","02 6248 3438","GasAAReview@actewagl.com.au",null,null,null,null,null,null,"CBD","Urban","Short rural","Long rural",null,"ActewAGL Gas"]
[null,"AEMO","Australian Energy Market Operator Ltd",94072010327,"Vic","Electricity","Transmission","-","Financial","March",5,5,"x","-","Level 22","530 Collins Street","MELBOURNE","VIC",3000,"GPO Box 2008",null,"MELBOURNE","VIC",3001,null,null,null,"n/a","n/a","n/a","n/a","n/a",null,"CBD","Urban","Short rural","Long rural",null,"AEMO"]
[null,"AGN (Albury and Victoria)","Australian Gas Networks Limited (reporting data for Albury and Victoria)",19078551685,"Vic","Gas","Distribution","Weighted average price cap","Calendar","December",5,5,"x",null,"Level 6","400 King William Street","ADELAIDE","SA",5000,"PO Box 6468","Halifax Street","ADELAIDE","SA",5000,"Craig de Laine","08 8418 1129 ","craig.delaine@agn.com.au","n/a","n/a","n/a","n/a","n/a",null,"CBD","Urban","Short rural","Long rural",null,"AGN (Albury)"]
[null,"AGN (Albury)","Australian Gas Networks Limited (reporting data for Albury)",19078551685,"Vic","Gas","Distribution","Weighted average price cap","Calendar","December",5,5,"x",null,"Level 6","400 King William Street","ADELAIDE","SA",5000,"PO Box 6468","Halifax Street","ADELAIDE","SA",5000,"Craig de Laine","08 8418 1129 ","craig.delaine@agn.com.au","n/a","n/a","n/a","n/a","n/a",null,"CBD","Urban","Short rural","Long rural"]
[null,"AGN (SA)","Australian Gas Networks Limited (reporting data for SA)",19078551685,"SA","Gas","Distribution","Weighted average price cap","Financial","June",5,5,5,"distribution determination","Level 6","400 King William Street","ADELAIDE","SA",5000,"PO Box 6468","Halifax Street","ADELAIDE","SA",5000,"Craig de Laine","08 8418 1129 ","craig.delaine@agn.com.au","n/a","n/a","n/a","n/a","n/a",null,"CBD","Urban","Short rural","Long rural",null,"AGN (SA)"]
[null,"AGN (Victoria)","Australian Gas Networks Limited (reporting data for Victoria)",19078551685,"Vic","Gas","Distribution","Weighted average price cap","Calendar","December",5,5,"x",null,"Level 6","400 King William Street","ADELAIDE","SA",5000,"PO Box 6468","Halifax Street","ADELAIDE","SA",5000,"Craig de Laine","08 8418 1129 ","craig.delaine@agn.com.au","n/a","n/a","n/a","n/a","n/a",null,"CBD","Urban","Short rural","Long rural",null,"AGN (Victoria)"]
[null,"Amadeus","APT Pipelines (NT) Pty Ltd",39009737393,"NT","Gas","Transmission","Weighted average price cap","Financial","June",5,5,"x","n/a","Level 19, HSBC Building","580 George Street","SYDNEY","NSW",2000,"Level 19, HSBC Building","580 George Street","SYDNEY","NSW",2000,"Alexandra Curran","02 9275 0020","alexandra.curran@apa.com.au","n/a","n/a","n/a","n/a","n/a",null,"CBD","Urban","Short rural","Long rural",null,"Amadeus"]
[null,"APA GasNet","APA GasNet Australia (Operations) Pty Ltd","065083009","Vic","Gas","Transmission","Weighted average price cap","Calendar","December",5,5,"x",null,"Level 19, HSBC Building","580 George Street","SYDNEY","NSW",2000,"PO Box R41",null,"ROYAL EXCHANGE","NSW",1225,"Alexandra Curran","02 9275 0020","alexandra.curran@apa.com.au","n/a","n/a","n/a","n/a","n/a",null,"CBD","Urban","Short rural","Long rural",null,"APA GasNet"]
[null,"Ausgrid","Ausgrid",78508211731,"NSW","Electricity","Distribution","Revenue cap","Financial","June",5,5,5,"2014-19 Distribution Determination","570 George St",null,"SYDNEY","NSW",2000,"GPO Box 4009",null,"SYDNEY","NSW",2001,"John Thomson","02 9269 2312","john.thomson@ausgrid.com.au","YES","YES","YES","YES","NO",null,"CBD","Urban","Short rural","Long rural",null,"Ausgrid"]
[null,"Ausgrid (Tx Assets)","Ausgrid (Tx Assets)",67505337385,"NSW","Electricity","Distribution","Revenue cap","Financial","June",5,5,5,"distribution determination","570 George St",null,"SYDNEY","NSW",2000,"GPO Box 4009",null,"SYDNEY","NSW",2001,"John Thomson","02 9269 2312","john.thomson@ausgrid.com.au","YES","YES","YES","YES","NO",null,"CBD","Urban","Short rural","Long rural",null,"Ausgrid (Tx Assets)"]
[null,"AusNet (D)","AusNet Electricity Services Pty Ltd",91064651118,"Vic","Electricity","Distribution","Revenue cap","Calendar","December",5,5,2,"2016-20 Distribution Determination","Level 32","2 Southbank Boulevard","SOUTHBANK","Vic",3006,"Locked Bag 14051",null,"MELBOURNE CITY MAIL CENTRE","VIC",8001,"please provide contact details",null,null,null,"YES","YES","YES","NO",null,"CBD","Urban","Short rural","Long rural",null,"AusNet (D)"]
[null,"AusNet (Gas)","AusNet Gas Services","086015036","Vic","Gas","Distribution","Weighted average price cap","Calendar","December",5,5,"X",null,"Level 19, HSBC Building","580 George Street","SYDNEY","NSW",2000,"PO Box R41",null,"ROYAL EXCHANGE","NSW",1225,"Alexandra Curran","02 9275 0020","alexandra.curran@apa.com.au","n/a","n/a","n/a","n/a","n/a",null,"CBD","Urban","Short rural","Long rural",null,"AusNet (Gas)"]
[null,"AusNet (T)","Ausnet Services (Transmission) Ltd",48116124362,"Vic","Electricity","Transmission","Revenue cap","Financial","March",5,5,2,"transmission determination","Level 32","2 Southbank Boulevard","SOUTHBANK","Vic",3006,"Locked Bag 14051",null,"MELBOURNE CITY MAIL CENTRE","Vic",8001,"Clare Thompson","03 9695 6670","clare.e.thompson@ausnetservices.com.au","n/a","n/a","n/a","n/a","n/a",null,"CBD","Urban","Short rural","Long rural",null,"AusNet (T)"]
[null,"Australian Distribution Co.","Australian Distribution Co.",11222333444,"-","Electricity","Distribution","Revenue cap","Financial","June",5,5,2,"distribution determination","123 Straight Street",null,"SYDNEY","NSW",2000,"PO Box 123",null,"SYDNEY","NSW",2000,"Bob Smith","02 1234 5678","bob@auselec.net.au","n/a","n/a","n/a","n/a","NO",null,"CBD","Urban","Short rural","Long rural",null,"Australian Distribution Co."]
[null,"Australian Distribution Co. (Vic)","Australian Distribution Co. (Victoria)",11222333444,"Vic","Electricity","Distribution","Revenue cap","Calendar","December",5,5,2,"distribution determination","123 Straight Street",null,"MELBOURNE","Vic",3000,"PO Box 123",null,"MELBOURNE","VIC",3000,"Bob Smith","02 1234 5678","bob@auselec.net.au","n/a","n/a","n/a","n/a","NO",null,"CBD","Urban","Short rural","Long rural",null,"Australian Distribution Co. (Vic)"]
[null,"Australian Transmission Co.","Australian Transmission Co.",11222333444,"-","Electricity","Transmission","Revenue cap","Financial","June",5,5,5,"transmission determination","123 Straight Street",null,"SYDNEY","NSW",2000,"PO Box 123",null,"SYDNEY","NSW",2000,"Bob Smith","02 1234 5678","bob@auselec.net.au","n/a","n/a","n/a","n/a","NO",null,"CBD","Urban","Short rural","Long rural",null,"Australian Transmission Co."]
[null,"Central Ranges Pipeline (D)","Central Ranges Pipeline Pty Ltd",108218355,"NSW","Gas","Distribution","Weighted average price cap","Financial","June",15,5,5,"distribution determination","Level 19","580 George Street","SYDNEY","NSW",2000,"PO Box R41",null,"ROYAL EXCHANGE","NSW",1225,"Scott Young","02 9275 0031","scott.young@apa.com.au","n/a","n/a","n/a","n/a","n/a",null,"CBD","Urban","Short rural","Long rural"]
[null,"Central Ranges Pipeline (T)","Central Ranges Pipeline Pty Ltd",108218355,"NSW","Gas","Distribution","Weighted average price cap","Financial","June",14,5,5,"transmission determination","Level 19","580 George Street","SYDNEY","NSW",2000,"PO Box R41",null,"ROYAL EXCHANGE","NSW",1225,"Scott Young","02 9275 0031","scott.young@apa.com.au","n/a","n/a","n/a","n/a","n/a",null,"CBD","Urban","Short rural","Long rural"]
[null,"CitiPower","CitiPower",76064651056,"Vic","Electricity","Distribution","Revenue cap","Calendar","December",5,5,2,"2016-20 Distribution Determination","40 Market Street",null,"MELBOURNE","Vic",3000,"Locked Bag 14090",null,"MELBOURNE","VIC",8001,"Hannah Williams","03 9683 4088","hwilliams@powercor.com.au","YES","YES","NO","NO","NO",null,"CBD","Urban","Short rural","Long rural",null,"CitiPower"]
[null,"Directlink","Directlink",16779340889,"Qld","Electricity","Transmission","Revenue cap","Financial","June",9,5,5,"transmission determination","Level 19, HSBC Building","580 George Street","SYDNEY","NSW",2000,"PO Box R41",null,"ROYAL EXCHANGE","NSW",1225,"Scott Young","02 9275 0031","scott.young@apa.com.au","n/a","n/a","n/a","n/a","n/a",null,"CBD","Urban","Short rural","Long rural",null,"Directlink"]
[null,"ElectraNet","ElectraNet",41094482416,"SA","Electricity","Transmission","Revenue cap","Financial","June",5,5,5,"transmission determination","52-55 East Terrace","Rymill Park","ADELAIDE","SA",5000,"PO Box 7096","Hutt Street Post Office","ADELAIDE","SA",5000,"Bill Jackson","08 8404 7969","jackson.bill@electranet.com.au","n/a","n/a","n/a","n/a","n/a",null,"CBD","Urban","Short rural","Long rural",null,"ElectraNet"]
[null,"Endeavour Energy","Endeavour Energy",11247365823,"NSW","Electricity","Distribution","Revenue cap","Financial","June",5,5,5,"2014-19 Distribution Determination","51 Huntingwood Drive",null,"HUNTINGWOOD","NSW",2148,"PO Box 811",null,"SEVEN HILLS","NSW",1730,"Jon Hocking","02 9853 4386 / 0407 348 156","Jon.Hocking@Endeavourenergy.com.au","NO","YES","YES","YES","NO",null,"CBD","Urban","Short rural","Long rural",null,"Endeavour Energy"]
[null,"Energex","Energex",40078849055,"Qld","Electricity","Distribution","Revenue cap","Financial","June",5,5,5,"2015-20 Distribution Determination","26 Reddacliff Street",null,"NEWSTEAD","Qld",4006,"26 Reddacliff Street",null,"NEWSTEAD","QLD",4006,"Nicola Roscoe","07 3664 5891","nicolaroscoe@energex.com.au","YES","YES","YES","NO","NO",null,"CBD","Urban","Short rural","Long rural",null,"Energex"]
[null,"Ergon Energy","Ergon Energy",50087646062,"Qld","Electricity","Distribution","Revenue cap","Financial","June",5,5,5,"2015-20 Distribution Determination","22 Walker Street",null,"TOWNSVILLE","Qld",4810,"Po Box 264",null,"FORTITUDE VALLEY","QLD",4006,"Jenny Doyle, Group Manager Regulatory Affairs","(07) 3851 6416","jenny.doyle@ergon.com.au","NO","YES","YES","YES","NO",null,"CBD","Urban","Short rural","Long rural",null,"Ergon Energy"]
[null,"Essential Energy","Essential Energy",37428185226,"NSW","Electricity","Distribution","Revenue cap","Financial","June",5,5,5,"2014-19 Distribution Determination","8 Buller Street",null,"PORT MACQUARIE","NSW",2444,"PO Box 5730",null,"PORT MACQUARIE","NSW",2444,"Catherine Waddell","02 6338 3553","catherine.waddell@essentialenergy.com.au","NO","NO","YES","YES","NO",null,"CBD","Urban","Short rural","Long rural",null,"Essential Energy"]
[null,"Jemena Electricity","Jemena Electricity",82064651083,"Vic","Electricity","Distribution","Revenue cap","Calendar","December",5,5,2,"2016-20 Distribution Determination","Level 16","567 Collins Street","MELBOURNE","VIC",3000,"PO Box 16182",null,"MELBOURNE","VIC",8001,"Matthew Serpell","03 9173 8231","matthew.serpell@jemena.com.au","NO","NO","YES","NO","NO",null,"CBD","Urban","Short rural","Long rural",null,"Jemena Electricity"]
[null,"JGN","Jemena Gas Networks (NSW) Ltd","003 004 322","NSW","Gas","Distribution","Weighted average price cap","Financial","June",5,5,null,null,null,null,null,null,null,null,null,null,null,null,"please provide contact details",null,null,"n/a","n/a","n/a","n/a","n/a",null,"CBD","Urban","Short rural","Long rural",null,"JGN"]
[null,"Multinet Gas","Multinet Gas (DB No.1) Pty Ltd (ACN 086 026 986), Multinet Gas (DB No.2) Pty Ltd (ACN 086 230 122)","086026986","Vic","Gas","Distribution","Weighted average price cap","Calendar","December",5,5,"x",null,"43-45 Centreway",null,"MT WAVERLEY","Vic",3149,null,null,null,null,null,"Andrew Schille","03 8846 9860","andrew.schille@ue.com.au","n/a","n/a","n/a","n/a","n/a",null,"CBD","Urban","Short rural","Long rural",null,"Multinet Gas"]
[null,"Murraylink","Murraylink",79181207909,"SA","Electricity","Transmission","Revenue cap","Financial","June",5,5,5,"transmission determination","Level 19","580 George Street","SYDNEY","NSW",2000,"PO Box R41",null,"ROYAL EXCHANGE","NSW",1225,"Scott Young","02 9275 0031","scott.young@apa.com.au","n/a","n/a","n/a","n/a","n/a",null,"CBD","Urban","Short rural","Long rural",null,"Murraylink"]
[null,"Power and Water","Power and Water Corporation",15947352360,"NT","Electricity","Distribution","Revenue cap","Financial","June",5,5,"x","distribution determination","GPO Box 1921",null,"DARWIN","NT",801,"GPO Box 1921",null,"DARWIN","NT",801,"Lucy Moon","08 8924 5822","Lucy.Moon@powerwater.com.au","YES","YES","YES","YES","NO",null,"CBD","Urban","Short rural","Long rural"]
[null,"Powercor Australia","Powercor Australia",89064651109,"Vic","Electricity","Distribution","Revenue cap","Calendar","December",5,5,2,"2016-20 Distribution Determination","40 Market Street",null,"MELBOURNE","Vic",3000,"Locked bag 14090",null,"MELBOURNE","VIC",8001,"Hannah Williams","03 9683 4088","hwilliams@powercor.com.au",null,null,"YES","YES","NO",null,"CBD","Urban","Short rural","Long rural",null,"Powercor Australia"]
[null,"Powerlink","Queensland Electricity Transmission Corporation Limited trading as Powerlink Queensland",82078849233,"Qld","Electricity","Transmission","Revenue cap","Financial","June",5,5,5,"transmission determination","33 Harold St",null,"VIRGINIA","Qld",4014,"PO Box 1193",null,"VIRGINIA","QLD",4014,"Jennifer Harris","07 3860 2667","jharris@powerlink.com.au","n/a","n/a","n/a","n/a","n/a",null,"CBD","Urban","Short rural","Long rural",null,"Powerlink"]
[null,"Roma to Brisbane Pipeline","APT Petroleum Pipelines Limited t/a Roma to Brisbane Pipeline","009 737 393","Qld","Gas","Transmission","Weighted average price cap","Financial","June",5,5,"x","n/a","580 George Street",null,"SYDNEY","NSW",2000,"PO Box R41",null,"ROYAL EXCHANGE","NSW",1225,"Mark Allen","02 9275 0010","mark.allen@apa.com.au","n/a","n/a","n/a","n/a","n/a",null,"CBD","Urban","Short rural","Long rural",null,"Roma to Brisbane Pipeline"]
[null,"SA Power Networks","SA Power Networks",13332330749,"SA","Electricity","Distribution","Revenue cap","Financial","June",5,5,5,"2015-20 Distribution Determination","1 Anzac Highway",null,"KESWICK","SA",5035,"GPO Box 77",null,"ADELAIDE","SA",5000,"Richard Sibly","08 8404 5613","richard.sibly@sapowernetworks.com.au","NO","NO","YES","YES","NO",null,"CBD","Urban","Short rural","Long rural",null,"SA Power Networks"]
[null,"TasNetworks (D)","TasNetworks (D)",24167357299,"Tas","Electricity","Distribution","Revenue cap","Financial","June",5,5,5,"distribution determination","1-7 Maria Street",null,"LENAH VALLEY","Tas",7008,"PO Box 606",null,"MOONAH","Tas",7009,"John Sayers","03 6271 6469","john.sayers@tasnetworks.com.au","YES","YES","YES","YES","YES",null,"Critical Infrastructure","High density commercial","Urban","High density rural","Low density rural","TasNetworks (D)"]
[null,"TasNetworks (T)","TasNetworks (T)",24167357299,"Tas","Electricity","Transmission","Revenue cap","Financial","June",5,5,5,"transmission determination","1-7 Maria Street",null,"LENAH VALLEY","Tas",7008,"PO Box 606",null,"MOONAH","Tas",7009,"John Sayers","03 6271 6469","john.sayers@tasnetworks.com.au","n/a","n/a","n/a","n/a","n/a",null,"CBD","Urban","Short rural","Long rural",null,"TasNetworks (T)"]
[null,"TransGrid","NSW Electricity Networks Operations Pty Ltd trading as TransGrid",70250995390,"NSW","Electricity","Transmission","Revenue cap","Financial","June",5,4,5,"transmission determination","180 Thomas Street",null,"SYDNEY","NSW",2000,"PO Box A1000",null,"SYDNEY SOUTH","NSW",1235,"Garrie Chubb","0408 210 221","garrie.chubb@transgrid.com.au","n/a","n/a","n/a","n/a","n/a",null,"CBD","Urban","Short rural","Long rural",null,"TransGrid"]
[null,"United Energy","United Energy",70064651029,"Vic","Electricity","Distribution","Revenue cap","Calendar","December",5,5,2,"2016-20 Distribution Determination","Level 3","6 Nexus Court","MULGRAVE","Vic",3149,"PO Box 449",null,"MOUNT WAVERLEY","VIC",3170,"Mathew Abraham","03 8846 9758","mathew.abraham@ue.com.au","NO","NO","YES","NO","NO",null,"CBD","Urban","Short rural","Long rural",null,"United Energy"]
[null,"Western Power (D)","Western Power (D)",18540492861,"WA","Electricity","Distribution","Revenue cap","Financial","June",12,4,"x","distribution determination","363 Wellington Street",null,"PERTH","WA",6000,"GPO Box L921",null,"PERTH","WA",6842,"Judy Hunter","08 9326 6239","judy.hunter@westernpower.com.au","NO","NO","YES","YES","NO","NO","CBD","Urban","Short rural","Long rural",null,"Western Power (D)"]
[null,"Western Power (T)","Western Power (T)",18540492861,"WA","Electricity","Transmission","Revenue cap","Financial","June",12,4,"x","transmission determination","363 Wellington Street",null,"PERTH","WA",6000,"GPO Box L921",null,"PERTH","WA",6842,"Judy Hunter","08 9326 6239","judy.hunter@westernpower.com.au","n/a","n/a","n/a","n/a","n/a",null,"CBD","Urban","Short rural","Long rural",null,"Western Power (T)"]
[]
[]
[null,null,null,null,null,null,null,null,null,null,null,null,null,null,null,null,null,null,null,null,null,null,null,null,"For EB & Reset RINs only",null,null,null,null,"For AARs only"]
[null,"The Reg Year Ending (dms_RYE) must be set to the last year of the regulatory period. For forecast data is is usually (FRCP_y5) for actual it is a single year (CRY). For historical actual data the RYE will need to be set manually in the business details sheet by setting the dms_Multiyear_flag to 1 and putting the correct value in 'dms_Specified_FinalYear. See cells C67:C68",null,null,null,null,{"$f":"IF(dms_RPT=\"financial\",VALUE(LEFT(CRCP_y1,4)-1)&\"-\"&TEXT(VALUE(RIGHT(CRCP_y1,2)-1),\"00\"),VALUE(LEFT(CRCP_y1,4)-1))","v":"2014-15"},null,null,null,null,null,null,"Drop down selector box for CA & Reset RINs.","For CA & Reset RINs only",null,null,null,null,null,null,null,null,null,"for DNSP only",null,null,null,null,"For DNSPs only",null,null,null,null,null,"Reason for interruption","dms_Reason_Interruption_Detailed","dms_Reason_Interruption","dms_STPIS_Exclusion_List","dms_020301_ProjectType_List","dms_020302_ProjectType_List"]
[null,"dms_Model_List ","DELETE NR 'CRY' IF NOT AN ANNUAL RIN (EB, CA , ARR)",null,"dms_RYE_Formula_Result",null,null,null,null,null,null,null,null,"dms_0203_ProjectType","dms_020303_01_UOM","dms_020501_01_UOM","dms_020501_02_UOM","dms_020501_03_UOM","dms_020501_04_UOM","dms_020603_01_UOM","dms_020701_01_UOM","dms_020701_02_UOM","dms_040102_01_UOM","dms_040102_04_UOM","dms_030601_01_UOM","dms_030601_02_UOM","dms_030701_01_UOM","dms_030702_01_UOM","dms_030703_01_UOM","dms_030605_UOM","dms_03060703_UOM",null,null,null,null,"Animal","Animal impact","Animal","Weather","New substation establishment","New line on new route - single circuit"]
[null,"ARR","ANNUAL REPORTING STATEMENT",null,{"$f":"LEFT(dms_SingleYear_FinalYear_Result,2)&RIGHT(dms_SingleYear_FinalYear_Result,2)","v":"2018"},"=LEFT(dms_SingleYear_FinalYear_Result,2)&RIGHT(dms_SingleYear_FinalYear_Result,2)",null,"Formula errors are OK",null,null,null,null,null,"New line on new route - single circuit","Circuit line length in km","0's","0's","0's","0's","0's","km","km","0's","days","minutes/customer","minutes/customer","Customer / km","%","km","number","number",null,null,null,null,null,"Animal nesting/burrowing, etc and other","Asset failure","Equipment failure","Capacity upgrade","New line on new route - dual circuit"]
[null,"CA","CATEGORY ANALYSIS",null,{"$f":"LEFT(dms_SingleYear_FinalYear_Result,2)&RIGHT(dms_SingleYear_FinalYear_Result,2)","v":"2018"},"=LEFT(dms_SingleYear_FinalYear_Result,2)&RIGHT(dms_SingleYear_FinalYear_Result,2)",null,"Formula errors are OK",null,null,null,null,null,"New line on new route - dual circuit","Circuit line length in km","0's","0's","0's","0's","0's","0's","0's","0's","0's","minutes/customer","minutes/customer","MWh/customer","Number of spans",null,"number","number",null,null,null,null,null,"Other","Other","Operational error","Voltage upgrade","New line on new route - other"]
[null,"CPI","CPI",null,null,null,null,null,null,null,null,null,null,"New line on new route - other","Circuit line length in km","MVA added","MVA added","MVA added","MVA added","0's","km","km","0's","$0s","interruptions/customer","interruptions/customer","kVA / customer","Number of spans",null,"number","number",null,null,null,null,"Asset failure","LV","Overloads","Vegetation","Other","Line rebuild over existing route - single circuit"]
[null,"EB","ECONOMIC BENCHMARKING",null,{"$f":"LEFT(dms_SingleYear_FinalYear_Result,2)&RIGHT(dms_SingleYear_FinalYear_Result,2)","v":"2018"},"=LEFT(dms_SingleYear_FinalYear_Result,2)&RIGHT(dms_SingleYear_FinalYear_Result,2)",null,"Formula errors are OK",null,null,null,null,null,"Line rebuild over existing route - single circuit","Circuit line length in km","0's","0's","0's","0's","0's","km","km","$0s","0's","interruptions/customer","interruptions/customer",null,"Number of spans",null,"number","number",null,null,null,null,null,"Distribution substation","Planned","Animals",null,"Line rebuild over existing route - dual circuit"]
[null,"PTRM","POST TAX REVENUE MODEL",null,{"$f":"LEFT(dms_MultiYear_FinalYear_Result,2)&RIGHT(dms_MultiYear_FinalYear_Result,2)","v":"2025"},"=LEFT(dms_MultiYear_FinalYear_Result,2)&RIGHT(dms_MultiYear_FinalYear_Result,2)",null,null,null,null,null,null,null,"Line rebuild over existing route - dual circuit","Number","total spend $0s","total spend $0s","total spend $0s","total spend $0s","(per cent)","0's","0's",null,null,null,null,null,"Number of spans",null,"number","(per cent)",null,null,null,null,null,"HV","Network business","Third party impacts",null,"Reconductor - Single circuit"]
[null,"Reset","REGULATORY REPORTING STATEMENT",null,{"$f":"LEFT(dms_MultiYear_FinalYear_Result,2)&RIGHT(dms_MultiYear_FinalYear_Result,2)","v":"2025"},"=LEFT(dms_MultiYear_FinalYear_Result,2)&RIGHT(dms_MultiYear_FinalYear_Result,2)",null,"Formula errors are OK",null,null,null,null,null,"Reconductor - Single circuit","Number","net circuit km added","net circuit km added","net circuit km added","net circuit km added",null,"years","years",null,null,null,null,null,"Years",null,"number",null,null,null,null,null,null,"Zone substation","Third party","Transmission failure",null,"Reconductor - Dual circuit"]
[null,"RFM","ROLL FORWARD MODEL",null,{"$f":"LEFT(dms_CRCP_FinalYear_Result,2)&RIGHT(dms_CRCP_FinalYear_Result,2)","v":"2018"},"=LEFT(dms_CRCP_FinalYear_Result,2)&RIGHT(dms_CRCP_FinalYear_Result,2)",null,null,null,null,null,null,null,"Reconductor - Dual circuit","Number","total spend $0s","total spend $0s","total spend $0s","total spend $0s",null,null,null,null,null,null,null,null,"Years",null,"number",null,null,null,null,null,null,"Subtransmission","Unknown","Load shedding",null,"Reconductor - Other"]
[null,"WACC","WEIGHTED AVERAGE COST OF CAPITAL",null,{"$f":"LEFT(dms_MultiYear_FinalYear_Result,2)&RIGHT(dms_MultiYear_FinalYear_Result,2)","v":"2025"},"=LEFT(dms_MultiYear_FinalYear_Result,2)&RIGHT(dms_MultiYear_FinalYear_Result,2)",null,null,null,null,null,null,null,"Other",null,"net circuit km added","net circuit km added","net circuit km added","net circuit km added",null,null,null,null,null,null,null,null,"Trees",null,"number",null,null,null,null,null,"Other","insert description of 'other'","Vegetation","Inter-distributor connection failure",null,"Line upgrade - raising/retensoring"]
[null,null,null,null,null,null,null,null,null,null,null,null,null,null,null,"total spend $0s","total spend $0s","total spend $0s","total spend $0s",null,null,null,null,null,null,null,null,"Trees",null,"number",null,null,null,null,null,"Overloads","-","Weather","Other",null,"Line upgrade - voltage upgrade"]
[null,"dms_DataQuality_List",null,null,null,null,null,null,null,null,null,null,null,null,null,"0's",null,"$0s",null,null,null,null,null,null,null,null,null,"Defects",null,"number",null,null,null,null,null,"Planned","-","2 - STPIS Exclusion (3.3)(a)",null,null,"Line upgrade - capacity"]
[null,"Actual",null,null,null,null,null,null,null,null,null,null,null,null,null,"0's",null,null,null,null,null,null,null,null,null,null,null,"Defects",null,"number",null,null,null,null,null,"Network business","Network error","3 - STPIS Exclusion (3.3)(a)",null,null,"String spare circuit"]
[null,"Estimate",null,null,null,null,null,null,null,null,null,null,null,null,null,"0's",null,null,null,null,null,null,null,null,null,null,null,"Spans",null,"number",null,null,null,null,null,null,"Switching and protection error","4 - STPIS Exclusion (3.3)(a)",null,null,"Other"]
[null,"Consolidated",null,null,null,null,null,null,null,null,null,null,null,null,null,"$0s",null,null,null,null,null,null,null,null,null,null,null,"km",null,"(per cent)",null,null,null,null,null,"Third party","Fire","5 - STPIS Exclusion (3.3)(a)"]
[null,"Recast",null,null,null,null,null,null,null,null,null,null,null,null,null,null,null,null,null,null,null,null,null,null,null,null,null,"Spans",null,"(per cent)","",null,null,null,null,null,"Other","6 - STPIS Exclusion (3.3)(a)"]
[null,"Public",null,null,null,null,null,null,null,null,null,null,null,null,null,null,null,null,null,null,null,null,null,null,null,null,null,null,null,null,null,null,null,null,null,null,"Dig-in","7 - STPIS Exclusion (3.3)(a)"]
[null,null,null,null,null,null,null,null,null,null,null,null,null,null,null,null,null,null,null,null,null,null,null,null,null,null,null,null,null,null,null,null,null,null,null,null,"Unauthorised access"]
[null,"For all files either AER or business needs to be able to specify the type of submission","For PTRM & RFM templates we must provide a choice in case they change their form of control - otherwise it is drawn from the business specific lookup table above.",null,null,null,null,null,null,null,null,null,null,null,"For PTRM files - this field set the text for the named range \"DMS_Xfactor\" which in all cases is simply the text \"x factors\" - this saves putting in each old gas PTRM file ",null,null,null,null,null,null,null,null,null,"for TNSP only",null,null,null,null,null,null,null,null,null,null,null,"Vehicle impact"]
[null,"dms_SourceList","dms_FormControl_Choices",null,null,null,null,null,null,null,null,null,null,null,"DMS_Xfactor",null,null,null,null,null,null,null,null,null,"dms_030601_01_UOM",null,"dms_030701_01_UOM","dms_030702_01_UOM",null,null,null,null,null,null,null,"Unknown","Unknown"]
[null,"After appeal","Revenue cap",null,null,null,null,null,null,null,null,null,null,null,"x factors",null,null,null,null,null,null,null,null,null,"%",null,"Number of spans","km",null,null,null,null,null,null,null,"Vegetation","Blow-in/Fall-in - NSP responsibility"]
[null,"Draft decision","Revenue yield",null,null,null,null,null,null,null,null,null,null,null,null,null,null,null,null,null,null,null,null,null,"number",null,"Years","%",null,null,null,null,null,null,null,null,"Grow-in - NSP responsibility"]
[null,"Final decision","Weighted average price cap",null,null,null,null,null,null,null,null,null,null,null,null,null,null,null,null,null,null,null,null,null,"number",null,"Trees","km",null,null,null,null,null,null,null,null,"Blow-in/Fall-in - Other responsible party"]
[null,"PTRM update 1",null,null,null,null,null,null,null,null,null,null,null,null,null,null,null,null,null,null,null,null,null,null,"%",null,"Defects","number",null,null,null,null,null,null,null,null,"Grow-in - Other responsible party"]
[null,"PTRM update 2",null,null,null,null,null,null,null,null,null,null,null,null,null,null,null,null,null,null,null,null,null,null,"number",null,"Number of spans",null,null,null,null,null,null,null,null,"Weather"]
[null,"PTRM update 3",null,null,null,null,null,null,null,null,null,null,null,null,null,null,null,null,null,null,null,null,null,null,"number",null,"km",null,null,null,null,null,null,null,null,"2 - STPIS Exclusion (3.3)(a)"]
[null,"PTRM update 4",null,null,null,null,null,null,null,null,null,null,null,null,null,null,null,null,null,null,null,null,null,null,"%",null,"km",null,null,null,null,null,null,null,null,"3 - STPIS Exclusion (3.3)(a)"]
[null,"PTRM update 5",null,null,null,null,null,null,null,null,null,null,null,null,null,null,null,null,null,null,null,null,null,null,"number",null,"Number of spans",null,null,null,null,null,null,null,null,"4 - STPIS Exclusion (3.3)(a)"]
[null,"PTRM update 6",null,null,null,null,null,null,null,null,null,null,null,null,null,null,null,null,null,null,null,null,null,null,"number",null,null,null,null,null,null,null,null,null,null,"5 - STPIS Exclusion (3.3)(a)"]
[null,"PTRM update 7",null,null,null,null,null,null,null,null,null,null,null,null,null,null,null,null,null,null,null,null,null,null,"%",null,null,null,null,null,null,null,null,null,null,"6 - STPIS Exclusion (3.3)(a)"]
[null,"Regulatory proposal",null,null,null,null,null,null,null,null,null,null,null,null,null,null,null,null,null,null,null,null,null,null,"number",null,null,null,null,null,null,null,null,null,null,"7 - STPIS Exclusion (3.3)(a)"]
[null,"Reporting",null,null,null,null,null,null,null,null,null,null,null,null,null,null,null,null,null,null,null,null,null,null,"%"]
[null,"Revised regulatory proposal",null,null,null,null,null,null,null,null,null,null,null,null,null,null,null,null,null,null,null,null,null,null,"number"]
[null,null,null,null,null,null,null,null,null,null,null,null,null,null,null,null,null,null,null,null,null,null,null,null,"%"]
[null,null,null,null,null,null,null,null,null,null,null,null,null,null,null,null,null,null,null,null,null,null,null,null,"number"]
[]
[]
[]
[null,"These are indeces and lookup values for various dates. All step from the value placed in FRCP_y1 on the business and other details worksheet",{"$f":"IF(dms_FifthFeeder_flag_NSP=\"NO\",\"This NSP has only 4 feeder categories\",\"This NSP has 5 feeder categories\")","v":"This NSP has 5 feeder categories"},null,null,null,null,null,null,null,null,"These date tables are currently used in the Recast templates to provide column headings and conditional formatting"]
[null,"dms_FRCPlength_Num_List","dms_FinalYear_List","dms_CRCPlength_Num_List","dms_CFinalYear_List","dms_FRCP_years",null,"dms_CRCP_years",null,"dms_CRCP_index",null,"CRY from input cell on business sheet","CRY - financial","dms_FinYears","CRY calendar","dms_CalYears",null,null,null,null,null,null,null,null,"These \"row descriptions\" are the column headings in the various templates but become row descriptions in the ETL process"]
[null,1,"dms_FRCP_y1",1,"CRCP_y1",{"$f":"FRCP_y1","v":"2020-21"},"dms_FRCP_y1",{"$f":"IF(dms_RPT=\"financial\",VALUE(LEFT(dms_FRCP_y1,4)-1)&\"-\"&TEXT(VALUE(MID(dms_FRCP_y1,3,2)),\"00\"),VALUE(LEFT(dms_FRCP_y1,4)-1))","v":"2019-20"},"dms_CRCP_yZ",1,null,{"$f":"CRY","v":"2017-18"},{"$f":"VALUE(LEFT(CRY,4))&\"-\"&TEXT(MID(CRY,3,2)+1,\"00\")","v":"2017-18"},"dms_CRYf_y1",{"$f":"VALUE(LEFT(CRY,4)+1)","v":2018},"dms_CRYc_y1",null,null,null,null,null,null,null,null,null,"Table 6.3 sustained interruptions - row descriptions"]
[null,2,"dms_FRCP_y2",2,"CRCP_y2",{"$f":"IF(dms_RPT=\"financial\",VALUE(LEFT(dms_FRCP_y1,4)+1)&\"-\"&TEXT(VALUE(RIGHT(dms_FRCP_y1,2)+1),\"00\"),VALUE(LEFT(dms_FRCP_y1,4)+1))","v":"2021-22"},"dms_FRCP_y2",{"$f":"IF(dms_RPT=\"financial\",VALUE(LEFT(dms_CRCP_yZ,4)-1)&\"-\"&TEXT(VALUE(MID(dms_CRCP_yZ,3,2)),\"00\"),VALUE(LEFT(dms_CRCP_yZ,4)-1))","v":"2018-19"},"dms_CRCP_yY",2,null,null,{"$f":"VALUE(LEFT(dms_CRYf_y1,4)+1)&\"-\"&TEXT(MID(dms_CRYf_y1,3,2)+2,\"00\")","v":"2018-19"},"dms_CRYf_y2",{"$f":"VALUE(LEFT(dms_CRYc_y1,4)+1)","v":2019},"dms_CRYc_y2",null,null,null,null,null,null,null,null,null,"dms_060301_CustNo_Affected_Row","dms_060301_Avg_Duration_Sustained_Int_Row","dms_060301_Effect_unplanned_SAIDI_Row","dms_060301_Effect_unplanned_SAIFI_Row"]
[null,3,"=IF(dms_Model=\"ARR\",15,9)",3,"=IF(dms_Model=\"ARR\",15,9)",{"$f":"IF(dms_RPT=\"financial\",VALUE(LEFT(dms_FRCP_y2,4)+1)&\"-\"&TEXT(VALUE(RIGHT(dms_FRCP_y2,2)+1),\"00\"),VALUE(LEFT(dms_FRCP_y2,4)+1))","v":"2022-23"},"dms_FRCP_y3",{"$f":"IF(dms_RPT=\"financial\",VALUE(LEFT(dms_CRCP_yY,4)-1)&\"-\"&TEXT(VALUE(MID(dms_CRCP_yY,3,2)),\"00\"),VALUE(LEFT(dms_CRCP_yY,4)-1))","v":"2017-18"},"dms_CRCP_yX",3,null,null,{"$f":"VALUE(LEFT(dms_CRYf_y2,4)+1)&\"-\"&TEXT(MID(dms_CRYf_y2,3,2)+2,\"00\")","v":"2019-20"},"dms_CRYf_y3",{"$f":"VALUE(LEFT(dms_CRYc_y2,4)+1)","v":2020},"dms_CRYc_y3",null,null,null,null,null,null,null,null,null,"Number of customers affected by the interruption","Average duration of sustained customer interruption","Effect on unplanned SAIDI","Effect on unplanned SAIFI"]
[null,4,"dms_FRCP_y4",4,"CRCP_y4",{"$f":"IF(dms_RPT=\"financial\",VALUE(LEFT(dms_FRCP_y3,4)+1)&\"-\"&TEXT(VALUE(RIGHT(dms_FRCP_y3,2)+1),\"00\"),VALUE(LEFT(dms_FRCP_y3,4)+1))","v":"2023-24"},"dms_FRCP_y4",{"$f":"IF(dms_RPT=\"financial\",VALUE(LEFT(dms_CRCP_yX,4)-1)&\"-\"&TEXT(VALUE(MID(dms_CRCP_yX,3,2)),\"00\"),VALUE(LEFT(dms_CRCP_yX,4)-1))","v":"2016-17"},"dms_CRCP_yW",4,null,null,{"$f":"VALUE(LEFT(dms_CRYf_y3,4)+1)&\"-\"&TEXT(MID(dms_CRYf_y3,3,2)+2,\"00\")","v":"2020-21"},"dms_CRYf_y4",{"$f":"VALUE(LEFT(dms_CRYc_y3,4)+1)","v":2021},"dms_CRYc_y4"]
[null,5,"dms_FRCP_y5",5,"CRCP_y5",{"$f":"IF(dms_RPT=\"financial\",VALUE(LEFT(dms_FRCP_y4,4)+1)&\"-\"&TEXT(VALUE(RIGHT(dms_FRCP_y4,2)+1),\"00\"),VALUE(LEFT(dms_FRCP_y4,4)+1))","v":"2024-25"},"dms_FRCP_y5",{"$f":"IF(dms_RPT=\"financial\",VALUE(LEFT(dms_CRCP_yW,4)-1)&\"-\"&TEXT(VALUE(MID(dms_CRCP_yW,3,2)),\"00\"),VALUE(LEFT(dms_CRCP_yW,4)-1))","v":"2015-16"},"dms_CRCP_yV",5,null,null,{"$f":"VALUE(LEFT(dms_CRYf_y4,4)+1)&\"-\"&TEXT(MID(dms_CRYf_y4,3,2)+2,\"00\")","v":"2021-22"},"dms_CRYf_y5",{"$f":"VALUE(LEFT(dms_CRYc_y4,4)+1)","v":2022},"dms_CRYc_y5"]
[null,6,"dms_FRCP_y6",6,"CRCP_y6",{"$f":"IF(dms_RPT=\"financial\",VALUE(LEFT(dms_FRCP_y5,4)+1)&\"-\"&TEXT(VALUE(RIGHT(dms_FRCP_y5,2)+1),\"00\"),VALUE(LEFT(dms_FRCP_y5,4)+1))","v":"2025-26"},"dms_FRCP_y6",{"$f":"IF(dms_RPT=\"financial\",VALUE(LEFT(dms_CRCP_yV,4)-1)&\"-\"&TEXT(VALUE(MID(dms_CRCP_yV,3,2)),\"00\"),VALUE(LEFT(dms_CRCP_yV,4)-1))","v":"2014-15"},"dms_CRCP_yU",6,null,null,{"$f":"VALUE(LEFT(dms_CRYf_y5,4)+1)&\"-\"&TEXT(MID(dms_CRYf_y5,3,2)+2,\"00\")","v":"2022-23"},"dms_CRYf_y6",{"$f":"VALUE(LEFT(dms_CRYc_y5,4)+1)","v":2023},"dms_CRYc_y6"]
[null,7,"dms_FRCP_y7",7,"CRCP_y7",{"$f":"IF(dms_RPT=\"financial\",VALUE(LEFT(dms_FRCP_y6,4)+1)&\"-\"&TEXT(VALUE(RIGHT(dms_FRCP_y6,2)+1),\"00\"),VALUE(LEFT(dms_FRCP_y6,4)+1))","v":"2026-27"},"dms_FRCP_y7",{"$f":"IF(dms_RPT=\"financial\",VALUE(LEFT(dms_CRCP_yU,4)-1)&\"-\"&TEXT(VALUE(MID(dms_CRCP_yU,3,2)),\"00\"),VALUE(LEFT(dms_CRCP_yU,4)-1))","v":"2013-14"},"dms_CRCP_yT",7,null,null,{"$f":"VALUE(LEFT(dms_CRYf_y6,4)+1)&\"-\"&TEXT(MID(dms_CRYf_y6,3,2)+2,\"00\")","v":"2023-24"},"dms_CRYf_y7",{"$f":"VALUE(LEFT(dms_CRYc_y6,4)+1)","v":2024},"dms_CRYc_y7",null,null,null,null,null,null,null,null,null,"Table 6.1 telephone answering - row descriptions and start date"]
[null,8,"dms_FRCP_y8",8,"CRCP_y8",{"$f":"IF(dms_RPT=\"financial\",VALUE(LEFT(dms_FRCP_y7,4)+1)&\"-\"&TEXT(VALUE(RIGHT(dms_FRCP_y7,2)+1),\"00\"),VALUE(LEFT(dms_FRCP_y7,4)+1))","v":"2027-28"},"dms_FRCP_y8",{"$f":"IF(dms_RPT=\"financial\",VALUE(LEFT(dms_CRCP_yT,4)-1)&\"-\"&TEXT(VALUE(MID(dms_CRCP_yT,3,2)),\"00\"),VALUE(LEFT(dms_CRCP_yT,4)-1))","v":"2012-13"},"dms_CRCP_yS",8,null,null,{"$f":"VALUE(LEFT(dms_CRYf_y7,4)+1)&\"-\"&TEXT(MID(dms_CRYf_y7,3,2)+2,\"00\")","v":"2024-25"},"dms_CRYf_y8",{"$f":"VALUE(LEFT(dms_CRYc_y7,4)+1)","v":2025},"dms_CRYc_y8",null,null,null,null,null,null,null,null,null,"dms_060101_Rows","dms_060102_Rows","dms_060101_StartDateTxt"]
[null,9,"dms_FRCP_y9",9,"CRCP_y9",{"$f":"IF(dms_RPT=\"financial\",VALUE(LEFT(dms_FRCP_y8,4)+1)&\"-\"&TEXT(VALUE(RIGHT(dms_FRCP_y8,2)+1),\"00\"),VALUE(LEFT(dms_FRCP_y8,4)+1))","v":"2028-29"},"dms_FRCP_y9",{"$f":"IF(dms_RPT=\"financial\",VALUE(LEFT(dms_CRCP_yS,4)-1)&\"-\"&TEXT(VALUE(MID(dms_CRCP_yS,3,2)),\"00\"),VALUE(LEFT(dms_CRCP_yS,4)-1))","v":"2011-12"},"dms_CRCP_yR",9,null,null,{"$f":"VALUE(LEFT(dms_CRYf_y8,4)+1)&\"-\"&TEXT(MID(dms_CRYf_y8,3,2)+2,\"00\")","v":"2025-26"},"dms_CRYf_y9",{"$f":"VALUE(LEFT(dms_CRYc_y8,4)+1)","v":2026},"dms_CRYc_y9",null,null,null,null,null,null,null,null,null,"Total number of calls \n(after removing excluded events)","Number of calls answered within 30 seconds \n(after excluding excluded events) ",{"$f":"dms_060701_StartDateTxt","v":"1-Jul-2017"}]
[null,10,"=IFERROR(IF(dms_Model=\"ARR\",(MAX(0,dms_0608_LastRow-dms_0608_OffsetRows)),\"not an ARR\"),\"6.8 not present\")",10,"=IFERROR(IF(dms_Model=\"ARR\",(MAX(0,dms_0608_LastRow-dms_0608_OffsetRows)),\"not an ARR\"),\"6.8 not present\")",{"$f":"IF(dms_RPT=\"financial\",VALUE(LEFT(dms_FRCP_y9,4)+1)&\"-\"&TEXT(VALUE(RIGHT(dms_FRCP_y9,2)+1),\"00\"),VALUE(LEFT(dms_FRCP_y9,4)+1))","v":"2029-30"},"dms_FRCP_y10",{"$f":"IF(dms_RPT=\"financial\",VALUE(LEFT(dms_CRCP_yR,4)-1)&\"-\"&TEXT(VALUE(MID(dms_CRCP_yR,3,2)),\"00\"),VALUE(LEFT(dms_CRCP_yR,4)-1))","v":"2010-11"},"dms_CRCP_yQ",10,null,null,{"$f":"VALUE(LEFT(dms_CRYf_y9,4)+1)&\"-\"&TEXT(MID(dms_CRYf_y9,3,2)+2,\"00\")","v":"2026-27"},"dms_CRYf_y10",{"$f":"VALUE(LEFT(dms_CRYc_y9,4)+1)","v":2027},"dms_CRYc_y10"]
[null,11,"dms_FRCP_y11",11,"CRCP_y11",{"$f":"IF(dms_RPT=\"financial\",VALUE(LEFT(dms_FRCP_y10,4)+1)&\"-\"&TEXT(VALUE(RIGHT(dms_FRCP_y10,2)+1),\"00\"),VALUE(LEFT(dms_FRCP_y10,4)+1))","v":"2030-31"},"dms_FRCP_y11",{"$f":"IF(dms_RPT=\"financial\",VALUE(LEFT(dms_CRCP_yQ,4)-1)&\"-\"&TEXT(VALUE(MID(dms_CRCP_yQ,3,2)),\"00\"),VALUE(LEFT(dms_CRCP_yQ,4)-1))","v":"2009-10"},"dms_CRCP_yP",11,null,null,{"$f":"VALUE(LEFT(dms_CRYf_y10,4)+1)&\"-\"&TEXT(MID(dms_CRYf_y10,3,2)+2,\"00\")","v":"2027-28"},"dms_CRYf_y11",{"$f":"VALUE(LEFT(dms_CRYc_y10,4)+1)","v":2028},"dms_CRYc_y11"]
[null,12,"dms_FRCP_y12",12,"CRCP_y12",{"$f":"IF(dms_RPT=\"financial\",VALUE(LEFT(dms_FRCP_y11,4)+1)&\"-\"&TEXT(VALUE(RIGHT(dms_FRCP_y11,2)+1),\"00\"),VALUE(LEFT(dms_FRCP_y11,4)+1))","v":"2031-32"},"dms_FRCP_y12",{"$f":"IF(dms_RPT=\"financial\",VALUE(LEFT(dms_CRCP_yP,4)-1)&\"-\"&TEXT(VALUE(MID(dms_CRCP_yP,3,2)),\"00\"),VALUE(LEFT(dms_CRCP_yP,4)-1))","v":"2008-09"},"dms_CRCP_yO",12,null,null,{"$f":"VALUE(LEFT(dms_CRYf_y11,4)+1)&\"-\"&TEXT(MID(dms_CRYf_y11,3,2)+2,\"00\")","v":"2028-29"},"dms_CRYf_y12",{"$f":"VALUE(LEFT(dms_CRYc_y11,4)+1)","v":2029},"dms_CRYc_y12"]
[null,13,"dms_FRCP_y13",13,"CRCP_y13",{"$f":"IF(dms_RPT=\"financial\",VALUE(LEFT(dms_FRCP_y12,4)+1)&\"-\"&TEXT(VALUE(RIGHT(dms_FRCP_y12,2)+1),\"00\"),VALUE(LEFT(dms_FRCP_y12,4)+1))","v":"2032-33"},"dms_FRCP_y13",{"$f":"IF(dms_RPT=\"financial\",VALUE(LEFT(dms_CRCP_yO,4)-1)&\"-\"&TEXT(VALUE(MID(dms_CRCP_yO,3,2)),\"00\"),VALUE(LEFT(dms_CRCP_yO,4)-1))","v":"2007-08"},"dms_CRCP_yN",13,null,null,{"$f":"VALUE(LEFT(dms_CRYf_y12,4)+1)&\"-\"&TEXT(MID(dms_CRYf_y12,3,2)+2,\"00\")","v":"2029-30"},"dms_CRYf_y13",{"$f":"VALUE(LEFT(dms_CRYc_y12,4)+1)","v":2030},"dms_CRYc_y13",null,null,null,null,null,null,null,null,null,null,null,null,null,null,"dms_0603_FeederList",{"$f":"INDEX(dms_FeederName_1,MATCH(dms_TradingName,dms_TradingName_List))","v":"CBD"},{"$f":"INDEX(dms_FeederName_2,MATCH(dms_TradingName,dms_TradingName_List))","v":"Urban"},{"$f":"INDEX(dms_FeederName_3,MATCH(dms_TradingName,dms_TradingName_List))","v":"Short rural"},{"$f":"INDEX(dms_FeederName_4,MATCH(dms_TradingName,dms_TradingName_List))","v":"Long rural"}]
[null,14,"dms_FRCP_y14",14,"CRCP_y14",{"$f":"IF(dms_RPT=\"financial\",VALUE(LEFT(dms_FRCP_y13,4)+1)&\"-\"&TEXT(VALUE(RIGHT(dms_FRCP_y13,2)+1),\"00\"),VALUE(LEFT(dms_FRCP_y13,4)+1))","v":"2033-34"},"dms_FRCP_y14",{"$f":"IF(dms_RPT=\"financial\",VALUE(LEFT(dms_CRCP_yN,4)-1)&\"-\"&TEXT(VALUE(MID(dms_CRCP_yN,3,2)),\"00\"),VALUE(LEFT(dms_CRCP_yN,4)-1))","v":"2006-07"},"dms_CRCP_yM",14,null,null,{"$f":"VALUE(LEFT(dms_CRYf_y13,4)+1)&\"-\"&TEXT(MID(dms_CRYf_y13,3,2)+2,\"00\")","v":"2030-31"},"dms_CRYf_y14",{"$f":"VALUE(LEFT(dms_CRYc_y13,4)+1)","v":2031},"dms_CRYc_y14",null,null,null,null,null,null,null,null,null,"Table 6.7.1 - daily performance data - unplanned - MAIFI  -- row descriptions and header named range values"]
[null,15,"dms_FRCP_y15",15,"CRCP_y15",{"$f":"IF(dms_RPT=\"financial\",VALUE(LEFT(dms_FRCP_y14,4)+1)&\"-\"&TEXT(VALUE(RIGHT(dms_FRCP_y14,2)+1),\"00\"),VALUE(LEFT(dms_FRCP_y14,4)+1))","v":"2034-35"},"dms_FRCP_y15",{"$f":"IF(dms_RPT=\"financial\",VALUE(LEFT(dms_CRCP_yM,4)-1)&\"-\"&TEXT(VALUE(MID(dms_CRCP_yM,3,2)),\"00\"),VALUE(LEFT(dms_CRCP_yM,4)-1))","v":"2005-06"},"dms_CRCP_yL",15,null,null,{"$f":"VALUE(LEFT(dms_CRYf_y14,4)+1)&\"-\"&TEXT(MID(dms_CRYf_y14,3,2)+2,\"00\")","v":"2031-32"},"dms_CRYf_y15",{"$f":"VALUE(LEFT(dms_CRYc_y14,4)+1)","v":2032},"dms_CRYc_y15",null,null,null,null,null,null,null,null,null,"These headings (Lists) are determined from the INDEX/MATCH function on the NSP selected on the Business & other details sheet"]
[null,null,null,null,null,null,null,null,null,null,null,null,{"$f":"VALUE(LEFT(dms_CRYf_y15,4)+1)&\"-\"&TEXT(MID(dms_CRYf_y15,3,2)+2,\"00\")","v":"2032-33"},"dms_CRYf_y16",{"$f":"VALUE(LEFT(dms_CRYc_y15,4)+1)","v":2033},"dms_CRYc_y16",null,null,null,null,null,null,null,null,"dms_060701_Feeder_Header_Lvl4",{"$f":"INDEX(dms_FeederName_1,MATCH(dms_TradingName,dms_TradingName_List))","v":"CBD"},{"$f":"INDEX(dms_FeederName_1,MATCH(dms_TradingName,dms_TradingName_List))","v":"CBD"},{"$f":"INDEX(dms_FeederName_2,MATCH(dms_TradingName,dms_TradingName_List))","v":"Urban"},{"$f":"INDEX(dms_FeederName_2,MATCH(dms_TradingName,dms_TradingName_List))","v":"Urban"},{"$f":"INDEX(dms_FeederName_3,MATCH(dms_TradingName,dms_TradingName_List))","v":"Short rural"},{"$f":"INDEX(dms_FeederName_3,MATCH(dms_TradingName,dms_TradingName_List))","v":"Short rural"},{"$f":"INDEX(dms_FeederName_4,MATCH(dms_TradingName,dms_TradingName_List))","v":"Long rural"},{"$f":"INDEX(dms_FeederName_4,MATCH(dms_TradingName,dms_TradingName_List))","v":"Long rural"},{"$f":"IF((INDEX(dms_FeederName_5,MATCH(dms_TradingName,dms_TradingName_List))=0),\"Network\",(INDEX(dms_FeederName_5,MATCH(dms_TradingName,dms_TradingName_List))))","v":"Network"},{"$f":"IF((INDEX(dms_FeederName_5,MATCH(dms_TradingName,dms_TradingName_List))=0),\"Network\",(INDEX(dms_FeederName_5,MATCH(dms_TradingName,dms_TradingName_List))))","v":"Network"},"Network","Network"]
[null,"These are drop down lists for businesses to select the correct FRCP_y1 on the business and other details worksheet.\nThis also populates the column headings in the worksheets",null,null,null,null,null,null,null,null,null,null,{"$f":"VALUE(LEFT(dms_CRYf_y16,4)+1)&\"-\"&TEXT(MID(dms_CRYf_y16,3,2)+2,\"00\")","v":"2033-34"},"dms_CRYf_y17",{"$f":"VALUE(LEFT(dms_CRYc_y16,4)+1)","v":2034},"dms_CRYc_y17"]
[null,"dms_RCP_fyear_list","dms_CRY_ListF","dms_CRY_ListC","dms_RCP_cyear_list","dms_FRCP_fyear_list","dms_FRCP_ListF","dms_FRCP_ListC","dms_FRCP_cyear_list",null,null,null,{"$f":"VALUE(LEFT(dms_CRYf_y17,4)+1)&\"-\"&TEXT(MID(dms_CRYf_y17,3,2)+2,\"00\")","v":"2034-35"},"dms_CRYf_y18",{"$f":"VALUE(LEFT(dms_CRYc_y17,4)+1)","v":2035},"dms_CRYc_y18",null,null,null,null,null,null,null,null,"dms_060701_Rows","All events","After removing excluded events","All events","After removing excluded events","All events","After removing excluded events","All events","After removing excluded events","All events","After removing excluded events","All events","After removing excluded events"]
[null,"dms_fy1","2005-06","2006","dms_cy1","dms_frcp_fy1","2010-11",2011,"dms_crcp_cy1",null,null,null,{"$f":"VALUE(LEFT(dms_CRYf_y18,4)+1)&\"-\"&TEXT(MID(dms_CRYf_y18,3,2)+2,\"00\")","v":"2035-36"},"dms_CRYf_y19",{"$f":"VALUE(LEFT(dms_CRYc_y18,4)+1)","v":2036},"dms_CRYc_y19",null,null,null,null,null,null,null,null,null,"the number of column headings changes from 10 to 12 depending on the number of feeder categories for the NSP"]
[null,"dms_fy2","2006-07","2007","dms_cy2","dms_frcp_fy2","2011-12",2012,"dms_crcp_cy2",null,null,null,{"$f":"VALUE(LEFT(dms_CRYf_y19,4)+1)&\"-\"&TEXT(MID(dms_CRYf_y19,3,2)+2,\"00\")","v":"2036-37"},"dms_CRYf_y20",{"$f":"VALUE(LEFT(dms_CRYc_y19,4)+1)","v":2037},"dms_CRYc_y20"]
[null,"dms_fy3","2007-08","2008","dms_cy3","dms_frcp_fy3","2012-13",2013,"dms_crcp_cy3"]
[null,"dms_fy4","2008-09","2009","dms_cy4","dms_frcp_fy4","2013-14",2014,"dms_crcp_cy4"]
[null,"dms_fy5","2009-10",2010,"dms_cy5","dms_frcp_fy5","2014-15",2015,"dms_crcp_cy5"]
[null,"dms_fy6","2010-11",2011,"dms_cy6","dms_frcp_fy6","2015-16",2016,"dms_crcp_cy6",null,null,null,null,null,null,null,null,null,null,null,null,null,null,null,null,"Table 6.8.1 - row descriptions"]
[null,"dms_fy7","2011-12",2012,"dms_cy7","dms_frcp_fy7","2016-17",2017,"dms_crcp_cy7",null,null,null,null,null,null,null,null,null,null,null,null,null,null,null,null,"dms_060801_01_Rows","dms_060801_02_Rows","dms_060801_03_Rows","dms_060801_04_Rows"]
[null,"dms_fy8","2012-13",2013,"dms_cy8","dms_frcp_fy8","2017-18",2018,"dms_crcp_cy8",null,null,"2005-06","2006",null,null,null,null,null,null,null,null,null,null,null,null,"Number of interruptions","Duration of interruptions","Total unplanned minutes off supply","Effect on unplanned MAIFI"]
[null,"dms_fy9","2013-14",2014,"dms_cy9","dms_frcp_fy9","2018-19",2019,"dms_crcp_cy9",null,null,"2006-07","2007"]
[null,"dms_fy10","2014-15",2015,"dms_cy10","dms_frcp_fy10","2019-20",2020,"dms_crcp_cy10",null,null,"2007-08","2008"]
[null,"dms_fy11","2015-16",2016,"dms_cy11","dms_frcp_fy11","2020-21",2021,"dms_crcp_cy11",null,null,"2008-09","2009"]
[null,"dms_fy12","2016-17",2017,"dms_cy12","dms_frcp_fy12","2021-22",2022,"dms_crcp_cy12",null,null,"2009-10",2010]
[null,"dms_fy13","2017-18",2018,"dms_cy13","dms_frcp_fy13","2022-23",2023,"dms_crcp_cy13",null,null,"2010-11",2011,null,null,null,null,null,null,null,null,null,null,null,null,"Table 7.9.4 - market impact component - row descriptions"]
[null,"dms_fy14","2018-19",2019,"dms_cy14","dms_frcp_fy14","2023-24",2024,"dms_crcp_cy14",null,null,"2011-12",2012,null,null,null,null,null,null,null,null,null,null,null,"dms_070904_01_Rows","without exclusions","with exclusions"]
[null,"dms_fy15","2019-20",2020,"dms_cy15","dms_frcp_fy15","2024-25",2025,"dms_crcp_cy15",null,null,"2012-13",2013]
[null,"dms_fy16","2020-21",2021,"dms_cy16",null,null,null,null,null,null,"2013-14",2014]
[null,"dms_fy17","2021-22",2022,"dms_cy17",null,null,null,null,null,null,"2014-15",2015]
[null,"dms_fy18","2022-23",2023,"dms_cy18",null,null,null,null,null,null,"2015-16",2016]
[null,"dms_fy19","2023-24",2024,"dms_cy19",null,null,null,null,null,null,"2016-17",2017,null,null,null,null,null,null,null,null,null,null,null,null,"Use this to add to existing files"]
[null,"dms_fy20","2024-25",2025,"dms_cy20",null,null,null,null,null,null,"2017-18",2018,null,null,null,null,null,null,null,null,null,null,null,null,"ARR's  6.8 STPIS exclusions"]
[null,null,null,null,null,null,null,null,null,null,null,"2018-19",2019,null,null,null,null,null,null,null,null,null,null,null,null,"dms_060801_Event_Date","dms_060801_OutageID","dms_060801_FeederID","dms_060801_FeederClass","dms_060801_CauseID","dms_060801_01_Values","dms_060801_02_Values","dms_060801_03_Values","dms_060801_Excl_Cat","dms_060801_04_Values"]
[null,null,null,null,null,null,null,null,null,null,null,"2019-20",2020]
[null,null,null,null,null,null,null,null,null,null,null,"2020-21",2021]
[null,null,null,null,null,null,null,null,null,null,null,"2021-22",2022,null,null,null,null,null,null,null,null,null,null,null,null,"CA 6.3 sustained interruptions"]
[null,null,null,null,null,null,null,null,null,null,null,"2022-23",2023,null,null,null,null,null,null,null,null,null,null,null,null,"dms_060301_Event_Date","dms_060301_Event_Time","dms_060301_AssetID","dms_060301_FeederClass","dms_060301_Reason","dms_060301_DetailedReason","dms_060301_CustNo_Affected_Values","dms_060301_Avg_Duration_Sustained_Int_Values","dms_060301_Effect_unplanned_SAIDI_Values","dms_060301_Effect_unplanned_SAIFI_Values","dms_060301_MED"]
[null,null,null,null,null,null,null,null,null,null,null,"2023-24",2024]
[null,null,null,null,null,null,null,null,null,null,null,"2024-25",2025]
[null,null,null,null,null,null,null,null,null,null,null,"2025-26",2026]
[null,null,null,null,null,null,null,null,null,null,null,"2026-27",2027]
[null,null,null,null,null,null,null,null,null,null,null,"2027-28",2028]
[null,null,null,null,null,null,null,null,null,null,null,"2028-29",2029]
[null,null,null,null,null,null,null,null,null,null,null,"2029-30",2030]
[null,null,null,null,null,null,null,null,null,null,null,"2030-31",2031]
[null,null,null,null,null,null,null,null,null,null,null,"2031-32",2032]
[null,null,null,null,null,null,null,null,null,null,null,"2032-33",2033]
[null,null,null,null,null,null,null,null,null,null,null,"2033-34",2034]
[null,null,null,null,null,null,null,null,null,null,null,"2034-35",2035]
[null,null,null,null,null,null,null,null,null,null,null,"2035-36",2036]

{"sheet":"Instructions","index":1,"n_rows":27,"n_cols":4,"rows_kept":27,"cut":false,"hidden":false,"merged":[[7,2,7,3],[1,1,1,5],[2,1,2,5],[3,2,3,4],[4,2,4,4],[5,2,5,4],[25,2,25,3],[26,2,26,4],[8,2,8,4],[10,2,10,4],[12,2,12,4],[20,2,20,4],[22,2,22,4],[24,2,24,4]]}
[]
[null,"Transmission Network Service Provider"]
[null,"Historical Reporting RIN Template"]
[null,null,"This template is to be used by Powerlink to fulfil its reporting obligations to the AER."]
[null,null,"INSTRUCTIONS"]
[null,null,"Complete the Business & other details worksheet before entering data or values in any other worksheets. The Business & other details worksheet is linked to other worksheets within the workbook and automatically generates certain column headings and conditional formatting."]
[]
[null,null,"Identifying CONFIDENTIAL INFORMATION:\n\nPlease use the macro at the top of each \nworksheet to identify confidential information. \n\n"]
[null,null,"-Do this by selecting the cell or cells that contain confidential information and then run the Mark selection CONFIDENTIAL macro. This will format the cells a specific colour that is identified by the AER's database which in turn marks that information as confidential.\n\n-To reverse this, select the cell or cells and run the Return selection to NON-CONFIDENTIAL macro."]
[]
[null,null,"UNITS OF MEASURE\n\nAll amounts are to be unrounded and reported on a one for one basis: that is 1000 is to be entered as '1000'. Applicable units of measure may be identified in the table column headings or row descriptors.\n\n\n"]
[]
[null,null,"COLOUR CODING OF INPUT / NON-INPUT CELLS:"]
[null,null,null,"Yellow = Input cell (mandatory)"]
[null,null,null,"Darker yellow = input cell (mandatory)"]
[null,null,null,"Orange = input cell (if data available)"]
[null,null,null,"Grey = Not applicable/No inputs required"]
[null,null,null,". \nPLEASE DO NOT ENTER TEXT into cells that are to contain numeric data."]
[]
[]
[null,null,"WORKSHEET NAVIGATION\n\nMany tables in the worksheets have been \"grouped\" to allow for easy navigation. To ungroup or group data use the outline symbols in the left margin of excel (for Row groupings) or above the columns (for column groupings). \n\n\n\n"]
[]
[null,null,"RETURNING COMPLETED RESPONSES\n\nPlease return four (4) files to the AER: \n1. A confidential version which must contain a complete set of all responses with confidential information marked using the Mark selected cells CONFIDENTIAL macro and which has been completed using the locked template file provided by the AER. \n\n2. An actual and an estimate version with confidential information marked using the Mark selection CONFIDENTIAL macro and which has been completed using the locked template file provided by the AER.\n\n3. A public version with confidential information either removed completely or aggregated in some form together with writtten consent to disclose the public version of the response.\n\n\nUse the drop down box on the Business and other details worksheet to identify the file as either confidential ('consolidated') or public. "]
[]
[null,null,"SUBMITTING AMENDED DATA TO THE AER\n\nIf an NSP wishes to correct data previously submitted to the AER it should resubmit that data using the original completed submission as the starting point. Please make any necessary changes to the data. Data that is not being amended should be left unchanged. \n\nNSPs must identify the reason for the amendments in the Amendment Reason box on the  Business and other details worksheet. NSPs may provide further details regarding any amendments in the Amendments worksheet. \n\n."]
[null,null,"NSP may use Amended Data macro \nto highlight cells that contain amended data.\nNB: if data is also CONFIDENTIAL, re-apply \nthe Confidentiality macro after applying the \nAmended macro"]
[null,null,"Please resubmit two (2) files - a confidential version and a public version of the amended submission to the AER"]

{"sheet":"Contents","index":2,"n_rows":26,"n_cols":12,"rows_kept":26,"cut":false,"hidden":false,"merged":[]}
[null,"REGULATORY REPORTING STATEMENT"]
[null,{"$f":"INDEX(dms_TradingNameFull_List,MATCH(dms_TradingName,dms_TradingName_List))","v":"Queensland Electricity Transmission Corporation Limited trading as Powerlink Queensland"}]
[null,{"$f":"CONCATENATE((LOOKUP(dms_Model,dms_Model_List,dms_Worksheet_List))&\" \"&CRY)","v":"CATEGORY ANALYSIS 2017-18"}]
[null,"CONTENTS"]
[]
[]
[null,null,null,null,"1. Business details",null,null,null,null,null,null,"2. Expenditure"]
[]
[]
[]
[]
[]
[]
[]
[]
[]
[]
[]
[]
[]
[]
[]
[]
[]
[]
[null,null,null,null,"4. Network information",null,null,null,null,null,null,"5. Network information"]

{"sheet":"Business & other details","index":3,"n_rows":143,"n_cols":9,"rows_kept":143,"cut":false,"hidden":false,"merged":[[59,2,59,8],[18,4,18,7],[19,2,19,3],[19,4,19,7],[22,2,22,3],[22,4,22,7],[23,4,23,7],[24,2,24,3],[24,4,24,7],[32,1,32,8],[57,2,57,3],[58,4,58,8],[7,1,7,8],[11,1,11,8],[13,2,13,4],[14,2,14,4],[17,2,17,3],[17,4,17,7]]}
[null,{"$f":"IF(dms_DataQuality=\"backcast\",INDEX(dms_Worksheet_List,MATCH(dms_Model,dms_Model_List))&\" BACKCAST\",INDEX(dms_Worksheet_List,MATCH(dms_Model,dms_Model_List)))","v":"CATEGORY ANALYSIS"}]
[null,{"$f":"INDEX(dms_TradingNameFull_List,MATCH(dms_TradingName,dms_TradingName_List))","v":"Queensland Electricity Transmission Corporation Limited trading as Powerlink Queensland"}]
[null,{"$f":"IF(SUM(dms_SingleYear_Model)>0,CONCATENATE(CRY),CONCATENATE(FRCP_y1,\" to \",dms_MultiYear_FinalYear_Result))","v":"2017-18"}]
[null,"BUSINESS & OTHER DETAILS"]
[]
[]
[null,"Instructions"]
[null,"Complete the following business details regulatory template before entering data or values in any other regulatory template. This regulatory template is linked to other cells within the spreadsheet and automatically generates column headings and conditional formatting to distinguish business specific input and non-input cells. "]
[]
[null,"SUBMISSION PARTICULARS INPUT SHEETS"]
[]
[null,"ENTITY DETAILS"]
[]
[null,"Short name","Powerlink",null,null,"Select business name from drop down list first"]
[null,"ACN / ABN",{"$f":"INDEX(dms_ABN_List,MATCH(dms_TradingName,dms_TradingName_List))","v":82078849233}]
[]
[]
[null,"Business address","Address 1",null,"33 Harold St"]
[null,null,null,"Address 2",{"$f":"IF(ISBLANK(INDEX(dms_Addr2_List,MATCH(dms_TradingName,dms_TradingName_List))),\"\",(INDEX(dms_Addr2_List,MATCH(dms_TradingName,dms_TradingName_List))))","v":""}]
[null,null,"Suburb",null,"Virginia"]
[null,null,null,"State","Qld","p/code",4014]
[]
[null,"Postal address","Address 1",null,"PO Box 1193"]
[null,null,null,"Address 2",{"$f":"IF(ISBLANK(INDEX(dms_PAddr2_List,MATCH(dms_TradingName,dms_TradingName_List))),\"\",(INDEX(dms_PAddr2_List,MATCH(dms_TradingName,dms_TradingName_List))))","v":""}]
[null,null,"Suburb",null,"Virginia"]
[null,null,null,"State","Qld","p/code",4014]
[]
[]
[null,"Contact name/s","Jennifer Harris"]
[null,"Contact phone/s","07 3860 2667"]
[null,"Contact email address/s","jharris@powerlink.com.au"]
[]
[null,"REGULATORY CONTROL PERIODS"]
[]
[null,"Forthcoming regulatory control period","2020-21",{"$f":"dms_FRCP_y2","v":"2021-22"},{"$f":"dms_FRCP_y3","v":"2022-23"},{"$f":"dms_FRCP_y4","v":"2023-24"},{"$f":"dms_FRCP_y5","v":"2024-25"}]
[null,null,{"$f":"dms_FRCP_y6","v":"2025-26"},{"$f":"dms_FRCP_y7","v":"2026-27"},{"$f":"dms_FRCP_y8","v":"2027-28"},{"$f":"dms_FRCP_y9","v":"2028-29"},{"$f":"dms_FRCP_y10","v":"2029-30"}]
[]
[]
[null,"Current regulatory control period",{"$f":"dms_CRCP_FirstYear_Result","v":"2015-16"},{"$f":"IF(dms_RPT=\"financial\",VALUE(LEFT(CRCP_y1,4)+1)&\"-\"&TEXT(MID(CRCP_y1,3,2)+2,\"00\"),VALUE(LEFT(CRCP_y1,4)+1))","v":"2016-17"},{"$f":"IF(dms_RPT=\"financial\",VALUE(LEFT(CRCP_y1,4)+2)&\"-\"&TEXT(VALUE(MID(CRCP_y1,3,2)+3),\"00\"),VALUE(LEFT(CRCP_y1,4)+2))","v":"2017-18"},{"$f":"IF(dms_RPT=\"financial\",VALUE(LEFT(CRCP_y1,4)+3)&\"-\"&TEXT(MID(CRCP_y1,3,2)+4,\"00\"),VALUE(LEFT(CRCP_y1,4)+3))","v":"2018-19"},{"$f":"IF(dms_RPT=\"financial\",VALUE(LEFT(CRCP_y1,4)+4)&\"-\"&TEXT(MID(CRCP_y1,3,2)+5,\"00\"),VALUE(LEFT(CRCP_y1,4)+4))","v":"2019-20"}]
[null,null,{"$f":"IF(dms_RPT=\"financial\",VALUE(LEFT(CRCP_y1,4)+5)&\"-\"&TEXT(MID(CRCP_y1,3,2)+6,\"00\"),VALUE(LEFT(CRCP_y1,4)+5))","v":"2020-21"},{"$f":"IF(dms_RPT=\"financial\",VALUE(LEFT(CRCP_y1,4)+6)&\"-\"&TEXT(MID(CRCP_y1,3,2)+7,\"00\"),VALUE(LEFT(CRCP_y1,4)+6))","v":"2021-22"},{"$f":"IF(dms_RPT=\"financial\",VALUE(LEFT(CRCP_y1,4)+7)&\"-\"&TEXT(MID(CRCP_y1,3,2)+8,\"00\"),VALUE(LEFT(CRCP_y1,4)+7))","v":"2022-23"},{"$f":"IF(dms_RPT=\"financial\",VALUE(LEFT(CRCP_y1,4)+8)&\"-\"&TEXT(MID(CRCP_y1,3,2)+9,\"00\"),VALUE(LEFT(CRCP_y1,4)+8))","v":"2023-24"},{"$f":"IF(dms_RPT=\"financial\",VALUE(LEFT(CRCP_y1,4)+9)&\"-\"&TEXT(MID(CRCP_y1,3,2)+10,\"00\"),VALUE(LEFT(CRCP_y1,4)+9))","v":"2024-25"}]
[null,null,{"$f":"IF(dms_RPT=\"financial\",VALUE(LEFT(CRCP_y1,4)+10)&\"-\"&TEXT(MID(CRCP_y1,3,2)+11,\"00\"),VALUE(LEFT(CRCP_y1,4)+10))","v":"2025-26"},{"$f":"IF(dms_RPT=\"financial\",VALUE(LEFT(CRCP_y1,4)+11)&\"-\"&TEXT(MID(CRCP_y1,3,2)+12,\"00\"),VALUE(LEFT(CRCP_y1,4)+11))","v":"2026-27"},{"$f":"IF(dms_RPT=\"financial\",VALUE(LEFT(CRCP_y1,4)+12)&\"-\"&TEXT(MID(CRCP_y1,3,2)+13,\"00\"),VALUE(LEFT(CRCP_y1,4)+12))","v":"2027-28"},{"$f":"IF(dms_RPT=\"financial\",VALUE(LEFT(CRCP_y1,4)+13)&\"-\"&TEXT(MID(CRCP_y1,3,2)+14,\"00\"),VALUE(LEFT(CRCP_y1,4)+13))","v":"2028-29"},{"$f":"IF(dms_RPT=\"financial\",VALUE(LEFT(CRCP_y1,4)+14)&\"-\"&TEXT(MID(CRCP_y1,3,2)+15,\"00\"),VALUE(LEFT(CRCP_y1,4)+14))","v":"2029-30"}]
[]
[]
[null,"Previous regulatory control period",{"$f":"IF(dms_RPT=\"financial\",VALUE(LEFT(PRCP_y2,4)-1)&\"-\"&TEXT(VALUE(MID(PRCP_y2,3,2)),\"00\"),VALUE(LEFT(PRCP_y2,4)-1))","v":"2010-11"},{"$f":"IF(dms_RPT=\"financial\",VALUE(LEFT(PRCP_y3,4)-1)&\"-\"&TEXT(VALUE(MID(PRCP_y3,3,2)),\"00\"),VALUE(LEFT(PRCP_y3,4)-1))","v":"2011-12"},{"$f":"IF(dms_RPT=\"financial\",VALUE(LEFT(PRCP_y4,4)-1)&\"-\"&TEXT(VALUE(MID(PRCP_y4,3,2)),\"00\"),VALUE(LEFT(PRCP_y4,4)-1))","v":"2012-13"},{"$f":"IF(dms_RPT=\"financial\",VALUE(LEFT(PRCP_y5,4)-1)&\"-\"&TEXT(VALUE(RIGHT(PRCP_y5,2)-1),\"00\"),VALUE(LEFT(PRCP_y5,4)-1))","v":"2013-14"},{"$f":"IF(dms_RPT=\"financial\",VALUE(LEFT(CRCP_y1,4)-1)&\"-\"&TEXT(VALUE(RIGHT(CRCP_y1,2)-1),\"00\"),VALUE(LEFT(CRCP_y1,4)-1))","v":"2014-15"}]
[]
[]
[]
[null,"Commencing regulatory year","2017-18","CRY"]
[]
[null,"Last completed regulatory year","2017-18","dms_FinalYear"]
[]
[]
[]
[null,null,"IF THIS IS AN ABC RIN - make sure the the named range CRY is applied and the named range dms_dollar_nom_UOM is applied"]
[null,null,"IF THIS IS A RESET RIN - make sure the named ranges CRY and dms_dollar_nom_UOM are NOT present in the workbook"]
[null,null,"FOR ABC RINS THAT SPAN MULTIPLE YEARS - make sure MultiYear Flag is set and final year entered as required"]
[]
[null,"Source","Reporting",null,"Please select the correct submission type from the dropdown list."]
[null,"Data quality (actual, estimate, public, consolidated)","Public",null,"Use Consolidated for Consolidated Confidential version\nUse Public for Consolidated Public version"]
[null,"Amended RIN submission - amendment reason","."]
[null,"Submission Date","29/10/18","dms_SubmissionDate","Please enter date this file submitted to AER (dd/mm/yyyy)"]
[null,"EBSS - First application of scheme in forthcoming period?","No"]
[null,"Sector",{"$f":"INDEX(dms_Sector_List,MATCH(dms_TradingName,dms_TradingName_List))","v":"Electricity"},"dms_Sector","=INDEX(dms_Sector_List,MATCH(dms_TradingName,dms_TradingName_List))"]
[null,"Segment",{"$f":"INDEX(dms_Segment_List,MATCH(dms_TradingName,dms_TradingName_List))","v":"Transmission"},"dms_Segment","=INDEX(dms_Segment_List,MATCH(dms_TradingName,dms_TradingName_List))"]
[null,"Regulatory Year Ending",{"$f":"IF(dms_MultiYear_Flag=1,LEFT(dms_Specified_FinalYear,2)&RIGHT(dms_Specified_FinalYear,2),INDEX(dms_RYE_Formula_Result,MATCH(dms_Model,dms_Model_List)))","v":"2018"},"dms_RYE","=IF(dms_MultiYear_Flag=1,LEFT(dms_Specified_FinalYear,2)&RIGHT(dms_Specified_FinalYear,2),INDEX(dms_RYE_Formula_Result,MATCH(dms_Model,dms_Model_List)))"]
[null,"Reporting Period Type",{"$f":"INDEX(dms_RPT_List,MATCH(dms_TradingName,dms_TradingName_List))","v":"Financial"},"dms_RPT","=INDEX(dms_RPT_List,MATCH(dms_TradingName,dms_TradingName_List))"]
[null,"Model or RIN Type","CA","dms_Model","Drop down selection"]
[null,"EB/CA Unit of Measure for Monetary Values","$0s","dms_dollar_nom_UOM","If the cover sheet is attached to an ABC RIN make the NAMED RANGE on this field is set"]
[null,"Security Classification","Public","dms_Classification","Always Public"]
[null,"Jurisdiction",{"$f":"INDEX(dms_JurisdictionList,MATCH(dms_TradingName,dms_TradingName_List))","v":"Qld"},"dms_Jurisdiction","=INDEX(dms_JurisdictionList,MATCH(dms_TradingName,dms_TradingName_List))"]
[null,"FOR RESET RINS"]
[null,"CRY-1",{"$f":"VALUE(LEFT(CRY,4)-1)","v":2016},"dms_Left_CRY_minus1","=VALUE(LEFT(CRY,4)-1)",null,"Not used in Reset RINS but may be useful in other cases"]
[null,"Dollar $ real month",{"$f":"INDEX(dms_RPTMonth_List,MATCH(dms_TradingName,dms_TradingName_List))","v":"June"},"dms_RPTMonth","=INDEX(dms_RPTMonth_List,MATCH(dms_TradingName,dms_TradingName_List))"]
[null,"Dollar $ real  (the last month before the FRCP_y1)",{"$f":"IF(SUM(dms_SingleYear_Model)>0,CONCATENATE(dms_RPTMonth)&\" \"&VALUE((LEFT(CRY,2))&RIGHT(CRY,2)),CONCATENATE(dms_RPTMonth)&\" \"&VALUE((LEFT(dms_CRCP_FinalYear_Result,2)&RIGHT(dms_CRCP_FinalYear_Result,2))))","v":"June 2018"},"dms_DollarReal","=IF(SUM(dms_SingleYear_Model)>0,CONCATENATE(dms_RPTMonth)&\" \"&VALUE((LEFT(CRY,2))&RIGHT(CRY,2)),CONCATENATE(dms_RPTMonth)&\" \"&VALUE((LEFT(dms_CRCP_FinalYear_Result,2)&RIGHT(dms_CRCP_FinalYear_Result,2))))"]
[null,"Dollar $ real previous year (PRCP_y5)",{"$f":"IF(SUM(dms_SingleYear_Model)>0,CONCATENATE(dms_RPTMonth)&\" \"&VALUE(((LEFT(CRY,2))&RIGHT(CRY,2))-1),CONCATENATE(dms_RPTMonth)&\" \"&VALUE(((LEFT(dms_CRCP_FirstYear_Result,2)&RIGHT(dms_CRCP_FirstYear_Result,2))))-1)","v":"June 2017"},"dms_DollarReal_Prev","=IF(SUM(dms_SingleYear_Model)>0,CONCATENATE(dms_RPTMonth)&\" \"&VALUE(((LEFT(CRY,2))&RIGHT(CRY,2))-1),CONCATENATE(dms_RPTMonth)&\" \"&VALUE(((LEFT(dms_CRCP_FirstYear_Result,2)&RIGHT(dms_CRCP_FirstYear_Result,2))))-1)"]
[null,"FOR PTRM/ RFMs"]
[null,"Form of control",{"$f":"INDEX(dms_FormControl_List,MATCH(dms_TradingName,dms_TradingName_List))","v":"Revenue cap"},"dms_FormControl","=INDEX(dms_FormControl_List,MATCH(dms_TradingName,dms_TradingName_List))"]
[null,"FOR EB RINS"]
[null,"Calendar Year for table 3.6 data",{"$f":"VALUE(dms_RYE)-1","v":2017},"dms_0306_Year","=VALUE(dms_RYE)-1"]
[null,"FOR ABC RINS THAT SPAN MULTIPLE YEARS"]
[null,"Is this a multi year ABC RIN?","No"]
[null,"Backcast Multiyear EB, CA or ARR?",{"$f":"IF(dms_MultiYear_ResponseFlag=\"No\",0,1)","v":0},"dms_MultiYear_Flag","This is set from the answer provided above"]
[null,null,{"$f":"IF(dms_MultiYear_Flag=1,\"Specify Final Reg Year here eg 2016 or 2015-16\",\"not a Multi Reg Year submission\")","v":"not a Multi Reg Year submission"},"dms_Specified_FinalYear","The result here is returned to dms_CRCP_FinalYear_Result if response to Q in C73 is \"yes\" and dms_MultiYear_Flag is set to 1"]
[null,"This block works out the various RYE's for ALL RIN types and MODELS"]
[null,"Single Year Model T/F",{"$f":"IF(dms_Model=\"EB\",1,0)","v":0},"dms_EB"]
[null,null,{"$f":"IF(dms_Model=\"CA\",1,0)","v":1},"dms_CA","=dms_SingleYear_Model"]
[null,null,{"$f":"IF(dms_Model=\"ARR\",1,0)","v":0},"dms_ARR"]
[null,"Single Year Final Year Reference","CRY","dms_SingleYear_FinalYear_Ref","This is the reference for EB, CA & ARR RINs"]
[null,"Single Year Final Year Result",{"$f":"IFERROR(IF(SUM(dms_SingleYear_Model)<>0,(INDIRECT(dms_SingleYear_FinalYear_Ref)),\"not a single year RIN\"),\"CRY not present\")","v":"2017-18"},"dms_SingleYear_FinalYear_Result","=IFERROR(IF(SUM(dms_SingleYear_Model)<>0,(INDIRECT(dms_SingleYear_FinalYear_Ref)),\"not a single year RIN\"),\"CRY not present\")"]
[null,"FRCP length in years",{"$f":"INDEX(dms_FRCPlength_List,MATCH(dms_TradingName,dms_TradingName_List))","v":5},"dms_FRCPlength_Num","=INDEX(dms_FRCPlength_List,MATCH(dms_TradingName,dms_TradingName_List))"]
[null,"Multi Year Final Year Reference",{"$f":"INDEX(dms_FinalYear_List,MATCH(dms_FRCPlength_Num,dms_FRCPlength_Num_List))","v":"dms_FRCP_y5"},"dms_MultiYear_FinalYear_Ref","=INDEX(dms_FinalYear_List,MATCH(dms_FRCPlength_Num,dms_FRCPlength_Num_List))"]
[null,"Multi Year Final Year Result",{"$f":"IF(dms_MultiYear_Flag=0,INDIRECT(dms_MultiYear_FinalYear_Ref),dms_Specified_FinalYear)","v":"2024-25"},"dms_MultiYear_FinalYear_Result","=IF(dms_MultiYear_Flag=0,INDIRECT(dms_MultiYear_FinalYear_Ref),dms_Specified_FinalYear)",null,null,null,"Formula errors OK"]
[null,"CRCP length in years",{"$f":"INDEX(dms_CRCPlength_List,MATCH(dms_TradingName,dms_TradingName_List))","v":5},"dms_CRCPlength_Num","=INDEX(dms_CRCPlength_List,MATCH(dms_TradingName,dms_TradingName_List))"]
[null,"CRCP Final Year Reference",{"$f":"INDEX(dms_CFinalYear_List,MATCH(dms_CRCPlength_Num,dms_CRCPlength_Num_List))","v":"CRCP_y5"},"dms_CRCP_FinalYear_Ref","=INDEX(dms_CFinalYear_List,MATCH(dms_CRCPlength_Num,dms_CRCPlength_Num_List))"]
[null,"CRCP First Year Result",{"$f":"INDEX(dms_CRCP_years,MATCH(dms_CRCPlength_Num,dms_CRCP_index))","v":"2015-16"},"dms_CRCP_FirstYear_Result","=INDEX(dms_CRCP_years,MATCH(dms_CRCPlength_Num,dms_CRCP_index))"]
[null,"CRCP Final Year Result",{"$f":"IF(dms_MultiYear_Flag=0,(IF(SUM(dms_SingleYear_Model)>0,CRY,dms_CRCP_yZ)),dms_Specified_FinalYear)","v":"2017-18"},"dms_CRCP_FinalYear_Result","=IF(dms_MultiYear_Flag=0,(IF(SUM(dms_SingleYear_Model)>0,CRY,dms_CRCP_yZ)),dms_Specified_FinalYear)"]
[null,"FOR CATEGORY ANALYSIS FILES"]
[null,"How many rows in tables 6.3 sustained interruptions?",{"$f":"IF(dms_Model<>\"CA\",\"not a CA\",\"Is a CA\")","v":"Is a CA"},"dms_060301_MaxRows only returns a valid value when cover sheet is attached to a CA file"]
[null,"Table 6.3.1 - last row reference",{"$f":"IFERROR(IF(dms_Model=\"CA\",\nLOOKUP(2,1/(dms_060301_Avg_Duration_Sustained_Int_Values<>\"\"),\n(ROW(dms_060301_Avg_Duration_Sustained_Int_Values))),\n\"not a CA\"),\"no data in 6.3 or 6.3 not present\")","v":"no data in 6.3 or 6.3 not present"},"dms_060301_LastRow","=IFERROR(IF(dms_Model=\"CA\",LOOKUP(2,1/(dms_060301_Avg_Duration_Sustained_Int_Values<>\"\"),(ROW(dms_060301_Avg_Duration_Sustained_Int_Values))),\"not a CA\"),\"6.3 not present\")"]
[null,"Table 6.3.1 - max number rows",{"$f":"IFERROR(IF(dms_Model=\"CA\",(dms_060301_LastRow-15),\"not a CA\"),\"no data in 6.3 or 6.3 not present\")","v":"no data in 6.3 or 6.3 not present"},"dms_060301_MaxRows","=IFERROR(IF(dms_Model=\"CA\",(dms_060301_LastRow-15),\"not a CA\"),\"6.3 not present\")"]
[null,"Table 6.6.3 - Public lighting repair - no. business days",{"$f":"INDEX(dms_663_List,MATCH(dms_TradingName,dms_TradingName_List))","v":5},"dms_663","=INDEX(dms_663_List,MATCH(dms_TradingName,dms_TradingName_List))"]
[null,"FOR ARR or RESET RINS"]
[null,"How many rows in tables 6.1 or 6.7?  (leap year?)","insert dms_LeapYear NR if required","dms_LeapYear is used to determine dms_060701_Max_Rows BUT it is only found on worksheet 6.1 or 6.7 and the date value in the cell is used to determine whether it is a leap year"]
[null,"Is dms_LeapYear named range present?",{"$f":"IFERROR(IF(dms_LeapYear,\"yes\"),\"no\")","v":"no"}]
[null,"Table 6.7.1 - includes a leap year?",{"$f":"\nIFERROR(IF(MONTH(DATE(YEAR(dms_LeapYear),2,29))=2,\"is a leap year\",\"not a leap year\"),\n\"dms_LeapYear not present\")","v":"dms_LeapYear not present"},"dms_LeapYear_Result","=IFERROR(IF(MONTH(DATE(YEAR(dms_LeapYear),2,29))=2,\"is a leap year\",\"not a leap year\"),\"dms_LeapYear not present\")"]
[null,"Table 6.7.1 - Last row  (leap year/ non leap year)",{"$f":"\nIFERROR(IF(dms_Model=\"ARR\",\nIF(dms_LeapYear_Result=\"is a leap year\",366,365),\n(IF(dms_Model=\"Reset\",\n(IF(dms_LeapYear_Result=\"is a leap year\",1827,1826)),\n\"not a relevant RIN type\"))),\n\"dms_LeapYear in either 6.1 or 6.7 not present\")","v":"not a relevant RIN type"},"dms_060701_MaxRows","=IFERROR(IF(dms_Model=\"ARR\",IF(dms_LeapYear_Result=\"is a leap year\",366,365),(IF(dms_Model=\"Reset\",(IF(dms_LeapYear_Result=\"is a leap year\",1827,1826)),\"not a relevant RIN type\"))),\"dms_LeapYear in either 6.1 or 6.7 not present\")"]
[null,"How many columns in 6.7?   (4 or 5 feeder categories)",{"$f":"IF(dms_FifthFeeder_flag_NSP=\"NO\",\"This NSP has only 4 feeder categories\",\"This NSP has 5 feeder categories\")","v":"This NSP has 5 feeder categories"}]
[null,"Table 6.7.1 - Last column (# of feeder categories > 4)",{"$f":"IF(dms_FifthFeeder_flag_NSP=\"NO\",10,12)","v":12},"dms_060701_MaxCols","=IF(dms_FifthFeeder_flag_NSP=\"NO\",8,10)"]
[null,"Table 6.7.1 - Number of offset rows",{"$f":"IF(dms_Model=\"ARR\",15,9)","v":9},"dms_060701_OffsetRows","=IF(dms_Model=\"ARR\",15,9)"]
[null,"Start date for telephone answering in 6.1 or 6.7?",null,null,"Using 060701 as naming standard not 060101 "]
[null,"Table 6.1.1 and 6.7.1 - Start Date as Text",{"$f":"IF(SUM(dms_SingleYear_Model)>0,(CONCATENATE(IF(LEN(CRY)=4,\"1-Jan-\",\"1-Jul-\"),LEFT(CRY,4))),(CONCATENATE(IF(LEN(CRCP_y4)=4,\"1-Jan-\",\"1-Jul-\"),LEFT(CRCP_y4,4))))","v":"1-Jul-2017"},"dms_060701_StartDateTxt","=IF(SUM(dms_SingleYear_Model)>1,(CONCATENATE(IF(LEN(CRY)=4,\"1-Jan-\",\"1-Jul-\"),LEFT(CRY,4))),(CONCATENATE(IF(LEN(CRCP_y4)=4,\"1-Jan-\",\"1-Jul-\"),LEFT(CRCP_y4,4))))"]
[null,"Table 6.1.1 and 6.7.1 - Start Date as Date Value",{"$f":"DATEVALUE(dms_060701_StartDateTxt)","v":42917},"dms_060701_StartDateVal","=DATEVALUE(dms_060701_StartDateTxt)"]
[null,"FOR ARRs"]
[null,"How many rows in table 6.8?","insert dms_060801_StartCell NR if required","dms_060801_StartCell is only found on worksheet 6.8 and is used to determine the starting date for the date range"]
[null,"Table 6.8 - Number of offset rows",{"$f":"IFERROR(IF(dms_Model=\"ARR\",(ROW(dms_060801_StartCell)-1),\"not an ARR\"),\"6.8 not present\")","v":"not an ARR"},"dms_0608_OffsetRows","=IFERROR(IF(dms_Model=\"ARR\",(ROW(dms_060801_StartCell)-1),\"not an ARR\"),\"6.8 not present\")"]
[null,"Table 6.8 - Last row",{"$f":"IFERROR(IF(dms_060801_StartCell<>\"\",IF(dms_Model=\"ARR\",(LOOKUP(2,1/(dms_060801_01_Values<>\"\"),(ROW(dms_060801_01_Values)))),\"not an ARR\"),0),\"6.8 not present\")","v":"6.8 not present"},"dms_0608_LastRow","=IFERROR(IF(dms_060801_StartCell<>\"\",IF(dms_Model=\"ARR\",(LOOKUP(2,1/(dms_060801_01_Values<>\"\"),(ROW(dms_060801_01_Values)))),\"not an ARR\"),0),\"6.8 not present\")"]
[null,"Table 6.8 - MaxRows",{"$f":"IFERROR(IF(dms_Model=\"ARR\",(MAX(0,dms_0608_LastRow-dms_0608_OffsetRows)),\"not an ARR\"),\"6.8 not present\")","v":"not an ARR"},"dms_060801_MaxRows","=IFERROR(IF(dms_Model=\"ARR\",(MAX(0,dms_0608_LastRow-dms_0608_OffsetRows)),\"not an ARR\"),\"6.8 not present\")"]
[null,"FOR TNSP RESET RINS"]
[null,"Table 7.9.4 only appears in TNSPs Reset RIN"]
[null,"Table 7.9.4 - first year",{"$f":"LEFT(PRCP_y3,4)","v":"2012"},"dms_070904_Start_Year","=LEFT(PRCP_y3,4)"]
[null,"FOR SUBSET FILES"]
[null,"Is this Submission File a Subset File","NO","dms_Partial"]
[null,"MISC"]
[null,"Distribution Determination Reference",{"$f":"INDEX(dms_DeterminationRef_List,MATCH(dms_TradingName,dms_TradingName_List))","v":"transmission determination"},"dms_DeterminationRef"]
[null,"CBD Feeder for this business",{"$f":"INDEX(dms_CBD_flag,MATCH(dms_TradingName,dms_TradingName_List))","v":"n/a"},"dms_CBD_flag_NSP"]
[null,"Urban Feeder for this business",{"$f":"INDEX(dms_Urban_flag,MATCH(dms_TradingName,dms_TradingName_List))","v":"n/a"},"dms_Urban_flag_NSP"]
[null,"Short rural Feeder for this business",{"$f":"INDEX(dms_ShortRural_flag,MATCH(dms_TradingName,dms_TradingName_List))","v":"n/a"},"dms_ShortRural_flag_NSP"]
[null,"Long rural Feeder for this business",{"$f":"INDEX(dms_LongRural_flag,MATCH(dms_TradingName,dms_TradingName_List))","v":"n/a"},"dms_LongRural_flag_NSP"]
[null,"Fifth Feeder Category (eg. TasNetworks (D))",{"$f":"INDEX(dms_FeederType_5_flag,MATCH(dms_TradingName,dms_TradingName_List))","v":"n/a"},"dms_FifthFeeder_flag_NSP","=INDEX(dms_FeederType_5_flag,MATCH(dms_TradingName,dms_TradingName_List))"]
[]
[null,"DISCARD FILES"]
[null,"discard this record?","NO","dms_DISCARD","If record is to be discarded from DB set this flag to YES"]
[]
[null,"USES NAMED RANGES FLAG","yes","dms_Defined_Names_Used"]
[]
[null,"REGULATORY YEARS FOR MULTI RYE SUBMISSIONS"]
[null,"Multiple RYE flag","NO","dms_Multi_RYE_flag"]
[null,null,"Manually specify RYE","Named ranges to apply"]
[null,null,2013,"dms_RYE_01"]
[null,null,2014,"dms_RYE_02"]
[null,null,2015,"dms_RYE_03"]
[null,null,2016,"dms_RYE_04"]
[null,null,2017,"dms_RYE_05"]

{"sheet":"2.1 Expenditure summary","index":4,"n_rows":59,"n_cols":3,"rows_kept":59,"cut":false,"hidden":false,"merged":[]}
[null,"REGULATORY REPORTING STATEMENT"]
[null,{"$f":"INDEX(dms_TradingNameFull_List,MATCH(dms_TradingName,dms_TradingName_List))","v":"Queensland Electricity Transmission Corporation Limited trading as Powerlink Queensland"}]
[null,{"$f":"CONCATENATE((LOOKUP(dms_Model,dms_Model_List,dms_Worksheet_List))&\" \"&CRY)","v":"CATEGORY ANALYSIS 2017-18"}]
[null,"2.1 EXPENDITURE SUMMARY AND RECONCILIATION"]
[]
[null,"There are TWO tables on this worksheet. Each has been grouped for ease of navigation. See the Instructions sheet on how to group or ungroup tables. "]
[]
[null,"2.1.1 - PRESCRIBED TRANSMISSION SERVICES CAPEX (as incurred)"]
[null,null,"Actual \n($0's)"]
[null,null,{"$f":"CRY","v":"2017-18"}]
[null,"Replacement expenditure",62647967]
[null,"Connections",0]
[null,"Augmentation Expenditure",2180677]
[null,"Non-network",34717170]
[null,"Capitalised network overheads",0]
[null,"Capitalised corporate overheads",8352767]
[]
[]
[]
[]
[]
[]
[]
[]
[]
[]
[]
[]
[]
[]
[]
[null,"balancing item",41526265]
[null,"TOTAL  CAPEX",{"$f":"+SUM(C11:C32)","v":149424846}]
[]
[null,"2.1.2 - PRESCRIBED TRANSMISSION SERVICE OPEX "]
[null,null,"Actual \n($0's)"]
[null,null,{"$f":"CRY","v":"2017-18"}]
[null,"Vegetation management",12704312]
[null,"Maintenance",75893120]
[null,"Non-network",29040716]
[null,"Network overheads",48792176]
[null,"Corporate overheads",72647517]
[]
[]
[]
[]
[]
[]
[]
[]
[]
[]
[]
[]
[]
[]
[]
[null,"balancing item",-45565620]
[null,"TOTAL OPEX",{"$f":"SUM(C38:C58)","v":193512221}]

{"sheet":"2.2 Repex","index":5,"n_rows":249,"n_cols":6,"rows_kept":249,"cut":false,"hidden":false,"merged":[[167,1,178,1],[84,1,119,1],[10,1,24,1],[25,1,39,1],[40,1,61,1],[62,1,83,1],[120,1,144,1],[145,1,166,1]]}
[null,"REGULATORY REPORTING STATEMENT"]
[null,{"$f":"INDEX(dms_TradingNameFull_List,MATCH(dms_TradingName,dms_TradingName_List))","v":"Queensland Electricity Transmission Corporation Limited trading as Powerlink Queensland"}]
[null,{"$f":"CONCATENATE((LOOKUP(dms_Model,dms_Model_List,dms_Worksheet_List))&\" \"&CRY)","v":"CATEGORY ANALYSIS 2017-18"}]
[null,"2.2 REPEX"]
[]
[null,"There are TWO tables (with three sub-tables each) on this worksheet. Each table has been grouped (and sub-grouped) for ease of navigation. See the Instructions sheet on how to group or ungroup data."]
[]
[null,"2.2.1 - REPLACEMENT EXPENDITURE, VOLUMES AND ASSET FAILURES BY ASSET CATEGORY"]
[null,null,null,"EXPENDITURE ($0's)","ASSET REPLACEMENTS ","ASSET FAILURES  "]
[null,"ASSET GROUP","ASSET CATEGORY",{"$f":"CRY","v":"2017-18"},{"$f":"CRY","v":"2017-18"},{"$f":"CRY","v":"2017-18"}]
[null,"TRANSMISSION TOWERS\nHighest operating voltage; Circuit configuration","< = 33 kV ; Single Circuit"]
[null,null,"> 33 kV & < = 66 kV ; Single Circuit"]
[null,null,"> 66 kV & < = 132 kV ; Single Circuit",null,2]
[null,null,"> 132 kV & < = 275 kV ; Single Circuit"]
[null,null,"> 275 kV & < = 330 kV ; Single Circuit"]
[null,null,"> 330 kV & < = 500 kV ; Single Circuit"]
[null,null,"> 500 kV ; Single Circuit"]
[null,null,"< = 33 kV ; Multiple Circuit"]
[null,null,"> 33 kV & < = 66 kV ; Multiple Circuit"]
[null,null,"> 66 kV & < = 132 kV ; Multiple Circuit",null,12]
[null,null,"> 132 kV & < = 275 kV ; Multiple Circuit"]
[null,null,"> 275 kV & < = 330 kV ; Multiple Circuit"]
[null,null,"> 330 kV & < = 500 kV ; Multiple Circuit"]
[null,null,"> 500 kV ; Multiple Circuit"]
[null,null,"Other"]
[null,"TRANSMISSION TOWER SUPPORT STRUCTURES BY:\nHighest operating voltage; Circuit configuration","< = 33 kV ; Single Circuit"]
[null,null,"> 33 kV & < = 66 kV ; Single Circuit"]
[null,null,"> 66 kV & < = 132 kV ; Single Circuit"]
[null,null,"> 132 kV & < = 275 kV ; Single Circuit"]
[null,null,"> 275 kV & < = 330 kV ; Single Circuit"]
[null,null,"> 330 kV & < = 500 kV ; Single Circuit"]
[null,null,"> 500 kV ; Single Circuit"]
[null,null,"< = 33 kV ; Multiple Circuit"]
[null,null,"> 33 kV & < = 66 kV ; Multiple Circuit"]
[null,null,"> 66 kV & < = 132 kV ; Multiple Circuit"]
[null,null,"> 132 kV & < = 275 kV ; Multiple Circuit"]
[null,null,"> 275 kV & < = 330 kV ; Multiple Circuit"]
[null,null,"> 330 kV & < = 500 kV ; Multiple Circuit"]
[null,null,"> 500 kV ; Multiple Circuit"]
[null,null,"Other"]
[null,"CONDUCTORS BY: \nVoltage; Maximum continuous rating","< = 33 kV ; < = 100 MVA"]
[null,null,"< = 33 kV ; > 100 MVA & < = 400 MVA"]
[null,null,"< = 33 kV ; > 400 MVA"]
[null,null,"> 33 kV & < = 66 kV ; < = 100 MVA"]
[null,null,"> 33 kV & < = 66 kV ; > 100 MVA & < = 400 MVA"]
[null,null,"> 33 kV & < = 66 kV ; > 400 MVA"]
[null,null,"> 66 kV & < = 132 kV ; < = 100 MVA",null,7.3]
[null,null,"> 66 kV & < = 132 kV ; > 100 MVA & < = 400 MVA"]
[null,null,"> 66 kV & < = 132 kV ; > 400 MVA"]
[null,null,"> 132 kV & < = 275 kV ; < = 200 MVA"]
[null,null,"> 132 kV & < = 275 kV ; > 200 MVA & < = 600 MVA"]
[null,null,"> 132 kV & < = 275 kV ; > 600 MVA"]
[null,null,"> 275 kV & < = 330 kV ; < = 800 MVA"]
[null,null,"> 275 kV & < = 330 kV ; > 800 MVA & < = 1200 MVA"]
[null,null,"> 275 kV & < = 330 kV ; > 1200 MVA"]
[null,null,"> 330 kV & < = 500 kV ; < = 1000 MVA"]
[null,null,"> 330 kV & < = 500 kV ; > 1000 MVA & < = 1500 MVA"]
[null,null,"> 330 kV & < = 500 kV ; > 1500 MVA"]
[null,null,"> 500 kV ; < = 2000 MVA"]
[null,null,"> 500 kV ; > 2000 MVA & < = 3000 MVA"]
[null,null,"> 500 kV ; > 3000 MVA"]
[null,null,"Other"]
[null,"TRANSMISSION CABLES BY: \nHighest operating voltage; Insulation type","< = 33 kV ; Oil Filled"]
[null,null,"> 33 kV & < = 66 kV ; Oil Filled"]
[null,null,"> 66 kV & < = 132 kV ; Oil Filled"]
[null,null,"> 132 kV & < = 275 kV ; Oil Filled"]
[null,null,"> 275 kV & < = 330 kV ; Oil Filled"]
[null,null,"> 330 kV & < = 500 kV ; Oil Filled"]
[null,null,"> 500 kV ; Oil Filled"]
[null,null,"< = 33 kV ; XLPE Insulated"]
[null,null,"> 33 kV & < = 66 kV ; XLPE Insulated"]
[null,null,"> 66 kV & < = 132 kV ; XLPE Insulated"]
[null,null,"> 132 kV & < = 275 kV ; XLPE Insulated"]
[null,null,"> 275 kV & < = 330 kV ; XLPE Insulated"]
[null,null,"> 330 kV & < = 500 kV ; XLPE Insulated"]
[null,null,"> 500 kV ; XLPE Insulated"]
[null,null,"< = 33 kV ; Other Insulated"]
[null,null,"> 33 kV & < = 66 kV ; Other Insulated"]
[null,null,"> 66 kV & < = 132 kV ; Other Insulated"]
[null,null,"> 132 kV & < = 275 kV ; Other Insulated"]
[null,null,"> 275 kV & < = 330 kV ; Other Insulated"]
[null,null,"> 330 kV & < = 500 kV ; Other Insulated"]
[null,null,"> 500 kV ; Other Insulated"]
[null,null,"Other"]
[null,"SUBSTATION SWITCHBAYS BY: \nHighest operating voltage; Switch type","< = 33 kV ; Air Insulated circuit Breaker"]
[null,null,"> 33 kV & < = 66 kV ; Air Insulated circuit Breaker"]
[null,null,"> 66 kV & < = 132 kV ; Air Insulated circuit Breaker",null,13]
[null,null,"> 132 kV & < = 275 kV ; Air Insulated circuit Breaker"]
[null,null,"> 275 kV & < = 330 kV ; Air Insulated circuit Breaker"]
[null,null,"> 330 kV & < = 500 kV ; Air Insulated circuit Breaker"]
[null,null,"> 500 kV ; Air Insulated circuit Breaker"]
[null,null,"< = 33 kV ; Air Insulated Isolators / Earth Switch"]
[null,null,"> 33 kV & < = 66 kV ; Air Insulated Isolators / Earth Switch"]
[null,null,"> 66 kV & < = 132 kV ; Air Insulated Isolators / Earth Switch",null,39]
[null,null,"> 132 kV & < = 275 kV ; Air Insulated Isolators / Earth Switch",null,3]
[null,null,"> 275 kV & < = 330 kV ; Air Insulated Isolators / Earth Switch"]
[null,null,"> 330 kV & < = 500 kV ; Air Insulated Isolators / Earth Switch"]
[null,null,"> 500 kV ; Air Insulated Isolators / Earth Switch"]
[null,null,"< = 33 kV ; VT"]
[null,null,"> 33 kV & < = 66 kV ; VT",null,6]
[null,null,"> 66 kV & < = 132 kV ; VT",null,18]
[null,null,"> 132 kV & < = 275 kV ; VT"]
[null,null,"> 275 kV & < = 330 kV ; VT"]
[null,null,"> 330 kV & < = 500 kV ; VT"]
[null,null,"> 500 kV ; VT"]
[null,null,"< = 33 kV ; CT"]
[null,null,"> 33 kV & < = 66 kV ; CT",null,6]
[null,null,"> 66 kV & < = 132 kV ; CT",null,6]
[null,null,"> 132 kV & < = 275 kV ; CT"]
[null,null,"> 275 kV & < = 330 kV ; CT"]
[null,null,"> 330 kV & < = 500 kV ; CT"]
[null,null,"> 500 kV ; CT"]
[null,null,"< = 33 kV ; GIS Module"]
[null,null,"> 33 kV & < = 66 kV ; GIS Module"]
[null,null,"> 66 kV & < = 132 kV ; GIS Module"]
[null,null,"> 132 kV & < = 275 kV ; GIS Module"]
[null,null,"> 275 kV & < = 330 kV ; GIS Module"]
[null,null,"> 330 kV & < = 500 kV ; GIS Module"]
[null,null,"> 500 kV ; GIS Module"]
[null,null,"Other"]
[null,"SUBSTATION POWER TRANSFORMERS BY: \nHighest operating voltage;  Ampere rating","< = 33 kV ; < = 10 MVA"]
[null,null,"< = 33 kV ; > 10 MVA & < = 30 MVA"]
[null,null,"< = 33 kV ; > 30 MVA"]
[null,null,"> 33 kV & < = 66 kV ; < = 10 MVA"]
[null,null,"> 33 kV & < = 66 kV ; > 10 MVA & < = 30 MVA"]
[null,null,"> 33 kV & < = 66 kV ; > 30 MVA"]
[null,null,"> 66 kV & < = 132 kV ; < = 30 MVA"]
[null,null,"> 66 kV & < = 132 kV ; > 30 MVA & < = 60 MVA"]
[null,null,"> 66 kV & < = 132 kV ; > 60 MVA"]
[null,null,"> 132 kV & < = 220 kV ; < = 50 MVA"]
[null,null,"> 132 kV & < = 220 kV ; > 50 MVA & < = 100 MVA"]
[null,null,"> 132 kV & < = 220 kV ; > 100 MVA"]
[null,null,"> 220 kV & < = 275 kV ; < = 50 MVA"]
[null,null,"> 220 kV & < = 275 kV ; > 50 MVA & < = 100 MVA"]
[null,null,"> 220 kV & < = 275 kV ; > 100 MVA"]
[null,null,"> 275 kV & < = 330 kV ; < = 100 MVA"]
[null,null,"> 275 kV & < = 330 kV ; > 100 MVA & < = 250 MVA"]
[null,null,"> 275 kV & < = 330 kV ; > 250 MVA"]
[null,null,"> 330 kV & < = 500 kV ; < = 150 MVA"]
[null,null,"> 330 kV & < = 500 kV ; > 150 MVA & < = 300 MVA"]
[null,null,"> 330 kV & < = 500 kV ; > 300 MVA"]
[null,null,"> 500 kV ; < = 1000 MVA"]
[null,null,"> 500 kV ; > 1000 MVA & < = 1500 MVA"]
[null,null,"> 500 kV ; > 1500 MVA"]
[null,null,"Other"]
[null,"SUBSTATION REACTIVE PLANT BY: \nHighest operating voltage; Function","< = 33 kV ; SVCS"]
[null,null,"> 33 kV & < = 66 kV ; SVCS"]
[null,null,"> 66 kV & < = 132 kV ; SVCS"]
[null,null,"> 132 kV & < = 275 kV ; SVCS"]
[null,null,"> 275 kV & < = 330 kV ; SVCS"]
[null,null,"> 330 kV & < = 500 kV ; SVCS"]
[null,null,"> 500 kV ; SVCS"]
[null,null,"< = 33 kV ; Capacitors"]
[null,null,"> 33 kV & < = 66 kV ; Capacitors"]
[null,null,"> 66 kV & < = 132 kV ; Capacitors"]
[null,null,"> 132 kV & < = 275 kV ; Capacitors"]
[null,null,"> 275 kV & < = 330 kV ; Capacitors"]
[null,null,"> 330 kV & < = 500 kV ; Capacitors"]
[null,null,"> 500 kV ; Capacitors"]
[null,null,"< = 33 kV ; Oil Filled Reactors"]
[null,null,"> 33 kV & < = 66 kV ; Oil Filled Reactors"]
[null,null,"> 66 kV & < = 132 kV ; Oil Filled Reactors"]
[null,null,"> 132 kV & < = 275 kV ; Oil Filled Reactors"]
[null,null,"> 275 kV & < = 330 kV ; Oil Filled Reactors"]
[null,null,"> 330 kV & < = 500 kV ; Oil Filled Reactors"]
[null,null,"> 500 kV ; Oil Filled Reactors"]
[null,null,"Other"]
[null,"SCADA, NETWORK CONTROL AND PROTECTION SYSTEMS BY:\nFunction","Communications Network Assets",null,10]
[null,null,"Master Station Assets"]
[null,null,"Control equipment / systems"]
[null,null,"Infrastructure: protection and control"]
[null,null,"Metering systems"]
[null,null,"OPGW",null,7.3]
[null,null,"Protection schemes / systems"]
[null,null,"Site establishment"]
[null,null,"Station SCADA and control systems"]
[null,null,"Telecommunications Network / Systems"]
[null,null,"Total secondary systems",null,26]
[null,null,"Other"]
[null,"OTHER BY: \nTNSP defined","<NSP to enter description for Asset Group/Category not listed above>"]
[null,null,"Substation Buildings",null,3]
[null,null,"Substation Site Infrastructure",null,3]
[null,null,"Other"]
[]
[]
[]
[]
[]
[]
[]
[]
[]
[]
[]
[]
[]
[]
[]
[]
[]
[]
[]
[]
[]
[]
[]
[]
[]
[]
[]
[null,"2.2.2 - SELECTED ASSET CHARACTERISTICS"]
[null,null,null,"ASSET VOLUMES CURRENTLY IN COMMISSION","ASSET REPLACEMENTS "]
[null,"ASSET GROUP","ASSET CATEGORY",{"$f":"CRY","v":"2017-18"},{"$f":"CRY","v":"2017-18"}]
[null,"CONDUCTORS BY: \nCONDUCTOR LENGTH MATERIAL TYPE","AAAC",7854,7]
[null,null,"AAC",0]
[null,null,"ACAR",0]
[null,null,"ACSR",6655]
[null,null,"HD Cu",0]
[]
[]
[]
[]
[]
[]
[]
[]
[]
[]
[]
[]
[]
[]
[]
[]
[]
[]
[]
[]
[]
[]
[]
[]
[]
[]
[]
[]
[null,"SUBSTATION REACTIVE PLANT BY:\nREACTIVE CAPACITY","Total MVAr by SVCs",3361]
[null,null,"Total MVAr by Capacitors",7536.2]
[null,null,"Total MVAr by Oil Filled Reactors",1032.4000000000001]

{"sheet":"2.3 Augex","index":6,"n_rows":212,"n_cols":35,"rows_kept":212,"cut":false,"hidden":false,"merged":[[142,4,148,4],[150,4,156,4],[158,4,164,4],[166,4,172,4],[174,4,180,4],[182,4,188,4],[190,4,196,4],[190,1,196,1],[182,28,188,28],[158,1,164,1],[142,27,148,27],[150,1,156,1],[142,1,148,1],[158,27,164,27],[158,28,164,28],[182,1,188,1],[174,27,180,27],[174,28,180,28],[190,31,196,31],[190,32,196,32],[190,33,196,33],[190,27,196,27],[190,28,196,28],[190,29,196,29],[190,30,196,30],[182,31,188,31],[182,32,188,32],[182,33,188,33],[182,27,188,27],[174,29,180,29],[174,30,180,30],[174,31,180,31],[174,32,180,32],[182,29,188,29],[182,30,188,30],[166,32,172,32],[166,33,172,33],[174,1,180,1],[166,27,172,27],[166,28,172,28],[166,29,172,29],[166,30,172,30],[166,31,172,31],[166,1,172,1],[174,33,180,33],[158,29,164,29],[158,30,164,30],[150,27,156,27],[150,28,156,28],[150,29,156,29],[150,30,156,30],[150,31,156,31],[142,33,148,33],[142,28,148,28],[142,29,148,29],[142,30,148,30],[142,31,148,31],[142,32,148,32],[158,31,164,31],[158,32,164,32],[158,33,164,33],[150,32,156,32],[150,33,156,33],[139,1,141,1],[133,3,133,10],[138,1,138,10],[138,32,138,33],[138,27,141,27],[141,29,141,31],[141,32,141,33],[139,29,140,29],[139,30,140,30],[139,31,140,31],[139,32,140,32],[139,33,140,33],[138,28,141,28],[138,29,138,31],[140,21,141,21],[138,25,138,26],[139,25,140,25],[139,26,140,26],[141,25,141,26],[139,23,140,24],[139,22,140,22],[140,18,140,19],[139,11,140,14],[139,15,139,21],[124,29,130,29],[124,30,130,30],[124,31,130,31],[124,32,130,32],[124,33,130,33],[132,3,132,10],[124,9,130,9],[124,10,130,10],[124,25,130,25],[124,26,130,26],[124,27,130,27],[124,28,130,28],[124,1,130,1],[124,2,130,2],[124,3,130,3],[124,4,130,4],[124,5,130,5],[124,6,130,6],[124,7,130,7],[124,8,130,8],[116,26,122,26],[116,6,122,6],[116,7,122,7],[116,8,122,8],[116,9,122,9],[116,10,122,10],[116,25,122,25],[108,29,114,29],[108,30,114,30],[108,31,114,31],[108,32,114,32],[108,33,114,33],[116,1,122,1],[116,2,122,2],[116,3,122,3],[116,4,122,4],[116,5,122,5],[108,9,114,9],[108,10,114,10],[108,25,114,25],[108,26,114,26],[108,27,114,27],[108,28,114,28],[116,32,122,32],[116,33,122,33],[116,27,122,27],[116,28,122,28],[116,29,122,29],[116,30,122,30],[116,31,122,31],[108,1,114,1],[108,2,114,2],[108,3,114,3],[108,4,114,4],[108,5,114,5],[108,6,114,6],[108,7,114,7],[108,8,114,8],[100,26,106,26],[100,6,106,6],[100,7,106,7],[100,8,106,8],[100,9,106,9],[100,10,106,10],[100,25,106,25],[92,31,98,31],[92,32,98,32],[92,33,98,33],[100,1,106,1],[100,2,106,2],[100,3,106,3],[100,4,106,4],[100,5,106,5],[92,9,98,9],[92,10,98,10],[92,25,98,25],[92,26,98,26],[92,27,98,27],[92,28,98,28],[100,32,106,32],[100,33,106,33],[100,27,106,27],[100,28,106,28],[100,29,106,29],[100,30,106,30],[100,31,106,31],[92,1,98,1],[92,2,98,2],[92,3,98,3],[84,26,90,26],[84,6,90,6],[84,7,90,7],[84,8,90,8],[84,9,90,9],[84,10,90,10],[84,25,90,25],[92,29,98,29],[92,30,98,30],[76,29,82,29],[76,30,82,30],[76,31,82,31],[76,32,82,32],[76,33,82,33],[84,1,90,1],[84,2,90,2],[84,3,90,3],[84,4,90,4],[84,5,90,5],[76,9,82,9],[76,10,82,10],[76,25,82,25],[76,26,82,26],[76,27,82,27],[76,28,82,28],[84,32,90,32],[84,33,90,33],[84,27,90,27],[84,28,90,28],[84,29,90,29],[84,30,90,30],[84,31,90,31],[76,1,82,1],[60,1,66,1],[76,2,82,2],[76,3,82,3],[76,4,82,4],[76,5,82,5],[76,6,82,6],[76,7,82,7],[76,8,82,8],[68,26,74,26],[68,6,74,6],[68,7,74,7],[68,8,74,8],[68,9,74,9],[68,10,74,10],[68,25,74,25],[52,25,58,25],[60,29,66,29],[60,30,66,30],[60,31,66,31],[60,32,66,32],[60,33,66,33],[68,1,74,1],[68,2,74,2],[68,3,74,3],[68,4,74,4],[68,5,74,5],[60,9,66,9],[60,10,66,10],[60,25,66,25],[60,26,66,26],[60,27,66,27],[60,28,66,28],[68,32,74,32],[68,33,74,33],[68,27,74,27],[68,28,74,28],[68,29,74,29],[68,30,74,30],[68,31,74,31],[44,32,50,32],[44,33,50,33],[52,1,58,1],[52,2,58,2],[52,3,58,3],[52,4,58,4],[52,5,58,5],[44,9,50,9],[44,10,50,10],[44,25,50,25],[44,26,50,26],[44,27,50,27],[44,28,50,28],[52,32,58,32],[52,33,58,33],[52,27,58,27],[52,28,58,28],[52,29,58,29],[52,30,58,30],[52,31,58,31],[44,1,50,1],[52,26,58,26],[52,6,58,6],[52,7,58,7],[36,32,42,32],[36,33,42,33],[36,27,42,27],[36,28,42,28],[36,29,42,29],[36,30,42,30],[36,31,42,31],[44,2,50,2],[44,3,50,3],[44,4,50,4],[44,5,50,5],[44,6,50,6],[44,7,50,7],[44,8,50,8],[36,26,42,26],[36,6,42,6],[36,7,42,7],[36,8,42,8],[36,9,42,9],[36,10,42,10],[36,25,42,25],[44,29,50,29],[44,30,50,30],[44,31,50,31],[36,1,42,1],[36,2,42,2],[36,3,42,3],[36,4,42,4],[36,5,42,5],[28,9,34,9],[28,10,34,10],[28,25,34,25],[28,26,34,26],[28,1,34,1],[28,8,34,8],[28,30,34,30],[28,31,34,31],[28,32,34,32],[28,33,34,33],[28,27,34,27],[28,28,34,28],[20,32,26,32],[20,33,26,33],[20,27,26,27],[28,29,34,29],[12,33,18,33],[12,27,18,27],[12,28,18,28],[20,29,26,29],[20,30,26,30],[20,31,26,31],[12,25,18,25],[12,26,18,26],[12,29,18,29],[12,30,18,30],[12,31,18,31],[12,32,18,32],[20,26,26,26],[20,25,26,25],[20,28,26,28],[12,1,18,1],[12,2,18,2],[20,1,26,1],[20,2,26,2],[20,3,26,3],[20,4,26,4],[20,5,26,5],[12,9,18,9],[12,10,18,10],[12,3,18,3],[12,4,18,4],[12,5,18,5],[12,6,18,6],[12,7,18,7],[12,8,18,8],[5,1,5,3],[9,32,9,33],[10,1,11,1],[10,2,11,2],[10,3,11,3],[10,4,11,4],[10,5,11,5],[10,6,11,6],[10,7,10,8],[10,9,10,10],[10,11,10,14],[9,1,9,10],[9,25,9,26],[9,27,11,27],[9,28,11,28],[9,29,9,31],[10,15,10,17],[11,25,11,26],[11,29,11,31],[11,32,11,33],[92,4,98,4],[92,5,98,5],[92,6,98,6],[10,18,10,21],[9,11,9,24],[10,23,10,24],[11,20,11,21],[20,6,26,6],[20,7,26,7],[20,8,26,8],[20,9,26,9],[20,10,26,10],[92,7,98,7],[92,8,98,8],[139,3,141,3],[139,6,141,6],[139,5,141,5],[139,4,141,4],[139,7,140,10],[140,16,140,17],[140,20,141,20],[138,11,138,24],[28,2,34,2],[28,3,34,3],[28,4,34,4],[28,5,34,5],[28,6,34,6],[28,7,34,7],[60,2,66,2],[60,3,66,3],[60,4,66,4],[60,5,66,5],[60,6,66,6],[60,7,66,7],[60,8,66,8],[52,8,58,8],[52,9,58,9],[52,10,58,10]]}
[null,"REGULATORY REPORTING STATEMENT"]
[null,{"$f":"INDEX(dms_TradingNameFull_List,MATCH(dms_TradingName,dms_TradingName_List))","v":"Queensland Electricity Transmission Corporation Limited trading as Powerlink Queensland"}]
[null,{"$f":"CONCATENATE((LOOKUP(dms_Model,dms_Model_List,dms_Worksheet_List))&\" \"&CRY)","v":"CATEGORY ANALYSIS 2017-18"}]
[null,"2.3 AUGEX PROJECTS"]
[]
[null,"There are THREE tables on this worksheet - each has been 'grouped' for easy navigation. Both ROWS and COLUMNS have been grouped.  See the Instructions sheet on how to group or ungroup tables. "]
[]
[null,"2.3.1 - AUGEX ASSET DATA - SUBSTATIONS"]
[null,"NOTE: TNSP MUST PROVIDE EXPENDITURE INFORMATION ON A PROJECT CLOSE BASIS."]
[null,"SUBSTATION AND PROJECT SUMMARY",null,null,null,null,null,null,null,null,null,"PLANT AND EQUIPMENT EXPENDITURE AND VOLUME",null,null,null,null,null,null,null,null,null,null,null,null,null,"OTHER EXPENDITURE",null,"TOTAL DIRECT EXPENDITURE\n($0's)","YEARS INCURRED","RELATED PARTY CONTRACTS",null,null,"LAND AND EASEMENTS"]
[null,"SUBSTATION ID","SUBSTATION TYPE","PROJECT ID","PROJECT TYPE","PROJECT TRIGGER","VOLTAGE (KV)","SUBSTATION RATING\nNORMAL CYCLIC\n(MVA)",null,"SUBSTATION RATING\nN-1 EMERGENCY\n(MVA)",null,"TRANSFORMERS",null,null,null,"SWITCHGEAR",null,null,"REACTIVE PLANT",null,null,null,"OTHER PLANT ITEM","INSTALLATION (LABOUR)",null,"CIVIL WORKS","OTHER DIRECT",null,null,"RELATED PARTY MARGINS","TOTAL","ALL NON RELATED PARTYCONTRACTS","LAND PURCHASES","EASEMENTS","Comments"]
[null,null,null,null,null,null,null,"PRE","POST","PRE","POST","Units Added","MVA Added","OLTC INCLUDED?","Expenditure ($0's)","Insulation","Units Added","Expenditure\n($0's)","Plant Type","Units Added","Expenditure\n($0's)",null,"Expenditure\n($0's)","Volume","Expenditure\n($0's)","Expenditure ($0's)",null,null,null,"Expenditure ($0's)",null,null,"Expenditure\n($0's)"]
[null,"<Enter substation ID>",null,null,null,null,""]
[]
[]
[]
[]
[]
[]
[null,"Project Totals",null,null,null,null,null,null,null,null,null,{"$f":"SUM(L13:L19)","v":0},{"$f":"SUM(M13:M19)","v":0},null,{"$f":"SUM(O13:O19)","v":0},null,{"$f":"SUM(Q13:Q19)","v":0},{"$f":"SUM(R13:R19)","v":0},null,{"$f":"SUM(T13:T19)","v":0},{"$f":"SUM(U13:U19)","v":0},null,{"$f":"SUM(W13:W19)","v":0},{"$f":"SUM(X13:X19)","v":0},{"$f":"SUM(Y13:Y19)","v":0},{"$f":"SUM(Z13)","v":0},{"$f":"SUM(AA13)","v":0},{"$f":"O20+R20+U20+W20+SUM(Y20:AA20)","v":0},null,{"$f":"SUM(AD13)","v":0},{"$f":"SUM(AE13)","v":0},{"$f":"SUM(AF13)","v":0},{"$f":"SUM(AG13)","v":0},{"$f":"SUM(AH13)","v":0}]
[null,"<Enter substation ID>",null,null,null,null,""]
[]
[]
[]
[]
[]
[]
[null,"Project Totals",null,null,null,null,null,null,null,null,null,{"$f":"SUM(L21:L27)","v":0},{"$f":"SUM(M21:M27)","v":0},null,{"$f":"SUM(O21:O27)","v":0},null,{"$f":"SUM(Q21:Q27)","v":0},{"$f":"SUM(R21:R27)","v":0},null,{"$f":"SUM(T21:T27)","v":0},{"$f":"SUM(U21:U27)","v":0},null,{"$f":"SUM(W21:W27)","v":0},{"$f":"SUM(X21:X27)","v":0},{"$f":"SUM(Y21:Y27)","v":0},{"$f":"SUM(Z21)","v":0},{"$f":"SUM(AA21)","v":0},{"$f":"O28+R28+U28+W28+SUM(Y28:AA28)","v":0},null,{"$f":"SUM(AD21)","v":0},{"$f":"SUM(AE21)","v":0},{"$f":"SUM(AF21)","v":0},{"$f":"SUM(AG21)","v":0},{"$f":"SUM(AH21)","v":0}]
[null,"<Enter substation ID>",null,null,null,null,""]
[]
[]
[]
[]
[]
[]
[null,"Project Totals",null,null,null,null,null,null,null,null,null,{"$f":"SUM(L29:L35)","v":0},{"$f":"SUM(M29:M35)","v":0},null,{"$f":"SUM(O29:O35)","v":0},null,{"$f":"SUM(Q29:Q35)","v":0},{"$f":"SUM(R29:R35)","v":0},null,{"$f":"SUM(T29:T35)","v":0},{"$f":"SUM(U29:U35)","v":0},null,{"$f":"SUM(W29:W35)","v":0},{"$f":"SUM(X29:X35)","v":0},{"$f":"SUM(Y29:Y35)","v":0},{"$f":"SUM(Z29)","v":0},{"$f":"SUM(AA29)","v":0},{"$f":"O36+R36+U36+W36+SUM(Y36:AA36)","v":0},null,{"$f":"SUM(AD29)","v":0},{"$f":"SUM(AE29)","v":0},{"$f":"SUM(AF29)","v":0},{"$f":"SUM(AG29)","v":0},{"$f":"SUM(AH29)","v":0}]
[null,"<Enter substation ID>",null,null,null,null,""]
[]
[]
[]
[]
[]
[]
[null,"Project Totals",null,null,null,null,null,null,null,null,null,{"$f":"SUM(L37:L43)","v":0},{"$f":"SUM(M37:M43)","v":0},null,{"$f":"SUM(O37:O43)","v":0},null,{"$f":"SUM(Q37:Q43)","v":0},{"$f":"SUM(R37:R43)","v":0},null,{"$f":"SUM(T37:T43)","v":0},{"$f":"SUM(U37:U43)","v":0},null,{"$f":"SUM(W37:W43)","v":0},{"$f":"SUM(X37:X43)","v":0},{"$f":"SUM(Y37:Y43)","v":0},{"$f":"SUM(Z37)","v":0},{"$f":"SUM(AA37)","v":0},{"$f":"O44+R44+U44+W44+SUM(Y44:AA44)","v":0},null,{"$f":"SUM(AD37)","v":0},{"$f":"SUM(AE37)","v":0},{"$f":"SUM(AF37)","v":0},{"$f":"SUM(AG37)","v":0},{"$f":"SUM(AH37)","v":0}]
[null,"<Enter substation ID>",null,null,null,null,""]
[]
[]
[]
[]
[]
[]
[null,"Project Totals",null,null,null,null,null,null,null,null,null,{"$f":"SUM(L45:L51)","v":0},{"$f":"SUM(M45:M51)","v":0},null,{"$f":"SUM(O45:O51)","v":0},null,{"$f":"SUM(Q45:Q51)","v":0},{"$f":"SUM(R45:R51)","v":0},null,{"$f":"SUM(T45:T51)","v":0},{"$f":"SUM(U45:U51)","v":0},null,{"$f":"SUM(W45:W51)","v":0},{"$f":"SUM(X45:X51)","v":0},{"$f":"SUM(Y45:Y51)","v":0},{"$f":"SUM(Z45)","v":0},{"$f":"SUM(AA45)","v":0},{"$f":"O52+R52+U52+W52+SUM(Y52:AA52)","v":0},null,{"$f":"SUM(AD45)","v":0},{"$f":"SUM(AE45)","v":0},{"$f":"SUM(AF45)","v":0},{"$f":"SUM(AG45)","v":0},{"$f":"SUM(AH45)","v":0}]
[null,"<Enter substation ID>",null,null,null,null,""]
[]
[]
[]
[]
[]
[]
[null,"Project Totals",null,null,null,null,null,null,null,null,null,{"$f":"SUM(L53:L59)","v":0},{"$f":"SUM(M53:M59)","v":0},null,{"$f":"SUM(O53:O59)","v":0},null,{"$f":"SUM(Q53:Q59)","v":0},{"$f":"SUM(R53:R59)","v":0},null,{"$f":"SUM(T53:T59)","v":0},{"$f":"SUM(U53:U59)","v":0},null,{"$f":"SUM(W53:W59)","v":0},{"$f":"SUM(X53:X59)","v":0},{"$f":"SUM(Y53:Y59)","v":0},{"$f":"SUM(Z53)","v":0},{"$f":"SUM(AA53)","v":0},{"$f":"O60+R60+U60+W60+SUM(Y60:AA60)","v":0},null,{"$f":"SUM(AD53)","v":0},{"$f":"SUM(AE53)","v":0},{"$f":"SUM(AF53)","v":0},{"$f":"SUM(AG53)","v":0},{"$f":"SUM(AH53)","v":0}]
[null,"<Enter substation ID>",null,null,null,null,""]
[]
[]
[]
[]
[]
[]
[null,"Project Totals",null,null,null,null,null,null,null,null,null,{"$f":"SUM(L61:L67)","v":0},{"$f":"SUM(M61:M67)","v":0},null,{"$f":"SUM(O61:O67)","v":0},null,{"$f":"SUM(Q61:Q67)","v":0},{"$f":"SUM(R61:R67)","v":0},null,{"$f":"SUM(T61:T67)","v":0},{"$f":"SUM(U61:U67)","v":0},null,{"$f":"SUM(W61:W67)","v":0},{"$f":"SUM(X61:X67)","v":0},{"$f":"SUM(Y61:Y67)","v":0},{"$f":"SUM(Z61)","v":0},{"$f":"SUM(AA61)","v":0},{"$f":"O68+R68+U68+W68+SUM(Y68:AA68)","v":0},null,{"$f":"SUM(AD61)","v":0},{"$f":"SUM(AE61)","v":0},{"$f":"SUM(AF61)","v":0},{"$f":"SUM(AG61)","v":0},{"$f":"SUM(AH61)","v":0}]
[null,"<Enter substation ID>",null,null,null,null,""]
[]
[]
[]
[]
[]
[]
[null,"Project Totals",null,null,null,null,null,null,null,null,null,{"$f":"SUM(L69:L75)","v":0},{"$f":"SUM(M69:M75)","v":0},null,{"$f":"SUM(O69:O75)","v":0},null,{"$f":"SUM(Q69:Q75)","v":0},{"$f":"SUM(R69:R75)","v":0},null,{"$f":"SUM(T69:T75)","v":0},{"$f":"SUM(U69:U75)","v":0},null,{"$f":"SUM(W69:W75)","v":0},{"$f":"SUM(X69:X75)","v":0},{"$f":"SUM(Y69:Y75)","v":0},{"$f":"SUM(Z69)","v":0},{"$f":"SUM(AA69)","v":0},{"$f":"O76+R76+U76+W76+SUM(Y76:AA76)","v":0},null,{"$f":"SUM(AD69)","v":0},{"$f":"SUM(AE69)","v":0},{"$f":"SUM(AF69)","v":0},{"$f":"SUM(AG69)","v":0},{"$f":"SUM(AH69)","v":0}]
[null,"<Enter substation ID>",null,null,null,null,""]
[]
[]
[]
[]
[]
[]
[null,"Project Totals",null,null,null,null,null,null,null,null,null,{"$f":"SUM(L77:L83)","v":0},{"$f":"SUM(M77:M83)","v":0},null,{"$f":"SUM(O77:O83)","v":0},null,{"$f":"SUM(Q77:Q83)","v":0},{"$f":"SUM(R77:R83)","v":0},null,{"$f":"SUM(T77:T83)","v":0},{"$f":"SUM(U77:U83)","v":0},null,{"$f":"SUM(W77:W83)","v":0},{"$f":"SUM(X77:X83)","v":0},{"$f":"SUM(Y77:Y83)","v":0},{"$f":"SUM(Z77)","v":0},{"$f":"SUM(AA77)","v":0},{"$f":"O84+R84+U84+W84+SUM(Y84:AA84)","v":0},null,{"$f":"SUM(AD77)","v":0},{"$f":"SUM(AE77)","v":0},{"$f":"SUM(AF77)","v":0},{"$f":"SUM(AG77)","v":0},{"$f":"SUM(AH77)","v":0}]
[null,"<Enter substation ID>",null,null,null,null,""]
[]
[]
[]
[]
[]
[]
[null,"Project Totals",null,null,null,null,null,null,null,null,null,{"$f":"SUM(L85:L91)","v":0},{"$f":"SUM(M85:M91)","v":0},null,{"$f":"SUM(O85:O91)","v":0},null,{"$f":"SUM(Q85:Q91)","v":0},{"$f":"SUM(R85:R91)","v":0},null,{"$f":"SUM(T85:T91)","v":0},{"$f":"SUM(U85:U91)","v":0},null,{"$f":"SUM(W85:W91)","v":0},{"$f":"SUM(X85:X91)","v":0},{"$f":"SUM(Y85:Y91)","v":0},{"$f":"SUM(Z85)","v":0},{"$f":"SUM(AA85)","v":0},{"$f":"O92+R92+U92+W92+SUM(Y92:AA92)","v":0},null,{"$f":"SUM(AD85)","v":0},{"$f":"SUM(AE85)","v":0},{"$f":"SUM(AF85)","v":0},{"$f":"SUM(AG85)","v":0},{"$f":"SUM(AH85)","v":0}]
[null,"<Enter substation ID>",null,null,null,null,""]
[]
[]
[]
[]
[]
[]
[null,"Project Totals",null,null,null,null,null,null,null,null,null,{"$f":"SUM(L93:L99)","v":0},{"$f":"SUM(M93:M99)","v":0},null,{"$f":"SUM(O93:O99)","v":0},null,{"$f":"SUM(Q93:Q99)","v":0},{"$f":"SUM(R93:R99)","v":0},null,{"$f":"SUM(T93:T99)","v":0},{"$f":"SUM(U93:U99)","v":0},null,{"$f":"SUM(W93:W99)","v":0},{"$f":"SUM(X93:X99)","v":0},{"$f":"SUM(Y93:Y99)","v":0},{"$f":"SUM(Z93)","v":0},{"$f":"SUM(AA93)","v":0},{"$f":"O100+R100+U100+W100+SUM(Y100:AA100)","v":0},null,{"$f":"SUM(AD93)","v":0},{"$f":"SUM(AE93)","v":0},{"$f":"SUM(AF93)","v":0},{"$f":"SUM(AG93)","v":0},{"$f":"SUM(AH93)","v":0}]
[null,"<Enter substation ID>",null,null,null,null,""]
[]
[]
[]
[]
[]
[]
[null,"Project Totals",null,null,null,null,null,null,null,null,null,{"$f":"SUM(L101:L107)","v":0},{"$f":"SUM(M101:M107)","v":0},null,{"$f":"SUM(O101:O107)","v":0},null,{"$f":"SUM(Q101:Q107)","v":0},{"$f":"SUM(R101:R107)","v":0},null,{"$f":"SUM(T101:T107)","v":0},{"$f":"SUM(U101:U107)","v":0},null,{"$f":"SUM(W101:W107)","v":0},{"$f":"SUM(X101:X107)","v":0},{"$f":"SUM(Y101:Y107)","v":0},{"$f":"SUM(Z101)","v":0},{"$f":"SUM(AA101)","v":0},{"$f":"O108+R108+U108+W108+SUM(Y108:AA108)","v":0},null,{"$f":"SUM(AD101)","v":0},{"$f":"SUM(AE101)","v":0},{"$f":"SUM(AF101)","v":0},{"$f":"SUM(AG101)","v":0},{"$f":"SUM(AH101)","v":0}]
[null,"<Enter substation ID>",null,null,null,null,""]
[]
[]
[]
[]
[]
[]
[null,"Project Totals",null,null,null,null,null,null,null,null,null,{"$f":"SUM(L109:L115)","v":0},{"$f":"SUM(M109:M115)","v":0},null,{"$f":"SUM(O109:O115)","v":0},null,{"$f":"SUM(Q109:Q115)","v":0},{"$f":"SUM(R109:R115)","v":0},null,{"$f":"SUM(T109:T115)","v":0},{"$f":"SUM(U109:U115)","v":0},null,{"$f":"SUM(W109:W115)","v":0},{"$f":"SUM(X109:X115)","v":0},{"$f":"SUM(Y109:Y115)","v":0},{"$f":"SUM(Z109)","v":0},{"$f":"SUM(AA109)","v":0},{"$f":"O116+R116+U116+W116+SUM(Y116:AA116)","v":0},null,{"$f":"SUM(AD109)","v":0},{"$f":"SUM(AE109)","v":0},{"$f":"SUM(AF109)","v":0},{"$f":"SUM(AG109)","v":0},{"$f":"SUM(AH109)","v":0}]
[null,"<Enter substation ID>",null,null,null,null,""]
[]
[]
[]
[]
[]
[]
[null,"Project Totals",null,null,null,null,null,null,null,null,null,{"$f":"SUM(L117:L123)","v":0},{"$f":"SUM(M117:M123)","v":0},null,{"$f":"SUM(O117:O123)","v":0},null,{"$f":"SUM(Q117:Q123)","v":0},{"$f":"SUM(R117:R123)","v":0},null,{"$f":"SUM(T117:T123)","v":0},{"$f":"SUM(U117:U123)","v":0},null,{"$f":"SUM(W117:W123)","v":0},{"$f":"SUM(X117:X123)","v":0},{"$f":"SUM(Y117:Y123)","v":0},{"$f":"SUM(Z117)","v":0},{"$f":"SUM(AA117)","v":0},{"$f":"O124+R124+U124+W124+SUM(Y124:AA124)","v":0},null,{"$f":"SUM(AD117)","v":0},{"$f":"SUM(AE117)","v":0},{"$f":"SUM(AF117)","v":0},{"$f":"SUM(AG117)","v":0},{"$f":"SUM(AH117)","v":0}]
[null,"<Enter substation ID>",null,null,null,null,""]
[]
[]
[]
[]
[]
[]
[null,"Project Totals",null,null,null,null,null,null,null,null,null,{"$f":"SUM(L125:L131)","v":0},{"$f":"SUM(M125:M131)","v":0},null,{"$f":"SUM(O125:O131)","v":0},null,{"$f":"SUM(Q125:Q131)","v":0},{"$f":"SUM(R125:R131)","v":0},null,{"$f":"SUM(T125:T131)","v":0},{"$f":"SUM(U125:U131)","v":0},null,{"$f":"SUM(W125:W131)","v":0},{"$f":"SUM(X125:X131)","v":0},{"$f":"SUM(Y125:Y131)","v":0},{"$f":"SUM(Z125)","v":0},{"$f":"SUM(AA125)","v":0},{"$f":"O132+R132+U132+W132+SUM(Y132:AA132)","v":0},null,{"$f":"SUM(AD125)","v":0},{"$f":"SUM(AE125)","v":0},{"$f":"SUM(AF125)","v":0},{"$f":"SUM(AG125)","v":0},{"$f":"SUM(AH125)","v":0}]
[null,null,null,"Non material projects",null,null,null,null,null,null,null,null,null,null,null,null,null,null,null,null,null,null,null,null,null,null,null,2180677,2018]
[null,null,null,"Non material projects"]
[]
[]
[null,"2.3.2 - AUGEX ASSET DATA - LINES"]
[null,"NOTE: TNSP MUST PROVIDE EXPENDITURE INFORMATION ON A PROJECT CLOSE BASIS."]
[null,"LINE AND PROJECT SUMMARY",null,null,null,null,null,null,null,null,null,"PLANT AND EQUIPMENT EXPENDITURE AND VOLUME",null,null,null,null,null,null,null,null,null,null,null,null,null,"OTHER EXPENDITURE",null,"TOTAL DIRECT EXPENDITURE ($0's)","YEARS INCURRED","ALL RELATED PARTY CONTRACTS",null,null,"LAND AND EASEMENTS"]
[null,"LINE ID",null,"PROJECT ID","PROJECT TYPE","PROJECT TRIGGER","VOLTAGE (KV)","ROUTE LINE LENGTH ADDED",null,null,null,"TOWERS/POLES (INCLUDING STRUCTURES, AND CIVIL WORKS)",null,null,null,"LINES AND CABLES",null,null,null,null,null,null,"OTHER PLANT ITEM","INSTALLATION (LABOUR)",null,"CIVIL WORKS","OTHER DIRECT",null,null,"RELATED PARTY MARGINS","TOTAL","ALL NON RELATED PARTYCONTRACTS","LAND PURCHASES","EASEMENTS"]
[null,null,null,null,null,null,null,null,null,null,null,null,null,null,null,"Type","Rating (MVA)",null,"N-1 Emergency Rating (MVA)",null,"Circuit KM Added","Expenditure\n($0's)"]
[null,null,null,null,null,null,null,"KM ADDED",null,null,null,"Configuration","Towers/Poles Added","Towers/Poles Upgraded","Expenditure\n($0's)",null,"PRE","POST","PRE","POST",null,null,"Expenditure ($0's)","Volume","Expenditure\n($0's)","Expenditure ($0's)",null,null,null,"Expenditure ($0's)",null,null,"Expenditure\n($0's)"]
[null,"<Enter line ID>"]
[]
[]
[]
[]
[]
[]
[null,"Project Totals",null,null,null,null,null,null,null,null,null,null,{"$f":"SUM(M143:M149)","v":0},{"$f":"SUM(N143:N149)","v":0},{"$f":"SUM(O143:O149)","v":0},null,null,null,null,null,{"$f":"SUM(U143:U149)","v":0},0,0,0,0,0,0,{"$f":"O150+R150+U150+W150+SUM(Y150:AA150)","v":0},null,{"$f":"SUM(AD143:AD149)","v":0},{"$f":"SUM(AE143:AE149)","v":0},{"$f":"SUM(AF143:AF149)","v":0},{"$f":"SUM(AG143:AG149)","v":0},{"$f":"SUM(AH143:AH149)","v":0}]
[null,"<Enter line ID>"]
[]
[]
[]
[]
[]
[]
[null,"Project Totals",null,null,null,null,null,null,null,null,null,null,{"$f":"SUM(M151:M157)","v":0},{"$f":"SUM(N151:N157)","v":0},{"$f":"SUM(O151:O157)","v":0},null,null,null,null,null,{"$f":"SUM(U151:U157)","v":0},{"$f":"SUM(V151:V157)","v":0},{"$f":"SUM(W151:W157)","v":0},0,0,0,0,{"$f":"O158+R158+U158+W158+SUM(Y158:AA158)","v":0},null,{"$f":"SUM(AD151:AD157)","v":0},{"$f":"SUM(AE151:AE157)","v":0},{"$f":"SUM(AF151:AF157)","v":0},{"$f":"SUM(AG151:AG157)","v":0},{"$f":"SUM(AH151:AH157)","v":0}]
[null,"<Enter line ID>"]
[]
[]
[]
[]
[]
[]
[null,"Project Totals",null,null,null,null,null,null,null,null,null,null,{"$f":"SUM(M159:M165)","v":0},{"$f":"SUM(N159:N165)","v":0},{"$f":"SUM(O159:O165)","v":0},null,null,null,null,null,{"$f":"SUM(U159:U165)","v":0},{"$f":"SUM(V159:V165)","v":0},{"$f":"SUM(W159:W165)","v":0},0,0,0,0,{"$f":"O166+R166+U166+W166+SUM(Y166:AA166)","v":0},null,{"$f":"SUM(AD159:AD165)","v":0},{"$f":"SUM(AE159:AE165)","v":0},{"$f":"SUM(AF159:AF165)","v":0},{"$f":"SUM(AG159:AG165)","v":0},{"$f":"SUM(AH159:AH165)","v":0}]
[null,"<Enter line ID>"]
[]
[]
[]
[]
[]
[]
[null,"Project Totals",null,null,null,null,null,null,null,null,null,null,{"$f":"SUM(M167:M173)","v":0},{"$f":"SUM(N167:N173)","v":0},{"$f":"SUM(O167:O173)","v":0},null,null,null,null,null,{"$f":"SUM(U167:U173)","v":0},{"$f":"SUM(V167:V173)","v":0},{"$f":"SUM(W167:W173)","v":0},0,0,0,0,{"$f":"O174+R174+U174+W174+SUM(Y174:AA174)","v":0},null,{"$f":"SUM(AD167:AD173)","v":0},{"$f":"SUM(AE167:AE173)","v":0},{"$f":"SUM(AF167:AF173)","v":0},{"$f":"SUM(AG167:AG173)","v":0},{"$f":"SUM(AH167:AH173)","v":0}]
[null,"<Enter line ID>"]
[]
[]
[]
[]
[]
[]
[null,"Project Totals",null,null,null,null,null,null,null,null,null,null,{"$f":"SUM(M175:M181)","v":0},{"$f":"SUM(N175:N181)","v":0},{"$f":"SUM(O175:O181)","v":0},null,null,null,null,null,{"$f":"SUM(U175:U181)","v":0},{"$f":"SUM(V175:V181)","v":0},{"$f":"SUM(W175:W181)","v":0},0,0,0,0,{"$f":"O182+R182+U182+W182+SUM(Y182:AA182)","v":0},null,{"$f":"SUM(AD175:AD181)","v":0},{"$f":"SUM(AE175:AE181)","v":0},{"$f":"SUM(AF175:AF181)","v":0},{"$f":"SUM(AG175:AG181)","v":0},{"$f":"SUM(AH175:AH181)","v":0}]
[null,"<Enter line ID>"]
[]
[]
[]
[]
[]
[]
[null,"Project Totals",null,null,null,null,null,null,null,null,null,null,{"$f":"SUM(M183:M189)","v":0},{"$f":"SUM(N183:N189)","v":0},{"$f":"SUM(O183:O189)","v":0},null,null,null,null,null,{"$f":"SUM(U183:U189)","v":0},{"$f":"SUM(V183:V189)","v":0},{"$f":"SUM(W183:W189)","v":0},0,0,0,0,{"$f":"O190+R190+U190+W190+SUM(Y190:AA190)","v":0},null,{"$f":"SUM(AD183:AD189)","v":0},{"$f":"SUM(AE183:AE189)","v":0},{"$f":"SUM(AF183:AF189)","v":0},{"$f":"SUM(AG183:AG189)","v":0},{"$f":"SUM(AH183:AH189)","v":0}]
[null,"<Enter line ID>"]
[]
[]
[]
[]
[]
[]
[null,"Project Totals",null,null,null,null,null,null,null,null,null,null,{"$f":"SUM(M191:M197)","v":0},{"$f":"SUM(N191:N197)","v":0},{"$f":"SUM(O191:O197)","v":0},null,null,null,null,null,{"$f":"SUM(U191:U197)","v":0},{"$f":"SUM(V191:V197)","v":0},{"$f":"SUM(W191:W197)","v":0},0,0,0,0,{"$f":"O198+R198+U198+W198+SUM(Y198:AA198)","v":0},null,{"$f":"SUM(AD191:AD197)","v":0},{"$f":"SUM(AE191:AE197)","v":0},{"$f":"SUM(AF191:AF197)","v":0},{"$f":"SUM(AG191:AG197)","v":0},{"$f":"SUM(AH191:AH197)","v":0}]
[null,null,null,"Non material projects"]
[null,null,null,"Non material projects"]
[null,null,null,"Non material projects"]
[]
[]
[]
[null,"2.3.4 - AUGEX - TOTAL EXPENDITURE"]
[]
[null,null,"EXPENDITURE\n($0's)"]
[null,"AUGMENTATION CAPEX (as incurred)",{"$f":"CRY","v":"2017-18"}]
[null,"Substations",427401.09]
[null,"Lines"]
[null,"Other assets"]
[null,"Total augmentation capex",{"$f":"SUM(C209:C211)","v":427401.09}]

{"sheet":"2.5 Connections","index":7,"n_rows":91,"n_cols":6,"rows_kept":91,"cut":false,"hidden":false,"merged":[]}
[null,"REGULATORY REPORTING STATEMENT"]
[null,{"$f":"INDEX(dms_TradingNameFull_List,MATCH(dms_TradingName,dms_TradingName_List))","v":"Queensland Electricity Transmission Corporation Limited trading as Powerlink Queensland"}]
[null,{"$f":"CONCATENATE((LOOKUP(dms_Model,dms_Model_List,dms_Worksheet_List))&\" \"&CRY)","v":"CATEGORY ANALYSIS 2017-18"}]
[null,"2.5 CONNECTIONS EXPENDITURE"]
[]
[null,"There are TWO tables on this worksheet. Each has been grouped (or sub-grouped).  See the Instructions sheet on how to group or ungroup data."]
[]
[null,"2.5.1 - EXPENDITURE ON CONNECTION PROJECTS"]
[null,null,"EXPENDITURE \n($0's)"]
[null,"CONNECTION PROJECT",{"$f":"CRY","v":"2017-18"}]
[null,"DIRECT MATERIALS EXPENDITURE"]
[null,"<Enter project description here…>"]
[]
[]
[]
[]
[]
[]
[]
[]
[]
[]
[]
[]
[]
[]
[]
[]
[]
[]
[]
[]
[]
[]
[]
[]
[null,"DIRECT LABOUR EXPENDITURE"]
[null,{"$f":"IF(ISBLANK(B12),\"\",B12)","v":"<Enter project description here…>"}]
[null,""]
[null,""]
[null,""]
[null,""]
[null,""]
[null,""]
[null,""]
[null,""]
[null,""]
[null,""]
[null,""]
[null,""]
[null,""]
[null,""]
[null,""]
[null,""]
[null,""]
[null,""]
[null,""]
[null,""]
[null,""]
[null,""]
[null,""]
[]
[]
[]
[]
[null,"2.5.2 - DESCRIPTION OF CONNECTION PROJECTS"]
[null,null,"CONNECTION RATING (MVA)","CONNECTION \nVOLTAGE (KV)","UNDERGROUND / OVERHEAD","YEAR CONNECTION PROJECT COMPLETED "]
[null,{"$f":"IF(ISBLANK(B12),\"\",B12)","v":"<Enter project description here…>"}]
[null,""]
[null,""]
[null,""]
[null,""]
[null,""]
[null,""]
[null,""]
[null,""]
[null,""]
[null,""]
[null,""]
[null,""]
[null,""]
[null,""]
[null,""]
[null,""]
[null,""]
[null,""]
[null,""]
[null,""]
[null,""]
[null,""]
[null,""]

{"sheet":"2.6 Non-network","index":8,"n_rows":93,"n_cols":5,"rows_kept":93,"cut":false,"hidden":false,"merged":[[78,1,82,1],[83,1,87,1],[88,1,92,1],[5,1,5,2],[68,1,72,1],[60,2,60,3],[61,2,61,3],[62,2,62,3],[73,1,77,1]]}
[null,"REGULATORY REPORTING STATEMENT"]
[null,{"$f":"INDEX(dms_TradingNameFull_List,MATCH(dms_TradingName,dms_TradingName_List))","v":"Queensland Electricity Transmission Corporation Limited trading as Powerlink Queensland"}]
[null,{"$f":"CONCATENATE((LOOKUP(dms_Model,dms_Model_List,dms_Worksheet_List))&\" \"&CRY)","v":"CATEGORY ANALYSIS 2017-18"}]
[null,"2.6 NON NETWORK EXPENDITURE"]
[]
[null,"There are THREE tables on this worksheet - each has been 'grouped' (and sub-grouped) for easy navigation. See the Instructions sheet on how to group or ungroup tables. "]
[]
[null,"2.6.1 - NON-NETWORK EXPENDITURE"]
[null,null,null,null,"EXPENDITURE\n($0's)"]
[null,"SERVICE SUBCATEGORY","ASSET CATEGORY",null,{"$f":"CRY","v":"2017-18"}]
[null,"OPEX"]
[null,"IT & COMMUNICATIONS","Client device expenditure",null,1427327]
[null,null,"Recurrent expenditure",null,19989253]
[null,null,"Non-recurrent expenditure",null,0]
[null,"MOTOR VEHICLES","Car",null,286745]
[null,null,"Light commercial vehicle",null,1498696]
[null,null,"Elevated work platform (LCV)  ",null,0]
[null,null,"Elevated work platform (HCV)",null,0]
[null,null,"Heavy commercial vehicle",null,155553]
[null,"BUILDINGS AND PROPERTY","Total buildings and property expenditure",null,5423355]
[null,"OTHER","Other expenditure",null,0]
[null,"OTHER - DNSP nominated","Motor Vehicle - Other",null,259787]
[]
[]
[]
[]
[]
[]
[]
[]
[]
[]
[null,"CAPEX"]
[null,"IT & COMMUNICATIONS","Client device expenditure",null,697829]
[null,null,"Recurrent expenditure",null,6427025]
[null,null,"Non-recurrent expenditure",null,20772597]
[null,"MOTOR VEHICLES","Car",null,281474]
[null,null,"Light commercial vehicle",null,1436271]
[null,null,"Elevated work platform (LCV)  ",null,0]
[null,null,"Elevated work platform (HCV)",null,0]
[null,null,"Heavy commercial vehicle",null,312208]
[null,"BUILDINGS AND PROPERTY","Total buildings and property expenditure",null,2223513]
[null,"OTHER","Other expenditure",null,0]
[null,"OTHER - DNSP nominated","Motor Vehicle - Other",null,726558]
[null,null,"Tools and Equipment",null,1839695]
[]
[]
[]
[]
[]
[]
[]
[]
[]
[]
[]
[]
[null,"2.6.2 - ANNUAL DESCRIPTOR METRICS - IT & COMMUNICATIONS EXPENDITURE"]
[null,null,null,null,"VOLUMES\n(0's)"]
[null,"NON-NETWORK CATEGORY","DESCRIPTOR METRIC",null,{"$f":"CRY","v":"2017-18"}]
[null,"IT & COMMUNICATIONS","Employee numbers",null,842.49]
[null,null,"User numbers",null,1656]
[null,null,"Number of devices",null,2042]
[]
[]
[null,"2.6.3 - ANNUAL DESCRIPTOR METRICS - MOTOR VEHICLES"]
[null,null,null,null,"VOLUMES / %"]
[null,"ASSET CATEGORY","DESCRIPTOR METRIC","UNITS",{"$f":"CRY","v":"2017-18"}]
[null,"CAR","Average kilometres travelled","0's",16507]
[null,null,"Number purchased","0's",6]
[null,null,"Number leased","0's",0]
[null,null,"Number in fleet","0's",47]
[null,null,"Proportion of total fleet expenditure allocated as regulatory expenditure","(per cent)",0.80800000000000005]
[null,"LIGHT COMMERCIAL VEHICLE","Average kilometres travelled","0's",23055]
[null,null,"Number purchased","0's",15]
[null,null,"Number leased","0's",0]
[null,null,"Number in fleet","0's",139]
[null,null,"Proportion of total fleet expenditure allocated as regulatory expenditure","(per cent)",0.80800000000000005]
[null,"ELEVATED WORK PLATFORM (LCV) ","Average kilometres travelled","0's",0]
[null,null,"Number purchased","0's",0]
[null,null,"Number leased","0's",0]
[null,null,"Number in fleet","0's",0]
[null,null,"Proportion of total fleet expenditure allocated as regulatory expenditure","(per cent)",0]
[null,"ELEVATED WORK PLATFORM (HCV)","Average kilometres travelled","0's",0]
[null,null,"Number purchased","0's",0]
[null,null,"Number leased","0's",0]
[null,null,"Number in fleet","0's",0]
[null,null,"Proportion of total fleet expenditure allocated as regulatory expenditure","(per cent)",0]
[null,"HEAVY COMMERCIAL VEHICLE ","Average kilometres travelled","0's",14958]
[null,null,"Number purchased","0's",1]
[null,null,"Number leased","0's",0]
[null,null,"Number in fleet","0's",7]
[null,null,"Proportion of total fleet expenditure allocated as regulatory expenditure","(per cent)",0.80800000000000005]

{"sheet":"2.7 Vegetation management","index":9,"n_rows":158,"n_cols":5,"rows_kept":158,"cut":false,"hidden":false,"merged":[[5,1,5,2],[149,1,149,3]]}
[null,"REGULATORY REPORTING STATEMENT"]
[null,{"$f":"INDEX(dms_TradingNameFull_List,MATCH(dms_TradingName,dms_TradingName_List))","v":"Queensland Electricity Transmission Corporation Limited trading as Powerlink Queensland"}]
[null,{"$f":"CONCATENATE((LOOKUP(dms_Model,dms_Model_List,dms_Worksheet_List))&\" \"&CRY)","v":"CATEGORY ANALYSIS 2017-18"}]
[null,"2.7 VEGETATION MANAGEMENT"]
[]
[null,"There are THREE tables on this worksheet. Each has been 'grouped' for easy navigation. See the Instructions sheet on how to group or ungroup data."]
[]
[null,"2.7.1 - DESCRIPTOR METRICS BY ZONE"]
[null,null,null,null,"VOLUMES"]
[null,"ZONES","ASSET / ENVIRONMENTAL FACTOR","UNITS",{"$f":"CRY","v":"2017-18"}]
[null,"ZONE 1 (URBAN)","Route line length within zone","km",702]
[null,null,"Number of maintenance spans","0's",1325]
[null,null,"Total length of maintenance spans","km",433]
[null,null,"Average number of trees per maintenance span","0's",1438]
[null,null,"Length of vegetation corridors","km",702]
[null,null,"Average width of vegetation corridors","metres",52]
[null,null,"Average frequency of cutting cycle","years",1]
[null,"ZONE 2 (RURAL)","Route line length within zone","km",7098]
[null,null,"Number of maintenance spans","0's",4764]
[null,null,"Total length of maintenance spans","km",2023]
[null,null,"Average number of trees per maintenance span","0's",969]
[null,null,"Length of vegetation corridors","km",2366]
[null,null,"Average width of vegetation corridors","metres",55]
[null,null,"Average frequency of cutting cycle","years",3]
[null,"ZONE 3 (TROPICAL)","Route line length within zone","km",1828]
[null,null,"Number of maintenance spans","0's",2270]
[null,null,"Total length of maintenance spans","km",912]
[null,null,"Average number of trees per maintenance span","0's",952]
[null,null,"Length of vegetation corridors","km",914]
[null,null,"Average width of vegetation corridors","metres",50]
[null,null,"Average frequency of cutting cycle","years",2]
[null,"ZONE 4","Route line length within zone","km"]
[null,null,"Number of maintenance spans","0's"]
[null,null,"Total length of maintenance spans","km"]
[null,null,"Average number of trees per maintenance span","0's"]
[null,null,"Length of vegetation corridors","km"]
[null,null,"Average width of vegetation corridors","metres"]
[null,null,"Average frequency of cutting cycle","years"]
[null,"ZONE 5","Route line length within zone","km"]
[null,null,"Number of maintenance spans","0's"]
[null,null,"Total length of maintenance spans","km"]
[null,null,"Average number of trees per maintenance span","0's"]
[null,null,"Length of vegetation corridors","km"]
[null,null,"Average width of vegetation corridors","metres"]
[null,null,"Average frequency of cutting cycle","years"]
[null,"ZONE 6","Route line length within zone","km"]
[null,null,"Number of maintenance spans","0's"]
[null,null,"Total length of maintenance spans","km"]
[null,null,"Average number of trees per maintenance span","0's"]
[null,null,"Length of vegetation corridors","km"]
[null,null,"Average width of vegetation corridors","metres"]
[null,null,"Average frequency of cutting cycle","years"]
[null,"ZONE 7","Route line length within zone","km"]
[null,null,"Number of maintenance spans","0's"]
[null,null,"Total length of maintenance spans","km"]
[null,null,"Average number of trees per maintenance span","0's"]
[null,null,"Length of vegetation corridors","km"]
[null,null,"Average width of vegetation corridors","metres"]
[null,null,"Average frequency of cutting cycle","years"]
[null,"ZONE 8","Route line length within zone","km"]
[null,null,"Number of maintenance spans","0's"]
[null,null,"Total length of maintenance spans","km"]
[null,null,"Average number of trees per maintenance span","0's"]
[null,null,"Length of vegetation corridors","km"]
[null,null,"Average width of vegetation corridors","metres"]
[null,null,"Average frequency of cutting cycle","years"]
[null,"ZONE 9","Route line length within zone","km"]
[null,null,"Number of maintenance spans","0's"]
[null,null,"Total length of maintenance spans","km"]
[null,null,"Average number of trees per maintenance span","0's"]
[null,null,"Length of vegetation corridors","km"]
[null,null,"Average width of vegetation corridors","metres"]
[null,null,"Average frequency of cutting cycle","years"]
[null,"ZONE 10","Route line length within zone","km"]
[null,null,"Number of maintenance spans","0's"]
[null,null,"Total length of maintenance spans","km"]
[null,null,"Average number of trees per maintenance span","0's"]
[null,null,"Length of vegetation corridors","km"]
[null,null,"Average width of vegetation corridors","metres"]
[null,null,"Average frequency of cutting cycle","years"]
[]
[]
[null,"2.7.2 - EXPENDITURE METRICS BY ZONE"]
[null,null,null,null,"EXPENDITURE\n($0's)"]
[null,"ZONES","SERVICE SUBCATEGORY",null,{"$f":"CRY","v":"2017-18"}]
[null,{"$f":"B11","v":"ZONE 1 (URBAN)"},"Tree trimming",null,304544.04000000004]
[null,null,"Vegetation corridor clearance ",null,2120735.1700000004]
[null,null,"Inspection ",null,82938.699999999983]
[null,null,"Audit ",null,0]
[null,null,"Contractor liaison expenditure ",null,442563.17000000045]
[null,null,"Other vegetation management expenditure",null,0]
[null,{"$f":"B18","v":"ZONE 2 (RURAL)"},"Tree trimming",null,45572.57]
[null,null,"Vegetation corridor clearance ",null,5801572.2000000039]
[null,null,"Inspection ",null,355945.24000000011]
[null,null,"Audit ",null,0]
[null,null,"Contractor liaison expenditure ",null,809200.33999999985]
[null,null,"Other vegetation management expenditure",null,0]
[null,{"$f":"B25","v":"ZONE 3 (TROPICAL)"},"Tree trimming",null,308173.08999999997]
[null,null,"Vegetation corridor clearance ",null,2057975.0799999998]
[null,null,"Inspection ",null,65633.84]
[null,null,"Audit ",null,0]
[null,null,"Contractor liaison expenditure ",null,309458.65000000002]
[null,null,"Other vegetation management expenditure",null,0]
[null,{"$f":"B32","v":"ZONE 4"},"Tree trimming"]
[null,null,"Vegetation corridor clearance "]
[null,null,"Inspection "]
[null,null,"Audit "]
[null,null,"Contractor liaison expenditure "]
[null,null,"Other vegetation management expenditure"]
[null,{"$f":"B39","v":"ZONE 5"},"Tree trimming"]
[null,null,"Vegetation corridor clearance "]
[null,null,"Inspection "]
[null,null,"Audit "]
[null,null,"Contractor liaison expenditure "]
[null,null,"Other vegetation management expenditure"]
[null,{"$f":"B46","v":"ZONE 6"},"Tree trimming"]
[null,null,"Vegetation corridor clearance "]
[null,null,"Inspection "]
[null,null,"Audit "]
[null,null,"Contractor liaison expenditure "]
[null,null,"Other vegetation management expenditure"]
[null,{"$f":"B53","v":"ZONE 7"},"Tree trimming"]
[null,null,"Vegetation corridor clearance "]
[null,null,"Inspection "]
[null,null,"Audit "]
[null,null,"Contractor liaison expenditure "]
[null,null,"Other vegetation management expenditure"]
[null,{"$f":"B60","v":"ZONE 8"},"Tree trimming"]
[null,null,"Vegetation corridor clearance "]
[null,null,"Inspection "]
[null,null,"Audit "]
[null,null,"Contractor liaison expenditure "]
[null,null,"Other vegetation management expenditure"]
[null,{"$f":"B67","v":"ZONE 9"},"Tree trimming"]
[null,null,"Vegetation corridor clearance "]
[null,null,"Inspection "]
[null,null,"Audit "]
[null,null,"Contractor liaison expenditure "]
[null,null,"Other vegetation management expenditure"]
[null,{"$f":"B74","v":"ZONE 10"},"Tree trimming"]
[null,null,"Vegetation corridor clearance "]
[null,null,"Inspection "]
[null,null,"Audit "]
[null,null,"Contractor liaison expenditure "]
[null,null,"Other vegetation management expenditure"]
[]
[]
[null,"2.7.3 - DESCRIPTOR METRICS ACROSS ALL ZONES - UNPLANNED VEGETATION EVENTS"]
[null,null,null,null,"VOLUMES\n(0's)"]
[null,"DESCRIPTOR METRIC",null,null,{"$f":"CRY","v":"2017-18"}]
[null,"Number of fire starts caused by vegetation grow-ins (NSP responsibility)",null,"",1]
[null,"Number of fire starts caused by vegetation blow-ins and fall-ins (NSP responsibility)",null,"",0]
[null,"Number of outages caused by vegetation grow-ins (NSP responsibility)",null,"",1]
[null,"Number of outages caused by vegetation blow-ins and fall-ins (NSP responsibility)",null,"",0]
[null,"Number of fire starts caused by vegetation grow-ins (other party responsibility)",null,"",0]
[null,"Number of fire starts caused by vegetation blow-ins and fall-ins (other party responsibility)",null,"",0]
[null,"Number of outages caused by vegetation grow-ins (other party responsibility)",null,"",0]
[null,"Number of outages caused by vegetation blow-ins and fall-ins (other party responsibility)",null,"",0]

{"sheet":"2.8 Maintenance","index":10,"n_rows":81,"n_cols":10,"rows_kept":81,"cut":false,"hidden":false,"merged":[[46,5,46,6],[15,1,17,1],[53,1,55,1],[47,1,48,1],[11,1,14,1],[49,1,52,1],[47,2,48,4],[5,1,5,2],[8,5,8,6],[8,7,9,7],[8,8,10,8],[8,9,10,9],[9,1,10,1],[9,2,10,2],[9,4,10,4],[9,3,10,3]]}
[null,"REGULATORY REPORTING STATEMENT"]
[null,{"$f":"INDEX(dms_TradingNameFull_List,MATCH(dms_TradingName,dms_TradingName_List))","v":"Queensland Electricity Transmission Corporation Limited trading as Powerlink Queensland"}]
[null,{"$f":"CONCATENATE((LOOKUP(dms_Model,dms_Model_List,dms_Worksheet_List))&\" \"&CRY)","v":"CATEGORY ANALYSIS 2017-18"}]
[null,"2.8 MAINTENANCE"]
[]
[null,"There are TWO tables on this worksheet. Each has been 'grouped' for easy navigation. See the Instructions sheet on how to group or ungroup data."]
[]
[null,"2.8.1 - DESCRIPTOR METRICS FOR ROUTINE AND NON-ROUTINE MAINTENANCE"]
[null,null,null,null,null,"ASSET QUANTITY",null,"AVERAGE AGE OF ASSET GROUP ","INSPECTION CYCLE \n(YEARS)","MAINTENANCE CYCLE \n(YEARS)"]
[null,"MAINTENANCE ACTIVITY","MAINTENANCE ASSET CATEGORY","MEASURE \n/ ASSET QUANTITY","UNITS","AT YEAR END","INSPECTED/ MAINTAINED"]
[null,null,null,null,null,{"$f":"CRY","v":"2017-18"},{"$f":"CRY","v":"2017-18"},{"$f":"CRY","v":"2017-18"}]
[null,"Transmission lines maintenance","Transmission towers","Number of towers","0's",23532,23532,29.23,1,0]
[null,null,"Transmission tower support structures","Number of towers","0's",23532,23532,29.23,1,0]
[null,null,"Conductors","Route length","km",9627,9627,27.07,1,0]
[null,null,"Transmission cables","Route length","km",21.53,21.53,21.06,0.5,0]
[null,"Substations equipment & property maintenance","Substation switchbays (incl. Reactive plant)","Number of switchbays","0's",1486,1486,17.21,6,0]
[null,null,"Substation power transformers","Number of transformers","0's",201,201,18.62,0.5,6]
[null,null,"Substation property","Number of substation properties maintained","0's",128,128,27.11,0.5,0]
[null,"SCADA & network control maintenance","SCADA & network control maintenance","Comms and SCADA equipment",null,5905,5905,10.68,1,0]
[null,"Protection systems maintenance","Protection systems maintenance","Protection relays",null,5176,5176,9.7260000000000009,6,0]
[null,"Other maintenance activity ","Transmission lines maintenance","Insulator strings (000's)",null,169.3,1.6930000000000001,17.23,5,0]
[null,null,"Corridor maintenance (non veg)","Length (route km)",null,9627,3978,29.23,1,0]
[]
[]
[]
[]
[]
[]
[]
[]
[]
[]
[]
[]
[]
[]
[]
[]
[]
[]
[]
[]
[]
[]
[]
[null,"2.8.2 - COST METRICS FOR ROUTINE AND NON-ROUTINE MAINTENANCE"]
[null,null,null,null,null,"DIRECT EXPENDITURE\n($0's)"]
[null,"ASSET CATEGORIES","ASSET SUBCATEGORIES",null,null," ROUTINE MAINTENANCE","NON-ROUTINE MAINTENANCE"]
[null,null,null,null,null,{"$f":"CRY","v":"2017-18"},{"$f":"CRY","v":"2017-18"}]
[null,"Transmission lines maintenance","Transmission towers",null,null,2565422.6100000073,8249269.4399999995]
[null,null,"Transmission tower support structures",null,null,719523.15000000095,16913809.349999998]
[null,null,"Conductors",null,null,0,49465.34]
[null,null,"Transmission cables",null,null,172935.37999999995,170298.92]
[null,"Substations equipment & property maintenance","Substation switchbays (incl. Reactive plant)",null,null,4540724.9699999839,13781746.489999928]
[null,null,"Substation power transformers",null,null,859958.47000000009,5134263.5999999978]
[null,null,"Substation property",null,null,1920311.3999999894,6588776.2200000072]
[null,"SCADA & network control maintenance","SCADA & network control maintenance",null,null,1247359.2100000014,5112623.4999999767]
[null,"Protection systems maintenance","Protection systems maintenance",null,null,694497.02999999991,3464266.879999998]
[null,"Other maintenance activity ",{"$f":"IF(ISBLANK(C21),\"\",C21)","v":"Transmission lines maintenance"},{"$f":"IF(ISBLANK(D21),\"\",D21)","v":"Insulator strings (000's)"},""]
[null,null,{"$f":"IF(ISBLANK(C22),\"\",C22)","v":"Corridor maintenance (non veg)"},"Length (route km)","",1932.87,3705934.6900000004]
[null,null,"","",""]
[null,null,"","",""]
[null,null,"","",""]
[null,null,"","",""]
[null,null,"","",""]
[null,null,"","",""]
[null,null,"","",""]
[null,null,"","",""]
[null,null,"","",""]
[null,null,"","",""]
[null,null,"","",""]
[null,null,"","",""]
[null,null,"","",""]
[null,null,"","",""]
[null,null,"","",""]
[null,null,"","",""]
[null,null,"","",""]
[null,null,"","",""]
[null,null,"","",""]
[null,null,"","",""]
[null,null,"","",""]

{"sheet":"2.10 Overheads","index":11,"n_rows":129,"n_cols":4,"rows_kept":129,"cut":false,"hidden":false,"merged":[[205,51,205,58],[101,1,101,3],[9,1,9,2],[208,56,208,57],[208,7,208,10],[208,11,208,12],[208,15,208,19],[208,20,208,21],[208,24,208,28],[208,29,208,30],[208,33,208,37],[208,38,208,39],[208,42,208,46],[208,47,208,48],[208,51,208,55],[205,7,205,13],[205,15,205,22],[205,24,205,31],[205,33,205,40],[205,42,205,49],[177,43,177,44],[177,65,177,66],[177,67,177,68],[177,71,177,75],[177,45,177,46],[177,49,177,53],[177,54,177,55],[177,56,177,57],[175,60,175,69],[175,71,175,80],[177,34,177,35],[175,16,175,25],[175,27,175,36],[175,38,175,47],[175,49,175,58],[177,16,177,20],[177,21,177,22],[177,23,177,24],[177,27,177,31],[177,32,177,33],[177,76,177,77],[177,78,177,79],[177,38,177,42],[177,60,177,64],[6,1,6,2],[66,1,66,3],[42,1,42,3],[14,1,14,3],[43,1,63,1]]}
[null,"REGULATORY REPORTING STATEMENT"]
[null,{"$f":"INDEX(dms_TradingNameFull_List,MATCH(dms_TradingName,dms_TradingName_List))","v":"Queensland Electricity Transmission Corporation Limited trading as Powerlink Queensland"}]
[null,{"$f":"CONCATENATE((LOOKUP(dms_Model,dms_Model_List,dms_Worksheet_List))&\" \"&CRY)","v":"CATEGORY ANALYSIS 2017-18"}]
[null,"2.10 OVERHEADS"]
[]
[]
[null,"There are TWO tables on this worksheet. Each has been 'grouped' (and sub-grouped) for easy navigation. See the Instructions sheet on how to group or ungroup data."]
[]
[null,"Instructions"]
[null,"Enter each expenditure category currently reported under annual Information Guidelines."]
[]
[null,"2.10.1 - NETWORK OVERHEADS EXPENDITURE"]
[null,null,null,"EXPENDITURE\n($0's)"]
[null,null,null,{"$f":"CRY","v":"2017-18"}]
[null,"MAINTENANCE SUPPORT"]
[null,"Prescribed Services",null,11651706]
[]
[]
[]
[]
[]
[]
[]
[]
[]
[]
[]
[]
[]
[]
[]
[]
[]
[]
[]
[]
[]
[]
[]
[]
[null,"Negotiated Services","Total",382322]
[null,"Unregulated Services","Total",399969]
[null,"NETWORK MONITORING AND CONTROL"]
[null,"Prescribed Services",null,15510588]
[]
[]
[]
[]
[]
[]
[]
[]
[]
[]
[]
[]
[]
[]
[]
[]
[]
[]
[]
[]
[null,"Negotiated Services","Total",761027]
[null,"Unregulated Services","Total",517626]
[null,"ASEET MANAGEMENT SUPPORT"]
[null,"Prescribed Services",null,21629882]
[]
[]
[]
[]
[]
[]
[]
[]
[]
[]
[]
[]
[]
[]
[]
[]
[]
[]
[]
[]
[]
[]
[]
[]
[]
[null,"Negotiated Services","Total",399658]
[null,"Unregulated Services","Total",932883]
[]
[]
[]
[null,"2.10.2 - CORPORATE OVERHEADS EXPENDITURE"]
[null,null,null,"EXPENDITURE\n($0's)"]
[null,null,null,{"$f":"CRY","v":"2017-18"}]
[null,"CORPORATE OVERHEADS"]
[null,"Prescribed Services","Grid Support",0]
[null,null,"Corporate Support",50707082]
[null,null,"Insurance Premiums",6646743]
[null,null,"Self Insurance",7167012]
[null,null,"AEMC Levy",4581420]
[null,null,"Project - write-off",3545260]
[]
[]
[]
[]
[]
[]
[]
[]
[]
[]
[]
[]
[]
[]
[]
[]
[]
[]
[]
[null,"Negotiated Services","Total",1338020]
[null,"Unregulated Services","Total",4665425]

{"sheet":"2.11 Labour","index":12,"n_rows":54,"n_cols":7,"rows_kept":54,"cut":false,"hidden":false,"merged":[[5,1,5,2],[33,3,33,4],[33,5,33,6],[8,5,9,5],[8,6,9,6],[8,3,9,3],[8,4,9,4]]}
[null,"REGULATORY REPORTING STATEMENT"]
[null,{"$f":"INDEX(dms_TradingNameFull_List,MATCH(dms_TradingName,dms_TradingName_List))","v":"Queensland Electricity Transmission Corporation Limited trading as Powerlink Queensland"}]
[null,{"$f":"CONCATENATE((LOOKUP(dms_Model,dms_Model_List,dms_Worksheet_List))&\" \"&CRY)","v":"CATEGORY ANALYSIS 2017-18"}]
[null,"2.11 LABOUR"]
[]
[null,"There are TWO tables on this worksheet. Each table has been 'grouped' (and sub-grouped) for easy navigation.  See the Instructions sheet on how to group or ungroup data."]
[]
[null,"2.11.1 - COST METRICS PER ANNUM"]
[null,null,null,"ASL \n(0's)","TOTAL LABOUR EXPENDITURE \n($0's)","AVERAGE PRODUCTIVE WORK HOURS \nPER ASL \n(0's)","STAND-DOWN OCCURENCES \nPER ASL\n(0's)"]
[]
[null,null,null,{"$f":"CRY","v":"2017-18"},{"$f":"CRY","v":"2017-18"},{"$f":"CRY","v":"2017-18"},{"$f":"CRY","v":"2017-18"}]
[null,"CORPORATE OVERHEADS","Executive manager",2.835,1422334.7825591334,1235.4062142857151,0]
[null,null,"Senior manager",4.5765000000000002,1179667.5969987304,1331.5081061946908,0]
[null,null,"Manager",17.812574999999999,3553949.5859671966,1293.2178223502194,0]
[null,null,"Professional",110.45632499999992,19016159.602364454,1294.5473558136916,0]
[null,null,"Semi professional",4.9275000000000002,767870.73534406105,1261.0816545205485,0]
[null,null,"Support staff",40.978574999999999,4727160.9046117468,1279.9684123276666,0]
[null,null,"Intern, junior staff, apprentice",3.8704500000000004,233266.8595922082,1318.6425936519015,0]
[null,"NETWORK OVERHEADS","Executive manager",1.62,680175.1808182617,1327.7722500000007,0]
[null,null,"Senior manager",7.02,1847739.6765052716,1304.6165307692295,0]
[null,null,"Manager",16.499025000000003,3598607.2082038871,1284.7288813157104,0]
[null,null,"Professional",113.388525,20943243.627117869,1318.3205355997165,0]
[null,null,"Semi professional",45.362700000000004,7865437.0497846678,1297.3537881316656,0]
[null,null,"Support staff",17.391374999999989,1802726.8576411109,1253.6182032214231,0]
[null,null,"Intern, junior staff, apprentice",4.2443999999999997,403001.94628430862,1366.6361736641227,0]
[null,"TOTAL DIRECT NETWORK LABOUR","Skilled electrical worker",103.27500000000001,16580284.600175193,1473.9812588117643,0]
[null,null,"Skilled non electical worker",0,0,0,0]
[null,null,"Apprentice",21.472425000000005,2049076.7844028824,1330.879936547107,0]
[null,null,"Unskilled worker",1.62,243242.17191872859,1598.0468197499999,0]
[]
[]
[null,"2.11.2 - DESCRIPTOR METRICS"]
[null,"AVERAGE PRODUCTIVE WORK HOURS PER ASL"]
[null,null,null,"ORDINARY TIME (0's)",null,"OVERTIME (0's)"]
[null,null,null,"PER ASL","HOURLY RATE \nPER ASL","PER ASL","HOURLY RATE \nPER ASL"]
[null,null,null,{"$f":"CRY","v":"2017-18"},{"$f":"CRY","v":"2017-18"},{"$f":"CRY","v":"2017-18"},{"$f":"CRY","v":"2017-18"}]
[null,"CORPORATE OVERHEADS","Executive manager",1235.4062142857151,258.20104235998247,0,0]
[null,null,"Senior manager",1331.5081061946908,115.23215265814497,0,0]
[null,null,"Manager",1292.4837301148182,90.801264746795582,0.73409223540111423,74.01237832413446]
[null,null,"Professional",1281.4200191817351,70.558459913763244,8.5323870002804405,64.589706728004643]
[null,null,"Semi professional",1237.5885476712335,64.344461158366769,23.493106849315065,71.76226309226935]
[null,null,"Support staff",1246.6019114045309,48.538526224168422,28.472747064455994,51.696959364139978]
[null,null,"Intern, junior staff, apprentice",1296.9480418555986,24.256581843818637,21.694551796302754,57.569430379746855]
[null,"NETWORK OVERHEADS","Executive manager",1327.7722500000007,180.14548487852491,0,0]
[null,null,"Senior manager",1304.6165307692295,117.02764450678642,0,0]
[null,null,"Manager",1276.8162453872237,99.115532632337192,7.9126359284866838,105.49356467986733]
[null,null,"Professional",1271.4066547915575,76.777764769917113,45.884694002081879,97.823502523146743]
[null,null,"Semi professional",1211.5050404581937,68.909120979439408,85.311349948543537,115.28585317028735]
[null,null,"Support staff",1247.9457824956326,44.486219530099184,5.6724207257908059,29.890217478052673]
[null,null,"Intern, junior staff, apprentice",1421.587143342392,36.137484388472281,37.891161684782617,41.175899882368306]
[null,"TOTAL DIRECT NETWORK LABOUR","Skilled electrical worker",1230.9453011647017,51.382818639923329,243.03595764705855,73.707150492241013]
[null,null,"Skilled non electical worker",0,0,0,0]
[null,null,"Apprentice",1195.9647109961968,34.313151380136283,134.97633648737855,45.885536783914596]
[null,null,"Unskilled worker",1296.6336697500003,42.900863185764102,301.41315000000003,67.707643470432529]

{"sheet":"2.12 Input tables","index":13,"n_rows":83,"n_cols":9,"rows_kept":83,"cut":false,"hidden":false,"merged":[[9,1,28,1],[29,1,46,1]]}
[null,"REGULATORY REPORTING STATEMENT"]
[null,{"$f":"INDEX(dms_TradingNameFull_List,MATCH(dms_TradingName,dms_TradingName_List))","v":"Queensland Electricity Transmission Corporation Limited trading as Powerlink Queensland"}]
[null,{"$f":"CONCATENATE((LOOKUP(dms_Model,dms_Model_List,dms_Worksheet_List))&\" \"&CRY)","v":"CATEGORY ANALYSIS 2017-18"}]
[null,"2.12 INPUT TABLES"]
[]
[]
[null,"2.12  INPUT TABLES"]
[null,null,null,"DIRECT MATERIAL EXPENDITURE ($0's)","DIRECT LABOUR EXPENDITURE ($0's)","CONTRACT \nEXPENDITURE ($0's)","OTHER \nEXPENDITURE ($0's)","RELATED PARTY CONTRACT \nEXPENDITURE ($0's)","RELATED PARTY CONTRACT MARGIN"]
[null,null,null,{"$f":"CRY","v":"2017-18"},"2017-18","2017-18","2017-18","2017-18","2017-18"]
[null,"VEGETATION MANAGEMENT",{"$f":"'2.7 Vegetation management'!B11","v":"ZONE 1 (URBAN)"},55843.130000000005,404072.30000000045,2414907.8200000003,75957.829999999973]
[null,null,{"$f":"'2.7 Vegetation management'!B18","v":"ZONE 2 (RURAL)"},2888.8900000000003,425073.12999999989,6488004.6800000034,96323.650000000023]
[null,null,{"$f":"'2.7 Vegetation management'!B25","v":"ZONE 3 (TROPICAL)"},0,0,2741240.6599999997,0]
[null,null,{"$f":"'2.7 Vegetation management'!B32","v":"ZONE 4"}]
[null,null,{"$f":"'2.7 Vegetation management'!B39","v":"ZONE 5"}]
[null,null,{"$f":"'2.7 Vegetation management'!B46","v":"ZONE 6"}]
[null,null,{"$f":"'2.7 Vegetation management'!B53","v":"ZONE 7"}]
[null,null,{"$f":"'2.7 Vegetation management'!B60","v":"ZONE 8"}]
[null,null,{"$f":"'2.7 Vegetation management'!B67","v":"ZONE 9"}]
[null,null,{"$f":"'2.7 Vegetation management'!B74","v":"ZONE 10"}]
[]
[]
[]
[]
[]
[]
[]
[]
[]
[]
[null,"ROUTINE MAINTENANCE","Transmission Lines Maintenance",1311.48,873640.28000000026,2333826.9400000083,249102.43999999965]
[null,null,"Substations Equipment & Propoerty Maintenance",21003.880000000005,2468175.8800000018,4188132.8099999744,643682.26999999711]
[null,null,"SCADA & Network Control Maintenance",1052.6999999999998,333648.47000000044,842020.83000000089,70637.21000000005]
[null,null,"Protection Systems Maintenance",0,214354.9699999998,439140.35,41001.710000000065]
[null,null,"Other Maintenance Activity",null,1277.5999999999999,237.8,417.46999999999997]
[]
[]
[]
[]
[]
[]
[]
[]
[]
[]
[]
[]
[]
[null,"NON-ROUTINE MAINTENANCE","Transmission Lines Maintenance",2439285.2200000007,7242405.8399999915,13325019.160000004,2376132.8299999991]
[null,null,"Substations Equipment & Propoerty Maintenance",2917756.3500000006,7562122.7799999677,13106503.919999979,1918403.2599999867]
[null,null,"Scada & Network Control Maintenance",179969.17999999991,2678071.3199999779,1838208.3199999989,416374.68000000092]
[null,null,"Protection Systems Maintenance",243747.27000000002,1781238.6200000015,1176022.3599999971,263258.62999999948]
[null,null,"Other Maintenance Activity",14399.92,102292.88999999991,3554388.64,34853.24]
[]
[]
[]
[]
[]
[]
[]
[]
[]
[]
[]
[null,"OVERHEADS","Network Overheads",436915.62999999995,33383757.529999994,2867671.4099999997,12103831.650000004]
[null,null,"Corporate Overheads",3628866.5672246348,30055246.402956538,12924162.044851763,26039242.176741008]
[null,"AUGMENTATION","Subtransmission Substations, Switching Stations , Zone Substations",15707.880000000003,214052.33,134178.88999999998,63461.99]
[null,null,"Subtransmission Lines",0,0,0,0]
[null,null,"HV Feeders",0,0,0,0]
[null,null,"Other Assets",0,0,0,0]
[null,"CONNECTIONS","All New Customer Connections"]
[null,"REPLACEMENT","Transmission Towers",34097.893224152867,144783.96919898782,2225052.9590888782,38690.071670251069]
[null,null,"Transmission Tower Support Structures",0,0,0,0]
[null,null,"Conductors",18294.520573543701,74669.759291259717,1153241.4108690373,19880.127349526785]
[null,null,"Transmission Cables",0,0,0,0]
[null,null,"Substation Switchbays",45685.349983278247,1440735.9733262938,1087433.1472813145,463152.50508732919]
[null,null,"Substation Power Transformers",0,0,0,0]
[null,null,"Substation Reactive Plant",0,0,0,0]
[null,null,"SCADA network control and protection systems",40383.173743934567,1236667.9106760793,1867448.8116489793,93658.189837537881]
[null,null,"Other ",8802.5298704084853,1302778.5611073789,996682.1275117906,226663.23186003708]
[null,"NON-NETWORK EXPENDITURE","IT and communications",0,384044.49,979544.28000000014,355917.33]
[null,null,"Motor Vehicles",2758507.3000000003,0,0,66721.75]
[null,null,"Buildings And Property",0,97400.75,921990.61,6093.8300000000008]
[null,null,"Other",641468.53,6894.06,20004,171328.95999999996]

{"sheet":"5.2 Asset Age Profile","index":14,"n_rows":180,"n_cols":114,"rows_kept":180,"cut":false,"hidden":false,"merged":[[179,1,204,1],[84,1,119,1],[120,1,144,1],[145,1,166,1],[167,1,178,1],[5,1,5,2],[8,3,8,4],[25,1,39,1],[40,1,61,1],[62,1,83,1]]}
[null,"REGULATORY REPORTING STATEMENT"]
[null,{"$f":"INDEX(dms_TradingNameFull_List,MATCH(dms_TradingName,dms_TradingName_List))","v":"Queensland Electricity Transmission Corporation Limited trading as Powerlink Queensland"}]
[null,{"$f":"CONCATENATE((LOOKUP(dms_Model,dms_Model_List,dms_Worksheet_List))&\" \"&CRY)","v":"CATEGORY ANALYSIS 2017-18"}]
[null,"5.2 ASSET AGE PROFILE"]
[null,"."]
[null,"There is ONE table on this worksheet. Both ROWS and COLUMNS have been 'grouped' for easy navigation. See the Instructions sheet on how to group or ungroup data."]
[]
[null,"TABLE 5.2.1 - ASSET AGE PROFILE"]
[null,null,null,"ECONOMIC LIFE (YEARS)",null,"INSTALLED ASSETS -˃ QUANTITY CURRENTLY IN COMMISSION BY YEAR"]
[null,"ASSET GROUP","ASSET CATEGORY","MEAN ","STANDARD DEVIATION ",{"$f":"CRY","v":"2017-18"},{"$f":"IF(dms_RPT=\"financial\",(VALUE(LEFT(F10,4)-1)&\"-\"&MID(F10,3,2)),VALUE(LEFT(F10,4)-1))","v":"2016-17"},{"$f":"IF(dms_RPT=\"financial\",(VALUE(LEFT(G10,4)-1)&\"-\"&MID(G10,3,2)),VALUE(LEFT(G10,4)-1))","v":"2015-16"},"2014-15","2013-14","2012-13","2011-12","2010-11","2009-10","2008-09","2007-08","2006-07","2005-06","2004-05","2003-04","2002-03","2001-02","2000-01","1999-00","1998-99","1997-98","1996-97","1995-96","1994-95","1993-94","1992-93","1991-92","1990-91","1989-90","1988-89","1987-88","1986-87","1985-86",{"$f":"IF(dms_RPT=\"financial\",(VALUE(LEFT(AL10,4)-1)&\"-\"&MID(AL10,3,2)),VALUE(LEFT(AL10,4)-1))","v":"1984-85"},"1983-84","1982-83","1981-82","1980-81","1979-80","1978-79","1977-78","1976-77","1975-76","1974-75","1973-74","1972-73","1971-72","1970-71","1969-70","1968-69","1967-68","1966-67","1965-66","1964-65","1963-64","1962-63","1961-62","1960-61","1959-60","1958-59","1957-58","1956-57","1955-56","1954-55","1953-54",{"$f":"IF(dms_RPT=\"financial\",(VALUE(LEFT(BR10,4)-1)&\"-\"&MID(BR10,3,2)),VALUE(LEFT(BR10,4)-1))","v":"1952-53"},"1951-52","1950-51","1949-50","1948-49","1947-48","1946-47","1945-46","1944-45","1943-44","1942-43","1941-42","1940-41","1939-40","1938-39","1937-38","1936-37","1935-36","1934-35","1933-34","1932-33","1931-32","1930-31","1929-30","1928-29","1927-28","1926-27","1925-26","1924-25","1923-24","1922-23","1921-22",{"$f":"IF(dms_RPT=\"financial\",(VALUE(LEFT(CX10,4)-1)&\"-\"&MID(CX10,3,2)),VALUE(LEFT(CX10,4)-1))","v":"1920-21"},"1919-20","1918-19",{"$f":"IF(dms_RPT=\"financial\",(VALUE(LEFT(DA10,4)-1)&\"-\"&MID(DA10,3,2)),VALUE(LEFT(DA10,4)-1))","v":"1917-18"},{"$f":"IF(dms_RPT=\"financial\",(VALUE(LEFT(DB10,4)-1)&\"-\"&MID(DB10,3,2)),VALUE(LEFT(DB10,4)-1))","v":"1916-17"},{"$f":"IF(dms_RPT=\"financial\",(VALUE(LEFT(DC10,4)-1)&\"-\"&MID(DC10,3,2)),VALUE(LEFT(DC10,4)-1))","v":"1915-16"},{"$f":"IF(dms_RPT=\"financial\",(VALUE(LEFT(DD10,4)-1)&\"-\"&MID(DD10,3,2)),VALUE(LEFT(DD10,4)-1))","v":"1914-15"},{"$f":"IF(dms_RPT=\"financial\",(VALUE(LEFT(DE10,4)-1)&\"-\"&MID(DE10,3,2)),VALUE(LEFT(DE10,4)-1))","v":"1913-14"},{"$f":"IF(dms_RPT=\"financial\",(VALUE(LEFT(DF10,4)-1)&\"-\"&MID(DF10,3,2)),VALUE(LEFT(DF10,4)-1))","v":"1912-13"},{"$f":"IF(dms_RPT=\"financial\",(VALUE(LEFT(DG10,4)-1)&\"-\"&MID(DG10,3,2)),VALUE(LEFT(DG10,4)-1))","v":"1911-12"},{"$f":"IF(dms_RPT=\"financial\",(VALUE(LEFT(DH10,4)-1)&\"-\"&MID(DH10,3,2)),VALUE(LEFT(DH10,4)-1))","v":"1910-11"},{"$f":"IF(dms_RPT=\"financial\",(VALUE(LEFT(DI10,4)-1)&\"-\"&MID(DI10,3,2)),VALUE(LEFT(DI10,4)-1))","v":"1909-10"}]
[null,"TRANSMISSION TOWERS\nHighest operating voltage; Circuit configuration","< = 33 kV; Single Circuit",0,0,0,0,0,0,0,0,0,0,0,0,0,0,0,0,0,0,0,0,0,0,0,0,0,0,0,0,0,0,0,18,0,0,0,0,0,0,0,0,0,0,0,0,0,0,0,0,0,0,0,0,0,0,0,0,0,0,0,0,0,0,0,0,0,0,0,0,0,0,0,0,0,0,0,0,0,0,0,0,0,0,0,0,0,0,0,0,0,0,0,0,0,0,0,0,0,0,0,0,0,0,0,0,0,0,0,0,0,0,0]
[null,null,"> 33 kV & < = 66 kV ; Single Circuit",0,0,0,0,0,0,0,0,0,0,0,0,0,0,0,0,0,0,0,0,0,0,0,0,0,0,0,0,0,0,0,0,0,0,0,0,0,0,0,0,0,0,0,0,0,0,0,0,0,0,0,0,0,0,0,0,0,0,0,0,0,0,0,0,0,0,0,0,0,0,0,0,0,0,0,0,0,0,0,0,0,0,0,0,0,0,0,0,0,0,0,0,0,0,0,0,0,0,0,0,0,0,0,0,0,0,0,0,0,0,0]
[null,null,"> 66 kV & < = 132 kV ; Single Circuit",50,7.1,0,2,8,7,22,14,17,39,20,191,20,100,16,15,4,8,2,1,9,0,3,0,0,0,0,122,5,0,4,0,233,477,12,1,0,0,151,144,0,34,25,464,0,0,4,6,0,0,0,458,0,175,0,128,0,228,0,0,0,0,0,0,0,0,0,0,0,0,0,0,0,0,0,0,0,0,0,0,0,0,0,0,0,0,0,0,0,0,0,0,0,0,0,0,0,0,0,0,0,0,0,0,0,0,0,0,0,0,0]
[null,null,"> 132 kV & < = 275 kV ; Single Circuit",50,7.1,16,0,0,8,8,18,6,11,21,17,12,12,0,221,42,272,1,2,0,72,2,0,161,150,40,462,0,17,0,10,114,171,363,239,0,299,357,1162,223,414,951,1093,0,362,0,982,0,0,0,0,0,0,0,0,0,0,0,0,0,0,0,0,0,0,0,0,0,0,0,0,0,0,0,0,0,0,0,0,0,0,0,0,0,0,0,0,0,0,0,0,0,0,0,0,0,0,0,0,0,0,0,0,0,0,0,0,0,0,0]
[null,null,"> 275 kV & < = 330 kV ; Single Circuit",50,7.1,0,0,0,0,0,0,0,0,0,0,0,0,0,14,0,0,0,0,0,0,0,0,0,0,0,0,0,0,0,0,0,0,0,0,0,0,0,0,0,0,0,0,0,0,0,0,0,0,0,0,0,0,0,0,0,0,0,0,0,0,0,0,0,0,0,0,0,0,0,0,0,0,0,0,0,0,0,0,0,0,0,0,0,0,0,0,0,0,0,0,0,0,0,0,0,0,0,0,0,0,0,0,0,0,0,0,0,0,0]
[null,null,"> 330 kV & < = 500 kV  ; Single Circuit",0,0,0,0,0,0,0,0,0,0,0,0,0,0,0,0,0,0,0,0,0,0,0,0,0,0,0,0,0,0,0,0,0,0,0,0,0,0,0,0,0,0,0,0,0,0,0,0,0,0,0,0,0,0,0,0,0,0,0,0,0,0,0,0,0,0,0,0,0,0,0,0,0,0,0,0,0,0,0,0,0,0,0,0,0,0,0,0,0,0,0,0,0,0,0,0,0,0,0,0,0,0,0,0,0,0,0,0,0,0,0]
[null,null,"> 500 kV  ; Single Circuit",0,0,0,0,0,0,0,0,0,0,0,0,0,0,0,0,0,0,0,0,0,0,0,0,0,0,0,0,0,0,0,0,0,0,0,0,0,0,0,0,0,0,0,0,0,0,0,0,0,0,0,0,0,0,0,0,0,0,0,0,0,0,0,0,0,0,0,0,0,0,0,0,0,0,0,0,0,0,0,0,0,0,0,0,0,0,0,0,0,0,0,0,0,0,0,0,0,0,0,0,0,0,0,0,0,0,0,0,0,0,0]
[null,null,"< = 33 kV; Multiple Circuit",0,0,0,0,0,0,0,0,0,0,0,0,0,0,0,0,0,0,0,0,0,0,0,0,0,0,0,0,0,0,0,0,0,0,0,0,0,0,0,0,0,0,0,0,0,0,0,0,0,0,0,0,0,0,0,0,0,0,0,0,0,0,0,0,0,0,0,0,0,0,0,0,0,0,0,0,0,0,0,0,0,0,0,0,0,0,0,0,0,0,0,0,0,0,0,0,0,0,0,0,0,0,0,0,0,0,0,0,0,0,0]
[null,null,"> 33 kV & < = 66 kV ; Multiple Circuit",50,7.1,0,0,0,0,0,0,0,0,0,0,0,0,0,0,0,0,0,0,0,0,0,0,0,0,0,0,0,0,0,0,0,0,0,0,2,0,0,0,0,0,0,0,0,0,0,0,0,0,0,0,0,0,0,0,0,0,0,0,0,0,0,0,0,0,0,0,0,0,0,0,0,0,0,0,0,0,0,0,0,0,0,0,0,0,0,0,0,0,0,0,0,0,0,0,0,0,0,0,0,0,0,0,0,0,0,0,0,0,0]
[null,null,"> 66 kV & < = 132 kV ; Multiple Circuit",50,7.1,12,0,0,36,0,11,4,189,140,216,437,1,12,24,21,0,1,5,207,0,22,31,0,0,0,63,2,0,0,0,3,139,401,21,0,77,114,0,0,442,243,221,32,0,205,0,12,424,11,6,529,240,67,0,28,208,0,0,0,0,0,0,0,0,0,0,0,0,0,0,0,0,0,0,0,0,0,0,0,0,0,0,0,0,0,0,0,0,0,0,0,0,0,0,0,0,0,0,0,0,0,0,0,0,0,0,0,0,0]
[null,null,"> 132 kV & < = 275 kV ; Multiple Circuit",50,7.1,8,0,0,7,481,542,210,356,603,344,97,147,71,7,214,0,200,340,316,728,137,0,0,1,18,77,0,13,6,518,4,65,29,214,9,3,0,96,0,1,4,0,0,0,0,4,115,0,111,0,0,0,0,0,0,0,0,0,0,0,0,0,0,0,0,0,0,0,0,0,0,0,0,0,0,0,0,0,0,0,0,0,0,0,0,0,0,0,0,0,0,0,0,0,0,0,0,0,0,0,0,0,0,0,0,0,0,0,0]
[null,null,"> 275 kV & < = 330 kV ; Multiple Circuit",50,7.1,0,0,0,0,0,0,0,0,0,0,170,0,0,235,0,0,0,483,0,0,0,0,0,0,0,0,0,0,0,0,0,0,0,0,0,0,0,0,0,0,0,0,0,0,0,0,0,0,0,0,0,0,0,0,0,0,0,0,0,0,0,0,0,0,0,0,0,0,0,0,0,0,0,0,0,0,0,0,0,0,0,0,0,0,0,0,0,0,0,0,0,0,0,0,0,0,0,0,0,0,0,0,0,0,0,0,0,0,0]
[null,null,"> 330 kV & < = 500 kV  ; Multiple Circuit",50,7.1,0,0,0,0,0,1,0,0,0,0,0,0,0,0,0,0,0,0,0,0,0,0,0,0,0,0,0,0,0,0,0,0,0,0,0,0,0,0,0,0,0,0,0,0,0,0,0,0,0,0,0,0,0,0,0,0,0,0,0,0,0,0,0,0,0,0,0,0,0,0,0,0,0,0,0,0,0,0,0,0,0,0,0,0,0,0,0,0,0,0,0,0,0,0,0,0,0,0,0,0,0,0,0,0,0,0,0,0,0]
[null,null,"> 500 kV  ; Multiple Circuit",0,0,0,0,0,0,0,0,0,0,0,0,0,0,0,0,0,0,0,0,0,0,0,0,0,0,0,0,0,0,0,0,0,0,0,0,0,0,0,0,0,0,0,0,0,0,0,0,0,0,0,0,0,0,0,0,0,0,0,0,0,0,0,0,0,0,0,0,0,0,0,0,0,0,0,0,0,0,0,0,0,0,0,0,0,0,0,0,0,0,0,0,0,0,0,0,0,0,0,0,0,0,0,0,0,0,0,0,0,0,0]
[null,null,"Other",15,3.9,0,45,15,41,0,51,0,0,7,0,0,0,0,0,0,0,0,0,0,0,0,0,0,0,0,0,0,0,0,0,0,0,0,0,0,0,0,0,0,0,0,0,0,0,0,0,0,0,0,0,0,0,0,0,0,0,0,0,0,0,0,0,0,0,0,0,0,0,0,0,0,0,0,0,0,0,0,0,0,0,0,0,0,0,0,0,0,0,0,0,0,0,0,0,0,0,0,0,0,0,0,0,0,0,0,0,0,0,0]
[null,"TRANSMISSION TOWER SUPPORT STRUCTURES BY:\nHighest operating voltage; Circuit configuration","< = 33 kV; Single Circuit",0,0,0,0,0,0,0,0,0,0,0,0,0,0,0,0,0,0,0,0,0,0,0,0,0,0,0,0,0,0,0,0,0,0,0,0,0,0,0,0,0,0,0,0,0,0,0,0,0,0,0,0,0,0,0,0,0,0,0,0,0,0,0,0,0,0,0,0,0,0,0,0,0,0,0,0,0,0,0,0,0,0,0,0,0,0,0,0,0,0,0,0,0,0,0,0,0,0,0,0,0,0,0,0,0,0,0,0,0,0,0]
[null,null,"> 33 kV & < = 66 kV ; Single Circuit",0,0,0,0,0,0,0,0,0,0,0,0,0,0,0,0,0,0,0,0,0,0,0,0,0,0,0,0,0,0,0,0,0,0,0,0,0,0,0,0,0,0,0,0,0,0,0,0,0,0,0,0,0,0,0,0,0,0,0,0,0,0,0,0,0,0,0,0,0,0,0,0,0,0,0,0,0,0,0,0,0,0,0,0,0,0,0,0,0,0,0,0,0,0,0,0,0,0,0,0,0,0,0,0,0,0,0,0,0,0,0]
[null,null,"> 66 kV & < = 132 kV ; Single Circuit",30,5.5,0,131,488,295,778,398,132,333,295,926,434,433,136,81,34,605,61,33,100,875,214,5,0,0,0,492,24,6,28,1316,174,427,26,78,0,138,518,450,0,3,10,1466,0,1,24,0,0,4,0,810,6,47,15,400,0,24,3,0,0,0,0,0,0,0,0,0,0,0,0,0,0,0,0,0,0,0,0,0,0,0,0,0,0,0,0,0,0,0,0,0,0,0,0,0,0,0,0,0,0,0,0,0,0,0,0,0,0,0,0]
[null,null,"> 132 kV & < = 275 kV ; Single Circuit",30,5.5,82,1808,121,211,1390,2958,1583,1450,2061,3240,2422,91,29,1495,650,1096,401,74,563,344,2805,0,408,655,366,1180,170,108,19,88,1876,798,15,1157,0,1725,1803,554,186,3,460,1963,0,838,775,1499,30,0,0,0,0,0,0,0,0,0,0,0,0,0,0,0,0,0,0,0,0,0,0,0,0,0,0,0,0,0,0,0,0,0,0,0,0,0,0,0,0,0,0,0,0,0,0,0,0,0,0,0,0,0,0,0,0,0,0,0,0,0,0]
[null,null,"> 275 kV & < = 330 kV ; Single Circuit",30,5.5,0,0,0,0,0,0,0,0,0,0,0,48,0,180,0,0,0,0,0,0,0,0,0,0,0,0,0,0,0,0,0,0,0,0,0,0,0,0,0,0,0,0,0,0,0,0,0,0,0,0,0,0,0,0,0,0,0,0,0,0,0,0,0,0,0,0,0,0,0,0,0,0,0,0,0,0,0,0,0,0,0,0,0,0,0,0,0,0,0,0,0,0,0,0,0,0,0,0,0,0,0,0,0,0,0,0,0,0,0]
[null,null,"> 330 kV & < = 500 kV  ; Single Circuit",0,0,0,0,0,0,0,0,0,0,0,0,0,0,0,0,0,0,0,0,0,0,0,0,0,0,0,0,0,0,0,0,0,0,0,0,0,0,0,0,0,0,0,0,0,0,0,0,0,0,0,0,0,0,0,0,0,0,0,0,0,0,0,0,0,0,0,0,0,0,0,0,0,0,0,0,0,0,0,0,0,0,0,0,0,0,0,0,0,0,0,0,0,0,0,0,0,0,0,0,0,0,0,0,0,0,0,0,0,0,0]
[null,null,"> 500 kV  ; Single Circuit",0,0,0,0,0,0,0,0,0,0,0,0,0,0,0,0,0,0,0,0,0,0,0,0,0,0,0,0,0,0,0,0,0,0,0,0,0,0,0,0,0,0,0,0,0,0,0,0,0,0,0,0,0,0,0,0,0,0,0,0,0,0,0,0,0,0,0,0,0,0,0,0,0,0,0,0,0,0,0,0,0,0,0,0,0,0,0,0,0,0,0,0,0,0,0,0,0,0,0,0,0,0,0,0,0,0,0,0,0,0,0]
[null,null,"< = 33 kV; Multiple Circuit",0,0,0,0,0,0,0,0,0,0,0,0,0,0,0,0,0,0,0,0,0,0,0,0,0,0,0,0,0,0,0,0,0,0,0,0,0,0,0,0,0,0,0,0,0,0,0,0,0,0,0,0,0,0,0,0,0,0,0,0,0,0,0,0,0,0,0,0,0,0,0,0,0,0,0,0,0,0,0,0,0,0,0,0,0,0,0,0,0,0,0,0,0,0,0,0,0,0,0,0,0,0,0,0,0,0,0,0,0,0,0]
[null,null,"> 33 kV & < = 66 kV ; Multiple Circuit",30,5.5,0,0,0,0,0,0,0,0,0,0,0,0,0,0,0,0,0,0,0,0,0,0,0,0,0,0,0,0,0,0,0,0,0,0,24,0,0,12,0,0,0,0,0,0,0,0,0,0,0,0,0,0,0,0,0,0,0,0,0,0,0,0,0,0,0,0,0,0,0,0,0,0,0,0,0,0,0,0,0,0,0,0,0,0,0,0,0,0,0,0,0,0,0,0,0,0,0,0,0,0,0,0,0,0,0,0,0,0,0]
[null,null,"> 66 kV & < = 132 kV ; Multiple Circuit",30,5.5,481,885,867,1320,635,739,997,2016,1619,2901,3432,333,2354,1281,539,2467,398,461,3655,998,280,463,18,0,201,257,108,54,139,594,39,51,2402,102,6,2910,162,6,666,264,867,282,228,36,1203,21,0,21,0,42,875,1317,6,6,0,657,18,0,0,0,0,6,0,0,0,0,0,0,0,0,0,0,0,0,0,0,0,0,0,0,0,0,0,0,0,0,0,0,0,0,0,0,0,0,0,0,0,0,0,0,0,0,0,0,0,0,0,0,0]
[null,null,"> 132 kV & < = 275 kV ; Multiple Circuit",30,5.5,0,487,713,71,5057,5108,2035,3804,8273,3147,2193,2202,846,2699,2226,171,2335,3714,2856,6264,677,0,73,0,198,409,165,308,141,369,39,621,204,1868,84,60,0,1142,48,0,24,6,0,0,0,24,1312,0,684,0,12,0,0,0,0,0,0,0,0,0,0,0,0,0,0,0,0,0,0,0,0,0,0,0,0,0,0,0,0,0,0,0,0,0,0,0,0,0,0,0,0,0,0,0,0,0,0,0,0,0,0,0,0,0,0,0,0,0,0]
[null,null,"> 275 kV & < = 330 kV ; Multiple Circuit",30,5.5,0,2,0,0,0,0,14,0,0,0,1767,36,0,3334,36,0,1,3707,0,0,0,0,0,0,0,0,0,0,0,0,0,0,0,0,0,0,0,0,0,0,0,0,0,0,0,0,0,0,0,0,0,0,0,0,0,0,0,0,0,0,0,0,0,0,0,0,0,0,0,0,0,0,0,0,0,0,0,0,0,0,0,0,0,0,0,0,0,0,0,0,0,0,0,0,0,0,0,0,0,0,0,0,0,0,0,0,0,0,0]
[null,null,"> 330 kV & < = 500 kV  ; Multiple Circuit",0,0,0,0,0,0,0,0,0,0,0,0,0,0,0,0,0,0,0,0,0,0,0,0,0,0,0,0,0,0,0,0,0,0,0,0,0,0,0,0,0,0,0,0,0,0,0,0,0,0,0,0,0,0,0,0,0,0,0,0,0,0,0,0,0,0,0,0,0,0,0,0,0,0,0,0,0,0,0,0,0,0,0,0,0,0,0,0,0,0,0,0,0,0,0,0,0,0,0,0,0,0,0,0,0,0,0,0,0,0,0]
[null,null,"> 500 kV  ; Multiple Circuit",0,0,0,0,0,0,0,0,0,0,0,0,0,0,0,0,0,0,0,0,0,0,0,0,0,0,0,0,0,0,0,0,0,0,0,0,0,0,0,0,0,0,0,0,0,0,0,0,0,0,0,0,0,0,0,0,0,0,0,0,0,0,0,0,0,0,0,0,0,0,0,0,0,0,0,0,0,0,0,0,0,0,0,0,0,0,0,0,0,0,0,0,0,0,0,0,0,0,0,0,0,0,0,0,0,0,0,0,0,0,0]
[null,null,"Other"]
[null,"CONDUCTORS BY: \nVoltage; Maximum continuous rating","< = 33 kV ; < = 100 MVA",50,7.1,0,0,0,0,0,0,0,0,0,0,0,0,0,0,0,0,0,0,0,0,0,0,0,0,0,0,0,0,0,0,0,0,0,0,0,0,0,0,0,0,0,0,0,0,0,0,0,0,0,0,0,0,0,0,0,0,0,0,0,0,0,0,0,0,0,0,0,0,0,0,0,0,0,0,0,0,0,0,0,0,0,0,0,0,0,0,0,0,0,0,0,0,0,0,0,0,0,0,0,0,0,0,0,0,0,0,0,0,0]
[null,null,"< = 33 kV ; > 100 MVA & < = 400 MVA",0,0,0,0,0,0,0,0,0,0,0,0,0,0,0,0,0,0,0,0,0,0,0,0,0,0,0,0,0,0,0,0,0,0,0,0,0,0,0,0,0,0,0,0,0,0,0,0,0,0,0,0,0,0,0,0,0,0,0,0,0,0,0,0,0,0,0,0,0,0,0,0,0,0,0,0,0,0,0,0,0,0,0,0,0,0,0,0,0,0,0,0,0,0,0,0,0,0,0,0,0,0,0,0,0,0,0,0,0,0,0]
[null,null,"< = 33 kV ; > 400 MVA",0,0,0,0,0,0,0,0,0,0,0,0,0,0,0,0,0,0,0,0,0,0,0,0,0,0,0,0,0,0,0,0,0,0,0,0,0,0,0,0,0,0,0,0,0,0,0,0,0,0,0,0,0,0,0,0,0,0,0,0,0,0,0,0,0,0,0,0,0,0,0,0,0,0,0,0,0,0,0,0,0,0,0,0,0,0,0,0,0,0,0,0,0,0,0,0,0,0,0,0,0,0,0,0,0,0,0,0,0,0,0]
[null,null,"> 33 kV & < = 66 kV  ; < = 100 MVA",50,7.1,0,0,0,0,0,0,0,0,0,0,0,0,0,0,0,0,0,0,0,0,0,0,0,0,0,0,0,0,0,0,0,0,0,0,0,0,0,0,0,0,0,0,0,0,0,0,0,0,0,0,0,0,0,0,0,0,0,0,0,0,0,0,0,0,0,0,0,0,0,0,0,0,0,0,0,0,0,0,0,0,0,0,0,0,0,0,0,0,0,0,0,0,0,0,0,0,0,0,0,0,0,0,0,0,0,0,0,0,0]
[null,null,"> 33 kV & < = 66 kV  ; > 100 MVA & < = 400 MVA",0,0,0,0,0,0,0,0,0,0,0,0,0,0,0,0,0,0,0,0,0,0,0,0,0,0,0,0,0,0,0,0,0,0,0,0,0,0,0,0,0,0,0,0,0,0,0,0,0,0,0,0,0,0,0,0,0,0,0,0,0,0,0,0,0,0,0,0,0,0,0,0,0,0,0,0,0,0,0,0,0,0,0,0,0,0,0,0,0,0,0,0,0,0,0,0,0,0,0,0,0,0,0,0,0,0,0,0,0,0,0]
[null,null,"> 33 kV & < = 66 kV  ; > 400 MVA",0,0,0,0,0,0,0,0,0,0,0,0,0,0,0,0,0,0,0,0,0,0,0,0,0,0,0,0,0,0,0,0,0,0,0,0,0,0,0,0,0,0,0,0,0,0,0,0,0,0,0,0,0,0,0,0,0,0,0,0,0,0,0,0,0,0,0,0,0,0,0,0,0,0,0,0,0,0,0,0,0,0,0,0,0,0,0,0,0,0,0,0,0,0,0,0,0,0,0,0,0,0,0,0,0,0,0,0,0,0,0]
[null,null,"> 66 kV & < = 132 kV  ; < = 100 MVA",50,7.1,7.08,0,0,29.12,0,0.1,0,0,0,0,0,0,0,0,1.2,0,0,0,0,0,0,23.900000000000002,0,0,0.98,43.25,0.2,0,0.15,0,75.170000000000016,102.22,110.28999999999999,0,0,0,0,0,19.22,0,9.92,50.05,47.01,56.28,0,338.8,0,0,0,254.68,5.64,27.06,0,47.92,10.98,33.1,0,0,0,0,0,0,0,0,0,0,0,0,0,0,0,0,0,0,0,0,0,0,0,0,0,0,0,0,0,0,0,0,0,0,0,0,0,0,0,0,0,0,0,0,0,0,0,0,0,0,0,0,0]
[null,null,"> 66 kV & < = 132 kV  ; > 100 MVA & < = 400 MVA",50,7.1,0,0,0,0,93.94,95.78,186.4,161.13,230.7,192.1,365.57,42.45,0.78,9.91,8.67,1.59,0,0.1,76.97,0.25,16.37,0,0.18,3.14,0.5,20.089999999999996,1.7999999999999998,0,14.66,0,0.95,233.44,264.45999999999998,28.36,0,54.350000000000009,257.57000000000005,124.98,0,37.31,92.68,291.63,26.92,26.56,0,33.730000000000004,19.920000000000002,12.629999999999999,53.58,0,303.87,178.95,15.14,25,15.14,76.38000000000001,0,0,0,0,1.64,0,0,0,0,0,0,0,0,0,0,0,0,0,0,0,0,0,0,0,0,0,0,0,0,0,0,0,0,0,0,0,0,0,0,0,0,0,0,0,0,0,0,0,0,0,0,0,0]
[null,null,"> 66 kV & < = 132 kV  ; > 400 MVA",50,7.1,0,0,0,0,0,0,0,0,83.78,7.84,0,0,0,0,0,0.18,0,0,0,1.61,2.4300000000000002,0,0,1.61,0,2.36,0,0,0,43.22,0,0,0,0,0,0,0,0,24.38,0,0,0,0,0,0,0,0,0,0,0,0,0,0,0,0,0,0,0,0,0,0,0,0,0,0,0,0,0,0,0,0,0,0,0,0,0,0,0,0,0,0,0,0,0,0,0,0,0,0,0,0,0,0,0,0,0,0,0,0,0,0,0,0,0,0,0,0,0,0]
[null,null,"> 132 kV & < = 275 kV  ; < = 200 MVA",50,7.1,0,0,0,0,0,0,0,0,0,0,0,0,0,0,0,0,0,0,0,0,0,0,0,0,0,0,0,0,0,0,0,0,0,0,0,0,0,0,0,0,0,0,0,0,0,0,0,0,0,0,0,0,0,0,0,0,0,0,0,0,0,0,0,0,0,0,0,0,0,0,0,0,0,0,0,0,0,0,0,0,0,0,0,0,0,0,0,0,0,0,0,0,0,0,0,0,0,0,0,0,0,0,0,0,0,0,0,0,0]
[null,null,"> 132 kV & < = 275 kV  ; > 200 MVA & < = 600 MVA",50,7.1,0,0,0,0,0,0,1.92,84.23,0.53,0.59,0,0,0,108.57,0,0,0,0,0,36.74,0,0.11,90.57,60.93,246.47,105.64,0,5.5299999999999994,0,244.1,84.580000000000013,106.12,7.69,108.47,1.82,0.22,0,317.54000000000002,249.1,0.09,199.96000000000004,75.19,65.180000000000007,65.27,0,0,0,0,0,0,0,0,0,0,0,0,0,0,0,0,0,0,0,0,0,0,0,0,0,0,0,0,0,0,0,0,0,0,0,0,0,0,0,0,0,0,0,0,0,0,0,0,0,0,0,0,0,0,0,0,0,0,0,0,0,0,0,0,0]
[null,null,"> 132 kV & < = 275 kV  ; > 600 MVA",50,7.1,0,0,0,0,333.64,385.71000000000004,0,274.63,324.68,318.44,206.36,136.82,55.24,4.4800000000000004,156.94,128.15,196.28000000000003,307.87,235.4,641.04,117.3,2.7,0,34.630000000000003,4.8499999999999996,168.39,0,12.27,0,0,0.28000000000000003,0,162.72999999999999,212.35,21.6,126.71000000000001,149.91,223.24,30.09,455.91999999999996,0,399.78,10.71,17.96,0,482.42000000000007,30.97,0,75.86,0,0,0,0,0,0,0,0,0,0,0,0,0,0,0,0,0,0,0,0,0,0,0,0,0,0,0,0,0,0,0,0,0,0,0,0,0,0,0,0,0,0,0,0,0,0,0,0,0,0,0,0,0,0,0,0,0,0,0,0]
[null,null,"> 275 kV & < = 330 kV  ; < = 800 MVA",0,0,0,0,0,0,0,0,0,0,0,0,0,0,0,0,0,0,0,0,0,0,0,0,0,0,0,0,0,0,0,0,0,0,0,0,0,0,0,0,0,0,0,0,0,0,0,0,0,0,0,0,0,0,0,0,0,0,0,0,0,0,0,0,0,0,0,0,0,0,0,0,0,0,0,0,0,0,0,0,0,0,0,0,0,0,0,0,0,0,0,0,0,0,0,0,0,0,0,0,0,0,0,0,0,0,0,0,0,0,0]
[null,null,"> 275 kV & < = 330 kV  ; > 800 MVA & < = 1200 MVA",0,0,0,0,0,0,0,0,0,0,0,0,0,0,0,0,0,0,0,0,0,0,0,0,0,0,0,0,0,0,0,0,0,0,0,0,0,0,0,0,0,0,0,0,0,0,0,0,0,0,0,0,0,0,0,0,0,0,0,0,0,0,0,0,0,0,0,0,0,0,0,0,0,0,0,0,0,0,0,0,0,0,0,0,0,0,0,0,0,0,0,0,0,0,0,0,0,0,0,0,0,0,0,0,0,0,0,0,0,0,0]
[null,null,"> 275 kV & < = 330 kV  ; > 1200 MVA",50,7.1,0,0,0,0,0,0,0,0,0,0,0,0,0,189.35999999999999,0,0,0,413.08,0,0,0,0,0,0,0,0,0,0,0,0,0,0,0,0,0,0,0,0,0,0,0,0,0,0,0,0,0,0,0,0,0,0,0,0,0,0,0,0,0,0,0,0,0,0,0,0,0,0,0,0,0,0,0,0,0,0,0,0,0,0,0,0,0,0,0,0,0,0,0,0,0,0,0,0,0,0,0,0,0,0,0,0,0,0,0,0,0,0,0]
[null,null,"> 330 kV & < = 500 kV   ; < = 1000 MVA",0,0,0,0,0,0,0,0,0,0,0,0,0,0,0,0,0,0,0,0,0,0,0,0,0,0,0,0,0,0,0,0,0,0,0,0,0,0,0,0,0,0,0,0,0,0,0,0,0,0,0,0,0,0,0,0,0,0,0,0,0,0,0,0,0,0,0,0,0,0,0,0,0,0,0,0,0,0,0,0,0,0,0,0,0,0,0,0,0,0,0,0,0,0,0,0,0,0,0,0,0,0,0,0,0,0,0,0,0,0,0]
[null,null,"> 330 kV & < = 500 kV   ; > 1000 MVA & < = 1500 MVA",0,0,0,0,0,0,0,0,0,0,0,0,0,0,0,0,0,0,0,0,0,0,0,0,0,0,0,0,0,0,0,0,0,0,0,0,0,0,0,0,0,0,0,0,0,0,0,0,0,0,0,0,0,0,0,0,0,0,0,0,0,0,0,0,0,0,0,0,0,0,0,0,0,0,0,0,0,0,0,0,0,0,0,0,0,0,0,0,0,0,0,0,0,0,0,0,0,0,0,0,0,0,0,0,0,0,0,0,0,0,0]
[null,null,"> 330 kV & < = 500 kV   ; > 1500 MVA",0,0,0,0,0,0,0,0,0,0,0,0,0,0,0,0,0,0,0,0,0,0,0,0,0,0,0,0,0,0,0,0,0,0,0,0,0,0,0,0,0,0,0,0,0,0,0,0,0,0,0,0,0,0,0,0,0,0,0,0,0,0,0,0,0,0,0,0,0,0,0,0,0,0,0,0,0,0,0,0,0,0,0,0,0,0,0,0,0,0,0,0,0,0,0,0,0,0,0,0,0,0,0,0,0,0,0,0,0,0,0]
[null,null,"> 500 kV   ; < = 2000 MVA",0,0,0,0,0,0,0,0,0,0,0,0,0,0,0,0,0,0,0,0,0,0,0,0,0,0,0,0,0,0,0,0,0,0,0,0,0,0,0,0,0,0,0,0,0,0,0,0,0,0,0,0,0,0,0,0,0,0,0,0,0,0,0,0,0,0,0,0,0,0,0,0,0,0,0,0,0,0,0,0,0,0,0,0,0,0,0,0,0,0,0,0,0,0,0,0,0,0,0,0,0,0,0,0,0,0,0,0,0,0,0]
[null,null,"> 500 kV   ; > 2000 MVA & < = 3000 MVA",0,0,0,0,0,0,0,0,0,0,0,0,0,0,0,0,0,0,0,0,0,0,0,0,0,0,0,0,0,0,0,0,0,0,0,0,0,0,0,0,0,0,0,0,0,0,0,0,0,0,0,0,0,0,0,0,0,0,0,0,0,0,0,0,0,0,0,0,0,0,0,0,0,0,0,0,0,0,0,0,0,0,0,0,0,0,0,0,0,0,0,0,0,0,0,0,0,0,0,0,0,0,0,0,0,0,0,0,0,0,0]
[null,null,"> 500 kV   ; > 3000 MVA",0,0,0,0,0,0,0,0,0,0,0,0,0,0,0,0,0,0,0,0,0,0,0,0,0,0,0,0,0,0,0,0,0,0,0,0,0,0,0,0,0,0,0,0,0,0,0,0,0,0,0,0,0,0,0,0,0,0,0,0,0,0,0,0,0,0,0,0,0,0,0,0,0,0,0,0,0,0,0,0,0,0,0,0,0,0,0,0,0,0,0,0,0,0,0,0,0,0,0,0,0,0,0,0,0,0,0,0,0,0,0]
[null,null,"Other"]
[null,"TRANSMISSION CABLES BY: \nHighest operating voltage; Insulation type","< = 33 kV; Oil Filled",0,0,0,0,0,0,0,0,0,0,0,0,0,0,0,0,0,0,0,0,0,0,0,0,0,0,0,0,0,0,0,0,0,0,0,0,0,0,0,0,0,0,0,0,0,0,0,0,0,0,0,0,0,0,0,0,0,0,0,0,0,0,0,0,0,0,0,0,0,0,0,0,0,0,0,0,0,0,0,0,0,0,0,0,0,0,0,0,0,0,0,0,0,0,0,0,0,0,0,0,0,0,0,0,0,0,0,0,0,0,0]
[null,null,"> 33 kV & < = 66 kV ; Oil Filled",0,0,0,0,0,0,0,0,0,0,0,0,0,0,0,0,0,0,0,0,0,0,0,0,0,0,0,0,0,0,0,0,0,0,0,0,0,0,0,0,0,0,0,0,0,0,0,0,0,0,0,0,0,0,0,0,0,0,0,0,0,0,0,0,0,0,0,0,0,0,0,0,0,0,0,0,0,0,0,0,0,0,0,0,0,0,0,0,0,0,0,0,0,0,0,0,0,0,0,0,0,0,0,0,0,0,0,0,0,0,0]
[null,null,"> 66 kV & < = 132 kV ; Oil Filled",45,6.7,0,0,0,0,0,0,0,0,0,0,0,0,0,0,0,0,0,0,0,0,0,0,0,0,0,0,0,0,0,0,0,0,0,0,0,0,0,0,0,0,4.548,0,0,0,0,0,0,0,0,0,0,0,0,0,0,0,0,0,0,0,0,0,0,0,0,0,0,0,0,0,0,0,0,0,0,0,0,0,0,0,0,0,0,0,0,0,0,0,0,0,0,0,0,0,0,0,0,0,0,0,0,0,0,0,0,0,0,0,0]
[null,null,"> 132 kV & < = 275 kV ; Oil Filled",0,0,0,0,0,0,0,0,0,0,0,0,0,0,0,0,0,0,0,0,0,0,0,0,0,0,0,0,0,0,0,0,0,0,0,0,0,0,0,0,0,0,0,0,0,0,0,0,0,0,0,0,0,0,0,0,0,0,0,0,0,0,0,0,0,0,0,0,0,0,0,0,0,0,0,0,0,0,0,0,0,0,0,0,0,0,0,0,0,0,0,0,0,0,0,0,0,0,0,0,0,0,0,0,0,0,0,0,0,0,0]
[null,null,"> 275 kV & < = 330 kV ; Oil Filled",0,0,0,0,0,0,0,0,0,0,0,0,0,0,0,0,0,0,0,0,0,0,0,0,0,0,0,0,0,0,0,0,0,0,0,0,0,0,0,0,0,0,0,0,0,0,0,0,0,0,0,0,0,0,0,0,0,0,0,0,0,0,0,0,0,0,0,0,0,0,0,0,0,0,0,0,0,0,0,0,0,0,0,0,0,0,0,0,0,0,0,0,0,0,0,0,0,0,0,0,0,0,0,0,0,0,0,0,0,0,0]
[null,null,"> 330 kV & < = 500 kV  ; Oil Filled",0,0,0,0,0,0,0,0,0,0,0,0,0,0,0,0,0,0,0,0,0,0,0,0,0,0,0,0,0,0,0,0,0,0,0,0,0,0,0,0,0,0,0,0,0,0,0,0,0,0,0,0,0,0,0,0,0,0,0,0,0,0,0,0,0,0,0,0,0,0,0,0,0,0,0,0,0,0,0,0,0,0,0,0,0,0,0,0,0,0,0,0,0,0,0,0,0,0,0,0,0,0,0,0,0,0,0,0,0,0,0]
[null,null,"> 500 kV  ; Oil Filled",0,0,0,0,0,0,0,0,0,0,0,0,0,0,0,0,0,0,0,0,0,0,0,0,0,0,0,0,0,0,0,0,0,0,0,0,0,0,0,0,0,0,0,0,0,0,0,0,0,0,0,0,0,0,0,0,0,0,0,0,0,0,0,0,0,0,0,0,0,0,0,0,0,0,0,0,0,0,0,0,0,0,0,0,0,0,0,0,0,0,0,0,0,0,0,0,0,0,0,0,0,0,0,0,0,0,0,0,0,0,0]
[null,null,"< = 33 kV; XLPE Insulated",0,0,0,0,0,0,0,0,0,0,0,0,0,0,0,0,0,0,0,0,0,0,0,0,0,0,0,0,0,0,0,0,0,0,0,0,0,0,0,0,0,0,0,0,0,0,0,0,0,0,0,0,0,0,0,0,0,0,0,0,0,0,0,0,0,0,0,0,0,0,0,0,0,0,0,0,0,0,0,0,0,0,0,0,0,0,0,0,0,0,0,0,0,0,0,0,0,0,0,0,0,0,0,0,0,0,0,0,0,0,0]
[null,null,"> 33 kV & < = 66 kV ; XLPE Insulated",45,6.7,0,0,0,0,0,0,0,0,0,0,0,0,0,0,0,0,0,0,0,0,0,0,0,0,0,0,0,0,0,0,0,0,0,0,0,0,1.288,0,0,0,0,0,0,0,0,0,0,0,0,0,0,0,0,0,0,0,0,0,0,0,0,0,0,0,0,0,0,0,0,0,0,0,0,0,0,0,0,0,0,0,0,0,0,0,0,0,0,0,0,0,0,0,0,0,0,0,0,0,0,0,0,0,0,0,0,0,0,0,0]
[null,null,"> 66 kV & < = 132 kV ; XLPE Insulated",45,6.7,0,0,0,0,0,0,0,0.35199999999999998,0,1.345,0,0,0,0,0.80500000000000005,1.589,0,0,0,0,0,0,0,0,0,0,2.12,0,0,0,0,0,0,0,0,0,0,0,0,0,0,0,0,0,0,0,0,0,0,0,0,0,0,0,0,0,0,0,0,0,0,0,0,0,0,0,0,0,0,0,0,0,0,0,0,0,0,0,0,0,0,0,0,0,0,0,0,0,0,0,0,0,0,0,0,0,0,0,0,0,0,0,0,0,0,0,0,0,0]
[null,null,"> 132 kV & < = 275 kV ; XLPE Insulated",45,6.7,0,0,0,0,0,0,0,3.98,0,0,0,0,0,0,0,0,0,0,0,0,0,5.4,0,0,0,0,0,0,0,0,0,0,0,0,0,0,0,0,0,0,0,0,0,0,0,0,0,0,0,0,0,0,0,0,0,0,0,0,0,0,0,0,0,0,0,0,0,0,0,0,0,0,0,0,0,0,0,0,0,0,0,0,0,0,0,0,0,0,0,0,0,0,0,0,0,0,0,0,0,0,0,0,0,0,0,0,0,0,0]
[null,null,"> 275 kV & < = 330 kV ; XLPE Insulated",0,0,0,0,0,0,0,0,0,0,0,0,0,0,0,0,0,0,0,0,0,0,0,0,0,0,0,0,0,0,0,0,0,0,0,0,0,0,0,0,0,0,0,0,0,0,0,0,0,0,0,0,0,0,0,0,0,0,0,0,0,0,0,0,0,0,0,0,0,0,0,0,0,0,0,0,0,0,0,0,0,0,0,0,0,0,0,0,0,0,0,0,0,0,0,0,0,0,0,0,0,0,0,0,0,0,0,0,0,0,0]
[null,null,"> 330 kV & < = 500 kV  ; XLPE Insulated",0,0,0,0,0,0,0,0,0,0,0,0,0,0,0,0,0,0,0,0,0,0,0,0,0,0,0,0,0,0,0,0,0,0,0,0,0,0,0,0,0,0,0,0,0,0,0,0,0,0,0,0,0,0,0,0,0,0,0,0,0,0,0,0,0,0,0,0,0,0,0,0,0,0,0,0,0,0,0,0,0,0,0,0,0,0,0,0,0,0,0,0,0,0,0,0,0,0,0,0,0,0,0,0,0,0,0,0,0,0,0]
[null,null,"> 500 kV  ; XLPE Insulated",0,0,0,0,0,0,0,0,0,0,0,0,0,0,0,0,0,0,0,0,0,0,0,0,0,0,0,0,0,0,0,0,0,0,0,0,0,0,0,0,0,0,0,0,0,0,0,0,0,0,0,0,0,0,0,0,0,0,0,0,0,0,0,0,0,0,0,0,0,0,0,0,0,0,0,0,0,0,0,0,0,0,0,0,0,0,0,0,0,0,0,0,0,0,0,0,0,0,0,0,0,0,0,0,0,0,0,0,0,0,0]
[null,null,"< = 33 kV; Other Insulated",0,0,0,0,0,0,0,0,0,0,0,0,0,0,0,0,0,0,0,0,0,0,0,0,0,0,0,0,0,0,0,0,0,0,0,0,0,0,0,0,0,0,0,0,0,0,0,0,0,0,0,0,0,0,0,0,0,0,0,0,0,0,0,0,0,0,0,0,0,0,0,0,0,0,0,0,0,0,0,0,0,0,0,0,0,0,0,0,0,0,0,0,0,0,0,0,0,0,0,0,0,0,0,0,0,0,0,0,0,0,0]
[null,null,"> 33 kV & < = 66 kV ; Other Insulated",0,0,0,0,0,0,0,0,0,0,0,0,0,0,0,0,0,0,0,0,0,0,0,0,0,0,0,0,0,0,0,0,0,0,0,0,0,0,0,0,0,0,0,0,0,0,0,0,0,0,0,0,0,0,0,0,0,0,0,0,0,0,0,0,0,0,0,0,0,0,0,0,0,0,0,0,0,0,0,0,0,0,0,0,0,0,0,0,0,0,0,0,0,0,0,0,0,0,0,0,0,0,0,0,0,0,0,0,0,0,0]
[null,null,"> 66 kV & < = 132 kV ; Other Insulated",0,0,0,0,0,0,0,0,0,0,0,0,0,0,0,0,0,0,0,0,0,0,0,0,0,0,0,0,0,0,0,0,0,0,0,0,0,0,0,0,0,0,0,0,0,0,0,0,0,0,0,0,0,0,0,0,0,0,0,0,0,0,0,0,0,0,0,0,0,0,0,0,0,0,0,0,0,0,0,0,0,0,0,0,0,0,0,0,0,0,0,0,0,0,0,0,0,0,0,0,0,0,0,0,0,0,0,0,0,0,0]
[null,null,"> 132 kV & < = 275 kV ; Other Insulated",0,0,0,0,0,0,0,0,0,0,0,0,0,0,0,0,0,0,0,0,0,0,0,0,0,0,0,0,0,0,0,0,0,0,0,0,0,0,0,0,0,0,0,0,0,0,0,0,0,0,0,0,0,0,0,0,0,0,0,0,0,0,0,0,0,0,0,0,0,0,0,0,0,0,0,0,0,0,0,0,0,0,0,0,0,0,0,0,0,0,0,0,0,0,0,0,0,0,0,0,0,0,0,0,0,0,0,0,0,0,0]
[null,null,"> 275 kV & < = 330 kV ; Other Insulated",0,0,0,0,0,0,0,0,0,0,0,0,0,0,0,0,0,0,0,0,0,0,0,0,0,0,0,0,0,0,0,0,0,0,0,0,0,0,0,0,0,0,0,0,0,0,0,0,0,0,0,0,0,0,0,0,0,0,0,0,0,0,0,0,0,0,0,0,0,0,0,0,0,0,0,0,0,0,0,0,0,0,0,0,0,0,0,0,0,0,0,0,0,0,0,0,0,0,0,0,0,0,0,0,0,0,0,0,0,0,0]
[null,null,"> 330 kV & < = 500 kV  ; Other Insulated",0,0,0,0,0,0,0,0,0,0,0,0,0,0,0,0,0,0,0,0,0,0,0,0,0,0,0,0,0,0,0,0,0,0,0,0,0,0,0,0,0,0,0,0,0,0,0,0,0,0,0,0,0,0,0,0,0,0,0,0,0,0,0,0,0,0,0,0,0,0,0,0,0,0,0,0,0,0,0,0,0,0,0,0,0,0,0,0,0,0,0,0,0,0,0,0,0,0,0,0,0,0,0,0,0,0,0,0,0,0,0]
[null,null,"> 500 kV  ; Other Insulated",0,0,0,0,0,0,0,0,0,0,0,0,0,0,0,0,0,0,0,0,0,0,0,0,0,0,0,0,0,0,0,0,0,0,0,0,0,0,0,0,0,0,0,0,0,0,0,0,0,0,0,0,0,0,0,0,0,0,0,0,0,0,0,0,0,0,0,0,0,0,0,0,0,0,0,0,0,0,0,0,0,0,0,0,0,0,0,0,0,0,0,0,0,0,0,0,0,0,0,0,0,0,0,0,0,0,0,0,0,0,0]
[null,null,"Other"]
[null,"SUBSTATION SWITCHBAYS BY: \nHighest operating voltage; Switch type","< = 33 kV; Air Insulated circuit Breaker",40,6.3,0,0,0,0,0,0,0,0,0,0,0,0,0,0,0,0,0,0,0,0,0,0,0,0,0,0,1,0,0,1,0,0,0,0,2,0,0,0,0,0,0,0,0,0,0,0,0,0,0,0,0,0,0,0,0,0,0,0,0,0,0,0,0,0,0,0,0,0,0,0,0,0,0,0,0,0,0,0,0,0,0,0,0,0,0,0,0,0,0,0,0,0,0,0,0,0,0,0,0,0,0,0,0,0,0,0,0,0,0]
[null,null,"> 33 kV & < = 66 kV ; Air Insulated circuit Breaker",40,6.3,0,0,0,0,0,2,7,0,0,0,0,0,0,0,0,0,0,0,0,2,2,0,0,0,0,0,0,0,0,0,0,0,0,0,0,0,0,0,0,0,0,0,0,0,0,0,0,0,0,0,0,0,0,0,0,0,0,0,0,0,0,0,0,0,0,0,0,0,0,0,0,0,0,0,0,0,0,0,0,0,0,0,0,0,0,0,0,0,0,0,0,0,0,0,0,0,0,0,0,0,0,0,0,0,0,0,0,0,0]
[null,null,"> 66 kV & < = 132 kV ; Air Insulated circuit Breaker",40,6.3,6,11,0,9,39,31,28,26,48,55,27,21,16,15,2,4,4,7,3,7,13,4,1,5,3,1,3,3,2,6,16,19,9,12,13,7,4,6,1,5,4,2,0,3,1,0,0,0,0,0,0,0,0,0,0,6,0,0,0,0,0,0,0,0,0,0,0,0,0,0,0,0,0,0,0,0,0,0,0,0,0,0,0,0,0,0,0,0,0,0,0,0,0,0,0,0,0,0,0,0,0,0,0,0,0,0,0,0,0]
[null,null,"> 132 kV & < = 275 kV ; Air Insulated circuit Breaker",40,6.3,2,0,2,16,21,30,28,6,15,35,43,31,27,15,5,10,12,0,4,8,13,0,5,4,7,12,2,0,0,18,2,1,1,11,0,0,0,3,0,1,4,0,0,13,0,0,0,0,0,0,0,0,0,0,0,0,0,0,0,0,0,0,0,0,0,0,0,0,0,0,0,0,0,0,0,0,0,0,0,0,0,0,0,0,0,0,0,0,0,0,0,0,0,0,0,0,0,0,0,0,0,0,0,0,0,0,0,0,0]
[null,null,"> 275 kV & < = 330 kV ; Air Insulated circuit Breaker",40,6.3,0,0,0,0,0,0,3,0,0,0,1,0,0,4,0,0,0,0,0,0,0,0,0,0,0,0,0,0,0,0,0,0,0,0,0,0,0,0,0,0,0,0,0,0,0,0,0,0,0,0,0,0,0,0,0,0,0,0,0,0,0,0,0,0,0,0,0,0,0,0,0,0,0,0,0,0,0,0,0,0,0,0,0,0,0,0,0,0,0,0,0,0,0,0,0,0,0,0,0,0,0,0,0,0,0,0,0,0,0]
[null,null,"> 330 kV & < = 500 kV  ; Air Insulated circuit Breaker",0,0,0,0,0,0,0,0,0,0,0,0,0,0,0,0,0,0,0,0,0,0,0,0,0,0,0,0,0,0,0,0,0,0,0,0,0,0,0,0,0,0,0,0,0,0,0,0,0,0,0,0,0,0,0,0,0,0,0,0,0,0,0,0,0,0,0,0,0,0,0,0,0,0,0,0,0,0,0,0,0,0,0,0,0,0,0,0,0,0,0,0,0,0,0,0,0,0,0,0,0,0,0,0,0,0,0,0,0,0,0]
[null,null,"> 500 kV  ; Air Insulated circuit Breaker",0,0,0,0,0,0,0,0,0,0,0,0,0,0,0,0,0,0,0,0,0,0,0,0,0,0,0,0,0,0,0,0,0,0,0,0,0,0,0,0,0,0,0,0,0,0,0,0,0,0,0,0,0,0,0,0,0,0,0,0,0,0,0,0,0,0,0,0,0,0,0,0,0,0,0,0,0,0,0,0,0,0,0,0,0,0,0,0,0,0,0,0,0,0,0,0,0,0,0,0,0,0,0,0,0,0,0,0,0,0,0]
[null,null,"< = 33 kV; Air Insulated Isolators / Earth Switch",40,6.3,0,1,0,0,1,0,2,0,0,0,0,1,0,0,0,0,2,0,0,0,0,0,0,1,0,0,0,0,0,0,0,0,0,0,0,0,0,0,0,0,0,0,0,2,0,0,0,0,0,0,0,0,0,0,0,1,0,0,0,0,0,0,0,0,0,0,0,0,0,0,0,0,0,0,0,0,0,0,0,0,0,0,0,0,0,0,0,0,0,0,0,0,0,0,0,0,0,0,0,0,0,0,0,0,0,0,0,0,0]
[null,null,"> 33 kV & < = 66 kV ; Air Insulated Isolators / Earth Switch",40,6.3,0,0,0,0,0,1,0,0,0,4,1,0,1,0,0,0,0,0,1,0,0,0,0,0,0,0,0,0,0,0,0,0,0,0,0,0,2,0,0,0,0,0,0,0,0,0,0,0,0,0,0,0,0,0,0,0,0,0,0,0,0,0,0,0,0,0,0,0,0,0,0,0,0,0,0,0,0,0,0,0,0,0,0,0,0,0,0,0,0,0,0,0,0,0,0,0,0,0,0,0,0,0,0,0,0,0,0,0,0]
[null,null,"> 66 kV & < = 132 kV ; Air Insulated Isolators / Earth Switch",40,6.3,0,2,0,0,1,2,3,5,12,10,4,2,4,5,5,3,2,0,0,0,3,1,0,1,0,1,1,1,1,1,2,12,2,1,5,2,0,0,1,5,2,2,0,1,0,0,2,0,1,0,0,0,0,0,2,0,0,0,0,0,0,0,0,0,0,0,0,0,0,0,0,0,0,0,0,0,0,0,0,0,0,0,0,0,0,0,0,0,0,0,0,0,0,0,0,0,0,0,0,0,0,0,0,0,0,0,0,0,0]
[null,null,"> 132 kV & < = 275 kV ; Air Insulated Isolators / Earth Switch",40,6.3,0,0,0,0,4,0,2,0,2,13,10,9,4,1,0,0,1,4,0,1,0,0,0,0,3,0,0,0,0,0,2,0,0,0,0,0,0,0,0,0,0,0,1,0,0,0,0,0,0,1,0,0,0,0,0,0,0,0,0,0,0,0,0,0,0,0,0,0,0,0,0,0,0,0,0,0,0,0,0,0,0,0,0,0,0,0,0,0,0,0,0,0,0,0,0,0,0,0,0,0,0,0,0,0,0,0,0,0,0]
[null,null,"> 275 kV & < = 330 kV ; Air Insulated Isolators / Earth Switch",40,6.3,0,0,0,0,0,0,0,0,0,2,0,0,0,2,0,0,0,0,0,0,0,0,0,0,0,0,0,0,0,0,0,0,0,0,0,0,0,0,0,0,0,0,0,0,0,0,0,0,0,0,0,0,0,0,0,0,0,0,0,0,0,0,0,0,0,0,0,0,0,0,0,0,0,0,0,0,0,0,0,0,0,0,0,0,0,0,0,0,0,0,0,0,0,0,0,0,0,0,0,0,0,0,0,0,0,0,0,0,0]
[null,null,"> 330 kV & < = 500 kV  ; Air Insulated Isolators / Earth Switch",0,0,0,0,0,0,0,0,0,0,0,0,0,0,0,0,0,0,0,0,0,0,0,0,0,0,0,0,0,0,0,0,0,0,0,0,0,0,0,0,0,0,0,0,0,0,0,0,0,0,0,0,0,0,0,0,0,0,0,0,0,0,0,0,0,0,0,0,0,0,0,0,0,0,0,0,0,0,0,0,0,0,0,0,0,0,0,0,0,0,0,0,0,0,0,0,0,0,0,0,0,0,0,0,0,0,0,0,0,0,0]
[null,null,"> 500 kV  ; Air Insulated Isolators / Earth Switch",0,0,0,0,0,0,0,0,0,0,0,0,0,0,0,0,0,0,0,0,0,0,0,0,0,0,0,0,0,0,0,0,0,0,0,0,0,0,0,0,0,0,0,0,0,0,0,0,0,0,0,0,0,0,0,0,0,0,0,0,0,0,0,0,0,0,0,0,0,0,0,0,0,0,0,0,0,0,0,0,0,0,0,0,0,0,0,0,0,0,0,0,0,0,0,0,0,0,0,0,0,0,0,0,0,0,0,0,0,0,0]
[null,null,"< = 33 kV; VT",40,6.3,1,1,0,0,2,0,0,0,0,0,0,1,0,0,0,0,1,0,0,0,0,0,0,0,0,0,0,0,0,0,0,0,0,0,0,0,0,0,0,0,0,0,0,0,0,0,0,0,0,0,0,0,0,0,0,0,0,0,0,0,0,0,0,0,0,0,0,0,0,0,0,0,0,0,0,0,0,0,0,0,0,0,0,0,0,0,0,0,0,0,0,0,0,0,0,0,0,0,0,0,0,0,0,0,0,0,0,0,0]
[null,null,"> 33 kV & < = 66 kV ; VT",40,6.3,1,1,0,0,0,1,0,0,0,0,0,1,0,0,0,0,1,0,1,0,2,0,0,0,0,0,0,0,0,0,0,0,0,1,0,0,0,0,0,0,0,0,0,1,0,0,0,0,0,0,0,0,0,0,0,0,0,0,0,0,0,0,0,0,0,0,0,0,0,0,0,0,0,0,0,0,0,0,0,0,0,0,0,0,0,0,0,0,0,0,0,0,0,0,0,0,0,0,0,0,0,0,0,0,0,0,0,0,0]
[null,null,"> 66 kV & < = 132 kV ; VT",40,6.3,0,0,0,1,2,1,0,0,0,1,0,1,0,0,0,0,0,0,0,0,0,0,0,0,0,0,0,0,0,0,2,4,0,3,0,0,0,0,0,0,0,0,0,0,0,0,0,0,0,0,0,0,0,0,0,0,0,0,0,0,0,0,0,0,0,0,0,0,0,0,0,0,0,0,0,0,0,0,0,0,0,0,0,0,0,0,0,0,0,0,0,0,0,0,0,0,0,0,0,0,0,0,0,0,0,0,0,0,0]
[null,null,"> 132 kV & < = 275 kV ; VT",40,6.3,0,0,1,0,1,0,0,0,0,2,0,0,0,0,0,0,0,0,0,0,0,0,0,0,0,0,0,0,0,0,0,0,0,0,0,0,0,0,0,0,0,0,0,0,0,0,0,0,0,0,0,0,0,0,0,0,0,0,0,0,0,0,0,0,0,0,0,0,0,0,0,0,0,0,0,0,0,0,0,0,0,0,0,0,0,0,0,0,0,0,0,0,0,0,0,0,0,0,0,0,0,0,0,0,0,0,0,0,0]
[null,null,"> 275 kV & < = 330 kV ; VT",0,0,0,0,0,0,0,0,0,0,0,0,0,0,0,0,0,0,0,0,0,0,0,0,0,0,0,0,0,0,0,0,0,0,0,0,0,0,0,0,0,0,0,0,0,0,0,0,0,0,0,0,0,0,0,0,0,0,0,0,0,0,0,0,0,0,0,0,0,0,0,0,0,0,0,0,0,0,0,0,0,0,0,0,0,0,0,0,0,0,0,0,0,0,0,0,0,0,0,0,0,0,0,0,0,0,0,0,0,0,0]
[null,null,"> 330 kV & < = 500 kV  ; VT",0,0,0,0,0,0,0,0,0,0,0,0,0,0,0,0,0,0,0,0,0,0,0,0,0,0,0,0,0,0,0,0,0,0,0,0,0,0,0,0,0,0,0,0,0,0,0,0,0,0,0,0,0,0,0,0,0,0,0,0,0,0,0,0,0,0,0,0,0,0,0,0,0,0,0,0,0,0,0,0,0,0,0,0,0,0,0,0,0,0,0,0,0,0,0,0,0,0,0,0,0,0,0,0,0,0,0,0,0,0,0]
[null,null,"> 500 kV  ; VT",0,0,0,0,0,0,0,0,0,0,0,0,0,0,0,0,0,0,0,0,0,0,0,0,0,0,0,0,0,0,0,0,0,0,0,0,0,0,0,0,0,0,0,0,0,0,0,0,0,0,0,0,0,0,0,0,0,0,0,0,0,0,0,0,0,0,0,0,0,0,0,0,0,0,0,0,0,0,0,0,0,0,0,0,0,0,0,0,0,0,0,0,0,0,0,0,0,0,0,0,0,0,0,0,0,0,0,0,0,0,0]
[null,null,"< = 33 kV; CT",40,6.3,0,0,0,0,0,2,0,0,0,0,0,0,0,0,0,0,0,0,0,0,0,0,0,0,0,0,0,0,0,0,0,0,0,0,0,0,0,0,0,0,0,0,0,0,0,2,0,0,0,0,0,0,0,0,0,0,0,0,0,0,0,0,0,0,0,0,0,0,0,0,0,0,0,0,0,0,0,0,0,0,0,0,0,0,0,0,0,0,0,0,0,0,0,0,0,0,0,0,0,0,0,0,0,0,0,0,0,0,0]
[null,null,"> 33 kV & < = 66 kV ; CT",40,6.3,0,0,0,0,0,0,0,0,0,0,0,0,0,0,0,0,0,0,1,1,0,0,0,0,0,0,0,0,0,0,0,0,0,0,0,0,0,0,0,0,0,0,0,1,1,0,0,0,0,0,0,0,0,0,0,0,0,0,0,0,0,0,0,0,0,0,0,0,0,0,0,0,0,0,0,0,0,0,0,0,0,0,0,0,0,0,0,0,0,0,0,0,0,0,0,0,0,0,0,0,0,0,0,0,0,0,0,0,0]
[null,null,"> 66 kV & < = 132 kV ; CT",0,0,0,0,0,0,0,0,0,0,0,0,0,0,0,0,0,0,0,0,0,0,0,0,0,0,0,0,0,0,0,0,0,0,0,0,0,0,0,0,0,0,0,0,0,0,0,0,0,0,0,0,0,0,0,0,0,0,0,0,0,0,0,0,0,0,0,0,0,0,0,0,0,0,0,0,0,0,0,0,0,0,0,0,0,0,0,0,0,0,0,0,0,0,0,0,0,0,0,0,0,0,0,0,0,0,0,0,0,0,0]
[null,null,"> 132 kV & < = 275 kV ; CT",40,6.3,0,0,0,0,0,0,2,0,0,0,0,0,0,0,0,0,0,0,0,0,0,0,0,0,0,0,0,0,0,0,0,0,0,0,0,0,0,0,0,0,0,0,0,0,0,0,0,0,0,0,0,0,0,0,0,0,0,0,0,0,0,0,0,0,0,0,0,0,0,0,0,0,0,0,0,0,0,0,0,0,0,0,0,0,0,0,0,0,0,0,0,0,0,0,0,0,0,0,0,0,0,0,0,0,0,0,0,0,0]
[null,null,"> 275 kV & < = 330 kV ; CT",0,0,0,0,0,0,0,0,0,0,0,0,0,0,0,0,0,0,0,0,0,0,0,0,0,0,0,0,0,0,0,0,0,0,0,0,0,0,0,0,0,0,0,0,0,0,0,0,0,0,0,0,0,0,0,0,0,0,0,0,0,0,0,0,0,0,0,0,0,0,0,0,0,0,0,0,0,0,0,0,0,0,0,0,0,0,0,0,0,0,0,0,0,0,0,0,0,0,0,0,0,0,0,0,0,0,0,0,0,0,0]
[null,null,"> 330 kV & < = 500 kV  ; CT",0,0,0,0,0,0,0,0,0,0,0,0,0,0,0,0,0,0,0,0,0,0,0,0,0,0,0,0,0,0,0,0,0,0,0,0,0,0,0,0,0,0,0,0,0,0,0,0,0,0,0,0,0,0,0,0,0,0,0,0,0,0,0,0,0,0,0,0,0,0,0,0,0,0,0,0,0,0,0,0,0,0,0,0,0,0,0,0,0,0,0,0,0,0,0,0,0,0,0,0,0,0,0,0,0,0,0,0,0,0,0]
[null,null,"> 500 kV  ; CT",0,0,0,0,0,0,0,0,0,0,0,0,0,0,0,0,0,0,0,0,0,0,0,0,0,0,0,0,0,0,0,0,0,0,0,0,0,0,0,0,0,0,0,0,0,0,0,0,0,0,0,0,0,0,0,0,0,0,0,0,0,0,0,0,0,0,0,0,0,0,0,0,0,0,0,0,0,0,0,0,0,0,0,0,0,0,0,0,0,0,0,0,0,0,0,0,0,0,0,0,0,0,0,0,0,0,0,0,0,0,0]
[null,null,"< = 33 kV; GIS Module",0,0,0,0,0,0,0,0,0,0,0,0,0,0,0,0,0,0,0,0,0,0,0,0,0,0,0,0,0,0,0,0,0,0,0,0,0,0,0,0,0,0,0,0,0,0,0,0,0,0,0,0,0,0,0,0,0,0,0,0,0,0,0,0,0,0,0,0,0,0,0,0,0,0,0,0,0,0,0,0,0,0,0,0,0,0,0,0,0,0,0,0,0,0,0,0,0,0,0,0,0,0,0,0,0,0,0,0,0,0,0]
[null,null,"> 33 kV & < = 66 kV ; GIS Module",0,0,0,0,0,0,0,0,0,0,0,0,0,0,0,0,0,0,0,0,0,0,0,0,0,0,0,0,0,0,0,0,0,0,0,0,0,0,0,0,0,0,0,0,0,0,0,0,0,0,0,0,0,0,0,0,0,0,0,0,0,0,0,0,0,0,0,0,0,0,0,0,0,0,0,0,0,0,0,0,0,0,0,0,0,0,0,0,0,0,0,0,0,0,0,0,0,0,0,0,0,0,0,0,0,0,0,0,0,0,0]
[null,null,"> 66 kV & < = 132 kV ; GIS Module",40,6.3,0,0,0,0,0,0,0,0,1,1,4,40,10,14,4,27,29,24,0,0,0,0,0,0,0,0,0,0,0,0,0,0,0,0,0,0,0,0,0,0,0,0,0,0,0,0,0,0,0,0,0,0,0,0,0,0,0,0,0,0,0,0,0,0,0,0,0,0,0,0,0,0,0,0,0,0,0,0,0,0,0,0,0,0,0,0,0,0,0,0,0,0,0,0,0,0,0,0,0,0,0,0,0,0,0,0,0,0,0]
[null,null,"> 132 kV & < = 275 kV ; GIS Module",40,6.3,0,0,0,0,0,0,0,0,0,0,0,0,0,0,0,2,9,10,18,0,0,0,0,0,0,0,0,0,0,0,0,0,0,0,0,0,0,0,0,0,0,0,0,0,0,0,0,0,0,0,0,0,0,0,0,0,0,0,0,0,0,0,0,0,0,0,0,0,0,0,0,0,0,0,0,0,0,0,0,0,0,0,0,0,0,0,0,0,0,0,0,0,0,0,0,0,0,0,0,0,0,0,0,0,0,0,0,0,0]
[null,null,"> 275 kV & < = 330 kV ; GIS Module",40,6.3,0,0,0,0,0,0,0,0,0,0,0,0,0,0,0,0,0,13,0,0,0,0,0,0,0,0,0,0,0,0,0,0,0,0,0,0,0,0,0,0,0,0,0,0,0,0,0,0,0,0,0,0,0,0,0,0,0,0,0,0,0,0,0,0,0,0,0,0,0,0,0,0,0,0,0,0,0,0,0,0,0,0,0,0,0,0,0,0,0,0,0,0,0,0,0,0,0,0,0,0,0,0,0,0,0,0,0,0,0]
[null,null,"> 330 kV & < = 500 kV  ; GIS Module",0,0,0,0,0,0,0,0,0,0,0,0,0,0,0,0,0,0,0,0,0,0,0,0,0,0,0,0,0,0,0,0,0,0,0,0,0,0,0,0,0,0,0,0,0,0,0,0,0,0,0,0,0,0,0,0,0,0,0,0,0,0,0,0,0,0,0,0,0,0,0,0,0,0,0,0,0,0,0,0,0,0,0,0,0,0,0,0,0,0,0,0,0,0,0,0,0,0,0,0,0,0,0,0,0,0,0,0,0,0,0]
[null,null,"> 500 kV  ; GIS Module",0,0,0,0,0,0,0,0,0,0,0,0,0,0,0,0,0,0,0,0,0,0,0,0,0,0,0,0,0,0,0,0,0,0,0,0,0,0,0,0,0,0,0,0,0,0,0,0,0,0,0,0,0,0,0,0,0,0,0,0,0,0,0,0,0,0,0,0,0,0,0,0,0,0,0,0,0,0,0,0,0,0,0,0,0,0,0,0,0,0,0,0,0,0,0,0,0,0,0,0,0,0,0,0,0,0,0,0,0,0,0]
[null,null,"Other"]
[null,"SUBSTATION POWER TRANSFORMERS BY: \nHighest operating voltage;  Ampere rating","< = 33 kV ; < = 10 MVA",0,0,0,0,0,0,0,0,0,0,0,0,0,0,0,0,0,0,0,0,0,0,0,0,0,0,0,0,0,0,0,0,0,0,0,0,0,0,0,0,0,0,0,0,0,0,0,0,0,0,0,0,0,0,0,0,0,0,0,0,0,0,0,0,0,0,0,0,0,0,0,0,0,0,0,0,0,0,0,0,0,0,0,0,0,0,0,0,0,0,0,0,0,0,0,0,0,0,0,0,0,0,0,0,0,0,0,0,0,0,0]
[null,null,"< = 33 kV ; > 10 MVA & < =  30 MVA",0,0,0,0,0,0,0,0,0,0,0,0,0,0,0,0,0,0,0,0,0,0,0,0,0,0,0,0,0,0,0,0,0,0,0,0,0,0,0,0,0,0,0,0,0,0,0,0,0,0,0,0,0,0,0,0,0,0,0,0,0,0,0,0,0,0,0,0,0,0,0,0,0,0,0,0,0,0,0,0,0,0,0,0,0,0,0,0,0,0,0,0,0,0,0,0,0,0,0,0,0,0,0,0,0,0,0,0,0,0,0]
[null,null,"< = 33 kV ; > 30 MVA",0,0,0,0,0,0,0,0,0,0,0,0,0,0,0,0,0,0,0,0,0,0,0,0,0,0,0,0,0,0,0,0,0,0,0,0,0,0,0,0,0,0,0,0,0,0,0,0,0,0,0,0,0,0,0,0,0,0,0,0,0,0,0,0,0,0,0,0,0,0,0,0,0,0,0,0,0,0,0,0,0,0,0,0,0,0,0,0,0,0,0,0,0,0,0,0,0,0,0,0,0,0,0,0,0,0,0,0,0,0,0]
[null,null,"> 33 kV & < = 66 kV  ; < = 10 MVA",0,0,0,0,0,0,0,0,0,0,0,0,0,0,0,0,0,0,0,0,0,0,0,0,0,0,0,0,0,0,0,0,0,0,0,0,0,0,0,0,0,0,0,0,0,0,0,0,0,0,0,0,0,0,0,0,0,0,0,0,0,0,0,0,0,0,0,0,0,0,0,0,0,0,0,0,0,0,0,0,0,0,0,0,0,0,0,0,0,0,0,0,0,0,0,0,0,0,0,0,0,0,0,0,0,0,0,0,0,0,0]
[null,null,"> 33 kV & < = 66 kV  ; > 10 MVA & < =  30 MVA",0,0,0,0,0,0,0,0,0,0,0,0,0,0,0,0,0,0,0,0,0,0,0,0,0,0,0,0,0,0,0,0,0,0,0,0,0,0,0,0,0,0,0,0,0,0,0,0,0,0,0,0,0,0,0,0,0,0,0,0,0,0,0,0,0,0,0,0,0,0,0,0,0,0,0,0,0,0,0,0,0,0,0,0,0,0,0,0,0,0,0,0,0,0,0,0,0,0,0,0,0,0,0,0,0,0,0,0,0,0,0]
[null,null,"> 33 kV & < = 66 kV  ; > 30 MVA",0,0,0,0,0,0,0,0,0,0,0,0,0,0,0,0,0,0,0,0,0,0,0,0,0,0,0,0,0,0,0,0,0,0,0,0,0,0,0,0,0,0,0,0,0,0,0,0,0,0,0,0,0,0,0,0,0,0,0,0,0,0,0,0,0,0,0,0,0,0,0,0,0,0,0,0,0,0,0,0,0,0,0,0,0,0,0,0,0,0,0,0,0,0,0,0,0,0,0,0,0,0,0,0,0,0,0,0,0,0,0]
[null,null,"> 66 kV & < = 132 kV  ; < = 30 MVA",40,6.3,0,0,0,2,0,0,0,0,0,1,0,0,0,0,0,0,0,1,0,0,0,0,0,0,0,0,0,0,0,0,1,2,2,0,1,1,0,0,0,0,0,1,0,0,0,0,0,0,0,0,0,0,1,1,1,0,0,0,0,0,0,0,0,0,0,0,0,0,0,0,0,0,0,0,0,0,0,0,0,0,0,0,0,0,0,0,0,0,0,0,0,0,0,0,0,0,0,0,0,0,0,0,0,0,0,0,0,0,0]
[null,null,"> 66 kV & < = 132 kV  ; > 30 MVA & < =  60 MVA",40,6.3,0,0,0,0,1,0,0,0,0,0,0,1,0,0,0,2,0,0,1,0,1,2,0,3,0,0,1,1,0,0,0,5,4,1,0,2,0,0,0,0,1,0,0,0,0,0,0,0,0,0,0,0,0,0,0,0,0,0,0,0,0,0,0,0,0,0,0,0,0,0,0,0,0,0,0,0,0,0,0,0,0,0,0,0,0,0,0,0,0,0,0,0,0,0,0,0,0,0,0,0,0,0,0,0,0,0,0,0,0]
[null,null,"> 66 kV & < = 132 kV  ; > 60 MVA",40,6.3,0,0,0,1,4,4,2,4,2,8,5,7,3,3,1,5,3,4,4,1,4,2,0,0,0,0,0,1,0,0,0,0,0,0,0,0,1,0,2,1,4,0,0,1,0,2,0,0,0,0,0,0,0,0,0,0,0,0,0,0,0,0,0,0,0,0,0,0,0,0,0,0,0,0,0,0,0,0,0,0,0,0,0,0,0,0,0,0,0,0,0,0,0,0,0,0,0,0,0,0,0,0,0,0,0,0,0,0,0]
[null,null,"> 132 kV & < = 220 kV  ; < = 50 MVA",0,0,0,0,0,0,0,0,0,0,0,0,0,0,0,0,0,0,0,0,0,0,0,0,0,0,0,0,0,0,0,0,0,0,0,0,0,0,0,0,0,0,0,0,0,0,0,0,0,0,0,0,0,0,0,0,0,0,0,0,0,0,0,0,0,0,0,0,0,0,0,0,0,0,0,0,0,0,0,0,0,0,0,0,0,0,0,0,0,0,0,0,0,0,0,0,0,0,0,0,0,0,0,0,0,0,0,0,0,0,0]
[null,null,"> 132 kV & < = 220 kV  ; > 50 MVA & < =  100 MVA",0,0,0,0,0,0,0,0,0,0,0,0,0,0,0,0,0,0,0,0,0,0,0,0,0,0,0,0,0,0,0,0,0,0,0,0,0,0,0,0,0,0,0,0,0,0,0,0,0,0,0,0,0,0,0,0,0,0,0,0,0,0,0,0,0,0,0,0,0,0,0,0,0,0,0,0,0,0,0,0,0,0,0,0,0,0,0,0,0,0,0,0,0,0,0,0,0,0,0,0,0,0,0,0,0,0,0,0,0,0,0]
[null,null,"> 132 kV & < = 220 kV  ; > 100 MVA",0,0,0,0,0,0,0,0,0,0,0,0,0,0,0,0,0,0,0,0,0,0,0,0,0,0,0,0,0,0,0,0,0,0,0,0,0,0,0,0,0,0,0,0,0,0,0,0,0,0,0,0,0,0,0,0,0,0,0,0,0,0,0,0,0,0,0,0,0,0,0,0,0,0,0,0,0,0,0,0,0,0,0,0,0,0,0,0,0,0,0,0,0,0,0,0,0,0,0,0,0,0,0,0,0,0,0,0,0,0,0]
[null,null,"> 220 kV & < = 275 kV  ; < = 50 MVA",0,0,0,0,0,0,0,0,0,0,0,0,0,0,0,0,0,0,0,0,0,0,0,0,0,0,0,0,0,0,0,0,0,0,0,0,0,0,0,0,0,0,0,0,0,0,0,0,0,0,0,0,0,0,0,0,0,0,0,0,0,0,0,0,0,0,0,0,0,0,0,0,0,0,0,0,0,0,0,0,0,0,0,0,0,0,0,0,0,0,0,0,0,0,0,0,0,0,0,0,0,0,0,0,0,0,0,0,0,0,0]
[null,null,"> 220 kV & < = 275 kV  ; > 50 MVA & < =  100 MVA",40,6.3,0,0,0,0,0,0,0,0,0,0,0,0,0,0,0,0,0,0,0,0,0,0,0,0,0,0,1,0,0,0,0,1,0,0,1,1,0,0,0,0,0,0,0,0,0,0,0,0,0,0,0,0,0,0,0,0,0,0,0,0,0,0,0,0,0,0,0,0,0,0,0,0,0,0,0,0,0,0,0,0,0,0,0,0,0,0,0,0,0,0,0,0,0,0,0,0,0,0,0,0,0,0,0,0,0,0,0,0,0]
[null,null,"> 220 kV & < = 275 kV  ; > 100 MVA",40,6.3,0,1,0,3,3,2,3,3,3,7,4,3,2,4,1,4,2,3,2,1,1,0,1,0,2,0,1,0,0,1,1,3,0,4,0,0,3,0,0,0,0,1,1,1,0,0,0,0,0,0,0,0,0,0,0,0,0,0,0,0,0,0,0,0,0,0,0,0,0,0,0,0,0,0,0,0,0,0,0,0,0,0,0,0,0,0,0,0,0,0,0,0,0,0,0,0,0,0,0,0,0,0,0,0,0,0,0,0,0]
[null,null,"> 275 kV & < = 330 kV  ; < = 100 MVA",40,6.3,0,0,0,0,0,0,0,0,0,0,0,0,0,0,1,0,0,0,0,0,0,0,0,0,0,0,0,0,0,0,0,0,0,0,0,0,0,0,0,0,0,0,0,0,0,0,0,0,0,0,0,0,0,0,0,0,0,0,0,0,0,0,0,0,0,0,0,0,0,0,0,0,0,0,0,0,0,0,0,0,0,0,0,0,0,0,0,0,0,0,0,0,0,0,0,0,0,0,0,0,0,0,0,0,0,0,0,0,0]
[null,null,"> 275 kV & < = 330 kV  ; > 100 MVA & < =  250 MVA",0,0,0,0,0,0,0,0,0,0,0,0,0,0,0,0,0,0,0,0,0,0,0,0,0,0,0,0,0,0,0,0,0,0,0,0,0,0,0,0,0,0,0,0,0,0,0,0,0,0,0,0,0,0,0,0,0,0,0,0,0,0,0,0,0,0,0,0,0,0,0,0,0,0,0,0,0,0,0,0,0,0,0,0,0,0,0,0,0,0,0,0,0,0,0,0,0,0,0,0,0,0,0,0,0,0,0,0,0,0,0]
[null,null,"> 275 kV & < = 330 kV  ; > 250 MVA",40,6.3,0,0,0,0,0,1,0,0,0,1,0,0,0,1,0,0,0,2,0,0,0,0,0,0,0,0,0,0,0,0,0,0,0,0,0,0,0,0,0,0,0,0,0,0,0,0,0,0,0,0,0,0,0,0,0,0,0,0,0,0,0,0,0,0,0,0,0,0,0,0,0,0,0,0,0,0,0,0,0,0,0,0,0,0,0,0,0,0,0,0,0,0,0,0,0,0,0,0,0,0,0,0,0,0,0,0,0,0,0]
[null,null,"> 330 kV & < = 500 kV   ; < = 150 MVA",0,0,0,0,0,0,0,0,0,0,0,0,0,0,0,0,0,0,0,0,0,0,0,0,0,0,0,0,0,0,0,0,0,0,0,0,0,0,0,0,0,0,0,0,0,0,0,0,0,0,0,0,0,0,0,0,0,0,0,0,0,0,0,0,0,0,0,0,0,0,0,0,0,0,0,0,0,0,0,0,0,0,0,0,0,0,0,0,0,0,0,0,0,0,0,0,0,0,0,0,0,0,0,0,0,0,0,0,0,0,0]
[null,null,"> 330 kV & < = 500 kV   ; > 150 MVA & < =  300 MVA",0,0,0,0,0,0,0,0,0,0,0,0,0,0,0,0,0,0,0,0,0,0,0,0,0,0,0,0,0,0,0,0,0,0,0,0,0,0,0,0,0,0,0,0,0,0,0,0,0,0,0,0,0,0,0,0,0,0,0,0,0,0,0,0,0,0,0,0,0,0,0,0,0,0,0,0,0,0,0,0,0,0,0,0,0,0,0,0,0,0,0,0,0,0,0,0,0,0,0,0,0,0,0,0,0,0,0,0,0,0,0]
[null,null,"> 330 kV & < = 500 kV   ; > 300 MVA",0,0,0,0,0,0,0,0,0,0,0,0,0,0,0,0,0,0,0,0,0,0,0,0,0,0,0,0,0,0,0,0,0,0,0,0,0,0,0,0,0,0,0,0,0,0,0,0,0,0,0,0,0,0,0,0,0,0,0,0,0,0,0,0,0,0,0,0,0,0,0,0,0,0,0,0,0,0,0,0,0,0,0,0,0,0,0,0,0,0,0,0,0,0,0,0,0,0,0,0,0,0,0,0,0,0,0,0,0,0,0]
[null,null,"> 500 kV   ; < = 1000 MVA",0,0,0,0,0,0,0,0,0,0,0,0,0,0,0,0,0,0,0,0,0,0,0,0,0,0,0,0,0,0,0,0,0,0,0,0,0,0,0,0,0,0,0,0,0,0,0,0,0,0,0,0,0,0,0,0,0,0,0,0,0,0,0,0,0,0,0,0,0,0,0,0,0,0,0,0,0,0,0,0,0,0,0,0,0,0,0,0,0,0,0,0,0,0,0,0,0,0,0,0,0,0,0,0,0,0,0,0,0,0,0]
[null,null,"> 500 kV   ; > 1000 MVA & < =  1500 MVA",0,0,0,0,0,0,0,0,0,0,0,0,0,0,0,0,0,0,0,0,0,0,0,0,0,0,0,0,0,0,0,0,0,0,0,0,0,0,0,0,0,0,0,0,0,0,0,0,0,0,0,0,0,0,0,0,0,0,0,0,0,0,0,0,0,0,0,0,0,0,0,0,0,0,0,0,0,0,0,0,0,0,0,0,0,0,0,0,0,0,0,0,0,0,0,0,0,0,0,0,0,0,0,0,0,0,0,0,0,0,0]
[null,null,"> 500 kV   ; > 1500 MVA",0,0,0,0,0,0,0,0,0,0,0,0,0,0,0,0,0,0,0,0,0,0,0,0,0,0,0,0,0,0,0,0,0,0,0,0,0,0,0,0,0,0,0,0,0,0,0,0,0,0,0,0,0,0,0,0,0,0,0,0,0,0,0,0,0,0,0,0,0,0,0,0,0,0,0,0,0,0,0,0,0,0,0,0,0,0,0,0,0,0,0,0,0,0,0,0,0,0,0,0,0,0,0,0,0,0,0,0,0,0,0]
[null,null,"Other"]
[null,"SUBSTATION REACTIVE PLANT BY: \nHighest operating voltage; Function","< = 33 kV;  SVCS",0,0,0,0,0,0,0,0,0,0,0,0,0,0,0,0,0,0,0,0,0,0,0,0,0,0,0,0,0,0,0,0,0,0,0,0,0,0,0,0,0,0,0,0,0,0,0,0,0,0,0,0,0,0,0,0,0,0,0,0,0,0,0,0,0,0,0,0,0,0,0,0,0,0,0,0,0,0,0,0,0,0,0,0,0,0,0,0,0,0,0,0,0,0,0,0,0,0,0,0,0,0,0,0,0,0,0,0,0,0,0]
[null,null,"> 33 kV & < = 66 kV ;  SVCS",0,0,0,0,0,0,0,0,0,0,0,0,0,0,0,0,0,0,0,0,0,0,0,0,0,0,0,0,0,0,0,0,0,0,0,0,0,0,0,0,0,0,0,0,0,0,0,0,0,0,0,0,0,0,0,0,0,0,0,0,0,0,0,0,0,0,0,0,0,0,0,0,0,0,0,0,0,0,0,0,0,0,0,0,0,0,0,0,0,0,0,0,0,0,0,0,0,0,0,0,0,0,0,0,0,0,0,0,0,0,0]
[null,null,"> 66 kV & < = 132 kV ;  SVCS",40,6.3,0,0,0,0,0,0,0,0,0,0,0,0,1,0,0,0,0,0,0,0,0,0,0,0,0,0,0,0,0,0,2,7,0,0,0,0,0,0,0,0,0,0,0,0,0,0,0,0,0,0,0,0,0,0,0,0,0,0,0,0,0,0,0,0,0,0,0,0,0,0,0,0,0,0,0,0,0,0,0,0,0,0,0,0,0,0,0,0,0,0,0,0,0,0,0,0,0,0,0,0,0,0,0,0,0,0,0,0,0]
[null,null,"> 132 kV & < = 275 kV ;  SVCS",40,6.3,0,0,0,0,0,0,0,0,0,3,1,0,0,0,0,0,0,2,0,1,0,0,0,0,0,0,0,0,0,0,1,0,0,0,0,0,0,0,0,0,0,0,0,0,0,0,0,0,0,0,0,0,0,0,0,0,0,0,0,0,0,0,0,0,0,0,0,0,0,0,0,0,0,0,0,0,0,0,0,0,0,0,0,0,0,0,0,0,0,0,0,0,0,0,0,0,0,0,0,0,0,0,0,0,0,0,0,0,0]
[null,null,"> 275 kV & < = 330 kV ;  SVCS",0,0,0,0,0,0,0,0,0,0,0,0,0,0,0,0,0,0,0,0,0,0,0,0,0,0,0,0,0,0,0,0,0,0,0,0,0,0,0,0,0,0,0,0,0,0,0,0,0,0,0,0,0,0,0,0,0,0,0,0,0,0,0,0,0,0,0,0,0,0,0,0,0,0,0,0,0,0,0,0,0,0,0,0,0,0,0,0,0,0,0,0,0,0,0,0,0,0,0,0,0,0,0,0,0,0,0,0,0,0,0]
[null,null,"> 330 kV & < = 500 kV  ;  SVCS",0,0,0,0,0,0,0,0,0,0,0,0,0,0,0,0,0,0,0,0,0,0,0,0,0,0,0,0,0,0,0,0,0,0,0,0,0,0,0,0,0,0,0,0,0,0,0,0,0,0,0,0,0,0,0,0,0,0,0,0,0,0,0,0,0,0,0,0,0,0,0,0,0,0,0,0,0,0,0,0,0,0,0,0,0,0,0,0,0,0,0,0,0,0,0,0,0,0,0,0,0,0,0,0,0,0,0,0,0,0,0]
[null,null,"> 500 kV  ;  SVCS",0,0,0,0,0,0,0,0,0,0,0,0,0,0,0,0,0,0,0,0,0,0,0,0,0,0,0,0,0,0,0,0,0,0,0,0,0,0,0,0,0,0,0,0,0,0,0,0,0,0,0,0,0,0,0,0,0,0,0,0,0,0,0,0,0,0,0,0,0,0,0,0,0,0,0,0,0,0,0,0,0,0,0,0,0,0,0,0,0,0,0,0,0,0,0,0,0,0,0,0,0,0,0,0,0,0,0,0,0,0,0]
[null,null,"< = 33 kV;  Capacitors",40,6.3,0,0,0,0,0,0,0,0,0,0,0,0,0,0,0,0,0,0,0,0,0,0,0,0,0,0,0,0,0,0,0,0,0,0,0,0,0,0,0,0,0,0,0,0,0,0,0,0,0,0,0,0,0,0,0,0,0,0,0,0,0,0,0,0,0,0,0,0,0,0,0,0,0,0,0,0,0,0,0,0,0,0,0,0,0,0,0,0,0,0,0,0,0,0,0,0,0,0,0,0,0,0,0,0,0,0,0,0,0]
[null,null,"> 33 kV & < = 66 kV ;  Capacitors",40,6.3,0,0,0,0,0,0,0,0,0,0,0,0,0,0,0,0,0,0,0,1,0,0,0,0,0,0,0,0,0,1,0,0,0,0,0,0,1,0,0,0,2,0,0,0,0,0,0,0,0,0,0,0,0,0,0,0,0,0,0,0,0,0,0,0,0,0,0,0,0,0,0,0,0,0,0,0,0,0,0,0,0,0,0,0,0,0,0,0,0,0,0,0,0,0,0,0,0,0,0,0,0,0,0,0,0,0,0,0,0]
[null,null,"> 66 kV & < = 132 kV ;  Capacitors",40,6.3,0,0,0,0,5,1,3,2,2,3,2,6,10,3,0,4,6,2,0,7,1,1,1,2,0,0,0,0,0,0,0,0,0,0,0,0,0,0,0,0,0,0,0,0,0,0,0,0,0,0,0,0,0,0,0,0,0,0,0,0,0,0,0,0,0,0,0,0,0,0,0,0,0,0,0,0,0,0,0,0,0,0,0,0,0,0,0,0,0,0,0,0,0,0,0,0,0,0,0,0,0,0,0,0,0,0,0,0,0]
[null,null,"> 132 kV & < = 275 kV ;  Capacitors",40,6.3,0,0,0,0,0,0,2,0,3,2,3,2,0,0,3,3,1,1,1,1,3,0,3,0,0,0,0,0,0,0,0,0,0,0,0,0,0,0,0,0,0,0,0,0,0,0,0,0,0,0,0,0,0,0,0,0,0,0,0,0,0,0,0,0,0,0,0,0,0,0,0,0,0,0,0,0,0,0,0,0,0,0,0,0,0,0,0,0,0,0,0,0,0,0,0,0,0,0,0,0,0,0,0,0,0,0,0,0,0]
[null,null,"> 275 kV & < = 330 kV ;  Capacitors",40,6.3,0,0,0,0,0,0,3,0,0,0,0,0,0,0,0,0,0,0,0,0,0,0,0,0,0,0,0,0,0,0,0,0,0,0,0,0,0,0,0,0,0,0,0,0,0,0,0,0,0,0,0,0,0,0,0,0,0,0,0,0,0,0,0,0,0,0,0,0,0,0,0,0,0,0,0,0,0,0,0,0,0,0,0,0,0,0,0,0,0,0,0,0,0,0,0,0,0,0,0,0,0,0,0,0,0,0,0,0,0]
[null,null,"> 330 kV & < = 500 kV  ;  Capacitors",0,0,0,0,0,0,0,0,0,0,0,0,0,0,0,0,0,0,0,0,0,0,0,0,0,0,0,0,0,0,0,0,0,0,0,0,0,0,0,0,0,0,0,0,0,0,0,0,0,0,0,0,0,0,0,0,0,0,0,0,0,0,0,0,0,0,0,0,0,0,0,0,0,0,0,0,0,0,0,0,0,0,0,0,0,0,0,0,0,0,0,0,0,0,0,0,0,0,0,0,0,0,0,0,0,0,0,0,0,0,0]
[null,null,"> 500 kV  ;  Capacitors",0,0,0,0,0,0,0,0,0,0,0,0,0,0,0,0,0,0,0,0,0,0,0,0,0,0,0,0,0,0,0,0,0,0,0,0,0,0,0,0,0,0,0,0,0,0,0,0,0,0,0,0,0,0,0,0,0,0,0,0,0,0,0,0,0,0,0,0,0,0,0,0,0,0,0,0,0,0,0,0,0,0,0,0,0,0,0,0,0,0,0,0,0,0,0,0,0,0,0,0,0,0,0,0,0,0,0,0,0,0,0]
[null,null,"< = 33 kV;  Oil Filled Reactors",0,0,0,0,0,0,0,0,0,0,0,0,0,0,0,0,0,0,0,0,0,0,0,0,0,0,0,0,0,0,0,0,0,0,0,0,0,0,0,0,0,0,0,0,0,0,0,0,0,0,0,0,0,0,0,0,0,0,0,0,0,0,0,0,0,0,0,0,0,0,0,0,0,0,0,0,0,0,0,0,0,0,0,0,0,0,0,0,0,0,0,0,0,0,0,0,0,0,0,0,0,0,0,0,0,0,0,0,0,0,0]
[null,null,"> 33 kV & < = 66 kV ;  Oil Filled Reactors",40,6.3,0,0,0,0,0,0,0,0,0,0,0,0,0,0,0,0,0,0,0,0,0,0,0,0,0,0,0,0,0,0,0,0,0,1,0,0,0,0,0,0,0,0,0,0,0,0,0,0,0,0,0,0,0,0,0,0,0,0,0,0,0,0,0,0,0,0,0,0,0,0,0,0,0,0,0,0,0,0,0,0,0,0,0,0,0,0,0,0,0,0,0,0,0,0,0,0,0,0,0,0,0,0,0,0,0,0,0,0,0]
[null,null,"> 66 kV & < = 132 kV ;  Oil Filled Reactors",0,0,0,0,0,0,0,0,0,0,0,0,0,0,0,0,0,0,0,0,0,0,0,0,0,0,0,0,0,0,0,0,0,0,0,0,0,0,0,0,0,0,0,0,0,0,0,0,0,0,0,0,0,0,0,0,0,0,0,0,0,0,0,0,0,0,0,0,0,0,0,0,0,0,0,0,0,0,0,0,0,0,0,0,0,0,0,0,0,0,0,0,0,0,0,0,0,0,0,0,0,0,0,0,0,0,0,0,0,0,0]
[null,null,"> 132 kV & < = 275 kV ;  Oil Filled Reactors",40,6.3,0,0,1,0,2,0,0,1,0,2,1,0,0,0,0,1,0,0,0,5,0,0,1,0,0,0,0,0,0,0,0,0,0,2,0,0,0,0,0,0,1,0,0,0,0,0,0,0,0,0,0,0,0,0,0,0,0,0,0,0,0,0,0,0,0,0,0,0,0,0,0,0,0,0,0,0,0,0,0,0,0,0,0,0,0,0,0,0,0,0,0,0,0,0,0,0,0,0,0,0,0,0,0,0,0,0,0,0,0]
[null,null,"> 275 kV & < = 330 kV ;  Oil Filled Reactors",40,6.3,0,0,0,0,0,0,0,0,0,0,0,0,0,0,0,0,0,4,0,0,0,0,0,0,0,0,0,0,0,0,0,0,0,0,0,0,0,0,0,0,0,0,0,0,0,0,0,0,0,0,0,0,0,0,0,0,0,0,0,0,0,0,0,0,0,0,0,0,0,0,0,0,0,0,0,0,0,0,0,0,0,0,0,0,0,0,0,0,0,0,0,0,0,0,0,0,0,0,0,0,0,0,0,0,0,0,0,0,0]
[null,null,"> 330 kV & < = 500 kV  ;  Oil Filled Reactors",0,0,0,0,0,0,0,0,0,0,0,0,0,0,0,0,0,0,0,0,0,0,0,0,0,0,0,0,0,0,0,0,0,0,0,0,0,0,0,0,0,0,0,0,0,0,0,0,0,0,0,0,0,0,0,0,0,0,0,0,0,0,0,0,0,0,0,0,0,0,0,0,0,0,0,0,0,0,0,0,0,0,0,0,0,0,0,0,0,0,0,0,0,0,0,0,0,0,0,0,0,0,0,0,0,0,0,0,0,0,0]
[null,null,"> 500 kV  ;  Oil Filled Reactors",0,0,0,0,0,0,0,0,0,0,0,0,0,0,0,0,0,0,0,0,0,0,0,0,0,0,0,0,0,0,0,0,0,0,0,0,0,0,0,0,0,0,0,0,0,0,0,0,0,0,0,0,0,0,0,0,0,0,0,0,0,0,0,0,0,0,0,0,0,0,0,0,0,0,0,0,0,0,0,0,0,0,0,0,0,0,0,0,0,0,0,0,0,0,0,0,0,0,0,0,0,0,0,0,0,0,0,0,0,0,0]
[null,null,"Other"]
[null,"SCADA, NETWORK CONTROL AND PROTECTION SYSTEMS BY:\nFunction","Communications Network Assets"]
[null,null,"Master Station Assets"]
[null,null,"Control equipment / systems"]
[null,null,"Infrastructure: protection and control"]
[null,null,"Metering systems",15,3.9,29,15,6,6,30,33,22,21,75,57,21,22,44,27,12,24,14,4,71,12,14,2,13,0,9,0,4,0,1,0,0,0,5,0,1,0,0,0,0,2,0,0,0,0,0,0,0,0,0,0,0,0,0,0,0,0,0,0,0,0,0,0,0,0,0,0,0,0,0,0,0,0,0,0,0,0,0,0,0,0,0,0,0,0,0,0,0,0,0,0,0,0,0,0,0,0,0,0,0,0,0,0,0,0,0,0,0,0,0]
[null,null,"OPGW",50,7.1,7.0775999999999986,0.34279999999999999,20.16211449612403,38.33383000000002,333.20231999999987,541.2143500000011,237.04715027522974,539.47482587963077,563.68353293258485,457.05257556886244,449.25106428571394,246.53214571428535,41.514400000000002,220.96223499999985,636.6080505769213,383.03120481481483,143.01882999999975,391.58315499999981,305.81434000000024,320.09231,85.796959999999984,9.2237000000000009,0,16.494000000000003,82.073099999999997,0.7229485714285715,0,0,0,0,0,77.345230275229397,1.8119000000000001,0,0.9023000000000001,0,0,0,0,0,0,3.6667000000000005,0,0.2969,8.6029999999999995E-2,0.36909999999999998,3.8723999999999998,12.818969999999997,0,0,8.5091099999999997,0,0,0,0,0.37990000000000002,0,0,0,0,0,0,0,0,0,0,0,0,0,0,0,0,0,0,0,0,0,0,0,0,0,0,0,0,0,0,0,0,0,0,0,0,0,0,0,0,0,0,0,0,0,0,0,0,0,0,0,0,0]
[null,null,"Protection schemes / systems",15,3.9,144,252,170,225,295,375,361,216,441,467,362,423,215,222,97,285,67,30,45,61,72,30,29,24,14,7,17,30,12,19,31,9,30,7,23,26,7,1,17,9,0,0,1,4,1,2,0,0,0,0,1,0,0,0,0,0,0,0,0,0,0,0,0,0,0,0,0,0,0,0,0,0,0,0,0,0,0,0,0,0,0,0,0,0,0,0,0,0,0,0,0,0,0,0,0,0,0,0,0,0,0,0,0,0,0,0,0,0,0]
[null,null,"Site establishment",40,6.3,0,0,0,0,3,3,3,4,7,10,2,5,2,3,3,9,5,4,3,8,7,0,0,0,2,4,2,1,2,1,3,11,5,5,6,2,10,4,19,6,2,2,1,6,4,0,3,1,1,3,1,3,1,2,4,0,1,0,0,2,2,0,0,0,0,0,0,0,0,0,0,0,0,0,0,0,0,0,0,0,0,0,0,0,0,0,0,0,0,0,0,0,0,0,0,0,0,0,0,0,0,0,0,0,0,0,0,0,0]
[null,null,"Station SCADA and control systems",15,3.9,163,177,112,87,158,279,207,124,282,296,297,344,174,151,74,233,68,97,62,56,55,19,68,2,14,43,9,17,9,12,15,76,23,10,20,15,3,0,3,27,8,20,1,4,0,2,0,0,0,0,0,0,0,0,0,0,0,0,0,0,0,0,0,0,0,0,0,0,0,0,0,0,0,0,0,0,0,0,0,0,0,0,0,0,0,0,0,0,0,0,0,0,0,0,0,0,0,0,0,0,0,0,0,0,0,0,0,0,0]
[null,null,"Telecommunications Network / Systems",15,3.9,69,19,72,40,127,129,43,93,92,137,40,58,48,36,48,65,42,13,198,13,11,0,0,0,0,0,0,0,0,0,0,0,0,0,0,0,0,0,0,0,0,0,0,0,0,0,0,0,0,0,0,0,0,0,0,0,0,0,0,0,0,0,0,0,0,0,0,0,0,0,0,0,0,0,0,0,0,0,0,0,0,0,0,0,0,0,0,0,0,0,0,0,0,0,0,0,0,0,0,0,0,0,0,0,0,0,0,0,0]
[null,null,"Total secondary systems"]
[null,null,"Other"]
[null,"OTHER BY: \nTNSP defined","Buildings",24,4.9000000000000004,5,8,4,4,13,25,17,7,16,36,14,20,11,7,8,15,5,11,20,5,2,1,0,2,0,3,2,1,1,4,3,4,3,8,1,5,4,3,12,3,4,1,2,3,3,2,2,2,0,1,2,2,2,1,3,1,0,0,0,0,5,2,0,0,0,0,0,0,0,0,0,0,0,0,0,0,0,0,0,0,0,0,0,0,0,0,0,0,0,0,0,0,0,0,0,0,0,0,0,0,0,0,0,0,0,0,0,0,0]

{"sheet":"5.3 MD - Network level","index":15,"n_rows":15,"n_cols":4,"rows_kept":15,"cut":false,"hidden":false,"merged":[]}
[null,"REGULATORY REPORTING STATEMENT"]
[null,{"$f":"INDEX(dms_TradingNameFull_List,MATCH(dms_TradingName,dms_TradingName_List))","v":"Queensland Electricity Transmission Corporation Limited trading as Powerlink Queensland"}]
[null,{"$f":"CONCATENATE((LOOKUP(dms_Model,dms_Model_List,dms_Worksheet_List))&\" \"&CRY)","v":"CATEGORY ANALYSIS 2017-18"}]
[null,"5.3 MAXIMUM DEMAND AT NETWORK LEVEL"]
[]
[]
[null,"5.3.1 - RAW AND WEATHER CORRECTED COINCIDENT MD AT NETWORK LEVEL \n(Summed at transmission connection point)"]
[null,null,"UNIT",{"$f":"CRY","v":"2017-18"}]
[null,"Raw network coincident MD","MW",8788.5806080000002]
[null,"Date MD occurred",null,"2018-02-14"]
[null,"Half hour time period MD occurred",null,"17:00:00"]
[null,"Winter/summer peaking",null,"SUMMER"]
[null,"Embedded generation","MW",347.65]
[null,"Weather corrected (10% POE) network coincident MD","MW",9176.6137561281994]
[null,"Weather corrected (50% POE) network coincident MD","MW",8523.5680126136031]

{"sheet":"5.4 MD & utilisation-Spatial","index":16,"n_rows":4431,"n_cols":6,"rows_kept":4431,"cut":false,"hidden":false,"merged":[[4255,1,4276,1],[4277,1,4298,1],[4299,1,4320,1],[4321,1,4342,1],[4343,1,4364,1],[4365,1,4386,1],[4387,1,4408,1],[4409,1,4430,1],[3881,1,3902,1],[3903,1,3924,1],[3925,1,3946,1],[3947,1,3968,1],[3969,1,3990,1],[3991,1,4012,1],[4013,1,4034,1],[4035,1,4056,1],[4057,1,4078,1],[4079,1,4100,1],[4101,1,4122,1],[4123,1,4144,1],[4145,1,4166,1],[4167,1,4188,1],[4189,1,4210,1],[4211,1,4232,1],[4233,1,4254,1],[3507,1,3528,1],[3529,1,3550,1],[3551,1,3572,1],[3573,1,3594,1],[3595,1,3616,1],[3617,1,3638,1],[3639,1,3660,1],[3661,1,3682,1],[3683,1,3704,1],[3705,1,3726,1],[3727,1,3748,1],[3749,1,3770,1],[3771,1,3792,1],[3793,1,3814,1],[3815,1,3836,1],[3837,1,3858,1],[3859,1,3880,1],[3133,1,3154,1],[3155,1,3176,1],[3177,1,3198,1],[3199,1,3220,1],[3221,1,3242,1],[3243,1,3264,1],[3265,1,3286,1],[3287,1,3308,1],[3309,1,3330,1],[3331,1,3352,1],[3353,1,3374,1],[3375,1,3396,1],[3397,1,3418,1],[3419,1,3440,1],[3441,1,3462,1],[3463,1,3484,1],[3485,1,3506,1],[2759,1,2780,1],[2781,1,2802,1],[2803,1,2824,1],[2825,1,2846,1],[2847,1,2868,1],[2869,1,2890,1],[2891,1,2912,1],[2913,1,2934,1],[2935,1,2956,1],[2957,1,2978,1],[2979,1,3000,1],[3001,1,3022,1],[3023,1,3044,1],[3045,1,3066,1],[3067,1,3088,1],[3089,1,3110,1],[3111,1,3132,1],[2385,1,2406,1],[2407,1,2428,1],[2429,1,2450,1],[2451,1,2472,1],[2473,1,2494,1],[2495,1,2516,1],[2517,1,2538,1],[2539,1,2560,1],[2561,1,2582,1],[2583,1,2604,1],[2605,1,2626,1],[2627,1,2648,1],[2649,1,2670,1],[2671,1,2692,1],[2693,1,2714,1],[2715,1,2736,1],[2737,1,2758,1],[2011,1,2032,1],[2033,1,2054,1],[2055,1,2076,1],[2077,1,2098,1],[2099,1,2120,1],[2121,1,2142,1],[2143,1,2164,1],[2165,1,2186,1],[2187,1,2208,1],[2209,1,2230,1],[2231,1,2252,1],[2253,1,2274,1],[2275,1,2296,1],[2297,1,2318,1],[2319,1,2340,1],[2341,1,2362,1],[2363,1,2384,1],[1637,1,1658,1],[1659,1,1680,1],[1681,1,1702,1],[1703,1,1724,1],[1725,1,1746,1],[1747,1,1768,1],[1769,1,1790,1],[1791,1,1812,1],[1813,1,1834,1],[1835,1,1856,1],[1857,1,1878,1],[1879,1,1900,1],[1901,1,1922,1],[1923,1,1944,1],[1945,1,1966,1],[1967,1,1988,1],[1989,1,2010,1],[1263,1,1284,1],[1285,1,1306,1],[1307,1,1328,1],[1329,1,1350,1],[1351,1,1372,1],[1373,1,1394,1],[1395,1,1416,1],[1417,1,1438,1],[1439,1,1460,1],[1461,1,1482,1],[1483,1,1504,1],[1505,1,1526,1],[1527,1,1548,1],[1549,1,1570,1],[1571,1,1592,1],[1593,1,1614,1],[1615,1,1636,1],[889,1,910,1],[911,1,932,1],[933,1,954,1],[955,1,976,1],[977,1,998,1],[999,1,1020,1],[1021,1,1042,1],[1043,1,1064,1],[1065,1,1086,1],[1087,1,1108,1],[1109,1,1130,1],[1131,1,1152,1],[1153,1,1174,1],[1175,1,1196,1],[1197,1,1218,1],[1219,1,1240,1],[1241,1,1262,1],[515,1,536,1],[537,1,558,1],[559,1,580,1],[581,1,602,1],[603,1,624,1],[625,1,646,1],[647,1,668,1],[669,1,690,1],[691,1,712,1],[713,1,734,1],[735,1,756,1],[757,1,778,1],[779,1,800,1],[801,1,822,1],[823,1,844,1],[845,1,866,1],[867,1,888,1],[141,1,162,1],[163,1,184,1],[185,1,206,1],[207,1,228,1],[229,1,250,1],[251,1,272,1],[273,1,294,1],[295,1,316,1],[317,1,338,1],[339,1,360,1],[361,1,382,1],[383,1,404,1],[405,1,426,1],[427,1,448,1],[449,1,470,1],[471,1,492,1],[493,1,514,1],[9,1,30,1],[31,1,52,1],[53,1,74,1],[75,1,96,1],[97,1,118,1],[119,1,140,1],[15,2,16,2],[15,3,16,3],[17,2,18,2],[17,3,18,3],[19,2,20,2],[19,3,20,3],[9,2,10,2],[9,3,10,3],[11,2,12,2],[11,3,12,3],[13,2,14,2],[13,3,14,3],[33,2,34,2],[33,3,34,3],[35,2,36,2],[35,3,36,3],[37,2,38,2],[37,3,38,3],[27,2,28,2],[27,3,28,3],[29,2,30,2],[29,3,30,3],[31,2,32,2],[31,3,32,3],[21,2,22,2],[21,3,22,3],[57,2,58,2],[57,3,58,3],[59,2,60,2],[59,3,60,3],[61,2,62,2],[61,3,62,3],[23,2,24,2],[23,3,24,3],[25,2,26,2],[25,3,26,3],[51,2,52,2],[51,3,52,3],[53,2,54,2],[53,3,54,3],[55,2,56,2],[55,3,56,3],[45,2,46,2],[45,3,46,3],[47,2,48,2],[47,3,48,3],[49,2,50,2],[49,3,50,3],[39,2,40,2],[39,3,40,3],[41,2,42,2],[41,3,42,3],[43,2,44,2],[43,3,44,3],[75,2,76,2],[75,3,76,3],[77,2,78,2],[77,3,78,3],[79,2,80,2],[79,3,80,3],[69,2,70,2],[69,3,70,3],[71,2,72,2],[71,3,72,3],[73,2,74,2],[73,3,74,3],[63,2,64,2],[63,3,64,3],[65,2,66,2],[65,3,66,3],[67,2,68,2],[67,3,68,3],[93,2,94,2],[93,3,94,3],[95,2,96,2],[95,3,96,3],[97,2,98,2],[97,3,98,3],[87,2,88,2],[87,3,88,3],[89,2,90,2],[89,3,90,3],[91,2,92,2],[91,3,92,3],[81,2,82,2],[81,3,82,3],[83,2,84,2],[83,3,84,3],[85,2,86,2],[85,3,86,3],[111,2,112,2],[111,3,112,3],[113,2,114,2],[113,3,114,3],[115,2,116,2],[115,3,116,3],[105,2,106,2],[105,3,106,3],[107,2,108,2],[107,3,108,3],[109,2,110,2],[109,3,110,3],[99,2,100,2],[99,3,100,3],[101,2,102,2],[101,3,102,3],[103,2,104,2],[103,3,104,3],[129,2,130,2],[129,3,130,3],[131,2,132,2],[131,3,132,3],[133,2,134,2],[133,3,134,3],[123,2,124,2],[123,3,124,3],[125,2,126,2],[125,3,126,3],[127,2,128,2],[127,3,128,3],[117,2,118,2],[117,3,118,3],[119,2,120,2],[119,3,120,3],[121,2,122,2],[121,3,122,3],[147,2,148,2],[147,3,148,3],[149,2,150,2],[149,3,150,3],[151,2,152,2],[151,3,152,3],[141,2,142,2],[141,3,142,3],[143,2,144,2],[143,3,144,3],[145,2,146,2],[145,3,146,3],[135,2,136,2],[135,3,136,3],[137,2,138,2],[137,3,138,3],[139,2,140,2],[139,3,140,3],[165,2,166,2],[165,3,166,3],[167,2,168,2],[167,3,168,3],[169,2,170,2],[169,3,170,3],[159,2,160,2],[159,3,160,3],[161,2,162,2],[161,3,162,3],[163,2,164,2],[163,3,164,3],[153,2,154,2],[153,3,154,3],[155,2,156,2],[155,3,156,3],[157,2,158,2],[157,3,158,3],[183,2,184,2],[183,3,184,3],[185,2,186,2],[185,3,186,3],[187,2,188,2],[187,3,188,3],[177,2,178,2],[177,3,178,3],[179,2,180,2],[179,3,180,3],[181,2,182,2],[181,3,182,3],[171,2,172,2],[171,3,172,3],[173,2,174,2],[173,3,174,3],[175,2,176,2],[175,3,176,3],[201,2,202,2],[201,3,202,3],[203,2,204,2],[203,3,204,3],[205,2,206,2],[205,3,206,3],[195,2,196,2],[195,3,196,3],[197,2,198,2],[197,3,198,3],[199,2,200,2],[199,3,200,3],[189,2,190,2],[189,3,190,3],[191,2,192,2],[191,3,192,3],[193,2,194,2],[193,3,194,3],[219,2,220,2],[219,3,220,3],[221,2,222,2],[221,3,222,3],[223,2,224,2],[223,3,224,3],[213,2,214,2],[213,3,214,3],[215,2,216,2],[215,3,216,3],[217,2,218,2],[217,3,218,3],[207,2,208,2],[207,3,208,3],[209,2,210,2],[209,3,210,3],[211,2,212,2],[211,3,212,3],[237,2,238,2],[237,3,238,3],[239,2,240,2],[239,3,240,3],[241,2,242,2],[241,3,242,3],[231,2,232,2],[231,3,232,3],[233,2,234,2],[233,3,234,3],[235,2,236,2],[235,3,236,3],[225,2,226,2],[225,3,226,3],[227,2,228,2],[227,3,228,3],[229,2,230,2],[229,3,230,3],[255,2,256,2],[255,3,256,3],[257,2,258,2],[257,3,258,3],[259,2,260,2],[259,3,260,3],[249,2,250,2],[249,3,250,3],[251,2,252,2],[251,3,252,3],[253,2,254,2],[253,3,254,3],[243,2,244,2],[243,3,244,3],[245,2,246,2],[245,3,246,3],[247,2,248,2],[247,3,248,3],[273,2,274,2],[273,3,274,3],[275,2,276,2],[275,3,276,3],[277,2,278,2],[277,3,278,3],[267,2,268,2],[267,3,268,3],[269,2,270,2],[269,3,270,3],[271,2,272,2],[271,3,272,3],[261,2,262,2],[261,3,262,3],[263,2,264,2],[263,3,264,3],[265,2,266,2],[265,3,266,3],[291,2,292,2],[291,3,292,3],[293,2,294,2],[293,3,294,3],[295,2,296,2],[295,3,296,3],[285,2,286,2],[285,3,286,3],[287,2,288,2],[287,3,288,3],[289,2,290,2],[289,3,290,3],[279,2,280,2],[279,3,280,3],[281,2,282,2],[281,3,282,3],[283,2,284,2],[283,3,284,3],[309,2,310,2],[309,3,310,3],[311,2,312,2],[311,3,312,3],[313,2,314,2],[313,3,314,3],[303,2,304,2],[303,3,304,3],[305,2,306,2],[305,3,306,3],[307,2,308,2],[307,3,308,3],[297,2,298,2],[297,3,298,3],[299,2,300,2],[299,3,300,3],[301,2,302,2],[301,3,302,3],[327,2,328,2],[327,3,328,3],[329,2,330,2],[329,3,330,3],[331,2,332,2],[331,3,332,3],[321,2,322,2],[321,3,322,3],[323,2,324,2],[323,3,324,3],[325,2,326,2],[325,3,326,3],[315,2,316,2],[315,3,316,3],[317,2,318,2],[317,3,318,3],[319,2,320,2],[319,3,320,3],[345,2,346,2],[345,3,346,3],[347,2,348,2],[347,3,348,3],[349,2,350,2],[349,3,350,3],[339,2,340,2],[339,3,340,3],[341,2,342,2],[341,3,342,3],[343,2,344,2],[343,3,344,3],[333,2,334,2],[333,3,334,3],[335,2,336,2],[335,3,336,3],[337,2,338,2],[337,3,338,3],[363,2,364,2],[363,3,364,3],[365,2,366,2],[365,3,366,3],[367,2,368,2],[367,3,368,3],[357,2,358,2],[357,3,358,3],[359,2,360,2],[359,3,360,3],[361,2,362,2],[361,3,362,3],[351,2,352,2],[351,3,352,3],[353,2,354,2],[353,3,354,3],[355,2,356,2],[355,3,356,3],[381,2,382,2],[381,3,382,3],[383,2,384,2],[383,3,384,3],[385,2,386,2],[385,3,386,3],[375,2,376,2],[375,3,376,3],[377,2,378,2],[377,3,378,3],[379,2,380,2],[379,3,380,3],[369,2,370,2],[369,3,370,3],[371,2,372,2],[371,3,372,3],[373,2,374,2],[373,3,374,3],[399,2,400,2],[399,3,400,3],[401,2,402,2],[401,3,402,3],[403,2,404,2],[403,3,404,3],[393,2,394,2],[393,3,394,3],[395,2,396,2],[395,3,396,3],[397,2,398,2],[397,3,398,3],[387,2,388,2],[387,3,388,3],[389,2,390,2],[389,3,390,3],[391,2,392,2],[391,3,392,3],[417,2,418,2],[417,3,418,3],[419,2,420,2],[419,3,420,3],[421,2,422,2],[421,3,422,3],[411,2,412,2],[411,3,412,3],[413,2,414,2],[413,3,414,3],[415,2,416,2],[415,3,416,3],[405,2,406,2],[405,3,406,3],[407,2,408,2],[407,3,408,3],[409,2,410,2],[409,3,410,3],[435,2,436,2],[435,3,436,3],[437,2,438,2],[437,3,438,3],[439,2,440,2],[439,3,440,3],[429,2,430,2],[429,3,430,3],[431,2,432,2],[431,3,432,3],[433,2,434,2],[433,3,434,3],[423,2,424,2],[423,3,424,3],[425,2,426,2],[425,3,426,3],[427,2,428,2],[427,3,428,3],[453,2,454,2],[453,3,454,3],[455,2,456,2],[455,3,456,3],[457,2,458,2],[457,3,458,3],[447,2,448,2],[447,3,448,3],[449,2,450,2],[449,3,450,3],[451,2,452,2],[451,3,452,3],[441,2,442,2],[441,3,442,3],[443,2,444,2],[443,3,444,3],[445,2,446,2],[445,3,446,3],[471,2,472,2],[471,3,472,3],[473,2,474,2],[473,3,474,3],[475,2,476,2],[475,3,476,3],[465,2,466,2],[465,3,466,3],[467,2,468,2],[467,3,468,3],[469,2,470,2],[469,3,470,3],[459,2,460,2],[459,3,460,3],[461,2,462,2],[461,3,462,3],[463,2,464,2],[463,3,464,3],[489,2,490,2],[489,3,490,3],[491,2,492,2],[491,3,492,3],[493,2,494,2],[493,3,494,3],[483,2,484,2],[483,3,484,3],[485,2,486,2],[485,3,486,3],[487,2,488,2],[487,3,488,3],[477,2,478,2],[477,3,478,3],[479,2,480,2],[479,3,480,3],[481,2,482,2],[481,3,482,3],[507,2,508,2],[507,3,508,3],[509,2,510,2],[509,3,510,3],[511,2,512,2],[511,3,512,3],[501,2,502,2],[501,3,502,3],[503,2,504,2],[503,3,504,3],[505,2,506,2],[505,3,506,3],[495,2,496,2],[495,3,496,3],[497,2,498,2],[497,3,498,3],[499,2,500,2],[499,3,500,3],[525,2,526,2],[525,3,526,3],[527,2,528,2],[527,3,528,3],[529,2,530,2],[529,3,530,3],[519,2,520,2],[519,3,520,3],[521,2,522,2],[521,3,522,3],[523,2,524,2],[523,3,524,3],[513,2,514,2],[513,3,514,3],[515,2,516,2],[515,3,516,3],[517,2,518,2],[517,3,518,3],[543,2,544,2],[543,3,544,3],[545,2,546,2],[545,3,546,3],[547,2,548,2],[547,3,548,3],[537,2,538,2],[537,3,538,3],[539,2,540,2],[539,3,540,3],[541,2,542,2],[541,3,542,3],[531,2,532,2],[531,3,532,3],[533,2,534,2],[533,3,534,3],[535,2,536,2],[535,3,536,3],[561,2,562,2],[561,3,562,3],[563,2,564,2],[563,3,564,3],[565,2,566,2],[565,3,566,3],[555,2,556,2],[555,3,556,3],[557,2,558,2],[557,3,558,3],[559,2,560,2],[559,3,560,3],[549,2,550,2],[549,3,550,3],[551,2,552,2],[551,3,552,3],[553,2,554,2],[553,3,554,3],[579,2,580,2],[579,3,580,3],[581,2,582,2],[581,3,582,3],[583,2,584,2],[583,3,584,3],[573,2,574,2],[573,3,574,3],[575,2,576,2],[575,3,576,3],[577,2,578,2],[577,3,578,3],[567,2,568,2],[567,3,568,3],[569,2,570,2],[569,3,570,3],[571,2,572,2],[571,3,572,3],[597,2,598,2],[597,3,598,3],[599,2,600,2],[599,3,600,3],[601,2,602,2],[601,3,602,3],[591,2,592,2],[591,3,592,3],[593,2,594,2],[593,3,594,3],[595,2,596,2],[595,3,596,3],[585,2,586,2],[585,3,586,3],[587,2,588,2],[587,3,588,3],[589,2,590,2],[589,3,590,3],[615,2,616,2],[615,3,616,3],[617,2,618,2],[617,3,618,3],[619,2,620,2],[619,3,620,3],[609,2,610,2],[609,3,610,3],[611,2,612,2],[611,3,612,3],[613,2,614,2],[613,3,614,3],[603,2,604,2],[603,3,604,3],[605,2,606,2],[605,3,606,3],[607,2,608,2],[607,3,608,3],[633,2,634,2],[633,3,634,3],[635,2,636,2],[635,3,636,3],[637,2,638,2],[637,3,638,3],[627,2,628,2],[627,3,628,3],[629,2,630,2],[629,3,630,3],[631,2,632,2],[631,3,632,3],[621,2,622,2],[621,3,622,3],[623,2,624,2],[623,3,624,3],[625,2,626,2],[625,3,626,3],[651,2,652,2],[651,3,652,3],[653,2,654,2],[653,3,654,3],[655,2,656,2],[655,3,656,3],[645,2,646,2],[645,3,646,3],[647,2,648,2],[647,3,648,3],[649,2,650,2],[649,3,650,3],[639,2,640,2],[639,3,640,3],[641,2,642,2],[641,3,642,3],[643,2,644,2],[643,3,644,3],[669,2,670,2],[669,3,670,3],[671,2,672,2],[671,3,672,3],[673,2,674,2],[673,3,674,3],[663,2,664,2],[663,3,664,3],[665,2,666,2],[665,3,666,3],[667,2,668,2],[667,3,668,3],[657,2,658,2],[657,3,658,3],[659,2,660,2],[659,3,660,3],[661,2,662,2],[661,3,662,3],[687,2,688,2],[687,3,688,3],[689,2,690,2],[689,3,690,3],[691,2,692,2],[691,3,692,3],[681,2,682,2],[681,3,682,3],[683,2,684,2],[683,3,684,3],[685,2,686,2],[685,3,686,3],[675,2,676,2],[675,3,676,3],[677,2,678,2],[677,3,678,3],[679,2,680,2],[679,3,680,3],[705,2,706,2],[705,3,706,3],[707,2,708,2],[707,3,708,3],[709,2,710,2],[709,3,710,3],[699,2,700,2],[699,3,700,3],[701,2,702,2],[701,3,702,3],[703,2,704,2],[703,3,704,3],[693,2,694,2],[693,3,694,3],[695,2,696,2],[695,3,696,3],[697,2,698,2],[697,3,698,3],[723,2,724,2],[723,3,724,3],[725,2,726,2],[725,3,726,3],[727,2,728,2],[727,3,728,3],[717,2,718,2],[717,3,718,3],[719,2,720,2],[719,3,720,3],[721,2,722,2],[721,3,722,3],[711,2,712,2],[711,3,712,3],[713,2,714,2],[713,3,714,3],[715,2,716,2],[715,3,716,3],[741,2,742,2],[741,3,742,3],[743,2,744,2],[743,3,744,3],[745,2,746,2],[745,3,746,3],[735,2,736,2],[735,3,736,3],[737,2,738,2],[737,3,738,3],[739,2,740,2],[739,3,740,3],[729,2,730,2],[729,3,730,3],[731,2,732,2],[731,3,732,3],[733,2,734,2],[733,3,734,3],[759,2,760,2],[759,3,760,3],[761,2,762,2],[761,3,762,3],[763,2,764,2],[763,3,764,3],[753,2,754,2],[753,3,754,3],[755,2,756,2],[755,3,756,3],[757,2,758,2],[757,3,758,3],[747,2,748,2],[747,3,748,3],[749,2,750,2],[749,3,750,3],[751,2,752,2],[751,3,752,3],[777,2,778,2],[777,3,778,3],[779,2,780,2],[779,3,780,3],[781,2,782,2],[781,3,782,3],[771,2,772,2],[771,3,772,3],[773,2,774,2],[773,3,774,3],[775,2,776,2],[775,3,776,3],[765,2,766,2],[765,3,766,3],[767,2,768,2],[767,3,768,3],[769,2,770,2],[769,3,770,3],[795,2,796,2],[795,3,796,3],[797,2,798,2],[797,3,798,3],[799,2,800,2],[799,3,800,3],[789,2,790,2],[789,3,790,3],[791,2,792,2],[791,3,792,3],[793,2,794,2],[793,3,794,3],[783,2,784,2],[783,3,784,3],[785,2,786,2],[785,3,786,3],[787,2,788,2],[787,3,788,3],[813,2,814,2],[813,3,814,3],[815,2,816,2],[815,3,816,3],[817,2,818,2],[817,3,818,3],[807,2,808,2]],"merged_total":4624,"flags":["merged_cut"]}
[null,"REGULATORY REPORTING STATEMENT"]
[null,{"$f":"INDEX(dms_TradingNameFull_List,MATCH(dms_TradingName,dms_TradingName_List))","v":"Queensland Electricity Transmission Corporation Limited trading as Powerlink Queensland"}]
[null,{"$f":"CONCATENATE((LOOKUP(dms_Model,dms_Model_List,dms_Worksheet_List))&\" \"&CRY)","v":"CATEGORY ANALYSIS 2017-18"}]
[null,"5.4 MAXIMUM DEMAND AND UTILISATION AT SPATIAL LEVEL"]
[]
[null,"There is ONE table on this worksheet. It has been sub-grouped into blocks of approximately 1000 rows for ease of navigation. See the Instructions sheet on how to group or ungroup data."]
[]
[null,"TABLE 5.4.1 NON-COINCIDENT & COINCIDENT MAXIMUM DEMAND"]
[null,"CONNECTION POINT","FORECASTING ELEMENTS","UNIT","MAX DEMAND",{"$f":"CRY","v":"2017-18"}]
[null,"Abermain (110)","Connection Point Rating","MVA","Non-Coincident",238.1569860407206]
[null,null,null,null,"Coincident",238.1569860407206]
[null,null,"Raw Adjusted MD","MW","Non-Coincident",59.94605]
[null,null,null,null,"Coincident",58.030625999999998]
[null,null,"Raw Adjusted MD","MVA","Non-Coincident",60.498108000000002]
[null,null,null,null,"Coincident",58.592559000000001]
[null,null,"Date MD occurred",null,"Non-Coincident","2018-02-12"]
[null,null,null,null,"Coincident","2018-02-14"]
[null,null,"Half hour time period MD occurred",null,"Non-Coincident","18:00:00"]
[null,null,null,null,"Coincident","17:00:00"]
[null,null,"Winter/Summer Peaking",null,"Non-Coincident","Summer"]
[null,null,null,null,"Coincident","Summer"]
[null,null,"Adjustments - Embedded generation","MW","Non-Coincident",0]
[null,null,null,null,"Coincident",0]
[null,null,"Weather Corrected MD 10% POE","MW","Non-Coincident",73.20551685219435]
[null,null,null,null,"Coincident",61.092902134019994]
[null,null,"Weather Corrected MD 10% POE","MVA","Non-Coincident",73.879684561699634]
[null,null,null,null,"Coincident",61.68448833843]
[null,null,"Weather Corrected MD 50% POE","MW","Non-Coincident",63.520632832280015]
[null,null,null,null,"Coincident",55.93920223896]
[null,null,"Weather Corrected MD 50% POE","MVA","Non-Coincident",64.105610049630002]
[null,null,null,null,"Coincident",56.480883173640002]
[null,"Abermain (33)","Connection Point Rating","MVA","Non-Coincident",277]
[null,null,null,null,"Coincident",277]
[null,null,"Raw Adjusted MD","MW","Non-Coincident",97.507891999999998]
[null,null,null,null,"Coincident",95.900934000000007]
[null,null,"Raw Adjusted MD","MVA","Non-Coincident",98.501208000000005]
[null,null,null,null,"Coincident",97.034391999999997]
[null,null,"Date MD occurred",null,"Non-Coincident","2018-02-14"]
[null,null,null,null,"Coincident","2018-02-14"]
[null,null,"Half hour time period MD occurred",null,"Non-Coincident","18:00:00"]
[null,null,null,null,"Coincident","17:00:00"]
[null,null,"Winter/Summer Peaking",null,"Non-Coincident","Summer"]
[null,null,null,null,"Coincident","Summer"]
[null,null,"Adjustments - Embedded generation","MW","Non-Coincident",0]
[null,null,null,null,"Coincident",0]
[null,null,"Weather Corrected MD 10% POE","MW","Non-Coincident",114.0111018412837]
[null,null,null,null,"Coincident",100.96162628718001]
[null,null,"Weather Corrected MD 10% POE","MVA","Non-Coincident",115.17253656532202]
[null,null,null,null,"Coincident",102.15489686584]
[null,null,"Weather Corrected MD 50% POE","MW","Non-Coincident",96.574741527460574]
[null,null,null,null,"Coincident",92.44466433864001]
[null,null,"Weather Corrected MD 50% POE","MVA","Non-Coincident",97.558551493889667]
[null,null,null,null,"Coincident",93.537272512320001]
[null,"Algester","Connection Point Rating","MVA","Non-Coincident",202]
[null,null,null,null,"Coincident",202]
[null,null,"Raw Adjusted MD","MW","Non-Coincident",67.157697999999996]
[null,null,null,null,"Coincident",64.229107999999997]
[null,null,"Raw Adjusted MD","MVA","Non-Coincident",68.854634000000004]
[null,null,null,null,"Coincident",65.708285000000004]
[null,null,"Date MD occurred",null,"Non-Coincident","2018-02-15"]
[null,null,null,null,"Coincident","2018-02-14"]
[null,null,"Half hour time period MD occurred",null,"Non-Coincident","16:00:00"]
[null,null,null,null,"Coincident","17:00:00"]
[null,null,"Winter/Summer Peaking",null,"Non-Coincident","Summer"]
[null,null,null,null,"Coincident","Summer"]
[null,null,"Adjustments - Embedded generation","MW","Non-Coincident",0]
[null,null,null,null,"Coincident",0]
[null,null,"Weather Corrected MD 10% POE","MW","Non-Coincident",74.10113261116625]
[null,null,null,null,"Coincident",67.618478029160002]
[null,null,"Weather Corrected MD 10% POE","MVA","Non-Coincident",75.973514829637509]
[null,null,null,null,"Coincident",69.175711199450006]
[null,null,"Weather Corrected MD 50% POE","MW","Non-Coincident",64.717187314928211]
[null,null,null,null,"Coincident",61.914290947680001]
[null,null,"Weather Corrected MD 50% POE","MVA","Non-Coincident",66.352456662210571]
[null,null,null,null,"Coincident",63.340158408600004]
[null,"Ashgrove West (33)","Connection Point Rating","MVA","Non-Coincident",179.10000000000002]
[null,null,null,null,"Coincident",179.10000000000002]
[null,null,"Raw Adjusted MD","MW","Non-Coincident",69.006898000000007]
[null,null,null,null,"Coincident",68.387652000000003]
[null,null,"Raw Adjusted MD","MVA","Non-Coincident",69.835791]
[null,null,null,null,"Coincident",69.306892000000005]
[null,null,"Date MD occurred",null,"Non-Coincident","2018-02-14"]
[null,null,null,null,"Coincident","2018-02-14"]
[null,null,"Half hour time period MD occurred",null,"Non-Coincident","18:00:00"]
[null,null,null,null,"Coincident","17:00:00"]
[null,null,"Winter/Summer Peaking",null,"Non-Coincident","Summer"]
[null,null,null,null,"Coincident","Summer"]
[null,null,"Adjustments - Embedded generation","MW","Non-Coincident",0]
[null,null,null,null,"Coincident",0]
[null,null,"Weather Corrected MD 10% POE","MW","Non-Coincident",81.893935647687982]
[null,null,null,null,"Coincident",71.996468396040001]
[null,null,"Weather Corrected MD 10% POE","MVA","Non-Coincident",82.877624408785721]
[null,null,null,null,"Coincident",72.964216690840004]
[null,null,"Weather Corrected MD 50% POE","MW","Non-Coincident",66.169334383815936]
[null,null,null,null,"Coincident",65.922961021920003]
[null,null,"Weather Corrected MD 50% POE","MVA","Non-Coincident",66.964143304011188]
[null,null,null,null,"Coincident",66.809071612320011]
[null,"Belmont (110)","Connection Point Rating","MVA","Non-Coincident",1636.0394207935576]
[null,null,null,null,"Coincident",1636.0394207935576]
[null,null,"Raw Adjusted MD","MW","Non-Coincident",381.53228999999999]
[null,null,null,null,"Coincident",374.39000199999998]
[null,null,"Raw Adjusted MD","MVA","Non-Coincident",399.015714]
[null,null,null,null,"Coincident",383.81347899999997]
[null,null,"Date MD occurred",null,"Non-Coincident","2018-02-15"]
[null,null,null,null,"Coincident","2018-02-14"]
[null,null,"Half hour time period MD occurred",null,"Non-Coincident","16:00:00"]
[null,null,null,null,"Coincident","17:00:00"]
[null,null,"Winter/Summer Peaking",null,"Non-Coincident","Summer"]
[null,null,null,null,"Coincident","Summer"]
[null,null,"Adjustments - Embedded generation","MW","Non-Coincident",0]
[null,null,null,null,"Coincident",0]
[null,null,"Weather Corrected MD 10% POE","MW","Non-Coincident",409.54259000000002]
[null,null,null,null,"Coincident",394.14656240553995]
[null,null,"Weather Corrected MD 10% POE","MVA","Non-Coincident",428.30956447292908]
[null,null,null,null,"Coincident",404.06731628682996]
[null,null,"Weather Corrected MD 50% POE","MW","Non-Coincident",372.06619000000001]
[null,null,null,null,"Coincident",360.89698632791999]
[null,null,"Weather Corrected MD 50% POE","MVA","Non-Coincident",389.11583724174346]
[null,null,null,null,"Coincident",369.98084121683996]
[null,"Ashgrove West (110)","Connection Point Rating","MVA","Non-Coincident",457.26141319818356]
[null,null,null,null,"Coincident",457.26141319818356]
[null,null,"Raw Adjusted MD","MW","Non-Coincident",109.129988]
[null,null,null,null,"Coincident",97.973476000000005]
[null,null,"Raw Adjusted MD","MVA","Non-Coincident",118.563366]
[null,null,null,null,"Coincident",105.498941]
[null,null,"Date MD occurred",null,"Non-Coincident","2018-02-15"]
[null,null,null,null,"Coincident","2018-02-14"]
[null,null,"Half hour time period MD occurred",null,"Non-Coincident","11:00:00"]
[null,null,null,null,"Coincident","17:00:00"]
[null,null,"Winter/Summer Peaking",null,"Non-Coincident","Summer"]
[null,null,null,null,"Coincident","Summer"]
[null,null,"Adjustments - Embedded generation","MW","Non-Coincident",0]
[null,null,null,null,"Coincident",0]
[null,null,"Weather Corrected MD 10% POE","MW","Non-Coincident",117.63667017974089]
[null,null,null,null,"Coincident",103.14353632852]
[null,null,"Weather Corrected MD 10% POE","MVA","Non-Coincident",127.80537996157304]
[null,null,null,null,"Coincident",111.06612011657]
[null,null,"Weather Corrected MD 50% POE","MW","Non-Coincident",110.32277868934638]
[null,null,null,null,"Coincident",94.442511924960016]
[null,null,"Weather Corrected MD 50% POE","MVA","Non-Coincident",119.85926350401482]
[null,null,null,null,"Coincident",101.69675916636001]
[null,"Bundamba","Connection Point Rating","MVA","Non-Coincident",685.89211979727543]
[null,null,null,null,"Coincident",685.89211979727543]
[null,null,"Raw Adjusted MD","MW","Non-Coincident",34.409314000000002]
[null,null,null,null,"Coincident",34.020609999999998]
[null,null,"Raw Adjusted MD","MVA","Non-Coincident",34.583872]
[null,null,null,null,"Coincident",34.197490999999999]
[null,null,"Date MD occurred",null,"Non-Coincident","2018-02-14"]
[null,null,null,null,"Coincident","2018-02-14"]
[null,null,"Half hour time period MD occurred",null,"Non-Coincident","18:00:00"]
[null,null,null,null,"Coincident","17:00:00"]
[null,null,"Winter/Summer Peaking",null,"Non-Coincident","Summer"]
[null,null,null,null,"Coincident","Summer"]
[null,null,"Adjustments - Embedded generation","MW","Non-Coincident",0]
[null,null,null,null,"Coincident",0]
[null,null,"Weather Corrected MD 10% POE","MW","Non-Coincident",41.990029879784636]
[null,null,null,null,"Coincident",35.815877589699994]
[null,null,"Weather Corrected MD 10% POE","MVA","Non-Coincident",42.203044752320466]
[null,null,null,null,"Coincident",36.00209260007]
[null,null,"Weather Corrected MD 50% POE","MW","Non-Coincident",35.430238325325725]
[null,null,null,null,"Coincident",32.794507215599999]
[null,null,"Weather Corrected MD 50% POE","MVA","Non-Coincident",35.609975461078918]
[null,null,null,null,"Coincident",32.965013424360002]
[null,"Goodna","Connection Point Rating","MVA","Non-Coincident",218]
[null,null,null,null,"Coincident",218]
[null,null,"Raw Adjusted MD","MW","Non-Coincident",111.30036]
[null,null,null,null,"Coincident",109.182278]
[null,null,"Raw Adjusted MD","MVA","Non-Coincident",111.35224700000001]
[null,null,null,null,"Coincident",109.450445]
[null,null,"Date MD occurred",null,"Non-Coincident","2018-02-14"]
[null,null,null,null,"Coincident","2018-02-14"]
[null,null,"Half hour time period MD occurred",null,"Non-Coincident","16:30:00"]
[null,null,null,null,"Coincident","17:00:00"]
[null,null,"Winter/Summer Peaking",null,"Non-Coincident","Summer"]
[null,null,null,null,"Coincident","Summer"]
[null,null,"Adjustments - Embedded generation","MW","Non-Coincident",0]
[null,null,null,null,"Coincident",0]
[null,null,"Weather Corrected MD 10% POE","MW","Non-Coincident",123.23732351317675]
[null,null,null,null,"Coincident",114.94382681005999]
[null,null,"Weather Corrected MD 10% POE","MVA","Non-Coincident",123.29477539388162]
[null,null,null,null,"Coincident",115.22614498265]
[null,null,"Weather Corrected MD 50% POE","MW","Non-Coincident",108.89404620583488]
[null,null,null,null,"Coincident",105.24734870088]
[null,null,"Weather Corrected MD 50% POE","MVA","Non-Coincident",108.94481140888978]
[null,null,null,null,"Coincident",105.5058509622]
[null,"Loganlea (33)","Connection Point Rating","MVA","Non-Coincident",313.3]
[null,null,null,null,"Coincident",313.3]
[null,null,"Raw Adjusted MD","MW","Non-Coincident",94.311874000000003]
[null,null,null,null,"Coincident",93.606915999999998]
[null,null,"Raw Adjusted MD","MVA","Non-Coincident",94.747749999999996]
[null,null,null,null,"Coincident",93.677978999999993]
[null,null,"Date MD occurred",null,"Non-Coincident","2018-02-15"]
[null,null,null,null,"Coincident","2018-02-14"]
[null,null,"Half hour time period MD occurred",null,"Non-Coincident","16:00:00"]
[null,null,null,null,"Coincident","17:00:00"]
[null,null,"Winter/Summer Peaking",null,"Non-Coincident","Summer"]
[null,null,null,null,"Coincident","Summer"]
[null,null,"Adjustments - Embedded generation","MW","Non-Coincident",0]
[null,null,null,null,"Coincident",0]
[null,null,"Weather Corrected MD 10% POE","MW","Non-Coincident",102.9810218046489]
[null,null,null,null,"Coincident",98.546552957320003]
[null,null,"Weather Corrected MD 10% POE","MVA","Non-Coincident",103.45696352817062]
[null,null,null,null,"Coincident",98.621365951829986]
[null,null,"Weather Corrected MD 50% POE","MW","Non-Coincident",91.354253584062931]
[null,null,null,null,"Coincident",90.233322747360006]
[null,null,"Weather Corrected MD 50% POE","MVA","Non-Coincident",91.776460512484334]
[null,null,null,null,"Coincident",90.301824636839996]
[null,"Molendinar","Connection Point Rating","MVA","Non-Coincident",850.9]
[null,null,null,null,"Coincident",850.9]
[null,null,"Raw Adjusted MD","MW","Non-Coincident",445.38164999999998]
[null,null,null,null,"Coincident",445.38164999999998]
[null,null,"Raw Adjusted MD","MVA","Non-Coincident",447.49927200000002]
[null,null,null,null,"Coincident",447.49927200000002]
[null,null,"Date MD occurred",null,"Non-Coincident","2018-02-14"]
[null,null,null,null,"Coincident","2018-02-14"]
[null,null,"Half hour time period MD occurred",null,"Non-Coincident","17:00:00"]
[null,null,null,null,"Coincident","17:00:00"]
[null,null,"Winter/Summer Peaking",null,"Non-Coincident","Summer"]
[null,null,null,null,"Coincident","Summer"]
[null,null,"Adjustments - Embedded generation","MW","Non-Coincident",0]
[null,null,null,null,"Coincident",0]
[null,null,"Weather Corrected MD 10% POE","MW","Non-Coincident",505.58834026675748]
[null,null,null,null,"Coincident",468.88443967049994]
[null,null,"Weather Corrected MD 10% POE","MVA","Non-Coincident",507.99222240310593]
[null,null,null,null,"Coincident",471.11380858344]
[null,null,"Weather Corrected MD 50% POE","MW","Non-Coincident",445.36383473433676]
[null,null,null,null,"Coincident",429.33009533400002]
[null,null,"Weather Corrected MD 50% POE","MVA","Non-Coincident",447.48137202945838]
[null,null,null,null,"Coincident",431.37139823712005]
[null,"Mudgeeraba (110)","Connection Point Rating","MVA","Non-Coincident",1981.4661238587955]
[null,null,null,null,"Coincident",1981.4661238587955]
[null,null,"Raw Adjusted MD","MW","Non-Coincident",333.38484999999997]
[null,null,null,null,"Coincident",333.38484999999997]
[null,null,"Raw Adjusted MD","MVA","Non-Coincident",352.33285000000001]
[null,null,null,null,"Coincident",352.33285000000001]
[null,null,"Date MD occurred",null,"Non-Coincident","2018-02-14"]
[null,null,null,null,"Coincident","2018-02-14"]
[null,null,"Half hour time period MD occurred",null,"Non-Coincident","17:00:00"]
[null,null,null,null,"Coincident","17:00:00"]
[null,null,"Winter/Summer Peaking",null,"Non-Coincident","Summer"]
[null,null,null,null,"Coincident","Summer"]
[null,null,"Adjustments - Embedded generation","MW","Non-Coincident",0]
[null,null,null,null,"Coincident",0]
[null,null,"Weather Corrected MD 10% POE","MW","Non-Coincident",378.93522259743582]
[null,null,null,null,"Coincident",350.97756853449994]
[null,null,"Weather Corrected MD 10% POE","MVA","Non-Coincident",400.47208786823688]
[null,null,null,null,"Coincident",370.9254544945]
[null,null,"Weather Corrected MD 50% POE","MW","Non-Coincident",329.96432140082669]
[null,null,null,null,"Coincident",321.369660006]
[null,null,"Weather Corrected MD 50% POE","MVA","Non-Coincident",348.71791491865713]
[null,null,null,null,"Coincident",339.63477408599999]
[null,"Mudgeeraba (33)","Connection Point Rating","MVA","Non-Coincident",101]
[null,null,null,null,"Coincident",101]
[null,null,"Raw Adjusted MD","MW","Non-Coincident",21.726192000000001]
[null,null,null,null,"Coincident",19.940014000000001]
[null,null,"Raw Adjusted MD","MVA","Non-Coincident",22.640879000000002]
[null,null,null,null,"Coincident",20.813413000000001]
[null,null,"Date MD occurred",null,"Non-Coincident","2018-02-14"]
[null,null,null,null,"Coincident","2018-02-14"]
[null,null,"Half hour time period MD occurred",null,"Non-Coincident","18:30:00"]
[null,null,null,null,"Coincident","17:00:00"]
[null,null,"Winter/Summer Peaking",null,"Non-Coincident","Summer"]
[null,null,null,null,"Coincident","Summer"]
[null,null,"Adjustments - Embedded generation","MW","Non-Coincident",0]
[null,null,null,null,"Coincident",0]
[null,null,"Weather Corrected MD 10% POE","MW","Non-Coincident",24.43979340327073]
[null,null,null,null,"Coincident",20.99224853878]
[null,null,"Weather Corrected MD 10% POE","MVA","Non-Coincident",25.468724810516765]
[null,null,null,null,"Coincident",21.911736804010001]
[null,null,"Weather Corrected MD 50% POE","MW","Non-Coincident",20.720703804490586]
[null,null,null,null,"Coincident",19.221375895440001]
[null,null,"Weather Corrected MD 50% POE","MVA","Non-Coincident",21.593059088878118]
[null,null,null,null,"Coincident",20.063297595480002]
[null,"Murarrie","Connection Point Rating","MVA","Non-Coincident",3216.6092216543989]
[null,null,null,null,"Coincident",3216.6092216543989]
[null,null,"Raw Adjusted MD","MW","Non-Coincident",442.95581600000003]
[null,null,null,null,"Coincident",442.57210199999997]
[null,null,"Raw Adjusted MD","MVA","Non-Coincident",444.103138]
[null,null,null,null,"Coincident",444.954904]
[null,null,"Date MD occurred",null,"Non-Coincident","2018-02-15"]
[null,null,null,null,"Coincident","2018-02-14"]
[null,null,"Half hour time period MD occurred",null,"Non-Coincident","16:00:00"]
[null,null,null,null,"Coincident","17:00:00"]
[null,null,"Winter/Summer Peaking",null,"Non-Coincident","Summer"]
[null,null,null,null,"Coincident","Summer"]
[null,null,"Adjustments - Embedded generation","MW","Non-Coincident",0]
[null,null,null,null,"Coincident",0]
[null,null,"Weather Corrected MD 10% POE","MW","Non-Coincident",492.9566674435813]
[null,null,null,null,"Coincident",465.92663182253995]
[null,null,"Weather Corrected MD 10% POE","MVA","Non-Coincident",494.23349914817891]
[null,null,null,null,"Coincident",468.43517428408001]
[null,null,"Weather Corrected MD 50% POE","MW","Non-Coincident",435.94382513700282]
[null,null,null,null,"Coincident",426.62180344391999]
[null,null,"Weather Corrected MD 50% POE","MVA","Non-Coincident",437.07298502897686]
[null,null,null,null,"Coincident",428.91872925984001]
[null,"Palmwoods","Connection Point Rating","MVA","Non-Coincident",827.00000000000011]
[null,null,null,null,"Coincident",827.00000000000011]
[null,null,"Raw Adjusted MD","MW","Non-Coincident",372.44193999999999]
[null,null,null,null,"Coincident",364.34395599999999]
[null,null,"Raw Adjusted MD","MVA","Non-Coincident",401.67033500000002]
[null,null,null,null,"Coincident",394.93785200000002]
[null,null,"Date MD occurred",null,"Non-Coincident","2018-02-14"]
[null,null,null,null,"Coincident","2018-02-14"]
[null,null,"Half hour time period MD occurred",null,"Non-Coincident","19:00:00"]
[null,null,null,null,"Coincident","17:00:00"]
[null,null,"Winter/Summer Peaking",null,"Non-Coincident","Summer"]
[null,null,null,null,"Coincident","Summer"]
[null,null,"Adjustments - Embedded generation","MW","Non-Coincident",0]
[null,null,null,null,"Coincident",0]
[null,null,"Weather Corrected MD 10% POE","MW","Non-Coincident",388.06587822967566]
[null,null,null,null,"Coincident",383.57038655811999]
[null,null,"Weather Corrected MD 10% POE","MVA","Non-Coincident",418.52040430941543]
[null,null,null,null,"Coincident",415.77872245003999]
[null,null,"Weather Corrected MD 50% POE","MW","Non-Coincident",344.7024664808244]
[null,null,null,null,"Coincident",351.21299982575999]
[null,null,"Weather Corrected MD 50% POE","MVA","Non-Coincident",371.75393079167998]
[null,null,null,null,"Coincident",380.70429181392001]
[null,"Redbank Plains","Connection Point Rating","MVA","Non-Coincident",65.500000000000014]
[null,null,null,null,"Coincident",65.500000000000014]
[null,null,"Raw Adjusted MD","MW","Non-Coincident",23.069597999999999]
[null,null,null,null,"Coincident",22.351796]
[null,null,"Raw Adjusted MD","MVA","Non-Coincident",23.455484999999999]
[null,null,null,null,"Coincident",22.798590999999998]
[null,null,"Date MD occurred",null,"Non-Coincident","2018-02-14"]
[null,null,null,null,"Coincident","2018-02-14"]
[null,null,"Half hour time period MD occurred",null,"Non-Coincident","18:00:00"]
[null,null,null,null,"Coincident","17:00:00"]
[null,null,"Winter/Summer Peaking",null,"Non-Coincident","Summer"]
[null,null,null,null,"Coincident","Summer"]
[null,null,"Adjustments - Embedded generation","MW","Non-Coincident",0]
[null,null,null,null,"Coincident",0]
[null,null,"Weather Corrected MD 10% POE","MW","Non-Coincident",28.533863417637193]
[null,null,null,null,"Coincident",23.53130027492]
[null,null,"Weather Corrected MD 10% POE","MVA","Non-Coincident",29.011151619739447]
[null,null,null,null,"Coincident",24.001672647069999]
[null,null,"Weather Corrected MD 50% POE","MW","Non-Coincident",22.852051688601275]
[null,null,null,null,"Coincident",21.546237272160003]
[null,null,"Weather Corrected MD 50% POE","MVA","Non-Coincident",23.234299774153495]
[null,null,null,null,"Coincident",21.976929780359999]
[null,"Richlands","Connection Point Rating","MVA","Non-Coincident",335.8]
[null,null,null,null,"Coincident",335.8]
[null,null,"Raw Adjusted MD","MW","Non-Coincident",123.536582]
[null,null,null,null,"Coincident",115.11857000000001]
[null,null,"Raw Adjusted MD","MVA","Non-Coincident",123.708939]
[null,null,null,null,"Coincident",116.882113]
[null,null,"Date MD occurred",null,"Non-Coincident","2018-02-15"]
[null,null,null,null,"Coincident","2018-02-14"]
[null,null,"Half hour time period MD occurred",null,"Non-Coincident","15:30:00"]
[null,null,null,null,"Coincident","17:00:00"]
[null,null,"Winter/Summer Peaking",null,"Non-Coincident","Summer"]
[null,null,null,null,"Coincident","Summer"]
[null,null,"Adjustments - Embedded generation","MW","Non-Coincident",0]
[null,null,null,null,"Coincident",0]
[null,null,"Weather Corrected MD 10% POE","MW","Non-Coincident",128.47310363171039]
[null,null,null,null,"Coincident",121.1933769389]
[null,null,"Weather Corrected MD 10% POE","MVA","Non-Coincident",128.65234801717224]
[null,null,null,null,"Coincident",123.04998210301]
[null,null,"Weather Corrected MD 50% POE","MW","Non-Coincident",116.89031403291487]
[null,null,null,null,"Coincident",110.96969673720001]
[null,null,"Weather Corrected MD 50% POE","MVA","Non-Coincident",117.05339822651651]
[null,null,null,null,"Coincident",112.66968164748]
[null,"Runcorn","Connection Point Rating","MVA","Non-Coincident",190.00000000000003]
[null,null,null,null,"Coincident",190.00000000000003]
[null,null,"Raw Adjusted MD","MW","Non-Coincident",62.348916000000003]
[null,null,null,null,"Coincident",59.924554000000001]
[null,null,"Raw Adjusted MD","MVA","Non-Coincident",62.930553000000003]
[null,null,null,null,"Coincident",60.575681000000003]
[null,null,"Date MD occurred",null,"Non-Coincident","2018-02-15"]
[null,null,null,null,"Coincident","2018-02-14"]
[null,null,"Half hour time period MD occurred",null,"Non-Coincident","16:00:00"]
[null,null,null,null,"Coincident","17:00:00"]
[null,null,"Winter/Summer Peaking",null,"Non-Coincident","Summer"]
[null,null,null,null,"Coincident","Summer"]
[null,null,"Adjustments - Embedded generation","MW","Non-Coincident",0]
[null,null,null,null,"Coincident",0]
[null,null,"Weather Corrected MD 10% POE","MW","Non-Coincident",68.353739835057382]
[null,null,null,null,"Coincident",63.08677271458]
[null,null,"Weather Corrected MD 10% POE","MVA","Non-Coincident",68.991394292056171]
[null,null,null,null,"Coincident",63.772259686369999]
[null,null,"Weather Corrected MD 50% POE","MW","Non-Coincident",59.399812331745409]
[null,null,null,null,"Coincident",57.76487307384]
[null,null,"Weather Corrected MD 50% POE","MVA","Non-Coincident",59.953937902191562]
[null,null,null,null,"Coincident",58.392533456760006]
[null,"South Pine","Connection Point Rating","MVA","Non-Coincident",5775.211648693059]
[null,null,null,null,"Coincident",5775.211648693059]
[null,null,"Raw Adjusted MD","MW","Non-Coincident",913.567814]
[null,null,null,null,"Coincident",906.66366600000003]
[null,null,"Raw Adjusted MD","MVA","Non-Coincident",917.35642600000006]
[null,null,null,null,"Coincident",911.39244099999996]
[null,null,"Date MD occurred",null,"Non-Coincident","2018-02-14"]
[null,null,null,null,"Coincident","2018-02-14"]
[null,null,"Half hour time period MD occurred",null,"Non-Coincident","17:30:00"]
[null,null,null,null,"Coincident","17:00:00"]
[null,null,"Winter/Summer Peaking",null,"Non-Coincident","Summer"]
[null,null,null,null,"Coincident","Summer"]
[null,null,"Adjustments - Embedded generation","MW","Non-Coincident",0]
[null,null,null,null,"Coincident",0]
[null,null,"Weather Corrected MD 10% POE","MW","Non-Coincident",955.77464377618071]
[null,null,null,null,"Coincident",954.50830765481999]
[null,null,"Weather Corrected MD 10% POE","MVA","Non-Coincident",959.73828963718324]
[null,null,null,null,"Coincident",959.48662011156989]
[null,null,"Weather Corrected MD 50% POE","MW","Non-Coincident",848.12895516165554]
[null,null,null,null,"Coincident",873.98750747736005]
[null,null,"Weather Corrected MD 50% POE","MVA","Non-Coincident",851.64618889935036]
[null,null,null,null,"Coincident",878.54585742636004]
[null,"Sumner","Connection Point Rating","MVA","Non-Coincident",381.05117766515298]
[null,null,null,null,"Coincident",381.05117766515298]
[null,null,"Raw Adjusted MD","MW","Non-Coincident",35.409216000000001]
[null,null,null,null,"Coincident",33.964976]
[null,null,"Raw Adjusted MD","MVA","Non-Coincident",37.158307000000001]
[null,null,null,null,"Coincident",35.45485]
[null,null,"Date MD occurred",null,"Non-Coincident","2018-02-15"]
[null,null,null,null,"Coincident","2018-02-14"]
[null,null,"Half hour time period MD occurred",null,"Non-Coincident","15:30:00"]
[null,null,null,null,"Coincident","17:00:00"]
[null,null,"Winter/Summer Peaking",null,"Non-Coincident","Summer"]
[null,null,null,null,"Coincident","Summer"]
[null,null,"Adjustments - Embedded generation","MW","Non-Coincident",0]
[null,null,null,null,"Coincident",0]
[null,null,"Weather Corrected MD 10% POE","MW","Non-Coincident",40.878523716304571]
[null,null,null,null,"Coincident",35.757307783519998]
[null,null,"Weather Corrected MD 10% POE","MVA","Non-Coincident",42.897779322683284]
[null,null,null,null,"Coincident",37.325802434499998]
[null,null,"Weather Corrected MD 50% POE","MW","Non-Coincident",34.449272132493391]
[null,null,null,null,"Coincident",32.740878264960003]
[null,null,"Weather Corrected MD 50% POE","MVA","Non-Coincident",36.150945274409182]
[null,null,null,null,"Coincident",34.177057206000001]
[null,"Blackstone","Connection Point Rating","MVA","Non-Coincident",800.20747309682122]
[null,null,null,null,"Coincident",800.20747309682122]
[null,null,"Raw Adjusted MD","MW","Non-Coincident",96.965093999999993]
[null,null,null,null,"Coincident",95.048804000000004]
[null,null,"Raw Adjusted MD","MVA","Non-Coincident",97.602367999999998]
[null,null,null,null,"Coincident",95.567363999999998]
[null,null,"Date MD occurred",null,"Non-Coincident","2018-02-14"]
[null,null,null,null,"Coincident","2018-02-14"]
[null,null,"Half hour time period MD occurred",null,"Non-Coincident","16:30:00"]
[null,null,null,null,"Coincident","17:00:00"]
[null,null,"Winter/Summer Peaking",null,"Non-Coincident","Summer"]
[null,null,null,null,"Coincident","Summer"]
[null,null,"Adjustments - Embedded generation","MW","Non-Coincident",0]
[null,null,null,null,"Coincident",0]
[null,null,"Weather Corrected MD 10% POE","MW","Non-Coincident",113.16602088892691]
[null,null,null,null,"Coincident",100.06452938708]
[null,null,"Weather Corrected MD 10% POE","MVA","Non-Coincident",113.90977062216567]
[null,null,null,null,"Coincident",100.61045379827999]
[null,null,"Weather Corrected MD 50% POE","MW","Non-Coincident",96.219432485550186]
[null,null,null,null,"Coincident",91.623245103840006]
[null,null,"Weather Corrected MD 50% POE","MVA","Non-Coincident",96.851805848874079]
[null,null,null,null,"Coincident",92.123116201439998]
[null,"Tennyson (33)","Connection Point Rating","MVA","Non-Coincident",264.10000000000002]
[null,null,null,null,"Coincident",264.10000000000002]
[null,null,"Raw Adjusted MD","MW","Non-Coincident",174.09934200000001]
[null,null,null,null,"Coincident",169.642538]
[null,null,"Raw Adjusted MD","MVA","Non-Coincident",174.10018099999999]
[null,null,null,null,"Coincident",169.654561]
[null,null,"Date MD occurred",null,"Non-Coincident","2018-02-15"]
[null,null,null,null,"Coincident","2018-02-14"]
[null,null,"Half hour time period MD occurred",null,"Non-Coincident","15:30:00"]
[null,null,null,null,"Coincident","17:00:00"]
[null,null,"Winter/Summer Peaking",null,"Non-Coincident","Summer"]
[null,null,null,null,"Coincident","Summer"]
[null,null,"Adjustments - Embedded generation","MW","Non-Coincident",0]
[null,null,null,null,"Coincident",0]
[null,null,"Weather Corrected MD 10% POE","MW","Non-Coincident",189.48450069747858]
[null,null,null,null,"Coincident",178.59457473026001]
[null,null,"Weather Corrected MD 10% POE","MVA","Non-Coincident",189.48541383990781]
[null,null,null,null,"Coincident",178.60723218397001]
[null,null,"Weather Corrected MD 50% POE","MW","Non-Coincident",163.24598968586341]
[null,null,null,null,"Coincident",163.52862093048]
[null,null,"Weather Corrected MD 50% POE","MVA","Non-Coincident",163.24677638260661]
[null,null,null,null,"Coincident",163.54021062156002]
[null,"Tennyson (110)","Connection Point Rating","MVA","Non-Coincident",301.37718692714611]
[null,null,null,null,"Coincident",301.37718692714611]
[null,null,"Raw Adjusted MD","MW","Non-Coincident"]
[null,null,null,null,"Coincident"]
[null,null,"Raw Adjusted MD","MVA","Non-Coincident"]
[null,null,null,null,"Coincident"]
[null,null,"Date MD occurred",null,"Non-Coincident","2017-12-12"]
[null,null,null,null,"Coincident","2018-02-14"]
[null,null,"Half hour time period MD occurred",null,"Non-Coincident","08:00:00"]
[null,null,null,null,"Coincident","17:00:00"]
[null,null,"Winter/Summer Peaking",null,"Non-Coincident","Summer"]
[null,null,null,null,"Coincident","Summer"]
[null,null,"Adjustments - Embedded generation","MW","Non-Coincident",0]
[null,null,null,null,"Coincident",0]
[null,null,"Weather Corrected MD 10% POE","MW","Non-Coincident"]
[null,null,null,null,"Coincident"]
[null,null,"Weather Corrected MD 10% POE","MVA","Non-Coincident"]
[null,null,null,null,"Coincident"]
[null,null,"Weather Corrected MD 50% POE","MW","Non-Coincident"]
[null,null,null,null,"Coincident"]
[null,null,"Weather Corrected MD 50% POE","MVA","Non-Coincident"]
[null,null,null,null,"Coincident"]
[null,"Belmont (33)","Connection Point Rating","MVA","Non-Coincident",307]
[null,null,null,null,"Coincident",307]
[null,null,"Raw Adjusted MD","MW","Non-Coincident",125.263462]
[null,null,null,null,"Coincident",121.126722]
[null,null,"Raw Adjusted MD","MVA","Non-Coincident",125.837633]
[null,null,null,null,"Coincident",122.114549]
[null,null,"Date MD occurred",null,"Non-Coincident","2018-02-15"]
[null,null,null,null,"Coincident","2018-02-14"]
[null,null,"Half hour time period MD occurred",null,"Non-Coincident","16:00:00"]
[null,null,null,null,"Coincident","17:00:00"]
[null,null,"Winter/Summer Peaking",null,"Non-Coincident","Summer"]
[null,null,null,null,"Coincident","Summer"]
[null,null,"Adjustments - Embedded generation","MW","Non-Coincident",0]
[null,null,null,null,"Coincident",0]
[null,null,"Weather Corrected MD 10% POE","MW","Non-Coincident",141.17693158222403]
[null,null,null,null,"Coincident",127.51857911994]
[null,null,"Weather Corrected MD 10% POE","MVA","Non-Coincident",141.82404526317512]
[null,null,null,null,"Coincident",128.55853375072999]
[null,null,"Weather Corrected MD 50% POE","MW","Non-Coincident",120.37568208911966]
[null,null,null,null,"Coincident",116.76131493912001]
[null,null,"Weather Corrected MD 50% POE","MVA","Non-Coincident",120.92744893842477]
[null,null,null,null,"Coincident",117.71354065404]
[null,"Alan Sherriff","Connection Point Rating","MVA","Non-Coincident",457.26141319818356]
[null,null,null,null,"Coincident",457.26141319818356]
[null,null,"Raw Adjusted MD","MW","Non-Coincident",25.781089999999999]
[null,null,null,null,"Coincident",23.861668000000002]
[null,null,"Raw Adjusted MD","MVA","Non-Coincident",26.811547999999998]
[null,null,null,null,"Coincident",25.249428999999999]
[null,null,"Date MD occurred",null,"Non-Coincident","2018-02-15"]
[null,null,null,null,"Coincident","2018-02-14"]
[null,null,"Half hour time period MD occurred",null,"Non-Coincident","19:00:00"]
[null,null,null,null,"Coincident","17:00:00"]
[null,null,"Winter/Summer Peaking",null,"Non-Coincident","Summer"]
[null,null,null,null,"Coincident","Summer"]
[null,null,"Adjustments - Embedded generation","MW","Non-Coincident",0]
[null,null,null,null,"Coincident",0]
[null,null,"Weather Corrected MD 10% POE","MW","Non-Coincident",26.457841228870823]
[null,null,null,null,"Coincident",25.120848220360003]
[null,null,"Weather Corrected MD 10% POE","MVA","Non-Coincident",27.51534865609829]
[null,null,null,null,"Coincident",26.58184136833]
[null,null,"Weather Corrected MD 50% POE","MW","Non-Coincident",24.069231626738009]
[null,null,null,null,"Coincident",23.001693485280004]
[null,null,"Weather Corrected MD 50% POE","MVA","Non-Coincident",25.031267455464615]
[null,null,null,null,"Coincident",24.33943957884]
[null,"Alligator Creek (33)","Connection Point Rating","MVA","Non-Coincident",250.79999999999998]
[null,null,null,null,"Coincident",250.79999999999998]
[null,null,"Raw Adjusted MD","MW","Non-Coincident",30.363807999999999]
[null,null,null,null,"Coincident",21.196823999999999]
[null,null,"Raw Adjusted MD","MVA","Non-Coincident",30.545380000000002]
[null,null,null,null,"Coincident",21.909164000000001]
[null,null,"Date MD occurred",null,"Non-Coincident","2018-01-05"]
[null,null,null,null,"Coincident","2018-02-14"]
[null,null,"Half hour time period MD occurred",null,"Non-Coincident","01:30:00"]
[null,null,null,null,"Coincident","17:00:00"]
[null,null,"Winter/Summer Peaking",null,"Non-Coincident","Summer"]
[null,null,null,null,"Coincident","Summer"]
[null,null,"Adjustments - Embedded generation","MW","Non-Coincident",0]
[null,null,null,null,"Coincident",0]
[null,null,"Weather Corrected MD 10% POE","MW","Non-Coincident",32.865801648141627]
[null,null,null,null,"Coincident",22.315380402479999]
[null,null,"Weather Corrected MD 10% POE","MVA","Non-Coincident",33.062335275836034]
[null,null,null,null,"Coincident",23.065310584279999]
[null,null,"Weather Corrected MD 50% POE","MW","Non-Coincident",29.869482105301497]
[null,null,null,null,"Coincident",20.43289046304]
[null,null,"Weather Corrected MD 50% POE","MVA","Non-Coincident",30.048098094601123]
[null,null,null,null,"Coincident",21.11955772944]
[null,"Biloela","Connection Point Rating","MVA","Non-Coincident",200]
[null,null,null,null,"Coincident",200]
[null,null,"Raw Adjusted MD","MW","Non-Coincident",35.173732000000001]
[null,null,null,null,"Coincident",29.807943999999999]
[null,null,"Raw Adjusted MD","MVA","Non-Coincident",35.348809000000003]
[null,null,null,null,"Coincident",29.863341999999999]
[null,null,"Date MD occurred",null,"Non-Coincident","2018-01-14"]
[null,null,null,null,"Coincident","2018-02-14"]
[null,null,"Half hour time period MD occurred",null,"Non-Coincident","17:00:00"]
[null,null,null,null,"Coincident","17:00:00"]
[null,null,"Winter/Summer Peaking",null,"Non-Coincident","Summer"]
[null,null,null,null,"Coincident","Summer"]
[null,null,"Adjustments - Embedded generation","MW","Non-Coincident",0]
[null,null,null,null,"Coincident",0]
[null,null,"Weather Corrected MD 10% POE","MW","Non-Coincident",36.32638399400485]
[null,null,null,null,"Coincident",31.380909204879998]
[null,null,"Weather Corrected MD 10% POE","MVA","Non-Coincident",36.507198311078696]
[null,null,null,null,"Coincident",31.43923055734]
[null,null,"Weather Corrected MD 50% POE","MW","Non-Coincident",33.841692583142937]
[null,null,null,null,"Coincident",28.733665698239999]
[null,null,"Weather Corrected MD 50% POE","MVA","Non-Coincident",34.010139366452108]
[null,null,null,null,"Coincident",28.787067154319999]
[null,"Blackwater (66/11)","Connection Point Rating","MVA","Non-Coincident",391.60000000000008]
[null,null,null,null,"Coincident",391.60000000000008]
[null,null,"Raw Adjusted MD","MW","Non-Coincident",99.802341999999996]
[null,null,null,null,"Coincident",72.303790000000006]
[null,null,"Raw Adjusted MD","MVA","Non-Coincident",100.629216]
[null,null,null,null,"Coincident",72.517995999999997]
[null,null,"Date MD occurred",null,"Non-Coincident","2017-07-04"]
[null,null,null,null,"Coincident","2018-02-14"]
[null,null,"Half hour time period MD occurred",null,"Non-Coincident","20:00:00"]
[null,null,null,null,"Coincident","17:00:00"]
[null,null,"Winter/Summer Peaking",null,"Non-Coincident","Winter"]
[null,null,null,null,"Coincident","Summer"]
[null,null,"Adjustments - Embedded generation","MW","Non-Coincident",0]
[null,null,null,null,"Coincident",0]
[null,null,"Weather Corrected MD 10% POE","MW","Non-Coincident",102.0059881]
[null,null,null,null,"Coincident",76.119260998300007]
[null,null,"Weather Corrected MD 10% POE","MVA","Non-Coincident",102.85111956399109]
[null,null,null,null,"Coincident",76.34477064891999]
[null,null,"Weather Corrected MD 50% POE","MW","Non-Coincident",99.802341999999996]
[null,null,null,null,"Coincident",69.697961408400005]
[null,null,"Weather Corrected MD 50% POE","MVA","Non-Coincident",100.629216]
[null,null,null,null,"Coincident",69.904447424159997]
[null,"Bluff (Rail)","Connection Point Rating","MVA","Non-Coincident"]
[null,null,null,null,"Coincident"]
[null,null,"Raw Adjusted MD","MW","Non-Coincident"]
[null,null,null,null,"Coincident"]
[null,null,"Raw Adjusted MD","MVA","Non-Coincident"]
[null,null,null,null,"Coincident"]
[null,null,"Date MD occurred",null,"Non-Coincident","2017-07-24"]
[null,null,null,null,"Coincident","2018-02-14"]
[null,null,"Half hour time period MD occurred",null,"Non-Coincident","08:30:00"]
[null,null,null,null,"Coincident","17:00:00"]
[null,null,"Winter/Summer Peaking",null,"Non-Coincident","Winter"]
[null,null,null,null,"Coincident","Summer"]
[null,null,"Adjustments - Embedded generation","MW","Non-Coincident",0]
[null,null,null,null,"Coincident",0]
[null,null,"Weather Corrected MD 10% POE","MW","Non-Coincident"]
[null,null,null,null,"Coincident"]
[null,null,"Weather Corrected MD 10% POE","MVA","Non-Coincident"]
[null,null,null,null,"Coincident"]
[null,null,"Weather Corrected MD 50% POE","MW","Non-Coincident"]
[null,null,null,null,"Coincident"]
[null,null,"Weather Corrected MD 50% POE","MVA","Non-Coincident"]
[null,null,null,null,"Coincident"]
[null,"Bolingbroke (Rail)","Connection Point Rating","MVA","Non-Coincident",129.19463968501481]
[null,null,null,null,"Coincident",129.19463968501481]
[null,null,"Raw Adjusted MD","MW","Non-Coincident"]
[null,null,null,null,"Coincident"]
[null,null,"Raw Adjusted MD","MVA","Non-Coincident"]
[null,null,null,null,"Coincident"]
[null,null,"Date MD occurred",null,"Non-Coincident","2017-09-10"]
[null,null,null,null,"Coincident","2018-02-14"]
[null,null,"Half hour time period MD occurred",null,"Non-Coincident","04:30:00"]
[null,null,null,null,"Coincident","17:00:00"]
[null,null,"Winter/Summer Peaking",null,"Non-Coincident","Winter"]
[null,null,null,null,"Coincident","Summer"]
[null,null,"Adjustments - Embedded generation","MW","Non-Coincident",0]
[null,null,null,null,"Coincident",0]
[null,null,"Weather Corrected MD 10% POE","MW","Non-Coincident"]
[null,null,null,null,"Coincident"]
[null,null,"Weather Corrected MD 10% POE","MVA","Non-Coincident"]
[null,null,null,null,"Coincident"]
[null,null,"Weather Corrected MD 50% POE","MW","Non-Coincident"]
[null,null,null,null,"Coincident"]
[null,null,"Weather Corrected MD 50% POE","MVA","Non-Coincident"]
[null,null,null,null,"Coincident"]
[null,"Bowen North","Connection Point Rating","MVA","Non-Coincident",134.6]
[null,null,null,null,"Coincident",134.6]
[null,null,"Raw Adjusted MD","MW","Non-Coincident",27.412680000000002]
[null,null,null,null,"Coincident",17.238199999999999]
[null,null,"Raw Adjusted MD","MVA","Non-Coincident",29.598665]
[null,null,null,null,"Coincident",17.253965999999998]
[null,null,"Date MD occurred",null,"Non-Coincident","2018-05-17"]
[null,null,null,null,"Coincident","2018-02-14"]
[null,null,"Half hour time period MD occurred",null,"Non-Coincident","19:30:00"]
[null,null,null,null,"Coincident","17:00:00"]
[null,null,"Winter/Summer Peaking",null,"Non-Coincident","Winter"]
[null,null,null,null,"Coincident","Summer"]
[null,null,"Adjustments - Embedded generation","MW","Non-Coincident",0]
[null,null,null,null,"Coincident",0]
[null,null,"Weather Corrected MD 10% POE","MW","Non-Coincident",29.117768600000002]
[null,null,null,null,"Coincident",18.147859814]
[null,null,"Weather Corrected MD 10% POE","MVA","Non-Coincident",31.439723454216043]
[null,null,null,null,"Coincident",18.164457785819998]
[null,null,"Weather Corrected MD 50% POE","MW","Non-Coincident",27.412680000000002]
[null,null,null,null,"Coincident",16.616935271999999]
[null,null,"Weather Corrected MD 50% POE","MVA","Non-Coincident",29.598665]
[null,null,null,null,"Coincident",16.632133065359998]
[null,"Bulli Creek (132)","Connection Point Rating","MVA","Non-Coincident",110.00000000000001]
[null,null,null,null,"Coincident",110.00000000000001]
[null,null,"Raw Adjusted MD","MW","Non-Coincident",21.562799999999999]
[null,null,null,null,"Coincident",19.565778000000002]
[null,null,"Raw Adjusted MD","MVA","Non-Coincident",21.763933999999999]
[null,null,null,null,"Coincident",19.766607]
[null,null,"Date MD occurred",null,"Non-Coincident","2018-02-13"]
[null,null,null,null,"Coincident","2018-02-14"]
[null,null,"Half hour time period MD occurred",null,"Non-Coincident","19:00:00"]
[null,null,null,null,"Coincident","17:00:00"]
[null,null,"Winter/Summer Peaking",null,"Non-Coincident","Summer"]
[null,null,null,null,"Coincident","Summer"]
[null,null,"Adjustments - Embedded generation","MW","Non-Coincident",0]
[null,null,null,null,"Coincident",0]
[null,null,"Weather Corrected MD 10% POE","MW","Non-Coincident",22.678685262209921]
[null,null,null,null,"Coincident",20.59826410506]
[null,null,"Weather Corrected MD 10% POE","MVA","Non-Coincident",22.89022804336679]
[null,null,null,null,"Coincident",20.809690851390002]
[null,null,"Weather Corrected MD 50% POE","MW","Non-Coincident",20.692732921852915]
[null,null,null,null,"Coincident",18.860627360880002]
[null,null,"Weather Corrected MD 50% POE","MVA","Non-Coincident",20.885751089414825]
[null,null,null,null,"Coincident",19.05421848372]
[null,"Cairns","Connection Point Rating","MVA","Non-Coincident",173.88000000000002]
[null,null,null,null,"Coincident",173.88000000000002]
[null,null,"Raw Adjusted MD","MW","Non-Coincident",58.996608000000002]
[null,null,null,null,"Coincident",52.188111999999997]
[null,null,"Raw Adjusted MD","MVA","Non-Coincident",58.997959999999999]
[null,null,null,null,"Coincident",52.261145999999997]
[null,null,"Date MD occurred",null,"Non-Coincident","2018-02-20"]
[null,null,null,null,"Coincident","2018-02-14"]
[null,null,"Half hour time period MD occurred",null,"Non-Coincident","13:30:00"]
[null,null,null,null,"Coincident","17:00:00"]
[null,null,"Winter/Summer Peaking",null,"Non-Coincident","Summer"]
[null,null,null,null,"Coincident","Summer"]
[null,null,"Adjustments - Embedded generation","MW","Non-Coincident",0]
[null,null,null,null,"Coincident",0]
[null,null,"Weather Corrected MD 10% POE","MW","Non-Coincident",61.659142581586721]
[null,null,null,null,"Coincident",54.942078670239994]
[null,null,"Weather Corrected MD 10% POE","MVA","Non-Coincident",61.660555597751483]
[null,null,null,null,"Coincident",55.018966674419993]
[null,null,"Weather Corrected MD 50% POE","MW","Non-Coincident",58.704572851582427]
[null,null,null,null,"Coincident",50.307252443519999]
[null,null,"Weather Corrected MD 50% POE","MVA","Non-Coincident",58.705918159137994]
[null,null,null,null,"Coincident",50.377654298159996]
[null,"Cairns City","Connection Point Rating","MVA","Non-Coincident",216.71447417114712]
[null,null,null,null,"Coincident",216.71447417114712]
[null,null,"Raw Adjusted MD","MW","Non-Coincident",44.996758]
[null,null,null,null,"Coincident",40.825063999999998]
[null,null,"Raw Adjusted MD","MVA","Non-Coincident",45.109833000000002]
[null,null,null,null,"Coincident",40.841112000000003]
[null,null,"Date MD occurred",null,"Non-Coincident","2018-02-20"]
[null,null,null,null,"Coincident","2018-02-14"]
[null,null,"Half hour time period MD occurred",null,"Non-Coincident","13:30:00"]
[null,null,null,null,"Coincident","17:00:00"]
[null,null,"Winter/Summer Peaking",null,"Non-Coincident","Summer"]
[null,null,null,null,"Coincident","Summer"]
[null,null,"Adjustments - Embedded generation","MW","Non-Coincident",0]
[null,null,null,null,"Coincident",0]
[null,null,"Weather Corrected MD 10% POE","MW","Non-Coincident",48.214943471326116]
[null,null,null,null,"Coincident",42.979402627279995]
[null,null,"Weather Corrected MD 10% POE","MVA","Non-Coincident",48.336105638898729]
[null,null,null,null,"Coincident",42.996297480240003]
[null,null,"Weather Corrected MD 50% POE","MW","Non-Coincident",46.275572713260161]
[null,null,null,null,"Coincident",39.353728693439997]
[null,null,"Weather Corrected MD 50% POE","MVA","Non-Coincident",46.391861321976194]
[null,null,null,null,"Coincident",39.369198323520003]
[null,"Callemondah (Rail)","Connection Point Rating","MVA","Non-Coincident",320.08298923872849]
[null,null,null,null,"Coincident",320.08298923872849]
[null,null,"Raw Adjusted MD","MW","Non-Coincident"]
[null,null,null,null,"Coincident"]
[null,null,"Raw Adjusted MD","MVA","Non-Coincident"]
[null,null,null,null,"Coincident"]
[null,null,"Date MD occurred",null,"Non-Coincident","2018-05-02"]
[null,null,null,null,"Coincident","2018-02-14"]
[null,null,"Half hour time period MD occurred",null,"Non-Coincident","10:30:00"]
[null,null,null,null,"Coincident","17:00:00"]
[null,null,"Winter/Summer Peaking",null,"Non-Coincident","Winter"]
[null,null,null,null,"Coincident","Summer"]
[null,null,"Adjustments - Embedded generation","MW","Non-Coincident",0]
[null,null,null,null,"Coincident",0]
[null,null,"Weather Corrected MD 10% POE","MW","Non-Coincident"]
[null,null,null,null,"Coincident"]
[null,null,"Weather Corrected MD 10% POE","MVA","Non-Coincident"]
[null,null,null,null,"Coincident"]
[null,null,"Weather Corrected MD 50% POE","MW","Non-Coincident"]
[null,null,null,null,"Coincident"]
[null,null,"Weather Corrected MD 50% POE","MVA","Non-Coincident"]
[null,null,null,null,"Coincident"]
[null,"Cardwell","Connection Point Rating","MVA","Non-Coincident",64.7]
[null,null,null,null,"Coincident",64.7]
[null,null,"Raw Adjusted MD","MW","Non-Coincident",5.3503439999999998]
[null,null,null,null,"Coincident",2.4742600000000001]
[null,null,"Raw Adjusted MD","MVA","Non-Coincident",5.6231439999999999]
[null,null,null,null,"Coincident",2.4760759999999999]
[null,null,"Date MD occurred",null,"Non-Coincident","2017-10-30"]
[null,null,null,null,"Coincident","2018-02-14"]
[null,null,"Half hour time period MD occurred",null,"Non-Coincident","18:00:00"]
[null,null,null,null,"Coincident","17:00:00"]
[null,null,"Winter/Summer Peaking",null,"Non-Coincident","Summer"]
[null,null,null,null,"Coincident","Summer"]
[null,null,"Adjustments - Embedded generation","MW","Non-Coincident",0]
[null,null,null,null,"Coincident",0]
[null,null,"Weather Corrected MD 10% POE","MW","Non-Coincident",5.8832039999999992]
[null,null,null,null,"Coincident",2.6048267002000003]
[null,null,"Weather Corrected MD 10% POE","MVA","Non-Coincident",6.1831731330501363]
[null,null,null,null,"Coincident",2.6067385305199999]
[null,null,"Weather Corrected MD 50% POE","MW","Non-Coincident",5.3503439999999998]
[null,null,null,null,"Coincident",2.3850876696000003]
[null,null,"Weather Corrected MD 50% POE","MVA","Non-Coincident",5.6231439999999999]
[null,null,null,null,"Coincident",2.3868382209600001]
[null,"Chinchilla","Connection Point Rating","MVA","Non-Coincident",440.16440895870358]
[null,null,null,null,"Coincident",440.16440895870358]
[null,null,"Raw Adjusted MD","MW","Non-Coincident",23.472359999999998]
[null,null,null,null,"Coincident",22.33154]
[null,null,"Raw Adjusted MD","MVA","Non-Coincident",24.193012]
[null,null,null,null,"Coincident",23.187507]
[null,null,"Date MD occurred",null,"Non-Coincident","2018-02-13"]
[null,null,null,null,"Coincident","2018-02-14"]
[null,null,"Half hour time period MD occurred",null,"Non-Coincident","18:30:00"]
[null,null,null,null,"Coincident","17:00:00"]
[null,null,"Winter/Summer Peaking",null,"Non-Coincident","Summer"]
[null,null,null,null,"Coincident","Summer"]
[null,null,"Adjustments - Embedded generation","MW","Non-Coincident",0]
[null,null,null,null,"Coincident",0]
[null,null,"Weather Corrected MD 10% POE","MW","Non-Coincident",23.076387372479438]
[null,null,null,null,"Coincident",23.509975365799999]
[null,null,"Weather Corrected MD 10% POE","MVA","Non-Coincident",23.784882160082905]
[null,null,null,null,"Coincident",24.411111744389999]
[null,null,"Weather Corrected MD 50% POE","MW","Non-Coincident",21.067184087977406]
[null,null,null,null,"Coincident",21.526711298400002]
[null,null,"Weather Corrected MD 50% POE","MVA","Non-Coincident",21.713992007904039]
[null,null,null,null,"Coincident",22.351829247720001]
[null,"Clare South","Connection Point Rating","MVA","Non-Coincident",416.4]
[null,null,null,null,"Coincident",416.4]
[null,null,"Raw Adjusted MD","MW","Non-Coincident",78.820480000000003]
[null,null,null,null,"Coincident",49.292850000000001]
[null,null,"Raw Adjusted MD","MVA","Non-Coincident",85.494567000000004]
[null,null,null,null,"Coincident",58.407124000000003]
[null,null,"Date MD occurred",null,"Non-Coincident","2018-01-04"]
[null,null,null,null,"Coincident","2018-02-14"]
[null,null,"Half hour time period MD occurred",null,"Non-Coincident","19:30:00"]
[null,null,null,null,"Coincident","17:00:00"]
[null,null,"Winter/Summer Peaking",null,"Non-Coincident","Summer"]
[null,null,null,null,"Coincident","Summer"]
[null,null,"Adjustments - Embedded generation","MW","Non-Coincident",0]
[null,null,null,null,"Coincident",29.34]
[null,null,"Weather Corrected MD 10% POE","MW","Non-Coincident",87.562217599999997]
[null,null,null,null,"Coincident",53.442305494500005]
[null,null,"Weather Corrected MD 10% POE","MVA","Non-Coincident",94.976507111752923]
[null,null,null,null,"Coincident",63.037539733479989]
[null,null,"Weather Corrected MD 50% POE","MW","Non-Coincident",82.848109475176344]
[null,null,null,null,"Coincident",46.458922086000001]
[null,null,"Weather Corrected MD 50% POE","MVA","Non-Coincident",89.863234102974232]
[null,null,null,null,"Coincident",55.244717651040006]
[null,"Collinsville Load","Connection Point Rating","MVA","Non-Coincident",143.00000000000003]
[null,null,null,null,"Coincident",143.00000000000003]
[null,null,"Raw Adjusted MD","MW","Non-Coincident",15.770666]
[null,null,null,null,"Coincident",12.57452]
[null,null,"Raw Adjusted MD","MVA","Non-Coincident",16.279458000000002]
[null,null,null,null,"Coincident",13.449202]
[null,null,"Date MD occurred",null,"Non-Coincident","2018-02-16"]
[null,null,null,null,"Coincident","2018-02-14"]
[null,null,"Half hour time period MD occurred",null,"Non-Coincident","19:00:00"]
[null,null,null,null,"Coincident","17:00:00"]
[null,null,"Winter/Summer Peaking",null,"Non-Coincident","Summer"]
[null,null,null,null,"Coincident","Summer"]
[null,null,"Adjustments - Embedded generation","MW","Non-Coincident",0]
[null,null,null,null,"Coincident",0]
[null,null,"Weather Corrected MD 10% POE","MW","Non-Coincident",16.824168799999999]
[null,null,null,null,"Coincident",13.2380774204]
[null,null,"Weather Corrected MD 10% POE","MVA","Non-Coincident",17.366948825402201]
[null,null,null,null,"Coincident",14.15891638954]
[null,null,"Weather Corrected MD 50% POE","MW","Non-Coincident",15.770666]
[null,null,null,null,"Coincident",12.121334299200001]
[null,null,"Weather Corrected MD 50% POE","MVA","Non-Coincident",16.279458000000002]
[null,null,null,null,"Coincident",12.964492759920001]
[null,"Columboola (Ergon)","Connection Point Rating","MVA","Non-Coincident",857.36514974659428]
[null,null,null,null,"Coincident",857.36514974659428]
[null,null,"Raw Adjusted MD","MW","Non-Coincident",68.984139999999996]
[null,null,null,null,"Coincident",-1.9056599999999999]
[null,null,"Raw Adjusted MD","MVA","Non-Coincident",69.714588000000006]
[null,null,null,null,"Coincident",3.672704]
[null,null,"Date MD occurred",null,"Non-Coincident","2018-01-23"]
[null,null,null,null,"Coincident","2018-02-14"]
[null,null,"Half hour time period MD occurred",null,"Non-Coincident","19:30:00"]
[null,null,null,null,"Coincident","17:00:00"]
[null,null,"Winter/Summer Peaking",null,"Non-Coincident","Summer"]
[null,null,null,null,"Coincident","Summer"]
[null,null,"Adjustments - Embedded generation","MW","Non-Coincident",0]
[null,null,null,null,"Coincident",60.56]
[null,null,"Weather Corrected MD 10% POE","MW","Non-Coincident",68.038545920447774]
[null,null,null,null,"Coincident",1.1895295218000044]
[null,null,"Weather Corrected MD 10% POE","MVA","Non-Coincident",68.75898136822606]
[null,null,null,null,"Coincident",7.0622637900799958]
[null,null,"Weather Corrected MD 50% POE","MW","Non-Coincident",62.372841729781925]
[null,null,null,null,"Coincident",-4.0195624135999921]
[null,null,"Weather Corrected MD 50% POE","MVA","Non-Coincident",63.033285093949928]
[null,null,null,null,"Coincident",1.3577573478399998]
[null,"Coppabella (Rail)","Connection Point Rating","MVA","Non-Coincident",63.669079173715076]
[null,null,null,null,"Coincident",71.591133157373605]
[null,null,"Raw Adjusted MD","MW","Non-Coincident"]
[null,null,null,null,"Coincident"]
[null,null,"Raw Adjusted MD","MVA","Non-Coincident"]
[null,null,null,null,"Coincident"]
[null,null,"Date MD occurred",null,"Non-Coincident","2018-03-10"]
[null,null,null,null,"Coincident","2018-02-14"]
[null,null,"Half hour time period MD occurred",null,"Non-Coincident","11:30:00"]
[null,null,null,null,"Coincident","17:00:00"]
[null,null,"Winter/Summer Peaking",null,"Non-Coincident","Summer"]
[null,null,null,null,"Coincident","Summer"]
[null,null,"Adjustments - Embedded generation","MW","Non-Coincident",0]
[null,null,null,null,"Coincident",0]
[null,null,"Weather Corrected MD 10% POE","MW","Non-Coincident"]
[null,null,null,null,"Coincident"]
[null,null,"Weather Corrected MD 10% POE","MVA","Non-Coincident"]
[null,null,null,null,"Coincident"]
[null,null,"Weather Corrected MD 50% POE","MW","Non-Coincident"]
[null,null,null,null,"Coincident"]
[null,null,"Weather Corrected MD 50% POE","MVA","Non-Coincident"]
[null,null,null,null,"Coincident"]
[null,"Dan Gleeson","Connection Point Rating","MVA","Non-Coincident",211]
[null,null,null,null,"Coincident",211]
[null,null,"Raw Adjusted MD","MW","Non-Coincident",98.407492000000005]
[null,null,null,null,"Coincident",44.80301]
[null,null,"Raw Adjusted MD","MVA","Non-Coincident",98.409108000000003]
[null,null,null,null,"Coincident",45.424774999999997]
[null,null,"Date MD occurred",null,"Non-Coincident","2017-10-31"]
[null,null,null,null,"Coincident","2018-02-14"]
[null,null,"Half hour time period MD occurred",null,"Non-Coincident","19:30:00"]
[null,null,null,null,"Coincident","17:00:00"]
[null,null,"Winter/Summer Peaking",null,"Non-Coincident","Summer"]
[null,null,null,null,"Coincident","Summer"]
[null,null,"Adjustments - Embedded generation","MW","Non-Coincident",0]
[null,null,null,null,"Coincident",24.13]
[null,null,"Weather Corrected MD 10% POE","MW","Non-Coincident",102.71968685660643]
[null,null,null,null,"Coincident",48.440604937700002]
[null,null,"Weather Corrected MD 10% POE","MVA","Non-Coincident",102.7213736693743]
[null,null,null,null,"Coincident",49.095180476750002]
[null,null,"Weather Corrected MD 50% POE","MW","Non-Coincident",95.638319104991311]
[null,null,null,null,"Coincident",42.318664319600003]
[null,null,"Weather Corrected MD 50% POE","MVA","Non-Coincident",95.639889630980065]
[null,null,null,null,"Coincident",42.918020909000006]
[null,"Duaringa (Rail)","Connection Point Rating","MVA","Non-Coincident"]
[null,null,null,null,"Coincident"]
[null,null,"Raw Adjusted MD","MW","Non-Coincident"]
[null,null,null,null,"Coincident"]
[null,null,"Raw Adjusted MD","MVA","Non-Coincident"]
[null,null,null,null,"Coincident"]
[null,null,"Date MD occurred",null,"Non-Coincident","2018-05-03"]
[null,null,null,null,"Coincident","2018-02-14"]
[null,null,"Half hour time period MD occurred",null,"Non-Coincident","16:00:00"]
[null,null,null,null,"Coincident","17:00:00"]
[null,null,"Winter/Summer Peaking",null,"Non-Coincident","Winter"]
[null,null,null,null,"Coincident","Summer"]
[null,null,"Adjustments - Embedded generation","MW","Non-Coincident",0]
[null,null,null,null,"Coincident",0]
[null,null,"Weather Corrected MD 10% POE","MW","Non-Coincident"]
[null,null,null,null,"Coincident"]
[null,null,"Weather Corrected MD 10% POE","MVA","Non-Coincident"]
[null,null,null,null,"Coincident"]
[null,null,"Weather Corrected MD 50% POE","MW","Non-Coincident"]
[null,null,null,null,"Coincident"]
[null,null,"Weather Corrected MD 50% POE","MVA","Non-Coincident"]
[null,null,null,null,"Coincident"]
[null,"Dysart (66/22)","Connection Point Rating","MVA","Non-Coincident",180.00000000000003]
[null,null,null,null,"Coincident",180.00000000000003]
[null,null,"Raw Adjusted MD","MW","Non-Coincident",45.385060000000003]
[null,null,null,null,"Coincident",21.823606000000002]
[null,null,"Raw Adjusted MD","MVA","Non-Coincident",46.266902999999999]
[null,null,null,null,"Coincident",22.548708999999999]
[null,null,"Date MD occurred",null,"Non-Coincident","2017-12-07"]
[null,null,null,null,"Coincident","2018-02-14"]
[null,null,"Half hour time period MD occurred",null,"Non-Coincident","20:00:00"]
[null,null,null,null,"Coincident","17:00:00"]
[null,null,"Winter/Summer Peaking",null,"Non-Coincident","Summer"]
[null,null,null,null,"Coincident","Summer"]
[null,null,"Adjustments - Embedded generation","MW","Non-Coincident",0]
[null,null,null,null,"Coincident",0]
[null,null,"Weather Corrected MD 10% POE","MW","Non-Coincident",49.5681954534626]
[null,null,null,null,"Coincident",22.975237688620002]
[null,null,"Weather Corrected MD 10% POE","MVA","Non-Coincident",50.531317815386714]
[null,null,null,null,"Coincident",23.738604373929999]
[null,null,"Weather Corrected MD 50% POE","MW","Non-Coincident",45.385060000000003]
[null,null,null,null,"Coincident",21.037083239760001]
[null,null,"Weather Corrected MD 50% POE","MVA","Non-Coincident",46.266902999999999]
[null,null,null,null,"Coincident",21.736053527639999]
[null,"Edmonton","Connection Point Rating","MVA","Non-Coincident",140]
[null,null,null,null,"Coincident",140]
[null,null,"Raw Adjusted MD","MW","Non-Coincident",42.521234]
[null,null,null,null,"Coincident",33.840994000000002]
[null,null,"Raw Adjusted MD","MVA","Non-Coincident",42.566406999999998]
[null,null,null,null,"Coincident",33.892207999999997]
[null,null,"Date MD occurred",null,"Non-Coincident","2018-02-15"]
[null,null,null,null,"Coincident","2018-02-14"]
[null,null,"Half hour time period MD occurred",null,"Non-Coincident","20:30:00"]
[null,null,null,null,"Coincident","17:00:00"]
[null,null,"Winter/Summer Peaking",null,"Non-Coincident","Summer"]
[null,null,null,null,"Coincident","Summer"]
[null,null,"Adjustments - Embedded generation","MW","Non-Coincident",0]
[null,null,null,null,"Coincident",0]
[null,null,"Weather Corrected MD 10% POE","MW","Non-Coincident",43.93973458975443]
[null,null,null,null,"Coincident",35.626783253380005]
[null,null,"Weather Corrected MD 10% POE","MVA","Non-Coincident",43.986414552772978]
[null,null,null,null,"Coincident",35.680699816159994]
[null,null,"Weather Corrected MD 50% POE","MW","Non-Coincident",41.561960222157481]
[null,null,null,null,"Coincident",32.621364576240005]
[null,null,"Weather Corrected MD 50% POE","MVA","Non-Coincident",41.606114124866785]
[null,null,null,null,"Coincident",32.670732823679998]
[null,"Egans Hill","Connection Point Rating","MVA","Non-Coincident",90]
[null,null,null,null,"Coincident",90]
[null,null,"Raw Adjusted MD","MW","Non-Coincident",60.956131999999997]
[null,null,null,null,"Coincident",58.298402000000003]
[null,null,"Raw Adjusted MD","MVA","Non-Coincident",61.710450999999999]
[null,null,null,null,"Coincident",58.850335000000001]
[null,null,"Date MD occurred",null,"Non-Coincident","2018-02-12"]
[null,null,null,null,"Coincident","2018-02-14"]
[null,null,"Half hour time period MD occurred",null,"Non-Coincident","19:00:00"]
[null,null,null,null,"Coincident","17:00:00"]
[null,null,"Winter/Summer Peaking",null,"Non-Coincident","Summer"]
[null,null,null,null,"Coincident","Summer"]
[null,null,"Adjustments - Embedded generation","MW","Non-Coincident",0]
[null,null,null,null,"Coincident",0]
[null,null,"Weather Corrected MD 10% POE","MW","Non-Coincident",61.612018558510357]
[null,null,null,null,"Coincident",61.374808673540002]
[null,null,"Weather Corrected MD 10% POE","MVA","Non-Coincident",62.374454013355773]
[null,null,null,null,"Coincident",61.955867177949997]
[null,null,"Weather Corrected MD 50% POE","MW","Non-Coincident",55.900441523642058]
[null,null,null,null,"Coincident",56.197327591920008]
[null,null,"Weather Corrected MD 50% POE","MVA","Non-Coincident",56.592197443287226]
[null,null,null,null,"Coincident",56.729368926600003]
[null,"El Arish","Connection Point Rating","MVA","Non-Coincident",184]
[null,null,null,null,"Coincident",184]
[null,null,"Raw Adjusted MD","MW","Non-Coincident",5.4156899999999997]
[null,null,null,null,"Coincident",3.4554399999999998]
[null,null,"Raw Adjusted MD","MVA","Non-Coincident",5.4344700000000001]
[null,null,null,null,"Coincident",3.4573489999999998]
[null,null,"Date MD occurred",null,"Non-Coincident","2018-01-04"]
[null,null,null,null,"Coincident","2018-02-14"]
[null,null,"Half hour time period MD occurred",null,"Non-Coincident","19:30:00"]
[null,null,null,null,"Coincident","17:00:00"]
[null,null,"Winter/Summer Peaking",null,"Non-Coincident","Summer"]
[null,null,null,null,"Coincident","Summer"]
[null,null,"Adjustments - Embedded generation","MW","Non-Coincident",0]
[null,null,null,null,"Coincident",0]
[null,null,"Weather Corrected MD 10% POE","MW","Non-Coincident",5.9572900080704683]
[null,null,null,null,"Coincident",3.6377835687999998]
[null,null,"Weather Corrected MD 10% POE","MVA","Non-Coincident",5.9779481155972221]
[null,null,null,null,"Coincident",3.6397933067299997]
[null,null,"Weather Corrected MD 50% POE","MW","Non-Coincident",5.5758411213332408]
[null,null,null,null,"Coincident",3.3309059423999998]
[null,null,"Weather Corrected MD 50% POE","MVA","Non-Coincident",5.59517647772525]
[null,null,null,null,"Coincident",3.33274614204]
[null,"Garbutt","Connection Point Rating","MVA","Non-Coincident",142]
[null,null,null,null,"Coincident",142]
[null,null,"Raw Adjusted MD","MW","Non-Coincident",84.194143999999994]
[null,null,null,null,"Coincident",45.167476000000001]
[null,null,"Raw Adjusted MD","MVA","Non-Coincident",84.194328999999996]
[null,null,null,null,"Coincident",45.317571999999998]
[null,null,"Date MD occurred",null,"Non-Coincident","2018-02-16"]
[null,null,null,null,"Coincident","2018-02-14"]
[null,null,"Half hour time period MD occurred",null,"Non-Coincident","17:00:00"]
[null,null,null,null,"Coincident","17:00:00"]
[null,null,"Winter/Summer Peaking",null,"Non-Coincident","Summer"]
[null,null,null,null,"Coincident","Summer"]
[null,null,"Adjustments - Embedded generation","MW","Non-Coincident",0]
[null,null,null,null,"Coincident",21.93]
[null,null,"Weather Corrected MD 10% POE","MW","Non-Coincident",85.920121047674357]
[null,null,null,null,"Coincident",48.708209808520003]
[null,null,"Weather Corrected MD 10% POE","MVA","Non-Coincident",85.920309840167974]
[null,null,null,null,"Coincident",48.866226374439997]
[null,null,"Weather Corrected MD 50% POE","MW","Non-Coincident",80.897948932117458]
[null,null,null,null,"Coincident",42.74928296496001]
[null,null,"Weather Corrected MD 50% POE","MVA","Non-Coincident",80.898126689379922]
[null,null,null,null,"Coincident",42.893969505119991]
[null,"Gin Gin","Connection Point Rating","MVA","Non-Coincident",548.72000000000014]
[null,null,null,null,"Coincident",548.72000000000014]
[null,null,"Raw Adjusted MD","MW","Non-Coincident",173.406488]
[null,null,null,null,"Coincident",163.50805800000001]
[null,null,"Raw Adjusted MD","MVA","Non-Coincident",173.52431300000001]
[null,null,null,null,"Coincident",163.53475700000001]
[null,null,"Date MD occurred",null,"Non-Coincident","2018-02-15"]
[null,null,null,null,"Coincident","2018-02-14"]
[null,null,"Half hour time period MD occurred",null,"Non-Coincident","17:30:00"]
[null,null,null,null,"Coincident","17:00:00"]
[null,null,"Winter/Summer Peaking",null,"Non-Coincident","Summer"]
[null,null,null,null,"Coincident","Summer"]
[null,null,"Adjustments - Embedded generation","MW","Non-Coincident",0]
[null,null,null,null,"Coincident",0]
[null,null,"Weather Corrected MD 10% POE","MW","Non-Coincident",178.70060372829448]
[null,null,null,null,"Coincident",172.13637822065999]
[null,null,"Weather Corrected MD 10% POE","MVA","Non-Coincident",178.82202593617799]
[null,null,null,null,"Coincident",172.16448612689001]
[null,null,"Weather Corrected MD 50% POE","MW","Non-Coincident",168.23722529341103]
[null,null,null,null,"Coincident",157.61522758968002]
[null,null,"Weather Corrected MD 50% POE","MVA","Non-Coincident",168.35153791976558]
[null,null,null,null,"Coincident",157.64096435772001]
[null,"Calliope River (Ergon)","Connection Point Rating","MVA","Non-Coincident",363.12043344894153]
[null,null,null,null,"Coincident",363.12043344894153]
[null,null,"Raw Adjusted MD","MW","Non-Coincident",57.779105999999999]
[null,null,null,null,"Coincident",53.529761999999998]
[null,null,"Raw Adjusted MD","MVA","Non-Coincident",57.803029000000002]
[null,null,null,null,"Coincident",53.581988000000003]
[null,null,"Date MD occurred",null,"Non-Coincident","2018-01-14"]
[null,null,null,null,"Coincident","2018-02-14"]
[null,null,"Half hour time period MD occurred",null,"Non-Coincident","19:30:00"]
[null,null,null,null,"Coincident","17:00:00"]
[null,null,"Winter/Summer Peaking",null,"Non-Coincident","Summer"]
[null,null,null,null,"Coincident","Summer"]
[null,null,"Adjustments - Embedded generation","MW","Non-Coincident",0]
[null,null,null,null,"Coincident",0]
[null,null,"Weather Corrected MD 10% POE","MW","Non-Coincident",62.098086177678169]
[null,null,null,null,"Coincident",56.354527540739994]
[null,null,"Weather Corrected MD 10% POE","MVA","Non-Coincident",62.123797418617563]
[null,null,null,null,"Coincident",56.409509506760003]
[null,null,"Weather Corrected MD 50% POE","MW","Non-Coincident",58.668902595178544]
[null,null,null,null,"Coincident",51.600549377520004]
[null,null,"Weather Corrected MD 50% POE","MVA","Non-Coincident",58.693194008700665]
[null,null,null,null,"Coincident",51.650893152480002]
[null,"Gladstone South (Ergon 66/11)","Connection Point Rating","MVA","Non-Coincident",236.00000000000003]
[null,null,null,null,"Coincident",236.00000000000003]
[null,null,"Raw Adjusted MD","MW","Non-Coincident",44.764622000000003]
[null,null,null,null,"Coincident",25.379483999999998]
[null,null,"Raw Adjusted MD","MVA","Non-Coincident",45.390037999999997]
[null,null,null,null,"Coincident",25.922396999999997]
[null,null,"Date MD occurred",null,"Non-Coincident","2018-03-04"]
[null,null,null,null,"Coincident","2018-02-14"]
[null,null,"Half hour time period MD occurred",null,"Non-Coincident","19:00:00"]
[null,null,null,null,"Coincident","17:00:00"]
[null,null,"Winter/Summer Peaking",null,"Non-Coincident","Summer"]
[null,null,null,null,"Coincident","Summer"]
[null,null,"Adjustments - Embedded generation","MW","Non-Coincident",0]
[null,null,null,null,"Coincident",0]
[null,null,"Weather Corrected MD 10% POE","MW","Non-Coincident",49.320428500000006]
[null,null,null,null,"Coincident",26.718759370679997]
[null,null,"Weather Corrected MD 10% POE","MVA","Non-Coincident",50.00949463599364]
[null,null,null,null,"Coincident",27.290321889689995]
[null,null,"Weather Corrected MD 50% POE","MW","Non-Coincident",44.764622000000003]
[null,null,null,null,"Coincident",24.464807396639998]
[null,null,"Weather Corrected MD 50% POE","MVA","Non-Coincident",45.390037999999997]
[null,null,null,null,"Coincident",24.988153812119997]
[null,"Grantleigh (Rail)","Connection Point Rating","MVA","Non-Coincident",63.669079173715076]
[null,null,null,null,"Coincident",71.591133157373605]
[null,null,"Raw Adjusted MD","MW","Non-Coincident"]
[null,null,null,null,"Coincident"]
[null,null,"Raw Adjusted MD","MVA","Non-Coincident"]
[null,null,null,null,"Coincident"]
[null,null,"Date MD occurred",null,"Non-Coincident","2018-06-01"]
[null,null,null,null,"Coincident","2018-02-14"]
[null,null,"Half hour time period MD occurred",null,"Non-Coincident","18:30:00"]
[null,null,null,null,"Coincident","17:00:00"]
[null,null,"Winter/Summer Peaking",null,"Non-Coincident","Winter"]
[null,null,null,null,"Coincident","Summer"]
[null,null,"Adjustments - Embedded generation","MW","Non-Coincident",0]
[null,null,null,null,"Coincident",0]
[null,null,"Weather Corrected MD 10% POE","MW","Non-Coincident"]
[null,null,null,null,"Coincident"]
[null,null,"Weather Corrected MD 10% POE","MVA","Non-Coincident"]
[null,null,null,null,"Coincident"]
[null,null,"Weather Corrected MD 50% POE","MW","Non-Coincident"]
[null,null,null,null,"Coincident"]
[null,null,"Weather Corrected MD 50% POE","MVA","Non-Coincident"]
[null,null,null,null,"Coincident"]
[null,"Gregory (Rail)","Connection Point Rating","MVA","Non-Coincident",56.974772084493679]
[null,null,null,null,"Coincident",65.820494122812519]
[null,null,"Raw Adjusted MD","MW","Non-Coincident"]
[null,null,null,null,"Coincident"]
[null,null,"Raw Adjusted MD","MVA","Non-Coincident"]
[null,null,null,null,"Coincident"]
[null,null,"Date MD occurred",null,"Non-Coincident","2018-05-11"]
[null,null,null,null,"Coincident","2018-02-14"]
[null,null,"Half hour time period MD occurred",null,"Non-Coincident","09:30:00"]
[null,null,null,null,"Coincident","17:00:00"]
[null,null,"Winter/Summer Peaking",null,"Non-Coincident","Winter"]
[null,null,null,null,"Coincident","Summer"]
[null,null,"Adjustments - Embedded generation","MW","Non-Coincident",0]
[null,null,null,null,"Coincident",0]
[null,null,"Weather Corrected MD 10% POE","MW","Non-Coincident"]
[null,null,null,null,"Coincident"]
[null,null,"Weather Corrected MD 10% POE","MVA","Non-Coincident"]
[null,null,null,null,"Coincident"]
[null,null,"Weather Corrected MD 50% POE","MW","Non-Coincident"]
[null,null,null,null,"Coincident"]
[null,null,"Weather Corrected MD 50% POE","MVA","Non-Coincident"]
[null,null,null,null,"Coincident"]
[null,"Ingham","Connection Point Rating","MVA","Non-Coincident",70]
[null,null,null,null,"Coincident",70]
[null,null,"Raw Adjusted MD","MW","Non-Coincident",18.993344]
[null,null,null,null,"Coincident",16.297840000000001]
[null,null,"Raw Adjusted MD","MVA","Non-Coincident",19.035478999999999]
[null,null,null,null,"Coincident",16.364356999999998]
[null,null,"Date MD occurred",null,"Non-Coincident","2018-02-13"]
[null,null,null,null,"Coincident","2018-02-14"]
[null,null,"Half hour time period MD occurred",null,"Non-Coincident","21:00:00"]
[null,null,null,null,"Coincident","17:00:00"]
[null,null,"Winter/Summer Peaking",null,"Non-Coincident","Summer"]
[null,null,null,null,"Coincident","Summer"]
[null,null,"Adjustments - Embedded generation","MW","Non-Coincident",0]
[null,null,null,null,"Coincident",0]
[null,null,"Weather Corrected MD 10% POE","MW","Non-Coincident",20.256758322279396]
[null,null,null,null,"Coincident",17.157877016800001]
[null,null,"Weather Corrected MD 10% POE","MVA","Non-Coincident",20.301696091632135]
[null,null,null,null,"Coincident",17.227904118889999]
[null,null,"Weather Corrected MD 50% POE","MW","Non-Coincident",18.45850111582266]
[null,null,null,null,"Coincident",15.710465846400002]
[null,null,"Weather Corrected MD 50% POE","MVA","Non-Coincident",18.499449615703206]
[null,null,null,null,"Coincident",15.77458557372]
[null,"Innisfail","Connection Point Rating","MVA","Non-Coincident",100]
[null,null,null,null,"Coincident",100]
[null,null,"Raw Adjusted MD","MW","Non-Coincident",26.209056]
[null,null,null,null,"Coincident",22.744593999999999]
[null,null,"Raw Adjusted MD","MVA","Non-Coincident",26.380552999999999]
[null,null,null,null,"Coincident",23.023795]
[null,null,"Date MD occurred",null,"Non-Coincident","2018-02-15"]
[null,null,null,null,"Coincident","2018-02-14"]
[null,null,"Half hour time period MD occurred",null,"Non-Coincident","20:00:00"]
[null,null,null,null,"Coincident","17:00:00"]
[null,null,"Winter/Summer Peaking",null,"Non-Coincident","Summer"]
[null,null,null,null,"Coincident","Summer"]
[null,null,"Adjustments - Embedded generation","MW","Non-Coincident",0]
[null,null,null,null,"Coincident",0]
[null,null,"Weather Corrected MD 10% POE","MW","Non-Coincident",28.829956039054455]
[null,null,null,null,"Coincident",23.944826225379998]
[null,null,"Weather Corrected MD 10% POE","MVA","Non-Coincident",29.018602702666822]
[null,null,null,null,"Coincident",24.23876066215]
[null,null,"Weather Corrected MD 50% POE","MW","Non-Coincident",27.11745994927934]
[null,null,null,null,"Coincident",21.924878832240001]
[null,null,"Weather Corrected MD 50% POE","MVA","Non-Coincident",27.294901022659531]
[null,null,null,null,"Coincident",22.194017428200002]
[null,"Invicta Load","Connection Point Rating","MVA","Non-Coincident"]
[null,null,null,null,"Coincident"]
[null,null,"Raw Adjusted MD","MW","Non-Coincident"]
[null,null,null,null,"Coincident"]
[null,null,"Raw Adjusted MD","MVA","Non-Coincident"]
[null,null,null,null,"Coincident"]
[null,null,"Date MD occurred",null,"Non-Coincident","2017-11-17"]
[null,null,null,null,"Coincident","2018-02-14"]
[null,null,"Half hour time period MD occurred",null,"Non-Coincident","22:00:00"]
[null,null,null,null,"Coincident","17:00:00"]
[null,null,"Winter/Summer Peaking",null,"Non-Coincident","Summer"]
[null,null,null,null,"Coincident","Summer"]
[null,null,"Adjustments - Embedded generation","MW","Non-Coincident",0]
[null,null,null,null,"Coincident",0]
[null,null,"Weather Corrected MD 10% POE","MW","Non-Coincident"]
[null,null,null,null,"Coincident"]
[null,null,"Weather Corrected MD 10% POE","MVA","Non-Coincident"]
[null,null,null,null,"Coincident"]
[null,null,"Weather Corrected MD 50% POE","MW","Non-Coincident"]
[null,null,null,null,"Coincident"]
[null,null,"Weather Corrected MD 50% POE","MVA","Non-Coincident"]
[null,null,null,null,"Coincident"]
[null,"Kamerunga","Connection Point Rating","MVA","Non-Coincident",100]
[null,null,null,null,"Coincident",100]
[null,null,"Raw Adjusted MD","MW","Non-Coincident",58.827730000000003]
[null,null,null,null,"Coincident",48.320002000000002]
[null,null,"Raw Adjusted MD","MVA","Non-Coincident",58.828364000000001]
[null,null,null,null,"Coincident",48.342790999999998]
[null,null,"Date MD occurred",null,"Non-Coincident","2018-02-15"]
[null,null,null,null,"Coincident","2018-02-14"]
[null,null,"Half hour time period MD occurred",null,"Non-Coincident","19:00:00"]
[null,null,null,null,"Coincident","17:00:00"]
[null,null,"Winter/Summer Peaking",null,"Non-Coincident","Summer"]
[null,null,null,null,"Coincident","Summer"]
[null,null,"Adjustments - Embedded generation","MW","Non-Coincident",0]
[null,null,null,null,"Coincident",0]
[null,null,"Weather Corrected MD 10% POE","MW","Non-Coincident",63.303364351223713]
[null,null,null,null,"Coincident",50.869848505539998]
[null,null,"Weather Corrected MD 10% POE","MVA","Non-Coincident",63.304046586166294]
[null,null,null,null,"Coincident",50.893840081069996]
[null,null,"Weather Corrected MD 50% POE","MW","Non-Coincident",59.577198728888781]
[null,null,null,null,"Coincident",46.578549127920006]
[null,null,"Weather Corrected MD 50% POE","MVA","Non-Coincident",59.577840806085945]
[null,null,null,null,"Coincident",46.600516812359999]
[null,"Kemmis","Connection Point Rating","MVA","Non-Coincident",85]
[null,null,null,null,"Coincident",85]
[null,null,"Raw Adjusted MD","MW","Non-Coincident"]
[null,null,null,null,"Coincident"]
[null,null,"Raw Adjusted MD","MVA","Non-Coincident"]
[null,null,null,null,"Coincident"]
[null,null,"Date MD occurred",null,"Non-Coincident","2017-12-24"]
[null,null,null,null,"Coincident","2018-02-14"]
[null,null,"Half hour time period MD occurred",null,"Non-Coincident","01:30:00"]
[null,null,null,null,"Coincident","17:00:00"]
[null,null,"Winter/Summer Peaking",null,"Non-Coincident","Summer"]
[null,null,null,null,"Coincident","Summer"]
[null,null,"Adjustments - Embedded generation","MW","Non-Coincident",0]
[null,null,null,null,"Coincident",0]
[null,null,"Weather Corrected MD 10% POE","MW","Non-Coincident"]
[null,null,null,null,"Coincident"]
[null,null,"Weather Corrected MD 10% POE","MVA","Non-Coincident"]
[null,null,null,null,"Coincident"]
[null,null,"Weather Corrected MD 50% POE","MW","Non-Coincident"]
[null,null,null,null,"Coincident"]
[null,null,"Weather Corrected MD 50% POE","MVA","Non-Coincident"]
[null,null,null,null,"Coincident"]
[null,"King Creek","Connection Point Rating","MVA","Non-Coincident",153.54380993781808]
[null,null,null,null,"Coincident",153.54380993781808]
[null,null,"Raw Adjusted MD","MW","Non-Coincident"]
[null,null,null,null,"Coincident"]
[null,null,"Raw Adjusted MD","MVA","Non-Coincident"]
[null,null,null,null,"Coincident"]
[null,null,"Date MD occurred",null,"Non-Coincident","2017-08-07"]
[null,null,null,null,"Coincident","2018-02-14"]
[null,null,"Half hour time period MD occurred",null,"Non-Coincident","20:30:00"]
[null,null,null,null,"Coincident","17:00:00"]
[null,null,"Winter/Summer Peaking",null,"Non-Coincident","Winter"]
[null,null,null,null,"Coincident","Summer"]
[null,null,"Adjustments - Embedded generation","MW","Non-Coincident",0]
[null,null,null,null,"Coincident",0]
[null,null,"Weather Corrected MD 10% POE","MW","Non-Coincident"]
[null,null,null,null,"Coincident"]
[null,null,"Weather Corrected MD 10% POE","MVA","Non-Coincident"]
[null,null,null,null,"Coincident"]
[null,null,"Weather Corrected MD 50% POE","MW","Non-Coincident"]
[null,null,null,null,"Coincident"]
[null,null,"Weather Corrected MD 50% POE","MVA","Non-Coincident"]
[null,null,null,null,"Coincident"]
[null,"Lilyvale (132)","Connection Point Rating","MVA","Non-Coincident",182.90456527927344]
[null,null,null,null,"Coincident",182.90456527927344]
[null,null,"Raw Adjusted MD","MW","Non-Coincident",42.69773]
[null,null,null,null,"Coincident",31.94445]
[null,null,"Raw Adjusted MD","MVA","Non-Coincident",43.156779999999998]
[null,null,null,null,"Coincident",33.215358999999999]
[null,null,"Date MD occurred",null,"Non-Coincident","2018-02-13"]
[null,null,null,null,"Coincident","2018-02-14"]
[null,null,"Half hour time period MD occurred",null,"Non-Coincident","19:30:00"]
[null,null,null,null,"Coincident","17:00:00"]
[null,null,"Winter/Summer Peaking",null,"Non-Coincident","Summer"]
[null,null,null,null,"Coincident","Summer"]
[null,null,"Adjustments - Embedded generation","MW","Non-Coincident",0]
[null,null,null,null,"Coincident",3.17]
[null,null,"Weather Corrected MD 10% POE","MW","Non-Coincident",42.293379942914022]
[null,null,null,null,"Coincident",33.797439526499993]
[null,null,"Weather Corrected MD 10% POE","MVA","Non-Coincident",42.748082711955718]
[null,null,null,null,"Coincident",35.135414394430001]
[null,null,"Weather Corrected MD 50% POE","MW","Non-Coincident",39.259687185879351]
[null,null,null,null,"Coincident",30.678925221999997]
[null,null,"Weather Corrected MD 50% POE","MVA","Non-Coincident",39.681774247713264]
[null,null,null,null,"Coincident",31.90403066164]
[null,"Lilyvale (66)","Connection Point Rating","MVA","Non-Coincident",269]
[null,null,null,null,"Coincident",269]
[null,null,"Raw Adjusted MD","MW","Non-Coincident",88.366752000000005]
[null,null,null,null,"Coincident",41.296807999999999]
[null,null,"Raw Adjusted MD","MVA","Non-Coincident",101.58556900000001]
[null,null,null,null,"Coincident",50.88212]
[null,null,"Date MD occurred",null,"Non-Coincident","2017-11-04"]
[null,null,null,null,"Coincident","2018-02-14"]
[null,null,"Half hour time period MD occurred",null,"Non-Coincident","05:00:00"]
[null,null,null,null,"Coincident","17:00:00"]
[null,null,"Winter/Summer Peaking",null,"Non-Coincident","Summer"]
[null,null,null,null,"Coincident","Summer"]
[null,null,"Adjustments - Embedded generation","MW","Non-Coincident",16]
[null,null,null,null,"Coincident",41.03]
[null,null,"Weather Corrected MD 10% POE","MW","Non-Coincident",97.076115999999999]
[null,null,null,null,"Coincident",45.641193658159992]
[null,null,"Weather Corrected MD 10% POE","MVA","Non-Coincident",111.59777016778895]
[null,null,null,null,"Coincident",55.732322572399994]
[null,null,"Weather Corrected MD 50% POE","MW","Non-Coincident",88.366752000000005]
[null,null,null,null,"Coincident",38.329749839680005]
[null,null,"Weather Corrected MD 50% POE","MVA","Non-Coincident",101.58556900000001]
[null,null,null,null,"Coincident",47.569607195200007]
[null,"Mackay","Connection Point Rating","MVA","Non-Coincident",302.3]
[null,null,null,null,"Coincident",302.3]
[null,null,"Raw Adjusted MD","MW","Non-Coincident",89.239304000000004]
[null,null,null,null,"Coincident",85.603412000000006]
[null,null,"Raw Adjusted MD","MVA","Non-Coincident",89.358345]
[null,null,null,null,"Coincident",85.603440000000006]
[null,null,"Date MD occurred",null,"Non-Coincident","2018-02-15"]
[null,null,null,null,"Coincident","2018-02-14"]
[null,null,"Half hour time period MD occurred",null,"Non-Coincident","16:00:00"]
[null,null,null,null,"Coincident","17:00:00"]
[null,null,"Winter/Summer Peaking",null,"Non-Coincident","Summer"]
[null,null,null,null,"Coincident","Summer"]
[null,null,"Adjustments - Embedded generation","MW","Non-Coincident",0]
[null,null,null,null,"Coincident",0]
[null,null,"Weather Corrected MD 10% POE","MW","Non-Coincident",89.719409818909597]
[null,null,null,null,"Coincident",90.120704051240011]
[null,null,"Weather Corrected MD 10% POE","MVA","Non-Coincident",89.839091257306436]
[null,null,null,null,"Coincident",90.120733528800002]
[null,null,"Weather Corrected MD 50% POE","MW","Non-Coincident",84.572104415955494]
[null,null,null,null,"Coincident",82.518265031520002]
[null,null,"Weather Corrected MD 50% POE","MVA","Non-Coincident",84.684919593018947]
[null,null,null,null,"Coincident",82.518292022400004]
[null,"Mindi (Rail)","Connection Point Rating","MVA","Non-Coincident",129.19463968501481]
[null,null,null,null,"Coincident",129.19463968501481]
[null,null,"Raw Adjusted MD","MW","Non-Coincident"]
[null,null,null,null,"Coincident"]
[null,null,"Raw Adjusted MD","MVA","Non-Coincident"]
[null,null,null,null,"Coincident"]
[null,null,"Date MD occurred",null,"Non-Coincident","2017-07-28"]
[null,null,null,null,"Coincident","2018-02-14"]
[null,null,"Half hour time period MD occurred",null,"Non-Coincident","17:30:00"]
[null,null,null,null,"Coincident","17:00:00"]
[null,null,"Winter/Summer Peaking",null,"Non-Coincident","Winter"]
[null,null,null,null,"Coincident","Summer"]
[null,null,"Adjustments - Embedded generation","MW","Non-Coincident",0]
[null,null,null,null,"Coincident",0]
[null,null,"Weather Corrected MD 10% POE","MW","Non-Coincident"]
[null,null,null,null,"Coincident"]
[null,null,"Weather Corrected MD 10% POE","MVA","Non-Coincident"]
[null,null,null,null,"Coincident"]
[null,null,"Weather Corrected MD 50% POE","MW","Non-Coincident"]
[null,null,null,null,"Coincident"]
[null,null,"Weather Corrected MD 50% POE","MVA","Non-Coincident"]
[null,null,null,null,"Coincident"]
[null,"Moranbah (11)","Connection Point Rating","MVA","Non-Coincident",40]
[null,null,null,null,"Coincident",40]
[null,null,"Raw Adjusted MD","MW","Non-Coincident",13.84892]
[null,null,null,null,"Coincident",13.149404000000001]
[null,null,"Raw Adjusted MD","MVA","Non-Coincident",13.904292999999999]
[null,null,null,null,"Coincident",13.241440000000001]
[null,null,"Date MD occurred",null,"Non-Coincident","2018-02-13"]
[null,null,null,null,"Coincident","2018-02-14"]
[null,null,"Half hour time period MD occurred",null,"Non-Coincident","19:00:00"]
[null,null,null,null,"Coincident","17:00:00"]
[null,null,"Winter/Summer Peaking",null,"Non-Coincident","Summer"]
[null,null,null,null,"Coincident","Summer"]
[null,null,"Adjustments - Embedded generation","MW","Non-Coincident",0]
[null,null,null,null,"Coincident",0.38]
[null,null,"Weather Corrected MD 10% POE","MW","Non-Coincident",13.449357356512992]
[null,null,null,null,"Coincident",13.863350649080001]
[null,null,"Weather Corrected MD 10% POE","MVA","Non-Coincident",13.503132760291928]
[null,null,null,null,"Coincident",13.9602433888]
[null,null,"Weather Corrected MD 50% POE","MW","Non-Coincident",12.317144260956049]
[null,null,null,null,"Coincident",12.661804279840002]
[null,null,"Weather Corrected MD 50% POE","MVA","Non-Coincident",12.36639266654738]
[null,null,null,null,"Coincident",12.750523302400001]
[null,"Moranbah (66)","Connection Point Rating","MVA","Non-Coincident",217.2]
[null,null,null,null,"Coincident",219.6]
[null,null,"Raw Adjusted MD","MW","Non-Coincident",78.840258000000006]
[null,null,null,null,"Coincident",5.3173240000000002]
[null,null,"Raw Adjusted MD","MVA","Non-Coincident",87.675037000000003]
[null,null,null,null,"Coincident",18.578685]
[null,null,"Date MD occurred",null,"Non-Coincident","2017-10-19"]
[null,null,null,null,"Coincident","2018-02-14"]
[null,null,"Half hour time period MD occurred",null,"Non-Coincident","14:00:00"]
[null,null,null,null,"Coincident","17:00:00"]
[null,null,"Winter/Summer Peaking",null,"Non-Coincident","Summer"]
[null,null,null,null,"Coincident","Summer"]
[null,null,"Adjustments - Embedded generation","MW","Non-Coincident",0]
[null,null,null,null,"Coincident",54.23]
[null,null,"Weather Corrected MD 10% POE","MW","Non-Coincident",87.65067345695067]
[null,null,null,null,"Coincident",8.4596362874799951]
[null,null,"Weather Corrected MD 10% POE","MVA","Non-Coincident",97.472740873235949]
[null,null,null,null,"Coincident",22.420799307450004]
[null,null,"Weather Corrected MD 50% POE","MW","Non-Coincident",78.840258000000006]
[null,null,null,null,"Coincident",3.1712384430400036]
[null,null,"Weather Corrected MD 50% POE","MVA","Non-Coincident",87.675037000000003]
[null,null,null,null,"Coincident",15.954659992600007]
[null,"Moura (66/11)","Connection Point Rating","MVA","Non-Coincident",165.70000000000002]
[null,null,null,null,"Coincident",165.70000000000002]
[null,null,"Raw Adjusted MD","MW","Non-Coincident",58.216234]
[null,null,null,null,"Coincident",39.083486000000001]
[null,null,"Raw Adjusted MD","MVA","Non-Coincident",60.488263000000003]
[null,null,null,null,"Coincident",41.253498999999998]
[null,null,"Date MD occurred",null,"Non-Coincident","2018-02-18"]
[null,null,null,null,"Coincident","2018-02-14"]
[null,null,"Half hour time period MD occurred",null,"Non-Coincident","14:00:00"]
[null,null,null,null,"Coincident","17:00:00"]
[null,null,"Winter/Summer Peaking",null,"Non-Coincident","Summer"]
[null,null,null,null,"Coincident","Summer"]
[null,null,"Adjustments - Embedded generation","MW","Non-Coincident",0]
[null,null,null,null,"Coincident",0]
[null,null,"Weather Corrected MD 10% POE","MW","Non-Coincident",62.291353999999998]
[null,null,null,null,"Coincident",41.145921556220003]
[null,null,"Weather Corrected MD 10% POE","MVA","Non-Coincident",64.722424390730978]
[null,null,null,null,"Coincident",43.430446142229997]
[null,null,"Weather Corrected MD 50% POE","MW","Non-Coincident",58.216234]
[null,null,null,null,"Coincident",37.67491716456]
[null,null,"Weather Corrected MD 50% POE","MVA","Non-Coincident",60.488263000000003]
[null,null,null,null,"Coincident",39.766722896040001]
[null,"Mt McLaren (Rail)","Connection Point Rating","MVA","Non-Coincident",63.669079173715076]
[null,null,null,null,"Coincident",71.591133157373605]
[null,null,"Raw Adjusted MD","MW","Non-Coincident"]
[null,null,null,null,"Coincident"]
[null,null,"Raw Adjusted MD","MVA","Non-Coincident"]
[null,null,null,null,"Coincident"]
[null,null,"Date MD occurred",null,"Non-Coincident","2018-05-02"]
[null,null,null,null,"Coincident","2018-02-14"]
[null,null,"Half hour time period MD occurred",null,"Non-Coincident","15:30:00"]
[null,null,null,null,"Coincident","17:00:00"]
[null,null,"Winter/Summer Peaking",null,"Non-Coincident","Winter"]
[null,null,null,null,"Coincident","Summer"]
[null,null,"Adjustments - Embedded generation","MW","Non-Coincident",0]
[null,null,null,null,"Coincident",0]
[null,null,"Weather Corrected MD 10% POE","MW","Non-Coincident"]
[null,null,null,null,"Coincident"]
[null,null,"Weather Corrected MD 10% POE","MVA","Non-Coincident"]
[null,null,null,null,"Coincident"]
[null,null,"Weather Corrected MD 50% POE","MW","Non-Coincident"]
[null,null,null,null,"Coincident"]
[null,null,"Weather Corrected MD 50% POE","MVA","Non-Coincident"]
[null,null,null,null,"Coincident"]
[null,"Nebo","Connection Point Rating","MVA","Non-Coincident",10.000000000000002]
[null,null,null,null,"Coincident",10.000000000000002]
[null,null,"Raw Adjusted MD","MW","Non-Coincident",3.1511040000000001]
[null,null,null,null,"Coincident",2.5359120000000002]
[null,null,"Raw Adjusted MD","MVA","Non-Coincident",3.180879]
[null,null,null,null,"Coincident",2.5526460000000002]
[null,null,"Date MD occurred",null,"Non-Coincident","2018-02-14"]
[null,null,null,null,"Coincident","2018-02-14"]
[null,null,"Half hour time period MD occurred",null,"Non-Coincident","19:30:00"]
[null,null,null,null,"Coincident","17:00:00"]
[null,null,"Winter/Summer Peaking",null,"Non-Coincident","Summer"]
[null,null,null,null,"Coincident","Summer"]
[null,null,"Adjustments - Embedded generation","MW","Non-Coincident",0]
[null,null,null,null,"Coincident",0]
[null,null,"Weather Corrected MD 10% POE","MW","Non-Coincident",3.0787255291116389]
[null,null,null,null,"Coincident",2.6697320762400003]
[null,null,"Weather Corrected MD 10% POE","MVA","Non-Coincident",3.1078166199259374]
[null,null,null,null,"Coincident",2.6873491294200003]
[null,null,"Weather Corrected MD 50% POE","MW","Non-Coincident",2.9345042511426809]
[null,null,null,null,"Coincident",2.4445177315200004]
[null,null,"Weather Corrected MD 50% POE","MVA","Non-Coincident",2.9622325851100055]
[null,null,null,null,"Coincident",2.4606486381600003]
[null,"Newlands","Connection Point Rating","MVA","Non-Coincident",152]
[null,null,null,null,"Coincident",152]
[null,null,"Raw Adjusted MD","MW","Non-Coincident",20.320892000000001]
[null,null,null,null,"Coincident",8.5172620000000006]
[null,null,"Raw Adjusted MD","MVA","Non-Coincident",20.320905]
[null,null,null,null,"Coincident",8.9852170000000005]
[null,null,"Date MD occurred",null,"Non-Coincident","2017-12-18"]
[null,null,null,null,"Coincident","2018-02-14"]
[null,null,"Half hour time period MD occurred",null,"Non-Coincident","11:30:00"]
[null,null,null,null,"Coincident","17:00:00"]
[null,null,"Winter/Summer Peaking",null,"Non-Coincident","Summer"]
[null,null,null,null,"Coincident","Summer"]
[null,null,"Adjustments - Embedded generation","MW","Non-Coincident",0]
[null,null,null,null,"Coincident",0]
[null,null,"Weather Corrected MD 10% POE","MW","Non-Coincident",22.064433790552439]
[null,null,null,null,"Coincident",8.9667179157400003]
[null,null,"Weather Corrected MD 10% POE","MVA","Non-Coincident",22.06444790595836]
[null,null,null,null,"Coincident",9.4593669010900001]
[null,null,"Weather Corrected MD 50% POE","MW","Non-Coincident",20.320892000000001]
[null,null,null,null,"Coincident",8.2102998775200007]
[null,null,"Weather Corrected MD 50% POE","MVA","Non-Coincident",20.320905]
[null,null,null,null,"Coincident",8.6613897793200003]
[null,"Norwich Park (Rail)","Connection Point Rating","MVA","Non-Coincident",63.669079173715076]
[null,null,null,null,"Coincident",71.591133157373605]
[null,null,"Raw Adjusted MD","MW","Non-Coincident"]
[null,null,null,null,"Coincident"]
[null,null,"Raw Adjusted MD","MVA","Non-Coincident"]
[null,null,null,null,"Coincident"]
[null,null,"Date MD occurred",null,"Non-Coincident","2018-05-20"]
[null,null,null,null,"Coincident","2018-02-14"]
[null,null,"Half hour time period MD occurred",null,"Non-Coincident","00:30:00"]
[null,null,null,null,"Coincident","17:00:00"]
[null,null,"Winter/Summer Peaking",null,"Non-Coincident","Winter"]
[null,null,null,null,"Coincident","Summer"]
[null,null,"Adjustments - Embedded generation","MW","Non-Coincident",0]
[null,null,null,null,"Coincident",0]
[null,null,"Weather Corrected MD 10% POE","MW","Non-Coincident"]
[null,null,null,null,"Coincident"]
[null,null,"Weather Corrected MD 10% POE","MVA","Non-Coincident"]
[null,null,null,null,"Coincident"]
[null,null,"Weather Corrected MD 50% POE","MW","Non-Coincident"]
[null,null,null,null,"Coincident"]
[null,null,"Weather Corrected MD 50% POE","MVA","Non-Coincident"]
[null,null,null,null,"Coincident"]
[null,"Oakey","Connection Point Rating","MVA","Non-Coincident",731.61826111709377]
[null,null,null,null,"Coincident",731.61826111709377]
[null,null,"Raw Adjusted MD","MW","Non-Coincident",25.464849999999998]
[null,null,null,null,"Coincident",21.066800000000001]
[null,null,"Raw Adjusted MD","MVA","Non-Coincident",28.196676]
[null,null,null,null,"Coincident",22.929334999999998]
[null,null,"Date MD occurred",null,"Non-Coincident","2018-02-26"]
[null,null,null,null,"Coincident","2018-02-14"]
[null,null,"Half hour time period MD occurred",null,"Non-Coincident","15:30:00"]
[null,null,null,null,"Coincident","17:00:00"]
[null,null,"Winter/Summer Peaking",null,"Non-Coincident","Summer"]
[null,null,null,null,"Coincident","Summer"]
[null,null,"Adjustments - Embedded generation","MW","Non-Coincident",0]
[null,null,null,null,"Coincident",0]
[null,null,"Weather Corrected MD 10% POE","MW","Non-Coincident",27.353589071674644]
[null,null,null,null,"Coincident",22.178495036000001]
[null,null,"Weather Corrected MD 10% POE","MVA","Non-Coincident",30.288035801944673]
[null,null,null,null,"Coincident",24.139316007949997]
[null,null,"Weather Corrected MD 50% POE","MW","Non-Coincident",25.253490503301283]
[null,null,null,null,"Coincident",20.307552528000002]
[null,null,"Weather Corrected MD 50% POE","MVA","Non-Coincident",27.962642214293947]
[null,null,null,null,"Coincident",22.1029617666]
[null,"Oonooie (Rail)","Connection Point Rating","MVA","Non-Coincident",76.867929865680637]
[null,null,null,null,"Coincident",76.867929865680637]
[null,null,"Raw Adjusted MD","MW","Non-Coincident"]
[null,null,null,null,"Coincident"]
[null,null,"Raw Adjusted MD","MVA","Non-Coincident"]
[null,null,null,null,"Coincident"]
[null,null,"Date MD occurred",null,"Non-Coincident","2017-11-28"]
[null,null,null,null,"Coincident","2018-02-14"]
[null,null,"Half hour time period MD occurred",null,"Non-Coincident","11:00:00"]
[null,null,null,null,"Coincident","17:00:00"]
[null,null,"Winter/Summer Peaking",null,"Non-Coincident","Summer"]
[null,null,null,null,"Coincident","Summer"]
[null,null,"Adjustments - Embedded generation","MW","Non-Coincident",0]
[null,null,null,null,"Coincident",0]
[null,null,"Weather Corrected MD 10% POE","MW","Non-Coincident"]
[null,null,null,null,"Coincident"]
[null,null,"Weather Corrected MD 10% POE","MVA","Non-Coincident"]
[null,null,null,null,"Coincident"]
[null,null,"Weather Corrected MD 50% POE","MW","Non-Coincident"]
[null,null,null,null,"Coincident"]
[null,null,"Weather Corrected MD 50% POE","MVA","Non-Coincident"]
[null,null,null,null,"Coincident"]
[null,"Pandoin (66)","Connection Point Rating","MVA","Non-Coincident",116.1]
[null,null,null,null,"Coincident",116.1]
[null,null,"Raw Adjusted MD","MW","Non-Coincident",45.938659999999999]
[null,null,null,null,"Coincident",43.265120000000003]
[null,null,"Raw Adjusted MD","MVA","Non-Coincident",45.939442]
[null,null,null,null,"Coincident",43.311304]
[null,null,"Date MD occurred",null,"Non-Coincident","2018-02-12"]
[null,null,null,null,"Coincident","2018-02-14"]
[null,null,"Half hour time period MD occurred",null,"Non-Coincident","19:00:00"]
[null,null,null,null,"Coincident","17:00:00"]
[null,null,"Winter/Summer Peaking",null,"Non-Coincident","Summer"]
[null,null,null,null,"Coincident","Summer"]
[null,null,"Adjustments - Embedded generation","MW","Non-Coincident",0]
[null,null,null,null,"Coincident",0]
[null,null,"Weather Corrected MD 10% POE","MW","Non-Coincident",42.2699713771975]
[null,null,null,null,"Coincident",45.548220382400004]
[null,null,"Weather Corrected MD 10% POE","MVA","Non-Coincident",42.270690926213881]
[null,null,null,null,"Coincident",45.596841512079997]
[null,null,"Weather Corrected MD 50% POE","MW","Non-Coincident",39.098342797044516]
[null,null,null,null,"Coincident",41.705845075200003]
[null,null,"Weather Corrected MD 50% POE","MVA","Non-Coincident",39.099008356380978]
[null,null,null,null,"Coincident",41.750364603840005]
[null,"Peak Downs (Rail)","Connection Point Rating","MVA","Non-Coincident",63.669079173715076]
[null,null,null,null,"Coincident",71.591133157373605]
[null,null,"Raw Adjusted MD","MW","Non-Coincident"]
[null,null,null,null,"Coincident"]
[null,null,"Raw Adjusted MD","MVA","Non-Coincident"]
[null,null,null,null,"Coincident"]
[null,null,"Date MD occurred",null,"Non-Coincident","2018-02-28"]
[null,null,null,null,"Coincident","2018-02-14"]
[null,null,"Half hour time period MD occurred",null,"Non-Coincident","23:00:00"]
[null,null,null,null,"Coincident","17:00:00"]
[null,null,"Winter/Summer Peaking",null,"Non-Coincident","Summer"]
[null,null,null,null,"Coincident","Summer"]
[null,null,"Adjustments - Embedded generation","MW","Non-Coincident",0]
[null,null,null,null,"Coincident",0]
[null,null,"Weather Corrected MD 10% POE","MW","Non-Coincident"]
[null,null,null,null,"Coincident"]
[null,null,"Weather Corrected MD 10% POE","MVA","Non-Coincident"]
[null,null,null,null,"Coincident"]
[null,null,"Weather Corrected MD 50% POE","MW","Non-Coincident"]
[null,null,null,null,"Coincident"]
[null,null,"Weather Corrected MD 50% POE","MVA","Non-Coincident"]
[null,null,null,null,"Coincident"]
[null,"Pioneer Valley","Connection Point Rating","MVA","Non-Coincident",264.60000000000008]
[null,null,null,null,"Coincident",264.60000000000008]
[null,null,"Raw Adjusted MD","MW","Non-Coincident",58.820751999999999]
[null,null,null,null,"Coincident",34.975181999999997]
[null,null,"Raw Adjusted MD","MVA","Non-Coincident",59.872051999999996]
[null,null,null,null,"Coincident",37.604134000000002]
[null,null,"Date MD occurred",null,"Non-Coincident","2018-02-12"]
[null,null,null,null,"Coincident","2018-02-14"]
[null,null,"Half hour time period MD occurred",null,"Non-Coincident","19:30:00"]
[null,null,null,null,"Coincident","17:00:00"]
[null,null,"Winter/Summer Peaking",null,"Non-Coincident","Summer"]
[null,null,null,null,"Coincident","Summer"]
[null,null,"Adjustments - Embedded generation","MW","Non-Coincident",-2]
[null,null,null,null,"Coincident",18.21]
[null,null,"Weather Corrected MD 10% POE","MW","Non-Coincident",57.432862451748591]
[null,null,null,null,"Coincident",37.781764054139998]
[null,null,"Weather Corrected MD 10% POE","MVA","Non-Coincident",58.459356779728672]
[null,null,null,null,"Coincident",40.549445851180003]
[null,null,"Weather Corrected MD 50% POE","MW","Non-Coincident",52.452328924026013]
[null,null,null,null,"Coincident",33.058388040719997]
[null,null,"Weather Corrected MD 50% POE","MVA","Non-Coincident",53.389806455728234]
[null,null,null,null,"Coincident",35.592592610640004]
[null,"Proserpine","Connection Point Rating","MVA","Non-Coincident",190.00000000000003]
[null,null,null,null,"Coincident",190.00000000000003]
[null,null,"Raw Adjusted MD","MW","Non-Coincident",48.107073999999997]
[null,null,null,null,"Coincident",36.705986000000003]
[null,null,"Raw Adjusted MD","MVA","Non-Coincident",48.675854000000001]
[null,null,null,null,"Coincident",37.412125000000003]
[null,null,"Date MD occurred",null,"Non-Coincident","2018-01-03"]
[null,null,null,null,"Coincident","2018-02-14"]
[null,null,"Half hour time period MD occurred",null,"Non-Coincident","19:30:00"]
[null,null,null,null,"Coincident","17:00:00"]
[null,null,"Winter/Summer Peaking",null,"Non-Coincident","Summer"]
[null,null,null,null,"Coincident","Summer"]
[null,null,"Adjustments - Embedded generation","MW","Non-Coincident",0]
[null,null,null,null,"Coincident",0]
[null,null,"Weather Corrected MD 10% POE","MW","Non-Coincident",50.747667197770411]
[null,null,null,null,"Coincident",38.642960881220006]
[null,null,"Weather Corrected MD 10% POE","MVA","Non-Coincident",51.347667483565139]
[null,null,null,null,"Coincident",39.386362836250001]
[null,null,"Weather Corrected MD 50% POE","MW","Non-Coincident",45.930232318817616]
[null,null,null,null,"Coincident",35.383102264560002]
[null,null,"Weather Corrected MD 50% POE","MVA","Non-Coincident",46.473275064221284]
[null,null,null,null,"Coincident",36.063792015000004]
[null,"Townsville Switchyard (QLD Nickel)","Connection Point Rating","MVA","Non-Coincident",228.63070659909178]
[null,null,null,null,"Coincident",228.63070659909178]
[null,null,"Raw Adjusted MD","MW","Non-Coincident"]
[null,null,null,null,"Coincident"]
[null,null,"Raw Adjusted MD","MVA","Non-Coincident"]
[null,null,null,null,"Coincident"]
[null,null,"Date MD occurred",null,"Non-Coincident","2018-02-25"]
[null,null,null,null,"Coincident","2018-02-14"]
[null,null,"Half hour time period MD occurred",null,"Non-Coincident","00:30:00"]
[null,null,null,null,"Coincident","17:00:00"]
[null,null,"Winter/Summer Peaking",null,"Non-Coincident","Summer"]
[null,null,null,null,"Coincident","Summer"]
[null,null,"Adjustments - Embedded generation","MW","Non-Coincident",0]
[null,null,null,null,"Coincident",0]
[null,null,"Weather Corrected MD 10% POE","MW","Non-Coincident"]
[null,null,null,null,"Coincident"]
[null,null,"Weather Corrected MD 10% POE","MVA","Non-Coincident"]
[null,null,null,null,"Coincident"]
[null,null,"Weather Corrected MD 50% POE","MW","Non-Coincident"]
[null,null,null,null,"Coincident"]
[null,null,"Weather Corrected MD 50% POE","MVA","Non-Coincident"]
[null,null,null,null,"Coincident"]
[null,"Raglan (Rail)","Connection Point Rating","MVA","Non-Coincident"]
[null,null,null,null,"Coincident"]
[null,null,"Raw Adjusted MD","MW","Non-Coincident"]
[null,null,null,null,"Coincident"]
[null,null,"Raw Adjusted MD","MVA","Non-Coincident"]
[null,null,null,null,"Coincident"]
[null,null,"Date MD occurred",null,"Non-Coincident","2017-09-01"]
[null,null,null,null,"Coincident","2018-02-14"]
[null,null,"Half hour time period MD occurred",null,"Non-Coincident","16:00:00"]
[null,null,null,null,"Coincident","17:00:00"]
[null,null,"Winter/Summer Peaking",null,"Non-Coincident","Winter"]
[null,null,null,null,"Coincident","Summer"]
[null,null,"Adjustments - Embedded generation","MW","Non-Coincident",0]
[null,null,null,null,"Coincident",0]
[null,null,"Weather Corrected MD 10% POE","MW","Non-Coincident"]
[null,null,null,null,"Coincident"]
[null,null,"Weather Corrected MD 10% POE","MVA","Non-Coincident"]
[null,null,null,null,"Coincident"]
[null,null,"Weather Corrected MD 50% POE","MW","Non-Coincident"]
[null,null,null,null,"Coincident"]
[null,null,"Weather Corrected MD 50% POE","MVA","Non-Coincident"]
[null,null,null,null,"Coincident"]
[null,"Rockhampton","Connection Point Rating","MVA","Non-Coincident",228.63999999999996]
[null,null,null,null,"Coincident",228.63999999999996]
[null,null,"Raw Adjusted MD","MW","Non-Coincident",103.375398]
[null,null,null,null,"Coincident",97.227367999999998]
[null,null,"Raw Adjusted MD","MVA","Non-Coincident",103.37598800000001]
[null,null,null,null,"Coincident",97.500319000000005]
[null,null,"Date MD occurred",null,"Non-Coincident","2018-02-12"]
[null,null,null,null,"Coincident","2018-02-14"]
[null,null,"Half hour time period MD occurred",null,"Non-Coincident","19:00:00"]
[null,null,null,null,"Coincident","17:00:00"]
[null,null,"Winter/Summer Peaking",null,"Non-Coincident","Summer"]
[null,null,null,null,"Coincident","Summer"]
[null,null,"Adjustments - Embedded generation","MW","Non-Coincident",0]
[null,null,null,null,"Coincident",0]
[null,null,"Weather Corrected MD 10% POE","MW","Non-Coincident",101.70175676256973]
[null,null,null,null,"Coincident",102.35805620936]
[null,null,"Weather Corrected MD 10% POE","MVA","Non-Coincident",101.70233721050658]
[null,null,null,null,"Coincident",102.64541083363001]
[null,null,"Weather Corrected MD 50% POE","MW","Non-Coincident",93.450364300278906]
[null,null,null,null,"Coincident",93.723293657279996]
[null,null,"Weather Corrected MD 50% POE","MVA","Non-Coincident",93.450897654597284]
[null,null,null,null,"Coincident",93.986407503240002]
[null,"Ross","Connection Point Rating","MVA","Non-Coincident",571.57676649772941]
[null,null,null,null,"Coincident",571.57676649772941]
[null,null,"Raw Adjusted MD","MW","Non-Coincident",35.205882000000003]
[null,null,null,null,"Coincident",28.850866]
[null,null,"Raw Adjusted MD","MVA","Non-Coincident",36.752530999999998]
[null,null,null,null,"Coincident",31.360140999999999]
[null,null,"Date MD occurred",null,"Non-Coincident","2018-02-16"]
[null,null,null,null,"Coincident","2018-02-14"]
[null,null,"Half hour time period MD occurred",null,"Non-Coincident","20:00:00"]
[null,null,null,null,"Coincident","17:00:00"]
[null,null,"Winter/Summer Peaking",null,"Non-Coincident","Summer"]
[null,null,null,null,"Coincident","Summer"]
[null,null,"Adjustments - Embedded generation","MW","Non-Coincident",0]
[null,null,null,null,"Coincident",1.42]
[null,null,"Weather Corrected MD 10% POE","MW","Non-Coincident",36.668241967313712]
[null,null,null,null,"Coincident",30.448259598819995]
[null,null,"Weather Corrected MD 10% POE","MVA","Non-Coincident",38.279134708773888]
[null,null,null,null,"Coincident",33.089949040569998]
[null,null,"Weather Corrected MD 50% POE","MW","Non-Coincident",35.205882000000003]
[null,null,null,null,"Coincident",27.759903989359998]
[null,null,"Weather Corrected MD 50% POE","MVA","Non-Coincident",36.752530999999998]
[null,null,null,null,"Coincident",30.178744718360001]
[null,"Stony Creek","Connection Point Rating","MVA","Non-Coincident",297]
[null,null,null,null,"Coincident",22.86307065990918]
[null,null,"Raw Adjusted MD","MW","Non-Coincident",5.6368299999999998]
[null,null,null,null,"Coincident",6.3521999999999995E-2]
[null,null,"Raw Adjusted MD","MVA","Non-Coincident",5.7002040000000003]
[null,null,null,null,"Coincident",1.8532109999999999]
[null,null,"Date MD occurred",null,"Non-Coincident","2017-08-25"]
[null,null,null,null,"Coincident","2018-02-14"]
[null,null,"Half hour time period MD occurred",null,"Non-Coincident","09:00:00"]
[null,null,null,null,"Coincident","17:00:00"]
[null,null,"Winter/Summer Peaking",null,"Non-Coincident","Winter"]
[null,null,null,null,"Coincident","Summer"]
[null,null,"Adjustments - Embedded generation","MW","Non-Coincident",0]
[null,null,null,null,"Coincident",0]
[null,null,"Weather Corrected MD 10% POE","MW","Non-Coincident",5.7997392999999997]
[null,null,null,null,"Coincident",6.6874055939999996E-2]
[null,null,"Weather Corrected MD 10% POE","MVA","Non-Coincident",5.8649448638360928]
[null,null,null,null,"Coincident",1.9510049444699999]
[null,null,"Weather Corrected MD 50% POE","MW","Non-Coincident",5.6368299999999998]
[null,null,null,null,"Coincident",6.1232667120000001E-2]
[null,null,"Weather Corrected MD 50% POE","MVA","Non-Coincident",5.7002040000000003]
[null,null,null,null,"Coincident",1.78642127556]
[null,"Tangkam","Connection Point Rating","MVA","Non-Coincident",487.44066646926365]
[null,null,null,null,"Coincident",487.44066646926365]
[null,null,"Raw Adjusted MD","MW","Non-Coincident",33.497160000000001]
[null,null,null,null,"Coincident",7.6161799999999999]
[null,null,"Raw Adjusted MD","MVA","Non-Coincident",33.976514000000002]
[null,null,null,null,"Coincident",10.525057]
[null,null,"Date MD occurred",null,"Non-Coincident","2018-06-21"]
[null,null,null,null,"Coincident","2018-02-14"]
[null,null,"Half hour time period MD occurred",null,"Non-Coincident","08:00:00"]
[null,null,null,null,"Coincident","17:00:00"]
[null,null,"Winter/Summer Peaking",null,"Non-Coincident","Winter"]
[null,null,null,null,"Coincident","Summer"]
[null,null,"Adjustments - Embedded generation","MW","Non-Coincident",0]
[null,null,null,null,"Coincident",26.79]
[null,null,"Weather Corrected MD 10% POE","MW","Non-Coincident",32.948553008966002]
[null,null,null,null,"Coincident",9.4317941186000027]
[null,null,"Weather Corrected MD 10% POE","MVA","Non-Coincident",33.420056285036566]
[null,null,null,null,"Coincident",12.494172557889996]
[null,null,"Weather Corrected MD 50% POE","MW","Non-Coincident",30.303559273842573]
[null,null,null,null,"Coincident",6.3761812728000038]
[null,null,"Weather Corrected MD 50% POE","MVA","Non-Coincident",30.737211928340852]
[null,null,null,null,"Coincident",9.1802223457199972]
[null,"Tarong (66)","Connection Point Rating","MVA","Non-Coincident",457.26141319818356]
[null,null,null,null,"Coincident",457.26141319818356]
[null,null,"Raw Adjusted MD","MW","Non-Coincident",44.016582]
[null,null,null,null,"Coincident",36.555441999999999]
[null,null,"Raw Adjusted MD","MVA","Non-Coincident",45.408462]
[null,null,null,null,"Coincident",38.010989000000002]
[null,null,"Date MD occurred",null,"Non-Coincident","2018-01-13"]
[null,null,null,null,"Coincident","2018-02-14"]
[null,null,"Half hour time period MD occurred",null,"Non-Coincident","18:00:00"]
[null,null,null,null,"Coincident","17:00:00"]
[null,null,"Winter/Summer Peaking",null,"Non-Coincident","Summer"]
[null,null,null,null,"Coincident","Summer"]
[null,null,"Adjustments - Embedded generation","MW","Non-Coincident",0]
[null,null,null,null,"Coincident",0]
[null,null,"Weather Corrected MD 10% POE","MW","Non-Coincident",44.854665666514606]
[null,null,null,null,"Coincident",38.484472674339997]
[null,null,"Weather Corrected MD 10% POE","MVA","Non-Coincident",46.273047312956585]
[null,null,null,null,"Coincident",40.016828889530004]
[null,null,"Weather Corrected MD 50% POE","MW","Non-Coincident",42.788947848328917]
[null,null,null,null,"Coincident",35.237983870320001]
[null,null,"Weather Corrected MD 50% POE","MVA","Non-Coincident",44.142007945797005]
[null,null,null,null,"Coincident",36.641072956440006]
[null,"Teebar Creek","Connection Point Rating","MVA","Non-Coincident",905.30000000000007]
[null,null,null,null,"Coincident",905.30000000000007]
[null,null,"Raw Adjusted MD","MW","Non-Coincident",119.02938]
[null,null,null,null,"Coincident",108.10697999999999]
[null,null,"Raw Adjusted MD","MVA","Non-Coincident",129.402153]
[null,null,null,null,"Coincident",118.162659]
[null,null,"Date MD occurred",null,"Non-Coincident","2018-02-15"]
[null,null,null,null,"Coincident","2018-02-14"]
[null,null,"Half hour time period MD occurred",null,"Non-Coincident","19:00:00"]
[null,null,null,null,"Coincident","17:00:00"]
[null,null,"Winter/Summer Peaking",null,"Non-Coincident","Summer"]
[null,null,null,null,"Coincident","Summer"]
[null,null,"Adjustments - Embedded generation","MW","Non-Coincident",0]
[null,null,null,null,"Coincident",-0.02]
[null,null,"Weather Corrected MD 10% POE","MW","Non-Coincident",120.48205759212851]
[null,null,null,null,"Coincident",113.81072993459999]
[null,null,"Weather Corrected MD 10% POE","MVA","Non-Coincident",130.98142366440476]
[null,null,null,null,"Coincident",124.39704711543]
[null,null,"Weather Corrected MD 50% POE","MW","Non-Coincident",110.66867978245497]
[null,null,null,null,"Coincident",104.2115252408]
[null,null,"Weather Corrected MD 50% POE","MVA","Non-Coincident",120.31286253458805]
[null,null,null,null,"Coincident",113.90479756964001]
[null,"Tully","Connection Point Rating","MVA","Non-Coincident",50.000000000000007]
[null,null,null,null,"Coincident",50.000000000000007]
[null,null,"Raw Adjusted MD","MW","Non-Coincident",13.704368000000001]
[null,null,null,null,"Coincident",11.71576]
[null,null,"Raw Adjusted MD","MVA","Non-Coincident",13.802129000000001]
[null,null,null,null,"Coincident",11.828094]
[null,null,"Date MD occurred",null,"Non-Coincident","2018-01-02"]
[null,null,null,null,"Coincident","2018-02-14"]
[null,null,"Half hour time period MD occurred",null,"Non-Coincident","19:00:00"]
[null,null,null,null,"Coincident","17:00:00"]
[null,null,"Winter/Summer Peaking",null,"Non-Coincident","Summer"]
[null,null,null,null,"Coincident","Summer"]
[null,null,"Adjustments - Embedded generation","MW","Non-Coincident",0]
[null,null,null,null,"Coincident",0]
[null,null,"Weather Corrected MD 10% POE","MW","Non-Coincident",15.074768020420551]
[null,null,null,null,"Coincident",12.334000655199999]
[null,null,"Weather Corrected MD 10% POE","MVA","Non-Coincident",15.18230485805103]
[null,null,null,null,"Coincident",12.45226252038]
[null,null,"Weather Corrected MD 50% POE","MW","Non-Coincident",14.595264989226342]
[null,null,null,null,"Coincident",11.2935240096]
[null,null,"Weather Corrected MD 50% POE","MVA","Non-Coincident",14.699381260813018]
[null,null,null,null,"Coincident",11.40180949224]
[null,"Turkinje (132)","Connection Point Rating","MVA","Non-Coincident",358.95020936057409]
[null,null,null,null,"Coincident",358.95020936057409]
[null,null,"Raw Adjusted MD","MW","Non-Coincident",22.749511999999999]
[null,null,null,null,"Coincident",12.820180000000001]
[null,null,"Raw Adjusted MD","MVA","Non-Coincident",24.905090000000001]
[null,null,null,null,"Coincident",17.152035999999999]
[null,null,"Date MD occurred",null,"Non-Coincident","2018-01-02"]
[null,null,null,null,"Coincident","2018-02-14"]
[null,null,"Half hour time period MD occurred",null,"Non-Coincident","19:30:00"]
[null,null,null,null,"Coincident","17:00:00"]
[null,null,"Winter/Summer Peaking",null,"Non-Coincident","Summer"]
[null,null,null,null,"Coincident","Summer"]
[null,null,"Adjustments - Embedded generation","MW","Non-Coincident",0]
[null,null,null,null,"Coincident",5.39]
[null,null,"Weather Corrected MD 10% POE","MW","Non-Coincident",23.637671982860088]
[null,null,null,null,"Coincident",13.781131198600001]
[null,null,"Weather Corrected MD 10% POE","MVA","Non-Coincident",25.877405551539258]
[null,null,null,null,"Coincident",18.341579239719998]
[null,null,"Weather Corrected MD 50% POE","MW","Non-Coincident",21.730994530944049]
[null,null,null,null,"Coincident",12.163885112800003]
[null,null,"Weather Corrected MD 50% POE","MVA","Non-Coincident",23.790065236681532]
[null,null,null,null,"Coincident",16.339621022559999]
[null,"Turkinje (66)","Connection Point Rating","MVA","Non-Coincident",160.00000000000003]
[null,null,null,null,"Coincident",160.00000000000003]
[null,null,"Raw Adjusted MD","MW","Non-Coincident",61.816848]
[null,null,null,null,"Coincident",54.221393999999997]
[null,null,"Raw Adjusted MD","MVA","Non-Coincident",61.882412000000002]
[null,null,null,null,"Coincident",54.227282000000002]
[null,null,"Date MD occurred",null,"Non-Coincident","2018-02-15"]
[null,null,null,null,"Coincident","2018-02-14"]
[null,null,"Half hour time period MD occurred",null,"Non-Coincident","19:00:00"]
[null,null,null,null,"Coincident","17:00:00"]
[null,null,"Winter/Summer Peaking",null,"Non-Coincident","Summer"]
[null,null,null,null,"Coincident","Summer"]
[null,null,"Adjustments - Embedded generation","MW","Non-Coincident",0]
[null,null,null,null,"Coincident",0]
[null,null,"Weather Corrected MD 10% POE","MW","Non-Coincident",64.399053959871409]
[null,null,null,null,"Coincident",57.082656961379996]
[null,null,"Weather Corrected MD 10% POE","MVA","Non-Coincident",64.467356691415162]
[null,null,null,null,"Coincident",57.088855671140003]
[null,null,"Weather Corrected MD 50% POE","MW","Non-Coincident",61.816848]
[null,null,null,null,"Coincident",52.267254960239995]
[null,null,"Weather Corrected MD 50% POE","MVA","Non-Coincident",61.882412000000002]
[null,null,null,null,"Coincident",52.272930756720001]
[null,"Townsville East","Connection Point Rating","MVA","Non-Coincident",112.50000000000001]
[null,null,null,null,"Coincident",112.50000000000001]
[null,null,"Raw Adjusted MD","MW","Non-Coincident",38.98518]
[null,null,null,null,"Coincident",31.74342]
[null,null,"Raw Adjusted MD","MVA","Non-Coincident",39.210459]
[null,null,null,null,"Coincident",32.173932000000001]
[null,null,"Date MD occurred",null,"Non-Coincident","2018-02-13"]
[null,null,null,null,"Coincident","2018-02-14"]
[null,null,"Half hour time period MD occurred",null,"Non-Coincident","17:00:00"]
[null,null,null,null,"Coincident","17:00:00"]
[null,null,"Winter/Summer Peaking",null,"Non-Coincident","Summer"]
[null,null,null,null,"Coincident","Summer"]
[null,null,"Adjustments - Embedded generation","MW","Non-Coincident",0]
[null,null,null,null,"Coincident",9.5]
[null,null,"Weather Corrected MD 10% POE","MW","Non-Coincident",42.712145999999997]
[null,null,null,null,"Coincident",33.919835273399997]
[null,null,"Weather Corrected MD 10% POE","MVA","Non-Coincident",42.958961572962188]
[null,null,null,null,"Coincident",34.373065391639997]
[null,null,"Weather Corrected MD 50% POE","MW","Non-Coincident",38.98518]
[null,null,null,null,"Coincident",30.257007143199999]
[null,null,"Weather Corrected MD 50% POE","MVA","Non-Coincident",39.210459]
[null,null,null,null,"Coincident",30.672003490720002]
[null,"Townsville South (Ergon)","Connection Point Rating","MVA","Non-Coincident",202]
[null,null,null,null,"Coincident",202]
[null,null,"Raw Adjusted MD","MW","Non-Coincident",91.366500000000002]
[null,null,null,null,"Coincident",75.200453999999993]
[null,null,"Raw Adjusted MD","MVA","Non-Coincident",92.496748999999994]
[null,null,null,null,"Coincident",76.984063000000006]
[null,null,"Date MD occurred",null,"Non-Coincident","2018-02-13"]
[null,null,null,null,"Coincident","2018-02-14"]
[null,null,"Half hour time period MD occurred",null,"Non-Coincident","17:00:00"]
[null,null,null,null,"Coincident","17:00:00"]
[null,null,"Winter/Summer Peaking",null,"Non-Coincident","Summer"]
[null,null,null,null,"Coincident","Summer"]
[null,null,"Adjustments - Embedded generation","MW","Non-Coincident",0]
[null,null,null,null,"Coincident",17.55]
[null,null,"Weather Corrected MD 10% POE","MW","Non-Coincident",91.346399479843015]
[null,null,null,null,"Coincident",80.094895457579995]
[null,null,"Weather Corrected MD 10% POE","MVA","Non-Coincident",92.476399826421826]
[null,null,null,null,"Coincident",81.972625504510006]
[null,null,"Weather Corrected MD 50% POE","MW","Non-Coincident",83.864437499076132]
[null,null,null,null,"Coincident",71.85772763784]
[null,null,"Weather Corrected MD 50% POE","MVA","Non-Coincident",84.901882258576521]
[null,null,null,null,"Coincident",73.577055369480007]
[null,"Wandoo (Rail)","Connection Point Rating","MVA","Non-Coincident",71.591133157373605]
[null,null,null,null,"Coincident",71.591133157373605]
[null,null,"Raw Adjusted MD","MW","Non-Coincident"]
[null,null,null,null,"Coincident"]
[null,null,"Raw Adjusted MD","MVA","Non-Coincident"]
[null,null,null,null,"Coincident"]
[null,null,"Date MD occurred",null,"Non-Coincident","2017-12-29"]
[null,null,null,null,"Coincident","2018-02-14"]
[null,null,"Half hour time period MD occurred",null,"Non-Coincident","02:00:00"]
[null,null,null,null,"Coincident","17:00:00"]
[null,null,"Winter/Summer Peaking",null,"Non-Coincident","Summer"]
[null,null,null,null,"Coincident","Summer"]
[null,null,"Adjustments - Embedded generation","MW","Non-Coincident",0]
[null,null,null,null,"Coincident",0]
[null,null,"Weather Corrected MD 10% POE","MW","Non-Coincident"]
[null,null,null,null,"Coincident"]
[null,null,"Weather Corrected MD 10% POE","MVA","Non-Coincident"]
[null,null,null,null,"Coincident"]
[null,null,"Weather Corrected MD 50% POE","MW","Non-Coincident"]
[null,null,null,null,"Coincident"]
[null,null,"Weather Corrected MD 50% POE","MVA","Non-Coincident"]
[null,null,null,null,"Coincident"]
[null,"Woree","Connection Point Rating","MVA","Non-Coincident",571.57676649772941]
[null,null,null,null,"Coincident",571.57676649772941]
[null,null,"Raw Adjusted MD","MW","Non-Coincident",41.246527999999998]
[null,null,null,null,"Coincident",35.937263999999999]
[null,null,"Raw Adjusted MD","MVA","Non-Coincident",41.279575000000001]
[null,null,null,null,"Coincident",35.953465000000001]
[null,null,"Date MD occurred",null,"Non-Coincident","2018-02-19"]
[null,null,null,null,"Coincident","2018-02-14"]
[null,null,"Half hour time period MD occurred",null,"Non-Coincident","19:30:00"]
[null,null,null,null,"Coincident","17:00:00"]
[null,null,"Winter/Summer Peaking",null,"Non-Coincident","Summer"]
[null,null,null,null,"Coincident","Summer"]
[null,null,"Adjustments - Embedded generation","MW","Non-Coincident",0]
[null,null,null,null,"Coincident",0]
[null,null,"Weather Corrected MD 10% POE","MW","Non-Coincident",43.932532502519962]
[null,null,null,null,"Coincident",37.833673421279997]
[null,null,"Weather Corrected MD 10% POE","MVA","Non-Coincident",43.967731547676223]
[null,null,null,null,"Coincident",37.850729348050002]
[null,null,"Weather Corrected MD 50% POE","MW","Non-Coincident",41.785626303841426]
[null,null,null,null,"Coincident",34.642085005440002]
[null,null,"Weather Corrected MD 50% POE","MVA","Non-Coincident",41.819105233085196]
[null,null,null,null,"Coincident",34.6577021214]
[null,"Wycarbah (Rail)","Connection Point Rating","MVA","Non-Coincident"]
[null,null,null,null,"Coincident"]
[null,null,"Raw Adjusted MD","MW","Non-Coincident"]
[null,null,null,null,"Coincident"]
[null,null,"Raw Adjusted MD","MVA","Non-Coincident"]
[null,null,null,null,"Coincident"]
[null,null,"Date MD occurred",null,"Non-Coincident","2017-08-29"]
[null,null,null,null,"Coincident","2018-02-14"]
[null,null,"Half hour time period MD occurred",null,"Non-Coincident","02:00:00"]
[null,null,null,null,"Coincident","17:00:00"]
[null,null,"Winter/Summer Peaking",null,"Non-Coincident","Winter"]
[null,null,null,null,"Coincident","Summer"]
[null,null,"Adjustments - Embedded generation","MW","Non-Coincident",0]
[null,null,null,null,"Coincident",0]
[null,null,"Weather Corrected MD 10% POE","MW","Non-Coincident"]
[null,null,null,null,"Coincident"]
[null,null,"Weather Corrected MD 10% POE","MVA","Non-Coincident"]
[null,null,null,null,"Coincident"]
[null,null,"Weather Corrected MD 50% POE","MW","Non-Coincident"]
[null,null,null,null,"Coincident"]
[null,null,"Weather Corrected MD 50% POE","MVA","Non-Coincident"]
[null,null,null,null,"Coincident"]
[null,"Yarwun (Ergon)","Connection Point Rating","MVA","Non-Coincident",731.61826111709377]
[null,null,null,null,"Coincident",731.61826111709377]
[null,null,"Raw Adjusted MD","MW","Non-Coincident",41.2149]
[null,null,null,null,"Coincident",35.258479999999999]
[null,null,"Raw Adjusted MD","MVA","Non-Coincident",46.112105]
[null,null,null,null,"Coincident",39.110478999999998]
[null,null,"Date MD occurred",null,"Non-Coincident","2018-02-19"]
[null,null,null,null,"Coincident","2018-02-14"]
[null,null,"Half hour time period MD occurred",null,"Non-Coincident","14:00:00"]
[null,null,null,null,"Coincident","17:00:00"]
[null,null,"Winter/Summer Peaking",null,"Non-Coincident","Summer"]
[null,null,null,null,"Coincident","Summer"]
[null,null,"Adjustments - Embedded generation","MW","Non-Coincident",0]
[null,null,null,null,"Coincident",0]
[null,null,"Weather Corrected MD 10% POE","MW","Non-Coincident",44.367847500000003]
[null,null,null,null,"Coincident",37.1190699896]
[null,null,"Weather Corrected MD 10% POE","MVA","Non-Coincident",49.639689591482387]
[null,null,null,null,"Coincident",41.174338976830001]
[null,null,"Weather Corrected MD 50% POE","MW","Non-Coincident",41.2149]
[null,null,null,null,"Coincident",33.987764380800002]
[null,null,"Weather Corrected MD 50% POE","MVA","Non-Coincident",46.112105]
[null,null,null,null,"Coincident",37.700937336839999]
[null,"Moranbah (Broadlea)","Connection Point Rating","MVA","Non-Coincident",228.63070659909178]
[null,null,null,null,"Coincident",228.63070659909178]
[null,null,"Raw Adjusted MD","MW","Non-Coincident",43.818655999999997]
[null,null,null,null,"Coincident",28.597186000000001]
[null,null,"Raw Adjusted MD","MVA","Non-Coincident",44.859172999999998]
[null,null,null,null,"Coincident",28.768447999999999]
[null,null,"Date MD occurred",null,"Non-Coincident","2017-09-23"]
[null,null,null,null,"Coincident","2018-02-14"]
[null,null,"Half hour time period MD occurred",null,"Non-Coincident","21:00:00"]
[null,null,null,null,"Coincident","17:00:00"]
[null,null,"Winter/Summer Peaking",null,"Non-Coincident","Winter"]
[null,null,null,null,"Coincident","Summer"]
[null,null,"Adjustments - Embedded generation","MW","Non-Coincident",0]
[null,null,null,null,"Coincident",0]
[null,null,"Weather Corrected MD 10% POE","MW","Non-Coincident",47.219886764538046]
[null,null,null,null,"Coincident",30.106259505219999]
[null,null,"Weather Corrected MD 10% POE","MVA","Non-Coincident",48.34116932775899]
[null,null,null,null,"Coincident",30.286559000960001]
[null,null,"Weather Corrected MD 50% POE","MW","Non-Coincident",43.818655999999997]
[null,null,null,null,"Coincident",27.566543416560002]
[null,null,"Weather Corrected MD 50% POE","MVA","Non-Coincident",44.859172999999998]
[null,null,null,null,"Coincident",27.731633134079999]
[null,"Boyne Island (132)","Connection Point Rating","MVA","Non-Coincident",793.78336505953769]
[null,null,null,null,"Coincident",793.78336505953769]
[null,null,"Raw Adjusted MD","MW","Non-Coincident"]
[null,null,null,null,"Coincident"]
[null,null,"Raw Adjusted MD","MVA","Non-Coincident"]
[null,null,null,null,"Coincident"]
[null,null,"Date MD occurred",null,"Non-Coincident","2017-12-28"]
[null,null,null,null,"Coincident","2018-02-14"]
[null,null,"Half hour time period MD occurred",null,"Non-Coincident","09:00:00"]
[null,null,null,null,"Coincident","17:00:00"]
[null,null,"Winter/Summer Peaking",null,"Non-Coincident","Summer"]
[null,null,null,null,"Coincident","Summer"]
[null,null,"Adjustments - Embedded generation","MW","Non-Coincident",0]
[null,null,null,null,"Coincident",0]
[null,null,"Weather Corrected MD 10% POE","MW","Non-Coincident"]
[null,null,null,null,"Coincident"]
[null,null,"Weather Corrected MD 10% POE","MVA","Non-Coincident"]
[null,null,null,null,"Coincident"]
[null,null,"Weather Corrected MD 50% POE","MW","Non-Coincident"]
[null,null,null,null,"Coincident"]
[null,null,"Weather Corrected MD 50% POE","MVA","Non-Coincident"]
[null,null,null,null,"Coincident"]
[null,"Boyne Island (275)","Connection Point Rating","MVA","Non-Coincident",933.94214703812747]
[null,null,null,null,"Coincident",933.94214703812747]
[null,null,"Raw Adjusted MD","MW","Non-Coincident"]
[null,null,null,null,"Coincident"]
[null,null,"Raw Adjusted MD","MVA","Non-Coincident"]
[null,null,null,null,"Coincident"]
[null,null,"Date MD occurred",null,"Non-Coincident","2017-12-06"]
[null,null,null,null,"Coincident","2018-02-14"]
[null,null,"Half hour time period MD occurred",null,"Non-Coincident","10:30:00"]
[null,null,null,null,"Coincident","17:00:00"]
[null,null,"Winter/Summer Peaking",null,"Non-Coincident","Summer"]
[null,null,null,null,"Coincident","Summer"]
[null,null,"Adjustments - Embedded generation","MW","Non-Coincident",0]
[null,null,null,null,"Coincident",0]
[null,null,"Weather Corrected MD 10% POE","MW","Non-Coincident"]
[null,null,null,null,"Coincident"]
[null,null,"Weather Corrected MD 10% POE","MVA","Non-Coincident"]
[null,null,null,null,"Coincident"]
[null,null,"Weather Corrected MD 50% POE","MW","Non-Coincident"]
[null,null,null,null,"Coincident"]
[null,null,"Weather Corrected MD 50% POE","MVA","Non-Coincident"]
[null,null,null,null,"Coincident"]
[null,"Goonyella Riverside Mine","Connection Point Rating","MVA","Non-Coincident"]
[null,null,null,null,"Coincident"]
[null,null,"Raw Adjusted MD","MW","Non-Coincident"]
[null,null,null,null,"Coincident"]
[null,null,"Raw Adjusted MD","MVA","Non-Coincident"]
[null,null,null,null,"Coincident"]
[null,null,"Date MD occurred",null,"Non-Coincident","2018-04-10"]
[null,null,null,null,"Coincident","2018-02-14"]
[null,null,"Half hour time period MD occurred",null,"Non-Coincident","01:00:00"]
[null,null,null,null,"Coincident","17:00:00"]
[null,null,"Winter/Summer Peaking",null,"Non-Coincident","Winter"]
[null,null,null,null,"Coincident","Summer"]
[null,null,"Adjustments - Embedded generation","MW","Non-Coincident",0]
[null,null,null,null,"Coincident",0]
[null,null,"Weather Corrected MD 10% POE","MW","Non-Coincident"]
[null,null,null,null,"Coincident"]
[null,null,"Weather Corrected MD 10% POE","MVA","Non-Coincident"]
[null,null,null,null,"Coincident"]
[null,null,"Weather Corrected MD 50% POE","MW","Non-Coincident"]
[null,null,null,null,"Coincident"]
[null,null,"Weather Corrected MD 50% POE","MVA","Non-Coincident"]
[null,null,null,null,"Coincident"]
[null,"Loganlea (110)","Connection Point Rating","MVA","Non-Coincident",1805.6110053663274]
[null,null,null,null,"Coincident",1805.6110053663274]
[null,null,"Raw Adjusted MD","MW","Non-Coincident",349.42136199999999]
[null,null,null,null,"Coincident",347.92977200000001]
[null,null,"Raw Adjusted MD","MVA","Non-Coincident",369.03627599999999]
[null,null,null,null,"Coincident",366.79146200000002]
[null,null,"Date MD occurred",null,"Non-Coincident","2018-02-13"]
[null,null,null,null,"Coincident","2018-02-14"]
[null,null,"Half hour time period MD occurred",null,"Non-Coincident","16:30:00"]
[null,null,null,null,"Coincident","17:00:00"]
[null,null,"Winter/Summer Peaking",null,"Non-Coincident","Summer"]
[null,null,null,null,"Coincident","Summer"]
[null,null,"Adjustments - Embedded generation","MW","Non-Coincident",11]
[null,null,null,null,"Coincident",34.049999999999997]
[null,null,"Weather Corrected MD 10% POE","MW","Non-Coincident",387.80497249879494]
[null,null,null,null,"Coincident",368.08684456844003]
[null,null,"Weather Corrected MD 10% POE","MVA","Non-Coincident",409.57456649498636]
[null,null,null,null,"Coincident",387.94386594974003]
[null,null,"Weather Corrected MD 50% POE","MW","Non-Coincident",337.6335024427305]
[null,null,null,null,"Coincident",334.16322101712001]
[null,null,"Weather Corrected MD 50% POE","MVA","Non-Coincident",356.58670002637723]
[null,null,null,null,"Coincident",352.34513570952004]
[null,"North Goonyella","Connection Point Rating","MVA","Non-Coincident",89.61180545151403]
[null,null,null,null,"Coincident",89.61180545151403]
[null,null,"Raw Adjusted MD","MW","Non-Coincident"]
[null,null,null,null,"Coincident"]
[null,null,"Raw Adjusted MD","MVA","Non-Coincident"]
[null,null,null,null,"Coincident"]
[null,null,"Date MD occurred",null,"Non-Coincident","2017-11-19"]
[null,null,null,null,"Coincident","2018-02-14"]
[null,null,"Half hour time period MD occurred",null,"Non-Coincident","16:30:00"]
[null,null,null,null,"Coincident","17:00:00"]
[null,null,"Winter/Summer Peaking",null,"Non-Coincident","Summer"]
[null,null,null,null,"Coincident","Summer"]
[null,null,"Adjustments - Embedded generation","MW","Non-Coincident",0]
[null,null,null,null,"Coincident",0]
[null,null,"Weather Corrected MD 10% POE","MW","Non-Coincident"]
[null,null,null,null,"Coincident"]
[null,null,"Weather Corrected MD 10% POE","MVA","Non-Coincident"]
[null,null,null,null,"Coincident"]
[null,null,"Weather Corrected MD 50% POE","MW","Non-Coincident"]
[null,null,null,null,"Coincident"]
[null,null,"Weather Corrected MD 50% POE","MVA","Non-Coincident"]
[null,null,null,null,"Coincident"]
[null,"Gladstone South (QAL)","Connection Point Rating","MVA","Non-Coincident",383.7383505700476]
[null,null,null,null,"Coincident",383.7383505700476]
[null,null,"Raw Adjusted MD","MW","Non-Coincident"]
[null,null,null,null,"Coincident"]
[null,null,"Raw Adjusted MD","MVA","Non-Coincident"]
[null,null,null,null,"Coincident"]
[null,null,"Date MD occurred",null,"Non-Coincident","2017-10-31"]
[null,null,null,null,"Coincident","2018-02-14"]
[null,null,"Half hour time period MD occurred",null,"Non-Coincident","01:30:00"]
[null,null,null,null,"Coincident","17:00:00"]
[null,null,"Winter/Summer Peaking",null,"Non-Coincident","Summer"]
[null,null,null,null,"Coincident","Summer"]
[null,null,"Adjustments - Embedded generation","MW","Non-Coincident",0]
[null,null,null,null,"Coincident",0]
[null,null,"Weather Corrected MD 10% POE","MW","Non-Coincident"]
[null,null,null,null,"Coincident"]
[null,null,"Weather Corrected MD 10% POE","MVA","Non-Coincident"]
[null,null,null,null,"Coincident"]
[null,null,"Weather Corrected MD 50% POE","MW","Non-Coincident"]
[null,null,null,null,"Coincident"]
[null,null,"Weather Corrected MD 50% POE","MVA","Non-Coincident"]
[null,null,null,null,"Coincident"]
[null,"Yarwun (Rio Tinto)","Connection Point Rating","MVA","Non-Coincident"]
[null,null,null,null,"Coincident"]
[null,null,"Raw Adjusted MD","MW","Non-Coincident"]
[null,null,null,null,"Coincident"]
[null,null,"Raw Adjusted MD","MVA","Non-Coincident"]
[null,null,null,null,"Coincident"]
[null,null,"Date MD occurred",null,"Non-Coincident","2017-07-09"]
[null,null,null,null,"Coincident","2018-02-14"]
[null,null,"Half hour time period MD occurred",null,"Non-Coincident","22:00:00"]
[null,null,null,null,"Coincident","17:00:00"]
[null,null,"Winter/Summer Peaking",null,"Non-Coincident","Winter"]
[null,null,null,null,"Coincident","Summer"]
[null,null,"Adjustments - Embedded generation","MW","Non-Coincident",0]
[null,null,null,null,"Coincident",0]
[null,null,"Weather Corrected MD 10% POE","MW","Non-Coincident"]
[null,null,null,null,"Coincident"]
[null,null,"Weather Corrected MD 10% POE","MVA","Non-Coincident"]
[null,null,null,null,"Coincident"]
[null,null,"Weather Corrected MD 50% POE","MW","Non-Coincident"]
[null,null,null,null,"Coincident"]
[null,null,"Weather Corrected MD 50% POE","MVA","Non-Coincident"]
[null,null,null,null,"Coincident"]
[null,"Rocklea","Connection Point Rating","MVA","Non-Coincident",646.37496127341774]
[null,null,null,null,"Coincident",646.37496127341774]
[null,null,"Raw Adjusted MD","MW","Non-Coincident",158.39760999999999]
[null,null,null,null,"Coincident",136.77472599999999]
[null,null,"Raw Adjusted MD","MVA","Non-Coincident",160.12904800000001]
[null,null,null,null,"Coincident",136.77474900000001]
[null,null,"Date MD occurred",null,"Non-Coincident","2018-02-15"]
[null,null,null,null,"Coincident","2018-02-14"]
[null,null,"Half hour time period MD occurred",null,"Non-Coincident","14:00:00"]
[null,null,null,null,"Coincident","17:00:00"]
[null,null,"Winter/Summer Peaking",null,"Non-Coincident","Summer"]
[null,null,null,null,"Coincident","Summer"]
[null,null,"Adjustments - Embedded generation","MW","Non-Coincident",0]
[null,null,null,null,"Coincident",0]
[null,null,"Weather Corrected MD 10% POE","MW","Non-Coincident",162.60623455247173]
[null,null,null,null,"Coincident",143.99232829101999]
[null,null,"Weather Corrected MD 10% POE","MVA","Non-Coincident",164.38367686073047]
[null,null,null,null,"Coincident",143.99235250473001]
[null,null,"Weather Corrected MD 50% POE","MW","Non-Coincident",148.43123268304794]
[null,null,null,null,"Coincident",131.84536487495998]
[null,null,"Weather Corrected MD 50% POE","MVA","Non-Coincident",150.05372860741369]
[null,null,null,null,"Coincident",131.84538704604003]
[null,"Townsville South (Townsville Zinc)","Connection Point Rating","MVA","Non-Coincident"]
[null,null,null,null,"Coincident"]
[null,null,"Raw Adjusted MD","MW","Non-Coincident"]
[null,null,null,null,"Coincident"]
[null,null,"Raw Adjusted MD","MVA","Non-Coincident"]
[null,null,null,null,"Coincident"]
[null,null,"Date MD occurred",null,"Non-Coincident","2017-10-24"]
[null,null,null,null,"Coincident","2018-02-14"]
[null,null,"Half hour time period MD occurred",null,"Non-Coincident","05:00:00"]
[null,null,null,null,"Coincident","17:00:00"]
[null,null,"Winter/Summer Peaking",null,"Non-Coincident","Summer"]
[null,null,null,null,"Coincident","Summer"]
[null,null,"Adjustments - Embedded generation","MW","Non-Coincident",0]
[null,null,null,null,"Coincident",0]
[null,null,"Weather Corrected MD 10% POE","MW","Non-Coincident"]
[null,null,null,null,"Coincident"]
[null,null,"Weather Corrected MD 10% POE","MVA","Non-Coincident"]
[null,null,null,null,"Coincident"]
[null,null,"Weather Corrected MD 50% POE","MW","Non-Coincident"]
[null,null,null,null,"Coincident"]
[null,null,"Weather Corrected MD 50% POE","MVA","Non-Coincident"]
[null,null,null,null,"Coincident"]
[null,"QNI","Connection Point Rating","MVA","Non-Coincident",2472.4810503745584]
[null,null,null,null,"Coincident",2472.4810503745584]
[null,null,"Raw Adjusted MD","MW","Non-Coincident",1236.364]
[null,null,null,null,"Coincident",-152.45996]
[null,null,"Raw Adjusted MD","MVA","Non-Coincident",1237.058526]
[null,null,null,null,"Coincident",166.28246999999999]
[null,null,"Date MD occurred",null,"Non-Coincident","2018-02-11"]
[null,null,null,null,"Coincident","2018-02-14"]
[null,null,"Half hour time period MD occurred",null,"Non-Coincident","07:30:00"]
[null,null,null,null,"Coincident","17:00:00"]
[null,null,"Winter/Summer Peaking",null,"Non-Coincident","Summer"]
[null,null,null,null,"Coincident","Summer"]
[null,null,"Adjustments - Embedded generation","MW","Non-Coincident",0]
[null,null,null,null,"Coincident",0]
[null,null,"Weather Corrected MD 10% POE","MW","Non-Coincident",1236.364]
[null,null,null,null,"Coincident",-152.45996]
[null,null,"Weather Corrected MD 10% POE","MVA","Non-Coincident",1237.058526]
[null,null,null,null,"Coincident",166.28246999999999]
[null,null,"Weather Corrected MD 50% POE","MW","Non-Coincident",1236.364]
[null,null,null,null,"Coincident",-152.45996]
[null,null,"Weather Corrected MD 50% POE","MVA","Non-Coincident",1237.058526]
[null,null,null,null,"Coincident",166.28246999999999]
[null,"Terranora Interconnector","Connection Point Rating","MVA","Non-Coincident",267.34550624987133]
[null,null,null,null,"Coincident",262.65095574103668]
[null,null,"Raw Adjusted MD","MW","Non-Coincident",203.110006]
[null,null,null,null,"Coincident",-0.64300800000000002]
[null,null,"Raw Adjusted MD","MVA","Non-Coincident",203.48848000000001]
[null,null,null,null,"Coincident",3.6253630000000001]
[null,null,"Date MD occurred",null,"Non-Coincident","2018-06-09"]
[null,null,null,null,"Coincident","2018-02-14"]
[null,null,"Half hour time period MD occurred",null,"Non-Coincident","01:00:00"]
[null,null,null,null,"Coincident","17:00:00"]
[null,null,"Winter/Summer Peaking",null,"Non-Coincident","Winter"]
[null,null,null,null,"Coincident","Summer"]
[null,null,"Adjustments - Embedded generation","MW","Non-Coincident",0]
[null,null,null,null,"Coincident",0]
[null,null,"Weather Corrected MD 10% POE","MW","Non-Coincident",203.110006]
[null,null,null,null,"Coincident",-0.64300800000000002]
[null,null,"Weather Corrected MD 10% POE","MVA","Non-Coincident",203.48848000000001]
[null,null,null,null,"Coincident",3.6253630000000001]
[null,null,"Weather Corrected MD 50% POE","MW","Non-Coincident",203.110006]
[null,null,null,null,"Coincident",-0.64300800000000002]
[null,null,"Weather Corrected MD 50% POE","MVA","Non-Coincident",203.48848000000001]
[null,null,null,null,"Coincident",3.6253630000000001]
[null,"Columboola (Condabri)","Connection Point Rating","MVA","Non-Coincident"]
[null,null,null,null,"Coincident"]
[null,null,"Raw Adjusted MD","MW","Non-Coincident"]
[null,null,null,null,"Coincident"]
[null,null,"Raw Adjusted MD","MVA","Non-Coincident"]
[null,null,null,null,"Coincident"]
[null,null,"Date MD occurred",null,"Non-Coincident","2017-11-05"]
[null,null,null,null,"Coincident","2018-02-14"]
[null,null,"Half hour time period MD occurred",null,"Non-Coincident","12:00:00"]
[null,null,null,null,"Coincident","17:00:00"]
[null,null,"Winter/Summer Peaking",null,"Non-Coincident","Summer"]
[null,null,null,null,"Coincident","Summer"]
[null,null,"Adjustments - Embedded generation","MW","Non-Coincident",0]
[null,null,null,null,"Coincident",0]
[null,null,"Weather Corrected MD 10% POE","MW","Non-Coincident"]
[null,null,null,null,"Coincident"]
[null,null,"Weather Corrected MD 10% POE","MVA","Non-Coincident"]
[null,null,null,null,"Coincident"]
[null,null,"Weather Corrected MD 50% POE","MW","Non-Coincident"]
[null,null,null,null,"Coincident"]
[null,null,"Weather Corrected MD 50% POE","MVA","Non-Coincident"]
[null,null,null,null,"Coincident"]
[null,"Orana","Connection Point Rating","MVA","Non-Coincident"]
[null,null,null,null,"Coincident"]
[null,null,"Raw Adjusted MD","MW","Non-Coincident"]
[null,null,null,null,"Coincident"]
[null,null,"Raw Adjusted MD","MVA","Non-Coincident"]
[null,null,null,null,"Coincident"]
[null,null,"Date MD occurred",null,"Non-Coincident","2018-01-22"]
[null,null,null,null,"Coincident","2018-02-14"]
[null,null,"Half hour time period MD occurred",null,"Non-Coincident","16:00:00"]
[null,null,null,null,"Coincident","17:00:00"]
[null,null,"Winter/Summer Peaking",null,"Non-Coincident","Summer"]
[null,null,null,null,"Coincident","Summer"]
[null,null,"Adjustments - Embedded generation","MW","Non-Coincident",0]
[null,null,null,null,"Coincident",0]
[null,null,"Weather Corrected MD 10% POE","MW","Non-Coincident"]
[null,null,null,null,"Coincident"]
[null,null,"Weather Corrected MD 10% POE","MVA","Non-Coincident"]
[null,null,null,null,"Coincident"]
[null,null,"Weather Corrected MD 50% POE","MW","Non-Coincident"]
[null,null,null,null,"Coincident"]
[null,null,"Weather Corrected MD 50% POE","MVA","Non-Coincident"]
[null,null,null,null,"Coincident"]
[null,"Braemar (Kumbarilla Park)","Connection Point Rating","MVA","Non-Coincident"]
[null,null,null,null,"Coincident"]
[null,null,"Raw Adjusted MD","MW","Non-Coincident"]
[null,null,null,null,"Coincident"]
[null,null,"Raw Adjusted MD","MVA","Non-Coincident"]
[null,null,null,null,"Coincident"]
[null,null,"Date MD occurred",null,"Non-Coincident","2017-10-28"]
[null,null,null,null,"Coincident","2018-02-14"]
[null,null,"Half hour time period MD occurred",null,"Non-Coincident","17:00:00"]
[null,null,null,null,"Coincident","17:00:00"]
[null,null,"Winter/Summer Peaking",null,"Non-Coincident","Summer"]
[null,null,null,null,"Coincident","Summer"]
[null,null,"Adjustments - Embedded generation","MW","Non-Coincident",0]
[null,null,null,null,"Coincident",0]
[null,null,"Weather Corrected MD 10% POE","MW","Non-Coincident"]
[null,null,null,null,"Coincident"]
[null,null,"Weather Corrected MD 10% POE","MVA","Non-Coincident"]
[null,null,null,null,"Coincident"]
[null,null,"Weather Corrected MD 50% POE","MW","Non-Coincident"]
[null,null,null,null,"Coincident"]
[null,null,"Weather Corrected MD 50% POE","MVA","Non-Coincident"]
[null,null,null,null,"Coincident"]
[null,"Pandoin (132)","Connection Point Rating","MVA","Non-Coincident",365.80913055854688]
[null,null,null,null,"Coincident",365.80913055854688]
[null,null,"Raw Adjusted MD","MW","Non-Coincident",0]
[null,null,null,null,"Coincident",0]
[null,null,"Raw Adjusted MD","MVA","Non-Coincident",0]
[null,null,null,null,"Coincident",0]
[null,null,"Date MD occurred",null,"Non-Coincident","00:00:00"]
[null,null,null,null,"Coincident","00:00:00"]
[null,null,"Half hour time period MD occurred",null,"Non-Coincident","00:00:00"]
[null,null,null,null,"Coincident","00:00:00"]
[null,null,"Winter/Summer Peaking",null,"Non-Coincident","Summer"]
[null,null,null,null,"Coincident","Summer"]
[null,null,"Adjustments - Embedded generation","MW","Non-Coincident",0]
[null,null,null,null,"Coincident",0]
[null,null,"Weather Corrected MD 10% POE","MW","Non-Coincident",0]
[null,null,null,null,"Coincident",0]
[null,null,"Weather Corrected MD 10% POE","MVA","Non-Coincident",0]
[null,null,null,null,"Coincident",0]
[null,null,"Weather Corrected MD 50% POE","MW","Non-Coincident",0]
[null,null,null,null,"Coincident",0]
[null,null,"Weather Corrected MD 50% POE","MVA","Non-Coincident",0]
[null,null,null,null,"Coincident",0]
[null,"Wandoan South (66)","Connection Point Rating","MVA","Non-Coincident",120.50000000000001]
[null,null,null,null,"Coincident",120.50000000000001]
[null,null,"Raw Adjusted MD","MW","Non-Coincident",0]
[null,null,null,null,"Coincident",0]
[null,null,"Raw Adjusted MD","MVA","Non-Coincident",0]
[null,null,null,null,"Coincident",0]
[null,null,"Date MD occurred",null,"Non-Coincident","00:00:00"]
[null,null,null,null,"Coincident","00:00:00"]
[null,null,"Half hour time period MD occurred",null,"Non-Coincident","00:00:00"]
[null,null,null,null,"Coincident","00:00:00"]
[null,null,"Winter/Summer Peaking",null,"Non-Coincident","Summer"]
[null,null,null,null,"Coincident","Summer"]
[null,null,"Adjustments - Embedded generation","MW","Non-Coincident",0]
[null,null,null,null,"Coincident",0]
[null,null,"Weather Corrected MD 10% POE","MW","Non-Coincident",0]
[null,null,null,null,"Coincident",0]
[null,null,"Weather Corrected MD 10% POE","MVA","Non-Coincident",0]
[null,null,null,null,"Coincident",0]
[null,null,"Weather Corrected MD 50% POE","MW","Non-Coincident",0]
[null,null,null,null,"Coincident",0]
[null,null,"Weather Corrected MD 50% POE","MVA","Non-Coincident",0]
[null,null,null,null,"Coincident",0]
[null,"Eagle Downs","Connection Point Rating","MVA","Non-Coincident"]
[null,null,null,null,"Coincident"]
[null,null,"Raw Adjusted MD","MW","Non-Coincident"]
[null,null,null,null,"Coincident"]
[null,null,"Raw Adjusted MD","MVA","Non-Coincident"]
[null,null,null,null,"Coincident"]
[null,null,"Date MD occurred",null,"Non-Coincident","2017-11-09"]
[null,null,null,null,"Coincident","2018-02-14"]
[null,null,"Half hour time period MD occurred",null,"Non-Coincident","12:30:00"]
[null,null,null,null,"Coincident","17:00:00"]
[null,null,"Winter/Summer Peaking",null,"Non-Coincident","Summer"]
[null,null,null,null,"Coincident","Summer"]
[null,null,"Adjustments - Embedded generation","MW","Non-Coincident"]
[null,null,null,null,"Coincident"]
[null,null,"Weather Corrected MD 10% POE","MW","Non-Coincident"]
[null,null,null,null,"Coincident"]
[null,null,"Weather Corrected MD 10% POE","MVA","Non-Coincident"]
[null,null,null,null,"Coincident"]
[null,null,"Weather Corrected MD 50% POE","MW","Non-Coincident"]
[null,null,null,null,"Coincident"]
[null,null,"Weather Corrected MD 50% POE","MVA","Non-Coincident"]
[null,null,null,null,"Coincident"]
[null,"Wotonga (Rail)","Connection Point Rating","MVA","Non-Coincident"]
[null,null,null,null,"Coincident"]
[null,null,"Raw Adjusted MD","MW","Non-Coincident"]
[null,null,null,null,"Coincident"]
[null,null,"Raw Adjusted MD","MVA","Non-Coincident"]
[null,null,null,null,"Coincident"]
[null,null,"Date MD occurred",null,"Non-Coincident","2018-02-11"]
[null,null,null,null,"Coincident","2018-02-14"]
[null,null,"Half hour time period MD occurred",null,"Non-Coincident","08:00:00"]
[null,null,null,null,"Coincident","17:00:00"]
[null,null,"Winter/Summer Peaking",null,"Non-Coincident","Summer"]
[null,null,null,null,"Coincident","Summer"]
[null,null,"Adjustments - Embedded generation","MW","Non-Coincident",0]
[null,null,null,null,"Coincident",0]
[null,null,"Weather Corrected MD 10% POE","MW","Non-Coincident"]
[null,null,null,null,"Coincident"]
[null,null,"Weather Corrected MD 10% POE","MVA","Non-Coincident"]
[null,null,null,null,"Coincident"]
[null,null,"Weather Corrected MD 50% POE","MW","Non-Coincident"]
[null,null,null,null,"Coincident"]
[null,null,"Weather Corrected MD 50% POE","MVA","Non-Coincident"]
[null,null,null,null,"Coincident"]
[null,"Middle Ridge (Energex)","Connection Point Rating","MVA","Non-Coincident",381.88186923246303]
[null,null,null,null,"Coincident",381.88186923246303]
[null,null,"Raw Adjusted MD","MW","Non-Coincident",106.64202]
[null,null,null,null,"Coincident",47.596738000000002]
[null,null,"Raw Adjusted MD","MVA","Non-Coincident",106.642538]
[null,null,null,null,"Coincident",48.331766000000002]
[null,null,"Date MD occurred",null,"Non-Coincident","2018-01-31"]
[null,null,null,null,"Coincident","2018-02-14"]
[null,null,"Half hour time period MD occurred",null,"Non-Coincident","16:00:00"]
[null,null,null,null,"Coincident","17:00:00"]
[null,null,"Winter/Summer Peaking",null,"Non-Coincident","Summer"]
[null,null,null,null,"Coincident","Summer"]
[null,null,"Adjustments - Embedded generation","MW","Non-Coincident",0]
[null,null,null,null,"Coincident",0]
[null,null,"Weather Corrected MD 10% POE","MW","Non-Coincident",123.96181977942257]
[null,null,null,null,"Coincident",50.108417864259998]
[null,null,"Weather Corrected MD 10% POE","MVA","Non-Coincident",123.96242190813925]
[null,null,null,null,"Coincident",50.88223329182]
[null,null,"Weather Corrected MD 50% POE","MW","Non-Coincident",112.87844509292998]
[null,null,null,null,"Coincident",45.881351562480006]
[null,null,"Weather Corrected MD 50% POE","MVA","Non-Coincident",112.87899338556883]
[null,null,null,null,"Coincident",46.589889153360005]
[null,"Middle Ridge (Ergon)","Connection Point Rating","MVA","Non-Coincident",1673.7672978941844]
[null,null,null,null,"Coincident",1673.7672978941844]
[null,null,"Raw Adjusted MD","MW","Non-Coincident",249.45743200000001]
[null,null,null,null,"Coincident",236.04051799999999]
[null,null,"Raw Adjusted MD","MVA","Non-Coincident",252.90685999999999]
[null,null,null,null,"Coincident",243.646051]
[null,null,"Date MD occurred",null,"Non-Coincident","2018-06-18"]
[null,null,null,null,"Coincident","2018-02-14"]
[null,null,"Half hour time period MD occurred",null,"Non-Coincident","18:00:00"]
[null,null,null,null,"Coincident","17:00:00"]
[null,null,"Winter/Summer Peaking",null,"Non-Coincident","Winter"]
[null,null,null,null,"Coincident","Summer"]
[null,null,"Adjustments - Embedded generation","MW","Non-Coincident",0]
[null,null,null,null,"Coincident",0]
[null,null,"Weather Corrected MD 10% POE","MW","Non-Coincident",259.73878840200632]
[null,null,null,null,"Coincident",248.49637613485999]
[null,null,"Weather Corrected MD 10% POE","MVA","Non-Coincident",263.33038413927]
[null,null,null,null,"Coincident",256.50325311127]
[null,null,"Weather Corrected MD 50% POE","MW","Non-Coincident",246.83937054542287]
[null,null,null,null,"Coincident",227.53361773128]
[null,null,"Weather Corrected MD 50% POE","MVA","Non-Coincident",250.25259671966549]
[null,null,null,null,"Coincident",234.86504732196002]
[null,"Woolooga (Energex)","Connection Point Rating","MVA","Non-Coincident",823.07054375673044]
[null,null,null,null,"Coincident",823.07054375673044]
[null,null,"Raw Adjusted MD","MW","Non-Coincident",199.976202]
[null,null,null,null,"Coincident",198.94496799999999]
[null,null,"Raw Adjusted MD","MVA","Non-Coincident",203.55018100000001]
[null,null,null,null,"Coincident",200.16275300000001]
[null,null,"Date MD occurred",null,"Non-Coincident","2018-01-12"]
[null,null,null,null,"Coincident","2018-02-14"]
[null,null,"Half hour time period MD occurred",null,"Non-Coincident","17:00:00"]
[null,null,null,null,"Coincident","17:00:00"]
[null,null,"Winter/Summer Peaking",null,"Non-Coincident","Summer"]
[null,null,null,null,"Coincident","Summer"]
[null,null,"Adjustments - Embedded generation","MW","Non-Coincident",0]
[null,null,null,null,"Coincident",0]
[null,null,"Weather Corrected MD 10% POE","MW","Non-Coincident",262.31601163176555]
[null,null,null,null,"Coincident",209.44329396135998]
[null,null,"Weather Corrected MD 10% POE","MVA","Non-Coincident",267.00412905553623]
[null,null,null,null,"Coincident",210.72534147581001]
[null,null,"Weather Corrected MD 50% POE","MW","Non-Coincident",232.47131673186385]
[null,null,null,null,"Coincident",191.77499135328]
[null,null,"Weather Corrected MD 50% POE","MVA","Non-Coincident",236.62604912398135]
[null,null,null,null,"Coincident",192.94888738188001]
[null,"Woolooga (Ergon)","Connection Point Rating","MVA","Non-Coincident",714.24232741556273]
[null,null,null,null,"Coincident",714.24232741556273]
[null,null,"Raw Adjusted MD","MW","Non-Coincident",18.78651]
[null,null,null,null,"Coincident",6.6868100000000004]
[null,null,"Raw Adjusted MD","MVA","Non-Coincident",18.797619000000001]
[null,null,null,null,"Coincident",15.823665]
[null,null,"Date MD occurred",null,"Non-Coincident","2017-08-16"]
[null,null,null,null,"Coincident","2018-02-14"]
[null,null,"Half hour time period MD occurred",null,"Non-Coincident","18:30:00"]
[null,null,null,null,"Coincident","17:00:00"]
[null,null,"Winter/Summer Peaking",null,"Non-Coincident","Winter"]
[null,null,null,null,"Coincident","Summer"]
[null,null,"Adjustments - Embedded generation","MW","Non-Coincident",0]
[null,null,null,null,"Coincident",0]
[null,null,"Weather Corrected MD 10% POE","MW","Non-Coincident",20.85411003080964]
[null,null,null,null,"Coincident",7.0396729637000002]
[null,null,"Weather Corrected MD 10% POE","MVA","Non-Coincident",20.866441661768892]
[null,null,null,null,"Coincident",16.658679802049999]
[null,null,"Weather Corrected MD 50% POE","MW","Non-Coincident",18.06057562922895]
[null,null,null,null,"Coincident",6.445817367600001]
[null,null,"Weather Corrected MD 50% POE","MVA","Non-Coincident",18.071255363499187]
[null,null,null,null,"Coincident",15.2533801134]
[null,"Alligator Creek (132)","Connection Point Rating","MVA","Non-Coincident",271.89220890177194]
[null,null,null,null,"Coincident",271.89220890177194]
[null,null,"Raw Adjusted MD","MW","Non-Coincident",39.739539999999998]
[null,null,null,null,"Coincident",28.655124000000001]
[null,null,"Raw Adjusted MD","MVA","Non-Coincident",41.032873000000002]
[null,null,null,null,"Coincident",29.781599]
[null,null,"Date MD occurred",null,"Non-Coincident","2018-01-29"]
[null,null,null,null,"Coincident","2018-02-14"]
[null,null,"Half hour time period MD occurred",null,"Non-Coincident","20:00:00"]
[null,null,null,null,"Coincident","17:00:00"]
[null,null,"Winter/Summer Peaking",null,"Non-Coincident","Summer"]
[null,null,null,null,"Coincident","Summer"]
[null,null,"Adjustments - Embedded generation","MW","Non-Coincident",0]
[null,null,null,null,"Coincident",0]
[null,null,"Weather Corrected MD 10% POE","MW","Non-Coincident",42.70017]
[null,null,null,null,"Coincident",30.167254893479999]
[null,null,"Weather Corrected MD 10% POE","MVA","Non-Coincident",44.089857423825492]
[null,null,null,null,"Coincident",31.35317397923]
[null,null,"Weather Corrected MD 50% POE","MW","Non-Coincident",39.739539999999998]
[null,null,null,null,"Coincident",27.622393331040001]
[null,null,"Weather Corrected MD 50% POE","MVA","Non-Coincident",41.032873000000002]
[null,null,null,null,"Coincident",28.708270172040002]
[null,"Alligator Creek (Rail 132)","Connection Point Rating","MVA","Non-Coincident"]
[null,null,null,null,"Coincident"]
[null,null,"Raw Adjusted MD","MW","Non-Coincident"]
[null,null,null,null,"Coincident"]
[null,null,"Raw Adjusted MD","MVA","Non-Coincident"]
[null,null,null,null,"Coincident"]
[null,null,"Date MD occurred",null,"Non-Coincident","2017-10-05"]
[null,null,null,null,"Coincident","2018-02-14"]
[null,null,"Half hour time period MD occurred",null,"Non-Coincident","18:00:00"]
[null,null,null,null,"Coincident","17:00:00"]
[null,null,"Winter/Summer Peaking",null,"Non-Coincident","Summer"]
[null,null,null,null,"Coincident","Summer"]
[null,null,"Adjustments - Embedded generation","MW","Non-Coincident",0]
[null,null,null,null,"Coincident",0]
[null,null,"Weather Corrected MD 10% POE","MW","Non-Coincident"]
[null,null,null,null,"Coincident"]
[null,null,"Weather Corrected MD 10% POE","MVA","Non-Coincident"]
[null,null,null,null,"Coincident"]
[null,null,"Weather Corrected MD 50% POE","MW","Non-Coincident"]
[null,null,null,null,"Coincident"]
[null,null,"Weather Corrected MD 50% POE","MVA","Non-Coincident"]
[null,null,null,null,"Coincident"]
[null,"Blackwater (Rail 132)","Connection Point Rating","MVA","Non-Coincident",480.12448385809273]
[null,null,null,null,"Coincident",480.12448385809273]
[null,null,"Raw Adjusted MD","MW","Non-Coincident"]
[null,null,null,null,"Coincident"]
[null,null,"Raw Adjusted MD","MVA","Non-Coincident"]
[null,null,null,null,"Coincident"]
[null,null,"Date MD occurred",null,"Non-Coincident","2018-04-21"]
[null,null,null,null,"Coincident","2018-02-14"]
[null,null,"Half hour time period MD occurred",null,"Non-Coincident","02:30:00"]
[null,null,null,null,"Coincident","17:00:00"]
[null,null,"Winter/Summer Peaking",null,"Non-Coincident","Winter"]
[null,null,null,null,"Coincident","Summer"]
[null,null,"Adjustments - Embedded generation","MW","Non-Coincident",0]
[null,null,null,null,"Coincident",0]
[null,null,"Weather Corrected MD 10% POE","MW","Non-Coincident"]
[null,null,null,null,"Coincident"]
[null,null,"Weather Corrected MD 10% POE","MVA","Non-Coincident"]
[null,null,null,null,"Coincident"]
[null,null,"Weather Corrected MD 50% POE","MW","Non-Coincident"]
[null,null,null,null,"Coincident"]
[null,null,"Weather Corrected MD 50% POE","MVA","Non-Coincident"]
[null,null,null,null,"Coincident"]
[null,"Blackwater (Rolleston 132)","Connection Point Rating","MVA","Non-Coincident",182.90456527927344]
[null,null,null,null,"Coincident",182.90456527927344]
[null,null,"Raw Adjusted MD","MW","Non-Coincident",26.841045999999999]
[null,null,null,null,"Coincident",12.015452]
[null,null,"Raw Adjusted MD","MVA","Non-Coincident",28.043385000000001]
[null,null,null,null,"Coincident",13.593678000000001]
[null,null,"Date MD occurred",null,"Non-Coincident","2017-07-29"]
[null,null,null,null,"Coincident","2018-02-14"]
[null,null,"Half hour time period MD occurred",null,"Non-Coincident","21:30:00"]
[null,null,null,null,"Coincident","17:00:00"]
[null,null,"Winter/Summer Peaking",null,"Non-Coincident","Winter"]
[null,null,null,null,"Coincident","Summer"]
[null,null,"Adjustments - Embedded generation","MW","Non-Coincident",0]
[null,null,null,null,"Coincident",0]
[null,null,"Weather Corrected MD 10% POE","MW","Non-Coincident",34.868120961841107]
[null,null,null,null,"Coincident",12.649507402039999]
[null,null,"Weather Corrected MD 10% POE","MVA","Non-Coincident",36.430031093403755]
[null,null,null,null,"Coincident",14.311016388060001]
[null,null,"Weather Corrected MD 50% POE","MW","Non-Coincident",26.841045999999999]
[null,null,null,null,"Coincident",11.582415109919999]
[null,null,"Weather Corrected MD 50% POE","MVA","Non-Coincident",28.043385000000001]
[null,null,null,null,"Coincident",13.103761844880001]
[null,"Wandoan South (275)","Connection Point Rating","MVA","Non-Coincident"]
[null,null,null,null,"Coincident"]
[null,null,"Raw Adjusted MD","MW","Non-Coincident"]
[null,null,null,null,"Coincident"]
[null,null,"Raw Adjusted MD","MVA","Non-Coincident"]
[null,null,null,null,"Coincident"]
[null,null,"Date MD occurred",null,"Non-Coincident","2018-05-23"]
[null,null,null,null,"Coincident","2018-02-14"]
[null,null,"Half hour time period MD occurred",null,"Non-Coincident","18:30:00"]
[null,null,null,null,"Coincident","17:00:00"]
[null,null,"Winter/Summer Peaking",null,"Non-Coincident","Winter"]
[null,null,null,null,"Coincident","Summer"]
[null,null,"Adjustments - Embedded generation","MW","Non-Coincident",0]
[null,null,null,null,"Coincident",0]
[null,null,"Weather Corrected MD 10% POE","MW","Non-Coincident"]
[null,null,null,null,"Coincident"]
[null,null,"Weather Corrected MD 10% POE","MVA","Non-Coincident"]
[null,null,null,null,"Coincident"]
[null,null,"Weather Corrected MD 50% POE","MW","Non-Coincident"]
[null,null,null,null,"Coincident"]
[null,null,"Weather Corrected MD 50% POE","MVA","Non-Coincident"]
[null,null,null,null,"Coincident"]
[null,"Wandoan South (132)","Connection Point Rating","MVA","Non-Coincident"]
[null,null,null,null,"Coincident"]
[null,null,"Raw Adjusted MD","MW","Non-Coincident"]
[null,null,null,null,"Coincident"]
[null,null,"Raw Adjusted MD","MVA","Non-Coincident"]
[null,null,null,null,"Coincident"]
[null,null,"Date MD occurred",null,"Non-Coincident","2017-12-24"]
[null,null,null,null,"Coincident","2018-02-14"]
[null,null,"Half hour time period MD occurred",null,"Non-Coincident","16:00:00"]
[null,null,null,null,"Coincident","17:00:00"]
[null,null,"Winter/Summer Peaking",null,"Non-Coincident","Summer"]
[null,null,null,null,"Coincident","Summer"]
[null,null,"Adjustments - Embedded generation","MW","Non-Coincident",0]
[null,null,null,null,"Coincident",0]
[null,null,"Weather Corrected MD 10% POE","MW","Non-Coincident"]
[null,null,null,null,"Coincident"]
[null,null,"Weather Corrected MD 10% POE","MVA","Non-Coincident"]
[null,null,null,null,"Coincident"]
[null,null,"Weather Corrected MD 50% POE","MW","Non-Coincident"]
[null,null,null,null,"Coincident"]
[null,null,"Weather Corrected MD 50% POE","MVA","Non-Coincident"]
[null,null,null,null,"Coincident"]
[null,"QGC Columboola","Connection Point Rating","MVA","Non-Coincident"]
[null,null,null,null,"Coincident"]
[null,null,"Raw Adjusted MD","MW","Non-Coincident"]
[null,null,null,null,"Coincident"]
[null,null,"Raw Adjusted MD","MVA","Non-Coincident"]
[null,null,null,null,"Coincident"]
[null,null,"Date MD occurred",null,"Non-Coincident","2017-09-19"]
[null,null,null,null,"Coincident","2018-02-14"]
[null,null,"Half hour time period MD occurred",null,"Non-Coincident","15:30:00"]
[null,null,null,null,"Coincident","17:00:00"]
[null,null,"Winter/Summer Peaking",null,"Non-Coincident","Winter"]
[null,null,null,null,"Coincident","Summer"]
[null,null,"Adjustments - Embedded generation","MW","Non-Coincident",0]
[null,null,null,null,"Coincident",0]
[null,null,"Weather Corrected MD 10% POE","MW","Non-Coincident"]
[null,null,null,null,"Coincident"]
[null,null,"Weather Corrected MD 10% POE","MVA","Non-Coincident"]
[null,null,null,null,"Coincident"]
[null,null,"Weather Corrected MD 50% POE","MW","Non-Coincident"]
[null,null,null,null,"Coincident"]
[null,null,"Weather Corrected MD 50% POE","MVA","Non-Coincident"]
[null,null,null,null,"Coincident"]
[null,"<Enter connection point name>","Connection Point Rating","MVA","Non-Coincident"]
[null,null,null,null,"Coincident"]
[null,null,"Raw Adjusted MD","MW","Non-Coincident"]
[null,null,null,null,"Coincident"]
[null,null,"Raw Adjusted MD","MVA","Non-Coincident"]
[null,null,null,null,"Coincident"]
[null,null,"Date MD occurred",null,"Non-Coincident"]
[null,null,null,null,"Coincident"]
[null,null,"Half hour time period MD occurred",null,"Non-Coincident"]
[null,null,null,null,"Coincident"]
[null,null,"Winter/Summer Peaking",null,"Non-Coincident"]
[null,null,null,null,"Coincident"]
[null,null,"Adjustments - Embedded generation","MW","Non-Coincident"]
[null,null,null,null,"Coincident"]
[null,null,"Weather Corrected MD 10% POE","MW","Non-Coincident"]
[null,null,null,null,"Coincident"]
[null,null,"Weather Corrected MD 10% POE","MVA","Non-Coincident"]
[null,null,null,null,"Coincident"]
[null,null,"Weather Corrected MD 50% POE","MW","Non-Coincident"]
[null,null,null,null,"Coincident"]
[null,null,"Weather Corrected MD 50% POE","MVA","Non-Coincident"]
[null,null,null,null,"Coincident"]
[null,"<Enter connection point name>","Connection Point Rating","MVA","Non-Coincident"]
[null,null,null,null,"Coincident"]
[null,null,"Raw Adjusted MD","MW","Non-Coincident"]
[null,null,null,null,"Coincident"]
[null,null,"Raw Adjusted MD","MVA","Non-Coincident"]
[null,null,null,null,"Coincident"]
[null,null,"Date MD occurred",null,"Non-Coincident"]
[null,null,null,null,"Coincident"]
[null,null,"Half hour time period MD occurred",null,"Non-Coincident"]
[null,null,null,null,"Coincident"]
[null,null,"Winter/Summer Peaking",null,"Non-Coincident"]
[null,null,null,null,"Coincident"]
[null,null,"Adjustments - Embedded generation","MW","Non-Coincident"]
[null,null,null,null,"Coincident"]
[null,null,"Weather Corrected MD 10% POE","MW","Non-Coincident"]
[null,null,null,null,"Coincident"]
[null,null,"Weather Corrected MD 10% POE","MVA","Non-Coincident"]
[null,null,null,null,"Coincident"]
[null,null,"Weather Corrected MD 50% POE","MW","Non-Coincident"]
[null,null,null,null,"Coincident"]
[null,null,"Weather Corrected MD 50% POE","MVA","Non-Coincident"]
[null,null,null,null,"Coincident"]
[null,"<Enter connection point name>","Connection Point Rating","MVA","Non-Coincident"]
[null,null,null,null,"Coincident"]
[null,null,"Raw Adjusted MD","MW","Non-Coincident"]
[null,null,null,null,"Coincident"]
[null,null,"Raw Adjusted MD","MVA","Non-Coincident"]
[null,null,null,null,"Coincident"]
[null,null,"Date MD occurred",null,"Non-Coincident"]
[null,null,null,null,"Coincident"]
[null,null,"Half hour time period MD occurred",null,"Non-Coincident"]
[null,null,null,null,"Coincident"]
[null,null,"Winter/Summer Peaking",null,"Non-Coincident"]
[null,null,null,null,"Coincident"]
[null,null,"Adjustments - Embedded generation","MW","Non-Coincident"]
[null,null,null,null,"Coincident"]
[null,null,"Weather Corrected MD 10% POE","MW","Non-Coincident"]
[null,null,null,null,"Coincident"]
[null,null,"Weather Corrected MD 10% POE","MVA","Non-Coincident"]
[null,null,null,null,"Coincident"]
[null,null,"Weather Corrected MD 50% POE","MW","Non-Coincident"]
[null,null,null,null,"Coincident"]
[null,null,"Weather Corrected MD 50% POE","MVA","Non-Coincident"]
[null,null,null,null,"Coincident"]
[null,"<Enter connection point name>","Connection Point Rating","MVA","Non-Coincident"]
[null,null,null,null,"Coincident"]
[null,null,"Raw Adjusted MD","MW","Non-Coincident"]
[null,null,null,null,"Coincident"]
[null,null,"Raw Adjusted MD","MVA","Non-Coincident"]
[null,null,null,null,"Coincident"]
[null,null,"Date MD occurred",null,"Non-Coincident"]
[null,null,null,null,"Coincident"]
[null,null,"Half hour time period MD occurred",null,"Non-Coincident"]
[null,null,null,null,"Coincident"]
[null,null,"Winter/Summer Peaking",null,"Non-Coincident"]
[null,null,null,null,"Coincident"]
[null,null,"Adjustments - Embedded generation","MW","Non-Coincident"]
[null,null,null,null,"Coincident"]
[null,null,"Weather Corrected MD 10% POE","MW","Non-Coincident"]
[null,null,null,null,"Coincident"]
[null,null,"Weather Corrected MD 10% POE","MVA","Non-Coincident"]
[null,null,null,null,"Coincident"]
[null,null,"Weather Corrected MD 50% POE","MW","Non-Coincident"]
[null,null,null,null,"Coincident"]
[null,null,"Weather Corrected MD 50% POE","MVA","Non-Coincident"]
[null,null,null,null,"Coincident"]
[null,"<Enter connection point name>","Connection Point Rating","MVA","Non-Coincident"]
[null,null,null,null,"Coincident"]
[null,null,"Raw Adjusted MD","MW","Non-Coincident"]
[null,null,null,null,"Coincident"]
[null,null,"Raw Adjusted MD","MVA","Non-Coincident"]
[null,null,null,null,"Coincident"]
[null,null,"Date MD occurred",null,"Non-Coincident"]
[null,null,null,null,"Coincident"]
[null,null,"Half hour time period MD occurred",null,"Non-Coincident"]
[null,null,null,null,"Coincident"]
[null,null,"Winter/Summer Peaking",null,"Non-Coincident"]
[null,null,null,null,"Coincident"]
[null,null,"Adjustments - Embedded generation","MW","Non-Coincident"]
[null,null,null,null,"Coincident"]
[null,null,"Weather Corrected MD 10% POE","MW","Non-Coincident"]
[null,null,null,null,"Coincident"]
[null,null,"Weather Corrected MD 10% POE","MVA","Non-Coincident"]
[null,null,null,null,"Coincident"]
[null,null,"Weather Corrected MD 50% POE","MW","Non-Coincident"]
[null,null,null,null,"Coincident"]
[null,null,"Weather Corrected MD 50% POE","MVA","Non-Coincident"]
[null,null,null,null,"Coincident"]
[null,"<Enter connection point name>","Connection Point Rating","MVA","Non-Coincident"]
[null,null,null,null,"Coincident"]
[null,null,"Raw Adjusted MD","MW","Non-Coincident"]
[null,null,null,null,"Coincident"]
[null,null,"Raw Adjusted MD","MVA","Non-Coincident"]
[null,null,null,null,"Coincident"]
[null,null,"Date MD occurred",null,"Non-Coincident"]
[null,null,null,null,"Coincident"]
[null,null,"Half hour time period MD occurred",null,"Non-Coincident"]
[null,null,null,null,"Coincident"]
[null,null,"Winter/Summer Peaking",null,"Non-Coincident"]
[null,null,null,null,"Coincident"]
[null,null,"Adjustments - Embedded generation","MW","Non-Coincident"]
[null,null,null,null,"Coincident"]
[null,null,"Weather Corrected MD 10% POE","MW","Non-Coincident"]
[null,null,null,null,"Coincident"]
[null,null,"Weather Corrected MD 10% POE","MVA","Non-Coincident"]
[null,null,null,null,"Coincident"]
[null,null,"Weather Corrected MD 50% POE","MW","Non-Coincident"]
[null,null,null,null,"Coincident"]
[null,null,"Weather Corrected MD 50% POE","MVA","Non-Coincident"]
[null,null,null,null,"Coincident"]
[null,"<Enter connection point name>","Connection Point Rating","MVA","Non-Coincident"]
[null,null,null,null,"Coincident"]
[null,null,"Raw Adjusted MD","MW","Non-Coincident"]
[null,null,null,null,"Coincident"]
[null,null,"Raw Adjusted MD","MVA","Non-Coincident"]
[null,null,null,null,"Coincident"]
[null,null,"Date MD occurred",null,"Non-Coincident"]
[null,null,null,null,"Coincident"]
[null,null,"Half hour time period MD occurred",null,"Non-Coincident"]
[null,null,null,null,"Coincident"]
[null,null,"Winter/Summer Peaking",null,"Non-Coincident"]
[null,null,null,null,"Coincident"]
[null,null,"Adjustments - Embedded generation","MW","Non-Coincident"]
[null,null,null,null,"Coincident"]
[null,null,"Weather Corrected MD 10% POE","MW","Non-Coincident"]
[null,null,null,null,"Coincident"]
[null,null,"Weather Corrected MD 10% POE","MVA","Non-Coincident"]
[null,null,null,null,"Coincident"]
[null,null,"Weather Corrected MD 50% POE","MW","Non-Coincident"]
[null,null,null,null,"Coincident"]
[null,null,"Weather Corrected MD 50% POE","MVA","Non-Coincident"]
[null,null,null,null,"Coincident"]
[null,"<Enter connection point name>","Connection Point Rating","MVA","Non-Coincident"]
[null,null,null,null,"Coincident"]
[null,null,"Raw Adjusted MD","MW","Non-Coincident"]
[null,null,null,null,"Coincident"]
[null,null,"Raw Adjusted MD","MVA","Non-Coincident"]
[null,null,null,null,"Coincident"]
[null,null,"Date MD occurred",null,"Non-Coincident"]
[null,null,null,null,"Coincident"]
[null,null,"Half hour time period MD occurred",null,"Non-Coincident"]
[null,null,null,null,"Coincident"]
[null,null,"Winter/Summer Peaking",null,"Non-Coincident"]
[null,null,null,null,"Coincident"]
[null,null,"Adjustments - Embedded generation","MW","Non-Coincident"]
[null,null,null,null,"Coincident"]
[null,null,"Weather Corrected MD 10% POE","MW","Non-Coincident"]
[null,null,null,null,"Coincident"]
[null,null,"Weather Corrected MD 10% POE","MVA","Non-Coincident"]
[null,null,null,null,"Coincident"]
[null,null,"Weather Corrected MD 50% POE","MW","Non-Coincident"]
[null,null,null,null,"Coincident"]
[null,null,"Weather Corrected MD 50% POE","MVA","Non-Coincident"]
[null,null,null,null,"Coincident"]
[null,"<Enter connection point name>","Connection Point Rating","MVA","Non-Coincident"]
[null,null,null,null,"Coincident"]
[null,null,"Raw Adjusted MD","MW","Non-Coincident"]
[null,null,null,null,"Coincident"]
[null,null,"Raw Adjusted MD","MVA","Non-Coincident"]
[null,null,null,null,"Coincident"]
[null,null,"Date MD occurred",null,"Non-Coincident"]
[null,null,null,null,"Coincident"]
[null,null,"Half hour time period MD occurred",null,"Non-Coincident"]
[null,null,null,null,"Coincident"]
[null,null,"Winter/Summer Peaking",null,"Non-Coincident"]
[null,null,null,null,"Coincident"]
[null,null,"Adjustments - Embedded generation","MW","Non-Coincident"]
[null,null,null,null,"Coincident"]
[null,null,"Weather Corrected MD 10% POE","MW","Non-Coincident"]
[null,null,null,null,"Coincident"]
[null,null,"Weather Corrected MD 10% POE","MVA","Non-Coincident"]
[null,null,null,null,"Coincident"]
[null,null,"Weather Corrected MD 50% POE","MW","Non-Coincident"]
[null,null,null,null,"Coincident"]
[null,null,"Weather Corrected MD 50% POE","MVA","Non-Coincident"]
[null,null,null,null,"Coincident"]
[null,"<Enter connection point name>","Connection Point Rating","MVA","Non-Coincident"]
[null,null,null,null,"Coincident"]
[null,null,"Raw Adjusted MD","MW","Non-Coincident"]
[null,null,null,null,"Coincident"]
[null,null,"Raw Adjusted MD","MVA","Non-Coincident"]
[null,null,null,null,"Coincident"]
[null,null,"Date MD occurred",null,"Non-Coincident"]
[null,null,null,null,"Coincident"]
[null,null,"Half hour time period MD occurred",null,"Non-Coincident"]
[null,null,null,null,"Coincident"]
[null,null,"Winter/Summer Peaking",null,"Non-Coincident"]
[null,null,null,null,"Coincident"]
[null,null,"Adjustments - Embedded generation","MW","Non-Coincident"]
[null,null,null,null,"Coincident"]
[null,null,"Weather Corrected MD 10% POE","MW","Non-Coincident"]
[null,null,null,null,"Coincident"]
[null,null,"Weather Corrected MD 10% POE","MVA","Non-Coincident"]
[null,null,null,null,"Coincident"]
[null,null,"Weather Corrected MD 50% POE","MW","Non-Coincident"]
[null,null,null,null,"Coincident"]
[null,null,"Weather Corrected MD 50% POE","MVA","Non-Coincident"]
[null,null,null,null,"Coincident"]
[null,"<Enter connection point name>","Connection Point Rating","MVA","Non-Coincident"]
[null,null,null,null,"Coincident"]
[null,null,"Raw Adjusted MD","MW","Non-Coincident"]
[null,null,null,null,"Coincident"]
[null,null,"Raw Adjusted MD","MVA","Non-Coincident"]
[null,null,null,null,"Coincident"]
[null,null,"Date MD occurred",null,"Non-Coincident"]
[null,null,null,null,"Coincident"]
[null,null,"Half hour time period MD occurred",null,"Non-Coincident"]
[null,null,null,null,"Coincident"]
[null,null,"Winter/Summer Peaking",null,"Non-Coincident"]
[null,null,null,null,"Coincident"]
[null,null,"Adjustments - Embedded generation","MW","Non-Coincident"]
[null,null,null,null,"Coincident"]
[null,null,"Weather Corrected MD 10% POE","MW","Non-Coincident"]
[null,null,null,null,"Coincident"]
[null,null,"Weather Corrected MD 10% POE","MVA","Non-Coincident"]
[null,null,null,null,"Coincident"]
[null,null,"Weather Corrected MD 50% POE","MW","Non-Coincident"]
[null,null,null,null,"Coincident"]
[null,null,"Weather Corrected MD 50% POE","MVA","Non-Coincident"]
[null,null,null,null,"Coincident"]
[null,"<Enter connection point name>","Connection Point Rating","MVA","Non-Coincident"]
[null,null,null,null,"Coincident"]
[null,null,"Raw Adjusted MD","MW","Non-Coincident"]
[null,null,null,null,"Coincident"]
[null,null,"Raw Adjusted MD","MVA","Non-Coincident"]
[null,null,null,null,"Coincident"]
[null,null,"Date MD occurred",null,"Non-Coincident"]
[null,null,null,null,"Coincident"]
[null,null,"Half hour time period MD occurred",null,"Non-Coincident"]
[null,null,null,null,"Coincident"]
[null,null,"Winter/Summer Peaking",null,"Non-Coincident"]
[null,null,null,null,"Coincident"]
[null,null,"Adjustments - Embedded generation","MW","Non-Coincident"]
[null,null,null,null,"Coincident"]
[null,null,"Weather Corrected MD 10% POE","MW","Non-Coincident"]
[null,null,null,null,"Coincident"]
[null,null,"Weather Corrected MD 10% POE","MVA","Non-Coincident"]
[null,null,null,null,"Coincident"]
[null,null,"Weather Corrected MD 50% POE","MW","Non-Coincident"]
[null,null,null,null,"Coincident"]
[null,null,"Weather Corrected MD 50% POE","MVA","Non-Coincident"]
[null,null,null,null,"Coincident"]
[null,"<Enter connection point name>","Connection Point Rating","MVA","Non-Coincident"]
[null,null,null,null,"Coincident"]
[null,null,"Raw Adjusted MD","MW","Non-Coincident"]
[null,null,null,null,"Coincident"]
[null,null,"Raw Adjusted MD","MVA","Non-Coincident"]
[null,null,null,null,"Coincident"]
[null,null,"Date MD occurred",null,"Non-Coincident"]
[null,null,null,null,"Coincident"]
[null,null,"Half hour time period MD occurred",null,"Non-Coincident"]
[null,null,null,null,"Coincident"]
[null,null,"Winter/Summer Peaking",null,"Non-Coincident"]
[null,null,null,null,"Coincident"]
[null,null,"Adjustments - Embedded generation","MW","Non-Coincident"]
[null,null,null,null,"Coincident"]
[null,null,"Weather Corrected MD 10% POE","MW","Non-Coincident"]
[null,null,null,null,"Coincident"]
[null,null,"Weather Corrected MD 10% POE","MVA","Non-Coincident"]
[null,null,null,null,"Coincident"]
[null,null,"Weather Corrected MD 50% POE","MW","Non-Coincident"]
[null,null,null,null,"Coincident"]
[null,null,"Weather Corrected MD 50% POE","MVA","Non-Coincident"]
[null,null,null,null,"Coincident"]
[null,"<Enter connection point name>","Connection Point Rating","MVA","Non-Coincident"]
[null,null,null,null,"Coincident"]
[null,null,"Raw Adjusted MD","MW","Non-Coincident"]
[null,null,null,null,"Coincident"]
[null,null,"Raw Adjusted MD","MVA","Non-Coincident"]
[null,null,null,null,"Coincident"]
[null,null,"Date MD occurred",null,"Non-Coincident"]
[null,null,null,null,"Coincident"]
[null,null,"Half hour time period MD occurred",null,"Non-Coincident"]
[null,null,null,null,"Coincident"]
[null,null,"Winter/Summer Peaking",null,"Non-Coincident"]
[null,null,null,null,"Coincident"]
[null,null,"Adjustments - Embedded generation","MW","Non-Coincident"]
[null,null,null,null,"Coincident"]
[null,null,"Weather Corrected MD 10% POE","MW","Non-Coincident"]
[null,null,null,null,"Coincident"]
[null,null,"Weather Corrected MD 10% POE","MVA","Non-Coincident"]
[null,null,null,null,"Coincident"]
[null,null,"Weather Corrected MD 50% POE","MW","Non-Coincident"]
[null,null,null,null,"Coincident"]
[null,null,"Weather Corrected MD 50% POE","MVA","Non-Coincident"]
[null,null,null,null,"Coincident"]
[null,"<Enter connection point name>","Connection Point Rating","MVA","Non-Coincident"]
[null,null,null,null,"Coincident"]
[null,null,"Raw Adjusted MD","MW","Non-Coincident"]
[null,null,null,null,"Coincident"]
[null,null,"Raw Adjusted MD","MVA","Non-Coincident"]
[null,null,null,null,"Coincident"]
[null,null,"Date MD occurred",null,"Non-Coincident"]
[null,null,null,null,"Coincident"]
[null,null,"Half hour time period MD occurred",null,"Non-Coincident"]
[null,null,null,null,"Coincident"]
[null,null,"Winter/Summer Peaking",null,"Non-Coincident"]
[null,null,null,null,"Coincident"]
[null,null,"Adjustments - Embedded generation","MW","Non-Coincident"]
[null,null,null,null,"Coincident"]
[null,null,"Weather Corrected MD 10% POE","MW","Non-Coincident"]
[null,null,null,null,"Coincident"]
[null,null,"Weather Corrected MD 10% POE","MVA","Non-Coincident"]
[null,null,null,null,"Coincident"]
[null,null,"Weather Corrected MD 50% POE","MW","Non-Coincident"]
[null,null,null,null,"Coincident"]
[null,null,"Weather Corrected MD 50% POE","MVA","Non-Coincident"]
[null,null,null,null,"Coincident"]
[null,"<Enter connection point name>","Connection Point Rating","MVA","Non-Coincident"]
[null,null,null,null,"Coincident"]
[null,null,"Raw Adjusted MD","MW","Non-Coincident"]
[null,null,null,null,"Coincident"]
[null,null,"Raw Adjusted MD","MVA","Non-Coincident"]
[null,null,null,null,"Coincident"]
[null,null,"Date MD occurred",null,"Non-Coincident"]
[null,null,null,null,"Coincident"]
[null,null,"Half hour time period MD occurred",null,"Non-Coincident"]
[null,null,null,null,"Coincident"]
[null,null,"Winter/Summer Peaking",null,"Non-Coincident"]
[null,null,null,null,"Coincident"]
[null,null,"Adjustments - Embedded generation","MW","Non-Coincident"]
[null,null,null,null,"Coincident"]
[null,null,"Weather Corrected MD 10% POE","MW","Non-Coincident"]
[null,null,null,null,"Coincident"]
[null,null,"Weather Corrected MD 10% POE","MVA","Non-Coincident"]
[null,null,null,null,"Coincident"]
[null,null,"Weather Corrected MD 50% POE","MW","Non-Coincident"]
[null,null,null,null,"Coincident"]
[null,null,"Weather Corrected MD 50% POE","MVA","Non-Coincident"]
[null,null,null,null,"Coincident"]
[null,"<Enter connection point name>","Connection Point Rating","MVA","Non-Coincident"]
[null,null,null,null,"Coincident"]
[null,null,"Raw Adjusted MD","MW","Non-Coincident"]
[null,null,null,null,"Coincident"]
[null,null,"Raw Adjusted MD","MVA","Non-Coincident"]
[null,null,null,null,"Coincident"]
[null,null,"Date MD occurred",null,"Non-Coincident"]
[null,null,null,null,"Coincident"]
[null,null,"Half hour time period MD occurred",null,"Non-Coincident"]
[null,null,null,null,"Coincident"]
[null,null,"Winter/Summer Peaking",null,"Non-Coincident"]
[null,null,null,null,"Coincident"]
[null,null,"Adjustments - Embedded generation","MW","Non-Coincident"]
[null,null,null,null,"Coincident"]
[null,null,"Weather Corrected MD 10% POE","MW","Non-Coincident"]
[null,null,null,null,"Coincident"]
[null,null,"Weather Corrected MD 10% POE","MVA","Non-Coincident"]
[null,null,null,null,"Coincident"]
[null,null,"Weather Corrected MD 50% POE","MW","Non-Coincident"]
[null,null,null,null,"Coincident"]
[null,null,"Weather Corrected MD 50% POE","MVA","Non-Coincident"]
[null,null,null,null,"Coincident"]
[null,"<Enter connection point name>","Connection Point Rating","MVA","Non-Coincident"]
[null,null,null,null,"Coincident"]
[null,null,"Raw Adjusted MD","MW","Non-Coincident"]
[null,null,null,null,"Coincident"]
[null,null,"Raw Adjusted MD","MVA","Non-Coincident"]
[null,null,null,null,"Coincident"]
[null,null,"Date MD occurred",null,"Non-Coincident"]
[null,null,null,null,"Coincident"]
[null,null,"Half hour time period MD occurred",null,"Non-Coincident"]
[null,null,null,null,"Coincident"]
[null,null,"Winter/Summer Peaking",null,"Non-Coincident"]
[null,null,null,null,"Coincident"]
[null,null,"Adjustments - Embedded generation","MW","Non-Coincident"]
[null,null,null,null,"Coincident"]
[null,null,"Weather Corrected MD 10% POE","MW","Non-Coincident"]
[null,null,null,null,"Coincident"]
[null,null,"Weather Corrected MD 10% POE","MVA","Non-Coincident"]
[null,null,null,null,"Coincident"]
[null,null,"Weather Corrected MD 50% POE","MW","Non-Coincident"]
[null,null,null,null,"Coincident"]
[null,null,"Weather Corrected MD 50% POE","MVA","Non-Coincident"]
[null,null,null,null,"Coincident"]
[null,"<Enter connection point name>","Connection Point Rating","MVA","Non-Coincident"]
[null,null,null,null,"Coincident"]
[null,null,"Raw Adjusted MD","MW","Non-Coincident"]
[null,null,null,null,"Coincident"]
[null,null,"Raw Adjusted MD","MVA","Non-Coincident"]
[null,null,null,null,"Coincident"]
[null,null,"Date MD occurred",null,"Non-Coincident"]
[null,null,null,null,"Coincident"]
[null,null,"Half hour time period MD occurred",null,"Non-Coincident"]
[null,null,null,null,"Coincident"]
[null,null,"Winter/Summer Peaking",null,"Non-Coincident"]
[null,null,null,null,"Coincident"]
[null,null,"Adjustments - Embedded generation","MW","Non-Coincident"]
[null,null,null,null,"Coincident"]
[null,null,"Weather Corrected MD 10% POE","MW","Non-Coincident"]
[null,null,null,null,"Coincident"]
[null,null,"Weather Corrected MD 10% POE","MVA","Non-Coincident"]
[null,null,null,null,"Coincident"]
[null,null,"Weather Corrected MD 50% POE","MW","Non-Coincident"]
[null,null,null,null,"Coincident"]
[null,null,"Weather Corrected MD 50% POE","MVA","Non-Coincident"]
[null,null,null,null,"Coincident"]
[null,"<Enter connection point name>","Connection Point Rating","MVA","Non-Coincident"]
[null,null,null,null,"Coincident"]
[null,null,"Raw Adjusted MD","MW","Non-Coincident"]
[null,null,null,null,"Coincident"]
[null,null,"Raw Adjusted MD","MVA","Non-Coincident"]
[null,null,null,null,"Coincident"]
[null,null,"Date MD occurred",null,"Non-Coincident"]
[null,null,null,null,"Coincident"]
[null,null,"Half hour time period MD occurred",null,"Non-Coincident"]
[null,null,null,null,"Coincident"]
[null,null,"Winter/Summer Peaking",null,"Non-Coincident"]
[null,null,null,null,"Coincident"]
[null,null,"Adjustments - Embedded generation","MW","Non-Coincident"]
[null,null,null,null,"Coincident"]
[null,null,"Weather Corrected MD 10% POE","MW","Non-Coincident"]
[null,null,null,null,"Coincident"]
[null,null,"Weather Corrected MD 10% POE","MVA","Non-Coincident"]
[null,null,null,null,"Coincident"]
[null,null,"Weather Corrected MD 50% POE","MW","Non-Coincident"]
[null,null,null,null,"Coincident"]
[null,null,"Weather Corrected MD 50% POE","MVA","Non-Coincident"]
[null,null,null,null,"Coincident"]
[null,"<Enter connection point name>","Connection Point Rating","MVA","Non-Coincident"]
[null,null,null,null,"Coincident"]
[null,null,"Raw Adjusted MD","MW","Non-Coincident"]
[null,null,null,null,"Coincident"]
[null,null,"Raw Adjusted MD","MVA","Non-Coincident"]
[null,null,null,null,"Coincident"]
[null,null,"Date MD occurred",null,"Non-Coincident"]
[null,null,null,null,"Coincident"]
[null,null,"Half hour time period MD occurred",null,"Non-Coincident"]
[null,null,null,null,"Coincident"]
[null,null,"Winter/Summer Peaking",null,"Non-Coincident"]
[null,null,null,null,"Coincident"]
[null,null,"Adjustments - Embedded generation","MW","Non-Coincident"]
[null,null,null,null,"Coincident"]
[null,null,"Weather Corrected MD 10% POE","MW","Non-Coincident"]
[null,null,null,null,"Coincident"]
[null,null,"Weather Corrected MD 10% POE","MVA","Non-Coincident"]
[null,null,null,null,"Coincident"]
[null,null,"Weather Corrected MD 50% POE","MW","Non-Coincident"]
[null,null,null,null,"Coincident"]
[null,null,"Weather Corrected MD 50% POE","MVA","Non-Coincident"]
[null,null,null,null,"Coincident"]
[null,"<Enter connection point name>","Connection Point Rating","MVA","Non-Coincident"]
[null,null,null,null,"Coincident"]
[null,null,"Raw Adjusted MD","MW","Non-Coincident"]
[null,null,null,null,"Coincident"]
[null,null,"Raw Adjusted MD","MVA","Non-Coincident"]
[null,null,null,null,"Coincident"]
[null,null,"Date MD occurred",null,"Non-Coincident"]
[null,null,null,null,"Coincident"]
[null,null,"Half hour time period MD occurred",null,"Non-Coincident"]
[null,null,null,null,"Coincident"]
[null,null,"Winter/Summer Peaking",null,"Non-Coincident"]
[null,null,null,null,"Coincident"]
[null,null,"Adjustments - Embedded generation","MW","Non-Coincident"]
[null,null,null,null,"Coincident"]
[null,null,"Weather Corrected MD 10% POE","MW","Non-Coincident"]
[null,null,null,null,"Coincident"]
[null,null,"Weather Corrected MD 10% POE","MVA","Non-Coincident"]
[null,null,null,null,"Coincident"]
[null,null,"Weather Corrected MD 50% POE","MW","Non-Coincident"]
[null,null,null,null,"Coincident"]
[null,null,"Weather Corrected MD 50% POE","MVA","Non-Coincident"]
[null,null,null,null,"Coincident"]
[null,"<Enter connection point name>","Connection Point Rating","MVA","Non-Coincident"]
[null,null,null,null,"Coincident"]
[null,null,"Raw Adjusted MD","MW","Non-Coincident"]
[null,null,null,null,"Coincident"]
[null,null,"Raw Adjusted MD","MVA","Non-Coincident"]
[null,null,null,null,"Coincident"]
[null,null,"Date MD occurred",null,"Non-Coincident"]
[null,null,null,null,"Coincident"]
[null,null,"Half hour time period MD occurred",null,"Non-Coincident"]
[null,null,null,null,"Coincident"]
[null,null,"Winter/Summer Peaking",null,"Non-Coincident"]
[null,null,null,null,"Coincident"]
[null,null,"Adjustments - Embedded generation","MW","Non-Coincident"]
[null,null,null,null,"Coincident"]
[null,null,"Weather Corrected MD 10% POE","MW","Non-Coincident"]
[null,null,null,null,"Coincident"]
[null,null,"Weather Corrected MD 10% POE","MVA","Non-Coincident"]
[null,null,null,null,"Coincident"]
[null,null,"Weather Corrected MD 50% POE","MW","Non-Coincident"]
[null,null,null,null,"Coincident"]
[null,null,"Weather Corrected MD 50% POE","MVA","Non-Coincident"]
[null,null,null,null,"Coincident"]
[null,"<Enter connection point name>","Connection Point Rating","MVA","Non-Coincident"]
[null,null,null,null,"Coincident"]
[null,null,"Raw Adjusted MD","MW","Non-Coincident"]
[null,null,null,null,"Coincident"]
[null,null,"Raw Adjusted MD","MVA","Non-Coincident"]
[null,null,null,null,"Coincident"]
[null,null,"Date MD occurred",null,"Non-Coincident"]
[null,null,null,null,"Coincident"]
[null,null,"Half hour time period MD occurred",null,"Non-Coincident"]
[null,null,null,null,"Coincident"]
[null,null,"Winter/Summer Peaking",null,"Non-Coincident"]
[null,null,null,null,"Coincident"]
[null,null,"Adjustments - Embedded generation","MW","Non-Coincident"]
[null,null,null,null,"Coincident"]
[null,null,"Weather Corrected MD 10% POE","MW","Non-Coincident"]
[null,null,null,null,"Coincident"]
[null,null,"Weather Corrected MD 10% POE","MVA","Non-Coincident"]
[null,null,null,null,"Coincident"]
[null,null,"Weather Corrected MD 50% POE","MW","Non-Coincident"]
[null,null,null,null,"Coincident"]
[null,null,"Weather Corrected MD 50% POE","MVA","Non-Coincident"]
[null,null,null,null,"Coincident"]
[null,"<Enter connection point name>","Connection Point Rating","MVA","Non-Coincident"]
[null,null,null,null,"Coincident"]
[null,null,"Raw Adjusted MD","MW","Non-Coincident"]
[null,null,null,null,"Coincident"]
[null,null,"Raw Adjusted MD","MVA","Non-Coincident"]
[null,null,null,null,"Coincident"]
[null,null,"Date MD occurred",null,"Non-Coincident"]
[null,null,null,null,"Coincident"]
[null,null,"Half hour time period MD occurred",null,"Non-Coincident"]
[null,null,null,null,"Coincident"]
[null,null,"Winter/Summer Peaking",null,"Non-Coincident"]
[null,null,null,null,"Coincident"]
[null,null,"Adjustments - Embedded generation","MW","Non-Coincident"]
[null,null,null,null,"Coincident"]
[null,null,"Weather Corrected MD 10% POE","MW","Non-Coincident"]
[null,null,null,null,"Coincident"]
[null,null,"Weather Corrected MD 10% POE","MVA","Non-Coincident"]
[null,null,null,null,"Coincident"]
[null,null,"Weather Corrected MD 50% POE","MW","Non-Coincident"]
[null,null,null,null,"Coincident"]
[null,null,"Weather Corrected MD 50% POE","MVA","Non-Coincident"]
[null,null,null,null,"Coincident"]
[null,"<Enter connection point name>","Connection Point Rating","MVA","Non-Coincident"]
[null,null,null,null,"Coincident"]
[null,null,"Raw Adjusted MD","MW","Non-Coincident"]
[null,null,null,null,"Coincident"]
[null,null,"Raw Adjusted MD","MVA","Non-Coincident"]
[null,null,null,null,"Coincident"]
[null,null,"Date MD occurred",null,"Non-Coincident"]
[null,null,null,null,"Coincident"]
[null,null,"Half hour time period MD occurred",null,"Non-Coincident"]
[null,null,null,null,"Coincident"]
[null,null,"Winter/Summer Peaking",null,"Non-Coincident"]
[null,null,null,null,"Coincident"]
[null,null,"Adjustments - Embedded generation","MW","Non-Coincident"]
[null,null,null,null,"Coincident"]
[null,null,"Weather Corrected MD 10% POE","MW","Non-Coincident"]
[null,null,null,null,"Coincident"]
[null,null,"Weather Corrected MD 10% POE","MVA","Non-Coincident"]
[null,null,null,null,"Coincident"]
[null,null,"Weather Corrected MD 50% POE","MW","Non-Coincident"]
[null,null,null,null,"Coincident"]
[null,null,"Weather Corrected MD 50% POE","MVA","Non-Coincident"]
[null,null,null,null,"Coincident"]
[null,"<Enter connection point name>","Connection Point Rating","MVA","Non-Coincident"]
[null,null,null,null,"Coincident"]
[null,null,"Raw Adjusted MD","MW","Non-Coincident"]
[null,null,null,null,"Coincident"]
[null,null,"Raw Adjusted MD","MVA","Non-Coincident"]
[null,null,null,null,"Coincident"]
[null,null,"Date MD occurred",null,"Non-Coincident"]
[null,null,null,null,"Coincident"]
[null,null,"Half hour time period MD occurred",null,"Non-Coincident"]
[null,null,null,null,"Coincident"]
[null,null,"Winter/Summer Peaking",null,"Non-Coincident"]
[null,null,null,null,"Coincident"]
[null,null,"Adjustments - Embedded generation","MW","Non-Coincident"]
[null,null,null,null,"Coincident"]
[null,null,"Weather Corrected MD 10% POE","MW","Non-Coincident"]
[null,null,null,null,"Coincident"]
[null,null,"Weather Corrected MD 10% POE","MVA","Non-Coincident"]
[null,null,null,null,"Coincident"]
[null,null,"Weather Corrected MD 50% POE","MW","Non-Coincident"]
[null,null,null,null,"Coincident"]
[null,null,"Weather Corrected MD 50% POE","MVA","Non-Coincident"]
[null,null,null,null,"Coincident"]
[null,"<Enter connection point name>","Connection Point Rating","MVA","Non-Coincident"]
[null,null,null,null,"Coincident"]
[null,null,"Raw Adjusted MD","MW","Non-Coincident"]
[null,null,null,null,"Coincident"]
[null,null,"Raw Adjusted MD","MVA","Non-Coincident"]
[null,null,null,null,"Coincident"]
[null,null,"Date MD occurred",null,"Non-Coincident"]
[null,null,null,null,"Coincident"]
[null,null,"Half hour time period MD occurred",null,"Non-Coincident"]
[null,null,null,null,"Coincident"]
[null,null,"Winter/Summer Peaking",null,"Non-Coincident"]
[null,null,null,null,"Coincident"]
[null,null,"Adjustments - Embedded generation","MW","Non-Coincident"]
[null,null,null,null,"Coincident"]
[null,null,"Weather Corrected MD 10% POE","MW","Non-Coincident"]
[null,null,null,null,"Coincident"]
[null,null,"Weather Corrected MD 10% POE","MVA","Non-Coincident"]
[null,null,null,null,"Coincident"]
[null,null,"Weather Corrected MD 50% POE","MW","Non-Coincident"]
[null,null,null,null,"Coincident"]
[null,null,"Weather Corrected MD 50% POE","MVA","Non-Coincident"]
[null,null,null,null,"Coincident"]
[null,"<Enter connection point name>","Connection Point Rating","MVA","Non-Coincident"]
[null,null,null,null,"Coincident"]
[null,null,"Raw Adjusted MD","MW","Non-Coincident"]
[null,null,null,null,"Coincident"]
[null,null,"Raw Adjusted MD","MVA","Non-Coincident"]
[null,null,null,null,"Coincident"]
[null,null,"Date MD occurred",null,"Non-Coincident"]
[null,null,null,null,"Coincident"]
[null,null,"Half hour time period MD occurred",null,"Non-Coincident"]
[null,null,null,null,"Coincident"]
[null,null,"Winter/Summer Peaking",null,"Non-Coincident"]
[null,null,null,null,"Coincident"]
[null,null,"Adjustments - Embedded generation","MW","Non-Coincident"]
[null,null,null,null,"Coincident"]
[null,null,"Weather Corrected MD 10% POE","MW","Non-Coincident"]
[null,null,null,null,"Coincident"]
[null,null,"Weather Corrected MD 10% POE","MVA","Non-Coincident"]
[null,null,null,null,"Coincident"]
[null,null,"Weather Corrected MD 50% POE","MW","Non-Coincident"]
[null,null,null,null,"Coincident"]
[null,null,"Weather Corrected MD 50% POE","MVA","Non-Coincident"]
[null,null,null,null,"Coincident"]
[null,"<Enter connection point name>","Connection Point Rating","MVA","Non-Coincident"]
[null,null,null,null,"Coincident"]
[null,null,"Raw Adjusted MD","MW","Non-Coincident"]
[null,null,null,null,"Coincident"]
[null,null,"Raw Adjusted MD","MVA","Non-Coincident"]
[null,null,null,null,"Coincident"]
[null,null,"Date MD occurred",null,"Non-Coincident"]
[null,null,null,null,"Coincident"]
[null,null,"Half hour time period MD occurred",null,"Non-Coincident"]
[null,null,null,null,"Coincident"]
[null,null,"Winter/Summer Peaking",null,"Non-Coincident"]
[null,null,null,null,"Coincident"]
[null,null,"Adjustments - Embedded generation","MW","Non-Coincident"]
[null,null,null,null,"Coincident"]
[null,null,"Weather Corrected MD 10% POE","MW","Non-Coincident"]
[null,null,null,null,"Coincident"]
[null,null,"Weather Corrected MD 10% POE","MVA","Non-Coincident"]
[null,null,null,null,"Coincident"]
[null,null,"Weather Corrected MD 50% POE","MW","Non-Coincident"]
[null,null,null,null,"Coincident"]
[null,null,"Weather Corrected MD 50% POE","MVA","Non-Coincident"]
[null,null,null,null,"Coincident"]
[null,"<Enter connection point name>","Connection Point Rating","MVA","Non-Coincident"]
[null,null,null,null,"Coincident"]
[null,null,"Raw Adjusted MD","MW","Non-Coincident"]
[null,null,null,null,"Coincident"]
[null,null,"Raw Adjusted MD","MVA","Non-Coincident"]
[null,null,null,null,"Coincident"]
[null,null,"Date MD occurred",null,"Non-Coincident"]
[null,null,null,null,"Coincident"]
[null,null,"Half hour time period MD occurred",null,"Non-Coincident"]
[null,null,null,null,"Coincident"]
[null,null,"Winter/Summer Peaking",null,"Non-Coincident"]
[null,null,null,null,"Coincident"]
[null,null,"Adjustments - Embedded generation","MW","Non-Coincident"]
[null,null,null,null,"Coincident"]
[null,null,"Weather Corrected MD 10% POE","MW","Non-Coincident"]
[null,null,null,null,"Coincident"]
[null,null,"Weather Corrected MD 10% POE","MVA","Non-Coincident"]
[null,null,null,null,"Coincident"]
[null,null,"Weather Corrected MD 50% POE","MW","Non-Coincident"]
[null,null,null,null,"Coincident"]
[null,null,"Weather Corrected MD 50% POE","MVA","Non-Coincident"]
[null,null,null,null,"Coincident"]
[null,"<Enter connection point name>","Connection Point Rating","MVA","Non-Coincident"]
[null,null,null,null,"Coincident"]
[null,null,"Raw Adjusted MD","MW","Non-Coincident"]
[null,null,null,null,"Coincident"]
[null,null,"Raw Adjusted MD","MVA","Non-Coincident"]
[null,null,null,null,"Coincident"]
[null,null,"Date MD occurred",null,"Non-Coincident"]
[null,null,null,null,"Coincident"]
[null,null,"Half hour time period MD occurred",null,"Non-Coincident"]
[null,null,null,null,"Coincident"]
[null,null,"Winter/Summer Peaking",null,"Non-Coincident"]
[null,null,null,null,"Coincident"]
[null,null,"Adjustments - Embedded generation","MW","Non-Coincident"]
[null,null,null,null,"Coincident"]
[null,null,"Weather Corrected MD 10% POE","MW","Non-Coincident"]
[null,null,null,null,"Coincident"]
[null,null,"Weather Corrected MD 10% POE","MVA","Non-Coincident"]
[null,null,null,null,"Coincident"]
[null,null,"Weather Corrected MD 50% POE","MW","Non-Coincident"]
[null,null,null,null,"Coincident"]
[null,null,"Weather Corrected MD 50% POE","MVA","Non-Coincident"]
[null,null,null,null,"Coincident"]
[null,"<Enter connection point name>","Connection Point Rating","MVA","Non-Coincident"]
[null,null,null,null,"Coincident"]
[null,null,"Raw Adjusted MD","MW","Non-Coincident"]
[null,null,null,null,"Coincident"]
[null,null,"Raw Adjusted MD","MVA","Non-Coincident"]
[null,null,null,null,"Coincident"]
[null,null,"Date MD occurred",null,"Non-Coincident"]
[null,null,null,null,"Coincident"]
[null,null,"Half hour time period MD occurred",null,"Non-Coincident"]
[null,null,null,null,"Coincident"]
[null,null,"Winter/Summer Peaking",null,"Non-Coincident"]
[null,null,null,null,"Coincident"]
[null,null,"Adjustments - Embedded generation","MW","Non-Coincident"]
[null,null,null,null,"Coincident"]
[null,null,"Weather Corrected MD 10% POE","MW","Non-Coincident"]
[null,null,null,null,"Coincident"]
[null,null,"Weather Corrected MD 10% POE","MVA","Non-Coincident"]
[null,null,null,null,"Coincident"]
[null,null,"Weather Corrected MD 50% POE","MW","Non-Coincident"]
[null,null,null,null,"Coincident"]
[null,null,"Weather Corrected MD 50% POE","MVA","Non-Coincident"]
[null,null,null,null,"Coincident"]
[null,"<Enter connection point name>","Connection Point Rating","MVA","Non-Coincident"]
[null,null,null,null,"Coincident"]
[null,null,"Raw Adjusted MD","MW","Non-Coincident"]
[null,null,null,null,"Coincident"]
[null,null,"Raw Adjusted MD","MVA","Non-Coincident"]
[null,null,null,null,"Coincident"]
[null,null,"Date MD occurred",null,"Non-Coincident"]
[null,null,null,null,"Coincident"]
[null,null,"Half hour time period MD occurred",null,"Non-Coincident"]
[null,null,null,null,"Coincident"]
[null,null,"Winter/Summer Peaking",null,"Non-Coincident"]
[null,null,null,null,"Coincident"]
[null,null,"Adjustments - Embedded generation","MW","Non-Coincident"]
[null,null,null,null,"Coincident"]
[null,null,"Weather Corrected MD 10% POE","MW","Non-Coincident"]
[null,null,null,null,"Coincident"]
[null,null,"Weather Corrected MD 10% POE","MVA","Non-Coincident"]
[null,null,null,null,"Coincident"]
[null,null,"Weather Corrected MD 50% POE","MW","Non-Coincident"]
[null,null,null,null,"Coincident"]
[null,null,"Weather Corrected MD 50% POE","MVA","Non-Coincident"]
[null,null,null,null,"Coincident"]
[null,"<Enter connection point name>","Connection Point Rating","MVA","Non-Coincident"]
[null,null,null,null,"Coincident"]
[null,null,"Raw Adjusted MD","MW","Non-Coincident"]
[null,null,null,null,"Coincident"]
[null,null,"Raw Adjusted MD","MVA","Non-Coincident"]
[null,null,null,null,"Coincident"]
[null,null,"Date MD occurred",null,"Non-Coincident"]
[null,null,null,null,"Coincident"]
[null,null,"Half hour time period MD occurred",null,"Non-Coincident"]
[null,null,null,null,"Coincident"]
[null,null,"Winter/Summer Peaking",null,"Non-Coincident"]
[null,null,null,null,"Coincident"]
[null,null,"Adjustments - Embedded generation","MW","Non-Coincident"]
[null,null,null,null,"Coincident"]
[null,null,"Weather Corrected MD 10% POE","MW","Non-Coincident"]
[null,null,null,null,"Coincident"]
[null,null,"Weather Corrected MD 10% POE","MVA","Non-Coincident"]
[null,null,null,null,"Coincident"]
[null,null,"Weather Corrected MD 50% POE","MW","Non-Coincident"]
[null,null,null,null,"Coincident"]
[null,null,"Weather Corrected MD 50% POE","MVA","Non-Coincident"]
[null,null,null,null,"Coincident"]
[null,"<Enter connection point name>","Connection Point Rating","MVA","Non-Coincident"]
[null,null,null,null,"Coincident"]
[null,null,"Raw Adjusted MD","MW","Non-Coincident"]
[null,null,null,null,"Coincident"]
[null,null,"Raw Adjusted MD","MVA","Non-Coincident"]
[null,null,null,null,"Coincident"]
[null,null,"Date MD occurred",null,"Non-Coincident"]
[null,null,null,null,"Coincident"]
[null,null,"Half hour time period MD occurred",null,"Non-Coincident"]
[null,null,null,null,"Coincident"]
[null,null,"Winter/Summer Peaking",null,"Non-Coincident"]
[null,null,null,null,"Coincident"]
[null,null,"Adjustments - Embedded generation","MW","Non-Coincident"]
[null,null,null,null,"Coincident"]
[null,null,"Weather Corrected MD 10% POE","MW","Non-Coincident"]
[null,null,null,null,"Coincident"]
[null,null,"Weather Corrected MD 10% POE","MVA","Non-Coincident"]
[null,null,null,null,"Coincident"]
[null,null,"Weather Corrected MD 50% POE","MW","Non-Coincident"]
[null,null,null,null,"Coincident"]
[null,null,"Weather Corrected MD 50% POE","MVA","Non-Coincident"]
[null,null,null,null,"Coincident"]
[null,"<Enter connection point name>","Connection Point Rating","MVA","Non-Coincident"]
[null,null,null,null,"Coincident"]
[null,null,"Raw Adjusted MD","MW","Non-Coincident"]
[null,null,null,null,"Coincident"]
[null,null,"Raw Adjusted MD","MVA","Non-Coincident"]
[null,null,null,null,"Coincident"]
[null,null,"Date MD occurred",null,"Non-Coincident"]
[null,null,null,null,"Coincident"]
[null,null,"Half hour time period MD occurred",null,"Non-Coincident"]
[null,null,null,null,"Coincident"]
[null,null,"Winter/Summer Peaking",null,"Non-Coincident"]
[null,null,null,null,"Coincident"]
[null,null,"Adjustments - Embedded generation","MW","Non-Coincident"]
[null,null,null,null,"Coincident"]
[null,null,"Weather Corrected MD 10% POE","MW","Non-Coincident"]
[null,null,null,null,"Coincident"]
[null,null,"Weather Corrected MD 10% POE","MVA","Non-Coincident"]
[null,null,null,null,"Coincident"]
[null,null,"Weather Corrected MD 50% POE","MW","Non-Coincident"]
[null,null,null,null,"Coincident"]
[null,null,"Weather Corrected MD 50% POE","MVA","Non-Coincident"]
[null,null,null,null,"Coincident"]
[null,"<Enter connection point name>","Connection Point Rating","MVA","Non-Coincident"]
[null,null,null,null,"Coincident"]
[null,null,"Raw Adjusted MD","MW","Non-Coincident"]
[null,null,null,null,"Coincident"]
[null,null,"Raw Adjusted MD","MVA","Non-Coincident"]
[null,null,null,null,"Coincident"]
[null,null,"Date MD occurred",null,"Non-Coincident"]
[null,null,null,null,"Coincident"]
[null,null,"Half hour time period MD occurred",null,"Non-Coincident"]
[null,null,null,null,"Coincident"]
[null,null,"Winter/Summer Peaking",null,"Non-Coincident"]
[null,null,null,null,"Coincident"]
[null,null,"Adjustments - Embedded generation","MW","Non-Coincident"]
[null,null,null,null,"Coincident"]
[null,null,"Weather Corrected MD 10% POE","MW","Non-Coincident"]
[null,null,null,null,"Coincident"]
[null,null,"Weather Corrected MD 10% POE","MVA","Non-Coincident"]
[null,null,null,null,"Coincident"]
[null,null,"Weather Corrected MD 50% POE","MW","Non-Coincident"]
[null,null,null,null,"Coincident"]
[null,null,"Weather Corrected MD 50% POE","MVA","Non-Coincident"]
[null,null,null,null,"Coincident"]
[null,"<Enter connection point name>","Connection Point Rating","MVA","Non-Coincident"]
[null,null,null,null,"Coincident"]
[null,null,"Raw Adjusted MD","MW","Non-Coincident"]
[null,null,null,null,"Coincident"]
[null,null,"Raw Adjusted MD","MVA","Non-Coincident"]
[null,null,null,null,"Coincident"]
[null,null,"Date MD occurred",null,"Non-Coincident"]
[null,null,null,null,"Coincident"]
[null,null,"Half hour time period MD occurred",null,"Non-Coincident"]
[null,null,null,null,"Coincident"]
[null,null,"Winter/Summer Peaking",null,"Non-Coincident"]
[null,null,null,null,"Coincident"]
[null,null,"Adjustments - Embedded generation","MW","Non-Coincident"]
[null,null,null,null,"Coincident"]
[null,null,"Weather Corrected MD 10% POE","MW","Non-Coincident"]
[null,null,null,null,"Coincident"]
[null,null,"Weather Corrected MD 10% POE","MVA","Non-Coincident"]
[null,null,null,null,"Coincident"]
[null,null,"Weather Corrected MD 50% POE","MW","Non-Coincident"]
[null,null,null,null,"Coincident"]
[null,null,"Weather Corrected MD 50% POE","MVA","Non-Coincident"]
[null,null,null,null,"Coincident"]
[null,"<Enter connection point name>","Connection Point Rating","MVA","Non-Coincident"]
[null,null,null,null,"Coincident"]
[null,null,"Raw Adjusted MD","MW","Non-Coincident"]
[null,null,null,null,"Coincident"]
[null,null,"Raw Adjusted MD","MVA","Non-Coincident"]
[null,null,null,null,"Coincident"]
[null,null,"Date MD occurred",null,"Non-Coincident"]
[null,null,null,null,"Coincident"]
[null,null,"Half hour time period MD occurred",null,"Non-Coincident"]
[null,null,null,null,"Coincident"]
[null,null,"Winter/Summer Peaking",null,"Non-Coincident"]
[null,null,null,null,"Coincident"]
[null,null,"Adjustments - Embedded generation","MW","Non-Coincident"]
[null,null,null,null,"Coincident"]
[null,null,"Weather Corrected MD 10% POE","MW","Non-Coincident"]
[null,null,null,null,"Coincident"]
[null,null,"Weather Corrected MD 10% POE","MVA","Non-Coincident"]
[null,null,null,null,"Coincident"]
[null,null,"Weather Corrected MD 50% POE","MW","Non-Coincident"]
[null,null,null,null,"Coincident"]
[null,null,"Weather Corrected MD 50% POE","MVA","Non-Coincident"]
[null,null,null,null,"Coincident"]
[null,"<Enter connection point name>","Connection Point Rating","MVA","Non-Coincident"]
[null,null,null,null,"Coincident"]
[null,null,"Raw Adjusted MD","MW","Non-Coincident"]
[null,null,null,null,"Coincident"]
[null,null,"Raw Adjusted MD","MVA","Non-Coincident"]
[null,null,null,null,"Coincident"]
[null,null,"Date MD occurred",null,"Non-Coincident"]
[null,null,null,null,"Coincident"]
[null,null,"Half hour time period MD occurred",null,"Non-Coincident"]
[null,null,null,null,"Coincident"]
[null,null,"Winter/Summer Peaking",null,"Non-Coincident"]
[null,null,null,null,"Coincident"]
[null,null,"Adjustments - Embedded generation","MW","Non-Coincident"]
[null,null,null,null,"Coincident"]
[null,null,"Weather Corrected MD 10% POE","MW","Non-Coincident"]
[null,null,null,null,"Coincident"]
[null,null,"Weather Corrected MD 10% POE","MVA","Non-Coincident"]
[null,null,null,null,"Coincident"]
[null,null,"Weather Corrected MD 50% POE","MW","Non-Coincident"]
[null,null,null,null,"Coincident"]
[null,null,"Weather Corrected MD 50% POE","MVA","Non-Coincident"]
[null,null,null,null,"Coincident"]
[null,"<Enter connection point name>","Connection Point Rating","MVA","Non-Coincident"]
[null,null,null,null,"Coincident"]
[null,null,"Raw Adjusted MD","MW","Non-Coincident"]
[null,null,null,null,"Coincident"]
[null,null,"Raw Adjusted MD","MVA","Non-Coincident"]
[null,null,null,null,"Coincident"]
[null,null,"Date MD occurred",null,"Non-Coincident"]
[null,null,null,null,"Coincident"]
[null,null,"Half hour time period MD occurred",null,"Non-Coincident"]
[null,null,null,null,"Coincident"]
[null,null,"Winter/Summer Peaking",null,"Non-Coincident"]
[null,null,null,null,"Coincident"]
[null,null,"Adjustments - Embedded generation","MW","Non-Coincident"]
[null,null,null,null,"Coincident"]
[null,null,"Weather Corrected MD 10% POE","MW","Non-Coincident"]
[null,null,null,null,"Coincident"]
[null,null,"Weather Corrected MD 10% POE","MVA","Non-Coincident"]
[null,null,null,null,"Coincident"]
[null,null,"Weather Corrected MD 50% POE","MW","Non-Coincident"]
[null,null,null,null,"Coincident"]
[null,null,"Weather Corrected MD 50% POE","MVA","Non-Coincident"]
[null,null,null,null,"Coincident"]
[null,"<Enter connection point name>","Connection Point Rating","MVA","Non-Coincident"]
[null,null,null,null,"Coincident"]
[null,null,"Raw Adjusted MD","MW","Non-Coincident"]
[null,null,null,null,"Coincident"]
[null,null,"Raw Adjusted MD","MVA","Non-Coincident"]
[null,null,null,null,"Coincident"]
[null,null,"Date MD occurred",null,"Non-Coincident"]
[null,null,null,null,"Coincident"]
[null,null,"Half hour time period MD occurred",null,"Non-Coincident"]
[null,null,null,null,"Coincident"]
[null,null,"Winter/Summer Peaking",null,"Non-Coincident"]
[null,null,null,null,"Coincident"]
[null,null,"Adjustments - Embedded generation","MW","Non-Coincident"]
[null,null,null,null,"Coincident"]
[null,null,"Weather Corrected MD 10% POE","MW","Non-Coincident"]
[null,null,null,null,"Coincident"]
[null,null,"Weather Corrected MD 10% POE","MVA","Non-Coincident"]
[null,null,null,null,"Coincident"]
[null,null,"Weather Corrected MD 50% POE","MW","Non-Coincident"]
[null,null,null,null,"Coincident"]
[null,null,"Weather Corrected MD 50% POE","MVA","Non-Coincident"]
[null,null,null,null,"Coincident"]
[null,"<Enter connection point name>","Connection Point Rating","MVA","Non-Coincident"]
[null,null,null,null,"Coincident"]
[null,null,"Raw Adjusted MD","MW","Non-Coincident"]
[null,null,null,null,"Coincident"]
[null,null,"Raw Adjusted MD","MVA","Non-Coincident"]
[null,null,null,null,"Coincident"]
[null,null,"Date MD occurred",null,"Non-Coincident"]
[null,null,null,null,"Coincident"]
[null,null,"Half hour time period MD occurred",null,"Non-Coincident"]
[null,null,null,null,"Coincident"]
[null,null,"Winter/Summer Peaking",null,"Non-Coincident"]
[null,null,null,null,"Coincident"]
[null,null,"Adjustments - Embedded generation","MW","Non-Coincident"]
[null,null,null,null,"Coincident"]
[null,null,"Weather Corrected MD 10% POE","MW","Non-Coincident"]
[null,null,null,null,"Coincident"]
[null,null,"Weather Corrected MD 10% POE","MVA","Non-Coincident"]
[null,null,null,null,"Coincident"]
[null,null,"Weather Corrected MD 50% POE","MW","Non-Coincident"]
[null,null,null,null,"Coincident"]
[null,null,"Weather Corrected MD 50% POE","MVA","Non-Coincident"]
[null,null,null,null,"Coincident"]
[null,"<Enter connection point name>","Connection Point Rating","MVA","Non-Coincident"]
[null,null,null,null,"Coincident"]
[null,null,"Raw Adjusted MD","MW","Non-Coincident"]
[null,null,null,null,"Coincident"]
[null,null,"Raw Adjusted MD","MVA","Non-Coincident"]
[null,null,null,null,"Coincident"]
[null,null,"Date MD occurred",null,"Non-Coincident"]
[null,null,null,null,"Coincident"]
[null,null,"Half hour time period MD occurred",null,"Non-Coincident"]
[null,null,null,null,"Coincident"]
[null,null,"Winter/Summer Peaking",null,"Non-Coincident"]
[null,null,null,null,"Coincident"]
[null,null,"Adjustments - Embedded generation","MW","Non-Coincident"]
[null,null,null,null,"Coincident"]
[null,null,"Weather Corrected MD 10% POE","MW","Non-Coincident"]
[null,null,null,null,"Coincident"]
[null,null,"Weather Corrected MD 10% POE","MVA","Non-Coincident"]
[null,null,null,null,"Coincident"]
[null,null,"Weather Corrected MD 50% POE","MW","Non-Coincident"]
[null,null,null,null,"Coincident"]
[null,null,"Weather Corrected MD 50% POE","MVA","Non-Coincident"]
[null,null,null,null,"Coincident"]
[null,"<Enter connection point name>","Connection Point Rating","MVA","Non-Coincident"]
[null,null,null,null,"Coincident"]
[null,null,"Raw Adjusted MD","MW","Non-Coincident"]
[null,null,null,null,"Coincident"]
[null,null,"Raw Adjusted MD","MVA","Non-Coincident"]
[null,null,null,null,"Coincident"]
[null,null,"Date MD occurred",null,"Non-Coincident"]
[null,null,null,null,"Coincident"]
[null,null,"Half hour time period MD occurred",null,"Non-Coincident"]
[null,null,null,null,"Coincident"]
[null,null,"Winter/Summer Peaking",null,"Non-Coincident"]
[null,null,null,null,"Coincident"]
[null,null,"Adjustments - Embedded generation","MW","Non-Coincident"]
[null,null,null,null,"Coincident"]
[null,null,"Weather Corrected MD 10% POE","MW","Non-Coincident"]
[null,null,null,null,"Coincident"]
[null,null,"Weather Corrected MD 10% POE","MVA","Non-Coincident"]
[null,null,null,null,"Coincident"]
[null,null,"Weather Corrected MD 50% POE","MW","Non-Coincident"]
[null,null,null,null,"Coincident"]
[null,null,"Weather Corrected MD 50% POE","MVA","Non-Coincident"]
[null,null,null,null,"Coincident"]
[null,"<Enter connection point name>","Connection Point Rating","MVA","Non-Coincident"]
[null,null,null,null,"Coincident"]
[null,null,"Raw Adjusted MD","MW","Non-Coincident"]
[null,null,null,null,"Coincident"]
[null,null,"Raw Adjusted MD","MVA","Non-Coincident"]
[null,null,null,null,"Coincident"]
[null,null,"Date MD occurred",null,"Non-Coincident"]
[null,null,null,null,"Coincident"]
[null,null,"Half hour time period MD occurred",null,"Non-Coincident"]
[null,null,null,null,"Coincident"]
[null,null,"Winter/Summer Peaking",null,"Non-Coincident"]
[null,null,null,null,"Coincident"]
[null,null,"Adjustments - Embedded generation","MW","Non-Coincident"]
[null,null,null,null,"Coincident"]
[null,null,"Weather Corrected MD 10% POE","MW","Non-Coincident"]
[null,null,null,null,"Coincident"]
[null,null,"Weather Corrected MD 10% POE","MVA","Non-Coincident"]
[null,null,null,null,"Coincident"]
[null,null,"Weather Corrected MD 50% POE","MW","Non-Coincident"]
[null,null,null,null,"Coincident"]
[null,null,"Weather Corrected MD 50% POE","MVA","Non-Coincident"]
[null,null,null,null,"Coincident"]
[null,"<Enter connection point name>","Connection Point Rating","MVA","Non-Coincident"]
[null,null,null,null,"Coincident"]
[null,null,"Raw Adjusted MD","MW","Non-Coincident"]
[null,null,null,null,"Coincident"]
[null,null,"Raw Adjusted MD","MVA","Non-Coincident"]
[null,null,null,null,"Coincident"]
[null,null,"Date MD occurred",null,"Non-Coincident"]
[null,null,null,null,"Coincident"]
[null,null,"Half hour time period MD occurred",null,"Non-Coincident"]
[null,null,null,null,"Coincident"]
[null,null,"Winter/Summer Peaking",null,"Non-Coincident"]
[null,null,null,null,"Coincident"]
[null,null,"Adjustments - Embedded generation","MW","Non-Coincident"]
[null,null,null,null,"Coincident"]
[null,null,"Weather Corrected MD 10% POE","MW","Non-Coincident"]
[null,null,null,null,"Coincident"]
[null,null,"Weather Corrected MD 10% POE","MVA","Non-Coincident"]
[null,null,null,null,"Coincident"]
[null,null,"Weather Corrected MD 50% POE","MW","Non-Coincident"]
[null,null,null,null,"Coincident"]
[null,null,"Weather Corrected MD 50% POE","MVA","Non-Coincident"]
[null,null,null,null,"Coincident"]
[null,"<Enter connection point name>","Connection Point Rating","MVA","Non-Coincident"]
[null,null,null,null,"Coincident"]
[null,null,"Raw Adjusted MD","MW","Non-Coincident"]
[null,null,null,null,"Coincident"]
[null,null,"Raw Adjusted MD","MVA","Non-Coincident"]
[null,null,null,null,"Coincident"]
[null,null,"Date MD occurred",null,"Non-Coincident"]
[null,null,null,null,"Coincident"]
[null,null,"Half hour time period MD occurred",null,"Non-Coincident"]
[null,null,null,null,"Coincident"]
[null,null,"Winter/Summer Peaking",null,"Non-Coincident"]
[null,null,null,null,"Coincident"]
[null,null,"Adjustments - Embedded generation","MW","Non-Coincident"]
[null,null,null,null,"Coincident"]
[null,null,"Weather Corrected MD 10% POE","MW","Non-Coincident"]
[null,null,null,null,"Coincident"]
[null,null,"Weather Corrected MD 10% POE","MVA","Non-Coincident"]
[null,null,null,null,"Coincident"]
[null,null,"Weather Corrected MD 50% POE","MW","Non-Coincident"]
[null,null,null,null,"Coincident"]
[null,null,"Weather Corrected MD 50% POE","MVA","Non-Coincident"]
[null,null,null,null,"Coincident"]
[null,"<Enter connection point name>","Connection Point Rating","MVA","Non-Coincident"]
[null,null,null,null,"Coincident"]
[null,null,"Raw Adjusted MD","MW","Non-Coincident"]
[null,null,null,null,"Coincident"]
[null,null,"Raw Adjusted MD","MVA","Non-Coincident"]
[null,null,null,null,"Coincident"]
[null,null,"Date MD occurred",null,"Non-Coincident"]
[null,null,null,null,"Coincident"]
[null,null,"Half hour time period MD occurred",null,"Non-Coincident"]
[null,null,null,null,"Coincident"]
[null,null,"Winter/Summer Peaking",null,"Non-Coincident"]
[null,null,null,null,"Coincident"]
[null,null,"Adjustments - Embedded generation","MW","Non-Coincident"]
[null,null,null,null,"Coincident"]
[null,null,"Weather Corrected MD 10% POE","MW","Non-Coincident"]
[null,null,null,null,"Coincident"]
[null,null,"Weather Corrected MD 10% POE","MVA","Non-Coincident"]
[null,null,null,null,"Coincident"]
[null,null,"Weather Corrected MD 50% POE","MW","Non-Coincident"]
[null,null,null,null,"Coincident"]
[null,null,"Weather Corrected MD 50% POE","MVA","Non-Coincident"]
[null,null,null,null,"Coincident"]
[null,"<Enter connection point name>","Connection Point Rating","MVA","Non-Coincident"]
[null,null,null,null,"Coincident"]
[null,null,"Raw Adjusted MD","MW","Non-Coincident"]
[null,null,null,null,"Coincident"]
[null,null,"Raw Adjusted MD","MVA","Non-Coincident"]
[null,null,null,null,"Coincident"]
[null,null,"Date MD occurred",null,"Non-Coincident"]
[null,null,null,null,"Coincident"]
[null,null,"Half hour time period MD occurred",null,"Non-Coincident"]
[null,null,null,null,"Coincident"]
[null,null,"Winter/Summer Peaking",null,"Non-Coincident"]
[null,null,null,null,"Coincident"]
[null,null,"Adjustments - Embedded generation","MW","Non-Coincident"]
[null,null,null,null,"Coincident"]
[null,null,"Weather Corrected MD 10% POE","MW","Non-Coincident"]
[null,null,null,null,"Coincident"]
[null,null,"Weather Corrected MD 10% POE","MVA","Non-Coincident"]
[null,null,null,null,"Coincident"]
[null,null,"Weather Corrected MD 50% POE","MW","Non-Coincident"]
[null,null,null,null,"Coincident"]
[null,null,"Weather Corrected MD 50% POE","MVA","Non-Coincident"]
[null,null,null,null,"Coincident"]
[null,"<Enter connection point name>","Connection Point Rating","MVA","Non-Coincident"]
[null,null,null,null,"Coincident"]
[null,null,"Raw Adjusted MD","MW","Non-Coincident"]
[null,null,null,null,"Coincident"]
[null,null,"Raw Adjusted MD","MVA","Non-Coincident"]
[null,null,null,null,"Coincident"]
[null,null,"Date MD occurred",null,"Non-Coincident"]
[null,null,null,null,"Coincident"]
[null,null,"Half hour time period MD occurred",null,"Non-Coincident"]
[null,null,null,null,"Coincident"]
[null,null,"Winter/Summer Peaking",null,"Non-Coincident"]
[null,null,null,null,"Coincident"]
[null,null,"Adjustments - Embedded generation","MW","Non-Coincident"]
[null,null,null,null,"Coincident"]
[null,null,"Weather Corrected MD 10% POE","MW","Non-Coincident"]
[null,null,null,null,"Coincident"]
[null,null,"Weather Corrected MD 10% POE","MVA","Non-Coincident"]
[null,null,null,null,"Coincident"]
[null,null,"Weather Corrected MD 50% POE","MW","Non-Coincident"]
[null,null,null,null,"Coincident"]
[null,null,"Weather Corrected MD 50% POE","MVA","Non-Coincident"]
[null,null,null,null,"Coincident"]
[null,"<Enter connection point name>","Connection Point Rating","MVA","Non-Coincident"]
[null,null,null,null,"Coincident"]
[null,null,"Raw Adjusted MD","MW","Non-Coincident"]
[null,null,null,null,"Coincident"]
[null,null,"Raw Adjusted MD","MVA","Non-Coincident"]
[null,null,null,null,"Coincident"]
[null,null,"Date MD occurred",null,"Non-Coincident"]
[null,null,null,null,"Coincident"]
[null,null,"Half hour time period MD occurred",null,"Non-Coincident"]
[null,null,null,null,"Coincident"]
[null,null,"Winter/Summer Peaking",null,"Non-Coincident"]
[null,null,null,null,"Coincident"]
[null,null,"Adjustments - Embedded generation","MW","Non-Coincident"]
[null,null,null,null,"Coincident"]
[null,null,"Weather Corrected MD 10% POE","MW","Non-Coincident"]
[null,null,null,null,"Coincident"]
[null,null,"Weather Corrected MD 10% POE","MVA","Non-Coincident"]
[null,null,null,null,"Coincident"]
[null,null,"Weather Corrected MD 50% POE","MW","Non-Coincident"]
[null,null,null,null,"Coincident"]
[null,null,"Weather Corrected MD 50% POE","MVA","Non-Coincident"]
[null,null,null,null,"Coincident"]
[null,"<Enter connection point name>","Connection Point Rating","MVA","Non-Coincident"]
[null,null,null,null,"Coincident"]
[null,null,"Raw Adjusted MD","MW","Non-Coincident"]
[null,null,null,null,"Coincident"]
[null,null,"Raw Adjusted MD","MVA","Non-Coincident"]
[null,null,null,null,"Coincident"]
[null,null,"Date MD occurred",null,"Non-Coincident"]
[null,null,null,null,"Coincident"]
[null,null,"Half hour time period MD occurred",null,"Non-Coincident"]
[null,null,null,null,"Coincident"]
[null,null,"Winter/Summer Peaking",null,"Non-Coincident"]
[null,null,null,null,"Coincident"]
[null,null,"Adjustments - Embedded generation","MW","Non-Coincident"]
[null,null,null,null,"Coincident"]
[null,null,"Weather Corrected MD 10% POE","MW","Non-Coincident"]
[null,null,null,null,"Coincident"]
[null,null,"Weather Corrected MD 10% POE","MVA","Non-Coincident"]
[null,null,null,null,"Coincident"]
[null,null,"Weather Corrected MD 50% POE","MW","Non-Coincident"]
[null,null,null,null,"Coincident"]
[null,null,"Weather Corrected MD 50% POE","MVA","Non-Coincident"]
[null,null,null,null,"Coincident"]
[null,"<Enter connection point name>","Connection Point Rating","MVA","Non-Coincident"]
[null,null,null,null,"Coincident"]
[null,null,"Raw Adjusted MD","MW","Non-Coincident"]
[null,null,null,null,"Coincident"]
[null,null,"Raw Adjusted MD","MVA","Non-Coincident"]
[null,null,null,null,"Coincident"]
[null,null,"Date MD occurred",null,"Non-Coincident"]
[null,null,null,null,"Coincident"]
[null,null,"Half hour time period MD occurred",null,"Non-Coincident"]
[null,null,null,null,"Coincident"]
[null,null,"Winter/Summer Peaking",null,"Non-Coincident"]
[null,null,null,null,"Coincident"]
[null,null,"Adjustments - Embedded generation","MW","Non-Coincident"]
[null,null,null,null,"Coincident"]
[null,null,"Weather Corrected MD 10% POE","MW","Non-Coincident"]
[null,null,null,null,"Coincident"]
[null,null,"Weather Corrected MD 10% POE","MVA","Non-Coincident"]
[null,null,null,null,"Coincident"]
[null,null,"Weather Corrected MD 50% POE","MW","Non-Coincident"]
[null,null,null,null,"Coincident"]
[null,null,"Weather Corrected MD 50% POE","MVA","Non-Coincident"]
[null,null,null,null,"Coincident"]
[null,"<Enter connection point name>","Connection Point Rating","MVA","Non-Coincident"]
[null,null,null,null,"Coincident"]
[null,null,"Raw Adjusted MD","MW","Non-Coincident"]
[null,null,null,null,"Coincident"]
[null,null,"Raw Adjusted MD","MVA","Non-Coincident"]
[null,null,null,null,"Coincident"]
[null,null,"Date MD occurred",null,"Non-Coincident"]
[null,null,null,null,"Coincident"]
[null,null,"Half hour time period MD occurred",null,"Non-Coincident"]
[null,null,null,null,"Coincident"]
[null,null,"Winter/Summer Peaking",null,"Non-Coincident"]
[null,null,null,null,"Coincident"]
[null,null,"Adjustments - Embedded generation","MW","Non-Coincident"]
[null,null,null,null,"Coincident"]
[null,null,"Weather Corrected MD 10% POE","MW","Non-Coincident"]
[null,null,null,null,"Coincident"]
[null,null,"Weather Corrected MD 10% POE","MVA","Non-Coincident"]
[null,null,null,null,"Coincident"]
[null,null,"Weather Corrected MD 50% POE","MW","Non-Coincident"]
[null,null,null,null,"Coincident"]
[null,null,"Weather Corrected MD 50% POE","MVA","Non-Coincident"]
[null,null,null,null,"Coincident"]
[null,"<Enter connection point name>","Connection Point Rating","MVA","Non-Coincident"]
[null,null,null,null,"Coincident"]
[null,null,"Raw Adjusted MD","MW","Non-Coincident"]
[null,null,null,null,"Coincident"]
[null,null,"Raw Adjusted MD","MVA","Non-Coincident"]
[null,null,null,null,"Coincident"]
[null,null,"Date MD occurred",null,"Non-Coincident"]
[null,null,null,null,"Coincident"]
[null,null,"Half hour time period MD occurred",null,"Non-Coincident"]
[null,null,null,null,"Coincident"]
[null,null,"Winter/Summer Peaking",null,"Non-Coincident"]
[null,null,null,null,"Coincident"]
[null,null,"Adjustments - Embedded generation","MW","Non-Coincident"]
[null,null,null,null,"Coincident"]
[null,null,"Weather Corrected MD 10% POE","MW","Non-Coincident"]
[null,null,null,null,"Coincident"]
[null,null,"Weather Corrected MD 10% POE","MVA","Non-Coincident"]
[null,null,null,null,"Coincident"]
[null,null,"Weather Corrected MD 50% POE","MW","Non-Coincident"]
[null,null,null,null,"Coincident"]
[null,null,"Weather Corrected MD 50% POE","MVA","Non-Coincident"]
[null,null,null,null,"Coincident"]
[null,"<Enter connection point name>","Connection Point Rating","MVA","Non-Coincident"]
[null,null,null,null,"Coincident"]
[null,null,"Raw Adjusted MD","MW","Non-Coincident"]
[null,null,null,null,"Coincident"]
[null,null,"Raw Adjusted MD","MVA","Non-Coincident"]
[null,null,null,null,"Coincident"]
[null,null,"Date MD occurred",null,"Non-Coincident"]
[null,null,null,null,"Coincident"]
[null,null,"Half hour time period MD occurred",null,"Non-Coincident"]
[null,null,null,null,"Coincident"]
[null,null,"Winter/Summer Peaking",null,"Non-Coincident"]
[null,null,null,null,"Coincident"]
[null,null,"Adjustments - Embedded generation","MW","Non-Coincident"]
[null,null,null,null,"Coincident"]
[null,null,"Weather Corrected MD 10% POE","MW","Non-Coincident"]
[null,null,null,null,"Coincident"]
[null,null,"Weather Corrected MD 10% POE","MVA","Non-Coincident"]
[null,null,null,null,"Coincident"]
[null,null,"Weather Corrected MD 50% POE","MW","Non-Coincident"]
[null,null,null,null,"Coincident"]
[null,null,"Weather Corrected MD 50% POE","MVA","Non-Coincident"]
[null,null,null,null,"Coincident"]
[null,"<Enter connection point name>","Connection Point Rating","MVA","Non-Coincident"]
[null,null,null,null,"Coincident"]
[null,null,"Raw Adjusted MD","MW","Non-Coincident"]
[null,null,null,null,"Coincident"]
[null,null,"Raw Adjusted MD","MVA","Non-Coincident"]
[null,null,null,null,"Coincident"]
[null,null,"Date MD occurred",null,"Non-Coincident"]
[null,null,null,null,"Coincident"]
[null,null,"Half hour time period MD occurred",null,"Non-Coincident"]
[null,null,null,null,"Coincident"]
[null,null,"Winter/Summer Peaking",null,"Non-Coincident"]
[null,null,null,null,"Coincident"]
[null,null,"Adjustments - Embedded generation","MW","Non-Coincident"]
[null,null,null,null,"Coincident"]
[null,null,"Weather Corrected MD 10% POE","MW","Non-Coincident"]
[null,null,null,null,"Coincident"]
[null,null,"Weather Corrected MD 10% POE","MVA","Non-Coincident"]
[null,null,null,null,"Coincident"]
[null,null,"Weather Corrected MD 50% POE","MW","Non-Coincident"]
[null,null,null,null,"Coincident"]
[null,null,"Weather Corrected MD 50% POE","MVA","Non-Coincident"]
[null,null,null,null,"Coincident"]
[null,"<Enter connection point name>","Connection Point Rating","MVA","Non-Coincident"]
[null,null,null,null,"Coincident"]
[null,null,"Raw Adjusted MD","MW","Non-Coincident"]
[null,null,null,null,"Coincident"]
[null,null,"Raw Adjusted MD","MVA","Non-Coincident"]
[null,null,null,null,"Coincident"]
[null,null,"Date MD occurred",null,"Non-Coincident"]
[null,null,null,null,"Coincident"]
[null,null,"Half hour time period MD occurred",null,"Non-Coincident"]
[null,null,null,null,"Coincident"]
[null,null,"Winter/Summer Peaking",null,"Non-Coincident"]
[null,null,null,null,"Coincident"]
[null,null,"Adjustments - Embedded generation","MW","Non-Coincident"]
[null,null,null,null,"Coincident"]
[null,null,"Weather Corrected MD 10% POE","MW","Non-Coincident"]
[null,null,null,null,"Coincident"]
[null,null,"Weather Corrected MD 10% POE","MVA","Non-Coincident"]
[null,null,null,null,"Coincident"]
[null,null,"Weather Corrected MD 50% POE","MW","Non-Coincident"]
[null,null,null,null,"Coincident"]
[null,null,"Weather Corrected MD 50% POE","MVA","Non-Coincident"]
[null,null,null,null,"Coincident"]
[null,"<Enter connection point name>","Connection Point Rating","MVA","Non-Coincident"]
[null,null,null,null,"Coincident"]
[null,null,"Raw Adjusted MD","MW","Non-Coincident"]
[null,null,null,null,"Coincident"]
[null,null,"Raw Adjusted MD","MVA","Non-Coincident"]
[null,null,null,null,"Coincident"]
[null,null,"Date MD occurred",null,"Non-Coincident"]
[null,null,null,null,"Coincident"]
[null,null,"Half hour time period MD occurred",null,"Non-Coincident"]
[null,null,null,null,"Coincident"]
[null,null,"Winter/Summer Peaking",null,"Non-Coincident"]
[null,null,null,null,"Coincident"]
[null,null,"Adjustments - Embedded generation","MW","Non-Coincident"]
[null,null,null,null,"Coincident"]
[null,null,"Weather Corrected MD 10% POE","MW","Non-Coincident"]
[null,null,null,null,"Coincident"]
[null,null,"Weather Corrected MD 10% POE","MVA","Non-Coincident"]
[null,null,null,null,"Coincident"]
[null,null,"Weather Corrected MD 50% POE","MW","Non-Coincident"]
[null,null,null,null,"Coincident"]
[null,null,"Weather Corrected MD 50% POE","MVA","Non-Coincident"]
[null,null,null,null,"Coincident"]
[null,"<Enter connection point name>","Connection Point Rating","MVA","Non-Coincident"]
[null,null,null,null,"Coincident"]
[null,null,"Raw Adjusted MD","MW","Non-Coincident"]
[null,null,null,null,"Coincident"]
[null,null,"Raw Adjusted MD","MVA","Non-Coincident"]
[null,null,null,null,"Coincident"]
[null,null,"Date MD occurred",null,"Non-Coincident"]
[null,null,null,null,"Coincident"]
[null,null,"Half hour time period MD occurred",null,"Non-Coincident"]
[null,null,null,null,"Coincident"]
[null,null,"Winter/Summer Peaking",null,"Non-Coincident"]
[null,null,null,null,"Coincident"]
[null,null,"Adjustments - Embedded generation","MW","Non-Coincident"]
[null,null,null,null,"Coincident"]
[null,null,"Weather Corrected MD 10% POE","MW","Non-Coincident"]
[null,null,null,null,"Coincident"]
[null,null,"Weather Corrected MD 10% POE","MVA","Non-Coincident"]
[null,null,null,null,"Coincident"]
[null,null,"Weather Corrected MD 50% POE","MW","Non-Coincident"]
[null,null,null,null,"Coincident"]
[null,null,"Weather Corrected MD 50% POE","MVA","Non-Coincident"]
[null,null,null,null,"Coincident"]
[null,"<Enter connection point name>","Connection Point Rating","MVA","Non-Coincident"]
[null,null,null,null,"Coincident"]
[null,null,"Raw Adjusted MD","MW","Non-Coincident"]
[null,null,null,null,"Coincident"]
[null,null,"Raw Adjusted MD","MVA","Non-Coincident"]
[null,null,null,null,"Coincident"]
[null,null,"Date MD occurred",null,"Non-Coincident"]
[null,null,null,null,"Coincident"]
[null,null,"Half hour time period MD occurred",null,"Non-Coincident"]
[null,null,null,null,"Coincident"]
[null,null,"Winter/Summer Peaking",null,"Non-Coincident"]
[null,null,null,null,"Coincident"]
[null,null,"Adjustments - Embedded generation","MW","Non-Coincident"]
[null,null,null,null,"Coincident"]
[null,null,"Weather Corrected MD 10% POE","MW","Non-Coincident"]
[null,null,null,null,"Coincident"]
[null,null,"Weather Corrected MD 10% POE","MVA","Non-Coincident"]
[null,null,null,null,"Coincident"]
[null,null,"Weather Corrected MD 50% POE","MW","Non-Coincident"]
[null,null,null,null,"Coincident"]
[null,null,"Weather Corrected MD 50% POE","MVA","Non-Coincident"]
[null,null,null,null,"Coincident"]
[null,"<Enter connection point name>","Connection Point Rating","MVA","Non-Coincident"]
[null,null,null,null,"Coincident"]
[null,null,"Raw Adjusted MD","MW","Non-Coincident"]
[null,null,null,null,"Coincident"]
[null,null,"Raw Adjusted MD","MVA","Non-Coincident"]
[null,null,null,null,"Coincident"]
[null,null,"Date MD occurred",null,"Non-Coincident"]
[null,null,null,null,"Coincident"]
[null,null,"Half hour time period MD occurred",null,"Non-Coincident"]
[null,null,null,null,"Coincident"]
[null,null,"Winter/Summer Peaking",null,"Non-Coincident"]
[null,null,null,null,"Coincident"]
[null,null,"Adjustments - Embedded generation","MW","Non-Coincident"]
[null,null,null,null,"Coincident"]
[null,null,"Weather Corrected MD 10% POE","MW","Non-Coincident"]
[null,null,null,null,"Coincident"]
[null,null,"Weather Corrected MD 10% POE","MVA","Non-Coincident"]
[null,null,null,null,"Coincident"]
[null,null,"Weather Corrected MD 50% POE","MW","Non-Coincident"]
[null,null,null,null,"Coincident"]
[null,null,"Weather Corrected MD 50% POE","MVA","Non-Coincident"]
[null,null,null,null,"Coincident"]
[null,"<Enter connection point name>","Connection Point Rating","MVA","Non-Coincident"]
[null,null,null,null,"Coincident"]
[null,null,"Raw Adjusted MD","MW","Non-Coincident"]
[null,null,null,null,"Coincident"]
[null,null,"Raw Adjusted MD","MVA","Non-Coincident"]
[null,null,null,null,"Coincident"]
[null,null,"Date MD occurred",null,"Non-Coincident"]
[null,null,null,null,"Coincident"]
[null,null,"Half hour time period MD occurred",null,"Non-Coincident"]
[null,null,null,null,"Coincident"]
[null,null,"Winter/Summer Peaking",null,"Non-Coincident"]
[null,null,null,null,"Coincident"]
[null,null,"Adjustments - Embedded generation","MW","Non-Coincident"]
[null,null,null,null,"Coincident"]
[null,null,"Weather Corrected MD 10% POE","MW","Non-Coincident"]
[null,null,null,null,"Coincident"]
[null,null,"Weather Corrected MD 10% POE","MVA","Non-Coincident"]
[null,null,null,null,"Coincident"]
[null,null,"Weather Corrected MD 50% POE","MW","Non-Coincident"]
[null,null,null,null,"Coincident"]
[null,null,"Weather Corrected MD 50% POE","MVA","Non-Coincident"]
[null,null,null,null,"Coincident"]
[null,"<Enter connection point name>","Connection Point Rating","MVA","Non-Coincident"]
[null,null,null,null,"Coincident"]
[null,null,"Raw Adjusted MD","MW","Non-Coincident"]
[null,null,null,null,"Coincident"]
[null,null,"Raw Adjusted MD","MVA","Non-Coincident"]
[null,null,null,null,"Coincident"]
[null,null,"Date MD occurred",null,"Non-Coincident"]
[null,null,null,null,"Coincident"]
[null,null,"Half hour time period MD occurred",null,"Non-Coincident"]
[null,null,null,null,"Coincident"]
[null,null,"Winter/Summer Peaking",null,"Non-Coincident"]
[null,null,null,null,"Coincident"]
[null,null,"Adjustments - Embedded generation","MW","Non-Coincident"]
[null,null,null,null,"Coincident"]
[null,null,"Weather Corrected MD 10% POE","MW","Non-Coincident"]
[null,null,null,null,"Coincident"]
[null,null,"Weather Corrected MD 10% POE","MVA","Non-Coincident"]
[null,null,null,null,"Coincident"]
[null,null,"Weather Corrected MD 50% POE","MW","Non-Coincident"]
[null,null,null,null,"Coincident"]
[null,null,"Weather Corrected MD 50% POE","MVA","Non-Coincident"]
[null,null,null,null,"Coincident"]
[null,"<Enter connection point name>","Connection Point Rating","MVA","Non-Coincident"]
[null,null,null,null,"Coincident"]
[null,null,"Raw Adjusted MD","MW","Non-Coincident"]
[null,null,null,null,"Coincident"]
[null,null,"Raw Adjusted MD","MVA","Non-Coincident"]
[null,null,null,null,"Coincident"]
[null,null,"Date MD occurred",null,"Non-Coincident"]
[null,null,null,null,"Coincident"]
[null,null,"Half hour time period MD occurred",null,"Non-Coincident"]
[null,null,null,null,"Coincident"]
[null,null,"Winter/Summer Peaking",null,"Non-Coincident"]
[null,null,null,null,"Coincident"]
[null,null,"Adjustments - Embedded generation","MW","Non-Coincident"]
[null,null,null,null,"Coincident"]
[null,null,"Weather Corrected MD 10% POE","MW","Non-Coincident"]
[null,null,null,null,"Coincident"]
[null,null,"Weather Corrected MD 10% POE","MVA","Non-Coincident"]
[null,null,null,null,"Coincident"]
[null,null,"Weather Corrected MD 50% POE","MW","Non-Coincident"]
[null,null,null,null,"Coincident"]
[null,null,"Weather Corrected MD 50% POE","MVA","Non-Coincident"]
[null,null,null,null,"Coincident"]
[null,"<Enter connection point name>","Connection Point Rating","MVA","Non-Coincident"]
[null,null,null,null,"Coincident"]
[null,null,"Raw Adjusted MD","MW","Non-Coincident"]
[null,null,null,null,"Coincident"]
[null,null,"Raw Adjusted MD","MVA","Non-Coincident"]
[null,null,null,null,"Coincident"]
[null,null,"Date MD occurred",null,"Non-Coincident"]
[null,null,null,null,"Coincident"]
[null,null,"Half hour time period MD occurred",null,"Non-Coincident"]
[null,null,null,null,"Coincident"]
[null,null,"Winter/Summer Peaking",null,"Non-Coincident"]
[null,null,null,null,"Coincident"]
[null,null,"Adjustments - Embedded generation","MW","Non-Coincident"]
[null,null,null,null,"Coincident"]
[null,null,"Weather Corrected MD 10% POE","MW","Non-Coincident"]
[null,null,null,null,"Coincident"]
[null,null,"Weather Corrected MD 10% POE","MVA","Non-Coincident"]
[null,null,null,null,"Coincident"]
[null,null,"Weather Corrected MD 50% POE","MW","Non-Coincident"]
[null,null,null,null,"Coincident"]
[null,null,"Weather Corrected MD 50% POE","MVA","Non-Coincident"]
[null,null,null,null,"Coincident"]
[null,"<Enter connection point name>","Connection Point Rating","MVA","Non-Coincident"]
[null,null,null,null,"Coincident"]
[null,null,"Raw Adjusted MD","MW","Non-Coincident"]
[null,null,null,null,"Coincident"]
[null,null,"Raw Adjusted MD","MVA","Non-Coincident"]
[null,null,null,null,"Coincident"]
[null,null,"Date MD occurred",null,"Non-Coincident"]
[null,null,null,null,"Coincident"]
[null,null,"Half hour time period MD occurred",null,"Non-Coincident"]
[null,null,null,null,"Coincident"]
[null,null,"Winter/Summer Peaking",null,"Non-Coincident"]
[null,null,null,null,"Coincident"]
[null,null,"Adjustments - Embedded generation","MW","Non-Coincident"]
[null,null,null,null,"Coincident"]
[null,null,"Weather Corrected MD 10% POE","MW","Non-Coincident"]
[null,null,null,null,"Coincident"]
[null,null,"Weather Corrected MD 10% POE","MVA","Non-Coincident"]
[null,null,null,null,"Coincident"]
[null,null,"Weather Corrected MD 50% POE","MW","Non-Coincident"]
[null,null,null,null,"Coincident"]
[null,null,"Weather Corrected MD 50% POE","MVA","Non-Coincident"]
[null,null,null,null,"Coincident"]
[null,"<Enter connection point name>","Connection Point Rating","MVA","Non-Coincident"]
[null,null,null,null,"Coincident"]
[null,null,"Raw Adjusted MD","MW","Non-Coincident"]
[null,null,null,null,"Coincident"]
[null,null,"Raw Adjusted MD","MVA","Non-Coincident"]
[null,null,null,null,"Coincident"]
[null,null,"Date MD occurred",null,"Non-Coincident"]
[null,null,null,null,"Coincident"]
[null,null,"Half hour time period MD occurred",null,"Non-Coincident"]
[null,null,null,null,"Coincident"]
[null,null,"Winter/Summer Peaking",null,"Non-Coincident"]
[null,null,null,null,"Coincident"]
[null,null,"Adjustments - Embedded generation","MW","Non-Coincident"]
[null,null,null,null,"Coincident"]
[null,null,"Weather Corrected MD 10% POE","MW","Non-Coincident"]
[null,null,null,null,"Coincident"]
[null,null,"Weather Corrected MD 10% POE","MVA","Non-Coincident"]
[null,null,null,null,"Coincident"]
[null,null,"Weather Corrected MD 50% POE","MW","Non-Coincident"]
[null,null,null,null,"Coincident"]
[null,null,"Weather Corrected MD 50% POE","MVA","Non-Coincident"]
[null,null,null,null,"Coincident"]
[null,"<Enter connection point name>","Connection Point Rating","MVA","Non-Coincident"]
[null,null,null,null,"Coincident"]
[null,null,"Raw Adjusted MD","MW","Non-Coincident"]
[null,null,null,null,"Coincident"]
[null,null,"Raw Adjusted MD","MVA","Non-Coincident"]
[null,null,null,null,"Coincident"]
[null,null,"Date MD occurred",null,"Non-Coincident"]
[null,null,null,null,"Coincident"]
[null,null,"Half hour time period MD occurred",null,"Non-Coincident"]
[null,null,null,null,"Coincident"]
[null,null,"Winter/Summer Peaking",null,"Non-Coincident"]
[null,null,null,null,"Coincident"]
[null,null,"Adjustments - Embedded generation","MW","Non-Coincident"]
[null,null,null,null,"Coincident"]
[null,null,"Weather Corrected MD 10% POE","MW","Non-Coincident"]
[null,null,null,null,"Coincident"]
[null,null,"Weather Corrected MD 10% POE","MVA","Non-Coincident"]
[null,null,null,null,"Coincident"]
[null,null,"Weather Corrected MD 50% POE","MW","Non-Coincident"]
[null,null,null,null,"Coincident"]
[null,null,"Weather Corrected MD 50% POE","MVA","Non-Coincident"]
[null,null,null,null,"Coincident"]
[null,"<Enter connection point name>","Connection Point Rating","MVA","Non-Coincident"]
[null,null,null,null,"Coincident"]
[null,null,"Raw Adjusted MD","MW","Non-Coincident"]
[null,null,null,null,"Coincident"]
[null,null,"Raw Adjusted MD","MVA","Non-Coincident"]
[null,null,null,null,"Coincident"]
[null,null,"Date MD occurred",null,"Non-Coincident"]
[null,null,null,null,"Coincident"]
[null,null,"Half hour time period MD occurred",null,"Non-Coincident"]
[null,null,null,null,"Coincident"]
[null,null,"Winter/Summer Peaking",null,"Non-Coincident"]
[null,null,null,null,"Coincident"]
[null,null,"Adjustments - Embedded generation","MW","Non-Coincident"]
[null,null,null,null,"Coincident"]
[null,null,"Weather Corrected MD 10% POE","MW","Non-Coincident"]
[null,null,null,null,"Coincident"]
[null,null,"Weather Corrected MD 10% POE","MVA","Non-Coincident"]
[null,null,null,null,"Coincident"]
[null,null,"Weather Corrected MD 50% POE","MW","Non-Coincident"]
[null,null,null,null,"Coincident"]
[null,null,"Weather Corrected MD 50% POE","MVA","Non-Coincident"]
[null,null,null,null,"Coincident"]
[null,"<Enter connection point name>","Connection Point Rating","MVA","Non-Coincident"]
[null,null,null,null,"Coincident"]
[null,null,"Raw Adjusted MD","MW","Non-Coincident"]
[null,null,null,null,"Coincident"]
[null,null,"Raw Adjusted MD","MVA","Non-Coincident"]
[null,null,null,null,"Coincident"]
[null,null,"Date MD occurred",null,"Non-Coincident"]
[null,null,null,null,"Coincident"]
[null,null,"Half hour time period MD occurred",null,"Non-Coincident"]
[null,null,null,null,"Coincident"]
[null,null,"Winter/Summer Peaking",null,"Non-Coincident"]
[null,null,null,null,"Coincident"]
[null,null,"Adjustments - Embedded generation","MW","Non-Coincident"]
[null,null,null,null,"Coincident"]
[null,null,"Weather Corrected MD 10% POE","MW","Non-Coincident"]
[null,null,null,null,"Coincident"]
[null,null,"Weather Corrected MD 10% POE","MVA","Non-Coincident"]
[null,null,null,null,"Coincident"]
[null,null,"Weather Corrected MD 50% POE","MW","Non-Coincident"]
[null,null,null,null,"Coincident"]
[null,null,"Weather Corrected MD 50% POE","MVA","Non-Coincident"]
[null,null,null,null,"Coincident"]
[null,"<Enter connection point name>","Connection Point Rating","MVA","Non-Coincident"]
[null,null,null,null,"Coincident"]
[null,null,"Raw Adjusted MD","MW","Non-Coincident"]
[null,null,null,null,"Coincident"]
[null,null,"Raw Adjusted MD","MVA","Non-Coincident"]
[null,null,null,null,"Coincident"]
[null,null,"Date MD occurred",null,"Non-Coincident"]
[null,null,null,null,"Coincident"]
[null,null,"Half hour time period MD occurred",null,"Non-Coincident"]
[null,null,null,null,"Coincident"]
[null,null,"Winter/Summer Peaking",null,"Non-Coincident"]
[null,null,null,null,"Coincident"]
[null,null,"Adjustments - Embedded generation","MW","Non-Coincident"]
[null,null,null,null,"Coincident"]
[null,null,"Weather Corrected MD 10% POE","MW","Non-Coincident"]
[null,null,null,null,"Coincident"]
[null,null,"Weather Corrected MD 10% POE","MVA","Non-Coincident"]
[null,null,null,null,"Coincident"]
[null,null,"Weather Corrected MD 50% POE","MW","Non-Coincident"]
[null,null,null,null,"Coincident"]
[null,null,"Weather Corrected MD 50% POE","MVA","Non-Coincident"]
[null,null,null,null,"Coincident"]
[null,"<Enter connection point name>","Connection Point Rating","MVA","Non-Coincident"]
[null,null,null,null,"Coincident"]
[null,null,"Raw Adjusted MD","MW","Non-Coincident"]
[null,null,null,null,"Coincident"]
[null,null,"Raw Adjusted MD","MVA","Non-Coincident"]
[null,null,null,null,"Coincident"]
[null,null,"Date MD occurred",null,"Non-Coincident"]
[null,null,null,null,"Coincident"]
[null,null,"Half hour time period MD occurred",null,"Non-Coincident"]
[null,null,null,null,"Coincident"]
[null,null,"Winter/Summer Peaking",null,"Non-Coincident"]
[null,null,null,null,"Coincident"]
[null,null,"Adjustments - Embedded generation","MW","Non-Coincident"]
[null,null,null,null,"Coincident"]
[null,null,"Weather Corrected MD 10% POE","MW","Non-Coincident"]
[null,null,null,null,"Coincident"]
[null,null,"Weather Corrected MD 10% POE","MVA","Non-Coincident"]
[null,null,null,null,"Coincident"]
[null,null,"Weather Corrected MD 50% POE","MW","Non-Coincident"]
[null,null,null,null,"Coincident"]
[null,null,"Weather Corrected MD 50% POE","MVA","Non-Coincident"]
[null,null,null,null,"Coincident"]
[null,"<Enter connection point name>","Connection Point Rating","MVA","Non-Coincident"]
[null,null,null,null,"Coincident"]
[null,null,"Raw Adjusted MD","MW","Non-Coincident"]
[null,null,null,null,"Coincident"]
[null,null,"Raw Adjusted MD","MVA","Non-Coincident"]
[null,null,null,null,"Coincident"]
[null,null,"Date MD occurred",null,"Non-Coincident"]
[null,null,null,null,"Coincident"]
[null,null,"Half hour time period MD occurred",null,"Non-Coincident"]
[null,null,null,null,"Coincident"]
[null,null,"Winter/Summer Peaking",null,"Non-Coincident"]
[null,null,null,null,"Coincident"]
[null,null,"Adjustments - Embedded generation","MW","Non-Coincident"]
[null,null,null,null,"Coincident"]
[null,null,"Weather Corrected MD 10% POE","MW","Non-Coincident"]
[null,null,null,null,"Coincident"]
[null,null,"Weather Corrected MD 10% POE","MVA","Non-Coincident"]
[null,null,null,null,"Coincident"]
[null,null,"Weather Corrected MD 50% POE","MW","Non-Coincident"]
[null,null,null,null,"Coincident"]
[null,null,"Weather Corrected MD 50% POE","MVA","Non-Coincident"]
[null,null,null,null,"Coincident"]
[null,"<Enter connection point name>","Connection Point Rating","MVA","Non-Coincident"]
[null,null,null,null,"Coincident"]
[null,null,"Raw Adjusted MD","MW","Non-Coincident"]
[null,null,null,null,"Coincident"]
[null,null,"Raw Adjusted MD","MVA","Non-Coincident"]
[null,null,null,null,"Coincident"]
[null,null,"Date MD occurred",null,"Non-Coincident"]
[null,null,null,null,"Coincident"]
[null,null,"Half hour time period MD occurred",null,"Non-Coincident"]
[null,null,null,null,"Coincident"]
[null,null,"Winter/Summer Peaking",null,"Non-Coincident"]
[null,null,null,null,"Coincident"]
[null,null,"Adjustments - Embedded generation","MW","Non-Coincident"]
[null,null,null,null,"Coincident"]
[null,null,"Weather Corrected MD 10% POE","MW","Non-Coincident"]
[null,null,null,null,"Coincident"]
[null,null,"Weather Corrected MD 10% POE","MVA","Non-Coincident"]
[null,null,null,null,"Coincident"]
[null,null,"Weather Corrected MD 50% POE","MW","Non-Coincident"]
[null,null,null,null,"Coincident"]
[null,null,"Weather Corrected MD 50% POE","MVA","Non-Coincident"]
[null,null,null,null,"Coincident"]
[null,"<Enter connection point name>","Connection Point Rating","MVA","Non-Coincident"]
[null,null,null,null,"Coincident"]
[null,null,"Raw Adjusted MD","MW","Non-Coincident"]
[null,null,null,null,"Coincident"]
[null,null,"Raw Adjusted MD","MVA","Non-Coincident"]
[null,null,null,null,"Coincident"]
[null,null,"Date MD occurred",null,"Non-Coincident"]
[null,null,null,null,"Coincident"]
[null,null,"Half hour time period MD occurred",null,"Non-Coincident"]
[null,null,null,null,"Coincident"]
[null,null,"Winter/Summer Peaking",null,"Non-Coincident"]
[null,null,null,null,"Coincident"]
[null,null,"Adjustments - Embedded generation","MW","Non-Coincident"]
[null,null,null,null,"Coincident"]
[null,null,"Weather Corrected MD 10% POE","MW","Non-Coincident"]
[null,null,null,null,"Coincident"]
[null,null,"Weather Corrected MD 10% POE","MVA","Non-Coincident"]
[null,null,null,null,"Coincident"]
[null,null,"Weather Corrected MD 50% POE","MW","Non-Coincident"]
[null,null,null,null,"Coincident"]
[null,null,"Weather Corrected MD 50% POE","MVA","Non-Coincident"]
[null,null,null,null,"Coincident"]
[null,"<Enter connection point name>","Connection Point Rating","MVA","Non-Coincident"]
[null,null,null,null,"Coincident"]
[null,null,"Raw Adjusted MD","MW","Non-Coincident"]
[null,null,null,null,"Coincident"]
[null,null,"Raw Adjusted MD","MVA","Non-Coincident"]
[null,null,null,null,"Coincident"]
[null,null,"Date MD occurred",null,"Non-Coincident"]
[null,null,null,null,"Coincident"]
[null,null,"Half hour time period MD occurred",null,"Non-Coincident"]
[null,null,null,null,"Coincident"]
[null,null,"Winter/Summer Peaking",null,"Non-Coincident"]
[null,null,null,null,"Coincident"]
[null,null,"Adjustments - Embedded generation","MW","Non-Coincident"]
[null,null,null,null,"Coincident"]
[null,null,"Weather Corrected MD 10% POE","MW","Non-Coincident"]
[null,null,null,null,"Coincident"]
[null,null,"Weather Corrected MD 10% POE","MVA","Non-Coincident"]
[null,null,null,null,"Coincident"]
[null,null,"Weather Corrected MD 50% POE","MW","Non-Coincident"]
[null,null,null,null,"Coincident"]
[null,null,"Weather Corrected MD 50% POE","MVA","Non-Coincident"]
[null,null,null,null,"Coincident"]

{"sheet":"Amendments","index":17,"n_rows":2,"n_cols":4,"rows_kept":2,"cut":false,"hidden":false,"merged":[[0,1,0,3]]}
[null,"NSP data amendments"]
[null,{"$f":"INDEX(dms_TradingNameFull_List,MATCH(dms_TradingName,dms_TradingName_List))","v":"Queensland Electricity Transmission Corporation Limited trading as Powerlink Queensland"},"Table","Comments"]