{"text_format":"1","workbook":"xlsx","n_sheets":28,"sheets":["AER only","Contents","Instructions","Business & other details","2.11 Labour","3.6 Quality of services","3.6.8 Network-feeders","3.6.8 Network-feeders Unlocked","3.6.9 Network-reliability","4.1 Public lighting","6.2 STPIS Reliability","6.6 STPIS Customer Service","6.7 STPIS Daily Performance","6.8 STPIS Exclusions","6.8 STPIS Exclusions Unlocked","6.9 STPIS - GSL","6.9 STPIS - GSL Unlocked","7.8 Avoided TUOS Payments","7.10 Juris Scheme","7.11 DMIS-DMIA","7.12 Safety and Bushfire","7.13 TARC","8.1 Income","8.2 Capex","8.4 Opex","8.4.3 Opex Unlocked","9.5 TUoS","unlocked"],"not_rendered":{"charts":0,"images":4,"macros":1,"external_links":1,"defined_names":386,"comments":2,"pivot_tables":0},"unopened":[],"bounds":{"document_bytes":16777216,"sheet_cells":100000,"rows_first":2000,"rows_last":500,"rows_between":2000,"halvings":0,"cell_chars":16384,"cell_head_chars":4096},"cells_cut":0,"cells_raw":0,"read":"whole","date_system":"1900"}

{"sheet":"AER only","index":0,"n_rows":74,"n_cols":23,"rows_kept":74,"cut":false,"hidden":true,"merged":[[0,1,0,9],[18,13,18,16]]}
[null,"Data in this worksheet is used for data validation and database purposes."]
[null,"Date last modified:"]
[null,"14 April 2015","merged cell C46/47"]
[null,"17 April 2015","adjusted dms_RYE to automate based on dms_Model (NB: EB & CA refer to CRCP_y5)"]
[null,"14 May 2015","adapted this cover for use in CA & EB RINs"]
[]
[null,"October 2015","added full Trading Name for worksheet headings"]
[null,"USES NAMED RANGES FLAG","yes"]
[null,"dms_Model_List ","dms_Worksheet_List ",null,"dms_RYE_Formula_Result"]
[null,"ARR","REGULATORY REPORTING STATEMENT",null,{"$f":"LEFT(CRY,2)&RIGHT(CRY,2)","v":"2016"}]
[null,"CA","CATEGORY ANALYSIS",null,{"$f":"LEFT(CRY,2)&RIGHT(CRY,2)","v":"2016"}]
[null,"CAM/Service change Backcast","REGULATORY REPORTING STATEMENT",null,{"$f":"LEFT(dms_FRCP_FinalYear_Num,2)&RIGHT(dms_FRCP_FinalYear_Num,2)","v":"2021"}]
[null,"CPI","CPI"]
[null,"EB","ECONOMIC BENCHMARKING",null,{"$f":"LEFT(CRY,2)&RIGHT(CRY,2)","v":"2016"}]
[null,"PTRM","POST TAX REVENUE MODEL",null,{"$f":"LEFT(dms_FRCP_FinalYear_Num,2)&RIGHT(dms_FRCP_FinalYear_Num,2)","v":"2021"}]
[null,"Reset","REGULATORY REPORTING STATEMENT",null,{"$f":"LEFT(dms_FRCP_FinalYear_Num,2)&RIGHT(dms_FRCP_FinalYear_Num,2)","v":"2021"}]
[null,"RFM","ROLL FORWARD MODEL",null,{"$f":"LEFT(dms_CRCP_FinalYear_Num,2)&RIGHT(dms_CRCP_FinalYear_Num,2)","v":"2015"}]
[null,"WACC","WEIGHTED AVERAGE COST OF CAPITAL"]
[null,null,null,null,null,null,null,null,null,null,null,null,null,"Feeder Types",null,null,null,"TasNetworks (D)"]
[null,null,null,null,null,null,null,null,null,null,null,null,null,"CBD","Urban","Short rural","long rural","EXTRA"]
[null,"dms_TradingName_List","dms_TradingNameFull_List","dms_ABN_List","dms_State_List","dms_Sector_List","dms_Segment_List","dms_FormControl_List","dms_CRCPlength_List","dms_FRCPlength_List","dms_JurisdictionList","dms_663_List","dms_DeterminationRef_List","dms_CBD_flag","dms_Urban_flag","dms_ShortRural_flag","dms_LongRural_flag","dms_FeederType_5_flag","dms_FeederName_1","dms_FeederName_2","dms_FeederName_3","dms_FeederName_4","dms_FeederName_5"]
[null,"ActewAGL Distribution","ActewAGL Distribution",76670568688,"ACT","Electricity","Distribution","Revenue cap",5,6,"ACT",5,"2014-19 Distribution Determination","NO","YES","YES","NO","NO","CBD","Urban","Short rural","Long rural"]
[null,"ActewAGL Distribution (Tx Assets)","ActewAGL Distribution (Tx Assets)",76670568688,"ACT","Electricity","Distribution","Revenue cap",5,5,"ACT",5,"distribution determination",null,null,null,null,null,"CBD","Urban","Short rural","Long rural"]
[null,"AGN","AGN",78551685,"SA","Gas","Distribution","Revenue cap",5,5,"SA",5,"distribution determination",null,null,null,null,null,"CBD","Urban","Short rural","Long rural"]
[null,"Ausgrid","Ausgrid",67505337385,"NSW","Electricity","Distribution","Revenue cap",5,5,"NSW",5,"2014-19 Distribution Determination","YES","YES","YES","YES","NO","CBD","Urban","Short rural","Long rural"]
[null,"Ausgrid (Tx Assets)","Ausgrid (Tx Assets)",67505337385,"NSW","Electricity","Distribution","Revenue cap",5,5,"NSW",5,"distribution determination",null,null,null,null,null,"CBD","Urban","Short rural","Long rural"]
[null,"AusNet (D)","AusNet Electricity Services",91064651118,"Vic","Electricity","Distribution","Revenue cap",5,5,"Vic",2,"2016-20 Distribution Determination","NO","YES","YES","YES","NO","CBD","Urban","Short rural","Long rural"]
[null,"AusNet (T)","AusNet (T)",48116124362,"Vic","Electricity","Transmission","Revenue cap",5,5,"Vic",2,"distribution determination",null,null,null,null,null,"CBD","Urban","Short rural","Long rural"]
[null,"Australian Distribution Co.","Australian Distribution Co.",11222333444,"-","Electricity","Distribution","Revenue cap",5,5,"NSW",2,"distribution determination",null,null,null,null,null,"CBD","Urban","Short rural","Long rural"]
[null,"Australian Transmission Co.","Australian Transmission Co.",11222333444,"-","Electricity","Transmission","Revenue cap",5,5,"Vic",5,"distribution determination",null,null,null,null,null,"CBD","Urban","Short rural","Long rural"]
[null,"CitiPower","CitiPower",76064651056,"Vic","Electricity","Distribution","Revenue cap",5,5,"Vic",2,"2016-20 Distribution Determination","YES","YES","NO","NO","NO","CBD","Urban","Short rural","Long rural"]
[null,"Directlink","Directlink",16779340889,"NSW","Electricity","Transmission","Revenue cap",10,5,"Qld",5,"distribution determination",null,null,null,null,null,"CBD","Urban","Short rural","Long rural"]
[null,"ElectraNet","ElectraNet",41094482416,"SA","Electricity","Transmission","Revenue cap",5,5,"SA",5,"distribution determination",null,null,null,null,null,"CBD","Urban","Short rural","Long rural"]
[null,"Endeavour Energy","Endeavour Energy",59253130878,"NSW","Electricity","Distribution","Revenue cap",5,5,"NSW",5,"2014-19 Distribution Determination","NO","YES","YES","YES","NO","CBD","Urban","Short rural","Long rural"]
[null,"Energex","Energex",40078849055,"Qld","Electricity","Distribution","Revenue cap",5,5,"Qld",5,"2015-20 Distribution Determination","YES","YES","YES","NO","NO","CBD","Urban","Short rural","Long rural"]
[null,"Ergon Energy","Ergon Energy",50087646062,"Qld","Electricity","Distribution","Revenue cap",5,5,"Qld",5,"2015-20 Distribution Determination","NO","YES","YES","YES","NO","CBD","Urban","Short rural","Long rural"]
[null,"Essential Energy","Essential Energy",37428185226,"NSW","Electricity","Distribution","Revenue cap",5,5,"NSW",5,"2014-19 Distribution Determination","NO","YES","YES","YES","NO","CBD","Urban","Short rural","Long rural"]
[null,"Jemena Electricity","Jemena Electricity",82064651083,"Vic","Electricity","Distribution","Revenue cap",5,5,"Vic",2,"2016-20 Distribution Determination","NO","YES","YES","NO","NO","CBD","Urban","Short rural","Long rural"]
[null,"Murraylink","Murraylink",79181207909,"NSW","Electricity","Transmission","Revenue cap",5,5,"SA",5,"distribution determination",null,null,null,null,null,"CBD","Urban","Short rural","Long rural"]
[null,"Powercor Australia","Powercor Australia",89064651109,"Vic","Electricity","Distribution","Revenue cap",5,5,"Vic",2,"2016-20 Distribution Determination","NO","YES","YES","YES","NO","CBD","Urban","Short rural","Long rural"]
[null,"Powerlink","Queensland Electricity Transmission Corporation Limited trading as Powerlink Queensland",82078849233,"Qld","Electricity","Transmission","Revenue cap",5,5,"Qld",5,"distribution determination",null,null,null,null,null,"CBD","Urban","Short rural","Long rural"]
[null,"Qld,SA &ACT Gas Reset","Qld,SA &ACT Gas Reset",22222222222,"-","Gas","Distribution","?",5,5,"-","x","distribution determination",null,null,null,null,null,"CBD","Urban","Short rural","Long rural"]
[null,"SA Power Networks","SA Power Networks",13332330749,"SA","Electricity","Distribution","Revenue cap",5,5,"SA",5,"2015-20 Distribution Determination","YES","YES","YES","YES","NO","CBD","Urban","Short rural","Long rural"]
[null,"TasNetworks (D)","TasNetworks (D)",24167357299,"Tas","Electricity","Distribution","Revenue cap",5,5,"Tas",5,"distribution determination","YES","YES","YES","YES","YES","Critical Infrastructure","High density commercial","Urban","High density rural","Low density rural"]
[null,"TasNetworks (T)","TasNetworks (T)",24167357299,"Tas","Electricity","Transmission","Revenue cap",5,5,"Tas",5,"distribution determination",null,null,null,null,null,"CBD","Urban","Short rural","Long rural"]
[null,"TransGrid","TransGrid",19622755774,"NSW","Electricity","Transmission","Revenue cap",5,5,"NSW",5,"distribution determination",null,null,null,null,null,"CBD","Urban","Short rural","Long rural"]
[null,"United Energy","United Energy",70064651029,"Vic","Electricity","Distribution","Revenue cap",5,5,"Vic",2,"2016-20 Distribution Determination","NO","YES","YES","NO","NO","CBD","Urban","Short rural","Long rural"]
[null,"DNSP Backcasting","Victorian DNSP Backcasting",33333333666,"Vic","Electricity","Distribution","?",5,5,"-","x","distribution determination",null,null,null,null,null,"CBD","Urban","Short rural","Long rural"]
[null,"DNSP Reset ","Victorian DNSP Reset ",33333333333,"Vic","Electricity","Distribution","?",5,5,"-","x","distribution determination",null,null,null,null,null,"CBD","Urban","Short rural","Long rural"]
[]
[]
[]
[]
[null,"dms_SourceList","dms_FormControl_Choices",null,"dms_FRCPlength_Num_List","dms_FinalYear_List"]
[null,"After appeal","Revenue cap",null,1,"FRCP_y1"]
[null,"Draft decision","Revenue yield",null,2,"FRCP_y2"]
[null,"Final decision","Weighted average price cap",null,3,"FRCP_y3"]
[null,"Pass through decision",null,null,4,"FRCP_y4"]
[null,"PTRM annual update",null,null,5,"FRCP_y5"]
[null,"PTRM interim update 1",null,null,6,"FRCP_y6"]
[null,"PTRM interim update 2",null,null,7,"FRCP_y7"]
[null,"PTRM interim update 3",null,null,8,"FRCP_y8"]
[null,"PTRM interim update 4",null,null,9,"FRCP_y9"]
[null,"Regulatory proposal",null,null,10,"FRCP_y10"]
[null,"Reporting"]
[null,"Revised regulatory proposal"]
[null,"RFM annual update"]
[null,"WACC annual update"]
[]
[]
[null,"Notes"]
[null,"RFM - Base year is usually CRCP_y1","EG. Victorian 2016-20 - base year = 2011"]
[null,"RFM - Form of Control Field is not relevant"]
[null,"PTRM - capture base year input by NSP","=PTRM input'!Q7"]

{"sheet":"Contents","index":1,"n_rows":31,"n_cols":4,"rows_kept":31,"cut":false,"hidden":false,"merged":[[2,1,2,3],[3,1,3,3],[4,1,4,3]]}
[]
[]
[null,{"$f":"CONCATENATE(dms_Segment,\" Network Service Provider\")","v":"Distribution Network Service Provider"}]
[null,"Annual Reporting RIN Template"]
[null,"Table of Contents"]
[]
[]
[null,null,"Instructions"]
[null,null,"Business & other details"]
[]
[]
[null,"CATEGORY ANALYSIS","STPIS","STATUTORY ACCOUNTS"]
[]
[null,"2.11 Labour","6.2 STPIS Reliability","8.1 Income"]
[null,null,"6.6 STPIS Customer Service","8.2 Capex"]
[null,null,"6.7 STPIS Daily Performance"]
[null,null,"6.8 STPIS Exclusions","8.4 Opex"]
[null,null,"6.9 STPIS GSL"]
[]
[]
[]
[null,"NETWORK PERFORMANCE","OTHER INFORMATION","PRICING PROPOSAL"]
[null,null,null,"Victorian Businesses Only"]
[null,"3.6 Quality of services","7.8 Avoided Cost Payments"]
[null,"3.6.8 Network-feeders","7.10 Juris Scheme","9.5 TUoS"]
[null,"3.6.9 Network-reliability","7.11 DMIS-DMIA"]
[null,null,"7.12 Safety and Bushfire"]
[null,null,"7.13 TARC"]
[null,"PUBLIC LIGHTING"]
[]
[null,"4.1 Public lighting tariffs"]

{"sheet":"Instructions","index":2,"n_rows":26,"n_cols":6,"rows_kept":26,"cut":false,"hidden":false,"merged":[[17,2,17,4],[19,2,19,4],[25,2,25,4],[7,1,7,5],[8,1,8,5],[14,2,14,4],[10,2,10,4],[16,2,16,3]]}
[]
[]
[]
[]
[]
[]
[]
[null,{"$f":"CONCATENATE(dms_Segment,\" Network Service Provider\")","v":"Distribution Network Service Provider"}]
[null,"Annual Reporting RIN Template"]
[]
[null,null,{"$f":"CONCATENATE(\"This template is to be used by \",dms_TradingName, \" to fulfil its annual reporting obligations to the AER.\")","v":"This template is to be used by SA Power Networks to fulfil its annual reporting obligations to the AER."}]
[null,null,null,null,null,"Amendments made December 2015"]
[null,null,null,null,null,"Click here for details."]
[null,null,"INSTRUCTIONS"]
[null,null,"Complete the Business & other details worksheet before entering data or values in any other worksheets. The Business & other details worksheet is linked to other cells within the workbook and automatically generates certain column headings and conditional formatting."]
[]
[null,null,"Identifying CONFIDENTIAL INFORMATION:\n\nPlease use the macro at the top of each \nworksheet to identify confidential information. \n\n"]
[null,null,"-Do this by selecting the cell or cells that contain confidential information and then run the Mark selected cells as CONFIDENTIAL macro. This will format the cells a specific colour that is identified by the AER's database which in turn marks that information as confidential.\n\n-To reverse this, select the cell or cells and run the Return cells to NON-CONFIDENTIAL macro"]
[]
[null,null,"All amounts are to be unrounded and reported in nominal terms on a one for one basis: that is 1000 is to be entered as '1000' not '1' as in previous templates.\n\nColour coding of input sheets:"]
[null,null,null,"Yellow = Input cells"]
[null,null,null,"Grey = Not applicable/No inputs required"]
[null,null,null,"Leave coloured cells blank if no information exists. \nPLEASE DO NOT ENTER TEXT into cells that are to contain numeric data."]
[]
[]
[null,null,"Returning completed responses\n\nPlease return two (2) files to the AER: \n1. A confidential version which must contain a complete set of all responses with confidential information marked using the Mark selected cells CONFIDENTIAL macro and which has been completed using the locked template file provided by the AER. \n\n2. A public version with confidential information either removed completely or aggregated in some form together with writtten consent to disclose the public version of the response.\n\nUse the drop down box on the Business and other details worksheet to identify the file as either confidential ('consolidated') or public. "]

{"sheet":"Business & other details","index":3,"n_rows":78,"n_cols":13,"rows_kept":78,"cut":false,"hidden":false,"merged":[[13,3,13,4],[14,3,14,4],[30,6,30,7],[71,4,71,9],[48,3,48,4],[50,3,50,9],[23,5,23,8],[24,5,24,8],[6,2,6,9],[11,2,11,9],[32,2,32,9],[28,6,28,7],[29,6,29,7],[19,3,19,4],[22,3,22,4],[17,3,17,4],[24,3,24,4],[28,3,28,4],[29,3,29,4],[30,3,30,4],[17,5,17,8],[18,5,18,8],[19,5,19,8],[22,5,22,8]]}
[null,null,{"$f":"(LOOKUP(dms_Model,dms_Model_List,dms_Worksheet_List))","v":"REGULATORY REPORTING STATEMENT"}]
[null,null,{"$f":"dms_TradingName","v":"SA Power Networks"}]
[null,null,{"$f":"CONCATENATE(\"Annual Reporting RIN Response \",CRY)","v":"Annual Reporting RIN Response 2015-16"}]
[null,null,"BUSINESS & OTHER DETAILS"]
[]
[null,null,"Instructions"]
[null,null,"Complete the following business details regulatory template before entering data or values in any other regulatory templates. This regulatory template is linked to other cells within these worksheets and is used to automatically generate some column headings and to apply conditional formatting to certain cells."]
[]
[]
[null,null,"SUBMISSION PARTICULARS INPUT SHEETS"]
[]
[null,null,"ENTITY DETAILS"]
[]
[null,null,"Short name","SA Power Networks"]
[null,null,"ACN / ABN",{"$f":"INDEX(dms_ABN_List,MATCH(dms_TradingName,dms_TradingName_List))","v":13332330749}]
[]
[]
[null,null,"Business address","Address 1",null,"1 Anzac Highway"]
[null,null,null,null,"Address 2"]
[null,null,null,"Suburb",null,"Keswick"]
[null,null,null,null,"State",{"$f":"INDEX(dms_State_List,MATCH(dms_TradingName,dms_TradingName_List))","v":"SA"},"p/code",5035]
[]
[null,null,"Postal address","Address 1",null,"GPO Box 77"]
[null,null,null,null,"Address 2"]
[null,null,null,"Suburb",null,"Adelaide"]
[null,null,null,null,"State","SA","p/code",5001]
[]
[]
[null,null,"Contact name/s","Richard Sibly"]
[null,null,"Contact phone/s"]
[null,null,"Contact email address/s"]
[]
[null,null,"REGULATORY CONTROL PERIODS"]
[]
[null,null,"Forthcoming regulatory control period","2016-17",{"$f":"IF(dms_RPT=\"financial\",VALUE(LEFT(FRCP_y1,4)+1)&\"-\"&VALUE(MID(FRCP_y1,3,2)+2),VALUE(LEFT(FRCP_y1,4)+1))","v":"2017-18"},{"$f":"IF(dms_RPT=\"financial\",VALUE(LEFT(FRCP_y2,4)+1)&\"-\"&VALUE(MID(FRCP_y2,3,2)+2),VALUE(LEFT(FRCP_y2,4)+1))","v":"2018-19"},{"$f":"IF(dms_RPT=\"financial\",VALUE(LEFT(FRCP_y3,4)+1)&\"-\"&VALUE(MID(FRCP_y3,3,2)+2),VALUE(LEFT(FRCP_y3,4)+1))","v":"2019-20"},{"$f":"IF(dms_RPT=\"financial\",VALUE(LEFT(FRCP_y4,4)+1)&\"-\"&VALUE(MID(FRCP_y4,3,2)+2),VALUE(LEFT(FRCP_y4,4)+1))","v":"2020-21"},{"$f":"IF(dms_RPT=\"financial\",VALUE(LEFT(FRCP_y5,4)+1)&\"-\"&VALUE(MID(FRCP_y5,3,2)+2),VALUE(LEFT(FRCP_y5,4)+1))","v":"2021-22"},{"$f":"IF(dms_RPT=\"financial\",VALUE(LEFT(FRCP_y6,4)+1)&\"-\"&VALUE(MID(FRCP_y6,3,2)+2),VALUE(LEFT(FRCP_y6,4)+1))","v":"2022-23"},{"$f":"IF(dms_RPT=\"financial\",VALUE(LEFT(FRCP_y7,4)+1)&\"-\"&VALUE(MID(FRCP_y7,3,2)+2),VALUE(LEFT(FRCP_y7,4)+1))","v":"2023-24"},{"$f":"IF(dms_RPT=\"financial\",VALUE(LEFT(FRCP_y8,4)+1)&\"-\"&VALUE(MID(FRCP_y8,3,2)+2),VALUE(LEFT(FRCP_y8,4)+1))","v":"2024-25"},{"$f":"IF(dms_RPT=\"financial\",VALUE(LEFT(FRCP_y9,4)+1)&\"-\"&VALUE(MID(FRCP_y9,3,2)+2),VALUE(LEFT(FRCP_y9,4)+1))","v":"2025-26"}]
[]
[]
[null,null,"Current regulatory control period",{"$f":"IF(dms_RPT=\"financial\",VALUE(LEFT(CRCP_y2,4)-1)&\"-\"&TEXT(VALUE(RIGHT(CRCP_y2,2)-1),\"0#\"),VALUE(LEFT(CRCP_y2,4)-1))","v":"2011-12"},{"$f":"IF(dms_RPT=\"financial\",VALUE(LEFT(CRCP_y3,4)-1)&\"-\"&TEXT(VALUE(RIGHT(CRCP_y3,2)-1),\"0#\"),VALUE(LEFT(CRCP_y3,4)-1))","v":"2012-13"},{"$f":"IF(dms_RPT=\"financial\",VALUE(LEFT(CRCP_y4,4)-1)&\"-\"&TEXT(VALUE(RIGHT(CRCP_y4,2)-1),\"0#\"),VALUE(LEFT(CRCP_y4,4)-1))","v":"2013-14"},{"$f":"IF(dms_RPT=\"financial\",VALUE(LEFT(CRCP_y5,4)-1)&\"-\"&TEXT(VALUE(RIGHT(CRCP_y5,2)-1),\"0#\"),VALUE(LEFT(CRCP_y5,4)-1))","v":"2014-15"},{"$f":"IF(dms_RPT=\"financial\",VALUE(LEFT(FRCP_y1,4)-1)&\"-\"&TEXT(VALUE(RIGHT(FRCP_y1,2)-1),\"0#\"),VALUE(LEFT(FRCP_y1,4)-1))","v":"2015-16"}]
[]
[]
[null,null,"Previous regulatory control period",{"$f":"IF(dms_RPT=\"financial\",VALUE(LEFT(PRCP_y2,4)-1)&\"-\"&TEXT(VALUE(MID(PRCP_y2,3,2)),\"0#\"),VALUE(LEFT(PRCP_y2,4)-1))","v":"2006-07"},{"$f":"IF(dms_RPT=\"financial\",VALUE(LEFT(PRCP_y3,4)-1)&\"-\"&TEXT(VALUE(MID(PRCP_y3,3,2)),\"0#\"),VALUE(LEFT(PRCP_y3,4)-1))","v":"2007-08"},{"$f":"IF(dms_RPT=\"financial\",VALUE(LEFT(PRCP_y4,4)-1)&\"-\"&TEXT(VALUE(MID(PRCP_y4,3,2)),\"0#\"),VALUE(LEFT(PRCP_y4,4)-1))","v":"2008-09"},{"$f":"IF(dms_RPT=\"financial\",VALUE(LEFT(PRCP_y5,4)-1)&\"-\"&TEXT(VALUE(RIGHT(PRCP_y5,2)-1),\"0#\"),VALUE(LEFT(PRCP_y5,4)-1))","v":"2009-10"},{"$f":"IF(dms_RPT=\"financial\",VALUE(LEFT(CRCP_y1,4)-1)&\"-\"&TEXT(VALUE(RIGHT(CRCP_y1,2)-1),\"0#\"),VALUE(LEFT(CRCP_y1,4)-1))","v":"2010-11"}]
[]
[]
[null,null,"Current regulatory year","2015-16"]
[]
[]
[]
[]
[null,null,"Source","Reporting"]
[null,null,"Consolidated confidential or public version?","Public"]
[null,null,"Amended RIN submission - amendment reason","20190711 - 8.2.4 Updated (D19/103436)"]
[null,null,"EBSS - First application of scheme in forthcoming period?","No"]
[null,null,"Sector",{"$f":"INDEX(dms_Sector_List,MATCH(dms_TradingName,dms_TradingName_List))","v":"Electricity"},"dms_Sector","=INDEX(dms_Sector_List,MATCH(dms_TradingName,dms_TradingName_List))"]
[null,null,"Segment",{"$f":"INDEX(dms_Segment_List,MATCH(dms_TradingName,dms_TradingName_List))","v":"Distribution"},"dms_Segment","=INDEX(dms_Segment_List,MATCH(dms_TradingName,dms_TradingName_List))"]
[null,null,"Regulatory Year Ending",{"$f":"INDEX(dms_RYE_Formula_Result,MATCH(dms_Model,dms_Model_List))","v":"2016"},"dms_RYE","=INDEX(dms_RYE_Formula_Result,MATCH(dms_Model,dms_Model_List))"]
[null,null,"Reporting Period Type",{"$f":"IF(LEN(FRCP_y1)>4,\"Financial\",\"Calendar\")","v":"Financial"},"dms_RPT","=IF(LEN(FRCP_y1)>4,\"Financial\",\"Calendar\")"]
[null,null,"Model or RIN Type","ARR","dms_Model"]
[null,null,"Security Classification","Public","dms_Classification"]
[null,null,"Template - version no.",5,"dms_TemplateNumber"]
[null,null,"Dollar $ real  (the last month before the FRCP_y1)",{"$f":"CONCATENATE(IF(dms_RPT=\"Financial\",\"June \",\"December \"),VALUE((LEFT(FRCP_y1,2))&RIGHT(FRCP_y1,2))-1)","v":"June 2016"},"dms_DollarReal","=CONCATENATE(IF(dms_RPT=\"Financial\",\"June \",\"December \"),VALUE((LEFT(FRCP_y1,2))&RIGHT(FRCP_y1,2))-1)"]
[null,null,"Form of control",{"$f":"INDEX(dms_FormControl_List,MATCH(dms_TradingName,dms_TradingName_List))","v":"Revenue cap"},"dms_FormControl","=INDEX(dms_FormControl_List,MATCH(dms_TradingName,dms_TradingName_List))"]
[null,null,"RIN response - version no.",1,"dms_RINversion"]
[null,null,"Jurisdiction",{"$f":"INDEX(dms_JurisdictionList,MATCH(dms_TradingName,dms_TradingName_List))","v":"SA"},"dms_Jurisdiction","=INDEX(dms_JurisdictionList,MATCH(dms_TradingName,dms_TradingName_List))"]
[null,null,"Length of current reg control period",{"$f":"INDEX(dms_CRCPlength_List,MATCH(dms_TradingName,dms_TradingName_List))","v":5},"dms_CRCPlength","=INDEX(dms_CRCPlength_List,MATCH(dms_TradingName,dms_TradingName_List))"]
[null,null,"Length of forthcoming reg control period",{"$f":"INDEX(dms_FRCPlength_List,MATCH(dms_TradingName,dms_TradingName_List))","v":5},"dms_FRCPlength","=INDEX(dms_FRCPlength_List,MATCH(dms_TradingName,dms_TradingName_List))"]
[null,null,"FRCP length in years",{"$f":"INDEX(dms_FRCPlength_List,MATCH(dms_TradingName,dms_TradingName_List))","v":5},"dms_FRCPlength_Num","=INDEX(dms_FRCPlength_List,MATCH(dms_TradingName,dms_TradingName_List))"]
[null,null,"FRCP Final Year Reference",{"$f":"INDEX(dms_FinalYear_List,MATCH(dms_FRCPlength_Num,dms_FRCPlength_Num_List))","v":"FRCP_y5"},"dms_FRCP_FinalYear","=INDEX(dms_FinalYear_List,MATCH(dms_FRCPlength_Num,dms_FRCPlength_Num_List))"]
[null,null,"FRCP Final Year",{"$f":"INDIRECT(dms_FRCP_FinalYear)","v":"2020-21"},"dms_FRCP_FinalYear_Num","=INDIRECT(dms_FRCP_FinalYear)"]
[null,null,"CRCP length in years",5,"dms_CRCPlength_Num","=INDEX(dms_CRCPlength_List,MATCH(dms_TradingName,dms_TradingName_List))"]
[null,null,"CRCP Final Year Reference","CRCP_y5","dms_CRCP_FinalYear","=INDEX(dms_CFinalYear_List,MATCH(dms_CRCPlength_Num,dms_CRCPlength_Num_List))"]
[null,null,"CRCP Final Year","2014-15","dms_CRCP_FinalYear_Num","=INDIRECT(dms_CRCP_FinalYear)"]
[null,null,"Backcast templates only - unit of measure ","$0s","If the cover sheet is for Backcast data ensure to apply dms_Backcast_UOM named range to this field. Otherwise, do not apply this named range."]
[null,null,"Table 6.6.3 - Public lighting repair - no. business days",{"$f":"INDEX(dms_663_List,MATCH(dms_TradingName,dms_TradingName_List))","v":5}]
[null,null,"Distribution Determination Reference",{"$f":"INDEX(dms_DeterminationRef_List,MATCH(dms_TradingName,dms_TradingName_List))","v":"2015-20 Distribution Determination"},"=dms_DeterminationRef"]
[null,null,"CBD Feeder for this business",{"$f":"INDEX(dms_CBD_flag,MATCH(dms_TradingName,dms_TradingName_List))","v":"YES"},"dms_CBD_flag_NSP"]
[null,null,"Urban Feeder for this business",{"$f":"INDEX(dms_Urban_flag,MATCH(dms_TradingName,dms_TradingName_List))","v":"YES"},"dms_Urban_flag_NSP"]
[null,null,"Short rural Feeder for this business",{"$f":"INDEX(dms_ShortRural_flag,MATCH(dms_TradingName,dms_TradingName_List))","v":"YES"},"dms_ShortRural_flag_NSP"]
[null,null,"Long rural Feeder for this business",{"$f":"INDEX(dms_LongRural_flag,MATCH(dms_TradingName,dms_TradingName_List))","v":"YES"},"dms_LongRural_flag_NSP"]

{"sheet":"2.11 Labour","index":4,"n_rows":36,"n_cols":4,"rows_kept":36,"cut":false,"hidden":false,"merged":[]}
[null,{"$f":"(LOOKUP(dms_Model,dms_Model_List,dms_Worksheet_List))","v":"REGULATORY REPORTING STATEMENT"}]
[null,{"$f":"dms_TradingName","v":"SA Power Networks"}]
[null,{"$f":"CONCATENATE(\"Annual Reporting RIN Response \",CRY)","v":"Annual Reporting RIN Response 2015-16"}]
[null,"2.11 LABOUR "]
[]
[null,"Tables 2.11.1 and 2.11.2 deliberately omitted."]
[]
[null,"2.11.3 - LABOUR / NON-LABOUR EXPENDITURE SPLIT"]
[null,"2.11.3.1 - Opex"]
[null,null,{"$f":"CRY","v":"2015-16"}]
[null,null,"$0's, nominal"]
[null,null,"Opex "]
[null,"In-house labour expenditure",98896993.580361441]
[null,"Labour expenditure outsourced to related parties",0]
[null,"Labour expenditure outsourced to unrelated parties",5238141.6675213836]
[null,"Controllable non-labour expenditure",101997180.04757959]
[null,"Uncontrollable non-labour expenditure",8283574.3545340998]
[null,"Total",{"$f":"SUM(C13:C17)","v":214415889.64999652}]
[]
[null,"Reconciliation with Opex worksheets - SCS","Opex"]
[null,"Total including margins",{"$f":"dms_Total_Actual_Opex","v":214415889.64999652},{"$f":"IF(C18=dms_Total_Actual_Opex,\"OK\",\"Error\")","v":"OK"}]
[]
[]
[null,"2.11.3.2 - Capex"]
[null,null,{"$f":"CRY","v":"2015-16"}]
[null,null,"$0's, nominal"]
[null,null,"Capex"]
[null,"In-house labour expenditure",106588506.41963856]
[null,"Labour expenditure outsourced to related parties",0]
[null,"Labour expenditure outsourced to unrelated parties",7482358.3324786164]
[null,"Controllable non-labour expenditure",147090445.49788284]
[null,"Uncontrollable non-labour expenditure",0]
[null,"Total",{"$f":"SUM(C28:C32)","v":261161310.25}]
[]
[null,"Reconciliation with Capex & Opex worksheets - SCS","Capex"]
[null,"Total including margins",{"$f":"dms_Total_Actual_Capex","v":261161310.25},{"$f":"IF(C33=dms_Total_Actual_Capex,\"OK\",\"Error\")","v":"OK"}]

{"sheet":"3.6 Quality of services","index":5,"n_rows":71,"n_cols":4,"rows_kept":71,"cut":false,"hidden":false,"merged":[[6,2,7,2],[24,2,25,2],[24,1,25,1]]}
[null,{"$f":"(LOOKUP(dms_Model,dms_Model_List,dms_Worksheet_List))","v":"REGULATORY REPORTING STATEMENT"}]
[null,{"$f":"dms_TradingName","v":"SA Power Networks"}]
[null,{"$f":"CONCATENATE(\"Annual Reporting RIN Response \",CRY)","v":"Annual Reporting RIN Response 2015-16"}]
[null,"3.6 QUALITY OF SERVICES"]
[]
[null,"3.6.5 - QUALITY OF SUPPLY METRICS"]
[null,null,"Unit","Volume"]
[null,null,null,{"$f":"CRY","v":"2015-16"}]
[null,"Over voltage events - due to high voltage injection","number"]
[null,"Customers receiving over-voltage - due to high voltage injection","number"]
[null,"Over voltage events - due to lightning","number"]
[null,"Customers receiving over-voltage - due to lightning","number"]
[null,"Over voltage events - due to voltage regulation or other cause","number"]
[null,"Customers receiving over-voltage - due to voltage regulation or other cause","number"]
[null,"Voltage variations - steady state (zone sub)","number"]
[null,"Voltage variations - one minute (zone sub)","number"]
[null,"Voltage variations - 10 seconds (zone sub) Min<0.7","number"]
[null,"Voltage variations - 10 seconds (zone sub) Min<0.8","number"]
[null,"Voltage variations - 10 seconds (zone sub) Min<0.9","number"]
[null,"Voltage variations - steady state (feeder)","number"]
[null,"Voltage variations - % zone subs monitored","(per cent)"]
[null,"Voltage variations - % feeders monitored","(per cent)"]
[]
[null,"3.6.6 - COMPLAINTS - TECHNICAL QUALITY OF SUPPLY"]
[null,null,"Unit","Volume"]
[null,null,null,{"$f":"CRY","v":"2015-16"}]
[null,"3.6.6.1 - TECHNICAL QUALITY OF SUPPLY"]
[null,"Number of complaints - technical quality of supply","number",22]
[null,"3.6.6.2 - PERCENTAGE OF COMPLAINTS BY CATEGORY"]
[null,"Low voltage supply","(per cent)",9.0909090909090917]
[null,"Voltage dips","(per cent)",13.636363636363635]
[null,"Voltage swell","(per cent)",0]
[null,"Voltage spike (impulsive transient)","(per cent)",0]
[null,"Waveform distortion","(per cent)",0]
[null,"TV or radio interference","(per cent)",0]
[null,"Solar related","(per cent)",18.181818181818183]
[null,"Noise from appliances","(per cent)",0]
[null,"Other","(per cent)",59.090909090909093]
[null,"3.6.6.3 - PERCENTAGE OF COMPLAINTS BY LIKELY CAUSE"]
[null,"Network equipment faulty","(per cent)",31.818181818181817]
[null,"Network interference by NSP equipment","(per cent)",0]
[null,"Network interference by another customer","(per cent)",0]
[null,"Network limitation","(per cent)",18.181818181818183]
[null,"Customer internal problem","(per cent)",36.363636363636367]
[null,"No problem identified","(per cent)",0]
[null,"Environmental","(per cent)",0]
[null,"Other","(per cent)",13.636363636363635]
[]
[null,"3.6.7 - CUSTOMER SERVICE METRICS"]
[null,null,"Unit",{"$f":"CRY","v":"2015-16"}]
[null,"3.6.7.1 - TIMELY PROVISIONS OF SERVICES"]
[null,"Number of connections made","number",11620]
[null,"Number of connections not made on or before agreed date","number",192]
[null,"3.6.7.2 - TIMELY REPAIR OF FAULTY STREET LIGHTS"]
[null,"Street lights - average monthly number \"out\"","number",2636]
[null,"Street lights - not repaired by \"fix by\" date","number",1138]
[null,"Street lights - average number of days to repair","number",4.38]
[null,"Total number of street lights","number",218026]
[null,"3.6.7.3 - CALL CENTRE PERFORMANCE"]
[null,"Calls to call centre fault line","number",263752]
[null,"Calls to fault line answered within 30 seconds","number",229067]
[null,"Calls to fault line - average waiting time before call answered","number",19]
[null,"Call centre - number of overload events","number",1]
[null,"Percentage of calls abandoned","(per cent)",0.06]
[null,"3.6.7.4 - NUMBER OF CUSTOMER COMPLAINTS"]
[null,"Complaint - reliability of supply","number",192]
[null,"Complaint - technical quality of supply","number",{"$f":"IF(ISBLANK(D28),\"\",D28)","v":22}]
[null,"Complaint - administrative process or customer service","number",249]
[null,"Complaint - connection or augmentation","number",109]
[null,"Complaint - other","number",491]
[null,"Total number of complaints","number",1063]

{"sheet":"3.6.8 Network-feeders","index":6,"n_rows":53,"n_cols":23,"rows_kept":53,"cut":false,"hidden":false,"merged":[[5,6,5,8],[5,1,5,4],[11,8,12,8],[11,9,12,9],[11,20,12,20],[10,20,10,22],[11,21,11,22],[10,1,12,1],[10,2,12,2],[10,3,12,3],[10,4,12,4],[10,7,12,7],[11,5,12,5],[11,6,12,6],[10,5,10,6],[10,8,10,9],[10,10,10,14],[11,11,11,12],[11,13,11,14],[11,18,11,19],[11,15,12,15],[11,10,12,10],[10,15,10,19],[11,16,11,17]]}
[null,{"$f":"(LOOKUP(dms_Model,dms_Model_List,dms_Worksheet_List))","v":"REGULATORY REPORTING STATEMENT"},null,null,null,null,{"$f":"CONCATENATE(\"1-Jan-\",LEFT(CRY,4))","v":"1-Jan-2015"}]
[null,{"$f":"dms_TradingName","v":"SA Power Networks"}]
[null,{"$f":"CONCATENATE(\"Annual Reporting RIN Response \",CRY)","v":"Annual Reporting RIN Response 2015-16"}]
[null,"3.6 QUALITY OF SERVICES"]
[]
[null,"Did the MAIFI parameter of the STPIS apply during the period?",null,null,null,"No","** IMPORTANT\nPlease ensure this question is answered correctly. Your response will affect other tables throughout this workbook and will determine which cells are grey and which are input cells. "]
[]
[]
[]
[null,"3.6.8 - NETWORK FEEDER RELIABILITY"]
[null,"Feeder ID / name","Description of the service area for the feeder","Feeder classification\n\n(drop down)","Number of distribution customers","Length of high voltage distribution lines",null,"Maximum demand\n(MVA)","Energy not supplied\n(MWh)",null,"Unplanned Outages",null,null,null,null,"Planned Outages",null,null,null,null,"Momentary feeder outages"]
[null,null,null,null,null,"Overhead","Underground",null,"Unplanned","Planned","Total number of unplanned outages","Unplanned customer minutes off-supply (SAIDI)",null,"Unplanned interruptions\n(SAIFI)",null,"Total number of planned outages","Planned customer minutes off-supply (SAIDI)",null,"Planned interruptions\n(SAIFI)",null,"Total number of momentary feeder outages","Momentary interruptions due to feeder outages (MAIFI)"]
[null,null,null,null,null,null,null,null,null,null,null,"Including excluded events and MEDs","After removing excluded events and MED","Including excluded events and MEDs","After removing excluded events and MED",null,"Including MEDs","After removing  MED","Including MEDs","After removing  MED",null,"Including excluded events and MEDs","After removing excluded events and MED"]
[null,"INSUFFICIENT ROWS AVAILABLE AND UNABLE TO INSERT ROWS IN LOCKED VERSION - REFER 3.6.8 NETWORK FEEDERS UNLOCKED TAB"]
[]
[]
[]
[]
[]
[]
[]
[]
[]
[]
[]
[]
[]
[]
[]
[]
[]
[]
[]
[]
[]
[]
[]
[]
[]
[null,null,null,null,null,null,null,null,null,null,null,null,null,null,null,null,null,null,null,null,null,null," "]
[]
[]
[]
[]
[]
[]
[]
[]
[]
[]
[]
[]
[null,"To enter further feeder ID's - please insert new lines above this line. "]

{"sheet":"3.6.8 Network-feeders Unlocked","index":7,"n_rows":1495,"n_cols":23,"rows_kept":1495,"cut":false,"hidden":false,"merged":[[10,10,10,14],[10,15,10,19],[10,20,10,22],[11,5,12,5],[11,6,12,6],[11,8,12,8],[11,9,12,9],[11,10,12,10],[11,11,11,12],[11,13,11,14],[11,15,12,15],[11,16,11,17],[11,18,11,19],[11,20,12,20],[11,21,11,22],[5,1,5,4],[5,6,5,8],[10,1,12,1],[10,2,12,2],[10,3,12,3],[10,4,12,4],[10,5,10,6],[10,7,12,7],[10,8,10,9]]}
[null,{"$f":"(LOOKUP(dms_Model,dms_Model_List,dms_Worksheet_List))","v":"REGULATORY REPORTING STATEMENT"},null,null,null,null,{"$f":"CONCATENATE(\"1-Jan-\",LEFT(CRY,4))","v":"1-Jan-2015"}]
[null,{"$f":"dms_TradingName","v":"SA Power Networks"}]
[null,{"$f":"CONCATENATE(\"Annual Reporting RIN Response \",CRY)","v":"Annual Reporting RIN Response 2015-16"}]
[null,"3.6 QUALITY OF SERVICES"]
[]
[null,"Did the MAIFI parameter of the STPIS apply during the period?",null,null,null,"No","** IMPORTANT\nPlease ensure this question is answered correctly. Your response will affect other tables throughout this workbook and will determine which cells are grey and which are input cells. "]
[]
[]
[]
[null,"3.6.8 - NETWORK FEEDER RELIABILITY"]
[null,"Feeder ID / name","Description of the service area for the feeder","Feeder classification\n\n(drop down)","Number of distribution customers","Length of high voltage distribution lines",null,"Maximum demand\n(MVA)","Energy not supplied\n(MWh)",null,"Unplanned Outages",null,null,null,null,"Planned Outages",null,null,null,null,"Momentary feeder outages"]
[null,null,null,null,null,"Overhead","Underground",null,"Unplanned","Planned","Total number of unplanned outages","Unplanned customer minutes off-supply (SAIDI)",null,"Unplanned interruptions\n(SAIFI)",null,"Total number of planned outages","Planned customer minutes off-supply (SAIDI)",null,"Planned interruptions\n(SAIFI)",null,"Total number of momentary feeder outages","Momentary interruptions due to feeder outages (MAIFI)"]
[null,null,null,null,null,null,null,null,null,null,null,"Including excluded events and MEDs","After removing excluded events and MED","Including excluded events and MEDs","After removing excluded events and MED",null,"Including MEDs","After removing  MED","Including MEDs","After removing  MED",null,"Including excluded events and MEDs","After removing excluded events and MED"]
[null,"AP125A","MAJOR METROPOLITAN AREAS","Urban",1685,0.91665796700000002,16.103642622999999,4.3505257276930935,1.9637781157616888E-2,0.86190336341606011,1,0.50741800000000004,0.50741800000000004,5.9347000000000002E-4,5.9347000000000002E-4,10,22.270623000000001,22.270623000000001,0.36379822000000001,0.36379822000000001]
[null,"AP125B","MAJOR METROPOLITAN AREAS","Urban",832.5,4.3322739480000001,7.4732099999999999,2.1983188849664188,3.1379107155013095,0.24070637021266078,2,164.10810799999999,164.10810799999999,0.99579580000000001,0.99579580000000001,1,12.588589000000001,12.588589000000001,4.8048050000000002E-2,4.8048050000000002E-2]
[null,"AP125C","MAJOR METROPOLITAN AREAS","Urban",951.5,5.9851433920000003,1.413906163,2.0261786690460246,0.40366550157323605,1.6003298712726484,3,18.470835999999998,17.334734999999998,0.45507093999999998,0.45401996999999999,3,73.227535000000003,73.227535000000003,0.23962164999999999,0.23962164999999999]
[null,"AP125D","MAJOR METROPOLITAN AREAS","Urban",2243,10.309741421999998,2.91696,5.376390322562572,1.8972696366702657,3.3495853250318324,15,36.827604999999998,36.827604999999998,0.16882150000000001,0.16882150000000001,7,65.018279000000007,65.018279000000007,0.25234062000000002,0.25234062000000002]
[null,"AP132A","MAJOR METROPOLITAN AREAS","Urban",456.5,3.7756472699999999,5.8506722609999997,2.9030955547186177,0,0.36248358155498217,null,null,null,null,null,3,34.571742,34.571742,1.0164293499999999,1.0164293499999999]
[null,"AP132B","MAJOR METROPOLITAN AREAS","Urban",54,10.868481005,6.6975119699999999,5.5526777609366089,0.65199730328702232,0.11006344714304107,8,525.68518600000004,525.68518600000004,4.0740742599999997,4.0740742599999997,3,88.740741,88.740741,0.31481481,0.31481481]
[null,"AP132C","MAJOR METROPOLITAN AREAS","Urban",320.5,8.0280259760000003,6.7169399999999992,8.9442237677453029,1.9270290516070841E-2,0.42801175657566165,3,2.617785,2.617785,1.8720750000000001E-2,1.8720750000000001E-2,5,58.143526000000001,58.143526000000001,0.45241809999999999,0.45241809999999999]
[null,"AP132D","MAJOR METROPOLITAN AREAS","Urban",1759,8.7679744129999992,1.1442099999999999,3.5729263673773071,0.70499248378127,6.0643765031230616,8,17.449876,17.449876,0.13321963000000001,0.13321963000000001,17,150.10460499999999,150.10460499999999,0.62876633999999998,0.62876633999999998]
[null,"AP132E","MAJOR METROPOLITAN AREAS","Urban",69,3.867907164,1.8175377670000001,1.1390762853944418,3.5141292597840748E-3,1.6720824190345141E-2,1,2.2173910000000001,2.2173910000000001,1.449275E-2,1.449275E-2,1,10.550725,10.550725,5.7971010000000003E-2,5.7971010000000003E-2]
[null,"AP139A","MAJOR METROPOLITAN AREAS","Urban",402.5,3.4698963680000001,1.3915299999999999,4.049259392017631,6.1256096312706718E-2,1.2387190799913381,4,6.6260870000000001,6.6260870000000001,7.9503110000000002E-2,7.9503110000000002E-2,3,133.992547,133.992547,0.62857143000000004,0.62857143000000004]
[null,"AP139B","MAJOR METROPOLITAN AREAS","Urban",1990,10.347661136999999,2.0872299999999999,5.5824378579122573,1.0815555077048571,1.7049957996179819,11,23.662980000000001,23.662980000000001,0.12345056,0.12345056,6,37.303015000000002,37.303015000000002,0.17587939999999999,0.17587939999999999]
[null,"AP139C","MAJOR METROPOLITAN AREAS","Urban",929.5,9.4312206820000011,3.2409947840000002,6.5797440526563795,4.5201348910163787E-2,2.5482490129755799,2,2.117267,2.117267,9.6826299999999994E-3,9.6826299999999994E-3,12,119.36202299999999,119.36202299999999,0.41850457000000002,0.41850457000000002]
[null,"AP139D","MAJOR METROPOLITAN AREAS","Urban",1845,9.9035434870000003,5.3459899999999996,5.9843515875545776,5.4469462889955089,0,7,128.53766899999999,128.53766899999999,1.0569105700000001,1.0569105700000001]
[null,"AP146A","MAJOR METROPOLITAN AREAS","Urban",566,3.0582107449999998,5.6035300000000001,4.9794624743749187,1.0176810633785229,0,4,78.283270000000002,4.2974050000000004,0.99705533999999996,2.3557100000000001E-2]
[null,"AP146B","MAJOR METROPOLITAN AREAS","Urban",2406.5,9.1495551089999996,1.76466024,7.2680748999907117,6.904881253467237,9.6017725141500208,17,124.923472,51.461598000000002,1.99002697,1.0284645400000001,12,173.71576999999999,173.71576999999999,0.53646373999999997,0.53646373999999997]
[null,"AP146C","MAJOR METROPOLITAN AREAS","Urban",1562,5.9959989699999996,1.3117000000000001,3.0442750160435565,15.810595754509313,2.3162246091694447,7,440.69782199999997,366.26120200000003,3.0117370700000001,2.0450277300000002,5,64.561459999999997,64.561459999999997,0.23943661999999999,0.23943661999999999]
[null,"AP146D","MAJOR METROPOLITAN AREAS","Urban",356,1.99160516,0.23913999999999999,0.81891708592018031,0.68285879302890462,0,2,83.513099999999994,8.2434370000000001,1.03558047,5.8052380000000001E-2]
[null,"AP146E","MAJOR METROPOLITAN AREAS","Urban",577,4.1542281409999999,0.62554999999999994,2.0656784341227943,1.0041452057711435,3.1687799293911771,4,75.769497000000001,0.77122999999999997,0.97920277,5.1993100000000004E-3,5,239.10571899999999,239.10571899999999,1.1005199299999999,1.1005199299999999]
[null,"AP149A","MAJOR METROPOLITAN AREAS","Urban",783,3.7585711809999998,0.57286000000000004,1.808907098053131,1.0861185350929554,0,3,60.393355999999997,60.393355999999997,0.20987652000000001,0.20987652000000001]
[null,"AP149B","MAJOR METROPOLITAN AREAS","Urban",1358,7.7478111030000001,1.4515199999999999,3.6009336289356959,4.8968127986010766E-2,0.44849935984185374,7,1.5699559999999999,1.5699559999999999,5.8910200000000003E-3,5.8910200000000003E-3,1,14.379234,14.379234,5.0810010000000003E-2,5.0810010000000003E-2]
[null,"AP149C","MAJOR METROPOLITAN AREAS","Urban",1367,7.2806005750000002,0.54962999999999995,4.6557213938306061,0.50928837527353754,0.26153849595530237,7,16.220676000000001,16.220676000000001,0.11216774,0.11216774,1,8.3299199999999995,8.3299199999999995,4.3160200000000003E-2,4.3160200000000003E-2]
[null,"AP149D","MAJOR METROPOLITAN AREAS","Urban",1896,10.115610196,1.62449,5.8300830182768415,0.93937496827817513,1.1512333391382823,11,21.571202,21.571202,7.6652590000000007E-2,7.6652590000000007E-2,5,26.436181000000001,26.436181000000001,0.11181435000000001,0.11181435000000001]
[null,"AP149E","MAJOR METROPOLITAN AREAS","Urban",1975,8.7136084260000004,3.5055509699999998,5.8206138965118619,1.2407170563498069,0.49721483801180166,14,27.351386999999999,27.351386999999999,0.12067506,0.12067506,4,10.961012999999999,10.961012999999999,7.8987340000000003E-2,7.8987340000000003E-2]
[null,"AP149F","MAJOR METROPOLITAN AREAS","Urban",1404,4.3377473350000004,1.9341600000000001,4.298466862210641,0.63143288161457456,1.6304181675492311,7,19.580950999999999,19.580950999999999,0.12203221,0.12203221,6,50.559829000000001,50.559829000000001,0.1994302,0.1994302]
[null,"AP149G","MAJOR METROPOLITAN AREAS","Urban",9,null,3.0606600000000004,3.7343015411184992,4.5476966891323323E-3,0,1,22,22,0.66666667000000002,0.66666667000000002]
[null,"AP149H","MAJOR METROPOLITAN AREAS","Urban",963,6.2517700180000002,2.3958499999999998,3.3830295129878776,5.5414545692950255E-2,5.432683058470503,3,2.505366,2.505366,3.392179E-2,3.392179E-2,28,245.618899,245.618899,1.1879543100000001,1.1879543100000001]
[null,"AP214A","MAJOR METROPOLITAN AREAS","Urban",1261,5.6088991880000005,4.0665280470000003,5.9247932884855148,1.7020179450644868,3.7332455548059058,12,58.765542000000003,58.166811000000003,0.86280758999999996,0.86201457000000004,15,128.89769999999999,128.89769999999999,0.55828707,0.55828707,null,null," "]
[null,"AP214B","MAJOR METROPOLITAN AREAS","Urban",913.5,4.5880167039999993,0.35783999999999999,2.7095787141413696,1.0919753772968928,1.2117774223329936,5,52.044877999999997,52.044877999999997,1.03849657,1.03849657,3,57.754789000000002,57.754789000000002,0.22003284000000001,0.22003284000000001]
[null,"AP214C","MAJOR METROPOLITAN AREAS","Urban",1231,5.6245902429999992,3.4654000000000003,4.4362740206132436,4.4425248320568302,1.4000704397951493,12,157.125079,153.060091,1.22312468,1.1938801699999999,2,49.518278000000002,49.518278000000002,0.13566206,0.13566206]
[null,"AP214D","MAJOR METROPOLITAN AREAS","Urban",1355.5,5.2873218599999996,0.18287,3.870634031463537,0.17974120358540713,0.27201197923936471,8,5.773269,5.773269,5.6559680000000001E-2,5.6559680000000001E-2,3,8.7369970000000006,8.7369970000000006,0.12762818000000001,0.12762818000000001]
[null,"AP226A","MAJOR METROPOLITAN AREAS","Urban",575.5,1.5018934289999999,0.92726999999999993,1.6045226778888728,2.1118998124698423,1.2341024788069159,5,159.77237199999999,95.845352000000005,2.9470026100000002,1.9635099899999999,2,93.364030999999997,93.364030999999997,0.25369244000000002,0.25369244000000002]
[null,"AP226B","MAJOR METROPOLITAN AREAS","Urban",272.5,1.7477578309999999,1.5200100000000001,0.64808283630869268,2.4853851451061097,0,6,397.10091699999998,334.85504600000002,3.2,2.2568807299999998]
[null,"AP226C","MAJOR METROPOLITAN AREAS","Urban",1780,2.5982331780000001,10.04461,3.9083871965059549,9.1990946635204338,4.9626165916029157,10,225.00842700000001,161.06741600000001,2.98370786,1.9999999900000001,12,121.38483100000001,121.38483100000001,0.42921347999999998,0.42921347999999998]
[null,"AP226D","MAJOR METROPOLITAN AREAS","Urban",1542,4.9202041010000004,2.32016,3.0650620506055137,8.3491806307901886,1.2945776575063372,15,235.739947,172.67898700000001,2.3372244499999999,1.3670558399999999,4,36.552529,36.552529,0.15693904,0.15693904]
[null,"AP226E","MAJOR METROPOLITAN AREAS","Urban",978,3.9751702409999998,0.29855999999999999,2.2524343875777775,5.6944971360253911,0.57085077531159079,9,253.50715600000001,183.319017,2.9543285300000002,1.97477843,1,25.413087999999998,25.413087999999998,8.7934559999999995E-2,8.7934559999999995E-2]
[null,"AP227A","MAJOR METROPOLITAN AREAS","Urban",1788,7.4187560780000004,1.1493900000000001,4.0934803811856728,2.3191644407984131,0.55564585001762312,13,56.472593000000003,56.472593000000003,2.0441834299999999,2.0441834299999999,1,13.530201,13.530201,3.5794180000000002E-2,3.5794180000000002E-2]
[null,"AP227B","MAJOR METROPOLITAN AREAS","Urban",1130,6.3823067819999997,4.1157967879999999,3.1473344639650356,1.3233797912476779,0.14603159368436044,8,50.989382999999997,50.989382999999997,0.31356932999999998,0.31356932999999998,1,5.6265489999999998,5.6265489999999998,0.16548673,0.16548673]
[null,"AP227C","MAJOR METROPOLITAN AREAS","Urban",769.5,1.1545333820000001,8.5052000000000003,2.622831374315413,0.21349654039291774,0.83317018888017857,5,12.079694,12.079694,8.4037169999999994E-2,8.4037169999999994E-2,2,47.141001000000003,47.141001000000003,0.14554906000000001,0.14554906000000001]
[null,"AP227D","MAJOR METROPOLITAN AREAS","Urban",1336.5,5.7095231130000004,3.0380687469999996,3.7746583249348538,1.2686924069125856,1.7618649763972327,12,41.329588000000001,41.329588000000001,1.05075443,1.05075443,7,57.395435999999997,57.395435999999997,0.16984661000000001,0.16984661000000001]
[null,"AP344A","MAJOR METROPOLITAN AREAS","Urban",217.5,1.0028789140000001,1.7523199999999999,3.1574612107806326,2.7561798115953531E-3,0,1,0.55172399999999999,0.55172399999999999,4.5976999999999997E-3,4.5976999999999997E-3]
[null,"AP344B","MAJOR METROPOLITAN AREAS","Urban",444.5,1.2237374910000001,2.7926780469999999,3.3324539758170282,1.4929307312808161E-2,0.33455429279748256,1,1.4623170000000001,1.4623170000000001,1.1248589999999999E-2,1.1248589999999999E-2,2,32.769404000000002,32.769404000000002,7.6490440000000007E-2,7.6490440000000007E-2]
[null,"AP344C","MAJOR METROPOLITAN AREAS","Urban",76,0.38788822900000003,1.54922,1.0300440334681424,0,4.1158951853157266E-2,null,null,null,null,null,1,23.578946999999999,23.578946999999999,9.2105259999999994E-2,9.2105259999999994E-2]
[null,"AP344D","MAJOR METROPOLITAN AREAS","Urban",1255.5,6.6617161990000007,2.3478101969999998,3.3735901824967884,0.1255669551380402,0.45387391047446474,3,4.3544400000000003,4.3544400000000003,5.5754669999999999E-2,5.5754669999999999E-2,2,15.739546000000001,15.739546000000001,6.133015E-2,6.133015E-2]
[null,"AP344E","MAJOR METROPOLITAN AREAS","Urban",772.5,2.6352823110000001,3.0370700000000004,1.5634391255536622,0.84829034391351621,5.9720674475997138,9,47.810108999999997,47.810108999999997,0.22783162000000001,0.22783162000000001,17,336.58899700000001,336.58899700000001,1.52491909,1.52491909]
[null,"AP344F","MAJOR METROPOLITAN AREAS","Urban",506.5,2.85698096,0.3952,1.0287579511025065,2.0788791074158879,7.4932260537842854,6,178.69955999999999,171.505754,1.05495224,1.0437643599999999,31,644.11451099999999,644.11451099999999,2.52122409,2.52122409]
[null,"AP351B","MAJOR METROPOLITAN AREAS","Urban",331.5,2.2566160270000002,0.74533997899999993,2.1341727297182675,4.6395693495188441E-3,0,1,0.60935099999999998,0.60935099999999998,3.01659E-3,3.01659E-3]
[null,"AP351C","MAJOR METROPOLITAN AREAS","Urban",605,3.0572397680000001,0.91457021199999999,2.206151218718245,5.4648893870596356E-2,2.1849845138073127,4,3.9327800000000002,3.9327800000000002,2.258951E-2,2.258951E-2,6,157.241322,157.241322,0.70909091000000002,0.70909091000000002]
[null,"AP351D","MAJOR METROPOLITAN AREAS","Urban",628,4.3596341799999996,0.40466293200000003,1.8153506734674487,0.93251499589649833,3.8997877199215547,7,64.650200999999996,64.650200999999996,0.90445847000000001,0.90445847000000001,12,270.36783400000002,270.36783400000002,1.2802547799999999,1.2802547799999999]
[null,"AP351E","MAJOR METROPOLITAN AREAS","Urban",466.5,3.7823108009999999,0.90398000000000001,1.871914603100387,1.004213938923922,12.265183906920093,4,93.723455999999999,53.208987,1.1797069899999999,1.0189352899999999,34,1144.711683,1144.711683,4.4480171500000001,4.4480171500000001]
[null,"AP351G","MAJOR METROPOLITAN AREAS","Urban",1,null,null,1.6983146147593737,3.9275562315233782E-3,0,3,171,123,3,2]
[null,"AP351K","MAJOR METROPOLITAN AREAS","Urban",4,null,0.71684999999999999,0.73750550181202024,0,1.2402809152179087E-3,null,null,null,null,null,1,13.5,13.5,0.25,0.25]
[null,"AP355A","MAJOR METROPOLITAN AREAS","Urban",1722,8.0442494530000008,0.68024264299999992,5.5080185629142537,16.272003276191935,7.3477916323924379,11,411.41637600000001,321.07258999999999,3.0458768900000002,2.0638792100000001,17,185.779326,185.779326,0.57491289000000001,0.57491289000000001]
[null,"AP355B","MAJOR METROPOLITAN AREAS","Urban",448.5,2.3749360369999999,1.33731,2.3076459319401663,0.88974077951317321,0.1974573153357104,2,86.372352000000006,0.21850600000000001,0.93868450000000003,2.2296500000000001E-3,3,19.168339,19.168339,6.4659980000000006E-2,6.4659980000000006E-2]
[null,"AP355C","MAJOR METROPOLITAN AREAS","Urban",548,3.5963131150000001,2.5547622630000002,3.3048568638898717,2.6793737428963698,0,5,212.87587099999999,126.8339,2.2037709400000001,1.2785884599999999]
[null,"AP355D","MAJOR METROPOLITAN AREAS","Urban",178.5,1.068968991,3.5406500000000003,4.2106155131999401,0.81419081291354001,0.14125421534426183,3,198.59196600000001,118.188605,1.9981325299999999,1.12418295,3,34.453781999999997,34.453781999999997,0.12885153999999999,0.12885153999999999]
[null,"AP355E","MAJOR METROPOLITAN AREAS","Urban",624,4.7364944979999999,1.167484966,2.6803139836966863,7.2770573256100644,9.3987339346958283,14,507.744123,352.78258399999999,4.7569444299999999,3.7761752,22,655.78044899999998,655.78044899999998,1.64262821,1.64262821]
[null,"AP355F","MAJOR METROPOLITAN AREAS","Urban",1208,4.1879606979999995,2.6925241299999998,3.1436722157375123,2.5425529080316163,1.9596668142093927,7,91.638244999999998,1.4660599999999999,1.03228477,5.2152320000000002E-2,5,70.629966999999994,70.629966999999994,0.23675497000000001,0.23675497000000001]
[null,"AP355G1","MAJOR METROPOLITAN AREAS","Urban",1,null,null,3.8259824544647354,4.2261423777795407E-3,0,2,184,91,2,1]
[null,"AP355H","MAJOR METROPOLITAN AREAS","Urban",2557.5,8.5525915440000002,3.65585,6.9072384873006962,22.220737779996593,10.046160572439579,13,378.28274399999998,288.777759,3.6431413500000001,2.6765724299999998,20,171.024438,171.024438,0.54858260000000003,0.54858260000000003]
[null,"AP365A","MAJOR METROPOLITAN AREAS","Urban",1630.5,5.7778413799999999,2.8942192690000001,3.4485131578696344,4.5412732069756956,12.054588801149112,6,121.26361900000001,121.26361900000001,0.24307471,0.24307471,18,321.88837799999999,321.88837799999999,0.99724011000000001,0.99724011000000001]
[null,"AP365B","MAJOR METROPOLITAN AREAS","Urban",1040.5,5.4466552400000001,0.62085541399999999,2.7693025972676364,3.9721603447718619,1.1326061572449171,13,166.21047300000001,159.26765700000001,2.2123978599999998,1.2205670099999999,4,47.392600000000002,47.392600000000002,0.24026910000000001,0.24026910000000001]
[null,"AP365C","MAJOR METROPOLITAN AREAS","Urban",556.5,2.9266508309999999,0.15484999999999999,1.141805512492944,2.2054491489084085,2.7914589131837735,4,172.54627099999999,165.65319,2.9577717899999998,1.9730458200000001,6,218.393531,202.10961399999999,0.81940701000000005,0.73674753000000004]
[null,"AP365D1","MAJOR METROPOLITAN AREAS","Urban",14,3.9441236659999999,0.86101000000000005,0.73452810647380928,0.28230171720265407,4.1687219650379713E-2,3,877.92857100000003,96.214286000000001,1.9285714300000001,1.14285714,2,129.64285699999999,129.64285699999999,0.42857142999999998,0.42857142999999998]
[null,"AP365D2","MAJOR METROPOLITAN AREAS","Urban",11,1.714213041,0.13179999999999997,0.31897607020862734,4.738332459434344E-2,5.7650094392536133E-3,2,187.545455,140.545455,2,1,1,22.818182,22.818182,9.0909089999999998E-2,9.0909089999999998E-2]
[null,"AP365E","MAJOR METROPOLITAN AREAS","Urban",301,null,5.1703700000000001,1.29557400406152,0,1.9408099506650608E-2,null,null,null,null,null,1,2.8073090000000001,2.8073090000000001,4.3189369999999998E-2,4.3189369999999998E-2]
[null,"AP365F","MAJOR METROPOLITAN AREAS","Urban",189,null,4.8502700000000001,1.0478907385791707,6.5688952176355909E-3,1.7915168775369794E-3,1,1.513228,1.513228,0.13756614,0.13756614,1,0.41269800000000001,0.41269800000000001,5.2910099999999996E-3,5.2910099999999996E-3]
[null,"AP372A","MAJOR METROPOLITAN AREAS","Urban",326,5.2497172899999995,0.39870828699999999,1.4670470340108388,1.371199456268688E-2,0,1,1.831288,1.831288,3.06748E-3,3.06748E-3]
[null,"AP372B","MAJOR METROPOLITAN AREAS","Urban",1165.5,6.5304821469999998,1.3880699999999999,3.981984806600849,0.88882172101932233,9.2636581557625615,18,33.202905000000001,33.202905000000001,0.29572420999999999,0.29572420999999999,25,346.05405400000001,346.05405400000001,1.3075933099999999,1.3075933099999999]
[null,"AP372C","MAJOR METROPOLITAN AREAS","Urban",111,2.8627266439999999,0.78129999999999999,1.7909405350262191,0.22545550858849986,0,2,88.432432000000006,88.432432000000006,1.9279279300000001,1.9279279300000001]
[null,"AP372D","MAJOR METROPOLITAN AREAS","Urban",892.5,6.9346120849999995,0.41152,2.3053596248741757,0.20285483169879248,15.397834912614275,9,9.8957979999999992,9.8957979999999992,1.34565826,1.34565826,47,751.14733899999999,751.14733899999999,2.8190476200000001,2.8190476200000001]
[null,"AP372F","MAJOR METROPOLITAN AREAS","Urban",1171.5,5.2685342819999992,1.4325349509999998,4.0200899243673636,0.91375762580379616,17.302148448940795,7,33.959589000000001,33.959589000000001,1.38369608,1.38369608,32,643.030303,643.030303,2.2304737499999998,2.2304737499999998]
[null,"AP373A","MAJOR METROPOLITAN AREAS","Urban",240,3.920184302,1.7695000000000001,5.4931385144264295,1.6133757890475331,0,3,292.683333,292.683333,0.95416666999999999,0.95416666999999999]
[null,"AP373B","MAJOR METROPOLITAN AREAS","Urban",125,4.6915857220000001,4.7928800000000003,7.4467040710565815,2.802116141788609E-3,5.9946910902198926E-2,1,0.97599999999999998,0.97599999999999998,1.6E-2,1.6E-2,1,20.88,20.88,7.1999999999999995E-2,7.1999999999999995E-2]
[null,"AP373C","MAJOR METROPOLITAN AREAS","Urban",262.5,4.8885543650000001,2.0155800000000004,6.6683956091401768,1.1887862890712688,0.10659525421345027,8,197.17333300000001,197.17333300000001,1.6152381,1.6152381,6,17.68,17.68,0.80761905,0.80761905]
[null,"AP373D","MAJOR METROPOLITAN AREAS","Urban",199.5,4.4617862839999995,6.6356399999999995,4.6545401351798441,9.5892089278421661E-2,0,3,20.927318,20.927318,0.12030075,0.12030075]
[null,"AP373E","MAJOR METROPOLITAN AREAS","Urban",220.5,9.7650221010000013,4.4540299999999995,5.0799456699252206,1.3689868346211833,9.0150048004264668E-2,16,270.31140900000003,270.31140900000003,3.5631141,3.5631141,8,17.800453999999998,17.800453999999998,8.6167800000000003E-2,8.6167800000000003E-2]
[null,"AP373F","MAJOR METROPOLITAN AREAS","Urban",139.5,0.42468157500000003,9.0533199999999994,6.0958662146982849,0,8.3374439300759426E-2,null,null,null,null,null,1,26.021505000000001,26.021505000000001,0.15053763000000001,0.15053763000000001]
[null,"AP373G","MAJOR METROPOLITAN AREAS","Urban",132.5,0.93570560400000002,2.5588699999999998,6.4160063616136629,3.2773504458029374,0,4,1076.9132079999999,107.388679,1.8792452799999999,0.95849057000000004]
[null,"AP373H","MAJOR METROPOLITAN AREAS","Urban",121,1.4922741820000001,1.51814,3.3198893328487618,4.7268436500376529E-2,1.8673118223558514E-2,1,17.008247000000001,17.008247000000001,0.17355355,0.17355355,1,6.7190079999999996,6.7190079999999996,2.4793389999999998E-2,2.4793389999999998E-2]
[null,"AP373J","MAJOR METROPOLITAN AREAS","Urban",1,0.82305973900000007,1.0155800000000001,3.4683849767848725,0,4.9726077434199496E-2,null,null,null,null,null,2,2165,2165,2,2]
[null,"AP373K","MAJOR METROPOLITAN AREAS","Urban",155.5,null,8.685857584999999,7.1161307428967318,7.7632398026602437E-3,3.3648361866559937E-2,1,2.1736330000000001,2.1736330000000001,2.5723469999999998E-2,2.5723469999999998E-2,2,9.4212220000000002,9.4212220000000002,3.8585210000000002E-2,3.8585210000000002E-2]
[null,"AP424A","MAJOR METROPOLITAN AREAS","Urban",1856.5,3.6449679769999999,9.8636707159999997,7.811549142135636,6.6025434418769047,9.8928251022544895,10,154.84244200000001,154.84244200000001,1.14785885,1.14785885,27,232.00592499999999,232.00592499999999,0.83652033000000003,0.83652033000000003]
[null,"AP424B","MAJOR METROPOLITAN AREAS","Urban",2677,9.6413532770000003,1.30623,6.773260893233628,7.3614268792448803,0.46979084888642791,13,119.725685,116.68173299999999,1.3886191000000001,1.38438551,2,7.6406429999999999,7.6406429999999999,4.519985E-2,4.519985E-2]
[null,"AP424C","MAJOR METROPOLITAN AREAS","Urban",2104.5,8.3990935990000004,3.1530446619999997,6.8030400427681599,20.37707261949155,2.9917872491565625,15,421.566956,334.298721,2.8532509400000001,1.86156645,7,61.894987,61.894987,0.2328344,0.2328344]
[null,"AP424D","MAJOR METROPOLITAN AREAS","Urban",1083,5.3769004780000005,0.23874999999999999,3.0668332457613343,5.6432781642414845E-2,1.2016943978555739,1,2.2686980000000001,2.2686980000000001,2.4930750000000002E-2,2.4930750000000002E-2,2,48.310248999999999,48.310248999999999,0.14404432,0.14404432]
[null,"AP424E","MAJOR METROPOLITAN AREAS","Urban",2831,7.499332656,10.006687577999999,8.1163900842677581,39.458840394922824,33.637176370157874,21,606.84551599999998,606.84551599999998,4.2542093200000002,4.2542093200000002,50,517.31296399999997,517.31296399999997,2.2921229200000002,2.2921229200000002]
[null,"AP424F","MAJOR METROPOLITAN AREAS","Urban",2437,4.5148220970000006,15.445756627000002,8.5164938208161693,5.3489107533136027,3.2872497249595845,8,95.561623999999995,95.561623999999995,0.55861033999999998,0.55861033999999998,13,58.728765000000003,58.728765000000003,0.28723841,0.28723841]
[null,"AP425A","MAJOR METROPOLITAN AREAS","Urban",1325.5,4.9719554989999999,2.3171999999999997,4.2427762325948786,0.27175929012477129,9.5237726254818718,5,8.9264419999999998,8.9264419999999998,6.3875249999999995E-2,6.3875249999999995E-2,39,312.82610299999999,312.82610299999999,1.57827235,1.57827235]
[null,"AP425B","MAJOR METROPOLITAN AREAS","Urban",1097.5,4.0018947590000007,0.52363256199999997,4.2278771315481718,0.5439931291835105,0.92929195980956658,6,21.580553999999999,21.580553999999999,0.17524674000000001,0.17524674000000001,4,36.865603999999998,36.865603999999998,0.21230067999999999,0.21230067999999999]
[null,"AP425C","MAJOR METROPOLITAN AREAS","Urban",1542.5,9.9710260569999996,1.4617865069999998,6.1181958137094634,8.3659933592910516,1.3943283985209924,16,236.13808800000001,234.27098899999999,2.0557536500000002,2.0401944900000002,4,39.35624,39.35624,0.12447326,0.12447326]
[null,"AP425D","MAJOR METROPOLITAN AREAS","Urban",1562,6.3260916930000004,1.3438599999999998,5.6866363024447946,5.9217824042212959,4.8921502610864618,7,165.06124399999999,165.06124399999999,1.7353819699999999,1.7353819699999999,11,136.361716,136.361716,0.62932138000000004,0.62932138000000004]
[null,"AP510A","MAJOR METROPOLITAN AREAS","Urban",17,null,3.4743573110000003,2.7131987003291886,2.8250843068852362E-2,5.489391458094078E-3,1,72.352941000000001,72.352941000000001,1,1,1,14.058824,14.058824,5.8823529999999999E-2,5.8823529999999999E-2]
[null,"AP529A","MAJOR METROPOLITAN AREAS","Urban",1311.5,4.7824143289999999,0.660650713,2.3119206333332465,1.1504064059546339,1.4298831180905724,8,38.190618999999998,38.190618999999998,0.10141058,0.10141058,3,47.468547000000001,47.468547000000001,0.16545940000000001,0.16545940000000001]
[null,"AP529B","MAJOR METROPOLITAN AREAS","Urban",397,2.715771116,4.219867829,1.7280892609618055,1.8960449968917332,0,2,207.937028,0.420655,1.07304786,2.5188900000000002E-3]
[null,"AP529C","MAJOR METROPOLITAN AREAS","Urban",718.5,3.1882964170000001,0.33838999999999997,2.2217500682912106,1.095742252264829,6.5935630269493695,6,66.398050999999995,66.398050999999995,0.21016006000000001,0.21016006000000001,15,399.54627699999998,399.54627699999998,1.4725121800000001,1.4725121800000001]
[null,"AP529D","MAJOR METROPOLITAN AREAS","Urban",1459.5,9.3055288829999991,2.3039589039999999,3.4356959818936241,4.1678335044350758,5.9307477185908803,12,124.331153,124.331153,1.0512731900000001,1.0512731900000001,11,176.920863,176.920863,1.1969852700000001,1.1969852700000001]
[null,"AP529E","MAJOR METROPOLITAN AREAS","Urban",1656,6.1527928760000004,1.6666099999999999,6.0474436166812433,0.22467451159723592,4.2404285764696432,6,5.9070029999999996,5.4963749999999996,4.8913030000000003E-2,4.8309169999999999E-2,11,111.486715,111.486715,0.37198068000000001,0.37198068000000001]
[null,"AP547B","MAJOR METROPOLITAN AREAS","Urban",3,null,0.2036,null,6.9639476572975922E-2,0,2,1010.666667,1010.666667,1.3333333300000001,1.3333333300000001]
[null,"BM11","BAROSSA/MID NORTH & YORKE PENINSULA/RIVE","Rural Short",441.5,43.508360000000003,0.28392000000000001,1.5870781549753621,1.613127539812706E-2,0,2,1.7780290000000001,1.7780290000000001,0.14722536999999999,0.14722536999999999]
[null,"BM12","BAROSSA/MID NORTH & YORKE PENINSULA/RIVE","Rural Short",398,51.465830000000004,4.6218000000000004,3.1570090069557923,4.2724248000313336,0.17676589933081396,11,522.38693499999999,418.89698499999997,1.66080402,1.35427136,6,21.613064999999999,21.613064999999999,0.12311558,0.12311558]
[null,"BM13","BAROSSA/MID NORTH & YORKE PENINSULA/RIVE","Rural Short",677,32.164649999999995,0.61426000000000003,5.5481051468046267,0.50124098279367935,0.20130187745229641,4,36.029550999999998,36.029550999999998,0.11767605,0.11767605,1,14.469719,14.469719,5.022157E-2,5.022157E-2]
[null,"BM14","BAROSSA/MID NORTH & YORKE PENINSULA/RIVE","Urban",12,2.6029300000000002,0.90442,2.9702939298998681,0,1.1621891538893737E-2,null,null,null,null,null,1,42.166666999999997,42.166666999999997,1,1]
[null,"BM15","BAROSSA/MID NORTH & YORKE PENINSULA/RIVE","Rural Short",484,61.537730000000003,0.89176,2.8254944823871093,4.6626574305145545E-2,1.1713155384627291E-2,5,4.6880160000000002,4.6880160000000002,4.4077129999999999E-2,4.4077129999999999E-2,1,1.177686,1.177686,6.19835E-3,6.19835E-3]
[null,"BM21","BAROSSA/MID NORTH & YORKE PENINSULA/RIVE","Rural Short",997.5,12.57114,3.9687399999999999,null,2.4875659627636622,0.19295882291517591,4,121.356391,121.356391,1.9067669199999999,1.9067669199999999,2,9.4135340000000003,9.4135340000000003,3.9097739999999999E-2,3.9097739999999999E-2]
[null,"BM31","BAROSSA/MID NORTH & YORKE PENINSULA/RIVE","Rural Short",465,36.371580000000002,0.35310000000000002,1.4632365222341872,0.77204769045827093,3.8509567001388668E-2,6,80.796422000000007,80.796422000000007,0.57777780000000001,0.57777780000000001,5,4.0301080000000002,4.0301080000000002,4.7311829999999999E-2,4.7311829999999999E-2]
[null,"BM32","BAROSSA/MID NORTH & YORKE PENINSULA/RIVE","Rural Short",65,5.7459800000000003,0.83350999999999997,0.63254495492415397,5.0757006666718261E-3,0,2,3.8,3.8,3.0769230000000002E-2,3.0769230000000002E-2]
[null,"BM33","BAROSSA/MID NORTH & YORKE PENINSULA/RIVE","Rural Short",450.5,32.334310000000002,2.0019300000000002,4.0963001599003945,0.57193077309639784,2.2404183841480263,3,61.780244000000003,61.780244000000003,0.55937846999999996,0.55937846999999996,13,242.011099,242.011099,0.59933407000000005,0.59933407000000005]
[null,"BM34","BAROSSA/MID NORTH & YORKE PENINSULA/RIVE","Rural Short",424.5,41.691830000000003,null,null,1.5248064098798868,0.44033244488033968,12,174.79860600000001,174.79860600000001,1.2917159,1.2917159,3,50.478209999999997,50.478209999999997,1.03180212,1.03180212]
[null,"BM35","BAROSSA/MID NORTH & YORKE PENINSULA/RIVE","Rural Short",67,5.6227999999999989,1.3533741540000002,5.10608578071305,3.7810849746505808E-3,0.10215104459119696,1,2.7462659999999999,2.7462659999999999,2.9850720000000001E-2,2.9850720000000001E-2,4,74.194029999999998,74.194029999999998,1.1641790999999999,1.1641790999999999]
[null,"BM41","BAROSSA/MID NORTH & YORKE PENINSULA/RIVE","Urban",518,8.2200799999999994,3.1525400000000001,3.9172061063977726,1.4240262359909324E-3,0,1,0.11969100000000001,0.11969100000000001,1.9304999999999999E-3,1.9304999999999999E-3]
[null,"BM42","BAROSSA/MID NORTH & YORKE PENINSULA/RIVE","Rural Short",164,14.912534587999998,0.81979000000000002,1.2593741421833307,3.3125625403542448E-2,0,1,9.8292680000000008,9.8292680000000008,7.9268290000000005E-2,7.9268290000000005E-2]
[null,"BM43","BAROSSA/MID NORTH & YORKE PENINSULA/RIVE","Rural Short",1437.5,10.033163319000002,9.7675400000000003,4.9746231244185726,2.0051210029650228,0.62340700860252307,9,67.878726,67.878726,0.99524637999999999,0.99524637999999999,5,21.103999999999999,21.103999999999999,9.5304349999999996E-2,9.5304349999999996E-2]
[null,"BM44","BAROSSA/MID NORTH & YORKE PENINSULA/RIVE","Rural Short",981,47.018749999999997,5.1919102270000002,3.6066493966006732,5.0357253500107868,2.7361930978489353,15,249.80088900000001,240.72545199999999,2.0570846299999999,2.0275229399999999,14,135.730887,135.730887,0.36187564,0.36187564]
[null,"BM51","BAROSSA/MID NORTH & YORKE PENINSULA/RIVE","Urban",839,5.9813499999999999,6.6748500000000002,3.9972268537074545,1.534617947738621,0.46834385448534033,5,79.636471999999998,79.636471999999998,0.94517282000000002,0.94517282000000002,3,24.303933000000001,24.303933000000001,0.11680572,0.11680572]
[null,"BM52","BAROSSA/MID NORTH & YORKE PENINSULA/RIVE","Urban",1236,7.8881899999999998,5.6614800000000001,4.9174654477687989,8.2646576791658415,1.0283536558713229,9,291.12540000000001,291.12540000000001,1.9824702999999999,1.9824702999999999,9,36.224110000000003,36.224110000000003,0.26375405000000002,0.26375405000000002]
[null,"BM53","BAROSSA/MID NORTH & YORKE PENINSULA/RIVE","Rural Short",956.5,28.04541,6.00284,5.8777144154849843,3.9166119362814329,0.80159081621673933,9,199.262934,199.262934,2.11813903,2.11813903,7,40.782018000000001,40.782018000000001,0.21014114,0.21014114]
[null,"BM54","BAROSSA/MID NORTH & YORKE PENINSULA/RIVE","Rural Short",266,33.460800000000006,2.8528000000000002,null,0.99222755745040125,0.19053399425660394,4,181.52255600000001,181.52255600000001,2.0451127800000002,2.0451127800000002,2,34.857143000000001,34.857143000000001,0.28571428999999998,0.28571428999999998]
[null,"BM55","BAROSSA/MID NORTH & YORKE PENINSULA/RIVE","Rural Short",579,33.561589999999995,1.48447,2.9474308592399585,3.6358938562022036,0.14795564696371316,11,305.58609100000001,305.58609100000001,2.1462291599999999,2.1462291599999999,1,12.435233,12.435233,4.145078E-2,4.145078E-2]
[null,"BM56","BAROSSA/MID NORTH & YORKE PENINSULA/RIVE","Rural Short",809.5,81.574900000000014,0.54094000000000009,3.0064937917780576,3.7928773657913943,9.0931074696448705E-2,9,228.009477,228.009477,2.00823558,2.00823558,1,5.4663370000000002,5.4663370000000002,1.8529960000000002E-2,1.8529960000000002E-2]
[null,"BM57","BAROSSA/MID NORTH & YORKE PENINSULA/RIVE","Rural Short",85,16.520989999999998,null,1.4365629397976267,0.34571618555928463,0,5,197.92549399999999,197.92549399999999,1.9686274699999999,1.9686274699999999]
[null,"BT01","SOUTH EAST","Rural Long",757.5,24.667377312999999,0.87961,2.7721473175139875,0.11211644933592135,6.0906074047929911E-4,1,8.0193659999999998,8.0193659999999998,5.9846009999999998E-2,5.9846009999999998E-2,1,4.3563999999999999E-2,4.3563999999999999E-2,1.3201300000000001E-3,1.3201300000000001E-3]
[null,"BT02","SOUTH EAST","Rural Long",380.5,190.80816373899998,7.8062100000000001,2.7340421997474729,0.87337464529513242,1.6979875189119854E-3,14,124.365309,124.365309,1.31931679,1.31931679,1,0.241787,0.241787,5.2562399999999997E-3,5.2562399999999997E-3]
[null,"BT03","SOUTH EAST","Rural Long",359.5,100.11328400699999,2.5623756009999998,3.7743119147733406,0.2464296758449431,3.6986597694561071E-2,3,37.140473999999998,37.140473999999998,0.16689847999999999,0.16689847999999999,3,5.5744090000000002,5.5744090000000002,2.5034770000000001E-2,2.5034770000000001E-2]
[null,"BT04","SOUTH EAST","Rural Long",993.5,120.14561660300001,2.38978,3.3665871546716262,1.2886556548531363,0.24735248617889594,12,70.278478000000007,70.278478000000007,0.24928702,0.24928702,7,13.489682999999999,13.489682999999999,4.428787E-2,4.428787E-2]
[null,"BT06","SOUTH EAST","Rural Long",912.5,112.40602772899999,3.3177600000000003,3.9515007123876367,2.1134284938623997,7.7738298148448723E-2,5,125.489682,125.489682,1.05826485,1.05826485,3,4.6158900000000003,4.6158900000000003,2.0821920000000001E-2,2.0821920000000001E-2]
[null,"BT07","SOUTH EAST","Rural Long",74.5,63.344053430000002,7.3829999999999993E-2,null,0.40045436467048229,3.9681230061530091E-3,5,291.23937599999999,291.23937599999999,4.5011186399999996,4.5011186399999996,1,2.8859059999999999,2.8859059999999999,6.7114090000000001E-2,6.7114090000000001E-2]
[null,"BT10","SOUTH EAST","Rural Long",38,24.584238802000002,0.75026999999999999,null,1.1442961950474822E-3,1.6241619746114643E-3,1,1.6315789999999999,1.6315789999999999,0.81578965999999997,0.81578965999999997,2,2.3157890000000001,2.3157890000000001,0.10526315999999999,0.10526315999999999]
[null,"BT11","SOUTH EAST","Rural Long",56,42.136038880000001,null,null,0.227382676445605,1.6241619746114641E-2,1,220,220,0.98214285999999995,0.98214285999999995,1,15.714286,15.714286,0.98214285999999995,0.98214285999999995]
[null,"BT12","SOUTH EAST","Rural Long",73.5,59.809369954000005,null,null,0.17142291386580999,5.3523519617877796E-3,1,126.367347,126.367347,0.97959183999999999,0.97959183999999999,2,3.9455779999999998,3.9455779999999998,5.4421770000000001E-2,5.4421770000000001E-2]
[null,"BT13","SOUTH EAST","Rural Long",84,89.395164647000001,null,null,0.36128375742067514,0.44184588263861879,3,233.03571400000001,233.03571400000001,1.0714285699999999,1.0714285699999999,1,285,285,0.90476190000000001,0.90476190000000001]
[null,"BT14","SOUTH EAST","Rural Long",94.5,105.00989896200001,5.2549999999999999E-2,null,0.74543497718843665,1.1350677436205121E-2,2,427.39682499999998,427.39682499999998,1.48148148,1.48148148,6,6.5079370000000001,6.5079370000000001,0.11640212,0.11640212]
[null,"BT15","SOUTH EAST","Rural Long",257.5,122.729554229,0.24525999999999998,null,1.7127526277720895E-2,1.2015107334909811E-2,3,3.6038830000000002,3.6038830000000002,2.7184469999999999E-2,2.7184469999999999E-2,1,2.5281549999999999,2.5281549999999999,1.1650489999999999E-2,1.1650489999999999E-2]
[null,"BT18","SOUTH EAST","Rural Long",70.5,112.107540403,0.11650000000000001,null,0.82909777526700235,0.17751352127060299,6,637.19148900000005,637.19148900000005,3.4326241099999999,3.4326241099999999,2,136.425532,136.425532,1.3617021300000001,1.3617021300000001]
[null,"BT19","SOUTH EAST","Rural Short",4,3.7426200000000001,null,null,1.0274697705813414E-2,0,1,125,125,1,1]
[null,"BT20","SOUTH EAST","Rural Long",68,95.752382690000005,0.15045,null,1.1519368804931811,3.5546999580700914E-2,3,917.85294099999999,917.85294099999999,1.20588235,1.20588235,2,28.323529000000001,28.323529000000001,8.8235289999999994E-2,8.8235289999999994E-2]
[null,"BT22","SOUTH EAST","Rural Long",74.5,51.207542621000002,0.27622000000000002,null,5.1677881010364773E-3,0,1,3.7583890000000002,3.7583890000000002,1.342282E-2,1.342282E-2]
[null,"BT23","SOUTH EAST","Rural Long",90,162.053602224,null,null,0.20071319856704173,2.1557058935752164E-2,1,120.833333,120.833333,0.96666666999999995,0.96666666999999995,3,12.977778000000001,12.977778000000001,0.96666666999999995,0.96666666999999995]
[null,"BT25","SOUTH EAST","Rural Long",14,9.5108799999999984,null,null,5.6384259459522988E-2,0,1,218.21428599999999,218.21428599999999,0.92857142999999998,0.92857142999999998]
[null,"BT26","SOUTH EAST","Rural Long",146,91.209785120000006,2.0787900000000001,2.5682849374631314,0.76558935078247892,1.2384235056412413E-2,4,284.11643800000002,284.11643800000002,1.9726027399999999,1.9726027399999999,2,4.5958899999999998,4.5958899999999998,4.7945210000000002E-2,4.7945210000000002E-2]
[null,"BT27","SOUTH EAST","Rural Long",63,47.516234626999996,null,null,1.0005022327467372,0,5,860.46031700000003,860.46031700000003,4.0952381000000004,4.0952381000000004]
[null,"BT29","SOUTH EAST","Rural Long",54.5,70.291183713000009,0.11515,null,0.27140115723479069,0,2,269.81651399999998,269.81651399999998,2,2]
[null,"BT30","SOUTH EAST","Rural Long",33,30.282531526,8.0030000000000004E-2,null,0.14685746399981162,0,2,241.12121200000001,241.12121200000001,1.15151515,1.15151515]
[null,"BT31","SOUTH EAST","Rural Long",62,52.977026395999999,null,null,1.1984039114608414,0,11,1047.2849490000001,1047.2849490000001,7.8978495300000002,7.8978495300000002]
[null,"BT34","SOUTH EAST","Rural Long",58.5,50.608898791999998,0.21587000000000001,null,0.56600199176602017,8.1208098730573214E-4,3,524.22222199999999,524.22222199999999,2.7179487199999999,2.7179487199999999,1,0.75213700000000006,0.75213700000000006,3.4188030000000001E-2,3.4188030000000001E-2]
[null,"BT37","SOUTH EAST","Rural Long",57.5,66.778534230999995,null,null,5.5369158225390832E-4,0,1,0.52173899999999995,0.52173899999999995,3.4782609999999999E-2,3.4782609999999999E-2]
[null,"BU01","BAROSSA/MID NORTH & YORKE PENINSULA/RIVE","Rural Long",698,11.405279999999999,2.9070399999999998,null,0.25351691912798946,0.25073000483064478,3,19.679082999999999,19.679082999999999,0.96275071999999995,0.96275071999999995,2,19.462751000000001,19.462751000000001,1.01002865,1.01002865]
[null,"BU02","BAROSSA/MID NORTH & YORKE PENINSULA/RIVE","Rural Long",115,109.59711999999999,0.23786000000000002,null,0.16752857094587861,8.7114142274614895E-3,4,78.930413000000001,78.930413000000001,1.07826084,1.07826084,2,4.1043479999999999,4.1043479999999999,0.97391304000000001,0.97391304000000001]
[null,"BU03","BAROSSA/MID NORTH & YORKE PENINSULA/RIVE","Rural Long",53,44.229610000000001,0.49410000000000004,null,0.25233571041918113,4.4295326580312665E-3,5,257.962264,257.962264,2.0188679199999999,2.0188679199999999,3,4.528302,4.528302,0.94339622999999995,0.94339622999999995]
[null,"BU04","BAROSSA/MID NORTH & YORKE PENINSULA/RIVE","Rural Long",130,38.344730000000006,null,null,4.3557071137307453E-2,6.7218158085624466E-2,1,18.153846000000001,18.153846000000001,0.90769230999999995,0.90769230999999995,2,28.015384999999998,28.015384999999998,1.0923076899999999,1.0923076899999999]
[null,"BU05","BAROSSA/MID NORTH & YORKE PENINSULA/RIVE","Rural Long",98,80.383560000000003,0.6613,null,4.7506737757385328E-2,0.4378962160185409,2,26.265305999999999,26.265305999999999,0.93877551000000004,0.93877551000000004,3,242.10204100000001,242.10204100000001,1.81632653,1.81632653]
[null,"BU06","BAROSSA/MID NORTH & YORKE PENINSULA/RIVE","Rural Long",48.5,33.851140000000001,null,null,3.5528543194625777E-2,2.5469812783679782E-3,2,39.690722000000001,39.690722000000001,0.98969072000000002,0.98969072000000002,1,2.845361,2.845361,0.94845360999999995,0.94845360999999995]
[null,"BU07","BAROSSA/MID NORTH & YORKE PENINSULA/RIVE","Rural Long",10,3.2392699999999994,0.15773000000000001,1.4289419162443238,2.9548674106283569E-2,6.0352382465676006E-3,2,160.1,160.1,0.9,0.9,2,32.700000000000003,32.700000000000003,0.9,0.9]
[null,"BU08","BAROSSA/MID NORTH & YORKE PENINSULA/RIVE","Rural Long",86,161.54175000000001,null,null,4.6879220630830901E-2,8.1448031749549912E-2,3,29.534884000000002,29.534884000000002,0.93023255999999999,0.93023255999999999,2,51.313952999999998,51.313952999999998,1.0930232600000001,1.0930232600000001]
[null,"BU09","BAROSSA/MID NORTH & YORKE PENINSULA/RIVE","Rural Long",106,74.604410000000001,0.70037000000000005,null,3.2951293443094589,0.51862444871116076,5,1684.3018870000001,1684.3018870000001,4.2169811299999997,4.2169811299999997,1,265.09433999999999,265.09433999999999,0.94339622999999995,0.94339622999999995]
[null,"BU10","BAROSSA/MID NORTH & YORKE PENINSULA/RIVE","Rural Long",56,45.028289999999998,null,null,0.16483398403698851,6.9303729712114182E-2,3,159.48214300000001,159.48214300000001,2.1428571399999998,2.1428571399999998,3,67.053571000000005,67.053571000000005,1.41071429,1.41071429]
[null,"BU11","BAROSSA/MID NORTH & YORKE PENINSULA/RIVE","Rural Short",20.5,74.764539999999997,0.40936,null,0.24427066325800809,8.4334718769316502E-2,4,579.85365899999999,null,3.7560975600000002,null,8,200.195122,200.195122,7.36585366,7.36585366]
[null,"BU12","BAROSSA/MID NORTH & YORKE PENINSULA/RIVE","Rural Long",30,31.93439,0.11829000000000001,null,0.26211760088967456,0,3,473.40001100000001,473.40001100000001,2.70000003,2.70000003]
[null,"BU13","BAROSSA/MID NORTH & YORKE PENINSULA/RIVE","Rural Long",82.5,78.725189999999998,null,null,1.6692140130208573,7.3825544300521113E-4,4,1096.254545,1096.254545,2.7757575800000001,2.7757575800000001,1,0.484848,0.484848,1.212121E-2,1.212121E-2]
[null,"CBD103A","MAJOR METROPOLITAN AREAS","Urban",995.5,1.7907802119999998,3.6478743269999998,2.7816735969556166,0.13411104470602608,0.26748725071532897,4,5.8653909999999998,5.8653909999999998,7.4334490000000003E-2,7.4334490000000003E-2,2,11.698644,11.698644,8.4379709999999997E-2,8.4379709999999997E-2]
[null,"CBD103C","MAJOR METROPOLITAN AREAS","Urban",2044,5.7123019670000001,3.86781,6.992289110155558,5.3125054940640339,6.2423797826219287,20,113.159807,113.159807,1.3023482799999999,1.3023482799999999,16,132.96673200000001,132.96673200000001,0.57436399000000005,0.57436399000000005]
[null,"CBD103E","MAJOR METROPOLITAN AREAS","Urban",804.5,0.66808046600000004,4.8639842600000005,3.5437759522859231,0,9.5317885151005949E-2,null,null,null,null,null,1,5.1584839999999996,5.1584839999999996,6.2150400000000001E-2,6.2150400000000001E-2]
[null,"CBD103F","MAJOR METROPOLITAN AREAS","Urban",737.5,1.0850231320000001,3.0669400000000002,2.8769363913719048,7.0512266846647778E-3,0.1984449464348654,1,0.416271,0.416271,1.35593E-3,1.35593E-3,1,11.715254,11.715254,6.101695E-2,6.101695E-2]
[null,"CBD103G","MAJOR METROPOLITAN AREAS","Urban",430.5,0.41650999999999999,2.1404030949999999,2.2291493893411447,0.54348749113844008,0,4,54.965488999999998,54.965488999999998,0.25319371000000002,0.25319371000000002]
[null,"CBD155B","ADELAIDE BUSINESS AREA","CBD",39,null,0.13816999999999999,1.1622060918787165,0,5.1313210270317375,null,null,null,null,null,3,698.84615399999996,698.84615399999996,1.7692307700000001,1.7692307700000001]
[null,"CBD27E","ADELAIDE BUSINESS AREA","CBD",86,null,1.8912100000000001,null,6.9283590153056004E-2,0,2,4.2790650000000001,4.2790650000000001,9.3023159999999994E-2,9.3023159999999994E-2]
[null,"CBD27G","ADELAIDE BUSINESS AREA","CBD",53.5,null,2.8234899999999996,null,5.836395224288529E-3,0,1,0.57943900000000004,0.57943900000000004,1.8691590000000001E-2,1.8691590000000001E-2]
[null,"CBD27M","ADELAIDE BUSINESS AREA","CBD",345,null,3.0962100000000001,null,0.25435370662478479,0.13781423561868397,2,3.91594,3.91594,1.1594190000000001E-2,1.1594190000000001E-2,1,2.1217389999999998,2.1217389999999998,8.6956499999999992E-3,8.6956499999999992E-3]
[null,"CBD353A","ADELAIDE BUSINESS AREA","CBD",29,null,4.4791846799999995,3.5818810700524382,0,4.311401633426043E-2,null,null,null,null,null,1,7.8965519999999998,7.8965519999999998,3.4482760000000001E-2,3.4482760000000001E-2]
[null,"CBD353C","MAJOR METROPOLITAN AREAS","Urban",154.5,null,1.75234,2.0397479014826807,0.25620963442355565,0,5,72.200577999999993,72.200577999999993,0.36245920999999998,0.36245920999999998]
[null,"CBD353F","ADELAIDE BUSINESS AREA","CBD",163.5,null,1.8702027489999999,3.0331673742146177,1.4685123467564686E-2,3.1252955071996637E-2,1,0.47706399999999999,0.47706399999999999,6.1162100000000004E-3,6.1162100000000004E-3,1,1.0152909999999999,1.0152909999999999,6.1162100000000004E-3,6.1162100000000004E-3]
[null,"CBD353L","MAJOR METROPOLITAN AREAS","Urban",14,0.23733000000000001,2.1161699999999999,1.444336383821996,2.0081814036201392E-2,0,2,62.452323999999997,62.452323999999997,0.61904707000000003,0.61904707000000003]
[null,"CBD353L","ADELAIDE BUSINESS AREA","CBD",14,0.23733000000000001,2.1161699999999999,1.444336383821996,0,8.7357657550641218E-2,null,null,null,null,null,2,33.142856999999999,33.142856999999999,0.21428570999999999,0.21428570999999999]
[null,"CBD353M","ADELAIDE BUSINESS AREA","CBD",54.5,null,2.3365900000000002,3.4091886763345909,0,2.9919997711094615,null,null,null,null,null,3,291.59633000000002,291.59633000000002,2.1467889900000001,2.1467889900000001]
[null,"CBD353N","ADELAIDE BUSINESS AREA","CBD",31.5,null,1.4117299999999999,2.5756201726331858,0,7.945028337579868E-2,null,null,null,null,null,2,13.396825,13.396825,6.3492060000000003E-2,6.3492060000000003E-2]
[null,"CBD353Q","ADELAIDE BUSINESS AREA","CBD",7,null,2.2274600000000002,2.1777074803563492,0.11861061262263785,0,1,90,90,0.85714285999999995,0.85714285999999995]
[null,"CBD353R","MAJOR METROPOLITAN AREAS","Urban",8,0.27672000000000002,2.735963505,2.3374441340335812,0.11865342223563906,0,1,645.74935400000004,645.74935400000004,5.12499488,5.12499488]
[null,"CBD366A","ADELAIDE BUSINESS AREA","CBD",426,null,3.0734400000000002,4.2677731898497129,2.4286934965587752E-2,6.1941097702933101E-2,1,0.302817,0.302817,2.3474199999999998E-3,2.3474199999999998E-3,1,0.77229999999999999,0.77229999999999999,2.3474199999999998E-3,2.3474199999999998E-3]
[null,"CBD366B","ADELAIDE BUSINESS AREA","CBD",22,null,1.894527614,2.553042890356525,0,1.3988521456923797,null,null,null,null,null,2,337.72727300000003,337.72727300000003,1.4545454499999999,1.4545454499999999]
[null,"CBD366E","MAJOR METROPOLITAN AREAS","Urban",626,0.530672335,3.6815900000000004,2.3821033320559377,4.2836087268513046,0,3,297.92651799999999,297.92651799999999,2.9472843499999999,2.9472843499999999]
[null,"CBD366J","MAJOR METROPOLITAN AREAS","Urban",192,null,5.6889764759999997,3.4675657167528922,0,0.11348570374243866,null,null,null,null,null,3,25.734375,25.734375,1.5625E-2,1.5625E-2]
[null,"CBD366K","ADELAIDE BUSINESS AREA","CBD",106,null,1.8841700000000001,2.8733164051840858,4.3678828775320609E-2,0,1,2.188679,2.188679,9.4339599999999999E-3,9.4339599999999999E-3]
[null,"CBD366L","ADELAIDE BUSINESS AREA","CBD",89,null,2.64832,3.3913554812198612,4.3302243845660005E-2,0,1,2.5842670000000001,2.5842670000000001,2.2471890000000001E-2,2.2471890000000001E-2]
[null,"CBD366N","ADELAIDE BUSINESS AREA","CBD",34.5,null,2.66635,2.2482019482244029,0,6.9283659436715439E-2,null,null,null,null,null,1,10.666667,10.666667,2.8985509999999999E-2,2.8985509999999999E-2]
[null,"CBD366Q","MAJOR METROPOLITAN AREAS","Urban",781.5,null,5.28939,4.877455074113958,0,0.31436527567754663,null,null,null,null,null,2,17.513756000000001,17.513756000000001,4.2226487523992322E-2,4.2226487523992322E-2]
[null,"CBD366S","MAJOR METROPOLITAN AREAS","Urban",166,null,2.4608099999999999,2.962634801228798,0,0.42961952813242565,null,null,null,null,null,1,112.680723,112.680723,0.25903614000000003,0.25903614000000003]
[null,"CBD367F","ADELAIDE BUSINESS AREA","CBD",111.5,null,1.1572499999999999,2.4253907458386985,0,4.6126349353248053E-2,null,null,null,null,null,1,2.1973090000000002,2.1973090000000002,8.9686100000000001E-3,8.9686100000000001E-3]
[null,"CBD367H","ADELAIDE BUSINESS AREA","CBD",130.5,null,3.8144248259999998,6.1717906618480667,0,0.44959070308390348,null,null,null,null,null,2,18.298850999999999,18.298850999999999,5.3639850000000003E-2,5.3639850000000003E-2]
[null,"CBD367K","ADELAIDE BUSINESS AREA","CBD",14.5,null,1.278488018,2.3672232835681131,0,0.10336067671401299,null,null,null,null,null,2,37.862068999999998,37.862068999999998,0.13793103000000001,0.13793103000000001]
[null,"CBD367N","ADELAIDE BUSINESS AREA","CBD",11,0.42312489199999997,4.2715350079999999,1.9950887034603246,0,1.2802415330697418E-2,null,null,null,null,null,2,6.1818179999999998,6.1818179999999998,1,1]
[null,"CBD367N","MAJOR METROPOLITAN AREAS","Urban",11,0.42312489199999997,4.2715350079999999,1.9950887034603246,0,0.11654046970029017,null,null,null,null,null,2,461.27272699999997,461.27272699999997,3.7272727300000001,3.7272727300000001]
[null,"CBD367Q","ADELAIDE BUSINESS AREA","CBD",13,null,2.72,3.8557425514403834,0,0.20898060319226669,null,null,null,null,null,2,85.384614999999997,85.384614999999997,0.30769231000000002,0.30769231000000002]
[null,"CBD367S","ADELAIDE BUSINESS AREA","CBD",8,null,2.3953699999999998,4.4964038964488058,0.24512859942011822,3.5394912973104632E-2,1,162.75,162.75,1,1,1,23.5,23.5,0.125,0.125]
[null,"CBD367U","ADELAIDE BUSINESS AREA","CBD",47.5,null,1.99054,1.3252578908016357,0.7035680307472979,0,2,78.673683999999994,78.673683999999994,1.0105263200000001,1.0105263200000001]
[null,"CBD412A","MAJOR METROPOLITAN AREAS","Urban",186.5,8.9510000000000006E-2,6.3832399999999998,5.9853232680576243,0,0.51207524082931988,null,null,null,null,null,1,119.544236,119.544236,0.34852547,0.34852547]
[null,"CBD412A","ADELAIDE BUSINESS AREA","CBD",186.5,8.9510000000000006E-2,6.3832399999999998,5.9853232680576243,0.21525608172552729,0,1,6.1304679999999996,6.1304679999999996,2.5022320000000001E-2,2.5022320000000001E-2]
[null,"CBD412B","MAJOR METROPOLITAN AREAS","Urban",516,null,3.7579300000000004,3.2364581774989771,6.5160621676042751E-2,0.10569949577468178,2,5.4980570000000002,5.4980570000000002,8.5917229999999997E-2,8.5917229999999997E-2,1,8.9186049999999994,8.9186049999999994,7.5581400000000007E-2,7.5581400000000007E-2]
[null,"CBD412C","ADELAIDE BUSINESS AREA","CBD",141,null,2.2071700000000001,1.5782949253301801,0.45912929851427337,1.3555498585444326E-2,1,17.295490999999998,17.295490999999998,0.27895953000000001,0.27895953000000001,1,0.51063800000000004,0.51063800000000004,0.12765957,0.12765957]
[null,"CBD412D","ADELAIDE BUSINESS AREA","CBD",206,null,3.1763300000000001,2.4123397430036677,0,11.467951803285899,null,null,null,null,null,2,295.68932000000001,295.68932000000001,1.04854369,1.04854369]
[null,"CBD412E","MAJOR METROPOLITAN AREAS","Urban",159,null,5.0413399999999999,2.7695942746236311,5.5582959533839616E-3,0,1,1.5220130000000001,1.5220130000000001,6.2893100000000002E-3,6.2893100000000002E-3]
[null,"CBD412E","ADELAIDE BUSINESS AREA","CBD",159,null,5.0413399999999999,2.7695942746236311,0,1.1672790448577058E-2,null,null,null,null,null,1,0.38993699999999998,0.38993699999999998,6.2893100000000002E-3,6.2893100000000002E-3]
[null,"CBD412F","MAJOR METROPOLITAN AREAS","Urban",593,0.31506566199999997,6.534736756,3.0519531972735097,2.7860384262209693E-2,0.41388633504123545,5,2.045531,2.045531,8.4317000000000003E-3,8.4317000000000003E-3,2,30.387858000000001,30.387858000000001,0.17875210999999999,0.17875210999999999]
[null,"CBD412G","MAJOR METROPOLITAN AREAS","Urban",286,null,3.5095700000000001,2.2863070659909175,0,4.5844457532869372E-2,null,null,null,null,null,3,6.9790210000000004,6.9790210000000004,0.42657342999999998,0.42657342999999998]
[null,"CBD412J","MAJOR METROPOLITAN AREAS","Urban",608.5,null,1.781312821,2.4118824815904691,1.5820931481859257,2.1523008148748111,5,113.199671,113.199671,0.47000821999999998,0.47000821999999998,1,153.998357,153.998357,0.45028759000000002,0.45028759000000002]
[null,"CBD412M","MAJOR METROPOLITAN AREAS","Urban",327,0.43637738599999998,2.3005599999999999,2.4118824815904691,2.2728147771368179,0.58210517620893854,5,302.61467900000002,170.77369999999999,2.0948012199999999,1.1253822600000001,1,77.504587000000001,77.504587000000001,0.19571864999999999,0.19571864999999999]
[null,"CBD412N","MAJOR METROPOLITAN AREAS","Urban",493.5,0.25398499099999999,2.82233,2.3225640855457574,3.2522921776825163E-2,0,2,2.8693010000000001,2.8693010000000001,1.013171E-2,1.013171E-2]
[null,"CBD412S","MAJOR METROPOLITAN AREAS","Urban",437,0.29407,3.8638000000000003,2.8733735628607358,0,0.2640190577857382,null,null,null,null,null,1,26.304348000000001,26.304348000000001,0.12585811999999999,0.12585811999999999]
[null,"CD01","UPPER NORTH/EYRE PENINSULA","Rural Short",672,11.302100000000001,0.97155999999999998,2.3434647426406907,1.7349443558128297,0,4,125.636905,16.626487999999998,1.9077381,0.95982142999999998]
[null,"CD02","UPPER NORTH/EYRE PENINSULA","Rural Long",363.5,5.4146800000000006,1.3730899999999999,3.2770401279203156,0.85986457085424439,0,5,128.167813,18.387895,1.9312242100000001,0.97661622999999997]
[null,"CD03","UPPER NORTH/EYRE PENINSULA","Rural Short",465,36.695449999999994,7.5743100000000005,2.2520124600010538,5.4312054001695955,0.61185824838118874,8,568.38711699999999,457.59141799999998,3.5519715999999999,2.5885307399999999,11,64.032257999999999,64.032257999999999,0.22150538,0.22150538]
[null,"CD04","UPPER NORTH/EYRE PENINSULA","Rural Short",190,31.56007,1.0275399999999999,null,5.2980795215694902,1.548910679151372,9,1356.9561779999999,1244.3772309999999,4.7122810800000003,3.7333337100000001,2,396.71052600000002,396.71052600000002,1.1368421099999999,1.1368421099999999]
[null,"CD05","UPPER NORTH/EYRE PENINSULA","Rural Long",66.5,82.154350000000008,null,null,1.6248079481240938,3.6156060321180211E-2,8,1323.8345859999999,1216.6165410000001,5.7142857100000004,4.7819548899999997,2,29.458646999999999,29.458646999999999,9.0225559999999996E-2,9.0225559999999996E-2]
[null,"CD15","UPPER NORTH/EYRE PENINSULA","Rural Long",33.5,88.256280000000004,null,null,0.53704392201414075,5.9355737617618969E-2,7,868.59701500000006,758.74626899999998,5.5223880599999999,4.5671641799999998,1,96,96,0.71641790999999999,0.71641790999999999]
[null,"CD16","UPPER NORTH/EYRE PENINSULA","Rural Short",68,96.935699999999997,null,null,4.8622335594654835,0.11474782397852419,10,3479.588244,3374.7353029999999,8.6862746299999998,7.7745099299999998,3,82.117647000000005,82.117647000000005,0.55882352999999996,0.55882352999999996]
[null,"CD17","UPPER NORTH/EYRE PENINSULA","Rural Long",88.5,183.94570999999999,0.52551999999999999,null,2.0912931061730116,1.5835579252461776E-2,5,1280.3389830000001,1178.9830509999999,2.8926553699999999,2.0112994400000002,1,9.6949149999999999,9.6949149999999999,0.88135593000000001,0.88135593000000001]
[null,"CD18","UPPER NORTH/EYRE PENINSULA","Rural Long",45.5,69.604020000000006,null,null,0.59536610201155249,0,7,708.96703300000001,602.81318699999997,3.2527472500000001,2.3296703299999999]
[null,"CD19","UPPER NORTH/EYRE PENINSULA","Rural Long",110,26.26641,null,null,0.51120498150895832,0.85462295720890746,5,251.8,140.981818,4.0454545499999996,3.08181818,15,420.954545,420.954545,1.7,1.7]
[null,"CD20","UPPER NORTH/EYRE PENINSULA","Rural Long",50.5,10.694709999999999,3.7539999999999997E-2,null,0.38824849207373074,0,5,416.55440700000003,311.80193100000002,3.8349832300000002,2.92409214]
[null,"CD21","UPPER NORTH/EYRE PENINSULA","Rural Long",18.5,4.1521699999999999,null,null,3.8979887390675143E-2,0,3,114.162162,14.702703,2.4864864899999999,1.62162162]
[null,"CD22","UPPER NORTH/EYRE PENINSULA","Rural Long",8.5,21.753150000000002,null,null,0.21005212992105765,0,7,1338.941176,1230.705882,5.7647058800000002,4.8235294099999999]
[null,"CD23","UPPER NORTH/EYRE PENINSULA","Rural Long",46,86.909949999999995,null,null,2.5209946867741948,7.2644335591712766E-2,13,2969.3913040000002,2969.3913040000002,8.6086956499999996,8.6086956499999996,3,85.565217000000004,85.565217000000004,0.73913043,0.73913043]
[null,"CD24","UPPER NORTH/EYRE PENINSULA","Rural Long",8,29.189520000000002,null,null,0.25397832877986776,0,10,1720.125,1605.125,7.5,6.5]
[null,"CD25","UPPER NORTH/EYRE PENINSULA","Rural Long",22.5,20.957999999999998,null,null,5.6107413668396042E-2,0,4,135.11111099999999,58.444443999999997,1.82222222,1.15555556]
[null,"CD26","UPPER NORTH/EYRE PENINSULA","Rural Long",34.5,83.55592,null,null,0.22861925431263871,5.1954726801491734E-2,8,359.04347799999999,252.376812,4.1449275400000003,3.2173913000000001,7,81.594202999999993,81.594202999999993,0.81159420000000004,0.81159420000000004]
[null,"CL01","BAROSSA/MID NORTH & YORKE PENINSULA/RIVE","Rural Long",137.5,45.341380000000001,0.21002999999999999,null,2.6827464543366362,0,3,1057.1345449999999,1057.1345449999999,2.7781818199999999,2.7781818199999999]
[null,"CL03","BAROSSA/MID NORTH & YORKE PENINSULA/RIVE","Rural Long",78,94.113910000000004,0.67034000000000005,null,3.1173205208616537,0,2,2165.4102560000001,2165.4102560000001,1.8589743599999999,1.8589743599999999]
[null,"CL04","BAROSSA/MID NORTH & YORKE PENINSULA/RIVE","Rural Long",1032,77.234030000000004,13.327500000000001,2.9150415091384207,1.5918079507882157,7.2367489800585813E-2,10,83.572676000000001,83.299419999999998,2.0048449599999998,2.0029069800000001,6,3.7994189999999999,3.7994189999999999,6.4922480000000005E-2,6.4922480000000005E-2]
[null,"CL05","BAROSSA/MID NORTH & YORKE PENINSULA/RIVE","Rural Long",395.5,44.498040000000003,6.4657099999999996,1.6956777406099306,0.45229219715714253,2.4436255163472486E-2,5,61.962072999999997,61.962072999999997,1.0391908999999999,1.0391908999999999,2,3.347661,3.347661,2.275601E-2,2.275601E-2]
[null,"CL06","BAROSSA/MID NORTH & YORKE PENINSULA/RIVE","Rural Long",244,57.770299999999999,0.38858000000000004,1.1622060918787165,0.39799350932410926,5.2434592839445113E-2,4,88.377049,22.877049,1.3893442600000001,0.95491802999999997,2,11.643443,11.643443,4.5081969999999999E-2,4.5081969999999999E-2]
[null,"CL07","BAROSSA/MID NORTH & YORKE PENINSULA/RIVE","Rural Long",62,60.581449999999997,0.11787,null,2.4386053793348128,0,7,2131.0967740000001,2131.0967740000001,5.9354838699999997,5.9354838699999997]
[null,"CL08","BAROSSA/MID NORTH & YORKE PENINSULA/RIVE","Rural Long",79,55.002510000000001,null,null,4.7340630282709156E-2,0,2,32.468353999999998,32.468353999999998,0.97468354000000001,0.97468354000000001]
[null,"CL09","BAROSSA/MID NORTH & YORKE PENINSULA/RIVE","Rural Long",673,99.131743794000016,5.7421699999999998,2.0576763593918259,0.20143303909547139,8.6486625148060464E-2,3,16.216942,16.216942,7.3798929999999999E-2,7.3798929999999999E-2,3,6.962853,6.962853,3.566122E-2,3.566122E-2]
[null,"CL11","BAROSSA/MID NORTH & YORKE PENINSULA/RIVE","Rural Short",81,74.864469999999997,0.28195999999999999,null,0,0.10993926545220352,null,null,null,null,null,4,66.049383000000006,66.049383000000006,1.45679012,1.45679012]
[null,"CL12","BAROSSA/MID NORTH & YORKE PENINSULA/RIVE","Rural Long",103,100.60039999999999,0.29955000000000004,null,0.59785771413169497,0,4,314.49514599999998,314.49514599999998,1.2427184499999999,1.2427184499999999]
[null,"CL13","BAROSSA/MID NORTH & YORKE PENINSULA/RIVE","Rural Long",73,60.165900000000001,null,null,1.0259351327582666,0.18360412867539599,4,761.46575299999995,761.46575299999995,2.3835616399999999,2.3835616399999999,2,136.27397300000001,136.27397300000001,1.19178082,1.19178082]
[null,"CL14","BAROSSA/MID NORTH & YORKE PENINSULA/RIVE","Rural Long",140.5,11.160730000000001,9.6300000000000014E-3,null,0,0.33354380914975434,null,null,null,null,null,3,128.62633500000001,128.62633500000001,0.51245552000000005,0.51245552000000005]
[null,"CL15","BAROSSA/MID NORTH & YORKE PENINSULA/RIVE","Rural Long",113.5,37.223550000000003,0.40205000000000002,null,2.6171155454534731E-2,5.2434592839445113E-2,2,12.493392,12.493392,0.93392070000000005,0.93392070000000005,3,25.030836999999998,25.030836999999998,0.17621144999999999,0.17621144999999999]
[null,"CL16","BAROSSA/MID NORTH & YORKE PENINSULA/RIVE","Rural Long",226,31.962760000000003,8.1110000000000002E-2,0.53156639284288842,0,0.3110639309102457,null,null,null,null,null,4,74.575220999999999,74.575220999999999,0.52212389000000003,0.52212389000000003]
[null,"CL17","BAROSSA/MID NORTH & YORKE PENINSULA/RIVE","Rural Long",231.5,37.364870000000003,0.72024999999999995,null,9.4552111634729874E-2,0,2,22.1296,22.1296,9.0712790000000001E-2,9.0712790000000001E-2]
[null,"CL18","BAROSSA/MID NORTH & YORKE PENINSULA/RIVE","Rural Long",32,31.021470000000001,null,null,0.18973164885233923,0,5,321.25,184.5625,2.65625,1.8125]
[null,"CL19","BAROSSA/MID NORTH & YORKE PENINSULA/RIVE","Rural Long",101.5,98.449939999999998,null,null,1.8087258353627671E-2,1.9711420328239134E-2,2,9.6551720000000003,9.6551720000000003,0.79802956000000003,0.79802956000000003,6,10.522167,10.522167,0.12807882000000001,0.12807882000000001]
[null,"CL20","BAROSSA/MID NORTH & YORKE PENINSULA/RIVE","Rural Long",105,31.804399999999998,0.25247999999999998,null,2.1483233391451643E-2,3.0083909302462352E-3,1,11.085713999999999,11.085713999999999,0.92380952000000005,0.92380952000000005,1,1.552381,1.552381,9.5238100000000006E-3,9.5238100000000006E-3]
[null,"CL23","BAROSSA/MID NORTH & YORKE PENINSULA/RIVE","Rural Long",1336.5,10.232799999999999,3.9068400000000003,4.3439834253827438,0.62180793264137568,0.65049532721796655,7,25.208130000000001,25.208130000000001,0.96844991999999996,0.96844991999999996,3,26.371119,26.371119,7.4074070000000006E-2,7.4074070000000006E-2]
[null,"CL24","BAROSSA/MID NORTH & YORKE PENINSULA/RIVE","Rural Long",53.5,38.141480000000001,null,null,0.25562094714055433,0,2,258.87850500000002,258.87850500000002,1.8691588800000001,1.8691588800000001]
[null,"CL25","BAROSSA/MID NORTH & YORKE PENINSULA/RIVE","Rural Long",325,15.0893,0.17454,null,4.1932909162695986E-2,0,4,6.9907690000000002,6.9907690000000002,2.4615379999999999E-2,2.4615379999999999E-2]
[null,"CL26","BAROSSA/MID NORTH & YORKE PENINSULA/RIVE","Rural Long",48,27.173839999999998,8.7550000000000003E-2,null,1.924386816959844E-2,0,1,21.722232999999999,21.722232999999999,5.555558E-2,5.555558E-2]
[null,"CL27","BAROSSA/MID NORTH & YORKE PENINSULA/RIVE","Rural Long",48,59.299399999999999,null,null,5.6107413668396037E-3,5.2785264174872587E-3,2,6.3333329999999997,6.3333329999999997,8.3333329999999997E-2,8.3333329999999997E-2,2,5.9583329999999997,5.9583329999999997,6.25E-2,6.25E-2]
[null,"CL28","BAROSSA/MID NORTH & YORKE PENINSULA/RIVE","Rural Long",40,14.08286,1.1117999999999999,null,1.4395981138601615E-2,0,1,19.5,19.5,0.97499999999999998,0.97499999999999998]
[null,"CM01","UPPER NORTH/EYRE PENINSULA","Rural Long",315.5,29.153449999999999,0.35208999999999996,1.0402697150258677,0.65223022750902881,0.22059072636995705,3,112.00950899999999,3.9144220000000001,1.8605388300000001,0.92868463000000001,2,37.882725999999998,37.882725999999998,0.14580032000000001,0.14580032000000001]
[null,"CM02","UPPER NORTH/EYRE PENINSULA","Rural Long",263.5,51.192209999999996,0.53042,1.3184370747214293,0.66014801713525972,0.13229537538653383,4,135.74193500000001,27.886147999999999,1.9924098699999999,1.0626186,2,27.203036000000001,27.203036000000001,0.15939279000000001,0.15939279000000001]
[null,"CM03","UPPER NORTH/EYRE PENINSULA","Rural Long",141.5,59.453180000000003,0.82114999999999994,1.028838179695913,1.1920364456407533,1.2107389265285462E-2,12,456.44287000000003,351.51000800000003,2.9893992599999999,2.08480562,2,4.6360419999999998,4.6360419999999998,2.826855E-2,2.826855E-2]
[null,"CM04","UPPER NORTH/EYRE PENINSULA","Rural Long",22.5,10.836319999999999,9.4670000000000004E-2,null,0.12779201718420202,2.1224843986399817E-3,3,307.73333300000002,194.31111100000001,2.7555555599999999,1.7777777800000001,2,5.1111110000000002,5.1111110000000002,0.84444443999999996,0.84444443999999996]
[null,"CM05","UPPER NORTH/EYRE PENINSULA","Rural Long",1057.5,9.382970000000002,4.9916999999999998,2.1205498037065764,2.2414911760524214,1.785341594205577,2,114.844444,3.835461,1.9158392399999999,0.95886525,5,91.473286000000002,91.473286000000002,0.29408983,0.29408983]
[null,"CM09","UPPER NORTH/EYRE PENINSULA","Rural Long",65.5,66.635840000000002,null,null,1.2542590848937032,4.7026871719431942E-2,6,1037.5267180000001,933.03816800000004,4.9312977099999999,4.0305343499999999,1,38.900762999999998,38.900762999999998,0.39694656,0.39694656]
[null,"CM10","UPPER NORTH/EYRE PENINSULA","Rural Long",81,82.747679999999988,null,null,0.81176722853943473,3.2077198998576417E-2,7,543,445.61728399999998,4.14814814,3.3086419600000001,3,21.456790000000002,21.456790000000002,0.14814815000000001,0.14814815000000001]
[null,"CM11","UPPER NORTH/EYRE PENINSULA","Rural Long",82.5,110.5834,null,null,0.72843664561324173,4.8540295377592626E-3,7,478.4,388.41212100000001,2.8,2.0242424200000002,3,3.1878790000000001,3.1878790000000001,4.8484850000000003E-2,4.8484850000000003E-2]
[null,"CM12","UPPER NORTH/EYRE PENINSULA","Rural Long",94,103.81151,null,null,2.6717649046219343,0.30713272067624292,13,1540.010638,1444.989362,5.4574468100000004,4.6382978699999997,5,177.031915,177.031915,1.06382979,1.06382979]
[null,"CM15","UPPER NORTH/EYRE PENINSULA","Rural Long",72,93.776449999999997,null,null,0.50762444261038309,0.4336327908351858,4,382,274.05555600000002,3.2083333299999999,2.2777777800000001,4,326.31944399999998,326.31944399999998,1.88888889,1.88888889]
[null,"CM16","UPPER NORTH/EYRE PENINSULA","Rural Long",100,136.61864000000003,null,null,0.83345348238073302,0.32448172358686539,4,451.58,350.66,3.02,2.15,7,175.81,175.81,0.98,0.98]
[null,"CM17","UPPER NORTH/EYRE PENINSULA","Rural Long",96,90.175600000000003,null,null,0.55029560721608428,0.29663103699949378,3,310.58333299999998,206.66666699999999,2.71875,1.8229166699999999,1,167.41666699999999,167.41666699999999,0.85416667000000002,0.85416667000000002]
[null,"CM18","UPPER NORTH/EYRE PENINSULA","Rural Long",68,96.193399999999997,null,null,2.0010598346516995,0,7,1594.426471,1507.426471,3.8088235300000002,3.0588235300000002]
[null,"CM20A","UPPER NORTH/EYRE PENINSULA","Rural Long",87,29.857130000000002,0.10604999999999999,null,0.72738463160695932,0,3,453,337,3,2]
[null,"CM20B","UPPER NORTH/EYRE PENINSULA","Rural Long",38,29.59517,0.18621000000000001,null,0.30934748700525855,9.1728238793397462E-2,3,441.07894700000003,328.13157899999999,2.9210526300000001,1.9473684200000001,1,130.78947400000001,130.78947400000001,0.36842105000000003,0.36842105000000003]
[null,"CM20C","UPPER NORTH/EYRE PENINSULA","Rural Long",107,33.579279999999997,null,null,0.87649377470793688,3.875841075777358E-3,4,443.83177599999999,328.915888,2.96261682,1.97196262,2,1.9626170000000001,1.9626170000000001,2.8037380000000001E-2,2.8037380000000001E-2]
[null,"CM21","UPPER NORTH/EYRE PENINSULA","Rural Long",60.5,55.339089999999999,null,null,0.13774000927869726,0.35417804878175002,4,123.355372,12.148759999999999,1.9504132199999999,0.99173553999999997,3,317.19008300000002,317.19008300000002,2.0661157000000001,2.0661157000000001]
[null,"CM22","UPPER NORTH/EYRE PENINSULA","Rural Long",57.5,74.50461,null,null,1.0096750638609802,0.3668575860153645,5,951.40870199999995,848.52174600000001,4.4695652900000002,3.5826087700000002,6,345.68695700000001,345.68695700000001,1.7391304299999999,1.7391304299999999]
[null,"CM24","UPPER NORTH/EYRE PENINSULA","Rural Long",48.5,58.796839999999996,null,null,0.37241295822397869,6.4523525718655439E-2,6,416.04123700000002,310.804124,2.8041237099999998,1.8969072199999999,1,72.082474000000005,72.082474000000005,0.94845360999999995,0.94845360999999995]
[null,"CM25","UPPER NORTH/EYRE PENINSULA","Rural Long",119,93.766600000000011,null,null,0.22660750823044953,6.6461446256544127E-2,3,103.17647100000001,3.7478989999999999,1.74789916,0.89075629999999995,2,30.260504000000001,30.260504000000001,0.83193276999999999,0.83193276999999999]
[null,"CM26","UPPER NORTH/EYRE PENINSULA","Rural Long",66,71.80735,null,null,0.67463628020423705,0.47947845384580945,5,553.83333300000004,446.62121200000001,3.7878787900000002,2.8636363600000001,6,393.62121200000001,393.62121200000001,2.2727272699999999,2.2727272699999999]
[null,"CM27","UPPER NORTH/EYRE PENINSULA","Rural Long",45,56.860459999999996,null,null,9.287253473005555E-2,0,2,111.822222,3.5555560000000002,1.82222222,0.88888889000000004]
[null,"CM28","UPPER NORTH/EYRE PENINSULA","Rural Long",77,78.573639999999997,null,null,0.22310079487617479,1.0354032588148085E-2,3,156.98701299999999,59.064934999999998,2.5194805200000001,1.6753246799999999,2,7.2857139999999996,7.2857139999999996,7.7922080000000005E-2,7.7922080000000005E-2]
[null,"CM29","UPPER NORTH/EYRE PENINSULA","Rural Long",77,62.28199,null,null,0.15510746857539484,0.64501378055365288,2,109.14285700000001,3.6883119999999998,1.83116883,0.92207792,3,453.87013000000002,453.87013000000002,1.6363636399999999,1.6363636399999999]
[null,"CM35","UPPER NORTH/EYRE PENINSULA","Rural Long",22,29.776979999999998,null,null,5.1511773535688601E-2,2.2147663290156333E-3,3,126.863636,3.8181820000000002,1.9545454499999999,0.95454545000000002,1,5.4545450000000004,5.4545450000000004,9.0909089999999998E-2,9.0909089999999998E-2]
[null,"CM36","UPPER NORTH/EYRE PENINSULA","Rural Long",4,30.249230000000001,null,null,6.6442989870468989E-3,0,2,90,3,1.5,0.75]
[null,"CM37","UPPER NORTH/EYRE PENINSULA","Rural Long",4,0.21920000000000001,0.27749000000000001,null,8.8590653160625331E-3,0,2,120,4,2,1]
[null,"CN02","BAROSSA/MID NORTH & YORKE PENINSULA/RIVE","Rural Long",90.5,101.22521,null,null,0.3960002196279952,0.23889946135648629,3,237.08287300000001,224.773481,0.90607735,0.88397789999999998,2,143.027624,143.027624,0.66298343000000004,0.66298343000000004]
[null,"CN03","BAROSSA/MID NORTH & YORKE PENINSULA/RIVE","Rural Long",51,38.462420000000002,null,null,0.17618466147319362,3.4328878099742313E-3,1,187.17647099999999,187.17647099999999,1,1,3,3.6470590000000001,3.6470590000000001,9.8039219999999996E-2,9.8039219999999996E-2]
[null,"CN11","BAROSSA/MID NORTH & YORKE PENINSULA/RIVE","Rural Long",13,17.02628,null,null,9.3278621862996014E-2,0,1,388.76942500000001,388.76942500000001,0.35897454000000001,0.35897454000000001]
[null,"CN24","BAROSSA/MID NORTH & YORKE PENINSULA/RIVE","Rural Long",549.5,9.5051800000000011,3.65882,1.8461929557876664,1.2181214809585983E-2,0,2,1.201092,1.201092,5.4595099999999999E-3,5.4595099999999999E-3]
[null,"CN25","BAROSSA/MID NORTH & YORKE PENINSULA/RIVE","Rural Long",97,87.345820000000003,0.58238999999999996,null,0.19746487461781884,0,3,110.298969,110.298969,0.80412371000000005,0.80412371000000005]
[null,"CN27","BAROSSA/MID NORTH & YORKE PENINSULA/RIVE","Rural Long",62,11.957240000000001,0.1648,null,3.285236721373189E-3,0.28721828010117734,3,2.870968,2.870968,0.16129031999999999,0.16129031999999999,4,251,251,1.12903226,1.12903226]
[null,"CN31","BAROSSA/MID NORTH & YORKE PENINSULA/RIVE","Rural Long",24,11.44641,8.2269999999999996E-2,0.40391424832506223,2.1058736511723648E-2,0.15719304020188454,2,47.541666999999997,47.541666999999997,0.79166667000000002,0.79166667000000002,3,354.875,354.875,0.91666667000000002,0.91666667000000002]
[null,"CN32","BAROSSA/MID NORTH & YORKE PENINSULA/RIVE","Rural Long",53,26.617489999999997,1.6042400000000001,null,1.3122495298078005E-2,0.27992800760150088,2,13.415099,13.415099,5.6603790000000001E-2,5.6603790000000001E-2,3,286.16981099999998,286.16981099999998,0.69811321000000004,0.69811321000000004]
[null,"CN33","BAROSSA/MID NORTH & YORKE PENINSULA/RIVE","Rural Long",37,31.983799999999999,5.45E-3,null,0.10012589445758174,0.26477531463381893,5,146.621622,146.621622,0.54054053999999996,0.54054053999999996,2,387.72973000000002,387.72973000000002,0.94594595000000004,0.94594595000000004]
[null,"CN41","BAROSSA/MID NORTH & YORKE PENINSULA/RIVE","Rural Long",41,20.764039999999998,1.9269999999999999E-2,0.23625173015239487,0.14611920855680641,0.27885753720914336,1,193.09756100000001,193.09756100000001,0.70731706999999999,0.70731706999999999,1,368.51219500000002,368.51219500000002,0.70731706999999999,0.70731706999999999]
[null,"CN42","BAROSSA/MID NORTH & YORKE PENINSULA/RIVE","Rural Long",114,39.38438,0.19441,1.2231742803051411,7.7332257654795858E-3,0.98852403818397749,1,3.6754389999999999,3.6754389999999999,8.7719300000000007E-3,8.7719300000000007E-3,1,469.82456100000002,469.82456100000002,0.90350876999999996,0.90350876999999996]
[null,"CN43","BAROSSA/MID NORTH & YORKE PENINSULA/RIVE","Rural Long",41,22.420470000000002,null,0.14479944751275814,0,0.19157728745985228,null,null,null,null,null,1,253.17073199999999,253.17073199999999,0.48780488,0.48780488]
[null,"CN52","BAROSSA/MID NORTH & YORKE PENINSULA/RIVE","Rural Long",103,112.72438000000001,null,null,0.55186440003247039,1.9563769239638092E-3,2,290.300971,290.300971,0.88349515000000001,0.88349515000000001,2,1.029126,1.029126,1.9417480000000001E-2,1.9417480000000001E-2]
[null,"CN53","BAROSSA/MID NORTH & YORKE PENINSULA/RIVE","Rural Long",106.5,119.86538,5.373E-2,null,2.9714781580959747E-3,0.19604373289003379,2,1.5117370000000001,1.5117370000000001,2.8169010000000001E-2,2.8169010000000001E-2,5,99.737088999999997,99.737088999999997,0.62910798000000001,0.62910798000000001]
[null,"CN61","BAROSSA/MID NORTH & YORKE PENINSULA/RIVE","Rural Long",50,25.268180000000001,0.92832999999999999,null,3.408276352029025E-2,0,3,36.933301,36.933301,0.12666656000000001,0.12666656000000001]
[null,"CN71","SOUTH EAST","Rural Long",240,11.167770000000001,0.51351999999999998,null,0,8.4899375945599268E-3,null,null,null,null,null,1,1.9166669999999999,1.9166669999999999,0.95833332999999998,0.95833332999999998]
[null,"CN72","SOUTH EAST","Rural Long",17,10.67934,null,null,0,6.2751712655442933E-4,null,null,null,null,null,1,2,2,1,1]
[null,"CN74","SOUTH EAST","Rural Long",98.5,93.144050000000007,0.22334000000000001,null,7.9473198439510964E-2,3.4698005821244917E-3,2,43.715736,43.715736,0.64974619,0.64974619,1,1.9086289999999999,1.9086289999999999,0.95431471999999995,0.95431471999999995]
[null,"CN75","SOUTH EAST","Rural Long",61,66.830240000000003,1.33738,null,0.64195002046518124,2.1040280125648515E-3,2,570.19672100000003,564.59016399999996,0.96721310999999999,0.91803279000000004,1,1.868852,1.868852,0.93442623000000002,0.93442623000000002]
[null,"CN76","SOUTH EAST","Rural Long",75,76.662399999999991,5.6770000000000001E-2,null,0,7.7959774781350286E-2,null,null,null,null,null,2,56.32,56.32,0.21333332999999999,0.21333332999999999]
[null,"CN77","SOUTH EAST","Rural Long",76,99.794060000000002,5.9650000000000002E-2,null,0,6.0204731377074959E-2,null,null,null,null,null,3,42.921053000000001,42.921053000000001,1.75,1.75]
[null,"CN81","BAROSSA/MID NORTH & YORKE PENINSULA/RIVE","Rural Long",191.5,16.112489999999998,4.5229999999999999E-2,0.3591026298316401,0.15521821885158382,0.54915131127942629,3,43.916452,43.916452,0.13054832,0.13054832,1,155.373368,155.373368,0.89295038999999998,0.89295038999999998]
[null,"CN83","BAROSSA/MID NORTH & YORKE PENINSULA/RIVE","Rural Long",105,102.12692,0.15444999999999998,null,0.60387449599218757,0.30665285463828956,9,311.60952400000002,311.60952400000002,1.5047619000000001,1.5047619000000001,2,158.23809499999999,158.23809499999999,0.91428571000000003,0.91428571000000003]
[null,"CV01","UPPER NORTH/EYRE PENINSULA","Rural Short",463,5.1332899999999997,1.1625999999999999,1.1622060918787165,3.2262550796254117E-3,0.17107371680179331,1,0.33909299999999998,0.33909299999999998,2.1598300000000002E-3,2.1598300000000002E-3,1,17.980561999999999,17.980561999999999,5.3995679999999997E-2,5.3995679999999997E-2]
[null,"CV02","UPPER NORTH/EYRE PENINSULA","Rural Long",80.5,23.757210000000004,0.14731,1.4003630779194374,3.3406058795985797E-3,0.14224336748102903,1,2.2484470000000001,2.2484470000000001,1.242236E-2,1.242236E-2,2,95.739130000000003,95.739130000000003,0.68322981000000005,0.68322981000000005]
[null,"CV04","UPPER NORTH/EYRE PENINSULA","Rural Short",34,14.53951,0.17355000000000001,null,0,4.3153730364416335E-3,null,null,null,null,null,1,6.1764710000000003,6.1764710000000003,2.9411759999999999E-2,2.9411759999999999E-2]
[null,"CV08","UPPER NORTH/EYRE PENINSULA","Rural Long",529.5,53.322960000000009,0.71986000000000006,2.0576763593918259,5.5446121355324118,0.2028172265796066,5,567.35977300000002,567.35977300000002,2.3814919699999999,2.3814919699999999,1,20.753540999999998,20.753540999999998,6.2322950000000002E-2,6.2322950000000002E-2]
[null,"CV09","UPPER NORTH/EYRE PENINSULA","Rural Long",4,7.3316600000000003,null,0.19814661238587952,2.9530217720208444E-4,0,1,4,4,1,1]
[null,"CV15","UPPER NORTH/EYRE PENINSULA","Rural Long",65,100.67371,null,null,2.4369996737462767,9.9166162381674972E-2,6,2031.4,2031.4,2.6307692299999998,2.6307692299999998,5,82.661537999999993,82.661537999999993,0.96923077000000002,0.96923077000000002]
[null,"CV16","UPPER NORTH/EYRE PENINSULA","Rural Long",61,91.693640000000002,null,null,1.7483549965110157,0,2,1552.934426,1552.934426,1.47540984,1.47540984]
[null,"CV17","UPPER NORTH/EYRE PENINSULA","Rural Long",50,78.068269999999998,null,null,2.6632749670273737,1.2956383024741452E-2,2,2886.02,2886.02,1.88,1.88,1,14.04,14.04,0.18,0.18]
[null,"CV18","UPPER NORTH/EYRE PENINSULA","Rural Short",80.5,108.35907,6.3539999999999999E-2,null,0.80917354312362955,8.8650091805758127E-2,2,489.15528,489.15528,0.52173913000000005,0.52173913000000005,2,53.590062000000003,53.590062000000003,0.37267081000000002,0.37267081000000002]
[null,"CV19","UPPER NORTH/EYRE PENINSULA","Rural Long",72.5,100.07006,null,null,2.3010683903029423,0,5,1719.668966,1714.5931029999999,1.36551724,1.33793103]
[null,"CV20","UPPER NORTH/EYRE PENINSULA","Rural Long",46,79.528729999999996,0.10235,null,0.94182938141389794,7.7276888496570467E-2,7,1109.3478259999999,1109.3478259999999,2.7391304299999999,2.7391304299999999,2,91.021738999999997,91.021738999999997,0.67391303999999996,0.67391303999999996]
[null,"CV21","UPPER NORTH/EYRE PENINSULA","Rural Long",70.5,105.16551,null,null,0.9841498746841717,1.1904369018459029E-2,5,756.35460999999998,756.35460999999998,1.7588652499999999,1.7588652499999999,1,9.1489360000000008,9.1489360000000008,4.2553189999999998E-2,4.2553189999999998E-2]
[null,"CV22","UPPER NORTH/EYRE PENINSULA","Rural Long",51,66.090220000000002,0.54051000000000005,null,0.83334274406428221,4.2818815694302239E-3,6,885.33333300000004,787.45097999999996,2.4509803899999998,1.50980392,1,4.5490199999999996,4.5490199999999996,7.843137E-2,7.843137E-2]
[null,"CV23","UPPER NORTH/EYRE PENINSULA","Rural Long",77.5,169.85570999999999,null,null,0.94402569135683856,2.2885918733161544E-2,6,659.98709699999995,564.70967700000006,1.88387097,0.96774194000000002,2,16,16,0.10322581,0.10322581]
[null,"CV24","UPPER NORTH/EYRE PENINSULA","Rural Long",85,110.35325,2.3550000000000001E-2,null,0.28555720489300601,0,4,182.023529,89.035293999999993,1.0235293999999999,0.12941174999999999]
[null,"CV25","UPPER NORTH/EYRE PENINSULA","Rural Long",69.5,112.87589999999999,8.3819999999999992E-2,null,1.0228160035115696,3.2114111770726678E-2,7,797.38129500000002,703.10791400000005,3.8561151100000002,2.9496402900000001,3,25.035971,25.035971,0.23021583000000001,0.23021583000000001]
[null,"CV26","UPPER NORTH/EYRE PENINSULA","Rural Long",67,55.610579999999999,null,null,0.12284570571606712,2.015437359404226E-2,1,99.343283999999997,null,0.95522388000000003,null,4,16.298507000000001,16.298507000000001,0.16417909999999999,0.16417909999999999]
[null,"CV28","UPPER NORTH/EYRE PENINSULA","Rural Long",90.5,156.31254000000001,null,null,7.3388681642122773,8.2979911793785721E-2,6,4393.7348069999998,4393.7348069999998,3.8784530400000001,3.8784530400000001,6,49.679558,49.679558,1.1491712700000001,1.1491712700000001]
[null,"CV29","UPPER NORTH/EYRE PENINSULA","Rural Long",113,186.78289999999998,null,null,5.3855734567230149,0.13247993924728513,8,2582.3008850000001,2582.3008850000001,3.9203539799999998,3.9203539799999998,3,63.522123999999998,63.522123999999998,0.30973451000000002,0.30973451000000002]
[null,"CV30","UPPER NORTH/EYRE PENINSULA","Rural Long",96,124.82262,null,null,4.4406987716067201,1.3657725695596405E-3,8,2506.302083,2506.302083,3.4583333299999999,3.4583333299999999,1,0.77083299999999999,0.77083299999999999,1.0416669999999999E-2,1.0416669999999999E-2]
[null,"CV31","UPPER NORTH/EYRE PENINSULA","Rural Long",67.5,107.44396,null,null,3.4765187066558392,0.21503535416134284,10,2790.5777779999999,2790.5777779999999,6.9185185200000001,6.9185185200000001,1,172.60740699999999,172.60740699999999,0.9037037,0.9037037]
[null,"CV32","UPPER NORTH/EYRE PENINSULA","Rural Long",76,137.11586,null,null,1.8109959708500081,0.37019819189496306,3,1291.0921049999999,1291.0921049999999,2.5789473699999999,2.5789473699999999,2,263.92105299999997,263.92105299999997,1.48684211,1.48684211]
[null,"CV33","UPPER NORTH/EYRE PENINSULA","Rural Long",44,72.022710000000004,null,null,2.2196388149394677,0.17417291539100441,5,2733.272727,2733.272727,4.3863636399999999,4.3863636399999999,5,214.477273,214.477273,2.0909090899999998,2.0909090899999998]
[null,"CV34","UPPER NORTH/EYRE PENINSULA","Rural Long",18,25.437069999999999,null,null,0.15999841088530437,0,3,481.61111099999999,377.61111099999999,3,2]
[null,"CV753A","UPPER NORTH/EYRE PENINSULA","Rural Long",764.5,26.878540000000001,0.56415999999999999,2.0786341741634096,1.92166649012896,0.2040907172187906,8,136.19271000000001,34.981461000000003,1.11140174,0.13821665,2,14.464356,14.464356,8.3714849999999993E-2,8.3714849999999993E-2]
[null,"CV757A","UPPER NORTH/EYRE PENINSULA","Rural Long",255,12.008229999999999,1.37171,0.72590249345211644,2.0560414087695128E-2,0.38791632252708813,1,4.368627,4.368627,3.9215700000000001E-3,3.9215700000000001E-3,3,82.423529000000002,82.423529000000002,0.98039215999999996,0.98039215999999996]
[null,"EL01A","MAJOR METROPOLITAN AREAS","Urban",773.5,null,5.124528744,null,1.8937865882300762,0.81130449570818874,3,106.596861,24.399059000000001,2.45076524,1.4837322799999999,3,45.666451000000002,45.666451000000002,0.99418229000000002,0.99418229000000002]
[null,"EL01B","MAJOR METROPOLITAN AREAS","Urban",482,null,3.0525600000000002,null,0.95582019049617162,0,3,86.338173999999995,0.60165999999999997,0.98962656000000004,4.1493800000000003E-3]
[null,"EL01C","MAJOR METROPOLITAN AREAS","Urban",543.5,null,2.8729899999999997,null,1.2134388618785263,1.5199412934344505,5,97.205770999999999,12.846985999999999,1.1284882700000001,0.15884706000000001,2,121.75897000000001,121.75897000000001,0.32382705000000001,0.32382705000000001]
[null,"EL01E","MAJOR METROPOLITAN AREAS","Urban",78.5,2.0627267429999998,0.77112999999999998,null,0.16693262392229188,0.24309505938271012,2,92.585987000000003,12.611465000000001,0.96815287000000005,3.8216559999999997E-2,2,134.828025,134.828025,0.54777070000000005,0.54777070000000005]
[null,"EL01L","MAJOR METROPOLITAN AREAS","Urban",1101,null,6.0571099999999998,null,3.9717618288247758,3.8552983841293864,13,157.061441,157.061441,1.2158643,1.2158643,8,152.455949,152.455949,1.2597638499999999,1.2597638499999999]
[null,"EL01M","MAJOR METROPOLITAN AREAS","Urban",690,null,4.5630916199999998,null,0.55488784234513588,0.5830239028128037,12,35.013039999999997,35.013039999999997,1.01304346,1.01304346,2,36.788406000000002,36.788406000000002,0.22028986,0.22028986]
[null,"EL01N","MAJOR METROPOLITAN AREAS","Urban",961,null,7.3944094379999994,null,3.2147774215112689E-2,3.9573918779838975,10,1.456469,1.456469,4.8560489999999998E-2,4.8560489999999998E-2,9,179.29136299999999,179.29136299999999,0.61394380999999998,0.61394380999999998]
[null,"EL01P","MAJOR METROPOLITAN AREAS","Urban",567,null,6.33657,null,0.56807138488294806,0.40986690614932564,5,43.620792999999999,43.620792999999999,0.25044082000000001,0.25044082000000001,1,31.472663000000001,31.472663000000001,0.14638448000000001,0.14638448000000001]
[null,"EL01Q","MAJOR METROPOLITAN AREAS","Urban",1022,null,11.186178125,null,0.22975055546156928,4.0593016265176356,5,9.7876709999999996,9.7876709999999996,8.51272E-2,8.51272E-2,8,172.93150700000001,172.93150700000001,0.74070449999999999,0.74070449999999999]
[null,"EL01R","MAJOR METROPOLITAN AREAS","Urban",1055.5,null,6.6934169069999996,null,0.19996859570887304,0.58954686170024606,4,8.2485429999999997,8.2485429999999997,5.3371259999999997E-2,5.3371259999999997E-2,3,24.318332999999999,24.318332999999999,0.28043581000000001,0.28043581000000001]
[null,"EL01X","MAJOR METROPOLITAN AREAS","Urban",61,null,2.7305924099999999,null,6.4310797959695968E-3,4.3409832032626806E-3,2,4.5901589999999999,4.5901589999999999,7.650266E-2,7.650266E-2,1,3.0983610000000001,3.0983610000000001,0.1147541,0.1147541]
[null,"EL01Z","MAJOR METROPOLITAN AREAS","Urban",748,null,5.8154451410000005,null,0.14791498322228391,9.3939795245208277E-2,1,8.6096260000000004,8.6096260000000004,0.12299465,0.12299465,2,5.4679140000000004,5.4679140000000004,1.3368980000000001E-2,1.3368980000000001E-2]
[null,"EL02","MAJOR METROPOLITAN AREAS","Urban",1366.5,14.148691463,5.6111100000000009,3.981984806600849,1.663124834646829,2.9392590555805742,9,52.989389000000003,52.989389000000003,1.0925722600000001,1.0925722600000001,10,93.648737999999994,93.648737999999994,0.39736553000000002,0.39736553000000002]
[null,"EL03","MAJOR METROPOLITAN AREAS","Urban",1458,8.2840263539999999,4.8767399999999999,4.572614131981835,0.55491086873453099,4.1870275926199838,7,16.570644999999999,16.570644999999999,9.1220850000000006E-2,9.1220850000000006E-2,18,125.032236,125.032236,0.59533608000000005,0.59533608000000005]
[null,"EL04","MAJOR METROPOLITAN AREAS","Urban",63,3.0751286099999997,1.0423199999999999,5.410926722845173,0,9.9957454500524803E-2,null,null,null,null,null,5,69.079364999999996,69.079364999999996,0.33333332999999998,0.33333332999999998]
[null,"EL06H10","MAJOR METROPOLITAN AREAS","Urban",1,null,1.3064970140000001,null,3.4796770121391325E-2,0,1,1515,1515,1,1]
[null,"EL07","MAJOR METROPOLITAN AREAS","Urban",1119,2.7533512259999999,7.0665200000000006,null,3.8914273078263819,4.6996770375767198,6,151.40929399999999,151.40929399999999,0.95889186999999998,0.95889186999999998,2,182.85701499999999,182.85701499999999,0.96961573000000001,0.96961573000000001]
[null,"EL08D","MAJOR METROPOLITAN AREAS","Urban",166.5,null,2.9392900000000002,null,0.14286198690102578,0.52918652382630771,1,37.357357,37.357357,0.12012012,0.12012012,3,138.378378,138.378378,0.78078077999999995,0.78078077999999995]
[null,"EL08G","MAJOR METROPOLITAN AREAS","Urban",651.5,null,3.8192399999999997,null,1.3296959819390815,1.0743129542296752,6,88.861090000000004,4.115119,1.0115118999999999,2.609363E-2,5,71.794320999999997,71.794320999999997,1.14351497,1.14351497]
[null,"EL09","MAJOR METROPOLITAN AREAS","Urban",2446.5,10.709670456,24.998900256000002,6.382607225891312,2.2565301961488964,1.0779648924800391,11,40.157774000000003,40.157774000000003,1.4503712600000001,1.4503712600000001,6,19.183731999999999,19.183731999999999,0.12425915,0.12425915]
[null,"EL10","MAJOR METROPOLITAN AREAS","Urban",2201.5,5.4238763319999999,22.041706566000002,5.3156639284288838,13.606103693174752,8.4959702055728687,17,269.084564,269.084564,4.1450526200000004,4.1450526200000004,26,168.02271200000001,168.02271200000001,1.34044969,1.34044969]
[null,"EL11","MAJOR METROPOLITAN AREAS","Urban",2112,61.404351669999997,23.209508351,7.3161826111709383,0.92778368101538689,0.17965698738582375,14,19.126104000000002,19.126104000000002,0.55934342000000004,0.55934342000000004,10,3.7035979999999999,3.7035979999999999,2.6041669999999999E-2,2.6041669999999999E-2]
[null,"EL12","MAJOR METROPOLITAN AREAS","Urban",335.5,60.363385209,3.8153932930000001,null,0.29638120376200872,1.5808298991056111,8,38.461996999999997,38.461996999999997,2.3298559399999998,2.3298559399999998,6,205.14754099999999,205.14754099999999,0.79582712,0.79582712]
[null,"EL13","MAJOR METROPOLITAN AREAS","Urban",2162,6.4143265760000006,23.212651146999999,8.0592324076179853,12.977495611061816,1.8290009229746762,6,261.341813,261.341813,1.9375578200000001,1.9375578200000001,10,36.832562000000003,36.832562000000003,0.19750230999999999,0.19750230999999999]
[null,"EL14","MAJOR METROPOLITAN AREAS","Urban",1629.5,3.1552273039999998,10.650459999999999,3.4294605989863771,3.9301286472721779,0.8355818462153245,9,105.008898,105.008898,2.1933108200000002,2.1933108200000002,5,22.325866999999999,22.325866999999999,0.22092666,0.22092666]
[null,"EL15","MAJOR METROPOLITAN AREAS","Urban",408,39.393073466000004,5.8723599999999996,4.1981094135489698,1.8265662974744337,0,6,194.91666699999999,82.759804000000003,1.9117647099999999,1.04901961]
[null,"EL16","MAJOR METROPOLITAN AREAS","Urban",278,24.906508417000001,1.45261,3.5354823734040406,3.4011105778485393,0.42488808612252027,13,532.65947300000005,532.65947300000005,3.5455635499999998,3.5455635499999998,10,66.543165000000002,41.140287999999998,0.42086330999999999,0.30215827000000001]
[null,"EL17","MAJOR METROPOLITAN AREAS","Urban",915.5,32.682806100000001,8.7197899999999997,3.8555158259896731,12.276507234178425,0.12503869078604252,12,583.83506399999999,583.83506399999999,5.7844529400000004,5.7844529400000004,4,5.9464769999999998,5.9464769999999998,2.0753690000000002E-2,2.0753690000000002E-2]
[null,"EL18","MAJOR METROPOLITAN AREAS","Urban",2773,5.4847553470000001,29.829519505,6.992289110155558,0.12790196104549079,6.1966961022447347,11,2.0081730000000002,2.0081730000000002,1.286211E-2,1.286211E-2,11,97.293544999999995,97.293544999999995,0.74720518999999996,0.74720518999999996]
[null,"EL19","MAJOR METROPOLITAN AREAS","Urban",414.5,50.843912106999994,2.3726599999999998,2.819778714722132,2.066262068422843,3.0353578583448657,8,217.03739400000001,217.03739400000001,0.92400483,0.92400483,13,318.82991600000003,318.82991600000003,1.00361882,1.00361882]
[null,"EL20","MAJOR METROPOLITAN AREAS","Urban",644,35.620347197000001,4.7214999999999998,3.5247233934026654,4.3305480810404715,1.2678656814989591,10,292.77278000000001,207.20807300000001,3.3793995799999998,2.8043477999999999,19,85.715839000000003,85.715839000000003,0.53260870000000005,0.53260870000000005]
[null,"EL22","MAJOR METROPOLITAN AREAS","Urban",6,1.3000298929999998,2.7743099999999998,2.2863070659909175,0,9.6466293405837354E-4,null,null,null,null,null,1,7,7,0.16666666999999999,0.16666666999999999]
[null,"EL23","MAJOR METROPOLITAN AREAS","Urban",571.5,18.634644526999999,6.0567399999999996,2.7763350699565277,4.9558410208657886,1.5111215180373454,15,377.55030900000003,377.55030900000003,4.7967337600000004,4.7967337600000004,20,115.12161,115.12161,0.54243220000000003,0.54243220000000003]
[null,"EL25","MAJOR METROPOLITAN AREAS","Urban",1730.5,2.856392547,27.839258683000001,5.3918741639619148,0.16403863512011674,1.8129232074070365,4,4.1271310000000003,4.1271310000000003,9.0725219999999995E-2,9.0725219999999995E-2,17,45.612251000000001,45.612251000000001,0.33689685000000003,0.33689685000000003]
[null,"EL260A","MAJOR METROPOLITAN AREAS","Urban",2033.5,13.942882849,15.32715,6.0206086071094171,12.447298487971256,1.9665802319034777,7,266.504549,195.72510399999999,3.88394394,2.92746496,4,42.105728999999997,42.105728999999997,0.13375952999999999,0.13375952999999999]
[null,"EL260B","MAJOR METROPOLITAN AREAS","Urban",2142,2.928555335,24.431459999999998,5.5061895172614603,3.0531658004252269,1.477381283510399,6,62.058978000000003,62.058978000000003,1.0242763699999999,1.0242763699999999,10,30.029412000000001,30.029412000000001,0.53688142000000005,0.53688142000000005]
[null,"EL260C","MAJOR METROPOLITAN AREAS","Urban",1646,8.5303076249999989,9.5765899999999995,4.3249308664994865,2.6174520944117199,1.8252800802290226,7,69.234508000000005,69.234508000000005,0.97752125999999995,0.97752125999999995,10,48.280679999999997,48.280679999999997,0.21445929999999999,0.21445929999999999]
[null,"G01","UPPER NORTH/EYRE PENINSULA","Rural Long",232,3.7937800000000004,null,null,4.3372507276556145E-3,0.1352114843864044,2,1.012931,1.012931,8.6206900000000003E-3,8.6206900000000003E-3,1,31.577586,31.577586,7.7586210000000003E-2,7.7586210000000003E-2]
[null,"G02","UPPER NORTH/EYRE PENINSULA","Rural Long",940,18.735232818,0.62182000000000004,2.4768326548234945,1.9819759314500149,0.63870169651595832,5,114.241489,114.241489,1.03297872,1.03297872,2,36.814894000000002,36.814894000000002,0.14893617000000001,0.14893617000000001]
[null,"G03","UPPER NORTH/EYRE PENINSULA","Rural Long",234.5,4.5716100000000006,0.13569999999999999,0.62682918725917658,1.3832628576006354,0,5,319.60620499999999,319.60620499999999,1.0319828799999999,1.0319828799999999]
[null,"G04","UPPER NORTH/EYRE PENINSULA","Rural Long",86,33.890749999999997,0.98071000000000008,0.4953665309646989,0.25710976540922953,0,3,161.984498,161.984498,0.97286823,0.97286823]
[null,"G05","UPPER NORTH/EYRE PENINSULA","Rural Long",560,40.27460585,0.50552999999999992,null,5.7620591299792761,0,5,557.49761999999998,557.49761999999998,1.9315476300000001,1.9315476300000001]
[null,"G06","UPPER NORTH/EYRE PENINSULA","Rural Long",71,57.084519999999998,null,null,0.77476217466181874,0.2092215925476768,3,591.23943699999995,591.23943699999995,1.7887323900000001,1.7887323900000001,2,159.66197199999999,159.66197199999999,1.8169014100000001,1.8169014100000001]
[null,"G07","UPPER NORTH/EYRE PENINSULA","Rural Long",93.5,67.0154,null,null,0,1.5134236581606827E-2,null,null,null,null,null,3,8.7700530000000008,8.7700530000000008,5.347594E-2,5.347594E-2]
[null,"G08","UPPER NORTH/EYRE PENINSULA","Rural Long",82,52.921289999999999,null,null,0.14689437677196185,0.11601684286826891,2,97.060975999999997,97.060975999999997,0.35365854000000002,0.35365854000000002,5,76.658536999999995,76.658536999999995,0.48780488,0.48780488]
[null,"G09","UPPER NORTH/EYRE PENINSULA","Rural Long",66,74.673550000000006,2.581E-2,null,1.5755293973034961,0.37167470278097353,3,1293.409091,1293.409091,2.6363636399999999,2.6363636399999999,7,305.12121200000001,305.12121200000001,2.1969696999999999,2.1969696999999999]
[null,"G10","UPPER NORTH/EYRE PENINSULA","Rural Long",79,108.93300000000001,null,null,0.35786932599677607,0,1,245.443038,245.443038,0.88607594999999995,0.88607594999999995]
[null,"G11","UPPER NORTH/EYRE PENINSULA","Rural Long",127,114.8626,null,null,2.032029650485768,0.30886762096730513,6,866.92125999999996,866.92125999999996,1.36220472,1.36220472,3,131.77165400000001,131.77165400000001,1.03149606,1.03149606]
[null,"G12","UPPER NORTH/EYRE PENINSULA","Rural Long",72,108.9425,null,null,0.36146832128142642,0.35530388833233295,3,272.01388900000001,272.01388900000001,1,1,2,267.375,267.375,1.9166666699999999,1.9166666699999999]
[null,"G13","UPPER NORTH/EYRE PENINSULA","Rural Long",115,106.91527000000001,null,null,0.69150541707690605,0.19890447273167897,5,325.8,325.8,1.86086957,1.86086957,7,93.713042999999999,93.713042999999999,0.88695652000000003,0.88695652000000003]
[null,"G14","UPPER NORTH/EYRE PENINSULA","Rural Long",109.5,125.04255000000001,0.19522,null,3.3041729734862724,0.25661759198861134,4,1634.9406389999999,1634.9406389999999,2.7488584500000002,2.7488584500000002,4,126.977169,126.977169,1.4155251099999999,1.4155251099999999]
[null,"G15","UPPER NORTH/EYRE PENINSULA","Rural Long",102,108.57803999999999,0.29674,null,2.3788805139956914,1.011409956917139E-2,6,1263.6470589999999,1263.6470589999999,2.8725490200000001,2.8725490200000001,2,5.3725490000000002,5.3725490000000002,1.9607840000000001E-2,1.9607840000000001E-2]
[null,"G16","UPPER NORTH/EYRE PENINSULA","Rural Long",64,47.826519999999995,0.28060000000000002,null,0.94636965238838,0.11424502980505641,5,801.1875,801.1875,2.9375,2.9375,2,96.71875,96.71875,0.9375,0.9375]
[null,"G17","UPPER NORTH/EYRE PENINSULA","Rural Long",404,28.863040000000002,1.5130000000000001E-2,null,2.3783637470345877,1.216405037053611,6,318.97029900000001,318.97029900000001,1.0940594100000001,1.0940594100000001,2,163.13613900000001,163.13613900000001,0.96534653000000004,0.96534653000000004]
[null,"G18","UPPER NORTH/EYRE PENINSULA","Rural Long",87,104.5907,null,null,0.34849348187060986,2.0192393749357027,3,217.03448299999999,217.03448299999999,0.95402299000000002,0.95402299000000002,10,1257.5402300000001,1257.5402300000001,2.9310344800000001,2.9310344800000001]
[null,"G20","UPPER NORTH/EYRE PENINSULA","Rural Long",116,125.41784,0.30517,null,0.55166137978564389,6.2567148794691633E-3,3,257.672414,257.672414,0.87931033999999997,0.87931033999999997,3,2.9224139999999998,2.9224139999999998,0.15517241000000001,0.15517241000000001]
[null,"G21","UPPER NORTH/EYRE PENINSULA","Rural Long",69,45.267060000000001,null,null,0.80396017743267478,0.23162764524288496,2,631.304348,631.304348,1.91304348,1.91304348,1,181.88405800000001,181.88405800000001,0.72463767999999995,0.72463767999999995]
[null,"G22","UPPER NORTH/EYRE PENINSULA","Rural Long",93.5,6.6271700000000004,null,null,0.45805065236429582,0.16507391705596519,3,265.43319100000002,265.43319100000002,1.58288797,1.58288797,1,95.657753999999997,95.657753999999997,0.91978610000000005,0.91978610000000005]
[null,"G23","UPPER NORTH/EYRE PENINSULA","Rural Long",115.5,116.39077,0.27648,null,2.9550150617169582,0.37699014197061104,3,1386.2164499999999,1386.2164499999999,1.87012987,1.87012987,4,176.84848500000001,176.84848500000001,1.79220779,1.79220779]
[null,"G24","UPPER NORTH/EYRE PENINSULA","Rural Long",49,7.3478900000000005,0.13427,0.19243084472090222,8.8627565932775598E-2,0,1,98,98,1,1]
[null,"G25","UPPER NORTH/EYRE PENINSULA","Rural Long",33,100.31438,1.4299999999999998E-3,null,3.3648760272873761,0.25006557493194009,8,5524.69697,5524.69697,7.3333333300000003,7.3333333300000003,5,410.57575800000001,410.57575800000001,3.0909090899999998,3.0909090899999998]
[null,"G27","UPPER NORTH/EYRE PENINSULA","Rural Long",4,2.4159499999999996,null,null,9.744971847668786E-2,0,2,1320,1320,2,2]
[null,"G28","UPPER NORTH/EYRE PENINSULA","Rural Long",112.5,101.25605,0.33121,null,0,8.1927897787503298E-2,null,null,null,null,null,3,39.457777999999998,39.457777999999998,0.20444444000000001,0.20444444000000001]
[null,"G29","UPPER NORTH/EYRE PENINSULA","Rural Long",81,189.52417000000003,null,null,4.5248968048814637,0.51229390828739108,8,3026.7530860000002,3026.7530860000002,3.5802469100000001,3.5802469100000001,5,342.679012,342.679012,1.88888889,1.88888889]
[null,"G30","UPPER NORTH/EYRE PENINSULA","Rural Long",16,11.233030000000001,0.26017000000000001,null,2.3513435859715971E-2,0,1,79.625,79.625,0.8125,0.8125]
[null,"G31","UPPER NORTH/EYRE PENINSULA","Rural Long",121,149.49611999999999,0.17335,null,1.3891568107168304,1.6027525667643132,2,622.04132200000004,622.04132200000004,1.8264462800000001,1.8264462800000001,4,717.68595000000005,717.68595000000005,3.6528925600000002,3.6528925600000002]
[null,"G32","UPPER NORTH/EYRE PENINSULA","Rural Long",104,111.29438852,6.6180000000000003E-2,null,1.0013143137340428,2.399330189766936E-3,4,521.66346199999998,521.66346199999998,1.9711538500000001,1.9711538500000001,2,1.25,1.25,2.8846150000000001E-2,2.8846150000000001E-2]
[null,"G34","UPPER NORTH/EYRE PENINSULA","Rural Long",79.5,26.858464642000001,0.19333,null,2.1335582302850598E-2,0.32739783258673599,2,14.540881000000001,14.540881000000001,0.15094340000000001,0.15094340000000001,1,223.13207499999999,223.13207499999999,0.91823898999999998,0.91823898999999998]
[null,"G35","UPPER NORTH/EYRE PENINSULA","Rural Long",144.5,3.5413299999999999,null,null,0.79892158403416424,0,1,299.56401399999999,299.56401399999999,0.97577855000000002,0.97577855000000002]
[null,"G36","UPPER NORTH/EYRE PENINSULA","Rural Long",73,121.84399999999999,null,null,1.9387879880342103,5.0201370124354348E-2,2,1439,1439,1.8356164399999999,1.8356164399999999,1,37.260274000000003,37.260274000000003,0.46575341999999997,0.46575341999999997]
[null,"G37","UPPER NORTH/EYRE PENINSULA","Rural Long",6,1.9447999999999999,null,null,3.067451365686652E-2,0,1,277,277,1,1]
[null,"G38","UPPER NORTH/EYRE PENINSULA","Rural Long",82.5,65.672550000000001,1.00637,null,0.45607575630254427,5.5590634858292388E-2,3,299.52727299999998,299.52727299999998,1.00606061,1.00606061,6,36.509090999999998,36.509090999999998,0.50909090999999995,0.50909090999999995]
[null,"G40","UPPER NORTH/EYRE PENINSULA","Rural Long",454,17.79787,0.18265000000000001,null,0.79081923054718206,0.79109607633830892,3,94.378855000000001,94.378855000000001,0.95814977999999995,0.95814977999999995,3,94.411894000000004,94.411894000000004,1.8920704800000001,1.8920704800000001]
[null,"G41","UPPER NORTH/EYRE PENINSULA","Rural Long",683,11.358549999999999,0.24931,null,3.3304364108711835,1.3825494245019339,3,264.20058599999999,264.20058599999999,1.87408492,1.87408492,4,109.676428,109.676428,0.99560760999999998,0.99560760999999998]
[null,"G42","UPPER NORTH/EYRE PENINSULA","Rural Long",51,116.49808,null,null,8.5010114262050046E-2,0.16132727068271374,1,90.313725000000005,90.313725000000005,0.92156863,0.92156863,4,171.392157,171.392157,2.90196078,2.90196078]
[null,"G43","UPPER NORTH/EYRE PENINSULA","Rural Long",53,2.3297300000000001,null,null,8.3201388426687298E-2,0,1,85.056603999999993,85.056603999999993,0.86792453000000003,0.86792453000000003]
[null,"GA01","MAJOR METROPOLITAN AREAS","Urban",1836.5,10.102770784000001,8.1398432780000007,6.992289110155558,0.64271809095204735,1.2201837707583594,9,15.237133999999999,14.585350999999999,1.02695344,1.0264089300000001,8,28.927306999999999,28.927306999999999,0.15845358000000001,0.15845358000000001]
[null,"GA02","MAJOR METROPOLITAN AREAS","Rural Short",1616.5,33.560428275999996,12.279907166999999,5.1209963132950875,0.38006092367578836,0.75736851729091836,7,11.441381,11.441381,1.0976389200000001,1.0976389200000001,6,22.799876000000001,22.799876000000001,0.10021652,0.10021652]
[null,"GA03","BAROSSA/MID NORTH & YORKE PENINSULA/RIVE","Rural Long",262,66.140539999999987,5.0580599999999993,0.74304979644704838,1.5428062301446419,0,4,319.05343599999998,319.05343599999998,1.9529262199999999,1.9529262199999999]
[null,"GA04","BAROSSA/MID NORTH & YORKE PENINSULA/RIVE","Rural Long",35,18.515790000000003,null,null,1.661609982234749,9.90000549069988E-2,5,2572.2571429999998,1334.6571429999999,4.8285716000000001,3.85714303,2,153.25714300000001,153.25714300000001,0.8,0.8]
[null,"GA05","BAROSSA/MID NORTH & YORKE PENINSULA/RIVE","Rural Short",405,30.488659999999999,13.647969999999999,1.6385200639601578,1.9820508356376423,0.17471095978965126,4,238.15555599999999,223.758025,1.2074074100000001,1.0864197499999999,5,20.992592999999999,20.992592999999999,4.6913580000000003E-2,4.6913580000000003E-2]
[null,"GA07","BAROSSA/MID NORTH & YORKE PENINSULA/RIVE","Rural Long",52.5,24.859810000000003,0.52916999999999992,null,1.4456518084928043,0.83823368637419171,2,1491.9619049999999,0.30476199999999998,1.0095238099999999,1.9047620000000001E-2,4,865.08571400000005,865.08571400000005,2.6857142899999999,2.6857142899999999]
[null,"GA08","BAROSSA/MID NORTH & YORKE PENINSULA/RIVE","Rural Long",869.5,23.005360734,9.1936199720000005,2.4958852137067522,12.269128639015525,1.0817472442494604,7,764.535168,764.535168,3.6450066900000002,3.6450066900000002,8,67.407706000000005,67.407706000000005,0.32662449999999998,0.32662449999999998]
[null,"GA09","BAROSSA/MID NORTH & YORKE PENINSULA/RIVE","Rural Long",798.5,15.605870000000001,7.8464499999999999,3.0674619802044818,5.0481353574939627,0.24857060765985456,5,342.53850999999997,342.53850999999997,2.0788979400000001,2.0788979400000001,2,16.866624999999999,16.866624999999999,9.6430810000000006E-2,9.6430810000000006E-2]
[null,"GA10","BAROSSA/MID NORTH & YORKE PENINSULA/RIVE","Rural Long",81,21.003709999999998,1.31786,null,0.61367483699808167,0.12280879294391686,4,410.49382700000001,410.49382700000001,2.9753086400000002,2.9753086400000002,3,82.148148000000006,82.148148000000006,0.58024690999999995,0.58024690999999995]
[null,"GA11","MAJOR METROPOLITAN AREAS","Rural Short",47,31.774209975999998,0.54125000000000001,null,0.3413665565779449,0.12216615572212149,3,353.44680899999997,353.44680899999997,3.6382978700000002,3.6382978700000002,1,126.489362,126.489362,0.87234042999999994,0.87234042999999994]
[null,"GA13","BAROSSA/MID NORTH & YORKE PENINSULA/RIVE","Rural Long",42.5,16.858730000000001,6.6709999999999992E-2,null,1.5238330605530293,0,6,1942.682354,773.60000100000002,5.22352974,4.3058826799999999]
[null,"GA14","MAJOR METROPOLITAN AREAS","Rural Short",463,null,null,null,0.15033937683146187,0.3139125643080114,3,15.801296000000001,15.801296000000001,4.1036719999999999E-2,4.1036719999999999E-2,1,32.993521000000001,32.993521000000001,0.14470842,0.14470842]
[null,"GA15","MAJOR METROPOLITAN AREAS","Rural Short",475.5,38.87426,3.8163400000000003,4.7114196444699212,9.4830185678068641,0.58128074800868812,14,970.503332,970.503332,5.6368734800000002,5.6368734800000002,10,59.488959000000001,59.488959000000001,0.21030494,0.21030494]
[null,"GA16","BAROSSA/MID NORTH & YORKE PENINSULA/RIVE","Rural Long",38.5,25.413319233999999,8.7039999999999992E-2,null,1.5049337206584048,0,11,2117.9220780000001,926.64935100000002,10.31168836,9.3766234300000004]
[null,"GA17","BAROSSA/MID NORTH & YORKE PENINSULA/RIVE","Rural Long",117,2.2286700000000002,null,null,4.6366071611414892,0.47119153649807594,9,2147.1766400000001,894.95441800000003,9.1509977899999999,8.16809181,1,218.205128,218.205128,0.98290597999999996,0.98290597999999996]
[null,"GA18","BAROSSA/MID NORTH & YORKE PENINSULA/RIVE","Rural Long",61,44.488250000000001,null,null,1.671834820212653,3.5565455966776037E-2,6,1484.9672129999999,336.27868899999999,6.2131148899999999,5.31147554,2,31.590164000000001,31.590164000000001,1.29508197,1.29508197]
[null,"GA19","BAROSSA/MID NORTH & YORKE PENINSULA/RIVE","Rural Long",64,13.7881,null,null,2.4839342646427158,1.0704703923575559E-2,7,2102.8750009999999,948.312501,5.9843753800000004,5.0781253800000004,2,9.0625,9.0625,0.9375,0.9375]
[null,"GA20","BAROSSA/MID NORTH & YORKE PENINSULA/RIVE","Rural Long",63.5,40.54316,0.6694500000000001,null,4.2810879448289931,1.3750007625972055E-2,6,3652.8661419999999,442.58267699999999,2.7874015700000001,0.97637795000000005,1,11.732283000000001,11.732283000000001,7.8740160000000003E-2,7.8740160000000003E-2]
[null,"GA21","BAROSSA/MID NORTH & YORKE PENINSULA/RIVE","Rural Long",49.5,48.869750000000003,null,null,1.5403576778805956,0,7,1686.0471379999999,476.39057300000002,6.2087543399999996,5.2592593900000004]
[null,"GA22","MAJOR METROPOLITAN AREAS","Rural Short",957,60.736110000000004,5.6970700000000001,3.2454528905477624,2.1844486758859714,1.5321012737046613,13,111.07871799999999,111.07871799999999,1.31382793,1.31382793,7,77.907000999999994,77.907000999999994,0.34064786000000002,0.34064786000000002]
[null,"GA23","BAROSSA/MID NORTH & YORKE PENINSULA/RIVE","Rural Short",88,17.897209999999998,0.72005999999999992,0.4953665309646989,0.3805337042325056,0,2,210.43181799999999,210.43181799999999,1,1]
[null,"GA24","BAROSSA/MID NORTH & YORKE PENINSULA/RIVE","Rural Long",102,3.0340199999999999,null,null,3.9895016562482009,0.51413954689490415,9,2119.1993480000001,882.66993600000001,9.0915038799999994,8.1209156500000006,2,273.107843,273.107843,1.95098039,1.95098039]
[null,"GA25","MAJOR METROPOLITAN AREAS","Rural Short",2292,31.19284,11.850042272000001,6.2522762915945007,1.0451696086208351,3.7877467598527028,14,22.190808000000001,22.190808000000001,0.69255381999999999,0.69255381999999999,19,80.420592999999997,80.420592999999997,0.34467713999999999,0.34467713999999999]
[null,"GA26","MAJOR METROPOLITAN AREAS","Urban",1678,9.4694900000000004,6.8201733820000001,5.7164078309557729,6.1818892739814899,1.4174573407732967,6,160.399483,160.399483,1.94676201,1.94676201,7,36.778308000000003,36.778308000000003,0.22586412,0.22586412]
[null,"GA27","BAROSSA/MID NORTH & YORKE PENINSULA/RIVE","Rural Long",406.5,26.24934,0.60641,1.1622060918787165,9.8329903639349165,0.1844162096627017,8,1310.6248479999999,69.532596999999996,5.2669132599999999,4.2927435200000001,3,24.580566000000001,24.580566000000001,0.11808117999999999,0.11808117999999999]
[null,"GA28","BAROSSA/MID NORTH & YORKE PENINSULA/RIVE","Rural Long",247.5,76.759450000000001,0.76637999999999995,2.8007261558388747,9.4129906850820078,0.51633585683784455,9,2060.65724,851.000675,9.0047143199999997,8.0552193699999997,3,113.03434300000001,113.03434300000001,0.81212121000000004,0.81212121000000004]
[null,"GA29","BAROSSA/MID NORTH & YORKE PENINSULA/RIVE","Rural Long",51.5,23.4495,0.44936000000000004,null,1.9857656435854063,2.5395987239379258E-2,8,2089.1715220000001,827.54045399999995,6.2589000400000003,5.2686087800000001,1,26.718447000000001,26.718447000000001,0.31067960999999999,0.31067960999999999]
[null,"GA30","BAROSSA/MID NORTH & YORKE PENINSULA/RIVE","Rural Long",197,11.019970000000001,1.1439600000000001,null,4.9961744762259697,0,7,1374.1201370000001,145.389172,5.2622679000000003,4.2978008900000004]
[null,"GA31","BAROSSA/MID NORTH & YORKE PENINSULA/RIVE","Rural Long",126,12.382490000000001,0.49663999999999997,null,3.6866631185072727,0.4108945231906253,2,1585.31746,0.793651,0.96825397000000002,7.9365100000000008E-3,9,176.69047599999999,176.69047599999999,0.50793650999999995,0.50793650999999995]
[null,"GA33","MAJOR METROPOLITAN AREAS","Rural Short",35,16.21602,5.246E-2,null,0.34046238317983329,1.6213472979773567E-2,5,473.37142899999998,473.37142899999998,4.8285714300000002,4.8285714300000002,2,22.542857000000001,22.542857000000001,0.2,0.2]
[null,"GA34","MAJOR METROPOLITAN AREAS","Rural Short",48,19.26023,null,null,1.6401773945208615,2.5748392450768414E-2,11,1662.8402779999999,1662.8402779999999,9.11111133,9.11111133,2,26.104167,26.104167,0.97916667000000002,0.97916667000000002]
[null,"GA35","BAROSSA/MID NORTH & YORKE PENINSULA/RIVE","Rural Long",80.5,50.290300000000002,null,null,2.6405366993828134,4.4479890441063968E-3,1,1777.2546580000001,null,0.98136646000000005,null,3,2.993789,2.993789,7.4534160000000002E-2,7.4534160000000002E-2]
[null,"GA36","BAROSSA/MID NORTH & YORKE PENINSULA/RIVE","Rural Long",106,30.35464,1.03457,null,4.0363255062442951,0.33454045399781135,11,2063.1635230000002,873.29559800000004,9.9654090899999996,9.0314468300000001,3,171,171,0.85849056999999995,0.85849056999999995]
[null,"GA37","BAROSSA/MID NORTH & YORKE PENINSULA/RIVE","Rural Long",25,31.727060000000002,null,null,0.82184441563175803,8.6191322970858381E-2,8,1781.16,660.04,7.0800000799999996,6.2000000799999997,3,186.8,186.8,1,1]
[null,"GA38","BAROSSA/MID NORTH & YORKE PENINSULA/RIVE","Rural Long",32,24.005790000000001,null,null,1.1457539911580124,3.0822164745467557E-3,5,1939.96875,324.125,3.09375,2.1875,3,5.21875,5.21875,0.125,0.125]
[null,"GA39","BAROSSA/MID NORTH & YORKE PENINSULA/RIVE","Rural Long",39.5,33.881489999999999,null,null,2.0702159132752125,3.0268473163213654E-3,8,2839.696203,1581.8227850000001,6.5569620300000002,5.5696202499999998,2,4.1518990000000002,4.1518990000000002,5.0632910000000003E-2,5.0632910000000003E-2]
[null,"GA40","MAJOR METROPOLITAN AREAS","Rural Short",54.5,30.318369999999998,null,null,2.2228897872618085,0.41304284777369921,10,1984.8257209999999,1984.8257209999999,8.8746179099999996,8.8746179099999996,6,368.80733900000001,368.80733900000001,2.1834862400000001,2.1834862400000001]
[null,"GA41","BAROSSA/MID NORTH & YORKE PENINSULA/RIVE","Rural Long",73,43.453519999999997,null,null,2.4518693695939158,8.7852397717620115E-2,7,1819.817352,650.52968099999998,7.1050230699999997,6.1872148500000002,1,65.205478999999997,65.205478999999997,0.76712329000000001,0.76712329000000001]
[null,"GA42","BAROSSA/MID NORTH & YORKE PENINSULA/RIVE","Rural Long",12,2.3475199999999998,null,null,0.31522892218833665,0,5,1423.305556,149.305556,5.7222225,4.7222225]
[null,"GA43","MAJOR METROPOLITAN AREAS","Rural Short",701,40.415871602999999,0.42455999999999999,null,7.0575665445991511,0,6,489.93437899999998,489.93437899999998,1.9999999900000001,1.9999999900000001]
[null,"GA44","MAJOR METROPOLITAN AREAS","Rural Short",15.5,5.53261,null,null,9.7671276391462308E-2,0,3,306.64516099999997,306.64516099999997,4,4]
[null,"GA45","MAJOR METROPOLITAN AREAS","Rural Short",88.5,19.715,2.94957,null,0.68470585511540583,0.36865615368458526,3,376.49717500000003,376.49717500000003,3.84180791,3.84180791,2,202.71186399999999,202.71186399999999,1.1751412400000001,1.1751412400000001]
[null,"GA46","BAROSSA/MID NORTH & YORKE PENINSULA/RIVE","Rural Long",90,2.24356,null,null,3.7866598208462219,0.36466127607242399,10,2279.6444459999998,1019.8000019999999,9.2555561799999992,8.2666672899999991,1,219.533333,219.533333,0.98888889000000002,0.98888889000000002]
[null,"GA47","BAROSSA/MID NORTH & YORKE PENINSULA/RIVE","Rural Long",55,26.65326,0.94983000000000006,null,2.317937527452457,0.10365106419793162,8,2283.4545459999999,1009.4545460000001,7.8909092000000003,6.8909092000000003,1,102.10909100000001,102.10909100000001,0.65454544999999997,0.65454544999999997]
[null,"GA48","BAROSSA/MID NORTH & YORKE PENINSULA/RIVE","Rural Short",44,26.865650000000002,0.29055999999999998,null,0.5979257582921057,0,2,661.29545499999995,661.29545499999995,2,2]
[null,"GA49","BAROSSA/MID NORTH & YORKE PENINSULA/RIVE","Rural Long",66,30.488060000000001,null,null,3.2340756198189013,3.6100691162954821E-2,9,2654.9696979999999,1419.575758,8.8030305200000001,7.8333335499999999,4,29.636364,29.636364,1.1818181800000001,1.1818181800000001]
[null,"GA50","MAJOR METROPOLITAN AREAS","Urban",1198,5.1586360699999991,4.3773875860000002,5.029875545180019,3.5641156951964801,1.4071446346449108,4,129.529495,129.529495,1.9610462,1.9610462,9,51.139398999999997,51.139398999999997,0.46577628999999998,0.46577628999999998]
[null,"GA51","MAJOR METROPOLITAN AREAS","Rural Short",12.5,3.6037399999999997,null,null,0.39861718020900139,0.14230456322551577,9,1551.840031,1551.840031,8.4800001599999995,8.4800001599999995,4,554,554,2.16,2.16]
[null,"GA52","BAROSSA/MID NORTH & YORKE PENINSULA/RIVE","Rural Long",66,37.91254,null,null,4.0214127450036452,0.31329715362533644,7,3301.3232320000002,2046.6262630000001,6.3989899399999999,5.4141414499999998,5,257.19697000000002,257.19697000000002,0.95454545000000002,0.95454545000000002]
[null,"GA53","MAJOR METROPOLITAN AREAS","Rural Short",1509,56.360340000000001,20.077729999999999,4.6869294852813814,0.65314198376314714,1.9274716414243616,6,21.062956,21.062956,1.1994698500000001,1.1994698500000001,15,62.158383000000001,62.158383000000001,0.24188203999999999,0.24188203999999999]
[null,"GA745A","MAJOR METROPOLITAN AREAS","Rural Short",1532.5,2.7889266660000005,16.801650000000002,4.5345090142153204,10.846649028305224,12.560324759867019,3,344.42610100000002,34.730179,2.2296900499999999,1.12756933,7,398.84241400000002,398.84241400000002,1.15171289,1.15171289]
[null,"GA745B","MAJOR METROPOLITAN AREAS","Rural Short",437,26.615210000000001,11.10694,3.3723029223366043,3.9005697957764487,3.1062055116306877,11,434.35774300000003,161.71701100000001,2.2013730200000001,1.2311213000000001,1,345.899314,345.899314,0.97711669999999995,0.97711669999999995]
[null,"GA745C","MAJOR METROPOLITAN AREAS","Rural Short",199.5,10.690046478000001,2.354025928,0.99073306192939781,3.3084526612719191E-3,5.6469738591150516E-2,1,0.80701800000000001,0.80701800000000001,5.0125300000000003E-3,5.0125300000000003E-3,2,13.774436,13.774436,0.10025062999999999,0.10025062999999999]
[null,"GA800A","MAJOR METROPOLITAN AREAS","Rural Short",467.5,52.015687925999998,4.8316400000000002,3.8867220121845603,8.4453083458885914,0.31644013994364151,8,879.09304999999995,879.09304999999995,7.61996436,7.61996436,6,32.939036999999999,32.939036999999999,0.12834224999999999,0.12834224999999999]
[null,"GU11","EASTERN HILLS/FLEURIEU PENINSULA","Rural Long",59.5,15.788315106000001,0.98685,null,0.72062961394105629,0,5,656.21850500000005,330.47060599999998,2.5602241700000001,2.19047627]
[null,"GU118","BAROSSA/MID NORTH & YORKE PENINSULA/RIVE","Rural Long",201,38.925461612999996,2.52589,null,6.5721714302652909,0.30598842473958482,11,1771.6019899999999,1233.313433,9.1194029899999993,7.1393034799999997,2,82.482586999999995,82.482586999999995,0.96517412999999996,0.96517412999999996]
[null,"GU12","EASTERN HILLS/FLEURIEU PENINSULA","Rural Long",117.5,10.319065076999999,0.60448000000000002,0.57157676649772937,1.9434574537112181E-2,0.31811427039094542,1,8.9617020000000007,8.9617020000000007,0.99574468000000005,0.99574468000000005,1,146.68936199999999,146.68936199999999,0.52765956999999997,0.52765956999999997]
[null,"GU13","EASTERN HILLS/FLEURIEU PENINSULA","Rural Long",435,34.749134214000009,4.5811999999999999,1.9243084472090224,1.0073864647527608,1.1523429209868339,6,125.47586200000001,125.47586200000001,2.9471264399999999,2.9471264399999999,4,143.53103400000001,143.53103400000001,0.55172414000000003,0.55172414000000003]
[null,"GU14","EASTERN HILLS/FLEURIEU PENINSULA","Rural Long",214,8.0926924880000008,0.75729999999999997,0.57157676649772937,3.6506731656607685E-2,0,2,9.242991,9.242991,0.97663551000000004,0.97663551000000004]
[null,"GU15","EASTERN HILLS/FLEURIEU PENINSULA","Rural Long",116,17.424489999999999,1.98298,null,0.32540454289062193,0.15315109165143104,2,151.99137899999999,151.99137899999999,1.8965517199999999,1.8965517199999999,5,71.534482999999994,71.534482999999994,1.1120689699999999,1.1120689699999999]
[null,"GU16","EASTERN HILLS/FLEURIEU PENINSULA","Rural Long",23,4.7460800000000001,null,null,3.6543644428757949E-3,0.2582417539632228,1,8.6086960000000001,8.6086960000000001,0.95652174000000001,0.95652174000000001,3,608.34782600000005,608.34782600000005,2.8695652200000001,2.8695652200000001]
[null,"GU17","EASTERN HILLS/FLEURIEU PENINSULA","Rural Long",305.5,23.304415280000001,1.3761000000000001,null,3.739485295454295,3.3030102211635395,4,663.21440299999995,663.21440299999995,3.7545008200000001,3.7545008200000001,15,585.80360099999996,585.80360099999996,2.99836334,2.99836334]
[null,"GU18","EASTERN HILLS/FLEURIEU PENINSULA","Rural Long",52.5,13.502481093,0.99070000000000003,0.19052558883257648,8.8036961578371424E-3,6.2751712655442933E-4,1,9.0857139999999994,9.0857139999999994,1.0095238099999999,1.0095238099999999,1,0.64761899999999994,0.64761899999999994,3.8095240000000002E-2,3.8095240000000002E-2]
[null,"GU19","EASTERN HILLS/FLEURIEU PENINSULA","Rural Long",7,0.56245000000000001,0.47317000000000004,null,9.9664484805703484E-4,0,1,7.7142860000000004,7.7142860000000004,0.85714285999999995,0.85714285999999995]
[null,"GU21","EASTERN HILLS/FLEURIEU PENINSULA","Rural Long",218.5,32.087168859999998,2.4180000000000001,1.3336791218280355,1.0400235207262722,1.6710411952422952,6,257.89626600000003,257.89626600000003,3.8565980299999998,3.8565980299999998,2,414.37070899999998,414.37070899999998,0.99313501000000004,0.99313501000000004]
[null,"GU23","EASTERN HILLS/FLEURIEU PENINSULA","Rural Long",60,39.785632568000004,0.91191,null,0.64637955312321249,0.14916451225920288,3,583.70000000000005,583.70000000000005,2.95,2.95,4,134.69999999999999,134.69999999999999,2.25,2.25]
[null,"GU24","EASTERN HILLS/FLEURIEU PENINSULA","Rural Long",134,0.53606328699999994,0.88005999999999995,null,2.6410534781929171,0,5,1067.88806,1067.88806,4.1865671600000001,4.1865671600000001]
[null,"GU31","EASTERN HILLS/FLEURIEU PENINSULA","Rural Long",884.5,76.262041897000003,4.7208399999999999,1.5796303365028159,5.3214558301774648,0.74502893669478387,10,325.976249,315.76483899999999,3.9133220199999998,3.90503109,8,45.638213999999998,45.638213999999998,0.36743923000000001,0.36743923000000001]
[null,"GU32","EASTERN HILLS/FLEURIEU PENINSULA","Rural Long",811.5,82.909076202999998,3.9948800000000002,2.553042890356525,5.2518015704504704,0.26617799997552882,9,350.64941499999998,349.98397999999997,5.8422674099999998,5.8274799799999997,5,17.772027000000001,17.772027000000001,0.15033888000000001,0.15033888000000001]
[null,"GU33","EASTERN HILLS/FLEURIEU PENINSULA","Rural Long",74,24.222468333000002,0.79159999999999997,null,0.32245152111860109,0.22590616555959459,5,236.094595,236.094595,3.93243243,3.93243243,1,165.405405,165.405405,0.97297297000000005,0.97297297000000005]
[null,"GU34","EASTERN HILLS/FLEURIEU PENINSULA","Rural Long",119.5,45.081019999999995,6.1079999999999995E-2,null,0.7626547853965332,9.3850723192037466E-2,6,345.790795,345.790795,5.8995815900000004,5.8995815900000004,2,42.552301,42.552301,0.44351464000000002,0.44351464000000002]
[null,"GU35","EASTERN HILLS/FLEURIEU PENINSULA","Rural Long",82.5,27.164085783999997,0.25031999999999999,null,1.8819976880810343,0,11,1236,1191.272727,10.787878790000001,9.7939393900000002]
[null,"GU36","EASTERN HILLS/FLEURIEU PENINSULA","Rural Long",57,22.122389999999999,null,null,0.27590451543712247,0.29273673953764129,6,262.26315799999998,262.26315799999998,4.8245614000000003,4.8245614000000003,1,278.26315799999998,278.26315799999998,0.89473683999999998,0.89473683999999998]
[null,"GU37","EASTERN HILLS/FLEURIEU PENINSULA","Rural Long",57,28.677319999999998,null,null,0.35037603325027317,0.15614102619560213,5,333.05263200000002,333.05263200000002,5.7368421100000004,5.7368421100000004,2,148.421053,148.421053,1.5789473700000001,1.5789473700000001]
[null,"GU38","EASTERN HILLS/FLEURIEU PENINSULA","Rural Long",84,19.75027,0.34605000000000002,0.66683956091401775,0.42226365701290558,0.34960086503511772,5,272.36904800000002,272.36904800000002,4.9285714299999999,4.9285714299999999,2,225.5,225.5,0.59523809999999999,0.59523809999999999]
[null,"GU41","EASTERN HILLS/FLEURIEU PENINSULA","Rural Long",594,72.428202978000002,0.89127000000000001,1.6956777406099306,4.2897811159892907,4.3390409971049024,12,391.29294900000002,172.092612,2.8933783599999998,2.3361393000000001,20,395.78619500000002,395.78619500000002,2.3585858599999998,2.3585858599999998]
[null,"GU42","EASTERN HILLS/FLEURIEU PENINSULA","Rural Long",1224.5,26.956378520000001,4.4683199999999994,4.2296680720831983,3.8207549802844616,1.1360643884685691,10,169.061116,128.82972599999999,2.9290867,2.89832585,13,50.268681000000001,50.268681000000001,1.0984075099999999,1.0984075099999999]
[null,"GU43","EASTERN HILLS/FLEURIEU PENINSULA","Rural Long",535.5,64.901874949000003,2.3786799999999997,1.8862033294425071,2.7352548981163691,0.82250884543818081,9,276.75256999999999,276.75256999999999,1.7790227300000001,1.7790227300000001,7,83.221288999999999,83.221288999999999,1.2866479900000001,1.2866479900000001]
[null,"GU51","EASTERN HILLS/FLEURIEU PENINSULA","Urban",60.5,5.5978877469999997,0.21859999999999999,null,0.11773481428531482,0.45210536176202437,2,84.727272999999997,5.7190079999999996,8.2644629999999997E-2,1.6528930000000001E-2,2,325.35537199999999,325.35537199999999,1.0082644599999999,1.0082644599999999]
[null,"HH102A","MAJOR METROPOLITAN AREAS","Urban",683,3.2489569729999999,0.10184,2.0195712416253109,1.1727774740024586,0,4,74.759883000000002,6.972181,1.1215226899999999,0.13909224000000001]
[null,"HH102B","MAJOR METROPOLITAN AREAS","Urban",2309,10.57033244,1.0559100000000001,5.9634509304596444,12.631947605030232,1.8129002392419398,9,238.18811199999999,172.16126,2.9367691499999999,1.96578604,5,34.184061999999997,34.184061999999997,0.14118665999999999,0.14118665999999999]
[null,"HH102C","MAJOR METROPOLITAN AREAS","Urban",978,3.5014182770000004,1.2883599999999999,4.5154564553320622,0.51946331818689662,0.602202320668488,4,23.125425,23.125425,0.13258349999999999,0.13258349999999999,3,26.808793000000001,26.808793000000001,0.10940695,0.10940695]
[null,"HH102D","MAJOR METROPOLITAN AREAS","Urban",1856.5,9.3509886219999991,2.1400175849999998,7.2971300522876792,5.7697942985088311,1.235939932014646,16,135.312861,69.149112000000002,2.0847472599999999,1.11625817,4,28.985187,22.456235,9.2647450000000006E-2,7.5949370000000002E-2]
[null,"HH107A","MAJOR METROPOLITAN AREAS","Urban",2209,11.874247708,1.2610999999999999,6.382607225891312,16.420974401747742,2.5793708766815113,30,323.65096599999998,323.65096599999998,3.0618680500000002,3.0618680500000002,5,50.838388000000002,50.838388000000002,0.22136713,0.22136713]
[null,"HH107B","MAJOR METROPOLITAN AREAS","Urban",2902.5,10.002334747999999,6.2021794970000004,5.1632434573628236,4.7469756001330365,1.7137466705197972,11,71.206308000000007,63.572896,1.03715186,1.0238300199999999,6,25.706804000000002,25.706804000000002,0.17708872000000001,0.17708872000000001]
[null,"HH107C","MAJOR METROPOLITAN AREAS","Urban",2328.5,8.4241847130000007,2.3092700000000002,5.8872406949266143,1.3692851823808538,2.3429365851768229,9,25.60303,25.60303,1.04731226,1.04731226,6,43.808459999999997,43.808459999999997,0.24994632,0.24994632]
[null,"HH107D","MAJOR METROPOLITAN AREAS","Urban",1357.5,6.3598576620000005,0.36791000000000001,3.0293568624379663,0.61489598272354407,6.2717330976154182,8,19.721298999999998,19.721298999999998,0.11025167,0.11025167,22,201.150645,201.150645,0.91860037000000005,0.91860037000000005]
[null,"HH118A","MAJOR METROPOLITAN AREAS","Urban",1155.5,2.548279945,5.1250413230000005,6.9732365512722998,6.2992029925233259,1.1076397617848823,7,237.350064,154.840328,1.9818260299999999,0.99956727000000001,2,41.73518,41.73518,0.87840761999999994,0.87840761999999994]
[null,"HH118B","MAJOR METROPOLITAN AREAS","Urban",1053.5,4.1894213360000006,4.10558143,6.3445021081247974,2.4075382037691249,1.0551804727041842,8,99.497540999999998,17.849699999999999,2.6353428000000001,1.6633446999999999,6,43.607973000000001,43.607973000000001,0.20408163000000001,0.20408163000000001]
[null,"HH118C","MAJOR METROPOLITAN AREAS","Urban",1799,4.1382515800000004,2.5795840079999999,6.7827109624397224,3.3905145952340234,2.4542403132350818,2,82.055586000000005,null,0.97387436999999999,null,6,59.396331000000004,59.396331000000004,0.25958866000000003,0.25958866000000003]
[null,"HH118D","MAJOR METROPOLITAN AREAS","Urban",1624.5,6.6154913099999995,1.7050000000000001,6.5159751380741167,0.89856032911024708,0.15441497394462964,11,24.082481000000001,24.082481000000001,0.17174511000000001,0.17174511000000001,1,4.1385040000000002,4.1385040000000002,5.1092640000000002E-2,5.1092640000000002E-2]
[null,"HH118E","MAJOR METROPOLITAN AREAS","Urban",1085.5,3.3861444719999998,3.5314080170000004,7.1066044634551035,2.3215069509336681,0.17230717455490283,6,93.113759000000002,13.898650999999999,1.0093658299999999,5.4966939999999999E-2,1,6.9111010000000004,6.9111010000000004,5.711654E-2,5.711654E-2]
[null,"HH121A","MAJOR METROPOLITAN AREAS","Urban",2693,11.215475537,3.4042296219999999,7.4686030822369984,2.2455514190436539,1.0796875048622863,22,36.304490999999999,36.304490999999999,0.31588063999999999,0.31588063999999999,2,17.455625999999999,17.455625999999999,8.0950610000000006E-2,8.0950610000000006E-2]
[null,"HH121B","MAJOR METROPOLITAN AREAS","Urban",2604.5,11.258191706,1.5664500000000001,7.2590249345211655,7.2894285463921369,4.5096843758974137,10,121.85485,121.85485,1.3658408500000001,1.3658408500000001,12,75.386830000000003,75.386830000000003,0.23344212,0.23344212]
[null,"HH121C","MAJOR METROPOLITAN AREAS","Urban",2252,11.162538725000001,8.6401000000000003,7.0494467868053308,0.52594014585926496,2.9529710501432609,24,10.168143000000001,9.5984269999999992,8.9401980000000006E-2,8.8957930000000005E-2,12,57.090586000000002,57.090586000000002,0.24067495999999999,0.24067495999999999]
[null,"HH121D","MAJOR METROPOLITAN AREAS","Urban",2207.5,11.252154446,7.2686307809999997,7.6591286710695741,7.7886886569228135,1.6935806215649578,26,153.616311,153.616311,2.9153646100000001,2.9153646100000001,6,33.402492000000002,33.402492000000002,0.17440543999999999,0.17440543999999999]
[null,"HH121E","MAJOR METROPOLITAN AREAS","Urban",1844,36.178671203999997,5.6181608389999997,7.0684993456885881,3.6896289198723369,5.0184062646226248,23,87.115508000000005,83.843995000000007,1.5133771600000001,1.31670318,13,118.489154,118.489154,0.46908894000000001,0.46908894000000001]
[null,"HH121F","MAJOR METROPOLITAN AREAS","Urban",1824,9.450860736000001,2.1713,4.9727178685302462,6.6436943298369791,10.010031648742583,18,158.583686,152.24597299999999,1.09448093,1.08351603,30,238.9375,238.9375,1.02905702,1.02905702]
[null,"HH121G","MAJOR METROPOLITAN AREAS","Urban",1980,9.9646442709999992,2.18404,7.5257607588867712,0.96114847557291105,5.1959501808195592,12,21.134841000000002,21.134841000000002,0.10892253,0.10892253,16,114.25454499999999,114.25454499999999,0.48888889000000002,0.48888889000000002]
[null,"HH130A","MAJOR METROPOLITAN AREAS","Urban",1871,12.134046929,1.2561567310000001,5.8300830182768415,1.3747823134904451,1.7337519423189602,9,31.991444000000001,27.883485,0.64938534999999997,0.64190272999999998,8,40.344735,40.344735,0.21753073000000001,0.21753073000000001]
[null,"HH130B","MAJOR METROPOLITAN AREAS","Urban",2497.5,15.268726812000001,1.447538759,6.6493430502569195,13.845332416270361,1.5294041774542613,17,241.363497,178.93947299999999,4.8178846399999999,3.2763431000000001,3,26.661861999999999,26.661861999999999,9.9299299999999993E-2,9.9299299999999993E-2]
[null,"HH130C","MAJOR METROPOLITAN AREAS","Urban",1508.5,7.5619636119999996,3.2176390440000002,4.7250346030478969,7.4315564407861867,0.23919047131628338,4,214.49055100000001,214.49055100000001,2.9817699599999998,2.9817699599999998,4,6.9035469999999997,6.9035469999999997,4.0437519999999998E-2,4.0437519999999998E-2]
[null,"HH130D","MAJOR METROPOLITAN AREAS","Urban",1196,4.235410838,7.7339669789999999,6.4588174614243439,0.36465772275211106,1.3040864778563412,5,13.274798000000001,13.274798000000001,9.5038990000000004E-2,9.5038990000000004E-2,5,47.473244000000001,47.473244000000001,0.16304347999999999,0.16304347999999999]
[null,"HH130E","MAJOR METROPOLITAN AREAS","Urban",810.5,4.1556803129999995,3.4085900000000002,2.2482019482244029,3.2542671770101768,1.5613069587734776,4,174.813064,38.742736999999998,1.0635410000000001,7.7729770000000004E-2,3,83.870450000000005,83.870450000000005,0.23318939,0.23318939]
[null,"HH130F","MAJOR METROPOLITAN AREAS","Urban",2563.5,13.710140093,1.8565399999999999,6.8589211979727542,0.41446050678353841,0.76961727605780905,16,7.0392039999999998,7.0392039999999998,7.3987380000000005E-2,7.3987380000000005E-2,6,13.071192,13.071192,9.7522919999999999E-2,9.7522919999999999E-2]
[null,"HH130G","MAJOR METROPOLITAN AREAS","Urban",500,2.6591863849999999,1.8514900000000001,5.2775588106623692,1.4642664612402245,0.8519581479292202,2,127.504,127.504,0.98799999999999999,0.98799999999999999,4,74.186000000000007,74.186000000000007,0.24,0.24]
[null,"HH145A","MAJOR METROPOLITAN AREAS","Urban",2427,29.530470499,3.1248083329999998,6.6874481680234359,2.6798026917311133,2.6764573105449574,16,48.073611,46.849879000000001,1.1604174899999999,1.1528635899999999,10,48.013596999999997,48.013596999999997,0.19283065999999999,0.19283065999999999]
[null,"HH145B","MAJOR METROPOLITAN AREAS","Urban",2846.5,9.5498905230000002,13.339748277,7.3733402878207102,0.64712795191565575,6.0350920926248612,12,9.8981189999999994,9.8981189999999994,0.13841559000000001,0.13841559000000001,19,92.309503000000007,83.602670000000003,0.80309151999999995,0.67380994000000005]
[null,"HH145C","MAJOR METROPOLITAN AREAS","Urban",1484.5,8.5324382209999996,1.6519257189999998,7.2590249345211655,2.8243493256021446,0,11,82.834624000000005,82.834624000000005,1.0380599500000001,1.0380599500000001]
[null,"HH145D","MAJOR METROPOLITAN AREAS","Urban",1805,11.289527795999998,2.5145399999999998,5.1822960162460801,2.2904619553141341,2.5672207173453949,7,55.248382999999997,55.248382999999997,0.70674053000000003,0.70674053000000003,10,61.924100000000003,61.924100000000003,0.23434903000000001,0.23434903000000001]
[null,"HH145E","MAJOR METROPOLITAN AREAS","Urban",2673.5,10.749897720000002,10.450613427,6.4778700203076003,7.8599893016265163,3.1846049951427537,10,128.00162,125.63369,1.08372296,1.08172807,13,51.861978999999998,51.487937000000002,0.27828689000000001,0.24088274000000001]
[null,"HH148A","MAJOR METROPOLITAN AREAS","Urban",900.5,6.6395710690000005,1.33979,3.4294605989863771,0.94332550868360621,2.0760694749191031,6,45.609105999999997,45.609105999999997,0.42754026000000001,0.42754026000000001,10,100.376458,100.376458,0.36091061000000002,0.36091061000000002]
[null,"HH148B","MAJOR METROPOLITAN AREAS","Urban",851,3.8894724540000003,0.77367307600000002,2.9721991857881935,3.2204582315636361,3.0816846473447637,8,164.76380399999999,164.76380399999999,2.0943986899999998,2.0943986899999998,7,157.66392500000001,157.66392500000001,0.52526439000000003,0.52526439000000003]
[null,"HH148C","MAJOR METROPOLITAN AREAS","Urban",921.5,3.9137503039999997,0.28226853400000002,2.8007261558388747,2.025217864787527,0,7,95.686376999999993,95.686376999999993,1.3640802599999999,1.3640802599999999]
[null,"HH148D","MAJOR METROPOLITAN AREAS","Urban",877.5,16.258809701000001,6.1681874460000001,3.9629322477175912,13.921303443403273,0,8,690.72706500000004,197.300285,1.34472934,0.35213675]
[null,"HH177A","MAJOR METROPOLITAN AREAS","Urban",667,6.1847169619999995,3.8360489710000003,6.8970263157392688,3.3978643140103086,0.69915094554135448,13,221.79609600000001,115.41528599999999,2.0269864800000001,1.0419789800000001,5,45.637180999999998,45.637180999999998,0.14692653999999999,0.14692653999999999]
[null,"HH177B","MAJOR METROPOLITAN AREAS","Urban",2390.5,7.3499738799999994,5.8431499999999996,7.3161826111709383,8.3684043777666819,10.800756668524192,33,152.414964,27.407225,2.1165722900000001,0.98082663000000003,24,196.71575000000001,196.71575000000001,0.77096841999999999,0.77096841999999999]
[null,"HH177C","MAJOR METROPOLITAN AREAS","Urban",1943,12.682203009999998,5.999777088000001,3.677143864468726,6.731065395419086,5.0974856570503153,24,150.82894999999999,63.763587000000001,1.41053351,0.61176872000000004,15,114.22388100000001,114.22388100000001,0.42151312000000002,0.42151312000000002]
[null,"HH177D","MAJOR METROPOLITAN AREAS","Urban",1074.5,6.4233945010000006,1.22872,5.5633471939112331,3.0301899838978241,0.36836343181971892,14,122.78268799999999,12.502558000000001,1.16053976,0.17589573999999999,1,14.926012,14.926012,5.0255929999999997E-2,5.0255929999999997E-2]
[null,"HH177E","MAJOR METROPOLITAN AREAS","Urban",2464.5,12.581552755999999,2.8865841099999998,5.6586099883275223,14.414161894244399,1.7210046106903318,20,254.64448300000001,145.503075,2.1339013800000002,1.15195778,4,30.403732999999999,30.403732999999999,9.170217E-2,9.170217E-2]
[null,"HH177F","MAJOR METROPOLITAN AREAS","Urban",2105,4.0731000310000001,20.951368590999998,4.2677731898497129,25.610583681518996,7.449999967072432,17,529.71354099999996,420.29548899999998,5.0463974900000004,4.0606492799999998,24,154.09121099999999,154.09121099999999,0.58907363000000001,0.58907363000000001]
[null,"HH177G","MAJOR METROPOLITAN AREAS","Urban",2264,11.145985204,3.66466,4.9917704274135044,3.9454246139856686,0.40405596037987873,17,75.873659000000004,8.6623940000000008,1.15474082,0.15459360999999999,2,7.7703179999999996,7.7703179999999996,3.0918729999999998E-2,3.0918729999999998E-2]
[null,"HH341A","MAJOR METROPOLITAN AREAS","Urban",1578.5,4.3045309370000009,4.6087869790000004,4.3820885431492593,0.62639524975548511,1.7260116706813964,4,17.277367000000002,17.277367000000002,0.12437967,0.12437967,5,47.607222,47.607222,0.25403863999999998,0.25403863999999998]
[null,"HH341B","MAJOR METROPOLITAN AREAS","Urban",858.5,4.8307137030000007,1.8638800000000002,5.7348202238605523,10.517375413523176,0.19348382277399376,7,533.38497199999995,533.38497199999995,4.3622597499999998,4.3622597499999998,2,9.8124640000000003,9.8124640000000003,1.0064065200000001,1.0064065200000001]
[null,"HH341C","MAJOR METROPOLITAN AREAS","Urban",2651.5,9.4135668900000002,1.0665199999999999,7.2399723756379064,8.3825155381377208,1.2534876101484698,16,137.64373000000001,137.64373000000001,1.6957697199999999,1.6957697199999999,4,20.582688999999998,20.582688999999998,1.1023948699999999,1.1023948699999999]
[null,"HH341D","MAJOR METROPOLITAN AREAS","Urban",2152,8.7374434409999999,0.75422,6.5159751380741167,1.9022762010542642,4.2572872096505687,24,38.486198000000002,38.486198000000002,0.2760222,0.2760222,12,86.131969999999995,86.131969999999995,1.30065056,1.30065056]
[null,"HH341E","MAJOR METROPOLITAN AREAS","Urban",2243,9.232445009000001,0.70596999999999999,7.354287728937452,12.181564355564596,0.65413334195196371,13,236.45444900000001,236.45444900000001,2.1983949900000002,2.1983949900000002,2,12.697279999999999,12.697279999999999,0.93802942,0.93802942]
[null,"HH341F","MAJOR METROPOLITAN AREAS","Urban",1093,3.718447319,1.93665,4.6678769263981241,0.11100511288024215,0.24309505938271012,7,4.4217740000000001,4.4217740000000001,4.4830729999999999E-2,4.4830729999999999E-2,2,9.6834399999999992,9.6834399999999992,1.0045745699999999,1.0045745699999999]
[null,"HH341G","MAJOR METROPOLITAN AREAS","Urban",2749.5,9.4956179910000014,0.87447000000000008,8.0020747309682125,9.3085533180850195,0.6910661514273414,7,147.401589,147.401589,1.99175608,1.99175608,5,10.943080999999999,10.943080999999999,3.2369519999999999E-2,3.2369519999999999E-2]
[null,"HH341H","MAJOR METROPOLITAN AREAS","Urban",1679.5,8.170626608000001,0.63028451099999994,6.0206086071094171,13.33861633772459,3.9291410349150451,12,345.78366399999999,28.283217,1.2970129699999999,0.31219606,10,101.8571,101.8571,0.39714200999999999,0.39714200999999999]
[null,"HH341J","MAJOR METROPOLITAN AREAS","Urban",1389,6.0300025260000005,1.6266729769999999,3.4104080401031194,3.7095794535729558,1.780308412969825,8,116.277619,101.187641,1.08063346,1.0609550599999999,3,55.804175999999998,55.804175999999998,0.21814254999999999,0.21814254999999999]
[null,"HH341K","MAJOR METROPOLITAN AREAS","Urban",1816.5,7.3347506939999993,4.3364701409999995,6.5540802558406313,6.3498167820279194,1.8609266724589892,16,152.19468699999999,143.415908,2.0908339900000001,2.07615376,9,44.603358,44.603358,1.1714836200000001,1.1714836200000001]
[null,"HH386A","MAJOR METROPOLITAN AREAS","Urban",1393,15.530132404,4.1705266679999999,5.3537690461954002,8.0460389944708588,2.0334175923346649,11,251.48073199999999,182.63651100000001,2.1921512000000001,1.2086623299999999,6,63.554917000000003,63.554917000000003,1.2182340300000001,1.2182340300000001]
[null,"HH386B","MAJOR METROPOLITAN AREAS","Urban",1598,7.0882341789999996,2.5888800000000001,6.5731328147238894,3.1676081199754007,3.8680227475929181,13,86.303493000000003,18.931778000000001,1.1458071700000001,0.18335410999999999,6,105.38673300000001,105.38673300000001,1.2640800999999999,1.2640800999999999]
[null,"HH386C","MAJOR METROPOLITAN AREAS","Urban",1374,6.9450358939999992,0.311272728,4.6869294852813814,2.7092939786054107,0.55119002598887734,7,85.850553000000005,16.969185,2.6414364799999999,1.67127636,3,17.465793000000001,17.465793000000001,1.02328967,1.02328967]
[null,"HH386D","MAJOR METROPOLITAN AREAS","Urban",1624,9.5834011730000004,1.6232421640000001,6.8589211979727542,2.8583651781102506,2.0096455414596548,8,76.631157999999999,8.5233989999999995,1.0184729100000001,3.1403939999999998E-2,7,53.877462999999999,53.877462999999999,1.24076355,1.24076355]
[null,"HH386E","MAJOR METROPOLITAN AREAS","Urban",823,3.3614657400000003,3.6374042639999997,5.2204011340125964,3.5993026471743792,0.37888285143397449,5,190.41108600000001,190.41108600000001,1.0502226800000001,1.0502226800000001,3,20.043742000000002,20.043742000000002,1.06682868,1.06682868]
[null,"HH386F","MAJOR METROPOLITAN AREAS","Urban",1667,5.9943652289999996,2.458706142,6.8208160802062388,3.914096886776754,2.3012493655264432,2,102.227954,102.227954,0.98080383999999998,0.98080383999999998,5,60.103779000000003,60.103779000000003,1.2015596900000001,1.2015596900000001]
[null,"HH386G","MAJOR METROPOLITAN AREAS","Urban",1949.5,8.5334590840000004,1.1846700000000001,6.7065007269066932,11.911902837924403,19.1868012359446,11,266.03060499999998,197.41301000000001,2.0866888800000001,1.1064375399999999,39,428.50218000000001,428.50218000000001,2.61964606,2.61964606]
[null,"HH403A","MAJOR METROPOLITAN AREAS","Urban",1406,7.7237593629999992,5.9880868649999996,6.4778700203076003,0.34714089743290727,1.027664610918424,9,10.749646,10.749646,9.8150799999999996E-2,9.8150799999999996E-2,3,31.822901999999999,31.822901999999999,0.15007112,0.15007112]
[null,"HH403B","MAJOR METROPOLITAN AREAS","Urban",2359,7.9916664659999999,11.430764331000001,7.4114454055872256,1.9870224926584168,0,13,36.673178,9.0142690000000005,0.73986183000000005,7.7857830000000003E-2]
[null,"HH403C","MAJOR METROPOLITAN AREAS","Urban",378.5,1.14614946,4.0383264389999995,2.3815698604072062,0,0.28416213857548089,null,null,null,null,null,2,32.686922000000003,32.686922000000003,0.11096433,0.11096433]
[null,"HH403D","MAJOR METROPOLITAN AREAS","Urban",1283.5,1.9612402170000001,6.8900380619999995,3.8486168944180448,0.25712855313315358,0.36955777640474358,4,8.7222419999999996,8.7222419999999996,8.9598730000000001E-2,8.9598730000000001E-2,2,12.536034000000001,12.536034000000001,0.13946241000000001,0.13946241000000001]
[null,"HH409A","MAJOR METROPOLITAN AREAS","Urban",1141.5,11.247730212,6.1672300550000001,4.5154564553320622,7.9429351000726589,2.0150889965875556,8,302.95546899999999,302.95546899999999,3.1128632000000001,3.1128632000000001,5,76.858519000000001,76.858519000000001,0.26719229,0.26719229]
[null,"HH409B","MAJOR METROPOLITAN AREAS","Urban",899,3.5286545519999999,0.78015000000000001,3.2008298923872855,3.8548248448759564E-2,0.16867820446963561,4,1.8668899999999999,1.8668899999999999,8.5280000000000009E-3,8.5280000000000009E-3,1,8.1690769999999997,8.1690769999999997,1.89099E-2,1.89099E-2]
[null,"HH409C","MAJOR METROPOLITAN AREAS","Urban",2656.5,11.235234883,0.86797620099999995,7.6400761121863168,5.3963313896232421,4.1793102891475167,17,88.442801000000003,78.104647999999997,1.1284271100000001,1.1150009400000001,4,68.496517999999995,68.496517999999995,0.20440428999999999,0.20440428999999999]
[null,"HH409D","MAJOR METROPOLITAN AREAS","Urban",3091.5,17.382823172000002,3.48468,8.5164938208161693,9.1530596997806821,4.4820077369559757,17,128.90529100000001,112.593137,2.5194892800000002,2.4813200800000002,12,63.121462000000001,63.121462000000001,0.27527089999999999,0.27527089999999999]
[null,"HH409E","MAJOR METROPOLITAN AREAS","Urban",2331.5,10.115728202,0.82257000000000002,7.0113416690388153,0.79295305074811007,0.2592646476107362,11,14.807637,14.807637,0.10994352,0.10994352,1,4.8415179999999998,4.8415179999999998,2.9165770000000001E-2,2.9165770000000001E-2]
[null,"HH409F","MAJOR METROPOLITAN AREAS","Urban",1975,9.577297218,5.0496846610000006,6.6683956091401768,6.8715919164981232,3.9631568874231511,22,151.48302100000001,151.48302100000001,2.15240498,2.15240498,9,87.367089000000007,87.367089000000007,0.37620252999999998,0.37620252999999998]
[null,"HH428A","MAJOR METROPOLITAN AREAS","Urban",2546,3.2222483900000003,20.814368618,8.4402835852831384,1.8616694209553764,3.6131450195156383,10,31.835954000000001,31.835954000000001,0.12843676000000001,0.12843676000000001,22,61.787509999999997,61.787509999999997,0.37431265000000002,0.37431265000000002]
[null,"HH428B","MAJOR METROPOLITAN AREAS","Urban",1795.5,5.6096650600000002,5.98888,5.1632434573628236,0.24617277324773662,0.13342207104631171,8,5.9693670000000001,5.9693670000000001,0.12587022,0.12587022,2,3.2353100000000001,3.2353100000000001,0.28070175000000003,0.28070175000000003]
[null,"HH428C","MAJOR METROPOLITAN AREAS","Urban",932.5,5.5129128550000006,1.6776468019999999,5.3537690461954002,0.64016859715639607,0.68847074877142245,8,29.88954,29.88954,0.32779261999999998,0.32779261999999998,3,32.144772000000003,32.144772000000003,8.9008039999999997E-2,8.9008039999999997E-2]
[null,"HH428D","MAJOR METROPOLITAN AREAS","Urban",2146,8.9616355649999999,1.12155,8.4212310263998802,0.91638357988607255,0.96450215690269714,9,18.591792999999999,18.591792999999999,1.1140105300000001,1.1140105300000001,4,19.568034000000001,19.568034000000001,0.11556384,0.11556384]
[null,"HH428E","MAJOR METROPOLITAN AREAS","Urban",1005,0.69788622099999997,6.815085238,2.667358243656071,3.9413371305813544E-2,3.9015103323038018,1,1.707463,1.707463,0.13134328000000001,0.13134328000000001,7,169.02089599999999,169.02089599999999,1.5353233799999999,1.5353233799999999]
[null,"HH428F","MAJOR METROPOLITAN AREAS","Urban",2005,8.9189385740000002,1.72526,6.0587137248759326,1.8386091869124235,4.3592658626795968,9,39.925350999999999,35.844889999999999,0.18836238999999999,0.18304235999999999,16,94.661347000000006,94.661347000000006,0.36059849999999999,0.36059849999999999]
[null,"HH429A","MAJOR METROPOLITAN AREAS","Urban",652,3.3893621550000002,0.29161000000000004,2.0767289182750837,1.8807711671024756,0.29711618368997905,1,125.59202500000001,125.59202500000001,0.96319018000000001,0.96319018000000001,1,19.840491,19.840491,0.12883436000000001,0.12883436000000001]
[null,"HH429B","MAJOR METROPOLITAN AREAS","Urban",1370.5,5.7780449520000001,1.0692999999999999,3.4485131578696344,0.25000067885647703,0.64053618821475999,8,7.9421090000000003,7.1650200000000002,8.1235520000000006E-2,8.0505859999999999E-2,1,20.348777999999999,20.348777999999999,8.1722000000000003E-2,8.1722000000000003E-2]
[null,"HH429C","MAJOR METROPOLITAN AREAS","Urban",2368,8.7250145470000007,1.68147,6.8017635213229815,1.1782438786912424,2.6870226664894061,11,21.663429000000001,21.059543999999999,9.2483099999999999E-2,9.2060799999999998E-2,8,49.404139000000001,49.404139000000001,0.22423986000000001,0.22423986000000001]
[null,"HH432A","MAJOR METROPOLITAN AREAS","Urban",149.5,0.80580814299999992,4.92666,3.867669453301303,3.40235052250982E-2,0.1946551991939218,2,9.9085830000000001,9.9085830000000001,0.97212931000000002,0.97212931000000002,3,56.688963000000001,56.688963000000001,0.30100334000000001,0.30100334000000001]
[null,"HH432B","MAJOR METROPOLITAN AREAS","Urban",2207.5,9.0063667930000015,0.5524,6.8017635213229815,5.209463034339632,2.4816413341953591,13,102.746242,102.746242,1.08931668,1.08931668,6,48.945413000000002,48.945413000000002,0.20883351999999999,0.20883351999999999]
[null,"HH432C","MAJOR METROPOLITAN AREAS","Urban",1863,6.8574183819999996,1.1275899999999999,5.4871369583782021,0.18938011105185354,19.353871668857472,6,4.4258350000000002,4.4258350000000002,5.8865609999999999E-2,5.8865609999999999E-2,29,452.30220100000003,452.30220100000003,1.2989801400000001,1.2989801400000001]
[null,"HH432D","MAJOR METROPOLITAN AREAS","Urban",608,3.6232457550000001,1.9642696740000001,7.7162863477193477,1.8715839010638242,1.1996731993270706,5,134.02302599999999,134.02302599999999,1.10032895,1.10032895,2,85.907894999999996,85.907894999999996,0.30592105000000003,0.30592105000000003]
[null,"HH432E","MAJOR METROPOLITAN AREAS","Urban",525,2.455100791,6.6237207169999994,4.7250346030478969,0.47902405125527237,0.48145867675551485,2,39.725714000000004,39.725714000000004,0.98476189999999997,0.98476189999999997,3,39.927619,39.927619,0.25714285999999997,0.25714285999999997]
[null,"HH432F","MAJOR METROPOLITAN AREAS","Urban",2092,7.7671051810000007,1.2399100000000001,7.3733402878207102,8.620143566397914,3.636618484244392,10,179.40168499999999,84.734859,2.0038240599999999,1.0348948099999999,7,75.684989999999999,75.684989999999999,0.26195028999999997,0.26195028999999997]
[null,"HH496A","MAJOR METROPOLITAN AREAS","Urban",1986.5,7.8922809950000001,13.477930000000001,5.2775588106623692,3.1661537513922591,4.1668156073349509,15,69.393234000000007,69.393234000000007,1.0307911599999999,1.0307911599999999,15,91.324943000000005,91.324943000000005,1.33903851,1.33903851]
[null,"HH496C","MAJOR METROPOLITAN AREAS","Urban",3031,2.3106639049999997,34.038901177,6.7255532857899496,11.378926583210484,13.139168525176981,20,163.45155500000001,163.45155500000001,1.8476850199999999,1.8476850199999999,31,188.736391,187.88188700000001,1.0838007300000001,1.0227647600000001]
[null,"HH496D","MAJOR METROPOLITAN AREAS","Urban",2627,0.46404999999999996,32.384830576999995,6.6874481680234359,13.814417159041618,3.2347444995486927,6,228.952923,228.952923,1.9930211799999999,1.9930211799999999,19,53.610962999999998,53.610962999999998,0.56147696999999996,0.56147696999999996]
[null,"HH496E","MAJOR METROPOLITAN AREAS","Urban",772.5,5.627041438,16.860585764,3.905774571067818,1.5480543275127231E-2,0.4659321971501944,1,0.87249200000000005,0.87249200000000005,2.5890000000000002E-3,2.5890000000000002E-3,1,26.260193999999998,26.260193999999998,8.1553399999999998E-2,8.1553399999999998E-2]
[null,"HH496F","MAJOR METROPOLITAN AREAS","Urban",2445,0.345953238,31.293528374000001,8.1163900842677581,3.9275562315233782E-3,3.1116581027958636,1,6.9939000000000001E-2,6.9939000000000001E-2,4.0900000000000002E-4,4.0900000000000002E-4,14,55.409815999999999,55.409815999999999,0.30143149000000002,0.30143149000000002]
[null,"HH496G","MAJOR METROPOLITAN AREAS","Urban",2706,2.994125693,35.751524962000005,7.2590249345211655,0.84018312650818705,3.8275987770228532,7,13.518231,13.518231,3.3259419999999998E-2,3.3259419999999998E-2,11,61.584626999999998,61.584626999999998,0.42017737999999999,0.42017737999999999]
[null,"HH496H","MAJOR METROPOLITAN AREAS","Urban",932.5,null,11.657068131000001,5.1251383395963073,5.0070599910648911E-3,0.10951221118072202,1,0.23377999999999999,0.23377999999999999,2.1447699999999998E-3,2.1447699999999998E-3,2,5.113137,5.113137,6.863271E-2,6.863271E-2]
[null,"HH522A","MAJOR METROPOLITAN AREAS","Urban",1681,5.2211444179999997,8.8706254829999995,4.1725103954334246,5.7638993439193618,0.3851301923402573,8,149.28713200000001,149.28713200000001,1.9936545800000001,1.9936545800000001,4,9.9750150000000009,9.9750150000000009,0.11838192,0.11838192]
[null,"HH522B","MAJOR METROPOLITAN AREAS","Urban",2303,15.347790568000001,12.641478643999999,7.9830221720849552,1.2269288904170434,4.5419316796930786,11,23.195255,23.195255,0.18077872,0.18077872,17,85.865826999999996,85.865826999999996,0.59227094999999996,0.59227094999999996]
[null,"HH522C","MAJOR METROPOLITAN AREAS","Urban",2441,12.433225532999998,4.9255300000000002,6.8589211979727542,0.55153443831000704,0.73486644226661091,10,9.8373600000000003,9.8373600000000003,1.0573535199999999,1.0573535199999999,1,13.107333000000001,13.107333000000001,3.2363790000000003E-2,3.2363790000000003E-2]
[null,"HK01","UPPER NORTH/EYRE PENINSULA","Rural Long",203.5,16.592412868,2.1989699999999996,0.97168050304614006,10.777071413376145,0,5,2869.3906630000001,850.95823099999996,4.5749385699999996,3.6560196600000001]
[null,"HK02","UPPER NORTH/EYRE PENINSULA","Rural Long",24,56.490690000000001,null,null,2.0191470930053272,0,8,4558.375,2364.375,8,7]
[null,"HK03","UPPER NORTH/EYRE PENINSULA","Rural Long",20,62.047980000000003,null,null,1.2017506665099575,0,6,3255.65,1161.8499999999999,5.7,4.75]
[null,"HK04","UPPER NORTH/EYRE PENINSULA","Rural Long",32,66.551659999999998,null,null,2.3249509538841608,0.13122490499417627,12,3936.5625,1788.75,6.3125,5.375,1,222.1875,222.1875,0.9375,0.9375]
[null,"HK05","UPPER NORTH/EYRE PENINSULA","Rural Long",60,165.55801,null,null,4.4238111783479761,2.7906055745596976E-2,8,3994.833333,1731.833333,6.35,5.35,1,25.2,25.2,0.11666667,0.11666667]
[null,"HK06","UPPER NORTH/EYRE PENINSULA","Rural Long",7,30.80086,null,null,0.24288604074871442,2.2609072942034587E-2,3,1880,464,3,2,1,175,175,0.71428570999999996,0.71428570999999996]
[null,"HK07","UPPER NORTH/EYRE PENINSULA","Rural Long",1,17.946060000000003,null,null,5.8765133263214801E-2,1.5835579252461776E-2,4,3184,1768,4,3,2,858,858,2,2]
[null,"KA01","BAROSSA/MID NORTH & YORKE PENINSULA/RIVE","Rural Short",1794.5,16.11806,9.3570400000000014,4.2487206309664565,0.78053440857233303,1.2638083672104616,5,21.166523999999999,21.166523999999999,0.97297294999999995,0.97297294999999995,6,34.271942000000003,34.271942000000003,0.11590971999999999,0.11590971999999999]
[null,"KA02","BAROSSA/MID NORTH & YORKE PENINSULA/RIVE","Rural Short",1167.5,12.85895,9.215209999999999,3.2960926868035734,1.7092439040329879,0.47280048963071003,5,71.243967999999995,71.243967999999995,0.59728764000000001,0.59728764000000001,2,19.707066000000001,19.707066000000001,0.10107066000000001,0.10107066000000001]
[null,"KA03","BAROSSA/MID NORTH & YORKE PENINSULA/RIVE","Rural Long",1625.5,26.230979999999999,11.998721114,4.2487206309664565,3.6375137623892009,1.0915475852553549,3,121.247001,121.247001,0.98984928000000005,0.98984928000000005,10,36.383882,36.383882,0.18640418,0.18640418]
[null,"KA04","BAROSSA/MID NORTH & YORKE PENINSULA/RIVE","Rural Long",1924,27.28736,6.3707799999999999,4.058195042133879,5.4025164224990458,0.11922825404534158,11,152.140333,152.140333,1.13149688,1.13149688,4,3.3575879999999998,3.3575879999999998,1.4033260000000001E-2,1.4033260000000001E-2]
[null,"KA05","BAROSSA/MID NORTH & YORKE PENINSULA/RIVE","Rural Long",993.5,23.749400000000001,3.3658999999999999,2.7054633614225865,2.6998005583790059,0,5,147.23706300000001,147.23706300000001,2.2737797199999998,2.2737797199999998]
[null,"KA06","BAROSSA/MID NORTH & YORKE PENINSULA/RIVE","Rural Long",883,11.694799999999999,2.8871899999999999,3.8486168944180448,0.93559980284198463,0,9,57.409365999999999,57.409365999999999,1.9535674199999999,1.9535674199999999]
[null,"KA07","BAROSSA/MID NORTH & YORKE PENINSULA/RIVE","Rural Long",80,73.884350000000012,0.20116000000000001,null,1.2588731814124858,2.7629209954470026E-2,5,852.6,852.6,1.9624999999999999,1.9624999999999999,3,18.712499999999999,18.712499999999999,1.0125,1.0125]
[null,"KA08","BAROSSA/MID NORTH & YORKE PENINSULA/RIVE","Rural Long",73,68.677710000000005,null,null,0.7386061143406385,4.5439622516970736E-2,6,548.20547899999997,548.20547899999997,2.8493150699999998,2.8493150699999998,5,33.726027000000002,33.726027000000002,0.36986300999999999,0.36986300999999999]
[null,"KA09","BAROSSA/MID NORTH & YORKE PENINSULA/RIVE","Rural Long",58,42.096350000000001,0.24084999999999998,null,5.4446338921634314E-2,1.7090613505570635E-2,1,50.862068999999998,50.862068999999998,0.86206897000000005,0.86206897000000005,3,15.965517,15.965517,0.31034483000000002,0.31034483000000002]
[null,"KA10","BAROSSA/MID NORTH & YORKE PENINSULA/RIVE","Rural Long",77,71.377740000000003,0.43297000000000002,null,0.43318983756938267,0,4,304.81818199999998,304.81818199999998,2.3636363600000001,2.3636363600000001]
[null,"KA11","BAROSSA/MID NORTH & YORKE PENINSULA/RIVE","Rural Long",35,32.724240000000002,null,null,0.25237262319133136,1.5503364303109429E-3,4,390.68571400000002,390.68571400000002,1.85714286,1.85714286,1,2.4,2.4,8.5714289999999999E-2,8.5714289999999999E-2]
[null,"KA12","BAROSSA/MID NORTH & YORKE PENINSULA/RIVE","Rural Long",59,67.178460000000001,0.21756,null,0,4.0050357783032696E-3,null,null,null,null,null,2,3.6779660000000001,3.6779660000000001,5.0847459999999997E-2,5.0847459999999997E-2]
[null,"KA13","BAROSSA/MID NORTH & YORKE PENINSULA/RIVE","Rural Long",47,21.539750000000002,6.2640000000000001E-2,null,0.18083567076412643,0,2,208.468085,208.468085,1.95744681,1.95744681]
[null,"KA14","BAROSSA/MID NORTH & YORKE PENINSULA/RIVE","Rural Long",94.5,80.479289999999992,null,null,0.10643797849527631,3.2520152264379543E-2,2,61.026454999999999,61.026454999999999,0.94179893999999997,0.94179893999999997,2,18.645503000000001,18.645503000000001,0.92063492000000002,0.92063492000000002]
[null,"KA15","BAROSSA/MID NORTH & YORKE PENINSULA/RIVE","Rural Long",64,56.942309999999999,0.36174000000000001,null,0.42047338756361796,3.7651027593265762E-3,2,355.96875,355.96875,1.84375,1.84375,1,3.1875,3.1875,3.125E-2,3.125E-2]
[null,"KA16","BAROSSA/MID NORTH & YORKE PENINSULA/RIVE","Rural Long",60.5,66.670410000000004,0.27027999999999996,null,0.13486081305097691,0.2151276360917185,3,120.77686,120.77686,0.97520660999999997,0.97520660999999997,3,192.661157,192.661157,1.05785124,1.05785124]
[null,"KA17","BAROSSA/MID NORTH & YORKE PENINSULA/RIVE","Rural Long",106,113.58081,null,null,0.22088602854715914,0.33345152721937865,2,112.90566,112.90566,0.88679244999999995,0.88679244999999995,3,170.44339600000001,170.44339600000001,0.92452829999999997,0.92452829999999997]
[null,"KA18","BAROSSA/MID NORTH & YORKE PENINSULA/RIVE","Rural Long",25,38.418870000000005,null,null,2.1409407847151119E-3,0,2,4.6399999999999997,4.6399999999999997,0.16,0.16]
[null,"KA20","BAROSSA/MID NORTH & YORKE PENINSULA/RIVE","Rural Long",65.5,26.780480000000001,null,0.30674619802044817,2.7093974758291246E-2,2.2406052695208154E-2,4,22.412213999999999,22.412213999999999,0.19847328,0.19847328,3,18.534351000000001,18.534351000000001,0.12213739999999999,0.12213739999999999]
[null,"KA21","BAROSSA/MID NORTH & YORKE PENINSULA/RIVE","Rural Long",88,95.416941643000001,0.28870000000000001,null,0.20719139007941248,0.38935592064094826,2,127.56818199999999,127.56818199999999,0.98863635999999999,0.98863635999999999,10,239.727273,239.727273,2.2159090899999998,2.2159090899999998]
[null,"KA22","BAROSSA/MID NORTH & YORKE PENINSULA/RIVE","Rural Long",1274.5,16.905379999999997,3.1198999999999999,2.937904579798329,1.6607240754262973,0,3,70.601020000000005,70.601020000000005,0.96665358999999995,0.96665358999999995]
[null,"KA24","BAROSSA/MID NORTH & YORKE PENINSULA/RIVE","Rural Long",65,59.393879999999996,0.10696,null,0.13177859657643018,3.1375856327721468E-3,2,109.846154,109.846154,0.84615384999999999,0.84615384999999999,2,2.6153849999999998,2.6153849999999998,4.6153850000000003E-2,4.6153850000000003E-2]
[null,"KA25","BAROSSA/MID NORTH & YORKE PENINSULA/RIVE","Rural Long",72,69.596820000000008,0.30057999999999996,null,2.6466457631736814E-2,2.9530217720208442E-2,2,19.916667,19.916667,1,1,3,22.222221999999999,22.222221999999999,0.16666666999999999,0.16666666999999999]
[null,"KA26","BAROSSA/MID NORTH & YORKE PENINSULA/RIVE","Rural Long",225.5,23.190919999999998,null,null,0.50625867004082348,0.99086799921551916,1,121.640798,121.640798,0.93569844999999996,0.93569844999999996,3,238.079823,238.079823,1.20177384,1.20177384]
[null,"KA27","BAROSSA/MID NORTH & YORKE PENINSULA/RIVE","Rural Long",46,34.897760000000005,0.59569000000000005,null,0.11298999555194755,0,2,133.08695700000001,133.08695700000001,0.21739130000000001,0.21739130000000001]
[null,"KA28","BAROSSA/MID NORTH & YORKE PENINSULA/RIVE","Rural Long",83.5,81.536149999999992,0.32538,null,0.58152381245520479,0,5,377.341317,377.341317,1.7005988000000001,1.7005988000000001]
[null,"KA29","BAROSSA/MID NORTH & YORKE PENINSULA/RIVE","Rural Long",724.5,34.388100000000009,1.26275,2.1529391538081146,0.16648893126357328,0,2,12.450888000000001,12.450888000000001,1.0039107599999999,1.0039107599999999]
[null,"KA30","BAROSSA/MID NORTH & YORKE PENINSULA/RIVE","Rural Short",67,47.67962,null,null,1.6125521567411805,0,5,1171.2238809999999,1171.2238809999999,4.7761193999999998,4.7761193999999998]
[null,"KA31","BAROSSA/MID NORTH & YORKE PENINSULA/RIVE","Rural Long",61,34.26314,0.23044000000000001,null,0,4.6140965187825691E-4,null,null,null,null,null,1,0.40983599999999998,0.40983599999999998,1.6393439999999999E-2,1.6393439999999999E-2]
[null,"KA33","BAROSSA/MID NORTH & YORKE PENINSULA/RIVE","Rural Long",97.5,4.7019200000000003,0.79896,null,1.8511755233355666E-2,0,2,10.287179,10.287179,0.97435897000000005,0.97435897000000005]
[null,"KI11","KANGAROO ISLAND","Rural Long",329,6.7673100000000002,1.6674299999999997,0.69732365512722994,1.4184286390319871,3.5768291649741721,3,233.59574499999999,40.136778,1.8723404299999999,0.94224923999999999,10,589.054711,589.054711,2.03039514,2.03039514]
[null,"KI12","KANGAROO ISLAND","Rural Long",111,67.549859999999995,null,null,9.9867505052529934E-2,1.0134770721575537,5,48.747748000000001,48.747748000000001,0.99099099000000002,0.99099099000000002,12,494.70270299999999,494.70270299999999,2.2522522500000002,2.2522522500000002]
[null,"KI13","KANGAROO ISLAND","Rural Long",89.5,28.159669999999998,0.82821,null,0.3674297339836935,3.4015119536465098E-2,2,222.435754,222.435754,1.8770949699999999,1.8770949699999999,5,20.592179000000002,20.592179000000002,1.05027933,1.05027933]
[null,"KI14","KANGAROO ISLAND","Rural Long",138,28.5627,null,null,0.46288616276426731,0.3674297339836935,2,181.73912999999999,181.73912999999999,1.91304348,1.91304348,1,144.26087000000001,144.26087000000001,0.91304348000000002,0.91304348000000002]
[null,"KI15","KANGAROO ISLAND","Rural Long",61.5,62.125959999999999,null,null,9.7800389812115335E-2,0.21324508471205522,3,86.162602000000007,86.162602000000007,2,2,7,187.86991900000001,187.86991900000001,1.95121951,1.95121951]
[null,"KI16","KANGAROO ISLAND","Rural Long",110,7.5946499999999997,1.4139699999999999,null,8.2942999021635461E-2,0.61995000826362601,1,40.854545000000002,40.854545000000002,0.97272727000000003,0.97272727000000003,2,305.36363599999999,305.36363599999999,0.9,0.9]
[null,"KI21","KANGAROO ISLAND","Rural Long",323.5,25.36542,1.4993899999999998,0.57538727827438096,1.0372119846501713,0.34819817969340783,6,173.71870200000001,173.71870200000001,2.9706336900000001,2.9706336900000001,3,58.318393,58.318393,1.1962905699999999,1.1962905699999999]
[null,"KI22","KANGAROO ISLAND","Rural Long",16,8.2339600000000015,null,null,0.1476510886010422,5.5812111491193951E-2,3,500,500,3,3,2,189,189,2,2]
[null,"KI31","KANGAROO ISLAND","Rural Short",681,41.634029999999996,5.58087,1.7890352791378934,6.5192477644355673,0.70620052271596745,11,465.85560600000002,465.85560600000002,4.9069995200000003,4.9069995200000003,2,50.464022999999997,50.464022999999997,1.90602056,1.90602056]
[null,"KI32","KANGAROO ISLAND","Rural Short",753.5,8.82789,2.0075699999999999,1.449899731015907,4.5569928422610628,2.7695447666020057,7,294.30391600000002,294.30391600000002,4.5888080999999996,4.5888080999999996,8,178.865295,178.865295,2.32116788,2.32116788]
[null,"KI41","KANGAROO ISLAND","Rural Long",99,32.204419999999999,0.94384000000000001,0.62492393137085078,0.15420310565771347,3.0619144498641126E-2,3,84.393939000000003,84.393939000000003,1.9797979800000001,1.9797979800000001,2,16.757576,16.757576,0.97979797999999996,0.97979797999999996]
[null,"KI42","KANGAROO ISLAND","Rural Long",216,95.506489999999985,0.24334,1.4670470340108388,0.41222338298803474,6.0942986820080168E-2,4,103.402778,103.402778,2.7175925900000002,2.7175925900000002,5,15.287037,15.287037,0.93981481,0.93981481]
[null,"KI43","KANGAROO ISLAND","Rural Long",80.5,86.331210000000013,null,null,1.3563967254334743,0.18305043709314206,5,912.94409900000005,912.94409900000005,3.7515527999999998,3.7515527999999998,4,123.20496900000001,123.20496900000001,1.7391304299999999,1.7391304299999999]
[null,"KI44","KANGAROO ISLAND","Rural Long",101,84.46902,null,null,0.14554706058847736,2.3993301897669361E-2,3,78.079207999999994,78.079207999999994,1.84158416,1.84158416,2,12.871287000000001,12.871287000000001,0.93069307000000001,0.93069307000000001]
[null,"KI45","KANGAROO ISLAND","Rural Long",96.5,56.175669999999997,null,null,0.146063839398581,2.8958069751879402E-2,5,82.010362999999998,82.010362999999998,1.9170984499999999,1.9170984499999999,3,16.259067000000002,16.259067000000002,1.90673575,1.90673575]
[null,"KI51","KANGAROO ISLAND","Rural Long",87,83.981179999999995,null,null,0.21503535416134284,0.13781383482299778,5,133.91954000000001,133.91954000000001,2.8735632199999999,2.8735632199999999,6,85.827585999999997,85.827585999999997,1.5517241399999999,1.5517241399999999]
[null,"KI52","KANGAROO ISLAND","Rural Long",82.5,83.4923,0.45487,null,2.5480517487603356,0.11158731021023764,13,1673.4303030000001,1673.4303030000001,9.8787878800000009,9.8787878800000009,3,73.284847999999997,73.284847999999997,2.0484848499999999,2.0484848499999999]
[null,"KI53","KANGAROO ISLAND","Rural Long",124,95.342710000000011,0.20165,null,0.29151861805668272,0.15680545609430682,3,127.379032,127.379032,2.83064516,2.83064516,3,68.516129000000006,68.516129000000006,1.25806452,1.25806452]
[null,"KI54","KANGAROO ISLAND","Rural Long",122,135.56545,0.76080999999999999,null,1.3259436884095093,0.25268638175460861,7,588.86885199999995,588.86885199999995,4.4426229499999996,4.4426229499999996,12,112.221311,112.221311,1.30327869,1.30327869]
[null,"KI55","KANGAROO ISLAND","Rural Long",81,92.332139999999995,null,null,0.60732584018823688,8.8609109546700454E-2,4,406.246914,406.246914,2.65432099,2.65432099,3,59.271605000000001,59.271605000000001,1.07407407,1.07407407]
[null,"KI56","KANGAROO ISLAND","Rural Long",116.5,37.009920000000001,null,null,2.8588388338794544,4.7709758004211761E-2,5,1329.5879829999999,1329.5879829999999,3.7510729600000001,3.7510729600000001,4,22.188841,22.188841,1.01287554,1.01287554]
[null,"KI57","KANGAROO ISLAND","Rural Short",161.5,41.958440000000003,0.63764999999999994,null,2.6832989540594077,0.36962197526893176,8,808.53250800000001,808.53250800000001,6.9535603699999999,6.9535603699999999,6,111.374613,111.374613,2.21052632,2.21052632]
[null,"LC01","UPPER NORTH/EYRE PENINSULA","Rural Short",201,17.59872,7.6844299999999999,null,6.9893014661933393,0,4,1692.1492539999999,2.2039800000000001,0.87064677000000001,1.492537E-2]
[null,"LC02","UPPER NORTH/EYRE PENINSULA","Rural Long",289,12.240271128999998,6.7822599999999991,null,12.948760537292426,0,4,2427.6366779999998,817.17647099999999,2.48442907,1.67128028]
[null,"LC03","UPPER NORTH/EYRE PENINSULA","Rural Long",30,89.856700000000004,0.21574000000000002,null,2.1728334198529371,2.6577195948187596E-3,3,3924.2666669999999,1970.633333,2.8666666699999999,1.9,1,4.8,4.8,6.6666669999999997E-2,6.6666669999999997E-2]
[null,"LC04","UPPER NORTH/EYRE PENINSULA","Rural Long",58,115.13741999999999,null,null,8.86585726613818,9.6379248084330307E-2,14,8282.206897,6574.8103449999999,5.0344827600000004,4.18965517,2,90.034482999999994,90.034482999999994,0.24137931000000001,0.24137931000000001]
[null,"LC05","UPPER NORTH/EYRE PENINSULA","Rural Short",2,4.5220200000000004,null,null,0.10065093872614821,0,1,2449,null,1]
[null,"LC06","UPPER NORTH/EYRE PENINSULA","Rural Long",59.5,67.241679999999988,null,null,16.119973698516944,0,15,14679.142851000001,12878.924363,11.697478970000001,10.806722669999999]
[null,"LM11","BAROSSA/MID NORTH & YORKE PENINSULA/RIVE","Rural Long",60.5,14.16757,null,null,0.77238759300926751,0,4,691.72464300000001,691.72464300000001,3.11845792,3.11845792]
[null,"LM12","BAROSSA/MID NORTH & YORKE PENINSULA/RIVE","Rural Long",29,3.4797500000000001,null,null,8.582219524935579E-2,6.6904399522347252E-2,1,160.34482800000001,160.34482800000001,0.86206897000000005,0.86206897000000005,1,125,125,0.86206897000000005,0.86206897000000005]
[null,"LM13","BAROSSA/MID NORTH & YORKE PENINSULA/RIVE","Rural Long",85,107.78655999999999,null,null,0.15687928163860734,7.129701940822826E-2,1,100,100,0.37647058999999999,0.37647058999999999,2,45.447059000000003,45.447059000000003,0.41176470999999998,0.41176470999999998]
[null,"LM14","BAROSSA/MID NORTH & YORKE PENINSULA/RIVE","Rural Long",114,137.96346,null,null,2.7684579112695416E-4,0.69737454784879738,1,0.131579,0.131579,8.7719300000000007E-3,8.7719300000000007E-3,2,331.44736799999998,331.44736799999998,0.92105263000000004,0.92105263000000004]
[null,"LM21","BAROSSA/MID NORTH & YORKE PENINSULA/RIVE","Rural Long",52,3.2273200000000002,null,null,0,0.11251012951399417,null,null,null,null,null,1,117.230769,117.230769,0.92307691999999997,0.92307691999999997]
[null,"LM31","BAROSSA/MID NORTH & YORKE PENINSULA/RIVE","Rural Long",96.5,101.55899000000001,null,null,0.64541982104730578,0.19700346496594057,3,362.38342,362.38342,1.5958549200000001,1.5958549200000001,4,110.61139900000001,110.61139900000001,0.80829015999999998,0.80829015999999998]
[null,"LM32","BAROSSA/MID NORTH & YORKE PENINSULA/RIVE","Rural Long",74,93.10896000000001,0.14977000000000001,null,0.910675001719078,0.15512592496146996,2,666.78378399999997,666.78378399999997,1.25675676,1.25675676,5,113.581081,113.581081,1.37837838,1.37837838]
[null,"LM41","BAROSSA/MID NORTH & YORKE PENINSULA/RIVE","Rural Long",397.5,6.6721899999999996,0.32717000000000002,null,0.10368172669648115,0,2,14.132481,14.132481,4.6960120000000001E-2,4.6960120000000001E-2]
[null,"LM43","BAROSSA/MID NORTH & YORKE PENINSULA/RIVE","Rural Long",111.5,106.96680000000001,null,null,1.4485310047205247,2.3808738036918057E-3,2,703.89237700000001,703.89237700000001,0.93273543000000003,0.93273543000000003,1,1.1569510000000001,1.1569510000000001,2.6905829999999999E-2,2.6905829999999999E-2]
[null,"LM51","BAROSSA/MID NORTH & YORKE PENINSULA/RIVE","Rural Long",120,134.79157000000001,null,null,0.75497692878927913,0,6,340.88333299999999,340.88333299999999,1.5,1.5]
[null,"LM52","BAROSSA/MID NORTH & YORKE PENINSULA/RIVE","Rural Long",49,68.347859999999997,null,null,0.19205715349780567,0,2,212.367347,212.367347,0.95918367000000004,0.95918367000000004]
[null,"LM53","BAROSSA/MID NORTH & YORKE PENINSULA/RIVE","Rural Long",68,10.028600000000001,2.018E-2,1.0078803649243298,0.26278202493770486,0,1,209.38235299999999,209.38235299999999,0.92647058999999998,0.92647058999999998]
[null,"LM54","BAROSSA/MID NORTH & YORKE PENINSULA/RIVE","Rural Long",103.5,133.72620000000001,1.0080499999999999,null,2.0917360594388148,0,3,1095.0144929999999,1095.0144929999999,1.6425120799999999,1.6425120799999999]
[null,"LM55","BAROSSA/MID NORTH & YORKE PENINSULA/RIVE","Rural Long",13,11.35361,null,null,0.21195313768679608,0,1,883.38461500000005,883.38461500000005,0.84615384999999999,0.84615384999999999]
[null,"LM56","BAROSSA/MID NORTH & YORKE PENINSULA/RIVE","Rural Long",61.5,67.30847,null,null,1.4458548287396307,5.8912784351815843E-2,3,1273.8048779999999,1273.8048779999999,1.8373983700000001,1.8373983700000001,1,51.902439000000001,51.902439000000001,0.91056910999999996,0.91056910999999996]
[null,"LM61","BAROSSA/MID NORTH & YORKE PENINSULA/RIVE","Rural Long",242.5,16.450479999999999,0.70984999999999998,1.1850691625386258,5.3365717516935431,0,4,1192.3505150000001,1192.3505150000001,2.8577319600000002,2.8577319600000002]
[null,"LM62","BAROSSA/MID NORTH & YORKE PENINSULA/RIVE","Rural Long",210,8.3367599999999999,4.6699999999999997E-3,0.62873444314750238,4.3849420292737511,0,5,1131.3523809999999,1131.3523809999999,2.71428571,2.71428571]
[null,"LM63","BAROSSA/MID NORTH & YORKE PENINSULA/RIVE","Rural Long",81,83.905330000000006,null,null,1.8379976636779236,0,4,1229.45679,1229.45679,3.2345679000000001,3.2345679000000001]
[null,"LM64","BAROSSA/MID NORTH & YORKE PENINSULA/RIVE","Rural Long",76.5,108.33369999999999,null,null,2.1109491573430255,8.489937594559927E-4,7,1495.098039,1495.098039,3.7777777800000001,3.7777777800000001,1,0.60130700000000004,0.60130700000000004,2.614379E-2,2.614379E-2]
[null,"LX21","BAROSSA/MID NORTH & YORKE PENINSULA/RIVE","Rural Short",191.5,71.484460000000013,2.64852,null,1.3979685665646338,0.10529510208917586,6,355.24631299999999,319.559617,1.7893823099999999,1.0409051300000001,4,26.757180000000002,6.5796340000000004,0.10443864,3.1331589999999999E-2]
[null,"LX22","BAROSSA/MID NORTH & YORKE PENINSULA/RIVE","Rural Short",2,0.15293000000000001,1.41E-3,null,1.7631381263175816E-2,0,2,429,389,2,1]
[null,"LX24","BAROSSA/MID NORTH & YORKE PENINSULA/RIVE","Rural Short",312,28.73076,0.76224000000000003,1.1183852064472242,0.84973804966618094,1.6049077816480552E-2,7,132.535256,132.535256,1.0224359000000001,1.0224359000000001,2,2.5032049999999999,2.5032049999999999,1.6025640000000001E-2,1.6025640000000001E-2]
[null,"LX25","BAROSSA/MID NORTH & YORKE PENINSULA/RIVE","Rural Short",341.5,8.6685999999999996,1.4288399999999999,1.461331266345862,7.7656170356787846E-2,0.54564809636492717,5,11.065887,11.065887,6.0517330000000001E-2,6.0517330000000001E-2,12,77.754025999999996,77.754025999999996,0.47730600000000001,0.47730600000000001]
[null,"LX32","BAROSSA/MID NORTH & YORKE PENINSULA/RIVE","Rural Short",26.5,9.1552199999999999,null,null,9.0622863972885572E-3,0,1,16.641514999999998,16.641514999999998,0.11320758,0.11320758]
[null,"LX33","BAROSSA/MID NORTH & YORKE PENINSULA/RIVE","Rural Short",78,111.23348,null,null,1.2747200961740353,0,2,795.28205100000002,795.28205100000002,1.6538461499999999,1.6538461499999999]
[null,"LX34","BAROSSA/MID NORTH & YORKE PENINSULA/RIVE","Rural Short",299.5,31.725300000000001,0.52664,null,0.16977909876714103,7.4573755948793757E-2,7,27.585975999999999,27.585975999999999,0.26377296,0.26377296,4,12.116861,12.116861,9.0150250000000001E-2,9.0150250000000001E-2]
[null,"LX41","BAROSSA/MID NORTH & YORKE PENINSULA/RIVE","Rural Short",434.5,51.351140000000001,7.7545299999999999,4.0239004361440154,1.6914619528698631,6.6847183274022073E-2,8,189.44075000000001,163.06559300000001,1.34637516,1.3187571899999999,2,7.4867660000000003,7.4867660000000003,6.6743380000000005E-2,6.6743380000000005E-2]
[null,"LX42","BAROSSA/MID NORTH & YORKE PENINSULA/RIVE","Rural Short",307.5,28.97419,0.16541,1.5985096903053169,3.1440574979789047E-3,0,1,0.49756099999999998,0.49756099999999998,3.2520299999999999E-3,3.2520299999999999E-3]
[null,"LX43","BAROSSA/MID NORTH & YORKE PENINSULA/RIVE","Rural Short",951.5,33.9116,6.8551599999999997,5.9120090214748489,0.39430170650107166,0.19131487128224575,4,20.166049000000001,20.166049000000001,0.25783848999999998,0.25783848999999998,5,9.7845510000000004,9.7845510000000004,4.0987910000000002E-2,4.0987910000000002E-2]
[null,"LX48","BAROSSA/MID NORTH & YORKE PENINSULA/RIVE","Rural Short",60,69.387570000000011,0.92069000000000001,null,0.66121789615991644,0,2,536.28333299999997,536.28333299999997,1.51666667,1.51666667]
[null,"LX51","BAROSSA/MID NORTH & YORKE PENINSULA/RIVE","Rural Short",1621.5,26.320129999999999,4.67096,5.0489281040632772,0.63933277186031878,0.49704877621642973,9,19.187172,19.187172,1.13906876,1.13906876,3,14.917052,14.917052,0.11594203,0.11594203]
[null,"LX53","BAROSSA/MID NORTH & YORKE PENINSULA/RIVE","Rural Short",249,40.420919999999995,2.5347900000000001,3.0998513303060191,0.18315676130382991,0.4837327679896955,3,35.795180999999999,35.795180999999999,0.22489960000000001,0.22489960000000001,3,94.538152999999994,94.538152999999994,0.30522088000000003,0.30522088000000003]
[null,"LX54","BAROSSA/MID NORTH & YORKE PENINSULA/RIVE","Rural Short",68,99.085630000000009,null,null,1.607229863329569,0.21936479601911635,7,1150.191176,851.72058800000002,3.8970588199999998,3.0294117599999999,2,156.98529400000001,156.98529400000001,0.83823528999999997,0.83823528999999997]
[null,"LX61","BAROSSA/MID NORTH & YORKE PENINSULA/RIVE","Rural Long",78.5,87.424329999999998,null,null,7.3308765490417455E-2,0,2,50.598725999999999,50.598725999999999,0.44585986999999999,0.44585986999999999]
[null,"LX63","BAROSSA/MID NORTH & YORKE PENINSULA/RIVE","Rural Long",69.5,88.127420000000001,null,null,0.20900011591477527,0,2,162.93525199999999,162.93525199999999,0.54676259000000005,0.54676259000000005]
[null,"LX71","BAROSSA/MID NORTH & YORKE PENINSULA/RIVE","Rural Long",145,176.64373000000001,null,null,1.824875173178506,8.5083939806350581E-2,1,681.89655200000004,681.89655200000004,0.86206897000000005,0.86206897000000005,5,31.793102999999999,31.793102999999999,0.22068966000000001,0.22068966000000001]
[null,"LX73","BAROSSA/MID NORTH & YORKE PENINSULA/RIVE","Rural Long",52,109.87876,null,null,9.5604079869174824E-2,0,5,99.615385000000003,99.615385000000003,0.53846154000000002,0.53846154000000002]
[null,"LX75","BAROSSA/MID NORTH & YORKE PENINSULA/RIVE","Rural Long",52,73.30198,null,null,8.8221525439122726E-3,0,2,9.1923080000000006,9.1923080000000006,7.6923080000000005E-2,7.6923080000000005E-2]
[null,"LX76","BAROSSA/MID NORTH & YORKE PENINSULA/RIVE","Rural Long",68,119.15861,null,null,1.2406382719702571,0,4,988.52941199999998,988.52941199999998,3.1617647099999999,3.1617647099999999]
[null,"M01","BAROSSA/MID NORTH & YORKE PENINSULA/RIVE","Rural Long",101,73.995994824999997,null,null,1.0889267784326862E-3,0,2,0.58415799999999996,0.58415799999999996,2.9702969999999999E-2,2.9702969999999999E-2]
[null,"M02","BAROSSA/MID NORTH & YORKE PENINSULA/RIVE","Rural Short",2,1.3505499999999999,null,null,2.5810040637003293E-2,7.8087702564181944E-3,5,628,628,5,5,1,190,190,1,1]
[null,"M03","BAROSSA/MID NORTH & YORKE PENINSULA/RIVE","Rural Short",2.5,1.009E-2,0.83723999999999998,1.085995856345686,0.15091475990298742,7.8087702564181944E-3,8,2937.6,2937.6,9.1999999999999993,9.1999999999999993,1,152,152,0.8,0.8]
[null,"M04","BAROSSA/MID NORTH & YORKE PENINSULA/RIVE","Rural Long",114,59.559682065000004,null,null,1.6434858108321255,7.2164469553759377E-3,3,781.11403499999994,770.00877200000002,1.5438596499999999,1.5350877199999999,1,3.4298250000000001,3.4298250000000001,0.14912280999999999,0.14912280999999999]
[null,"M05","BAROSSA/MID NORTH & YORKE PENINSULA/RIVE","Rural Long",4.5,2.0994866740000004,null,null,8.8406089299874022E-2,0,2,1064.444444,1064.444444,2.2222222199999999,2.2222222199999999]
[null,"M101","BAROSSA/MID NORTH & YORKE PENINSULA/RIVE","Rural Long",47,5.4258324839999998,null,null,0.28193979576425032,0,3,325.02132499999999,325.02132499999999,2.4255321699999999,2.4255321699999999]
[null,"M11","BAROSSA/MID NORTH & YORKE PENINSULA/RIVE","Rural Long",710,17.283355021999999,1.3434200000000001,1.6099065846191196,0.75652726521959002,1.4934723048134668,5,57.732393999999999,57.732393999999999,0.21267606,0.21267606,5,113.970423,113.970423,0.58591548999999998,0.58591548999999998]
[null,"M13","BAROSSA/MID NORTH & YORKE PENINSULA/RIVE","Rural Long",935.5,13.908462763999999,7.0522300000000007,2.4905504972194397,3.1278590658541492,0.32306058185908032,4,181.157667,108.66701999999999,1.05469444,1.0065918300000001,6,18.710850000000001,18.710850000000001,9.4067339999999999E-2,9.4067339999999999E-2]
[null,"M14","BAROSSA/MID NORTH & YORKE PENINSULA/RIVE","Rural Long",11,3.271514555,null,null,8.2426220211531814E-2,8.0396017743267489E-2,3,406,406,3,3,2,396,396,2,2]
[null,"M21","BAROSSA/MID NORTH & YORKE PENINSULA/RIVE","Rural Long",618,74.412139410999998,0.47527999999999998,1.9909924033004245,6.0448972232652247,4.3940779403809413,17,529.97304299999996,374.54747700000001,2.9169364199999999,2.4088457999999999,9,385.24110000000002,385.24110000000002,1.1100323599999999,1.1100323599999999]
[null,"M22","BAROSSA/MID NORTH & YORKE PENINSULA/RIVE","Rural Long",76,51.876377603999998,0.14493,null,0.64254062481958552,3.6543644428757949E-3,4,458.07894700000003,93.078946999999999,1.9078947399999999,0.94736841999999999,1,2.6052629999999999,2.6052629999999999,0.11842105,0.11842105]
[null,"M23","BAROSSA/MID NORTH & YORKE PENINSULA/RIVE","Rural Long",132.5,86.293439929999991,1.1073599999999999,null,2.2700616616967233,3.0822164745467557E-3,4,928.27169800000001,928.27169800000001,3.3660377399999999,3.3660377399999999,2,1.2603770000000001,1.2603770000000001,1.5094339999999999E-2,1.5094339999999999E-2]
[null,"M31","BAROSSA/MID NORTH & YORKE PENINSULA/RIVE","Rural Long",42,0.98457292600000001,null,null,3.2298643332802357E-2,0,1,41.666625000000003,41.666625000000003,0.19841249999999999,0.19841249999999999]
[null,"M41","BAROSSA/MID NORTH & YORKE PENINSULA/RIVE","Rural Long",163,19.909190000000002,0.12520999999999999,null,4.1771415784538597,0,3,1388.4969329999999,124.650307,1.87730061,0.94478527999999995]
[null,"M42","BAROSSA/MID NORTH & YORKE PENINSULA/RIVE","Rural Long",57,17.38636,null,null,1.4242054878735029,0.17435747925175571,2,1353.7894739999999,97.578946999999999,1.89473684,0.94736841999999999,3,165.736842,165.736842,1.3157894699999999,1.3157894699999999]
[null,"M43","BAROSSA/MID NORTH & YORKE PENINSULA/RIVE","Rural Long",120,101.08361000000001,3.4729999999999997E-2,null,3.1482903366957227,9.9295357084200883E-2,2,1421.5,144.07499999999999,1.8666666700000001,0.94166667000000004,4,44.833333000000003,44.833333000000003,0.25833333000000003,0.25833333000000003]
[null,"M44","BAROSSA/MID NORTH & YORKE PENINSULA/RIVE","Rural Long",56,18.978110000000001,0.1767,null,1.5459991795832875,0,3,1495.8035709999999,193.48214300000001,2.9464285700000001,1.96428571]
[null,"M51","BAROSSA/MID NORTH & YORKE PENINSULA/RIVE","Rural Short",446,21.027180000000001,0.94769000000000003,1.4860995928940968,8.0329093937132452,1.9776532650195542,10,876.47384499999998,876.47384499999998,7.7122571300000002,7.7122571300000002,5,215.782511,215.782511,1.44618834,1.44618834]
[null,"M61","BAROSSA/MID NORTH & YORKE PENINSULA/RIVE","Rural Long",201,14.81926,null,null,0.46951200536523907,4.5956401327074382E-2,2,126.562189,126.562189,1.3333333300000001,1.3333333300000001,2,12.388059999999999,12.388059999999999,1.1243781100000001,1.1243781100000001]
[null,"M71","BAROSSA/MID NORTH & YORKE PENINSULA/RIVE","Rural Long",237.5,31.060650000000003,0.41720000000000002,3.1627247746207696,1.0471968895168167,1.3926081549128797,3,238.90105299999999,238.90105299999999,1.4021052599999999,1.4021052599999999,5,317.701053,317.701053,1.0063157899999999,1.0063157899999999]
[null,"M72","BAROSSA/MID NORTH & YORKE PENINSULA/RIVE","Rural Long",67,107.84048,null,null,0.12723832560194812,0.36322167795856386,4,102.895522,102.895522,1.01492537,1.01492537,1,293.73134299999998,293.73134299999998,0.89552239,0.89552239]
[null,"M73","BAROSSA/MID NORTH & YORKE PENINSULA/RIVE","Rural Long",82,137.00114000000002,null,null,1.329136643200507,0.47898013142178092,6,878.23170700000003,878.23170700000003,2.9634146299999999,2.9634146299999999,2,316.48780499999998,316.48780499999998,0.98780488,0.98780488]
[null,"M74","BAROSSA/MID NORTH & YORKE PENINSULA/RIVE","Rural Long",40,20.64329,null,null,7.1703059901881125E-2,3.0083909302462352E-3,1,97.125,97.125,0.92500000000000004,0.92500000000000004,2,4.0750000000000002,4.0750000000000002,0.95,0.95]
[null,"M81","BAROSSA/MID NORTH & YORKE PENINSULA/RIVE","Rural Long",416.5,31.672739999999997,0.73508000000000007,null,2.6007324133050482,0.40234921643784,5,338.324928,338.324928,2.5794317599999999,2.5794317599999999,4,52.340935999999999,52.340935999999999,1.15006002,1.15006002]
[null,"M82","BAROSSA/MID NORTH & YORKE PENINSULA/RIVE","Rural Long",16.5,13.19425,null,null,9.824334307791846E-2,8.1208098730573214E-4,3,322.60606100000001,322.60606100000001,2.06060606,2.06060606,1,2.6666669999999999,2.6666669999999999,0.66666667000000002,0.66666667000000002]
[null,"M83","BAROSSA/MID NORTH & YORKE PENINSULA/RIVE","Rural Long",102.5,54.668349999999997,null,null,0.61978390078894974,6.7365809174225501E-3,4,327.61951199999999,327.61951199999999,2.5951219499999998,2.5951219499999998,2,3.5609760000000001,3.5609760000000001,0.85853659000000004,0.85853659000000004]
[null,"M91","BAROSSA/MID NORTH & YORKE PENINSULA/RIVE","Rural Long",386.5,32.813699999999997,1.91076,1.2250795361934668,0.72356415315584655,0.18353030313109545,2,101.433376,101.433376,0.96507114000000005,0.96507114000000005,5,25.728331000000001,25.728331000000001,0.15265201,0.15265201]
[null,"M92","BAROSSA/MID NORTH & YORKE PENINSULA/RIVE","Rural Long",392.5,39.069870000000002,3.8353099999999998,null,2.8643572993511563,2.8171643141218103,7,395.40382199999999,395.40382199999999,1.9439490500000001,1.9439490500000001,3,388.88917199999997,388.88917199999997,0.95031847000000003,0.95031847000000003]
[null,"M93","BAROSSA/MID NORTH & YORKE PENINSULA/RIVE","Rural Long",76.5,104.842289885,null,null,1.2846013836012176,0.72644335591712772,6,909.83006499999999,909.83006499999999,3.0457516299999998,3.0457516299999998,4,514.50980400000003,514.50980400000003,1.9738562100000001,1.9738562100000001]
[null,"MB01","BAROSSA/MID NORTH & YORKE PENINSULA/RIVE","Rural Long",131,116.074243345,0.16275000000000001,null,7.0614133123448428E-2,9.156213131872129E-2,3,29.206106999999999,29.206106999999999,0.56488550000000004,0.56488550000000004,4,37.870229000000002,37.870229000000002,1.07633588,1.07633588]
[null,"MB02","BAROSSA/MID NORTH & YORKE PENINSULA/RIVE","Rural Long",120,109.625284143,null,null,0.60313624054918225,0,4,272.32499999999999,272.32499999999999,1.51666667,1.51666667]
[null,"MB03","BAROSSA/MID NORTH & YORKE PENINSULA/RIVE","Rural Long",109,131.13336636300002,null,null,0.45526367531523854,1.1055375259003035E-2,2,226.302752,226.302752,0.93577982000000004,0.93577982000000004,4,5.4954130000000001,5.4954130000000001,0.1559633,0.1559633]
[null,"MB11","BAROSSA/MID NORTH & YORKE PENINSULA/RIVE","Rural Long",667.5,4.6916533990000007,1.4712400000000001,4.4728854177633117,2.17748442914387,3.5048677156672398E-2,2,176.749064,48.808988999999997,1.0352059899999999,0.94382021999999999,1,2.8449439999999999,2.8449439999999999,0.94831460999999995,0.94831460999999995]
[null,"MB12","BAROSSA/MID NORTH & YORKE PENINSULA/RIVE","Rural Long",1791,21.606988602999998,2.0668800000000003,4.1610788601034709,5.6907143863616928E-2,0.58910938713208327,3,1.7215689999999999,1.7215689999999999,1.488925E-2,1.488925E-2,5,17.821887,17.821887,1.0100502499999999,1.0100502499999999]
[null,"MB123","BAROSSA/MID NORTH & YORKE PENINSULA/RIVE","Rural Long",98,105.79819970700001,null,null,2.2827965680885636,0,6,1262.1020410000001,1166.816327,2.53061224,2.0612244899999999]
[null,"MB13","BAROSSA/MID NORTH & YORKE PENINSULA/RIVE","Rural Long",1649,11.720255499999999,8.4191399999999987,3.2008298923872855,6.5926211060365336E-2,0.1353406790889303,6,2.1661609999999998,2.1661609999999998,2.546998E-2,2.546998E-2,4,4.4469380000000003,4.4469380000000003,0.98847786999999998,0.98847786999999998]
[null,"MB14","BAROSSA/MID NORTH & YORKE PENINSULA/RIVE","Rural Long",109,80.966628708000002,null,null,2.9530217720208444E-4,4.2984923168978416E-2,1,0.146789,0.146789,9.1743099999999998E-3,9.1743099999999998E-3,2,21.366972000000001,21.366972000000001,1.13761468,1.13761468]
[null,"MB15","BAROSSA/MID NORTH & YORKE PENINSULA/RIVE","Rural Long",938.5,4.326566723,7.5694800000000004,2.3034543689858502,0.94659112902128162,9.5844012888151517E-2,2,54.648907999999999,54.648907999999999,0.96856686000000003,0.96856686000000003,3,5.5332980000000003,5.5332980000000003,0.99307405000000004,0.99307405000000004]
[null,"MB16","BAROSSA/MID NORTH & YORKE PENINSULA/RIVE","Rural Long",38.5,5.7264964239999996,null,null,0,4.2634251833550936E-3,null,null,null,null,null,2,6,6,0.98701298999999998,0.98701298999999998]
[null,"MB17","BAROSSA/MID NORTH & YORKE PENINSULA/RIVE","Rural Long",505,2.5754996410000004,3.5565000000000002,3.7552593558900824,0,2.6521826789962209E-2,null,null,null,null,null,1,2.845545,2.845545,0.94851485000000002,0.94851485000000002]
[null,"MB20","BAROSSA/MID NORTH & YORKE PENINSULA/RIVE","Rural Short",193.5,8.0057971549999998,1.5650949189999999,1.7528354172597038,0.14783235059124339,3.3659909684244739E-2,2,37.178294999999999,37.178294999999999,0.97157623000000004,0.97157623000000004,3,8.4651160000000001,8.4651160000000001,2.5839790000000001E-2,2.5839790000000001E-2]
[null,"MB21","BAROSSA/MID NORTH & YORKE PENINSULA/RIVE","Urban",222,3.2634399219999999,0.20479,7.1637621401048763,0.22412335501289543,0,2,43.954954999999998,43.954954999999998,1.1531531500000001,1.1531531500000001]
[null,"MB22","BAROSSA/MID NORTH & YORKE PENINSULA/RIVE","Urban",1173.5,13.260247017999999,3.1490100000000001,5.0698859188348617,5.6318857853078619,0,6,208.95099500000001,166.95696000000001,2.8902144299999999,1.9358045500000001]
[null,"MB23","BAROSSA/MID NORTH & YORKE PENINSULA/RIVE","Rural Short",601,5.617162124,1.8325748020000001,5.9234405568048025,1.7374513820530482,0.30678192410017691,4,140.682196,36.069884000000002,1.9251247899999999,0.96505823999999996,3,24.840266,24.840266,9.6505820000000006E-2,9.6505820000000006E-2]
[null,"MB24","BAROSSA/MID NORTH & YORKE PENINSULA/RIVE","Rural Short",807,19.206112354000002,3.0798400000000004,null,9.5240077420312748,6.986794439953121E-4,2,574.31102899999996,35.624535000000002,1.94299876,0.96282528000000001,1,4.2131000000000002E-2,4.2131000000000002E-2,1.23916E-3,1.23916E-3]
[null,"MB25","BAROSSA/MID NORTH & YORKE PENINSULA/RIVE","Rural Long",71,40.850869122999995,null,null,2.6983236441840464E-2,3.5620825125001433E-3,2,20.591549000000001,20.591549000000001,5.6338029999999997E-2,5.6338029999999997E-2,1,2.7183099999999998,2.7183099999999998,1.408451E-2,1.408451E-2]
[null,"MB26","BAROSSA/MID NORTH & YORKE PENINSULA/RIVE","Rural Long",124,54.538012674999997,9.0519999999999989E-2,null,1.7401788174797332,2.4177865758420663E-2,9,760.37096799999995,760.37096799999995,3.33870968,3.33870968,2,10.564515999999999,10.564515999999999,0.99193547999999998,0.99193547999999998]
[null,"MB27","BAROSSA/MID NORTH & YORKE PENINSULA/RIVE","Rural Short",192.5,21.219183520000001,2.1682299999999999,null,2.0642689666795615,0,3,521.83896100000004,34.742857000000001,2.1194805200000002,0.91428571000000003]
[null,"MB28","BAROSSA/MID NORTH & YORKE PENINSULA/RIVE","Rural Short",320,48.859806035999995,1.7454700000000001,null,1.7675356969356699,1.9480826850222229E-2,7,268.79374999999999,172.875,2.7312500000000002,1.8,3,2.9624999999999999,2.9624999999999999,1.2500000000000001E-2,1.2500000000000001E-2]
[null,"MB31","BAROSSA/MID NORTH & YORKE PENINSULA/RIVE","Rural Long",243.5,19.712830936,0.13193000000000002,0.70494467868053301,2.1040280125648515E-3,0.1322215498422333,1,0.46817199999999998,0.46817199999999998,4.10678E-3,4.10678E-3,5,29.420945,29.420945,1.23203285,1.23203285]
[null,"MB32","BAROSSA/MID NORTH & YORKE PENINSULA/RIVE","Rural Long",344.5,30.448036781000003,null,1.9814661238587956,5.3493620272436084,2.8349009011400104E-2,4,841.32946300000003,104.725689,1.0537010200000001,0.53120464000000001,2,4.4586360000000003,4.4586360000000003,0.95791000999999998,0.95791000999999998]
[null,"MB33","BAROSSA/MID NORTH & YORKE PENINSULA/RIVE","Rural Long",54,71.624055494000004,null,null,1.5247189664386622,2.3901019967293706E-2,4,1529.851852,283.55555600000002,2.7777777800000001,1.8518518500000001,2,23.981480999999999,23.981480999999999,1.03703704,1.03703704]
[null,"MB34","BAROSSA/MID NORTH & YORKE PENINSULA/RIVE","Rural Long",76,74.368942913000012,0.24364,null,1.9914440575065568,9.2023540970599546E-2,2,1419.736842,268.55263200000002,1.71052632,0.85526316000000002,3,65.605262999999994,65.605262999999994,1.75,1.75]
[null,"MB41","BAROSSA/MID NORTH & YORKE PENINSULA/RIVE","Rural Long",275.5,7.5799236969999999,1.0118799999999999,null,1.2045375808073024,0,2,236.892922,236.892922,0.96914701000000003,0.96914701000000003]
[null,"MB42","BAROSSA/MID NORTH & YORKE PENINSULA/RIVE","Rural Long",78,130.25627820899999,null,null,0.31567802742902823,4.6140965187825688E-3,2,219.282051,219.282051,0.92307691999999997,0.92307691999999997,1,3.2051280000000002,3.2051280000000002,2.5641029999999999E-2,2.5641029999999999E-2]
[null,"MB43","BAROSSA/MID NORTH & YORKE PENINSULA/RIVE","Rural Long",95,129.07244103099998,null,null,2.4545701532898008,4.2708077377851456E-2,4,1399.926316,1399.926316,2.8315789499999999,2.8315789499999999,1,24.357894999999999,24.357894999999999,0.93684210999999995,0.93684210999999995]
[null,"MB44","BAROSSA/MID NORTH & YORKE PENINSULA/RIVE","Rural Long",69,84.692540397000002,null,null,0.33239951321309624,0.11278697530512112,2,261.01449300000002,261.01449300000002,1.8405797100000001,1.8405797100000001,1,88.565217000000004,88.565217000000004,0.91304348000000002,0.91304348000000002]
[null,"MB61","BAROSSA/MID NORTH & YORKE PENINSULA/RIVE","Rural Long",499,7.8735887890000003,0.35452,null,0.12541114338051024,0.41800023182955054,4,13.617234,13.617234,1.06012024,1.06012024,3,45.386774000000003,45.386774000000003,0.31462926000000002,0.31462926000000002]
[null,"MB62","BAROSSA/MID NORTH & YORKE PENINSULA/RIVE","Rural Long",380,11.785519824000001,2.243071424,2.1376971067015083,0.16476021666721685,5.2010095959717118E-2,3,23.492114000000001,23.492114000000001,1.3973686299999999,1.3973686299999999,3,7.4157890000000002,7.4157890000000002,7.1052630000000006E-2,7.1052630000000006E-2]
[null,"MB63","BAROSSA/MID NORTH & YORKE PENINSULA/RIVE","Rural Long",214,27.845434974,2.50875,null,1.1621187465965812,9.822488669184333E-2,5,294.23211099999997,294.23211099999997,4.63395665,4.63395665,3,24.869159,24.869159,0.14953271000000001,0.14953271000000001]
[null,"MB64","BAROSSA/MID NORTH & YORKE PENINSULA/RIVE","Rural Long",93,46.574000547000004,0.11488,null,7.1057086389251563E-3,0.22149508928763842,1,4.1397849999999998,4.1397849999999998,0.82795699,0.82795699,4,129.04301100000001,129.04301100000001,1.83870968,1.83870968]
[null,"MB65","BAROSSA/MID NORTH & YORKE PENINSULA/RIVE","Rural Long",83.5,77.102692609999991,0.1406,null,8.508393980635057E-3,1.3602356537371013E-2,2,5.5209580000000003,5.5209580000000003,0.94610777999999995,0.94610777999999995,3,8.8263470000000002,8.8263470000000002,4.7904189999999999E-2,4.7904189999999999E-2]
[null,"MB71","BAROSSA/MID NORTH & YORKE PENINSULA/RIVE","Rural Long",170.5,20.526057947000002,0.43814999999999998,0.4953665309646989,1.174306020416239,0.70992489037988604,5,373.17302100000001,373.17302100000001,3.4721407599999998,3.4721407599999998,4,225.60117299999999,225.60117299999999,0.93841642000000003,0.93841642000000003]
[null,"MB72","BAROSSA/MID NORTH & YORKE PENINSULA/RIVE","Rural Long",287.5,32.513082082000004,0.46718999999999999,1.2574688862950048,1.7887006564712506,1.2169033594776397,5,337.09565199999997,337.09565199999997,3.1860869599999999,3.1860869599999999,2,229.33565200000001,229.33565200000001,0.94956521999999999,0.94956521999999999]
[null,"MB81","BAROSSA/MID NORTH & YORKE PENINSULA/RIVE","Rural Long",293,33.038569904999996,1.0946999999999998,1.8480982116759919,2.2512545988599881,1.4229873663925443E-2,7,416.30375299999997,416.30375299999997,2.8839590400000001,2.8839590400000001,1,2.631399,2.631399,1.023891E-2,1.023891E-2]
[null,"MB82","BAROSSA/MID NORTH & YORKE PENINSULA/RIVE","Rural Long",158.5,31.169802258999997,null,null,2.4095550313438352,0.68563628630501472,6,823.68454399999996,823.68454399999996,2.89589907,2.89589907,2,234.37854899999999,234.37854899999999,1.20504732,1.20504732]
[null,"MB83","BAROSSA/MID NORTH & YORKE PENINSULA/RIVE","Rural Long",80,60.031382280999999,null,null,0.84504409283591486,0,6,572.32500000000005,572.32500000000005,2.8624999999999998,2.8624999999999998]
[null,"MB84","BAROSSA/MID NORTH & YORKE PENINSULA/RIVE","Rural Long",4,2.1872400000000001,2.7425900000000003,1.9433610060922801,8.8959780882127935E-3,2.7684579112695413E-2,1,120.5,120.5,0.5,0.5,3,375,375,3,3]
[null,"MB91","BAROSSA/MID NORTH & YORKE PENINSULA/RIVE","Rural Long",95,18.901274222000001,1.3572899999999999,2.667358243656071,0.13541450463323085,6.0721510187178605E-2,3,77.231578999999996,77.231578999999996,0.11578947000000001,0.11578947000000001,2,34.631579000000002,34.631579000000002,0.14736842,0.14736842]
[null,"MB92","BAROSSA/MID NORTH & YORKE PENINSULA/RIVE","Rural Long",68.5,32.682299447999995,5.3446400000000001,3.3913554812198612,0,0.10996314823562618,null,null,null,null,null,6,86.978102000000007,86.978102000000007,0.20437955999999999,0.20437955999999999]
[null,"MB93","BAROSSA/MID NORTH & YORKE PENINSULA/RIVE","Rural Long",36.5,28.377455216999998,null,null,0,3.9865793922281394E-3,null,null,null,null,null,1,5.917808,5.917808,5.4794519999999999E-2,5.4794519999999999E-2]
[null,"ME116A","MAJOR METROPOLITAN AREAS","Urban",899.5,3.3542143779999996,1.7367897999999999,3.3723029223366043,0.55638842811319356,3.9392470275575615,3,26.930885,26.930885,1.02204925,1.02204925,6,190.67148399999999,190.67148399999999,0.72929405000000003,0.72929405000000003]
[null,"ME116B","MAJOR METROPOLITAN AREAS","Urban",1066.5,3.5063827879999998,3.4690500000000002,5.6871888266524087,1.6427673798450484,0.4874763360108314,5,67.063916000000006,67.063916000000006,1.1086107199999999,1.1086107199999999,2,19.900608999999999,19.900608999999999,0.10501641,0.10501641]
[null,"ME116C","MAJOR METROPOLITAN AREAS","Urban",1608.5,3.648203042,2.3992480409999999,5.6205048705610059,3.3064970362858395,0.50010882681397684,6,89.499533,24.019894000000001,1.95482333,0.97751527999999999,1,13.536835999999999,13.536835999999999,3.5436740000000001E-2,3.5436740000000001E-2]
[null,"ME116D","MAJOR METROPOLITAN AREAS","Urban",1275,4.153486225,1.0426064060000002,3.867669453301303,2.5882365724229666,0.91652166001584134,3,88.382745,23.529411,1.9207843,0.96705881000000005,2,31.297255,31.297255,9.7254900000000005E-2,9.7254900000000005E-2]
[null,"ME131A","MAJOR METROPOLITAN AREAS","Urban",1618,7.5732530809999998,0.98254134900000001,5.102275268936399,3.2789121405562103,1.2938886125534383,9,88.231763999999998,88.231763999999998,2.1075401500000002,2.1075401500000002,3,34.817058000000003,34.817058000000003,0.16007416999999999,0.16007416999999999]
[null,"ME131B","MAJOR METROPOLITAN AREAS","Urban",1586,5.6214801239999996,0.63412000000000002,3.4866182756361499,3.2116384984049864,3.3174758302267464,9,88.165194999999997,88.165194999999997,1.39785622,1.39785622,6,91.070617999999996,91.070617999999996,0.38209332000000001,0.38209332000000001]
[null,"ME131C","MAJOR METROPOLITAN AREAS","Urban",2558.5,9.8022781689999992,1.1864930390000001,5.8110304593935824,1.0106452079086674,13.630227894942884,12,17.198359,17.198359,1.09973291,1.09973291,24,231.948407,231.948407,1.1581004500000001,1.1581004500000001]
[null,"ME131D","MAJOR METROPOLITAN AREAS","Urban",662.5,5.0729657239999995,2.6288007209999997,4.2296680720831983,1.1321697621080811,2.4315018297894202,7,74.404527999999999,74.404527999999999,1.96679245,1.96679245,8,159.79471699999999,159.79471699999999,0.56754716999999999,0.56754716999999999]
[null,"ME131E","MAJOR METROPOLITAN AREAS","Urban",636.5,2.991331631,1.3214411079999999,3.7209647499002196,3.3143062234434119E-2,1.4735915362694554,2,2.2670859999999999,2.2670859999999999,1.04320503,1.04320503,6,100.798115,100.798115,0.47761194000000001,0.47761194000000001]
[null,"ME131F","MAJOR METROPOLITAN AREAS","Urban",1,null,4.5839699999999999,1.6194675050769001,4.5936330193255884E-5,8.1307304442062907E-3,1,2,2,1,1,1,354,354,1,1]
[null,"ME200A","MAJOR METROPOLITAN AREAS","Urban",958,3.8884011260000002,3.9628666509999997,7.9449170543184389,6.6272802643253952,2.8520719008737747,11,301.19206500000001,301.19206500000001,4.0340987799999999,4.0340987799999999,13,129.618998,129.618998,0.77348642999999995,0.77348642999999995]
[null,"ME200B","MAJOR METROPOLITAN AREAS","Urban",18,0.31990756199999998,4.1349346240000004,1.9624135649755379,3.3901011682622842E-2,0,1,82,82,1,1]
[null,"ME200C","MAJOR METROPOLITAN AREAS","Urban",69.5,2.9272962179999999,1.742570382,6.5731328147238894,4.1342702686289921E-3,0.14003690259414056,2,2.589928,2.589928,0.11031177,0.11031177,5,87.726618999999999,87.726618999999999,0.43165468000000001,0.43165468000000001]
[null,"ME200D","MAJOR METROPOLITAN AREAS","Urban",568,2.7867135629999997,3.6007505320000002,6.5540802558406313,3.5450214418390398,7.6461021606674409E-2,3,271.73415499999999,271.73415499999999,1.95774648,1.95774648,2,5.8609150000000003,5.8609150000000003,6.514085E-2,6.514085E-2]
[null,"ME200E","MAJOR METROPOLITAN AREAS","Urban",1587.5,5.3819040070000002,2.576734224,4.7040767882763141,0.3104147512809266,3.0656758362724141,1,8.5133860000000006,8.5133860000000006,5.3543309999999997E-2,5.3543309999999997E-2,8,84.078739999999996,84.078739999999996,0.32755906000000001,0.32755906000000001]
[null,"ME200F","MAJOR METROPOLITAN AREAS","Urban",924.5,3.915754266,1.5306191630000001,2.7391863906459526,2.305766485593141,0,7,108.58806800000001,108.58806800000001,2.18712821,2.18712821]
[null,"ME200G","MAJOR METROPOLITAN AREAS","Urban",1736.5,6.886753219,1.9569557119999998,7.1637621401048763,4.0038028518088664,5.8248415093303283,11,100.38564100000001,100.38564100000001,1.81245799,1.81245799,10,146.04376600000001,146.04376600000001,0.66743448999999999,0.66743448999999999]
[null,"ME200H","MAJOR METROPOLITAN AREAS","Urban",1,null,0.82900032199999996,2.7245159203058438,0,6.6377997129254745E-3,null,null,null,null,null,1,289,289,1,1]
[null,"ME231A","MAJOR METROPOLITAN AREAS","Urban",675,4.6264969960000002,2.1908888259999997,1.9243084472090224,7.1476904056361243E-2,2.7975225087692828E-2,3,4.6103690000000004,4.6103690000000004,0.99456789000000001,0.99456789000000001,2,1.8044439999999999,1.8044439999999999,2.518519E-2,2.518519E-2]
[null,"ME231B","MAJOR METROPOLITAN AREAS","Urban",831,4.212632782,2.1569797090000002,2.4558748400519113,9.7959224137118162E-2,7.053064137872509,4,5.132371,5.132371,1.0024067400000001,1.0024067400000001,17,369.530686,369.530686,1.3730445200000001,1.3730445200000001]
[null,"ME231C","MAJOR METROPOLITAN AREAS","Urban",640.5,3.6703620400000001,0.70352999999999999,2.0100449621836818,0.12650092116538322,1.8854566727821878,4,8.5990059999999993,8.5990059999999993,1.06115008,1.06115008,6,128.16549599999999,128.16549599999999,0.59328649,0.59328649]
[null,"ME231D","MAJOR METROPOLITAN AREAS","Urban",1668,3.5811703309999996,1.828792274,5.7595885504087869,0.12340795106418193,4.7682140422250576,3,3.2212230000000002,3.2212230000000002,0.96642686,0.96642686,10,124.46103100000001,124.46103100000001,0.41426858999999999,0.41426858999999999]
[null,"ME231E","MAJOR METROPOLITAN AREAS","Urban",1229.5,3.8277856610000001,1.79164301,3.3913554812198612,1.8722348772936745,10.178847662202797,5,66.298773999999995,66.298773999999995,1.25552397,1.25552397,21,360.44896299999999,360.44896299999999,1.5965839799999999,1.5965839799999999]
[null,"ME231F","MAJOR METROPOLITAN AREAS","Urban",526.5,1.9326480989999999,0.89504995899999995,2.1396023625898337,4.0446938735161808E-2,0.29895363689770926,2,3.3447290000000001,3.3447290000000001,0.99145298999999998,0.99145298999999998,2,24.721747000000001,24.721747000000001,9.3067430000000007E-2,9.3067430000000007E-2]
[null,"ME347A","MAJOR METROPOLITAN AREAS","Urban",1467,4.3919584050000005,3.3482738649999999,5.567557809424434,0.11245218608510414,1.2852066461469129,4,3.3374250000000001,3.3374250000000001,1.7041589999999999E-2,1.7041589999999999E-2,2,38.143149000000001,38.143149000000001,0.14860259000000001,0.14860259000000001]
[null,"ME347B","MAJOR METROPOLITAN AREAS","Urban",1056,4.006005644,3.0907973419999997,3.416866857564544,2.0876988118183948,0.68592128244569683,4,86.075118000000003,86.075118000000003,1.0372474199999999,1.0372474199999999,2,28.280303,28.280303,0.18087121,0.18087121]
[null,"ME347C","MAJOR METROPOLITAN AREAS","Urban",2565,9.1045865789999993,1.817649112,7.0303942279220726,1.053082114186874,0,12,17.875104,17.875104,0.14671859000000001,0.14671859000000001]
[null,"ME347D","MAJOR METROPOLITAN AREAS","Urban",188,1.444572854,1.9967200000000001,1.8315853588918727,2.0671327915616558E-3,0.42442872282058774,1,0.47872300000000001,0.47872300000000001,8.8652399999999999E-3,8.8652399999999999E-3,2,98.292552999999998,98.292552999999998,0.28723404000000002,0.28723404000000002]
[null,"ME347E","MAJOR METROPOLITAN AREAS","Urban",248.5,1.49797604,1.5150763629999999,2.8136818958794896,3.0777341229481442E-3,0.12540618142758855,1,0.53923500000000002,0.53923500000000002,4.0241399999999998E-3,4.0241399999999998E-3,1,21.971831000000002,21.971831000000002,0.24144868999999999,0.24144868999999999]
[null,"ME347F","MAJOR METROPOLITAN AREAS","Urban",835,5.8001557019999996,1.7862808610000001,4.6595509581661396,2.4356207237902439,0.94082197868807371,11,126.998001,126.998001,1.3465069599999999,1.3465069599999999,7,49.056286999999998,49.056286999999998,0.27664671000000002,0.27664671000000002]
[null,"ME347G","MAJOR METROPOLITAN AREAS","Urban",1471.5,6.6613299720000008,1.548156007,6.5648640041685535,1.0292953378010803,0.18080539564065515,4,30.454637999999999,30.454637999999999,0.12096498999999999,0.12096498999999999,1,5.3496430000000004,5.3496430000000004,5.5725450000000003E-2,5.5725450000000003E-2]
[null,"ME427A","MAJOR METROPOLITAN AREAS","Urban",423,3.7568382369999997,2.9147042489999997,7.7408069910021,1.8081917653971311,0,6,186.11347499999999,186.11347499999999,1.9952718700000001,1.9952718700000001]
[null,"ME427C","MAJOR METROPOLITAN AREAS","Urban",110.5,0.60284231200000005,4.1132858909999994,7.428211657404491,0.1939891224061196,0,1,76.434388999999996,76.434388999999996,0.93212669999999997,0.93212669999999997]
[null,"ME427D","MAJOR METROPOLITAN AREAS","Urban",1022.5,3.933544275,3.4137740399999998,4.8084086007210329,1.8052971334863336E-2,7.6914642867332814,3,0.76870400000000005,0.76870400000000005,5.2159700000000003E-3,5.2159700000000003E-3,15,327.50611199999997,327.50611199999997,1.4376528099999999,1.4376528099999999]
[null,"ME427E","MAJOR METROPOLITAN AREAS","Urban",2267.5,8.8604032579999998,2.78315,6.9816577822986998,0.43147995841690057,5.8900481300396557,6,8.2848950000000006,8.2848950000000006,8.7467840000000005E-2,8.7467840000000005E-2,13,113.09547999999999,113.09547999999999,0.47012127999999997,0.47012127999999997]
[null,"ME427F","MAJOR METROPOLITAN AREAS","Urban",1575.5,9.5119776240000018,3.0663231359999998,6.728601695211271,0.42145050497962494,0.53752396775638378,6,11.646673,11.646673,0.12588595,0.12588595,3,14.854331999999999,14.854331999999999,0.12630911,0.12630911]
[null,"MG02","SOUTH EAST","Rural Long",144,48.603209999999997,2.0466500000000001,null,1.6746155825904789,2.399330189766936E-3,8,630.09490800000003,630.09490800000003,4.9537038100000004,4.9537038100000004,2,0.90277799999999997,0.90277799999999997,1.3888889999999999E-2,1.3888889999999999E-2]
[null,"MG03","SOUTH EAST","Rural Short",349.5,61.253530832999999,0.50597000000000003,null,0.22852982637270194,1.3542668058124427,1,31.819742000000002,31.819742000000002,0.96423462000000004,0.96423462000000004,5,188.56366199999999,188.56366199999999,0.59799714000000004,0.59799714000000004]
[null,"MG04","SOUTH EAST","Rural Short",659.5,54.144635230999995,5.1615900000000003,null,2.1787496485177344,3.3248921776012207E-2,7,160.76573200000001,160.76573200000001,2.2365428399999998,2.2365428399999998,4,2.4533740000000002,2.4533740000000002,1.21304E-2,1.21304E-2]
[null,"MG05","SOUTH EAST","Rural Long",489.5,70.135270323,4.5715070029999998,3.6027055169118389,4.2222244827696329,1.0798462364837222,7,467.34968800000001,467.34968800000001,4.9765069500000001,4.9765069500000001,14,119.52604700000001,119.52604700000001,0.45352399999999998,0.45352399999999998]
[null,"MG06","SOUTH EAST","Rural Short",395,62.961220000000004,2.9993600000000002,null,1.3141271652534143,1.7412324708087876,6,161.89791199999999,161.89791199999999,1.1966246599999999,1.1966246599999999,3,214.51645600000001,214.51645600000001,0.97974684000000001,0.97974684000000001]
[null,"MG07","SOUTH EAST","Rural Short",283.5,30.752660000000002,1.3073899999999998,null,0.59211027939061533,0.47399235456458438,5,101.636684,101.636684,1.90828924,1.90828924,2,81.361552000000003,81.361552000000003,1.8624338600000001,1.8624338600000001]
[null,"MG09","SOUTH EAST","Rural Short",344.5,46.862470000000002,1.56996,null,0.31294674272366491,6.8758277047303362E-2,6,44.206096000000002,44.206096000000002,1.03338171,1.03338171,2,9.7126269999999995,9.7126269999999995,0.16835994000000001,0.16835994000000001]
[null,"MG10","SOUTH EAST","Rural Long",413.5,61.273139999999998,3.7751400000000004,null,5.3814824884725558,0.22247327774962034,16,705.14714400000003,705.14714400000003,7.74123378,7.74123378,2,29.151149,29.151149,0.12091898,0.12091898]
[null,"MG11","SOUTH EAST","Rural Short",1431.5,59.984014356000003,9.5629299999999997,2.553042890356525,0.27025889162756012,0.9917549213559339,4,9.1873360000000002,9.1873360000000002,0.68739114000000001,0.68739114000000001,4,33.714286000000001,33.714286000000001,0.14320643,0.14320643]
[null,"MG12","SOUTH EAST","Rural Long",277,41.225299999999997,0.26086999999999999,null,1.4237625346076999,0,1,278.49097499999999,278.49097499999999,0.93140794000000005,0.93140794000000005]
[null,"MG13","SOUTH EAST","Rural Short",127.5,70.93956,3.4730799999999999,null,0.25654552105691264,5.9141159994662011E-2,5,97.916347000000002,97.916347000000002,1.1790849999999999,1.1790849999999999,3,22.572548999999999,22.572548999999999,7.843137E-2,7.843137E-2]
[null,"MG14","SOUTH EAST","Rural Long",51.5,40.11027,null,null,0.28022330977870297,0,2,294.81553400000001,294.81553400000001,1.2233009699999999,1.2233009699999999]
[null,"MG15","SOUTH EAST","Rural Short",26,15.920170000000001,null,null,0.42814665340124497,0,6,801.34615399999996,801.34615399999996,4.3461538500000003,4.3461538500000003]
[null,"MG16","SOUTH EAST","Rural Long",27.5,22.377670000000002,1.03417,null,0.10682556260285404,0.13373497350039398,2,210.47272699999999,210.47272699999999,2,2,3,263.49090899999999,263.49090899999999,2.0363636399999998,2.0363636399999998]
[null,"MG17","SOUTH EAST","Rural Long",703.5,29.06861,2.8102399999999998,2.4558748400519113,11.898149237539641,2.1435985043099306,15,916.365318,916.365318,3.7507699699999999,3.7507699699999999,3,165.094527,165.094527,1.9445629,1.9445629]
[null,"MG18","SOUTH EAST","Rural Long",52,29.623450000000002,null,null,0.68521181701758394,0,8,713.96156699999995,713.96156699999995,6.6923079799999998,6.6923079799999998]
[null,"MG19","SOUTH EAST","Rural Long",200,61.259880000000003,3.6831999999999998,2.4044329310671158,3.1394067493761266,0.61498524040941593,12,850.49335699999995,850.49335699999995,4.8583333900000003,4.8583333900000003,5,166.60499999999999,166.60499999999999,1.95,1.95]
[null,"MG20","SOUTH EAST","Rural Long",55.5,28.753509999999999,null,null,0.51943652969846654,0.16741787808750674,4,507.09909900000002,507.09909900000002,3.6576576599999999,3.6576576599999999,2,163.441441,163.441441,1.9279279300000001,1.9279279300000001]
[null,"MG21","SOUTH EAST","Rural Long",72.5,36.7179,null,null,1.0336929332756308,0.23061254400875281,8,772.51491699999997,772.51491699999997,4.14252866,4.14252866,3,172.34482800000001,172.34482800000001,2,2]
[null,"MG22","SOUTH EAST","Rural Long",1009,55.807060698999997,2.08406,2.398717163402138,4.4287574705476436,5.9798690883422099E-3,5,237.81764000000001,237.81764000000001,0.85761478000000002,0.85761478000000002,1,0.32111000000000001,0.32111000000000001,9.9108000000000009E-4,9.9108000000000009E-4]
[null,"MG23","SOUTH EAST","Rural Short",261,4.0697380480000005,1.2241500000000001,1.1431535329954587,0.50222722386015961,0,7,93.639847000000003,93.639847000000003,0.44444444,0.44444444]
[null,"MG24","SOUTH EAST","Rural Short",52,39.984919999999995,null,null,0.12194011087248773,0.24346923683695465,5,114.11538299999999,114.11538299999999,2.0192307500000002,2.0192307500000002,3,227.84615400000001,227.84615400000001,2.8653846199999999,2.8653846199999999]
[null,"MG25","SOUTH EAST","Rural Long",26,15.490770000000001,null,null,9.2743340027529639E-2,0.16937425501147055,2,193.26923099999999,193.26923099999999,1.92307692,1.92307692,5,352.96153800000002,352.96153800000002,2.4230769200000002,2.4230769200000002]
[null,"MG26","SOUTH EAST","Rural Long",33,31.658529999999999,0.26774000000000003,null,0.20625013349194043,4.9463114681349138E-3,3,338.63639499999999,338.63639499999999,1.4848486700000001,1.4848486700000001,1,8.1212119999999999,8.1212119999999999,6.0606060000000003E-2,6.0606060000000003E-2]
[null,"MG27","SOUTH EAST","Rural Long",96.5,62.457709999999999,null,null,1.4907223032882724,0,7,836.99481900000001,836.99481900000001,2.7875647699999999,2.7875647699999999]
[null,"MG28","SOUTH EAST","Rural Long",81.5,60.053730000000002,0.59026000000000001,null,0,0.17118298084683331,null,null,null,null,null,1,113.803681,113.803681,0.65030675000000004,0.65030675000000004]
[null,"MG29","SOUTH EAST","Rural Long",126.5,80.617080000000001,0.43570999999999999,null,1.2300073935909821,7.4748363604277612E-2,3,526.83004000000005,526.83004000000005,2.8300395300000001,2.8300395300000001,2,32.015810000000002,32.015810000000002,0.16600791000000001,0.16600791000000001]
[null,"MG30","SOUTH EAST","Rural Long",68,35.894280000000002,0.98355999999999999,null,0.24484241767267823,0.32891125624489664,2,195.088235,195.088235,1.94117647,1.94117647,2,262.07352900000001,262.07352900000001,1.95588235,1.95588235]
[null,"MG31","SOUTH EAST","Rural Long",97,38.129089999999998,null,null,1.8628639304892832E-2,0.25547329605195329,4,10.405495,10.405495,0.99312712000000003,0.99312712000000003,3,142.701031,142.701031,1.4020618600000001,1.4020618600000001]
[null,"MG32","SOUTH EAST","Rural Long",258.5,18.203400000000002,0.19828999999999999,null,3.1160162550107704,1.2273127612240131,9,653.11927500000002,653.11927500000002,3.9264990000000002,3.9264990000000002,2,257.24564800000002,257.24564800000002,1.92649903,1.92649903]
[null,"MG33","SOUTH EAST","Rural Long",63.5,30.993819999999999,0.14749999999999999,null,0.83262298363656817,2.7407733321568463E-2,9,710.44097799999997,710.44097799999997,6.6456696199999996,6.6456696199999996,1,23.385826999999999,23.385826999999999,0.23622046999999999,0.23622046999999999]
[null,"MG34","SOUTH EAST","Rural Long",155.5,53.796779999999998,6.6783000000000001,3.0293568624379663,2.9965419335974124,7.2349033414510679E-3,15,1044.102895,1044.102895,7.1704180199999996,7.1704180199999996,2,2.5209000000000001,2.5209000000000001,0.98392283000000003,0.98392283000000003]
[null,"MG35","SOUTH EAST","Rural Long",188,19.755240000000001,0.2445,null,2.3160303645004188,0.62185101602936443,7,667.48226899999997,667.48226899999997,3.9166666600000002,3.9166666600000002,4,179.218085,179.218085,1.9734042599999999,1.9734042599999999]
[null,"MG36","SOUTH EAST","Rural Long",163,17.857509999999998,0.87351000000000001,null,0.65459264492664548,0.48678718273156102,3,217.58895699999999,217.58895699999999,2.88343558,2.88343558,2,161.80981600000001,161.80981600000001,1.9202454,1.9202454]
[null,"MG37","SOUTH EAST","Rural Long",114,22.670400000000001,null,null,3.6995579631975479,0.98372537780444369,12,1758.321629,1758.321629,7.8830408900000002,7.8830408900000002,3,467.54386,467.54386,2.7017543900000001,2.7017543900000001]
[null,"MG38","SOUTH EAST","Rural Short",881,18.948123102,5.58535,3.2198824512705424,0.15611375694212898,0,1,8.6231559999999998,8.6231559999999998,0.98070374999999999,0.98070374999999999]
[null,"MG39","MAJOR METROPOLITAN AREAS","Rural Short",1075,4.446220566,5.8703100430000008,3.8486168944180448,2.6180691859771006,2.7483377905372066,7,118.515078,118.515078,1.1600000699999999,1.1600000699999999,15,124.412093,124.412093,1.0809302300000001,1.0809302300000001]
[null,"MG40","MAJOR METROPOLITAN AREAS","Urban",1,1.1056355610000002,0.11339,4.3766204587497644,3.2385112786245396E-3,0,1,141,141,1,1]
[null,"MG41","MAJOR METROPOLITAN AREAS","Urban",1704.5,7.9734229209999992,11.320511386,3.3496494298244106,5.3368062441702797,1.1286096965181038,2,136.31954500000001,136.31954500000001,0.98367066999999997,0.98367066999999997,4,28.828395,28.828395,9.9149310000000004E-2,9.9149310000000004E-2]
[null,"MG42","MAJOR METROPOLITAN AREAS","Rural Short",1246.5,11.595685679999999,11.917619999999999,2.7349376700149857,1.9659606590303387,0,5,76.750902999999994,76.750902999999994,1.3221018899999999,1.3221018899999999]
[null,"MG43","MAJOR METROPOLITAN AREAS","Urban",1575,8.4929232250000002,2.2408000000000001,2.9588052368932631,6.7664367923740043,0.78087167695515669,6,187.048044,187.048044,1.0230687999999999,1.0230687999999999,1,21.586031999999999,21.586031999999999,5.650794E-2,5.650794E-2]
[null,"MG44","MAJOR METROPOLITAN AREAS","Urban",1649,9.6668363089999989,2.3877299999999999,4.391519559796472,8.266403448350724,0.63966339794108817,9,218.257733,218.257733,1.95633718,1.95633718,4,16.889023999999999,16.889023999999999,0.12795634,0.12795634]
[null,"MG45","MAJOR METROPOLITAN AREAS","Urban",1052,5.2833327319999999,3.9608699999999999,4.279738196828399,3.3516830495129448,7.0558203176841028E-2,4,138.71419399999999,138.71419399999999,1.01901138,1.01901138,2,2.9201519999999999,2.9201519999999999,3.992395E-2,3.992395E-2]
[null,"MG46","MAJOR METROPOLITAN AREAS","Rural Short",1455.5,9.4867579020000008,3.9908620639999999,4.1888765435141444,3.1260425004788885,0.45650481906928997,5,104.51620200000001,104.51620200000001,1.8978586900000001,1.8978586900000001,3,15.262796,15.262796,0.14496737000000001,0.14496737000000001]
[null,"MG48","SOUTH EAST","Rural Long",101,11.91578,null,null,1.1026952424447334,0.47623012989658647,5,591.54455399999995,591.54455399999995,2.9306930699999998,2.9306930699999998,2,255.47524799999999,255.47524799999999,1.93069307,1.93069307]
[null,"MG49","SOUTH EAST","Rural Long",53,21.239939999999997,null,null,0.23476523087565712,9.7818846198190462E-4,2,240,240,2,2,1,1,1,1,1]
[null,"MG51","SOUTH EAST","Rural Long",14,0.64522999999999997,null,null,0.21265448035765105,6.838091040835767E-2,3,823,823,3,3,5,264.64285699999999,264.64285699999999,4.5714285700000001,4.5714285700000001]
[null,"MG52","MAJOR METROPOLITAN AREAS","Urban",1731,12.836980071999999,4.49953,5.3918741639619148,1.6583015199765374E-2,0.13011465527239729,3,0.41710000000000003,0.41710000000000003,2.3108E-3,2.3108E-3,2,3.272675,3.272675,1.2709420000000001E-2,1.2709420000000001E-2]
[null,"MI01","SOUTH EAST","Rural Long",836,11.243129999999999,0.82945000000000002,1.8671507705592496,9.5419516008423532E-3,0.3006545291638722,1,0.618421,0.618421,1.1961700000000001E-3,1.1961700000000001E-3,3,19.485645999999999,19.485645999999999,0.1076555,0.1076555]
[null,"MI02","SOUTH EAST","Rural Short",240.5,45.71613,0.59326999999999996,null,0.14768851172795888,0.24842164113115672,6,29.883576999999999,29.883576999999999,0.22591823999999999,0.22591823999999999,8,50.266112,50.266112,2.0873180900000001,2.0873180900000001]
[null,"MI03","SOUTH EAST","Rural Long",105,49.275230000000001,null,null,0.45297508344192233,0.46831234027035562,4,233.74285699999999,233.74285699999999,1.53333333,1.53333333,4,241.65714299999999,241.65714299999999,1.75238095,1.75238095]
[null,"MI04","SOUTH EAST","Rural Long",52,23.690549999999998,null,null,5.2785264174872587E-3,0.20488434182002119,1,5.5,5.5,3.8461540000000002E-2,3.8461540000000002E-2,2,213.48076900000001,213.48076900000001,1.57692308,1.57692308]
[null,"MI06","SOUTH EAST","Rural Long",59,31.159869999999998,null,null,0.22693972317980185,0,1,208.40678,208.40678,0.98305085000000003,0.98305085000000003]
[null,"MI08","SOUTH EAST","Rural Long",1080,13.38875,4.1123100000000008,2.9670723153977896,2.3957127317472136,0.49522175116789557,5,120.188889,120.188889,0.78302468999999997,0.78302468999999997,7,24.844443999999999,24.844443999999999,0.1287037,0.1287037]
[null,"MI09","SOUTH EAST","Rural Long",59,44.454819999999998,null,null,0.73059604278403201,0.14351685812021303,3,670.93220299999996,670.93220299999996,2.71186441,2.71186441,1,131.79660999999999,131.79660999999999,0.91525424,0.91525424]
[null,"MI10","SOUTH EAST","Rural Long",63,50.179639999999999,null,null,0.94756931748326356,0.24164946288168071,4,814.936508,814.936508,2.3809523800000001,2.3809523800000001,4,207.82539700000001,207.82539700000001,0.85714285999999995,0.85714285999999995]
[null,"MI12","SOUTH EAST","Rural Long",153.5,50.862430000000003,0.18026,null,2.2812093188861023E-2,2.5838940505182388E-4,1,8.0521170000000009,8.0521170000000009,3.9087950000000003E-2,3.9087950000000003E-2,1,9.1204999999999994E-2,9.1204999999999994E-2,6.5146600000000002E-3,6.5146600000000002E-3]
[null,"MI13","SOUTH EAST","Rural Long",370,10.352139999999999,0.95433000000000001,0.75822256152135159,3.3775186517488406E-3,0.40825525998188167,1,0.49459500000000001,0.49459500000000001,2.7027000000000002E-3,2.7027000000000002E-3,4,59.783783999999997,59.783783999999997,0.31081080999999999,0.31081080999999999]
[null,"MI14","SOUTH EAST","Rural Long",604.5,20.457599999999999,0.31225999999999998,null,4.1757942622703759,1.5484538789312798,5,374.27956999999998,374.27956999999998,2.0595533499999998,2.0595533499999998,4,138.78908200000001,138.78908200000001,1.1910670000000001,1.1910670000000001]
[null,"MI15","SOUTH EAST","Rural Long",133.5,61.955870000000004,null,null,1.6006669951378234,5.8691307718914277E-3,3,649.64044899999999,649.64044899999999,1.7153558099999999,1.7153558099999999,2,2.3820220000000001,2.3820220000000001,2.2471910000000001E-2,2.2471910000000001E-2]
[null,"MI16","SOUTH EAST","Rural Long",294.5,22.0473,0.75253999999999999,null,9.2666192420296039,0.52761270872974919,7,1704.86248,1704.86248,4.0882852500000002,4.0882852500000002,2,97.069609999999997,97.069609999999997,0.30220712999999999,0.30220712999999999]
[null,"MI17","SOUTH EAST","Rural Long",109,71.74063000000001,1.2871400000000002,null,0.20248501163025423,1.277181916399015E-2,5,100.651376,100.651376,0.93577982000000004,0.93577982000000004,1,6.348624,6.348624,3.6697250000000001E-2,3.6697250000000001E-2]
[null,"MI18","SOUTH EAST","Rural Long",42.5,25.432119999999998,null,null,0.34199684117015455,1.4119135347474662E-2,3,436.00000899999998,436.00000899999998,1.7098040000000001,1.7098040000000001,1,18,18,0.4,0.4]
[null,"MI19","SOUTH EAST","Rural Long",100.5,51.400739999999999,0.15028,null,0,1.6610747467617247E-3,null,null,null,null,null,1,0.89552200000000004,0.89552200000000004,9.9502500000000008E-3,9.9502500000000008E-3]
[null,"MI20","SOUTH EAST","Rural Long",794,33.677810000000001,1.2782800000000001,2.2196231098995165,0.1118579993939232,0.5871530102081195,5,7.6330809999999998,7.6330809999999998,4.6179680000000001E-2,4.6179680000000001E-2,5,40.066750999999996,40.066750999999996,0.44080605,0.44080605]
[null,"MI21","SOUTH EAST","Rural Long",69,32.436529999999998,6.1869999999999994E-2,null,0.25558403436840404,0.26388940810221267,2,200.695652,200.695652,0.98550724999999995,0.98550724999999995,4,207.21739099999999,207.21739099999999,0.82608696000000004,0.82608696000000004]
[null,"MI22","SOUTH EAST","Rural Long",185.5,2.05111,9.7750000000000004E-2,null,0.70038293877904378,0,1,204.57142899999999,204.57142899999999,0.96495956999999999,0.96495956999999999]
[null,"MI23","SOUTH EAST","Rural Long",101,66.996320000000011,null,null,0.2460420827675617,0.30523171291050449,4,131.99009899999999,131.99009899999999,0.86138614000000002,0.86138614000000002,4,163.74257399999999,163.74257399999999,0.63366336999999995,0.63366336999999995]
[null,"MI24","SOUTH EAST","Rural Long",45,40.490459999999999,null,null,8.0156084798116325E-2,0,4,96.511111,96.511111,3.5777778699999998,3.5777778699999998]
[null,"MI25","SOUTH EAST","Rural Long",27.5,5.4699300000000006,null,null,4.7537501415386943E-2,2.5838940505182383E-2,2,93.660612,93.660612,0.739394,0.739394,1,50.909090999999997,50.909090999999997,0.90909090999999997,0.90909090999999997]
[null,"MI26","SOUTH EAST","Rural Long",84,68.891059999999996,null,null,0.50740296597748158,0.34365790871892576,3,327.28571399999998,327.28571399999998,2.1785714299999999,2.1785714299999999,2,221.66666699999999,221.66666699999999,1.80952381,1.80952381]
[null,"MI28","SOUTH EAST","Rural Long",59,39.829260000000005,null,null,0.22086757216108402,2.399330189766936E-3,2,202.83050800000001,202.83050800000001,0.94915254000000004,0.94915254000000004,1,2.2033900000000002,2.2033900000000002,3.3898310000000001E-2,3.3898310000000001E-2]
[null,"MI29","SOUTH EAST","Urban",1.5,2.3433099999999998,1.4548599999999998,null,0,9.9681836519365258E-3,null,null,null,null,null,1,289.33333299999998,289.33333299999998,1.3333333300000001,1.3333333300000001]
[null,"MI30","SOUTH EAST","Rural Long",43,36.966000000000001,null,null,0.31890789499217603,5.2563787541971024E-2,4,401.83720899999997,401.83720899999997,1.0697674399999999,1.0697674399999999,3,66.232557999999997,66.232557999999997,0.27906976999999999,0.27906976999999999]
[null,"MI31","SOUTH EAST","Rural Long",49,44.584589999999999,null,null,0.18437929689055146,0,1,203.87755100000001,203.87755100000001,0.91836735000000003,0.91836735000000003]
[null,"MI32","SOUTH EAST","Rural Long",1188,31.48667,0.44674999999999998,2.3377489749757139,3.0773809105309824,1.4069672232793313,9,140.35185200000001,140.35185200000001,1.0774410800000001,1.0774410800000001,5,64.168350000000004,64.168350000000004,0.25084174999999997,0.25084174999999997]
[null,"MT01","BAROSSA/MID NORTH & YORKE PENINSULA/RIVE","Rural Long",572,79.425370000000001,3.1544599999999998,1.4803838252291193,2.450811172236889,0.20514273122507301,10,232.149181,232.149181,2.2226107000000002,2.2226107000000002,5,19.431818,19.431818,0.10839161,0.10839161]
[null,"MT02","BAROSSA/MID NORTH & YORKE PENINSULA/RIVE","Rural Long",136.5,60.239629999999998,1.10043,null,1.3517272597564662,5.7214796832903859E-3,3,536.54945099999998,536.54945099999998,1.89010989,1.89010989,2,2.2710620000000001,2.2710620000000001,2.9304029999999998E-2,2.9304029999999998E-2]
[null,"MT03","BAROSSA/MID NORTH & YORKE PENINSULA/RIVE","Rural Long",235,24.902989999999999,0.10739,0.85736514974659428,4.3606268812244262E-2,3.1357399941646338E-2,2,10.053896,10.053896,0.96879428999999995,0.96879428999999995,4,7.229787,7.229787,0.15319149000000001,0.15319149000000001]
[null,"MT04","BAROSSA/MID NORTH & YORKE PENINSULA/RIVE","Rural Short",15,7.6408999999999994,0.25762999999999997,null,0,0.10880904870456405,null,null,null,null,null,1,353,353,1,1]
[null,"MT05","BAROSSA/MID NORTH & YORKE PENINSULA/RIVE","Rural Long",112,4.5760800000000001,null,null,0.50402559715467476,0,6,243.83043000000001,243.83043000000001,2.6696431500000002,2.6696431500000002]
[null,"MT06","BAROSSA/MID NORTH & YORKE PENINSULA/RIVE","Rural Long",1013.5,13.233559999999999,1.9901300000000002,2.2291493893411447,6.1225927297473247E-2,0.74041484017600123,5,3.2731430000000001,3.2731430000000001,2.565365E-2,2.565365E-2,2,39.582633999999999,39.582633999999999,0.27923038999999999,0.27923038999999999]
[null,"MT07","BAROSSA/MID NORTH & YORKE PENINSULA/RIVE","Rural Long",115,40.602870000000003,null,null,0.4561126690746945,4.6989958947281682E-2,2,214.89565200000001,214.89565200000001,0.88695652000000003,0.88695652000000003,3,22.139130000000002,22.139130000000002,9.5652169999999995E-2,9.5652169999999995E-2]
[null,"MT08","BAROSSA/MID NORTH & YORKE PENINSULA/RIVE","Rural Long",710,6.0759099999999995,3.11415,1.632232719528683,0.60378221406181187,0.24096657659690088,8,46.076056000000001,46.076056000000001,1.6014084500000001,1.6014084500000001,2,18.388732000000001,18.388732000000001,0.14366197,0.14366197]
[null,"MT09","BAROSSA/MID NORTH & YORKE PENINSULA/RIVE","Rural Long",73,60.815930000000002,0.28227999999999998,null,6.4431243788279802E-2,7.0909435300650511E-2,2,47.821917999999997,47.821917999999997,1.1369863,1.1369863,4,52.630136999999998,52.630136999999998,0.30136985999999999,0.30136985999999999]
[null,"MT10","BAROSSA/MID NORTH & YORKE PENINSULA/RIVE","Rural Long",97,5.38124,9.0400000000000008E-2,null,0.73264470163837137,0,4,409.23711300000002,409.23711300000002,2.97938144,2.97938144]
[null,"MT11","BAROSSA/MID NORTH & YORKE PENINSULA/RIVE","Rural Long",75,71.030350000000013,0.24434999999999998,null,0.68535947157598553,7.1241650250002866E-3,6,495.12002200000001,495.12002200000001,2.5866667699999999,2.5866667699999999,5,5.1466669999999999,5.1466669999999999,0.97333333,0.97333333]
[null,"MT12","BAROSSA/MID NORTH & YORKE PENINSULA/RIVE","Rural Long",79.5,69.594279999999998,0.18833000000000003,null,2.0302024682643301E-3,3.2464783106154159E-2,1,1.383648,1.383648,2.5157229999999999E-2,2.5157229999999999E-2,7,22.125786000000002,22.125786000000002,1.18238994,1.18238994]
[null,"MT13","BAROSSA/MID NORTH & YORKE PENINSULA/RIVE","Rural Long",200,1.3886500000000002,4.0057800000000006,null,3.7097336011011855E-3,0,1,1.0049999999999999,1.0049999999999999,1.0049999999999999,1.0049999999999999]
[null,"MT14","BAROSSA/MID NORTH & YORKE PENINSULA/RIVE","Rural Short",93,83.654160000000005,9.7439999999999999E-2,null,1.7318413971056741,0.62848270926919481,6,906.20430099999999,906.20430099999999,2.2258064499999999,2.2258064499999999,2,328.86021499999998,328.86021499999998,0.94623656,0.94623656]
[null,"MT15","BAROSSA/MID NORTH & YORKE PENINSULA/RIVE","Rural Long",49.5,44.936109999999999,0.32232,null,8.489937594559927E-4,0,1,0.92929300000000004,0.92929300000000004,0.92929293000000002,0.92929293000000002]
[null,"MT16","BAROSSA/MID NORTH & YORKE PENINSULA/RIVE","Rural Long",122,54.220330000000004,null,null,1.5392625986658651E-2,1.6223163360039511E-2,2,6.8360659999999998,6.8360659999999998,0.97540983999999997,0.97540983999999997,5,7.2049180000000002,7.2049180000000002,7.3770489999999994E-2,7.3770489999999994E-2]
[null,"MT17","BAROSSA/MID NORTH & YORKE PENINSULA/RIVE","Rural Short",348,3.9369299999999998,null,0.55252420761447185,5.0736475457521572E-2,7.551902813772858E-2,3,7.09483,7.09483,3.4482770000000003E-2,3.4482770000000003E-2,1,10.560345,10.560345,4.3103450000000001E-2,4.3103450000000001E-2]
[null,"MT18","BAROSSA/MID NORTH & YORKE PENINSULA/RIVE","Rural Long",73,67.818130000000011,0.28781000000000001,null,1.0603562927883845,1.1442959366580771E-3,3,787.01369899999997,787.01369899999997,2.3561643800000001,2.3561643800000001,1,0.84931500000000004,0.84931500000000004,1.369863E-2,1.369863E-2]
[null,"MT19","BAROSSA/MID NORTH & YORKE PENINSULA/RIVE","Rural Long",76,63.14414,null,null,1.1470274817971964,0,2,817.73684200000002,817.73684200000002,1.8157894699999999,1.8157894699999999]
[null,"MT20","BAROSSA/MID NORTH & YORKE PENINSULA/RIVE","Rural Long",11,8.2416400000000003,null,null,1.5023498265156044E-2,0,2,74,74,2,2]
[null,"MT21","BAROSSA/MID NORTH & YORKE PENINSULA/RIVE","Rural Long",209.5,2.8955199999999999,null,null,1.5909404796762297E-2,0,2,4.1145579999999997,4.1145579999999997,1.0023866299999999,1.0023866299999999]
[null,"MT22","BAROSSA/MID NORTH & YORKE PENINSULA/RIVE","Rural Long",534,15.739600000000001,0.91786999999999996,1.4041735896960887,5.9435667131747798E-2,0.18489607570065511,3,6.0305819999999999,6.0305819999999999,2.7465639999999999E-2,2.7465639999999999E-2,5,18.760300000000001,18.760300000000001,6.1797749999999999E-2,6.1797749999999999E-2]
[null,"MT23","BAROSSA/MID NORTH & YORKE PENINSULA/RIVE","Rural Long",136,36.398330000000001,8.8319999999999996E-2,null,0.41379217580442079,0,1,164.85294099999999,null,0.13970588]
[null,"MT24","BAROSSA/MID NORTH & YORKE PENINSULA/RIVE","Rural Long",53.5,2.4986400000000004,0.34491000000000005,null,0.25141289111542464,0,2,254.61682200000001,254.61682200000001,2,2]
[null,"MT25","BAROSSA/MID NORTH & YORKE PENINSULA/RIVE","Rural Long",80,82.151030000000006,0.57907000000000008,null,0.66769667903998797,0,7,452.21249999999998,452.21249999999998,3.6124999999999998,3.6124999999999998]
[null,"MT26","BAROSSA/MID NORTH & YORKE PENINSULA/RIVE","Rural Long",95,22.375869999999999,null,null,1.643116683110623,6.4597351262955967E-4,5,937.12631599999997,937.12631599999997,3.7263157900000001,3.7263157900000001,1,0.368421,0.368421,1.052632E-2,1.052632E-2]
[null,"MT27","BAROSSA/MID NORTH & YORKE PENINSULA/RIVE","Rural Short",11,2.66452,null,null,3.1995412210948371E-2,0,1,141.54546999999999,141.54546999999999,0.81818190999999996,0.81818190999999996]
[null,"MTB11","MAJOR METROPOLITAN AREAS","Rural Short",1751,27.877740063000001,12.800520832,3.791459217768272,3.5885750389552431,2.9496807667803262,15,99.732529999999997,99.139155000000002,1.63982484,1.63925374,9,81.976585,81.976585,0.26442032999999998,0.26442032999999998]
[null,"MTB12","EASTERN HILLS/FLEURIEU PENINSULA","Rural Short",1944.5,42.857777776000006,28.862566060000002,6.1349239604089636,1.2982628495992043,0.11641232500686598,11,32.490442999999999,32.490442999999999,0.15290992,0.15290992,6,2.9133450000000001,2.9133450000000001,4.3713040000000002E-2,4.3713040000000002E-2]
[null,"MTB13","MAJOR METROPOLITAN AREAS","Rural Short",2677.5,89.973786785000001,39.075571855,5.5252420761447185,1.0414434505978161,5.7133689556900187,13,18.928106,16.571681999999999,0.76016214000000004,0.75667629999999997,20,103.839776,103.839776,0.31447246000000001,0.31447246000000001]
[null,"MTB14","EASTERN HILLS/FLEURIEU PENINSULA","Rural Short",201.5,26.912200094999999,1.6403099999999999,0.60968188426424474,1.1274014804680828,8.9985802507513882E-2,4,272.27295299999997,182.12406899999999,1.80148883,1.72704715,2,21.732009999999999,21.732009999999999,6.9478910000000005E-2,6.9478910000000005E-2]
[null,"MTB15","MAJOR METROPOLITAN AREAS","Urban",366.5,0.52572541100000003,5.1899600000000001,3.5437759522859231,1.2127191171019553E-2,0,1,1.440655,1.440655,5.4570299999999999E-3,5.4570299999999999E-3]
[null,"MTB21","EASTERN HILLS/FLEURIEU PENINSULA","Rural Short",1210.5,23.403012238999999,5.3229421739999996,3.8867220121845603,2.340288400475468,1.2277441782630565,12,94.081783000000001,91.816603000000001,1.14167698,1.1152416300000001,13,49.356464000000003,49.356464000000003,0.15613383,0.15613383]
[null,"MTB22","EASTERN HILLS/FLEURIEU PENINSULA","Rural Short",376,33.749614424999997,2.2345199999999998,1.6194675050769001,1.8837904947159796,2.5727843055356785E-2,18,243.80673999999999,124.67908,0.71187944999999997,0.59485816999999996,3,3.3297870000000001,3.3297870000000001,4.2553189999999998E-2,4.2553189999999998E-2]
[null,"MTB32","EASTERN HILLS/FLEURIEU PENINSULA","Rural Long",711,71.490796442000004,1.5052249390000001,1.7337828583764461,7.8632694617649532,0.15128699665784287,12,599.22081600000001,341.73417699999999,2.8635724300000001,2.0084388199999998,7,11.528833000000001,11.528833000000001,5.2039380000000003E-2,5.2039380000000003E-2]
[null,"MTB33","EASTERN HILLS/FLEURIEU PENINSULA","Rural Short",100,14.472979256,0.96042999999999989,null,0.60805661023003788,7.4121669249737954E-2,5,295.89999999999998,295.89999999999998,3.04,3.04,3,36.07,36.07,0.22,0.22]
[null,"MTB41","EASTERN HILLS/FLEURIEU PENINSULA","Rural Short",253.5,14.909984844,0.37323000000000001,null,0.42394789261487809,5.0346018758485725E-2,5,81.383331999999996,81.383331999999996,0.90072355999999998,0.90072355999999998,1,9.6646940000000008,9.6646940000000008,0.96646942999999996,0.96646942999999996]
[null,"MTB51","EASTERN HILLS/FLEURIEU PENINSULA","Rural Long",1028,19.218320501999997,4.7915300000000007,2.4768326548234945,6.9857421294368102E-2,9.4422871160366489E-2,6,3.6819069999999998,3.6819069999999998,2.8210120000000002E-2,2.8210120000000002E-2,2,4.9766539999999999,4.9766539999999999,0.98540855999999999,0.98540855999999999]
[null,"MTB52","EASTERN HILLS/FLEURIEU PENINSULA","Rural Long",975,40.138492974999998,6.7734500000000004,2.3625173015239485,1.6796172272637988,1.3317943627953255,6,93.338117999999994,93.338117999999994,1.04341879,1.04341879,3,74.009231,74.009231,1.2071794899999999,1.2071794899999999]
[null,"MTB53","EASTERN HILLS/FLEURIEU PENINSULA","Rural Long",334,52.71900188,2.5675750019999999,1.6956777406099306,5.8566542549046394,3.0453037023964957E-2,9,950.07185600000003,950.07185600000003,4.2724550900000002,4.2724550900000002,1,4.9401200000000003,4.9401200000000003,0.98802394999999998,0.98802394999999998]
[null,"MTB54","EASTERN HILLS/FLEURIEU PENINSULA","Rural Long",485,49.121316227999998,3.2165599999999999,2.2100968304578874,5.674994191636312,0.18153701343498138,8,633.98212999999998,503.856357,4.0343642600000003,3.0673539500000002,4,20.280411999999998,20.280411999999998,1.1030927800000001,1.1030927800000001]
[null,"MTB61","EASTERN HILLS/FLEURIEU PENINSULA","Rural Short",1263.5,22.398934508000004,6.6611799999999999,2.4196749781737217,3.4682447599927291,0.80302927389555323,3,133.57815600000001,133.57815600000001,1.0708349800000001,1.0708349800000001,3,30.928374000000002,30.928374000000002,1.0470914099999999,1.0470914099999999]
[null,"MTB62","EASTERN HILLS/FLEURIEU PENINSULA","Rural Short",1533.5,13.522963111999999,12.278437013,3.6961964233519837,3.1065343019572738,0.99516612099426405,6,98.581023999999999,98.581023999999999,1.06488425,1.06488425,6,31.580045999999999,31.580045999999999,1.1372676900000001,1.1372676900000001]
[null,"MTB63","EASTERN HILLS/FLEURIEU PENINSULA","Rural Short",222.5,30.033386307000001,2.3570500000000001,1.0669432974624282,0.63451053707432048,0.17123811196508634,6,138.77453299999999,138.77453299999999,1.0172284700000001,1.0172284700000001,2,37.451684999999998,37.451684999999998,1.08314607,1.08314607]
[null,"MTB71","EASTERN HILLS/FLEURIEU PENINSULA","Rural Short",206,24.818769689,0.89364999999999994,null,1.7885371790463525,0.88526795433288363,1,422.50485400000002,422.50485400000002,0.97572815999999996,0.97572815999999996,4,209.126214,209.126214,1.5873786400000001,1.5873786400000001]
[null,"MTB72","EASTERN HILLS/FLEURIEU PENINSULA","Rural Long",123,33.306575272000003,0.56376000000000004,null,2.7672582461746575,3.4421160030117963E-2,5,1218.9837399999999,1218.9837399999999,4.8699187000000004,4.8699187000000004,2,15.162602,15.162602,1.0975609799999999,1.0975609799999999]
[null,"MTB81","EASTERN HILLS/FLEURIEU PENINSULA","Rural Short",534,36.180681849999999,3.2179105719999996,null,3.0724017561785617,1.9628782497185944,4,279.98689100000001,279.98689100000001,1.20786517,1.20786517,10,178.87640400000001,178.87640400000001,0.84456929000000003,0.84456929000000003]
[null,"MTB82","EASTERN HILLS/FLEURIEU PENINSULA","Rural Short",80.5,50.037682625000002,0.51758160399999997,null,0.51683783033247843,0.60388508296147758,3,312.434774,312.434774,0.98136643000000001,0.98136643000000001,5,365.05590100000001,365.05590100000001,4.8074534199999999,4.8074534199999999]
[null,"MV11","EASTERN HILLS/FLEURIEU PENINSULA","Rural Short",797,14.8522406,3.824658978,2.4272960017270249,0.1401468093258274,2.0307118039723746,7,8.5570850000000007,8.5570850000000007,8.8247580000000006E-2,8.8247580000000006E-2,7,123.99121700000001,123.99121700000001,0.67001255000000004,0.67001255000000004]
[null,"MV12","EASTERN HILLS/FLEURIEU PENINSULA","Urban",123.5,19.034437614000002,2.1523699999999999,null,1.11384118328851,0.30749779431365487,6,392.67207100000002,392.67207100000002,4.4669367500000003,4.4669367500000003,3,108.404858,108.404858,0.35627530000000002,0.35627530000000002]
[null,"MV13","EASTERN HILLS/FLEURIEU PENINSULA","Rural Short",682,53.506862947000002,8.5502500000000001,2.5720954492397827,0.62200964971453243,1.1345937688621519,3,44.382697999999998,44.382697999999998,0.97947214000000005,0.97947214000000005,10,80.957477999999995,80.957477999999995,0.31964809,0.31964809]
[null,"MV14","EASTERN HILLS/FLEURIEU PENINSULA","Rural Short",587,60.148943918999997,9.3899159829999981,1.9243084472090224,3.3849033184645307,0.377040307012529,14,280.61385999999999,280.61385999999999,2.2180579599999999,2.2180579599999999,10,31.257239999999999,31.257239999999999,0.15161839999999999,0.15161839999999999]
[null,"MV15","EASTERN HILLS/FLEURIEU PENINSULA","Rural Short",1108,28.370744761000001,12.866513231000001,4.8837424185454328,1.4394577825641508,0.83072985891042617,7,63.220820000000003,63.220820000000003,1.5300842400000001,1.5300842400000001,8,36.48556,36.48556,0.13357400999999999,0.13357400999999999]
[null,"MV22","EASTERN HILLS/FLEURIEU PENINSULA","Rural Short",418,44.137941676000004,2.3931799999999996,1.0097856208126554,1.0149005309183612,0.42646160297749153,6,118.153924,118.153924,1.20015958,1.20015958,8,49.648325,49.648325,0.38038277999999998,0.38038277999999998]
[null,"MV31","EASTERN HILLS/FLEURIEU PENINSULA","Rural Short",384.5,54.166301138999998,3.91784,1.5051521517773543,4.3372380464998157,0.46634797947145923,20,548.93113700000004,255.583933,1.97399255,1.7087129700000001,2,59.022106999999998,59.022106999999998,0.17165150000000001,0.17165150000000001]
[null,"MV32","EASTERN HILLS/FLEURIEU PENINSULA","Rural Short",126.5,32.482057497,0.12139,null,1.7693036703347279E-2,5.2483155881294916E-2,2,6.8063269999999996,6.8063269999999996,0.11857711,0.11857711,3,20.189723000000001,20.189723000000001,0.15810277,0.15810277]
[null,"MV33","EASTERN HILLS/FLEURIEU PENINSULA","Rural Short",301.5,61.292025910999996,11.08178,1.7280670907114686,0.56531394760825515,0.10284972403519226,8,91.243793999999994,91.243793999999994,0.37700392999999999,0.37700392999999999,6,16.600332000000002,16.600332000000002,0.12935323000000001,0.12935323000000001]
[null,"MV34","EASTERN HILLS/FLEURIEU PENINSULA","Rural Short",1033.5,16.665574369999998,4.762701807,3.0103043035547086,0.13331069579365751,9.534344087923321,4,6.2770479999999997,6.2770479999999997,5.4829849999999999E-2,5.4829849999999999E-2,10,448.93275299999999,448.93275299999999,1.7726173199999999,1.7726173199999999]
[null,"MV41","EASTERN HILLS/FLEURIEU PENINSULA","Rural Short",121.5,16.866798619000001,null,1.3146265629447778,0.49723372026139945,0,6,199.152263,96.995885000000001,1.8820301699999999,1.00137174]
[null,"MV42","EASTERN HILLS/FLEURIEU PENINSULA","Rural Short",770,48.596262241999995,12.044106812000001,2.3682330691889257,5.9049920708831003,0.4821504645430002,11,373.18961100000001,373.18961100000001,2.4311688299999998,2.4311688299999998,6,30.471429000000001,30.471429000000001,0.14545454999999999,0.14545454999999999]
[null,"MV51","EASTERN HILLS/FLEURIEU PENINSULA","Rural Short",119,16.827323673999999,0.65212999999999999,null,0,0.20311022424851957,null,null,null,null,null,2,83.058824000000001,83.058824000000001,0.54621849,0.54621849]
[null,"MV52","EASTERN HILLS/FLEURIEU PENINSULA","Rural Short",1167.5,15.014485461999998,8.3462474370000006,2.9531466269049358,4.5896663703209626,1.8925582186200074,8,191.304497,191.304497,2.0145610299999999,2.0145610299999999,11,78.884797000000006,78.884797000000006,0.3503212,0.3503212]
[null,"MV53","EASTERN HILLS/FLEURIEU PENINSULA","Rural Short",295,54.867491026000003,3.55619,null,4.3153730364416335E-3,0.10445257687729916,1,0.71186400000000005,0.71186400000000005,6.7796599999999999E-3,6.7796599999999999E-3,5,17.230508,17.230508,0.11864407,0.11864407]
[null,"MV54","EASTERN HILLS/FLEURIEU PENINSULA","Rural Short",136,23.154699672000003,null,null,0.15835365776920418,0.18303346493136013,2,56.661771000000002,56.661771000000002,0.22549026,0.22549026,3,65.492647000000005,65.492647000000005,0.31617646999999999,0.31617646999999999]
[null,"MV55","EASTERN HILLS/FLEURIEU PENINSULA","Rural Short",4.5,0.72003817400000003,0.45685000000000003,null,0,3.3844854242949383E-2,null,null,null,null,null,1,366,0,2]
[null,"MV61","EASTERN HILLS/FLEURIEU PENINSULA","Urban",1915,6.5903874049999995,7.3853999999999997,5.715767664977295,3.5120850003679931,13.791487382086309,13,79.849084000000005,2.6892930000000002,1.0069625499999999,2.62837E-2,23,313.55665800000003,313.55665800000003,1.25065274,1.25065274]
[null,"MV62","EASTERN HILLS/FLEURIEU PENINSULA","Rural Short",1995.5,37.891771349000003,17.22223,4.566326787550361,5.0749813838286082,9.7672303861232894,10,123.76096099999999,46.663491999999998,1.5317798300000001,0.56009352999999995,22,238.188424,238.188424,0.82335254000000002,0.82335254000000002]
[null,"MV63","EASTERN HILLS/FLEURIEU PENINSULA","Rural Short",617,39.605142794000002,4.6146499999999993,2.1910442715746297,4.9219912821227174,1.0585199070483093,12,388.20098000000002,162.408435,3.0000000500000001,1.0696921100000001,9,83.486224000000007,83.486224000000007,0.40032414999999999,0.40032414999999999]
[null,"MV64","EASTERN HILLS/FLEURIEU PENINSULA","Rural Short",2520,12.953260945,7.5985300000000002,5.1441908984795655,17.567143574202127,11.64986324675948,19,339.23570899999999,257.27539100000001,3.6227512700000002,1.6501322300000001,31,224.968254,224.968254,1.03730159,1.03730159]
[null,"NA01","SOUTH EAST","Rural Long",2050.5,22.726626942000003,3.16005,5.4795159348249012,0.87825323522570775,0.66263962925540232,6,23.206696000000001,23.206696000000001,0.11346823,0.11346823,3,17.509388000000001,17.509388000000001,7.9980490000000001E-2,7.9980490000000001E-2]
[null,"NA02","SOUTH EAST","Rural Long",246,67.269833172999995,1.5170399999999999,1.1888796743152772,7.0687976348966813E-2,6.8233259319756628E-2,3,15.56911,15.56911,0.15040654000000001,0.15040654000000001,5,15.028454999999999,15.028454999999999,0.18292683000000001,0.18292683000000001]
[null,"NA03","SOUTH EAST","Rural Long",80.5,43.278064316000005,0.52554999999999996,0.7621023553303059,0,6.7181245313474199E-3,null,null,null,null,null,1,4.5217390000000002,4.5217390000000002,2.4844720000000001E-2,2.4844720000000001E-2]
[null,"NA04","SOUTH EAST","Rural Long",263.5,121.302878631,2.3442500000000002,1.6194675050769001,0.15187760839480149,0,6,31.229603000000001,31.229603000000001,0.13282733999999999,0.13282733999999999]
[null,"NA05","SOUTH EAST","Rural Long",219.5,81.739809238999996,2.1191599999999999,5.0489281040632772,9.6680720120658994E-2,1.2993295796891714E-2,4,23.864849,23.864849,0.18526959000000001,0.18526959000000001,4,3.2072889999999998,3.2072889999999998,6.8337129999999996E-2,6.8337129999999996E-2]
[null,"NA06","SOUTH EAST","Rural Long",872.5,16.055842962,2.57646,2.3186964160924561,1.103691588299336E-2,1.9833970731777999,3,0.68538699999999997,0.68538699999999997,3.4383899999999999E-3,3.4383899999999999E-3,9,123.167908,123.167908,0.47564469999999998,0.47564469999999998]
[null,"NA07","SOUTH EAST","Rural Long",257.5,99.66340292000001,2.2421100000000003,3.3761134341132557,0.37318812643913418,4.8964792257320616E-2,1,78.524271999999996,78.524271999999996,0.99417476000000005,0.99417476000000005,6,10.302913,10.302913,0.99805825000000004,0.99805825000000004]
[null,"NA08","SOUTH EAST","Rural Long",194,109.550622537,1.40184,null,4.2911097624677895E-2,5.3744996250779359E-2,2,11.984536,11.984536,0.96907215999999996,0.96907215999999996,3,15.010308999999999,15.010308999999999,0.99484536000000001,0.99484536000000001]
[null,"NA09","SOUTH EAST","Rural Long",216.5,94.469938353000003,0.92547999999999997,null,2.9798204446019332,4.5476535289121003E-2,4,745.73672099999999,745.73672099999999,1.97228637,1.97228637,3,11.381062,11.381062,0.99769052999999996,0.99769052999999996]
[null,"NA12","SOUTH EAST","Rural Long",312,132.853493297,1.23916,2.692126570204306,0.46078213475170243,0,4,80.019231000000005,80.019231000000005,0.68910256000000003,0.68910256000000003]
[null,"NA13","SOUTH EAST","Rural Long",439,120.999762202,0.94716999999999996,null,0.53707472884162943,2.4657731796374045E-2,9,66.286261999999994,66.286261999999994,3.04631769,3.04631769,1,3.0432800000000002,3.0432800000000002,9.1116200000000008E-3,9.1116200000000008E-3]
[null,"NA15","SOUTH EAST","Rural Long",72,52.327996079999998,0.62773999999999996,null,0.11833623027376544,7.7332257654795858E-3,5,89.050951999999995,89.050951999999995,3.1620372899999998,3.1620372899999998,2,5.8194439999999998,5.8194439999999998,2.7777779999999998E-2,2.7777779999999998E-2]
[null,"NA16","SOUTH EAST","Rural Long",65,57.318794392000001,null,null,0.62305068112424788,0,2,519.35384599999998,519.35384599999998,1.9076923100000001,1.9076923100000001]
[null,"NA17","SOUTH EAST","Rural Long",65,62.309655999,null,null,2.399330189766936E-4,1.3842289556347707E-3,1,0.2,0.2,1.538462E-2,1.538462E-2,1,1.1538459999999999,1.1538459999999999,4.6153850000000003E-2,4.6153850000000003E-2]
[null,"NA18","SOUTH EAST","Rural Long",39,32.199576808000003,null,null,4.454141240471522E-3,0.2186158930599181,3,6.188034,6.188034,2.5982906899999998,2.5982906899999998,3,303.71794899999998,303.71794899999998,1.0256410300000001,1.0256410300000001]
[null,"NA20","SOUTH EAST","Rural Long",65,49.524464826000006,null,null,8.1331142657875728E-3,0.39452370874198472,3,6.7794869999999996,6.7794869999999996,2.84102575,2.84102575,1,328.861538,328.861538,0.98461538000000004,0.98461538000000004]
[null,"NA21","SOUTH EAST","Rural Long",60.5,64.135780746999998,5.1869999999999999E-2,null,0.8068947428186205,6.312084037694554E-3,2,722.62809900000002,722.62809900000002,1.8842975200000001,1.8842975200000001,1,5.6528929999999997,5.6528929999999997,0.94214876000000003,0.94214876000000003]
[null,"NA22","SOUTH EAST","Rural Long",96.5,52.654150663000003,0.126,null,2.0818803492746951E-2,0.67622352940669817,1,11.689119,11.689119,0.97409325999999996,0.97409325999999996,4,379.67875600000002,379.67875600000002,1.96891192,1.96891192]
[null,"NA23","SOUTH EAST","Rural Long",53.5,43.706861418000003,0.13943,null,6.7673416408587737E-3,0.36290791939528666,3,6.8535830000000004,6.8535830000000004,2.89096581,2.89096581,1,367.53271000000001,367.53271000000001,0.99065420999999998,0.99065420999999998]
[null,"NA27","SOUTH EAST","Rural Long",70,65.963682267999999,null,null,2.1809296402828263E-2,3.8758410757773574E-4,6,16.880953000000002,16.880953000000002,3.0809525299999998,3.0809525299999998,1,0.3,0.3,1.428571E-2,1.428571E-2]
[null,"NA28","SOUTH EAST","Rural Long",52.5,52.388402369000005,7.46E-2,null,6.1398245143043451E-3,0.33575857547877003,3,6.3365080000000003,6.3365080000000003,2.6793651600000001,2.6793651600000001,1,346.51428600000003,346.51428600000003,0.91428571000000003,0.91428571000000003]
[null,"NA29","SOUTH EAST","Rural Long",56.5,55.408061058000001,null,null,6.9765139363992439E-3,1.8825513796632881E-3,3,6.6902650000000001,6.6902650000000001,2.8672566399999999,2.8672566399999999,1,1.80531,1.80531,3.5398230000000003E-2,3.5398230000000003E-2]
[null,"NA30","SOUTH EAST","Rural Long",67,51.351505298999996,1.77321,null,0.17635076894786977,1.2365778670337284E-3,2,142.61194,142.61194,1.0447761200000001,1.0447761200000001,2,1,1,5.9701490000000003E-2,5.9701490000000003E-2]
[null,"NA32","SOUTH EAST","Rural Long",210.5,71.365910178999997,2.24959,2.1624654332497433,2.6890954511464813E-2,6.3859095819950749E-3,1,6.9216150000000001,6.9216150000000001,4.7505899999999998E-3,4.7505899999999998E-3,2,1.643705,1.643705,1.425178E-2,1.425178E-2]
[null,"NA33","SOUTH EAST","Rural Long",83,32.802518683000002,0.1201,2.0576763593918259,0.22509408457228886,2.4473167935622746E-2,3,146.93975900000001,146.93975900000001,1.22891566,1.22891566,1,15.975904,15.975904,0.15662651,0.15662651]
[null,"NA34","SOUTH EAST","Rural Long",164,157.16842375799999,0.25768999999999997,null,1.1790493116375473,1.8825513796632881E-3,5,389.53048799999999,389.53048799999999,3.0914634099999998,3.0914634099999998,1,0.62195100000000003,0.62195100000000003,6.0975600000000001E-3,6.0975600000000001E-3]
[null,"NA35","SOUTH EAST","Rural Short",17.5,7.6317469819999992,8.788E-2,null,8.4252436935148799E-3,0.15905232048599163,1,23.428547999999999,23.428547999999999,5.7142800000000001E-2,5.7142800000000001E-2,2,442.28571399999998,442.28571399999998,2,2]
[null,"NA36","SOUTH EAST","Rural Long",68.5,62.678579865000003,null,null,8.397655811835365E-3,0,3,6.6423360000000002,6.6423360000000002,2.7883212799999999,2.7883212799999999]
[null,"NA51","SOUTH EAST","Rural Long",514.5,24.213709211000001,0.23688999999999999,null,2.1250563262526554,0.44009252596148141,7,223.788827,223.788827,2.5623585699999998,2.5623585699999998,9,46.345967000000002,46.345967000000002,0.24101069,0.24101069]
[null,"NA52","SOUTH EAST","Rural Long",1075.5,47.885971527000002,7.3762499999999998,2.1758022244680237,4.4961609688249871,5.0201370124354347E-3,3,226.50863899999999,226.50863899999999,2.6369133800000002,2.6369133800000002,1,0.25290600000000002,0.25290600000000002,1.8596000000000001E-3,1.8596000000000001E-3]
[null,"NA56","SOUTH EAST","Rural Long",77,110.72502936800001,null,null,0.41079610550852452,0.39695995170390197,4,289.06061799999998,289.06061799999998,3.34632044,3.34632044,1,279.32467500000001,279.32467500000001,0.98701298999999998,0.98701298999999998]
[null,"NA57","SOUTH EAST","Rural Long",78,71.963101339000005,null,null,0.48775308852397908,3.0766795587242168E-2,5,338.811981,338.811981,3.5170941400000002,3.5170941400000002,2,21.371794999999999,21.371794999999999,1.0128205100000001,1.0128205100000001]
[null,"NA58","SOUTH EAST","Rural Long",88,136.95604778399999,null,null,1.5418772742032536,0.55066473493758694,6,949.33713399999999,949.33713399999999,4.91666677,4.91666677,3,339.045455,339.045455,1.03409091,1.03409091]
[null,"NA59","SOUTH EAST","Rural Long",66.5,7.3662224969999999,null,null,0.27154268373778018,4.4295326580312665E-3,3,221.24313000000001,221.24313000000001,2.2957395300000001,2.2957395300000001,1,3.6090230000000001,3.6090230000000001,0.60150376000000005,0.60150376000000005]
[null,"NA60","SOUTH EAST","Rural Long",66.5,64.541503117000005,null,null,0.31384471168908795,0,6,255.70928799999999,255.70928799999999,2.6265665399999998,2.6265665399999998]
[null,"NA62","SOUTH EAST","Rural Long",22.5,36.919741779000006,null,null,0.12291953126036763,0,2,296,296,4,4]
[null,"NL111A","MAJOR METROPOLITAN AREAS","Urban",1259.5,7.5154728020000006,14.894627085,6.8589211979727542,7.8347856369362399,4.3006281371879052,3,270.833664,270.833664,1.6601826099999999,1.6601826099999999,13,148.66454899999999,148.66454899999999,0.95196506999999997,0.95196506999999997]
[null,"NL111B","MAJOR METROPOLITAN AREAS","Urban",1970,10.181862927000001,8.5850021539999997,6.1920816370587364,3.5393650911369199,1.3935015445775139,11,78.222706000000002,78.222706000000002,0.54957723999999997,0.54957723999999997,6,30.797461999999999,30.797461999999999,0.90456853000000004,0.90456853000000004]
[null,"NL111C","MAJOR METROPOLITAN AREAS","Urban",2138,14.050525327999999,3.5953578259999999,5.652894220662545,1.4888425442467645,1.0182476632288064,16,30.318992999999999,30.318992999999999,1.0639226799999999,1.0639226799999999,4,20.735734000000001,20.735734000000001,9.6351729999999997E-2,9.6351729999999997E-2]
[null,"NL111D","MAJOR METROPOLITAN AREAS","Urban",252.5,5.1592571999999999,2.2555938979999999,7.5448133177700285,0,0.36962668090003342,null,null,null,null,null,5,63.734653000000002,63.734653000000002,0.29702970000000001,0.29702970000000001]
[null,"NL111P","MAJOR METROPOLITAN AREAS","Urban",1988,11.309419449000002,5.1601599999999994,5.2394536928958537,3.9834071606393993,2.4289064271335015,13,87.239268999999993,87.239268999999993,1.0461099899999999,1.0461099899999999,13,53.194668,53.194668,0.32394366000000002,0.32394366000000002]
[null,"NL111Q","MAJOR METROPOLITAN AREAS","Urban",3114,19.054242569000003,6.3758815230000003,7.5448133177700285,13.178290995668323,3.5340196907577544,17,184.252837,180.638192,2.0354313799999999,2.0210875499999998,16,49.411047000000003,49.411047000000003,0.32145151,0.32145151]
[null,"NL115A","MAJOR METROPOLITAN AREAS","Urban",2050,1.1579499689999999,27.378720741000002,5.5061895172614603,5.121900816548031E-3,5.9147159393534343,2,0.10878,0.10878,9.7561000000000002E-4,9.7561000000000002E-4,8,125.618537,125.618537,0.51560976000000003,0.51560976000000003]
[null,"NL115B","MAJOR METROPOLITAN AREAS","Urban",1807.5,25.126922526000001,8.1093283770000006,4.2614858454182389,5.6291754463248296,4.8259789774430759,14,135.593908,135.593908,2.1224527200000001,2.1224527200000001,15,116.24675000000001,116.24675000000001,0.45753803999999998,0.45753803999999998]
[null,"NL115C","MAJOR METROPOLITAN AREAS","Urban",2337.5,8.9825962719999985,8.2178471240000004,5.6014523116777495,5.4241385824401709,2.8100401587469452,10,101.030582,101.030582,1.0090552500000001,1.0090552500000001,11,52.340107000000003,46.424813,0.26224598999999998,0.24812834]
[null,"NL115D","MAJOR METROPOLITAN AREAS","Urban",2497,3.4768589209999998,21.719882175999999,5.3537690461954002,0.5294008439550304,0.56010167404636901,10,9.2308090000000007,9.1403009999999991,0.11520490999999999,0.11480443,5,9.7661189999999998,9.7661189999999998,7.7292749999999993E-2,7.7292749999999993E-2]
[null,"NL115E","MAJOR METROPOLITAN AREAS","Urban",2415,9.9891875820000013,23.852599983000001,6.9541839923890416,3.6288555881832902,5.7168451970459842,11,65.422365999999997,65.422365999999997,1.26376815,1.26376815,16,103.06542399999999,103.06542399999999,0.75652174000000005,0.75652174000000005]
[null,"NL115F","MAJOR METROPOLITAN AREAS","Urban",2590,7.276154655,12.100372590999999,5.2903240251141517,19.140076470611682,3.2064706883147434,11,321.74929400000002,321.74929400000002,2.4857142900000002,2.4857142900000002,11,53.901544000000001,53.901544000000001,0.46756756999999999,0.46756756999999999]
[null,"NL21","MAJOR METROPOLITAN AREAS","Urban",614,43.634847669999992,6.6565299999999992,1.8671507705592496,2.8426319850190604,2.0597391095354003,8,201.570033,201.570033,0.28664495000000001,0.28664495000000001,17,146.055375,138.030945,0.52605862999999997,0.50488599000000001]
[null,"NL210A","MAJOR METROPOLITAN AREAS","Urban",2411,26.968408809999996,13.953053873,7.1637621401048763,5.3824286238240147,0.38777153132636955,12,97.197427000000005,15.741599000000001,1.0511544100000001,5.7790670000000002E-2,3,7.0024889999999997,7.0024889999999997,5.0601409999999999E-2,5.0601409999999999E-2]
[null,"NL210B","MAJOR METROPOLITAN AREAS","Urban",927.5,11.44442808,3.2098100000000001,2.667358243656071,6.8599862746604154,0.42353296438181925,9,322.02013499999998,322.02013499999998,2.2544475400000001,2.2544475400000001,3,19.881402000000001,19.881402000000001,0.10997305,0.10997305]
[null,"NL210C","MAJOR METROPOLITAN AREAS","Urban",1959,7.4661101990000001,11.329252097000001,6.2873444314750246,14.06366844489529,3.4102212808869301,10,312.56322699999998,311.72606500000001,2.1800238599999999,2.1698145700000002,10,75.791730000000001,75.791730000000001,0.38080652999999998,0.38080652999999998]
[null,"NL210D","MAJOR METROPOLITAN AREAS","Urban",2914.5,8.4828383019999993,26.046883553000001,6.6683956091401768,8.0340344691494874,2.397876436087957,7,120.017156,120.017156,1.01218048,1.01218048,19,35.820895999999998,35.820895999999998,0.35992452000000003,0.35992452000000003]
[null,"NL210E","MAJOR METROPOLITAN AREAS","Urban",2741.5,6.9092147370000001,24.489974823000001,6.7571805335361583,12.253862013029151,2.1257266478580124,11,194.606989,194.606989,1.1660283300000001,1.1660283300000001,7,33.759256000000001,33.759256000000001,0.20317345000000001,0.20317345000000001]
[null,"NL210F","MAJOR METROPOLITAN AREAS","Urban",631,3.3153772640000003,3.4024099999999997,2.4958852137067522,0.12484734702205139,0,3,8.6143730000000005,8.6143730000000005,4.0147929999999998E-2,4.0147929999999998E-2]
[null,"NL234A","MAJOR METROPOLITAN AREAS","Urban",2683.5,10.576979256000001,4.3556299999999997,6.8779737568560115,13.520265762121667,25.701147061475702,21,219.35994500000001,219.35994500000001,1.65231993,1.65231993,59,416.98900700000002,408.99012499999998,1.6698341699999999,1.56959195]
[null,"NL234B","MAJOR METROPOLITAN AREAS","Urban",1351.5,10.566489099999998,19.615169935999997,4.6488243675148659,12.18238367174675,0.32940942381583793,6,392.45505000000003,392.45505000000003,2.39141694,2.39141694,4,10.611912999999999,10.611912999999999,7.6951539999999999E-2,7.6951539999999999E-2]
[null,"NL234C","MAJOR METROPOLITAN AREAS","Urban",2556.5,10.16084178,8.4648128140000001,6.2301867548252519,11.385481695438965,30.556961685379299,16,193.90067099999999,193.690618,2.65062943,2.65023827,68,520.40093899999999,520.40093899999999,2.1991003299999998,2.1991003299999998]
[null,"NL234D","MAJOR METROPOLITAN AREAS","Urban",1554,4.2942392179999995,15.999962850999999,3.4485131578696344,3.3668114797235171,0.61481184330653671,4,94.328186000000002,94.328186000000002,1.01501503,1.01501503,2,17.225224999999998,17.225224999999998,7.2072070000000002E-2,7.2072070000000002E-2]
[null,"NL234E","MAJOR METROPOLITAN AREAS","Urban",1910,null,27.840052704000001,6.2111341959419937,7.0512266846647778E-3,5.9946910902198926E-2,1,0.16073299999999999,0.16073299999999999,5.2355999999999995E-4,5.2355999999999995E-4,1,1.366492,1.366492,7.8534E-3,7.8534E-3]
[null,"NL451A","MAJOR METROPOLITAN AREAS","Urban",2114.5,1.6747745540000001,22.527342802,5.8872406949266143,8.6175638219899628,5.8282178295995335,7,177.43958699999999,177.43958699999999,0.41302121000000003,0.41302121000000003,14,120.005675,120.005675,2.0600614799999999,2.0600614799999999]
[null,"NL451C","MAJOR METROPOLITAN AREAS","Urban",2688,13.390385860999999,11.852318231,6.8589211979727542,0.31271914315080157,9.5151595635706361,18,5.0652270000000001,5.0652270000000001,4.7743050000000002E-2,4.7743050000000002E-2,31,154.12053599999999,154.12053599999999,0.64806547999999997,0.64806547999999997]
[null,"NL451D","MAJOR METROPOLITAN AREAS","Urban",2167,1.906108565,23.83110379,6.8017635213229815,4.4787921938424487E-3,0.64779412838529449,1,8.9985999999999997E-2,8.9985999999999997E-2,4.6147000000000001E-4,4.6147000000000001E-4,4,13.015228,13.015228,5.5837560000000001E-2,5.5837560000000001E-2]
[null,"NL451E","MAJOR METROPOLITAN AREAS","Urban",882.5,null,13.17383027,3.4085027842147939,1.3734962727783509E-2,0.21123821439368717,1,0.67762,0.67762,1.1331399999999999E-3,1.1331399999999999E-3,4,10.421530000000001,10.421530000000001,1.22946176,1.22946176]
[null,"NL511A","MAJOR METROPOLITAN AREAS","Urban",1486.5,5.7057047050000005,5.0963284089999998,4.3439834253827438,2.4839763812387932,5.0316129595531862,11,72.753895,14.146428,1.1582015699999999,0.18141045,17,147.37235100000001,133.78607500000001,0.67473932000000003,0.62899428000000002]
[null,"NL511B","MAJOR METROPOLITAN AREAS","Urban",1656.5,8.943462834,6.9761099999999994,3.2960926868035734,4.728180429332804,1.2962773017234877,11,124.272862,64.138240999999994,2.14005432,1.15424086,5,34.070630999999999,34.070630999999999,0.16118321999999999,0.16118321999999999]
[null,"NL511C","MAJOR METROPOLITAN AREAS","Urban",673,0.58087999999999995,10.105726248,4.9917704274135044,0.92332023688444331,8.0021087196651741E-2,1,59.732540999999998,null,0.99554235000000002,null,5,5.1768200000000002,5.1768200000000002,1.9316489999999999E-2,1.9316489999999999E-2]
[null,"NL511D","MAJOR METROPOLITAN AREAS","Urban",40,null,4.6348260269999999,2.0767289182750837,0.10085321293929329,0,1,109.77500000000001,109.77500000000001,0.95,0.95]
[null,"NL544A","MAJOR METROPOLITAN AREAS","Urban",1695,2.6655624859999998,13.491066028999999,2.553042890356525,2.4005712126462058,5.4058562416376423,8,61.662140000000001,61.662140000000001,2.0285151899999998,2.0285151899999998,11,138.85722699999999,138.85722699999999,0.71445428,0.71445428]
[null,"NL544B","MAJOR METROPOLITAN AREAS","Urban",1551.5,36.401465403000003,14.790771875999999,4.0010373654841063,17.162647301834603,5.6719424342820766,14,481.62186700000001,481.62186700000001,4.1327746999999997,4.1327746999999997,14,159.16725700000001,159.16725700000001,0.62842410999999998,0.62842410999999998]
[null,"NL760A","MAJOR METROPOLITAN AREAS","Urban",743,9.5040839390000009,8.1459400000000013,1.9547925414222345,1.1428958952082062,2.2141311153149334E-2,1,66.971736000000007,66.971736000000007,0.37146702999999998,0.37146702999999998,1,1.2974429999999999,1.2974429999999999,5.3835799999999998E-3,5.3835799999999998E-3]
[null,"NL760B","MAJOR METROPOLITAN AREAS","Urban",2308.5,16.299188257000001,9.2540499999999994,6.1349239604089636,14.116372118215509,1.728193646365576,16,266.236085,266.236085,2.32604144,2.32604144,4,32.593891999999997,32.593891999999997,0.16374269,0.16374269]
[null,"NL760C","MAJOR METROPOLITAN AREAS","Urban",3073,9.2048282150000009,10.999889999999999,5.8045525893732757,14.951563464786794,4.7748748101030793,16,211.835015,153.03286700000001,1.8828506300000001,1.0052066399999999,17,67.650829999999999,67.650829999999999,0.39895867000000002,0.39895867000000002]
[null,"NU01","BAROSSA/MID NORTH & YORKE PENINSULA/RIVE","Rural Short",130.5,13.027470000000001,1.2340499999999999,2.7816735969556166,0.26204589028906528,0.28460912645103154,2,97.716475000000003,1.747126,0.96551724000000005,1.532567E-2,6,106.130268,106.130268,0.27586207000000001,0.27586207000000001]
[null,"NU02","BAROSSA/MID NORTH & YORKE PENINSULA/RIVE","Rural Long",992.5,25.094047632000002,5.3225600640000001,6.0777662837591908,4.3079604457412968,0.34919482454146483,7,235.17682600000001,136.51889199999999,3.8498740599999999,2.8826196500000001,3,19.062971999999998,19.062971999999998,8.3627199999999999E-2,8.3627199999999999E-2]
[null,"NU03","BAROSSA/MID NORTH & YORKE PENINSULA/RIVE","Rural Long",57.5,14.198930000000001,2.1510000000000001E-2,null,1.5112335402983577,0,3,1424.023226,207.6754,2.6898552699999998,1.7333335299999999]
[null,"NU04","BAROSSA/MID NORTH & YORKE PENINSULA/RIVE","Rural Short",465,28.813170000000003,2.2794499999999998,3.2008298923872855,2.1543506691055825,1.2402382106733256,6,225.457348,127.93261699999999,2.9369175699999999,1.97132617,3,129.79354799999999,129.79354799999999,0.4,0.4]
[null,"NU05","BAROSSA/MID NORTH & YORKE PENINSULA/RIVE","Rural Short",897.5,25.704059999999998,0.59916999999999998,2.5720954492397827,13.527153264588648,0.70517305294538624,7,733.45403899999997,590.59721400000001,6.7665738199999996,5.3660167100000002,11,38.235097000000003,38.235097000000003,0.15041783,0.15041783]
[null,"NU06","BAROSSA/MID NORTH & YORKE PENINSULA/RIVE","Rural Long",716.5,25.349973558999999,1.6060399999999999,3.7343015411184992,8.1518350580496151,1.107733835843244,1,616.44242799999995,null,0.96161898000000001,null,2,83.766923000000006,83.766923000000006,1.1751570099999999,1.1751570099999999]
[null,"NU07","BAROSSA/MID NORTH & YORKE PENINSULA/RIVE","Rural Long",57,35.342559999999999,null,null,2.4418167905118855,0.35032066409204776,6,2321.0877190000001,532.19298200000003,4.0701754399999999,2.0701754399999999,1,333,333,1,1]
[null,"NU08","BAROSSA/MID NORTH & YORKE PENINSULA/RIVE","Rural Long",76.5,52.43432,null,null,2.073685713857337,0.19087594478899733,2,1468.705882,27.189541999999999,1.6732026099999999,0.67973855999999999,2,135.18954199999999,135.18954199999999,1.9346405200000001,1.9346405200000001]
[null,"NU09","BAROSSA/MID NORTH & YORKE PENINSULA/RIVE","Rural Long",22,22.962299999999999,null,null,0.64888962162943031,5.3486606845727543E-2,2,1598.090909,201.727273,1.8636363600000001,0.95454545000000002,2,131.727273,131.727273,1.90909091,1.90909091]
[null,"NU10","BAROSSA/MID NORTH & YORKE PENINSULA/RIVE","Rural Long",93,20.049033003000002,null,null,0.96798208048235757,0,2,563.946237,108.139785,1.92473118,0.95698925000000001]
[null,"NU11","BAROSSA/MID NORTH & YORKE PENINSULA/RIVE","Rural Long",94.5,55.105379999999997,0.17186000000000001,null,2.6547665730467389,1.6610747467617247E-3,4,1522.1164020000001,319.51322800000003,3.2910052900000002,2.2962962999999998,1,0.95238100000000003,0.95238100000000003,2.1164019999999999E-2,2.1164019999999999E-2]
[null,"NU12","BAROSSA/MID NORTH & YORKE PENINSULA/RIVE","Rural Long",57,35.578859999999999,0.41032000000000002,null,1.7426888859859508,5.3338955757126494E-3,1,1656.526316,null,0.92982456000000002,null,2,5.0701749999999999,5.0701749999999999,5.2631579999999997E-2,5.2631579999999997E-2]
[null,"NU13","BAROSSA/MID NORTH & YORKE PENINSULA/RIVE","Rural Long",649.5,48.577732718,4.7714499999999997,null,12.758339848999208,1.0667791151425299E-2,13,1064.3104949999999,65.879394000000005,2.0523479600000001,1.0623556599999999,3,0.88991500000000001,0.88991500000000001,9.2378800000000004E-3,9.2378800000000004E-3]
[null,"NU14","BAROSSA/MID NORTH & YORKE PENINSULA/RIVE","Rural Long",247.5,72.116609999999994,0.43797000000000003,null,4.219111400388706,1.3156634813656616,15,923.63232300000004,619.73333300000002,7.9757575799999998,6.0323232300000003,8,288.02020199999998,288.02020199999998,0.90101010000000004,0.90101010000000004]
[null,"NU15","BAROSSA/MID NORTH & YORKE PENINSULA/RIVE","Rural Long",520,57.869459999999997,7.6374499999999994,2.4577800959402367,8.478789943498068,3.3107434469290191,6,883.453847,115.721154,1.61474359,0.65512820999999999,6,344.96538500000003,344.96538500000003,1.2134615399999999,1.2134615399999999]
[null,"NU16","BAROSSA/MID NORTH & YORKE PENINSULA/RIVE","Rural Long",96,67.343740000000011,null,null,2.7301055410054209,0.52988284421699028,4,1540.854167,4.5208329999999997,1.0416666699999999,4.1666670000000003E-2,3,299.0625,299.0625,2.15625,2.15625]
[null,"NU17","BAROSSA/MID NORTH & YORKE PENINSULA/RIVE","Rural Long",25.5,14.682088374999999,null,null,0.6629349314326044,0,4,1408.5882349999999,48.901961,1.09803922,0.23529412]
[null,"NU18","BAROSSA/MID NORTH & YORKE PENINSULA/RIVE","Rural Long",107.5,24.296060759999996,1.7179,null,1.302522534480169,0,8,656.49302299999999,562.55813999999998,6.4279069800000004,5.5069767399999998]
[null,"NU19","BAROSSA/MID NORTH & YORKE PENINSULA/RIVE","Rural Long",748.5,20.290400000000002,7.6943599999999996,2.5149377725900095,17.937004914590034,0.83498536242496879,3,1298.4088180000001,0.30193700000000001,0.96993987999999998,2.6720099999999998E-3,5,60.442217999999997,60.442217999999997,0.21376086,0.21376086]
[null,"NU20","BAROSSA/MID NORTH & YORKE PENINSULA/RIVE","Rural Long",875,37.085140000000003,0.58230000000000004,2.5149377725900095,8.341166875044296,0.75861283684607972,6,516.50209900000004,14.403813,1.0849524100000001,0.1146667,4,46.974857,46.974857,1.1782857099999999,1.1782857099999999]
[null,"NU21","BAROSSA/MID NORTH & YORKE PENINSULA/RIVE","Rural Long",2236.5,22.630959999999998,14.717988721999999,6.1920816370587364,11.535241296956421,1.3031500516067234,12,279.45450499999998,279.45450499999998,2.9827856000000001,2.9827856000000001,6,31.570311,31.570311,0.13190252999999999,0.13190252999999999]
[null,"NU22","BAROSSA/MID NORTH & YORKE PENINSULA/RIVE","Rural Long",139,31.535440000000001,0.28647,null,1.2698178627980157,0.17066620203672966,6,494.97124000000002,494.97124000000002,2.6282974000000001,2.6282974000000001,7,66.525180000000006,66.525180000000006,0.38129496000000002,0.38129496000000002]
[null,"NU23","BAROSSA/MID NORTH & YORKE PENINSULA/RIVE","Rural Long",47,18.270359275000001,null,null,0.2009900443581687,0,4,231.70212799999999,134.042553,3.82978723,2.8723404299999999]
[null,"NU24","BAROSSA/MID NORTH & YORKE PENINSULA/RIVE","Rural Long",84,35.195509999999999,0.17638999999999999,null,0.33110756618783715,1.2015107334909811E-2,5,213.57142899999999,213.57142899999999,1.04761905,1.04761905,1,7.75,7.75,3.5714290000000003E-2,3.5714290000000003E-2]
[null,"NU25","BAROSSA/MID NORTH & YORKE PENINSULA/RIVE","Rural Long",872.5,21.045203732000001,6.39926788,5.258506251779111,9.8489366704299943,0.78616822125624919,8,611.61375399999997,508.71404000000001,4.5226360999999997,4.4458452700000004,6,48.820630000000001,48.820630000000001,0.11461318,0.11461318]
[null,"NU26","BAROSSA/MID NORTH & YORKE PENINSULA/RIVE","Rural Long",49.5,4.0491399999999995,2.4991099999999999,4.7250346030478969,0.1812970804160047,5.8469831086012718E-2,1,198.444444,198.444444,0.94949494999999995,0.94949494999999995,1,64,64,0.22222222,0.22222222]
[null,"NU27","BAROSSA/MID NORTH & YORKE PENINSULA/RIVE","Rural Long",54.5,11.924999530000001,1.5198200000000002,null,0.21820985256626527,1.1904369018459029E-2,4,216.93577999999999,125.229358,3.5779816499999999,2.6788990799999999,1,11.834861999999999,11.834861999999999,5.5045869999999997E-2,5.5045869999999997E-2]
[null,"NU28","BAROSSA/MID NORTH & YORKE PENINSULA/RIVE","Rural Long",49,25.83145,null,null,0.38619987862210103,0.16920814753679436,6,427.04081600000001,331.28571399999998,4.8367346900000001,3.89795918,2,187.10204100000001,187.10204100000001,1,1]
[null,"NU30","BAROSSA/MID NORTH & YORKE PENINSULA/RIVE","Rural Long",56.5,5.1360299999999999,0.73012999999999995,4.0391424832506218,6.1791980579536165E-2,2.7832230201296455E-2,1,59.256636999999998,59.256636999999998,0.95575220999999999,0.95575220999999999,3,26.690265,26.690265,0.10619468999999999,0.10619468999999999]
[null,"NU31","BAROSSA/MID NORTH & YORKE PENINSULA/RIVE","Rural Long",340.5,33.385100000000001,4.13619,2.667358243656071,1.3339353002209784,0.22029542419275497,7,212.26138,212.26138,1.0435633799999999,1.0435633799999999,2,35.054332000000002,35.054332000000002,0.11160059,0.11160059]
[null,"NU32","BAROSSA/MID NORTH & YORKE PENINSULA/RIVE","Rural Long",6,0.17948,1.7349300000000001,0.24006224192904638,2.3144308138213367E-2,0,1,209,209,1,1]
[null,"NU33","BAROSSA/MID NORTH & YORKE PENINSULA/RIVE","Rural Long",655,14.300450000000001,3.79366,5.1441908984795655,5.4541573837053781,7.2884268610689459E-2,10,451.169465,451.169465,4.3236641200000001,4.3236641200000001,3,6.0290080000000001,6.0290080000000001,0.10687023,0.10687023]
[null,"NU34","BAROSSA/MID NORTH & YORKE PENINSULA/RIVE","Rural Long",1002,8.7977900000000009,10.118229999999999,5.0870332218297918,2.1965868662484511,0.30048842168919598,5,118.777449,118.777449,1.25249502,1.25249502,3,16.248502999999999,16.248502999999999,8.0838320000000005E-2,8.0838320000000005E-2]
[null,"NU35","BAROSSA/MID NORTH & YORKE PENINSULA/RIVE","Rural Long",82,81.444179999999989,5.8799999999999998E-2,null,1.122609680159059,0.45635260209367118,6,741.76829099999998,287.99999800000001,2.8902438899999998,1.9268292600000001,4,301.536585,301.536585,1.02439024,1.02439024]
[null,"PA01","MAJOR METROPOLITAN AREAS","Urban",408.5,3.0931570530000001,3.0081100000000003,4.4542786887579222,3.5416221534047385,0.13202101297541741,3,377.47123599999998,377.47123599999998,2.2423500600000001,2.2423500600000001,1,14.070990999999999,14.070990999999999,0.11750306000000001,0.11750306000000001]
[null,"PA02","MAJOR METROPOLITAN AREAS","Urban",1634,21.471191651000002,1.30579,3.9629322477175912,10.201073105285333,2.5191942841283459,11,271.81129900000002,271.81129900000002,1.1115870699999999,1.1115870699999999,5,67.124847000000003,67.124847000000003,0.19033048,0.19033048]
[null,"PA03","UPPER NORTH/EYRE PENINSULA","Urban",1118,9.3203054719999994,0.63485999999999998,3.7844669286581172,6.4747257407394168,1.9672922450214729,4,252.146691,252.146691,1.01520572,1.01520572,8,76.612701000000001,76.612701000000001,0.20930233000000001,0.20930233000000001]
[null,"PA04","UPPER NORTH/EYRE PENINSULA","Urban",710.5,9.6101700000000001,4.7166999999999994,2.9434679269922404,9.4694988513585407,0.40437751469123151,6,580.27867700000002,580.27867700000002,3.0344827599999999,3.0344827599999999,2,24.779733,24.779733,6.7558060000000003E-2,6.7558060000000003E-2]
[null,"PA05","UPPER NORTH/EYRE PENINSULA","Rural Long",696,27.666979999999999,4.1239999999999997,2.1148340360415991,5.8297817567792496,3.8813779915998971E-2,5,453.83333299999998,453.83333299999998,1.9267241399999999,1.9267241399999999,4,3.0215519999999998,3.0215519999999998,5.4597699999999999E-2,5.4597699999999999E-2]
[null,"PA06","UPPER NORTH/EYRE PENINSULA","Rural Long",955.5,0.11985,16.229179999999999,2.7988208999505488,11.630051752224366,0.17480043251755886,5,659.48404000000005,659.48404000000005,4.83516484,4.83516484,1,9.9120880000000007,9.9120880000000007,3.4536890000000001E-2,3.4536890000000001E-2]
[null,"PA07","UPPER NORTH/EYRE PENINSULA","Rural Long",676,4.674145942,3.2781700000000003,3.4675657167528922,8.4152753525134809,0,7,674.48915099999999,674.48915099999999,3.7016765199999999,3.7016765199999999]
[null,"PA08","UPPER NORTH/EYRE PENINSULA","Rural Long",624.5,9.893559242000002,0.15915000000000001,null,13.428128252821784,9.4283525445499254,4,1165.028022,1165.028022,3.7886308999999998,3.7886308999999998,6,818.00640499999997,818.00640499999997,2.1216973600000002,2.1216973600000002]
[null,"PA09","UPPER NORTH/EYRE PENINSULA","Rural Long",3,null,1.8618399999999999,null,1.7385915682772719E-2,2.5838940505182388E-4,2,314,314,1.3333333300000001,1.3333333300000001,2,4.6666670000000003,4.6666670000000003,1.3333333300000001,1.3333333300000001]
[null,"PA10","UPPER NORTH/EYRE PENINSULA","Rural Long",244.5,14.011599999999998,null,null,3.3520303825790854,1.0241264069229039,3,742.81799599999999,742.81799599999999,2.1226993900000002,2.1226993900000002,2,226.94887499999999,226.94887499999999,1.0879345600000001,1.0879345600000001]
[null,"PA11","UPPER NORTH/EYRE PENINSULA","Rural Long",98.5,61.384529999999998,0.44871,null,1.4267340127657955,0.34694314544029892,5,784.80202999999995,784.80202999999995,3.0253807099999999,3.0253807099999999,2,190.84263999999999,190.84263999999999,0.96446701000000001,0.96446701000000001]
[null,"PA12","UPPER NORTH/EYRE PENINSULA","Rural Long",53,55.273830000000004,7.7109999999999998E-2,null,0.6939601164248983,0.53462613543829862,2,709.43396199999995,709.43396199999995,1.88679245,1.88679245,3,546.54717000000005,546.54717000000005,2.6226415099999998,2.6226415099999998]
[null,"PA13","UPPER NORTH/EYRE PENINSULA","Rural Long",401.5,15.84764,0.76018000000000008,1.6728146699500217,2.1574038457686053,0,6,291.13822699999997,291.13822699999997,2.0813615400000001,2.0813615400000001]
[null,"PA14","UPPER NORTH/EYRE PENINSULA","Rural Long",457.5,9.8058099999999992,0.43635000000000002,1.7528354172597038,2.3742848633428437,0,3,281.18688400000002,281.18688400000002,1.97085607,1.97085607]
[null,"PA15","UPPER NORTH/EYRE PENINSULA","Rural Long",79.5,87.135559999999998,0.28458,null,1.7365613658090078,1.1702456154797103,4,1183.522013,1183.522013,3.8993710699999999,3.8993710699999999,5,797.55974800000001,797.55974800000001,2.1383647799999999,2.1383647799999999]
[null,"PA16","UPPER NORTH/EYRE PENINSULA","Rural Long",2,9.6278799999999993,null,null,1.6906049644819333E-2,2.8459747327850886E-2,3,458,458,3,3,2,771,771,2,2]
[null,"PA17","UPPER NORTH/EYRE PENINSULA","Rural Long",9.5,68.739940000000004,null,null,0.60468657697949324,0.11627523227332073,7,3448.7368419999998,3448.7368419999998,6.9473684200000001,6.9473684200000001,3,663.15789500000005,663.15789500000005,2.6315789500000002,2.6315789500000002]
[null,"PA18","UPPER NORTH/EYRE PENINSULA","Rural Long",96,70.194399999999987,0.10466,null,0.70208092629795571,1.2091701337121599,2,396.25,396.25,1.9270833300000001,1.9270833300000001,5,682.44791699999996,682.44791699999996,2.9375,2.9375]
[null,"PA19","UPPER NORTH/EYRE PENINSULA","Rural Long",25,104.30564,0.26085000000000003,null,1.5405914584632745,0.22328535873692607,13,3338.88,3338.88,10.16,10.16,2,483.92,483.92,1.84,1.84]
[null,"PA20","UPPER NORTH/EYRE PENINSULA","Rural Long",70,4.1564100000000002,null,null,0.60302550223273144,0,3,466.75714299999999,466.75714299999999,2.0142857099999998,2.0142857099999998]
[null,"PA21","UPPER NORTH/EYRE PENINSULA","Rural Long",16,22.244669999999999,0.25236000000000003,null,0.28880552930363856,7.0872522528500265E-2,4,978,978,3,3,1,240,240,0.75,0.75]
[null,"PA22","UPPER NORTH/EYRE PENINSULA","Rural Long",70,71.402850000000001,null,null,1.5193850708629495,1.0174821079358569,4,1176.0428569999999,1176.0428569999999,3.8142857100000001,3.8142857100000001,3,787.557143,787.557143,2.0714285700000001,2.0714285700000001]
[null,"PA23","UPPER NORTH/EYRE PENINSULA","Rural Long",92.5,88.757859999999994,null,null,3.4319649906704748,1.3185795903655324,7,2010.27027,2010.27027,6.5837837800000001,6.5837837800000001,7,772.35675700000002,772.35675700000002,2.0324324300000001,2.0324324300000001]
[null,"PA24","UPPER NORTH/EYRE PENINSULA","Rural Long",30,97.358109999999996,9.8239999999999994E-2,null,1.2489498082544634,0.46458415028317934,5,2255.6777969999998,2255.6777969999998,4.7555556299999999,4.7555556299999999,3,839.06666700000005,839.06666700000005,2.9,2.9]
[null,"PA25","UPPER NORTH/EYRE PENINSULA","Rural Short",10,64.179550000000006,0.27723999999999999,null,0.36742318995988771,5.1702278855653094E-2,4,1788,1788,1.9,1.9,3,251.6,251.6,1.2,1.2]
[null,"PA26","UPPER NORTH/EYRE PENINSULA","Rural Long",196.5,8.346412119,2.6871399999999999,0.87641770862985191,1.7004606746460527,2.746310247979385E-2,4,468.87531799999999,468.87531799999999,2.9618320599999999,2.9618320599999999,2,7.5725189999999998,7.5725189999999998,5.5979639999999997E-2,5.5979639999999997E-2]
[null,"PA32","UPPER NORTH/EYRE PENINSULA","Rural Long",11,39.361370000000001,0.29014000000000001,null,0.47539959252320568,5.3154391896375192E-2,8,2341.636364,2341.636364,6.5454545499999996,6.5454545499999996,1,261.81818199999998,261.81818199999998,0.81818181999999995,0.81818181999999995]
[null,"PA33","UPPER NORTH/EYRE PENINSULA","Rural Long",22,46.624170000000007,6.96E-3,null,0.51952881162884212,0.12402691442487546,5,1279.5,1279.5,3.2727272699999999,3.2727272699999999,1,305.454545,305.454545,0.95454545000000002,0.95454545000000002]
[null,"PL01","MAJOR METROPOLITAN AREAS","Urban",1776,10.070099872999998,1.6258800000000002,1.7564172983297563,2.9880433991539945,1.8895450061693873,8,73.251688000000001,6.4679039999999999,0.65277777000000003,5.6493990000000001E-2,5,46.322071999999999,46.322071999999999,0.16779279,0.16779279]
[null,"PL02","MAJOR METROPOLITAN AREAS","Urban",2,6.2683671999999996E-2,0.43667,3.475605896601627,5.1448689816446583E-3,0,1,112,null,1]
[null,"PL03","MAJOR METROPOLITAN AREAS","Urban",339.5,0.51069068800000006,3.4325999999999999,3.3044377075944404,1.3670654372488169,0,6,175.31667400000001,7.7378499999999999,1.5778108,7.0692190000000002E-2]
[null,"PL04","MAJOR METROPOLITAN AREAS","Urban",558.5,13.896190566,0.50047000000000008,2.8467190329830578,4.8370955693498439E-2,3.860948552743157E-2,4,3.7708149999999998,0.65532699999999999,0.63205012999999999,8.9525500000000001E-3,11,3.0098479999999999,2.9149509999999998,4.6553270000000001E-2,4.4762759999999999E-2]
[null,"PL05","MAJOR METROPOLITAN AREAS","Urban",117.5,48.686609802,null,null,0.22405445772960941,9.7844383311635016E-2,5,83.021279000000007,78.170214999999999,1.7617021399999999,0.79148938000000002,3,36.255319,36.255319,0.23829786999999999,0.23829786999999999]
[null,"PL06","MAJOR METROPOLITAN AREAS","Urban",1745.5,7.1084904159999995,4.032,4.2942752992563245,9.7844383311635023E-3,1.1409436011749929,3,0.244056,0.244056,1.71871E-3,1.71871E-3,6,28.458894000000001,28.458894000000001,8.5362359999999998E-2,8.5362359999999998E-2]
[null,"PL07","MAJOR METROPOLITAN AREAS","Urban",2484,33.996903449999998,4.3881014319999991,7.0554102377357895,0.48674890128587245,5.3556018964062204,8,8.5315329999999996,4.6313719999999998,0.99852386999999998,2.3483609999999999E-2,15,93.870773,93.870773,0.29710144999999999,0.29710144999999999]
[null,"PL08","MAJOR METROPOLITAN AREAS","Urban",41,21.254519999999999,8.6840000000000001E-2,null,3.5600655899773307E-3,0,1,3.7804880000000001,null,0.75609755999999995]
[null,"PL10","UPPER NORTH/EYRE PENINSULA","Rural Long",69,42.913770000000007,null,null,0.16948499332792133,0,2,133.08695700000001,4.5942030000000003,0.88405796999999997,1.449275E-2]
[null,"PL11","UPPER NORTH/EYRE PENINSULA","Rural Long",102.5,24.84186,1.01451,0.27435684791891013,0.34018810813680123,2.6429544859586554E-2,2,179.82438999999999,79.434145999999998,1.6195122,0.67317073000000005,1,13.970732,13.970732,7.8048779999999998E-2,7.8048779999999998E-2]
[null,"PL12","UPPER NORTH/EYRE PENINSULA","Rural Long",747.5,10.263920000000001,2.7060300000000002,1.7147302994931886,4.0548864770921966,1.1889234781877422,4,293.91438099999999,194.01872900000001,1.9638796000000001,1.00334448,12,86.177925999999999,86.177925999999999,0.42006689000000003,0.42006689000000003]
[null,"PL13","UPPER NORTH/EYRE PENINSULA","Rural Long",17,15.84592,null,0.64397649025410852,0.16597827997364656,9.2281930375651383E-4,2,529,324,2,1,1,2.941176,2.941176,5.8823529999999999E-2,5.8823529999999999E-2]
[null,"PL14","UPPER NORTH/EYRE PENINSULA","Urban",563.5,41.973887009999999,2.0234999999999999,null,4.2084339224900411,1.7102784775902065,5,325.16237799999999,321.28660200000002,3.1055900599999999,2.1366459600000001,10,132.143744,132.143744,0.42590949,0.42590949]
[null,"PL15","UPPER NORTH/EYRE PENINSULA","Rural Long",67.5,19.433400000000002,0.61887000000000003,0.58300830182768415,0.56768152289885709,0.15599337510700109,3,455.67407400000002,343.73333300000002,2.0148148099999998,1.0074074099999999,4,125.214815,125.214815,0.66666667000000002,0.66666667000000002]
[null,"PL20","UPPER NORTH/EYRE PENINSULA","Rural Long",34,41.186649999999993,null,null,0.78413801878798495,0,4,1249.5882349999999,1127.7647059999999,4,3]
[null,"PL21","UPPER NORTH/EYRE PENINSULA","Rural Long",70.5,57.563420000000001,null,null,0.12284570571606712,0,1,94.411348000000004,null,0.90780141999999997]
[null,"PL22","UPPER NORTH/EYRE PENINSULA","Rural Long",46,54.96622,null,null,0.19857225778232665,0,4,233.89130399999999,132.152174,1.30434783,0.32608695999999998]
[null,"PL23","UPPER NORTH/EYRE PENINSULA","Rural Long",55,29.343229999999998,null,null,0.40605895003894116,7.2053731237308599E-2,2,400.01818200000002,296.67272700000001,1.7818181799999999,0.89090908999999996,3,70.981818000000004,70.981818000000004,0.43636364,0.43636364]
[null,"PL24","UPPER NORTH/EYRE PENINSULA","Rural Long",63,62.00629,null,null,2.8201911614381312,9.6360791698255163E-2,9,2425.4444440000002,2425.4444440000002,6.1428571400000003,6.1428571400000003,4,82.873016000000007,82.873016000000007,0.74603174999999999,0.74603174999999999]
[null,"PL25","UPPER NORTH/EYRE PENINSULA","Rural Long",65,46.816919999999996,null,null,0.26278202493770486,0.30895990289768083,2,219.046154,106.615385,1.93846154,0.96923077000000002,1,257.53846199999998,257.53846199999998,0.95384614999999995,0.95384614999999995]
[null,"PL26","UPPER NORTH/EYRE PENINSULA","Urban",1,20.98094,null,null,1.1484082548313971E-4,0,1,5,null,1]
[null,"PL27","UPPER NORTH/EYRE PENINSULA","Rural Long",188,44.078809999999997,null,null,2.2415465452106473,6.8583930655184103E-2,2,646.01595699999996,548.10106399999995,1.8882978699999999,0.94680850999999999,2,19.765957,19.765957,0.93617021,0.93617021]
[null,"PL28","UPPER NORTH/EYRE PENINSULA","Rural Long",93,15.74531,null,null,1.7061083287850427,0,4,993.97849499999995,516.946237,3.6666666700000001,1.7204301099999999]
[null,"PL29","UPPER NORTH/EYRE PENINSULA","Rural Long",88,17.047139999999999,null,null,0.54402043595054006,2.9733237967034871E-2,2,334.954545,235.68181799999999,1.9204545500000001,0.96590909000000003,3,18.306818,18.306818,0.23863635999999999,0.23863635999999999]
[null,"PL32","MAJOR METROPOLITAN AREAS","Urban",1,11.249517428999999,1.61263,null,2.5494663257257014E-3,0,1,111,null,1]
[null,"PL33","UPPER NORTH/EYRE PENINSULA","Rural Long",56,101.89373999999999,0.14155000000000001,null,0.28369311036082745,3.6912772150260553E-3,5,274.48214300000001,100.57142899999999,1.4285714300000001,0.57142857000000002,2,3.5714290000000002,3.5714290000000002,3.5714290000000003E-2,3.5714290000000003E-2]
[null,"PL34","UPPER NORTH/EYRE PENINSULA","Rural Long",26,34.093939999999996,10.350160000000001,null,8.2666153230508507E-2,1.535571321450839E-2,4,172.26923099999999,87.5,1.57692308,0.84615384999999999,1,32,32,0.30769231000000002,0.30769231000000002]
[null,"PL754A","UPPER NORTH/EYRE PENINSULA","Rural Long",19,1.02396,12.81583,1.1431535329954587,3.8536934124872017E-2,0,1,109.89473700000001,null,0.94736841999999999]
[null,"PL803A","MAJOR METROPOLITAN AREAS","Urban",693.5,7.30531329,14.21965,3.0484094213212236,3.2582179642774465,0.26252612705445738,1,204.55371299999999,null,1.8428262399999999,null,2,16.481615000000001,16.481615000000001,0.23648161000000001,0.23648161000000001]
[null,"PL803C","MAJOR METROPOLITAN AREAS","Urban",552,14.327229890999998,1.79684,4.2106155131999401,2.8044972073652992,2.126323820150525,4,221.20229699999999,5.8200510000000003,1.9861111199999999,2.777779E-2,9,167.71195700000001,167.71195700000001,0.65036232000000005,0.65036232000000005]
[null,"PP01","UPPER NORTH/EYRE PENINSULA","Urban",383,3.4277399999999996,4.3546700000000005,4.5175331842503379,0.11496320740033271,0,3,13.068742,13.068742,6.4403769999999999E-2,6.4403769999999999E-2]
[null,"PP02","UPPER NORTH/EYRE PENINSULA","Urban",1117,9.3842599999999994,1.9970699999999999,2.8273997382754357,7.3544064639402662E-2,0.49434381737472322,3,2.8666070000000001,2.8666070000000001,5.0134289999999998E-2,5.0134289999999998E-2,2,19.268577000000001,19.268577000000001,6.0877349999999997E-2,6.0877349999999997E-2]
[null,"PP03","UPPER NORTH/EYRE PENINSULA","Urban",2476.5,16.261609999999997,3.6633200000000001,6.3446545285958624,3.2412520898856325,0.98763109915500136,7,56.983376,56.983376,1.0257756099999999,1.0257756099999999,4,17.363213999999999,17.363213999999999,6.1780740000000001E-2,6.1780740000000001E-2]
[null,"PP04","UPPER NORTH/EYRE PENINSULA","Rural Short",1975.5,44.785849999999996,5.0009899999999998,6.6311859616411759,2.4225268035370591,0.18030039534161377,15,59.675010999999998,59.675010999999998,1.17084279,1.17084279,4,4.4414069999999999,4.4414069999999999,2.0248039999999998E-2,2.0248039999999998E-2]
[null,"PP06","UPPER NORTH/EYRE PENINSULA","Rural Long",261,36.714529999999996,0.15569999999999998,0.92595436172632162,1.7349002910622458E-2,0.46713113156154729,1,3.6015329999999999,3.6015329999999999,1.532567E-2,1.532567E-2,3,96.973179999999999,96.973179999999999,0.34099616999999999,0.34099616999999999]
[null,"PP07","UPPER NORTH/EYRE PENINSULA","Rural Long",60,24.64357,0.90977999999999992,null,0.21309743362345415,2.4916121201425871E-3,2,192.433333,192.433333,0.8,0.8,1,2.25,2.25,0.05,0.05]
[null,"PP08","UPPER NORTH/EYRE PENINSULA","Rural Long",579,71.499989999999997,1.3721499999999998,null,3.3132168844367342,2.6986743155194741,6,310.04493100000002,310.04493100000002,1.0995970500000001,1.0995970500000001,11,252.53713300000001,252.53713300000001,1.1433506,1.1433506]
[null,"PP09","UPPER NORTH/EYRE PENINSULA","Rural Long",780,27.050147267,0.75724000000000002,null,3.4513441960493615E-3,7.2755073908163548E-2,1,0.23974400000000001,0.23974400000000001,1.2820500000000001E-3,1.2820500000000001E-3,9,5.0538460000000001,5.0538460000000001,1.00384615,1.00384615]
[null,"PP10","UPPER NORTH/EYRE PENINSULA","Urban",1673.5,15.16296,0.86485000000000001,4.7440871619311551,4.7773735627202711E-3,3.9964607268132618E-3,1,0.12429,0.12429,4.7803999999999998E-3,4.7803999999999998E-3,2,0.103974,0.103974,1.1950999999999999E-3,1.1950999999999999E-3]
[null,"PP12","UPPER NORTH/EYRE PENINSULA","Rural Long",81.5,90.924689999999998,1.5820000000000001E-2,null,1.9442695346985239,0.33372837301050562,5,1292.564417,1292.564417,1.92638037,1.92638037,4,221.86503099999999,221.86503099999999,2.5276073600000002,2.5276073600000002]
[null,"PP13","UPPER NORTH/EYRE PENINSULA","Rural Long",79.5,84.500720000000001,0.29346,null,2.3070482593912844E-3,1.2605711689313978E-2,4,1.572327,1.572327,5.031447E-2,5.031447E-2,4,8.5911950000000008,8.5911950000000008,0.93081760999999996,0.93081760999999996]
[null,"PP14","UPPER NORTH/EYRE PENINSULA","Rural Long",67,57.085260000000005,0.57467000000000001,null,0.66646010117295418,0,3,538.95522400000004,538.95522400000004,1.86567164,1.86567164]
[null,"PP15","UPPER NORTH/EYRE PENINSULA","Rural Long",57.5,20.274080000000001,0.22927,null,2.5838940505182388E-4,3.1375856327721468E-3,1,0.243478,0.243478,3.4782609999999999E-2,3.4782609999999999E-2,1,2.9565220000000001,2.9565220000000001,3.4782609999999999E-2,3.4782609999999999E-2]
[null,"PP16","UPPER NORTH/EYRE PENINSULA","Rural Short",93.5,116.78644,0.19792999999999999,null,0.89644682734790271,0.36978637043222479,7,466.566846,466.566846,3.79679148,3.79679148,6,192.45989299999999,192.45989299999999,1.8395721899999999,1.8395721899999999]
[null,"PP17","UPPER NORTH/EYRE PENINSULA","Rural Long",59,62.126429999999999,null,null,0.80349876778079654,1.6241619746114643E-3,2,737.88135599999998,737.88135599999998,1.3559322,1.3559322,1,1.491525,1.491525,1.694915E-2,1.694915E-2]
[null,"R01","BAROSSA/MID NORTH & YORKE PENINSULA/RIVE","Rural Long",153.5,28.617620000000002,2.7913800000000002,0.43820885431492596,0.52907076322968449,0.12860409817150775,3,186.74918600000001,186.74918600000001,1.0749185699999999,1.0749185699999999,1,45.394137000000001,45.394137000000001,0.67752442999999996,0.67752442999999996]
[null,"R02","BAROSSA/MID NORTH & YORKE PENINSULA/RIVE","Rural Long",388.5,20.27112,0.16905000000000001,null,6.2788625427593198E-2,6.8860776446311056E-2,1,8.7567570000000003,8.7567570000000003,5.4054049999999999E-2,5.4054049999999999E-2,2,9.6036040000000007,9.6036040000000007,3.6036039999999998E-2,3.6036039999999998E-2]
[null,"R03","BAROSSA/MID NORTH & YORKE PENINSULA/RIVE","Rural Long",113,33.509020000000007,0.33285999999999999,null,4.6510053228098237E-3,0.32684414100448206,2,2.2300870000000002,2.2300870000000002,1.7699110000000001E-2,1.7699110000000001E-2,12,156.716814,156.716814,1.07964602,1.07964602]
[null,"R04","BAROSSA/MID NORTH & YORKE PENINSULA/RIVE","Rural Long",341.5,35.276809999999998,0.45462999999999998,0.60968188426424474,5.5375336685193344E-2,0.77616486000352858,2,8.7857529999999997,8.7857529999999997,4.1971710000000002E-2,4.1971710000000002E-2,1,123.144949,123.144949,0.75549047999999996,0.75549047999999996]
[null,"R05","BAROSSA/MID NORTH & YORKE PENINSULA/RIVE","Rural Long",53,49.60286,null,null,0.39511431309638889,2.9345653859457138E-3,3,403.92452800000001,403.92452800000001,2.7169811300000002,2.7169811300000002,1,3,3,1.886792E-2,1.886792E-2]
[null,"R06","BAROSSA/MID NORTH & YORKE PENINSULA/RIVE","Rural Long",58,45.020600000000002,null,null,0,0.10108562653348852,null,null,null,null,null,2,94.431033999999997,94.431033999999997,0.74137931000000001,0.74137931000000001]
[null,"R07","BAROSSA/MID NORTH & YORKE PENINSULA/RIVE","Rural Short",120,92.963499999999996,0.18076,null,1.9028740151166443E-2,1.7035448796238639E-2,2,7.7166670000000002,7.7166670000000002,3.3333330000000001E-2,3.3333330000000001E-2,4,6.9083329999999998,6.9083329999999998,1.05,1.05]
[null,"R08","BAROSSA/MID NORTH & YORKE PENINSULA/RIVE","Rural Long",98,62.458829999999999,0.42293999999999998,null,1.0076018282614665,5.4630902782385618E-3,4,557.07825300000002,557.07825300000002,3.0544218399999998,3.0544218399999998,1,3.0204080000000002,3.0204080000000002,8.1632650000000001E-2,8.1632650000000001E-2]
[null,"R09","BAROSSA/MID NORTH & YORKE PENINSULA/RIVE","Rural Long",199.5,44.802599999999998,1.41371,null,0.98057573040659241,0,5,266.31251400000002,266.31251400000002,1.7978280499999999,1.7978280499999999]
[null,"R10","BAROSSA/MID NORTH & YORKE PENINSULA/RIVE","Rural Long",80,55.479410000000001,null,null,1.0686247537500428,8.3201388426687298E-2,3,723.75,723.75,0.97499999999999998,0.97499999999999998,2,56.35,56.35,0.58750000000000002,0.58750000000000002]
[null,"R11","BAROSSA/MID NORTH & YORKE PENINSULA/RIVE","Rural Long",89,70.707750000000004,0.42795,null,0.89961962646007509,0,5,547.67415700000004,327.58427,1.9101123600000001,0.97752808999999996]
[null,"R12","BAROSSA/MID NORTH & YORKE PENINSULA/RIVE","Rural Long",95.5,65.129139999999992,null,null,3.970780725747828,0,5,2252.8167539999999,714.86910999999998,2.8900523599999999,1.9371727700000001]
[null,"R13","BAROSSA/MID NORTH & YORKE PENINSULA/RIVE","Rural Long",77,36.602890000000002,null,null,0,4.1286935650066428E-2,null,null,null,null,null,4,29.051947999999999,29.051947999999999,0.22077922,0.22077922]
[null,"R14","BAROSSA/MID NORTH & YORKE PENINSULA/RIVE","Rural Long",221.5,59.956629999999997,0.11591,null,2.0846303507998893,1.1756717929857986E-2,4,509.92776500000002,338.46952599999997,1.8735891600000001,0.94356658999999998,2,2.8758469999999998,2.8758469999999998,1.8058689999999999E-2,1.8058689999999999E-2]
[null,"R15","BAROSSA/MID NORTH & YORKE PENINSULA/RIVE","Rural Long",112.5,80.723479999999995,0.25918999999999998,null,0.58971849467795767,1.3657725695596405E-3,3,284.01780000000002,284.01780000000002,1.74222229,1.74222229,1,0.65777799999999997,0.65777799999999997,8.88889E-3,8.88889E-3]
[null,"R16","BAROSSA/MID NORTH & YORKE PENINSULA/RIVE","Rural Long",76.5,65.548850000000002,0.34555000000000002,null,0,4.9832242402851742E-4,null,null,null,null,null,2,0.352941,0.352941,2.614379E-2,2.614379E-2]
[null,"R17","BAROSSA/MID NORTH & YORKE PENINSULA/RIVE","Rural Long",76.5,56.101559999999999,null,null,0.72504067057541777,0,2,513.51634000000001,513.51634000000001,1.00653595,1.00653595]
[null,"R18","BAROSSA/MID NORTH & YORKE PENINSULA/RIVE","Rural Long",654,48.153880000000001,1.4516900000000001,1.9243084472090224,4.9873215434871332,3.2501695878304419E-2,7,413.18348500000002,385.11009100000001,1.96228337,1.8063200699999999,5,2.6926610000000002,2.6926610000000002,4.2813459999999998E-2,4.2813459999999998E-2]
[null,"R20","BAROSSA/MID NORTH & YORKE PENINSULA/RIVE","Rural Long",689,7.5979918289999997,1.26841,2.1193373681412782,1.8444758551902942,0.24746322449534675,2,145.04644400000001,145.04644400000001,0.96516690999999999,0.96516690999999999,3,19.460087000000001,19.460087000000001,0.11030479,0.11030479]
[null,"R21","BAROSSA/MID NORTH & YORKE PENINSULA/RIVE","Rural Long",628,67.227829999999997,0.67083000000000004,2.0576763593918259,18.038730391268661,7.3198027173966673E-2,5,1556.3227199999999,33.932592999999997,1.0498938499999999,0.11199576,2,6.3152869999999997,6.3152869999999997,4.2993629999999998E-2,4.2993629999999998E-2]
[null,"R22","BAROSSA/MID NORTH & YORKE PENINSULA/RIVE","Rural Long",11.5,6.2009199999999991,null,null,0.27583068989282195,2.3162764524288497E-2,5,1299.5652170000001,541.47826099999997,2.60869565,2.0869565200000002,1,109.13043500000001,109.13043500000001,0.43478261000000001,0.43478261000000001]
[null,"R23","BAROSSA/MID NORTH & YORKE PENINSULA/RIVE","Rural Long",354.5,3.0084599999999999,1.4121300000000001,1.0135961325893068,0.95190656821091901,0,2,145.48942199999999,145.48942199999999,0.97320169000000001,0.97320169000000001]
[null,"R24","BAROSSA/MID NORTH & YORKE PENINSULA/RIVE","Rural Long",32,1.6106500000000001,null,null,0,0.11442959366580771,null,null,null,null,null,1,193.75,193.75,0.96875,0.96875]
[null,"R25","BAROSSA/MID NORTH & YORKE PENINSULA/RIVE","Rural Long",127.5,98.501609999999999,null,null,5.3102714015364825,0.25724510911516579,6,2256.6274509999998,828.23529399999995,4.5725490200000003,3.6627451,4,109.31764699999999,109.31764699999999,0.95686274999999998,0.95686274999999998]
[null,"R26","BAROSSA/MID NORTH & YORKE PENINSULA/RIVE","Rural Long",103,63.312640000000002,null,null,4.1894519879659713,2.2147663290156332E-4,8,2203.8058249999999,931.54368899999997,3.26213592,2.4563106800000001,1,0.116505,0.116505,9.7087400000000004E-3,9.7087400000000004E-3]
[null,"R27","BAROSSA/MID NORTH & YORKE PENINSULA/RIVE","Rural Long",38,39.008760000000002,null,null,7.0484938420922516E-2,0.10222992247014659,1,100.5,100.5,7.8947370000000003E-2,7.8947370000000003E-2,1,145.763158,145.763158,0.76315789000000001,0.76315789000000001]
[null,"R28","BAROSSA/MID NORTH & YORKE PENINSULA/RIVE","Rural Long",94,55.490209999999998,null,null,3.9217974771044322,0.15769136262591307,3,2260.531915,428.24468100000001,2.6595744699999999,1.7659574499999999,6,90.893617000000006,90.893617000000006,0.56382979,0.56382979]
[null,"R29","BAROSSA/MID NORTH & YORKE PENINSULA/RIVE","Rural Long",97,74.321240000000003,0.25536999999999999,null,0.23925013269191375,1.8161083897928192E-2,1,133.63917499999999,133.63917499999999,0.89690722000000001,0.89690722000000001,1,10.14433,10.14433,0.86597937999999997,0.86597937999999997]
[null,"R30","BAROSSA/MID NORTH & YORKE PENINSULA/RIVE","Rural Long",70,67.011250000000004,null,null,0.86417726785183913,7.7812123692749244E-2,5,668.89528099999995,668.89528099999995,1.7904762599999999,1.7904762599999999,3,60.228571000000002,60.228571000000002,0.8,0.8]
[null,"R31","BAROSSA/MID NORTH & YORKE PENINSULA/RIVE","Rural Long",29,22.406560000000002,null,null,6.8750038129860275E-2,0,1,128.44827599999999,128.44827599999999,0.86206897000000005,0.86206897000000005]
[null,"R32","BAROSSA/MID NORTH & YORKE PENINSULA/RIVE","Rural Long",90,62.307989999999997,null,null,3.5806865496638745,0,7,2155.644444,869.24444400000004,3.85555556,2.9777777799999998]
[null,"R33","BAROSSA/MID NORTH & YORKE PENINSULA/RIVE","Rural Long",98,68.725080000000005,0.32785000000000003,null,1.179547634061576,0.18770144638407493,6,652.14285700000005,652.14285700000005,1.0102040800000001,1.0102040800000001,2,103.77551,103.77551,1.1224489799999999,1.1224489799999999]
[null,"R34","BAROSSA/MID NORTH & YORKE PENINSULA/RIVE","Rural Short",15,4.2082299999999995,null,null,3.2858483263191296E-2,0,1,106.6,106.6,0.86666666999999997,0.86666666999999997]
[null,"R35","BAROSSA/MID NORTH & YORKE PENINSULA/RIVE","Rural Long",79.5,63.285309999999996,0.33859,null,1.9968886913987203,0,7,1360.9433959999999,1360.9433959999999,6.0880503099999999,6.0880503099999999]
[null,"R36","BAROSSA/MID NORTH & YORKE PENINSULA/RIVE","Rural Short",39,36.647469999999998,0.1623,null,9.0992722882683591E-2,6.5963559271322112E-3,1,113.538462,113.538462,0.92307691999999997,0.92307691999999997,1,8.2307690000000004,8.2307690000000004,0.61538462000000005,0.61538462000000005]
[null,"SA11","MAJOR METROPOLITAN AREAS","Urban",2261.5,8.4400405809999999,8.0452176699999995,7.1305078038300369,7.0402708699136864,2.7873705797965735,13,135.53968599999999,135.53968599999999,2.7472916199999999,2.7472916199999999,12,53.662613,53.662613,0.31616184000000003,0.31616184000000003]
[null,"SA12","MAJOR METROPOLITAN AREAS","Urban",404,4.6351986589999994,2.4579009470000002,7.2049328145957077,0.60835766840042194,0.50031554029984637,3,65.561868000000004,65.561868000000004,0.15759068000000001,0.15759068000000001,3,53.918317000000002,53.918317000000002,0.33663366,0.33663366]
[null,"SA13","MAJOR METROPOLITAN AREAS","Urban",1104.5,5.558676717,5.5491947790000005,7.3984420341494026,0.29152711726284697,0.38655421857624822,9,11.491770000000001,11.491770000000001,7.3638129999999996E-2,7.3638129999999996E-2,2,15.237664000000001,15.237664000000001,9.2349479999999998E-2,9.2349479999999998E-2]
[null,"SA14","MAJOR METROPOLITAN AREAS","Urban",3253.5,10.528016141,25.111656122999999,8.5355463796994258,1.2982678000837962,1.0714189654275001,14,17.373494000000001,17.373494000000001,0.23533633000000001,0.23533633000000001,12,14.33779,14.33779,7.46888E-2,7.46888E-2]
[null,"SA16","MAJOR METROPOLITAN AREAS","Urban",1852,14.530850698,1.80081,6.1331939880623629,0.49884556386089052,4.4464530173863963,12,11.727321,11.727321,0.13606910999999999,0.13606910999999999,20,104.531317,104.531317,0.43736501,0.43736501]
[null,"SA17","MAJOR METROPOLITAN AREAS","Urban",2545,14.948075688000001,8.4210140609999993,5.9248009095090675,15.834314249158648,1.6125029987738613,19,270.88513399999999,270.88513399999999,3.0446627500000001,3.0446627500000001,4,27.585854999999999,27.585854999999999,0.11709234,0.11709234]
[null,"SA18","MAJOR METROPOLITAN AREAS","Urban",2383,12.008145995000001,5.631892627,4.8202973974641852,6.6680107633643058,3.7353356578296988,15,121.827673,121.827673,1.79955273,1.79955273,16,68.246328000000005,68.246328000000005,0.25178347000000001,0.25178347000000001]
[null,"SA19","MAJOR METROPOLITAN AREAS","Urban",1463.5,7.5160929829999992,14.746307135,6.3445021081247974,4.4627680435269754,0.43343224353846588,7,132.76551599999999,132.76551599999999,1.02653455,1.02653455,3,12.894431000000001,12.894431000000001,3.7581139999999999E-2,3.7581139999999999E-2]
[null,"SA20","MAJOR METROPOLITAN AREAS","Urban",2508.5,9.5523189660000014,9.4042600000000007,6.2111341959419937,0.87399226265940289,1.3898496063271499,12,15.169357,15.169357,0.11560693,0.11560693,2,24.122782999999998,24.122782999999998,6.6972290000000004E-2,6.6972290000000004E-2]
[null,"SA31","MAJOR METROPOLITAN AREAS","Urban",2654,2.0040264570000001,29.000805953,6.2492393137085092,18.225675389526668,4.791603301710043,15,298.98982699999999,298.98982699999999,3.1278573199999999,3.1278573199999999,28,78.605626999999998,78.605626999999998,0.52398895000000001,0.52398895000000001]
[null,"SA32","MAJOR METROPOLITAN AREAS","Urban",2027,8.5790660179999989,14.979583043,5.7538727827438096,3.5577687734676684E-2,1.671163692430649,4,0.76418399999999997,0.76418399999999997,2.0226939999999999E-2,2.0226939999999999E-2,4,35.895412,24.547606999999999,0.16970893000000001,0.13912184999999999]
[null,"SA33","MAJOR METROPOLITAN AREAS","Urban",2242,7.0099323120000001,15.870592791000002,6.8017635213229815,10.149946067303068,0.49383851774259735,17,197.106899,197.106899,2.3157894799999998,2.3157894799999998,5,9.5900979999999993,9.5900979999999993,7.4933100000000002E-2,7.4933100000000002E-2]
[null,"SA34","MAJOR METROPOLITAN AREAS","Urban",873.5,7.4614424860000002,18.642648790999999,4.9346127507637307,7.6070518379600438E-2,0.39142346957673335,8,3.7916409999999998,3.7916409999999998,2.5949239999999998E-2,2.5949239999999998E-2,6,19.510017000000001,19.510017000000001,8.9295940000000004E-2,8.9295940000000004E-2]
[null,"SA35","MAJOR METROPOLITAN AREAS","Urban",854.5,null,10.839605045000001,2.1148340360415991,4.8485804098476061E-2,0.36668675576766507,6,2.4704510000000002,2.4704510000000002,2.8086610000000001E-2,2.8086610000000001E-2,2,18.683440999999998,18.683440999999998,8.7770630000000002E-2,8.7770630000000002E-2]
[null,"SA36","MAJOR METROPOLITAN AREAS","Urban",960,49.294741347000006,5.7726999999999995,null,7.0445352856149297,1.3713142970941712,18,319.48819400000002,319.48819400000002,3.3878472300000002,3.3878472300000002,9,62.192708000000003,62.192708000000003,0.20729167000000001,0.20729167000000001]
[null,"SA40","MAJOR METROPOLITAN AREAS","Urban",1220.5,null,15.938954549,3.1859117387816944,0.15092381284994222,0.5295769826329505,4,5.3838590000000002,5.3838590000000002,0.99549365000000001,0.99549365000000001,4,18.891438000000001,18.891438000000001,0.86358049999999997,0.86358049999999997]
[null,"SA41","MAJOR METROPOLITAN AREAS","Urban",1038,6.5747122359999999,12.70495938,3.9248271299510757,0.13942442009026546,0.74501837123932058,5,5.8481050000000003,5.8481050000000003,0.992614,0.992614,7,31.249517999999998,31.249517999999998,0.72928709000000003,0.72928709000000003]
[null,"SA42","MAJOR METROPOLITAN AREAS","Urban",2077,15.914601857999999,28.032399420000001,6.4778700203076003,6.6047485110634589,9.5460747137906985,10,138.45016799999999,138.45016799999999,2.0136414600000001,2.0136414600000001,40,200.10688500000001,200.10688500000001,1.42320655,1.42320655]
[null,"SA43","MAJOR METROPOLITAN AREAS","Urban",28,0.50274003599999995,2.6597600000000003,5.2996197685932929,3.1007022880447719E-3,0,1,4.8214290000000002,4.8214290000000002,0.96428570999999996,0.96428570999999996]
[null,"SA520A","MAJOR METROPOLITAN AREAS","Urban",1524,null,9.9808913630000013,2.7054633614225865,8.3358743895123126,0.32219741997549672,6,238.144137,238.144137,1.70253717,1.70253717,3,9.2047240000000006,9.2047240000000006,8.5301840000000004E-2,8.5301840000000004E-2]
[null,"SA520B","MAJOR METROPOLITAN AREAS","Urban",81,0.51763297600000002,6.241046162,5.0679806629465345,3.4452247644941912E-3,5.5812641184805896E-2,1,1.8518520000000001,1.8518520000000001,1.234568E-2,1.234568E-2,3,30,30,0.2345679,0.2345679]
[null,"SA520D","MAJOR METROPOLITAN AREAS","Urban",1839,0.52358859700000004,14.202609794000001,6.5350276969573731,2.2922228766434686E-2,0.47801345199102069,5,0.542686,0.542686,2.71887E-3,2.71887E-3,3,11.317019999999999,11.317019999999999,8.7003810000000001E-2,8.7003810000000001E-2]
[null,"SA520E","MAJOR METROPOLITAN AREAS","Urban",569,4.3823547609999993,6.2103067149999998,3.905774571067818,0.50555226432529499,2.9783738407401317,4,38.683653999999997,38.683653999999997,0.19156412,0.19156412,9,227.898067,227.898067,1.17750439,1.17750439]
[null,"SA520F","MAJOR METROPOLITAN AREAS","Urban",35,0.86656573300000006,8.0153599999999994,8.3259682319835928,0,3.3533521041076795E-3,null,null,null,null,null,1,4.1714289999999998,4.1714289999999998,2.8571429999999998E-2,2.8571429999999998E-2]
[null,"SA520G","MAJOR METROPOLITAN AREAS","Urban",29.5,0.702283922,6.8687100000000001,2.8769363913719048,0,7.8045824998341742E-2,null,null,null,null,null,2,115.186441,115.186441,0.47457627000000002,0.47457627000000002]
[null,"SA520J","MAJOR METROPOLITAN AREAS","Urban",1091,null,14.209258213000002,6.0206086071094171,2.0864051492125855,0,2,83.262145000000004,83.262145000000004,0.97891841999999996,0.97891841999999996]
[null,"SA711C","MAJOR METROPOLITAN AREAS","Urban",2285.5,8.4984581549999998,10.688981261999999,5.8110304593935824,4.5165516073676679,1.4426763860493941,10,86.039811,86.039811,1.13994018,1.13994018,5,27.482827,27.482827,9.1883610000000004E-2,9.1883610000000004E-2]
[null,"SA711E","MAJOR METROPOLITAN AREAS","Urban",1,null,2.4461370099999997,null,0,3.1236704531414001E-3,null,null,null,null,null,1,136,136,1,1]
[null,"SA744C","MAJOR METROPOLITAN AREAS","Urban",825,11.537666431,9.8232378679999997,7.582918435536544,4.3323316972367065,0.15792910320441372,5,228.63433499999999,228.63433499999999,1.8711110900000001,1.8711110900000001,5,8.3345450000000003,8.3345450000000003,3.0303030000000002E-2,3.0303030000000002E-2]
[null,"SA744D","MAJOR METROPOLITAN AREAS","Urban",2945,8.3280887019999987,15.749688675,7.1256570223383608,0.49117406476650832,9.2877747291140196,19,7.2614580000000002,7.2614580000000002,8.4097320000000003E-2,8.4097320000000003E-2,33,137.309338,137.309338,0.68081493999999998,0.68081493999999998]
[null,"SA744G","MAJOR METROPOLITAN AREAS","Urban",56.5,3.1199999999999999E-3,13.470906971,4.0200899243673636,0.13268708976321961,0,1,102.247788,null,0.83185841000000005]
[null,"SB01","UPPER NORTH/EYRE PENINSULA","Rural Long",826,40.460350000000005,10.22701,2.8959889502551626,2.0245671517764783,1.5134236581606827E-3,7,132.80226200000001,23.867636999999998,2.0464084200000001,1.1033091399999999,2,9.9274000000000001E-2,9.9274000000000001E-2,3.63196E-3,3.63196E-3]
[null,"SB02","UPPER NORTH/EYRE PENINSULA","Rural Long",21.5,19.007949999999997,null,0.62873444314750238,4.8651033694043409E-2,5.1677881010364776E-4,2,122.604651,15.627907,1.9069767399999999,0.97674419000000001,1,1.3023260000000001,1.3023260000000001,4.6511629999999998E-2,4.6511629999999998E-2]
[null,"SB03","UPPER NORTH/EYRE PENINSULA","Rural Long",62,49.092800000000004,0.10491,null,0.65350985083617785,0,4,571.10213399999998,465.376327,2.8494622600000001,1.9301074199999999]
[null,"SB15","UPPER NORTH/EYRE PENINSULA","Rural Long",116.5,129.01052999999999,null,null,1.4213262916457825,5.4261775060883014E-3,8,661.03004299999998,562.31759699999998,2.7553648100000001,1.8969957099999999,4,2.5236049999999999,2.5236049999999999,6.8669530000000006E-2,6.8669530000000006E-2]
[null,"SB16","UPPER NORTH/EYRE PENINSULA","Rural Long",38,61.18018,null,null,8.4622530154472311E-2,6.6258426009717687E-3,2,120.657895,14.736841999999999,1.8421052600000001,0.92105263000000004,2,9.4473680000000009,9.4473680000000009,0.13157895,0.13157895]
[null,"SB17","UPPER NORTH/EYRE PENINSULA","Rural Long",158,110.84838999999999,0.16041,null,2.3713441355356952,0.87837632608760008,10,813.18775700000003,703.28269299999999,3.87552735,2.9198311499999998,8,301.21519000000001,301.21519000000001,3.3164557000000001,3.3164557000000001]
[null,"SB18","UPPER NORTH/EYRE PENINSULA","Rural Long",47,127.05496000000001,null,null,1.011539151619665,7.6132592559912379E-2,5,1166.1063830000001,1060.8936169999999,3.91489362,3,3,87.765957,87.765957,0.78723403999999997,0.78723403999999997]
[null,"SB19","UPPER NORTH/EYRE PENINSULA","Rural Long",67.5,132.66142000000002,null,null,1.5984891415809579,2.7315451391192809E-3,6,1283.0962959999999,1182.5777780000001,3.5407407399999999,2.6666666700000001,3,2.192593,2.192593,8.8888889999999998E-2,8.8888889999999998E-2]
[null,"SB20","UPPER NORTH/EYRE PENINSULA","Rural Long",12,18.567880000000002,null,null,4.5845669544184273E-2,0,3,207.00003000000001,97.000029999999995,2.5000002499999998,1.5833335799999999]
[null,"SB21","UPPER NORTH/EYRE PENINSULA","Rural Long",76.5,25.12349,0.29714999999999997,null,0.17679372221367293,8.2684609616583638E-2,2,125.21568600000001,15.477124,1.9215686300000001,0.96732026000000004,1,58.562092,58.562092,0.73202613999999999,0.73202613999999999]
[null,"SB22","UPPER NORTH/EYRE PENINSULA","Rural Long",54,102.45801,null,null,1.0861398641353417,6.9580575503241137E-3,5,1089.796296,989.70370400000002,3.53703704,2.6666666700000001,3,6.9814809999999996,6.9814809999999996,0.12962963,0.12962963]
[null,"SB23","UPPER NORTH/EYRE PENINSULA","Rural Long",61,139.41139000000001,null,null,3.6791882821468449,0.16278532518264904,5,3267.95082,3160.4918029999999,4.3770491800000002,3.4426229500000001,5,144.59016399999999,144.59016399999999,1.09836066,1.09836066]
[null,"SD1613","UPPER NORTH/EYRE PENINSULA","Rural Long",0.5,55.487839999999998,null,null,2.7241625846892287E-2,0,5,2952,2952,10,10]
[null,"SD1621","BAROSSA/MID NORTH & YORKE PENINSULA/RIVE","Rural Short",2.5,32.8431438,2.112E-2,null,4.1694723290190826E-2,1.1713155384627291E-2,7,811.6,811.6,5.6,5.6,1,228,228,1.2,1.2]
[null,"SD1689","KANGAROO ISLAND","Rural Long",2720,24.676459999999999,0.40901999999999999,null,3.3835723463814835,0,1,67.400000000000006,67.400000000000006,1,1]
[null,"SD2001","UPPER NORTH/EYRE PENINSULA","Urban",1,11.325899999999999,1.052E-2,null,0,8.4063484253658269E-3,null,null,null,null,null,1,366,366,1,1]
[null,"SD31101","UPPER NORTH/EYRE PENINSULA","Rural Long",25,10.054949999999998,0.13143000000000002,null,0.33935757076342038,5.647654138989865E-3,1,735.48,735.48,0.56000000000000005,0.56000000000000005,1,12.24,12.24,0.08,0.08]
[null,"SD31200","UPPER NORTH/EYRE PENINSULA","Rural Long",262.5,54.719880000000003,5.9539999999999996E-2,null,0.19139272359910095,0,6,39.504761999999999,39.504761999999999,5.7142859999999997E-2,5.7142859999999997E-2]
[null,"SD31301","UPPER NORTH/EYRE PENINSULA","Rural Long",19,19.758099999999999,1.14035,null,0.13474393023447401,4.3003379555053541E-3,4,384.24563599999999,384.24563599999999,1.5964913199999999,1.5964913199999999,1,12.263158000000001,12.263158000000001,5.2631579999999997E-2,5.2631579999999997E-2]
[null,"SD31400","UPPER NORTH/EYRE PENINSULA","Rural Long",14,39.283679999999997,1.4719599999999999,null,8.2241656350780512E-2,1.0667791151425299E-2,2,318.28571399999998,318.28571399999998,1.0714285699999999,1.0714285699999999,2,41.285713999999999,41.285713999999999,0.21428570999999999,0.21428570999999999]
[null,"SD32102","UPPER NORTH/EYRE PENINSULA","Rural Short",7,3.1629200000000002,null,null,2.5070262402184729E-2,0.25214108170066118,1,174.28571400000001,null,1.4285714300000001,null,2,1752.857143,1752.857143,2.8571428600000002,2.8571428600000002]
[null,"SD32201","UPPER NORTH/EYRE PENINSULA","Rural Long",16,70.938290000000009,0.24600999999999998,null,2.3513435859715971E-2,0,1,79.625,79.625,0.8125,0.8125]
[null,"SD32202","UPPER NORTH/EYRE PENINSULA","Rural Long",11,42.279540000000004,0.12748999999999999,null,1.9895984188990436E-2,1.2015107334909811E-2,1,98,98,1,1,1,59.181818,59.181818,0.63636364000000001,0.63636364000000001]
[null,"SD32203","UPPER NORTH/EYRE PENINSULA","Rural Long",141.5,null,null,null,0.2134296485728065,0.18668634514994273,1,81.724382000000006,81.724382000000006,0.83392226000000003,0.83392226000000003,1,71.484099000000001,71.484099000000001,0.8409894,0.8409894]
[null,"SD32302","UPPER NORTH/EYRE PENINSULA","Rural Long",8.5,21.897729999999999,0.13996,null,0.14215108555065339,1.6057055885363338E-3,3,906.11764700000003,906.11764700000003,4,4,1,10.235294,10.235294,0.35294118000000002,0.35294118000000002]
[null,"SD32402","UPPER NORTH/EYRE PENINSULA","Rural Long",26.5,20.121929999999999,null,null,0,4.0604049365286607E-4,null,null,null,null,null,1,0.83018899999999995,0.83018899999999995,0.83018868000000001,0.83018868000000001]
[null,"SD33101","UPPER NORTH/EYRE PENINSULA","Rural Long",108.5,65.39246,4.5759999999999995E-2,null,5.4243328991927693E-2,9.5604079869174834E-3,2,27.087562999999999,27.087562999999999,5.5299550000000003E-2,5.5299550000000003E-2,1,4.7741939999999996,4.7741939999999996,0.12903226000000001,0.12903226000000001]
[null,"SD33102","UPPER NORTH/EYRE PENINSULA","Rural Long",35,19.690849999999998,null,null,1.1553697683031553E-2,0,1,17.885714,17.885714,5.7142859999999997E-2,5.7142859999999997E-2]
[null,"SD33202","BAROSSA/MID NORTH & YORKE PENINSULA/RIVE","Rural Long",226,79.263432652999995,1.1930000000000001,null,7.0687958667748959E-3,0,2,1.69469,1.69469,8.8495599999999994E-3,8.8495599999999994E-3]
[null,"SD33204","BAROSSA/MID NORTH & YORKE PENINSULA/RIVE","Rural Long",94,null,null,null,1.1073831645078165E-2,2.5838940505182387E-3,1,6.3829789999999997,6.3829789999999997,4.2553189999999998E-2,4.2553189999999998E-2,3,1.4893620000000001,1.4893620000000001,3.1914890000000001E-2,3.1914890000000001E-2]
[null,"SD34102","BAROSSA/MID NORTH & YORKE PENINSULA/RIVE","Rural Long",61.5,55.007040916999998,2.1997600000000004,null,0.25047163196251493,2.882887504935349E-2,2,220.66668100000001,220.66668100000001,0.99186993000000001,0.99186993000000001,3,25.398374,25.398374,8.1300810000000001E-2,8.1300810000000001E-2]
[null,"SD34201","BAROSSA/MID NORTH & YORKE PENINSULA/RIVE","Rural Short",410.5,65.082844037000001,1.58995,null,1.1948855213574738,0.45812822130680847,4,141.64918800000001,141.64918800000001,0.99878193999999998,0.99878193999999998,9,54.309379,54.309379,0.21924482000000001,0.21924482000000001]
[null,"SD34300","BAROSSA/MID NORTH & YORKE PENINSULA/RIVE","Rural Short",136,49.311639999999997,0.44433000000000006,null,0.29506890380727507,9.5472491082418232E-2,1,105.58093100000001,105.58093100000001,0.61029440000000001,0.61029440000000001,3,34.161765000000003,34.161765000000003,0.20588234999999999,0.20588234999999999]
[null,"SD34402","BAROSSA/MID NORTH & YORKE PENINSULA/RIVE","Rural Long",21.5,13.832349999999998,0.27123000000000003,null,0,5.0755061706608253E-3,null,null,null,null,null,1,12.790698000000001,12.790698000000001,4.6511629999999998E-2,4.6511629999999998E-2]
[null,"SD34403","BAROSSA/MID NORTH & YORKE PENINSULA/RIVE","Rural Long",20,null,null,null,1.4617457771503179E-2,1.0796985853951212E-2,1,39.6,39.6,0.15,0.15,4,29.25,29.25,0.4,0.4]
[null,"SD34404","BAROSSA/MID NORTH & YORKE PENINSULA/RIVE","Rural Long",77,36.416710000000009,4.6030000000000001E-2,null,0.17035244347345246,3.3959750378239708E-3,1,119.87013,119.87013,0.92207792,0.92207792,1,2.3896099999999998,2.3896099999999998,2.5974029999999999E-2,2.5974029999999999E-2]
[null,"SD34405","BAROSSA/MID NORTH & YORKE PENINSULA/RIVE","Rural Long",34.5,27.757960000000001,0.47604000000000002,null,0,5.4077211200131712E-3,null,null,null,null,null,1,8.4927539999999997,8.4927539999999997,2.8985509999999999E-2,2.8985509999999999E-2]
[null,"SD35202","BAROSSA/MID NORTH & YORKE PENINSULA/RIVE","Rural Long",165.5,44.94397,3.9100000000000003E-2,null,5.3560432390028063E-2,0,3,17.534742999999999,17.534742999999999,1.03927492,1.03927492]
[null,"SD35302","BAROSSA/MID NORTH & YORKE PENINSULA/RIVE","Rural Long",16,21.67811,0.19093000000000002,null,2.1852361112954247E-2,0,2,74,74,2,2]
[null,"SD35303","BAROSSA/MID NORTH & YORKE PENINSULA/RIVE","Rural Long",21,16.332729999999998,null,null,0.14517793286697475,6.1828893351686415E-3,3,374.57142900000002,374.57142900000002,2.71428571,2.71428571,3,15.952381000000001,15.952381000000001,0.23809524000000001,0.23809524000000001]
[null,"SD35401","BAROSSA/MID NORTH & YORKE PENINSULA/RIVE","Rural Short",10,12.23339,0.81486999999999998,null,2.6077182777354442E-2,0,2,126.9,75.599999999999994,1.8,0.9]
[null,"SD35403","BAROSSA/MID NORTH & YORKE PENINSULA/RIVE","Rural Short",15,15.700790000000001,null,null,0.10695960311751763,1.5781935676129403E-2,2,347,290,2,1,1,51.2,51.2,0.53333333000000005,0.53333333000000005]
[null,"SD36101","BAROSSA/MID NORTH & YORKE PENINSULA/RIVE","Rural Short",1,24.30734,0.20061000000000001,null,0,4.1098790823253649E-5,null,null,null,null,null,1,2,2,1,1]
[null,"SD36302","BAROSSA/MID NORTH & YORKE PENINSULA/RIVE","Rural Long",1,21.931339999999999,null,null,0,6.2936276516194238E-3,null,null,null,null,null,1,341,341,1,1]
[null,"SD36403","BAROSSA/MID NORTH & YORKE PENINSULA/RIVE","Rural Long",1,3.5612699999999999,2.3739999999999997E-2,null,0,4.5033582023317874E-3,null,null,null,null,null,1,244,244,1,1]
[null,"SD37102","BAROSSA/MID NORTH & YORKE PENINSULA/RIVE","Rural Long",219,52.326790000000003,0.33021,null,8.6261395770057447,0.14401518054424153,6,2134.15373,747.50076200000001,3.8614916400000001,2.90715374,5,35.630136999999998,35.630136999999998,0.15981735,0.15981735]
[null,"SD37301","BAROSSA/MID NORTH & YORKE PENINSULA/RIVE","Rural Short",91.5,24.042290000000001,0.78464,null,2.4707771067123634,1.9583573827280366E-2,6,1314.0546449999999,11.639343999999999,1.1038251400000001,0.13114754000000001,3,10.415300999999999,10.415300999999999,5.4644810000000002E-2,5.4644810000000002E-2]
[null,"SD37401","BAROSSA/MID NORTH & YORKE PENINSULA/RIVE","Rural Long",3,10.40776,1.6351800000000001,null,7.8753399474862817E-2,0,5,1422.333335,148.33333500000001,5.3333339999999998,4.3333339999999998]
[null,"SD37402","BAROSSA/MID NORTH & YORKE PENINSULA/RIVE","Rural Long",6,22.503700000000002,null,null,0.13247993933956706,0,6,1196.3333339999999,134.66666799999999,6.1666670000000003,5.33333367]
[null,"SD37501","BAROSSA/MID NORTH & YORKE PENINSULA/RIVE","Rural Short",26,14.54191,1.12845,null,0.244661101770829,9.2677773306436995E-3,5,457.92307699999998,213.115385,1.8846153800000001,1.69230769,2,17.346153999999999,17.346153999999999,7.6923080000000005E-2,7.6923080000000005E-2]
[null,"SD38101","EASTERN HILLS/FLEURIEU PENINSULA","Rural Long",147.5,23.432140938,0.69267999999999996,null,0.60459429504911755,0.54841305583642108,7,222.08813599999999,222.08813599999999,3.1389830500000002,3.1389830500000002,10,201.45084700000001,201.45084700000001,0.76610168999999995,0.76610168999999995]
[null,"SD38102","EASTERN HILLS/FLEURIEU PENINSULA","Rural Long",154.5,36.212420999999992,2.08283,null,1.2692272665644215,0.32258071582112696,8,445.10681499999998,445.10681499999998,3.4196332800000002,3.4196332800000002,6,113.126214,113.126214,0.42071196999999999,0.42071196999999999]
[null,"SD38200","EASTERN HILLS/FLEURIEU PENINSULA","Rural Long",100,59.274279853000003,1.4281999999999999,null,0.20510581845292275,6.9488293572865484E-2,2,111.13,111.13,1.77,1.77,2,37.65,37.65,0.75,0.75]
[null,"SD38300","EASTERN HILLS/FLEURIEU PENINSULA","Rural Long",143.5,null,null,null,5.296983008428275E-2,0.19024842766244288,4,20.000001000000001,20.000001000000001,1.0731707399999999,1.0731707399999999,8,71.832752999999997,71.832752999999997,0.62020905999999998,0.62020905999999998]
[null,"SD38400","EASTERN HILLS/FLEURIEU PENINSULA","Rural Long",17,11.671023404,4.1399999999999996E-3,null,3.4513441960493615E-3,0,2,11,11,1.05882353,1.05882353]
[null,"SD39101","BAROSSA/MID NORTH & YORKE PENINSULA/RIVE","Rural Long",9.5,29.78227,null,null,2.338424115719006E-2,0,2,133.36842100000001,133.36842100000001,1.1578947399999999,1.1578947399999999]
[null,"SD39201","BAROSSA/MID NORTH & YORKE PENINSULA/RIVE","Rural Long",50,18.555555389000002,0.09,null,1.8456386075130278E-4,2.7093974758291246E-2,1,0.2,0.2,0.1,0.1,1,29.36,29.36,0.08,0.08]
[null,"SD39202","BAROSSA/MID NORTH & YORKE PENINSULA/RIVE","Rural Long",44,27.525689999999997,null,null,3.9053712934975664E-2,0,2,48.090909000000003,48.090909000000003,0.15909091,0.15909091]
[null,"SD39300","BAROSSA/MID NORTH & YORKE PENINSULA/RIVE","Rural Long",63,12.34923,1.0500000000000001E-2,null,1.1258395505829469E-3,1.7053700733420375E-2,1,0.96825399999999995,0.96825399999999995,1.5873020000000002E-2,1.5873020000000002E-2,1,14.666667,14.666667,4.7619050000000003E-2,4.7619050000000003E-2]
[null,"SD40101","BAROSSA/MID NORTH & YORKE PENINSULA/RIVE","Rural Long",3,7.1295593400000001,0.51167000000000007,null,2.7684579112695416E-4,0,1,5,5,1,1]
[null,"SD40102","BAROSSA/MID NORTH & YORKE PENINSULA/RIVE","Rural Long",2.5,15.375360000000001,1.3417999999999999,null,9.2281930375651391E-5,0,1,2,2,0.4,0.4]
[null,"SD40802","BAROSSA/MID NORTH & YORKE PENINSULA/RIVE","Rural Long",14,50.310101991999993,null,null,0.16407727220790816,0,1,635,635,1,1]
[null,"SD41202","EASTERN HILLS/FLEURIEU PENINSULA","Rural Short",6,4.0768930729999999,null,null,8.9047414366041929E-5,1.6028528421068923E-3,1,0.72222299999999995,0.72222299999999995,0.72222249999999999,0.72222249999999999,2,13,13,1.1666666699999999,1.1666666699999999]
[null,"SD41300","EASTERN HILLS/FLEURIEU PENINSULA","Rural Short",21.5,17.094908517000004,0.39393,null,0,4.7058115492625433E-3,null,null,null,null,null,2,10.651163,10.651163,1.0697674399999999,1.0697674399999999]
[null,"SD43101","BAROSSA/MID NORTH & YORKE PENINSULA/RIVE","Rural Long",2,16.737128451,0.39135000000000003,null,0,1.1073831645078166E-4,null,null,null,null,null,1,3,3,1,1]
[null,"SD43102","BAROSSA/MID NORTH & YORKE PENINSULA/RIVE","Rural Long",1,9.6415400000000009,null,null,0,5.5369158225390829E-5,null,null,null,null,null,1,3,3,1,1]
[null,"SD44200","EASTERN HILLS/FLEURIEU PENINSULA","Rural Short",1,31.201559999999997,9.4299999999999991E-3,null,1.3768094925789972E-2,0,1,670,670,1,1]
[null,"SD44400","EASTERN HILLS/FLEURIEU PENINSULA","Rural Short",62.5,7.3933199400000005,null,null,0,0.20894625254542157,null,null,null,null,null,2,162.68799999999999,1.6479999999999999,0.89600000000000002,1.6E-2]
[null,"SD48104","SOUTH EAST","Rural Short",1,5.4888702260000004,2.25529,null,1.2124143292859827E-2,4.7592399773327736E-2,3,590,590,3,3,4,2316,2316,4,4]
[null,"SD48200","SOUTH EAST","Rural Long",5.5,39.444853301000002,0.49270999999999998,null,4.1342323264677893E-3,2.5414443625454392E-2,2,40.727291000000001,40.727291000000001,1.4545456400000001,1.4545456400000001,5,250.36363600000001,250.36363600000001,2,2]
[null,"SD49100","SOUTH EAST","Rural Long",14,9.6861513230000007,null,null,7.8070538936741568E-3,2.3255046454664146E-3,2,30.214296000000001,30.214296000000001,0.21428579,0.21428579,1,9,9,0.14285713999999999,0.14285713999999999]
[null,"SD49201","SOUTH EAST","Rural Long",14,24.709905081000002,null,null,0.10996314823562618,3.9312102340027487E-3,2,425.57142900000002,425.57142900000002,1,1,3,15.214286,15.214286,0.57142857000000002,0.57142857000000002]
[null,"SD49202","SOUTH EAST","Rural Long",12,60.279356016999998,3.9810000000000005E-2,null,2.8275183467099584E-2,0,1,127.666667,127.666667,0.33333332999999998,0.33333332999999998]
[null,"SD49203","SOUTH EAST","Rural Long",9,16.911750000000001,null,null,2.6577195948187596E-2,0,1,160,160,0.11111111,0.11111111]
[null,"SD49502","SOUTH EAST","Rural Long",7,30.756409999999999,null,null,4.5562670430852645E-2,0,3,352.66670800000003,352.66670800000003,1.6666668600000001,1.6666668600000001]
[null,"SD49900","SOUTH EAST","Rural Short",3,10.092129999999999,0.34776000000000001,null,5.277084741705769E-2,0,3,856,856,3,3]
[null,"SD51200","BAROSSA/MID NORTH & YORKE PENINSULA/RIVE","Rural Long",29.5,20.592760000000002,4.7719999999999999E-2,null,9.5973207590677439E-4,0,1,1.7627120000000001,1.7627120000000001,6.7796609999999993E-2,6.7796609999999993E-2]
[null,"SD52202","BAROSSA/MID NORTH & YORKE PENINSULA/RIVE","Rural Long",1,6.0989000000000004,2.9069999999999999E-2,null,4.4295326580312665E-3,5.653191054812403E-2,1,240,null,1,null,2,3063,3063,2,2]
[null,"SD52301","BAROSSA/MID NORTH & YORKE PENINSULA/RIVE","Rural Long",3,8.9022800000000011,0.54282000000000008,null,1.3731551239896925E-2,0,2,248,248,1.3333333300000001,1.3333333300000001]
[null,"SD52303","BAROSSA/MID NORTH & YORKE PENINSULA/RIVE","Rural Long",72.5,13.748175642,1.6475799999999998,null,0.42123017399341084,6.4966478984458571E-3,3,314.80005599999998,314.80005599999998,1.3747128399999999,1.3747128399999999,2,4.8551719999999996,4.8551719999999996,5.5172409999999998E-2,5.5172409999999998E-2]
[null,"SD52304","BAROSSA/MID NORTH & YORKE PENINSULA/RIVE","Rural Long",102,13.66277,null,null,0.96349734477357574,1.9323836220661399E-2,5,511.80401000000001,511.80401000000001,2.4281048099999998,2.4281048099999998,3,10.264706,10.264706,9.8039219999999996E-2,9.8039219999999996E-2]
[null,"SD52305","BAROSSA/MID NORTH & YORKE PENINSULA/RIVE","Rural Long",111.5,21.266148625000003,0.43022000000000005,null,0.43034140869094117,7.0134267085495042E-2,5,209.11809,209.11809,1.02541109,1.02541109,4,34.080717,34.080717,0.26008968999999998,0.26008968999999998]
[null,"SD54101","UPPER NORTH/EYRE PENINSULA","Rural Long",1,6.3620100000000006,0.60686000000000007,null,2.343961031541545E-2,0,1,1270,1270,1,1]
[null,"SD54102","UPPER NORTH/EYRE PENINSULA","Rural Long",32,20.300789999999999,0.87260000000000004,null,0.41467808233602704,0.1307081261840726,2,702.125,702.125,1.875,1.875,3,221.3125,221.3125,1.0625,1.0625]
[null,"SD54301","UPPER NORTH/EYRE PENINSULA","Rural Long",4,7.3583299999999996,1.23814,null,2.1261756758550077E-2,3.3442971568136061E-2,2,288,288,2,2,1,453,453,1,1]
[null,"SD54302","UPPER NORTH/EYRE PENINSULA","Rural Long",45,34.082310434999997,3.7880000000000004E-2,null,0.49090295682631507,0.61397013917528376,8,591.06666700000005,591.06666700000005,3.5555555600000002,3.5555555600000002,2,739.24444400000004,739.24444400000004,1.8666666700000001,1.8666666700000001]
[null,"SD54400","UPPER NORTH/EYRE PENINSULA","Rural Short",1.5,3.9036399999999998,0.85714000000000012,null,0,1.8412258288817637E-2,null,null,null,null,null,1,597.33333300000004,597.33333300000004,2.6666666700000001,2.6666666700000001]
[null,"SD55100","UPPER NORTH/EYRE PENINSULA","Rural Long",9,14.834989999999999,8.7200000000000003E-3,null,3.2483239492229286E-3,0,1,19.555555999999999,19.555555999999999,0.22222222,0.22222222]
[null,"SD57104","BAROSSA/MID NORTH & YORKE PENINSULA/RIVE","Rural Long",8,16.668959999999998,0.60978999999999994,null,2.5838940505182387E-3,3.8758410757773574E-4,1,17.5,17.5,0.875,0.875,1,2.625,2.625,0.875,0.875]
[null,"SG01","EASTERN HILLS/FLEURIEU PENINSULA","Rural Short",491,17.117860757999999,1.24255,1.085995856345686,5.046006822770071,2.3682767223991683,7,500.11201999999997,411.32179500000001,2.6951799200000002,1.8377461100000001,6,234.720978,234.720978,0.55804480999999995,0.55804480999999995]
[null,"SG02","EASTERN HILLS/FLEURIEU PENINSULA","Rural Short",728,18.97615678,0.83847941400000003,1.6956777406099306,4.9651654687526854,0.10550059604329212,5,331.89697799999999,202.876374,2.4560439600000001,1.4711538500000001,2,7.0521979999999997,7.0521979999999997,5.4945050000000002E-2,5.4945050000000002E-2]
[null,"SG03","EASTERN HILLS/FLEURIEU PENINSULA","Rural Short",1013.5,14.628469905000001,2.016612947,2.4577800959402367,3.3810605400127769,3.157579000159755,10,162.34172100000001,160.074331,2.1012991400000001,2.10031246,10,151.61124799999999,151.61124799999999,0.53280709999999998,0.53280709999999998]
[null,"SG04","EASTERN HILLS/FLEURIEU PENINSULA","Rural Short",575,37.390576864000003,2.6814,1.4289419162443238,7.9100037001020311,1.8701799270167458,14,669.43712400000004,582.20234200000004,5.6000002899999997,4.6139133299999999,13,158.276522,158.276522,0.60695652,0.60695652]
[null,"SG05","EASTERN HILLS/FLEURIEU PENINSULA","Rural Short",45.5,2.459067149,0.70711000000000002,null,0.33955820978172163,8.5074497004135052E-2,1,363.16483499999998,363.16483499999998,1.0109890100000001,1.0109890100000001,1,90.989011000000005,90.989011000000005,0.26373626,0.26373626]
[null,"SG06","EASTERN HILLS/FLEURIEU PENINSULA","Rural Short",318,6.450505218,0.26014999999999999,0.68589211979727527,2.3817571257891959,0,7,364.47798699999998,364.47798699999998,3.9842767299999999,3.9842767299999999]
[null,"SG07","EASTERN HILLS/FLEURIEU PENINSULA","Rural Short",1056.5,38.241938524999995,3.3827699999999998,2.553042890356525,0.31739906589066608,0.6550736269318399,5,14.619654000000001,14.619654000000001,5.8053309999999997E-2,5.8053309999999997E-2,8,30.173213000000001,30.173213000000001,0.11736866999999999,0.11736866999999999]
[null,"SG08","EASTERN HILLS/FLEURIEU PENINSULA","Rural Short",200.5,18.501557686000002,0.20780999999999999,null,0.53120196863029268,1.1045094539795304,7,128.92770400000001,128.92770400000001,1.6442230600000001,1.6442230600000001,2,268.07481300000001,268.07481300000001,0.87281796,0.87281796]
[null,"SG09","EASTERN HILLS/FLEURIEU PENINSULA","Rural Short",608,29.301282788999998,0.22,1.3336791218280355,13.618180240374919,0.1664501028341773,9,1089.9747809999999,482.36622799999998,5.6145836500000001,4.6326757499999998,2,13.322368000000001,13.322368000000001,0.99342105000000003,0.99342105000000003]
[null,"SG10","EASTERN HILLS/FLEURIEU PENINSULA","Rural Short",1450.5,17.922244678999999,1.051991219,2.8959889502551626,2.2306779617222801,0,12,74.837642000000002,73.958635000000001,1.30920372,1.3085142999999999]
[null,"SG11","EASTERN HILLS/FLEURIEU PENINSULA","Rural Short",448.5,9.910443110000001,1.0051552029999999,1.1241009741122014,2.4227737190308029E-2,0,1,2.6287630000000002,2.6287630000000002,0.87625417999999999,0.87625417999999999]
[null,"SG12","EASTERN HILLS/FLEURIEU PENINSULA","Rural Short",544,41.352679789,1.6912399999999999,1.2193637685284895,7.2841237236834004,0.58002723488857877,12,651.59743400000002,508.54596299999997,4.1060052200000001,3.1280640399999999,8,51.886029000000001,51.886029000000001,1.2794117599999999,1.2794117599999999]
[null,"SG13","EASTERN HILLS/FLEURIEU PENINSULA","Rural Short",1407,31.942340501000004,4.652775224,3.9248271299510757,7.6046326775168067,1.5700971058207591,21,263.01777199999998,263.01777199999998,4.1234304799999997,4.1234304799999997,8,54.304192999999998,54.304192999999998,0.19971570999999999,0.19971570999999999]
[null,"SG14","EASTERN HILLS/FLEURIEU PENINSULA","Rural Short",1077,24.443555728,3.60554,2.667358243656071,6.2030747297255617,0.94323779878908298,10,280.28009800000001,280.28009800000001,3.3057876799999999,3.3057876799999999,7,42.619312999999998,42.619312999999998,0.24976787,0.24976787]
[null,"SM126A","MAJOR METROPOLITAN AREAS","Urban",1673.5,12.375303345000001,1.0052085079999999,4.4201936609157748,16.867774405783692,3.1525184685027647,15,438.83955500000002,336.559304,5.01703016,3.5590080500000001,18,82.017329000000004,82.017329000000004,0.57603824000000003,0.57603824000000003]
[null,"SM126B","MAJOR METROPOLITAN AREAS","Urban",1342,10.328336417000001,4.0846900000000002,3.7076279586819383,16.460924177966369,0.5472165334271607,15,534.04197999999997,471.98087700000002,5.0891704200000003,4.1040735499999998,5,17.753353000000001,17.753353000000001,0.12071535,0.12071535]
[null,"SM126C","MAJOR METROPOLITAN AREAS","Urban",2149.5,17.271406258999999,6.4675917680000001,5.9571635860281695,22.932587404575251,3.3840146045116777,18,464.50383799999997,401.35101200000003,5.1035124500000002,4.1056059600000001,16,68.543847,68.543847,0.30193068000000001,0.30193068000000001]
[null,"SM126D","MAJOR METROPOLITAN AREAS","Urban",2124,15.207210433,0.8637999999999999,5.8110304593935824,9.5557670787426812,2.0270783787679956,16,195.87758500000001,133.64877200000001,3.03028874,2.0425297900000001,7,41.551788999999999,41.551788999999999,0.27636535000000001,0.27636535000000001]
[null,"SM126E","MAJOR METROPOLITAN AREAS","Urban",1949,9.4043819070000012,11.503680000000001,7.0048637990185076,8.7847105270801862,0,11,196.240804,134.92166599999999,2.9962373599999998,2.0229177100000002]
[null,"SM137A","MAJOR METROPOLITAN AREAS","Urban",1704.5,6.6793487850000002,2.2755300000000003,4.0772476010171363,1.2203215797489393,4.4145042997369872,8,31.171018,31.171018,1.1980052800000001,1.1980052800000001,10,112.760927,112.760927,0.43883836999999998,0.43883836999999998]
[null,"SM137B","MAJOR METROPOLITAN AREAS","Urban",2089.5,4.2695970230000002,7.05170151,6.8970263157392688,4.0557415609276584,3.4428820116543348,5,84.508734000000004,84.508734000000004,2.03780809,2.03780809,8,71.738692999999998,71.738692999999998,0.31873654000000001,0.31873654000000001]
[null,"SM137C","MAJOR METROPOLITAN AREAS","Urban",372,1.8217549610000001,1.543646136,5.258506251779111,0,0.67464391338325247,null,null,null,null,null,2,78.959676999999999,78.959676999999999,0.28225805999999998,0.28225805999999998]
[null,"SM137D","MAJOR METROPOLITAN AREAS","Urban",217.5,1.133111913,1.8010299999999999,2.1148340360415991,0.38283337583059451,1.0335674293482573E-2,4,76.634483000000003,76.634483000000003,1.51724138,1.51724138,1,2.0689660000000001,2.0689660000000001,4.5976999999999997E-3,4.5976999999999997E-3]
[null,"SM172A","MAJOR METROPOLITAN AREAS","Urban",1275.5,4.5276466609999995,0.5696,2.2100968304578874,1.7798260208898082,0,5,60.753428,60.753428,1.0069253600000001,1.0069253600000001]
[null,"SM172B","MAJOR METROPOLITAN AREAS","Urban",856,3.9599328099999997,0.41102,1.5813623873103848,5.6901867725787776,0.63261217125642333,8,289.418612,289.418612,1.3929127299999999,1.3929127299999999,2,32.176402000000003,32.176402000000003,0.22897196,0.22897196]
[null,"SM172C","MAJOR METROPOLITAN AREAS","Urban",2589.5,8.6816989190000005,0.53332000000000002,4.6221507850783059,0.36832482908683206,5.9379826905963178,9,6.192825,6.192825,2.1110879999999999E-2,2.1110879999999999E-2,8,99.838193000000004,99.838193000000004,0.39119521000000002,0.39119521000000002]
[null,"SM172D","MAJOR METROPOLITAN AREAS","Urban",749.5,2.894032046,0.23791000000000001,1.8480982116759919,7.6943353073703601E-3,0.97010638918627434,1,0.446965,0.446965,1.3342199999999999E-3,1.3342199999999999E-3,2,56.353569,56.353569,0.17078051999999999,0.17078051999999999]
[null,"SM172E","MAJOR METROPOLITAN AREAS","Urban",2561.5,10.687361158,0.85647000000000006,5.536673611474674,0.57771049756994974,9.9433320973019743,7,9.8195049999999995,9.8195049999999995,4.3073699999999999E-2,4.3073699999999999E-2,28,169.00956500000001,169.00956500000001,0.73511614000000003,0.73511614000000003]
[null,"SM172F","MAJOR METROPOLITAN AREAS","Urban",1846.5,7.0105725310000002,0.41208,4.4316251962457294,0.98652862723036328,6.1143781985384207,12,23.261305,23.261305,0.19442187999999999,0.19442187999999999,14,144.170593,144.170593,0.53614947000000002,0.53614947000000002]
[null,"SM179A","MAJOR METROPOLITAN AREAS","Urban",1699.5,6.3799782260000004,2.0297299999999998,5.7348202238605523,0.56802550353854209,2.1175729492487094,7,14.551921999999999,14.551921999999999,9.5714380000000002E-2,9.5714380000000002E-2,2,54.248896999999999,54.248896999999999,0.20770815000000001,0.20770815000000001]
[null,"SM179B","MAJOR METROPOLITAN AREAS","Urban",942.5,4.4689663829999997,2.8839699999999997,3.5723547906108095,0.38976976168977612,0.77687521622834343,6,18.005305,18.005305,0.19522545999999999,0.19522545999999999,2,35.887532999999998,35.887532999999998,0.10397878000000001,0.10397878000000001]
[null,"SM179C","MAJOR METROPOLITAN AREAS","Urban",1277,5.1622779440000004,0.50546000000000002,3.867669453301303,5.5732863429240727,0.7814458810825724,12,190.01774399999999,190.01774399999999,2.2156094500000001,2.2156094500000001,2,26.642913,26.642913,9.3970239999999997E-2,9.3970239999999997E-2]
[null,"SM179D","MAJOR METROPOLITAN AREAS","Urban",2123.5,7.6330122469999999,0.96108213899999995,3.5946462845042202,6.6749622135376709,5.8544704423049794,9,136.85801799999999,136.85801799999999,1.00981085,1.00981085,16,120.035319,120.035319,0.57263951000000002,0.57263951000000002]
[null,"SM216A","MAJOR METROPOLITAN AREAS","Urban",1993,9.6905878919999999,2.4869899999999996,7.2342566079729291,6.93212124953721,4.7265038544095805,11,151.43719300000001,151.43719300000001,1.10285999,1.10285999,12,103.253889,103.253889,0.37330657,0.37330657]
[null,"SM216B","MAJOR METROPOLITAN AREAS","Urban",2735.5,11.469629474,2.1875270790000001,7.1751936754348309,0.78938496775261524,10.312361605909496,10,12.563939,12.563939,0.10869429,0.10869429,25,164.1327,164.1327,0.66934747000000006,0.66934747000000006]
[null,"SM216C","MAJOR METROPOLITAN AREAS","Urban",3080,10.334739788,4.0274599999999996,7.0113416690388153,10.157035602130932,3.3856912805637314,13,143.57867999999999,57.095996,1.89924242,0.96396103,12,47.859740000000002,47.859740000000002,0.21266234000000001,0.21266234000000001]
[null,"SM216D","MAJOR METROPOLITAN AREAS","Urban",653,2.6980904720000001,2.792451555,8.1544952020342727,0.14745561992035139,6.4770225572490792E-3,3,9.8315470000000005,9.8315470000000005,1.3124042899999999,1.3124042899999999,1,0.43185299999999999,0.43185299999999999,1.5313900000000001E-3,1.5313900000000001E-3]
[null,"SM216E","MAJOR METROPOLITAN AREAS","Urban",2361,9.1638959369999995,0.83452999999999999,5.9990792155713359,19.233265819465132,1.2806359812926842,7,354.67513700000001,333.90639499999997,3.9847522199999998,2.9957644999999999,3,23.615841,23.615841,6.9038539999999995E-2,6.9038539999999995E-2]
[null,"SM216F","MAJOR METROPOLITAN AREAS","Urban",171,0.620013119,1.167903004,4.9727178685302462,0,7.6943353073703601E-3,null,null,null,null,null,2,1.9590639999999999,1.9590639999999999,1.169591E-2,1.169591E-2]
[null,"SM216G","MAJOR METROPOLITAN AREAS","Urban",1507,5.5327531819999995,2.299064741,4.6297718086316078,0.474468586135532,1.1507969440014463,6,13.707805,13.707805,0.1521787,0.1521787,2,33.247512,33.247512,8.4936960000000006E-2,8.4936960000000006E-2]
[null,"SM349A","MAJOR METROPOLITAN AREAS","Urban",1587.5,6.2907577730000002,0.52773000000000003,3.867669453301303,3.1657401941221193,10.166605630206295,4,86.823088999999996,7.7182079999999997,0.94803143999999995,5.9212540000000001E-2,19,278.82771700000001,278.82771700000001,0.91275591,0.91275591]
[null,"SM349B","MAJOR METROPOLITAN AREAS","Urban",1610.5,5.0249841179999999,2.0817981530000003,5.1441908984795655,3.998849342577055,3.822040481069469,4,108.105555,22.946287999999999,1.0686122,0.1117665,5,103.325675,103.325675,0.38745731,0.38745731]
[null,"SM349C","MAJOR METROPOLITAN AREAS","Urban",1800.5,9.3293785959999997,4.7218418589999995,6.2301867548252519,2.5765073129807852,2.4739469988879885,12,62.303429000000001,16.00629,1.0315652799999999,0.56391740000000001,7,59.823382000000002,59.823382000000002,0.16217717000000001,0.16217717000000001]
[null,"SM349D","MAJOR METROPOLITAN AREAS","Urban",2326.5,9.9495389570000015,12.082341807000001,5.3918741639619148,16.362796356978023,5.8408962567328722,15,306.21620300000001,245.964753,3.3440790800000002,2.66709649,23,109.30754399999999,109.30754399999999,1.58134537,1.58134537]
[null,"SM349E","MAJOR METROPOLITAN AREAS","Urban",1693,4.9836832280000003,0.23801,3.3341978045700884,6.8916053416284049,1.1530018878507227E-2,7,177.22996000000001,77.430786999999995,1.9102185199999999,0.77613701000000002,1,0.29651499999999997,0.29651499999999997,1.18133E-3,1.18133E-3]
[null,"SM349F","MAJOR METROPOLITAN AREAS","Urban",2903,12.405830590999999,9.0290269250000001,8.2307054375673037,15.163352598342897,21.09449109254032,18,227.416461,148.207367,3.7760936599999999,2.8759903200000001,72,316.37030700000003,316.37030700000003,1.4512573200000001,1.4512573200000001]
[null,"SM349H","MAJOR METROPOLITAN AREAS","Urban",1559.5,11.818795146000001,0.94621,4.877455074113958,2.2577706289985264E-2,8.1269636651304431,6,0.63032999999999995,0.63032999999999995,6.4123100000000001E-3,6.4123100000000001E-3,19,226.89067,226.89067,0.81243988,0.81243988]
[null,"SM350A","MAJOR METROPOLITAN AREAS","Urban",1724.5,6.4651606050000003,1.0822799999999999,6.4588174614243439,16.82356834902712,3.1845131224823673,14,424.74533400000001,314.29998799999998,4.0981926800000004,2.1260268400000002,11,80.399535999999998,80.399535999999998,0.41577269,0.41577269]
[null,"SM350B","MAJOR METROPOLITAN AREAS","Urban",1753.5,7.4500012239999993,1.3683557559999999,5.9539246510180153,7.1324648877054715,3.5048501210850374,11,177.095518,123.93098999999999,2.0716661599999999,1.09191138,15,87.023667000000003,87.023667000000003,0.51953236000000003,0.51953236000000003]
[null,"SM350C","MAJOR METROPOLITAN AREAS","Urban",380,2.9750441400000001,1.9492799999999999,2.8388312736053898,4.5585376630579404,0.72873394218581122,5,522.29473700000005,468.16315800000001,3.7131578900000002,2.7289473700000002,3,83.494737000000001,83.494737000000001,1.2815789500000001,1.2815789500000001]
[null,"SM350D","MAJOR METROPOLITAN AREAS","Urban",752,5.0585990230000011,2.0102099999999998,5.3156639284288838,6.9665889962837033,0.59246381866751774,7,403.34441500000003,261.07845700000001,5.0106383000000001,3.0319148899999999,3,34.301862,34.301862,0.13297871999999999,0.13297871999999999]
[null,"SM350E","MAJOR METROPOLITAN AREAS","Urban",1731,7.2795453649999997,2.6124306599999998,7.582918435536544,2.7089340532180843,1.1756944349661909,8,68.135754000000006,14.406694999999999,1.0362025500000001,5.9310580000000002E-2,5,29.571345999999998,29.571345999999998,9.3009820000000007E-2,9.3009820000000007E-2]
[null,"SM350F","MAJOR METROPOLITAN AREAS","Urban",1927,6.3966630709999999,4.8972600000000002,7.7671566799376457,3.1851791992701695,1.4233371910380335,5,71.96575,20.148416999999998,1.0498183699999999,7.2132849999999998E-2,7,32.158796000000002,32.158796000000002,0.24182666999999999,0.24182666999999999]
[null,"SM350G","MAJOR METROPOLITAN AREAS","Urban",1157,4.9193587379999997,2.9783200000000001,4.3186435220680117,12.502437192294675,0.46143043679125528,10,470.473343,416.98674,2.3843272500000001,1.3938345999999999,2,17.363872000000001,17.363872000000001,7.0872950000000004E-2,7.0872950000000004E-2]
[null,"SM350H","MAJOR METROPOLITAN AREAS","Urban",1931.5,6.6123473720000003,8.4643195850000001,7.9258644954351825,9.3621070321018411,2.1830551879391962,15,211.034076,156.806792,2.0797307300000001,1.10639394,13,49.208905000000001,49.208905000000001,0.26300802000000001,0.26300802000000001]
[null,"SM374A","MAJOR METROPOLITAN AREAS","Urban",2044.5,7.2414648379999997,2.3752600000000004,4.9155601918804734,9.9072643081537617,2.5619380393731701,6,210.979536,210.58971,1.00676611,1.0062769899999999,9,54.557594000000002,54.557594000000002,0.33211054000000001,0.33211054000000001]
[null,"SM374B","MAJOR METROPOLITAN AREAS","Urban",2019,7.5988929230000002,2.1504799999999999,5.2520283817588043,1.6977301709690222,6.9695289214160727,14,36.610532999999997,36.188541000000001,1.0330196300000001,1.0325243399999999,17,150.29371,150.29371,0.52748885999999995,0.52748885999999995]
[null,"SM374C","MAJOR METROPOLITAN AREAS","Urban",648,2.2978653370000002,2.9535707250000001,2.8388312736053898,3.3490111209044167,0,3,225.016975,225.016975,0.98919752999999999,0.98919752999999999]
[null,"SM374E","MAJOR METROPOLITAN AREAS","Urban",1747,5.7668417710000002,0.90264,3.4420352878493268,0.12130243874436177,0.22325056473922358,7,3.023085,3.023085,3.0719300000000001E-2,3.0719300000000001E-2,1,5.5638240000000003,5.5638240000000003,4.1213510000000002E-2,4.1213510000000002E-2]
[null,"SM402A","MAJOR METROPOLITAN AREAS","Urban",35,0.94242208599999999,3.097395224,4.4582987786822894,0,9.0953933782646643E-2,null,null,null,null,null,1,113.14285700000001,113.14285700000001,0.34285714,0.34285714]
[null,"SM402B","MAJOR METROPOLITAN AREAS","Urban",539,2.4287985990000003,2.4947300000000001,2.7054633614225865,2.0464637857275307E-2,0.24888303698706038,4,1.6530609999999999,1.6530609999999999,1.6697589999999998E-2,1.6697589999999998E-2,2,20.103895999999999,20.103895999999999,0.18923933000000001,0.18923933000000001]
[null,"SM402C","MAJOR METROPOLITAN AREAS","Urban",312.5,2.7849934079999996,0.73754999999999993,3.6733333526920751,2.0869793533400012,0.54152042848319693,6,290.76479999999998,290.76479999999998,2.0575999999999999,2.0575999999999999,1,75.446399999999997,75.446399999999997,0.27839999999999998,0.27839999999999998]
[null,"SM402D","MAJOR METROPOLITAN AREAS","Urban",1540,8.0927299459999986,0.98880999999999997,4.7631397208144124,2.3871193264207382,4.3875626420786418,7,67.488084999999998,10.212111,1.0209956200000001,5.0216400000000001E-2,12,124.044156,124.044156,0.47142856999999999,0.47142856999999999]
[null,"SM402E","MAJOR METROPOLITAN AREAS","Urban",472,3.4556558220000002,0.47897000000000001,2.4444433047219563,0.15303688403883198,0.41051001477203114,4,14.116524999999999,14.116524999999999,1.01271186,1.01271186,3,37.866525000000003,37.866525000000003,0.29025424,0.29025424]
[null,"SM410A","MAJOR METROPOLITAN AREAS","Urban",1711.5,7.3800665079999996,1.17689,5.3537690461954002,2.1922959449279995,0.79483632133390647,11,55.769399999999997,55.769399999999997,1.0996201999999999,1.0996201999999999,1,20.21969,20.21969,8.3552440000000006E-2,8.3552440000000006E-2]
[null,"SM410B","MAJOR METROPOLITAN AREAS","Urban",2237.5,5.8720508730000001,3.1144614449999999,6.8907389713077949,4.8128870189476887,0.97362051844605835,5,93.651842000000002,93.651842000000002,0.98175045000000005,0.98175045000000005,2,18.945250999999999,18.945250999999999,7.1955309999999995E-2,7.1955309999999995E-2]
[null,"SM410C","MAJOR METROPOLITAN AREAS","Urban",2719.5,8.1119039950000005,0.30528,6.382607225891312,7.8688933621047327E-2,5.8822619220718986,4,1.25979,1.25979,3.6771500000000001E-3,3.6771500000000001E-3,7,94.173561000000007,94.173561000000007,0.3287369,0.3287369]
[null,"SM410D","MAJOR METROPOLITAN AREAS","Urban",1198.5,4.8669714019999999,2.0174278710000002,5.258506251779111,0.13551217407010485,0.18438842939572911,1,4.9228199999999998,4.9228199999999998,4.92282E-2,4.92282E-2,2,6.6983730000000001,6.6983730000000001,0.10429703999999999,0.10429703999999999]
[null,"SM411A","MAJOR METROPOLITAN AREAS","Urban",841,4.4271499139999992,0.41283999999999998,3.753354100001757,1.3935548486586751,6.6319198626607383,7,72.144257999999994,72.144257999999994,0.50495433000000001,0.50495433000000001,9,343.33412600000003,343.33412600000003,1.3864447099999999,1.3864447099999999]
[null,"SM411B","MAJOR METROPOLITAN AREAS","Urban",737,4.2576446239999992,0.67124000000000006,3.9248271299510757,1.4027347469463582,0.99860988207118973,6,82.867028000000005,10.956581,1.1058344600000001,0.12075983999999999,2,58.993215999999997,58.993215999999997,0.17096336000000001,0.17096336000000001]
[null,"SM411C","MAJOR METROPOLITAN AREAS","Urban",1388,14.848781383,3.1237900000000001,4.3439834253827438,2.5359914482521311,0.63743548592671528,7,79.548503999999994,7.8633459999999999,1.02545625,4.3467779999999998E-2,3,19.994956999999999,19.994956999999999,6.2680120000000006E-2,6.2680120000000006E-2]
[null,"SM411D","MAJOR METROPOLITAN AREAS","Urban",1535,12.115442215,1.57159,4.6812137176164041,3.9129712260088887,2.1627972663239703,12,110.986964,23.732240999999998,1.1176981100000001,0.12616716,8,61.345277000000003,61.345277000000003,0.23908794999999999,0.23908794999999999]
[null,"SM411E","MAJOR METROPOLITAN AREAS","Urban",1814.5,12.439205871,2.9310300000000002,6.3063969903582819,6.5133811625970415,1.607771556763956E-2,4,156.28713099999999,85.29898,1.7828602899999999,0.79691374999999998,1,0.38578099999999999,0.38578099999999999,1.10223E-3,1.10223E-3]
[null,"SM411F","MAJOR METROPOLITAN AREAS","Urban",808.5,4.8514020790000005,1.957982128,3.6390387467022109,1.4342317067882799,0.10190974853373817,4,77.234793999999994,77.234793999999994,1.0257678400000001,1.0257678400000001,1,5.4879410000000002,5.4879410000000002,3.586889E-2,3.586889E-2]
[null,"SSD111","MAJOR METROPOLITAN AREAS","Urban",2,null,null,null,1.8764990883945027E-2,0,1,408.5,408.5,0.5,0.5]
[null,"SSD134","UPPER NORTH/EYRE PENINSULA","Urban",3,null,null,null,0,0.23145019967871974,null,null,null,null,null,2,3359,3359,0.66666667000000002,0.66666667000000002]
[null,"SSD298","SOUTH EAST","Rural Short",2,null,null,null,9.7815122159343685E-3,0,2,238,238,2,2]
[null,"SSD384","MAJOR METROPOLITAN AREAS","Urban",0.5,null,null,null,0,8.7279027367186176E-3,null,null,null,null,null,1,760,760,2,2]
[null,"SSD737","MAJOR METROPOLITAN AREAS","Urban",1,null,null,null,0,1.4171357864619438E-2,null,null,null,null,null,1,617,617,1,1]
[null,"SSD762","BAROSSA/MID NORTH & YORKE PENINSULA/RIVE","Rural Long",2,null,null,null,2.7684579112695416E-4,0,1,7.5,7.5,1.5,1.5]
[null,"ST11","EASTERN HILLS/FLEURIEU PENINSULA","Rural Short",1693.5,51.095330000000004,8.5673399999999997,4.2296680720831983,11.641129753709539,1.6642749849922451,7,334.51136700000001,334.51136700000001,1.0451727200000001,1.0451727200000001,14,47.823442999999997,47.823442999999997,0.24446413,0.24446413]
[null,"ST12","EASTERN HILLS/FLEURIEU PENINSULA","Rural Short",1725,75.248000000000005,14.284630652000001,4.2868257487329711,1.2300939366717369,2.4046080534869247,8,34.701650000000001,28.127737,0.18685995,0.15207734000000001,15,67.835362000000003,67.835362000000003,0.25565217000000001,0.25565217000000001]
[null,"ST13","EASTERN HILLS/FLEURIEU PENINSULA","Rural Short",189.5,18.483649999999997,5.8511200000000008,1.4289419162443238,0.27827991266425051,0,1,71.461741000000004,71.461741000000004,0.96569921000000003,0.96569921000000003]
[null,"ST14","EASTERN HILLS/FLEURIEU PENINSULA","Rural Short",21.5,8.852879999999999,null,null,3.8489017605977047E-2,0,2,87.116279000000006,87.116279000000006,1.0697674399999999,1.0697674399999999]
[null,"ST15","EASTERN HILLS/FLEURIEU PENINSULA","Rural Short",98.5,48.632820000000002,0.55830999999999997,null,0.58343843452690891,2.6714214035114872E-4,1,288.24365499999999,288.24365499999999,0.92385786999999997,0.92385786999999997,1,0.13197999999999999,0.13197999999999999,1.015228E-2,1.015228E-2]
[null,"ST16","EASTERN HILLS/FLEURIEU PENINSULA","Rural Short",55,31.33014,null,null,7.7265726747716867E-2,0,2,68.363636,68.363636,0.94545455,0.94545455]
[null,"ST21","EASTERN HILLS/FLEURIEU PENINSULA","Rural Short",846.5,47.559989999999999,3.5725599999999997,1.1241009741122014,9.9942121708713216,7.228270385435148,14,574.54302099999995,574.54302099999995,3.9771608600000001,3.9771608600000001,8,415.53573499999999,415.53573499999999,1.3030124000000001,1.3030124000000001]
[null,"ST22","EASTERN HILLS/FLEURIEU PENINSULA","Rural Short",271,45.738979999999998,1.7131500000000002,null,3.200116202281837,1.8681455368709949,7,574.64205800000002,574.64205800000002,3.9606395600000002,3.9606395600000002,4,335.46125499999999,335.46125499999999,0.96678967000000005,0.96678967000000005]
[null,"ST23","EASTERN HILLS/FLEURIEU PENINSULA","Rural Short",132,33.92456,0.96483000000000008,null,0.35805266565218585,0.87454116992801456,3,132,132,0.92424242000000001,0.92424242000000001,1,322.40909099999999,322.40909099999999,0.93181818000000005,0.93181818000000005]
[null,"ST24","EASTERN HILLS/FLEURIEU PENINSULA","Rural Short",69.5,40.926139999999997,null,null,0.16795020869922608,0.48065035867795153,3,117.597122,117.597122,1.3381295,1.3381295,2,336.546763,336.546763,0.99280575999999998,0.99280575999999998]
[null,"ST34","EASTERN HILLS/FLEURIEU PENINSULA","Rural Long",550.5,39.05039,2.2068300000000001,1.1622060918787165,1.1009851404123914,0.18236755080836223,10,108.36211400000001,108.36211400000001,1.2273691200000001,1.2273691200000001,2,17.949137,17.949137,8.5376930000000004E-2,8.5376930000000004E-2]
[null,"ST35","EASTERN HILLS/FLEURIEU PENINSULA","Rural Long",774,74.538529999999994,10.71968,1.7718879761429616,9.8161027744228182,0.51445330545818135,10,687.14987199999996,371.44186200000001,2.46942292,2.2316968199999998,8,36.012920000000001,36.012920000000001,0.20671835,0.20671835]
[null,"ST36","EASTERN HILLS/FLEURIEU PENINSULA","Rural Long",433.5,75.913629999999998,1.91577,1.1812586507619742,1.01569810439273,0.44127373467028974,9,126.94888,126.94888,1.14186875,1.14186875,5,55.153402999999997,55.153402999999997,0.21222606999999999,0.21222606999999999]
[null,"ST41","EASTERN HILLS/FLEURIEU PENINSULA","Rural Long",354.5,101.86782999999998,1.97993,1.1050484152289437,0.61195839909142002,1.3868313060713642,5,93.531735999999995,93.531735999999995,1.2242595300000001,1.2242595300000001,5,211.96332899999999,211.96332899999999,1.0437235499999999,1.0437235499999999]
[null,"ST42","EASTERN HILLS/FLEURIEU PENINSULA","Rural Long",158,39.379880000000007,1.6644700000000001,1.8862033294425071,4.6510110922761104E-2,0.6221278618204914,5,15.949373,15.949373,8.6497920000000006E-2,8.6497920000000006E-2,2,213.34177199999999,213.34177199999999,0.96202531999999996,0.96202531999999996]
[null,"ST43","EASTERN HILLS/FLEURIEU PENINSULA","Rural Long",147.5,17.054040000000001,0.71941999999999995,null,0.48782076242560612,0.60885772023247264,4,179.193228,179.193228,1.9615819400000001,1.9615819400000001,4,223.65423699999999,223.65423699999999,1.0779661,1.0779661]
[null,"ST44","EASTERN HILLS/FLEURIEU PENINSULA","Rural Long",142,38.568630000000006,0.70508000000000004,null,6.9211450716303927E-2,0.56240299648136982,5,26.408452,26.408452,0.11971832,0.11971832,4,214.59154899999999,214.59154899999999,0.96478872999999998,0.96478872999999998]
[null,"ST45","EASTERN HILLS/FLEURIEU PENINSULA","Rural Long",9.5,6.0066899999999999,null,null,3.0563775340415739E-2,3.9496666200778789E-2,2,174.315789,174.315789,1.89473684,1.89473684,1,225.263158,225.263158,1.0526315799999999,1.0526315799999999]
[null,"ST51","EASTERN HILLS/FLEURIEU PENINSULA","Rural Short",265,70.601559999999992,3.2936000000000005,null,1.1458342816998017,1.8083467962231609E-3,8,210.41509300000001,100.543395,2.12578618,1.1786163700000001,1,0.33207500000000001,0.33207500000000001,1.5094339999999999E-2,1.5094339999999999E-2]
[null,"VH10","EASTERN HILLS/FLEURIEU PENINSULA","Rural Short",2175.5,12.623720857,14.952508354999999,3.7343015411184992,11.147307229490325,2.6029713673953587,6,249.35141300000001,249.35141300000001,1.9837585200000001,1.9837585200000001,11,58.225236000000002,58.225236000000002,0.35164329999999999,0.35164329999999999]
[null,"VH11","EASTERN HILLS/FLEURIEU PENINSULA","Urban",1797,7.2950062660000006,3.9903579730000001,5.5252420761447185,7.0267234146921181E-2,0,4,1.702466,1.702466,2.949359E-2,2.949359E-2]
[null,"VH12","EASTERN HILLS/FLEURIEU PENINSULA","Rural Short",2717.5,12.004359230999999,16.580779999999997,5.3156639284288838,9.2677773306436995E-3,2.3270957339942684,3,0.165961,0.165961,1.10396E-3,1.10396E-3,11,41.672125000000001,41.672125000000001,0.15970561,0.15970561]
[null,"VH13","EASTERN HILLS/FLEURIEU PENINSULA","Rural Short",58.5,12.547805423,0.97460999999999998,null,4.3564718272648875E-3,3.1646068933905312E-3,1,3.6239319999999999,3.6239319999999999,0.90598290999999997,0.90598290999999997,1,2.632479,2.632479,3.4188030000000001E-2,3.4188030000000001E-2]
[null,"VH14","EASTERN HILLS/FLEURIEU PENINSULA","Rural Short",84,21.647296642999997,null,null,1.8083473674963532E-2,5.3428428070229749E-3,2,10.476194,10.476194,1.01190479,1.01190479,1,3.0952380000000002,3.0952380000000002,1.190476E-2,1.190476E-2]
[null,"VH15","EASTERN HILLS/FLEURIEU PENINSULA","Rural Short",2177,40.953685843999999,12.84863693,4.439246219799033,15.139390593413253,5.3904557561917148,19,338.416022,337.15281499999998,3.06507431,3.0604808299999999,18,120.49471800000001,120.49471800000001,0.36610014000000002,0.36610014000000002]
[null,"VH16","EASTERN HILLS/FLEURIEU PENINSULA","Rural Short",2230,12.150023129999999,13.513451062,3.7343015411184992,9.5284737934273736,3.1155760359383895,15,207.93109100000001,207.93109100000001,1.7701046300000001,1.7701046300000001,9,67.988341000000005,67.988341000000005,0.34663676999999998,0.34663676999999998]
[null,"VH17","EASTERN HILLS/FLEURIEU PENINSULA","Rural Short",491.5,76.027862974999991,6.8183500000000006,1.3717842395945505,3.9683829075327717,7.1594093614107859E-2,13,392.90811600000001,392.90811600000001,2.0902001100000001,2.0902001100000001,6,7.0885049999999996,7.0885049999999996,4.679552E-2,4.679552E-2]
[null,"VH18","EASTERN HILLS/FLEURIEU PENINSULA","Rural Short",259,61.961273308000003,9.7962500000000006,null,1.3041400493084934,0.17838930156833249,7,245.03347500000001,245.03347500000001,2.1106821500000001,2.1106821500000001,3,33.517375000000001,33.517375000000001,0.16988417,0.16988417]
[null,"VH19","EASTERN HILLS/FLEURIEU PENINSULA","Rural Short",72,20.089281602,null,null,0.34829855862370729,4.4386694089113944E-3,4,235.407411,235.407411,1.8935185400000001,1.8935185400000001,1,3,3,4.1666670000000003E-2,4.1666670000000003E-2]
[null,"VH21","EASTERN HILLS/FLEURIEU PENINSULA","Rural Short",2981.5,17.428622694999998,2.32694,5.0984647571597481,16.940846181880531,13.758744950877684,11,276.50388400000003,276.50388400000003,1.6586729099999999,1.6586729099999999,14,224.56649300000001,224.56649300000001,0.67348649999999999,0.67348649999999999]
[null,"VH22","EASTERN HILLS/FLEURIEU PENINSULA","Rural Short",1872.5,57.140788528000002,16.21865,3.7933644736565975,9.5047322938325092,0.70017954986036079,16,247.01254700000001,247.01254700000001,1.1850467099999999,1.1850467099999999,5,18.196529000000002,18.196529000000002,0.11642189999999999,0.11642189999999999]
[null,"VH23","EASTERN HILLS/FLEURIEU PENINSULA","Rural Short",1609,24.313711142999999,7.1434899999999999,3.0179253271080113,18.221642083252391,18.504052438121374,13,551.10254799999996,551.10254799999996,3.3635798700000001,3.3635798700000001,36,559.64387799999997,559.64387799999997,1.7066500899999999,1.7066500899999999]
[null,"VH31","EASTERN HILLS/FLEURIEU PENINSULA","Rural Short",2230,21.374673813000001,18.929886750000001,6.2492393137085092,0.21739205405960019,15.573790850005034,2,4.7439460000000002,4.4394999999999997E-2,3.632287E-2,4.4842999999999999E-4,21,339.85246599999999,339.85246599999999,1.18923767,1.18923767]
[null,"VH32","EASTERN HILLS/FLEURIEU PENINSULA","Rural Short",471,77.163626551999997,3.34185,1.3603527042645962,1.3142777231730658,0.18586928149816465,10,135.78981300000001,135.78981300000001,1.2420382299999999,1.2420382299999999,5,19.203821999999999,19.203821999999999,0.13800424999999999,0.13800424999999999]
[null,"VH33","EASTERN HILLS/FLEURIEU PENINSULA","Rural Short",147,72.745910686999991,1.2243199999999999,null,1.6438283365576762,7.477924990291003E-2,8,544.17687100000001,544.17687100000001,5.0612244899999999,5.0612244899999999,2,24.755102000000001,24.755102000000001,0.25850339999999999,0.25850339999999999]
[null,"VH34","EASTERN HILLS/FLEURIEU PENINSULA","Rural Short",206,42.066255854000005,3.2225132190000005,0.53347164873121411,1.0101810591174005,0.38320512563601705,3,238.63434699999999,150.24114299999999,1.41423951,0.73948223000000002,6,90.524271999999996,90.524271999999996,0.46601942000000002,0.46601942000000002]
[null,"VH35","EASTERN HILLS/FLEURIEU PENINSULA","Rural Short",153,0.62616949999999993,5.4790799999999997,null,1.9413013845363862,4.1304284777369929E-2,1,617.45097999999996,617.45097999999996,0.92156863,0.92156863,1,13.137255,13.137255,0.87581699000000002,0.87581699000000002]
[null,"VH36","EASTERN HILLS/FLEURIEU PENINSULA","Rural Short",12,0.71416374000000005,1.0911500000000001,null,0.16521713910947972,0,1,670,670,1,1]
[null,"VH43","EASTERN HILLS/FLEURIEU PENINSULA","Rural Short",112,30.532171635000001,1.8795419250000001,0.3943879688834333,3.0762444931205359E-2,5.9798740647834067E-2,1,13.366071,13.366071,0.13392857,0.13392857,1,25.982143000000001,25.982143000000001,8.9285710000000004E-2,8.9285710000000004E-2]
[null,"VH44","EASTERN HILLS/FLEURIEU PENINSULA","Rural Short",303,91.371841015000015,7.3799599999999996,0.79639696132016968,5.594942789932813,9.0848877114802204E-2,11,898.57425699999999,898.57425699999999,2.3234323400000001,2.3234323400000001,5,14.590759,14.590759,8.2508250000000005E-2,8.2508250000000005E-2]
[null,"VH45","EASTERN HILLS/FLEURIEU PENINSULA","Rural Short",1175.5,51.412054742999999,8.0760400000000008,2.7569052704073815,6.20091014654255,0.50549457773060824,12,256.70466199999998,256.70466199999998,1.33021407,1.33021407,5,20.926414000000001,20.926414000000001,9.6129309999999996E-2,9.6129309999999996E-2]
[null,"VH51","EASTERN HILLS/FLEURIEU PENINSULA","Rural Short",335,23.084452508000002,3.0095000000000001,null,7.4448405827825797,2.1248074855622138E-2,7,1081.462704,1072.0537489999999,1.83582103,1.8119404400000001,2,3.0865670000000001,3.0865670000000001,3.5820900000000003E-2,3.5820900000000003E-2]
[null,"VH61","EASTERN HILLS/FLEURIEU PENINSULA","Rural Short",43,1.416677559,null,null,0.79986466700216252,0,2,905.20930199999998,905.20930199999998,1.72093023,1.72093023]
[null,"VH71","EASTERN HILLS/FLEURIEU PENINSULA","Rural Short",336,20.931124183000001,6.7931435049999997,0.56205048705610072,2.1355137205716712,2.4659274493952192E-4,6,309.28868999999997,309.28868999999997,1.93452381,1.93452381,1,3.5714000000000003E-2,3.5714000000000003E-2,2.9761900000000001E-3,2.9761900000000001E-3]
[null,"VH72","EASTERN HILLS/FLEURIEU PENINSULA","Rural Short",116.5,44.483307513,0.70750000000000002,null,2.6532351885721974,0.98805603018184107,4,1108.2832619999999,1108.2832619999999,1.4248927,1.4248927,4,412.72102999999998,412.72102999999998,1.06437768,1.06437768]
[null,"W01","UPPER NORTH/EYRE PENINSULA","Rural Long",303,39.557780000000001,0.65646000000000004,1.1812586507619742,0.65051378360404177,0,8,116.323432,22.877887999999999,1.9174917499999999,0.97359735999999997]
[null,"W02","UPPER NORTH/EYRE PENINSULA","Rural Long",298,53.273380000000003,0.82201000000000002,1.1050484152289437,0.57864461622748442,0.13886584882928021,4,105.208054,16.506710999999999,1.81208054,0.91610738000000003,1,25.248322000000002,25.248322000000002,0.12080537,0.12080537]
[null,"W03","UPPER NORTH/EYRE PENINSULA","Rural Long",139,8.7074300000000004,null,null,3.4127703491523391,0,5,1330.2877699999999,1330.2877699999999,4.5251798599999997,4.5251798599999997]
[null,"W04","UPPER NORTH/EYRE PENINSULA","Rural Long",306.5,66.583240000000004,0.72105999999999992,0.7621023553303059,1.5031311510428991,0.62605907205449407,6,265.71723800000001,172.35671600000001,1.8423056099999999,0.879826,6,110.672104,110.672104,2.3686786299999998,2.3686786299999998]
[null,"W06","UPPER NORTH/EYRE PENINSULA","Rural Long",235.5,69.018509999999992,null,null,0.55319325982987977,2.2932982517653122,4,127.27388500000001,16.424627999999998,1.95329087,0.98938429000000006,5,527.62208099999998,527.62208099999998,3.5286624199999999,3.5286624199999999]
[null,"W07","UPPER NORTH/EYRE PENINSULA","Rural Short",5,15.4825,5.0499999999999998E-3,null,0.12132363051024478,6.904596858306614E-3,5,1180.8,1180.8,4,4,1,67.2,67.2,0.6,0.6]
[null,"W08","UPPER NORTH/EYRE PENINSULA","Rural Short",52,33.896049999999995,6.8330000000000002E-2,null,0.20111693289359175,0,3,188.21153799999999,88.692307999999997,2.4807692299999999,1.6153846199999999]
[null,"W15","UPPER NORTH/EYRE PENINSULA","Rural Long",65,82.637839999999997,null,null,0.48084422641536911,0.10542287726114413,3,400.81538499999999,317.046154,2.5692307699999999,1.72307692,1,87.876923000000005,87.876923000000005,0.86153846000000001,0.86153846000000001]
[null,"W16","UPPER NORTH/EYRE PENINSULA","Rural Long",53.5,76.725719999999995,null,null,0.33083072039671019,9.0897701420016616E-2,3,335.04672900000003,255.47663600000001,2.3551401900000002,1.5514018700000001,2,92.056075000000007,92.056075000000007,0.93457944000000004,0.93457944000000004]
[null,"W17","UPPER NORTH/EYRE PENINSULA","Rural Long",61,80.963160000000002,null,null,2.1195867460261861,9.9350726242426274E-2,7,1882.672131,1803.147541,4.7540983600000004,3.95081967,3,88.245902000000001,88.245902000000001,0.88524590000000003,0.88524590000000003]
[null,"W18","UPPER NORTH/EYRE PENINSULA","Rural Long",65.5,86.720520000000008,null,null,2.3365600207254178,2.0855716264897213E-3,8,1932.80916,1845.1450380000001,4.2442748100000003,3.3587786300000002,1,1.7251909999999999,1.7251909999999999,1.526718E-2,1.526718E-2]
[null,"W19","UPPER NORTH/EYRE PENINSULA","Rural Long",17,25.718880000000002,null,null,3.3664448201037624E-2,4.955539661172479E-2,2,107.294118,14.117647,1.8235294099999999,0.88235293999999997,1,157.94117600000001,157.94117600000001,0.88235293999999997,0.88235293999999997]
[null,"W20","UPPER NORTH/EYRE PENINSULA","Rural Long",57.5,93.826270000000008,null,null,0.21149172803491784,0.2533508116533133,4,199.286957,111.478261,2.6956521699999998,1.80869565,1,238.730435,238.730435,0.92173912999999996,0.92173912999999996]
[null,"W21","UPPER NORTH/EYRE PENINSULA","Rural Long",58,102.47769,5.237E-2,null,0.27092129119683728,0.20663769849715857,4,253.086207,160.913793,2.84482759,1.9137930999999999,2,193.03448299999999,193.03448299999999,1.0689655199999999,1.0689655199999999]
[null,"W22","UPPER NORTH/EYRE PENINSULA","Rural Long",4,8.5388799999999989,null,null,3.9127538479276185E-3,1.2365778670337284E-3,3,53,24.25,1,0.75,2,16.75,16.75,0.5,0.5]
[null,"W23","UPPER NORTH/EYRE PENINSULA","Rural Long",52.5,79.371160000000003,null,null,0.29288439062624233,0.10940945665337228,5,302.26666699999998,213.63809499999999,3.1619047600000001,2.2666666700000002,3,112.914286,112.914286,0.76190475999999996,0.76190475999999996]
[null,"W24","UPPER NORTH/EYRE PENINSULA","Rural Long",76.5,124.66359,null,null,2.2331304331603876,0.36785423086342156,11,1581.6339869999999,1581.6339869999999,5.1372549000000003,5.1372549000000003,2,260.53594800000002,260.53594800000002,1.7777777800000001,1.7777777800000001]
[null,"W25","UPPER NORTH/EYRE PENINSULA","Rural Long",54,71.073350000000005,null,null,1.6179052597319952,6.8436279566583061E-2,8,1623.351852,1623.351852,5.5,5.5,7,68.666667000000004,68.666667000000004,1.1481481499999999,1.1481481499999999]
[null,"W26","UPPER NORTH/EYRE PENINSULA","Rural Long",111,148.52779000000001,0.47737999999999997,null,8.677786692032603,6.3416142554147625E-2,17,4235.8378380000004,4235.8378380000004,8.9009008999999999,8.9009008999999999,2,30.954955000000002,30.954955000000002,0.39639639999999998,0.39639639999999998]
[null,"W27","UPPER NORTH/EYRE PENINSULA","Rural Long",78.5,130.27849000000001,null,null,3.1420336218162532,0.1380168550698242,5,2168.6751589999999,2077.2356690000001,4.7133757999999997,3.7707006399999998,7,95.261145999999997,95.261145999999997,2.7006369399999999,2.7006369399999999]
[null,"W28","UPPER NORTH/EYRE PENINSULA","Rural Long",91,164.82123000000001,null,null,2.9598998488959372,0.52364458572359618,6,1762.3369949999999,1673.8644670000001,3.8058607900000001,2.8937728800000002,4,311.78021999999999,311.78021999999999,1.93406593,1.93406593]
[null,"W29","UPPER NORTH/EYRE PENINSULA","Rural Long",90.5,137.28393,null,null,3.6161228109281249,1.2645762047097011,9,2164.950276,2056.9392269999998,6.6850828699999996,5.7458563500000004,4,757.09392300000002,757.09392300000002,3.2375690600000002,3.2375690600000002]
[null,"W30","UPPER NORTH/EYRE PENINSULA","Rural Short",68,112.26964,null,null,1.9690636177374943,0.15042157441310838,6,1409.132353,1409.132353,4.7352941199999998,4.7352941199999998,1,107.647059,107.647059,0.94117647000000004,0.94117647000000004]
[null,"W31","UPPER NORTH/EYRE PENINSULA","Rural Short",30.5,55.548010000000005,null,null,8.9163826691048803E-2,0.13131063668029541,3,142.26229499999999,29.147541,2.0327868900000001,1.04918033,2,209.508197,209.508197,1.04918033,1.04918033]
[null,"W32","UPPER NORTH/EYRE PENINSULA","Rural Long",21,43.308019999999999,null,null,0.17836251503005898,2.015437359404226E-2,3,460.19047599999999,375.33333299999998,2.6190476199999999,1.76190476,2,52,52,0.57142857000000002,0.57142857000000002]
[null,"W33","UPPER NORTH/EYRE PENINSULA","Rural Short",41,43.02496,null,null,1.213236305102448,2.350850835090109E-2,5,1440,1440,4.8780487800000003,4.8780487800000003,2,27.902439000000001,27.902439000000001,0.53658536999999995,0.53658536999999995]
[null,"WHY01","MAJOR METROPOLITAN AREAS","Rural Short",941,8.5701238250000014,0.15936,1.9759580290856456,1.1877550547920305E-2,0,4,0.61424000000000001,0.61424000000000001,6.3762000000000003E-3,6.3762000000000003E-3]
[null,"WHY02","MAJOR METROPOLITAN AREAS","Urban",902.5,8.8386746469999995,1.5152597719999998,2.8007261558388747,0.18317111664560784,0,2,8.8365650000000002,8.8365650000000002,5.6509700000000003E-2,5.6509700000000003E-2]
[null,"WHY03","MAJOR METROPOLITAN AREAS","Urban",983,7.5259663809999999,0.66853999999999991,2.4373938579351511,1.2450889239489165,6.8376227492661382E-2,4,55.146830000000001,55.146830000000001,0.97829772999999998,0.97829772999999998,1,3.0284840000000002,3.0284840000000002,1.322482E-2,1.322482E-2]
[null,"WHY04","MAJOR METROPOLITAN AREAS","Urban",1174.5,10.51202572,1.2563800000000001,3.6481839749661744,4.869251000485123E-3,0,1,0.180502,0.180502,8.5143000000000003E-4,8.5143000000000003E-4]
[null,"WHY05","MAJOR METROPOLITAN AREAS","Urban",533,6.1421877290000007,0.11387,1.5165836871073088,2.2148947447903508E-2,0.29711618368997905,2,1.8092539999999999,1.8092539999999999,2.1888660000000001E-2,2.1888660000000001E-2,2,24.270168999999999,24.270168999999999,7.8799250000000001E-2,7.8799250000000001E-2]
[null,"WHY06","MAJOR METROPOLITAN AREAS","Urban",699.5,6.5925353080000004,0.47839999999999999,3.1627247746207696,0.32441001883858178,0.18916580773582772,6,20.192042000000001,20.192042000000001,0.23207052,0.23207052,1,11.774124,11.774124,4.1458179999999997E-2,4.1458179999999997E-2]
[null,"WHY07","MAJOR METROPOLITAN AREAS","Urban",931,22.706631955000002,2.5534699999999999,2.9340940680216776,5.7411913633683245,1.1558040039925113,12,268.48871800000001,268.48871800000001,3.0744718899999999,3.0744718899999999,4,54.051557000000003,54.051557000000003,0.22448979999999999,0.22448979999999999]
[null,"WHY08","MAJOR METROPOLITAN AREAS","Urban",1484,9.9726796560000004,3.4519699999999998,3.6579388851144023,9.8868992995818452,0.16789728685635025,8,290.06805900000001,290.06805900000001,1.9353099600000001,1.9353099600000001,1,4.9258759999999997,4.9258759999999997,2.897574E-2,2.897574E-2]
[null,"WHY09","MAJOR METROPOLITAN AREAS","Urban",769.5,7.5289235529999994,0.97469191799999999,3.3723029223366043,2.864221876946901,1.2380989395337292,3,162.058469,162.058469,1.01061288,1.01061288,2,70.051981999999995,70.051981999999995,0.31838855999999999,0.31838855999999999]
[null,"WHY10","MAJOR METROPOLITAN AREAS","Urban",1812,8.9922888710000013,1.95973,4.409619490735567,4.1283591645484403,0.54294445471918784,4,99.195729999999998,99.195729999999998,0.96063279999999995,0.96063279999999995,1,13.045806000000001,13.045806000000001,4.2494480000000001E-2,4.2494480000000001E-2]
[null,"WHY12","MAJOR METROPOLITAN AREAS","Urban",1359,4.5116377650000006,10.765450000000001,3.3723029223366043,4.22880668493075,8.2111190220444899E-2,4,135.479029,135.479029,1.02943341,1.02943341,1,2.630611,2.630611,9.5658600000000007E-3,9.5658600000000007E-3]
[null,"WHY13","MAJOR METROPOLITAN AREAS","Urban",285.5,null,5.6523500000000002,1.2019497297091921,2.7443516332272244,0.24987066808621536,2,418.51144900000003,418.51144900000003,1.08464687,1.08464687,2,38.105079000000003,38.105079000000003,0.30122591999999998,0.30122591999999998]
[null,"WHY14","UPPER NORTH/EYRE PENINSULA","Urban",100,47.743515363,null,null,0.47964419171288131,2.2049438492762825E-2,3,208.83,208.83,1.63,1.63,1,9.6,9.6,0.12,0.12]
[null,"WHY15","UPPER NORTH/EYRE PENINSULA","Urban",40,60.343800000000002,null,null,2.1980993360774872,0,6,2392.5500000000002,2392.5500000000002,5.25,5.25]
[null,"WHY17","UPPER NORTH/EYRE PENINSULA","Rural Short",51,2.6920999999999999,null,null,1.2275797830997632,0.29599349150907284,6,1171.333333,1171.333333,4.7450980400000002,4.7450980400000002,2,282.43137300000001,282.43137300000001,2,2]
[null,"WHY363A","UPPER NORTH/EYRE PENINSULA","Rural Short",1,2.1327099999999999,0.49278,null,1.1918649338743559E-2,4.1098790823253649E-5,4,580,580,4,4,1,2,2,1,1]
[null,"WK11","BAROSSA/MID NORTH & YORKE PENINSULA/RIVE","Rural Short",306,44.092860000000002,0.91413999999999995,null,0.2091106477087146,3.5694299829995793E-2,1,33.254902000000001,33.254902000000001,0.34640523000000001,0.34640523000000001,2,5.6764710000000003,5.6764710000000003,7.843137E-2,7.843137E-2]
[null,"WK12","BAROSSA/MID NORTH & YORKE PENINSULA/RIVE","Rural Short",8,30.639980000000001,null,null,1.5781935676129403E-2,0,1,96,96,1,1]
[null,"WK21","BAROSSA/MID NORTH & YORKE PENINSULA/RIVE","Rural Short",79.5,18.269080000000002,1.44807,1.2765214451782625,0.82037296362296619,0,3,502.163522,502.163522,2.2012578600000001,2.2012578600000001]
[null,"WK23","BAROSSA/MID NORTH & YORKE PENINSULA/RIVE","Rural Short",23,33.769199999999998,null,null,0,9.0417339811158046E-3,null,null,null,null,null,1,19.130434999999999,19.130434999999999,0.86956522000000003,0.86956522000000003]
[null,"WK31","BAROSSA/MID NORTH & YORKE PENINSULA/RIVE","Rural Short",543.5,45.132249999999999,2.4140300000000003,4.3439834253827438,0.52946891631896342,4.2537248502067526E-3,5,47.406934,47.406934,0.35510583000000001,0.35510583000000001,1,0.38086500000000001,0.38086500000000001,5.5197800000000002E-3,5.5197800000000002E-3]
[null,"WK32","BAROSSA/MID NORTH & YORKE PENINSULA/RIVE","Rural Short",121,30.111689999999999,0.17881,1.200311209645232,1.8899895441935541,3.1029587071556508E-2,2,760.107438,760.107438,1.76033058,1.76033058,2,12.479339,12.479339,0.1322314,0.1322314]
[null,"WK33","BAROSSA/MID NORTH & YORKE PENINSULA/RIVE","Rural Short",141,27.589440000000003,9.3870000000000009E-2,1.6194675050769001,0.2738412244731917,3.2139254423784354E-2,5,94.510632000000001,94.510632000000001,1.0425531800000001,1.0425531800000001,2,11.092199000000001,11.092199000000001,0.19858155999999999,0.19858155999999999]
[null,"WK41","BAROSSA/MID NORTH & YORKE PENINSULA/RIVE","Rural Short",1269,23.863509999999998,7.1391,4.8488762357890716,1.0968375898163172,1.9244303309034407,11,42.061199999999999,22.258993,0.32440239999999998,0.17546623,9,73.797477999999998,73.797477999999998,1.2222222199999999,1.2222222199999999]
[null,"WK42","BAROSSA/MID NORTH & YORKE PENINSULA/RIVE","Rural Short",406,31.741940000000003,2.11165,1.8480982116759919,1.1378200997484971,1.9521925641045487E-2,7,136.37931900000001,136.37931900000001,1.1346470399999999,1.1346470399999999,1,2.3399009999999998,2.3399009999999998,2.4630539999999999E-2,2.4630539999999999E-2]
[null,"WK43","BAROSSA/MID NORTH & YORKE PENINSULA/RIVE","Rural Short",318,45.412430000000001,1.33999,1.9509820296455835,1.4766590371466428,0.15796320252917542,4,225.97170299999999,225.97170299999999,1.8993710699999999,1.8993710699999999,4,24.172955999999999,24.172955999999999,0.10691824,0.10691824]
[null,"WK44","BAROSSA/MID NORTH & YORKE PENINSULA/RIVE","Rural Short",63,133.86511999999999,null,null,1.1057218683088161,0,4,854.09523799999999,854.09523799999999,2.80952381,2.80952381]
[null,"WK51","BAROSSA/MID NORTH & YORKE PENINSULA/RIVE","Rural Short",89.5,49.95758,4.6275699999999995,2.9055152296967912,1.2041945711213319E-2,2.5090811797596355E-2,1,6.5474860000000001,6.5474860000000001,2.2346370000000001E-2,2.2346370000000001E-2,3,13.642458,13.642458,5.5865919999999999E-2,5.5865919999999999E-2]
[null,"WK52","BAROSSA/MID NORTH & YORKE PENINSULA/RIVE","Rural Short",120.5,51.454140000000002,9.1120900000000002,null,0.48977428284293145,0.18531444782205073,5,197.792528,197.792528,1.19502073,1.19502073,5,74.838173999999995,74.838173999999995,0.40663899999999997,0.40663899999999997]
[null,"WK61","BAROSSA/MID NORTH & YORKE PENINSULA/RIVE","Rural Short",445,27.926539999999999,0.31660000000000005,null,6.6210152016261639E-2,0.14692817719313181,4,7.2404489999999999,7.2404489999999999,1.9213483099999999,1.9213483099999999,3,16.067416000000001,16.067416000000001,1.0539325799999999,1.0539325799999999]
[null,"WK65","BAROSSA/MID NORTH & YORKE PENINSULA/RIVE","Rural Short",516,39.959800000000001,9.6300000000000014E-3,null,0.63898345032453618,0.10241818673154811,5,60.261628000000002,60.261628000000002,2.4244186000000001,2.4244186000000001,2,9.6589150000000004,9.6589150000000004,1.03875969,1.03875969]
[null,"WK71","BAROSSA/MID NORTH & YORKE PENINSULA/RIVE","Rural Short",109,23.985769999999999,0.82383000000000006,0.87641770862985191,0.45278542664701893,1.3615207423927471,4,202.14680999999999,202.14680999999999,2.1039756199999999,2.1039756199999999,4,607.85321099999999,607.85321099999999,2.5412843999999999,2.5412843999999999]
[null,"WK72","BAROSSA/MID NORTH & YORKE PENINSULA/RIVE","Rural Short",575.5,39.024979999999999,0.61096000000000006,2.4006224192904639,3.2452016221949318,5.4894010950986969,4,274.40834100000001,274.40834100000001,2.0538661999999999,2.0538661999999999,4,464.17376200000001,464.17376200000001,1.91659427,1.91659427]
[null,"WK73","BAROSSA/MID NORTH & YORKE PENINSULA/RIVE","Rural Short",29.5,11.389959999999999,null,null,8.8896684550697658E-2,0.24975735183291245,2,146.644068,146.644068,1.69491525,1.69491525,2,412,412,1.69491525,1.69491525]
[null,"WK81","BAROSSA/MID NORTH & YORKE PENINSULA/RIVE","Rural Short",43.5,30.468190000000003,null,0.78496542599021513,0.2647995092742233,0.69894658613566329,2,296.22988500000002,296.22988500000002,1.8620689699999999,1.8620689699999999,3,781.90804600000001,781.90804600000001,2.3678160899999998,2.3678160899999998]
[null,"WK91","BAROSSA/MID NORTH & YORKE PENINSULA/RIVE","Rural Short",67.5,98.298199999999994,null,null,2.2682833643261922,0.23395486676137139,10,1635.2888889999999,1635.2888889999999,7.28888889,7.28888889,5,168.66666699999999,168.66666699999999,0.94814814999999997,0.94814814999999997]
[null,"YK01","BAROSSA/MID NORTH & YORKE PENINSULA/RIVE","Rural Long",79,52.315019999999997,null,null,1.0815442240026341,9.7818846198190462E-4,4,741.77215200000001,741.77215200000001,3.5569620300000002,3.5569620300000002,1,0.67088599999999998,0.67088599999999998,1.2658229999999999E-2,1.2658229999999999E-2]
[null,"YK02","BAROSSA/MID NORTH & YORKE PENINSULA/RIVE","Rural Short",492,10.491680000000001,1.6424100000000001,1.200311209645232,2.3242188186366408,0.36002540761170199,4,229.886179,174.16056900000001,2.9410569099999999,1.9634146299999999,4,35.609755999999997,35.609755999999997,0.29878049000000001,0.29878049000000001]
[null,"YK03","BAROSSA/MID NORTH & YORKE PENINSULA/RIVE","Rural Long",884,22.591369999999998,3.0746899999999999,1.3717842395945505,1.8754825377293736,0.2163457575726771,6,114.95135500000001,59.563346000000003,1.9694569900000001,0.99773752999999998,10,13.260180999999999,13.260180999999999,1.03167421,1.03167421]
[null,"YK04","BAROSSA/MID NORTH & YORKE PENINSULA/RIVE","Rural Short",172,14.656140000000001,0.12145,null,0.69843285125037247,3.4584632477767947E-2,4,197.60465099999999,141.26744199999999,3.0465116299999999,2.0581395300000001,1,9.7848839999999999,9.7848839999999999,5.2325579999999997E-2,5.2325579999999997E-2]
[null,"YK05","BAROSSA/MID NORTH & YORKE PENINSULA/RIVE","Rural Long",45,40.658839999999998,9.6030000000000004E-2,null,0.24641121048906431,3.6912772150260556E-4,2,296.68888900000002,244.75555600000001,1.84444444,0.93333332999999996,1,0.44444400000000001,0.44444400000000001,4.4444440000000002E-2,4.4444440000000002E-2]
[null,"YK06","BAROSSA/MID NORTH & YORKE PENINSULA/RIVE","Rural Short",59,46.707459999999998,0.44863999999999998,null,0.39931585163873251,0,2,329.355932,275.25423699999999,1.8983050800000001,0.94915254000000004]
[null,"YK07","BAROSSA/MID NORTH & YORKE PENINSULA/RIVE","Rural Long",642.5,38.140320000000003,1.10361,1.3336791218280355,9.0650016718888367,0.12930544084236273,8,764.44824900000003,764.44824900000003,4.0715953300000001,4.0715953300000001,2,10.90428,10.90428,4.3579769999999997E-2,4.3579769999999997E-2]
[null,"YK08","BAROSSA/MID NORTH & YORKE PENINSULA/RIVE","Rural Long",54,58.00506,null,null,5.6015131738020384E-2,7.8218164186402109E-2,2,56.203704000000002,2.3703699999999999,0.98148148000000002,3.703704E-2,5,78.481481000000002,78.481481000000002,0.72222222000000003,0.72222222000000003]
[null,"YK09","BAROSSA/MID NORTH & YORKE PENINSULA/RIVE","Rural Long",66,4.5369799999999998,null,null,6.8528561496958712E-2,2.8976526137954532E-2,2,56.257576,2.7121209999999998,0.95454545000000002,1.515152E-2,2,23.787879,23.787879,0.15151514999999999,0.15151514999999999]
[null,"YK10","BAROSSA/MID NORTH & YORKE PENINSULA/RIVE","Rural Long",21,21.894479999999998,null,null,0.13753698903187081,0,3,354.85714300000001,354.85714300000001,2.5714285700000001,2.5714285700000001]
[null,"YK11","BAROSSA/MID NORTH & YORKE PENINSULA/RIVE","Rural Long",101.5,27.902159999999999,null,null,0.10387254083083319,0.18557896198543491,2,55.448276,1.5369459999999999,0.95566501999999998,9.8522200000000001E-3,4,99.064038999999994,99.064038999999994,0.34482759000000002,0.34482759000000002]
[null,"YK12","BAROSSA/MID NORTH & YORKE PENINSULA/RIVE","Rural Long",98,83.493070000000003,0.63811000000000007,null,0.81045682533112073,4.147149951081773E-2,5,448.08163300000001,393.98979600000001,3.2551020400000001,2.3061224500000002,2,22.928571000000002,22.928571000000002,0.14285713999999999,0.14285713999999999]
[null,"YK13","BAROSSA/MID NORTH & YORKE PENINSULA/RIVE","Rural Short",3,1.4937100000000001,0.47214999999999996,null,1.6398417538478208E-2,0,3,266,209,3,2]
[null,"YK14","BAROSSA/MID NORTH & YORKE PENINSULA/RIVE","Rural Long",49,39.992870000000003,null,null,0.91181929765573622,1.6979875189119854E-3,6,1008.244898,1008.244898,5.63265306,5.63265306,1,1.877551,1.877551,0.93877551000000004,0.93877551000000004]
[null,"YK15","BAROSSA/MID NORTH & YORKE PENINSULA/RIVE","Rural Long",84,93.406899999999993,null,null,1.9448601390529279,8.5286960053177013E-2,8,1254.4761900000001,1202.9047619999999,4.6190476199999999,3.71428571,5,55.011904999999999,55.011904999999999,1.3809523800000001,1.3809523800000001]
[null,"YK16","BAROSSA/MID NORTH & YORKE PENINSULA/RIVE","Rural Long",91,43.731180000000002,null,null,9.362924655913589E-2,4.1526868669043123E-3,1,55.747253000000001,null,0.97802197999999996,null,2,2.4725269999999999,2.4725269999999999,5.4945050000000002E-2,5.4945050000000002E-2]
[null,"YK17","BAROSSA/MID NORTH & YORKE PENINSULA/RIVE","Rural Long",941,52.589849999999998,5.37188,2.4768326548234945,3.1020017204192958,1.7039858443864029,4,178.60998900000001,123.124336,1.5377258199999999,0.5642933,8,98.113709,98.113709,0.34750266000000002,0.34750266000000002]
[null,"YK18","BAROSSA/MID NORTH & YORKE PENINSULA/RIVE","Rural Long",47,26.27861,null,0.34294605989863763,4.8392644288991586E-2,6.8473192338733323E-3,1,55.787233999999998,null,0.97872340000000002,null,2,7.8936169999999999,7.8936169999999999,4.2553189999999998E-2,4.2553189999999998E-2]
[null,"YK19","BAROSSA/MID NORTH & YORKE PENINSULA/RIVE","Rural Long",55,64.858980000000003,1.0971,null,0.38335759516653095,0.13871819774067917,2,377.65454499999998,324.8,1.85454545,0.92727272999999999,3,136.65454500000001,136.65454500000001,0.67272726999999999,0.67272726999999999]
[null,"YK20","BAROSSA/MID NORTH & YORKE PENINSULA/RIVE","Rural Long",224,33.606029999999997,0.60627999999999993,0.40010373654841069,1.6567374960340693,0.13857054665207813,3,400.73660699999999,400.73660699999999,2.90178571,2.90178571,6,33.517856999999999,33.517856999999999,0.10714286000000001,0.10714286000000001]
[null,"YK21","BAROSSA/MID NORTH & YORKE PENINSULA/RIVE","Rural Long",43,28.472709999999999,null,null,0.7730641871429067,0,6,974.09302300000002,974.09302300000002,5.4418604699999999,5.4418604699999999]
[null,"YK22","BAROSSA/MID NORTH & YORKE PENINSULA/RIVE","Rural Short",85,16.31859,1.5282500000000001,0.15242047106606119,0.2317971802431506,0,2,132.705882,79.058824000000001,1.8823529400000001,0.94117647000000004]
[null,"YK23","BAROSSA/MID NORTH & YORKE PENINSULA/RIVE","Rural Long",539,21.565639999999998,0.83455999999999997,1.200311209645232,0.53968318522288439,0.18707392925752048,1,54.250464000000001,null,0.95176251999999995,null,2,18.805195000000001,18.805195000000001,0.18738404,0.18738404]
[null,"YK24","BAROSSA/MID NORTH & YORKE PENINSULA/RIVE","Rural Long",122.5,65.349599999999995,0.21678999999999998,null,0.29722164135389795,1.2052020107060071E-2,2,131.46122399999999,82.138775999999993,1.07755102,0.21224489999999999,2,5.3306120000000004,5.3306120000000004,0.87346939000000001,0.87346939000000001]
[null,"YK25","BAROSSA/MID NORTH & YORKE PENINSULA/RIVE","Rural Long",317.5,0.63369000000000009,6.5535299999999994,null,0.73509940098636373,0.6362839099401163,3,125.445669,70.151180999999994,1.9401574800000001,0.97007874000000005,2,108.582677,108.582677,1.11181102,1.11181102]
[null,"YK26","BAROSSA/MID NORTH & YORKE PENINSULA/RIVE","Rural Short",6,2.1777199999999999,0.49719999999999998,null,1.4487323765196913E-2,0,2,117.5,70,1.6666666699999999,0.83333332999999998]
[null,"YK27","BAROSSA/MID NORTH & YORKE PENINSULA/RIVE","Rural Long",105.5,12.76052,null,null,2.4338805444995795,0.19395816126354407,6,1249.9715639999999,1249.9715639999999,5.91469194,5.91469194,2,99.611373999999998,99.611373999999998,1.7630331800000001,1.7630331800000001]
[null,"YK28","BAROSSA/MID NORTH & YORKE PENINSULA/RIVE","Rural Long",66.5,55.223269999999999,null,null,6.3120840376945542E-2,1.3030208569041975E-2,1,51.428570999999998,null,0.90225564000000003,null,3,10.616541,10.616541,0.10526315999999999,0.10526315999999999]
[null,"YK29","BAROSSA/MID NORTH & YORKE PENINSULA/RIVE","Rural Long",165,36.299059999999997,8.929999999999999E-2,null,0.91464312472523102,0,2,300.34545500000002,245.418182,1.8181818199999999,0.85454545000000004]
[null,"YK30","BAROSSA/MID NORTH & YORKE PENINSULA/RIVE","Rural Long",128.5,32.786499999999997,0.85153999999999996,null,2.867476422562615,9.9424551786726809E-2,5,1209.0661480000001,1209.0661480000001,4.8560311299999999,4.8560311299999999,3,41.922179,41.922179,0.44357976999999998,0.44357976999999998]
[null,"To enter further feeder ID's - please insert new lines above this line. "]

{"sheet":"3.6.9 Network-reliability","index":8,"n_rows":24,"n_cols":7,"rows_kept":24,"cut":false,"hidden":false,"merged":[]}
[null,{"$f":"(LOOKUP(dms_Model,dms_Model_List,dms_Worksheet_List))","v":"REGULATORY REPORTING STATEMENT"},null,null,null,null,{"$f":"CONCATENATE(\"1-Jan-\",LEFT(CRY,4))","v":"1-Jan-2015"}]
[null,{"$f":"dms_TradingName","v":"SA Power Networks"}]
[null,{"$f":"CONCATENATE(\"Annual Reporting RIN Response \",CRY)","v":"Annual Reporting RIN Response 2015-16"}]
[null,"3.6 QUALITY OF SERVICES"]
[]
[]
[null,"3.6.9 - NETWORK FEEDER RELIABILITY - PLANNED OUTAGES"]
[]
[]
[null,"3.6.9.1 - PLANNED MINUTES OFF SUPPLY (SAIDI)"]
[null,null,{"$f":"CRY","v":"2015-16"}]
[null,{"$f":"INDEX(dms_FeederName_1,MATCH(dms_TradingName,dms_TradingName_List))","v":"CBD"},23.34]
[null,{"$f":"INDEX(dms_FeederName_2,MATCH(dms_TradingName,dms_TradingName_List))","v":"Urban"},79.42]
[null,{"$f":"INDEX(dms_FeederName_3,MATCH(dms_TradingName,dms_TradingName_List))","v":"Short rural"},88.96]
[null,{"$f":"INDEX(dms_FeederName_4,MATCH(dms_TradingName,dms_TradingName_List))","v":"Long rural"},64.41]
[null,{"$f":"IF((INDEX(dms_FeederName_5,MATCH(dms_TradingName,dms_TradingName_List))=0),\"\",(INDEX(dms_FeederName_5,MATCH(dms_TradingName,dms_TradingName_List))))","v":""}]
[]
[null,"3.6.9.2 - PLANNED INTERRUPTIONS TO SUPPLY (SAIFI)"]
[null,null,{"$f":"CRY","v":"2015-16"}]
[null,{"$f":"INDEX(dms_FeederName_1,MATCH(dms_TradingName,dms_TradingName_List))","v":"CBD"},"0.096"]
[null,{"$f":"INDEX(dms_FeederName_2,MATCH(dms_TradingName,dms_TradingName_List))","v":"Urban"},0.41599999999999998]
[null,{"$f":"INDEX(dms_FeederName_3,MATCH(dms_TradingName,dms_TradingName_List))","v":"Short rural"},0.438]
[null,{"$f":"INDEX(dms_FeederName_4,MATCH(dms_TradingName,dms_TradingName_List))","v":"Long rural"},0.48799999999999999]
[null,{"$f":"IF((INDEX(dms_FeederName_5,MATCH(dms_TradingName,dms_TradingName_List))=0),\"\",(INDEX(dms_FeederName_5,MATCH(dms_TradingName,dms_TradingName_List))))","v":""}]

{"sheet":"4.1 Public lighting","index":9,"n_rows":23,"n_cols":4,"rows_kept":23,"cut":false,"hidden":false,"merged":[[9,1,10,1],[5,1,5,2]]}
[null,{"$f":"(LOOKUP(dms_Model,dms_Model_List,dms_Worksheet_List))","v":"REGULATORY REPORTING STATEMENT"}]
[null,{"$f":"dms_TradingName","v":"SA Power Networks"}]
[null,{"$f":"CONCATENATE(\"Annual Reporting RIN Response \",CRY)","v":"Annual Reporting RIN Response 2015-16"}]
[null,"4.1 PUBLIC LIGHTING"]
[]
[null,"Tables 4.1.1 - 4.1.3 deliberately omitted."]
[]
[null,"4.1.4 - PUBLIC LIGHTING METRICS BY TARIFF"]
[]
[null,"Tariff categories","Number of Lights","Public Lighting Revenue"]
[null,"<insert tariff category>","0's","$0's, nominal"]
[]
[]
[]
[]
[]
[]
[]
[]
[]
[]
[null,"To enter further tariff categories - please insert new lines above this line. "]
[null,"Total ",{"$f":"SUM(C12:C21)","v":0},{"$f":"SUM(D12:D21)","v":0}]

{"sheet":"6.2 STPIS Reliability","index":10,"n_rows":98,"n_cols":8,"rows_kept":98,"cut":false,"hidden":false,"merged":[[5,1,5,2],[31,1,31,2],[68,1,73,1],[62,1,67,1],[55,1,55,2],[56,1,61,1],[16,1,21,1],[9,1,9,2],[10,1,15,1],[80,1,85,1],[86,1,91,1],[92,1,97,1],[79,1,79,2],[22,1,27,1],[32,1,37,1],[38,1,43,1],[44,1,49,1]]}
[null,{"$f":"(LOOKUP(dms_Model,dms_Model_List,dms_Worksheet_List))","v":"REGULATORY REPORTING STATEMENT"}]
[null,{"$f":"dms_TradingName","v":"SA Power Networks"}]
[null,{"$f":"CONCATENATE(\"Annual Reporting RIN Response \",CRY)","v":"Annual Reporting RIN Response 2015-16"}]
[null,"6.2 RELIABILITY AND CUSTOMER SERVICE PERFORMANCE"]
[]
[null,"Did the MAIFI parameter of the STPIS apply during the period?\nThis flag is set from the response on worksheet 3.6.8 Network feeders",null,{"$f":"dms_MAIFI_Flag","v":"No"}]
[]
[]
[null,"6.2.1 - UNPLANNED MINUTES OFF SUPPLY (SAIDI)"]
[null,null,null,{"$f":"CRY","v":"2015-16"}]
[null,"Total sustained minutes off supply",{"$f":"INDEX(dms_FeederName_1,MATCH(dms_TradingName,dms_TradingName_List))","v":"CBD"},2.29]
[null,null,{"$f":"INDEX(dms_FeederName_2,MATCH(dms_TradingName,dms_TradingName_List))","v":"Urban"},116.75," "]
[null,null,{"$f":"INDEX(dms_FeederName_3,MATCH(dms_TradingName,dms_TradingName_List))","v":"Short rural"},204.97]
[null,null,{"$f":"INDEX(dms_FeederName_4,MATCH(dms_TradingName,dms_TradingName_List))","v":"Long rural"},390.52]
[null,null,{"$f":"IF((INDEX(dms_FeederName_5,MATCH(dms_TradingName,dms_TradingName_List))=0),\"\",(INDEX(dms_FeederName_5,MATCH(dms_TradingName,dms_TradingName_List))))","v":""},null,"","","",""]
[null,null,"Whole Network",172.6,"","","",""]
[null,"Total of excluded events*\n\n*see 3.3 of STPIS",{"$f":"INDEX(dms_FeederName_1,MATCH(dms_TradingName,dms_TradingName_List))","v":"CBD"},0]
[null,null,{"$f":"INDEX(dms_FeederName_2,MATCH(dms_TradingName,dms_TradingName_List))","v":"Urban"},18.899999999999999]
[null,null,{"$f":"INDEX(dms_FeederName_3,MATCH(dms_TradingName,dms_TradingName_List))","v":"Short rural"},30.14]
[null,null,{"$f":"INDEX(dms_FeederName_4,MATCH(dms_TradingName,dms_TradingName_List))","v":"Long rural"},101.13]
[null,null,{"$f":"IF((INDEX(dms_FeederName_5,MATCH(dms_TradingName,dms_TradingName_List))=0),\"\",(INDEX(dms_FeederName_5,MATCH(dms_TradingName,dms_TradingName_List))))","v":""},null,null,"","",""]
[null,null,"Whole Network",33.630000000000003,null,"","",""]
[null,"Total sustained minutes off supply after removing excluded events",{"$f":"INDEX(dms_FeederName_1,MATCH(dms_TradingName,dms_TradingName_List))","v":"CBD"},2.29]
[null,null,{"$f":"INDEX(dms_FeederName_2,MATCH(dms_TradingName,dms_TradingName_List))","v":"Urban"},97.86]
[null,null,{"$f":"INDEX(dms_FeederName_3,MATCH(dms_TradingName,dms_TradingName_List))","v":"Short rural"},174.83]
[null,null,{"$f":"INDEX(dms_FeederName_4,MATCH(dms_TradingName,dms_TradingName_List))","v":"Long rural"},289.39]
[null,null,{"$f":"IF((INDEX(dms_FeederName_5,MATCH(dms_TradingName,dms_TradingName_List))=0),\"\",(INDEX(dms_FeederName_5,MATCH(dms_TradingName,dms_TradingName_List))))","v":""},null,"","","",""]
[null,null,"Whole Network",138.97,"","","",""]
[]
[]
[null,"6.2.2 - UNPLANNED INTERRUPTIONS TO SUPPLY (SAIFI)"]
[null,null,null,{"$f":"CRY","v":"2015-16"}]
[null,"Total sustained interruptions",{"$f":"INDEX(dms_FeederName_1,MATCH(dms_TradingName,dms_TradingName_List))","v":"CBD"},2.4E-2]
[null,null,{"$f":"INDEX(dms_FeederName_2,MATCH(dms_TradingName,dms_TradingName_List))","v":"Urban"},1.2669999999999999]
[null,null,{"$f":"INDEX(dms_FeederName_3,MATCH(dms_TradingName,dms_TradingName_List))","v":"Short rural"},1.655]
[null,null,{"$f":"INDEX(dms_FeederName_4,MATCH(dms_TradingName,dms_TradingName_List))","v":"Long rural"},1.899]
[null,null,{"$f":"IF((INDEX(dms_FeederName_5,MATCH(dms_TradingName,dms_TradingName_List))=0),\"\",(INDEX(dms_FeederName_5,MATCH(dms_TradingName,dms_TradingName_List))))","v":""},null,"","","",""]
[null,null,"Whole Network",1.4159999999999999,"","","",""]
[null,"Total of excluded events*\n\n*see 3.3 of STPIS",{"$f":"INDEX(dms_FeederName_1,MATCH(dms_TradingName,dms_TradingName_List))","v":"CBD"},0]
[null,null,{"$f":"INDEX(dms_FeederName_2,MATCH(dms_TradingName,dms_TradingName_List))","v":"Urban"},0.22900000000000001]
[null,null,{"$f":"INDEX(dms_FeederName_3,MATCH(dms_TradingName,dms_TradingName_List))","v":"Short rural"},0.17299999999999999]
[null,null,{"$f":"INDEX(dms_FeederName_4,MATCH(dms_TradingName,dms_TradingName_List))","v":"Long rural"},0.19900000000000001]
[null,null,{"$f":"IF((INDEX(dms_FeederName_5,MATCH(dms_TradingName,dms_TradingName_List))=0),\"\",(INDEX(dms_FeederName_5,MATCH(dms_TradingName,dms_TradingName_List))))","v":""},null,"",null,"",""]
[null,null,"Whole Network",0.215,"",null,"",""]
[null,"Total sustained interruptions after removing excluded events",{"$f":"INDEX(dms_FeederName_1,MATCH(dms_TradingName,dms_TradingName_List))","v":"CBD"},"0.024"]
[null,null,{"$f":"INDEX(dms_FeederName_2,MATCH(dms_TradingName,dms_TradingName_List))","v":"Urban"},1.038]
[null,null,{"$f":"INDEX(dms_FeederName_3,MATCH(dms_TradingName,dms_TradingName_List))","v":"Short rural"},1.482]
[null,null,{"$f":"INDEX(dms_FeederName_4,MATCH(dms_TradingName,dms_TradingName_List))","v":"Long rural"},1.7]
[null,null,{"$f":"IF((INDEX(dms_FeederName_5,MATCH(dms_TradingName,dms_TradingName_List))=0),\"\",(INDEX(dms_FeederName_5,MATCH(dms_TradingName,dms_TradingName_List))))","v":""},null,"","","",""]
[null,null,"Whole Network",1.2010000000000001,"","","",""]
[]
[]
[]
[]
[null,"6.2.3 - UNPLANNED MOMENTARY INTERRUPTIONS TO SUPPLY (MAIFI)"]
[null,null,null,{"$f":"CRY","v":"2015-16"}]
[null,"Total momentary interruptions",{"$f":"INDEX(dms_FeederName_1,MATCH(dms_TradingName,dms_TradingName_List))","v":"CBD"}]
[null,null,{"$f":"INDEX(dms_FeederName_2,MATCH(dms_TradingName,dms_TradingName_List))","v":"Urban"}]
[null,null,{"$f":"INDEX(dms_FeederName_3,MATCH(dms_TradingName,dms_TradingName_List))","v":"Short rural"}]
[null,null,{"$f":"INDEX(dms_FeederName_4,MATCH(dms_TradingName,dms_TradingName_List))","v":"Long rural"}]
[null,null,{"$f":"IF((INDEX(dms_FeederName_5,MATCH(dms_TradingName,dms_TradingName_List))=0),\"\",(INDEX(dms_FeederName_5,MATCH(dms_TradingName,dms_TradingName_List))))","v":""}]
[null,null,"Whole Network"]
[null,"Total of excluded events*\n\n*see 3.3 of STPIS",{"$f":"INDEX(dms_FeederName_1,MATCH(dms_TradingName,dms_TradingName_List))","v":"CBD"}]
[null,null,{"$f":"INDEX(dms_FeederName_2,MATCH(dms_TradingName,dms_TradingName_List))","v":"Urban"}]
[null,null,{"$f":"INDEX(dms_FeederName_3,MATCH(dms_TradingName,dms_TradingName_List))","v":"Short rural"}]
[null,null,{"$f":"INDEX(dms_FeederName_4,MATCH(dms_TradingName,dms_TradingName_List))","v":"Long rural"}]
[null,null,{"$f":"IF((INDEX(dms_FeederName_5,MATCH(dms_TradingName,dms_TradingName_List))=0),\"\",(INDEX(dms_FeederName_5,MATCH(dms_TradingName,dms_TradingName_List))))","v":""}]
[null,null,"Whole Network"]
[null,"Total momentary interruptions after removing excluded events",{"$f":"INDEX(dms_FeederName_1,MATCH(dms_TradingName,dms_TradingName_List))","v":"CBD"}]
[null,null,{"$f":"INDEX(dms_FeederName_2,MATCH(dms_TradingName,dms_TradingName_List))","v":"Urban"}]
[null,null,{"$f":"INDEX(dms_FeederName_3,MATCH(dms_TradingName,dms_TradingName_List))","v":"Short rural"}]
[null,null,{"$f":"INDEX(dms_FeederName_4,MATCH(dms_TradingName,dms_TradingName_List))","v":"Long rural"}]
[null,null,{"$f":"IF((INDEX(dms_FeederName_5,MATCH(dms_TradingName,dms_TradingName_List))=0),\"\",(INDEX(dms_FeederName_5,MATCH(dms_TradingName,dms_TradingName_List))))","v":""}]
[null,null,"Whole Network"]
[]
[]
[]
[]
[null,"6.2.4 - DISTRIBUTION CUSTOMER NUMBERS"]
[null,null,null,{"$f":"CRY","v":"2015-16"}]
[null,"Customer numbers at the start of the period",{"$f":"INDEX(dms_FeederName_1,MATCH(dms_TradingName,dms_TradingName_List))","v":"CBD"},5106]
[null,null,{"$f":"INDEX(dms_FeederName_2,MATCH(dms_TradingName,dms_TradingName_List))","v":"Urban"},592372]
[null,null,{"$f":"INDEX(dms_FeederName_3,MATCH(dms_TradingName,dms_TradingName_List))","v":"Short rural"},119950]
[null,null,{"$f":"INDEX(dms_FeederName_4,MATCH(dms_TradingName,dms_TradingName_List))","v":"Long rural"},137680]
[null,null,{"$f":"IF((INDEX(dms_FeederName_5,MATCH(dms_TradingName,dms_TradingName_List))=0),\"\",(INDEX(dms_FeederName_5,MATCH(dms_TradingName,dms_TradingName_List))))","v":""}]
[null,null,"Whole Network",855108]
[null,"Customer numbers at the end of the period",{"$f":"INDEX(dms_FeederName_1,MATCH(dms_TradingName,dms_TradingName_List))","v":"CBD"},5083]
[null,null,{"$f":"INDEX(dms_FeederName_2,MATCH(dms_TradingName,dms_TradingName_List))","v":"Urban"},597100]
[null,null,{"$f":"INDEX(dms_FeederName_3,MATCH(dms_TradingName,dms_TradingName_List))","v":"Short rural"},120600]
[null,null,{"$f":"INDEX(dms_FeederName_4,MATCH(dms_TradingName,dms_TradingName_List))","v":"Long rural"},139402]
[null,null,{"$f":"IF((INDEX(dms_FeederName_5,MATCH(dms_TradingName,dms_TradingName_List))=0),\"\",(INDEX(dms_FeederName_5,MATCH(dms_TradingName,dms_TradingName_List))))","v":""}]
[null,null,"Whole Network",862185]
[null,"Average customer numbers",{"$f":"INDEX(dms_FeederName_1,MATCH(dms_TradingName,dms_TradingName_List))","v":"CBD"},{"$f":"ROUND(SUM(D81+D87)/2,0)","v":5095}]
[null,null,{"$f":"INDEX(dms_FeederName_2,MATCH(dms_TradingName,dms_TradingName_List))","v":"Urban"},{"$f":"ROUND(SUM(D82+D88)/2,0)","v":594736}]
[null,null,{"$f":"INDEX(dms_FeederName_3,MATCH(dms_TradingName,dms_TradingName_List))","v":"Short rural"},{"$f":"ROUND(SUM(D83+D89)/2,0)","v":120275}]
[null,null,{"$f":"INDEX(dms_FeederName_4,MATCH(dms_TradingName,dms_TradingName_List))","v":"Long rural"},{"$f":"ROUND(SUM(D84+D90)/2,0)","v":138541}]
[null,null,{"$f":"IF((INDEX(dms_FeederName_5,MATCH(dms_TradingName,dms_TradingName_List))=0),\"\",(INDEX(dms_FeederName_5,MATCH(dms_TradingName,dms_TradingName_List))))","v":""},{"$f":"ROUND(SUM(D85+D91)/2,0)","v":0}]
[null,null,"Whole Network",858647]

{"sheet":"6.6 STPIS Customer Service","index":11,"n_rows":13,"n_cols":4,"rows_kept":13,"cut":false,"hidden":false,"merged":[[8,1,9,1]]}
[null,{"$f":"(LOOKUP(dms_Model,dms_Model_List,dms_Worksheet_List))","v":"REGULATORY REPORTING STATEMENT"}]
[null,{"$f":"dms_TradingName","v":"SA Power Networks"}]
[null,{"$f":"CONCATENATE(\"Annual Reporting RIN Response \",CRY)","v":"Annual Reporting RIN Response 2015-16"}]
[null,"6.6 STPIS CUSTOMER SERVICE"]
[]
[]
[null,"6.6.1 - TELEPHONE ANSWERING"]
[]
[null,null,"Number of calls \nafter removing excluded events","Total number of calls"]
[null,null,{"$f":"CRY","v":"2015-16"},{"$f":"CRY","v":"2015-16"}]
[null,"Number of calls received",108172,263752]
[null,"Number of calls answered within 30 seconds",80704]
[null,"Percentage of calls answered within 30 seconds",{"$f":"C12/C11","v":0.74607107199645006}]

{"sheet":"6.7 STPIS Daily Performance","index":12,"n_rows":381,"n_cols":16,"rows_kept":381,"cut":false,"hidden":false,"merged":[[13,14,13,15],[13,3,14,3],[6,1,6,5],[8,1,8,6],[13,4,13,5],[13,6,13,7],[13,10,13,11],[13,8,13,9],[13,12,13,13],[12,1,14,1],[12,2,12,3],[13,2,14,2],[12,4,12,13]]}
[null,{"$f":"(LOOKUP(dms_Model,dms_Model_List,dms_Worksheet_List))","v":"REGULATORY REPORTING STATEMENT"},null,null,null,null,null,null,{"$f":"CONCATENATE(IF(LEN(CRY)=4,\"1-Jan-\",\"1-Jul-\"),LEFT(CRY,4))","v":"1-Jul-2015"}]
[null,{"$f":"dms_TradingName","v":"SA Power Networks"}]
[null,{"$f":"CONCATENATE(\"Annual Reporting RIN Response \",CRY)","v":"Annual Reporting RIN Response 2015-16"}]
[null,"6.7 STPIS DAILY PERFORMANCE"]
[]
[]
[null,"Did the MAIFI parameter of the STPIS apply during the period?\nThis flag is set from the response on worksheet 3.6.8 Network feeders",null,null,null,null,{"$f":"dms_MAIFI_Flag","v":"No"}]
[]
[null,"The excluded events to be removed from the data refer only to events listed in clause 3.3(a) of the STPIS, with respect to reliability data, and in clause 5.4 of the STPIS with respect to customer service parameters.\n\n*Customer service information must be reported as per the definitions in the STPIS, that is excluding: \n   • calls to payment lines and automated interactive services \n   • calls abandoned by the customer within 30 seconds of the call being queued for response by a human operator (where the time in which a telephone call is abandoned is not measured, then an estimate of the number of calls abandoned within 30 seconds will be determined by taking 20 per cent of all calls abandoned)."]
[]
[null,"6.7.1 - DAILY PERFORMANCE DATA - UNPLANNED"]
[]
[null,"Date","Customer service*",null,"MAIFI"]
[null,null,"Number of calls received\n(after removing excluded events)","Number of calls answered in 30 seconds\n(after removing excluded events)",{"$f":"INDEX(dms_FeederName_1,MATCH(dms_TradingName,dms_TradingName_List))","v":"CBD"},null,{"$f":"INDEX(dms_FeederName_2,MATCH(dms_TradingName,dms_TradingName_List))","v":"Urban"},null,{"$f":"INDEX(dms_FeederName_3,MATCH(dms_TradingName,dms_TradingName_List))","v":"Short rural"},null,{"$f":"INDEX(dms_FeederName_4,MATCH(dms_TradingName,dms_TradingName_List))","v":"Long rural"},null,{"$f":"IF((INDEX(dms_FeederName_5,MATCH(dms_TradingName,dms_TradingName_List))=0),\"Network\",(INDEX(dms_FeederName_5,MATCH(dms_TradingName,dms_TradingName_List))))","v":"Network"},null,"Network"]
[null,null,null,null,"All events","After removing excluded events","All events","After removing excluded events","All events","After removing excluded events","All events","After removing excluded events","All events","After removing excluded events","All events","After removing excluded events"]
[null,{"$f":"CONCATENATE(IF(LEN(CRY)=4,\"1-Jan-\",\"1-Jul-\"),LEFT(CRY,4))","v":"1-Jul-2015"},275,233]
[null,{"$f":"B16+1","v":"2015-07-02"},290,233]
[null,"2015-07-03",229,210]
[null,"2015-07-04",176,144]
[null,"2015-07-05",210,193]
[null,"2015-07-06",412,331]
[null,"2015-07-07",350,321]
[null,"2015-07-08",267,240]
[null,"2015-07-09",293,247]
[null,"2015-07-10",240,219]
[null,"2015-07-11",557,441]
[null,"2015-07-12",439,314]
[null,"2015-07-13",335,247]
[null,"2015-07-14",431,250]
[null,"2015-07-15",455,337]
[null,"2015-07-16",394,309]
[null,"2015-07-17",356,271]
[null,"2015-07-18",203,179]
[null,"2015-07-19",109,106]
[null,"2015-07-20",616,408]
[null,"2015-07-21",332,287]
[null,"2015-07-22",365,226]
[null,"2015-07-23",272,242]
[null,"2015-07-24",472,327]
[null,"2015-07-25",446,338]
[null,"2015-07-26",245,214]
[null,"2015-07-27",404,332]
[null,"2015-07-28",354,323]
[null,"2015-07-29",304,268]
[null,"2015-07-30",335,283]
[null,"2015-07-31",426,295]
[null,"2015-08-01",284,265]
[null,"2015-08-02",223,197]
[null,"2015-08-03",344,261]
[null,"2015-08-04",424,361]
[null,"2015-08-05",301,273]
[null,"2015-08-06",291,247]
[null,"2015-08-07",306,249]
[null,"2015-08-08",173,165]
[null,"2015-08-09",145,140]
[null,"2015-08-10",305,260]
[null,"2015-08-11",525,416]
[null,"2015-08-12",543,378]
[null,"2015-08-13",330,279]
[null,"2015-08-14",263,191]
[null,"2015-08-15",217,176]
[null,"2015-08-16",126,113]
[null,"2015-08-17",383,280]
[null,"2015-08-18",269,244]
[null,"2015-08-19",265,146]
[null,"2015-08-20",352,298]
[null,"2015-08-21",270,229]
[null,"2015-08-22",204,172]
[null,"2015-08-23",215,203]
[null,"2015-08-24",323,228]
[null,"2015-08-25",308,225]
[null,"2015-08-26",322,283]
[null,"2015-08-27",253,191]
[null,"2015-08-28",269,164]
[null,"2015-08-29",197,176]
[null,"2015-08-30",136,125]
[null,"2015-08-31",289,256]
[null,"2015-09-01",185,173]
[null,"2015-09-02",311,273]
[null,"2015-09-03",293,278]
[null,{"$f":"B80+1","v":"2015-09-04"},254,175]
[null,"2015-09-05",183,156]
[null,"2015-09-06",281,243]
[null,"2015-09-07",354,300]
[null,"2015-09-08",366,251]
[null,"2015-09-09",204,109]
[null,"2015-09-10",415,229]
[null,"2015-09-11",229,159]
[null,"2015-09-12",173,167]
[null,"2015-09-13",146,139]
[null,"2015-09-14",326,167]
[null,"2015-09-15",204,119]
[null,"2015-09-16",326,231]
[null,"2015-09-17",228,143]
[null,"2015-09-18",233,110]
[null,"2015-09-19",142,132]
[null,"2015-09-20",106,98]
[null,"2015-09-21",225,113]
[null,"2015-09-22",207,113]
[null,"2015-09-23",267,209]
[null,"2015-09-24",175,155]
[null,"2015-09-25",213,157]
[null,"2015-09-26",125,114]
[null,"2015-09-27",128,96]
[null,"2015-09-28",228,163]
[null,"2015-09-29",255,196]
[null,"2015-09-30",255,201]
[null,"2015-10-01",213,176]
[null,"2015-10-02",284,267]
[null,"2015-10-03",240,175]
[null,"2015-10-04",79,77]
[null,"2015-10-05",262,159]
[null,"2015-10-06",309,174]
[null,"2015-10-07",202,146]
[null,"2015-10-08",246,189]
[null,"2015-10-09",272,122]
[null,"2015-10-10",311,236]
[null,"2015-10-11",90,83]
[null,"2015-10-12",262,206]
[null,"2015-10-13",299,282]
[null,"2015-10-14",223,206]
[null,"2015-10-15",278,187]
[null,"2015-10-16",291,234]
[null,"2015-10-17",146,114]
[null,"2015-10-18",67,66]
[null,"2015-10-19",235,190]
[null,"2015-10-20",432,306]
[null,"2015-10-21",315,250]
[null,"2015-10-22",222,142]
[null,"2015-10-23",193,151]
[null,"2015-10-24",107,94]
[null,"2015-10-25",116,99]
[null,"2015-10-26",328,256]
[null,"2015-10-27",288,239]
[null,"2015-10-28",228,194]
[null,"2015-10-29",319,270]
[null,"2015-10-30",259,143]
[null,"2015-10-31",195,66]
[null,"2015-11-01",2006,192]
[null,"2015-11-02",547,239]
[null,"2015-11-03",448,345]
[null,"2015-11-04",715,373]
[null,"2015-11-05",389,184]
[null,"2015-11-06",272,173]
[null,{"$f":"B144+1","v":"2015-11-07"},183,142]
[null,"2015-11-08",145,122]
[null,"2015-11-09",345,178]
[null,"2015-11-10",292,177]
[null,"2015-11-11",278,187]
[null,"2015-11-12",381,268]
[null,"2015-11-13",249,137]
[null,"2015-11-14",131,103]
[null,"2015-11-15",108,92]
[null,"2015-11-16",254,149]
[null,"2015-11-17",331,261]
[null,"2015-11-18",297,211]
[null,"2015-11-19",263,214]
[null,"2015-11-20",220,168]
[null,"2015-11-21",175,131]
[null,"2015-11-22",54,49]
[null,"2015-11-23",203,163]
[null,"2015-11-24",270,214]
[null,"2015-11-25",791,529]
[null,"2015-11-26",540,319]
[null,"2015-11-27",336,262]
[null,"2015-11-28",143,118]
[null,"2015-11-29",113,108]
[null,"2015-11-30",430,258]
[null,"2015-12-01",328,212]
[null,"2015-12-02",333,223]
[null,"2015-12-03",367,296]
[null,"2015-12-04",363,261]
[null,"2015-12-05",294,204]
[null,"2015-12-06",468,290]
[null,"2015-12-07",893,631]
[null,"2015-12-08",1241,508]
[null,"2015-12-09",452,381]
[null,"2015-12-10",309,279]
[null,"2015-12-11",252,167]
[null,"2015-12-12",154,139]
[null,"2015-12-13",128,113]
[null,"2015-12-14",255,220]
[null,"2015-12-15",675,364]
[null,"2015-12-16",555,428]
[null,"2015-12-17",916,438]
[null,"2015-12-18",725,428]
[null,"2015-12-19",876,309]
[null,"2015-12-20",275,212]
[null,"2015-12-21",222,157]
[null,"2015-12-22",293,208]
[null,"2015-12-23",209,185]
[null,"2015-12-24",276,222]
[null,"2015-12-25",222,170]
[null,"2015-12-26",236,121]
[null,"2015-12-27",103,74]
[null,"2015-12-28",188,174]
[null,"2015-12-29",215,174]
[null,"2015-12-30",391,287]
[null,"2015-12-31",194,173]
[null,"2016-01-01",140,137]
[null,"2016-01-02",130,130]
[null,"2016-01-03",272,117]
[null,"2016-01-04",293,232]
[null,"2016-01-05",261,207]
[null,"2016-01-06",314,215]
[null,"2016-01-07",350,321]
[null,"2016-01-08",333,257]
[null,"2016-01-09",120,118]
[null,{"$f":"B208+1","v":"2016-01-10"},189,147]
[null,"2016-01-11",313,269]
[null,"2016-01-12",594,425]
[null,"2016-01-13",333,180]
[null,"2016-01-14",477,247]
[null,"2016-01-15",217,188]
[null,"2016-01-16",208,168]
[null,"2016-01-17",182,158]
[null,"2016-01-18",334,242]
[null,"2016-01-19",312,240]
[null,"2016-01-20",318,235]
[null,"2016-01-21",312,223]
[null,"2016-01-22",1678,530]
[null,"2016-01-23",315,234]
[null,"2016-01-24",162,143]
[null,"2016-01-25",252,244]
[null,"2016-01-26",111,106]
[null,"2016-01-27",316,164]
[null,"2016-01-28",374,261]
[null,"2016-01-29",849,354]
[null,"2016-01-30",524,350]
[null,"2016-01-31",164,131]
[null,"2016-02-01",335,284]
[null,"2016-02-02",617,497]
[null,"2016-02-03",347,311]
[null,"2016-02-04",271,253]
[null,"2016-02-05",246,228]
[null,"2016-02-06",190,175]
[null,"2016-02-07",138,111]
[null,"2016-02-08",392,353]
[null,"2016-02-09",299,285]
[null,"2016-02-10",313,281]
[null,"2016-02-11",296,271]
[null,"2016-02-12",289,265]
[null,"2016-02-13",189,169]
[null,"2016-02-14",137,109]
[null,"2016-02-15",262,241]
[null,"2016-02-16",244,227]
[null,"2016-02-17",254,244]
[null,"2016-02-18",411,350]
[null,"2016-02-19",414,306]
[null,"2016-02-20",100,93]
[null,"2016-02-21",105,101]
[null,"2016-02-22",428,390]
[null,"2016-02-23",296,268]
[null,"2016-02-24",224,214]
[null,"2016-02-25",238,219]
[null,"2016-02-26",220,196]
[null,"2016-02-27",193,175]
[null,"2016-02-28",164,150]
[null,"2016-02-29",258,208]
[null,"2016-03-01",229,207]
[null,"2016-03-02",417,296]
[null,"2016-03-03",270,248]
[null,"2016-03-04",238,183]
[null,"2016-03-05",242,196]
[null,"2016-03-06",974,636]
[null,"2016-03-07",396,298]
[null,"2016-03-08",484,301]
[null,"2016-03-09",284,215]
[null,"2016-03-10",563,326]
[null,"2016-03-11",370,255]
[null,"2016-03-12",270,206]
[null,"2016-03-13",270,219]
[null,{"$f":"B272+1","v":"2016-03-14"},116,113]
[null,"2016-03-15",291,231]
[null,"2016-03-16",228,218]
[null,"2016-03-17",439,372]
[null,"2016-03-18",463,281]
[null,"2016-03-19",140,118]
[null,"2016-03-20",122,98]
[null,"2016-03-21",256,210]
[null,"2016-03-22",264,206]
[null,"2016-03-23",259,184]
[null,"2016-03-24",301,222]
[null,"2016-03-25",135,111]
[null,"2016-03-26",79,76]
[null,"2016-03-27",112,108]
[null,"2016-03-28",80,73]
[null,"2016-03-29",229,216]
[null,"2016-03-30",189,166]
[null,"2016-03-31",250,176]
[null,"2016-04-01",206,153]
[null,"2016-04-02",172,156]
[null,"2016-04-03",94,89]
[null,"2016-04-04",215,153]
[null,"2016-04-05",249,204]
[null,"2016-04-06",248,206]
[null,"2016-04-07",227,201]
[null,"2016-04-08",243,216]
[null,"2016-04-09",134,119]
[null,"2016-04-10",86,81]
[null,"2016-04-11",247,212]
[null,"2016-04-12",291,246]
[null,"2016-04-13",179,168]
[null,"2016-04-14",214,183]
[null,"2016-04-15",179,159]
[null,"2016-04-16",111,105]
[null,"2016-04-17",77,77]
[null,"2016-04-18",193,140]
[null,"2016-04-19",195,136]
[null,"2016-04-20",246,175]
[null,"2016-04-21",367,299]
[null,"2016-04-22",231,212]
[null,"2016-04-23",133,107]
[null,"2016-04-24",65,55]
[null,"2016-04-25",63,62]
[null,"2016-04-26",212,191]
[null,"2016-04-27",252,239]
[null,"2016-04-28",264,223]
[null,"2016-04-29",260,216]
[null,"2016-04-30",455,366]
[null,"2016-05-01",271,156]
[null,"2016-05-02",318,260]
[null,"2016-05-03",512,391]
[null,"2016-05-04",247,218]
[null,"2016-05-05",245,213]
[null,"2016-05-06",201,180]
[null,"2016-05-07",147,140]
[null,"2016-05-08",197,179]
[null,"2016-05-09",2515,823]
[null,"2016-05-10",739,457]
[null,"2016-05-11",313,262]
[null,"2016-05-12",317,272]
[null,"2016-05-13",251,228]
[null,"2016-05-14",202,182]
[null,"2016-05-15",79,76]
[null,"2016-05-16",257,206]
[null,{"$f":"B336+1","v":"2016-05-17"},227,181]
[null,"2016-05-18",288,262]
[null,"2016-05-19",259,236]
[null,"2016-05-20",220,206]
[null,"2016-05-21",137,129]
[null,"2016-05-22",147,123]
[null,"2016-05-23",359,280]
[null,"2016-05-24",224,206]
[null,"2016-05-25",330,270]
[null,"2016-05-26",369,262]
[null,"2016-05-27",346,302]
[null,"2016-05-28",258,231]
[null,"2016-05-29",175,150]
[null,"2016-05-30",273,230]
[null,"2016-05-31",329,287]
[null,"2016-06-01",227,203]
[null,"2016-06-02",258,208]
[null,"2016-06-03",293,264]
[null,"2016-06-04",192,169]
[null,"2016-06-05",205,193]
[null,"2016-06-06",301,259]
[null,"2016-06-07",225,191]
[null,"2016-06-08",312,255]
[null,"2016-06-09",427,385]
[null,"2016-06-10",290,273]
[null,"2016-06-11",183,173]
[null,"2016-06-12",107,98]
[null,"2016-06-13",155,148]
[null,"2016-06-14",462,345]
[null,"2016-06-15",347,305]
[null,"2016-06-16",387,356]
[null,"2016-06-17",262,234]
[null,"2016-06-18",183,160]
[null,"2016-06-19",83,71]
[null,"2016-06-20",279,208]
[null,"2016-06-21",489,418]
[null,"2016-06-22",240,232]
[null,"2016-06-23",405,333]
[null,"2016-06-24",775,501]
[null,"2016-06-25",312,239]
[null,"2016-06-26",153,132]
[null,"2016-06-27",506,372]
[null,"2016-06-28",324,306]
[null,"2016-06-29",351,329]
[null,"2016-06-30",405,367]

{"sheet":"6.8 STPIS Exclusions","index":13,"n_rows":44,"n_cols":15,"rows_kept":44,"cut":false,"hidden":false,"merged":[[10,11,11,11],[6,1,6,4],[10,6,10,8],[10,5,11,5],[10,4,11,4],[10,2,11,2],[10,3,11,3]]}
[null,{"$f":"(LOOKUP(dms_Model,dms_Model_List,dms_Worksheet_List))","v":"REGULATORY REPORTING STATEMENT"}]
[null,{"$f":"dms_TradingName","v":"SA Power Networks"}]
[null,{"$f":"CONCATENATE(\"Annual Reporting RIN Response \",CRY)","v":"Annual Reporting RIN Response 2015-16"}]
[null,"6.8 STPIS EXCLUSIONS"]
[]
[]
[null,{"$f":"CONCATENATE(\"This information is collected to inform the application of the STPIS to \",dms_TradingName,\" in future regulatory periods. The information is also collected to monitor network performance, and may be used in performance reports.\")","v":"This information is collected to inform the application of the STPIS to SA Power Networks in future regulatory periods. The information is also collected to monitor network performance, and may be used in performance reports."}]
[]
[null,"6.8.1 - STPIS EXCLUSIONS"]
[]
[null,"Date of event","Outage ID","Feeder ID / name","Feeder classification\n(drop down)","Cause of event\n(drop down)","Unplanned",null,null,"Event category","Effect on unplanned MAIFI","Please provide separate explanation to confirm the outage was not due to inadequate transmission connection planning "]
[null,"DD/MM/YYYY",null,null,null,null,"Number of  interruptions","Duration of interruption\n(mins)","Total unplanned minutes off supply","Use exclusion categories listed in section 3.3(a) of the STPIS\n(drop down)","by feeder classification",null,null,null,"Cause of Event"]
[null,"INSUFFICIENT ROWS AVAILABLE AND UNABLE TO INSERT ROWS IN LOCKED VERSION - REFER 6.8 STPIS EXCLUSIONS UNLOCKED TAB",null,null,null,null,null,null,null,null,null,null,null,null,"Weather"]
[null,null,null,null,null,null,null,null,null,null,null,null,null,null,"Equipment failure"]
[null,null,null,null,null,null,null,null,null,null,null,null,null,null,"Operational error"]
[null,null,null,null,null,null,null,null,null,null,null,null,null,null,"Vegetation"]
[null,null,null,null,null,null,null,null,null,null,null,null,null,null,"Animals"]
[null,null,null,null,null,null,null,null,null,null,null,null,null,null,"Third party impacts"]
[null,null,null,null,null,null,null,null,null,null,null,null,null,null,"Transmission failure"]
[null,null,null,null,null,null,null,null,null,null,null,null,null,null,"Load shedding"]
[null,null,null,null,null,null,null,null,null,null,null,null,null,null,"Inter-distributor connection failure"]
[null,null,null,null,null,null,null,null,null,null,null,null,null,null,"Other"]
[]
[]
[]
[]
[]
[]
[]
[]
[]
[]
[]
[]
[]
[]
[]
[]
[]
[]
[]
[]
[]
[null,"To enter further events - please insert new lines above this line. "]

{"sheet":"6.8 STPIS Exclusions Unlocked","index":14,"n_rows":53,"n_cols":15,"rows_kept":53,"cut":false,"hidden":false,"merged":[[10,11,11,11],[6,1,6,4],[10,2,11,2],[10,3,11,3],[10,4,11,4],[10,5,11,5],[10,6,10,8]]}
[null,{"$f":"(LOOKUP(dms_Model,dms_Model_List,dms_Worksheet_List))","v":"REGULATORY REPORTING STATEMENT"}]
[null,{"$f":"dms_TradingName","v":"SA Power Networks"}]
[null,{"$f":"CONCATENATE(\"Annual Reporting RIN Response \",CRY)","v":"Annual Reporting RIN Response 2015-16"}]
[null,"6.8 STPIS EXCLUSIONS"]
[]
[]
[null,{"$f":"CONCATENATE(\"This information is collected to inform the application of the STPIS to \",dms_TradingName,\" in future regulatory periods. The information is also collected to monitor network performance, and may be used in performance reports.\")","v":"This information is collected to inform the application of the STPIS to SA Power Networks in future regulatory periods. The information is also collected to monitor network performance, and may be used in performance reports."}]
[]
[null,"6.8.1 - STPIS EXCLUSIONS"]
[]
[null,"Date of event","Outage ID","Feeder ID / name","Feeder classification\n(drop down)","Cause of event\n(drop down)","Unplanned",null,null,"Event category","Effect on unplanned MAIFI","Please provide separate explanation to confirm the outage was not due to inadequate transmission connection planning "]
[null,"DD/MM/YYYY",null,null,null,null,"Number of  interruptions","Duration of interruption\n(mins)","Total unplanned minutes off supply","Use exclusion categories listed in section 3.3(a) of the STPIS\n(drop down)","by feeder classification",null,null,null,"Cause of Event"]
[null,"11/07/2015","2437051107155","BU11","Rural Short","Transmission failure",2,373,6.2024999999999997E-2,5,"N/A",null,null,null,"Weather"]
[null,"20/08/2015","3223012008157","R18","Rural Long","Other",1,180,0.132524,7,"N/A",null,null,null,"Equipment failure"]
[null,"1/11/2015","1005020211151","Multiple substations","Rural Long","Load shedding",1,158,2.0204270000000002,3,"N/A",null,null,null,"Operational error"]
[null,"1/11/2015","1005020211151","Multiple substations","Rural Short","Load shedding",1,158,4.8607860000000001,3,"N/A",null,null,null,"Vegetation"]
[null,"1/11/2015","1005020211151","Multiple substations","Urban","Load shedding",1,158,12.320403000000001,3,"N/A",null,null,null,"Animals"]
[null,"4/11/2015","3629230411151","BU11","Rural Short","Transmission failure",2,186,3.3174000000000002E-2,5,"N/A",null,null,null,"Third party impacts"]
[null,"25/11/2015","0348122611152","SD372","Rural Long","Transmission failure",1,1650,9.8225440000000006,5,"N/A",null,null,null,"Transmission failure"]
[null,"25/11/2015","0510102611155","NU13","Rural Long","Transmission failure",1,1329,4.4765379999999997,5,"N/A",null,null,null,"Load shedding"]
[null,"25/11/2015","1628132611155","NU26","Rural Long","Transmission failure",1,1340,0.64803900000000003,5,"N/A",null,null,null,"Inter-distributor connection failure"]
[null,"25/11/2015","1801142511154","SD374","Rural Long","Other",1,1274,17.242187999999999,7,"N/A",null,null,null,"Other"]
[null,"25/11/2015","1956162611156","GA20","Rural Long","Transmission failure",1,12891,0.75683699999999998,5,"N/A"]
[null,"25/11/2015","2629162511158","SSD788","Rural Long","Transmission failure",1,483,2.5857540000000001,5,"N/A"]
[null,"25/11/2015","2815162611159","R32","Rural Long","Transmission failure",1,1476,0.458117,5,"N/A"]
[null,"25/11/2015","2924152511155","R21","Rural Long","Transmission failure",1,2769,7.9610729999999998,5,"N/A"]
[null,"25/11/2015","3307132611159","SD373","Rural Short","Transmission failure",1,1339,0.99082099999999995,5,"N/A"]
[null,"25/11/2015","3318162611158","NU11","Rural Long","Transmission failure",1,1209,0.82030599999999998,5,"N/A"]
[null,"25/11/2015","3403112611153","R26","Rural Long","Transmission failure",1,1681,0.94587900000000003,5,"N/A"]
[null,"25/11/2015","3532152611153","NU16","Rural Long","Transmission failure",1,1759,0.51304700000000003,5,"N/A"]
[null,"25/11/2015","3543162611159","NU20","Rural Long","Transmission failure",1,1576,0.26164100000000001,5,"N/A"]
[null,"25/11/2015","3637152611151","NU15","Rural Long","Transmission failure",1,1937,2.139453,5,"N/A"]
[null,"25/11/2015","3710152511153","NU19","Rural Long","Transmission failure",2,1506,7.5785869999999997,5,"N/A"]
[null,"25/11/2015","4250182611152","GA38","Rural Long","Transmission failure",1,11324,1.616431,5,"N/A"]
[null,"25/11/2015","5205112611151","SD371","Rural Long","Transmission failure",1,1453,2.6324550000000002,5,"N/A"]
[null,"25/11/2015","5525102611152","NU19","Rural Long","Transmission failure",2,2637,1.964494,5,"N/A"]
[null,"25/11/2015","5748162611153","R25","Rural Long","Transmission failure",1,1570,1.314557,5,"N/A"]
[null,"25/11/2015","5953132611159","SD375","Rural Short","Other",1,1273,4.9895490000000002,7,"N/A"]
[null,"7/12/2015","0742190812154","SSD331","Rural Long","Transmission failure",1,2291,5.2051090000000002,5,"N/A"]
[null,"7/12/2015","2525110812157","SSD440","Rural Long","Transmission failure",1,2449,5.270454,5,"N/A"]
[null,"7/12/2015","2525110812157","SSD440","Rural Short","Transmission failure",1,2449,2.8649100000000001,5,"N/A"]
[null,"12/01/2016","1626011201167","SSD320","Rural Long","Transmission failure",1,120,3.1002010000000002,5,"N/A"]
[null,"12/01/2016","1626011201167","SSD320","Rural Short","Transmission failure",1,120,1.3462479999999999,5,"N/A"]
[null,"14/01/2016","3858171401163","SSD443","Rural Short","Transmission failure",2,7,1.106E-3,5,"N/A"]
[null,"15/01/2016","2303181401162","SSD443","Rural Short","Transmission failure",2,8,2.5279999999999999E-3,5,"N/A"]
[null,"16/01/2016","5202141601169","AP365D1","Urban","Other",1,1784,3.7948000000000003E-2,7,"N/A"]
[null,"22/01/2016","0317002201163","SSD282","Rural Long","Transmission failure",1,57,1.450704,5,"N/A"]
[null,"22/01/2016","0317002201163","SSD282","Rural Short","Transmission failure",1,57,0.38813599999999998,5,"N/A"]
[null,"2/02/2016","J685017","PL803C","Urban","Other",1,67,2.8159999999999999E-3,7,"N/A"]
[null,"4/02/2016","3741130402164","VH31","Rural Short","Other",1,131,8.7134000000000003E-2,7,"N/A"]
[null,"2/03/2016","3217160203165","SSD188","Rural Long","Transmission failure",1,116,3.8552770000000001,5,"N/A"]
[null,"2/03/2016","3217160203165","SSD188","Urban","Transmission failure",1,116,0.71804999999999997,5,"N/A"]
[null,"To enter further events - please insert new lines above this line. "]

{"sheet":"6.9 STPIS - GSL","index":15,"n_rows":102,"n_cols":5,"rows_kept":102,"cut":false,"hidden":false,"merged":[[5,4,5,5],[101,1,101,2],[69,1,69,2],[98,1,98,2],[100,1,100,2],[93,1,93,2],[94,1,94,2],[95,1,95,2],[96,1,96,2],[88,1,88,2],[89,1,89,2],[90,1,90,2],[91,1,91,2],[92,1,92,2],[83,1,83,2],[84,1,84,2],[85,1,85,2],[86,1,86,2],[45,1,45,2],[46,1,46,2],[71,1,71,2],[70,1,70,2],[77,1,77,2],[49,1,49,2],[50,1,50,2],[51,1,51,2],[53,1,53,4],[58,1,58,4],[63,1,63,4],[68,1,68,4],[66,1,66,2],[65,1,65,2],[40,1,40,2],[42,1,42,2],[43,1,43,2],[44,1,44,2],[41,1,41,2],[33,1,33,2],[34,1,34,2],[35,1,35,2],[36,1,36,2],[37,1,37,2],[27,1,27,2],[31,1,31,2],[32,1,32,2],[28,1,28,2],[29,1,29,2],[30,1,30,2],[20,1,20,2],[22,1,22,2],[23,1,23,2],[24,1,24,2],[21,1,21,2],[17,1,17,2],[15,1,15,2],[5,1,5,2],[7,1,7,2],[14,1,14,2],[16,1,16,2],[64,1,64,2],[54,1,54,2],[55,1,55,2],[56,1,56,2],[61,1,61,2],[60,1,60,2],[59,1,59,2]]}
[null,{"$f":"(LOOKUP(dms_Model,dms_Model_List,dms_Worksheet_List))","v":"REGULATORY REPORTING STATEMENT"}]
[null,{"$f":"dms_TradingName","v":"SA Power Networks"}]
[null,{"$f":"CONCATENATE(\"Annual Reporting RIN Response \",CRY)","v":"Annual Reporting RIN Response 2015-16"}]
[null,"6.9 STPIS - GUARANTEED SERVICE LEVEL"]
[]
[null,"Did the AER's GSL Scheme apply at any time during the regulatory year?",null,"No","**IMPORTANT \nPlease ensure this flag is set. Conditional formatting on this worksheet is dependant on this response."]
[]
[null,"Instructions:\nTable 6.9.1 collects information relating to jurisdiction GSL scheme parameters. These parameters can be found in the jurisdictonal scheme relevant to NSP. Please identify each parameter in the relevant sub-tables and provide the volume and value of GSL payments. \n\nFor GSL parameters that do not fit within the provided sub-tables provided, please enter a heading and identify the relevant parameter(s). "]
[]
[null,"6.9.1 - GUARANTEED SERVICE LEVELS - JURISDICTIONAL GSL SCHEME"]
[null,null,null,{"$f":"CRY","v":"2015-16"},{"$f":"CRY","v":"2015-16"}]
[null,null,null,"Volume","Value of GSL payments"]
[null,null,null,"0's","$0's"]
[null,"Appointments"]
[null,"INSUFFICIENT SPACE AVAILABLE AND UNABLE TO INSERT ROWS IN LOCKED VERSION - REFER 6.9 STPIS - GSL UNLOCKED TAB"]
[]
[]
[]
[null,"To enter further GSL parameters relating to appointments - please copy a row from above and \"insert copied cells\" above this row."]
[null,"Connections"]
[]
[]
[]
[]
[]
[null,"To enter further GSL parameters relating to connections -  please copy a row from above and \"insert copied cells\" above this row."]
[null,"Reliability of supply"]
[]
[]
[]
[]
[]
[]
[]
[]
[]
[]
[]
[null,"To enter further GSL parameters relating to reliability of supply -  please copy a row from above and \"insert copied cells\" above this row."]
[null,"Street lights"]
[]
[]
[]
[]
[]
[]
[]
[null,"To enter further GSL parameters relating to street lights -  please copy a row from above and \"insert copied cells\" above this row."]
[null,"Planned interruptions"]
[]
[]
[]
[null,"To enter further GSL parameters relating to planned interruptions -  please copy a row from above and \"insert copied cells\" above this row."]
[null,"<NSP defined parameter category>"]
[]
[]
[]
[null,"To enter further GSL parameters - please identify the parameter and if insufficient rows  please copy a row from above and \"insert copied cells\" above this row."]
[null,"<NSP defined parameter category>"]
[]
[]
[]
[null,"To enter further GSL parameters - please identify the parameter and if insufficient rows  please copy a row from above and \"insert copied cells\" above this row."]
[null,"<NSP defined parameter category>"]
[]
[]
[]
[null,"To enter further GSL parameters - please identify the parameter and if insufficient rows  please copy a row from above and \"insert copied cells\" above this row."]
[null,"<NSP defined parameter category>"]
[]
[]
[]
[null,"To enter further GSL parameters - please identify the parameter and if insufficient rows  please copy a row from above and \"insert copied cells\" above this row."]
[]
[]
[null,"6.9.2 - GUARANTEED SERVICE LEVELS - AER GSL SCHEME"]
[]
[null,"Complete Table 6.9.2 if the AER's GSL scheme applied at any time during the regulatory year. \n\nDo not complete Table 6.9.2 if the AER's GSL scheme did not apply during the regulatory year."]
[]
[null,null,null,{"$f":"CRY","v":"2015-16"},{"$f":"CRY","v":"2015-16"}]
[null,null,null,"Volume","Value \nof GSL payments"]
[null,null,null,"0's","$0's"]
[null,"New connections "]
[null,"Number of connections made"]
[null,"Number of connections not made on or before the day agreed"]
[null,"Connections - GSL payments – 1-6 day delay"]
[null,"Connections - GSL payments – 7+ day delay"]
[null,"Reliability of supply"]
[null,"Frequency of interruptions – CBD feeders – 9 interruptions"]
[null,"Frequency of interruptions – Urban feeders – 9 interruptions"]
[null,"Frequency of interruptions – Rural (short and long) feeders – 15 interruptions"]
[null,"Interruptions – CBD feeders – 12 hours duration"]
[null,"Interruptions – Urban feeders – 12 hours duration"]
[null,"Interruptions – Rural (short and long) feeders – 18 hours duration"]
[null,"Total duration of interruptions Level 1 – 20 hours"]
[null,"Total duration of interruptions Level 2 – 30 hours"]
[null,"Total duration of interruptions Level 3 – 60 hours"]
[null,"Street lights"]
[null,"Streetlight repair 5 days – GSL payments"]
[null,"Planned interruptions"]
[null,"Notice of planned interruptions – 4 business days notice not given"]
[null,"Total ",null,null,{"$f":"SUM(E101,E99,E89:E97,E86:E87)","v":0}]

{"sheet":"6.9 STPIS - GSL Unlocked","index":16,"n_rows":106,"n_cols":5,"rows_kept":106,"cut":false,"hidden":false,"merged":[[100,1,100,2],[102,1,102,2],[104,1,104,2],[105,1,105,2],[94,1,94,2],[95,1,95,2],[96,1,96,2],[97,1,97,2],[98,1,98,2],[99,1,99,2],[93,1,93,2],[70,1,70,2],[72,1,72,4],[73,1,73,2],[74,1,74,2],[75,1,75,2],[81,1,81,2],[87,1,87,2],[88,1,88,2],[89,1,89,2],[90,1,90,2],[92,1,92,2],[69,1,69,2],[55,1,55,2],[57,1,57,4],[58,1,58,2],[59,1,59,2],[60,1,60,2],[62,1,62,4],[63,1,63,2],[64,1,64,2],[65,1,65,2],[67,1,67,4],[68,1,68,2],[54,1,54,2],[41,1,41,2],[42,1,42,2],[43,1,43,2],[44,1,44,2],[45,1,45,2],[46,1,46,2],[47,1,47,2],[48,1,48,2],[49,1,49,2],[50,1,50,2],[53,1,53,2],[40,1,40,2],[27,1,27,2],[28,1,28,2],[29,1,29,2],[30,1,30,2],[31,1,31,2],[32,1,32,2],[33,1,33,2],[34,1,34,2],[35,1,35,2],[36,1,36,2],[37,1,37,2],[24,1,24,2],[5,1,5,2],[5,4,5,5],[7,1,7,2],[14,1,14,2],[15,1,15,2],[16,1,16,2],[17,1,17,2],[20,1,20,2],[21,1,21,2],[22,1,22,2],[23,1,23,2]]}
[null,{"$f":"(LOOKUP(dms_Model,dms_Model_List,dms_Worksheet_List))","v":"REGULATORY REPORTING STATEMENT"}]
[null,{"$f":"dms_TradingName","v":"SA Power Networks"}]
[null,{"$f":"CONCATENATE(\"Annual Reporting RIN Response \",CRY)","v":"Annual Reporting RIN Response 2015-16"}]
[null,"6.9 STPIS - GUARANTEED SERVICE LEVEL"]
[]
[null,"Did the AER's GSL Scheme apply at any time during the regulatory year?",null,"No","**IMPORTANT \nPlease ensure this flag is set. Conditional formatting on this worksheet is dependant on this response."]
[]
[null,"Instructions:\nTable 6.9.1 collects information relating to jurisdiction GSL scheme parameters. These parameters can be found in the jurisdictonal scheme relevant to NSP. Please identify each parameter in the relevant sub-tables and provide the volume and value of GSL payments. \n\nFor GSL parameters that do not fit within the provided sub-tables provided, please enter a heading and identify the relevant parameter(s). "]
[]
[null,"6.9.1 - GUARANTEED SERVICE LEVELS - JURISDICTIONAL GSL SCHEME"]
[null,null,null,{"$f":"CRY","v":"2015-16"},{"$f":"CRY","v":"2015-16"}]
[null,null,null,"Volume","Value of GSL payments"]
[null,null,null,"0's","$0's"]
[null,"Appointments"]
[null,"Number of appointments for period",null,30214]
[null,"Number of appointments where more than 15 minutes late",null,2,50]
[]
[]
[null,"To enter further GSL parameters relating to appointments - please copy a row from above and \"insert copied cells\" above this row."]
[null,"Connections"]
[null,"Total number of new supply addresses connected",null,11620]
[null,"Number where connection not made on date agreed or within 6 business days",null,192,52620]
[]
[]
[]
[null,"To enter further GSL parameters relating to connections -  please copy a row from above and \"insert copied cells\" above this row."]
[null,"Reliability of supply"]
[null,"Long Duration Interruptions"]
[null,"Long Duration interruption greater than 12 hours & no more than 15 hours",null,2946,294600]
[null,"Long Duration interruption greater than 15 hours & no more than 18 hours",null,3630,544500]
[null,"Long Duration interruption greater than 18 hours & no more than 24 hours",null,3051,610200]
[null,"Long Duration interruption greater than 24 hours & no more than 48 hours",null,1049,424845]
[null,"Long Duration interruption greater than 48 hours",null,52,31460]
[null,"Frequency of Interruptions (1 July to 30 June)"]
[null,"No. of interruptions pa more than 9 & no more than 12",null,395,39500]
[null,"No. of interruptions pa more than 12 & no more than 15",null,74,11100]
[null,"No. of interruptions pa more than 15",null,0,0]
[]
[null,"To enter further GSL parameters relating to reliability of supply -  please copy a row from above and \"insert copied cells\" above this row."]
[null,"Street lights"]
[null,"Metroplitan Areas"]
[null,"No. of Street lights",null,174433]
[null,"Street light \"out\" during period",null,27486]
[null,"Ave. number of business days to repair",null,4.55]
[null,"Number of street lights not repaired within 5 buisness days",null,1126,190650]
[null,"Country Areas"]
[null,"No. of Street lights",null,43593]
[null,"Street light \"out\" during period",null,4149]
[null,"Ave. number of business days to repair",null,3.24]
[null,"Number of street lights not repaired within 10 buisness days",null,12,425]
[]
[null,"To enter further GSL parameters relating to street lights -  please copy a row from above and \"insert copied cells\" above this row."]
[null,"Planned interruptions"]
[null,"N/A"]
[]
[]
[null,"To enter further GSL parameters relating to planned interruptions -  please copy a row from above and \"insert copied cells\" above this row."]
[null,"<NSP defined parameter category>"]
[]
[]
[]
[null,"To enter further GSL parameters - please identify the parameter and if insufficient rows  please copy a row from above and \"insert copied cells\" above this row."]
[null,"<NSP defined parameter category>"]
[]
[]
[]
[null,"To enter further GSL parameters - please identify the parameter and if insufficient rows  please copy a row from above and \"insert copied cells\" above this row."]
[null,"<NSP defined parameter category>"]
[]
[]
[]
[null,"To enter further GSL parameters - please identify the parameter and if insufficient rows  please copy a row from above and \"insert copied cells\" above this row."]
[null,"<NSP defined parameter category>"]
[]
[]
[]
[null,"To enter further GSL parameters - please identify the parameter and if insufficient rows  please copy a row from above and \"insert copied cells\" above this row."]
[]
[]
[null,"6.9.2 - GUARANTEED SERVICE LEVELS - AER GSL SCHEME"]
[]
[null,"Complete Table 6.9.2 if the AER's GSL scheme applied at any time during the regulatory year. \n\nDo not complete Table 6.9.2 if the AER's GSL scheme did not apply during the regulatory year."]
[]
[null,null,null,{"$f":"CRY","v":"2015-16"},{"$f":"CRY","v":"2015-16"}]
[null,null,null,"Volume","Value \nof GSL payments"]
[null,null,null,"0's","$0's"]
[null,"New connections "]
[null,"Number of connections made"]
[null,"Number of connections not made on or before the day agreed"]
[null,"Connections - GSL payments – 1-6 day delay"]
[null,"Connections - GSL payments – 7+ day delay"]
[null,"Reliability of supply"]
[null,"Frequency of interruptions – CBD feeders – 9 interruptions"]
[null,"Frequency of interruptions – Urban feeders – 9 interruptions"]
[null,"Frequency of interruptions – Rural (short and long) feeders – 15 interruptions"]
[null,"Interruptions – CBD feeders – 12 hours duration"]
[null,"Interruptions – Urban feeders – 12 hours duration"]
[null,"Interruptions – Rural (short and long) feeders – 18 hours duration"]
[null,"Total duration of interruptions Level 1 – 20 hours"]
[null,"Total duration of interruptions Level 2 – 30 hours"]
[null,"Total duration of interruptions Level 3 – 60 hours"]
[null,"Street lights"]
[null,"Streetlight repair 5 days – GSL payments"]
[null,"Planned interruptions"]
[null,"Notice of planned interruptions – 4 business days notice not given"]
[null,"Total ",null,null,{"$f":"SUM(E105,E103,E93:E101,E90:E91)","v":0}]

{"sheet":"7.8 Avoided TUOS Payments","index":17,"n_rows":11,"n_cols":3,"rows_kept":11,"cut":false,"hidden":false,"merged":[[6,1,7,1]]}
[null,{"$f":"(LOOKUP(dms_Model,dms_Model_List,dms_Worksheet_List))","v":"REGULATORY REPORTING STATEMENT"}]
[null,{"$f":"dms_TradingName","v":"SA Power Networks"}]
[null,{"$f":"CONCATENATE(\"Annual Reporting RIN Response \",CRY)","v":"Annual Reporting RIN Response 2015-16"}]
[null,"7.8 - AVOIDED TUOS PAYMENTS"]
[]
[null,"7.8.1 - AVOIDED TUOS PAYMENTS"]
[null,"Description","Avoided TUOS Payment "]
[null,null,"$0's, nominal"]
[null,"Embedded generators",0]
[null,"Market network service providers",0]
[null,"Other",0]

{"sheet":"7.10 Juris Scheme","index":18,"n_rows":17,"n_cols":6,"rows_kept":17,"cut":false,"hidden":false,"merged":[[8,4,9,4],[8,3,9,3],[8,2,9,2],[8,1,9,1],[5,1,5,2]]}
[null,{"$f":"(LOOKUP(dms_Model,dms_Model_List,dms_Worksheet_List))","v":"REGULATORY REPORTING STATEMENT"}]
[null,{"$f":"dms_TradingName","v":"SA Power Networks"}]
[null,{"$f":"CONCATENATE(\"Annual Reporting RIN Response \",CRY)","v":"Annual Reporting RIN Response 2015-16"}]
[null,"7.10 - JURISDICTIONAL SCHEMES"]
[]
[null,"Instructions\nBusiness must list each relevant jurisdictional scheme individually and report information for each scheme separately from other schemes."]
[]
[null,"7.10.1 - JURISDICTIONAL SCHEME PAYMENTS"]
[null,"Jurisdictional Scheme Name","Description","Date DNSP Became Subject to Scheme","Description of Cost Recovery Method","Total Scheme Payments  "]
[null,null,null,null,null,"$0's, nominal"]
[null,"PV Incentive Scheme Payments for export PV - 2028 Scheme","\"44 cent Scheme\"","2008-07-01","Recovered through tariffs as uniform percentage uplift across all customer groups on each component of their DUoS charge.",15038828.800382771]
[null,"PV Incentive Scheme Payments for export PV - 2028S Scheme","\"44 cent Scheme\"","2010-12-01","Recovered through tariffs as uniform percentage uplift across all customer groups on each component of their DUoS charge.",68183025.685608447]
[null,"PV Incentive Scheme Payments for export PV - 2016 Scheme","\"16 cent Scheme\"","2011-10-01","Recovered through tariffs as uniform percentage uplift across all customer groups on each component of their DUoS charge.",35542295.014426664]
[]
[]
[]
[null,null,null,null,"Total",{"$f":"SUM(F11:F16)","v":118764149.50041787}]

{"sheet":"7.11 DMIS-DMIA","index":19,"n_rows":17,"n_cols":5,"rows_kept":17,"cut":false,"hidden":false,"merged":[[14,5,14,7],[6,1,7,1],[6,5,7,7],[6,2,6,4],[13,5,13,7],[9,5,9,7],[10,5,10,7],[11,5,11,7],[12,5,12,7],[8,2,8,4]]}
[null,{"$f":"(LOOKUP(dms_Model,dms_Model_List,dms_Worksheet_List))","v":"REGULATORY REPORTING STATEMENT"}]
[null,{"$f":"dms_TradingName","v":"SA Power Networks"}]
[null,{"$f":"CONCATENATE(\"Annual Reporting RIN Response \",CRY)","v":"Annual Reporting RIN Response 2015-16"}]
[null,"7.11 - DEMAND MANAGEMENT INCENTIVE SCHEME"]
[]
[null,"7.11.1 - DMIA - PROJECTS SUBMITTED FOR APPROVAL"]
[null,"Name of project",{"$f":"CONCATENATE(\"Total amount of the DMIA spent in \", CRY)","v":"Total amount of the DMIA spent in 2015-16"}]
[null,null,"Operating expenditure","Capital expenditure","Total"]
[null,null,"$0's, nominal"]
[null,"Grid Side Storage",218103.54,null,{"$f":"SUM(C10:D10)","v":218103.54}]
[null,"Future Network Modelling",263288.57,null,263288.57]
[null,"Residential Energy Storage",1474298.3599999999,null,1474298.3599999999]
[null,null,null,null,0]
[null,null,null,null,0]
[null,null,null,null,{"$f":"SUM(C15:D15)","v":0}]
[null,"To enter additional projects - please copy a row from above and \"insert copied cells\" above this row. "]
[null,"Total",{"$f":"SUM(C10:C16)","v":1955690.4699999997},{"$f":"SUM(D10:D16)","v":0},{"$f":"SUM(E10:E16)","v":1955690.4699999997}]

{"sheet":"7.12 Safety and Bushfire","index":20,"n_rows":340,"n_cols":10,"rows_kept":340,"cut":false,"hidden":false,"merged":[[319,4,319,6],[320,4,320,6],[214,6,214,8],[212,3,212,5],[212,6,212,8],[40,2,40,5],[41,2,41,5],[38,2,38,5],[39,2,39,5],[119,6,119,8],[120,6,120,8],[44,2,44,5],[68,6,68,7],[69,6,69,7],[70,6,70,7],[122,6,122,8],[123,6,123,8],[124,6,124,8],[125,6,125,8],[126,6,126,8],[59,6,59,7],[60,6,60,7],[61,6,61,7],[62,6,62,7],[337,4,337,6],[338,4,338,6],[324,4,324,6],[313,4,313,6],[314,4,314,6],[315,4,315,6],[316,4,316,6],[317,4,317,6],[318,4,318,6],[325,4,325,6],[326,4,326,6],[321,4,321,6],[322,4,322,6],[323,4,323,6],[332,4,332,6],[333,4,333,6],[334,4,334,6],[336,4,336,6],[331,4,331,6],[335,4,335,6],[329,4,329,6],[330,4,330,6],[327,4,327,6],[328,4,328,6],[248,1,249,1],[248,2,249,2],[312,4,312,6],[10,1,10,2],[82,3,82,5],[82,1,84,1],[82,2,84,2],[11,1,11,2],[164,2,164,4],[84,3,84,5],[82,6,82,8],[84,6,84,8],[17,6,17,8],[32,6,32,8],[33,6,33,8],[34,2,34,5],[34,6,34,8],[35,2,35,5],[35,6,35,8],[36,2,36,5],[36,6,36,8],[249,3,249,5],[311,4,311,6],[43,2,43,5],[37,2,37,5],[5,1,5,2],[25,2,25,5],[26,2,26,5],[27,2,27,5],[28,2,28,5],[29,2,29,5],[30,2,30,5],[42,2,42,5],[31,2,31,5],[32,2,32,5],[14,1,14,4],[13,1,13,4],[33,2,33,5],[24,2,24,5],[17,2,17,5],[18,2,18,5],[19,2,19,5],[20,2,20,5],[21,2,21,5],[22,2,22,5],[23,2,23,5],[212,1,214,1],[212,2,214,2],[214,3,214,5],[82,9,84,9],[162,2,162,4],[162,5,162,7],[162,1,164,1],[164,5,164,7],[133,6,133,8],[134,6,134,8],[135,6,135,8],[136,6,136,8],[137,6,137,8],[138,6,138,8],[139,6,139,8],[140,6,140,8],[141,6,141,8],[142,6,142,8],[143,6,143,8],[144,6,144,8],[145,6,145,8],[212,9,214,9],[117,6,118,8],[121,6,121,8],[18,6,18,8],[19,6,19,8],[20,6,20,8],[21,6,21,8],[22,6,22,8],[42,6,42,8],[43,6,43,8],[44,6,44,8],[28,6,28,8],[29,6,29,8],[30,6,30,8],[31,6,31,8],[23,6,23,8],[24,6,24,8],[25,6,25,8],[26,6,26,8],[27,6,27,8],[40,6,40,8],[37,6,37,8],[41,6,41,8],[38,6,38,8],[39,6,39,8],[63,6,63,7],[64,6,64,7],[65,6,65,7],[66,6,66,7],[67,6,67,7],[50,6,50,7],[51,6,51,7],[52,6,52,7],[53,6,53,7],[54,6,54,7],[55,6,55,7],[56,6,56,7],[57,6,57,7],[58,6,58,7],[162,8,164,9],[171,8,171,9],[172,8,172,9],[166,8,166,9],[167,8,167,9],[71,6,71,7],[72,6,72,7],[73,6,73,7],[74,6,74,7],[75,6,75,7],[76,6,76,7],[77,6,77,7],[165,8,165,9],[168,8,168,9],[130,6,130,8],[131,6,131,8],[132,6,132,8],[127,6,127,8],[128,6,128,8],[129,6,129,8],[248,6,249,7],[250,6,250,7],[251,6,251,7],[252,6,252,7],[253,6,253,7],[254,6,254,7],[255,6,255,7],[256,6,256,7],[169,8,169,9],[170,8,170,9],[207,6,207,7],[190,6,190,7],[191,6,191,7],[192,6,192,7],[193,6,193,7],[194,6,194,7],[195,6,195,7],[196,6,196,7],[197,6,197,7],[198,6,198,7],[199,6,199,7],[200,6,200,7],[201,6,201,7],[202,6,202,7],[272,6,272,7],[273,6,273,7],[274,6,274,7],[257,6,257,7],[258,6,258,7],[259,6,259,7],[260,6,260,7],[261,6,261,7],[262,6,262,7],[263,6,263,7],[264,6,264,7],[265,6,265,7],[304,6,304,7],[305,6,305,7],[288,6,288,7],[289,6,289,7],[290,6,290,7],[291,6,291,7],[292,6,292,7],[293,6,293,7],[294,6,294,7],[295,6,295,7],[296,6,296,7],[138,1,138,2],[297,6,297,7],[298,6,298,7],[299,6,299,7],[300,6,300,7],[301,6,301,7],[302,6,302,7],[303,6,303,7],[275,6,275,7],[276,6,276,7],[282,6,282,7],[283,6,283,7],[284,6,284,7],[285,6,285,7],[286,6,286,7],[287,6,287,7],[280,6,280,7],[281,6,281,7],[266,6,266,7],[267,6,267,7],[268,6,268,7],[269,6,269,7],[270,6,270,7],[271,6,271,7],[117,1,118,2],[180,6,180,7],[306,6,306,7],[307,6,307,7],[118,3,118,5],[119,1,119,2],[120,1,120,2],[121,1,121,2],[122,1,122,2],[123,1,123,2],[124,1,124,2],[125,1,125,2],[126,1,126,2],[127,1,127,2],[128,1,128,2],[129,1,129,2],[130,1,130,2],[131,1,131,2],[132,1,132,2],[133,1,133,2],[134,1,134,2],[135,1,135,2],[136,1,136,2],[137,1,137,2],[206,6,206,7],[181,6,181,7],[182,6,182,7],[183,6,183,7],[184,6,184,7],[185,6,185,7],[186,6,186,7],[187,6,187,7],[188,6,188,7],[189,6,189,7],[139,1,139,2],[140,1,140,2],[141,1,141,2],[142,1,142,2],[143,1,143,2],[144,1,144,2],[203,6,203,7],[204,6,204,7],[205,6,205,7],[145,1,145,2]]}
[null,{"$f":"(LOOKUP(dms_Model,dms_Model_List,dms_Worksheet_List))","v":"REGULATORY REPORTING STATEMENT"}]
[null,{"$f":"dms_TradingName","v":"SA Power Networks"}]
[null,{"$f":"CONCATENATE(\"Annual Reporting RIN Response \",CRY)","v":"Annual Reporting RIN Response 2015-16"}]
[null,"7.12 SAFETY AND BUSHFIRE RELATED EXPENDITURE"]
[]
[null,"These templates collect information from Victorian businesses only.\n\nBushfire and safety related expenditure information is used by the AER to monitor the expenditures throughout the regulatory control period."]
[]
[null,"CPI applied to convert expected expenditure in real $ to nominal based on lagged September CPI index"]
[]
[null,"Instructions"]
[null,"For \"Exclusive of Margins & Overheads\" reported expenditure is to EXCLUDE any overheads, profit margins or management fees paid directly or indirectly to related party contractors (not including actual incurred expense of the related party contractor) for the reporting period."]
[null,"For \"Value of Margins & Overheads\" reported expenditure is to COMPRISE ONLY the sum of overheads, profit margins or management fees paid directly or indirectly to related party contractors (not including actual incurred expenses of the related party contractor) for the reporting period. "]
[]
[null,{"$f":"CONCATENATE(dms_TradingName, \" is to specify each activity in this table in accordance with the definition in Appendix F of the RIN.\")","v":"SA Power Networks is to specify each activity in this table in accordance with the definition in Appendix F of the RIN."}]
[null,"All activities must be reported but the Reason for Difference is only required if there is a 10 per cent difference between the expected value and the actual value.\n\nUse median unit costs. Where unit costs are not recorded at the asset category level - provide the best estimates of the unit cost using the cost allocation method identified in this table. (As a transitional measure, the unit cost may be based on a statistically significant annual sample of actual work orders at a 5% or better confidence interval.)\n\nProvide basis of allocation where applicable."]
[]
[null,"7.12.1 - SAFETY AND BUSHFIRE RELATED ASSET GROUP DEFINITIONS AND ALLOCATION BASIS"]
[null,"Activity","Definitions",null,null,null,"Basis for allocation of cost to activity"]
[null,"Planned non-preferred services replacements"]
[null,"Planned replacement of non-preferred services due to height "]
[null,"Removal of public lighting switchwire "]
[null,"Replacement of existing SWER lines with 22kV overhead bare conductor "]
[null,"Installation of GFN and associated equipment at zone substations "]
[null,"Replacement of crossarms/insulator sets – pole top fire mitigation"]
[null,"Replacement of crossarms – based on age and condition "]
[null,"Replacement of poles – based on age and condition "]
[null,"Stake poles – based on age and condition "]
[null,"Replacement of undersized poles "]
[null,"Stake undersized poles"]
[null,"Replacement of overhead conductor – mainly steel "]
[null,"Service line clearance – overhead services requiring relocation "]
[null,"Service line clearance – overhead services requiring undergrounding "]
[null,"Replacement of 22kV distribution feeders with ABC/underground cabling"]
[null,"Replacement of SWER with covered carbon core conductor or equivalent"]
[null,"Replacement of SWER with ABC"]
[null,"Replacement of SWER with underground"]
[null,"Replacement of surge diverters (neptune configuration)"]
[null,"Replacement of surge diverters (single phase or three phase)"]
[]
[]
[]
[]
[]
[]
[]
[null,"To enter further activities - please copy row from above and \"insert copied cells\" into a row above this row. "]
[]
[null,"7.12.2 - BUSHFIRE RELATED"]
[]
[null,"7.12.2.1 - NUMBER OF ACTIVITIES"]
[null,"Activity","Units","AER expected number","Actual Number","Difference","Reasons for Difference"]
[null,"Planned non-preferred services replacements","number of services",null,null,{"$f":"D52-E52","v":0}]
[null,"Planned replacement of non-preferred services due to height ","number of services",null,null,{"$f":"D53-E53","v":0}]
[null,"Removal of public lighting switchwire ","number of spans removed",null,null,0]
[null,"Replacement of existing SWER lines with 22kV overhead bare conductor ","kms of SWER",null,null,0]
[null,"Installation of GFN and associated equipment at zone substations ","number of zone substations",null,null,{"$f":"D56-E56","v":0}]
[null,"Replacement of crossarms/insulator sets – pole top fire mitigation","number of crossarms/sets",null,null,0]
[null,"Replacement of crossarms – based on age and condition ","number of crossarms",null,null,0]
[null,"Replacement of poles – based on age and condition ","number of poles",null,null,0]
[null,"Stake poles – based on age and condition ","number of poles",null,null,0]
[null,"Replacement of undersized poles ","number of poles",null,null,0]
[null,"Stake undersized poles","number of poles",null,null,0]
[null,"Replacement of overhead conductor – mainly steel ","kms ",null,null,0]
[null,"Service line clearance – overhead services requiring relocation ","number of services",null,null,0]
[null,"Service line clearance – overhead services requiring undergrounding ","number of services",null,null,0]
[null,"Replacement of 22kV distribution feeders with ABC/underground cabling","number of feeders",null,null,0]
[null,"Replacement of SWER with covered carbon core conductor or equivalent","kms ",null,null,0]
[null,"Replacement of SWER with ABC","kms ",null,null,0]
[null,"Replacement of SWER with underground","kms ",null,null,0]
[null,"Replacement of surge diverters (neptune configuration)","number of units",null,null,{"$f":"D70-E70","v":0}]
[null,"Replacement of surge diverters (single phase or three phase)","number of units",null,null,0]
[null,{"$f":"IF(ISBLANK(B39),\"\",B39)","v":""},null,null,null,{"$f":"D72-E72","v":0}]
[null,{"$f":"IF(ISBLANK(B40),\"\",B40)","v":""},null,null,null,0]
[null,"",null,null,null,0]
[null,"",null,null,null,0]
[null,"",null,null,null,0]
[null,"",null,null,null,0]
[null,"",null,null,null,0]
[null,"To enter further activities - please copy row from above and \"insert copied cells\" into a row above this row. "]
[]
[]
[null,"7.12.2.2 - EXPENDITURE "]
[null,"Activity","Units","Exclusive of Margins & Overheads",null,null,"Value of Margins & Overheads",null,null,"Reasons for Difference"]
[null,null,null,"AER expected expenditure ","Actual expenditure","Difference  ","AER expected expenditure ","Actual expenditure","Difference  "]
[null,null,null,"$0's, Nominal",null,null,"$0's, Nominal"]
[null,"Planned non-preferred services replacements","number of services",null,null,{"$f":"D86*$C$8-E86","v":0},null,null,{"$f":"G86*$C$8-H86","v":0}]
[null,"Planned replacement of non-preferred services due to height ","number of services",null,null,{"$f":"D87*$C$8-E87","v":0},null,null,{"$f":"G87*$C$8-H87","v":0}]
[null,"Removal of public lighting switchwire ","number of spans removed",null,null,0,null,null,0]
[null,"Replacement of existing SWER lines with 22kV overhead bare conductor ","kms of SWER",null,null,0,null,null,0]
[null,"Installation of GFN and associated equipment at zone substations ","number of zone substations",null,null,0,null,null,0]
[null,"Replacement of crossarms/insulator sets – pole top fire mitigation","number of crossarms/sets",null,null,0,null,null,0]
[null,"Replacement of crossarms – based on age and condition ","number of crossarms",null,null,0,null,null,0]
[null,"Replacement of poles – based on age and condition ","number of poles",null,null,0,null,null,0]
[null,"Stake poles – based on age and condition ","number of poles",null,null,0,null,null,0]
[null,"Replacement of undersized poles ","number of poles",null,null,0,null,null,0]
[null,"Stake undersized poles","number of poles",null,null,0,null,null,0]
[null,"Replacement of overhead conductor – mainly steel ","kms ",null,null,0,null,null,0]
[null,"Service line clearance – overhead services requiring relocation ","number of services",null,null,0,null,null,0]
[null,"Service line clearance – overhead services requiring undergrounding ","number of services",null,null,0,null,null,0]
[null,"Replacement of 22kV distribution feeders with ABC/underground cabling","number of feeders",null,null,0,null,null,0]
[null,"Replacement of SWER with covered carbon core conductor or equivalent","kms ",null,null,0,null,null,0]
[null,"Replacement of SWER with ABC","kms ",null,null,0,null,null,0]
[null,"Replacement of SWER with underground","kms ",null,null,0,null,null,0]
[null,"Replacement of surge diverters (neptune configuration)","number of units",null,null,0,null,null,0]
[null,"Replacement of surge diverters (single phase or three phase)","number of units",null,null,0,null,null,0]
[null,{"$f":"IF(ISBLANK(B39),\"\",B39)","v":""},{"$f":"IF(ISBLANK(C72),\"\",C72)","v":""},null,null,0,null,null,0]
[null,"","",null,null,{"$f":"D107*$C$8-E107","v":0},null,null,{"$f":"G107*$C$8-H107","v":0}]
[null,"","",null,null,0,null,null,0]
[null,"","",null,null,0,null,null,0]
[null,"","",null,null,0,null,null,0]
[null,"","",null,null,0,null,null,0]
[null,"","",null,null,0,null,null,0]
[null,"To enter further activities - please copy row from above and \"insert copied cells\" into a row above this row. "]
[]
[]
[]
[null,"7.12.2.3 - UNIT COSTS"]
[null,"Activity",null,"AER expected ","Actual","Difference","Reasons for Difference"]
[null,null,null,"$0's, Per Unit"]
[null,"Planned non-preferred services replacements",null,null,null,{"$f":"D120*$C$8-E120","v":0}]
[null,"Planned replacement of non-preferred services due to height ",null,null,null,0]
[null,"Removal of public lighting switchwire ",null,null,null,0]
[null,"Replacement of existing SWER lines with 22kV overhead bare conductor ",null,null,null,0]
[null,"Installation of GFN and associated equipment at zone substations ",null,null,null,0]
[null,"Replacement of crossarms/insulator sets – pole top fire mitigation",null,null,null,0]
[null,"Replacement of crossarms – based on age and condition ",null,null,null,0]
[null,"Replacement of poles – based on age and condition ",null,null,null,0]
[null,"Stake poles – based on age and condition ",null,null,null,0]
[null,"Replacement of undersized poles ",null,null,null,0]
[null,"Stake undersized poles",null,null,null,0]
[null,"Replacement of overhead conductor – mainly steel ",null,null,null,0]
[null,"Service line clearance – overhead services requiring relocation ",null,null,null,0]
[null,"Service line clearance – overhead services requiring undergrounding ",null,null,null,0]
[null,"Replacement of 22kV distribution feeders with ABC/underground cabling",null,null,null,0]
[null,"Replacement of SWER with covered carbon core conductor or equivalent",null,null,null,0]
[null,"Replacement of SWER with ABC",null,null,null,0]
[null,"Replacement of SWER with underground",null,null,null,0]
[null,"Replacement of surge diverters (neptune configuration)",null,null,null,0]
[null,"Replacement of surge diverters (single phase or three phase)",null,null,null,0]
[null,{"$f":"IF(ISBLANK(B39),\"\",B39)","v":""},null,null,null,0]
[null,"",null,null,null,0]
[null,"",null,null,null,0]
[null,"",null,null,null,0]
[null,"",null,null,null,0]
[null,"",null,null,null,0]
[null,"",null,null,null,0]
[null,"To enter further activities - please copy row from above and \"insert copied cells\" into a row above this row. "]
[]
[]
[null,"7.12.2.4 - CONTINGENT PROJECT APPLICATIONS - VOLUMES APPROVED"]
[null,"Activity","Units","Volume approved under contingent project applications ","Actual volumes","Difference"]
[null,null,null,null,null,{"$f":"E152-D152","v":0}]
[null,null,null,null,null,0]
[null,null,null,null,null,0]
[null,null,null,null,null,0]
[null,null,null,null,null,0]
[null,null,null,null,null,0]
[null,null,null,null,null,0]
[null,null,null,null,null,0]
[null,"To enter further activities - please copy row from above and \"insert copied cells\" into a row above this row. "]
[]
[null,"7.12.2.5 - CONTINGENT PROJECT APPLICATIONS - EXPENDITURE APPROVED"]
[null,"Activity","Exclusive of Margins & Overheads",null,null,"Value of Margins & Overheads",null,null,"Reasons for Difference"]
[null,null,"Expenditure approved under contingent project applications","Actual expenditure ","Difference","Expenditure approved under contingent project applications","Actual expenditure","Difference"]
[null,null,"$0's, Nominal",null,null,"$0's, Nominal"]
[null,{"$f":"IF(ISBLANK(B152),\"\",B152)","v":""},null,null,{"$f":"C166-D166","v":0},null,null,{"$f":"F166-G166","v":0}]
[null,{"$f":"IF(ISBLANK(B153),\"\",B153)","v":""},null,null,{"$f":"C167-D167","v":0},null,null,{"$f":"F167-G167","v":0}]
[null,"",null,null,0,null,null,0]
[null,"",null,null,0,null,null,0]
[null,"",null,null,0,null,null,0]
[null,"",null,null,0,null,null,0]
[null,"",null,null,0,null,null,0]
[null,"",null,null,0,null,null,0]
[null,"To enter further activities - please copy row from above and \"insert copied cells\" into a row above this row. "]
[]
[]
[]
[null,"7.12.3 - SAFETY RELATED"]
[]
[null,"7.12.3.1 - NUMBER OF ACTIVITIES"]
[null,"Activity","Units","AER expected volumes","Actual units","Difference","Reasons for Difference"]
[null,"Planned non-preferred services replacements","number of services",null,null,{"$f":"D182-E182","v":0}]
[null,"Planned replacement of non-preferred services due to height ","number of services",null,null,{"$f":"D183-E183","v":0}]
[null,"Removal of public lighting switchwire ","number of spans removed",null,null,0]
[null,"Replacement of existing SWER lines with 22kV overhead bare conductor ","kms of SWER",null,null,0]
[null,"Installation of GFN and associated equipment at zone substations ","number of zone substations",null,null,0]
[null,"Replacement of crossarms/insulator sets – pole top fire mitigation","number of crossarms/sets",null,null,0]
[null,"Replacement of crossarms – based on age and condition ","number of crossarms",null,null,0]
[null,"Replacement of poles – based on age and condition ","number of poles",null,null,0]
[null,"Stake poles – based on age and condition ","number of poles",null,null,0]
[null,"Replacement of undersized poles ","number of poles",null,null,0]
[null,"Stake undersized poles","number of poles",null,null,0]
[null,"Replacement of overhead conductor – mainly steel ","kms ",null,null,0]
[null,"Service line clearance – overhead services requiring relocation ","number of services",null,null,0]
[null,"Service line clearance – overhead services requiring undergrounding ","number of services",null,null,0]
[null,"Replacement of 22kV distribution feeders with ABC/underground cabling","number of feeders",null,null,0]
[null,"Replacement of SWER with covered carbon core conductor or equivalent","kms ",null,null,0]
[null,"Replacement of SWER with ABC","kms ",null,null,{"$f":"D198-E198","v":0}]
[null,"Replacement of SWER with underground","kms ",null,null,{"$f":"D199-E199","v":0}]
[null,"Replacement of surge diverters (neptune configuration)","number of units",null,null,0]
[null,"Replacement of surge diverters (single phase or three phase)","number of units",null,null,0]
[null,{"$f":"IF(ISBLANK(B39),\"\",B39)","v":""},{"$f":"IF(ISBLANK(C72),\"\",C72)","v":""},null,null,0]
[null,"","",null,null,0]
[null,"","",null,null,{"$f":"D204-E204","v":0}]
[null,"","",null,null,{"$f":"D205-E205","v":0}]
[null,"","",null,null,{"$f":"D206-E206","v":0}]
[null,"","",null,null,0]
[null,"","",null,null,0]
[null,"To enter further activities - please copy row from above and \"insert copied cells\" into a row above this row. "]
[]
[]
[null,"7.12.3.2 - EXPENDITURE"]
[null,"Activity","Units","Exclusive of Margins & Overheads",null,null,"Value of Margins & Overheads",null,null,"Reasons for Difference"]
[null,null,null,"AER expected expenditure ","Actual expenditure","Difference  ","AER expected expenditure ","Actual expenditure","Difference  "]
[null,null,null,"$0's, Nominal",null,null,"$0's, Nominal"]
[null,"Planned non-preferred services replacements","number of services",null,null,{"$f":"D216*$C$8-E216","v":0},null,null,{"$f":"G216*$C$8-H216","v":0}]
[null,"Planned replacement of non-preferred services due to height ","number of services",null,null,{"$f":"D217*$C$8-E217","v":0},null,null,{"$f":"G217*$C$8-H217","v":0}]
[null,"Removal of public lighting switchwire ","number of spans removed",null,null,0,null,null,0]
[null,"Replacement of existing SWER lines with 22kV overhead bare conductor ","kms of SWER",null,null,0,null,null,0]
[null,"Installation of GFN and associated equipment at zone substations ","number of zone substations",null,null,0,null,null,0]
[null,"Replacement of crossarms/insulator sets – pole top fire mitigation","number of crossarms/sets",null,null,0,null,null,0]
[null,"Replacement of crossarms – based on age and condition ","number of crossarms",null,null,0,null,null,0]
[null,"Replacement of poles – based on age and condition ","number of poles",null,null,0,null,null,0]
[null,"Stake poles – based on age and condition ","number of poles",null,null,0,null,null,0]
[null,"Replacement of undersized poles ","number of poles",null,null,0,null,null,0]
[null,"Stake undersized poles","number of poles",null,null,0,null,null,0]
[null,"Replacement of overhead conductor – mainly steel ","kms ",null,null,0,null,null,0]
[null,"Service line clearance – overhead services requiring relocation ","number of services",null,null,0,null,null,0]
[null,"Service line clearance – overhead services requiring undergrounding ","number of services",null,null,0,null,null,0]
[null,"Replacement of 22kV distribution feeders with ABC/underground cabling","number of feeders",null,null,0,null,null,0]
[null,"Replacement of SWER with covered carbon core conductor or equivalent","kms ",null,null,0,null,null,0]
[null,"Replacement of SWER with ABC","kms ",null,null,{"$f":"D232-E232","v":0},null,null,{"$f":"G232-H232","v":0}]
[null,"Replacement of SWER with underground","kms ",null,null,{"$f":"D233-E233","v":0},null,null,{"$f":"G233-H233","v":0}]
[null,"Replacement of surge diverters (neptune configuration)","number of units",null,null,0,null,null,0]
[null,"Replacement of surge diverters (single phase or three phase)","number of units",null,null,0,null,null,0]
[null,{"$f":"IF(ISBLANK(B39),\"\",B39)","v":""},{"$f":"IF(ISBLANK(C72),\"\",C72)","v":""},null,null,0,null,null,0]
[null,"","",null,null,0,null,null,0]
[null,"","",null,null,{"$f":"D238-E238","v":0},null,null,{"$f":"G238-H238","v":0}]
[null,"","",null,null,{"$f":"D239-E239","v":0},null,null,{"$f":"G239-H239","v":0}]
[null,"","",null,null,{"$f":"D240-E240","v":0},null,null,{"$f":"G240-H240","v":0}]
[null,"","",null,null,0,null,null,0]
[null,"","",null,null,0,null,null,0]
[null,"To enter further activities - please copy row from above and \"insert copied cells\" into a row above this row. "]
[]
[]
[]
[]
[null,"7.12.3.3 - UNIT COSTS"]
[null,"Activity","Units","AER expected","Actual\n  ","Difference\n  ","Reasons for Difference"]
[null,null,null,"$0's per Unit"]
[null,"Planned non-preferred services replacements","number of services",null,null,{"$f":"D251*$C$8-E251","v":0}]
[null,"Planned replacement of non-preferred services due to height ","number of services",null,null,0]
[null,"Removal of public lighting switchwire ","number of spans removed",null,null,0]
[null,"Replacement of  existing SWER lines with 22kV overhead bare conductor ","kms of SWER",null,null,0]
[null,"Installation of GFN and associated equipment at zone substations ","number of zone substations",null,null,0]
[null,"Replacement of crossarms/insulator sets – pole top fire mitigation","number of crossarms/sets",null,null,0]
[null,"Replacement of crossarms – based on age and condition ","number of crossarms",null,null,0]
[null,"Replacement of poles – based on age and condition ","number of poles",null,null,0]
[null,"Stake poles – based on age and condition ","number of poles",null,null,0]
[null,"Replacement of undersized poles ","number of poles",null,null,0]
[null,"Stake undersized poles","number of poles",null,null,0]
[null,"Replacement of overhead conductor – mainly steel ","kms ",null,null,0]
[null,"Service line clearance – overhead services requiring relocation ","number of services",null,null,0]
[null,"Service line clearance – overhead services requiring undergrounding ","number of services",null,null,0]
[null,"Replacement of 22kV distribution feeders with ABC/underground cabling","number of feeders",null,null,0]
[null,"Replacement of SWER with covered carbon core conductor or equivalent","kms ",null,null,0]
[null,"Replacement of SWER with ABC","kms ",null,null,{"$f":"D267-E267","v":0}]
[null,"Replacement of SWER with underground","kms ",null,null,{"$f":"D268-E268","v":0}]
[null,"Replacement of surge diverters (neptune configuration)","number of units",null,null,0]
[null,"Replacement of surge diverters (single phase or three phase)","number of units",null,null,0]
[null,{"$f":"IF(ISBLANK(B39),\"\",B39)","v":""},{"$f":"IF(ISBLANK(C72),\"\",C72)","v":""},null,null,0]
[null,"","",null,null,0]
[null,"","",null,null,{"$f":"D273-E273","v":0}]
[null,"","",null,null,{"$f":"D274-E274","v":0}]
[null,"","",null,null,{"$f":"D275-E275","v":0}]
[null,"","",null,null,0]
[null,"","",null,null,0]
[null,"To enter further activities - please copy row from above and \"insert copied cells\" into a row above this row. "]
[]
[null,"7.12.3.4 - SAFETY IMPROVEMENT OUTCOMES REPORTED TO ESV"]
[null,"Activity","Units","Safety Improvement Programme - outcomes","Safety Improvement Target","Difference","Reasons for Difference"]
[null,"Planned non-preferred services replacements","number of services",null,null,{"$f":"D282-E282","v":0}]
[null,"Planned replacement of non-preferred services due to height ","number of services",null,null,{"$f":"D283-E283","v":0}]
[null,"Removal of public lighting switchwire ","number of spans removed",null,null,0]
[null,"Replacement of  existing SWER lines with 22kV overhead bare conductor ","kms of SWER",null,null,0]
[null,"Installation of GFN and associated equipment at zone substations ","number of zone substations",null,null,0]
[null,"Replacement of crossarms/insulator sets – pole top fire mitigation","number of crossarms/sets",null,null,0]
[null,"Replacement of crossarms – based on age and condition ","number of crossarms",null,null,0]
[null,"Replacement of poles – based on age and condition ","number of poles",null,null,0]
[null,"Stake poles – based on age and condition ","number of poles",null,null,0]
[null,"Replacement of undersized poles ","number of poles",null,null,0]
[null,"Stake undersized poles","number of poles",null,null,0]
[null,"Replacement of overhead conductor – mainly steel ","kms ",null,null,0]
[null,"Service line clearance – overhead services requiring relocation ","number of services",null,null,0]
[null,"Service line clearance – overhead services requiring undergrounding ","number of services",null,null,0]
[null,"Replacement of 22kV distribution feeders with ABC/underground cabling","number of feeders",null,null,0]
[null,"Replacement of SWER with covered carbon core conductor or equivalent","kms ",null,null,0]
[null,"Replacement of SWER with ABC","kms ",null,null,0]
[null,"Replacement of SWER with underground","kms ",null,null,{"$f":"D299-E299","v":0}]
[null,"Replacement of surge diverters (neptune configuration)","number of units",null,null,0]
[null,"Replacement of surge diverters (single phase or three phase)","number of units",null,null,0]
[null,{"$f":"IF(ISBLANK(B39),\"\",B39)","v":""},{"$f":"IF(ISBLANK(C72),\"\",C72)","v":""},null,null,0]
[null,"","",null,null,0]
[null,"","",null,null,{"$f":"D304-E304","v":0}]
[null,"","",null,null,{"$f":"D305-E305","v":0}]
[null,"","",null,null,{"$f":"D306-E306","v":0}]
[null,"","",null,null,0]
[null,"","",null,null,0]
[null,"To enter further activities - please copy row from above and \"insert copied cells\" into a row above this row. "]
[]
[null,"7.12.3.5 - SAFETY IMPROVEMENT OUTCOMES RECONCILIATION"]
[null,"Activity","Units","Difference","Reasons for Difference"]
[null,"Planned non-preferred services replacements","number of services",{"$f":"D282-E52-E182","v":0}]
[null,"Planned replacement of non-preferred services due to height ","number of services",0]
[null,"Removal of public lighting switchwire ","number of spans removed",0]
[null,"Replacement of  existing SWER lines with 22kV overhead bare conductor ","kms of SWER",0]
[null,"Installation of GFN and associated equipment at zone substations ","number of zone substations",0]
[null,"Replacement of crossarms/insulator sets – pole top fire mitigation","number of crossarms/sets",0]
[null,"Replacement of crossarms – based on age and condition ","number of crossarms",0]
[null,"Replacement of poles – based on age and condition ","number of poles",0]
[null,"Stake poles – based on age and condition ","number of poles",0]
[null,"Replacement of undersized poles ","number of poles",0]
[null,"Stake undersized poles","number of poles",0]
[null,"Replacement of overhead conductor – mainly steel ","kms ",0]
[null,"Service line clearance – overhead services requiring relocation ","number of services",0]
[null,"Service line clearance – overhead services requiring undergrounding ","number of services",0]
[null,"Replacement of 22kV distribution feeders with ABC/underground cabling","number of feeders",0]
[null,"Replacement of SWER with covered carbon core conductor or equivalent","kms ",0]
[null,"Replacement of SWER with ABC","kms ",0]
[null,"Replacement of SWER with underground","kms ",0]
[null,"Replacement of surge diverters (neptune configuration)","number of units",0]
[null,"Replacement of surge diverters (single phase or three phase)","number of units",0]
[null,{"$f":"IF(ISBLANK(B39),\"\",B39)","v":""},{"$f":"IF(ISBLANK(C72),\"\",C72)","v":""},{"$f":"D302-E73-E202","v":0}]
[null,"","",0]
[null,"","",0]
[null,"","",0]
[null,"","",0]
[null,"","",0]
[null,"","",0]
[null,"To enter further activities - please copy row from above and \"insert copied cells\" into a row above this row. "]

{"sheet":"7.13 TARC","index":21,"n_rows":9,"n_cols":3,"rows_kept":9,"cut":false,"hidden":false,"merged":[]}
[null,{"$f":"(LOOKUP(dms_Model,dms_Model_List,dms_Worksheet_List))","v":"REGULATORY REPORTING STATEMENT"}]
[null,{"$f":"dms_TradingName","v":"SA Power Networks"}]
[null,{"$f":"CONCATENATE(\"Annual Reporting RIN Response \",CRY)","v":"Annual Reporting RIN Response 2015-16"}]
[null,"7.13 - TARC"]
[]
[]
[null,"7.13.1 - TOTAL ANNUAL RETAILER CHARGES"]
[null,null,"$0's"]
[null,"TARC",964429487.98999953]

{"sheet":"8.1 Income","index":22,"n_rows":40,"n_cols":12,"rows_kept":40,"cut":false,"hidden":false,"merged":[[6,1,9,1],[6,6,6,10],[7,8,7,10],[6,11,8,11],[9,2,9,11],[6,5,8,5],[7,6,7,7],[6,2,8,2],[6,3,8,3],[6,4,8,4]]}
[null,{"$f":"(LOOKUP(dms_Model,dms_Model_List,dms_Worksheet_List))","v":"REGULATORY REPORTING STATEMENT"}]
[null,{"$f":"dms_TradingName","v":"SA Power Networks"}]
[null,{"$f":"CONCATENATE(\"Annual Reporting RIN Response \",CRY)","v":"Annual Reporting RIN Response 2015-16"}]
[null,"8.1 - INCOME"]
[]
[null,"8.1.1 - INCOME STATEMENT"]
[null,"Description","Audited Statutory Accounts","Adjustments","Distribution business","Standard Control Services","Alternative Control Services",null,null,null,null,"Negotiated Services"]
[null,null,null,null,null,null,"Public Lighting",null,"Other"]
[null,null,null,null,null,null,{"$f":"IF(dms_Jurisdiction=\"Vic\",\"Energy efficient\",\"\")","v":""},{"$f":"IF(dms_Jurisdiction=\"Vic\",\"Non-energy efficient\",\"\")","v":""},"Connection services","Metering services","Ancillary network services"]
[null,null,"$0's, nominal"]
[]
[null,"8.1.1.1 - REVENUE"]
[null,"Distribution revenue",807633127.54999983,{"$f":"E13-C13","v":-19904260.740000248},{"$f":"SUM(F13,I13:L13)","v":787728866.80999959},679011681.17999959,null,null,0,17816089.329999994,0,90901096.299999982]
[null,"Cross boundary revenue",0,0,0,0,null,null,0,0,0,0]
[null,"Contributions",80417701.150000006,0,80417701.150000006,0,null,null,0,0,0,80417701.150000006]
[null,"Interest income",5396753.8100000005,-5396753.8100000005,0,0,null,null,0,0,0,0]
[null,"Jurisdictional scheme amounts",0,0,0,0,null,null,0,0,0,0]
[null,"Profit from sale of fixed assets",0,0,0,0,null,null,0,0,0,0]
[null,"TUOS revenue",256974743.08000004,0,256974743.08000004,256974743.08000004,null,null,0,0,0,0]
[null,"Pass through revenue (F-factor)",0,0,0,0,null,null,0,0,0,0]
[null,"Other Revenue ",154809900.10999975,-154809900.10999975,0,0,null,null,0,0,0,0]
[null,"Total revenue",{"$f":"SUM(C13:C21)","v":1305232225.6999993},-180110914.66,1125121311.0399995,935986424.25999963,0,0,0,17816089.329999994,0,171318797.44999999]
[]
[null,"8.1.1.2 - EXPENDITURE"]
[null,"TUOS expenditure",256974743.08000004,{"$f":"E25-C25","v":0},{"$f":"SUM(F25,I25:L25)","v":256974743.08000004},256974743.08000004,null,null,0,0,0,0]
[null,"Avoided TUOS expenditure",0,0,0,0,null,null,0,0,0,0]
[null,"Cross boundary expenditure",0,0,0,0,null,null,0,0,0,0]
[null,"Depreciation ",224246164.88,-8513877.3500000238,215732287.52999997,209612434.55999997,null,null,0,2519072.4900000002,0,3600780.48]
[null,"Finance charges",223204163.34999999,-223204163.34999999,0,0,null,null,0,0,0,0]
[null,"Impairment losses",0,0,0,0,null,null,0,0,0,0]
[null,"Jurisdictional scheme amounts",0,0,0,0,null,null,0,0,0,0]
[null,"Loss from sale of fixed assets",970729.51000000024,0,970729.51000000024,970729.51000000024,null,null,0,0,0,0]
[null,"Maintenance expenditure",120881181.62017858,-77517.819999977946,120803663.8001786,106632984.5501786,null,null,0,6288975.5699999994,0,7881703.6800000006]
[null,"Operating expenditure excluding maintenance expenditure",253203368.70273423,-126182208.75228,127021159.95045424,69284723.328429356,null,null,0,2691394.7724039434,0,55045041.849620938]
[null,"Other ",0,0,0,0,null,null,0,0,0,0]
[]
[null,"8.1.1.3 - PROFIT"]
[null,"Profit before tax (PBT)",{"$f":"C22-SUM(C25:C35)","v":225751874.55708647},177866852.61227998,403618727.1693666,292510809.23139167,0,0,0,6316646.4975960515,0,104791271.44037905]
[null,"Income tax expenses (/ benefit)",-2039709.9959999919,{"$f":"dms_080101_03_dnsp_Values-C39","v":2039709.9959999919},{"$f":"SUM(F39,I39:L39)","v":0},0,null,null,0,0,0,0]
[null,"Profit after tax",{"$f":"C38-C39","v":227791584.55308646},175827142.61627999,403618727.1693666,292510809.23139167,0,0,0,6316646.4975960515,0,{"$f":"L38-L39","v":104791271.44037905}]

{"sheet":"8.2 Capex","index":23,"n_rows":251,"n_cols":10,"rows_kept":251,"cut":false,"hidden":false,"merged":[[62,1,65,1],[63,2,64,2],[52,2,52,5],[53,2,53,5],[54,2,54,5],[62,2,62,9],[63,6,63,9],[85,2,85,3],[45,2,45,5],[46,2,46,5],[47,2,47,5],[65,2,65,3],[57,2,57,5],[83,3,84,3],[63,4,64,4],[81,1,81,2],[58,2,58,5],[63,3,64,3],[63,5,64,5],[83,1,85,1],[83,2,84,2],[65,5,65,9],[48,2,48,5],[83,5,84,5],[43,2,43,5],[44,2,44,5],[55,2,55,5],[56,2,56,5],[50,2,50,5],[51,2,51,5],[49,2,49,5],[83,4,84,4],[6,1,6,4],[41,1,41,4],[10,1,10,4],[7,1,7,4],[8,1,8,4],[14,1,14,4],[16,1,19,1],[16,2,16,9],[17,2,18,2],[17,3,18,3],[17,4,18,4],[17,5,18,5],[17,6,17,9],[19,2,19,3],[19,5,19,9],[140,4,141,4],[197,4,198,4],[140,3,141,3],[140,2,141,2],[197,2,198,2],[197,1,199,1],[140,1,142,1],[197,3,198,3],[142,2,142,3],[199,2,199,3]]}
[null,{"$f":"(LOOKUP(dms_Model,dms_Model_List,dms_Worksheet_List))","v":"REGULATORY REPORTING STATEMENT"}]
[null,{"$f":"dms_TradingName","v":"SA Power Networks"}]
[null,{"$f":"CONCATENATE(\"Annual Reporting RIN Response \",CRY)","v":"Annual Reporting RIN Response 2015-16"}]
[null,"8.2 - CAPEX"]
[]
[null,"Instructions"]
[null,"Reported expenditure must EXCLUDE capital contributions (except tables 8.2.1 and 8.2.5 which should include all capital contributions)."]
[null,{"$f":"CONCATENATE(\"Forecast expenditure is to be taken from \",dms_TradingName,\"'s \",dms_DeterminationRef,\".\")","v":"Forecast expenditure is to be taken from SA Power Networks's 2015-20 Distribution Determination."}]
[null,"If allocating based on assumptions then provide method in Basis of Preparation. All adjustments must be explained in Basis of Preparation with supporting documentation attached. "]
[]
[null,"For tables 8.2.1 and 8.2.3:\nReported expenditure must INCLUDE any profit margins or management fees paid directly or indirectly to related party contractors (not including actual incurred expenses of the related party contractor) for the regulatory reporting period.\n\n'Related Party Margin Expenditure' must COMPRISE ONLY profit margins or management fees paid directly or indirectly to related party contractors (not including actual incurred expenses of the related party contractor) for the regulatory reporting period."]
[]
[null,"8.2.1 - CAPEX BY PURPOSE - STANDARD CONTROL SERVICES"]
[]
[null,"Each line item in this table must INCLUDE the capital contributions. Total capital contributions should also be identified in the last item in the table. "]
[]
[null,"Description","EXPENDITURE"]
[null,null,"CPI adjusted Forecast","Actual","Difference","Related Party Margin","Voltage level"]
[null,null,null,null,null,null,"Subtransmission","HV","LV","Other "]
[null,null,"$0's, nominal",null," (%)","$0's, nominal"]
[null,"Replacement Expenditure",117781357.21782424,{"$f":"SUM(G21:J21)","v":83125255.349999994},{"$f":"IF(C21=0,1,(D21-C21)/C21*1)","v":-0.29424097910275754},0,5002395.053557016,15415819.503919596,48944601.313476779,13762439.479046613]
[null,"Connections",99070371.094477922,{"$f":"SUM(G22:J22)","v":55537467.969999999},{"$f":"IF(C22=0,1,(D22-C22)/C22*1)","v":-0.43941395034205538},0,691858.00644565956,32832909.304442093,22012700.649112239,1.000000536441803E-2]
[null,"Augmentation Expenditure",97276564.38517791,51680564.969999999,-0.46872542943267642,0,25810462.678275295,19310566.545182597,793572.7065421117,5765963.0399999991]
[null,"Non-Network",133149163.22796215,76417968.890000001,-0.42607248113781798,0,0,0,0,76417968.890000001]
[null,"Capitalised Network Overheads",16666306.726806676,7889275.0799999991,-0.52663327218677602,0,1305795.2870804647,2800171.5744398977,2973902.5346296825,809405.68384995428]
[null,"Capitalised Corporate Overheads",-9872438.1712739635,{"$f":"SUM(G26:J26)","v":-13251556.65},0.34227800874543102,0,0,0,0,-13251556.65]
[null,"Balancing Item",null,-237665.3599999994,1,0,0,-237665.3599999994,0,0]
[null,null,null,0,1]
[null,null,null,0,1]
[null,null,null,{"$f":"SUM(G30:J30)","v":0},1]
[null,null,null,0,1]
[null,null,null,0,1]
[null,null,null,0,1]
[null,null,null,0,1]
[null,null,null,0,1]
[null,"Capital contributions included in the above",71258656.563526452,30384252.998888895,-0.57360614886415084,0,null,null,null,30384252.998888895]
[null,"Total",{"$f":"SUM(C21:C35)","v":454071324.48097497},261161310.25,{"$f":"IF(C37=0,1,(D37-C37)/C37*1)","v":-0.42484518142932776},null,{"$f":"SUM(G21:G35)","v":32810511.025358435},{"$f":"SUM(H21:H35)","v":70121801.567984179},74724777.203760818,83504220.452896565]
[]
[]
[null,"8.2.2 - CAPEX BY PURPOSE - MATERIAL DIFFERENCE EXPLANATION"]
[]
[null,"Where the difference between forecast and actual expenditure shown in table 8.2.1 is a Material Difference please explain the main factors driving the difference."]
[]
[null,"Description","Reason for material difference"]
[null,"Replacement Expenditure","Significant uncertainty arose from the AER's Preliminary Determination for the 2015-20 Regulatory Control Period (RCP), which formed the basis of planning for year 1, being 2015/16.  In its expenditure decisions, SA Power Networks adopts a commercially prudent and risk-based stance that takes account of forecasted regulatory conditions.  2015/16 Repex in total was below forecast, but ramped up as the year progressed. "]
[null,"Connections","Connections are below forecast due to major (commercial) customer connections being significantly lower compared to historical connections, primarily a result of a subdued economic climate in South Australia. Minor and medium customer connections (and alterations) are marginally above forecast for the 2015/16 period. "]
[null,"Augmentation Expenditure","Significant uncertainty arose from the AER's Preliminary Determination for the 2015-20 RCP, which formed the basis of planning for year 1, being 2015/16.  In its expenditure decisions, SA Power Networks adopts a commercially prudent and risk-based stance that takes account of forecasted regulatory conditions.  Under certain conditions, high risk projects are assigned priority, and opportunities for prudent and efficient deferrals are considered.  Timing of some large projects can also vary according to circumstances.  Augex expenditure is below forecast in 2015/16 as the focus was primarily on implementing higher priority projects in the transitional year. "]
[null,"Non-Network","Significant uncertainty arose from the AER's Preliminary Determination for the 2015-20 RCP, which formed the basis of planning for year 1, being 2015/16.  In its expenditure decisions, SA Power Networks adopts a commercially prudent and risk-based stance that takes account of forecasted regulatory conditions.  Under certain conditions, high risk projects are assigned priority, and opportunities for prudent and efficient deferrals are considered.  Timing of some large projects can also vary according to circumstances. Non-Network expenditure is below forecast in 2015/16 as the focus was primarily on implementing higher priority projects and programs in the transitional year.  A number of lower priority projects and programs were deferred and timing of major IT projects has also affected expenditure profiles."]
[null,"Capitalised Network Overheads","Capitalised Network Overheads are lower than forecast commensurate with the lower capital spend across the Replacement, Connections and Augmentation categories."]
[null,"Capitalised Corporate Overheads","Represents an adjustment to report superannuation on a cash payments basis in accordance with SA Power Networks' Cost Allocation Method.  Lower contributions than forecast in 2015/16 relate to an identified surplus in the defined benefit superannuation scheme."]
[]
[]
[]
[]
[]
[]
[]
[]
[]
[]
[]
[null,"8.2.3 - CAPEX OTHER"]
[null,null,"EXPENDITURE"]
[null,null,"CPI adjusted Forecast","Actual","Difference","Related Party Margin","Voltage level"]
[null,null,null,null,null,null,"Subtransmission","HV","LV","Other "]
[null,null,"$0's, nominal",null," (%)","$0's, nominal"]
[null,"Public lighting"]
[null,{"$f":"IF(dms_Jurisdiction=\"Vic\",\"Energy Efficient\", \"Total\")","v":"Total"},null,{"$f":"SUM(G68:J68)","v":0},{"$f":"IF(C68=0,1,((D68-C68)/C68)*1)","v":1}]
[null,{"$f":"IF(dms_Jurisdiction=\"Vic\",\"Non-energy efficient\", \"\")","v":""},null,{"$f":"SUM(G69:J69)","v":0},{"$f":"IF(C69=0,1,((D69-C69)/C69)*1)","v":1}]
[null,"Alternative Control Services"]
[null,"Connection services",0,{"$f":"SUM(G71:J71)","v":0},{"$f":"IF(C71=0,1,((D71-C71)/C71)*1)","v":1},0,0,0,0,0]
[null,"Metering services",4327507.4469573619,1914158.4745454555,{"$f":"IF(C72=0,1,((D72-C72)/C72)*1)","v":-0.55767644585076659},0,0,0,1914158.4745454555,0]
[null,"Ancillary network services",0,0,{"$f":"IF(C73=0,1,((D73-C73)/C73)*1)","v":1},0,0,0,0,0]
[null,"Negotiated Services"]
[null,"Negotiated services",0,{"$f":"SUM(G75:J75)","v":3219708.3169696969},{"$f":"IF(C75=0,1,((D75-C75)/C75)*1)","v":1},0,0,0,3219708.3169696969,0]
[null,"Total",{"$f":"SUM(C68:C69,C71:C73,C75)","v":4327507.4469573619},{"$f":"SUM(D68:D69,D71:D73,D75)","v":5133866.7915151529},{"$f":"IF(C76=0,1,((C76-#REF!)/#REF!)*1)","v":{"$error":"#REF!"}},null,{"$f":"SUM(G68:G69,G71:G73,G75)","v":0},{"$f":"SUM(H68:H69,H71:H73,H75)","v":0},{"$f":"SUM(I68:I69,I71:I73,I75)","v":5133866.7915151529},{"$f":"SUM(J68:J69,J71:J73,J75)","v":0}]
[]
[]
[]
[null,"8.2.4 - CAPEX BY ASSET CLASS"]
[]
[null,{"$f":"CONCATENATE(dms_TradingName, \" to enter in Table 8.2.4 each Asset Class specified in its current determination as listed in the AER's final decision in its Roll Forward Model and Post-tax Revenue Model and enter information against that Asset Class.\")","v":"SA Power Networks to enter in Table 8.2.4 each Asset Class specified in its current determination as listed in the AER's final decision in its Roll Forward Model and Post-tax Revenue Model and enter information against that Asset Class."}]
[]
[null,"Asset class","CPI adjusted Forecast","Actual ","Difference","Movements in provisions \nallocated to \nas-incurred capex"]
[]
[null,null,"$0's, nominal",null," (%)","$0's, nominal"]
[null,"Sub-transmission Lines",10177324.395974038,3442868.4547302881,-0.66171182908425097,-33678.380481176515]
[null,"Distribution Lines",164992689.57970926,-179290351.20076963,-2.0866563340320181,-747805.75130076951]
[null,"Substations",44634451.687398084,208848064.10931849,3.6790776230882622,-568171.32517424563]
[null,"Distribution Transformers",17077914.520533506,38480524.504656471,1.2532332304620504,-71420.142702779267]
[null,"Low Voltage Services",5491056.5492553478,81439149.549938887,13.831234903414536,-949878.74281128717]
[null,"Communications",14918006.48864899,12839542.517849583,-0.13932585244421875,-142889.80806525881]
[null,"Substation Land",1607998.4942864359,6226195.7237247294,2.8720158917111807,0]
[null,"Easements",581569.77697349899,435545.47303077905,-0.25108647272324469,-4002.6723779107192]
[null,"Land",0,-5876766.7684358293,1,0]
[null,"Buildings",14546095.287006468,0,-1,0]
[null,"Heavy Vehicles - 15 Years",2906528.9731562999,4969673.6870209528,0.70983111915248276,-47603.293478283158]
[null,"Heavy Vehicles - 10 Years",20918599.11964209,3179792.8486727169,-0.84799207487622996,-33084.378174026213]
[null,"Light Vehicles",12688864.822773851,6257536.6399999997,-0.5068481911187962,0]
[null,"Information Technology",64257104.190972395,40529873.156662367,-0.36925459578434461,-323509.76131369994]
[null,"Plant and Tools / Office Furniture",8014326.4116205573,9295408.5547111109,0.15984901004693533,0]
[null,"Equity Raising Costs",13723167.612777064,13723167.617035648,3.1032079118331549E-10,0]
[null,null,null,null,{"$f":"IF(C103=0,1,((D103-C103)/C103)*1)","v":1}]
[null,null,null,null,1]
[null,null,null,null,1]
[null,null,null,null,1]
[null,null,null,null,{"$f":"IF(C107=0,1,((D107-C107)/C107)*1)","v":1}]
[null,null,null,null,1]
[null,null,null,null,1]
[null,null,null,null,1]
[null,null,null,null,1]
[null,null,null,null,1]
[null,null,null,null,1]
[null,null,null,null,1]
[null,null,null,null,1]
[null,null,null,null,1]
[null,null,null,null,{"$f":"IF(C117=0,1,((D117-C117)/C117)*1)","v":1}]
[null,null,null,null,1]
[null,null,null,null,1]
[null,null,null,null,1]
[null,null,null,null,1]
[null,null,null,null,1]
[null,null,null,null,1]
[null,null,null,null,1]
[null,null,null,null,1]
[null,null,null,null,1]
[null,null,null,null,1]
[null,null,null,null,1]
[null,null,null,null,1]
[null,null,null,null,1]
[null,null,null,null,1]
[null,null,null,null,1]
[null,null,null,null,1]
[null,null,null,null,1]
[null,null,null,null,1]
[null,null,null,null,1]
[null,"Total",{"$f":"SUM(C87:C136)","v":396535697.91072786},{"$f":"SUM(D87:D136)","v":244500224.86814657},-0.38340929667524931,{"$f":"SUM(F87:F136)","v":-2922044.2558794371}]
[]
[]
[null,"8.2.5 - CAPITAL CONTRIBUTIONS BY ASSET CLASS"]
[null,"Asset class","CPI Adjusted Forecast","Actual","Difference"]
[]
[null,null,"$0's, nominal",null," (%)"]
[null,{"$f":"IF(ISBLANK(B87),\"\",B87)","v":"Sub-transmission Lines"},0,0,{"$f":"IF(C144=0,1,((D144-C144)/C144)*1)","v":1}]
[null,"Distribution Lines",80362353.088312149,40162953.476196311,{"$f":"IF(C145=0,1,((D145-C145)/C145)*1)","v":-0.50022676125398835}]
[null,"Substations",0,0,1]
[null,"Distribution Transformers",0,2069023.12,1]
[null,"Low Voltage Services",23569722.481194794,17402032.292692587,-0.26167852393778185]
[null,"Communications",0,0,1]
[null,"Substation Land",0,0,1]
[null,"Easements",0,0,1]
[null,"Land",0,0,1]
[null,"Buildings",0,0,1]
[null,"Heavy Vehicles - 15 Years",0,0,1]
[null,"Heavy Vehicles - 10 Years",0,0,1]
[null,"Light Vehicles",0,0,1]
[null,"Information Technology",0,0,1]
[null,"Plant and Tools / Office Furniture",0,0,1]
[null,"Equity Raising Costs",0,0,1]
[null,"",null,null,1]
[null,"",null,null,1]
[null,"",null,null,1]
[null,"",null,null,1]
[null,"",null,null,1]
[null,"",null,null,1]
[null,"",null,null,1]
[null,"",null,null,1]
[null,"",null,null,1]
[null,"",null,null,1]
[null,"",null,null,1]
[null,"",null,null,1]
[null,"",null,null,1]
[null,"",null,null,{"$f":"IF(C173=0,1,((D173-C173)/C173)*1)","v":1}]
[null,"",null,null,1]
[null,"",null,null,1]
[null,{"$f":"IF(ISBLANK(B119),\"\",B119)","v":""},null,null,1]
[null,"",null,null,1]
[null,"",null,null,1]
[null,"",null,null,1]
[null,"",null,null,1]
[null,"",null,null,1]
[null,"",null,null,1]
[null,"",null,null,{"$f":"IF(C183=0,1,((D183-C183)/C183)*1)","v":1}]
[null,"",null,null,1]
[null,"",null,null,1]
[null,"",null,null,1]
[null,"",null,null,1]
[null,"",null,null,1]
[null,"",null,null,1]
[null,"",null,null,1]
[null,"",null,null,1]
[null,"",null,null,1]
[null,"",null,null,1]
[null,"Total",{"$f":"SUM(C183:C193)","v":0},{"$f":"SUM(D183:D193)","v":0},1]
[]
[]
[null,"8.2.6 - DISPOSALS BY ASSET CLASS"]
[null,"Asset class","CPI Adjusted Forecast","Actual","Difference"]
[]
[null,null,"$0's, nominal",null," (%)"]
[null,{"$f":"IF(ISBLANK(B87),\"\",B87)","v":"Sub-transmission Lines"},0,0,{"$f":"IF(C201=0,1,((D201-C201)/C201)*1)","v":1}]
[null,"Distribution Lines",0,0,{"$f":"IF(C202=0,1,((D202-C202)/C202)*1)","v":1}]
[null,"Substations",0,0,1]
[null,"Distribution Transformers",0,0,1]
[null,"Low Voltage Services",0,0,1]
[null,"Communications",0,0,1]
[null,"Substation Land",0,0,1]
[null,"Easements",0,0,1]
[null,"Land",0,0,1]
[null,"Buildings",0,0,1]
[null,"Heavy Vehicles - 15 Years",282694.18386491557,439818.74,0.55581106758873344]
[null,"Heavy Vehicles - 10 Years",335572.23264540336,516766.89,0.53995724236833287]
[null,"Light Vehicles",3471443.9024390243,1084857.18,-0.68749108138034931]
[null,"Information Technology",0,0,1]
[null,"Plant and Tools / Office Furniture",0,0,1]
[null,"Equity Raising Costs",0,0,1]
[null,"",null,null,1]
[null,"",null,null,1]
[null,"",null,null,1]
[null,"",null,null,1]
[null,"",null,null,1]
[null,"",null,null,1]
[null,"",null,null,1]
[null,"",null,null,1]
[null,"",null,null,1]
[null,"",null,null,1]
[null,"",null,null,1]
[null,"",null,null,1]
[null,"",null,null,1]
[null,"",null,null,1]
[null,"",null,null,{"$f":"IF(C231=0,1,((D231-C231)/C231)*1)","v":1}]
[null,"",null,null,1]
[null,{"$f":"IF(ISBLANK(B119),\"\",B119)","v":""},null,null,1]
[null,"",null,null,1]
[null,"",null,null,1]
[null,"",null,null,1]
[null,"",null,null,1]
[null,"",null,null,1]
[null,"",null,null,1]
[null,"",null,null,1]
[null,"",null,null,1]
[null,"",null,null,1]
[null,"",null,null,1]
[null,"",null,null,1]
[null,"",null,null,1]
[null,"",null,null,1]
[null,"",null,null,1]
[null,"",null,null,1]
[null,"",null,null,1]
[null,"",null,null,1]
[null,"Total",{"$f":"SUM(C201:C250)","v":4089710.3189493432},{"$f":"SUM(D201:D250)","v":2041442.81},-0.50083437437093303]

{"sheet":"8.4 Opex","index":24,"n_rows":141,"n_cols":14,"rows_kept":141,"cut":false,"hidden":false,"merged":[[80,8,80,13],[78,6,79,6],[78,7,79,7],[142,2,142,7],[143,2,143,7],[80,2,80,4],[78,5,79,5],[19,2,19,6],[139,2,139,7],[140,2,140,7],[141,2,141,7],[137,1,137,4],[16,1,19,1],[77,5,77,7],[17,5,18,5],[17,6,18,6],[17,7,18,7],[16,5,16,7],[75,1,75,4],[77,1,80,1],[77,2,79,2],[77,3,79,3],[77,4,79,4],[16,13,18,13],[77,13,79,13],[19,8,19,13],[17,8,17,9],[78,8,78,9],[78,10,78,12],[17,10,17,12],[16,8,16,12],[77,8,77,12],[6,1,6,4],[14,1,14,5],[16,2,18,2],[16,3,18,3],[16,4,18,4],[12,1,12,5],[7,1,7,4],[13,1,13,5]]}
[null,{"$f":"(LOOKUP(dms_Model,dms_Model_List,dms_Worksheet_List))","v":"REGULATORY REPORTING STATEMENT"}]
[null,{"$f":"dms_TradingName","v":"SA Power Networks"}]
[null,{"$f":"CONCATENATE(\"Annual Reporting RIN Response \",CRY)","v":"Annual Reporting RIN Response 2015-16"}]
[null,"8.4 OPEX"]
[]
[null,"Instructions"]
[null,{"$f":"CONCATENATE(\"Forecast expenditure is to be taken from \",dms_TradingName,\"'s \",dms_DeterminationRef,\".\")","v":"Forecast expenditure is to be taken from SA Power Networks's 2015-20 Distribution Determination."}]
[null,"If allocating based on assumptions then provide method in Basis of Preparation.  \n\nAll adjustments must be explained in Basis of Preparation with supporting documentation attached. "]
[]
[null,"8.4.1 - OPERATING & MAINTENANCE EXPENDITURE - BY PURPOSE"]
[]
[]
[null,{"$f":"CONCATENATE(dms_TradingName,\" is to list the operating expenditure categories identified in \", dms_TradingName,\"'s regulatory proposal at table 3.2.1.1 current opex categories and cost allocations.\")","v":"SA Power Networks is to list the operating expenditure categories identified in SA Power Networks's regulatory proposal at table 3.2.1.1 current opex categories and cost allocations."}]
[null,{"$f":"CONCATENATE(dms_TradingName, \" must specify any expenditure category where the expense is more than 5 per cent of the total standard control services operating expenditure.\")","v":"SA Power Networks must specify any expenditure category where the expense is more than 5 per cent of the total standard control services operating expenditure."}]
[null,"Reported operating expenditure must INCLUDE any profit margins or management fees paid directly or indirectly to related party contractors (not including actual incurred expenditure of the related party contractor) for the regulatory reporting period.  "]
[]
[null,"Opex category","Audited Statutory Accounts","Adjustments","Distribution business","Standard Control Services",null,null,"Alternative Control Services",null,null,null,null,"Negotiated Services"]
[null,null,null,null,null,"CPI Adjusted Forecast","Actual","Difference","Public Lighting",null,"Other"]
[null,null,null,null,null,null,null,null,{"$f":"IF(dms_Jurisdiction=\"Vic\",\"Energy efficient\",\"\")","v":""},{"$f":"IF(dms_Jurisdiction=\"Vic\",\"Non-energy efficient\",\"\")","v":""},"Connection services","Metering services","Ancillary network services"]
[null,null,"$0's, nominal",null,null,null,null,"%","$0's, nominal"]
[null,"Distribution Licence Fee",{"$f":"SUM(D21:E21)","v":2558186.8199999998},0,{"$f":"SUM(G21,K21:N21)","v":2558186.8199999998},2733208.7399184909,2558186.8199999998,{"$f":"IF(F21=0,1,((G21-F21)/F21)*1)","v":-6.403532864588693E-2},null,null,0,0,0,0]
[null,"Network Operating Costs",{"$f":"SUM(D22:E22)","v":26327893.280000001},0,{"$f":"SUM(G22,K22:N22)","v":26327893.280000001},31212894.70870335,26327893.280000001,-0.15650587599429616,null,null,0,0,0,0]
[null,"Inspections",{"$f":"SUM(D23:E23)","v":13641343.41},0,{"$f":"SUM(G23,K23:N23)","v":13641343.41},18289383.165783793,13641343.41,-0.25413868328153649,null,null,0,0,0,0]
[null,"Maintenance and Repair",24446570.519999996,0,24446570.519999996,14748616.514373058,14396779.889999997,-2.385556801413774E-2,null,null,0,2726925.52,0,7322865.1100000003]
[null,"Substation Property Maintenance",6864052.4920576001,77517.820000000007,6786534.6720575998,7116194.578774577,6786534.6720575998,-4.632530814998391E-2,null,null,0,0,0,0]
[null,"Vegetation Management",32029751.129999999,0,32029751.129999999,37210003.895123713,32029751.129999999,-0.13921666817676884,null,null,0,0,0,0]
[null,"Emergency Response",34747494.260000005,0,34747494.260000005,35205087.658366479,34747494.260000005,-1.2997933787496953E-2,null,null,0,0,0,0]
[null,"Guaranteed Service Level Payments",3389550,0,3389550,5785977.110694183,3389550,-0.41417846369714856,null,null,0,0,0,0]
[null,"Network Insurance",1641531.1881209998,0,1641531.1881209998,2115563.9565921202,1641531.1881209998,-0.22406922135066121,null,null,0,0,0,0]
[null,"Call Centre",3210252.2,0,3210252.2,3122157.5051902393,3210252.2,2.8215967536331293E-2,null,null,0,0,0,0]
[null,"Full Retail Contestability",18193754.495000001,0,18193754.495000001,15693765.853733372,15865522.385866668,1.094425224220082E-2,null,null,0,2328232.1091333334,0,0]
[null,"Meter Reading",4120888.6199999992,0,4120888.6199999992,0,0,1,null,null,0,3562050.0499999993,0,558838.57000000007]
[null,"Other Customer Services",19235553.460000001,0,19235553.460000001,6950041.7102600085,6946344.6208092701,-5.3195212415496152E-4,null,null,0,127291.2865803957,0,12161917.552610334]
[null,"Corporate Costs and Other Operating",183677728.44773421,21848957.510528088,161828770.93720612,65439758.602408335,52874705.793141991,-0.19200946148972989,null,null,0,1080225.0975399241,0,107873840.0465242]
[null,null,null,null,null,null,null,1]
[null,null,null,null,null,null,null,{"$f":"IF(F36=0,1,((G36-F36)/F36)*1)","v":1}]
[null,null,null,null,null,null,null,1]
[null,null,null,null,null,null,null,1]
[null,null,null,null,null,null,null,1]
[null,null,null,null,null,null,null,1]
[null,null,null,null,null,null,null,1]
[null,null,null,null,null,null,null,{"$f":"IF(F42=0,1,((G42-F42)/F42)*1)","v":1}]
[null,null,null,null,null,null,null,1]
[null,null,null,null,null,null,null,1]
[null,null,null,null,null,null,null,1]
[null,null,null,null,null,null,null,1]
[null,null,null,null,null,null,null,1]
[null,null,null,null,null,null,null,1]
[null,null,null,null,null,null,null,1]
[null,null,null,null,null,null,null,1]
[null,null,null,null,null,null,null,1]
[null,null,null,null,null,null,null,1]
[null,null,null,null,null,null,null,1]
[null,null,null,null,null,null,null,1]
[null,null,null,null,null,null,null,1]
[null,null,null,null,null,null,null,1]
[null,null,null,null,null,null,null,1]
[null,null,null,null,null,null,null,1]
[null,null,null,null,null,null,null,1]
[null,null,null,null,null,null,null,1]
[null,null,null,null,null,null,null,1]
[null,null,null,null,null,null,null,1]
[null,null,null,null,null,null,null,1]
[null,null,null,null,null,null,null,1]
[null,null,null,null,null,null,null,1]
[null,null,null,null,null,null,null,1]
[null,null,null,null,null,null,null,1]
[null,null,null,null,null,null,null,1]
[null,null,null,null,null,null,null,1]
[null,null,null,null,null,null,null,1]
[null,"Total",{"$f":"SUM(C21:C70)","v":374084550.32291281},21926475.330528088,352158074.99238467,245622653.99992168,214415889.64999652,-0.12705165359028778,{"$f":"SUM(I21:I70)","v":0},0,0,9824724.0632536523,0,127917461.27913453]
[]
[]
[null,"8.4.2 - OPERATING & MAINTENANCE EXPENDITURE - BY PURPOSE - MARGINS ONLY"]
[]
[null,"\"Related party margin expenditure' must COMPRISE ONLY profit margins or management fees paid directly or indirectly to related party contractors (for expenditure that is not an actual incurred expenditure of the related party contractor) for the regulatory reporting period."]
[]
[null,"Opex category","Audited Statutory Accounts","Adjustments","Distribution business","Standard Control Services",null,null,"Alternative Control Services",null,null,null,null,"Negotiated Services"]
[null,null,null,null,null,"CPI Adjusted Forecast","Actual","Difference","Public Lighting",null,"Other"]
[null,null,null,null,null,null,null,null,{"$f":"IF(dms_Jurisdiction=\"Vic\",\"Energy efficient\",\"\")","v":""},{"$f":"IF(dms_Jurisdiction=\"Vic\",\"Non-energy efficient\",\"\")","v":""},"Connection services","Metering services","Ancillary network services"]
[null,null,"$0's, nominal",null,null,null,"$0's, nominal","per cent","$0's, nominal"]
[null,{"$f":"IF(ISBLANK(B21),\"\",B21)","v":"Distribution Licence Fee"},{"$f":"SUM(D82:E82)","v":0},0,{"$f":"SUM(G82,K82:N82)","v":0},0,0,{"$f":"IF(F82=0,1,((G82-F82)/F82)*1)","v":1},null,null,0,0,0,0]
[null,"Network Operating Costs",{"$f":"SUM(D83:E83)","v":0},0,{"$f":"SUM(G83,K83:N83)","v":0},0,0,1,null,null,0,0,0,0]
[null,"Inspections",{"$f":"SUM(D84:E84)","v":0},0,{"$f":"SUM(G84,K84:N84)","v":0},0,0,1,null,null,0,0,0,0]
[null,"Maintenance and Repair",0,0,0,0,0,1,null,null,0,0,0,0]
[null,"Substation Property Maintenance",0,0,0,0,0,1,null,null,0,0,0,0]
[null,"Vegetation Management",0,0,0,0,0,1,null,null,0,0,0,0]
[null,"Emergency Response",0,0,0,0,0,1,null,null,0,0,0,0]
[null,{"$f":"IF(ISBLANK(B27),\"\",B27)","v":"Emergency Response"},0,0,0,0,0,{"$f":"IF(F89=0,1,((G89-F89)/F89)*1)","v":1},null,null,0,0,0,0]
[null,"Guaranteed Service Level Payments",0,0,0,0,0,1,null,null,0,0,0,0]
[null,"Network Insurance",0,0,0,0,0,1,null,null,0,0,0,0]
[null,"Call Centre",0,0,0,0,0,1,null,null,0,0,0,0]
[null,"Full Retail Contestability",0,0,0,0,0,1,null,null,0,0,0,0]
[null,"Meter Reading",0,0,0,0,0,1,null,null,0,0,0,0]
[null,"Other Customer Services",0,0,0,0,0,1,null,null,0,0,0,0]
[null,"Corporate Costs and Other Operating",0,0,0,0,0,1,null,null,0,0,0,0]
[null,"",null,null,null,null,null,1]
[null,"",null,null,null,null,null,{"$f":"IF(F98=0,1,((G98-F98)/F98)*1)","v":1}]
[null,"",null,null,null,null,null,1]
[null,"",null,null,null,null,null,1]
[null,"",null,null,null,null,null,1]
[null,"",null,null,null,null,null,1]
[null,"",null,null,null,null,null,1]
[null,"",null,null,null,null,null,{"$f":"IF(F104=0,1,((G104-F104)/F104)*1)","v":1}]
[null,"",null,null,null,null,null,1]
[null,"",null,null,null,null,null,1]
[null,"",null,null,null,null,null,1]
[null,"",null,null,null,null,null,1]
[null,"",null,null,null,null,null,1]
[null,"",null,null,null,null,null,1]
[null,"",null,null,null,null,null,1]
[null,"",null,null,null,null,null,1]
[null,"",null,null,null,null,null,1]
[null,"",null,null,null,null,null,1]
[null,"",null,null,null,null,null,1]
[null,"",null,null,null,null,null,1]
[null,"",null,null,null,null,null,1]
[null,"",null,null,null,null,null,1]
[null,"",null,null,null,null,null,1]
[null,"",null,null,null,null,null,1]
[null,"",null,null,null,null,null,1]
[null,"",null,null,null,null,null,1]
[null,"",null,null,null,null,null,1]
[null,"",null,null,null,null,null,1]
[null,"",null,null,null,null,null,1]
[null,"",null,null,null,null,null,1]
[null,"",null,null,null,null,null,1]
[null,"",null,null,null,null,null,1]
[null,"",null,null,null,null,null,1]
[null,"",null,null,null,null,null,1]
[null,"",null,null,null,null,null,1]
[null,null,null,null,null,null,null,1]
[null,"Total",{"$f":"SUM(C82:C132)","v":0},{"$f":"SUM(D82:D132)","v":0},{"$f":"SUM(E82:E132)","v":0},{"$f":"SUM(F82:F132)","v":0},{"$f":"SUM(G82:G132)","v":0},1,{"$f":"SUM(I82:I132)","v":0},{"$f":"SUM(J82:J132)","v":0},0,0,{"$f":"SUM(M82:M132)","v":0},{"$f":"SUM(N82:N132)","v":0}]
[]
[]
[null,"8.4.3 - OPERATING & MAINTENANCE EXPENDITURE - EXPLANATION OF MATERIAL DIFFERENCE"]
[]
[null,"Where the difference between forecast and actual expenditure shown in table 8.4.1, column I is a Material Difference please explain the main factors driving the difference."]
[]
[null,"Category","Explanation"]
[null,"INSUFFICIENT ROWS AVAILABLE AND UNABLE TO INSERT ROWS IN LOCKED VERSION - REFER 8.4.3 OPEX UNLOCKED"]

{"sheet":"8.4.3 Opex Unlocked","index":25,"n_rows":17,"n_cols":3,"rows_kept":17,"cut":false,"hidden":false,"merged":[[15,2,15,7],[16,2,16,7],[8,1,8,4],[10,2,10,7],[11,2,11,7],[12,2,12,7],[13,2,13,7],[14,2,14,7]]}
[null,{"$f":"(LOOKUP(dms_Model,dms_Model_List,dms_Worksheet_List))","v":"REGULATORY REPORTING STATEMENT"}]
[null,{"$f":"dms_TradingName","v":"SA Power Networks"}]
[null,{"$f":"CONCATENATE(\"Annual Reporting RIN Response \",CRY)","v":"Annual Reporting RIN Response 2015-16"}]
[null,"8.4 OPEX"]
[]
[]
[null,"8.4.3 - OPERATING & MAINTENANCE EXPENDITURE - EXPLANATION OF MATERIAL DIFFERENCE"]
[]
[null,"Where the difference between forecast and actual expenditure shown in table 8.4.1, column I is a Material Difference please explain the main factors driving the difference."]
[]
[null,"Category","Explanation"]
[null,"Network Operating Costs","Expenditure is lower than forecast largely due to a diversion of regulatory compliance resources to the RIN Compliance capital project, a refund received for telephony services incorrectly charged in previous periods and lower asset system and quality assurance costs associated with the redirection of labour to specific capital projects for the collection and management of distribution network data (e.g. OMS/SCADA, QMS)."]
[null,"Inspections","Variation is primarily due to timing differences associated with the cyclical nature of the asset inspection program."]
[null,"Vegetation Management","Variation is primarily due to timing differences associated with the cyclical nature of the vegetation management program."]
[null,"Guaranteed Service Level Payments","The GSL forecast is based on a 5-year annual average of payments made in the 2010-15 regulatory control period.  The underspend in 2015/16 is due to an unusually low number of weather events (i.e. storms and heatwaves) impacting system reliability."]
[null,"Network Insurance","The variance is not material in dollar terms, but relates primarily to favourable negotiation of insurance policy premiums."]
[null,"Corporate Costs and Other Operating","Significant uncertainty arose from the AER's Preliminary Determination for the 2015-20 Regulatory Control Period (RCP), which formed the basis of planning for year 1, being 2015/16.  In its expenditure decisions, SA Power Networks adopts a commercially prudent and risk-based stance that takes account of forecasted regulatory conditions.   The underspend is primarily driven by a combination of delays in implementation of some business and system improvement initiatives, timing differences affecting expenditure profiles and targeted efficiencies."]

{"sheet":"9.5 TUoS","index":26,"n_rows":60,"n_cols":6,"rows_kept":60,"cut":false,"hidden":false,"merged":[[5,1,5,3],[21,1,21,3],[24,2,24,5],[36,1,36,4],[25,2,25,5],[24,1,27,1],[9,1,9,4],[10,1,10,4],[11,1,11,4],[12,1,12,4],[17,1,17,4],[18,1,18,4],[13,1,13,3],[50,1,50,4],[54,1,54,4],[52,1,52,4],[55,1,55,4],[56,1,56,4],[57,1,57,4],[51,1,51,4],[19,1,19,4],[20,1,20,4],[59,1,59,4],[53,1,53,4],[48,1,48,4],[58,1,58,4],[40,1,40,4],[44,1,44,4],[45,1,45,4],[46,1,46,4],[47,1,47,4],[41,1,41,4],[42,1,42,4],[43,1,43,4]]}
[null,{"$f":"(LOOKUP(dms_Model,dms_Model_List,dms_Worksheet_List))","v":"REGULATORY REPORTING STATEMENT"}]
[null,{"$f":"dms_TradingName","v":"SA Power Networks"}]
[null,{"$f":"CONCATENATE(\"Annual Reporting RIN Response \",CRY)","v":"Annual Reporting RIN Response 2015-16"}]
[null,"9.5 - TUoS AUDIT (t-2)"]
[]
[null,"This template collects information for annual pricing proposals from Victorian businesses only.\n"]
[]
[null,"9.5.1 - TUOS CHARGES (AEMO)"]
[null,null,null,null,null,{"$f":"CRY","v":"2015-16"}]
[]
[]
[]
[]
[null,null,null,null,"Total",{"$f":"SUM(F10:F13)","v":0}]
[]
[null,"9.5.2 - TRANSMISSION CONNECTION FEES"]
[null,null,null,null,null,{"$f":"CRY","v":"2015-16"}]
[]
[]
[]
[]
[null,null,null,null,"Total",{"$f":"SUM(F18:F21)","v":0}]
[]
[null,"9.5.3 - CROSS BOUNDARY NETWORK CHARGES"]
[null,"Distribution Business","Amount (payable)/receivable"]
[null,null,"$0's, nominal"]
[null,null,"HV crossings","Subtransmission crossings","TUoS Adjustment","Total"]
[null,null,null,null,null,{"$f":"CRY","v":"2015-16"}]
[null,null,null,null,null,{"$f":"IF((SUM(C29:E29)=0),\"\",(SUM(C29:E29)))","v":""}]
[null,null,null,null,null,{"$f":"IF((SUM(C30:E30)=0),\"\",(SUM(C30:E30)))","v":""}]
[null,null,null,null,null,""]
[null,null,null,null,null,""]
[null,null,null,null,null,""]
[null,null,null,null,null,""]
[null,null,null,null,null,""]
[null,null,null,null,null,""]
[null,"Total",null,null,null,""]
[]
[null,"9.5.4 - PAYMENTS TO EMBEDDED GENERATORS"]
[null,"9.5.4.1 - AVOIDED TRANSMISSION COSTS",null,null,null,{"$f":"CRY","v":"2015-16"}]
[]
[]
[]
[]
[]
[]
[]
[]
[null,"Total",null,null,null,{"$f":"SUM(F41:F48)","v":0}]
[null,"9.5.4.2 - AVOIDED TUoS USAGE CHARGES",null,null,null,{"$f":"CRY","v":"2015-16"}]
[]
[]
[]
[]
[]
[]
[]
[]
[null,"Total",null,null,null,{"$f":"SUM(F51:F58)","v":0}]
[null,"Total payments to embedded generators",null,null,null,{"$f":"F59+F49","v":0}]

{"sheet":"unlocked","index":27,"n_rows":0,"n_cols":0,"rows_kept":0,"cut":false,"hidden":false,"merged":[]}