{"text_format":"1","workbook":"xlsx","n_sheets":23,"sheets":["CF","AER only","Contents","Instructions","Business & other details","2.11 Labour","3.6 Quality of services","3.6.8 Network-feeders","3.6.9 Network-reliability","4.1 Public lighting","6.2 STPIS Reliability","6.6 STPIS Customer Service","6.7 STPIS Daily Performance","6.8 STPIS Exclusions","6.9 STPIS - GSL","7.8 Avoided TUOS Payments","7.10 Juris Scheme","7.11 DMIS-DMIA","7.12 Safety and Bushfire","8.1 Income","8.2 Capex","8.4 Opex","9.5 TUoS"],"not_rendered":{"charts":0,"images":8,"macros":1,"external_links":1,"defined_names":735,"comments":2,"pivot_tables":0},"unopened":[],"bounds":{"document_bytes":16777216,"sheet_cells":100000,"rows_first":2000,"rows_last":500,"rows_between":2000,"halvings":0,"cell_chars":16384,"cell_head_chars":4096},"cells_cut":0,"cells_raw":0,"read":"whole","date_system":"1900"}

{"sheet":"CF","index":0,"n_rows":25,"n_cols":24,"rows_kept":25,"cut":false,"hidden":true,"merged":[[1,1,1,23]]}
[]
[null,"CONDITIONAL FORMATTING MAP"]
[null,null,null,null,null,"=INDEX(dms_CF_3.6.5, MATCH(dms_TradingName,dms_CF_TradingName))=\"Y\"","=INDEX(dms_CF_3.6.6.1, MATCH(dms_TradingName,dms_CF_TradingName))=\"Y\"","=INDEX(dms_CF_3.6.6.2, MATCH(dms_TradingName,dms_CF_TradingName))=\"Y\"","=INDEX(dms_CF_3.6.6.3, MATCH(dms_TradingName,dms_CF_TradingName))=\"Y\"","=INDEX(dms_CF_3.6.7.1, MATCH(dms_TradingName,dms_CF_TradingName))=\"Y\"","=INDEX(dms_CF_3.6.7.2, MATCH(dms_TradingName,dms_CF_TradingName))=\"Y\"","=INDEX(dms_CF_3.6.7.3, MATCH(dms_TradingName,dms_CF_TradingName))=\"Y\"","=INDEX(dms_CF_3.6.7.4, MATCH(dms_TradingName,dms_CF_TradingName))=\"Y\"","=INDEX(dms_CF_6.6.1, MATCH(dms_TradingName,dms_CF_TradingName))=\"Y\"","=INDEX(dms_CF_6.6.2, MATCH(dms_TradingName,dms_CF_TradingName))=\"Y\"","=INDEX(dms_CF_6.6.3, MATCH(dms_TradingName,dms_CF_TradingName))=\"Y\"","=INDEX(dms_CF_6.6.4, MATCH(dms_TradingName,dms_CF_TradingName))=\"Y\"","=INDEX(dms_CF_6.8, MATCH(dms_TradingName,dms_CF_TradingName))=\"Y\"","=INDEX(dms_CF_7.12, MATCH(dms_TradingName,dms_CF_TradingName))=\"Y\"","=INDEX(dms_CF_8.1_A, MATCH(dms_TradingName,dms_CF_TradingName))=\"Y\"","=INDEX(dms_CF_8.1_B, MATCH(dms_TradingName,dms_CF_TradingName))=\"Y\"","=INDEX(dms_CF_8.1_Neg, MATCH(dms_TradingName,dms_CF_TradingName))=\"Y\""]
[null,"dms_CF_TradingName","JurisdictionList","Sector","Segment","dms_CF_3.6.5","dms_CF_3.6.6.1","dms_CF_3.6.6.2","dms_CF_3.6.6.3","dms_CF_3.6.7.1","dms_CF_3.6.7.2","dms_CF_3.6.7.3","dms_CF_3.6.7.4","dms_CF_6.6.1","dms_CF_6.6.2","dms_CF_6.6.3","dms_CF_6.6.4","dms_CF_6.8","dms_CF_7.12","dms_CF_8.1_A","dms_CF_8.1_B","dms_CF_8.1_Neg","Column1","Column3"]
[null,"ActewAGL Distribution","ACT","Electricity","Distribution","Y","N","Y","Y","Y","Y","N","Y","N","Y","Y","Y","Y","Y","N","Y","Y","N"]
[null,"Ausgrid","NSW","Electricity","Distribution","Y","N","Y","Y","N","N","N","Y","N","Y","Y","Y","Y","Y","N","Y","Y","N"]
[null,"AusNet (D)","Vic","Electricity","Distribution","N","N","N","N","N","N","N","N","N","Y","Y","Y","Y","N","N","N","Y","N"]
[null,"AusNet (T)","Vic","Electricity","Transmission","N","N","N","N","N","N","N","N","N","N","N","N","Y","N","N","N","Y","N"]
[null,"CitiPower","Vic","Electricity","Distribution","N","N","N","N","N","N","N","N","N","Y","Y","Y","Y","N","N","N","Y","N"]
[null,"Directlink","Qld","Electricity","Transmission","N","N","N","N","N","N","N","N","N","N","N","N","Y","N","N","Y","Y","N"]
[null,"ElectraNet","SA","Electricity","Transmission","N","N","N","N","N","N","N","N","N","N","N","N","Y","N","N","Y","Y","N"]
[null,"Endeavour Energy","NSW","Electricity","Distribution","Y","N","Y","Y","N","N","N","Y","N","Y","Y","Y","Y","Y","N","Y","Y","N"]
[null,"Energex","Qld","Electricity","Distribution","Y","N","N","N","N","N","N","N","N","Y","Y","Y","Y","Y","N","Y","Y","N"]
[null,"Ergon Energy","Qld","Electricity","Distribution","Y","N","Y","Y","N","N","N","N","N","Y","Y","Y","Y","Y","N","Y","Y","N"]
[null,"Essential Energy","NSW","Electricity","Distribution","Y","N","Y","Y","N","N","N","Y","N","Y","Y","Y","Y","Y","N","Y","Y","N"]
[null,"Jemena Electricity","Vic","Electricity","Distribution","N","N","N","N","N","N","N","N","N","Y","Y","Y","Y","N","N","N","Y","N"]
[null,"Murraylink","SA","Electricity","Transmission","N","N","N","N","N","N","N","N","N","N","N","N","Y","N","N","Y","Y","N"]
[null,"Power and Water","NT","Electricity","Distribution","N","N","N","N","N","Y","N","N","Y","Y","Y","Y","Y","Y","N","Y","Y","N"]
[null,"Powercor Australia","Vic","Electricity","Distribution","N","N","N","N","N","N","N","N","N","Y","Y","Y","Y","N","N","N","Y","N"]
[null,"Powerlink","Qld","Electricity","Transmission","N","N","N","N","N","N","N","N","N","N","N","N","Y","N","N","Y","Y","N"]
[null,"SA Power Networks","SA","Electricity","Distribution","Y","N","N","N","N","N","N","N","N","Y","Y","Y","Y","Y","Y","Y","N","N"]
[null,"TasNetworks (D)","Tas","Electricity","Distribution","Y","N","N","N","N","N","N","N","N","Y","Y","Y","Y","Y","N","Y","Y","N"]
[null,"TasNetworks (T)","Tas","Electricity","Transmission","N","N","N","N","N","N","N","N","N","N","N","N","Y","N","N","Y","Y","N"]
[null,"TransGrid","NSW","Electricity","Transmission","N","N","N","N","N","N","N","N","N","N","N","N","Y","N","N","Y","Y","N"]
[null,"United Energy","Vic","Electricity","Distribution","N","N","N","N","N","N","N","N","N","Y","Y","Y","Y","N","N","N","Y","N"]

{"sheet":"AER only","index":1,"n_rows":223,"n_cols":37,"rows_kept":223,"cut":false,"hidden":true,"merged":[[0,1,0,11],[4,24,4,35],[6,24,6,27],[6,30,6,34],[53,25,53,29],[53,30,53,33],[54,14,54,21],[54,25,54,29],[54,30,54,33],[72,14,72,15],[72,25,72,28],[93,1,95,1],[96,1,100,1],[104,1,105,1],[148,1,148,8],[54,1,54,5]]}
[null,"Data in these columns used for data validation and database purposes."]
[null,"Date last modified:","2017-01-16","added (Albury and Victora) for AGN"]
[null,null,"2016-10-17","updated TransGrid's correct legal name, corrected TasNetworks (T) to June financial year"]
[null,null,"2017-02-01","inserted Power and Water, added NRs (dms_FeederCat_1 and dms_FeederCat_2)"]
[null,null,"2017-03-03","inserted AEMO as a business",null,null,null,null,null,null,null,null,null,null,null,null,null,null,null,null,null,null,null,null,"FOR ELECTRICITY BUSINESSES ONLY"]
[null,null,"2018-03-28","major changes to accommodate STPIS"]
[null,null,"Template Version",5,null,null,null,null,null,null,null,null,null,null,null,null,null,null,null,null,null,null,null,null,"Feeder Types",null,null,null,"TasNetworks (D)","MAIFI flag","Feeder Names"]
[]
[null,null,null,null,null,null,null,null,null,null,null,null,null,null,null,null,null,null,null,null,null,null,null,null,"CBD","Urban","Short rural","long rural","EXTRA"]
[null,"dms_TradingName_List","dms_TradingNameFull_List","dms_ABN_List","dms_JurisdictionList","dms_Sector_List","dms_Segment_List","dms_FormControl_List","dms_RPT_List","dms_RPTMonth_List","dms_CRCPlength_List","dms_FRCPlength_List","dms_663_List","dms_DeterminationRef_List","dms_Addr1_List","dms_Addr2_List","dms_Suburb_List","dms_State_List","dms_PostCode_List","dms_PAddr1_List","dms_PAddr2_List","dms_PSuburb_List","dms_PState_List","dms_PPostCode_List","dms_CBD_flag","dms_Urban_flag","dms_ShortRural_flag","dms_LongRural_flag","dms_FeederType_5_flag","dms_MAIFI_flag_List","dms_FeederName_1","dms_FeederName_2","dms_FeederName_3","dms_FeederName_4","dms_FeederName_5","dms_Public_Lighting_List","Column1"]
[null,"ActewAGL Distribution","ActewAGL Distribution",76670568688,"ACT","Electricity","Distribution","Revenue cap","Financial","June",5,5,5,"2014-19 Distribution Determination","40 Bunda Street",null,"CANBERRA","ACT",2600,"GPO BOX 366",null,"CANBERRA","ACT",2601,"NO","YES","YES","NO","NO","NO","CBD","Urban","Short rural","Long rural","  ","YES","ActewAGL Distribution"]
[null,"ActewAGL Distribution (Tx Assets)","ActewAGL Distribution (Tx Assets)",76670568688,"ACT","Electricity","Distribution","Revenue cap","Financial","June",5,5,5,"distribution determination","40 Bunda Street",null,"CANBERRA","ACT",2600,"GPO BOX 366",null,"CANBERRA","ACT",2601,"NO","YES","YES","NO","NO","NO","CBD","Urban","Short rural","Long rural","  ","NO","ActewAGL Distribution (Tx Assets)"]
[null,"ActewAGL Gas","ActewAGL Gas",76670568688,"ACT","Gas","Distribution","Weighted average price cap","Financial","June",5,5,"x",null,"40 Bunda Street",null,"CANBERRA","ACT",2600,"GPO BOX 366",null,"CANBERRA","ACT",2601,"NO","NO","NO","NO","NO",null,"CBD","Urban","Short rural","Long rural","  ","NO","ActewAGL Gas"]
[null,"AEMO","Australian Energy Market Operator Ltd",94072010327,"Vic","Electricity","Transmission","-","Financial","March",5,5,"x","-","Level 22","530 Collins Street","MELBOURNE","VIC",3000,"GPO Box 2008",null,"MELBOURNE","VIC",3001,"NO","NO","NO","NO","NO",null,"CBD","Urban","Short rural","Long rural","  ","NO","AEMO"]
[null,"AGN (Albury and Victoria)","Australian Gas Networks Limited (reporting data for Albury and Victoria)",19078551685,"Vic","Gas","Distribution","Weighted average price cap","Calendar","December",5,5,"x",null,"Level 6","400 King William Street","ADELAIDE","SA",5000,"PO Box 6468","Halifax Street","ADELAIDE","SA",5000,"NO","NO","NO","NO","NO",null,"CBD","Urban","Short rural","Long rural","  ","NO","AGN (Albury)"]
[null,"AGN (Albury)","Australian Gas Networks Limited (reporting data for Albury)",19078551685,"Vic","Gas","Distribution","Weighted average price cap","Calendar","December",5,5,"x",null,"Level 6","400 King William Street","ADELAIDE","SA",5000,"PO Box 6468","Halifax Street","ADELAIDE","SA",5000,"NO","NO","NO","NO","NO",null,"CBD","Urban","Short rural","Long rural","  ","NO"]
[null,"AGN (SA)","Australian Gas Networks Limited (reporting data for SA)",19078551685,"SA","Gas","Distribution","Weighted average price cap","Financial","June",5,5,5,"distribution determination","Level 6","400 King William Street","ADELAIDE","SA",5000,"PO Box 6468","Halifax Street","ADELAIDE","SA",5000,"NO","NO","NO","NO","NO",null,"CBD","Urban","Short rural","Long rural","  ","NO","AGN (SA)"]
[null,"AGN (Victoria)","Australian Gas Networks Limited (reporting data for Victoria)",19078551685,"Vic","Gas","Distribution","Weighted average price cap","Calendar","December",5,5,"x",null,"Level 6","400 King William Street","ADELAIDE","SA",5000,"PO Box 6468","Halifax Street","ADELAIDE","SA",5000,"NO","NO","NO","NO","NO",null,"CBD","Urban","Short rural","Long rural","  ","NO","AGN (Victoria)"]
[null,"Amadeus","APT Pipelines (NT) Pty Ltd",39009737393,"NT","Gas","Transmission","Weighted average price cap","Financial","June",5,5,"x","n/a","Level 19, HSBC Building","580 George Street","SYDNEY","NSW",2000,"Level 19, HSBC Building","580 George Street","SYDNEY","NSW",2000,"NO","NO","NO","NO","NO",null,"CBD","Urban","Short rural","Long rural","  ","NO","Amadeus"]
[null,"APA GasNet","APA GasNet Australia (Operations) Pty Ltd","065083009","Vic","Gas","Transmission","Weighted average price cap","Calendar","December",5,5,"x",null,"Level 19, HSBC Building","580 George Street","SYDNEY","NSW",2000,"PO Box R41",null,"ROYAL EXCHANGE","NSW",1225,"NO","NO","NO","NO","NO",null,"CBD","Urban","Short rural","Long rural","  ","NO","APA GasNet"]
[null,"Ausgrid","Ausgrid",78508211731,"NSW","Electricity","Distribution","Revenue cap","Financial","June",5,5,5,"2014-19 Distribution Determination","570 George St",null,"SYDNEY","NSW",2000,"GPO Box 4009",null,"SYDNEY","NSW",2001,"YES","YES","YES","YES","NO","NO","CBD","Urban","Short rural","Long rural","  ","YES","Ausgrid"]
[null,"Ausgrid (Tx Assets)","Ausgrid (Tx Assets)",67505337385,"NSW","Electricity","Distribution","Revenue cap","Financial","June",5,5,5,"distribution determination","570 George St",null,"SYDNEY","NSW",2000,"GPO Box 4009",null,"SYDNEY","NSW",2001,"YES","YES","YES","YES","NO","NO","CBD","Urban","Short rural","Long rural","  ","NO","Ausgrid (Tx Assets)"]
[null,"AusNet (D)","AusNet Electricity Services Pty Ltd",91064651118,"Vic","Electricity","Distribution","Revenue cap","Calendar","December",5,5,2,"2016-20 Distribution Determination","Level 32","2 Southbank Boulevard","SOUTHBANK","Vic",3006,"Locked Bag 14051",null,"MELBOURNE CITY MAIL CENTRE","VIC",8001,"NO","YES","YES","YES","NO",null,"CBD","Urban","Short rural","Long rural","  ","YES","AusNet (D)"]
[null,"AusNet (Gas)","AusNet Gas Services","086015036","Vic","Gas","Distribution","Weighted average price cap","Calendar","December",5,5,"X",null,"Level 19, HSBC Building","580 George Street","SYDNEY","NSW",2000,"PO Box R41",null,"ROYAL EXCHANGE","NSW",1225,"NO","NO","NO","NO","NO",null,"CBD","Urban","Short rural","Long rural","  ","NO","AusNet (Gas)"]
[null,"AusNet (T)","Ausnet Services (Transmission) Ltd",48116124362,"Vic","Electricity","Transmission","Revenue cap","Financial","March",5,5,2,"transmission determination","Level 32","2 Southbank Boulevard","SOUTHBANK","Vic",3006,"Locked Bag 14051",null,"MELBOURNE CITY MAIL CENTRE","Vic",8001,"NO","NO","NO","NO","NO",null,"CBD","Urban","Short rural","Long rural","  ","NO","AusNet (T)"]
[null,"Australian Distribution Co.","Australian Distribution Co.",11222333444,"-","Electricity","Distribution","Revenue cap","Financial","June",5,5,2,"distribution determination","123 Straight Street",null,"SYDNEY","NSW",2000,"PO Box 123",null,"SYDNEY","NSW",2000,"YES","YES","YES","YES","NO",null,"CBD","Urban","Short rural","Long rural","  ","YES","Australian Distribution Co."]
[null,"Australian Distribution Co. (Vic)","Australian Distribution Co. (Victoria)",11222333444,"Vic","Electricity","Distribution","Revenue cap","Calendar","December",5,5,2,"distribution determination","123 Straight Street",null,"MELBOURNE","Vic",3000,"PO Box 123",null,"MELBOURNE","VIC",3000,"NO","NO","NO","NO","NO",null,"CBD","Urban","Short rural","Long rural","  ","YES","Australian Distribution Co. (Vic)"]
[null,"Australian Distribution Co. (Gas)","Australian Gas Distribution Co. ",11222333444,"NSW","Gas","Distribution","Weighted average price cap","Financial","June",5,5,null,null,"123 Straight Street",null,"SYDNEY","NSW",2000,"PO Box 123",null,"SYDNEY","NSW",2000,"NO","NO","NO","NO","NO",null,"CBD","Urban","Short rural","Long rural","  ","NO","Australian Distribution Co. (Vic)"]
[null,"Australian Transmission Co.","Australian Transmission Co.",11222333444,"-","Electricity","Transmission","Revenue cap","Financial","June",5,5,5,"transmission determination","123 Straight Street",null,"SYDNEY","NSW",2000,"PO Box 123",null,"SYDNEY","NSW",2000,"NO","NO","NO","NO","NO",null,"CBD","Urban","Short rural","Long rural","  ","NO","Australian Transmission Co."]
[null,"Central Ranges Pipeline (D)","Central Ranges Pipeline Pty Ltd",108218355,"NSW","Gas","Distribution","Weighted average price cap","Financial","June",15,5,5,"distribution determination","Level 19","580 George Street","SYDNEY","NSW",2000,"PO Box R41",null,"ROYAL EXCHANGE","NSW",1225,"NO","NO","NO","NO","NO",null,"CBD","Urban","Short rural","Long rural","  ","NO"]
[null,"Central Ranges Pipeline (T)","Central Ranges Pipeline Pty Ltd",108218355,"NSW","Gas","Distribution","Weighted average price cap","Financial","June",14,5,5,"transmission determination","Level 19","580 George Street","SYDNEY","NSW",2000,"PO Box R41",null,"ROYAL EXCHANGE","NSW",1225,"NO","NO","NO","NO","NO",null,"CBD","Urban","Short rural","Long rural","  ","NO"]
[null,"CitiPower","CitiPower",76064651056,"Vic","Electricity","Distribution","Revenue cap","Calendar","December",5,5,2,"2016-20 Distribution Determination","40 Market Street",null,"MELBOURNE","Vic",3000,"Locked Bag 14090",null,"MELBOURNE","VIC",8001,"YES","YES","NO","NO","NO",null,"CBD","Urban","Short rural","Long rural","  ","YES","CitiPower"]
[null,"Directlink","Directlink",16779340889,"Qld","Electricity","Transmission","Revenue cap","Financial","June",9,5,5,"transmission determination","Level 19, HSBC Building","580 George Street","SYDNEY","NSW",2000,"PO Box R41",null,"ROYAL EXCHANGE","NSW",1225,"NO","NO","NO","NO","NO",null,"CBD","Urban","Short rural","Long rural","  ","NO","Directlink"]
[null,"ElectraNet","ElectraNet",41094482416,"SA","Electricity","Transmission","Revenue cap","Financial","June",5,5,5,"transmission determination","52-55 East Terrace","Rymill Park","ADELAIDE","SA",5000,"PO Box 7096","Hutt Street Post Office","ADELAIDE","SA",5000,"NO","NO","NO","NO","NO",null,"CBD","Urban","Short rural","Long rural","  ","NO","ElectraNet"]
[null,"Endeavour Energy","Endeavour Energy",11247365823,"NSW","Electricity","Distribution","Revenue cap","Financial","June",5,5,5,"2014-19 Distribution Determination","51 Huntingwood Drive",null,"HUNTINGWOOD","NSW",2148,"PO Box 811",null,"SEVEN HILLS","NSW",1730,"NO","YES","YES","YES","NO","NO","CBD","Urban","Short rural","Long rural","  ","YES","Endeavour Energy"]
[null,"Energex","Energex",40078849055,"Qld","Electricity","Distribution","Revenue cap","Financial","June",5,5,5,"2015-20 Distribution Determination","26 Reddacliff Street",null,"NEWSTEAD","Qld",4006,"26 Reddacliff Street",null,"NEWSTEAD","QLD",4006,"YES","YES","YES","NO","NO","NO","CBD","Urban","Short rural","Long rural","  ","YES","Energex"]
[null,"Ergon Energy","Ergon Energy",50087646062,"Qld","Electricity","Distribution","Revenue cap","Financial","June",5,5,5,"2015-20 Distribution Determination","22 Walker Street",null,"TOWNSVILLE","Qld",4810,"Po Box 264",null,"FORTITUDE VALLEY","QLD",4006,"NO","YES","YES","YES","NO","NO","CBD","Urban","Short rural","Long rural","  ","YES","Ergon Energy"]
[null,"Essential Energy","Essential Energy",37428185226,"NSW","Electricity","Distribution","Revenue cap","Financial","June",5,5,5,"2014-19 Distribution Determination","8 Buller Street",null,"PORT MACQUARIE","NSW",2444,"PO Box 5730",null,"PORT MACQUARIE","NSW",2444,"NO","NO","YES","YES","NO","NO","CBD","Urban","Short rural","Long rural","  ","YES","Essential Energy"]
[null,"Jemena Electricity","Jemena Electricity",82064651083,"Vic","Electricity","Distribution","Revenue cap","Calendar","December",5,5,2,"2016-20 Distribution Determination","Level 16","567 Collins Street","MELBOURNE","VIC",3000,"PO Box 16182",null,"MELBOURNE","VIC",8001,"NO","YES","YES","NO","NO",null,"CBD","Urban","Short rural","Long rural","  ","YES","Jemena Electricity"]
[null,"JGN","Jemena Gas Networks (NSW) Ltd","003 004 322","NSW","Gas","Distribution","Weighted average price cap","Financial","June",5,5,null,null,null,null,null,null,null,null,null,null,null,null,"NO","NO","NO","NO","NO",null,"CBD","Urban","Short rural","Long rural","  ","NO","JGN"]
[null,"Multinet Gas","Multinet Gas (DB No.1) Pty Ltd (ACN 086 026 986), Multinet Gas (DB No.2) Pty Ltd (ACN 086 230 122)","086026986","Vic","Gas","Distribution","Weighted average price cap","Calendar","December",5,5,"x",null,"43-45 Centreway",null,"MT WAVERLEY","Vic",3149,null,null,null,null,null,"NO","NO","NO","NO","NO",null,"CBD","Urban","Short rural","Long rural","  ","NO","Multinet Gas"]
[null,"Murraylink","Murraylink",79181207909,"SA","Electricity","Transmission","Revenue cap","Financial","June",5,5,5,"transmission determination","Level 19","580 George Street","SYDNEY","NSW",2000,"PO Box R41",null,"ROYAL EXCHANGE","NSW",1225,"NO","NO","NO","NO","NO",null,"CBD","Urban","Short rural","Long rural","  ","NO","Murraylink"]
[null,"Power and Water","Power and Water Corporation",15947352360,"NT","Electricity","Distribution","Revenue cap","Financial","June",5,5,"x","distribution determination","GPO Box 1921",null,"DARWIN","NT",801,"GPO Box 1921",null,"DARWIN","NT",801,"YES","YES","YES","YES","NO",null,"CBD","Urban","Short rural","Long rural","  ","NO","Power and Water"]
[null,"Powercor Australia","Powercor Australia",89064651109,"Vic","Electricity","Distribution","Revenue cap","Calendar","December",5,5,2,"2016-20 Distribution Determination","40 Market Street",null,"MELBOURNE","Vic",3000,"Locked bag 14090",null,"MELBOURNE","VIC",8001,"NO","NO","YES","YES","NO",null,"CBD","Urban","Short rural","Long rural","  ","YES","Powercor Australia"]
[null,"Powerlink","Queensland Electricity Transmission Corporation Limited trading as Powerlink Queensland",82078849233,"Qld","Electricity","Transmission","Revenue cap","Financial","June",5,5,5,"transmission determination","33 Harold St",null,"VIRGINIA","Qld",4014,"PO Box 1193",null,"VIRGINIA","QLD",4014,"NO","NO","NO","NO","NO",null,"CBD","Urban","Short rural","Long rural","  ","NO","Powerlink"]
[null,"Roma to Brisbane Pipeline","APT Petroleum Pipelines Limited t/a Roma to Brisbane Pipeline","009 737 393","Qld","Gas","Transmission","Weighted average price cap","Financial","June",5,5,"x","n/a","580 George Street",null,"SYDNEY","NSW",2000,"PO Box R41",null,"ROYAL EXCHANGE","NSW",1225,"NO","NO","NO","NO","NO",null,"CBD","Urban","Short rural","Long rural","  ","NO","Roma to Brisbane Pipeline"]
[null,"SA Power Networks","SA Power Networks",13332330749,"SA","Electricity","Distribution","Revenue cap","Financial","June",5,5,5,"2015-20 Distribution Determination","1 Anzac Highway",null,"KESWICK","SA",5035,"GPO Box 77",null,"ADELAIDE","SA",5000,"YES","YES","YES","YES","NO","NO","CBD","Urban","Short rural","Long rural","  ","NO","SA Power Networks"]
[null,"TasNetworks (D)","TasNetworks (D)",24167357299,"Tas","Electricity","Distribution","Revenue cap","Financial","June",5,5,5,"distribution determination","1-7 Maria Street",null,"LENAH VALLEY","Tas",7008,"PO Box 606",null,"MOONAH","Tas",7009,"YES","YES","YES","YES","YES","NO","Critical Infrastructure","High density commercial","Urban","High density rural","Low density rural","YES","TasNetworks (D)"]
[null,"TasNetworks (T)","TasNetworks (T)",24167357299,"Tas","Electricity","Transmission","Revenue cap","Financial","June",5,5,5,"transmission determination","1-7 Maria Street",null,"LENAH VALLEY","Tas",7008,"PO Box 606",null,"MOONAH","Tas",7009,"NO","NO","NO","NO","NO",null,"CBD","Urban","Short rural","Long rural","  ","NO","TasNetworks (T)"]
[null,"TransGrid","NSW Electricity Networks Operations Pty Ltd trading as TransGrid","70 250 995 390","NSW","Electricity","Transmission","Revenue cap","Financial","June",4,5,5,"transmission determination","180 Thomas Street",null,"SYDNEY","NSW",2000,"PO Box A1000",null,"SYDNEY SOUTH","NSW",1235,"NO","NO","NO","NO","NO",null,"CBD","Urban","Short rural","Long rural","  ","NO","TransGrid"]
[null,"United Energy","United Energy",70064651029,"Vic","Electricity","Distribution","Revenue cap","Calendar","December",5,5,2,"2016-20 Distribution Determination","Level 3","6 Nexus Court","MULGRAVE","Vic",3149,"PO Box 449",null,"MOUNT WAVERLEY","VIC",3170,"NO","NO","YES","NO","NO",null,"CBD","Urban","Short rural","Long rural","  ","YES","United Energy"]
[]
[]
[null,null,null,null,null,null,null,null,null,null,null,null,null,null,null,null,null,null,null,null,null,null,null,null,null,"For EB & Reset RINs only",null,null,null,null,"For AARs only"]
[null,"The Reg Year Ending (dms_RYE) must be set to the last year of the regulatory period. For forecast data is is usually (FRCP_y5) for actual it is a single year (CRY). For historical actual data the RYE will need to be set manually in the business details sheet by setting the dms_Multiyear_flag to 1 and putting the correct value in 'dms_Specified_FinalYear. See cells C67:C68",null,null,null,null,null,null,null,null,null,null,null,"Drop down selector box for CA & Reset RINs.","For CA & Reset RINs only",null,null,null,null,null,null,null,null,null,null,"for DNSP only",null,null,null,null,"For DNSPs only"]
[null,"dms_Model_List ","dms_Worksheet_List",null,"dms_RYE_Formula_Result",null,null,null,null,null,null,null,null,"dms_0203_ProjectType","dms_020303_01_UOM","dms_020501_01_UOM","dms_020501_02_UOM","dms_020501_03_UOM","dms_020501_04_UOM","dms_020603_01_UOM","dms_020701_01_UOM","dms_020701_02_UOM","dms_020701_01_Rows","dms_040102_01_UOM","dms_040102_04_UOM","dms_030601_01_UOM","dms_030601_02_UOM","dms_030701_01_UOM","dms_030702_01_UOM","dms_030703_01_UOM","dms_030605_UOM","dms_03060703_UOM"]
[null,"ARR","ANNUAL REPORTING STATEMENT",null,{"$f":"LEFT(dms_SingleYear_FinalYear_Result,2)&RIGHT(dms_SingleYear_FinalYear_Result,2)","v":"2018"},"=LEFT(dms_SingleYear_FinalYear_Result,2)&RIGHT(dms_SingleYear_FinalYear_Result,2)",null,"Formula errors are OK",null,null,null,null,null,"New line on new route - single circuit","Circuit line length in km","0's","0's","0's","0's","0's","km","km","Route line length within zone","0's","days","minutes/customer","minutes/customer","Customer / km","%","km","number","number"]
[null,"CA","CATEGORY ANALYSIS",null,{"$f":"LEFT(dms_SingleYear_FinalYear_Result,2)&RIGHT(dms_SingleYear_FinalYear_Result,2)","v":"2018"},"=LEFT(dms_SingleYear_FinalYear_Result,2)&RIGHT(dms_SingleYear_FinalYear_Result,2)",null,"Formula errors are OK",null,null,null,null,null,"New line on new route - dual circuit","Circuit line length in km","0's","0's","0's","0's","0's","0's","0's","Number of maintenance spans","0's","0's","minutes/customer","minutes/customer","MWh/customer","Number of spans",null,"number","number"]
[null,"CESS","CAPITLAL EXPENDITURE SHARING SCHEMING",null,"2016","=LEFT(dms_SingleYear_FinalYear_Result,2)&RIGHT(dms_SingleYear_FinalYear_Result,2)",null,null,null,null,null,null,null,"New line on new route - other","Circuit line length in km","MVA added","MVA added","MVA added","MVA added","0's","km","km","Total length of maintenance spans","0's","$0s","interruptions/customer","interruptions/customer","kVA / customer","Number of spans",null,"number","number"]
[null,"CPI","CPI",null,null,null,null,null,null,null,null,null,null,"Line rebuild over existing route - single circuit","Circuit line length in km","0's","0's","0's","0's","0's","km","km","Length of vegetation corridors","$0s","0's","interruptions/customer","interruptions/customer",null,"Number of spans",null,"number","number"]
[null,"EB","ECONOMIC BENCHMARKING",null,{"$f":"LEFT(dms_SingleYear_FinalYear_Result,2)&RIGHT(dms_SingleYear_FinalYear_Result,2)","v":"2018"},"=LEFT(dms_SingleYear_FinalYear_Result,2)&RIGHT(dms_SingleYear_FinalYear_Result,2)",null,"Formula errors are OK",null,null,null,null,null,"Line rebuild over existing route - dual circuit","Number","total spend $0s","total spend $0s","total spend $0s","total spend $0s","(per cent)","0's","0's","Average number of trees per maintenance span",null,null,null,null,null,"Number of spans",null,"number","(per cent)"]
[null,"PTRM","POST TAX REVENUE MODEL",null,{"$f":"LEFT(dms_MultiYear_FinalYear_Result,2)&RIGHT(dms_MultiYear_FinalYear_Result,2)","v":"2025"},"=LEFT(dms_MultiYear_FinalYear_Result,2)&RIGHT(dms_MultiYear_FinalYear_Result,2)",null,null,null,null,null,null,null,"Reconductor - Single circuit","Number","net circuit km added","net circuit km added","net circuit km added","net circuit km added",null,"years","years","Average frequency of cutting cycle",null,null,null,null,null,"Years",null,"number"]
[null,"Reset","REGULATORY REPORTING STATEMENT",null,{"$f":"LEFT(dms_MultiYear_FinalYear_Result,2)&RIGHT(dms_MultiYear_FinalYear_Result,2)","v":"2025"},"=LEFT(dms_MultiYear_FinalYear_Result,2)&RIGHT(dms_MultiYear_FinalYear_Result,2)",null,"Formula errors are OK",null,null,null,null,null,"Reconductor - Dual circuit","Number","total spend $0s","total spend $0s","total spend $0s","total spend $0s",null,null,null,null,null,null,null,null,null,"Years",null,"number"]
[null,"RFM","ROLL FORWARD MODEL",null,{"$f":"LEFT(dms_CRCP_FinalYear_Result,2)&RIGHT(dms_CRCP_FinalYear_Result,2)","v":"2018"},"=LEFT(dms_CRCP_FinalYear_Result,2)&RIGHT(dms_CRCP_FinalYear_Result,2)",null,null,null,null,null,null,null,"Other",null,"net circuit km added","net circuit km added","net circuit km added","net circuit km added",null,null,null,null,null,null,null,null,null,"Trees",null,"number"]
[null,"WACC","WEIGHTED AVERAGE COST OF CAPITAL",null,{"$f":"LEFT(dms_MultiYear_FinalYear_Result,2)&RIGHT(dms_MultiYear_FinalYear_Result,2)","v":"2025"},"=LEFT(dms_MultiYear_FinalYear_Result,2)&RIGHT(dms_MultiYear_FinalYear_Result,2)",null,null,null,null,null,null,null,null,null,"total spend $0s","total spend $0s","total spend $0s","total spend $0s",null,null,null,null,null,null,null,null,null,"Trees",null,"number"]
[null,null,null,null,null,null,null,null,null,null,null,null,null,null,null,"0's",null,"$0s",null,null,null,null,null,null,null,null,null,null,"Defects",null,"number"]
[null,"dms_DataQuality_List",null,null,null,null,null,null,null,null,null,null,null,null,null,"0's",null,null,null,null,null,null,null,null,null,null,null,null,"Defects",null,"number"]
[null,"Actual",null,null,null,null,null,null,null,null,null,null,null,null,null,"0's",null,null,null,null,null,null,null,null,null,null,null,null,"Spans",null,"number"]
[null,"Estimate",null,null,null,null,null,null,null,null,null,null,null,null,null,"$0s",null,null,null,null,null,null,null,null,null,null,null,null,"km",null,"(per cent)"]
[null,"Consolidated",null,null,null,null,null,null,null,null,null,null,null,null,null,null,null,null,null,null,null,null,null,null,null,null,null,null,"Spans",null,"(per cent)",""]
[null,"Recast"]
[null,"Public"]
[null,null,null,null,null,null,null,null,null,null,null,null,null,null,"For PTRM files - this field set the text for the named range \"DMS_Xfactor\" which in all cases is simply the text \"x factors\" - this saves putting in each old gas PTRM file ",null,null,null,null,null,null,null,null,null,null,"for TNSP only"]
[null,"For all files either AER or business needs to be able to specify the type of submission","For PTRM & RFM templates we must provide a choice in case they change their form of control - otherwise it is drawn from the business specific lookup table above.",null,null,null,null,null,null,null,null,null,null,null,"DMS_Xfactor",null,null,null,null,null,null,null,null,null,null,"dms_030601_01_UOM",null,"dms_030701_01_UOM","dms_030702_01_UOM"]
[null,"dms_SourceList","dms_FormControl_Choices",null,null,null,null,null,null,null,null,null,null,null,"x factors",null,null,null,null,null,null,null,null,null,null,"%",null,"Number of spans","km"]
[null,"After appeal","Revenue cap",null,null,null,null,null,null,null,null,null,null,null,null,null,null,null,null,null,null,null,null,null,null,"number",null,"Years","%"]
[null,"Draft decision","Revenue yield",null,null,null,null,null,null,null,null,null,null,null,null,null,null,null,null,null,null,null,null,null,null,"number",null,"Trees","km"]
[null,"Final decision","Weighted average price cap",null,null,null,null,null,null,null,null,null,null,null,null,null,null,null,null,null,null,null,null,null,null,"%",null,"Defects","number"]
[null,"PTRM update 1",null,null,null,null,null,null,null,null,null,null,null,null,null,null,null,null,null,null,null,null,null,null,null,"number",null,"Number of spans"]
[null,"PTRM update 2",null,null,null,null,null,null,null,null,null,null,null,null,null,null,null,null,null,null,null,null,null,null,null,"number",null,"km"]
[null,"PTRM update 3",null,null,null,null,null,null,null,null,null,null,null,null,null,null,null,null,null,null,null,null,null,null,null,"%",null,"km"]
[null,"PTRM update 4",null,null,null,null,null,null,null,null,null,null,null,null,null,null,null,null,null,null,null,null,null,null,null,"number",null,"Number of spans"]
[null,"PTRM update 5",null,null,null,null,null,null,null,null,null,null,null,null,null,null,null,null,null,null,null,null,null,null,null,"number"]
[null,"PTRM update 6",null,null,null,null,null,null,null,null,null,null,null,null,null,null,null,null,null,null,null,null,null,null,null,"%"]
[null,"PTRM update 7",null,null,null,null,null,null,null,null,null,null,null,null,null,null,null,null,null,null,null,null,null,null,null,"number"]
[null,"Regulatory proposal",null,null,null,null,null,null,null,null,null,null,null,null,null,null,null,null,null,null,null,null,null,null,null,"%"]
[null,"Reporting",null,null,null,null,null,null,null,null,null,null,null,null,null,null,null,null,null,null,null,null,null,null,null,"number"]
[null,"Revised regulatory proposal",null,null,null,null,null,null,null,null,null,null,null,null,null,null,null,null,null,null,null,null,null,null,null,"%"]
[null,null,null,null,null,null,null,null,null,null,null,null,null,null,null,null,null,null,null,null,null,null,null,null,null,"number"]
[]
[]
[]
[null,"Reason for interruption","dms_Reason_Interruption_Detailed","dms_Reason_Interruption","dms_STPIS_Exclusion_List","dms_020301_ProjectType_List","dms_020302_ProjectType_List"]
[null,"Animal","Animal impact","Animal","Weather","New substation establishment","New line on new route - single circuit"]
[null,null,"Animal nesting/burrowing, etc and other","Asset failure","Equipment failure","Capacity upgrade","New line on new route - dual circuit"]
[null,null,"Other","Other","Operational error","Voltage upgrade","New line on new route - other"]
[null,"Asset failure","LV","Overloads","Vegetation","Other","Line rebuild over existing route - single circuit"]
[null,null,"Distribution substation","Planned","Animals",null,"Line rebuild over existing route - dual circuit"]
[null,null,"HV","Network business","Third party impacts",null,"Reconductor - Single circuit"]
[null,null,"Zone substation","Third party","Transmission failure",null,"Reconductor - Dual circuit"]
[null,null,"Subtransmission","Unknown","Load shedding",null,"Reconductor - Other"]
[null,"Other","insert description of 'other'","Vegetation","Inter-distributor connection failure",null,"Line upgrade - raising/retensoring"]
[null,"Overloads","-","Weather","Other",null,"Line upgrade - voltage upgrade"]
[null,"Planned","-","2 - STPIS Exclusion (3.3)(a)",null,null,"Line upgrade - capacity"]
[null,"Network business","Network error","3 - STPIS Exclusion (3.3)(a)",null,null,"String spare circuit"]
[null,null,"Switching and protection error","4 - STPIS Exclusion (3.3)(a)",null,null,"Other"]
[null,"Third party","Fire","5 - STPIS Exclusion (3.3)(a)"]
[null,null,"Other","6 - STPIS Exclusion (3.3)(a)"]
[null,null,"Dig-in","7 - STPIS Exclusion (3.3)(a)"]
[null,null,"Unauthorised access"]
[null,null,"Vehicle impact"]
[null,"Unknown","Unknown"]
[null,"Vegetation","Blow-in/Fall-in - NSP responsibility"]
[null,null,"Grow-in - NSP responsibility"]
[null,null,"Blow-in/Fall-in - Other responsible party"]
[null,null,"Grow-in - Other responsible party"]
[null,"Weather"]
[null,"2 - STPIS Exclusion (3.3)(a)"]
[null,"3 - STPIS Exclusion (3.3)(a)"]
[null,"4 - STPIS Exclusion (3.3)(a)"]
[null,"5 - STPIS Exclusion (3.3)(a)"]
[null,"6 - STPIS Exclusion (3.3)(a)"]
[null,"7 - STPIS Exclusion (3.3)(a)"]
[]
[]
[]
[]
[]
[]
[]
[null,"These are indeces and lookup values for various dates. All step from the value placed in FRCP_y1 on the business and other details worksheet",{"$f":"IF(dms_FifthFeeder_flag_NSP=\"NO\",\"This NSP has only 4 feeder categories\",\"This NSP has 5 feeder categories\")","v":"This NSP has only 4 feeder categories"},null,null,null,null,null,null,null,null,null,null,null,"These date tables are currently used in the Recast templates to provide column headings and conditional formatting"]
[null,"dms_FRCPlength_Num_List","dms_FinalYear_List","dms_CRCPlength_Num_List","dms_CFinalYear_List","dms_FRCP_years",null,"dms_CRCP_years",null,"dms_CRCP_index",null,"dms_Financial_Years","dms_Calendar_Years",null,"CRY from input cell on business sheet","CRY - financial","dms_FinYears","CRY calendar","dms_CalYears"]
[null,1,"dms_FRCP_y1",1,"CRCP_y1",{"$f":"FRCP_y1","v":"2020-21"},"dms_FRCP_y1",{"$f":"IF(dms_RPT=\"financial\",VALUE(LEFT(dms_FRCP_y1,4)-1)&\"-\"&TEXT(VALUE(MID(dms_FRCP_y1,3,2)),\"00\"),VALUE(LEFT(dms_FRCP_y1,4)-1))","v":"2019-20"},"dms_CRCP_yZ",1,null,"2005-06","2006",null,{"$f":"CRY","v":"2017-18"},{"$f":"VALUE(LEFT(CRY,4))&\"-\"&TEXT(MID(CRY,3,2)+1,\"00\")","v":"2017-18"},"dms_CRYf_y1",{"$f":"VALUE(LEFT(CRY,4)+1)","v":2018},"dms_CRYc_y1"]
[null,2,"dms_FRCP_y2",2,"CRCP_y2",{"$f":"IF(dms_RPT=\"financial\",VALUE(LEFT(dms_FRCP_y1,4)+1)&\"-\"&TEXT(VALUE(RIGHT(dms_FRCP_y1,2)+1),\"00\"),VALUE(LEFT(dms_FRCP_y1,4)+1))","v":"2021-22"},"dms_FRCP_y2",{"$f":"IF(dms_RPT=\"financial\",VALUE(LEFT(dms_CRCP_yZ,4)-1)&\"-\"&TEXT(VALUE(MID(dms_CRCP_yZ,3,2)),\"00\"),VALUE(LEFT(dms_CRCP_yZ,4)-1))","v":"2018-19"},"dms_CRCP_yY",2,null,"2006-07","2007",null,null,{"$f":"VALUE(LEFT(dms_CRYf_y1,4)+1)&\"-\"&TEXT(MID(dms_CRYf_y1,3,2)+2,\"00\")","v":"2018-19"},"dms_CRYf_y2",{"$f":"VALUE(LEFT(dms_CRYc_y1,4)+1)","v":2019},"dms_CRYc_y2"]
[null,3,"dms_FRCP_y3",3,"CRCP_y3",{"$f":"IF(dms_RPT=\"financial\",VALUE(LEFT(dms_FRCP_y2,4)+1)&\"-\"&TEXT(VALUE(RIGHT(dms_FRCP_y2,2)+1),\"00\"),VALUE(LEFT(dms_FRCP_y2,4)+1))","v":"2022-23"},"dms_FRCP_y3",{"$f":"IF(dms_RPT=\"financial\",VALUE(LEFT(dms_CRCP_yY,4)-1)&\"-\"&TEXT(VALUE(MID(dms_CRCP_yY,3,2)),\"00\"),VALUE(LEFT(dms_CRCP_yY,4)-1))","v":"2017-18"},"dms_CRCP_yX",3,null,"2007-08","2008",null,null,{"$f":"VALUE(LEFT(dms_CRYf_y2,4)+1)&\"-\"&TEXT(MID(dms_CRYf_y2,3,2)+2,\"00\")","v":"2019-20"},"dms_CRYf_y3",{"$f":"VALUE(LEFT(dms_CRYc_y2,4)+1)","v":2020},"dms_CRYc_y3"]
[null,4,"dms_FRCP_y4",4,"CRCP_y4",{"$f":"IF(dms_RPT=\"financial\",VALUE(LEFT(dms_FRCP_y3,4)+1)&\"-\"&TEXT(VALUE(RIGHT(dms_FRCP_y3,2)+1),\"00\"),VALUE(LEFT(dms_FRCP_y3,4)+1))","v":"2023-24"},"dms_FRCP_y4",{"$f":"IF(dms_RPT=\"financial\",VALUE(LEFT(dms_CRCP_yX,4)-1)&\"-\"&TEXT(VALUE(MID(dms_CRCP_yX,3,2)),\"00\"),VALUE(LEFT(dms_CRCP_yX,4)-1))","v":"2016-17"},"dms_CRCP_yW",4,null,"2008-09","2009",null,null,{"$f":"VALUE(LEFT(dms_CRYf_y3,4)+1)&\"-\"&TEXT(MID(dms_CRYf_y3,3,2)+2,\"00\")","v":"2020-21"},"dms_CRYf_y4",{"$f":"VALUE(LEFT(dms_CRYc_y3,4)+1)","v":2021},"dms_CRYc_y4"]
[null,5,"dms_FRCP_y5",5,"CRCP_y5",{"$f":"IF(dms_RPT=\"financial\",VALUE(LEFT(dms_FRCP_y4,4)+1)&\"-\"&TEXT(VALUE(RIGHT(dms_FRCP_y4,2)+1),\"00\"),VALUE(LEFT(dms_FRCP_y4,4)+1))","v":"2024-25"},"dms_FRCP_y5",{"$f":"IF(dms_RPT=\"financial\",VALUE(LEFT(dms_CRCP_yW,4)-1)&\"-\"&TEXT(VALUE(MID(dms_CRCP_yW,3,2)),\"00\"),VALUE(LEFT(dms_CRCP_yW,4)-1))","v":"2015-16"},"dms_CRCP_yV",5,null,"2009-10",2010,null,null,{"$f":"VALUE(LEFT(dms_CRYf_y4,4)+1)&\"-\"&TEXT(MID(dms_CRYf_y4,3,2)+2,\"00\")","v":"2021-22"},"dms_CRYf_y5",{"$f":"VALUE(LEFT(dms_CRYc_y4,4)+1)","v":2022},"dms_CRYc_y5"]
[null,6,"dms_FRCP_y6",6,"CRCP_y6",{"$f":"IF(dms_RPT=\"financial\",VALUE(LEFT(dms_FRCP_y5,4)+1)&\"-\"&TEXT(VALUE(RIGHT(dms_FRCP_y5,2)+1),\"00\"),VALUE(LEFT(dms_FRCP_y5,4)+1))","v":"2025-26"},"dms_FRCP_y6",{"$f":"IF(dms_RPT=\"financial\",VALUE(LEFT(dms_CRCP_yV,4)-1)&\"-\"&TEXT(VALUE(MID(dms_CRCP_yV,3,2)),\"00\"),VALUE(LEFT(dms_CRCP_yV,4)-1))","v":"2014-15"},"dms_CRCP_yU",6,null,"2010-11",2011,null,null,{"$f":"VALUE(LEFT(dms_CRYf_y5,4)+1)&\"-\"&TEXT(MID(dms_CRYf_y5,3,2)+2,\"00\")","v":"2022-23"},"dms_CRYf_y6",{"$f":"VALUE(LEFT(dms_CRYc_y5,4)+1)","v":2023},"dms_CRYc_y6"]
[null,7,"dms_FRCP_y7",7,"CRCP_y7",{"$f":"IF(dms_RPT=\"financial\",VALUE(LEFT(dms_FRCP_y6,4)+1)&\"-\"&TEXT(VALUE(RIGHT(dms_FRCP_y6,2)+1),\"00\"),VALUE(LEFT(dms_FRCP_y6,4)+1))","v":"2026-27"},"dms_FRCP_y7",{"$f":"IF(dms_RPT=\"financial\",VALUE(LEFT(dms_CRCP_yU,4)-1)&\"-\"&TEXT(VALUE(MID(dms_CRCP_yU,3,2)),\"00\"),VALUE(LEFT(dms_CRCP_yU,4)-1))","v":"2013-14"},"dms_CRCP_yT",7,null,"2011-12",2012,null,null,{"$f":"VALUE(LEFT(dms_CRYf_y6,4)+1)&\"-\"&TEXT(MID(dms_CRYf_y6,3,2)+2,\"00\")","v":"2023-24"},"dms_CRYf_y7",{"$f":"VALUE(LEFT(dms_CRYc_y6,4)+1)","v":2024},"dms_CRYc_y7"]
[null,8,"dms_FRCP_y8",8,"CRCP_y8",{"$f":"IF(dms_RPT=\"financial\",VALUE(LEFT(dms_FRCP_y7,4)+1)&\"-\"&TEXT(VALUE(RIGHT(dms_FRCP_y7,2)+1),\"00\"),VALUE(LEFT(dms_FRCP_y7,4)+1))","v":"2027-28"},"dms_FRCP_y8",{"$f":"IF(dms_RPT=\"financial\",VALUE(LEFT(dms_CRCP_yT,4)-1)&\"-\"&TEXT(VALUE(MID(dms_CRCP_yT,3,2)),\"00\"),VALUE(LEFT(dms_CRCP_yT,4)-1))","v":"2012-13"},"dms_CRCP_yS",8,null,"2012-13",2013,null,null,{"$f":"VALUE(LEFT(dms_CRYf_y7,4)+1)&\"-\"&TEXT(MID(dms_CRYf_y7,3,2)+2,\"00\")","v":"2024-25"},"dms_CRYf_y8",{"$f":"VALUE(LEFT(dms_CRYc_y7,4)+1)","v":2025},"dms_CRYc_y8"]
[null,9,"dms_FRCP_y9",9,"CRCP_y9",{"$f":"IF(dms_RPT=\"financial\",VALUE(LEFT(dms_FRCP_y8,4)+1)&\"-\"&TEXT(VALUE(RIGHT(dms_FRCP_y8,2)+1),\"00\"),VALUE(LEFT(dms_FRCP_y8,4)+1))","v":"2028-29"},"dms_FRCP_y9",{"$f":"IF(dms_RPT=\"financial\",VALUE(LEFT(dms_CRCP_yS,4)-1)&\"-\"&TEXT(VALUE(MID(dms_CRCP_yS,3,2)),\"00\"),VALUE(LEFT(dms_CRCP_yS,4)-1))","v":"2011-12"},"dms_CRCP_yR",9,null,"2013-14",2014,null,null,{"$f":"VALUE(LEFT(dms_CRYf_y8,4)+1)&\"-\"&TEXT(MID(dms_CRYf_y8,3,2)+2,\"00\")","v":"2025-26"},"dms_CRYf_y9",{"$f":"VALUE(LEFT(dms_CRYc_y8,4)+1)","v":2026},"dms_CRYc_y9"]
[null,10,"dms_FRCP_y10",10,"CRCP_y10",{"$f":"IF(dms_RPT=\"financial\",VALUE(LEFT(dms_FRCP_y9,4)+1)&\"-\"&TEXT(VALUE(RIGHT(dms_FRCP_y9,2)+1),\"00\"),VALUE(LEFT(dms_FRCP_y9,4)+1))","v":"2029-30"},"dms_FRCP_y10",{"$f":"IF(dms_RPT=\"financial\",VALUE(LEFT(dms_CRCP_yR,4)-1)&\"-\"&TEXT(VALUE(MID(dms_CRCP_yR,3,2)),\"00\"),VALUE(LEFT(dms_CRCP_yR,4)-1))","v":"2010-11"},"dms_CRCP_yQ",10,null,"2014-15",2015,null,null,{"$f":"VALUE(LEFT(dms_CRYf_y9,4)+1)&\"-\"&TEXT(MID(dms_CRYf_y9,3,2)+2,\"00\")","v":"2026-27"},"dms_CRYf_y10",{"$f":"VALUE(LEFT(dms_CRYc_y9,4)+1)","v":2027},"dms_CRYc_y10"]
[null,11,"dms_FRCP_y11",11,"CRCP_y11",{"$f":"IF(dms_RPT=\"financial\",VALUE(LEFT(dms_FRCP_y10,4)+1)&\"-\"&TEXT(VALUE(RIGHT(dms_FRCP_y10,2)+1),\"00\"),VALUE(LEFT(dms_FRCP_y10,4)+1))","v":"2030-31"},"dms_FRCP_y11",{"$f":"IF(dms_RPT=\"financial\",VALUE(LEFT(dms_CRCP_yQ,4)-1)&\"-\"&TEXT(VALUE(MID(dms_CRCP_yQ,3,2)),\"00\"),VALUE(LEFT(dms_CRCP_yQ,4)-1))","v":"2009-10"},"dms_CRCP_yP",11,null,"2015-16",2016,null,null,{"$f":"VALUE(LEFT(dms_CRYf_y10,4)+1)&\"-\"&TEXT(MID(dms_CRYf_y10,3,2)+2,\"00\")","v":"2027-28"},"dms_CRYf_y11",{"$f":"VALUE(LEFT(dms_CRYc_y10,4)+1)","v":2028},"dms_CRYc_y11"]
[null,12,"dms_FRCP_y12",12,"CRCP_y12",{"$f":"IF(dms_RPT=\"financial\",VALUE(LEFT(dms_FRCP_y11,4)+1)&\"-\"&TEXT(VALUE(RIGHT(dms_FRCP_y11,2)+1),\"00\"),VALUE(LEFT(dms_FRCP_y11,4)+1))","v":"2031-32"},"dms_FRCP_y12",{"$f":"IF(dms_RPT=\"financial\",VALUE(LEFT(dms_CRCP_yP,4)-1)&\"-\"&TEXT(VALUE(MID(dms_CRCP_yP,3,2)),\"00\"),VALUE(LEFT(dms_CRCP_yP,4)-1))","v":"2008-09"},"dms_CRCP_yO",12,null,"2016-17",2017,null,null,{"$f":"VALUE(LEFT(dms_CRYf_y11,4)+1)&\"-\"&TEXT(MID(dms_CRYf_y11,3,2)+2,\"00\")","v":"2028-29"},"dms_CRYf_y12",{"$f":"VALUE(LEFT(dms_CRYc_y11,4)+1)","v":2029},"dms_CRYc_y12"]
[null,13,"dms_FRCP_y13",13,"CRCP_y13",{"$f":"IF(dms_RPT=\"financial\",VALUE(LEFT(dms_FRCP_y12,4)+1)&\"-\"&TEXT(VALUE(RIGHT(dms_FRCP_y12,2)+1),\"00\"),VALUE(LEFT(dms_FRCP_y12,4)+1))","v":"2032-33"},"dms_FRCP_y13",{"$f":"IF(dms_RPT=\"financial\",VALUE(LEFT(dms_CRCP_yO,4)-1)&\"-\"&TEXT(VALUE(MID(dms_CRCP_yO,3,2)),\"00\"),VALUE(LEFT(dms_CRCP_yO,4)-1))","v":"2007-08"},"dms_CRCP_yN",13,null,"2017-18",2018,null,null,{"$f":"VALUE(LEFT(dms_CRYf_y12,4)+1)&\"-\"&TEXT(MID(dms_CRYf_y12,3,2)+2,\"00\")","v":"2029-30"},"dms_CRYf_y13",{"$f":"VALUE(LEFT(dms_CRYc_y12,4)+1)","v":2030},"dms_CRYc_y13"]
[null,14,"dms_FRCP_y14",14,"CRCP_y14",{"$f":"IF(dms_RPT=\"financial\",VALUE(LEFT(dms_FRCP_y13,4)+1)&\"-\"&TEXT(VALUE(RIGHT(dms_FRCP_y13,2)+1),\"00\"),VALUE(LEFT(dms_FRCP_y13,4)+1))","v":"2033-34"},"dms_FRCP_y14",{"$f":"IF(dms_RPT=\"financial\",VALUE(LEFT(dms_CRCP_yN,4)-1)&\"-\"&TEXT(VALUE(MID(dms_CRCP_yN,3,2)),\"00\"),VALUE(LEFT(dms_CRCP_yN,4)-1))","v":"2006-07"},"dms_CRCP_yM",14,null,"2018-19",2019,null,null,{"$f":"VALUE(LEFT(dms_CRYf_y13,4)+1)&\"-\"&TEXT(MID(dms_CRYf_y13,3,2)+2,\"00\")","v":"2030-31"},"dms_CRYf_y14",{"$f":"VALUE(LEFT(dms_CRYc_y13,4)+1)","v":2031},"dms_CRYc_y14"]
[null,15,"dms_FRCP_y15",15,"CRCP_y15",{"$f":"IF(dms_RPT=\"financial\",VALUE(LEFT(dms_FRCP_y14,4)+1)&\"-\"&TEXT(VALUE(RIGHT(dms_FRCP_y14,2)+1),\"00\"),VALUE(LEFT(dms_FRCP_y14,4)+1))","v":"2034-35"},"dms_FRCP_y15",{"$f":"IF(dms_RPT=\"financial\",VALUE(LEFT(dms_CRCP_yM,4)-1)&\"-\"&TEXT(VALUE(MID(dms_CRCP_yM,3,2)),\"00\"),VALUE(LEFT(dms_CRCP_yM,4)-1))","v":"2005-06"},"dms_CRCP_yL",15,null,"2019-20",2020,null,null,{"$f":"VALUE(LEFT(dms_CRYf_y14,4)+1)&\"-\"&TEXT(MID(dms_CRYf_y14,3,2)+2,\"00\")","v":"2031-32"},"dms_CRYf_y15",{"$f":"VALUE(LEFT(dms_CRYc_y14,4)+1)","v":2032},"dms_CRYc_y15"]
[null,null,null,null,null,null,null,null,null,null,null,"2020-21",2021,null,null,{"$f":"VALUE(LEFT(dms_CRYf_y15,4)+1)&\"-\"&TEXT(MID(dms_CRYf_y15,3,2)+2,\"00\")","v":"2032-33"},"dms_CRYf_y16",{"$f":"VALUE(LEFT(dms_CRYc_y15,4)+1)","v":2033},"dms_CRYc_y16"]
[null,"These are drop down lists for businesses to select the correct FRCP_y1 on the business and other details worksheet.\nThis also populates the column headings in the worksheets",null,null,null,null,null,null,null,null,null,"2021-22",2022,null,null,{"$f":"VALUE(LEFT(dms_CRYf_y16,4)+1)&\"-\"&TEXT(MID(dms_CRYf_y16,3,2)+2,\"00\")","v":"2033-34"},"dms_CRYf_y17",{"$f":"VALUE(LEFT(dms_CRYc_y16,4)+1)","v":2034},"dms_CRYc_y17"]
[null,"dms_RCP_fyear_list","dms_CRY_ListF","dms_CRY_ListC","dms_RCP_cyear_list","dms_FRCP_fyear_list","dms_FRCP_ListF","dms_FRCP_ListC","dms_FRCP_cyear_list",null,null,"2022-23",2023,null,null,{"$f":"VALUE(LEFT(dms_CRYf_y17,4)+1)&\"-\"&TEXT(MID(dms_CRYf_y17,3,2)+2,\"00\")","v":"2034-35"},"dms_CRYf_y18",{"$f":"VALUE(LEFT(dms_CRYc_y17,4)+1)","v":2035},"dms_CRYc_y18"]
[null,"dms_y1",{"$f":"CRY","v":"2017-18"},"2006","dms_cy1","dms_frcp_fy1","2010-11",2011,"dms_crcp_cy1",null,null,"2023-24",2024,null,null,{"$f":"VALUE(LEFT(dms_CRYf_y18,4)+1)&\"-\"&TEXT(MID(dms_CRYf_y18,3,2)+2,\"00\")","v":"2035-36"},"dms_CRYf_y19",{"$f":"VALUE(LEFT(dms_CRYc_y18,4)+1)","v":2036},"dms_CRYc_y19"]
[null,"dms_y2",{"$f":"IF(dms_RPT=\"financial\",VALUE(LEFT(CRY,4)+1)&\"-\"&TEXT(MID(CRY,3,2)+2,\"00\"),VALUE(LEFT(CRY,4)+1))","v":"2018-19"},"2007","dms_cy2","dms_frcp_fy2","2011-12",2012,"dms_crcp_cy2",null,null,"2024-25",2025,null,null,{"$f":"VALUE(LEFT(dms_CRYf_y19,4)+1)&\"-\"&TEXT(MID(dms_CRYf_y19,3,2)+2,\"00\")","v":"2036-37"},"dms_CRYf_y20",{"$f":"VALUE(LEFT(dms_CRYc_y19,4)+1)","v":2037},"dms_CRYc_y20"]
[null,"dms_y3",{"$f":"IF(dms_RPT=\"financial\",VALUE(LEFT(dms_fy2,4)+1)&\"-\"&TEXT(MID(dms_fy2,3,2)+2,\"00\"),VALUE(LEFT(dms_fy2,4)+1))","v":"2019-20"},"2008","dms_cy3","dms_frcp_fy3","2012-13",2013,"dms_crcp_cy3",null,null,"2025-26",2026]
[null,"dms_y4",{"$f":"IF(dms_RPT=\"financial\",VALUE(LEFT(dms_fy3,4)+1)&\"-\"&TEXT(MID(dms_fy3,3,2)+2,\"00\"),VALUE(LEFT(dms_fy3,4)+1))","v":"2020-21"},"2009","dms_cy4","dms_frcp_fy4","2013-14",2014,"dms_crcp_cy4",null,null,"2026-27",2027]
[null,"dms_y5",{"$f":"IF(dms_RPT=\"financial\",VALUE(LEFT(dms_fy4,4)+1)&\"-\"&TEXT(MID(dms_fy4,3,2)+2,\"00\"),VALUE(LEFT(dms_fy4,4)+1))","v":"2021-22"},2010,"dms_cy5","dms_frcp_fy5","2014-15",2015,"dms_crcp_cy5",null,null,"2027-28",2028]
[null,"dms_y6",{"$f":"IF(dms_RPT=\"financial\",VALUE(LEFT(dms_fy5,4)+1)&\"-\"&TEXT(MID(dms_fy5,3,2)+2,\"00\"),VALUE(LEFT(dms_fy5,4)+1))","v":"2022-23"},2011,"dms_cy6","dms_frcp_fy6","2015-16",2016,"dms_crcp_cy6",null,null,"2028-29",2029]
[null,"dms_y7",{"$f":"IF(dms_RPT=\"financial\",VALUE(LEFT(dms_fy6,4)+1)&\"-\"&TEXT(MID(dms_fy6,3,2)+2,\"00\"),VALUE(LEFT(dms_fy6,4)+1))","v":"2023-24"},2012,"dms_cy7","dms_frcp_fy7","2016-17",2017,"dms_crcp_cy7",null,null,"2029-30",2030]
[null,"dms_y8",{"$f":"IF(dms_RPT=\"financial\",VALUE(LEFT(dms_fy7,4)+1)&\"-\"&TEXT(MID(dms_fy7,3,2)+2,\"00\"),VALUE(LEFT(dms_fy7,4)+1))","v":"2024-25"},2013,"dms_cy8","dms_frcp_fy8","2017-18",2018,"dms_crcp_cy8",null,null,"2030-31",2031]
[null,"dms_y9",{"$f":"IF(dms_RPT=\"financial\",VALUE(LEFT(dms_fy8,4)+1)&\"-\"&TEXT(MID(dms_fy8,3,2)+2,\"00\"),VALUE(LEFT(dms_fy8,4)+1))","v":"2025-26"},2014,"dms_cy9","dms_frcp_fy9","2018-19",2019,"dms_crcp_cy9",null,null,"2031-32",2032]
[null,"dms_y10",{"$f":"IF(dms_RPT=\"financial\",VALUE(LEFT(dms_fy9,4)+1)&\"-\"&TEXT(MID(dms_fy9,3,2)+2,\"00\"),VALUE(LEFT(dms_fy9,4)+1))","v":"2026-27"},2015,"dms_cy10","dms_frcp_fy10","2019-20",2020,"dms_crcp_cy10",null,null,"2032-33",2033]
[null,"dms_y11",{"$f":"IF(dms_RPT=\"financial\",VALUE(LEFT(dms_fy10,4)+1)&\"-\"&TEXT(MID(dms_fy10,3,2)+2,\"00\"),VALUE(LEFT(dms_fy10,4)+1))","v":"2027-28"},2016,"dms_cy11","dms_frcp_fy11","2020-21",2021,"dms_crcp_cy11",null,null,"2033-34",2034]
[null,"dms_y12",{"$f":"IF(dms_RPT=\"financial\",VALUE(LEFT(dms_fy11,4)+1)&\"-\"&TEXT(MID(dms_fy11,3,2)+2,\"00\"),VALUE(LEFT(dms_fy11,4)+1))","v":"2028-29"},2017,"dms_cy12","dms_frcp_fy12","2021-22",2022,"dms_crcp_cy12",null,null,"2034-35",2035]
[null,"dms_y13",{"$f":"IF(dms_RPT=\"financial\",VALUE(LEFT(dms_fy12,4)+1)&\"-\"&TEXT(MID(dms_fy12,3,2)+2,\"00\"),VALUE(LEFT(dms_fy12,4)+1))","v":"2029-30"},2018,"dms_cy13","dms_frcp_fy13","2022-23",2023,"dms_crcp_cy13",null,null,"2035-36",2036]
[null,"dms_y14",{"$f":"IF(dms_RPT=\"financial\",VALUE(LEFT(dms_fy13,4)+1)&\"-\"&TEXT(MID(dms_fy13,3,2)+2,\"00\"),VALUE(LEFT(dms_fy13,4)+1))","v":"2030-31"},2019,"dms_cy14","dms_frcp_fy14","2023-24",2024,"dms_crcp_cy14"]
[null,"dms_y15",{"$f":"IF(dms_RPT=\"financial\",VALUE(LEFT(dms_fy14,4)+1)&\"-\"&TEXT(MID(dms_fy14,3,2)+2,\"00\"),VALUE(LEFT(dms_fy14,4)+1))","v":"2031-32"},2020,"dms_cy15","dms_frcp_fy15","2024-25",2025,"dms_crcp_cy15"]
[null,"dms_y16",{"$f":"IF(dms_RPT=\"financial\",VALUE(LEFT(dms_fy15,4)+1)&\"-\"&TEXT(MID(dms_fy15,3,2)+2,\"00\"),VALUE(LEFT(dms_fy15,4)+1))","v":"2032-33"},2021,"dms_cy16"]
[null,"dms_y17",{"$f":"IF(dms_RPT=\"financial\",VALUE(LEFT(dms_fy16,4)+1)&\"-\"&TEXT(MID(dms_fy16,3,2)+2,\"00\"),VALUE(LEFT(dms_fy16,4)+1))","v":"2033-34"},2022,"dms_cy17"]
[null,"dms_y18",{"$f":"IF(dms_RPT=\"financial\",VALUE(LEFT(dms_fy17,4)+1)&\"-\"&TEXT(MID(dms_fy17,3,2)+2,\"00\"),VALUE(LEFT(dms_fy17,4)+1))","v":"2034-35"},2023,"dms_cy18"]
[null,"dms_y19",{"$f":"IF(dms_RPT=\"financial\",VALUE(LEFT(dms_fy18,4)+1)&\"-\"&TEXT(MID(dms_fy18,3,2)+2,\"00\"),VALUE(LEFT(dms_fy18,4)+1))","v":"2035-36"},2024,"dms_cy19"]
[null,"dms_y20",{"$f":"IF(dms_RPT=\"financial\",VALUE(LEFT(dms_fy19,4)+1)&\"-\"&TEXT(MID(dms_fy19,3,2)+2,\"00\"),VALUE(LEFT(dms_fy19)+1))","v":"2036-37"},2025,"dms_cy20"]
[]
[]
[]
[]
[]
[null,"These \"row descriptions\" are the column headings in the various templates but become row descriptions in the ETL process"]
[null,null,"Table 6.3 sustained interruptions - row descriptions"]
[null,null,"dms_060301_CustNo_Affected_Row","dms_060301_Avg_Duration_Sustained_Int_Row","dms_060301_Effect_unplanned_SAIDI_Row","dms_060301_Effect_unplanned_SAIFI_Row"]
[null,null,"Number of customers affected by the interruption","Average duration of sustained customer interruption","Effect on unplanned SAIDI","Effect on unplanned SAIFI"]
[]
[]
[]
[null,null,"Table 6.1 telephone answering - row descriptions and start date"]
[null,null,"dms_060101_Rows","dms_060102_Rows","dms_060101_StartDateTxt"]
[null,null,"Total number of calls \n(after removing excluded events)","Number of calls answered within 30 seconds \n(after excluding excluded events) ",{"$f":"dms_060701_StartDateTxt","v":"1-Jul-2017"}]
[]
[]
[]
[null,null,null,null,null,null,null,"dms_0603_FeederList",{"$f":"INDEX(dms_FeederName_1,MATCH(dms_TradingName,dms_TradingName_List))","v":"CBD"},{"$f":"INDEX(dms_FeederName_2,MATCH(dms_TradingName,dms_TradingName_List))","v":"Urban"},{"$f":"INDEX(dms_FeederName_3,MATCH(dms_TradingName,dms_TradingName_List))","v":"Short rural"},{"$f":"INDEX(dms_FeederName_4,MATCH(dms_TradingName,dms_TradingName_List))","v":"Long rural"},{"$f":"INDEX(dms_FeederName_5,MATCH(dms_TradingName,dms_TradingName_List))","v":"  "}]
[null,null,"Table 6.7.1 - daily performance data - unplanned - MAIFI  -- row descriptions and header named range values"]
[null,null,"These headings (Lists) are determined from the INDEX/MATCH function on the NSP selected on the Business & other details sheet"]
[null,"dms_060701_Feeder_Header_Lvl4",{"$f":"INDEX(dms_FeederName_1,MATCH(dms_TradingName,dms_TradingName_List))","v":"CBD"},{"$f":"INDEX(dms_FeederName_1,MATCH(dms_TradingName,dms_TradingName_List))","v":"CBD"},{"$f":"INDEX(dms_FeederName_2,MATCH(dms_TradingName,dms_TradingName_List))","v":"Urban"},{"$f":"INDEX(dms_FeederName_2,MATCH(dms_TradingName,dms_TradingName_List))","v":"Urban"},{"$f":"INDEX(dms_FeederName_3,MATCH(dms_TradingName,dms_TradingName_List))","v":"Short rural"},{"$f":"INDEX(dms_FeederName_3,MATCH(dms_TradingName,dms_TradingName_List))","v":"Short rural"},{"$f":"INDEX(dms_FeederName_4,MATCH(dms_TradingName,dms_TradingName_List))","v":"Long rural"},{"$f":"INDEX(dms_FeederName_4,MATCH(dms_TradingName,dms_TradingName_List))","v":"Long rural"},{"$f":"IF((INDEX(dms_FeederName_5,MATCH(dms_TradingName,dms_TradingName_List))=0),\"Network\",(INDEX(dms_FeederName_5,MATCH(dms_TradingName,dms_TradingName_List))))","v":"  "},{"$f":"IF((INDEX(dms_FeederName_5,MATCH(dms_TradingName,dms_TradingName_List))=0),\"Network\",(INDEX(dms_FeederName_5,MATCH(dms_TradingName,dms_TradingName_List))))","v":"  "},"Network","Network"]
[]
[null,"dms_060701_Rows","All events","After removing excluded events","All events","After removing excluded events","All events","After removing excluded events","All events","After removing excluded events","All events","After removing excluded events","All events","After removing excluded events"]
[null,null,"the number of column headings changes from 10 to 12 depending on the number of feeder categories for the NSP"]
[]
[]
[]
[]
[null,null,"Table 6.8.1 - row descriptions"]
[null,null,"dms_060801_01_Rows","dms_060801_02_Rows","dms_060801_03_Rows","dms_060801_04_Rows"]
[null,null,"Number of interruptions","Duration of interruptions","Total unplanned minutes off supply","Effect on unplanned MAIFI"]
[]
[]
[]
[]
[null,null,"Table 7.9.4 - market impact component - row descriptions"]
[null,"dms_070904_01_Rows","without exclusions","with exclusions"]
[]
[]
[]
[]
[]
[null,null,"Use this to add to existing files"]
[null,null,"ARRs 6.7 STPIS daily performance"]
[null,null,"dms_060101_Values","dms_060102_Values","dms_060701_Values"]
[]
[null,null,"ARR's  6.8 STPIS exclusions"]
[null,null,"dms_060801_Event_Date","dms_060801_OutageID","dms_060801_FeederID","dms_060801_FeederClass","dms_060801_CauseID","dms_060801_01_Values","dms_060801_02_Values","dms_060801_03_Values","dms_060801_Excl_Cat","dms_060801_04_Values"]
[null,null,"dms_060801_StartCell"]
[]
[null,null,"CA 6.3 sustained interruptions"]
[null,null,"dms_060301_Event_Date","dms_060301_Event_Time","dms_060301_AssetID","dms_060301_FeederClass","dms_060301_Reason","dms_060301_DetailedReason","dms_060301_CustNo_Affected_Values","dms_060301_Avg_Duration_Sustained_Int_Values","dms_060301_Effect_unplanned_SAIDI_Values","dms_060301_Effect_unplanned_SAIFI_Values","dms_060301_MED"]

{"sheet":"Contents","index":2,"n_rows":31,"n_cols":4,"rows_kept":31,"cut":false,"hidden":false,"merged":[[2,1,2,3],[3,1,3,3],[4,1,4,3]]}
[]
[]
[null,{"$f":"CONCATENATE(dms_Segment,\" Network Service Provider\")","v":"Distribution Network Service Provider"}]
[]
[null,"Table of Contents"]
[]
[]
[null,null,"Instructions"]
[null,null,"Business & other details"]
[]
[]
[null,"CATEGORY ANALYSIS","STPIS","STATUTORY ACCOUNTS"]
[]
[null,"2.11 Labour","6.2 STPIS Reliability","8.1 Income"]
[null,null,"6.6 STPIS Customer Service","8.2 Capex"]
[null,null,"6.7 STPIS Daily Performance"]
[null,null,"6.8 STPIS Exclusions","8.4 Opex"]
[null,null,"6.9 STPIS GSL"]
[]
[]
[]
[null,"NETWORK PERFORMANCE","OTHER INFORMATION","PRICING PROPOSAL"]
[null,null,null,"Victorian Businesses Only"]
[null,"3.6 Quality of services","7.8 Avoided Cost Payments"]
[null,"3.6.8 Network-feeders","7.10 Juris Scheme","9.5 TUoS"]
[null,"3.6.9 Network-reliability","7.11 DMIS-DMIA"]
[null,null,"7.12 Safety and Bushfire"]
[]
[null,"PUBLIC LIGHTING"]
[]
[null,"4.1 Public lighting tariffs"]

{"sheet":"Instructions","index":3,"n_rows":27,"n_cols":4,"rows_kept":27,"cut":false,"hidden":false,"merged":[[7,2,7,3],[1,1,1,5],[2,1,2,5],[3,2,3,4],[4,2,4,4],[5,2,5,4],[24,2,24,4],[25,2,25,3],[26,2,26,4],[8,2,8,4],[10,2,10,4],[12,2,12,4],[20,2,20,4],[22,2,22,4]]}
[]
[null,{"$f":"CONCATENATE(dms_Segment,\" Network Service Provider\")","v":"Distribution Network Service Provider"}]
[null,{"$f":"IF(dms_Model=\"Reset\",\"Regulatory Proposal RIN Template\",\"Annual Reporting RIN\")","v":"Annual Reporting RIN"}]
[null,null,"This template is to be used by Australian Distribution Co. to fulfil its reporting obligations to the AER."]
[null,null,"INSTRUCTIONS"]
[null,null,"Complete the Business & other details worksheet before entering data or values in any other worksheets. The Business & other details worksheet is linked to other worksheets within the workbook and automatically generates certain column headings and conditional formatting."]
[]
[null,null,"Identifying CONFIDENTIAL INFORMATION:\n\nPlease use the macro at the top of each \nworksheet to identify confidential information. \n\n"]
[null,null,"-Do this by selecting the cell or cells that contain confidential information and then run the Mark selected cells as CONFIDENTIAL macro. This will format the cells a specific colour that is identified by the AER's database which in turn marks that information as confidential.\n\n-To reverse this, select the cell or cells and run the Return cells to NON-CONFIDENTIAL macro."]
[]
[null,null,"UNITS OF MEASURE\n\nAll amounts are to be unrounded and reported on a one for one basis: that is 1000 is to be entered as '1000'. Applicable units of measure may be identified in the table column headings or row descriptors.\n\n"]
[]
[null,null,"COLOUR CODING OF INPUT / NON-INPUT CELLS:"]
[null,null,null,"Yellow = Input cell (mandatory)"]
[null,null,null,"Darker yellow = input cell (mandatory)"]
[null,null,null,"Orange = input cell (if data available)"]
[null,null,null,"Grey = Not applicable/No inputs required"]
[null,null,null," \nPLEASE DO NOT ENTER TEXT into cells that are to contain numeric data."]
[]
[]
[null,null,"WORKSHEET NAVIGATION\n\nMany tables in the worksheets have been \"grouped\" to allow for easy navigation. To ungroup or group data use the outline symbols in the left margin (for Row groupings) or above the columns (for column groupings). \n\n\n\n"]
[]
[null,null,"RETURNING COMPLETED RESPONSES\n\nPlease return two (2) files to the AER: \n1. A confidential version which must contain a complete set of all responses with confidential information marked using the Mark selection CONFIDENTIAL macro and which has been completed using the locked template file provided by the AER. \n\n2. A public version with confidential information either removed completely or aggregated in some form together with writtten consent to disclose the public version of the response.\n\nUse the drop down box on the Business and other details worksheet to identify the file as either confidential ('consolidated') or public. "]
[]
[null,null,"SUBMITTING AMENDED DATA TO THE AER\n\nIf an NSP wishes to correct data previously submitted to the AER it should resubmit that data using the original completed submission as the starting point. Please make any necessary changes to the data. Data that is not being amended should be left unchanged. \n\nNSPs must identify the reason for the amendments in the Amendment Reason box on the  Business and other details worksheet. NSPs may provide further details regarding any amendments in the Amendments worksheet. \n\n."]
[null,null,"NSP may use Amended Data macro \nto highlight cells that contain amended data.\nNB: if data is also CONFIDENTIAL, re-apply \nthe Confidentiality macro after applying the \nAmended macro"]
[null,null,"Please resubmit two (2) files - a confidential version and a public version of the amended submission to the AER"]

{"sheet":"Business & other details","index":4,"n_rows":156,"n_cols":9,"rows_kept":156,"cut":false,"hidden":false,"merged":[[7,1,7,8],[11,1,11,8],[13,2,13,4],[14,2,14,4],[17,2,17,3],[17,4,17,7],[59,2,59,8],[18,4,18,7],[19,2,19,3],[19,4,19,7],[22,2,22,3],[22,4,22,7],[23,4,23,7],[24,2,24,3],[24,4,24,7],[32,1,32,8],[57,2,57,3],[58,4,58,8],[28,2,28,3],[29,2,29,3],[30,2,30,3]]}
[null,{"$f":"IF(dms_DataQuality=\"backcast\",INDEX(dms_Worksheet_List,MATCH(dms_Model,dms_Model_List))&\" BACKCAST\",INDEX(dms_Worksheet_List,MATCH(dms_Model,dms_Model_List)))","v":"ANNUAL REPORTING STATEMENT"}]
[null,{"$f":"INDEX(dms_TradingNameFull_List,MATCH(dms_TradingName,dms_TradingName_List))","v":"SA Power Networks"}]
[null,{"$f":"IF(SUM(dms_SingleYear_Model)>0,CONCATENATE(CRY),CONCATENATE(FRCP_y1,\" to \",dms_MultiYear_FinalYear_Result))","v":"2017-18"}]
[null,"BUSINESS & OTHER DETAILS"]
[]
[]
[null,"Instructions"]
[null,"Complete the following business details regulatory template before entering data or values in any other regulatory template. This regulatory template is linked to other cells within the spreadsheet and automatically generates column headings and conditional formatting to distinguish business specific input and non-input cells. "]
[]
[null,"SUBMISSION PARTICULARS INPUT SHEETS"]
[]
[null,"ENTITY DETAILS"]
[]
[null,"Short name","SA Power Networks",null,null,"Select business name from drop down list first"]
[null,"ACN / ABN",{"$f":"INDEX(dms_ABN_List,MATCH(dms_TradingName,dms_TradingName_List))","v":13332330749}]
[]
[]
[null,"Business address","Address 1",null,{"$f":"INDEX(dms_Addr1_List,MATCH(dms_TradingName,dms_TradingName_List))","v":"1 Anzac Highway"}]
[null,null,null,"Address 2",{"$f":"IF(ISBLANK(INDEX(dms_Addr2_List,MATCH(dms_TradingName,dms_TradingName_List))),\"\",(INDEX(dms_Addr2_List,MATCH(dms_TradingName,dms_TradingName_List))))","v":""}]
[null,null,"Suburb",null,{"$f":"INDEX(dms_Suburb_List,MATCH(dms_TradingName,dms_TradingName_List))","v":"KESWICK"}]
[null,null,null,"State",{"$f":"INDEX(dms_State_List,MATCH(dms_TradingName,dms_TradingName_List))","v":"SA"},"p/code",{"$f":"INDEX(dms_PostCode_List,MATCH(dms_TradingName,dms_TradingName_List))","v":5035}]
[]
[null,"Postal address","Address 1",null,{"$f":"INDEX(dms_PAddr1_List,MATCH(dms_TradingName,dms_TradingName_List))","v":"GPO Box 77"}]
[null,null,null,"Address 2",{"$f":"IF(ISBLANK(INDEX(dms_PAddr2_List,MATCH(dms_TradingName,dms_TradingName_List))),\"\",(INDEX(dms_PAddr2_List,MATCH(dms_TradingName,dms_TradingName_List))))","v":""}]
[null,null,"Suburb",null,{"$f":"INDEX(dms_PSuburb_List,MATCH(dms_TradingName,dms_TradingName_List))","v":"ADELAIDE"}]
[null,null,null,"State",{"$f":"INDEX(dms_PState_List,MATCH(dms_TradingName,dms_TradingName_List))","v":"SA"},"p/code",5001]
[]
[]
[null,"Contact name/s","Richard Sibly"]
[null,"Contact phone/s"]
[null,"Contact email address/s"]
[]
[null,"REGULATORY CONTROL PERIODS"]
[]
[null,"Forthcoming regulatory control period","2020-21",{"$f":"dms_FRCP_y2","v":"2021-22"},{"$f":"dms_FRCP_y3","v":"2022-23"},{"$f":"dms_FRCP_y4","v":"2023-24"},{"$f":"dms_FRCP_y5","v":"2024-25"}]
[null,null,{"$f":"dms_FRCP_y6","v":"2025-26"},{"$f":"dms_FRCP_y7","v":"2026-27"},{"$f":"dms_FRCP_y8","v":"2027-28"},{"$f":"dms_FRCP_y9","v":"2028-29"},{"$f":"dms_FRCP_y10","v":"2029-30"}]
[]
[]
[null,"Current regulatory control period",{"$f":"dms_CRCP_FirstYear_Result","v":"2015-16"},{"$f":"IF(dms_RPT=\"financial\",VALUE(LEFT(CRCP_y1,4)+1)&\"-\"&TEXT(MID(CRCP_y1,3,2)+2,\"00\"),VALUE(LEFT(CRCP_y1,4)+1))","v":"2016-17"},{"$f":"IF(dms_RPT=\"financial\",VALUE(LEFT(CRCP_y1,4)+2)&\"-\"&TEXT(VALUE(MID(CRCP_y1,3,2)+3),\"00\"),VALUE(LEFT(CRCP_y1,4)+2))","v":"2017-18"},{"$f":"IF(dms_RPT=\"financial\",VALUE(LEFT(CRCP_y1,4)+3)&\"-\"&TEXT(MID(CRCP_y1,3,2)+4,\"00\"),VALUE(LEFT(CRCP_y1,4)+3))","v":"2018-19"},{"$f":"IF(dms_RPT=\"financial\",VALUE(LEFT(CRCP_y1,4)+4)&\"-\"&TEXT(MID(CRCP_y1,3,2)+5,\"00\"),VALUE(LEFT(CRCP_y1,4)+4))","v":"2019-20"}]
[null,null,{"$f":"IF(dms_RPT=\"financial\",VALUE(LEFT(CRCP_y1,4)+5)&\"-\"&TEXT(MID(CRCP_y1,3,2)+6,\"00\"),VALUE(LEFT(CRCP_y1,4)+5))","v":"2020-21"},{"$f":"IF(dms_RPT=\"financial\",VALUE(LEFT(CRCP_y1,4)+6)&\"-\"&TEXT(MID(CRCP_y1,3,2)+7,\"00\"),VALUE(LEFT(CRCP_y1,4)+6))","v":"2021-22"},{"$f":"IF(dms_RPT=\"financial\",VALUE(LEFT(CRCP_y1,4)+7)&\"-\"&TEXT(MID(CRCP_y1,3,2)+8,\"00\"),VALUE(LEFT(CRCP_y1,4)+7))","v":"2022-23"},{"$f":"IF(dms_RPT=\"financial\",VALUE(LEFT(CRCP_y1,4)+8)&\"-\"&TEXT(MID(CRCP_y1,3,2)+9,\"00\"),VALUE(LEFT(CRCP_y1,4)+8))","v":"2023-24"},{"$f":"IF(dms_RPT=\"financial\",VALUE(LEFT(CRCP_y1,4)+9)&\"-\"&TEXT(MID(CRCP_y1,3,2)+10,\"00\"),VALUE(LEFT(CRCP_y1,4)+9))","v":"2024-25"}]
[null,null,{"$f":"IF(dms_RPT=\"financial\",VALUE(LEFT(CRCP_y1,4)+10)&\"-\"&TEXT(MID(CRCP_y1,3,2)+11,\"00\"),VALUE(LEFT(CRCP_y1,4)+10))","v":"2025-26"},{"$f":"IF(dms_RPT=\"financial\",VALUE(LEFT(CRCP_y1,4)+11)&\"-\"&TEXT(MID(CRCP_y1,3,2)+12,\"00\"),VALUE(LEFT(CRCP_y1,4)+11))","v":"2026-27"},{"$f":"IF(dms_RPT=\"financial\",VALUE(LEFT(CRCP_y1,4)+12)&\"-\"&TEXT(MID(CRCP_y1,3,2)+13,\"00\"),VALUE(LEFT(CRCP_y1,4)+12))","v":"2027-28"},{"$f":"IF(dms_RPT=\"financial\",VALUE(LEFT(CRCP_y1,4)+13)&\"-\"&TEXT(MID(CRCP_y1,3,2)+14,\"00\"),VALUE(LEFT(CRCP_y1,4)+13))","v":"2028-29"},{"$f":"IF(dms_RPT=\"financial\",VALUE(LEFT(CRCP_y1,4)+14)&\"-\"&TEXT(MID(CRCP_y1,3,2)+15,\"00\"),VALUE(LEFT(CRCP_y1,4)+14))","v":"2029-30"}]
[]
[]
[null,"Previous regulatory control period",{"$f":"IF(dms_RPT=\"financial\",VALUE(LEFT(PRCP_y2,4)-1)&\"-\"&TEXT(VALUE(MID(PRCP_y2,3,2)),\"00\"),VALUE(LEFT(PRCP_y2,4)-1))","v":"2010-11"},{"$f":"IF(dms_RPT=\"financial\",VALUE(LEFT(PRCP_y3,4)-1)&\"-\"&TEXT(VALUE(MID(PRCP_y3,3,2)),\"00\"),VALUE(LEFT(PRCP_y3,4)-1))","v":"2011-12"},{"$f":"IF(dms_RPT=\"financial\",VALUE(LEFT(PRCP_y4,4)-1)&\"-\"&TEXT(VALUE(MID(PRCP_y4,3,2)),\"00\"),VALUE(LEFT(PRCP_y4,4)-1))","v":"2012-13"},{"$f":"IF(dms_RPT=\"financial\",VALUE(LEFT(PRCP_y5,4)-1)&\"-\"&TEXT(VALUE(RIGHT(PRCP_y5,2)-1),\"00\"),VALUE(LEFT(PRCP_y5,4)-1))","v":"2013-14"},{"$f":"IF(dms_RPT=\"financial\",VALUE(LEFT(CRCP_y1,4)-1)&\"-\"&TEXT(VALUE(RIGHT(CRCP_y1,2)-1),\"00\"),VALUE(LEFT(CRCP_y1,4)-1))","v":"2014-15"}]
[]
[]
[]
[null,"Commencing regulatory year","2017-18","CRY"]
[]
[null,"Last completed regulatory year","2017-18","dms_FinalYear"]
[]
[]
[]
[null,null,"IF THIS IS AN ABC RIN - make sure the the named range CRY is applied and the named range dms_dollar_nom_UOM is applied"]
[null,null,"IF THIS IS A RESET RIN - make sure the named ranges CRY and dms_dollar_nom_UOM are NOT present in the workbook"]
[null,null,"FOR ABC RINS THAT SPAN MULTIPLE YEARS - make sure MultiYear Flag is set and final year entered as required"]
[]
[null,"Source","Reporting",null,"Please select the correct submission type from the dropdown list."]
[null,"Data quality (actual, estimate, public, consolidated)","Public",null,"Use Consolidated for Consolidated Confidential version\nUse Public for Consolidated Public version"]
[null,"Amended RIN submission - amendment reason","20190809 - 8.2.1 & 8.2.3 (D19/123035)\n20190711 - 8.2.4 updated (D19/103436)\n20190523 - 2.11, 3.6 & 8.2 updated (D19/105950)"]
[null,"Submission Date","2019-08-09","dms_SubmissionDate","Please enter date this file submitted to AER (dd/mm/yyyy)"]
[null,"EBSS - First application of scheme in forthcoming period?","No"]
[null,"Sector",{"$f":"INDEX(dms_Sector_List,MATCH(dms_TradingName,dms_TradingName_List))","v":"Electricity"},"dms_Sector","=INDEX(dms_Sector_List,MATCH(dms_TradingName,dms_TradingName_List))"]
[null,"Segment",{"$f":"INDEX(dms_Segment_List,MATCH(dms_TradingName,dms_TradingName_List))","v":"Distribution"},"dms_Segment","=INDEX(dms_Segment_List,MATCH(dms_TradingName,dms_TradingName_List))"]
[null,"Regulatory Year Ending",{"$f":"IF(dms_MultiYear_Flag=1,LEFT(dms_Specified_FinalYear,2)&RIGHT(dms_Specified_FinalYear,2),INDEX(dms_RYE_Formula_Result,MATCH(dms_Model,dms_Model_List)))","v":"2018"},"dms_RYE","=IF(dms_MultiYear_Flag=1,LEFT(dms_Specified_FinalYear,2)&RIGHT(dms_Specified_FinalYear,2),INDEX(dms_RYE_Formula_Result,MATCH(dms_Model,dms_Model_List)))"]
[null,"Reporting Period Type",{"$f":"INDEX(dms_RPT_List,MATCH(dms_TradingName,dms_TradingName_List))","v":"Financial"},"dms_RPT","=INDEX(dms_RPT_List,MATCH(dms_TradingName,dms_TradingName_List))"]
[null,"Model or RIN Type","ARR","dms_Model","Drop down selection"]
[null,"EB/CA Unit of Measure for Monetary Values","$0s","dms_dollar_nom_UOM","If the cover sheet is attached to an ABC RIN apply the NAMED RANGE to the cell"]
[null,"Security Classification","Public","dms_Classification","Always Public"]
[null,"Jurisdiction",{"$f":"INDEX(dms_JurisdictionList,MATCH(dms_TradingName,dms_TradingName_List))","v":"SA"},"dms_Jurisdiction","=INDEX(dms_JurisdictionList,MATCH(dms_TradingName,dms_TradingName_List))"]
[null,"FORECAST and MultiYear RINS"]
[null,"CRY-1  (last full calendar year before CRY)",{"$f":"IF(dms_RPT=\"financial\",VALUE(LEFT(dms_SingleYear_FinalYear_Result,4)),VALUE(LEFT(dms_SingleYear_FinalYear_Result,4)-1))","v":2017},"dms_Cal_Year_B4_CRY","'=IF(dms_RPT=\"financial\",VALUE(LEFT(dms_SingleYear_FinalYear_Result,4)),VALUE(LEFT(dms_SingleYear_FinalYear_Result,4)-1))"]
[null,"Dollar $ real month",{"$f":"INDEX(dms_RPTMonth_List,MATCH(dms_TradingName,dms_TradingName_List))","v":"June"},"dms_RPTMonth","=INDEX(dms_RPTMonth_List,MATCH(dms_TradingName,dms_TradingName_List))"]
[null,"Dollar $ real  (the last month before the FRCP_y1)",{"$f":"IF(SUM(dms_SingleYear_Model)>0,CONCATENATE(dms_RPTMonth)&\" \"&VALUE((LEFT(CRY,2))&RIGHT(CRY,2)),CONCATENATE(dms_RPTMonth)&\" \"&VALUE((LEFT(dms_CRCP_FinalYear_Result,2)&RIGHT(dms_CRCP_FinalYear_Result,2))))","v":"June 2018"},"dms_DollarReal","=IF(SUM(dms_SingleYear_Model)>0,CONCATENATE(dms_RPTMonth)&\" \"&VALUE((LEFT(CRY,2))&RIGHT(CRY,2)),CONCATENATE(dms_RPTMonth)&\" \"&VALUE((LEFT(dms_CRCP_FinalYear_Result,2)&RIGHT(dms_CRCP_FinalYear_Result,2))))"]
[null,"Dollar $ real previous year (PRCP_y5)",{"$f":"IF(SUM(dms_SingleYear_Model)>0,CONCATENATE(dms_RPTMonth)&\" \"&VALUE(((LEFT(CRY,2))&RIGHT(CRY,2))-1),CONCATENATE(dms_RPTMonth)&\" \"&VALUE(((LEFT(dms_CRCP_FirstYear_Result,2)&RIGHT(dms_CRCP_FirstYear_Result,2))))-1)","v":"June 2017"},"dms_DollarReal_Prev","=IF(SUM(dms_SingleYear_Model)>0,CONCATENATE(dms_RPTMonth)&\" \"&VALUE(((LEFT(CRY,2))&RIGHT(CRY,2))-1),CONCATENATE(dms_RPTMonth)&\" \"&VALUE(((LEFT(dms_CRCP_FirstYear_Result,2)&RIGHT(dms_CRCP_FirstYear_Result,2))))-1)"]
[null,"This block works out the various RYE's for ALL RIN types and MODELS"]
[null,"Single Year Model T/F",{"$f":"IF(dms_Model=\"EB\",1,0)","v":0},"dms_EB"]
[null,null,{"$f":"IF(dms_Model=\"CA\",1,0)","v":0},"dms_CA","=dms_SingleYear_Model"]
[null,null,{"$f":"IF(dms_Model=\"ARR\",1,0)","v":1},"dms_ARR"]
[null,"Is this a single Year RIN?",{"$f":"IF(SUM(dms_SingleYear_Model)=1,\"yes\",\"no\")","v":"yes"},"dms_SingleYearModel","=IF(SUM(dms_SingleYear_Model)=1,\"yes\",\"no\")"]
[null,"Single Year Final Year Reference","CRY","dms_SingleYear_FinalYear_Ref","This is the reference for EB, CA & ARR RINs"]
[null,"Single Year Final Year Result",{"$f":"IFERROR(IF(SUM(dms_SingleYear_Model)<>0,(INDIRECT(dms_SingleYear_FinalYear_Ref)),\"not a single year RIN\"),\"CRY not present\")","v":"2017-18"},"dms_SingleYear_FinalYear_Result","=IFERROR(IF(SUM(dms_SingleYear_Model)<>0,(INDIRECT(dms_SingleYear_FinalYear_Ref)),\"not a single year RIN\"),\"CRY not present\")"]
[null,"FRCP length in years",{"$f":"INDEX(dms_FRCPlength_List,MATCH(dms_TradingName,dms_TradingName_List))","v":5},"dms_FRCPlength_Num","=INDEX(dms_FRCPlength_List,MATCH(dms_TradingName,dms_TradingName_List))"]
[null,"Multi Year Final Year Reference",{"$f":"INDEX(dms_FinalYear_List,MATCH(dms_FRCPlength_Num,dms_FRCPlength_Num_List))","v":"dms_FRCP_y5"},"dms_MultiYear_FinalYear_Ref","=INDEX(dms_FinalYear_List,MATCH(dms_FRCPlength_Num,dms_FRCPlength_Num_List))"]
[null,"Multi Year Final Year Result",{"$f":"IF(dms_MultiYear_Flag=0,INDIRECT(dms_MultiYear_FinalYear_Ref),dms_Specified_FinalYear)","v":"2024-25"},"dms_MultiYear_FinalYear_Result","=IF(dms_MultiYear_Flag=0,INDIRECT(dms_MultiYear_FinalYear_Ref),dms_Specified_FinalYear)",null,null,null,"Formula errors OK"]
[null,"CRCP length in years",{"$f":"INDEX(dms_CRCPlength_List,MATCH(dms_TradingName,dms_TradingName_List))","v":5},"dms_CRCPlength_Num","=INDEX(dms_CRCPlength_List,MATCH(dms_TradingName,dms_TradingName_List))"]
[null,"CRCP Final Year Reference",{"$f":"INDEX(dms_CFinalYear_List,MATCH(dms_CRCPlength_Num,dms_CRCPlength_Num_List))","v":"CRCP_y5"},"dms_CRCP_FinalYear_Ref","=INDEX(dms_CFinalYear_List,MATCH(dms_CRCPlength_Num,dms_CRCPlength_Num_List))"]
[null,"CRCP First Year Result",{"$f":"INDEX(dms_CRCP_years,MATCH(dms_CRCPlength_Num,dms_CRCP_index))","v":"2015-16"},"dms_CRCP_FirstYear_Result","=INDEX(dms_CRCP_years,MATCH(dms_CRCPlength_Num,dms_CRCP_index))"]
[null,"CRCP Final Year Result",{"$f":"IF(dms_MultiYear_Flag=0,(IF(SUM(dms_SingleYear_Model)>0,CRY,dms_CRCP_yZ)),dms_Specified_FinalYear)","v":"2017-18"},"dms_CRCP_FinalYear_Result","=IF(dms_MultiYear_Flag=0,(IF(SUM(dms_SingleYear_Model)>0,CRY,dms_CRCP_yZ)),dms_Specified_FinalYear)"]
[null,"PTRM/ RFMs"]
[null,"Form of control",{"$f":"INDEX(dms_FormControl_List,MATCH(dms_TradingName,dms_TradingName_List))","v":"Revenue cap"},"dms_FormControl","=INDEX(dms_FormControl_List,MATCH(dms_TradingName,dms_TradingName_List))"]
[null,"ABC RINS THAT SPAN MULTIPLE YEARS"]
[null,"Is this a multi year ABC RIN?","No"]
[null,"Multiyear EB, CA or ARR?",{"$f":"IF(dms_MultiYear_ResponseFlag=\"No\",0,1)","v":0},"dms_MultiYear_Flag","This is set from the answer provided above"]
[null,null,{"$f":"IF(dms_MultiYear_Flag=1,FRY,\"not a Multiple year submission\")","v":"not a Multiple year submission"},"dms_Specified_FinalYear","The result here is returned to dms_CRCP_FinalYear_Result if response to Q in C73 is \"yes\" and dms_MultiYear_Flag is set to 1"]
[null," Start year for 5.2 in Multi year ABC RINS",{"$f":"IFERROR(IF(dms_MultiYear_Flag=1,FRY,CRY),\"not an ABC\")","v":"2017-18"},"dms_0502_Inst_Year","=IF(dms_MultiYear_Flag=1,FRY,CRY)",null,"For single year RINS this is CRY - multi year RINS need to start a the end of the span of years (ie. FRY)"]
[null,"EB RINS"]
[null,"Calendar Year for table 3.6 data",{"$f":"IF(dms_RPT=\"financial\",VALUE(LEFT(dms_SingleYear_FinalYear_Result,4)),VALUE(LEFT(dms_SingleYear_FinalYear_Result,4)-1))","v":2017},"dms_0306_Year","=IF(dms_RPT=\"financial\",VALUE(LEFT(dms_SingleYear_FinalYear_Result,4)),VALUE(LEFT(dms_SingleYear_FinalYear_Result,4)-1))"]
[null,"CA RINS"]
[null,"Find how many rows in tables 6.3 sustained interruptions?",null,null,"dms_060301_MaxRows only returns a valid value when cover sheet is attached to a CA file"]
[null,null,{"$f":"IF(dms_Model<>\"CA\",\"not a CA\",\"Is a CA\")","v":"not a CA"},null,"=IF(dms_Model<>\"CA\",\"not a CA\",\"Is a CA\")"]
[null,"dms_060301_Avg_Duration_Sustained_Int_Values present?",{"$f":"IFERROR(IF(INDEX(dms_060301_Avg_Duration_Sustained_Int_Values,1,1)<>\"\",\"yes\",\"no\"),\"no\")","v":"no"},"dms_060301_checkvalue","=IFERROR(IF(INDEX(dms_060301_Avg_Duration_Sustained_Int_Values,1,1)<>\"\",\"yes\",\"no\"),\"no\")"]
[null,null,{"$f":"IF(AND(dms_Model=\"CA\",(dms_060301_checkvalue=\"no\")),\"error - NR not present\",\"no errors\")","v":"no errors"},null,"=IF(AND(dms_Model=\"CA\",(dms_060301_checkvalue=\"no\")),\"error - NR not present\",\"no errors\")"]
[null,"Table 6.3.1 - last row reference",{"$f":"IFERROR(IF(dms_Model=\"CA\",LOOKUP(2,1/(dms_060301_Avg_Duration_Sustained_Int_Values<>\"\"),(ROW(dms_060301_Avg_Duration_Sustained_Int_Values))),\"not a CA\"),\"6.3 not present\")","v":"not a CA"},"dms_060301_LastRow","=IFERROR(IF(dms_Model=\"CA\",LOOKUP(2,1/(dms_060301_Avg_Duration_Sustained_Int_Values<>\"\"),(ROW(dms_060301_Avg_Duration_Sustained_Int_Values))),\"not a CA\"),\"6.3 not present\")"]
[null,"Table 6.3.1 - max number rows",{"$f":"IFERROR(IF(dms_Model=\"CA\",(dms_060301_LastRow-15),\"not a CA\"),\"error\")","v":"not a CA"},"dms_060301_MaxRows","=IFERROR(IF(dms_Model=\"CA\",(dms_060301_LastRow-15),\"not a CA\"),\"error\")"]
[null,"Table 6.6.3 - Public lighting repair - no. business days",{"$f":"INDEX(dms_663_List,MATCH(dms_TradingName,dms_TradingName_List))","v":5},"dms_663","=INDEX(dms_663_List,MATCH(dms_TradingName,dms_TradingName_List))"]
[null,"ARR or RESET RINS"]
[null,"How many rows in tables 6.1 or 6.7?  (leap year?)","insert dms_LeapYear NR if required",null,"'dms_LeapYear is used to determine dms_060701_Max_Rows BUT it is only found on worksheet 6.1 or 6.7 and the date value in the cell is used to determine whether it is a leap year"]
[null,"Is dms_LeapYear named range present?",{"$f":"IFERROR(IF(dms_LeapYear,\"yes\"),\"no\")","v":"yes"}]
[null,"Table 6.7.1 - includes a leap year?",{"$f":"\nIFERROR(IF(MONTH(DATE(YEAR(dms_LeapYear),2,29))=2,\"is a leap year\",\"not a leap year\"),\n\"dms_LeapYear not present\")","v":"not a leap year"},"dms_LeapYear_Result","=IFERROR(IF(MONTH(DATE(YEAR(dms_LeapYear),2,29))=2,\"is a leap year\",\"not a leap year\"),\"dms_LeapYear not present\")"]
[null,"MaxRows if Reset and leap year",{"$f":"IF(dms_LeapYear_Result=\"is a leap year\",1827,1826)","v":1826},"dms_060701_Reset_MaxRows","=IF(dms_LeapYear_Result=\"is a leap year\",1827,1826)",null,null,"number of days present in Reset RIN table"]
[null,"MaxRows if ARR and leap year",{"$f":"IF(dms_LeapYear_Result=\"is a leap year\",366,365)","v":365},"dms_060701_ARR_MaxRows","=IF(dms_LeapYear_Result=\"is a leap year\",366,365)",null,null,"number of days present in ARR RIN table"]
[null,"Table 6.7.1 - Max Rows (leap year/ non leap year)",{"$f":"IF(dms_Model=\"ARR\",dms_060701_ARR_MaxRows,IF(dms_Model=\"Reset\",dms_060701_Reset_MaxRows,\"not a relevant RIN type\"))","v":365},"dms_060701_MaxRows","=IF(dms_Model=\"ARR\",dms_060701_ARR_MaxRows,IF(dms_Model=\"Reset\",dms_060701_Reset_MaxRows,\"not a relevant RIN type\"))"]
[null,"How many columns in 6.7?   (4 or 5 feeder categories)",{"$f":"IF(dms_FifthFeeder_flag_NSP=\"NO\",\"This NSP has only 4 feeder categories\",\"This NSP has 5 feeder categories\")","v":"This NSP has only 4 feeder categories"}]
[null,"Table 6.7.1 - Last column (# of feeder categories > 4)",{"$f":"IF(dms_FifthFeeder_flag_NSP=\"NO\",10,12)","v":10},"dms_060701_MaxCols","=IF(dms_FifthFeeder_flag_NSP=\"NO\",8,10)"]
[null,"Table 6.7.1 - Number of offset rows",{"$f":"IF(dms_Model=\"ARR\",15,9)","v":15},"dms_060701_OffsetRows","=IF(dms_Model=\"ARR\",15,9)"]
[null,"Start date for telephone answering in 6.1 or 6.7?",null,null,"Using 060101 as naming standard not 060701 for start dates"]
[null,"Table 6.1.1 and 6.7.1 - Start Date as Text",{"$f":"IF(dms_SingleYearModel=\"yes\",(CONCATENATE(IF(LEN(CRY)=4,\"1-Jan-\",\"1-Jul-\"),LEFT(CRY,4))),(CONCATENATE(IF(LEN(PRCP_y4)=4,\"1-Jan-\",\"1-Jul-\"),LEFT(PRCP_y4,4))))","v":"1-Jul-2017"},"dms_060101_StartDateTxt","=IF(SUM(dms_SingleYear_Model)>1,(CONCATENATE(IF(LEN(CRY)=4,\"1-Jan-\",\"1-Jul-\"),LEFT(CRY,4))),(CONCATENATE(IF(LEN(CRCP_y4)=4,\"1-Jan-\",\"1-Jul-\"),LEFT(CRCP_y4,4))))"]
[null,"Table 6.1.1 and 6.7.1 - Start Date as Date Value",{"$f":"DATEVALUE(dms_060701_StartDateTxt)","v":42917},"dms_060101_StartDateVal","=DATEVALUE(dms_060701_StartDateTxt)"]
[null,"ARRs"]
[null,"How many rows in table 6.8?","insert dms_060801_StartCell NR if required",null,"dms_060801_StartCell is only found on worksheet 6.8 and is used to determine the starting date for the date range"]
[null,"Is dms_060801_StartCell named range present?","yes",null,"=IFERROR(IF((ROW(dms_060801_StartCell)-1)=1,\"yes\",\"yes\"),\"no\")"]
[null,"Table 6.8 - Number of offset rows",{"$f":"IFERROR(IF(dms_Model=\"ARR\",(ROW(dms_060801_StartCell)-1),\"not an ARR\"),\"6.8 error\")","v":11},"dms_0608_OffsetRows","=IFERROR(IF(dms_Model=\"ARR\",(ROW(dms_060801_StartCell)-1),\"not an ARR\"),\"6.8 error\")"]
[null,"Table 6.8 - Last row",{"$f":"IFERROR(IF(dms_060801_StartCell<>\"\",IF(dms_Model=\"ARR\",(LOOKUP(2,1/(dms_060801_01_Values<>\"\"),(ROW(dms_060801_01_Values)))),\"not an ARR\"),0),\"6.8 not present\")","v":26},"dms_0608_LastRow","=IFERROR(IF(dms_060801_StartCell<>\"\",IF(dms_Model=\"ARR\",(LOOKUP(2,1/(dms_060801_01_Values<>\"\"),(ROW(dms_060801_01_Values)))),\"not an ARR\"),0),\"6.8 not present\")"]
[null,"Table 6.8 - MaxRows",{"$f":"IFERROR(IF(dms_Model=\"ARR\",(MAX(0,dms_0608_LastRow-dms_0608_OffsetRows)),\"not an ARR\"),\"6.8 not present\")","v":15},"dms_060801_MaxRows","=IFERROR(IF(dms_Model=\"ARR\",(MAX(0,dms_0608_LastRow-dms_0608_OffsetRows)),\"not an ARR\"),\"6.8 not present\")"]
[null,"TNSP RESET RINS"]
[null,"Table 7.9.4 only appears in TNSPs Reset RIN"]
[null,"Table 7.9.4 - first year",{"$f":"LEFT(PRCP_y3,4)","v":"2012"},"dms_070904_Start_Year","=LEFT(PRCP_y3,4)"]
[null,"SUBSET FILES"]
[null,"Is this Submission File a Subset File","NO","dms_Partial"]
[null,"MISC"]
[null,"Distribution Determination Reference",{"$f":"INDEX(dms_DeterminationRef_List,MATCH(dms_TradingName,dms_TradingName_List))","v":"2015-20 Distribution Determination"},"dms_DeterminationRef"]
[null,"Public lighting NSP?",{"$f":"INDEX(dms_Public_Lighting_List,MATCH(dms_TradingName,dms_TradingName_List))","v":"NO"},"dms_Public_Lighting","=INDEX(dms_Public_Lighting_List,MATCH(dms_TradingName,dms_TradingName_List))"]
[null,"CBD Feeder for this business",{"$f":"INDEX(dms_CBD_flag,MATCH(dms_TradingName,dms_TradingName_List))","v":"YES"},"dms_CBD_flag_NSP"]
[null,"Urban Feeder for this business",{"$f":"INDEX(dms_Urban_flag,MATCH(dms_TradingName,dms_TradingName_List))","v":"YES"},"dms_Urban_flag_NSP"]
[null,"Short rural Feeder for this business",{"$f":"INDEX(dms_ShortRural_flag,MATCH(dms_TradingName,dms_TradingName_List))","v":"YES"},"dms_ShortRural_flag_NSP"]
[null,"Long rural Feeder for this business",{"$f":"INDEX(dms_LongRural_flag,MATCH(dms_TradingName,dms_TradingName_List))","v":"YES"},"dms_LongRural_flag_NSP"]
[null,"Fifth Feeder Category (eg. TasNetworks (D))",{"$f":"INDEX(dms_FeederType_5_flag,MATCH(dms_TradingName,dms_TradingName_List))","v":"NO"},"dms_FifthFeeder_flag_NSP","=INDEX(dms_FeederType_5_flag,MATCH(dms_TradingName,dms_TradingName_List))"]
[]
[null,"DISCARD FILES"]
[null,"discard this record?","NO","dms_DISCARD","If record is to be discarded from DB set this flag to YES"]
[]
[null,"USES NAMED RANGES FLAG","yes","dms_Defined_Names_Used"]
[]
[null,"REGULATORY YEARS FOR MULTI RYE SUBMISSIONS"]
[null,"Multiple RYE flag","NO","dms_Multi_RYE_flag"]
[null,null,"Manually specify RYE","Named ranges to apply"]
[null,null,2013,"dms_RYE_01"]
[null,null,2014,"dms_RYE_02"]
[null,null,2015,"dms_RYE_03"]
[null,null,2016,"dms_RYE_04"]
[null,null,2017,"dms_RYE_05"]
[null,null,2018,"dms_RYE_06"]
[null,null,2019,"dms_RYE_07"]
[null,null,2020,"dms_RYE_08"]
[null,null,2021,"dms_RYE_09"]

{"sheet":"2.11 Labour","index":5,"n_rows":36,"n_cols":4,"rows_kept":36,"cut":false,"hidden":false,"merged":[]}
[null,{"$f":"IF(dms_DataQuality=\"backcast\",INDEX(dms_Worksheet_List,MATCH(dms_Model,dms_Model_List))&\" BACKCAST\",INDEX(dms_Worksheet_List,MATCH(dms_Model,dms_Model_List)))","v":"ANNUAL REPORTING STATEMENT"}]
[null,{"$f":"INDEX(dms_TradingNameFull_List,MATCH(dms_TradingName,dms_TradingName_List))","v":"SA Power Networks"}]
[null,{"$f":"CONCATENATE(\"Annual Reporting RIN Response \",IF(SUM(dms_SingleYear_Model)>0,CONCATENATE(CRY),CONCATENATE(FRCP_y1,\" to \",dms_MultiYear_FinalYear_Result)))","v":"Annual Reporting RIN Response 2017-18"}]
[null,"2.11 LABOUR "]
[]
[null,"Tables 2.11.1 and 2.11.2 deliberately omitted."]
[]
[null,"2.11.3 - LABOUR / NON-LABOUR EXPENDITURE SPLIT"]
[null,"2.11.3.1 - Opex"]
[null,null,{"$f":"CRY","v":"2017-18"}]
[null,null,"$0's, nominal"]
[null,null,"Opex "]
[null,"In-house labour expenditure",94525882.989999995]
[null,"Labour expenditure outsourced to related parties",0]
[null,"Labour expenditure outsourced to unrelated parties",7251556.8200000003]
[null,"Controllable non-labour expenditure",{"$f":"dms_Total_Actual_Opex-SUM(C13:C15,C17)","v":141048578.6834805}]
[null,"Uncontrollable non-labour expenditure",8389725.9499999993]
[null,"Total",{"$f":"SUM(C13:C17)","v":251215744.44348049}]
[]
[null,"Reconciliation with Opex worksheets - SCS","Opex"]
[null,"Total including margins",{"$f":"dms_Total_Actual_Opex","v":251215744.44348052},{"$f":"IF(ROUND(C18,0)=ROUND(dms_Total_Actual_Opex,0),\"OK\",\"Error\")","v":"OK"}]
[]
[]
[null,"2.11.3.2 - Capex"]
[null,null,{"$f":"CRY","v":"2017-18"}]
[null,null,"$0's, nominal"]
[null,null,"Capex"]
[null,"In-house labour expenditure",126687122.02]
[null,"Labour expenditure outsourced to related parties",0]
[null,"Labour expenditure outsourced to unrelated parties",12917751.42]
[null,"Controllable non-labour expenditure",260363770]
[null,"Uncontrollable non-labour expenditure",0]
[null,"Total",{"$f":"SUM(C28:C32)","v":399968643.44}]
[]
[null,"Reconciliation with Capex & Opex worksheets - SCS","Capex"]
[null,"Total including margins",{"$f":"dms_Total_Actual_Capex","v":399318022.26109427},{"$f":"IF(ROUND(C33,0)=ROUND(dms_Total_Actual_Capex,0),\"OK\",\"Error\")","v":"Error"}]

{"sheet":"3.6 Quality of services","index":6,"n_rows":74,"n_cols":4,"rows_kept":74,"cut":false,"hidden":false,"merged":[]}
[null,{"$f":"IF(dms_DataQuality=\"backcast\",INDEX(dms_Worksheet_List,MATCH(dms_Model,dms_Model_List))&\" BACKCAST\",INDEX(dms_Worksheet_List,MATCH(dms_Model,dms_Model_List)))","v":"ANNUAL REPORTING STATEMENT"}]
[null,{"$f":"INDEX(dms_TradingNameFull_List,MATCH(dms_TradingName,dms_TradingName_List))","v":"SA Power Networks"}]
[null,{"$f":"CONCATENATE(\"Annual Reporting RIN Response \",IF(SUM(dms_SingleYear_Model)>0,CONCATENATE(CRY),CONCATENATE(FRCP_y1,\" to \",dms_MultiYear_FinalYear_Result)))","v":"Annual Reporting RIN Response 2017-18"}]
[null,"3.6 QUALITY OF SERVICES"]
[]
[null,"3.6.5 - QUALITY OF SUPPLY METRICS"]
[null,null,null,"Volume"]
[null,null,"Units",{"$f":"CRY","v":"2017-18"}]
[null,"Over voltage events - due to high voltage injection","number"]
[null,"Customers receiving over-voltage - due to high voltage injection","number"]
[null,"Over voltage events - due to lightning","number"]
[null,"Customers receiving over-voltage - due to lightning","number"]
[null,"Over voltage events - due to voltage regulation or other cause","number"]
[null,"Customers receiving over-voltage - due to voltage regulation or other cause","number"]
[null,"Voltage variations - steady state (zone sub)","number"]
[null,"Voltage variations - one minute (zone sub)","number"]
[null,"Voltage variations - 10 seconds (zone sub) Min<0.7","number"]
[null,"Voltage variations - 10 seconds (zone sub) Min<0.8","number"]
[null,"Voltage variations - 10 seconds (zone sub) Min<0.9","number"]
[null,"Voltage variations - steady state (feeder)","number"]
[null,"Voltage variations - % zone subs monitored","(per cent)"]
[null,"Voltage variations - % feeders monitored","(per cent)"]
[]
[null,"3.6.6 - COMPLAINTS - TECHNICAL QUALITY OF SUPPLY"]
[null,null,null,"Volume"]
[null,null,"Units",{"$f":"CRY","v":"2017-18"}]
[null,"3.6.6.1 - TECHNICAL QUALITY OF SUPPLY"]
[null,"Number of complaints - technical quality of supply","number",56]
[null,"3.6.6.2 - PERCENTAGE OF COMPLAINTS BY CATEGORY"]
[null,"Low voltage supply","(per cent)",0.02]
[null,"Voltage dips","(per cent)",0.02]
[null,"Voltage swell","(per cent)",0]
[null,"Voltage spike (impulsive transient)","(per cent)",0]
[null,"Waveform distortion","(per cent)",0]
[null,"TV or radio interference","(per cent)",0]
[null,"Solar related","(per cent)",0.96]
[null,"Noise from appliances","(per cent)",0]
[null,"Other","(per cent)",0]
[null,"3.6.6.3 - PERCENTAGE OF COMPLAINTS BY LIKELY CAUSE"]
[null,"Network equipment faulty","(per cent)",0]
[null,"Network interference by NSP equipment","(per cent)",0]
[null,"Network interference by another customer","(per cent)",0.5]
[null,"Network limitation","(per cent)",0.09]
[null,"Customer internal problem","(per cent)",0.27]
[null,"No problem identified","(per cent)",0.14000000000000001]
[null,"Environmental","(per cent)",0]
[null,"Other","(per cent)",0]
[]
[]
[]
[null,"3.6.7 - CUSTOMER SERVICE METRICS"]
[null,null,null,"Volume"]
[null,null,"Unit",{"$f":"CRY","v":"2017-18"}]
[null,"3.6.7.1 - TIMELY PROVISIONS OF SERVICES"]
[null,"Number of connections made","number",11789]
[null,"Number of connections not made on or before agreed date","number",215]
[null,"3.6.7.2 - TIMELY REPAIR OF FAULTY STREET LIGHTS"]
[null,"Street lights - average monthly number \"out\"","number",2579]
[null,"Street lights - not repaired by \"fix by\" date","number",1045]
[null,"Street lights - average number of days to repair","number",4.38]
[null,"Total number of street lights","number",216445]
[null,"3.6.7.3 - CALL CENTRE PERFORMANCE"]
[null,"Calls to call centre fault line","number",{"$f":"IF(SUM(dms_060101_Values)=0,\"\",SUM(dms_060101_Values))","v":100331}]
[null,"Calls to fault line answered within 30 seconds","number",{"$f":"IF(SUM(dms_060102_Values)=0,\"\",SUM(dms_060102_Values))","v":80026}]
[null,"Calls to fault line - average waiting time before call answered","number","13 seconds"]
[null,"Call centre - number of overload events","number",0]
[null,"Percentage of calls abandoned","(per cent)",3.6999999999999998E-2]
[null,"3.6.7.4 - NUMBER OF CUSTOMER COMPLAINTS"]
[null,"Complaint - reliability of supply","number",246]
[null,"Complaint - technical quality of supply","number",{"$f":"IF(ISBLANK(dms_030606_01_Values),\"\",dms_030606_01_Values)","v":56}]
[null,"Complaint - administrative process or customer service","number",647]
[null,"Complaint - connection or augmentation","number",56]
[null,"Complaint - other","number",130]
[null,"Total number of complaints","number",{"$f":"IF(SUM(D69:D73)=0,\"\",(SUM(D69:D73)))","v":1135}]

{"sheet":"3.6.8 Network-feeders","index":7,"n_rows":1515,"n_cols":23,"rows_kept":1515,"cut":false,"hidden":false,"merged":[[10,10,10,14],[11,11,11,12],[11,13,11,14],[11,18,11,19],[11,15,12,15],[11,10,12,10],[10,15,10,19],[11,16,11,17],[5,6,5,8],[5,1,5,4],[11,8,12,8],[11,9,12,9],[11,20,12,20],[10,20,10,22],[11,21,11,22],[10,1,12,1],[10,2,12,2],[10,3,12,3],[10,4,12,4],[10,7,12,7],[11,5,12,5],[11,6,12,6],[10,5,10,6],[10,8,10,9]]}
[null,{"$f":"IF(dms_DataQuality=\"backcast\",INDEX(dms_Worksheet_List,MATCH(dms_Model,dms_Model_List))&\" BACKCAST\",INDEX(dms_Worksheet_List,MATCH(dms_Model,dms_Model_List)))","v":"ANNUAL REPORTING STATEMENT"}]
[null,{"$f":"INDEX(dms_TradingNameFull_List,MATCH(dms_TradingName,dms_TradingName_List))","v":"SA Power Networks"}]
[null,{"$f":"CONCATENATE(\"Annual Reporting RIN Response \",IF(SUM(dms_SingleYear_Model)>0,CONCATENATE(CRY),CONCATENATE(FRCP_y1,\" to \",dms_MultiYear_FinalYear_Result)))","v":"Annual Reporting RIN Response 2017-18"}]
[null,"3.6 QUALITY OF SERVICES"]
[]
[null,"Did the MAIFI parameter of the STPIS apply during the period?",null,null,null,"No","** IMPORTANT\nPlease ensure this question is answered correctly. Your response will affect other tables throughout this workbook and will determine which cells are grey and which are input cells. "]
[]
[]
[]
[null,"3.6.8 - NETWORK FEEDER RELIABILITY"]
[null,"Feeder ID / name","Description of the service area for the feeder","Feeder classification\n\n(drop down)","Number of distribution customers","Length of high voltage distribution lines",null,"Maximum demand\n(MVA)","Energy not supplied\n(MWh)",null,"Unplanned Outages",null,null,null,null,"Planned Outages",null,null,null,null,"Momentary feeder outages"]
[null,null,null,null,null,"Overhead","Underground",null,"Unplanned","Planned","Total number of unplanned outages","Unplanned customer minutes off-supply (SAIDI)",null,"Unplanned interruptions\n(SAIFI)",null,"Total number of planned outages","Planned customer minutes off-supply (SAIDI)",null,"Planned interruptions\n(SAIFI)",null,"Total number of momentary feeder outages","Momentary interruptions due to feeder outages (MAIFI)"]
[null,null,null,null,null,null,null,null,null,null,null,"Including excluded events and MEDs","After removing excluded events and MED","Including excluded events and MEDs","After removing excluded events and MED",null,"Including MEDs","After removing  MED","Including MEDs","After removing  MED",null,"Including excluded events and MEDs","After removing excluded events and MED"]
[null,"AP125A","MAJOR METROPOLITAN AREAS","Urban",1705.5,0.91874999999999984,16.153537413000002,4.0999999999999996,0.19363971256673582,2.5485206304154353,6,5.2410782383740138,5.2410782383740138,2.1499063243360872E-2,2.1499063243360872E-2,12,68.978598651421876,68.978598651421876,0.81559659923776018,0.81559659923776018]
[null,"AP125B","MAJOR METROPOLITAN AREAS","Urban",843.5,3.8870545500000016,7.591510000000004,1.1599999999999999,4.7652842249696539,10.361040593953437,7,260.78443063895378,260.78443063895378,1.7929263021653405,1.7929263021653405,21,567.01719027860111,567.01719027860111,3.1736810906935387,3.1736810906935387]
[null,"AP125C","MAJOR METROPOLITAN AREAS","Urban",948,5.9852233919999991,1.4069761630000002,2.06,0.50904123299730453,0.59833683102330215,6,24.786919831223628,24.786919831223628,0.25632911392405061,0.25632911392405061,3,29.135021097046412,29.135021097046412,0.19198312236286919,0.19198312236286919]
[null,"AP125D","MAJOR METROPOLITAN AREAS","Urban",2289.5,10.315951421999996,2.9368300000000001,5.33,0.78859706120694728,0.45278197339674281,19,15.899828639033581,15.899828639033581,0.1356919221658672,0.1356919221658672,2,9.1290674819829665,9.1290674819829665,7.0321030792749512E-2,7.0321030792749512E-2]
[null,"AP132A","MAJOR METROPOLITAN AREAS","Urban",478,3.7562274190000005,5.8810722610000026,3.92,1.6246368548135901,6.3256464394932732E-3,5,156.89400223608297,156.89400223608297,2.6408647111769001,2.6408647111769001,1,0.61087866108786615,0.61087866108786615,4.1841004184100415E-3,4.1841004184100415E-3]
[null,"AP132B","MAJOR METROPOLITAN AREAS","Urban",66,10.866851004999999,6.7001519699999994,5.7,1.499091553468954E-2,0,3,10.484848484848484,10.484848484848484,0.12121212121212122,0.12121212121212122,null,0,0,0,0]
[null,"AP132C","MAJOR METROPOLITAN AREAS","Urban",328.5,7.2195115140000024,4.7631100000000002,5.72,0.10522523738311028,1.3907756897790006E-2,4,14.78640092126855,14.78640092126855,0.10553018252054851,0.10553018252054851,1,1.9543378995433789,1.9543378995433789,6.0882800608828003E-3,6.0882800608828003E-3]
[null,"AP132D","MAJOR METROPOLITAN AREAS","Urban",1783.5,8.7703044130000016,1.1779399999999998,6.57,13.953675398434358,0.32401607464212634,22,361.15484004853516,361.15484004853516,6.1573684452827955,6.1573684452827955,3,8.3863190356041493,8.3863190356041493,4.3173535183627695E-2,4.3173535183627695E-2]
[null,"AP132E","MAJOR METROPOLITAN AREAS","Urban",82.5,4.624823580000001,4.0533877669999994,3.16,2.5519217485353001E-2,0,2,14.278787878787879,14.278787878787879,4.8484848484848485E-2,4.8484848484848485E-2,null,0,0,0,0]
[null,"AP139A","MAJOR METROPOLITAN AREAS","Urban",452,3.4690663679999991,1.3407699999999998,3.35,1.0549965123401454E-2,0,3,1.0774336283185841,1.0774336283185841,6.6371681415929203E-3,6.6371681415929203E-3,null,0,0,0,0]
[null,"AP139B","MAJOR METROPOLITAN AREAS","Urban",2089,10.340991136999996,2.0665399999999998,5.56,0.30212169539934541,0.6259357130915022,6,6.6760781280386094,6.6760781280386094,3.3189708733455933E-2,3.3189708733455933E-2,4,13.831498324557204,13.831498324557204,0.11297271421732887,0.11297271421732887]
[null,"AP139C","MAJOR METROPOLITAN AREAS","Urban",944.5,9.4353406820000014,3.1839447840000004,6.36,3.0686317036931845,0.10354996568759536,10,149.9756464879938,149.9756464879938,1.1162872612318582,1.1162872612318582,1,5.0608787718369506,5.0608787718369506,2.1175224986765485E-2,2.1175224986765485E-2]
[null,"AP139D","MAJOR METROPOLITAN AREAS","Urban",1967.5,9.8745034870000019,5.3396600000000012,5.94,0.68213003606245548,0,11,16.004067314564807,16.004067314564807,7.5730630130598109E-2,7.5730630130598109E-2,null,0,0,0,0]
[null,"AP146A","MAJOR METROPOLITAN AREAS","Urban",592.5,3.0795307450000009,6.1229299999999958,4.63,0.70521589164453136,2.9678546651047209E-2,6,54.942911927106529,54.942911927106529,0.71448690961684902,0.71448690961684902,1,2.3122362869198314,2.3122362869198314,8.4388185654008432E-3,8.4388185654008432E-3]
[null,"AP146B","MAJOR METROPOLITAN AREAS","Urban",2473,9.5945504370000023,1.7041502399999999,6.44,1.0825303308460839,0.34567924738011702,15,20.206630239397999,20.206630239397999,0.14799837096230106,0.14799837096230106,1,6.4524868580671253,6.4524868580671253,3.2753740396279825E-2,3.2753740396279825E-2]
[null,"AP146C","MAJOR METROPOLITAN AREAS","Urban",1611.5,5.6461647909999986,1.9542999999999999,2.9,0.46260224501030178,6.6765898378487232E-2,8,13.251204719981384,13.251204719981384,6.8052500181230657E-2,6.8052500181230657E-2,1,1.9125038783741855,1.9125038783741855,2.8544834005584861E-2,2.8544834005584861E-2]
[null,"AP146D","MAJOR METROPOLITAN AREAS","Urban",359,1.9916051600000004,0.24249999999999999,1.05,0.10476310336092284,0,1,13.470752089136491,13.470752089136491,0.21727019498607242,0.21727019498607242,null,0,0,0,0]
[null,"AP146E","MAJOR METROPOLITAN AREAS","Urban",576,4.1590081410000002,0.72850000000000015,3.75,1.3185865197672237,7.4954577673447698E-3,6,105.67301177978516,105.67301177978516,1.2361110592329942,1.2361110592329942,1,0.60069444444444442,0.60069444444444442,1.736111111111111E-3,1.736111111111111E-3]
[null,"AP149A","MAJOR METROPOLITAN AREAS","Urban",821.5,3.7585673470000014,0.57286000000000015,2.44,2.3186164757979744,0,10,130.28646090896987,130.28646090896987,1.2663826063066739,1.2663826063066739,null,0,0,0,0]
[null,"AP149B","MAJOR METROPOLITAN AREAS","Urban",1434,7.7479570209999968,1.4576,4.63,1.5559356367561032,0.27477568300867361,6,50.086468769749175,50.086468769749175,1.1357507851998343,1.1357507851998343,1,8.8451882845188283,8.8451882845188283,2.9288702928870293E-2,2.9288702928870293E-2]
[null,"AP149C","MAJOR METROPOLITAN AREAS","Urban",1407,7.2806005750000011,0.54962999999999995,4.4800000000000004,0.13577746148311601,0,6,4.4546288420481295,4.4546288420481295,4.1222437273634172E-2,4.1222437273634172E-2,null,0,0,0,0]
[null,"AP149D","MAJOR METROPOLITAN AREAS","Urban",1982,10.118450195999991,1.7797600000000005,7.2,0.66713170686751555,0.65401118495993804,13,15.537669130819964,15.537669130819964,0.1263033720607353,0.1263033720607353,2,15.232088799192734,15.232088799192734,0.98234106962663981,0.98234106962663981]
[null,"AP149E","MAJOR METROPOLITAN AREAS","Urban",2065,8.7414571900000038,3.5012186009999997,6.31,11.694364825057393,1.0631418652896298,18,261.41741721682052,261.41741721682052,2.1388215047299042,2.1388215047299042,5,23.765617433414043,23.765617433414043,0.10411622276029056,0.10411622276029056]
[null,"AP149F","MAJOR METROPOLITAN AREAS","Urban",1507,4.3415704509999982,1.9434299999999995,4.12,13.681694289830974,3.7767142087958159,14,419.0873645562246,419.0873645562246,3.0745410130261792,3.0745410130261797,6,115.68546781685468,115.68546781685468,0.32979429329794291,0.32979429329794291]
[null,"AP149H","MAJOR METROPOLITAN AREAS","Urban",1002.5,6.256836317000003,2.445749999999999,3.14,1.9581558258042719,0.14289028737978643,13,90.165585060785531,90.165585060785531,1.0613466210496099,1.0613466210496099,2,6.5795511221945135,6.5795511221945135,3.3915211970074813E-2,3.3915211970074813E-2]
[null,"AP214A","MAJOR METROPOLITAN AREAS","Urban",1532,5.6516697830000009,4.4093320449999984,6.5,0.31363233576080712,3.222461934294325,3,9.4501783405831858,9.4501783405831858,0.1499130388930946,0.1499130388930946,5,97.097258485639685,97.097258485639685,0.34530026109660572,0.34530026109660572]
[null,"AP214B","MAJOR METROPOLITAN AREAS","Urban",972,4.534194072,0.60142999999999991,3.96,0.1402256748221293,0,4,6.6594630111882713,6.6594630111882713,9.7736601966889311E-2,9.7736601966889311E-2,null,0,0,0,0]
[null,"AP214C","MAJOR METROPOLITAN AREAS","Urban",1285,5.6711426499999984,3.4646800000000004,6.38,1.5515236217007842,1.937120906231125,10,55.735666855392751,55.735666855392751,1.3156938827455276,1.3156938827455276,2,69.58754863813229,69.58754863813229,0.21556420233463036,0.21556420233463036]
[null,"AP214D","MAJOR METROPOLITAN AREAS","Urban",1435,5.2873218600000005,0.18287,3.92,2.8715400986232642,0.40956394378445143,6,92.372122203016119,92.372122203016119,0.25296164921351844,0.25296164921351844,2,13.174912891986063,13.174912891986063,0.10034843205574913,0.10034843205574913]
[null,"AP226A","MAJOR METROPOLITAN AREAS","Urban",609,1.5306534290000002,1.2693800000000002,1.99,0.19800844358746295,0,5,15.008744163074713,15.008744163074713,5.3639798720286201E-2,5.3639798720286201E-2,null,0,0,0,0]
[null,"AP226B","MAJOR METROPOLITAN AREAS","Urban",365,1.7477578310000002,1.52007,0.71,0.60249616018899632,0,2,76.197260273972603,76.197260273972603,0.81917808219178079,0.81917808219178079,null,0,0,0,0]
[null,"AP226C","MAJOR METROPOLITAN AREAS","Urban",1896,2.5982331779999992,10.0596,4.4000000000000004,2.2941944998629018,0.91032984479584367,15,55.856000908316446,55.856000908316446,0.25879037971235025,0.25879037971235025,2,22.163502109704641,22.163502109704641,0.10495780590717299,0.10495780590717299]
[null,"AP226D","MAJOR METROPOLITAN AREAS","Urban",1626.5,4.9202241009999987,2.3235199999999998,4.83,0.71985236243536743,5.5849609004086345,8,20.429950009336334,20.429950009336334,0.12911154161358065,0.12911154161358065,11,158.50537964955427,158.50537964955427,0.55272056563172456,0.55272056563172456]
[null,"AP226E","MAJOR METROPOLITAN AREAS","Urban",984.5,3.9998963989999994,0.29855999999999999,2.85,0.25364661907363167,8.2320056404364531E-2,4,11.89299659864621,11.89299659864621,4.8078504051878787E-2,4.8078504051878787E-2,2,3.8598273235144744,3.8598273235144744,0.12899949212798376,0.12899949212798376]
[null,"AP227A","MAJOR METROPOLITAN AREAS","Urban",1820.5,7.4341460780000039,1.1493900000000001,4.57,5.1986273826924041,9.5813396807676767,15,131.81837211510401,131.81837211510401,1.0310354926893259,1.0310354926893259,11,242.94809118374073,242.94809118374073,0.77011809942323539,0.77011809942323539]
[null,"AP227B","MAJOR METROPOLITAN AREAS","Urban",1225.5,6.3897184179999975,4.1012667880000002,4.0999999999999996,0.12389174835489498,4.0120195910758709E-2,3,4.666669057272542,4.666669057272542,4.5695656224301023E-2,4.5695656224301023E-2,2,1.511219910240718,1.511219910240718,6.6095471236230108E-2,6.6095471236230108E-2]
[null,"AP227C","MAJOR METROPOLITAN AREAS","Urban",782.5,1.1565033819999999,8.2744799999999969,3.19,0.42479336577368015,0,3,25.059437400159744,25.059437400159744,5.6230061198956675E-2,5.6230061198956675E-2,null,0,0,0,0]
[null,"AP227D","MAJOR METROPOLITAN AREAS","Urban",1390,5.8015031129999981,3.0346587469999999,4.4400000000000004,0.35235150458341813,9.293501104597994E-2,8,11.701438848920864,11.701438848920864,6.1151079136690649E-2,6.1151079136690649E-2,1,3.0863309352517985,3.0863309352517985,9.3525179856115109E-2,9.3525179856115109E-2]
[null,"AP344A","MAJOR METROPOLITAN AREAS","Urban",214.5,1.0056189139999996,1.7894700000000001,5.26,9.0530398872062975E-2,0.85071279342089334,3,19.482517482517483,19.482517482517483,0.33100233100233101,0.33100233100233101,1,183.07692307692307,183.07692307692307,0.55477855477855476,0.55477855477855476]
[null,"AP344B","MAJOR METROPOLITAN AREAS","Urban",443.5,1.2164274910000001,2.957148047,3.74,5.7002972557458925E-2,1.8563605982638958,2,5.9331020282113283,5.9331020282113283,7.591123430409058E-2,7.591123430409058E-2,2,193.21758737316799,193.21758737316799,0.71702367531003386,0.71702367531003386]
[null,"AP344C","MAJOR METROPOLITAN AREAS","Urban",85,0.35554822900000005,1.5724500000000001,0.56999999999999995,3.0848357978898705E-2,1.1078546538208425,3,16.752941176470589,16.752941176470589,0.28235294117647058,0.28235294117647058,5,601.64705882352939,601.64705882352939,3.0352941176470587,3.0352941176470587]
[null,"AP344D","MAJOR METROPOLITAN AREAS","Urban",1275,6.6592761989999998,2.3476800000000004,2.44,5.0392207296013414,0,8,182.44465073529412,182.44465073529412,1.0708496732026145,1.0708496732026145,null,0,0,0,0]
[null,"AP344E","MAJOR METROPOLITAN AREAS","Urban",801.5,2.6366323109999992,3.0135199999999993,2,0.36287259781717701,0.50509853555899031,9,20.899148142642709,20.899148142642709,0.12642962701059374,0.12642962701059374,1,29.090455396132253,29.090455396132253,0.10854647535870243,0.10854647535870243]
[null,"AP344F","MAJOR METROPOLITAN AREAS","Urban",512.5,3.2153209600000006,0.47091999999999995,1.1599999999999999,5.9052581180567314,0.18946610876646636,7,531.89138100228661,531.89138100228661,5.8042276349881803,5.8042276349881803,2,17.065365853658538,17.065365853658538,0.16195121951219513,0.16195121951219513]
[null,"AP351B","MAJOR METROPOLITAN AREAS","Urban",376,2.263473026999999,1.054459979,1.56,5.2858141480697221E-3,0.87547379986041673,1,0.64893617021276595,0.64893617021276595,2.6595744680851063E-3,2.6595744680851063E-3,2,107.4813829787234,107.4813829787234,0.25265957446808512,0.25265957446808512]
[null,"AP351C","MAJOR METROPOLITAN AREAS","Urban",733.5,3.957078605,0.88887792499999996,3.18,0.16440902133665558,0.43809434228038518,4,10.346738267936278,10.346738267936278,0.10088616223585563,0.10088616223585563,2,27.570552147239265,27.570552147239265,0.13633265167007499,0.13633265167007499]
[null,"AP351D","MAJOR METROPOLITAN AREAS","Urban",676.5,4.3530741800000019,0.38811000000000001,4.8,0.1194940608227565,0.58481901123479585,3,8.1537324464153738,8.1537324464153738,1.7738359201773836E-2,1.7738359201773836E-2,2,39.90539541759054,39.90539541759054,0.21286031042128603,0.21286031042128603]
[null,"AP351E","MAJOR METROPOLITAN AREAS","Urban",493.5,3.8572108009999999,0.87444999999999984,2.11,0.35945702524147904,0.70951223351467019,3,33.623100303951368,33.623100303951368,0.23910840932117527,0.23910840932117527,3,66.366767983789259,66.366767983789259,0.23302938196555217,0.23302938196555217]
[null,"AP355A","MAJOR METROPOLITAN AREAS","Urban",2007.5,9.4935012959999998,0.78046000000000004,5.96,4.5390769942763205,11.244139830617625,21,104.37342448727428,104.37342448727428,1.4317973791291081,1.4317973791291081,16,258.55242839352428,258.55242839352428,0.91955168119551678,0.91955168119551678]
[null,"AP355B","MAJOR METROPOLITAN AREAS","Urban",498,2.3444788599999997,1.3640400000000006,3.72,5.4807827027116372E-3,0,1,0.50803212851405621,0.50803212851405621,2.008032128514056E-3,2.008032128514056E-3,null,0,0,0,0]
[null,"AP355C","MAJOR METROPOLITAN AREAS","Urban",948,3.522213665000002,2.5877122629999989,10.039999999999999,2.2183076983766245E-2,2.6689028813204497E-2,3,1.0801681969236223,1.0801681969236223,6.3291117863313083E-3,6.3291117863313083E-3,1,1.2995780590717299,1.2995780590717299,2.9535864978902954E-2,2.9535864978902954E-2]
[null,"AP355D","MAJOR METROPOLITAN AREAS","Urban",215,0.93356317999999983,4.9752999999999998,10.36,0.60574563114138813,0.46051572606420554,3,130.05581288892171,130.05581288892171,1.0124031007751937,1.0124031007751937,3,98.874418604651169,98.874418604651169,0.24186046511627907,0.24186046511627907]
[null,"AP355E","MAJOR METROPOLITAN AREAS","Urban",627,4.728786484000004,1.1463649660000002,8.48,1.6582796721650606,0.47580992601722688,4,122.08664899275443,122.08664899275443,1.0148856499168482,1.0148856499168482,4,35.030303030303031,35.030303030303031,0.10047846889952153,0.10047846889952153]
[null,"AP355F","MAJOR METROPOLITAN AREAS","Urban",1230,4.2485129180000012,2.7216479989999995,6.9,1.6235756712269236,0.542879108814046,10,60.931989809361923,60.931989809361923,1.788076129773768,1.788076129773768,2,20.373983739837399,20.373983739837399,5.6910569105691054E-2,5.6910569105691054E-2]
[null,"AP355H","MAJOR METROPOLITAN AREAS","Urban",2430.5,7.071052688,4.8029099999999998,6.34,0.26275965764581133,2.1008295026121204,6,4.9904648294862852,4.9904648294862852,5.6778409848412328E-2,5.6778409848412328E-2,4,39.900020571898786,39.900020571898786,0.14688335733388191,0.14688335733388191]
[null,"AP365A","MAJOR METROPOLITAN AREAS","Urban",1665,5.777841379999999,2.947189268999999,6.17,4.2425951506712547,1.2672956051724537E-2,12,117.6238229929148,117.6238229929148,0.94874873805690452,0.94874873805690452,1,0.35135135135135137,0.35135135135135137,7.8078078078078076E-3,7.8078078078078076E-3]
[null,"AP365C","MAJOR METROPOLITAN AREAS","Urban",279.5,null,null,0,5.4071226265419374E-2,0,1,8.9302238232334528,8.9302238232334528,4.2933766018725936E-2,4.2933766018725936E-2,null,0,0,0,0]
[null,"AP365D2","MAJOR METROPOLITAN AREAS","Urban",11.5,1.7133646390000001,0.10191000000000001,1.37,8.6652690951962656E-3,0,1,34.782608695652172,34.782608695652172,0.17391304347826086,0.17391304347826086,null,0,0,0,0]
[null,"AP365E","MAJOR METROPOLITAN AREAS","Urban",930.5,4.464109918000001,5.7804854140000019,3.45,0.43700354652887802,0,6,21.679363203586789,21.679363203586789,0.12036527810975617,0.12036527810975615,null,0,0,0,0]
[null,"AP365F","MAJOR METROPOLITAN AREAS","Urban",806,2.9269133830000009,6.3789099999999976,2.5,2.6754234963145849,9.6617750411438358E-2,3,153.22704714640199,153.22704714640199,2.0794044665012406,2.0794044665012406,2,5.5334987593052105,5.5334987593052105,5.7071960297766747E-2,5.7071960297766747E-2]
[null,"AP372A","MAJOR METROPOLITAN AREAS","Urban",405.5,7.2104248649999994,1.019668287,4.78,1.5582536782164065,0.1201872823503722,3,177.38840937114674,177.38840937114674,1.0702836004932184,1.0702836004932184,2,13.681874229346485,13.681874229346485,5.4254007398273733E-2,5.4254007398273733E-2]
[null,"AP372B","MAJOR METROPOLITAN AREAS","Urban",1235.5,6.6520639930000023,1.38798,5.98,0.36428784532907921,1.7010139865597649,9,13.610681414169997,13.610681414169997,9.0651532343873867E-2,9.0651532343873867E-2,3,63.554026709834076,63.554026709834076,0.18211250505868071,0.18211250505868071]
[null,"AP372C","MAJOR METROPOLITAN AREAS","Urban",57,1.7910203359999999,0.49722,0,4.0293501292662636E-3,2.5150943548807158E-2,1,3.263157894736842,3.263157894736842,1.7543859649122806E-2,1.7543859649122806E-2,1,20.368421052631579,20.368421052631579,5.2631578947368418E-2,5.2631578947368418E-2]
[null,"AP372D","MAJOR METROPOLITAN AREAS","Urban",960.5,6.5239519780000021,0.34054999999999996,3.81,0.59020578973041649,0.2577267660638749,10,28.365081358179335,28.365081358179335,0.20891890955244363,0.20891890955244363,3,12.386257157730348,12.386257157730348,4.4768349817803227E-2,4.4768349817803227E-2]
[null,"AP372F","MAJOR METROPOLITAN AREAS","Urban",1213.5,5.2716742819999975,1.4325349509999998,4.0199999999999996,8.6970334626638293E-2,1.9936401239045425,4,3.3083336149953686,3.3083336149953686,2.4447169184046245E-2,2.4447169184046245E-2,6,75.837659662134328,75.837659662134328,0.28677379480840542,0.28677379480840542]
[null,"AP373A","MAJOR METROPOLITAN AREAS","Urban",249.5,3.9094438939999989,1.7754299999999998,5.49,0.14559818397203522,3.3577917743885528E-2,4,26.937875751503007,26.937875751503007,1.871743486973948,1.871743486973948,1,6.2124248496993992,6.2124248496993992,2.004008016032064E-2,2.004008016032064E-2]
[null,"AP373B","MAJOR METROPOLITAN AREAS","Urban",136,4.7013957219999982,4.7855500000000024,6.61,3.2408106416034033E-2,0,2,11,11,2.2058823529411766E-2,2.2058823529411766E-2,null,0,0,0,0]
[null,"AP373C","MAJOR METROPOLITAN AREAS","Urban",268,4.9440243650000015,3.0020999999999995,6.63,0.40431417850976609,0.56443396568834669,6,69.640537546641795,69.640537546641795,3.0509949299826551,3.0509949299826551,2,97.22014925373135,97.22014925373135,0.38805970149253732,0.38805970149253732]
[null,"AP373D","MAJOR METROPOLITAN AREAS","Urban",209.5,4.4632562840000007,6.7664800000000005,5.58,0.11033056117026487,7.6362683901417081E-2,4,24.310267468909945,24.310267468909945,0.83850468656043708,0.83850468656043708,2,16.825775656324581,16.825775656324581,4.2959427207637228E-2,4.2959427207637228E-2]
[null,"AP373E","MAJOR METROPOLITAN AREAS","Urban",237.5,9.7422821009999989,4.4554400000000003,5.14,2.9107649902732429,0.31194968742706553,8,565.74596615439964,565.74596615439964,1.9270175572445518,1.9270175572445518,4,60.631578947368418,60.631578947368418,0.16421052631578947,0.16421052631578947]
[null,"AP373G","MAJOR METROPOLITAN AREAS","Urban",131.5,0.93570560399999991,2.8006099999999998,6.61,3.2711390834365898E-3,0,1,1.1482889733840305,1.1482889733840305,7.6045627376425855E-3,7.6045627376425855E-3,null,0,0,0,0]
[null,"AP373J","MAJOR METROPOLITAN AREAS","Urban",1,0.82305973900000007,1.01739,7.39,8.3533194077691997E-2,7.5821104582967317E-3,1,3856,3856,1,1,1,350,350,1,1]
[null,"AP373K","MAJOR METROPOLITAN AREAS","Urban",156.5,0,8.6740975849999984,6.9,0.60867759493781726,5.6150943736871795E-2,7,179.53573803398945,179.53573803398945,1.6911610734348479,1.6911610734348479,2,16.562300319488816,16.562300319488816,6.3897763578274758E-2,6.3897763578274758E-2]
[null,"AP373L","MAJOR METROPOLITAN AREAS","Urban",1,0,1.384038101,5.91,0,1.1243186651017154E-2,null,0,0,0,0,1,519,519,1,1]
[null,"AP373N","MAJOR METROPOLITAN AREAS","Urban",62,1.3847199999999997,3.6242865509999986,5.39,2.2984626275008094E-2,9.0595388390276949E-2,2,17.112903225806452,17.112903225806452,1.032258064516129,1.032258064516129,1,67.451612903225808,67.451612903225808,0.27419354838709675,0.27419354838709675]
[null,"AP424A","MAJOR METROPOLITAN AREAS","Urban",1911,3.6449679770000007,9.8644607160000035,7.49,3.1663904924610509,0.79402027036557177,11,76.485960183375667,76.485960183375667,1.1107625302564779,1.1107625302564779,6,19.180010465724752,19.180010465724752,0.2271062271062271,0.2271062271062271]
[null,"AP424B","MAJOR METROPOLITAN AREAS","Urban",2652,9.728273276999996,1.30623,6.67,7.7629613358774927,1.2875290085097371,13,135.12379706427342,135.12379706427342,1.9997485867093232,1.9997485867093232,2,22.411010558069382,22.411010558069382,6.485671191553545E-2,6.485671191553545E-2]
[null,"AP424C","MAJOR METROPOLITAN AREAS","Urban",2199.5,8.3990935990000004,3.155664662,7.66,8.7186469809347074,0.28998323027074302,15,182.97976452167751,182.97976452167751,1.2281578982012773,1.2281578982012773,2,6.0859286201409413,6.0859286201409413,4.2282336894748807E-2,4.2282336894748807E-2]
[null,"AP424D","MAJOR METROPOLITAN AREAS","Urban",1147,5.3787604780000038,0.26683000000000007,3.01,4.1686008727267687,0.22876310411318138,10,167.76634172407981,167.76634172407981,1.2432431767271619,1.2432431767271619,1,9.2066259808195294,9.2066259808195294,7.6721883173496083E-2,7.6721883173496083E-2]
[null,"AP424E","MAJOR METROPOLITAN AREAS","Urban",2842.5,7.4920726560000013,9.2157975779999983,7.13,2.5792878857014028,5.2302264468240374,31,41.886809567306372,41.886809567306372,0.64649647308283631,0.6464964730828362,6,84.937203166226908,84.937203166226908,0.2990325417766051,0.2990325417766051]
[null,"AP424F","MAJOR METROPOLITAN AREAS","Urban",2675,4.5125420970000016,17.469512602999998,7.49,5.8490639140851401,0.57810342768601886,10,100.93470497773072,100.93470497773072,0.91962617369084354,0.91962617369084354,3,9.9760747663551399,9.9760747663551399,9.9813084112149536E-2,9.9813084112149536E-2]
[null,"AP425A","MAJOR METROPOLITAN AREAS","Urban",1428,4.97177866,2.3244700000000003,4.38,4.1880254757450217,0,6,135.38141364944414,135.38141364944414,1.0912698190085359,1.0912698190085359,null,0,0,0,0]
[null,"AP425B","MAJOR METROPOLITAN AREAS","Urban",1128.5,4.0255467289999993,0.28893999999999997,6,6.7827613042779049,0.40055206392544734,13,277.44883638110684,277.44883638110684,2.8595483429832274,2.8595483429832274,1,16.384581302614091,16.384581302614091,3.8103677447939743E-2,3.8103677447939743E-2]
[null,"AP425C","MAJOR METROPOLITAN AREAS","Urban",1612,9.9776961469999996,1.3249965069999998,10.4,0.1907008805237988,0.20569182514722134,9,5.460917281157915,5.460917281157915,8.8089321150673264E-2,8.8089321150673264E-2,1,5.8901985111662531,5.8901985111662531,2.7915632754342432E-2,2.7915632754342432E-2]
[null,"AP425D","MAJOR METROPOLITAN AREAS","Urban",1881,6.3302720900000011,1.2896599999999998,5.26,1.8049537782905729,1.0238881962883906,14,44.2950530957187,44.2950530957187,0.15878076061550955,0.15878076061550955,1,25.127060074428496,25.127060074428496,5.9542796384901647E-2,5.9542796384901647E-2]
[null,"AP510A","MAJOR METROPOLITAN AREAS","Urban",16,0.38980939799999992,3.5685731319999991,2.15,4.3932931831995571E-2,4.9608665569998624E-3,2,126.75005054473876,126.75005054473876,0.3749999925494194,0.3749999925494194,1,14.3125,14.3125,6.25E-2,6.25E-2]
[null,"AP510D","MAJOR METROPOLITAN AREAS","Urban",10,1.9922600000000001,2.10582,2.25,3.6047519436016466E-2,2.5150943548807158E-2,3,166.4,166.4,2.4,2.4,6,116.1,116.1,0.6,0.6]
[null,"AP510E","MAJOR METROPOLITAN AREAS","Urban",7,0,3.5799999999999996,2.48,0,6.3256464394932732E-3,null,0,0,0,0,1,41.714285714285715,41.714285714285715,0.14285714285714285,0.14285714285714285]
[null,"AP529A","MAJOR METROPOLITAN AREAS","Urban",1305,4.782414328999999,0.6568907129999999,3.28,0.51414600151608236,3.1949930312625532,7,18.18669938712285,18.18669938712285,0.12490408950381809,0.12490408950381809,5,113.01532567049809,113.01532567049809,0.48275862068965519,0.48275862068965519]
[null,"AP529B","MAJOR METROPOLITAN AREAS","Urban",557.5,2.7157711160000004,4.2216878289999995,2.12,0.60338435027125392,0,1,49.960538116591927,49.960538116591927,0.97757847533632292,0.97757847533632292,null,0,0,0,0]
[null,"AP529C","MAJOR METROPOLITAN AREAS","Urban",737,3.190336417000001,0.33727999999999997,2.44,2.6046342347969532E-2,2.666065005691773,4,1.6313877390391791,1.6313877390391791,2.7589303667542066E-2,2.7589303667542066E-2,5,166.9864314789688,166.9864314789688,0.44776119402985076,0.44776119402985076]
[null,"AP529D","MAJOR METROPOLITAN AREAS","Urban",1502.5,9.3375588829999927,2.2985889039999994,4.04,0.69714963308780853,0.5087379485789727,11,21.41852007721506,21.41852007721506,0.14154186470933044,0.14154186470933044,3,15.629950083194675,15.629950083194675,0.16772046589018302,0.16772046589018302]
[null,"AP529E","MAJOR METROPOLITAN AREAS","Urban",1677,6.3480314579999995,1.323,6.05,0.10027876379893998,3.3512928225671557,12,2.7602844966190094,2.7602844966190094,2.0671825111800858E-2,2.0671825111800858E-2,5,92.248062015503876,92.248062015503876,0.29695885509838998,0.29695885509838998]
[null,"BM11","BAROSSA/MID NORTH & YORKE PENINSULA/RIVE","Rural Short",464.5,43.492689999999968,0.32878000000000002,1.6,4.3643502272676389E-2,6.3705887779319612E-2,5,4.833155242952766,4.833155242952766,2.3681381931859265E-2,2.3681381931859265E-2,5,7.0548977395048436,7.0548977395048436,4.3057050592034449E-2,4.3057050592034449E-2]
[null,"BM12","BAROSSA/MID NORTH & YORKE PENINSULA/RIVE","Rural Short",436,51.459729999999958,4.3000599999999984,3.62,5.7679392444687616E-2,0.25348216989763461,6,6.8050458715596331,6.8050458715596331,8.7155963302752298E-2,8.7155963302752298E-2,5,29.905963302752294,29.905963302752294,0.13073394495412843,0.13073394495412843]
[null,"BM13","BAROSSA/MID NORTH & YORKE PENINSULA/RIVE","Rural Short",690,32.153530000000011,0.61058000000000001,5.68,0.18209090170103426,0.46384573769135373,7,13.574880804531816,13.574880804531816,9.9033833932185525E-2,9.9033833932185525E-2,10,34.579710144927539,34.579710144927539,1.1333333333333333,1.1333333333333333]
[null,"BM14","BAROSSA/MID NORTH & YORKE PENINSULA/RIVE","Urban",12.5,2.6029299999999997,0.88515999999999995,2.65,9.6964361175246219E-2,8.0175402303303445E-2,1,358.08,358.08,0.96,0.96,2,296.08,296.08,0.96,0.96]
[null,"BM15","BAROSSA/MID NORTH & YORKE PENINSULA/RIVE","Rural Short",492.5,61.567009999999982,0.89176,2.67,0.51256315073730208,0.19704695713493553,9,53.535025628569166,53.535025628569166,0.4162436567587296,0.4162436567587296,3,20.580710659898479,20.580710659898479,0.11573604060913706,0.11573604060913706]
[null,"BM21","BAROSSA/MID NORTH & YORKE PENINSULA/RIVE","Rural Short",1013.5,12.545440000000003,4.0057000000000009,2.5099999999999998,2.3814376725561956E-2,0.30880928513106259,4,1.2086827824370991,1.2086827824370991,3.9467192895905282E-3,3.9467192895905282E-3,5,15.673408978786384,15.673408978786384,0.99457326097681298,0.99457326097681298]
[null,"BM31","BAROSSA/MID NORTH & YORKE PENINSULA/RIVE","Rural Short",470.5,36.36360999999998,0.40512999999999999,1.56,8.9464295257988671E-2,0.13711248901664366,2,9.7810839532412324,9.7810839532412324,8.9266737513283748E-2,8.9266737513283748E-2,4,14.990435706695004,14.990435706695004,1.0031880977683316,1.0031880977683316]
[null,"BM32","BAROSSA/MID NORTH & YORKE PENINSULA/RIVE","Rural Short",68,5.7459800000000003,0.83335999999999999,0.7,0.11203449230156209,5.6765697990727275E-3,1,84.75,84.75,0.75,0.75,1,4.2941176470588234,4.2941176470588234,1.4705882352941176E-2,1.4705882352941176E-2]
[null,"BM33","BAROSSA/MID NORTH & YORKE PENINSULA/RIVE","Rural Short",454,32.403939999999984,2.1727100000000004,4.5199999999999996,3.886117683105976E-2,8.2912911620017751E-2,4,4.4030839357082003,4.4030839357082003,3.3039651778300948E-2,3.3039651778300948E-2,2,9.3942731277533031,9.3942731277533031,2.2026431718061675E-2,2.2026431718061675E-2]
[null,"BM34","BAROSSA/MID NORTH & YORKE PENINSULA/RIVE","Rural Short",490,47.316950000000027,1.3508241539999999,4.04,9.9754713073970214E-2,2.5654207430302516,6,10.472110421316964,10.472110421316964,0.10340137481689453,0.10340137481689453,3,269.31428571428569,269.31428571428569,0.94285714285714284,0.94285714285714284]
[null,"BM41","BAROSSA/MID NORTH & YORKE PENINSULA/RIVE","Urban",533,8.2245000000000026,3.1466000000000012,3.81,6.8672284023733168E-2,0.98285814712263642,3,5.9474694572291371,5.9474694572291371,5.6285199707489304E-2,5.6285199707489304E-2,4,85.121951219512198,85.121951219512198,0.28705440900562851,0.28705440900562851]
[null,"BM42","BAROSSA/MID NORTH & YORKE PENINSULA/RIVE","Rural Short",179,14.914764588000006,0.82223000000000002,1.26,0,2.8421729610425783E-2,null,0,0,0,0,1,8.1675977653631282,8.1675977653631282,9.4972067039106142E-2,9.4972067039106142E-2]
[null,"BM43","BAROSSA/MID NORTH & YORKE PENINSULA/RIVE","Rural Short",1431.5,10.050443318999994,9.7538600000000013,4.97,7.0859920950753746E-2,2.031201092076421,3,2.5462801257422285,2.5462801257422285,0.55186866922808242,0.55186866922808242,4,72.989172196996151,72.989172196996151,0.28501571777855395,0.28501571777855395]
[null,"BM44","BAROSSA/MID NORTH & YORKE PENINSULA/RIVE","Rural Short",991.5,47.064879999999981,5.1369799999999994,3.39,0.80298190257088708,6.0673199804472548E-2,7,41.659102370146243,41.659102370146243,0.22592032274331819,0.22592032274331819,4,3.1477559253656078,3.1477559253656078,2.6222894604135148E-2,2.6222894604135148E-2]
[null,"BM51","BAROSSA/MID NORTH & YORKE PENINSULA/RIVE","Rural Short",863,6.0038400000000012,6.6526699999999996,3.72,1.9245904455760276E-3,2.8077830570201137,1,0.11471610660486674,0.11471610660486674,1.1587485515643105E-3,1.1587485515643105E-3,4,167.35921205098492,167.35921205098492,0.64542294322132099,0.64542294322132099]
[null,"BM52","BAROSSA/MID NORTH & YORKE PENINSULA/RIVE","Urban",1277,7.9358999999999966,5.5949200000000001,4.93,4.1809923384321978E-3,0.73150035384373069,1,0.15113547376664058,0.15113547376664058,7.8308535630383712E-4,7.8308535630383712E-4,5,26.442443226311667,26.442443226311667,0.11902897415818324,0.11902897415818324]
[null,"BM53","BAROSSA/MID NORTH & YORKE PENINSULA/RIVE","Rural Short",1007,28.069550000000003,6.7677400000000016,5.39,1.2949318238874135,0.18266112956194297,4,66.147632163236253,66.147632163236253,1.0165508038869009,1.0165508038869009,4,9.3306852035749746,9.3306852035749746,6.8520357497517378E-2,6.8520357497517378E-2]
[null,"BM54","BAROSSA/MID NORTH & YORKE PENINSULA/RIVE","Rural Short",274,33.465599999999981,3.1433799999999992,1.1499999999999999,0.32832735389225792,0.38007745253996883,2,61.638686131386862,61.638686131386862,0.95985401459854014,0.95985401459854014,5,71.354014598540147,71.354014598540147,0.25547445255474455,0.25547445255474455]
[null,"BM55","BAROSSA/MID NORTH & YORKE PENINSULA/RIVE","Rural Short",597,33.564019999999992,1.4842700000000004,2.48,1.8455072935243062,0.19630822544875484,11,159.01507701266752,159.01507701266752,1.9190396495799922,1.9190396495799922,4,16.91457286432161,16.91457286432161,7.5376884422110546E-2,7.5376884422110546E-2]
[null,"BM56","BAROSSA/MID NORTH & YORKE PENINSULA/RIVE","Rural Short",817,81.559170000000037,0.54020000000000012,2.76,0.79742197461700071,0.39549361641210817,6,50.20685434516524,50.20685434516524,1.0122399020807833,1.0122399020807833,11,24.900856793145653,24.900856793145653,0.13708690330477355,0.13708690330477355]
[null,"BM57","BAROSSA/MID NORTH & YORKE PENINSULA/RIVE","Rural Short",97,16.595670000000002,1.1879999999999998E-2,1.6,0,1.2597319280134E-2,null,0,0,0,0,1,6.6804123711340209,6.6804123711340209,3.0927835051546393E-2,3.0927835051546393E-2]
[null,"BT01","SOUTH EAST","Rural Long",763.5,24.671005168999983,0.8347,2.44,3.6067189195670362,1.7876929419263939E-2,5,268.21086907027666,268.21086907027666,2.8417375998006746,2.8417375998006746,2,1.3294040602488539,1.3294040602488539,1.4407334643091027E-2,1.4407334643091027E-2]
[null,"BT02","SOUTH EAST","Rural Long",391,191.17432544500019,7.8013199999999996,2.61,3.796995355774162,0.9951901673951622,24,551.36148479100689,551.36148479100689,3.9565218862873417,3.9565218862873417,10,144.51150895140665,144.51150895140665,0.51150895140664965,0.51150895140664965]
[null,"BT03","SOUTH EAST","Rural Long",363.5,100.141294007,2.5623756010000003,3.14,2.9825587782159553,5.49517436335995E-3,8,465.86245689759392,465.86245689759392,5.1178359276982741,5.1178359276982741,2,0.85832187070151311,0.85832187070151311,8.253094910591471E-3,8.253094910591471E-3]
[null,"BT04","SOUTH EAST","Rural Long",1007,120.07406281899989,2.8207400000000002,3.39,4.9421872175701669,0.11712470998828098,9,278.65243296921551,278.65243296921551,2.2442899702085404,2.2442899702085404,3,6.6037735849056602,6.6037735849056602,2.4826216484607744E-2,2.4826216484607744E-2]
[null,"BT06","SOUTH EAST","Rural Long",929.5,111.436931989,3.32213,4.2699999999999996,3.4657289749224067,0.14569257158241508,3,211.69876277568585,211.69876277568585,1.9634211941904249,1.9634211941904249,4,8.8994082840236679,8.8994082840236679,3.335126412049489E-2,3.335126412049489E-2]
[null,"BT07","SOUTH EAST","Rural Long",74,63.354707148000017,7.3830000000000007E-2,7.0000000000000007E-2,0.15090594213226941,0.89536116646078978,2,115.78378378378379,115.78378378378379,1.8378378378378379,1.8378378378378379,7,686.97297297297303,686.97297297297303,3.7702702702702702,3.7702702702702702]
[null,"BT08","SOUTH EAST","Rural Long",65,50.952584455000014,9.5469999999999999E-2,0.13,1.1152033664718761,5.5303998400481552E-3,4,974.12307692307695,974.12307692307695,3.7538461538461538,3.7538461538461538,1,4.8307692307692305,4.8307692307692305,3.0769230769230771E-2,3.0769230769230771E-2]
[null,"BT10","SOUTH EAST","Rural Long",38,24.586263905999999,0.75026999999999999,0.06,0.22262501290460979,2.624298013271258E-2,4,332.6315792987221,332.6315792987221,3.8157896493610584,3.8157896493610584,1,39.210526315789473,39.210526315789473,0.26315789473684209,0.26315789473684209]
[null,"BT11","SOUTH EAST","Rural Long",55.5,42.136038880000022,0,0.12,0.88732975777587908,0,3,907.74774774774778,907.74774774774778,2.9729729729729728,2.9729729729729728,null,0,0,0,0]
[null,"BT12","SOUTH EAST","Rural Long",71,59.812478235999961,0,0.09,0,6.2384319214810711E-2,null,0,0,0,0,1,49.887323943661968,49.887323943661968,1,1]
[null,"BT13","SOUTH EAST","Rural Long",83.5,89.471392563999956,0,0.15,1.6522862095369346,0,4,1123.4970059880241,1123.4970059880241,2.8263473053892216,2.8263473053892216,null,0,0,0,0]
[null,"BT14","SOUTH EAST","Rural Long",95,105.01323546999991,5.2549999999999999E-2,0.12,0.75452971066134689,4.7166913285506241E-2,3,450.94736842105266,450.94736842105266,2.8421052631578947,2.8421052631578947,2,28.189473684210526,28.189473684210526,0.1368421052631579,0.1368421052631579]
[null,"BT15","SOUTH EAST","Rural Long",259.5,122.75057129400005,0.24428,1.94,1.7959885416864663,2.5010088448625413E-3,5,392.95183044315991,392.95183044315991,3.2061657032755297,3.2061657032755297,1,0.54720616570327552,0.54720616570327552,7.7071290944123313E-3,7.7071290944123313E-3]
[null,"BT18","SOUTH EAST","Rural Long",70.5,112.11075904900002,0.11650000000000001,0.04,0.78087836722412418,0.29941655184974086,3,628.87943262411352,628.87943262411352,2.8936170212765959,2.8936170212765959,1,241.13475177304966,241.13475177304966,0.96453900709219853,0.96453900709219853]
[null,"BT19","SOUTH EAST","Rural Short",4,3.7426200000000001,0,0.63,8.5537353136712346E-3,0,1,110,110,1,1,null,0,0,0,0]
[null,"BT20","SOUTH EAST","Rural Long",66,95.754570505000004,0.15045000000000003,0.16,0.55823574181632574,7.3268991511466E-3,3,480.22727272727275,480.22727272727275,2.0454545454545454,2.0454545454545454,1,6.3030303030303028,6.3030303030303028,3.0303030303030304E-2,3.0303030303030304E-2]
[null,"BT22","SOUTH EAST","Rural Long",76,51.216052883000017,0.27622000000000002,0.56999999999999995,0.40142953233878198,8.3026448554098742E-2,3,299.89473684210526,299.89473684210526,2.9210526315789473,2.9210526315789473,2,62.026315789473685,62.026315789473685,1.1842105263157894,1.1842105263157894]
[null,"BT23","SOUTH EAST","Rural Long",93.5,162.06029222399997,0,0.16,0.98546205989978719,0,5,598.41354419075867,598.41354419075867,2.5525846519572211,2.5525846519572211,null,0,0,0,0]
[null,"BT25","SOUTH EAST","Rural Long",14,9.5108799999999984,0,0.03,0.28381166567686611,0,3,1151,1151,3,3,null,0,0,0,0]
[null,"BT26","SOUTH EAST","Rural Long",147,91.258005120000036,2.078790000000001,2.46,1.3590341161076296,4.4912482777461132E-3,9,524.91156462585036,524.91156462585036,2.795918367346939,2.795918367346939,1,1.7346938775510203,1.7346938775510203,2.0408163265306121E-2,2.0408163265306121E-2]
[null,"BT27","SOUTH EAST","Rural Long",61.5,47.51623462700001,0,0.09,0.86244293054576027,0.31068870438996643,6,796.21135631034042,796.21135631034042,3.3658536081391621,3.3658536081391621,1,286.82926829268291,286.82926829268291,1.024390243902439,1.024390243902439]
[null,"BT28","SOUTH EAST","Rural Long",39,30.134502214999991,0,0.06,7.925732254846081E-2,0,2,115.38461538461539,115.38461538461539,1.8461538461538463,1.8461538461538463,null,0,0,0,0]
[null,"BT29","SOUTH EAST","Rural Long",56,70.291183712999981,0.11515,0.09,0.52045641806822607,7.133159029361473E-2,4,527.67857142857144,527.67857142857144,2.9464285714285716,2.9464285714285716,2,72.321428571428569,72.321428571428569,0.375,0.375]
[null,"BT30","SOUTH EAST","Rural Long",33,30.16670805799999,8.0030000000000004E-2,7.0000000000000007E-2,0.63194505178639426,0,3,1087.2727272727273,1087.2727272727273,2.7272727272727271,2.7272727272727271,null,0,0,0,0]
[null,"BT31","SOUTH EAST","Rural Long",62,53.05750639599998,0,0.09,0.13315230188141416,5.563864042901949E-2,2,121.93548387096774,121.93548387096774,1.935483870967742,1.935483870967742,1,50.951612903225808,50.951612903225808,0.20967741935483872,0.20967741935483872]
[null,"BT33","SOUTH EAST","Rural Long",67.5,52.476714167000004,0.12239781499999999,0.11,0.39751950442639122,0,4,334.37037037037038,334.37037037037038,3.1703703703703705,3.1703703703703705,null,0,0,0,0]
[null,"BT34","SOUTH EAST","Rural Long",60.5,50.608888792000002,0.21587000000000001,0.09,1.2973366936882391,0.21061312511877656,3,1217.504132231405,1217.504132231405,2.28099173553719,2.28099173553719,2,197.65289256198346,197.65289256198346,0.77685950413223137,0.77685950413223137]
[null,"BT37","SOUTH EAST","Rural Long",63,66.778534230999981,0,0.09,0.71456640735857868,7.3550795324971635E-2,5,643.98412698412699,643.98412698412699,4.5714285714285712,4.5714285714285712,1,66.285714285714292,66.285714285714292,0.92063492063492058,0.92063492063492058]
[null,"BU02","BAROSSA/MID NORTH & YORKE PENINSULA/RIVE","Rural Long",112.5,109.61775000000002,0.23785999999999999,0.11,5.6418884737663229,6.6611376417395285E-2,16,2847.3777777777777,2847.3777777777777,10.551111111111112,10.551111111111112,4,33.617777777777775,33.617777777777775,1.191111111111111,1.191111111111111]
[null,"BU03","BAROSSA/MID NORTH & YORKE PENINSULA/RIVE","Rural Long",51,44.257720000000006,0.49409999999999998,0.12,0.43961394906879603,0,3,489.41176470588238,489.41176470588238,2.8235294117647061,2.8235294117647061,null,0,0,0,0]
[null,"BU04","BAROSSA/MID NORTH & YORKE PENINSULA/RIVE","Rural Long",130,38.344730000000027,0,0.12,1.2339308356494703,0.90466069230647583,4,538.9153846153846,538.9153846153846,3.5307692307692307,3.5307692307692307,3,395.10769230769233,395.10769230769233,1.9076923076923078,1.9076923076923078]
[null,"BU05","BAROSSA/MID NORTH & YORKE PENINSULA/RIVE","Rural Long",97.5,80.383610000000033,0.6613,0.1,0.81804124217394059,0,4,476.36922904772638,476.36922904772638,2.7487179383253442,2.7487179383253442,null,0,0,0,0]
[null,"BU06","BAROSSA/MID NORTH & YORKE PENINSULA/RIVE","Rural Long",48,33.851430000000001,0,0.89,0.47726998364848694,0.17008621418899691,5,564.54166666666663,564.54166666666663,3.6041666666666665,3.6041666666666665,1,201.1875,201.1875,0.77083333333333337,0.77083333333333337]
[null,"BU08","BAROSSA/MID NORTH & YORKE PENINSULA/RIVE","Rural Long",88,161.56431999999995,0,0.11,0.86379913934815833,0.3947014662913349,5,557.31818181818187,557.31818181818187,4.2613636363636367,4.2613636363636367,3,254.65909090909091,254.65909090909091,1.0681818181818181,1.0681818181818181]
[null,"BU09","BAROSSA/MID NORTH & YORKE PENINSULA/RIVE","Rural Long",106,73.026730000000029,0.70821000000000001,0.12,0.39908703813901636,4.1706964398834492E-2,2,213.76415094339623,213.76415094339623,1.9339622641509433,1.9339622641509433,2,22.339622641509433,22.339622641509433,0.13207547169811321,0.13207547169811321]
[null,"BU10","BAROSSA/MID NORTH & YORKE PENINSULA/RIVE","Rural Long",55,45.02829000000002,0,0.06,0.53250353109559201,0.23648623774626296,5,549.70909090909095,549.70909090909095,3.581818181818182,3.581818181818182,4,244.12727272727273,244.12727272727273,1.0545454545454545,1.0545454545454545]
[null,"BU11","BAROSSA/MID NORTH & YORKE PENINSULA/RIVE","Rural Short",25,74.767849999999925,0.40931000000000001,7.0000000000000007E-2,0.14935988276121839,0.33032970556795815,4,307.32,294.83999999999997,2.96,1.04,5,679.68,679.68,4.12,4.12]
[null,"BU13","BAROSSA/MID NORTH & YORKE PENINSULA/RIVE","Rural Long",83,78.72242,0,0.09,0.66998856660965544,5.1253068581337997E-3,4,458.31325301204816,458.31325301204816,2.9879518072289155,2.9879518072289155,1,3.5060240963855422,3.5060240963855422,3.614457831325301E-2,3.614457831325301E-2]
[null,"CBD103A","MAJOR METROPOLITAN AREAS","Urban",1019,1.7872702119999999,3.6615043269999994,4.88,8.2320056404364527E-3,0,2,0.37291462217860649,0.37291462217860649,1.9627085377821392E-3,1.9627085377821392E-3,null,0,0,0,0]
[null,"CBD103B","MAJOR METROPOLITAN AREAS","Urban",297,0.134711208,3.2190894570000004,3.73,0.88738854486631158,0.26136617908385734,1,137.92255892255892,137.92255892255892,0.96969696969696972,0.96969696969696972,3,40.622895622895626,40.622895622895626,9.7643097643097643E-2,9.7643097643097643E-2]
[null,"CBD103C","MAJOR METROPOLITAN AREAS","Urban",2071,5.7136819669999976,3.8678100000000013,6.59,3.0433578604130478,2.3972683583587848,12,67.834536406453935,67.834536406453935,1.0576210772283177,1.0576210772283177,6,53.433606953162723,53.433606953162723,0.24384355383872525,0.24384355383872525]
[null,"CBD103E","MAJOR METROPOLITAN AREAS","Urban",830,0.66808046600000015,4.9078142599999994,3.14,1.4812410991328495,7.5561146510111435E-2,1,82.380722891566265,82.380722891566265,0.9927710843373494,0.9927710843373494,1,4.2024096385542169,4.2024096385542169,6.2650602409638559E-2,6.2650602409638559E-2]
[null,"CBD155B","ADELAIDE BUSINESS AREA","CBD",39.5,0,0.13878000000000001,0.93,0,0.48053088325478971,null,0,0,0,0,1,69.037974683544306,69.037974683544306,0.22784810126582278,0.22784810126582278]
[null,"CBD27B","ADELAIDE BUSINESS AREA","CBD",362,0,3.4425100000000004,3.6,6.5550967572710589E-2,0,2,1.0276243093922652,1.0276243093922652,0.88674033149171272,0.88674033149171272,null,0,0,0,0]
[null,"CBD27C","ADELAIDE BUSINESS AREA","CBD",460.5,0,3.2015899999999995,2.06,0.10819433895065672,0,2,1.3333333333333333,1.3333333333333333,8.6862106406080351E-3,8.6862106406080351E-3,null,0,0,0,0]
[null,"CBD27F","ADELAIDE BUSINESS AREA","CBD",103,0,4.4007632499999998,1.54,0.63818158471081721,0,4,35.161781977681329,35.161781977681329,0.24595446262544807,0.24595446262544807,null,0,0,0,0]
[null,"CBD27G","ADELAIDE BUSINESS AREA","CBD",31,0,2.49682,1.89,0,0.4884604357837467,null,0,0,0,0,1,89.41935483870968,89.41935483870968,0.67741935483870963,0.67741935483870963]
[null,"CBD27M","ADELAIDE BUSINESS AREA","CBD",460.5,0,2.8537700000000004,4.63,1.8625637829127712,0,2,22.953311617806733,22.953311617806733,0.62106406080347454,0.62106406080347454,null,0,0,0,0]
[null,"CBD27S","ADELAIDE BUSINESS AREA","CBD",29,0,3.1940300000000006,0.28999999999999998,0,2.0264412018445477E-2,null,0,0,0,0,1,3.9655172413793105,3.9655172413793105,3.4482758620689655E-2,3.4482758620689655E-2]
[null,"CBD353A","ADELAIDE BUSINESS AREA","CBD",29.5,0,4.4981999999999998,0.93,0,9.4978418069061848E-2,null,0,0,0,0,2,18.271186440677965,18.271186440677965,6.7796610169491525E-2,6.7796610169491525E-2]
[null,"CBD353B","MAJOR METROPOLITAN AREAS","Urban",249.5,3.628E-2,2.1047599999999993,2.76,0.17529839379582043,0,1,32.432865731462925,32.432865731462925,0.47695390781563124,0.47695390781563124,null,0,0,0,0]
[null,"CBD353B","MAJOR METROPOLITAN AREAS","Urban",249.5,3.628E-2,2.1047599999999993,2.76,0,4.8742138660478988E-3,null,0,0,0,0,1,0.90180360721442887,0.90180360721442887,4.0080160320641279E-3,4.0080160320641279E-3]
[null,"CBD353C","MAJOR METROPOLITAN AREAS","Urban",135.5,0,1.8348100000000003,3.07,0.19652829382354536,0,2,66.9520263671875,66.9520263671875,0.62730625810658358,0.62730625810658358,null,0,0,0,0]
[null,"CBD353D","ADELAIDE BUSINESS AREA","CBD",20,0,2.0412299999999997,2.8,0,0.67136878078501971,null,0,0,0,0,1,190.5,190.5,0.75,0.75]
[null,"CBD353E","ADELAIDE BUSINESS AREA","CBD",26,0,3.7822400000000012,1.37,0,5.0572923906903065E-2,null,0,0,0,0,1,11.038461538461538,11.038461538461538,3.8461538461538464E-2,3.8461538461538464E-2]
[null,"CBD353F","ADELAIDE BUSINESS AREA","CBD",165.5,0,1.7558900000000004,3.03,0,0.76564234974039658,null,0,0,0,0,1,26.253776435045317,26.253776435045317,6.6465256797583083E-2,6.6465256797583083E-2]
[null,"CBD353L","ADELAIDE BUSINESS AREA","CBD",15,0.23733000000000001,2.2301300000000004,1.51,0.13345147162656582,0,1,50.488903808593733,50.488903808593733,0.7111113230387367,0.7111113230387367,null,0,0,0,0]
[null,"CBD353L","MAJOR METROPOLITAN AREAS","Urban",15,0.23733000000000001,2.2301300000000004,1.51,0.3380034374853173,0,1,1040.1783142089841,1040.1783142089841,5.511113675435384,5.511113675435384,null,0,0,0,0]
[null,"CBD353L","ADELAIDE BUSINESS AREA","CBD",15,0.23733000000000001,2.2301300000000004,1.51,0,3.7885639860571987E-2,null,0,0,0,0,1,14.333333333333334,14.333333333333334,6.6666666666666666E-2,6.6666666666666666E-2]
[null,"CBD353M","ADELAIDE BUSINESS AREA","CBD",75.5,0,2.3461500000000002,3.32,0,0.10008857414327854,null,0,0,0,0,2,7.5231788079470201,7.5231788079470201,5.2980132450331126E-2,5.2980132450331126E-2]
[null,"CBD353M","MAJOR METROPOLITAN AREAS","Urban",75.5,0,2.3461500000000002,3.32,0,0.12348008460654677,null,0,0,0,0,2,75.496688741721854,75.496688741721854,0.39735099337748342,0.39735099337748342]
[null,"CBD353N","ADELAIDE BUSINESS AREA","CBD",35.5,0,1.4028099999999999,2.3199999999999998,0,3.0308511888457585E-2,null,0,0,0,0,1,4.845070422535211,4.845070422535211,2.8169014084507043E-2,2.8169014084507043E-2]
[null,"CBD353P","ADELAIDE BUSINESS AREA","CBD",60.5,0,3.7382599999999995,2,0.49104438062720857,0,1,46.060558981146777,46.060558981146777,0.30302999827487437,0.30302999827487437,null,0,0,0,0]
[null,"CBD353P","ADELAIDE BUSINESS AREA","CBD",60.5,0,3.7382599999999995,2,0,6.6432028964816925E-2,null,0,0,0,0,4,6.2314049586776861,6.2314049586776861,9.9173553719008267E-2,9.9173553719008267E-2]
[null,"CBD353P","MAJOR METROPOLITAN AREAS","Urban",60.5,0,3.7382599999999995,2,0,8.8819008225761713E-4,null,0,0,0,0,4,0.6776859504132231,0.6776859504132231,0.6776859504132231,0.6776859504132231]
[null,"CBD353Q","ADELAIDE BUSINESS AREA","CBD",8,0,1.9965899999999996,0,0,1.9735775183181682E-2,null,0,0,0,0,1,14,14,0.125,0.125]
[null,"CBD353R","ADELAIDE BUSINESS AREA","CBD",7.5,0.27471000000000001,2.8914035049999991,3.43,0,0.3954203527773188,null,0,0,0,0,2,299.2,299.2,0.53333333333333333,0.53333333333333333]
[null,"CBD353R","MAJOR METROPOLITAN AREAS","Urban",484,0.27471000000000001,2.8914035049999991,3.43,0,1.74947450397465,null,0,0,0,0,2,166.85537190082644,166.85537190082644,0.30785123966942146,0.30785123966942146]
[null,"CBD366A","ADELAIDE BUSINESS AREA","CBD",424,0,3.0732100000000004,1.68,0,6.1850509725864034E-2,null,0,0,0,0,1,0.82783018867924529,0.82783018867924529,2.3584905660377358E-3,2.3584905660377358E-3]
[null,"CBD366B","ADELAIDE BUSINESS AREA","CBD",14.5,0,1.8696599999999999,0.63,0.38590488974257042,0,1,151.0344827586207,151.0344827586207,1.0344827586206897,1.0344827586206897,null,0,0,0,0]
[null,"CBD366E","MAJOR METROPOLITAN AREAS","Urban",768.5,0.56451233499999998,3.9648800000000008,4.57,0.83837904372823213,0,4,50.358696425666885,50.358696425666885,1.1220993276946432,1.1220993276946432,null,0,0,0,0]
[null,"CBD366E","MAJOR METROPOLITAN AREAS","Urban",768.5,0.56451233499999998,3.9648800000000008,4.57,0,0.37122012803820803,null,0,0,0,0,1,22.297983083929733,22.297983083929733,8.1977878985035779E-2,8.1977878985035779E-2]
[null,"CBD366H","ADELAIDE BUSINESS AREA","CBD",99.5,0,2.7364099999999993,2,0,7.1542185039033618E-2,null,0,0,0,0,2,4.0804020100502516,4.0804020100502516,0.1407035175879397,0.1407035175879397]
[null,"CBD366J","ADELAIDE BUSINESS AREA","CBD",195,0,5.7041664760000002,1.94,6.8722788584293371E-3,0,1,0.2,0.2,5.1282051282051282E-3,5.1282051282051282E-3,null,0,0,0,0]
[null,"CBD366J","ADELAIDE BUSINESS AREA","CBD",195,0,5.7041664760000002,1.94,0,0.49216089363059323,null,0,0,0,0,2,14.323076923076924,14.323076923076924,9.7435897435897437E-2,9.7435897435897437E-2]
[null,"CBD366J","MAJOR METROPOLITAN AREAS","Urban",195,0,5.7041664760000002,1.94,0,5.7190776028295349E-3,null,0,0,0,0,2,1.3538461538461539,1.3538461538461539,5.1282051282051282E-3,5.1282051282051282E-3]
[null,"CBD366L","ADELAIDE BUSINESS AREA","CBD",89,0,2.65157,2.31,1.3585966666279536,0,1,86.629213483146074,86.629213483146074,0.93258426966292129,0.93258426966292129,null,0,0,0,0]
[null,"CBD366L","ADELAIDE BUSINESS AREA","CBD",89,0,2.65157,2.31,0,0.56141231905015032,null,0,0,0,0,1,35.797752808988761,35.797752808988761,0.10112359550561797,0.10112359550561797]
[null,"CBD366M","ADELAIDE BUSINESS AREA","CBD",15.5,0,2.6960800000000007,2.5299999999999998,0,1.0925161262118434E-2,null,0,0,0,0,1,4,4,6.4516129032258063E-2,6.4516129032258063E-2]
[null,"CBD366N","ADELAIDE BUSINESS AREA","CBD",38.5,0,2.6679599999999994,0.97,0,0.65057573193131057,null,0,0,0,0,2,95.896103896103895,95.896103896103895,0.90909090909090906,0.90909090909090906]
[null,"CBD366Q","MAJOR METROPOLITAN AREAS","Urban",6,0,5.4392600000000018,2.63,0.17573165725058026,0,4,1352,1352,4.166666666666667,4.166666666666667,null,0,0,0,0]
[null,"CBD366S","ADELAIDE BUSINESS AREA","CBD",166,0,2.4602300000000006,2.86,7.4072593357162972,0,2,253.22891566265059,253.22891566265059,1.9698795180722892,1.9698795180722892,null,0,0,0,0]
[null,"CBD366S","MAJOR METROPOLITAN AREAS","Urban",166,0,2.4602300000000006,2.86,4.6089266526984654,0,2,1281.6506024096386,1281.6506024096386,4.8614457831325302,4.8614457831325302,null,0,0,0,0]
[null,"CBD366T","ADELAIDE BUSINESS AREA","CBD",55.5,0,2.0978500000000007,1.39,0.91700869690426323,0,1,93.765765765765764,93.765765765765764,0.95495495495495497,0.95495495495495497,null,0,0,0,0]
[null,"CBD366T","ADELAIDE BUSINESS AREA","CBD",55.5,0,2.0978500000000007,1.39,0,0.86573092388367523,null,0,0,0,0,3,88.522522522522522,88.522522522522522,1.027027027027027,1.027027027027027]
[null,"CBD367B","ADELAIDE BUSINESS AREA","CBD",107,0,2.0748899999999999,2.42,0,3.4537606570567952E-2,null,0,0,0,0,1,1.8317757009345794,1.8317757009345794,9.3457943925233638E-3,9.3457943925233638E-3]
[null,"CBD367F","ADELAIDE BUSINESS AREA","CBD",141.5,0,1.1576099999999998,0.86,6.5727179851131856E-2,0,2,2.6360424028268552,2.6360424028268552,2.1201413427561839E-2,2.1201413427561839E-2,null,0,0,0,0]
[null,"CBD367F","ADELAIDE BUSINESS AREA","CBD",141.5,0,1.1576099999999998,0.86,0,0.17991273626811161,null,0,0,0,0,3,7.2155477031802118,7.2155477031802118,3.5335689045936397E-2,3.5335689045936397E-2]
[null,"CBD367G","ADELAIDE BUSINESS AREA","CBD",7.5,0,4.157,2.13,0,0.12581556679278322,null,0,0,0,0,1,95.2,95.2,0.4,0.4]
[null,"CBD367H","ADELAIDE BUSINESS AREA","CBD",137.5,0,3.7955748259999993,2.29,4.6019598397228805,0,4,189.9345444835316,189.9345444835316,1.45454543243755,1.45454543243755,null,0,0,0,0]
[null,"CBD367H","ADELAIDE BUSINESS AREA","CBD",137.5,0,3.7955748259999993,2.29,0,0.13568345438437407,null,0,0,0,0,2,5.6,5.6,2.9090909090909091E-2,2.9090909090909091E-2]
[null,"CBD367J","ADELAIDE BUSINESS AREA","CBD",6,0,3.7104265179999993,2.84,1.0572736705275901E-3,0,2,1,1,1,1,null,0,0,0,0]
[null,"CBD367J","MAJOR METROPOLITAN AREAS","Urban",6,0,3.7104265179999993,2.84,9.1418588954320593E-3,0,2,70.333333333333329,70.333333333333329,0.66666666666666663,0.66666666666666663,null,0,0,0,0]
[null,"CBD367K","ADELAIDE BUSINESS AREA","CBD",20,0,1.26789,3.07,0,4.6167616946371434E-2,null,0,0,0,0,1,13.1,13.1,0.05,0.05]
[null,"CBD367M","ADELAIDE BUSINESS AREA","CBD",2,0,1.9596800000000003,2.21,0,1.9559562904760422E-2,null,0,0,0,0,1,55.5,55.5,0.5,0.5]
[null,"CBD367N","ADELAIDE BUSINESS AREA","CBD",14,0.42309000000000002,4.1881650080000012,3.01,0.10114584781380613,0,1,41,41,1,1,null,0,0,0,0]
[null,"CBD367N","MAJOR METROPOLITAN AREAS","Urban",14,0.42309000000000002,4.1881650080000012,3.01,3.2863033043531831E-2,0,1,108.35714285714286,108.35714285714286,2.6428571428571428,2.6428571428571428,null,0,0,0,0]
[null,"CBD367N","ADELAIDE BUSINESS AREA","CBD",14,0.42309000000000002,4.1881650080000012,3.01,0,1.9043260928986114,null,0,0,0,0,2,771.92857142857144,771.92857142857144,0.5,0.5]
[null,"CBD367R","ADELAIDE BUSINESS AREA","CBD",18.5,0,2.18357,0.93,0,0.14519891741912239,null,0,0,0,0,1,44.54054054054054,44.54054054054054,0.10810810810810811,0.10810810810810811]
[null,"CBD367S","ADELAIDE BUSINESS AREA","CBD",9.5,0,2.3971100000000001,1.33,0,5.1806409855851915E-2,null,0,0,0,0,1,30.94736842105263,30.94736842105263,0.10526315789473684,0.10526315789473684]
[null,"CBD367U","ADELAIDE BUSINESS AREA","CBD",47,0,1.9905400000000002,2.4,0,0.21586004106604967,null,0,0,0,0,1,26.063829787234042,26.063829787234042,0.10638297872340426,0.10638297872340426]
[null,"CBD412A","ADELAIDE BUSINESS AREA","CBD",194.5,3.4889999999999997E-2,6.7169699999999999,1.26,14.4698474548406,0,3,422.19023136246784,422.19023136246784,2.7095115681233932,2.7095115681233932,null,0,0,0,0]
[null,"CBD412A","MAJOR METROPOLITAN AREAS","Urban",194.5,3.4889999999999997E-2,6.7169699999999999,1.26,2.0532788384522309,0,3,487.31105398457584,487.31105398457584,3.2082262210796917,3.2082262210796917,null,0,0,0,0]
[null,"CBD412B","MAJOR METROPOLITAN AREAS","Urban",468.5,0,3.7585200000000007,3.03,0.69021036511613243,0,4,68.006405239044156,68.006405239044156,0.40768410632806246,0.40768410632806246,null,0,0,0,0]
[null,"CBD412B","MAJOR METROPOLITAN AREAS","Urban",468.5,0,3.7585200000000007,3.03,0,6.2671558731006979E-2,null,0,0,0,0,4,6.1750266808964778,6.1750266808964778,1.9210245464247599E-2,1.9210245464247599E-2]
[null,"CBD412C","ADELAIDE BUSINESS AREA","CBD",142,0,2.5259399999999999,1.71,0,1.5034431594902333,null,0,0,0,0,2,60.08450704225352,60.08450704225352,0.25352112676056338,0.25352112676056338]
[null,"CBD412D","ADELAIDE BUSINESS AREA","CBD",213.5,0,3.1759499999999998,1.68,6.1591477676584763,0,1,163.71428571428572,163.71428571428572,0.98829039812646369,0.98829039812646369,null,0,0,0,0]
[null,"CBD412D","MAJOR METROPOLITAN AREAS","Urban",213.5,0,3.1759499999999998,1.68,4.1398323102300155E-2,0,1,8.9508196721311482,8.9508196721311482,6.0889929742388757E-2,6.0889929742388757E-2,null,0,0,0,0]
[null,"CBD412F","MAJOR METROPOLITAN AREAS","Urban",643.5,0.31842566200000005,6.6398667560000009,1.26,0.20779315290280645,0,2,14.905982905982906,14.905982905982906,0.18803418803418803,0.18803418803418803,null,0,0,0,0]
[null,"CBD412G","MAJOR METROPOLITAN AREAS","Urban",391.5,0,3.5163500000000001,3.05,0.38863731891955244,0,1,45.82375478927203,45.82375478927203,0.19923371647509577,0.19923371647509577,null,0,0,0,0]
[null,"CBD412J","MAJOR METROPOLITAN AREAS","Urban",704,0,1.7820128210000001,2.36,0.17297305106355315,0,2,11.341845425692471,11.341845425692471,0.13683698394081803,0.13683698394081803,null,0,0,0,0]
[null,"CBD412J","MAJOR METROPOLITAN AREAS","Urban",704,0,1.7820128210000001,2.36,0,0.81600839069463238,null,0,0,0,0,2,53.50568181818182,53.50568181818182,0.13636363636363635,0.13636363636363635]
[null,"CBD412L","MAJOR METROPOLITAN AREAS","Urban",11,0,4.0743299999999998,1.87,0,2.1663172737990661E-4,null,0,0,0,0,1,0.90909090909090906,0.90909090909090906,9.0909090909090912E-2,9.0909090909090912E-2]
[null,"CBD412M","MAJOR METROPOLITAN AREAS","Urban",436.5,0.43637738599999992,2.3007100000000005,2.46,1.5831013373468816,0,2,167.418098510882,167.418098510882,1.9450171821305842,1.9450171821305842,null,0,0,0,0]
[null,"CBD412M","MAJOR METROPOLITAN AREAS","Urban",436.5,0.43637738599999992,2.3007100000000005,2.46,0,0.26385744394872629,null,0,0,0,0,1,27.903780068728523,27.903780068728523,0.13745704467353953,0.13745704467353953]
[null,"CBD412N","MAJOR METROPOLITAN AREAS","Urban",534,0.25397499099999998,2.8449799999999996,1.89,3.9318618852999011E-2,0,2,3.3988729755530152,3.3988729755530152,2.0599233077259999E-2,2.0599233077259999E-2,null,0,0,0,0]
[null,"CBD412N","MAJOR METROPOLITAN AREAS","Urban",534,0.25397499099999998,2.8449799999999996,1.89,0,1.7677148954200379E-2,null,0,0,0,0,1,1.5280898876404494,1.5280898876404494,7.4906367041198503E-3,7.4906367041198503E-3]
[null,"CBD412R","ADELAIDE BUSINESS AREA","CBD",0.5,0,1.2836000000000001,2.08,2.6960478598453554E-2,0,1,306,306,2,2,null,0,0,0,0]
[null,"CBD412S","MAJOR METROPOLITAN AREAS","Urban",472.5,0.29415999999999998,4.4482500000000007,1.1599999999999999,1.0398322914235518E-3,0,1,0.10158730158730159,0.10158730158730159,2.1164021164021165E-3,2.1164021164021165E-3,null,0,0,0,0]
[null,"CBD412S","MAJOR METROPOLITAN AREAS","Urban",472.5,0.29415999999999998,4.4482500000000007,1.1599999999999999,0,1.0983228578161267E-2,null,0,0,0,0,3,1.073015873015873,1.073015873015873,0.15873015873015872,0.15873015873015872]
[null,"CD01","UPPER NORTH/EYRE PENINSULA","Rural Short",675,11.30210000000001,0.97155999999999998,2.27,9.0251627475688601,4.9112437721895255,5,687.77777596932867,250.84296115451389,1.9081481248361094,0.96444442113240558,5,374.26962962962961,374.26962962962961,2.1718518518518519,2.1718518518518519]
[null,"CD02","UPPER NORTH/EYRE PENINSULA","Rural Long",498.5,87.641210000000001,1.3731499999999999,2.02,7.8024371919642492,2.9031781122117755,7,888.66532663787257,450.27816515341925,2.8592443714887952,1.912403849924101,4,330.65997993981944,330.65997993981944,2.0260782347041122,2.0260782347041122]
[null,"CD03","UPPER NORTH/EYRE PENINSULA","Rural Short",506,36.697450000000025,7.5752299999999995,3.32,10.806666039330329,3.0116924427135174,11,1098.596175725281,653.896570982198,4.821475612316207,3.8610013040158115,3,306.16600790513831,306.16600790513831,1.9150197628458498,1.9150197628458498]
[null,"CD04","UPPER NORTH/EYRE PENINSULA","Rural Short",194,31.613989999999998,1.03426,2.27,4.2584059049017489,1.1526935947473229,7,1129.1254454937177,680.44503312258371,4.9725086369465306,4.0034364719980768,2,305.63917525773195,305.63917525773195,1.9432989690721649,1.9432989690721649]
[null,"CD15","UPPER NORTH/EYRE PENINSULA","Rural Long",34.5,88.256280000000004,0,0.56999999999999995,0.54955266181268325,0.18040727885864094,7,904.40579710144925,461.536231884058,2.9565217391304346,2,3,296.89855072463769,296.89855072463769,1.9130434782608696,1.9130434782608696]
[null,"CD16","UPPER NORTH/EYRE PENINSULA","Rural Short",71,96.935599999999965,0,0.05,1.7880222851702539,2.6330924535459093,10,1295.4225352112676,891.11267605633805,5.619718309859155,4.746478873239437,22,1907.6760563380283,1907.6760563380283,7.450704225352113,7.450704225352113]
[null,"CD17","UPPER NORTH/EYRE PENINSULA","Rural Long",86,183.82322999999991,0.67621000000000009,0.17,3.8104454854931937,2.7815797666840929,10,2515.6511599518531,2117.2558111146441,5.6976744068223377,4.8372092905432682,7,1836.3953488372092,1836.3953488372092,5.5116279069767442,5.5116279069767442]
[null,"CD18","UPPER NORTH/EYRE PENINSULA","Rural Long",47,69.604019999999991,0,0.16,0.69980693262622085,0.24148825543598806,4,845.38297872340422,431.63829787234044,3.4042553191489362,2.5106382978723403,4,291.72340425531917,291.72340425531917,1.8297872340425532,1.8297872340425532]
[null,"CD19","UPPER NORTH/EYRE PENINSULA","Rural Long",55,26.270230000000016,0,0.06,0.93985094351799248,0.35237805605045674,4,970.21818181818185,532.4727272727273,3.1636363636363636,2.2181818181818183,6,363.76363636363635,363.76363636363635,2.3818181818181818,2.3818181818181818]
[null,"CD20","UPPER NORTH/EYRE PENINSULA","Rural Long",65,10.694710000000002,3.7539999999999997E-2,0.18,1.0173293794936988,0.32872414845432724,3,888.63076923076926,447,2.8461538461538463,1.8923076923076922,2,287.13846153846151,287.13846153846151,1.8769230769230769,1.8769230769230769]
[null,"CD21","UPPER NORTH/EYRE PENINSULA","Rural Long",19,4.1521699999999999,0,0.15,0.23030416658748304,7.7918754434309026E-2,3,688.21052631578948,347.05263157894734,2.2105263157894739,1.4736842105263157,2,232.84210526315789,232.84210526315789,1.4736842105263157,1.4736842105263157]
[null,"CD22","UPPER NORTH/EYRE PENINSULA","Rural Long",9,21.778689999999994,0,0.03,0.22234320885594874,5.4898905418567193E-2,6,1402.6666666666667,939.66666666666663,3.5555555555555554,2.5555555555555554,3,346.33333333333331,346.33333333333331,2.1111111111111112,2.1111111111111112]
[null,"CD23","UPPER NORTH/EYRE PENINSULA","Rural Long",49,86.922349999999952,0,0.14000000000000001,3.9393178962569757,0.26158438988660887,15,4564.5510204081629,4129.8979591836733,8.5510204081632661,7.6122448979591839,2,303.10204081632651,303.10204081632651,1.9183673469387754,1.9183673469387754]
[null,"CD24","UPPER NORTH/EYRE PENINSULA","Rural Long",8.5,29.216530000000002,0,0.17,0.15840896866685703,4.7695295435829309E-2,4,1058.1176470588234,676.82352941176475,2.7058823529411766,1.8823529411764706,3,318.58823529411762,318.58823529411762,1.8823529411764706,1.8823529411764706]
[null,"CD25","UPPER NORTH/EYRE PENINSULA","Rural Long",29,21.048449999999985,0,0.03,0.35759142660031112,0.42369203360572744,4,700.10344827586209,348.86206896551727,2.2758620689655173,1.5172413793103448,5,829.51724137931035,829.51724137931035,3.3448275862068964,3.3448275862068964]
[null,"CD26","UPPER NORTH/EYRE PENINSULA","Rural Long",35,83.555930000000004,0,0.06,1.172286251445112,0.21376580528237088,7,1901.6857142857143,1451.9142857142858,6.3142857142857141,5.3428571428571425,7,346.77142857142854,346.77142857142854,2.1714285714285713,2.1714285714285713]
[null,"CL01","BAROSSA/MID NORTH & YORKE PENINSULA/RIVE","Rural Long",140,45.496169999999999,0.21002999999999999,0.12,0.46090774972681581,0.24858618898866133,2,186.92142857142858,186.92142857142858,1.7,1.7,3,100.81428571428572,100.81428571428572,0.39285714285714285,0.39285714285714285]
[null,"CL02","BAROSSA/MID NORTH & YORKE PENINSULA/RIVE","Rural Long",34,21.528110000000005,0.33112999999999998,0.72,8.369573261117462E-2,4.0685425574876546E-3,2,139.76470588235293,139.76470588235293,1.9411764705882353,1.9411764705882353,2,6.7941176470588234,6.7941176470588234,1.9411764705882353,1.9411764705882353]
[null,"CL03","BAROSSA/MID NORTH & YORKE PENINSULA/RIVE","Rural Long",78,92.361109999999982,0.67034000000000005,0.06,0.13480789928575979,0,2,98.128205128205124,98.128205128205124,0.96153846153846156,0.96153846153846156,null,0,0,0,0]
[null,"CL04","BAROSSA/MID NORTH & YORKE PENINSULA/RIVE","Rural Long",1068,77.682919999999953,13.320799999999998,0.09,0.6203910991951499,4.8945799858260579E-2,9,32.981273608261283,32.981273608261283,0.13483146413435204,0.13483146413435204,5,2.6020599250936329,2.6020599250936329,1.4981273408239701E-2,1.4981273408239701E-2]
[null,"CL05","BAROSSA/MID NORTH & YORKE PENINSULA/RIVE","Rural Long",397,44.495210000000014,6.4657099999999987,3.11,1.2498351405241872,3.8624735188616574E-2,5,178.7455922470285,178.7455922470285,1.0957178865331847,1.0957178865331847,3,5.523929471032746,5.523929471032746,5.0377833753148617E-2,5.0377833753148617E-2]
[null,"CL06","BAROSSA/MID NORTH & YORKE PENINSULA/RIVE","Rural Long",248,57.886119999999998,0.38858000000000004,1.77,0,0.90980361190295367,null,0,0,0,0,20,208.29032258064515,208.29032258064515,0.82661290322580649,0.82661290322580649]
[null,"CL07","BAROSSA/MID NORTH & YORKE PENINSULA/RIVE","Rural Long",61,60.586169999999989,0.11787,1.26,0.23796570776716758,1.4794700209046019E-3,2,221.49180327868854,221.49180327868854,1.9344262295081966,1.9344262295081966,1,1.3770491803278688,1.3770491803278688,1.6393442622950821E-2,1.6393442622950821E-2]
[null,"CL08","BAROSSA/MID NORTH & YORKE PENINSULA/RIVE","Rural Long",81,55.014599999999987,0,0.08,0.21156421298935807,2.4182289746452604E-2,1,148.2962962962963,148.2962962962963,0.95061728395061729,0.95061728395061729,2,16.950617283950617,16.950617283950617,0.98765432098765427,0.98765432098765427]
[null,"CL09","BAROSSA/MID NORTH & YORKE PENINSULA/RIVE","Rural Long",707,98.771773793999984,6.1379700000000001,0.08,9.3462113526786812,7.2053712565722933E-2,8,750.56671450127976,750.56671450127976,2.1862329092862076,2.1862329092862076,6,5.7864214992927865,5.7864214992927865,3.2531824611032531E-2,3.2531824611032531E-2]
[null,"CL10","BAROSSA/MID NORTH & YORKE PENINSULA/RIVE","Rural Long",95,94.746810000000039,0,1.96,0.45514838428829429,2.4798735588496185E-2,3,272.02105263157893,272.02105263157893,1.8842105263157896,1.8842105263157896,1,14.821052631578947,14.821052631578947,0.11578947368421053,0.11578947368421053]
[null,"CL11","BAROSSA/MID NORTH & YORKE PENINSULA/RIVE","Rural Short",80,74.860539999999986,0.28195999999999999,0.09,4.6267931923948943E-2,0,2,29.75,29.75,0.21249999999999999,0.21249999999999999,null,0,0,0,0]
[null,"CL12","BAROSSA/MID NORTH & YORKE PENINSULA/RIVE","Rural Long",103,102.58139000000004,0.25524999999999998,7.0000000000000007E-2,0.38353499018117393,0,3,211.41747572815535,211.41747572815535,1.854368932038835,1.854368932038835,null,0,0,0,0]
[null,"CL13","BAROSSA/MID NORTH & YORKE PENINSULA/RIVE","Rural Long",72.5,60.140170000000012,0,0.13,0.28652402738185789,0,3,224.38620689655173,224.38620689655173,1.5448275862068965,1.5448275862068965,null,0,0,0,0]
[null,"CL14","BAROSSA/MID NORTH & YORKE PENINSULA/RIVE","Rural Long",143.5,11.162679999999998,9.6300000000000014E-3,0.09,0.24545112156341109,2.3424941997656195E-2,1,97.114982578397218,97.114982578397218,0.93379790940766549,0.93379790940766549,1,9.2682926829268286,9.2682926829268286,6.968641114982578E-2,6.968641114982578E-2]
[null,"CL15","BAROSSA/MID NORTH & YORKE PENINSULA/RIVE","Rural Long",116.5,37.22336,0.40206999999999998,0.44,0,1.5182180452616273E-2,null,0,0,0,0,2,7.3991416309012878,7.3991416309012878,5.1502145922746781E-2,5.1502145922746781E-2]
[null,"CL16","BAROSSA/MID NORTH & YORKE PENINSULA/RIVE","Rural Long",230.5,32.022439999999989,8.1110000000000002E-2,0.5,0.82027806289988126,2.1064835059546476E-2,3,202.05206073752711,202.05206073752711,1.7657266811279826,1.7657266811279826,3,5.188720173535792,5.188720173535792,5.2060737527114966E-2,5.2060737527114966E-2]
[null,"CL17","BAROSSA/MID NORTH & YORKE PENINSULA/RIVE","Rural Long",235,37.342069999999993,0.67576999999999998,0.48,0.90120860204100917,0.24516931774990544,3,217.73617177111038,217.73617177111038,1.8893617102440368,1.8893617102440368,1,59.234042553191486,59.234042553191486,0.1276595744680851,0.1276595744680851]
[null,"CL18","BAROSSA/MID NORTH & YORKE PENINSULA/RIVE","Rural Long",32,31.025770000000009,0,0.24,0,0.12920704849233525,null,0,0,0,0,1,229.25,229.25,0.875,0.875]
[null,"CL19","BAROSSA/MID NORTH & YORKE PENINSULA/RIVE","Rural Long",100.5,98.424059999999955,0,0.04,0,0.10004035379450166,null,0,0,0,0,2,56.517412935323385,56.517412935323385,0.37810945273631841,0.37810945273631841]
[null,"CL21","BAROSSA/MID NORTH & YORKE PENINSULA/RIVE","Rural Long",54.5,18.382949999999994,0.45519000000000004,0.1,0.12726964727448398,1.6062817369821392E-2,3,132.58715596330276,132.58715596330276,1.871559633027523,1.871559633027523,3,16.73394495412844,16.73394495412844,1.871559633027523,1.871559633027523]
[null,"CL22","BAROSSA/MID NORTH & YORKE PENINSULA/RIVE","Rural Long",76.5,51.818369999999994,0,0.1,0.11437712280660102,1.1976662073989635E-3,1,84.888888888888886,84.888888888888886,0.92810457516339873,0.92810457516339873,1,0.88888888888888884,0.88888888888888884,2.6143790849673203E-2,2.6143790849673203E-2]
[null,"CL23","BAROSSA/MID NORTH & YORKE PENINSULA/RIVE","Rural Long",1355.5,10.35764,3.9056600000000001,0.17,0.16688069581037027,1.7351365307075926,2,6.9900405754334196,6.9900405754334196,0.9634821099225378,0.9634821099225378,3,72.678716340833645,72.678716340833645,3.6149022500922168E-2,3.6149022500922168E-2]
[null,"CL24","BAROSSA/MID NORTH & YORKE PENINSULA/RIVE","Rural Long",53.5,38.141489999999983,0,4.4800000000000004,0.13297617449797314,0.13988036792886127,1,141.12149532710279,141.12149532710279,0.93457943925233644,0.93457943925233644,2,148.44859813084113,148.44859813084113,0.82242990654205606,0.82242990654205606]
[null,"CL25","BAROSSA/MID NORTH & YORKE PENINSULA/RIVE","Rural Long",328.5,15.089300000000001,0.17454,0.1,1.0444353838052724E-2,0,2,1.8051750380517504,1.8051750380517504,6.0882800608828003E-3,6.0882800608828003E-3,null,0,0,0,0]
[null,"CL26","BAROSSA/MID NORTH & YORKE PENINSULA/RIVE","Rural Long",50,27.177389999999992,8.7550000000000003E-2,1.94,0.18745237419628188,0,3,212.86,212.86,1.88,1.88,null,0,0,0,0]
[null,"CL27","BAROSSA/MID NORTH & YORKE PENINSULA/RIVE","Rural Long",47,59.299379999999999,0,0.11,0.22861334370644923,6.6928405707589135E-3,3,276.17021276595744,276.17021276595744,2.8085106382978724,2.8085106382978724,3,8.085106382978724,8.085106382978724,1.9148936170212767,1.9148936170212767]
[null,"CL28","BAROSSA/MID NORTH & YORKE PENINSULA/RIVE","Rural Long",42,14.081449999999997,1.1118000000000001,0.17,0.10668035615022826,0,2,144.21428571428572,144.21428571428572,0.97619047619047616,0.97619047619047616,null,0,0,0,0]
[null,"CM01","UPPER NORTH/EYRE PENINSULA","Rural Long",329.5,29.251549999999995,0.35209000000000001,0.15,4.1266645940231932E-2,0.10423218552039804,2,7.1107738998482546,0.61608497723823974,0.65250379362670718,3.0349013657056147E-3,4,17.960546282245826,17.960546282245826,0.94688922610015169,0.94688922610015169]
[null,"CM02","UPPER NORTH/EYRE PENINSULA","Rural Long",268,51.279340000000026,0.57337000000000005,1.51,6.1926388017864056E-2,6.7315885951159379E-2,6,13.119402985074627,6.7014925373134329,0.66417910447761197,2.2388059701492536E-2,2,14.261194029850746,14.261194029850746,0.94029850746268662,0.94029850746268662]
[null,"CM03","UPPER NORTH/EYRE PENINSULA","Rural Long",142,59.78168999999999,0.82274999999999998,1.68,0.95489224356378077,1.2771877210225859,13,381.8028254979094,374.83099451199382,3.1103286474523411,2.4131455488607916,9,510.66901408450707,510.66901408450707,2.7183098591549295,2.7183098591549295]
[null,"CM04","UPPER NORTH/EYRE PENINSULA","Rural Long",23.5,10.836100000000004,9.4670000000000004E-2,0.95,4.1812640828899107E-2,5.4247234099835404E-3,2,101.02127659574468,94.212765957446805,1.446808510638298,0.76595744680851063,1,13.106382978723405,13.106382978723405,0.93617021276595747,0.93617021276595747]
[null,"CM05","UPPER NORTH/EYRE PENINSULA","Rural Long",1099.5,9.3824400000000008,4.9917000000000016,0.06,0.13829522147789206,0.44144567385658268,3,7.1414279217826282,0.42928603910868579,0.67303319690768526,1.8190086402910413E-3,2,22.79581628012733,22.79581628012733,0.99681673487949063,0.99681673487949063]
[null,"CM09","UPPER NORTH/EYRE PENINSULA","Rural Long",68.5,66.83587999999996,0,1.87,2.267604836326496,0.71479537295705198,12,1879.5328467153286,1872.087591240876,7.8248175182481754,7.0802919708029197,3,592.46715328467155,592.46715328467155,2.6861313868613137,2.6861313868613137]
[null,"CM10","UPPER NORTH/EYRE PENINSULA","Rural Long",78.5,82.760010000000065,0,0.1,1.8214037231170059,0.97497074377613258,8,1317.375796178344,1310.2420382165606,4.6496815286624207,3.9363057324840764,4,705.171974522293,705.171974522293,3.4012738853503186,3.4012738853503186]
[null,"CM11","UPPER NORTH/EYRE PENINSULA","Rural Long",85,110.58339999999997,0,0.09,0.6226279132023641,0.91540446269637832,5,415.89411764705881,409.65882352941179,3.7176470588235295,3.0941176470588236,4,611.4588235294118,611.4588235294118,2.6235294117647059,2.6235294117647059]
[null,"CM12","UPPER NORTH/EYRE PENINSULA","Rural Long",90.5,103.81149999999988,0,0.1,0.13903495057586507,2.2244888528601337E-2,3,87.22651562769768,80.375686898415921,0.87292816559912745,0.18784529267095071,2,13.955801104972375,13.955801104972375,0.86187845303867405,0.86187845303867405]
[null,"CM15","UPPER NORTH/EYRE PENINSULA","Rural Long",73,93.808890000000019,0,0.11,1.2671660729047916,1.7013905240402923E-2,6,985.56164383561645,978.71232876712327,2.5342465753424657,1.8493150684931507,1,13.232876712328768,13.232876712328768,0.9452054794520548,0.9452054794520548]
[null,"CM16","UPPER NORTH/EYRE PENINSULA","Rural Long",101,136.62824000000003,0,0.13,2.868111150168668,2.0468115484448286,4,1612.3069306930693,1606.6633663366338,3.0792079207920793,2.5148514851485149,9,1150.6138613861385,1150.6138613861385,4.9801980198019802,4.9801980198019802]
[null,"CM17","UPPER NORTH/EYRE PENINSULA","Rural Long",93.5,90.17566000000005,0,0.11,1.1527713373598465,1.8000218587672655E-2,4,700.01069518716577,693.80748663101599,2.3850267379679146,1.7647058823529411,1,10.930481283422459,10.930481283422459,0.78074866310160429,0.78074866310160429]
[null,"CM18","UPPER NORTH/EYRE PENINSULA","Rural Long",67.5,96.193399999999869,0,0.12,0.66998856660965544,0.57554906360857838,4,563.55555555555554,558.51851851851848,2.2666666666666666,1.7629629629629631,3,484.1185185185185,484.1185185185185,2.2074074074074073,2.2074074074074073]
[null,"CM20","UPPER NORTH/EYRE PENINSULA","Rural Long",236,87.476990000000001,0.29225999999999996,0.09,6.7417863706171737,2.6456446521443104,7,1621.9449152542372,1614.3601694915253,6.6101694915254239,5.851694915254237,7,636.49152542372883,636.49152542372883,3.1991525423728815,3.1991525423728815]
[null,"CM21","UPPER NORTH/EYRE PENINSULA","Rural Long",69.5,55.338989999999981,0,0.31,0.41338858167442755,1.5781013556315754E-2,2,337.71223021582733,331.9568345323741,1.4964028776978417,0.92086330935251803,1,12.892086330935252,12.892086330935252,0.92086330935251803,0.92086330935251803]
[null,"CM22","UPPER NORTH/EYRE PENINSULA","Rural Long",57,74.517009999999985,0,0.1,2.0994384106170064E-2,0.13818954504782746,2,20.912280701754387,13.017543859649123,0.82456140350877194,3.5087719298245612E-2,3,137.64912280701753,137.64912280701753,1.9298245614035088,1.9298245614035088]
[null,"CM24","UPPER NORTH/EYRE PENINSULA","Rural Long",49,58.79683,0,0.16,5.1076941197896967E-3,0.44986456278506359,1,5.9183673469387754,0,0.59183673469387754,0,3,521.26530612244903,521.26530612244903,2.6326530612244898,2.6326530612244898]
[null,"CM25","UPPER NORTH/EYRE PENINSULA","Rural Long",116,93.731789999999918,0,0.04,1.2783501617532966,1.1782569697437626,4,625.69827586206895,618.7155172413793,1.6120689655172413,0.91379310344827591,6,576.70689655172418,576.70689655172418,3.3620689655172415,3.3620689655172415]
[null,"CM26","UPPER NORTH/EYRE PENINSULA","Rural Long",66.5,71.812090000000012,0,0.18,0.91196997871927843,1.553443521949832E-2,6,778.63157894736844,770.36090225563908,4.0451127819548871,3.2180451127819549,1,13.263157894736842,13.263157894736842,0.94736842105263153,0.94736842105263153]
[null,"CM27","UPPER NORTH/EYRE PENINSULA","Rural Long",48,56.860450000000029,0,0.09,0.42363919539069511,1.4424832703819869E-2,5,501.10416666666669,493.39583333333331,2.9166666666666665,2.1458333333333335,3,17.0625,17.0625,0.97916666666666663,0.97916666666666663]
[null,"CM28","UPPER NORTH/EYRE PENINSULA","Rural Long",72.5,78.573640000000012,0,0.06,1.0229478430254677,2.7475871816799752E-2,3,801.10344827586209,795.44827586206895,2.2206896551724138,1.6551724137931034,2,21.517241379310345,21.517241379310345,0.86896551724137927,0.86896551724137927]
[null,"CM29","UPPER NORTH/EYRE PENINSULA","Rural Long",74,62.281919999999978,0,0.11,8.8063691720512011E-3,1.6274170229950619E-2,1,6.756756756756757,0,0.67567567567567566,0,1,12.486486486486486,12.486486486486486,0.89189189189189189,0.89189189189189189]
[null,"CM35","UPPER NORTH/EYRE PENINSULA","Rural Long",22.5,29.776979999999995,0,0.19,6.1996852408693365E-3,5.1781450731661072E-3,2,15.644447835286444,7.2000033908420003,0.93333337571885866,8.8888931274414218E-2,1,13.066666666666666,13.066666666666666,0.93333333333333335,0.93333333333333335]
[null,"CM36","UPPER NORTH/EYRE PENINSULA","Rural Long",3,30.249230000000001,0,3.14,3.5225476688204808E-4,4.9315667363486731E-4,1,6.666666666666667,0,0.66666666666666663,0,1,9.3333333333333339,9.3333333333333339,0.66666666666666663,0.66666666666666663]
[null,"CM37","UPPER NORTH/EYRE PENINSULA","Rural Long",4,0.21919999999999998,3.7399999999999998E-3,2.69,5.2838215032307212E-4,5.8474291302419981E-3,1,7.5,0,0.75,0,2,83,83,2,2]
[null,"CN01","BAROSSA/MID NORTH & YORKE PENINSULA/RIVE","Rural Long",73,52.060279999999992,0,0.74,5.7945909152096915E-3,2.7634386461896671E-2,2,4.506849315068493,4.506849315068493,4.1095890410958902E-2,4.1095890410958902E-2,7,21.493150684931507,21.493150684931507,0.15068493150684931,0.15068493150684931]
[null,"CN02","BAROSSA/MID NORTH & YORKE PENINSULA/RIVE","Rural Long",90.5,101.23581000000006,0,0.12,0.83922936935813552,0.37973063869884777,7,526.50828729281773,526.50828729281773,2.2209944751381214,2.2209944751381214,1,238.23204419889504,238.23204419889504,0.850828729281768,0.850828729281768]
[null,"CN03","BAROSSA/MID NORTH & YORKE PENINSULA/RIVE","Rural Long",51,38.463920000000023,0,0.17,0.12695261798429011,3.4767545491258142E-2,1,141.33333333333334,141.33333333333334,0.96078431372549022,0.96078431372549022,2,38.705882352941174,38.705882352941174,7.8431372549019607E-2,7.8431372549019607E-2]
[null,"CN11","BAROSSA/MID NORTH & YORKE PENINSULA/RIVE","Rural Long",17,21.637520000000006,5.4009999999999996E-2,0.13,0.12152789457430659,9.8877913063790887E-2,2,405.88235294117646,405.88235294117646,1.7647058823529411,1.7647058823529411,3,330.23529411764707,330.23529411764707,1.7058823529411764,1.7058823529411764]
[null,"CN12","BAROSSA/MID NORTH & YORKE PENINSULA/RIVE","Rural Long",57,54.931230000000014,0.25473000000000001,0.72,1.178662062725677,0.1986716885214751,4,1174.0526315789473,1174.0526315789473,3.6491228070175437,3.6491228070175437,1,197.89473684210526,197.89473684210526,0.84210526315789469,0.84210526315789469]
[null,"CN21","BAROSSA/MID NORTH & YORKE PENINSULA/RIVE","Rural Long",93.5,18.611590000000007,1.009E-2,0.12,0.69963080524277987,1.104389145128597,5,424.84491978609628,424.84491978609628,1.3903743315508021,1.3903743315508021,5,670.63101604278074,670.63101604278074,3.0802139037433154,3.0802139037433154]
[null,"CN24","BAROSSA/MID NORTH & YORKE PENINSULA/RIVE","Rural Long",624,34.432470000000002,3.7309999999999994,1.1200000000000001,1.4598670431276157,0.30309761416365827,2,132.83173076923077,132.83173076923077,1.0240384615384615,1.0240384615384615,5,27.578525641025642,27.578525641025642,1.0881410256410255,1.0881410256410255]
[null,"CN25","BAROSSA/MID NORTH & YORKE PENINSULA/RIVE","Rural Long",101.5,87.35670000000016,0.58238999999999996,1.73,4.7431104360667771,0.65744829690865447,17,2653.2019704433496,2653.2019704433496,8.6403940886699502,8.6403940886699502,4,367.76354679802955,367.76354679802955,3.1921182266009853,3.1921182266009853]
[null,"CN27","BAROSSA/MID NORTH & YORKE PENINSULA/RIVE","Rural Long",67.5,11.956080000000002,0.1648,0.13,0.72029054732041187,0.63382961478921318,3,605.86666666666667,605.86666666666667,2.8444444444444446,2.8444444444444446,5,533.14074074074074,533.14074074074074,3.8222222222222224,3.8222222222222224]
[null,"CN31","BAROSSA/MID NORTH & YORKE PENINSULA/RIVE","Rural Long",24,11.476460000000001,8.2269999999999996E-2,0.05,0.18826255263513694,0.3063911962340054,5,445.37498219807941,445.37498219807941,2.8749999577800431,2.8749999577800431,2,724.83333333333337,724.83333333333337,0.625,0.625]
[null,"CN32","BAROSSA/MID NORTH & YORKE PENINSULA/RIVE","Rural Long",52,26.644739999999999,1.6042399999999999,0.51,0.16688069581037027,0.433590392555113,6,182.21153846153845,182.21153846153845,2,2,4,473.42307692307691,473.42307692307691,1.3653846153846154,1.3653846153846154]
[null,"CN33","BAROSSA/MID NORTH & YORKE PENINSULA/RIVE","Rural Long",38.5,32.011759999999995,5.45E-3,1.07,0.27737129818478928,2.0289874572405973E-2,5,409.04765418907272,409.04765418907272,3.264069396179992,3.264069396179992,2,29.922077922077921,29.922077922077921,0.31168831168831168,0.31168831168831168]
[null,"CN41","BAROSSA/MID NORTH & YORKE PENINSULA/RIVE","Rural Long",42,20.78905,1.9269999999999999E-2,0.54,0.18445820867778448,0.10981542357547848,5,249.35714285714286,249.35714285714286,2.9761904761904763,2.9761904761904763,4,148.45238095238096,148.45238095238096,0.97619047619047616,0.97619047619047616]
[null,"CN42","BAROSSA/MID NORTH & YORKE PENINSULA/RIVE","Rural Long",118,39.446129999999982,0.19441,0.3,0.25497961300757049,0.744226258730047,5,122.6864406779661,122.6864406779661,2.9237288135593222,2.9237288135593222,5,358.09322033898303,358.09322033898303,1.1779661016949152,1.1779661016949152]
[null,"CN43","BAROSSA/MID NORTH & YORKE PENINSULA/RIVE","Rural Long",38.5,22.454969999999999,0,1.1599999999999999,6.7562485787901652E-2,0,4,99.636395342938442,99.636395342938442,1.3766234013941381,1.3766234013941381,null,0,0,0,0]
[null,"CN51","BAROSSA/MID NORTH & YORKE PENINSULA/RIVE","Rural Long",52.5,11.5908,6.9850000000000009E-2,0.11,1.8387698831242909E-2,0.22232559611760463,1,19.885714285714286,19.885714285714286,0.91428571428571426,0.91428571428571426,5,240.43809523809523,240.43809523809523,2.9904761904761905,2.9904761904761905]
[null,"CN52","BAROSSA/MID NORTH & YORKE PENINSULA/RIVE","Rural Long",102,112.72437000000005,0,0.5,0.6609356191007868,0.98504523010895928,2,367.9019607843137,367.9019607843137,1.7450980392156863,1.7450980392156863,8,548.31372549019613,548.31372549019613,4.3529411764705879,4.3529411764705879]
[null,"CN53","BAROSSA/MID NORTH & YORKE PENINSULA/RIVE","Rural Long",109,119.86636999999997,5.373E-2,0.12,0.80567710281262039,1.2292282345115948,3,419.66972477064218,419.66972477064218,1.8899082568807339,1.8899082568807339,4,640.29357798165142,640.29357798165142,3.8073394495412844,3.8073394495412844]
[null,"CN61","BAROSSA/MID NORTH & YORKE PENINSULA/RIVE","Rural Long",51,25.268180000000008,0.92832999999999988,0.17,0.50495720832541591,0.19245439188600699,2,562.15686274509801,562.15686274509801,1.9019607843137254,1.9019607843137254,1,214.25490196078431,214.25490196078431,0.96078431372549022,0.96078431372549022]
[null,"CN71","SOUTH EAST","Rural Long",241,11.167770000000001,0.51351999999999998,0.57999999999999996,9.3576484197197246E-2,5.6167022579342571E-2,2,22.045644419816519,22.045644419816519,7.0539423044291782E-2,7.0539423044291782E-2,3,13.232365145228215,13.232365145228215,1.0663900414937759,1.0663900414937759]
[null,"CN72","SOUTH EAST","Rural Long",17,10.679339999999998,0,1.1299999999999999,4.7202090387363808E-3,0.13272959616115571,1,15.764689725988058,15.764689725988058,7.8431290738722931E-2,7.8431290738722931E-2,2,443.29411764705884,443.29411764705884,1.8823529411764706,1.8823529411764706]
[null,"CN73","SOUTH EAST","Rural Long",111,112.75450000000004,0.31785000000000002,0.56000000000000005,0.5118261762796158,0.50354818925788769,3,261.80180180180179,261.80180180180179,1.027027027027027,1.027027027027027,3,257.56756756756755,257.56756756756755,1.2072072072072073,1.2072072072072073]
[null,"CN74","SOUTH EAST","Rural Long",98,93.282560000000032,0.22333999999999998,0.66,0,0.81871052918725618,null,0,0,0,0,6,474.32653061224488,474.32653061224488,1.9081632653061225,1.9081632653061225]
[null,"CN75","SOUTH EAST","Rural Long",61,66.830230000000014,1.33738,0.16,0.41182104796180241,0.51260113676675634,2,383.31147540983608,383.31147540983608,0.96721311475409832,0.96721311475409832,4,477.11475409836066,477.11475409836066,1.9180327868852458,1.9180327868852458]
[null,"CN76","SOUTH EAST","Rural Long",78,73.939760000000078,5.6770000000000001E-2,0.12,0,0.21332548682376828,null,0,0,0,0,2,155.28205128205127,155.28205128205127,1.141025641025641,1.141025641025641]
[null,"CN77","SOUTH EAST","Rural Long",78,99.801410000000047,5.9650000000000002E-2,0.47,2.4305578914861316E-2,0.5457659230687012,1,17.692307692307693,17.692307692307693,0.58974358974358976,0.58974358974358976,6,397.26923076923077,397.26923076923077,2.8717948717948718,2.8717948717948718]
[null,"CN81","BAROSSA/MID NORTH & YORKE PENINSULA/RIVE","Rural Long",191,16.112489999999998,4.5230000000000006E-2,0.12,4.2781350037794652E-2,0,2,12.717280043357334,12.717280043357334,5.7591637703760828E-2,5.7591637703760828E-2,null,0,0,0,0]
[null,"CN83","BAROSSA/MID NORTH & YORKE PENINSULA/RIVE","Rural Long",106,102.13246000000011,0.15444999999999998,0.56999999999999995,0.1657534805563477,0.52579307778648909,3,88.783018867924525,88.783018867924525,0.37735849056603776,0.37735849056603776,5,281.6320754716981,281.6320754716981,1.5094339622641511,1.5094339622641511]
[null,"CN91","BAROSSA/MID NORTH & YORKE PENINSULA/RIVE","Rural Long",16,2.0804600000000004,0,0.11,6.472681341457634E-2,0,1,229.6875,229.6875,0.9375,0.9375,null,0,0,0,0]
[null,"CV01","UPPER NORTH/EYRE PENINSULA","Rural Short",464,5.1332899999999997,1.1625999999999999,0.12,4.0488328494961543,0.3949881684163003,2,448.85775862068965,3.8189655172413794,1.915948275862069,0.95474137931034486,3,43.788793103448278,43.788793103448278,1.1422413793103448,1.1422413793103448]
[null,"CV02","UPPER NORTH/EYRE PENINSULA","Rural Long",86,23.782150000000001,0.14731,1.22,0.71262900614072744,9.3048096671892996E-2,3,470.47674418604652,18.244186046511629,1.9883720930232558,1.0116279069767442,7,61.430232558139537,61.430232558139537,1.4186046511627908,1.4186046511627908]
[null,"CV03","UPPER NORTH/EYRE PENINSULA","Rural Short",27,2.6605100000000004,0.3871,1.28,0.22502155967214665,0,1,428.7037037037037,0,0.92592592592592593,0,null,0,0,0,0]
[null,"CV04","UPPER NORTH/EYRE PENINSULA","Rural Short",35.5,14.539509999999998,0.17355000000000001,0.1,0.28802759638034775,0.13680144409614653,1,417.35211267605632,0,0.90140845070422537,0,1,198.22535211267606,198.22535211267606,0.87323943661971826,0.87323943661971826]
[null,"CV05","UPPER NORTH/EYRE PENINSULA","Rural Long",1,5.2409499999999989,0,0.21,8.1546978533194123E-3,0,1,463,0,1,0,null,0,0,0,0]
[null,"CV07","UPPER NORTH/EYRE PENINSULA","Rural Short",17,3.6971599999999998,0.10036,0.27,0.13656816040577369,6.2208984099427155E-4,2,413.23529411764707,4.7058823529411766,1.8235294117647058,0.94117647058823528,1,1.8823529411764706,1.8823529411764706,0.94117647058823528,0.94117647058823528]
[null,"CV08","UPPER NORTH/EYRE PENINSULA","Rural Long",531.5,53.376949999999958,0.71992999999999985,2.25,10.760649272390536,0,6,1149.4982762018242,719.1652564464149,2.8704923197332688,1.9410473526589509,null,0,0,0,0]
[null,"CV09","UPPER NORTH/EYRE PENINSULA","Rural Long",5,7.3316499999999998,0,1.98,4.077348926659706E-2,0,1,463,0,1,0,null,0,0,0,0]
[null,"CV15","UPPER NORTH/EYRE PENINSULA","Rural Long",65.5,100.67691000000002,0,0.21,1.0172941540170108,1.5217405929304477E-2,6,881.81679389312978,478.90076335877865,3.1297709923664123,2.2595419847328246,9,13.190839694656489,13.190839694656489,1.1603053435114503,1.1603053435114503]
[null,"CV16","UPPER NORTH/EYRE PENINSULA","Rural Long",62,91.708430000000021,0,0.11,0.45351039962229278,1.9374012178512644E-3,3,415.30645161290323,4.580645161290323,1.7903225806451613,0.90322580645161288,1,1.7741935483870968,1.7741935483870968,0.88709677419354838,0.88709677419354838]
[null,"CV17","UPPER NORTH/EYRE PENINSULA","Rural Long",49,78.071309999999997,0,0.08,2.4594251696321154,0.24612040562048701,6,2849.7755102040815,2415.1224489795918,4.9591836734693882,4.0204081632653059,3,285.18367346938777,285.18367346938777,1.9183673469387754,1.9183673469387754]
[null,"CV18","UPPER NORTH/EYRE PENINSULA","Rural Short",77.5,108.35905999999997,6.3539999999999999E-2,0.09,0.61355554598813145,1.0342243606529765E-2,5,407.23870967741937,18.916129032258066,0.91612903225806452,7.7419354838709681E-2,1,6.8645161290322578,6.8645161290322578,9.0322580645161285E-2,9.0322580645161285E-2]
[null,"CV19","UPPER NORTH/EYRE PENINSULA","Rural Long",71.5,100.07005999999996,0,0.09,1.0480107696891254,6.340585803876865E-2,4,832.20979020979019,463.10489510489509,1.9020979020979021,1.1048951048951048,1,50.349650349650346,50.349650349650346,0.25174825174825177,0.25174825174825177]
[null,"CV20","UPPER NORTH/EYRE PENINSULA","Rural Long",46,79.528980000000018,0.10235000000000001,0.02,0.41333574345939522,1.6203719276574213E-2,2,510.17391304347825,147.82608695652175,1.5652173913043479,0.78260869565217395,1,20,20,0.17391304347826086,0.17391304347826086]
[null,"CV21","UPPER NORTH/EYRE PENINSULA","Rural Long",70,105.16468000000002,0,7.0000000000000007E-2,0.70981096800567101,7.5347294636070081E-2,3,575.7285714285714,192.1,1.3,0.47142857142857142,1,61.114285714285714,61.114285714285714,0.44285714285714284,0.44285714285714284]
[null,"CV22","UPPER NORTH/EYRE PENINSULA","Rural Long",50,66.093220000000017,0.5404500000000001,0.08,2.1147086547613432,4.1389935108640651E-3,9,2401.34,1966.12,5.12,4.18,1,4.7,4.7,0.94,0.94]
[null,"CV23","UPPER NORTH/EYRE PENINSULA","Rural Long",78,169.85460000000009,0,0.09,2.3247933977297968,0,8,1692.2435897435898,1276.7307692307693,4.8589743589743586,3.9615384615384617,null,0,0,0,0]
[null,"CV24","UPPER NORTH/EYRE PENINSULA","Rural Long",85,110.35614000000001,2.3550000000000001E-2,0.12,1.5347916320434276,0.21584410840697496,5,1025.1882352941177,611.21176470588239,2.7882352941176469,1.8941176470588235,2,144.1764705882353,144.1764705882353,0.90588235294117647,0.90588235294117647]
[null,"CV25","UPPER NORTH/EYRE PENINSULA","Rural Long",68.5,112.88158999999993,8.3819999999999992E-2,0.08,0.70810253238629295,0.15842658140520111,4,586.91970802919707,194.8905109489051,3.1094890510948905,2.2627737226277373,3,131.31386861313868,131.31386861313868,0.59854014598540151,0.59854014598540151]
[null,"CV26","UPPER NORTH/EYRE PENINSULA","Rural Long",67,55.617419999999989,0,0.14000000000000001,2.6151041638556367,0.18319009151700907,5,2216.0895522388059,1766.9104477611941,3.5820895522388061,2.6119402985074629,2,155.23880597014926,155.23880597014926,0.73134328358208955,0.73134328358208955]
[null,"CV28","UPPER NORTH/EYRE PENINSULA","Rural Long",90,156.3198099999999,0,0.08,3.2878931558620041,0,6,2074.1888888888889,1662.6333333333334,4.6555555555555559,3.7666666666666666,null,0,0,0,0]
[null,"CV29","UPPER NORTH/EYRE PENINSULA","Rural Long",114,186.78883999999994,0,0.13,3.9509070780873952,0.286541640120202,7,1967.7280701754387,1553.4649122807018,4.1403508771929829,3.2456140350877192,1,142.71052631578948,142.71052631578948,0.76315789473684215,0.76315789473684215]
[null,"CV30","UPPER NORTH/EYRE PENINSULA","Rural Long",95,124.81923999999991,0,0.02,2.180862099981792,0.25129855069365309,5,1303.4000000000001,889.13684210526321,2.9473684210526314,2.0526315789473686,3,150.18947368421053,150.18947368421053,1.0526315789473684,1.0526315789473684]
[null,"CV31","UPPER NORTH/EYRE PENINSULA","Rural Long",66,107.44374000000002,0,0.11,4.1820566561153951,0.16344621183327029,6,3597.651515151515,3183.757575757576,5.2878787878787881,4.3939393939393936,5,140.60606060606059,140.60606060606059,1.1212121212121211,1.1212121212121211]
[null,"CV32","UPPER NORTH/EYRE PENINSULA","Rural Long",78,137.11501999999996,0,0.06,3.1555334272060751,0.17700802035822916,5,2296.9487179487178,1905.1794871794871,4.2820512820512819,3.4358974358974357,4,128.84615384615384,128.84615384615384,0.61538461538461542,0.61538461538461542]
[null,"CV33","UPPER NORTH/EYRE PENINSULA","Rural Long",46,72.842129999999983,0,7.0000000000000007E-2,0.64843057487647415,0.18968919196598288,3,800.3478260869565,407.80434782608694,2.5434782608695654,1.6956521739130435,4,234.13043478260869,234.13043478260869,2.2391304347826089,2.2391304347826089]
[null,"CV34","UPPER NORTH/EYRE PENINSULA","Rural Long",18,25.440030000000004,0,0.06,0.20321577501425356,0,2,641,178,2,1,null,0,0,0,0]
[null,"CV753A","UPPER NORTH/EYRE PENINSULA","Rural Long",791.5,26.998870000000007,0.54805000000000004,0.11,14.368013949722005,4.579311969466625E-3,7,1030.668346913495,590.18950926346338,2.9012423254460078,1.949884144776393,1,0.32849020846493998,0.32849020846493998,3.2849020846494E-2,3.2849020846494E-2]
[null,"CV757A","UPPER NORTH/EYRE PENINSULA","Rural Long",262.5,12.009489999999991,1.3717099999999998,2.1,2.1548480854475529,0.56152932388667276,6,466.08,19.836190476190477,2.9523809523809526,1.9885714285714287,2,121.4552380952381,121.4552380952381,1.3676190476190475,1.3676190476190475]
[null,"EL01A","MAJOR METROPOLITAN AREAS","Urban",789.5,0,5.1317899999999996,0.72,0.4090873539842157,0.87670860070648216,2,23.918936035465485,23.918936035465485,0.13299556681443953,0.13299556681443953,5,51.260291323622546,51.260291323622546,1.2716909436352122,1.2716909436352122]
[null,"EL01C","MAJOR METROPOLITAN AREAS","Urban",557,0,2.8758899999999996,1.39,1.2952118159130686,0.25085954030593188,14,107.34048168920314,107.34048168920314,1.518252225067714,1.518252225067714,1,20.789946140035905,20.789946140035905,0.95152603231597843,0.95152603231597843]
[null,"EL01E","MAJOR METROPOLITAN AREAS","Urban",77,2.0637867429999996,0.76783000000000012,1.03,0,2.1771488601680614E-2,null,0,0,0,0,1,13.051948051948052,13.051948051948052,3.896103896103896E-2,3.896103896103896E-2]
[null,"EL01L","MAJOR METROPOLITAN AREAS","Urban",1208.5,0,6.0571100000000015,2.08,6.31598466445213,4.1197722122746363,12,241.25279271824576,241.25279271824576,2.6487381050889534,2.6487381050889534,4,157.3636739760033,157.3636739760033,0.89284236657012828,0.89284236657012828]
[null,"EL01M","MAJOR METROPOLITAN AREAS","Urban",733,0,4.8015716200000007,2.46,0.36523386348183706,7.2463312808578775E-2,6,23.000909011653469,23.000909011653469,0.96907684845293363,0.96907684845293363,2,4.5634379263301499,4.5634379263301499,0.17053206002728513,0.17053206002728513]
[null,"EL01N","MAJOR METROPOLITAN AREAS","Urban",1064,0,7.3910402279999996,1.87,8.0291226444958674,1.4670083946439898,7,348.34084509369126,348.34084509369126,2.3690475843902816,2.3690475843902816,1,63.645676691729321,63.645676691729321,0.2781954887218045,0.2781954887218045]
[null,"EL01P","MAJOR METROPOLITAN AREAS","Urban",571,0,6.3476699999999973,2.3199999999999998,0.64965687666188099,0.19334381668656667,4,52.520139249945274,52.520139249945274,0.96672503543192367,0.96672503543192367,1,15.630472854640981,15.630472854640981,0.14886164623467601,0.14886164623467601]
[null,"EL01Q","MAJOR METROPOLITAN AREAS","Urban",1044.5,0,11.207795921999997,1.33,0.22176589931881041,1.1505744304601602,3,9.8008616562948774,9.8008616562948774,0.9688846337960747,0.9688846337960747,4,50.849210148396359,50.849210148396359,0.21541407371948301,0.21541407371948301]
[null,"EL01R","MAJOR METROPOLITAN AREAS","Urban",1076,0,7.1316799999999976,4.29,2.6502942159385157,1.8198581522003816,3,113.69981412639405,113.69981412639405,0.16356877323420074,0.16356877323420074,4,78.073420074349443,78.073420074349443,0.77230483271375461,0.77230483271375461]
[null,"EL01Y","MAJOR METROPOLITAN AREAS","Urban",57.5,0,3.95662,2.04,1.5337526298497389E-2,0,1,12.31304347826087,12.31304347826087,1.0260869565217392,1.0260869565217392,null,0,0,0,0]
[null,"EL01Z","MAJOR METROPOLITAN AREAS","Urban",773,0,5.7964651410000014,2.71,2.9461914923667302E-3,0.84287072488974069,1,0.17593790426908151,0.17593790426908151,1.29366106080207E-3,1.29366106080207E-3,1,50.333764553686933,50.333764553686933,0.17723156532988357,0.17723156532988357]
[null,"EL02","MAJOR METROPOLITAN AREAS","Urban",1499,14.152071530999995,6.462089999999999,2.08,4.1673155830958528,6.1141488840522706,10,128.33132977323424,128.33132977323424,1.1372025794974427,1.1372025794974427,18,188.28352234823217,188.28352234823217,0.55170113408939292,0.55170113408939292]
[null,"EL03","MAJOR METROPOLITAN AREAS","Urban",1477.5,8.283916354000004,4.8615199999999987,4.1900000000000004,16.24621674461649,0,19,507.57788375105753,507.57788375105753,3.0824590892759476,3.0824590892759476,null,0,0,0,0]
[null,"EL04","MAJOR METROPOLITAN AREAS","Urban",65,3.0873640640000013,1.0235500000000004,4.3099999999999996,5.4612858472474463E-2,4.2243186839081792E-2,2,38.784615384615385,38.784615384615385,0.9538461538461539,0.9538461538461539,3,30,30,0.1076923076923077,0.1076923076923077]
[null,"EL06H04","MAJOR METROPOLITAN AREAS","Urban",3,null,0.64788999999999997,2.5099999999999998,7.5821104582967317E-3,0,1,116.66666666666667,116.66666666666667,1.6666666666666667,1.6666666666666667,null,0,0,0,0]
[null,"EL06H10","MAJOR METROPOLITAN AREAS","Urban",1,null,1.3064970139999998,0.04,1.5164220916593463E-3,0,1,70,70,1,1,null,0,0,0,0]
[null,"EL07","MAJOR METROPOLITAN AREAS","Urban",1130,2.7569312259999994,7.07409,0,0.25439782237925662,0,8,10.392328907114212,10.392328907114212,0.13274334764058612,0.13274334764058612,null,0,0,0,0]
[null,"EL08D","MAJOR METROPOLITAN AREAS","Urban",206.5,0,2.9977900000000002,5.6,1.7330538190392529E-3,0.29056813593466874,1,0.38740920096852299,0.38740920096852299,4.8426150121065378E-3,4.8426150121065378E-3,2,64.953995157384995,64.953995157384995,0.44067796610169491,0.44067796610169491]
[null,"EL08G","MAJOR METROPOLITAN AREAS","Urban",626,0,3.8192399999999989,0.44,0.86084363750259674,1.7580964467243703,12,63.478678645417332,63.478678645417332,0.3285410904401922,0.3285410904401922,3,129.64217252396165,129.64217252396165,0.402555910543131,0.402555910543131]
[null,"EL09","MAJOR METROPOLITAN AREAS","Urban",2482,10.587102700999999,25.168244712999996,0.99,1.0277513082756387,1.1086778543848861,17,19.114555291261144,19.114555291261144,0.42908942574555597,0.42908942574555597,4,20.619661563255438,20.619661563255438,0.22401289282836423,0.22401289282836423]
[null,"EL10","MAJOR METROPOLITAN AREAS","Urban",2259.5,5.423866332000002,21.865806565999993,6.74,5.7172867020984297,1.5352257255959223,18,116.80342098336537,116.80342098336537,1.4349782352401081,1.4349782352401081,5,31.36446116397433,31.36446116397433,0.40495684886036731,0.40495684886036731]
[null,"EL11","MAJOR METROPOLITAN AREAS","Urban",2126.5,61.785625409999987,23.195448350999996,4.84,1.6480980464278541,0.48867785062359337,13,35.776314102843763,35.776314102843763,1.1273610701203318,1.1273610701203318,11,10.608041382553491,10.608041382553491,6.0192805078767932E-2,6.0192805078767932E-2]
[null,"EL12","MAJOR METROPOLITAN AREAS","Urban",338,60.355377898000008,3.8102532930000002,7.91,0.67494504101939912,5.5357205087751824,8,92.17850237061991,92.17850237061991,3.0069033634027784,3.0069033634027784,18,756.0236686390532,756.0236686390532,2.9230769230769229,2.9230769230769229]
[null,"EL13","MAJOR METROPOLITAN AREAS","Urban",2484,6.4115450329999968,24.49421000000002,0.97,0.1449626850682629,2.0282795371125899,7,2.6939068239860107,2.6939068239860107,3.4755762072577016E-2,3.4755762072577016E-2,8,37.692431561996777,37.692431561996777,0.13486312399355876,0.13486312399355876]
[null,"EL14","MAJOR METROPOLITAN AREAS","Urban",1693,3.1552135019999978,10.150570000000005,8.76,3.8373277489279176,1.3515436839504995,12,104.62846970262432,104.62846970262432,0.9688915065668493,0.9688915065668493,3,36.851151801535735,36.851151801535735,0.12344949793266391,0.12344949793266391]
[null,"EL15","MAJOR METROPOLITAN AREAS","Urban",414.5,38.621623792000008,5.0788499999999992,5.91,0.47360028239795182,0.55884486712194514,10,52.743063932448734,52.743063932448734,1.4644149577804584,1.4644149577804584,8,62.236429433051867,62.236429433051867,0.28468033775633295,0.28468033775633295]
[null,"EL16","MAJOR METROPOLITAN AREAS","Urban",278.5,24.908555584999995,1.4036099999999998,3.92,0.92659165070809835,1.0498406772285036,16,153.58228344463575,153.58228344463575,2.9275882618645577,2.9275882618645577,12,174.01077199281866,174.01077199281866,1.3429084380610412,1.3429084380610412]
[null,"EL17","MAJOR METROPOLITAN AREAS","Urban",1014,33.714198855000006,10.053009999999997,5.87,3.7100638587977959,0.25415234256210645,5,168.89677895690798,168.89677895690798,1.9312952010354112,1.9312952010354112,3,11.570019723865878,11.570019723865878,3.5502958579881658E-2,3.5502958579881658E-2]
[null,"EL18","MAJOR METROPOLITAN AREAS","Urban",2620.5,5.0917964700000011,31.282654336000004,4.42,5.941255078630495,0.95525926505443626,11,104.65788929645761,104.65788929645761,0.91890859867729913,0.91890859867729913,6,16.827323029956116,16.827323029956116,0.25071551230681166,0.25071551230681166]
[null,"EL19","MAJOR METROPOLITAN AREAS","Urban",431,50.897416621000026,2.3594200000000001,7.56,2.1172935191818536,3.4124479592065029,13,226.76798200496665,226.76798200496665,1.8631090509365993,1.8631090509365993,30,365.48259860788863,365.48259860788863,1.3178654292343388,1.3178654292343388]
[null,"EL20","MAJOR METROPOLITAN AREAS","Urban",744.5,34.884247166000023,6.5884300000000007,6.25,0.93080905486796872,1.2116862407540316,9,57.713024521130215,57.713024521130215,0.46384613989502749,0.46384613989502749,7,75.12827400940229,75.12827400940229,0.30490261920752182,0.30490261920752182]
[null,"EL22","MAJOR METROPOLITAN AREAS","Urban",10,1.2998451040000001,2.7743099999999998,3.79,0,8.5786164042443033E-2,null,0,0,0,0,1,396,396,1,1]
[null,"EL23","MAJOR METROPOLITAN AREAS","Urban",618.5,18.486391552000001,7.2621600000000015,2.29,3.3163717686108414,1.6967246783576426,7,247.51495408202337,247.51495408202337,1.0644031529862166,1.0644031529862166,14,126.63379143088116,126.63379143088116,0.57396928051738072,0.57396928051738072]
[null,"EL25","MAJOR METROPOLITAN AREAS","Urban",2499.5,2.856392547,30.108546708000009,3.07,5.402068855860831E-2,0.87150943924936441,4,0.99766540222106814,0.99766540222106814,9.0684724774544902E-3,9.0684724774544902E-3,5,16.095219043808761,16.095219043808761,7.2814562912582523E-2,7.2814562912582523E-2]
[null,"EL260A","MAJOR METROPOLITAN AREAS","Urban",2442.5,14.084636608,18.560280000000006,6.23,4.4929420258592638E-2,10.906454293977827,3,0.84912998976458542,0.84912998976458542,2.0470829068577278E-3,2.0470829068577278E-3,11,206.12323439099285,206.12323439099285,0.78648925281473903,0.78648925281473903]
[null,"EL260B","MAJOR METROPOLITAN AREAS","Urban",2323.5,2.9285553350000004,26.105319999999992,6.8,1.7611293609850911,0.98957373067141341,9,34.988596184576409,34.988596184576409,7.1013544546583873E-2,7.1013544546583859E-2,2,19.659995696148052,19.659995696148052,6.3697008822896486E-2,6.3697008822896486E-2]
[null,"EL260C","MAJOR METROPOLITAN AREAS","Urban",1873.5,8.5304649179999998,9.5774100000000022,5.91,5.2870200757039294,0.46153389518289112,13,130.2672362825156,130.2672362825156,1.1280135243041438,1.1280135243041438,3,11.37176407792901,11.37176407792901,5.6044835868694957E-2,5.6044835868694957E-2]
[null,"G01","UPPER NORTH/EYRE PENINSULA","Rural Long",240,3.7937799999999995,0,5.24,0.81576336841671193,0,4,192.98611996968586,192.98611996968586,0.97777775724728899,0.97777775724728899,null,0,0,0,0]
[null,"G02","UPPER NORTH/EYRE PENINSULA","Rural Long",970.5,18.793512818,0.61555000000000004,0.85,2.8753498996283948,3.7867387439820166E-3,6,168.21637827633953,168.21637827633953,2.0144255361502958,2.0144255361502958,1,0.22153529108706851,0.22153529108706851,4.4307058217413701E-2,4.4307058217413701E-2]
[null,"G03","UPPER NORTH/EYRE PENINSULA","Rural Long",238,4.5752000000000006,0.13564999999999999,2.5,0.56924370328138962,0.44193883053021749,4,135.79831932773109,135.19327731092437,0.95798319327731096,0.95378151260504207,3,105.42857142857143,105.42857142857143,1.1932773109243697,1.1932773109243697]
[null,"G04","UPPER NORTH/EYRE PENINSULA","Rural Long",85,33.920790000000011,0.96608000000000005,0.56999999999999995,0.63773964270160399,5.4300072314867706E-2,3,425.98823529411766,425.98823529411766,2.7294117647058824,2.7294117647058824,3,36.27058823529412,36.27058823529412,1.0470588235294118,1.0470588235294118]
[null,"G05","UPPER NORTH/EYRE PENINSULA","Rural Long",575.5,40.300145850000014,0.50559999999999994,0.53,1.844124155580898,0.18366563545229986,4,181.93570807993049,181.93570807993049,1.8766290182450043,1.8766290182450043,1,18.11989574283232,18.11989574283232,0.11468288444830582,0.11468288444830582]
[null,"G06","UPPER NORTH/EYRE PENINSULA","Rural Long",71.5,57.090499999999999,0,2.4300000000000002,0.15534435219498322,0.20638606791619196,1,123.35664335664336,123.35664335664336,0.88111888111888115,0.88111888111888115,2,163.88811188811189,163.88811188811189,1.7622377622377623,1.7622377622377623]
[null,"G07","UPPER NORTH/EYRE PENINSULA","Rural Long",93,67.015460000000019,0,7.0000000000000007E-2,0.96153222441958253,2.3072687230774151E-3,5,587.02150537634407,587.02150537634407,2.89247311827957,2.89247311827957,2,1.4086021505376345,1.4086021505376345,0.93548387096774188,0.93548387096774188]
[null,"G08","UPPER NORTH/EYRE PENINSULA","Rural Long",85,52.959459999999979,0,0.1,0.27856306965032362,0.2536234321550746,4,186.07058823529411,186.07058823529411,0.96470588235294119,0.96470588235294119,3,169.41176470588235,169.41176470588235,1.9058823529411764,1.9058823529411764]
[null,"G09","UPPER NORTH/EYRE PENINSULA","Rural Long",64.5,74.623159999999956,2.581E-2,0.06,0.43307962314313403,0.13841851064630079,4,381.22480620155039,381.22480620155039,1.875968992248062,1.875968992248062,5,121.84496124031008,121.84496124031008,0.77519379844961245,0.77519379844961245]
[null,"G10","UPPER NORTH/EYRE PENINSULA","Rural Long",78.5,108.95072000000002,0,7.0000000000000007E-2,0.25749823459077714,0.12161595826602709,2,186.2420382165605,186.2420382165605,1.7324840764331211,1.7324840764331211,4,87.961783439490446,87.961783439490446,2.4203821656050954,2.4203821656050954]
[null,"G11","UPPER NORTH/EYRE PENINSULA","Rural Long",124.5,114.86258999999998,0,0.09,0.29587639144257627,0.1758455796275184,4,134.93172690763052,134.93172690763052,1.1084337349397591,1.1084337349397591,1,80.192771084337352,80.192771084337352,0.41767068273092367,0.41767068273092367]
[null,"G12","UPPER NORTH/EYRE PENINSULA","Rural Long",71,108.84782999999993,0,0.09,1.6910870721089921,1.2659331812207044,5,1352.3239436619717,1352.3239436619717,4.3098591549295771,4.3098591549295771,5,1012.3380281690141,1012.3380281690141,4.788732394366197,4.788732394366197]
[null,"G13","UPPER NORTH/EYRE PENINSULA","Rural Long",115.5,106.97405999999997,0,0.09,1.4845777150243917,0.80255964812571412,3,729.7835497835498,729.7835497835498,2.0086580086580086,2.0086580086580086,3,394.51948051948051,394.51948051948051,1.3852813852813852,1.3852813852813852]
[null,"G14","UPPER NORTH/EYRE PENINSULA","Rural Long",109,125.72386999999996,0.19522,0.1,2.1988799313078089,4.1266645940231932E-2,3,1145.3761467889908,1145.3761467889908,1.8256880733944953,1.8256880733944953,2,21.495412844036696,21.495412844036696,1.128440366972477,1.128440366972477]
[null,"G15","UPPER NORTH/EYRE PENINSULA","Rural Long",102.5,107.34377000000003,0.29674,0.11,2.4592314370353039,1.8387698831242909E-2,4,1362.2243944121569,1362.2243944121569,2.5756097747058404,2.5756097747058404,3,10.185365853658537,10.185365853658537,9.7560975609756101E-2,9.7560975609756101E-2]
[null,"G16","UPPER NORTH/EYRE PENINSULA","Rural Long",62.5,47.845300000000023,0.28060000000000002,0.08,0.5983047215491587,0.42682710103097765,3,543.52,541.21600000000001,1.728,1.712,4,387.74400000000003,387.74400000000003,2.464,2.464]
[null,"G17","UPPER NORTH/EYRE PENINSULA","Rural Long",405.5,28.993489999999998,1.5059999999999999E-2,0.05,1.3327558234235335,1.5780661301548871,7,186.60911234562846,170.62884107559148,1.2009864082759758,1.0900123022340522,5,220.95684340320591,220.95684340320591,2.1553637484586932,2.1553637484586932]
[null,"G18","UPPER NORTH/EYRE PENINSULA","Rural Long",86.5,104.62621999999998,0,1.49,6.6523312725674785E-2,0.40828088755463782,7,43.664739884393065,43.664739884393065,1.0404624277456647,1.0404624277456647,6,267.98843930635837,267.98843930635837,2.2658959537572256,2.2658959537572256]
[null,"G19","UPPER NORTH/EYRE PENINSULA","Rural Long",27.5,4.6035300000000001,5.2069999999999998E-2,0.09,0.21735880390456777,6.3229730655327623E-3,3,448.76363636363635,448.76363636363635,2.8727272727272726,2.8727272727272726,2,13.054545454545455,13.054545454545455,1.0545454545454545,1.0545454545454545]
[null,"G20","UPPER NORTH/EYRE PENINSULA","Rural Long",116,125.43864999999995,0.30514999999999998,0.1,0.79877290938173218,0.13822477052451565,2,390.9655172413793,390.9655172413793,1.646551724137931,1.646551724137931,9,67.65517241379311,67.65517241379311,2.9310344827586206,2.9310344827586206]
[null,"G21","UPPER NORTH/EYRE PENINSULA","Rural Long",71,45.267060000000001,0,0.11,0.54046448882712639,0.18861481492699264,4,432.19718309859155,432.19718309859155,3.7746478873239435,3.7746478873239435,2,150.83098591549296,150.83098591549296,0.95774647887323938,0.95774647887323938]
[null,"G22","UPPER NORTH/EYRE PENINSULA","Rural Long",96,7.0524199999999997,0,7.0000000000000007E-2,0.16119178132522521,0.20881662580767812,1,95.333333333333329,95.333333333333329,0.91666666666666663,0.91666666666666663,2,123.5,123.5,0.79166666666666663,0.79166666666666663]
[null,"G23","UPPER NORTH/EYRE PENINSULA","Rural Long",115,116.49797999999997,0.27648,0.19,0.89208519712878676,1.9655815992018284E-2,2,440.43478260869563,440.43478260869563,1.8956521739130434,1.8956521739130434,3,9.7043478260869573,9.7043478260869573,1.2086956521739129,1.2086956521739129]
[null,"G24","UPPER NORTH/EYRE PENINSULA","Rural Long",48.5,7.3460499999999991,0.13427,0.13,0.14428359443974012,1.6027591893133186E-2,2,168.90726557466172,168.90726557466172,1.7182132681620481,1.7182132681620481,1,18.762886597938145,18.762886597938145,0.53608247422680411,0.53608247422680411]
[null,"G25","UPPER NORTH/EYRE PENINSULA","Rural Long",32,100.33015000000003,2.7899999999999999E-3,0.11,7.925732254846081E-2,0.10483101862409749,2,140.625,140.625,1.03125,1.03125,2,186,186,2,2]
[null,"G26","UPPER NORTH/EYRE PENINSULA","Rural Long",35,1.9107299999999998,0,0.14000000000000001,6.0446917996959448E-2,0,1,98.057142857142864,98.057142857142864,0.94285714285714284,0.94285714285714284,null,0,0,0,0]
[null,"G28","UPPER NORTH/EYRE PENINSULA","Rural Long",111.5,101.24503999999995,0.33121,0.1,3.5331329245652863,0.35553073621405112,6,1799.1121076233185,1799.1121076233185,4.6367713004484301,4.6367713004484301,2,181.04035874439461,181.04035874439461,1.8295964125560538,1.8295964125560538]
[null,"G29","UPPER NORTH/EYRE PENINSULA","Rural Long",80,189.50975999999994,0,0.1,0.36521774230330745,1.2797063426057924,2,259.2,259.2,1.2375,1.2375,9,908.22500000000002,908.22500000000002,6.3375000000000004,6.3375000000000004]
[null,"G30","UPPER NORTH/EYRE PENINSULA","Rural Long",17.5,11.181529999999999,0.26017000000000001,0.14000000000000001,3.452096715444071E-2,1.5428758789433707E-2,2,112,112,1.6,1.6,2,50.057142857142857,50.057142857142857,0.22857142857142856,0.22857142857142856]
[null,"G31","UPPER NORTH/EYRE PENINSULA","Rural Long",120,149.64621000000017,0.17335000000000003,0.21,2.3843949013299999,9.5108787058152972E-3,4,1128.1583319346109,1128.1583319346109,2.6833333248893418,2.6833333248893418,1,4.5,4.5,0.9,0.9]
[null,"G32","UPPER NORTH/EYRE PENINSULA","Rural Long",104,111.29391852000002,6.6179999999999989E-2,0.14000000000000001,0.59679002605156584,2.2406045084449873,4,325.80769230769232,325.80769230769232,1.6153846153846154,1.6153846153846154,4,1223.2211538461538,1223.2211538461538,3.8076923076923075,3.8076923076923075]
[null,"G33","UPPER NORTH/EYRE PENINSULA","Rural Long",8,2.1788000000000003,0,0.1,6.2278642784746097E-2,1.4090190675281923E-4,3,442,442,3,3,1,1,1,1,1]
[null,"G34","UPPER NORTH/EYRE PENINSULA","Rural Long",80,26.938144642000005,0.19332999999999997,0.05,0.37128238732315433,2.5221441308754641E-2,3,263.50416107177733,263.50416107177733,1.0083332866430283,1.0083332866430283,2,17.899999999999999,17.899999999999999,7.4999999999999997E-2,7.4999999999999997E-2]
[null,"G35","UPPER NORTH/EYRE PENINSULA","Rural Long",157,3.5413600000000001,0,0.67,1.6863844709711171,2.694748966647668E-3,2,609.85987261146499,609.85987261146499,1.9426751592356688,1.9426751592356688,1,0.97452229299363058,0.97452229299363058,0.97452229299363058,0.97452229299363058]
[null,"G36","UPPER NORTH/EYRE PENINSULA","Rural Long",74,121.89525999999999,0,0.32,0.23671520334473628,1.1605385549695957,2,181.62162162162161,181.62162162162161,1,1,3,890.43243243243239,890.43243243243239,2.7567567567567566,2.7567567567567566]
[null,"G37","UPPER NORTH/EYRE PENINSULA","Rural Long",6,1.9447999999999996,0,0.06,0.22306538272787632,1.0567643006461442E-4,2,2110.8338216145835,2110.8338216145835,1.8333334922790534,1.8333334922790534,1,1,1,1,1]
[null,"G38","UPPER NORTH/EYRE PENINSULA","Rural Long",79.5,65.685590000000005,1.0063700000000002,0.03,1.5499033615426674,0.72134731162105814,5,1106.9056603773586,1106.9056603773586,3.5471698113207548,3.5471698113207548,8,515.16981132075466,515.16981132075466,3.1698113207547172,3.1698113207547172]
[null,"G40","UPPER NORTH/EYRE PENINSULA","Rural Long",461,19.437949999999997,0.18265000000000001,0.08,4.6472971394748601,2.9589400418092035E-2,4,572.36442516268983,572.36442516268983,2.9197396963123645,2.9197396963123645,1,3.6442516268980478,3.6442516268980478,1.735357917570499E-2,1.735357917570499E-2]
[null,"G41","UPPER NORTH/EYRE PENINSULA","Rural Long",683,11.358470000000006,0.24931,1.1200000000000001,7.0732757189915257E-2,5.3260920752565673E-2,5,5.8799414348462662,5.8799414348462662,0.9282576866764275,0.9282576866764275,1,4.4275256222547581,4.4275256222547581,6.149341142020498E-2,6.149341142020498E-2]
[null,"G42","UPPER NORTH/EYRE PENINSULA","Rural Long",52,116.51806000000001,0,1.31,1.7304339295697171,0.16425639779709902,5,1889.4038461538462,1889.4038461538462,2.7115384615384617,2.7115384615384617,4,179.34615384615384,179.34615384615384,0.80769230769230771,0.80769230769230771]
[null,"G43","UPPER NORTH/EYRE PENINSULA","Rural Long",52.5,2.3297400000000001,0,0.08,4.2270572025845769E-3,0,1,4.5714285714285712,4.5714285714285712,0.91428571428571426,0.91428571428571426,null,0,0,0,0]
[null,"GA01","MAJOR METROPOLITAN AREAS","Urban",1900,10.102760784000006,8.2894832780000023,0.1,0.10575241645654725,0.92818029913194788,10,2.5692989309210525,2.5692989309210525,3.6491237439607319E-2,3.6491237439607319E-2,3,22.550526315789472,22.550526315789472,9.0526315789473691E-2,9.0526315789473691E-2]
[null,"GA02","MAJOR METROPOLITAN AREAS","Rural Short",1652.5,33.011867345000006,10.24606,9.0299999999999994,7.6808979057111637,13.79970230093074,16,239.09329298022294,239.09329298022294,3.409380022588548,3.409380022588548,10,429.56127080181545,429.56127080181545,1.0711043872919819,1.0711043872919819]
[null,"GA03","BAROSSA/MID NORTH & YORKE PENINSULA/RIVE","Rural Long",276,66.307240000000021,4.8986099999999997,6.02,0.54352911148022853,7.7513661452394675E-2,8,111.81159547446431,111.81159547446431,1.9963768254155698,1.9963768254155698,2,15.945652173913043,15.945652173913043,0.15942028985507245,0.15942028985507245]
[null,"GA04","BAROSSA/MID NORTH & YORKE PENINSULA/RIVE","Rural Long",30,18.515790000000013,0,2.04,3.6986750522615048E-4,0,1,0.7,0.7,0.7,0.7,null,0,0,0,0]
[null,"GA05","BAROSSA/MID NORTH & YORKE PENINSULA/RIVE","Rural Short",446.5,30.525400000000005,14.623419999999999,0.04,1.7369914779011928,0.24226511245220664,5,200.11198208286675,200.11198208286675,1.9148936170212767,1.9148936170212767,8,27.910414333706608,27.910414333706608,0.22172452407614782,0.22172452407614782]
[null,"GA07","BAROSSA/MID NORTH & YORKE PENINSULA/RIVE","Rural Long",52,24.858099999999983,0.52878999999999998,1.92,0.42282900942686641,5.0742299169359024E-2,4,461.67307692307691,461.67307692307691,3.0192307692307692,3.0192307692307692,2,55.403846153846153,55.403846153846153,0.76923076923076927,0.76923076923076927]
[null,"GA08","BAROSSA/MID NORTH & YORKE PENINSULA/RIVE","Rural Long",895.5,23.021900733999995,9.1888599719999977,0.1,0.4861526904533075,1.2328916840871683E-3,4,30.823377139604279,30.823377139604279,1.0616043203706385,1.0616043203706385,1,7.8168620882188719E-2,7.8168620882188719E-2,1.1166945840312675E-3,1.1166945840312675E-3]
[null,"GA09","BAROSSA/MID NORTH & YORKE PENINSULA/RIVE","Rural Long",835.5,15.56812,7.8445500000000008,2.67,2.8510091952114953,0.24041387839699782,5,193.74267001012211,193.74267001012211,1.170556563235271,1.170556563235271,1,16.337522441651707,16.337522441651707,4.66786355475763E-2,4.66786355475763E-2]
[null,"GA10","BAROSSA/MID NORTH & YORKE PENINSULA/RIVE","Rural Long",81,21.007940000000001,1.3206300000000002,3.18,3.0012106138350498E-2,0.58391511432202703,2,21.037037037037038,21.037037037037038,0.22222222222222221,0.22222222222222221,2,409.2962962962963,409.2962962962963,1.1481481481481481,1.1481481481481481]
[null,"GA11","MAJOR METROPOLITAN AREAS","Rural Short",46.5,31.774209976000002,0.54125000000000001,0.43,0.59773113565783964,7.7294662743538231E-2,5,661.22580645161293,661.22580645161293,3.78494623655914,3.78494623655914,2,85.505376344086017,85.505376344086017,1.2043010752688172,1.2043010752688172]
[null,"GA13","BAROSSA/MID NORTH & YORKE PENINSULA/RIVE","Rural Long",41.5,16.858730000000005,6.6710000000000005E-2,7.0000000000000007E-2,6.5167131873178894E-4,8.5950163119219731E-3,1,0.89156626506024095,0.89156626506024095,0.89156626506024095,0.89156626506024095,1,11.759036144578314,11.759036144578314,4.8192771084337352E-2,4.8192771084337352E-2]
[null,"GA15","MAJOR METROPOLITAN AREAS","Rural Short",513,39.151880000000013,3.81616,0.41,0.71632349605053769,0.53254778450615858,8,71.827160930075834,71.827160930075834,1.7069525690803751,1.7069525690803751,11,53.399610136452239,53.399610136452239,0.21442495126705652,0.21442495126705652]
[null,"GA16","BAROSSA/MID NORTH & YORKE PENINSULA/RIVE","Rural Long",39.5,25.429189234000027,8.7040000000000006E-2,5.1100000000000003,0.29217771639031481,0.38661721939139188,3,419.97468354430379,419.97468354430379,2.6835443037974684,2.6835443037974684,3,555.72151898734182,555.72151898734182,1.8227848101265822,1.8227848101265822]
[null,"GA17","BAROSSA/MID NORTH & YORKE PENINSULA/RIVE","Rural Long",118,2.2286699999999997,0,0.06,1.6828266978256081,0,3,809.71186440677968,809.71186440677968,2.8813559322033897,2.8813559322033897,null,0,0,0,0]
[null,"GA18","BAROSSA/MID NORTH & YORKE PENINSULA/RIVE","Rural Long",62.5,44.422449999999998,0,0.44,5.6184586942856036E-3,0,2,5.1039956054687519,5.1039956054687519,0.92799998378753668,0.92799998378753668,null,0,0,0,0]
[null,"GA19","BAROSSA/MID NORTH & YORKE PENINSULA/RIVE","Rural Long",65,13.787419999999999,0,7.0000000000000007E-2,0.34816861158621626,0,2,304.12307692307695,0.92307692307692313,0.9538461538461539,0.92307692307692313,null,0,0,0,0]
[null,"GA20","BAROSSA/MID NORTH & YORKE PENINSULA/RIVE","Rural Long",63,40.542929999999984,0.6694500000000001,0.14000000000000001,0.50317832175266153,0.47036579021759878,4,453.47619047619048,453.47619047619048,1.9841269841269842,1.9841269841269842,4,423.90476190476193,423.90476190476193,1.6190476190476191,1.6190476190476191]
[null,"GA21","BAROSSA/MID NORTH & YORKE PENINSULA/RIVE","Rural Long",46,48.798089999999974,0,0.1,0.1450409002636833,0.48364579492905202,3,179.02173913043478,179.02173913043478,1.9347826086956521,1.9347826086956521,3,596.95652173913038,596.95652173913038,1.4130434782608696,1.4130434782608696]
[null,"GA22","MAJOR METROPOLITAN AREAS","Rural Short",1001,61.031920000000014,5.6357700000000008,0.08,4.5121796211234635,5.0295963644386861,20,231.87246096646274,231.87246096646274,2.3156843154461351,2.3156843154461351,32,258.46153846153845,258.46153846153845,0.90209790209790208,0.90209790209790208]
[null,"GA23","BAROSSA/MID NORTH & YORKE PENINSULA/RIVE","Rural Short",92.5,17.829190000000004,0.72006000000000003,3.05,0.16640903246596764,0.1021782563833091,2,92.540540540540547,92.540540540540547,0.97297297297297303,0.97297297297297303,1,56.821621621621624,56.821621621621624,0.19459459459459461,0.19459459459459461]
[null,"GA24","BAROSSA/MID NORTH & YORKE PENINSULA/RIVE","Rural Long",103,3.0340199999999999,0,0.51,0.83123318614991293,0,3,458.20388349514565,458.20388349514565,2.9320388349514563,2.9320388349514563,null,0,0,0,0]
[null,"GA25","MAJOR METROPOLITAN AREAS","Rural Short",2461.5,31.203350000000004,12.495262272000005,0.15,7.9581683693000569,3.4366964459577911,24,166.30685555603165,166.30685555603165,1.6346401110572977,1.6346401110572977,10,71.818809668901082,71.818809668901082,0.36766199471866751,0.36766199471866751]
[null,"GA26","MAJOR METROPOLITAN AREAS","Urban",1778,9.4730600000000056,6.3945800000000013,6.86,5.40197926520786,0.42154367830856027,7,140.24878046402648,140.24878046402648,1.0193100862392201,1.0193100862392201,3,10.944319460067492,10.944319460067492,0.13160854893138357,0.13160854893138357]
[null,"GA27","BAROSSA/MID NORTH & YORKE PENINSULA/RIVE","Rural Long",425.5,26.278090000000006,0.60641,7.03,2.9493586799001248,5.5797155074116415E-2,4,393.55111203042378,393.55111203042378,1.9537798481458222,1.9537798481458222,1,7.4453584018801413,7.4453584018801413,5.170387779083431E-2,5.170387779083431E-2]
[null,"GA28","BAROSSA/MID NORTH & YORKE PENINSULA/RIVE","Rural Long",267,77.445719999999923,0.76637999999999984,1.39,2.0895048261909328,3.0311522690200238E-2,3,444.32958801498125,444.32958801498125,2.7790262172284645,2.7790262172284645,3,6.4456928838951315,6.4456928838951315,2.6217228464419477E-2,2.6217228464419477E-2]
[null,"GA29","BAROSSA/MID NORTH & YORKE PENINSULA/RIVE","Rural Long",48,23.44949999999999,0.44936000000000004,3.49,0.17086117467613743,7.0539017068130122E-2,3,202.10416666666666,202.10416666666666,2.1041666666666665,2.1041666666666665,2,83.4375,83.4375,0.27083333333333331,0.27083333333333331]
[null,"GA30","BAROSSA/MID NORTH & YORKE PENINSULA/RIVE","Rural Long",216.5,11.019970000000001,1.1439599999999999,0.15,5.4599488866717448E-3,4.561699231122522E-3,2,1.4318706697459584,1.4318706697459584,0.99307159353348728,0.99307159353348728,1,1.1963048498845266,1.1963048498845266,4.6189376443418013E-3,4.6189376443418013E-3]
[null,"GA31","BAROSSA/MID NORTH & YORKE PENINSULA/RIVE","Rural Long",132,12.382490000000001,0.49663999999999997,0.86,1.0219439169398539,3.2231311169707397E-3,2,439.56818181818181,439.56818181818181,1.8863636363636365,1.8863636363636365,1,1.3863636363636365,1.3863636363636365,7.575757575757576E-3,7.575757575757576E-3]
[null,"GA33","MAJOR METROPOLITAN AREAS","Rural Short",36,16.216010000000008,5.246E-2,0.39,0.15676663993055642,0.11703065133704733,2,224,224,2,2,1,167.22222222222223,167.22222222222223,0.77777777777777779,0.77777777777777779]
[null,"GA34","MAJOR METROPOLITAN AREAS","Rural Short",48,19.260229999999996,0,0.12,1.8682135537359219E-2,5.579368261417373E-2,2,20.020833333333332,20.020833333333332,1.6875,1.6875,2,59.791666666666664,59.791666666666664,0.41666666666666669,0.41666666666666669]
[null,"GA36","BAROSSA/MID NORTH & YORKE PENINSULA/RIVE","Rural Long",105.5,30.354400000000002,1.0345700000000002,0.09,0.7960605476767405,0,3,428.41706161137444,428.41706161137444,2.7393364928909953,2.7393364928909953,null,0,0,0,0]
[null,"GA37","BAROSSA/MID NORTH & YORKE PENINSULA/RIVE","Rural Long",25,31.727059999999994,0,0.11,6.8971483355505014E-2,0.18739953598124956,3,156.63999999999999,156.63999999999999,1.8,1.8,2,425.6,425.6,0.92,0.92]
[null,"GA38","BAROSSA/MID NORTH & YORKE PENINSULA/RIVE","Rural Long",30.5,24.005790000000008,0,0.05,6.7809042624794258E-2,6.1186653007411745E-2,2,126.22950819672131,126.22950819672131,0.85245901639344257,0.85245901639344257,2,113.90163934426229,113.90163934426229,0.39344262295081966,0.39344262295081966]
[null,"GA39","BAROSSA/MID NORTH & YORKE PENINSULA/RIVE","Rural Long",38.5,33.888549999999995,0,0.05,0.10488385683912982,1.3051039112979883E-2,3,154.67532467532467,154.67532467532467,2,2,3,19.246753246753247,19.246753246753247,0.1038961038961039,0.1038961038961039]
[null,"GA40","MAJOR METROPOLITAN AREAS","Rural Short",55.5,30.318440000000002,0,0.18,0.14809626277169877,0.55369883909996387,2,137.26126126126127,137.26126126126127,1.7837837837837838,1.7837837837837838,5,513.18918918918916,513.18918918918916,3.3153153153153152,3.3153153153153152]
[null,"GA41","BAROSSA/MID NORTH & YORKE PENINSULA/RIVE","Rural Long",73,43.475319999999996,0,0.08,0.21464644219957599,0.33594537117540924,4,166.94520547945206,166.94520547945206,1.8630136986301369,1.8630136986301369,1,261.28767123287673,261.28767123287673,0.90410958904109584,0.90410958904109584]
[null,"GA42","BAROSSA/MID NORTH & YORKE PENINSULA/RIVE","Rural Long",12,2.3475600000000001,0,0.12,2.1135286012922885E-4,0,1,1,1,1,1,null,0,0,0,0]
[null,"GA43","MAJOR METROPOLITAN AREAS","Rural Short",708,40.437161603000014,0.42455999999999999,0.02,0.24078116403340902,0.66283672557939632,3,17.493879113493666,17.493879113493666,7.9566853026212275E-2,7.9566853026212275E-2,4,48.158192090395481,48.158192090395481,0.26977401129943501,0.26977401129943501]
[null,"GA44","MAJOR METROPOLITAN AREAS","Rural Short",16,5.5326100000000018,0,2.68,2.5252959482861211E-2,0.14290570066090283,2,81.1875,81.1875,1.0625,1.0625,3,459.4375,459.4375,2.6875,2.6875]
[null,"GA45","MAJOR METROPOLITAN AREAS","Rural Short",90.5,19.715910000000004,2.94957,0.05,0.24755287610065793,1.0800451655037109,2,140.707182320442,140.707182320442,1.6353591160220995,1.6353591160220995,4,613.88950276243099,613.88950276243099,2.6298342541436464,2.6298342541436464]
[null,"GA46","BAROSSA/MID NORTH & YORKE PENINSULA/RIVE","Rural Long",91,2.2435600000000004,0,0.09,1.3064424794121399,0,4,815.12087912087907,815.12087912087907,2.8901098901098901,2.8901098901098901,null,0,0,0,0]
[null,"GA47","BAROSSA/MID NORTH & YORKE PENINSULA/RIVE","Rural Long",53,25.816760000000006,0.94983000000000006,0.34,0.16031114440802011,7.0521404329786028E-2,3,171.73584905660377,171.73584905660377,1.9622641509433962,1.9622641509433962,1,75.547169811320757,75.547169811320757,0.98113207547169812,0.98113207547169812]
[null,"GA48","BAROSSA/MID NORTH & YORKE PENINSULA/RIVE","Rural Short",48,26.86937,0.29055999999999993,0.12,1.0300446945337962,0.30249118518346457,2,1103.8541666666667,1103.8541666666667,1.0208333333333333,1.0208333333333333,3,324.16666666666669,324.16666666666669,1.0625,1.0625]
[null,"GA49","BAROSSA/MID NORTH & YORKE PENINSULA/RIVE","Rural Long",66,30.49743999999999,0,0.09,1.091989777334349E-3,0,1,0.93939393939393945,0.93939393939393945,0.93939393939393945,0.93939393939393945,null,0,0,0,0]
[null,"GA50","MAJOR METROPOLITAN AREAS","Urban",1225,5.1637260700000009,4.3735275859999998,0.11,4.7220156108771913,1.3214318738446924,7,177.93823036660953,177.93823036660953,2.0163265133877188,2.0163265133877188,5,49.795102040816325,49.795102040816325,0.2089795918367347,0.2089795918367347]
[null,"GA51","MAJOR METROPOLITAN AREAS","Rural Short",13,3.6060699999999999,0,6.02,3.9172219675108033E-2,6.671913544663563E-2,2,155,155,2,2,1,264,264,1,1]
[null,"GA52","BAROSSA/MID NORTH & YORKE PENINSULA/RIVE","Rural Long",62.5,37.916560000000004,0,0.05,0.39903419992398403,4.9685534868712876E-2,2,362.49599999999998,362.49599999999998,1.8879999999999999,1.8879999999999999,2,45.136000000000003,45.136000000000003,0.16,0.16]
[null,"GA53","MAJOR METROPOLITAN AREAS","Rural Short",1812,56.273339999999976,22.531320000000012,0.13,0.35547897862895045,0.69732383113951624,6,10.091427384491261,10.091427384491261,0.55297984232176212,0.55297984232176212,5,19.79580573951435,19.79580573951435,7.2295805739514343E-2,7.2295805739514343E-2]
[null,"GA745A","MAJOR METROPOLITAN AREAS","Rural Short",1385.5,2.8118666659999993,16.801590000000001,4.42,1.1637356894249715,0,10,43.206062793215445,43.206062793215445,0.26849512811259474,0.26849512811259474,null,0,0,0,0]
[null,"GA745B","MAJOR METROPOLITAN AREAS","Rural Short",453,26.640220000000003,11.439350000000001,4.82,0.54349271324241788,2.6827624392877958E-3,5,61.715235830142817,61.715235830142817,0.35540840115241923,0.35540840115241923,1,0.30463576158940397,0.30463576158940397,6.6225165562913907E-3,6.6225165562913907E-3]
[null,"GA745C","MAJOR METROPOLITAN AREAS","Rural Short",468.5,11.125199727999998,4.3477059279999999,3.7,0,6.4502940388093538E-2,null,0,0,0,0,2,7.0821771611526145,7.0821771611526145,5.9765208110992528E-2,5.9765208110992528E-2]
[null,"GA800A","MAJOR METROPOLITAN AREAS","Rural Short",977.5,52.020244826999999,6.0568400000000002,1.39,1.7067617664671955,2.2321944316401638,14,89.815855029171999,89.815855029171999,1.1028132930131214,1.1028132930131214,10,117.46598465473146,117.46598465473146,0.55856777493606136,0.55856777493606136]
[null,"GU11","EASTERN HILLS/FLEURIEU PENINSULA","Rural Long",59.5,15.790035105999996,0.98707999999999996,3.58,9.3582332714223677E-3,0.10814221343278876,2,8.9299703646106874,8.9299703646106874,5.6022385589214956E-2,5.6022385589214956E-2,2,103.19327731092437,103.19327731092437,0.58823529411764708,0.58823529411764708]
[null,"GU118","BAROSSA/MID NORTH & YORKE PENINSULA/RIVE","Rural Long",201.5,38.924671613000001,2.5320999999999998,0.3,4.5830282572572303,1.6306225413736888,6,1291.3697270471464,1291.3697270471464,3.5583126550868487,3.5583126550868487,6,459.46401985111663,459.46401985111663,1.8064516129032258,1.8064516129032258]
[null,"GU12","EASTERN HILLS/FLEURIEU PENINSULA","Rural Long",121,10.233015076999999,0.60448000000000002,0.44,1.2079168211152311,0.10673319436526056,2,566.7933884297521,566.7933884297521,1,1,1,50.082644628099175,50.082644628099175,0.49586776859504134,0.49586776859504134]
[null,"GU13","EASTERN HILLS/FLEURIEU PENINSULA","Rural Long",436.5,34.907019767999998,5.1866899999999996,0.48,1.3029727699583518,5.6988832950478381,4,169.48224513172966,169.48224513172966,1.0378006872852235,1.0378006872852235,6,741.27376861397477,741.27376861397477,1.8487972508591066,1.8487972508591066]
[null,"GU14","EASTERN HILLS/FLEURIEU PENINSULA","Rural Long",220,8.1182924879999998,0.75729999999999997,1.36,0.92898388395968123,6.9112385262257825E-2,3,239.75,239.75,2.8909090909090911,2.8909090909090911,3,17.836363636363636,17.836363636363636,1.1954545454545455,1.1954545454545455]
[null,"GU15","EASTERN HILLS/FLEURIEU PENINSULA","Rural Long",116.5,17.430149999999994,1.9818099999999998,0.56999999999999995,2.516296701745222,1.3838856899111582,7,1226.3347639484978,1226.3347639484978,5.3218884120171674,5.3218884120171674,6,674.44635193133047,674.44635193133047,2.8326180257510729,2.8326180257510729]
[null,"GU16","EASTERN HILLS/FLEURIEU PENINSULA","Rural Long",23,4.7460299999999984,0,0.4,0.17135433134977227,3.6986750522615044E-3,2,423,423,2,2,2,9.1304347826086953,9.1304347826086953,1.0869565217391304,1.0869565217391304]
[null,"GU17","EASTERN HILLS/FLEURIEU PENINSULA","Rural Long",318.5,23.322215280000002,1.3778300000000001,0.05,2.1262860815079132,3.3512109502090524,5,379.04029067681762,379.04029067681762,1.8817373033221139,1.8817373033221139,11,597.40031397174255,597.40031397174255,1.805337519623234,1.805337519623234]
[null,"GU18","EASTERN HILLS/FLEURIEU PENINSULA","Rural Long",50.5,13.502491092999998,0.99131999999999998,1.1200000000000001,0,0.12335961936209323,null,0,0,0,0,2,138.69306930693068,138.69306930693068,0.79207920792079212,0.79207920792079212]
[null,"GU19","EASTERN HILLS/FLEURIEU PENINSULA","Rural Long",7,0.56245000000000001,0.47317000000000004,0.17,4.4701129917331897E-2,2.1135286012922885E-4,2,362.57142857142856,362.57142857142856,1.7142857142857142,1.7142857142857142,1,1.7142857142857142,1.7142857142857142,0.8571428571428571,0.8571428571428571]
[null,"GU21","EASTERN HILLS/FLEURIEU PENINSULA","Rural Long",223.5,32.140828860000006,2.4180000000000001,0.08,0.68656823088268093,5.1992275209639978,3,174.41317701233052,174.41317701233052,1.6912753854021929,1.6912753854021929,6,1320.7919463087248,1320.7919463087248,4.7740492170022373,4.7740492170022373]
[null,"GU23","EASTERN HILLS/FLEURIEU PENINSULA","Rural Long",63,38.971912567999979,1.7560899999999999,0.97,1.0780933267808523,0.3297809127549734,5,971.60317460317458,971.60317460317458,3.7619047619047619,3.7619047619047619,1,297.20634920634922,297.20634920634922,0.98412698412698407,0.98412698412698407]
[null,"GU24","EASTERN HILLS/FLEURIEU PENINSULA","Rural Long",132.5,0.53606328700000005,0.88005999999999995,0.09,0,0.67551896644970355,null,0,0,0,0,1,289.46415094339625,289.46415094339625,0.95849056603773586,0.95849056603773586]
[null,"GU31","EASTERN HILLS/FLEURIEU PENINSULA","Rural Long",996,96.034991896999927,5.8709999999999978,0.31,0.23180125364671667,6.8353980749160783,11,13.213855666807856,13.213855666807856,0.13119143367292413,0.13119143367292413,6,389.65261044176708,389.65261044176708,1.5170682730923695,1.5170682730923695]
[null,"GU32","EASTERN HILLS/FLEURIEU PENINSULA","Rural Long",832.5,82.943956202999999,3.9709400000000006,2.38,0.27935564287580822,7.4465248699797435,7,19.052252252252252,19.052252252252252,6.966966966966967E-2,6.966966966966967E-2,13,507.85825825825827,507.85825825825827,2.6006006006006004,2.6006006006006004]
[null,"GU33","EASTERN HILLS/FLEURIEU PENINSULA","Rural Long",79,24.214948332999992,0.79159999999999986,2.57,0,1.1023460674806811,null,0,0,0,0,6,792.25316455696202,792.25316455696202,4.037974683544304,4.037974683544304]
[null,"GU34","EASTERN HILLS/FLEURIEU PENINSULA","Rural Long",113,45.085620000000013,6.1079999999999995E-2,0.13,0.95262017881746663,2.16471121892025,2,478.64601769911502,478.64601769911502,1.2654867256637168,1.2654867256637168,5,1087.6637168141592,1087.6637168141592,4.9203539823008846,4.9203539823008846]
[null,"GU35","EASTERN HILLS/FLEURIEU PENINSULA","Rural Long",86,27.149525783999991,0.26788000000000001,0.1,0.21258575181331602,1.9207219546393994,2,140.34883720930233,140.34883720930233,0.79069767441860461,0.79069767441860461,6,1268.0581395348838,1268.0581395348838,4.8255813953488369,4.8255813953488369]
[null,"GU36","EASTERN HILLS/FLEURIEU PENINSULA","Rural Long",60.5,22.124479999999984,0,0.1,0.51788495826998704,0.40123579221699684,4,486.01652892561981,486.01652892561981,1.884297520661157,1.884297520661157,5,376.54545454545456,376.54545454545456,1.4710743801652892,1.4710743801652892]
[null,"GU37","EASTERN HILLS/FLEURIEU PENINSULA","Rural Long",58,28.677740000000018,0,0.08,0,0.28513262105267378,null,0,0,0,0,3,279.12068965517244,279.12068965517244,1.8448275862068966,1.8448275862068966]
[null,"GU41","EASTERN HILLS/FLEURIEU PENINSULA","Rural Long",603,73.158062977999947,0.89127000000000001,0.1,3.2007045282278157,1.0141062483767282,14,301.37095122867163,301.37095122867163,1.0077392071436095,1.0077392071436095,8,95.485903814262016,95.485903814262016,2.2139303482587063,2.2139303482587063]
[null,"GU42","EASTERN HILLS/FLEURIEU PENINSULA","Rural Long",1279.5,27.079787872999994,4.4620300000000004,1.91,0.30981985588149435,2.3604063546615719,5,13.748080743668183,13.748080743668183,5.3927322811053655E-2,5.3927322811053655E-2,13,104.74169597499024,104.74169597499024,2.2383743649863228,2.2383743649863228]
[null,"GU43","EASTERN HILLS/FLEURIEU PENINSULA","Rural Long",541.5,65.085004798000057,2.3786799999999997,4.84,0.32234834362373965,1.5343865390615132,7,33.798707970841988,33.798707970841988,0.52446906916652691,0.52446906916652691,16,160.88273314866112,160.88273314866112,1.9519852262234534,1.9519852262234534]
[null,"GU51","EASTERN HILLS/FLEURIEU PENINSULA","Urban",59,5.5986577469999999,0.21859999999999999,1.91,0.10799091609888345,0.3046491982143627,3,84.491525423728817,84.491525423728817,2.8135593220338984,2.8135593220338984,1,238.35593220338984,238.35593220338984,0.69491525423728817,0.69491525423728817]
[null,"HH102A","MAJOR METROPOLITAN AREAS","Urban",701,3.2503984869999996,0.11356000000000001,0.27,1.8648597574719417,0,6,122.80218566807463,122.80218566807463,1.5786970794285926,1.5786970794285926,null,0,0,0,0]
[null,"HH102B","MAJOR METROPOLITAN AREAS","Urban",2430.5,10.572285131000003,1.4452,3.56,8.6241450100902561,0,19,163.79414078571796,163.79414078571796,2.1365973909377138,2.1365973909377138,null,0,0,0,0]
[null,"HH102C","MAJOR METROPOLITAN AREAS","Urban",1290.5,3.5643967220000015,1.2883600000000002,5.98,2.2734704555451648,0.95521593870896038,5,81.322223248014339,81.322223248014339,1.049722317529713,1.049722317529713,2,34.168151879116621,34.168151879116621,0.87330492057342113,0.87330492057342113]
[null,"HH102D","MAJOR METROPOLITAN AREAS","Urban",1880.5,9.3559668340000073,2.1293475850000001,8.8800000000000008,9.6323347153488577,4.6880405595376073,15,236.4482832129919,236.4482832129919,2.9786404044474102,2.9786404044474102,15,115.07896835947886,115.07896835947886,0.76149960116990167,0.76149960116990167]
[null,"HH107A","MAJOR METROPOLITAN AREAS","Urban",2452.5,11.852322713999994,1.4199500000000003,7.34,7.7070779456783081,5.6664360930762179,22,145.06367397794423,145.06367397794423,3.0905878111735277,3.0905878111735277,8,106.65443425076452,106.65443425076452,0.48236493374108053,0.48236493374108053]
[null,"HH107B","MAJOR METROPOLITAN AREAS","Urban",3498.5,10.003624747999998,8.595539496999999,10.14,2.1874450948518835,5.051093671453593,24,28.862451758063724,28.862451758063724,0.26392255645602208,0.26392255645602208,7,66.647134486208373,66.647134486208373,0.20437330284407604,0.20437330284407604]
[null,"HH107C","MAJOR METROPOLITAN AREAS","Urban",2473,8.4268447130000013,2.3241100000000006,8.7100000000000009,4.8899196662829425,3.3050202855988076,9,91.275778406793364,91.275778406793364,1.0691467852810352,1.0691467852810352,3,61.691872219975735,61.691872219975735,0.22482814395471087,0.22482814395471087]
[null,"HH107D","MAJOR METROPOLITAN AREAS","Urban",1418,6.3967676620000002,0.38546999999999992,5.41,9.1418588954320593E-3,1.1559468972991818,3,0.29760225669957685,0.29760225669957685,2.1156558533145277E-3,2.1156558533145277E-3,3,37.630465444287729,37.630465444287729,0.16361071932299012,0.16361071932299012]
[null,"HH118A","MAJOR METROPOLITAN AREAS","Urban",1125,2.5482799449999991,5.1563213229999993,3.09,0.75855712770742789,0.10619287276163022,9,31.125311631944445,31.125311631944445,0.1694814181857639,0.1694814181857639,1,4.3573333333333331,4.3573333333333331,1.6888888888888887E-2,1.6888888888888887E-2]
[null,"HH118B","MAJOR METROPOLITAN AREAS","Urban",1119.5,4.0851278569999998,4.3730033869999989,6.52,0.53544839727733073,0.48622991210420047,4,22.07859648908553,22.07859648908553,0.17090960728797386,0.17090960728797386,7,20.049129075480124,20.049129075480124,0.11612326931665923,0.11612326931665923]
[null,"HH118C","MAJOR METROPOLITAN AREAS","Urban",1941,4.6771846560000006,3.0646084960000004,6.36,1.1323410811325698,1.0759014740323063,9,26.929585303061405,26.929585303061405,0.1579941440525281,0.1579941440525281,3,25.587326120556416,25.587326120556416,7.1612570839773307E-2,7.1612570839773307E-2]
[null,"HH118D","MAJOR METROPOLITAN AREAS","Urban",1686.5,6.6162913099999994,1.5877800000000002,7.24,2.5003200340513825,1.1054283784741876,6,68.436405746229241,68.436405746229241,1.0133412392528907,1.0133412392528907,3,30.256744737622295,30.256744737622295,0.16898903053661429,0.16898903053661429]
[null,"HH118E","MAJOR METROPOLITAN AREAS","Urban",1128.5,3.3148244720000002,3.8434780169999976,6.27,7.3828050380187929E-2,2.1534926755381756,5,3.0199362400310146,3.0199362400310146,1.7131873026430749E-2,1.7131873026430749E-2,2,88.088613203367302,88.088613203367302,0.11874169251218432,0.11874169251218432]
[null,"HH121A","MAJOR METROPOLITAN AREAS","Urban",2794.5,11.312239948,3.4042396219999991,8.86,8.2247265763977619,6.8630447656046076,33,135.86115191042114,135.86115191042114,1.2653425719704305,1.2653425719704305,13,113.36804437287529,113.36804437287529,0.49847915548398641,0.49847915548398641]
[null,"HH121B","MAJOR METROPOLITAN AREAS","Urban",2700.5,11.262215422000002,1.5248300000000004,7.43,0.73051085299355745,0.76037736310347226,17,12.487066604057699,12.487066604057699,8.603342204949431E-2,8.603342204949431E-2,1,12.997593038326237,12.997593038326237,4.3325310127754119E-2,4.3325310127754119E-2]
[null,"HH121C","MAJOR METROPOLITAN AREAS","Urban",2366,11.170408725000003,8.6401000000000021,7.03,7.8910848319886169,3.4356925435543673,32,153.95716639040691,153.95716639040691,2.9740772477066928,2.9740772477066928,14,67.031276415891796,67.031276415891796,0.34234995773457311,0.34234995773457311]
[null,"HH121D","MAJOR METROPOLITAN AREAS","Urban",2408,11.243714445999997,7.2569607809999992,7.34,5.6058441645504642,3.299149565786812,19,107.46386977287622,107.46386977287622,0.71525468065889175,0.71525468065889175,13,63.244601328903656,63.244601328903656,0.30564784053156147,0.30564784053156147]
[null,"HH121E","MAJOR METROPOLITAN AREAS","Urban",1770,36.943197965999993,5.936367380000001,7.53,0.70309223810049015,1.9328099348562648,20,18.336522446109758,18.336522446109758,1.1263652651660185,1.1263652651660185,10,50.407344632768364,50.407344632768364,0.51807909604519775,0.51807909604519775]
[null,"HH121F","MAJOR METROPOLITAN AREAS","Urban",1836.5,9.4481807359999959,2.1264000000000003,6.48,5.508576791333204,0.55787002434873556,11,138.4606648441754,138.4606648441754,2.6016880890150147,2.6016880890150147,4,14.022325074870677,14.022325074870677,8.8211271440239589E-2,8.8211271440239589E-2]
[null,"HH121G","MAJOR METROPOLITAN AREAS","Urban",2156,9.983564270999997,2.18404,4.6900000000000004,1.832920715799268,0.31838364973024874,18,39.243963259270551,39.243963259270551,0.21026584116227107,0.21026584116227107,2,6.8167903525046381,6.8167903525046381,2.6437847866419294E-2,2.6437847866419294E-2]
[null,"HH130A","MAJOR METROPOLITAN AREAS","Urban",1946.5,12.285206718999998,1.2913767309999999,7.72,6.3056222687674861,2.0777365604734226,16,149.53796991896513,149.53796991896513,2.7913348175032171,2.7913348175032171,6,49.273567942460829,49.273567942460829,0.20806575905471358,0.20806575905471358]
[null,"HH130B","MAJOR METROPOLITAN AREAS","Urban",2552,15.261812525999989,1.443548759,9.7899999999999991,6.9499135527868212,7.8488057778741354,30,125.71198090938938,125.71198090938938,2.0761493642034949,2.0761493642034949,13,141.97139498432603,141.97139498432603,0.59090909090909094,0.59090909090909094]
[null,"HH130C","MAJOR METROPOLITAN AREAS","Urban",1538,7.5619636119999969,3.1361990440000005,6.46,0.94569851914938474,0,13,28.384046576888107,28.384046576888107,0.11985261759615379,0.11985261759615379,null,0,0,0,0]
[null,"HH130D","MAJOR METROPOLITAN AREAS","Urban",1223,4.2379508379999997,7.8571669789999969,6.21,0.23420788025339298,1.1758553530453952,8,8.8400146284750605,8.8400146284750605,3.3251580700753472E-2,3.3251580700753472E-2,4,44.381847914963203,44.381847914963203,0.1643499591169256,0.1643499591169256]
[null,"HH130E","MAJOR METROPOLITAN AREAS","Urban",822.5,4.1561546410000014,3.40205,6.1,4.1724787115461677,0.88626205988393614,5,234.17264437689968,234.17264437689968,1.1610942249240122,1.1610942249240122,2,49.739817629179335,49.739817629179335,0.28936170212765955,0.28936170212765955]
[null,"HH130F","MAJOR METROPOLITAN AREAS","Urban",2644.5,13.743450093000007,1.8565400000000003,2.11,25.795819661636667,4.8505360182452755,30,450.28107895096525,450.28107895096525,3.7587444826208323,3.7587444826208323,11,84.668935526564567,84.668935526564567,0.4688977122329363,0.4688977122329363]
[null,"HH130G","MAJOR METROPOLITAN AREAS","Urban",539.5,2.6591863849999995,1.84108,6.76,0.29157179770891589,0,3,24.947785583439536,24.947785583439536,0.16434967705670936,0.16434967705670936,null,0,0,0,0]
[null,"HH145A","MAJOR METROPOLITAN AREAS","Urban",2488,29.524132816000005,3.1248183329999999,4.76,7.862352382286085,3.7597086181964934,24,145.87473019909629,145.87473019909629,2.3089496113863022,2.3089496113863022,15,69.756028938906752,69.756028938906752,0.36454983922829581,0.36454983922829581]
[null,"HH145B","MAJOR METROPOLITAN AREAS","Urban",2874.5,9.5520905230000004,13.340578276999999,6.67,2.1140146996812641,1.2502250250549169,33,33.948737417351452,33.948737417351452,1.0014497554909769,1.0014497554909769,2,20.077230822751783,20.077230822751783,0.19133762393459733,0.19133762393459733]
[null,"HH145C","MAJOR METROPOLITAN AREAS","Urban",1524.5,8.5359063669999991,1.6423588430000007,6.67,1.5991039087685135,1.8736261469360744,7,48.420268508245577,48.420268508245577,0.69071857168385942,0.69071857168385942,4,56.73269924565431,56.73269924565431,0.27353230567399145,0.27353230567399145]
[null,"HH145D","MAJOR METROPOLITAN AREAS","Urban",1890,11.289897796000004,2.5158099999999992,7.32,2.6509944663617779,0.9870174762883307,18,64.747790721106156,64.747790721106156,1.1790123041344698,1.1790123041344698,3,24.106878306878308,24.106878306878308,0.1671957671957672,0.1671957671957672]
[null,"HH145E","MAJOR METROPOLITAN AREAS","Urban",2739.5,10.726752677999999,10.451653427000007,5.09,4.8091083366781628,4.2292578872924409,21,81.034730708301012,81.034730708301012,1.6005353276047993,1.6005353276047993,10,71.264099288191275,71.264099288191275,0.2945793027924804,0.2945793027924804]
[null,"HH148A","MAJOR METROPOLITAN AREAS","Urban",914,6.6337810689999985,1.3439900000000002,7.45,2.9725775258308862,0.56289588042394934,14,150.12911744399457,150.12911744399457,1.191101679395012,1.191101679395012,3,28.428884026258206,28.428884026258206,8.6433260393873085E-2,8.6433260393873085E-2]
[null,"HH148B","MAJOR METROPOLITAN AREAS","Urban",841.5,3.8905724399999992,0.68621307600000003,3.52,0.36849050563327945,0.70058700634661808,9,20.213900307141394,20.213900307141394,0.19409780153828721,0.19409780153828721,1,38.431372549019606,38.431372549019606,9.1503267973856203E-2,9.1503267973856203E-2]
[null,"HH148C","MAJOR METROPOLITAN AREAS","Urban",929,3.9150335729999997,0.16412853399999999,3.94,2.258407347064217,0.11550803703896621,9,112.21851085256324,112.21851085256324,2.2963760055689817,2.2963760055689817,1,5.7395048439181915,5.7395048439181915,9.2572658772874059E-2,9.2572658772874059E-2]
[null,"HH148D","MAJOR METROPOLITAN AREAS","Urban",898.5,16.256736196999992,6.1689974460000006,2.86,0.72778153387172473,2.0014605292629577,7,37.39046685882721,37.39046685882721,1.0120571393335138,1.0120571393335138,8,102.82693377851976,102.82693377851976,0.43405676126878129,0.43405676126878129]
[null,"HH177A","MAJOR METROPOLITAN AREAS","Urban",691,6.1845469619999971,4.1904289710000002,3.89,0.8162392732567153,0.98173166214026097,12,54.527724800165089,54.527724800165089,0.33574521524343742,0.33574521524343742,8,65.583212735166427,65.583212735166427,0.33140376266280752,0.33140376266280752]
[null,"HH177B","MAJOR METROPOLITAN AREAS","Urban",2062,7.3577438799999983,5.8468699999999991,6.06,2.4186354183733245,0.78806289786262429,18,54.145165399945441,54.145165399945441,1.7428063384314165,1.7428063384314165,2,17.642095053346267,17.642095053346267,7.1290009699321047E-2,7.1290009699321047E-2]
[null,"HH177C","MAJOR METROPOLITAN AREAS","Urban",2371,12.684033009999991,5.9982421070000003,5.14,0.63626171083796645,0.60641719445457265,25,12.387457350043499,12.387457350043499,9.7286640868715871E-2,9.7286640868715871E-2,3,11.806410797132012,11.806410797132012,3.7536904259805992E-2,3.7536904259805992E-2]
[null,"HH177D","MAJOR METROPOLITAN AREAS","Urban",1097,6.1957345009999978,1.53915,6.06,4.1486924844135276,0.2148770103881294,15,174.57520243419555,174.57520243419555,1.1731996145048462,1.1731996145048462,2,9.0419325432999091,9.0419325432999091,4.5578851412944391E-2,4.5578851412944391E-2]
[null,"HH177E","MAJOR METROPOLITAN AREAS","Urban",2521,12.575256646999993,2.9022741099999987,5.3,2.3662970396613838,0.57177778124652556,32,43.328569605160403,43.328569605160403,0.35885228206599717,0.35885228206599717,2,10.469654898849663,10.469654898849663,3.9270130900436337E-2,3.9270130900436337E-2]
[null,"HH177F","MAJOR METROPOLITAN AREAS","Urban",2151,4.0670600310000005,21.139497216999995,5.73,0.54225066227523899,1.1312942067233485,12,11.636908459807485,11.636908459807485,5.4858185035691391E-2,5.4858185035691391E-2,8,24.278010227801023,24.278010227801023,0.1608554160855416,0.1608554160855416]
[null,"HH177G","MAJOR METROPOLITAN AREAS","Urban",2313,11.145985203999997,3.6651900000000004,4.29,4.9821395546298444,0,23,99.430172509153422,99.430172509153422,1.1495892580656037,1.1495892580656037,null,0,0,0,0]
[null,"HH341A","MAJOR METROPOLITAN AREAS","Urban",1555.5,4.6083575259999972,4.1887169790000005,5.09,0.38934496845869876,0.92066317819186505,7,11.554269376808101,11.554269376808101,9.0431812580255372E-2,9.0431812580255372E-2,3,27.321761491481837,27.321761491481837,0.22115075538412085,0.22115075538412085]
[null,"HH341B","MAJOR METROPOLITAN AREAS","Urban",876,4.8364139070000043,1.8431699999999993,4.38,2.1461850093417314,0.52563522331460544,3,113.09437066343821,113.09437066343821,1.980213102140383,1.980213102140383,4,27.698630136986303,27.698630136986303,1.1324200913242009,1.1324200913242009]
[null,"HH341C","MAJOR METROPOLITAN AREAS","Urban",2531.5,9.4661433589999984,1.1072299999999999,5.01,23.187155134549524,7.0229623067564555,13,422.81216410321019,422.81216410321019,2.1341760058942669,2.1341760058942669,5,128.06201856606754,128.06201856606754,0.39541773651984991,0.39541773651984991]
[null,"HH341D","MAJOR METROPOLITAN AREAS","Urban",2231.5,8.8685021830000021,0.67371999999999987,7.45,4.700611591313594,0.84393222035390225,26,97.237864684716698,97.237864684716698,1.5992231135568142,1.5992231135568142,4,17.457763835984764,17.457763835984764,0.14160878332959892,0.14160878332959892]
[null,"HH341E","MAJOR METROPOLITAN AREAS","Urban",2469,9.2352850089999965,0.98604999999999998,6.78,2.3725429723949425,0.40328162369043413,20,44.357895620538429,44.357895620538429,0.75280133475976641,0.75280133475976641,2,7.539894694208181,7.539894694208181,4.6982584042122313E-2,4.6982584042122313E-2]
[null,"HH341F","MAJOR METROPOLITAN AREAS","Urban",1114.5,3.7180213180000008,1.5768199999999994,7.16,0.48677149142265025,0.53369392357313805,3,20.161507402422611,20.161507402422611,0.16689098250336473,0.16689098250336473,5,22.104979811574697,22.104979811574697,0.17676087931807985,0.17676087931807985]
[null,"HH341G","MAJOR METROPOLITAN AREAS","Urban",2792.5,9.5587061879999968,0.87370999999999999,6.55,3.7656947938338967,0.61263452503037596,13,62.24864085580797,62.24864085580797,1.0402864659376836,1.0402864659376836,2,10.127126230975827,10.127126230975827,8.7735004476275733E-2,8.7735004476275733E-2]
[null,"HH341H","MAJOR METROPOLITAN AREAS","Urban",1599.5,7.0897924680000024,0.75907451100000001,7.54,8.8645412921745592,2.6247749984531628,17,255.82911014825189,255.82911014825189,3.2929040014315261,3.2929040014315261,17,75.750547045951862,75.750547045951862,0.64832760237574238,0.64832760237574238]
[null,"HH341J","MAJOR METROPOLITAN AREAS","Urban",1530,6.0332542370000004,1.563912977,5.7,2.3866169654514287,0.29429420164560316,9,72.006090171664368,72.006090171664368,1.0553376295467867,1.0553376295467867,4,8.8790849673202619,8.8790849673202619,1.0535947712418301,1.0535947712418301]
[null,"HH341K","MAJOR METROPOLITAN AREAS","Urban",1967.5,7.3920293149999994,4.3319701410000002,3.52,2.8398757170640634,0.77749126956648484,15,66.628882673522867,66.628882673522867,0.8108428300714553,0.8108428300714553,3,18.241423125794157,18.241423125794157,0.11435832274459974,0.11435832274459974]
[null,"HH386A","MAJOR METROPOLITAN AREAS","Urban",1421,15.512147482999996,4.1369500000000006,6.44,1.49606553571709,3.4563808735191484,19,48.599799519269766,48.599799519269766,0.92024388024987647,0.92024388024987647,10,112.2807881773399,112.2807881773399,0.58902181562280087,0.58902181562280087]
[null,"HH386B","MAJOR METROPOLITAN AREAS","Urban",1652.5,7.0897441790000055,2.5896899999999996,6.46,3.5359567173704232,1.2574821879221441,13,98.774174649560322,98.774174649560322,1.1128592572666693,1.1128592572666693,4,35.1267776096823,35.1267776096823,0.17609682299546142,0.17609682299546142]
[null,"HH386C","MAJOR METROPOLITAN AREAS","Urban",1407,6.9614660240000026,0.32449272800000001,6.19,6.0402485666817771,1.8772872231287949,14,198.17033831956289,198.17033831956289,2.9234778425247856,2.9234778425247856,4,61.59061833688699,61.59061833688699,0.31627576403695806,0.31627576403695806]
[null,"HH386D","MAJOR METROPOLITAN AREAS","Urban",1676.5,9.5731567999999996,1.620282164,7.11,5.1522172789908112,2.8535381025663442,21,141.86280714445175,141.86280714445175,1.2134406804351094,1.2134406804351094,11,78.570235609901587,78.570235609901587,0.36504622725917091,0.36504622725917091]
[null,"HH386E","MAJOR METROPOLITAN AREAS","Urban",839,3.3614657400000008,4.2326642640000012,6.74,1.1027060723814202,0.64603913739235752,9,60.670244146444809,60.670244146444809,1.2344060651735982,1.2344060651735982,3,35.544696066746127,35.544696066746127,0.23003575685339689,0.23003575685339689]
[null,"HH386F","MAJOR METROPOLITAN AREAS","Urban",1687,5.993435229000001,2.4580761419999999,4.6900000000000004,0.42726989587310771,1.9134863847739774,7,11.69136312379594,11.69136312379594,0.11163800188119975,0.11163800188119975,6,52.358624777711917,52.358624777711917,0.27563722584469474,0.27563722584469474]
[null,"HH386G","MAJOR METROPOLITAN AREAS","Urban",2028.5,8.5269690840000028,1.1816899999999999,6.34,1.8207244483833607,0.66781062599403818,20,41.43307337903142,41.43307337903142,0.60520907019777437,0.60520907019777437,5,15.196943554350506,15.196943554350506,0.14197683017007642,0.14197683017007642]
[null,"HH403A","MAJOR METROPOLITAN AREAS","Urban",1467.5,7.7237593629999974,5.9977168650000019,6.5,9.650250233247224,5.9790356756854231E-3,17,303.55570698466778,303.55570698466778,2.7884156729131178,2.7884156729131178,1,0.18807495741056218,0.18807495741056218,6.814310051107325E-4,6.814310051107325E-4]
[null,"HH403B","MAJOR METROPOLITAN AREAS","Urban",2424.5,7.9916418090000061,11.681549416999998,6.34,2.69872538282188,2.0573298517542353,17,51.382406740194497,51.382406740194497,1.1734377828965017,1.1734377828965017,3,39.17055062899567,39.17055062899567,0.13569808207877912,0.13569808207877912]
[null,"HH403C","MAJOR METROPOLITAN AREAS","Urban",396.5,1.146134368,4.0333524230000002,9.5299999999999994,7.0130838047884544E-2,0,2,8.1647665978680788,8.1647665978680788,4.4556493867390697E-2,4.4556493867390697E-2,null,0,0,0,0]
[null,"HH403D","MAJOR METROPOLITAN AREAS","Urban",1467,1.9612339560000001,9.0170310120000003,2.23,4.100834897099271E-2,0.59484906021248563,2,1.2903873831054056,1.2903873831054056,2.1813203464500271E-2,2.1813203464500271E-2,2,18.717791411042946,18.717791411042946,0.10020449897750511,0.10020449897750511]
[null,"HH409A","MAJOR METROPOLITAN AREAS","Urban",1172,11.257060211999994,6.167230055000001,5.01,1.8648308988044502,3.5765681558695208,14,73.449658703071677,73.449658703071677,1.2261092150170649,1.2261092150170649,11,140.86945392491467,140.86945392491467,0.73122866894197958,0.73122866894197958]
[null,"HH409B","MAJOR METROPOLITAN AREAS","Urban",929,3.531364551999999,0.77628000000000008,4.67,0.19973436008921472,0,6,9.9246455624747778,9.9246455624747778,5.4897713776681852E-2,5.4897713776681852E-2,null,0,0,0,0]
[null,"HH409C","MAJOR METROPOLITAN AREAS","Urban",2860,11.232014882999996,0.86797620100000006,4.46,5.7448421599772344,0.11178197132803183,19,92.723540278081288,92.723540278081288,1.4855477426435564,1.4855477426435564,2,1.8041958041958042,1.8041958041958042,1.048951048951049E-2,1.048951048951049E-2]
[null,"HH409D","MAJOR METROPOLITAN AREAS","Urban",3236.5,17.451399444,4.1453200000000008,8.1,10.208040551823316,4.8951188277400597,20,145.59441392822831,145.59441392822831,2.0969153595324297,2.0969153595324297,10,69.817704310211653,69.817704310211653,0.24872547505020856,0.24872547505020856]
[null,"HH409E","MAJOR METROPOLITAN AREAS","Urban",2382.5,10.108191249000001,0.82125999999999999,9.15,11.337074640686906,0.88017470834456057,22,219.65749872934154,219.65749872934154,3.1854494358535077,3.1854494358535077,8,17.053515215110178,17.053515215110178,0.15110178384050368,0.15110178384050368]
[null,"HH409F","MAJOR METROPOLITAN AREAS","Urban",2049.5,9.6133074780000065,5.4695646610000006,6.92,0.63229694827351357,5.7439685883054858,20,14.2413480469703,14.2413480469703,9.303077507903143E-2,9.303077507903143E-2,2,129.37252988533788,129.37252988533788,0.53525250060990481,0.53525250060990481]
[null,"HH428A","MAJOR METROPOLITAN AREAS","Urban",2972,3.2526983899999986,18.623139999999992,6.82,2.6851357112186198,0.6268239031737598,12,41.705695951931567,41.705695951931567,0.99001793745870059,0.99001793745870059,2,9.7358681022880216,9.7358681022880216,3.7685060565275909E-2,3.7685060565275909E-2]
[null,"HH428B","MAJOR METROPOLITAN AREAS","Urban",2009.5,5.6976850600000004,6.2666599999999999,7.66,3.577954402245251,3.0237889771142128,12,82.191087793491164,82.191087793491164,1.0607945208645602,1.0607945208645602,6,69.461059965165461,69.461059965165461,0.27121174421497884,0.27121174421497884]
[null,"HH428C","MAJOR METROPOLITAN AREAS","Urban",1101.5,5.4597369719999991,1.7202668020000003,5.58,2.4273508946215485,0.42689448197484398,12,101.72460161746766,101.72460161746766,2.2154636551886866,2.2154636551886866,2,17.890149795733091,17.890149795733091,9.3508851566046297E-2,9.3508851566046297E-2]
[null,"HH428D","MAJOR METROPOLITAN AREAS","Urban",2191,8.9654555649999974,1.1215500000000003,5.35,1.3282123146901703,1.3845366960304593,9,27.98356636078703,24.341393836825368,0.16978545299897396,0.13509809562791053,2,29.170241898676405,29.170241898676405,8.6261980830670923E-2,8.6261980830670923E-2]
[null,"HH428E","MAJOR METROPOLITAN AREAS","Urban",965.5,0.69788622099999997,6.820226248,9.24,0.68082279104925636,0,8,32.550655955665782,32.550655955665782,0.17296729440950842,0.17296729440950842,null,0,0,0,0]
[null,"HH428F","MAJOR METROPOLITAN AREAS","Urban",2122,8.9189051710000022,1.7252599999999998,2.78,3.4643672486099089,0,4,75.362705644181489,75.362705644181489,1.0392710994033743,1.0392710994033743,null,0,0,0,0]
[null,"HH429A","MAJOR METROPOLITAN AREAS","Urban",706.5,3.379918399000001,0.28552,5.96,4.6293333571204531,4.0986722820278335E-2,6,302.47133729884746,302.47133729884746,2.0679405505827617,2.0679405505827617,2,2.677990092002831,2.677990092002831,3.113941967445152E-2,3.113941967445152E-2]
[null,"HH429B","MAJOR METROPOLITAN AREAS","Urban",1400.5,5.965784951999999,1.06731,1.64,0.6167865911030681,3.1627582302284227,10,20.329642789187666,20.329642789187666,0.2703796129318613,0.2703796129318613,6,104.24634059264548,104.24634059264548,0.41413780792574079,0.41413780792574079]
[null,"HH429C","MAJOR METROPOLITAN AREAS","Urban",2450,8.729007266,1.6792399999999996,3.68,0.1763886276058963,0.49764640413712147,14,3.3233986118861609,3.3233986118861609,4.5170031437257542E-2,4.5170031437257542E-2,3,9.3763265306122445,9.3763265306122445,0.11224489795918367,0.11224489795918367]
[null,"HH432A","MAJOR METROPOLITAN AREAS","Urban",145.5,0.80922711299999994,5.3275299999999994,6.54,2.7490566204510153E-2,0,1,8.7216494845360817,8.7216494845360817,0.96907216494845361,0.96907216494845361,null,0,0,0,0]
[null,"HH432B","MAJOR METROPOLITAN AREAS","Urban",2231.5,8.7216169479999976,0.82990999999999993,5.75,12.648787092893981,6.3680845948869971,21,261.65553649177525,261.65553649177525,3.3052505583819749,3.3052505583819749,13,131.73157069235941,131.73157069235941,0.53148106654716554,0.53148106654716554]
[null,"HH432C","MAJOR METROPOLITAN AREAS","Urban",2030,6.8849538640000008,1.21706,6.5,3.0524487279166013,3.104051032108468,20,69.411315797702429,69.411315797702429,2.1275861007239429,2.1275861007239429,6,70.584729064039408,70.584729064039408,0.254679802955665,0.254679802955665]
[null,"HH432D","MAJOR METROPOLITAN AREAS","Urban",676,3.7466732870000001,2.0230099999999998,5.47,0.42146396328041097,0.39502795487725972,6,28.780059543587054,28.780059543587054,1.1612424455450836,1.1612424455450836,2,26.974852071005916,26.974852071005916,7.8402366863905323E-2,7.8402366863905323E-2]
[null,"HH432E","MAJOR METROPOLITAN AREAS","Urban",560.5,2.4491513009999988,6.6798311849999994,5.81,2.2914437595337005,0.38291824131672292,3,188.71721677074041,188.71721677074041,2.9366636931311327,2.9366636931311327,5,31.536128456735057,31.536128456735057,3.568242640499554E-2,3.568242640499554E-2]
[null,"HH432F","MAJOR METROPOLITAN AREAS","Urban",2156,7.7756127940000015,1.3394499999999998,6.1,6.568519541242118,2.5660028108149939,18,140.63605551640046,140.63605551640046,3.5811688495994574,3.5811688495994574,3,54.939703153988866,54.939703153988866,0.1567717996289425,0.1567717996289425]
[null,"HH432G","MAJOR METROPOLITAN AREAS","Urban",1,0,2.0957200000000005,7.47,1.9496855464191598E-4,0,1,9,9,1,1,null,0,0,0,0]
[null,"HH496A","MAJOR METROPOLITAN AREAS","Urban",1996,7.8796309949999976,12.849650000000006,4.93,4.7931499364561603,2.411371083811217,13,110.85069360427245,110.85069360427245,1.8740815074744828,1.8740815074744828,8,55.767535070140283,55.767535070140283,0.58667334669338678,0.58667334669338678]
[null,"HH496B","MAJOR METROPOLITAN AREAS","Urban",314.5,2.3074443720000009,6.539463006000001,6.34,0.61293780944870779,8.5677848178753083E-2,2,89.965023847376784,89.965023847376784,1.1573926868044515,1.1573926868044515,2,12.575516693163753,12.575516693163753,3.1796502384737677E-2,3.1796502384737677E-2]
[null,"HH496C","MAJOR METROPOLITAN AREAS","Urban",3044.5,2.306893904999999,34.039191177000006,3.92,5.2862977307765613,3.1386904453165152,22,80.151855083458685,80.151855083458685,1.6566487542708572,1.6566487542708572,12,47.589423550665131,47.589423550665131,0.2318935785843324,0.2318935785843324]
[null,"HH496D","MAJOR METROPOLITAN AREAS","Urban",2641,0.46405000000000007,32.238233561000008,10.9,15.426381244530463,3.7582571856230484,11,269.63334302746949,269.63334302746949,2.9617568943727113,2.9617568943727113,9,65.689511548655815,65.689511548655815,0.58121923513820517,0.58121923513820517]
[null,"HH496E","MAJOR METROPOLITAN AREAS","Urban",812.5,5.6299750440000009,14.731531009999998,7.6,2.9082953813089283,0.54755835412545206,6,165.23158969350962,165.23158969350962,2.0418461397611178,2.0418461397611178,6,31.108923076923077,31.108923076923077,9.3538461538461543E-2,9.3538461538461543E-2]
[null,"HH496F","MAJOR METROPOLITAN AREAS","Urban",2468.5,0.34596323800000006,31.257074314,3.92,12.544919238260803,1.9161726181934879,23,234.59171785196602,234.59171785196602,2.093038941305386,2.093038941305386,11,35.832691918168926,35.832691918168926,0.30787927891432043,0.30787927891432043]
[null,"HH496G","MAJOR METROPOLITAN AREAS","Urban",2770.5,2.9930856929999989,35.765436627999989,8.33,22.999082943155159,3.4307316769973677,31,383.2042369432902,383.2042369432902,4.2774469481115203,4.2774469481115203,12,57.161884136437465,57.161884136437465,0.19924201407688144,0.19924201407688144]
[null,"HH496H","MAJOR METROPOLITAN AREAS","Urban",933.5,0,11.628671498000005,7.53,1.3465394885688702,1.0073375323165659,2,66.585966669050975,66.585966669050975,0.99303695660066527,0.99303695660066527,4,49.812533476164973,49.812533476164973,0.21210498125334762,0.21210498125334762]
[null,"HH522A","MAJOR METROPOLITAN AREAS","Urban",1716,5.221324418,8.8669954829999984,4.55,0.46123771899311383,1.4926142648202947,15,12.407533872377622,12.407533872377622,0.3005050430949936,0.3005050430949936,7,40.1520979020979,40.1520979020979,0.28321678321678323,0.28321678321678323]
[null,"HH522B","MAJOR METROPOLITAN AREAS","Urban",2358,15.355063211999992,12.579848181999994,4.38,6.9951612051058243,0.59476240752153364,7,136.94048570110397,136.94048570110397,2.6638394024940344,2.6638394024940344,6,11.643341815097541,11.643341815097541,8.4393553859202719E-2,8.4393553859202719E-2]
[null,"HH522C","MAJOR METROPOLITAN AREAS","Urban",2504.5,12.361219792000002,4.916380000000002,7.26,4.0702790302965637,1.7632522818360121,20,75.020695097457391,75.020695097457391,1.1861316542302713,1.1861316542302713,7,32.499101617089238,32.499101617089238,0.12138151327610301,0.12138151327610301]
[null,"HK01","UPPER NORTH/EYRE PENINSULA","Rural Long",208.5,16.646412867999995,2.1989699999999996,6.94,1.2962975421259369E-2,0,2,3.5299760191846521,3.5299760191846521,9.5923261390887284E-3,9.5923261390887284E-3,null,0,0,0,0]
[null,"HK03","UPPER NORTH/EYRE PENINSULA","Rural Long",20,62.04798000000001,0,0.99,3.917073007728375E-2,1.5886689986380369E-2,1,111.2,111.2,0.2,0.2,1,45.1,45.1,0.55000000000000004,0.55000000000000004]
[null,"HK05","UPPER NORTH/EYRE PENINSULA","Rural Long",60.5,165.73889999999986,0,0.04,0.63772202996325977,0.39359186377565647,2,598.47933884297515,598.47933884297515,0.51239669421487599,0.51239669421487599,5,369.37190082644628,369.37190082644628,1.4710743801652892,1.4710743801652892]
[null,"HK06","UPPER NORTH/EYRE PENINSULA","Rural Long",7,30.800859999999997,0,0.11,0.13376874772345776,0,1,1085,1085,1,1,null,0,0,0,0]
[null,"KA01","BAROSSA/MID NORTH & YORKE PENINSULA/RIVE","Rural Short",1909.5,16.139770000000006,9.5260699999999954,0.02,0.59511961558578685,1.9634710606381699E-3,6,16.031769925557246,1.4441815516373708,0.98647114668069757,1.3965255086039277E-2,2,5.2893427598847867E-2,5.2893427598847867E-2,4.2943178842628958E-2,4.2943178842628958E-2]
[null,"KA02","BAROSSA/MID NORTH & YORKE PENINSULA/RIVE","Rural Short",1229.5,12.786130000000002,9.3029399999999995,4.67,0.70175616756556558,2.1889786279985928E-2,11,29.359900153037152,14.719802552386485,1.0866205619573108,0.11061405524726613,2,0.9158194387962586,0.9158194387962586,3.2533550223668157E-3,3.2533550223668157E-3]
[null,"KA03","BAROSSA/MID NORTH & YORKE PENINSULA/RIVE","Rural Long",1764.5,26.168900000000018,13.289531113999994,3.96,2.3835494670458126,0.65966750194001145,7,76.696513763194247,62.168318807116037,1.9684518661131498,0.99990553570793583,7,21.22640974780391,21.22640974780391,0.10767922924341174,0.10767922924341174]
[null,"KA04","BAROSSA/MID NORTH & YORKE PENINSULA/RIVE","Rural Long",2043,27.644390000000001,6.24139,4.74,0.99204934007288781,1.0638093959837851,8,27.570079769857131,12.995924116406325,2.0310002017476312,1.0593898248509106,1,29.564366128242781,29.564366128242781,9.7895252080274109E-2,9.7895252080274109E-2]
[null,"KA05","BAROSSA/MID NORTH & YORKE PENINSULA/RIVE","Rural Long",1039,23.886430000000008,3.3658999999999999,4.6100000000000003,0.52520599600415241,0.28743988977575124,5,28.700353422339315,14.191210015217081,1.0628809841695717,9.5604757028089585E-2,1,15.707410972088546,15.707410972088546,9.8171318575553418E-2,9.8171318575553418E-2]
[null,"KA06","BAROSSA/MID NORTH & YORKE PENINSULA/RIVE","Rural Long",940,11.405720000000002,3.1510400000000005,2.97,0.24867425268038182,1.2830527628911721,5,15.020212765957448,0.73829787234042554,0.95638297872340428,4.2553191489361703E-3,2,77.497872340425531,77.497872340425531,0.3425531914893617,0.3425531914893617]
[null,"KA07","BAROSSA/MID NORTH & YORKE PENINSULA/RIVE","Rural Long",79,73.850430000000017,0.20116000000000001,3.72,0.32213113525910841,9.6130325882110929E-2,2,231.51478364196004,231.51478364196004,1.7763714005675497,1.7763714005675497,4,69.088607594936704,69.088607594936704,0.46835443037974683,0.46835443037974683]
[null,"KA08","BAROSSA/MID NORTH & YORKE PENINSULA/RIVE","Rural Long",72.5,68.681869999999989,0,0.08,0.20740760674014991,1.0567643006461442E-3,2,162.42758620689656,148.77241379310345,1.8344827586206895,0.92413793103448272,1,0.82758620689655171,0.82758620689655171,2.7586206896551724E-2,2.7586206896551724E-2]
[null,"KA09","BAROSSA/MID NORTH & YORKE PENINSULA/RIVE","Rural Long",58,42.100329999999992,0.24084999999999998,0.13,6.9276763016615261E-4,0.26891128903775546,1,0.67816084315036906,0.67816084315036906,0.67816084315036906,0.67816084315036906,5,263.24137931034483,263.24137931034483,1.7586206896551724,1.7586206896551724]
[null,"KA10","BAROSSA/MID NORTH & YORKE PENINSULA/RIVE","Rural Long",76.5,71.36688999999997,0.43297000000000002,0.16,6.210251540130507E-2,0.10217149513413804,5,46.091503267973856,32.366013071895424,1.4901960784313726,0.57516339869281041,3,75.830065359477118,75.830065359477118,0.99346405228758172,0.99346405228758172]
[null,"KA11","BAROSSA/MID NORTH & YORKE PENINSULA/RIVE","Rural Long",34,33.008939999999996,0,0.12,8.1899233300076184E-3,5.4599488866717449E-2,1,13.676470588235293,0,0.91176470588235292,0,1,91.17647058823529,91.17647058823529,0.91176470588235292,0.91176470588235292]
[null,"KA12","BAROSSA/MID NORTH & YORKE PENINSULA/RIVE","Rural Long",55,67.178459999999987,0.21756,0.13,0.12173924743443582,0.11804057238217432,1,125.67272727272727,125.67272727272727,0.87272727272727268,0.87272727272727268,2,121.85454545454546,121.85454545454546,1.1454545454545455,1.1454545454545455]
[null,"KA13","BAROSSA/MID NORTH & YORKE PENINSULA/RIVE","Rural Long",53,22.118339999999996,6.2640000000000001E-2,0.08,5.1200230366305693E-2,1.3737935908399875E-3,2,54.849056603773583,40.415094339622641,1.9245283018867925,0.96226415094339623,1,1.4716981132075471,1.4716981132075471,1.8867924528301886E-2,1.8867924528301886E-2]
[null,"KA14","BAROSSA/MID NORTH & YORKE PENINSULA/RIVE","Rural Long",96,80.479189999999988,0,0.16,0.20659742077632121,0.29816604742730957,6,122.1875,109.21875,3.03125,2.1666666666666665,1,176.34375,176.34375,0.84375,0.84375]
[null,"KA15","BAROSSA/MID NORTH & YORKE PENINSULA/RIVE","Rural Long",64,56.93795999999999,0.36174000000000001,0.11,0.31436976670388378,5.9354928219625099E-3,1,278.890625,278.890625,0.921875,0.921875,2,5.265625,5.265625,0.9375,0.9375]
[null,"KA16","BAROSSA/MID NORTH & YORKE PENINSULA/RIVE","Rural Long",60,66.684769999999986,0.31502999999999998,0.1,0.15308992706191926,0.33226430886149183,1,144.86667175292968,144.86667175292968,0.88333336512247729,0.88333336512247729,1,314.41666666666669,314.41666666666669,0.91666666666666663,0.91666666666666663]
[null,"KA17","BAROSSA/MID NORTH & YORKE PENINSULA/RIVE","Rural Long",104.5,113.58927999999993,0,0.11,0.43876855482821886,0.59277432170911049,4,238.39235384270336,238.39235384270336,1.8181818729382382,1.8181818729382382,2,322.06698564593302,322.06698564593302,0.8995215311004785,0.8995215311004785]
[null,"KA18","BAROSSA/MID NORTH & YORKE PENINSULA/RIVE","Rural Long",25,38.450200000000017,0,0.1,0.1128624273090082,8.4664433220100255E-2,2,256.32,256.32,0.96,0.96,1,192.28,192.28,0.92,0.92]
[null,"KA19","BAROSSA/MID NORTH & YORKE PENINSULA/RIVE","Rural Long",63.5,64.094379999999987,0.39118000000000003,0.03,0.1282911860984419,5.8122036535537935E-2,2,114.70866141732283,114.70866141732283,0.36220472440944884,0.36220472440944884,1,51.968503937007874,51.968503937007874,0.86614173228346458,0.86614173228346458]
[null,"KA20","BAROSSA/MID NORTH & YORKE PENINSULA/RIVE","Rural Long",69,26.706669999999999,0,0.11,6.7985170008235275E-3,0,1,5.5942028985507246,5.5942028985507246,1.4492753623188406E-2,1.4492753623188406E-2,null,0,0,0,0]
[null,"KA21","BAROSSA/MID NORTH & YORKE PENINSULA/RIVE","Rural Long",87.5,94.358639999999966,0.28870000000000001,0.18,0.46517591801048519,0,4,301.84381905691964,301.84381905691964,1.8704762486049107,1.8704762486049107,null,0,0,0,0]
[null,"KA22","BAROSSA/MID NORTH & YORKE PENINSULA/RIVE","Rural Long",1284,16.953309999999984,3.1198999999999995,0.13,0.24285024073066475,2.4342565665383935,8,10.738574423151228,10.738574423151228,0.15550361982201491,0.15550361982201491,4,107.64018691588785,107.64018691588785,0.32476635514018692,0.32476635514018692]
[null,"KA23","BAROSSA/MID NORTH & YORKE PENINSULA/RIVE","Rural Long",75.5,1.7175999999999996,1.7770000000000001E-2,2.95,0,6.0763947287153291E-3,null,0,0,0,0,1,4.5695364238410594,4.5695364238410594,0.91390728476821192,0.91390728476821192]
[null,"KA24","BAROSSA/MID NORTH & YORKE PENINSULA/RIVE","Rural Long",66,59.393879999999996,0.10696,0.19,0.1309448513964088,8.5703584782402295E-2,1,112.64647558963659,112.64647558963659,0.68686875430020422,0.68686875430020422,5,73.727272727272734,73.727272727272734,0.46969696969696972,0.46969696969696972]
[null,"KA25","BAROSSA/MID NORTH & YORKE PENINSULA/RIVE","Rural Long",71.5,69.599639999999994,0.30057999999999996,7.0000000000000007E-2,0.26235935037374941,8.0137959465665931E-2,3,208.33566433566435,195.32867132867133,1.7902097902097902,0.92307692307692313,1,63.636363636363633,63.636363636363633,0.90909090909090906,0.90909090909090906]
[null,"KA26","BAROSSA/MID NORTH & YORKE PENINSULA/RIVE","Rural Long",227.5,23.218589999999985,0,0.12,0.41934188395904565,2.571459798238951E-3,2,104.6549941513565,104.6549941513565,0.63736292660891347,0.63736292660891347,1,0.64175824175824181,0.64175824175824181,4.3956043956043956E-3,4.3956043956043956E-3]
[null,"KA27","BAROSSA/MID NORTH & YORKE PENINSULA/RIVE","Rural Long",44.5,34.009589999999989,0.59569000000000005,0.87,2.9131469221145373E-2,1.224085314915117E-2,1,37.168539325842694,37.168539325842694,4.49438202247191E-2,4.49438202247191E-2,2,15.617977528089888,15.617977528089888,0.898876404494382,0.898876404494382]
[null,"KA28","BAROSSA/MID NORTH & YORKE PENINSULA/RIVE","Rural Long",80.5,81.536150000000049,0.32538,0.28000000000000003,0.59499354931538839,0,4,419.65218983525813,419.65218983525813,2.8530021335767661,2.8530021335767661,null,0,0,0,0]
[null,"KA29","BAROSSA/MID NORTH & YORKE PENINSULA/RIVE","Rural Long",739,34.200789999999998,1.7333099999999999,0.11,0.39714963692116506,0.10095621618839497,4,30.512855209742895,16.040595399188092,1.006765899864682,4.1948579161028419E-2,5,7.7564276048714476,7.7564276048714476,5.2774018944519621E-2,5.2774018944519621E-2]
[null,"KA30","BAROSSA/MID NORTH & YORKE PENINSULA/RIVE","Rural Short",69,47.685740000000024,0,2.59,2.3892137955686239E-2,1.2169632514450439E-2,2,17.811594202898551,3.4637681159420288,0.97101449275362317,1.4492753623188406E-2,3,9.0724637681159415,9.0724637681159415,7.2463768115942032E-2,7.2463768115942032E-2]
[null,"KA31","BAROSSA/MID NORTH & YORKE PENINSULA/RIVE","Rural Long",64,34.263150000000024,0.23044000000000001,0.21,1.7612738344102402E-3,9.4633243122862212E-2,1,1.5625,1.5625,3.125E-2,3.125E-2,1,83.953125,83.953125,0.421875,0.421875]
[null,"KA32","BAROSSA/MID NORTH & YORKE PENINSULA/RIVE","Rural Long",36.5,25.862020000000005,0.16775000000000001,0.04,0,0.28294864149800514,null,0,0,0,0,2,440.13698630136986,440.13698630136986,1.9178082191780821,1.9178082191780821]
[null,"KA33","BAROSSA/MID NORTH & YORKE PENINSULA/RIVE","Rural Long",104.5,4.7037499999999994,0.79896,0,2.6947489666476677E-2,0,1,14.641148325358852,0,0.97607655502392343,0,null,0,0,0,0]
[null,"KI11","KANGAROO ISLAND","Rural Long",337.5,6.7680100000000003,1.7000700000000002,0.19,3.650110851611152,2.0186135543559205,6,614.05234397605614,614.05234397605614,3.0143209316112376,3.0143209316112376,3,339.58814814814815,339.58814814814815,1.3244444444444445,1.3244444444444445]
[null,"KI12","KANGAROO ISLAND","Rural Long",110.5,67.504129999999975,0,0.76,1.2404299360984441,0.69151133286614852,6,637.3574660633484,637.3574660633484,2.8868778280542986,2.8868778280542986,17,355.31221719457011,355.31221719457011,3.2941176470588234,3.2941176470588234]
[null,"KI13","KANGAROO ISLAND","Rural Long",93,28.531389999999988,0.82821,0.14000000000000001,0,1.7821097038713136,null,0,0,0,0,8,1087.989247311828,1087.989247311828,4.709677419354839,4.709677419354839]
[null,"KI14","KANGAROO ISLAND","Rural Long",142.5,28.565699999999985,0,0.22,1.0978595792862721E-2,2.7586479813600708,1,4.3742645799068001,4.3742645799068001,2.3391812865497078E-2,2.3391812865497078E-2,3,1099.1438596491228,1099.1438596491228,2.856140350877193,2.856140350877193]
[null,"KI15","KANGAROO ISLAND","Rural Long",63,62.188000000000017,0,0.13,2.8849665407639738E-2,0.23025132837245071,4,26,26,1.1587301587301588,1.1587301587301588,6,207.50793650793651,207.50793650793651,4,4]
[null,"KI16","KANGAROO ISLAND","Rural Long",112,7.6025200000000037,1.4099900000000001,0.28999999999999998,0,2.5515926293868034,null,0,0,0,0,8,1293.5,1293.5,4.5178571428571432,4.5178571428571432]
[null,"KI21","KANGAROO ISLAND","Rural Long",335,25.398990000000001,1.4939500000000003,0.41,4.5176673852622667E-2,3.0078682289291203,3,7.6567164179104479,7.6567164179104479,0.14029850746268657,0.14029850746268657,10,509.78507462686565,509.78507462686565,4.2925373134328355,4.2925373134328355]
[null,"KI22","KANGAROO ISLAND","Rural Long",16,8.233880000000001,0,0.48,0,0.22014161656293593,null,0,0,0,0,6,781.1875,781.1875,5.125,5.125]
[null,"KI31","KANGAROO ISLAND","Rural Short",711,41.236390000000021,6.1226199999999995,0.04,0.64042855265409859,1.6305946747836411,11,46.333803716088148,46.333803716088148,0.48195031591273224,0.48195031591273224,5,117.9704641350211,117.9704641350211,3.8326300984528832,3.8326300984528832]
[null,"KI32","KANGAROO ISLAND","Rural Short",776,8.8404400000000027,2.0025699999999995,2.06,4.0772773749554743E-2,2.8609328578100617,4,2.7027470696832716,2.7027470696832716,3.0068709063775761E-2,3.0068709063775761E-2,8,189.64561855670104,189.64561855670104,4.0025773195876289,4.0025773195876289]
[null,"KI41","KANGAROO ISLAND","Rural Long",103,32.397050000000007,0.94391000000000003,1.45,4.6497629228430346E-3,0.15520345028823038,1,2.563106796116505,2.563106796116505,1.9417475728155338E-2,1.9417475728155338E-2,4,85.553398058252426,85.553398058252426,2.9902912621359223,2.9902912621359223]
[null,"KI42","KANGAROO ISLAND","Rural Long",219,95.577629999999985,0.23138,0.61,0.78778256065501229,0.24474661202964698,3,204.23744292237444,204.23744292237444,1.0136986301369864,1.0136986301369864,4,63.452054794520549,63.452054794520549,2.7397260273972601,2.7397260273972601]
[null,"KI43","KANGAROO ISLAND","Rural Long",79.5,85.873449999999991,0,1.54,7.0450953376409615E-4,8.8451171964082281E-2,1,0.50314465408805031,0.50314465408805031,2.5157232704402517E-2,2.5157232704402517E-2,3,63.169811320754718,63.169811320754718,2.8050314465408803,2.8050314465408803]
[null,"KI44","KANGAROO ISLAND","Rural Long",102.5,84.478880000000004,0,0.17,0,0.23597546833428401,null,0,0,0,0,5,130.71219512195123,130.71219512195123,2.9463414634146341,2.9463414634146341]
[null,"KI45","KANGAROO ISLAND","Rural Long",97,56.18538999999997,0,0.1,0.32969284906325286,0.10727918925392775,3,192.97938144329896,192.97938144329896,0.94845360824742264,0.94845360824742264,3,62.793814432989691,62.793814432989691,2.7628865979381443,2.7628865979381443]
[null,"KI51","KANGAROO ISLAND","Rural Long",87,84.027440000000013,0,0.28000000000000003,0.31244997822437665,9.3224224055334023E-2,3,203.90804597701148,203.90804597701148,1.0114942528735633,1.0114942528735633,3,60.839080459770116,60.839080459770116,2.7241379310344827,2.7241379310344827]
[null,"KI52","KANGAROO ISLAND","Rural Long",82.5,83.970230000000058,0.45595999999999998,0.12,0.43970201276051651,0.15467506813790732,3,302.60606060606062,302.60606060606062,1.3333333333333333,1.3333333333333333,6,106.44848484848485,106.44848484848485,3.2242424242424241,3.2242424242424241]
[null,"KI53","KANGAROO ISLAND","Rural Long",127,95.718780000000038,0.20164999999999997,0.09,1.0753457395991723,0.39378560389744149,2,480.74803149606299,480.74803149606299,1.8976377952755905,1.8976377952755905,16,176.04724409448818,176.04724409448818,3.6614173228346458,3.6614173228346458]
[null,"KI54","KANGAROO ISLAND","Rural Long",123,135.56954999999991,0.76251999999999998,0.11,1.55858644154631,0.41701680577331263,9,719.44715447154476,719.44715447154476,2.8699186991869921,2.8699186991869921,10,192.4959349593496,192.4959349593496,3.4471544715447155,3.4471544715447155]
[null,"KI55","KANGAROO ISLAND","Rural Long",83.5,92.333629999999914,0,0.15,1.1779575531919129,0.20261694191055404,4,800.97005988023955,800.97005988023955,3.4491017964071857,3.4491017964071857,4,137.77245508982037,137.77245508982037,3.4011976047904193,3.4011976047904193]
[null,"KI56","KANGAROO ISLAND","Rural Long",120,37.113140000000001,0,0.06,2.9153485144075506,0.12068248313378967,3,1379.375,1379.375,2.8166666666666669,2.8166666666666669,3,57.1,57.1,2.8166666666666669,2.8166666666666669]
[null,"KI57","KANGAROO ISLAND","Rural Short",169,41.991259999999976,0.91025000000000011,0.14000000000000001,0.70097860895535768,0.73507690836485617,1,213.36094674556213,213.36094674556213,0.98816568047337283,0.98816568047337283,5,223.73964497041419,223.73964497041419,4.550295857988166,4.550295857988166]
[null,"LC01","UPPER NORTH/EYRE PENINSULA","Rural Short",201.5,17.620969999999993,7.1179199999999998,0.4,0.93993274182332154,8.2990672850142042E-2,1,239.94880801217431,239.94880801217431,0.4218363797398415,0.4218363797398415,2,21.186104218362281,21.186104218362281,0.30769230769230771,0.30769230769230771]
[null,"LC02","UPPER NORTH/EYRE PENINSULA","Rural Long",288,12.240301128999995,5.3061800000000003,0,1.3023915420680228,0,3,256.75694296095105,256.75694296095105,0.43402775625387829,0.43402775625387829,null,0,0,0,0]
[null,"LC03","UPPER NORTH/EYRE PENINSULA","Rural Long",29,89.94999,0.21574000000000002,0,0.602672680658496,0,4,1179.9310344827586,1179.9310344827586,1.5172413793103448,1.5172413793103448,null,0,0,0,0]
[null,"LC04","UPPER NORTH/EYRE PENINSULA","Rural Long",58,115.15067999999995,0,7.0000000000000007E-2,2.4882572223014114,3.4186325125902764E-2,3,2435.7931034482758,2435.7931034482758,1.7241379310344827,1.7241379310344827,1,33.46551724137931,33.46551724137931,0.87931034482758619,0.87931034482758619]
[null,"LC05","UPPER NORTH/EYRE PENINSULA","Rural Short",2,4.5220200000000004,0,0.09,2.0801129058245955E-2,9.8367956107219181E-3,1,535,535,1,1,1,253,253,1,1]
[null,"LC06","UPPER NORTH/EYRE PENINSULA","Rural Long",61,67.320449999999994,0,0.01,0.58847681355314951,0,2,547.73770491803282,547.73770491803282,0.86885245901639341,0.86885245901639341,null,0,0,0,0]
[null,"LM11","BAROSSA/MID NORTH & YORKE PENINSULA/RIVE","Rural Long",62,14.170789999999998,0,0.23,0.38610649674174924,4.9879274990498004E-2,2,353.58068798434351,353.58068798434351,1.6989249260194845,1.6989249260194845,1,45.677419354838712,45.677419354838712,0.19354838709677419,0.19354838709677419]
[null,"LM12","BAROSSA/MID NORTH & YORKE PENINSULA/RIVE","Rural Long",29,3.4797499999999997,0,0.17,0.57412243180270606,0,3,1124.0344827586207,1124.0344827586207,2.4827586206896552,2.4827586206896552,null,0,0,0,0]
[null,"LM13","BAROSSA/MID NORTH & YORKE PENINSULA/RIVE","Rural Long",84.5,107.71402999999994,0,0.08,1.3198986115070341,1.2293691364183479E-2,6,886.86390532544374,886.86390532544374,3.6331360946745561,3.6331360946745561,2,8.2603550295857993,8.2603550295857993,4.7337278106508875E-2,4.7337278106508875E-2]
[null,"LM14","BAROSSA/MID NORTH & YORKE PENINSULA/RIVE","Rural Long",114,137.97645999999989,0,0.12,0.38596554807266009,2.0501227432535199E-2,3,192.2280701754386,192.2280701754386,0.93859649122807021,0.93859649122807021,2,10.210526315789474,10.210526315789474,0.12280701754385964,0.12280701754385964]
[null,"LM21","BAROSSA/MID NORTH & YORKE PENINSULA/RIVE","Rural Long",52.5,3.2311400000000003,0,0.16,0.1656478041262831,0,1,179.14285714285714,179.14285714285714,0.8571428571428571,0.8571428571428571,null,0,0,0,0]
[null,"LM31","BAROSSA/MID NORTH & YORKE PENINSULA/RIVE","Rural Long",94.5,101.57435999999998,0,0.1,0.6712742965087749,1.1272152540225538E-3,3,403.31216931216932,403.31216931216932,1.9047619047619047,1.9047619047619047,1,0.67724867724867721,0.67724867724867721,2.1164021164021163E-2,2.1164021164021163E-2]
[null,"LM32","BAROSSA/MID NORTH & YORKE PENINSULA/RIVE","Rural Long",74.5,93.122080000000125,0.14976999999999999,0.15,0.26135542428813557,1.8845630028189572E-3,1,199.18120805369128,199.18120805369128,0.95302013422818788,0.95302013422818788,2,1.436241610738255,1.436241610738255,4.0268456375838924E-2,4.0268456375838924E-2]
[null,"LM33","BAROSSA/MID NORTH & YORKE PENINSULA/RIVE","Rural Long",72,75.637909999999977,0,0.16,0.51076941197896975,1.1747696475516304E-2,4,402.77777777777777,402.77777777777777,1.9444444444444444,1.9444444444444444,2,9.2638888888888893,9.2638888888888893,6.9444444444444448E-2,6.9444444444444448E-2]
[null,"LM41","BAROSSA/MID NORTH & YORKE PENINSULA/RIVE","Rural Long",402.5,6.6721899999999987,0.32717000000000002,0.1,3.1363355424110035,0.34878505742825988,10,442.41490683229813,442.41490683229813,1.995031055900621,1.995031055900621,2,49.2,49.2,0.20372670807453416,0.20372670807453416]
[null,"LM43","BAROSSA/MID NORTH & YORKE PENINSULA/RIVE","Rural Long",111,106.96678999999999,0,1.44,0.82524485511291812,0,3,422.11711711711712,422.11711711711712,1.954954954954955,1.954954954954955,null,0,0,0,0]
[null,"LM51","BAROSSA/MID NORTH & YORKE PENINSULA/RIVE","Rural Long",119,132.30202000000003,0,0.1,1.9934273385238541,0.8882984583848047,4,951.10084033613441,951.10084033613441,1.865546218487395,1.865546218487395,3,423.8235294117647,423.8235294117647,1.8235294117647058,1.8235294117647058]
[null,"LM52","BAROSSA/MID NORTH & YORKE PENINSULA/RIVE","Rural Long",49,68.35839,0,0.14000000000000001,0.17165374790162205,6.6047768790384017E-3,2,198.89795918367346,198.89795918367346,1.0204081632653061,1.0204081632653061,1,7.6530612244897958,7.6530612244897958,6.1224489795918366E-2,6.1224489795918366E-2]
[null,"LM53","BAROSSA/MID NORTH & YORKE PENINSULA/RIVE","Rural Long",68.5,10.051900000000002,2.018E-2,7.0000000000000007E-2,0.35880670554605421,0,3,297.4014598540146,297.4014598540146,1.8394160583941606,1.8394160583941606,null,0,0,0,0]
[null,"LM54","BAROSSA/MID NORTH & YORKE PENINSULA/RIVE","Rural Long",100.5,133.74325999999999,1.0080499999999999,0.51,0.6604776879038402,0.33062632419549032,3,373.13432835820896,373.13432835820896,1.6218905472636815,1.6218905472636815,3,186.78606965174129,186.78606965174129,1.6119402985074627,1.6119402985074627]
[null,"LM55","BAROSSA/MID NORTH & YORKE PENINSULA/RIVE","Rural Long",12.5,11.355669999999998,0,0.17,4.417274776700883E-2,0,1,200.64,200.64,0.96,0.96,null,0,0,0,0]
[null,"LM56","BAROSSA/MID NORTH & YORKE PENINSULA/RIVE","Rural Long",60,69.69917999999997,0,0.13,0.75091909930080591,0,2,710.58333333333337,710.58333333333337,1.8333333333333333,1.8333333333333333,null,0,0,0,0]
[null,"LM61","BAROSSA/MID NORTH & YORKE PENINSULA/RIVE","Rural Long",242.5,16.451459999999994,0.70985000000000009,0.25,0.85855054332161573,1.7753640250855223E-2,2,201.01443298969073,201.01443298969073,0.96494845360824744,0.96494845360824744,2,4.1567010309278354,4.1567010309278354,3.711340206185567E-2,3.711340206185567E-2]
[null,"LM62","BAROSSA/MID NORTH & YORKE PENINSULA/RIVE","Rural Long",210.5,8.336660000000002,4.6699999999999997E-3,1.18,0.71572884808928938,6.6576150940707091E-3,3,193.0498812351544,193.0498812351544,0.90736342042755347,0.90736342042755347,1,1.7957244655581948,1.7957244655581948,6.6508313539192399E-2,6.6508313539192399E-2]
[null,"LM63","BAROSSA/MID NORTH & YORKE PENINSULA/RIVE","Rural Long",81,84.248939999999905,0,0.55000000000000004,1.5793166345773184,0,6,1107.0246913580247,1107.0246913580247,3.5432098765432101,3.5432098765432101,null,0,0,0,0]
[null,"LM64","BAROSSA/MID NORTH & YORKE PENINSULA/RIVE","Rural Long",75.5,108.33678,0,0.11,0.76490361354602332,0,4,575.21854304635758,575.21854304635758,1.8013245033112584,1.8013245033112584,null,0,0,0,0]
[null,"LX21","BAROSSA/MID NORTH & YORKE PENINSULA/RIVE","Rural Short",204,71.711739999999992,2.4129999999999998,0.11,2.4848212342357776,0.94131913096198827,7,626.55882510016943,626.55882510016943,1.0294117740556306,1.0294117740556306,2,237.35784313725489,237.35784313725489,0.98039215686274506,0.98039215686274506]
[null,"LX22","BAROSSA/MID NORTH & YORKE PENINSULA/RIVE","Rural Short",1,0,0,12.52,1.8312769694268868E-2,9.8367956107219181E-3,2,942,942,4,4,1,506,506,2,2]
[null,"LX24","BAROSSA/MID NORTH & YORKE PENINSULA/RIVE","Rural Short",314.5,28.729839999999992,0.76224000000000014,3.03,2.8441169917956852E-2,2.0042957064534187E-2,3,4.6518282988871222,4.6518282988871222,2.2257551669316374E-2,2.2257551669316374E-2,2,3.2782193958664547,3.2782193958664547,1.5898251192368838E-2,1.5898251192368838E-2]
[null,"LX25","BAROSSA/MID NORTH & YORKE PENINSULA/RIVE","Rural Short",349,8.6741600000000005,1.4283600000000001,1.1599999999999999,0,9.3235714919016444E-2,null,0,0,0,0,2,13.742120343839542,13.742120343839542,7.7363896848137534E-2,7.7363896848137534E-2]
[null,"LX31","BAROSSA/MID NORTH & YORKE PENINSULA/RIVE","Rural Short",81.5,29.660310000000013,3.882E-2,1.56,0,4.6073528848638232E-2,null,0,0,0,0,2,29.079754601226995,29.079754601226995,0.12269938650306748,0.12269938650306748]
[null,"LX33","BAROSSA/MID NORTH & YORKE PENINSULA/RIVE","Rural Short",75,111.24568000000004,0,2.27,0,4.0591362124876219E-2,null,0,0,0,0,1,27.84,27.84,0.38666666666666666,0.38666666666666666]
[null,"LX34","BAROSSA/MID NORTH & YORKE PENINSULA/RIVE","Rural Short",306,31.75089000000003,0.52664,0.26,1.0400567643796285E-2,0.93896685375072864,2,1.7483665366577965,1.7483665366577965,4.2483672597049903E-2,4.2483672597049903E-2,5,157.84313725490196,157.84313725490196,0.71895424836601307,0.71895424836601307]
[null,"LX41","BAROSSA/MID NORTH & YORKE PENINSULA/RIVE","Rural Short",467.5,51.133710000000036,7.7473799999999988,1.81,1.78603294333659,6.570823945501994E-2,6,196.51907854539189,196.51907854539189,1.0010695533956435,1.0010695533956435,3,7.2299465240641707,7.2299465240641707,4.2780748663101602E-2,4.2780748663101602E-2]
[null,"LX42","BAROSSA/MID NORTH & YORKE PENINSULA/RIVE","Rural Short",319,28.974179999999997,0.16541,4.7300000000000004,2.0950159946076154E-2,2.5311280405454425E-2,4,3.3782635631979812,3.3782635631979812,2.2988498024058588E-2,2.2988498024058588E-2,1,4.0815047021943576,4.0815047021943576,1.8808777429467086E-2,1.8808777429467086E-2]
[null,"LX43","BAROSSA/MID NORTH & YORKE PENINSULA/RIVE","Rural Short",980,33.941540000000018,6.6253300000000008,1.64,1.3199968813597199E-2,0.66170918774259424,4,0.69285714285714284,0.69285714285714284,4.0816326530612249E-3,4.0816326530612249E-3,7,34.732653061224489,34.732653061224489,0.25408163265306122,0.25408163265306122]
[null,"LX48","BAROSSA/MID NORTH & YORKE PENINSULA/RIVE","Rural Short",58.5,69.536020000000008,0.9206899999999999,5.77,6.2986596400670001E-3,0.19333385839650097,1,5.5384615384615383,5.5384615384615383,3.4188034188034191E-2,3.4188034188034191E-2,4,170,170,1.0427350427350428,1.0427350427350428]
[null,"LX51","BAROSSA/MID NORTH & YORKE PENINSULA/RIVE","Rural Short",1646.5,26.343330000000005,5.2334500000000004,0.33,7.5512764712915112,7.8830447038492846E-2,9,235.91497289319912,235.91497289319912,2.1975908492762422,2.1975908492762422,3,2.4627998785302156,2.4627998785302156,2.7938050409960523E-2,2.7938050409960523E-2]
[null,"LX52","BAROSSA/MID NORTH & YORKE PENINSULA/RIVE","Rural Long",75,64.233769999999993,1.1952499999999999,5.24,0,3.0646164718738183E-3,null,0,0,0,0,1,2.3199999999999998,2.3199999999999998,1.3333333333333334E-2,1.3333333333333334E-2]
[null,"LX53","BAROSSA/MID NORTH & YORKE PENINSULA/RIVE","Rural Short",237,40.440299999999979,2.5760299999999998,1.18,7.3328828141777685E-2,0.14189480466928714,5,15.915609239022945,15.915609239022945,0.14627285513361465,0.14627285513361465,3,30.797468354430379,30.797468354430379,0.11392405063291139,0.11392405063291139]
[null,"LX54","BAROSSA/MID NORTH & YORKE PENINSULA/RIVE","Rural Short",66,100.58528999999993,0,4.2699999999999996,9.8497609574255372E-3,0.16854746629438544,1,7.6767716841264235,7.6767716841264235,5.0505074587735302E-2,5.0505074587735302E-2,3,131.36363636363637,131.36363636363637,0.43939393939393939,0.43939393939393939]
[null,"LX61","BAROSSA/MID NORTH & YORKE PENINSULA/RIVE","Rural Long",76,87.422909999999959,0,0.1,0.58697973079390076,7.8376685631255695E-3,2,438.51315789473682,438.51315789473682,1.8157894736842106,1.8157894736842106,2,5.8552631578947372,5.8552631578947372,6.5789473684210523E-2,6.5789473684210523E-2]
[null,"LX62","BAROSSA/MID NORTH & YORKE PENINSULA/RIVE","Rural Long",16,20.378219999999999,0,0.15,9.6482580648992969E-2,0,1,342.375,342.375,0.875,0.875,null,0,0,0,0]
[null,"LX63","BAROSSA/MID NORTH & YORKE PENINSULA/RIVE","Rural Long",68.5,88.122349999999969,0,0.15,0.12205627672462967,2.007852171227674E-3,1,101.16788321167883,101.16788321167883,0.91970802919708028,0.91970802919708028,1,1.6642335766423357,1.6642335766423357,1.4598540145985401E-2,1.4598540145985401E-2]
[null,"LX71","BAROSSA/MID NORTH & YORKE PENINSULA/RIVE","Rural Long",145.5,177.18580000000003,0,0.14000000000000001,1.6468967116036395,6.4673975199544029E-2,5,642.65292096219935,642.65292096219935,2.3780068728522337,2.3780068728522337,1,25.237113402061855,25.237113402061855,0.16494845360824742,0.16494845360824742]
[null,"LX73","BAROSSA/MID NORTH & YORKE PENINSULA/RIVE","Rural Long",52,109.84334999999997,0,0.2,0.68029201854095533,0,5,742.78846153846155,742.78846153846155,2.1923076923076925,2.1923076923076925,null,0,0,0,0]
[null,"LX75","BAROSSA/MID NORTH & YORKE PENINSULA/RIVE","Rural Long",52,73.328909999999993,0,0.15,0.15809193937666319,1.6379846660015233E-3,1,172.61538461538461,172.61538461538461,0.92307692307692313,0.92307692307692313,1,1.7884615384615385,1.7884615384615385,5.7692307692307696E-2,5.7692307692307696E-2]
[null,"LX76","BAROSSA/MID NORTH & YORKE PENINSULA/RIVE","Rural Long",68,119.15243999999996,0,0.1,0.26387404587134222,3.2125634739642785E-2,1,220.3235294117647,220.3235294117647,0.44117647058823528,0.44117647058823528,3,26.823529411764707,26.823529411764707,0.25,0.25]
[null,"M01","BAROSSA/MID NORTH & YORKE PENINSULA/RIVE","Rural Long",100,73.995894824999979,0,0.12,0.24707149349106852,2.4481706298302344E-3,3,140.28,140.28,0.99,0.99,1,1.39,1.39,0.01,0.01]
[null,"M02","BAROSSA/MID NORTH & YORKE PENINSULA/RIVE","Rural Short",1,0,0,0.12,0,1.3919260192246827E-2,null,0,0,0,0,2,716,716,4,4]
[null,"M03","BAROSSA/MID NORTH & YORKE PENINSULA/RIVE","Rural Short",3,1.009E-2,0.8372400000000001,0,0,5.5346555540959096E-2,null,0,0,0,0,3,949,949,3,3]
[null,"M04","BAROSSA/MID NORTH & YORKE PENINSULA/RIVE","Rural Long",113.5,59.717653900000023,0,1.05,0.17107252753626667,0.71183643291524279,2,85.57709251101322,85.57709251101322,0.96916299559471364,0.96916299559471364,5,356.08810572687224,356.08810572687224,1.6475770925110131,1.6475770925110131]
[null,"M101","BAROSSA/MID NORTH & YORKE PENINSULA/RIVE","Rural Long",46,5.4258324840000016,0,0.18,8.7617540332328464E-2,0.57107542806917633,1,108.14497441830842,108.14497441830842,0.59420314042464473,0.59420314042464473,3,704.86956521739125,704.86956521739125,2.7391304347826089,2.7391304347826089]
[null,"M11","BAROSSA/MID NORTH & YORKE PENINSULA/RIVE","Rural Long",750,17.304702996999996,1.3580600000000005,0.1,3.1141787111241452,0.57271341273517784,4,235.75199951171874,235.75199951171874,0.98088888888888903,0.98088888888888903,4,43.356000000000002,43.356000000000002,0.41066666666666668,0.41066666666666668]
[null,"M13","BAROSSA/MID NORTH & YORKE PENINSULA/RIVE","Rural Long",988.5,14.208068686000006,8.8059399999999979,1.86,1.9990442970608924E-2,0.1326591452077793,2,1.1482034855921224,1.1482034855921224,1.2139593885592513E-2,1.2139593885592513E-2,5,7.6196256954982298,7.6196256954982298,5.665149215983814E-2,5.665149215983814E-2]
[null,"M14","BAROSSA/MID NORTH & YORKE PENINSULA/RIVE","Rural Long",12,3.271631121,0,2.65,1.3315226963152703E-2,0,2,62.999984741210916,62.999984741210916,0.44444432854652421,0.44444432854652421,null,0,0,0,0]
[null,"M21","BAROSSA/MID NORTH & YORKE PENINSULA/RIVE","Rural Long",629.5,74.443858961999965,0.47528000000000004,0.11,2.8735534809420145,3.3111948086912521E-2,8,259.17712421735382,259.17712421735382,1.105639393126993,1.105639393126993,6,2.9864972200158855,2.9864972200158855,1.9062748212867357E-2,1.9062748212867357E-2]
[null,"M22","BAROSSA/MID NORTH & YORKE PENINSULA/RIVE","Rural Long",71,50.774347623000025,0.14492999999999998,1.91,1.0867059558311184E-2,1.5146954975928065E-3,2,8.6901408450704221,8.6901408450704221,0.9859154929577465,0.9859154929577465,1,1.2112676056338028,1.2112676056338028,1.4084507042253521E-2,1.4084507042253521E-2]
[null,"M23","BAROSSA/MID NORTH & YORKE PENINSULA/RIVE","Rural Long",132,86.451269929999896,1.1073600000000001,0.1,1.9285948486792132E-2,0.10729680199227185,2,8.295454545454545,8.295454545454545,1.4924242424242424,1.4924242424242424,4,46.151515151515149,46.151515151515149,0.36363636363636365,0.36363636363636365]
[null,"M31","BAROSSA/MID NORTH & YORKE PENINSULA/RIVE","Rural Long",44,0.9845729259999999,0,0.17,0,1.1536343615387076E-2,null,0,0,0,0,1,14.886363636363637,14.886363636363637,0.11363636363636363,0.11363636363636363]
[null,"M41","BAROSSA/MID NORTH & YORKE PENINSULA/RIVE","Rural Long",165,19.931120000000011,0.12529000000000001,0.03,2.78457393220259E-2,0,4,9.581818181818182,9.581818181818182,3.6363636363636362E-2,3.6363636363636362E-2,null,0,0,0,0]
[null,"M43","BAROSSA/MID NORTH & YORKE PENINSULA/RIVE","Rural Long",117.5,100.98084000000001,3.4729999999999997E-2,0.95,4.5793119694666248E-2,0,1,22.127659574468087,22.127659574468087,1.7021276595744681E-2,1.7021276595744681E-2,null,0,0,0,0]
[null,"M44","BAROSSA/MID NORTH & YORKE PENINSULA/RIVE","Rural Long",56,18.978660000000001,0.1767,0.13,0,0.17605693248764762,null,0,0,0,0,3,178.5,178.5,0.8214285714285714,0.8214285714285714]
[null,"M51","BAROSSA/MID NORTH & YORKE PENINSULA/RIVE","Rural Short",453,21.032969999999995,0.94088999999999989,0.15,2.9853831029233214E-2,0.23561652727658036,4,3.3899925012988499,3.3899925012988499,1.4716697318138145E-2,1.4716697318138145E-2,3,26.754966887417218,26.754966887417218,1.9006622516556291,1.9006622516556291]
[null,"M61","BAROSSA/MID NORTH & YORKE PENINSULA/RIVE","Rural Long",202.5,14.835349999999998,0,1.41,0.12711113262938706,3.9615980102622652,2,35.639506172839504,35.639506172839504,0.98271604938271606,0.98271604938271606,3,1110.7555555555555,1110.7555555555555,2.9333333333333331,2.9333333333333331]
[null,"M71","BAROSSA/MID NORTH & YORKE PENINSULA/RIVE","Rural Long",242,31.16751,0.41720000000000002,0.48,1.6908228810338308E-3,4.5386441566300926,1,0.39669421487603307,0.39669421487603307,8.2644628099173556E-3,8.2644628099173556E-3,4,1064.8388429752067,1064.8388429752067,2.8140495867768593,2.8140495867768593]
[null,"M72","BAROSSA/MID NORTH & YORKE PENINSULA/RIVE","Rural Long",63.5,107.83821000000006,0,2.4,0.35704543171164388,1.5310401187761338,3,319.24409448818898,319.24409448818898,0.97637795275590555,0.97637795275590555,5,1368.9448818897638,1368.9448818897638,4.0787401574803148,4.0787401574803148]
[null,"M73","BAROSSA/MID NORTH & YORKE PENINSULA/RIVE","Rural Long",80,137.49152000000001,0,0.14000000000000001,0.1567533712625114,1.5482477641383219,1,111.25,111.25,0.3125,0.3125,5,1098.8125,1098.8125,2.9249999999999998,2.9249999999999998]
[null,"M74","BAROSSA/MID NORTH & YORKE PENINSULA/RIVE","Rural Long",40,20.646970000000003,0,0.14000000000000001,8.8063691720512008E-4,0.7402986180793123,1,1.25,1.25,2.5000000000000001E-2,2.5000000000000001E-2,3,1050.8,1050.8,2.7749999999999999,2.7749999999999999]
[null,"M81","BAROSSA/MID NORTH & YORKE PENINSULA/RIVE","Rural Long",444,44.861679999999986,0.74741000000000002,0.06,1.0530656255938826,8.3672307669176966,6,134.66216216216216,134.66216216216216,1.6058558558558558,1.6058558558558558,6,1069.9707207207207,1069.9707207207207,3.7702702702702702,3.7702702702702702]
[null,"M83","BAROSSA/MID NORTH & YORKE PENINSULA/RIVE","Rural Long",99.5,54.848949999999988,0,1.45,6.1116202054035344E-3,1.7292362633623182,2,3.487437185929648,3.487437185929648,0.87437185929648242,0.87437185929648242,6,986.7437185929648,986.7437185929648,3.4673366834170856,3.4673366834170856]
[null,"M91","BAROSSA/MID NORTH & YORKE PENINSULA/RIVE","Rural Long",391.5,32.965159999999997,1.9069700000000005,0.15,1.1008489847214327,7.503008921849279,3,159.6500638569604,159.6500638569604,0.96551724137931039,0.96551724137931039,3,1088.1200510855683,1088.1200510855683,2.8786717752234994,2.8786717752234994]
[null,"M92","BAROSSA/MID NORTH & YORKE PENINSULA/RIVE","Rural Long",409.5,38.260489999999997,3.8187899999999995,1.24,3.3684890465246169,7.680950417339746,3,467.04029304029302,467.04029304029302,1.8925518925518925,1.8925518925518925,11,1064.9621489621491,1064.9621489621491,2.8424908424908426,2.8424908424908426]
[null,"M93","BAROSSA/MID NORTH & YORKE PENINSULA/RIVE","Rural Long",76,105.01269667000001,0,2.37,0.74160196071677587,1.4842078475191656,2,554.02631578947364,554.02631578947364,1.9473684210526316,1.9473684210526316,6,1108.8026315789473,1108.8026315789473,3.013157894736842,3.013157894736842]
[null,"MB01","BAROSSA/MID NORTH & YORKE PENINSULA/RIVE","Rural Long",128.5,116.59686231099985,0.16275000000000001,0.13,0.11915017489785276,3.2108022001298683E-2,2,52.645914396887157,52.645914396887157,0.87159533073929962,0.87159533073929962,4,14.186770428015564,14.186770428015564,0.17120622568093385,0.17120622568093385]
[null,"MB02","BAROSSA/MID NORTH & YORKE PENINSULA/RIVE","Rural Long",119,109.63878414299987,0,0.08,0.47168674559340651,8.1546978533194123E-3,2,225.05042016806723,225.05042016806723,0.84873949579831931,0.84873949579831931,1,3.8907563025210083,3.8907563025210083,8.4033613445378148E-3,8.4033613445378148E-3]
[null,"MB03","BAROSSA/MID NORTH & YORKE PENINSULA/RIVE","Rural Long",109.5,131.15363636299995,0,0.13,1.1365676180832722,1.003926085613837E-2,6,589.32420091324195,589.32420091324195,1.5799086757990868,1.5799086757990868,2,5.2054794520547949,5.2054794520547949,3.6529680365296802E-2,3.6529680365296802E-2]
[null,"MB11","BAROSSA/MID NORTH & YORKE PENINSULA/RIVE","Rural Long",687,4.6962433990000001,1.4724299999999999,0.15,6.3405823638889081E-2,0.31713496662390789,4,5.2401718295123727,5.2401718295123727,6.210575075996317E-2,6.210575075996317E-2,2,26.209606986899562,26.209606986899562,9.0247452692867547E-2,9.0247452692867547E-2]
[null,"MB12","BAROSSA/MID NORTH & YORKE PENINSULA/RIVE","Rural Long",1903,21.542952603000014,2.1997199999999997,4.4000000000000004,0.26260599751032598,0.4500054646918164,4,7.834999425249606,7.834999425249606,3.0828522057265162E-2,3.0828522057265162E-2,4,13.426169206516027,13.426169206516027,7.9873883342091431E-2,7.9873883342091431E-2]
[null,"MB123","BAROSSA/MID NORTH & YORKE PENINSULA/RIVE","Rural Long",99,105.80368907800005,0,4.29,1.0432729430745618,1.4410390258377705,5,598.32323232323233,598.32323232323233,1.9797979797979799,1.9797979797979799,9,826.44444444444446,826.44444444444446,4.1616161616161618,4.1616161616161618]
[null,"MB13","BAROSSA/MID NORTH & YORKE PENINSULA/RIVE","Rural Long",1747,11.720255499999995,8.4191400000000023,0.14000000000000001,0.73406376030531939,0.16804313654108102,7,23.856899215619634,23.856899215619634,1.0419767365567536,1.0419767365567536,1,5.4613623354321694,5.4613623354321694,1.6599885518030912E-2,1.6599885518030912E-2]
[null,"MB14","BAROSSA/MID NORTH & YORKE PENINSULA/RIVE","Rural Long",112,81.005988708000061,0,3.49,5.6360762701127692E-3,0.31768096151257508,2,2.8571428571428572,2.8571428571428572,2.6785714285714284E-2,2.6785714285714284E-2,4,161.04464285714286,161.04464285714286,0.9821428571428571,0.9821428571428571]
[null,"MB15","BAROSSA/MID NORTH & YORKE PENINSULA/RIVE","Rural Long",961,4.2354299999999991,7.6706499999999984,0.14000000000000001,8.1546978533194123E-3,0.43299155945141354,2,0.48178980228928198,0.48178980228928198,2.0811654526534861E-3,2.0811654526534861E-3,3,25.581685744016649,25.581685744016649,0.23204994797086367,0.23204994797086367]
[null,"MB16","BAROSSA/MID NORTH & YORKE PENINSULA/RIVE","Rural Long",39,5.732996424000004,0,2.48,5.3190469799189255E-3,0,2,7.7435897435897436,7.7435897435897436,5.128205128205128E-2,5.128205128205128E-2,null,0,0,0,0]
[null,"MB17","BAROSSA/MID NORTH & YORKE PENINSULA/RIVE","Rural Long",524,2.5730896410000001,3.5562800000000006,0.11,0.13380971798003552,0.34679481799537631,2,14.498714068463741,14.498714068463741,6.1704777579271182E-2,6.1704777579271182E-2,1,37.576335877862597,37.576335877862597,0.20992366412213739,0.20992366412213739]
[null,"MB20","BAROSSA/MID NORTH & YORKE PENINSULA/RIVE","Rural Short",200,8.0058203370000047,1.5650949190000001,3.66,0,3.9658227363384806E-3,null,0,0,0,0,1,1.02,1.02,0.02,0.02]
[null,"MB21","BAROSSA/MID NORTH & YORKE PENINSULA/RIVE","Urban",218,3.2634399219999999,0.20436999999999994,3.3,4.6575821386679924E-3,1.2672956051724537E-2,1,0.98623853211009171,0.98623853211009171,4.5871559633027525E-3,4.5871559633027525E-3,1,2.6834862385321099,2.6834862385321099,2.2935779816513763E-2,2.2935779816513763E-2]
[null,"MB22","BAROSSA/MID NORTH & YORKE PENINSULA/RIVE","Urban",1193,13.261227017999996,3.2809499999999994,7.49,7.2983228954290547E-2,0.22512369109319894,5,2.8239731768650462,2.8239731768650462,4.3587594300083819E-2,4.3587594300083819E-2,5,8.7108130762782903,8.7108130762782903,9.0528080469404859E-2,9.0528080469404859E-2]
[null,"MB23","BAROSSA/MID NORTH & YORKE PENINSULA/RIVE","Rural Short",619.5,5.4594721240000004,2.0372548020000001,5.01,1.3814865829795639,0,5,114.71025094070004,114.71025094070004,1.0556900757180769,1.0556900757180769,null,0,0,0,0]
[null,"MB24","BAROSSA/MID NORTH & YORKE PENINSULA/RIVE","Rural Short",841.5,18.449282354000001,3.0798399999999999,6.23,3.3080793713322252,0,4,202.2174688057041,202.2174688057041,1.9334521687462864,1.9334521687462864,null,0,0,0,0]
[null,"MB25","BAROSSA/MID NORTH & YORKE PENINSULA/RIVE","Rural Long",71,40.778969123000003,0,2.69,0.22657026605853331,2.2015922930128003E-3,1,181.18309859154928,181.18309859154928,0.94366197183098588,0.94366197183098588,1,1.7605633802816902,1.7605633802816902,1.4084507042253521E-2,1.4084507042253521E-2]
[null,"MB26","BAROSSA/MID NORTH & YORKE PENINSULA/RIVE","Rural Long",123.5,54.538012675000012,9.0519999999999989E-2,0.11,0.66378888271253134,8.1370851149753093E-3,3,305.16599190283398,305.16599190283398,0.98785425101214575,0.98785425101214575,5,3.7408906882591095,3.7408906882591095,7.28744939271255E-2,7.28744939271255E-2]
[null,"MB27","BAROSSA/MID NORTH & YORKE PENINSULA/RIVE","Rural Short",195.5,21.320890450999993,2.1682299999999999,0.18,0.21069404946212072,1.6193776173382132E-2,5,55.437339216851825,55.437339216851825,0.93776639952988883,0.93776639952988883,3,4.2608695652173916,4.2608695652173916,2.557544757033248E-2,2.557544757033248E-2]
[null,"MB28","BAROSSA/MID NORTH & YORKE PENINSULA/RIVE","Rural Short",325.5,50.082561836999972,1.7959000000000005,0.74,3.7320530382773525,0.30369648425039092,4,589.78494623655911,589.78494623655911,2.8079877112135176,2.8079877112135176,6,47.993855606758835,47.993855606758835,0.13824884792626729,0.13824884792626729]
[null,"MB31","BAROSSA/MID NORTH & YORKE PENINSULA/RIVE","Rural Long",250,19.708715116000004,9.8960000000000006E-2,3.05,0.52655060667215159,1.4986679056996735,1,119.58404113769535,119.58404113769535,0.64800021743774405,0.64800021743774405,2,340.36,340.36,0.92,0.92]
[null,"MB32","BAROSSA/MID NORTH & YORKE PENINSULA/RIVE","Rural Long",360,30.451436780999998,0,0.7,0.9729452788665609,2.1593217209869547E-2,1,153.44722222222222,153.44722222222222,0.92500000000000004,0.92500000000000004,2,3.4055555555555554,3.4055555555555554,9.166666666666666E-2,9.166666666666666E-2]
[null,"MB33","BAROSSA/MID NORTH & YORKE PENINSULA/RIVE","Rural Long",58,71.697385493999974,0,2.21,0.71793044038230214,1.3914063291840897E-3,2,702.79310344827582,702.79310344827582,1.8275862068965518,1.8275862068965518,2,1.3620689655172413,1.3620689655172413,3.4482758620689655E-2,3.4482758620689655E-2]
[null,"MB34","BAROSSA/MID NORTH & YORKE PENINSULA/RIVE","Rural Long",78,74.37239291300007,0.24364,0.17,0.3165889717352407,0,2,230.44871794871796,230.44871794871796,0.88461538461538458,0.88461538461538458,null,0,0,0,0]
[null,"MB41","BAROSSA/MID NORTH & YORKE PENINSULA/RIVE","Rural Long",277,7.579923696999999,1.0118800000000001,0.12,2.5615966647662538,0,2,525.05415162454869,525.05415162454869,1.9025270758122743,1.9025270758122743,null,0,0,0,0]
[null,"MB42","BAROSSA/MID NORTH & YORKE PENINSULA/RIVE","Rural Long",80,130.70504820899993,0,0.85,0.75565692571380771,7.555864749619931E-3,4,536.29999985694883,536.29999985694883,1.9249999873340129,1.9249999873340129,2,5.3624999999999998,5.3624999999999998,3.7499999999999999E-2,3.7499999999999999E-2]
[null,"MB43","BAROSSA/MID NORTH & YORKE PENINSULA/RIVE","Rural Long",95,128.97540264500003,0,0.14000000000000001,0.84136051069777174,9.0265284013524807E-2,2,502.84210526315792,502.84210526315792,1.7894736842105263,1.7894736842105263,1,53.94736842105263,53.94736842105263,0.43157894736842106,0.43157894736842106]
[null,"MB44","BAROSSA/MID NORTH & YORKE PENINSULA/RIVE","Rural Long",68.5,84.318510011000029,0,0.08,0.60119321063759146,2.8250832303940255E-2,5,498.30656934306569,498.30656934306569,1.8540145985401459,1.8540145985401459,5,23.416058394160583,23.416058394160583,0.21897810218978103,0.21897810218978103]
[null,"MB61","BAROSSA/MID NORTH & YORKE PENINSULA/RIVE","Rural Long",503.5,7.8735887889999994,0.35452000000000006,0.09,0.12443982718067199,0,4,14.032435063927508,14.032435063927508,0.13770270323919087,0.13770270323919087,null,0,0,0,0]
[null,"MB62","BAROSSA/MID NORTH & YORKE PENINSULA/RIVE","Rural Long",385,11.789393983,2.2431114240000003,1.1599999999999999,5.829816391897895E-3,1.1166476110160924E-2,1,0.85974025974025969,0.85974025974025969,2.5974025974025974E-3,2.5974025974025974E-3,1,1.6467532467532469,1.6467532467532469,5.1948051948051948E-3,5.1948051948051948E-3]
[null,"MB63","BAROSSA/MID NORTH & YORKE PENINSULA/RIVE","Rural Long",240.5,26.586163215999999,3.34958,1.94,0.26183096822342633,0.45717384919786613,3,61.812889812889814,61.812889812889814,1.9875259875259876,1.9875259875259876,2,107.92931392931393,107.92931392931393,0.8066528066528067,0.8066528066528067]
[null,"MB64","BAROSSA/MID NORTH & YORKE PENINSULA/RIVE","Rural Long",62.5,15.995828526000002,0,0.5,5.5022194586975909E-2,9.0934568070600713E-2,2,49.984000000000002,49.984000000000002,0.78400000000000003,0.78400000000000003,2,82.608000000000004,82.608000000000004,0.78400000000000003,0.78400000000000003]
[null,"MB65","BAROSSA/MID NORTH & YORKE PENINSULA/RIVE","Rural Long",86.5,77.259665550999941,0.1406,0.18,0.13325797831147879,0.18699444299933521,1,87.468208092485554,87.468208092485554,0.90173410404624277,0.90173410404624277,7,122.73988439306359,122.73988439306359,0.50867052023121384,0.50867052023121384]
[null,"MB66","BAROSSA/MID NORTH & YORKE PENINSULA/RIVE","Rural Long",25.5,29.507662021000016,0.11488,0.14000000000000001,8.5492231922273065E-2,0,2,190.35294117647058,190.35294117647058,3.6470588235294117,3.6470588235294117,null,0,0,0,0]
[null,"MB71","BAROSSA/MID NORTH & YORKE PENINSULA/RIVE","Rural Long",174.5,20.719334634999992,0.44262999999999997,0.1,7.46780482038625E-3,0.85747616628262546,2,2.4298006511349399,2.4298006511349399,2.292264156833421E-2,2.292264156833421E-2,3,278.99713467048713,278.99713467048713,0.87106017191977081,0.87106017191977081]
[null,"MB72","BAROSSA/MID NORTH & YORKE PENINSULA/RIVE","Rural Long",288.5,32.575262081999995,0.46832999999999997,0.59,0.14449490537501611,0.10620481221493749,4,28.4367417677643,28.4367417677643,0.82495667244367421,0.82495667244367421,4,20.901213171577123,20.901213171577123,0.10051993067590988,0.10051993067590988]
[null,"MB81","BAROSSA/MID NORTH & YORKE PENINSULA/RIVE","Rural Long",307,33.038569218999989,1.0775399999999999,1.6,3.4402081095368282,2.7860886277001828,9,636.23778362460553,636.23778362460553,3.8241042279265214,3.8241042279265214,9,515.26384364820842,515.26384364820842,2.1009771986970684,2.1009771986970684]
[null,"MB82","BAROSSA/MID NORTH & YORKE PENINSULA/RIVE","Rural Long",162.5,31.169802259000004,0,2.1,0.24809303231502647,1.4907773989215158,3,86.683076923076925,86.683076923076925,0.94769230769230772,0.94769230769230772,2,520.8738461538461,520.8738461538461,1.8830769230769231,1.8830769230769231]
[null,"MB83","BAROSSA/MID NORTH & YORKE PENINSULA/RIVE","Rural Long",80.5,60.035972280999992,0,0,0.9832663435362049,0.64409784124382485,5,693.50310559006209,693.50310559006209,4.4844720496894412,4.4844720496894412,2,454.28571428571428,454.28571428571428,1.826086956521739,1.826086956521739]
[null,"MB84","BAROSSA/MID NORTH & YORKE PENINSULA/RIVE","Rural Long",5,3.0640699999999996,3.3889,0.13,0,6.9623154674236798E-2,null,0,0,0,0,3,790.6,790.6,2.8,2.8]
[null,"MB92","BAROSSA/MID NORTH & YORKE PENINSULA/RIVE","Rural Long",62,28.720379997000002,1.66273,2.02,0,7.1789521490561406E-2,null,0,0,0,0,3,65.741935483870961,65.741935483870961,0.19354838709677419,0.19354838709677419]
[null,"MB93","BAROSSA/MID NORTH & YORKE PENINSULA/RIVE","Rural Long",33,26.701895671999988,0,3.52,0,1.0638093959837851E-2,null,0,0,0,0,2,18.303030303030305,18.303030303030305,0.18181818181818182,0.18181818181818182]
[null,"MB94","BAROSSA/MID NORTH & YORKE PENINSULA/RIVE","Rural Long",12.5,4.506424384999999,3.6876000000000007,0.39,1.0567643006461442E-2,0,1,48,48,1.6,1.6,null,0,0,0,0]
[null,"ME116A","MAJOR METROPOLITAN AREAS","Urban",915,3.3542143780000004,1.7438798000000002,11.55,0.54669914038783274,0,5,27.580696814698605,27.580696814698605,0.17814209526353858,0.17814209526353858,null,0,0,0,0]
[null,"ME116B","MAJOR METROPOLITAN AREAS","Urban",1082,3.5121696860000031,3.4667799999999986,6.57,2.2356394265606361E-2,0,4,0.95378927911275413,0.95378927911275413,4.6210720887245845E-3,4.6210720887245845E-3,null,0,0,0,0]
[null,"ME116C","MAJOR METROPOLITAN AREAS","Urban",1641.5,3.6482030419999996,2.4112799999999996,5.09,0.16878499545188083,0,5,4.7464715990757318,4.7464715990757318,0.12569803832835844,0.12569803832835844,null,0,0,0,0]
[null,"ME116D","MAJOR METROPOLITAN AREAS","Urban",1300,4.3180931979999979,1.02919,5.16,1.7134627160803859,1.1629657652662908,6,60.842807241586542,60.842807241586542,1.0112819965069111,1.0112819965069111,3,41.295384615384613,41.295384615384613,0.16692307692307692,0.16692307692307692]
[null,"ME131A","MAJOR METROPOLITAN AREAS","Urban",1686,7.5767130810000021,0.98051134900000014,3.41,8.79532705167051,3.0102278309802304,17,240.8088037076794,240.8088037076794,2.092328982138266,2.092328982138266,4,82.417556346381971,82.417556346381971,0.3582443653618031,0.3582443653618031]
[null,"ME131B","MAJOR METROPOLITAN AREAS","Urban",1627.5,5.6494031380000003,0.68880000000000008,5.22,0.86370315184303204,3.0450838759156578,12,24.497481845088096,24.497481845088096,0.25478745929046104,0.25478745929046104,5,86.36866359447005,86.36866359447005,0.33179723502304148,0.33179723502304148]
[null,"ME131C","MAJOR METROPOLITAN AREAS","Urban",2665,9.8119381739999945,1.169223039,4.32,16.544836176404946,0.95408945372658471,15,286.57822943538929,286.57822943538929,2.0696685106177268,2.0696685106177268,1,16.526078799249532,16.526078799249532,4.5778611632270171E-2,4.5778611632270171E-2]
[null,"ME131D","MAJOR METROPOLITAN AREAS","Urban",708,5.0360223850000008,2.4785607209999996,7.16,4.7658980023579456E-3,0.29440251750929308,2,0.31073446327683618,0.31073446327683618,2.8248587570621469E-3,2.8248587570621469E-3,3,19.194915254237287,19.194915254237287,8.6158192090395477E-2,8.6158192090395477E-2]
[null,"ME131E","MAJOR METROPOLITAN AREAS","Urban",690,2.9968116310000008,1.3222799999999995,3.94,0.10552123408218332,0.48633822796789045,5,7.0594149161076283,7.0594149161076283,6.0386477115649526E-2,6.0386477115649526E-2,3,32.536231884057969,32.536231884057969,0.14057971014492754,0.14057971014492754]
[null,"ME200A","MAJOR METROPOLITAN AREAS","Urban",1007,3.8937511260000011,3.9550366510000012,3.92,0.20956937440150597,0,4,9.6067454575782136,9.6067454575782136,5.9913886852194904E-2,5.9913886852194904E-2,null,0,0,0,0]
[null,"ME200D","MAJOR METROPOLITAN AREAS","Urban",585,2.8083203839999995,3.6284699999999988,7.32,1.1995332008480188,0.5505045456178187,3,94.652991452991458,94.652991452991458,0.9982905982905983,0.9982905982905983,2,43.439316239316241,43.439316239316241,0.12649572649572649,0.12649572649572649]
[null,"ME200E","MAJOR METROPOLITAN AREAS","Urban",1653.5,5.3885940070000045,2.5672942240000012,5.83,4.2012040309969985,1.4454968641151651,7,117.28636093301141,117.28636093301141,1.0172361619601553,1.0172361619601553,2,40.354399758088903,40.354399758088903,0.17175687934684003,0.17175687934684003]
[null,"ME200F","MAJOR METROPOLITAN AREAS","Urban",936,3.6625061749999981,1.8270799999999996,6.19,0.51751151634906223,0.17213557057607379,7,25.522435049725395,25.522435049725395,0.2008546916847555,0.2008546916847555,1,8.4893162393162385,8.4893162393162385,3.0982905982905984E-2,3.0982905982905984E-2]
[null,"ME200G","MAJOR METROPOLITAN AREAS","Urban",1786.5,6.8893932189999969,1.928715712,5.91,1.4253645618920603,0,5,36.829928327934631,36.829928327934631,0.27857080294643499,0.27857080294643499,null,0,0,0,0]
[null,"ME231A","MAJOR METROPOLITAN AREAS","Urban",727.5,4.6264969960000011,2.1988088260000005,6.29,9.4379135736385594E-2,0,5,5.9885397370328608,5.9885397370328608,3.5280610359821087E-2,3.5280610359821087E-2,null,0,0,0,0]
[null,"ME231B","MAJOR METROPOLITAN AREAS","Urban",836,4.2126327820000027,2.1569797089999998,2.1,1.3066575900373829,0.62407268023603502,3,72.149521531100476,72.149521531100476,1.0083732057416268,1.0083732057416268,2,34.459330143540669,34.459330143540669,0.21770334928229665,0.21770334928229665]
[null,"ME231C","MAJOR METROPOLITAN AREAS","Urban",636.5,3.6703620400000001,0.7035300000000001,2.34,0.94494039404753871,0,8,68.530506838238907,68.530506838238907,1.2636816170116343,1.2636816170116343,null,0,0,0,0]
[null,"ME231D","MAJOR METROPOLITAN AREAS","Urban",1675,3.5811703309999992,1.8287922740000002,2.88,0.14390832956581923,0.49846960470116508,3,3.9659666511194032,3.9659666511194032,2.5074604091359583E-2,2.5074604091359583E-2,1,13.737313432835821,13.737313432835821,7.0447761194029845E-2,7.0447761194029845E-2]
[null,"ME231E","MAJOR METROPOLITAN AREAS","Urban",1288.5,3.8277856610000001,1.80139301,5.45,1.0744933678043368E-2,0.30311111294996534,2,0.38494373302289486,0.38494373302289486,2.3282887077997671E-3,2.3282887077997671E-3,1,10.859138533178115,10.859138533178115,4.1133100504462554E-2,4.1133100504462554E-2]
[null,"ME231F","MAJOR METROPOLITAN AREAS","Urban",1894.5,3.705481389,4.5238882559999984,3.24,2.7461654978967208E-2,7.3134871163456475E-2,3,0.66912927977420267,0.66912927977420267,3.5189549694529428E-3,3.5189549694529428E-3,2,1.7820005278437583,1.7820005278437583,7.91765637371338E-3,7.91765637371338E-3]
[null,"ME347A","MAJOR METROPOLITAN AREAS","Urban",1533,4.4409369480000018,3.3551738650000007,6.27,0.46479043635015255,1.7191893884869389,8,13.995646537088991,13.995646537088991,5.0663186742264589E-2,5.0663186742264589E-2,4,51.767775603392039,51.767775603392039,0.18330071754729288,0.18330071754729288]
[null,"ME347B","MAJOR METROPOLITAN AREAS","Urban",1091.5,4.005625644000002,3.0891673419999996,5.16,0.39888387269196929,0,5,16.869440348717362,16.869440348717362,8.0622957433192949E-2,8.0622957433192949E-2,null,0,0,0,0]
[null,"ME347C","MAJOR METROPOLITAN AREAS","Urban",2659,9.1054165789999999,1.8039191119999998,3.12,0.89235593787720779,1.7407225821885017,15,15.491651474062152,15.491651474062152,0.15206210894499175,0.15206210894499175,3,30.219631440391126,30.219631440391126,0.1226024821361414,0.1226024821361414]
[null,"ME347E","MAJOR METROPOLITAN AREAS","Urban",240.5,1.4995924580000002,1.5140363630000002,10.69,0.29747872506011158,0,4,57.097720203677255,57.097720203677255,0.46569646569646572,0.46569646569646572,null,0,0,0,0]
[null,"ME347F","MAJOR METROPOLITAN AREAS","Urban",872,5.8661504790000016,1.7862808609999998,2.69,0.28307260412327651,0.19401537504144437,8,14.985087823430332,14.985087823430332,0.214067251310436,0.214067251310436,1,10.270642201834862,10.270642201834862,2.2935779816513763E-3,2.2935779816513763E-3]
[null,"ME347G","MAJOR METROPOLITAN AREAS","Urban",1520,6.6592999720000021,1.52999,4.99,2.5484121691080808,0,12,77.39341663561369,77.39341663561369,1.0298245260590002,1.0298245260590002,null,0,0,0,0]
[null,"ME347H","MAJOR METROPOLITAN AREAS","Urban",1,0,3.1395399999999998,5.6,4.592592620454021E-3,0,1,212,212,1,1,null,0,0,0,0]
[null,"ME427A","MAJOR METROPOLITAN AREAS","Urban",423,3.634338478000001,3.752404249,3.39,1.3116184565943827,0.59088469960143331,5,143.13475177304966,143.13475177304966,1.2340425531914894,1.2340425531914894,5,64.482269503546092,64.482269503546092,0.22222222222222221,0.22222222222222221]
[null,"ME427B","MAJOR METROPOLITAN AREAS","Urban",161,1.4302888179999993,2.2142600000000003,3.51,0.95848692772097943,0.76445003957821456,12,274.81362156838367,274.81362156838367,2.2401653372723134,2.2401653372723134,7,219.18012422360249,219.18012422360249,0.58385093167701863,0.58385093167701863]
[null,"ME427C","MAJOR METROPOLITAN AREAS","Urban",113.5,0.60284231200000005,4.1027278910000007,2.48,1.0901775048666422,5.9790356756854231E-3,4,443.3832599118943,443.3832599118943,2.8193832599118944,2.8193832599118944,1,2.4317180616740086,2.4317180616740086,1.7621145374449341E-2,1.7621145374449341E-2]
[null,"ME427D","MAJOR METROPOLITAN AREAS","Urban",1050,3.9314442750000009,3.9236440400000001,7.39,4.285452157374789,0.98862055107094182,4,188.40190476190477,188.40190476190477,1.9276190476190476,1.9276190476190476,2,43.462857142857146,43.462857142857146,9.9047619047619051E-2,9.9047619047619051E-2]
[null,"ME427E","MAJOR METROPOLITAN AREAS","Urban",2321,8.9399232579999985,2.7795599999999987,4.46,17.503099461352804,2.0667533318952609,14,348.11100856480238,348.11100856480238,2.6001722885585457,2.6001722885585457,4,41.104696251615685,41.104696251615685,0.15252046531667385,0.15252046531667385]
[null,"ME427F","MAJOR METROPOLITAN AREAS","Urban",1668.5,9.5199852820000022,3.1103302469999998,3.96,4.8809944391148905,1.4423123777226803,5,135.03925681750076,135.03925681750076,0.96314054540005989,0.96314054540005989,5,39.903506143242431,39.903506143242431,0.1492358405753671,0.1492358405753671]
[null,"MG02","SOUTH EAST","Rural Long",145.5,48.603769999999962,2.0748699999999998,7.39,0.93277062270366329,0.15842658140520111,8,363.98625429553266,351.47766323024052,3.0515463917525771,2.0893470790378008,3,61.821305841924399,61.821305841924399,0.19243986254295534,0.19243986254295534]
[null,"MG03","SOUTH EAST","Rural Short",364.5,61.283414015999981,0.50596999999999992,0.32,5.3600815884252331,0.19385874669983985,12,756.43346993717148,756.43346993717148,4.7681757609049482,4.7681757609049482,3,27.358024691358025,27.358024691358025,8.2304526748971193E-2,8.2304526748971193E-2]
[null,"MG04","SOUTH EAST","Rural Short",677,54.150905230999982,5.1573700000000011,0.68,1.2781159911703777,0.18223344279625941,11,97.113245644280624,97.113245644280624,1.3042836360659051,1.3042836360659051,6,13.846381093057607,13.846381093057607,7.6809453471196457E-2,7.6809453471196457E-2]
[null,"MG05","SOUTH EAST","Rural Long",528.5,70.641427953999951,5.3122470030000004,1.94,0.69894391489733732,8.1899233300076184E-3,6,75.087985555744439,62.518449131903381,1.8429517538455036,0.87606433662696048,1,0.87984862819299903,0.87984862819299903,5.6764427625354778E-3,5.6764427625354778E-3]
[null,"MG06","SOUTH EAST","Rural Short",394,63.001239999999996,2.9993599999999998,3.81,2.1906699347537963,0.30437689501397841,9,286.007614213198,273.33756345177665,3.015228426395939,2.0406091370558377,8,39.738578680203048,39.738578680203048,0.24111675126903553,0.24111675126903553]
[null,"MG07","SOUTH EAST","Rural Short",276,30.776190000000014,1.3073899999999998,1.39,2.2052890460171617,0,3,411.01086956521738,411.01086956521738,1.7391304347826086,1.7391304347826086,null,0,0,0,0]
[null,"MG09","SOUTH EAST","Rural Short",347.5,46.95779999999997,1.5670299999999997,2.06,1.5669211898405186,3.5964568932481326E-3,7,231.94724255019813,231.94724255019813,3.5923263110702846,3.5923263110702846,1,0.53237410071942448,0.53237410071942448,1.4388489208633094E-2,1.4388489208633094E-2]
[null,"MG10","SOUTH EAST","Rural Long",414,61.319680000000012,4.1483999999999996,0.9,0.1419293204312114,9.1128308192385835E-2,7,19.464573809490112,6.935588302243735,1.0322061253054706,6.8438009363441646E-2,4,12.497584541062801,12.497584541062801,7.2463768115942032E-2,7.2463768115942032E-2]
[null,"MG11","SOUTH EAST","Rural Short",1456,59.779674356000022,9.5666099999999989,1.6,0.99230461261535063,0.25231575144577034,16,35.057464610089312,22.566393181517885,1.1250000130180473,0.16414836466639907,5,8.9141483516483522,8.9141483516483522,0.22321428571428573,0.22321428571428573]
[null,"MG12","SOUTH EAST","Rural Long",275,41.211370000000009,0.26086999999999999,3.05,3.4545096605972136,1.6573586781800362E-2,7,713.22545454545457,713.22545454545457,5.3927272727272726,5.3927272727272726,5,3.4218181818181819,3.4218181818181819,2.181818181818182E-2,2.181818181818182E-2]
[null,"MG13","SOUTH EAST","Rural Short",129.5,70.518029999999982,3.4716900000000002,0.61,0.37281973634406979,6.8429882509369877E-3,4,148.09008954022383,135.64221309234736,1.9742599684299189,1.0167310109009613,1,2.718146718146718,2.718146718146718,1.5444015444015444E-2,1.5444015444015444E-2]
[null,"MG14","SOUTH EAST","Rural Long",51.5,40.109580000000015,0,0.9,0.61630494013683135,0.10863537010642361,5,679.45631067961165,679.45631067961165,4.6601941747572813,4.6601941747572813,2,119.76699029126213,119.76699029126213,1.0679611650485437,1.0679611650485437]
[null,"MG15","SOUTH EAST","Rural Short",26,15.921169999999996,0,0.08,3.1337775740086428E-2,0,2,62,62,1.1538461538461537,1.1538461538461537,null,0,0,0,0]
[null,"MG16","SOUTH EAST","Rural Long",29.5,23.263039999999993,1.0363800000000001,0.11,0.13098593516587048,4.9315667363486731E-4,6,252.10169510922191,239.76271205837443,5.5932205329507081,4.6440679905778275,1,0.94915254237288138,0.94915254237288138,0.94915254237288138,0.94915254237288138]
[null,"MG17","SOUTH EAST","Rural Long",930.5,48.66005999999998,3.2469800000000006,0.9,17.801693924337279,2.0011769433952593,24,1086.2206852895993,1073.6328292981966,7.0585709945416335,6.0902743798183661,7,122.10746910263299,122.10746910263299,1.6077377753895754,1.6077377753895754]
[null,"MG18","SOUTH EAST","Rural Long",52.5,29.625639999999997,0,2.27,0.36019811187523826,1.2328916840871683E-3,4,389.54285714285714,376.91428571428571,3.8857142857142857,2.9142857142857141,1,1.3333333333333333,1.3333333333333333,1.9047619047619049E-2,1.9047619047619049E-2]
[null,"MG19","SOUTH EAST","Rural Long",208,61.331449999999997,3.7539900000000004,0.09,3.4862125894150355,0.28067659825161589,13,951.62019225267261,939.62019225267261,6.1057693631603165,5.182692440083394,6,76.615384615384613,76.615384615384613,1.3028846153846154,1.3028846153846154]
[null,"MG20","SOUTH EAST","Rural Long",56,28.753519999999995,0,2.5499999999999998,0.7836142127090171,2.3160750922494661E-2,7,794.48809536865781,782.41666679722925,5.452381082943508,4.5238096543720792,4,23.482142857142858,23.482142857142858,1.0357142857142858,1.0357142857142858]
[null,"MG21","SOUTH EAST","Rural Long",74.5,36.550969999999971,0,0.06,1.3057731955062353,0.4777455275837777,10,995.14093971252441,983.27516790044388,7.9463088400411923,7.0335571621888437,15,364.09395973154363,364.09395973154363,1.2080536912751678,1.2080536912751678]
[null,"MG22","SOUTH EAST","Rural Long",1019.5,55.825240698999998,2.0840600000000005,0.17,5.8936801445837386,0,11,328.2255987491954,328.2255987491954,1.8518881617719605,1.8518881617719605,null,0,0,0,0]
[null,"MG23","SOUTH EAST","Rural Short",261.5,4.1119480480000004,1.2110999999999998,2.34,2.5097437022612645E-2,2.4339265028900877E-2,2,4.9369024856596555,4.9369024856596555,0.9674952198852772,0.9674952198852772,1,4.7877629063097515,4.7877629063097515,3.8240917782026767E-3,3.8240917782026767E-3]
[null,"MG24","SOUTH EAST","Rural Short",51,39.984829999999988,0,1.03,0.53997398198302771,5.4821667237620175E-3,3,544.62745098039215,544.62745098039215,2.5098039215686274,2.5098039215686274,2,5.5294117647058822,5.5294117647058822,5.8823529411764705E-2,5.8823529411764705E-2]
[null,"MG25","SOUTH EAST","Rural Long",27.5,15.452720000000001,0,0.11,0.13741458459428058,0.19583603764807464,8,283.70909097844907,271.8909091602672,6.7636364329944954,5.8545455239035871,7,404.32727272727271,404.32727272727271,2.2181818181818183,2.2181818181818183]
[null,"MG26","SOUTH EAST","Rural Long",34,31.665550000000007,0.26124999999999998,0.08,0.27285655962677424,0,3,455.64708754595586,455.64708754595586,2.2352942017947925,2.2352942017947925,null,0,0,0,0]
[null,"MG27","SOUTH EAST","Rural Long",101,62.46202999999997,0,0.44,1.2152789555524066,3.0646164718738183E-3,7,683.16832234599804,683.16832234599804,5.0561056892470555,5.0561056892470555,1,1.7227722772277227,1.7227722772277227,1.9801980198019802E-2,1.9801980198019802E-2]
[null,"MG28","SOUTH EAST","Rural Long",82,60.05372999999998,0.59026000000000001,0.51,0.43344949064836019,1.1448279923666563E-3,2,300.1219512195122,300.1219512195122,0.97560975609756095,0.97560975609756095,1,0.79268292682926833,0.79268292682926833,1.2195121951219513E-2,1.2195121951219513E-2]
[null,"MG29","SOUTH EAST","Rural Long",129.5,80.617079999999973,0.43570999999999999,1.03,1.0015659485758326,0,5,439.11967792290056,439.11967792290056,2.1956241301127841,2.1956241301127841,null,0,0,0,0]
[null,"MG30","SOUTH EAST","Rural Long",69,35.886930000000007,0.9835600000000001,0,0.55009278599572975,0.39871717063379025,7,452.64734316563261,439.83574896273404,6.1256040351978243,5.1400967888210127,3,328.08695652173913,328.08695652173913,2,2]
[null,"MG31","SOUTH EAST","Rural Long",97,38.155080000000012,0,0.17,1.3623864075185503,0.15256153953661503,8,797.4467355197238,785.25085923106406,6.5601375815794638,5.6219932516825564,5,89.298969072164951,89.298969072164951,0.73195876288659789,0.73195876288659789]
[null,"MG32","SOUTH EAST","Rural Long",263.5,18.232419999999998,0.19829000000000002,0.13,2.5578744733818612,9.0705602472127389E-2,18,551.15242812574706,538.96646987147756,7.4168250447658703,6.4794436405912972,2,19.54459203036053,19.54459203036053,1.0815939278937381,1.0815939278937381]
[null,"MG33","SOUTH EAST","Rural Long",64,30.993820000000014,0.14749999999999999,0.48,0.37030782368475301,0,6,328.515625,315.71875,5.90625,4.921875,null,0,0,0,0]
[null,"MG34","SOUTH EAST","Rural Long",159,53.01386999999999,7.3032700000000004,0.17,1.4046628569183526,0.12047113027366044,17,501.58910091568089,489.07966695341673,6.1991616195102903,5.2368974685668945,1,43.018867924528301,43.018867924528301,0.11949685534591195,0.11949685534591195]
[null,"MG36","SOUTH EAST","Rural Long",164,17.864180000000001,0.87351000000000001,3.05,2.8689448206346606,3.1984732832889967E-2,8,993.23374013202942,980.78861818080998,6.5020328149562925,5.544715741785561,2,11.073170731707316,11.073170731707316,0.95731707317073167,0.95731707317073167]
[null,"MG37","SOUTH EAST","Rural Long",114,22.670349999999992,0,0.11,1.059623432443987,1.0505998422257083,12,527.73976472386141,515.08186998701933,7.3333335424724382,6.3596493319461223,2,523.24561403508767,523.24561403508767,1.9385964912280702,1.9385964912280702]
[null,"MG38","SOUTH EAST","Rural Short",890,18.977564406999999,5.5845999999999991,0.15,0.50500086873463101,0,3,29.187640449438202,16.479775280898878,1.9561797752808989,0.97865168539325842,null,0,0,0,0]
[null,"MG39","MAJOR METROPOLITAN AREAS","Rural Short",1099.5,4.4410605660000018,5.5986400429999996,2.8,4.0435811187614662E-2,3.500985542963043,2,1.891767653620964,1.891767653620964,1.0914043168037143E-2,1.0914043168037143E-2,2,163.79172351068667,163.79172351068667,0.42837653478854026,0.42837653478854026]
[null,"MG40","MAJOR METROPOLITAN AREAS","Urban",1,1.1089199999999999,0.11195000000000001,4.34,2.8162124559387864E-4,0,1,13,0,1,0,null,0,0,0,0]
[null,"MG41","MAJOR METROPOLITAN AREAS","Urban",1761,7.983734275999999,11.120280000000001,5.03,0.53627179352921417,0.54346401447797177,5,14.057352528526053,1.4116966511836344,0.98618208123228213,1.3439321436711414E-2,2,14.245883021010789,14.245883021010789,4.8835888699602502E-2,4.8835888699602502E-2]
[null,"MG42","MAJOR METROPOLITAN AREAS","Rural Short",1382,11.580511619999998,12.626939999999999,3.33,1.5124559259173227E-2,0,2,0.56295224312590453,0.56295224312590453,2.1707670043415342E-3,2.1707670043415342E-3,null,0,0,0,0]
[null,"MG43","MAJOR METROPOLITAN AREAS","Urban",1580.5,8.4960632250000039,2.2392099999999999,2.72,2.1606415225417126,0,9,63.105346409364124,50.553622271433092,1.9341980385953812,0.96868079721607081,null,0,0,0,0]
[null,"MG44","MAJOR METROPOLITAN AREAS","Urban",1643.5,9.6719645480000001,2.3871200000000004,5.35,5.3290033256255978,0.50089588004782004,10,149.67670712008243,149.67670712008243,1.0013183245200945,1.0013183245200945,3,14.068755704289625,14.068755704289625,0.10891390325524794,0.10891390325524794]
[null,"MG45","MAJOR METROPOLITAN AREAS","Urban",1090.5,5.2750427319999993,3.9608699999999999,5.41,0.31665059591120953,0,6,13.403943145346171,0.91059147180192568,0.96561210453920221,4.585052728106373E-3,null,0,0,0,0]
[null,"MG46","MAJOR METROPOLITAN AREAS","Rural Short",1476.5,9.4947679020000013,4.0166120639999994,4.34,5.1463224663951541,0,11,179.29179419398994,179.29179419398994,2.570493616050193,2.570493616050193,null,0,0,0,0]
[null,"MG48","SOUTH EAST","Rural Long",103,12.913909999999998,0,4.12,1.0538229738297868,0.64381603743031923,8,580.90291288986941,568.53398085103447,6.4951458995782057,5.5436895888985935,4,354.89320388349512,354.89320388349512,2.029126213592233,2.029126213592233]
[null,"MG49","SOUTH EAST","Rural Long",51.5,21.24015,0,0.13,0.48197258727229109,2.007852171227674E-2,7,531.35922604162715,518.2330124493941,4.8220066700166866,3.8122979321526094,3,22.135922330097088,22.135922330097088,0.17475728155339806,0.17475728155339806]
[null,"MG50","SOUTH EAST","Urban",29.5,1.0277945639999999,0.26101000000000008,0.18,3.3924528507693376E-2,0,2,53.084745762711862,41.186440677966104,1.8305084745762712,0.9152542372881356,null,0,0,0,0]
[null,"MG51","SOUTH EAST","Rural Long",14.5,0.64522999999999997,0,2.59,0.29094482477341488,3.3640330237235588E-2,8,1139.2413795734274,1126.6896554354964,6.9655175044618804,6.00000026308257,2,131.72413793103448,131.72413793103448,2,2]
[null,"MG52","MAJOR METROPOLITAN AREAS","Urban",1783.5,12.819399916000009,5.2804099999999989,0.21,4.4789475851984664,0.18290216742685517,14,115.92598742117961,103.19932636146557,1.9719652309449809,0.99299130327466956,3,4.7339500981216709,4.7339500981216709,3.476310625175217E-2,3.476310625175217E-2]
[null,"MI01","SOUTH EAST","Rural Long",847.5,11.241680000000004,0.82945000000000002,6.1,2.8276370774539203,0,7,189.43362831858408,189.43362831858408,1.1162241887905604,1.1162241887905604,null,0,0,0,0]
[null,"MI02","SOUTH EAST","Rural Short",238.5,45.744819999999997,0.59326999999999996,1.85,1.8329552942237954,0.10565807143137082,9,395.33053339352398,382.90286043754912,4.013976171081671,3.0580013283143752,6,22.788259958071279,22.788259958071279,2.9685534591194966,2.9685534591194966]
[null,"MI03","SOUTH EAST","Rural Long",106.5,49.28084000000004,0,0.54,1.4701352695822276,8.1370851149753093E-3,6,783.75586854460096,783.75586854460096,4.657276995305164,4.657276995305164,5,4.3380281690140849,4.3380281690140849,4.6948356807511735E-2,4.6948356807511735E-2]
[null,"MI04","SOUTH EAST","Rural Long",52.5,23.692670000000007,0,0.1,0.5677994587371733,2.8374121472348971E-2,5,614.05714285714282,614.05714285714282,4.666666666666667,4.666666666666667,7,30.685714285714287,30.685714285714287,0.2857142857142857,0.2857142857142857]
[null,"MI05","SOUTH EAST","Rural Long",55,22.285650000000004,0,0.08,0.29404466665478962,2.5186215832066434E-2,1,303.54545454545456,303.54545454545456,0.96363636363636362,0.96363636363636362,5,26,26,0.21818181818181817,0.21818181818181817]
[null,"MI06","SOUTH EAST","Rural Long",60,31.159849999999999,0,7.0000000000000007E-2,0.22049387132981799,2.7722450153617181E-2,2,208.65,208.65,1.0166666666666666,1.0166666666666666,4,26.233333333333334,26.233333333333334,0.4,0.4]
[null,"MI07","SOUTH EAST","Rural Long",80,76.979749999999925,0,7.0000000000000007E-2,0.41951781461817511,0.17064982181600821,2,297.73750000000001,297.73750000000001,0.95,0.95,5,121.1125,121.1125,0.95,0.95]
[null,"MI08","SOUTH EAST","Rural Long",1142,13.443160000000006,4.3502399999999994,0.08,7.4483918299191849,0.51793779648501936,13,370.31348559484798,370.31348559484798,2.2443082462050241,2.2443082462050241,2,25.750437828371279,25.750437828371279,0.9728546409807356,0.9728546409807356]
[null,"MI09","SOUTH EAST","Rural Long",57,44.265269999999958,0,2.44,0.55011626943969449,1.6327008444982929E-2,3,547.96491228070181,547.96491228070181,2.736842105263158,2.736842105263158,4,16.263157894736842,16.263157894736842,0.12280701754385964,0.12280701754385964]
[null,"MI10","SOUTH EAST","Rural Long",61,50.190779999999975,0,0.04,0.37110039691023761,1.2276078625839376E-2,3,345.40983606557376,345.40983606557376,2.4098360655737703,2.4098360655737703,4,11.426229508196721,11.426229508196721,0.11475409836065574,0.11475409836065574]
[null,"MI11","SOUTH EAST","Rural Long",52.5,50.548029999999997,0,0.06,1.6616914118126853,2.4023775101355678E-2,7,1797.0666666666666,1797.0666666666666,6.1333333333333337,6.1333333333333337,2,25.980952380952381,25.980952380952381,0.53333333333333333,0.53333333333333333]
[null,"MI12","SOUTH EAST","Rural Long",157,50.862480000000026,0.18026,0.06,0.8371510662335313,0.70686964070220593,2,302.74522292993629,302.74522292993629,1.8980891719745223,1.8980891719745223,16,255.63057324840764,255.63057324840764,0.86624203821656054,0.86624203821656054]
[null,"MI13","SOUTH EAST","Rural Long",385.5,9.3268800000000027,0.9543299999999999,0.21,2.1183368788602284,2.007852171227674E-2,3,311.99221789883268,311.99221789883268,1.9714656290531778,1.9714656290531778,1,2.9571984435797667,2.9571984435797667,1.0376134889753566E-2,1.0376134889753566E-2]
[null,"MI14","SOUTH EAST","Rural Long",629.5,20.44641,0.31516,2.8,3.8117897790373028,0.43986052740561349,11,343.80035715504619,343.80035715504619,1.2560232686150601,1.2560232686150601,2,39.67275615567911,39.67275615567911,0.1318506751389992,0.1318506751389992]
[null,"MI15","SOUTH EAST","Rural Long",137,62.000080000000011,0,1.18,1.3029727699583518,2.9061018267768968E-2,6,539.99270072992704,539.99270072992704,2.4744525547445257,2.4744525547445257,7,12.043795620437956,12.043795620437956,0.10948905109489052,0.10948905109489052]
[null,"MI16","SOUTH EAST","Rural Long",303,22.549469999999985,0.7525400000000001,0.13,2.1113565646098746,1.4885405811518146,15,395.63260092908399,395.63260092908399,3.8591865417849767,3.8591865417849767,6,278.92739273927396,278.92739273927396,1.3960396039603959,1.3960396039603959]
[null,"MI17","SOUTH EAST","Rural Long",108,71.735169999999982,1.2871400000000002,0.52,0.52072060914338758,2.2086373883504415E-2,5,273.75,273.75,0.7592592592592593,0.7592592592592593,5,11.611111111111111,11.611111111111111,0.10185185185185185,0.10185185185185185]
[null,"MI18","SOUTH EAST","Rural Long",40,25.432119999999987,0,0.16,0.17640918725452967,2.7299744433358724E-3,1,250.4,250.4,0.8,0.8,1,3.875,3.875,2.5000000000000001E-2,2.5000000000000001E-2]
[null,"MI19","SOUTH EAST","Rural Long",98,51.405349999999991,0.15028,7.0000000000000007E-2,1.3349398900528975,1.8669502644748548E-3,3,773.40816326530614,773.40816326530614,2.7857142857142856,2.7857142857142856,1,1.0816326530612246,1.0816326530612246,1.020408163265306E-2,1.020408163265306E-2]
[null,"MI20","SOUTH EAST","Rural Long",816.5,33.678760000000011,1.27539,0.1,2.3388190117686385,0.17655008916128251,7,162.63482367006898,162.63482367006898,2.9899979607137666,2.9899979607137666,4,12.276791181873852,12.276791181873852,8.6956521739130432E-2,8.6956521739130432E-2]
[null,"MI21","SOUTH EAST","Rural Long",69.5,32.432700000000018,6.1869999999999994E-2,2.06,1.105146503896105,2.1152898751266989E-2,6,902.83454137568856,902.83454137568856,4.7577938793374477,4.7577938793374477,2,17.280575539568346,17.280575539568346,0.25899280575539568,0.25899280575539568]
[null,"MI22","SOUTH EAST","Rural Long",184.5,2.0512100000000002,9.7750000000000004E-2,0.09,0.63176892440295318,0,1,194.41734417344173,194.41734417344173,0.92140921409214094,0.92140921409214094,null,0,0,0,0]
[null,"MI23","SOUTH EAST","Rural Long",102,67.000650000000007,0,0.38,2.0176976919620273,0.62902133722127318,4,1123.1274509803923,1123.1274509803923,3.7549019607843137,3.7549019607843137,10,350.13725490196077,350.13725490196077,1.3333333333333333,1.3333333333333333]
[null,"MI24","SOUTH EAST","Rural Long",44.5,40.497449999999965,0,0.11,0.63537953576349426,6.2349093738122505E-3,4,810.67415730337075,810.67415730337075,3.50561797752809,3.50561797752809,2,7.9550561797752808,7.9550561797752808,6.741573033707865E-2,6.741573033707865E-2]
[null,"MI25","SOUTH EAST","Rural Long",28.5,5.4871000000000008,0,0.06,0.31606058958491762,0,4,629.64912280701753,629.64912280701753,2.8771929824561404,2.8771929824561404,null,0,0,0,0]
[null,"MI26","SOUTH EAST","Rural Long",83,68.89106000000001,0,7.0000000000000007E-2,1.2401305195465944,0.75826361119029662,4,848.32530120481931,848.32530120481931,2.6867469879518073,2.6867469879518073,11,518.69879518072287,518.69879518072287,1.9156626506024097,1.9156626506024097]
[null,"MI28","SOUTH EAST","Rural Long",58.5,39.829320000000038,0,0.08,0.19324696511149159,8.1370851149753093E-3,1,187.55555555555554,187.55555555555554,0.88888888888888884,0.88888888888888884,1,7.8974358974358978,7.8974358974358978,0.10256410256410256,0.10256410256410256]
[null,"MI29","SOUTH EAST","Rural Short",1,2.3433700000000002,1.45486,0.04,8.3204516232983829E-3,1.9440307531070986E-5,2,428,428,2,2,1,1,1,1,1]
[null,"MI30","SOUTH EAST","Rural Long",43,36.983239999999995,0,1.44,0.23597546833428401,2.4851573803528492E-2,2,311.58139534883719,311.58139534883719,1.9534883720930232,1.9534883720930232,6,32.813953488372093,32.813953488372093,0.30232558139534882,0.30232558139534882]
[null,"MI31","SOUTH EAST","Rural Long",49,44.584589999999977,0,0.05,0.25844932246135865,2.7141229788261802E-2,2,299.46938775510205,299.46938775510205,1.8775510204081634,1.8775510204081634,7,31.448979591836736,31.448979591836736,0.24489795918367346,0.24489795918367346]
[null,"MI32","SOUTH EAST","Rural Long",1195.5,31.486650000000019,0.44674999999999998,0.1,0.14230501817852809,4.2481924885974999E-2,9,6.7583978095347845,6.7583978095347845,5.2418785781254099E-2,5.2418785781254099E-2,3,2.0175658720200751,2.0175658720200751,1.2547051442910916E-2,1.2547051442910916E-2]
[null,"MI33","SOUTH EAST","Rural Long",50,42.80155000000002,0,2.34,0.27537516401004108,0,2,312.7,312.7,1.98,1.98,null,0,0,0,0]
[null,"MT01","BAROSSA/MID NORTH & YORKE PENINSULA/RIVE","Rural Long",605,79.479609999999994,3.1529099999999999,0.08,0.56497545544799899,8.143020607797272,10,53.020927794905752,53.020927794905752,0.33443526380975069,0.33443526380975069,16,764.19338842975208,764.19338842975208,1.8479338842975206,1.8479338842975206]
[null,"MT02","BAROSSA/MID NORTH & YORKE PENINSULA/RIVE","Rural Long",142.5,60.245850000000011,1.10043,1.47,2.3072687230774151E-3,2.5987067044572774,1,0.91929824561403506,0.91929824561403506,7.0175438596491229E-3,7.0175438596491229E-3,4,1035.4175438596492,1035.4175438596492,2.736842105263158,2.736842105263158]
[null,"MT03","BAROSSA/MID NORTH & YORKE PENINSULA/RIVE","Rural Long",242.5,24.907499999999995,0.10739,0.1,0.1120874668218677,2.5406551188751161,1,26.243298969072164,26.243298969072164,0.30515463917525776,0.30515463917525776,6,594.84948453608251,594.84948453608251,1.4721649484536083,1.4721649484536083]
[null,"MT06","BAROSSA/MID NORTH & YORKE PENINSULA/RIVE","Rural Long",1050,13.226570000000002,1.9901299999999997,0.91,0.43698963493058118,2.4494035215143213,6,23.629522937593006,23.629522937593006,0.42476188114711216,0.42476188114711216,5,132.44761904761904,132.44761904761904,0.47047619047619049,0.47047619047619049]
[null,"MT07","BAROSSA/MID NORTH & YORKE PENINSULA/RIVE","Rural Long",123,40.602869999999996,0,2.19,7.6087029646522385E-3,1.7197958356098793,1,3.5121951219512195,3.5121951219512195,0.13008130081300814,0.13008130081300814,2,793.86178861788619,793.86178861788619,1.8130081300813008,1.8130081300813008]
[null,"MT08","BAROSSA/MID NORTH & YORKE PENINSULA/RIVE","Rural Long",730.5,6.0764199999999979,3.1141499999999995,0.22,0,5.0196304280691856E-2,null,0,0,0,0,1,3.9014373716632442,3.9014373716632442,1.3689253935660506E-2,1.3689253935660506E-2]
[null,"MT09","BAROSSA/MID NORTH & YORKE PENINSULA/RIVE","Rural Long",73,60.815930000000037,0.28228000000000003,1.3,0.1999398056822505,0,1,155.50684931506851,155.50684931506851,0.90410958904109584,0.90410958904109584,null,0,0,0,0]
[null,"MT10","BAROSSA/MID NORTH & YORKE PENINSULA/RIVE","Rural Long",100,5.3812400000000009,9.0400000000000008E-2,0.08,3.194947940629965E-2,6.4814877106296846E-3,2,18.1399841308594,18.1399841308594,9.6666584014892601E-2,9.6666584014892601E-2,1,3.68,3.68,0.02,0.02]
[null,"MT11","BAROSSA/MID NORTH & YORKE PENINSULA/RIVE","Rural Long",76,71.026299999999992,0.24434999999999998,0.1,5.389497933295336E-3,0.54493812436652833,1,4.0263157894736841,4.0263157894736841,2.6315789473684209E-2,2.6315789473684209E-2,1,407.10526315789474,407.10526315789474,0.89473684210526316,0.89473684210526316]
[null,"MT12","BAROSSA/MID NORTH & YORKE PENINSULA/RIVE","Rural Long",78.5,69.594280000000012,0.18833000000000003,0.09,0.18725863407449675,0.54481483519811957,4,135.43949044585986,135.43949044585986,0.92993630573248409,0.92993630573248409,4,394.05095541401272,394.05095541401272,0.90445859872611467,0.90445859872611467]
[null,"MT14","BAROSSA/MID NORTH & YORKE PENINSULA/RIVE","Rural Short",92.5,83.654160000000033,9.7439999999999999E-2,0.09,0.41516720763355197,0.11133464123044354,3,230.87567567567567,230.87567567567567,0.94054054054054059,0.94054054054054059,1,61.913513513513514,61.913513513513514,0.89729729729729735,0.89729729729729735]
[null,"MT15","BAROSSA/MID NORTH & YORKE PENINSULA/RIVE","Rural Long",50,44.967659999999988,0.32232,0.11,0.76233215374778429,3.7691260056379144E-3,2,865.66,865.66,1.84,1.84,1,4.28,4.28,0.04,0.04]
[null,"MT16","BAROSSA/MID NORTH & YORKE PENINSULA/RIVE","Rural Long",121.5,54.145550000000014,0,0.05,0,2.4017610642935243,null,0,0,0,0,6,1122.3456790123457,1122.3456790123457,2.9958847736625516,2.9958847736625516]
[null,"MT17","BAROSSA/MID NORTH & YORKE PENINSULA/RIVE","Rural Short",356,3.9369299999999994,0,0.09,7.0957122488409102E-2,0.27228094728018026,1,10.252808988764045,10.252808988764045,0.1404494382022472,0.1404494382022472,1,39.342696629213485,39.342696629213485,0.13202247191011235,0.13202247191011235]
[null,"MT18","BAROSSA/MID NORTH & YORKE PENINSULA/RIVE","Rural Long",73,67.818680000000029,0.28781000000000001,0.46,1.4621566991123494,0.95522686409239377,8,1137.2191780821918,1137.2191780821918,4.506849315068493,4.506849315068493,7,742.94520547945206,742.94520547945206,2.6849315068493151,2.6849315068493151]
[null,"MT19","BAROSSA/MID NORTH & YORKE PENINSULA/RIVE","Rural Long",75,63.147289999999998,0,0.08,0.23734926192512398,1.0177168597372692,5,179.68,179.68,1.96,1.96,3,770.44,770.44,1.8,1.8]
[null,"MT20","BAROSSA/MID NORTH & YORKE PENINSULA/RIVE","Rural Long",11,8.2416400000000003,0,0.11,6.3934240189091728E-3,0,1,33,33,1,1,null,0,0,0,0]
[null,"MT21","BAROSSA/MID NORTH & YORKE PENINSULA/RIVE","Rural Long",215.5,2.895519999999999,0,0.03,7.9081195165019783E-3,0,1,2.0835266821345706,2.0835266821345706,4.6403712296983757E-3,4.6403712296983757E-3,null,0,0,0,0]
[null,"MT22","BAROSSA/MID NORTH & YORKE PENINSULA/RIVE","Rural Long",546,15.73969,0.9178400000000001,0.43,2.8708763500886916E-3,4.2322881858727754,1,0.29853479853479853,0.29853479853479853,1.8315018315018315E-3,1.8315018315018315E-3,1,440.10439560439562,440.10439560439562,0.9505494505494505,0.9505494505494505]
[null,"MT23","BAROSSA/MID NORTH & YORKE PENINSULA/RIVE","Rural Long",139.5,36.408420000000021,8.832000000000001E-2,1.47,0,1.1253483037580789,null,0,0,0,0,1,458.02150537634407,458.02150537634407,0.989247311827957,0.989247311827957]
[null,"MT24","BAROSSA/MID NORTH & YORKE PENINSULA/RIVE","Rural Long",65,2.5201600000000002,0.34491000000000005,0.09,0,5.882654606930203E-2,null,0,0,0,0,2,51.384615384615387,51.384615384615387,0.35384615384615387,0.35384615384615387]
[null,"MT25","BAROSSA/MID NORTH & YORKE PENINSULA/RIVE","Rural Long",80.5,82.15827000000003,0.57906999999999997,0.3,9.8983589493855523E-3,4.6497629228430346E-3,2,6.9813664596273295,6.9813664596273295,9.9378881987577633E-2,9.9378881987577633E-2,3,3.2795031055900621,3.2795031055900621,3.7267080745341616E-2,3.7267080745341616E-2]
[null,"MT26","BAROSSA/MID NORTH & YORKE PENINSULA/RIVE","Rural Long",94,22.378890000000006,0,0.1,0,0.30274535939677621,null,0,0,0,0,3,182.86170212765958,182.86170212765958,0.5957446808510638,0.5957446808510638]
[null,"MTB10","MAJOR METROPOLITAN AREAS","Urban",745,4.8323927770000008,3.457850000000001,0.94,0.4117301552810399,2.5582040686293173,5,25.511402841862417,25.511402841862417,0.17181205749511719,0.17181205749511719,3,158.51006711409397,158.51006711409397,0.19328859060402684,0.19328859060402684]
[null,"MTB11","MAJOR METROPOLITAN AREAS","Rural Short",1928,27.887225308999994,13.305911660000001,6.03,1.0413853145913934,1.015250620502651,7,27.784417012915085,27.784417012915085,0.66096158657496062,0.66096158657496062,9,27.087136929460581,27.087136929460581,0.23962655601659752,0.23962655601659752]
[null,"MTB12","EASTERN HILLS/FLEURIEU PENINSULA","Rural Short",2001,42.863005449999996,29.123586059999994,5.28,6.9013091735302002E-3,1.348826857428298,2,0.1774112943528236,0.1774112943528236,9.9950024987506244E-4,9.9950024987506244E-4,8,34.674162918540731,34.674162918540731,0.13743128435782109,0.13743128435782109]
[null,"MTB13","MAJOR METROPOLITAN AREAS","Rural Short",3307,89.581524953999988,49.247911855000012,8.2200000000000006,23.264513934703988,1.0146090903541258,23,361.87339717656204,361.87339717656204,1.9222860411282641,1.9222860411282641,12,15.781977623223465,15.781977623223465,8.376171756879347E-2,8.376171756879347E-2]
[null,"MTB14","EASTERN HILLS/FLEURIEU PENINSULA","Rural Short",212.5,26.007665341999999,4.0806400000000007,6.8,2.6224975811614883,1.8535166812424322,8,634.82355246151189,634.82355246151189,3.2658825189927043,3.2658825189927043,5,448.67764705882354,448.67764705882354,1.3505882352941176,1.3505882352941176]
[null,"MTB15","MAJOR METROPOLITAN AREAS","Urban",403,0.52687475700000008,5.2004299999999981,0.75,3.3144654289125712E-3,0.13065059478282168,1,0.37965260545905705,0.37965260545905705,2.4813895781637717E-3,2.4813895781637717E-3,1,14.965260545905707,14.965260545905707,9.1811414392059559E-2,9.1811414392059559E-2]
[null,"MTB21","EASTERN HILLS/FLEURIEU PENINSULA","Rural Short",1275,23.67738465499999,5.3178721739999997,4.68,2.3783271426663544,1.0694307575917459,6,95.952937921262262,95.952937921262262,0.98980391184488936,0.98980391184488936,7,43.145882352941179,43.145882352941179,0.19215686274509805,0.19215686274509805]
[null,"MTB22","EASTERN HILLS/FLEURIEU PENINSULA","Rural Short",429,33.755760117999991,2.2320600000000006,4.1500000000000004,2.8194278324521167,0.95574383915004291,11,338.06527180882881,338.06527180882881,2.2059052139173301,2.2059052139173301,3,114.5990675990676,114.5990675990676,0.43123543123543123,0.43123543123543123]
[null,"MTB32","EASTERN HILLS/FLEURIEU PENINSULA","Rural Long",733,71.505758894999957,1.5052249390000001,1.28,3.3655830140350975,3.1201670486111173,13,260.69304766271159,260.69304766271159,2.380172845123572,2.380172845123572,5,241.68349249658937,241.68349249658937,1.1145975443383356,1.1145975443383356]
[null,"MTB33","EASTERN HILLS/FLEURIEU PENINSULA","Rural Short",108,14.812194207000001,0.96043000000000012,1.6,1.3783761806430099,1.3716108978547135,4,656.50928582085498,656.50928582085498,3.4043212025253862,3.4043212025253862,6,653.28703703703707,653.28703703703707,1.9444444444444444,1.9444444444444444]
[null,"MTB41","EASTERN HILLS/FLEURIEU PENINSULA","Rural Short",261.5,14.909994844000005,0.37323000000000001,0.25,2.1244562473029682,0.86822357464516131,4,417.90057361376671,417.90057361376671,2.1108986615678775,2.1108986615678775,5,170.78776290630975,170.78776290630975,0.58891013384321222,0.58891013384321222]
[null,"MTB51","EASTERN HILLS/FLEURIEU PENINSULA","Rural Long",1078,19.232356733,4.7909099999999993,0.78,14.806395088470492,1.045721113704392,7,779.8367358085618,779.8367358085618,3.9573284053625555,3.9573284053625555,2,55.076994434137291,55.076994434137291,0.1679035250463822,0.1679035250463822]
[null,"MTB52","EASTERN HILLS/FLEURIEU PENINSULA","Rural Long",1002,40.126812895000022,6.7737999999999996,2.44,3.9996004083607115,0.19708654207050588,16,226.63240071066363,226.63240071066363,2.3589487643298988,2.3589487643298988,4,11.167664670658683,11.167664670658683,5.9880239520958084E-2,5.9880239520958084E-2]
[null,"MTB53","EASTERN HILLS/FLEURIEU PENINSULA","Rural Long",337,52.66494551600001,3.0968400000000003,2.44,2.6734610381565918,1.3166930931284075,8,450.41938695709501,450.41938695709501,3.0039564774368919,3.0039564774368919,5,221.83382789317508,221.83382789317508,0.64391691394658757,0.64391691394658757]
[null,"MTB54","EASTERN HILLS/FLEURIEU PENINSULA","Rural Long",489,49.161067367999983,3.2165599999999999,1.77,6.2282517490432143,1.3725430864175563,14,723.15337310978236,723.15337310978236,5.0170415744703485,5.0170415744703485,12,159.36400817995911,159.36400817995911,0.51942740286298572,0.51942740286298572]
[null,"MTB61","EASTERN HILLS/FLEURIEU PENINSULA","Rural Short",1292,22.427998898000002,6.4776000000000016,2,1.2756924204964093,3.5185207003560692,9,50.790247678018574,50.790247678018574,0.3846749226006192,0.3846749226006192,7,140.08591331269349,140.08591331269349,0.47523219814241485,0.47523219814241485]
[null,"MTB62","EASTERN HILLS/FLEURIEU PENINSULA","Rural Short",1563,13.538578869999993,12.417687012999998,2.78,7.2512347090894777E-3,4.4323901170841848E-3,1,0.23864363403710812,0.23864363403710812,6.3979526551503517E-4,6.3979526551503517E-4,2,0.14587332053742802,0.14587332053742802,2.5591810620601407E-3,2.5591810620601407E-3]
[null,"MTB63","EASTERN HILLS/FLEURIEU PENINSULA","Rural Short",225,30.892683565000009,2.5018900000000004,4.12,0.93492326978426588,0.46794764258040972,2,213.74222222222221,213.74222222222221,1.52,1.52,3,106.98222222222222,106.98222222222222,0.36888888888888888,0.36888888888888888]
[null,"MTB71","EASTERN HILLS/FLEURIEU PENINSULA","Rural Short",209,24.821089688999994,0.89364999999999994,0.9,0,1.4821679267839141,null,0,0,0,0,2,364.79425837320576,364.79425837320576,0.99043062200956933,0.99043062200956933]
[null,"MTB72","EASTERN HILLS/FLEURIEU PENINSULA","Rural Long",124.5,33.311455271999982,0.56376000000000015,0.49,1.3844669102765135,2.9166694697833579E-2,4,631.37349397590367,631.37349397590367,3.9116465863453813,3.9116465863453813,3,13.301204819277109,13.301204819277109,2,2]
[null,"MTB81","EASTERN HILLS/FLEURIEU PENINSULA","Rural Short",560.5,35.714875031999995,3.2179105719999996,0.26,0.7706137905316538,0.24187630630158521,5,70.72256913470116,70.72256913470116,1.3327386262265835,1.3327386262265835,7,22.198037466547724,22.198037466547724,0.30508474576271188,0.30508474576271188]
[null,"MTB82","EASTERN HILLS/FLEURIEU PENINSULA","Rural Short",87,50.030705980999983,0.51758160399999997,1.7,1.0859161383780942,5.4860547852682323E-2,2,642.05747126436779,642.05747126436779,1.9080459770114941,1.9080459770114941,1,32.4367816091954,32.4367816091954,0.95402298850574707,0.95402298850574707]
[null,"MV11","EASTERN HILLS/FLEURIEU PENINSULA","Rural Short",838.5,14.880415267999989,3.8246589779999995,0.15,8.5381830522213278,2.8771655145985063E-3,7,523.79248563690271,523.79248563690271,1.6302921781955053,1.6302921781955053,1,0.1765056648777579,0.1765056648777579,1.1926058437686344E-3,1.1926058437686344E-3]
[null,"MV12","EASTERN HILLS/FLEURIEU PENINSULA","Urban",127.5,19.025334758999996,2.1523699999999999,2.5299999999999998,2.7834433064502146,0.21732494890752233,6,1007.7437944000842,1007.7437944000842,2.9385620935290468,2.9385620935290468,6,78.682352941176475,78.682352941176475,0.58823529411764708,0.58823529411764708]
[null,"MV13","EASTERN HILLS/FLEURIEU PENINSULA","Rural Short",706,53.686382763000019,8.3264300000000002,3.14,8.9359057590326909,2.8772432758286302,21,651.0745928280752,651.0745928280752,3.3399433130583076,3.3399433130583076,7,209.63739376770539,209.63739376770539,0.77620396600566577,0.77620396600566577]
[null,"MV14","EASTERN HILLS/FLEURIEU PENINSULA","Rural Short",596.5,60.197673947999974,9.3982359829999993,3.35,0.37790013987630217,3.4606274645285393,9,32.588432676534339,32.588432676534339,0.31181894543784461,0.31181894543784461,21,298.42917015926236,298.42917015926236,1.237217099748533,1.237217099748533]
[null,"MV15","EASTERN HILLS/FLEURIEU PENINSULA","Rural Short",1126,28.373239740000006,12.864123230999995,2.27,1.61825660370374,0.58661127975006699,16,73.927473891480147,73.927473891480147,1.0852575572091776,1.0852575572091776,3,26.798401420959149,26.798401420959149,8.7033747779751328E-2,8.7033747779751328E-2]
[null,"MV22","EASTERN HILLS/FLEURIEU PENINSULA","Rural Short",424,44.141469410000013,2.3931799999999996,4.67,3.4528707981385978,3.0150944965314546,10,418.90094537555046,418.90094537555046,1.5275157397648074,1.5275157397648074,6,365.79009433962267,365.79009433962267,1.4080188679245282,1.4080188679245282]
[null,"MV31","EASTERN HILLS/FLEURIEU PENINSULA","Rural Short",427.5,54.166365813000013,3.9195400000000005,1.1200000000000001,1.5242756328962139,4.6682204877436071,6,183.41052631578947,183.41052631578947,0.38830409356725148,0.38830409356725148,8,561.70994152046785,561.70994152046785,1.5040935672514619,1.5040935672514619]
[null,"MV32","EASTERN HILLS/FLEURIEU PENINSULA","Rural Short",125,32.471709985000011,0.14867,1.54,1.2310578119763285,1.9449833281761211,11,506.60013891601568,506.60013891601568,1.2640002813339233,1.2640002813339233,7,800.39200000000005,800.39200000000005,2.7759999999999998,2.7759999999999998]
[null,"MV33","EASTERN HILLS/FLEURIEU PENINSULA","Rural Short",307.5,61.330485994,11.106460000000002,0.63,1.687146549562744,2.6054872168517891,10,282.23089768324439,282.23089768324439,1.1598916212717691,1.1598916212717691,15,435.85365853658539,435.85365853658539,1.5544715447154471,1.5544715447154471]
[null,"MV34","EASTERN HILLS/FLEURIEU PENINSULA","Rural Short",1091.5,16.65630118,4.7759818069999991,2.23,3.5891343188753466,7.4638922331718636,9,169.14643181151226,169.14643181151226,1.1140632250778983,1.1140632250778983,11,351.75355016032984,351.75355016032984,1.4383875400824553,1.4383875400824553]
[null,"MV41","EASTERN HILLS/FLEURIEU PENINSULA","Rural Short",119,16.866798619000001,0,3.32,0.6477121746260186,0.74631340611781516,3,279.98319686761425,279.98319686761425,1.0084033773726775,1.0084033773726775,4,322.60504201680675,322.60504201680675,1.0252100840336134,1.0252100840336134]
[null,"MV42","EASTERN HILLS/FLEURIEU PENINSULA","Rural Short",789.5,48.663153597000012,11.945396812000002,1.05,1.0526731378961216,4.1900472434018541,13,68.586442257649836,68.586442257649836,1.7416088727548804,1.7416088727548804,23,273.00063331222293,273.00063331222293,0.98416719442685241,0.98416719442685241]
[null,"MV51","EASTERN HILLS/FLEURIEU PENINSULA","Rural Short",121,16.828437440999995,0.65212999999999999,2.3199999999999998,0.37653931656931394,1.1064645434384361,2,160.07438016528926,160.07438016528926,0.99173553719008267,0.99173553719008267,6,470.38016528925618,470.38016528925618,1.8264462809917354,1.8264462809917354]
[null,"MV52","EASTERN HILLS/FLEURIEU PENINSULA","Rural Short",1213.5,15.012595461999995,8.2282974369999966,1.33,4.3863554646977105,2.0323480702207539,8,185.9348988762892,185.9348988762892,1.976651557443758,1.976651557443758,7,86.149979398434283,86.149979398434283,0.29748660898228263,0.29748660898228263]
[null,"MV53","EASTERN HILLS/FLEURIEU PENINSULA","Rural Short",293,54.942854837000006,3.55619,3.14,7.5459562684690074,1.5598513956780737,18,1324.7792976561666,1324.7792976561666,5.1171786337582326,5.1171786337582326,10,273.84982935153585,273.84982935153585,1.0546075085324231,1.0546075085324231]
[null,"MV54","EASTERN HILLS/FLEURIEU PENINSULA","Rural Short",134.5,23.157351646999999,0,0.99,2.5090244108826147,0.29646468984883256,4,959.57620817843861,959.57620817843861,3.6059479553903344,3.6059479553903344,4,113.38289962825279,113.38289962825279,0.58736059479553904,0.58736059479553904]
[null,"MV55","EASTERN HILLS/FLEURIEU PENINSULA","Rural Short",8,0.72003817400000003,0.45684999999999998,0.28999999999999998,5.9740065042981141E-2,0,1,384.125,384.125,0.875,0.875,null,0,0,0,0]
[null,"MV61","EASTERN HILLS/FLEURIEU PENINSULA","Urban",1991,6.5893974050000015,7.3904100000000001,0.05,6.9064355505573083,1.0492124452191018,13,160.12555228999247,160.12555228999247,1.0323120147843028,1.0323120147843028,3,24.325966850828728,24.325966850828728,0.13611250627825214,0.13611250627825214]
[null,"MV62","EASTERN HILLS/FLEURIEU PENINSULA","Rural Short",2110.5,37.89484704600001,17.220469999999999,5.7,8.8846094077704425,2.9479671146266662,22,216.54584367793194,216.54584367793194,1.5662955234638749,1.5662955234638749,7,71.851220090026061,71.851220090026061,0.22032693674484718,0.22032693674484718]
[null,"MV63","EASTERN HILLS/FLEURIEU PENINSULA","Rural Short",641,39.304727859999993,4.9157300000000008,5.37,2.3429007237784512,0.91917662068409833,16,188.01509832629176,188.01509832629176,1.8939159452078309,1.8939159452078309,10,73.762870514820591,73.762870514820591,0.28861154446177845,0.28861154446177845]
[null,"MV64","EASTERN HILLS/FLEURIEU PENINSULA","Rural Short",2643.5,12.954600944999997,7.6018800000000022,2.31,0.58328045524740058,1.7285155038176456,16,11.349976925086004,11.349976925086004,0.13277852704354984,0.13277852704354984,5,33.634953659920562,33.634953659920562,0.14223567240400983,0.14223567240400983]
[null,"NA01","SOUTH EAST","Rural Long",2121.5,22.587866941999998,3.1588300000000005,5.93,0.25308917945030224,0.48354011849898737,7,6.7733521975072915,6.7733521975072915,4.3679785565500576E-2,4.3679785565500576E-2,2,12.940843742634929,12.940843742634929,4.5722366250294605E-2,4.5722366250294605E-2]
[null,"NA02","SOUTH EAST","Rural Long",257,67.294829610999997,1.5172099999999999,5.32,0.16024657999966196,2.5890725365830536E-3,10,35.402078680491172,35.402078680491172,1.3138781261815171,1.3138781261815171,1,0.57198443579766534,0.57198443579766534,7.7821011673151752E-3,7.7821011673151752E-3]
[null,"NA03","SOUTH EAST","Rural Long",81.5,43.306604316000005,0.46338000000000001,1.37,3.0293909951856133E-2,0,1,21.104294478527606,21.104294478527606,9.815950920245399E-2,9.815950920245399E-2,null,0,0,0,0]
[null,"NA04","SOUTH EAST","Rural Long",271,121.32996522599989,2.2434099999999999,0.67,2.8189013019409956,0.16231899657924778,14,590.58674576537635,590.58674576537635,2.3345635649902796,2.3345635649902796,3,34.007380073800739,34.007380073800739,0.12177121771217712,0.12177121771217712]
[null,"NA05","SOUTH EAST","Rural Long",221.5,81.792098644000035,2.0104900000000003,1.43,0.51861884315091866,0.14912705555951505,11,132.93755235521306,132.93755235521306,0.9631301788031561,0.9631301788031561,3,38.22573363431151,38.22573363431151,0.10835214446952596,0.10835214446952596]
[null,"NA06","SOUTH EAST","Rural Long",874,16.055869611999995,2.5764500000000004,4.17,2.0228640198703109,0.86871309334616287,5,131.40998747801618,131.40998747801618,1.0141113191774835,1.0141113191774835,6,56.433638443935926,56.433638443935926,0.19679633867276888,0.19679633867276888]
[null,"NA07","SOUTH EAST","Rural Long",210,91.748944496000007,1.2621700000000002,5.51,0.30138917854428032,3.7409456242873507E-2,3,81.48571428571428,81.48571428571428,1.2047619047619047,1.2047619047619047,1,10.114285714285714,10.114285714285714,2.8571428571428571E-2,2.8571428571428571E-2]
[null,"NA08","SOUTH EAST","Rural Long",112,51.251881622000013,1.3146499999999999,0.71,0.1942332838337425,4.5264737544343176E-3,2,98.464288439069477,98.464288439069477,0.9821428571428571,0.9821428571428571,2,2.2946428571428572,2.2946428571428572,2.6785714285714284E-2,2.6785714285714284E-2]
[null,"NA09","SOUTH EAST","Rural Long",293,111.31684702199992,1.90343,0.38,1.2670192958748554,1.4477670918852176E-2,5,245.52104582802835,245.52104582802835,1.5062571027579974,1.5062571027579974,3,2.8054607508532423,2.8054607508532423,1.0238907849829351E-2,1.0238907849829351E-2]
[null,"NA10","SOUTH EAST","Rural Long",68.5,49.108268210000013,8.7190000000000004E-2,2.9,0.16851868047637181,0,1,139.67883211678833,139.67883211678833,0.33576642335766421,0.33576642335766421,null,0,0,0,0]
[null,"NA12","SOUTH EAST","Rural Long",317,133.09138009099996,1.23916,0.22,2.9078631006113067,5.357795004275951E-2,10,520.8201892744479,520.8201892744479,5.0063091482649842,5.0063091482649842,3,9.5962145110410102,9.5962145110410102,4.4164037854889593E-2,4.4164037854889593E-2]
[null,"NA13","SOUTH EAST","Rural Long",439,120.53221811700001,0.94717000000000007,3.23,2.5775890311826983,0,9,333.36674259681092,333.36674259681092,1.8542141230068336,1.8542141230068336,null,0,0,0,0]
[null,"NA15","SOUTH EAST","Rural Long",72,52.327876079999996,0.62773999999999996,1.62,5.8122036535537933E-4,1.1448279923666563E-3,1,0.45833333333333331,0.45833333333333331,1.3888888888888888E-2,1.3888888888888888E-2,1,0.90277777777777779,0.90277777777777779,1.3888888888888888E-2,1.3888888888888888E-2]
[null,"NA16","SOUTH EAST","Rural Long",65,57.319104392,0,0.28999999999999998,0.6262913627779374,5.9178800836184077E-3,5,547.06153846153848,547.06153846153848,4.6769230769230772,4.6769230769230772,1,5.1692307692307695,5.1692307692307695,4.6153846153846156E-2,4.6153846153846156E-2]
[null,"NA17","SOUTH EAST","Rural Long",65.5,62.306695999000006,0,0.55000000000000004,0.15613692542046781,7.097933552673269E-3,1,135.34351145038167,135.34351145038167,0.91603053435114501,0.91603053435114501,1,6.1526717557251906,6.1526717557251906,3.0534351145038167E-2,3.0534351145038167E-2]
[null,"NA18","SOUTH EAST","Rural Long",39,32.199576807999989,0,0.09,5.8562354994140489E-2,0,1,85.256410256410263,85.256410256410263,0.89743589743589747,0.89743589743589747,null,0,0,0,0]
[null,"NA19","SOUTH EAST","Rural Long",38,30.761953266999988,0,0.04,2.6771362283035654E-3,1.7260483577220358E-3,2,4,4,1.0789473684210527,1.0789473684210527,1,2.5789473684210527,2.5789473684210527,5.2631578947368418E-2,5.2631578947368418E-2]
[null,"NA20","SOUTH EAST","Rural Long",65,49.524384825999974,0,0.05,0.10902285034999387,0,3,95.230769230769226,95.230769230769226,1.0307692307692307,1.0307692307692307,null,0,0,0,0]
[null,"NA21","SOUTH EAST","Rural Long",62,64.137750263000044,5.1870000000000006E-2,0.1,0.83408644976165758,6.2349093738122505E-3,5,763.82258064516134,763.82258064516134,3.629032258064516,3.629032258064516,1,5.709677419354839,5.709677419354839,4.8387096774193547E-2,4.8387096774193547E-2]
[null,"NA23","SOUTH EAST","Rural Long",53.5,43.747321417999991,0.13943,0.12,0.84750735637986352,0,7,899.42056074766356,899.42056074766356,4.990654205607477,4.990654205607477,null,0,0,0,0]
[null,"NA24","SOUTH EAST","Rural Long",77,84.845119796999953,0.60663,0.06,0.41876046686937873,0.22699297177879177,5,308.77922077922079,308.77922077922079,2.9090909090909092,2.9090909090909092,2,167.37662337662337,167.37662337662337,1.8701298701298701,1.8701298701298701]
[null,"NA27","SOUTH EAST","Rural Long",69,65.970452267999974,0,0.11,0,2.5538470598948483E-3,null,0,0,0,0,1,2.1014492753623188,2.1014492753623188,1.4492753623188406E-2,1.4492753623188406E-2]
[null,"NA28","SOUTH EAST","Rural Long",53,52.388402369000012,7.46E-2,0.1,8.154697853319412E-2,0,2,87.35849056603773,87.35849056603773,0.94339622641509435,0.94339622641509435,null,0,0,0,0]
[null,"NA29","SOUTH EAST","Rural Long",57.5,55.420231057999992,0,0.04,7.221222721081986E-3,0,1,7.1304347826086953,7.1304347826086953,1.7391304347826087E-2,1.7391304347826087E-2,null,0,0,0,0]
[null,"NA30","SOUTH EAST","Rural Long",67,51.357305299000004,1.77321,0.08,0.19726266945394694,5.4599488866717448E-3,2,167.16417910447763,167.16417910447763,0.55223880597014929,0.55223880597014929,4,4.6268656716417906,4.6268656716417906,0.1044776119402985,0.1044776119402985]
[null,"NA32","SOUTH EAST","Rural Long",214.5,71.061015334999979,2.5545199999999992,0.14000000000000001,1.2328918722115088E-2,0,3,3.2634037613590814,3.2634037613590814,3.2634037080066756E-2,3.2634037080066756E-2,null,0,0,0,0]
[null,"NA33","SOUTH EAST","Rural Long",84.5,32.805608600000006,0.1201,4.34,3.7303779812808892E-2,0,1,25.065088757396449,25.065088757396449,1.1834319526627219E-2,1.1834319526627219E-2,null,0,0,0,0]
[null,"NA34","SOUTH EAST","Rural Long",167.5,157.16846705599997,0.25768999999999997,3.32,1.1441763307228905,0.18886139326381005,6,387.83880924965018,387.83880924965018,1.2278607098024283,1.2278607098024283,5,64.017910447761196,64.017910447761196,0.37014925373134328,0.37014925373134328]
[null,"NA35","SOUTH EAST","Rural Short",22,7.6637869819999977,8.788E-2,1.03,1.3413812196438979E-3,0,1,3.1363636363636362,3.1363636363636362,4.5454545454545456E-2,4.5454545454545456E-2,null,0,0,0,0]
[null,"NA51","SOUTH EAST","Rural Long",537.5,26.805115441999995,0.23689000000000002,0.98,1.9536577366430063,0.22783838321930872,6,206.36836800508721,206.36836800508721,1.0009302041696948,1.0009302041696948,1,24.066976744186046,24.066976744186046,9.1162790697674412E-2,9.1162790697674412E-2]
[null,"NA52","SOUTH EAST","Rural Long",1117.5,47.801316861000046,7.3759400000000017,1.28,8.9045602377693989,1.1083520112560201,6,452.41610989495945,452.41610989495945,2.6046234339942336,2.6046234339942336,4,56.312304250559286,56.312304250559286,0.13154362416107382,0.13154362416107382]
[null,"NA56","SOUTH EAST","Rural Long",77.5,111.00129554399999,0,2.15,0.40553330037295787,1.1078412418440412E-2,2,297.09677419354841,297.09677419354841,0.98064516129032253,0.98064516129032253,2,8.1161290322580637,8.1161290322580637,3.870967741935484E-2,3.870967741935484E-2]
[null,"NA57","SOUTH EAST","Rural Long",77,71.158282189000019,0,0.04,0.36900448104728945,3.7339005289497096E-3,1,272.09090909090907,272.09090909090907,0.94805194805194803,0.94805194805194803,1,2.7532467532467533,2.7532467532467533,2.5974025974025976E-2,2.5974025974025976E-2]
[null,"NA58","SOUTH EAST","Rural Long",87,136.96075778399995,0,0.08,1.7730215308857569,3.4186325125902764E-2,4,1157.0919540229886,1157.0919540229886,3,3,7,22.310344827586206,22.310344827586206,0.18390804597701149,0.18390804597701149]
[null,"NA59","SOUTH EAST","Rural Long",44,7.3662314390000017,0,0.08,0.47413491622323667,3.5049349304763786E-3,2,611.81818181818187,611.81818181818187,1.8181818181818181,1.8181818181818181,2,4.5227272727272725,4.5227272727272725,4.5454545454545456E-2,4.5454545454545456E-2]
[null,"NA60","SOUTH EAST","Rural Long",64,64.552017417000002,0,0.16,1.5172317319143576,4.5687443264601633E-2,4,1346,1346,3.578125,3.578125,8,40.53125,40.53125,0.265625,0.265625]
[null,"NA61","SOUTH EAST","Rural Long",103.5,120.88360236899993,0,7.0000000000000007E-2,1.0776882337989377,1.1148863371816821E-2,5,591.1884057971015,591.1884057971015,3.8454106280193239,3.8454106280193239,5,6.1159420289855069,6.1159420289855069,1.0048309178743962,1.0048309178743962]
[null,"NA62","SOUTH EAST","Rural Long",45,36.919741778999992,0,0.08,0.84123722152936309,1.0461966576396827E-2,5,1061.4000000000001,1061.4000000000001,3.088888888888889,3.088888888888889,3,13.2,13.2,8.8888888888888892E-2,8.8888888888888892E-2]
[null,"NL111A","MAJOR METROPOLITAN AREAS","Urban",1330.5,7.5209333689999971,14.964077084999991,0.09,1.3175830272365139,1.3132215313769939,15,45.713139628253003,45.713139628253003,0.40536141064058601,0.40536141064058601,7,45.561818865088313,45.561818865088313,0.45621946636602778,0.45621946636602778]
[null,"NL111B","MAJOR METROPOLITAN AREAS","Urban",2018,10.181862927000003,8.5733421539999988,5.81,3.5907425453821569,7.1540245018212989,16,82.137417297060821,82.137417297060821,0.95920052069974959,0.95920052069974959,6,163.64667988107036,163.64667988107036,1.9177403369672943,1.9177403369672943]
[null,"NL111C","MAJOR METROPOLITAN AREAS","Urban",2238.5,14.044867047999995,3.5953578259999999,5.56,1.9849746406104949,0,32,40.933209788833899,40.933209788833899,0.3214950054544462,0.3214950054544462,null,0,0,0,0]
[null,"NL111D","MAJOR METROPOLITAN AREAS","Urban",269.5,5.1626455549999992,2.2755138980000007,6.34,3.0046820587593049E-2,7.7554158402006572E-3,2,5.1465677179962892,5.1465677179962892,2.2263450834879406E-2,2.2263450834879406E-2,1,1.3283858998144713,1.3283858998144713,3.7105751391465678E-3,3.7105751391465678E-3]
[null,"NL111P","MAJOR METROPOLITAN AREAS","Urban",2304.5,11.308275647999997,5.5968099999999978,5.79,0.99367529221663053,2.7104528466319158,20,19.904245333962287,19.904245333962287,0.74000175916390765,0.74000175916390765,8,54.292905185506619,54.292905185506619,0.21740073768713386,0.21740073768713386]
[null,"NL111Q","MAJOR METROPOLITAN AREAS","Urban",2893.5,19.058306986000012,6.3398115229999998,5.66,3.7626546351564629,1.315517827687221,21,60.027299790343655,60.027299790343655,1.1308104091714819,1.1308104091714819,4,20.987039917055469,20.987039917055469,8.8819768446518052E-2,8.8819768446518052E-2]
[null,"NL115A","MAJOR METROPOLITAN AREAS","Urban",2936,1.1579499689999999,27.562180740999992,6.94,11.909581002138131,0.16897274735632717,23,187.24850917057381,187.24850917057381,1.0615349390851054,1.0615349390851054,1,2.6566757493188011,2.6566757493188011,1.7029972752043598E-2,1.7029972752043598E-2]
[null,"NL115B","MAJOR METROPOLITAN AREAS","Urban",1837,25.124612525999993,7.946898377000001,6.76,0.63406671141239623,7.1333578350292557,6,15.933226658588014,15.933226658588014,0.16566869780364468,0.16566869780364468,13,179.25149700598803,179.25149700598803,1.5949918345127927,1.5949918345127927]
[null,"NL115C","MAJOR METROPOLITAN AREAS","Urban",2394.5,8.9261814320000035,8.2176771239999962,4.5,6.9724942839884951,0.93073655351503093,16,134.41609144419911,134.41609144419911,0.99575415262973843,0.99575415262973843,2,17.942785550219252,17.942785550219252,7.6842764669033198E-2,7.6842764669033198E-2]
[null,"NL115D","MAJOR METROPOLITAN AREAS","Urban",2558,3.6383989209999994,21.874972176,5.66,1.0991675840425346,3.9347687170921963,13,19.835415814051505,19.835415814051505,8.7177472341983392E-2,8.7177472341983392E-2,15,71.006254886630174,71.006254886630174,0.35965598123534009,0.35965598123534009]
[null,"NL115E","MAJOR METROPOLITAN AREAS","Urban",2115,9.9899235449999999,23.863559983000002,5.54,1.0705866927124659,1.1442487840206668,17,23.366270845381646,23.366270845381646,0.26540590504946154,0.26540590504946154,4,24.973995271867611,24.973995271867611,7.706855791962175E-2,7.706855791962175E-2]
[null,"NL115F","MAJOR METROPOLITAN AREAS","Urban",2239.5,7.2709346550000022,10.071352591000004,5.73,1.1129095616069573,0.46344025438383424,14,22.939647717996486,22.939647717996486,0.19900276757266058,0.19900276757266058,3,9.5525787006028136,9.5525787006028136,0.18620227729403885,0.18620227729403885]
[null,"NL21","MAJOR METROPOLITAN AREAS","Urban",623,43.595975702000025,6.7083699999999986,4.7300000000000004,5.1477330850377694,1.0671712154188961,7,381.42215088282506,381.42215088282506,1.9614767255216694,1.9614767255216694,4,79.072231139646874,79.072231139646874,0.1797752808988764,0.1797752808988764]
[null,"NL210A","MAJOR METROPOLITAN AREAS","Urban",2418.5,26.971350364000006,13.949843873000003,1.94,2.8069187168354643,0.22908805170425123,24,53.574938603957776,53.574938603957776,0.4939700542266196,0.4939700542266196,1,4.3725449658879469,4.3725449658879469,1.8606574322927436E-2,1.8606574322927436E-2]
[null,"NL210B","MAJOR METROPOLITAN AREAS","Urban",956,11.445389716000006,3.2098100000000005,7.32,8.9154208167195126,0.29414255943643725,12,430.48883490781901,430.48883490781901,4.2224546276874619,4.2224546276874619,1,14.202928870292887,14.202928870292887,4.8117154811715482E-2,4.8117154811715482E-2]
[null,"NL210C","MAJOR METROPOLITAN AREAS","Urban",2024.5,7.0511755929999964,10.435552096999999,2.69,3.9102460002639301,2.1472753449623725,17,89.158804522528712,89.158804522528712,1.0758211941859197,1.0758211941859197,10,48.960731044702399,48.960731044702399,0.40652012842677204,0.40652012842677204]
[null,"NL210D","MAJOR METROPOLITAN AREAS","Urban",2908,8.7783722070000021,26.346153553000033,6.23,25.368802828649773,4.5793130955656318,14,402.7017418862701,402.7017418862701,3.0115772562800935,3.0115772562800935,16,72.691540577716637,72.691540577716637,0.50447042640990369,0.50447042640990369]
[null,"NL210E","MAJOR METROPOLITAN AREAS","Urban",2772.5,7.1628047369999992,25.07311482299999,6.73,13.525307915912823,0.46961425861416162,19,225.19230356035843,225.19230356035843,2.2225428200284032,2.2225428200284032,3,7.8189359783588817,7.8189359783588817,0.23011722272317403,0.23011722272317403]
[null,"NL210F","MAJOR METROPOLITAN AREAS","Urban",645,3.3153772640000017,3.4211000000000009,7.64,8.953389292611541E-2,0,2,6.4077519379844965,6.4077519379844965,6.6666666666666666E-2,6.6666666666666666E-2,null,0,0,0,0]
[null,"NL234A","MAJOR METROPOLITAN AREAS","Urban",3005,10.576504173999995,4.3498900000000003,2.46,9.5223361904335668,11.024583574918092,31,146.27731206960567,146.27731206960567,3.1591791235071649,3.1591791235071649,20,169.3540765391015,169.3540765391015,0.63361064891846919,0.63361064891846919]
[null,"NL234B","MAJOR METROPOLITAN AREAS","Urban",1618.5,9.493434621000004,21.996519935999999,8.06,0.32273794745058487,0.98658421283357067,9,9.2048192771084345,9.2048192771084345,8.4646277417361748E-2,8.4646277417361748E-2,4,28.138399752857584,28.138399752857584,7.0435588507877664E-2,7.0435588507877664E-2]
[null,"NL234C","MAJOR METROPOLITAN AREAS","Urban",2639,10.160701779999998,8.1567528139999954,6.04,2.0568958002592566,5.3705171534752649,29,35.979144987891964,35.979144987891964,1.092332885378883,1.092332885378883,8,93.940886699507388,93.940886699507388,0.38309965896172793,0.38309965896172793]
[null,"NL234D","MAJOR METROPOLITAN AREAS","Urban",1564.5,4.2935136010000026,16.523552850999994,6.97,0.17994869317353634,2.0316806552324542,4,5.3094687237835609,5.3094687237835609,6.0296142470840461E-2,6.0296142470840461E-2,3,59.94566954298498,59.94566954298498,0.1840843720038351,0.1840843720038351]
[null,"NL234E","MAJOR METROPOLITAN AREAS","Urban",2361,0,28.773751637000018,3.52,7.5323718136903057,0,1,147.26980093180856,147.26980093180856,0.98941126641253707,0.98941126641253707,null,0,0,0,0]
[null,"NL451A","MAJOR METROPOLITAN AREAS","Urban",2135,1.6783545540000004,22.515672802000008,7.3,1.7041551069403196,6.2701887172840172,9,36.845900781707407,36.845900781707407,0.16206088456951204,0.16206088456951204,7,135.56908665105385,135.56908665105385,0.5859484777517564,0.5859484777517564]
[null,"NL451B","MAJOR METROPOLITAN AREAS","Urban",460.5,0,8.185194659999997,5.39,4.3371259735721202,0,6,434.76076008054252,434.76076008054252,3.006876548390176,3.006876548390176,null,0,0,0,0]
[null,"NL451C","MAJOR METROPOLITAN AREAS","Urban",2716.5,13.39065586099999,11.519858230999997,3.05,8.0140451463476268,0.45852271417231039,32,136.18209549587735,136.18209549587735,1.7939750589002925,1.7939750589002925,2,7.7916436591201919,7.7916436591201919,4.9328179642922881E-2,4.9328179642922881E-2]
[null,"NL451D","MAJOR METROPOLITAN AREAS","Urban",2284.5,1.90601731,22.864850000000004,6.52,0.61575402190464656,0.28976659854336306,1,12.442109870868899,12.442109870868899,1.6633836725760562E-2,1.6633836725760562E-2,1,5.8551105274677173,5.8551105274677173,1.9260231998249069E-2,1.9260231998249069E-2]
[null,"NL451E","MAJOR METROPOLITAN AREAS","Urban",960.5,0,13.174690269999996,6.57,1.8989359361220919,1.6317134969709328,6,91.262188984415673,91.262188984415673,1.0074613898573661,1.0074613898573661,7,78.419573138990103,78.419573138990103,0.37168141592920356,0.37168141592920356]
[null,"NL511A","MAJOR METROPOLITAN AREAS","Urban",1570.5,5.7056947050000018,5.0962684089999986,4.1500000000000004,0.53404030427151283,0.19590007106964957,17,15.696905049272731,15.696905049272731,0.14156848377550432,0.14156848377550432,3,5.7580388411333967,5.7580388411333967,7.1951607768226677E-2,7.1951607768226677E-2]
[null,"NL511B","MAJOR METROPOLITAN AREAS","Urban",1902,8.943462834,9.1046800000000001,5.68,10.134544676262115,2.3937805875479685E-2,17,245.96406742902209,245.96406742902209,3.0681738216668899,3.0681738216668899,1,0.5809674027339643,0.5809674027339643,3.41745531019979E-2,3.41745531019979E-2]
[null,"NL511C","MAJOR METROPOLITAN AREAS","Urban",700,0.58765000000000001,10.265581964999999,3.81,2.3612858284409823E-3,1.5644493456194717,1,0.15571428571428572,0.15571428571428572,1.4285714285714286E-3,1.4285714285714286E-3,1,103.16714285714286,103.16714285714286,0.40142857142857141,0.40142857142857141]
[null,"NL511D","MAJOR METROPOLITAN AREAS","Urban",45,0,4.6326599999999996,4.7300000000000004,0.17233053913071572,9.0552062044800957E-3,1,176.77777777777777,176.77777777777777,0.88888888888888884,0.88888888888888884,1,9.2888888888888896,9.2888888888888896,0.24444444444444444,0.24444444444444444]
[null,"NL511E","MAJOR METROPOLITAN AREAS","Urban",1,0,1.0724800000000001,1.71,0,8.730258613410237E-3,null,0,0,0,0,1,403,403,1,1]
[null,"NL544A","MAJOR METROPOLITAN AREAS","Urban",1713,2.9413124859999997,13.336256028999999,4.7300000000000004,0.19447033340210537,5.7190776028295349E-3,5,5.2405145737558376,5.2405145737558376,2.1015761821366025E-2,2.1015761821366025E-2,1,0.15411558669001751,0.15411558669001751,3.8528896672504379E-2,3.8528896672504379E-2]
[null,"NL544B","MAJOR METROPOLITAN AREAS","Urban",1680,36.126212221999992,17.032311876000001,4,1.8359393617059356,1.9388106337046882,23,50.446029390607563,50.446029390607563,0.17380952040354411,0.17380952040354411,6,53.272619047619045,53.272619047619045,0.17083333333333334,0.17083333333333334]
[null,"NL760A","MAJOR METROPOLITAN AREAS","Urban",913.5,9.4914185139999958,8.193950000000001,4.88,3.1974811228111022E-2,0,1,1.6157619432471264,1.6157619432471264,1.4960758269779311E-2,1.4960758269779311E-2,null,0,0,0,0]
[null,"NL760B","MAJOR METROPOLITAN AREAS","Urban",2673.5,16.299920374000003,9.2512499999999989,2,1.5024349449983299,2.1534710123654377,33,25.94140088502461,25.94140088502461,0.15422979051294963,0.15422979051294963,7,37.182345240321673,37.182345240321673,9.5754628763792787E-2,9.5754628763792787E-2]
[null,"NL760C","MAJOR METROPOLITAN AREAS","Urban",2720.5,9.2722554789999982,11.13335,6.06,0.45445724839779555,0.78015583981325776,19,7.7112048723486897,7.7112048723486897,6.8982412306356711E-2,6.8982412306356711E-2,5,13.237640139680206,13.237640139680206,8.1602646572321261E-2,8.1602646572321261E-2]
[null,"NU01","BAROSSA/MID NORTH & YORKE PENINSULA/RIVE","Rural Short",130,13.05528,1.2402399999999996,5.87,1.4904242398681749E-2,1.0672728834557971E-2,1,5.8974385188176086,5.8974385188176086,6.4102591001070464E-2,6.4102591001070464E-2,1,4.2230769230769232,4.2230769230769232,2.3076923076923078E-2,2.3076923076923078E-2]
[null,"NU02","BAROSSA/MID NORTH & YORKE PENINSULA/RIVE","Rural Long",1114,47.129413654999993,6.797580063999999,3.7,0.88296179221656435,1.2255823976743658,13,45.001795003401313,45.001795003401313,0.26301615702613679,0.26301615702613679,6,62.464093357271096,62.464093357271096,0.24147217235188509,0.24147217235188509]
[null,"NU03","BAROSSA/MID NORTH & YORKE PENINSULA/RIVE","Rural Long",57.5,14.198930000000001,2.1510000000000001E-2,6.48,0.19189078855898062,0.5226051721462065,4,189.47826511548914,189.47826511548917,3.0782609027364978,3.0782609027364978,3,516.03478260869565,516.03478260869565,1.808695652173913,1.808695652173913]
[null,"NU04","BAROSSA/MID NORTH & YORKE PENINSULA/RIVE","Rural Short",475,28.771709999999992,2.3307799999999999,0.17,1.9689921121298914,0.11878027901484373,6,213.22947413394326,213.22947413394326,2.0463157794350071,2.0463157794350071,1,12.863157894736842,12.863157894736842,9.8947368421052631E-2,9.8947368421052631E-2]
[null,"NU05","BAROSSA/MID NORTH & YORKE PENINSULA/RIVE","Rural Short",526,25.703900000000008,0.82101000000000013,2.99,1.9815699869495966,0,2,193.78517110266159,193.78517110266159,0.98098859315589348,0.98098859315589348,null,0,0,0,0]
[null,"NU06","BAROSSA/MID NORTH & YORKE PENINSULA/RIVE","Rural Long",728.5,25.358273559000008,1.7575200000000002,2.4,2.9813845657389528,3.0593326503705873E-2,10,232.36010256252146,232.36010256252146,2.1011210345371012,2.1011210345371012,1,2.3843514070006862,2.3843514070006862,1.2354152367879203E-2,1.2354152367879203E-2]
[null,"NU07","BAROSSA/MID NORTH & YORKE PENINSULA/RIVE","Rural Long",55,35.368740000000003,0,4.2300000000000004,0.47279049717331695,0,2,488.06668728915128,488.06668728915128,1.8848485773259944,1.8848485773259944,null,0,0,0,0]
[null,"NU08","BAROSSA/MID NORTH & YORKE PENINSULA/RIVE","Rural Long",102.5,75.40339000000003,0,0.15,0.34149338375380145,6.0763947287153291E-3,4,189.16097560975609,189.16097560975609,1.9317073170731707,1.9317073170731707,1,3.3658536585365852,3.3658536585365852,2.9268292682926831E-2,2.9268292682926831E-2]
[null,"NU11","BAROSSA/MID NORTH & YORKE PENINSULA/RIVE","Rural Long",104,55.398310000000002,0.17186000000000001,0.15,0,8.959599995644893E-2,null,0,0,0,0,4,48.91346153846154,48.91346153846154,0.19230769230769232,0.19230769230769232]
[null,"NU12","BAROSSA/MID NORTH & YORKE PENINSULA/RIVE","Rural Long",57,35.431000000000019,0.42664000000000002,0.15,0.76814435740133813,7.4501883195553171E-3,9,765.14035087719299,765.14035087719299,3.8245614035087718,3.8245614035087718,1,7.4210526315789478,7.4210526315789478,5.2631578947368418E-2,5.2631578947368418E-2]
[null,"NU13","BAROSSA/MID NORTH & YORKE PENINSULA/RIVE","Rural Long",733,53.63177271800005,5.50136,0.11,2.3062765424006848,0.15463984266121911,9,178.6407460711012,178.6407460711012,2.8835834487561152,2.8835834487561152,6,11.978171896316507,11.978171896316507,4.0927694406548434E-2,4.0927694406548434E-2]
[null,"NU14","BAROSSA/MID NORTH & YORKE PENINSULA/RIVE","Rural Long",249.5,74.441635336999994,0.66567999999999994,3.89,0.63027184809368197,6.7544851549632717E-2,9,143.42685517519413,143.42685517519413,1.222444893601901,1.222444893601901,3,15.370741482965931,15.370741482965931,0.17635270541082165,0.17635270541082165]
[null,"NU15","BAROSSA/MID NORTH & YORKE PENINSULA/RIVE","Rural Long",526.5,57.872779999999985,7.6542200000000005,0.63,0.53648996145966577,0.10970974714541387,6,57.85439298906897,57.85439298906897,0.20829380068004638,0.20829380068004638,5,11.830959164292498,11.830959164292498,0.10066476733143399,0.10066476733143399]
[null,"NU16","BAROSSA/MID NORTH & YORKE PENINSULA/RIVE","Rural Long",100,67.629280000000037,0,2.5099999999999998,0.90529475088686362,0.18794553086991675,5,514,514,3.42,3.42,3,106.71,106.71,1.02,1.02]
[null,"NU19","BAROSSA/MID NORTH & YORKE PENINSULA/RIVE","Rural Long",877,35.033048375,8.6011699999999962,0.1,2.5017250691677959,0.17186510076175127,15,161.96198988667643,161.96198988667643,1.1239072528913057,1.1239072528913057,1,11.126567844925884,11.126567844925884,3.8768529076396809E-2,3.8768529076396809E-2]
[null,"NU20","BAROSSA/MID NORTH & YORKE PENINSULA/RIVE","Rural Long",883.5,37.131749999999997,0.95190999999999981,2.99,5.5283919878769279,9.3805444420689402E-2,7,355.27560837577818,355.27560837577818,2.9077532541029996,2.9077532541029996,5,6.0282965478211654,6.0282965478211654,9.8471986417657045E-2,9.8471986417657045E-2]
[null,"NU21","BAROSSA/MID NORTH & YORKE PENINSULA/RIVE","Rural Long",2335,22.645199999999985,15.456308722000001,11.39,0.11993089521483022,0.31072392986665459,4,2.9162000112921587,2.9162000112921587,1.3418983102780765E-2,1.3418983102780765E-2,3,7.5554603854389724,7.5554603854389724,2.2698072805139188E-2,2.2698072805139188E-2]
[null,"NU22","BAROSSA/MID NORTH & YORKE PENINSULA/RIVE","Rural Long",141,31.573080000000001,0.28647,6.63,1.5272709927704957,0,2,614.99290780141848,614.99290780141848,0.98581560283687941,0.98581560283687941,null,0,0,0,0]
[null,"NU23","BAROSSA/MID NORTH & YORKE PENINSULA/RIVE","Rural Long",47,18.269179275000003,0,0.45,0,1.61156555848537E-2,null,0,0,0,0,3,19.468085106382979,19.468085106382979,0.97872340425531912,0.97872340425531912]
[null,"NU24","BAROSSA/MID NORTH & YORKE PENINSULA/RIVE","Rural Long",85.5,35.258869999999995,0.17639000000000002,7.0000000000000007E-2,0.83799647767404828,2.719406800329411E-2,2,556.47953216374265,556.47953216374265,2.1871345029239766,2.1871345029239766,3,18.058479532163744,18.058479532163744,8.1871345029239762E-2,8.1871345029239762E-2]
[null,"NU25","BAROSSA/MID NORTH & YORKE PENINSULA/RIVE","Rural Long",939,21.042363731999998,6.4622378799999982,0.13,0.1281620489505049,3.559534419343096E-2,9,7.7493801584132056,7.7493801584132056,3.4788784762413989E-2,3.4788784762413989E-2,1,2.1522896698615548,2.1522896698615548,4.5793397231096912E-2,4.5793397231096912E-2]
[null,"NU26","BAROSSA/MID NORTH & YORKE PENINSULA/RIVE","Rural Long",51,4.0491400000000004,2.5045600000000001,5.14,8.7711436953629967E-3,3.1174546869061254E-2,2,9.764705882352942,9.764705882352942,3.9215686274509803E-2,3.9215686274509803E-2,1,34.705882352941174,34.705882352941174,0.19607843137254902,0.19607843137254902]
[null,"NU28","BAROSSA/MID NORTH & YORKE PENINSULA/RIVE","Rural Long",49,25.829509999999999,0,4.46,0.10277032823783752,0.23178363660838763,4,119.08163265306122,119.08163265306122,1.0408163265306123,1.0408163265306123,1,268.57142857142856,268.57142857142856,0.95918367346938771,0.95918367346938771]
[null,"NU31","BAROSSA/MID NORTH & YORKE PENINSULA/RIVE","Rural Long",344.5,33.413849999999975,4.1807899999999991,0.08,0.79175723131611198,1.8757566336469061E-2,4,130.48960878679475,130.48960878679475,1.1562651185292696,1.1562651185292696,3,3.0914368650217705,3.0914368650217705,2.3222060957910014E-2,2.3222060957910014E-2]
[null,"NU32","BAROSSA/MID NORTH & YORKE PENINSULA/RIVE","Rural Long",5,0.20227000000000001,1.7349300000000001,2.86,1.3914063291840897E-3,4.4701129917331897E-2,1,15.8,15.8,0.2,0.2,1,507.6,507.6,1.2,1.2]
[null,"NU33","BAROSSA/MID NORTH & YORKE PENINSULA/RIVE","Rural Long",493.5,14.27976,3.7934999999999994,0.42,1.2089207485445901,6.3405858038768654E-3,4,139.08611970880233,139.08611970880233,0.98480243354341301,0.98480243354341301,1,0.72948328267477203,0.72948328267477203,8.1053698074974676E-3,8.1053698074974676E-3]
[null,"NU34","BAROSSA/MID NORTH & YORKE PENINSULA/RIVE","Rural Long",1610,8.6716700000000007,10.252090000000001,11.24,7.4678010578994192E-3,0.53275010943240952,3,0.26335403726708073,0.26335403726708073,2.4844720496894411E-3,2.4844720496894411E-3,2,18.787577639751554,18.787577639751554,7.2049689440993783E-2,7.2049689440993783E-2]
[null,"NU35","BAROSSA/MID NORTH & YORKE PENINSULA/RIVE","Rural Long",83,81.386630000000025,5.8799999999999998E-2,5.33,0.28768646435008183,5.4599488866717452E-4,3,196.79517814911992,196.79517814911992,1.8192770962255547,1.8192770962255547,1,0.37349397590361444,0.37349397590361444,1.2048192771084338E-2,1.2048192771084338E-2]
[null,"PA01","MAJOR METROPOLITAN AREAS","Urban",433.5,3.0930670529999995,3.0066899999999994,2.25,1.522480782863501,0,5,162.12151557543982,162.12151557543982,1.2587469050353517,1.2587469050353517,null,0,0,0,0]
[null,"PA02","MAJOR METROPOLITAN AREAS","Urban",1657.5,21.472541041999982,1.30446,3.28,29.956745078657015,1.6460761804962205,26,834.29381496607812,834.29381496607812,5.8224233323332646,5.8224233323332646,6,45.843137254901961,45.843137254901961,0.2799396681749623,0.2799396681749623]
[null,"PA03","UPPER NORTH/EYRE PENINSULA","Urban",1126,9.3236454719999884,0.63866999999999985,4.1900000000000004,2.6995634556617389,0.44355346181035876,5,110.67080964923541,110.67080964923541,0.99763172070891137,0.99763172070891137,2,18.183836589698046,18.183836589698046,3.7300177619893425E-2,3.7300177619893425E-2]
[null,"PA04","UPPER NORTH/EYRE PENINSULA","Urban",722,9.6101700000000019,4.7080399999999987,4.9000000000000004,13.991571713113292,0.26346750683944242,8,894.55540166204992,894.55540166204992,4.7590027700831028,4.7590027700831028,3,16.844875346260388,16.844875346260388,7.3407202216066489E-2,7.3407202216066489E-2]
[null,"PA05","UPPER NORTH/EYRE PENINSULA","Rural Long",756,27.714889999999961,5.0076400000000003,4.74,2.6553492709719104,4.6180599938236505E-2,3,199.42195767195767,199.42195767195767,2.9246031746031744,2.9246031746031744,3,3.4682539682539684,3.4682539682539684,2.1164021164021163E-2,2.1164021164021163E-2]
[null,"PA06","UPPER NORTH/EYRE PENINSULA","Rural Long",958.5,0.12038,15.571860000000001,2.31,3.175065988429564,0.80243635895730547,5,188.07616270539907,188.07616270539907,1.9721787641243693,1.9721787641243693,2,47.532603025560775,47.532603025560775,0.69900886802295248,0.69900886802295248]
[null,"PA07","UPPER NORTH/EYRE PENINSULA","Rural Long",680,4.6741159420000002,3.2772700000000001,2.97,0.98256183400244079,0.16809597475611335,2,82.039705882352948,82.039705882352948,0.91911764705882348,0.91911764705882348,2,14.035294117647059,14.035294117647059,5.1470588235294115E-2,5.1470588235294115E-2]
[null,"PA08","UPPER NORTH/EYRE PENINSULA","Rural Long",634.5,9.9146092419999974,0.15914999999999999,6.13,21.103318961628098,10.64640717233627,8,1888.3924411446021,1888.3924411446021,3.8865248377253634,3.8865248377253634,3,952.67454688731289,952.67454688731289,1.941686367218282,1.941686367218282]
[null,"PA09","UPPER NORTH/EYRE PENINSULA","Rural Long",3,0,1.2333000000000003,2.23,5.5233547447105145E-2,0,2,1045.3333333333333,1045.3333333333333,1,1,null,0,0,0,0]
[null,"PA10","UPPER NORTH/EYRE PENINSULA","Rural Long",249.5,14.004730000000004,1.1900000000000001E-2,0,3.1611518824066227,0.69808088426849868,6,719.36272355502024,707.81963738267552,2.9846359207061584,2.9044756000648757,3,158.85771543086173,158.85771543086173,1.9278557114228456,1.9278557114228456]
[null,"PA11","UPPER NORTH/EYRE PENINSULA","Rural Long",94,61.388269999999991,0.44871,0.76,2.4613097326349345,0.10638093959837852,12,1486.6595744680851,1485.127659574468,7.2978723404255321,7.2872340425531918,7,64.255319148936167,64.255319148936167,1.4680851063829787,1.4680851063829787]
[null,"PA12","UPPER NORTH/EYRE PENINSULA","Rural Long",53,55.27061999999998,7.7109999999999998E-2,0.18,0.6455773112647295,0.46340875857167835,5,691.58490566037733,691.58490566037733,2.8679245283018866,2.8679245283018866,8,496.43396226415092,496.43396226415092,3.2264150943396226,3.2264150943396226]
[null,"PA13","UPPER NORTH/EYRE PENINSULA","Rural Long",435,15.796849999999996,0.84138000000000013,7.0000000000000007E-2,3.4714692226278529E-2,3.7870557732722108,4,4.5310325184087654,4.5310325184087654,2.9885037740071611E-2,2.9885037740071611E-2,5,494.29425287356321,494.29425287356321,1.2390804597701151,1.2390804597701151]
[null,"PA14","UPPER NORTH/EYRE PENINSULA","Rural Long",479,9.8450600000000072,0.43635000000000002,2.93,5.7628879861903064E-2,4.3149799923983361,2,6.8308977035490601,6.8308977035490601,6.2630480167014616E-3,6.2630480167014616E-3,1,511.46555323590815,511.46555323590815,0.96868475991649272,0.96868475991649272]
[null,"PA15","UPPER NORTH/EYRE PENINSULA","Rural Long",77,87.136529999999951,0.28458,1.77,2.6273626297431316,1.2890058684514785,4,1937.3246753246754,1937.3246753246754,3.8181818181818183,3.8181818181818183,6,950.46753246753246,950.46753246753246,2.0129870129870131,2.0129870129870131]
[null,"PA16","UPPER NORTH/EYRE PENINSULA","Rural Long",2,9.6278799999999993,0,0.1,2.427035343817311E-2,1.8845630028189571E-2,4,689,689,4,4,1,535,535,1,1]
[null,"PA17","UPPER NORTH/EYRE PENINSULA","Rural Long",8.5,68.796599999999984,0,0.01,0.15187464274119503,0.15257915227495911,2,1014.4705882352941,1014.4705882352941,1.7647058823529411,1.7647058823529411,3,1019.1764705882352,1019.1764705882352,2.5882352941176472,2.5882352941176472]
[null,"PA18","UPPER NORTH/EYRE PENINSULA","Rural Long",99,70.194050000000018,0.10466,0.04,2.1196049960210037,3.8078740299949398E-2,1,1215.6060606060605,1215.6060606060605,1.0707070707070707,1.0707070707070707,1,21.838383838383837,21.838383838383837,0.9494949494949495,0.9494949494949495]
[null,"PA19","UPPER NORTH/EYRE PENINSULA","Rural Long",25,104.27665000000005,0.26227,0.1,0.19085163269669364,0.15465745539956319,4,433.44,433.44,3.52,3.52,2,351.24,351.24,0.92,0.92]
[null,"PA20","UPPER NORTH/EYRE PENINSULA","Rural Long",70,4.1563499999999998,0,0.18,0.24599711645207828,2.0342712787438273E-2,3,199.52857142857144,199.52857142857144,2.9285714285714284,2.9285714285714284,2,16.5,16.5,0.18571428571428572,0.18571428571428572]
[null,"PA21","UPPER NORTH/EYRE PENINSULA","Rural Long",13.5,22.244669999999996,0.25235999999999997,0.06,0.17418998222317278,0.18704728121436753,2,732.59259259259261,732.59259259259261,1.4074074074074074,1.4074074074074074,3,786.66666666666663,786.66666666666663,2,2]
[null,"PA22","UPPER NORTH/EYRE PENINSULA","Rural Long",72,71.402850000000043,0,0.03,2.4760163691522603,1.1685347381778179,5,1952.5138888888889,1952.5138888888889,3.9305555555555554,3.9305555555555554,5,921.47222222222217,921.47222222222217,1.9305555555555556,1.9305555555555556]
[null,"PA23","UPPER NORTH/EYRE PENINSULA","Rural Long",94.5,88.783239999999878,0,0.1,2.9642590887891225,1.5752304792814866,4,1780.9735449735449,1780.9735449735449,3.64021164021164,3.64021164021164,4,946.4232804232804,946.4232804232804,2.1164021164021163,2.1164021164021163]
[null,"PA24","UPPER NORTH/EYRE PENINSULA","Rural Long",30,97.670669999999973,0.13431000000000001,0.09,0.92299555292268654,0.45414445820268051,6,1746.8333333333333,1746.8333333333333,5.2666666666666666,5.2666666666666666,2,859.5,859.5,1.8333333333333333,1.8333333333333333]
[null,"PA25","UPPER NORTH/EYRE PENINSULA","Rural Short",7,52.368759999999995,0.36366000000000004,7.0000000000000007E-2,0.14078670714001609,5.7387787831721555E-2,1,1034.5714285714287,1034.5714285714287,0.8571428571428571,0.8571428571428571,1,421.71428571428572,421.71428571428572,0.8571428571428571,0.8571428571428571]
[null,"PA26","UPPER NORTH/EYRE PENINSULA","Rural Long",209.5,8.3457421189999987,2.6867000000000005,0.23,0.32291194480077345,8.6003001334252052E-2,1,87.513126491646773,87.513126491646773,0.98329355608591884,0.98329355608591884,3,23.307875894988065,23.307875894988065,0.11933174224343675,0.11933174224343675]
[null,"PA27","UPPER NORTH/EYRE PENINSULA","Rural Short",3,11.79083,0,0.95,0,6.5319433304398518E-3,null,0,0,0,0,2,112,112,1.3333333333333333,1.3333333333333333]
[null,"PA28","UPPER NORTH/EYRE PENINSULA","Rural Long",2,1.4,0,0.15,6.2701348505004558E-3,0,1,178,178,2,2,null,0,0,0,0]
[null,"PL01","MAJOR METROPOLITAN AREAS","Urban",1164.5,10.065969872999997,1.62588,7.0000000000000007E-2,5.7968050666134454,0,6,229.78789179905539,188.10476599398885,2.9463288965221124,2.0017174753112923,null,0,0,0,0]
[null,"PL02","MAJOR METROPOLITAN AREAS","Urban",4.5,6.2653792999999999E-2,0.43667,1.81,7.148847003536918E-3,0,3,73.333333333333329,50.666666666666664,1.3333333333333333,0.88888888888888884,null,0,0,0,0]
[null,"PL03","MAJOR METROPOLITAN AREAS","Urban",344,0.51069068799999995,3.4326000000000003,3.51,0.57628372117602755,0.24598532643988397,4,77.331395348837205,37.424418604651166,1.5494186046511629,0.65406976744186052,3,33.008720930232556,33.008720930232556,0.14825581395348839,0.14825581395348839]
[null,"PL04","MAJOR METROPOLITAN AREAS","Urban",483,62.842190368000004,0.49859999999999999,5.91,2.3810859683235055,0.25107617203331178,3,227.56521739130434,187.1614906832298,2.1180124223602483,1.175983436853002,3,23.995859213250519,23.995859213250519,8.6956521739130432E-2,8.6956521739130432E-2]
[null,"PL06","MAJOR METROPOLITAN AREAS","Urban",1413.5,7.104870415999998,4.0302199999999999,2.63,1.3286312012039592,0.78788959248072044,5,43.389692421890551,2.6270465074936613,0.97323426970079419,1.9573144833443679E-2,2,25.730456314113901,25.730456314113901,0.11956137247966042,0.11956137247966042]
[null,"PL07","MAJOR METROPOLITAN AREAS","Urban",2577,34.028139884999995,4.413861432,6.69,5.1112378605827571,1.1701579386153036,22,91.55659036040538,63.21666020906661,1.581813477541586,0.6144095194507827,9,20.960807140085372,20.960807140085372,0.14590609235545207,0.14590609235545207]
[null,"PL08","MAJOR METROPOLITAN AREAS","Urban",42,21.254510000000003,8.6840000000000001E-2,6.25,0.25068623492402792,0.25456394284412825,5,275.52380952380952,240.66666666666666,2.5238095238095237,1.7142857142857142,3,279.78571428571428,279.78571428571428,0.88095238095238093,0.88095238095238093]
[null,"PL10","UPPER NORTH/EYRE PENINSULA","Rural Long",69,42.935390000000005,0,0.11,0.13257108151605879,0.14033829912580795,2,109.08695652173913,84.463768115942031,1.7971014492753623,0.89855072463768115,1,115.47826086956522,115.47826086956522,0.46376811594202899,0.46376811594202899]
[null,"PL11","UPPER NORTH/EYRE PENINSULA","Rural Long",104,24.882440000000003,1.01474,0.3,4.8699221521443146E-2,4.4912482777461127E-2,2,26.58653846153846,1.3076923076923077,0.96153846153846156,9.6153846153846159E-3,3,24.51923076923077,24.51923076923077,0.16346153846153846,0.16346153846153846]
[null,"PL12","UPPER NORTH/EYRE PENINSULA","Rural Long",784,10.262200000000004,2.6307600000000004,0.25,1.5647685127050899,5.130256076476325,3,113.32015306122449,88.150510204081627,1.9247448979591837,0.96683673469387754,4,371.53189056990095,371.53189056990095,2.057823439033664,2.057823439033664]
[null,"PL13","UPPER NORTH/EYRE PENINSULA","Rural Long",17,15.845919999999998,0,1.62,7.9081195165019783E-3,3.1600422882221655,1,26.411764705882351,0,1,0,2,10554,10554,2,2]
[null,"PL14","UPPER NORTH/EYRE PENINSULA","Urban",641,39.862315503999966,2.0235499999999997,0.51,0.39517959708642569,0.98511111708738741,3,28.458658346333852,0.60218408736349449,0.96255850234009366,3.1201248049921998E-3,3,70.942277691107648,70.942277691107648,0.22152886115444617,0.22152886115444617]
[null,"PL15","UPPER NORTH/EYRE PENINSULA","Rural Long",82.5,21.556080000000009,0.62584999999999991,1.66,0.22068761145160312,0.51799063470005169,4,151.87878787878788,144.72727272727272,2.606060606060606,1.8909090909090909,4,356.4848484848485,356.4848484848485,2.5696969696969698,2.5696969696969698]
[null,"PL20","UPPER NORTH/EYRE PENINSULA","Rural Long",39.5,41.186630000000008,0,0.53,8.3766183564551025E-2,7.7672176097491599E-3,2,120.40506329113924,92.151898734177209,2.0253164556962027,1.0126582278481013,2,11.164556962025317,11.164556962025317,7.5949367088607597E-2,7.5949367088607597E-2]
[null,"PL21","UPPER NORTH/EYRE PENINSULA","Rural Long",68,57.851909999999975,0,0.04,0.12827357336009781,1.0647428711160227,2,107.10294117647059,84.32352941176471,1.7941176470588236,0.8970588235294118,5,889.01470588235293,889.01470588235293,3.5588235294117645,3.5588235294117645]
[null,"PL22","UPPER NORTH/EYRE PENINSULA","Rural Long",45,54.96679000000001,0,0.09,0.21288516836516574,0.18857958945030445,5,268.60000000000002,244.64444444444445,3,2.0222222222222221,1,237.93333333333334,237.93333333333334,0.9555555555555556,0.9555555555555556]
[null,"PL23","UPPER NORTH/EYRE PENINSULA","Rural Long",55,29.349080000000001,0,0.08,0.14213479843690638,0.82045419028332234,4,146.72727272727272,140.18181818181819,2.5272727272727273,1.8727272727272728,6,846.9636363636364,846.9636363636364,4.2727272727272725,4.2727272727272725]
[null,"PL24","UPPER NORTH/EYRE PENINSULA","Rural Long",59.5,62.076730000000005,0,0.14000000000000001,9.0529475088686352E-3,4.7096462332129829E-2,2,8.6386554621848735,1.9159663865546219,0.68907563025210083,1.680672268907563E-2,2,44.941176470588232,44.941176470588232,1.0420168067226891,1.0420168067226891]
[null,"PL25","UPPER NORTH/EYRE PENINSULA","Rural Long",70,46.81692000000001,0,7.0000000000000007E-2,0.48900006738565915,4.875205973647545E-2,3,396.62857142857143,390.05714285714288,2.6,1.9428571428571428,2,39.542857142857144,39.542857142857144,1.0428571428571429,1.0428571428571429]
[null,"PL26","UPPER NORTH/EYRE PENINSULA","Urban",1.5,20.980940000000007,0,0.11,1.5554158025877297E-2,5.3941300117596753E-3,3,478.66666666666669,444.66666666666669,2.6666666666666665,2,1,166,166,0.66666666666666663,0.66666666666666663]
[null,"PL27","UPPER NORTH/EYRE PENINSULA","Rural Long",150,25.372559999999986,0,0.02,0.29126185399642146,0.47001353545071678,2,110.24666666666667,86.146666666666661,1.9066666666666667,0.94666666666666666,2,177.90666666666667,177.90666666666667,0.96666666666666667,0.96666666666666667]
[null,"PL28","UPPER NORTH/EYRE PENINSULA","Rural Long",94,15.745310000000002,0,0.24,0.2622184484669966,0.40269764949955739,4,158.38297872340425,151.89361702127658,2.6382978723404253,1.9893617021276595,2,243.2340425531915,243.2340425531915,1.9680851063829787,1.9680851063829787]
[null,"PL29","UPPER NORTH/EYRE PENINSULA","Rural Long",91.5,17.046799999999998,0,0.13,0.24009684910680398,0,4,148.98360655737704,123.01639344262296,2.8743169398907105,1.9125683060109289,null,0,0,0,0]
[null,"PL30","UPPER NORTH/EYRE PENINSULA","Rural Long",39,21.969540000000002,0,0.21,7.2159388995787541E-2,0.16661650473520873,2,105.05128205128206,81.666666666666671,1.8205128205128205,0.89743589743589747,4,242.56410256410257,242.56410256410257,1.5128205128205128,1.5128205128205128]
[null,"PL32","MAJOR METROPOLITAN AREAS","Urban",1,11.290958614999997,1.6080300000000001,0.06,3.5527603290304685E-3,1.0138364841379631E-2,2,164,113,2,1,3,468,468,3,3]
[null,"PL33","UPPER NORTH/EYRE PENINSULA","Rural Long",58.5,102.74938999999996,0.14154999999999998,18.46,8.5368942753864349E-2,0.46851645269146808,4,82.854700854700852,62.239316239316238,1.1965811965811965,0.42735042735042733,6,454.71794871794873,454.71794871794873,0.44444444444444442,0.44444444444444442]
[null,"PL34","UPPER NORTH/EYRE PENINSULA","Rural Long",27,34.113149999999997,10.354839999999999,3.49,3.5225476688204803E-3,4.3644365616685755E-2,1,7.4074074074074074,0,0.7407407407407407,0,2,91.777777777777771,91.777777777777771,1.2222222222222223,1.2222222222222223]
[null,"PL754A","UPPER NORTH/EYRE PENINSULA","Rural Long",23.5,1.0527800000000003,12.783110000000001,7.26,3.7515132672938122E-3,0.34947195422367994,2,9.0638297872340434,0.97872340425531912,1.7872340425531914,0.97872340425531912,7,844.34042553191489,844.34042553191489,4.6808510638297873,4.6808510638297873]
[null,"PL803A","MAJOR METROPOLITAN AREAS","Urban",1483.5,7.3042532900000019,14.916149999999993,1.28,4.9774172209716863,0,5,154.87967644084935,114.51769464105156,1.8934951129086619,0.95854398382204242,null,0,0,0,0]
[null,"PL803C","MAJOR METROPOLITAN AREAS","Urban",1115,14.322936605999999,1.80063,2.9,6.6698453480327089,9.8047519812145739E-2,7,276.13333242099918,235.75575394566283,2.8092675564000427,1.8846038792699977,2,4.0591928251121079,4.0591928251121079,1.2556053811659192E-2,1.2556053811659192E-2]
[null,"PP01","UPPER NORTH/EYRE PENINSULA","Urban",394,3.4368899999999982,4.3783699999999985,5.41,0.90844514876763838,5.1081761316181987E-2,4,106.43401015228426,106.43401015228426,0.91624365482233505,0.91624365482233505,2,5.9847715736040605,5.9847715736040605,5.5837563451776651E-2,5.5837563451776651E-2]
[null,"PP02","UPPER NORTH/EYRE PENINSULA","Urban",1166.5,9.3984099999999984,2.0018500000000006,5.24,4.3001397884911467E-2,0,6,1.7016716673810544,1.7016716673810544,0.95756536648092583,0.95756536648092583,null,0,0,0,0]
[null,"PP03","UPPER NORTH/EYRE PENINSULA","Urban",2536,16.261460000000007,3.6649499999999997,3.05,11.494082176730144,1.2834346688622569,12,209.21989792303333,209.21989792303333,1.0628285968341287,1.0628285968341287,2,23.361593059936908,23.361593059936908,8.793375394321766E-2,8.793375394321766E-2]
[null,"PP04","UPPER NORTH/EYRE PENINSULA","Rural Short",2049.5,44.913550000000015,4.9987999999999992,6.73,3.9758149930058924,4.7162186070378214,12,99.787263645489475,99.787263645489475,1.0417174660132902,1.0417174660132902,25,118.37033422786045,118.37033422786045,0.48548426445474507,0.48548426445474507]
[null,"PP05","UPPER NORTH/EYRE PENINSULA","Rural Long",87.5,22.825919999999993,0.11807999999999999,6.29,0.47361242031558926,0.35931747495803318,7,307.31810518537247,307.31810518537247,1.672381078856332,1.672381078856332,6,233.15428571428572,233.15428571428572,1.84,1.84]
[null,"PP06","UPPER NORTH/EYRE PENINSULA","Rural Long",207,23.44952000000001,0.15569999999999998,0.27,0.51295336573372874,1.2751622561130141E-2,2,140.69564509737319,140.69564509737319,1.0193236069978724,1.0193236069978724,2,3.4975845410628019,3.4975845410628019,0.97584541062801933,0.97584541062801933]
[null,"PP07","UPPER NORTH/EYRE PENINSULA","Rural Long",60,24.649249999999999,0.86081999999999992,1.0900000000000001,0.11096025156784514,1.142027566969944,1,105,105,0.75,0.75,3,1080.6833333333334,1080.6833333333334,2.0499999999999998,2.0499999999999998]
[null,"PP08","UPPER NORTH/EYRE PENINSULA","Rural Long",418.5,51.766449999999992,0.34585000000000005,0.3,1.4546712646224282,6.2620153781238246,8,197.35244641594562,196.66427437293487,1.3636001057474796,1.3588211332265716,10,849.55555555555554,849.55555555555554,3.3930704898446833,3.3930704898446833]
[null,"PP09","UPPER NORTH/EYRE PENINSULA","Rural Long",793,27.080907267000018,1.0791600000000001,1.0900000000000001,2.8924343418218732,0.22857811822976098,6,207.09205548549812,207.09205548549812,2.9054224464060532,2.9054224464060532,1,16.365699873896595,16.365699873896595,5.2963430012610342E-2,5.2963430012610342E-2]
[null,"PP10","UPPER NORTH/EYRE PENINSULA","Urban",1689.5,15.169280000000002,0.96975000000000011,2.19,7.0220957322471902,0.51164081372586345,7,191.86090429282888,191.86090429282888,0.96004734761829946,0.96004734761829946,3,13.979283811778632,13.979283811778632,7.0435039952648715E-2,7.0435039952648715E-2]
[null,"PP12","UPPER NORTH/EYRE PENINSULA","Rural Long",82,90.817049999999995,1.5820000000000001E-2,4.76,2.0988043520366189,6.4462622339414794E-3,9,1453.219512195122,1453.219512195122,4.6951219512195124,4.6951219512195124,3,4.4634146341463419,4.4634146341463419,6.097560975609756E-2,6.097560975609756E-2]
[null,"PP13","UPPER NORTH/EYRE PENINSULA","Rural Long",79.5,84.509580000000042,0.29346,0.1,0.32245401360382681,0.26489558469530017,2,230.28930817610063,230.28930817610063,1.6352201257861636,1.6352201257861636,2,189.1823899371069,189.1823899371069,0.5911949685534591,0.5911949685534591]
[null,"PP15","UPPER NORTH/EYRE PENINSULA","Rural Long",57,20.277959999999997,0.22927,0.1,0.13072174398992803,9.15862393893325E-4,2,130.21052631578948,130.21052631578948,0.92982456140350878,0.92982456140350878,1,0.91228070175438591,0.91228070175438591,0.91228070175438591,0.91228070175438591]
[null,"PP16","UPPER NORTH/EYRE PENINSULA","Rural Short",90.5,116.74632999999994,0.19792999999999997,0.09,0.17280488652443673,1.7496276777963889E-2,3,98.220990428608431,98.220990428608431,0.87292816559912745,0.87292816559912745,1,9.94475138121547,9.94475138121547,0.82872928176795579,0.82872928176795579]
[null,"PP17","UPPER NORTH/EYRE PENINSULA","Rural Long",59,62.123510000000046,0,0.1,1.0843810743696969,1.4248176938228523,2,1043.5254237288136,1043.5254237288136,1.7627118644067796,1.7627118644067796,13,1371.1355932203389,1371.1355932203389,2.9152542372881354,2.9152542372881354]
[null,"PP18","UPPER NORTH/EYRE PENINSULA","Rural Long",233,33.665020000000005,1.0263000000000002,7.0000000000000007E-2,0.55864083479824,0.4777631403221218,3,136.12875536480686,135.5107296137339,0.96137339055793991,0.9570815450643777,3,116.4206008583691,116.4206008583691,2.1587982832618025,2.1587982832618025]
[null,"R01","BAROSSA/MID NORTH & YORKE PENINSULA/RIVE","Rural Long",152,28.617619999999995,2.80511,0.72,0.34496309320758967,0,3,128.85526315789474,128.85526315789474,0.92105263157894735,0.92105263157894735,null,0,0,0,0]
[null,"R02","BAROSSA/MID NORTH & YORKE PENINSULA/RIVE","Rural Long",394,20.2714,0.16905000000000001,0.4,0.22819063798619074,6.4920553536361461E-2,1,32.883248730964468,32.883248730964468,0.10406091370558376,0.10406091370558376,1,9.3553299492385786,9.3553299492385786,4.8223350253807105E-2,4.8223350253807105E-2]
[null,"R03","BAROSSA/MID NORTH & YORKE PENINSULA/RIVE","Rural Long",116.5,33.500369999999997,0.33285999999999999,0.95,0.49400208507538423,0,1,240.75536480686696,240.75536480686696,0.94420600858369097,0.94420600858369097,null,0,0,0,0]
[null,"R04","BAROSSA/MID NORTH & YORKE PENINSULA/RIVE","Rural Long",384,71.846929999999986,0.47506999999999999,0.43,5.2098480021854909E-2,1.010971180951478E-2,1,7.703125,7.703125,4.4270833333333336E-2,4.4270833333333336E-2,2,1.4947916666666667,1.4947916666666667,1.0416666666666666E-2,1.0416666666666666E-2]
[null,"R05","BAROSSA/MID NORTH & YORKE PENINSULA/RIVE","Rural Long",52,49.602860000000021,0,1.18,0.11671961700636663,0,1,127.44230769230769,127.44230769230769,0.90384615384615385,0.90384615384615385,null,0,0,0,0]
[null,"R06","BAROSSA/MID NORTH & YORKE PENINSULA/RIVE","Rural Long",59,44.993599999999986,2.7E-2,0.12,0,1.7612738344102402E-3,null,0,0,0,0,1,1.6949152542372881,1.6949152542372881,3.3898305084745763E-2,3.3898305084745763E-2]
[null,"R07","BAROSSA/MID NORTH & YORKE PENINSULA/RIVE","Rural Short",116,92.966679999999982,0.18076,0.32,0.14877667353528626,0.46159066201774951,2,65.974137931034477,65.974137931034477,0.5431034482758621,0.5431034482758621,3,204.68965517241378,204.68965517241378,0.74137931034482762,0.74137931034482762]
[null,"R08","BAROSSA/MID NORTH & YORKE PENINSULA/RIVE","Rural Long",128,94.39427000000002,0.54122999999999999,0.13,1.3042937253341593,0,5,578.546875,578.546875,3.671875,3.671875,null,0,0,0,0]
[null,"R09","BAROSSA/MID NORTH & YORKE PENINSULA/RIVE","Rural Long",197.5,44.832220000000035,1.4113600000000002,0.1,2.4628068153941833,1.4266318058722947E-3,5,708.00506329113921,708.00506329113921,3.8734177215189876,3.8734177215189876,1,0.41012658227848103,0.41012658227848103,5.0632911392405064E-3,5.0632911392405064E-3]
[null,"R10","BAROSSA/MID NORTH & YORKE PENINSULA/RIVE","Rural Long",80.5,55.499339999999997,0,0.98,0,1.83172478778665E-3,null,0,0,0,0,1,1.2919254658385093,1.2919254658385093,1.2422360248447204E-2,1.2422360248447204E-2]
[null,"R11","BAROSSA/MID NORTH & YORKE PENINSULA/RIVE","Rural Long",88.5,70.836809999999986,0.42795,7.0000000000000007E-2,0.40433563416555884,0,3,259.40112994350284,259.40112994350284,1.8983050847457628,1.8983050847457628,null,0,0,0,0]
[null,"R12","BAROSSA/MID NORTH & YORKE PENINSULA/RIVE","Rural Long",95.5,65.130279999999971,0,0.14000000000000001,0.25864306258314379,0,1,153.7696335078534,153.7696335078534,0.93193717277486909,0.93193717277486909,null,0,0,0,0]
[null,"R14","BAROSSA/MID NORTH & YORKE PENINSULA/RIVE","Rural Long",222,59.960949999999983,0.11591,0.11,0.86809666040407418,6.411036757253275E-3,9,222.0180213172157,222.0180213172157,1.675675697154827,1.675675697154827,2,1.6396396396396395,1.6396396396396395,0.14414414414414414,0.14414414414414414]
[null,"R15","BAROSSA/MID NORTH & YORKE PENINSULA/RIVE","Rural Long",112,80.724679999999964,0.25918999999999998,0.6,1.0910386894637674,2.9589400418092038E-3,5,553.08928571428567,553.08928571428567,3.5446428571428572,3.5446428571428572,1,1.5,1.5,2.6785714285714284E-2,2.6785714285714284E-2]
[null,"R16","BAROSSA/MID NORTH & YORKE PENINSULA/RIVE","Rural Long",77,65.39967,0.34555000000000002,0.09,1.2029500289021942E-2,7.6087029646522385E-3,1,8.8701298701298708,8.8701298701298708,1.2987012987012988E-2,1.2987012987012988E-2,1,5.6103896103896105,5.6103896103896105,0.11688311688311688,0.11688311688311688]
[null,"R17","BAROSSA/MID NORTH & YORKE PENINSULA/RIVE","Rural Long",77,56.137910000000062,0,0.16,0.24761748837973568,3.2055183786266375E-3,3,182.58441558441558,163.96103896103895,1.0129870129870129,1,3,2.3636363636363638,2.3636363636363638,6.4935064935064929E-2,6.4935064935064929E-2]
[null,"R18","BAROSSA/MID NORTH & YORKE PENINSULA/RIVE","Rural Long",665,48.204740000000008,1.4483400000000002,0.32,0.98331918175123723,0.10245329894764368,3,83.954887218045116,83.954887218045116,1.0165413533834586,1.0165413533834586,2,8.7473684210526308,8.7473684210526308,0.96842105263157896,0.96842105263157896]
[null,"R20","BAROSSA/MID NORTH & YORKE PENINSULA/RIVE","Rural Long",692,7.5980118289999981,1.26841,1.91,5.1347825113629266,1.282207351450655E-2,3,421.2976878612717,421.2976878612717,2.846820809248555,2.846820809248555,1,1.0520231213872833,1.0520231213872833,2.8901734104046241E-3,2.8901734104046241E-3]
[null,"R21","BAROSSA/MID NORTH & YORKE PENINSULA/RIVE","Rural Long",635.5,67.315699999999993,0.66379999999999995,2.15,9.8801603380923808E-2,2.56441470290131E-2,6,8.8271712956702402,8.8271712956702402,4.4584322313358252E-2,4.4584322313358252E-2,2,2.2911093627065302,2.2911093627065302,1.2588512981904013E-2,1.2588512981904013E-2]
[null,"R22","BAROSSA/MID NORTH & YORKE PENINSULA/RIVE","Rural Long",9.5,5.9954199999999993,0,1.54,1.8123507756081375E-2,1.6344621183327031E-2,1,108.31578947368421,108.31578947368421,0.73684210526315785,0.73684210526315785,1,97.684210526315795,97.684210526315795,0.84210526315789469,0.84210526315789469]
[null,"R23","BAROSSA/MID NORTH & YORKE PENINSULA/RIVE","Rural Long",368.5,3.0084599999999995,1.4121300000000001,0.09,2.29707090457633,0,5,353.92400965697084,353.92400965697084,1.9421076185829442,1.9421076185829442,null,0,0,0,0]
[null,"R24","BAROSSA/MID NORTH & YORKE PENINSULA/RIVE","Rural Long",32,1.6103900000000002,0,1.1200000000000001,7.7513661452394675E-2,3.6986750522615044E-3,3,137.53125,137.53125,1.90625,1.90625,2,6.5625,6.5625,1.875,1.875]
[null,"R25","BAROSSA/MID NORTH & YORKE PENINSULA/RIVE","Rural Long",129,98.390369999999905,0,0.09,1.4773741050416536,0.90797188711516708,5,650.24031007751933,650.24031007751933,1.4496124031007751,1.4496124031007751,8,399.62790697674421,399.62790697674421,2.5193798449612403,2.5193798449612403]
[null,"R26","BAROSSA/MID NORTH & YORKE PENINSULA/RIVE","Rural Long",100.5,63.22802999999999,0,0.13,0.22007116560955953,1.6098042846509595E-2,1,124.32835820895522,124.32835820895522,0.845771144278607,0.845771144278607,3,9.0945273631840795,9.0945273631840795,5.9701492537313432E-2,5.9701492537313432E-2]
[null,"R27","BAROSSA/MID NORTH & YORKE PENINSULA/RIVE","Rural Long",38,39.008690000000009,0,0.12,7.6087029646522378E-2,3.6986750522615044E-3,2,113.68421052631579,113.68421052631579,1.5789473684210527,1.5789473684210527,2,5.5263157894736841,5.5263157894736841,1.5789473684210527,1.5789473684210527]
[null,"R28","BAROSSA/MID NORTH & YORKE PENINSULA/RIVE","Rural Long",93.5,55.325480000000027,0,0.01,0.4345062549490063,0.46134806818541835,3,263.85026737967917,263.85026737967917,1.9144385026737969,1.9144385026737969,2,280.14973262032083,280.14973262032083,0.98395721925133695,0.98395721925133695]
[null,"R29","BAROSSA/MID NORTH & YORKE PENINSULA/RIVE","Rural Long",96,74.391630000000035,0.25536999999999999,0.1,1.3391141090404499,4.808277567939956E-3,5,791.98958333333337,791.98958333333337,3.375,3.375,2,2.84375,2.84375,3.125E-2,3.125E-2]
[null,"R30","BAROSSA/MID NORTH & YORKE PENINSULA/RIVE","Rural Long",69.5,67.011230000000026,0,0.12,0.36403768883425264,0,2,297.39568345323738,297.39568345323738,1.6834532374100719,1.6834532374100719,null,0,0,0,0]
[null,"R31","BAROSSA/MID NORTH & YORKE PENINSULA/RIVE","Rural Long",28.5,22.406559999999995,0,7.0000000000000007E-2,0.15587273434530627,9.7310379351165779E-2,2,310.5263157894737,310.5263157894737,1.7543859649122806,1.7543859649122806,1,193.85964912280701,193.85964912280701,0.8771929824561403,0.8771929824561403]
[null,"R32","BAROSSA/MID NORTH & YORKE PENINSULA/RIVE","Rural Long",90,62.310780000000008,0,0.02,0.212268717148141,3.5577731455086856E-3,2,133.91110772026909,133.91110772026909,0.8999999887413449,0.8999999887413449,1,2.2444444444444445,2.2444444444444445,2.2222222222222223E-2,2.2222222222222223E-2]
[null,"R33","BAROSSA/MID NORTH & YORKE PENINSULA/RIVE","Rural Long",99,68.771530000000027,0.32784999999999997,0.12,0.22572485461801639,0.15663008209410267,2,129.45454545454547,129.45454545454547,1.797979797979798,1.797979797979798,3,89.828282828282823,89.828282828282823,2.6868686868686869,2.6868686868686869]
[null,"R34","BAROSSA/MID NORTH & YORKE PENINSULA/RIVE","Rural Short",15,4.2121399999999998,0,0.1,2.4494787489149444E-2,2.2492435813449129E-2,1,84,84,0.93333333333333335,0.93333333333333335,1,77.13333333333334,77.13333333333334,0.8666666666666667,0.8666666666666667]
[null,"R35","BAROSSA/MID NORTH & YORKE PENINSULA/RIVE","Rural Long",81,63.287839999999996,0.33859000000000006,0.05,0.96852448154219106,2.2896559847333125E-3,3,678.88888888888891,678.88888888888891,2.7407407407407409,2.7407407407407409,2,1.6049382716049383,1.6049382716049383,0.32098765432098764,0.32098765432098764]
[null,"R36","BAROSSA/MID NORTH & YORKE PENINSULA/RIVE","Rural Short",39.5,36.646830000000008,0.16229999999999997,7.0000000000000007E-2,0.51059967908339277,0,3,664.93671117855024,664.93671117855024,2.6329114165487169,2.6329114165487169,null,0,0,0,0]
[null,"SA11","MAJOR METROPOLITAN AREAS","Urban",2359.5,8.8830773870000019,7.9991231069999973,0.04,14.871240644419663,5.9695255428534448,23,290.94115392220527,290.94115392220527,2.1902945049992808,2.1902945049992808,16,116.78787878787878,116.78787878787878,0.40559440559440557,0.40559440559440557]
[null,"SA12","MAJOR METROPOLITAN AREAS","Urban",411.5,4.6381686589999989,2.4735409469999996,7.03,0.78825777121777663,0.51809643920178461,9,88.425262710738153,88.425262710738153,1.2045361923273394,1.2045361923273394,4,58.119076549210206,58.119076549210206,0.17496962332928312,0.17496962332928312]
[null,"SA13","MAJOR METROPOLITAN AREAS","Urban",1103,5.1239767169999979,5.4796771769999983,5.41,0.76535265634978755,0.75106219882613623,11,32.030522170979005,32.030522170979005,0.76820790800092875,0.76820790800092875,4,31.4324569356301,31.4324569356301,0.17860380779691751,0.17860380779691751]
[null,"SA14","MAJOR METROPOLITAN AREAS","Urban",3058,10.576102733999999,22.013266122999998,6.84,11.093688928361512,1.2306848432452495,25,167.46206418044275,167.46206418044275,1.0624591144102706,1.0624591144102706,7,18.57750163505559,18.57750163505559,0.21353826030085024,0.21353826030085024]
[null,"SA16","MAJOR METROPOLITAN AREAS","Urban",1899.5,14.530850508999995,1.6629400000000001,7.64,10.261223782372102,0.23773165762670953,29,249.36632124741914,249.36632124741914,3.2287443755456855,3.2287443755456855,1,5.7773098183732561,5.7773098183732561,0.96288496972887605,0.96288496972887605]
[null,"SA17","MAJOR METROPOLITAN AREAS","Urban",2860.5,15.023473080000004,10.771434712,7.77,2.6408199852140424,0.1909392045126497,35,42.616206008599079,42.616206008599079,0.89786166030127201,0.89786166030127201,2,3.0812794965915051,3.0812794965915051,1.4333158538717007E-2,1.4333158538717007E-2]
[null,"SA18","MAJOR METROPOLITAN AREAS","Urban",2399,12.051389921,5.7958226269999997,6.74,7.4750726768430047,1.3242264231278931,20,143.83451351596693,143.83451351596693,1.0757259919077915,1.0757259919077915,2,25.480616923718216,25.480616923718216,0.10087536473530638,0.10087536473530638]
[null,"SA19","MAJOR METROPOLITAN AREAS","Urban",1510.5,7.6928029830000009,14.669962715000004,9.68,1.3643393151222576,0.76044235262168625,10,41.694579835681481,41.694579835681481,1.0916914556327146,1.0916914556327146,2,23.239324726911619,23.239324726911619,8.1429990069513403E-2,8.1429990069513403E-2]
[null,"SA20","MAJOR METROPOLITAN AREAS","Urban",2641,9.5966518410000106,9.4119300000000017,5.87,3.8713098572602198,4.6399916424047438,27,67.665527135754388,67.665527135754388,0.54373343174737099,0.54373343174737099,11,81.101098068913288,81.101098068913288,0.28966300643695569,0.28966300643695569]
[null,"SA31","MAJOR METROPOLITAN AREAS","Urban",2846.5,1.7206164569999998,30.04297055100001,6.88,0.39421188634164306,1.0024849816232559,11,6.3928787014343262,6.3928787014343262,0.15972831658397349,0.15972831658397349,3,16.25715791322677,16.25715791322677,0.13349727735815914,0.13349727735815914]
[null,"SA32","MAJOR METROPOLITAN AREAS","Urban",2433.5,8.5790660179999936,14.804153042999994,4.4800000000000004,0.93862900373160874,1.927394141671767,12,17.804941723276659,17.804941723276659,6.6844726211362906E-2,6.6844726211362906E-2,7,36.560920484898297,36.560920484898297,0.12985411958085064,0.12985411958085064]
[null,"SA33","MAJOR METROPOLITAN AREAS","Urban",2564,7.0099323120000054,16.211017687000002,6.1,6.7748464950728744,1.417443055419467,19,121.97178395192448,121.97178395192448,2.0014300264545981,2.0014300264545981,8,25.519110764430579,25.519110764430579,0.13689547581903277,0.13689547581903277]
[null,"SA34","MAJOR METROPOLITAN AREAS","Urban",1266,7.4614576749999975,18.358998791000008,7.22,0.60664853004061536,0.55689518157552598,4,22.119809438455352,22.119809438455352,5.5555576349698335E-2,5.5555576349698335E-2,6,20.305687203791468,20.305687203791468,9.6366508688783575E-2,9.6366508688783575E-2]
[null,"SA35","MAJOR METROPOLITAN AREAS","Urban",934.5,0,10.801555044999999,5.09,0.15019795622066109,0,8,7.4192952604584672,7.4192952604584672,0.73515247903194192,0.73515247903194192,null,0,0,0,0]
[null,"SA36","MAJOR METROPOLITAN AREAS","Urban",952.5,47.586886952000015,6.573540000000003,2.74,9.6361041890520536,1.3075891064651164,24,466.99737569653769,466.99737569653769,2.834995625963987,2.834995625963987,20,63.370078740157481,63.370078740157481,0.33280839895013126,0.33280839895013126]
[null,"SA38","MAJOR METROPOLITAN AREAS","Urban",17.5,7.9371728429999999,4.6755899999999988,3.05,0.15699301283221834,2.4132774430121597E-2,4,414.1142857142857,414.1142857142857,2,2,3,63.657142857142858,63.657142857142858,0.2857142857142857,0.2857142857142857]
[null,"SA40","MAJOR METROPOLITAN AREAS","Urban",1226,0,15.954336609999999,0,0.52954929091128478,0,8,19.938563139948137,19.938563139948137,5.0027210988578381E-2,5.0027210988578381E-2,null,0,0,0,0]
[null,"SA41","MAJOR METROPOLITAN AREAS","Urban",1159,6.3806850519999978,12.922169999999996,3.32,1.1042296889761716,4.7400321741087854,6,43.97986794340909,43.97986794340909,0.98849582886401,0.98849582886401,4,188.78861087144091,188.78861087144091,0.79119930974978425,0.79119930974978425]
[null,"SA42","MAJOR METROPOLITAN AREAS","Urban",2111.5,5.2429469480000011,30.554549999999978,4.57,0.65232118511005777,3.1782257355633483,22,14.260945975258265,14.260945975258265,0.11413682661659479,0.11413682661659479,12,69.481884915936533,69.481884915936533,0.74449443523561454,0.74449443523561454]
[null,"SA520B","MAJOR METROPOLITAN AREAS","Urban",85,0.51763297600000002,6.1618399999999998,6.25,0.23838155280884926,9.6011181574774618E-2,1,129.45882352941177,129.45882352941177,0.9882352941176471,0.9882352941176471,1,52.141176470588235,52.141176470588235,0.2,0.2]
[null,"SA520D","MAJOR METROPOLITAN AREAS","Urban",1943.5,0.52358859699999993,14.134203305999993,3.41,1.2007892576245616,5.5457722209256093E-2,14,28.520700386504696,28.520700386504696,0.14081121401888622,0.14081121401888622,1,1.3172112168767687,1.3172112168767687,4.1162850527399021E-2,4.1162850527399021E-2]
[null,"SA520E","MAJOR METROPOLITAN AREAS","Urban",580,4.3806319250000003,6.1458367149999997,6.54,3.8041186816063752,0,4,302.76383761701913,302.76383761701913,2.6034485816955568,2.6034485816955568,null,0,0,0,0]
[null,"SA520G","MAJOR METROPOLITAN AREAS","Urban",57,0.702283922,6.8687100000000001,4.04,0,8.5136268860303305E-3,null,0,0,0,0,1,6.8947368421052628,6.8947368421052628,1.7543859649122806E-2,1.7543859649122806E-2]
[null,"SA520H","MAJOR METROPOLITAN AREAS","Urban",199,1.7840977169999996,8.2149799999999953,5.68,0.65266811056106699,3.3534591398409551E-2,3,151.3969947393216,151.3969947393216,1.9396985403856439,1.9396985403856439,1,7.7788944723618094,7.7788944723618094,1.0050251256281407E-2,1.0050251256281407E-2]
[null,"SA520J","MAJOR METROPOLITAN AREAS","Urban",1218,0,14.241840200000002,5.64,4.1376659929562168E-3,4.3326345475981322E-4,1,0.1568144499178982,0.1568144499178982,8.2101806239737272E-4,8.2101806239737272E-4,1,1.6420361247947456E-2,1.6420361247947456E-2,4.1050903119868639E-3,4.1050903119868639E-3]
[null,"SA711C","MAJOR METROPOLITAN AREAS","Urban",2579,8.4938614419999983,10.683408181999997,5.93,3.623468934020138,0.70608945222206765,21,64.856145957127339,64.856145957127339,0.85485330722090713,0.85485330722090713,6,12.638231872818922,12.638231872818922,5.9325319891430785E-2,5.9325319891430785E-2]
[null,"SA744B","MAJOR METROPOLITAN AREAS","Urban",1,0,1.0606900000000001,5.43,0,1.1091544441851221E-2,null,0,0,0,0,1,512,512,1,1]
[null,"SA744C","MAJOR METROPOLITAN AREAS","Urban",922.5,11.132880656000017,10.364745729000004,4.99,3.8545715881498284,0.3044325664869828,4,192.88021362635502,192.88021362635502,0.99223125564588976,0.99223125564588976,2,15.23360433604336,15.23360433604336,7.0460704607046065E-2,7.0460704607046065E-2]
[null,"SA744D","MAJOR METROPOLITAN AREAS","Urban",2830,8.337236549,15.972209999999997,7.35,9.5321712083819499,3.7005681566217792,31,155.48315190291657,155.48315190291657,2.1661954905034797,2.1661954905034797,14,60.361484098939933,60.361484098939933,0.56643109540636039,0.56643109540636039]
[null,"SA744H","MAJOR METROPOLITAN AREAS","Urban",21.5,0,5.8213299999999988,7.51,1.9626834500619542E-2,0,1,42.139534883720927,42.139534883720927,0.97674418604651159,0.97674418604651159,null,0,0,0,0]
[null,"SB01","UPPER NORTH/EYRE PENINSULA","Rural Long",868.5,40.516059999999982,10.22369,1.22,7.3782049179247107,0.27150036157433854,8,482.34080834792275,44.663203281716648,2.0587218978587551,1.1134138955559343,4,17.748992515831894,17.748992515831894,7.2538860103626937E-2,7.2538860103626937E-2]
[null,"SB02","UPPER NORTH/EYRE PENINSULA","Rural Long",21.5,19.007950000000001,0,2.71,0.58984476638709216,0.11471176483513895,4,1557.6589943641841,1105.4264362246495,2.9457365080367688,1.968992321990257,4,302.93023255813955,302.93023255813955,1.4883720930232558,1.4883720930232558]
[null,"SB03","UPPER NORTH/EYRE PENINSULA","Rural Long",65,49.218510000000002,0.10491,0.53,0.8235892577085725,0.50980071137004401,2,719.4,292.01538461538462,1.8461538461538463,0.92307692307692313,2,445.30769230769232,445.30769230769232,1.3076923076923077,1.3076923076923077]
[null,"SB15","UPPER NORTH/EYRE PENINSULA","Rural Long",119.5,129.10228999999993,0,0.59,2.5844639082568377,0.83718629171021963,7,1227.9358619466486,824.99025525208799,5.1827058432990034,4.3124129562697151,3,397.76569037656901,397.76569037656901,1.3723849372384938,1.3723849372384938]
[null,"SB16","UPPER NORTH/EYRE PENINSULA","Rural Long",39,61.179579999999987,0,0.11,0.38788534629432064,6.6681827370771704E-2,6,564.69232187515649,149.17950136233603,3.2307693285819812,2.3333334311460838,2,97.07692307692308,97.07692307692308,0.53846153846153844,0.53846153846153844]
[null,"SB17","UPPER NORTH/EYRE PENINSULA","Rural Long",160.5,110.88072000000001,0.16041,0.03,2.1686741563165643,1.0361750095218885,8,767.1713647753279,320.03740838903514,3.2980271900925682,2.332295102865154,6,366.54828660436135,366.54828660436135,1.4517133956386292,1.4517133956386292]
[null,"SB18","UPPER NORTH/EYRE PENINSULA","Rural Long",48,127.05405999999999,0,0.06,1.4978224942591567,0.78499974799664418,9,1771.7083333333333,1337.6458333333333,5.854166666666667,4.916666666666667,7,928.54166666666663,928.54166666666663,3.5,3.5]
[null,"SB19","UPPER NORTH/EYRE PENINSULA","Rural Long",66.5,132.63850000000008,0,0.1,0.97190612730425885,1.3741634583452136,4,829.80451127819549,439.90977443609023,2.1954887218045114,1.3533834586466165,5,1173.2481203007519,1173.2481203007519,3.4135338345864663,3.4135338345864663]
[null,"SB20","UPPER NORTH/EYRE PENINSULA","Rural Long",12,18.56786,0,0.1,0.17526435926216302,6.3405858038768665E-4,6,829.25,404.83333333333331,4,3.0833333333333335,1,3,3,8.3333333333333329E-2,8.3333333333333329E-2]
[null,"SB21","UPPER NORTH/EYRE PENINSULA","Rural Long",81,25.126740000000005,0.29714999999999997,0.02,0.66158729041951858,0.34262059900782404,4,463.74074074074076,12.17283950617284,1.9753086419753085,1,2,240.16049382716051,240.16049382716051,0.98765432098765427,0.98765432098765427]
[null,"SB22","UPPER NORTH/EYRE PENINSULA","Rural Long",53,102.30021999999995,0,0.08,0.97833477679985625,0.63176892440295318,8,1048.0566037735848,637.47169811320759,3.3962264150943398,2.5094339622641511,4,676.79245283018872,676.79245283018872,1.6226415094339623,1.6226415094339623]
[null,"SB23","UPPER NORTH/EYRE PENINSULA","Rural Long",61,139.28940000000003,0,0.09,1.9744231938505676,1.0306446096818405,5,1837.7377049180327,1412.688524590164,4.5901639344262293,3.6721311475409837,4,959.29508196721315,959.29508196721315,2.9344262295081966,2.9344262295081966]
[null,"SD1613","UPPER NORTH/EYRE PENINSULA","RURAL LONG",1,55.529229999999998,0,0.1,8.1546978533194123E-3,0,1,463,0,1,0,null,0,0,0,0]
[null,"SD1621","BAROSSA/MID NORTH & YORKE PENINSULA/RIVE","Rural Short",2,32.930759999999999,8.09E-3,1.34,0,7.4475818151532952E-2,null,0,0,0,0,3,1915.5,1915.5,3,3]
[null,"SD31100","UPPER NORTH/EYRE PENINSULA","Rural Long",49,60.144100000000002,0.24676000000000001,5.93,0.10909330130337029,0.12661797595575219,3,126.40816326530613,126.40816326530613,0.87755102040816324,0.87755102040816324,2,146.71428571428572,146.71428571428572,1.2448979591836735,1.2448979591836735]
[null,"SD31200","UPPER NORTH/EYRE PENINSULA","Rural Long",265.5,54.892749999999985,5.747E-2,0.01,2.0569036475159992,4.3855718476814983E-3,4,439.86817325800376,439.86817325800376,2.8097928436911488,2.8097928436911488,1,0.93785310734463279,0.93785310734463279,0.93785310734463279,0.93785310734463279]
[null,"SD31300","UPPER NORTH/EYRE PENINSULA","Rural Long",20,50.995499999999986,1.1677800000000003,2.5099999999999998,0.1606751811336577,3.1702929019384332E-4,2,456.13344726562502,456.13344726562502,1.1666667461395266,1.1666667461395266,1,0.9,0.9,0.9,0.9]
[null,"SD31400","UPPER NORTH/EYRE PENINSULA","Rural Long",15,39.266429999999993,1.5033299999999996,1.43,0.17725459869504659,2.8180381350563846E-4,2,670.93333333333328,670.93333333333328,2.1333333333333333,2.1333333333333333,1,1.0666666666666667,1.0666666666666667,1.0666666666666667,1.0666666666666667]
[null,"SD32200","UPPER NORTH/EYRE PENINSULA","Rural Long",171,113.41678000000003,0.45088,2,4.8628770568066734E-2,0.35792606862884907,4,16.146198830409357,16.146198830409357,0.88304093567251463,0.88304093567251463,3,118.84210526315789,118.84210526315789,1.3567251461988303,1.3567251461988303]
[null,"SD32301","UPPER NORTH/EYRE PENINSULA","Rural Long",4,16.848190000000002,0.14939999999999998,6.46,0,1.4900376639110634E-2,null,0,0,0,0,1,211.5,211.5,0.75,0.75]
[null,"SD32302","UPPER NORTH/EYRE PENINSULA","Rural Long",17,21.903100000000002,0.13879999999999998,8.57,0,7.9785704698783887E-3,null,0,0,0,0,1,26.647058823529413,26.647058823529413,0.17647058823529413,0.17647058823529413]
[null,"SD32400","UPPER NORTH/EYRE PENINSULA","Rural Long",32,73.786179999999987,0.28626999999999997,8.57,8.8486397440770484E-2,0,2,157,157,0.8125,0.8125,null,0,0,0,0]
[null,"SD33100","UPPER NORTH/EYRE PENINSULA","Rural Long",141,85.142540000000039,4.5759999999999995E-2,5.66,0.33997868825620869,0,2,136.90070921985816,136.90070921985816,0.95035460992907805,0.95035460992907805,null,0,0,0,0]
[null,"SD33200","BAROSSA/MID NORTH & YORKE PENINSULA/RIVE","Rural Long",346.5,98.712522652999965,1.1930000000000001,3.2,1.2635906547710516,4.1759802613866796E-2,6,207.05049976607594,207.05049976607594,2.017315956765267,2.017315956765267,4,6.8427128427128423,6.8427128427128423,0.53968253968253965,0.53968253968253965]
[null,"SD34102","BAROSSA/MID NORTH & YORKE PENINSULA/RIVE","Rural Long",66,56.082400917000008,2.2211399999999997,2.63,0.40063696099454077,3.5454442286678135E-2,3,344.65151676987159,344.65151676987159,1.8333333477829441,1.8333333477829441,3,30.5,30.5,0.13636363636363635,0.13636363636363635]
[null,"SD34201","BAROSSA/MID NORTH & YORKE PENINSULA/RIVE","Rural Short",419.5,65.089474037000045,1.6120900000000002,7.09,4.1994759812146345,9.6812731504733518E-2,6,514.94400406338457,514.94400406338457,2.441001428324503,2.441001428324503,6,11.871275327771157,11.871275327771157,0.14541120381406436,0.14541120381406436]
[null,"SD34300","BAROSSA/MID NORTH & YORKE PENINSULA/RIVE","Rural Short",138,48.75741,0.91809000000000007,6.74,6.3453163781415689E-2,3.1396096662679639E-2,1,23.652173913043477,23.652173913043477,0.73913043478260865,0.73913043478260865,1,11.702898550724637,11.702898550724637,3.6231884057971016E-2,3.6231884057971016E-2]
[null,"SD34400","BAROSSA/MID NORTH & YORKE PENINSULA/RIVE","Rural Long",134,93.204039128000019,0.72477999999999998,2.23,0.18272046274851164,5.215131823688722E-2,3,77.420416760800578,77.420416760800578,0.40796030635264391,0.40796030635264391,3,22.097014925373134,22.097014925373134,0.18656716417910449,0.18656716417910449]
[null,"SD34405","BAROSSA/MID NORTH & YORKE PENINSULA/RIVE","Rural Long",40,27.762609999999999,0.47138000000000002,9.1999999999999993,0,0.30711331850611362,null,0,0,0,0,2,435.92500000000001,435.92500000000001,1.875,1.875]
[null,"SD35100","BAROSSA/MID NORTH & YORKE PENINSULA/RIVE","Rural Long",21.5,26.438480000000002,0.41040999999999994,0,0,0.16027591893133186,null,0,0,0,0,1,423.25581395348837,423.25581395348837,0.93023255813953487,0.93023255813953487]
[null,"SD35200","BAROSSA/MID NORTH & YORKE PENINSULA/RIVE","Rural Long",166,45.028019999999977,0.68292999999999993,3.83,8.0789665990524479E-2,0,6,27.632542162056428,27.632542162056428,7.8313270247126268E-2,7.8313270247126268E-2,null,0,0,0,0]
[null,"SD35300","BAROSSA/MID NORTH & YORKE PENINSULA/RIVE","Rural Long",38,38.010830000000006,0.19093000000000002,2.46,2.4640220943399266E-2,0,3,36.815789473684212,36.815789473684212,0.57894736842105265,0.57894736842105265,null,0,0,0,0]
[null,"SD35400","BAROSSA/MID NORTH & YORKE PENINSULA/RIVE","Rural Short",10.5,19.732659999999999,0.92126999999999992,5.37,1.341381219643898E-2,0.19164255164129776,5,65.714285714285708,65.714285714285708,3.7142857142857144,3.7142857142857144,5,938.85714285714289,938.85714285714289,2.9523809523809526,2.9523809523809526]
[null,"SD35403","BAROSSA/MID NORTH & YORKE PENINSULA/RIVE","Rural Short",15,15.817369999999999,0,3.89,2.1870345972454859E-2,3.4409344329995643E-2,4,75,75,4,4,2,118,118,1.4,1.4]
[null,"SD36101","BAROSSA/MID NORTH & YORKE PENINSULA/RIVE","Rural Short",1,24.314869999999996,0.19687000000000002,1.26,0,6.9985107111855541E-4,null,0,0,0,0,1,36,36,1,1]
[null,"SD36400","BAROSSA/MID NORTH & YORKE PENINSULA/RIVE","Rural Long",1.5,36.982670000000013,0.13298000000000001,4.63,0,7.7883528957620823E-2,null,0,0,0,0,1,2948,2948,0.66666666666666663,0.66666666666666663]
[null,"SD37101","BAROSSA/MID NORTH & YORKE PENINSULA/RIVE","Rural Long",4.5,17.428699999999999,0,5.43,0,5.5127871017040522E-3,null,0,0,0,0,2,69.555555555555557,69.555555555555557,0.66666666666666663,0.66666666666666663]
[null,"SD37102","BAROSSA/MID NORTH & YORKE PENINSULA/RIVE","Rural Long",220,52.278109999999984,0.33021,7.72,0.56302640664592152,5.8932222499366645E-2,2,145.30454545454546,145.30454545454546,0.96818181818181814,0.96818181818181814,2,15.209090909090909,15.209090909090909,6.363636363636363E-2,6.363636363636363E-2]
[null,"SD37301","BAROSSA/MID NORTH & YORKE PENINSULA/RIVE","Rural Short",92.5,24.063679999999987,0.78525000000000023,3.49,1.498847710645573E-2,5.2294427258580949E-3,2,8.3351351351351344,8.3351351351351344,2.1621621621621623E-2,2.1621621621621623E-2,2,2.9081081081081082,2.9081081081081082,2.1621621621621623E-2,2.1621621621621623E-2]
[null,"SD37402","BAROSSA/MID NORTH & YORKE PENINSULA/RIVE","Rural Long",10.5,33.109639999999999,1.7650299999999997,17.38,5.1957578115102085E-3,1.3209553758076803E-3,2,28.095238095238095,28.095238095238095,1.2380952380952381,1.2380952380952381,1,7.1428571428571432,7.1428571428571432,9.5238095238095233E-2,9.5238095238095233E-2]
[null,"SD37501","BAROSSA/MID NORTH & YORKE PENINSULA/RIVE","Rural Short",6,14.540150000000001,1.1286700000000001,7.49,0,5.0739202656095279E-2,null,0,0,0,0,2,435,435,1.3333333333333333,1.3333333333333333]
[null,"SD38100","EASTERN HILLS/FLEURIEU PENINSULA","Rural Long",410,62.122502780000026,2.6972700000000001,9.43,0.11000913950984827,2.3935887537018607,8,15.23414299197313,15.23414299197313,7.8861764291437667E-2,7.8861764291437667E-2,9,331.46585365853656,331.46585365853656,1.1195121951219513,1.1195121951219513]
[null,"SD38200","EASTERN HILLS/FLEURIEU PENINSULA","Rural Long",177,70.41468906499999,1.42848,6.8,0.93148489280454383,0.13554763429621211,4,298.79661016949154,298.79661016949154,1.6892655367231639,1.6892655367231639,8,43.480225988700568,43.480225988700568,1.1186440677966101,1.1186440677966101]
[null,"SD39100","BAROSSA/MID NORTH & YORKE PENINSULA/RIVE","Rural Long",10,67.549520000000001,7.5630000000000003E-2,11.43,4.7378266145635464E-3,0.19617067967661256,1,26.9,26.9,0.1,0.1,4,1113.8,1113.8,3.3,3.3]
[null,"SD39200","BAROSSA/MID NORTH & YORKE PENINSULA/RIVE","Rural Long",98,46.089285388999997,0.09,6.52,2.1593217209869547E-2,5.7065272234891789E-3,2,12.510204081632653,12.510204081632653,3.0612244897959183E-2,3.0612244897959183E-2,1,3.306122448979592,3.306122448979592,4.0816326530612242E-2,4.0816326530612242E-2]
[null,"SD39400","BAROSSA/MID NORTH & YORKE PENINSULA/RIVE","Rural Short",1,9.0343600000000013,0.11241000000000001,1.77,0,6.920749481061271E-3,null,0,0,0,0,1,356,356,2,2]
[null,"SD40102","BAROSSA/MID NORTH & YORKE PENINSULA/RIVE","Rural Long",0.5,15.393360000000003,5.8129999999999994E-2,2.17,3.5049349304763786E-3,0,1,398,398,2,2,null,0,0,0,0]
[null,"SD40300","BAROSSA/MID NORTH & YORKE PENINSULA/RIVE","Rural Long",22,53.871199737999994,0.226684619,0,6.4533080817764862E-2,0,2,166.54547396573153,166.54547396573153,0.31818190487948317,0.31818190487948317,null,0,0,0,0]
[null,"SD40501","BAROSSA/MID NORTH & YORKE PENINSULA/RIVE","Rural Long",9,29.579406040000002,0.27539999999999998,4.4000000000000004,7.5910902263081363E-3,0,2,47.888888888888886,47.888888888888886,0.33333333333333331,0.33333333333333331,null,0,0,0,0]
[null,"SD40600","BAROSSA/MID NORTH & YORKE PENINSULA/RIVE","Rural Long",24.5,37.653399344999997,0,8.86,0.13803103040273054,0,2,319.87755102040819,319.87755102040819,1.2653061224489797,1.2653061224489797,null,0,0,0,0]
[null,"SD40700","BAROSSA/MID NORTH & YORKE PENINSULA/RIVE","Rural Long",38,37.901471543,0,4.4000000000000004,0.13214837579580033,0,2,197.44736842105263,197.44736842105263,0.94736842105263153,0.94736842105263153,null,0,0,0,0]
[null,"SD40800","BAROSSA/MID NORTH & YORKE PENINSULA/RIVE","Rural Long",14,50.463551991999992,0,5.54,5.1534872394843632E-2,0,1,209,209,1,1,null,0,0,0,0]
[null,"SD41200","EASTERN HILLS/FLEURIEU PENINSULA","Rural Short",6,13.807233073000003,4.9210000000000004E-2,3.03,2.2356353660731632E-3,0,1,19.166666666666668,19.166666666666668,0.16666666666666666,0.16666666666666666,null,0,0,0,0]
[null,"SD41300","EASTERN HILLS/FLEURIEU PENINSULA","Rural Short",25,17.089008517,0.38689999999999997,3.72,0,8.942541464292653E-3,null,0,0,0,0,2,18.399999999999999,18.399999999999999,0.2,0.2]
[null,"SD43100","BAROSSA/MID NORTH & YORKE PENINSULA/RIVE","Rural Long",3,30.903702094999996,0.39135000000000003,9.0299999999999994,0,1.1976662073989635E-3,null,0,0,0,0,1,22.666666666666668,22.666666666666668,0.33333333333333331,0.33333333333333331]
[null,"SD44200","EASTERN HILLS/FLEURIEU PENINSULA","Rural Short",2,31.206580000000002,9.4299999999999991E-3,23.38,1.9440307531070987E-4,0,1,5,5,0.5,0.5,null,0,0,0,0]
[null,"SD44400","EASTERN HILLS/FLEURIEU PENINSULA","Rural Short",57.5,7.3933199400000031,0,5.6,0.47683834698200317,3.3476209568504237E-2,2,426.57971350628395,426.57971350628395,1.0144927812659221,1.0144927812659221,1,29.947826086956521,29.947826086956521,0.24347826086956523,0.24347826086956523]
[null,"SD45101","SOUTH EAST","Rural Long",13,63.993708978000008,0,2.86,0,3.5929986221968904E-3,null,0,0,0,0,2,15.692307692307692,15.692307692307692,0.30769230769230771,0.30769230769230771]
[null,"SD46100","SOUTH EAST","Rural Long",4,61.885698477999988,0.17355000000000001,4.12,0,2.1346638873052111E-2,null,0,0,0,0,2,303,303,1,1]
[null,"SD48100","SOUTH EAST","Rural Short",16,46.891429143999972,1.2646200000000001,5.72,6.967406219135841E-2,4.1913303036989043E-2,4,224,212.625,2.75,1.875,2,134.75,134.75,0.75,0.75]
[null,"SD48200","SOUTH EAST","Rural Long",6.5,39.452903300999992,0.55577999999999994,16,0.16455581436574557,0,7,1437.3846155313345,1425.3846155313345,5.3846155313345099,4.4615386082575874,null,0,0,0,0]
[null,"SD49100","SOUTH EAST","Rural Long",29,34.384286404000001,0,8.75,5.4300073927362059E-2,6.1274716699132259E-2,5,106.31034798457704,106.31034798457704,0.86206899840256279,0.86206899840256279,7,119.96551724137932,119.96551724137932,0.72413793103448276,0.72413793103448276]
[null,"SD49200","SOUTH EAST","Rural Long",23.5,97.404966016999992,1.6262000000000001,12.69,0.12896047015551779,5.3806915641232841E-2,2,311.57446808510639,311.57446808510639,1.8297872340425532,1.8297872340425532,3,130,130,0.46808510638297873,0.46808510638297873]
[null,"SD49500","SOUTH EAST","Rural Long",8,46.670259999999999,0.34185000000000004,7.72,3.180860544944894E-2,0,5,225.75,225.75,1.25,1.25,null,0,0,0,0]
[null,"SD49900","SOUTH EAST","Rural Short",3,10.092129999999997,0.34776000000000001,1.43,3.0151916980691099E-2,0,2,517,517,2,2,null,0,0,0,0]
[null,"SD51200","BAROSSA/MID NORTH & YORKE PENINSULA/RIVE","Rural Long",30,20.595039999999997,4.7719999999999999E-2,28.81,8.5774042454505196E-3,1.1096025156784515E-2,2,16.233334604899092,2.7333346048990901,0.96666669845581066,6.6666698455810663E-2,2,21,21,0.13333333333333333,0.13333333333333333]
[null,"SD51300","BAROSSA/MID NORTH & YORKE PENINSULA/RIVE","Rural Short",2,10.838600000000001,5.7009999999999998E-2,9.9499999999999993,5.8320922593212956E-4,0,1,15,0,1,0,null,0,0,0,0]
[null,"SD52202","BAROSSA/MID NORTH & YORKE PENINSULA/RIVE","Rural Long",1,6.0989000000000004,2.9069999999999999E-2,8.69,2.2896559847333125E-4,0,1,13,13,1,1,null,0,0,0,0]
[null,"SD52300","BAROSSA/MID NORTH & YORKE PENINSULA/RIVE","Rural Long",289.5,60.187998975999996,3.1977700000000002,19.149999999999999,0.10705611114109444,0.30957910187428794,12,20.995973313616556,20.995973313616556,0.11629247802664103,0.11629247802664103,9,60.715025906735754,60.715025906735754,0.24179620034542315,0.24179620034542315]
[null,"SD54102","UPPER NORTH/EYRE PENINSULA","Rural Long",68,104.73880000000003,1.16815,17.03,0.50995922601514099,0.79655370435037531,4,425.79411764705884,425.79411764705884,1.25,1.25,6,665.08823529411768,665.08823529411768,1.7352941176470589,1.7352941176470589]
[null,"SD54300","UPPER NORTH/EYRE PENINSULA","Rural Long",50.5,41.382750434999998,1.31348,10.119999999999999,0.91980764728240394,0.66437010307788669,6,1034.1386138613861,1034.1386138613861,3.4653465346534653,3.4653465346534653,3,746.95049504950498,746.95049504950498,1.5247524752475248,1.5247524752475248]
[null,"SD55100","UPPER NORTH/EYRE PENINSULA","Rural Long",9,14.835000000000004,8.7200000000000003E-3,7.03,7.3709309970068568E-2,3.1702929019384332E-4,2,465,2,2,1,1,2,2,1,1]
[null,"SD56301","MAJOR METROPOLITAN AREAS","Urban",9.5,15.278704794000001,4.5923100000000003,0.97,0,4.2026555111701882E-3,null,0,0,0,0,1,20.421052631578949,20.421052631578949,0.10526315789473684,0.10526315789473684]
[null,"SD60101","MAJOR METROPOLITAN AREAS","RURAL SHORT",37.5,6.2465742809999991,0.90927000000000002,5.14,0,6.6097045605641351E-3,null,0,0,0,0,1,9.0666666666666664,9.0666666666666664,0.90666666666666662,0.90666666666666662]
[null,"SG01","EASTERN HILLS/FLEURIEU PENINSULA","Rural Short",447,17.123113806999996,1.2409800000000002,6.63,1.0735132221732711,0.36829662617613984,8,123.53691275167785,123.53691275167785,0.51006711409395977,0.51006711409395977,4,42.382550335570471,42.382550335570471,0.15883668903803133,0.15883668903803133]
[null,"SG02","EASTERN HILLS/FLEURIEU PENINSULA","Rural Short",738,19.001696779999993,0.85685941399999999,1.26,5.4201456817189451,4.015492722080368,9,377.79087757224312,377.79087757224312,1.274616060379721,1.274616060379721,8,279.88482384823845,279.88482384823845,1.1124661246612466,1.1124661246612466]
[null,"SG03","EASTERN HILLS/FLEURIEU PENINSULA","Rural Short",1028,15.34209268499999,2.0420129469999999,2.99,17.663923470062414,6.5234867966638355,18,883.87516012822607,883.87516012822607,4.7078469551027053,4.7078469551027053,10,326.42509727626458,326.42509727626458,1.284046692607004,1.284046692607004]
[null,"SG04","EASTERN HILLS/FLEURIEU PENINSULA","Rural Short",583.5,37.317968995999998,2.6504800000000004,3.51,4.9000656534997269,1.6446500171286054,16,431.97429818461467,431.97429818461467,2.7032276875153505,2.7032276875153505,12,144.98714652956298,144.98714652956298,0.59982862039417306,0.59982862039417306]
[null,"SG05","EASTERN HILLS/FLEURIEU PENINSULA","Rural Short",45.5,2.4553071489999994,0.7324400000000002,1.33,0.25319056528466849,0.1988743460428562,1,286.24175824175825,286.24175824175825,0.96703296703296704,0.96703296703296704,1,224.83516483516485,224.83516483516485,0.72527472527472525,0.72527472527472525]
[null,"SG06","EASTERN HILLS/FLEURIEU PENINSULA","Rural Short",318.5,6.4716804289999974,0.26016999999999996,0.46,1.2657195427329699,0.77560994956713913,6,204.42072213500785,204.42072213500785,2.0156985871271584,2.0156985871271584,4,125.26530612244898,125.26530612244898,0.47409733124018838,0.47409733124018838]
[null,"SG07","EASTERN HILLS/FLEURIEU PENINSULA","Rural Short",1057.5,38.357121552000002,3.3024300000000006,0.76,16.6747422450049,10.665788644769378,19,811.10228055047651,811.10228055047651,6.5935382052798079,6.5935382052798079,10,518.8113475177305,518.8113475177305,1.5470449172576832,1.5470449172576832]
[null,"SG08","EASTERN HILLS/FLEURIEU PENINSULA","Rural Short",205,18.505397686000002,0.20780999999999997,2.29,1.5035717053756232,1.1532962442807864,3,377.28292682926832,377.28292682926832,1.9170731707317072,1.9170731707317072,2,289.39024390243901,289.39024390243901,1.0097560975609756,1.0097560975609756]
[null,"SG09","EASTERN HILLS/FLEURIEU PENINSULA","Rural Short",604.5,28.715616591000007,0.19465000000000002,0.46,3.795817246979265,2.9842816090947069,16,323.00248138957818,323.00248138957818,1.5318444995864351,1.5318444995864351,10,253.9454094292804,253.9454094292804,1.0074441687344913,1.0074441687344913]
[null,"SG10","EASTERN HILLS/FLEURIEU PENINSULA","Rural Short",1472,17.936884678999991,1.0520012190000001,1.26,7.8297004382838313,0.63429835412378421,14,273.61141088734502,273.61141088734502,2.4646738987901937,2.4646738987901937,3,22.165760869565219,22.165760869565219,7.4728260869565216E-2,7.4728260869565216E-2]
[null,"SG11","EASTERN HILLS/FLEURIEU PENINSULA","Rural Short",503,9.9104431099999992,1.004755203,2.82,2.9291877609400609,0.24821384655671436,12,299.55467026939925,299.55467026939925,3.1550695784760281,3.1550695784760281,1,25.383697813121273,25.383697813121273,0.16699801192842942,0.16699801192842942]
[null,"SG12","EASTERN HILLS/FLEURIEU PENINSULA","Rural Short",552,41.612940603999995,1.6912400000000001,1.28,3.9033285691925164,1.9407064605192856,13,363.741540438887,363.741540438887,2.8435990231624548,2.8435990231624548,6,180.84963768115941,180.84963768115941,0.58514492753623193,0.58514492753623193]
[null,"SG13","EASTERN HILLS/FLEURIEU PENINSULA","Rural Short",1433,31.910237417999998,4.652775224,1.18,8.1023706514997382,5.9044490839519419,24,290.84579237773545,290.84579237773545,2.7006281215830108,2.7006281215830108,17,211.9483600837404,211.9483600837404,0.87787857641311928,0.87787857641311928]
[null,"SG14","EASTERN HILLS/FLEURIEU PENINSULA","Rural Short",1096.5,24.456857843999991,3.7799199999999993,5.75,4.1975188284912521,0.57936004504097749,16,196.91594593415127,196.91594593415127,1.9477124229392884,1.9477124229392884,7,27.179206566347471,27.179206566347471,0.21705426356589147,0.21705426356589147]
[null,"SM126A","MAJOR METROPOLITAN AREAS","Urban",1685.5,12.374543345000022,1.0052085079999999,2.5299999999999998,3.292080022602518,0.13493990298494385,9,90.161175180422163,90.161175180422163,1.5427667061322805,1.5427667061322805,2,3.6956392761791754,3.6956392761791754,1.0353010975971522,1.0353010975971522]
[null,"SM126B","MAJOR METROPOLITAN AREAS","Urban",1377,10.388336504000005,4.0846900000000002,4.2699999999999996,2.2413512729689038,0.68005031859100284,11,75.137012490000345,75.137012490000345,1.0077463003198739,1.0077463003198739,1,22.797385620915033,22.797385620915033,7.9157588961510525E-2,7.9157588961510525E-2]
[null,"SM126C","MAJOR METROPOLITAN AREAS","Urban",2179,17.270646258999999,6.4671317679999989,4.95,8.7186976733406887,2.6858218192288206,13,184.70230935855216,184.70230935855216,2.2944775840020495,2.2944775840020495,10,56.898118402937129,56.898118402937129,0.3377696190913263,0.3377696190913263]
[null,"SM126D","MAJOR METROPOLITAN AREAS","Urban",2137.5,15.215170432999995,0.86303999999999992,5.73,12.205630833765062,1.2977106996965928,20,263.59189009103164,263.59189009103164,2.3218713298596834,2.3218713298596834,2,28.025263157894738,28.025263157894738,0.96187134502923977,0.96187134502923977]
[null,"SM126E","MAJOR METROPOLITAN AREAS","Urban",2104.5,9.0110669999999988,13.676,5.85,1.0663118549153972,1.2060321526694162,14,23.38908567856825,23.38908567856825,7.6819519178312409E-2,7.6819519178312409E-2,12,26.453789498693276,26.453789498693276,0.20194820622475648,0.20194820622475648]
[null,"SM137A","MAJOR METROPOLITAN AREAS","Urban",1839.5,6.6843187849999985,2.6708399999999997,7.35,0.58679024359902154,0,10,14.725194144553553,14.725194144553553,0.13789976326853531,0.13789976326853531,null,0,0,0,0]
[null,"SM137B","MAJOR METROPOLITAN AREAS","Urban",2074,4.0938270230000011,7.4318515100000013,6.04,3.4171271906346501,4.4842767567640678E-3,13,76.055448099870233,76.055448099870233,1.3484410080580955,1.3484410080580955,1,9.9807135969141758E-2,9.9807135969141758E-2,4.8216007714561236E-4,4.8216007714561236E-4]
[null,"SM137C","MAJOR METROPOLITAN AREAS","Urban",366.5,1.658134384,2.177,7.2,0.31249097056932557,0,4,39.358762150409277,39.358762150409277,0.11914495491558663,0.11914495491558663,null,0,0,0,0]
[null,"SM137D","MAJOR METROPOLITAN AREAS","Urban",234.5,1.0100835300000002,2.8048699999999998,5.73,7.3921892946479009E-2,0,4,14.551513606805539,14.551513606805539,0.13361749847306373,0.13361749847306373,null,0,0,0,0]
[null,"SM137F","MAJOR METROPOLITAN AREAS","Urban",5.5,0,2.6387700000000001,2.67,0,8.8060797179932052E-2,null,0,0,0,0,2,739.09090909090912,739.09090909090912,1.8181818181818181,1.8181818181818181]
[null,"SM172A","MAJOR METROPOLITAN AREAS","Urban",1346,4.5253366610000008,0.56737000000000004,0.99,2.6696248583827766,1.3004402594615796,6,91.555220945451808,91.555220945451808,1.16072309105747,1.16072309105747,1,44.598811292719169,44.598811292719169,0.15378900445765231,0.15378900445765231]
[null,"SM172B","MAJOR METROPOLITAN AREAS","Urban",892,3.9629954010000001,0.39655000000000007,2.31,5.3678742464012306,0.84261076681688485,3,277.78923766816143,277.78923766816143,2.123318385650224,2.123318385650224,1,43.605381165919283,43.605381165919283,0.15246636771300448,0.15246636771300448]
[null,"SM172C","MAJOR METROPOLITAN AREAS","Urban",2766.5,8.6893372799999966,0.54022999999999999,1.52,1.6977861738218041,0,8,28.328935478040847,28.328935478040847,0.13771913970721128,0.13771913970721128,null,0,0,0,0]
[null,"SM172D","MAJOR METROPOLITAN AREAS","Urban",789.5,2.8482914599999996,0.23790999999999995,6.31,2.3921413898479251,1.1070747796022748,5,139.86615898610671,139.86615898610671,1.0040109584873578,1.0040109584873578,2,64.72957568081064,64.72957568081064,0.28879037365421151,0.28879037365421151]
[null,"SM172E","MAJOR METROPOLITAN AREAS","Urban",1225,4.2144091059999997,0.39837,1.71,2.3656184629885807E-2,0,3,0.89142857142857146,0.89142857142857146,2.4489795918367346E-3,2.4489795918367346E-3,null,0,0,0,0]
[null,"SM172F","MAJOR METROPOLITAN AREAS","Urban",2087,7.058155924000002,0.41217999999999994,2.11,6.9645658118386669,1.0073808586620419,13,154.04568397730347,154.04568397730347,2.1074907967903767,2.1074907967903767,3,22.281744130330619,22.281744130330619,0.1528509822712027,0.1528509822712027]
[null,"SM179A","MAJOR METROPOLITAN AREAS","Urban",1709,6.3812038780000018,2.0170799999999995,6.1,1.481320595995502,0.62216632103509184,8,40.011509466199165,40.011509466199165,0.21220987731772875,0.21220987731772875,2,16.805149210064364,16.805149210064364,8.777062609713282E-2,8.777062609713282E-2]
[null,"SM179B","MAJOR METROPOLITAN AREAS","Urban",955.5,4.470556382999999,2.8771700000000009,5.58,1.8638269038319899,0,10,90.043594240580845,90.043594240580845,0.39281348243924979,0.39281348243924979,null,0,0,0,0]
[null,"SM179C","MAJOR METROPOLITAN AREAS","Urban",1307.5,5.1622779439999986,0.49692999999999993,3.6,0.69219596995885291,0.27523060963617135,11,24.437980065427826,24.437980065427826,0.27023577571599022,0.27023577571599017,4,9.7170172084130026,9.7170172084130026,0.20038240917782027,0.20038240917782027]
[null,"SM179D","MAJOR METROPOLITAN AREAS","Urban",2120,7.6453071280000051,0.97555000000000003,4.4000000000000004,2.0223292609382608,0,17,44.034588479096037,44.034588479096037,0.17342764611514111,0.17342764611514111,null,0,0,0,0]
[null,"SM216A","MAJOR METROPOLITAN AREAS","Urban",2128.5,9.5806544690000006,2.9578200000000003,3.6,0.88763355728041249,0.7435667410587915,18,19.250321864745754,19.250321864745757,1.139613117125122,1.139613117125122,2,16.12591026544515,16.12591026544515,9.3493070237256282E-2,9.3493070237256282E-2]
[null,"SM216B","MAJOR METROPOLITAN AREAS","Urban",2841,11.474191992999989,2.2523397240000005,7.49,25.504240675870456,1.0193822563588888,30,414.39938442575306,414.39938442575306,5.0817786731113497,5.0817786731113497,5,16.563181978176697,16.563181978176697,7.7789510735656459E-2,7.7789510735656459E-2]
[null,"SM216C","MAJOR METROPOLITAN AREAS","Urban",3033,10.335939787999992,4.0232200000000002,7.32,9.3280682521379514,0.99420964963734348,15,141.97021566882134,141.97021566882134,2.1114408104403202,2.1114408104403202,2,15.131552917903067,15.131552917903067,5.8358061325420374E-2,5.8358061325420374E-2]
[null,"SM216D","MAJOR METROPOLITAN AREAS","Urban",943,2.699970472,2.7745855449999999,6.95,2.0183944875352386,8.4226415605307692E-2,6,98.803492427757178,98.803492427757178,2.1233652292860401,2.1233652292860401,1,4.1230116648992574,4.1230116648992574,1.9088016967126194E-2,1.9088016967126194E-2]
[null,"SM216E","MAJOR METROPOLITAN AREAS","Urban",2512.5,9.0875650119999953,0.80264000000000013,7.74,1.51060176609382,2.4972005741991357,19,27.753761696886659,27.753761696886659,1.1913764215108766,1.1913764215108766,4,45.880199004975125,45.880199004975125,0.13412935323383085,0.13412935323383085]
[null,"SM216F","MAJOR METROPOLITAN AREAS","Urban",225,0.70543311900000005,1.0766200000000001,6.17,0.96922473399834863,1.2889587779104445E-2,2,198.84739583333334,198.84739583333334,1.0562962171766492,1.0562962171766492,1,2.6444444444444444,2.6444444444444444,2.2222222222222223E-2,2.2222222222222223E-2]
[null,"SM216G","MAJOR METROPOLITAN AREAS","Urban",1578,5.4570151390000019,2.3014647409999998,5.14,7.2354996944888807E-3,0.23168763243281015,3,0.21166032953105196,0.21166032953105196,1.9011406844106464E-3,1.9011406844106464E-3,1,6.7775665399239546,6.7775665399239546,5.8935361216730035E-2,5.8935361216730035E-2]
[null,"SM349A","MAJOR METROPOLITAN AREAS","Urban",1664,6.2893669290000043,0.52659,4.17,4.4018268773446607,0.33534591398409547,8,122.11178317436806,122.11178317436806,1.1666666601712887,1.1666666601712887,1,9.302884615384615,9.302884615384615,5.1682692307692304E-2,5.1682692307692304E-2]
[null,"SM349B","MAJOR METROPOLITAN AREAS","Urban",1784.5,5.0249318890000012,2.0014200000000004,4.6100000000000003,1.8408930929289704,3.2946652890300481,9,47.6200616419165,47.6200616419165,0.41131969739422808,0.41131969739422808,3,85.226113757354995,85.226113757354995,0.27906976744186046,0.27906976744186046]
[null,"SM349C","MAJOR METROPOLITAN AREAS","Urban",2005.5,8.7536685959999989,4.9588855759999992,5.72,11.324459195704604,2.3348784208733715,21,260.65901047509971,260.65901047509971,3.6773871319812899,3.6773871319812899,6,53.742707554225881,53.742707554225881,0.1600598354525056,0.1600598354525056]
[null,"SM349D","MAJOR METROPOLITAN AREAS","Urban",2356,9.9522089570000034,12.072501807,6.4,4.1086658499330673,2.9427037215559135,36,80.501407464615156,80.501407464615156,1.1595925114707348,1.1595925114707348,13,57.656621392190154,57.656621392190154,0.68463497453310695,0.68463497453310695]
[null,"SM349E","MAJOR METROPOLITAN AREAS","Urban",1496,4.9836832279999985,0.23801,5.54,1.6091187919386269,0,5,49.651737478327625,49.651737478327625,0.21457219115871798,0.21457219115871798,null,0,0,0,0]
[null,"SM349F","MAJOR METROPOLITAN AREAS","Urban",3265.5,12.405779516999996,9.0259769249999984,3.6,11.381086883940881,1.765873525737309,20,160.88367865531336,160.88367865531336,1.2311539630250312,1.2311539630250312,3,24.962486602357984,24.962486602357984,8.3601286173633438E-2,8.3601286173633438E-2]
[null,"SM349H","MAJOR METROPOLITAN AREAS","Urban",1586.5,11.780820992000006,0.94692000000000009,7.96,0.61355872167513359,2.9549434141528783,16,17.85229253663725,17.85229253663725,0.11198653477507364,0.11198653477507364,4,85.977938859123853,85.977938859123853,0.28490387645761112,0.28490387645761112]
[null,"SM350A","MAJOR METROPOLITAN AREAS","Urban",1757.5,6.3909006050000006,1.08535,4.42,2.9431801404598437,0.47931936000078135,13,77.303551699121513,77.303551699121513,1.0467519941234995,1.0467519941234995,2,12.589473684210526,12.589473684210526,4.1536273115220484E-2,4.1536273115220484E-2]
[null,"SM350B","MAJOR METROPOLITAN AREAS","Urban",1780,7.4960873450000021,1.3673857559999996,5.93,2.9899292424368937,1.6135164318710205,9,77.538758970110607,77.538758970110607,1.019850150654825,1.019850150654825,3,41.843820224719103,41.843820224719103,0.16235955056179777,0.16235955056179777]
[null,"SM350C","MAJOR METROPOLITAN AREAS","Urban",394,2.9750441399999996,1.9598599999999997,6,0.26377078960500544,0,2,30.903553105852932,30.903553105852932,0.99069373589481802,0.99069373589481802,null,0,0,0,0]
[null,"SM350D","MAJOR METROPOLITAN AREAS","Urban",785.5,5.0575983530000004,2.0354299999999999,3.32,1.3716037819058788,2.1562005721304245,7,80.604710375556976,80.604710375556976,2.0789306174411202,2.0789306174411202,4,126.7129217059198,126.7129217059198,0.34882240611075749,0.34882240611075749]
[null,"SM350E","MAJOR METROPOLITAN AREAS","Urban",1748.5,7.2753604540000003,2.6204428850000006,4.84,0.42846124872990515,1.6207735947382473,11,11.311595066977056,11.311595066977056,0.1044704657061836,0.10447046570618358,5,42.789247926794395,42.789247926794395,0.17386331140977981,0.17386331140977981]
[null,"SM350F","MAJOR METROPOLITAN AREAS","Urban",1964.5,6.4027430710000006,4.9049200000000006,6.97,10.342951633162793,0.38798742373741274,16,243.03588202309749,243.03588202309749,2.1693390633623606,2.1693390633623606,3,9.1168236192415382,9.1168236192415382,5.5484856197505726E-2,5.5484856197505726E-2]
[null,"SM350G","MAJOR METROPOLITAN AREAS","Urban",1171,4.9178734380000018,2.9656400000000005,7.32,0.81995107226636499,0.83795318467821678,10,32.322800399298146,32.322800399298146,1.1229718108140536,1.1229718108140536,4,33.032450896669516,33.032450896669516,0.11272416737830913,0.11272416737830913]
[null,"SM350H","MAJOR METROPOLITAN AREAS","Urban",1930.5,6.6134373720000017,8.5610195850000004,4.3099999999999996,1.049400006724569,0.32026834575845392,13,25.092803978790307,25.092803978790307,0.79426742470718303,0.79426742470718303,1,7.6581196581196584,7.6581196581196584,2.4864024864024864E-2,2.4864024864024864E-2]
[null,"SM374A","MAJOR METROPOLITAN AREAS","Urban",2062.5,6.8021150680000009,3.20235,7.74,1.1297992104668106,1.2961076249139813,8,25.286297718394888,25.286297718394888,0.12105046312736739,0.12105046312736739,2,29.008484848484848,29.008484848484848,0.10327272727272727,0.10327272727272727]
[null,"SM374B","MAJOR METROPOLITAN AREAS","Urban",2040.5,7.5984129230000006,2.1532700000000005,4.88,0.84774491660868512,0.57195108662842953,10,19.178142111081172,19.178142111081172,0.59364533365955829,0.59364533365955829,1,12.938985542759127,12.938985542759127,4.2146532712570448E-2,4.2146532712570448E-2]
[null,"SM374C","MAJOR METROPOLITAN AREAS","Urban",660,2.3221950459999992,2.9345807250000004,5.26,3.1498253161038423E-2,5.9357093302094413E-3,3,2.2030303030303031,2.2030303030303031,2.1212121212121213E-2,2.1212121212121213E-2,1,0.41515151515151516,0.41515151515151516,1.5151515151515152E-3,1.5151515151515152E-3]
[null,"SM374D","MAJOR METROPOLITAN AREAS","Urban",40,0.85070043399999995,1.9766499999999998,2.95,0.11381830956540295,0,1,131.35,131.35,0.92500000000000004,0.92500000000000004,null,0,0,0,0]
[null,"SM374E","MAJOR METROPOLITAN AREAS","Urban",1750,5.7673161370000017,0.91052999999999995,2.63,0.62002871169625906,0.31524248968324015,8,16.355042968749999,16.355042968749999,9.2761890956333706E-2,9.2761890956333706E-2,1,8.3154285714285709,8.3154285714285709,3.8857142857142854E-2,3.8857142857142854E-2]
[null,"SM402A","MAJOR METROPOLITAN AREAS","Urban",33.5,0.94053208599999971,3.0492899999999996,5.98,5.8122292456028957E-2,5.3226415417243052E-2,1,80.089552238805965,80.089552238805965,0.56716417910447758,0.56716417910447758,1,73.343283582089555,73.343283582089555,0.26865671641791045,0.26865671641791045]
[null,"SM402B","MAJOR METROPOLITAN AREAS","Urban",550.5,2.4276485990000003,2.5059199999999997,4.1500000000000004,0.47099328166664201,0.67589098942530867,9,39.494382348957117,39.494382348957117,0.87193485956425909,0.87193485956425909,1,56.675749318801088,56.675749318801088,0.21798365122615804,0.21798365122615804]
[null,"SM402C","MAJOR METROPOLITAN AREAS","Urban",324,2.746369301000001,0.74052000000000007,2.63,2.2561761143162515,1.728721184491655E-2,2,321.44444444444446,321.44444444444446,1.9382716049382716,1.9382716049382716,1,2.4629629629629628,2.4629629629629628,6.4814814814814811E-2,6.4814814814814811E-2]
[null,"SM402D","MAJOR METROPOLITAN AREAS","Urban",1617,7.947196893000001,1.2545000000000004,3.26,0.56738728920914039,1.1375332004718897,9,16.197482513069147,16.197482513069147,1.0581323346067424,1.0581323346067424,2,32.473716759431042,32.473716759431042,0.11008039579468151,0.11008039579468151]
[null,"SM402E","MAJOR METROPOLITAN AREAS","Urban",475,3.4728694009999987,0.47681000000000001,4.38,2.4479385193929446E-3,0,1,0.23789473684210527,0.23789473684210527,2.1052631578947368E-3,2.1052631578947368E-3,null,0,0,0,0]
[null,"SM410A","MAJOR METROPOLITAN AREAS","Urban",1717,7.3640465079999968,1.19584,4.1500000000000004,0.74220157773390971,1.7243885499440566E-2,13,19.953979207807045,19.953979207807045,0.17821776431825551,0.17821776431825551,1,0.46359930110658126,0.46359930110658126,2.3296447291788003E-3,2.3296447291788003E-3]
[null,"SM410B","MAJOR METROPOLITAN AREAS","Urban",1970,5.9001167279999986,2.1228878709999996,6.69,4.3397756490654205,0,15,101.69017383556076,101.69017383556076,1.0678510330655249,1.0678510330655249,null,0,0,0,0]
[null,"SM410C","MAJOR METROPOLITAN AREAS","Urban",2627,8.0820131690000014,0.32650999999999997,6.54,1.2727974613399544,1.1365800208714181,17,22.365425496124978,22.365425496124978,0.18424050926844524,0.18424050926844524,2,19.971830985915492,19.971830985915492,8.1461743433574416E-2,8.1461743433574416E-2]
[null,"SM410D","MAJOR METROPOLITAN AREAS","Urban",1924.5,9.3173888540000043,1.19296,6.57,2.6667347129454653E-2,3.2928022561745811E-2,3,0.63964621746313999,0.63964621746313999,2.4248708158568872E-3,2.4248708158568872E-3,1,0.78981553650298775,0.78981553650298775,2.5980774227071968E-3,2.5980774227071968E-3]
[null,"SM411A","MAJOR METROPOLITAN AREAS","Urban",905,4.3827241619999979,0.47710000000000002,4.5199999999999996,0.84544834098051136,0,8,43.123741529264514,43.123741529264514,0.48508278862547477,0.48508278862547477,null,0,0,0,0]
[null,"SM411B","MAJOR METROPOLITAN AREAS","Urban",743.5,4.2611154970000005,0.67124000000000006,2.74,0.1073914766462165,0.27169951247987889,6,6.6675576349193006,6.6675576349193006,6.1869478257775126E-2,6.1869478257775112E-2,2,16.868863483523874,16.868863483523874,0.11297915265635508,0.11297915265635508]
[null,"SM411C","MAJOR METROPOLITAN AREAS","Urban",1413,14.853150462999997,3.1253399999999996,4.5199999999999996,6.6857171166778828,0.7301139107884993,17,218.41565956499082,218.41565956499082,2.1646614337507413,2.1646614337507413,5,23.852087756546354,23.852087756546354,0.11394196744515216,0.11394196744515216]
[null,"SM411D","MAJOR METROPOLITAN AREAS","Urban",1562,12.117446157999998,1.5715899999999996,4.53,1.0424101349353252,0,11,30.806015737536011,30.806015737536011,1.1355100209215387,1.1355100209215387,null,0,0,0,0]
[null,"SM411E","MAJOR METROPOLITAN AREAS","Urban",1867.5,11.897992647999999,3.5832600000000001,4.7300000000000004,5.2247671154090893,1.7764234908607104,21,129.14698271438618,129.14698271438618,2.0041052944050577,2.0041052944050577,3,43.910040160642573,43.910040160642573,0.13119143239625167,0.13119143239625167]
[null,"SM411F","MAJOR METROPOLITAN AREAS","Urban",839,4.8755463750000008,1.8616900000000001,6.44,0.5958454327580307,0,9,32.783067749779896,32.783067749779896,0.48430634333493472,0.48430634333493472,null,0,0,0,0]
[null,"SSD165","MAJOR METROPOLITAN AREAS","URBAN",2,null,null,5.37,2.0103424300855335E-2,0,3,464,464,3,3,null,0,0,0,0]
[null,"SSD251","SOUTH EAST","RURAL SHORT",1,null,null,6.97,2.5272399790392285E-4,2.5272399790392285E-4,1,13,0,1,0,2,13,13,2,2]
[null,"SSD298","SOUTH EAST","RURAL SHORT",2.5,null,null,0,8.2038097781119562E-3,0,3,168.8,158.4,3.2,2.4,null,0,0,0,0]
[null,"SSD309","BAROSSA/MID NORTH & YORKE PENINSULA/RIVE","RURAL LONG",2,null,null,6.54,0,0.142240474866971,null,0,0,0,0,1,4038,4038,2,2]
[null,"SSD338","SOUTH EAST","RURAL SHORT",7,null,null,1.94,4.2593713800576527E-2,0,2,313,313,2,2,null,0,0,0,0]
[null,"SSD382","ADELAIDE BUSINESS AREA","CBD",3,null,null,5.72,2.1850322524236868E-2,0,1,41.333333333333336,41.333333333333336,0.33333333333333331,0.33333333333333331,null,0,0,0,0]
[null,"SSD495","MAJOR METROPOLITAN AREAS","URBAN",2,null,null,0,8.1020266040085082E-3,0,2,187,187,2,2,null,0,0,0,0]
[null,"SSD543","SOUTH EAST","RURAL LONG",2,null,null,0,7.432575581211214E-3,0,1,211,211,1,1,null,0,0,0,0]
[null,"SSD725","MAJOR METROPOLITAN AREAS","Urban",0.5,null,null,0,3.2494759106985996E-4,0,2,30,30,4,4,null,0,0,0,0]
[null,"SSD739","MAJOR METROPOLITAN AREAS","URBAN",1.5,null,null,0,4.332634547598133E-5,0,1,1.3333333333333333,1.3333333333333333,1.3333333333333333,1.3333333333333333,null,0,0,0,0]
[null,"ST11","EASTERN HILLS/FLEURIEU PENINSULA","Rural Short",1849.5,49.951770000000032,10.53181,2.5299999999999998,6.3646788630389572,12.908092036325698,20,177.0186519823902,177.0186519823902,1.0887627200714218,1.0887627200714218,17,359.00838064341713,359.00838064341713,1.1792376317923763,1.1792376317923763]
[null,"ST12","EASTERN HILLS/FLEURIEU PENINSULA","Rural Short",1795.5,75.301339999999982,14.226970000000001,4.46,4.8382647390636642,1.9732106547112362,14,138.61208237064014,138.61208237064014,0.68393203694984395,0.68393203694984395,10,56.530771372876636,56.530771372876636,0.18156502367028682,0.18156502367028682]
[null,"ST13","EASTERN HILLS/FLEURIEU PENINSULA","Rural Short",195.5,18.475689999999997,5.8484699999999989,4.63,1.0463939946506047,0.1740685136332096,4,275.32480857439356,275.32480857439356,1.1304347874868252,1.1304347874868252,7,45.800511508951409,45.800511508951409,0.15856777493606139,0.15856777493606139]
[null,"ST14","EASTERN HILLS/FLEURIEU PENINSULA","Rural Short",21,8.8528799999999972,0,1.2,0.242906642600732,1.8468292154517436E-3,2,595,595,2,2,1,4.5238095238095237,4.5238095238095237,4.7619047619047616E-2,4.7619047619047616E-2]
[null,"ST15","EASTERN HILLS/FLEURIEU PENINSULA","Rural Short",97,48.643529999999977,0.55649999999999999,0.18,0.26742734179861333,7.5933841216363276E-2,2,141.81786480146584,141.81786480146584,0.91065290662431231,0.91065290662431231,4,40.268041237113401,40.268041237113401,1.9381443298969072,1.9381443298969072]
[null,"ST16","EASTERN HILLS/FLEURIEU PENINSULA","Rural Short",56,31.330170000000003,0,0.23,1.0469383217782968,0.14405267880523601,4,961.67857142857144,961.67857142857144,2.75,2.75,1,132.32142857142858,132.32142857142858,0.6964285714285714,0.6964285714285714]
[null,"ST21","EASTERN HILLS/FLEURIEU PENINSULA","Rural Short",900,47.087419999999966,3.4059099999999995,0.1,5.4160956236815618,2.2910013619216536,11,309.5570384724935,309.5570384724935,2.0918518585628934,2.0918518585628934,7,130.94222222222223,130.94222222222223,0.69666666666666666,0.69666666666666666]
[null,"ST22","EASTERN HILLS/FLEURIEU PENINSULA","Rural Short",300,45.752409999999983,1.7131500000000002,1.28,2.1743661753876204,0.29586204031536933,20,372.8278083928426,372.8278083928426,3.638889420032501,3.638889420032501,5,50.73,50.73,0.23666666666666666,0.23666666666666666]
[null,"ST23","EASTERN HILLS/FLEURIEU PENINSULA","Rural Short",135.5,33.924560000000014,0.96483000000000019,2.34,9.4609399750265246E-3,3.6742181233724164E-2,1,3.591632237733513,3.591632237733513,1.2300110391145239E-2,1.2300110391145239E-2,6,13.948339483394834,13.948339483394834,0.16974169741697417,0.16974169741697417]
[null,"ST24","EASTERN HILLS/FLEURIEU PENINSULA","Rural Short",69.5,40.92613999999999,0,0.51,1.0925452832461893E-2,1.9051501380449566E-2,1,8.086330935251798,8.086330935251798,2.8776978417266189E-2,2.8776978417266189E-2,2,14.100719424460431,14.100719424460431,0.17266187050359713,0.17266187050359713]
[null,"ST34","EASTERN HILLS/FLEURIEU PENINSULA","Rural Long",560.5,39.160650000000018,2.2073900000000002,0.12,9.3829400351703249,5.1613601335241777,21,950.46568207141013,950.46568207141013,4.801665243774945,4.801665243774945,11,522.83140053523641,522.83140053523641,2.5280999107939341,2.5280999107939341]
[null,"ST35","EASTERN HILLS/FLEURIEU PENINSULA","Rural Long",852.5,74.577989999999957,10.86055,1.2,0.8309983671969301,6.7210209521094777,6,55.345064708004948,55.345064708004948,0.47741935931342788,0.47741935931342788,18,447.62463343108504,447.62463343108504,1.8287390029325514,1.8287390029325514]
[null,"ST36","EASTERN HILLS/FLEURIEU PENINSULA","Rural Long",446.5,75.94623999999996,1.9095300000000002,1.89,3.2229609501726828,1.9943432009177475,16,409.83278482571694,409.83278482571694,1.7319896067198912,1.7319896067198912,4,253.60134378499441,253.60134378499441,1.2094064949608063,1.2094064949608063]
[null,"ST41","EASTERN HILLS/FLEURIEU PENINSULA","Rural Long",372,101.92921000000003,1.98542,1.31,3.6950644366009788,0.14720726708000789,13,563.96505310714883,563.96505310714883,2.4166666666666665,2.4166666666666665,3,22.467741935483872,22.467741935483872,8.0645161290322578E-2,8.0645161290322578E-2]
[null,"ST42","EASTERN HILLS/FLEURIEU PENINSULA","Rural Long",163.5,39.181960000000011,1.6644699999999997,1.6,0.13463177190231876,2.624298013271258E-2,5,46.752293577981654,46.752293577981654,0.14067278287461774,0.14067278287461774,2,9.1131498470948014,9.1131498470948014,4.2813455657492352E-2,4.2813455657492352E-2]
[null,"ST43","EASTERN HILLS/FLEURIEU PENINSULA","Rural Long",148.5,17.054040000000011,0.73518000000000006,1.98,0.99809643127762204,0.2037265444262325,3,381.60948956935903,381.60948956935903,1.6430979064016629,1.6430979064016629,1,77.892255892255889,77.892255892255889,0.28956228956228958,0.28956228956228958]
[null,"ST44","EASTERN HILLS/FLEURIEU PENINSULA","Rural Long",139.5,38.600189999999991,0.70508000000000004,0.42,1.4640412575464341,1.7262773233205089,10,595.87096588244151,595.87096588244151,2.5041815837224326,2.5041815837224326,10,702.60215053763443,702.60215053763443,1.9641577060931901,1.9641577060931901]
[null,"ST45","EASTERN HILLS/FLEURIEU PENINSULA","Rural Long",10,6.0066900000000016,0,0.67,7.1859972443937811E-2,0,2,408,408,2,2,null,0,0,0,0]
[null,"ST51","EASTERN HILLS/FLEURIEU PENINSULA","Rural Short",278.5,70.685870000000008,3.2567299999999997,0.02,1.8577287725937937,0.60377707130000269,8,343.12627625936238,343.12627625936238,1.2519449751081757,1.2519449751081757,8,111.51885098743267,111.51885098743267,0.40215439856373431,0.40215439856373431]
[null,"VH10","EASTERN HILLS/FLEURIEU PENINSULA","Rural Short",2301,12.630342199000006,15.389148354999996,0.8,5.203522770657848E-2,0.18493564554307829,9,1.163262451384079,1.163262451384079,8.9816027545555933E-3,8.9816027545555933E-3,3,4.1342894393741849,4.1342894393741849,1.6514558887440245E-2,1.6514558887440245E-2]
[null,"VH11","EASTERN HILLS/FLEURIEU PENINSULA","Urban",1828,7.2949440859999974,3.9934879730000001,4.53,3.3696776184160719,8.8732355534809765E-2,5,85.092267994285933,85.092267994285933,0.99927059044201472,0.99927059044201472,2,2.2407002188183807,2.2407002188183807,1.7505470459518599E-2,1.7505470459518599E-2]
[null,"VH12","EASTERN HILLS/FLEURIEU PENINSULA","Rural Short",2864,11.956300251000002,17.230510000000002,5.14,2.6999022942116131,4.7328983908994804,8,48.492201757164644,48.492201757164644,1.0734404084624747,1.0734404084624747,9,85.00628491620111,85.00628491620111,0.29608938547486036,0.29608938547486036]
[null,"VH13","EASTERN HILLS/FLEURIEU PENINSULA","Rural Short",60,12.546560746000001,0.97460999999999998,5.79,0,0.20666990936281565,null,0,0,0,0,4,177.18333333333334,177.18333333333334,0.8833333333333333,0.8833333333333333]
[null,"VH14","EASTERN HILLS/FLEURIEU PENINSULA","Rural Short",84.5,21.620364445999989,0,0.23,1.9751357197736949E-2,0.11652520334123949,2,12.02367152829142,12.02367152829142,8.284025925856367E-2,8.284025925856367E-2,3,70.934911242603548,70.934911242603548,0.36686390532544377,0.36686390532544377]
[null,"VH15","EASTERN HILLS/FLEURIEU PENINSULA","Rural Short",2282.5,40.971387713999995,13.365506930000002,0.32,1.9065239183928531,3.3670807046890259,20,42.966338048393858,42.966338048393858,0.29324572459760906,0.29324572459760906,18,75.882146768893762,75.882146768893762,0.24446878422782037,0.24446878422782037]
[null,"VH16","EASTERN HILLS/FLEURIEU PENINSULA","Rural Short",2296,12.14478313,13.205201062000004,4.63,0.8587563661676515,8.9793808470640322,13,19.239551996104808,19.239551996104808,0.10380373754983169,0.10380373754983169,26,201.17378048780489,201.17378048780489,0.81097560975609762,0.81097560975609762]
[null,"VH17","EASTERN HILLS/FLEURIEU PENINSULA","Rural Short",512,76.175758525000006,6.8860399999999995,4,1.7734550332172543,1.1285487327937329,9,178.17513206601143,178.17513206601143,1.0885416828095913,1.0885416828095913,31,113.3828125,113.3828125,0.517578125,0.517578125]
[null,"VH18","EASTERN HILLS/FLEURIEU PENINSULA","Rural Short",263,61.931370449000006,9.7919800000000006,1.47,1.483781488920584,0.21837297449652038,6,290.20912872430489,290.20912872430489,1.1406844251509403,1.1406844251509403,3,42.71102661596958,42.71102661596958,0.24714828897338403,0.24714828897338403]
[null,"VH19","EASTERN HILLS/FLEURIEU PENINSULA","Rural Short",72,20.090661602000001,0,0.51,0.19658038975418979,9.2341460772587189E-3,1,140.44444444444446,140.44444444444446,0.88888888888888884,0.88888888888888884,2,6.5972222222222223,6.5972222222222223,4.1666666666666664E-2,4.1666666666666664E-2]
[null,"VH21","EASTERN HILLS/FLEURIEU PENINSULA","Rural Short",3049,17.612601985999998,2.3270099999999996,0.13,1.8880357949651472,13.788543564407904,17,31.85295063442932,31.85295063442932,1.0302831049863139,1.0302831049863139,6,232.62577894391603,232.62577894391603,0.78747130206625127,0.78747130206625127]
[null,"VH22","EASTERN HILLS/FLEURIEU PENINSULA","Rural Short",2016.5,57.143207787000037,16.240779999999994,4.38,23.429115200110527,0.53087591805848655,15,597.66046803931044,597.66046803931044,1.9133812858601407,1.9133812858601407,6,13.542276221175303,13.542276221175303,5.8517232829159438E-2,5.8517232829159438E-2]
[null,"VH23","EASTERN HILLS/FLEURIEU PENINSULA","Rural Short",1683,24.309865314000007,7.1472900000000017,3.77,5.5222008643083953,27.170570858033585,19,168.78154295424372,168.78154295424372,2.7635175338899245,2.7635175338899245,29,830.44622697563875,830.44622697563875,2.4622697563874034,2.4622697563874034]
[null,"VH31","EASTERN HILLS/FLEURIEU PENINSULA","Rural Short",2371.5,22.108408220999987,18.969136749999997,4.17,0.52724063453784686,10.22941206161943,16,11.436222971579008,11.436222971579008,0.11019749982902095,0.11019749982902095,13,221.8831962892684,221.8831962892684,0.61817415138098253,0.61817415138098253]
[null,"VH32","EASTERN HILLS/FLEURIEU PENINSULA","Rural Short",475.5,77.174776684999969,3.3394299999999997,5.39,1.0992781158478389,2.2642903793739619,6,118.91973427292174,118.91973427292174,0.64493516667282791,0.64493516667282791,26,244.95057833859096,244.95057833859096,1.0557308096740274,1.0557308096740274]
[null,"VH33","EASTERN HILLS/FLEURIEU PENINSULA","Rural Short",144.5,72.660129585999996,1.2243199999999999,1.28,0.86789308941713306,2.0065702224345539,6,308.95501730103808,308.95501730103808,2,2,15,714.30449826989616,714.30449826989616,2.8235294117647061,2.8235294117647061]
[null,"VH34","EASTERN HILLS/FLEURIEU PENINSULA","Rural Short",219.5,42.074589376999995,3.2344632190000002,0.46,0.62794142280262555,0.6960796514575277,4,147.15718693830974,147.15718693830974,1.2209568327814679,1.2209568327814679,3,163.12528473804099,163.12528473804099,0.54214123006833714,0.54214123006833714]
[null,"VH35","EASTERN HILLS/FLEURIEU PENINSULA","Rural Short",165.5,0.63874949999999997,5.4905100000000013,0.56999999999999995,3.0326879748470738E-2,0,1,9.4259818731117821,9.4259818731117821,0.94259818731117828,0.94259818731117828,null,0,0,0,0]
[null,"VH36","EASTERN HILLS/FLEURIEU PENINSULA","Rural Short",11,0.71416373999999994,1.0911500000000001,0.7,1.817669228772022E-2,0,2,85.000022194602366,85.000022194602366,1.757575988769531,1.757575988769531,null,0,0,0,0]
[null,"VH43","EASTERN HILLS/FLEURIEU PENINSULA","Rural Short",111.5,30.522491948999996,1.8795419250000001,0.05,0.36921033724169106,0.91756307515901947,3,170.33184622862947,170.33184622862947,1.811659192825112,1.811659192825112,3,423.30941704035877,423.30941704035877,1.452914798206278,1.452914798206278]
[null,"VH44","EASTERN HILLS/FLEURIEU PENINSULA","Rural Short",312.5,91.36849727100001,7.3799599999999987,0.42,5.6512973992823359E-2,4.5313801630323978,5,9.3024000000000004,9.3024000000000004,5.7599999999999998E-2,5.7599999999999998E-2,23,745.89440000000002,745.89440000000002,2.6303999999999998,2.6303999999999998]
[null,"VH45","EASTERN HILLS/FLEURIEU PENINSULA","Rural Short",1278.5,51.408463345999984,8.1242100000000015,0.86,0.10386956313851228,6.4895829003296477,6,4.1791161517403204,4.1791161517403204,3.5979663668361361E-2,3.5979663668361361E-2,13,261.10363707469691,261.10363707469691,1.1724677356276887,1.1724677356276887]
[null,"VH51","EASTERN HILLS/FLEURIEU PENINSULA","Rural Short",343.5,23.086529048999992,3.0071399999999997,2.42,0.86285804976658564,3.6564302419814863,5,129.21397379912665,129.21397379912665,1.784570596797671,1.784570596797671,14,547.5545851528384,547.5545851528384,1.8311499272197962,1.8311499272197962]
[null,"VH61","EASTERN HILLS/FLEURIEU PENINSULA","Rural Short",43.5,1.4276175590000002,0,0.3,1.8455320875102783E-2,0.26324120427823222,2,21.823741693606323,21.823741693606323,0.92720301397915539,0.92720301397915539,2,311.28735632183907,311.28735632183907,0.89655172413793105,0.89655172413793105]
[null,"VH71","EASTERN HILLS/FLEURIEU PENINSULA","Rural Short",343.5,20.959005491999999,6.7869099999999998,0.06,3.1168710182002468,0.29551211477981004,6,466.75497805221977,466.75497805221977,1.9466278598124631,1.9466278598124631,5,44.253275109170303,44.253275109170303,0.33187772925764192,0.33187772925764192]
[null,"VH72","EASTERN HILLS/FLEURIEU PENINSULA","Rural Short",120,44.485875669000009,0.82225999999999999,0.88,0.14601614986587419,0.62422827482268939,2,62.591666666666669,62.591666666666669,1.2333333333333334,1.2333333333333334,13,267.58333333333331,267.58333333333331,1.1083333333333334,1.1083333333333334]
[null,"W01","UPPER NORTH/EYRE PENINSULA","Rural Long",309,39.583840000000009,0.65646000000000015,0.2,2.3972522032774339,0,4,440.48220064724921,1.4563106796116505,0.96440129449838186,1.6181229773462782E-2,null,0,0,0,0]
[null,"W02","UPPER NORTH/EYRE PENINSULA","Rural Long",301.5,53.293569999999981,0.82201000000000002,1.1200000000000001,2.2670060032227966,0,1,426.91210613598673,0,0.92205638474295193,0,null,0,0,0,0]
[null,"W03","UPPER NORTH/EYRE PENINSULA","Rural Long",145,24.180539999999997,5.0499999999999998E-3,1.0900000000000001,1.1318297914687088,0,2,443.18620689655171,15.310344827586206,0.9517241379310345,2.7586206896551724E-2,null,0,0,0,0]
[null,"W04","UPPER NORTH/EYRE PENINSULA","Rural Long",312.5,66.637590000000031,0.72105999999999992,1.01,8.9002216841071249,3.9723065551754799,20,1617.0517515624999,1179.9797515625,7.8709334106445317,6.9269334106445308,9,721.71519999999998,721.71519999999998,2.0768,2.0768]
[null,"W06","UPPER NORTH/EYRE PENINSULA","Rural Long",241.5,69.084079999999972,0,0.76,2.7051168753533275,0.53466989791191666,6,635.97788682388716,193.10832160649585,2.2236023877224813,1.2670806485920465,4,125.70186335403727,125.70186335403727,0.99378881987577639,0.99378881987577639]
[null,"W08","UPPER NORTH/EYRE PENINSULA","Rural Short",51,33.895989999999998,6.8330000000000002E-2,0.56999999999999995,0.42304053218363574,0,1,426.68627450980392,0,0.92156862745098034,0,null,0,0,0,0]
[null,"W15","UPPER NORTH/EYRE PENINSULA","Rural Long",64.5,82.645330000000001,0,0.34,1.8367972564297514,8.8063691720512011E-3,4,1616.8682170542636,1250.7751937984497,3.2093023255813953,2.4186046511627906,1,7.7519379844961236,7.7519379844961236,6.2015503875968991E-2,6.2015503875968991E-2]
[null,"W16","UPPER NORTH/EYRE PENINSULA","Rural Long",53,76.760049999999964,0,0.05,0.35065200769273475,3.5225476688204808E-4,1,375.64150943396226,0,0.81132075471698117,0,1,0.37735849056603776,0.37735849056603776,3.7735849056603772E-2,3.7735849056603772E-2]
[null,"W17","UPPER NORTH/EYRE PENINSULA","Rural Long",59,80.966080000000034,0,7.0000000000000007E-2,1.9116337816538427,2.6771362283035654E-3,4,1839.6101694915253,1455.0847457627119,2.7288135593220337,1.8983050847457628,1,2.5762711864406778,2.5762711864406778,3.3898305084745763E-2,3.3898305084745763E-2]
[null,"W18","UPPER NORTH/EYRE PENINSULA","Rural Long",64.5,86.723019999999934,0,0.09,0.49511168759106267,0,2,435.82945736434107,41.02325581395349,1.069767441860465,0.21705426356589147,null,0,0,0,0]
[null,"W19","UPPER NORTH/EYRE PENINSULA","Rural Long",17,25.729489999999991,0,0.06,0.1304751656531106,3.0153008045103315E-2,1,435.76470588235293,0,0.94117647058823528,0,1,100.70588235294117,100.70588235294117,0.94117647058823528,0.94117647058823528]
[null,"W20","UPPER NORTH/EYRE PENINSULA","Rural Long",57,93.451959999999957,0,0.02,0.96456161541476804,0.15023665807519351,2,960.78947368421052,522.15789473684208,1.5263157894736843,0.57894736842105265,6,149.64912280701753,149.64912280701753,1.0877192982456141,1.0877192982456141]
[null,"W21","UPPER NORTH/EYRE PENINSULA","Rural Long",59,102.40079999999993,5.237E-2,0.08,1.7332871931814615,9.8983589493855523E-3,3,1667.9830508474577,1236.3728813559321,2.5762711864406778,1.6440677966101696,3,9.5254237288135588,9.5254237288135588,0.13559322033898305,0.13559322033898305]
[null,"W22","UPPER NORTH/EYRE PENINSULA","Rural Long",4,8.5388799999999989,0,0.08,0.10542985172779698,0,5,1496.5,1265,2,1.5,null,0,0,0,0]
[null,"W23","UPPER NORTH/EYRE PENINSULA","Rural Long",52,79.645560000000017,0,0.01,0.5157185914536625,0,2,563.09615384615381,144.61538461538461,1.8076923076923077,0.90384615384615385,null,0,0,0,0]
[null,"W24","UPPER NORTH/EYRE PENINSULA","Rural Long",76,124.53477999999997,0,0.06,0.65278092124746734,0,3,487.67105263157896,73.40789473684211,1.0789473684210527,0.18421052631578946,null,0,0,0,0]
[null,"W25","UPPER NORTH/EYRE PENINSULA","Rural Long",53.5,71.072199999999995,0,0.1,0.31803321627945713,0.13737935908399876,1,337.51401869158877,0,0.7289719626168224,0,1,145.79439252336448,145.79439252336448,0.7289719626168224,0.7289719626168224]
[null,"W26","UPPER NORTH/EYRE PENINSULA","Rural Long",108,148.52772999999999,0.47737999999999997,0.03,2.4217339095757366,0,8,1273.1388888888889,865.87037037037032,3.6574074074074074,2.7777777777777777,null,0,0,0,0]
[null,"W27","UPPER NORTH/EYRE PENINSULA","Rural Long",79.5,130.27843000000001,0,0.12,1.3004189228984568,4.6004472554795478E-2,4,928.72955974842762,497.76100628930817,2.8050314465408803,1.8742138364779874,3,32.855345911949684,32.855345911949684,0.22641509433962265,0.22641509433962265]
[null,"W28","UPPER NORTH/EYRE PENINSULA","Rural Long",92,164.82120999999995,0,0.1,2.6673435457842443,9.3946346327442226E-2,10,1646.1304347826087,1228.4239130434783,2.7826086956521738,1.8804347826086956,3,57.978260869565219,57.978260869565219,0.41304347826086957,0.41304347826086957]
[null,"W29","UPPER NORTH/EYRE PENINSULA","Rural Long",90.5,137.26929999999984,0,0.12,1.5845123923888287,0.27687224676928979,4,994.07734806629833,559.21546961325964,2.8287292817679557,1.8895027624309393,3,173.70165745856355,173.70165745856355,1.4696132596685083,1.4696132596685083]
[null,"W30","UPPER NORTH/EYRE PENINSULA","Rural Short",68.5,112.35136000000007,0,0.11,1.0883850574345402,4.3740691944909718E-2,3,817.31386861313865,384.7299270072993,1.3430656934306568,0.40875912408759124,1,32.846715328467155,32.846715328467155,0.21897810218978103,0.21897810218978103]
[null,"W31","UPPER NORTH/EYRE PENINSULA","Rural Short",30,55.558090000000007,0,0.09,0.28458666194734816,0,2,487.96666666666664,24.966666666666665,1.0333333333333334,3.3333333333333333E-2,null,0,0,0,0]
[null,"W32","UPPER NORTH/EYRE PENINSULA","Rural Long",21,43.306269999999991,0,0.05,0.15201554464794784,0,2,411,14.142857142857142,0.90476190476190477,4.7619047619047616E-2,null,0,0,0,0]
[null,"W33","UPPER NORTH/EYRE PENINSULA","Rural Short",40.5,43.030449999999973,0,0.03,0.33303190831477708,0,1,422.98765432098764,0,0.9135802469135802,0,null,0,0,0,0]
[null,"WHY01","MAJOR METROPOLITAN AREAS","Rural Short",945.5,8.5701238250000014,0.15935999999999997,7.0000000000000007E-2,1.6265510908171783,0.46135737832737667,1,88.491803278688522,88.491803278688522,0.93812797461660502,0.93812797461660502,1,25.099947117927023,25.099947117927023,7.1919619249074571E-2,7.1919619249074571E-2]
[null,"WHY02","MAJOR METROPOLITAN AREAS","Urban",921.5,8.8386245369999976,1.4977397720000001,2.08,1.8025926035282032,1.6142963060895881,2,90.298426478567549,90.298426478567549,1.0667390124796527,1.0667390124796527,3,80.865979381443296,80.865979381443296,0.23982637004883342,0.23982637004883342]
[null,"WHY03","MAJOR METROPOLITAN AREAS","Urban",1002,7.526146380999994,0.66853999999999991,4.63,5.2107115351899845E-2,0,6,2.4005306038313972,2.4005306038313972,1.6633387811169659E-2,1.6633387811169659E-2,null,0,0,0,0]
[null,"WHY04","MAJOR METROPOLITAN AREAS","Urban",1201.5,10.512121607999992,1.2880700000000003,2.72,3.4554710202641528,0,4,132.75821889305035,132.75821889305035,0.94714939658759878,0.94714939658759878,null,0,0,0,0]
[null,"WHY05","MAJOR METROPOLITAN AREAS","Urban",538.5,6.1421877290000015,0.11387,4.17,3.4735387105799522,3.8127184018863565E-2,4,297.7586404699469,297.7586404699469,1.5561748711692363,1.5561748711692363,1,3.2683379758588673,3.2683379758588673,1.8570102135561744E-2,1.8570102135561744E-2]
[null,"WHY06","MAJOR METROPOLITAN AREAS","Urban",702.5,6.5952753079999971,0.46662999999999999,1.54,3.6545772408990249E-2,0,3,2.4014234875444842,2.4014234875444842,4.2704626334519574E-2,4.2704626334519574E-2,null,0,0,0,0]
[null,"WHY07","MAJOR METROPOLITAN AREAS","Urban",955,22.646234816,2.5534700000000004,2.5499999999999998,9.7538651567198702,0.19613836596976744,11,471.46701417293849,471.46701417293849,2.4041884696920506,2.4041884696920506,2,9.4806282722513089,9.4806282722513089,3.7696335078534031E-2,3.7696335078534031E-2]
[null,"WHY08","MAJOR METROPOLITAN AREAS","Urban",1488,9.9702396559999986,3.4521099999999998,3.05,0.16338354433493019,1.9223249592510776,6,5.0685451466550147,5.0685451466550147,5.1971315269401838E-2,5.1971315269401838E-2,2,59.635080645161288,59.635080645161288,0.20766129032258066,0.20766129032258066]
[null,"WHY09","MAJOR METROPOLITAN AREAS","Urban",810,7.5275987359999954,0.9746919180000001,3.66,1.3853454474275302,0.76427673419631059,4,78.949793836805554,78.949793836805554,0.95102878853126804,0.95102878853126804,1,43.555555555555557,43.555555555555557,9.8765432098765427E-2,9.8765432098765427E-2]
[null,"WHY10","MAJOR METROPOLITAN AREAS","Urban",1828.5,8.992266266000005,1.9577399999999998,3.98,1.7604505820133725,0,15,44.443352431979768,44.443352431979768,0.25886428828835323,0.25886428828835323,null,0,0,0,0]
[null,"WHY12","MAJOR METROPOLITAN AREAS","Urban",1478.5,4.5116377649999997,10.74142,6.1,2.0042405870683009,0.14384346698025799,6,62.575807274053098,62.575807274053098,0.35892232173110811,0.35892232173110811,1,4.4910382144064931,4.4910382144064931,1.3527223537368955E-2,1.3527223537368955E-2]
[null,"WHY13","MAJOR METROPOLITAN AREAS","Urban",302.5,0,5.3045100000000005,3.73,2.2096436192750473E-3,0,1,0.33719008264462808,0.33719008264462808,3.3057851239669421E-3,3.3057851239669421E-3,null,0,0,0,0]
[null,"WHY14","UPPER NORTH/EYRE PENINSULA","Urban",102.5,48.117703636999991,0,1.43,0,0.20952620672184569,null,0,0,0,0,3,94.360975609756096,94.360975609756096,1.1219512195121952,1.1219512195121952]
[null,"WHY15","UPPER NORTH/EYRE PENINSULA","Urban",40,60.335050000000003,0,0.06,0.75201537842660782,0.24306079812025524,5,867.85,867.85,4.25,4.25,1,280.5,280.5,0.85,0.85]
[null,"WHY17","UPPER NORTH/EYRE PENINSULA","Rural Short",52.5,2.6934300000000002,0,0.04,0.71540331714341221,0.43507408254536867,7,700.95238095238096,700.95238095238096,3.3142857142857145,3.3142857142857145,5,426.28571428571428,426.28571428571428,1.5619047619047619,1.5619047619047619]
[null,"WK11","BAROSSA/MID NORTH & YORKE PENINSULA/RIVE","Rural Short",300,44.097480000000012,0.91413999999999984,0.16,0.15983826547449162,2.0023322353927804,4,27.406676432291668,27.406676432291668,4.8888899485270171E-2,4.8888899485270171E-2,6,343.33,343.33,1.03,1.03]
[null,"WK12","BAROSSA/MID NORTH & YORKE PENINSULA/RIVE","Rural Short",8,30.666840000000001,0,0.93,0.11635025718505082,5.7232265371472982E-2,1,748.12510681152378,748.12510681152378,0.87500011920928999,0.87500011920928999,1,368,368,1,1]
[null,"WK21","BAROSSA/MID NORTH & YORKE PENINSULA/RIVE","Rural Short",145,29.718060000000001,1.4778500000000001,0.02,0.87760038610794144,0.45352293439235503,7,311.33336991934942,311.33336991934942,1.3356324023213879,1.3356324023213879,5,160.8896551724138,160.8896551724138,0.54482758620689653,0.54482758620689653]
[null,"WK31","BAROSSA/MID NORTH & YORKE PENINSULA/RIVE","Rural Short",564.5,45.160810000000005,2.5354299999999994,2.9,2.3034626732079579,7.2512347090894777E-3,18,209.90080392329011,209.90080392329011,2.3430765024989908,2.3430765024989908,2,0.66076173604960142,0.66076173604960142,5.1372896368467667E-2,5.1372896368467667E-2]
[null,"WK32","BAROSSA/MID NORTH & YORKE PENINSULA/RIVE","Rural Short",128,30.114729999999994,0.17881,4.12,0.96661097105991156,1.7885082928585307E-3,5,388.453125,388.453125,2.640625,2.640625,1,0.71875,0.71875,1.5625E-2,1.5625E-2]
[null,"WK33","BAROSSA/MID NORTH & YORKE PENINSULA/RIVE","Rural Short",151,27.588590000000014,9.3869999999999995E-2,1.1100000000000001,0.43822341236540213,0.52201113782431818,6,149.28476821192052,149.28476821192052,1.1920529801324504,1.1920529801324504,5,177.82781456953643,177.82781456953643,0.85430463576158944,0.85430463576158944]
[null,"WK41","BAROSSA/MID NORTH & YORKE PENINSULA/RIVE","Rural Short",1307,23.86391999999999,7.4327399999999981,1.7,0.84806383305374022,7.8208357197498579E-2,15,33.377194078441057,33.377194078441057,1.1571027764523707,1.1571027764523707,3,3.0780413159908186,3.0780413159908186,1.6067329762815608E-2,1.6067329762815608E-2]
[null,"WK42","BAROSSA/MID NORTH & YORKE PENINSULA/RIVE","Rural Short",403,31.881379999999996,2.1116499999999996,5.2,1.7382552272238128,2.89466179137647E-2,9,221.87346563978173,221.87346563978173,1.2886684218943858,1.2886684218943858,4,3.694789081885856,3.694789081885856,2.729528535980149E-2,2.729528535980149E-2]
[null,"WK43","BAROSSA/MID NORTH & YORKE PENINSULA/RIVE","Rural Short",333.5,45.420630000000003,1.33999,1.75,3.0015834827973601E-2,0,3,4.6296851574212896,4.6296851574212896,3.2983508245877063E-2,3.2983508245877063E-2,null,0,0,0,0]
[null,"WK51","BAROSSA/MID NORTH & YORKE PENINSULA/RIVE","Rural Short",92,49.513849999999998,4.6281099999999995,2.04,5.4432861086998758E-3,1.3763737731998259E-2,1,3.0434782608695654,3.0434782608695654,4.3478260869565216E-2,4.3478260869565216E-2,1,7.6956521739130439,7.6956521739130439,4.3478260869565216E-2,4.3478260869565216E-2]
[null,"WK52","BAROSSA/MID NORTH & YORKE PENINSULA/RIVE","Rural Short",126.5,51.524839999999976,9.1129500000000032,3.22,1.2351399389865951,5.8793986292545841E-2,3,502.2529644268775,502.2529644268775,2.9486166007905137,2.9486166007905137,2,23.907779980082751,23.907779980082751,0.19235841653092575,0.19235841653092575]
[null,"WK61","BAROSSA/MID NORTH & YORKE PENINSULA/RIVE","Rural Short",466,27.925559999999994,0.31660000000000005,4.09,2.6730422855222608E-2,4.6287372231480023E-2,3,2.9506437768240343,2.9506437768240343,8.5836909871244635E-3,8.5836909871244635E-3,4,5.1094420600858372,5.1094420600858372,1.9399141630901287,1.9399141630901287]
[null,"WK65","BAROSSA/MID NORTH & YORKE PENINSULA/RIVE","Rural Short",509,39.987650000000009,9.640000000000001E-3,1.1000000000000001,0.74635887263540124,0.33760038058457875,7,75.426991700657695,75.426991700657695,0.42174203269373922,0.42174203269373922,4,34.117878192534384,34.117878192534384,2.0962671905697445,2.0962671905697445]
[null,"WK71","BAROSSA/MID NORTH & YORKE PENINSULA/RIVE","Rural Short",122.5,23.990089999999999,0.81858999999999993,2.1,4.3351885794288298E-3,2.0237360139844895E-2,1,1.8204081632653062,1.8204081632653062,8.1632653061224497E-3,8.1632653061224497E-3,3,8.4979591836734691,8.4979591836734691,1.8857142857142857,1.8857142857142857]
[null,"WK72","BAROSSA/MID NORTH & YORKE PENINSULA/RIVE","Rural Short",590,39.707850000000001,0.61096000000000006,0.59,3.1184196990224575,5.9487341045077219E-2,13,271.88135313906912,271.88135313906912,1.753107327828973,1.753107327828973,5,5.1864406779661021,5.1864406779661021,1.8915254237288135,1.8915254237288135]
[null,"WK73","BAROSSA/MID NORTH & YORKE PENINSULA/RIVE","Rural Short",27,11.389959999999999,0,2.76,7.2784511396329771E-2,1.3997021422371108E-3,1,138.66666666666666,138.66666666666666,0.88888888888888884,0.88888888888888884,2,2.6666666666666665,2.6666666666666665,1.7777777777777777,1.7777777777777777]
[null,"WK81","BAROSSA/MID NORTH & YORKE PENINSULA/RIVE","Rural Short",52,30.467779999999994,0,0.02,3.1383137248687076E-2,3.0326879748470742E-3,3,31.044872577373805,31.044872577373805,0.24999999541502732,0.24999999541502732,2,3,3,2,2]
[null,"WK91","BAROSSA/MID NORTH & YORKE PENINSULA/RIVE","Rural Short",63,98.295309999999986,0,0.63,0.39730156501249775,3.5925688317419185E-2,1,324.39682539682542,324.39682539682542,0.82539682539682535,0.82539682539682535,3,29.333333333333332,29.333333333333332,1.6666666666666667,1.6666666666666667]
[null,"YK01","BAROSSA/MID NORTH & YORKE PENINSULA/RIVE","Rural Long",78.5,52.311060000000019,0,0.08,0.20342712787438275,1.7260483577220358E-3,4,147.13375796178343,147.13375796178343,1.8726114649681529,1.8726114649681529,2,1.2484076433121019,1.2484076433121019,5.0955414012738856E-2,5.0955414012738856E-2]
[null,"YK02","BAROSSA/MID NORTH & YORKE PENINSULA/RIVE","Rural Short",508,10.491680000000001,1.6424100000000004,0.1,5.3910111217488259,3.4572059704030709,8,545.88779527559052,545.88779527559052,6.840551181102362,6.840551181102362,7,350.07283464566927,350.07283464566927,1.2381889763779528,1.2381889763779528]
[null,"YK03","BAROSSA/MID NORTH & YORKE PENINSULA/RIVE","Rural Long",909.5,22.698219999999999,3.0898199999999996,0.95,9.6988243226849136,8.9771246702972753,8,605.46564583047007,605.46564583047007,3.9384277285030085,3.9384277285030085,11,560.41231445849371,560.41231445849371,1.560197910940077,1.560197910940077]
[null,"YK04","BAROSSA/MID NORTH & YORKE PENINSULA/RIVE","Rural Short",179.5,14.656139999999999,0.12145,1.2,0.27445825875730467,5.2061143568208103E-2,6,78.651809734886399,78.651809734886399,4.9749303564719831,4.9749303564719831,1,14.919220055710307,14.919220055710307,7.2423398328690811E-2,7.2423398328690811E-2]
[null,"YK05","BAROSSA/MID NORTH & YORKE PENINSULA/RIVE","Rural Long",45,40.658840000000019,9.6030000000000004E-2,0.91,0.84667955767769065,5.0724686431014932E-3,6,1068.2666666666667,1068.2666666666667,5.333333333333333,5.333333333333333,1,6.4,6.4,8.8888888888888892E-2,8.8888888888888892E-2]
[null,"YK06","BAROSSA/MID NORTH & YORKE PENINSULA/RIVE","Rural Short",59,46.707460000000012,0.44864000000000004,0.13,9.3138513381361088E-2,0.26195814398118156,5,81.20338983050847,81.20338983050847,3.7796610169491527,3.7796610169491527,1,228.38983050847457,228.38983050847457,0.93220338983050843,0.93220338983050843]
[null,"YK07","BAROSSA/MID NORTH & YORKE PENINSULA/RIVE","Rural Long",651.5,37.885750000000009,1.8034799999999997,0.06,0.63222685559989988,9.8991867480877236,1,55.097467382962392,55.097467382962392,0.98388334612432848,0.98388334612432848,5,862.69685341519573,862.69685341519573,2.0429777436684575,2.0429777436684575]
[null,"YK08","BAROSSA/MID NORTH & YORKE PENINSULA/RIVE","Rural Long",53,58.004580000000004,0,1.41,0.70253690706955663,5.5303998400481552E-3,4,752.60377358490564,752.60377358490564,3.8490566037735849,3.8490566037735849,1,5.9245283018867925,5.9245283018867925,3.7735849056603772E-2,3.7735849056603772E-2]
[null,"YK09","BAROSSA/MID NORTH & YORKE PENINSULA/RIVE","Rural Long",68,6.2954900000000009,0,7.0000000000000007E-2,0.51816676208349266,0,3,432.64705882352939,432.64705882352939,2.8382352941176472,2.8382352941176472,null,0,0,0,0]
[null,"YK10","BAROSSA/MID NORTH & YORKE PENINSULA/RIVE","Rural Long",21,21.894460000000002,0,0.08,1.6767326903585487E-2,4.0896778435005783E-2,1,45.333333333333336,45.333333333333336,0.80952380952380953,0.80952380952380953,2,110.57142857142857,110.57142857142857,0.8571428571428571,0.8571428571428571]
[null,"YK11","BAROSSA/MID NORTH & YORKE PENINSULA/RIVE","Rural Long",102,27.902160000000006,0,0.11,2.308889095005072,2.4505307367683438,5,1285.2156862745098,1285.2156862745098,4.6568627450980395,4.6568627450980395,6,1364.0588235294117,1364.0588235294117,4.1862745098039218,4.1862745098039218]
[null,"YK12","BAROSSA/MID NORTH & YORKE PENINSULA/RIVE","Rural Long",97,83.485979999999955,0.63810999999999996,0.05,1.2412753475389608,0.7488231834378577,5,726.5567010309278,726.5567010309278,3.7731958762886597,3.7731958762886597,14,438.30927835051546,438.30927835051546,1.597938144329897,1.597938144329897]
[null,"YK13","BAROSSA/MID NORTH & YORKE PENINSULA/RIVE","Rural Short",3,0.26494999999999996,0.48516000000000004,0.1,4.607352884863824E-3,0,5,79,79,5,5,null,0,0,0,0]
[null,"YK14","BAROSSA/MID NORTH & YORKE PENINSULA/RIVE","Rural Long",49,39.992870000000003,0,1.56,4.6180599938236505E-2,0.65434845496009253,2,53.510204081632651,53.510204081632651,0.91836734693877553,0.91836734693877553,2,758.20408163265301,758.20408163265301,1.7551020408163265,1.7551020408163265]
[null,"YK15","BAROSSA/MID NORTH & YORKE PENINSULA/RIVE","Rural Long",83,93.468269999999947,0,0.06,1.3512845112362246,3.3305688208697642E-2,4,924.36144578313258,924.36144578313258,2.7831325301204819,2.7831325301204819,3,22.783132530120483,22.783132530120483,0.14457831325301204,0.14457831325301204]
[null,"YK16","BAROSSA/MID NORTH & YORKE PENINSULA/RIVE","Rural Long",92,43.43683999999994,0,0.08,1.6188220066831402,9.0916955332256619E-2,4,999.04347826086962,999.04347826086962,2.9782608695652173,2.9782608695652173,4,56.108695652173914,56.108695652173914,0.58695652173913049,0.58695652173913049]
[null,"YK17","BAROSSA/MID NORTH & YORKE PENINSULA/RIVE","Rural Long",984.5,52.649529999999984,5.3648800000000012,0.06,12.877078096355181,2.4378847906372783,5,742.63382427628233,742.63382427628233,2.9253428136109698,2.9253428136109698,8,140.59522600304723,140.59522600304723,0.4174707973590655,0.4174707973590655]
[null,"YK18","BAROSSA/MID NORTH & YORKE PENINSULA/RIVE","Rural Long",42,24.52711,0,1.98,0.32336987599772016,0,3,437.14285714285717,437.14285714285717,2.8571428571428572,2.8571428571428572,null,0,0,0,0,null,null," "]
[null,"YK19","BAROSSA/MID NORTH & YORKE PENINSULA/RIVE","Rural Long",57,64.86921000000001,1.0971000000000002,0.27,1.6621493430096321,0.58220667870264908,4,1655.6491228070176,1655.6491228070176,3.8596491228070176,3.8596491228070176,8,579.92982456140351,579.92982456140351,2.8421052631578947,2.8421052631578947]
[null,"YK20","BAROSSA/MID NORTH & YORKE PENINSULA/RIVE","Rural Long",227,33.605849999999997,0.60517999999999994,0.06,0.21600262305207188,1.6062817369821392E-2,1,54.026431718061673,54.026431718061673,0.96475770925110127,0.96475770925110127,1,4.0176211453744495,4.0176211453744495,1.7621145374449341E-2,1.7621145374449341E-2]
[null,"YK21","BAROSSA/MID NORTH & YORKE PENINSULA/RIVE","Rural Long",70.5,46.16754000000001,0.40852000000000005,0.5,8.9754514601545848E-2,1.4068703134502119,1,72.283687943262407,72.283687943262407,1.2907801418439717,1.2907801418439717,9,1133.0212765957447,1133.0212765957447,2.8794326241134751,2.8794326241134751]
[null,"YK22","BAROSSA/MID NORTH & YORKE PENINSULA/RIVE","Rural Short",83.5,16.31859,1.5282499999999994,0.04,0.11788602486841446,0.44702987167697728,4,72.622754491017957,72.622754491017957,3.8562874251497008,3.8562874251497008,2,275.38922155688624,275.38922155688624,1.1377245508982037,1.1377245508982037]
[null,"YK23","BAROSSA/MID NORTH & YORKE PENINSULA/RIVE","Rural Long",544,21.565799999999996,0.83455999999999997,1.2,4.202822074623092,5.4440974221620524E-2,6,438.64705882352939,438.64705882352939,2.8713235294117645,2.8713235294117645,1,5.6819852941176467,5.6819852941176467,2.0220588235294119E-2,2.0220588235294119E-2]
[null,"YK24","BAROSSA/MID NORTH & YORKE PENINSULA/RIVE","Rural Long",124,65.352610000000013,0.21678999999999998,1.37,2.9037064943620989,0.34878505742825988,4,1329.5483870967741,1329.5483870967741,3.564516129032258,3.564516129032258,1,159.70161290322579,159.70161290322579,0.55645161290322576,0.55645161290322576]
[null,"YK25","BAROSSA/MID NORTH & YORKE PENINSULA/RIVE","Rural Long",332.5,0.6336900000000002,6.5571999999999999,0.06,7.2694287859297937,0.53260920752565666,4,1241.3142857142857,1241.3142857142857,2.9293233082706767,2.9293233082706767,1,90.94736842105263,90.94736842105263,0.31578947368421051,0.31578947368421051]
[null,"YK26","BAROSSA/MID NORTH & YORKE PENINSULA/RIVE","Rural Short",5,2.1777199999999999,0.46836,0.48,7.6789214747730395E-3,2.4378145643963019E-2,5,79,79,5,5,2,250.8,250.8,0.6,0.6]
[null,"YK27","BAROSSA/MID NORTH & YORKE PENINSULA/RIVE","Rural Long",111.5,12.760519999999996,0,1.49,0.10849446819967082,1.8904808829025757,1,55.246636771300452,55.246636771300452,0.98654708520179368,0.98654708520179368,4,962.65470852017938,962.65470852017938,2.8699551569506725,2.8699551569506725]
[null,"YK28","BAROSSA/MID NORTH & YORKE PENINSULA/RIVE","Rural Long",68,55.151039999999995,0,0.06,1.1273561559293066,0.94545179431141713,3,941.29411764705878,941.29411764705878,2.7794117647058822,2.7794117647058822,5,789.41176470588232,789.41176470588232,2.8676470588235294,2.8676470588235294]
[null,"YK29","BAROSSA/MID NORTH & YORKE PENINSULA/RIVE","Rural Long",169.5,36.306209999999979,8.929999999999999E-2,0.09,1.3196696459085608,0.32527205173888318,4,442.04719764011799,442.04719764011799,2.8849557522123894,2.8849557522123894,1,108.95575221238938,108.95575221238938,0.95575221238938057,0.95575221238938057]
[null,"YK30","BAROSSA/MID NORTH & YORKE PENINSULA/RIVE","Rural Long",113.5,18.975870000000004,0.76509000000000005,0.25,8.0877694476118242E-2,0.32919969238961805,1,40.458149779735685,40.458149779735685,0.72246696035242286,0.72246696035242286,9,164.6784140969163,164.6784140969163,0.96916299559471364,0.96916299559471364]

{"sheet":"3.6.9 Network-reliability","index":8,"n_rows":22,"n_cols":3,"rows_kept":22,"cut":false,"hidden":false,"merged":[]}
[null,{"$f":"IF(dms_DataQuality=\"backcast\",INDEX(dms_Worksheet_List,MATCH(dms_Model,dms_Model_List))&\" BACKCAST\",INDEX(dms_Worksheet_List,MATCH(dms_Model,dms_Model_List)))","v":"ANNUAL REPORTING STATEMENT"}]
[null,{"$f":"INDEX(dms_TradingNameFull_List,MATCH(dms_TradingName,dms_TradingName_List))","v":"SA Power Networks"}]
[null,{"$f":"CONCATENATE(\"Annual Reporting RIN Response \",IF(SUM(dms_SingleYear_Model)>0,CONCATENATE(CRY),CONCATENATE(FRCP_y1,\" to \",dms_MultiYear_FinalYear_Result)))","v":"Annual Reporting RIN Response 2017-18"}]
[null,"3.6 QUALITY OF SERVICES"]
[]
[]
[null,"3.6.9 - NETWORK FEEDER RELIABILITY - PLANNED OUTAGES"]
[null,null,{"$f":"CRY","v":"2017-18"}]
[null,"3.6.9.1 - PLANNED MINUTES OFF SUPPLY (SAIDI)"]
[null,{"$f":"INDEX(dms_FeederName_1,MATCH(dms_TradingName,dms_TradingName_List))","v":"CBD"},"11.29"]
[null,{"$f":"INDEX(dms_FeederName_2,MATCH(dms_TradingName,dms_TradingName_List))","v":"Urban"},38.130000000000003]
[null,{"$f":"INDEX(dms_FeederName_3,MATCH(dms_TradingName,dms_TradingName_List))","v":"Short rural"},117.32]
[null,{"$f":"INDEX(dms_FeederName_4,MATCH(dms_TradingName,dms_TradingName_List))","v":"Long rural"},140.91]
[null,{"$f":"IF((INDEX(dms_FeederName_5,MATCH(dms_TradingName,dms_TradingName_List))=0),\"\",(INDEX(dms_FeederName_5,MATCH(dms_TradingName,dms_TradingName_List))))","v":"  "}]
[]
[null,null,{"$f":"CRY","v":"2017-18"}]
[null,"3.6.9.2 - PLANNED INTERRUPTIONS TO SUPPLY (SAIFI)"]
[null,{"$f":"INDEX(dms_FeederName_1,MATCH(dms_TradingName,dms_TradingName_List))","v":"CBD"},"0.054"]
[null,{"$f":"INDEX(dms_FeederName_2,MATCH(dms_TradingName,dms_TradingName_List))","v":"Urban"},0.20499999999999999]
[null,{"$f":"INDEX(dms_FeederName_3,MATCH(dms_TradingName,dms_TradingName_List))","v":"Short rural"},0.54700000000000004]
[null,{"$f":"INDEX(dms_FeederName_4,MATCH(dms_TradingName,dms_TradingName_List))","v":"Long rural"},0.67600000000000005]
[null,{"$f":"IF((INDEX(dms_FeederName_5,MATCH(dms_TradingName,dms_TradingName_List))=0),\"\",(INDEX(dms_FeederName_5,MATCH(dms_TradingName,dms_TradingName_List))))","v":"  "}]

{"sheet":"4.1 Public lighting","index":9,"n_rows":52,"n_cols":4,"rows_kept":52,"cut":false,"hidden":false,"merged":[[5,1,5,2]]}
[null,{"$f":"IF(dms_DataQuality=\"backcast\",INDEX(dms_Worksheet_List,MATCH(dms_Model,dms_Model_List))&\" BACKCAST\",INDEX(dms_Worksheet_List,MATCH(dms_Model,dms_Model_List)))","v":"ANNUAL REPORTING STATEMENT"}]
[null,{"$f":"INDEX(dms_TradingNameFull_List,MATCH(dms_TradingName,dms_TradingName_List))","v":"SA Power Networks"}]
[null,{"$f":"CONCATENATE(\"Annual Reporting RIN Response \",IF(SUM(dms_SingleYear_Model)>0,CONCATENATE(CRY),CONCATENATE(FRCP_y1,\" to \",dms_MultiYear_FinalYear_Result)))","v":"Annual Reporting RIN Response 2017-18"}]
[null,"4.1 PUBLIC LIGHTING"]
[]
[null,"Tables 4.1.1 - 4.1.3 deliberately omitted."]
[]
[null,"4.1.4 - PUBLIC LIGHTING METRICS BY TARIFF"]
[null,null,"Number of Lights","Public Lighting Revenue"]
[null,"Tariff categories","0's","$0's, nominal"]
[]
[]
[]
[]
[]
[]
[]
[]
[]
[]
[]
[]
[]
[]
[]
[]
[]
[]
[]
[]
[]
[]
[]
[]
[]
[]
[]
[]
[]
[]
[]
[]
[]
[]
[]
[]
[]
[]
[]
[]
[null,"To enter further tariff categories - please insert new rows above this row. "]
[null,"Total ",{"$f":"SUM(C11:C50)","v":0},{"$f":"SUM(D11:D50)","v":0}]

{"sheet":"6.2 STPIS Reliability","index":10,"n_rows":94,"n_cols":5,"rows_kept":94,"cut":false,"hidden":false,"merged":[[76,1,81,1],[82,1,87,1],[88,1,93,1],[75,1,75,2],[22,1,27,1],[32,1,37,1],[38,1,43,1],[44,1,49,1],[5,1,5,2],[31,1,31,2],[66,1,71,1],[60,1,65,1],[53,1,53,2],[54,1,59,1],[16,1,21,1],[9,1,9,2],[10,1,15,1]]}
[null,{"$f":"IF(dms_DataQuality=\"backcast\",INDEX(dms_Worksheet_List,MATCH(dms_Model,dms_Model_List))&\" BACKCAST\",INDEX(dms_Worksheet_List,MATCH(dms_Model,dms_Model_List)))","v":"ANNUAL REPORTING STATEMENT"}]
[null,{"$f":"INDEX(dms_TradingNameFull_List,MATCH(dms_TradingName,dms_TradingName_List))","v":"SA Power Networks"}]
[null,{"$f":"CONCATENATE(\"Annual Reporting RIN Response \",IF(SUM(dms_SingleYear_Model)>0,CONCATENATE(CRY),CONCATENATE(FRCP_y1,\" to \",dms_MultiYear_FinalYear_Result)))","v":"Annual Reporting RIN Response 2017-18"}]
[null,"6.2 RELIABILITY AND CUSTOMER SERVICE PERFORMANCE"]
[]
[null,"Did the MAIFI parameter of the STPIS apply during the period?\nNB:This flag is set from the response on worksheet 3.6.8 Network feeders",null,{"$f":"dms_MAIFI_Flag","v":"No"}]
[]
[]
[null,"6.2.1 - UNPLANNED MINUTES OFF SUPPLY (SAIDI)"]
[null,null,null,{"$f":"CRY","v":"2017-18"}]
[null,"Total sustained minutes off supply",{"$f":"INDEX(dms_FeederName_1,MATCH(dms_TradingName,dms_TradingName_List))","v":"CBD"},42.56]
[null,null,{"$f":"INDEX(dms_FeederName_2,MATCH(dms_TradingName,dms_TradingName_List))","v":"Urban"},96.79]
[null,null,{"$f":"INDEX(dms_FeederName_3,MATCH(dms_TradingName,dms_TradingName_List))","v":"Short rural"},163.61000000000001]
[null,null,{"$f":"INDEX(dms_FeederName_4,MATCH(dms_TradingName,dms_TradingName_List))","v":"Long rural"},293.98]
[null,null,{"$f":"IF((INDEX(dms_FeederName_5,MATCH(dms_TradingName,dms_TradingName_List))=0),\"\",(INDEX(dms_FeederName_5,MATCH(dms_TradingName,dms_TradingName_List))))","v":"  "},null,""]
[null,null,"Whole Network",137.29,""]
[null,"Total of excluded events*\n\n*see 3.3 of STPIS",{"$f":"INDEX(dms_FeederName_1,MATCH(dms_TradingName,dms_TradingName_List))","v":"CBD"},0]
[null,null,{"$f":"INDEX(dms_FeederName_2,MATCH(dms_TradingName,dms_TradingName_List))","v":"Urban"},0.68]
[null,null,{"$f":"INDEX(dms_FeederName_3,MATCH(dms_TradingName,dms_TradingName_List))","v":"Short rural"},8.5299999999999994]
[null,null,{"$f":"INDEX(dms_FeederName_4,MATCH(dms_TradingName,dms_TradingName_List))","v":"Long rural"},24.74]
[null,null,{"$f":"IF((INDEX(dms_FeederName_5,MATCH(dms_TradingName,dms_TradingName_List))=0),\"\",(INDEX(dms_FeederName_5,MATCH(dms_TradingName,dms_TradingName_List))))","v":"  "},null,""]
[null,null,"Whole Network",5.62,""]
[null,"Total sustained minutes off supply after removing excluded events",{"$f":"INDEX(dms_FeederName_1,MATCH(dms_TradingName,dms_TradingName_List))","v":"CBD"},42.56]
[null,null,{"$f":"INDEX(dms_FeederName_2,MATCH(dms_TradingName,dms_TradingName_List))","v":"Urban"},96.11]
[null,null,{"$f":"INDEX(dms_FeederName_3,MATCH(dms_TradingName,dms_TradingName_List))","v":"Short rural"},155.08000000000001]
[null,null,{"$f":"INDEX(dms_FeederName_4,MATCH(dms_TradingName,dms_TradingName_List))","v":"Long rural"},269.23]
[null,null,{"$f":"IF((INDEX(dms_FeederName_5,MATCH(dms_TradingName,dms_TradingName_List))=0),\"\",(INDEX(dms_FeederName_5,MATCH(dms_TradingName,dms_TradingName_List))))","v":"  "},null,""]
[null,null,"Whole Network",131.68,""]
[]
[]
[null,"6.2.2 - UNPLANNED INTERRUPTIONS TO SUPPLY (SAIFI)"]
[null,null,null,{"$f":"CRY","v":"2017-18"}]
[null,"Total sustained interruptions",{"$f":"INDEX(dms_FeederName_1,MATCH(dms_TradingName,dms_TradingName_List))","v":"CBD"},0.40699999999999997]
[null,null,{"$f":"INDEX(dms_FeederName_2,MATCH(dms_TradingName,dms_TradingName_List))","v":"Urban"},1.083]
[null,null,{"$f":"INDEX(dms_FeederName_3,MATCH(dms_TradingName,dms_TradingName_List))","v":"Short rural"},1.266]
[null,null,{"$f":"INDEX(dms_FeederName_4,MATCH(dms_TradingName,dms_TradingName_List))","v":"Long rural"},1.629]
[null,null,{"$f":"IF((INDEX(dms_FeederName_5,MATCH(dms_TradingName,dms_TradingName_List))=0),\"\",(INDEX(dms_FeederName_5,MATCH(dms_TradingName,dms_TradingName_List))))","v":"  "},null,""]
[null,null,"Whole Network",1.1919999999999999,""]
[null,"Total of excluded events*\n\n*see 3.3 of STPIS",{"$f":"INDEX(dms_FeederName_1,MATCH(dms_TradingName,dms_TradingName_List))","v":"CBD"},0]
[null,null,{"$f":"INDEX(dms_FeederName_2,MATCH(dms_TradingName,dms_TradingName_List))","v":"Urban"},2.4E-2]
[null,null,{"$f":"INDEX(dms_FeederName_3,MATCH(dms_TradingName,dms_TradingName_List))","v":"Short rural"},6.6000000000000003E-2]
[null,null,{"$f":"INDEX(dms_FeederName_4,MATCH(dms_TradingName,dms_TradingName_List))","v":"Long rural"},0.15]
[null,null,{"$f":"IF((INDEX(dms_FeederName_5,MATCH(dms_TradingName,dms_TradingName_List))=0),\"\",(INDEX(dms_FeederName_5,MATCH(dms_TradingName,dms_TradingName_List))))","v":"  "},null,""]
[null,null,"Whole Network",0.05,""]
[null,"Total sustained interruptions after removing excluded events",{"$f":"INDEX(dms_FeederName_1,MATCH(dms_TradingName,dms_TradingName_List))","v":"CBD"},0.40699999999999997]
[null,null,{"$f":"INDEX(dms_FeederName_2,MATCH(dms_TradingName,dms_TradingName_List))","v":"Urban"},1.0589999999999999]
[null,null,{"$f":"INDEX(dms_FeederName_3,MATCH(dms_TradingName,dms_TradingName_List))","v":"Short rural"},1.2]
[null,null,{"$f":"INDEX(dms_FeederName_4,MATCH(dms_TradingName,dms_TradingName_List))","v":"Long rural"},1.48]
[null,null,{"$f":"IF((INDEX(dms_FeederName_5,MATCH(dms_TradingName,dms_TradingName_List))=0),\"\",(INDEX(dms_FeederName_5,MATCH(dms_TradingName,dms_TradingName_List))))","v":"  "},null,""]
[null,null,"Whole Network",1.1419999999999999,""]
[]
[]
[null,"6.2.3 - UNPLANNED MOMENTARY INTERRUPTIONS TO SUPPLY (MAIFI)"]
[null,null,null,{"$f":"CRY","v":"2017-18"}]
[null,"Total momentary interruptions",{"$f":"INDEX(dms_FeederName_1,MATCH(dms_TradingName,dms_TradingName_List))","v":"CBD"}]
[null,null,{"$f":"INDEX(dms_FeederName_2,MATCH(dms_TradingName,dms_TradingName_List))","v":"Urban"}]
[null,null,{"$f":"INDEX(dms_FeederName_3,MATCH(dms_TradingName,dms_TradingName_List))","v":"Short rural"}]
[null,null,{"$f":"INDEX(dms_FeederName_4,MATCH(dms_TradingName,dms_TradingName_List))","v":"Long rural"}]
[null,null,{"$f":"IF((INDEX(dms_FeederName_5,MATCH(dms_TradingName,dms_TradingName_List))=0),\"\",(INDEX(dms_FeederName_5,MATCH(dms_TradingName,dms_TradingName_List))))","v":"  "}]
[null,null,"Whole Network"]
[null,"Total of excluded events*\n\n*see 3.3 of STPIS",{"$f":"INDEX(dms_FeederName_1,MATCH(dms_TradingName,dms_TradingName_List))","v":"CBD"}]
[null,null,{"$f":"INDEX(dms_FeederName_2,MATCH(dms_TradingName,dms_TradingName_List))","v":"Urban"}]
[null,null,{"$f":"INDEX(dms_FeederName_3,MATCH(dms_TradingName,dms_TradingName_List))","v":"Short rural"}]
[null,null,{"$f":"INDEX(dms_FeederName_4,MATCH(dms_TradingName,dms_TradingName_List))","v":"Long rural"}]
[null,null,{"$f":"IF((INDEX(dms_FeederName_5,MATCH(dms_TradingName,dms_TradingName_List))=0),\"\",(INDEX(dms_FeederName_5,MATCH(dms_TradingName,dms_TradingName_List))))","v":"  "}]
[null,null,"Whole Network"]
[null,"Total momentary interruptions after removing excluded events",{"$f":"INDEX(dms_FeederName_1,MATCH(dms_TradingName,dms_TradingName_List))","v":"CBD"}]
[null,null,{"$f":"INDEX(dms_FeederName_2,MATCH(dms_TradingName,dms_TradingName_List))","v":"Urban"}]
[null,null,{"$f":"INDEX(dms_FeederName_3,MATCH(dms_TradingName,dms_TradingName_List))","v":"Short rural"}]
[null,null,{"$f":"INDEX(dms_FeederName_4,MATCH(dms_TradingName,dms_TradingName_List))","v":"Long rural"}]
[null,null,{"$f":"IF((INDEX(dms_FeederName_5,MATCH(dms_TradingName,dms_TradingName_List))=0),\"\",(INDEX(dms_FeederName_5,MATCH(dms_TradingName,dms_TradingName_List))))","v":"  "}]
[null,null,"Whole Network"]
[]
[]
[null,"6.2.4 - DISTRIBUTION CUSTOMER NUMBERS"]
[null,null,null,{"$f":"CRY","v":"2017-18"}]
[null,"Customer numbers at the start of the period",{"$f":"INDEX(dms_FeederName_1,MATCH(dms_TradingName,dms_TradingName_List))","v":"CBD"},5231]
[null,null,{"$f":"INDEX(dms_FeederName_2,MATCH(dms_TradingName,dms_TradingName_List))","v":"Urban"},618869]
[null,null,{"$f":"INDEX(dms_FeederName_3,MATCH(dms_TradingName,dms_TradingName_List))","v":"Short rural"},125407]
[null,null,{"$f":"INDEX(dms_FeederName_4,MATCH(dms_TradingName,dms_TradingName_List))","v":"Long rural"},142278]
[null,null,{"$f":"IF((INDEX(dms_FeederName_5,MATCH(dms_TradingName,dms_TradingName_List))=0),\"\",(INDEX(dms_FeederName_5,MATCH(dms_TradingName,dms_TradingName_List))))","v":"  "}]
[null,null,"Whole Network",891785]
[null,"Customer numbers at the end of the period",{"$f":"INDEX(dms_FeederName_1,MATCH(dms_TradingName,dms_TradingName_List))","v":"CBD"},5123]
[null,null,{"$f":"INDEX(dms_FeederName_2,MATCH(dms_TradingName,dms_TradingName_List))","v":"Urban"},622795]
[null,null,{"$f":"INDEX(dms_FeederName_3,MATCH(dms_TradingName,dms_TradingName_List))","v":"Short rural"},126456]
[null,null,{"$f":"INDEX(dms_FeederName_4,MATCH(dms_TradingName,dms_TradingName_List))","v":"Long rural"},142633]
[null,null,{"$f":"IF((INDEX(dms_FeederName_5,MATCH(dms_TradingName,dms_TradingName_List))=0),\"\",(INDEX(dms_FeederName_5,MATCH(dms_TradingName,dms_TradingName_List))))","v":"  "}]
[null,null,"Whole Network",897007]
[null,"Average customer numbers",{"$f":"INDEX(dms_FeederName_1,MATCH(dms_TradingName,dms_TradingName_List))","v":"CBD"},{"$f":"IFERROR(ROUND(AVERAGE(D77,D83),0),\"\")","v":5177}]
[null,null,{"$f":"INDEX(dms_FeederName_2,MATCH(dms_TradingName,dms_TradingName_List))","v":"Urban"},{"$f":"IFERROR(ROUND(AVERAGE(D78,D84),0),\"\")","v":620832}]
[null,null,{"$f":"INDEX(dms_FeederName_3,MATCH(dms_TradingName,dms_TradingName_List))","v":"Short rural"},{"$f":"IFERROR(ROUND(AVERAGE(D79,D85),0),\"\")","v":125932}]
[null,null,{"$f":"INDEX(dms_FeederName_4,MATCH(dms_TradingName,dms_TradingName_List))","v":"Long rural"},{"$f":"IFERROR(ROUND(AVERAGE(D80,D86),0),\"\")","v":142456}]
[null,null,{"$f":"IF((INDEX(dms_FeederName_5,MATCH(dms_TradingName,dms_TradingName_List))=0),\"\",(INDEX(dms_FeederName_5,MATCH(dms_TradingName,dms_TradingName_List))))","v":"  "}]
[null,null,"Whole Network",{"$f":"IFERROR(ROUND(AVERAGE(D82,D88),0),\"\")","v":894396}]

{"sheet":"6.6 STPIS Customer Service","index":11,"n_rows":12,"n_cols":4,"rows_kept":12,"cut":false,"hidden":false,"merged":[]}
[null,{"$f":"IF(dms_DataQuality=\"backcast\",INDEX(dms_Worksheet_List,MATCH(dms_Model,dms_Model_List))&\" BACKCAST\",INDEX(dms_Worksheet_List,MATCH(dms_Model,dms_Model_List)))","v":"ANNUAL REPORTING STATEMENT"}]
[null,{"$f":"INDEX(dms_TradingNameFull_List,MATCH(dms_TradingName,dms_TradingName_List))","v":"SA Power Networks"}]
[null,{"$f":"CONCATENATE(\"Annual Reporting RIN Response \",IF(SUM(dms_SingleYear_Model)>0,CONCATENATE(CRY),CONCATENATE(FRCP_y1,\" to \",dms_MultiYear_FinalYear_Result)))","v":"Annual Reporting RIN Response 2017-18"}]
[null,"6.6 STPIS CUSTOMER SERVICE"]
[]
[]
[null,"6.6.1 - TELEPHONE ANSWERING"]
[null,null,"Number of calls \nafter removing excluded events","Total number of calls"]
[null,null,{"$f":"CRY","v":"2017-18"},{"$f":"CRY","v":"2017-18"}]
[null,"Number of calls received",100331,218016]
[null,"Number of calls answered within 30 seconds",80026]
[null,"Percentage of calls answered within 30 seconds",{"$f":"IFERROR(C11/C10,\"\")","v":0.79761987820314761}]

{"sheet":"6.7 STPIS Daily Performance","index":12,"n_rows":380,"n_cols":16,"rows_kept":380,"cut":false,"hidden":false,"merged":[[12,14,12,15],[12,3,13,3],[6,1,6,5],[8,1,8,6],[12,4,12,5],[12,6,12,7],[12,10,12,11],[12,8,12,9],[12,12,12,13],[11,1,13,1],[11,2,11,3],[12,2,13,2],[11,4,11,13]]}
[null,{"$f":"IF(dms_DataQuality=\"backcast\",INDEX(dms_Worksheet_List,MATCH(dms_Model,dms_Model_List))&\" BACKCAST\",INDEX(dms_Worksheet_List,MATCH(dms_Model,dms_Model_List)))","v":"ANNUAL REPORTING STATEMENT"},null,null,null,null,null,null,"1-Jul-2016"]
[null,{"$f":"INDEX(dms_TradingNameFull_List,MATCH(dms_TradingName,dms_TradingName_List))","v":"SA Power Networks"}]
[null,{"$f":"CONCATENATE(\"Annual Reporting RIN Response \",IF(SUM(dms_SingleYear_Model)>0,CONCATENATE(CRY),CONCATENATE(FRCP_y1,\" to \",dms_MultiYear_FinalYear_Result)))","v":"Annual Reporting RIN Response 2017-18"}]
[null,"6.7 STPIS DAILY PERFORMANCE"]
[]
[]
[null,"Did the MAIFI parameter of the STPIS apply during the period?\nThis flag is set from the response on worksheet 3.6.8 Network feeders",null,null,null,null,{"$f":"dms_MAIFI_Flag","v":"No"}]
[]
[null,"The excluded events to be removed from the data refer only to events listed in clause 3.3(a) of the STPIS, with respect to reliability data, and in clause 5.4 of the STPIS with respect to customer service parameters.\n\n*Customer service information must be reported as per the definitions in the STPIS, that is excluding: \n   • calls to payment lines and automated interactive services \n   • calls abandoned by the customer within 30 seconds of the call being queued for response by a human operator (where the time in which a telephone call is abandoned is not measured, then an estimate of the number of calls abandoned within 30 seconds will be determined by taking 20 per cent of all calls abadoned)."]
[]
[null,"6.7.1 - DAILY PERFORMANCE DATA - UNPLANNED"]
[null,"Date","Customer service*",null,"MAIFI"]
[null,null,"Number of calls received\n(after removing excluded events)","Number of calls answered in 30 seconds\n(after removing excluded events)",{"$f":"INDEX(dms_FeederName_1,MATCH(dms_TradingName,dms_TradingName_List))","v":"CBD"},null,{"$f":"INDEX(dms_FeederName_2,MATCH(dms_TradingName,dms_TradingName_List))","v":"Urban"},null,{"$f":"INDEX(dms_FeederName_3,MATCH(dms_TradingName,dms_TradingName_List))","v":"Short rural"},null,{"$f":"INDEX(dms_FeederName_4,MATCH(dms_TradingName,dms_TradingName_List))","v":"Long rural"},null,{"$f":"IF((INDEX(dms_FeederName_5,MATCH(dms_TradingName,dms_TradingName_List))=0),\"Network\",(INDEX(dms_FeederName_5,MATCH(dms_TradingName,dms_TradingName_List))))","v":"  "},null,"Network"]
[null,null,null,null,"All events","After removing excluded events","All events","After removing excluded events","All events","After removing excluded events","All events","After removing excluded events","All events","After removing excluded events","All events","After removing excluded events"]
[null,{"$f":"dms_060701_StartDateTxt","v":"1-Jul-2017"},194,146]
[null,{"$f":"B15+1","v":"2017-07-02"},81,66]
[null,"2017-07-03",385,312]
[null,"2017-07-04",324,251]
[null,"2017-07-05",370,308]
[null,"2017-07-06",289,208]
[null,"2017-07-07",286,226]
[null,"2017-07-08",215,141]
[null,"2017-07-09",101,85]
[null,"2017-07-10",292,241]
[null,"2017-07-11",309,237]
[null,"2017-07-12",243,213]
[null,"2017-07-13",233,199]
[null,"2017-07-14",304,225]
[null,"2017-07-15",245,175]
[null,"2017-07-16",127,110]
[null,"2017-07-17",359,276]
[null,"2017-07-18",411,272]
[null,"2017-07-19",316,261]
[null,"2017-07-20",252,216]
[null,"2017-07-21",277,230]
[null,"2017-07-22",183,147]
[null,"2017-07-23",121,112]
[null,"2017-07-24",261,230]
[null,"2017-07-25",213,120]
[null,"2017-07-26",213,149]
[null,"2017-07-27",304,214]
[null,"2017-07-28",228,191]
[null,"2017-07-29",354,212]
[null,"2017-07-30",136,120]
[null,"2017-07-31",351,269]
[null,"2017-08-01",242,176]
[null,"2017-08-02",247,161]
[null,"2017-08-03",306,206]
[null,"2017-08-04",770,241]
[null,"2017-08-05",249,197]
[null,"2017-08-06",406,290]
[null,"2017-08-07",834,395]
[null,"2017-08-08",272,223]
[null,"2017-08-09",272,189]
[null,"2017-08-10",317,226]
[null,"2017-08-11",225,158]
[null,"2017-08-12",112,83]
[null,"2017-08-13",130,103]
[null,"2017-08-14",232,160]
[null,"2017-08-15",330,203]
[null,"2017-08-16",226,168]
[null,"2017-08-17",453,312]
[null,"2017-08-18",333,207]
[null,"2017-08-19",213,190]
[null,"2017-08-20",237,198]
[null,"2017-08-21",363,263]
[null,"2017-08-22",283,180]
[null,"2017-08-23",294,225]
[null,"2017-08-24",276,250]
[null,"2017-08-25",240,183]
[null,"2017-08-26",155,130]
[null,"2017-08-27",159,134]
[null,"2017-08-28",346,213]
[null,"2017-08-29",247,185]
[null,"2017-08-30",259,171]
[null,"2017-08-31",195,160]
[null,"2017-09-01",223,181]
[null,"2017-09-02",234,196]
[null,"2017-09-03",338,276]
[null,{"$f":"B79+1","v":"2017-09-04"},688,426]
[null,"2017-09-05",508,282]
[null,"2017-09-06",279,172]
[null,"2017-09-07",271,190]
[null,"2017-09-08",210,122]
[null,"2017-09-09",181,153]
[null,"2017-09-10",110,94]
[null,"2017-09-11",287,196]
[null,"2017-09-12",260,174]
[null,"2017-09-13",367,225]
[null,"2017-09-14",220,177]
[null,"2017-09-15",329,185]
[null,"2017-09-16",154,142]
[null,"2017-09-17",77,68]
[null,"2017-09-18",361,266]
[null,"2017-09-19",287,266]
[null,"2017-09-20",305,218]
[null,"2017-09-21",207,175]
[null,"2017-09-22",219,170]
[null,"2017-09-23",228,177]
[null,"2017-09-24",158,139]
[null,"2017-09-25",226,167]
[null,"2017-09-26",225,151]
[null,"2017-09-27",197,186]
[null,"2017-09-28",202,158]
[null,"2017-09-29",256,227]
[null,"2017-09-30",201,195]
[null,"2017-10-01",83,82]
[null,"2017-10-02",55,45]
[null,"2017-10-03",255,179]
[null,"2017-10-04",253,199]
[null,"2017-10-05",180,142]
[null,"2017-10-06",241,165]
[null,"2017-10-07",196,152]
[null,"2017-10-08",65,58]
[null,"2017-10-09",212,145]
[null,"2017-10-10",269,213]
[null,"2017-10-11",337,288]
[null,"2017-10-12",204,175]
[null,"2017-10-13",228,213]
[null,"2017-10-14",117,89]
[null,"2017-10-15",91,87]
[null,"2017-10-16",314,289]
[null,"2017-10-17",304,243]
[null,"2017-10-18",342,302]
[null,"2017-10-19",186,154]
[null,"2017-10-20",196,179]
[null,"2017-10-21",248,211]
[null,"2017-10-22",117,112]
[null,"2017-10-23",294,256]
[null,"2017-10-24",259,220]
[null,"2017-10-25",556,475]
[null,"2017-10-26",282,261]
[null,"2017-10-27",316,275]
[null,"2017-10-28",198,158]
[null,"2017-10-29",460,280]
[null,"2017-10-30",522,373]
[null,"2017-10-31",252,225]
[null,"2017-11-01",308,263]
[null,"2017-11-02",202,176]
[null,"2017-11-03",210,191]
[null,"2017-11-04",195,178]
[null,"2017-11-05",206,181]
[null,"2017-11-06",308,283]
[null,{"$f":"B143+1","v":"2017-11-07"},290,279]
[null,"2017-11-08",216,190]
[null,"2017-11-09",216,213]
[null,"2017-11-10",385,319]
[null,"2017-11-11",130,110]
[null,"2017-11-12",95,92]
[null,"2017-11-13",332,294]
[null,"2017-11-14",674,347]
[null,"2017-11-15",701,583]
[null,"2017-11-16",297,203]
[null,"2017-11-17",320,291]
[null,"2017-11-18",152,114]
[null,"2017-11-19",148,111]
[null,"2017-11-20",949,675]
[null,"2017-11-21",392,348]
[null,"2017-11-22",462,405]
[null,"2017-11-23",686,556]
[null,"2017-11-24",325,294]
[null,"2017-11-25",177,161]
[null,"2017-11-26",106,88]
[null,"2017-11-27",253,220]
[null,"2017-11-28",332,314]
[null,"2017-11-29",541,424]
[null,"2017-11-30",887,500]
[null,"2017-12-01",700,548]
[null,"2017-12-02",153,134]
[null,"2017-12-03",94,85]
[null,"2017-12-04",238,214]
[null,"2017-12-05",295,231]
[null,"2017-12-06",226,202]
[null,"2017-12-07",293,243]
[null,"2017-12-08",243,201]
[null,"2017-12-09",182,138]
[null,"2017-12-10",130,125]
[null,"2017-12-11",279,226]
[null,"2017-12-12",316,275]
[null,"2017-12-13",311,258]
[null,"2017-12-14",302,245]
[null,"2017-12-15",286,260]
[null,"2017-12-16",183,158]
[null,"2017-12-17",100,97]
[null,"2017-12-18",429,314]
[null,"2017-12-19",398,294]
[null,"2017-12-20",267,216]
[null,"2017-12-21",202,179]
[null,"2017-12-22",156,141]
[null,"2017-12-23",215,141]
[null,"2017-12-24",213,181]
[null,"2017-12-25",85,83]
[null,"2017-12-26",88,87]
[null,"2017-12-27",297,242]
[null,"2017-12-28",213,205]
[null,"2017-12-29",166,157]
[null,"2017-12-30",92,89]
[null,"2017-12-31",101,98]
[null,"2018-01-01",92,91]
[null,"2018-01-02",212,197]
[null,"2018-01-03",238,224]
[null,"2018-01-04",268,250]
[null,"2018-01-05",401,313]
[null,"2018-01-06",274,205]
[null,"2018-01-07",104,101]
[null,"2018-01-08",252,221]
[null,"2018-01-09",226,212]
[null,{"$f":"B207+1","v":"2018-01-10"},226,215]
[null,"2018-01-11",256,222]
[null,"2018-01-12",326,299]
[null,"2018-01-13",172,137]
[null,"2018-01-14",182,161]
[null,"2018-01-15",385,327]
[null,"2018-01-16",255,219]
[null,"2018-01-17",361,294]
[null,"2018-01-18",615,443]
[null,"2018-01-19",655,417]
[null,"2018-01-20",302,264]
[null,"2018-01-21",281,246]
[null,"2018-01-22",551,399]
[null,"2018-01-23",319,261]
[null,"2018-01-24",318,281]
[null,"2018-01-25",218,195]
[null,"2018-01-26",233,196]
[null,"2018-01-27",218,154]
[null,"2018-01-28",247,153]
[null,"2018-01-29",369,317]
[null,"2018-01-30",339,250]
[null,"2018-01-31",268,254]
[null,"2018-02-01",333,246]
[null,"2018-02-02",312,258]
[null,"2018-02-03",215,164]
[null,"2018-02-04",108,100]
[null,"2018-02-05",368,321]
[null,"2018-02-06",326,301]
[null,"2018-02-07",342,277]
[null,"2018-02-08",302,220]
[null,"2018-02-09",428,334]
[null,"2018-02-10",195,149]
[null,"2018-02-11",107,94]
[null,"2018-02-12",311,281]
[null,"2018-02-13",296,270]
[null,"2018-02-14",379,343]
[null,"2018-02-15",284,245]
[null,"2018-02-16",235,211]
[null,"2018-02-17",161,134]
[null,"2018-02-18",292,259]
[null,"2018-02-19",311,281]
[null,"2018-02-20",293,259]
[null,"2018-02-21",334,293]
[null,"2018-02-22",468,330]
[null,"2018-02-23",594,494]
[null,"2018-02-24",259,192]
[null,"2018-02-25",95,85]
[null,"2018-02-26",304,272]
[null,"2018-02-27",302,263]
[null,"2018-02-28",258,235]
[null,"2018-03-01",243,204]
[null,"2018-03-02",273,237]
[null,"2018-03-03",209,191]
[null,"2018-03-04",111,103]
[null,"2018-03-05",257,208]
[null,"2018-03-06",222,181]
[null,"2018-03-07",325,267]
[null,"2018-03-08",290,273]
[null,"2018-03-09",340,254]
[null,"2018-03-10",250,159]
[null,"2018-03-11",130,121]
[null,"2018-03-12",62,62]
[null,"2018-03-13",257,189]
[null,"2018-03-14",318,261]
[null,{"$f":"B271+1","v":"2018-03-15"},254,203]
[null,"2018-03-16",293,248]
[null,"2018-03-17",231,203]
[null,"2018-03-18",238,164]
[null,"2018-03-19",280,230]
[null,"2018-03-20",364,287]
[null,"2018-03-21",220,198]
[null,"2018-03-22",219,167]
[null,"2018-03-23",256,210]
[null,"2018-03-24",233,172]
[null,"2018-03-25",263,192]
[null,"2018-03-26",312,257]
[null,"2018-03-27",351,263]
[null,"2018-03-28",256,187]
[null,"2018-03-29",257,199]
[null,"2018-03-30",151,149]
[null,"2018-03-31",68,65]
[null,"2018-04-01",68,62]
[null,"2018-04-02",78,77]
[null,"2018-04-03",264,203]
[null,"2018-04-04",282,201]
[null,"2018-04-05",292,235]
[null,"2018-04-06",249,221]
[null,"2018-04-07",140,126]
[null,"2018-04-08",85,80]
[null,"2018-04-09",309,252]
[null,"2018-04-10",286,218]
[null,"2018-04-11",558,443]
[null,"2018-04-12",272,257]
[null,"2018-04-13",518,440]
[null,"2018-04-14",750,579]
[null,"2018-04-15",280,242]
[null,"2018-04-16",385,311]
[null,"2018-04-17",304,281]
[null,"2018-04-18",288,261]
[null,"2018-04-19",407,369]
[null,"2018-04-20",297,271]
[null,"2018-04-21",298,237]
[null,"2018-04-22",119,104]
[null,"2018-04-23",396,299]
[null,"2018-04-24",436,357]
[null,"2018-04-25",125,121]
[null,"2018-04-26",239,212]
[null,"2018-04-27",235,202]
[null,"2018-04-28",128,118]
[null,"2018-04-29",94,82]
[null,"2018-04-30",245,221]
[null,"2018-05-01",321,284]
[null,"2018-05-02",271,230]
[null,"2018-05-03",521,396]
[null,"2018-05-04",389,323]
[null,"2018-05-05",171,143]
[null,"2018-05-06",95,92]
[null,"2018-05-07",303,258]
[null,"2018-05-08",235,210]
[null,"2018-05-09",308,270]
[null,"2018-05-10",406,300]
[null,"2018-05-11",315,245]
[null,"2018-05-12",152,122]
[null,"2018-05-13",93,85]
[null,"2018-05-14",340,295]
[null,"2018-05-15",251,224]
[null,"2018-05-16",249,195]
[null,"2018-05-17",315,265]
[null,{"$f":"B335+1","v":"2018-05-18"},375,301]
[null,"2018-05-19",182,168]
[null,"2018-05-20",119,113]
[null,"2018-05-21",290,230]
[null,"2018-05-22",263,201]
[null,"2018-05-23",218,186]
[null,"2018-05-24",244,216]
[null,"2018-05-25",205,164]
[null,"2018-05-26",115,111]
[null,"2018-05-27",73,70]
[null,"2018-05-28",398,249]
[null,"2018-05-29",405,303]
[null,"2018-05-30",277,211]
[null,"2018-05-31",246,223]
[null,"2018-06-01",308,230]
[null,"2018-06-02",202,156]
[null,"2018-06-03",98,87]
[null,"2018-06-04",312,220]
[null,"2018-06-05",277,222]
[null,"2018-06-06",288,207]
[null,"2018-06-07",241,220]
[null,"2018-06-08",291,274]
[null,"2018-06-09",177,118]
[null,"2018-06-10",81,75]
[null,"2018-06-11",172,169]
[null,"2018-06-12",352,303]
[null,"2018-06-13",307,258]
[null,"2018-06-14",548,389]
[null,"2018-06-15",497,338]
[null,"2018-06-16",254,228]
[null,"2018-06-17",157,125]
[null,"2018-06-18",338,287]
[null,"2018-06-19",353,311]
[null,"2018-06-20",292,274]
[null,"2018-06-21",213,195]
[null,"2018-06-22",273,254]
[null,"2018-06-23",236,141]
[null,"2018-06-24",154,145]
[null,"2018-06-25",427,350]
[null,"2018-06-26",357,280]
[null,"2018-06-27",420,340]
[null,"2018-06-28",368,311]
[null,"2018-06-29",285,266]
[null,"2018-06-30",185,144]
[null,"2018-07-01"]

{"sheet":"6.8 STPIS Exclusions","index":13,"n_rows":403,"n_cols":12,"rows_kept":403,"cut":false,"hidden":false,"merged":[[9,11,10,11],[6,1,6,4],[9,6,9,8],[9,5,10,5],[9,4,10,4],[9,2,10,2],[9,3,10,3]]}
[null,{"$f":"IF(dms_DataQuality=\"backcast\",INDEX(dms_Worksheet_List,MATCH(dms_Model,dms_Model_List))&\" BACKCAST\",INDEX(dms_Worksheet_List,MATCH(dms_Model,dms_Model_List)))","v":"ANNUAL REPORTING STATEMENT"}]
[null,{"$f":"INDEX(dms_TradingNameFull_List,MATCH(dms_TradingName,dms_TradingName_List))","v":"SA Power Networks"}]
[null,{"$f":"CONCATENATE(\"Annual Reporting RIN Response \",IF(SUM(dms_SingleYear_Model)>0,CONCATENATE(CRY),CONCATENATE(FRCP_y1,\" to \",dms_MultiYear_FinalYear_Result)))","v":"Annual Reporting RIN Response 2017-18"}]
[null,"6.8 STPIS EXCLUSIONS"]
[]
[]
[null,"This information is collected to inform the application of the STPIS to Australian Distribution Co. in future regulatory periods. The information is also collected to monitor network performance, and may be used in performance reports."]
[]
[null,"6.8.1 - STPIS EXCLUSIONS"]
[null,"Date of event","Outage ID","Feeder ID / name","Feeder classification\n(drop down)","Cause of event\n(drop down)","Unplanned",null,null,"Event category","Effect on unplanned MAIFI","Please provide separate explanation to confirm the outage was not due to inadequate transmission connection planning "]
[null,"DD/MM/YYYY",null,null,null,null,"Number of  interruptions","Duration of interruption\n(mins)","Total unplanned minutes off supply","Use exclusion categories listed in section 3.3(a) of the STPIS\n(drop down)","by feeder classification"]
[null,"2017-08-01","5802183107177","SSD442","Short rural","Transmission failure",1,4,168,5,"N/A"]
[null,"2017-08-15","2735171408171","SSD443","Short rural","Transmission failure",1,3,144,5,"N/A"]
[null,"2017-09-08","0456140809171","HH428D","Urban","Other",1,105,7980,7,"N/A"]
[null,"2017-09-15","3034181509170","SSD339","Urban","Transmission failure",1,13,78793,5,"N/A"]
[null,"2017-09-15","3034181509170","SSD339","Short rural","Transmission failure",1,13,39286,5,"N/A"]
[null,"2017-09-15","3034181509170","SSD339","Long rural","Transmission failure",1,13,44551,5,"N/A"]
[null,"2017-10-29","1112122810176","SSD742","Short rural","Transmission failure",1,463,988042,5,"N/A"]
[null,"2017-10-29","1112122810176","SSD742","Long rural","Transmission failure",1,463,3285448,5,"N/A"]
[null,"2017-11-14","0050171411175","SSD310","Long rural","Transmission failure",1,144,10224,5,"N/A"]
[null,"2017-11-23","2405012311173","SSD262","Urban","Transmission failure",1,30,336855,5,"N/A"]
[null,"2017-11-23","2405012311173","SSD262","Long rural","Transmission failure",1,30,61582,5,"N/A"]
[null,"2018-01-25","3714122501187","GA19","Long rural","Other",1,9854,19708,7,"N/A"]
[null,"2018-06-15","4222141506184","SSD457","Short rural","Transmission failure",1,15,46875,5,"N/A"]
[null,"2018-06-15","4222141506184","SSD457","Long rural","Transmission failure",1,15,101985,5,"N/A"]
[null,"2018-06-28","4832132806187","R17","Long rural","Other",1,1434,1434,7,"N/A"]
[]
[]
[]
[]
[]
[]
[]
[]
[]
[]
[]
[]
[]
[]
[]
[]
[]
[]
[]
[]
[]
[]
[]
[]
[]
[]
[]
[]
[]
[]
[]
[]
[]
[]
[]
[]
[]
[]
[]
[]
[]
[]
[]
[]
[]
[]
[]
[]
[]
[]
[]
[]
[]
[]
[]
[]
[]
[]
[]
[]
[]
[]
[]
[]
[]
[]
[]
[]
[]
[]
[]
[]
[]
[]
[]
[]
[]
[]
[]
[]
[]
[]
[]
[]
[]
[]
[]
[]
[]
[]
[]
[]
[]
[]
[]
[]
[]
[]
[]
[]
[]
[]
[]
[]
[]
[]
[]
[]
[]
[]
[]
[]
[]
[]
[]
[]
[]
[]
[]
[]
[]
[]
[]
[]
[]
[]
[]
[]
[]
[]
[]
[]
[]
[]
[]
[]
[]
[]
[]
[]
[]
[]
[]
[]
[]
[]
[]
[]
[]
[]
[]
[]
[]
[]
[]
[]
[]
[]
[]
[]
[]
[]
[]
[]
[]
[]
[]
[]
[]
[]
[]
[]
[]
[]
[]
[]
[]
[]
[]
[]
[]
[]
[]
[]
[]
[]
[]
[]
[]
[]
[]
[]
[]
[]
[]
[]
[]
[]
[]
[]
[]
[]
[]
[]
[]
[]
[]
[]
[]
[]
[]
[]
[]
[]
[]
[]
[]
[]
[]
[]
[]
[]
[]
[]
[]
[]
[]
[]
[]
[]
[]
[]
[]
[]
[]
[]
[]
[]
[]
[]
[]
[]
[]
[]
[]
[]
[]
[]
[]
[]
[]
[]
[]
[]
[]
[]
[]
[]
[]
[]
[]
[]
[]
[]
[]
[]
[]
[]
[]
[]
[]
[]
[]
[]
[]
[]
[]
[]
[]
[]
[]
[]
[]
[]
[]
[]
[]
[]
[]
[]
[]
[]
[]
[]
[]
[]
[]
[]
[]
[]
[]
[]
[]
[]
[]
[]
[]
[]
[]
[]
[]
[]
[]
[]
[]
[]
[]
[]
[]
[]
[]
[]
[]
[]
[]
[]
[]
[]
[]
[]
[]
[]
[]
[]
[]
[]
[]
[]
[]
[]
[]
[]
[]
[]
[]
[]
[]
[]
[]
[]
[]
[]
[]
[]
[]
[]
[]
[]
[]
[]
[]
[]
[]
[]
[]
[]
[]
[]
[]
[]
[]
[]
[]
[]
[]
[]
[null,"To enter further events - please insert new lines above this line. "]

{"sheet":"6.9 STPIS - GSL","index":14,"n_rows":114,"n_cols":5,"rows_kept":114,"cut":false,"hidden":false,"merged":[[63,1,63,2],[64,1,64,2],[65,1,65,2],[71,1,71,2],[70,1,70,2],[69,1,69,2],[17,1,17,2],[15,1,15,2],[5,1,5,2],[7,1,7,2],[14,1,14,2],[16,1,16,2],[21,1,21,2],[23,1,23,2],[24,1,24,2],[25,1,25,2],[22,1,22,2],[33,1,33,2],[34,1,34,2],[30,1,30,2],[31,1,31,2],[32,1,32,2],[98,1,98,2],[48,1,48,2],[53,1,53,2],[83,1,83,2],[82,1,82,2],[89,1,89,2],[57,1,57,2],[58,1,58,2],[59,1,59,2],[62,1,62,4],[68,1,68,4],[74,1,74,4],[80,1,80,4],[77,1,77,2],[76,1,76,2],[75,1,75,2],[113,1,113,2],[81,1,81,2],[110,1,110,2],[112,1,112,2],[105,1,105,2],[106,1,106,2],[107,1,107,2],[108,1,108,2],[100,1,100,2],[101,1,101,2],[102,1,102,2],[103,1,103,2],[104,1,104,2],[95,1,95,2],[96,1,96,2],[97,1,97,2],[49,1,49,2],[50,1,50,2],[51,1,51,2],[52,1,52,2],[5,4,5,5],[43,1,43,2],[45,1,45,2],[46,1,46,2],[47,1,47,2],[44,1,44,2],[35,1,35,2],[36,1,36,2],[37,1,37,2],[38,1,38,2],[39,1,39,2],[29,1,29,2]]}
[null,{"$f":"IF(dms_DataQuality=\"backcast\",INDEX(dms_Worksheet_List,MATCH(dms_Model,dms_Model_List))&\" BACKCAST\",INDEX(dms_Worksheet_List,MATCH(dms_Model,dms_Model_List)))","v":"ANNUAL REPORTING STATEMENT"}]
[null,{"$f":"INDEX(dms_TradingNameFull_List,MATCH(dms_TradingName,dms_TradingName_List))","v":"SA Power Networks"}]
[null,{"$f":"CONCATENATE(\"Annual Reporting RIN Response \",IF(SUM(dms_SingleYear_Model)>0,CONCATENATE(CRY),CONCATENATE(FRCP_y1,\" to \",dms_MultiYear_FinalYear_Result)))","v":"Annual Reporting RIN Response 2017-18"}]
[null,"6.9 STPIS - GUARANTEED SERVICE LEVEL"]
[]
[null,"Did the AER's GSL Scheme apply at any time during the regulatory year?",null,"No","**IMPORTANT \nPlease ensure this flag is set. Conditional formatting on this worksheet is dependant on this response."]
[]
[null,"Instructions:\nTable 6.9.1 collects information relating to jurisdiction GSL scheme parameters. These parameters can be found in the jurisdictonal scheme relevant to NSP. Please identify each parameter in the relevant sub-tables and provide the volume and value of GSL payments. \n\nFor GSL parameters that do not fit within the provided sub-tables provided, please enter a heading and identify the relevant parameter(s). "]
[]
[null,"6.9.1 - GUARANTEED SERVICE LEVELS - JURISDICTIONAL GSL SCHEME"]
[null,null,null,{"$f":"CRY","v":"2017-18"},{"$f":"CRY","v":"2017-18"}]
[null,null,null,"Volume","Value of GSL payments"]
[null,null,null,"0's","$0's"]
[null,"Appointments"]
[null,"Number of appointments for period",null,29729]
[null,"Number of appointments where more than 15 minutes late",null,2,50]
[]
[]
[null,"To enter further GSL parameters relating to appointments - please copy a row from above and \"insert copied cells\" above this row."]
[]
[null,"Connections"]
[null,"Total number of new supply addresses connected",null,11789]
[null,"Number where connection not made on date agreed or within 6 business days",null,215,60975]
[]
[]
[]
[null,"To enter further GSL parameters relating to connections -  please copy a row from above and \"insert copied cells\" above this row."]
[]
[null,"Reliability of supply"]
[null,"Long Duration Interruptions:"]
[null,"   - Long Duration interruption greater than 12 hours & no more than 15 hours",null,2898,289750]
[null,"   - Long Duration interruption greater than 15 hours & no more than 18 hours",null,2211,331590]
[null,"   - Long Duration interruption greater than 18 hours & no more than 24 hours",null,1117,223355]
[null,"   - Long Duration interruption greater than 24 hours & no more than 48 hours",null,460,186265]
[null,"   - Long Duration interruption greater than 48 hours",null,68,41140]
[null,"Frequency of Interruptions (1 July to 30 June):"]
[null,"   - Number of interruptions p.a. more than 9 & no more than 12",null,525,52500]
[null,"   - Number of interruptions p.a. more than 12 & no more than 15",null,19,2850]
[null,"   - Number of interruptions p.a. more than 15",null,0,0]
[]
[null,"To enter further GSL parameters relating to reliability of supply -  please copy a row from above and \"insert copied cells\" above this row."]
[]
[null,"Street lights"]
[null,"Metropolitan Areas:"]
[null,"   - Number of street lights",null,172128]
[null,"   - Number of street light \"outs\" during period",null,26589]
[null,"   - Average number of business days to repair",null,4.55]
[null,"   - Number of street lights not repaired within 5 business days",null,1022,154585]
[null,"Country Areas:"]
[null,"   - Number of street lights",null,44317]
[null,"   - Number of street light \"outs\" during period",null,4356]
[null,"   - Average number of business days to repair",null,3.39]
[null,"   - Number of street lights not repaired within 10 business days",null,23,1950]
[]
[null,"To enter further GSL parameters relating to street lights -  please copy a row from above and \"insert copied cells\" above this row."]
[]
[null,"Planned interruptions"]
[null,"N/A"]
[]
[]
[null,"To enter further GSL parameters relating to planned interruptions -  please copy a row from above and \"insert copied cells\" above this row."]
[]
[null,"<NSP defined parameter category>"]
[]
[]
[]
[null,"To enter further GSL parameters - please identify the parameter and if insufficient rows  please copy a row from above and \"insert copied cells\" above this row."]
[]
[null,"<NSP defined parameter category>"]
[]
[]
[]
[null,"To enter further GSL parameters - please identify the parameter and if insufficient rows  please copy a row from above and \"insert copied cells\" above this row."]
[]
[null,"<NSP defined parameter category>"]
[]
[]
[]
[null,"To enter further GSL parameters - please identify the parameter and if insufficient rows  please copy a row from above and \"insert copied cells\" above this row."]
[]
[null,"<NSP defined parameter category>"]
[]
[]
[]
[null,"To enter further GSL parameters - please identify the parameter and if insufficient rows  please copy a row from above and \"insert copied cells\" above this row."]
[]
[]
[null,"6.9.2 - GUARANTEED SERVICE LEVELS - AER GSL SCHEME"]
[]
[null,"Complete Table 6.9.2 if the AER's GSL scheme applied at any time during the regulatory year. \n\nDo not complete Table 6.9.2 if the AER's GSL scheme did not apply during the regulatory year."]
[]
[null,null,null,{"$f":"CRY","v":"2017-18"},{"$f":"CRY","v":"2017-18"}]
[null,null,null,"Volume","Value \nof GSL payments"]
[null,null,null,"0's","$0's"]
[null,"New connections "]
[null,"Number of connections made"]
[null,"Number of connections not made on or before the day agreed"]
[null,"Connections - GSL payments – 1-6 day delay"]
[null,"Connections - GSL payments – 7+ day delay"]
[null,"Reliability of supply"]
[null,"Frequency of interruptions – CBD feeders – 9 interruptions"]
[null,"Frequency of interruptions – Urban feeders – 9 interruptions"]
[null,"Frequency of interruptions – Rural (short and long) feeders – 15 interruptions"]
[null,"Interruptions – CBD feeders – 12 hours duration"]
[null,"Interruptions – Urban feeders – 12 hours duration"]
[null,"Interruptions – Rural (short and long) feeders – 18 hours duration"]
[null,"Total duration of interruptions Level 1 – 20 hours"]
[null,"Total duration of interruptions Level 2 – 30 hours"]
[null,"Total duration of interruptions Level 3 – 60 hours"]
[null,"Street lights"]
[null,"Streetlight repair 5 days – GSL payments"]
[null,"Planned interruptions"]
[null,"Notice of planned interruptions – 4 business days notice not given"]
[null,"Total ",null,null,{"$f":"SUM(E113,E111,E101:E109,E98:E99)","v":0}]

{"sheet":"7.8 Avoided TUOS Payments","index":15,"n_rows":11,"n_cols":3,"rows_kept":11,"cut":false,"hidden":false,"merged":[]}
[null,{"$f":"IF(dms_DataQuality=\"backcast\",INDEX(dms_Worksheet_List,MATCH(dms_Model,dms_Model_List))&\" BACKCAST\",INDEX(dms_Worksheet_List,MATCH(dms_Model,dms_Model_List)))","v":"ANNUAL REPORTING STATEMENT"}]
[null,{"$f":"INDEX(dms_TradingNameFull_List,MATCH(dms_TradingName,dms_TradingName_List))","v":"SA Power Networks"}]
[null,{"$f":"CONCATENATE(\"Annual Reporting RIN Response \",IF(SUM(dms_SingleYear_Model)>0,CONCATENATE(CRY),CONCATENATE(FRCP_y1,\" to \",dms_MultiYear_FinalYear_Result)))","v":"Annual Reporting RIN Response 2017-18"}]
[null,"7.8 - AVOIDED TUOS PAYMENTS"]
[]
[null,"7.8.1 - AVOIDED TUOS PAYMENTS"]
[null,null,"Avoided TUOS Payment "]
[null,null,"$0's, nominal"]
[null,"Embedded generators",0]
[null,"Market network service providers",0]
[null,"Other",0]

{"sheet":"7.10 Juris Scheme","index":16,"n_rows":17,"n_cols":6,"rows_kept":17,"cut":false,"hidden":false,"merged":[[8,4,9,4],[8,3,9,3],[8,2,9,2],[8,1,9,1],[5,1,5,2]]}
[null,{"$f":"IF(dms_DataQuality=\"backcast\",INDEX(dms_Worksheet_List,MATCH(dms_Model,dms_Model_List))&\" BACKCAST\",INDEX(dms_Worksheet_List,MATCH(dms_Model,dms_Model_List)))","v":"ANNUAL REPORTING STATEMENT"}]
[null,{"$f":"INDEX(dms_TradingNameFull_List,MATCH(dms_TradingName,dms_TradingName_List))","v":"SA Power Networks"}]
[null,{"$f":"CONCATENATE(\"Annual Reporting RIN Response \",IF(SUM(dms_SingleYear_Model)>0,CONCATENATE(CRY),CONCATENATE(FRCP_y1,\" to \",dms_MultiYear_FinalYear_Result)))","v":"Annual Reporting RIN Response 2017-18"}]
[null,"7.10 - JURISDICTIONAL SCHEMES"]
[]
[null,"Instructions\nBusiness must list each relevant jurisdictional scheme individually and report information for each scheme separately from other schemes."]
[]
[null,"7.10.1 - JURISDICTIONAL SCHEME PAYMENTS"]
[null,"Jurisdictional Scheme Name","Description","Date DNSP Became Subject to Scheme","Description of Cost Recovery Method","Total Scheme Payments  "]
[null,null,null,null,null,"$0's, nominal"]
[null,"PV Incentive Scheme Payments for export PV - 2028 Scheme","\"44 cent Scheme\"","2008-07-01","Recovered through tariffs as uniform percentage uplift across all customer groups on each component of their DUoS charge.",14603631.560000001]
[null,"PV Incentive Scheme Payments for export PV - 2028S Scheme","\"44 cent Scheme\"","2010-12-01","Recovered through tariffs as uniform percentage uplift across all customer groups on each component of their DUoS charge.",66704349.990000002]
[]
[]
[]
[]
[null,null,null,null,"Total",{"$f":"SUM(F11:F16)","v":81307981.549999997}]

{"sheet":"7.11 DMIS-DMIA","index":17,"n_rows":46,"n_cols":5,"rows_kept":46,"cut":false,"hidden":false,"merged":[[6,2,6,4],[8,2,8,4]]}
[null,{"$f":"IF(dms_DataQuality=\"backcast\",INDEX(dms_Worksheet_List,MATCH(dms_Model,dms_Model_List))&\" BACKCAST\",INDEX(dms_Worksheet_List,MATCH(dms_Model,dms_Model_List)))","v":"ANNUAL REPORTING STATEMENT"}]
[null,{"$f":"INDEX(dms_TradingNameFull_List,MATCH(dms_TradingName,dms_TradingName_List))","v":"SA Power Networks"}]
[null,{"$f":"CONCATENATE(\"Annual Reporting RIN Response \",IF(SUM(dms_SingleYear_Model)>0,CONCATENATE(CRY),CONCATENATE(FRCP_y1,\" to \",dms_MultiYear_FinalYear_Result)))","v":"Annual Reporting RIN Response 2017-18"}]
[null,"7.11 - DEMAND MANAGEMENT INCENTIVE SCHEME"]
[]
[null,"7.11.1 - DMIA - PROJECTS SUBMITTED FOR APPROVAL"]
[null,null,{"$f":"CONCATENATE(\"Total amount of the DMIA spent in \", CRY)","v":"Total amount of the DMIA spent in 2017-18"}]
[null,null,"Operating expenditure","Capital expenditure","Total"]
[null,"Name of project","$0's, nominal"]
[null,"Grid Side Storage",-279589.34999999998,null,{"$f":"SUM(C10:D10)","v":-279589.34999999998}]
[null,"Residential Energy Storage",266178.49,null,266178.49]
[null,null,null,null,0]
[null,null,null,null,0]
[null,null,null,null,0]
[null,null,null,null,0]
[null,null,null,null,{"$f":"SUM(C16:D16)","v":0}]
[null,null,null,null,0]
[null,null,null,null,0]
[null,null,null,null,0]
[null,null,null,null,0]
[null,null,null,null,0]
[null,null,null,null,0]
[null,null,null,null,0]
[null,null,null,null,0]
[null,null,null,null,0]
[null,null,null,null,0]
[null,null,null,null,0]
[null,null,null,null,0]
[null,null,null,null,0]
[null,null,null,null,0]
[null,null,null,null,0]
[null,null,null,null,0]
[null,null,null,null,0]
[null,null,null,null,0]
[null,null,null,null,0]
[null,null,null,null,0]
[null,null,null,null,0]
[null,null,null,null,0]
[null,null,null,null,0]
[null,null,null,null,0]
[null,null,null,null,0]
[null,null,null,null,0]
[null,null,null,null,0]
[null,null,null,null,0]
[null,"To enter additional projects - please copy an existing row and insert above this row. "]
[null,"Total",{"$f":"SUM(C10:C45)","v":-13410.859999999986},{"$f":"SUM(D10:D45)","v":0},{"$f":"SUM(E10:E45)","v":-13410.859999999986}]

{"sheet":"7.12 Safety and Bushfire","index":18,"n_rows":339,"n_cols":7,"rows_kept":339,"cut":false,"hidden":false,"merged":[[137,1,137,2],[138,1,138,2],[296,6,296,7],[297,6,297,7],[84,3,84,4],[85,3,85,4],[163,2,163,3],[164,2,164,3],[213,3,213,4],[214,3,214,4],[139,1,139,2],[140,1,140,2],[141,1,141,2],[142,1,142,2],[143,1,143,2],[144,1,144,2],[145,1,145,2],[117,1,118,2],[212,1,214,1],[212,2,214,2],[162,1,164,1],[128,1,128,2],[129,1,129,2],[130,1,130,2],[131,1,131,2],[132,1,132,2],[133,1,133,2],[134,1,134,2],[135,1,135,2],[136,1,136,2],[119,1,119,2],[120,1,120,2],[121,1,121,2],[122,1,122,2],[123,1,123,2],[124,1,124,2],[125,1,125,2],[126,1,126,2],[127,1,127,2],[41,6,41,8],[38,6,38,8],[39,6,39,8],[279,6,279,7],[280,6,280,7],[303,6,303,7],[304,6,304,7],[287,6,287,7],[288,6,288,7],[289,6,289,7],[290,6,290,7],[291,6,291,7],[292,6,292,7],[293,6,293,7],[294,6,294,7],[295,6,295,7],[298,6,298,7],[299,6,299,7],[300,6,300,7],[301,6,301,7],[302,6,302,7],[281,6,281,7],[282,6,282,7],[283,6,283,7],[29,6,29,8],[30,6,30,8],[31,6,31,8],[23,6,23,8],[24,6,24,8],[25,6,25,8],[26,6,26,8],[27,6,27,8],[40,6,40,8],[37,6,37,8],[5,1,5,2],[25,2,25,5],[26,2,26,5],[27,2,27,5],[28,2,28,5],[29,2,29,5],[30,2,30,5],[42,2,42,5],[31,2,31,5],[32,2,32,5],[14,1,14,4],[13,1,13,4],[33,2,33,5],[24,2,24,5],[17,2,17,5],[18,2,18,5],[19,2,19,5],[20,2,20,5],[21,2,21,5],[22,2,22,5],[23,2,23,5],[10,1,10,2],[41,2,41,5],[38,2,38,5],[83,1,85,1],[83,2,85,2],[11,1,11,2],[17,6,17,8],[32,6,32,8],[33,6,33,8],[34,2,34,5],[34,6,34,8],[35,2,35,5],[35,6,35,8],[36,2,36,5],[36,6,36,8],[43,2,43,5],[37,2,37,5],[18,6,18,8],[19,6,19,8],[20,6,20,8],[21,6,21,8],[22,6,22,8],[42,6,42,8],[43,6,43,8],[44,6,44,8],[28,6,28,8],[40,2,40,5],[326,4,326,6],[327,4,327,6],[246,1,247,1],[246,2,247,2],[311,4,311,6],[310,4,310,6],[284,6,284,7],[285,6,285,7],[286,6,286,7],[305,6,305,7],[306,6,306,7],[318,4,318,6],[319,4,319,6],[39,2,39,5],[44,2,44,5],[336,4,336,6],[337,4,337,6],[323,4,323,6],[312,4,312,6],[313,4,313,6],[314,4,314,6],[315,4,315,6],[316,4,316,6],[317,4,317,6],[324,4,324,6],[325,4,325,6],[320,4,320,6],[321,4,321,6],[322,4,322,6],[331,4,331,6],[332,4,332,6],[333,4,333,6],[335,4,335,6],[330,4,330,6],[334,4,334,6],[328,4,328,6],[329,4,329,6]]}
[null,{"$f":"IF(dms_DataQuality=\"backcast\",INDEX(dms_Worksheet_List,MATCH(dms_Model,dms_Model_List))&\" BACKCAST\",INDEX(dms_Worksheet_List,MATCH(dms_Model,dms_Model_List)))","v":"ANNUAL REPORTING STATEMENT"}]
[null,{"$f":"INDEX(dms_TradingNameFull_List,MATCH(dms_TradingName,dms_TradingName_List))","v":"SA Power Networks"}]
[null,{"$f":"CONCATENATE(\"Annual Reporting RIN Response \",IF(SUM(dms_SingleYear_Model)>0,CONCATENATE(CRY),CONCATENATE(FRCP_y1,\" to \",dms_MultiYear_FinalYear_Result)))","v":"Annual Reporting RIN Response 2017-18"}]
[null,"7.12 SAFETY AND BUSHFIRE RELATED EXPENDITURE"]
[]
[null,"These templates collect information from Victorian businesses only.\n\nBushfire and safety related expenditure information is used by the AER to monitor the expenditures throughout the regulatory control period."]
[]
[null,"CPI applied to convert expected expenditure in real $ to nominal based on lagged September CPI index"]
[]
[null,"Instructions"]
[null,"For \"Exclusive of Margins & Overheads\" reported expenditure is to EXCLUDE any overheads, profit margins or management fees paid directly or indirectly to related party contractors (not including actual incurred expense of the related party contractor) for the reporting period."]
[null,"For \"Value of Margins & Overheads\" reported expenditure is to COMPRISE ONLY the sum of overheads, profit margins or management fees paid directly or indirectly to related party contractors (not including actual incurred expenses of the related party contractor) for the reporting period. "]
[]
[null,"Australian Distribution Co. is to specify each activity in this table in accordance with the definition in Appendix F of the RIN."]
[null,"All activities must be reported but the Reason for Difference is only required if there is a 10 per cent difference between the expected value and the actual value.\n\nUse median unit costs. Where unit costs are not recorded at the asset category level - provide the best estimates of the unit cost using the cost allocation method identified in this table. (As a transitional measure, the unit cost may be based on a statistically significant annual sample of actual work orders at a 5% or better confidence interval.)\n\nProvide basis of allocation where applicable."]
[]
[null,"7.12.1 - SAFETY AND BUSHFIRE RELATED ASSET GROUP DEFINITIONS AND ALLOCATION BASIS"]
[null,"Activity","Definitions",null,null,null,"Basis for allocation of cost to activity"]
[null,"Planned non-preferred services replacements"]
[null,"Planned replacement of non-preferred services due to height "]
[null,"Removal of public lighting switchwire "]
[null,"Replacement of existing SWER lines with 22kV overhead bare conductor "]
[null,"Installation of GFN and associated equipment at zone substations "]
[null,"Replacement of crossarms/insulator sets – pole top fire mitigation"]
[null,"Replacement of crossarms – based on age and condition "]
[null,"Replacement of poles – based on age and condition "]
[null,"Stake poles – based on age and condition "]
[null,"Replacement of undersized poles "]
[null,"Stake undersized poles"]
[null,"Replacement of overhead conductor – mainly steel "]
[null,"Service line clearance – overhead services requiring relocation "]
[null,"Service line clearance – overhead services requiring undergrounding "]
[null,"Replacement of 22kV distribution feeders with ABC/underground cabling"]
[null,"Replacement of SWER with covered carbon core conductor or equivalent"]
[null,"Replacement of SWER with ABC"]
[null,"Replacement of SWER with underground"]
[null,"Replacement of surge diverters (neptune configuration)"]
[null,"Replacement of surge diverters (single phase or three phase)"]
[]
[]
[]
[]
[]
[]
[]
[null,"To enter further activities - please copy row from above and \"insert copied cells\" into a row above this row. "]
[]
[]
[null,"7.12.2 - BUSHFIRE RELATED"]
[]
[null,"7.12.2.1 - NUMBER OF ACTIVITIES"]
[null,"Activity","Units","Number of Activities"]
[null,"Planned non-preferred services replacements","number of services"]
[null,"Planned replacement of non-preferred services due to height ","number of services"]
[null,"Removal of public lighting switchwire ","number of spans removed"]
[null,"Replacement of existing SWER lines with 22kV overhead bare conductor ","kms of SWER"]
[null,"Installation of GFN and associated equipment at zone substations ","number of zone substations"]
[null,"Replacement of crossarms/insulator sets – pole top fire mitigation","number of crossarms/sets"]
[null,"Replacement of crossarms – based on age and condition ","number of crossarms"]
[null,"Replacement of poles – based on age and condition ","number of poles"]
[null,"Stake poles – based on age and condition ","number of poles"]
[null,"Replacement of undersized poles ","number of poles"]
[null,"Stake undersized poles","number of poles"]
[null,"Replacement of overhead conductor – mainly steel ","kms "]
[null,"Service line clearance – overhead services requiring relocation ","number of services"]
[null,"Service line clearance – overhead services requiring undergrounding ","number of services"]
[null,"Replacement of 22kV distribution feeders with ABC/underground cabling","number of feeders"]
[null,"Replacement of SWER with covered carbon core conductor or equivalent","kms "]
[null,"Replacement of SWER with ABC","kms "]
[null,"Replacement of SWER with underground","kms "]
[null,"Replacement of surge diverters (neptune configuration)","number of units"]
[null,"Replacement of surge diverters (single phase or three phase)","number of units"]
[null,{"$f":"IF(ISBLANK(B39),\"\",B39)","v":""}]
[null,""]
[null,""]
[null,""]
[null,""]
[null,""]
[null,""]
[null,"To enter further activities - please copy row from above and \"insert copied cells\" into a row above this row. "]
[]
[]
[null,"7.12.2.2 - EXPENDITURE "]
[null,"Activity","Units","Exclusive of \nMargins & Overheads","Value of \nMargins & Overheads"]
[null,null,null,"Actual Expenditure"]
[null,null,null,"$0's, Nominal"]
[null,"Planned non-preferred services replacements","number of services"]
[null,"Planned replacement of non-preferred services due to height ","number of services"]
[null,"Removal of public lighting switchwire ","number of spans removed"]
[null,"Replacement of existing SWER lines with 22kV overhead bare conductor ","kms of SWER"]
[null,"Installation of GFN and associated equipment at zone substations ","number of zone substations"]
[null,"Replacement of crossarms/insulator sets – pole top fire mitigation","number of crossarms/sets"]
[null,"Replacement of crossarms – based on age and condition ","number of crossarms"]
[null,"Replacement of poles – based on age and condition ","number of poles"]
[null,"Stake poles – based on age and condition ","number of poles"]
[null,"Replacement of undersized poles ","number of poles"]
[null,"Stake undersized poles","number of poles"]
[null,"Replacement of overhead conductor – mainly steel ","kms "]
[null,"Service line clearance – overhead services requiring relocation ","number of services"]
[null,"Service line clearance – overhead services requiring undergrounding ","number of services"]
[null,"Replacement of 22kV distribution feeders with ABC/underground cabling","number of feeders"]
[null,"Replacement of SWER with covered carbon core conductor or equivalent","kms "]
[null,"Replacement of SWER with ABC","kms "]
[null,"Replacement of SWER with underground","kms "]
[null,"Replacement of surge diverters (neptune configuration)","number of units"]
[null,"Replacement of surge diverters (single phase or three phase)","number of units"]
[null,{"$f":"IF(ISBLANK(B39),\"\",B39)","v":""},{"$f":"IF(ISBLANK(C73),\"\",C73)","v":""}]
[null,"",""]
[null,"",""]
[null,"",""]
[null,"",""]
[null,"",""]
[null,"",""]
[null,"To enter further activities - please copy row from above and \"insert copied cells\" into a row above this row. "]
[]
[]
[null,"7.12.2.3 - UNIT COSTS"]
[null,"Activity",null,"Actual"]
[null,null,null,"$0's, Per Unit"]
[null,"Planned non-preferred services replacements"]
[null,"Planned replacement of non-preferred services due to height "]
[null,"Removal of public lighting switchwire "]
[null,"Replacement of existing SWER lines with 22kV overhead bare conductor "]
[null,"Installation of GFN and associated equipment at zone substations "]
[null,"Replacement of crossarms/insulator sets – pole top fire mitigation"]
[null,"Replacement of crossarms – based on age and condition "]
[null,"Replacement of poles – based on age and condition "]
[null,"Stake poles – based on age and condition "]
[null,"Replacement of undersized poles "]
[null,"Stake undersized poles"]
[null,"Replacement of overhead conductor – mainly steel "]
[null,"Service line clearance – overhead services requiring relocation "]
[null,"Service line clearance – overhead services requiring undergrounding "]
[null,"Replacement of 22kV distribution feeders with ABC/underground cabling"]
[null,"Replacement of SWER with covered carbon core conductor or equivalent"]
[null,"Replacement of SWER with ABC"]
[null,"Replacement of SWER with underground"]
[null,"Replacement of surge diverters (neptune configuration)"]
[null,"Replacement of surge diverters (single phase or three phase)"]
[null,{"$f":"IF(ISBLANK(B39),\"\",B39)","v":""}]
[null,""]
[null,""]
[null,""]
[null,""]
[null,""]
[null,""]
[null,"To enter further activities - please copy row from above and \"insert copied cells\" into a row above this row. "]
[]
[]
[null,"7.12.2.4 - CONTINGENT PROJECT APPLICATIONS - VOLUMES APPROVED"]
[null,"Activity","Units","Volume approved under contingent project applications ","Actual volumes","Difference"]
[null,null,null,null,null,{"$f":"E152-D152","v":0}]
[null,null,null,null,null,0]
[null,null,null,null,null,0]
[null,null,null,null,null,0]
[null,null,null,null,null,0]
[null,null,null,null,null,0]
[null,null,null,null,null,0]
[null,null,null,null,null,0]
[null,"To enter further activities - please copy row from above and \"insert copied cells\" into a row above this row. "]
[]
[null,"7.12.2.5 - CONTINGENT PROJECT APPLICATIONS - EXPENDITURE APPROVED"]
[null,"Activity","Exclusive of \nMargins & Overheads","Value of \nMargins & Overheads"]
[null,null,"Actual Expenditure"]
[null,null,"$0's, Nominal"]
[null,{"$f":"IF(ISBLANK(B152),\"\",B152)","v":""}]
[null,{"$f":"IF(ISBLANK(B153),\"\",B153)","v":""}]
[null,""]
[null,""]
[null,""]
[null,""]
[null,""]
[null,""]
[null,"To enter further activities - please copy row from above and \"insert copied cells\" into a row above this row. "]
[]
[]
[]
[null,"7.12.3 - SAFETY RELATED"]
[]
[null,"7.12.3.1 - NUMBER OF ACTIVITIES"]
[null,"Activity","Units","Number of Activities"]
[null,"Planned non-preferred services replacements","number of services"]
[null,"Planned replacement of non-preferred services due to height ","number of services"]
[null,"Removal of public lighting switchwire ","number of spans removed"]
[null,"Replacement of existing SWER lines with 22kV overhead bare conductor ","kms of SWER"]
[null,"Installation of GFN and associated equipment at zone substations ","number of zone substations"]
[null,"Replacement of crossarms/insulator sets – pole top fire mitigation","number of crossarms/sets"]
[null,"Replacement of crossarms – based on age and condition ","number of crossarms"]
[null,"Replacement of poles – based on age and condition ","number of poles"]
[null,"Stake poles – based on age and condition ","number of poles"]
[null,"Replacement of undersized poles ","number of poles"]
[null,"Stake undersized poles","number of poles"]
[null,"Replacement of overhead conductor – mainly steel ","kms "]
[null,"Service line clearance – overhead services requiring relocation ","number of services"]
[null,"Service line clearance – overhead services requiring undergrounding ","number of services"]
[null,"Replacement of 22kV distribution feeders with ABC/underground cabling","number of feeders"]
[null,"Replacement of SWER with covered carbon core conductor or equivalent","kms "]
[null,"Replacement of SWER with ABC","kms "]
[null,"Replacement of SWER with underground","kms "]
[null,"Replacement of surge diverters (neptune configuration)","number of units"]
[null,"Replacement of surge diverters (single phase or three phase)","number of units"]
[null,{"$f":"IF(ISBLANK(B39),\"\",B39)","v":""},{"$f":"IF(ISBLANK(C73),\"\",C73)","v":""}]
[null,"",""]
[null,"",""]
[null,"",""]
[null,"",""]
[null,"",""]
[null,"",""]
[null,"To enter further activities - please copy row from above and \"insert copied cells\" into a row above this row. "]
[]
[]
[null,"7.12.3.2 - EXPENDITURE"]
[null,"Activity","Units","Exclusive of \nMargins & Overheads","Value of \nMargins & Overheads"]
[null,null,null,"Actual Expenditure"]
[null,null,null,"$0's, Nominal"]
[null,"Planned non-preferred services replacements","number of services"]
[null,"Planned replacement of non-preferred services due to height ","number of services"]
[null,"Removal of public lighting switchwire ","number of spans removed"]
[null,"Replacement of existing SWER lines with 22kV overhead bare conductor ","kms of SWER"]
[null,"Installation of GFN and associated equipment at zone substations ","number of zone substations"]
[null,"Replacement of crossarms/insulator sets – pole top fire mitigation","number of crossarms/sets"]
[null,"Replacement of crossarms – based on age and condition ","number of crossarms"]
[null,"Replacement of poles – based on age and condition ","number of poles"]
[null,"Stake poles – based on age and condition ","number of poles"]
[null,"Replacement of undersized poles ","number of poles"]
[null,"Stake undersized poles","number of poles"]
[null,"Replacement of overhead conductor – mainly steel ","kms "]
[null,"Service line clearance – overhead services requiring relocation ","number of services"]
[null,"Service line clearance – overhead services requiring undergrounding ","number of services"]
[null,"Replacement of 22kV distribution feeders with ABC/underground cabling","number of feeders"]
[null,"Replacement of SWER with covered carbon core conductor or equivalent","kms "]
[null,"Replacement of SWER with ABC","kms "]
[null,"Replacement of SWER with underground","kms "]
[null,"Replacement of surge diverters (neptune configuration)","number of units"]
[null,"Replacement of surge diverters (single phase or three phase)","number of units"]
[null,{"$f":"IF(ISBLANK(B39),\"\",B39)","v":""},{"$f":"IF(ISBLANK(C73),\"\",C73)","v":""}]
[null,"",""]
[null,"",""]
[null,"",""]
[null,"",""]
[null,"",""]
[null,"",""]
[null,"To enter further activities - please copy row from above and \"insert copied cells\" into a row above this row. "]
[]
[]
[null,"7.12.3.3 - UNIT COSTS"]
[null,"Activity","Units","Actual"]
[null,null,null,"$0's, Per Unit"]
[null,"Planned non-preferred services replacements","number of services"]
[null,"Planned replacement of non-preferred services due to height ","number of services"]
[null,"Removal of public lighting switchwire ","number of spans removed"]
[null,"Replacement of  existing SWER lines with 22kV overhead bare conductor ","kms of SWER"]
[null,"Installation of GFN and associated equipment at zone substations ","number of zone substations"]
[null,"Replacement of crossarms/insulator sets – pole top fire mitigation","number of crossarms/sets"]
[null,"Replacement of crossarms – based on age and condition ","number of crossarms"]
[null,"Replacement of poles – based on age and condition ","number of poles"]
[null,"Stake poles – based on age and condition ","number of poles"]
[null,"Replacement of undersized poles ","number of poles"]
[null,"Stake undersized poles","number of poles"]
[null,"Replacement of overhead conductor – mainly steel ","kms "]
[null,"Service line clearance – overhead services requiring relocation ","number of services"]
[null,"Service line clearance – overhead services requiring undergrounding ","number of services"]
[null,"Replacement of 22kV distribution feeders with ABC/underground cabling","number of feeders"]
[null,"Replacement of SWER with covered carbon core conductor or equivalent","kms "]
[null,"Replacement of SWER with ABC","kms "]
[null,"Replacement of SWER with underground","kms "]
[null,"Replacement of surge diverters (neptune configuration)","number of units"]
[null,"Replacement of surge diverters (single phase or three phase)","number of units"]
[null,{"$f":"IF(ISBLANK(B39),\"\",B39)","v":""},{"$f":"IF(ISBLANK(C73),\"\",C73)","v":""}]
[null,"",""]
[null,"",""]
[null,"",""]
[null,"",""]
[null,"",""]
[null,"",""]
[null,"To enter further activities - please copy row from above and \"insert copied cells\" into a row above this row. "]
[]
[]
[null,"7.12.4 - SAFETY IMPROVEMENT OUTCOMES REPORTED TO ESV"]
[null,"Activity","Units","Safety Improvement Programme - outcomes","Safety Improvement Target","Difference","Reasons for Difference"]
[null,"Planned non-preferred services replacements","number of services",null,null,{"$f":"D281-E281","v":0}]
[null,"Planned replacement of non-preferred services due to height ","number of services",null,null,{"$f":"D282-E282","v":0}]
[null,"Removal of public lighting switchwire ","number of spans removed",null,null,0]
[null,"Replacement of  existing SWER lines with 22kV overhead bare conductor ","kms of SWER",null,null,0]
[null,"Installation of GFN and associated equipment at zone substations ","number of zone substations",null,null,0]
[null,"Replacement of crossarms/insulator sets – pole top fire mitigation","number of crossarms/sets",null,null,0]
[null,"Replacement of crossarms – based on age and condition ","number of crossarms",null,null,0]
[null,"Replacement of poles – based on age and condition ","number of poles",null,null,0]
[null,"Stake poles – based on age and condition ","number of poles",null,null,0]
[null,"Replacement of undersized poles ","number of poles",null,null,0]
[null,"Stake undersized poles","number of poles",null,null,0]
[null,"Replacement of overhead conductor – mainly steel ","kms ",null,null,0]
[null,"Service line clearance – overhead services requiring relocation ","number of services",null,null,0]
[null,"Service line clearance – overhead services requiring undergrounding ","number of services",null,null,0]
[null,"Replacement of 22kV distribution feeders with ABC/underground cabling","number of feeders",null,null,0]
[null,"Replacement of SWER with covered carbon core conductor or equivalent","kms ",null,null,0]
[null,"Replacement of SWER with ABC","kms ",null,null,0]
[null,"Replacement of SWER with underground","kms ",null,null,{"$f":"D298-E298","v":0}]
[null,"Replacement of surge diverters (neptune configuration)","number of units",null,null,0]
[null,"Replacement of surge diverters (single phase or three phase)","number of units",null,null,0]
[null,{"$f":"IF(ISBLANK(B39),\"\",B39)","v":""},{"$f":"IF(ISBLANK(C73),\"\",C73)","v":""},null,null,0]
[null,"","",null,null,0]
[null,"","",null,null,{"$f":"D303-E303","v":0}]
[null,"","",null,null,{"$f":"D304-E304","v":0}]
[null,"","",null,null,{"$f":"D305-E305","v":0}]
[null,"","",null,null,0]
[null,"","",null,null,0]
[null,"To enter further activities - please copy row from above and \"insert copied cells\" into a row above this row. "]
[]
[null,"7.12.5 - RECONCILIATION OF VOLUME OF OUTCOMES REPORTED TO ESV AND AER"]
[null,"Activity","Units","Difference","Reasons for Difference"]
[null,"Planned non-preferred services replacements","number of services",{"$f":"D281-D53-D182","v":0}]
[null,"Planned replacement of non-preferred services due to height ","number of services",0]
[null,"Removal of public lighting switchwire ","number of spans removed",0]
[null,"Replacement of  existing SWER lines with 22kV overhead bare conductor ","kms of SWER",0]
[null,"Installation of GFN and associated equipment at zone substations ","number of zone substations",0]
[null,"Replacement of crossarms/insulator sets – pole top fire mitigation","number of crossarms/sets",0]
[null,"Replacement of crossarms – based on age and condition ","number of crossarms",0]
[null,"Replacement of poles – based on age and condition ","number of poles",0]
[null,"Stake poles – based on age and condition ","number of poles",0]
[null,"Replacement of undersized poles ","number of poles",0]
[null,"Stake undersized poles","number of poles",0]
[null,"Replacement of overhead conductor – mainly steel ","kms ",0]
[null,"Service line clearance – overhead services requiring relocation ","number of services",0]
[null,"Service line clearance – overhead services requiring undergrounding ","number of services",0]
[null,"Replacement of 22kV distribution feeders with ABC/underground cabling","number of feeders",0]
[null,"Replacement of SWER with covered carbon core conductor or equivalent","kms ",0]
[null,"Replacement of SWER with ABC","kms ",0]
[null,"Replacement of SWER with underground","kms ",0]
[null,"Replacement of surge diverters (neptune configuration)","number of units",0]
[null,"Replacement of surge diverters (single phase or three phase)","number of units",0]
[null,{"$f":"IF(ISBLANK(B39),\"\",B39)","v":""},{"$f":"IF(ISBLANK(C73),\"\",C73)","v":""},{"$f":"D301-D74-D202","v":0}]
[null,"","",0]
[null,"","",0]
[null,"","",0]
[null,"","",0]
[null,"","",0]
[null,"","",0]
[null,"To enter further activities - please copy row from above and \"insert copied cells\" into a row above this row. "]

{"sheet":"8.1 Income","index":19,"n_rows":40,"n_cols":12,"rows_kept":40,"cut":false,"hidden":false,"merged":[[6,6,6,10],[7,8,7,10],[6,11,8,11],[9,2,9,11],[6,5,8,5],[7,6,7,7],[6,2,8,2],[6,3,8,3],[6,4,8,4]]}
[null,{"$f":"IF(dms_DataQuality=\"backcast\",INDEX(dms_Worksheet_List,MATCH(dms_Model,dms_Model_List))&\" BACKCAST\",INDEX(dms_Worksheet_List,MATCH(dms_Model,dms_Model_List)))","v":"ANNUAL REPORTING STATEMENT"}]
[null,{"$f":"INDEX(dms_TradingNameFull_List,MATCH(dms_TradingName,dms_TradingName_List))","v":"SA Power Networks"}]
[null,{"$f":"CONCATENATE(\"Annual Reporting RIN Response \",IF(SUM(dms_SingleYear_Model)>0,CONCATENATE(CRY),CONCATENATE(FRCP_y1,\" to \",dms_MultiYear_FinalYear_Result)))","v":"Annual Reporting RIN Response 2017-18"}]
[null,"8.1 - INCOME"]
[]
[null,"8.1.1 - INCOME STATEMENT"]
[null,null,"Audited Statutory Accounts","Adjustments","Distribution business","Standard Control Services","Alternative Control Services",null,null,null,null,"Negotiated Services"]
[null,null,null,null,null,null,"Public Lighting",null,"Other"]
[null,null,null,null,null,null,{"$f":"IF(dms_Jurisdiction=\"Vic\",\"Energy efficient\",\"\")","v":""},{"$f":"IF(dms_Jurisdiction=\"Vic\",\"Non-energy efficient\",\"\")","v":""},"Connection services","Metering services","Ancillary network services"]
[null,null,"$0's, nominal"]
[null,"8.1.1.1 - REVENUE"]
[null,"Distribution revenue",{"$f":"1047431052.07-C18+68598149.29","v":876962832.20000005},{"$f":"E12-C12","v":-761535.75},{"$f":"SUM(F12,I12:L12)","v":876201296.45000005},{"$f":"1026267378.87-F18","v":787201009.71000004},null,null,0,20590251,0,68410035.739999995]
[null,"Cross boundary revenue",0,{"$f":"E13-C13","v":0},0,0,null,null,0,0,0,0]
[null,"Contributions",12591215.32,{"$f":"E14-C14","v":64965583.130000003},77556798.450000003,0,null,null,0,0,0,77556798.450000003]
[null,"Interest income",2968996.74,{"$f":"E15-C15","v":-2968996.74},0,0,null,null,0,0,0,0]
[null,"Jurisdictional scheme amounts",0,{"$f":"E16-C16","v":0},0,0,null,null,0,0,0,0]
[null,"Profit from sale of fixed assets",0,0,0,0,null,null,0,0,0,0]
[null,"TUOS revenue",239066369.16,0,239066369.16,{"$f":"C18","v":239066369.16},null,null,0,0,0,0]
[null,"Pass through revenue (F-factor)"]
[null,"Other Revenue ",204604959.53,{"$f":"E20-C20","v":-204604959.53},{"$f":"SUM(F20,I20:L20)","v":0},0,null,null,0,0,0,0]
[null,"Total revenue",{"$f":"SUM(C12:C20)","v":1336194372.95},-143369908.88999999,1192824464.0600002,1026267378.87,0,0,0,20590251,0,145966834.19]
[]
[null,"8.1.1.2 - EXPENDITURE"]
[null,"TUOS expenditure",239066369.16,{"$f":"E24-C24","v":0},{"$f":"SUM(F24,I24:L24)","v":239066369.16},{"$f":"C24","v":239066369.16},null,null,0,0,0,0]
[null,"Avoided TUOS expenditure",0,0,0,0,null,null,0,0,0,0]
[null,"Cross boundary expenditure",0,0,0,0,null,null,0,0,0,0]
[null,"Depreciation ",233730346.28,74527968.479999989,308258314.75999999,293369469.95999998,null,null,0,9393948.9800000004,0,5494895.8200000003]
[null,"Finance charges",190971844.55000001,-190971844.55000001,0,0,null,null,0,0,0,0]
[null,"Impairment losses",0,0,0,0,null,null,0,0,0,0]
[null,"Jurisdictional scheme amounts",0,0,0,0,null,null,0,0,0,0]
[null,"Loss from sale of fixed assets",357170.38,-357170.38,0,{"$f":"-'[1]4b-DPLb'!$D$14-'[1]4b-DPLb'!$D$23","v":0},null,null,0,0,0,0]
[null,"Maintenance expenditure",{"$f":"SUM(D32:E32)","v":131608231.19},0,131608231.19,112608162.61,null,null,0,4748135.6900000004,0,14251932.890000001]
[null,"Operating expenditure excluding maintenance expenditure",{"$f":"450576262.43-C32","v":318968031.24000001},{"$f":"E33-C33","v":-64125097.940000057},{"$f":"SUM(F33,I33:L33)","v":254842933.29999995},{"$f":"251215744.44-F32","v":138607581.82999998},null,null,0,{"$f":"8031933.2-J32","v":3283797.51},0,{"$f":"127203486.85-L32","v":112951553.95999999}]
[null,"Other ",0,{"$f":"E34-C34","v":1669005.63},{"$f":"SUM(F34,I34:L34)","v":1669005.63},1669005.63,null,null,0,0,0,0]
[null,"Total expenditure",{"$f":"SUM(dms_080101_02_audited_Values)","v":1114701992.8},{"$f":"SUM(D24:D34)","v":-179257138.76000008},{"$f":"SUM(dms_080101_02_dnsp_Values)","v":935444854.03999984},{"$f":"SUM(dms_080101_02_SCS_Values)","v":785320589.18999994},{"$f":"SUM(G24:G34)","v":0},{"$f":"SUM(H24:H34)","v":0},{"$f":"SUM(dms_080101_02_connection_Values)","v":0},{"$f":"SUM(dms_080101_02_metering_Values)","v":17425882.18},{"$f":"SUM(dms_080101_02_ancillary_Values)","v":0},{"$f":"SUM(dms_080101_02_negotiated_Values)","v":132698382.66999999}]
[]
[null,"8.1.1.3 - PROFIT"]
[null,"Profit before tax (PBT)",{"$f":"C21-SUM(C24:C34)","v":221492380.1500001},35887229.870000094,257379610.02000034,240946789.68000007,0,0,0,3164368.8200000003,0,13268451.520000011]
[null,"Income tax expenses (/ benefit)",0,{"$f":"dms_080101_03_dnsp_Values-C39","v":0},{"$f":"SUM(dms_080101_03_SCS_Values,I39:L39)","v":0},0,null,null,0,0,0,0]
[null,"Profit after tax",{"$f":"C38-C39","v":221492380.1500001},35887229.870000094,257379610.02000034,240946789.68000007,0,0,0,3164368.8200000003,0,{"$f":"L38-L39","v":13268451.520000011}]

{"sheet":"8.2 Capex","index":20,"n_rows":248,"n_cols":10,"rows_kept":248,"cut":false,"hidden":false,"merged":[[140,2,140,3],[196,2,196,3],[6,1,6,4],[41,1,41,4],[10,1,10,4],[7,1,7,4],[8,1,8,4],[14,1,14,4],[16,2,16,9],[17,2,18,2],[17,3,18,3],[17,4,18,4],[17,5,18,5],[17,6,17,9],[19,2,19,3],[19,5,19,9],[43,2,43,5],[44,2,44,5],[55,2,55,5],[56,2,56,5],[50,2,50,5],[51,2,51,5],[49,2,49,5],[45,2,45,5],[46,2,46,5],[47,2,47,5],[81,1,81,2],[58,2,58,5],[63,3,64,3],[63,5,64,5],[65,5,65,9],[65,2,65,3],[57,2,57,5],[63,4,64,4],[48,2,48,5],[63,2,64,2],[52,2,52,5],[53,2,53,5],[54,2,54,5],[62,2,62,9],[63,6,63,9]]}
[null,{"$f":"IF(dms_DataQuality=\"backcast\",INDEX(dms_Worksheet_List,MATCH(dms_Model,dms_Model_List))&\" BACKCAST\",INDEX(dms_Worksheet_List,MATCH(dms_Model,dms_Model_List)))","v":"ANNUAL REPORTING STATEMENT"}]
[null,{"$f":"INDEX(dms_TradingNameFull_List,MATCH(dms_TradingName,dms_TradingName_List))","v":"SA Power Networks"}]
[null,{"$f":"CONCATENATE(\"Annual Reporting RIN Response \",IF(SUM(dms_SingleYear_Model)>0,CONCATENATE(CRY),CONCATENATE(FRCP_y1,\" to \",dms_MultiYear_FinalYear_Result)))","v":"Annual Reporting RIN Response 2017-18"}]
[null,"8.2 - CAPEX"]
[]
[null,"Instructions"]
[null,"Reported expenditure must EXCLUDE capital contributions (except tables 8.2.1 and 8.2.5 which should include all capital contributions)."]
[null,"Forecast expenditure is to be taken from Australian Distribution Co.'s distribution determination."]
[null,"If allocating based on assumptions then provide method in Basis of Preparation. All adjustments must be explained in Basis of Preparation with supporting documentation attached. "]
[]
[null,"For tables 8.2.1 and 8.2.3:\nReported expenditure must INCLUDE any profit margins or management fees paid directly or indirectly to related party contractors (not including actual incurred expenses of the related party contractor) for the regulatory reporting period.\n\n'Related Party Margin Expenditure' must COMPRISE ONLY profit margins or management fees paid directly or indirectly to related party contractors (not including actual incurred expenses of the related party contractor) for the regulatory reporting period."]
[]
[null,"8.2.1 - CAPEX BY PURPOSE - STANDARD CONTROL SERVICES"]
[]
[null,"Each line item in this table must INCLUDE the capital contributions. Total capital contributions should also be identified in the last item in the table. "]
[]
[null,null,"EXPENDITURE"]
[null,null,"CPI adjusted Forecast","Actual","Difference","Related Party Margin","Voltage level"]
[null,null,null,null,null,null,"Subtransmission","HV","LV","Other "]
[null,"Description","$0's, nominal",null," (%)","$0's, nominal"]
[null,"Replacement Expenditure",144821647.08849108,{"$f":"SUM(G21:J21)","v":143580748.88999999},{"$f":"IF(C21=0,1,(D21-C21)/C21*1)","v":-8.5684579856550331E-3},141824.58999999997,10392222.568003761,27508597.371899102,69510536.689648926,36169392.260448188]
[null,"Connections",108315460.14241482,{"$f":"SUM(G22:J22)","v":68973178.139999986},{"$f":"IF(C22=0,1,(D22-C22)/C22*1)","v":-0.36321945132012551},6442.2899999999991,175336.58551139053,44639393.168013826,24158448.346474789,3.9999976754188538E-2]
[null,"Augmentation Expenditure",111270589.93368582,87165260.980000004,-0.21663701943210623,26266.920000000002,51364830.898847014,31177338.69878836,2611561.4823725466,2011529.8999920785]
[null,"Non-Network",87282072.764713496,109262862.13999993,0.25183624401931998,33060.159999999996,0,0,0,109262862.13999993]
[null,"Capitalised Network Overheads",17557515.563729338,6904976.3469208702,-0.60672247039408544,0,1426807.8438994375,2380424.6874152068,2218125.9090981195,879617.90650810674]
[null,"Capitalised Corporate Overheads",-9912519.7794863004,{"$f":"SUM(G26:J26)","v":-6939995.2358265053},-0.29987577425180595,0,0,0,0,-6939995.2358265053]
[null,"Balancing Item",0,-9629009,1,-1616.02,null,-9629009]
[null,null,null,0,1]
[null,null,null,0,1]
[null,null,null,{"$f":"SUM(G30:J30)","v":0},1]
[null,null,null,0,1]
[null,null,null,0,1]
[null,null,null,0,1]
[null,null,null,0,1]
[null,null,null,0,1]
[null,"Capital contributions included in the above",75827625.938688979,29535992.122741792,-0.61048507378269568,null,null,null,null,29535992.122741792]
[null,"Total",{"$f":"SUM(C21:C35)","v":459334765.71354824},399318022.26109427,{"$f":"IF(C37=0,1,(D37-C37)/C37*1)","v":-0.13066013707719609},null,{"$f":"SUM(G21:G35)","v":63359197.896261603},{"$f":"SUM(H21:H35)","v":96076744.926116496},98498672.427594393,141383407.01112178]
[]
[]
[null,"8.2.2 - CAPEX BY PURPOSE - MATERIAL DIFFERENCE EXPLANATION"]
[]
[null,"Where the difference between forecast and actual expenditure shown in table 8.2.1 is a Material Difference please explain the main factors driving the difference."]
[]
[null,"Description","Reason for material difference"]
[null,"Connections","Continued subdued economic conditions."]
[null,"Augmentation Expenditure","Savings from KI cable installation.  More prudent solution and efficient tender process."]
[null,"Non-Network","Unforecasted expenditure associated with metering contestability to meet AEMC timeframes.  Progression of IT projects that were delayed in earlier years."]
[null,"Capitalised Network Overheads","Reduced overheads commensurate with lower than forecast capital spend in the network categories.  Lower overheads associated with savings from KI cable delivery."]
[null,"Capitalised Corporate Overheads","Represents an adjustment to total capital to report superannuation on a cash payments basis in accordance with SA Power Networks' Cost Allocation Method.  Difference is due to the re-commencement of contributions paid into the superannuation defined benefit scheme, which was not assumed in the forecast."]
[]
[]
[]
[]
[]
[]
[]
[]
[]
[]
[]
[]
[null,"8.2.3 - CAPEX OTHER"]
[null,null,"EXPENDITURE"]
[null,null,"CPI adjusted Forecast","Actual","Difference","Related Party Margin","Voltage level"]
[null,null,null,null,null,null,"Subtransmission","HV","LV","Other "]
[null,null,"$0's, nominal",null," (%)","$0's, nominal"]
[null,"Public lighting"]
[null,{"$f":"IF(dms_Jurisdiction=\"Vic\",\"Energy Efficient\", \"Total\")","v":"Total"},null,{"$f":"SUM(G68:J68)","v":0},{"$f":"IF(C68=0,1,((D68-C68)/C68)*1)","v":1}]
[null,{"$f":"IF(dms_Jurisdiction=\"Vic\",\"Non-energy efficient\", \"\")","v":""},null,{"$f":"SUM(G69:J69)","v":0},{"$f":"IF(C69=0,1,((D69-C69)/C69)*1)","v":1}]
[null,"Alternative Control Services"]
[null,"Connection services",0,{"$f":"SUM(G71:J71)","v":0},{"$f":"IF(C71=0,1,((D71-C71)/C71)*1)","v":1},0,0,0,0,0]
[null,"Metering services",4350251.3735697754,-441566.59431446996,{"$f":"IF(C72=0,1,((D72-C72)/C72)*1)","v":-1.1015036963144786},-30.88,0,0,-441566.59431446996,0]
[null,"Ancillary network services",0,0,{"$f":"IF(C73=0,1,((D73-C73)/C73)*1)","v":1},0,0,0,0,0]
[null,"Negotiated Services"]
[null,"Negotiated services",0,{"$f":"SUM(G75:J75)","v":9779021.8305051662},{"$f":"IF(C75=0,1,((D75-C75)/C75)*1)","v":1},216948.38,null,null,9779021.8305051662]
[null,"Total",{"$f":"SUM(C68:C69,C71:C73,C75)","v":4350251.3735697754},{"$f":"SUM(D68:D69,D71:D73,D75)","v":9337455.2361906953},{"$f":"IF(C76=0,1,((D76-C76)/C76)*1)","v":1.1464173985257471},null,{"$f":"SUM(G68:G69,G71:G73,G75)","v":0},{"$f":"SUM(H68:H69,H71:H73,H75)","v":0},{"$f":"SUM(I68:I69,I71:I73,I75)","v":9337455.2361906953},{"$f":"SUM(J68:J69,J71:J73,J75)","v":0}]
[]
[]
[]
[null,"8.2.4 - CAPEX BY ASSET CLASS"]
[]
[null,"Australian Distribution Co. to enter in Table 8.2.4 each Asset Class specified in its current determination as listed in the AER's final decision in its Roll Forward Model and Post-tax Revenue Model and enter information against that Asset Class."]
[]
[null,null,"CPI adjusted Forecast","Actual ","Difference","Movements in provisions \nallocated to \nas-incurred capex"]
[null,"Asset class","$0's, nominal",null," (%)","$0's, nominal"]
[null,"Sub-transmission Lines",3495926.4145520241,1372782.8749163209,-0.60731928761371468,12240.913180126441]
[null,"Distribution Lines",219090461.47243348,48740183.922053069,-0.7775339757172145,268409.74809534015]
[null,"Substations",36232181.055099018,61833521.408657737,0.70659120174483114,523457.15311754675]
[null,"Distribution Transformers",19877947.661113825,6725231.5841416912,-0.66167374525802258,46882.007576516262]
[null,"Low Voltage Services",5644669.1335913362,124310687.71356648,21.022670376514284,1277200.0230368045]
[null,"Communications",11788327.26975083,29585850.351351611,1.5097581424694335,293691.22721908212]
[null,"Substation Land",413833.41491747741,43552.193282905668,-0.8947591187347923,0]
[null,"Easements",613869.59576712584,554835.04241870542,-9.6167905619511149E-2,4076.9458525219552]
[null,"Land",0,2054357.3268014011,1,0]
[null,"Buildings",15116158.759362154,0,-1,0]
[null,"Heavy Vehicles - 15 Years",4620029.8473805729,2580448.2934899731,-0.44146501673511596,20122.070623002546]
[null,"Heavy Vehicles - 10 Years",5674932.4715905963,7157989.2870767908,0.26133470713714352,56983.378591238681]
[null,"Light Vehicles",8231262.589262519,8940037.5799999982,8.6107687982407324E-2,0]
[null,"Information Technology",46186262.421908192,61973267.150680281,0.34181169683225143,495696.71622670663]
[null,"Plant and Tools / Office Furniture",6521277.4432072956,13909285.619915627,1.1329081213074044,0]
[null,"Equity Raising Costs",0,0,{"$f":"IF(C101=0,1,((D101-C101)/C101)*1)","v":1},0]
[null,null,null,null,1]
[null,null,null,null,1]
[null,null,null,null,1]
[null,null,null,null,1]
[null,null,null,null,{"$f":"IF(C106=0,1,((D106-C106)/C106)*1)","v":1}]
[null,null,null,null,1]
[null,null,null,null,1]
[null,null,null,null,1]
[null,null,null,null,1]
[null,null,null,null,1]
[null,null,null,null,1]
[null,null,null,null,1]
[null,null,null,null,1]
[null,null,null,null,1]
[null,null,null,null,{"$f":"IF(C116=0,1,((D116-C116)/C116)*1)","v":1}]
[null,null,null,null,1]
[null,null,null,null,1]
[null,null,null,null,1]
[null,null,null,null,1]
[null,null,null,null,1]
[null,null,null,null,1]
[null,null,null,null,1]
[null,null,null,null,1]
[null,null,null,null,1]
[null,null,null,null,1]
[null,null,null,null,1]
[null,null,null,null,1]
[null,null,null,null,1]
[null,null,null,null,1]
[null,null,null,null,1]
[null,null,null,null,1]
[null,null,null,null,1]
[null,null,null,null,1]
[null,null,null,null,1]
[null,"Total",{"$f":"SUM(C86:C135)","v":383507139.54993653},{"$f":"SUM(D86:D135)","v":369782030.34835261},-3.5788405967333424E-2,{"$f":"SUM(F86:F135)","v":2998760.1835188856}]
[]
[]
[null,"8.2.5 - CAPITAL CONTRIBUTIONS BY ASSET CLASS"]
[null,null,"CPI Adjusted Forecast","Actual","Difference"]
[null,"Asset class","$0's, nominal",null," (%)"]
[null,{"$f":"IF(ISBLANK(B86),\"\",B86)","v":"Sub-transmission Lines"},0,0,{"$f":"IF(C142=0,1,((D142-C142)/C142)*1)","v":1}]
[null,"Distribution Lines",87103513.879982501,28477818.818914216,{"$f":"IF(C143=0,1,((D143-C143)/C143)*1)","v":-0.67305774990716205}]
[null,"Substations",0,2799190.7569942344,1]
[null,"Distribution Transformers",0,916120.24300576549,1]
[null,"Low Voltage Services",22561882.876136325,21071910.783827577,-6.6039350549270431E-2]
[null,"Communications",0,0,1]
[null,"Substation Land",0,0,1]
[null,"Easements",0,0,1]
[null,"Land",0,0,1]
[null,"Buildings",0,0,1]
[null,"Heavy Vehicles - 15 Years",0,0,1]
[null,"Heavy Vehicles - 10 Years",0,0,1]
[null,"Light Vehicles",0,0,1]
[null,"Information Technology",0,0,1]
[null,"Plant and Tools / Office Furniture",0,0,1]
[null,"Equity Raising Costs",0,0,1]
[null,"",null,null,1]
[null,"",null,null,1]
[null,"",null,null,1]
[null,"",null,null,1]
[null,"",null,null,1]
[null,"",null,null,1]
[null,"",null,null,1]
[null,"",null,null,1]
[null,"",null,null,1]
[null,"",null,null,1]
[null,"",null,null,1]
[null,"",null,null,1]
[null,"",null,null,1]
[null,"",null,null,{"$f":"IF(C171=0,1,((D171-C171)/C171)*1)","v":1}]
[null,"",null,null,1]
[null,"",null,null,1]
[null,{"$f":"IF(ISBLANK(B118),\"\",B118)","v":""},null,null,1]
[null,"",null,null,1]
[null,"",null,null,1]
[null,"",null,null,1]
[null,"",null,null,1]
[null,"",null,null,1]
[null,"",null,null,1]
[null,"",null,null,{"$f":"IF(C181=0,1,((D181-C181)/C181)*1)","v":1}]
[null,"",null,null,1]
[null,"",null,null,1]
[null,"",null,null,1]
[null,"",null,null,1]
[null,"",null,null,1]
[null,"",null,null,1]
[null,"",null,null,1]
[null,"",null,null,1]
[null,"",null,null,1]
[null,"",null,null,1]
[null,"Total",{"$f":"SUM(C142:C191)","v":109665396.75611883},{"$f":"SUM(D142:D191)","v":53265040.602741793},-0.51429491728191967]
[]
[]
[null,"8.2.6 - DISPOSALS BY ASSET CLASS"]
[null,null,"CPI Adjusted Forecast","Actual","Difference"]
[null,"Asset class","$0's, nominal",null," (%)"]
[null,{"$f":"IF(ISBLANK(B86),\"\",B86)","v":"Sub-transmission Lines"},0,0,{"$f":"IF(C198=0,1,((D198-C198)/C198)*1)","v":1}]
[null,"Distribution Lines",0,0,{"$f":"IF(C199=0,1,((D199-C199)/C199)*1)","v":1}]
[null,"Substations",0,0,1]
[null,"Distribution Transformers",0,0,1]
[null,"Low Voltage Services",0,0,1]
[null,"Communications",0,0,1]
[null,"Substation Land",0,0,1]
[null,"Easements",0,0,1]
[null,"Land",0,0,1]
[null,"Buildings",0,0,1]
[null,"Heavy Vehicles - 15 Years",131449.34333958724,454791.06,2.4598199461909007]
[null,"Heavy Vehicles - 10 Years",52579.7373358349,119752.25,1.2775361016949152]
[null,"Light Vehicles",1919370.7317073171,1975453.08,2.9219132795047204E-2]
[null,"Information Technology",0,0,1]
[null,"Plant and Tools / Office Furniture",0,0,1]
[null,"Equity Raising Costs",0,0,1]
[null,"",null,null,1]
[null,"",null,null,1]
[null,"",null,null,1]
[null,"",null,null,1]
[null,"",null,null,1]
[null,"",null,null,1]
[null,"",null,null,1]
[null,"",null,null,1]
[null,"",null,null,1]
[null,"",null,null,1]
[null,"",null,null,1]
[null,"",null,null,1]
[null,"",null,null,1]
[null,"",null,null,1]
[null,"",null,null,{"$f":"IF(C228=0,1,((D228-C228)/C228)*1)","v":1}]
[null,"",null,null,1]
[null,{"$f":"IF(ISBLANK(B118),\"\",B118)","v":""},null,null,1]
[null,"",null,null,1]
[null,"",null,null,1]
[null,"",null,null,1]
[null,"",null,null,1]
[null,"",null,null,1]
[null,"",null,null,1]
[null,"",null,null,1]
[null,"",null,null,1]
[null,"",null,null,1]
[null,"",null,null,1]
[null,"",null,null,1]
[null,"",null,null,1]
[null,"",null,null,1]
[null,"",null,null,1]
[null,"",null,null,1]
[null,"",null,null,1]
[null,"",null,null,1]
[null,"Total",{"$f":"SUM(C198:C247)","v":2103399.812382739},{"$f":"SUM(D198:D247)","v":2549996.39},0.21232129763830057]

{"sheet":"8.4 Opex","index":21,"n_rows":143,"n_cols":14,"rows_kept":143,"cut":false,"hidden":false,"merged":[[153,2,153,7],[154,2,154,7],[143,2,143,7],[144,2,144,7],[145,2,145,7],[146,2,146,7],[148,2,148,7],[149,2,149,7],[150,2,150,7],[151,2,151,7],[152,2,152,7],[6,1,6,4],[13,1,13,5],[15,2,17,2],[15,3,17,3],[15,4,17,4],[11,1,11,5],[7,1,7,4],[12,1,12,5],[16,5,17,5],[15,5,15,7],[16,7,17,7],[74,1,74,4],[18,2,18,6],[15,13,17,13],[76,13,78,13],[18,8,18,13],[16,8,16,9],[77,8,77,9],[77,10,77,12],[16,10,16,12],[15,8,15,12],[76,8,76,12],[76,5,76,7],[76,2,78,2],[76,3,78,3],[76,4,78,4],[16,6,17,6],[79,8,79,13],[77,6,78,6],[77,7,78,7],[156,2,156,7],[157,2,157,7],[79,2,79,4],[77,5,78,5],[137,2,137,7],[138,2,138,7],[155,2,155,7],[135,1,135,4],[139,2,139,7],[140,2,140,7],[141,2,141,7],[142,2,142,7],[147,2,147,7]]}
[null,{"$f":"IF(dms_DataQuality=\"backcast\",INDEX(dms_Worksheet_List,MATCH(dms_Model,dms_Model_List))&\" BACKCAST\",INDEX(dms_Worksheet_List,MATCH(dms_Model,dms_Model_List)))","v":"ANNUAL REPORTING STATEMENT"}]
[null,{"$f":"INDEX(dms_TradingNameFull_List,MATCH(dms_TradingName,dms_TradingName_List))","v":"SA Power Networks"}]
[null,{"$f":"CONCATENATE(\"Annual Reporting RIN Response \",IF(SUM(dms_SingleYear_Model)>0,CONCATENATE(CRY),CONCATENATE(FRCP_y1,\" to \",dms_MultiYear_FinalYear_Result)))","v":"Annual Reporting RIN Response 2017-18"}]
[null,"8.4 OPEX"]
[]
[null,"Instructions"]
[null,"Forecast expenditure is to be taken from Australian Distribution Co.'s distribution determination."]
[null,"If allocating based on assumptions then provide method in Basis of Preparation.  \n\nAll adjustments must be explained in Basis of Preparation with supporting documentation attached. "]
[]
[null,"8.4.1 - OPERATING & MAINTENANCE EXPENDITURE - BY PURPOSE"]
[]
[null,"Australian Distribution Co. is to list the operating expenditure categories identified in Australian Distribution Co.'s regulatory proposal at table 3.2.1.1 current opex categories and cost allocations."]
[null,"Australian Distribution Co. must specify any expenditure category where the expense is more than 5 per cent of the total standard control services operating expenditure."]
[null,"Reported operating expenditure must INCLUDE any profit margins or management fees paid directly or indirectly to related party contractors (not including actual incurred expenditure of the related party contractor) for the regulatory reporting period.  "]
[]
[null,null,"Audited Statutory Accounts","Adjustments","Distribution business","Standard Control Services",null,null,"Alternative Control Services",null,null,null,null,"Negotiated Services"]
[null,null,null,null,null,"CPI Adjusted Forecast","Actual","Difference","Public Lighting",null,"Other"]
[null,null,null,null,null,null,null,null,{"$f":"IF(dms_Jurisdiction=\"Vic\",\"Energy efficient\",\"\")","v":""},{"$f":"IF(dms_Jurisdiction=\"Vic\",\"Non-energy efficient\",\"\")","v":""},"Connection services","Metering services","Ancillary network services"]
[null,"Opex category","$0's, nominal",null,null,null,null,"%","$0's, nominal"]
[null,"Distribution Licence Fee",{"$f":"E20-D20","v":2299110.1399999997},0,{"$f":"SUM(G20,K20:N20)","v":2299110.1399999997},2588222.0607382222,2299110.1399999997,{"$f":"IF(F20=0,1,((G20-F20)/F20)*1)","v":-0.1117029041378934},null,null,0,0,0,0]
[null,"Network Operating Costs",{"$f":"E21-D21","v":35713998.703549907},0,{"$f":"SUM(G21,K21:N21)","v":35713998.703549907},34989218.922384672,35713998.703549907,2.0714374412672307E-2,null,null,0,0,0,0]
[null,"Inspections",{"$f":"E22-D22","v":11939438.675151819},0,{"$f":"SUM(G22,K22:N22)","v":11939438.675151819},14331074.645112554,11939438.675151819,-0.16688462164813117,null,null,0,0,0,0]
[null,"Maintenance and Repair",30288182.732181378,0,30288182.732181378,15566108.244930238,15311648.988976993,-1.6347005426749509E-2,null,null,0,1651037.6532043852,0,13325496.09]
[null,"Substation Property Maintenance",7818000.8856300004,0,7818000.8856300004,7508682.508262272,7818000.8856300004,4.1194760469278877E-2,null,null,0,0,0,0]
[null,"Vegetation Management",38365210.349408701,0,38365210.349408701,37265967.293650165,38365210.349408701,2.9497236636759419E-2,null,null,0,0,0,0]
[null,"Emergency Response",35434504.431148127,0,35434504.431148127,37158566.623321593,35434504.431148127,-4.6397435338407372E-2,null,null,0,0,0,0]
[null,"Guaranteed Service Level Payments",1867082.6400000006,0,1867082.6400000006,11073241.935000412,1867082.6400000006,-0.83138789426260906,null,null,0,0,0,0]
[null,"Network Insurance",1872276.6428235292,0,1872276.6428235292,3346518.1462784559,1872276.6428235292,-0.44052995950264856,null,null,0,0,0,0]
[null,"Call Centre",3579417.2399999993,0,3579417.2399999993,3294214.2271142877,3579417.2399999993,8.6576947709787466E-2,null,null,0,0,0,0]
[null,"Customer Billing (previously Full Retail Contestability)",17380048.129999999,0,17380048.129999999,16560702.955430953,15155255.499533333,-8.4866412958437526E-2,null,null,0,2224792.630466667,0,0]
[null,"Meter Reading",4023534.84,0,4023534.84,0,0,1,null,null,0,3097098.0399999996,0,926436.8]
[null,"Other Customer Services",18893982.529434405,0,18893982.529434405,8309838.6680809129,9266336.7342532706,0.11510428834754416,null,null,0,180815.27518113301,0,9446830.5199999996]
[null,"Corporate Costs and Other Operating",241101474.50324926,-64125097.935793519,176976376.56745574,70964020.890437037,72593463.513004869,2.2961531803328421E-2,null,null,0,878189.60445087089,0,103504723.45]
[null,null,null,null,null,null,null,1]
[null,null,null,null,null,null,null,{"$f":"IF(F35=0,1,((G35-F35)/F35)*1)","v":1}]
[null,null,null,null,null,null,null,1]
[null,null,null,null,null,null,null,1]
[null,null,null,null,null,null,null,1]
[null,null,null,null,null,null,null,1]
[null,null,null,null,null,null,null,1]
[null,null,null,null,null,null,null,{"$f":"IF(F41=0,1,((G41-F41)/F41)*1)","v":1}]
[null,null,null,null,null,null,null,1]
[null,null,null,null,null,null,null,1]
[null,null,null,null,null,null,null,1]
[null,null,null,null,null,null,null,1]
[null,null,null,null,null,null,null,1]
[null,null,null,null,null,null,null,1]
[null,null,null,null,null,null,null,1]
[null,null,null,null,null,null,null,1]
[null,null,null,null,null,null,null,1]
[null,null,null,null,null,null,null,1]
[null,null,null,null,null,null,null,1]
[null,null,null,null,null,null,null,1]
[null,null,null,null,null,null,null,1]
[null,null,null,null,null,null,null,1]
[null,null,null,null,null,null,null,1]
[null,null,null,null,null,null,null,1]
[null,null,null,null,null,null,null,1]
[null,null,null,null,null,null,null,1]
[null,null,null,null,null,null,null,1]
[null,null,null,null,null,null,null,1]
[null,null,null,null,null,null,null,1]
[null,null,null,null,null,null,null,1]
[null,null,null,null,null,null,null,1]
[null,null,null,null,null,null,null,1]
[null,null,null,null,null,null,null,1]
[null,null,null,null,null,null,null,1]
[null,null,null,null,null,null,null,1]
[null,null,null,null,null,null,null,1]
[null,"Total",{"$f":"SUM(C20:C69)","v":450576262.44257712},-64125097.935793519,386451164.5067836,262956377.12074181,251215744.44348052,-4.4648594591301126E-2,{"$f":"SUM(I20:I69)","v":0},0,0,8031933.2033030568,0,127203486.86]
[]
[]
[null,"8.4.2 - OPERATING & MAINTENANCE EXPENDITURE - BY PURPOSE - MARGINS ONLY"]
[]
[null,"\"Related party margin expenditure' must COMPRISE ONLY profit margins or management fees paid directly or indirectly to related party contractors (for expenditure that is not an actual incurred expenditure of the related party contractor) for the regulatory reporting period."]
[]
[null,null,"Audited Statutory Accounts","Adjustments","Distribution business","Standard Control Services",null,null,"Alternative Control Services",null,null,null,null,"Negotiated Services"]
[null,null,null,null,null,"CPI Adjusted Forecast","Actual","Difference","Public Lighting",null,"Other"]
[null,null,null,null,null,null,null,null,{"$f":"IF(dms_Jurisdiction=\"Vic\",\"Energy efficient\",\"\")","v":""},{"$f":"IF(dms_Jurisdiction=\"Vic\",\"Non-energy efficient\",\"\")","v":""},"Connection services","Metering services","Ancillary network services"]
[null,"Opex category","$0's, nominal",null,null,null,"$0's, nominal","per cent","$0's, nominal"]
[null,{"$f":"IF(ISBLANK(B20),\"\",B20)","v":"Distribution Licence Fee"},{"$f":"E81-D81","v":0},0,{"$f":"SUM(G81,K81:N81)","v":0},0,0,{"$f":"IF(F81=0,1,((G81-F81)/F81)*1)","v":1},null,null,0,0,0,0]
[null,"Network Operating Costs",{"$f":"E82-D82","v":3076.4000000000005},0,{"$f":"SUM(G82,K82:N82)","v":3076.4000000000005},0,3076.4000000000005,1,null,null,0,0,0,0]
[null,"Inspections",{"$f":"E83-D83","v":0},0,{"$f":"SUM(G83,K83:N83)","v":0},0,0,1,null,null,0,0,0,0]
[null,"Maintenance and Repair",257472.45,0,257472.45,0,21575.22,1,null,null,0,22517.49,0,213379.74]
[null,"Substation Property Maintenance",0,0,0,0,0,1,null,null,0,0,0,0]
[null,"Vegetation Management",0,0,0,0,0,1,null,null,0,0,0,0]
[null,"Emergency Response",12372.22,0,12372.22,0,12372.22,1,null,null,0,0,0,0]
[null,"Guaranteed Service Level Payments",0,0,0,0,0,{"$f":"IF(F88=0,1,((G88-F88)/F88)*1)","v":1},null,null,0,0,0,0]
[null,"Network Insurance",0,0,0,0,0,1,null,null,0,0,0,0]
[null,"Call Centre",0,0,0,0,0,1,null,null,0,0,0,0]
[null,"Customer Billing (previously Full Retail Contestability)",0,0,0,0,0,1,null,null,0,0,0,0]
[null,"Meter Reading",0,0,0,0,0,1,null,null,0,0,0,0]
[null,"Other Customer Services",0,0,0,0,0,1,null,null,0,0,0,0]
[null,"Corporate Costs and Other Operating",6744.63,0,6744.63,0,0,1,null,null,0,0,0,6744.63]
[null,"",null,null,null,null,null,1]
[null,"",null,null,null,null,null,1]
[null,"",null,null,null,null,null,{"$f":"IF(F97=0,1,((G97-F97)/F97)*1)","v":1}]
[null,"",null,null,null,null,null,1]
[null,"",null,null,null,null,null,1]
[null,"",null,null,null,null,null,1]
[null,"",null,null,null,null,null,1]
[null,"",null,null,null,null,null,1]
[null,"",null,null,null,null,null,{"$f":"IF(F103=0,1,((G103-F103)/F103)*1)","v":1}]
[null,"",null,null,null,null,null,1]
[null,"",null,null,null,null,null,1]
[null,"",null,null,null,null,null,1]
[null,"",null,null,null,null,null,1]
[null,"",null,null,null,null,null,1]
[null,"",null,null,null,null,null,1]
[null,"",null,null,null,null,null,1]
[null,"",null,null,null,null,null,1]
[null,"",null,null,null,null,null,1]
[null,"",null,null,null,null,null,1]
[null,"",null,null,null,null,null,1]
[null,"",null,null,null,null,null,1]
[null,"",null,null,null,null,null,1]
[null,"",null,null,null,null,null,1]
[null,"",null,null,null,null,null,1]
[null,"",null,null,null,null,null,1]
[null,"",null,null,null,null,null,1]
[null,"",null,null,null,null,null,1]
[null,"",null,null,null,null,null,1]
[null,"",null,null,null,null,null,1]
[null,"",null,null,null,null,null,1]
[null,"",null,null,null,null,null,1]
[null,"",null,null,null,null,null,1]
[null,"",null,null,null,null,null,1]
[null,"",null,null,null,null,null,1]
[null,"",null,null,null,null,null,1]
[null,"",null,null,null,null,null,1]
[null,"Total",{"$f":"SUM(C81:C130)","v":279665.7},{"$f":"SUM(D81:D130)","v":0},{"$f":"SUM(E81:E130)","v":279665.7},{"$f":"SUM(F81:F130)","v":0},{"$f":"SUM(G81:G130)","v":37023.840000000004},1,{"$f":"SUM(I81:I130)","v":0},0,0,22517.49,0,220124.37]
[]
[]
[null,"8.4.3 - OPERATING & MAINTENANCE EXPENDITURE - EXPLANATION OF MATERIAL DIFFERENCE"]
[]
[null,"Where the difference between forecast and actual expenditure shown in table 8.4.1, column I is a Material Difference please explain the main factors driving the difference."]
[]
[null,"Category","Explanation"]
[null,"Distribution Licence Fee","Forecast assumed CPI escalation, but this has not been applied to date by ESCoSA."]
[null,"Inspections","Lower contractor costs through competitive tender.  Timing of cyclical program."]
[null,"Guaranteed Service Level Payments","No major weather event days in 2017/18, following 9 in the previous year, leading to lower GSL costs."]
[null,"Network Insurance","Primarily due to favourable negotiation of insurance policy premiums."]
[null,"Other Customer Services","Unforecasted expenditure associated with self-insurance costs for substation fire, development of customer analytics for meter contestability, and increased customer engagement."]

{"sheet":"9.5 TUoS","index":22,"n_rows":67,"n_cols":6,"rows_kept":67,"cut":false,"hidden":false,"merged":[[64,1,64,4],[58,1,58,4],[24,1,24,4],[25,1,25,4],[66,1,66,4],[60,1,60,4],[55,1,55,4],[65,1,65,4],[47,1,47,4],[51,1,51,4],[52,1,52,4],[53,1,53,4],[54,1,54,4],[48,1,48,4],[49,1,49,4],[50,1,50,4],[57,1,57,4],[61,1,61,4],[59,1,59,4],[62,1,62,4],[63,1,63,4],[5,1,5,3],[26,1,26,3],[30,2,30,5],[42,1,42,4],[31,2,31,5],[9,1,9,4],[12,1,12,4],[13,1,13,4],[14,1,14,4],[20,1,20,4],[23,1,23,4],[15,1,15,3],[10,1,10,4],[11,1,11,4],[21,1,21,4],[22,1,22,4]]}
[null,{"$f":"IF(dms_DataQuality=\"backcast\",INDEX(dms_Worksheet_List,MATCH(dms_Model,dms_Model_List))&\" BACKCAST\",INDEX(dms_Worksheet_List,MATCH(dms_Model,dms_Model_List)))","v":"ANNUAL REPORTING STATEMENT"}]
[null,{"$f":"INDEX(dms_TradingNameFull_List,MATCH(dms_TradingName,dms_TradingName_List))","v":"SA Power Networks"}]
[null,{"$f":"CONCATENATE(\"Annual Reporting RIN Response \",IF(SUM(dms_SingleYear_Model)>0,CONCATENATE(CRY),CONCATENATE(FRCP_y1,\" to \",dms_MultiYear_FinalYear_Result)))","v":"Annual Reporting RIN Response 2017-18"}]
[null,"9.5 - TUoS AUDIT (t-2)"]
[]
[null,"This template collects information for annual pricing proposals from Victorian businesses only.\n"]
[]
[null,"9.5.1 - TUOS CHARGES (AEMO)"]
[null,null,null,null,null,{"$f":"CRY","v":"2017-18"}]
[]
[]
[]
[]
[]
[]
[null,null,null,null,"Total",{"$f":"SUM(F10:F15)","v":0}]
[]
[]
[null,"9.5.2 - TRANSMISSION CONNECTION FEES"]
[null,null,null,null,null,{"$f":"CRY","v":"2017-18"}]
[]
[]
[]
[]
[]
[]
[null,null,null,null,"Total",{"$f":"SUM(F21:F26)","v":0}]
[]
[]
[null,"9.5.3 - CROSS BOUNDARY NETWORK CHARGES"]
[null,null,"Amount (payable)/receivable"]
[null,null,"$0's, nominal"]
[null,null,"HV crossings","Subtransmission crossings","TUoS Adjustment","Total"]
[null,"Distribution Business",null,null,null,{"$f":"CRY","v":"2017-18"}]
[null,null,null,null,null,{"$f":"IF((SUM(C35:E35)=0),\"\",(SUM(C35:E35)))","v":""}]
[null,null,null,null,null,{"$f":"IF((SUM(C36:E36)=0),\"\",(SUM(C36:E36)))","v":""}]
[null,null,null,null,null,""]
[null,null,null,null,null,""]
[null,null,null,null,null,""]
[null,null,null,null,null,""]
[null,null,null,null,null,""]
[null,null,null,null,null,""]
[null,"Total",null,null,null,""]
[]
[]
[null,"9.5.4 - PAYMENTS TO EMBEDDED GENERATORS"]
[null,"9.5.4.1 - AVOIDED TRANSMISSION COSTS",null,null,null,"2016-17"]
[]
[]
[]
[]
[]
[]
[]
[]
[null,"Total",null,null,null,{"$f":"SUM(F48:F55)","v":0}]
[null,"9.5.4.2 - AVOIDED TUoS USAGE CHARGES",null,null,null,"2016-17"]
[]
[]
[]
[]
[]
[]
[]
[]
[null,"Total",null,null,null,{"$f":"SUM(F58:F65)","v":0}]
[null,"Total payments to embedded generators",null,null,null,{"$f":"F66+F56","v":0}]