{"text_format":"1","workbook":"xlsx","n_sheets":23,"sheets":["AER only","Contents","Instructions","Business & other details","2.11 Labour","3.6 Quality of services","3.6.8 Network-feeders","3.6.9 Network-reliability","4.1 Public lighting","6.2 STPIS Reliability","6.6 STPIS Customer Service","6.7 STPIS Daily Performance","6.8 STPIS Exclusions","6.9 STPIS - GSL","7.8 Avoided TUOS Payments","7.10 Juris Scheme","7.11 DMIS-DMIA","7.12 Safety and Bushfire","7.13 TARC","8.1 Income","8.2 Capex","8.4 Opex","9.5 TUoS"],"not_rendered":{"charts":0,"images":8,"macros":1,"external_links":1,"defined_names":711,"comments":2,"pivot_tables":0},"unopened":[],"bounds":{"document_bytes":16777216,"sheet_cells":100000,"rows_first":2000,"rows_last":500,"rows_between":2000,"halvings":0,"cell_chars":16384,"cell_head_chars":4096},"cells_cut":0,"cells_raw":0,"read":"whole","date_system":"1900"}

{"sheet":"AER only","index":0,"n_rows":223,"n_cols":40,"rows_kept":223,"cut":false,"hidden":true,"merged":[[93,1,95,1],[96,1,100,1],[104,1,105,1],[148,1,148,8],[54,1,54,5],[54,14,54,21],[54,25,54,29],[54,30,54,33],[72,14,72,15],[72,25,72,28],[0,1,0,11],[4,27,4,38],[6,27,6,30],[6,33,6,37],[53,25,53,29],[53,30,53,33]]}
[null,"Data in these columns used for data validation and database purposes."]
[null,"Date last modified:","2017-01-16","added (Albury and Victora) for AGN"]
[null,null,"2016-10-17","updated TransGrid's correct legal name, corrected TasNetworks (T) to June financial year"]
[null,null,"2017-02-01","inserted Power and Water, added NRs (dms_FeederCat_1 and dms_FeederCat_2)"]
[null,null,"2017-03-03","inserted AEMO as a business",null,null,null,null,null,null,null,null,null,null,null,null,null,null,null,null,null,null,null,null,null,null,null,"FOR ELECTRICITY BUSINESSES ONLY"]
[null,null,"2018-03-28","major changes to accommodate STPIS"]
[null,null,"Template Version",5,null,null,null,null,null,null,null,null,null,null,null,null,null,null,null,null,null,null,null,null,null,null,null,"Feeder Types",null,null,null,"TasNetworks (D)","MAIFI flag","Feeder Names"]
[]
[null,null,null,null,null,null,null,null,null,null,null,null,null,null,null,null,null,null,null,null,null,null,null,null,null,null,null,"CBD","Urban","Short rural","long rural","EXTRA"]
[null,"dms_TradingName_List","dms_TradingNameFull_List","dms_ABN_List","dms_JurisdictionList","dms_Sector_List","dms_Segment_List","dms_FormControl_List","dms_RPT_List","dms_RPTMonth_List","dms_CRCPlength_List","dms_FRCPlength_List","dms_663_List","dms_DeterminationRef_List","dms_Addr1_List","dms_Addr2_List","dms_Suburb_List","dms_State_List","dms_PostCode_List","dms_PAddr1_List","dms_PAddr2_List","dms_PSuburb_List","dms_PState_List","dms_PPostCode_List","dms_ContactName1_List","dms_ContactPh1_List","dms_ContactEmail_List","dms_CBD_flag","dms_Urban_flag","dms_ShortRural_flag","dms_LongRural_flag","dms_FeederType_5_flag","dms_MAIFI_flag_List","dms_FeederName_1","dms_FeederName_2","dms_FeederName_3","dms_FeederName_4","dms_FeederName_5","dms_Public_Lighting_List","Column1"]
[null,"ActewAGL Distribution","ActewAGL Distribution",76670568688,"ACT","Electricity","Distribution","Revenue cap","Financial","June",5,5,5,"2014-19 Distribution Determination","40 Bunda Street",null,"CANBERRA","ACT",2600,"GPO BOX 366",null,"CANBERRA","ACT",2601,"Robert Walker","02 6248 3847","robert.walker@actewagle.com.au","NO","YES","YES","NO","NO",null,"CBD","Urban","Short rural","Long rural","  ","NO","ActewAGL Distribution"]
[null,"ActewAGL Distribution (Tx Assets)","ActewAGL Distribution (Tx Assets)",76670568688,"ACT","Electricity","Distribution","Revenue cap","Financial","June",5,5,5,"distribution determination","40 Bunda Street",null,"CANBERRA","ACT",2600,"GPO BOX 366",null,"CANBERRA","ACT",2601,"Robert Walker","02 6248 3847","robert.walker@actewagle.com.au","NO","YES","YES","NO","NO",null,"CBD","Urban","Short rural","Long rural","  ","NO","ActewAGL Distribution (Tx Assets)"]
[null,"ActewAGL Gas","ActewAGL Gas",76670568688,"ACT","Gas","Distribution","Weighted average price cap","Financial","June",5,5,"x",null,"40 Bunda Street",null,"CANBERRA","ACT",2600,"GPO BOX 366",null,"CANBERRA","ACT",2601,"Philip Deamer","02 6248 3438","GasAAReview@actewagl.com.au","NO","NO","NO","NO","NO",null,"CBD","Urban","Short rural","Long rural","  ","NO","ActewAGL Gas"]
[null,"AEMO","Australian Energy Market Operator Ltd",94072010327,"Vic","Electricity","Transmission","-","Financial","March",5,5,"x","-","Level 22","530 Collins Street","MELBOURNE","VIC",3000,"GPO Box 2008",null,"MELBOURNE","VIC",3001,null,null,null,"NO","NO","NO","NO","NO",null,"CBD","Urban","Short rural","Long rural","  ","NO","AEMO"]
[null,"AGN (Albury and Victoria)","Australian Gas Networks Limited (reporting data for Albury and Victoria)",19078551685,"Vic","Gas","Distribution","Weighted average price cap","Calendar","December",5,5,"x",null,"Level 6","400 King William Street","ADELAIDE","SA",5000,"PO Box 6468","Halifax Street","ADELAIDE","SA",5000,"Craig de Laine","08 8418 1129 ","craig.delaine@agn.com.au","NO","NO","NO","NO","NO",null,"CBD","Urban","Short rural","Long rural","  ","NO","AGN (Albury)"]
[null,"AGN (Albury)","Australian Gas Networks Limited (reporting data for Albury)",19078551685,"Vic","Gas","Distribution","Weighted average price cap","Calendar","December",5,5,"x",null,"Level 6","400 King William Street","ADELAIDE","SA",5000,"PO Box 6468","Halifax Street","ADELAIDE","SA",5000,"Craig de Laine","08 8418 1129 ","craig.delaine@agn.com.au","NO","NO","NO","NO","NO",null,"CBD","Urban","Short rural","Long rural","  ","NO"]
[null,"AGN (SA)","Australian Gas Networks Limited (reporting data for SA)",19078551685,"SA","Gas","Distribution","Weighted average price cap","Financial","June",5,5,5,"distribution determination","Level 6","400 King William Street","ADELAIDE","SA",5000,"PO Box 6468","Halifax Street","ADELAIDE","SA",5000,"Craig de Laine","08 8418 1129 ","craig.delaine@agn.com.au","NO","NO","NO","NO","NO",null,"CBD","Urban","Short rural","Long rural","  ","NO","AGN (SA)"]
[null,"AGN (Victoria)","Australian Gas Networks Limited (reporting data for Victoria)",19078551685,"Vic","Gas","Distribution","Weighted average price cap","Calendar","December",5,5,"x",null,"Level 6","400 King William Street","ADELAIDE","SA",5000,"PO Box 6468","Halifax Street","ADELAIDE","SA",5000,"Craig de Laine","08 8418 1129 ","craig.delaine@agn.com.au","NO","NO","NO","NO","NO",null,"CBD","Urban","Short rural","Long rural","  ","NO","AGN (Victoria)"]
[null,"Amadeus","APT Pipelines (NT) Pty Ltd",39009737393,"NT","Gas","Transmission","Weighted average price cap","Financial","June",5,5,"x","n/a","Level 19, HSBC Building","580 George Street","SYDNEY","NSW",2000,"Level 19, HSBC Building","580 George Street","SYDNEY","NSW",2000,"Alexandra Curran","02 9275 0020","alexandra.curran@apa.com.au","NO","NO","NO","NO","NO",null,"CBD","Urban","Short rural","Long rural","  ","NO","Amadeus"]
[null,"APA GasNet","APA GasNet Australia (Operations) Pty Ltd","065083009","Vic","Gas","Transmission","Weighted average price cap","Calendar","December",5,5,"x",null,"Level 19, HSBC Building","580 George Street","SYDNEY","NSW",2000,"PO Box R41",null,"ROYAL EXCHANGE","NSW",1225,"Alexandra Curran","02 9275 0020","alexandra.curran@apa.com.au","NO","NO","NO","NO","NO",null,"CBD","Urban","Short rural","Long rural","  ","NO","APA GasNet"]
[null,"Ausgrid","Ausgrid",78508211731,"NSW","Electricity","Distribution","Revenue cap","Financial","June",5,5,5,"2014-19 Distribution Determination","570 George St",null,"SYDNEY","NSW",2000,"GPO Box 4009",null,"SYDNEY","NSW",2001,"John Thomson","02 9269 2312","john.thomson@ausgrid.com.au","YES","YES","YES","YES","NO",null,"CBD","Urban","Short rural","Long rural","  ","YES","Ausgrid"]
[null,"Ausgrid (Tx Assets)","Ausgrid (Tx Assets)",67505337385,"NSW","Electricity","Distribution","Revenue cap","Financial","June",5,5,5,"distribution determination","570 George St",null,"SYDNEY","NSW",2000,"GPO Box 4009",null,"SYDNEY","NSW",2001,"John Thomson","02 9269 2312","john.thomson@ausgrid.com.au","YES","YES","YES","YES","NO",null,"CBD","Urban","Short rural","Long rural","  ","NO","Ausgrid (Tx Assets)"]
[null,"AusNet (D)","AusNet Electricity Services Pty Ltd",91064651118,"Vic","Electricity","Distribution","Revenue cap","Calendar","December",5,5,2,"2016-20 Distribution Determination","Level 32","2 Southbank Boulevard","SOUTHBANK","Vic",3006,"Locked Bag 14051",null,"MELBOURNE CITY MAIL CENTRE","VIC",8001,"please provide contact details",null,null,"NO","YES","YES","YES","NO",null,"CBD","Urban","Short rural","Long rural","  ","YES","AusNet (D)"]
[null,"AusNet (Gas)","AusNet Gas Services","086015036","Vic","Gas","Distribution","Weighted average price cap","Calendar","December",5,5,"X",null,"Level 19, HSBC Building","580 George Street","SYDNEY","NSW",2000,"PO Box R41",null,"ROYAL EXCHANGE","NSW",1225,"Alexandra Curran","02 9275 0020","alexandra.curran@apa.com.au","NO","NO","NO","NO","NO",null,"CBD","Urban","Short rural","Long rural","  ","NO","AusNet (Gas)"]
[null,"AusNet (T)","Ausnet Services (Transmission) Ltd",48116124362,"Vic","Electricity","Transmission","Revenue cap","Financial","March",5,5,2,"transmission determination","Level 32","2 Southbank Boulevard","SOUTHBANK","Vic",3006,"Locked Bag 14051",null,"MELBOURNE CITY MAIL CENTRE","Vic",8001,"Clare Thompson","03 9695 6670","clare.e.thompson@ausnetservices.com.au","NO","NO","NO","NO","NO",null,"CBD","Urban","Short rural","Long rural","  ","NO","AusNet (T)"]
[null,"Australian Distribution Co.","Australian Distribution Co.",11222333444,"-","Electricity","Distribution","Revenue cap","Financial","June",5,5,2,"distribution determination","123 Straight Street",null,"SYDNEY","NSW",2000,"PO Box 123",null,"SYDNEY","NSW",2000,"Bob Smith","02 1234 5678","bob@auselec.net.au","YES","YES","YES","YES","NO",null,"CBD","Urban","Short rural","Long rural","  ","YES","Australian Distribution Co."]
[null,"Australian Distribution Co. (Vic)","Australian Distribution Co. (Victoria)",11222333444,"Vic","Electricity","Distribution","Revenue cap","Calendar","December",5,5,2,"distribution determination","123 Straight Street",null,"MELBOURNE","Vic",3000,"PO Box 123",null,"MELBOURNE","VIC",3000,"Bob Smith","02 1234 5678","bob@auselec.net.au","NO","NO","NO","NO","NO",null,"CBD","Urban","Short rural","Long rural","  ","YES","Australian Distribution Co. (Vic)"]
[null,"Australian Distribution Co. (Gas)","Australian Gas Distribution Co. ",11222333444,"NSW","Gas","Distribution","Weighted average price cap","Financial","June",5,5,null,null,"123 Straight Street",null,"SYDNEY","NSW",2000,"PO Box 123",null,"SYDNEY","NSW",2000,"Bob Smith","02 1234 5678","bob@auselec.net.au","NO","NO","NO","NO","NO",null,"CBD","Urban","Short rural","Long rural","  ","NO","Australian Distribution Co. (Vic)"]
[null,"Australian Transmission Co.","Australian Transmission Co.",11222333444,"-","Electricity","Transmission","Revenue cap","Financial","June",5,5,5,"transmission determination","123 Straight Street",null,"SYDNEY","NSW",2000,"PO Box 123",null,"SYDNEY","NSW",2000,"Bob Smith","02 1234 5678","bob@auselec.net.au","NO","NO","NO","NO","NO",null,"CBD","Urban","Short rural","Long rural","  ","NO","Australian Transmission Co."]
[null,"Central Ranges Pipeline (D)","Central Ranges Pipeline Pty Ltd",108218355,"NSW","Gas","Distribution","Weighted average price cap","Financial","June",15,5,5,"distribution determination","Level 19","580 George Street","SYDNEY","NSW",2000,"PO Box R41",null,"ROYAL EXCHANGE","NSW",1225,"Scott Young","02 9275 0031","scott.young@apa.com.au","NO","NO","NO","NO","NO",null,"CBD","Urban","Short rural","Long rural","  ","NO"]
[null,"Central Ranges Pipeline (T)","Central Ranges Pipeline Pty Ltd",108218355,"NSW","Gas","Distribution","Weighted average price cap","Financial","June",14,5,5,"transmission determination","Level 19","580 George Street","SYDNEY","NSW",2000,"PO Box R41",null,"ROYAL EXCHANGE","NSW",1225,"Scott Young","02 9275 0031","scott.young@apa.com.au","NO","NO","NO","NO","NO",null,"CBD","Urban","Short rural","Long rural","  ","NO"]
[null,"CitiPower","CitiPower",76064651056,"Vic","Electricity","Distribution","Revenue cap","Calendar","December",5,5,2,"2016-20 Distribution Determination","40 Market Street",null,"MELBOURNE","Vic",3000,"Locked Bag 14090",null,"MELBOURNE","VIC",8001,"Hannah Williams","03 9683 4088","hwilliams@powercor.com.au","YES","YES","NO","NO","NO",null,"CBD","Urban","Short rural","Long rural","  ","YES","CitiPower"]
[null,"Directlink","Directlink",16779340889,"Qld","Electricity","Transmission","Revenue cap","Financial","June",9,5,5,"transmission determination","Level 19, HSBC Building","580 George Street","SYDNEY","NSW",2000,"PO Box R41",null,"ROYAL EXCHANGE","NSW",1225,"Scott Young","02 9275 0031","scott.young@apa.com.au","NO","NO","NO","NO","NO",null,"CBD","Urban","Short rural","Long rural","  ","NO","Directlink"]
[null,"ElectraNet","ElectraNet",41094482416,"SA","Electricity","Transmission","Revenue cap","Financial","June",5,5,5,"transmission determination","52-55 East Terrace","Rymill Park","ADELAIDE","SA",5000,"PO Box 7096","Hutt Street Post Office","ADELAIDE","SA",5000,"Bill Jackson","08 8404 7969","jackson.bill@electranet.com.au","NO","NO","NO","NO","NO",null,"CBD","Urban","Short rural","Long rural","  ","NO","ElectraNet"]
[null,"Endeavour Energy","Endeavour Energy",11247365823,"NSW","Electricity","Distribution","Revenue cap","Financial","June",5,5,5,"2014-19 Distribution Determination","51 Huntingwood Drive",null,"HUNTINGWOOD","NSW",2148,"PO Box 811",null,"SEVEN HILLS","NSW",1730,"Jon Hocking","02 9853 4386 / 0407 348 156","Jon.Hocking@Endeavourenergy.com.au","NO","YES","YES","YES","NO",null,"CBD","Urban","Short rural","Long rural","  ","YES","Endeavour Energy"]
[null,"Energex","Energex",40078849055,"Qld","Electricity","Distribution","Revenue cap","Financial","June",5,5,5,"2015-20 Distribution Determination","26 Reddacliff Street",null,"NEWSTEAD","Qld",4006,"26 Reddacliff Street",null,"NEWSTEAD","QLD",4006,"Jenny Doyle, Group Manager Regulatory Affairs","(07) 3851 6416","jenny.doyle@ergon.com.au","YES","YES","YES","NO","NO",null,"CBD","Urban","Short rural","Long rural","  ","YES","Energex"]
[null,"Ergon Energy","Ergon Energy",50087646062,"Qld","Electricity","Distribution","Revenue cap","Financial","June",5,5,5,"2015-20 Distribution Determination","22 Walker Street",null,"TOWNSVILLE","Qld",4810,"Po Box 264",null,"FORTITUDE VALLEY","QLD",4006,"Jenny Doyle, Group Manager Regulatory Affairs","(07) 3851 6416","jenny.doyle@ergon.com.au","NO","YES","YES","YES","NO",null,"CBD","Urban","Short rural","Long rural","  ","YES","Ergon Energy"]
[null,"Essential Energy","Essential Energy",37428185226,"NSW","Electricity","Distribution","Revenue cap","Financial","June",5,5,5,"2014-19 Distribution Determination","8 Buller Street",null,"PORT MACQUARIE","NSW",2444,"PO Box 5730",null,"PORT MACQUARIE","NSW",2444,"Catherine Waddell","02 6338 3553","catherine.waddell@essentialenergy.com.au","NO","NO","YES","YES","NO",null,"CBD","Urban","Short rural","Long rural","  ","YES","Essential Energy"]
[null,"Jemena Electricity","Jemena Electricity",82064651083,"Vic","Electricity","Distribution","Revenue cap","Calendar","December",5,5,2,"2016-20 Distribution Determination","Level 16","567 Collins Street","MELBOURNE","VIC",3000,"PO Box 16182",null,"MELBOURNE","VIC",8001,"Matthew Serpell","03 9173 8231","matthew.serpell@jemena.com.au","NO","YES","YES","NO","NO",null,"CBD","Urban","Short rural","Long rural","  ","YES","Jemena Electricity"]
[null,"JGN","Jemena Gas Networks (NSW) Ltd","003 004 322","NSW","Gas","Distribution","Weighted average price cap","Financial","June",5,5,null,null,null,null,null,null,null,null,null,null,null,null,"please provide contact details",null,null,"NO","NO","NO","NO","NO",null,"CBD","Urban","Short rural","Long rural","  ","NO","JGN"]
[null,"Multinet Gas","Multinet Gas (DB No.1) Pty Ltd (ACN 086 026 986), Multinet Gas (DB No.2) Pty Ltd (ACN 086 230 122)","086026986","Vic","Gas","Distribution","Weighted average price cap","Calendar","December",5,5,"x",null,"43-45 Centreway",null,"MT WAVERLEY","Vic",3149,null,null,null,null,null,"Andrew Schille","03 8846 9860","andrew.schille@ue.com.au","NO","NO","NO","NO","NO",null,"CBD","Urban","Short rural","Long rural","  ","NO","Multinet Gas"]
[null,"Murraylink","Murraylink",79181207909,"SA","Electricity","Transmission","Revenue cap","Financial","June",5,5,5,"transmission determination","Level 19","580 George Street","SYDNEY","NSW",2000,"PO Box R41",null,"ROYAL EXCHANGE","NSW",1225,"Scott Young","02 9275 0031","scott.young@apa.com.au","NO","NO","NO","NO","NO",null,"CBD","Urban","Short rural","Long rural","  ","NO","Murraylink"]
[null,"Power and Water","Power and Water Corporation",15947352360,"NT","Electricity","Distribution","Revenue cap","Financial","June",5,5,"x","distribution determination","GPO Box 1921",null,"DARWIN","NT",801,"GPO Box 1921",null,"DARWIN","NT",801,"Lucy Moon","08 8924 5822","Lucy.Moon@powerwater.com.au","YES","YES","YES","YES","NO",null,"CBD","Urban","Short rural","Long rural","  ","NO","Power and Water"]
[null,"Powercor Australia","Powercor Australia",89064651109,"Vic","Electricity","Distribution","Revenue cap","Calendar","December",5,5,2,"2016-20 Distribution Determination","40 Market Street",null,"MELBOURNE","Vic",3000,"Locked bag 14090",null,"MELBOURNE","VIC",8001,"Hannah Williams","03 9683 4088","hwilliams@powercor.com.au","NO","NO","YES","YES","NO",null,"CBD","Urban","Short rural","Long rural","  ","YES","Powercor Australia"]
[null,"Powerlink","Queensland Electricity Transmission Corporation Limited trading as Powerlink Queensland",82078849233,"Qld","Electricity","Transmission","Revenue cap","Financial","June",5,5,5,"transmission determination","33 Harold St",null,"VIRGINIA","Qld",4014,"PO Box 1193",null,"VIRGINIA","QLD",4014,"Jennifer Harris","07 3860 2667","jharris@powerlink.com.au","NO","NO","NO","NO","NO",null,"CBD","Urban","Short rural","Long rural","  ","NO","Powerlink"]
[null,"Roma to Brisbane Pipeline","APT Petroleum Pipelines Limited t/a Roma to Brisbane Pipeline","009 737 393","Qld","Gas","Transmission","Weighted average price cap","Financial","June",5,5,"x","n/a","580 George Street",null,"SYDNEY","NSW",2000,"PO Box R41",null,"ROYAL EXCHANGE","NSW",1225,"Mark Allen","02 9275 0010","mark.allen@apa.com.au","NO","NO","NO","NO","NO",null,"CBD","Urban","Short rural","Long rural","  ","NO","Roma to Brisbane Pipeline"]
[null,"SA Power Networks","SA Power Networks",13332330749,"SA","Electricity","Distribution","Revenue cap","Financial","June",5,5,5,"2015-20 Distribution Determination","1 Anzac Highway",null,"KESWICK","SA",5035,"GPO Box 77",null,"ADELAIDE","SA",5000,"Richard Sibly","08 8404 5613","richard.sibly@sapowernetworks.com.au","NO","NO","YES","YES","NO",null,"CBD","Urban","Short rural","Long rural","  ","NO","SA Power Networks"]
[null,"TasNetworks (D)","TasNetworks (D)",24167357299,"Tas","Electricity","Distribution","Revenue cap","Financial","June",5,5,5,"distribution determination","1-7 Maria Street",null,"LENAH VALLEY","Tas",7008,"PO Box 606",null,"MOONAH","Tas",7009,"John Sayers","03 6271 6469","john.sayers@tasnetworks.com.au","YES","YES","YES","YES","YES",null,"Critical Infrastructure","High density commercial","Urban","High density rural","Low density rural","YES","TasNetworks (D)"]
[null,"TasNetworks (T)","TasNetworks (T)",24167357299,"Tas","Electricity","Transmission","Revenue cap","Financial","June",5,5,5,"transmission determination","1-7 Maria Street",null,"LENAH VALLEY","Tas",7008,"PO Box 606",null,"MOONAH","Tas",7009,"John Sayers","03 6271 6469","john.sayers@tasnetworks.com.au","NO","NO","NO","NO","NO",null,"CBD","Urban","Short rural","Long rural","  ","NO","TasNetworks (T)"]
[null,"TransGrid","NSW Electricity Networks Operations Pty Ltd trading as TransGrid","70 250 995 390","NSW","Electricity","Transmission","Revenue cap","Financial","June",4,5,5,"transmission determination","180 Thomas Street",null,"SYDNEY","NSW",2000,"PO Box A1000",null,"SYDNEY SOUTH","NSW",1235,"Garrie Chubb","0408 210 221","garrie.chubb@transgrid.com.au","NO","NO","NO","NO","NO",null,"CBD","Urban","Short rural","Long rural","  ","NO","TransGrid"]
[null,"United Energy","United Energy",70064651029,"Vic","Electricity","Distribution","Revenue cap","Calendar","December",5,5,2,"2016-20 Distribution Determination","Level 3","6 Nexus Court","MULGRAVE","Vic",3149,"PO Box 449",null,"MOUNT WAVERLEY","VIC",3170,"Mathew Abraham","03 8846 9758","mathew.abraham@ue.com.au","NO","NO","YES","NO","NO",null,"CBD","Urban","Short rural","Long rural","  ","YES","United Energy"]
[]
[]
[null,null,null,null,null,null,null,null,null,null,null,null,null,null,null,null,null,null,null,null,null,null,null,null,null,"For EB & Reset RINs only",null,null,null,null,"For AARs only"]
[null,"The Reg Year Ending (dms_RYE) must be set to the last year of the regulatory period. For forecast data is is usually (FRCP_y5) for actual it is a single year (CRY). For historical actual data the RYE will need to be set manually in the business details sheet by setting the dms_Multiyear_flag to 1 and putting the correct value in 'dms_Specified_FinalYear. See cells C67:C68",null,null,null,null,null,null,null,null,null,null,null,"Drop down selector box for CA & Reset RINs.","For CA & Reset RINs only",null,null,null,null,null,null,null,null,null,null,"for DNSP only",null,null,null,null,"For DNSPs only"]
[null,"dms_Model_List ","dms_Worksheet_List",null,"dms_RYE_Formula_Result",null,null,null,null,null,null,null,null,"dms_0203_ProjectType","dms_020303_01_UOM","dms_020501_01_UOM","dms_020501_02_UOM","dms_020501_03_UOM","dms_020501_04_UOM","dms_020603_01_UOM","dms_020701_01_UOM","dms_020701_02_UOM","dms_020701_01_Rows","dms_040102_01_UOM","dms_040102_04_UOM","dms_030601_01_UOM","dms_030601_02_UOM","dms_030701_01_UOM","dms_030702_01_UOM","dms_030703_01_UOM","dms_030605_UOM","dms_03060703_UOM"]
[null,"ARR","ANNUAL REPORTING STATEMENT",null,{"$f":"LEFT(dms_SingleYear_FinalYear_Result,2)&RIGHT(dms_SingleYear_FinalYear_Result,2)","v":"2018"},"=LEFT(dms_SingleYear_FinalYear_Result,2)&RIGHT(dms_SingleYear_FinalYear_Result,2)",null,"Formula errors are OK",null,null,null,null,null,"New line on new route - single circuit","Circuit line length in km","0's","0's","0's","0's","0's","km","km","Route line length within zone","0's","days","minutes/customer","minutes/customer","Customer / km","%","km","number","number"]
[null,"CA","CATEGORY ANALYSIS",null,{"$f":"LEFT(dms_SingleYear_FinalYear_Result,2)&RIGHT(dms_SingleYear_FinalYear_Result,2)","v":"2018"},"=LEFT(dms_SingleYear_FinalYear_Result,2)&RIGHT(dms_SingleYear_FinalYear_Result,2)",null,"Formula errors are OK",null,null,null,null,null,"New line on new route - dual circuit","Circuit line length in km","0's","0's","0's","0's","0's","0's","0's","Number of maintenance spans","0's","0's","minutes/customer","minutes/customer","MWh/customer","Number of spans",null,"number","number"]
[null,"CESS","CAPITLAL EXPENDITURE SHARING SCHEMING",null,"2016","=LEFT(dms_SingleYear_FinalYear_Result,2)&RIGHT(dms_SingleYear_FinalYear_Result,2)",null,null,null,null,null,null,null,"New line on new route - other","Circuit line length in km","MVA added","MVA added","MVA added","MVA added","0's","km","km","Total length of maintenance spans","0's","$0s","interruptions/customer","interruptions/customer","kVA / customer","Number of spans",null,"number","number"]
[null,"CPI","CPI",null,null,null,null,null,null,null,null,null,null,"Line rebuild over existing route - single circuit","Circuit line length in km","0's","0's","0's","0's","0's","km","km","Length of vegetation corridors","$0s","0's","interruptions/customer","interruptions/customer",null,"Number of spans",null,"number","number"]
[null,"EB","ECONOMIC BENCHMARKING",null,{"$f":"LEFT(dms_SingleYear_FinalYear_Result,2)&RIGHT(dms_SingleYear_FinalYear_Result,2)","v":"2018"},"=LEFT(dms_SingleYear_FinalYear_Result,2)&RIGHT(dms_SingleYear_FinalYear_Result,2)",null,"Formula errors are OK",null,null,null,null,null,"Line rebuild over existing route - dual circuit","Number","total spend $0s","total spend $0s","total spend $0s","total spend $0s","(per cent)","0's","0's","Average number of trees per maintenance span",null,null,null,null,null,"Number of spans",null,"number","(per cent)"]
[null,"PTRM","POST TAX REVENUE MODEL",null,{"$f":"LEFT(dms_MultiYear_FinalYear_Result,2)&RIGHT(dms_MultiYear_FinalYear_Result,2)","v":"2025"},"=LEFT(dms_MultiYear_FinalYear_Result,2)&RIGHT(dms_MultiYear_FinalYear_Result,2)",null,null,null,null,null,null,null,"Reconductor - Single circuit","Number","net circuit km added","net circuit km added","net circuit km added","net circuit km added",null,"years","years","Average frequency of cutting cycle",null,null,null,null,null,"Years",null,"number"]
[null,"Reset","REGULATORY REPORTING STATEMENT",null,{"$f":"LEFT(dms_MultiYear_FinalYear_Result,2)&RIGHT(dms_MultiYear_FinalYear_Result,2)","v":"2025"},"=LEFT(dms_MultiYear_FinalYear_Result,2)&RIGHT(dms_MultiYear_FinalYear_Result,2)",null,"Formula errors are OK",null,null,null,null,null,"Reconductor - Dual circuit","Number","total spend $0s","total spend $0s","total spend $0s","total spend $0s",null,null,null,null,null,null,null,null,null,"Years",null,"number"]
[null,"RFM","ROLL FORWARD MODEL",null,{"$f":"LEFT(dms_CRCP_FinalYear_Result,2)&RIGHT(dms_CRCP_FinalYear_Result,2)","v":"2018"},"=LEFT(dms_CRCP_FinalYear_Result,2)&RIGHT(dms_CRCP_FinalYear_Result,2)",null,null,null,null,null,null,null,"Other",null,"net circuit km added","net circuit km added","net circuit km added","net circuit km added",null,null,null,null,null,null,null,null,null,"Trees",null,"number"]
[null,"WACC","WEIGHTED AVERAGE COST OF CAPITAL",null,{"$f":"LEFT(dms_MultiYear_FinalYear_Result,2)&RIGHT(dms_MultiYear_FinalYear_Result,2)","v":"2025"},"=LEFT(dms_MultiYear_FinalYear_Result,2)&RIGHT(dms_MultiYear_FinalYear_Result,2)",null,null,null,null,null,null,null,null,null,"total spend $0s","total spend $0s","total spend $0s","total spend $0s",null,null,null,null,null,null,null,null,null,"Trees",null,"number"]
[null,null,null,null,null,null,null,null,null,null,null,null,null,null,null,"0's",null,"$0s",null,null,null,null,null,null,null,null,null,null,"Defects",null,"number"]
[null,"dms_DataQuality_List",null,null,null,null,null,null,null,null,null,null,null,null,null,"0's",null,null,null,null,null,null,null,null,null,null,null,null,"Defects",null,"number"]
[null,"Actual",null,null,null,null,null,null,null,null,null,null,null,null,null,"0's",null,null,null,null,null,null,null,null,null,null,null,null,"Spans",null,"number"]
[null,"Estimate",null,null,null,null,null,null,null,null,null,null,null,null,null,"$0s",null,null,null,null,null,null,null,null,null,null,null,null,"km",null,"(per cent)"]
[null,"Consolidated",null,null,null,null,null,null,null,null,null,null,null,null,null,null,null,null,null,null,null,null,null,null,null,null,null,null,"Spans",null,"(per cent)",""]
[null,"Recast"]
[null,"Public"]
[null,null,null,null,null,null,null,null,null,null,null,null,null,null,"For PTRM files - this field set the text for the named range \"DMS_Xfactor\" which in all cases is simply the text \"x factors\" - this saves putting in each old gas PTRM file ",null,null,null,null,null,null,null,null,null,null,"for TNSP only"]
[null,"For all files either AER or business needs to be able to specify the type of submission","For PTRM & RFM templates we must provide a choice in case they change their form of control - otherwise it is drawn from the business specific lookup table above.",null,null,null,null,null,null,null,null,null,null,null,"DMS_Xfactor",null,null,null,null,null,null,null,null,null,null,"dms_030601_01_UOM",null,"dms_030701_01_UOM","dms_030702_01_UOM"]
[null,"dms_SourceList","dms_FormControl_Choices",null,null,null,null,null,null,null,null,null,null,null,"x factors",null,null,null,null,null,null,null,null,null,null,"%",null,"Number of spans","km"]
[null,"After appeal","Revenue cap",null,null,null,null,null,null,null,null,null,null,null,null,null,null,null,null,null,null,null,null,null,null,"number",null,"Years","%"]
[null,"Draft decision","Revenue yield",null,null,null,null,null,null,null,null,null,null,null,null,null,null,null,null,null,null,null,null,null,null,"number",null,"Trees","km"]
[null,"Final decision","Weighted average price cap",null,null,null,null,null,null,null,null,null,null,null,null,null,null,null,null,null,null,null,null,null,null,"%",null,"Defects","number"]
[null,"PTRM update 1",null,null,null,null,null,null,null,null,null,null,null,null,null,null,null,null,null,null,null,null,null,null,null,"number",null,"Number of spans"]
[null,"PTRM update 2",null,null,null,null,null,null,null,null,null,null,null,null,null,null,null,null,null,null,null,null,null,null,null,"number",null,"km"]
[null,"PTRM update 3",null,null,null,null,null,null,null,null,null,null,null,null,null,null,null,null,null,null,null,null,null,null,null,"%",null,"km"]
[null,"PTRM update 4",null,null,null,null,null,null,null,null,null,null,null,null,null,null,null,null,null,null,null,null,null,null,null,"number",null,"Number of spans"]
[null,"PTRM update 5",null,null,null,null,null,null,null,null,null,null,null,null,null,null,null,null,null,null,null,null,null,null,null,"number"]
[null,"PTRM update 6",null,null,null,null,null,null,null,null,null,null,null,null,null,null,null,null,null,null,null,null,null,null,null,"%"]
[null,"PTRM update 7",null,null,null,null,null,null,null,null,null,null,null,null,null,null,null,null,null,null,null,null,null,null,null,"number"]
[null,"Regulatory proposal",null,null,null,null,null,null,null,null,null,null,null,null,null,null,null,null,null,null,null,null,null,null,null,"%"]
[null,"Reporting",null,null,null,null,null,null,null,null,null,null,null,null,null,null,null,null,null,null,null,null,null,null,null,"number"]
[null,"Revised regulatory proposal",null,null,null,null,null,null,null,null,null,null,null,null,null,null,null,null,null,null,null,null,null,null,null,"%"]
[null,null,null,null,null,null,null,null,null,null,null,null,null,null,null,null,null,null,null,null,null,null,null,null,null,"number"]
[]
[]
[]
[null,"Reason for interruption","dms_Reason_Interruption_Detailed","dms_Reason_Interruption","dms_STPIS_Exclusion_List","dms_020301_ProjectType_List","dms_020302_ProjectType_List"]
[null,"Animal","Animal impact","Animal","Weather","New substation establishment","New line on new route - single circuit"]
[null,null,"Animal nesting/burrowing, etc and other","Asset failure","Equipment failure","Capacity upgrade","New line on new route - dual circuit"]
[null,null,"Other","Other","Operational error","Voltage upgrade","New line on new route - other"]
[null,"Asset failure","LV","Overloads","Vegetation","Other","Line rebuild over existing route - single circuit"]
[null,null,"Distribution substation","Planned","Animals",null,"Line rebuild over existing route - dual circuit"]
[null,null,"HV","Network business","Third party impacts",null,"Reconductor - Single circuit"]
[null,null,"Zone substation","Third party","Transmission failure",null,"Reconductor - Dual circuit"]
[null,null,"Subtransmission","Unknown","Load shedding",null,"Reconductor - Other"]
[null,"Other","insert description of 'other'","Vegetation","Inter-distributor connection failure",null,"Line upgrade - raising/retensoring"]
[null,"Overloads","-","Weather","Other",null,"Line upgrade - voltage upgrade"]
[null,"Planned","-","2 - STPIS Exclusion (3.3)(a)",null,null,"Line upgrade - capacity"]
[null,"Network business","Network error","3 - STPIS Exclusion (3.3)(a)",null,null,"String spare circuit"]
[null,null,"Switching and protection error","4 - STPIS Exclusion (3.3)(a)",null,null,"Other"]
[null,"Third party","Fire","5 - STPIS Exclusion (3.3)(a)"]
[null,null,"Other","6 - STPIS Exclusion (3.3)(a)"]
[null,null,"Dig-in","7 - STPIS Exclusion (3.3)(a)"]
[null,null,"Unauthorised access"]
[null,null,"Vehicle impact"]
[null,"Unknown","Unknown"]
[null,"Vegetation","Blow-in/Fall-in - NSP responsibility"]
[null,null,"Grow-in - NSP responsibility"]
[null,null,"Blow-in/Fall-in - Other responsible party"]
[null,null,"Grow-in - Other responsible party"]
[null,"Weather"]
[null,"2 - STPIS Exclusion (3.3)(a)"]
[null,"3 - STPIS Exclusion (3.3)(a)"]
[null,"4 - STPIS Exclusion (3.3)(a)"]
[null,"5 - STPIS Exclusion (3.3)(a)"]
[null,"6 - STPIS Exclusion (3.3)(a)"]
[null,"7 - STPIS Exclusion (3.3)(a)"]
[]
[]
[]
[]
[]
[]
[]
[null,"These are indeces and lookup values for various dates. All step from the value placed in FRCP_y1 on the business and other details worksheet",{"$f":"IF(dms_FifthFeeder_flag_NSP=\"NO\",\"This NSP has only 4 feeder categories\",\"This NSP has 5 feeder categories\")","v":"This NSP has 5 feeder categories"},null,null,null,null,null,null,null,null,null,null,null,"These date tables are currently used in the Recast templates to provide column headings and conditional formatting"]
[null,"dms_FRCPlength_Num_List","dms_FinalYear_List","dms_CRCPlength_Num_List","dms_CFinalYear_List","dms_FRCP_years",null,"dms_CRCP_years",null,"dms_CRCP_index",null,"dms_Financial_Years","dms_Calendar_Years",null,"CRY from input cell on business sheet","CRY - financial","dms_FinYears","CRY calendar","dms_CalYears"]
[null,1,"dms_FRCP_y1",1,"CRCP_y1",{"$f":"FRCP_y1","v":"2020-21"},"dms_FRCP_y1",{"$f":"IF(dms_RPT=\"financial\",VALUE(LEFT(dms_FRCP_y1,4)-1)&\"-\"&TEXT(VALUE(MID(dms_FRCP_y1,3,2)),\"00\"),VALUE(LEFT(dms_FRCP_y1,4)-1))","v":"2019-20"},"dms_CRCP_yZ",1,null,"2005-06","2006",null,{"$f":"CRY","v":"2017-18"},{"$f":"VALUE(LEFT(CRY,4))&\"-\"&TEXT(MID(CRY,3,2)+1,\"00\")","v":"2017-18"},"dms_CRYf_y1",{"$f":"VALUE(LEFT(CRY,4)+1)","v":2018},"dms_CRYc_y1"]
[null,2,"dms_FRCP_y2",2,"CRCP_y2",{"$f":"IF(dms_RPT=\"financial\",VALUE(LEFT(dms_FRCP_y1,4)+1)&\"-\"&TEXT(VALUE(RIGHT(dms_FRCP_y1,2)+1),\"00\"),VALUE(LEFT(dms_FRCP_y1,4)+1))","v":"2021-22"},"dms_FRCP_y2",{"$f":"IF(dms_RPT=\"financial\",VALUE(LEFT(dms_CRCP_yZ,4)-1)&\"-\"&TEXT(VALUE(MID(dms_CRCP_yZ,3,2)),\"00\"),VALUE(LEFT(dms_CRCP_yZ,4)-1))","v":"2018-19"},"dms_CRCP_yY",2,null,"2006-07","2007",null,null,{"$f":"VALUE(LEFT(dms_CRYf_y1,4)+1)&\"-\"&TEXT(MID(dms_CRYf_y1,3,2)+2,\"00\")","v":"2018-19"},"dms_CRYf_y2",{"$f":"VALUE(LEFT(dms_CRYc_y1,4)+1)","v":2019},"dms_CRYc_y2"]
[null,3,"dms_FRCP_y3",3,"CRCP_y3",{"$f":"IF(dms_RPT=\"financial\",VALUE(LEFT(dms_FRCP_y2,4)+1)&\"-\"&TEXT(VALUE(RIGHT(dms_FRCP_y2,2)+1),\"00\"),VALUE(LEFT(dms_FRCP_y2,4)+1))","v":"2022-23"},"dms_FRCP_y3",{"$f":"IF(dms_RPT=\"financial\",VALUE(LEFT(dms_CRCP_yY,4)-1)&\"-\"&TEXT(VALUE(MID(dms_CRCP_yY,3,2)),\"00\"),VALUE(LEFT(dms_CRCP_yY,4)-1))","v":"2017-18"},"dms_CRCP_yX",3,null,"2007-08","2008",null,null,{"$f":"VALUE(LEFT(dms_CRYf_y2,4)+1)&\"-\"&TEXT(MID(dms_CRYf_y2,3,2)+2,\"00\")","v":"2019-20"},"dms_CRYf_y3",{"$f":"VALUE(LEFT(dms_CRYc_y2,4)+1)","v":2020},"dms_CRYc_y3"]
[null,4,"dms_FRCP_y4",4,"CRCP_y4",{"$f":"IF(dms_RPT=\"financial\",VALUE(LEFT(dms_FRCP_y3,4)+1)&\"-\"&TEXT(VALUE(RIGHT(dms_FRCP_y3,2)+1),\"00\"),VALUE(LEFT(dms_FRCP_y3,4)+1))","v":"2023-24"},"dms_FRCP_y4",{"$f":"IF(dms_RPT=\"financial\",VALUE(LEFT(dms_CRCP_yX,4)-1)&\"-\"&TEXT(VALUE(MID(dms_CRCP_yX,3,2)),\"00\"),VALUE(LEFT(dms_CRCP_yX,4)-1))","v":"2016-17"},"dms_CRCP_yW",4,null,"2008-09","2009",null,null,{"$f":"VALUE(LEFT(dms_CRYf_y3,4)+1)&\"-\"&TEXT(MID(dms_CRYf_y3,3,2)+2,\"00\")","v":"2020-21"},"dms_CRYf_y4",{"$f":"VALUE(LEFT(dms_CRYc_y3,4)+1)","v":2021},"dms_CRYc_y4"]
[null,5,"dms_FRCP_y5",5,"CRCP_y5",{"$f":"IF(dms_RPT=\"financial\",VALUE(LEFT(dms_FRCP_y4,4)+1)&\"-\"&TEXT(VALUE(RIGHT(dms_FRCP_y4,2)+1),\"00\"),VALUE(LEFT(dms_FRCP_y4,4)+1))","v":"2024-25"},"dms_FRCP_y5",{"$f":"IF(dms_RPT=\"financial\",VALUE(LEFT(dms_CRCP_yW,4)-1)&\"-\"&TEXT(VALUE(MID(dms_CRCP_yW,3,2)),\"00\"),VALUE(LEFT(dms_CRCP_yW,4)-1))","v":"2015-16"},"dms_CRCP_yV",5,null,"2009-10",2010,null,null,{"$f":"VALUE(LEFT(dms_CRYf_y4,4)+1)&\"-\"&TEXT(MID(dms_CRYf_y4,3,2)+2,\"00\")","v":"2021-22"},"dms_CRYf_y5",{"$f":"VALUE(LEFT(dms_CRYc_y4,4)+1)","v":2022},"dms_CRYc_y5"]
[null,6,"dms_FRCP_y6",6,"CRCP_y6",{"$f":"IF(dms_RPT=\"financial\",VALUE(LEFT(dms_FRCP_y5,4)+1)&\"-\"&TEXT(VALUE(RIGHT(dms_FRCP_y5,2)+1),\"00\"),VALUE(LEFT(dms_FRCP_y5,4)+1))","v":"2025-26"},"dms_FRCP_y6",{"$f":"IF(dms_RPT=\"financial\",VALUE(LEFT(dms_CRCP_yV,4)-1)&\"-\"&TEXT(VALUE(MID(dms_CRCP_yV,3,2)),\"00\"),VALUE(LEFT(dms_CRCP_yV,4)-1))","v":"2014-15"},"dms_CRCP_yU",6,null,"2010-11",2011,null,null,{"$f":"VALUE(LEFT(dms_CRYf_y5,4)+1)&\"-\"&TEXT(MID(dms_CRYf_y5,3,2)+2,\"00\")","v":"2022-23"},"dms_CRYf_y6",{"$f":"VALUE(LEFT(dms_CRYc_y5,4)+1)","v":2023},"dms_CRYc_y6"]
[null,7,"dms_FRCP_y7",7,"CRCP_y7",{"$f":"IF(dms_RPT=\"financial\",VALUE(LEFT(dms_FRCP_y6,4)+1)&\"-\"&TEXT(VALUE(RIGHT(dms_FRCP_y6,2)+1),\"00\"),VALUE(LEFT(dms_FRCP_y6,4)+1))","v":"2026-27"},"dms_FRCP_y7",{"$f":"IF(dms_RPT=\"financial\",VALUE(LEFT(dms_CRCP_yU,4)-1)&\"-\"&TEXT(VALUE(MID(dms_CRCP_yU,3,2)),\"00\"),VALUE(LEFT(dms_CRCP_yU,4)-1))","v":"2013-14"},"dms_CRCP_yT",7,null,"2011-12",2012,null,null,{"$f":"VALUE(LEFT(dms_CRYf_y6,4)+1)&\"-\"&TEXT(MID(dms_CRYf_y6,3,2)+2,\"00\")","v":"2023-24"},"dms_CRYf_y7",{"$f":"VALUE(LEFT(dms_CRYc_y6,4)+1)","v":2024},"dms_CRYc_y7"]
[null,8,"dms_FRCP_y8",8,"CRCP_y8",{"$f":"IF(dms_RPT=\"financial\",VALUE(LEFT(dms_FRCP_y7,4)+1)&\"-\"&TEXT(VALUE(RIGHT(dms_FRCP_y7,2)+1),\"00\"),VALUE(LEFT(dms_FRCP_y7,4)+1))","v":"2027-28"},"dms_FRCP_y8",{"$f":"IF(dms_RPT=\"financial\",VALUE(LEFT(dms_CRCP_yT,4)-1)&\"-\"&TEXT(VALUE(MID(dms_CRCP_yT,3,2)),\"00\"),VALUE(LEFT(dms_CRCP_yT,4)-1))","v":"2012-13"},"dms_CRCP_yS",8,null,"2012-13",2013,null,null,{"$f":"VALUE(LEFT(dms_CRYf_y7,4)+1)&\"-\"&TEXT(MID(dms_CRYf_y7,3,2)+2,\"00\")","v":"2024-25"},"dms_CRYf_y8",{"$f":"VALUE(LEFT(dms_CRYc_y7,4)+1)","v":2025},"dms_CRYc_y8"]
[null,9,"dms_FRCP_y9",9,"CRCP_y9",{"$f":"IF(dms_RPT=\"financial\",VALUE(LEFT(dms_FRCP_y8,4)+1)&\"-\"&TEXT(VALUE(RIGHT(dms_FRCP_y8,2)+1),\"00\"),VALUE(LEFT(dms_FRCP_y8,4)+1))","v":"2028-29"},"dms_FRCP_y9",{"$f":"IF(dms_RPT=\"financial\",VALUE(LEFT(dms_CRCP_yS,4)-1)&\"-\"&TEXT(VALUE(MID(dms_CRCP_yS,3,2)),\"00\"),VALUE(LEFT(dms_CRCP_yS,4)-1))","v":"2011-12"},"dms_CRCP_yR",9,null,"2013-14",2014,null,null,{"$f":"VALUE(LEFT(dms_CRYf_y8,4)+1)&\"-\"&TEXT(MID(dms_CRYf_y8,3,2)+2,\"00\")","v":"2025-26"},"dms_CRYf_y9",{"$f":"VALUE(LEFT(dms_CRYc_y8,4)+1)","v":2026},"dms_CRYc_y9"]
[null,10,"dms_FRCP_y10",10,"CRCP_y10",{"$f":"IF(dms_RPT=\"financial\",VALUE(LEFT(dms_FRCP_y9,4)+1)&\"-\"&TEXT(VALUE(RIGHT(dms_FRCP_y9,2)+1),\"00\"),VALUE(LEFT(dms_FRCP_y9,4)+1))","v":"2029-30"},"dms_FRCP_y10",{"$f":"IF(dms_RPT=\"financial\",VALUE(LEFT(dms_CRCP_yR,4)-1)&\"-\"&TEXT(VALUE(MID(dms_CRCP_yR,3,2)),\"00\"),VALUE(LEFT(dms_CRCP_yR,4)-1))","v":"2010-11"},"dms_CRCP_yQ",10,null,"2014-15",2015,null,null,{"$f":"VALUE(LEFT(dms_CRYf_y9,4)+1)&\"-\"&TEXT(MID(dms_CRYf_y9,3,2)+2,\"00\")","v":"2026-27"},"dms_CRYf_y10",{"$f":"VALUE(LEFT(dms_CRYc_y9,4)+1)","v":2027},"dms_CRYc_y10"]
[null,11,"dms_FRCP_y11",11,"CRCP_y11",{"$f":"IF(dms_RPT=\"financial\",VALUE(LEFT(dms_FRCP_y10,4)+1)&\"-\"&TEXT(VALUE(RIGHT(dms_FRCP_y10,2)+1),\"00\"),VALUE(LEFT(dms_FRCP_y10,4)+1))","v":"2030-31"},"dms_FRCP_y11",{"$f":"IF(dms_RPT=\"financial\",VALUE(LEFT(dms_CRCP_yQ,4)-1)&\"-\"&TEXT(VALUE(MID(dms_CRCP_yQ,3,2)),\"00\"),VALUE(LEFT(dms_CRCP_yQ,4)-1))","v":"2009-10"},"dms_CRCP_yP",11,null,"2015-16",2016,null,null,{"$f":"VALUE(LEFT(dms_CRYf_y10,4)+1)&\"-\"&TEXT(MID(dms_CRYf_y10,3,2)+2,\"00\")","v":"2027-28"},"dms_CRYf_y11",{"$f":"VALUE(LEFT(dms_CRYc_y10,4)+1)","v":2028},"dms_CRYc_y11"]
[null,12,"dms_FRCP_y12",12,"CRCP_y12",{"$f":"IF(dms_RPT=\"financial\",VALUE(LEFT(dms_FRCP_y11,4)+1)&\"-\"&TEXT(VALUE(RIGHT(dms_FRCP_y11,2)+1),\"00\"),VALUE(LEFT(dms_FRCP_y11,4)+1))","v":"2031-32"},"dms_FRCP_y12",{"$f":"IF(dms_RPT=\"financial\",VALUE(LEFT(dms_CRCP_yP,4)-1)&\"-\"&TEXT(VALUE(MID(dms_CRCP_yP,3,2)),\"00\"),VALUE(LEFT(dms_CRCP_yP,4)-1))","v":"2008-09"},"dms_CRCP_yO",12,null,"2016-17",2017,null,null,{"$f":"VALUE(LEFT(dms_CRYf_y11,4)+1)&\"-\"&TEXT(MID(dms_CRYf_y11,3,2)+2,\"00\")","v":"2028-29"},"dms_CRYf_y12",{"$f":"VALUE(LEFT(dms_CRYc_y11,4)+1)","v":2029},"dms_CRYc_y12"]
[null,13,"dms_FRCP_y13",13,"CRCP_y13",{"$f":"IF(dms_RPT=\"financial\",VALUE(LEFT(dms_FRCP_y12,4)+1)&\"-\"&TEXT(VALUE(RIGHT(dms_FRCP_y12,2)+1),\"00\"),VALUE(LEFT(dms_FRCP_y12,4)+1))","v":"2032-33"},"dms_FRCP_y13",{"$f":"IF(dms_RPT=\"financial\",VALUE(LEFT(dms_CRCP_yO,4)-1)&\"-\"&TEXT(VALUE(MID(dms_CRCP_yO,3,2)),\"00\"),VALUE(LEFT(dms_CRCP_yO,4)-1))","v":"2007-08"},"dms_CRCP_yN",13,null,"2017-18",2018,null,null,{"$f":"VALUE(LEFT(dms_CRYf_y12,4)+1)&\"-\"&TEXT(MID(dms_CRYf_y12,3,2)+2,\"00\")","v":"2029-30"},"dms_CRYf_y13",{"$f":"VALUE(LEFT(dms_CRYc_y12,4)+1)","v":2030},"dms_CRYc_y13"]
[null,14,"dms_FRCP_y14",14,"CRCP_y14",{"$f":"IF(dms_RPT=\"financial\",VALUE(LEFT(dms_FRCP_y13,4)+1)&\"-\"&TEXT(VALUE(RIGHT(dms_FRCP_y13,2)+1),\"00\"),VALUE(LEFT(dms_FRCP_y13,4)+1))","v":"2033-34"},"dms_FRCP_y14",{"$f":"IF(dms_RPT=\"financial\",VALUE(LEFT(dms_CRCP_yN,4)-1)&\"-\"&TEXT(VALUE(MID(dms_CRCP_yN,3,2)),\"00\"),VALUE(LEFT(dms_CRCP_yN,4)-1))","v":"2006-07"},"dms_CRCP_yM",14,null,"2018-19",2019,null,null,{"$f":"VALUE(LEFT(dms_CRYf_y13,4)+1)&\"-\"&TEXT(MID(dms_CRYf_y13,3,2)+2,\"00\")","v":"2030-31"},"dms_CRYf_y14",{"$f":"VALUE(LEFT(dms_CRYc_y13,4)+1)","v":2031},"dms_CRYc_y14"]
[null,15,"dms_FRCP_y15",15,"CRCP_y15",{"$f":"IF(dms_RPT=\"financial\",VALUE(LEFT(dms_FRCP_y14,4)+1)&\"-\"&TEXT(VALUE(RIGHT(dms_FRCP_y14,2)+1),\"00\"),VALUE(LEFT(dms_FRCP_y14,4)+1))","v":"2034-35"},"dms_FRCP_y15",{"$f":"IF(dms_RPT=\"financial\",VALUE(LEFT(dms_CRCP_yM,4)-1)&\"-\"&TEXT(VALUE(MID(dms_CRCP_yM,3,2)),\"00\"),VALUE(LEFT(dms_CRCP_yM,4)-1))","v":"2005-06"},"dms_CRCP_yL",15,null,"2019-20",2020,null,null,{"$f":"VALUE(LEFT(dms_CRYf_y14,4)+1)&\"-\"&TEXT(MID(dms_CRYf_y14,3,2)+2,\"00\")","v":"2031-32"},"dms_CRYf_y15",{"$f":"VALUE(LEFT(dms_CRYc_y14,4)+1)","v":2032},"dms_CRYc_y15"]
[null,null,null,null,null,null,null,null,null,null,null,"2020-21",2021,null,null,{"$f":"VALUE(LEFT(dms_CRYf_y15,4)+1)&\"-\"&TEXT(MID(dms_CRYf_y15,3,2)+2,\"00\")","v":"2032-33"},"dms_CRYf_y16",{"$f":"VALUE(LEFT(dms_CRYc_y15,4)+1)","v":2033},"dms_CRYc_y16"]
[null,"These are drop down lists for businesses to select the correct FRCP_y1 on the business and other details worksheet.\nThis also populates the column headings in the worksheets",null,null,null,null,null,null,null,null,null,"2021-22",2022,null,null,{"$f":"VALUE(LEFT(dms_CRYf_y16,4)+1)&\"-\"&TEXT(MID(dms_CRYf_y16,3,2)+2,\"00\")","v":"2033-34"},"dms_CRYf_y17",{"$f":"VALUE(LEFT(dms_CRYc_y16,4)+1)","v":2034},"dms_CRYc_y17"]
[null,"dms_RCP_fyear_list","dms_CRY_ListF","dms_CRY_ListC","dms_RCP_cyear_list","dms_FRCP_fyear_list","dms_FRCP_ListF","dms_FRCP_ListC","dms_FRCP_cyear_list",null,null,"2022-23",2023,null,null,{"$f":"VALUE(LEFT(dms_CRYf_y17,4)+1)&\"-\"&TEXT(MID(dms_CRYf_y17,3,2)+2,\"00\")","v":"2034-35"},"dms_CRYf_y18",{"$f":"VALUE(LEFT(dms_CRYc_y17,4)+1)","v":2035},"dms_CRYc_y18"]
[null,"dms_y1",{"$f":"CRY","v":"2017-18"},"2006","dms_cy1","dms_frcp_fy1","2010-11",2011,"dms_crcp_cy1",null,null,"2023-24",2024,null,null,{"$f":"VALUE(LEFT(dms_CRYf_y18,4)+1)&\"-\"&TEXT(MID(dms_CRYf_y18,3,2)+2,\"00\")","v":"2035-36"},"dms_CRYf_y19",{"$f":"VALUE(LEFT(dms_CRYc_y18,4)+1)","v":2036},"dms_CRYc_y19"]
[null,"dms_y2",{"$f":"IF(dms_RPT=\"financial\",VALUE(LEFT(CRY,4)+1)&\"-\"&TEXT(MID(CRY,3,2)+2,\"00\"),VALUE(LEFT(CRY,4)+1))","v":"2018-19"},"2007","dms_cy2","dms_frcp_fy2","2011-12",2012,"dms_crcp_cy2",null,null,"2024-25",2025,null,null,{"$f":"VALUE(LEFT(dms_CRYf_y19,4)+1)&\"-\"&TEXT(MID(dms_CRYf_y19,3,2)+2,\"00\")","v":"2036-37"},"dms_CRYf_y20",{"$f":"VALUE(LEFT(dms_CRYc_y19,4)+1)","v":2037},"dms_CRYc_y20"]
[null,"dms_y3",{"$f":"IF(dms_RPT=\"financial\",VALUE(LEFT(dms_fy2,4)+1)&\"-\"&TEXT(MID(dms_fy2,3,2)+2,\"00\"),VALUE(LEFT(dms_fy2,4)+1))","v":"2019-20"},"2008","dms_cy3","dms_frcp_fy3","2012-13",2013,"dms_crcp_cy3",null,null,"2025-26",2026]
[null,"dms_y4",{"$f":"IF(dms_RPT=\"financial\",VALUE(LEFT(dms_fy3,4)+1)&\"-\"&TEXT(MID(dms_fy3,3,2)+2,\"00\"),VALUE(LEFT(dms_fy3,4)+1))","v":"2020-21"},"2009","dms_cy4","dms_frcp_fy4","2013-14",2014,"dms_crcp_cy4",null,null,"2026-27",2027]
[null,"dms_y5",{"$f":"IF(dms_RPT=\"financial\",VALUE(LEFT(dms_fy4,4)+1)&\"-\"&TEXT(MID(dms_fy4,3,2)+2,\"00\"),VALUE(LEFT(dms_fy4,4)+1))","v":"2021-22"},2010,"dms_cy5","dms_frcp_fy5","2014-15",2015,"dms_crcp_cy5",null,null,"2027-28",2028]
[null,"dms_y6",{"$f":"IF(dms_RPT=\"financial\",VALUE(LEFT(dms_fy5,4)+1)&\"-\"&TEXT(MID(dms_fy5,3,2)+2,\"00\"),VALUE(LEFT(dms_fy5,4)+1))","v":"2022-23"},2011,"dms_cy6","dms_frcp_fy6","2015-16",2016,"dms_crcp_cy6",null,null,"2028-29",2029]
[null,"dms_y7",{"$f":"IF(dms_RPT=\"financial\",VALUE(LEFT(dms_fy6,4)+1)&\"-\"&TEXT(MID(dms_fy6,3,2)+2,\"00\"),VALUE(LEFT(dms_fy6,4)+1))","v":"2023-24"},2012,"dms_cy7","dms_frcp_fy7","2016-17",2017,"dms_crcp_cy7",null,null,"2029-30",2030]
[null,"dms_y8",{"$f":"IF(dms_RPT=\"financial\",VALUE(LEFT(dms_fy7,4)+1)&\"-\"&TEXT(MID(dms_fy7,3,2)+2,\"00\"),VALUE(LEFT(dms_fy7,4)+1))","v":"2024-25"},2013,"dms_cy8","dms_frcp_fy8","2017-18",2018,"dms_crcp_cy8",null,null,"2030-31",2031]
[null,"dms_y9",{"$f":"IF(dms_RPT=\"financial\",VALUE(LEFT(dms_fy8,4)+1)&\"-\"&TEXT(MID(dms_fy8,3,2)+2,\"00\"),VALUE(LEFT(dms_fy8,4)+1))","v":"2025-26"},2014,"dms_cy9","dms_frcp_fy9","2018-19",2019,"dms_crcp_cy9",null,null,"2031-32",2032]
[null,"dms_y10",{"$f":"IF(dms_RPT=\"financial\",VALUE(LEFT(dms_fy9,4)+1)&\"-\"&TEXT(MID(dms_fy9,3,2)+2,\"00\"),VALUE(LEFT(dms_fy9,4)+1))","v":"2026-27"},2015,"dms_cy10","dms_frcp_fy10","2019-20",2020,"dms_crcp_cy10",null,null,"2032-33",2033]
[null,"dms_y11",{"$f":"IF(dms_RPT=\"financial\",VALUE(LEFT(dms_fy10,4)+1)&\"-\"&TEXT(MID(dms_fy10,3,2)+2,\"00\"),VALUE(LEFT(dms_fy10,4)+1))","v":"2027-28"},2016,"dms_cy11","dms_frcp_fy11","2020-21",2021,"dms_crcp_cy11",null,null,"2033-34",2034]
[null,"dms_y12",{"$f":"IF(dms_RPT=\"financial\",VALUE(LEFT(dms_fy11,4)+1)&\"-\"&TEXT(MID(dms_fy11,3,2)+2,\"00\"),VALUE(LEFT(dms_fy11,4)+1))","v":"2028-29"},2017,"dms_cy12","dms_frcp_fy12","2021-22",2022,"dms_crcp_cy12",null,null,"2034-35",2035]
[null,"dms_y13",{"$f":"IF(dms_RPT=\"financial\",VALUE(LEFT(dms_fy12,4)+1)&\"-\"&TEXT(MID(dms_fy12,3,2)+2,\"00\"),VALUE(LEFT(dms_fy12,4)+1))","v":"2029-30"},2018,"dms_cy13","dms_frcp_fy13","2022-23",2023,"dms_crcp_cy13",null,null,"2035-36",2036]
[null,"dms_y14",{"$f":"IF(dms_RPT=\"financial\",VALUE(LEFT(dms_fy13,4)+1)&\"-\"&TEXT(MID(dms_fy13,3,2)+2,\"00\"),VALUE(LEFT(dms_fy13,4)+1))","v":"2030-31"},2019,"dms_cy14","dms_frcp_fy14","2023-24",2024,"dms_crcp_cy14"]
[null,"dms_y15",{"$f":"IF(dms_RPT=\"financial\",VALUE(LEFT(dms_fy14,4)+1)&\"-\"&TEXT(MID(dms_fy14,3,2)+2,\"00\"),VALUE(LEFT(dms_fy14,4)+1))","v":"2031-32"},2020,"dms_cy15","dms_frcp_fy15","2024-25",2025,"dms_crcp_cy15"]
[null,"dms_y16",{"$f":"IF(dms_RPT=\"financial\",VALUE(LEFT(dms_fy15,4)+1)&\"-\"&TEXT(MID(dms_fy15,3,2)+2,\"00\"),VALUE(LEFT(dms_fy15,4)+1))","v":"2032-33"},2021,"dms_cy16"]
[null,"dms_y17",{"$f":"IF(dms_RPT=\"financial\",VALUE(LEFT(dms_fy16,4)+1)&\"-\"&TEXT(MID(dms_fy16,3,2)+2,\"00\"),VALUE(LEFT(dms_fy16,4)+1))","v":"2033-34"},2022,"dms_cy17"]
[null,"dms_y18",{"$f":"IF(dms_RPT=\"financial\",VALUE(LEFT(dms_fy17,4)+1)&\"-\"&TEXT(MID(dms_fy17,3,2)+2,\"00\"),VALUE(LEFT(dms_fy17,4)+1))","v":"2034-35"},2023,"dms_cy18"]
[null,"dms_y19",{"$f":"IF(dms_RPT=\"financial\",VALUE(LEFT(dms_fy18,4)+1)&\"-\"&TEXT(MID(dms_fy18,3,2)+2,\"00\"),VALUE(LEFT(dms_fy18,4)+1))","v":"2035-36"},2024,"dms_cy19"]
[null,"dms_y20",{"$f":"IF(dms_RPT=\"financial\",VALUE(LEFT(dms_fy19,4)+1)&\"-\"&TEXT(MID(dms_fy19,3,2)+2,\"00\"),VALUE(LEFT(dms_fy19)+1))","v":"2036-37"},2025,"dms_cy20"]
[]
[]
[]
[]
[]
[null,"These \"row descriptions\" are the column headings in the various templates but become row descriptions in the ETL process"]
[null,null,"Table 6.3 sustained interruptions - row descriptions"]
[null,null,"dms_060301_CustNo_Affected_Row","dms_060301_Avg_Duration_Sustained_Int_Row","dms_060301_Effect_unplanned_SAIDI_Row","dms_060301_Effect_unplanned_SAIFI_Row"]
[null,null,"Number of customers affected by the interruption","Average duration of sustained customer interruption","Effect on unplanned SAIDI","Effect on unplanned SAIFI"]
[]
[]
[]
[null,null,"Table 6.1 telephone answering - row descriptions and start date"]
[null,null,"dms_060101_Rows","dms_060102_Rows","dms_060101_StartDateTxt"]
[null,null,"Total number of calls \n(after removing excluded events)","Number of calls answered within 30 seconds \n(after excluding excluded events) ",{"$f":"dms_060701_StartDateTxt","v":"1-Jul-2017"}]
[]
[]
[]
[null,null,null,null,null,null,null,"dms_0603_FeederList",{"$f":"INDEX(dms_FeederName_1,MATCH(dms_TradingName,dms_TradingName_List))","v":"Critical Infrastructure"},{"$f":"INDEX(dms_FeederName_2,MATCH(dms_TradingName,dms_TradingName_List))","v":"High density commercial"},{"$f":"INDEX(dms_FeederName_3,MATCH(dms_TradingName,dms_TradingName_List))","v":"Urban"},{"$f":"INDEX(dms_FeederName_4,MATCH(dms_TradingName,dms_TradingName_List))","v":"High density rural"},{"$f":"INDEX(dms_FeederName_5,MATCH(dms_TradingName,dms_TradingName_List))","v":"Low density rural"}]
[null,null,"Table 6.7.1 - daily performance data - unplanned - MAIFI  -- row descriptions and header named range values"]
[null,null,"These headings (Lists) are determined from the INDEX/MATCH function on the NSP selected on the Business & other details sheet"]
[null,"dms_060701_Feeder_Header_Lvl4",{"$f":"INDEX(dms_FeederName_1,MATCH(dms_TradingName,dms_TradingName_List))","v":"Critical Infrastructure"},{"$f":"INDEX(dms_FeederName_1,MATCH(dms_TradingName,dms_TradingName_List))","v":"Critical Infrastructure"},{"$f":"INDEX(dms_FeederName_2,MATCH(dms_TradingName,dms_TradingName_List))","v":"High density commercial"},{"$f":"INDEX(dms_FeederName_2,MATCH(dms_TradingName,dms_TradingName_List))","v":"High density commercial"},{"$f":"INDEX(dms_FeederName_3,MATCH(dms_TradingName,dms_TradingName_List))","v":"Urban"},{"$f":"INDEX(dms_FeederName_3,MATCH(dms_TradingName,dms_TradingName_List))","v":"Urban"},{"$f":"INDEX(dms_FeederName_4,MATCH(dms_TradingName,dms_TradingName_List))","v":"High density rural"},{"$f":"INDEX(dms_FeederName_4,MATCH(dms_TradingName,dms_TradingName_List))","v":"High density rural"},{"$f":"IF((INDEX(dms_FeederName_5,MATCH(dms_TradingName,dms_TradingName_List))=0),\"Network\",(INDEX(dms_FeederName_5,MATCH(dms_TradingName,dms_TradingName_List))))","v":"Low density rural"},{"$f":"IF((INDEX(dms_FeederName_5,MATCH(dms_TradingName,dms_TradingName_List))=0),\"Network\",(INDEX(dms_FeederName_5,MATCH(dms_TradingName,dms_TradingName_List))))","v":"Low density rural"},"Network","Network"]
[]
[null,"dms_060701_Rows","All events","After removing excluded events","All events","After removing excluded events","All events","After removing excluded events","All events","After removing excluded events","All events","After removing excluded events","All events","After removing excluded events"]
[null,null,"the number of column headings changes from 10 to 12 depending on the number of feeder categories for the NSP"]
[]
[]
[]
[]
[null,null,"Table 6.8.1 - row descriptions"]
[null,null,"dms_060801_01_Rows","dms_060801_02_Rows","dms_060801_03_Rows","dms_060801_04_Rows"]
[null,null,"Number of interruptions","Duration of interruptions","Total unplanned minutes off supply","Effect on unplanned MAIFI"]
[]
[]
[]
[]
[null,null,"Table 7.9.4 - market impact component - row descriptions"]
[null,"dms_070904_01_Rows","without exclusions","with exclusions"]
[]
[]
[]
[]
[]
[null,null,"Use this to add to existing files"]
[null,null,"ARRs 6.7 STPIS daily performance"]
[null,null,"dms_060101_Values","dms_060102_Values","dms_060701_Values"]
[]
[null,null,"ARR's  6.8 STPIS exclusions"]
[null,null,"dms_060801_Event_Date","dms_060801_OutageID","dms_060801_FeederID","dms_060801_FeederClass","dms_060801_CauseID","dms_060801_01_Values","dms_060801_02_Values","dms_060801_03_Values","dms_060801_Excl_Cat","dms_060801_04_Values"]
[null,null,"dms_060801_StartCell"]
[]
[null,null,"CA 6.3 sustained interruptions"]
[null,null,"dms_060301_Event_Date","dms_060301_Event_Time","dms_060301_AssetID","dms_060301_FeederClass","dms_060301_Reason","dms_060301_DetailedReason","dms_060301_CustNo_Affected_Values","dms_060301_Avg_Duration_Sustained_Int_Values","dms_060301_Effect_unplanned_SAIDI_Values","dms_060301_Effect_unplanned_SAIFI_Values","dms_060301_MED"]

{"sheet":"Contents","index":1,"n_rows":31,"n_cols":4,"rows_kept":31,"cut":false,"hidden":false,"merged":[[2,1,2,3],[3,1,3,3],[4,1,4,3]]}
[]
[]
[null,{"$f":"CONCATENATE(dms_Segment,\" Network Service Provider\")","v":"Distribution Network Service Provider"}]
[null,"Annual Reporting RIN Template"]
[null,"Table of Contents"]
[]
[]
[null,null,"Instructions"]
[null,null,"Business & other details"]
[]
[]
[null,"CATEGORY ANALYSIS","STPIS","STATUTORY ACCOUNTS"]
[]
[null,"2.11 Labour","6.2 STPIS Reliability","8.1 Income"]
[null,null,"6.6 STPIS Customer Service","8.2 Capex"]
[null,null,"6.7 STPIS Daily Performance"]
[null,null,"6.8 STPIS Exclusions","8.4 Opex"]
[null,null,"6.9 STPIS GSL"]
[]
[]
[]
[null,"NETWORK PERFORMANCE","OTHER INFORMATION","PRICING PROPOSAL"]
[null,null,null,"Victorian Businesses Only"]
[null,"3.6 Quality of services","7.8 Avoided Cost Payments"]
[null,"3.6.8 Network-feeders","7.10 Juris Scheme","9.5 TUoS"]
[null,"3.6.9 Network-reliability","7.11 DMIS-DMIA"]
[null,null,"7.12 Safety and Bushfire"]
[null,null,"7.13 TARC"]
[null,"PUBLIC LIGHTING"]
[]
[null,"4.1 Public lighting tariffs"]

{"sheet":"Instructions","index":2,"n_rows":27,"n_cols":4,"rows_kept":27,"cut":false,"hidden":false,"merged":[[24,2,24,4],[25,2,25,3],[26,2,26,4],[8,2,8,4],[10,2,10,4],[12,2,12,4],[20,2,20,4],[22,2,22,4],[7,2,7,3],[1,1,1,5],[2,1,2,5],[3,2,3,4],[4,2,4,4],[5,2,5,4]]}
[]
[null,{"$f":"CONCATENATE(dms_Segment,\" Network Service Provider\")","v":"Distribution Network Service Provider"}]
[null,{"$f":"IF(dms_Model=\"Reset\",\"Regulatory Proposal RIN Template\",\"Annual Reporting RIN\")","v":"Annual Reporting RIN"}]
[null,null,"This template is to be used by Australian Distribution Co. to fulfil its reporting obligations to the AER."]
[null,null,"INSTRUCTIONS"]
[null,null,"Complete the Business & other details worksheet before entering data or values in any other worksheets. The Business & other details worksheet is linked to other worksheets within the workbook and automatically generates certain column headings and conditional formatting."]
[]
[null,null,"Identifying CONFIDENTIAL INFORMATION:\n\nPlease use the macro at the top of each \nworksheet to identify confidential information. \n\n"]
[null,null,"-Do this by selecting the cell or cells that contain confidential information and then run the Mark selected cells as CONFIDENTIAL macro. This will format the cells a specific colour that is identified by the AER's database which in turn marks that information as confidential.\n\n-To reverse this, select the cell or cells and run the Return cells to NON-CONFIDENTIAL macro."]
[]
[null,null,"UNITS OF MEASURE\n\nAll amounts are to be unrounded and reported on a one for one basis: that is 1000 is to be entered as '1000'. Applicable units of measure may be identified in the table column headings or row descriptors.\n\n"]
[]
[null,null,"COLOUR CODING OF INPUT / NON-INPUT CELLS:"]
[null,null,null,"Yellow = Input cell (mandatory)"]
[null,null,null,"Darker yellow = input cell (mandatory)"]
[null,null,null,"Orange = input cell (if data available)"]
[null,null,null,"Grey = Not applicable/No inputs required"]
[null,null,null," \nPLEASE DO NOT ENTER TEXT into cells that are to contain numeric data."]
[]
[]
[null,null,"WORKSHEET NAVIGATION\n\nMany tables in the worksheets have been \"grouped\" to allow for easy navigation. To ungroup or group data use the outline symbols in the left margin (for Row groupings) or above the columns (for column groupings). \n\n\n\n"]
[]
[null,null,"RETURNING COMPLETED RESPONSES\n\nPlease return two (2) files to the AER: \n1. A confidential version which must contain a complete set of all responses with confidential information marked using the Mark selection CONFIDENTIAL macro and which has been completed using the locked template file provided by the AER. \n\n2. A public version with confidential information either removed completely or aggregated in some form together with writtten consent to disclose the public version of the response.\n\nUse the drop down box on the Business and other details worksheet to identify the file as either confidential ('consolidated') or public. "]
[]
[null,null,"SUBMITTING AMENDED DATA TO THE AER\n\nIf an NSP wishes to correct data previously submitted to the AER it should resubmit that data using the original completed submission as the starting point. Please make any necessary changes to the data. Data that is not being amended should be left unchanged. \n\nNSPs must identify the reason for the amendments in the Amendment Reason box on the  Business and other details worksheet. NSPs may provide further details regarding any amendments in the Amendments worksheet. \n\n."]
[null,null,"NSP may use Amended Data macro \nto highlight cells that contain amended data.\nNB: if data is also CONFIDENTIAL, re-apply \nthe Confidentiality macro after applying the \nAmended macro"]
[null,null,"Please resubmit two (2) files - a confidential version and a public version of the amended submission to the AER"]

{"sheet":"Business & other details","index":3,"n_rows":156,"n_cols":9,"rows_kept":156,"cut":false,"hidden":false,"merged":[[59,2,59,8],[18,4,18,7],[19,2,19,3],[19,4,19,7],[22,2,22,3],[22,4,22,7],[23,4,23,7],[24,2,24,3],[24,4,24,7],[32,1,32,8],[57,2,57,3],[58,4,58,8],[7,1,7,8],[11,1,11,8],[13,2,13,4],[14,2,14,4],[17,2,17,3],[17,4,17,7]]}
[null,{"$f":"IF(dms_DataQuality=\"backcast\",INDEX(dms_Worksheet_List,MATCH(dms_Model,dms_Model_List))&\" BACKCAST\",INDEX(dms_Worksheet_List,MATCH(dms_Model,dms_Model_List)))","v":"ANNUAL REPORTING STATEMENT"}]
[null,{"$f":"INDEX(dms_TradingNameFull_List,MATCH(dms_TradingName,dms_TradingName_List))","v":"TasNetworks (D)"}]
[null,{"$f":"IF(SUM(dms_SingleYear_Model)>0,CONCATENATE(CRY),CONCATENATE(FRCP_y1,\" to \",dms_MultiYear_FinalYear_Result))","v":"2017-18"}]
[null,"BUSINESS & OTHER DETAILS"]
[]
[]
[null,"Instructions"]
[null,"Complete the following business details regulatory template before entering data or values in any other regulatory template. This regulatory template is linked to other cells within the spreadsheet and automatically generates column headings and conditional formatting to distinguish business specific input and non-input cells. "]
[]
[null,"SUBMISSION PARTICULARS INPUT SHEETS"]
[]
[null,"ENTITY DETAILS"]
[]
[null,"Short name","TasNetworks (D)",null,null,"Select business name from drop down list first"]
[null,"ACN / ABN",{"$f":"INDEX(dms_ABN_List,MATCH(dms_TradingName,dms_TradingName_List))","v":24167357299}]
[]
[]
[null,"Business address","Address 1",null,{"$f":"INDEX(dms_Addr1_List,MATCH(dms_TradingName,dms_TradingName_List))","v":"1-7 Maria Street"}]
[null,null,null,"Address 2",{"$f":"IF(ISBLANK(INDEX(dms_Addr2_List,MATCH(dms_TradingName,dms_TradingName_List))),\"\",(INDEX(dms_Addr2_List,MATCH(dms_TradingName,dms_TradingName_List))))","v":""}]
[null,null,"Suburb",null,{"$f":"INDEX(dms_Suburb_List,MATCH(dms_TradingName,dms_TradingName_List))","v":"LENAH VALLEY"}]
[null,null,null,"State",{"$f":"INDEX(dms_State_List,MATCH(dms_TradingName,dms_TradingName_List))","v":"Tas"},"p/code",{"$f":"INDEX(dms_PostCode_List,MATCH(dms_TradingName,dms_TradingName_List))","v":7008}]
[]
[null,"Postal address","Address 1",null,{"$f":"INDEX(dms_PAddr1_List,MATCH(dms_TradingName,dms_TradingName_List))","v":"PO Box 606"}]
[null,null,null,"Address 2",{"$f":"IF(ISBLANK(INDEX(dms_PAddr2_List,MATCH(dms_TradingName,dms_TradingName_List))),\"\",(INDEX(dms_PAddr2_List,MATCH(dms_TradingName,dms_TradingName_List))))","v":""}]
[null,null,"Suburb",null,{"$f":"INDEX(dms_PSuburb_List,MATCH(dms_TradingName,dms_TradingName_List))","v":"MOONAH"}]
[null,null,null,"State",{"$f":"INDEX(dms_PState_List,MATCH(dms_TradingName,dms_TradingName_List))","v":"Tas"},"p/code",{"$f":"INDEX(dms_PPostCode_List,MATCH(dms_TradingName,dms_TradingName_List))","v":7009}]
[]
[]
[null,"Contact name/s",{"$f":"INDEX(dms_ContactName1_List,MATCH(dms_TradingName,dms_TradingName_List))","v":"John Sayers"}]
[null,"Contact phone/s",{"$f":"INDEX(dms_ContactPh1_List,MATCH(dms_TradingName,dms_TradingName_List))","v":"03 6271 6469"}]
[null,"Contact email address/s",{"$f":"INDEX(dms_ContactEmail_List,MATCH(dms_TradingName,dms_TradingName_List))","v":"john.sayers@tasnetworks.com.au"}]
[]
[null,"REGULATORY CONTROL PERIODS"]
[]
[null,"Forthcoming regulatory control period","2020-21",{"$f":"dms_FRCP_y2","v":"2021-22"},{"$f":"dms_FRCP_y3","v":"2022-23"},{"$f":"dms_FRCP_y4","v":"2023-24"},{"$f":"dms_FRCP_y5","v":"2024-25"}]
[null,null,{"$f":"dms_FRCP_y6","v":"2025-26"},{"$f":"dms_FRCP_y7","v":"2026-27"},{"$f":"dms_FRCP_y8","v":"2027-28"},{"$f":"dms_FRCP_y9","v":"2028-29"},{"$f":"dms_FRCP_y10","v":"2029-30"}]
[]
[]
[null,"Current regulatory control period",{"$f":"dms_CRCP_FirstYear_Result","v":"2015-16"},{"$f":"IF(dms_RPT=\"financial\",VALUE(LEFT(CRCP_y1,4)+1)&\"-\"&TEXT(MID(CRCP_y1,3,2)+2,\"00\"),VALUE(LEFT(CRCP_y1,4)+1))","v":"2016-17"},{"$f":"IF(dms_RPT=\"financial\",VALUE(LEFT(CRCP_y1,4)+2)&\"-\"&TEXT(VALUE(MID(CRCP_y1,3,2)+3),\"00\"),VALUE(LEFT(CRCP_y1,4)+2))","v":"2017-18"},{"$f":"IF(dms_RPT=\"financial\",VALUE(LEFT(CRCP_y1,4)+3)&\"-\"&TEXT(MID(CRCP_y1,3,2)+4,\"00\"),VALUE(LEFT(CRCP_y1,4)+3))","v":"2018-19"},{"$f":"IF(dms_RPT=\"financial\",VALUE(LEFT(CRCP_y1,4)+4)&\"-\"&TEXT(MID(CRCP_y1,3,2)+5,\"00\"),VALUE(LEFT(CRCP_y1,4)+4))","v":"2019-20"}]
[null,null,{"$f":"IF(dms_RPT=\"financial\",VALUE(LEFT(CRCP_y1,4)+5)&\"-\"&TEXT(MID(CRCP_y1,3,2)+6,\"00\"),VALUE(LEFT(CRCP_y1,4)+5))","v":"2020-21"},{"$f":"IF(dms_RPT=\"financial\",VALUE(LEFT(CRCP_y1,4)+6)&\"-\"&TEXT(MID(CRCP_y1,3,2)+7,\"00\"),VALUE(LEFT(CRCP_y1,4)+6))","v":"2021-22"},{"$f":"IF(dms_RPT=\"financial\",VALUE(LEFT(CRCP_y1,4)+7)&\"-\"&TEXT(MID(CRCP_y1,3,2)+8,\"00\"),VALUE(LEFT(CRCP_y1,4)+7))","v":"2022-23"},{"$f":"IF(dms_RPT=\"financial\",VALUE(LEFT(CRCP_y1,4)+8)&\"-\"&TEXT(MID(CRCP_y1,3,2)+9,\"00\"),VALUE(LEFT(CRCP_y1,4)+8))","v":"2023-24"},{"$f":"IF(dms_RPT=\"financial\",VALUE(LEFT(CRCP_y1,4)+9)&\"-\"&TEXT(MID(CRCP_y1,3,2)+10,\"00\"),VALUE(LEFT(CRCP_y1,4)+9))","v":"2024-25"}]
[null,null,{"$f":"IF(dms_RPT=\"financial\",VALUE(LEFT(CRCP_y1,4)+10)&\"-\"&TEXT(MID(CRCP_y1,3,2)+11,\"00\"),VALUE(LEFT(CRCP_y1,4)+10))","v":"2025-26"},{"$f":"IF(dms_RPT=\"financial\",VALUE(LEFT(CRCP_y1,4)+11)&\"-\"&TEXT(MID(CRCP_y1,3,2)+12,\"00\"),VALUE(LEFT(CRCP_y1,4)+11))","v":"2026-27"},{"$f":"IF(dms_RPT=\"financial\",VALUE(LEFT(CRCP_y1,4)+12)&\"-\"&TEXT(MID(CRCP_y1,3,2)+13,\"00\"),VALUE(LEFT(CRCP_y1,4)+12))","v":"2027-28"},{"$f":"IF(dms_RPT=\"financial\",VALUE(LEFT(CRCP_y1,4)+13)&\"-\"&TEXT(MID(CRCP_y1,3,2)+14,\"00\"),VALUE(LEFT(CRCP_y1,4)+13))","v":"2028-29"},{"$f":"IF(dms_RPT=\"financial\",VALUE(LEFT(CRCP_y1,4)+14)&\"-\"&TEXT(MID(CRCP_y1,3,2)+15,\"00\"),VALUE(LEFT(CRCP_y1,4)+14))","v":"2029-30"}]
[]
[]
[null,"Previous regulatory control period",{"$f":"IF(dms_RPT=\"financial\",VALUE(LEFT(PRCP_y2,4)-1)&\"-\"&TEXT(VALUE(MID(PRCP_y2,3,2)),\"00\"),VALUE(LEFT(PRCP_y2,4)-1))","v":"2010-11"},{"$f":"IF(dms_RPT=\"financial\",VALUE(LEFT(PRCP_y3,4)-1)&\"-\"&TEXT(VALUE(MID(PRCP_y3,3,2)),\"00\"),VALUE(LEFT(PRCP_y3,4)-1))","v":"2011-12"},{"$f":"IF(dms_RPT=\"financial\",VALUE(LEFT(PRCP_y4,4)-1)&\"-\"&TEXT(VALUE(MID(PRCP_y4,3,2)),\"00\"),VALUE(LEFT(PRCP_y4,4)-1))","v":"2012-13"},{"$f":"IF(dms_RPT=\"financial\",VALUE(LEFT(PRCP_y5,4)-1)&\"-\"&TEXT(VALUE(RIGHT(PRCP_y5,2)-1),\"00\"),VALUE(LEFT(PRCP_y5,4)-1))","v":"2013-14"},{"$f":"IF(dms_RPT=\"financial\",VALUE(LEFT(CRCP_y1,4)-1)&\"-\"&TEXT(VALUE(RIGHT(CRCP_y1,2)-1),\"00\"),VALUE(LEFT(CRCP_y1,4)-1))","v":"2014-15"}]
[]
[]
[]
[null,"Commencing regulatory year","2017-18","CRY"]
[]
[null,"Last completed regulatory year","2017-18","dms_FinalYear"]
[]
[]
[]
[null,null,"IF THIS IS AN ABC RIN - make sure the the named range CRY is applied and the named range dms_dollar_nom_UOM is applied"]
[null,null,"IF THIS IS A RESET RIN - make sure the named ranges CRY and dms_dollar_nom_UOM are NOT present in the workbook"]
[null,null,"FOR ABC RINS THAT SPAN MULTIPLE YEARS - make sure MultiYear Flag is set and final year entered as required"]
[]
[null,"Source","Reporting",null,"Please select the correct submission type from the dropdown list."]
[null,"Data quality (actual, estimate, public, consolidated)","Consolidated",null,"Use Consolidated for Consolidated Confidential version\nUse Public for Consolidated Public version"]
[null,"Amended RIN submission - amendment reason","."]
[null,"Submission Date","dd/mm/yy","dms_SubmissionDate","Please enter date this file submitted to AER (dd/mm/yyyy)"]
[null,"EBSS - First application of scheme in forthcoming period?","No"]
[null,"Sector",{"$f":"INDEX(dms_Sector_List,MATCH(dms_TradingName,dms_TradingName_List))","v":"Electricity"},"dms_Sector","=INDEX(dms_Sector_List,MATCH(dms_TradingName,dms_TradingName_List))"]
[null,"Segment",{"$f":"INDEX(dms_Segment_List,MATCH(dms_TradingName,dms_TradingName_List))","v":"Distribution"},"dms_Segment","=INDEX(dms_Segment_List,MATCH(dms_TradingName,dms_TradingName_List))"]
[null,"Regulatory Year Ending",{"$f":"IF(dms_MultiYear_Flag=1,LEFT(dms_Specified_FinalYear,2)&RIGHT(dms_Specified_FinalYear,2),INDEX(dms_RYE_Formula_Result,MATCH(dms_Model,dms_Model_List)))","v":"2018"},"dms_RYE","=IF(dms_MultiYear_Flag=1,LEFT(dms_Specified_FinalYear,2)&RIGHT(dms_Specified_FinalYear,2),INDEX(dms_RYE_Formula_Result,MATCH(dms_Model,dms_Model_List)))"]
[null,"Reporting Period Type",{"$f":"INDEX(dms_RPT_List,MATCH(dms_TradingName,dms_TradingName_List))","v":"Financial"},"dms_RPT","=INDEX(dms_RPT_List,MATCH(dms_TradingName,dms_TradingName_List))"]
[null,"Model or RIN Type","ARR","dms_Model","Drop down selection"]
[null,"EB/CA Unit of Measure for Monetary Values","$0s","dms_dollar_nom_UOM","If the cover sheet is attached to an ABC RIN apply the NAMED RANGE to the cell"]
[null,"Security Classification","Public","dms_Classification","Always Public"]
[null,"Jurisdiction",{"$f":"INDEX(dms_JurisdictionList,MATCH(dms_TradingName,dms_TradingName_List))","v":"Tas"},"dms_Jurisdiction","=INDEX(dms_JurisdictionList,MATCH(dms_TradingName,dms_TradingName_List))"]
[null,"FORECAST and MultiYear RINS"]
[null,"CRY-1  (last full calendar year before CRY)",{"$f":"IF(dms_RPT=\"financial\",VALUE(LEFT(dms_SingleYear_FinalYear_Result,4)),VALUE(LEFT(dms_SingleYear_FinalYear_Result,4)-1))","v":2017},"dms_Cal_Year_B4_CRY","'=IF(dms_RPT=\"financial\",VALUE(LEFT(dms_SingleYear_FinalYear_Result,4)),VALUE(LEFT(dms_SingleYear_FinalYear_Result,4)-1))"]
[null,"Dollar $ real month",{"$f":"INDEX(dms_RPTMonth_List,MATCH(dms_TradingName,dms_TradingName_List))","v":"June"},"dms_RPTMonth","=INDEX(dms_RPTMonth_List,MATCH(dms_TradingName,dms_TradingName_List))"]
[null,"Dollar $ real  (the last month before the FRCP_y1)",{"$f":"IF(SUM(dms_SingleYear_Model)>0,CONCATENATE(dms_RPTMonth)&\" \"&VALUE((LEFT(CRY,2))&RIGHT(CRY,2)),CONCATENATE(dms_RPTMonth)&\" \"&VALUE((LEFT(dms_CRCP_FinalYear_Result,2)&RIGHT(dms_CRCP_FinalYear_Result,2))))","v":"June 2018"},"dms_DollarReal","=IF(SUM(dms_SingleYear_Model)>0,CONCATENATE(dms_RPTMonth)&\" \"&VALUE((LEFT(CRY,2))&RIGHT(CRY,2)),CONCATENATE(dms_RPTMonth)&\" \"&VALUE((LEFT(dms_CRCP_FinalYear_Result,2)&RIGHT(dms_CRCP_FinalYear_Result,2))))"]
[null,"Dollar $ real previous year (PRCP_y5)",{"$f":"IF(SUM(dms_SingleYear_Model)>0,CONCATENATE(dms_RPTMonth)&\" \"&VALUE(((LEFT(CRY,2))&RIGHT(CRY,2))-1),CONCATENATE(dms_RPTMonth)&\" \"&VALUE(((LEFT(dms_CRCP_FirstYear_Result,2)&RIGHT(dms_CRCP_FirstYear_Result,2))))-1)","v":"June 2017"},"dms_DollarReal_Prev","=IF(SUM(dms_SingleYear_Model)>0,CONCATENATE(dms_RPTMonth)&\" \"&VALUE(((LEFT(CRY,2))&RIGHT(CRY,2))-1),CONCATENATE(dms_RPTMonth)&\" \"&VALUE(((LEFT(dms_CRCP_FirstYear_Result,2)&RIGHT(dms_CRCP_FirstYear_Result,2))))-1)"]
[null,"This block works out the various RYE's for ALL RIN types and MODELS"]
[null,"Single Year Model T/F",{"$f":"IF(dms_Model=\"EB\",1,0)","v":0},"dms_EB"]
[null,null,{"$f":"IF(dms_Model=\"CA\",1,0)","v":0},"dms_CA","=dms_SingleYear_Model"]
[null,null,{"$f":"IF(dms_Model=\"ARR\",1,0)","v":1},"dms_ARR"]
[null,"Is this a single Year RIN?",{"$f":"IF(SUM(dms_SingleYear_Model)=1,\"yes\",\"no\")","v":"yes"},"dms_SingleYearModel","=IF(SUM(dms_SingleYear_Model)=1,\"yes\",\"no\")"]
[null,"Single Year Final Year Reference","CRY","dms_SingleYear_FinalYear_Ref","This is the reference for EB, CA & ARR RINs"]
[null,"Single Year Final Year Result",{"$f":"IFERROR(IF(SUM(dms_SingleYear_Model)<>0,(INDIRECT(dms_SingleYear_FinalYear_Ref)),\"not a single year RIN\"),\"CRY not present\")","v":"2017-18"},"dms_SingleYear_FinalYear_Result","=IFERROR(IF(SUM(dms_SingleYear_Model)<>0,(INDIRECT(dms_SingleYear_FinalYear_Ref)),\"not a single year RIN\"),\"CRY not present\")"]
[null,"FRCP length in years",{"$f":"INDEX(dms_FRCPlength_List,MATCH(dms_TradingName,dms_TradingName_List))","v":5},"dms_FRCPlength_Num","=INDEX(dms_FRCPlength_List,MATCH(dms_TradingName,dms_TradingName_List))"]
[null,"Multi Year Final Year Reference",{"$f":"INDEX(dms_FinalYear_List,MATCH(dms_FRCPlength_Num,dms_FRCPlength_Num_List))","v":"dms_FRCP_y5"},"dms_MultiYear_FinalYear_Ref","=INDEX(dms_FinalYear_List,MATCH(dms_FRCPlength_Num,dms_FRCPlength_Num_List))"]
[null,"Multi Year Final Year Result",{"$f":"IF(dms_MultiYear_Flag=0,INDIRECT(dms_MultiYear_FinalYear_Ref),dms_Specified_FinalYear)","v":"2024-25"},"dms_MultiYear_FinalYear_Result","=IF(dms_MultiYear_Flag=0,INDIRECT(dms_MultiYear_FinalYear_Ref),dms_Specified_FinalYear)",null,null,null,"Formula errors OK"]
[null,"CRCP length in years",{"$f":"INDEX(dms_CRCPlength_List,MATCH(dms_TradingName,dms_TradingName_List))","v":5},"dms_CRCPlength_Num","=INDEX(dms_CRCPlength_List,MATCH(dms_TradingName,dms_TradingName_List))"]
[null,"CRCP Final Year Reference",{"$f":"INDEX(dms_CFinalYear_List,MATCH(dms_CRCPlength_Num,dms_CRCPlength_Num_List))","v":"CRCP_y5"},"dms_CRCP_FinalYear_Ref","=INDEX(dms_CFinalYear_List,MATCH(dms_CRCPlength_Num,dms_CRCPlength_Num_List))"]
[null,"CRCP First Year Result",{"$f":"INDEX(dms_CRCP_years,MATCH(dms_CRCPlength_Num,dms_CRCP_index))","v":"2015-16"},"dms_CRCP_FirstYear_Result","=INDEX(dms_CRCP_years,MATCH(dms_CRCPlength_Num,dms_CRCP_index))"]
[null,"CRCP Final Year Result",{"$f":"IF(dms_MultiYear_Flag=0,(IF(SUM(dms_SingleYear_Model)>0,CRY,dms_CRCP_yZ)),dms_Specified_FinalYear)","v":"2017-18"},"dms_CRCP_FinalYear_Result","=IF(dms_MultiYear_Flag=0,(IF(SUM(dms_SingleYear_Model)>0,CRY,dms_CRCP_yZ)),dms_Specified_FinalYear)"]
[null,"PTRM/ RFMs"]
[null,"Form of control",{"$f":"INDEX(dms_FormControl_List,MATCH(dms_TradingName,dms_TradingName_List))","v":"Revenue cap"},"dms_FormControl","=INDEX(dms_FormControl_List,MATCH(dms_TradingName,dms_TradingName_List))"]
[null,"ABC RINS THAT SPAN MULTIPLE YEARS"]
[null,"Is this a multi year ABC RIN?","No"]
[null,"Multiyear EB, CA or ARR?",{"$f":"IF(dms_MultiYear_ResponseFlag=\"No\",0,1)","v":0},"dms_MultiYear_Flag","This is set from the answer provided above"]
[null,null,{"$f":"IF(dms_MultiYear_Flag=1,FRY,\"not a Multiple year submission\")","v":"not a Multiple year submission"},"dms_Specified_FinalYear","The result here is returned to dms_CRCP_FinalYear_Result if response to Q in C73 is \"yes\" and dms_MultiYear_Flag is set to 1"]
[null," Start year for 5.2 in Multi year ABC RINS",{"$f":"IFERROR(IF(dms_MultiYear_Flag=1,FRY,CRY),\"not an ABC\")","v":"2017-18"},"dms_0502_Inst_Year","=IF(dms_MultiYear_Flag=1,FRY,CRY)",null,"For single year RINS this is CRY - multi year RINS need to start a the end of the span of years (ie. FRY)"]
[null,"EB RINS"]
[null,"Calendar Year for table 3.6 data",{"$f":"IF(dms_RPT=\"financial\",VALUE(LEFT(dms_SingleYear_FinalYear_Result,4)),VALUE(LEFT(dms_SingleYear_FinalYear_Result,4)-1))","v":2017},"dms_0306_Year","=IF(dms_RPT=\"financial\",VALUE(LEFT(dms_SingleYear_FinalYear_Result,4)),VALUE(LEFT(dms_SingleYear_FinalYear_Result,4)-1))"]
[null,"CA RINS"]
[null,"Find how many rows in tables 6.3 sustained interruptions?",null,null,"dms_060301_MaxRows only returns a valid value when cover sheet is attached to a CA file"]
[null,null,{"$f":"IF(dms_Model<>\"CA\",\"not a CA\",\"Is a CA\")","v":"not a CA"},null,"=IF(dms_Model<>\"CA\",\"not a CA\",\"Is a CA\")"]
[null,"dms_060301_Avg_Duration_Sustained_Int_Values present?",{"$f":"IFERROR(IF(INDEX(dms_060301_Avg_Duration_Sustained_Int_Values,1,1)<>\"\",\"yes\",\"no\"),\"no\")","v":"no"},"dms_060301_checkvalue","=IFERROR(IF(INDEX(dms_060301_Avg_Duration_Sustained_Int_Values,1,1)<>\"\",\"yes\",\"no\"),\"no\")"]
[null,null,{"$f":"IF(AND(dms_Model=\"CA\",(dms_060301_checkvalue=\"no\")),\"error - NR not present\",\"no errors\")","v":"no errors"},null,"=IF(AND(dms_Model=\"CA\",(dms_060301_checkvalue=\"no\")),\"error - NR not present\",\"no errors\")"]
[null,"Table 6.3.1 - last row reference",{"$f":"IFERROR(IF(dms_Model=\"CA\",LOOKUP(2,1/(dms_060301_Avg_Duration_Sustained_Int_Values<>\"\"),(ROW(dms_060301_Avg_Duration_Sustained_Int_Values))),\"not a CA\"),\"6.3 not present\")","v":"not a CA"},"dms_060301_LastRow","=IFERROR(IF(dms_Model=\"CA\",LOOKUP(2,1/(dms_060301_Avg_Duration_Sustained_Int_Values<>\"\"),(ROW(dms_060301_Avg_Duration_Sustained_Int_Values))),\"not a CA\"),\"6.3 not present\")"]
[null,"Table 6.3.1 - max number rows",{"$f":"IFERROR(IF(dms_Model=\"CA\",(dms_060301_LastRow-15),\"not a CA\"),\"error\")","v":"not a CA"},"dms_060301_MaxRows","=IFERROR(IF(dms_Model=\"CA\",(dms_060301_LastRow-15),\"not a CA\"),\"error\")"]
[null,"Table 6.6.3 - Public lighting repair - no. business days",{"$f":"INDEX(dms_663_List,MATCH(dms_TradingName,dms_TradingName_List))","v":5},"dms_663","=INDEX(dms_663_List,MATCH(dms_TradingName,dms_TradingName_List))"]
[null,"ARR or RESET RINS"]
[null,"How many rows in tables 6.1 or 6.7?  (leap year?)","insert dms_LeapYear NR if required",null,"'dms_LeapYear is used to determine dms_060701_Max_Rows BUT it is only found on worksheet 6.1 or 6.7 and the date value in the cell is used to determine whether it is a leap year"]
[null,"Is dms_LeapYear named range present?",{"$f":"IFERROR(IF(dms_LeapYear,\"yes\"),\"no\")","v":"yes"}]
[null,"Table 6.7.1 - includes a leap year?",{"$f":"\nIFERROR(IF(MONTH(DATE(YEAR(dms_LeapYear),2,29))=2,\"is a leap year\",\"not a leap year\"),\n\"dms_LeapYear not present\")","v":"not a leap year"},"dms_LeapYear_Result","=IFERROR(IF(MONTH(DATE(YEAR(dms_LeapYear),2,29))=2,\"is a leap year\",\"not a leap year\"),\"dms_LeapYear not present\")"]
[null,"MaxRows if Reset and leap year",{"$f":"IF(dms_LeapYear_Result=\"is a leap year\",1827,1826)","v":1826},"dms_060701_Reset_MaxRows","=IF(dms_LeapYear_Result=\"is a leap year\",1827,1826)",null,null,"number of days present in Reset RIN table"]
[null,"MaxRows if ARR and leap year",{"$f":"IF(dms_LeapYear_Result=\"is a leap year\",366,365)","v":365},"dms_060701_ARR_MaxRows","=IF(dms_LeapYear_Result=\"is a leap year\",366,365)",null,null,"number of days present in ARR RIN table"]
[null,"Table 6.7.1 - Max Rows (leap year/ non leap year)",{"$f":"IF(dms_Model=\"ARR\",dms_060701_ARR_MaxRows,IF(dms_Model=\"Reset\",dms_060701_Reset_MaxRows,\"not a relevant RIN type\"))","v":365},"dms_060701_MaxRows","=IF(dms_Model=\"ARR\",dms_060701_ARR_MaxRows,IF(dms_Model=\"Reset\",dms_060701_Reset_MaxRows,\"not a relevant RIN type\"))"]
[null,"How many columns in 6.7?   (4 or 5 feeder categories)",{"$f":"IF(dms_FifthFeeder_flag_NSP=\"NO\",\"This NSP has only 4 feeder categories\",\"This NSP has 5 feeder categories\")","v":"This NSP has 5 feeder categories"}]
[null,"Table 6.7.1 - Last column (# of feeder categories > 4)",{"$f":"IF(dms_FifthFeeder_flag_NSP=\"NO\",10,12)","v":12},"dms_060701_MaxCols","=IF(dms_FifthFeeder_flag_NSP=\"NO\",8,10)"]
[null,"Table 6.7.1 - Number of offset rows",{"$f":"IF(dms_Model=\"ARR\",15,9)","v":15},"dms_060701_OffsetRows","=IF(dms_Model=\"ARR\",15,9)"]
[null,"Start date for telephone answering in 6.1 or 6.7?",null,null,"Using 060101 as naming standard not 060701 for start dates"]
[null,"Table 6.1.1 and 6.7.1 - Start Date as Text",{"$f":"IF(dms_SingleYearModel=\"yes\",(CONCATENATE(IF(LEN(CRY)=4,\"1-Jan-\",\"1-Jul-\"),LEFT(CRY,4))),(CONCATENATE(IF(LEN(PRCP_y4)=4,\"1-Jan-\",\"1-Jul-\"),LEFT(PRCP_y4,4))))","v":"1-Jul-2017"},"dms_060101_StartDateTxt","=IF(SUM(dms_SingleYear_Model)>1,(CONCATENATE(IF(LEN(CRY)=4,\"1-Jan-\",\"1-Jul-\"),LEFT(CRY,4))),(CONCATENATE(IF(LEN(CRCP_y4)=4,\"1-Jan-\",\"1-Jul-\"),LEFT(CRCP_y4,4))))"]
[null,"Table 6.1.1 and 6.7.1 - Start Date as Date Value",{"$f":"DATEVALUE(dms_060701_StartDateTxt)","v":42917},"dms_060101_StartDateVal","=DATEVALUE(dms_060701_StartDateTxt)"]
[null,"ARRs"]
[null,"How many rows in table 6.8?","insert dms_060801_StartCell NR if required",null,"dms_060801_StartCell is only found on worksheet 6.8 and is used to determine the starting date for the date range"]
[null,"Is dms_060801_StartCell named range present?","yes",null,"=IFERROR(IF((ROW(dms_060801_StartCell)-1)=1,\"yes\",\"yes\"),\"no\")"]
[null,"Table 6.8 - Number of offset rows",{"$f":"IFERROR(IF(dms_Model=\"ARR\",(ROW(dms_060801_StartCell)-1),\"not an ARR\"),\"6.8 error\")","v":11},"dms_0608_OffsetRows","=IFERROR(IF(dms_Model=\"ARR\",(ROW(dms_060801_StartCell)-1),\"not an ARR\"),\"6.8 error\")"]
[null,"Table 6.8 - Last row",{"$f":"IFERROR(IF(dms_060801_StartCell<>\"\",IF(dms_Model=\"ARR\",(LOOKUP(2,1/(dms_060801_01_Values<>\"\"),(ROW(dms_060801_01_Values)))),\"not an ARR\"),0),\"6.8 not present\")","v":998},"dms_0608_LastRow","=IFERROR(IF(dms_060801_StartCell<>\"\",IF(dms_Model=\"ARR\",(LOOKUP(2,1/(dms_060801_01_Values<>\"\"),(ROW(dms_060801_01_Values)))),\"not an ARR\"),0),\"6.8 not present\")"]
[null,"Table 6.8 - MaxRows",{"$f":"IFERROR(IF(dms_Model=\"ARR\",(MAX(0,dms_0608_LastRow-dms_0608_OffsetRows)),\"not an ARR\"),\"6.8 not present\")","v":987},"dms_060801_MaxRows","=IFERROR(IF(dms_Model=\"ARR\",(MAX(0,dms_0608_LastRow-dms_0608_OffsetRows)),\"not an ARR\"),\"6.8 not present\")"]
[null,"TNSP RESET RINS"]
[null,"Table 7.9.4 only appears in TNSPs Reset RIN"]
[null,"Table 7.9.4 - first year",{"$f":"LEFT(PRCP_y3,4)","v":"2012"},"dms_070904_Start_Year","=LEFT(PRCP_y3,4)"]
[null,"SUBSET FILES"]
[null,"Is this Submission File a Subset File","NO","dms_Partial"]
[null,"MISC"]
[null,"Distribution Determination Reference",{"$f":"INDEX(dms_DeterminationRef_List,MATCH(dms_TradingName,dms_TradingName_List))","v":"distribution determination"},"dms_DeterminationRef"]
[null,"Public lighting NSP?",{"$f":"INDEX(dms_Public_Lighting_List,MATCH(dms_TradingName,dms_TradingName_List))","v":"YES"},"dms_Public_Lighting","=INDEX(dms_Public_Lighting_List,MATCH(dms_TradingName,dms_TradingName_List))"]
[null,"CBD Feeder for this business",{"$f":"INDEX(dms_CBD_flag,MATCH(dms_TradingName,dms_TradingName_List))","v":"YES"},"dms_CBD_flag_NSP"]
[null,"Urban Feeder for this business",{"$f":"INDEX(dms_Urban_flag,MATCH(dms_TradingName,dms_TradingName_List))","v":"YES"},"dms_Urban_flag_NSP"]
[null,"Short rural Feeder for this business",{"$f":"INDEX(dms_ShortRural_flag,MATCH(dms_TradingName,dms_TradingName_List))","v":"YES"},"dms_ShortRural_flag_NSP"]
[null,"Long rural Feeder for this business",{"$f":"INDEX(dms_LongRural_flag,MATCH(dms_TradingName,dms_TradingName_List))","v":"YES"},"dms_LongRural_flag_NSP"]
[null,"Fifth Feeder Category (eg. TasNetworks (D))",{"$f":"INDEX(dms_FeederType_5_flag,MATCH(dms_TradingName,dms_TradingName_List))","v":"YES"},"dms_FifthFeeder_flag_NSP","=INDEX(dms_FeederType_5_flag,MATCH(dms_TradingName,dms_TradingName_List))"]
[]
[null,"DISCARD FILES"]
[null,"discard this record?","NO","dms_DISCARD","If record is to be discarded from DB set this flag to YES"]
[]
[null,"USES NAMED RANGES FLAG","yes","dms_Defined_Names_Used"]
[]
[null,"REGULATORY YEARS FOR MULTI RYE SUBMISSIONS"]
[null,"Multiple RYE flag","NO","dms_Multi_RYE_flag"]
[null,null,"Manually specify RYE","Named ranges to apply"]
[null,null,2013,"dms_RYE_01"]
[null,null,2014,"dms_RYE_02"]
[null,null,2015,"dms_RYE_03"]
[null,null,2016,"dms_RYE_04"]
[null,null,2017,"dms_RYE_05"]
[null,null,2018,"dms_RYE_06"]
[null,null,2019,"dms_RYE_07"]
[null,null,2020,"dms_RYE_08"]
[null,null,2021,"dms_RYE_09"]

{"sheet":"2.11 Labour","index":4,"n_rows":36,"n_cols":4,"rows_kept":36,"cut":false,"hidden":false,"merged":[]}
[null,{"$f":"IF(dms_DataQuality=\"backcast\",INDEX(dms_Worksheet_List,MATCH(dms_Model,dms_Model_List))&\" BACKCAST\",INDEX(dms_Worksheet_List,MATCH(dms_Model,dms_Model_List)))","v":"ANNUAL REPORTING STATEMENT"}]
[null,{"$f":"INDEX(dms_TradingNameFull_List,MATCH(dms_TradingName,dms_TradingName_List))","v":"TasNetworks (D)"}]
[null,{"$f":"CONCATENATE(\"Annual Reporting RIN Response \",IF(SUM(dms_SingleYear_Model)>0,CONCATENATE(CRY),CONCATENATE(FRCP_y1,\" to \",dms_MultiYear_FinalYear_Result)))","v":"Annual Reporting RIN Response 2017-18"}]
[null,"2.11 LABOUR "]
[]
[null,"Tables 2.11.1 and 2.11.2 deliberately omitted."]
[]
[null,"2.11.3 - LABOUR / NON-LABOUR EXPENDITURE SPLIT"]
[null,"2.11.3.1 - Opex"]
[null,null,{"$f":"CRY","v":"2017-18"}]
[null,null,"$0's, nominal"]
[null,null,"Opex "]
[null,"In-house labour expenditure",45083761.665451348]
[null,"Labour expenditure outsourced to related parties",0]
[null,"Labour expenditure outsourced to unrelated parties",2550938.6060186713]
[null,"Controllable non-labour expenditure",38781646.662974201]
[null,"Uncontrollable non-labour expenditure"]
[null,"Total",{"$f":"SUM(C13:C17)","v":86416346.934444219}]
[]
[null,"Reconciliation with Opex worksheets - SCS","Opex"]
[null,"Total including margins",{"$f":"dms_Total_Actual_Opex","v":86416346.934444219},{"$f":"IF(ROUND(C18,0)=ROUND(dms_Total_Actual_Opex,0),\"OK\",\"Error\")","v":"OK"}]
[]
[]
[null,"2.11.3.2 - Capex"]
[null,null,{"$f":"CRY","v":"2017-18"}]
[null,null,"$0's, nominal"]
[null,null,"Capex"]
[null,"In-house labour expenditure",43522867.638351493]
[null,"Labour expenditure outsourced to related parties"]
[null,"Labour expenditure outsourced to unrelated parties",2462619.7815341502]
[null,"Controllable non-labour expenditure",116339880.74835519]
[null,"Uncontrollable non-labour expenditure"]
[null,"Total",{"$f":"SUM(C28:C32)","v":162325368.16824085}]
[]
[null,"Reconciliation with Capex & Opex worksheets - SCS","Capex"]
[null,"Total including margins",{"$f":"dms_Total_Actual_Capex","v":162325368.16824085},{"$f":"IF(ROUND(C33,0)=ROUND(dms_Total_Actual_Capex,0),\"OK\",\"Error\")","v":"OK"}]

{"sheet":"3.6 Quality of services","index":5,"n_rows":74,"n_cols":4,"rows_kept":74,"cut":false,"hidden":false,"merged":[]}
[null,{"$f":"IF(dms_DataQuality=\"backcast\",INDEX(dms_Worksheet_List,MATCH(dms_Model,dms_Model_List))&\" BACKCAST\",INDEX(dms_Worksheet_List,MATCH(dms_Model,dms_Model_List)))","v":"ANNUAL REPORTING STATEMENT"}]
[null,{"$f":"INDEX(dms_TradingNameFull_List,MATCH(dms_TradingName,dms_TradingName_List))","v":"TasNetworks (D)"}]
[null,{"$f":"CONCATENATE(\"Annual Reporting RIN Response \",IF(SUM(dms_SingleYear_Model)>0,CONCATENATE(CRY),CONCATENATE(FRCP_y1,\" to \",dms_MultiYear_FinalYear_Result)))","v":"Annual Reporting RIN Response 2017-18"}]
[null,"3.6 QUALITY OF SERVICES"]
[]
[null,"3.6.5 - QUALITY OF SUPPLY METRICS"]
[null,null,null,"Volume"]
[null,null,"Units",{"$f":"CRY","v":"2017-18"}]
[null,"Over voltage events - due to high voltage injection","number",2]
[null,"Customers receiving over-voltage - due to high voltage injection","number",4]
[null,"Over voltage events - due to lightning","number",20]
[null,"Customers receiving over-voltage - due to lightning","number",40]
[null,"Over voltage events - due to voltage regulation or other cause","number",148]
[null,"Customers receiving over-voltage - due to voltage regulation or other cause","number",148]
[null,"Voltage variations - steady state (zone sub)","number",327]
[null,"Voltage variations - one minute (zone sub)","number",0]
[null,"Voltage variations - 10 seconds (zone sub) Min<0.7","number",0]
[null,"Voltage variations - 10 seconds (zone sub) Min<0.8","number",0]
[null,"Voltage variations - 10 seconds (zone sub) Min<0.9","number",0]
[null,"Voltage variations - steady state (feeder)","number",326]
[null,"Voltage variations - % zone subs monitored","(per cent)",1]
[null,"Voltage variations - % feeders monitored","(per cent)",0.09]
[]
[null,"3.6.6 - COMPLAINTS - TECHNICAL QUALITY OF SUPPLY"]
[null,null,null,"Volume"]
[null,null,"Units",{"$f":"CRY","v":"2017-18"}]
[null,"3.6.6.1 - TECHNICAL QUALITY OF SUPPLY"]
[null,"Number of complaints - technical quality of supply","number",412]
[null,"3.6.6.2 - PERCENTAGE OF COMPLAINTS BY CATEGORY"]
[null,"Low voltage supply","(per cent)",0.06]
[null,"Voltage dips","(per cent)",0.08]
[null,"Voltage swell","(per cent)",0.23]
[null,"Voltage spike (impulsive transient)","(per cent)",0]
[null,"Waveform distortion","(per cent)",0]
[null,"TV or radio interference","(per cent)",0.02]
[null,"Solar related","(per cent)",0]
[null,"Noise from appliances","(per cent)",0]
[null,"Other","(per cent)",0.61]
[null,"3.6.6.3 - PERCENTAGE OF COMPLAINTS BY LIKELY CAUSE"]
[null,"Network equipment faulty","(per cent)",0.01]
[null,"Network interference by NSP equipment","(per cent)",0]
[null,"Network interference by another customer","(per cent)",0.01]
[null,"Network limitation","(per cent)",0.41]
[null,"Customer internal problem","(per cent)",0.01]
[null,"No problem identified","(per cent)",0.54]
[null,"Environmental","(per cent)",0.01]
[null,"Other","(per cent)",0.01]
[]
[]
[]
[null,"3.6.7 - CUSTOMER SERVICE METRICS"]
[null,null,null,"Volume"]
[null,null,"Unit",{"$f":"CRY","v":"2017-18"}]
[null,"3.6.7.1 - TIMELY PROVISIONS OF SERVICES"]
[null,"Number of connections made","number",2959]
[null,"Number of connections not made on or before agreed date","number",525]
[null,"3.6.7.2 - TIMELY REPAIR OF FAULTY STREET LIGHTS"]
[null,"Street lights - average monthly number \"out\"","number",171.83]
[null,"Street lights - not repaired by \"fix by\" date","number",908]
[null,"Street lights - average number of days to repair","number",12.43]
[null,"Total number of street lights","number",36383]
[null,"3.6.7.3 - CALL CENTRE PERFORMANCE"]
[null,"Calls to call centre fault line","number",{"$f":"SUM(dms_060101_Values)","v":42634}]
[null,"Calls to fault line answered within 30 seconds","number",{"$f":"SUM(dms_060102_Values)","v":34315}]
[null,"Calls to fault line - average waiting time before call answered","number",47]
[null,"Call centre - number of overload events","number","N/A"]
[null,"Percentage of calls abandoned","(per cent)",0.17219999999999999]
[null,"3.6.7.4 - NUMBER OF CUSTOMER COMPLAINTS"]
[null,"Complaint - reliability of supply","number",111]
[null,"Complaint - technical quality of supply","number",{"$f":"dms_030606_01_Values","v":412}]
[null,"Complaint - administrative process or customer service","number",0]
[null,"Complaint - connection or augmentation","number",146]
[null,"Complaint - other","number",1946]
[null,"Total number of complaints","number",{"$f":"SUM(D69:D73)","v":2615}]

{"sheet":"3.6.8 Network-feeders","index":6,"n_rows":427,"n_cols":23,"rows_kept":427,"cut":false,"hidden":false,"merged":[[5,6,5,8],[5,1,5,4],[11,8,12,8],[11,9,12,9],[11,20,12,20],[10,20,10,22],[11,21,11,22],[10,1,12,1],[10,2,12,2],[10,3,12,3],[10,4,12,4],[10,7,12,7],[11,5,12,5],[11,6,12,6],[10,5,10,6],[10,8,10,9],[10,10,10,14],[11,11,11,12],[11,13,11,14],[11,18,11,19],[11,15,12,15],[11,10,12,10],[10,15,10,19],[11,16,11,17]]}
[null,{"$f":"IF(dms_DataQuality=\"backcast\",INDEX(dms_Worksheet_List,MATCH(dms_Model,dms_Model_List))&\" BACKCAST\",INDEX(dms_Worksheet_List,MATCH(dms_Model,dms_Model_List)))","v":"ANNUAL REPORTING STATEMENT"}]
[null,{"$f":"INDEX(dms_TradingNameFull_List,MATCH(dms_TradingName,dms_TradingName_List))","v":"TasNetworks (D)"}]
[null,{"$f":"CONCATENATE(\"Annual Reporting RIN Response \",IF(SUM(dms_SingleYear_Model)>0,CONCATENATE(CRY),CONCATENATE(FRCP_y1,\" to \",dms_MultiYear_FinalYear_Result)))","v":"Annual Reporting RIN Response 2017-18"}]
[null,"3.6 QUALITY OF SERVICES"]
[]
[null,"Did the MAIFI parameter of the STPIS apply during the period?",null,null,null,"No","** IMPORTANT\nPlease ensure this question is answered correctly. Your response will affect other tables throughout this workbook and will determine which cells are grey and which are input cells. "]
[]
[]
[]
[null,"3.6.8 - NETWORK FEEDER RELIABILITY"]
[null,"Feeder ID / name","Description of the service area for the feeder","Feeder classification\n\n(drop down)","Number of distribution customers","Length of high voltage distribution lines",null,"Maximum demand\n(MVA)","Energy not supplied\n(MWh)",null,"Unplanned Outages",null,null,null,null,"Planned Outages",null,null,null,null,"Momentary feeder outages"]
[null,null,null,null,null,"Overhead","Underground",null,"Unplanned","Planned","Total number of unplanned outages","Unplanned customer minutes off-supply (SAIDI)",null,"Unplanned interruptions\n(SAIFI)",null,"Total number of planned outages","Planned customer minutes off-supply (SAIDI)",null,"Planned interruptions\n(SAIFI)",null,"Total number of momentary feeder outages","Momentary interruptions due to feeder outages (MAIFI)"]
[null,null,null,null,null,null,null,null,null,null,null,"Including excluded events and MEDs","After removing excluded events and MED","Including excluded events and MEDs","After removing excluded events and MED",null,"Including MEDs","After removing  MED","Including MEDs","After removing  MED",null,"Including excluded events and MEDs","After removing excluded events and MED"]
[null,12017,"Enterprise Rd-Mt Nelson-Taroona","Urban",1004,6.5140000000000002,3.1720000000000002,3.3532999999999999,34.545657441749334,0.66692045741584549,22,1087.2199932966473,204.40823741870898,5.1165582099999991,3.1115557299999992,1,35.411705852926403,35.411705852926403,0.10205102000000001,0.10205102000000001]
[null,12018,"Upper Sandy Bay","Urban",888,0.02,4.4240000000000004,2.6661000000000001,23.083374685501102,0.38375868792309192,6,0.978675645342309,0.978675645342309,4.4893199999999998E-3,4.4893199999999998E-3,2,51.167826374859658,51.167826374859658,0.17059483,0.17059483]
[null,12019,"Lower Sandy Bay","Urban",1129,2.1989999999999998,3.5579999999999998,3.6162000000000001,39.124494237896293,0.93011582142390126,14,5.145296477931331,5.145296477931331,7.4899660000000021E-2,7.4899660000000021E-2,5,37.95630851538111,37.95630851538111,0.23896564000000001,0.23896564000000001]
[null,12030,"Lower Sandy Bay-Taroona (North)-Station Supply","Short Rural",936,6.18,5.2409999999999997,3.2993000000000001,28.892597224128004,0.38244839776523271,29,430.92899946495396,430.92899946495396,2.3649009799999989,2.3649009799999989,5,20.58052434456927,20.58052434456927,0.14874261,0.14874261]
[null,12031,"Mt Nelson-Taroona","Urban",952,10.201000000000001,4.0890000000000004,4.4259000000000004,57.639287185478409,7.1836856728548195,29,182.54531338345839,182.54531338345839,3.2090223999999985,3.2090223999999985,14,197.60701754385931,197.60701754385931,0.57944855000000006,0.57944855000000006]
[null,12032,"Sandy Bay-Dynnyrne-Waterworks Reserve","Short Rural",681,2.7490000000000001,3.9990000000000001,1.9618,18.057650893415328,5.7096771735657926E-3,9,7.2113148093841524,7.2113148093841524,0.22287385999999998,0.22287385999999998,1,1.9032258064516101,1.9032258064516101,8.6510260000000005E-2,8.6510260000000005E-2]
[null,12033,"Sandy Bay","Urban",344,0.68300000000000005,2.3889999999999998,1.1787000000000001,9.5011597257567217,0,5,1.388646288209606,1.388646288209606,8.7336000000000011E-3,8.7336000000000011E-3,0,0,0,0,0]
[null,12034,"University Boiler House","Short Rural",1,0,0.19400000000000001,2.6700000000000002E-2,0,0,0,0,0,0,0,0,0,0,0,0]
[null,12035,"Sandy Bay","Urban",852,1.266,4.3170000000000002,3.0808,29.131315404147287,0.40283151758779379,12,43.164479554774431,43.164479554774431,0.22378435999999999,0.22378435999999999,5,15.227885178676026,15.227885178676026,7.0298739999999998E-2,7.0298739999999998E-2]
[null,12036,"Sandy Bay-Fitzroy Place","Urban",15,0.29399999999999998,3.516,4.3281000000000001,20.162437147647143,0,1,0,0,0,0,0,0,0,0,0]
[null,12037,"Casino-Battery Point","Urban",312,0,2.85,2.6825999999999999,29.204216766329107,0,4,2.55106888361045,2.55106888361045,1.425178E-2,1.425178E-2,0,0,0,0,0]
[null,12038,"Tolmans Hill-Mt Nelson-Taroona-Sandy Bay","Short Rural",747,27.417999999999999,4.2880000000000003,3.1861999999999999,27.892286320897799,1.1175334597919491,16,124.80470746469382,124.80470746469382,1.3517147300000001,1.3517147300000001,7,54.084375655682464,54.084375655682464,0.18829850999999995,0.18829850999999995]
[null,12039,"West Hobart Zone","Urban",1184,0.52100000000000002,4.8010000000000002,3.4758,39.362503617345844,0.36389040313990773,12,14.891754403708369,14.891754403708369,0.11040872999999998,0.11040872999999998,1,11.0493046776232,11.0493046776232,3.2026970000000002E-2,3.2026970000000002E-2]
[null,13043,"Lynton Avenue South Hobart","Urban",437,0,1.472,1.4861,1.9642193197609598E-2,0,3,1.086306098964325,1.086306098964325,6.9044699999999994E-3,6.9044699999999994E-3,0,0,0,0,0]
[null,13044,"City West to Harrington and Murray Sts","Urban",516,0,3.3820000000000001,4.6868999999999996,2.0371351208741357,0.17637228496192825,3,44.317662007623802,44.317662007623802,9.6569240000000001E-2,9.6569240000000001E-2,1,8.7674714104193097,8.7674714104193097,3.8119439999999997E-2,3.8119439999999997E-2]
[null,13045,"South Hobart-Cascades","Short Rural",1553,10.821999999999999,4.37,4.109,15.159202400659087,0.23595153197880692,23,585.47667838098255,585.47667838098255,4.0430451499999993,4.0430451499999993,7,9.0362993896562749,9.0362993896562749,4.1117849999999997E-2,4.1117849999999997E-2]
[null,13046,"City (South)(Collins St)","Urban",8,0,0.89300000000000002,1.3146,1.9533332188924155E-2,0,1,4,4,0.125,0.125,0,0,0,0,0]
[null,13047,"City (South-East)(Macquarie St)-Salamanca","Urban",0,0,1.9710000000000001,1.0987,4.8665979392289015E-3,0.52599227129493231,1,0.50781913580246896,0.50781913580246896,6.1728299999999998E-3,6.1728299999999998E-3,1,96.512345679012299,96.512345679012299,0.32716049000000003,0.32716049000000003]
[null,13048,"Molle St Near Collins","Urban",372,0,1.9159999999999999,3.8422999999999998,0.15405840822605893,1.0530403519650325E-3,2,0.34620505992010597,0.34620505992010597,2.6631100000000002E-3,2.6631100000000002E-3,1,0.97203728362183695,0.97203728362183695,2.6631100000000002E-3,2.6631100000000002E-3]
[null,13049,"West Hobart (Hill St - Arthur St)","Urban",998,0.53400000000000003,3.762,2.7816999999999998,2.0325078185261261E-2,0.48892569841151257,7,0.86015732931726696,0.86015732931726696,6.0240599999999995E-3,6.0240599999999995E-3,5,29.33734939759033,29.33734939759033,0.10642567999999999,0.10642567999999999]
[null,13050,"Sandy Bay","Urban",291,4.2999999999999997E-2,2.83,1.4035,2.8204304623071823E-2,0,2,1.17301038062283,1.17301038062283,3.4602000000000001E-3,3.4602000000000001E-3,0,0,0,0,0]
[null,13051,"Open","Short Rural",0,0,0,0,0,0,0,0,0,0,0,0,0,0,0,0]
[null,13052,"Battery Point","Urban",712,0.126,5.9630000000000001,4.7504,0.30938600807011235,0,3,4.5535446478873203,4.5535446478873203,2.8168999999999998E-3,2.8168999999999998E-3,0,0,0,0,0]
[null,13053,"Battery Point (Hampton Road)","Urban",761,0,3.6989999999999998,2.7435999999999998,0.18532453375986771,0.69197139241645578,11,7.0533774257425668,7.0533774257425668,0.18085805999999999,0.18085805999999999,3,34.561056105610511,34.561056105610511,0.12145212999999999,0.12145212999999999]
[null,13054,"St Davids Park","Urban",246,0,2.0819999999999999,2.6863999999999999,1.10728056285084,0,5,62.831295843520685,62.831295843520685,1.0171148800000001,1.0171148800000001,0,0,0,0,0]
[null,13055,"South Hobart","Urban",897,2.5049999999999999,2.1190000000000002,3.4548999999999999,0.21820060769096017,2.0117990922714979,11,11.672991071428569,11.672991071428569,0.14285712999999997,0.14285712999999997,2,61.205357142857103,61.205357142857103,0.25334821000000002,0.25334821000000002]
[null,13056,"South Hobart - Sandy Bay Zone","Urban",597,0.58299999999999996,2.0819999999999999,1.5242,3.380128208344331E-3,0,4,0.28628762541805897,0.28628762541805897,3.3444799999999999E-3,3.3444799999999999E-3,0,0,0,0,0]
[null,13057,"Huon Road-Mount Wellington-Nieka","Short Rural",879,39.091999999999999,0.93200000000000005,3.3214999999999999,9.387623350357492,0.51716048309020979,27,66.537005365296665,66.537005365296665,1.1952054200000002,1.1952054200000002,6,22.825342465753394,22.825342465753394,7.305934E-2,7.305934E-2]
[null,13058,"MacQuarie St","Urban",27,0,1.3049999999999999,1.4035,0,0,0,0,0,0,0,0,0,0,0,0]
[null,14060,"Evans St","Short Rural",128,0,1.3640000000000001,0,20.671235580319095,0,1,0,0,0,0,0,0,0,0,0]
[null,14061,"Domain-Tasman Bridge","Urban",55,1.071,2.016,1.6702999999999999,1.3866423177101852,1.8292879305996941E-2,2,70.19417475728153,70.19417475728153,1.0485436700000001,1.0485436700000001,1,1.84466019417475,1.84466019417475,1.9417469999999999E-2,1.9417469999999999E-2]
[null,14062,"City (East)-Marine Board Group","Urban",116,0,3.242,2.1974,7.2413562556562523,0.31843747943639755,1,0,0,0,0,1,9.375,9.375,0.125,0.125]
[null,14063,"Argyle St North Hobart","Urban",277,0,2.4540000000000002,2.4767999999999999,2.8354750902411567E-2,2.1289206085282772E-2,4,1.00753564154786,1.00753564154786,8.1466200000000003E-3,8.1466200000000003E-3,2,1.8329938900203582,1.8329938900203582,1.629326E-2,1.629326E-2]
[null,14064,"Collins Street to CBD","Urban",51,0,0.75700000000000001,2.3371,0,1.6343041916881178E-2,0,0,0,0,0,1,1.94174757281553,1.94174757281553,3.883495E-2,3.883495E-2]
[null,14065,"Sackville-Collins-Argyle-Liverpool-Mall-Collins","Urban",324,0,1.901,5.3918999999999997,8.481846295870267E-3,0,1,0.40615384615384598,0.40615384615384598,3.0769199999999999E-3,3.0769199999999999E-3,0,0,0,0,0]
[null,14066,"Brooker Ave (University - Tech College)","Urban",78,0,0.69,2.1465999999999998,0,0,0,0,0,0,0,0,0,0,0,0]
[null,14067,"Parliament Sq and Law Courts via Davey St","Urban",118,0,1.819,4.7313999999999998,0,8.2245408760920888,0,0,0,0,0,2,170.67415730337061,170.67415730337061,0.61423220000000001,0.61423220000000001]
[null,14068,"Town Hall","Urban",168,0,1.603,3.5819000000000001,0,0,0,0,0,0,0,0,0,0,0,0]
[null,14069,"Murray St SBT to State Offices Macqu St Market Pl","Urban",73,0,1.5509999999999999,3.3277999999999999,0,6.7226026564428248E-2,1,0,0,0,0,2,7.3972602739725897,7.3972602739725897,4.1095889999999996E-2,4.1095889999999996E-2]
[null,14070,"Mawson Place - West Hobart Zone","Urban",145,0,3.0630000000000002,4.2233000000000001,0,0.3294251839945635,0,0,0,0,0,1,10.1102362204724,10.1102362204724,2.362204E-2,2.362204E-2]
[null,16091,"Albert Rpad-Charles St Moonah","Urban",1044,2.8090000000000002,7.4050000000000002,4.7187000000000001,0.77644912374884212,0.58974426584126771,14,32.863366200103506,32.863366200103506,0.72576456999999994,0.72576456999999994,1,14.442716433385099,14.442716433385099,0.20632452000000001,0.20632452000000001]
[null,16092,"Moonah-Gormanston Rd","Urban",639,0,2.59,2.1720000000000002,5.3621385373890537E-2,0.53017400117426716,6,2.6385636221701771,2.6385636221701771,0.38563621999999997,0.38563621999999997,1,34.727556596409002,34.727556596409002,9.2115530000000001E-2,9.2115530000000001E-2]
[null,16093,"Moonah-Birdwood Dr","Urban",294,0,3.5209999999999999,2.3624999999999998,0.26044239481090697,0,6,30.980194170403568,30.980194170403568,0.12556052000000001,0.12556052000000001,0,0,0,0,0]
[null,16094,"Lutana","Urban",1073,3.5950000000000002,2.54,3.9502000000000002,3.4398608649866755,2.9172840506102742E-2,18,95.426995992544178,95.426995992544178,1.3522832499999997,1.3522832499999997,2,0.666356011183596,0.666356011183596,1.86392E-3,1.86392E-3]
[null,16095,"Selfs Point-Lenox Avenue","Urban",156,1.2789999999999999,2.2210000000000001,1.8163,0.37805171405554056,3.3038348223255799E-3,4,43.389380530973412,43.389380530973412,0.48967550000000004,0.48967550000000004,1,0.70796460176991105,0.70796460176991105,5.8996999999999999E-3,5.8996999999999999E-3]
[null,16096,"North Hobart","Urban",1133,1.7250000000000001,8.0980000000000008,3.8422999999999998,5.1797901068140091E-2,0.43258338002316388,13,1.8949432109685931,1.8949432109685931,1.2383859999999997E-2,1.2383859999999997E-2,3,11.211853162317547,11.211853162317547,6.1034919999999999E-2,6.1034919999999999E-2]
[null,16097,"New Town (Cross St)","Urban",201,0,1.25,1.1241000000000001,1.6523383150053261E-2,0,1,1.3731343283582,1.3731343283582,4.9751200000000004E-3,4.9751200000000004E-3,0,0,0,0,0]
[null,16098,"Augusta Rd Lenah Valley-Creek Road Lenah Valley","Urban",1066,3.9220000000000002,3.7370000000000001,4.1725000000000003,3.110436943807164,0.1440238331522897,11,104.30015579439224,104.30015579439224,1.6233644300000001,1.6233644300000001,2,5.3971962616822369,5.3971962616822369,2.2429889999999997E-2,2.2429889999999997E-2]
[null,17100,"Eady St nr Cooper St-Derwent Pk (East)","Urban",61,0,4.6920000000000002,2.8388,0,0,0,0,0,0,0,0,0,0,0,0]
[null,17101,"East Derwent Hwy Bowen Bridge","Short Rural",343,10.114000000000001,6.391,3.4358,0.52713358286691347,0.55357706607491874,10,25.129142105263135,25.129142105263135,0.32163737999999997,0.32163737999999997,3,48.388888888888843,48.388888888888843,0.24269004,0.24269004]
[null,17102,"Derwent Park (HEC Garage)","Urban",1,0,0.81899999999999995,0.29849999999999999,0,0,0,0,0,0,0,0,0,0,0,0]
[null,17103,"Dowsing Point-Grove Road","Urban",598,2.0390000000000001,4.9340000000000002,3.3024,0.50216291705079608,5.7663930852376595E-2,13,22.272803347280313,22.272803347280313,0.41506272999999988,0.41506272999999988,3,3.16820083682008,3.16820083682008,1.3389119999999999E-2,1.3389119999999999E-2]
[null,17104,"Derwent Park (Sunderland Street)","Urban",156,0,1.8640000000000001,2.0068999999999999,6.7862362425814393E-2,8.4489248148215707E-2,5,17.703225806451599,17.703225806451599,0.31612902999999998,0.31612902999999998,2,29.193548387096687,29.193548387096687,7.7419349999999998E-2,7.7419349999999998E-2]
[null,17105,"Goodwood","Urban",873,2.7149999999999999,3.9009999999999998,3.6644000000000001,6.4056753942659111E-2,0.58498856588959425,13,0.6464530892448489,0.6464530892448489,9.1532799999999997E-3,9.1532799999999997E-3,2,23.718535469107461,23.718535469107461,5.3775730000000001E-2,5.3775730000000001E-2]
[null,17106,"Brooker Hwy Lutana","Urban",489,2.58,3.3929999999999998,3.4992999999999999,0.31767879214796763,0.76797516083668094,4,2.0521006198347091,2.0521006198347091,6.1983300000000002E-3,6.1983300000000002E-3,1,38.398760330578497,38.398760330578497,0.13016527999999999,0.13016527999999999]
[null,17107,"Main Rd Moonah","Urban",299,3.06,4.1139999999999999,3.9565999999999999,0.45068925822945805,1.0247299550193456,22,21.3929624309392,21.3929624309392,0.42778207000000007,0.42778207000000007,3,27.650420915548438,27.650420915548438,0.16179951000000001,0.16179951000000001]
[null,17108,"Derwent Park (Howard Road)","Urban",28,0,1.446,0.58430000000000004,0,2.9807661443408566E-2,0,0,0,0,0,1,6,6,4.1666660000000001E-2,4.1666660000000001E-2]
[null,17109,"Moonah (Lampton Ave)-Moonah (HEC Depot)","Urban",89,0,1.504,1.1813,7.6963349474662261E-3,0.55279776985584661,3,0.65968586387434502,0.65968586387434502,1.04712E-2,1.04712E-2,3,101.15183246073289,101.15183246073289,0.24083767999999997,0.24083767999999997]
[null,18131,"A-Argyle St to Library - B-Victoria St via CBD SW","Urban",583,0,4.6459999999999999,6.0587,0.10278686523068711,0.34823754253393402,6,2.2308726377952728,2.2308726377952728,4.3307060000000001E-2,4.3307060000000001E-2,1,10.0590551181102,10.0590551181102,2.7559050000000002E-2,2.7559050000000002E-2]
[null,18132,"A-Websters, B-RHH","Urban",33,0,2.2410000000000001,2.8007,0,0,0,0,0,0,0,0,0,0,0,0]
[null,18133,"A-RHH, B-North Hobart (Brisbane Street)","Urban",138,0,3.2250000000000001,3.3723000000000001,0.10460218598997924,0.15542305937190312,2,3.2615384615384602,3.2615384615384602,1.53846E-2,1.53846E-2,1,4.8461538461538396,4.8461538461538396,2.3076920000000001E-2,2.3076920000000001E-2]
[null,18134,"A-North Hobart, B-Domain","Urban",760,1.1970000000000001,2.7069999999999999,2.3511000000000002,0.12567640510788788,1.0002278514155565,8,5.6924042686754399,5.6924042686754399,0.17953543999999999,0.17953543999999999,5,45.304456999372171,28.581293157564275,0.13935968999999998,9.4161949999999994E-2]
[null,18135,"A-New Town Substation, B-Augusta Rd","Urban",604,0.55500000000000005,2.6840000000000002,2.2176999999999998,6.4793439049006547E-3,0.28906855084635991,6,0.31686274509803802,0.31686274509803802,4.7058600000000001E-3,4.7058600000000001E-3,2,14.136470588235261,14.136470588235261,6.5882339999999998E-2,6.5882339999999998E-2]
[null,18136,"A-New Town-Mt Stuart, B-Stn Supp No1 (Transend)","Short Rural",464,0,0,2.4197000000000002,0,0,0,0,0,0,0,0,0,0,0,0]
[null,18141,"A-Stn Supp No2 (Transend), B-North Hobart","Urban",443,0,2.9729999999999999,3.2694000000000001,0.37517073658279171,0,6,11.387909604519757,11.387909604519757,9.0395449999999988E-2,9.0395449999999988E-2,0,0,0,0,0]
[null,18142,"A-City (West), B-City (West)","Urban",215,0,2.2949999999999999,1.5014000000000001,1.0813112779592531,0,2,58.669767441860465,58.669767441860465,1.0046511499999999,1.0046511499999999,0,0,0,0,0]
[null,18143,"A-North Hobart, B-Mount Stuart-City(North)","Urban",1391,1.637,5.625,4.3783000000000003,5.8139454277309248,1.4356345095343683,18,154.62096227501792,154.62096227501792,1.1871849800000001,1.1871849800000001,7,38.747300215982641,38.747300215982641,0.11447082,0.11447082]
[null,18144,"A-North Hobart, B-Lenah Valley-New Town","Short Rural",1213,0,0,4.7709000000000001,0,0,0,0,0,0,0,0,0,0,0,0]
[null,18145,"Noth Hobart Substation","Short Rural",161,0,0,1.3108,0,0,0,0,0,0,0,0,0,0,0,0]
[null,18146,"A-Mount Stuart, B-New Town, Ogilvie High School","Urban",2374,8.9450000000000003,15.409000000000001,11.2829,1.434687979981242,0.57184435207935791,47,43.260783118201417,43.260783118201417,0.39564883000000001,0.39564883000000001,15,17.594778825235654,17.594778825235654,7.4836760000000002E-2,7.4836760000000002E-2]
[null,20534,"Glenorchy (East)","Urban",320,1.4570000000000001,2.1080000000000001,1.0892999999999999,4.6638427906472546E-2,1.1255083236699845,6,3.0437116564417162,3.0437116564417162,2.7607339999999998E-2,2.7607339999999998E-2,1,117.20245398773,117.20245398773,0.29447852000000002,0.29447852000000002]
[null,20535,"West Moonah","Urban",1745,4.6539999999999999,5.4820000000000002,4.5476999999999999,19.478713537057047,0.52106297115649414,33,209.38974875322336,209.38974875322336,2.1587847300000012,2.1587847300000012,1,12.9475494411006,12.9475494411006,3.6686719999999999E-2,3.6686719999999999E-2]
[null,20536,"Glenorchy (Central)","Urban",890,2.3210000000000002,2.8109999999999999,2.3372000000000002,1.5035272028461604,0.95785701602475015,12,67.180822209821415,67.180822209821415,1.0323660399999997,1.0323660399999997,3,42.799107142856997,42.799107142856997,0.13950891999999998,0.13950891999999998]
[null,20537,"Merton-Glenorchy (Central)","Short Rural",825,2.8460000000000001,4.5960000000000001,2.1139000000000001,4.7906788523114008,0.20000887886073457,10,247.09947274939074,247.09947274939074,1.0085157799999995,1.0085157799999995,1,10.316301703163001,10.316301703163001,0.19464719999999999,0.19464719999999999]
[null,20538,"Open","Short Rural",0,0,0,0,0,0,0,0,0,0,0,0,0,0,0,0]
[null,20539,"Glenorchy (Central)","Short Rural",168,0.113,3.7909999999999999,0.62290000000000001,0,0,0,0,0,0,0,0,0,0,0,0]
[null,20540,"Northgate-Nichols St","Urban",186,0,3.8119999999999998,2.4984999999999999,0.21178260646347899,1.0533792803928668,1,6.8106596205961996,6.8106596205961996,5.42005E-3,5.42005E-3,4,33.875338753387481,33.875338753387481,0.19512191999999998,0.19512191999999998]
[null,20541,"Rosetta-Berriedale","Urban",754,2.992,7.56,4.7287999999999997,2.8874658157632287,2.8660237124331734E-2,4,71.704831237590895,71.704831237590895,1.0046326799999998,1.0046326799999998,1,0.71475843812045003,0.71475843812045003,3.9708800000000004E-3,3.9708800000000004E-3]
[null,20542,"Station Supply No1 (Owned By Transend)","Urban",1,0,2.4E-2,0.12920000000000001,0,0,0,0,0,0,0,0,0,0,0,0]
[null,20544,"Glenorchy (North)-Montrose","Urban",229,1.165,1.99,3.4710000000000001,3.8265742889135539,0,9,139.99115044247787,139.99115044247787,2.3938052999999999,2.3938052999999999,0,0,0,0,0]
[null,20545,"Glenorchy (West)","Short Rural",939,1.952,4.3360000000000003,0.80649999999999999,0.51030790113519864,0.76441740495340937,9,40.462716782841795,40.462716782841795,0.12117958,0.12117958,1,60.611260053619297,60.611260053619297,0.16836461,0.16836461]
[null,20547,"Stn Service No2 (Transend)-Merton-West Moonah","Urban",936,3.9670000000000001,0.76100000000000001,2.2033,1.8044640761911254E-2,0,15,0.87027119914346596,0.87027119914346596,8.5652799999999998E-3,8.5652799999999998E-3,0,0,0,0,0]
[null,20548,"Lenah Valley","Short Rural",1629,13.587,5.71,4.9645000000000001,19.6495861939589,0.67458704375926559,23,444.02823025107034,444.02823025107034,3.0685852399999982,3.0685852399999982,5,15.404164115125525,15.404164115125525,5.2051400000000005E-2,5.2051400000000005E-2]
[null,20549,"Rosetta-Berriedale-Chigwell","Urban",972,1.7869999999999999,6.8390000000000004,2.8780000000000001,0.64385501586642591,3.6962116484091405,18,23.321495934122417,23.321495934122417,0.10499220999999995,0.10499220999999995,13,145.87339166237743,145.87339166237743,0.48481721000000005,0.48481721000000005]
[null,20551,"Glenorchy (West)","Urban",210,2.2930000000000001,0.63500000000000001,1.0447,0.31100204860070102,0,4,18.528652300242108,18.528652300242108,1.00242129,1.00242129,0,0,0,0,0]
[null,20552,"Montrose","Urban",1048,5.5090000000000003,2.94,2.8582000000000001,1.6441388186327399,0.10998462297041041,15,63.715264187866836,63.715264187866836,0.30332677000000002,0.30332677000000002,2,4.2622309197651624,4.2622309197651624,1.369861E-2,1.369861E-2]
[null,20553,"Rosetta (West)-Glenlusk-Collinsvale-Collins Cap","Short Rural",959,47.74,2.4329999999999998,2.5952000000000002,14.529710621196866,2.5473044596758125,26,46.432829301355532,46.432829301355532,0.8644420599999999,0.8644420599999999,10,100.94264859228343,100.94264859228343,0.29614177000000003,0.29614177000000003]
[null,20554,"Glenorchy (Central)","Urban",417,0.46600000000000003,2.8769999999999998,2.7490000000000001,0,0,2,0,0,0,0,0,0,0,0,0]
[null,21081,"Claremont","Urban",908,2.4,4.3970000000000002,2.8452000000000002,1.6803564356344678,5.030302087684254E-2,9,68.680695934065881,68.680695934065881,1.00329669,1.00329669,2,2.554945054945053,2.554945054945053,1.6483500000000002E-2,1.6483500000000002E-2]
[null,21082,"Battersby Drive","Urban",227,0,1.669,0.77480000000000004,0,0,0,0,0,0,0,0,0,0,0,0]
[null,21083,"Cadburys","Urban",319,0,3.8759999999999999,2.9468000000000001,2.4402775191774435E-2,0,4,0.67616747181964498,0.67616747181964498,9.6618299999999997E-3,9.6618299999999997E-3,0,0,0,0,0]
[null,21084,"Cadburys","Urban",113,0,2.5270000000000001,2.5085999999999999,0,0,0,0,0,0,0,0,0,0,0,0]
[null,21085,"Claremont","Urban",1598,8.91,5.0170000000000003,4.8011999999999997,0.40272326644320589,0.47141412949397543,17,6.800480991217035,6.800480991217035,0.11041400999999999,0.11041400999999999,2,29.513801756587089,29.513801756587089,0.11856963,0.11856963]
[null,21086,"Claremont (East)","Urban",716,2.3740000000000001,2.653,2.4578000000000002,9.1297006898381916,1.9729072055057919,14,564.81191637630548,564.81191637630548,5.1205574,5.1205574,5,73.721254355400518,57.344947735191511,0.30940764000000004,0.23972122999999998]
[null,21087,"Rosetta","Urban",609,1.393,3.4,1.6830000000000001,0.10382690397620348,1.0761443965834669,10,8.5798525798525773,8.5798525798525773,3.6036020000000002E-2,3.6036020000000002E-2,10,102.72727272727265,102.72727272727265,0.50122845000000005,0.50122845000000005]
[null,21088,"Claremont-Chigwell (Nth)","Urban",346,1.073,1.252,0.92090000000000005,3.6792879900489656E-2,0.27461712020070805,5,0.23376623376623301,0.23376623376623301,2.8860000000000001E-3,2.8860000000000001E-3,2,67.128427128427006,67.128427128427006,0.19047617999999999,0.19047617999999999]
[null,21089,"Claremont West-Austins Ferry","Short Rural",122,6.5510000000000002,1.8660000000000001,2.4767999999999999,4.4259744082929015E-2,0,2,2.3111570247933861,2.3111570247933861,1.6528919999999999E-2,1.6528919999999999E-2,0,0,0,0,0]
[null,22323,"Shorline-Howrah-Tranmere","Urban",409,1.389,3.1659999999999999,4.0683999999999996,18.836086312067547,7.6165128917427272E-2,4,281.89150460593589,281.89150460593589,1.0051177000000002,1.0051177000000002,2,5.3224155578300909,5.3224155578300909,4.7082899999999997E-2,4.7082899999999997E-2]
[null,22324,"Mornington-Rokeby Terminal","Short Rural",336,10.505000000000001,3.8660000000000001,1.5242,0.37606803472227768,9.9829330514944623E-2,9,31.521690724637629,31.521690724637629,0.25507244000000001,0.25507244000000001,2,7.7101449275362199,7.7101449275362199,2.6086950000000001E-2,2.6086950000000001E-2]
[null,22325,"Ninabah St Howrah","Urban",906,0,6.0949999999999998,2.6558999999999999,1.252704209400102,1.6099236491165323,8,35.014933076499645,35.014933076499645,0.15410014000000002,0.15410014000000002,10,70.686681342872674,70.686681342872674,0.29829384999999997,0.29829384999999997]
[null,22326,"Rokeby-Rokeby Terminal","Urban",345,0,2.7909999999999999,0.85740000000000005,3.6600965578199008E-3,0.40106522233589836,4,0.77681159420289703,0.77681159420289703,8.6956500000000009E-3,8.6956500000000009E-3,3,64.999999999999844,64.999999999999844,0.25507246,0.25507246]
[null,22328,"Clarence St Bellerive","Urban",791,2.8149999999999999,4.9059999999999997,3.5203000000000002,0.77040771397517194,1.6881889165784325,5,67.702447215189864,67.702447215189864,0.23291138,0.23291138,5,56.524367088607526,56.524367088607526,0.18101262999999998,0.18101262999999998]
[null,22329,"Howrah-Rokeby-Bellerive Zone","Urban",997,4.9669999999999996,6.5110000000000001,3.9965999999999999,0.56719125816166505,1.7343553784164425,14,25.114751630707428,25.114751630707428,1.1971901400000005,1.1971901400000005,10,64.571249372804658,64.571249372804658,0.24385344,0.24385344]
[null,22330,"Rokeby","Short Rural",74,0.78500000000000003,0.185,0.2286,7.9279277507249301E-4,0,3,1.0270270270270261,1.0270270270270261,2.7027019999999999E-2,2.7027019999999999E-2,0,0,0,0,0]
[null,22331,"Howrah-Tranmere","Urban",966,0,6.6589999999999998,4.7370999999999999,12.034377581024703,1.2313760145632724,11,127.63167790998432,127.63167790998432,1.1495085099999998,1.1495085099999998,5,37.410243145369733,24.443869632695232,0.17485771,9.2084819999999998E-2]
[null,22333,"Ploughman Rd","Urban",1,0,0.248,1.9053,0,0,0,0,0,0,0,0,0,0,0,0]
[null,23340,"Open","Short Rural",0,0,0,0,0,0,0,0,0,0,0,0,0,0,0,0]
[null,23341,"Bellerive CBD to Kangaroo Bluff via Cambridge Road","Urban",666,1.246,2.762,2.0958000000000001,3.0119731581044473E-2,0.56158716449197721,5,1.2994214339622632,1.2994214339622632,7.5471599999999998E-3,7.5471599999999998E-3,6,32.578113207547091,32.578113207547091,0.16905658000000004,0.16905658000000004]
[null,23342,"Lindisfarne-Geilstone Bay Zone","Urban",833,1.9710000000000001,5.351,5.3765999999999998,7.2873403366033266E-3,1.0350510239720463,4,0.22664660660660599,0.22664660660660599,3.6035999999999998E-3,3.6035999999999998E-3,4,14.834834834834817,14.834834834834817,6.8468459999999995E-2,6.8468459999999995E-2]
[null,23343,"Bellerive Zone Via Bayfield and Bligh Streets","Urban",779,0,4.3029999999999999,3.1938,2.2566707172904793E-2,0.41284536370355818,10,0.57255156150413899,0.57255156150413899,7.6481400000000003E-3,7.6481400000000003E-3,8,21.791969407265693,21.791969407265693,7.1382990000000007E-2,7.1382990000000007E-2]
[null,23346,"Open","Short Rural",0,0,0,0,0,0,0,0,0,0,0,0,0,0,0,0]
[null,23347,"Rosny Bastick St Motague Bay Lindisfarne +Sub Cab","Urban",845,4.4660000000000002,4.25,3.0567000000000002,5.5527646065134956E-3,1.0038874027037616,9,0.51303317535544801,0.51303317535544801,5.9241499999999996E-3,5.9241499999999996E-3,17,73.440363388625499,73.440363388625499,0.22156390999999998,0.22156390999999998]
[null,23348,"Linisfarne via Gordins Hill Rd","Urban",653,2.0310000000000001,3.7010000000000001,2.3567999999999998,4.2889151798995356E-2,0.18747334742676591,5,3.0856525496974831,3.0856525496974831,3.8029359999999998E-2,3.8029359999999998E-2,1,16.069144338807199,16.069144338807199,0.1434745,0.1434745]
[null,24401,"Howrah Zone","Subtransmission",0,0,4.6289999999999996,10.311199999999999,0,0,0,0,0,0,0,0,0,0,0,0]
[null,24402,"Cambridge Zone","Subtransmission",0,0,8.8119999999999994,6.9790000000000001,0,0,0,0,0,0,0,0,0,0,0,0]
[null,24406,"Howrah Zone","Subtransmission",0,0,4.62,10.254099999999999,0,0,0,0,0,0,0,0,0,0,0,0]
[null,25305,"Bellerive Zone Substation","Subtransmission",0,4.5970000000000004,1.256,6.4016999999999999,0,0,0,0,0,0,0,0,0,0,0,0]
[null,25306,"Future","Subtransmission",0,0,0,0,0,0,0,0,0,0,0,0,0,0,0,0]
[null,25307,"Geilston Bay Zone Substation","Subtransmission",1,1.92,8.6999999999999994E-2,8.0498999999999992,0,0,0,0,0,0,0,0,0,0,0,0]
[null,25308,"Geilston Bay Zone Substation","Subtransmission",1,2.21,0.19900000000000001,9.8529999999999998,0,0,0,0,0,0,0,0,0,0,0,0]
[null,25309,"Cambridge Zone","Subtransmission",0,0,12.673,7.4869000000000003,0,0,0,0,0,0,0,0,0,0,0,0]
[null,25310,"Bellerive Zone Substation","Subtransmission",0,3.0870000000000002,2.456,7.7683999999999997,0,0,0,0,0,0,0,0,0,0,0,0]
[null,26160,"Station Supply","Short Rural",1,0,0,0,0,0,0,0,0,0,0,0,0,0,0,0]
[null,26161,"Risdon-Otago Bay","Short Rural",652,13.302,6.1120000000000001,2.0767000000000002,6.9714724438944345E-2,0,4,4.5681655960028458,4.5681655960028458,0.11134903,0.11134903,0,0,0,0,0]
[null,26162,"Lindisfarne (West)-Geilston Bay","Urban",432,8.8999999999999996E-2,1.915,3.4548999999999999,1.8132792786087031,2.1833255368609761,4,12.384728604651084,12.384728604651084,0.18837208999999999,0.18837208999999999,2,46.813953488372,46.813953488372,0.13720928999999998,0.13720928999999998]
[null,26163,"Lindisfarne-Rose Bay-Montagu Bay","Urban",302,1.5740000000000001,1.1220000000000001,1.0351999999999999,1.045667114835402,4.0409918461099495E-2,5,123.14900662251651,123.14900662251651,1.31125826,1.31125826,4,4.6698675496688669,4.6698675496688669,2.6490040000000006E-2,2.6490040000000006E-2]
[null,26164,"Risdon Brook","Short Rural",1440,9.4580000000000002,4.8899999999999997,3.5882000000000001,1.4451455378746763,1.8618342906175807,19,78.676827156217399,78.676827156217399,1.2220297499999999,1.2220297499999999,16,68.20028867336319,68.20028867336319,0.24592997999999994,0.24592997999999994]
[null,26165,"Flagstaff Gully-Warrane (North) - Kennedy Drive","Urban",388,4.3209999999999997,4.633,2.7498999999999998,2.374388492403555,0.10758556204046157,5,200.71657754010593,200.71657754010593,1.0347593399999999,1.0347593399999999,2,4.5641711229946473,4.5641711229946473,3.4759350000000001E-2,3.4759350000000001E-2]
[null,26166,"Lindisfarne (East) Malunna Rd to Begonia St","Urban",492,2.6680000000000001,0.91600000000000004,1.5179,0.11188347693692557,0.15030549002276419,4,1.20773930753564,1.20773930753564,1.8329910000000001E-2,1.8329910000000001E-2,1,22.545824847250501,22.545824847250501,8.3503049999999995E-2,8.3503049999999995E-2]
[null,26167,"Risdon Vale","Short Rural",858,9.109,4.3890000000000002,3.6389999999999998,4.7043486680252693,3.620505586223556,13,118.18995342648027,118.18995342648027,2.009314680000001,2.009314680000001,3,82.528276779773591,82.528276779773591,0.30738521000000002,0.30738521000000002]
[null,26169,"Open","Short Rural",0,0,0,0,0,0,0,0,0,0,0,0,0,0,0,0]
[null,27171,"Warrane via Barana St to Hill/Beach Sts Bellerive","Urban",1065,2.851,2.6579999999999999,3.0103,0.21642848922903571,1.0545713133238521,11,1.6816713076199379,1.6816713076199379,9.4073000000000004E-3,9.4073000000000004E-3,7,45.044214487299989,45.044214487299989,0.22953901000000002,0.22953901000000002]
[null,27172,"Open","Short Rural",0,0,0,0,0,0,0,0,0,0,0,0,0,0,0,0]
[null,27173,"Cambridge","Short Rural",222,8.5860000000000003,2.1669999999999998,0.91449999999999998,1.5105604413336356E-2,2.5911503845611503E-2,4,4.933628318584061,4.933628318584061,8.8495539999999998E-2,8.8495539999999998E-2,2,8.5663716814159194,8.5663716814159194,3.9822999999999997E-2,3.9822999999999997E-2]
[null,27174,"Open","Short Rural",0,0,0,0,0,0,0,0,0,0,0,0,0,0,0,0]
[null,27175,"Warrane Cambridge Rd to Kangaroo Bay - Bayfield St","Urban",885,2.6779999999999999,2.722,2.4641000000000002,1.3565032201885481,0.58575727667804511,9,119.8739424703891,119.8739424703891,2.0451212300000003,2.0451212300000003,6,50.189509306260462,50.189509306260462,0.14100393,0.14100393]
[null,27176,"Warrane-Rosny","Urban",356,0.32600000000000001,5.5869999999999997,4.2233000000000001,0.6744106998137378,1.4435703063821084,4,18.495412844036601,18.495412844036601,7.7064220000000003E-2,7.7064220000000003E-2,1,33.966360733944903,33.966360733944903,0.10642201,0.10642201]
[null,27177,"Open","Short Rural",0,0,0,0,0,0,0,0,0,0,0,0,0,0,0,0]
[null,27178,"South Arm Hwy to Nankar Cr to South/Chrch Sts","Urban",669,3.66,2.5329999999999999,2.4197000000000002,0.25057135622603854,0.29179994974711088,8,11.030457614403584,11.030457614403584,0.13203297999999999,0.13203297999999999,2,17.479369842460521,17.479369842460521,5.7014240000000001E-2,5.7014240000000001E-2]
[null,28221,"Ploughman Rd-Actaeon St","Urban",657,0,4.9859999999999998,1.9510000000000001,0.17848362405128465,0.31042264313762774,11,12.557916084977228,12.557916084977228,0.17602427000000001,0.17602427000000001,7,9.7617602427921,9.7617602427921,4.2488610000000024E-2,4.2488610000000024E-2]
[null,28222,"Lauderdale West -Sandford East - Clifton Beach","Short Rural",972,68.507000000000005,1.853,3.2027000000000001,4.1300892159742482,1.4360293235688473,41,95.897178683385476,95.897178683385476,1.3761754500000001,1.3761754500000001,24,65.033089446185784,65.033089446185784,0.23928938,0.23928938]
[null,28223,"Lauderdale_East Roches Beach","Short Rural",1293,28.170999999999999,3.2730000000000001,4.21,1.1313141590267559,1.7451615568056527,36,40.161707322743034,40.161707322743034,0.80976355999999938,0.80976355999999938,7,34.460377140643104,34.460377140643104,0.13638121,0.13638121]
[null,28224,"Rokeby","Urban",837,0,4.6260000000000003,2.1566999999999998,0.938925015088374,0.19962521826206819,4,57.822724568709077,57.822724568709077,1.0065436999999999,1.0065436999999999,8,15.757287328970831,15.757287328970831,0.10707906999999998,0.10707906999999998]
[null,28225,0,"Urban",11,0.97399999999999998,2.4830000000000001,1.2345999999999999,0,0,1,0,0,0,0,0,0,0,0,0]
[null,28226,"Station Supply (Owned By Transend)","Short Rural",1,0,0,9.9099999999999994E-2,0,0,0,0,0,0,0,0,0,0,0,0]
[null,28227,"Clarendon Vale-Pass Road","Short Rural",1471,0,0,1.6766000000000001,0,0,0,0,0,0,0,0,0,0,0,0]
[null,28228,"Claredon Vale","Urban",655,1.4139999999999999,5.75,3.7837999999999998,0.60250280534723322,0,14,48.816023489932789,48.816023489932789,0.16946305000000003,0.16946305000000003,0,0,0,0,0]
[null,28229,"Rokeby East (Rokeby Rd)","Urban",74,1.6160000000000001,0.67400000000000004,5.7519999999999998,2.5175484976252998,0,2,47.905405405405403,47.905405405405403,1.0135135099999999,1.0135135099999999,0,0,0,0,0]
[null,28230,"Future","Short Rural",0,0,0,0,0,0,0,0,0,0,0,0,0,0,0,0]
[null,28231,"Tranmere West via Droughty Point","Short Rural",1080,10.548,3.9510000000000001,3.8353000000000002,6.6729494269864356,6.7529032411512144,22,330.57114566699084,330.57114566699084,1.8227846600000006,1.8227846600000006,12,276.67770204479029,276.67770204479029,0.84225894999999995,0.84225895000000006]
[null,28232,"Sandford West to Opossum Bay","Short Rural",1300,80.375,3.8010000000000002,3.0941000000000001,25.032140714519141,0.101159675753015,52,218.58547338521382,218.58547338521382,2.83112838,2.83112838,10,6.6522698054474505,6.6522698054474505,0.14630349000000001,0.14630349000000001]
[null,29481,"Mount Rumney-Mornington-Bellerive Zone","Short Rural",370,14.791,6.4930000000000003,1.2726999999999999,1.3255770763413677,1.1444590180900065,11,40.531165311653098,40.531165311653098,1.0460704200000002,1.0460704200000002,5,91.695663956639493,91.695663956639493,0.52574522999999995,0.52574522999999995]
[null,29482,"Backhouse Lane","Short Rural",103,6.2930000000000001,0.69899999999999995,0.8377,0.93086271781924557,0.3349075549885967,3,1.5652173913043441,1.5652173913043441,1.9323659999999999E-2,1.9323659999999999E-2,2,30.971980676328428,30.971980676328428,8.6956500000000006E-2,8.6956500000000006E-2]
[null,29483,"Seven Mile Beach","Short Rural",728,23.969000000000001,2.2349999999999999,3.5304000000000002,0.15169687521085487,0.36785652004545927,18,5.353994490358108,5.353994490358108,3.3057839999999991E-2,3.3057839999999991E-2,9,19.994191873278218,19.994191873278218,0.10468317000000001,0.10468317000000001]
[null,29484,"Future","Short Rural",0,0,0,0,0,0,0,0,0,0,0,0,0,0,0,0]
[null,29485,"Hobart Airport","Short Rural",14,3.472,8.093,1.7324999999999999,0,0,0,0,0,0,0,0,0,0,0,0]
[null,29486,"Cranston Parade","Short Rural",177,0.86,2.3650000000000002,0.72650000000000003,0,0.4577399969100952,0,0,0,0,0,1,54,54,0.33333332999999998,0.33333332999999998]
[null,29487,"Open","Short Rural",0,0,0,0,0,0,0,0,0,0,0,0,0,0,0,0]
[null,29488,"Cambridge-Richmond Golf Course-Brighton","Short Rural",481,39.378,2.7450000000000001,3.8956,6.471018997667576,2.4001465703473848,23,159.1486157253596,159.1486157253596,2.3078624999999988,2.3078624999999988,23,106.29457364341069,105.91805094130659,0.94573624000000012,0.56921355000000007]
[null,29489,"Pittwater Road","Short Rural",233,12.669,3.7930000000000001,2.0539000000000001,0.14260759629433498,3.6226076053815253,5,7.692176039119782,7.692176039119782,1.0757945999999998,1.0757945999999998,4,166.30806845965671,166.30806845965671,0.67481659999999999,0.67481659999999999]
[null,29490,"Acton Park","Short Rural",339,13.475,2.8610000000000002,1.2263999999999999,0.21910383569745623,1.2787611874858889E-2,5,28.277482890855367,28.277482890855367,7.9646009999999989E-2,7.9646009999999989E-2,1,3.0088495575221201,3.0088495575221201,8.8495499999999994E-3,8.8495499999999994E-3]
[null,29491,"Cambridge Park","Urban",118,0,2.569,1.6646000000000001,0,0,0,0,0,0,0,0,0,0,0,0]
[null,29492,"Holyman Avenue","Short Rural",0,0,2.3820000000000001,4.9500000000000002E-2,0,0,0,0,0,0,0,0,0,0,0,0]
[null,30603,"Huonville (North)-Ranelagh-Judbury-Lonnavale","Short Rural",1060,88.566999999999993,1.264,3.62,4.0808364353642474,0.56359537504258128,32,70.03938388625582,70.03938388625582,0.37914675000000003,0.37914675000000003,5,9.6729857819904996,9.6729857819904996,4.1706130000000008E-2,4.1706130000000008E-2]
[null,30604,"Huonville (Central)-South Franklin-Glen Huon","Short Rural",930,74.08,2.0190000000000001,4.5898000000000003,10.234104443439053,1.0205485594475392,23,155.97211881838047,155.97211881838047,0.81400426999999986,0.81400426999999986,8,20.906436870897089,20.906436870897089,7.221002E-2,7.221002E-2]
[null,30605,"Huonville (South)-Franklin","Short Rural",731,33.438000000000002,0.88100000000000001,2.6293000000000002,0.92217079827209714,0.10822527976733261,19,34.316826575342432,34.316826575342432,0.22602732,0.22602732,1,4.02739726027397,4.02739726027397,1.6438350000000001E-2,1.6438350000000001E-2]
[null,30606,"Cradoc-Cygnet-Glaziers Bay","Short Rural",1043,71.349000000000004,0.67300000000000004,2.7302,2.1027728013660174,1.0823722086697041,31,13.070873135755232,13.070873135755232,0.11281059000000004,0.11281059000000004,12,38.165073326959799,38.165073326959799,0.14435938000000004,0.14435938000000004]
[null,30607,"Pelverata-Lower Woodstock-Verona Sands","Short Rural",1515,138.822,0.80400000000000005,2.9359999999999999,9.9907848488714368,3.7206949691707689,47,223.34957404169404,223.34957404169404,0.8486883900000004,0.8486883900000004,32,156.33879172831178,156.33879172831178,0.55615309999999996,0.55615309999999996]
[null,30608,"Grove-Crabtree-Lower Longley-Mountain River","Short Rural",1313,130.68700000000001,0.217,4.2049000000000003,1.5473257862917722,0.859453323855909,46,23.736696377093814,23.736696377093814,0.31554307000000009,0.31554307000000009,15,17.424191663420299,17.424191663420299,6.7004149999999998E-2,6.7004149999999998E-2]
[null,31002,"Wattle Grove-Petcheys Bay-Lymington","Short Rural",432,57.26,1.597,0.6522,12.024045560780818,7.8028386470043301E-2,24,697.80755563636296,697.80755563636296,3.4036362799999993,3.4036362799999993,7,14.181818181818144,14.181818181818144,6.7878750000000002E-2,6.7878750000000002E-2]
[null,31007,"Geeveston-Police Point-Surveyors Bay","Short Rural",1074,95.004000000000005,2.012,2.1263999999999998,2.8895466404320076,0.43223204592351894,36,67.277533114754007,67.277533114754007,0.39906305999999997,0.39906305999999997,6,31.613114754098323,31.613114754098323,0.10585477,0.10585477]
[null,31008,"Dover-Southport-Lune River","Short Rural",1156,95.876999999999995,11.222,2.6966999999999999,2.1215872128757471,1.9351053108435077,34,84.086149999999876,84.086149999999876,0.34063031000000021,0.34063031000000021,13,75.733800350262584,75.733800350262584,0.33625212999999998,0.33625212999999998]
[null,31010,"Port Huon-Castle Forbes Bay","Short Rural",478,28.896000000000001,0.377,1.2434000000000001,0.1470940515040691,0.40281573372382956,19,14.159914255091078,14.159914255091078,0.12647369,0.12647369,2,58.842443729903515,58.842443729903515,0.16720256,0.16720256]
[null,32371,"Summerleas Zone (Station Service)","Short Rural",1,0,1E-3,0,0,0,0,0,0,0,0,0,0,0,0,0]
[null,32372,"Future","Short Rural",0,0,0,0,0,0,0,0,0,0,0,0,0,0,0,0]
[null,32373,"Future","Short Rural",0,0,0,1.9099999999999999E-2,0,0,0,0,0,0,0,0,0,0,0,0]
[null,32374,"Kingston (Summerleas Rd)-Kingston Terminal","Urban",1122,3.1659999999999999,8.1280000000000001,3.9312,13.325418084409991,1.0975958373161596,10,346.83621255565345,346.83621255565345,3.1006232899999993,3.1006232899999993,5,30.733689492430969,30.733689492430969,8.9937639999999999E-2,8.9937639999999999E-2]
[null,32375,"Future","Short Rural",0,0,0,0,0,0,0,0,0,0,0,0,0,0,0,0]
[null,32376,"Future","Short Rural",0,0,0,0,0,0,0,0,0,0,0,0,0,0,0,0]
[null,32377,"Kingston","Urban",386,0.26900000000000002,2.512,4.1216999999999997,2.2576814633674021,0.47847371393508292,2,34.646695513748092,34.646695513748092,1.0014471600000001,1.0014471600000001,1,17.047756874095501,17.047756874095501,5.4992760000000002E-2,5.4992760000000002E-2]
[null,32378,"Future","Short Rural",0,0,0,0,0,0,0,0,0,0,0,0,0,0,0,0]
[null,32379,"Kingston (Whitewater Cr)-Firthside-Kingston Beach","Short Rural",1430,11.302,5.5720000000000001,4.4836999999999998,3.7024806099430903,0.57978786207234334,16,252.76273963053262,252.76273963053262,3.1223421900000004,3.1223421900000004,8,12.430812129661875,9.6702683861972556,7.9470159999999984E-2,7.1801989999999982E-2]
[null,32380,"Future","Short Rural",0,0,0,0,0,0,0,0,0,0,0,0,0,0,0,0]
[null,32381,"Future","Short Rural",0,0,0,0,0,0,0,0,0,0,0,0,0,0,0,0]
[null,32382,"Future","Short Rural",0,0,0,0,0,0,0,0,0,0,0,0,0,0,0,0]
[null,32383,"Open","Short Rural",0,0,0,0,0,0,0,0,0,0,0,0,0,0,0,0]
[null,32384,"Open","Short Rural",0,0,0,0,0,0,0,0,0,0,0,0,0,0,0,0]
[null,33271,"Snug-Conningham-Oyster Cove-Bruny Is","Short Rural",1502,145.51900000000001,3.3940000000000001,2.3408000000000002,16.789858503125316,1.3670062856992731,47,132.42545914160169,132.42545914160169,0.96519075999999915,0.96519075999999915,18,71.300439337613994,71.300439337613994,0.37174712000000004,0.37174712000000004]
[null,33272,"Nierinna-West Margate-Kaoota-Sandfly-Longley","Short Rural",1449,115.514,0.58499999999999996,4.2483000000000004,13.162017996922756,0.10644928159832913,47,142.24132814994761,142.24132814994761,1.8805968299999993,1.8805968299999993,6,4.7066990628253995,4.7066990628253995,1.8743479999999996E-2,1.8743479999999996E-2]
[null,33273,"Electrona Abalone Plant","Urban",2,0.26200000000000001,0.48699999999999999,0.37969999999999998,0,0,1,0,0,0,0,0,0,0,0,0]
[null,33274,"Margate-,Huntingfield,Blackmans Bay Central","Short Rural",1431,48.534999999999997,5.8140000000000001,4.4202000000000004,5.6301694633960437,1.596546490168685,42,10.409242801279746,10.409242801279746,0.27870592,0.27870592,14,49.032989690721521,49.032989690721521,0.22893702000000002,0.22893702000000002]
[null,33275,"Howden-B Bay S-Tinderbox-Dennes Pt-Killora","Short Rural",68,4.6159999999999997,0.72499999999999998,0.15190000000000001,0,0,0,0,0,0,0,0,0,0,0,0]
[null,33276,"Lower Snug-Nicolls Rivulet-Kettering-Gordon","Short Rural",1726,158.06100000000001,0.38400000000000001,3.7703000000000002,10.122031774239664,1.3493756938022272,67,278.9678983415763,278.9678983415763,2.8705262699999978,2.8705262699999978,30,50.01862089031119,50.01862089031119,0.22752382999999995,0.22752382999999995]
[null,33277,"Hazell Bros Industrial","Short Rural",2,2E-3,7.2999999999999995E-2,0,0,0,0,0,0,0,0,0,0,0,0,0]
[null,33278,"Future","Short Rural",0,0,0.1,0,0,0,0,0,0,0,0,0,0,0,0,0]
[null,34251,"Channel Hwy Margate-North Bruny","Short Rural",697,30.327999999999999,3.0059999999999998,4.1420000000000003,18.958476091286606,1.4170872979499392,16,95.977510593538597,95.977510593538597,1.0172801699999998,1.0172801699999998,6,40.572201352366562,40.572201352366562,0.10368140000000001,0.10368140000000001]
[null,34252,"Sirius Drive-Margate - Blackmans Bay","Urban",1808,7.1340000000000003,7.9749999999999996,4.6811999999999996,1.6971308778485952,1.2846143820598841,16,42.639714471122467,42.639714471122467,1.1823490199999998,1.1823490199999998,3,41.50227125243331,41.50227125243331,0.12005191000000001,0.12005191000000001]
[null,34253,"North West Blackmans Bay","Urban",664,1.8620000000000001,5.3550000000000004,3.9590999999999998,0.17063815920083661,0.66833710745639718,6,10.737167969924807,10.737167969924807,0.13684204999999999,0.13684204999999999,5,62.138345864661559,62.138345864661559,0.16992478,0.16992478]
[null,34254,"Open","Short Rural",1,0,2.13,0.29530000000000001,6.4444431892887993E-4,0,1,0,0,0,0,0,0,0,0,0]
[null,34255,"Open","Short Rural",0,0,0,0,0,0,0,0,0,0,0,0,0,0,0,0]
[null,34256,"Mirramar Park","Urban",817,3.1909999999999998,6.5529999999999999,3.0674999999999999,7.066608460992768,0.33764489962120281,19,20.677994752898083,20.677994752898083,0.24039042000000005,0.24039042000000005,3,17.840146430750451,17.840146430750451,8.9078690000000002E-2,8.9078690000000002E-2]
[null,34257,"Summerleas Zone-Huon Hwy-Kingston","Short Rural",7,0,0,0.52390000000000003,0,0,0,0,0,0,0,0,0,0,0,0]
[null,34258,"Legana Ave-Maronoa Rd-Channel Hwy","Urban",263,0,0,2.8464999999999998,0,0,0,0,0,0,0,0,0,0,0,0]
[null,34259,"Channel Hwy-Kingston (North)","Urban",1336,5.9950000000000001,5.7480000000000002,4.4088000000000003,40.632133139464052,0.65291306600029542,15,2.3739867354458291,2.3739867354458291,2.3581320000000003E-2,2.3581320000000003E-2,4,19.846720707442877,19.846720707442877,0.15549002999999997,0.15549002999999997]
[null,34260,"Redwood Rd SW- B Bay NW - Huntingfield","Short Rural",394,0,4.2320000000000002,1.2232000000000001,1.703755848930975,0,1,0,0,0,0,0,0,0,0,0]
[null,34261,"Leslie Vale-Longley-Bonnet Hill","Short Rural",183,0.13200000000000001,5.0670000000000002,0.5716,0.56160000809442068,2.1015087966002572,2,2.93877551020408,2.93877551020408,0.1632653,0.1632653,6,339.7551020408153,339.7551020408153,1.0612244500000001,1.0612244500000001]
[null,34262,"Maranoa Heights West-Huntingfield East","Urban",229,0.59299999999999997,4.141,2.7949999999999999,3.0199334817982777,0,2,0,0,0,0,0,0,0,0,0]
[null,34263,"Kingston-Blackmans Bay","Urban",803,8.5999999999999993E-2,5.4880000000000004,2.2730000000000001,4.4000064406826391,1.8983015810926631,7,7.8278637770897754,7.8278637770897754,0.24643961000000003,0.24643961000000003,4,100.13250773993796,100.13250773993796,0.32198140999999997,0.32198140999999997]
[null,34264,"Fernt Tree - Longley","Short Rural",440,43.545000000000002,0.183,2.2844000000000002,19.853705017460179,0.60707333875209624,19,142.98542372881343,142.98542372881343,1.0485874799999999,1.0485874799999999,7,33.742033898304996,33.742033898304996,0.10847453,0.10847453]
[null,35010,"New Norfolk Township (South)","Short Rural",933,81.596000000000004,0.27,2.3079000000000001,16.720628846381935,0.30344466498014622,34,499.38813282525763,499.38813282525763,1.7038648799999991,1.7038648799999991,5,13.688622754491002,13.688622754491002,8.7098510000000004E-2,8.7098510000000004E-2]
[null,35011,"Lachlan Park-Molesworth-Lachlan","Short Rural",1134,102.517,1.708,2.5402999999999998,18.90926316774663,0.76327352965951289,55,550.13452932735345,550.13452932735345,3.8403585800000024,3.8403585800000024,17,33.129476860986401,33.129476860986401,0.11928247,0.11928247]
[null,35012,"New Norfolk Township (South)","Urban",471,1.9379999999999999,2.2599999999999998,2.6539999999999999,9.6615584964414758,0,3,367.7542718487386,367.7542718487386,0.99159662999999998,0.99159662999999998,0,0,0,0,0]
[null,36240,"Summerleas Zone","Subtransmission",0,0,3.0680000000000001,10.7342,0,0,0,0,0,0,0,0,0,0,0,0]
[null,37001,"Gretna","Short Rural",141,35.502000000000002,0,0.48270000000000002,0.85996922659931496,0.31118769889631681,3,173.70612244897882,173.70612244897882,1.03673467,1.03673467,1,62.857142857142847,62.857142857142847,0.17959183000000001,0.17959183000000001]
[null,37002,"Bushy Park-Plenty","Short Rural",193,30.8,0,0.99070000000000003,1.3188523430800478,1.3230683885421652,11,186.49864498644965,186.49864498644965,1.1002709399999999,1.1002709399999999,4,195.60433604335998,195.60433604335998,1.1219512,1.1219512]
[null,39563,"New Norfolk Zone Substation","Urban",0,8.6999999999999994E-2,0.245,6.7789000000000001,0,0,0,0,0,0,0,0,0,0,0,0]
[null,39565,"ANM Backup-New Norfolk Township (North)-Magra","Short Rural",1633,48.792000000000002,0.99,4.9307999999999996,8.5376750188837178,2.2223148278788547,69,286.62898992009764,286.62898992009764,2.4161029999999997,2.4161029999999997,7,38.02655193607864,38.02655193607864,0.12231094999999999,0.12231094999999999]
[null,39568,"Dromedary","Short Rural",236,32.634,1.0349999999999999,0.87260000000000004,6.0924306353540562E-2,0.57023290367973245,7,12.349344978165925,12.349344978165925,0.13973796999999999,0.13973796999999999,3,92.576419213973693,92.576419213973693,0.44541482999999998,0.44541482999999998]
[null,39569,"Boyer","Short Rural",5,1.7529999999999999,1.2529999999999999,0.1181,0,0,0,0,0,0,0,0,0,0,0,0]
[null,39570,"Metropolitan Water Board (Lawitta)","Urban",24,12.012,0.8,5.0336999999999996,13.027874876868893,0.33151514602429938,3,271.81060454545411,271.81060454545411,1.13636362,1.13636362,1,9.0909090909090899,9.0909090909090899,9.0909089999999998E-2,9.0909089999999998E-2]
[null,39571,"Black Hills-Hayes-Glenora-Westerway Zone Sub","Long Rural",1067,204.18899999999999,2.6,3.2122999999999999,9.8298933046916233,5.5953169968925733,64,467.70499599045291,467.70499599045291,7.0128875399999968,7.0128875399999968,15,173.27414482100204,173.27414482100204,0.54797127999999995,0.54797127999999995]
[null,40001,"Richmond","Short Rural",210,2.3050000000000002,0.44,0.65859999999999996,4.3553987632540068E-3,0,1,0.62707838479809896,0.62707838479809896,4.7505899999999998E-3,4.7505899999999998E-3,0,0,0,0,0]
[null,40002,"Campania-Colebrook-Rhyndaston","Long Rural",1041,224.54900000000001,0,1.7401,1.2197957989916108,2.5263355415110094,40,49.271418698346999,49.271418698346999,1.2634295,1.2634295,16,110.77196973140471,110.77196973140471,0.40805774999999994,0.40805774999999994]
[null,40003,"Tea Tree","Short Rural",306,51.037999999999997,0.152,0.88780000000000003,4.3295322853082014,9.2652697649546117E-2,25,577.26101083032313,577.26101083032313,6.3357398899999984,6.3357398899999984,3,12.726714801444029,12.726714801444029,4.6931390000000003E-2,4.6931390000000003E-2]
[null,41511,"Midway Point","Short Rural",1435,16.617999999999999,2.399,3.7688000000000001,2.7376127991230259,1.9177971328738859,25,55.517853421326755,55.517853421326755,0.27301135000000004,0.27301135000000004,6,63.097279124695881,63.097279124695881,1.02674537,1.02674537]
[null,41512,"Penna-Richmond-Richmond Zone Sub-Grasstree Hill","Short Rural",397,67.256,2.3069999999999999,4.1261000000000001,54.985825843042562,3.1049432103969496,37,146.90311176470556,146.90311176470556,1.2199486099999997,1.2199486099999997,9,66.07041764705879,66.067860102301751,0.23273651999999997,0.23017897999999998]
[null,41513,"Sorell","Short Rural",1295,12.672000000000001,4.7080000000000002,4.6798000000000002,3.5612592690051983,3.0717286334778988,17,96.467271132494204,96.467271132494204,1.2620280499999994,1.2620280499999994,6,70.991117690599467,70.991117690599467,0.18948920999999999,0.18948920999999999]
[null,41514,"Pawlena-Carlton River-Connellys Marsh-Port Arthur","Short Rural",947,132.73599999999999,5.819,4.1261000000000001,15.507679193302247,1.3713646582906425,28,607.53124881018209,607.53124881018209,2.4338681400000004,2.4338681400000004,23,65.719977863862681,65.719977863862681,0.26563350999999996,0.26563350999999996]
[null,41515,"Forcett-Copping-Nubeena-Highcroft-Saltwater River","Long Rural",3108,332.73399999999998,12.874000000000001,4.2422000000000004,75.626146228229942,2.9245539509048193,110,333.13430575095782,333.13430575095782,3.7696275099999954,3.7696275099999954,40,70.102600433405456,69.939239873312104,0.20069986000000001,0.19936631999999999]
[null,41516,"Orielton-Runnymede-Levendale-Buckland-Oatlands","Long Rural",2251,530.58299999999997,1.9319999999999999,4.1916000000000002,8.4295613083869814,2.9842297764979251,124,155.7935796468399,155.7935796468399,1.5701667699999997,1.5701667699999997,54,85.439614312267466,85.179391263940332,0.41449791000000014,0.41356855000000003]
[null,41517,"Lewisham-Dodges Ferry-Carlton (Nth)-Primrose Sands","Short Rural",1858,47.106000000000002,2.6930000000000001,3.5337000000000001,4.5479240076498773,3.7833989476186618,32,161.70700859291057,161.70700859291057,1.7158966799999995,1.7158966799999995,6,130.02801648764697,130.02801648764697,0.33351230000000004,0.33351230000000004]
[null,41518,"Wattle Hill-Nugent-Forcett-Dodges Ferry-Carlton","Short Rural",2025,110.908,3.516,3.8999000000000001,10.073041981177642,2.1043280540174716,84,372.37324581475923,372.37324581475923,5.2506186999999978,5.2506186999999978,22,74.263496780584148,74.263496780584148,0.28875666999999999,0.28875666999999999]
[null,43505,"Chip Mill","Short Rural",15,9.8140000000000001,0.73799999999999999,0.31569999999999998,0,2.3301781591606723E-2,1,0,0,0,0,1,312.375,312.375,0.875,0.875]
[null,43506,"Triabunna Township","Short Rural",1795,81.426000000000002,1.1659999999999999,3.0484,15.712586320203215,0.46840607147120672,42,377.72840129395092,377.72840129395092,4.3971868200000017,4.3971868200000017,10,23.176371308016833,23.176371308016833,0.10407869,0.10407869]
[null,43507,"Swansea","Long Rural",1505,205.011,0.621,3.1865999999999999,2.2504499456932781,1.9085185600432559,83,80.784920054017377,80.784920054017377,1.1444963300000006,1.1444963300000006,21,60.967128021606868,57.351327886562984,0.25118147000000002,0.23700187]
[null,45001,"Gretna-Gretna Zone Substation","Short Rural",57,29.021999999999998,7.1999999999999995E-2,2.5148999999999999,5.7468177083434693,1.6813615703163525,15,426.96055045871503,426.96055045871503,2.9724769999999996,2.9724769999999996,2,232.385321100917,232.385321100917,0.6238532,0.6238532]
[null,45002,"Hollow Tree-Bothwell-Jericho","Long Rural",780,294.81900000000002,0.85099999999999998,2.0958000000000001,0.80490179657303118,0.36787688885528158,35,62.92932202674163,62.92932202674163,0.50668517999999974,0.50668517999999974,10,20.363124560168849,20.363124560168849,0.14496826000000002,0.14496826000000002]
[null,45003,"Hamilton Zone Sub-Ouse-Strickland-Lawrenny","Short Rural",641,183.779,0.24,3.1246,10.13974114449687,2.653570296645043,55,365.22119497161276,365.22119497161276,2.5709651,2.5709651,30,188.65531224655274,181.35604217356004,0.65693429999999997,0.63260339999999993]
[null,48180,"Gagebrook (West)-Old Beach-Austins  Ferry-Granton","Short Rural",1088,3.5720000000000001,9.0169999999999995,3.3628,15.30304862720036,0.43884935601636005,15,188.28897236842079,188.28897236842079,2.0554510000000001,2.0554510000000001,4,23.566729323308245,23.566729323308245,9.5864630000000006E-2,9.5864630000000006E-2]
[null,48181,"Brighton Transport Hub","Urban",396,2.1059999999999999,4.8650000000000002,2.7225999999999999,0,0,1,0,0,0,0,0,0,0,0,0]
[null,48182,"Brighton (East)-Dysart-Kempton-Melton  Mowbray","Short Rural",1609,157.18100000000001,2.9630000000000001,5.4508999999999999,3.388342381303235,1.9252075267223596,35,68.887225294679638,68.887225294679638,1.1424018900000006,1.1424018900000006,27,66.226823829244807,66.226823829244807,0.43198455000000002,0.43198455000000008]
[null,48183,"Bridgewater--Gagebrook-Sorell Creek-Cove Hill","Short Rural",880,44.591999999999999,2.8140000000000001,5.3784999999999998,2.600249766689394,0.43589632388907928,20,49.728359062321196,49.728359062321196,2.0445968399999996,2.0445968399999996,3,18.387650085763219,18.387650085763219,5.9462540000000001E-2,5.9462540000000001E-2]
[null,48184,"Bridgewater  (East)","Urban",1150,0,7.899,3.7745000000000002,3.7943634597537849E-2,2.0609501949751232,13,1.1411850262696959,1.1411850262696959,7.0052000000000014E-3,7.0052000000000014E-3,8,45.973730297723264,45.973730297723264,0.24693515999999999,0.24693515999999999]
[null,48185,"Granton-Dromedary-Broadmarsh-Elderslie--Pelham","Short Rural",1253,177.93299999999999,5.2160000000000002,3.1818,11.356379204040904,1.3623423299057313,42,173.75170042158501,173.75170042158501,1.1433388900000006,1.1433388900000006,19,43.200674536256209,43.200674536256209,0.16441817000000003,0.16441817000000003]
[null,48186,"Station Supply (Owned By  Transend)","Short Rural",0,0,0,2.4767999999999999,0,0,0,0,0,0,0,0,0,0,0,0]
[null,48187,"Bridgewater  (West)","Urban",553,0,0,1.7833000000000001,0,0,0,0,0,0,0,0,0,0,0,0]
[null,48188,"Brighton  (West)","Short Rural",1459,31.32,5.04,4.4353999999999996,1.120780300585964,0.3355737321699872,23,27.515437392795743,27.515437392795743,1.05934806,1.05934806,2,11.371526586620909,11.371526586620909,5.1457959999999997E-2,5.1457959999999997E-2]
[null,48189,"Bridgewater North","Urban",553,1.794,3.0990000000000002,1.9623999999999999,2.3659588492516526,0.13176534459721567,4,183.25858951175351,183.25858951175351,3.0036166299999998,3.0036166299999998,1,9.5045207956600297,9.5045207956600297,4.3399630000000002E-2,4.3399630000000002E-2]
[null,48190,"Bridgewater (North)","Urban",68,4.1870000000000003,3.633,2.5453999999999999,6.6619046129995863E-2,2.2476189973808468E-2,3,24.982142857142811,24.982142857142811,1.02380951,1.02380951,1,22.4761904761904,22.4761904761904,0.19047618999999999,0.19047618999999999]
[null,48191,"Gagebrook","Short Rural",358,0,6.4710000000000001,1.0479000000000001,3.3444149408686667E-2,1.4451475963310853E-2,4,13.026722925457037,13.026722925457037,0.19971867999999998,0.19971867999999998,2,1.6455696202531631,1.6455696202531631,5.6258599999999999E-3,5.6258599999999999E-3]
[null,48192,"Old Beach","Short Rural",1702,24.994,13.548,5.5690999999999997,1.0162465018599252,0.25318548793828599,20,35.364013424413393,35.364013424413393,0.42233438999999984,0.42233438999999984,5,7.5253935253934978,7.5253935253934978,5.167803E-2,5.167803E-2]
[null,49101,"Tods Corner Power Station-Wilburville","Short Rural",5,6.194,0.105,1.5014000000000001,0.46210734581362517,1.8484293832545009,4,55,55,3,3,1,284,284,1,1]
[null,49202,"Tods Corner-Liawenee","Short Rural",757,109.083,0.63,1.8845000000000001,16.904908333987745,2.3680237242365463,26,1325.6925133689817,1325.6925133689817,5.8114972299999987,5.8114972299999987,10,446.38368983957042,446.38368983957042,1.4572191899999998,1.4572191899999998]
[null,49303,"Bronte Park","Short Rural",278,98.602000000000004,0.71,0.7621,3.8094477299869833,3.7114846781815931,15,628.89951702898452,628.89951702898452,2.3659419499999998,2.3659419499999998,9,639.16666666666504,639.16666666666504,1.58333328,1.58333328]
[null,49304,"Tarraleah Stn-Liapootah Dam","Short Rural",2,2.8460000000000001,0.247,0.2286,4.0130268863456227E-2,8.2378851039352947E-3,4,1705,1705,5,5,1,350,350,1,1]
[null,49307,"Tarraleah","Short Rural",13,6.9290000000000003,0.34899999999999998,0.1905,0.74181059108966474,9.1076439161399646E-3,5,4235.3599999999997,4235.3599999999997,4.96,4.96,1,52,52,0.16,0.16]
[null,49411,"Wayatinah","Short Rural",69,10.802,0.34399999999999997,0.4541,1.6685914333958225,0.41977675615777826,4,387.59016393442528,387.59016393442528,1.4098360500000002,1.4098360500000002,2,97.508196721311393,97.508196721311393,0.95081965999999996,0.95081965999999996]
[null,49412,"Wayatinah-Catagunya-Repulse-Cluny","Short Rural",30,50.042000000000002,0.35599999999999998,0,0,0,2,246.69387755101968,246.69387755101968,1.02040814,1.02040814,4,154.8612244897958,154.8612244897958,0.57142853999999998,0.57142853999999998]
[null,49414,"Open","Short Rural",0,0,0,0,0,0,0,0,0,0,0,0,0,0,0,0]
[null,49621,"Lake St Clair-Derwent Bridge","Short Rural",42,11.888999999999999,2.13,0,0,0,7,283.341772151898,283.341772151898,4.0253164300000002,4.0253164300000002,1,120.506329113924,120.506329113924,0.35443036999999999,0.35443036999999999]
[null,49801,"Gordon Area-Strathgordon","Short Rural",47,19.931999999999999,0,0,1.9022169427617554E-2,0.26974715049667747,1,0,0,0,0,1,125,125,1,1]
[null,51001,"Poatina","Short Rural",14,26.98,0.19700000000000001,0.38109999999999999,14.566543173693036,1.3125111897307882,17,1281.4722222222204,1281.4722222222204,9.6666666300000017,9.6666666300000017,4,380.88888888888789,380.88888888888789,1.5555555399999998,1.5555555399999998]
[null,51002,"Bracknell-Liffey-Bishopsbourne-Oaks-Cluan","Short Rural",87,7.0709999999999997,0.45800000000000002,1.2686999999999999,11.036329108478984,1.7343125367559822,4,395.64161849710922,395.64161849710922,3.0173410199999999,3.0173410199999999,2,62.173410404624192,62.173410404624192,0.25433525000000001,0.25433525000000001]
[null,51003,"Brumbys Creek-Epping Forest-Clarendon","Long Rural",553,234.786,3.8279999999999998,7.6448,45.675017043183004,6.0171465073568227,78,309.0655093539051,309.0655093539051,2.5400191800000007,2.5400191800000007,24,156.52417222757927,156.52417222757927,0.58437795000000003,0.58437795000000003]
[null,51004,"Liffey-Bracknell-Bishopsbourne-Toiberry","Long Rural",790,205.51,1.577,2.9691999999999998,7.2394138491981241,3.6670941887807316,94,505.61635592543172,505.61635592543172,2.8029288300000008,2.8029288300000008,38,203.2079005326228,203.2079005326228,0.70572546999999974,0.70572546999999974]
[null,53001,"Bell Bay Industrial","Short Rural",0,27.010999999999999,6.89,3.9628999999999999,16.742856199750438,1.4300881284747633,14,13.536802030456833,13.536802030456833,0.10050753999999999,0.10050753999999999,12,46.340101522842559,46.340101522842559,0.25685274999999996,0.25685274999999996]
[null,53002,"Long Reach","Urban",9,7.4160000000000004,1.9750000000000001,3.0865,1.004400689774853,1.396000055472056,3,190.76670000000001,190.76670000000001,2,2,1,698,698,1,1]
[null,53003,"George Town (North)","Short Rural",2095,49.235999999999997,5.851,5.0679999999999996,20.029020386691457,1.1218429269899342,51,286.64574227349163,286.64574227349163,2.0105741900000016,2.0105741900000016,15,21.861571737563057,21.861571737563057,0.14227343000000001,0.14227343000000001]
[null,53004,"Bell Bay Power Station Standby - Beaconsfield Gold","Short Rural",641,70.555000000000007,13.702,1.7908999999999999,5.3849744915640105,2.9018459678476303,28,227.31995224358943,227.31995224358943,2.9054485999999988,2.9054485999999988,11,165.42628205128179,164.34294871794845,0.48237173999999994,0.47596148999999993]
[null,53005,"Bell Bay","Short Rural",0,0.47599999999999998,0.253,0,0,0,0,0,0,0,0,0,0,0,0,0]
[null,53006,"East Tamar Hwy (Sth of GT Sub)","Short Rural",2,0.47599999999999998,0.252,0,0,0,0,0,0,0,0,1,111,111,1,1]
[null,53007,"Bell Bay Power Station Main Feeder","Short Rural",3,1.8169999999999999,1.175,0,0,0,0,0,0,0,0,0,0,0,0,0]
[null,53008,"Hillwood-The Glen-Pipers River-Weymouth","Long Rural",1304,201.99199999999999,1.43,2.1720000000000002,16.239156588022105,3.0399388969343986,70,578.16976276638377,578.16976276638377,3.2593483899999973,3.2593483899999973,27,198.56051467631619,198.56051467631619,0.69642126999999998,0.69642126999999998]
[null,53009,"George Town (South)-Greens Beach-Beauty Point","Short Rural",1670,101.97199999999999,3.2320000000000002,3.1246,11.473387481137269,11.657759280148955,55,170.55559945272088,170.55559945272088,1.9513526899999996,1.9513526899999996,17,313.48799027059863,313.48799027059863,1.0167223299999997,1.0167223299999997]
[null,53010,"Bell Bay","Urban",56,7.5609999999999999,2.4390000000000001,4.1916000000000002,0.76836598536175582,0.40950967158113477,10,95.698979591836476,95.698979591836476,2.2653060800000002,2.2653060800000002,2,10.87516938775509,10.87516938775509,0.22448979000000002,0.22448979000000002]
[null,54003,"Ringarooma Rd-Scottsdale","Long Rural",2065,300.49,1.629,5.0807000000000002,9.7677908675233382,2.5614605074428392,101,240.09831683168284,240.09831683168284,1.1757417899999998,1.1757417899999998,45,64.545594059405843,64.545594059405843,0.19950460000000003,0.19950460000000003]
[null,54004,"Tongah","Short Rural",168,30.4,0.13500000000000001,0.6351,2.5306578437354385E-2,0.65919735060886397,7,2.5150501672240759,2.5150501672240759,6.020064E-2,6.020064E-2,5,131.83946488294305,131.83946488294305,0.48160532,0.48160532]
[null,54005,"Scottsdale-Springfield-Golconda-Lillydale","Long Rural",1577,314.065,2.1240000000000001,3.7216,28.585097298509144,3.9956724347270072,162,361.44324744061504,361.44324744061504,3.3422547899999979,3.3422547899999979,54,147.72619605219106,147.72619605219106,0.50317824000000022,0.50317824000000022]
[null,54006,"Derby Terminal-Mt Horror-North Scottsdale","Short Rural",124,59.034999999999997,6.6950000000000003,0.30480000000000002,0.88715587115175343,0.44318244830489323,23,277.90809300411451,277.90809300411451,0.74074064000000017,0.74074064000000017,5,265.90946502057545,265.90946502057545,0.82304524000000012,0.82304524000000012]
[null,54007,"North Scottsdale-Forester-Bridport-Waterhouse","Short Rural",1071,10.664999999999999,1.8740000000000001,3.6581000000000001,0.35727608125315197,0.38143779300135677,11,12.699480887210935,12.699480887210935,0.20953275999999998,0.20953275999999998,5,9.974516281264739,9.974516281264739,3.3034429999999997E-2,3.3034429999999997E-2]
[null,55001,"Derby-Branxholm-Legerwood-Ringarooma","Short Rural",889,153.261,0.35099999999999998,4.4583000000000004,6.6741719901550587,1.2843311687762546,99,119.72332551963011,119.72332551963011,2.032332020000005,2.032332020000005,16,71.804349538106024,71.804349538106024,0.27482669999999998,0.27482669999999998]
[null,55002,"Herrick-Gladstone-Weldborough-Priory","Long Rural",860,248.09800000000001,15.555999999999999,1.6131,2.3819815247360032,1.1878787473584407,66,127.06742738738717,127.06742738738717,1.9783781199999997,1.9783781199999997,21,319.7333333333321,319.7333333333321,1.1987987000000004,1.1987987000000004]
[null,55003,"Winnaleah-Telita","Short Rural",290,73.619,1.284,1.3017000000000001,2.2429022403968388,0.28381818719885571,43,383.4163636363632,383.4163636363632,2.4509088899999996,2.4509088899999996,8,79.963636363636169,79.963636363636169,0.38909085999999998,0.38909085999999998]
[null,56001,"Royal   George","Short Rural",97,52.45,0.187,0.45729999999999998,7.176325853310403E-2,0.19031251408159733,10,61.664930208333196,61.664930208333196,0.58333329,0.58333329,1,78.75,78.75,0.25,0.25]
[null,56002,"Rossarden-Storeys  Creek","Short Rural",61,31.056999999999999,0.217,0,4.3697316026928586E-4,0.12491808578960625,1,1.08196721311475,1.08196721311475,1.6393439999999999E-2,1.6393439999999999E-2,4,224.34426229508188,224.34426229508188,1.09836065,1.09836065]
[null,56003,"Fingal-Mangana-Mathinna-Upper  Esk","Short Rural",507,146.66300000000001,0.36599999999999999,1.7146999999999999,1.462957492509801,5.3672609151048345,21,89.251787538304256,89.251787538304256,1.08069452,1.08069452,20,323.19669724208268,323.19669724208268,0.99080685999999996,0.99080685999999996]
[null,56004,"Conara-Campbell  Town-Ross-Oatlands","Long Rural",1881,530.36599999999999,4.5659999999999998,6.0968,5.6895242249178173,2.4664407692339787,154,224.33113373659575,224.33113373659575,2.5856468900000014,2.5856468900000014,35,82.718504261754035,82.718504261754035,0.29639796999999996,0.29639796999999996]
[null,57003,"Dianas Beach","Short Rural",550,36.137,6.9790000000000001,0.99070000000000003,0.56294007523384682,0.36719204499634034,16,117.00770642201817,117.00770642201817,1.37247702,1.37247702,2,55.941284403669599,55.941284403669599,0.37614678000000001,0.37614678000000001]
[null,57004,"Chain of Lagoons-Bicheno-Coles Bay","Long Rural",2113,214.60599999999999,4.66,4.6868999999999996,23.888691254451963,5.8307223558886383,66,115.70581042974379,115.70581042974379,1.4398837100000006,1.4398837100000006,26,150.29019797199382,150.29019797199382,0.45823257000000001,0.45823257000000001]
[null,57005,"St Marys-German Town-Mt Nicholas","Short Rural",295,50.097000000000001,0.36199999999999999,1.5242,1.0608149263941158,2.4067350603856776,14,40.062622876949639,40.062622876949639,0.22183704000000004,0.22183704000000004,7,175.81629116117833,175.81629116117833,0.52686305,0.52686305]
[null,57006,"Binalong Bay-Priory","Short Rural",3258,138.99299999999999,18.146000000000001,6.4398,23.536033355095459,2.8723503815620255,66,178.39257125971974,178.39257125971974,6.6889576800000006,6.6889576800000006,19,87.908553654743272,87.904821150855255,0.40777592000000007,0.40746488000000014]
[null,61021,"Riverside-Newnham-Alanvale","Short Rural",1567,105.907,5.2919999999999998,5.4236000000000004,17.608634130780537,2.7957772373608356,44,193.31843775280802,193.31843775280802,1.7155695999999994,1.7155695999999994,9,80.176351011235766,80.176351011235766,0.24333863999999999,0.24333863999999999]
[null,61022,"Prospect Vale","Short Rural",18,6.5579999999999998,0.90900000000000003,0,0,0,0,0,0,0,0,0,0,0,0,0]
[null,61023,"Glengarry-Birralee-Beaconsfield-Beauty Point","Long Rural",1732,323.38,0.8,3.3405,23.275609330832935,3.2328135158400406,137,379.46929534538936,379.46929534538936,2.7530382099999993,2.7530382099999993,40,86.580274710939676,86.580274710939676,0.28757756999999989,0.28757756999999989]
[null,61024,"City (North)","Urban",424,0,6.9349999999999996,6.4779,1.784318949716396,0.20299790200447387,9,76.210691823899182,76.210691823899182,1.2044024600000003,1.2044024600000003,3,6.2798742138364663,6.2798742138364663,1.5723259999999999E-2,1.5723259999999999E-2]
[null,61025,"Trevallyn-City (South)","Urban",1692,12.753,4.7869999999999999,5.665,4.6499650798277488,0.80302657307222591,22,27.009270762837602,27.009270762837602,1.2573462799999997,1.2573462799999997,3,14.426872484416741,14.426872484416741,6.8269500000000011E-2,6.8269500000000011E-2]
[null,61026,"City (Central)","Urban",222,1.4570000000000001,4.9969999999999999,4.1916000000000002,3.2864357015755963,1.0537900448949249,4,49.884259259259174,49.884259259259174,1.01388886,1.01388886,2,35.263888888888822,35.263888888888822,0.15277776999999998,0.15277776999999998]
[null,61027,"Trevallyn-West Launceston","Urban",2296,12.433999999999999,3.9009999999999998,6.9732000000000003,0.49389855291480733,3.1971021391301644,30,6.1395647442872505,6.1395647442872505,7.1817060000000002E-2,7.1817060000000002E-2,11,48.992818280739804,48.992818280739804,0.16844389999999998,0.16844389999999998]
[null,61028,"Rosevears-Exeter-Deviot","Short Rural",1681,70.363,2.907,4.6234000000000002,19.085420977048599,2.1325736440429388,40,63.121091331923765,63.121091331923765,0.38296569999999991,0.38296569999999991,19,57.667351253397612,57.667351253397612,0.21383259999999996,0.21383259999999996]
[null,61029,"Alanvale-Rocherlea","Short Rural",923,5.4630000000000001,6.766,3.0737999999999999,1.2876697549693896E-2,0.44594643832518366,8,0.40521455730580802,0.40521455730580802,7.6045199999999992E-3,7.6045199999999992E-3,4,16.425855513307962,16.425855513307962,9.7772919999999999E-2,9.7772919999999999E-2]
[null,61030,"Open","Short Rural",0,0,0,0,0,0,0,0,0,0,0,0,0,0,0,0]
[null,61037,"West Riverside-Summerhill-Prospect","Short Rural",878,22.567,1.7749999999999999,3.0230000000000001,5.4028128548007333,1.4534537834229198,16,294.66490522688093,294.66490522688093,1.38541063,1.38541063,6,56.678230901780495,56.678230901780495,0.19184374999999998,0.19184374999999998]
[null,61038,"Inveresk-City (North)-Mowbray-Mayfield-Ravenswood","Short Rural",0,0,3.0310000000000001,0,0,0,0,0,0,0,0,0,0,0,0,0]
[null,61039,"City (Central / North)","Urban",703,0,7.9530000000000003,5.8681999999999999,1.8402733888948235,0,5,45.247446975647989,45.247446975647989,0.25451685999999996,0.25451685999999996,0,0,0,0,0]
[null,61040,"City (Central)-Launceston General Hospital","Urban",1120,0,8.9009999999999998,6.3762999999999996,3.5102235250183536E-2,0.26533888608114825,7,0.43728522336769604,0.43728522336769604,3.4364E-3,3.4364E-3,1,4.7809278350515401,4.7809278350515401,1.8041229999999998E-2,1.8041229999999998E-2]
[null,61041,"Trevallyn-West Launceston-Prospect","Short Rural",1742,17.372,2.3530000000000002,5.9824999999999999,3.4104327722612822,1.6893209891565555,27,127.34537543758955,127.34537543758955,3.11735995,3.11735995,13,60.671449067431674,60.671449067431674,0.27431844,0.27431844]
[null,61042,"Inveresk-Invermay-Newnham-Alanvale-Rocherlea","Short Rural",0,0,3.048,0,0,0,0,0,0,0,0,0,0,0,0,0]
[null,61043,"Riverside-Legana-Dilston-Turners Marsh-Lilydale","Short Rural",2999,104.51900000000001,10.07,9.6279000000000003,16.48361344746931,7.1257843996555161,80,119.52860476190462,119.52860476190462,0.54845144000000134,0.54845144000000134,38,109.66996336996313,109.66996336996313,0.40692629000000008,0.40692629000000008]
[null,62004,"Mowbray Heights","Urban",0,10.563000000000001,6.7039999999999997,7.6208999999999998,1.4375708397130336,3.6265238295308952,18,6.8985853780313713,6.8985853780313713,5.064188E-2,5.064188E-2,6,41.968699500713171,41.968699500713171,0.2375178,0.2375178]
[null,62005,"Alanvale-Newnham","Urban",1148,6.1349999999999998,3.1869999999999998,5.31,9.3251761986979478,0.28464422305669745,17,243.06217923449137,243.06217923449137,3.0717113200000004,3.0717113200000004,4,10.846458424988976,10.846458424988976,3.1676180000000005E-2,3.1676180000000005E-2]
[null,62006,"Remount Rd-Ravenswood","Short Rural",917,9.1839999999999993,3.9649999999999999,3.4864000000000002,5.4218481258075091,6.2106405687832931,27,433.63993735473076,433.63993735473076,9.1178747400000013,9.1178747400000013,13,151.38605423353584,151.38605423353584,0.55118974999999992,0.55118974999999992]
[null,62007,"Trevallyn Super Feeder","Short Rural",0,0,0,0,0,0,0,0,0,0,0,0,0,0,0,0]
[null,62008,"Invermay-Inveresk","Urban",1779,8.6609999999999996,3.7090000000000001,6.3156999999999996,3.4752289444105164,0.2781841417455897,20,56.581774647887308,56.581774647887308,1.04619716,1.04619716,9,5.4078873239436529,5.4078873239436529,0.10478870999999999,0.10478870999999999]
[null,62009,"East Launceston","Urban",876,8.891,3.5550000000000002,6.3335999999999997,16.342363289879273,1.2396613851230216,29,269.4326430517707,269.4326430517707,5.8081741700000009,5.8081741700000009,2,28.49591280653943,28.49591280653943,9.4822879999999998E-2,9.4822879999999998E-2]
[null,62010,"Mayfield","Short Rural",1649,14.503,5.1710000000000003,4.4161000000000001,1.530923162145772,2.1205475524846737,27,32.105296309850502,32.105296309850502,2.1567550299999994,2.1567550299999994,8,58.061502470265154,58.061502470265154,0.31046047000000004,0.31046047000000004]
[null,62011,"Open","Urban",109,0.64900000000000002,3.5419999999999998,2.2751000000000001,0,0,1,0,0,0,0,0,0,0,0,0]
[null,62012,"Trevallyn Super Feeder","Short Rural",0,0,0,0,0,0,0,0,0,0,0,0,0,0,0,0]
[null,62013,"Invermay","Urban",737,5.5819999999999999,4.3879999999999999,4.5323000000000002,5.9894443512354902,2.2155086229229976E-2,12,149.61201904047965,149.61201904047965,2.0329835000000003,2.0329835000000003,1,0.76461769115442202,0.76461769115442202,4.49775E-3,4.49775E-3]
[null,65060,"Western Junction-Breadalbane-Perth-Evandale","Urban",246,0.59399999999999997,3.76,5.0946999999999996,9.1909382416374905E-3,0,2,0.55880403225806297,0.55880403225806297,8.0645000000000005E-3,8.0645000000000005E-3,0,0,0,0,0]
[null,65061,"Techno Park Drive Norwood","Urban",909,5.2370000000000001,3.2309999999999999,5.3994999999999997,5.5064676739076468,5.9469613054180671E-2,11,197.56303856353574,197.56303856353574,3.0994474700000008,3.0994474700000008,1,2.5856353591160199,2.5856353591160199,1.325966E-2,1.325966E-2]
[null,65062,"Kings Meadows-South Launceston","Urban",1303,7.4729999999999999,3.496,4.9116999999999997,1.9923626063962412,0.58968243530108,31,36.01449835940474,36.01449835940474,0.41663468999999997,0.41663468999999997,4,15.894696680656212,15.894696680656212,8.6989679999999986E-2,8.6989679999999986E-2]
[null,65063,"St Leonards South","Urban",514,5.6040000000000001,1.5860000000000001,3.1208,0.36784642181310495,5.9389676286580977E-3,7,9.1903756539235353,9.1903756539235353,0.10462775000000001,0.10462775000000001,1,0.70422535211267601,0.70422535211267601,2.0120699999999999E-3,2.0120699999999999E-3]
[null,65064,"South Norwood-Punchbowl","Urban",1004,5.9870000000000001,2.1259999999999999,3.6732999999999998,0.64175666414328381,1.1378775438859414,16,18.053433999025803,18.053433999025803,0.19873351,0.19873351,5,29.867510959571327,29.867510959571327,0.13151483,0.13151483]
[null,65065,"Franklin Village","Urban",1004,5.7350000000000003,4.157,5.1555999999999997,1.384217944551607,6.8757213644720424E-3,8,47.390679900497432,47.390679900497432,0.29054722999999999,0.29054722999999999,1,0.12835820895522301,0.12835820895522301,9.9502000000000011E-4,9.9502000000000011E-4]
[null,65066,"Relbia-Evandale-Upper Blessington","Long Rural",1393,250.49799999999999,3.14,3.8791000000000002,21.692861474104141,2.1246103874506121,72,82.947999105145286,82.947999105145286,1.5727066699999981,1.5727066699999981,16,67.934327665920833,67.934327665920833,0.12677098999999997,0.12677098999999997]
[null,65067,"Waverley-White Hills","Short Rural",636,143.77799999999999,3.032,1.9777,19.879649235949515,0.82134179939456864,61,252.31777578187589,252.31777578187589,1.8203685300000001,1.8203685300000001,14,38.64263560545303,38.642635605453037,0.18765026000000001,0.18765026000000001]
[null,66101,"Waverley-St Leonards","Short Rural",660,13.417999999999999,1.6439999999999999,1.9167000000000001,5.6059170254366864,0.29914858152657864,14,499.029733840304,499.029733840304,1.14220528,1.14220528,2,21.04638783269959,21.04638783269959,0.19315589,0.19315589]
[null,66102,"Norwood-Newstead-East Launceston-Launceston","Urban",1830,7.4829999999999997,2.41,6.2721,0.70292162922813861,1.5288716906021724,28,10.60215110746511,10.60215110746511,0.18375702999999993,0.18375702999999993,3,29.757178014766136,29.757178014766136,8.367513E-2,8.367513E-2]
[null,66103,"Norwood-Newstead-East Lton-South Lton-Launceston","Urban",1567,8.8249999999999993,3.52,6.1234999999999999,6.2400537909736791,3.1773704821840925,29,220.94318931200004,220.94318931200004,3.2057600000000006,3.2057600000000006,10,63.220480000000002,63.220480000000002,0.24768000000000001,0.24768000000000001]
[null,66105,"Ravenswood-Waverley","Urban",1257,7.6230000000000002,3.47,3.4180000000000001,0.67480246024282264,0.56547874450715285,17,20.499348724082914,20.499348724082914,0.13237628999999995,0.13237628999999995,3,31.070972886762238,31.070972886762238,0.10925038000000001,0.10925038000000001]
[null,66106,"Newstead-South Launceston","Urban",1648,9.6170000000000009,2.577,5.6966999999999999,7.4755294151000342,2.7365814145604399,35,207.90377148171069,207.90377148171069,2.0799750799999996,2.0799750799999996,13,66.02231866088016,66.02231866088016,0.27526340999999999,0.27526340999999999]
[null,66107,"High St East Launceston","Urban",627,4.593,2.7069999999999999,4.3592000000000004,0.65021739436738668,0.47498552004496253,13,21.28295304182501,21.28295304182501,0.27756652999999998,0.27756652999999998,2,13.93536121673,13.93536121673,0.16349809000000001,0.16349809000000001]
[null,66108,"St Leonards Rd","Urban",169,0,0.36399999999999999,0.1181,0,0,0,0,0,0,0,0,0,0,0,0]
[null,66109,"St Leonards","Short Rural",624,5.9509999999999996,0.22900000000000001,1.8481000000000001,8.1367714064461832E-3,0.18303212742632158,7,0.5883347421808931,0.5883347421808931,8.4530500000000001E-3,8.4530500000000001E-3,2,9.7886728655959381,9.7886728655959381,4.7337270000000001E-2,4.7337270000000001E-2]
[null,67081,"Prospect","Short Rural",930,4.2409999999999997,18.39,4.3440000000000003,6.562944031523223,4.6874746377072674,14,172.21903735909805,172.21903735909805,3.2120235000000008,3.2120235000000008,6,92.909250348899434,92.909250348899434,0.28019319999999998,0.28019319999999998]
[null,67082,"Carrick-Westbury-Poatina","Long Rural",1861,224.08,7.8419999999999996,4.8392999999999997,7.8251334466903142,5.9804779661229741,141,168.03467691882909,168.03467691882909,2.4743230799999969,2.4743230799999969,59,136.61803793484239,128.28562490336805,0.55052427000000004,0.50579761000000001]
[null,67083,"Pateena-Longford","Short Rural",481,35.590000000000003,0.56000000000000005,4.4583000000000004,9.2348038355657138,1.591569690588982,27,114.18319010752668,114.18319010752668,1.3741934200000001,1.3741934200000001,10,35.627634408602077,35.627634408602077,0.31827951999999998,0.31827951999999998]
[null,67084,"Hagley-Westbury Nth-Quamby Bend-Selbourne","Short Rural",490,95.13,23.190999999999999,4.9537000000000004,6.1489196384298008,7.0125356165432908,58,89.418243145589628,89.418243145589628,1.0520718899999995,1.0520718899999995,21,149.07545164718357,149.07545164718357,0.63761942999999999,0.63761942999999999]
[null,67085,"Blackstone Heights","Short Rural",662,17.398,1.673,4.0391000000000004,18.085318236289403,7.1040590885219554,15,210.54613050075793,210.54613050075793,2.0864946499999992,2.0864946499999992,5,265.9059180576628,265.9059180576628,0.86494686999999992,0.86494686999999992]
[null,67086,"Prospect Vale","Urban",1873,7.4619999999999997,8.7850000000000001,5.8681999999999999,0.36503496877496677,1.2784313047876816,13,9.1071624435590728,9.1071624435590728,1.08525889,1.08525889,5,24.76972111553777,24.76972111553777,0.18326690000000001,0.18326690000000001]
[null,67087,"Cressy","Short Rural",2356,181.78200000000001,8.7029999999999994,6.2111000000000001,8.8433862432631631,3.7887477334185578,96,215.76817530172383,215.76817530172383,1.8999994800000015,1.8999994800000015,27,58.326724137930967,58.326724137930967,0.19525844999999997,0.19525844999999997]
[null,67088,"Travellers Rest-Hadspen","Short Rural",1060,19.690000000000001,0.53600000000000003,2.8959999999999999,10.553402470775112,6.9149104707600273E-2,25,340.37519128805525,340.37519128805525,3.9494143700000008,3.9494143700000008,3,2.7353629976580738,2.7353629976580738,9.3676699999999998E-3,9.3676699999999998E-3]
[null,67089,"Trevallyn Terminal","Short Rural",1239,16.202000000000002,2.9670000000000001,3.5819000000000001,3.0818306717770061,2.9940693932789002,16,9.452716297786699,9.452716297786699,0.25352102999999998,0.25352102999999998,9,106.64225352112655,106.64225352112655,0.33239432000000008,0.33239432000000008]
[null,67090,"Evandale-Perth","Short Rural",1923,80.840999999999994,7.5209999999999999,8.4212000000000007,1.2261610992445429,3.08375536951434,49,17.458313303119127,17.458313303119127,0.24846693999999997,0.24846693999999997,16,41.867768595041191,40.334310850439756,0.19194873000000004,0.17648620000000001]
[null,67091,"Young Town-Kings Meadows-South Launceston","Short Rural",1484,12.183,6.1269999999999998,4.6487999999999996,5.3563492077360584,8.0736448526626311E-3,26,197.31162632117253,197.31162632117253,5.1401294000000011,5.1401294000000011,1,0.30276167746334798,0.30276167746334798,7.569041E-2,7.569041E-2]
[null,80001,"Miandetta-East Devonport","Urban",2706,4.0650000000000004,2.7909999999999999,8.1234999999999999,2.8153361749386865,0.44957859682507245,5,233.36920222634456,233.36920222634456,1.2374767800000002,1.2374767800000002,5,32.476808905380238,32.476808905380238,0.18552874,0.18552874]
[null,80002,"Quioba-Spreyton","Short Rural",737,24.132999999999999,0.91200000000000003,7.0411999999999999,22.193024351804766,16.594559791537129,23,269.69644993084313,269.69644993084313,1.5283539700000006,1.5283539700000006,18,229.49515905947391,223.40940525587777,0.74412161999999993,0.71369285999999987]
[null,80003,"Quoiba-Spreyton","Urban",453,11.909000000000001,1.8109999999999999,6.0507,20.570173851046377,10.490426068138206,7,285.44856735582061,285.44856735582061,1.0315559999999999,1.0315559999999999,15,261.25136017410125,261.25136017410125,0.80087040000000009,0.80087040000000009]
[null,80004,"Devonport CDB-Marine Board Area","Urban",1189,5.07,4.5780000000000003,8.0623000000000005,0.19474951549149433,2.5151372567374883,16,5.5036718588640037,5.5036718588640037,0.15146292,0.15146292,8,38.823580034423365,38.823580034423365,0.15232354000000001,0.15232354000000001]
[null,80005,"Devonport","Urban",1673,9.9339999999999993,3.931,4.5726000000000004,23.758938907881397,5.9423997561792925,16,23.252004787552266,23.252004787552266,1.0388988299999999,1.0388988299999999,14,105.49730700179514,105.49730700179514,0.42369831000000008,0.42369831000000008]
[null,80006,"Devonport (West)-Don-Forth-Leith","Short Rural",813,68.962000000000003,1.0049999999999999,4.3891999999999998,10.477764293556834,7.2230361660102851,57,213.29608946047642,213.29608946047642,1.7202005300000012,1.7202005300000012,31,226.28657465495561,226.28657465495561,0.7264741600000002,0.7264741600000002]
[null,80007,"East Devonport","Urban",1869,14.003,2.0510000000000002,6.0810000000000004,1.7236235839277843,9.2872669963541803,34,54.016868096676703,54.016868096676703,2.015105510000001,2.015105510000001,27,129.51750253776407,124.44197383685773,0.46283971000000002,0.43867053]
[null,80008,"Devonport (Central)","Urban",1958,8.3770000000000007,2.419,4.9683999999999999,1.1320437738991367,1.8851428690047374,28,20.794294410270087,20.794294410270087,0.18347144000000004,0.18347144000000004,14,52.560577694570682,52.560577694570682,0.18721574999999996,0.18721574999999996]
[null,80009,"James St","Urban",1811,5.4880000000000004,4.5860000000000003,5.5778999999999996,0.89708826707326317,3.5297006871627721,32,23.87909212425474,23.87909212425474,1.0812673699999997,1.0812673699999997,10,64.952871038594097,64.952871038594097,0.22780037999999997,0.22780037999999997]
[null,80010,"Devonport West-Don Heads","Urban",1997,13.364000000000001,3.74,6.6752000000000002,9.9003438498252301,2.5221658869349075,22,109.85389766390321,109.85389766390321,1.0801304999999999,1.0801304999999999,8,41.500921024867992,41.500921024867992,0.20296404000000001,0.20296404000000001]
[null,80011,"Panorama Heights-Ambleside-Latrobe(North)","Short Rural",1236,32.520000000000003,2.8769999999999998,5.9135999999999997,5.7025484888940001,0.78916633978679585,28,179.2104030844153,179.2104030844153,1.7353894099999998,1.7353894099999998,5,13.060876623376583,13.060876623376583,4.4642829999999994E-2,4.4642829999999994E-2]
[null,81001,"East Devonport-Shearwater-Port Sorell","Short Rural",2948,75.343999999999994,5.0199999999999996,7.2552000000000003,0.55528120936925873,2.3277201061729317E-2,16,175.80921569115787,175.80921569115787,1.8132004799999999,1.8132004799999999,5,7.3698630136986152,7.3698630136986152,3.4869240000000003E-2,3.4869240000000003E-2]
[null,81002,"Moriarty-Thirlstane-Squeaking Point","Short Rural",875,72.132000000000005,1.56,1.7376,0.18599770628353091,0.16956269161663426,75,225.89451682184952,225.89451682184952,2.4320293900000003,2.4320293900000003,26,245.88206083178102,245.88206083178102,0.74239587000000029,0.74239587000000029]
[null,82001,"Kindred-Forth-Turners Beach","Short Rural",579,92.245999999999995,0.185,3.8410000000000002,11.737422787741041,8.0346733105152488,73,293.94927279479998,293.94927279479998,3.1532032299999995,3.1532032299999995,30,222.01414410399198,222.01414410399198,0.73909000000000002,0.73909000000000002]
[null,82002,"Ulverstone-Penguin","Short Rural",2215,22.236999999999998,2.8919999999999999,5.7423999999999999,5.7710884697603255,2.8369432503308496,40,152.44484689904863,152.44484689904863,2.1892257199999983,2.1892257199999983,20,63.871057808963229,63.871057808963229,0.22996819999999998,0.22996819999999998]
[null,82003,"Ulverstone (West)-Penguin","Short Rural",2278,64.441999999999993,1.9810000000000001,5.8605999999999998,6.2978878647295549,2.9683374224442942,51,90.666343511786522,90.666343511786522,2.4516410000000008,2.4516410000000008,26,50.575141352720728,50.575141352720728,0.17228449000000004,0.17228449000000004]
[null,82004,"Gawler-Preston-Gunns Plains-Nietta","Short Rural",871,185.18100000000001,0.254,2.2368000000000001,6.0539753385536699,2.0327822873406691,85,471.54756635513922,471.54756635513922,4.2827098400000017,4.2827098400000017,35,175.8202102803736,175.8202102803736,0.60397176999999991,0.60397176999999991]
[null,82005,"Ulverstone (East)","Urban",1869,10.005000000000001,3.0409999999999999,5.7652999999999999,1.902368557907367,0.92381170885594266,26,15.126381779091624,15.126381779091624,0.14727205000000004,0.14727205000000004,7,12.781510346680987,12.781510346680987,4.9986490000000001E-2,4.9986490000000001E-2]
[null,82006,"Simplot","Urban",224,2.4159999999999999,1.1080000000000001,4.6182999999999996,1.2336303300781439,5.4390531944288174,6,213.00054153132177,213.00054153132177,1.17401391,1.17401391,3,160.14849187935022,160.14849187935022,0.42691414000000005,0.42691414000000005]
[null,82007,"Gawler-Upper Castra","Short Rural",560,101.74299999999999,1.835,1.7527999999999999,2.207705128233417,1.202165882774358,32,188.33526119402956,188.33526119402956,0.99999989000000056,0.99999989000000056,17,155.38787313432806,155.38787313432806,0.50932828000000008,0.50932828000000008]
[null,82008,"Turners Beach","Short Rural",1834,24.256,6.7889999999999997,5.7728999999999999,7.3036079484781586,3.5961069075202965,36,166.36692155148853,166.36692155148853,2.7489754499999992,2.7489754499999992,25,52.857233925156997,52.857233925156997,0.54083569000000009,0.54083569000000009]
[null,85001,"Beulah-Sheffield-Nook-Wilmot-Cradle Mountain","Long Rural",2656,397.58499999999998,13.153,6.1806999999999999,10.099880807261577,3.820903274495616,129,150.06288798888207,150.06288798888207,0.73654920999999862,0.73654920999999862,36,72.024419297200538,72.024419297200538,0.27476655999999994,0.27476655999999994]
[null,85002,"Elizabeth Town-Deloraine-Meander-Exton-Westbury","Long Rural",2000,337.17599999999999,1.9450000000000001,6.4855,25.727404618960673,10.893021831490348,187,358.82572535704577,358.82572535704577,3.6060348299999907,3.6060348299999907,54,180.5208749124221,180.5208749124221,0.54432730000000007,0.54432730000000007]
[null,85003,"Big Bend-Tarleton-Melrose-Barrington","Short Rural",1458,174.09299999999999,0.53100000000000003,3.4866000000000001,12.100872229732435,2.3597893451270218,73,221.87980991087301,221.87980991087301,2.4869872399999995,2.4869872399999995,23,90.350089126559581,90.350089126559581,0.25311928000000011,0.25311928000000006]
[null,85004,"Sassafras-Moriarty-Thirlstane","Short Rural",789,166.94900000000001,1.073,4.4545000000000003,6.4454561648219766,6.942938531260582,108,163.55338058405647,163.55338058405647,2.1341746399999995,2.1341746399999995,27,247.65609044988105,247.65609044988105,0.79873695,0.79873695]
[null,85005,"Goliath Portland Cement (South)","Urban",2,0.41199999999999998,0.57599999999999996,11.2067,0,0,0,0,0,0,0,0,0,0,0,0]
[null,85006,"Needles-Deloraine-Mole Creek-Western Creek","Long Rural",2444,406.31900000000002,3.3580000000000001,8.0745000000000005,14.411881502646663,7.5057402307782963,201,166.45852861834865,166.45852861834865,1.9583961999999997,1.9583961999999997,51,126.25928031530519,126.25928031530519,0.49923335999999979,0.49923335999999979]
[null,85007,"Goliath Portland Cement (North)","Urban",2,0.41399999999999998,0.56100000000000005,14.567600000000001,0,0,0,0,0,0,0,0,0,0,0,0]
[null,85008,"Latrobe","Short Rural",1535,42.612000000000002,1.536,5.4870999999999999,0.94405328770336383,0.3202863202914637,34,21.717440922569988,21.717440922569988,0.17133424,0.17133424,7,5.7891268533772537,5.7891268533772537,2.8995010000000002E-2,2.8995010000000002E-2]
[null,89001,"Rowallan-Lemonthyme-Parsons Falls","Short Rural",11,25.184000000000001,0.13200000000000001,0,0,0,7,1230,1230,6.75,6.75,0,0,0,0,0]
[null,90019,"Massey Sawmill","Urban",5,0.66600000000000004,0.121,4.0334000000000003,0,48.971567186148164,0,0,0,0,0,1,1964,1964,1,1]
[null,90020,"Burnie CBD (East)-Marine Board","Urban",118,0.92100000000000004,2.6120000000000001,1.8575999999999999,1.6049641631153942E-2,0.2134418571330684,1,0.78806375545851504,0.78806375545851504,1.7467239999999998E-2,1.7467239999999998E-2,1,10.4803493449781,10.4803493449781,0.13100435999999999,0.13100435999999999]
[null,90021,"Burnie CBD (North)-Marine Board","Urban",182,1.016,3.5009999999999999,1.9719,2.3071142323065875E-2,1.2389705656161127,2,1.122962777777776,1.122962777777776,1.11111E-2,1.11111E-2,2,60.3055555555555,60.3055555555555,0.20555554000000001,0.20555554000000001]
[null,90023,"Burnie CBD (West)","Urban",495,1.7350000000000001,1.7150000000000001,2.5339999999999998,5.3779828231744202E-2,2.2660039985285478E-2,8,1.6608519269776831,1.6608519269776831,1.6227120000000001E-2,1.6227120000000001E-2,1,0.69979716024340699,0.69979716024340699,2.0283900000000001E-3,2.0283900000000001E-3]
[null,90024,"Burnie CBD (Central / West)","Urban",185,0,3.9750000000000001,2.6507000000000001,7.9348666853472902E-2,0.63866000150356239,1,3.36065573770491,3.36065573770491,1.6393439999999999E-2,1.6393439999999999E-2,3,27.04918032786874,27.04918032786874,0.20218577999999998,0.20218577999999998]
[null,91001,"Ridgley-Yolla-Calder-Hampshire-Preolenna","Short Rural",818,96.671000000000006,0.42399999999999999,5.1822999999999997,11.521224522089636,3.9712122420219895,59,228.68462811343983,228.68462811343983,1.8545003400000002,1.8545003400000002,8,78.637916152897503,78.637916152897503,0.21085075999999997,0.21085075999999997]
[null,91002,"Natone-Cuprona","Short Rural",832,141.45099999999999,0.68700000000000006,3.1373000000000002,6.5155440218783509,3.4763816492557518,76,320.20652307692239,320.20652307692239,1.66153792,1.66153792,37,212.06276923076888,212.06276923076888,0.69292282999999988,0.69292282999999988]
[null,91003,"Upper Burnie-Wivenhoe","Urban",1088,15.661,2.887,6.4016999999999999,18.712035981108365,0.96984214987115813,17,234.85077372330545,234.85077372330545,2.1857009200000008,2.1857009200000008,5,14.740947075208904,14.740947075208904,0.12070564,0.12070564]
[null,91004,"Wynyard-Moorleah-Table Cape-Boat Harbour","Long Rural",2993,249.31899999999999,1.95,7.1130000000000004,84.062772554907397,2.895579200960928,115,801.06860947391135,801.06860947391135,7.0561006099999926,7.0561006099999926,31,49.779524121370805,49.779524121370805,0.19777323000000008,0.19777323000000008]
[null,91005,"Somerset (South)-Wynyard (South)","Short Rural",470,35.896000000000001,2.5720000000000001,3.8866999999999998,3.1853730141525718,1.4611404639512329,20,10.367472527472499,10.367472527472499,7.9120830000000003E-2,7.9120830000000003E-2,9,39.589010989010902,39.589010989010902,0.12747248,0.12747248]
[null,91006,"Camdale-Somerset (North)-Wynyard (North)","Short Rural",2369,35.868000000000002,5.8739999999999997,9.4246999999999996,23.605354470542188,1.3192916205495777,59,145.6925311213773,145.6925311213773,1.5325491699999996,1.5325491699999996,9,18.167996640067155,18.167996640067152,9.407807E-2,9.407807E-2]
[null,91007,"Burnie (West)-Cooee","Urban",1318,7.0789999999999997,0.61899999999999999,3.3786999999999998,1.6693033535670924E-2,1.2408112412801076,14,0.70042964366944305,0.70042964366944305,6.0651999999999998E-3,6.0651999999999998E-3,6,74.905231235784541,74.905231235784541,0.22896131,0.22896131]
[null,91008,"Burnie (East)","Urban",3657,22.039000000000001,4.8410000000000002,9.4882000000000009,25.78585481469846,1.1551660998693567,65,279.35676526978881,279.35676526978881,3.2747189799999981,3.2747189799999981,8,12.644480964119392,12.644480964119392,3.7797839999999999E-2,3.7797839999999999E-2]
[null,91009,"Wynyard","Short Rural",2164,28.599,8.2119999999999997,5.3474000000000004,16.681362358089242,2.0833287399622757,30,69.796430248942855,69.796430248942855,0.29403467,0.29403467,15,46.377806481916352,46.377806481916352,0.20713944999999997,0.20713944999999997]
[null,91010,"North West Private Hospital","Urban",855,5.6029999999999998,3.496,5.5251999999999999,0.23793567248952321,1.2296154332958267,5,3.6011695906432686,3.6011695906432686,5.1461979999999997E-2,5.1461979999999997E-2,4,25.385964912280681,25.385964912280681,0.20818711000000001,0.20818711000000001]
[null,91011,"Penguin-Riana","Short Rural",1355,147.114,2.6150000000000002,3.7088999999999999,30.804788912829917,6.820169832961593,93,714.08838245882691,714.08838245882691,5.2761392799999998,5.2761392799999998,67,228.97896078130947,228.97896078130947,0.70088084999999967,0.70088084999999967]
[null,91012,"Mooreville","Long Rural",1228,257.94099999999997,7.1319999999999997,3.7088999999999999,27.610448160184394,1.4766107320905517,98,717.79282637456936,717.79282637456936,5.9175251999999938,5.9175251999999938,22,54.874398625429386,54.874398625429386,0.21563559999999998,0.21563559999999998]
[null,93001,"Irishtown-Forest-Stanley-Mengha-Trowutta","Short Rural",900,191.40199999999999,0.876,5.0370999999999997,7.0863696310964857,10.123595725556484,76,173.02802113251562,173.02802113251562,4.3222412899999973,4.3222412899999973,30,257.1375753648565,257.06752282545193,0.81260926999999994,0.81144172999999997]
[null,93002,"Marrawah-Mella","Short Rural",942,180.75,3.7349999999999999,6.4393000000000002,31.7383561444869,0.69142186000919381,98,609.68009579563409,609.68009579563409,4.4938792599999955,4.4938792599999955,10,18.464076636508747,18.464076636508747,0.10537516000000001,0.10537516000000001]
[null,93003,"Edith Creek-Trowutta-Togari-Marrawah-Woolnorth","Short Rural",700,53.77,0.89800000000000002,5.5431999999999997,2.894615158654227,5.74807301255903,35,89.934317343173362,89.934317343173362,0.51808100000000012,0.51808100000000012,4,130.44870848708479,130.31586715867149,0.41328410999999998,0.40885607000000002]
[null,93004,"Smithton-McCains","Urban",294,2.4239999999999999,0.28699999999999998,3.9891999999999999,0.42838000042713453,0.34190286919089891,6,9.8760757314974033,9.8760757314974033,0.11703958,0.11703958,1,19.4664371772805,19.4664371772805,0.13425129,0.13425129]
[null,93005,"Montague-Cape Grim","Short Rural",1328,151.446,2.8170000000000002,4.4804000000000004,8.0660421172268517,1.2265511382950676,99,202.16772727272706,202.16772727272706,1.4310601099999996,1.4310601099999996,14,29.406818181818121,29.406818181818121,0.15075751000000001,0.15075751000000001]
[null,93006,"Irish Town","Urban",2,0,1.823,2.331,0,0,0,0,0,0,0,0,0,0,0,0]
[null,94001,"Mawbanna-Stanley","Short Rural",996,140.73500000000001,0.224,4.2830000000000004,12.104167248157562,4.4289298199615095,86,697.82813701772534,697.82813701772534,7.3545355799999967,7.3545355799999967,44,252.75808133472302,252.75808133472302,0.83315930000000005,0.83315930000000005]
[null,94002,"Montumana-Sisters Creek-Myalla","Short Rural",559,82.569000000000003,0.33600000000000002,3.1703999999999999,16.376948172927477,6.4440171068382748,85,656.3506985209508,656.3506985209508,5.2514376300000016,5.2514376300000016,41,336.77403451109171,336.77403451109171,1.1051763899999993,1.1051763899999993]
[null,95001,"Savage River-Luina-Waratah","Short Rural",258,61.078000000000003,0.24,1.0517000000000001,6.4700706337432328,7.9494456862023375,10,693.27697782101052,693.27697782101052,1.87159531,1.87159531,6,864.6225680933843,864.6225680933843,1.9766536800000001,1.9766536800000001]
[null,96202,"Henty Gold","Urban",20,10.551,0.52600000000000002,3.7038000000000002,0,4.3184720358051747,0,0,0,0,0,1,304.83330000000001,304.83330000000001,1,1]
[null,96303,"Hampshire Mill","Short Rural",7,7.5339999999999998,0.61,0,0,0,0,0,0,0,0,0,0,0,0,0]
[null,97001,"Rosebery Village (South)-Williamsford-Mt Read","Short Rural",439,19.088999999999999,2.298,1.1469,2.6925046186789272,0.27014772025858824,18,237.33486238532004,237.33486238532004,2.4678897999999991,2.4678897999999991,4,23.812576376146698,23.812576376146698,0.11926603999999999,0.11926603999999999]
[null,97002,"Rosebery-Anthony-Tribute-Tullah-Mackintosh-Reece","Short Rural",530,60.305,4.4999999999999998E-2,1.1432,0.94846377673899651,0,19,69.605442176870653,69.605442176870653,0.60058302999999991,0.60058302999999991,0,0,0,0,0]
[null,97011,"Pasminco Rosebery","Short Rural",1,0.14199999999999999,0,0,0,0,0,0,0,0,0,0,0,0,0,0]
[null,97013,"Zeehan Zone Substation","Short Rural",7,36.369,0,1.3988,12.225203977446755,12.267207207262738,4,162,162,2,2,2,620.26667142857104,620.26667142857104,2,2]
[null,97014,"Renison Mine","Urban",1,9.5459999999999994,0,16.159800000000001,0,49.985729271225729,0,0,0,0,0,1,244.66669999999999,244.66669999999999,1,1,null,null," "]
[null,98001,"Strahan","Short Rural",675,64.100999999999999,2.14,1.9172,10.743701154442098,0.28612243955277711,38,547.01133786847936,547.01133786847936,10.255479659999997,10.255479659999997,3,15.300075585789859,15.300075585789859,7.7097499999999999E-2,7.7097499999999999E-2]
[null,98002,"Queenstown (West)-John Butters Power Station","Short Rural",837,17.071999999999999,1.905,2.3071999999999999,0.62758967958881462,1.1943926414091908,25,25.261017964071826,25.261017964071826,0.31496997999999998,0.31496997999999998,4,83.716167664670522,83.716167664670522,0.22514968000000002,0.22514968000000002]
[null,98003,"Queenstown (East)-Gormanston-Lake Burbury","Short Rural",559,11.16,2.3460000000000001,1.2087000000000001,0.25650432824012542,3.5924323943829828E-2,11,24.377259066427243,24.377259066427243,0.21184917000000006,0.21184917000000006,1,4.0592459605026896,4.0592459605026896,3.0520640000000002E-2,3.0520640000000002E-2]
[null,99981,"Zeehan","Short Rural",650,67.924000000000007,0.23799999999999999,1.8036000000000001,25.675890844837891,0.52114382786834768,38,1032.8482623938187,1032.8482623938187,9.5938222200000016,9.5938222200000016,9,33.407490347490238,33.407490347490238,1.1057914599999998,1.1057914599999998]
[null,99982,"Allegiance","Short Rural",2,2.415,0.129,0.60970000000000002,0,0,0,0,0,0,0,0,0,0,0,0]
[null,99983,"Zeehan Zinc","Short Rural",15,4.24,0.219,0,4.6664228107807226E-5,2.7548576777321412E-7,4,204.33333333333331,204.33333333333331,5.6666666599999997,5.6666666599999997,1,5,5,1,1]

{"sheet":"3.6.9 Network-reliability","index":7,"n_rows":22,"n_cols":3,"rows_kept":22,"cut":false,"hidden":false,"merged":[]}
[null,{"$f":"IF(dms_DataQuality=\"backcast\",INDEX(dms_Worksheet_List,MATCH(dms_Model,dms_Model_List))&\" BACKCAST\",INDEX(dms_Worksheet_List,MATCH(dms_Model,dms_Model_List)))","v":"ANNUAL REPORTING STATEMENT"}]
[null,{"$f":"INDEX(dms_TradingNameFull_List,MATCH(dms_TradingName,dms_TradingName_List))","v":"TasNetworks (D)"}]
[null,{"$f":"CONCATENATE(\"Annual Reporting RIN Response \",IF(SUM(dms_SingleYear_Model)>0,CONCATENATE(CRY),CONCATENATE(FRCP_y1,\" to \",dms_MultiYear_FinalYear_Result)))","v":"Annual Reporting RIN Response 2017-18"}]
[null,"3.6 QUALITY OF SERVICES"]
[]
[]
[null,"3.6.9 - NETWORK FEEDER RELIABILITY - PLANNED OUTAGES"]
[null,null,{"$f":"CRY","v":"2017-18"}]
[null,"3.6.9.1 - PLANNED MINUTES OFF SUPPLY (SAIDI)"]
[null,{"$f":"INDEX(dms_FeederName_1,MATCH(dms_TradingName,dms_TradingName_List))","v":"Critical Infrastructure"},24.291428571428565]
[null,{"$f":"INDEX(dms_FeederName_2,MATCH(dms_TradingName,dms_TradingName_List))","v":"High density commercial"},20.983845094778815]
[null,{"$f":"INDEX(dms_FeederName_3,MATCH(dms_TradingName,dms_TradingName_List))","v":"Urban"},40.5611286855206]
[null,{"$f":"INDEX(dms_FeederName_4,MATCH(dms_TradingName,dms_TradingName_List))","v":"High density rural"},84.711993628928582]
[null,{"$f":"IF((INDEX(dms_FeederName_5,MATCH(dms_TradingName,dms_TradingName_List))=0),\"\",(INDEX(dms_FeederName_5,MATCH(dms_TradingName,dms_TradingName_List))))","v":"Low density rural"},145.04612909714032]
[]
[null,null,{"$f":"CRY","v":"2017-18"}]
[null,"3.6.9.2 - PLANNED INTERRUPTIONS TO SUPPLY (SAIFI)"]
[null,{"$f":"INDEX(dms_FeederName_1,MATCH(dms_TradingName,dms_TradingName_List))","v":"Critical Infrastructure"},8.8571380000000019E-2]
[null,{"$f":"INDEX(dms_FeederName_2,MATCH(dms_TradingName,dms_TradingName_List))","v":"High density commercial"},7.4714429999999998E-2]
[null,{"$f":"INDEX(dms_FeederName_3,MATCH(dms_TradingName,dms_TradingName_List))","v":"Urban"},0.16683635000000166]
[null,{"$f":"INDEX(dms_FeederName_4,MATCH(dms_TradingName,dms_TradingName_List))","v":"High density rural"},0.31790985000000099]
[null,{"$f":"IF((INDEX(dms_FeederName_5,MATCH(dms_TradingName,dms_TradingName_List))=0),\"\",(INDEX(dms_FeederName_5,MATCH(dms_TradingName,dms_TradingName_List))))","v":"Low density rural"},0.51185340000000246]

{"sheet":"4.1 Public lighting","index":8,"n_rows":87,"n_cols":4,"rows_kept":87,"cut":false,"hidden":false,"merged":[[5,1,5,2]]}
[null,{"$f":"IF(dms_DataQuality=\"backcast\",INDEX(dms_Worksheet_List,MATCH(dms_Model,dms_Model_List))&\" BACKCAST\",INDEX(dms_Worksheet_List,MATCH(dms_Model,dms_Model_List)))","v":"ANNUAL REPORTING STATEMENT"}]
[null,{"$f":"INDEX(dms_TradingNameFull_List,MATCH(dms_TradingName,dms_TradingName_List))","v":"TasNetworks (D)"}]
[null,{"$f":"CONCATENATE(\"Annual Reporting RIN Response \",IF(SUM(dms_SingleYear_Model)>0,CONCATENATE(CRY),CONCATENATE(FRCP_y1,\" to \",dms_MultiYear_FinalYear_Result)))","v":"Annual Reporting RIN Response 2017-18"}]
[null,"4.1 PUBLIC LIGHTING"]
[]
[null,"Tables 4.1.1 - 4.1.3 deliberately omitted."]
[]
[null,"4.1.4 - PUBLIC LIGHTING METRICS BY TARIFF"]
[null,null,"Number of Lights","Public Lighting Revenue"]
[null,"Tariff categories","0's","$0's, nominal"]
[null,"Public Road Lights"]
[null,"14W LED",5105.916666666667,581069.01999999909]
[null,"18W LED",485.16666666666669,58930.979999999989]
[null,"18W LED Decorative",111.66666666666667,14174.119999999999]
[null,"25W LED",16,2462.63]
[null,"25W LED Decorative ",7.75,1325.33]
[null,"42W Compact Fluorescent",5627.5,727825.50000000035]
[null,"42W Compact Fluorescent - Bottom Pole Entry",4,513.26]
[null,"70W Sodium Vapour",187.33333333333334,23948.410000000007]
[null,"100W Sodium Vapour",335.58333333333331,54445.360000000008]
[null,"150W Sodium Vapour",4270.833333333333,722462.58999999962]
[null,"250W Sodium Vapour",5409.5,934811.67000000062]
[null,"400W Sodium Vapour",501.33333333333331,88181.179999999978]
[null,"250W Sodium Vapour - Flood Light",7.333333333333333,1384.51]
[null,"400W Sodium Vapour - Flood Light",4,748.92000000000007]
[null,"100W Metal Halide",0.66666666666666663,107.78999999999999]
[null,"150W Metal Halide",27,4657.6299999999992]
[null,"250W Metal Halide",28,4916.1999999999989]
[null,"400W Metal Halide",2,389.64]
[null,"250W Metal Halide - Flood Light",0,0]
[null,"400W Metal Halide - Flood Light",0,0]
[null,"2x24W Compact Fluorescent",0,0]
[null,"1x20W Fluorescent",7,940.4]
[null,"50W Mercury Vapour",162.41666666666666,19448.73]
[null,"80W Mercury Vapour",13832.75,1710923.4600000002]
[null,"80W Mercury Vapour Art decorative",0,0]
[null,"125W Mercury Vapour",97.916666666666671,15859.480000000003]
[null,"250W Mercury Vapour",424.33333333333331,69459.89]
[null,"400W Mercury Vapour",282.41666666666669,48402.710000000014]
[null,"1x40W Fluorescent",40.333333333333336,5251.67]
[null,"2x20W Fluorescent",8,1083.0100000000002]
[null,"2x24W Fluorescent",35,4732.0199999999995]
[null,"2x40W Fluorescent",3,393.84]
[null,"4x40W Fluorescent",1,170.4]
[null,"100W Incandescent",8,1195.29]
[null,"60W Incandescent",15,1750.54]
[null,"30W LED",1,122.24]
[]
[null,"Private Contract Lights"]
[null,"14W LED",5730.666666666667,254932.05]
[null,"18W LED",33.666666666666664,1479.3599999999997]
[null,"18W LED Decorative",2.333333333333333,102.52]
[null,"25W LED",0.16666666666666666,7.34]
[null,"25W LED Decorative",0,0]
[null,"42W Compact Fluorescent",26.666666666666668,1735.3000000000002]
[null,"42W Compact Fluorescent - Bottom Pole Entry",0,0]
[null,"50W Mercury Vapour",179.16666666666666,11608.380000000001]
[null,"80W Mercury Vapour",333.58333333333331,21373.74]
[null,"80W Mercury Vapour Art decorative",0,0]
[null,"125W Mercury Vapour",347,26735.529999999992]
[null,"250W Mercury Vapour",28.583333333333332,2148.8099999999995]
[null,"400W Mercury Vapour",22,1707.2200000000003]
[null,"70W Sodium Vapour",73,4789.7400000000007]
[null,"100W Sodium Vapour",1,80.3]
[null,"150W Sodium Vapour",161.75,13000.340000000002]
[null,"250W Sodium Vapour",167.58333333333334,13460.690000000002]
[null,"400W Sodium Vapour",103.08333333333333,8348.4100000000017]
[null,"250W Sodium Vapour - Flood Light",0,0]
[null,"400W Sodium Vapour - Flood Light",0,0]
[null,"100W Metal Halide",0,0]
[null,"150W Metal Halide",28,2262.5900000000006]
[null,"250W Metal Halide",38,3084.56]
[null,"400W Metal Halide",9,749.91]
[null,"250W Metal Halide - Flood Light",0,0]
[null,"400W Metal Halide - Flood Light",0,0]
[null,"1x20W Fluorescent",27,1748.11]
[null,"2x20W Fluorescent",45,2966.17]
[null,"1x40W Fluorescent",4,259.21999999999997]
[null,"2x40W Fluorescent",3,197.81]
[null,"3x40W Fluorescent",1,79.820000000000007]
[null,"4x40W Fluorescent",1,80.89]
[null,"4x20 Fluorescent",2,135.68]
[null,"60W Incandescent",23,1475.6699999999998]
[null,"100W Incandescent",5,384.59000000000003]
[]
[null,"To enter further tariff categories - please insert new rows above this row. "]
[null,"Total ",{"$f":"SUM(C11:C85)","v":44446},{"$f":"SUM(D11:D85)","v":5477023.1699999981}]

{"sheet":"6.2 STPIS Reliability","index":9,"n_rows":94,"n_cols":4,"rows_kept":94,"cut":false,"hidden":false,"merged":[[5,1,5,2],[31,1,31,2],[66,1,71,1],[60,1,65,1],[53,1,53,2],[54,1,59,1],[16,1,21,1],[9,1,9,2],[10,1,15,1],[76,1,81,1],[82,1,87,1],[88,1,93,1],[75,1,75,2],[22,1,27,1],[32,1,37,1],[38,1,43,1],[44,1,49,1]]}
[null,{"$f":"IF(dms_DataQuality=\"backcast\",INDEX(dms_Worksheet_List,MATCH(dms_Model,dms_Model_List))&\" BACKCAST\",INDEX(dms_Worksheet_List,MATCH(dms_Model,dms_Model_List)))","v":"ANNUAL REPORTING STATEMENT"}]
[null,{"$f":"INDEX(dms_TradingNameFull_List,MATCH(dms_TradingName,dms_TradingName_List))","v":"TasNetworks (D)"}]
[null,{"$f":"CONCATENATE(\"Annual Reporting RIN Response \",IF(SUM(dms_SingleYear_Model)>0,CONCATENATE(CRY),CONCATENATE(FRCP_y1,\" to \",dms_MultiYear_FinalYear_Result)))","v":"Annual Reporting RIN Response 2017-18"}]
[null,"6.2 RELIABILITY AND CUSTOMER SERVICE PERFORMANCE"]
[]
[null,"Did the MAIFI parameter of the STPIS apply during the period?\nNB:This flag is set from the response on worksheet 3.6.8 Network feeders",null,{"$f":"dms_MAIFI_Flag","v":"No"}]
[]
[]
[null,"6.2.1 - UNPLANNED MINUTES OFF SUPPLY (SAIDI)"]
[null,null,null,{"$f":"CRY","v":"2017-18"}]
[null,"Total sustained minutes off supply",{"$f":"INDEX(dms_FeederName_1,MATCH(dms_TradingName,dms_TradingName_List))","v":"Critical Infrastructure"},29.64325714285712]
[null,null,{"$f":"INDEX(dms_FeederName_2,MATCH(dms_TradingName,dms_TradingName_List))","v":"High density commercial"},70.577951402283361]
[null,null,{"$f":"INDEX(dms_FeederName_3,MATCH(dms_TradingName,dms_TradingName_List))","v":"Urban"},246.90922880870838]
[null,null,{"$f":"INDEX(dms_FeederName_4,MATCH(dms_TradingName,dms_TradingName_List))","v":"High density rural"},576.71908197642449]
[null,null,{"$f":"IF((INDEX(dms_FeederName_5,MATCH(dms_TradingName,dms_TradingName_List))=0),\"\",(INDEX(dms_FeederName_5,MATCH(dms_TradingName,dms_TradingName_List))))","v":"Low density rural"},758.44728059663623]
[null,null,"Whole Network",372.61873444129867]
[null,"Total of excluded events*\n\n*see 3.3 of STPIS",{"$f":"INDEX(dms_FeederName_1,MATCH(dms_TradingName,dms_TradingName_List))","v":"Critical Infrastructure"},26.064399999999992]
[null,null,{"$f":"INDEX(dms_FeederName_2,MATCH(dms_TradingName,dms_TradingName_List))","v":"High density commercial"},48.68696002660451]
[null,null,{"$f":"INDEX(dms_FeederName_3,MATCH(dms_TradingName,dms_TradingName_List))","v":"Urban"},142.20495021819124]
[null,null,{"$f":"INDEX(dms_FeederName_4,MATCH(dms_TradingName,dms_TradingName_List))","v":"High density rural"},334.11130717059439]
[null,null,{"$f":"IF((INDEX(dms_FeederName_5,MATCH(dms_TradingName,dms_TradingName_List))=0),\"\",(INDEX(dms_FeederName_5,MATCH(dms_TradingName,dms_TradingName_List))))","v":"Low density rural"},438.00061783394824]
[null,null,"Whole Network",215.27035116467454]
[null,"Total sustained minutes off supply after removing excluded events",{"$f":"INDEX(dms_FeederName_1,MATCH(dms_TradingName,dms_TradingName_List))","v":"Critical Infrastructure"},3.5788571428571325]
[null,null,{"$f":"INDEX(dms_FeederName_2,MATCH(dms_TradingName,dms_TradingName_List))","v":"High density commercial"},21.89099137567889]
[null,null,{"$f":"INDEX(dms_FeederName_3,MATCH(dms_TradingName,dms_TradingName_List))","v":"Urban"},104.70427859051762]
[null,null,{"$f":"INDEX(dms_FeederName_4,MATCH(dms_TradingName,dms_TradingName_List))","v":"High density rural"},242.6077748058286]
[null,null,{"$f":"IF((INDEX(dms_FeederName_5,MATCH(dms_TradingName,dms_TradingName_List))=0),\"\",(INDEX(dms_FeederName_5,MATCH(dms_TradingName,dms_TradingName_List))))","v":"Low density rural"},320.44666276269362]
[null,null,"Whole Network",157.34838327661942]
[]
[]
[null,"6.2.2 - UNPLANNED INTERRUPTIONS TO SUPPLY (SAIFI)"]
[null,null,null,{"$f":"CRY","v":"2017-18"}]
[null,"Total sustained interruptions",{"$f":"INDEX(dms_FeederName_1,MATCH(dms_TradingName,dms_TradingName_List))","v":"Critical Infrastructure"},0.15142846000000001]
[null,null,{"$f":"INDEX(dms_FeederName_2,MATCH(dms_TradingName,dms_TradingName_List))","v":"High density commercial"},0.37867152999999976]
[null,null,{"$f":"INDEX(dms_FeederName_3,MATCH(dms_TradingName,dms_TradingName_List))","v":"Urban"},1.7387863800000778]
[null,null,{"$f":"INDEX(dms_FeederName_4,MATCH(dms_TradingName,dms_TradingName_List))","v":"High density rural"},3.6110719200001111]
[null,null,{"$f":"IF((INDEX(dms_FeederName_5,MATCH(dms_TradingName,dms_TradingName_List))=0),\"\",(INDEX(dms_FeederName_5,MATCH(dms_TradingName,dms_TradingName_List))))","v":"Low density rural"},4.2599343599998232]
[null,null,"Whole Network",2.3851873800003154]
[null,"Total of excluded events*\n\n*see 3.3 of STPIS",{"$f":"INDEX(dms_FeederName_1,MATCH(dms_TradingName,dms_TradingName_List))","v":"Critical Infrastructure"},9.4285650000000013E-2]
[null,null,{"$f":"INDEX(dms_FeederName_2,MATCH(dms_TradingName,dms_TradingName_List))","v":"High density commercial"},0.11196080999999999]
[null,null,{"$f":"INDEX(dms_FeederName_3,MATCH(dms_TradingName,dms_TradingName_List))","v":"Urban"},0.47656391000000464]
[null,null,{"$f":"INDEX(dms_FeederName_4,MATCH(dms_TradingName,dms_TradingName_List))","v":"High density rural"},1.1487514200000026]
[null,null,{"$f":"IF((INDEX(dms_FeederName_5,MATCH(dms_TradingName,dms_TradingName_List))=0),\"\",(INDEX(dms_FeederName_5,MATCH(dms_TradingName,dms_TradingName_List))))","v":"Low density rural"},1.4756811400000021]
[null,null,"Whole Network",0.72630900999999115]
[null,"Total sustained interruptions after removing excluded events",{"$f":"INDEX(dms_FeederName_1,MATCH(dms_TradingName,dms_TradingName_List))","v":"Critical Infrastructure"},5.7142810000000016E-2]
[null,null,{"$f":"INDEX(dms_FeederName_2,MATCH(dms_TradingName,dms_TradingName_List))","v":"High density commercial"},0.2667107199999999]
[null,null,{"$f":"INDEX(dms_FeederName_3,MATCH(dms_TradingName,dms_TradingName_List))","v":"Urban"},1.2622224700000044]
[null,null,{"$f":"INDEX(dms_FeederName_4,MATCH(dms_TradingName,dms_TradingName_List))","v":"High density rural"},2.4623205000000281]
[null,null,{"$f":"IF((INDEX(dms_FeederName_5,MATCH(dms_TradingName,dms_TradingName_List))=0),\"\",(INDEX(dms_FeederName_5,MATCH(dms_TradingName,dms_TradingName_List))))","v":"Low density rural"},2.7842532199999113]
[null,null,"Whole Network",1.6588783700001162]
[]
[]
[null,"6.2.3 - UNPLANNED MOMENTARY INTERRUPTIONS TO SUPPLY (MAIFI)"]
[null,null,null,{"$f":"CRY","v":"2017-18"}]
[null,"Total momentary interruptions",{"$f":"INDEX(dms_FeederName_1,MATCH(dms_TradingName,dms_TradingName_List))","v":"Critical Infrastructure"},0.12342857142857142]
[null,null,{"$f":"INDEX(dms_FeederName_2,MATCH(dms_TradingName,dms_TradingName_List))","v":"High density commercial"},1.9685213921525162]
[null,null,{"$f":"INDEX(dms_FeederName_3,MATCH(dms_TradingName,dms_TradingName_List))","v":"Urban"},3.5477309029408839]
[null,null,{"$f":"INDEX(dms_FeederName_4,MATCH(dms_TradingName,dms_TradingName_List))","v":"High density rural"},8.1101745248538215]
[null,null,{"$f":"IF((INDEX(dms_FeederName_5,MATCH(dms_TradingName,dms_TradingName_List))=0),\"\",(INDEX(dms_FeederName_5,MATCH(dms_TradingName,dms_TradingName_List))))","v":"Low density rural"},10.425611076034924]
[null,null,"Whole Network",5.2669613476058066]
[null,"Total of excluded events*\n\n*see 3.3 of STPIS",{"$f":"INDEX(dms_FeederName_1,MATCH(dms_TradingName,dms_TradingName_List))","v":"Critical Infrastructure"},0.12342857142857142]
[null,null,{"$f":"INDEX(dms_FeederName_2,MATCH(dms_TradingName,dms_TradingName_List))","v":"High density commercial"},1.9685213921525162]
[null,null,{"$f":"INDEX(dms_FeederName_3,MATCH(dms_TradingName,dms_TradingName_List))","v":"Urban"},3.2968200277699342]
[null,null,{"$f":"INDEX(dms_FeederName_4,MATCH(dms_TradingName,dms_TradingName_List))","v":"High density rural"},7.4610060307017774]
[null,null,{"$f":"IF((INDEX(dms_FeederName_5,MATCH(dms_TradingName,dms_TradingName_List))=0),\"\",(INDEX(dms_FeederName_5,MATCH(dms_TradingName,dms_TradingName_List))))","v":"Low density rural"},9.3327094795706174]
[null,null,"Whole Network",4.8299966079053522]
[null,"Total momentary interruptions after removing excluded events",{"$f":"INDEX(dms_FeederName_1,MATCH(dms_TradingName,dms_TradingName_List))","v":"Critical Infrastructure"},0]
[null,null,{"$f":"INDEX(dms_FeederName_2,MATCH(dms_TradingName,dms_TradingName_List))","v":"High density commercial"},0]
[null,null,{"$f":"INDEX(dms_FeederName_3,MATCH(dms_TradingName,dms_TradingName_List))","v":"Urban"},0.25091087517095229]
[null,null,{"$f":"INDEX(dms_FeederName_4,MATCH(dms_TradingName,dms_TradingName_List))","v":"High density rural"},0.6491684941520468]
[null,null,{"$f":"IF((INDEX(dms_FeederName_5,MATCH(dms_TradingName,dms_TradingName_List))=0),\"\",(INDEX(dms_FeederName_5,MATCH(dms_TradingName,dms_TradingName_List))))","v":"Low density rural"},1.0929015964643281]
[null,null,"Whole Network",0.43696473970044658]
[]
[]
[null,"6.2.4 - DISTRIBUTION CUSTOMER NUMBERS"]
[null,null,null,{"$f":"CRY","v":"2017-18"}]
[null,"Customer numbers at the start of the period",{"$f":"INDEX(dms_FeederName_1,MATCH(dms_TradingName,dms_TradingName_List))","v":"Critical Infrastructure"},1740]
[null,null,{"$f":"INDEX(dms_FeederName_2,MATCH(dms_TradingName,dms_TradingName_List))","v":"High density commercial"},4497]
[null,null,{"$f":"INDEX(dms_FeederName_3,MATCH(dms_TradingName,dms_TradingName_List))","v":"Urban"},190857]
[null,null,{"$f":"INDEX(dms_FeederName_4,MATCH(dms_TradingName,dms_TradingName_List))","v":"High density rural"},43537]
[null,null,{"$f":"IF((INDEX(dms_FeederName_5,MATCH(dms_TradingName,dms_TradingName_List))=0),\"\",(INDEX(dms_FeederName_5,MATCH(dms_TradingName,dms_TradingName_List))))","v":"Low density rural"},44192]
[null,null,"Whole Network",284823]
[null,"Customer numbers at the end of the period",{"$f":"INDEX(dms_FeederName_1,MATCH(dms_TradingName,dms_TradingName_List))","v":"Critical Infrastructure"},1760]
[null,null,{"$f":"INDEX(dms_FeederName_2,MATCH(dms_TradingName,dms_TradingName_List))","v":"High density commercial"},4524]
[null,null,{"$f":"INDEX(dms_FeederName_3,MATCH(dms_TradingName,dms_TradingName_List))","v":"Urban"},192291]
[null,null,{"$f":"INDEX(dms_FeederName_4,MATCH(dms_TradingName,dms_TradingName_List))","v":"High density rural"},44015]
[null,null,{"$f":"IF((INDEX(dms_FeederName_5,MATCH(dms_TradingName,dms_TradingName_List))=0),\"\",(INDEX(dms_FeederName_5,MATCH(dms_TradingName,dms_TradingName_List))))","v":"Low density rural"},44504]
[null,null,"Whole Network",287094]
[null,"Average customer numbers",{"$f":"INDEX(dms_FeederName_1,MATCH(dms_TradingName,dms_TradingName_List))","v":"Critical Infrastructure"},{"$f":"IFERROR(ROUND(AVERAGE(D77,D83),0),\"\")","v":1750}]
[null,null,{"$f":"INDEX(dms_FeederName_2,MATCH(dms_TradingName,dms_TradingName_List))","v":"High density commercial"},4511]
[null,null,{"$f":"INDEX(dms_FeederName_3,MATCH(dms_TradingName,dms_TradingName_List))","v":"Urban"},191574]
[null,null,{"$f":"INDEX(dms_FeederName_4,MATCH(dms_TradingName,dms_TradingName_List))","v":"High density rural"},43776]
[null,null,{"$f":"IF((INDEX(dms_FeederName_5,MATCH(dms_TradingName,dms_TradingName_List))=0),\"\",(INDEX(dms_FeederName_5,MATCH(dms_TradingName,dms_TradingName_List))))","v":"Low density rural"},44348]
[null,null,"Whole Network",285959]

{"sheet":"6.6 STPIS Customer Service","index":10,"n_rows":12,"n_cols":4,"rows_kept":12,"cut":false,"hidden":false,"merged":[]}
[null,{"$f":"IF(dms_DataQuality=\"backcast\",INDEX(dms_Worksheet_List,MATCH(dms_Model,dms_Model_List))&\" BACKCAST\",INDEX(dms_Worksheet_List,MATCH(dms_Model,dms_Model_List)))","v":"ANNUAL REPORTING STATEMENT"}]
[null,{"$f":"INDEX(dms_TradingNameFull_List,MATCH(dms_TradingName,dms_TradingName_List))","v":"TasNetworks (D)"}]
[null,{"$f":"CONCATENATE(\"Annual Reporting RIN Response \",IF(SUM(dms_SingleYear_Model)>0,CONCATENATE(CRY),CONCATENATE(FRCP_y1,\" to \",dms_MultiYear_FinalYear_Result)))","v":"Annual Reporting RIN Response 2017-18"}]
[null,"6.6 STPIS CUSTOMER SERVICE"]
[]
[]
[null,"6.6.1 - TELEPHONE ANSWERING"]
[null,null,"Number of calls \nafter removing excluded events","Total number of calls"]
[null,null,{"$f":"CRY","v":"2017-18"},{"$f":"CRY","v":"2017-18"}]
[null,"Number of calls received",42634,50203]
[null,"Number of calls answered within 30 seconds",34315]
[null,"Percentage of calls answered within 30 seconds",{"$f":"IFERROR(C11/C10,\"\")","v":0.80487404419008302}]

{"sheet":"6.7 STPIS Daily Performance","index":11,"n_rows":380,"n_cols":16,"rows_kept":380,"cut":false,"hidden":false,"merged":[[12,14,12,15],[12,3,13,3],[6,1,6,5],[8,1,8,6],[12,4,12,5],[12,6,12,7],[12,10,12,11],[12,8,12,9],[12,12,12,13],[11,1,13,1],[11,2,11,3],[12,2,13,2],[11,4,11,13]]}
[null,{"$f":"IF(dms_DataQuality=\"backcast\",INDEX(dms_Worksheet_List,MATCH(dms_Model,dms_Model_List))&\" BACKCAST\",INDEX(dms_Worksheet_List,MATCH(dms_Model,dms_Model_List)))","v":"ANNUAL REPORTING STATEMENT"},null,null,null,null,null,null,"1-Jul-2016"]
[null,{"$f":"INDEX(dms_TradingNameFull_List,MATCH(dms_TradingName,dms_TradingName_List))","v":"TasNetworks (D)"}]
[null,{"$f":"CONCATENATE(\"Annual Reporting RIN Response \",IF(SUM(dms_SingleYear_Model)>0,CONCATENATE(CRY),CONCATENATE(FRCP_y1,\" to \",dms_MultiYear_FinalYear_Result)))","v":"Annual Reporting RIN Response 2017-18"}]
[null,"6.7 STPIS DAILY PERFORMANCE"]
[]
[]
[null,"Did the MAIFI parameter of the STPIS apply during the period?\nThis flag is set from the response on worksheet 3.6.8 Network feeders",null,null,null,null,{"$f":"dms_MAIFI_Flag","v":"No"}]
[]
[null,"The excluded events to be removed from the data refer only to events listed in clause 3.3(a) of the STPIS, with respect to reliability data, and in clause 5.4 of the STPIS with respect to customer service parameters.\n\n*Customer service information must be reported as per the definitions in the STPIS, that is excluding: \n   • calls to payment lines and automated interactive services \n   • calls abandoned by the customer within 30 seconds of the call being queued for response by a human operator (where the time in which a telephone call is abandoned is not measured, then an estimate of the number of calls abandoned within 30 seconds will be determined by taking 20 per cent of all calls abadoned)."]
[]
[null,"6.7.1 - DAILY PERFORMANCE DATA - UNPLANNED"]
[null,"Date","Customer service*",null,"MAIFI"]
[null,null,"Number of calls received\n(after removing excluded events)","Number of calls answered in 30 seconds\n(after removing excluded events)",{"$f":"INDEX(dms_FeederName_1,MATCH(dms_TradingName,dms_TradingName_List))","v":"Critical Infrastructure"},null,{"$f":"INDEX(dms_FeederName_2,MATCH(dms_TradingName,dms_TradingName_List))","v":"High density commercial"},null,{"$f":"INDEX(dms_FeederName_3,MATCH(dms_TradingName,dms_TradingName_List))","v":"Urban"},null,{"$f":"INDEX(dms_FeederName_4,MATCH(dms_TradingName,dms_TradingName_List))","v":"High density rural"},null,{"$f":"IF((INDEX(dms_FeederName_5,MATCH(dms_TradingName,dms_TradingName_List))=0),\"Network\",(INDEX(dms_FeederName_5,MATCH(dms_TradingName,dms_TradingName_List))))","v":"Low density rural"},null,"Network"]
[null,null,null,null,"All events","After removing excluded events","All events","After removing excluded events","All events","After removing excluded events","All events","After removing excluded events","All events","After removing excluded events","All events","After removing excluded events"]
[null,{"$f":"dms_060701_StartDateTxt","v":"1-Jul-2017"},78,69]
[null,{"$f":"B15+1","v":"2017-07-02"},198,143]
[null,"2017-07-03",235,175]
[null,"2017-07-04",127,119]
[null,"2017-07-05",110,102]
[null,"2017-07-06",65,60]
[null,"2017-07-07",89,81]
[null,"2017-07-08",73,66]
[null,"2017-07-09",100,89]
[null,"2017-07-10",106,103]
[null,"2017-07-11",94,90]
[null,"2017-07-12",146,116]
[null,"2017-07-13",112,89]
[null,"2017-07-14",137,113]
[null,"2017-07-15",122,96]
[null,"2017-07-16",61,60]
[null,"2017-07-17",143,138]
[null,"2017-07-18",106,101]
[null,"2017-07-19",96,90]
[null,"2017-07-20",96,91]
[null,"2017-07-21",95,86]
[null,"2017-07-22",59,55]
[null,"2017-07-23",115,101]
[null,"2017-07-24",81,73]
[null,"2017-07-25",114,102]
[null,"2017-07-26",94,88]
[null,"2017-07-27",93,86]
[null,"2017-07-28",206,171]
[null,"2017-07-29",130,96]
[null,"2017-07-30",130,96]
[null,"2017-07-31",99,87]
[null,"2017-08-01",144,117]
[null,"2017-08-02",101,86]
[null,"2017-08-03",109,94]
[null,"2017-08-04",105,97]
[null,"2017-08-05",61,58]
[null,"2017-08-06",45,42]
[null,"2017-08-07",103,89]
[null,"2017-08-08",76,72]
[null,"2017-08-09",63,57]
[null,"2017-08-10",99,86]
[null,"2017-08-11",0,0]
[null,"2017-08-12",789,272]
[null,"2017-08-13",105,102]
[null,"2017-08-14",174,143]
[null,"2017-08-15",127,97]
[null,"2017-08-16",148,131]
[null,"2017-08-17",120,106]
[null,"2017-08-18",88,82]
[null,"2017-08-19",14,13]
[null,"2017-08-20",46,43]
[null,"2017-08-21",73,65]
[null,"2017-08-22",92,75]
[null,"2017-08-23",95,83]
[null,"2017-08-24",132,100]
[null,"2017-08-25",86,73]
[null,"2017-08-26",60,59]
[null,"2017-08-27",42,41]
[null,"2017-08-28",94,76]
[null,"2017-08-29",72,69]
[null,"2017-08-30",65,55]
[null,"2017-08-31",73,63]
[null,"2017-09-01",64,55]
[null,"2017-09-02",37,37]
[null,"2017-09-03",148,105]
[null,{"$f":"B79+1","v":"2017-09-04"},91,78]
[null,"2017-09-05",113,109]
[null,"2017-09-06",97,94]
[null,"2017-09-07",139,103]
[null,"2017-09-08",82,76]
[null,"2017-09-09",43,39]
[null,"2017-09-10",31,30]
[null,"2017-09-11",164,115]
[null,"2017-09-12",115,97]
[null,"2017-09-13",120,102]
[null,"2017-09-14",85,73]
[null,"2017-09-15",61,57]
[null,"2017-09-16",58,55]
[null,"2017-09-17",32,32]
[null,"2017-09-18",95,88]
[null,"2017-09-19",100,90]
[null,"2017-09-20",67,59]
[null,"2017-09-21",88,86]
[null,"2017-09-22",74,71]
[null,"2017-09-23",163,122]
[null,"2017-09-24",66,63]
[null,"2017-09-25",194,137]
[null,"2017-09-26",82,70]
[null,"2017-09-27",103,83]
[null,"2017-09-28",73,66]
[null,"2017-09-29",103,82]
[null,"2017-09-30",148,118]
[null,"2017-10-01",40,38]
[null,"2017-10-02",74,70]
[null,"2017-10-03",60,58]
[null,"2017-10-04",70,67]
[null,"2017-10-05",44,42]
[null,"2017-10-06",87,77]
[null,"2017-10-07",52,50]
[null,"2017-10-08",34,33]
[null,"2017-10-09",68,59]
[null,"2017-10-10",97,94]
[null,"2017-10-11",93,84]
[null,"2017-10-12",81,74]
[null,"2017-10-13",74,60]
[null,"2017-10-14",85,78]
[null,"2017-10-15",83,38]
[null,"2017-10-16",91,82]
[null,"2017-10-17",94,72]
[null,"2017-10-18",80,74]
[null,"2017-10-19",103,95]
[null,"2017-10-20",83,69]
[null,"2017-10-21",77,73]
[null,"2017-10-22",43,36]
[null,"2017-10-23",92,85]
[null,"2017-10-24",72,57]
[null,"2017-10-25",84,77]
[null,"2017-10-26",53,50]
[null,"2017-10-27",79,73]
[null,"2017-10-28",48,46]
[null,"2017-10-29",116,99]
[null,"2017-10-30",122,113]
[null,"2017-10-31",115,109]
[null,"2017-11-01",46,45]
[null,"2017-11-02",79,76]
[null,"2017-11-03",99,96]
[null,"2017-11-04",27,25]
[null,"2017-11-05",30,28]
[null,"2017-11-06",65,63]
[null,{"$f":"B143+1","v":"2017-11-07"},81,72]
[null,"2017-11-08",49,46]
[null,"2017-11-09",79,74]
[null,"2017-11-10",70,60]
[null,"2017-11-11",39,36]
[null,"2017-11-12",37,34]
[null,"2017-11-13",79,64]
[null,"2017-11-14",82,74]
[null,"2017-11-15",97,80]
[null,"2017-11-16",142,110]
[null,"2017-11-17",93,78]
[null,"2017-11-18",81,63]
[null,"2017-11-19",35,35]
[null,"2017-11-20",124,93]
[null,"2017-11-21",69,66]
[null,"2017-11-22",88,79]
[null,"2017-11-23",81,81]
[null,"2017-11-24",207,162]
[null,"2017-11-25",240,143]
[null,"2017-11-26",135,114]
[null,"2017-11-27",252,182]
[null,"2017-11-28",117,106]
[null,"2017-11-29",89,85]
[null,"2017-11-30",144,136]
[null,"2017-12-01",183,151]
[null,"2017-12-02",120,95]
[null,"2017-12-03",0,0]
[null,"2017-12-04",150,125]
[null,"2017-12-05",113,95]
[null,"2017-12-06",92,88]
[null,"2017-12-07",102,92]
[null,"2017-12-08",88,81]
[null,"2017-12-09",85,79]
[null,"2017-12-10",65,59]
[null,"2017-12-11",220,172]
[null,"2017-12-12",98,87]
[null,"2017-12-13",106,98]
[null,"2017-12-14",166,134]
[null,"2017-12-15",110,101]
[null,"2017-12-16",42,38]
[null,"2017-12-17",58,43]
[null,"2017-12-18",170,136]
[null,"2017-12-19",186,157]
[null,"2017-12-20",189,177]
[null,"2017-12-21",120,110]
[null,"2017-12-22",117,111]
[null,"2017-12-23",64,55]
[null,"2017-12-24",89,70]
[null,"2017-12-25",100,89]
[null,"2017-12-26",60,55]
[null,"2017-12-27",64,57]
[null,"2017-12-28",91,81]
[null,"2017-12-29",124,91]
[null,"2017-12-30",87,75]
[null,"2017-12-31",62,55]
[null,"2018-01-01",98,93]
[null,"2018-01-02",88,81]
[null,"2018-01-03",125,112]
[null,"2018-01-04",101,94]
[null,"2018-01-05",96,89]
[null,"2018-01-06",54,49]
[null,"2018-01-07",48,43]
[null,"2018-01-08",136,116]
[null,"2018-01-09",102,81]
[null,{"$f":"B207+1","v":"2018-01-10"},125,105]
[null,"2018-01-11",119,107]
[null,"2018-01-12",248,221]
[null,"2018-01-13",160,106]
[null,"2018-01-14",84,81]
[null,"2018-01-15",173,153]
[null,"2018-01-16",107,92]
[null,"2018-01-17",94,76]
[null,"2018-01-18",112,84]
[null,"2018-01-19",225,155]
[null,"2018-01-20",109,89]
[null,"2018-01-21",85,72]
[null,"2018-01-22",94,84]
[null,"2018-01-23",89,87]
[null,"2018-01-24",92,87]
[null,"2018-01-25",114,110]
[null,"2018-01-26",48,46]
[null,"2018-01-27",82,74]
[null,"2018-01-28",65,63]
[null,"2018-01-29",249,160]
[null,"2018-01-30",150,126]
[null,"2018-01-31",106,68]
[null,"2018-02-01",77,62]
[null,"2018-02-02",99,90]
[null,"2018-02-03",38,36]
[null,"2018-02-04",67,61]
[null,"2018-02-05",120,112]
[null,"2018-02-06",74,74]
[null,"2018-02-07",189,160]
[null,"2018-02-08",95,85]
[null,"2018-02-09",66,60]
[null,"2018-02-10",186,92]
[null,"2018-02-11",47,45]
[null,"2018-02-12",92,77]
[null,"2018-02-13",82,71]
[null,"2018-02-14",0,0]
[null,"2018-02-15",554,343]
[null,"2018-02-16",237,184]
[null,"2018-02-17",79,72]
[null,"2018-02-18",73,69]
[null,"2018-02-19",130,102]
[null,"2018-02-20",110,96]
[null,"2018-02-21",90,84]
[null,"2018-02-22",146,130]
[null,"2018-02-23",197,129]
[null,"2018-02-24",153,110]
[null,"2018-02-25",63,59]
[null,"2018-02-26",164,137]
[null,"2018-02-27",221,199]
[null,"2018-02-28",305,232]
[null,"2018-03-01",215,169]
[null,"2018-03-02",123,109]
[null,"2018-03-03",69,69]
[null,"2018-03-04",59,55]
[null,"2018-03-05",124,118]
[null,"2018-03-06",90,88]
[null,"2018-03-07",101,90]
[null,"2018-03-08",116,106]
[null,"2018-03-09",90,83]
[null,"2018-03-10",63,56]
[null,"2018-03-11",79,67]
[null,"2018-03-12",62,58]
[null,"2018-03-13",112,105]
[null,"2018-03-14",95,70]
[null,{"$f":"B271+1","v":"2018-03-15"},120,112]
[null,"2018-03-16",81,76]
[null,"2018-03-17",52,44]
[null,"2018-03-18",611,234]
[null,"2018-03-19",450,351]
[null,"2018-03-20",117,109]
[null,"2018-03-21",109,100]
[null,"2018-03-22",123,115]
[null,"2018-03-23",159,133]
[null,"2018-03-24",387,245]
[null,"2018-03-25",258,136]
[null,"2018-03-26",261,212]
[null,"2018-03-27",101,97]
[null,"2018-03-28",85,78]
[null,"2018-03-29",81,76]
[null,"2018-03-30",128,107]
[null,"2018-03-31",39,36]
[null,"2018-04-01",33,32]
[null,"2018-04-02",90,85]
[null,"2018-04-03",130,86]
[null,"2018-04-04",117,93]
[null,"2018-04-05",99,86]
[null,"2018-04-06",116,93]
[null,"2018-04-07",33,33]
[null,"2018-04-08",41,40]
[null,"2018-04-09",145,102]
[null,"2018-04-10",92,84]
[null,"2018-04-11",100,87]
[null,"2018-04-12",254,160]
[null,"2018-04-13",79,68]
[null,"2018-04-14",454,228]
[null,"2018-04-15",183,154]
[null,"2018-04-16",436,277]
[null,"2018-04-17",131,113]
[null,"2018-04-18",104,89]
[null,"2018-04-19",112,107]
[null,"2018-04-20",74,68]
[null,"2018-04-21",60,54]
[null,"2018-04-22",39,38]
[null,"2018-04-23",110,104]
[null,"2018-04-24",110,103]
[null,"2018-04-25",159,68]
[null,"2018-04-26",114,94]
[null,"2018-04-27",64,58]
[null,"2018-04-28",40,36]
[null,"2018-04-29",56,44]
[null,"2018-04-30",83,80]
[null,"2018-05-01",72,70]
[null,"2018-05-02",53,51]
[null,"2018-05-03",76,72]
[null,"2018-05-04",117,102]
[null,"2018-05-05",156,83]
[null,"2018-05-06",46,43]
[null,"2018-05-07",211,168]
[null,"2018-05-08",107,99]
[null,"2018-05-09",140,126]
[null,"2018-05-10",0,0]
[null,"2018-05-11",0,0]
[null,"2018-05-12",708,234]
[null,"2018-05-13",162,145]
[null,"2018-05-14",211,148]
[null,"2018-05-15",140,104]
[null,"2018-05-16",176,133]
[null,"2018-05-17",105,90]
[null,{"$f":"B335+1","v":"2018-05-18"},107,99]
[null,"2018-05-19",205,160]
[null,"2018-05-20",85,71]
[null,"2018-05-21",420,135]
[null,"2018-05-22",518,360]
[null,"2018-05-23",212,176]
[null,"2018-05-24",133,103]
[null,"2018-05-25",129,116]
[null,"2018-05-26",82,59]
[null,"2018-05-27",108,86]
[null,"2018-05-28",188,171]
[null,"2018-05-29",283,234]
[null,"2018-05-30",158,141]
[null,"2018-05-31",172,129]
[null,"2018-06-01",157,134]
[null,"2018-06-02",44,40]
[null,"2018-06-03",46,42]
[null,"2018-06-04",126,116]
[null,"2018-06-05",139,127]
[null,"2018-06-06",147,116]
[null,"2018-06-07",126,114]
[null,"2018-06-08",160,154]
[null,"2018-06-09",171,87]
[null,"2018-06-10",60,56]
[null,"2018-06-11",60,57]
[null,"2018-06-12",170,150]
[null,"2018-06-13",79,75]
[null,"2018-06-14",111,101]
[null,"2018-06-15",230,166]
[null,"2018-06-16",57,53]
[null,"2018-06-17",86,71]
[null,"2018-06-18",161,147]
[null,"2018-06-19",133,108]
[null,"2018-06-20",133,128]
[null,"2018-06-21",133,124]
[null,"2018-06-22",92,81]
[null,"2018-06-23",59,55]
[null,"2018-06-24",48,38]
[null,"2018-06-25",217,174]
[null,"2018-06-26",123,104]
[null,"2018-06-27",147,131]
[null,"2018-06-28",104,89]
[null,"2018-06-29",99,93]
[null,"2018-06-30",68,68]
[null,"2018-07-01"]

{"sheet":"6.8 STPIS Exclusions","index":12,"n_rows":998,"n_cols":12,"rows_kept":998,"cut":false,"hidden":false,"merged":[[9,11,10,11],[6,1,6,4],[9,6,9,8],[9,5,10,5],[9,4,10,4],[9,2,10,2],[9,3,10,3]]}
[null,{"$f":"IF(dms_DataQuality=\"backcast\",INDEX(dms_Worksheet_List,MATCH(dms_Model,dms_Model_List))&\" BACKCAST\",INDEX(dms_Worksheet_List,MATCH(dms_Model,dms_Model_List)))","v":"ANNUAL REPORTING STATEMENT"}]
[null,{"$f":"INDEX(dms_TradingNameFull_List,MATCH(dms_TradingName,dms_TradingName_List))","v":"TasNetworks (D)"}]
[null,{"$f":"CONCATENATE(\"Annual Reporting RIN Response \",IF(SUM(dms_SingleYear_Model)>0,CONCATENATE(CRY),CONCATENATE(FRCP_y1,\" to \",dms_MultiYear_FinalYear_Result)))","v":"Annual Reporting RIN Response 2017-18"}]
[null,"6.8 STPIS EXCLUSIONS"]
[]
[]
[null,"This information is collected to inform the application of the STPIS to Australian Distribution Co. in future regulatory periods. The information is also collected to monitor network performance, and may be used in performance reports."]
[]
[null,"6.8.1 - STPIS EXCLUSIONS"]
[null,"Date of event","Outage ID","Feeder ID / name","Feeder classification\n(drop down)","Cause of event\n(drop down)","Unplanned",null,null,"Event category","Effect on unplanned MAIFI","Please provide separate explanation to confirm the outage was not due to inadequate transmission connection planning "]
[null,"DD/MM/YYYY",null,null,null,null,"Number of  interruptions","Duration of interruption\n(mins)","Total unplanned minutes off supply","Use exclusion categories listed in section 3.3(a) of the STPIS\n(drop down)","by feeder classification"]
[null,"2017-07-01","J1706300018",80008,"Urban","Third Party",5,25,1.30497875494E-4,7]
[null,"2017-07-01","J1707010005",41517,"Urban","Third Party",1,5,2.6099575097999999E-5,7]
[null,"2017-07-01","J1707010011",91001,"High Density Rural","Third Party",1,1,2.2843567250999998E-5,7]
[null,"2017-07-02","J1707020002",91006,"Urban","Third Party",1,85,4.4369277668099998E-4,7]
[null,"2017-07-03","J1707030000",28231,"Urban","Third Party",1,34,1.7747711067199999E-4,7]
[null,"2017-07-03","J1707030026",56004,"Low Density Rural","Third Party",1,10,2.2548931180599999E-4,7]
[null,"2017-07-03","J1707030032",33274,"Urban","Third Party",19,190,9.9178385375800005E-4,7]
[null,"2017-07-03","J1707030062",33274,"Urban","Third Party",1,10,5.2199150196999999E-5,7]
[null,"2017-07-03","J1707030063",33274,"Urban","Third Party",1,10,5.2199150196999999E-5,7]
[null,"2017-07-03","J1707030064",33274,"Urban","Third Party",1,10,5.2199150196999999E-5,7]
[null,"2017-07-03","J1707030065",33274,"Urban","Third Party",1,10,5.2199150196999999E-5,7]
[null,"2017-07-03","J1707030066",33274,"Urban","Third Party",1,9,4.6979235177999998E-5,7]
[null,"2017-07-03","J1707030067",33274,"Urban","Third Party",1,8,4.1759320158000003E-5,7]
[null,"2017-07-03","J1707030068",33274,"Urban","Third Party",1,7,3.6539405138000002E-5,7]
[null,"2017-07-03","J1707030069",33274,"Urban","Third Party",1,6,3.1319490118000001E-5,7]
[null,"2017-07-03","J1707030070",33274,"Urban","Third Party",1,5,2.6099575097999999E-5,7]
[null,"2017-07-03","J1707030071",33274,"Urban","Third Party",1,3,1.5659745059E-5,7]
[null,"2017-07-03","J1707030072",33274,"Urban","Third Party",1,2,1.0439830039000001E-5,7]
[null,"2017-07-03","J1707030073",33274,"Urban","Third Party",1,1,5.2199150190000002E-6,7]
[null,"2017-07-03","J1707030074",33274,"Urban","Third Party",1,9,4.6979235177999998E-5,7]
[null,"2017-07-03","J1707030076",33274,"Urban","Third Party",1,8,4.1759320158000003E-5,7]
[null,"2017-07-03","J1707030077",33274,"Urban","Third Party",1,5,2.6099575097999999E-5,7]
[null,"2017-07-03","J1707030078",33274,"Urban","Third Party",1,4,2.0879660079000002E-5,7]
[null,"2017-07-03","J1707030079",33274,"Urban","Third Party",1,3,1.5659745059E-5,7]
[null,"2017-07-03","J1707030080",33274,"Urban","Third Party",1,10,5.2199150196999999E-5,7]
[null,"2017-07-03","J1707030082",91012,"Low Density Rural","Third Party",1,12,2.7058717416700003E-4,7]
[null,"2017-07-03","J1707030083",53003,"Urban","Third Party",1,242,1.2632194347869999E-3,7]
[null,"2017-07-03","J1707030084",33274,"Urban","Third Party",1,10,5.2199150196999999E-5,7]
[null,"2017-07-03","J1707030100",82003,"Urban","Third Party",1,64,3.34074561266E-4,7]
[null,"2017-07-06","J1707060012",31010,"Low Density Rural","Third Party",1,411,9.2676107152520008E-3,7]
[null,"2017-07-06","J1707060026",33271,"Low Density Rural","Third Party",1,10,2.2548931180599999E-4,7]
[null,"2017-07-07","J1707070007",20552,"Urban","Third Party",1,25,1.30497875494E-4,7]
[null,"2017-07-08","J1707080002",66102,"Urban","Third Party",1,87,4.5413260672099999E-4,7]
[null,"2017-07-08","J1707080006",28231,"Urban","Third Party",1,58,3.02755071147E-4,7]
[null,"2017-07-08","J1707080027",33276,"Low Density Rural","Third Party",1,10,2.2548931180599999E-4,7]
[null,"2017-07-10","J1707100005",57006,"Low Density Rural","Third Party",1,240,5.4117434833579996E-3,7]
[null,"2017-07-10","J1707100012",17104,"Urban","Third Party",1,10,5.2199150196999999E-5,7]
[null,"2017-07-10","J1707100045",48184,"Urban","Third Party",1,76,3.9671354150299997E-4,7]
[null,"2017-07-11","J1707110019",48185,"Low Density Rural","Third Party",1,10,2.2548931180599999E-4,7]
[null,"2017-07-12","J1707120041",66102,"Urban","Third Party",1,103,5.3765124703700001E-4,7]
[null,"2017-07-12","J1707120049",80008,"Urban","Third Party",1,10,5.2199150196999999E-5,7]
[null,"2017-07-12","J1707120076",62006,"Urban","Third Party",1,10,5.2199150196999999E-5,7]
[null,"2017-07-13","J1707130001",99981,"High Density Rural","Third Party",1,5,1.14217836257E-4,7]
[null,"2017-07-13","J1707130013",20553,"Urban","Third Party",1,10,5.2199150196999999E-5,7]
[null,"2017-07-13","J1707130025",48184,"Urban","Third Party",1,30,1.56597450593E-4,7]
[null,"2017-07-13","J1707130043",39565,"Urban","Third Party",1,70,3.6539405138399998E-4,7]
[null,"2017-07-13","J1707130071",80003,"High Density Rural","Third Party",1,46,1.0508040935670001E-3,7]
[null,"2017-07-14","J1707140022",41518,"Urban","Third Party",1,10,5.2199150196999999E-5,7]
[null,"2017-07-14","J1707140037",61037,"Urban","Third Party",1,208,1.085742324114E-3,7]
[null,"2017-07-14","J1707140038",31007,"Low Density Rural","Third Party",1,10,2.2548931180599999E-4,7]
[null,"2017-07-14","J1707140047",13049,"Urban","Third Party",1,93,4.8545209683900002E-4,7]
[null,"2017-07-15","J1707150011",82005,"Urban","Third Party",1,174,9.0826521344199997E-4,7]
[null,"2017-07-15","J1707150025",18146,"Urban","Third Party",1,10,5.2199150196999999E-5,7]
[null,"2017-07-16","J1707160012",91007,"Urban","Third Party",1,99,5.1677158695799996E-4,7]
[null,"2017-07-16","J1707160018",39565,"High Density Rural","Third Party",1,17,3.8834064327400002E-4,7]
[null,"2017-07-16","J1707160029",91008,"Urban","Third Party",1,173,9.03045298422E-4,7]
[null,"2017-07-16","J1707160033",93005,"High Density Rural","Third Party",1,16,3.6549707602300002E-4,7]
[null,"2017-07-17","J1707170010",27176,"High Density Commercial","Third Party",1,88,1.9510032147212E-2,7]
[null,"2017-07-17","J1707170032",54005,"Low Density Rural","Third Party",1,124,2.7960674664020001E-3,7]
[null,"2017-07-17","J1707170055",53003,"Low Density Rural","Third Party",1,178,4.0137097501569997E-3,7]
[null,"2017-07-17","J1707170059",20553,"Urban","Third Party",1,983,5.1311764644470003E-3,7]
[null,"2017-07-18","J1707180018",31010,"High Density Rural","Third Party",1,10,2.28435672514E-4,7]
[null,"2017-07-18","J1707180023",57006,"Low Density Rural","Third Party",1,197,4.4421394425899997E-3,7]
[null,"2017-07-18","J1707180043",22325,"Urban","Third Party",1,10,5.2199150196999999E-5,7]
[null,"2017-07-19","J1707190022",48182,"High Density Rural","Third Party",1,10,2.28435672514E-4,7]
[null,"2017-07-19","J1707190028",23341,"Urban","Third Party",1,70,3.6539405138399998E-4,7]
[null,"2017-07-19","J1707190029",91012,"High Density Rural","Third Party",1,10,2.28435672514E-4,7]
[null,"2017-07-20","J1707200002",97002,"Urban","Third Party",1,132,6.8902878261100004E-4,7]
[null,"2017-07-20","J1707200014",53010,"Low Density Rural","Third Party",1,10,2.2548931180599999E-4,7]
[null,"2017-07-21","J1707210031",30603,"High Density Rural","Third Party",1,175,3.9976242690049997E-3,7]
[null,"2017-07-22","J1707220008",35011,"Low Density Rural","Third Party",1,146,3.2921439523760001E-3,7]
[null,"2017-07-22","J1707220016",85006,"Low Density Rural","Third Party",1,186,4.1941011996030004E-3,7]
[null,"2017-07-23","J1707230028",54005,"Low Density Rural","Third Party",1,91,2.0519527374399998E-3,7]
[null,"2017-07-23","J1707230029",91002,"Low Density Rural","Third Party",1,62,1.398033733201E-3,7]
[null,"2017-07-24","J1707240025",82008,"High Density Rural","Third Party",1,5,1.14217836257E-4,7]
[null,"2017-07-24","J1707240030",21087,"Urban","Third Party",1,10,5.2199150196999999E-5,7]
[null,"2017-07-25","J1707250001",18146,"Urban","Third Party",1,15,7.8298725296000005E-5,7]
[null,"2017-07-25","J1707250016",23343,"High Density Commercial","Third Party",1,5,1.108524553818E-3,7]
[null,"2017-07-25","J1707250019",17104,"Urban","Third Party",1,5,2.6099575097999999E-5,7]
[null,"2017-07-25","J1707250034",93002,"Low Density Rural","Third Party",1,43,9.6960404076799997E-4,7]
[null,"2017-07-26","J1707260037",67082,"Urban","Third Party",1,10,5.2199150196999999E-5,7]
[null,"2017-07-26","WASP0353034",33271,"High Density Rural","Third Party",21,63,1.439144736842E-3,5]
[null,"2017-07-26","WASP0353034",33271,"Low Density Rural","Third Party",970,2910,6.5617389735726006E-2,5]
[null,"2017-07-26","WASP0353034",33271,"Urban","Third Party",481,1443,7.5323373735469998E-3,5]
[null,"2017-07-26","WASP0353034",33272,"High Density Rural","Third Party",829,2487,5.6811951754384998E-2,5]
[null,"2017-07-26","WASP0353034",33272,"Low Density Rural","Third Party",189,567,1.2785243979435E-2,5]
[null,"2017-07-26","WASP0353034",33272,"Urban","Third Party",419,1257,6.561433179867E-3,5]
[null,"2017-07-26","WASP0353034",33273,"Urban","Third Party",1,3,1.5659745059E-5,5]
[null,"2017-07-26","WASP0353034",33274,"High Density Rural","Third Party",8,24,5.4824561403499998E-4,5]
[null,"2017-07-26","WASP0353034",33274,"Urban","Third Party",846,2538,1.3248144320210001E-2,5]
[null,"2017-07-27","J1707270016",62004,"Urban","Third Party",1,26,1.3571779051400001E-4,7]
[null,"2017-07-28","J1707280012",40002,"Low Density Rural","Third Party",1,46,1.03725083431E-3,7]
[null,"2017-07-28","J1707280014",80003,"High Density Rural","Third Party",1,76,1.736111111111E-3,7]
[null,"2017-07-28","J1707280022",13045,"Urban","Third Party",1,202,1.054422833996E-3,7]
[null,"2017-07-29","J1707290009",31007,"Low Density Rural","Third Party",1,163,3.6754757824470001E-3,7]
[null,"2017-07-30","J1707300013",32379,"Urban","Third Party",1,20,1.04398300395E-4,7]
[null,"2017-07-30","J1707300021",82002,"Urban","Third Party",1,81,4.2281311660199999E-4,7]
[null,"2017-07-31","J1707310023",39571,"Low Density Rural","Third Party",1,5,1.1274465590299999E-4,7]
[null,"2017-07-31","J1707310035",41517,"Urban","Third Party",1,10,5.2199150196999999E-5,7]
[null,"2017-07-31","J1707310036",30603,"High Density Rural","Third Party",1,5,1.14217836257E-4,7]
[null,"2017-08-01","J1708010021",48192,"Urban","Third Party",1,5,2.6099575097999999E-5,7]
[null,"2017-08-01","J1708010055",20545,"Urban","Third Party",1,87,4.5413260672099999E-4,7]
[null,"2017-08-01","J1708010066",41518,"Urban","Third Party",1,72,3.7583388142399998E-4,7]
[null,"2017-08-02","J1708020020",41517,"Urban","Third Party",1,143,7.4644784782899995E-4,7]
[null,"2017-08-02","J1708020042",61043,"Urban","Third Party",2,200,1.0439830039560001E-3,7]
[null,"2017-08-03","J1708030010",20554,"Urban","Third Party",1,120,6.2638980237400001E-4,7]
[null,"2017-08-03","J1708030012",54005,"Low Density Rural","Third Party",1,229,5.1637052403710002E-3,7]
[null,"2017-08-03","J1708030041",22329,"Urban","Third Party",1,5,2.6099575097999999E-5,7]
[null,"2017-08-04","J1708040011",18131,"Urban","Third Party",1,80,4.1759320158200002E-4,7]
[null,"2017-08-04","J1708040025",80005,"Urban","Third Party",1,10,5.2199150196999999E-5,7]
[null,"2017-08-04","J1708040026",85008,"Urban","Third Party",1,373,1.947028302379E-3,7]
[null,"2017-08-04","J1708040030",41514,"High Density Rural","Third Party",1,5,1.14217836257E-4,7]
[null,"2017-08-04","J1708040034",40002,"Low Density Rural","Third Party",1,16,3.6078289889000001E-4,7]
[null,"2017-08-05","J1708050007",29490,"Urban","Third Party",1,10,5.2199150196999999E-5,7]
[null,"2017-08-05","J1708050012",85006,"High Density Rural","Third Party",158,3634,8.3013523391812005E-2,7]
[null,"2017-08-05","J1708050012",85006,"Low Density Rural","Third Party",701,31151,0.70242175520880301,7]
[null,"2017-08-07","J1708070001",56004,"Low Density Rural","Third Party",1,10,2.2548931180599999E-4,7]
[null,"2017-08-07","J1708070035",53003,"Urban","Third Party",1,176,9.1870504348099996E-4,7]
[null,"2017-08-07","J1708070037",20535,"Urban","Third Party",1,30,1.56597450593E-4,7]
[null,"2017-08-08","J1708080014",17103,"Urban","Third Party",1,126,6.5770929249200005E-4,7]
[null,"2017-08-08","J1708080025",55002,"Low Density Rural","Third Party",1,7,1.5784251826399999E-4,7]
[null,"2017-08-08","J1708080033",35010,"Urban","Third Party",1,58,3.02755071147E-4,7]
[null,"2017-08-09","J1708090003",30603,"Urban","Third Party",1,10,5.2199150196999999E-5,7]
[null,"2017-08-09","J1708090017",20553,"Low Density Rural","Third Party",1,5,1.1274465590299999E-4,7]
[null,"2017-08-09","J1708090026",85002,"Low Density Rural","Third Party",4,764,1.7227383422025001E-2,7]
[null,"2017-08-09","J1708090031",45003,"Low Density Rural","Third Party",1,193,4.3519437178669998E-3,7]
[null,"2017-08-10","J1708100012",21088,"Urban","Third Party",1,15,7.8298725296000005E-5,7]
[null,"2017-08-10","J1708100013",20534,"Urban","Third Party",1,131,6.8380886759099996E-4,7]
[null,"2017-08-10","J1708100018",91008,"Urban","Third Party",1,101,5.2721141699800002E-4,7]
[null,"2017-08-10","J1708100031",85006,"Urban","Third Party",1,5,2.6099575097999999E-5,7]
[null,"2017-08-10","J1708100032",23347,"Urban","Third Party",1,109,5.68970737156E-4,7]
[null,"2017-08-11","J1708110003",55003,"Low Density Rural","Third Party",1,7429.9832999999999,0.16753818210516799,7]
[null,"2017-08-11","J1708110010",56004,"Low Density Rural","Third Party",1,222,5.0058627221059998E-3,7]
[null,"2017-08-11","J1708110027",39571,"Low Density Rural","Third Party",1,154,3.4725354018210002E-3,7]
[null,"2017-08-11","J1708110043",34251,"High Density Rural","Third Party",1,5,1.14217836257E-4,7]
[null,"2017-08-11","J1708110061",66105,"Urban","Third Party",1,100,5.2199150197800004E-4,7]
[null,"2017-08-11","J1708120276",91006,"Urban","Third Party",1,1227,6.4048357292739999E-3,7]
[null,"2017-08-12","J1708120069",85004,"High Density Rural","Third Party",1,10,2.28435672514E-4,7]
[null,"2017-08-12","J1708120136",91008,"Urban","Third Party",1,10,5.2199150196999999E-5,7]
[null,"2017-08-12","J1708120158",80005,"Urban","Third Party",1,1534,8.0073496403469998E-3,7]
[null,"2017-08-12","J1708120172",66101,"Urban","Third Party",1,5,2.6099575097999999E-5,7]
[null,"2017-08-12","J1708120182",57006,"Low Density Rural","Third Party",1,655,1.4769549923333E-2,7]
[null,"2017-08-12","J1708120214",91006,"Urban","Third Party",1,112,5.8463048221499996E-4,7]
[null,"2017-08-12","J1708120228",28223,"Urban","Third Party",1,121,6.3160971739300003E-4,7]
[null,"2017-08-12","J1708120235",21088,"Urban","Third Party",1,10,5.2199150196999999E-5,7]
[null,"2017-08-12","J1708120246",91006,"Urban","Third Party",1,16,8.3518640316000006E-5,7]
[null,"2017-08-12","J1708120263",80008,"Urban","Third Party",1,587,3.0640901166119998E-3,7]
[null,"2017-08-12","J1708120272",91006,"Urban","Third Party",1,95,4.9589192687900002E-4,7]
[null,"2017-08-13","J1708120251",91011,"Urban","Third Party",1,10,5.2199150196999999E-5,7]
[null,"2017-08-13","J1708130014",91012,"High Density Rural","Third Party",1,197,4.500182748538E-3,7]
[null,"2017-08-13","J1708130015",93002,"Low Density Rural","Third Party",1,10,2.2548931180599999E-4,7]
[null,"2017-08-13","J1708130056",80006,"High Density Rural","Third Party",1,10,2.28435672514E-4,7]
[null,"2017-08-14","J1708140007",85002,"Low Density Rural","Third Party",1,5,1.1274465590299999E-4,7]
[null,"2017-08-14","J1708140023",80006,"Urban","Third Party",1,87,4.5413260672099999E-4,7]
[null,"2017-08-14","J1708140059",62009,"Urban","Third Party",1,10,5.2199150196999999E-5,7]
[null,"2017-08-14","J1708140062",34262,"Urban","Third Party",9,621,3.2415672272850002E-3,7]
[null,"2017-08-14","J1708140072",85004,"High Density Rural","Third Party",1,50,1.142178362573E-3,7]
[null,"2017-08-15","J1708150008",55001,"High Density Rural","Third Party",1,226,5.1626461988300001E-3,7]
[null,"2017-08-15","J1708150020",31008,"Low Density Rural","Third Party",1,187,4.2166501307829996E-3,7]
[null,"2017-08-15","J1708150024",23342,"Urban","Third Party",1,10,5.2199150196999999E-5,7]
[null,"2017-08-15","J1708150025",41515,"High Density Rural","Third Party",1,121,2.7640716374259999E-3,7]
[null,"2017-08-15","J1708150039",61023,"Low Density Rural","Third Party",1,8,1.80391449445E-4,7]
[null,"2017-08-16","J1708160004",65067,"Low Density Rural","Third Party",1,505,1.1387210246234E-2,7]
[null,"2017-08-16","J1708160012",91002,"High Density Rural","Third Party",1,90,2.0559210526309999E-3,7]
[null,"2017-08-16","J1708160016",31007,"High Density Rural","Third Party",1,139,3.175255847953E-3,7]
[null,"2017-08-16","J1708160043",65067,"Low Density Rural","Third Party",1,128,2.8862631911239999E-3,7]
[null,"2017-08-16","J1708160056",94002,"High Density Rural","Third Party",1,10,2.28435672514E-4,7]
[null,"2017-08-17","J1708170006",61041,"Urban","Third Party",1,91,4.7501226679999998E-4,7]
[null,"2017-08-17","J1708170056",34256,"Urban","Third Party",1,29,1.51377535573E-4,7]
[null,"2017-08-17","J1708170058",67084,"High Density Rural","Third Party",1,136,3.1067251461980002E-3,7]
[null,"2017-08-18","J1708180022",91004,"High Density Rural","Third Party",1,5,1.14217836257E-4,7]
[null,"2017-08-18","J1708180029",28221,"Urban","Third Party",1,125,6.5248937747199997E-4,7]
[null,"2017-08-19","J1708190013",99981,"High Density Rural","Third Party",1,70,1.599049707602E-3,7]
[null,"2017-08-21","J1708210035",57004,"Low Density Rural","Third Party",30,4440,0.10011725444213899,7]
[null,"2017-08-22","J1708220005",34264,"High Density Rural","Third Party",1,10,2.28435672514E-4,7]
[null,"2017-08-22","J1708220033",56003,"Low Density Rural","Third Party",1,10,2.2548931180599999E-4,7]
[null,"2017-08-23","J1708230022",91002,"High Density Rural","Third Party",1,10,2.28435672514E-4,7]
[null,"2017-08-23","J1708230032",53009,"Urban","Third Party",1,10,5.2199150196999999E-5,7]
[null,"2017-08-24","J1708240021",54005,"High Density Rural","Third Party",11,660,1.5076754385964E-2,7]
[null,"2017-08-25","J1708250000",34263,"Urban","Third Party",1,60,3.1319490118700001E-4,7]
[null,"2017-08-25","J1708250005",62010,"Urban","Third Party",1,10,5.2199150196999999E-5,7]
[null,"2017-08-25","J1708250020",91001,"High Density Rural","Third Party",1,109,2.4899488304089999E-3,7]
[null,"2017-08-25","J1708250027",20547,"Urban","Third Party",1,43,2.2445634585E-4,7]
[null,"2017-08-25","J1708250046",82006,"Urban","Third Party",1,5,2.6099575097999999E-5,7]
[null,"2017-08-26","J1708260004",43507,"Low Density Rural","Third Party",1,214,4.8254712726610001E-3,7]
[null,"2017-08-26","J1708260007",30605,"High Density Rural","Third Party",1,5,1.14217836257E-4,7]
[null,"2017-08-26","J1708260008",91010,"Urban","Third Party",1,10,5.2199150196999999E-5,7]
[null,"2017-08-26","J1708260009",61023,"Low Density Rural","Third Party",15,1125,2.5367547578243999E-2,7]
[null,"2017-08-26","J1708260010",33272,"High Density Rural","Third Party",1,199,4.5458698830399998E-3,7]
[null,"2017-08-26","J1708260022",82008,"Urban","Third Party",1,108,5.6375082213600003E-4,7]
[null,"2017-08-27","J1708270022",91011,"Low Density Rural","Third Party",1,135,3.0441057093889999E-3,7]
[null,"2017-08-27","J1708270024",29483,"Urban","Third Party",1,5,2.6099575097999999E-5,7]
[null,"2017-08-28","J1708280014",57004,"High Density Rural","Third Party",1,106,2.421418128654E-3,7]
[null,"2017-08-28","J1708280031",85003,"Low Density Rural","Third Party",1,10,2.2548931180599999E-4,7]
[null,"2017-08-28","J1708280035",41515,"High Density Rural","Third Party",1,10,2.28435672514E-4,7]
[null,"2017-08-29","J1708290004",33271,"Low Density Rural","Third Party",1,237,5.3440966898159999E-3,7]
[null,"2017-08-29","J1708290019",81001,"Urban","Third Party",1,10,5.2199150196999999E-5,7]
[null,"2017-08-30","J1708300006",40002,"Low Density Rural","Third Party",1,74,1.668620907368E-3,7]
[null,"2017-08-30","J1708300025",23343,"Urban","Third Party",1,57,2.9753515612699998E-4,7]
[null,"2017-08-30","J1708300048",80007,"Urban","Third Party",1,70,3.6539405138399998E-4,7]
[null,"2017-08-31","J1708310020",82003,"Urban","Third Party",1,112,5.8463048221499996E-4,7]
[null,"2017-09-01","J1709010000",22326,"Urban","Third Party",1,5,2.6099575097999999E-5,7]
[null,"2017-09-01","J1709010009",94002,"Low Density Rural","Third Party",1,289,6.5166411112109997E-3,7]
[null,"2017-09-02","J1709010026",41518,"Urban","Third Party",1,5,2.6099575097999999E-5,7]
[null,"2017-09-03","J1709030015",48182,"High Density Rural","Third Party",1,5,1.14217836257E-4,7]
[null,"2017-09-03","J1709030022",41518,"High Density Rural","Third Party",1,10,2.28435672514E-4,7]
[null,"2017-09-03","J1709030028",41517,"Urban","Third Party",1,139,7.2556818774900005E-4,7]
[null,"2017-09-04","J1709040018",23343,"Urban","Third Party",1,10,5.2199150196999999E-5,7]
[null,"2017-09-04","J1709040029",62004,"Urban","Third Party",1,10,5.2199150196999999E-5,7]
[null,"2017-09-04","J1709040045",62004,"Urban","Third Party",1,10,5.2199150196999999E-5,7]
[null,"2017-09-04","J1709040064",20549,"Urban","Third Party",11,880,4.5935252174089999E-3,7]
[null,"2017-09-04","J1709040071",41518,"Urban","Third Party",1,99,5.1677158695799996E-4,7]
[null,"2017-09-05","J1709040058",62004,"Urban","Third Party",1,60,3.1319490118700001E-4,7]
[null,"2017-09-05","J1709040059",62004,"Urban","Third Party",1,60,3.1319490118700001E-4,7]
[null,"2017-09-05","J1709050072",31008,"Low Density Rural","Third Party",1,5,1.1274465590299999E-4,7]
[null,"2017-09-07","J1709070012",18135,"Urban","Third Party",1,10,5.2199150196999999E-5,7]
[null,"2017-09-07","J1709070013",18135,"Urban","Third Party",1,10,5.2199150196999999E-5,7]
[null,"2017-09-07","J1709070014",16091,"Urban","Third Party",1,417,2.1767045632490002E-3,7]
[null,"2017-09-07","J1709070079",33276,"Low Density Rural","Third Party",1,10,2.2548931180599999E-4,7]
[null,"2017-09-09","J1709090013",43507,"High Density Rural","Third Party",1,317,7.2414108187130004E-3,7]
[null,"2017-09-09","J1709090016",93003,"Urban","Third Party",1,97,5.0633175691800001E-4,7]
[null,"2017-09-09","J1709090017",91004,"Urban","Third Party",1,30,1.56597450593E-4,7]
[null,"2017-09-11","J1709110014",39565,"Urban","Third Party",1,10,5.2199150196999999E-5,7]
[null,"2017-09-11","J1709110016",20552,"Urban","Third Party",1,275,1.4354766304400001E-3,7]
[null,"2017-09-11","J1709110026",26167,"Urban","Third Party",1,138,7.2034827273000004E-4,7]
[null,"2017-09-11","J1709110047",82004,"High Density Rural","Third Party",1,121,2.7640716374259999E-3,7]
[null,"2017-09-12","J1709120014",43507,"Low Density Rural","Third Party",1,790,1.7813655632723E-2,7]
[null,"2017-09-12","J1709120043",91011,"High Density Rural","Third Party",1,169,3.8605628654970001E-3,7]
[null,"2017-09-13","J1709130030",53001,"High Density Rural","Third Party",1,42,9.5942982456100002E-4,7]
[null,"2017-09-13","J1709130033",28232,"High Density Rural","Third Party",1,256,5.8479532163739998E-3,7]
[null,"2017-09-13","J1709130064",65066,"Urban","Third Party",1,185,9.6568427865900003E-4,7]
[null,"2017-09-15","J1709150025",67082,"Urban","Third Party",1,144,7.5166776284799996E-4,7]
[null,"2017-09-15","J1709150030",67088,"Urban","Third Party",1,167,8.7172580830300001E-4,7]
[null,"2017-09-15","J1709150046",48182,"High Density Rural","Third Party",1,39,8.9089912280700004E-4,7]
[null,"2017-09-16","J1709160000",20549,"Urban","Third Party",1,10,5.2199150196999999E-5,7]
[null,"2017-09-16","J1709160001",33272,"High Density Rural","Third Party",1,364,8.3150584795319993E-3,7]
[null,"2017-09-17","J1709170000",20544,"Urban","Third Party",1,12,6.2638980237000001E-5,7]
[null,"2017-09-17","J1709170001",20544,"Urban","Third Party",1,10,5.2199150196999999E-5,7]
[null,"2017-09-17","J1709170020",98002,"Urban","Third Party",1,43,2.2445634585E-4,7]
[null,"2017-09-17","J1709170026",41517,"High Density Rural","Third Party",1,10,2.28435672514E-4,7]
[null,"2017-09-18","J1709180006",66106,"Urban","Third Party",1,10,5.2199150196999999E-5,7]
[null,"2017-09-18","J1709180020",53003,"Low Density Rural","Third Party",1,427,9.6283936141420001E-3,7]
[null,"2017-09-18","J1709190036",82007,"High Density Rural","Third Party",1,1151,2.6292945906432E-2,7]
[null,"2017-09-19","J1709190026",67086,"Urban","Third Party",1,77,4.01933456523E-4,7]
[null,"2017-09-19","J1709190064",82005,"Urban","Third Party",1,83,4.33252946642E-4,7]
[null,"2017-09-20","J1709200006",95001,"Low Density Rural","Third Party",1,10,2.2548931180599999E-4,7]
[null,"2017-09-20","J1709200008",30606,"High Density Rural","Third Party",1,10,2.28435672514E-4,7]
[null,"2017-09-20","J1709200019",94002,"Low Density Rural","Third Party",1,10,2.2548931180599999E-4,7]
[null,"2017-09-21","J1709210008",85003,"Low Density Rural","Third Party",1,10,2.2548931180599999E-4,7]
[null,"2017-09-21","J1709210070",65061,"Urban","Third Party",1,16,8.3518640316000006E-5,7]
[null,"2017-09-22","J1709220022",80009,"High Density Commercial","Third Party",1,136,3.0151867863873E-2,7]
[null,"2017-09-22","J1709220027",20535,"Urban","Third Party",1,166,8.6650589328399999E-4,7]
[null,"2017-09-22","J1709220034",53001,"High Density Rural","Third Party",1,10,2.28435672514E-4,7]
[null,"2017-09-23","J1709210043",66101,"Urban","Third Party",1,60,3.1319490118700001E-4,7]
[null,"2017-09-23","J1709230001",98001,"Low Density Rural","Third Party",62,310,6.990168666005E-3,5]
[null,"2017-09-23","J1709230001",98001,"Urban","Third Party",600,3000,1.5659745059349001E-2,5]
[null,"2017-09-23","J1709230001",98002,"Low Density Rural","Third Party",7,35,7.8921259132299997E-4,5]
[null,"2017-09-23","J1709230001",98002,"Urban","Third Party",827,4135,2.1584348606803999E-2,5]
[null,"2017-09-23","J1709230001",98003,"Low Density Rural","Third Party",32,160,3.607828988905E-3,5]
[null,"2017-09-23","J1709230001",98003,"Urban","Third Party",525,2625,1.3702276926931E-2,5]
[null,"2017-09-23","J1709230043",48184,"Urban","Third Party",1,89,4.6457243675999998E-4,7]
[null,"2017-09-23","J1709230059",85008,"Urban","Third Party",1,34,1.7747711067199999E-4,7]
[null,"2017-09-24","J1709240026",93005,"Low Density Rural","Third Party",1,134,3.0215567782080001E-3,7]
[null,"2017-09-24","J1709240046",16094,"Urban","Third Party",1,11,5.7419065217E-5,7]
[null,"2017-09-24","J1709250000",16094,"Urban","Third Party",1,10,5.2199150196999999E-5,7]
[null,"2017-09-25","J1709250030",22325,"Urban","Third Party",1,12,6.2638980237000001E-5,7]
[null,"2017-09-26","J1709260027",20537,"Urban","Third Party",1,96,5.01111841899E-4,7]
[null,"2017-09-26","J1709260047",20549,"Urban","Third Party",1,15,7.8298725296000005E-5,7]
[null,"2017-09-26","J1709260055",66105,"Urban","Third Party",1,74,3.8627371146300002E-4,7]
[null,"2017-09-27","J1709270000",91008,"Urban","Third Party",1,107,5.5853090711600005E-4,7]
[null,"2017-09-27","J1709270030",91004,"High Density Rural","Third Party",1,224,5.1169590643270002E-3,7]
[null,"2017-09-27","J1709270041",66106,"Urban","Third Party",1,77,4.01933456523E-4,7]
[null,"2017-09-27","J1709270051",21081,"Urban","Third Party",1,62,3.23634731226E-4,7]
[null,"2017-09-29","J1709290034",17107,"Urban","Third Party",1,20,1.04398300395E-4,7]
[null,"2017-09-30","J1709300008",94001,"Low Density Rural","Third Party",1,138,3.111752502931E-3,7]
[null,"2017-09-30","J1709300033",41515,"High Density Rural","Third Party",1,125,2.8554459064320001E-3,7]
[null,"2017-10-02","J1710020006",12019,"Urban","Third Party",1,147,7.6732750790799999E-4,7]
[null,"2017-10-02","J1710020046",41516,"Low Density Rural","Third Party",1,10,2.2548931180599999E-4,7]
[null,"2017-10-03","J1710030014",48182,"High Density Rural","Third Party",1,10,2.28435672514E-4,7]
[null,"2017-10-03","J1710030018",55002,"Low Density Rural","Third Party",1,1392,3.1388112203480999E-2,7]
[null,"2017-10-03","J1710030020",98002,"Urban","Third Party",1,5,2.6099575097999999E-5,7]
[null,"2017-10-03","J1710030028",21085,"Urban","Third Party",1,68,3.5495422134499999E-4,7]
[null,"2017-10-04","J1710040000",48183,"Urban","Third Party",1,42,2.1923643083E-4,7]
[null,"2017-10-04","J1710040023",27175,"Urban","Third Party",1,246,1.284099094866E-3,7]
[null,"2017-10-04","J1710040043",41518,"Low Density Rural","Third Party",1,17095.0167,0.38547435510056799,7]
[null,"2017-10-04","J1710040044",30608,"High Density Rural","Third Party",1,10,2.28435672514E-4,7]
[null,"2017-10-05","J1710050014",91007,"Urban","Third Party",1,10,5.2199150196999999E-5,7]
[null,"2017-10-05","J1710050029",91007,"Urban","Third Party",1,15,7.8298725296000005E-5,7]
[null,"2017-10-05","J1710050030",57004,"Low Density Rural","Third Party",1,10,2.2548931180599999E-4,7]
[null,"2017-10-07","J1710060057",23343,"Urban","Third Party",1,40,2.0879660079100001E-4,7]
[null,"2017-10-07","J1710070000",20536,"Urban","Third Party",1,5,2.6099575097999999E-5,7]
[null,"2017-10-07","J1710070002",93002,"Low Density Rural","Third Party",375,40944,0.92324343826102595,7]
[null,"2017-10-07","J1710070014",67082,"High Density Rural","Third Party",15,3645,8.3264802631577997E-2,7]
[null,"2017-10-07","J1710070014",67082,"Urban","Third Party",84,20676,0.107926962949043,7]
[null,"2017-10-07","J1710070021",43506,"High Density Rural","Third Party",1,10,2.28435672514E-4,7]
[null,"2017-10-08","J1710080023",43506,"High Density Rural","Third Party",1,10,2.28435672514E-4,7]
[null,"2017-10-09","J1710090006",67083,"Urban","Third Party",1,10,5.2199150196999999E-5,7]
[null,"2017-10-09","J1710090021",67084,"Low Density Rural","Third Party",1,10,2.2548931180599999E-4,7]
[null,"2017-10-09","J1710090038",14069,"Critical Infrastructure","Third Party",1,10,5.7142857142849996E-3,7]
[null,"2017-10-10","J1710100000",21081,"Urban","Third Party",1,5,2.6099575097999999E-5,7]
[null,"2017-10-10","J1710100002",27176,"High Density Commercial","Third Party",1,234,5.1878949118721998E-2,7]
[null,"2017-10-10","J1710100015",22325,"Urban","Third Party",1,271,1.4145969703610001E-3,7]
[null,"2017-10-11","J1710110031",62009,"Urban","Third Party",1,5,2.6099575097999999E-5,7]
[null,"2017-10-11","J1710110043",91008,"Urban","Third Party",1,10,5.2199150196999999E-5,7]
[null,"2017-10-11","J1710110056",28232,"High Density Rural","Third Party",1,10,2.28435672514E-4,7]
[null,"2017-10-12","J1710120025",28231,"Urban","Third Party",1,10,5.2199150196999999E-5,7]
[null,"2017-10-12","J1710120032",94001,"Low Density Rural","Third Party",1,5,1.1274465590299999E-4,7]
[null,"2017-10-12","J1710120080",61023,"Low Density Rural","Third Party",1,10,2.2548931180599999E-4,7]
[null,"2017-10-13","J1710130011",82001,"High Density Rural","Third Party",1,155,3.5407529239760002E-3,7]
[null,"2017-10-14","J1710140005",41515,"High Density Rural","Third Party",1,191,4.3631213450290003E-3,7]
[null,"2017-10-14","J1710140008",62005,"Urban","Third Party",1,10,5.2199150196999999E-5,7]
[null,"2017-10-14","J1710140015",53003,"Urban","Third Party",1,89,4.6457243675999998E-4,7]
[null,"2017-10-15","J1710150011",97002,"Low Density Rural","Third Party",1,61,1.3754848020200001E-3,7]
[null,"2017-10-16","J1710160000",33274,"Urban","Third Party",1,10,5.2199150196999999E-5,7]
[null,"2017-10-16","J1710160013",33272,"High Density Rural","Third Party",1,10,2.28435672514E-4,7]
[null,"2017-10-16","J1710160014",66106,"Urban","Third Party",1,10,5.2199150196999999E-5,7]
[null,"2017-10-16","J1710160043",93002,"Low Density Rural","Third Party",1,5,1.1274465590299999E-4,7]
[null,"2017-10-16","J1710160056",48191,"Urban","Third Party",1,93,4.8545209683900002E-4,7]
[null,"2017-10-16","J1710160058",85006,"Low Density Rural","Third Party",1,10,2.2548931180599999E-4,7]
[null,"2017-10-17","J1710170057",13057,"High Density Rural","Third Party",1,10,2.28435672514E-4,7]
[null,"2017-10-17","J1710170085",41516,"High Density Rural","Third Party",1,10,2.28435672514E-4,7]
[null,"2017-10-18","J1710180022",41518,"Urban","Third Party",1,10,5.2199150196999999E-5,7]
[null,"2017-10-18","J1710180025",27178,"Urban","Third Party",1,219,1.143161389332E-3,7]
[null,"2017-10-19","J1710190032",45001,"Low Density Rural","Third Party",1,10,2.2548931180599999E-4,7]
[null,"2017-10-19","J1710190039",39571,"Low Density Rural","Third Party",1,10,2.2548931180599999E-4,7]
[null,"2017-10-19","J1710190065",61029,"Urban","Third Party",1,5,2.6099575097999999E-5,7]
[null,"2017-10-19","J1710190078",85006,"High Density Rural","Third Party",1,5,1.14217836257E-4,7]
[null,"2017-10-20","J1710200017",91007,"Urban","Third Party",1,5,2.6099575097999999E-5,7]
[null,"2017-10-20","J1710200040",17107,"Urban","Third Party",1,5,2.6099575097999999E-5,7]
[null,"2017-10-21","J1710210002",91008,"Urban","Third Party",1,10,5.2199150196999999E-5,7]
[null,"2017-10-21","J1710210008",20544,"Urban","Third Party",1,61,3.1841481620600002E-4,7]
[null,"2017-10-21","J1710210023",80011,"Urban","Third Party",1,176,9.1870504348099996E-4,7]
[null,"2017-10-23","J1710230036",53009,"Low Density Rural","Third Party",1,10,2.2548931180599999E-4,7]
[null,"2017-10-24","J1710240017",23347,"Urban","Third Party",1,256,1.336298245064E-3,7]
[null,"2017-10-24","J1710240060",80004,"Urban","Third Party",1,10,5.2199150196999999E-5,7]
[null,"2017-10-25","J1710250002",48184,"Urban","Third Party",1,10,5.2199150196999999E-5,7]
[null,"2017-10-25","J1710250008",81002,"High Density Rural","Third Party",1,50,1.142178362573E-3,7]
[null,"2017-10-25","J1710250066",62005,"Urban","Third Party",1,65,3.3929447628500001E-4,7]
[null,"2017-10-26","J1710260029",80006,"High Density Rural","Third Party",1,10,2.28435672514E-4,7]
[null,"2017-10-27","J1710270079",91012,"Low Density Rural","Third Party",1,85,1.916659150356E-3,7]
[null,"2017-10-28","J1710280015",67091,"Urban","Third Party",1,2,1.0439830039000001E-5,7]
[null,"2017-10-28","J1710280017",66101,"Urban","Third Party",1,126,6.5770929249200005E-4,7]
[null,"2017-10-28","J1710280021",67085,"Urban","Third Party",1,10,5.2199150196999999E-5,7]
[null,"2017-10-29","J1710290017",62009,"Urban","Third Party",1,23,1.20058045455E-4,7]
[null,"2017-10-29","J1710290021",28232,"High Density Rural","Third Party",1,105,2.3985745614030001E-3,7]
[null,"2017-10-29","J1710290024",80007,"Urban","Third Party",1,28,1.4615762055299999E-4,7]
[null,"2017-10-29","J1710290026",41518,"Urban","Third Party",1,10,5.2199150196999999E-5,7]
[null,"2017-10-30","J1710300007",30608,"Low Density Rural","Third Party",1,10,2.2548931180599999E-4,7]
[null,"2017-10-30","J1710300027",98002,"Urban","Third Party",1,54,2.8187541106800001E-4,7]
[null,"2017-10-30","J1710300029",80005,"Urban","Third Party",1,34,1.7747711067199999E-4,7]
[null,"2017-10-30","J1710300057",91009,"Urban","Third Party",1,66,3.4451439130499999E-4,7]
[null,"2017-10-30","J1710300061",21086,"Urban","Third Party",1,130,6.7858895257099999E-4,7]
[null,"2017-10-30","J1710300062",80011,"Urban","Third Party",1,53,2.7665549604799998E-4,7]
[null,"2017-10-31","J1710310025",91006,"Urban","Third Party",1,10,5.2199150196999999E-5,7]
[null,"2017-10-31","J1710310032",65066,"Urban","Third Party",1,10,5.2199150196999999E-5,7]
[null,"2017-10-31","J1710310051",94001,"High Density Rural","Third Party",1,10,2.28435672514E-4,7]
[null,"2017-11-01","J1711010009",20535,"Urban","Third Party",1,10,5.2199150196999999E-5,7]
[null,"2017-11-01","J1711010015",43506,"High Density Rural","Third Party",1,142,3.2437865497070002E-3,7]
[null,"2017-11-02","J1711020051",48184,"Urban","Third Party",1,10,5.2199150196999999E-5,7]
[null,"2017-11-02","J1711020054",82002,"Urban","Third Party",1,10,5.2199150196999999E-5,7]
[null,"2017-11-02","J1711020082",28223,"Urban","Third Party",1,10,5.2199150196999999E-5,7]
[null,"2017-11-04","J1711040009",82004,"Low Density Rural","Third Party",1,5,1.1274465590299999E-4,7]
[null,"2017-11-05","J1711060017",91002,"High Density Rural","Third Party",1,5,1.14217836257E-4,7]
[null,"2017-11-06","J1711060009",28232,"High Density Rural","Third Party",1,160,3.6549707602329998E-3,7]
[null,"2017-11-06","J1711060020",33271,"Low Density Rural","Third Party",1,10,2.2548931180599999E-4,7]
[null,"2017-11-06","J1711060041",33271,"Urban","Third Party",1,5,2.6099575097999999E-5,7]
[null,"2017-11-07","J1711060051",29481,"Urban","Third Party",1,90,4.6979235178E-4,7]
[null,"2017-11-08","J1711080026",45003,"Low Density Rural","Third Party",1,10,2.2548931180599999E-4,7]
[null,"2017-11-08","J1711080042",82005,"Urban","Third Party",1,10,5.2199150196999999E-5,7]
[null,"2017-11-09","J1711090052",33272,"High Density Rural","Third Party",1,303,6.9216008771919996E-3,7]
[null,"2017-11-09","J1711090065",39565,"Urban","Third Party",1,132,6.8902878261100004E-4,7]
[null,"2017-11-10","J1711100076",67088,"Urban","Third Party",1,10,5.2199150196999999E-5,7]
[null,"2017-11-11","J1711110003",67090,"High Density Rural","Third Party",1,10,2.28435672514E-4,7]
[null,"2017-11-12","J1711120013",80010,"Urban","Third Party",1,189,9.8656393873899993E-4,7]
[null,"2017-11-12","J1711120022",28232,"High Density Rural","Third Party",1,102,2.3300438596489999E-3,7]
[null,"2017-11-12","J1711120028",65064,"Urban","Third Party",1,110,5.7419065217599998E-4,7]
[null,"2017-11-13","J1711130002",65064,"Urban","Third Party",1,377,1.9679079624580001E-3,7]
[null,"2017-11-13","J1711130052",66106,"Urban","Third Party",1,172,8.9782538340200003E-4,7]
[null,"2017-11-14","J1711140034",97001,"Urban","Third Party",1,10,5.2199150196999999E-5,7]
[null,"2017-11-14","J1711140062",53008,"Low Density Rural","Third Party",1,223,5.028411653287E-3,7]
[null,"2017-11-14","J1711140066",28228,"Urban","Third Party",1,147,7.6732750790799999E-4,7]
[null,"2017-11-14","J1711140070",31007,"Low Density Rural","Third Party",1,59,1.3303869396589999E-3,7]
[null,"2017-11-15","J1711150050",33271,"Low Density Rural","Third Party",1,10,2.2548931180599999E-4,7]
[null,"2017-11-16","J1711160031",53003,"Urban","Third Party",1,10,5.2199150196999999E-5,7]
[null,"2017-11-16","J1711160086",40003,"Low Density Rural","Third Party",1,10,2.2548931180599999E-4,7]
[null,"2017-11-17","J1711170042",34252,"Urban","Third Party",1,4,2.0879660079000002E-5,7]
[null,"2017-11-17","J1711170059",62005,"Urban","Third Party",1,155,8.0908682806599998E-4,7]
[null,"2017-11-17","J1711170068",91010,"Urban","Third Party",1,24,1.25277960474E-4,7]
[null,"2017-11-18","J1711180005",94002,"High Density Rural","Third Party",50,7050,0.16104714912280699,7]
[null,"2017-11-18","J1711180005",94002,"Low Density Rural","Third Party",135,67899,1.53104987823577,7]
[null,"2017-11-18","J1711180024",31007,"Low Density Rural","Third Party",1,10,2.2548931180599999E-4,7]
[null,"2017-11-19","J1711190011",65063,"Low Density Rural","Third Party",1,121,2.72842067286E-3,7]
[null,"2017-11-19","J1711190012",65064,"Urban","Third Party",1,200,1.0439830039560001E-3,7]
[null,"2017-11-20","J1711200054",20535,"Urban","Third Party",1,273,1.4250368003999999E-3,7]
[null,"2017-11-20","J1711200056",94001,"Low Density Rural","Third Party",1,79,1.781365563272E-3,7]
[null,"2017-11-20","J1711200057",94001,"Low Density Rural","Third Party",1,59,1.3303869396589999E-3,7]
[null,"2017-11-20","J1711200059",43506,"Low Density Rural","Third Party",1,276,6.223505005862E-3,7]
[null,"2017-11-20","J1711200067",62006,"Urban","Third Party",1,153,7.9864699802600003E-4,7]
[null,"2017-11-21","J1711200023",20547,"Urban","Third Party",1,10,5.2199150196999999E-5,7]
[null,"2017-11-21","J1711210000",57003,"Low Density Rural","Third Party",1,75,1.6911698385489999E-3,7]
[null,"2017-11-21","J1711210005",40002,"Low Density Rural","Third Party",1,10,2.2548931180599999E-4,7]
[null,"2017-11-21","J1711210039",17104,"Urban","Third Party",1,10,5.2199150196999999E-5,7]
[null,"2017-11-21","J1711210044",17103,"Urban","Third Party",1,10,5.2199150196999999E-5,7]
[null,"2017-11-21","J1711210049",17104,"Urban","Third Party",1,10,5.2199150196999999E-5,7]
[null,"2017-11-22","J1711220041",67082,"High Density Rural","Third Party",1,97,2.2158260233909998E-3,7]
[null,"2017-11-22","J1711220055",28223,"Urban","Third Party",1,299,1.560754590915E-3,7]
[null,"2017-11-22","J1711220058",53009,"Low Density Rural","Third Party",1,10,2.2548931180599999E-4,7]
[null,"2017-11-22","J1711220062",81002,"High Density Rural","Third Party",1,10,2.28435672514E-4,7]
[null,"2017-11-23","J1711230016",26165,"Urban","Third Party",1,10,5.2199150196999999E-5,7]
[null,"2017-11-23","J1711230047",48182,"Low Density Rural","Third Party",1,10,2.2548931180599999E-4,7]
[null,"2017-11-24","J1711240070",57003,"High Density Rural","Third Party",31,62,1.41630116959E-3,5]
[null,"2017-11-24","J1711240070",57003,"Low Density Rural","Third Party",515,1030,2.3225399116081E-2,5]
[null,"2017-11-24","J1711240070",57004,"High Density Rural","Third Party",1447,34728,0.79331140350877005,5]
[null,"2017-11-24","J1711240070",57004,"Low Density Rural","Third Party",623,13830,0.31185171822855501,5]
[null,"2017-11-24","J1711240070",57005,"High Density Rural","Third Party",153,306,6.9901315789469998E-3,5]
[null,"2017-11-24","J1711240070",57005,"Low Density Rural","Third Party",135,270,6.0882114187770005E-3,5]
[null,"2017-11-24","J1711240070",57006,"High Density Rural","Third Party",127,254,5.8022660818709999E-3,5]
[null,"2017-11-24","J1711240070",57006,"Low Density Rural","Third Party",1987,3974,8.9609452511950002E-2,5]
[null,"2017-11-24","J1711240070",57006,"Urban","Third Party",1100,2200,1.1483813043523E-2,5]
[null,"2017-11-25","J1711250024",91006,"Urban","Third Party",1,20,1.04398300395E-4,7]
[null,"2017-11-25","J1711250079",80002,"High Density Rural","Third Party",1,10,2.28435672514E-4,7]
[null,"2017-11-26","J1711250108",31008,"Low Density Rural","Third Party",1,15,3.3823396770900002E-4,7]
[null,"2017-11-26","J1711260017",82006,"Urban","Third Party",1,87,4.5413260672099999E-4,7]
[null,"2017-11-26","J1711260047",85006,"Urban","Third Party",1,18,9.3958470355999995E-5,7]
[null,"2017-11-26","J1711260055",62011,"Urban","Third Party",1,10,5.2199150196999999E-5,7]
[null,"2017-11-26","J1711260069",45002,"Low Density Rural","Third Party",1,10,2.2548931180599999E-4,7]
[null,"2017-11-27","J1711270018",28231,"Urban","Third Party",1,113,5.8985039723500005E-4,7]
[null,"2017-11-27","J1711270031",21081,"Urban","Third Party",1,61,3.1841481620600002E-4,7]
[null,"2017-11-27","J1711270041",28223,"Urban","Third Party",1,10,5.2199150196999999E-5,7]
[null,"2017-11-27","J1711270065",48183,"High Density Rural","Third Party",1,8,1.82748538011E-4,7]
[null,"2017-11-27","J1711270067",48183,"High Density Rural","Third Party",1,10,2.28435672514E-4,7]
[null,"2017-11-28","J1711270032",41516,"Low Density Rural","Third Party",1,10,2.2548931180599999E-4,7]
[null,"2017-11-28","J1711270078",40002,"Low Density Rural","Third Party",1,10,2.2548931180599999E-4,7]
[null,"2017-11-29","J1711290013",82003,"High Density Rural","Third Party",5,1220,2.7869152046782999E-2,7]
[null,"2017-11-29","J1711290013",82003,"Urban","Third Party",1,244,1.2736592648270001E-3,7]
[null,"2017-11-29","J1711290026",93001,"Low Density Rural","Third Party",1,5,1.1274465590299999E-4,7]
[null,"2017-11-29","J1711290027",35011,"Low Density Rural","Third Party",1,5,1.1274465590299999E-4,7]
[null,"2017-11-29","J1711290051",20548,"Urban","Third Party",1,107,5.5853090711600005E-4,7]
[null,"2017-11-29","J1711290061",80007,"Urban","Third Party",1,10,5.2199150196999999E-5,7]
[null,"2017-11-29","J1711290068",17107,"Urban","Third Party",1,134,6.9946861265000003E-4,7]
[null,"2017-11-30","J1711300047",22324,"Urban","Third Party",1,54,2.8187541106800001E-4,7]
[null,"2017-11-30","J1711300050",93002,"Low Density Rural","Third Party",1,5,1.1274465590299999E-4,7]
[null,"2017-12-01","J1712010022",54005,"High Density Rural","Third Party",1,91,2.0787646198829998E-3,7]
[null,"2017-12-01","J1712010046",20554,"Urban","Third Party",1,10,5.2199150196999999E-5,7]
[null,"2017-12-01","J1712010066",91004,"Urban","Third Party",1,86,4.4891269170100001E-4,7]
[null,"2017-12-01","J1712010072",91004,"Urban","Third Party",1,18,9.3958470355999995E-5,7]
[null,"2017-12-01","J1712010077",28231,"Urban","Third Party",1,66,3.4451439130499999E-4,7]
[null,"2017-12-02","J1712020043",30603,"High Density Rural","Third Party",1,10,2.28435672514E-4,7]
[null,"2017-12-02","J1712020053",20547,"Urban","Third Party",1,36,1.8791694071199999E-4,7]
[null,"2017-12-02","J1712020066",61023,"Low Density Rural","Third Party",1,49,1.1048976278520001E-3,7]
[null,"2017-12-03","J1712030080",49202,"Low Density Rural","Third Party",1,1,2.2548931179999999E-5,7]
[null,"2017-12-03","J1712030103",16096,"Urban","Third Party",1,1,5.2199150190000002E-6,7]
[null,"2017-12-03","J1712030146",82004,"High Density Rural","Third Party",1,5,1.14217836257E-4,7]
[null,"2017-12-03","J1712030178",67086,"Urban","Third Party",1,93,4.8545209683900002E-4,7]
[null,"2017-12-03","J1712030181",41516,"Low Density Rural","Third Party",1,10,2.2548931180599999E-4,7]
[null,"2017-12-04","J1712030175",28222,"High Density Rural","Third Party",1,10,2.28435672514E-4,7]
[null,"2017-12-04","J1712040010",65066,"Low Density Rural","Third Party",1,1566,3.5311626228916003E-2,7]
[null,"2017-12-04","J1712040027",93005,"Urban","Third Party",1,74,3.8627371146300002E-4,7]
[null,"2017-12-04","J1712040077",49202,"Low Density Rural","Third Party",1,10,2.2548931180599999E-4,7]
[null,"2017-12-05","J1712050006",49202,"Low Density Rural","Third Party",1,10,2.2548931180599999E-4,7]
[null,"2017-12-05","J1712050046",49202,"Low Density Rural","Third Party",1,10,2.2548931180599999E-4,7]
[null,"2017-12-05","J1712050051",49202,"Low Density Rural","Third Party",252,92736,2.0910976819698699,7]
[null,"2017-12-05","J1712050061",12017,"Urban","Third Party",1,104,5.4287116205699998E-4,7]
[null,"2017-12-06","J1712060068",61021,"Low Density Rural","Third Party",1,10,2.2548931180599999E-4,7]
[null,"2017-12-06","J1712060073",66105,"Urban","Third Party",77,308,1.6077338260930001E-3,7]
[null,"2017-12-06","J1712060082",61027,"Low Density Rural","Third Party",2,22,4.96076485974E-4,7]
[null,"2017-12-07","J1712070000",28221,"Urban","Third Party",1,1,5.2199150190000002E-6,7]
[null,"2017-12-07","J1712070001",91007,"Urban","Third Party",1,36,1.8791694071199999E-4,7]
[null,"2017-12-07","J1712070016",53003,"Urban","Third Party",1,10,5.2199150196999999E-5,7]
[null,"2017-12-07","J1712070078",20551,"Urban","Third Party",1,18,9.3958470355999995E-5,7]
[null,"2017-12-08","J1712060075",39571,"Low Density Rural","Third Party",12,720,1.6235230450076001E-2,7]
[null,"2017-12-08","J1712080042",85008,"Urban","Third Party",1,10,5.2199150196999999E-5,7]
[null,"2017-12-08","J1712080043",39571,"Low Density Rural","Third Party",1,181,4.0813565436990003E-3,7]
[null,"2017-12-08","J1712080098",20549,"Urban","Third Party",1,5,2.6099575097999999E-5,7]
[null,"2017-12-09","J1712090012",16098,"Urban","Third Party",1,10,5.2199150196999999E-5,7]
[null,"2017-12-09","J1712090018",21085,"Urban","Third Party",1,10,5.2199150196999999E-5,7]
[null,"2017-12-09","WASP0357663",61027,"Low Density Rural","Third Party",2,20,4.5097862361299999E-4,7]
[null,"2017-12-10","J1712100016",61028,"Urban","Third Party",1,10,5.2199150196999999E-5,7]
[null,"2017-12-11","J1712110023",18143,"Urban","Third Party",1,10,5.2199150196999999E-5,7]
[null,"2017-12-11","J1712110038",82001,"High Density Rural","Third Party",1,225,5.1398026315779997E-3,7]
[null,"2017-12-11","J1712110095",45002,"Low Density Rural","Third Party",6,1734,3.9099846667266999E-2,7]
[null,"2017-12-11","J1712110103",12030,"Urban","Third Party",1,10,5.2199150196999999E-5,7]
[null,"2017-12-11","J1712110105",12030,"Urban","Third Party",1,10,5.2199150196999999E-5,7]
[null,"2017-12-11","J1712110108",12030,"Urban","Third Party",1,10,5.2199150196999999E-5,7]
[null,"2017-12-11","J1712110111",12030,"Urban","Third Party",1,10,5.2199150196999999E-5,7]
[null,"2017-12-11","J1712120040",12030,"Urban","Third Party",1,10,5.2199150196999999E-5,7]
[null,"2017-12-11","J1712120041",12030,"Urban","Third Party",1,15,7.8298725296000005E-5,7]
[null,"2017-12-12","J1712120034",20548,"Urban","Third Party",1,111,5.7941056719499999E-4,7]
[null,"2017-12-12","J1712120044",22331,"Urban","Third Party",1,182,9.5002453359999996E-4,7]
[null,"2017-12-12","J1712120048",91009,"Urban","Third Party",1,130,6.7858895257099999E-4,7]
[null,"2017-12-12","J1712120069",39571,"Low Density Rural","Third Party",2,2036,4.5909623883827001E-2,7]
[null,"2017-12-13","J1712130079",41516,"Low Density Rural","Third Party",1,10,2.2548931180599999E-4,7]
[null,"2017-12-14","J1712080026",94001,"Low Density Rural","Third Party",1,10,2.2548931180599999E-4,7]
[null,"2017-12-14","J1712130083",94002,"High Density Rural","Third Party",1,10,2.28435672514E-4,7]
[null,"2017-12-14","J1712140018",93002,"High Density Rural","Third Party",1,5,1.14217836257E-4,7]
[null,"2017-12-15","J1712150056",12031,"Urban","Third Party",1,10,5.2199150196999999E-5,7]
[null,"2017-12-16","J1711300071",91003,"Urban","Third Party",1,160,8.35186403165E-4,7]
[null,"2017-12-16","J1712140028",41518,"Urban","Third Party",1,10,5.2199150196999999E-5,7]
[null,"2017-12-16","J1712150036",49202,"Low Density Rural","Third Party",1,10,2.2548931180599999E-4,7]
[null,"2017-12-16","J1712150054",21087,"Urban","Third Party",1,30,1.56597450593E-4,7]
[null,"2017-12-16","J1712160002",66107,"Urban","Third Party",1,10,5.2199150196999999E-5,7]
[null,"2017-12-16","J1712160003",93002,"High Density Rural","Third Party",1,75,1.713267543859E-3,7]
[null,"2017-12-16","J1712160020",91004,"High Density Rural","Third Party",1,160,3.6549707602329998E-3,7]
[null,"2017-12-17","J1712170023",56004,"Low Density Rural","Third Party",1,10,2.2548931180599999E-4,7]
[null,"2017-12-17","J1712170024",53004,"High Density Rural","Third Party",1,5,1.14217836257E-4,7]
[null,"2017-12-17","J1712170033",41517,"High Density Rural","Third Party",1,5,1.14217836257E-4,7]
[null,"2017-12-17","J1712170035",18143,"Urban","Third Party",18,1332,6.9529268063509998E-3,7]
[null,"2017-12-18","J1712150031",61028,"Urban","Third Party",1,206,1.0753024940750001E-3,7]
[null,"2017-12-18","J1712180000",81002,"High Density Rural","Third Party",1,5,1.14217836257E-4,7]
[null,"2017-12-18","J1712180023",13053,"Urban","Third Party",1,10,5.2199150196999999E-5,7]
[null,"2017-12-18","J1712180038",43506,"High Density Rural","Third Party",1,118,2.6955409356720001E-3,7]
[null,"2017-12-18","J1712180042",91012,"Low Density Rural","Third Party",1,10,2.2548931180599999E-4,7]
[null,"2017-12-18","J1712180069",16092,"Urban","Third Party",1,10,5.2199150196999999E-5,7]
[null,"2017-12-18","J1712180070",28232,"High Density Rural","Third Party",1,145,3.312317251461E-3,7]
[null,"2017-12-19","J1712130082",41516,"Low Density Rural","Third Party",2,20,4.5097862361299999E-4,7]
[null,"2017-12-19","J1712190003",13053,"Urban","Third Party",1,195,1.0178834288570001E-3,7]
[null,"2017-12-19","J1712190016",51004,"Low Density Rural","Third Party",1,10,2.2548931180599999E-4,7]
[null,"2017-12-19","J1712190034",41511,"Urban","Third Party",1,10,5.2199150196999999E-5,7]
[null,"2017-12-20","J1712200016",61025,"Urban","Third Party",1,181,9.4480461857999998E-4,7]
[null,"2017-12-20","J1712200026",41517,"High Density Rural","Third Party",1,455,1.0393823099415E-2,7]
[null,"2017-12-20","J1712200030",34264,"High Density Rural","Third Party",1,102,2.3300438596489999E-3,7]
[null,"2017-12-20","J1712200034",67087,"Urban","Third Party",1,10,5.2199150196999999E-5,7]
[null,"2017-12-21","J1712210000",31002,"Low Density Rural","Third Party",1,10,2.2548931180599999E-4,7]
[null,"2017-12-21","J1712210002",93001,"High Density Rural","Third Party",1,20,4.5687134502900002E-4,7]
[null,"2017-12-21","J1712210020",41516,"High Density Rural","Third Party",1,53,1.210709064327E-3,7]
[null,"2017-12-21","J1712210028",20537,"Urban","Third Party",1,10,5.2199150196999999E-5,7]
[null,"2017-12-21","J1712210029",93005,"Urban","Third Party",1,174,9.0826521344199997E-4,7]
[null,"2017-12-21","J1712210035",39565,"Urban","Third Party",1,10,5.2199150196999999E-5,7]
[null,"2017-12-21","J1712210036",56004,"Low Density Rural","Third Party",1,104,2.3450888427879999E-3,7]
[null,"2017-12-21","J1712210044",22331,"Urban","Third Party",1,20,1.04398300395E-4,7]
[null,"2017-12-21","J1712210056",85001,"Low Density Rural","Third Party",1,252,5.682330657526E-3,7]
[null,"2017-12-22","J1712220039",93002,"High Density Rural","Third Party",1,173,3.9519371345019998E-3,7]
[null,"2017-12-23","J1712230001",35011,"Low Density Rural","Third Party",1,10,2.2548931180599999E-4,7]
[null,"2017-12-23","J1712230022",35011,"Low Density Rural","Third Party",2,348,7.8470280508699999E-3,7]
[null,"2017-12-23","J1712230026",81003,"High Density Rural","Third Party",1,5,1.14217836257E-4,7]
[null,"2017-12-23","J1712230031",35011,"Low Density Rural","Third Party",1,45,1.014701903129E-3,7]
[null,"2017-12-23","J1712230034",82001,"High Density Rural","Third Party",1,211,4.8199926900579998E-3,7]
[null,"2017-12-24","J1712240008",13057,"High Density Rural","Third Party",1,10,2.28435672514E-4,7]
[null,"2017-12-24","J1712240012",35010,"Urban","Third Party",1,51,2.6621566600799998E-4,7]
[null,"2017-12-24","J1712240031",23347,"Urban","Third Party",1,5,2.6099575097999999E-5,7]
[null,"2017-12-26","J1712260005",39565,"Urban","Third Party",1,92,4.8023218182000001E-4,7]
[null,"2017-12-26","J1712260010",48185,"Low Density Rural","Third Party",1,39,8.7940831604499999E-4,7]
[null,"2017-12-26","J1712260012",94002,"Low Density Rural","Third Party",1,116,2.6156760169559999E-3,7]
[null,"2017-12-27","J1712270022",67091,"Urban","Third Party",1,66,3.4451439130499999E-4,7]
[null,"2017-12-27","J1712270027",98001,"Urban","Third Party",6,660,3.4451439130570001E-3,7]
[null,"2017-12-28","J1712280010",85008,"Low Density Rural","Third Party",1,278,6.2686028682240004E-3,7]
[null,"2017-12-28","J1712280016",32379,"Urban","Third Party",1,43,2.2445634585E-4,7]
[null,"2017-12-29","J1712290026",61041,"Urban","Third Party",1,46,2.4011609091E-4,7]
[null,"2017-12-29","J1712290044",17105,"Urban","Third Party",1,138,7.2034827273000004E-4,7]
[null,"2017-12-30","J1712300001",66106,"Urban","Third Party",1,44,2.2967626087E-4,7]
[null,"2017-12-31","J1712300003",66106,"Urban","Third Party",1,20,1.04398300395E-4,7]
[null,"2018-01-01","J1801010007",12037,"Urban","Third Party",1,10,5.2199150196999999E-5,7]
[null,"2018-01-01","J1801010018",82008,"Urban","Third Party",1,10,5.2199150196999999E-5,7]
[null,"2018-01-02","J1801020025",94001,"Low Density Rural","Third Party",1,235,5.2989988274550004E-3,7]
[null,"2018-01-02","J1801020050",32379,"Urban","Third Party",1,97,5.0633175691800001E-4,7]
[null,"2018-01-02","J1801020053",93002,"Low Density Rural","Third Party",1,104,2.3450888427879999E-3,7]
[null,"2018-01-03","J1801030020",82001,"High Density Rural","Third Party",1,10,2.28435672514E-4,7]
[null,"2018-01-03","J1801030021",82001,"High Density Rural","Third Party",1,10,2.28435672514E-4,7]
[null,"2018-01-04","J1801040023",57005,"High Density Rural","Third Party",1,67,1.5305190058469999E-3,7]
[null,"2018-01-04","J1801040032",98003,"Urban","Third Party",1,10,5.2199150196999999E-5,7]
[null,"2018-01-04","J1801040044",62005,"Urban","Third Party",1,129,6.7336903755199997E-4,7]
[null,"2018-01-05","J1801050013",65062,"Urban","Third Party",1,82,4.2803303162200002E-4,7]
[null,"2018-01-05","J1801050045",85003,"High Density Rural","Third Party",1,101,2.307200292397E-3,7]
[null,"2018-01-06","J1801060014",98001,"Urban","Third Party",1,86,4.4891269170100001E-4,7]
[null,"2018-01-07","J1801070010",57006,"Urban","Third Party",1,207,1.0805224090950001E-3,7]
[null,"2018-01-08","J1712130081",30608,"Low Density Rural","Third Party",1,5,1.1274465590299999E-4,7]
[null,"2018-01-08","J1801080039",16095,"Urban","Third Party",1,100,5.2199150197800004E-4,7]
[null,"2018-01-08","J1801080042",16092,"Urban","Third Party",1,123,6.4204954743299998E-4,7]
[null,"2018-01-08","J1801080070",61021,"Low Density Rural","Third Party",1,47,1.059799765491E-3,7]
[null,"2018-01-09","J1801090023",85006,"Low Density Rural","Third Party",1,10,2.2548931180599999E-4,7]
[null,"2018-01-09","J1801090046",30606,"High Density Rural","Third Party",1,10,2.28435672514E-4,7]
[null,"2018-01-10","J1801100000",28232,"High Density Rural","Third Party",1,5,1.14217836257E-4,7]
[null,"2018-01-10","J1801100028",16091,"Urban","Third Party",1,10,5.2199150196999999E-5,7]
[null,"2018-01-10","J1801100037",94001,"High Density Rural","Third Party",1,142,3.2437865497070002E-3,7]
[null,"2018-01-11","J1801110018",91012,"Low Density Rural","Third Party",1,39,8.7940831604499999E-4,7]
[null,"2018-01-11","J1801110046",99981,"High Density Rural","Third Party",212,19882,0.454175804093567,7]
[null,"2018-01-11","J1801110046",99981,"Low Density Rural","Third Party",6,1116,2.5164607197618E-2,7]
[null,"2018-01-12","J1801120019",67087,"Low Density Rural","Third Party",1,463,1.0440155136646E-2,7]
[null,"2018-01-12","J1801120058",80005,"Urban","Third Party",1,8,4.1759320158000003E-5,7]
[null,"2018-01-12","J1801120073",40002,"Low Density Rural","Third Party",1,106,2.3901867051499999E-3,7]
[null,"2018-01-12","J1801120089",45002,"Low Density Rural","Third Party",73,20079,0.452759989176513,7]
[null,"2018-01-13","J1801130016",43505,"High Density Rural","Third Party",1,16,3.6549707602300002E-4,5]
[null,"2018-01-13","J1801130016",43505,"Low Density Rural","Third Party",7,112,2.5254802922340001E-3,5]
[null,"2018-01-13","J1801130024",43506,"High Density Rural","Third Party",1479,23664,0.54057017543859598,5]
[null,"2018-01-13","J1801130024",43506,"Low Density Rural","Third Party",69,1104,2.4894020023450002E-2,5]
[null,"2018-01-13","J1801130024","NULL","Low Density Rural","Third Party",1,16,3.6078289889000001E-4,5]
[null,"2018-01-13","J1801130025",43507,"High Density Rural","Third Party",688,11008,0.251461988304093,5]
[null,"2018-01-13","J1801130025",43507,"Low Density Rural","Third Party",795,12720,0.286822404618021,5]
[null,"2018-01-14","J1801140007",61025,"Urban","Third Party",1,98,5.1155167193799999E-4,7]
[null,"2018-01-15","J1801150059",34259,"Urban","Third Party",1,10,5.2199150196999999E-5,7]
[null,"2018-01-15","J1801150063",67082,"Low Density Rural","Third Party",1,10,2.2548931180599999E-4,7]
[null,"2018-01-15","J1801150066",91007,"Urban","Third Party",1,10,5.2199150196999999E-5,7]
[null,"2018-01-16","J1801160009",43507,"Low Density Rural","Third Party",1,248,5.5921349328040002E-3,7]
[null,"2018-01-16","J1801160011",61028,"High Density Rural","Third Party",1,10,2.28435672514E-4,7]
[null,"2018-01-16","J1801160053",28221,"Urban","Third Party",1,57,2.9753515612699998E-4,7]
[null,"2018-01-17","J1801170046",41515,"High Density Rural","Third Party",1,141,3.2209429824559999E-3,7]
[null,"2018-01-17","J1801170053",23348,"Urban","Third Party",1,10,5.2199150196999999E-5,7]
[null,"2018-01-18","J1801160021",61023,"Low Density Rural","Third Party",1,10,2.2548931180599999E-4,7]
[null,"2018-01-18","J1801180035",31008,"Low Density Rural","Third Party",1,10,2.2548931180599999E-4,7]
[null,"2018-01-18","J1801180041",91009,"Urban","Third Party",1,5,2.6099575097999999E-5,7]
[null,"2018-01-18","J1801180049",33274,"High Density Rural","Third Party",1,5,1.14217836257E-4,7]
[null,"2018-01-19","J1801190000",56003,"Low Density Rural","Third Party",1,10,2.2548931180599999E-4,7]
[null,"2018-01-19","J1801190003",41518,"Urban","Third Party",1,10,5.2199150196999999E-5,7]
[null,"2018-01-19","J1801190049",91009,"Urban","Third Party",1,199,1.0387630889359999E-3,7]
[null,"2018-01-19","J1801190069",94002,"High Density Rural","Third Party",1,101,2.307200292397E-3,7]
[null,"2018-01-20","J1801200003",43507,"High Density Rural","Third Party",629,27676,0.63221856725146097,7]
[null,"2018-01-20","J1801200003",43507,"Low Density Rural","Third Party",784,72714,1.63962298187065,7]
[null,"2018-01-21","J1801210028",51003,"Low Density Rural","Third Party",1,10,2.2548931180599999E-4,7]
[null,"2018-01-21","J1801210043",20535,"Urban","Third Party",1,10,5.2199150196999999E-5,7]
[null,"2018-01-22","J1801220007",61040,"Urban","Third Party",1,5,2.6099575097999999E-5,7]
[null,"2018-01-22","J1801220008",93002,"High Density Rural","Third Party",1,5,1.14217836257E-4,7]
[null,"2018-01-22","J1801220018",91009,"Urban","Third Party",1,1605,8.3779636067519998E-3,7]
[null,"2018-01-22","J1801220026",35010,"Low Density Rural","Third Party",1,110,2.4803824298720001E-3,7]
[null,"2018-01-22","J1801220031",91006,"Urban","Third Party",1,85,4.4369277668099998E-4,7]
[null,"2018-01-22","J1801220037",21088,"Urban","Third Party",1,5,2.6099575097999999E-5,7]
[null,"2018-01-22","J1801220048",20549,"Urban","Third Party",1,3,1.5659745059E-5,7]
[null,"2018-01-23","J1801230022",12031,"High Density Rural","Third Party",1,55,1.2563961988299999E-3,7]
[null,"2018-01-23","J1801230026",91008,"Urban","Third Party",1,36,1.8791694071199999E-4,7]
[null,"2018-01-24","J1801240009",85003,"Low Density Rural","Third Party",3,30,6.76467935419E-4,7]
[null,"2018-01-24","J1801240043",41515,"High Density Rural","Third Party",1,147,3.3580043859639998E-3,7]
[null,"2018-01-25","J1801250010",28225,"Urban","Third Party",1,73,3.8105379644400001E-4,7]
[null,"2018-01-25","J1801250033",56003,"Low Density Rural","Third Party",1,150,3.382339677099E-3,7]
[null,"2018-01-25","J1801250036",34252,"Urban","Third Party",1,64,3.34074561266E-4,7]
[null,"2018-01-25","J1801250052",12019,"Urban","Third Party",1,5,2.6099575097999999E-5,7]
[null,"2018-01-25","J1801250060",56004,"High Density Rural","Third Party",1,5,1.14217836257E-4,7]
[null,"2018-01-26","J1801260022",20547,"Urban","Third Party",1,110,5.7419065217599998E-4,7]
[null,"2018-01-27","J1801270009",45002,"Low Density Rural","Third Party",1,61,1.3754848020200001E-3,7]
[null,"2018-01-27","J1801270012",57004,"High Density Rural","Third Party",1,10,2.28435672514E-4,7]
[null,"2018-01-28","J1801280006",57003,"Low Density Rural","Third Party",1,5,1.1274465590299999E-4,7]
[null,"2018-01-28","J1801280015",20549,"Urban","Third Party",1,37,1.9313685573100001E-4,7]
[null,"2018-01-28","J1801280022",39565,"Urban","Third Party",1,10,5.2199150196999999E-5,7]
[null,"2018-01-28","J1801280037",53003,"Low Density Rural","Third Party",1,70,1.5784251826459999E-3,7]
[null,"2018-01-29","J1801280021",41518,"Urban","Third Party",1,18,9.3958470355999995E-5,7]
[null,"2018-01-29","J1801290039",41515,"Low Density Rural","Third Party",1,10,2.2548931180599999E-4,7]
[null,"2018-01-29","J1801290047",33272,"High Density Rural","Third Party",1,78,1.7817982456140001E-3,7]
[null,"2018-01-29","J1801290054",13055,"Urban","Third Party",1,10,5.2199150196999999E-5,7]
[null,"2018-01-29","J1801290066",31010,"High Density Rural","Third Party",1,58,1.3249269005840001E-3,7]
[null,"2018-01-29","J1801290081",48190,"High Density Rural","Third Party",35,3955,9.0346308479531998E-2,7]
[null,"2018-01-29","J1801290081",48190,"Urban","Third Party",7,791,4.1289527806480002E-3,7]
[null,"2018-01-30","J1801300050",33274,"Low Density Rural","Third Party",1,10,2.2548931180599999E-4,7]
[null,"2018-01-30","J1801300052",17109,"Urban","Third Party",1,218,1.137941474312E-3,7]
[null,"2018-01-30","J1801300085",33274,"Low Density Rural","Third Party",1,10,2.2548931180599999E-4,7]
[null,"2018-01-31","J1801250056",12031,"Urban","Third Party",1,5,2.6099575097999999E-5,7]
[null,"2018-01-31","J1801310002",13057,"High Density Rural","Third Party",1,10,2.28435672514E-4,7]
[null,"2018-01-31","J1801310025",41518,"Urban","Third Party",1,5,2.6099575097999999E-5,7]
[null,"2018-02-01","J1802010002",85001,"Low Density Rural","Third Party",1,78,1.7588166320910001E-3,7]
[null,"2018-02-01","J1802010040",21087,"Urban","Third Party",1,10,5.2199150196999999E-5,7]
[null,"2018-02-01","J1802010051",85001,"Low Density Rural","Third Party",1,88,1.9843059438980001E-3,7]
[null,"2018-02-02","J1802020005",61043,"Urban","Third Party",1,10,5.2199150196999999E-5,7]
[null,"2018-02-02","J1802020017",66103,"Urban","Third Party",1,60,3.1319490118700001E-4,7]
[null,"2018-02-02","J1802020060",82007,"Low Density Rural","Third Party",1,119,2.683322810498E-3,7]
[null,"2018-02-03","J1802030003",39565,"High Density Rural","Third Party",1,115,2.6270102339179999E-3,7]
[null,"2018-02-03","J1802030028",22328,"Urban","Third Party",1,53,2.7665549604799998E-4,7]
[null,"2018-02-04","J1802040034",80002,"Urban","Third Party",1,90,4.6979235178E-4,7]
[null,"2018-02-04","J1802040035",81002,"High Density Rural","Third Party",1,10,2.28435672514E-4,7]
[null,"2018-02-05","J1802050035",34256,"Urban","Third Party",1,11,5.7419065217E-5,7]
[null,"2018-02-05","J1802050058",57003,"Low Density Rural","Third Party",1,173,3.9009650942540002E-3,7]
[null,"2018-02-05","J1802050068",67087,"Urban","Third Party",1,5,2.6099575097999999E-5,7]
[null,"2018-02-06","J1802060008",45003,"Low Density Rural","Third Party",1,10,2.2548931180599999E-4,7]
[null,"2018-02-06","J1802060014",28228,"Urban","Third Party",1,8,4.1759320158000003E-5,7]
[null,"2018-02-06","J1802060046",12017,"Urban","Third Party",1,233,1.2162401996090001E-3,7]
[null,"2018-02-07","J1802060069",48183,"Urban","Third Party",1,5,2.6099575097999999E-5,7]
[null,"2018-02-07","J1802070017",31010,"High Density Rural","Third Party",1,10,2.28435672514E-4,7]
[null,"2018-02-07","J1802070019",16096,"Urban","Third Party",1,32,1.67037280633E-4,7]
[null,"2018-02-07","J1802070037",91008,"Urban","Third Party",1,10,5.2199150196999999E-5,7]
[null,"2018-02-07","J1802070065",91008,"Urban","Third Party",1,40,2.0879660079100001E-4,7]
[null,"2018-02-08","J1802070066",66102,"Urban","Third Party",1,310,1.618173656132E-3,7]
[null,"2018-02-08","J1802080033",91008,"Urban","Third Party",1,94,4.9067201185900005E-4,7]
[null,"2018-02-08","J1802080054",85006,"Low Density Rural","Third Party",1,134,3.0215567782080001E-3,7]
[null,"2018-02-10","J1802100000",48185,"Low Density Rural","Third Party",1,40,9.0195724722599998E-4,7]
[null,"2018-02-10","J1802100006",48182,"Low Density Rural","Third Party",1,40,9.0195724722599998E-4,7]
[null,"2018-02-10","J1802100017",41516,"High Density Rural","Third Party",1,171,3.90625E-3,7]
[null,"2018-02-10","J1802100031",18146,"Urban","Third Party",1,10,5.2199150196999999E-5,7]
[null,"2018-02-10","J1802100032",18146,"Urban","Third Party",1,10,5.2199150196999999E-5,7]
[null,"2018-02-10","J1802100034",18146,"Urban","Third Party",1,10,5.2199150196999999E-5,7]
[null,"2018-02-10","J1802100036",18146,"Urban","Third Party",1,10,5.2199150196999999E-5,7]
[null,"2018-02-11","J1802110027",39565,"Urban","Third Party",1,67,3.4973430632500002E-4,7]
[null,"2018-02-12","J1802120030",35010,"Urban","Third Party",1,5,2.6099575097999999E-5,7]
[null,"2018-02-12","J1802120043",82001,"High Density Rural","Third Party",1,5,1.14217836257E-4,7]
[null,"2018-02-12","J1802120045",65062,"Urban","Third Party",1,127,6.6292920751200002E-4,7]
[null,"2018-02-13","J1802130004",41513,"High Density Rural","Third Party",1,10,2.28435672514E-4,7]
[null,"2018-02-13","J1802130020",48182,"High Density Rural","Third Party",1,10,2.28435672514E-4,7]
[null,"2018-02-14","J1802140015",94002,"Low Density Rural","Third Party",1,10,2.2548931180599999E-4,7]
[null,"2018-02-14","J1802140020",94002,"Low Density Rural","Third Party",1,10,2.2548931180599999E-4,7]
[null,"2018-02-14","J1802140046",85001,"Low Density Rural","Third Party",1,10,2.2548931180599999E-4,7]
[null,"2018-02-14","J1802140074",85006,"High Density Rural","Third Party",1,10,2.28435672514E-4,7]
[null,"2018-02-14","J1802140179",21085,"Urban","Third Party",1,5,2.6099575097999999E-5,7]
[null,"2018-02-14","J1802140221",30606,"High Density Rural","Third Party",1,290,6.624634502923E-3,7]
[null,"2018-02-14","J1802140313",41515,"High Density Rural","Third Party",1,216,4.9342105263149999E-3,7]
[null,"2018-02-14","J1802140348",20535,"Urban","Third Party",1,10,5.2199150196999999E-5,7]
[null,"2018-02-14","J1802140363",13055,"Urban","Third Party",1,10,5.2199150196999999E-5,7]
[null,"2018-02-14","J1802140499",85002,"Low Density Rural","Third Party",1,2980,6.7195814918371996E-2,7]
[null,"2018-02-14","J1802140521",26164,"Urban","Third Party",1,237,1.2371198596880001E-3,7]
[null,"2018-02-14","J1802140569",53003,"Low Density Rural","Third Party",1,10,2.2548931180599999E-4,7]
[null,"2018-02-14","J1802140646",41513,"Urban","Third Party",1,106,5.5331099209700004E-4,7]
[null,"2018-02-14","J1802140647",61041,"Urban","Third Party",1,10,5.2199150196999999E-5,7]
[null,"2018-02-14","J1802140657",20535,"Urban","Third Party",1,142,7.4122793280899997E-4,7]
[null,"2018-02-14","J1802140666",91009,"Urban","Third Party",1,10,5.2199150196999999E-5,7]
[null,"2018-02-14","J1802140685",55003,"Low Density Rural","Third Party",1,279,6.2911517994039996E-3,7]
[null,"2018-02-14","J1802140703",94002,"Low Density Rural","Third Party",1,49,1.1048976278520001E-3,7]
[null,"2018-02-14","J1802140708",61041,"Urban","Third Party",1,10,5.2199150196999999E-5,7]
[null,"2018-02-14","J1802140711",41516,"High Density Rural","Third Party",1,10,2.28435672514E-4,7]
[null,"2018-02-15","J1802140136",65067,"Urban","Third Party",1,5,2.6099575097999999E-5,7]
[null,"2018-02-15","J1802140629",85002,"Low Density Rural","Third Party",1,5,1.1274465590299999E-4,7]
[null,"2018-02-15","J1802150053",20548,"Urban","Third Party",1,148,7.7254742292700001E-4,7]
[null,"2018-02-15","J1802150100",16094,"Urban","Third Party",1,140,7.3078810276900003E-4,7]
[null,"2018-02-15","J1802150111",81002,"High Density Rural","Third Party",1,25,5.7108918128599999E-4,7]
[null,"2018-02-15","J1802150134",85001,"Low Density Rural","Third Party",1,1,2.2548931179999999E-5,7]
[null,"2018-02-15","J1802150161",26167,"Urban","Third Party",1,1624,8.4771419921280001E-3,7]
[null,"2018-02-16","J1802160097",67091,"Urban","Third Party",1,39,2.0357668577100001E-4,7]
[null,"2018-02-17","J1802170011",81003,"High Density Rural","Third Party",1,43,9.8227339181200003E-4,7]
[null,"2018-02-17","J1802170036",30607,"Low Density Rural","Third Party",1,62,1.398033733201E-3,7]
[null,"2018-02-17","J1802170039",85003,"High Density Rural","Third Party",1,10,2.28435672514E-4,7]
[null,"2018-02-18","J1802180001",16093,"Urban","Third Party",1,10,5.2199150196999999E-5,7]
[null,"2018-02-18","J1802180003",91008,"Urban","Third Party",1,268,1.3989372253009999E-3,7]
[null,"2018-02-18","J1802180006",22330,"Urban","Third Party",1,88,4.5935252174E-4,7]
[null,"2018-02-18","J1802180008",61023,"Low Density Rural","Third Party",1,278,6.2686028682240004E-3,7]
[null,"2018-02-18","J1802180015",91008,"Urban","Third Party",1,7,3.6539405138000002E-5,7]
[null,"2018-02-19","J1802190001",41516,"Low Density Rural","Third Party",1,43,9.6960404076799997E-4,7]
[null,"2018-02-19","J1802190003",18146,"Urban","Third Party",1,15,7.8298725296000005E-5,7]
[null,"2018-02-19","J1802190013",41515,"High Density Rural","Third Party",1,124,2.8326023391810002E-3,7]
[null,"2018-02-19","J1802190018",39565,"Urban","Third Party",1,4,2.0879660079000002E-5,7]
[null,"2018-02-19","J1802190028",37002,"Low Density Rural","Third Party",1,138,3.111752502931E-3,7]
[null,"2018-02-19","J1802190031",51004,"Low Density Rural","Third Party",1,124,2.7960674664020001E-3,7]
[null,"2018-02-19","J1802190039",40002,"Low Density Rural","Third Party",1,104,2.3450888427879999E-3,7]
[null,"2018-02-19","J1802190059",91011,"High Density Rural","Third Party",1,31,7.0815058479500002E-4,7]
[null,"2018-02-19","J1802190064",30607,"Low Density Rural","Third Party",1,10,2.2548931180599999E-4,7]
[null,"2018-02-19","J1802190073",85001,"Low Density Rural","Third Party",1,10,2.2548931180599999E-4,7]
[null,"2018-02-20","J1802200055",53004,"High Density Rural","Third Party",1,126,2.878289473684E-3,7]
[null,"2018-02-21","J1802210047",48185,"Low Density Rural","Third Party",1,54,1.2176422837550001E-3,7]
[null,"2018-02-21","J1802210051",94002,"Low Density Rural","Third Party",1,10,2.2548931180599999E-4,7]
[null,"2018-02-22","J1802220023",93002,"High Density Rural","Third Party",1,108,2.4671052631569999E-3,7]
[null,"2018-02-22","J1802220027",30607,"Low Density Rural","Third Party",1,10,2.2548931180599999E-4,7]
[null,"2018-02-22","J1802220029",49202,"Low Density Rural","Third Party",1,10,2.2548931180599999E-4,7]
[null,"2018-02-22","J1802220098",57004,"Low Density Rural","Third Party",1,5,1.1274465590299999E-4,7]
[null,"2018-02-23","J1802210026",55002,"Low Density Rural","Third Party",1,20,4.5097862361299999E-4,7]
[null,"2018-02-23","J1802230004",82002,"Urban","Third Party",1,161,8.4040631818499997E-4,7]
[null,"2018-02-23","J1802230017",48180,"Urban","Third Party",1,68,3.5495422134499999E-4,7]
[null,"2018-02-24","J1802240047",54005,"High Density Rural","Third Party",1,67,1.5305190058469999E-3,7]
[null,"2018-02-25","J1802250030",48185,"Low Density Rural","Third Party",1,209,4.7127266167580001E-3,7]
[null,"2018-02-25","J1802250040",80007,"Urban","Third Party",1,248,1.2945389249059999E-3,7]
[null,"2018-02-25","J1802250048",30605,"High Density Rural","Third Party",1,10,2.28435672514E-4,7]
[null,"2018-02-26","J1802260011",23341,"Urban","Third Party",1,23,1.20058045455E-4,7]
[null,"2018-02-26","J1802260014",61043,"High Density Rural","Third Party",1,5,1.14217836257E-4,7]
[null,"2018-02-26","J1802260016",16096,"Urban","Third Party",1,5,2.6099575097999999E-5,7]
[null,"2018-02-26","J1802260044",55002,"Low Density Rural","Third Party",1,5,1.1274465590299999E-4,7]
[null,"2018-02-26","J1802260046",67083,"Urban","Third Party",1,5,2.6099575097999999E-5,7]
[null,"2018-02-26","J1802260074",53008,"Low Density Rural","Third Party",1,191,4.3068458555060004E-3,7]
[null,"2018-02-26","J1802260075",53008,"Low Density Rural","Third Party",1,174,3.9235140254349999E-3,7]
[null,"2018-02-26","J1802260082",91008,"Urban","Third Party",1,65,3.3929447628500001E-4,7]
[null,"2018-02-27","J1802270045",41516,"Low Density Rural","Third Party",1,10,2.2548931180599999E-4,7]
[null,"2018-02-27","J1802270078",99981,"High Density Rural","Third Party",1,103,2.3528874268999998E-3,7]
[null,"2018-02-28","J1802230010",51004,"Low Density Rural","Third Party",1,10,2.2548931180599999E-4,7]
[null,"2018-02-28","J1802280062",98001,"Low Density Rural","Third Party",62,806,1.8174438531613001E-2,5]
[null,"2018-02-28","J1802280062",98001,"Urban","Third Party",600,7800,4.071533715431E-2,5]
[null,"2018-02-28","J1802280062",98002,"Low Density Rural","Third Party",7,91,2.0519527374399998E-3,5]
[null,"2018-02-28","J1802280062",98002,"Urban","Third Party",829,10777,5.6255024168205998E-2,5]
[null,"2018-02-28","J1802280062",98003,"Low Density Rural","Third Party",32,416,9.3803553711550008E-3,5]
[null,"2018-02-28","J1802280062",98003,"Urban","Third Party",525,6825,3.5625920010022002E-2,5]
[null,"2018-02-28","J1802280070",82007,"High Density Rural","Third Party",1,10,2.28435672514E-4,7]
[null,"2018-02-28","J1802280072",45001,"Low Density Rural","Third Party",55,715,1.6122485794173001E-2,5]
[null,"2018-02-28","J1802280072",45002,"Low Density Rural","Third Party",715,9295,0.20959231532425199,5]
[null,"2018-02-28","J1802280072",45003,"Low Density Rural","Third Party",616,8008,0.18057184089474099,5]
[null,"2018-03-01","J1803010001",39565,"Urban","Third Party",1,10,5.2199150196999999E-5,7]
[null,"2018-03-01","J1803010002",39565,"Urban","Third Party",1,10,5.2199150196999999E-5,7]
[null,"2018-03-01","J1803010003",39565,"Urban","Third Party",1,10,5.2199150196999999E-5,7]
[null,"2018-03-01","J1803010004",39565,"Urban","Third Party",1,10,5.2199150196999999E-5,7]
[null,"2018-03-01","J1803010005",39565,"Urban","Third Party",1,10,5.2199150196999999E-5,7]
[null,"2018-03-01","J1803010006",39565,"Urban","Third Party",1,10,5.2199150196999999E-5,7]
[null,"2018-03-01","J1803010007",39565,"Urban","Third Party",1,10,5.2199150196999999E-5,7]
[null,"2018-03-01","J1803010008",39565,"Urban","Third Party",1,10,5.2199150196999999E-5,7]
[null,"2018-03-01","J1803010009",39565,"Urban","Third Party",1,10,5.2199150196999999E-5,7]
[null,"2018-03-01","J1803010010",39565,"Urban","Third Party",1,10,5.2199150196999999E-5,7]
[null,"2018-03-01","J1803010011",39565,"Urban","Third Party",1,10,5.2199150196999999E-5,7]
[null,"2018-03-01","J1803010012",39565,"Urban","Third Party",1,10,5.2199150196999999E-5,7]
[null,"2018-03-01","J1803010013",39565,"Urban","Third Party",1,10,5.2199150196999999E-5,7]
[null,"2018-03-01","J1803010014",39565,"Urban","Third Party",1,10,5.2199150196999999E-5,7]
[null,"2018-03-01","J1803010015",39565,"Urban","Third Party",1,10,5.2199150196999999E-5,7]
[null,"2018-03-01","J1803010016",39565,"Urban","Third Party",1,10,5.2199150196999999E-5,7]
[null,"2018-03-01","J1803010017",39565,"Urban","Third Party",1,10,5.2199150196999999E-5,7]
[null,"2018-03-01","J1803010018",39565,"Urban","Third Party",1,10,5.2199150196999999E-5,7]
[null,"2018-03-01","J1803010019",39565,"Urban","Third Party",1,10,5.2199150196999999E-5,7]
[null,"2018-03-01","J1803010020",39565,"Urban","Third Party",1,10,5.2199150196999999E-5,7]
[null,"2018-03-01","J1803010021",39565,"Urban","Third Party",1,10,5.2199150196999999E-5,7]
[null,"2018-03-01","J1803010022",39565,"Urban","Third Party",1,10,5.2199150196999999E-5,7]
[null,"2018-03-01","J1803010023",39565,"Urban","Third Party",1,10,5.2199150196999999E-5,7]
[null,"2018-03-01","J1803010040",91004,"High Density Rural","Third Party",1,37,8.4521198830399995E-4,7]
[null,"2018-03-01","J1803010055",66106,"Urban","Third Party",1,15,7.8298725296000005E-5,7]
[null,"2018-03-01","J1803010059",12033,"Urban","Third Party",1,109,5.68970737156E-4,7]
[null,"2018-03-01","J1803010069",85001,"Low Density Rural","Third Party",1,52,1.172544421394E-3,7]
[null,"2018-03-01","J1803010108",80005,"Urban","Third Party",1,129,6.7336903755199997E-4,7]
[null,"2018-03-01","J1803010131",41516,"Low Density Rural","Third Party",1,123,2.7735185352209999E-3,7]
[null,"2018-03-02","J1803020052",43506,"High Density Rural","Third Party",1,10,2.28435672514E-4,7]
[null,"2018-03-02","J1803020056",16098,"Urban","Third Party",1,10,5.2199150196999999E-5,7]
[null,"2018-03-02","J1803020069",48192,"Urban","Third Party",1,86,4.4891269170100001E-4,7]
[null,"2018-03-03","J1803030031",51004,"Low Density Rural","Third Party",1,1230,2.7735185352214E-2,7]
[null,"2018-03-04","J1803040019",16094,"Urban","Third Party",1,67,3.4973430632500002E-4,7]
[null,"2018-03-04","J1803040021",20552,"Urban","Third Party",1,117,6.1073005731399998E-4,7]
[null,"2018-03-04","J1803040026",91012,"Low Density Rural","Third Party",1,131,2.953909984666E-3,7]
[null,"2018-03-04","J1803040031",67087,"High Density Rural","Third Party",19,17620,0.40250365497076002,7]
[null,"2018-03-05","J1803050031",62010,"Urban","Third Party",1,40,2.0879660079100001E-4,7]
[null,"2018-03-06","J1803060014",23347,"Urban","Third Party",1,10,5.2199150196999999E-5,7]
[null,"2018-03-06","J1803060022",80010,"Urban","Third Party",1,5,2.6099575097999999E-5,7]
[null,"2018-03-06","J1803060034",12030,"Urban","Third Party",1,279,1.4563562905189999E-3,7]
[null,"2018-03-07","J1803070003",81001,"Urban","Third Party",1,166,8.6650589328399999E-4,7]
[null,"2018-03-07","J1803070005",17105,"Urban","Third Party",1,40,2.0879660079100001E-4,7]
[null,"2018-03-07","J1803070014",29483,"Urban","Third Party",1,428,2.234123628467E-3,7]
[null,"2018-03-07","J1803070030",39571,"Low Density Rural","Third Party",1,5,1.1274465590299999E-4,7]
[null,"2018-03-08","J1803080000",62010,"Urban","Third Party",1,10,5.2199150196999999E-5,7]
[null,"2018-03-08","J1803080044",26164,"Urban","Third Party",1,198,1.033543173917E-3,7]
[null,"2018-03-09","J1803090020",93005,"Urban","Third Party",1,109,5.68970737156E-4,7]
[null,"2018-03-09","J1803090039",20547,"Urban","Third Party",1,175,9.1348512846199995E-4,7]
[null,"2018-03-09","J1803090057",91002,"High Density Rural","Environmental",58,5104,0.116593567251461,7]
[null,"2018-03-09","J1803090057",91002,"Low Density Rural","Environmental",17,1496,3.3733201046269999E-2,7]
[null,"2018-03-10","J1803090052",20547,"Urban","Third Party",1,30,1.56597450593E-4,7]
[null,"2018-03-10","J1803090055",85001,"Low Density Rural","Third Party",1,75,1.6911698385489999E-3,7]
[null,"2018-03-10","J1803100047",61043,"Urban","Third Party",1,2,1.0439830039000001E-5,7]
[null,"2018-03-11","J1803090057",91002,"High Density Rural","Environmental",58,4988,0.113943713450292,7]
[null,"2018-03-11","J1803090057",91002,"Low Density Rural","Environmental",17,1462,3.2966537386127003E-2,7]
[null,"2018-03-12","J1803120022",31007,"Low Density Rural","Third Party",1,127,2.8637142599440002E-3,7]
[null,"2018-03-13","J1803130018",48183,"Urban","Third Party",1,10,5.2199150196999999E-5,7]
[null,"2018-03-14","J1803140023",54003,"High Density Rural","Third Party",160,1280,2.9239766081871E-2,5]
[null,"2018-03-14","J1803140023",54003,"Low Density Rural","Third Party",621,4968,0.11202309010552799,5]
[null,"2018-03-14","J1803140023",54003,"Urban","Third Party",1215,9720,5.0737573992293998E-2,5]
[null,"2018-03-14","J1803140023",54005,"High Density Rural","Third Party",3,24,5.4824561403499998E-4,5]
[null,"2018-03-14","J1803140024",54005,"High Density Rural","Third Party",342,2736,6.25E-2,5]
[null,"2018-03-14","J1803140024",54005,"Low Density Rural","Third Party",1150,9200,0.20745016686209,5]
[null,"2018-03-14","J1803140024",54005,"Urban","Third Party",1,8,4.1759320158000003E-5,5]
[null,"2018-03-14","J1803140025",54004,"High Density Rural","Third Party",68,544,1.2426900584795E-2,5]
[null,"2018-03-14","J1803140025",54004,"Low Density Rural","Third Party",59,472,1.0643095517272E-2,5]
[null,"2018-03-14","J1803140025",54004,"Urban","Third Party",21,168,8.7694572332299998E-4,5]
[null,"2018-03-14","J1803140028",82003,"Urban","Third Party",1,171,8.9260546838200005E-4,7]
[null,"2018-03-15","J1803150001",61021,"Urban","Third Party",1,10,5.2199150196999999E-5,7]
[null,"2018-03-15","J1803150031",62006,"Urban","Third Party",1,5,2.6099575097999999E-5,7]
[null,"2018-03-15","J1803150041",57006,"Low Density Rural","Third Party",1,150,3.382339677099E-3,7]
[null,"2018-03-15","J1803150051",14063,"Urban","Third Party",55,55,2.8709532608799999E-4,7]
[null,"2018-03-16","J1803160005",14063,"Urban","Third Party",1,10,5.2199150196999999E-5,7]
[null,"2018-03-16","J1803160011",65067,"Low Density Rural","Third Party",1,100,2.2548931180660001E-3,7]
[null,"2018-03-16","J1803160024",67082,"High Density Rural","Third Party",1,260,5.9393274853800004E-3,7]
[null,"2018-03-16","J1803160031",53004,"High Density Rural","Third Party",1,5,1.14217836257E-4,7]
[null,"2018-03-16","J1803160032",55001,"High Density Rural","Third Party",1,5,1.14217836257E-4,7]
[null,"2018-03-16","J1803160041",61040,"Urban","Third Party",1,152,7.9342708300700001E-4,7]
[null,"2018-03-18","J1803180018",28223,"Urban","Third Party",1,10,5.2199150196999999E-5,7]
[null,"2018-03-18","J1803180024",20552,"Urban","Third Party",1,72,3.7583388142399998E-4,7]
[null,"2018-03-18","J1803180060",16094,"Urban","Third Party",1,78,4.0715337154299998E-4,7]
[null,"2018-03-18","J1803180079",32379,"High Density Rural","Third Party",1,10,2.28435672514E-4,7]
[null,"2018-03-18","J1803180127",29483,"Urban","Third Party",1,10,5.2199150196999999E-5,7]
[null,"2018-03-18","J1803180130",17109,"Urban","Third Party",1,10,5.2199150196999999E-5,7]
[null,"2018-03-18","J1803180143",12030,"Urban","Third Party",1,10,5.2199150196999999E-5,7]
[null,"2018-03-18","J1803180206",28232,"High Density Rural","Third Party",1,162,3.7006578947360001E-3,7]
[null,"2018-03-18","J1803180247",61021,"Low Density Rural","Third Party",1,141,3.1793992964730001E-3,7]
[null,"2018-03-19","J1803190000",17105,"Urban","Third Party",1,10,5.2199150196999999E-5,7]
[null,"2018-03-19","J1803190020",53009,"Urban","Third Party",1,5,2.6099575097999999E-5,7]
[null,"2018-03-19","J1803190042",61023,"High Density Rural","Third Party",170,31110,0.710663377192982,7]
[null,"2018-03-19","J1803190042",61023,"Low Density Rural","Third Party",990,352739,7.95388743573554,7]
[null,"2018-03-19","J1803190042",61023,"Urban","Third Party",210,38430,0.20060133421027901,7]
[null,"2018-03-19","J1803190080",21083,"Urban","Third Party",1,10,5.2199150196999999E-5,7]
[null,"2018-03-19","J1803190156",17107,"Urban","Third Party",1,5,2.6099575097999999E-5,7]
[null,"2018-03-19","J1803190195",22324,"Urban","Third Party",1,10,5.2199150196999999E-5,7]
[null,"2018-03-20","J1803200065",48183,"High Density Rural","Third Party",1,37,8.4521198830399995E-4,7]
[null,"2018-03-20","J1803200068",48183,"Urban","Third Party",1,107,5.5853090711600005E-4,7]
[null,"2018-03-21","J1803210060",51003,"Low Density Rural","Third Party",1,10,2.2548931180599999E-4,7]
[null,"2018-03-22","J1803210084",28231,"Urban","Third Party",1,20,1.04398300395E-4,7]
[null,"2018-03-22","J1803220016",41518,"Urban","Third Party",1,10,5.2199150196999999E-5,7]
[null,"2018-03-22","J1803220032",35010,"Low Density Rural","Third Party",1,5,1.1274465590299999E-4,7]
[null,"2018-03-22","J1803220038",80005,"Urban","Third Party",1,124,6.4726946245299995E-4,7]
[null,"2018-03-22","J1803220070",56004,"High Density Rural","Third Party",1,2,4.5687134501999997E-5,7]
[null,"2018-03-23","J1803210030",94001,"High Density Rural","Third Party",1,20,4.5687134502900002E-4,7]
[null,"2018-03-23","J1803230013",49303,"Low Density Rural","Third Party",1,150,3.382339677099E-3,7]
[null,"2018-03-23","J1803230023",91011,"Urban","Third Party",1,5,2.6099575097999999E-5,7]
[null,"2018-03-23","J1803230043",67086,"Urban","Third Party",1,5,2.6099575097999999E-5,7]
[null,"2018-03-24","J1803190218",18135,"Urban","Third Party",1,140,7.3078810276900003E-4,7]
[null,"2018-03-24","J1803240092",65065,"Urban","Third Party",1,264,1.3780575652220001E-3,7]
[null,"2018-03-24","J1803240093",66107,"Urban","Third Party",1,400,2.0879660079129998E-3,7]
[null,"2018-03-24","J1803240109",67087,"High Density Rural","Third Party",1,276,6.3048245614030001E-3,7]
[null,"2018-03-24","J1803240144",91008,"Urban","Third Party",1,10,5.2199150196999999E-5,7]
[null,"2018-03-24","J1803240156",80007,"Urban","Third Party",1,769,4.0141146502129998E-3,7]
[null,"2018-03-25","J1803250068",66109,"Urban","Third Party",1,10,5.2199150196999999E-5,7]
[null,"2018-03-25","J1803250079",91012,"Low Density Rural","Third Party",1,36,8.11761522503E-4,7]
[null,"2018-03-26","J1803260045",91001,"High Density Rural","Third Party",1,45,1.0279605263149999E-3,7]
[null,"2018-03-26","J1803260135",65067,"Low Density Rural","Third Party",1,139,3.1343014341120002E-3,7]
[null,"2018-03-27","J1803270051",54005,"High Density Rural","Third Party",1,2,4.5687134501999997E-5,7]
[null,"2018-03-27","J1803270052",91008,"Urban","Third Party",1,184,9.6046436364000001E-4,7]
[null,"2018-03-27","J1803270072",62009,"Urban","Third Party",1,75,3.91493626483E-4,7]
[null,"2018-03-28","J1803280042",66109,"Urban","Third Party",1,51,2.6621566600799998E-4,7]
[null,"2018-03-30","J1803300028",67087,"High Density Rural","Third Party",1,10,2.28435672514E-4,7]
[null,"2018-03-31","J1803310005",82001,"High Density Rural","Third Party",1,5,1.14217836257E-4,7]
[null,"2018-04-01","J1804010007",28223,"Urban","Third Party",1,46,2.4011609091E-4,7]
[null,"2018-04-01","J1804010017",16093,"Urban","Third Party",1,10,5.2199150196999999E-5,7]
[null,"2018-04-02","J1804020000",28228,"Urban","Third Party",1,5,2.6099575097999999E-5,7]
[null,"2018-04-02","J1804020008",41516,"Low Density Rural","Third Party",1,106,2.3901867051499999E-3,7]
[null,"2018-04-02","J1804020010",56004,"Low Density Rural","Third Party",1,95,2.142148462162E-3,7]
[null,"2018-04-02","J1804020021",82001,"High Density Rural","Third Party",1,134,3.0610380116949999E-3,7]
[null,"2018-04-03","J1804030014",39571,"Low Density Rural","Third Party",2,10,2.2548931180599999E-4,7]
[null,"2018-04-03","J1804030025",13053,"High Density Commercial","Third Party",1,90,1.9953441968739001E-2,7]
[null,"2018-04-03","J1804030063",67091,"Urban","Third Party",1,10,5.2199150196999999E-5,7]
[null,"2018-04-03","J1804030064",18141,"Urban","Third Party",1,111,5.7941056719499999E-4,7]
[null,"2018-04-04","J1804040015",27178,"Urban","Third Party",1,181,9.4480461857999998E-4,7]
[null,"2018-04-04","J1804040017",80008,"Urban","Third Party",1,113,5.8985039723500005E-4,7]
[null,"2018-04-05","J1804050011",91011,"Urban","Third Party",1,20,1.04398300395E-4,7]
[null,"2018-04-05","J1804050033",67082,"Low Density Rural","Third Party",1,5,1.1274465590299999E-4,7]
[null,"2018-04-05","J1804050043",91012,"Low Density Rural","Third Party",1,78,1.7588166320910001E-3,7]
[null,"2018-04-06","J1804060020",43507,"Low Density Rural","Third Party",1,153,3.4499864706410001E-3,7]
[null,"2018-04-06","J1804060021",53008,"Low Density Rural","Third Party",1,278,6.2686028682240004E-3,7]
[null,"2018-04-06","J1804060029",13044,"Urban","Third Party",1,10,5.2199150196999999E-5,7]
[null,"2018-04-06","J1804060041",80007,"Urban","Third Party",1,10,5.2199150196999999E-5,7]
[null,"2018-04-07","J1804070010",66102,"Urban","Third Party",1,89,4.6457243675999998E-4,7]
[null,"2018-04-08","J1804080022",62005,"Urban","Third Party",1,87,4.5413260672099999E-4,7]
[null,"2018-04-08","J1804080029",48181,"High Density Rural","Third Party",1,10,2.28435672514E-4,7]
[null,"2018-04-08","J1804080030",17107,"Urban","Third Party",1,10,5.2199150196999999E-5,7]
[null,"2018-04-09","J1804090047",91011,"High Density Rural","Third Party",1,71,1.6218932748530001E-3,7]
[null,"2018-04-10","J1804100023",56004,"Low Density Rural","Third Party",1,88,1.9843059438980001E-3,7]
[null,"2018-04-10","J1804100036",30604,"Urban","Third Party",1,55,2.8709532608799999E-4,7]
[null,"2018-04-10","J1804100050",67082,"High Density Rural","Third Party",1,120,2.741228070175E-3,7]
[null,"2018-04-10","J1804100053",91008,"Urban","Third Party",1,81,4.2281311660199999E-4,7]
[null,"2018-04-10","J1804100055",54005,"High Density Rural","Third Party",1,10,2.28435672514E-4,7]
[null,"2018-04-11","J1804110008",54005,"High Density Rural","Third Party",1,59,1.3477704678360001E-3,7]
[null,"2018-04-11","J1804110017",45003,"Low Density Rural","Third Party",1,234,5.2764498962740002E-3,7]
[null,"2018-04-11","J1804110025",41514,"High Density Rural","Third Party",1,169,3.8605628654970001E-3,7]
[null,"2018-04-11","J1804110041",55002,"Low Density Rural","Third Party",1,14,3.15685036529E-4,7]
[null,"2018-04-11","J1804110044",67082,"High Density Rural","Third Party",1,71,1.6218932748530001E-3,7]
[null,"2018-04-11","J1804110047",49621,"Low Density Rural","Third Party",1,331,7.4636962207990003E-3,7]
[null,"2018-04-11","J1804110056",81002,"High Density Rural","Third Party",1,82,1.873172514619E-3,7]
[null,"2018-04-12","J1804120034",13044,"Urban","Third Party",1,55,2.8709532608799999E-4,7]
[null,"2018-04-12","J1804120038",28221,"Urban","Third Party",1,225,1.174480879451E-3,7]
[null,"2018-04-12","J1804120109",53008,"Low Density Rural","Third Party",1,84,1.894110219175E-3,7]
[null,"2018-04-12","J1804120112",93002,"Urban","Third Party",1,125,6.5248937747199997E-4,7]
[null,"2018-04-13","J1804130019",13057,"High Density Rural","Third Party",1,16,3.6549707602300002E-4,7]
[null,"2018-04-14","J1804140010",91006,"Urban","Third Party",1,113,5.8985039723500005E-4,7]
[null,"2018-04-14","J1804140063",65061,"Urban","Third Party",1,107,5.5853090711600005E-4,7]
[null,"2018-04-14","J1804140067",80011,"Urban","Third Party",1,108,5.6375082213600003E-4,7]
[null,"2018-04-14","J1804140146",82007,"High Density Rural","Third Party",1,10,2.28435672514E-4,7]
[null,"2018-04-15","J1804150017",35010,"Low Density Rural","Third Party",1,62,1.398033733201E-3,7]
[null,"2018-04-16","J1804160049",12018,"Urban","Third Party",1,10,5.2199150196999999E-5,7]
[null,"2018-04-16","J1804160063",13056,"Urban","Third Party",1,1,5.2199150190000002E-6,7]
[null,"2018-04-16","J1804160073",41511,"Urban","Third Party",1,229,1.19536053953E-3,7]
[null,"2018-04-16","J1804160119",61028,"Urban","Third Party",1,10,5.2199150196999999E-5,7]
[null,"2018-04-16","J1804160144",81003,"Urban","Third Party",1,242,1.2632194347869999E-3,7]
[null,"2018-04-16","J1804160158",48182,"High Density Rural","Third Party",1,10,2.28435672514E-4,7]
[null,"2018-04-16","J1804160163",80006,"Urban","Third Party",1,29,1.51377535573E-4,7]
[null,"2018-04-16","J1804160166",91001,"High Density Rural","Third Party",1,60,1.370614035087E-3,7]
[null,"2018-04-17","J1804170023",67082,"High Density Rural","Third Party",1,10,2.28435672514E-4,7]
[null,"2018-04-17","J1804170028",95001,"Low Density Rural","Third Party",1,10,2.2548931180599999E-4,7]
[null,"2018-04-17","J1804170054",81002,"High Density Rural","Third Party",1,78,1.7817982456140001E-3,7]
[null,"2018-04-17","J1804170058",39565,"Urban","Third Party",1,85,4.4369277668099998E-4,7]
[null,"2018-04-18","J1804180004",28222,"High Density Rural","Third Party",1,36,8.2236842105199999E-4,7]
[null,"2018-04-18","J1804180032",82008,"Urban","Third Party",1,20,1.04398300395E-4,7]
[null,"2018-04-18","J1804180036",17105,"Urban","Third Party",1,10,5.2199150196999999E-5,7]
[null,"2018-04-18","J1804180037",82001,"High Density Rural","Third Party",1,305,6.9672880116950003E-3,7]
[null,"2018-04-18","J1804180039",30607,"Low Density Rural","Third Party",1,7,1.5784251826399999E-4,7]
[null,"2018-04-18","J1804180043",67082,"High Density Rural","Third Party",6,1206,2.7549342105263001E-2,7]
[null,"2018-04-18","J1804180044",66107,"Urban","Third Party",1,71,3.7061396640400001E-4,7]
[null,"2018-04-18","J1804180052",61023,"High Density Rural","Third Party",1,81,1.8503289473680001E-3,7]
[null,"2018-04-19","J1804190010",30607,"Low Density Rural","Third Party",1,23,5.1862541715499999E-4,7]
[null,"2018-04-19","J1804190014",81001,"Urban","Third Party",1,101,5.2721141699800002E-4,7]
[null,"2018-04-19","J1804190030",17107,"Urban","Third Party",1,255,1.331078330044E-3,7]
[null,"2018-04-19","J1804190040",12019,"Urban","Third Party",1,159,8.2996648814500002E-4,7]
[null,"2018-04-20","J1804200003",28228,"Urban","Third Party",1,10,5.2199150196999999E-5,7]
[null,"2018-04-20","J1804200026",62004,"Urban","Third Party",1,2,1.0439830039000001E-5,7]
[null,"2018-04-20","J1804200029",56004,"Low Density Rural","Third Party",1,52,1.172544421394E-3,7]
[null,"2018-04-20","J1804200039",31002,"Low Density Rural","Third Party",1,336,7.5764408767020003E-3,7]
[null,"2018-04-21","J1804210012",91008,"Urban","Third Party",1,149,7.7776733794699998E-4,7]
[null,"2018-04-21","J1804210018",81001,"Urban","Third Party",1,83,4.33252946642E-4,7]
[null,"2018-04-22","J1804220029",81001,"Urban","Third Party",1,10,5.2199150196999999E-5,7]
[null,"2018-04-23","J1804230017",66103,"Urban","Third Party",1,204,1.0648626640349999E-3,7]
[null,"2018-04-24","J1804240048",20547,"Urban","Third Party",1,24,1.25277960474E-4,7]
[null,"2018-04-24","J1804240054",91002,"High Density Rural","Third Party",1,73,1.6675804093559999E-3,7]
[null,"2018-04-25","J1804240051",81003,"Urban","Third Party",1,5,2.6099575097999999E-5,7]
[null,"2018-04-25","J1804250033",91009,"High Density Rural","Third Party",1,96,2.1929824561399999E-3,7]
[null,"2018-04-26","W1804260013",31007,"High Density Rural","Third Party",1,153,3.4950657894729999E-3,7]
[null,"2018-04-27","W1804270027",94001,"High Density Rural","Third Party",1,100,2.2843567251460001E-3,7]
[null,"2018-04-27","W1804270035",91004,"Urban","Third Party",1,246,1.284099094866E-3,7]
[null,"2018-04-27","W1804270046",67082,"High Density Rural","Third Party",1,225,5.1398026315779997E-3,7]
[null,"2018-05-03","J1805040042",33276,"Low Density Rural","Third Party",120,11181,0.25211959953098201,7]
[null,"2018-05-11","J1805110479",20553,"Low Density Rural","Environmental",164,38002.533300000003,0.85691650807251696,7]
[null,"2018-05-11","J1805110479",20553,"Urban","Environmental",1,124.7333,6.5109722613699997E-4,7]
[null,"2018-05-28","J1805280035",82008,"Urban","Third Party",1,40,2.0879660079100001E-4,7]
[null,"2018-05-30","J1805300057",54005,"Low Density Rural","Third Party",4,48,1.0823486966710001E-3,7]
[null,"2018-05-30","J1805300073",61043,"High Density Rural","Third Party",9,2027.85,4.6323327850876998E-2,7]
[null,"2018-05-30","J1805300123",57006,"Low Density Rural","Environmental",358,40454,0.91219446198250198,7]
[null,"2018-06-01","J1806010082",41516,"Low Density Rural","Third Party",1,1.2666999999999999,2.8562731126000001E-5,7]
[null,"2018-06-08","J1806080112",67088,"High Density Rural","Third Party",4,412.26670000000001,9.4176420869880005E-3,7]
[null,"2018-06-12","J1806120096",91008,"Urban","Environmental",3497,239835.9167,1.25192310386586,7]
[null,"2018-06-15","J1806200046",12037,"Urban","Third Party",1,229,1.19536053953E-3,7]
[null,"2018-06-24","J1806260057",62006,"Low Density Rural","Third Party",42,31203.9,0.70361459366825996,7]
[null,"2018-06-27","J1806270053",66101,"Urban","Third Party",1,15.6333,8.1604497477999997E-5,7]
[null,"2018-06-28","J1806280035",57006,"Low Density Rural","Third Party",4,1000,2.2548931180662E-2,7]

{"sheet":"6.9 STPIS - GSL","index":13,"n_rows":110,"n_cols":5,"rows_kept":110,"cut":false,"hidden":false,"merged":[[5,4,5,5],[109,1,109,2],[77,1,77,2],[106,1,106,2],[108,1,108,2],[101,1,101,2],[102,1,102,2],[103,1,103,2],[104,1,104,2],[96,1,96,2],[97,1,97,2],[98,1,98,2],[99,1,99,2],[100,1,100,2],[91,1,91,2],[92,1,92,2],[93,1,93,2],[94,1,94,2],[48,1,48,2],[49,1,49,2],[79,1,79,2],[78,1,78,2],[85,1,85,2],[53,1,53,2],[54,1,54,2],[55,1,55,2],[58,1,58,4],[64,1,64,4],[70,1,70,4],[76,1,76,4],[73,1,73,2],[72,1,72,2],[43,1,43,2],[45,1,45,2],[46,1,46,2],[47,1,47,2],[44,1,44,2],[35,1,35,2],[36,1,36,2],[37,1,37,2],[38,1,38,2],[39,1,39,2],[29,1,29,2],[33,1,33,2],[34,1,34,2],[30,1,30,2],[31,1,31,2],[32,1,32,2],[21,1,21,2],[23,1,23,2],[24,1,24,2],[25,1,25,2],[22,1,22,2],[17,1,17,2],[15,1,15,2],[5,1,5,2],[7,1,7,2],[14,1,14,2],[16,1,16,2],[71,1,71,2],[59,1,59,2],[60,1,60,2],[61,1,61,2],[67,1,67,2],[66,1,66,2],[65,1,65,2]]}
[null,{"$f":"IF(dms_DataQuality=\"backcast\",INDEX(dms_Worksheet_List,MATCH(dms_Model,dms_Model_List))&\" BACKCAST\",INDEX(dms_Worksheet_List,MATCH(dms_Model,dms_Model_List)))","v":"ANNUAL REPORTING STATEMENT"}]
[null,{"$f":"INDEX(dms_TradingNameFull_List,MATCH(dms_TradingName,dms_TradingName_List))","v":"TasNetworks (D)"}]
[null,{"$f":"CONCATENATE(\"Annual Reporting RIN Response \",IF(SUM(dms_SingleYear_Model)>0,CONCATENATE(CRY),CONCATENATE(FRCP_y1,\" to \",dms_MultiYear_FinalYear_Result)))","v":"Annual Reporting RIN Response 2017-18"}]
[null,"6.9 STPIS - GUARANTEED SERVICE LEVEL"]
[]
[null,"Did the AER's GSL Scheme apply at any time during the regulatory year?",null,"No","**IMPORTANT \nPlease ensure this flag is set. Conditional formatting on this worksheet is dependant on this response."]
[]
[null,"Instructions:\nTable 6.9.1 collects information relating to jurisdiction GSL scheme parameters. These parameters can be found in the jurisdictonal scheme relevant to NSP. Please identify each parameter in the relevant sub-tables and provide the volume and value of GSL payments. \n\nFor GSL parameters that do not fit within the provided sub-tables provided, please enter a heading and identify the relevant parameter(s). "]
[]
[null,"6.9.1 - GUARANTEED SERVICE LEVELS - JURISDICTIONAL GSL SCHEME"]
[null,null,null,{"$f":"CRY","v":"2017-18"},{"$f":"CRY","v":"2017-18"}]
[null,null,null,"Volume","Value of GSL payments"]
[null,null,null,"0's","$0's"]
[null,"Appointments"]
[null,"There is no GSL scheme in the TasNetworks Customer Charter for Appointments",null,0,0]
[]
[]
[]
[null,"To enter further GSL parameters relating to appointments - please copy a row from above and \"insert copied cells\" above this row."]
[]
[null,"Connections"]
[null,"Charter payments for not meeting connection expectations - residential customers",null,134,14400]
[]
[]
[]
[]
[null,"To enter further GSL parameters relating to connections -  please copy a row from above and \"insert copied cells\" above this row."]
[]
[null,"Reliability of supply"]
[null,"GSL payments for not meeting reliability of supply expectations",null,30845,3210800]
[]
[]
[]
[]
[]
[]
[]
[]
[]
[]
[null,"To enter further GSL parameters relating to reliability of supply -  please copy a row from above and \"insert copied cells\" above this row."]
[]
[null,"Street lights"]
[null,"Charter payments for not meeting public lighting expectations",null,11,330]
[]
[]
[]
[]
[]
[]
[null,"To enter further GSL parameters relating to street lights -  please copy a row from above and \"insert copied cells\" above this row."]
[]
[null,"Planned interruptions"]
[null,"Charter payments for not meeting planned interruption expectations",null,116,4040]
[]
[]
[null,"To enter further GSL parameters relating to planned interruptions -  please copy a row from above and \"insert copied cells\" above this row."]
[]
[null,"<NSP defined parameter category>"]
[]
[]
[]
[null,"To enter further GSL parameters - please identify the parameter and if insufficient rows  please copy a row from above and \"insert copied cells\" above this row."]
[]
[null,"<NSP defined parameter category>"]
[]
[]
[]
[null,"To enter further GSL parameters - please identify the parameter and if insufficient rows  please copy a row from above and \"insert copied cells\" above this row."]
[]
[null,"<NSP defined parameter category>"]
[]
[]
[]
[null,"To enter further GSL parameters - please identify the parameter and if insufficient rows  please copy a row from above and \"insert copied cells\" above this row."]
[]
[null,"<NSP defined parameter category>"]
[]
[]
[]
[null,"To enter further GSL parameters - please identify the parameter and if insufficient rows  please copy a row from above and \"insert copied cells\" above this row."]
[]
[]
[null,"6.9.2 - GUARANTEED SERVICE LEVELS - AER GSL SCHEME"]
[]
[null,"Complete Table 6.9.2 if the AER's GSL scheme applied at any time during the regulatory year. \n\nDo not complete Table 6.9.2 if the AER's GSL scheme did not apply during the regulatory year."]
[]
[null,null,null,{"$f":"CRY","v":"2017-18"},{"$f":"CRY","v":"2017-18"}]
[null,null,null,"Volume","Value \nof GSL payments"]
[null,null,null,"0's","$0's"]
[null,"New connections "]
[null,"Number of connections made"]
[null,"Number of connections not made on or before the day agreed"]
[null,"Connections - GSL payments – 1-6 day delay"]
[null,"Connections - GSL payments – 7+ day delay"]
[null,"Reliability of supply"]
[null,"Frequency of interruptions – CBD feeders – 9 interruptions"]
[null,"Frequency of interruptions – Urban feeders – 9 interruptions"]
[null,"Frequency of interruptions – Rural (short and long) feeders – 15 interruptions"]
[null,"Interruptions – CBD feeders – 12 hours duration"]
[null,"Interruptions – Urban feeders – 12 hours duration"]
[null,"Interruptions – Rural (short and long) feeders – 18 hours duration"]
[null,"Total duration of interruptions Level 1 – 20 hours"]
[null,"Total duration of interruptions Level 2 – 30 hours"]
[null,"Total duration of interruptions Level 3 – 60 hours"]
[null,"Street lights"]
[null,"Streetlight repair 5 days – GSL payments"]
[null,"Planned interruptions"]
[null,"Notice of planned interruptions – 4 business days notice not given"]
[null,"Total ",null,null,{"$f":"SUM(E109,E107,E97:E105,E94:E95)","v":0}]

{"sheet":"7.8 Avoided TUOS Payments","index":14,"n_rows":11,"n_cols":3,"rows_kept":11,"cut":false,"hidden":false,"merged":[]}
[null,{"$f":"IF(dms_DataQuality=\"backcast\",INDEX(dms_Worksheet_List,MATCH(dms_Model,dms_Model_List))&\" BACKCAST\",INDEX(dms_Worksheet_List,MATCH(dms_Model,dms_Model_List)))","v":"ANNUAL REPORTING STATEMENT"}]
[null,{"$f":"INDEX(dms_TradingNameFull_List,MATCH(dms_TradingName,dms_TradingName_List))","v":"TasNetworks (D)"}]
[null,{"$f":"CONCATENATE(\"Annual Reporting RIN Response \",IF(SUM(dms_SingleYear_Model)>0,CONCATENATE(CRY),CONCATENATE(FRCP_y1,\" to \",dms_MultiYear_FinalYear_Result)))","v":"Annual Reporting RIN Response 2017-18"}]
[null,"7.8 - AVOIDED TUOS PAYMENTS"]
[]
[null,"7.8.1 - AVOIDED TUOS PAYMENTS"]
[null,null,"Avoided TUOS Payment "]
[null,null,"$0's, nominal"]
[null,"Embedded generators",114325]
[null,"Market network service providers",0]
[null,"Other",0]

{"sheet":"7.10 Juris Scheme","index":15,"n_rows":17,"n_cols":6,"rows_kept":17,"cut":false,"hidden":false,"merged":[[8,4,9,4],[8,3,9,3],[8,2,9,2],[8,1,9,1],[5,1,5,2]]}
[null,{"$f":"IF(dms_DataQuality=\"backcast\",INDEX(dms_Worksheet_List,MATCH(dms_Model,dms_Model_List))&\" BACKCAST\",INDEX(dms_Worksheet_List,MATCH(dms_Model,dms_Model_List)))","v":"ANNUAL REPORTING STATEMENT"}]
[null,{"$f":"INDEX(dms_TradingNameFull_List,MATCH(dms_TradingName,dms_TradingName_List))","v":"TasNetworks (D)"}]
[null,{"$f":"CONCATENATE(\"Annual Reporting RIN Response \",IF(SUM(dms_SingleYear_Model)>0,CONCATENATE(CRY),CONCATENATE(FRCP_y1,\" to \",dms_MultiYear_FinalYear_Result)))","v":"Annual Reporting RIN Response 2017-18"}]
[null,"7.10 - JURISDICTIONAL SCHEMES"]
[]
[null,"Instructions\nBusiness must list each relevant jurisdictional scheme individually and report information for each scheme separately from other schemes."]
[]
[null,"7.10.1 - JURISDICTIONAL SCHEME PAYMENTS"]
[null,"Jurisdictional Scheme Name","Description","Date DNSP Became Subject to Scheme","Description of Cost Recovery Method","Total Scheme Payments  "]
[null,null,null,null,null,"$0's, nominal"]
[]
[]
[]
[]
[]
[]
[null,null,null,null,"Total",{"$f":"SUM(F11:F16)","v":0}]

{"sheet":"7.11 DMIS-DMIA","index":16,"n_rows":46,"n_cols":5,"rows_kept":46,"cut":false,"hidden":false,"merged":[[6,2,6,4],[8,2,8,4]]}
[null,{"$f":"IF(dms_DataQuality=\"backcast\",INDEX(dms_Worksheet_List,MATCH(dms_Model,dms_Model_List))&\" BACKCAST\",INDEX(dms_Worksheet_List,MATCH(dms_Model,dms_Model_List)))","v":"ANNUAL REPORTING STATEMENT"}]
[null,{"$f":"INDEX(dms_TradingNameFull_List,MATCH(dms_TradingName,dms_TradingName_List))","v":"TasNetworks (D)"}]
[null,{"$f":"CONCATENATE(\"Annual Reporting RIN Response \",IF(SUM(dms_SingleYear_Model)>0,CONCATENATE(CRY),CONCATENATE(FRCP_y1,\" to \",dms_MultiYear_FinalYear_Result)))","v":"Annual Reporting RIN Response 2017-18"}]
[null,"7.11 - DEMAND MANAGEMENT INCENTIVE SCHEME"]
[]
[null,"7.11.1 - DMIA - PROJECTS SUBMITTED FOR APPROVAL"]
[null,null,{"$f":"CONCATENATE(\"Total amount of the DMIA spent in \", CRY)","v":"Total amount of the DMIA spent in 2017-18"}]
[null,null,"Operating expenditure","Capital expenditure","Total"]
[null,"Name of project","$0's, nominal"]
[null,"EmPOWERing you trial",468457.15,null,{"$f":"SUM(C10:D10)","v":468457.15}]
[null,"CONSORT Bruny Island Battery Trial",558725.65,null,558725.65]
[null,"Demand management processes",32231.46,null,32231.46]
[null,null,null,null,0]
[null,null,null,null,0]
[null,null,null,null,0]
[null,null,null,null,0]
[null,null,null,null,0]
[null,null,null,null,0]
[null,null,null,null,0]
[null,null,null,null,0]
[null,null,null,null,0]
[null,null,null,null,0]
[null,null,null,null,0]
[null,null,null,null,0]
[null,null,null,null,0]
[null,null,null,null,0]
[null,null,null,null,0]
[null,null,null,null,0]
[null,null,null,null,0]
[null,null,null,null,0]
[null,null,null,null,0]
[null,null,null,null,0]
[null,null,null,null,0]
[null,null,null,null,0]
[null,null,null,null,0]
[null,null,null,null,0]
[null,null,null,null,0]
[null,null,null,null,0]
[null,null,null,null,0]
[null,null,null,null,0]
[null,null,null,null,0]
[null,null,null,null,0]
[null,null,null,null,0]
[null,null,null,null,0]
[null,"To enter additional projects - please copy an existing row and insert above this row. "]
[null,"Total",{"$f":"SUM(C10:C45)","v":1059414.26},{"$f":"SUM(D10:D45)","v":0},{"$f":"SUM(E10:E45)","v":1059414.26}]

{"sheet":"7.12 Safety and Bushfire","index":17,"n_rows":339,"n_cols":7,"rows_kept":339,"cut":false,"hidden":false,"merged":[[39,2,39,5],[44,2,44,5],[336,4,336,6],[337,4,337,6],[323,4,323,6],[312,4,312,6],[313,4,313,6],[314,4,314,6],[315,4,315,6],[316,4,316,6],[317,4,317,6],[324,4,324,6],[325,4,325,6],[320,4,320,6],[321,4,321,6],[322,4,322,6],[331,4,331,6],[332,4,332,6],[333,4,333,6],[335,4,335,6],[330,4,330,6],[334,4,334,6],[328,4,328,6],[329,4,329,6],[326,4,326,6],[327,4,327,6],[246,1,247,1],[246,2,247,2],[311,4,311,6],[310,4,310,6],[284,6,284,7],[285,6,285,7],[286,6,286,7],[305,6,305,7],[306,6,306,7],[318,4,318,6],[319,4,319,6],[83,1,85,1],[83,2,85,2],[11,1,11,2],[17,6,17,8],[32,6,32,8],[33,6,33,8],[34,2,34,5],[34,6,34,8],[35,2,35,5],[35,6,35,8],[36,2,36,5],[36,6,36,8],[43,2,43,5],[37,2,37,5],[18,6,18,8],[19,6,19,8],[20,6,20,8],[21,6,21,8],[22,6,22,8],[42,6,42,8],[43,6,43,8],[44,6,44,8],[28,6,28,8],[40,2,40,5],[5,1,5,2],[25,2,25,5],[26,2,26,5],[27,2,27,5],[28,2,28,5],[29,2,29,5],[30,2,30,5],[42,2,42,5],[31,2,31,5],[32,2,32,5],[14,1,14,4],[13,1,13,4],[33,2,33,5],[24,2,24,5],[17,2,17,5],[18,2,18,5],[19,2,19,5],[20,2,20,5],[21,2,21,5],[22,2,22,5],[23,2,23,5],[10,1,10,2],[41,2,41,5],[38,2,38,5],[29,6,29,8],[30,6,30,8],[31,6,31,8],[23,6,23,8],[24,6,24,8],[25,6,25,8],[26,6,26,8],[27,6,27,8],[40,6,40,8],[37,6,37,8],[41,6,41,8],[38,6,38,8],[39,6,39,8],[279,6,279,7],[280,6,280,7],[303,6,303,7],[304,6,304,7],[287,6,287,7],[288,6,288,7],[289,6,289,7],[290,6,290,7],[291,6,291,7],[292,6,292,7],[293,6,293,7],[294,6,294,7],[295,6,295,7],[298,6,298,7],[299,6,299,7],[300,6,300,7],[301,6,301,7],[302,6,302,7],[281,6,281,7],[282,6,282,7],[283,6,283,7],[131,1,131,2],[132,1,132,2],[133,1,133,2],[134,1,134,2],[135,1,135,2],[136,1,136,2],[119,1,119,2],[120,1,120,2],[121,1,121,2],[122,1,122,2],[123,1,123,2],[124,1,124,2],[125,1,125,2],[126,1,126,2],[127,1,127,2],[137,1,137,2],[138,1,138,2],[296,6,296,7],[297,6,297,7],[84,3,84,4],[85,3,85,4],[163,2,163,3],[164,2,164,3],[213,3,213,4],[214,3,214,4],[139,1,139,2],[140,1,140,2],[141,1,141,2],[142,1,142,2],[143,1,143,2],[144,1,144,2],[145,1,145,2],[117,1,118,2],[212,1,214,1],[212,2,214,2],[162,1,164,1],[128,1,128,2],[129,1,129,2],[130,1,130,2]]}
[null,{"$f":"IF(dms_DataQuality=\"backcast\",INDEX(dms_Worksheet_List,MATCH(dms_Model,dms_Model_List))&\" BACKCAST\",INDEX(dms_Worksheet_List,MATCH(dms_Model,dms_Model_List)))","v":"ANNUAL REPORTING STATEMENT"}]
[null,{"$f":"INDEX(dms_TradingNameFull_List,MATCH(dms_TradingName,dms_TradingName_List))","v":"TasNetworks (D)"}]
[null,{"$f":"CONCATENATE(\"Annual Reporting RIN Response \",IF(SUM(dms_SingleYear_Model)>0,CONCATENATE(CRY),CONCATENATE(FRCP_y1,\" to \",dms_MultiYear_FinalYear_Result)))","v":"Annual Reporting RIN Response 2017-18"}]
[null,"7.12 SAFETY AND BUSHFIRE RELATED EXPENDITURE"]
[]
[null,"These templates collect information from Victorian businesses only.\n\nBushfire and safety related expenditure information is used by the AER to monitor the expenditures throughout the regulatory control period."]
[]
[null,"CPI applied to convert expected expenditure in real $ to nominal based on lagged September CPI index"]
[]
[null,"Instructions"]
[null,"For \"Exclusive of Margins & Overheads\" reported expenditure is to EXCLUDE any overheads, profit margins or management fees paid directly or indirectly to related party contractors (not including actual incurred expense of the related party contractor) for the reporting period."]
[null,"For \"Value of Margins & Overheads\" reported expenditure is to COMPRISE ONLY the sum of overheads, profit margins or management fees paid directly or indirectly to related party contractors (not including actual incurred expenses of the related party contractor) for the reporting period. "]
[]
[null,"Australian Distribution Co. is to specify each activity in this table in accordance with the definition in Appendix F of the RIN."]
[null,"All activities must be reported but the Reason for Difference is only required if there is a 10 per cent difference between the expected value and the actual value.\n\nUse median unit costs. Where unit costs are not recorded at the asset category level - provide the best estimates of the unit cost using the cost allocation method identified in this table. (As a transitional measure, the unit cost may be based on a statistically significant annual sample of actual work orders at a 5% or better confidence interval.)\n\nProvide basis of allocation where applicable."]
[]
[null,"7.12.1 - SAFETY AND BUSHFIRE RELATED ASSET GROUP DEFINITIONS AND ALLOCATION BASIS"]
[null,"Activity","Definitions",null,null,null,"Basis for allocation of cost to activity"]
[null,"Planned non-preferred services replacements"]
[null,"Planned replacement of non-preferred services due to height "]
[null,"Removal of public lighting switchwire "]
[null,"Replacement of existing SWER lines with 22kV overhead bare conductor "]
[null,"Installation of GFN and associated equipment at zone substations "]
[null,"Replacement of crossarms/insulator sets – pole top fire mitigation"]
[null,"Replacement of crossarms – based on age and condition "]
[null,"Replacement of poles – based on age and condition "]
[null,"Stake poles – based on age and condition "]
[null,"Replacement of undersized poles "]
[null,"Stake undersized poles"]
[null,"Replacement of overhead conductor – mainly steel "]
[null,"Service line clearance – overhead services requiring relocation "]
[null,"Service line clearance – overhead services requiring undergrounding "]
[null,"Replacement of 22kV distribution feeders with ABC/underground cabling"]
[null,"Replacement of SWER with covered carbon core conductor or equivalent"]
[null,"Replacement of SWER with ABC"]
[null,"Replacement of SWER with underground"]
[null,"Replacement of surge diverters (neptune configuration)"]
[null,"Replacement of surge diverters (single phase or three phase)"]
[]
[]
[]
[]
[]
[]
[]
[null,"To enter further activities - please copy row from above and \"insert copied cells\" into a row above this row. "]
[]
[]
[null,"7.12.2 - BUSHFIRE RELATED"]
[]
[null,"7.12.2.1 - NUMBER OF ACTIVITIES"]
[null,"Activity","Units","Number of Activities"]
[null,"Planned non-preferred services replacements","number of services"]
[null,"Planned replacement of non-preferred services due to height ","number of services"]
[null,"Removal of public lighting switchwire ","number of spans removed"]
[null,"Replacement of existing SWER lines with 22kV overhead bare conductor ","kms of SWER"]
[null,"Installation of GFN and associated equipment at zone substations ","number of zone substations"]
[null,"Replacement of crossarms/insulator sets – pole top fire mitigation","number of crossarms/sets"]
[null,"Replacement of crossarms – based on age and condition ","number of crossarms"]
[null,"Replacement of poles – based on age and condition ","number of poles"]
[null,"Stake poles – based on age and condition ","number of poles"]
[null,"Replacement of undersized poles ","number of poles"]
[null,"Stake undersized poles","number of poles"]
[null,"Replacement of overhead conductor – mainly steel ","kms "]
[null,"Service line clearance – overhead services requiring relocation ","number of services"]
[null,"Service line clearance – overhead services requiring undergrounding ","number of services"]
[null,"Replacement of 22kV distribution feeders with ABC/underground cabling","number of feeders"]
[null,"Replacement of SWER with covered carbon core conductor or equivalent","kms "]
[null,"Replacement of SWER with ABC","kms "]
[null,"Replacement of SWER with underground","kms "]
[null,"Replacement of surge diverters (neptune configuration)","number of units"]
[null,"Replacement of surge diverters (single phase or three phase)","number of units"]
[null,{"$f":"IF(ISBLANK(B39),\"\",B39)","v":""}]
[null,""]
[null,""]
[null,""]
[null,""]
[null,""]
[null,""]
[null,"To enter further activities - please copy row from above and \"insert copied cells\" into a row above this row. "]
[]
[]
[null,"7.12.2.2 - EXPENDITURE "]
[null,"Activity","Units","Exclusive of \nMargins & Overheads","Value of \nMargins & Overheads"]
[null,null,null,"Actual Expenditure"]
[null,null,null,"$0's, Nominal"]
[null,"Planned non-preferred services replacements","number of services"]
[null,"Planned replacement of non-preferred services due to height ","number of services"]
[null,"Removal of public lighting switchwire ","number of spans removed"]
[null,"Replacement of existing SWER lines with 22kV overhead bare conductor ","kms of SWER"]
[null,"Installation of GFN and associated equipment at zone substations ","number of zone substations"]
[null,"Replacement of crossarms/insulator sets – pole top fire mitigation","number of crossarms/sets"]
[null,"Replacement of crossarms – based on age and condition ","number of crossarms"]
[null,"Replacement of poles – based on age and condition ","number of poles"]
[null,"Stake poles – based on age and condition ","number of poles"]
[null,"Replacement of undersized poles ","number of poles"]
[null,"Stake undersized poles","number of poles"]
[null,"Replacement of overhead conductor – mainly steel ","kms "]
[null,"Service line clearance – overhead services requiring relocation ","number of services"]
[null,"Service line clearance – overhead services requiring undergrounding ","number of services"]
[null,"Replacement of 22kV distribution feeders with ABC/underground cabling","number of feeders"]
[null,"Replacement of SWER with covered carbon core conductor or equivalent","kms "]
[null,"Replacement of SWER with ABC","kms "]
[null,"Replacement of SWER with underground","kms "]
[null,"Replacement of surge diverters (neptune configuration)","number of units"]
[null,"Replacement of surge diverters (single phase or three phase)","number of units"]
[null,{"$f":"IF(ISBLANK(B39),\"\",B39)","v":""},{"$f":"IF(ISBLANK(C73),\"\",C73)","v":""}]
[null,"",""]
[null,"",""]
[null,"",""]
[null,"",""]
[null,"",""]
[null,"",""]
[null,"To enter further activities - please copy row from above and \"insert copied cells\" into a row above this row. "]
[]
[]
[null,"7.12.2.3 - UNIT COSTS"]
[null,"Activity",null,"Actual"]
[null,null,null,"$0's, Per Unit"]
[null,"Planned non-preferred services replacements"]
[null,"Planned replacement of non-preferred services due to height "]
[null,"Removal of public lighting switchwire "]
[null,"Replacement of existing SWER lines with 22kV overhead bare conductor "]
[null,"Installation of GFN and associated equipment at zone substations "]
[null,"Replacement of crossarms/insulator sets – pole top fire mitigation"]
[null,"Replacement of crossarms – based on age and condition "]
[null,"Replacement of poles – based on age and condition "]
[null,"Stake poles – based on age and condition "]
[null,"Replacement of undersized poles "]
[null,"Stake undersized poles"]
[null,"Replacement of overhead conductor – mainly steel "]
[null,"Service line clearance – overhead services requiring relocation "]
[null,"Service line clearance – overhead services requiring undergrounding "]
[null,"Replacement of 22kV distribution feeders with ABC/underground cabling"]
[null,"Replacement of SWER with covered carbon core conductor or equivalent"]
[null,"Replacement of SWER with ABC"]
[null,"Replacement of SWER with underground"]
[null,"Replacement of surge diverters (neptune configuration)"]
[null,"Replacement of surge diverters (single phase or three phase)"]
[null,{"$f":"IF(ISBLANK(B39),\"\",B39)","v":""}]
[null,""]
[null,""]
[null,""]
[null,""]
[null,""]
[null,""]
[null,"To enter further activities - please copy row from above and \"insert copied cells\" into a row above this row. "]
[]
[]
[null,"7.12.2.4 - CONTINGENT PROJECT APPLICATIONS - VOLUMES APPROVED"]
[null,"Activity","Units","Volume approved under contingent project applications ","Actual volumes","Difference"]
[null,null,null,null,null,{"$f":"E152-D152","v":0}]
[null,null,null,null,null,0]
[null,null,null,null,null,0]
[null,null,null,null,null,0]
[null,null,null,null,null,0]
[null,null,null,null,null,0]
[null,null,null,null,null,0]
[null,null,null,null,null,0]
[null,"To enter further activities - please copy row from above and \"insert copied cells\" into a row above this row. "]
[]
[null,"7.12.2.5 - CONTINGENT PROJECT APPLICATIONS - EXPENDITURE APPROVED"]
[null,"Activity","Exclusive of \nMargins & Overheads","Value of \nMargins & Overheads"]
[null,null,"Actual Expenditure"]
[null,null,"$0's, Nominal"]
[null,{"$f":"IF(ISBLANK(B152),\"\",B152)","v":""}]
[null,{"$f":"IF(ISBLANK(B153),\"\",B153)","v":""}]
[null,""]
[null,""]
[null,""]
[null,""]
[null,""]
[null,""]
[null,"To enter further activities - please copy row from above and \"insert copied cells\" into a row above this row. "]
[]
[]
[]
[null,"7.12.3 - SAFETY RELATED"]
[]
[null,"7.12.3.1 - NUMBER OF ACTIVITIES"]
[null,"Activity","Units","Number of Activities"]
[null,"Planned non-preferred services replacements","number of services"]
[null,"Planned replacement of non-preferred services due to height ","number of services"]
[null,"Removal of public lighting switchwire ","number of spans removed"]
[null,"Replacement of existing SWER lines with 22kV overhead bare conductor ","kms of SWER"]
[null,"Installation of GFN and associated equipment at zone substations ","number of zone substations"]
[null,"Replacement of crossarms/insulator sets – pole top fire mitigation","number of crossarms/sets"]
[null,"Replacement of crossarms – based on age and condition ","number of crossarms"]
[null,"Replacement of poles – based on age and condition ","number of poles"]
[null,"Stake poles – based on age and condition ","number of poles"]
[null,"Replacement of undersized poles ","number of poles"]
[null,"Stake undersized poles","number of poles"]
[null,"Replacement of overhead conductor – mainly steel ","kms "]
[null,"Service line clearance – overhead services requiring relocation ","number of services"]
[null,"Service line clearance – overhead services requiring undergrounding ","number of services"]
[null,"Replacement of 22kV distribution feeders with ABC/underground cabling","number of feeders"]
[null,"Replacement of SWER with covered carbon core conductor or equivalent","kms "]
[null,"Replacement of SWER with ABC","kms "]
[null,"Replacement of SWER with underground","kms "]
[null,"Replacement of surge diverters (neptune configuration)","number of units"]
[null,"Replacement of surge diverters (single phase or three phase)","number of units"]
[null,{"$f":"IF(ISBLANK(B39),\"\",B39)","v":""},{"$f":"IF(ISBLANK(C73),\"\",C73)","v":""}]
[null,"",""]
[null,"",""]
[null,"",""]
[null,"",""]
[null,"",""]
[null,"",""]
[null,"To enter further activities - please copy row from above and \"insert copied cells\" into a row above this row. "]
[]
[]
[null,"7.12.3.2 - EXPENDITURE"]
[null,"Activity","Units","Exclusive of \nMargins & Overheads","Value of \nMargins & Overheads"]
[null,null,null,"Actual Expenditure"]
[null,null,null,"$0's, Nominal"]
[null,"Planned non-preferred services replacements","number of services"]
[null,"Planned replacement of non-preferred services due to height ","number of services"]
[null,"Removal of public lighting switchwire ","number of spans removed"]
[null,"Replacement of existing SWER lines with 22kV overhead bare conductor ","kms of SWER"]
[null,"Installation of GFN and associated equipment at zone substations ","number of zone substations"]
[null,"Replacement of crossarms/insulator sets – pole top fire mitigation","number of crossarms/sets"]
[null,"Replacement of crossarms – based on age and condition ","number of crossarms"]
[null,"Replacement of poles – based on age and condition ","number of poles"]
[null,"Stake poles – based on age and condition ","number of poles"]
[null,"Replacement of undersized poles ","number of poles"]
[null,"Stake undersized poles","number of poles"]
[null,"Replacement of overhead conductor – mainly steel ","kms "]
[null,"Service line clearance – overhead services requiring relocation ","number of services"]
[null,"Service line clearance – overhead services requiring undergrounding ","number of services"]
[null,"Replacement of 22kV distribution feeders with ABC/underground cabling","number of feeders"]
[null,"Replacement of SWER with covered carbon core conductor or equivalent","kms "]
[null,"Replacement of SWER with ABC","kms "]
[null,"Replacement of SWER with underground","kms "]
[null,"Replacement of surge diverters (neptune configuration)","number of units"]
[null,"Replacement of surge diverters (single phase or three phase)","number of units"]
[null,{"$f":"IF(ISBLANK(B39),\"\",B39)","v":""},{"$f":"IF(ISBLANK(C73),\"\",C73)","v":""}]
[null,"",""]
[null,"",""]
[null,"",""]
[null,"",""]
[null,"",""]
[null,"",""]
[null,"To enter further activities - please copy row from above and \"insert copied cells\" into a row above this row. "]
[]
[]
[null,"7.12.3.3 - UNIT COSTS"]
[null,"Activity","Units","Actual"]
[null,null,null,"$0's, Per Unit"]
[null,"Planned non-preferred services replacements","number of services"]
[null,"Planned replacement of non-preferred services due to height ","number of services"]
[null,"Removal of public lighting switchwire ","number of spans removed"]
[null,"Replacement of  existing SWER lines with 22kV overhead bare conductor ","kms of SWER"]
[null,"Installation of GFN and associated equipment at zone substations ","number of zone substations"]
[null,"Replacement of crossarms/insulator sets – pole top fire mitigation","number of crossarms/sets"]
[null,"Replacement of crossarms – based on age and condition ","number of crossarms"]
[null,"Replacement of poles – based on age and condition ","number of poles"]
[null,"Stake poles – based on age and condition ","number of poles"]
[null,"Replacement of undersized poles ","number of poles"]
[null,"Stake undersized poles","number of poles"]
[null,"Replacement of overhead conductor – mainly steel ","kms "]
[null,"Service line clearance – overhead services requiring relocation ","number of services"]
[null,"Service line clearance – overhead services requiring undergrounding ","number of services"]
[null,"Replacement of 22kV distribution feeders with ABC/underground cabling","number of feeders"]
[null,"Replacement of SWER with covered carbon core conductor or equivalent","kms "]
[null,"Replacement of SWER with ABC","kms "]
[null,"Replacement of SWER with underground","kms "]
[null,"Replacement of surge diverters (neptune configuration)","number of units"]
[null,"Replacement of surge diverters (single phase or three phase)","number of units"]
[null,{"$f":"IF(ISBLANK(B39),\"\",B39)","v":""},{"$f":"IF(ISBLANK(C73),\"\",C73)","v":""}]
[null,"",""]
[null,"",""]
[null,"",""]
[null,"",""]
[null,"",""]
[null,"",""]
[null,"To enter further activities - please copy row from above and \"insert copied cells\" into a row above this row. "]
[]
[]
[null,"7.12.4 - SAFETY IMPROVEMENT OUTCOMES REPORTED TO ESV"]
[null,"Activity","Units","Safety Improvement Programme - outcomes","Safety Improvement Target","Difference","Reasons for Difference"]
[null,"Planned non-preferred services replacements","number of services",null,null,{"$f":"D281-E281","v":0}]
[null,"Planned replacement of non-preferred services due to height ","number of services",null,null,{"$f":"D282-E282","v":0}]
[null,"Removal of public lighting switchwire ","number of spans removed",null,null,0]
[null,"Replacement of  existing SWER lines with 22kV overhead bare conductor ","kms of SWER",null,null,0]
[null,"Installation of GFN and associated equipment at zone substations ","number of zone substations",null,null,0]
[null,"Replacement of crossarms/insulator sets – pole top fire mitigation","number of crossarms/sets",null,null,0]
[null,"Replacement of crossarms – based on age and condition ","number of crossarms",null,null,0]
[null,"Replacement of poles – based on age and condition ","number of poles",null,null,0]
[null,"Stake poles – based on age and condition ","number of poles",null,null,0]
[null,"Replacement of undersized poles ","number of poles",null,null,0]
[null,"Stake undersized poles","number of poles",null,null,0]
[null,"Replacement of overhead conductor – mainly steel ","kms ",null,null,0]
[null,"Service line clearance – overhead services requiring relocation ","number of services",null,null,0]
[null,"Service line clearance – overhead services requiring undergrounding ","number of services",null,null,0]
[null,"Replacement of 22kV distribution feeders with ABC/underground cabling","number of feeders",null,null,0]
[null,"Replacement of SWER with covered carbon core conductor or equivalent","kms ",null,null,0]
[null,"Replacement of SWER with ABC","kms ",null,null,0]
[null,"Replacement of SWER with underground","kms ",null,null,{"$f":"D298-E298","v":0}]
[null,"Replacement of surge diverters (neptune configuration)","number of units",null,null,0]
[null,"Replacement of surge diverters (single phase or three phase)","number of units",null,null,0]
[null,{"$f":"IF(ISBLANK(B39),\"\",B39)","v":""},{"$f":"IF(ISBLANK(C73),\"\",C73)","v":""},null,null,0]
[null,"","",null,null,0]
[null,"","",null,null,{"$f":"D303-E303","v":0}]
[null,"","",null,null,{"$f":"D304-E304","v":0}]
[null,"","",null,null,{"$f":"D305-E305","v":0}]
[null,"","",null,null,0]
[null,"","",null,null,0]
[null,"To enter further activities - please copy row from above and \"insert copied cells\" into a row above this row. "]
[]
[null,"7.12.5 - RECONCILIATION OF VOLUME OF OUTCOMES REPORTED TO ESV AND AER"]
[null,"Activity","Units","Difference","Reasons for Difference"]
[null,"Planned non-preferred services replacements","number of services",{"$f":"D281-D53-D182","v":0}]
[null,"Planned replacement of non-preferred services due to height ","number of services",0]
[null,"Removal of public lighting switchwire ","number of spans removed",0]
[null,"Replacement of  existing SWER lines with 22kV overhead bare conductor ","kms of SWER",0]
[null,"Installation of GFN and associated equipment at zone substations ","number of zone substations",0]
[null,"Replacement of crossarms/insulator sets – pole top fire mitigation","number of crossarms/sets",0]
[null,"Replacement of crossarms – based on age and condition ","number of crossarms",0]
[null,"Replacement of poles – based on age and condition ","number of poles",0]
[null,"Stake poles – based on age and condition ","number of poles",0]
[null,"Replacement of undersized poles ","number of poles",0]
[null,"Stake undersized poles","number of poles",0]
[null,"Replacement of overhead conductor – mainly steel ","kms ",0]
[null,"Service line clearance – overhead services requiring relocation ","number of services",0]
[null,"Service line clearance – overhead services requiring undergrounding ","number of services",0]
[null,"Replacement of 22kV distribution feeders with ABC/underground cabling","number of feeders",0]
[null,"Replacement of SWER with covered carbon core conductor or equivalent","kms ",0]
[null,"Replacement of SWER with ABC","kms ",0]
[null,"Replacement of SWER with underground","kms ",0]
[null,"Replacement of surge diverters (neptune configuration)","number of units",0]
[null,"Replacement of surge diverters (single phase or three phase)","number of units",0]
[null,{"$f":"IF(ISBLANK(B39),\"\",B39)","v":""},{"$f":"IF(ISBLANK(C73),\"\",C73)","v":""},{"$f":"D301-D74-D202","v":0}]
[null,"","",0]
[null,"","",0]
[null,"","",0]
[null,"","",0]
[null,"","",0]
[null,"","",0]
[null,"To enter further activities - please copy row from above and \"insert copied cells\" into a row above this row. "]

{"sheet":"7.13 TARC","index":18,"n_rows":9,"n_cols":3,"rows_kept":9,"cut":false,"hidden":false,"merged":[]}
[null,{"$f":"(LOOKUP(dms_Model,dms_Model_List,dms_Worksheet_List))","v":"ANNUAL REPORTING STATEMENT"}]
[null,{"$f":"dms_TradingName","v":"TasNetworks (D)"}]
[null,{"$f":"CONCATENATE(\"Annual Reporting RIN Response \",CRY)","v":"Annual Reporting RIN Response 2017-18"}]
[null,"7.13 - TARC"]
[]
[]
[null,"7.13.1 - TOTAL ANNUAL RETAILER CHARGES"]
[null,null,"$0's"]
[null,"TARC",361067036.28999996]

{"sheet":"8.1 Income","index":19,"n_rows":40,"n_cols":12,"rows_kept":40,"cut":false,"hidden":false,"merged":[[6,6,6,10],[7,8,7,10],[6,11,8,11],[9,2,9,11],[6,5,8,5],[7,6,7,7],[6,2,8,2],[6,3,8,3],[6,4,8,4]]}
[null,{"$f":"IF(dms_DataQuality=\"backcast\",INDEX(dms_Worksheet_List,MATCH(dms_Model,dms_Model_List))&\" BACKCAST\",INDEX(dms_Worksheet_List,MATCH(dms_Model,dms_Model_List)))","v":"ANNUAL REPORTING STATEMENT"}]
[null,{"$f":"INDEX(dms_TradingNameFull_List,MATCH(dms_TradingName,dms_TradingName_List))","v":"TasNetworks (D)"}]
[null,{"$f":"CONCATENATE(\"Annual Reporting RIN Response \",IF(SUM(dms_SingleYear_Model)>0,CONCATENATE(CRY),CONCATENATE(FRCP_y1,\" to \",dms_MultiYear_FinalYear_Result)))","v":"Annual Reporting RIN Response 2017-18"}]
[null,"8.1 - INCOME"]
[]
[null,"8.1.1 - INCOME STATEMENT"]
[null,null,"Audited Statutory Accounts","Adjustments","Distribution business","Standard Control Services","Alternative Control Services",null,null,null,null,"Negotiated Services"]
[null,null,null,null,null,null,"Public Lighting",null,"Other"]
[null,null,null,null,null,null,{"$f":"IF(dms_Jurisdiction=\"Vic\",\"Energy efficient\",\"\")","v":""},{"$f":"IF(dms_Jurisdiction=\"Vic\",\"Non-energy efficient\",\"\")","v":""},"Connection services","Metering services","Ancillary network services"]
[null,null,"$0's, nominal"]
[null,"8.1.1.1 - REVENUE"]
[null,"Distribution revenue",260516545.96000001,6400151.9196190219,266916697.45961851,242840398.20961854,null,5644322.0300000012,null,12446655.940000001,5985321.2799999686]
[null,"Cross boundary revenue",0,null,0]
[null,"Contributions",14371635.75,-1846732.7,12524903.049999999,9496255.5699999984,null,null,null,null,3028647.4800000004]
[null,"Interest income",42736.82,-42736.82,0]
[null,"Jurisdictional scheme amounts",0,null,0]
[null,"Profit from sale of fixed assets",2968845.14,-756209.15999999992,2212635.98,null,null,2212635.98]
[null,"TUOS revenue",95748692.980381444,0,95748692.980381444,95748692.980381444]
[null,"Pass through revenue (F-factor)",null,null,0]
[null,"Other Revenue ",215151795.93000007,-215151795.93000007,0]
[null,"Total revenue",{"$f":"SUM(C12:C20)","v":588800252.58038151},-211397322.69038105,377402929.46999997,348085346.75999999,0,7856958.0100000016,0,12446655.940000001,9013968.7599999681,0]
[]
[null,"8.1.1.2 - EXPENDITURE"]
[null,"TUOS expenditure",95108850.710000008,0,95108850.710000008,95108850.710000008]
[null,"Avoided TUOS expenditure",71388.929999999993,42936.79,114325.72,114325.72]
[null,"Cross boundary expenditure",0,null,0]
[null,"Depreciation ",155562000,-70560738.603109077,85001261.396890923,77495377.549908042,null,1396278.8279553093,null,6109605.0190275814]
[null,"Finance charges",83550065.329999998,-83550065.329999998,0]
[null,"Impairment losses",2122479.23,0,2122479.23,null,null,2122479.23]
[null,"Jurisdictional scheme amounts",0,null,0]
[null,"Loss from sale of fixed assets",null,null,0]
[null,"Maintenance expenditure",79188048.128778398,null,79188048.128778398,61880440.764797866,null,1967517.5719778584,null,6566042.8444980616,8773130.4814992882,916.466005322618]
[null,"Operating expenditure excluding maintenance expenditure",28654131.485159703,null,28654131.485159703,24535906.169646353,null,701369.83372855466,null,1936900.7152218753,1479236.1293313694,718.63723155031767]
[null,"Other ",59929792.626443267,-59929792.626443267,0]
[null,"Total expenditure",{"$f":"SUM(dms_080101_02_audited_Values)","v":504186756.44038141},{"$f":"SUM(D24:D34)","v":-213997659.76955235},{"$f":"SUM(dms_080101_02_dnsp_Values)","v":290189096.67082906},{"$f":"SUM(dms_080101_02_SCS_Values)","v":259134900.91435227},{"$f":"SUM(G24:G34)","v":0},{"$f":"SUM(H24:H34)","v":6187645.4636617219},{"$f":"SUM(dms_080101_02_connection_Values)","v":0},{"$f":"SUM(dms_080101_02_metering_Values)","v":14612548.578747518},{"$f":"SUM(dms_080101_02_ancillary_Values)","v":10252366.610830657},{"$f":"SUM(dms_080101_02_negotiated_Values)","v":1635.1032368729357}]
[]
[null,"8.1.1.3 - PROFIT"]
[null,"Profit before tax (PBT)",{"$f":"C21-SUM(C24:C34)","v":84613496.140000105},2600337.0791712999,87213832.799170911,88950445.845647722,0,1669312.5463382797,0,-2165892.638747517,-1238397.8508306891,-1635.1032368729357]
[null,"Income tax expenses (/ benefit)",25383999.539999999,-25383999.539999999,0]
[null,"Profit after tax",{"$f":"C38-C39","v":59229496.600000106},27984336.619171299,87213832.799170911,88950445.845647722,0,1669312.5463382797,0,-2165892.638747517,-1238397.8508306891,{"$f":"L38-L39","v":-1635.1032368729357}]

{"sheet":"8.2 Capex","index":20,"n_rows":248,"n_cols":10,"rows_kept":248,"cut":false,"hidden":false,"merged":[[57,2,57,5],[63,4,64,4],[48,2,48,5],[63,2,64,2],[52,2,52,5],[53,2,53,5],[54,2,54,5],[62,2,62,9],[63,6,63,9],[81,1,81,2],[58,2,58,5],[63,3,64,3],[63,5,64,5],[65,5,65,9],[65,2,65,3],[43,2,43,5],[44,2,44,5],[55,2,55,5],[56,2,56,5],[50,2,50,5],[51,2,51,5],[49,2,49,5],[45,2,45,5],[46,2,46,5],[47,2,47,5],[140,2,140,3],[196,2,196,3],[6,1,6,4],[41,1,41,4],[10,1,10,4],[7,1,7,4],[8,1,8,4],[14,1,14,4],[16,2,16,9],[17,2,18,2],[17,3,18,3],[17,4,18,4],[17,5,18,5],[17,6,17,9],[19,2,19,3],[19,5,19,9]]}
[null,{"$f":"IF(dms_DataQuality=\"backcast\",INDEX(dms_Worksheet_List,MATCH(dms_Model,dms_Model_List))&\" BACKCAST\",INDEX(dms_Worksheet_List,MATCH(dms_Model,dms_Model_List)))","v":"ANNUAL REPORTING STATEMENT"}]
[null,{"$f":"INDEX(dms_TradingNameFull_List,MATCH(dms_TradingName,dms_TradingName_List))","v":"TasNetworks (D)"}]
[null,{"$f":"CONCATENATE(\"Annual Reporting RIN Response \",IF(SUM(dms_SingleYear_Model)>0,CONCATENATE(CRY),CONCATENATE(FRCP_y1,\" to \",dms_MultiYear_FinalYear_Result)))","v":"Annual Reporting RIN Response 2017-18"}]
[null,"8.2 - CAPEX"]
[]
[null,"Instructions"]
[null,"Reported expenditure must EXCLUDE capital contributions (except tables 8.2.1 and 8.2.5 which should include all capital contributions)."]
[null,"Forecast expenditure is to be taken from Australian Distribution Co.'s distribution determination."]
[null,"If allocating based on assumptions then provide method in Basis of Preparation. All adjustments must be explained in Basis of Preparation with supporting documentation attached. "]
[]
[null,"For tables 8.2.1 and 8.2.3:\nReported expenditure must INCLUDE any profit margins or management fees paid directly or indirectly to related party contractors (not including actual incurred expenses of the related party contractor) for the regulatory reporting period.\n\n'Related Party Margin Expenditure' must COMPRISE ONLY profit margins or management fees paid directly or indirectly to related party contractors (not including actual incurred expenses of the related party contractor) for the regulatory reporting period."]
[]
[null,"8.2.1 - CAPEX BY PURPOSE - STANDARD CONTROL SERVICES"]
[]
[null,"Each line item in this table must INCLUDE the capital contributions. Total capital contributions should also be identified in the last item in the table. "]
[]
[null,null,"EXPENDITURE"]
[null,null,"CPI adjusted Forecast","Actual","Difference","Related Party Margin","Voltage level"]
[null,null,null,null,null,null,"Subtransmission","HV","LV","Other "]
[null,"Description","$0's, nominal",null," (%)","$0's, nominal"]
[null,"Customer Initiated",26026750.550585337,{"$f":"SUM(G21:J21)","v":32410954.900841892},{"$f":"IF(C21=0,1,(D21-C21)/C21*1)","v":0.24529394623613415},null,0,19494953.551148649,12022483.534885669,893517.81480757287]
[null,"Reinforcement",6700545.7337317858,{"$f":"SUM(G22:J22)","v":6926858.283688779},{"$f":"IF(C22=0,1,(D22-C22)/C22*1)","v":3.3775241443050524E-2},null,463936.91543404531,6163991.7816469371,298929.58660779579,0]
[null,"Reliability & Quality Maintained",55423531.371613942,83891981.208479494,0.51365275961910517,null,25391938.547277957,35475526.37230292,19749806.00479956,3274710.2840990592]
[null,"Regulatory obligations or requirements",3430336.4627092532,4552432.0296838852,0.32710947721099337,null,0,4372229.7516477779,81298.15535800808,98904.122678099011]
[null,null,null,0,1]
[null,null,null,{"$f":"SUM(G26:J26)","v":0},1]
[null,"SCADA & Network Control",3411635.8279311308,996150.88912893971,-0.70801370973612354,null,0,94124.768078828522,0,902026.12105011113]
[null,"IT & Communications",15690683.049441436,15401278.227260849,-1.8444373726030375E-2,null,null,null,null,15401278.227260849]
[null,"Motor Vehicle",2516351.3001822983,3246541.8898993395,0.29017831876818717,null,null,null,null,3246541.8898993395]
[null,"Property",1342473.418647256,{"$f":"SUM(G30:J30)","v":2240070.603092052},0.66861449320110955,null,null,null,null,2240070.603092052]
[null,"Plant & Equipment",0,0,1]
[null,"Other Capex",0,0,1]
[null,"Business Services Management ",11615577.162956869,12659100.136165619,8.9838236926929396E-2,null,null,null,null,12659100.136165619]
[null,"Capitalised Overheads",0,0,1]
[null,null,null,0,1]
[null,"Capital contributions included in the above",11440447.43896639,9496255.5700000003,-0.16994019502632682,null,1690.9499999999998,3634468.560000001,5860096.0599999987,0]
[null,"Total",{"$f":"SUM(C21:C35)","v":126157884.8777993},162325368.16824085,{"$f":"IF(C37=0,1,(D37-C37)/C37*1)","v":0.28668428711748428},null,{"$f":"SUM(G21:G35)","v":25855875.462712001},{"$f":"SUM(H21:H35)","v":65600826.224825114},32152517.281651035,38716149.199052706]
[]
[]
[null,"8.2.2 - CAPEX BY PURPOSE - MATERIAL DIFFERENCE EXPLANATION"]
[]
[null,"Where the difference between forecast and actual expenditure shown in table 8.2.1 is a Material Difference please explain the main factors driving the difference."]
[]
[null,"Description","Reason for material difference"]
[null,"Customer Initiated","The customer initiated works expenditure is higher during the year, due to higher volumes of general customer supply works."]
[null,"Reliability & Quality Maintained","The reliability and quality maintained category is higher than forecast predominately due to the significantly higher than budget volumes associated with the cross arm and condemned pole replacements, fire mitigation (vibration damper and HV fuse replacement programs), HV copper conductor and HV feeder replacement programs. "]
[null,"Regulatory obligations or requirements","There was higher expenditure than forecast relating to replacement of HV feeders (safety),safety and environmental issues relating to ground mounted substations and Wildlife Endangered Species Protection."]
[null,"SCADA & Network Control","Lower than forecast expenditure on SCADA and Network control programs due to timing."]
[null,"Motor Vehicle","The motor vehicle expenditure is higher due to the timing of the fleet replacement program"]
[]
[]
[]
[]
[]
[]
[]
[]
[]
[]
[]
[]
[null,"8.2.3 - CAPEX OTHER"]
[null,null,"EXPENDITURE"]
[null,null,"CPI adjusted Forecast","Actual","Difference","Related Party Margin","Voltage level"]
[null,null,null,null,null,null,"Subtransmission","HV","LV","Other "]
[null,null,"$0's, nominal",null," (%)","$0's, nominal"]
[null,"Public lighting"]
[null,{"$f":"IF(dms_Jurisdiction=\"Vic\",\"Energy Efficient\", \"Total\")","v":"Total"},null,{"$f":"SUM(G68:J68)","v":3030689.1543713105},{"$f":"IF(C68=0,1,((D68-C68)/C68)*1)","v":1},null,null,null,null,3030689.1543713105]
[null,{"$f":"IF(dms_Jurisdiction=\"Vic\",\"Non-energy efficient\", \"\")","v":""},null,{"$f":"SUM(G69:J69)","v":0},{"$f":"IF(C69=0,1,((D69-C69)/C69)*1)","v":1}]
[null,"Alternative Control Services"]
[null,"Connection services",null,{"$f":"SUM(G71:J71)","v":3388607.5793305743},{"$f":"IF(C71=0,1,((D71-C71)/C71)*1)","v":1},null,null,null,null,3388607.5793305743]
[null,"Metering services",null,2897424.3865584857,{"$f":"IF(C72=0,1,((D72-C72)/C72)*1)","v":1},null,null,null,null,2897424.3865584857]
[null,"Ancillary network services",null,0,{"$f":"IF(C73=0,1,((D73-C73)/C73)*1)","v":1}]
[null,"Negotiated Services"]
[null,"Negotiated services",null,{"$f":"SUM(G75:J75)","v":0},{"$f":"IF(C75=0,1,((D75-C75)/C75)*1)","v":1}]
[null,"Total",{"$f":"SUM(C68:C69,C71:C73,C75)","v":0},{"$f":"SUM(D68:D69,D71:D73,D75)","v":9316721.1202603709},{"$f":"IF(C76=0,1,((D76-C76)/C76)*1)","v":1},null,{"$f":"SUM(G68:G69,G71:G73,G75)","v":0},{"$f":"SUM(H68:H69,H71:H73,H75)","v":0},{"$f":"SUM(I68:I69,I71:I73,I75)","v":0},{"$f":"SUM(J68:J69,J71:J73,J75)","v":9316721.1202603709}]
[]
[]
[]
[null,"8.2.4 - CAPEX BY ASSET CLASS"]
[]
[null,"Australian Distribution Co. to enter in Table 8.2.4 each Asset Class specified in its current determination as listed in the AER's final decision in its Roll Forward Model and Post-tax Revenue Model and enter information against that Asset Class."]
[]
[null,null,"CPI adjusted Forecast","Actual ","Difference","Movements in provisions \nallocated to \nas-incurred capex"]
[null,"Asset class","$0's, nominal",null," (%)","$0's, nominal"]
[null,"Overhead Subtransmission Lines (Urban)",176429.51546371137,100755.99631341943,{"$f":"IF(C86=0,1,((D86-C86)/C86)*1)","v":-0.42891643697710397},617.13440716077025]
[null,"Underground Subtransmission Lines (Urban)",0,0,{"$f":"IF(C87=0,1,((D87-C87)/C87)*1)","v":1},0]
[null,"Urban Zone Substations",830067.17122445058,1906716.9650753434,1.297063456036579,11678.715777915775]
[null,"Rural Zone Substations",1149666.3772918826,625481.36287431524,-0.45594532881123379,3831.0977429751247]
[null,"SCADA",3404368.9158050888,1020442.6010679281,-0.70025498813291598,6250.2507314075901]
[null,"Distribution Switching Stations (Ground)",267435.04450220679,298113.78955774999,0.11471475293242674,1825.9585882400663]
[null,"Overhead High Voltage Lines Urban",6144448.0074756984,12488117.080994021,1.0324229395057523,76490.204189535463]
[null,"Overhead High Voltage Lines Rural",19692307.005337209,33264364.485767443,0.6892060679712031,203745.52987046115]
[null,"Voltage Regulators on Distribution Feeders",1607539.8952584404,531371.65925253846,-0.66945040628860342,3254.6721377730478]
[null,"Underground High Voltage Lines",6451513.6706653154,7174977.796341002,0.1121386642897835,43947.018845039704]
[null,"Underground High Voltage Lines SWER",0,1063101.7152121421,1,6511.5394693552571]
[null,"Distribution Substations HV (Pole)",161901.83906351478,83790.220165696417,-0.48246282654747885,513.21836654738513]
[null,"Distribution Substations HV (Ground)",3560849.0715539823,4127914.4796790802,0.15925005433539088,25283.637187237229]
[null,"Distribution Substations LV (Pole)",6753525.3573506819,7039661.8028055215,4.2368456519290706E-2,43118.203106965688]
[null,"Distribution Substations LV (Ground)",6028373.4851285545,5888754.0687002009,-2.316037929182423E-2,36068.848347230814]
[null,"Overhead Low Voltage Lines Underbuilt Urban",3561599.7576188557,6843471.052575727,0.92145988272163415,41916.527109868082]
[null,"Overhead Low Voltage Lines Underbuilt Rural",3050174.5962821357,5730177.1348170945,0.87863905948256849,35097.558442291534]
[null,"Overhead Low Voltage Lines Urban",4011036.3468775707,7814838.1103446558,0.94833390538287954,47866.188224497826]
[null,"Overhead Low Voltage Lines Rural",6314620.1957212202,12168268.369195368,0.92699924810055456,74531.118354852413]
[null,"Underground Low Voltage Lines",4493889.5060807429,6359791.7039335323,0.41520873962922583,38953.972234705252]
[null,"Underground Low Voltage Common Trench",898447.88337315642,1232150.3785066404,0.37142109331998485,7546.9691253634928]
[null,"HVST Service Connections",0,0,1,0]
[null,"HV Service Connections",80909.884413553242,76152.331356172115,-5.8800640884170974E-2,466.43599969188648]
[null,"HV Metering CA Service Connections",24479.286482097759,-3559.9845416382841,-1.1454284439312306,-21.805044166019901]
[null,"HV/LV Service Connections",146344.1480781649,137739.01838152081,-5.8800640884170779E-2,843.65685976016596]
[null,"Business LV Service Connections",393502.01614022511,363318.96951384639,-7.6703664500725063E-2,2225.3428586396371]
[null,"Business LV Metering CA Service Connections",711314.45621285541,-203369.22527173426,-1.2859062169978979,-1245.6444367083395]
[null,"Domestic LV Service Connections",3104844.090832938,2901142.64078217,-6.5607626048662854E-2,17769.611826760112]
[null,"Domestic LV Metering CA Service Connections",532764.98337079666,-507454.62638433313,-1.9524924539403374,-3108.1793786299509]
[null,"Wholesale Metering",0,0,1,0]
[null,"HV Metering",0,0,{"$f":"IF(C116=0,1,((D116-C116)/C116)*1)","v":1},0]
[null,"Business LV Metering",0,0,1,0]
[null,"HV/LV Metering",0,0,1,0]
[null,"Business LV Metering",0,0,1,0]
[null,"Domestic LV Metering",0,0,1,0]
[null,"Emergency Network Spares",0,0,1,0]
[null,"Motor Vehicles",2516351.3001822983,3246541.8898993395,0.29017831876818717,19885.195699055261]
[null,"Minor Assets",15690683.049441436,15401278.22726085,-1.8444373726030257E-2,94333.429831141504]
[null,"Non-System Property",1342473.418647256,2240070.603092052,0.66861449320110955,13720.519812411017]
[null,"Spare Parts",0,0,1,0]
[null,"NEM Assets",0,0,1,0]
[null,"Business Services Managements",11615577.162956869,12659100.136165619,8.9838236926929396E-2,77537.482071237158]
[null,"Non-System Land",0,0,1,0]
[null,"Easements",0,755891.84480757278,1,4629.8670311580481]
[null,null,null,null,1]
[null,null,null,null,1]
[null,null,null,null,1]
[null,null,null,null,1]
[null,null,null,null,1]
[null,null,null,null,1]
[null,"Total",{"$f":"SUM(C86:C135)","v":114717437.43883289},{"$f":"SUM(D86:D135)","v":152829112.59824085},0.33222216264836829,{"$f":"SUM(F86:F135)","v":936084.27538977424}]
[]
[]
[null,"8.2.5 - CAPITAL CONTRIBUTIONS BY ASSET CLASS"]
[null,null,"CPI Adjusted Forecast","Actual","Difference"]
[null,"Asset class","$0's, nominal",null," (%)"]
[null,"Overhead Subtransmission Lines (Urban)",31679.784757546422,226771.81950000068,{"$f":"IF(C142=0,1,((D142-C142)/C142)*1)","v":6.1582500081848419}]
[null,"Underground Subtransmission Lines (Urban)",0,0,{"$f":"IF(C143=0,1,((D143-C143)/C143)*1)","v":1}]
[null,"Urban Zone Substations",3633.4560630208712,0,-1]
[null,"Rural Zone Substations",0,0,1]
[null,"SCADA",7266.9121260417423,0,-1]
[null,"Distribution Switching Stations (Ground)",25434.192441146093,0,-1]
[null,"Overhead High Voltage Lines Urban",413108.72798279836,138189.05075000008,-0.66548987859739872]
[null,"Overhead High Voltage Lines Rural",1909395.1157293846,936741.11150000035,-0.50940425908538711]
[null,"Voltage Regulators on Distribution Feeders",0,0,1]
[null,"Underground High Voltage Lines",2743593.9763751957,2565589,-6.4880218395279382E-2]
[null,"Underground High Voltage Lines SWER",0,0,1]
[null,"Distribution Substations HV (Pole)",60280.566872895353,20.909000000000002,-0.99965313863016436]
[null,"Distribution Substations HV (Ground)",264489.67991353938,122715.76050000011,-0.53602817115542889]
[null,"Distribution Substations LV (Pole)",557231.57512651698,338357.79750000016,-0.39278782358451692]
[null,"Distribution Substations LV (Ground)",1397450.2717664361,1597634.5324999997,0.14324964886265495]
[null,"Overhead Low Voltage Lines Underbuilt Urban",13105.602127507935,6261.0447499999991,-0.52226195415635179]
[null,"Overhead Low Voltage Lines Underbuilt Rural",252898.03548871132,127747.75099999999,-0.49486459729457921]
[null,"Overhead Low Voltage Lines Urban",300871.16456293757,123052.90075000009,-0.59101131898514214]
[null,"Overhead Low Voltage Lines Rural",711030.2068636592,321868.54225000012,-0.54732086043185679]
[null,"Underground Low Voltage Lines",1374489.0853845254,1426839.6899999995,3.8087319260762684E-2]
[null,"Underground Low Voltage Common Trench",1374489.0853845254,1426839.6899999995,3.8087319260762684E-2]
[null,"HVST Service Connections",0,0,1]
[null,"HV Service Connections",0,0,1]
[null,"HV Metering CA Service Connections",0,0,1]
[null,"HV/LV Service Connections",0,0,1]
[null,"Business LV Service Connections",0,0,1]
[null,"Business LV Metering CA Service Connections",0,0,1]
[null,"Domestic LV Service Connections",0,0,1]
[null,"Domestic LV Metering CA Service Connections",0,0,1]
[null,"Wholesale Metering",0,0,{"$f":"IF(C171=0,1,((D171-C171)/C171)*1)","v":1}]
[null,"HV Metering",0,0,1]
[null,"Business LV Metering",0,0,1]
[null,"HV/LV Metering",0,0,1]
[null,"Business LV Metering",0,0,1]
[null,"Domestic LV Metering",0,0,1]
[null,"Emergency Network Spares",0,0,1]
[null,"Motor Vehicles",0,0,1]
[null,"Minor Assets",0,0,1]
[null,"Non-System Property",0,0,1]
[null,"Spare Parts",0,0,{"$f":"IF(C181=0,1,((D181-C181)/C181)*1)","v":1}]
[null,"NEM Assets",0,0,1]
[null,"Business Services Managements",null,null,1]
[null,"Non-System Land",null,0,1]
[null,"Easements",null,137625.97,1]
[null,{"$f":"IF(ISBLANK(B130),\"\",B130)","v":""},null,null,1]
[null,"",null,null,1]
[null,"",null,null,1]
[null,"",null,null,1]
[null,"",null,null,1]
[null,"",null,null,1]
[null,"Total",{"$f":"SUM(C142:C191)","v":11440447.43896639},{"$f":"SUM(D142:D191)","v":9496255.5700000022},-0.16994019502632665]
[]
[]
[null,"8.2.6 - DISPOSALS BY ASSET CLASS"]
[null,null,"CPI Adjusted Forecast","Actual","Difference"]
[null,"Asset class","$0's, nominal",null," (%)"]
[null,{"$f":"IF(ISBLANK(B86),\"\",B86)","v":"Overhead Subtransmission Lines (Urban)"},null,null,{"$f":"IF(C198=0,1,((D198-C198)/C198)*1)","v":1}]
[null,"Underground Subtransmission Lines (Urban)",null,null,{"$f":"IF(C199=0,1,((D199-C199)/C199)*1)","v":1}]
[null,"Urban Zone Substations",null,null,1]
[null,"Rural Zone Substations",null,null,1]
[null,"SCADA",null,null,1]
[null,"Distribution Switching Stations (Ground)",null,null,1]
[null,"Overhead High Voltage Lines Urban",null,null,1]
[null,"Overhead High Voltage Lines Rural",null,null,1]
[null,"Voltage Regulators on Distribution Feeders",null,null,1]
[null,"Underground High Voltage Lines",null,null,1]
[null,"Underground High Voltage Lines SWER",null,null,1]
[null,"Distribution Substations HV (Pole)",null,null,1]
[null,"Distribution Substations HV (Ground)",null,null,1]
[null,"Distribution Substations LV (Pole)",null,null,1]
[null,"Distribution Substations LV (Ground)",null,null,1]
[null,"Overhead Low Voltage Lines Underbuilt Urban",null,null,1]
[null,"Overhead Low Voltage Lines Underbuilt Rural",null,null,1]
[null,"Overhead Low Voltage Lines Urban",null,null,1]
[null,"Overhead Low Voltage Lines Rural",null,null,1]
[null,"Underground Low Voltage Lines",null,null,1]
[null,"Underground Low Voltage Common Trench",null,null,1]
[null,"HVST Service Connections",null,null,1]
[null,"HV Service Connections",null,null,1]
[null,"HV Metering CA Service Connections",null,null,1]
[null,"HV/LV Service Connections",null,null,1]
[null,"Business LV Service Connections",null,null,1]
[null,"Business LV Metering CA Service Connections",null,null,1]
[null,"Domestic LV Service Connections",null,null,1]
[null,"Domestic LV Metering CA Service Connections",null,null,1]
[null,"Wholesale Metering",null,null,1]
[null,"HV Metering",null,null,{"$f":"IF(C228=0,1,((D228-C228)/C228)*1)","v":1}]
[null,"Business LV Metering",null,null,1]
[null,{"$f":"IF(ISBLANK(B118),\"\",B118)","v":"HV/LV Metering"},null,null,1]
[null,"Business LV Metering",null,null,1]
[null,"Domestic LV Metering",null,null,1]
[null,"Emergency Network Spares",null,null,1]
[null,"Motor Vehicles",773077.68726126256,468939.20632060239,-0.39341257153354653]
[null,"Minor Assets",null,null,1]
[null,"Non-System Property",null,null,1]
[null,"Spare Parts",null,null,1]
[null,"NEM Assets",null,null,1]
[null,"Business Services Managements",null,null,1]
[null,"Non-System Land",null,null,1]
[null,"Easements",null,null,1]
[null,"",null,null,1]
[null,"",null,null,1]
[null,"",null,null,1]
[null,"",null,null,1]
[null,"",null,null,1]
[null,"",null,null,1]
[null,"Total",{"$f":"SUM(C198:C247)","v":773077.68726126256},{"$f":"SUM(D198:D247)","v":468939.20632060239},-0.39341257153354653]

{"sheet":"8.4 Opex","index":21,"n_rows":142,"n_cols":14,"rows_kept":142,"cut":false,"hidden":false,"merged":[[79,8,79,13],[77,6,78,6],[77,7,78,7],[156,2,156,7],[157,2,157,7],[79,2,79,4],[77,5,78,5],[137,2,137,7],[138,2,138,7],[155,2,155,7],[135,1,135,4],[139,2,139,7],[140,2,140,7],[141,2,141,7],[142,2,142,7],[147,2,147,7],[74,1,74,4],[18,2,18,6],[15,13,17,13],[76,13,78,13],[18,8,18,13],[16,8,16,9],[77,8,77,9],[77,10,77,12],[16,10,16,12],[15,8,15,12],[76,8,76,12],[76,5,76,7],[76,2,78,2],[76,3,78,3],[76,4,78,4],[16,6,17,6],[6,1,6,4],[13,1,13,5],[15,2,17,2],[15,3,17,3],[15,4,17,4],[11,1,11,5],[7,1,7,4],[12,1,12,5],[16,5,17,5],[15,5,15,7],[16,7,17,7],[153,2,153,7],[154,2,154,7],[143,2,143,7],[144,2,144,7],[145,2,145,7],[146,2,146,7],[148,2,148,7],[149,2,149,7],[150,2,150,7],[151,2,151,7],[152,2,152,7]]}
[null,{"$f":"IF(dms_DataQuality=\"backcast\",INDEX(dms_Worksheet_List,MATCH(dms_Model,dms_Model_List))&\" BACKCAST\",INDEX(dms_Worksheet_List,MATCH(dms_Model,dms_Model_List)))","v":"ANNUAL REPORTING STATEMENT"}]
[null,{"$f":"INDEX(dms_TradingNameFull_List,MATCH(dms_TradingName,dms_TradingName_List))","v":"TasNetworks (D)"}]
[null,{"$f":"CONCATENATE(\"Annual Reporting RIN Response \",IF(SUM(dms_SingleYear_Model)>0,CONCATENATE(CRY),CONCATENATE(FRCP_y1,\" to \",dms_MultiYear_FinalYear_Result)))","v":"Annual Reporting RIN Response 2017-18"}]
[null,"8.4 OPEX"]
[]
[null,"Instructions"]
[null,"Forecast expenditure is to be taken from Australian Distribution Co.'s distribution determination."]
[null,"If allocating based on assumptions then provide method in Basis of Preparation.  \n\nAll adjustments must be explained in Basis of Preparation with supporting documentation attached. "]
[]
[null,"8.4.1 - OPERATING & MAINTENANCE EXPENDITURE - BY PURPOSE"]
[]
[null,"Australian Distribution Co. is to list the operating expenditure categories identified in Australian Distribution Co.'s regulatory proposal at table 3.2.1.1 current opex categories and cost allocations."]
[null,"Australian Distribution Co. must specify any expenditure category where the expense is more than 5 per cent of the total standard control services operating expenditure."]
[null,"Reported operating expenditure must INCLUDE any profit margins or management fees paid directly or indirectly to related party contractors (not including actual incurred expenditure of the related party contractor) for the regulatory reporting period.  "]
[]
[null,null,"Audited Statutory Accounts","Adjustments","Distribution business","Standard Control Services",null,null,"Alternative Control Services",null,null,null,null,"Negotiated Services"]
[null,null,null,null,null,"CPI Adjusted Forecast","Actual","Difference","Public Lighting",null,"Other"]
[null,null,null,null,null,null,null,null,{"$f":"IF(dms_Jurisdiction=\"Vic\",\"Energy efficient\",\"\")","v":""},{"$f":"IF(dms_Jurisdiction=\"Vic\",\"Non-energy efficient\",\"\")","v":""},"Connection services","Metering services","Ancillary network services"]
[null,"Opex category","$0's, nominal",null,null,null,null,"%","$0's, nominal"]
[null,"Routine Overhead network and structures",7196025.978753252,null,7196025.978753252,5842616.6274245651,7196025.978753252,{"$f":"IF(F20=0,1,((G20-F20)/F20)*1)","v":0.23164438771764354}]
[null,"Routine Underground network",58316.325416394095,null,58316.325416394095,194892.92814398836,58316.325416394095,-0.70077762199093463]
[null,"Routine Ground mounted substations",1085904.4853890166,null,1085904.4853890166,826936.57642337226,1085904.4853890166,0.31316538214541229]
[null,"Routine Zone substations",1206403.8243664906,null,1206403.8243664906,1474195.1341547803,1206403.8243664906,-0.18165255303316818]
[null,"Other network asset maintenance - routine costs",17276216.78119196,null,17276216.78119196,1821172.5397946632,1744033.8479292633,-0.345332138232122,null,2668887.4057064131,null,8502943.5597199369,4360351.9678363474]
[null,"Routine Vegetation management",29150170.246475436,null,29150170.246475436,18122534.191493526,29150170.246475436,0.60850408328423156]
[null,"Routine Connection asset repair",742875.26376616035,null,742875.26376616035,918622.89487990586,742875.26376616035,-0.19131640643108672]
[null,"Other  non network asset maintenance - routine costs",1164581.187062684,null,1164581.187062684,842825.41975025763,1164581.187062684,1]
[null,"Non-routine Overhead network & structures",6414815.5594315883,null,6414815.5594315883,6254775.1850366173,6414815.5594315883,2.5586910745863046E-2]
[null,"Non-routine Underground network",470467.62912135682,null,470467.62912135682,507370.36039249512,470467.62912135682,-7.2733320966149512E-2]
[null,"Non-routine Ground mounted substations",583256.39351003838,null,583256.39351003838,727423.96801110404,583256.39351003838,-0.19818920030260118]
[null,"Non-routine Zone substations",33187.875669821689,null,33187.875669821689,55783.211215568976,33187.875669821689,-0.40505619976644469]
[null,"Non-routine Decommissioned assets",1442103.2906661336,null,1442103.2906661336,1364307.7074557899,1442103.2906661336,5.7022021341079816E-2]
[null,"Non-routine Connection assets",0,null,0,0,null,1]
[null,"Non-routine Other network asset maintenance - non-routine costs",1753913.1938731198,null,1753913.1938731198,1303737.8687049276,1753913.1938731198,0.3452958880571409]
[null,"Emergency and unscheduled power system response & repair",25622808.633812245,null,25622808.633812245,22825235.85337843,25622808.633812245,{"$f":"IF(F35=0,1,((G35-F35)/F35)*1)","v":0.12256490134009888}]
[null,null,0,null,null,0,null,1]
[null,"Connection asset repair",81933.21920121646,null,81933.21920121646,90640.534943460239,81933.21920121646,-9.6064258090215709E-2]
[null,"Alternative Control - Quoted Services",5892014.6429943107,5892014.6429943107,null,null,null,1]
[null,"Unclassified Distribution",8408957.0303533189,8408957.0303533189,null,null,null,1]
[null,"Transmission",39624794.565081894,39624794.565081894,null,null,null,1]
[null,"Other Non Regulated Services",933304.21557582053,933304.21557582053,null,null,null,{"$f":"IF(F41=0,1,((G41-F41)/F41)*1)","v":1}]
[null,"GSLs",3167184.96,null,3167184.96,2434974.007368573,3167184.96,0.30070585986365927]
[null,"Nem Fees",644000,null,644000,451424.14412645798,644000,0.42659626955973257]
[null,"Electrical Inspector Fee",3854365.02,null,3854365.02,2212258.5551454006,3854365.02,0.74227601517701991]
[null,"Other Non Network Costs",0,null,0,0,null,1]
[null,"Feed In Tarriff",10261327.48,10261327.48,0,0,null,1]
[null,"Demand Management Incentive Scheme",1114528.9450508519,1114528.9450508519,0,null,null,1]
[null,null,null,null,null,null,null,1]
[null,null,null,null,null,null,null,1]
[null,null,null,null,null,null,null,1]
[null,null,null,null,null,null,null,1]
[null,null,null,null,null,null,null,1]
[null,null,null,null,null,null,null,1]
[null,null,null,null,null,null,null,1]
[null,null,null,null,null,null,null,1]
[null,null,null,null,null,null,null,1]
[null,null,null,null,null,null,null,1]
[null,null,null,null,null,null,null,1]
[null,null,null,null,null,null,null,1]
[null,null,null,null,null,null,null,1]
[null,null,null,null,null,null,null,1]
[null,null,null,null,null,null,null,1]
[null,null,null,null,null,null,null,1]
[null,null,null,null,null,null,null,1]
[null,null,null,null,null,null,null,1]
[null,null,null,null,null,null,null,1]
[null,null,null,null,null,null,null,1]
[null,null,null,null,null,null,null,1]
[null,null,null,null,null,null,null,1]
[null,"Total",{"$f":"SUM(C20:C69)","v":168183456.74676314},66234926.8790562,101948529.86770691,68271727.7078439,86416346.934444219,0.26577061743986952,{"$f":"SUM(I20:I69)","v":0},2668887.4057064131,0,8502943.5597199369,4360351.9678363474,0]
[]
[]
[null,"8.4.2 - OPERATING & MAINTENANCE EXPENDITURE - BY PURPOSE - MARGINS ONLY"]
[]
[null,"\"Related party margin expenditure' must COMPRISE ONLY profit margins or management fees paid directly or indirectly to related party contractors (for expenditure that is not an actual incurred expenditure of the related party contractor) for the regulatory reporting period."]
[]
[null,null,"Audited Statutory Accounts","Adjustments","Distribution business","Standard Control Services",null,null,"Alternative Control Services",null,null,null,null,"Negotiated Services"]
[null,null,null,null,null,"CPI Adjusted Forecast","Actual","Difference","Public Lighting",null,"Other"]
[null,null,null,null,null,null,null,null,{"$f":"IF(dms_Jurisdiction=\"Vic\",\"Energy efficient\",\"\")","v":""},{"$f":"IF(dms_Jurisdiction=\"Vic\",\"Non-energy efficient\",\"\")","v":""},"Connection services","Metering services","Ancillary network services"]
[null,"Opex category","$0's, nominal",null,null,null,"$0's, nominal","per cent","$0's, nominal"]
[null,{"$f":"IF(ISBLANK(B20),\"\",B20)","v":"Routine Overhead network and structures"},null,null,null,null,null,{"$f":"IF(F81=0,1,((G81-F81)/F81)*1)","v":1}]
[null,"Routine Underground network",null,null,null,null,null,1]
[null,"Routine Ground mounted substations",null,null,null,null,null,1]
[null,"Routine Zone substations",null,null,null,null,null,1]
[null,"Other network asset maintenance - routine costs",null,null,null,null,null,1]
[null,"Routine Vegetation management",null,null,null,null,null,1]
[null,"Routine Connection asset repair",null,null,null,null,null,1]
[null,"Other  non network asset maintenance - routine costs",null,null,null,null,null,{"$f":"IF(F88=0,1,((G88-F88)/F88)*1)","v":1}]
[null,"Non-routine Overhead network & structures",null,null,null,null,null,1]
[null,"Non-routine Underground network",null,null,null,null,null,1]
[null,"Non-routine Ground mounted substations",null,null,null,null,null,1]
[null,"Non-routine Zone substations",null,null,null,null,null,1]
[null,"Non-routine Decommissioned assets",null,null,null,null,null,1]
[null,"Non-routine Connection assets",null,null,null,null,null,1]
[null,"Non-routine Other network asset maintenance - non-routine costs",null,null,null,null,null,1]
[null,"Emergency and unscheduled power system response & repair",null,null,null,null,null,1]
[null,"",null,null,null,null,null,{"$f":"IF(F97=0,1,((G97-F97)/F97)*1)","v":1}]
[null,"Connection asset repair",null,null,null,null,null,1]
[null,"Alternative Control - Quoted Services",null,null,null,null,null,1]
[null,"Unclassified Distribution",null,null,null,null,null,1]
[null,"Transmission",null,null,null,null,null,1]
[null,"Other Non Regulated Services",null,null,null,null,null,1]
[null,"GSLs",null,null,null,null,null,{"$f":"IF(F103=0,1,((G103-F103)/F103)*1)","v":1}]
[null,"Nem Fees",null,null,null,null,null,1]
[null,"Electrical Inspector Fee",null,null,null,null,null,1]
[null,"Other Non Network Costs",null,null,null,null,null,1]
[null,"Feed In Tarriff",null,null,null,null,null,1]
[null,"Demand Management Incentive Scheme",null,null,null,null,null,1]
[null,"",null,null,null,null,null,1]
[null,"",null,null,null,null,null,1]
[null,"",null,null,null,null,null,1]
[null,"",null,null,null,null,null,1]
[null,"",null,null,null,null,null,1]
[null,"",null,null,null,null,null,1]
[null,"",null,null,null,null,null,1]
[null,"",null,null,null,null,null,1]
[null,"",null,null,null,null,null,1]
[null,"",null,null,null,null,null,1]
[null,"",null,null,null,null,null,1]
[null,"",null,null,null,null,null,1]
[null,"",null,null,null,null,null,1]
[null,"",null,null,null,null,null,1]
[null,"",null,null,null,null,null,1]
[null,"",null,null,null,null,null,1]
[null,"",null,null,null,null,null,1]
[null,"",null,null,null,null,null,1]
[null,"",null,null,null,null,null,1]
[null,"",null,null,null,null,null,1]
[null,"",null,null,null,null,null,1]
[null,"",null,null,null,null,null,1]
[null,"Total",{"$f":"SUM(C81:C130)","v":0},{"$f":"SUM(D81:D130)","v":0},{"$f":"SUM(E81:E130)","v":0},{"$f":"SUM(F81:F130)","v":0},{"$f":"SUM(G81:G130)","v":0},1,{"$f":"SUM(I81:I130)","v":0},0,0,0,0,0]
[]
[]
[null,"8.4.3 - OPERATING & MAINTENANCE EXPENDITURE - EXPLANATION OF MATERIAL DIFFERENCE"]
[]
[null,"Where the difference between forecast and actual expenditure shown in table 8.4.1, column I is a Material Difference please explain the main factors driving the difference."]
[]
[null,"Category","Explanation"]
[null,"Routine Overhead network and structures","Higher overhead network expenditure due to higher fault levels "]
[null,"Routine Vegetation management","Bushfire risks posed due to vegetation were higher than previously understood, especially in light of experiences interstate. The operating expenditure had to increase to prudently address these risks."]
[null,"Emergency and unscheduled power system response & repair","Higher emergency response and repair costs resulting from major weather events"]
[null,"Electrical Inspector Fee","The forecast had electrical inspection costs allocated to other forms of control. It has now been correctly allocated to Standard control services"]

{"sheet":"9.5 TUoS","index":22,"n_rows":67,"n_cols":6,"rows_kept":67,"cut":false,"hidden":false,"merged":[[5,1,5,3],[26,1,26,3],[30,2,30,5],[42,1,42,4],[31,2,31,5],[9,1,9,4],[12,1,12,4],[13,1,13,4],[14,1,14,4],[20,1,20,4],[23,1,23,4],[15,1,15,3],[10,1,10,4],[11,1,11,4],[21,1,21,4],[22,1,22,4],[57,1,57,4],[61,1,61,4],[59,1,59,4],[62,1,62,4],[63,1,63,4],[64,1,64,4],[58,1,58,4],[24,1,24,4],[25,1,25,4],[66,1,66,4],[60,1,60,4],[55,1,55,4],[65,1,65,4],[47,1,47,4],[51,1,51,4],[52,1,52,4],[53,1,53,4],[54,1,54,4],[48,1,48,4],[49,1,49,4],[50,1,50,4]]}
[null,{"$f":"IF(dms_DataQuality=\"backcast\",INDEX(dms_Worksheet_List,MATCH(dms_Model,dms_Model_List))&\" BACKCAST\",INDEX(dms_Worksheet_List,MATCH(dms_Model,dms_Model_List)))","v":"ANNUAL REPORTING STATEMENT"}]
[null,{"$f":"INDEX(dms_TradingNameFull_List,MATCH(dms_TradingName,dms_TradingName_List))","v":"TasNetworks (D)"}]
[null,{"$f":"CONCATENATE(\"Annual Reporting RIN Response \",IF(SUM(dms_SingleYear_Model)>0,CONCATENATE(CRY),CONCATENATE(FRCP_y1,\" to \",dms_MultiYear_FinalYear_Result)))","v":"Annual Reporting RIN Response 2017-18"}]
[null,"9.5 - TUoS AUDIT (t-2)"]
[]
[null,"This template collects information for annual pricing proposals from Victorian businesses only.\n"]
[]
[null,"9.5.1 - TUOS CHARGES (AEMO)"]
[null,null,null,null,null,{"$f":"CRY","v":"2017-18"}]
[]
[]
[]
[]
[]
[]
[null,null,null,null,"Total",{"$f":"SUM(F10:F15)","v":0}]
[]
[]
[null,"9.5.2 - TRANSMISSION CONNECTION FEES"]
[null,null,null,null,null,{"$f":"CRY","v":"2017-18"}]
[]
[]
[]
[]
[]
[]
[null,null,null,null,"Total",{"$f":"SUM(F21:F26)","v":0}]
[]
[]
[null,"9.5.3 - CROSS BOUNDARY NETWORK CHARGES"]
[null,null,"Amount (payable)/receivable"]
[null,null,"$0's, nominal"]
[null,null,"HV crossings","Subtransmission crossings","TUoS Adjustment","Total"]
[null,"Distribution Business",null,null,null,{"$f":"CRY","v":"2017-18"}]
[null,null,null,null,null,{"$f":"IF((SUM(C35:E35)=0),\"\",(SUM(C35:E35)))","v":""}]
[null,null,null,null,null,{"$f":"IF((SUM(C36:E36)=0),\"\",(SUM(C36:E36)))","v":""}]
[null,null,null,null,null,""]
[null,null,null,null,null,""]
[null,null,null,null,null,""]
[null,null,null,null,null,""]
[null,null,null,null,null,""]
[null,null,null,null,null,""]
[null,"Total",null,null,null,""]
[]
[]
[null,"9.5.4 - PAYMENTS TO EMBEDDED GENERATORS"]
[null,"9.5.4.1 - AVOIDED TRANSMISSION COSTS",null,null,null,"2016-17"]
[]
[]
[]
[]
[]
[]
[]
[]
[null,"Total",null,null,null,{"$f":"SUM(F48:F55)","v":0}]
[null,"9.5.4.2 - AVOIDED TUoS USAGE CHARGES",null,null,null,"2016-17"]
[]
[]
[]
[]
[]
[]
[]
[]
[null,"Total",null,null,null,{"$f":"SUM(F58:F65)","v":0}]
[null,"Total payments to embedded generators",null,null,null,{"$f":"F66+F56","v":0}]