{"text_format":"1","workbook":"xlsx","n_sheets":23,"sheets":["AER only","Instructions","Contents","Business & other details","2.11 Labour","3.6 Quality of services","3.6.8 Network-feeders","3.6.9 Network-reliability","4.1 Public lighting","6.2 STPIS Reliability","6.6 STPIS Customer Service","6.7 STPIS Daily Performance","6.8 STPIS Exclusions","6.9 STPIS - GSL","7.8 Avoided TUOS Payments","7.10 Juris Scheme","7.11 DMIS-DMIA","7.12 Safety and Bushfire","7.13 TARC","8.1 Income","8.2 Capex","8.4 Opex","9.5 TUoS"],"not_rendered":{"charts":0,"images":12,"macros":1,"external_links":2,"defined_names":575,"comments":3,"pivot_tables":0},"unopened":[],"bounds":{"document_bytes":16777216,"sheet_cells":100000,"rows_first":2000,"rows_last":500,"rows_between":2000,"halvings":0,"cell_chars":16384,"cell_head_chars":4096},"cells_cut":0,"cells_raw":0,"read":"whole","date_system":"1900"}

{"sheet":"AER only","index":0,"n_rows":149,"n_cols":39,"rows_kept":149,"cut":false,"hidden":true,"merged":[[54,35,56,35],[0,1,0,11],[4,24,4,34],[5,24,5,27],[5,30,5,34],[52,24,52,28],[52,29,52,32],[53,1,53,5],[53,14,53,21],[53,24,53,28],[53,29,53,32],[54,2,54,3],[57,35,61,35],[65,35,66,35],[71,14,71,15],[71,24,71,27],[109,1,109,8]]}
[null,"Data in these columns used for data validation and database purposes."]
[null,"Date last modified:","2017-01-16","added (Albury and Victora) for AGN"]
[null,null,"2016-10-17","updated TransGrid's correct legal name, corrected TasNetworks (T) to June financial year"]
[null,null,"2017-02-01","inserted Power and Water, added NRs (dms_FeederCat_1 and dms_FeederCat_2)"]
[null,null,"2017-03-03","inserted AEMO as a business",null,null,null,null,null,null,null,null,null,null,null,null,null,null,null,null,null,null,null,null,"FOR ELECTRICITY BUSINESSES ONLY"]
[null,null,null,null,null,null,null,null,null,null,null,null,null,null,null,null,null,null,null,null,null,null,null,null,"Feeder Types",null,null,null,"TasNetworks (D)","MAIFI flag","Feeder Names"]
[null,null,null,null,null,null,null,null,null,null,null,null,null,null,null,null,null,null,null,null,null,null,null,null,"CBD","Urban","Short rural","long rural","EXTRA"]
[null,"dms_TradingName_List","dms_TradingNameFull_List","dms_ABN_List","dms_JurisdictionList","dms_Sector_List","dms_Segment_List","dms_FormControl_List","dms_RPT_List","dms_RPTMonth_List","dms_CRCPlength_List","dms_FRCPlength_List","dms_663_List","dms_DeterminationRef_List","dms_Addr1_List","dms_Addr2_List","dms_Suburb_List","dms_State_List","dms_PostCode_List","dms_PAddr1_List","dms_PAddr2_List","dms_PSuburb_List","dms_PState_List","dms_PPostCode_List","dms_CBD_flag","dms_Urban_flag","dms_ShortRural_flag","dms_LongRural_flag","dms_FeederType_5_flag","dms_MAIFI_flag_List","dms_FeederName_1","dms_FeederName_2","dms_FeederName_3","dms_FeederName_4","dms_FeederName_5","Column1"]
[null,"ActewAGL Distribution","ActewAGL Distribution",76670568688,"ACT","Electricity","Distribution","Revenue cap","Financial","June",5,5,5,"2014-19 Distribution Determination","40 Bunda Street",null,"CANBERRA","ACT","2600","GPO BOX 366",null,"CANBERRA","ACT",2601,"NO","YES","YES","NO","NO",null,"CBD","Urban","Short rural","Long rural",null,"ActewAGL Distribution"]
[null,"ActewAGL Distribution (Tx Assets)","ActewAGL Distribution (Tx Assets)",76670568688,"ACT","Electricity","Distribution","Revenue cap","Financial","June",5,5,5,"distribution determination","40 Bunda Street",null,"CANBERRA","ACT","2600","GPO BOX 366",null,"CANBERRA","ACT",2601,null,null,null,null,null,null,"CBD","Urban","Short rural","Long rural",null,"ActewAGL Distribution (Tx Assets)"]
[null,"ActewAGL Gas","ActewAGL Gas",76670568688,"ACT","Gas","Distribution","Weighted average price cap","Financial","June",5,5,"x",null,"40 Bunda Street",null,"CANBERRA","ACT","2600","GPO BOX 366",null,"CANBERRA","ACT",2601,null,null,null,null,null,null,null,null,null,null,null,"ActewAGL Gas"]
[null,"AEMO","Australian Energy Market Operator Ltd",94072010327,"Vic","Electricity","Transmission","-","Financial","March",5,5,"x","-","Level 22","530 Collins Street","MELBOURNE","VIC","3000","GPO Box 2008",null,"MELBOURNE","VIC","3001",null,null,null,null,null,null,null,null,null,null,null,"AEMO"]
[null,"AGN (Albury and Victoria)","Australian Gas Networks Limited (reporting data for Albury and Victoria)",19078551685,"Vic","Gas","Distribution","Weighted average price cap","Calendar","December",5,5,"x",null,"Level 6","400 King William Street","ADELAIDE","SA","5000","PO Box 6468","Halifax Street","ADELAIDE","SA","5000",null,null,null,null,null,null,"CBD","Urban","Short rural","Long rural",null,"AGN (Albury)"]
[null,"AGN (Albury)","Australian Gas Networks Limited (reporting data for Albury)",19078551685,"Vic","Gas","Distribution","Weighted average price cap","Calendar","December",5,5,"x",null,"Level 6","400 King William Street","ADELAIDE","SA","5000","PO Box 6468","Halifax Street","ADELAIDE","SA","5000",null,null,null,null,null,null,"CBD","Urban","Short rural","Long rural"]
[null,"AGN (SA)","Australian Gas Networks Limited (reporting data for SA)",19078551685,"SA","Gas","Distribution","Weighted average price cap","Financial","June",5,5,5,"distribution determination","Level 6","400 King William Street","ADELAIDE","SA","5000","PO Box 6468","Halifax Street","ADELAIDE","SA","5000",null,null,null,null,null,null,null,null,null,null,null,"AGN (SA)"]
[null,"AGN (Victoria)","Australian Gas Networks Limited (reporting data for Victoria)",19078551685,"Vic","Gas","Distribution","Weighted average price cap","Calendar","December",5,5,"x",null,"Level 6","400 King William Street","ADELAIDE","SA","5000","PO Box 6468","Halifax Street","ADELAIDE","SA","5000",null,null,null,null,null,null,null,null,null,null,null,"AGN (Victoria)"]
[null,"Amadeus","APT Pipelines (NT) Pty Ltd",39009737393,"NT","Gas","Transmission","Weighted average price cap","Financial","June",5,5,"x","n/a","Level 19, HSBC Building","580 George Street","SYDNEY","NSW","2000","Level 19, HSBC Building","580 George Street","SYDNEY","NSW","2000",null,null,null,null,null,null,null,null,null,null,null,"Amadeus"]
[null,"APA GasNet","APA GasNet Australia (Operations) Pty Ltd","065083009","Vic","Gas","Transmission","Weighted average price cap","Calendar","December",5,5,"x",null,"Level 19, HSBC Building","580 George Street","SYDNEY","NSW","2000","PO Box R41",null,"ROYAL EXCHANGE","NSW","1225",null,null,null,null,null,null,null,null,null,null,null,"APA GasNet"]
[null,"Ausgrid","Ausgrid",78508211731,"NSW","Electricity","Distribution","Revenue cap","Financial","June",5,5,5,"2014-19 Distribution Determination","570 George St",null,"SYDNEY","NSW",2000,"GPO Box 4009",null,"SYDNEY","NSW","2001","YES","YES","YES","YES","NO",null,"CBD","Urban","Short rural","Long rural",null,"Ausgrid"]
[null,"Ausgrid (Tx Assets)","Ausgrid (Tx Assets)",67505337385,"NSW","Electricity","Distribution","Revenue cap","Financial","June",5,5,5,"distribution determination","570 George St",null,"SYDNEY","NSW",2000,"GPO Box 4009",null,"SYDNEY","NSW","2001",null,null,null,null,null,null,"CBD","Urban","Short rural","Long rural",null,"Ausgrid (Tx Assets)"]
[null,"AusNet (D)","AusNet Electricity Services Pty Ltd",91064651118,"Vic","Electricity","Distribution","Revenue cap","Calendar","December",5,5,2,"2016-20 Distribution Determination","Level 32","2 Southbank Boulevard","SOUTHBANK","Vic","3006","Locked Bag 14051",null,"MELBOURNE CITY MAIL CENTRE","VIC",8001,null,"YES","YES","YES","NO",null,"CBD","Urban","Short rural","Long rural",null,"AusNet (D)"]
[null,"AusNet (Gas)","AusNet Gas Services","086015036","Vic","Gas","Distribution","Weighted average price cap","Calendar","December",5,5,"X",null,"Level 19, HSBC Building","580 George Street","SYDNEY","NSW","2000","PO Box R41",null,"ROYAL EXCHANGE","NSW","1225",null,null,null,null,null,null,null,null,null,null,null,"AusNet (Gas)"]
[null,"AusNet (T)","Ausnet Services (Transmission) Ltd",48116124362,"Vic","Electricity","Transmission","Revenue cap","Financial","March",5,5,2,"transmission determination","Level 32","2 Southbank Boulevard","SOUTHBANK","Vic","3006","Locked Bag 14051",null,"MELBOURNE CITY MAIL CENTRE","Vic","8001",null,null,null,null,null,null,"CBD","Urban","Short rural","Long rural",null,"AusNet (T)"]
[null,"Australian Distribution Co.","Australian Distribution Co.",11222333444,"-","Electricity","Distribution","Revenue cap","Financial","June",5,5,2,"distribution determination","123 Straight Street",null,"SYDNEY","NSW","2000","PO Box 123",null,"SYDNEY","NSW",2000,null,null,null,null,null,null,"CBD","Urban","Short rural","Long rural",null,"Australian Distribution Co."]
[null,"Australian Distribution Co. (Vic)","Australian Distribution Co. (Victoria)",11222333444,"Vic","Electricity","Distribution","Revenue cap","Calendar","December",5,5,2,"distribution determination","123 Straight Street",null,"MELBOURNE","Vic","3000","PO Box 123",null,"MELBOURNE","VIC","3000",null,null,null,null,null,null,"CBD","Urban","Short rural","Long rural",null,"Australian Distribution Co. (Vic)"]
[null,"Australian Transmission Co.","Australian Transmission Co.",11222333444,"-","Electricity","Transmission","Revenue cap","Financial","June",5,5,5,"transmission determination","123 Straight Street",null,"SYDNEY","NSW","2000","PO Box 123",null,"SYDNEY","NSW",2000,null,null,null,null,null,null,"CBD","Urban","Short rural","Long rural",null,"Australian Transmission Co."]
[null,"Central Ranges Pipeline (D)","Central Ranges Pipeline Pty Ltd",108218355,"NSW","Gas","Distribution","Weighted average price cap","Financial","June",15,5,5,"distribution determination","Level 19","580 George Street","SYDNEY","NSW","2000","PO Box R41",null,"ROYAL EXCHANGE","NSW","1225"]
[null,"Central Ranges Pipeline (T)","Central Ranges Pipeline Pty Ltd",108218355,"NSW","Gas","Distribution","Weighted average price cap","Financial","June",14,5,5,"transmission determination","Level 19","580 George Street","SYDNEY","NSW","2000","PO Box R41",null,"ROYAL EXCHANGE","NSW","1225"]
[null,"CitiPower","CitiPower",76064651056,"Vic","Electricity","Distribution","Revenue cap","Calendar","December",5,5,2,"2016-20 Distribution Determination","40 Market Street",null,"MELBOURNE","Vic","3000","Locked Bag 14090",null,"MELBOURNE","VIC",8001,"YES","YES","NO","NO","NO",null,"CBD","Urban","Short rural","Long rural",null,"CitiPower"]
[null,"Directlink","Directlink",16779340889,"Qld","Electricity","Transmission","Revenue cap","Financial","June",9,5,5,"transmission determination","Level 19, HSBC Building","580 George Street","SYDNEY","NSW","2000","PO Box R41",null,"ROYAL EXCHANGE","NSW","1225",null,null,null,null,null,null,"CBD","Urban","Short rural","Long rural",null,"Directlink"]
[null,"ElectraNet","ElectraNet",41094482416,"SA","Electricity","Transmission","Revenue cap","Financial","June",5,5,5,"transmission determination","52-55 East Terrace","Rymill Park","ADELAIDE","SA","5000","PO Box 7096","Hutt Street Post Office","ADELAIDE","SA",5000,null,null,null,null,null,null,"CBD","Urban","Short rural","Long rural",null,"ElectraNet"]
[null,"Endeavour Energy","Endeavour Energy",11247365823,"NSW","Electricity","Distribution","Revenue cap","Financial","June",5,5,5,"2014-19 Distribution Determination","51 Huntingwood Drive",null,"HUNTINGWOOD","NSW","2148","PO Box 811",null,"SEVEN HILLS","NSW","1730","NO","YES","YES","YES","NO",null,"CBD","Urban","Short rural","Long rural",null,"Endeavour Energy"]
[null,"Energex","Energex",40078849055,"Qld","Electricity","Distribution","Revenue cap","Financial","June",5,5,5,"2015-20 Distribution Determination","26 Reddacliff Street",null,"NEWSTEAD","Qld","4006","26 Reddacliff Street",null,"NEWSTEAD","QLD","4006","YES","YES","YES","NO","NO",null,"CBD","Urban","Short rural","Long rural",null,"Energex"]
[null,"Ergon Energy","Ergon Energy",50087646062,"Qld","Electricity","Distribution","Revenue cap","Financial","June",5,5,5,"2015-20 Distribution Determination","22 Walker Street",null,"TOWNSVILLE","Qld","4810","Po Box 264",null,"FORTITUDE VALLEY","QLD",4006,"NO","YES","YES","YES","NO",null,"CBD","Urban","Short rural","Long rural",null,"Ergon Energy"]
[null,"Essential Energy","Essential Energy",37428185226,"NSW","Electricity","Distribution","Revenue cap","Financial","June",5,5,5,"2014-19 Distribution Determination","8 Buller Street",null,"PORT MACQUARIE","NSW","2444","PO Box 5730",null,"PORT MACQUARIE","NSW","2444",null,null,"YES","YES","NO",null,"CBD","Urban","Short rural","Long rural",null,"Essential Energy"]
[null,"Jemena Electricity","Jemena Electricity",82064651083,"Vic","Electricity","Distribution","Revenue cap","Calendar","December",5,5,2,"2016-20 Distribution Determination","Level 16","567 Collins Street","MELBOURNE","VIC","3000","PO Box 16182",null,"MELBOURNE","VIC",8001,null,null,"YES","NO","NO",null,"CBD","Urban","Short rural","Long rural",null,"Jemena Electricity"]
[null,"JGN","Jemena Gas Networks (NSW) Ltd","003 004 322","NSW","Gas","Distribution","Weighted average price cap","Financial","June",5,5,null,null,null,null,null,null,null,null,null,null,null,null,null,null,null,null,null,null,null,null,null,null,null,"JGN"]
[null,"Multinet Gas","Multinet Gas (DB No.1) Pty Ltd (ACN 086 026 986), Multinet Gas (DB No.2) Pty Ltd (ACN 086 230 122)","086026986","Vic","Gas","Distribution","Weighted average price cap","Calendar","December",5,5,"x",null,"43-45 Centreway",null,"MT WAVERLEY","Vic","3149",null,null,null,null,null,null,null,null,null,null,null,null,null,null,null,null,"Multinet Gas"]
[null,"Murraylink","Murraylink",79181207909,"SA","Electricity","Transmission","Revenue cap","Financial","June",5,5,5,"transmission determination","Level 19","580 George Street","SYDNEY","NSW","2000","PO Box R41",null,"ROYAL EXCHANGE","NSW","1225",null,null,null,null,null,null,"CBD","Urban","Short rural","Long rural",null,"Murraylink"]
[null,"Power and Water","Power and Water Corporation",15947352360,"NT","Electricity","Distribution","Revenue cap","Financial","June",5,5,"x","distribution determination","GPO Box 1921",null,"DARWIN","NT","0801","GPO Box 1921",null,"DARWIN","NT","0801","YES","YES","YES","YES","NO"]
[null,"Powercor Australia","Powercor Australia",89064651109,"Vic","Electricity","Distribution","Revenue cap","Calendar","December",5,5,2,"2016-20 Distribution Determination","40 Market Street",null,"MELBOURNE","Vic","3000","Locked bag 14090",null,"MELBOURNE","VIC",8001,null,null,"YES","YES","NO",null,"CBD","Urban","Short rural","Long rural",null,"Powercor Australia"]
[null,"Powerlink","Queensland Electricity Transmission Corporation Limited trading as Powerlink Queensland",82078849233,"Qld","Electricity","Transmission","Revenue cap","Financial","June",5,5,5,"transmission determination","33 Harold St",null,"VIRGINIA","Qld","4014","PO Box 1193",null,"VIRGINIA","QLD",4014,null,null,null,null,null,null,"CBD","Urban","Short rural","Long rural",null,"Powerlink"]
[null,"Roma to Brisbane Pipeline","APT Petroleum Pipelines Limited t/a Roma to Brisbane Pipeline","009 737 393","Qld","Gas","Transmission","Weighted average price cap","Financial","June",5,5,"x","n/a","580 George Street",null,"SYDNEY","NSW","2000","PO Box R41",null,"ROYAL EXCHANGE","NSW","1225",null,null,null,null,null,null,"CBD","Urban","Short rural","Long rural",null,"Roma to Brisbane Pipeline"]
[null,"SA Power Networks","SA Power Networks",13332330749,"SA","Electricity","Distribution","Revenue cap","Financial","June",5,5,5,"2015-20 Distribution Determination","1 Anzac Highway",null,"KESWICK","SA","5035","GPO Box 77",null,"ADELAIDE","SA","5000",null,null,"YES","YES","NO",null,"CBD","Urban","Short rural","Long rural",null,"SA Power Networks"]
[null,"TasNetworks (D)","TasNetworks (D)",24167357299,"Tas","Electricity","Distribution","Revenue cap","Financial","June",5,5,5,"distribution determination","1-7 Maria Street",null,"LENAH VALLEY","Tas","7008","PO Box 606",null,"MOONAH","Tas","7009",null,null,"YES","YES","YES",null,"Critical Infrastructure","High density commercial","Urban","High density rural","Low density rural","TasNetworks (D)"]
[null,"TasNetworks (T)","TasNetworks (T)",24167357299,"Tas","Electricity","Transmission","Revenue cap","Financial","June",5,5,5,"transmission determination","1-7 Maria Street",null,"LENAH VALLEY","Tas","7008","PO Box 606",null,"MOONAH","Tas","7009",null,null,null,null,null,null,"CBD","Urban","Short rural","Long rural",null,"TasNetworks (T)"]
[null,"TransGrid","NSW Electricity Networks Operations Pty Ltd trading as TransGrid",609169959,"NSW","Electricity","Transmission","Revenue cap","Financial","June",5,4,5,"transmission determination","180 Thomas Street",null,"SYDNEY","NSW","2000","PO Box A1000",null,"SYDNEY SOUTH","NSW","1235",null,null,null,null,null,null,"CBD","Urban","Short rural","Long rural",null,"TransGrid"]
[null,"United Energy","United Energy",70064651029,"Vic","Electricity","Distribution","Revenue cap","Calendar","December",5,5,2,"2016-20 Distribution Determination","Level 3","6 Nexus Court","MULGRAVE","Vic","3149","PO Box 449",null,"MOUNT WAVERLEY","VIC",3170,null,null,"YES","NO","NO",null,"CBD","Urban","Short rural","Long rural",null,"United Energy"]
[null,"Western Power (D)","Western Power (D)",18540492861,"WA","Electricity","Distribution","Revenue cap","Financial","June",12,4,"x","distribution determination","363 Wellington Street",null,"PERTH","WA","6000","GPO Box L921",null,"PERTH","WA",6842,null,null,"YES","YES","NO","NO","CBD","Urban","Short rural","Long rural",null,"Western Power (D)"]
[null,"Western Power (T)","Western Power (T)",18540492861,"WA","Electricity","Transmission","Revenue cap","Financial","June",12,4,"x","transmission determination","363 Wellington Street",null,"PERTH","WA","6000","GPO Box L921",null,"PERTH","WA",6842,null,null,"YES","YES","NO",null,"CBD","Urban","Short rural","Long rural",null,"Western Power (T)"]
[]
[]
[null,null,null,null,null,null,null,null,null,null,null,null,null,null,null,null,null,null,null,null,null,null,null,null,"For EB & Reset RINs only",null,null,null,null,"For AARs only"]
[null,"The Reg Year Ending (dms_RYE) must be set to the last year of the regulatory period. For forecast data is is usually (FRCP_y5) for actual it is a single year (CRY). For historical actual data the RYE will need to be set manually in the business details sheet by setting the dms_Multiyear_flag to 1 and putting the correct value in 'dms_Specified_FinalYear. See cells C67:C68",null,null,null,null,{"$f":"IF(dms_RPT=\"financial\",VALUE(LEFT(CRCP_y1,4)-1)&\"-\"&TEXT(VALUE(RIGHT(CRCP_y1,2)-1),\"00\"),VALUE(LEFT(CRCP_y1,4)-1))","v":2011},null,null,null,null,null,null,"Drop down selector box for CA & Reset RINs.","For CA & Reset RINs only",null,null,null,null,null,null,null,null,null,"for DNSP only",null,null,null,null,"For DNSPs only",null,null,null,null,null,"Reason for interruption","dms_Reason_Interruption_Detailed","dms_Reason_Interruption","dms_STPIS_Exclusion_List"]
[null,"dms_Model_List ","DELETE NR 'CRY' IF NOT AN ANNUAL RIN (EB, CA , ARR)",null,"dms_RYE_Formula_Result",null,null,null,null,null,null,null,null,"dms_0203_ProjectType","dms_020303_01_UOM","dms_020501_01_UOM","dms_020501_02_UOM","dms_020501_03_UOM","dms_020501_04_UOM","dms_020603_01_UOM","dms_020701_01_UOM","dms_020701_02_UOM","dms_040102_01_UOM","dms_040102_04_UOM","dms_030601_01_UOM","dms_030601_02_UOM","dms_030701_01_UOM","dms_030702_01_UOM","dms_030703_01_UOM","dms_030605_UOM","dms_03060703_UOM",null,null,null,null,"Animal","Animal impact","Animal","Weather"]
[null,"ARR","ANNUAL REPORTING STATEMENT",null,{"$f":"LEFT(dms_SingleYear_FinalYear_Result,2)&RIGHT(dms_SingleYear_FinalYear_Result,2)","v":"2017"},"=LEFT(dms_SingleYear_FinalYear_Result,2)&RIGHT(dms_SingleYear_FinalYear_Result,2)",null,"Formula errors are OK",null,null,null,null,null,"New line on new route - single circuit","Circuit line length in km","0's","0's","0's","0's","0's","km","km","0's","days","minutes/customer","minutes/customer","Customer / km","%","km","number","number",null,null,null,null,null,"Animal nesting/burrowing, etc and other","Asset failure","Equipment failure"]
[null,"CA","CATEGORY ANALYSIS",null,{"$f":"LEFT(dms_SingleYear_FinalYear_Result,2)&RIGHT(dms_SingleYear_FinalYear_Result,2)","v":"2017"},"=LEFT(dms_SingleYear_FinalYear_Result,2)&RIGHT(dms_SingleYear_FinalYear_Result,2)",null,"Formula errors are OK",null,null,null,null,null,"New line on new route - dual circuit","Circuit line length in km","0's","0's","0's","0's","0's","0's","0's","0's","0's","minutes/customer","minutes/customer","MWh/customer","Number of spans",null,"number","number",null,null,null,null,null,"Other","Other","Operational error"]
[null,"CPI","CPI",null,null,null,null,null,null,null,null,null,null,"New line on new route - other","Circuit line length in km","MVA added","MVA added","MVA added","MVA added","0's","km","km","0's","$0s","interruptions/customer","interruptions/customer","kVA / customer","Number of spans",null,"number","number",null,null,null,null,"Asset failure","LV","Overloads","Vegetation"]
[null,"EB","ECONOMIC BENCHMARKING",null,{"$f":"LEFT(dms_SingleYear_FinalYear_Result,2)&RIGHT(dms_SingleYear_FinalYear_Result,2)","v":"2017"},"=LEFT(dms_SingleYear_FinalYear_Result,2)&RIGHT(dms_SingleYear_FinalYear_Result,2)",null,"Formula errors are OK",null,null,null,null,null,"Line rebuild over existing route - single circuit","Circuit line length in km","0's","0's","0's","0's","0's","km","km","$0s","0's","interruptions/customer","interruptions/customer",null,"Number of spans",null,"number","number",null,null,null,null,null,"Distribution substation","Planned","Animals"]
[null,"PTRM","POST TAX REVENUE MODEL",null,{"$f":"LEFT(dms_MultiYear_FinalYear_Result,2)&RIGHT(dms_MultiYear_FinalYear_Result,2)","v":"2021"},"=LEFT(dms_MultiYear_FinalYear_Result,2)&RIGHT(dms_MultiYear_FinalYear_Result,2)",null,null,null,null,null,null,null,"Line rebuild over existing route - dual circuit","Number","total spend $0s","total spend $0s","total spend $0s","total spend $0s","(per cent)","0's","0's",null,null,null,null,null,"Number of spans",null,"number","(per cent)",null,null,null,null,null,"HV","Network business","Third party impacts"]
[null,"Reset","REGULATORY REPORTING STATEMENT",null,{"$f":"LEFT(dms_MultiYear_FinalYear_Result,2)&RIGHT(dms_MultiYear_FinalYear_Result,2)","v":"2021"},"=LEFT(dms_MultiYear_FinalYear_Result,2)&RIGHT(dms_MultiYear_FinalYear_Result,2)",null,"Formula errors are OK",null,null,null,null,null,"Reconductor - Single circuit","Number","net circuit km added","net circuit km added","net circuit km added","net circuit km added",null,"years","years",null,null,null,null,null,"Years",null,"number",null,null,null,null,null,null,"Zone substation","Third party","Transmission failure"]
[null,"RFM","ROLL FORWARD MODEL",null,{"$f":"LEFT(dms_CRCP_FinalYear_Result,2)&RIGHT(dms_CRCP_FinalYear_Result,2)","v":"2017"},"=LEFT(dms_CRCP_FinalYear_Result,2)&RIGHT(dms_CRCP_FinalYear_Result,2)",null,null,null,null,null,null,null,"Reconductor - Dual circuit","Number","total spend $0s","total spend $0s","total spend $0s","total spend $0s",null,null,null,null,null,null,null,null,"Years",null,"number",null,null,null,null,null,null,"Subtransmission","Unknown","Load shedding"]
[null,"WACC","WEIGHTED AVERAGE COST OF CAPITAL",null,{"$f":"LEFT(dms_MultiYear_FinalYear_Result,2)&RIGHT(dms_MultiYear_FinalYear_Result,2)","v":"2021"},"=LEFT(dms_MultiYear_FinalYear_Result,2)&RIGHT(dms_MultiYear_FinalYear_Result,2)",null,null,null,null,null,null,null,"Other",null,"net circuit km added","net circuit km added","net circuit km added","net circuit km added",null,null,null,null,null,null,null,null,"Trees",null,"number",null,null,null,null,null,"Other","insert description of 'other'","Vegetation","Inter-distributor connection failure"]
[null,null,null,null,null,null,null,null,null,null,null,null,null,null,null,"total spend $0s","total spend $0s","total spend $0s","total spend $0s",null,null,null,null,null,null,null,null,"Trees",null,"number",null,null,null,null,null,"Overloads","-","Weather","Other"]
[null,"dms_DataQuality_List",null,null,null,null,null,null,null,null,null,null,null,null,null,"0's",null,"$0s",null,null,null,null,null,null,null,null,null,"Defects",null,"number",null,null,null,null,null,"Planned","-","2 - STPIS Exclusion (3.3)(a)"]
[null,"Actual",null,null,null,null,null,null,null,null,null,null,null,null,null,"0's",null,null,null,null,null,null,null,null,null,null,null,"Defects",null,"number",null,null,null,null,null,"Network business","Network error","3 - STPIS Exclusion (3.3)(a)"]
[null,"Estimate",null,null,null,null,null,null,null,null,null,null,null,null,null,"0's",null,null,null,null,null,null,null,null,null,null,null,"Spans",null,"number",null,null,null,null,null,null,"Switching and protection error","4 - STPIS Exclusion (3.3)(a)"]
[null,"Consolidated",null,null,null,null,null,null,null,null,null,null,null,null,null,"$0s",null,null,null,null,null,null,null,null,null,null,null,"km",null,"(per cent)",null,null,null,null,null,"Third party","Fire","5 - STPIS Exclusion (3.3)(a)"]
[null,"Recast",null,null,null,null,null,null,null,null,null,null,null,null,null,null,null,null,null,null,null,null,null,null,null,null,null,"Spans",null,"(per cent)",null,null,null,null,null,null,"Other","6 - STPIS Exclusion (3.3)(a)"]
[null,"Public",null,null,null,null,null,null,null,null,null,null,null,null,null,null,null,null,null,null,null,null,null,null,null,null,null,null,null,null,null,null,null,null,null,null,"Dig-in","7 - STPIS Exclusion (3.3)(a)"]
[null,null,null,null,null,null,null,null,null,null,null,null,null,null,null,null,null,null,null,null,null,null,null,null,null,null,null,null,null,null,null,null,null,null,null,null,"Unauthorised access"]
[null,"For all files either AER or business needs to be able to specify the type of submission","For PTRM & RFM templates we must provide a choice in case they change their form of control - otherwise it is drawn from the business specific lookup table above.",null,null,null,null,null,null,null,null,null,null,null,"For PTRM files - this field set the text for the named range \"DMS_Xfactor\" which in all cases is simply the text \"x factors\" - this saves putting in each old gas PTRM file ",null,null,null,null,null,null,null,null,null,"for TNSP only",null,null,null,null,null,null,null,null,null,null,null,"Vehicle impact"]
[null,"dms_SourceList","dms_FormControl_Choices",null,null,null,null,null,null,null,null,null,null,null,"DMS_Xfactor",null,null,null,null,null,null,null,null,null,"dms_030601_01_UOM",null,"dms_030701_01_UOM","dms_030702_01_UOM",null,null,null,null,null,null,null,"Unknown","Unknown"]
[null,"After appeal","Revenue cap",null,null,null,null,null,null,null,null,null,null,null,"x factors",null,null,null,null,null,null,null,null,null,"%",null,"Number of spans","km",null,null,null,null,null,null,null,"Vegetation","Blow-in/Fall-in - NSP responsibility"]
[null,"Draft decision","Revenue yield",null,null,null,null,null,null,null,null,null,null,null,null,null,null,null,null,null,null,null,null,null,"number",null,"Years","%",null,null,null,null,null,null,null,null,"Grow-in - NSP responsibility"]
[null,"Final decision","Weighted average price cap",null,null,null,null,null,null,null,null,null,null,null,null,null,null,null,null,null,null,null,null,null,"number",null,"Trees","km",null,null,null,null,null,null,null,null,"Blow-in/Fall-in - Other responsible party"]
[null,"PTRM update 1",null,null,null,null,null,null,null,null,null,null,null,null,null,null,null,null,null,null,null,null,null,null,"%",null,"Defects","number",null,null,null,null,null,null,null,null,"Grow-in - Other responsible party"]
[null,"PTRM update 2",null,null,null,null,null,null,null,null,null,null,null,null,null,null,null,null,null,null,null,null,null,null,"number",null,"Number of spans",null,null,null,null,null,null,null,null,"Weather"]
[null,"PTRM update 3",null,null,null,null,null,null,null,null,null,null,null,null,null,null,null,null,null,null,null,null,null,null,"number",null,"km",null,null,null,null,null,null,null,null,"2 - STPIS Exclusion (3.3)(a)"]
[null,"PTRM update 4",null,null,null,null,null,null,null,null,null,null,null,null,null,null,null,null,null,null,null,null,null,null,"%",null,"km",null,null,null,null,null,null,null,null,"3 - STPIS Exclusion (3.3)(a)"]
[null,"PTRM update 5",null,null,null,null,null,null,null,null,null,null,null,null,null,null,null,null,null,null,null,null,null,null,"number",null,"Number of spans",null,null,null,null,null,null,null,null,"4 - STPIS Exclusion (3.3)(a)"]
[null,"PTRM update 6",null,null,null,null,null,null,null,null,null,null,null,null,null,null,null,null,null,null,null,null,null,null,"number",null,null,null,null,null,null,null,null,null,null,"5 - STPIS Exclusion (3.3)(a)"]
[null,"PTRM update 7",null,null,null,null,null,null,null,null,null,null,null,null,null,null,null,null,null,null,null,null,null,null,"%",null,null,null,null,null,null,null,null,null,null,"6 - STPIS Exclusion (3.3)(a)"]
[null,"Regulatory proposal",null,null,null,null,null,null,null,null,null,null,null,null,null,null,null,null,null,null,null,null,null,null,"number",null,null,null,null,null,null,null,null,null,null,"7 - STPIS Exclusion (3.3)(a)"]
[null,"Reporting",null,null,null,null,null,null,null,null,null,null,null,null,null,null,null,null,null,null,null,null,null,null,"%"]
[null,"Revised regulatory proposal",null,null,null,null,null,null,null,null,null,null,null,null,null,null,null,null,null,null,null,null,null,null,"number"]
[null,null,null,null,null,null,null,null,null,null,null,null,null,null,null,null,null,null,null,null,null,null,null,null,"%"]
[null,null,null,null,null,null,null,null,null,null,null,null,null,null,null,null,null,null,null,null,null,null,null,null,"number"]
[]
[]
[]
[null,"These are indeces and lookup values for various dates. All step from the value placed in FRCP_y1 on the business and other details worksheet",null,null,null,null,null,null,null,null,null,"These date tables are currently used in the Recast templates to provide column headings and conditional formatting"]
[null,"dms_FRCPlength_Num_List","dms_FinalYear_List","dms_CRCPlength_Num_List","dms_CFinalYear_List","dms_FRCP_years",null,"dms_CRCP_years",null,"dms_CRCP_index",null,"CRY from input cell on business sheet","CRY - financial","dms_FinYears","CRY calendar","dms_CalYears"]
[null,1,"dms_FRCP_y1",1,"CRCP_y1",{"$f":"FRCP_y1","v":2017},"dms_FRCP_y1",{"$f":"IF(dms_RPT=\"financial\",VALUE(LEFT(dms_FRCP_y1,4)-1)&\"-\"&TEXT(VALUE(MID(dms_FRCP_y1,3,2)),\"00\"),VALUE(LEFT(dms_FRCP_y1,4)-1))","v":2016},"dms_CRCP_yZ",1,null,{"$f":"CRY","v":2017},{"$f":"VALUE(LEFT(CRY,4))&\"-\"&TEXT(MID(CRY,3,2)+1,\"00\")","v":"2017-18"},"dms_CRYf_y1",{"$f":"VALUE(LEFT(CRY,4)+1)","v":2018},"dms_CRYc_y1"]
[null,2,"dms_FRCP_y2",2,"CRCP_y2",{"$f":"IF(dms_RPT=\"financial\",VALUE(LEFT(dms_FRCP_y1,4)+1)&\"-\"&TEXT(VALUE(RIGHT(dms_FRCP_y1,2)+1),\"00\"),VALUE(LEFT(dms_FRCP_y1,4)+1))","v":2018},"dms_FRCP_y2",{"$f":"IF(dms_RPT=\"financial\",VALUE(LEFT(dms_CRCP_yZ,4)-1)&\"-\"&TEXT(VALUE(MID(dms_CRCP_yZ,3,2)),\"00\"),VALUE(LEFT(dms_CRCP_yZ,4)-1))","v":2015},"dms_CRCP_yY",2,null,null,{"$f":"VALUE(LEFT(dms_CRYf_y1,4)+1)&\"-\"&TEXT(MID(dms_CRYf_y1,3,2)+2,\"00\")","v":"2018-19"},"dms_CRYf_y2",{"$f":"VALUE(LEFT(dms_CRYc_y1,4)+1)","v":2019},"dms_CRYc_y2"]
[null,3,"dms_FRCP_y3",3,"CRCP_y3",{"$f":"IF(dms_RPT=\"financial\",VALUE(LEFT(dms_FRCP_y2,4)+1)&\"-\"&TEXT(VALUE(RIGHT(dms_FRCP_y2,2)+1),\"00\"),VALUE(LEFT(dms_FRCP_y2,4)+1))","v":2019},"dms_FRCP_y3",{"$f":"IF(dms_RPT=\"financial\",VALUE(LEFT(dms_CRCP_yY,4)-1)&\"-\"&TEXT(VALUE(MID(dms_CRCP_yY,3,2)),\"00\"),VALUE(LEFT(dms_CRCP_yY,4)-1))","v":2014},"dms_CRCP_yX",3,null,null,{"$f":"VALUE(LEFT(dms_CRYf_y2,4)+1)&\"-\"&TEXT(MID(dms_CRYf_y2,3,2)+2,\"00\")","v":"2019-20"},"dms_CRYf_y3",{"$f":"VALUE(LEFT(dms_CRYc_y2,4)+1)","v":2020},"dms_CRYc_y3"]
[null,4,"dms_FRCP_y4",4,"CRCP_y4",{"$f":"IF(dms_RPT=\"financial\",VALUE(LEFT(dms_FRCP_y3,4)+1)&\"-\"&TEXT(VALUE(RIGHT(dms_FRCP_y3,2)+1),\"00\"),VALUE(LEFT(dms_FRCP_y3,4)+1))","v":2020},"dms_FRCP_y4",{"$f":"IF(dms_RPT=\"financial\",VALUE(LEFT(dms_CRCP_yX,4)-1)&\"-\"&TEXT(VALUE(MID(dms_CRCP_yX,3,2)),\"00\"),VALUE(LEFT(dms_CRCP_yX,4)-1))","v":2013},"dms_CRCP_yW",4,null,null,{"$f":"VALUE(LEFT(dms_CRYf_y3,4)+1)&\"-\"&TEXT(MID(dms_CRYf_y3,3,2)+2,\"00\")","v":"2020-21"},"dms_CRYf_y4",{"$f":"VALUE(LEFT(dms_CRYc_y3,4)+1)","v":2021},"dms_CRYc_y4"]
[null,5,"dms_FRCP_y5",5,"CRCP_y5",{"$f":"IF(dms_RPT=\"financial\",VALUE(LEFT(dms_FRCP_y4,4)+1)&\"-\"&TEXT(VALUE(RIGHT(dms_FRCP_y4,2)+1),\"00\"),VALUE(LEFT(dms_FRCP_y4,4)+1))","v":2021},"dms_FRCP_y5",{"$f":"IF(dms_RPT=\"financial\",VALUE(LEFT(dms_CRCP_yW,4)-1)&\"-\"&TEXT(VALUE(MID(dms_CRCP_yW,3,2)),\"00\"),VALUE(LEFT(dms_CRCP_yW,4)-1))","v":2012},"dms_CRCP_yV",5,null,null,{"$f":"VALUE(LEFT(dms_CRYf_y4,4)+1)&\"-\"&TEXT(MID(dms_CRYf_y4,3,2)+2,\"00\")","v":"2021-22"},"dms_CRYf_y5",{"$f":"VALUE(LEFT(dms_CRYc_y4,4)+1)","v":2022},"dms_CRYc_y5"]
[null,6,"dms_FRCP_y6",6,"CRCP_y6",{"$f":"IF(dms_RPT=\"financial\",VALUE(LEFT(dms_FRCP_y5,4)+1)&\"-\"&TEXT(VALUE(RIGHT(dms_FRCP_y5,2)+1),\"00\"),VALUE(LEFT(dms_FRCP_y5,4)+1))","v":2022},"dms_FRCP_y6",{"$f":"IF(dms_RPT=\"financial\",VALUE(LEFT(dms_CRCP_yV,4)-1)&\"-\"&TEXT(VALUE(MID(dms_CRCP_yV,3,2)),\"00\"),VALUE(LEFT(dms_CRCP_yV,4)-1))","v":2011},"dms_CRCP_yU",6,null,null,{"$f":"VALUE(LEFT(dms_CRYf_y5,4)+1)&\"-\"&TEXT(MID(dms_CRYf_y5,3,2)+2,\"00\")","v":"2022-23"},"dms_CRYf_y6",{"$f":"VALUE(LEFT(dms_CRYc_y5,4)+1)","v":2023},"dms_CRYc_y6"]
[null,7,"dms_FRCP_y7",7,"CRCP_y7",{"$f":"IF(dms_RPT=\"financial\",VALUE(LEFT(dms_FRCP_y6,4)+1)&\"-\"&TEXT(VALUE(RIGHT(dms_FRCP_y6,2)+1),\"00\"),VALUE(LEFT(dms_FRCP_y6,4)+1))","v":2023},"dms_FRCP_y7",{"$f":"IF(dms_RPT=\"financial\",VALUE(LEFT(dms_CRCP_yU,4)-1)&\"-\"&TEXT(VALUE(MID(dms_CRCP_yU,3,2)),\"00\"),VALUE(LEFT(dms_CRCP_yU,4)-1))","v":2010},"dms_CRCP_yT",7,null,null,{"$f":"VALUE(LEFT(dms_CRYf_y6,4)+1)&\"-\"&TEXT(MID(dms_CRYf_y6,3,2)+2,\"00\")","v":"2023-24"},"dms_CRYf_y7",{"$f":"VALUE(LEFT(dms_CRYc_y6,4)+1)","v":2024},"dms_CRYc_y7"]
[null,8,"dms_FRCP_y8",8,"CRCP_y8",{"$f":"IF(dms_RPT=\"financial\",VALUE(LEFT(dms_FRCP_y7,4)+1)&\"-\"&TEXT(VALUE(RIGHT(dms_FRCP_y7,2)+1),\"00\"),VALUE(LEFT(dms_FRCP_y7,4)+1))","v":2024},"dms_FRCP_y8",{"$f":"IF(dms_RPT=\"financial\",VALUE(LEFT(dms_CRCP_yT,4)-1)&\"-\"&TEXT(VALUE(MID(dms_CRCP_yT,3,2)),\"00\"),VALUE(LEFT(dms_CRCP_yT,4)-1))","v":2009},"dms_CRCP_yS",8,null,null,{"$f":"VALUE(LEFT(dms_CRYf_y7,4)+1)&\"-\"&TEXT(MID(dms_CRYf_y7,3,2)+2,\"00\")","v":"2024-25"},"dms_CRYf_y8",{"$f":"VALUE(LEFT(dms_CRYc_y7,4)+1)","v":2025},"dms_CRYc_y8"]
[null,9,"dms_FRCP_y9",9,"CRCP_y9",{"$f":"IF(dms_RPT=\"financial\",VALUE(LEFT(dms_FRCP_y8,4)+1)&\"-\"&TEXT(VALUE(RIGHT(dms_FRCP_y8,2)+1),\"00\"),VALUE(LEFT(dms_FRCP_y8,4)+1))","v":2025},"dms_FRCP_y9",{"$f":"IF(dms_RPT=\"financial\",VALUE(LEFT(dms_CRCP_yS,4)-1)&\"-\"&TEXT(VALUE(MID(dms_CRCP_yS,3,2)),\"00\"),VALUE(LEFT(dms_CRCP_yS,4)-1))","v":2008},"dms_CRCP_yR",9,null,null,{"$f":"VALUE(LEFT(dms_CRYf_y8,4)+1)&\"-\"&TEXT(MID(dms_CRYf_y8,3,2)+2,\"00\")","v":"2025-26"},"dms_CRYf_y9",{"$f":"VALUE(LEFT(dms_CRYc_y8,4)+1)","v":2026},"dms_CRYc_y9"]
[null,10,"dms_FRCP_y10",10,"CRCP_y10",{"$f":"IF(dms_RPT=\"financial\",VALUE(LEFT(dms_FRCP_y9,4)+1)&\"-\"&TEXT(VALUE(RIGHT(dms_FRCP_y9,2)+1),\"00\"),VALUE(LEFT(dms_FRCP_y9,4)+1))","v":2026},"dms_FRCP_y10",{"$f":"IF(dms_RPT=\"financial\",VALUE(LEFT(dms_CRCP_yR,4)-1)&\"-\"&TEXT(VALUE(MID(dms_CRCP_yR,3,2)),\"00\"),VALUE(LEFT(dms_CRCP_yR,4)-1))","v":2007},"dms_CRCP_yQ",10,null,null,{"$f":"VALUE(LEFT(dms_CRYf_y9,4)+1)&\"-\"&TEXT(MID(dms_CRYf_y9,3,2)+2,\"00\")","v":"2026-27"},"dms_CRYf_y10",{"$f":"VALUE(LEFT(dms_CRYc_y9,4)+1)","v":2027},"dms_CRYc_y10"]
[null,11,"dms_FRCP_y11",11,"CRCP_y11",{"$f":"IF(dms_RPT=\"financial\",VALUE(LEFT(dms_FRCP_y10,4)+1)&\"-\"&TEXT(VALUE(RIGHT(dms_FRCP_y10,2)+1),\"00\"),VALUE(LEFT(dms_FRCP_y10,4)+1))","v":2027},"dms_FRCP_y11",{"$f":"IF(dms_RPT=\"financial\",VALUE(LEFT(dms_CRCP_yQ,4)-1)&\"-\"&TEXT(VALUE(MID(dms_CRCP_yQ,3,2)),\"00\"),VALUE(LEFT(dms_CRCP_yQ,4)-1))","v":2006},"dms_CRCP_yP",11,null,null,{"$f":"VALUE(LEFT(dms_CRYf_y10,4)+1)&\"-\"&TEXT(MID(dms_CRYf_y10,3,2)+2,\"00\")","v":"2027-28"},"dms_CRYf_y11",{"$f":"VALUE(LEFT(dms_CRYc_y10,4)+1)","v":2028},"dms_CRYc_y11"]
[null,12,"dms_FRCP_y12",12,"CRCP_y12",{"$f":"IF(dms_RPT=\"financial\",VALUE(LEFT(dms_FRCP_y11,4)+1)&\"-\"&TEXT(VALUE(RIGHT(dms_FRCP_y11,2)+1),\"00\"),VALUE(LEFT(dms_FRCP_y11,4)+1))","v":2028},"dms_FRCP_y12",{"$f":"IF(dms_RPT=\"financial\",VALUE(LEFT(dms_CRCP_yP,4)-1)&\"-\"&TEXT(VALUE(MID(dms_CRCP_yP,3,2)),\"00\"),VALUE(LEFT(dms_CRCP_yP,4)-1))","v":2005},"dms_CRCP_yO",12,null,null,{"$f":"VALUE(LEFT(dms_CRYf_y11,4)+1)&\"-\"&TEXT(MID(dms_CRYf_y11,3,2)+2,\"00\")","v":"2028-29"},"dms_CRYf_y12",{"$f":"VALUE(LEFT(dms_CRYc_y11,4)+1)","v":2029},"dms_CRYc_y12"]
[null,13,"dms_FRCP_y13",13,"CRCP_y13",{"$f":"IF(dms_RPT=\"financial\",VALUE(LEFT(dms_FRCP_y12,4)+1)&\"-\"&TEXT(VALUE(RIGHT(dms_FRCP_y12,2)+1),\"00\"),VALUE(LEFT(dms_FRCP_y12,4)+1))","v":2029},"dms_FRCP_y13",{"$f":"IF(dms_RPT=\"financial\",VALUE(LEFT(dms_CRCP_yO,4)-1)&\"-\"&TEXT(VALUE(MID(dms_CRCP_yO,3,2)),\"00\"),VALUE(LEFT(dms_CRCP_yO,4)-1))","v":2004},"dms_CRCP_yN",13,null,null,{"$f":"VALUE(LEFT(dms_CRYf_y12,4)+1)&\"-\"&TEXT(MID(dms_CRYf_y12,3,2)+2,\"00\")","v":"2029-30"},"dms_CRYf_y13",{"$f":"VALUE(LEFT(dms_CRYc_y12,4)+1)","v":2030},"dms_CRYc_y13"]
[null,14,"dms_FRCP_y14",14,"CRCP_y14",{"$f":"IF(dms_RPT=\"financial\",VALUE(LEFT(dms_FRCP_y13,4)+1)&\"-\"&TEXT(VALUE(RIGHT(dms_FRCP_y13,2)+1),\"00\"),VALUE(LEFT(dms_FRCP_y13,4)+1))","v":2030},"dms_FRCP_y14",{"$f":"IF(dms_RPT=\"financial\",VALUE(LEFT(dms_CRCP_yN,4)-1)&\"-\"&TEXT(VALUE(MID(dms_CRCP_yN,3,2)),\"00\"),VALUE(LEFT(dms_CRCP_yN,4)-1))","v":2003},"dms_CRCP_yM",14,null,null,{"$f":"VALUE(LEFT(dms_CRYf_y13,4)+1)&\"-\"&TEXT(MID(dms_CRYf_y13,3,2)+2,\"00\")","v":"2030-31"},"dms_CRYf_y14",{"$f":"VALUE(LEFT(dms_CRYc_y13,4)+1)","v":2031},"dms_CRYc_y14"]
[null,15,"dms_FRCP_y15",15,"CRCP_y15",{"$f":"IF(dms_RPT=\"financial\",VALUE(LEFT(dms_FRCP_y14,4)+1)&\"-\"&TEXT(VALUE(RIGHT(dms_FRCP_y14,2)+1),\"00\"),VALUE(LEFT(dms_FRCP_y14,4)+1))","v":2031},"dms_FRCP_y15",{"$f":"IF(dms_RPT=\"financial\",VALUE(LEFT(dms_CRCP_yM,4)-1)&\"-\"&TEXT(VALUE(MID(dms_CRCP_yM,3,2)),\"00\"),VALUE(LEFT(dms_CRCP_yM,4)-1))","v":2002},"dms_CRCP_yL",15,null,null,{"$f":"VALUE(LEFT(dms_CRYf_y14,4)+1)&\"-\"&TEXT(MID(dms_CRYf_y14,3,2)+2,\"00\")","v":"2031-32"},"dms_CRYf_y15",{"$f":"VALUE(LEFT(dms_CRYc_y14,4)+1)","v":2032},"dms_CRYc_y15"]
[null,null,null,null,null,null,null,null,null,null,null,null,{"$f":"VALUE(LEFT(dms_CRYf_y15,4)+1)&\"-\"&TEXT(MID(dms_CRYf_y15,3,2)+2,\"00\")","v":"2032-33"},"dms_CRYf_y16",{"$f":"VALUE(LEFT(dms_CRYc_y15,4)+1)","v":2033},"dms_CRYc_y16"]
[null,"These are drop down lists for businesses to select the correct FRCP_y1 on the business and other details worksheet.\nThis also populates the column headings in the worksheets",null,null,null,null,null,null,null,null,null,null,{"$f":"VALUE(LEFT(dms_CRYf_y16,4)+1)&\"-\"&TEXT(MID(dms_CRYf_y16,3,2)+2,\"00\")","v":"2033-34"},"dms_CRYf_y17",{"$f":"VALUE(LEFT(dms_CRYc_y16,4)+1)","v":2034},"dms_CRYc_y17"]
[null,"dms_RCP_fyear_list","dms_CRY_ListF","dms_CRY_ListC","dms_RCP_cyear_list","dms_FRCP_fyear_list","dms_FRCP_ListF","dms_FRCP_ListC","dms_FRCP_cyear_list",null,null,null,{"$f":"VALUE(LEFT(dms_CRYf_y17,4)+1)&\"-\"&TEXT(MID(dms_CRYf_y17,3,2)+2,\"00\")","v":"2034-35"},"dms_CRYf_y18",{"$f":"VALUE(LEFT(dms_CRYc_y17,4)+1)","v":2035},"dms_CRYc_y18"]
[null,"dms_fy1","2005-06","2006","dms_cy1","dms_frcp_fy1","2015-16",2016,"dms_crcp_cy1",null,null,null,{"$f":"VALUE(LEFT(dms_CRYf_y18,4)+1)&\"-\"&TEXT(MID(dms_CRYf_y18,3,2)+2,\"00\")","v":"2035-36"},"dms_CRYf_y19",{"$f":"VALUE(LEFT(dms_CRYc_y18,4)+1)","v":2036},"dms_CRYc_y19"]
[null,"dms_fy2","2006-07","2007","dms_cy2","dms_frcp_fy2","2016-17",2017,"dms_crcp_cy2",null,null,null,{"$f":"VALUE(LEFT(dms_CRYf_y19,4)+1)&\"-\"&TEXT(MID(dms_CRYf_y19,3,2)+2,\"00\")","v":"2036-37"},"dms_CRYf_y20",{"$f":"VALUE(LEFT(dms_CRYc_y19,4)+1)","v":2037},"dms_CRYc_y20"]
[null,"dms_fy3","2007-08","2008","dms_cy3","dms_frcp_fy3","2017-18",2018,"dms_crcp_cy3"]
[null,"dms_fy4","2008-09","2009","dms_cy4","dms_frcp_fy4","2018-19",2019,"dms_crcp_cy4"]
[null,"dms_fy5","2009-10",2010,"dms_cy5","dms_frcp_fy5","2019-20",2020,"dms_crcp_cy5"]
[null,"dms_fy6","2010-11",2011,"dms_cy6","dms_frcp_fy6","2020-21",2021,"dms_crcp_cy6"]
[null,"dms_fy7","2011-12",2012,"dms_cy7","dms_frcp_fy7","2021-22",2022,"dms_crcp_cy7"]
[null,"dms_fy8","2012-13",2013,"dms_cy8","dms_frcp_fy8","2022-23",2023,"dms_crcp_cy8",null,null,"2005-06","2006"]
[null,"dms_fy9","2013-14",2014,"dms_cy9","dms_frcp_fy9","2023-24",2024,"dms_crcp_cy9",null,null,"2006-07","2007"]
[null,"dms_fy10","2014-15",2015,"dms_cy10","dms_frcp_fy10","2024-25",2025,"dms_crcp_cy10",null,null,"2007-08","2008"]
[null,"dms_fy11","2015-16",2016,"dms_cy11","dms_frcp_fy11","2025-26",2026,"dms_crcp_cy11",null,null,"2008-09","2009"]
[null,"dms_fy12","2016-17",2017,"dms_cy12","dms_frcp_fy12","2026-27",2027,"dms_crcp_cy12",null,null,"2009-10",2010]
[null,"dms_fy13","2017-18",2018,"dms_cy13","dms_frcp_fy13","2027-28",2028,"dms_crcp_cy13",null,null,"2010-11",2011]
[null,"dms_fy14","2018-19",2019,"dms_cy14","dms_frcp_fy14","2028-29",2029,"dms_crcp_cy14",null,null,"2011-12",2012]
[null,"dms_fy15","2019-20",2020,"dms_cy15","dms_frcp_fy15","2029-30",2030,"dms_crcp_cy15",null,null,"2012-13",2013]
[null,"dms_fy16","2020-21",2021,"dms_cy16",null,null,null,null,null,null,"2013-14",2014]
[null,"dms_fy17","2021-22",2022,"dms_cy17",null,null,null,null,null,null,"2014-15",2015]
[null,"dms_fy18","2022-23",2023,"dms_cy18",null,null,null,null,null,null,"2015-16",2016]
[null,"dms_fy19","2023-24",2024,"dms_cy19",null,null,null,null,null,null,"2016-17",2017]
[null,"dms_fy20","2024-25",2025,"dms_cy20",null,null,null,null,null,null,"2017-18",2018]
[null,null,null,null,null,null,null,null,null,null,null,"2018-19",2019]
[null,null,null,null,null,null,null,null,null,null,null,"2019-20",2020]
[null,null,null,null,null,null,null,null,null,null,null,"2020-21",2021]
[null,null,null,null,null,null,null,null,null,null,null,"2021-22",2022]
[null,null,null,null,null,null,null,null,null,null,null,"2022-23",2023]
[null,null,null,null,null,null,null,null,null,null,null,"2023-24",2024]
[null,null,null,null,null,null,null,null,null,null,null,"2024-25",2025]
[null,null,null,null,null,null,null,null,null,null,null,"2025-26",2026]
[null,null,null,null,null,null,null,null,null,null,null,"2026-27",2027]
[null,null,null,null,null,null,null,null,null,null,null,"2027-28",2028]
[null,null,null,null,null,null,null,null,null,null,null,"2028-29",2029]
[null,null,null,null,null,null,null,null,null,null,null,"2029-30",2030]
[null,null,null,null,null,null,null,null,null,null,null,"2030-31",2031]
[null,null,null,null,null,null,null,null,null,null,null,"2031-32",2032]
[null,null,null,null,null,null,null,null,null,null,null,"2032-33",2033]
[null,null,null,null,null,null,null,null,null,null,null,"2033-34",2034]
[null,null,null,null,null,null,null,null,null,null,null,"2034-35",2035]
[null,null,null,null,null,null,null,null,null,null,null,"2035-36",2036]

{"sheet":"Instructions","index":1,"n_rows":27,"n_cols":4,"rows_kept":27,"cut":false,"hidden":false,"merged":[[7,2,7,3],[1,1,1,5],[2,1,2,5],[3,2,3,4],[4,2,4,4],[5,2,5,4],[24,2,24,4],[25,2,25,3],[26,2,26,4],[8,2,8,4],[10,2,10,4],[12,2,12,4],[20,2,20,4],[22,2,22,4]]}
[]
[null,{"$f":"CONCATENATE(dms_Segment,\" Network Service Provider\")","v":"Distribution Network Service Provider"}]
[null,{"$f":"IF(dms_Model=\"Reset\",\"Regulatory Proposal RIN Template\",\"Annual Reporting RIN\")","v":"Annual Reporting RIN"}]
[null,null,{"$f":"CONCATENATE(\"This template is to be used by \",dms_TradingName,\" to fulfil its reporting obligations to the AER.\")","v":"This template is to be used by United Energy to fulfil its reporting obligations to the AER."}]
[null,null,"INSTRUCTIONS"]
[null,null,"Complete the Business & other details worksheet before entering data or values in any other worksheets. The Business & other details worksheet is linked to other worksheets within the workbook and automatically generates certain column headings and conditional formatting."]
[]
[null,null,"Identifying CONFIDENTIAL INFORMATION:\n\nPlease use the macro at the top of each \nworksheet to identify confidential information. \n\n"]
[null,null,"-Do this by selecting the cell or cells that contain confidential information and then run the Mark selected cells as CONFIDENTIAL macro. This will format the cells a specific colour that is identified by the AER's database which in turn marks that information as confidential.\n\n-To reverse this, select the cell or cells and run the Return cells to NON-CONFIDENTIAL macro."]
[]
[null,null,"UNITS OF MEASURE\n\nAll amounts are to be unrounded and reported on a one for one basis: that is 1000 is to be entered as '1000'. Applicable units of measure may be identified in the table column headings or row descriptors.\n\n"]
[]
[null,null,"COLOUR CODING OF INPUT / NON-INPUT CELLS:"]
[null,null,null,"Yellow = Input cell (mandatory)"]
[null,null,null,"Darker yellow = input cell (mandatory)"]
[null,null,null,"Orange = input cell (if data available)"]
[null,null,null,"Grey = Not applicable/No inputs required"]
[null,null,null," \nPLEASE DO NOT ENTER TEXT into cells that are to contain numeric data."]
[]
[]
[null,null,"WORKSHEET NAVIGATION\n\nMany tables in the worksheets have been \"grouped\" to allow for easy navigation. To ungroup or group data use the outline symbols in the left margin (for Row groupings) or above the columns (for column groupings). \n\n\n\n"]
[]
[null,null,"RETURNING COMPLETED RESPONSES\n\nPlease return two (2) files to the AER: \n1. A confidential version which must contain a complete set of all responses with confidential information marked using the Mark selection CONFIDENTIAL macro and which has been completed using the locked template file provided by the AER. \n\n2. A public version with confidential information either removed completely or aggregated in some form together with writtten consent to disclose the public version of the response.\n\nUse the drop down box on the Business and other details worksheet to identify the file as either confidential ('consolidated') or public. "]
[]
[null,null,"SUBMITTING AMENDED DATA TO THE AER\n\nIf an NSP wishes to correct data previously submitted to the AER it should resubmit that data using the original completed submission as the starting point. Please make any necessary changes to the data. Data that is not being amended should be left unchanged. \n\nNSPs must identify the reason for the amendments in the Amendment Reason box on the  Business and other details worksheet. NSPs may provide further details regarding any amendments in the Amendments worksheet. \n\n."]
[null,null,"NSP may use Amended Data macro \nto highlight cells that contain amended data.\nNB: if data is also CONFIDENTIAL, re-apply \nthe Confidentiality macro after applying the \nAmended macro"]
[null,null,"Please resubmit two (2) files - a confidential version and a public version of the amended submission to the AER"]

{"sheet":"Contents","index":2,"n_rows":31,"n_cols":4,"rows_kept":31,"cut":false,"hidden":false,"merged":[[2,1,2,3],[3,1,3,3],[4,1,4,3]]}
[]
[]
[null,{"$f":"CONCATENATE(dms_Segment,\" Network Service Provider\")","v":"Distribution Network Service Provider"}]
[null,"Annual Reporting RIN Template"]
[null,"Table of Contents"]
[]
[]
[null,null,"Instructions"]
[null,null,"Business & other details"]
[]
[]
[null,"CATEGORY ANALYSIS","STPIS","STATUTORY ACCOUNTS"]
[]
[null,"2.11 Labour","6.2 STPIS Reliability","8.1 Income"]
[null,null,"6.6 STPIS Customer Service","8.2 Capex"]
[null,null,"6.7 STPIS Daily Performance"]
[null,null,"6.8 STPIS Exclusions","8.4 Opex"]
[null,null,"6.9 STPIS GSL"]
[]
[]
[]
[null,"NETWORK PERFORMANCE","OTHER INFORMATION","PRICING PROPOSAL"]
[null,null,null,"Victorian Businesses Only"]
[null,"3.6 Quality of services","7.8 Avoided Cost Payments"]
[null,"3.6.8 Network-feeders","7.10 Juris Scheme","9.5 TUoS"]
[null,"3.6.9 Network-reliability","7.11 DMIS-DMIA"]
[null,null,"7.12 Safety and Bushfire"]
[null,null,"7.13 TARC"]
[null,"PUBLIC LIGHTING"]
[]
[null,"4.1 Public lighting tariffs"]

{"sheet":"Business & other details","index":3,"n_rows":103,"n_cols":12,"rows_kept":103,"cut":false,"hidden":false,"merged":[[7,1,7,8],[11,1,11,8],[13,2,13,4],[14,2,14,4],[17,2,17,3],[17,4,17,7],[84,4,84,8],[18,4,18,7],[19,2,19,3],[19,4,19,7],[22,2,22,3],[22,4,22,7],[23,4,23,7],[50,4,50,8],[24,2,24,3],[24,4,24,7],[32,1,32,8],[49,2,49,3],[51,2,51,8]]}
[null,{"$f":"(LOOKUP(dms_Model,dms_Model_List,dms_Worksheet_List))","v":"ANNUAL REPORTING STATEMENT"}]
[null,{"$f":"dms_TradingName","v":"United Energy"}]
[null,{"$f":"CONCATENATE(\"Annual Reporting RIN Response \",CRY)","v":"Annual Reporting RIN Response 2017"}]
[null,"BUSINESS & OTHER DETAILS"]
[]
[]
[null,"Instructions"]
[null,"Complete the following business details regulatory template before entering data or values in any other regulatory template. This regulatory template is linked to other cells within the spreadsheet and automatically generates column headings and conditional formatting to distinguish business specific input and non-input cells. "]
[]
[null,"SUBMISSION PARTICULARS INPUT SHEETS"]
[]
[null,"ENTITY DETAILS"]
[]
[null,"Short name","United Energy",null,null,"Select business name from drop down list first"]
[null,"ACN / ABN",{"$f":"INDEX(dms_ABN_List,MATCH(dms_TradingName,dms_TradingName_List))","v":70064651029}]
[]
[]
[null,"Business address","Address 1",null,"43-45 Centreway"]
[null,null,null,"Address 2"]
[null,null,"Suburb",null,"Mount Waverley"]
[null,null,null,"State","Vic","p/code","3149"]
[]
[null,"Postal address","Address 1",null,"PO Box 449"]
[null,null,null,"Address 2",""]
[null,null,"Suburb",null,"Mount Waverley"]
[null,null,null,"State","VIC","p/code",3149]
[]
[]
[null,"Contact name/s","Mark de Villiers"]
[null,"Contact phone/s"]
[null,"Contact email address/s"]
[]
[null,"REGULATORY CONTROL PERIODS"]
[]
[null,"Forthcoming regulatory control period",2017,{"$f":"dms_FRCP_y2","v":2018},{"$f":"dms_FRCP_y3","v":2019},{"$f":"dms_FRCP_y4","v":2020},{"$f":"dms_FRCP_y5","v":2021},{"$f":"dms_FRCP_y6","v":2022},{"$f":"dms_FRCP_y7","v":2023},{"$f":"dms_FRCP_y8","v":2024},{"$f":"dms_FRCP_y9","v":2025},{"$f":"dms_FRCP_y10","v":2026}]
[]
[]
[null,"Current regulatory control period",{"$f":"dms_CRCP_FirstYear_Result","v":2012},{"$f":"IF(dms_RPT=\"financial\",VALUE(LEFT(CRCP_y1,4)+1)&\"-\"&TEXT(MID(CRCP_y1,3,2)+2,\"00\"),VALUE(LEFT(CRCP_y1,4)+1))","v":2013},{"$f":"IF(dms_RPT=\"financial\",VALUE(LEFT(CRCP_y2,4)+1)&\"-\"&TEXT(VALUE(MID(CRCP_y2,3,2)+2),\"00\"),VALUE(LEFT(CRCP_y2,4)+1))","v":2014},{"$f":"IF(dms_RPT=\"financial\",VALUE(LEFT(CRCP_y3,4)+1)&\"-\"&TEXT(VALUE(MID(CRCP_y3,3,2)+2),\"00\"),VALUE(LEFT(CRCP_y3,4)+1))","v":2015},{"$f":"IF(dms_RPT=\"financial\",VALUE(LEFT(CRCP_y4,4)+1)&\"-\"&TEXT(VALUE(MID(CRCP_y4,3,2)+2),\"00\"),VALUE(LEFT(CRCP_y4,4)+1))","v":2016},{"$f":"IF(dms_RPT=\"financial\",VALUE(LEFT(CRCP_y5,4)+1)&\"-\"&TEXT(VALUE(MID(CRCP_y5,3,2)+2),\"00\"),VALUE(LEFT(CRCP_y5,4)+1))","v":2017},{"$f":"IF(dms_RPT=\"financial\",VALUE(LEFT(CRCP_y6,4)+1)&\"-\"&TEXT(VALUE(MID(CRCP_y6,3,2)+2),\"00\"),VALUE(LEFT(CRCP_y6,4)+1))","v":2018},{"$f":"IF(dms_RPT=\"financial\",VALUE(LEFT(CRCP_y7,4)+1)&\"-\"&TEXT(VALUE(MID(CRCP_y7,3,2)+2),\"00\"),VALUE(LEFT(CRCP_y7,4)+1))","v":2019},{"$f":"IF(dms_RPT=\"financial\",VALUE(LEFT(CRCP_y8,4)+1)&\"-\"&TEXT(VALUE(MID(CRCP_y8,3,2)+2),\"00\"),VALUE(LEFT(CRCP_y8,4)+1))","v":2020},{"$f":"IF(dms_RPT=\"financial\",VALUE(LEFT(CRCP_y9,4)+1)&\"-\"&TEXT(VALUE(MID(CRCP_y9,3,2)+2),\"00\"),VALUE(LEFT(CRCP_y9,4)+1))","v":2021}]
[]
[]
[null,"Previous regulatory control period",{"$f":"IF(dms_RPT=\"financial\",VALUE(LEFT(PRCP_y2,4)-1)&\"-\"&TEXT(VALUE(MID(PRCP_y2,3,2)),\"00\"),VALUE(LEFT(PRCP_y2,4)-1))","v":2007},{"$f":"IF(dms_RPT=\"financial\",VALUE(LEFT(PRCP_y3,4)-1)&\"-\"&TEXT(VALUE(MID(PRCP_y3,3,2)),\"00\"),VALUE(LEFT(PRCP_y3,4)-1))","v":2008},{"$f":"IF(dms_RPT=\"financial\",VALUE(LEFT(PRCP_y4,4)-1)&\"-\"&TEXT(VALUE(MID(PRCP_y4,3,2)),\"00\"),VALUE(LEFT(PRCP_y4,4)-1))","v":2009},{"$f":"IF(dms_RPT=\"financial\",VALUE(LEFT(PRCP_y5,4)-1)&\"-\"&TEXT(VALUE(RIGHT(PRCP_y5,2)-1),\"00\"),VALUE(LEFT(PRCP_y5,4)-1))","v":2010},{"$f":"IF(dms_RPT=\"financial\",VALUE(LEFT(CRCP_y1,4)-1)&\"-\"&TEXT(VALUE(RIGHT(CRCP_y1,2)-1),\"00\"),VALUE(LEFT(CRCP_y1,4)-1))","v":2011}]
[]
[]
[null,"Commencing regulatory year",2017,"CRY"]
[]
[null,"Last completed regulatory year",2017,"dms_FinalYear"]
[]
[]
[]
[null,"Source","Reporting"]
[null,"Data quality (actual, estimate, public, consolidated)","Consolidated",null,"Use Consolidated for the Consolidated Confidential version\nUse Public for the Consolidated Public version"]
[null,"Amended RIN submission - amendment reason","Updated on 7 December 2018 - see D19/5921 (AB)  THEN public version sent on 22 January 2019 - see D19/32572 & D19/33062"]
[null,"Submission Date","30/04/218","dms_SubmissionDate","Please enter date this file submitted to AER (dd/mm/yyyy)"]
[null,"EBSS - First application of scheme in forthcoming period?","No"]
[null,"Sector",{"$f":"INDEX(dms_Sector_List,MATCH(dms_TradingName,dms_TradingName_List))","v":"Electricity"},"dms_Sector","=INDEX(dms_Sector_List,MATCH(dms_TradingName,dms_TradingName_List))"]
[null,"Segment",{"$f":"INDEX(dms_Segment_List,MATCH(dms_TradingName,dms_TradingName_List))","v":"Distribution"},"dms_Segment","=INDEX(dms_Segment_List,MATCH(dms_TradingName,dms_TradingName_List))"]
[null,"Regulatory Year Ending",{"$f":"IF(dms_MultiYear_Flag=1,LEFT(dms_Specified_FinalYear,2)&RIGHT(dms_Specified_FinalYear,2),INDEX(dms_RYE_Formula_Result,MATCH(dms_Model,dms_Model_List)))","v":"2017"},"dms_RYE","=IF(dms_MultiYear_Flag=1,LEFT(dms_Specified_FinalYear,2)&RIGHT(dms_Specified_FinalYear,2),INDEX(dms_RYE_Formula_Result,MATCH(dms_Model,dms_Model_List)))"]
[null,"Reporting Period Type",{"$f":"INDEX(dms_RPT_List,MATCH(dms_TradingName,dms_TradingName_List))","v":"Calendar"},"dms_RPT","=INDEX(dms_RPT_List,MATCH(dms_TradingName,dms_TradingName_List))"]
[null,"Model or RIN Type","ARR","dms_Model","Drop down selection"]
[null,"Security Classification","Public","dms_Classification","Always Public"]
[null,"Template - version no.",5,"dms_TemplateNumber"]
[null,"Dollar $ real month",{"$f":"INDEX(dms_RPTMonth_List,MATCH(dms_TradingName,dms_TradingName_List))","v":"December"},"dms_RPTMonth","=INDEX(dms_RPTMonth_List,MATCH(dms_TradingName,dms_TradingName_List))"]
[null,"Dollar $ real  (the last month before the FRCP_y1)",{"$f":"CONCATENATE(dms_RPTMonth)&\" \"&VALUE((LEFT(dms_CRCP_FinalYear_Result,2)&RIGHT(dms_CRCP_FinalYear_Result,2)))","v":"December 2017"},"dms_DollarReal","=IF(SUM(dms_SingleYear_Model)>0,CONCATENATE(dms_RPTMonth)&\" \"&VALUE((LEFT(CRY,2))&RIGHT(CRY,2)),CONCATENATE(dms_RPTMonth)&\" \"&VALUE((LEFT(dms_CRCP_FinalYear_Result,2)&RIGHT(dms_CRCP_FinalYear_Result,2))))"]
[null,"Dollar $ real previous year (PRCP_y5)","June 2014","dms_DollarReal_Prev","=IF(SUM(dms_SingleYear_Model)>0,CONCATENATE(dms_RPTMonth)&\" \"&VALUE(((LEFT(CRY,2))&RIGHT(CRY,2))-1),CONCATENATE(dms_RPTMonth)&\" \"&VALUE(((LEFT(dms_CRCP_FirstYear_Result,2)&RIGHT(dms_CRCP_FirstYear_Result,2))))-1)"]
[null,"Form of control",{"$f":"INDEX(dms_FormControl_List,MATCH(dms_TradingName,dms_TradingName_List))","v":"Revenue cap"},"dms_FormControl","=INDEX(dms_FormControl_List,MATCH(dms_TradingName,dms_TradingName_List))"]
[null,"Calendar Year for table 3.6 data",{"$f":"IF(dms_RPT=\"Calendar\",dms_RYE,VALUE(dms_RYE)-1)","v":"2017"},"dms_0306_Year","=IF(dms_RPT=\"Calendar\",dms_RYE,VALUE(dms_RYE)-1)"]
[null,"RIN response - version no.",1,"dms_RINversion"]
[null,"Jurisdiction",{"$f":"INDEX(dms_JurisdictionList,MATCH(dms_TradingName,dms_TradingName_List))","v":"Vic"},"dms_Jurisdiction","=INDEX(dms_JurisdictionList,MATCH(dms_TradingName,dms_TradingName_List))"]
[null,"Backcast Multiyear EB, CA or ARR?",0,"dms_MultiYear_Flag","1=y, 0-n"]
[null,null,2013,"dms_Specified_FinalYear","The result here is returned to dms_CRCP_FinalYear_Result if dms_MultiYear_Flag is set to 1"]
[null,"Single Year Model T/F",{"$f":"IF(dms_Model=\"EB\",1,0)","v":0},"dms_EB"]
[null,null,{"$f":"IF(dms_Model=\"CA\",1,0)","v":0},"dms_CA","=dms_SingleYear_Model"]
[null,null,{"$f":"IF(dms_Model=\"ARR\",1,0)","v":1},"dms_ARR"]
[null,"Single Year Final Year Reference","CRY","dms_SingleYear_FinalYear_Ref","This is the reference for EB, CA & ARR RINs"]
[null,"Single Year Final Year Result",{"$f":"INDIRECT(dms_SingleYear_FinalYear_Ref)","v":2017},"dms_SingleYear_FinalYear_Result","=INDIRECT(dms_SingleYear_FinalYear_Ref)",null,null,null,"Formula errors OK"]
[null,"FRCP length in years",{"$f":"INDEX(dms_FRCPlength_List,MATCH(dms_TradingName,dms_TradingName_List))","v":5},"dms_FRCPlength_Num","=INDEX(dms_FRCPlength_List,MATCH(dms_TradingName,dms_TradingName_List))"]
[null,"Multi Year Final Year Reference",{"$f":"INDEX(dms_FinalYear_List,MATCH(dms_FRCPlength_Num,dms_FRCPlength_Num_List))","v":"dms_FRCP_y5"},"dms_MultiYear_FinalYear_Ref","=INDEX(dms_FinalYear_List,MATCH(dms_FRCPlength_Num,dms_FRCPlength_Num_List))"]
[null,"Multi Year Final Year Result",{"$f":"IF(dms_MultiYear_Flag=0,INDIRECT(dms_MultiYear_FinalYear_Ref),dms_Specified_FinalYear)","v":2021},"dms_MultiYear_FinalYear_Result","=IF(dms_MultiYear_Flag=0,INDIRECT(dms_MultiYear_FinalYear_Ref),dms_Specified_FinalYear)",null,null,null,"Formula errors OK"]
[null,"CRCP length in years",{"$f":"INDEX(dms_CRCPlength_List,MATCH(dms_TradingName,dms_TradingName_List))","v":5},"dms_CRCPlength_Num","=INDEX(dms_CRCPlength_List,MATCH(dms_TradingName,dms_TradingName_List))"]
[null,"CRCP Final Year Reference",{"$f":"INDEX(dms_CFinalYear_List,MATCH(dms_CRCPlength_Num,dms_CRCPlength_Num_List))","v":"CRCP_y5"},"dms_CRCP_FinalYear_Ref","=INDEX(dms_CFinalYear_List,MATCH(dms_CRCPlength_Num,dms_CRCPlength_Num_List))"]
[null,"CRCP First Year Result",{"$f":"INDEX(dms_CRCP_years,MATCH(dms_CRCPlength_Num,dms_CRCP_index))","v":2012},"dms_CRCP_FirstYear_Result","=INDEX(dms_CRCP_years,MATCH(dms_CRCPlength_Num,dms_CRCP_index))"]
[null,"CRCP Final Year Result",{"$f":"IF(dms_MultiYear_Flag=0,(IF(SUM(dms_SingleYear_Model)>0,CRY,dms_CRCP_yZ)),dms_Specified_FinalYear)","v":2017},"dms_CRCP_FinalYear_Result","=IF(dms_MultiYear_Flag=0,(IF(SUM(dms_SingleYear_Model)>0,CRY,dms_CRCP_yZ)),dms_Specified_FinalYear)"]
[null,"Table 6.6.3 - Public lighting repair - no. business days",{"$f":"INDEX(dms_663_List,MATCH(dms_TradingName,dms_TradingName_List))","v":2},"dms_663"]
[null,"Distribution Determination Reference",{"$f":"INDEX(dms_DeterminationRef_List,MATCH(dms_TradingName,dms_TradingName_List))","v":"2016-20 Distribution Determination"},"dms_DeterminationRef"]
[null,"Backcast templates only - unit of measure ","$0s","dms_Backcast_UOM","If the cover sheet is for Backcast data ensure to apply dms_Backcast_UOM named range to this field. Otherwise, do not apply this named range."]
[null,"EB/CA Unit of Measure for Monetary Values","$0s","dms_dollar_nom_UOM","If the cover sheet is attached to an EB files make sure this field is set"]
[null,"Is this Submission File a Subset File","NO","dms_Partial"]
[null,"discard this record?","NO","dms_DISCARD","If record is to be discarded from DB set this flag to YES"]
[null,"CBD Feeder for this business",{"$f":"INDEX(dms_CBD_flag,MATCH(dms_TradingName,dms_TradingName_List))","v":0},"dms_CBD_flag_NSP"]
[null,"Urban Feeder for this business",{"$f":"INDEX(dms_Urban_flag,MATCH(dms_TradingName,dms_TradingName_List))","v":0},"dms_Urban_flag_NSP"]
[null,"Short rural Feeder for this business",{"$f":"INDEX(dms_ShortRural_flag,MATCH(dms_TradingName,dms_TradingName_List))","v":"YES"},"dms_ShortRural_flag_NSP"]
[null,"Long rural Feeder for this business",{"$f":"INDEX(dms_LongRural_flag,MATCH(dms_TradingName,dms_TradingName_List))","v":"NO"},"dms_LongRural_flag_NSP"]
[null,"USES NAMED RANGES FLAG","yes","dms_Defined_Names_Used"]
[]
[]
[null,"REGULATORY YEARS FOR MULTI RYE SUBMISSIONS"]
[null,"Multiple RYE flag","NO","dms_Multi_RYE_flag"]
[null,null,"Manually specify RYE","Named ranges to apply"]
[null,null,2013,"dms_RYE_01"]
[null,null,2014,"dms_RYE_02"]
[null,null,2015,"dms_RYE_03"]
[null,null,2016,"dms_RYE_04"]
[null,null,2017,"dms_RYE_05"]

{"sheet":"2.11 Labour","index":4,"n_rows":36,"n_cols":4,"rows_kept":36,"cut":false,"hidden":false,"merged":[]}
[null,{"$f":"(LOOKUP(dms_Model,dms_Model_List,dms_Worksheet_List))","v":"ANNUAL REPORTING STATEMENT"}]
[null,{"$f":"dms_TradingName","v":"United Energy"}]
[null,{"$f":"CONCATENATE(\"Annual Reporting RIN Response \",CRY)","v":"Annual Reporting RIN Response 2017"}]
[null,"2.11 LABOUR "]
[]
[null,"Tables 2.11.1 and 2.11.2 deliberately omitted."]
[]
[null,"2.11.3 - LABOUR / NON-LABOUR EXPENDITURE SPLIT"]
[null,"2.11.3.1 - Opex"]
[null,null,{"$f":"CRY","v":2017}]
[null,null,"$0's, nominal"]
[null,null,"Opex "]
[null,"In-house labour expenditure"]
[null,"Labour expenditure outsourced to related parties"]
[null,"Labour expenditure outsourced to unrelated parties"]
[null,"Controllable non-labour expenditure"]
[null,"Uncontrollable non-labour expenditure"]
[null,"Total",{"$f":"SUM(C13:C17)","v":0}]
[]
[null,"Reconciliation with Opex worksheets - SCS","Opex"]
[null,"Total including margins",{"$f":"dms_Total_Actual_Opex","v":133029976.06209952},{"$f":"IF(ROUND(C18,0)=ROUND(dms_Total_Actual_Opex,0),\"OK\",\"Error\")","v":"Error"}]
[]
[]
[null,"2.11.3.2 - Capex"]
[null,null,{"$f":"CRY","v":2017}]
[null,null,"$0's, nominal"]
[null,null,"Capex"]
[null,"In-house labour expenditure"]
[null,"Labour expenditure outsourced to related parties"]
[null,"Labour expenditure outsourced to unrelated parties"]
[null,"Controllable non-labour expenditure"]
[null,"Uncontrollable non-labour expenditure"]
[null,"Total",{"$f":"SUM(C28:C32)","v":0}]
[]
[null,"Reconciliation with Capex & Opex worksheets - SCS","Capex"]
[null,"Total including margins",{"$f":"dms_Total_Actual_Capex","v":191970857.55000001},{"$f":"IF(ROUND(C33,0)=ROUND(dms_Total_Actual_Capex,0),\"OK\",\"Error\")","v":"Error"}]

{"sheet":"3.6 Quality of services","index":5,"n_rows":74,"n_cols":4,"rows_kept":74,"cut":false,"hidden":false,"merged":[]}
[null,{"$f":"(LOOKUP(dms_Model,dms_Model_List,dms_Worksheet_List))","v":"ANNUAL REPORTING STATEMENT"}]
[null,{"$f":"dms_TradingName","v":"United Energy"}]
[null,{"$f":"CONCATENATE(\"Annual Reporting RIN Response \",CRY)","v":"Annual Reporting RIN Response 2017"}]
[null,"3.6 QUALITY OF SERVICES"]
[]
[null,"3.6.5 - QUALITY OF SUPPLY METRICS"]
[null,null,null,"Volume"]
[null,null,"Units",{"$f":"CRY","v":2017}]
[null,"Over voltage events - due to high voltage injection","number"]
[null,"Customers receiving over-voltage - due to high voltage injection","number"]
[null,"Over voltage events - due to lightning","number"]
[null,"Customers receiving over-voltage - due to lightning","number"]
[null,"Over voltage events - due to voltage regulation or other cause","number"]
[null,"Customers receiving over-voltage - due to voltage regulation or other cause","number"]
[null,"Voltage variations - steady state (zone sub)","number",45]
[null,"Voltage variations - one minute (zone sub)","number",5]
[null,"Voltage variations - 10 seconds (zone sub) Min<0.7","number",1247]
[null,"Voltage variations - 10 seconds (zone sub) Min<0.8","number",499]
[null,"Voltage variations - 10 seconds (zone sub) Min<0.9","number",2358]
[null,"Voltage variations - steady state (feeder)","number",676]
[null,"Voltage variations - % zone subs monitored","(per cent)",1]
[null,"Voltage variations - % feeders monitored","(per cent)",1]
[]
[null,"3.6.6 - COMPLAINTS - TECHNICAL QUALITY OF SUPPLY"]
[null,null,null,"Volume"]
[null,null,"Units",{"$f":"CRY","v":2017}]
[null,"3.6.6.1 - TECHNICAL QUALITY OF SUPPLY"]
[null,"Number of complaints - technical quality of supply","number",45]
[null,"3.6.6.2 - PERCENTAGE OF COMPLAINTS BY CATEGORY"]
[null,"Low voltage supply","(per cent)",4.3999999999999997E-2]
[null,"Voltage dips","(per cent)",2.1999999999999999E-2]
[null,"Voltage swell","(per cent)",0.35599999999999998]
[null,"Voltage spike (impulsive transient)","(per cent)",0.2]
[null,"Waveform distortion","(per cent)",0]
[null,"TV or radio interference","(per cent)",0]
[null,"Solar related","(per cent)",0.111]
[null,"Noise from appliances","(per cent)",4.3999999999999997E-2]
[null,"Other","(per cent)",0.156]
[null,"3.6.6.3 - PERCENTAGE OF COMPLAINTS BY LIKELY CAUSE"]
[null,"Network equipment faulty","(per cent)",0.17799999999999999]
[null,"Network interference by NSP equipment","(per cent)",0]
[null,"Network interference by another customer","(per cent)",0]
[null,"Network limitation","(per cent)",0]
[null,"Customer internal problem","(per cent)",0]
[null,"No problem identified","(per cent)",0.13300000000000001]
[null,"Environmental","(per cent)",0]
[null,"Other","(per cent)",0.68899999999999995]
[]
[]
[]
[null,"3.6.7 - CUSTOMER SERVICE METRICS"]
[null,null,null,"Volume"]
[null,null,"Unit",{"$f":"CRY","v":2017}]
[null,"3.6.7.1 - TIMELY PROVISIONS OF SERVICES"]
[null,"Number of connections made","number",12835]
[null,"Number of connections not made on or before agreed date","number",427]
[null,"3.6.7.2 - TIMELY REPAIR OF FAULTY STREET LIGHTS"]
[null,"Street lights - average monthly number \"out\"","number",784]
[null,"Street lights - not repaired by \"fix by\" date","number",2310]
[null,"Street lights - average number of days to repair","number",2]
[null,"Total number of street lights","number",120839]
[null,"3.6.7.3 - CALL CENTRE PERFORMANCE"]
[null,"Calls to call centre fault line","number",95613]
[null,"Calls to fault line answered within 30 seconds","number",76723]
[null,"Calls to fault line - average waiting time before call answered","number",31]
[null,"Call centre - number of overload events","number",0]
[null,"Percentage of calls abandoned","(per cent)",0.31359999999999999]
[null,"3.6.7.4 - NUMBER OF CUSTOMER COMPLAINTS"]
[null,"Complaint - reliability of supply","number",276]
[null,"Complaint - technical quality of supply","number",45]
[null,"Complaint - administrative process or customer service","number",245]
[null,"Complaint - connection or augmentation","number",1546]
[null,"Complaint - other","number",1356]
[null,"Total number of complaints","number",3468]

{"sheet":"3.6.8 Network-feeders","index":6,"n_rows":477,"n_cols":23,"rows_kept":477,"cut":false,"hidden":false,"merged":[[10,10,10,14],[11,11,11,12],[11,13,11,14],[11,18,11,19],[11,15,12,15],[11,10,12,10],[10,15,10,19],[11,16,11,17],[5,6,5,8],[5,1,5,4],[11,8,12,8],[11,9,12,9],[11,20,12,20],[10,20,10,22],[11,21,11,22],[10,1,12,1],[10,2,12,2],[10,3,12,3],[10,4,12,4],[10,7,12,7],[11,5,12,5],[11,6,12,6],[10,5,10,6],[10,8,10,9]]}
[null,{"$f":"(LOOKUP(dms_Model,dms_Model_List,dms_Worksheet_List))","v":"ANNUAL REPORTING STATEMENT"}]
[null,{"$f":"dms_TradingName","v":"United Energy"}]
[null,{"$f":"CONCATENATE(\"Annual Reporting RIN Response \",CRY)","v":"Annual Reporting RIN Response 2017"}]
[null,"3.6 QUALITY OF SERVICES"]
[]
[null,"Did the MAIFI parameter of the STPIS apply during the period?",null,null,null,"Yes","** IMPORTANT\nPlease ensure this question is answered correctly. Your response will affect other tables throughout this workbook and will determine which cells are grey and which are input cells. "]
[]
[]
[]
[null,"3.6.8 - NETWORK FEEDER RELIABILITY"]
[null,"Feeder ID / name","Description of the service area for the feeder","Feeder classification\n\n(drop down)","Number of distribution customers","Length of high voltage distribution lines",null,"Maximum demand\n(MVA)","Energy not supplied\n(MWh)",null,"Unplanned Outages",null,null,null,null,"Planned Outages",null,null,null,null,"Momentary feeder outages"]
[null,null,null,null,null,"Overhead","Underground",null,"Unplanned","Planned","Total number of unplanned outages","Unplanned customer minutes off-supply (SAIDI)",null,"Unplanned interruptions\n(SAIFI)",null,"Total number of planned outages","Planned customer minutes off-supply (SAIDI)",null,"Planned interruptions\n(SAIFI)",null,"Total number of momentary feeder outages","Momentary interruptions due to feeder outages (MAIFI)"]
[null,null,null,null,null,null,null,null,null,null,null,"Including excluded events and MEDs","After removing excluded events and MED","Including excluded events and MEDs","After removing excluded events and MED",null,"Including MEDs","After removing  MED","Including MEDs","After removing  MED",null,"Including excluded events and MEDs","After removing excluded events and MED"]
[null,"AR11","Citipower","Urban",0,0,0.183,0,0,0,0,0,0,0,0,0,0,0,0,0,0,0,0]
[null,"AR12","Citipower","Urban",261,2.294,0.50900000000000001,0,0,0,0,0,0,0,0,0,0,0,0,0,0,0,0]
[null,"AR2","Citipower","Urban",110,0,1.375,0,0,0,0,0,0,0,0,0,0,0,0,0,0,0,0]
[null,"AR3","Citipower","Urban",71,3.504,2.4820000000000002,0,0,0,2,37.229999999999997,37.229999999999997,0.19041,0.19041,0,0,0,0,0,0,0,0]
[null,"AR6","Citipower","Urban",386,0.621,2.2480000000000002,0,0,0,1,0.62409999999999999,0.62409999999999999,2.5929999999999998E-3,2.5929999999999998E-3,0,0,0,0,0,0,0,0]
[null,"AR7","Citipower","Urban",302,3.0249999999999999,1.0900000000000001,0,0,0,0,0,0,0,0,2,41.680329999999998,41.680329999999998,0.18568999999999999,0.18568999999999999,0,0,0]
[null,"BC11","Citipower","Urban",1241,1.33,1.381,0,0,0,5,2.0421999999999998,2.0421999999999998,2.4981E-2,2.4981E-2,0,0,0,0,0,2,1.9678199999999999,1.9678199999999999]
[null,"BC12","Citipower","Urban",204,2.331,0.30499999999999999,0,0,0,0,0,0,0,0,0,0,0,0,0,0,0,0]
[null,"BC22","Citipower","Urban",504,0.02,2.8929999999999998,0,0,0,6,16.459499999999998,16.459499999999998,0.15115000000000001,0.15115000000000001,0,0,0,0,0,0,0,0]
[null,"BC23","Citipower","Urban",1306,2.8460000000000001,1.214,0,0,0,7,3.3170000000000002,3.3170000000000002,4.2736000000000003E-2,4.2736000000000003E-2,1,42.62838,42.62838,9.1869999999999993E-2,9.1869999999999993E-2,0,0,0]
[null,"BC6","Citipower","Urban",5,0,1.9119999999999999,0,0,0,0,0,0,0,0,0,0,0,0,0,0,0,0]
[null,"BH11","United Energy","Urban",2070,5.3339999999999996,0.54100000000000004,5.8959999999999999,2.3E-2,0.58199999999999996,11,0.63819999999999999,0.63819999999999999,5.313E-3,5.313E-3,4,16.304290000000002,16.304290000000002,4.7820000000000001E-2,4.7820000000000001E-2,1,0.84045000000000003,0.84045000000000003]
[null,"BH12","United Energy","Urban",1890,4.633,1.07,4.1989999999999998,1.4999999999999999E-2,0.83,5,0.79210000000000003,0.79210000000000003,1.4504E-2,1.4504E-2,8,44.274340000000002,44.274340000000002,0.20418,0.20418,2,1.2996700000000001,1.2996700000000001]
[null,"BH14","United Energy","Urban",1,0,1.1639999999999999,6.6520000000000001,0,0,0,0,0,0,0,0,0,0,0,0,0,0,0]
[null,"BH21","United Energy","Urban",2427,7.3520000000000003,0.52200000000000002,4.6120000000000001,2.6019999999999999,4.3970000000000002,17,94.125799999999998,94.125799999999998,1.939049,1.939049,16,159.04485,159.04485,0.46839999999999998,0.46839999999999998,0,0,0]
[null,"BH22","United Energy","Urban",1525,6.0270000000000001,0.85099999999999998,4.6219999999999999,2.556,1.147,10,86.555199999999999,86.555199999999999,1.038856,1.038856,7,38.833590000000001,38.833590000000001,0.16588,0.16588,0,0,0]
[null,"BH23","United Energy","Urban",2996,6.92,1.552,9.15,9.6010000000000009,1.5409999999999999,17,134.01689999999999,134.01689999999999,1.024238,1.024238,9,21.507079999999998,21.507079999999998,6.3089999999999993E-2,6.3089999999999993E-2,0,0,0]
[null,"BH31","United Energy","Urban",1451,5.6509999999999998,2.8450000000000002,3.375,1.6259999999999999,4.7809999999999997,10,102.77809999999999,102.77809999999999,0.79057100000000002,0.79057100000000002,10,302.26772,302.26772,0.81401000000000001,0.81401000000000001,1,0.97597999999999996,0.97597999999999996]
[null,"BH34","United Energy","Urban",1208,4.391,0.627,2.5510000000000002,1.155,0.104,4,100.38160000000001,100.38160000000001,1.3105899999999999,1.3105899999999999,1,9.0756099999999993,9.0756099999999993,3.4770000000000002E-2,3.4770000000000002E-2,0,0,0]
[null,"BR1","United Energy","Urban",1548,5.7949999999999999,0.27900000000000003,4.4210000000000003,0.94099999999999995,0.24,7,40.498899999999999,40.498899999999999,6.7067000000000002E-2,6.7067000000000002E-2,1,10.338139999999999,10.338139999999999,2.1319999999999999E-2,2.1319999999999999E-2,0,0,0]
[null,"BR10","United Energy","Urban",1101,3.6749999999999998,3.0089999999999999,3.411,6.2E-2,0,4,3.1793,3.1793,2.5132000000000002E-2,2.5132000000000002E-2,0,0,0,0,0,0,0,0]
[null,"BR13","United Energy","Urban",1428,4.5739999999999998,7.0000000000000001E-3,3.88,5.7000000000000002E-2,1.08,6,3.0246,3.0246,3.8608999999999997E-2,3.8608999999999997E-2,4,57.460099999999997,57.460099999999997,0.15051,0.15051,0,0,0]
[null,"BR15","United Energy","Urban",1384,3.7109999999999999,0.18,3.6840000000000002,7.0000000000000001E-3,0,7,0.42820000000000003,0.42820000000000003,5.0569999999999999E-3,5.0569999999999999E-3,0,0,0,0,0,1,0.99846999999999997,0.99846999999999997]
[null,"BR4","United Energy","Urban",1528,4.2009999999999996,7.5999999999999998E-2,4.0659999999999998,0.751,0.193,10,38.936599999999999,38.936599999999999,0.35718699999999998,0.35718699999999998,1,9.9982100000000003,9.9982100000000003,4.2549999999999998E-2,4.2549999999999998E-2,0,0,0]
[null,"BR6","United Energy","Urban",1270,7.0439999999999996,0.64,4.0620000000000003,5.1999999999999998E-2,1.6319999999999999,10,2.4540999999999999,2.4540999999999999,0.185748,0.185748,7,76.456519999999998,76.456519999999998,0.16929,0.16929,0,0,0]
[null,"BR9","United Energy","Urban",1566,5.2329999999999997,0.246,4.8810000000000002,0.17199999999999999,9.5000000000000001E-2,13,6.8945999999999996,6.8945999999999996,3.8199999999999998E-2,3.8199999999999998E-2,1,3.7919200000000002,3.7919200000000002,2.1069999999999998E-2,2.1069999999999998E-2,1,0.97160000000000002,0.97160000000000002]
[null,"BRA21","Ausnet","Urban",259,3.8690000000000002,0.20499999999999999,0,0,0,2,181.44810000000001,181.44810000000001,1.0300279999999999,1.0300279999999999,1,19.823090000000001,19.823090000000001,7.3419999999999999E-2,7.3419999999999999E-2,1,0.98536000000000001,0.98536000000000001]
[null,"BRA23","Ausnet","Urban",20,1.163,8.6999999999999994E-2,0,0,0,1,945.91470000000004,945.91470000000004,0.73612,0.73612,1,6.1834100000000003,6.1834100000000003,1.03057,1.03057,0,0,0]
[null,"BT10","United Energy","Urban",2076,5.4589999999999996,0.20300000000000001,5.1319999999999997,0.44400000000000001,2.278,17,17.551600000000001,17.551600000000001,0.16494700000000001,0.16494700000000001,15,90.082650000000001,90.082650000000001,0.41272999999999999,0.41272999999999999,1,1.0012399999999999,1.0012399999999999]
[null,"BT14","United Energy","Urban",1261,2.91,0.371,3.5459999999999998,2.9000000000000001E-2,0.316,7,1.5101,1.5101,2.8837999999999999E-2,2.8837999999999999E-2,3,16.528749999999999,16.528749999999999,5.9479999999999998E-2,5.9479999999999998E-2,2,1.8924000000000001,1.8924000000000001]
[null,"BT15","United Energy","Urban",1924,3.2410000000000001,1.036,3.6640000000000001,0.104,3.5910000000000002,11,4.1105999999999998,4.1105999999999998,3.0245000000000001E-2,3.0245000000000001E-2,10,141.41726,141.41726,0.37118000000000001,0.37118000000000001,0,0,0]
[null,"BT2","United Energy","Urban",1604,3.0270000000000001,0.92500000000000004,3.5979999999999999,3.9E-2,1.889,8,1.7816000000000001,1.7816000000000001,3.0613999999999999E-2,3.0613999999999999E-2,5,85.485659999999996,85.485659999999996,0.20197000000000001,0.20197000000000001,0,0,0]
[null,"BT4","United Energy","Urban",2184,5.2249999999999996,1.726,3.9929999999999999,0.12,0.183,10,4.3506999999999998,4.3506999999999998,2.6574E-2,2.6574E-2,2,6.6269099999999996,6.6269099999999996,4.6240000000000003E-2,4.6240000000000003E-2,0,0,0]
[null,"BT5","United Energy","Urban",750,2.0539999999999998,0.25700000000000001,1.71,4.0000000000000001E-3,0.44400000000000001,1,0.57299999999999995,0.57299999999999995,1.333E-3,1.333E-3,2,58.183329999999998,58.183329999999998,0.17058000000000001,0.17058000000000001,0,0,0]
[null,"BT6","United Energy","Urban",1029,3.0289999999999999,0.24099999999999999,2.5529999999999999,3.47,0,5,217.7372,217.7372,1.217635,1.217635,0,0,0,0,0,0,0,0]
[null,"BT9","United Energy","Urban",1813,5.5940000000000003,0.86199999999999999,2.5299999999999998,0.01,1.4390000000000001,4,0.50839999999999996,0.50839999999999996,2.2070000000000002E-3,2.2070000000000002E-3,9,73.587770000000006,73.587770000000006,0.22564999999999999,0.22564999999999999,0,0,0]
[null,"BU1","United Energy","Urban",1330,6.8949999999999996,0.30499999999999999,3.988,6.4000000000000001E-2,3.7669999999999999,7,3.4281999999999999,3.4281999999999999,2.3496E-2,2.3496E-2,21,203.3347,203.3347,0.56181999999999999,0.56181999999999999,1,0.98524999999999996,0.98524999999999996]
[null,"BU10","United Energy","Urban",1768,8.2970000000000006,0.16200000000000001,3.95,1.5660000000000001,0.79,8,65.9572,65.9572,2.3385060000000002,2.3385060000000002,6,33.270690000000002,33.270690000000002,0.11763,0.11763,0,0,0]
[null,"BU13","United Energy","Urban",745,5.5780000000000003,0.81899999999999995,2.2669999999999999,3.5999999999999997E-2,2.2320000000000002,2,2.2521,2.2521,1.9495999999999999E-2,1.9495999999999999E-2,5,138.60061999999999,138.60061999999999,0.33276,0.33276,0,0,0]
[null,"BU14","United Energy","Urban",1680,9.8859999999999992,0.68200000000000005,4.3369999999999997,0.46400000000000002,1.502,9,18.060099999999998,18.060099999999998,8.4997000000000003E-2,8.4997000000000003E-2,15,58.497869999999999,58.497869999999999,0.15242,0.15242,0,0,0]
[null,"BU2","United Energy","Urban",1610,9.0549999999999997,2.202,3.5459999999999998,2E-3,1.732,1,7.2300000000000003E-2,7.2300000000000003E-2,6.2100000000000002E-4,6.2100000000000002E-4,11,70.059600000000003,70.059600000000003,0.20307,0.20307,0,0,0]
[null,"BU4","United Energy","Urban",1497,6.0759999999999996,0.11,3.8279999999999998,2.1999999999999999E-2,0.93400000000000005,4,1.2242,1.2242,7.9579999999999998E-3,7.9579999999999998E-3,8,52.217610000000001,52.217610000000001,0.17505000000000001,0.17505000000000001,1,0.9708,0.9708]
[null,"BU6","United Energy","Urban",1504,5.444,0.81100000000000005,3.4809999999999999,1.6E-2,0.32200000000000001,4,0.93479999999999996,0.93479999999999996,8.7980000000000003E-3,8.7980000000000003E-3,5,19.25085,19.25085,7.7799999999999994E-2,7.7799999999999994E-2,0,0,0]
[null,"BU9","United Energy","Urban",1673,7.8760000000000003,1.702,3.6960000000000002,7.6999999999999999E-2,2.1040000000000001,15,3.7429999999999999,3.7429999999999999,5.1193000000000002E-2,5.1193000000000002E-2,10,102.10883,102.10883,0.32984999999999998,0.32984999999999998,1,0.95848999999999995,0.95848999999999995]
[null,"BW21","United Energy","Urban",1876,6.6680000000000001,0.81100000000000005,4.1360000000000001,0.625,1.0620000000000001,9,23.819400000000002,23.819400000000002,4.1897999999999998E-2,4.1897999999999998E-2,5,40.442979999999999,40.442979999999999,0.12418999999999999,0.12418999999999999,0,0,0]
[null,"BW22","United Energy","Urban",645,3.6480000000000001,1.387,3.09,2.3559999999999999,2.3090000000000002,6,127.15219999999999,127.15219999999999,0.27263199999999999,0.27263199999999999,9,124.61870999999999,124.61870999999999,0.41399999999999998,0.41399999999999998,0,0,0]
[null,"BW23","United Energy","Urban",855,2.9870000000000001,1.222,3.1459999999999999,1.157,0.47599999999999998,4,74.004099999999994,74.004099999999994,0.47350199999999998,0.47350199999999998,3,30.48535,30.48535,0.11224000000000001,0.11224000000000001,0,0,0]
[null,"BW32","United Energy","Urban",971,2.6349999999999998,0.47599999999999998,2.3109999999999999,0.26800000000000002,2.9969999999999999,12,18.1312,18.1312,0.119406,0.119406,5,202.78065000000001,202.78065000000001,0.63922999999999996,0.63922999999999996,0,0,0]
[null,"BW33","United Energy","Urban",1560,8.0690000000000008,0.10199999999999999,3.359,3.6999999999999998E-2,3.4670000000000001,5,1.837,1.837,1.8918999999999998E-2,1.8918999999999998E-2,13,170.7825,170.7825,0.58704000000000001,0.58704000000000001,0,0,0]
[null,"BW34","United Energy","Urban",1582,6.0049999999999999,0.16,3.3540000000000001,1.6259999999999999,0.44400000000000001,7,90.071299999999994,90.071299999999994,0.94315099999999996,0.94315099999999996,4,24.61382,24.61382,8.9109999999999995E-2,8.9109999999999995E-2,0,0,0]
[null,"BW35","United Energy","Urban",1965,6.649,0.28399999999999997,4.4050000000000002,1.377,0.36,15,51.734400000000001,51.734400000000001,7.4795E-2,7.4795E-2,4,13.52416,13.52416,3.7650000000000003E-2,3.7650000000000003E-2,0,0,0]
[null,"CDA11","United Energy","Urban",1844,7.3259999999999996,1.9350000000000001,5.1180000000000003,1.19,0.91200000000000003,9,39.680799999999998,39.680799999999998,2.4025789999999998,2.4025789999999998,3,30.38916,30.38916,9.1670000000000001E-2,9.1670000000000001E-2,0,0,0]
[null,"CDA21","United Energy","Urban",659,4.3810000000000002,0.52900000000000003,1.754,0.628,0,4,54.271599999999999,54.271599999999999,0.98756200000000005,0.98756200000000005,0,0,0,0,0,1,0.97543000000000002,0.97543000000000002]
[null,"CDA22","United Energy","Urban",2017,13.585000000000001,4.3819999999999997,8.1359999999999992,0.69,0.31,15,10.1028,10.1028,0.42247499999999999,0.42247499999999999,1,4.5378299999999996,4.5378299999999996,2.5780000000000001E-2,2.5780000000000001E-2,0,0,0]
[null,"CDA23","United Energy","Urban",4743,17.256,1.6839999999999999,9.6560000000000006,2.6389999999999998,7.8460000000000001,24,44.920499999999997,44.920499999999997,1.1686879999999999,1.1686879999999999,16,133.56791999999999,133.56791999999999,0.37252999999999997,0.37252999999999997,0,0,0]
[null,"CDA24","United Energy","Urban",3812,13.045999999999999,1.7110000000000001,8.6010000000000009,1.268,3.6230000000000002,28,21.1875,21.1875,0.98164300000000004,0.98164300000000004,10,60.541200000000003,60.541200000000003,0.20516999999999999,0.20516999999999999,0,0,0]
[null,"CFD11","United Energy","Urban",190,0,2.452,3.45,3.6999999999999998E-2,3.895,2,1.4956,1.4956,1.0553999999999999E-2,1.0553999999999999E-2,3,159.54553000000001,159.54553000000001,0.51712999999999998,0.51712999999999998,0,0,0]
[null,"CFD12","United Energy","Urban",1199,1.391,4.3959999999999999,4.5940000000000003,1.605,5.6260000000000003,13,48.735700000000001,48.735700000000001,0.55434799999999995,0.55434799999999995,12,170.79578000000001,170.79578000000001,0.47282000000000002,0.47282000000000002,0,0,0]
[null,"CFD13","United Energy","Urban",1796,4.9000000000000004,0.54200000000000004,4.1539999999999999,1.3109999999999999,0.16800000000000001,21,55.262500000000003,55.262500000000003,1.1203289999999999,1.1203289999999999,2,7.0973800000000002,7.0973800000000002,5.0680000000000003E-2,5.0680000000000003E-2,1,1.0018199999999999,1.0018199999999999]
[null,"CFD14","United Energy","Urban",3591,6.8650000000000002,1.86,7.8390000000000004,0.104,2.8639999999999999,12,2.3170999999999999,2.3170999999999999,2.1897E-2,2.1897E-2,6,63.58616,63.58616,0.17738999999999999,0.17738999999999999,0,0,0]
[null,"CFD15","United Energy","Urban",2752,1.7769999999999999,0.79900000000000004,3.2349999999999999,7.0000000000000007E-2,2.4660000000000002,9,3.0975999999999999,3.0975999999999999,4.5182E-2,4.5182E-2,7,108.36978999999999,108.36978999999999,0.29465000000000002,0.29465000000000002,1,0.98785000000000001,0.98785000000000001]
[null,"CFD16","United Energy","Urban",1679,4.157,4.53,5.1050000000000004,0.01,1.268,7,0.42109999999999997,0.42109999999999997,4.169E-3,4.169E-3,5,51.216949999999997,51.216949999999997,0.21262,0.21262,1,0.83140999999999998,0.83140999999999998]
[null,"CFD21","United Energy","Urban",146,0,1.7889999999999999,0.59499999999999997,6.7000000000000004E-2,0,1,13.207700000000001,13.207700000000001,1.0883130000000001,1.0883130000000001,0,0,0,0,0,0,0,0]
[null,"CFD22","United Energy","Urban",1292,4.1269999999999998,1.24,2.9540000000000002,0.24399999999999999,4.1000000000000002E-2,5,12.319100000000001,12.319100000000001,0.99917,0.99917,1,2.0899299999999998,2.0899299999999998,6.9699999999999996E-3,6.9699999999999996E-3,1,0.96911000000000003,0.96911000000000003]
[null,"CFD23","United Energy","Urban",1787,3.298,0.245,4.9109999999999996,0.92400000000000004,0.71799999999999997,11,34.103499999999997,34.103499999999997,1.212634,1.212634,2,26.50705,26.50705,5.7079999999999999E-2,5.7079999999999999E-2,0,0,0]
[null,"CFD24","United Energy","Urban",787,3.1160000000000001,0.50900000000000001,3.6459999999999999,0.46700000000000003,1.4359999999999999,10,13.784700000000001,13.784700000000001,0.97476799999999997,0.97476799999999997,6,42.423409999999997,42.423409999999997,0.16771,0.16771,0,0,0]
[null,"CFD25","United Energy","Urban",1423,2.883,1.1020000000000001,2.6819999999999999,0.156,1.607,8,11.4666,11.4666,0.91151499999999996,0.91151499999999996,6,117.74482999999999,117.74482999999999,0.25020999999999999,0.25020999999999999,0,0,0]
[null,"CFD26","United Energy","Urban",2728,2.6150000000000002,1.109,3.669,0.45,1.4610000000000001,13,18.497599999999998,18.497599999999998,1.020572,1.020572,10,59.990079999999999,59.990079999999999,0.17302000000000001,0.17302000000000001,0,0,0]
[null,"CM11","United Energy","Urban",47,1.528,0.41299999999999998,2.1749999999999998,3.5000000000000003E-2,1.927,1,1.7307999999999999,1.7307999999999999,2.1107000000000001E-2,2.1107000000000001E-2,2,96.038650000000004,96.038650000000004,0.23218,0.23218,0,0,0]
[null,"CM12","United Energy","Urban",256,0,2.5339999999999998,4.1319999999999997,0,0,0,0,0,0,0,0,0,0,0,0,0,0,0]
[null,"CM13","United Energy","Urban",1083,3.6869999999999998,0.31900000000000001,2.629,2.1999999999999999E-2,0.76200000000000001,11,1.3087,1.3087,1.0161E-2,1.0161E-2,4,45.594889999999999,45.594889999999999,0.19583999999999999,0.19583999999999999,1,0.96994999999999998,0.96994999999999998]
[null,"CM14","United Energy","Urban",8,0,1.6319999999999999,2.38,0,0,0,0,0,0,0,0,0,0,0,0,0,0,0]
[null,"CM15","United Energy","Urban",76,0.496,0.93600000000000005,1.6060000000000001,0,0.312,0,0,0,0,0,2,31.01521,31.01521,5.2350000000000001E-2,5.2350000000000001E-2,0,0,0]
[null,"CM21","United Energy","Urban",116,0.99399999999999999,0.52500000000000002,3.206,0,0.81699999999999995,0,0,0,0,0,2,27.023510000000002,27.023510000000002,0.19889000000000001,0.19889000000000001,0,0,0]
[null,"CM22","United Energy","Urban",430,1.603,3.7999999999999999E-2,1.3380000000000001,6.3E-2,2.3940000000000001,2,8.4336000000000002,8.4336000000000002,0.72373500000000002,0.72373500000000002,4,319.14697000000001,319.14697000000001,0.71086000000000005,0.71086000000000005,0,0,0]
[null,"CM23","United Energy","Urban",0,3.1E-2,1.5569999999999999,2.3959999999999999,0,0,0,0,0,0,0,0,0,0,0,0,0,0,0]
[null,"CM24","United Energy","Urban",251,1.0669999999999999,1.044,3.0049999999999999,0.23300000000000001,0.49,1,12.102,12.102,1.073941,1.073941,1,25.443190000000001,25.443190000000001,7.1669999999999998E-2,7.1669999999999998E-2,0,0,0]
[null,"CM25","United Energy","Urban",1457,3.5230000000000001,0.877,2.8559999999999999,3.0550000000000002,2.46,5,138.75479999999999,138.75479999999999,2.064994,2.064994,13,111.70773,111.70773,0.36788999999999999,0.36788999999999999,1,0.99041999999999997,0.99041999999999997]
[null,"CRM11","United Energy","Urban",8,2.3090000000000002,0.54100000000000004,13.308,0,0,0,0,0,0,0,0,0,0,0,0,0,0,0]
[null,"CRM12","United Energy","Urban",3457,4.8280000000000003,3.0609999999999999,6.6870000000000003,0.309,6.6349999999999998,22,7.6249000000000002,7.6249000000000002,5.6453999999999997E-2,5.6453999999999997E-2,20,163.97730000000001,163.97730000000001,0.41707,0.41707,0,0,0]
[null,"CRM13","United Energy","Urban",764,10.212,3.3090000000000002,7.7,0.83899999999999997,2.1080000000000001,13,18.91,18.91,0.33201999999999998,0.33201999999999998,5,47.496450000000003,47.496450000000003,0.21199999999999999,0.21199999999999999,1,1.14377,1.14377]
[null,"CRM14","United Energy","Urban",4112,21.895,8.0060000000000002,9.31,6.3689999999999998,8.0549999999999997,25,117.39790000000001,117.39790000000001,2.623777,2.623777,21,148.4794,148.4794,0.43214000000000002,0.43214000000000002,1,0.97638999999999998,0.97638999999999998]
[null,"CRM21","United Energy","Rural Short",3136,20.259,10.547000000000001,8.4740000000000002,1.502,0.14000000000000001,13,29.535299999999999,29.535299999999999,0.36178399999999999,0.36178399999999999,4,2.74559,2.74559,3.3160000000000002E-2,3.3160000000000002E-2,3,3.7931300000000001,3.7931300000000001]
[null,"CRM22","United Energy","Urban",4266,10.273999999999999,4.133,8.9939999999999998,7.9180000000000001,4.9320000000000004,41,176.16390000000001,176.16390000000001,1.2782439999999999,1.2782439999999999,16,109.72481000000001,109.72481000000001,0.36188999999999999,0.36188999999999999,2,1.7234400000000001,1.7234400000000001]
[null,"CRM24","United Energy","Urban",1848,3.7530000000000001,3.8010000000000002,4.141,0.38300000000000001,0.187,8,14.910600000000001,14.910600000000001,8.9198E-2,8.9198E-2,1,7.3064099999999996,7.3064099999999996,4.8710000000000003E-2,4.8710000000000003E-2,0,0,0]
[null,"CRM32","United Energy","Urban",2,9.5000000000000001E-2,2.823,8.2040000000000006,0,0,0,0,0,0,0,0,0,0,0,0,0,0,0]
[null,"CRM33","United Energy","Urban",2246,7.9720000000000004,1.5129999999999999,7.03,1.643,5.2999999999999999E-2,23,48.006799999999998,48.006799999999998,0.23464599999999999,0.23464599999999999,2,1.5564100000000001,1.5564100000000001,2.7609999999999999E-2,2.7609999999999999E-2,0,0,0]
[null,"CRM34","United Energy","Urban",715,7.9809999999999999,8.4969999999999999,6.7009999999999996,3.6999999999999998E-2,1.744,4,0.84740000000000004,0.84740000000000004,7.1310000000000002E-3,7.1310000000000002E-3,9,39.431730000000002,39.431730000000002,0.20832000000000001,0.20832000000000001,0,0,0]
[null,"CRM35","United Energy","Urban",3491,29.161999999999999,4.7240000000000002,10.113,0.64100000000000001,3.3359999999999999,33,9.6212,9.6212,8.7163000000000004E-2,8.7163000000000004E-2,13,50.082259999999998,50.082259999999998,0.15126000000000001,0.15126000000000001,1,0.78839999999999999,0.78839999999999999]
[null,"DC1","United Energy","Urban",2354,18.25,5.9459999999999997,9.2439999999999998,6.298,3.4430000000000001,10,112.202,112.202,1.9762150000000001,1.9762150000000001,35,61.331470000000003,61.331470000000003,0.24176,0.24176,1,0.97936999999999996,0.97936999999999996]
[null,"DC10","United Energy","Urban",3971,14.211,3.6850000000000001,7.9139999999999997,4.0960000000000001,1.0509999999999999,26,101.72239999999999,101.72239999999999,2.0681099999999999,2.0681099999999999,19,26.109629999999999,26.109629999999999,9.0149999999999994E-2,9.0149999999999994E-2,1,0.98816999999999999,0.98816999999999999]
[null,"DC12","United Energy","Urban",1512,4.5339999999999998,1.3149999999999999,7.9809999999999999,0.13400000000000001,7.95,9,2.2850000000000001,2.2850000000000001,2.3140999999999998E-2,2.3140999999999998E-2,19,135.95128,135.95128,0.36892999999999998,0.36892999999999998,1,1.0155400000000001,1.0155400000000001]
[null,"DC2","United Energy","Urban",4162,13.961,10.154,9.8979999999999997,2.032,11.321999999999999,24,38.842300000000002,38.842300000000002,0.96211599999999997,0.96211599999999997,74,216.40342000000001,216.40342000000001,0.64295999999999998,0.64295999999999998,2,1.8692800000000001,1.8692800000000001]
[null,"DC3","United Energy","Urban",4198,13.762,10.314,9.1780000000000008,6.9930000000000003,2.39,29,123.1383,123.1383,1.5174300000000001,1.5174300000000001,23,42.09346,42.09346,0.13317000000000001,0.13317000000000001,1,0.96362999999999999,0.96362999999999999]
[null,"DC4","United Energy","Urban",3394,11.509,2.9870000000000001,7.7519999999999998,0.42399999999999999,1.1459999999999999,13,7.4161000000000001,7.4161000000000001,6.2302000000000003E-2,6.2302000000000003E-2,21,20.029430000000001,20.029430000000001,8.2500000000000004E-2,8.2500000000000004E-2,2,1.9285099999999999,1.9285099999999999]
[null,"DC5","United Energy","Urban",4887,14.273,2.5190000000000001,10.153,6.3040000000000003,4.75,23,106.8141,106.8141,0.975437,0.975437,25,80.488020000000006,80.488020000000006,0.20565,0.20565,1,0.97238999999999998,0.97238999999999998]
[null,"DC6","United Energy","Urban",1958,4.2530000000000001,3.2480000000000002,8.2949999999999999,3.746,8.7249999999999996,13,76.716800000000006,76.716800000000006,1.5390269999999999,1.5390269999999999,7,178.68144000000001,178.68144000000001,0.44746000000000002,0.44746000000000002,3,2.8977400000000002,2.8977400000000002]
[null,"DC7","United Energy","Urban",2152,5.5039999999999996,1.8819999999999999,5.4169999999999998,0.79200000000000004,1.5449999999999999,14,18.516300000000001,18.516300000000001,0.26814500000000002,0.26814500000000002,6,36.143790000000003,36.143790000000003,0.14918000000000001,0.14918000000000001,0,0,0]
[null,"DC8","United Energy","Urban",2969,11.182,1.0609999999999999,6.5259999999999998,3.2730000000000001,1.841,21,93.951499999999996,93.951499999999996,2.3416700000000001,2.3416700000000001,23,52.854520000000001,52.854520000000001,0.23202999999999999,0.23202999999999999,1,1.04026,1.04026]
[null,"DMA12","United Energy","Urban",2107,3.0859999999999999,9.7870000000000008,4.6340000000000003,2E-3,0.17199999999999999,1,8.4900000000000003E-2,8.4900000000000003E-2,4.75E-4,4.75E-4,2,8.2226199999999992,8.2226199999999992,5.126E-2,5.126E-2,0,0,0]
[null,"DMA13","United Energy","Urban",2484,13.426,0.97599999999999998,4.359,5.5E-2,1.2370000000000001,11,2.6547000000000001,2.6547000000000001,0.53940100000000002,0.53940100000000002,7,59.636270000000003,59.636270000000003,0.22700999999999999,0.22700999999999999,0,0,0]
[null,"DMA14","United Energy","Urban",3498,21.077999999999999,6.0289999999999999,8.6189999999999998,3.1240000000000001,1.0449999999999999,21,96.774500000000003,96.774500000000003,1.102312,1.102312,7,32.372,32.372,0.13064000000000001,0.13064000000000001,1,1.0067900000000001,1.0067900000000001]
[null,"DMA15","United Energy","Rural Short",743,58.658999999999999,4.01,3.0739999999999998,5.6429999999999998,35.807000000000002,37,219.76150000000001,219.76150000000001,2.9727350000000001,2.9727350000000001,120,1394.51701,1394.51701,4.6179100000000002,4.6179100000000002,3,4.109,4.109]
[null,"DMA21","United Energy","Urban",2797,13.391,1.51,6.9669999999999996,0.54100000000000004,0.51500000000000001,23,16.670500000000001,16.670500000000001,0.15606700000000001,0.15606700000000001,5,15.88626,15.88626,6.0780000000000001E-2,6.0780000000000001E-2,0,0,0]
[null,"DMA23","United Energy","Rural Short",1715,123.714,5.4569999999999999,6.6929999999999996,15.186999999999999,17.981999999999999,58,348.28949999999998,348.28949999999998,4.1919370000000002,4.1919370000000002,97,412.38227999999998,412.38227999999998,1.5572600000000001,1.5572600000000001,3,4.2333400000000001,4.2333400000000001]
[null,"DMA24","United Energy","Rural Short",1562,33.726999999999997,4.9489999999999998,5.8079999999999998,0.98899999999999999,4.5890000000000004,19,33.930500000000002,33.930500000000002,2.7823030000000002,2.7823030000000002,27,157.48438999999999,157.48438999999999,0.46850000000000003,0.46850000000000003,1,1.3677299999999999,1.3677299999999999]
[null,"DN10","United Energy","Urban",3282,5.367,8.3149999999999995,5.2539999999999996,1.37,0,10,46.171700000000001,46.171700000000001,1.424069,1.424069,0,0,0,0,0,0,0,0]
[null,"DN11","United Energy","Urban",2660,9.0559999999999992,0.68200000000000005,7.8390000000000004,0.55600000000000005,0,14,29.666699999999999,29.666699999999999,2.112447,2.112447,0,0,0,0,0,2,2.00305,2.00305]
[null,"DN13","United Energy","Urban",4605,7.7210000000000001,17.692,9.8569999999999993,4.4640000000000004,1.905,17,126.0668,126.0668,2.7707099999999998,2.7707099999999998,11,53.803539999999998,53.803539999999998,0.13291,0.13291,1,0.96714999999999995,0.96714999999999995]
[null,"DN2","United Energy","Urban",65,4.2409999999999997,0.25,7.1870000000000003,5.9740000000000002,0.30099999999999999,2,109.5851,109.5851,1.0888450000000001,1.0888450000000001,1,5.5209000000000001,5.5209000000000001,3.0669999999999999E-2,3.0669999999999999E-2,2,2.2237,2.2237]
[null,"DN21","United Energy","Urban",594,5.7510000000000003,2.8519999999999999,6.8390000000000004,25.382999999999999,2.6469999999999998,9,598.24490000000003,598.24490000000003,5.7676660000000002,5.7676660000000002,1,62.37621,62.37621,0.1128,0.1128,3,2.9899399999999998,2.9899399999999998]
[null,"DN22","United Energy","Urban",4745,8.2569999999999997,14.624000000000001,9.3699999999999992,1.107,0.60499999999999998,6,20.887799999999999,20.887799999999999,0.78730199999999995,0.78730199999999995,2,11.410830000000001,11.410830000000001,3.0980000000000001E-2,3.0980000000000001E-2,2,1.92211,1.92211]
[null,"DN23","United Energy","Urban",44,0,3.6970000000000001,1.2050000000000001,0,0,0,0,0,0,0,0,0,0,0,0,0,0,0]
[null,"DN24","United Energy","Urban",186,6.7750000000000004,3.4049999999999998,5.9669999999999996,0.186,0.93,4,4.7104999999999997,4.7104999999999997,3.7543E-2,3.7543E-2,3,23.54513,23.54513,9.1179999999999997E-2,9.1179999999999997E-2,1,1.0565800000000001,1.0565800000000001]
[null,"DN25","United Energy","Urban",996,7.9,1.51,6.0030000000000001,2.3879999999999999,0.55300000000000005,8,52.9024,52.9024,1.128592,1.128592,1,12.23981,12.23981,2.3089999999999999E-2,2.3089999999999999E-2,1,1.1225700000000001,1.1225700000000001]
[null,"DN4","United Energy","Urban",167,6.8040000000000003,0.97799999999999998,4.6920000000000002,0,0,0,0,0,0,0,0,0,0,0,0,0,0,0]
[null,"DN6","United Energy","Urban",1095,5.3479999999999999,0.98899999999999999,5.6719999999999997,9.1999999999999998E-2,2.9159999999999999,12,2.5188999999999999,2.5188999999999999,1.3658999999999999E-2,1.3658999999999999E-2,2,79.514700000000005,79.514700000000005,0.18351999999999999,0.18351999999999999,1,0.98423000000000005,0.98423000000000005]
[null,"DN7","United Energy","Urban",793,4.4710000000000001,3.1680000000000001,8.92,0.255,2.2250000000000001,8,4.6417999999999999,4.6417999999999999,4.0168000000000002E-2,4.0168000000000002E-2,3,40.456980000000001,40.456980000000001,0.17535999999999999,0.17535999999999999,2,1.9654499999999999,1.9654499999999999]
[null,"DN8","United Energy","Urban",319,2.0819999999999999,6.4589999999999996,5.9740000000000002,1.468,9.6000000000000002E-2,4,47.746200000000002,47.746200000000002,1.0206280000000001,1.0206280000000001,1,3.13076,3.13076,6.2619999999999995E-2,6.2619999999999995E-2,1,1.0112399999999999,1.0112399999999999]
[null,"DN9","United Energy","Urban",77,5.3079999999999998,2.145,7.2270000000000003,0.48099999999999998,84.703999999999994,4,8.0264000000000006,8.0264000000000006,5.1999999999999998E-2,5.1999999999999998E-2,2,1414.7031899999999,1414.7031899999999,5.1869699999999996,5.1869699999999996,2,1.9113500000000001,1.9113500000000001]
[null,"DSH13","United Energy","Urban",0,0,0.51100000000000001,12.837,0,0,0,0,0,0,0,0,0,0,0,0,0,0,0]
[null,"DSH14","United Energy","Urban",151,4.0439999999999996,2.7040000000000002,5.976,0.13900000000000001,8.3529999999999998,3,2.3382000000000001,2.3382000000000001,1.9827999999999998E-2,1.9827999999999998E-2,6,140.54199,140.54199,0.61467000000000005,0.61467000000000005,0,0,0]
[null,"DSH21","United Energy","Urban",181,3.738,2.44,10.102,2.8170000000000002,0,1,30.268799999999999,30.268799999999999,0.987008,0.987008,0,0,0,0,0,0,0,0]
[null,"DSH22","United Energy","Urban",8,1.8,0.24099999999999999,5.931,0,0,0,0,0,0,0,0,0,0,0,0,0,0,0]
[null,"DSH23","United Energy","Urban",167,2.762,7.0000000000000007E-2,2.7349999999999999,4.2999999999999997E-2,0,3,2.0468000000000002,2.0468000000000002,1.7954000000000001E-2,1.7954000000000001E-2,0,0,0,0,0,0,0,0]
[null,"DSH24","United Energy","Rural Short",215,0.36399999999999999,8.8149999999999995,2.2509999999999999,0.01,0.20599999999999999,2,0.73950000000000005,0.73950000000000005,9.3039999999999998E-3,9.3039999999999998E-3,2,15.073169999999999,15.073169999999999,2.7910000000000001E-2,2.7910000000000001E-2,0,0,0]
[null,"DSH31","United Energy","Urban",68,3.49,0.42099999999999999,6.82,4.1000000000000002E-2,0.26,1,1.0765,1.0765,1.4649000000000001E-2,1.4649000000000001E-2,1,6.8118600000000002,6.8118600000000002,4.3950000000000003E-2,4.3950000000000003E-2,1,1.04009,1.04009]
[null,"DSH32","United Energy","Urban",197,4.657,1.2370000000000001,8.14,0.14599999999999999,4.7,3,2.6928000000000001,2.6928000000000001,1.0170999999999999E-2,1.0170999999999999E-2,1,86.707099999999997,86.707099999999997,0.2797,0.2797,0,0,0]
[null,"DSH33","United Energy","Urban",154,2.2360000000000002,8.3089999999999993,14.37,0.27200000000000002,1.258,3,3.6261000000000001,3.6261000000000001,1.9435999999999998E-2,1.9435999999999998E-2,1,16.779330000000002,16.779330000000002,4.5350000000000001E-2,4.5350000000000001E-2,0,0,0]
[null,"DSH34","United Energy","Urban",329,3.6779999999999999,3.0049999999999999,4.3259999999999996,0,7.0000000000000007E-2,0,0,0,0,0,1,1.90221,1.90221,6.0800000000000003E-3,6.0800000000000003E-3,0,0,0]
[null,"DVY11","United Energy","Urban",65,1.3280000000000001,5.1970000000000001,5.3620000000000001,0.17799999999999999,1.206,1,4.3170000000000002,4.3170000000000002,0.97376600000000002,0.97376600000000002,2,29.212969999999999,29.212969999999999,0.13911000000000001,0.13911000000000001,0,0,0]
[null,"DVY13","United Energy","Urban",79,2.7949999999999999,1.512,8.6370000000000005,0.26500000000000001,13.548,2,3.3279000000000001,3.3279000000000001,3.7749999999999999E-2,3.7749999999999999E-2,7,170.20111,170.20111,0.59140999999999999,0.59140999999999999,1,1.0192399999999999,1.0192399999999999]
[null,"DVY14","United Energy","Urban",57,2.0190000000000001,0.97,6.8819999999999997,0.28899999999999998,4.3780000000000001,4,4.9537000000000004,4.9537000000000004,7.0737999999999995E-2,7.0737999999999995E-2,2,75.159440000000004,75.159440000000004,0.14147999999999999,0.14147999999999999,0,0,0]
[null,"DVY21","United Energy","Urban",143,4.8899999999999997,2.37,9.5020000000000007,0.16500000000000001,1.492,2,2.0964999999999998,2.0964999999999998,1.3971000000000001E-2,1.3971000000000001E-2,6,18.938289999999999,18.938289999999999,0.20957000000000001,0.20957000000000001,1,1.0059400000000001,1.0059400000000001]
[null,"DVY22","United Energy","Urban",163,3.5209999999999999,1.544,6.5110000000000001,1.599,1.8620000000000001,2,33.094700000000003,33.094700000000003,9.2015E-2,9.2015E-2,3,38.52364,38.52364,0.20243,0.20243,1,1.02443,1.02443]
[null,"DVY23","United Energy","Urban",135,2.1429999999999998,1.8149999999999999,8.5679999999999996,4.8000000000000001E-2,1.9850000000000001,1,0.72209999999999996,0.72209999999999996,7.4079999999999997E-3,7.4079999999999997E-3,3,30.00038,30.00038,0.48148999999999997,0.48148999999999997,0,0,0]
[null,"DVY24","United Energy","Rural Short",1203,32.000999999999998,15.055999999999999,7.2670000000000003,3.665,0.76900000000000002,12,60.686500000000002,60.686500000000002,1.5355259999999999,1.5355259999999999,8,12.731479999999999,12.731479999999999,0.16544,0.16544,0,0,0]
[null,"DVY31","United Energy","Urban",261,2.903,2.2930000000000001,7.8289999999999997,0.625,0,2,9.9766999999999992,9.9766999999999992,6.9011000000000003E-2,6.9011000000000003E-2,0,0,0,0,0,0,0,0]
[null,"DVY32","United Energy","Urban",134,3.5329999999999999,2.0419999999999998,6.798,4.1000000000000002E-2,5.6639999999999997,1,1.1064000000000001,1.1064000000000001,7.4359999999999999E-3,7.4359999999999999E-3,4,152.72640000000001,152.72640000000001,0.29742000000000002,0.29742000000000002,0,0,0]
[null,"DVY33","United Energy","Urban",77,1.296,4.577,6.492,0,2.1709999999999998,0,0,0,0,0,1,44.94209,44.94209,0.10332,0.10332,0,0,0]
[null,"DVY34","United Energy","Urban",695,12.576000000000001,7.835,10.603,8.0000000000000002E-3,1.859,1,9.6500000000000002E-2,9.6500000000000002E-2,1.438E-3,1.438E-3,4,22.829619999999998,22.829619999999998,0.17257,0.17257,0,0,0]
[null,"EB11","United Energy","Urban",1532,4.2670000000000003,1.6040000000000001,8.01,0.39200000000000002,0.53500000000000003,6,7.1196000000000002,7.1196000000000002,8.7475999999999998E-2,8.7475999999999998E-2,2,9.7137499999999992,9.7137499999999992,2.938E-2,2.938E-2,0,0,0]
[null,"EB12","United Energy","Urban",1884,8.3089999999999993,0.16300000000000001,3.1520000000000001,0.13500000000000001,2.5459999999999998,5,8.1622000000000003,8.1622000000000003,6.1983999999999997E-2,6.1983999999999997E-2,9,154.1155,154.1155,0.43569000000000002,0.43569000000000002,0,0,0]
[null,"EB13","United Energy","Urban",582,3.5619999999999998,2.19,3.839,0.71499999999999997,7.2999999999999995E-2,2,20.1554,20.1554,7.0413000000000003E-2,7.0413000000000003E-2,1,2.06088,2.06088,6.8700000000000002E-3,6.8700000000000002E-3,0,0,0]
[null,"EB14","United Energy","Urban",2266,6.8769999999999998,1.359,3.7389999999999999,6.4000000000000001E-2,2.129,9,3.0968,3.0968,1.8835999999999999E-2,1.8835999999999999E-2,17,103.07495,103.07495,0.29524,0.29524,1,0.98370000000000002,0.98370000000000002]
[null,"EB21","United Energy","Urban",1404,6.5110000000000001,0.76100000000000001,4.202,0.64300000000000002,4.1130000000000004,5,20.425699999999999,20.425699999999999,0.10059999999999999,0.10059999999999999,14,130.73170999999999,130.73170999999999,0.44230999999999998,0.44230999999999998,1,0.95652999999999999,0.95652999999999999]
[null,"EB22","United Energy","Urban",2070,8.2349999999999994,0.158,5.8179999999999996,4.2709999999999999,0.246,10,120.3569,120.3569,2.0208719999999998,2.0208719999999998,2,6.9281899999999998,6.9281899999999998,1.788E-2,1.788E-2,2,1.9729699999999999,1.9729699999999999]
[null,"EB23","United Energy","Urban",458,2.6960000000000002,2.0270000000000001,6.2839999999999998,0.71199999999999997,0.76100000000000001,3,11.5762,11.5762,6.8824999999999997E-2,6.8824999999999997E-2,3,12.382759999999999,12.382759999999999,4.5850000000000002E-2,4.5850000000000002E-2,1,1.0243500000000001,1.0243500000000001]
[null,"EB24","United Energy","Urban",1322,2.9849999999999999,1.085,2.2109999999999999,0.13600000000000001,1.907,3,9.6334999999999997,9.6334999999999997,0.13750000000000001,0.13750000000000001,11,135.46204,135.46204,0.47714000000000001,0.47714000000000001,1,0.88566,0.88566]
[null,"EB31","United Energy","Urban",2034,6.32,3.5049999999999999,6.22,1.345,2.7090000000000001,12,29.053699999999999,29.053699999999999,0.344528,0.344528,4,58.506180000000001,58.506180000000001,0.16517999999999999,0.16517999999999999,2,2.0160800000000001,2.0160800000000001]
[null,"EB32","United Energy","Urban",3954,19.137,1.7869999999999999,7.3879999999999999,0.55900000000000005,1.264,21,14.156599999999999,14.156599999999999,6.8234000000000003E-2,6.8234000000000003E-2,14,32.0274,32.0274,9.7369999999999998E-2,9.7369999999999998E-2,1,0.99743000000000004,0.99743000000000004]
[null,"EB33","United Energy","Urban",2593,7.952,1.544,6.1849999999999996,2.0209999999999999,0.17599999999999999,12,45.714399999999998,45.714399999999998,0.99678900000000004,0.99678900000000004,2,3.9857499999999999,3.9857499999999999,1.427E-2,1.427E-2,0,0,0]
[null,"EL10","United Energy","Urban",1212,1.5309999999999999,0.999,3.1890000000000001,0.38,3.2869999999999999,14,17.447900000000001,17.447900000000001,9.8488000000000006E-2,9.8488000000000006E-2,8,151.01727,151.01727,0.27877999999999997,0.27877999999999997,0,0,0]
[null,"EL11","United Energy","Urban",235,4.1440000000000001,0.25700000000000001,3.806,0.03,0.51200000000000001,2,1.5418000000000001,1.5418000000000001,8.5159999999999993E-3,8.5159999999999993E-3,2,26.251239999999999,26.251239999999999,6.3869999999999996E-2,6.3869999999999996E-2,0,0,0]
[null,"EL12","United Energy","Urban",345,1.2629999999999999,0.84199999999999997,2.9620000000000002,1.6E-2,0,1,0.8528,0.8528,2.8999999999999998E-3,2.8999999999999998E-3,0,0,0,0,0,0,0,0]
[null,"EL13","United Energy","Urban",1158,3.391,0.54700000000000004,3.2869999999999999,2.1999999999999999E-2,0.629,8,1.0654999999999999,1.0654999999999999,6.9090000000000002E-3,6.9090000000000002E-3,6,30.16507,30.16507,9.5860000000000001E-2,9.5860000000000001E-2,0,0,0]
[null,"EL14","United Energy","Urban",1290,2.915,0.93,3.0430000000000001,0.02,1.5649999999999999,9,1.0410999999999999,1.0410999999999999,6.9750000000000003E-3,6.9750000000000003E-3,6,79.66104,79.66104,0.19064,0.19064,0,0,0]
[null,"EL5","United Energy","Urban",874,1.099,3.706,2.6930000000000001,0.40699999999999997,0.16800000000000001,10,26.2058,26.2058,0.15556200000000001,0.15556200000000001,4,10.790139999999999,10.790139999999999,8.2409999999999997E-2,8.2409999999999997E-2,0,0,0]
[null,"EL6","United Energy","Urban",1576,3.5750000000000002,0.23300000000000001,3.45,8.9999999999999993E-3,1.992,5,0.52459999999999996,0.52459999999999996,3.173E-3,3.173E-3,7,122.66484,122.66484,0.39284999999999998,0.39284999999999998,0,0,0]
[null,"EL7","United Energy","Urban",451,1.643,1.6160000000000001,2.3159999999999998,0.218,0,2,19.388000000000002,19.388000000000002,0.13541500000000001,0.13541500000000001,0,0,0,0,0,0,0,0]
[null,"EL8","United Energy","Urban",1551,4.2939999999999996,0.44500000000000001,3.87,7.1999999999999995E-2,2.4630000000000001,8,3.1678000000000002,3.1678000000000002,1.5367E-2,1.5367E-2,10,108.97613,108.97613,0.33274999999999999,0.33274999999999999,0,0,0]
[null,"EL9","United Energy","Urban",859,4.3719999999999999,2.0790000000000002,3.0630000000000002,4.2000000000000003E-2,0,3,2.4988999999999999,2.4988999999999999,2.3075999999999999E-2,2.3075999999999999E-2,0,0,0,0,0,0,0,0]
[null,"EM1","United Energy","Urban",1725,2.2080000000000002,8.4000000000000005E-2,3.504,8.0000000000000002E-3,10.087,6,0.35949999999999999,0.35949999999999999,3.4770000000000001E-3,3.4770000000000001E-3,25,474.16732000000002,474.16732000000002,1.1747799999999999,1.1747799999999999,0,0,0]
[null,"EM10","United Energy","Urban",2232,4.3150000000000004,0.95599999999999996,3.1139999999999999,5.0000000000000001E-3,6.702,6,0.23699999999999999,0.23699999999999999,2.6879999999999999E-3,2.6879999999999999E-3,12,308.88342999999998,308.88342999999998,0.50172000000000005,0.50172000000000005,0,0,0]
[null,"EM11","United Energy","Urban",963,3.722,1.1990000000000001,2.6629999999999998,1.369,2.2250000000000001,7,75.331000000000003,75.331000000000003,1.0038119999999999,1.0038119999999999,5,122.49209999999999,122.49209999999999,0.29792999999999997,0.29792999999999997,0,0,0]
[null,"EM2","United Energy","Urban",628,3.4430000000000001,0.73199999999999998,2.2869999999999999,2.5339999999999998,0,8,97.246099999999998,97.246099999999998,1.202617,1.202617,0,0,0,0,0,2,1.9598,1.9598]
[null,"EM3","United Energy","Urban",412,1.4990000000000001,0.47299999999999998,3.2410000000000001,7.0000000000000001E-3,0,1,0.32629999999999998,0.32629999999999998,2.4260000000000002E-3,2.4260000000000002E-3,0,0,0,0,0,0,0,0]
[null,"EM5","United Energy","Urban",1582,4.8579999999999997,0.54300000000000004,3.7,1.4339999999999999,2.4780000000000002,4,65.798699999999997,65.798699999999997,0.89014099999999996,0.89014099999999996,13,113.72053,113.72053,0.29271000000000003,0.29271000000000003,0,0,0]
[null,"EM6","United Energy","Urban",1314,4.1909999999999998,1.4710000000000001,2.89,0.22800000000000001,0.107,7,11.204000000000001,11.204000000000001,7.9645999999999995E-2,7.9645999999999995E-2,3,5.2404700000000002,5.2404700000000002,5.7849999999999999E-2,5.7849999999999999E-2,0,0,0]
[null,"EM7","United Energy","Urban",1618,5.5469999999999997,1.0629999999999999,3.9039999999999999,0.189,0.47799999999999998,9,7.1143000000000001,7.1143000000000001,0.95429900000000001,0.95429900000000001,5,17.991990000000001,17.991990000000001,9.0859999999999996E-2,9.0859999999999996E-2,0,0,0]
[null,"EM8","United Energy","Urban",1682,4.3550000000000004,1.3440000000000001,4.3620000000000001,3.6999999999999998E-2,1.637,7,1.6915,1.6915,1.9855999999999999E-2,1.9855999999999999E-2,7,75.657390000000007,75.657390000000007,0.18612999999999999,0.18612999999999999,0,0,0]
[null,"EM9","United Energy","Urban",1201,3.2290000000000001,0.52300000000000002,2.4580000000000002,1.0369999999999999,2.2109999999999999,8,70.779700000000005,70.779700000000005,1.024983,1.024983,6,150.887,150.887,0.43371999999999999,0.43371999999999999,0,0,0]
[null,"EW1","United Energy","Urban",3103,3.3450000000000002,2.78,3.9940000000000002,5.3319999999999999,3.1669999999999998,22,149.40649999999999,149.40649999999999,1.4584699999999999,1.4584699999999999,8,88.741489999999999,88.741489999999999,0.31163999999999997,0.31163999999999997,1,0.98101000000000005,0.98101000000000005]
[null,"EW12","United Energy","Urban",2853,3.9060000000000001,0.877,3.6829999999999998,3.2639999999999998,4.9320000000000004,16,125.9991,125.9991,1.027004,1.027004,21,190.35583,190.35583,0.57977999999999996,0.57977999999999996,1,0.97097999999999995,0.97097999999999995]
[null,"EW14","United Energy","Urban",2069,4.3360000000000003,2.9510000000000001,4.3680000000000003,1.7909999999999999,2.3730000000000002,8,65.043000000000006,65.043000000000006,0.40351900000000002,0.40351900000000002,12,86.159800000000004,86.159800000000004,0.21795,0.21795,1,0.61084000000000005,0.61084000000000005]
[null,"EW2","United Energy","Urban",2440,2.9249999999999998,0.86099999999999999,2.7080000000000002,8.9999999999999993E-3,1.895,6,0.4148,0.4148,2.4589999999999998E-3,2.4589999999999998E-3,8,87.067869999999999,87.067869999999999,0.22872000000000001,0.22872000000000001,0,0,0]
[null,"EW3","United Energy","Urban",1154,2.0680000000000001,0.98699999999999999,1.946,1.8779999999999999,0.44,11,113.9264,113.9264,0.80750299999999997,0.80750299999999997,3,26.70703,26.70703,4.7669999999999997E-2,4.7669999999999997E-2,1,0.98538999999999999,0.98538999999999999]
[null,"EW8","United Energy","Urban",1652,1.6160000000000001,2.452,1.6639999999999999,1.9E-2,0.85199999999999998,5,1.3629,1.3629,3.026E-3,3.026E-3,2,61.940350000000002,61.940350000000002,0.14951,0.14951,1,0.99148000000000003,0.99148000000000003]
[null,"EW9","United Energy","Urban",2809,2.3130000000000002,1.5189999999999999,3.0950000000000002,0.25600000000000001,1.8149999999999999,13,9.2434999999999992,9.2434999999999992,9.7230999999999998E-2,9.7230999999999998E-2,5,65.603809999999996,65.603809999999996,0.19045999999999999,0.19045999999999999,0,0,0]
[null,"FGY21","Ausnet","Urban",13,5.61,1.419,0,0,0,0,0,0,0,0,1,15.311299999999999,15.311299999999999,1.02075,1.02075,0,0,0]
[null,"FGY31","Ausnet","Urban",22,1.64,0.16700000000000001,0,0,0,5,16.377300000000002,16.377300000000002,0.22217500000000001,0.22217500000000001,0,0,0,0,0,0,0,0]
[null,"FSH11","United Energy","Urban",1470,6.8730000000000002,1.0980000000000001,6.8529999999999998,1.921,17.614999999999998,11,38.386000000000003,38.386000000000003,1.010313,1.010313,11,351.97744999999998,351.97744999999998,0.92844000000000004,0.92844000000000004,0,0,0]
[null,"FSH12","United Energy","Rural Short",1762,22.771000000000001,5.1769999999999996,6.4189999999999996,1.5840000000000001,2.35,13,39.428400000000003,39.428400000000003,0.74843700000000002,0.74843700000000002,6,58.503709999999998,58.503709999999998,0.15154000000000001,0.15154000000000001,0,0,0]
[null,"FSH13","United Energy","Rural Short",2431,25.353999999999999,2.0529999999999999,8.1560000000000006,3.181,7.9260000000000002,34,69.554299999999998,69.554299999999998,0.34020400000000001,0.34020400000000001,25,173.28352000000001,173.28352000000001,0.52232000000000001,0.52232000000000001,2,2.6831700000000001,2.6831700000000001]
[null,"FSH21","United Energy","Rural Short",1573,20.48,3.161,4.5579999999999998,7.2999999999999995E-2,1.8540000000000001,9,2.8580999999999999,2.8580999999999999,1.8428E-2,1.8428E-2,5,73.045879999999997,73.045879999999997,0.12903999999999999,0.12903999999999999,1,1.3616200000000001,1.3616200000000001]
[null,"FSH22","United Energy","Urban",2777,10.101000000000001,2.73,7.8259999999999996,0.10100000000000001,2.1819999999999999,11,2.1358000000000001,2.1358000000000001,1.5528E-2,1.5528E-2,10,46.333500000000001,46.333500000000001,0.13396,0.13396,1,0.98275000000000001,0.98275000000000001]
[null,"FSH23","United Energy","Rural Short",660,11.401,2.5259999999999998,3.411,0.27800000000000002,1.083,11,15.393700000000001,15.393700000000001,0.12044100000000001,0.12044100000000001,6,59.871699999999997,59.871699999999997,0.15767999999999999,0.15767999999999999,0,0,0]
[null,"FSH31","United Energy","Urban",3974,15.677,1.579,7.6459999999999999,0.69199999999999995,4.0650000000000004,29,16.091799999999999,16.091799999999999,0.102911,0.102911,15,94.504019999999997,94.504019999999997,0.22449,0.22449,1,1.0209299999999999,1.0209299999999999]
[null,"FSH32","United Energy","Rural Short",947,37.905999999999999,2.609,8.7490000000000006,0.66100000000000003,16.303999999999998,19,8.3861000000000008,8.3861000000000008,7.5655E-2,7.5655E-2,27,206.86621,206.86621,0.78486,0.78486,4,5.2416900000000002,5.2416900000000002]
[null,"FSH33","United Energy","Urban",3259,18.920999999999999,5.407,8.9060000000000006,2.355,3.02,32,41.456400000000002,41.456400000000002,0.72204900000000005,0.72204900000000005,11,53.162999999999997,53.162999999999997,0.23291000000000001,0.23291000000000001,5,5.0251999999999999,5.0251999999999999]
[null,"FSH34","United Energy","Urban",2931,6.2679999999999998,7.6289999999999996,5.1820000000000004,0.41299999999999998,0.92700000000000005,12,16.3156,16.3156,0.99605299999999997,0.99605299999999997,3,36.648470000000003,36.648470000000003,0.13478000000000001,0.13478000000000001,1,1.01509,1.01509]
[null,"FTN11","United Energy","Urban",2247,7.5069999999999997,2.5880000000000001,5.8819999999999997,4.9359999999999999,0.76700000000000002,14,114.06319999999999,114.06319999999999,0.98806400000000005,0.98806400000000005,8,17.734549999999999,17.734549999999999,0.10149,0.10149,0,0,0]
[null,"FTN12","United Energy","Urban",2635,12.009,1.726,5.28,0.06,1.7170000000000001,19,1.7748999999999999,1.7748999999999999,1.8218000000000002E-2,1.8218000000000002E-2,4,51.186839999999997,51.186839999999997,0.17876,0.17876,0,0,0]
[null,"FTN13","United Energy","Rural Short",1357,11.09,9.9000000000000005E-2,3.3410000000000002,0.81799999999999995,0.3,9,44.259599999999999,44.259599999999999,1.4146989999999999,1.4146989999999999,2,16.218109999999999,16.218109999999999,5.083E-2,5.083E-2,0,0,0]
[null,"FTN14","United Energy","Urban",1821,6.1269999999999998,2.6,6.2619999999999996,8.6120000000000001,3.7719999999999998,27,217.51300000000001,217.51300000000001,1.765552,1.765552,9,95.271910000000005,95.271910000000005,0.22025,0.22025,2,1.42858,1.42858]
[null,"FTN21","United Energy","Urban",2033,9.9220000000000006,1.149,3.4940000000000002,0.36199999999999999,4.0919999999999996,16,10.7486,10.7486,9.5703999999999997E-2,9.5703999999999997E-2,11,121.64816999999999,121.64816999999999,0.33995999999999998,0.33995999999999998,1,1.09711,1.09711]
[null,"FTN22","United Energy","Urban",858,2.48,3.3119999999999998,7.734,0.26900000000000002,20.734000000000002,8,4.9131,4.9131,3.9773000000000003E-2,3.9773000000000003E-2,7,378.48012999999997,378.48012999999997,0.83462000000000003,0.83462000000000003,0,0,0]
[null,"FTN23","United Energy","Urban",2641,12.972,4.0599999999999996,7.4580000000000002,0.436,1.4999999999999999E-2,14,8.7779000000000007,8.7779000000000007,4.7398999999999997E-2,4.7398999999999997E-2,3,0.30174000000000001,0.30174000000000001,3.1419999999999997E-2,3.1419999999999997E-2,1,1.0286299999999999,1.0286299999999999]
[null,"FTN24","United Energy","Urban",2783,10.292,2.6379999999999999,5.77,0.70899999999999996,0.90900000000000003,13,20.605699999999999,20.605699999999999,4.8146000000000001E-2,4.8146000000000001E-2,5,26.397749999999998,26.397749999999998,8.4440000000000001E-2,8.4440000000000001E-2,1,0.91735,0.91735]
[null,"FTN25","United Energy","Urban",3757,13.494999999999999,5.4429999999999996,7.7370000000000001,2.5000000000000001E-2,0.51200000000000001,14,0.60250000000000004,0.60250000000000004,1.1717999999999999E-2,1.1717999999999999E-2,2,12.495609999999999,12.495609999999999,2.8750000000000001E-2,2.8750000000000001E-2,0,0,0]
[null,"GW1","United Energy","Urban",687,3.2709999999999999,1.3029999999999999,6.3979999999999997,2.8540000000000001,14.442,7,49.499200000000002,49.499200000000002,1.98573,1.98573,9,250.49121,250.49121,0.58496999999999999,0.58496999999999999,0,0,0]
[null,"GW10","United Energy","Urban",1149,5.0380000000000003,2.1339999999999999,3.1269999999999998,3.3159999999999998,0.39300000000000002,7,152.8331,152.8331,2.930447,2.930447,4,18.11955,18.11955,0.10532999999999999,0.10532999999999999,1,4.6699999999999997E-3,4.6699999999999997E-3]
[null,"GW11","United Energy","Urban",2533,10.773999999999999,1.728,7.45,1.776,1.4179999999999999,20,45.746899999999997,45.746899999999997,1.4909429999999999,1.4909429999999999,9,36.520339999999997,36.520339999999997,8.4470000000000003E-2,8.4470000000000003E-2,5,4.2804700000000002,4.2804700000000002]
[null,"GW12","United Energy","Urban",2420,10.664,0.73399999999999999,5.5259999999999998,2.1850000000000001,0.57199999999999995,15,70.753900000000002,70.753900000000002,1.9576469999999999,1.9576469999999999,20,18.527529999999999,18.527529999999999,9.2549999999999993E-2,9.2549999999999993E-2,3,1.98678,1.98678]
[null,"GW2","United Energy","Urban",2713,13.513999999999999,4.6449999999999996,6.6189999999999998,0.83399999999999996,3.004,9,19.898499999999999,19.898499999999999,1.0453319999999999,1.0453319999999999,7,71.712819999999994,71.712819999999994,0.19645000000000001,0.19645000000000001,2,1.94567,1.94567]
[null,"GW3","United Energy","Urban",1598,7.444,0.34,5.1120000000000001,1.7230000000000001,0.27400000000000002,7,48.048000000000002,48.048000000000002,0.997973,0.997973,5,7.6404500000000004,7.6404500000000004,2.315E-2,2.315E-2,0,0,0]
[null,"GW4","United Energy","Urban",1127,5.0430000000000001,1.3440000000000001,6.5679999999999996,0.82399999999999995,7.0570000000000004,6,18.482900000000001,18.482900000000001,0.99376799999999998,0.99376799999999998,13,158.27198999999999,158.27198999999999,0.74067000000000005,0.74067000000000005,1,0.94201999999999997,0.94201999999999997]
[null,"GW5","United Energy","Urban",1615,7.18,2.8170000000000002,8.0920000000000005,2.2229999999999999,1.4330000000000001,4,41.4953,41.4953,0.96836199999999995,0.96836199999999995,4,26.74493,26.74493,6.13E-2,6.13E-2,0,0,0]
[null,"GW6","United Energy","Urban",1214,8.2550000000000008,1.0169999999999999,7.3339999999999996,7.75,16.207999999999998,12,142.43510000000001,142.43510000000001,2.9527420000000002,2.9527420000000002,4,297.87927999999999,297.87927999999999,0.54674,0.54674,2,1.9382900000000001,1.9382900000000001]
[null,"GW7","United Energy","Urban",2507,15.912000000000001,6.476,4.9580000000000002,1.6559999999999999,9.5000000000000001E-2,13,57.239199999999997,57.239199999999997,1.0524720000000001,1.0524720000000001,3,3.2909299999999999,3.2909299999999999,1.077E-2,1.077E-2,1,0.96533999999999998,0.96533999999999998]
[null,"GW8","United Energy","Urban",2425,7.0380000000000003,1.1859999999999999,4.415,0.51100000000000001,0.14099999999999999,12,37.011400000000002,37.011400000000002,1.592624,1.592624,5,10.235580000000001,10.235580000000001,2.3089999999999999E-2,2.3089999999999999E-2,3,2.2648600000000001,2.2648600000000001]
[null,"HGS21","United Energy","Urban",1461,44.064,8.5969999999999995,3.9129999999999998,8.6769999999999996,1.32,9,153.8203,153.8203,0.62785500000000005,0.62785500000000005,10,23.392209999999999,23.392209999999999,8.9690000000000006E-2,8.9690000000000006E-2,1,0.97814999999999996,0.97814999999999996]
[null,"HGS22","United Energy","Rural Short",2160,69.093999999999994,3.218,7.2380000000000004,0.96499999999999997,2.5499999999999998,44,20.561299999999999,20.561299999999999,0.14135400000000001,0.14135400000000001,45,54.354050000000001,54.354050000000001,0.33753,0.33753,2,2.7510400000000002,2.7510400000000002]
[null,"HGS23","United Energy","Rural Short",2498,64.677999999999997,1.728,10.106,3.1309999999999998,21.324999999999999,58,62.467399999999998,62.467399999999998,1.229258,1.229258,101,425.49784,425.49784,0.99141999999999997,0.99141999999999997,4,6.1550399999999996,6.1550399999999996]
[null,"HGS31","United Energy","Rural Short",1590,33.667999999999999,4.8230000000000004,4.9269999999999996,2.181,8.5220000000000002,16,48.9056,48.9056,0.37244100000000002,0.37244100000000002,24,191.07551000000001,191.07551000000001,0.61695999999999995,0.61695999999999995,3,4.0941599999999996,4.0941599999999996]
[null,"HGS32","United Energy","Urban",2658,13.765000000000001,2.0459999999999998,9.1820000000000004,1.835,2.8,14,21.278300000000002,21.278300000000002,0.72055199999999997,0.72055199999999997,9,32.476779999999998,32.476779999999998,9.708E-2,9.708E-2,2,1.50427,1.50427]
[null,"HGS33","United Energy","Rural Short",3007,108.33,5.0590000000000002,10.957000000000001,15.364000000000001,6.3179999999999996,52,244.34280000000001,244.34280000000001,3.9626519999999998,3.9626519999999998,104,100.48079,100.48079,0.52642,0.52642,1,0.97363,0.97363]
[null,"HT1","United Energy","Urban",2061,8.9600000000000009,3.637,5.2750000000000004,0.49,0.89300000000000002,14,14.1188,14.1188,0.55371300000000001,0.55371300000000001,3,25.71781,25.71781,8.6870000000000003E-2,8.6870000000000003E-2,1,0.99531999999999998,0.99531999999999998]
[null,"HT10","United Energy","Urban",603,3.53,1.7010000000000001,4.83,2.5310000000000001,0,5,111.06310000000001,111.06310000000001,1.0163070000000001,1.0163070000000001,0,0,0,0,0,0,0,0]
[null,"HT11","United Energy","Urban",2413,7.4749999999999996,0.83399999999999996,6.2960000000000003,3.7999999999999999E-2,0.47699999999999998,9,0.97789999999999999,0.97789999999999999,7.6930000000000002E-3,7.6930000000000002E-3,3,12.31758,12.31758,2.86E-2,2.86E-2,0,0,0]
[null,"HT13","United Energy","Urban",303,2.9060000000000001,0.93500000000000005,4.2229999999999999,0.29499999999999998,1.0389999999999999,3,11.035299999999999,11.035299999999999,4.9570000000000003E-2,4.9570000000000003E-2,2,38.836750000000002,38.836750000000002,0.17515,0.17515,0,0,0]
[null,"HT2","United Energy","Urban",1338,7.415,2.1819999999999999,4.718,2.294,1.085,18,63.7273,63.7273,0.64580499999999996,0.64580499999999996,4,30.147490000000001,30.147490000000001,8.8950000000000001E-2,8.8950000000000001E-2,0,0,0]
[null,"HT3","United Energy","Urban",409,4.6509999999999998,1.03,3.0569999999999999,0.23799999999999999,0,2,12.362,12.362,7.0981000000000002E-2,7.0981000000000002E-2,0,0,0,0,0,0,0,0]
[null,"HT4","United Energy","Urban",349,2.3420000000000001,0.22800000000000001,1.1279999999999999,1.0529999999999999,0,5,108.27079999999999,108.27079999999999,0.246448,0.246448,0,0,0,0,0,0,0,0]
[null,"HT6","United Energy","Urban",181,2.5369999999999999,0.74099999999999999,5.5609999999999999,0,0.66100000000000003,0,0,0,0,0,2,13.013070000000001,13.013070000000001,2.206E-2,2.206E-2,0,0,0]
[null,"HT7","United Energy","Urban",344,3.6280000000000001,1.026,3.7770000000000001,3.1E-2,0.58099999999999996,2,1.0471999999999999,1.0471999999999999,5.816E-3,5.816E-3,2,19.432120000000001,19.432120000000001,0.14541000000000001,0.14541000000000001,1,0.99458000000000002,0.99458000000000002]
[null,"HT8","United Energy","Urban",381,5.4,1.042,5.2510000000000003,2.0550000000000002,0.95099999999999996,4,60.947699999999998,60.947699999999998,1.069237,1.069237,1,28.1966,28.1966,7.621E-2,7.621E-2,0,0,0]
[null,"HT9","United Energy","Urban",339,4.673,3.2730000000000001,8.0760000000000005,27.279,2.569,5,352.85039999999998,352.85039999999998,3.2116250000000002,3.2116250000000002,2,33.226149999999997,33.226149999999997,5.9040000000000002E-2,5.9040000000000002E-2,1,1.0095400000000001,1.0095400000000001]
[null,"K10","United Energy","Urban",1434,1.7130000000000001,1.841,2.5529999999999999,3.0000000000000001E-3,1.7000000000000001E-2,2,0.19869999999999999,0.19869999999999999,1.395E-3,1.395E-3,1,1.046,1.046,3.49E-3,3.49E-3,0,0,0]
[null,"K11","United Energy","Urban",1,2.1030000000000002,1.913,3.552,2.012,12.938000000000001,1,109.1421,109.1421,2.9444819999999998,2.9444819999999998,3,701.76813000000004,701.76813000000004,2.94448,2.94448,0,0,0]
[null,"K12","United Energy","Urban",1211,0.34799999999999998,4.8230000000000004,2.23,0.74099999999999999,0.03,6,43.903500000000001,43.903500000000001,1.0097419999999999,1.0097419999999999,2,1.7756000000000001,1.7756000000000001,3.0540000000000001E-2,3.0540000000000001E-2,0,0,0]
[null,"K13","United Energy","Urban",1430,4.7169999999999996,1.1850000000000001,3.2189999999999999,0.158,0.222,4,8.234,8.234,0.13636699999999999,0.13636699999999999,3,11.528269999999999,11.528269999999999,4.8250000000000001E-2,4.8250000000000001E-2,1,1.0315000000000001,1.0315000000000001]
[null,"K2","United Energy","Urban",1336,3.0760000000000001,1.847,3.6080000000000001,2.5870000000000002,2.3E-2,10,124.81140000000001,124.81140000000001,1.0105869999999999,1.0105869999999999,1,1.10053,1.10053,1.048E-2,1.048E-2,0,0,0]
[null,"K3","United Energy","Urban",907,2.5369999999999999,3.9540000000000002,3.6560000000000001,0.11700000000000001,2.0539999999999998,4,5.3368000000000002,5.3368000000000002,0.119036,0.119036,5,93.983140000000006,93.983140000000006,0.27665000000000001,0.27665000000000001,0,0,0]
[null,"K4","United Energy","Urban",795,2.3420000000000001,1.06,3.21,1.0999999999999999E-2,0.27700000000000002,4,0.61480000000000001,0.61480000000000001,5.0330000000000001E-3,5.0330000000000001E-3,1,15.06216,15.06216,7.9269999999999993E-2,7.9269999999999993E-2,0,0,0]
[null,"K5","United Energy","Urban",69,0.90100000000000002,0.67800000000000005,3.141,0,0,0,0,0,0,0,0,0,0,0,0,0,0,0]
[null,"K6","United Energy","Urban",1689,3.7559999999999998,2.5179999999999998,4.37,1.7190000000000001,0.307,5,62.598199999999999,62.598199999999999,1.466321,1.466321,3,11.187139999999999,11.187139999999999,4.795E-2,4.795E-2,2,1.1490199999999999,1.1490199999999999]
[null,"K7","United Energy","Urban",1215,3.1720000000000002,3.3050000000000002,3.4689999999999999,0.03,3.76,3,1.2806,1.2806,1.1575999999999999E-2,1.1575999999999999E-2,8,161.68486999999999,161.68486999999999,0.36857000000000001,0.36857000000000001,0,0,0]
[null,"K8","United Energy","Urban",1241,2.9449999999999998,2.73,3.3969999999999998,7.1999999999999995E-2,3.3439999999999999,5,4.4379,4.4379,7.9824999999999993E-2,7.9824999999999993E-2,7,206.42556999999999,206.42556999999999,0.59711999999999998,0.59711999999999998,0,0,0]
[null,"K9","United Energy","Urban",404,0,0.94699999999999995,2.3849999999999998,0,0,0,0,0,0,0,0,0,0,0,0,0,0,0]
[null,"KBH31","United Energy","Urban",976,8.7050000000000001,1.2749999999999999,6.657,0.189,3.786,6,4.0777999999999999,4.0777999999999999,1.9886000000000001E-2,1.9886000000000001E-2,7,81.799700000000001,81.799700000000001,0.24806,0.24806,2,1.99681,1.99681]
[null,"KBH32","United Energy","Urban",3638,9.8569999999999993,5.1429999999999998,6.7510000000000003,0.15,3.1419999999999999,12,3.0910000000000002,3.0910000000000002,1.9258999999999998E-2,1.9258999999999998E-2,11,64.817909999999998,64.817909999999998,0.19131999999999999,0.19131999999999999,1,0.95413999999999999,0.95413999999999999]
[null,"KBH33","United Energy","Urban",156,1.851,1.49,5.12,0.159,1.22,3,5.5064000000000002,5.5064000000000002,3.1969999999999998E-2,3.1969999999999998E-2,2,42.303350000000002,42.303350000000002,0.24937000000000001,0.24937000000000001,0,0,0]
[null,"KBH34","United Energy","Urban",3368,16.013999999999999,13.222,6.8949999999999996,0.02,4.1390000000000002,8,0.49130000000000001,0.49130000000000001,2.6719999999999999E-3,2.6719999999999999E-3,25,100.90903,100.90903,0.32068000000000002,0.32068000000000002,1,0.95076000000000005,0.95076000000000005]
[null,"KBH35","United Energy","Urban",1342,2.8820000000000001,15.861000000000001,7.0019999999999998,1.2999999999999999E-2,0.221,3,0.2571,0.2571,9.6849999999999992E-3,9.6849999999999992E-3,5,4.5293999999999999,4.5293999999999999,5.364E-2,5.364E-2,1,0.97441999999999995,0.97441999999999995]
[null,"LD1","United Energy","Urban",680,4.7560000000000002,0.91500000000000004,2.907,1.7000000000000001E-2,4.5490000000000004,4,0.81269999999999998,0.81269999999999998,5.8820000000000001E-3,5.8820000000000001E-3,8,221.25887,221.25887,0.69108999999999998,0.69108999999999998,1,0.79842999999999997,0.79842999999999997]
[null,"LD2","United Energy","Urban",2750,11.547000000000001,4.1020000000000003,6.9969999999999999,2.8919999999999999,7.085,18,58.499099999999999,58.499099999999999,0.435701,0.435701,11,143.33229,143.33229,0.41528999999999999,0.41528999999999999,2,3.2404899999999999,3.2404899999999999]
[null,"LD3","United Energy","Urban",1741,6.6589999999999998,1.4970000000000001,3.7749999999999999,3.4000000000000002E-2,1.022,6,2.2907999999999999,2.2907999999999999,2.3334000000000001E-2,2.3334000000000001E-2,7,69.878460000000004,69.878460000000004,0.2079,0.2079,0,0,0]
[null,"LD32","United Energy","Urban",1205,6.5330000000000004,1.952,2.8820000000000001,2.1150000000000002,0.46300000000000002,12,126.33929999999999,126.33929999999999,1.3738090000000001,1.3738090000000001,4,27.636980000000001,27.636980000000001,0.11947000000000001,0.11947000000000001,0,0,0]
[null,"LD33","United Energy","Urban",3073,12.439,9.4149999999999991,7.5839999999999996,0.57399999999999995,2.1659999999999999,8,16.196100000000001,16.196100000000001,1.7905000000000001E-2,1.7905000000000001E-2,11,61.168559999999999,61.168559999999999,0.17798,0.17798,0,0,0]
[null,"LD4","United Energy","Urban",4131,13.789,0.72199999999999998,8.0210000000000008,4.38,3.278,22,84.088200000000001,84.088200000000001,0.17377899999999999,0.17377899999999999,11,62.9238,62.9238,0.17645,0.17645,1,9.7000000000000005E-4,9.7000000000000005E-4]
[null,"LD5","United Energy","Urban",902,6.0720000000000001,1.792,9.3840000000000003,0.39600000000000002,18.213999999999999,5,4.4638,4.4638,2.6539E-2,2.6539E-2,14,205.37620999999999,205.37620999999999,0.52568000000000004,0.52568000000000004,0,0,0]
[null,"LD6","United Energy","Urban",3575,14.722,4.7720000000000002,9.09,4.1029999999999998,4.9649999999999999,15,90.8917,90.8917,1.029844,1.029844,16,109.995,109.995,0.27411000000000002,0.27411000000000002,1,0.95016999999999996,0.95016999999999996]
[null,"LD7","United Energy","Urban",2417,8.0399999999999991,2.593,5.5190000000000001,2.2040000000000002,2.8,7,48.219499999999996,48.219499999999996,0.70137899999999997,0.70137899999999997,4,61.258540000000004,61.258540000000004,0.15393000000000001,0.15393000000000001,0,0,0]
[null,"LWN21","United Energy","Rural Short",2818,73.870999999999995,18.11,9.9169999999999998,2.306,8.4979999999999993,53,34.244300000000003,34.244300000000003,0.74053400000000003,0.74053400000000003,53,126.21342,126.21342,0.54224000000000006,0.54224000000000006,2,3.0855999999999999,3.0855999999999999]
[null,"LWN23","United Energy","Urban",2679,5.3449999999999998,11.712,6.3230000000000004,0.48,0.27500000000000002,8,13.154,13.154,6.2368E-2,6.2368E-2,4,7.53057,7.53057,5.8979999999999998E-2,5.8979999999999998E-2,2,1.9764299999999999,1.9764299999999999]
[null,"LWN24","United Energy","Urban",2462,8.9139999999999997,1.351,4.8860000000000001,0.17599999999999999,2.2959999999999998,15,6.2487000000000004,6.2487000000000004,8.1570000000000004E-2,8.1570000000000004E-2,12,81.370959999999997,81.370959999999997,0.24049999999999999,0.24049999999999999,0,0,0]
[null,"LWN32","United Energy","Rural Short",1042,8.83,6.984,3.2850000000000001,0.71799999999999997,1.921,11,32.033000000000001,32.033000000000001,8.4538000000000002E-2,8.4538000000000002E-2,4,85.68956,85.68956,0.25807000000000002,0.25807000000000002,0,0,0]
[null,"LWN33","United Energy","Urban",1969,10.933,0.54100000000000004,5.9480000000000004,1.79,1.8819999999999999,10,44.989199999999997,44.989199999999997,0.149202,0.149202,3,47.299630000000001,47.299630000000001,4.9770000000000002E-2,4.9770000000000002E-2,0,0,0]
[null,"LWN34","United Energy","Urban",1392,6.7439999999999998,1.5129999999999999,5.3789999999999996,6.0000000000000001E-3,1.982,2,0.16389999999999999,0.16389999999999999,1.4369999999999999E-3,1.4369999999999999E-3,2,56.13053,56.13053,0.25723000000000001,0.25723000000000001,1,0.97431000000000001,0.97431000000000001]
[null,"LWN35","United Energy","Urban",2881,10.581,5.694,6.2839999999999998,1.615,3.5760000000000001,23,38.253300000000003,38.253300000000003,1.079793,1.079793,12,84.704170000000005,84.704170000000005,0.25717000000000001,0.25717000000000001,2,1.99631,1.99631]
[null,"LYD11","Ausnet","Urban",1,4.008,1.08,0,0,0,0,0,0,0,0,0,0,0,0,0,0,0,0]
[null,"M11","United Energy","Urban",1633,5.0289999999999999,0.34599999999999997,3.254,0.34899999999999998,0.36099999999999999,12,19.931999999999999,19.931999999999999,5.6224999999999997E-2,5.6224999999999997E-2,4,20.59759,20.59759,0.11025,0.11025,0,0,0]
[null,"M12","United Energy","Urban",1629,4.1260000000000003,1.1140000000000001,2.87,7.0000000000000001E-3,0.4,5,0.35099999999999998,0.35099999999999998,3.0699999999999998E-3,3.0699999999999998E-3,1,18.95815,18.95815,5.0959999999999998E-2,5.0959999999999998E-2,0,0,0]
[null,"M13","United Energy","Urban",1745,5.6109999999999998,2.9390000000000001,4.3650000000000002,6.7000000000000004E-2,0.48499999999999999,9,2.7486000000000002,2.7486000000000002,3.5782000000000001E-2,3.5782000000000001E-2,4,19.990849999999998,19.990849999999998,6.8180000000000004E-2,6.8180000000000004E-2,0,0,0]
[null,"M21","United Energy","Urban",480,2.6880000000000002,0.84099999999999997,2.8479999999999999,1.0999999999999999E-2,6.0990000000000002,2,0.6351,0.6351,4.163E-3,4.163E-3,4,347.12826000000001,347.12826000000001,0.82433000000000001,0.82433000000000001,0,0,0]
[null,"M22","United Energy","Urban",1360,3.1179999999999999,0.63200000000000001,2.4860000000000002,6.8000000000000005E-2,1.0209999999999999,9,4.12,4.12,1.4997999999999999E-2,1.4997999999999999E-2,4,61.56503,61.56503,0.15659999999999999,0.15659999999999999,0,0,0]
[null,"M23","United Energy","Urban",1161,4.9459999999999997,0.65500000000000003,2.7959999999999998,1.79,0.23400000000000001,9,109.9765,109.9765,0.85288799999999998,0.85288799999999998,1,14.38003,14.38003,4.5650000000000003E-2,4.5650000000000003E-2,2,1.8863300000000001,1.8863300000000001]
[null,"M25","United Energy","Urban",1369,4.3029999999999999,0.45400000000000001,2.8620000000000001,0.58399999999999996,0.33700000000000002,17,38.762999999999998,38.762999999999998,0.14204600000000001,0.14204600000000001,2,22.390329999999999,22.390329999999999,0.29065000000000002,0.29065000000000002,0,0,0]
[null,"M31","United Energy","Urban",758,2.95,0.73499999999999999,2.895,0.124,0.82,3,6.8979999999999997,6.8979999999999997,3.9669000000000003E-2,3.9669000000000003E-2,2,45.503830000000001,45.503830000000001,0.20197999999999999,0.20197999999999999,0,0,0]
[null,"M32","United Energy","Urban",2007,4.1710000000000003,1.6459999999999999,3.1379999999999999,4.7E-2,3.415,5,1.9277,1.9277,1.3341E-2,1.3341E-2,7,138.74222,138.74222,0.38522000000000001,0.38522000000000001,0,0,0]
[null,"M33","United Energy","Urban",854,3.7320000000000002,0.41199999999999998,3.5819999999999999,7.6999999999999999E-2,1.399,3,2.9935999999999998,2.9935999999999998,2.938E-2,2.938E-2,3,54.371369999999999,54.371369999999999,0.16386999999999999,0.16386999999999999,0,0,0]
[null,"M34","United Energy","Urban",872,3.1920000000000002,0.32700000000000001,2.298,2.1000000000000001E-2,0.93,6,1.1956,1.1956,6.8840000000000004E-3,6.8840000000000004E-3,3,53.118839999999999,53.118839999999999,0.17094000000000001,0.17094000000000001,0,0,0]
[null,"M35","United Energy","Urban",1164,3.403,0.90400000000000003,2.7320000000000002,1.978,0,11,123.05549999999999,123.05549999999999,0.39272600000000002,0.39272600000000002,0,0,0,0,0,0,0,0]
[null,"MC1","United Energy","Urban",2129,7.54,0.46300000000000002,5.28,5.4729999999999999,6.7770000000000001,25,154.91980000000001,154.91980000000001,1.184857,1.184857,8,191.84483,191.84483,0.43356,0.43356,1,0.98314000000000001,0.98314000000000001]
[null,"MC10","United Energy","Urban",353,3.4889999999999999,3.359,5.758,0,5.8999999999999997E-2,0,0,0,0,0,2,1.1630400000000001,1.1630400000000001,5.6699999999999997E-3,5.6699999999999997E-3,0,0,0]
[null,"MC2","United Energy","Urban",1809,8.1620000000000008,0.122,5.133,13.111000000000001,3.2679999999999998,26,387.67970000000003,387.67970000000003,2.7301169999999999,2.7301169999999999,7,96.630170000000007,96.630170000000007,0.28737000000000001,0.28737000000000001,0,0,0]
[null,"MC3","United Energy","Urban",2748,9.8079999999999998,1.0469999999999999,5.2460000000000004,2.258,0.29499999999999998,14,72.820400000000006,72.820400000000006,0.30883500000000003,0.30883500000000003,4,9.5256799999999995,9.5256799999999995,3.5659999999999997E-2,3.5659999999999997E-2,3,2.9632200000000002,2.9632200000000002]
[null,"MC4","United Energy","Urban",297,4.4349999999999996,3.5920000000000001,9.5380000000000003,3.1E-2,10.972,2,0.43269999999999997,0.43269999999999997,6.7340000000000004E-3,6.7340000000000004E-3,8,153.89757,153.89757,0.63636999999999999,0.63636999999999999,0,0,0]
[null,"MC5","United Energy","Urban",426,3.4660000000000002,3.22,7.2009999999999996,0.13400000000000001,0,4,2.5089000000000001,2.5089000000000001,3.1308999999999997E-2,3.1308999999999997E-2,0,0,0,0,0,1,0.99673999999999996,0.99673999999999996]
[null,"MC6","United Energy","Urban",2765,8.8960000000000008,1.9119999999999999,8.4130000000000003,0.76600000000000001,0.19900000000000001,14,11.7798,11.7798,8.7622000000000005E-2,8.7622000000000005E-2,4,3.0674399999999999,3.0674399999999999,4.1230000000000003E-2,4.1230000000000003E-2,0,0,0]
[null,"MC7","United Energy","Urban",2300,6.6589999999999998,6.7709999999999999,7.8520000000000003,2.4780000000000002,1.1930000000000001,12,51.429200000000002,51.429200000000002,0.83082999999999996,0.83082999999999996,8,24.75478,24.75478,0.14871999999999999,0.14871999999999999,2,2.3952499999999999,2.3952499999999999]
[null,"MC9","United Energy","Urban",350,5.1609999999999996,1.839,6.6369999999999996,2.5999999999999999E-2,7.6999999999999999E-2,1,0.4662,0.4662,2.8570000000000002E-3,2.8570000000000002E-3,2,1.38581,1.38581,5.7099999999999998E-3,5.7099999999999998E-3,1,1.02864,1.02864]
[null,"MGE11","United Energy","Urban",859,0,2.2850000000000001,2.88,8.0000000000000002E-3,0,4,0.72599999999999998,0.72599999999999998,4.6569999999999997E-3,4.6569999999999997E-3,0,0,0,0,0,0,0,0]
[null,"MGE12","United Energy","Urban",1139,6.5350000000000001,7.1189999999999998,7.9859999999999998,4.6390000000000002,3.7440000000000002,9,87.253100000000003,87.253100000000003,1.1418619999999999,1.1418619999999999,8,70.414609999999996,70.414609999999996,0.26876,0.26876,1,0.99773999999999996,0.99773999999999996]
[null,"MGE13","United Energy","Urban",936,4.2750000000000004,9.8729999999999993,9.3979999999999997,5.0289999999999999,1.7999999999999999E-2,5,72.124200000000002,72.124200000000002,0.130296,0.130296,2,0.25631999999999999,0.25631999999999999,2.14E-3,2.14E-3,2,1.9811399999999999,1.9811399999999999]
[null,"MGE14","United Energy","Urban",395,2.9849999999999999,2.7320000000000002,4.4269999999999996,2.4E-2,3.8130000000000002,4,0.95109999999999995,0.95109999999999995,1.0118E-2,1.0118E-2,4,150.8288,150.8288,0.61470000000000002,0.61470000000000002,0,0,0]
[null,"MGE21","United Energy","Urban",2235,8.2620000000000005,8.7460000000000004,8.0609999999999999,0.95,1.2999999999999999E-2,5,18.7483,18.7483,0.33054899999999998,0.33054899999999998,2,0.26175999999999999,0.26175999999999999,8.0499999999999999E-3,8.0499999999999999E-3,3,2.65341,2.65341]
[null,"MGE22","United Energy","Urban",1184,7.4180000000000001,2.0859999999999999,6.625,1.7000000000000001E-2,24.602,3,0.4098,0.4098,2.5330000000000001E-3,2.5330000000000001E-3,24,582.61899000000005,582.61899000000005,0.86709000000000003,0.86709000000000003,0,0,0]
[null,"MGE23","United Energy","Urban",2368,11.006,2.3239999999999998,5.9480000000000004,0.96699999999999997,4.0350000000000001,16,33.784799999999997,33.784799999999997,0.214396,0.214396,27,140.92597000000001,140.92597000000001,0.42942000000000002,0.42942000000000002,1,0.56791000000000003,0.56791000000000003]
[null,"MGE24","United Energy","Urban",1879,8.8369999999999997,1.536,8.3800000000000008,1.0580000000000001,0,13,16.079499999999999,16.079499999999999,5.1716999999999999E-2,5.1716999999999999E-2,0,0,0,0,0,0,0,0]
[null,"MGE31","United Energy","Urban",2236,8.7029999999999994,6.3310000000000004,6.8449999999999998,1.4E-2,2.9870000000000001,5,0.2984,0.2984,2.2360000000000001E-3,2.2360000000000001E-3,9,64.914559999999994,64.914559999999994,0.3654,0.3654,1,0.97277000000000002,0.97277000000000002]
[null,"MGE32","United Energy","Urban",1376,6.3460000000000001,5.8730000000000002,5.1539999999999999,2.6669999999999998,0.52,8,65.267799999999994,65.267799999999994,0.993224,0.993224,4,12.725630000000001,12.725630000000001,5.9589999999999997E-2,5.9589999999999997E-2,1,0.99567000000000005,0.99567000000000005]
[null,"MGE33","United Energy","Urban",1203,3.52,6.2149999999999999,8.8529999999999998,1.1539999999999999,0.76700000000000002,8,22.243600000000001,22.243600000000001,0.15198400000000001,0.15198400000000001,7,14.780189999999999,14.780189999999999,0.13053000000000001,0.13053000000000001,0,0,0]
[null,"MGE34","United Energy","Urban",2455,12.574,1.0549999999999999,5.3179999999999996,3.4380000000000002,3.8820000000000001,15,126.3271,126.3271,2.3733089999999999,2.3733089999999999,24,142.64241999999999,142.64241999999999,0.49237999999999998,0.49237999999999998,0,0,0]
[null,"MR11","United Energy","Urban",1154,3.9,8.8999999999999996E-2,2.5990000000000002,1.016,3.1360000000000001,13,61.238799999999998,61.238799999999998,0.41475800000000002,0.41475800000000002,5,188.93216000000001,188.93216000000001,0.40733000000000003,0.40733000000000003,1,0.91432999999999998,0.91432999999999998]
[null,"MR12","United Energy","Urban",1728,5.452,0.54900000000000004,3.4279999999999999,7.8E-2,1.075,4,4.2552000000000003,4.2552000000000003,4.9977000000000001E-2,4.9977000000000001E-2,8,59.037199999999999,59.037199999999999,0.19445000000000001,0.19445000000000001,1,0.83045000000000002,0.83045000000000002]
[null,"MR13","United Energy","Urban",1353,4.8600000000000003,1.238,4.4409999999999998,0.34300000000000003,4.6749999999999998,14,10.5227,10.5227,6.0611999999999999E-2,6.0611999999999999E-2,13,143.38609,143.38609,0.67206999999999995,0.67206999999999995,0,0,0]
[null,"MR14","United Energy","Urban",1870,4.6210000000000004,0.41899999999999998,3.891,1.4999999999999999E-2,1.085,14,0.89710000000000001,0.89710000000000001,7.4879999999999999E-3,7.4879999999999999E-3,4,63.468159999999997,63.468159999999997,0.14763000000000001,0.14763000000000001,0,0,0]
[null,"MR15","United Energy","Urban",2037,8.2070000000000007,1.135,5.3179999999999996,0.11,4.2359999999999998,12,3.8138000000000001,3.8138000000000001,4.9617000000000001E-2,4.9617000000000001E-2,12,146.52312000000001,146.52312000000001,0.34459000000000001,0.34459000000000001,0,0,0]
[null,"MR21","United Energy","Urban",1051,4.47,0.23699999999999999,3.5680000000000001,1.044,0.35099999999999998,7,52.773400000000002,52.773400000000002,1.0318050000000001,1.0318050000000001,4,17.758189999999999,17.758189999999999,8.0839999999999995E-2,8.0839999999999995E-2,2,1.9724999999999999,1.9724999999999999]
[null,"MR22","United Energy","Urban",2266,7.0890000000000004,0.38900000000000001,4.859,6.5000000000000002E-2,1.4470000000000001,8,2.7780999999999998,2.7780999999999998,1.8959E-2,1.8959E-2,7,61.982590000000002,61.982590000000002,0.16943,0.16943,0,0,0]
[null,"MR23","United Energy","Urban",822,0.49399999999999999,1.68,4.4660000000000002,0.183,3.2000000000000001E-2,3,6.2557,6.2557,4.0160000000000001E-2,4.0160000000000001E-2,2,1.0928500000000001,1.0928500000000001,2.4299999999999999E-3,2.4299999999999999E-3,0,0,0]
[null,"MR24","United Energy","Urban",1088,3.3050000000000002,1.046,3.4830000000000001,1.5389999999999999,1.37,7,75.800799999999995,75.800799999999995,1.4777549999999999,1.4777549999999999,6,67.47954,67.47954,0.24077999999999999,0.24077999999999999,0,0,0]
[null,"MR31","United Energy","Urban",1240,4.0369999999999999,1.655,3.548,1.2E-2,0.67500000000000004,3,0.61209999999999998,0.61209999999999998,2.418E-3,2.418E-3,9,34.301099999999998,34.301099999999998,0.18218999999999999,0.18218999999999999,1,0.93755999999999995,0.93755999999999995]
[null,"MR32","United Energy","Urban",1404,4.55,3.6629999999999998,4.4710000000000001,0.53100000000000003,1.6240000000000001,23,16.854199999999999,16.854199999999999,0.121597,0.121597,10,51.527720000000002,51.527720000000002,0.16097,0.16097,3,3.1161400000000001,3.1161400000000001]
[null,"MR33","United Energy","Urban",719,6.1929999999999996,1.8129999999999999,5.5570000000000004,0.42599999999999999,0.13600000000000001,10,11.145300000000001,11.145300000000001,5.4968999999999997E-2,5.4968999999999997E-2,1,3.5450599999999999,3.5450599999999999,6.9499999999999996E-3,6.9499999999999996E-3,0,0,0]
[null,"MTN21","United Energy","Urban",2509,9.9719999999999995,5.6420000000000003,8.06,2.3620000000000001,2.0249999999999999,16,39.113199999999999,39.113199999999999,0.23660300000000001,0.23660300000000001,8,33.529389999999999,33.529389999999999,0.21001,0.21001,0,0,0]
[null,"MTN22","United Energy","Rural Short",2363,54.354999999999997,2.4470000000000001,9.3879999999999999,1.702,8.57,24,28.787800000000001,28.787800000000001,1.7189730000000001,1.7189730000000001,41,144.92434,144.92434,0.58706000000000003,0.58706000000000003,9,12.312569999999999,12.312569999999999]
[null,"MTN23","United Energy","Urban",1948,10.151,2.2090000000000001,5.66,1.258,2.8769999999999998,17,31.093499999999999,31.093499999999999,0.18367800000000001,0.18367800000000001,13,71.123009999999994,71.123009999999994,0.29935,0.29935,0,0,0]
[null,"MTN24","United Energy","Rural Short",1832,32.292000000000002,15.477,7.7160000000000002,5.0919999999999996,5.2009999999999996,2,87.870599999999996,87.870599999999996,1.5656110000000001,1.5656110000000001,27,89.740970000000004,89.740970000000004,0.28386,0.28386,1,1.5590599999999999,1.5590599999999999]
[null,"MTN31","United Energy","Urban",5024,12.534000000000001,12.941000000000001,9.4600000000000009,0.73499999999999999,1.8440000000000001,21,15.9405,15.9405,7.7674000000000007E-2,7.7674000000000007E-2,15,39.990180000000002,39.990180000000002,0.13811999999999999,0.13811999999999999,3,2.9672700000000001,2.9672700000000001]
[null,"MTN32","United Energy","Rural Short",1289,109.59699999999999,5.5209999999999999,2.754,3.2440000000000002,9.2690000000000001,46,93.152900000000002,93.152900000000002,2.0456889999999999,2.0456889999999999,87,266.15307000000001,266.15307000000001,0.83453999999999995,0.83453999999999995,1,1.7947200000000001,1.7947200000000001]
[null,"MTN34","United Energy","Urban",3760,13.244999999999999,3.2589999999999999,7.2560000000000002,1.92,1.1890000000000001,23,45.859200000000001,45.859200000000001,0.38184200000000001,0.38184200000000001,11,28.408940000000001,28.408940000000001,0.11355999999999999,0.11355999999999999,0,0,0]
[null,"MTN35","United Energy","Rural Short",1169,21.507000000000001,5.9109999999999996,6.899,2.3730000000000002,5.4749999999999996,14,52.580199999999998,52.580199999999998,0.40639599999999998,0.40639599999999998,17,121.31031,121.31031,0.41588000000000003,0.41588000000000003,1,1.37513,1.37513]
[null,"NB12","United Energy","Urban",0,null,null,2.2170000000000001,0,0,0,0,0,0,0,0,0,0,0,0,0,0,0]
[null,"NB13","United Energy","Urban",507,null,null,3.1150000000000002,0.45300000000000001,0.39100000000000001,3,26.2044,26.2044,0.30030200000000001,0.30030200000000001,2,22.605889999999999,22.605889999999999,4.1390000000000003E-2,4.1390000000000003E-2,0,0,0]
[null,"NB14","United Energy","Urban",609,null,null,4.9980000000000002,2.5999999999999999E-2,0,5,0.85829999999999995,0.85829999999999995,8.2059999999999998E-3,8.2059999999999998E-3,0,0,0,0,0,0,0,0]
[null,"NB15","United Energy","Urban",334,null,null,3.1080000000000001,7.0999999999999994E-2,4.2640000000000002,1,3.5943999999999998,3.5943999999999998,2.5673999999999999E-2,2.5673999999999999E-2,4,215.50373999999999,215.50373999999999,0.58052000000000004,0.58052000000000004,0,0,0]
[null,"NB21","United Energy","Urban",0,0,0,2.2469999999999999,0,0,0,0,0,0,0,0,0,0,0,0,0,0,0]
[null,"NB22","United Energy","Urban",547,2.649,1.3819999999999999,2.0110000000000001,1.677,2.774,3,89.552300000000002,89.552300000000002,2.808154,2.808154,4,148.14246,148.14246,0.34393000000000001,0.34393000000000001,0,0,0]
[null,"NB23","United Energy","Urban",574,0.55700000000000005,1.6850000000000001,3.762,1.627,5.9130000000000003,9,50.704799999999999,50.704799999999999,0.12784699999999999,0.12784699999999999,5,184.24739,184.24739,0.39363999999999999,0.39363999999999999,0,0,0]
[null,"NB24","United Energy","Urban",400,3.508,1.109,3.831,0.13600000000000001,3.4359999999999999,3,6.9318,6.9318,4.4410999999999999E-2,4.4410999999999999E-2,4,175.13102000000001,175.13102000000001,0.34759000000000001,0.34759000000000001,0,0,0]
[null,"NB25","United Energy","Urban",1020,5.109,0.52400000000000002,4.2889999999999997,2.149,1.103,11,85.545100000000005,85.545100000000005,1.9872920000000001,1.9872920000000001,4,43.914870000000001,43.914870000000001,0.13425999999999999,0.13425999999999999,0,0,0]
[null,"NB26","United Energy","Urban",888,2.504,0.85599999999999998,1.958,0.55000000000000004,6.2E-2,4,39.680500000000002,39.680500000000002,0.23411799999999999,0.23411799999999999,3,4.4572399999999996,4.4572399999999996,1.1259999999999999E-2,1.1259999999999999E-2,0,0,0]
[null,"NB31","United Energy","Urban",266,1.143,2.2509999999999999,0,3.5999999999999997E-2,0,1,1.8088,1.8088,3.761E-3,3.761E-3,0,0,0,0,0,0,0,0]
[null,"NB32","United Energy","Urban",2250,5.2869999999999999,1.3580000000000001,6.657,0.97299999999999998,1.659,12,34.467199999999998,34.467199999999998,1.790764,1.790764,10,58.81053,58.81053,0.17332,0.17332,1,1.2079200000000001,1.2079200000000001]
[null,"NB33","United Energy","Urban",962,3.3380000000000001,1.0980000000000001,3.0939999999999999,0.501,3.2210000000000001,3,18.463200000000001,18.463200000000001,0.83135599999999998,0.83135599999999998,6,118.77583,118.77583,0.29720000000000002,0.29720000000000002,1,0.82926,0.82926]
[null,"NB34","United Energy","Urban",1382,3.52,1.5469999999999999,5.1070000000000002,0.86899999999999999,4.1150000000000002,15,38.580199999999998,38.580199999999998,0.68476599999999999,0.68476599999999999,10,182.65774999999999,182.65774999999999,0.47048000000000001,0.47048000000000001,0,0,0]
[null,"NB35","United Energy","Urban",1637,5.2469999999999999,2.1760000000000002,5.8579999999999997,0.85799999999999998,3.012,12,23.247699999999998,23.247699999999998,0.86996399999999996,0.86996399999999996,11,81.646609999999995,81.646609999999995,0.23698,0.23698,3,2.7355999999999998,2.7355999999999998]
[null,"NB36","United Energy","Urban",2402,4.2080000000000002,0.83199999999999996,9.798,0.91900000000000004,1.619,11,34.027500000000003,34.027500000000003,1.440429,1.440429,7,59.944800000000001,59.944800000000001,0.19771,0.19771,0,0,0]
[null,"NO2","United Energy","Urban",232,4.1529999999999996,1.629,8.0329999999999995,7.3659999999999997,1.3049999999999999,2,122.2736,122.2736,0.93619399999999997,0.93619399999999997,3,21.66621,21.66621,0.15962999999999999,0.15962999999999999,0,0,0]
[null,"NO3","United Energy","Urban",221,3.008,1.744,9.3650000000000002,0.311,5.7690000000000001,3,4.0923999999999996,4.0923999999999996,1.0562999999999999E-2,1.0562999999999999E-2,3,76.030640000000005,76.030640000000005,0.55308000000000002,0.55308000000000002,1,1.0245599999999999,1.0245599999999999]
[null,"NO31","United Energy","Urban",22,0.53400000000000003,1.3069999999999999,0,0,0,0,0,0,0,0,0,0,0,0,0,0,0,0]
[null,"NO32","United Energy","Urban",643,3.089,2.7160000000000002,0,0,0,0,0,0,0,0,0,0,0,0,0,0,0,0]
[null,"NO4","United Energy","Urban",351,1.94,1.6120000000000001,8.4410000000000007,0.159,1.431,2,2.7608000000000001,2.7608000000000001,4.1397000000000003E-2,4.1397000000000003E-2,6,24.843620000000001,24.843620000000001,0.12250999999999999,0.12250999999999999,0,0,0]
[null,"NO5","United Energy","Urban",455,1.9390000000000001,0.52,7.3920000000000003,0.15,0.38900000000000001,1,3.1575000000000002,3.1575000000000002,1.3849E-2,1.3849E-2,8,8.1992700000000003,8.1992700000000003,5.935E-2,5.935E-2,0,0,0]
[null,"NO6","United Energy","Urban",735,3.9489999999999998,0.35299999999999998,4.1029999999999998,2.9769999999999999,0.08,8,86.639499999999998,86.639499999999998,1.109456,1.109456,3,2.3142,2.3142,2.3140000000000001E-2,2.3140000000000001E-2,1,0.98148999999999997,0.98148999999999997]
[null,"NO7","United Energy","Urban",1699,6.0449999999999999,0.70299999999999996,5.4459999999999997,4.5999999999999999E-2,6.7190000000000003,13,1.3166,1.3166,1.8512000000000001E-2,1.8512000000000001E-2,20,193.28486000000001,193.28486000000001,0.7167,0.7167,0,0,0]
[null,"NO8","United Energy","Urban",0,0,1.0469999999999999,0,0,0,0,0,0,0,0,0,0,0,0,0,0,0,0]
[null,"NP11","United Energy","Urban",1621,8.6359999999999992,0.624,5.32,0.27,0.55500000000000005,9,6.8906999999999998,6.8906999999999998,5.2103999999999998E-2,5.2103999999999998E-2,5,14.151770000000001,14.151770000000001,5.799E-2,5.799E-2,0,0,0]
[null,"NP12","United Energy","Urban",2001,12.102,1.7909999999999999,5.1820000000000004,1.161,0.81499999999999995,6,26.860800000000001,26.860800000000001,0.44345099999999998,0.44345099999999998,11,18.845279999999999,18.845279999999999,8.2960000000000006E-2,8.2960000000000006E-2,3,2.9079999999999999,2.9079999999999999]
[null,"NP14","United Energy","Urban",1270,7.173,1.9359999999999999,4.944,0.40400000000000003,4.9470000000000001,7,11.8362,11.8362,7.4015999999999998E-2,7.4015999999999998E-2,14,144.82644999999999,144.82644999999999,0.51417000000000002,0.51417000000000002,1,0.9748,0.9748]
[null,"NP16","United Energy","Urban",3782,10.446,0.76400000000000001,6.6079999999999997,1.2609999999999999,2.706,23,32.660899999999998,32.660899999999998,0.82219200000000003,0.82219200000000003,8,70.075540000000004,70.075540000000004,0.18296999999999999,0.18296999999999999,2,1.95929,1.95929]
[null,"NP23","United Energy","Urban",2666,9.1010000000000009,0.61499999999999999,4.8659999999999997,1.089,1.5620000000000001,10,37.381399999999999,37.381399999999999,0.93843799999999999,0.93843799999999999,7,53.602730000000001,53.602730000000001,0.15267,0.15267,0,0,0]
[null,"NP24","United Energy","Urban",1799,7.4420000000000002,0.185,4.2329999999999997,0.23599999999999999,1.9379999999999999,9,15.1815,15.1815,0.135486,0.135486,7,124.61442,124.61442,0.29853000000000002,0.29853000000000002,1,0.98343999999999998,0.98343999999999998]
[null,"NP25","United Energy","Urban",2661,7.0339999999999998,0.94499999999999995,6.2480000000000002,0.40899999999999997,7.5999999999999998E-2,11,9.2303999999999995,9.2303999999999995,6.1261000000000003E-2,6.1261000000000003E-2,2,1.7205699999999999,1.7205699999999999,8.2699999999999996E-3,8.2699999999999996E-3,0,0,0]
[null,"NP31","United Energy","Urban",531,2.6779999999999999,0.53500000000000003,4.4589999999999996,7.1999999999999995E-2,0.13900000000000001,1,2.3704999999999998,2.3704999999999998,2.4693E-2,2.4693E-2,1,4.5734000000000004,4.5734000000000004,3.388E-2,3.388E-2,0,0,0]
[null,"NP33","United Energy","Urban",2845,9.7949999999999999,2.1469999999999998,6.7629999999999999,0.25700000000000001,0.46500000000000002,13,4.8884999999999996,4.8884999999999996,1.6603E-2,1.6603E-2,6,8.8264099999999992,8.8264099999999992,5.7299999999999997E-2,5.7299999999999997E-2,1,0.97411000000000003,0.97411000000000003]
[null,"NP34","United Energy","Urban",2116,11.019,8.6050000000000004,6.3579999999999997,1.1279999999999999,0.22800000000000001,10,29.555700000000002,29.555700000000002,0.46036199999999999,0.46036199999999999,2,5.9603200000000003,5.9603200000000003,3.3550000000000003E-2,3.3550000000000003E-2,0,0,0]
[null,"NP36","United Energy","Urban",3470,13.497999999999999,0.47299999999999998,4.2039999999999997,0.52,1.2430000000000001,18,16.803699999999999,16.803699999999999,0.26533000000000001,0.26533000000000001,6,40.158969999999997,40.158969999999997,9.6549999999999997E-2,9.6549999999999997E-2,1,1.0035400000000001,1.0035400000000001]
[null,"NW11","United Energy","Urban",2608,4.9459999999999997,1.9139999999999999,8.7929999999999993,1.998,0.42199999999999999,11,67.5749,67.5749,0.65193900000000005,0.65193900000000005,4,14.27356,14.27356,3.6810000000000002E-2,3.6810000000000002E-2,1,1.34368,1.34368]
[null,"NW13","United Energy","Urban",3217,16.218,8.3710000000000004,7.3,5.8390000000000004,1.488,23,130.97389999999999,130.97389999999999,2.986888,2.986888,19,33.368310000000001,33.368310000000001,0.11534,0.11534,4,3.3542399999999999,3.3542399999999999]
[null,"NW14","United Energy","Urban",2655,10.247999999999999,3.5449999999999999,9.9130000000000003,4.2670000000000003,2.2069999999999999,17,77.729299999999995,77.729299999999995,1.3589100000000001,1.3589100000000001,4,40.200380000000003,40.200380000000003,0.10585,0.10585,0,0,0]
[null,"NW21","United Energy","Urban",1913,11.286,3.0409999999999999,8.7379999999999995,5.0220000000000002,4.8390000000000004,22,105.5553,105.5553,1.550881,1.550881,16,101.70639,101.70639,0.30208000000000002,0.30208000000000002,0,0,0]
[null,"NW22","United Energy","Urban",2763,10.615,1.4390000000000001,6.0439999999999996,11.141,7.0720000000000001,21,303.87490000000003,303.87490000000003,3.081645,3.081645,26,192.88961,192.88961,0.63949,0.63949,1,0.98258000000000001,0.98258000000000001]
[null,"NW23","United Energy","Urban",3353,12.538,1.506,7.5709999999999997,7.42,1.069,25,167.5624,167.5624,2.0504479999999998,2.0504479999999998,8,24.151129999999998,24.151129999999998,8.3510000000000001E-2,8.3510000000000001E-2,2,1.93913,1.93913]
[null,"NW31","United Energy","Urban",2740,9.1850000000000005,2.5880000000000001,7.3079999999999998,0.61399999999999999,4.2590000000000003,18,14.0412,14.0412,0.132774,0.132774,10,97.330110000000005,97.330110000000005,0.31019999999999998,0.31019999999999998,0,0,0]
[null,"NW32","United Energy","Urban",788,2.8260000000000001,3.2719999999999998,5.468,0.02,4,5,0.62170000000000003,0.62170000000000003,6.3489999999999996E-3,6.3489999999999996E-3,6,121.40304999999999,121.40304999999999,0.27679999999999999,0.27679999999999999,1,0.99673,0.99673]
[null,"NW33","United Energy","Urban",2762,9.7780000000000005,1.905,8.3659999999999997,8.6349999999999998,1.1399999999999999,19,210.4444,210.4444,3.9685670000000002,3.9685670000000002,8,27.772960000000001,27.772960000000001,7.7130000000000004E-2,7.7130000000000004E-2,1,1.0044900000000001,1.0044900000000001]
[null,"NW34","United Energy","Urban",1,0,2.0230000000000001,2.5030000000000001,0,0,0,0,0,0,0,0,0,0,0,0,0,0,0]
[null,"OAK21","United Energy","Urban",2551,8.6020000000000003,1.327,3.6349999999999998,4.4999999999999998E-2,0.33500000000000002,11,1.869,1.869,1.5691E-2,1.5691E-2,3,13.8538,13.8538,4.3900000000000002E-2,4.3900000000000002E-2,0,0,0]
[null,"OAK22","United Energy","Urban",1445,3.2029999999999998,1.883,4.9039999999999999,0.06,1.5669999999999999,9,1.8305,1.8305,2.1062000000000001E-2,2.1062000000000001E-2,6,47.704689999999999,47.704689999999999,0.11831999999999999,0.11831999999999999,0,0,0]
[null,"OAK23","United Energy","Urban",941,2.4329999999999998,0.89600000000000002,5.8879999999999999,0.01,0.27500000000000002,4,0.43819999999999998,0.43819999999999998,4.2509999999999996E-3,4.2509999999999996E-3,3,11.75455,11.75455,6.4829999999999999E-2,6.4829999999999999E-2,1,0.97884000000000004,0.97884000000000004]
[null,"OAK24","United Energy","Urban",477,1.9330000000000001,0.79400000000000004,4.12,1.7000000000000001E-2,0.56299999999999994,2,0.7339,0.7339,4.1939999999999998E-3,4.1939999999999998E-3,1,24.914840000000002,24.914840000000002,1.2579999999999999E-2,1.2579999999999999E-2,0,0,0]
[null,"OAK25","United Energy","Urban",181,0.89900000000000002,1.119,2.6080000000000001,0,0,0,0,0,0,0,0,0,0,0,0,0,0,0]
[null,"OAK26","United Energy","Urban",2565,8.2989999999999995,0.77600000000000002,4.3070000000000004,0.58199999999999996,0.71099999999999997,15,26.902200000000001,26.902200000000001,9.8242999999999997E-2,9.8242999999999997E-2,5,32.86591,32.86591,0.10137,0.10137,0,0,0]
[null,"OAK30","United Energy","Urban",1,0,2.6459999999999999,0.94,0,0,0,0,0,0,0,0,0,0,0,0,0,0,0]
[null,"OAK31","United Energy","Urban",305,0.66700000000000004,1.1619999999999999,6.4690000000000003,0,0.32800000000000001,0,0,0,0,0,1,11.07874,11.07874,8.2059999999999994E-2,8.2059999999999994E-2,0,0,0]
[null,"OAK32","United Energy","Urban",779,2.258,0.64300000000000002,1.3069999999999999,1.6E-2,0.11700000000000001,3,1.8728,1.8728,4.2389999999999997E-2,4.2389999999999997E-2,1,13.279030000000001,13.279030000000001,5.7729999999999997E-2,5.7729999999999997E-2,0,0,0]
[null,"OAK33","United Energy","Urban",2222,7.7910000000000004,1.2390000000000001,4.0819999999999999,0.23799999999999999,0.47099999999999997,16,11.0756,11.0756,0.100013,0.100013,2,21.96602,21.96602,7.5170000000000001E-2,7.5170000000000001E-2,0,0,0]
[null,"OAK34","United Energy","Urban",394,2.1880000000000002,0.79600000000000004,4.0780000000000003,0,0.33100000000000002,0,0,0,0,0,3,14.589090000000001,14.589090000000001,4.8250000000000001E-2,4.8250000000000001E-2,0,0,0]
[null,"OAK35","United Energy","Urban",400,2.802,0.32600000000000001,2.286,0.4,3.0000000000000001E-3,5,29.0671,29.0671,1.010251,1.010251,1,0.20505000000000001,0.20505000000000001,2.5000000000000001E-3,2.5000000000000001E-3,1,1.02525,1.02525]
[null,"OE1","United Energy","Urban",117,0.29899999999999999,0.76900000000000002,1.028,0,3.1E-2,0,0,0,0,0,1,5.05748,5.05748,1.7139999999999999E-2,1.7139999999999999E-2,0,0,0]
[null,"OE10","United Energy","Urban",242,2.1739999999999999,0.69,1.204,0.41,0.20399999999999999,1,63.117800000000003,63.117800000000003,1.0227329999999999,1.0227329999999999,3,31.44492,31.44492,4.5359999999999998E-2,4.5359999999999998E-2,0,0,0]
[null,"OE14","United Energy","Urban",193,1.9910000000000001,0.48299999999999998,2.1560000000000001,1.675,0,5,93.754300000000001,93.754300000000001,1.98376,1.98376,0,0,0,0,0,1,0.99187999999999998,0.99187999999999998]
[null,"OE15","United Energy","Urban",586,2.581,0.97399999999999998,1.984,4.0000000000000001E-3,0.52400000000000002,2,0.3206,0.3206,3.411E-3,3.411E-3,4,41.084600000000002,41.084600000000002,0.15690000000000001,0.15690000000000001,0,0,0]
[null,"OE2","United Energy","Urban",374,1.5760000000000001,1.095,0.53400000000000003,2.4E-2,0,3,5.2732999999999999,5.2732999999999999,5.7418999999999998E-2,5.7418999999999998E-2,0,0,0,0,0,0,0,0]
[null,"OE4","United Energy","Urban",2406,8.8049999999999997,0.63300000000000001,3.2610000000000001,2.3E-2,0.318,15,0.87439999999999996,0.87439999999999996,6.2360000000000002E-3,6.2360000000000002E-3,1,12.12214,12.12214,4.4900000000000002E-2,4.4900000000000002E-2,1,1.2566900000000001,1.2566900000000001]
[null,"OE5","United Energy","Urban",360,2.66,0.72099999999999997,1.4890000000000001,1.9E-2,0,4,1.7802,1.7802,1.1106E-2,1.1106E-2,0,0,0,0,0,0,0,0]
[null,"OE6","United Energy","Urban",27,0.72499999999999998,8.6999999999999994E-2,1.6859999999999999,0,0,0,0,0,0,0,0,0,0,0,0,0,0,0]
[null,"OE9","United Energy","Urban",704,1.891,0.28899999999999998,1.2270000000000001,4.0000000000000001E-3,1.0509999999999999,1,0.47289999999999999,0.47289999999999999,1.42E-3,1.42E-3,1,127.19649,127.19649,0.28266000000000002,0.28266000000000002,0,0,0]
[null,"OR22","United Energy","Urban",6,1.4E-2,1.163,1.2729999999999999,0,7.48,0,0,0,0,0,7,1026.6426100000001,1026.6426100000001,2.2901500000000001,2.2901500000000001,0,0,0]
[null,"OR23","United Energy","Urban",1992,5.3849999999999998,0.32100000000000001,3.7469999999999999,9.6000000000000002E-2,0.115,11,4.29,4.29,7.9950000000000004E-3,7.9950000000000004E-3,2,5.1345900000000002,5.1345900000000002,1.205E-2,1.205E-2,0,0,0]
[null,"OR24","United Energy","Urban",1885,4.3490000000000002,1.4650000000000001,4.4480000000000004,0.67200000000000004,1.1080000000000001,11,18.065000000000001,18.065000000000001,0.13645399999999999,0.13645399999999999,6,29.78162,29.78162,9.3880000000000005E-2,9.3880000000000005E-2,0,0,0]
[null,"OR25","United Energy","Urban",2737,6.2539999999999996,0.64100000000000001,3.8570000000000002,7.1999999999999995E-2,1.212,15,3.4062000000000001,3.4062000000000001,5.6994000000000003E-2,5.6994000000000003E-2,9,57.002270000000003,57.002270000000003,0.21592,0.21592,1,0.96304000000000001,0.96304000000000001]
[null,"OR31","United Energy","Urban",2,0,0.55700000000000005,1.5069999999999999,0,0,0,0,0,0,0,0,0,0,0,0,0,0,0]
[null,"OR32","United Energy","Urban",1759,5.1139999999999999,0.84399999999999997,3.8639999999999999,0.3,1.806,8,14.8186,14.8186,2.5690000000000001E-2,2.5690000000000001E-2,9,89.267910000000001,89.267910000000001,0.25297999999999998,0.25297999999999998,0,0,0]
[null,"OR33","United Energy","Urban",3366,9.7959999999999994,0.88700000000000001,6.7240000000000002,4.4999999999999998E-2,1.0289999999999999,25,1.2383999999999999,1.2383999999999999,1.0167000000000001E-2,1.0167000000000001E-2,5,28.078119999999998,28.078119999999998,7.7840000000000006E-2,7.7840000000000006E-2,0,0,0]
[null,"OR34","United Energy","Urban",2129,4.8570000000000002,0.159,5.3940000000000001,0.68500000000000005,0,10,37.172499999999999,37.172499999999999,0.83427200000000001,0.83427200000000001,0,0,0,0,0,0,0,0]
[null,"OR35","United Energy","Urban",2771,5.1879999999999997,1.2889999999999999,5.5250000000000004,0.8,0.29299999999999998,20,31.106000000000002,31.106000000000002,0.146616,0.146616,5,11.39067,11.39067,6.2080000000000003E-2,6.2080000000000003E-2,0,0,0]
[null,"RBD11","United Energy","Urban",1146,3.5640000000000001,3.4049999999999998,3.0169999999999999,1.7000000000000001E-2,0,4,0.67679999999999996,0.67679999999999996,3.4910000000000002E-3,3.4910000000000002E-3,0,0,0,0,0,1,0.98978999999999995,0.98978999999999995]
[null,"RBD12","United Energy","Rural Short",1709,54.264000000000003,7.0640000000000001,4.57,1.1659999999999999,1.964,32,41.453899999999997,41.453899999999997,0.54887799999999998,0.54887799999999998,18,69.795000000000002,69.795000000000002,0.20241999999999999,0.20241999999999999,3,4.0940599999999998,4.0940599999999998]
[null,"RBD13","United Energy","Urban",3693,15.08,0.32200000000000001,7.4340000000000002,0.14699999999999999,6.3390000000000004,21,3.9001999999999999,3.9001999999999999,4.8913999999999999E-2,4.8913999999999999E-2,22,168.55509000000001,168.55509000000001,0.49989,0.49989,4,3.8858999999999999,3.8858999999999999]
[null,"RBD14","United Energy","Urban",1604,7.968,0.35099999999999998,3.9,0.189,0.85799999999999998,16,8.5498999999999992,8.5498999999999992,8.2997000000000001E-2,8.2997000000000001E-2,5,38.801430000000003,38.801430000000003,0.13905999999999999,0.13905999999999999,0,0,0]
[null,"RBD21","United Energy","Rural Short",929,46.106000000000002,12.053000000000001,5.2960000000000003,2.7450000000000001,13.795999999999999,23,65.744299999999996,65.744299999999996,2.2683970000000002,2.2683970000000002,45,330.46087,330.46087,1.16577,1.16577,0,0,0]
[null,"RBD22","United Energy","Urban",1290,3.4489999999999998,1.4750000000000001,3.984,0.996,0.308,9,28.363299999999999,28.363299999999999,1.2981799999999999,1.2981799999999999,2,8.7571100000000008,8.7571100000000008,2.7119999999999998E-2,2.7119999999999998E-2,0,0,0]
[null,"RBD23","United Energy","Urban",3900,15.231,0.72,6.9560000000000004,3.91,0,29,146.39070000000001,146.39070000000001,2.7032060000000002,2.7032060000000002,0,0,0,0,0,0,0,0]
[null,"RBD24","United Energy","Urban",3358,14.17,0.88400000000000001,6.1959999999999997,1.087,0.94799999999999995,20,39.900199999999998,39.900199999999998,1.1194459999999999,1.1194459999999999,5,34.77514,34.77514,0.14949000000000001,0.14949000000000001,2,1.87395,1.87395]
[null,"RD10","Citipower","Urban",1037,5.3140000000000001,0,0,6.0000000000000001E-3,0.156,4,0.53920000000000001,0.53920000000000001,3.8579999999999999E-3,3.8579999999999999E-3,2,13.592359999999999,13.592359999999999,4.0509999999999997E-2,4.0509999999999997E-2,0,0,0]
[null,"RD2","Citipower","Urban",148,6.0940000000000003,1.097,0,0,0,0,0,0,0,0,0,0,0,0,0,0,0,0]
[null,"RD4","Citipower","Urban",1821,5.4939999999999998,0.17699999999999999,0,2.617,4.0780000000000003,9,102.71040000000001,102.71040000000001,1.0666260000000001,1.0666260000000001,11,160.06644,160.06644,0.40423999999999999,0.40423999999999999,0,0,0]
[null,"RWT12","United Energy","Urban",1769,6.2720000000000002,1.3149999999999999,4.5650000000000004,1.456,0.02,16,35.226700000000001,35.226700000000001,0.480771,0.480771,1,0.47816999999999998,0.47816999999999998,1.6999999999999999E-3,1.6999999999999999E-3,1,0.99478,0.99478]
[null,"RWT13","United Energy","Urban",1,0,1.841,2.573,0,0,0,0,0,0,0,0,0,0,0,0,0,0,0]
[null,"RWT23","United Energy","Urban",2904,6.8029999999999999,5.266,7.6020000000000003,3.5840000000000001,1.3520000000000001,15,81.481899999999996,81.481899999999996,0.71899500000000005,0.71899500000000005,5,30.727419999999999,30.727419999999999,7.3340000000000002E-2,7.3340000000000002E-2,0,0,0]
[null,"RWT24","United Energy","Urban",3270,11.686,2.0579999999999998,7.1340000000000003,2.8180000000000001,2.1709999999999998,18,59.202199999999998,59.202199999999998,1.050068,1.050068,8,45.614159999999998,45.614159999999998,0.15933,0.15933,1,0.98133999999999999,0.98133999999999999]
[null,"RWT34","United Energy","Urban",3478,14.196,2.0190000000000001,9.7379999999999995,4.1349999999999998,1.8759999999999999,20,72.863299999999995,72.863299999999995,1.220934,1.220934,10,33.058860000000003,33.058860000000003,8.337E-2,8.337E-2,2,1.95523,1.95523]
[null,"RWT35","United Energy","Urban",2565,13.055,0.751,5.7169999999999996,0.60499999999999998,1.171,8,21.192399999999999,21.192399999999999,0.483207,0.483207,5,41.01455,41.01455,0.1076,0.1076,0,0,0]
[null,"SH22","United Energy","Urban",1077,3.4740000000000002,0.52900000000000003,1.954,3.0000000000000001E-3,0.17599999999999999,2,0.21790000000000001,0.21790000000000001,1.8569999999999999E-3,1.8569999999999999E-3,3,14.428050000000001,14.428050000000001,5.4789999999999998E-2,5.4789999999999998E-2,0,0,0]
[null,"SH24","United Energy","Urban",590,2.57,3.5000000000000003E-2,1.121,2E-3,0,3,0.30649999999999999,0.30649999999999999,5.0850000000000001E-3,5.0850000000000001E-3,0,0,0,0,0,0,0,0]
[null,"SH32","United Energy","Urban",463,2.2799999999999998,0.14299999999999999,1.0429999999999999,4.0000000000000001E-3,2.2200000000000002,2,0.74719999999999998,0.74719999999999998,4.3189999999999999E-3,4.3189999999999999E-3,5,371.89872000000003,371.89872000000003,1.0149699999999999,1.0149699999999999,0,0,0]
[null,"SH34","United Energy","Urban",1061,3.69,0.14000000000000001,2.02,3.1E-2,1.038,6,2.8681999999999999,2.8681999999999999,2.7102999999999999E-2,2.7102999999999999E-2,8,95.038579999999996,95.038579999999996,0.27045999999999998,0.27045999999999998,1,0.97160000000000002,0.97160000000000002]
[null,"SK1","Citipower","Urban",410,0,4.8780000000000001,0,0,0,4,1.8194999999999999,1.8194999999999999,9.7660000000000004E-3,9.7660000000000004E-3,0,0,0,0,0,0,0,0]
[null,"SR11","United Energy","Urban",1289,3.984,0.57899999999999996,3.069,0.156,1.05,6,10.257999999999999,10.257999999999999,6.4862000000000003E-2,6.4862000000000003E-2,10,68.952759999999998,68.952759999999998,0.20630000000000001,0.20630000000000001,0,0,0]
[null,"SR12","United Energy","Urban",283,1.6379999999999999,0.307,1.3580000000000001,0.01,0.13800000000000001,2,1.1960999999999999,1.1960999999999999,7.0740000000000004E-3,7.0740000000000004E-3,2,16.552759999999999,16.552759999999999,0.17685000000000001,0.17685000000000001,0,0,0]
[null,"SR13","United Energy","Urban",1726,3.2669999999999999,0.78200000000000003,4.2839999999999998,0.127,0.96099999999999997,5,5.5376000000000003,5.5376000000000003,6.9699999999999996E-3,6.9699999999999996E-3,9,41.907589999999999,41.907589999999999,0.21843000000000001,0.21843000000000001,0,0,0]
[null,"SR14","United Energy","Urban",810,2.427,0.23,1.8049999999999999,8.0000000000000002E-3,0.67,4,0.77090000000000003,0.77090000000000003,6.2310000000000004E-3,6.2310000000000004E-3,4,66.784769999999995,66.784769999999995,0.20974999999999999,0.20974999999999999,0,0,0]
[null,"SR15","United Energy","Urban",2238,5.0579999999999998,0.67500000000000004,4.2130000000000001,0.38500000000000001,3.778,16,14.2042,14.2042,0.19323299999999999,0.19323299999999999,17,139.35694000000001,139.35694000000001,0.41154000000000002,0.41154000000000002,0,0,0]
[null,"SR19","United Energy","Urban",846,2.992,0.186,2.1019999999999999,1.7999999999999999E-2,0.29599999999999999,8,1.6016999999999999,1.6016999999999999,9.4599999999999997E-3,9.4599999999999997E-3,2,26.44003,26.44003,6.1490000000000003E-2,6.1490000000000003E-2,0,0,0]
[null,"SR20","United Energy","Urban",1306,4.2519999999999998,0.77400000000000002,3.7440000000000002,0.25900000000000001,0.68500000000000005,7,10.385999999999999,10.385999999999999,5.7419999999999999E-2,5.7419999999999999E-2,9,27.49025,27.49025,0.12096,0.12096,1,0.94703999999999999,0.94703999999999999]
[null,"SR23","United Energy","Urban",1433,3.528,0.90600000000000003,3.9969999999999999,1.7999999999999999E-2,4.952,5,0.70899999999999996,0.70899999999999996,3.49E-3,3.49E-3,21,200.26733999999999,200.26733999999999,0.55776000000000003,0.55776000000000003,0,0,0]
[null,"SR24","United Energy","Urban",1733,4.8940000000000001,0.31900000000000001,2.4569999999999999,0.159,0.47,13,11.4331,11.4331,8.3153000000000005E-2,8.3153000000000005E-2,6,33.722189999999998,33.722189999999998,0.13847999999999999,0.13847999999999999,0,0,0]
[null,"SR25","United Energy","Urban",999,4.5439999999999996,0.32500000000000001,2.585,5.5E-2,2.3479999999999999,6,3.3795000000000002,3.3795000000000002,3.9059999999999997E-2,3.9059999999999997E-2,5,145.16200000000001,145.16200000000001,0.30830999999999997,0.30830999999999997,1,0.98699999999999999,0.98699999999999999]
[null,"SS11","United Energy","Urban",2162,11.944000000000001,0.186,5.9039999999999999,0.309,7.2560000000000002,13,3.0268000000000002,3.0268000000000002,3.6683E-2,3.6683E-2,9,71.011769999999999,71.011769999999999,0.22253000000000001,0.22253000000000001,0,0,0]
[null,"SS12","United Energy","Urban",1244,8.1010000000000009,1.2609999999999999,4.1150000000000002,0.17199999999999999,0.3,10,6.0692000000000004,6.0692000000000004,2.2468999999999999E-2,2.2468999999999999E-2,6,10.544320000000001,10.544320000000001,6.7549999999999999E-2,6.7549999999999999E-2,1,0.99556999999999995,0.99556999999999995]
[null,"SS13","United Energy","Urban",2034,6.9850000000000003,1.2529999999999999,4.3639999999999999,0.59799999999999998,2.5910000000000002,13,19.422499999999999,19.422499999999999,0.10691000000000001,0.10691000000000001,7,84.128749999999997,84.128749999999997,0.23843,0.23843,1,0.97682000000000002,0.97682000000000002]
[null,"SS14","United Energy","Urban",651,3.698,3.5139999999999998,4.532,3.2000000000000001E-2,0,3,1.0879000000000001,1.0879000000000001,4.6080000000000001E-3,4.6080000000000001E-3,0,0,0,0,0,0,0,0]
[null,"SS21","United Energy","Urban",408,7.1150000000000002,0.55200000000000005,4.42,0.42599999999999999,0.187,5,11.7372,11.7372,7.1157999999999999E-2,7.1157999999999999E-2,1,5.1528400000000003,5.1528400000000003,4.9070000000000003E-2,4.9070000000000003E-2,1,0.98885999999999996,0.98885999999999996]
[null,"SS22","United Energy","Urban",1388,6.4610000000000003,0.97,4.0510000000000002,3.6999999999999998E-2,0.73399999999999999,6,0.91930000000000001,0.91930000000000001,6.4539999999999997E-3,6.4539999999999997E-3,2,18.18627,18.18627,6.1949999999999998E-2,6.1949999999999998E-2,0,0,0]
[null,"SS23","United Energy","Urban",3634,14.569000000000001,3.8109999999999999,6.7489999999999997,0.41299999999999998,1.117,17,21.074300000000001,21.074300000000001,0.16711300000000001,0.16711300000000001,10,56.974519999999998,56.974519999999998,0.15959000000000001,0.15959000000000001,5,4.9231499999999997,4.9231499999999997]
[null,"SS24","United Energy","Urban",112,3.2320000000000002,8.0540000000000003,7.3689999999999998,1.2E-2,2.9000000000000001E-2,1,0.22409999999999999,0.22409999999999999,8.9630000000000005E-3,8.9630000000000005E-3,1,0.53779999999999994,0.53779999999999994,3.585E-2,3.585E-2,0,0,0]
[null,"STO13","United Energy","Urban",3046,20.120999999999999,5.2910000000000004,9.1159999999999997,1.631,1.54,35,44.660200000000003,44.660200000000003,0.13456599999999999,0.13456599999999999,10,42.181260000000002,42.181260000000002,0.15526999999999999,0.15526999999999999,0,0,0]
[null,"STO14","United Energy","Rural Short",3969,35.488999999999997,1.9930000000000001,10.279,0.66300000000000003,3.8460000000000001,52,16.177,16.177,0.131022,0.131022,26,93.860399999999998,93.860399999999998,0.38196999999999998,0.38196999999999998,1,1.3646199999999999,1.3646199999999999]
[null,"STO21","United Energy","Rural Short",2803,43.478000000000002,11.614000000000001,9.4870000000000001,0.755,3.4169999999999998,58,20.550999999999998,20.550999999999998,0.17543700000000001,0.17543700000000001,26,92.979799999999997,92.979799999999997,0.42707000000000001,0.42707000000000001,3,4.0723099999999999,4.0723099999999999]
[null,"STO22","United Energy","Rural Short",1527,10.103999999999999,1.9830000000000001,5.52,0.64200000000000002,3.1339999999999999,20,20.2759,20.2759,0.132054,0.132054,6,98.906009999999995,98.906009999999995,0.26121,0.26121,0,0,0]
[null,"STO23","United Energy","Urban",3665,16.495999999999999,0.59699999999999998,7.5149999999999997,0.28399999999999997,0.33200000000000002,20,9.0056999999999992,9.0056999999999992,9.9671999999999997E-2,9.9671999999999997E-2,8,10.52248,10.52248,4.8840000000000001E-2,4.8840000000000001E-2,1,0.97877000000000003,0.97877000000000003]
[null,"SV14","United Energy","Urban",16,1.4510000000000001,0.83699999999999997,4.9130000000000003,2.5350000000000001,21.14,1,60.654899999999998,60.654899999999998,7.3611999999999997E-2,7.3611999999999997E-2,3,505.77607,505.77607,0.61343000000000003,0.61343000000000003,0,0,0]
[null,"SV16","United Energy","Urban",1243,6.39,1.373,6.4080000000000004,1.22,12.143000000000001,10,28.805499999999999,28.805499999999999,0.184778,0.184778,11,286.76999000000001,286.76999000000001,0.52856000000000003,0.52856000000000003,0,0,0]
[null,"SV20","United Energy","Urban",81,5.6589999999999998,1.0029999999999999,6.375,0.16700000000000001,0.42199999999999999,1,2.9013,2.9013,1.2345999999999999E-2,1.2345999999999999E-2,1,7.3457699999999999,7.3457699999999999,1.235E-2,1.235E-2,0,0,0]
[null,"SV21","United Energy","Urban",45,1.829,1.6930000000000001,5.5540000000000003,7.2999999999999995E-2,6.8000000000000005E-2,1,3.0728,3.0728,2.2055999999999999E-2,2.2055999999999999E-2,1,2.8672900000000001,2.8672900000000001,0.57345999999999997,0.57345999999999997,0,0,0]
[null,"SV22","United Energy","Urban",37,0,0.52400000000000002,3.101,0,0,0,0,0,0,0,0,0,0,0,0,0,0,0]
[null,"SV23","United Energy","Urban",172,3.431,0.80100000000000005,5.9610000000000003,0,1.9350000000000001,0,0,0,0,0,5,47.874769999999998,47.874769999999998,0.38444,0.38444,0,0,0]
[null,"SV31","United Energy","Urban",58,2.4159999999999999,0.29899999999999999,2.8860000000000001,1.0999999999999999E-2,34.054000000000002,1,1.4058999999999999,1.4058999999999999,1.7219000000000002E-2,1.7219000000000002E-2,4,4407.4241400000001,4407.4241400000001,7.5075700000000003,7.5075700000000003,0,0,0]
[null,"SV32","United Energy","Urban",1685,7.2539999999999996,1.075,5.577,7.923,1.867,23,183.01429999999999,183.01429999999999,1.573661,1.573661,5,43.124589999999998,43.124589999999998,0.14246,0.14246,0,0,0]
[null,"SV33","United Energy","Urban",1581,8.2590000000000003,1.069,5.2729999999999997,9.5000000000000001E-2,0.67400000000000004,9,2.5276999999999998,2.5276999999999998,1.8131000000000001E-2,1.8131000000000001E-2,4,17.993320000000001,17.993320000000001,7.5910000000000005E-2,7.5910000000000005E-2,0,0,0]
[null,"SV34","United Energy","Urban",1187,3.8260000000000001,2.137,5.4820000000000002,5.1999999999999998E-2,13.542,10,1.3210999999999999,1.3210999999999999,8.4250000000000002E-3,8.4250000000000002E-3,12,341.85896000000002,341.85896000000002,0.70769000000000004,0.70769000000000004,0,0,0]
[null,"SVW41","United Energy","Urban",1049,6.1529999999999996,1.0720000000000001,4.1150000000000002,2.9000000000000001E-2,0,4,0.89190000000000003,0.89190000000000003,2.2880999999999999E-2,2.2880999999999999E-2,0,0,0,0,0,1,1.0077100000000001,1.0077100000000001]
[null,"SVW42","United Energy","Urban",592,4.5060000000000002,2.5249999999999999,8.0269999999999992,0.13800000000000001,0.91700000000000004,4,1.6351,1.6351,6.7510000000000001E-3,6.7510000000000001E-3,3,10.83441,10.83441,3.882E-2,3.882E-2,0,0,0]
[null,"SVW43","United Energy","Urban",2,8.5000000000000006E-2,2.2269999999999999,5.4969999999999999,0,0,0,0,0,0,0,0,0,0,0,0,0,0,0]
[null,"SVW44","United Energy","Urban",0,2.5999999999999999E-2,2.5390000000000001,3.7320000000000002,0,0,0,0,0,0,0,0,0,0,0,0,0,0,0]
[null,"SVW45","United Energy","Urban",427,4.2750000000000004,1.9650000000000001,9.0109999999999992,9.5000000000000001E-2,0.97599999999999998,3,1.548,1.548,8.5730000000000008E-3,8.5730000000000008E-3,2,15.90067,15.90067,1.6400000000000001E-2,1.6400000000000001E-2,0,0,0]
[null,"SVW52","United Energy","Urban",12,0,0.65700000000000003,3.3450000000000002,0,0,0,0,0,0,0,0,0,0,0,0,0,0,0]
[null,"SVW53","United Energy","Urban",2181,11.391999999999999,0.84,6.694,5.3999999999999999E-2,2.569,10,1.2466999999999999,1.2466999999999999,6.5459999999999997E-3,6.5459999999999997E-3,8,59.541980000000002,59.541980000000002,0.20857999999999999,0.20857999999999999,0,0,0]
[null,"SVW54","United Energy","Urban",1271,4.9829999999999997,0.89900000000000002,4.22,7.0000000000000007E-2,0.68799999999999994,5,1.2536,1.2536,2.4185000000000002E-2,2.4185000000000002E-2,3,12.254709999999999,12.254709999999999,3.4619999999999998E-2,3.4619999999999998E-2,0,0,0]
[null,"SVW55","United Energy","Urban",1433,7.867,2.2069999999999999,4.4909999999999997,0.26200000000000001,4.0000000000000001E-3,9,8.1049000000000007,8.1049000000000007,6.8672999999999998E-2,6.8672999999999998E-2,1,0.12561,0.12561,6.9999999999999999E-4,6.9999999999999999E-4,0,0,0]
[null,"WD14","United Energy","Urban",1387,5.7080000000000002,1.375,3.492,4.0000000000000001E-3,6.3E-2,3,0.20030000000000001,0.20030000000000001,2.163E-3,2.163E-3,2,3.0493700000000001,3.0493700000000001,1.081E-2,1.081E-2,0,0,0]
[null,"WD15","United Energy","Urban",769,4.5599999999999996,0.90500000000000003,2.7189999999999999,0.41699999999999998,2.254,3,28.091999999999999,28.091999999999999,5.9839000000000003E-2,5.9839000000000003E-2,5,151.73154,151.73154,0.42798000000000003,0.42798000000000003,0,0,0]
[null,"WD16","United Energy","Urban",716,3.4470000000000001,0.15,1.373,9.9000000000000005E-2,0,5,16.588100000000001,16.588100000000001,0.12425700000000001,0.12425700000000001,0,0,0,0,0,0,0,0]
[null,"WD23","United Energy","Urban",986,4.0839999999999996,4.6260000000000003,3.5579999999999998,1.4999999999999999E-2,3.2040000000000002,4,0.53359999999999996,0.53359999999999996,6.0870000000000004E-3,6.0870000000000004E-3,10,115.71686,115.71686,0.44331999999999999,0.44331999999999999,0,0,0]
[null,"WD24","United Energy","Urban",73,0,2.2530000000000001,3.984,0,9.9220000000000006,0,0,0,0,0,2,372.28609,372.28609,1.32229,1.32229,0,0,0]
[null,"WD26","United Energy","Urban",622,4.1779999999999999,0.14399999999999999,1.292,1E-3,0.53700000000000003,1,0.1656,0.1656,1.6080000000000001E-3,1.6080000000000001E-3,2,87.393950000000004,87.393950000000004,0.24276,0.24276,0,0,0]
[null,"WD33","United Energy","Urban",41,0,3.3460000000000001,5.2679999999999998,0,0,0,0,0,0,0,0,0,0,0,0,0,0,0]
[null,"WD34","United Energy","Urban",1100,4.6310000000000002,0.111,2.6549999999999998,0.46899999999999997,0.26800000000000002,4,39.338900000000002,39.338900000000002,4.1968999999999999E-2,4.1968999999999999E-2,3,22.49935,22.49935,5.7279999999999998E-2,5.7279999999999998E-2,1,1.0656000000000001,1.0656000000000001]
[null,"WD36","United Energy","Urban",1500,10.089,1.1830000000000001,4.3410000000000002,0.21,0.57199999999999995,12,8.1449999999999996,8.1449999999999996,5.5975999999999998E-2,5.5975999999999998E-2,10,22.157620000000001,22.157620000000001,7.868E-2,7.868E-2,0,0,0]

{"sheet":"3.6.9 Network-reliability","index":7,"n_rows":22,"n_cols":3,"rows_kept":22,"cut":false,"hidden":false,"merged":[]}
[null,{"$f":"(LOOKUP(dms_Model,dms_Model_List,dms_Worksheet_List))","v":"ANNUAL REPORTING STATEMENT"}]
[null,{"$f":"dms_TradingName","v":"United Energy"}]
[null,{"$f":"CONCATENATE(\"Annual Reporting RIN Response \",CRY)","v":"Annual Reporting RIN Response 2017"}]
[null,"3.6 QUALITY OF SERVICES"]
[]
[]
[null,"3.6.9 - NETWORK FEEDER RELIABILITY - PLANNED OUTAGES"]
[null,null,{"$f":"CRY","v":2017}]
[null,"3.6.9.1 - PLANNED MINUTES OFF SUPPLY (SAIDI)"]
[null,{"$f":"INDEX(dms_FeederName_1,MATCH(dms_TradingName,dms_TradingName_List))","v":"CBD"},0]
[null,{"$f":"INDEX(dms_FeederName_2,MATCH(dms_TradingName,dms_TradingName_List))","v":"Urban"},64.619519699999998]
[null,{"$f":"INDEX(dms_FeederName_3,MATCH(dms_TradingName,dms_TradingName_List))","v":"Short rural"},153.02341179999999]
[null,{"$f":"INDEX(dms_FeederName_4,MATCH(dms_TradingName,dms_TradingName_List))","v":"Long rural"},0]
[null,{"$f":"IF((INDEX(dms_FeederName_5,MATCH(dms_TradingName,dms_TradingName_List))=0),\"\",(INDEX(dms_FeederName_5,MATCH(dms_TradingName,dms_TradingName_List))))","v":""}]
[]
[null,null,{"$f":"CRY","v":2017}]
[null,"3.6.9.2 - PLANNED INTERRUPTIONS TO SUPPLY (SAIFI)"]
[null,{"$f":"INDEX(dms_FeederName_1,MATCH(dms_TradingName,dms_TradingName_List))","v":"CBD"},0]
[null,{"$f":"INDEX(dms_FeederName_2,MATCH(dms_TradingName,dms_TradingName_List))","v":"Urban"},0.1914276]
[null,{"$f":"INDEX(dms_FeederName_3,MATCH(dms_TradingName,dms_TradingName_List))","v":"Short rural"},0.52853570000000005]
[null,{"$f":"INDEX(dms_FeederName_4,MATCH(dms_TradingName,dms_TradingName_List))","v":"Long rural"},0]
[null,{"$f":"IF((INDEX(dms_FeederName_5,MATCH(dms_TradingName,dms_TradingName_List))=0),\"\",(INDEX(dms_FeederName_5,MATCH(dms_TradingName,dms_TradingName_List))))","v":""}]

{"sheet":"4.1 Public lighting","index":8,"n_rows":52,"n_cols":4,"rows_kept":52,"cut":false,"hidden":false,"merged":[[5,1,5,2]]}
[null,{"$f":"(LOOKUP(dms_Model,dms_Model_List,dms_Worksheet_List))","v":"ANNUAL REPORTING STATEMENT"}]
[null,{"$f":"dms_TradingName","v":"United Energy"}]
[null,{"$f":"CONCATENATE(\"Annual Reporting RIN Response \",CRY)","v":"Annual Reporting RIN Response 2017"}]
[null,"4.1 PUBLIC LIGHTING"]
[]
[null,"Tables 4.1.1 - 4.1.3 deliberately omitted."]
[]
[null,"4.1.4 - PUBLIC LIGHTING METRICS BY TARIFF"]
[null,null,"Number of Lights","Public Lighting Revenue"]
[null,"Tariff categories","0's","$0's, nominal"]
[null,"CC Mercury Vapour 1x125",773,65184]
[null,"CC Mercury Vapour 1x250",120,7601]
[null,"CC Mercury Vapour 1x400",6,526]
[null,"CC Mercury Vapour 1x50",30,2403]
[null,"CC Mercury Vapour 1x700",3,263]
[null,"CC Mercury Vapour 1x80",26321,1739461]
[null,"Compact Fluorescent 1x32",1775,59281]
[null,"Compact Fluorescent 1x42",344,11400]
[null,"Flourescent 2x20",47,3793]
[null,"Flourescent 3x20",3,198]
[null,"HP Sodium 1x100",1034,77256]
[null,"HP Sodium 1x150",23988,1630269]
[null,"HP Sodium 1x250",10339,717190]
[null,"HP Sodium 1x400",315,27860]
[null,"HP Sodium 1x70",294,34720]
[null,"LED 1x17",1,3]
[null,"LED 1x18",10742,177808]
[null,"LED 1x21.900",6146,37107]
[null,"LED 1x23",4689,28369]
[null,"LED 1x25",10,143]
[null,"LED 1x70.400",13,44]
[null,"metal halide 1x100",95,8716]
[null,"metal halide 1x150",43,2997]
[null,"metal halide 1x250",125,11770]
[null,"metal halide 1x400",117,10995]
[null,"metal halide 1x70",9,826]
[null,"T5 Fluorescent 2x14",33025,1110318]
[null,"T5 Fluorescent 2x24",352,11866]
[null,"Avoided costs",0,-210996]
[]
[]
[]
[]
[]
[]
[]
[]
[]
[]
[]
[null,"To enter further tariff categories - please insert new lines above this line. "]
[null,"Total ",{"$f":"SUM(C11:C50)","v":120759},{"$f":"SUM(D11:D50)","v":5567371}]

{"sheet":"6.2 STPIS Reliability","index":9,"n_rows":94,"n_cols":4,"rows_kept":94,"cut":false,"hidden":false,"merged":[[76,1,81,1],[82,1,87,1],[88,1,93,1],[75,1,75,2],[22,1,27,1],[32,1,37,1],[38,1,43,1],[44,1,49,1],[5,1,5,2],[31,1,31,2],[66,1,71,1],[60,1,65,1],[53,1,53,2],[54,1,59,1],[16,1,21,1],[9,1,9,2],[10,1,15,1]]}
[null,{"$f":"(LOOKUP(dms_Model,dms_Model_List,dms_Worksheet_List))","v":"ANNUAL REPORTING STATEMENT"}]
[null,{"$f":"dms_TradingName","v":"United Energy"}]
[null,{"$f":"CONCATENATE(\"Annual Reporting RIN Response \",CRY)","v":"Annual Reporting RIN Response 2017"}]
[null,"6.2 RELIABILITY AND CUSTOMER SERVICE PERFORMANCE"]
[]
[null,"Did the MAIFI parameter of the STPIS apply during the period?\nNB:This flag is set from the response on worksheet 3.6.8 Network feeders",null,{"$f":"dms_MAIFI_Flag","v":"Yes"}]
[]
[]
[null,"6.2.1 - UNPLANNED MINUTES OFF SUPPLY (SAIDI)"]
[null,null,null,{"$f":"CRY","v":2017}]
[null,"Total sustained minutes off supply",{"$f":"INDEX(dms_FeederName_1,MATCH(dms_TradingName,dms_TradingName_List))","v":"CBD"},0]
[null,null,{"$f":"INDEX(dms_FeederName_2,MATCH(dms_TradingName,dms_TradingName_List))","v":"Urban"},41.215430339999997]
[null,null,{"$f":"INDEX(dms_FeederName_3,MATCH(dms_TradingName,dms_TradingName_List))","v":"Short rural"},65.378126530000003]
[null,null,{"$f":"INDEX(dms_FeederName_4,MATCH(dms_TradingName,dms_TradingName_List))","v":"Long rural"},0]
[null,null,{"$f":"IF((INDEX(dms_FeederName_5,MATCH(dms_TradingName,dms_TradingName_List))=0),\"\",(INDEX(dms_FeederName_5,MATCH(dms_TradingName,dms_TradingName_List))))","v":""}]
[null,null,"Whole Network",42.938320220000001]
[null,"Total of excluded events*\n\n*see 3.3 of STPIS",{"$f":"INDEX(dms_FeederName_1,MATCH(dms_TradingName,dms_TradingName_List))","v":"CBD"},0]
[null,null,{"$f":"INDEX(dms_FeederName_2,MATCH(dms_TradingName,dms_TradingName_List))","v":"Urban"},0]
[null,null,{"$f":"INDEX(dms_FeederName_3,MATCH(dms_TradingName,dms_TradingName_List))","v":"Short rural"},0]
[null,null,{"$f":"INDEX(dms_FeederName_4,MATCH(dms_TradingName,dms_TradingName_List))","v":"Long rural"},0]
[null,null,{"$f":"IF((INDEX(dms_FeederName_5,MATCH(dms_TradingName,dms_TradingName_List))=0),\"\",(INDEX(dms_FeederName_5,MATCH(dms_TradingName,dms_TradingName_List))))","v":""}]
[null,null,"Whole Network",0]
[null,"Total sustained minutes off supply after removing excluded events",{"$f":"INDEX(dms_FeederName_1,MATCH(dms_TradingName,dms_TradingName_List))","v":"CBD"},0]
[null,null,{"$f":"INDEX(dms_FeederName_2,MATCH(dms_TradingName,dms_TradingName_List))","v":"Urban"},41.215430339999997]
[null,null,{"$f":"INDEX(dms_FeederName_3,MATCH(dms_TradingName,dms_TradingName_List))","v":"Short rural"},65.378126530000003]
[null,null,{"$f":"INDEX(dms_FeederName_4,MATCH(dms_TradingName,dms_TradingName_List))","v":"Long rural"},0]
[null,null,{"$f":"IF((INDEX(dms_FeederName_5,MATCH(dms_TradingName,dms_TradingName_List))=0),\"\",(INDEX(dms_FeederName_5,MATCH(dms_TradingName,dms_TradingName_List))))","v":""}]
[null,null,"Whole Network",42.938320220000001]
[]
[]
[null,"6.2.2 - UNPLANNED INTERRUPTIONS TO SUPPLY (SAIFI)"]
[null,null,null,{"$f":"CRY","v":2017}]
[null,"Total sustained interruptions",{"$f":"INDEX(dms_FeederName_1,MATCH(dms_TradingName,dms_TradingName_List))","v":"CBD"},0]
[null,null,{"$f":"INDEX(dms_FeederName_2,MATCH(dms_TradingName,dms_TradingName_List))","v":"Urban"},0.60639562400000002]
[null,null,{"$f":"INDEX(dms_FeederName_3,MATCH(dms_TradingName,dms_TradingName_List))","v":"Short rural"},1.1109268139999999]
[null,null,{"$f":"INDEX(dms_FeederName_4,MATCH(dms_TradingName,dms_TradingName_List))","v":"Long rural"},0]
[null,null,{"$f":"IF((INDEX(dms_FeederName_5,MATCH(dms_TradingName,dms_TradingName_List))=0),\"\",(INDEX(dms_FeederName_5,MATCH(dms_TradingName,dms_TradingName_List))))","v":""}]
[null,null,"Whole Network",0.642370569]
[null,"Total of excluded events*\n\n*see 3.3 of STPIS",{"$f":"INDEX(dms_FeederName_1,MATCH(dms_TradingName,dms_TradingName_List))","v":"CBD"},0]
[null,null,{"$f":"INDEX(dms_FeederName_2,MATCH(dms_TradingName,dms_TradingName_List))","v":"Urban"},0]
[null,null,{"$f":"INDEX(dms_FeederName_3,MATCH(dms_TradingName,dms_TradingName_List))","v":"Short rural"},0]
[null,null,{"$f":"INDEX(dms_FeederName_4,MATCH(dms_TradingName,dms_TradingName_List))","v":"Long rural"},0]
[null,null,{"$f":"IF((INDEX(dms_FeederName_5,MATCH(dms_TradingName,dms_TradingName_List))=0),\"\",(INDEX(dms_FeederName_5,MATCH(dms_TradingName,dms_TradingName_List))))","v":""}]
[null,null,"Whole Network",0]
[null,"Total sustained interruptions after removing excluded events",{"$f":"INDEX(dms_FeederName_1,MATCH(dms_TradingName,dms_TradingName_List))","v":"CBD"},0]
[null,null,{"$f":"INDEX(dms_FeederName_2,MATCH(dms_TradingName,dms_TradingName_List))","v":"Urban"},0.60639562400000002]
[null,null,{"$f":"INDEX(dms_FeederName_3,MATCH(dms_TradingName,dms_TradingName_List))","v":"Short rural"},1.1109268139999999]
[null,null,{"$f":"INDEX(dms_FeederName_4,MATCH(dms_TradingName,dms_TradingName_List))","v":"Long rural"},0]
[null,null,{"$f":"IF((INDEX(dms_FeederName_5,MATCH(dms_TradingName,dms_TradingName_List))=0),\"\",(INDEX(dms_FeederName_5,MATCH(dms_TradingName,dms_TradingName_List))))","v":""}]
[null,null,"Whole Network",0.642370569]
[]
[]
[null,"6.2.3 - UNPLANNED MOMENTARY INTERRUPTIONS TO SUPPLY (MAIFI)"]
[null,null,null,{"$f":"CRY","v":2017}]
[null,"Total momentary interruptions",{"$f":"INDEX(dms_FeederName_1,MATCH(dms_TradingName,dms_TradingName_List))","v":"CBD"},0]
[null,null,{"$f":"INDEX(dms_FeederName_2,MATCH(dms_TradingName,dms_TradingName_List))","v":"Urban"},0.99287924599999999]
[null,null,{"$f":"INDEX(dms_FeederName_3,MATCH(dms_TradingName,dms_TradingName_List))","v":"Short rural"},4.9102407220000002]
[null,null,{"$f":"INDEX(dms_FeederName_4,MATCH(dms_TradingName,dms_TradingName_List))","v":"Long rural"},0]
[null,null,{"$f":"IF((INDEX(dms_FeederName_5,MATCH(dms_TradingName,dms_TradingName_List))=0),\"\",(INDEX(dms_FeederName_5,MATCH(dms_TradingName,dms_TradingName_List))))","v":""}]
[null,null,"Whole Network",1.2722016519999999]
[null,"Total of excluded events*\n\n*see 3.3 of STPIS",{"$f":"INDEX(dms_FeederName_1,MATCH(dms_TradingName,dms_TradingName_List))","v":"CBD"},0]
[null,null,{"$f":"INDEX(dms_FeederName_2,MATCH(dms_TradingName,dms_TradingName_List))","v":"Urban"},0]
[null,null,{"$f":"INDEX(dms_FeederName_3,MATCH(dms_TradingName,dms_TradingName_List))","v":"Short rural"},0]
[null,null,{"$f":"INDEX(dms_FeederName_4,MATCH(dms_TradingName,dms_TradingName_List))","v":"Long rural"},0]
[null,null,{"$f":"IF((INDEX(dms_FeederName_5,MATCH(dms_TradingName,dms_TradingName_List))=0),\"\",(INDEX(dms_FeederName_5,MATCH(dms_TradingName,dms_TradingName_List))))","v":""}]
[null,null,"Whole Network",0]
[null,"Total momentary interruptions after removing excluded events",{"$f":"INDEX(dms_FeederName_1,MATCH(dms_TradingName,dms_TradingName_List))","v":"CBD"},0]
[null,null,{"$f":"INDEX(dms_FeederName_2,MATCH(dms_TradingName,dms_TradingName_List))","v":"Urban"},0.99287924599999999]
[null,null,{"$f":"INDEX(dms_FeederName_3,MATCH(dms_TradingName,dms_TradingName_List))","v":"Short rural"},4.9102407220000002]
[null,null,{"$f":"INDEX(dms_FeederName_4,MATCH(dms_TradingName,dms_TradingName_List))","v":"Long rural"},0]
[null,null,{"$f":"IF((INDEX(dms_FeederName_5,MATCH(dms_TradingName,dms_TradingName_List))=0),\"\",(INDEX(dms_FeederName_5,MATCH(dms_TradingName,dms_TradingName_List))))","v":""}]
[null,null,"Whole Network",1.2722016519999999]
[]
[]
[null,"6.2.4 - DISTRIBUTION CUSTOMER NUMBERS"]
[null,null,null,{"$f":"CRY","v":2017}]
[null,"Customer numbers at the start of the period",{"$f":"INDEX(dms_FeederName_1,MATCH(dms_TradingName,dms_TradingName_List))","v":"CBD"},0]
[null,null,{"$f":"INDEX(dms_FeederName_2,MATCH(dms_TradingName,dms_TradingName_List))","v":"Urban"},621855]
[null,null,{"$f":"INDEX(dms_FeederName_3,MATCH(dms_TradingName,dms_TradingName_List))","v":"Short rural"},47971]
[null,null,{"$f":"INDEX(dms_FeederName_4,MATCH(dms_TradingName,dms_TradingName_List))","v":"Long rural"},0]
[null,null,{"$f":"IF((INDEX(dms_FeederName_5,MATCH(dms_TradingName,dms_TradingName_List))=0),\"\",(INDEX(dms_FeederName_5,MATCH(dms_TradingName,dms_TradingName_List))))","v":""}]
[null,null,"Whole Network",669826]
[null,"Customer numbers at the end of the period",{"$f":"INDEX(dms_FeederName_1,MATCH(dms_TradingName,dms_TradingName_List))","v":"CBD"},0]
[null,null,{"$f":"INDEX(dms_FeederName_2,MATCH(dms_TradingName,dms_TradingName_List))","v":"Urban"},628758]
[null,null,{"$f":"INDEX(dms_FeederName_3,MATCH(dms_TradingName,dms_TradingName_List))","v":"Short rural"},48049]
[null,null,{"$f":"INDEX(dms_FeederName_4,MATCH(dms_TradingName,dms_TradingName_List))","v":"Long rural"},0]
[null,null,{"$f":"IF((INDEX(dms_FeederName_5,MATCH(dms_TradingName,dms_TradingName_List))=0),\"\",(INDEX(dms_FeederName_5,MATCH(dms_TradingName,dms_TradingName_List))))","v":""}]
[null,null,"Whole Network",676807]
[null,"Average customer numbers",{"$f":"INDEX(dms_FeederName_1,MATCH(dms_TradingName,dms_TradingName_List))","v":"CBD"},0]
[null,null,{"$f":"INDEX(dms_FeederName_2,MATCH(dms_TradingName,dms_TradingName_List))","v":"Urban"},625307]
[null,null,{"$f":"INDEX(dms_FeederName_3,MATCH(dms_TradingName,dms_TradingName_List))","v":"Short rural"},48010]
[null,null,{"$f":"INDEX(dms_FeederName_4,MATCH(dms_TradingName,dms_TradingName_List))","v":"Long rural"},0]
[null,null,{"$f":"IF((INDEX(dms_FeederName_5,MATCH(dms_TradingName,dms_TradingName_List))=0),\"\",(INDEX(dms_FeederName_5,MATCH(dms_TradingName,dms_TradingName_List))))","v":""},{"$f":"ROUND(SUM(D81+D87)/2,0)","v":0}]
[null,null,"Whole Network",673317]

{"sheet":"6.6 STPIS Customer Service","index":10,"n_rows":12,"n_cols":4,"rows_kept":12,"cut":false,"hidden":false,"merged":[]}
[null,{"$f":"(LOOKUP(dms_Model,dms_Model_List,dms_Worksheet_List))","v":"ANNUAL REPORTING STATEMENT"}]
[null,{"$f":"dms_TradingName","v":"United Energy"}]
[null,{"$f":"CONCATENATE(\"Annual Reporting RIN Response \",CRY)","v":"Annual Reporting RIN Response 2017"}]
[null,"6.6 STPIS CUSTOMER SERVICE"]
[]
[]
[null,"6.6.1 - TELEPHONE ANSWERING"]
[null,null,"Number of calls \nafter removing excluded events","Total number of calls"]
[null,null,{"$f":"CRY","v":2017},{"$f":"CRY","v":2017}]
[null,"Number of calls received",95613,95613]
[null,"Number of calls answered within 30 seconds",76723]
[null,"Percentage of calls answered within 30 seconds",0.8]

{"sheet":"6.7 STPIS Daily Performance","index":11,"n_rows":380,"n_cols":14,"rows_kept":380,"cut":false,"hidden":false,"merged":[[6,1,6,5],[8,1,8,6],[12,4,12,5],[12,6,12,7],[12,10,12,11],[12,8,12,9],[12,12,12,13],[11,1,13,1],[11,2,11,3],[12,2,13,2],[11,4,11,13],[12,3,13,3]]}
[null,{"$f":"(LOOKUP(dms_Model,dms_Model_List,dms_Worksheet_List))","v":"ANNUAL REPORTING STATEMENT"},null,null,null,null,null,null,{"$f":"CONCATENATE(IF(LEN(CRY)=4,\"1-Jan-\",\"1-Jul-\"),LEFT(CRY,4))","v":"1-Jan-2017"}]
[null,{"$f":"dms_TradingName","v":"United Energy"}]
[null,{"$f":"CONCATENATE(\"Annual Reporting RIN Response \",CRY)","v":"Annual Reporting RIN Response 2017"}]
[null,"6.7 STPIS DAILY PERFORMANCE"]
[]
[]
[null,"Did the MAIFI parameter of the STPIS apply during the period?\nThis flag is set from the response on worksheet 3.6.8 Network feeders",null,null,null,null,{"$f":"dms_MAIFI_Flag","v":"Yes"}]
[]
[null,"The excluded events to be removed from the data refer only to events listed in clause 3.3(a) of the STPIS, with respect to reliability data, and in clause 5.4 of the STPIS with respect to customer service parameters.\n\n*Customer service information must be reported as per the definitions in the STPIS, that is excluding: \n   • calls to payment lines and automated interactive services \n   • calls abandoned by the customer within 30 seconds of the call being queued for response by a human operator (where the time in which a telephone call is abandoned is not measured, then an estimate of the number of calls abandoned within 30 seconds will be determined by taking 20 per cent of all calls abandoned)."]
[]
[null,"6.7.1 - DAILY PERFORMANCE DATA - UNPLANNED"]
[null,"Date","Customer service*",null,"MAIFI"]
[null,null,"Number of calls received\n(after removing excluded events)","Number of calls answered in 30 seconds\n(after removing excluded events)",{"$f":"INDEX(dms_FeederName_1,MATCH(dms_TradingName,dms_TradingName_List))","v":"CBD"},null,{"$f":"INDEX(dms_FeederName_2,MATCH(dms_TradingName,dms_TradingName_List))","v":"Urban"},null,{"$f":"INDEX(dms_FeederName_3,MATCH(dms_TradingName,dms_TradingName_List))","v":"Short rural"},null,{"$f":"INDEX(dms_FeederName_4,MATCH(dms_TradingName,dms_TradingName_List))","v":"Long rural"},null,{"$f":"IF((INDEX(dms_FeederName_5,MATCH(dms_TradingName,dms_TradingName_List))=0),\"Network\",(INDEX(dms_FeederName_5,MATCH(dms_TradingName,dms_TradingName_List))))","v":"Network"}]
[null,null,null,null,"All events","After removing excluded events","All events","After removing excluded events","All events","After removing excluded events","All events","After removing excluded events","All events","After removing excluded events"]
[null,{"$f":"CONCATENATE(IF(LEN(CRY)=4,\"1-Jan-\",\"1-Jul-\"),LEFT(CRY,4))","v":"1-Jan-2017"},80,75,0,0,0,0,0,0,0,0,0,0]
[null,{"$f":"B15+1","v":"2017-01-02"},136,123,0,0,0,0,0,0,0,0,0,0]
[null,"2017-01-03",201,166,0,0,0,0,6.7599999999999993E-2,6.7599999999999993E-2,0,0,4.7999999999999996E-3,4.7999999999999996E-3]
[null,"2017-01-04",405,231,0,0,6.1999999999999998E-3,6.1999999999999998E-3,8.9099999999999999E-2,8.9099999999999999E-2,0,0,1.21E-2,1.21E-2]
[null,"2017-01-05",323,298,0,0,0,0,0,0,0,0,0,0]
[null,"2017-01-06",427,338,0,0,0,0,0,0,0,0,0,0]
[null,"2017-01-07",899,550,0,0,1.1299999999999999E-2,1.1299999999999999E-2,0,0,0,0,1.0500000000000001E-2,1.0500000000000001E-2]
[null,"2017-01-08",172,135,0,0,0,0,8.6999999999999994E-3,8.6999999999999994E-3,0,0,5.9999999999999995E-4,5.9999999999999995E-4]
[null,"2017-01-09",299,253,0,0,4.3E-3,4.3E-3,7.4200000000000002E-2,7.4200000000000002E-2,0,0,9.2999999999999992E-3,9.2999999999999992E-3]
[null,"2017-01-10",193,190,0,0,0,0,4.1200000000000001E-2,4.1200000000000001E-2,0,0,2.8999999999999998E-3,2.8999999999999998E-3]
[null,"2017-01-11",272,228,0,0,1.9E-3,1.9E-3,0,0,0,0,1.6999999999999999E-3,1.6999999999999999E-3]
[null,"2017-01-12",251,213,0,0,4.1000000000000003E-3,4.1000000000000003E-3,0,0,0,0,3.8E-3,3.8E-3]
[null,"2017-01-13",425,299,0,0,2.3E-3,2.3E-3,0.1235,0.1235,0,0,1.09E-2,1.09E-2]
[null,"2017-01-14",220,182,0,0,0,0,0,0,0,0,0,0]
[null,"2017-01-15",133,115,0,0,4.1999999999999997E-3,4.1999999999999997E-3,0,0,0,0,3.8999999999999998E-3,3.8999999999999998E-3]
[null,"2017-01-16",294,245,0,0,2E-3,2E-3,0,0,0,0,1.8E-3,1.8E-3]
[null,"2017-01-17",462,404,0,0,0,0,0,0,0,0,0,0]
[null,"2017-01-18",347,257,0,0,0,0,0,0,0,0,0,0]
[null,"2017-01-19",314,300,0,0,2.8999999999999998E-3,2.8999999999999998E-3,0,0,0,0,2.7000000000000001E-3,2.7000000000000001E-3]
[null,"2017-01-20",563,327,0,0,2.1299999999999999E-2,2.1299999999999999E-2,0,0,0,0,1.9800000000000002E-2,1.9800000000000002E-2]
[null,"2017-01-21",167,141,0,0,4.5999999999999999E-3,4.5999999999999999E-3,0,0,0,0,4.3E-3,4.3E-3]
[null,"2017-01-22",105,97,0,0,6.1000000000000004E-3,6.1000000000000004E-3,4.1200000000000001E-2,4.1200000000000001E-2,0,0,8.6E-3,8.6E-3]
[null,"2017-01-23",642,330,0,0,0,0,1.9699999999999999E-2,1.9699999999999999E-2,0,0,1.4E-3,1.4E-3]
[null,"2017-01-24",307,257,0,0,5.3E-3,5.3E-3,0,0,0,0,5.0000000000000001E-3,5.0000000000000001E-3]
[null,"2017-01-25",264,241,0,0,0,0,0,0,0,0,0,0]
[null,"2017-01-26",121,103,0,0,2.3999999999999998E-3,2.3999999999999998E-3,0,0,0,0,2.2000000000000001E-3,2.2000000000000001E-3]
[null,"2017-01-27",217,211,0,0,0,0,4.2299999999999997E-2,4.2299999999999997E-2,0,0,3.0000000000000001E-3,3.0000000000000001E-3]
[null,"2017-01-28",118,84,0,0,0,0,0,0,0,0,0,0]
[null,"2017-01-29",110,99,0,0,0,0,6.7599999999999993E-2,6.7599999999999993E-2,0,0,4.7999999999999996E-3,4.7999999999999996E-3]
[null,"2017-01-30",286,238,0,0,5.1999999999999998E-3,5.1999999999999998E-3,3.3500000000000002E-2,3.3500000000000002E-2,0,0,7.3000000000000001E-3,7.3000000000000001E-3]
[null,"2017-01-31",319,265,0,0,1.4E-3,1.4E-3,0,0,0,0,1.2999999999999999E-3,1.2999999999999999E-3]
[null,"2017-02-01",212,198,0,0,2.5000000000000001E-3,2.5000000000000001E-3,0,0,0,0,2.3E-3,2.3E-3]
[null,"2017-02-02",300,231,0,0,0,0,0,0,0,0,0,0]
[null,"2017-02-03",259,217,0,0,8.2000000000000007E-3,8.2000000000000007E-3,0,0,0,0,7.6E-3,7.6E-3]
[null,"2017-02-04",239,188,0,0,4.8999999999999998E-3,4.8999999999999998E-3,0,0,0,0,4.4999999999999997E-3,4.4999999999999997E-3]
[null,"2017-02-05",329,175,0,0,9.4000000000000004E-3,9.4000000000000004E-3,0,0,0,0,8.6999999999999994E-3,8.6999999999999994E-3]
[null,"2017-02-06",428,286,0,0,1E-4,1E-4,0,0,0,0,1E-4,1E-4]
[null,"2017-02-07",305,268,0,0,0,0,7.4800000000000005E-2,7.4800000000000005E-2,0,0,5.3E-3,5.3E-3]
[null,"2017-02-08",694,261,0,0,0,0,7.4800000000000005E-2,7.4800000000000005E-2,0,0,5.3E-3,5.3E-3]
[null,"2017-02-09",441,317,0,0,6.3E-3,6.3E-3,0,0,0,0,5.7999999999999996E-3,5.7999999999999996E-3]
[null,"2017-02-10",342,255,0,0,2.8E-3,2.8E-3,0,0,0,0,2.5999999999999999E-3,2.5999999999999999E-3]
[null,"2017-02-11",156,131,0,0,5.9999999999999995E-4,5.9999999999999995E-4,0,0,0,0,5.9999999999999995E-4,5.9999999999999995E-4]
[null,"2017-02-12",84,72,0,0,0,0,0,0,0,0,0,0]
[null,"2017-02-13",269,222,0,0,7.7000000000000002E-3,7.7000000000000002E-3,0,0,0,0,7.1000000000000004E-3,7.1000000000000004E-3]
[null,"2017-02-14",276,250,0,0,3.2000000000000002E-3,3.2000000000000002E-3,0,0,0,0,2.8999999999999998E-3,2.8999999999999998E-3]
[null,"2017-02-15",304,207,0,0,4.7000000000000002E-3,4.7000000000000002E-3,7.9100000000000004E-2,7.9100000000000004E-2,0,0,0.01,0.01]
[null,"2017-02-16",216,187,0,0,0,0,0,0,0,0,0,0]
[null,"2017-02-17",220,210,0,0,2.8E-3,2.8E-3,4.0099999999999997E-2,4.0099999999999997E-2,0,0,5.4999999999999997E-3,5.4999999999999997E-3]
[null,"2017-02-18",181,140,0,0,1.4E-3,1.4E-3,0,0,0,0,1.2999999999999999E-3,1.2999999999999999E-3]
[null,"2017-02-19",124,104,0,0,1.8E-3,1.8E-3,0,0,0,0,1.6999999999999999E-3,1.6999999999999999E-3]
[null,"2017-02-20",303,273,0,0,5.0000000000000001E-4,5.0000000000000001E-4,0,0,0,0,5.0000000000000001E-4,5.0000000000000001E-4]
[null,"2017-02-21",255,221,0,0,0,0,0,0,0,0,0,0]
[null,"2017-02-22",283,222,0,0,5.3E-3,5.3E-3,0,0,0,0,4.8999999999999998E-3,4.8999999999999998E-3]
[null,"2017-02-23",230,217,0,0,0,0,0,0,0,0,0,0]
[null,"2017-02-24",241,232,0,0,0,0,0,0,0,0,0,0]
[null,"2017-02-25",106,96,0,0,6.4000000000000003E-3,6.4000000000000003E-3,0,0,0,0,6.0000000000000001E-3,6.0000000000000001E-3]
[null,"2017-02-26",139,103,0,0,1.01E-2,1.01E-2,0,0,0,0,9.2999999999999992E-3,9.2999999999999992E-3]
[null,"2017-02-27",317,300,0,0,0,0,0,0,0,0,0,0]
[null,"2017-02-28",269,253,0,0,5.0000000000000001E-4,5.0000000000000001E-4,3.8600000000000002E-2,3.8600000000000002E-2,0,0,3.2000000000000002E-3,3.2000000000000002E-3]
[null,"2017-03-01",468,400,0,0,1.2E-2,1.2E-2,0,0,0,0,1.11E-2,1.11E-2]
[null,"2017-03-02",282,249,0,0,1.6500000000000001E-2,1.6500000000000001E-2,0.1216,0.1216,0,0,2.4E-2,2.4E-2]
[null,"2017-03-03",390,287,0,0,1.2999999999999999E-3,1.2999999999999999E-3,0,0,0,0,1.1999999999999999E-3,1.1999999999999999E-3]
[null,"2017-03-04",122,119,0,0,0,0,0,0,0,0,0,0]
[null,"2017-03-05",156,97,0,0,1.18E-2,1.18E-2,0,0,0,0,1.09E-2,1.09E-2]
[null,"2017-03-06",225,200,0,0,0,0,0,0,0,0,0,0]
[null,{"$f":"B79+1","v":"2017-03-07"},286,239,0,0,0,0,0,0,0,0,0,0]
[null,"2017-03-08",422,339,0,0,0,0,0,0,0,0,0,0]
[null,"2017-03-09",384,293,0,0,0,0,0,0,0,0,0,0]
[null,"2017-03-10",253,229,0,0,3.7000000000000002E-3,3.7000000000000002E-3,5.0500000000000003E-2,5.0500000000000003E-2,0,0,7.0000000000000001E-3,7.0000000000000001E-3]
[null,"2017-03-11",129,102,0,0,0,0,0,0,0,0,0,0]
[null,"2017-03-12",178,128,0,0,1.4200000000000001E-2,1.4200000000000001E-2,4.8399999999999999E-2,4.8399999999999999E-2,0,0,1.66E-2,1.66E-2]
[null,"2017-03-13",192,124,0,0,0,0,0,0,0,0,0,0]
[null,"2017-03-14",264,242,0,0,7.1999999999999998E-3,7.1999999999999998E-3,0,0,0,0,6.6E-3,6.6E-3]
[null,"2017-03-15",419,340,0,0,2.3999999999999998E-3,2.3999999999999998E-3,0,0,0,0,2.2000000000000001E-3,2.2000000000000001E-3]
[null,"2017-03-16",279,273,0,0,8.9999999999999998E-4,8.9999999999999998E-4,8.6999999999999994E-2,8.6999999999999994E-2,0,0,7.0000000000000001E-3,7.0000000000000001E-3]
[null,"2017-03-17",206,193,0,0,0,0,0,0,0,0,0,0]
[null,"2017-03-18",160,147,0,0,0,0,5.3600000000000002E-2,5.3600000000000002E-2,0,0,3.8E-3,3.8E-3]
[null,"2017-03-19",318,202,0,0,1.17E-2,1.17E-2,7.4499999999999997E-2,7.4499999999999997E-2,0,0,1.61E-2,1.61E-2]
[null,"2017-03-20",331,214,0,0,4.0000000000000002E-4,4.0000000000000002E-4,0,0,0,0,2.9999999999999997E-4,2.9999999999999997E-4]
[null,"2017-03-21",406,343,0,0,0,0,0,0,0,0,0,0]
[null,"2017-03-22",392,348,0,0,2.01E-2,2.01E-2,0,0,0,0,1.8700000000000001E-2,1.8700000000000001E-2]
[null,"2017-03-23",256,235,0,0,2.8999999999999998E-3,2.8999999999999998E-3,0,0,0,0,2.7000000000000001E-3,2.7000000000000001E-3]
[null,"2017-03-24",211,198,0,0,0,0,6.7900000000000002E-2,6.7900000000000002E-2,0,0,4.7999999999999996E-3,4.7999999999999996E-3]
[null,"2017-03-25",201,157,0,0,0,0,0,0,0,0,0,0]
[null,"2017-03-26",126,114,0,0,5.7000000000000002E-3,5.7000000000000002E-3,6.7900000000000002E-2,6.7900000000000002E-2,0,0,1.0200000000000001E-2,1.0200000000000001E-2]
[null,"2017-03-27",721,487,0,0,1.0999999999999999E-2,1.0999999999999999E-2,0,0,0,0,1.0200000000000001E-2,1.0200000000000001E-2]
[null,"2017-03-28",279,255,0,0,0,0,0,0,0,0,0,0]
[null,"2017-03-29",588,397,0,0,2.2000000000000001E-3,2.2000000000000001E-3,8.4199999999999997E-2,8.4199999999999997E-2,0,0,8.0999999999999996E-3,8.0999999999999996E-3]
[null,"2017-03-30",280,256,0,0,2.3999999999999998E-3,2.3999999999999998E-3,0,0,0,0,2.3E-3,2.3E-3]
[null,"2017-03-31",221,147,0,0,0,0,0,0,0,0,0,0]
[null,"2017-04-01",179,137,0,0,0,0,0,0,0,0,0,0]
[null,"2017-04-02",88,84,0,0,0,0,0,0,0,0,0,0]
[null,"2017-04-03",237,196,0,0,3.3E-3,3.3E-3,0,0,0,0,3.0000000000000001E-3,3.0000000000000001E-3]
[null,"2017-04-04",262,244,0,0,2.3999999999999998E-3,2.3999999999999998E-3,0,0,0,0,2.2000000000000001E-3,2.2000000000000001E-3]
[null,"2017-04-05",202,191,0,0,2.0999999999999999E-3,2.0999999999999999E-3,0,0,0,0,2E-3,2E-3]
[null,"2017-04-06",393,256,0,0,1.1900000000000001E-2,1.1900000000000001E-2,5.3699999999999998E-2,5.3699999999999998E-2,0,0,1.49E-2,1.49E-2]
[null,"2017-04-07",315,233,0,0,0,0,0,0,0,0,0,0]
[null,"2017-04-08",315,216,0,0,8.9999999999999993E-3,8.9999999999999993E-3,0,0,0,0,8.3999999999999995E-3,8.3999999999999995E-3]
[null,"2017-04-09",226,161,0,0,3.3E-3,3.3E-3,6.1600000000000002E-2,6.1600000000000002E-2,0,0,7.4000000000000003E-3,7.4000000000000003E-3]
[null,"2017-04-10",553,221,0,0,1.6000000000000001E-3,1.6000000000000001E-3,0,0,0,0,1.5E-3,1.5E-3]
[null,"2017-04-11",293,275,0,0,0,0,0,0,0,0,0,0]
[null,"2017-04-12",282,224,0,0,2.5999999999999999E-3,2.5999999999999999E-3,0,0,0,0,2.3999999999999998E-3,2.3999999999999998E-3]
[null,"2017-04-13",218,209,0,0,3.3E-3,3.3E-3,0,0,0,0,3.0999999999999999E-3,3.0999999999999999E-3]
[null,"2017-04-14",158,127,0,0,0,0,7.5499999999999998E-2,7.5499999999999998E-2,0,0,5.4000000000000003E-3,5.4000000000000003E-3]
[null,"2017-04-15",103,91,0,0,2.0999999999999999E-3,2.0999999999999999E-3,0,0,0,0,1.9E-3,1.9E-3]
[null,"2017-04-16",53,50,0,0,0,0,0,0,0,0,0,0]
[null,"2017-04-17",72,64,0,0,1.7600000000000001E-2,1.7600000000000001E-2,0,0,0,0,1.6400000000000001E-2,1.6400000000000001E-2]
[null,"2017-04-18",378,325,0,0,0,0,5.0200000000000002E-2,5.0200000000000002E-2,0,0,3.5999999999999999E-3,3.5999999999999999E-3]
[null,"2017-04-19",405,335,0,0,2E-3,2E-3,0.20710000000000001,0.20710000000000001,0,0,1.66E-2,1.66E-2]
[null,"2017-04-20",293,276,0,0,0,0,0,0,0,0,0,0]
[null,"2017-04-21",346,325,0,0,1.9E-3,1.9E-3,3.3999999999999998E-3,3.3999999999999998E-3,0,0,2E-3,2E-3]
[null,"2017-04-22",183,126,0,0,3.8999999999999998E-3,3.8999999999999998E-3,0,0,0,0,3.5999999999999999E-3,3.5999999999999999E-3]
[null,"2017-04-23",104,92,0,0,5.0000000000000001E-3,5.0000000000000001E-3,0,0,0,0,4.7000000000000002E-3,4.7000000000000002E-3]
[null,"2017-04-24",220,201,0,0,0,0,8.6999999999999994E-3,8.6999999999999994E-3,0,0,5.9999999999999995E-4,5.9999999999999995E-4]
[null,"2017-04-25",175,128,0,0,0,0,0,0,0,0,0,0]
[null,"2017-04-26",502,328,0,0,2.3999999999999998E-3,2.3999999999999998E-3,0,0,0,0,2.2000000000000001E-3,2.2000000000000001E-3]
[null,"2017-04-27",335,212,0,0,0,0,0,0,0,0,0,0]
[null,"2017-04-28",260,228,0,0,0,0,0,0,0,0,0,0]
[null,"2017-04-29",145,123,0,0,1.9E-3,1.9E-3,0,0,0,0,1.8E-3,1.8E-3]
[null,"2017-04-30",198,163,0,0,2.0999999999999999E-3,2.0999999999999999E-3,0,0,0,0,2E-3,2E-3]
[null,"2017-05-01",286,207,0,0,0,0,8.14E-2,8.14E-2,0,0,5.7999999999999996E-3,5.7999999999999996E-3]
[null,"2017-05-02",326,277,0,0,3.3E-3,3.3E-3,0,0,0,0,3.0999999999999999E-3,3.0999999999999999E-3]
[null,"2017-05-03",307,243,0,0,0,0,0,0,0,0,0,0]
[null,"2017-05-04",258,205,0,0,0,0,0,0,0,0,0,0]
[null,"2017-05-05",272,227,0,0,2.0000000000000001E-4,2.0000000000000001E-4,0,0,0,0,2.0000000000000001E-4,2.0000000000000001E-4]
[null,"2017-05-06",128,98,0,0,4.7000000000000002E-3,4.7000000000000002E-3,0,0,0,0,4.4000000000000003E-3,4.4000000000000003E-3]
[null,"2017-05-07",102,87,0,0,0,0,0,0,0,0,0,0]
[null,"2017-05-08",284,250,0,0,0,0,0,0,0,0,0,0]
[null,"2017-05-09",245,227,0,0,0,0,0,0,0,0,0,0]
[null,{"$f":"B143+1","v":"2017-05-10"},209,186,0,0,0,0,0,0,0,0,0,0]
[null,"2017-05-11",299,245,0,0,2.3E-3,2.3E-3,0,0,0,0,2.2000000000000001E-3,2.2000000000000001E-3]
[null,"2017-05-12",214,202,0,0,0,0,2.1100000000000001E-2,2.1100000000000001E-2,0,0,1.5E-3,1.5E-3]
[null,"2017-05-13",108,99,0,0,0,0,0,0,0,0,0,0]
[null,"2017-05-14",93,72,0,0,0,0,0,0,0,0,0,0]
[null,"2017-05-15",375,318,0,0,1.1000000000000001E-3,1.1000000000000001E-3,0,0,0,0,1.1000000000000001E-3,1.1000000000000001E-3]
[null,"2017-05-16",361,313,0,0,1.8E-3,1.8E-3,0,0,0,0,1.6999999999999999E-3,1.6999999999999999E-3]
[null,"2017-05-17",248,244,0,0,1.9E-3,1.9E-3,2.7E-2,2.7E-2,0,0,3.7000000000000002E-3,3.7000000000000002E-3]
[null,"2017-05-18",248,225,0,0,4.7999999999999996E-3,4.7999999999999996E-3,3.3000000000000002E-2,3.3000000000000002E-2,0,0,6.7999999999999996E-3,6.7999999999999996E-3]
[null,"2017-05-19",221,217,0,0,0,0,1.24E-2,1.24E-2,0,0,8.9999999999999998E-4,8.9999999999999998E-4]
[null,"2017-05-20",137,110,0,0,0,0,2.35E-2,2.35E-2,0,0,1.6999999999999999E-3,1.6999999999999999E-3]
[null,"2017-05-21",164,126,0,0,0,0,7.2800000000000004E-2,7.2800000000000004E-2,0,0,5.1999999999999998E-3,5.1999999999999998E-3]
[null,"2017-05-22",345,334,0,0,1.6999999999999999E-3,1.6999999999999999E-3,1.5599999999999999E-2,1.5599999999999999E-2,0,0,2.7000000000000001E-3,2.7000000000000001E-3]
[null,"2017-05-23",326,285,0,0,0,0,0,0,0,0,0,0]
[null,"2017-05-24",199,168,0,0,0,0,0,0,0,0,0,0]
[null,"2017-05-25",215,212,0,0,1.5E-3,1.5E-3,0,0,0,0,1.4E-3,1.4E-3]
[null,"2017-05-26",205,193,0,0,3.3E-3,3.3E-3,0,0,0,0,3.0999999999999999E-3,3.0999999999999999E-3]
[null,"2017-05-27",131,114,0,0,0,0,0,0,0,0,0,0]
[null,"2017-05-28",205,170,0,0,0,0,0,0,0,0,0,0]
[null,"2017-05-29",293,190,0,0,1.9E-3,1.9E-3,5.9499999999999997E-2,5.9499999999999997E-2,0,0,6.0000000000000001E-3,6.0000000000000001E-3]
[null,"2017-05-30",340,309,0,0,7.7000000000000002E-3,7.7000000000000002E-3,0,0,0,0,7.1000000000000004E-3,7.1000000000000004E-3]
[null,"2017-05-31",368,322,0,0,0,0,0,0,0,0,0,0]
[null,"2017-06-01",276,195,0,0,1.9E-3,1.9E-3,0,0,0,0,1.8E-3,1.8E-3]
[null,"2017-06-02",279,250,0,0,0,0,0,0,0,0,0,0]
[null,"2017-06-03",125,105,0,0,4.3E-3,4.3E-3,0,0,0,0,4.0000000000000001E-3,4.0000000000000001E-3]
[null,"2017-06-04",87,79,0,0,0,0,0,0,0,0,0,0]
[null,"2017-06-05",238,214,0,0,0,0,2.7900000000000001E-2,2.7900000000000001E-2,0,0,2E-3,2E-3]
[null,"2017-06-06",494,369,0,0,4.8999999999999998E-3,4.8999999999999998E-3,0,0,0,0,4.4999999999999997E-3,4.4999999999999997E-3]
[null,"2017-06-07",278,226,0,0,0,0,0,0,0,0,0,0]
[null,"2017-06-08",292,221,0,0,0,0,0,0,0,0,0,0]
[null,"2017-06-09",219,206,0,0,0,0,0,0,0,0,0,0]
[null,"2017-06-10",160,144,0,0,0,0,4.4600000000000001E-2,4.4600000000000001E-2,0,0,3.2000000000000002E-3,3.2000000000000002E-3]
[null,"2017-06-11",106,90,0,0,0,0,0,0,0,0,0,0]
[null,"2017-06-12",68,58,0,0,0,0,0,0,0,0,0,0]
[null,"2017-06-13",323,211,0,0,2.2000000000000001E-3,2.2000000000000001E-3,0,0,0,0,2E-3,2E-3]
[null,"2017-06-14",308,181,0,0,1.6999999999999999E-3,1.6999999999999999E-3,0,0,0,0,1.5E-3,1.5E-3]
[null,"2017-06-15",264,240,0,0,0,0,2.64E-2,2.64E-2,0,0,1.9E-3,1.9E-3]
[null,"2017-06-16",261,199,0,0,4.1999999999999997E-3,4.1999999999999997E-3,0,0,0,0,3.8999999999999998E-3,3.8999999999999998E-3]
[null,"2017-06-17",135,111,0,0,5.3E-3,5.3E-3,0,0,0,0,4.8999999999999998E-3,4.8999999999999998E-3]
[null,"2017-06-18",88,69,0,0,0,0,0,0,0,0,0,0]
[null,"2017-06-19",252,231,0,0,0,0,2.64E-2,2.64E-2,0,0,1.9E-3,1.9E-3]
[null,"2017-06-20",295,207,0,0,4.4000000000000003E-3,4.4000000000000003E-3,0,0,0,0,4.1000000000000003E-3,4.1000000000000003E-3]
[null,"2017-06-21",231,222,0,0,0,0,0,0,0,0,0,0]
[null,"2017-06-22",239,229,0,0,0,0,0,0,0,0,0,0]
[null,"2017-06-23",255,248,0,0,5.0000000000000001E-3,5.0000000000000001E-3,0,0,0,0,4.7000000000000002E-3,4.7000000000000002E-3]
[null,"2017-06-24",105,95,0,0,0,0,0,0,0,0,0,0]
[null,"2017-06-25",70,70,0,0,0,0,0,0,0,0,0,0]
[null,"2017-06-26",276,248,0,0,0,0,8.6999999999999994E-3,8.6999999999999994E-3,0,0,5.9999999999999995E-4,5.9999999999999995E-4]
[null,"2017-06-27",259,235,0,0,0,0,0,0,0,0,0,0]
[null,"2017-06-28",269,213,0,0,0,0,0,0,0,0,0,0]
[null,"2017-06-29",262,200,0,0,0,0,0,0,0,0,0,0]
[null,"2017-06-30",255,225,0,0,0,0,7.4999999999999997E-3,7.4999999999999997E-3,0,0,5.0000000000000001E-4,5.0000000000000001E-4]
[null,"2017-07-01",273,133,0,0,7.6E-3,7.6E-3,0,0,0,0,7.0000000000000001E-3,7.0000000000000001E-3]
[null,"2017-07-02",203,139,0,0,0,0,5.0500000000000003E-2,5.0500000000000003E-2,0,0,3.5999999999999999E-3,3.5999999999999999E-3]
[null,"2017-07-03",277,214,0,0,0,0,0,0,0,0,0,0]
[null,"2017-07-04",246,178,0,0,0,0,0,0,0,0,0,0]
[null,"2017-07-05",246,229,0,0,0,0,0,0,0,0,0,0]
[null,"2017-07-06",290,274,0,0,0,0,0,0,0,0,0,0]
[null,"2017-07-07",204,170,0,0,0,0,0,0,0,0,0,0]
[null,"2017-07-08",166,108,0,0,0,0,0,0,0,0,0,0]
[null,"2017-07-09",149,103,0,0,0,0,0,0,0,0,0,0]
[null,"2017-07-10",262,228,0,0,2.5999999999999999E-3,2.5999999999999999E-3,0,0,0,0,2.3999999999999998E-3,2.3999999999999998E-3]
[null,"2017-07-11",305,284,0,0,7.7000000000000002E-3,7.7000000000000002E-3,0,0,0,0,7.1999999999999998E-3,7.1999999999999998E-3]
[null,"2017-07-12",394,315,0,0,0,0,5.0799999999999998E-2,5.0799999999999998E-2,0,0,3.5999999999999999E-3,3.5999999999999999E-3]
[null,{"$f":"B207+1","v":"2017-07-13"},251,233,0,0,1.35E-2,1.35E-2,0,0,0,0,1.2500000000000001E-2,1.2500000000000001E-2]
[null,"2017-07-14",247,247,0,0,0,0,0,0,0,0,0,0]
[null,"2017-07-15",312,149,0,0,6.4000000000000003E-3,6.4000000000000003E-3,0,0,0,0,5.8999999999999999E-3,5.8999999999999999E-3]
[null,"2017-07-16",101,93,0,0,0,0,0,0,0,0,0,0]
[null,"2017-07-17",329,301,0,0,2.8999999999999998E-3,2.8999999999999998E-3,0,0,0,0,2.7000000000000001E-3,2.7000000000000001E-3]
[null,"2017-07-18",460,284,0,0,1.1299999999999999E-2,1.1299999999999999E-2,2.0000000000000001E-4,2.0000000000000001E-4,0,0,1.0500000000000001E-2,1.0500000000000001E-2]
[null,"2017-07-19",374,257,0,0,0,0,0,0,0,0,0,0]
[null,"2017-07-20",240,228,0,0,0,0,4.2099999999999999E-2,4.2099999999999999E-2,0,0,3.0000000000000001E-3,3.0000000000000001E-3]
[null,"2017-07-21",241,240,0,0,3.8E-3,3.8E-3,0,0,0,0,3.5999999999999999E-3,3.5999999999999999E-3]
[null,"2017-07-22",139,119,0,0,0,0,0,0,0,0,0,0]
[null,"2017-07-23",86,79,0,0,0,0,0,0,0,0,0,0]
[null,"2017-07-24",261,224,0,0,5.7000000000000002E-3,5.7000000000000002E-3,6.6400000000000001E-2,6.6400000000000001E-2,0,0,1.01E-2,1.01E-2]
[null,"2017-07-25",490,288,0,0,3.8999999999999998E-3,3.8999999999999998E-3,0,0,0,0,3.5999999999999999E-3,3.5999999999999999E-3]
[null,"2017-07-26",240,219,0,0,2.3999999999999998E-3,2.3999999999999998E-3,0,0,0,0,2.3E-3,2.3E-3]
[null,"2017-07-27",250,213,0,0,0,0,0,0,0,0,0,0]
[null,"2017-07-28",195,180,0,0,1.1000000000000001E-3,1.1000000000000001E-3,0,0,0,0,1E-3,1E-3]
[null,"2017-07-29",652,283,0,0,7.4999999999999997E-3,7.4999999999999997E-3,0,0,0,0,6.8999999999999999E-3,6.8999999999999999E-3]
[null,"2017-07-30",159,122,0,0,2.8E-3,2.8E-3,0,0,0,0,2.5999999999999999E-3,2.5999999999999999E-3]
[null,"2017-07-31",320,200,0,0,1.6999999999999999E-3,1.6999999999999999E-3,0,0,0,0,1.6000000000000001E-3,1.6000000000000001E-3]
[null,"2017-08-01",273,243,0,0,0,0,0,0,0,0,0,0]
[null,"2017-08-02",306,253,0,0,0,0,0,0,0,0,0,0]
[null,"2017-08-03",307,243,0,0,0,0,0,0,0,0,0,0]
[null,"2017-08-04",228,216,0,0,5.4000000000000003E-3,5.4000000000000003E-3,6.4999999999999997E-3,6.4999999999999997E-3,0,0,5.4999999999999997E-3,5.4999999999999997E-3]
[null,"2017-08-05",173,145,0,0,2.8999999999999998E-3,2.8999999999999998E-3,0,0,0,0,2.7000000000000001E-3,2.7000000000000001E-3]
[null,"2017-08-06",127,99,0,0,2.2000000000000001E-3,2.2000000000000001E-3,6.5299999999999997E-2,6.5299999999999997E-2,0,0,6.7000000000000002E-3,6.7000000000000002E-3]
[null,"2017-08-07",316,264,0,0,0,0,0,0,0,0,0,0]
[null,"2017-08-08",232,213,0,0,0,0,0,0,0,0,0,0]
[null,"2017-08-09",244,215,0,0,0,0,0,0,0,0,0,0]
[null,"2017-08-10",286,258,0,0,3.8E-3,3.8E-3,0,0,0,0,3.5999999999999999E-3,3.5999999999999999E-3]
[null,"2017-08-11",239,231,0,0,1.2999999999999999E-3,1.2999999999999999E-3,0,0,0,0,1.1999999999999999E-3,1.1999999999999999E-3]
[null,"2017-08-12",197,176,0,0,4.1999999999999997E-3,4.1999999999999997E-3,0,0,0,0,3.8999999999999998E-3,3.8999999999999998E-3]
[null,"2017-08-13",107,101,0,0,1.6999999999999999E-3,1.6999999999999999E-3,0,0,0,0,1.6000000000000001E-3,1.6000000000000001E-3]
[null,"2017-08-14",252,223,0,0,0,0,7.3000000000000001E-3,7.3000000000000001E-3,0,0,5.0000000000000001E-4,5.0000000000000001E-4]
[null,"2017-08-15",369,257,0,0,0,0,0,0,0,0,0,0]
[null,"2017-08-16",266,237,0,0,2.0999999999999999E-3,2.0999999999999999E-3,0,0,0,0,1.9E-3,1.9E-3]
[null,"2017-08-17",238,222,0,0,2.8999999999999998E-3,2.8999999999999998E-3,0,0,0,0,2.7000000000000001E-3,2.7000000000000001E-3]
[null,"2017-08-18",342,319,0,0,0,0,0,0,0,0,0,0]
[null,"2017-08-19",245,118,0,0,0,0,0,0,0,0,0,0]
[null,"2017-08-20",199,137,0,0,0,0,0,0,0,0,0,0]
[null,"2017-08-21",284,259,0,0,1E-3,1E-3,4.1700000000000001E-2,4.1700000000000001E-2,0,0,3.8999999999999998E-3,3.8999999999999998E-3]
[null,"2017-08-22",246,226,0,0,0,0,0,0,0,0,0,0]
[null,"2017-08-23",295,285,0,0,0,0,0,0,0,0,0,0]
[null,"2017-08-24",333,277,0,0,0,0,0,0,0,0,0,0]
[null,"2017-08-25",251,237,0,0,4.1999999999999997E-3,4.1999999999999997E-3,0,0,0,0,3.8999999999999998E-3,3.8999999999999998E-3]
[null,"2017-08-26",106,95,0,0,0,0,0,0,0,0,0,0]
[null,"2017-08-27",211,149,0,0,3.0000000000000001E-3,3.0000000000000001E-3,0,0,0,0,2.8E-3,2.8E-3]
[null,"2017-08-28",398,312,0,0,0,0,0,0,0,0,0,0]
[null,"2017-08-29",394,318,0,0,8.8999999999999999E-3,8.8999999999999999E-3,0,0,0,0,8.3000000000000001E-3,8.3000000000000001E-3]
[null,"2017-08-30",233,227,0,0,0,0,0,0,0,0,0,0]
[null,"2017-08-31",311,252,0,0,0,0,0,0,0,0,0,0]
[null,"2017-09-01",243,218,0,0,0,0,0,0,0,0,0,0]
[null,"2017-09-02",106,100,0,0,2.2000000000000001E-3,2.2000000000000001E-3,9.1399999999999995E-2,9.1399999999999995E-2,0,0,8.5000000000000006E-3,8.5000000000000006E-3]
[null,"2017-09-03",190,123,0,0,5.4999999999999997E-3,5.4999999999999997E-3,0,0,0,0,5.1999999999999998E-3,5.1999999999999998E-3]
[null,"2017-09-04",424,328,0,0,4.4000000000000003E-3,4.4000000000000003E-3,0,0,0,0,4.1000000000000003E-3,4.1000000000000003E-3]
[null,"2017-09-05",327,284,0,0,0,0,1.9E-2,1.9E-2,0,0,1.4E-3,1.4E-3]
[null,"2017-09-06",250,243,0,0,0,0,0,0,0,0,0,0]
[null,"2017-09-07",247,190,0,0,0,0,0,0,0,0,0,0]
[null,"2017-09-08",217,207,0,0,0,0,0,0,0,0,0,0]
[null,"2017-09-09",120,110,0,0,0,0,0,0,0,0,0,0]
[null,"2017-09-10",90,75,0,0,0,0,4.0500000000000001E-2,4.0500000000000001E-2,0,0,2.8999999999999998E-3,2.8999999999999998E-3]
[null,"2017-09-11",257,241,0,0,0,0,0,0,0,0,0,0]
[null,"2017-09-12",198,183,0,0,0,0,0,0,0,0,0,0]
[null,"2017-09-13",270,266,0,0,0,0,0,0,0,0,0,0]
[null,"2017-09-14",312,273,0,0,0,0,0,0,0,0,0,0]
[null,{"$f":"B271+1","v":"2017-09-15"},230,208,0,0,1.6000000000000001E-3,1.6000000000000001E-3,0,0,0,0,1.5E-3,1.5E-3]
[null,"2017-09-16",234,153,0,0,0,0,6.6199999999999995E-2,6.6199999999999995E-2,0,0,4.7000000000000002E-3,4.7000000000000002E-3]
[null,"2017-09-17",135,96,0,0,5.4000000000000003E-3,5.4000000000000003E-3,0,0,0,0,5.0000000000000001E-3,5.0000000000000001E-3]
[null,"2017-09-18",449,272,0,0,0,0,0,0,0,0,0,0]
[null,"2017-09-19",296,285,0,0,0,0,0,0,0,0,0,0]
[null,"2017-09-20",276,271,0,0,0,0,0,0,0,0,0,0]
[null,"2017-09-21",234,215,0,0,0,0,2.5600000000000001E-2,2.5600000000000001E-2,0,0,1.8E-3,1.8E-3]
[null,"2017-09-22",256,248,0,0,0,0,0,0,0,0,0,0]
[null,"2017-09-23",280,207,0,0,4.3E-3,4.3E-3,3.7199999999999997E-2,3.7199999999999997E-2,0,0,6.7000000000000002E-3,6.7000000000000002E-3]
[null,"2017-09-24",229,161,0,0,0,0,3.9800000000000002E-2,3.9800000000000002E-2,0,0,2.8E-3,2.8E-3]
[null,"2017-09-25",237,204,0,0,1.6999999999999999E-3,1.6999999999999999E-3,1.49E-2,1.49E-2,0,0,2.5999999999999999E-3,2.5999999999999999E-3]
[null,"2017-09-26",231,211,0,0,0,0,0,0,0,0,0,0]
[null,"2017-09-27",274,266,0,0,7.7000000000000002E-3,7.7000000000000002E-3,0,0,0,0,7.1999999999999998E-3,7.1999999999999998E-3]
[null,"2017-09-28",189,185,0,0,0,0,0,0,0,0,0,0]
[null,"2017-09-29",169,151,0,0,4.7999999999999996E-3,4.7999999999999996E-3,6.6600000000000006E-2,6.6600000000000006E-2,0,0,9.1999999999999998E-3,9.1999999999999998E-3]
[null,"2017-09-30",110,97,0,0,0,0,0,0,0,0,0,0]
[null,"2017-10-01",56,54,0,0,2.5999999999999999E-3,2.5999999999999999E-3,0,0,0,0,2.3999999999999998E-3,2.3999999999999998E-3]
[null,"2017-10-02",361,319,0,0,0,0,1.9800000000000002E-2,1.9800000000000002E-2,0,0,1.4E-3,1.4E-3]
[null,"2017-10-03",282,249,0,0,0,0,0,0,0,0,0,0]
[null,"2017-10-04",288,259,0,0,0,0,2.7099999999999999E-2,2.7099999999999999E-2,0,0,1.9E-3,1.9E-3]
[null,"2017-10-05",251,205,0,0,0,0,0,0,0,0,0,0]
[null,"2017-10-06",316,270,0,0,1.3299999999999999E-2,1.3299999999999999E-2,0,0,0,0,1.23E-2,1.23E-2]
[null,"2017-10-07",120,107,0,0,2.0999999999999999E-3,2.0999999999999999E-3,0,0,0,0,1.9E-3,1.9E-3]
[null,"2017-10-08",51,51,0,0,0,0,0,0,0,0,0,0]
[null,"2017-10-09",225,206,0,0,0,0,0,0,0,0,0,0]
[null,"2017-10-10",263,242,0,0,5.1999999999999998E-3,5.1999999999999998E-3,0,0,0,0,4.8999999999999998E-3,4.8999999999999998E-3]
[null,"2017-10-11",216,186,0,0,7.4000000000000003E-3,7.4000000000000003E-3,9.0300000000000005E-2,9.0300000000000005E-2,0,0,1.3299999999999999E-2,1.3299999999999999E-2]
[null,"2017-10-12",226,209,0,0,5.4999999999999997E-3,5.4999999999999997E-3,0,0,0,0,5.1000000000000004E-3,5.1000000000000004E-3]
[null,"2017-10-13",207,187,0,0,0,0,0,0,0,0,0,0]
[null,"2017-10-14",86,84,0,0,2.0999999999999999E-3,2.0999999999999999E-3,0,0,0,0,1.9E-3,1.9E-3]
[null,"2017-10-15",54,51,0,0,6.1999999999999998E-3,6.1999999999999998E-3,0,0,0,0,5.7000000000000002E-3,5.7000000000000002E-3]
[null,"2017-10-16",286,248,0,0,9.7999999999999997E-3,9.7999999999999997E-3,0,0,0,0,9.1000000000000004E-3,9.1000000000000004E-3]
[null,"2017-10-17",325,305,0,0,2.5999999999999999E-3,2.5999999999999999E-3,4.2799999999999998E-2,4.2799999999999998E-2,0,0,5.4999999999999997E-3,5.4999999999999997E-3]
[null,"2017-10-18",225,199,0,0,3.5000000000000001E-3,3.5000000000000001E-3,2.7199999999999998E-2,2.7199999999999998E-2,0,0,5.1999999999999998E-3,5.1999999999999998E-3]
[null,"2017-10-19",417,327,0,0,6.0000000000000001E-3,6.0000000000000001E-3,0,0,0,0,5.4999999999999997E-3,5.4999999999999997E-3]
[null,"2017-10-20",185,173,0,0,0,0,0,0,0,0,0,0]
[null,"2017-10-21",99,87,0,0,9.1000000000000004E-3,9.1000000000000004E-3,0,0,0,0,8.3999999999999995E-3,8.3999999999999995E-3]
[null,"2017-10-22",222,127,0,0,0,0,0,0,0,0,0,0]
[null,"2017-10-23",210,195,0,0,1.9E-3,1.9E-3,0,0,0,0,1.6999999999999999E-3,1.6999999999999999E-3]
[null,"2017-10-24",189,182,0,0,3.3999999999999998E-3,3.3999999999999998E-3,9.4799999999999995E-2,9.4799999999999995E-2,0,0,9.9000000000000008E-3,9.9000000000000008E-3]
[null,"2017-10-25",356,320,0,0,2.2599999999999999E-2,2.2599999999999999E-2,0,0,0,0,2.1000000000000001E-2,2.1000000000000001E-2]
[null,"2017-10-26",270,254,0,0,2.2000000000000001E-3,2.2000000000000001E-3,0,0,0,0,2.0999999999999999E-3,2.0999999999999999E-3]
[null,"2017-10-27",180,168,0,0,0,0,0,0,0,0,0,0]
[null,"2017-10-28",134,126,0,0,0,0,0,0,0,0,0,0]
[null,"2017-10-29",355,199,0,0,5.1999999999999998E-3,5.1999999999999998E-3,0,0,0,0,4.7999999999999996E-3,4.7999999999999996E-3]
[null,"2017-10-30",390,311,0,0,6.8999999999999999E-3,6.8999999999999999E-3,0,0,0,0,6.4000000000000003E-3,6.4000000000000003E-3]
[null,"2017-10-31",275,266,0,0,0,0,0,0,0,0,0,0]
[null,"2017-11-01",205,201,0,0,5.4999999999999997E-3,5.4999999999999997E-3,0,0,0,0,5.1000000000000004E-3,5.1000000000000004E-3]
[null,"2017-11-02",215,213,0,0,5.4000000000000003E-3,5.4000000000000003E-3,0,0,0,0,5.1000000000000004E-3,5.1000000000000004E-3]
[null,"2017-11-03",253,252,0,0,4.4999999999999997E-3,4.4999999999999997E-3,0,0,0,0,4.1999999999999997E-3,4.1999999999999997E-3]
[null,"2017-11-04",140,126,0,0,0,0,6.6500000000000004E-2,6.6500000000000004E-2,0,0,4.7000000000000002E-3,4.7000000000000002E-3]
[null,"2017-11-05",76,69,0,0,5.1999999999999998E-3,5.1999999999999998E-3,0,0,0,0,4.7999999999999996E-3,4.7999999999999996E-3]
[null,"2017-11-06",162,153,0,0,2E-3,2E-3,0,0,0,0,1.8E-3,1.8E-3]
[null,"2017-11-07",167,106,0,0,3.3999999999999998E-3,3.3999999999999998E-3,0,0,0,0,3.2000000000000002E-3,3.2000000000000002E-3]
[null,"2017-11-08",244,242,0,0,4.3E-3,4.3E-3,0,0,0,0,4.0000000000000001E-3,4.0000000000000001E-3]
[null,"2017-11-09",311,276,0,0,5.4999999999999997E-3,5.4999999999999997E-3,0.24590000000000001,0.24590000000000001,0,0,2.2599999999999999E-2,2.2599999999999999E-2]
[null,"2017-11-10",200,192,0,0,0,0,0,0,0,0,0,0]
[null,"2017-11-11",128,109,0,0,0,0,0,0,0,0,0,0]
[null,"2017-11-12",214,145,0,0,9.7999999999999997E-3,9.7999999999999997E-3,0,0,0,0,9.1000000000000004E-3,9.1000000000000004E-3]
[null,"2017-11-13",264,245,0,0,7.9000000000000008E-3,7.9000000000000008E-3,0,0,0,0,7.3000000000000001E-3,7.3000000000000001E-3]
[null,"2017-11-14",318,274,0,0,1.8E-3,1.8E-3,6.6500000000000004E-2,6.6500000000000004E-2,0,0,6.4000000000000003E-3,6.4000000000000003E-3]
[null,"2017-11-15",287,256,0,0,8.9999999999999993E-3,8.9999999999999993E-3,0,0,0,0,8.3000000000000001E-3,8.3000000000000001E-3]
[null,"2017-11-16",233,212,0,0,5.7000000000000002E-3,5.7000000000000002E-3,2.2200000000000001E-2,2.2200000000000001E-2,0,0,6.8999999999999999E-3,6.8999999999999999E-3]
[null,"2017-11-17",311,297,0,0,5.1000000000000004E-3,5.1000000000000004E-3,6.4999999999999997E-3,6.4999999999999997E-3,0,0,5.1999999999999998E-3,5.1999999999999998E-3]
[null,{"$f":"B335+1","v":"2017-11-18"},485,199,0,0,1.66E-2,1.66E-2,0,0,0,0,1.55E-2,1.55E-2]
[null,"2017-11-19",162,127,0,0,0,0,0,0,0,0,0,0]
[null,"2017-11-20",295,240,0,0,0,0,0,0,0,0,0,0]
[null,"2017-11-21",404,333,0,0,9.5999999999999992E-3,9.5999999999999992E-3,3.3000000000000002E-2,3.3000000000000002E-2,0,0,1.1299999999999999E-2,1.1299999999999999E-2]
[null,"2017-11-22",398,312,0,0,4.7000000000000002E-3,4.7000000000000002E-3,0,0,0,0,4.4000000000000003E-3,4.4000000000000003E-3]
[null,"2017-11-23",725,436,0,0,2E-3,2E-3,0,0,0,0,1.8E-3,1.8E-3]
[null,"2017-11-24",522,392,0,0,2.7E-2,2.7E-2,0.1007,0.1007,0,0,3.2300000000000002E-2,3.2300000000000002E-2]
[null,"2017-11-25",315,189,0,0,3.8E-3,3.8E-3,5.3999999999999999E-2,5.3999999999999999E-2,0,0,7.4000000000000003E-3,7.4000000000000003E-3]
[null,"2017-11-26",162,125,0,0,8.9999999999999998E-4,8.9999999999999998E-4,0,0,0,0,8.0000000000000004E-4,8.0000000000000004E-4]
[null,"2017-11-27",272,192,0,0,0,0,0,0,0,0,0,0]
[null,"2017-11-28",332,251,0,0,4.1999999999999997E-3,4.1999999999999997E-3,0,0,0,0,3.8999999999999998E-3,3.8999999999999998E-3]
[null,"2017-11-29",511,380,0,0,0.01,0.01,0,0,0,0,9.2999999999999992E-3,9.2999999999999992E-3]
[null,"2017-11-30",376,331,0,0,0,0,0,0,0,0,0,0]
[null,"2017-12-01",747,534,0,0,1.03E-2,1.03E-2,4.87E-2,4.87E-2,0,0,1.2999999999999999E-2,1.2999999999999999E-2]
[null,"2017-12-02",342,224,0,0,0,0,0,0,0,0,0,0]
[null,"2017-12-03",541,288,0,0,6.6E-3,6.6E-3,4.82E-2,4.82E-2,0,0,9.4999999999999998E-3,9.4999999999999998E-3]
[null,"2017-12-04",311,238,0,0,0,0,5.3999999999999999E-2,5.3999999999999999E-2,0,0,3.8E-3,3.8E-3]
[null,"2017-12-05",305,207,0,0,0,0,0,0,0,0,0,0]
[null,"2017-12-06",196,157,0,0,0,0,0,0,0,0,0,0]
[null,"2017-12-07",438,313,0,0,5.3E-3,5.3E-3,0,0,0,0,4.8999999999999998E-3,4.8999999999999998E-3]
[null,"2017-12-08",338,215,0,0,4.3E-3,4.3E-3,0,0,0,0,4.0000000000000001E-3,4.0000000000000001E-3]
[null,"2017-12-09",236,193,0,0,0,0,1.9599999999999999E-2,1.9599999999999999E-2,0,0,1.4E-3,1.4E-3]
[null,"2017-12-10",101,70,0,0,1.5E-3,1.5E-3,0,0,0,0,1.4E-3,1.4E-3]
[null,"2017-12-11",232,180,0,0,0,0,0,0,0,0,0,0]
[null,"2017-12-12",231,219,0,0,1.9E-3,1.9E-3,0,0,0,0,1.8E-3,1.8E-3]
[null,"2017-12-13",549,305,0,0,4.1000000000000003E-3,4.1000000000000003E-3,0,0,0,0,3.8E-3,3.8E-3]
[null,"2017-12-14",558,279,0,0,1.21E-2,1.21E-2,0,0,0,0,1.12E-2,1.12E-2]
[null,"2017-12-15",297,248,0,0,6.0000000000000001E-3,6.0000000000000001E-3,0,0,0,0,5.5999999999999999E-3,5.5999999999999999E-3]
[null,"2017-12-16",154,124,0,0,5.5999999999999999E-3,5.5999999999999999E-3,4.1300000000000003E-2,4.1300000000000003E-2,0,0,8.0999999999999996E-3,8.0999999999999996E-3]
[null,"2017-12-17",131,110,0,0,0,0,0,0,0,0,0,0]
[null,"2017-12-18",266,232,0,0,7.7000000000000002E-3,7.7000000000000002E-3,4.2900000000000001E-2,4.2900000000000001E-2,0,0,1.0200000000000001E-2,1.0200000000000001E-2]
[null,"2017-12-19",605,391,0,0,2.5000000000000001E-2,2.5000000000000001E-2,0,0,0,0,2.3300000000000001E-2,2.3300000000000001E-2]
[null,"2017-12-20",304,277,0,0,4.7000000000000002E-3,4.7000000000000002E-3,0,0,0,0,4.4000000000000003E-3,4.4000000000000003E-3]
[null,"2017-12-21",283,236,0,0,0,0,2.6800000000000001E-2,2.6800000000000001E-2,0,0,1.9E-3,1.9E-3]
[null,"2017-12-22",252,230,0,0,3.5999999999999999E-3,3.5999999999999999E-3,0,0,0,0,3.3999999999999998E-3,3.3999999999999998E-3]
[null,"2017-12-23",125,115,0,0,0,0,9.11E-2,9.11E-2,0,0,6.4999999999999997E-3,6.4999999999999997E-3]
[null,"2017-12-24",81,74,0,0,4.0000000000000001E-3,4.0000000000000001E-3,0,0,0,0,3.8E-3,3.8E-3]
[null,"2017-12-25",226,114,0,0,2E-3,2E-3,1.95E-2,1.95E-2,0,0,3.3E-3,3.3E-3]
[null,"2017-12-26",91,86,0,0,1.9E-3,1.9E-3,0.22789999999999999,0.22789999999999999,0,0,1.7999999999999999E-2,1.7999999999999999E-2]
[null,"2017-12-27",218,199,0,0,0,0,0,0,0,0,0,0]
[null,"2017-12-28",244,153,0,0,7.7999999999999996E-3,7.7999999999999996E-3,1.78E-2,1.78E-2,0,0,8.5000000000000006E-3,8.5000000000000006E-3]
[null,"2017-12-29",219,183,0,0,5.9999999999999995E-4,5.9999999999999995E-4,4.3299999999999998E-2,4.3299999999999998E-2,0,0,3.7000000000000002E-3,3.7000000000000002E-3]
[null,"2017-12-30",104,91,0,0,1.5E-3,1.5E-3,0,0,0,0,1.4E-3,1.4E-3]
[null,"2017-12-31",118,93,0,0,3.2000000000000002E-3,3.2000000000000002E-3,8.0399999999999999E-2,8.0399999999999999E-2,0,0,8.6999999999999994E-3,8.6999999999999994E-3]
[null,"2018-01-01"]

{"sheet":"6.8 STPIS Exclusions","index":12,"n_rows":403,"n_cols":12,"rows_kept":403,"cut":false,"hidden":false,"merged":[[9,11,10,11],[6,1,6,4],[9,6,9,8],[9,5,10,5],[9,4,10,4],[9,2,10,2],[9,3,10,3]]}
[null,{"$f":"(LOOKUP(dms_Model,dms_Model_List,dms_Worksheet_List))","v":"ANNUAL REPORTING STATEMENT"}]
[null,{"$f":"dms_TradingName","v":"United Energy"}]
[null,{"$f":"CONCATENATE(\"Annual Reporting RIN Response \",CRY)","v":"Annual Reporting RIN Response 2017"}]
[null,"6.8 STPIS EXCLUSIONS"]
[]
[]
[null,{"$f":"CONCATENATE(\"This information is collected to inform the application of the STPIS to \",dms_TradingName,\" in future regulatory periods. The information is also collected to monitor network performance, and may be used in performance reports.\")","v":"This information is collected to inform the application of the STPIS to United Energy in future regulatory periods. The information is also collected to monitor network performance, and may be used in performance reports."}]
[]
[null,"6.8.1 - STPIS EXCLUSIONS"]
[null,"Date of event","Outage ID","Feeder ID / name","Feeder classification\n(drop down)","Cause of event\n(drop down)","Unplanned",null,null,"Event category","Effect on unplanned MAIFI","Please provide separate explanation to confirm the outage was not due to inadequate transmission connection planning "]
[null,"DD/MM/YYYY",null,null,null,null,"Number of  interruptions","Duration of interruption\n(mins)","Total unplanned minutes off supply","Use exclusion categories listed in section 3.3(a) of the STPIS\n(drop down)","by feeder classification"]
[null,null,null,null,null,null,null,null,null,null,null,"No Exclusions or MEDs for United Energy in 2017"]
[]
[]
[]
[]
[]
[]
[]
[]
[]
[]
[]
[]
[]
[]
[]
[]
[]
[]
[]
[]
[]
[]
[]
[]
[]
[]
[]
[]
[]
[]
[]
[]
[]
[]
[]
[]
[]
[]
[]
[]
[]
[]
[]
[]
[]
[]
[]
[]
[]
[]
[]
[]
[]
[]
[]
[]
[]
[]
[]
[]
[]
[]
[]
[]
[]
[]
[]
[]
[]
[]
[]
[]
[]
[]
[]
[]
[]
[]
[]
[]
[]
[]
[]
[]
[]
[]
[]
[]
[]
[]
[]
[]
[]
[]
[]
[]
[]
[]
[]
[]
[]
[]
[]
[]
[]
[]
[]
[]
[]
[]
[]
[]
[]
[]
[]
[]
[]
[]
[]
[]
[]
[]
[]
[]
[]
[]
[]
[]
[]
[]
[]
[]
[]
[]
[]
[]
[]
[]
[]
[]
[]
[]
[]
[]
[]
[]
[]
[]
[]
[]
[]
[]
[]
[]
[]
[]
[]
[]
[]
[]
[]
[]
[]
[]
[]
[]
[]
[]
[]
[]
[]
[]
[]
[]
[]
[]
[]
[]
[]
[]
[]
[]
[]
[]
[]
[]
[]
[]
[]
[]
[]
[]
[]
[]
[]
[]
[]
[]
[]
[]
[]
[]
[]
[]
[]
[]
[]
[]
[]
[]
[]
[]
[]
[]
[]
[]
[]
[]
[]
[]
[]
[]
[]
[]
[]
[]
[]
[]
[]
[]
[]
[]
[]
[]
[]
[]
[]
[]
[]
[]
[]
[]
[]
[]
[]
[]
[]
[]
[]
[]
[]
[]
[]
[]
[]
[]
[]
[]
[]
[]
[]
[]
[]
[]
[]
[]
[]
[]
[]
[]
[]
[]
[]
[]
[]
[]
[]
[]
[]
[]
[]
[]
[]
[]
[]
[]
[]
[]
[]
[]
[]
[]
[]
[]
[]
[]
[]
[]
[]
[]
[]
[]
[]
[]
[]
[]
[]
[]
[]
[]
[]
[]
[]
[]
[]
[]
[]
[]
[]
[]
[]
[]
[]
[]
[]
[]
[]
[]
[]
[]
[]
[]
[]
[]
[]
[]
[]
[]
[]
[]
[]
[]
[]
[]
[]
[]
[]
[]
[]
[]
[]
[]
[]
[]
[]
[]
[]
[]
[]
[]
[]
[]
[]
[]
[]
[]
[]
[]
[]
[]
[]
[]
[]
[]
[]
[]
[]
[]
[]
[]
[]
[]
[]
[]
[]
[]
[]
[]
[]
[]
[null,"To enter further events - please insert new lines above this line. "]

{"sheet":"6.9 STPIS - GSL","index":13,"n_rows":116,"n_cols":5,"rows_kept":116,"cut":false,"hidden":false,"merged":[[77,1,77,2],[65,1,65,2],[66,1,66,2],[67,1,67,2],[73,1,73,2],[72,1,72,2],[71,1,71,2],[17,1,17,2],[15,1,15,2],[5,1,5,2],[7,1,7,2],[14,1,14,2],[16,1,16,2],[21,1,21,2],[23,1,23,2],[24,1,24,2],[25,1,25,2],[22,1,22,2],[29,1,29,2],[33,1,33,2],[34,1,34,2],[30,1,30,2],[31,1,31,2],[32,1,32,2],[35,1,35,2],[36,1,36,2],[37,1,37,2],[38,1,38,2],[39,1,39,2],[43,1,43,2],[45,1,45,2],[46,1,46,2],[47,1,47,2],[44,1,44,2],[99,1,99,2],[100,1,100,2],[48,1,48,2],[49,1,49,2],[85,1,85,2],[84,1,84,2],[91,1,91,2],[53,1,53,2],[54,1,54,2],[61,1,61,2],[64,1,64,4],[70,1,70,4],[76,1,76,4],[82,1,82,4],[79,1,79,2],[78,1,78,2],[5,4,5,5],[115,1,115,2],[83,1,83,2],[112,1,112,2],[114,1,114,2],[107,1,107,2],[108,1,108,2],[109,1,109,2],[110,1,110,2],[102,1,102,2],[103,1,103,2],[104,1,104,2],[105,1,105,2],[106,1,106,2],[97,1,97,2],[98,1,98,2],[60,1,60,2],[55,1,55,2],[56,1,56,2],[57,1,57,2],[58,1,58,2],[59,1,59,2]]}
[null,{"$f":"(LOOKUP(dms_Model,dms_Model_List,dms_Worksheet_List))","v":"ANNUAL REPORTING STATEMENT"}]
[null,{"$f":"dms_TradingName","v":"United Energy"}]
[null,{"$f":"CONCATENATE(\"Annual Reporting RIN Response \",CRY)","v":"Annual Reporting RIN Response 2017"}]
[null,"6.9 STPIS - GUARANTEED SERVICE LEVEL"]
[]
[null,"Did the AER's GSL Scheme apply at any time during the regulatory year?",null,"No","**IMPORTANT \nPlease ensure this flag is set. Conditional formatting on this worksheet is dependant on this response."]
[]
[null,"Instructions:\nTable 6.9.1 collects information relating to jurisdiction GSL scheme parameters. These parameters can be found in the jurisdictonal scheme relevant to NSP. Please identify each parameter in the relevant sub-tables and provide the volume and value of GSL payments. \n\nFor GSL parameters that do not fit within the provided sub-tables provided, please enter a heading and identify the relevant parameter(s). "]
[]
[null,"6.9.1 - GUARANTEED SERVICE LEVELS - JURISDICTIONAL GSL SCHEME"]
[null,null,null,{"$f":"CRY","v":2017},{"$f":"CRY","v":2017}]
[null,null,null,"Volume","Value of GSL payments"]
[null,null,null,"0's","$0's"]
[null,"Appointments"]
[null,"Customer Arranged Appointments",null,5529]
[null,"Appointments not met within 15 minutes of agreed time",null,2]
[null,"Appoinments GSL Payments",null,2,60]
[]
[null,"To enter further GSL parameters relating to appointments - please copy a row from above and \"insert copied cells\" above this row."]
[]
[null,"Connections"]
[null,"Connections Made",null,12835]
[null,"Connections not made on agreed date",null,427]
[null,"Connections - GSL payments - 1-4 day delay",null,283,38430]
[null,"Connections - GSL payments - 5+ day delay",null,144,50400]
[]
[null,"To enter further GSL parameters relating to connections -  please copy a row from above and \"insert copied cells\" above this row."]
[]
[null,"Reliability of supply"]
[null,"Low reliability payments - Annual Duration of Unplanned Interuptions - 20 hours",null,258,30960]
[null,"Low reliability payments - Annual Duration of Unplanned Interuptions - 30 hours",null,6,1080]
[null,"Low reliability payments - Annual Duration of Unplanned Interuptions - 60 hours",null,1,360]
[null,"Low reliability payments - Low Reliability Payments >8 events",null,2,240]
[null,"Low reliability payments - Low Reliability Payments >12 events",null,0,0]
[null,"Low reliability payments - Low Reliability Payments >24 events",null,0,0]
[null,"Low reliability payments - Annual Frequency of Momentary Interuptions - 24",null,0,0]
[null,"Low reliability payments - Annual Frequency of Momentary Interuptions - 36",null,0,0]
[null,"Duration of an individual unplanned interuptions > 12hrs (CBD & Urban Feeders)",null,473,37840]
[null,"Duration of an individual unplanned interuptions > 18hrs (Short & Long Rural Feeders)",null,0,0]
[]
[null,"To enter further GSL parameters relating to reliability of supply -  please copy a row from above and \"insert copied cells\" above this row."]
[]
[null,"Street lights"]
[null,"Street lights",null,120839]
[null,"Street lights \"out\" during period",null,9407]
[null,"Street lights not repaired by \"fix by\" date",null,668]
[null,"Street lights not repaired in 2 business days",null,2134]
[null,"Street lights - number of business days to repair",null,2]
[null,"Street lights - GSL payments",null,97,2425]
[]
[null,"To enter further GSL parameters relating to street lights -  please copy a row from above and \"insert copied cells\" above this row."]
[]
[null,"Planned interruptions"]
[null,"Planned Interruptions - 4 business days notice not given",null,93]
[]
[]
[]
[]
[]
[]
[]
[]
[null,"To enter further GSL parameters relating to planned interruptions -  please copy a row from above and \"insert copied cells\" above this row."]
[]
[null,"<NSP defined parameter category>"]
[]
[]
[]
[null,"To enter further GSL parameters - please identify the parameter and if insufficient rows  please copy a row from above and \"insert copied cells\" above this row."]
[]
[null,"<NSP defined parameter category>"]
[]
[]
[]
[null,"To enter further GSL parameters - please identify the parameter and if insufficient rows  please copy a row from above and \"insert copied cells\" above this row."]
[]
[null,"<NSP defined parameter category>"]
[]
[]
[]
[null,"To enter further GSL parameters - please identify the parameter and if insufficient rows  please copy a row from above and \"insert copied cells\" above this row."]
[]
[null,"<NSP defined parameter category>"]
[]
[]
[]
[null,"To enter further GSL parameters - please identify the parameter and if insufficient rows  please copy a row from above and \"insert copied cells\" above this row."]
[]
[]
[null,"6.9.2 - GUARANTEED SERVICE LEVELS - AER GSL SCHEME"]
[]
[null,"Complete Table 6.9.2 if the AER's GSL scheme applied at any time during the regulatory year. \n\nDo not complete Table 6.9.2 if the AER's GSL scheme did not apply during the regulatory year."]
[]
[null,null,null,{"$f":"CRY","v":2017},{"$f":"CRY","v":2017}]
[null,null,null,"Volume","Value \nof GSL payments"]
[null,null,null,"0's","$0's"]
[null,"New connections "]
[null,"Number of connections made"]
[null,"Number of connections not made on or before the day agreed"]
[null,"Connections - GSL payments – 1-6 day delay"]
[null,"Connections - GSL payments – 7+ day delay"]
[null,"Reliability of supply"]
[null,"Frequency of interruptions – CBD feeders – 9 interruptions"]
[null,"Frequency of interruptions – Urban feeders – 9 interruptions"]
[null,"Frequency of interruptions – Rural (short and long) feeders – 15 interruptions"]
[null,"Interruptions – CBD feeders – 12 hours duration"]
[null,"Interruptions – Urban feeders – 12 hours duration"]
[null,"Interruptions – Rural (short and long) feeders – 18 hours duration"]
[null,"Total duration of interruptions Level 1 – 20 hours"]
[null,"Total duration of interruptions Level 2 – 30 hours"]
[null,"Total duration of interruptions Level 3 – 60 hours"]
[null,"Street lights"]
[null,"Streetlight repair 5 days – GSL payments"]
[null,"Planned interruptions"]
[null,"Notice of planned interruptions – 4 business days notice not given"]
[null,"Total ",null,null,{"$f":"SUM(E115,E113,E103:E111,E100:E101)","v":0}]

{"sheet":"7.8 Avoided TUOS Payments","index":14,"n_rows":11,"n_cols":3,"rows_kept":11,"cut":false,"hidden":false,"merged":[]}
[null,{"$f":"(LOOKUP(dms_Model,dms_Model_List,dms_Worksheet_List))","v":"ANNUAL REPORTING STATEMENT"}]
[null,{"$f":"dms_TradingName","v":"United Energy"}]
[null,{"$f":"CONCATENATE(\"Annual Reporting RIN Response \",CRY)","v":"Annual Reporting RIN Response 2017"}]
[null,"7.8 - AVOIDED TUOS PAYMENTS"]
[]
[null,"7.8.1 - AVOIDED TUOS PAYMENTS"]
[null,null,"Avoided TUOS Payment "]
[null,null,"$0's, nominal"]
[null,"Embedded generators",11279]
[null,"Market network service providers",0]
[null,"Other",0]

{"sheet":"7.10 Juris Scheme","index":15,"n_rows":17,"n_cols":6,"rows_kept":17,"cut":false,"hidden":false,"merged":[[8,4,9,4],[8,3,9,3],[8,2,9,2],[8,1,9,1],[5,1,5,2]]}
[null,{"$f":"(LOOKUP(dms_Model,dms_Model_List,dms_Worksheet_List))","v":"ANNUAL REPORTING STATEMENT"}]
[null,{"$f":"dms_TradingName","v":"United Energy"}]
[null,{"$f":"CONCATENATE(\"Annual Reporting RIN Response \",CRY)","v":"Annual Reporting RIN Response 2017"}]
[null,"7.10 - JURISDICTIONAL SCHEMES"]
[]
[null,"Instructions\nBusiness must list each relevant jurisdictional scheme individually and report information for each scheme separately from other schemes."]
[]
[null,"7.10.1 - JURISDICTIONAL SCHEME PAYMENTS"]
[null,"Jurisdictional Scheme Name","Description","Date DNSP Became Subject to Scheme","Description of Cost Recovery Method","Total Scheme Payments  "]
[null,null,null,null,null,"$0's, nominal"]
[null,"PFIT","Solar Rebate","1970-01-01T00:33:37","Full recovery via tariff submission",12876415.92]
[null,"TFIT","Solar Rebate","1970-01-01T00:33:37","Full recovery via tariff submission",622927.43999999994]
[]
[]
[]
[]
[null,null,null,null,"Total",{"$f":"SUM(F11:F16)","v":13499343.359999999}]

{"sheet":"7.11 DMIS-DMIA","index":16,"n_rows":46,"n_cols":5,"rows_kept":46,"cut":false,"hidden":false,"merged":[[6,2,6,4],[8,2,8,4]]}
[null,{"$f":"(LOOKUP(dms_Model,dms_Model_List,dms_Worksheet_List))","v":"ANNUAL REPORTING STATEMENT"}]
[null,{"$f":"dms_TradingName","v":"United Energy"}]
[null,{"$f":"CONCATENATE(\"Annual Reporting RIN Response \",CRY)","v":"Annual Reporting RIN Response 2017"}]
[null,"7.11 - DEMAND MANAGEMENT INCENTIVE SCHEME"]
[]
[null,"7.11.1 - DMIA - PROJECTS SUBMITTED FOR APPROVAL"]
[null,null,{"$f":"CONCATENATE(\"Total amount of the DMIA spent in \", CRY)","v":"Total amount of the DMIA spent in 2017"}]
[null,null,"Operating expenditure","Capital expenditure","Total"]
[null,"Name of project","$0's, nominal"]
[null,"Summer Saver Program",288192.37,null,{"$f":"SUM(C10:D10)","v":288192.37}]
[null,"Virtual Power Plant Stage 1 (VPP)",62074.35,null,62074.35]
[null,null,null,null,0]
[null,null,null,null,0]
[null,null,null,null,0]
[null,null,null,null,0]
[null,null,null,null,0]
[null,null,null,null,0]
[null,null,null,null,0]
[null,null,null,null,0]
[null,null,null,null,0]
[null,null,null,null,0]
[null,null,null,null,0]
[null,null,null,null,0]
[null,null,null,null,0]
[null,null,null,null,0]
[null,null,null,null,0]
[null,null,null,null,0]
[null,null,null,null,0]
[null,null,null,null,0]
[null,null,null,null,0]
[null,null,null,null,0]
[null,null,null,null,0]
[null,null,null,null,0]
[null,null,null,null,0]
[null,null,null,null,0]
[null,null,null,null,0]
[null,null,null,null,0]
[null,null,null,null,0]
[null,null,null,null,0]
[null,null,null,null,0]
[null,null,null,null,0]
[null,null,null,null,0]
[null,null,null,null,0]
[null,null,null,null,0]
[null,"To enter additional projects - please copy an existing row and insert above this row. "]
[null,"Total",{"$f":"SUM(C10:C45)","v":350266.72},{"$f":"SUM(D10:D45)","v":0},{"$f":"SUM(E10:E45)","v":350266.72}]

{"sheet":"7.12 Safety and Bushfire","index":17,"n_rows":343,"n_cols":7,"rows_kept":343,"cut":false,"hidden":false,"merged":[[139,1,139,2],[140,1,140,2],[134,1,134,2],[87,1,89,1],[87,2,89,2],[148,1,148,2],[149,1,149,2],[121,1,122,2],[138,1,138,2],[43,2,43,5],[141,1,141,2],[142,1,142,2],[300,6,300,7],[44,2,44,5],[45,2,45,5],[46,2,46,5],[48,6,48,8],[47,6,47,8],[47,2,47,5],[88,3,88,4],[89,3,89,4],[167,2,167,3],[168,2,168,3],[217,3,217,4],[218,3,218,4],[143,1,143,2],[144,1,144,2],[145,1,145,2],[295,6,295,7],[296,6,296,7],[297,6,297,7],[298,6,298,7],[48,2,48,5],[216,1,218,1],[285,6,285,7],[286,6,286,7],[287,6,287,7],[123,1,123,2],[124,1,124,2],[125,1,125,2],[126,1,126,2],[127,1,127,2],[128,1,128,2],[129,1,129,2],[130,1,130,2],[131,1,131,2],[166,1,168,1],[132,1,132,2],[133,1,133,2],[284,6,284,7],[216,2,218,2],[135,1,135,2],[136,1,136,2],[137,1,137,2],[250,1,251,1],[146,1,146,2],[147,1,147,2],[38,2,38,5],[29,6,29,8],[30,6,30,8],[31,6,31,8],[23,6,23,8],[24,6,24,8],[25,6,25,8],[26,6,26,8],[27,6,27,8],[37,6,37,8],[38,6,38,8],[24,2,24,5],[23,2,23,5],[31,2,31,5],[32,2,32,5],[33,2,33,5],[34,2,34,5],[34,6,34,8],[35,2,35,5],[35,6,35,8],[36,2,36,5],[36,6,36,8],[37,2,37,5],[40,2,40,5],[41,2,41,5],[39,2,39,5],[42,2,42,5],[40,6,40,8],[41,6,41,8],[39,6,39,8],[5,1,5,2],[25,2,25,5],[26,2,26,5],[27,2,27,5],[28,2,28,5],[29,2,29,5],[30,2,30,5],[11,1,11,2],[10,1,10,2],[17,2,17,5],[18,2,18,5],[19,2,19,5],[20,2,20,5],[21,2,21,5],[22,2,22,5],[14,1,14,4],[13,1,13,4],[18,6,18,8],[19,6,19,8],[28,6,28,8],[303,6,303,7],[304,6,304,7],[305,6,305,7],[299,6,299,7],[20,6,20,8],[21,6,21,8],[22,6,22,8],[42,6,42,8],[301,6,301,7],[17,6,17,8],[32,6,32,8],[33,6,33,8],[341,4,341,6],[327,4,327,6],[316,4,316,6],[317,4,317,6],[318,4,318,6],[319,4,319,6],[320,4,320,6],[321,4,321,6],[328,4,328,6],[329,4,329,6],[324,4,324,6],[325,4,325,6],[326,4,326,6],[335,4,335,6],[336,4,336,6],[337,4,337,6],[322,4,322,6],[323,4,323,6],[339,4,339,6],[334,4,334,6],[338,4,338,6],[340,4,340,6],[332,4,332,6],[333,4,333,6],[330,4,330,6],[331,4,331,6],[250,2,251,2],[315,4,315,6],[314,4,314,6],[288,6,288,7],[289,6,289,7],[290,6,290,7],[309,6,309,7],[310,6,310,7],[283,6,283,7],[307,6,307,7],[308,6,308,7],[291,6,291,7],[292,6,292,7],[293,6,293,7],[294,6,294,7],[302,6,302,7],[306,6,306,7]]}
[null,{"$f":"(LOOKUP(dms_Model,dms_Model_List,dms_Worksheet_List))","v":"ANNUAL REPORTING STATEMENT"}]
[null,{"$f":"dms_TradingName","v":"United Energy"}]
[null,{"$f":"CONCATENATE(\"Annual Reporting RIN Response \",CRY)","v":"Annual Reporting RIN Response 2017"}]
[null,"7.12 SAFETY AND BUSHFIRE RELATED EXPENDITURE"]
[]
[null,"These templates collect information from Victorian businesses only.\n\nBushfire and safety related expenditure information is used by the AER to monitor the expenditures throughout the regulatory control period."]
[]
[null,"CPI applied to convert expected expenditure in real $ to nominal based on lagged September CPI index"]
[]
[null,"Instructions"]
[null,"For \"Exclusive of Margins & Overheads\" reported expenditure is to EXCLUDE any overheads, profit margins or management fees paid directly or indirectly to related party contractors (not including actual incurred expense of the related party contractor) for the reporting period."]
[null,"For \"Value of Margins & Overheads\" reported expenditure is to COMPRISE ONLY the sum of overheads, profit margins or management fees paid directly or indirectly to related party contractors (not including actual incurred expenses of the related party contractor) for the reporting period. "]
[]
[null,{"$f":"CONCATENATE(dms_TradingName, \" is to specify each activity in this table in accordance with the definition in Appendix F of the RIN.\")","v":"United Energy is to specify each activity in this table in accordance with the definition in Appendix F of the RIN."}]
[null,"All activities must be reported but the Reason for Difference is only required if there is a 10 per cent difference between the expected value and the actual value.\n\nUse median unit costs. Where unit costs are not recorded at the asset category level - provide the best estimates of the unit cost using the cost allocation method identified in this table. (As a transitional measure, the unit cost may be based on a statistically significant annual sample of actual work orders at a 5% or better confidence interval.)\n\nProvide basis of allocation where applicable."]
[]
[null,"7.12.1 - SAFETY AND BUSHFIRE RELATED ASSET GROUP DEFINITIONS AND ALLOCATION BASIS"]
[null,"Activity","Definitions",null,null,null,"Basis for allocation of cost to activity"]
[null,"Planned non-preferred services replacements"]
[null,"Planned replacement of non-preferred services due to height "]
[null,"Removal of public lighting switchwire "]
[null,"Replacement of existing SWER lines with 22kV overhead bare conductor "]
[null,"Installation of GFN and associated equipment at zone substations "]
[null,"Replacement of crossarms/insulator sets – pole top fire mitigation"]
[null,"Replacement of crossarms – based on age and condition "]
[null,"Replacement of poles – based on age and condition "]
[null,"Stake poles – based on age and condition "]
[null,"Replacement of undersized poles "]
[null,"Stake undersized poles"]
[null,"Replacement of overhead conductor – mainly steel "]
[null,"Service line clearance – overhead services requiring relocation "]
[null,"Service line clearance – overhead services requiring undergrounding "]
[null,"Replacement of 22kV distribution feeders with ABC/underground cabling"]
[null,"Replacement of SWER with covered carbon core conductor or equivalent"]
[null,"Replacement of SWER with ABC"]
[null,"Replacement of SWER with underground"]
[null,"Replacement of surge diverters (neptune configuration)"]
[null,"Replacement of surge diverters (single phase or three phase)"]
[null,"Armour Rods and Vibration Dampers"]
[null,"SWER ACRS"]
[null,"Multicircuit Clearances (LBRA Survey)"]
[null,"Multicircuit Clearances (HBRA)"]
[]
[]
[]
[]
[]
[]
[]
[null,"To enter further activities - please copy row from above and \"insert copied cells\" into a row above this row. "]
[]
[]
[null,"7.12.2 - BUSHFIRE RELATED"]
[]
[null,"7.12.2.1 - NUMBER OF ACTIVITIES"]
[null,"Activity","Units","Number of Activities"]
[null,"Planned non-preferred services replacements","number of services"]
[null,"Planned replacement of non-preferred services due to height ","number of services"]
[null,"Removal of public lighting switchwire ","number of spans removed"]
[null,"Replacement of existing SWER lines with 22kV overhead bare conductor ","kms of SWER"]
[null,"Installation of GFN and associated equipment at zone substations ","number of zone substations"]
[null,"Replacement of crossarms/insulator sets – pole top fire mitigation","number of crossarms/sets"]
[null,"Replacement of crossarms – based on age and condition ","number of crossarms"]
[null,"Replacement of poles – based on age and condition ","number of poles"]
[null,"Stake poles – based on age and condition ","number of poles"]
[null,"Replacement of undersized poles ","number of poles"]
[null,"Stake undersized poles","number of poles"]
[null,"Replacement of overhead conductor – mainly steel ","kms "]
[null,"Service line clearance – overhead services requiring relocation ","number of services"]
[null,"Service line clearance – overhead services requiring undergrounding ","number of services"]
[null,"Replacement of 22kV distribution feeders with ABC/underground cabling","number of feeders"]
[null,"Replacement of SWER with covered carbon core conductor or equivalent","kms "]
[null,"Replacement of SWER with ABC","kms "]
[null,"Replacement of SWER with underground","kms "]
[null,"Replacement of surge diverters (neptune configuration)","number of units"]
[null,"Replacement of surge diverters (single phase or three phase)","number of units"]
[null,{"$f":"IF(ISBLANK(B39),\"\",B39)","v":"Armour Rods and Vibration Dampers"}]
[null,{"$f":"IF(ISBLANK(B40),\"\",B40)","v":"SWER ACRS"}]
[null,{"$f":"IF(ISBLANK(B41),\"\",B41)","v":"Multicircuit Clearances (LBRA Survey)"}]
[null,{"$f":"IF(ISBLANK(B42),\"\",B42)","v":"Multicircuit Clearances (HBRA)"}]
[null,{"$f":"IF(ISBLANK(B43),\"\",B43)","v":""}]
[null,{"$f":"IF(ISBLANK(B48),\"\",B48)","v":""}]
[null,{"$f":"IF(ISBLANK(B49),\"\",B49)","v":""}]
[null,"To enter further activities - please copy row from above and \"insert copied cells\" into a row above this row. "]
[]
[]
[null,"7.12.2.2 - EXPENDITURE "]
[null,"Activity","Units","Exclusive of \nMargins & Overheads","Value of \nMargins & Overheads"]
[null,null,null,"Actual Expenditure"]
[null,null,null,"$0's, Nominal"]
[null,"Planned non-preferred services replacements","number of services"]
[null,"Planned replacement of non-preferred services due to height ","number of services"]
[null,"Removal of public lighting switchwire ","number of spans removed"]
[null,"Replacement of existing SWER lines with 22kV overhead bare conductor ","kms of SWER"]
[null,"Installation of GFN and associated equipment at zone substations ","number of zone substations"]
[null,"Replacement of crossarms/insulator sets – pole top fire mitigation","number of crossarms/sets"]
[null,"Replacement of crossarms – based on age and condition ","number of crossarms"]
[null,"Replacement of poles – based on age and condition ","number of poles"]
[null,"Stake poles – based on age and condition ","number of poles"]
[null,"Replacement of undersized poles ","number of poles"]
[null,"Stake undersized poles","number of poles"]
[null,"Replacement of overhead conductor – mainly steel ","kms "]
[null,"Service line clearance – overhead services requiring relocation ","number of services"]
[null,"Service line clearance – overhead services requiring undergrounding ","number of services"]
[null,"Replacement of 22kV distribution feeders with ABC/underground cabling","number of feeders"]
[null,"Replacement of SWER with covered carbon core conductor or equivalent","kms "]
[null,"Replacement of SWER with ABC","kms "]
[null,"Replacement of SWER with underground","kms "]
[null,"Replacement of surge diverters (neptune configuration)","number of units"]
[null,"Replacement of surge diverters (single phase or three phase)","number of units"]
[null,{"$f":"IF(ISBLANK(B39),\"\",B39)","v":"Armour Rods and Vibration Dampers"},"number of units"]
[null,{"$f":"IF(ISBLANK(B40),\"\",B40)","v":"SWER ACRS"},"number of units"]
[null,{"$f":"IF(ISBLANK(B41),\"\",B41)","v":"Multicircuit Clearances (LBRA Survey)"},"kms "]
[null,{"$f":"IF(ISBLANK(B42),\"\",B42)","v":"Multicircuit Clearances (HBRA)"},"number of units"]
[null,{"$f":"IF(ISBLANK(B43),\"\",B43)","v":""},{"$f":"IF(ISBLANK(C81),\"\",C81)","v":""}]
[null,{"$f":"IF(ISBLANK(B48),\"\",B48)","v":""},{"$f":"IF(ISBLANK(C82),\"\",C82)","v":""}]
[null,{"$f":"IF(ISBLANK(B49),\"\",B49)","v":""},{"$f":"IF(ISBLANK(C83),\"\",C83)","v":""}]
[null,"To enter further activities - please copy row from above and \"insert copied cells\" into a row above this row. "]
[]
[]
[null,"7.12.2.3 - UNIT COSTS"]
[null,"Activity",null,"Actual"]
[null,null,null,"$0's, Per Unit"]
[null,"Planned non-preferred services replacements"]
[null,"Planned replacement of non-preferred services due to height "]
[null,"Removal of public lighting switchwire "]
[null,"Replacement of existing SWER lines with 22kV overhead bare conductor "]
[null,"Installation of GFN and associated equipment at zone substations "]
[null,"Replacement of crossarms/insulator sets – pole top fire mitigation"]
[null,"Replacement of crossarms – based on age and condition "]
[null,"Replacement of poles – based on age and condition "]
[null,"Stake poles – based on age and condition "]
[null,"Replacement of undersized poles "]
[null,"Stake undersized poles"]
[null,"Replacement of overhead conductor – mainly steel "]
[null,"Service line clearance – overhead services requiring relocation "]
[null,"Service line clearance – overhead services requiring undergrounding "]
[null,"Replacement of 22kV distribution feeders with ABC/underground cabling"]
[null,"Replacement of SWER with covered carbon core conductor or equivalent"]
[null,"Replacement of SWER with ABC"]
[null,"Replacement of SWER with underground"]
[null,"Replacement of surge diverters (neptune configuration)"]
[null,"Replacement of surge diverters (single phase or three phase)"]
[null,{"$f":"IF(ISBLANK(B39),\"\",B39)","v":"Armour Rods and Vibration Dampers"}]
[null,{"$f":"IF(ISBLANK(B40),\"\",B40)","v":"SWER ACRS"}]
[null,{"$f":"IF(ISBLANK(B41),\"\",B41)","v":"Multicircuit Clearances (LBRA Survey)"}]
[null,{"$f":"IF(ISBLANK(B42),\"\",B42)","v":"Multicircuit Clearances (HBRA)"}]
[null,{"$f":"IF(ISBLANK(B43),\"\",B43)","v":""}]
[null,{"$f":"IF(ISBLANK(B48),\"\",B48)","v":""}]
[null,{"$f":"IF(ISBLANK(B49),\"\",B49)","v":""}]
[null,"To enter further activities - please copy row from above and \"insert copied cells\" into a row above this row. "]
[]
[]
[null,"7.12.2.4 - CONTINGENT PROJECT APPLICATIONS - VOLUMES APPROVED"]
[null,"Activity","Units","Volume approved under contingent project applications ","Actual volumes","Difference"]
[null,null,null,null,null,{"$f":"E156-D156","v":0}]
[null,null,null,null,null,0]
[null,null,null,null,null,0]
[null,null,null,null,null,0]
[null,null,null,null,null,0]
[null,null,null,null,null,0]
[null,null,null,null,null,0]
[null,null,null,null,null,0]
[null,"To enter further activities - please copy row from above and \"insert copied cells\" into a row above this row. "]
[]
[null,"7.12.2.5 - CONTINGENT PROJECT APPLICATIONS - EXPENDITURE APPROVED"]
[null,"Activity","Exclusive of \nMargins & Overheads","Value of \nMargins & Overheads"]
[null,null,"Actual Expenditure"]
[null,null,"$0's, Nominal"]
[]
[]
[]
[]
[]
[]
[]
[]
[null,"To enter further activities - please copy row from above and \"insert copied cells\" into a row above this row. "]
[]
[]
[]
[null,"7.12.3 - SAFETY RELATED"]
[]
[null,"7.12.3.1 - NUMBER OF ACTIVITIES"]
[null,"Activity","Units","Number of Activities"]
[null,"Planned non-preferred services replacements","number of services"]
[null,"Planned replacement of non-preferred services due to height ","number of services"]
[null,"Removal of public lighting switchwire ","number of spans removed"]
[null,"Replacement of existing SWER lines with 22kV overhead bare conductor ","kms of SWER"]
[null,"Installation of GFN and associated equipment at zone substations ","number of zone substations"]
[null,"Replacement of crossarms/insulator sets – pole top fire mitigation","number of crossarms/sets"]
[null,"Replacement of crossarms – based on age and condition ","number of crossarms"]
[null,"Replacement of poles – based on age and condition ","number of poles"]
[null,"Stake poles – based on age and condition ","number of poles"]
[null,"Replacement of undersized poles ","number of poles"]
[null,"Stake undersized poles","number of poles"]
[null,"Replacement of overhead conductor – mainly steel ","kms "]
[null,"Service line clearance – overhead services requiring relocation ","number of services"]
[null,"Service line clearance – overhead services requiring undergrounding ","number of services"]
[null,"Replacement of 22kV distribution feeders with ABC/underground cabling","number of feeders"]
[null,"Replacement of SWER with covered carbon core conductor or equivalent","kms "]
[null,"Replacement of SWER with ABC","kms "]
[null,"Replacement of SWER with underground","kms "]
[null,"Replacement of surge diverters (neptune configuration)","number of units"]
[null,"Replacement of surge diverters (single phase or three phase)","number of units"]
[null,{"$f":"IF(ISBLANK(B39),\"\",B39)","v":"Armour Rods and Vibration Dampers"},"number of units"]
[null,{"$f":"IF(ISBLANK(B40),\"\",B40)","v":"SWER ACRS"},"number of units"]
[null,{"$f":"IF(ISBLANK(B41),\"\",B41)","v":"Multicircuit Clearances (LBRA Survey)"},"kms "]
[null,{"$f":"IF(ISBLANK(B42),\"\",B42)","v":"Multicircuit Clearances (HBRA)"},"number of units"]
[null,{"$f":"IF(ISBLANK(B43),\"\",B43)","v":""},{"$f":"IF(ISBLANK(C81),\"\",C81)","v":""}]
[null,{"$f":"IF(ISBLANK(B48),\"\",B48)","v":""},{"$f":"IF(ISBLANK(C82),\"\",C82)","v":""}]
[null,{"$f":"IF(ISBLANK(B49),\"\",B49)","v":""},{"$f":"IF(ISBLANK(C83),\"\",C83)","v":""}]
[null,"To enter further activities - please copy row from above and \"insert copied cells\" into a row above this row. "]
[]
[]
[null,"7.12.3.2 - EXPENDITURE"]
[null,"Activity","Units","Exclusive of \nMargins & Overheads","Value of \nMargins & Overheads"]
[null,null,null,"Actual Expenditure"]
[null,null,null,"$0's, Nominal"]
[null,"Planned non-preferred services replacements","number of services"]
[null,"Planned replacement of non-preferred services due to height ","number of services"]
[null,"Removal of public lighting switchwire ","number of spans removed"]
[null,"Replacement of existing SWER lines with 22kV overhead bare conductor ","kms of SWER"]
[null,"Installation of GFN and associated equipment at zone substations ","number of zone substations"]
[null,"Replacement of crossarms/insulator sets – pole top fire mitigation","number of crossarms/sets"]
[null,"Replacement of crossarms – based on age and condition ","number of crossarms"]
[null,"Replacement of poles – based on age and condition ","number of poles"]
[null,"Stake poles – based on age and condition ","number of poles"]
[null,"Replacement of undersized poles ","number of poles"]
[null,"Stake undersized poles","number of poles"]
[null,"Replacement of overhead conductor – mainly steel ","kms "]
[null,"Service line clearance – overhead services requiring relocation ","number of services"]
[null,"Service line clearance – overhead services requiring undergrounding ","number of services"]
[null,"Replacement of 22kV distribution feeders with ABC/underground cabling","number of feeders"]
[null,"Replacement of SWER with covered carbon core conductor or equivalent","kms "]
[null,"Replacement of SWER with ABC","kms "]
[null,"Replacement of SWER with underground","kms "]
[null,"Replacement of surge diverters (neptune configuration)","number of units"]
[null,"Replacement of surge diverters (single phase or three phase)","number of units"]
[null,{"$f":"IF(ISBLANK(B39),\"\",B39)","v":"Armour Rods and Vibration Dampers"},"number of units"]
[null,{"$f":"IF(ISBLANK(B40),\"\",B40)","v":"SWER ACRS"},"number of units"]
[null,{"$f":"IF(ISBLANK(B41),\"\",B41)","v":"Multicircuit Clearances (LBRA Survey)"},"kms "]
[null,{"$f":"IF(ISBLANK(B42),\"\",B42)","v":"Multicircuit Clearances (HBRA)"},"number of units"]
[null,{"$f":"IF(ISBLANK(B43),\"\",B43)","v":""},{"$f":"IF(ISBLANK(C81),\"\",C81)","v":""}]
[null,{"$f":"IF(ISBLANK(B48),\"\",B48)","v":""},{"$f":"IF(ISBLANK(C82),\"\",C82)","v":""}]
[null,{"$f":"IF(ISBLANK(B49),\"\",B49)","v":""},{"$f":"IF(ISBLANK(C83),\"\",C83)","v":""}]
[null,"To enter further activities - please copy row from above and \"insert copied cells\" into a row above this row. "]
[]
[]
[null,"7.12.3.3 - UNIT COSTS"]
[null,"Activity","Units","Actual"]
[null,null,null,"$0's, Per Unit"]
[null,"Planned non-preferred services replacements","number of services"]
[null,"Planned replacement of non-preferred services due to height ","number of services"]
[null,"Removal of public lighting switchwire ","number of spans removed"]
[null,"Replacement of  existing SWER lines with 22kV overhead bare conductor ","kms of SWER"]
[null,"Installation of GFN and associated equipment at zone substations ","number of zone substations"]
[null,"Replacement of crossarms/insulator sets – pole top fire mitigation","number of crossarms/sets"]
[null,"Replacement of crossarms – based on age and condition ","number of crossarms"]
[null,"Replacement of poles – based on age and condition ","number of poles"]
[null,"Stake poles – based on age and condition ","number of poles"]
[null,"Replacement of undersized poles ","number of poles"]
[null,"Stake undersized poles","number of poles"]
[null,"Replacement of overhead conductor – mainly steel ","kms "]
[null,"Service line clearance – overhead services requiring relocation ","number of services"]
[null,"Service line clearance – overhead services requiring undergrounding ","number of services"]
[null,"Replacement of 22kV distribution feeders with ABC/underground cabling","number of feeders"]
[null,"Replacement of SWER with covered carbon core conductor or equivalent","kms "]
[null,"Replacement of SWER with ABC","kms "]
[null,"Replacement of SWER with underground","kms "]
[null,"Replacement of surge diverters (neptune configuration)","number of units"]
[null,"Replacement of surge diverters (single phase or three phase)","number of units"]
[null,{"$f":"IF(ISBLANK(B39),\"\",B39)","v":"Armour Rods and Vibration Dampers"},"number of units"]
[null,{"$f":"IF(ISBLANK(B40),\"\",B40)","v":"SWER ACRS"},"number of units"]
[null,{"$f":"IF(ISBLANK(B41),\"\",B41)","v":"Multicircuit Clearances (LBRA Survey)"},"kms "]
[null,{"$f":"IF(ISBLANK(B42),\"\",B42)","v":"Multicircuit Clearances (HBRA)"},"number of units"]
[null,{"$f":"IF(ISBLANK(B43),\"\",B43)","v":""},{"$f":"IF(ISBLANK(C81),\"\",C81)","v":""}]
[null,{"$f":"IF(ISBLANK(B48),\"\",B48)","v":""},{"$f":"IF(ISBLANK(C82),\"\",C82)","v":""}]
[null,{"$f":"IF(ISBLANK(B49),\"\",B49)","v":""},{"$f":"IF(ISBLANK(C83),\"\",C83)","v":""}]
[null,"To enter further activities - please copy row from above and \"insert copied cells\" into a row above this row. "]
[]
[]
[null,"7.12.4 - SAFETY IMPROVEMENT OUTCOMES REPORTED TO ESV"]
[null,"Activity","Units","Safety Improvement Programme - outcomes","Safety Improvement Target","Difference","Reasons for Difference"]
[null,"Planned non-preferred services replacements","number of services",null,null,{"$f":"D285-E285","v":0}]
[null,"Planned replacement of non-preferred services due to height ","number of services",null,null,0]
[null,"Removal of public lighting switchwire ","number of spans removed",null,null,0]
[null,"Replacement of  existing SWER lines with 22kV overhead bare conductor ","kms of SWER",null,null,0]
[null,"Installation of GFN and associated equipment at zone substations ","number of zone substations",null,null,0]
[null,"Replacement of crossarms/insulator sets – pole top fire mitigation","number of crossarms/sets",null,null,0]
[null,"Replacement of crossarms – based on age and condition ","number of crossarms",null,null,0]
[null,"Replacement of poles – based on age and condition ","number of poles",null,null,0]
[null,"Stake poles – based on age and condition ","number of poles",null,null,0]
[null,"Replacement of undersized poles ","number of poles",null,null,0]
[null,"Stake undersized poles","number of poles",null,null,0]
[null,"Replacement of overhead conductor – mainly steel ","kms ",null,null,0]
[null,"Service line clearance – overhead services requiring relocation ","number of services",null,null,0]
[null,"Service line clearance – overhead services requiring undergrounding ","number of services",null,null,0]
[null,"Replacement of 22kV distribution feeders with ABC/underground cabling","number of feeders",null,null,0]
[null,"Replacement of SWER with covered carbon core conductor or equivalent","kms ",null,null,0]
[null,"Replacement of SWER with ABC","kms ",null,null,0]
[null,"Replacement of SWER with underground","kms ",null,null,0]
[null,"Replacement of surge diverters (neptune configuration)","number of units",null,null,0]
[null,"Replacement of surge diverters (single phase or three phase)","number of units",null,null,0]
[null,{"$f":"IF(ISBLANK(B39),\"\",B39)","v":"Armour Rods and Vibration Dampers"},"number of units",null,null,0]
[null,{"$f":"IF(ISBLANK(B40),\"\",B40)","v":"SWER ACRS"},"number of units",null,null,0]
[null,{"$f":"IF(ISBLANK(B41),\"\",B41)","v":"Multicircuit Clearances (LBRA Survey)"},"kms ",null,null,0]
[null,{"$f":"IF(ISBLANK(B42),\"\",B42)","v":"Multicircuit Clearances (HBRA)"},"number of units",null,null,0]
[null,{"$f":"IF(ISBLANK(B43),\"\",B43)","v":""},{"$f":"IF(ISBLANK(C81),\"\",C81)","v":""},null,null,0]
[null,{"$f":"IF(ISBLANK(B48),\"\",B48)","v":""},{"$f":"IF(ISBLANK(C82),\"\",C82)","v":""},null,null,0]
[null,{"$f":"IF(ISBLANK(B49),\"\",B49)","v":""},{"$f":"IF(ISBLANK(C83),\"\",C83)","v":""},null,null,0]
[null,"To enter further activities - please copy row from above and \"insert copied cells\" into a row above this row. "]
[]
[null,"7.12.5 - RECONCILIATION OF VOLUME OF OUTCOMES REPORTED TO ESV AND AER"]
[null,"Activity","Units","Difference","Reasons for Difference"]
[null,"Planned non-preferred services replacements","number of services",{"$f":"D285-D57-D186","v":0}]
[null,"Planned replacement of non-preferred services due to height ","number of services",0]
[null,"Removal of public lighting switchwire ","number of spans removed",0]
[null,"Replacement of  existing SWER lines with 22kV overhead bare conductor ","kms of SWER",0]
[null,"Installation of GFN and associated equipment at zone substations ","number of zone substations",0]
[null,"Replacement of crossarms/insulator sets – pole top fire mitigation","number of crossarms/sets",0]
[null,"Replacement of crossarms – based on age and condition ","number of crossarms",0]
[null,"Replacement of poles – based on age and condition ","number of poles",0]
[null,"Stake poles – based on age and condition ","number of poles",0]
[null,"Replacement of undersized poles ","number of poles",0]
[null,"Stake undersized poles","number of poles",0]
[null,"Replacement of overhead conductor – mainly steel ","kms ",0]
[null,"Service line clearance – overhead services requiring relocation ","number of services",0]
[null,"Service line clearance – overhead services requiring undergrounding ","number of services",0]
[null,"Replacement of 22kV distribution feeders with ABC/underground cabling","number of feeders",0]
[null,"Replacement of SWER with covered carbon core conductor or equivalent","kms ",0]
[null,"Replacement of SWER with ABC","kms ",0]
[null,"Replacement of SWER with underground","kms ",0]
[null,"Replacement of surge diverters (neptune configuration)","number of units",0]
[null,"Replacement of surge diverters (single phase or three phase)","number of units",0]
[null,{"$f":"IF(ISBLANK(B39),\"\",B39)","v":"Armour Rods and Vibration Dampers"},"number of units",0]
[null,{"$f":"IF(ISBLANK(B40),\"\",B40)","v":"SWER ACRS"},"number of units",0]
[null,{"$f":"IF(ISBLANK(B41),\"\",B41)","v":"Multicircuit Clearances (LBRA Survey)"},"kms ",0]
[null,{"$f":"IF(ISBLANK(B42),\"\",B42)","v":"Multicircuit Clearances (HBRA)"},"number of units",0]
[null,{"$f":"IF(ISBLANK(B43),\"\",B43)","v":""},{"$f":"IF(ISBLANK(C81),\"\",C81)","v":""},0]
[null,{"$f":"IF(ISBLANK(B48),\"\",B48)","v":""},{"$f":"IF(ISBLANK(C82),\"\",C82)","v":""},0]
[null,{"$f":"IF(ISBLANK(B49),\"\",B49)","v":""},{"$f":"IF(ISBLANK(C83),\"\",C83)","v":""},0]
[null,"To enter further activities - please copy row from above and \"insert copied cells\" into a row above this row. "]

{"sheet":"7.13 TARC","index":18,"n_rows":9,"n_cols":3,"rows_kept":9,"cut":false,"hidden":false,"merged":[]}
[null,{"$f":"(LOOKUP(dms_Model,dms_Model_List,dms_Worksheet_List))","v":"ANNUAL REPORTING STATEMENT"}]
[null,{"$f":"dms_TradingName","v":"United Energy"}]
[null,{"$f":"CONCATENATE(\"Annual Reporting RIN Response \",CRY)","v":"Annual Reporting RIN Response 2017"}]
[null,"7.13 - TARC"]
[]
[]
[null,"7.13.1 - TOTAL ANNUAL RETAILER CHARGES"]
[null,null,"$0's"]
[null,"TARC",584697245]

{"sheet":"8.1 Income","index":19,"n_rows":39,"n_cols":12,"rows_kept":39,"cut":false,"hidden":false,"merged":[[6,6,6,10],[7,8,7,10],[6,11,8,11],[9,2,9,11],[6,5,8,5],[7,6,7,7],[6,2,8,2],[6,3,8,3],[6,4,8,4]]}
[null,{"$f":"(LOOKUP(dms_Model,dms_Model_List,dms_Worksheet_List))","v":"ANNUAL REPORTING STATEMENT"}]
[null,{"$f":"dms_TradingName","v":"United Energy"}]
[null,{"$f":"CONCATENATE(\"Annual Reporting RIN Response \",CRY)","v":"Annual Reporting RIN Response 2017"}]
[null,"8.1 - INCOME"]
[]
[null,"8.1.1 - INCOME STATEMENT"]
[null,null,"Audited Statutory Accounts","Adjustments","Distribution business","Standard Control Services","Alternative Control Services",null,null,null,null,"Negotiated Services"]
[null,null,null,null,null,null,"Public Lighting",null,"Other"]
[null,null,null,null,null,null,{"$f":"IF(dms_Jurisdiction=\"Vic\",\"Energy efficient\",\"\")","v":"Energy efficient"},{"$f":"IF(dms_Jurisdiction=\"Vic\",\"Non-energy efficient\",\"\")","v":"Non-energy efficient"},"Connection services","Metering services","Ancillary network services"]
[null,null,"$0's, nominal"]
[null,"8.1.1.1 - REVENUE"]
[null,"Distribution revenue",396999969,5138687,402138656,402138656]
[null,"Cross boundary revenue",null,null,"--"]
[null,"Contributions",46783375,-46783375,"--"]
[null,"Interest Income",694871,-694871,"--"]
[null,"Jurisdictional scheme amounts",13521848,-13521848,"--"]
[null,"Profit from sale of fixed assets",null,null,"--"]
[null,"TUOS revenue",107044739,-107044739,"--"]
[null,"Pass through revenue (F-factor)",null,null,"--"]
[null,"Other Revenue",76128990,-13126070,63002920,2711255,1436340,4131033,7658945,42579408,3475020,1010918]
[null,"Total revenue",{"$f":"SUM(C12:C20)","v":641173792},-176032216,465141576,404849911,1436340,4131033,7658945,42579408,3475020,1010918]
[]
[null,"8.1.1.2 - EXPENDITURE"]
[null,"TUOS expenditure",106892516,-106892516,"--"]
[null,"Avoided TUOS expenditure",152223,-152223,"--"]
[null,"Cross boundary expenditure",null,null,"--"]
[null,"Depreciation",141304898,9071859,150376757,120908569,354941,1020840,null,28092406]
[null,"Finance charges",118929240,-38993836,79935403,72689283,173610,499318,null,6573192]
[null,"Impairment losses",null,null,"--"]
[null,"Jurisdictional scheme amounts",13521848,-13521848,"--"]
[null,"Loss from sale of fixed assets",2250603,null,2250603,2250603,null,"--"]
[null,"Maintenance expenditure",47759034,{"$f":"E32-C32","v":3015049.9499999061},{"$f":"'[1]8.1 Income'!$E$36","v":50774083.949999906},{"$f":"'[1]8.1 Income'!$F$36","v":45300108.268992677},635816,1828659,1084,"--",3008416,"--"]
[null,"Operating expenditure excluding maintenance expenditure",94808620,5178971,99987591,87729868,"--","--",6188789,5999112,69822,"--"]
[null,"Other",206800,"(206800)","--"]
[]
[null,"8.1.1.3 - PROFIT"]
[null,"Profit before tax (PBT)",{"$f":"C21-SUM(C24:C34)","v":115348010},-33737672.949999899,81817138.050000072,75971479.731007338,271973,782216,1469072,1914698,396782,1010918]
[null,"Income tax expenses (/ benefit)",35976180,{"$f":"D37/C37*dms_080101_03_audited_Values","v":-10522527.391936172},{"$f":"dms_080101_03_audited_Values+dms_080101_03_adjust_Values","v":25453652.608063828},{"$f":"F37/$E$37*dms_080101_03_dnsp_Values","v":23635043.944116808},84611.933706876196,243350.65736840741,457034.42133825057,595670.52701808058,123440.53372975167,314500.80264985078]
[null,"Profit after tax",{"$f":"C37-C38","v":79371830},-23215145.558063727,56363485.44193624,52336435.786890529,187361.06629312382,538865.34263159265,1012037.5786617494,1319027.4729819195,273341.46627024835,696417.19735014928]

{"sheet":"8.2 Capex","index":20,"n_rows":248,"n_cols":10,"rows_kept":248,"cut":false,"hidden":false,"merged":[[140,2,140,3],[196,2,196,3],[6,1,6,4],[41,1,41,4],[10,1,10,4],[7,1,7,4],[8,1,8,4],[14,1,14,4],[16,2,16,9],[17,2,18,2],[17,3,18,3],[17,4,18,4],[17,5,18,5],[17,6,17,9],[19,2,19,3],[19,5,19,9],[43,2,43,5],[44,2,44,5],[55,2,55,5],[56,2,56,5],[50,2,50,5],[51,2,51,5],[49,2,49,5],[45,2,45,5],[46,2,46,5],[47,2,47,5],[81,1,81,2],[58,2,58,5],[63,3,64,3],[63,5,64,5],[65,5,65,9],[65,2,65,3],[57,2,57,5],[63,4,64,4],[48,2,48,5],[63,2,64,2],[52,2,52,5],[53,2,53,5],[54,2,54,5],[62,2,62,9],[63,6,63,9]]}
[null,{"$f":"(LOOKUP(dms_Model,dms_Model_List,dms_Worksheet_List))","v":"ANNUAL REPORTING STATEMENT"}]
[null,{"$f":"dms_TradingName","v":"United Energy"}]
[null,{"$f":"CONCATENATE(\"Annual Reporting RIN Response \",CRY)","v":"Annual Reporting RIN Response 2017"}]
[null,"8.2 - CAPEX"]
[]
[null,"Instructions"]
[null,"Reported expenditure must EXCLUDE capital contributions (except tables 8.2.1 and 8.2.5 which should include all capital contributions)."]
[null,{"$f":"CONCATENATE(\"Forecast expenditure is to be taken from \",dms_TradingName,\"'s \",dms_DeterminationRef,\".\")","v":"Forecast expenditure is to be taken from United Energy's 2016-20 Distribution Determination."}]
[null,"If allocating based on assumptions then provide method in Basis of Preparation. All adjustments must be explained in Basis of Preparation with supporting documentation attached. "]
[]
[null,"For tables 8.2.1 and 8.2.3:\nReported expenditure must INCLUDE any profit margins or management fees paid directly or indirectly to related party contractors (not including actual incurred expenses of the related party contractor) for the regulatory reporting period.\n\n'Related Party Margin Expenditure' must COMPRISE ONLY profit margins or management fees paid directly or indirectly to related party contractors (not including actual incurred expenses of the related party contractor) for the regulatory reporting period."]
[]
[null,"8.2.1 - CAPEX BY PURPOSE - STANDARD CONTROL SERVICES"]
[]
[null,"Each line item in this table must INCLUDE the capital contributions. Total capital contributions should also be identified in the last item in the table. "]
[]
[null,null,"EXPENDITURE"]
[null,null,"CPI adjusted Forecast","Actual","Difference","Related Party Margin","Voltage level"]
[null,null,null,null,null,null,"Subtransmission","HV","LV","Other "]
[null,"Description","$0's, nominal",null," (%)","$0's, nominal"]
[null,"AUGMENTATION",31581766,{"$f":"SUM(G21:J21)","v":24611211},{"$f":"IF(C21=0,1,(D21-C21)/C21*1)","v":-0.22071454142241445},null,8749513,13740943,13271,2107484]
[null,"CONNECTION",65008915,66669237,2.5539912487387306E-2,null,19038,25410686,40253490,986023]
[null,"REPLACEMENT",95329874,71247467.549999997,-0.25262182188555082,null,10072035,34571336,21320112,{"$f":"'[2]RIN Tab 8.2'!$I$15","v":5283984.55}]
[null,"NON NETWORK IT",42971956,26340807,-0.38702331818453878,null,0,0,0,26340807]
[null,"NON NETWORK OTHER",3869364,3102135,-0.19828297363597738,null,0,45650,0,3056485]
[null,null,null,0,1]
[null,null,null,0,1]
[null,null,null,0,1]
[null,null,null,0,1]
[null,null,null,0,1]
[null,null,null,0,1]
[null,null,null,0,1]
[null,null,null,0,1]
[null,null,null,0,1]
[null,null,null,0,1]
[null,"Capital contributions included in the above",null,40922868,1,null,null,16788568,23344878,789422]
[null,"Total",{"$f":"SUM(C21:C35)","v":238761875},{"$f":"SUM(D21:D35)","v":191970857.55000001},-0.19597357178569647,{"$f":"SUM(F21:F35)","v":0},{"$f":"SUM(G21:G35)","v":18840586},{"$f":"SUM(H21:H35)","v":73768615},{"$f":"SUM(I21:I35)","v":61586873},{"$f":"SUM(J21:J35)","v":37774783.549999997}]
[]
[]
[null,"8.2.2 - CAPEX BY PURPOSE - MATERIAL DIFFERENCE EXPLANATION"]
[]
[null,"Where the difference between forecast and actual expenditure shown in table 8.2.1 is a Material Difference please explain the main factors driving the difference."]
[]
[null,"Description","Reason for material difference"]
[null,"AUGMENTATION","Reduced scope for distribution substation and low voltage circuit upgrade works has been driven largely by substitution of capex to opex for demand management activities by United EnergyÃ\u0083Â\u0083Ã\u0082Â\u0083Ã\u0083Â\u0082Ã\u0082Â\u0083Ã\u0083Â\u0083Ã\u0082Â\u0082Ã\u0083Â\u0082Ã\u0082Â\u0083Ã\u0083Â\u0083Ã\u0082Â\u0083Ã\u0083Â\u0082Ã\u0082Â\u0082Ã\u0083Â\u0083Ã\u0082Â\u0082Ã\u0083Â\u0082Ã\u0082Â¢Ã\u0083Â\u0083Ã\u0082Â\u0083Ã\u0083Â\u0082Ã\u0082Â\u0083Ã\u0083Â\u0083Ã\u0082Â\u0082Ã\u0083Â\u0082Ã\u0082Â\u0082Ã\u0083Â\u0083Ã\u0082Â\u0083Ã\u0083Â\u0082Ã\u0082Â\u0082Ã\u0083Â\u0083Ã\u0082Â\u0082Ã\u0083Â\u0082Ã\u0082Â\u0080Ã\u0083Â\u0083Ã\u0082Â\u0083Ã\u0083Â\u0082Ã\u0082Â\u0083Ã\u0083Â\u0083Ã\u0082Â\u0082Ã\u0083Â\u0082Ã\u0082Â\u0082Ã\u0083Â\u0083Ã\u0082Â\u0083Ã\u0083Â\u0082Ã\u0082Â\u0082Ã\u0083Â\u0083Ã\u0082Â\u0082Ã\u0083Â\u0082Ã\u0082Â\u0099s Summer Saver programme.  Deferral of planned expenditure"]
[null,"CONNECTION","Marginal underspend in business supply projects offset against overspend in new housing estates and recoverable works. Net effect is only 3% difference between actual and allowance."]
[null,"REPLACEMENT","Reduced expenditure driven predominantly by a reduction in expenditure for pole top structures with the substation for OPEX via increased asset inspection and assessment. Furthermore deferral of transformer and switchgear replacement achieved through inc"]
[null,"NON NETWORK IT","IT Capex underspend due to reduced scope for Power of Choice program and Asset Management projects. Also Webmethods Refresh and Works Planning projects put on hold."]
[null,"NON NETWORK OTHER","Predominately due to fleet purchases being below forecast due to delays in ordering on new fleet and an increase in the level of refurbishment of existing fleet."]
[]
[]
[]
[]
[]
[]
[]
[]
[]
[]
[]
[]
[null,"8.2.3 - CAPEX OTHER"]
[null,null,"EXPENDITURE"]
[null,null,"CPI adjusted Forecast","Actual","Difference","Related Party Margin","Voltage level"]
[null,null,null,null,null,null,"Subtransmission","HV","LV","Other "]
[null,null,"$0's, nominal",null," (%)","$0's, nominal"]
[null,"Public lighting"]
[null,{"$f":"IF(dms_Jurisdiction=\"Vic\",\"Energy Efficient\", \"Total\")","v":"Energy Efficient"},2079971,{"$f":"SUM(G68:J68)","v":544925},{"$f":"IF(C68=0,1,((D68-C68)/C68)*1)","v":-0.73801317422214063},null,0,0,0,544925]
[null,{"$f":"IF(dms_Jurisdiction=\"Vic\",\"Non-energy efficient\", \"\")","v":"Non-energy efficient"},null,{"$f":"SUM(G69:J69)","v":1189979},{"$f":"IF(C69=0,1,((D69-C69)/C69)*1)","v":1},null,0,0,0,1189979]
[null,"Alternative Control Services"]
[null,"Connection services",null,{"$f":"SUM(G71:J71)","v":0},{"$f":"IF(C71=0,1,((D71-C71)/C71)*1)","v":1}]
[null,"Metering services",null,{"$f":"SUM(G72:J72)","v":0},{"$f":"IF(C72=0,1,((D72-C72)/C72)*1)","v":1}]
[null,"Ancillary network services",null,{"$f":"SUM(G73:J73)","v":0},{"$f":"IF(C73=0,1,((D73-C73)/C73)*1)","v":1}]
[null,"Negotiated Services"]
[null,"Negotiated services",null,{"$f":"SUM(G75:J75)","v":0},{"$f":"IF(C75=0,1,((D75-C75)/C75)*1)","v":1}]
[null,"Total",{"$f":"SUM(C68:C69,C71:C73,C75)","v":2079971},{"$f":"SUM(D68:D69,D71:D73,D75)","v":1734904},{"$f":"IF(C76=0,1,((D76-C76)/C76)*1)","v":-0.16589990918142608},null,{"$f":"SUM(G68:G69,G71:G73,G75)","v":0},{"$f":"SUM(H68:H69,H71:H73,H75)","v":0},{"$f":"SUM(I68:I69,I71:I73,I75)","v":0},{"$f":"SUM(J68:J69,J71:J73,J75)","v":1734904}]
[]
[]
[]
[null,"8.2.4 - CAPEX BY ASSET CLASS"]
[]
[null,{"$f":"CONCATENATE(dms_TradingName, \" to enter in Table 8.2.4 each Asset Class specified in its current determination as listed in the AER's final decision in its Roll Forward Model and Post-tax Revenue Model and enter information against that Asset Class.\")","v":"United Energy to enter in Table 8.2.4 each Asset Class specified in its current determination as listed in the AER's final decision in its Roll Forward Model and Post-tax Revenue Model and enter information against that Asset Class."}]
[]
[null,null,"CPI adjusted Forecast","Actual ","Difference","Movements in provisions \nallocated to \nas-incurred capex"]
[null,"Asset class","$0's, nominal",null," (%)","$0's, nominal"]
[null,"Subtransmission",30569164,18840586,{"$f":"IF(C86=0,1,((D86-C86)/C86)*1)","v":-0.38367349529087547},185251]
[null,"Distribution system assets",155560986,{"$f":"'[2]RIN Tab 8.2'!$C$75","v":92861309.380000025},-0.40305527904020855,942709]
[null,"SCADA",5790406,9903152,0.71026902085967725,97373]
[null,"Non network - IT",42971956,26340807,-0.38702331818453878,258997]
[null,"Non network - other",3869364,3102135,-0.19828297363597738,30502]
[null,"Neutral Screen Services",null,null,1]
[null,"Distribution Transformers upgrades",null,null,1]
[null,"Metering - Non AMI",null,null,1]
[null,"Equity raising costs",null,null,1]
[null,"AMI",null,null,1]
[null,"Public lighting",null,null,1]
[null,"Alternative control -other",null,null,1]
[null,"Negotiated services",null,null,1]
[null,"Unregulated services",null,null,1]
[null,null,null,null,1]
[null,null,null,null,1]
[null,null,null,null,1]
[null,null,null,null,1]
[null,null,null,null,1]
[null,null,null,null,1]
[null,null,null,null,1]
[null,null,null,null,1]
[null,null,null,null,1]
[null,null,null,null,1]
[null,null,null,null,1]
[null,null,null,null,1]
[null,null,null,null,1]
[null,null,null,null,1]
[null,null,null,null,1]
[null,null,null,null,1]
[null,null,null,null,1]
[null,null,null,null,1]
[null,null,null,null,{"$f":"IF(C118=0,1,((D118-C118)/C118)*1)","v":1}]
[null,null,null,null,1]
[null,null,null,null,1]
[null,null,null,null,1]
[null,null,null,null,1]
[null,null,null,null,1]
[null,null,null,null,1]
[null,null,null,null,1]
[null,null,null,null,1]
[null,null,null,null,1]
[null,null,null,null,1]
[null,null,null,null,1]
[null,null,null,null,1]
[null,null,null,null,1]
[null,null,null,null,1]
[null,null,null,null,1]
[null,null,null,null,1]
[null,null,null,null,1]
[null,"Total",{"$f":"SUM(C86:C135)","v":238761876},{"$f":"SUM(D86:D135)","v":151047989.38000003},-0.36736973293005948,{"$f":"SUM(F86:F135)","v":1514832}]
[]
[]
[null,"8.2.5 - CAPITAL CONTRIBUTIONS BY ASSET CLASS"]
[null,null,"CPI Adjusted Forecast","Actual","Difference"]
[null,"Asset class","$0's, nominal",null," (%)"]
[null,"Subtransmission",null,null,{"$f":"IF(C142=0,1,((D142-C142)/C142)*1)","v":1}]
[null,"Distribution system assets",28093044,40922868,0.45669041774184388]
[null,"SCADA/Network control",null,null,1]
[null,"Non network - IT",null,null,1]
[null,"Non network - other",null,null,1]
[null,"Neutral Screen Services",null,null,1]
[null,"Distribution Transformers upgrades",null,null,1]
[null,"Metering - Non AMI",null,null,1]
[null,"Equity raising costs",null,null,1]
[null,"AMI",null,null,1]
[null,"Public lighting",null,null,1]
[null,"Alternative control -other",null,null,1]
[null,"Negotiated services",null,null,1]
[null,"Unregulated services",null,null,1]
[null,null,null,null,1]
[null,null,null,null,1]
[null,null,null,null,1]
[null,null,null,null,1]
[null,null,null,null,1]
[null,null,null,null,1]
[null,null,null,null,1]
[null,null,null,null,1]
[null,null,null,null,1]
[null,null,null,null,1]
[null,null,null,null,1]
[null,null,null,null,1]
[null,null,null,null,1]
[null,null,null,null,1]
[null,{"$f":"IF(ISBLANK(B114),\"\",B114)","v":""},null,null,1]
[null,"",null,null,1]
[null,"",null,null,1]
[null,"",null,null,1]
[null,"",null,null,{"$f":"IF(C174=0,1,((D174-C174)/C174)*1)","v":1}]
[null,"",null,null,1]
[null,"",null,null,1]
[null,"",null,null,1]
[null,"",null,null,1]
[null,"",null,null,1]
[null,"",null,null,1]
[null,"",null,null,1]
[null,"",null,null,1]
[null,"",null,null,1]
[null,"",null,null,1]
[null,"",null,null,1]
[null,"",null,null,1]
[null,"",null,null,1]
[null,"",null,null,1]
[null,"",null,null,1]
[null,"",null,null,1]
[null,"",null,null,1]
[null,"Total",{"$f":"SUM(C142:C191)","v":28093044},{"$f":"SUM(D142:D191)","v":40922868},0.45669041774184388]
[]
[]
[null,"8.2.6 - DISPOSALS BY ASSET CLASS"]
[null,null,"CPI Adjusted Forecast","Actual","Difference"]
[null,"Asset class","$0's, nominal",null," (%)"]
[null,"Subtransmission",null,59001,{"$f":"IF(C198=0,1,((D198-C198)/C198)*1)","v":1}]
[null,"Distribution system assets",null,4734,1]
[null,"SCADA/Network control",null,null,1]
[null,"Non network - IT",null,null,1]
[null,"Non network - other",null,16826,1]
[null,"Neutral Screen Services",null,null,1]
[null,"Distribution Transformers upgrades",null,null,1]
[null,"Metering - Non AMI",null,null,1]
[null,"Equity raising costs",null,null,1]
[null,"AMI",null,null,1]
[null,"Public lighting",null,null,1]
[null,"Alternative control -other",null,null,1]
[null,"Negotiated services",null,null,1]
[null,"Unregulated services",null,null,1]
[null,null,null,null,1]
[null,null,null,null,1]
[null,null,null,null,1]
[null,null,null,null,1]
[null,null,null,null,1]
[null,null,null,null,1]
[null,null,null,null,1]
[null,null,null,null,1]
[null,null,null,null,1]
[null,null,null,null,1]
[null,null,null,null,1]
[null,null,null,null,1]
[null,null,null,null,1]
[null,null,null,null,1]
[null,{"$f":"IF(ISBLANK(B114),\"\",B114)","v":""},null,null,1]
[null,"",null,null,1]
[null,"",null,null,1]
[null,"",null,null,1]
[null,"",null,null,{"$f":"IF(C230=0,1,((D230-C230)/C230)*1)","v":1}]
[null,"",null,null,1]
[null,"",null,null,1]
[null,"",null,null,1]
[null,"",null,null,1]
[null,"",null,null,1]
[null,"",null,null,1]
[null,"",null,null,1]
[null,"",null,null,1]
[null,"",null,null,1]
[null,"",null,null,1]
[null,"",null,null,1]
[null,"",null,null,1]
[null,"",null,null,1]
[null,"",null,null,1]
[null,"",null,null,1]
[null,"",null,null,1]
[null,"",null,null,1]
[null,"Total",{"$f":"SUM(C198:C247)","v":0},{"$f":"SUM(D198:D247)","v":80561},1]

{"sheet":"8.4 Opex","index":21,"n_rows":140,"n_cols":14,"rows_kept":140,"cut":false,"hidden":false,"merged":[[153,2,153,7],[154,2,154,7],[143,2,143,7],[144,2,144,7],[145,2,145,7],[146,2,146,7],[148,2,148,7],[149,2,149,7],[150,2,150,7],[151,2,151,7],[152,2,152,7],[6,1,6,4],[13,1,13,5],[15,2,17,2],[15,3,17,3],[15,4,17,4],[11,1,11,5],[7,1,7,4],[12,1,12,5],[16,5,17,5],[15,5,15,7],[16,7,17,7],[74,1,74,4],[18,2,18,6],[15,13,17,13],[76,13,78,13],[18,8,18,13],[16,8,16,9],[77,8,77,9],[77,10,77,12],[16,10,16,12],[15,8,15,12],[76,8,76,12],[76,5,76,7],[76,2,78,2],[76,3,78,3],[76,4,78,4],[16,6,17,6],[79,8,79,13],[77,6,78,6],[77,7,78,7],[156,2,156,7],[157,2,157,7],[79,2,79,4],[77,5,78,5],[137,2,137,7],[138,2,138,7],[155,2,155,7],[135,1,135,4],[139,2,139,7],[140,2,140,7],[141,2,141,7],[142,2,142,7],[147,2,147,7]]}
[null,{"$f":"(LOOKUP(dms_Model,dms_Model_List,dms_Worksheet_List))","v":"ANNUAL REPORTING STATEMENT"}]
[null,{"$f":"dms_TradingName","v":"United Energy"}]
[null,{"$f":"CONCATENATE(\"Annual Reporting RIN Response \",CRY)","v":"Annual Reporting RIN Response 2017"}]
[null,"8.4 OPEX"]
[]
[null,"Instructions"]
[null,{"$f":"CONCATENATE(\"Forecast expenditure is to be taken from \",dms_TradingName,\"'s \",dms_DeterminationRef,\".\")","v":"Forecast expenditure is to be taken from United Energy's 2016-20 Distribution Determination."}]
[null,"If allocating based on assumptions then provide method in Basis of Preparation.  \n\nAll adjustments must be explained in Basis of Preparation with supporting documentation attached. "]
[]
[null,"8.4.1 - OPERATING & MAINTENANCE EXPENDITURE - BY PURPOSE"]
[]
[null,{"$f":"CONCATENATE(dms_TradingName,\" is to list the operating expenditure categories identified in \", dms_TradingName,\"'s regulatory proposal at table 3.2.1.1 current opex categories and cost allocations.\")","v":"United Energy is to list the operating expenditure categories identified in United Energy's regulatory proposal at table 3.2.1.1 current opex categories and cost allocations."}]
[null,{"$f":"CONCATENATE(dms_TradingName, \" must specify any expenditure category where the expense is more than 5 per cent of the total standard control services operating expenditure.\")","v":"United Energy must specify any expenditure category where the expense is more than 5 per cent of the total standard control services operating expenditure."}]
[null,"Reported operating expenditure must INCLUDE any profit margins or management fees paid directly or indirectly to related party contractors (not including actual incurred expenditure of the related party contractor) for the regulatory reporting period.  "]
[]
[null,null,"Audited Statutory Accounts","Adjustments","Distribution business","Standard Control Services",null,null,"Alternative Control Services",null,null,null,null,"Negotiated Services"]
[null,null,null,null,null,"CPI Adjusted Forecast","Actual","Difference","Public Lighting",null,"Other"]
[null,null,null,null,null,null,null,null,{"$f":"IF(dms_Jurisdiction=\"Vic\",\"Energy efficient\",\"\")","v":"Energy efficient"},{"$f":"IF(dms_Jurisdiction=\"Vic\",\"Non-energy efficient\",\"\")","v":"Non-energy efficient"},"Connection services","Metering services","Ancillary network services"]
[null,"Opex category","$0's, nominal",null,null,null,null,"%","$0's, nominal"]
[null,"Maintenance Expenditure",null,null,null,null,null,{"$f":"IF(F20=0,1,((G20-F20)/F20)*1)","v":1}]
[null,"Routine",null,21266521,21266521,null,21266521,1]
[null,"Condition based",null,{"$f":"'[1]8.4 Opex'!D24","v":10807554.932099499},{"$f":"'[1]8.4 Opex'!E24","v":10807554.932099499},null,{"$f":"'[1]8.4 Opex'!G24","v":10807554.932099499},1]
[null,"Emergency",null,{"$f":"'[1]8.4 Opex'!D25","v":12643926.080000002},{"$f":"'[1]8.4 Opex'!E25","v":12643926.080000002},null,{"$f":"'[1]8.4 Opex'!G25","v":12643926.080000002},1]
[null,"SCADA/Network Control",null,582106.03,582106.03,null,582106.03,1]
[null,"Other - Standard Control Services",47759034.5,-47759034.5,null,null,null,1]
[null,"Public Lighting",null,2464474.7799999998,2464474.7799999998,null,null,1,635815.80000000005,1828658.98]
[null,"Alternative control - Fee based",null,1449906.19,1449906.19,null,null,1,null,null,0,0,1449906.19]
[null,"Alternative control - Qouted",null,1559594.71,1559594.71,null,null,1,null,null,1084.45,0,1558510.26]
[null,"Negotiated services",null,0,0,null,null,1]
[null,"AMI",null,null,null,null,null,1]
[null,null,null,null,null,null,null,1]
[null,"Operating Expenditure",null,null,null,null,null,1]
[null,"Transmission Connection Fee",12530019.15,-12530019.15,null,null,0,1]
[null,"Avoided TUoS charges/transmission costs",152223.12,-152223.12,null,null,0,1]
[null,"AEMO shared TUOS Charges",94362496.730000004,-94362496.730000004,null,null,0,1]
[null,"Net Cross Boundary Network Charges",null,null,null,null,0,1]
[null,"Premium Feed In Tariff",12876416,-12876416,0,null,0,1]
[null,"Transitional Feed In Tariff",645445,-645445,0,null,0,1]
[null,"Network Operating Costs",23515059.350000001,0,23515059.350000001,null,23324935.760000002,1,null,null,190123.59,0,0]
[null,"Billing & Revenue Collection",1093593.29,0,1093593.29,null,1093593.29,1,null,null,0,0,0]
[null,"Advertising/Marketing",577097.32999999996,0,577097.32999999996,null,577097.32999999996,1,null,null,0,0,0]
[null,"Customer Service",4713302.25,0,4713302.25,null,3860942.92,1,null,null,677386.38,111416.66,63556.3]
[null,"Regulatory",1540923.29,0,1540923.29,null,1540923.29,1]
[null,"Regulatory Reset",0,0,0,null,null,1]
[null,"IT",21838034.18,0,21838034.18,null,18562098.149999999,1,null,null,null,3275936.03]
[null,"Licence fee",37.06,0,37.06,null,37.06,1]
[null,"GSL payments",792100,0,792100,null,792100,1]
[null,"Non-network alternatives costs",59293.56,0,59293.56,null,59293.56,1]
[null,"Debt raising costs",0,0,0,null,null,1]
[null,"Other - Standard Control Services",38075792.659999996,0,38075792.659999996,null,37918846.659999996,1,null,null,142307.54999999999,8372.7099999999991,6265.74]
[null,"AMI",2603387,0,2603387,null,0,1,null,null,null,2603387]
[null,"ACS Connections",null,5178971,5178971,null,null,{"$f":"IF(F52=0,1,((G52-F52)/F52)*1)","v":1},null,null,5178971]
[null,"Forecast (1 line in the FD)",null,null,null,146896709.34999999,null,-1]
[null,null,null,null,null,null,null,1]
[null,null,null,null,null,null,null,1]
[null,null,null,null,null,null,null,1]
[null,null,null,null,null,null,null,1]
[null,null,null,null,null,null,null,1]
[null,null,null,null,null,null,null,1]
[null,null,null,null,null,null,null,1]
[null,null,null,null,null,null,null,1]
[null,null,null,null,null,null,null,1]
[null,null,null,null,null,null,null,1]
[null,null,null,null,null,null,null,1]
[null,null,null,null,null,null,null,1]
[null,null,null,null,null,null,null,1]
[null,null,null,null,null,null,null,1]
[null,null,null,null,null,null,null,1]
[null,null,null,null,null,null,null,1]
[null,"Total",{"$f":"SUM(C20:C69)","v":263134254.47},{"$f":"SUM(D20:D69)","v":-112372579.7779005},{"$f":"SUM(E20:E69)","v":150761674.69209951},{"$f":"SUM(F20:F69)","v":146896709.34999999},{"$f":"SUM(G20:G69)","v":133029976.06209952},-9.4397848319809741E-2,{"$f":"SUM(I20:I69)","v":635815.80000000005},1828658.98,6189872.9699999997,5999112.4000000004,3078238.49,0]
[]
[]
[null,"8.4.2 - OPERATING & MAINTENANCE EXPENDITURE - BY PURPOSE - MARGINS ONLY"]
[]
[null,"\"Related party margin expenditure' must COMPRISE ONLY profit margins or management fees paid directly or indirectly to related party contractors (for expenditure that is not an actual incurred expenditure of the related party contractor) for the regulatory reporting period."]
[]
[null,null,"Audited Statutory Accounts","Adjustments","Distribution business","Standard Control Services",null,null,"Alternative Control Services",null,null,null,null,"Negotiated Services"]
[null,null,null,null,null,"CPI Adjusted Forecast","Actual","Difference","Public Lighting",null,"Other"]
[null,null,null,null,null,null,null,null,{"$f":"IF(dms_Jurisdiction=\"Vic\",\"Energy efficient\",\"\")","v":"Energy efficient"},{"$f":"IF(dms_Jurisdiction=\"Vic\",\"Non-energy efficient\",\"\")","v":"Non-energy efficient"},"Connection services","Metering services","Ancillary network services"]
[null,"Opex category","$0's, nominal",null,null,null,"$0's, nominal","per cent","$0's, nominal"]
[null,"Maintenance Expenditure",null,null,null,null,null,{"$f":"IF(F81=0,1,((G81-F81)/F81)*1)","v":1}]
[null,"Routine",null,null,null,null,null,1]
[null,"Condition based",null,null,null,null,null,1]
[null,"Emergency",null,null,null,null,null,1]
[null,"SCADA/Network Control",null,null,null,null,null,1]
[null,"Other - Standard Control Services",null,null,null,null,null,1]
[null,"Other - Standard Control Services",null,null,null,null,null,1]
[null,"Public Lighting",null,null,null,null,null,1]
[null,"Alternative control - Fee based",null,null,null,null,null,1]
[null,"Alternative control - Qouted",null,null,null,null,null,1]
[null,"Negotiated services",null,null,null,null,null,1]
[null,"AMI",null,null,null,null,null,1]
[null,null,null,null,null,null,null,1]
[null,"Operating Expenditure",null,null,null,null,null,1]
[null,"Transmission Connection Fee",null,null,null,null,null,1]
[null,"Avoided TUoS charges/transmission costs",null,null,null,null,null,1]
[null,"AEMO shared TUOS Charges",null,null,null,null,null,1]
[null,"Net Cross Boundary Network Charges",null,null,null,null,null,1]
[null,"Premium Feed In Tariff",null,null,null,null,null,1]
[null,"Transitional Feed In Tariff",null,null,null,null,null,1]
[null,"Network Operating Costs",null,null,null,null,null,1]
[null,"Billing & Revenue Collection",null,null,null,null,null,1]
[null,"Advertising/Marketing",null,null,null,null,null,1]
[null,"Customer Service",null,null,null,null,null,1]
[null,"Regulatory",null,null,null,null,null,1]
[null,"Regulatory Reset",null,null,null,null,null,1]
[null,"IT",null,null,null,null,null,1]
[null,"Licence fee",null,null,null,null,null,1]
[null,"GSL payments",null,null,null,null,null,1]
[null,"Non-network alternatives costs",null,null,null,null,null,1]
[null,"Debt raising costs",null,null,null,null,null,1]
[null,"Other - Standard Control Services",null,null,null,null,null,1]
[null,"AMI",null,null,null,null,null,{"$f":"IF(F113=0,1,((G113-F113)/F113)*1)","v":1}]
[null,null,null,null,null,null,null,1]
[null,null,null,null,null,null,null,1]
[null,null,null,null,null,null,null,1]
[null,null,null,null,null,null,null,1]
[null,null,null,null,null,null,null,1]
[null,null,null,null,null,null,null,1]
[null,null,null,null,null,null,null,1]
[null,null,null,null,null,null,null,1]
[null,null,null,null,null,null,null,1]
[null,null,null,null,null,null,null,1]
[null,null,null,null,null,null,null,1]
[null,null,null,null,null,null,null,1]
[null,null,null,null,null,null,null,1]
[null,null,null,null,null,null,null,1]
[null,null,null,null,null,null,null,1]
[null,null,null,null,null,null,null,1]
[null,null,null,null,null,null,null,1]
[null,"Total",{"$f":"SUM(C81:C130)","v":0},{"$f":"SUM(D81:D130)","v":0},{"$f":"SUM(E81:E130)","v":0},{"$f":"SUM(F81:F130)","v":0},{"$f":"SUM(G81:G130)","v":0},1,{"$f":"SUM(I81:I130)","v":0},0,0,0,0,0]
[]
[]
[null,"8.4.3 - OPERATING & MAINTENANCE EXPENDITURE - EXPLANATION OF MATERIAL DIFFERENCE"]
[]
[null,"Where the difference between forecast and actual expenditure shown in table 8.4.1, column I is a Material Difference please explain the main factors driving the difference."]
[]
[null,"Category","Explanation"]
[null,"Operating Expenditure","Efficiencies in line maintenance."]
[null,null,"Reduction in operating costs as a result of efficiencies realised as part of a corporate review such efficiencies include re-contracting of call centre."]

{"sheet":"9.5 TUoS","index":22,"n_rows":67,"n_cols":6,"rows_kept":67,"cut":false,"hidden":false,"merged":[[64,1,64,4],[58,1,58,4],[24,1,24,4],[25,1,25,4],[66,1,66,4],[60,1,60,4],[55,1,55,4],[65,1,65,4],[47,1,47,4],[51,1,51,4],[52,1,52,4],[53,1,53,4],[54,1,54,4],[48,1,48,4],[49,1,49,4],[50,1,50,4],[57,1,57,4],[61,1,61,4],[59,1,59,4],[62,1,62,4],[63,1,63,4],[5,1,5,3],[26,1,26,3],[30,2,30,5],[42,1,42,4],[31,2,31,5],[9,1,9,4],[12,1,12,4],[13,1,13,4],[14,1,14,4],[20,1,20,4],[23,1,23,4],[15,1,15,3],[10,1,10,4],[11,1,11,4],[21,1,21,4],[22,1,22,4]]}
[null,{"$f":"(LOOKUP(dms_Model,dms_Model_List,dms_Worksheet_List))","v":"ANNUAL REPORTING STATEMENT"}]
[null,{"$f":"dms_TradingName","v":"United Energy"}]
[null,{"$f":"CONCATENATE(\"Annual Reporting RIN Response \",CRY)","v":"Annual Reporting RIN Response 2017"}]
[null,"9.5 - TUoS AUDIT (t-2)"]
[]
[null,"This template collects information for annual pricing proposals from Victorian businesses only.\n"]
[]
[null,"9.5.1 - TUOS CHARGES (AEMO)"]
[null,null,null,null,null,{"$f":"CRY","v":2017}]
[null,"AEMO (TUOS Locational Charge) - 2017",null,null,null,21691128]
[null,"AEMO (TUOS Non Locational and Common Service) - 2017",null,null,null,72806702]
[null,"Grid equalisation - 2017",null,null,null,2571800]
[]
[]
[]
[null,null,null,null,"Total",{"$f":"SUM(F10:F15)","v":97069630}]
[]
[]
[null,"9.5.2 - TRANSMISSION CONNECTION FEES"]
[null,null,null,null,null,{"$f":"CRY","v":2017}]
[null,"Ausnet (Connection) - 2017",null,null,null,8653641]
[null,"Ausnet & AEMO (Augmentation) - 2017",null,null,null,1436319]
[]
[]
[]
[]
[null,null,null,null,"Total",{"$f":"SUM(F21:F26)","v":10089960}]
[]
[]
[null,"9.5.3 - CROSS BOUNDARY NETWORK CHARGES"]
[null,null,"Amount (payable)/receivable"]
[null,null,"$0's, nominal"]
[null,null,"HV crossings","Subtransmission crossings","TUoS Adjustment","Total"]
[null,"Distribution Business",null,null,null,{"$f":"CRY","v":2017}]
[null,"Citipower",0,0,0,{"$f":"IF((SUM(C35:E35)=0),\"\",(SUM(C35:E35)))","v":""}]
[null,"Ausnet",0,0,-1479147,-1479147]
[null,null,null,null,null,""]
[null,null,null,null,null,""]
[null,null,null,null,null,""]
[null,null,null,null,null,""]
[null,null,null,null,null,""]
[null,null,null,null,null,""]
[null,"Total",null,null,null,{"$f":"SUM(F35:F42)","v":-1479147}]
[]
[]
[null,"9.5.4 - PAYMENTS TO EMBEDDED GENERATORS"]
[null,"9.5.4.1 - AVOIDED TRANSMISSION COSTS",null,null,null,{"$f":"CRY","v":2017}]
[null,"Avoided TUOS",null,null,null,11279]
[]
[]
[]
[]
[]
[]
[]
[null,"Total",null,null,null,{"$f":"SUM(F48:F55)","v":11279}]
[null,"9.5.4.2 - AVOIDED TUoS USAGE CHARGES",null,null,null,{"$f":"CRY","v":2017}]
[]
[]
[]
[]
[]
[]
[]
[]
[null,"Total",null,null,null,{"$f":"SUM(F58:F65)","v":0}]
[null,"Total payments to embedded generators",null,null,null,{"$f":"F66+F56","v":11279}]