{"text_format":"1","workbook":"xlsx","n_sheets":33,"sheets":["Instructions","CONTENTS","Business & other details","2.1 Expenditure summary","2.2 Repex","2.3 Augex (b)","2.5 Connections","2.6 Non-network","2.10 Overheads","2.14 Forecast price changes","2.16 Opex Summary","2.17 Step Changes","3.1 Revenue","3.2 Operating expenditure","3.3 Assets (RAB)","3.4 Operational data","3.5 Physical assets","3.7 Operating environment","5.4 MD & Utilisation - Spatial","7.1  Policies and Procedures","7.2 Contingent projects","7.3 Obligations","7.4 Shared Assets","7.5 Large Projects","7.9 STPIS","8.2 Capex","8.8 Revenue","Formatting Styles","AER Sheet Heading","AER CF","AER NRs","AER lookups","AER ETL"],"not_rendered":{"charts":0,"images":7,"macros":1,"external_links":0,"defined_names":541,"comments":4,"pivot_tables":0},"unopened":[],"bounds":{"document_bytes":16777216,"sheet_cells":100000,"rows_first":2000,"rows_last":500,"rows_between":2000,"halvings":0,"cell_chars":16384,"cell_head_chars":4096},"cells_cut":0,"cells_raw":0,"read":"whole","date_system":"1900"}

{"sheet":"Instructions","index":0,"n_rows":27,"n_cols":4,"rows_kept":27,"cut":false,"hidden":false,"merged":[[26,2,26,4],[10,2,10,4],[12,1,14,1],[12,2,12,4],[13,2,13,3],[14,2,14,4],[16,2,16,4],[7,1,8,1],[7,2,7,3],[8,2,8,4],[18,1,24,1],[18,2,18,4],[4,1,4,4],[5,2,5,4],[1,1,1,4],[2,1,2,4],[3,1,3,4]]}
[]
[null,{"$f":"CONCATENATE(dms_Sector,\" \",dms_Segment,\" \", \"Network Service Provider\")","v":"Electricity Transmission Network Service Provider"}]
[null,{"$f":"IF(dms_Model=\"Reset\",\"Regulatory Proposal RIN Template\",\"Annual Reporting RIN\")","v":"Regulatory Proposal RIN Template"}]
[null,{"$f":"CONCATENATE(\"This template is to be used by \",dms_TradingNameFull,\" to fulfil its reporting obligations to the AER.\")","v":"This template is to be used by Queensland Electricity Transmission Corporation Limited trading as Powerlink Queensland to fulfil its reporting obligations to the AER."}]
[null,"INSTRUCTIONS"]
[null,"GENERAL","Complete the Business & other details worksheet before entering data or values in any other worksheets. The Business & other details worksheet is linked to other worksheets within the workbook and automatically generates certain column headings and conditional formatting."]
[]
[null,"CONFIDENTIAL INFORMATION","\nPlease use the appropriate style to identify\nconfidential and protected information\nin the confidential workbook. \n\n"]
[null,null,"Do this by selecting the cell that contains the correct cell colour and format, then copy it and 'paste format' to the confidential cells. Alternatively you can change the fill of the cell to the same colour and pattern manually. This will format the cells a specific colour that is identified by the AER's process which in turn identifies that information as confidential or protected in the AER database."]
[]
[null,"RESPONSES","\nPlease return two (2) files to the AER: \n\n1. A confidential version which must contain a complete set of all responses with confidential information marked using the Mark selection CONFIDENTIAL macro and which has been completed using the locked template file provided by the AER. \n\n2. A public version with confidential information either removed completely or aggregated in some form together with writtten consent to disclose the public version of the response.\n\nUse the drop down box on the Business and other details worksheet to identify the file as either confidential ('consolidated') or public. "]
[]
[null,"AMENDMENTS","\nIf an NSP wishes to correct data previously submitted to the AER it should resubmit that data using the original completed submission as the starting point. Please make any necessary changes to the data. Data that is not being amended should be left unchanged. \n\nNSPs must identify the reason for the amendments in the Amendment Reason box on the  Business and other details worksheet. NSPs may provide further details regarding any amendments in the Amendments worksheet. \n\n."]
[null,null,"NSP may recolour cells using the Amended \nstyle on the Home ribbon to identify cells that \ncontain amended data.\nNB: if data is also CONFIDENTIAL, apply \nthe Amended Confidential style"]
[null,null,"Please resubmit two (2) files - a confidential version and a public version of the amended submission to the AER"]
[]
[null,"UNITS OF MEASURE","\nAll amounts are to be unrounded and reported on a one for one basis: that is 1000 is to be entered as '1000'. Applicable units of measure may be identified in the table column headings or row descriptors.\n\n"]
[]
[null,"INPUT / NON-INPUT CELLS"]
[null,null,null,"Yellow = Input cell (mandatory)"]
[null,null,null,"Darker yellow = input cell (mandatory)"]
[null,null,null,"Orange = input cell (if data available)"]
[null,null,null,"Grey = Not applicable/No inputs required"]
[null,null,null,"PLEASE DO NOT ENTER TEXT into cells that are to contain numbers (including 'numbers stored as text')"]
[]
[]
[null,"NAVIGATION","\nSome tables in the worksheets have been \"grouped\" to allow for easy navigation. To ungroup or group data use the outline symbols in the left margin (for Row groupings) or above the columns (for column groupings). \n\n\n\n"]

{"sheet":"CONTENTS","index":1,"n_rows":39,"n_cols":4,"rows_kept":39,"cut":false,"hidden":false,"merged":[[5,2,5,3]]}
[null,null,{"$f":"INDEX(dms_Worksheet_List,MATCH(dms_Model,dms_Model_List))","v":"REGULATORY REPORTING STATEMENT"}]
[null,{"$f":"INDEX(dms_TradingNameFull_List,MATCH(dms_TradingName,dms_TradingName_List))","v":"Queensland Electricity Transmission Corporation Limited trading as Powerlink Queensland"}]
[null,null,{"$f":"CONCATENATE(\"REGULATORY PERIOD FROM \", FRCP_y1,\" TO \",dms_MultiYear_FinalYear_Result)","v":"REGULATORY PERIOD FROM 2027-28 TO 2031-32"}]
[]
[]
[null,null,"CONTENTS"]
[]
[null,null,"TEMPLATE","RESET RIN - OCTOBER 2025"]
[]
[null,null,"SUBMISSION","Business & other details"]
[]
[null,null,"EXPENDITURE","2.1 Expenditure summary"]
[null,null,null,"2.2 Repex"]
[null,null,null,"2.3 Augex (b)"]
[null,null,null,"2.5 Connections"]
[null,null,null,"2.6 Non-network"]
[null,null,null,"2.10 Overheads"]
[null,null,null,"2.14 Forecast price changes"]
[null,null,null,"2.16 Opex Summary"]
[null,null,null,"2.17 Step Changes"]
[]
[null,null,"ECONOMIC BENCHMARKING","3.1 Revenue"]
[null,null,null,"3.2 Operating expenditure"]
[null,null,null,"3.3 Assets (RAB)"]
[null,null,null,"3.4 Operational data"]
[null,null,null,"3.5 Physical assets"]
[null,null,null,"3.7 Operating environment"]
[]
[null,null,"NETWORK","5.4 MD & Utilisation - Spatial"]
[]
[null,null,"OTHER","7.1  Policies and Procedures"]
[null,null,null,"7.2 Contingent projects"]
[null,null,null,"7.3 Obligations"]
[null,null,null,"7.4 Shared Assets"]
[null,null,null,"7.5 Large Projects"]
[null,null,null,"7.9 STPIS"]
[]
[null,null,"FINANCIAL","8.2 Capex"]
[null,null,null,"8.8 Revenue"]

{"sheet":"Business & other details","index":2,"n_rows":74,"n_cols":79,"rows_kept":74,"cut":false,"hidden":false,"merged":[[0,7,2,15],[3,21,3,57],[6,21,6,75],[8,16,8,93],[15,21,15,35],[15,37,15,58],[16,21,16,35],[16,37,16,48],[22,21,22,35],[22,37,22,58],[22,60,22,66],[22,68,22,89],[23,21,23,35],[23,37,23,58],[23,60,23,66],[23,68,23,89],[24,21,24,35],[24,37,24,51],[24,60,24,66],[24,68,24,82],[25,21,25,35],[25,37,25,40],[25,49,25,51],[25,60,25,66],[25,68,25,71],[25,80,25,82],[31,21,31,35],[31,37,31,58],[31,60,31,66],[31,68,31,89],[32,21,32,35],[32,37,32,58],[32,60,32,66],[32,68,32,89],[33,21,33,35],[33,37,33,58],[33,60,33,66],[33,68,33,89],[41,25,41,34],[41,37,41,44],[41,46,41,53],[41,55,41,62],[41,64,41,71],[41,73,41,80],[42,37,42,44],[42,46,42,53],[42,55,42,62],[42,64,42,71],[42,73,42,80],[43,37,43,44],[43,46,43,53],[43,55,43,62],[43,64,43,71],[43,73,43,80],[45,25,45,34],[45,37,45,44],[45,46,45,53],[45,55,45,62],[45,64,45,71],[45,73,45,80],[46,37,46,44],[46,46,46,53],[46,55,46,62],[46,64,46,71],[46,73,46,80],[47,37,47,44],[47,46,47,53],[47,55,47,62],[47,64,47,71],[47,73,47,80],[49,25,49,34],[49,37,49,44],[49,46,49,53],[49,55,49,62],[49,64,49,71],[49,73,49,80],[50,37,50,44],[50,46,50,53],[50,55,50,62],[50,64,50,71],[50,73,50,80],[51,37,51,44],[51,46,51,53],[51,55,51,62],[51,64,51,71],[51,73,51,80],[53,25,53,34],[53,37,53,44],[55,25,55,34],[55,37,55,44],[61,25,61,34],[61,37,61,52],[69,25,71,34],[69,37,71,81],[73,25,73,34],[73,37,73,52],[63,25,63,34],[63,37,63,52],[65,25,65,34],[65,37,65,52],[67,25,67,34],[67,37,67,52]]}
[null,null,null,null,null,null,null,null,null,null,null,null,null,null,null,null,null,null,null,null,null,{"$f":"INDEX(dms_Worksheet_List,MATCH(dms_Model,dms_Model_List))","v":"REGULATORY REPORTING STATEMENT"}]
[null,null,null,null,null,null,null,null,null,null,null,null,null,null,null,null,null,null,null,null,null,{"$f":"INDEX(dms_TradingNameFull_List,MATCH(dms_TradingName,dms_TradingName_List))","v":"Queensland Electricity Transmission Corporation Limited trading as Powerlink Queensland"}]
[null,null,null,null,null,null,null,null,null,null,null,null,null,null,null,null,null,null,null,null,null,{"$f":"CONCATENATE(\"REGULATORY PERIOD FROM \", FRCP_y1,\" TO \",dms_MultiYear_FinalYear_Result)","v":"REGULATORY PERIOD FROM 2027-28 TO 2031-32"}]
[null,null,null,null,null,null,null,null,null,null,null,null,null,null,null,null,null,null,null,null,null,"BUSINESS & OTHER DETAILS"]
[]
[null,null,null,null,null,null,null,null,null,null,null,null,null,null,null,null,null,null,null,null,null,"INSTRUCTIONS"]
[null,null,null,null,null,null,null,null,null,null,null,null,null,null,null,null,null,null,null,null,null,"Complete the following business details regulatory template before entering data or values in any other regulatory template. This regulatory template is linked to other cells within the spreadsheet and automatically generates column headings and conditional formatting to distinguish business specific input and non-input cells. "]
[]
[null,null,null,null,null,null,null,null,null,null,null,null,null,null,null,null,"SUBMISSION PARTICULARS INPUT SHEET"]
[]
[]
[null,null,null,null,null,null,null,null,null,null,null,null,null,null,null,null,null,null,null,null,null,"ENTITY DETAILS"]
[]
[null,null,null,null,null,null,null,null,null,null,null,null,null,null,null,null,null,null,null,null,null,"Business Name"]
[]
[null,null,null,null,null,null,null,null,null,null,null,null,null,null,null,null,null,null,null,null,null,"Short name",null,null,null,null,null,null,null,null,null,null,null,null,null,null,null,"Powerlink"]
[null,null,null,null,null,null,null,null,null,null,null,null,null,null,null,null,null,null,null,null,null,"ACN/ABN",null,null,null,null,null,null,null,null,null,null,null,null,null,null,null,{"$f":"INDEX(dms_ABN_List,MATCH(dms_TradingName,dms_TradingName_List))","v":82078849233}]
[]
[]
[]
[null,null,null,null,null,null,null,null,null,null,null,null,null,null,null,null,null,null,null,null,null,"Business Address",null,null,null,null,null,null,null,null,null,null,null,null,null,null,null,null,null,null,null,null,null,null,null,null,null,null,null,null,null,null,null,null,null,null,null,null,null,null,null,null,null,null,null,null,null,null,"Postal Address"]
[]
[null,null,null,null,null,null,null,null,null,null,null,null,null,null,null,null,null,null,null,null,null,"Address 1",null,null,null,null,null,null,null,null,null,null,null,null,null,null,null,null,null,null,null,null,null,null,null,null,null,null,null,null,null,null,null,null,null,null,null,null,null,null,"Address 1"]
[null,null,null,null,null,null,null,null,null,null,null,null,null,null,null,null,null,null,null,null,null,"Address 2",null,null,null,null,null,null,null,null,null,null,null,null,null,null,null,null,null,null,null,null,null,null,null,null,null,null,null,null,null,null,null,null,null,null,null,null,null,null,"Address 2"]
[null,null,null,null,null,null,null,null,null,null,null,null,null,null,null,null,null,null,null,null,null,"Suburb",null,null,null,null,null,null,null,null,null,null,null,null,null,null,null,null,null,null,null,null,null,null,null,null,null,null,null,null,null,null,null,null,null,null,null,null,null,null,"Suburb"]
[null,null,null,null,null,null,null,null,null,null,null,null,null,null,null,null,null,null,null,null,null,"State",null,null,null,null,null,null,null,null,null,null,null,null,null,null,null,{"$f":"INDEX(dms_JurisdictionList,MATCH(dms_TradingName,dms_TradingName_List))","v":"Qld"},null,null,null,null,null,null,null,null,null,"Post code",null,null,null,null,null,null,null,null,null,null,null,null,"State",null,null,null,null,null,null,null,{"$f":"INDEX(dms_PState_List,MATCH(dms_TradingName,dms_TradingName_List))","v":"QLD"},null,null,null,null,null,null,null,null,null,"Post code"]
[]
[null,null,null,null,null,null,null,null,null,null,null,null,null,null,null,null,null,null,null,null,null,null,null,null,null,null,null,null,null,null,null,null,null,null,null,null,null,null,null,null,null,null,null,null,null,null,null,null,null,null,null,null,"`"]
[]
[null,null,null,null,null,null,null,null,null,null,null,null,null,null,null,null,null,null,null,null,null,"Contact Names"]
[]
[null,null,null,null,null,null,null,null,null,null,null,null,null,null,null,null,null,null,null,null,null,"Name",null,null,null,null,null,null,null,null,null,null,null,null,null,null,null,null,null,null,null,null,null,null,null,null,null,null,null,null,null,null,null,null,null,null,null,null,null,null,"Name"]
[null,null,null,null,null,null,null,null,null,null,null,null,null,null,null,null,null,null,null,null,null,"Phone",null,null,null,null,null,null,null,null,null,null,null,null,null,null,null,null,null,null,null,null,null,null,null,null,null,null,null,null,null,null,null,null,null,null,null,null,null,null,"Phone"]
[null,null,null,null,null,null,null,null,null,null,null,null,null,null,null,null,null,null,null,null,null,"Email",null,null,null,null,null,null,null,null,null,null,null,null,null,null,null,null,null,null,null,null,null,null,null,null,null,null,null,null,null,null,null,null,null,null,null,null,null,null,"Email"]
[]
[]
[]
[]
[null,null,null,null,null,null,null,null,null,null,null,null,null,null,null,null,"REGULATORY CONTROL PERIODS"]
[]
[]
[null,null,null,null,null,null,null,null,null,null,null,null,null,null,null,null,null,null,null,null,null,null,null,null,null,"Forthcoming period",null,null,null,null,null,null,null,null,null,null,null,"2027-28",null,null,null,null,null,null,null,null,{"$f":"FRCP_y2","v":"2028-29"},null,null,null,null,null,null,null,null,{"$f":"FRCP_y3","v":"2029-30"},null,null,null,null,null,null,null,null,{"$f":"FRCP_y4","v":"2030-31"},null,null,null,null,null,null,null,null,{"$f":"FRCP_y5","v":"2031-32"}]
[null,null,null,null,null,null,null,null,null,null,null,null,null,null,null,null,null,null,null,null,null,null,null,null,null,null,null,null,null,null,null,null,null,null,null,null,null,{"$f":"FRCP_y6","v":"2032-33"},null,null,null,null,null,null,null,null,{"$f":"FRCP_y7","v":"2033-34"},null,null,null,null,null,null,null,null,{"$f":"FRCP_y8","v":"2034-35"},null,null,null,null,null,null,null,null,{"$f":"FRCP_y9","v":"2035-36"},null,null,null,null,null,null,null,null,{"$f":"FRCP_y10","v":"2036-37"}]
[null,null,null,null,null,null,null,null,null,null,null,null,null,null,null,null,null,null,null,null,null,null,null,null,null,null,null,null,null,null,null,null,null,null,null,null,null,{"$f":"FRCP_y11","v":"2037-38"},null,null,null,null,null,null,null,null,{"$f":"FRCP_y12","v":"2038-39"},null,null,null,null,null,null,null,null,{"$f":"FRCP_y13","v":"2039-40"},null,null,null,null,null,null,null,null,{"$f":"FRCP_y14","v":"2040-41"},null,null,null,null,null,null,null,null,{"$f":"FRCP_y15","v":"2041-42"}]
[]
[null,null,null,null,null,null,null,null,null,null,null,null,null,null,null,null,null,null,null,null,null,null,null,"RESETS",null,"Current period",null,null,null,null,null,null,null,null,null,null,null,{"$f":"CRCP_y1","v":"2022-23"},null,null,null,null,null,null,null,null,{"$f":"CRCP_y2","v":"2023-24"},null,null,null,null,null,null,null,null,{"$f":"CRCP_y3","v":"2024-25"},null,null,null,null,null,null,null,null,{"$f":"CRCP_y4","v":"2025-26"},null,null,null,null,null,null,null,null,{"$f":"CRCP_y5","v":"2026-27"}]
[null,null,null,null,null,null,null,null,null,null,null,null,null,null,null,null,null,null,null,null,null,null,null,null,null,null,null,null,null,null,null,null,null,null,null,null,null,{"$f":"CRCP_y6","v":"2027-28"},null,null,null,null,null,null,null,null,{"$f":"CRCP_y7","v":"2028-29"},null,null,null,null,null,null,null,null,{"$f":"CRCP_y8","v":"2029-30"},null,null,null,null,null,null,null,null,{"$f":"CRCP_y9","v":"2030-31"},null,null,null,null,null,null,null,null,{"$f":"CRCP_y10","v":"2031-32"}]
[null,null,null,null,null,null,null,null,null,null,null,null,null,null,null,null,null,null,null,null,null,null,null,null,null,null,null,null,null,null,null,null,null,null,null,null,null,{"$f":"CRCP_y11","v":"2032-33"},null,null,null,null,null,null,null,null,{"$f":"CRCP_y12","v":"2033-34"},null,null,null,null,null,null,null,null,{"$f":"CRCP_y13","v":"2034-35"},null,null,null,null,null,null,null,null,{"$f":"CRCP_y14","v":"2035-36"},null,null,null,null,null,null,null,null,{"$f":"CRCP_y15","v":"2036-37"}]
[]
[null,null,null,null,null,null,null,null,null,null,null,null,null,null,null,null,null,null,null,null,null,null,null,null,null,"Previous period",null,null,null,null,null,null,null,null,null,null,null,{"$f":"PRCP_y1","v":"2017-18"},null,null,null,null,null,null,null,null,{"$f":"PRCP_y2","v":"2018-19"},null,null,null,null,null,null,null,null,{"$f":"PRCP_y3","v":"2019-20"},null,null,null,null,null,null,null,null,{"$f":"PRCP_y4","v":"2020-21"},null,null,null,null,null,null,null,null,{"$f":"PRCP_y5","v":"2021-22"}]
[null,null,null,null,null,null,null,null,null,null,null,null,null,null,null,null,null,null,null,null,null,null,null,null,null,null,null,null,null,null,null,null,null,null,null,null,null,{"$f":"PRCP_y6","v":"2022-23"},null,null,null,null,null,null,null,null,{"$f":"PRCP_y7","v":"2023-24"},null,null,null,null,null,null,null,null,{"$f":"PRCP_y8","v":"2024-25"},null,null,null,null,null,null,null,null,{"$f":"PRCP_y9","v":"2025-26"},null,null,null,null,null,null,null,null,{"$f":"PRCP_y10","v":"2026-27"}]
[null,null,null,null,null,null,null,null,null,null,null,null,null,null,null,null,null,null,null,null,null,null,null,null,null,null,null,null,null,null,null,null,null,null,null,null,null,{"$f":"PRCP_y11","v":"2027-28"},null,null,null,null,null,null,null,null,{"$f":"PRCP_y12","v":"2028-29"},null,null,null,null,null,null,null,null,{"$f":"PRCP_y13","v":"2029-30"},null,null,null,null,null,null,null,null,{"$f":"PRCP_y14","v":"2030-31"},null,null,null,null,null,null,null,null,{"$f":"PRCP_y15","v":"2031-32"}]
[]
[null,null,null,null,null,null,null,null,null,null,null,null,null,null,null,null,null,null,null,null,null,null,null,null,null,"Commencing year",null,null,null,null,null,null,null,null,null,null,null,"2022-23"]
[null,null,null,null,null,null,null,null,null,null,null,null,null,null,null,null,null,null,null,null,null,null,null,"ANNUAL RINS"]
[null,null,null,null,null,null,null,null,null,null,null,null,null,null,null,null,null,null,null,null,null,null,null,null,null,"Final year",null,null,null,null,null,null,null,null,null,null,null,"2026-27"]
[]
[]
[]
[null,null,null,null,null,null,null,null,null,null,null,null,null,null,null,null,"SUBMISSION DETAILS"]
[]
[null,null,null,null,null,null,null,null,null,null,null,null,null,null,null,null,null,null,null,null,null,null,null,null,null,"RIN type",null,null,null,null,null,null,null,null,null,null,null,{"$f":"INDIRECT(dms_Model)","v":"Regulatory Reporting (Reset)"}]
[]
[null,null,null,null,null,null,null,null,null,null,null,null,null,null,null,null,null,null,null,null,null,null,null,null,null,"Source",null,null,null,null,null,null,null,null,null,null,null,"Regulatory proposal"]
[]
[null,null,null,null,null,null,null,null,null,null,null,null,null,null,null,null,null,null,null,null,null,null,null,"THIS FILE",null,"Data Quality",null,null,null,null,null,null,null,null,null,null,null,"Consolidated"]
[]
[null,null,null,null,null,null,null,null,null,null,null,null,null,null,null,null,null,null,null,null,null,null,null,null,null,"Confidentiality Status",null,null,null,null,null,null,null,null,null,null,null,"Public"]
[]
[null,null,null,null,null,null,null,null,null,null,null,null,null,null,null,null,null,null,null,null,null,null,null,null,null,"Amended RIN \nAmendment Reason",null,null,null,null,null,null,null,null,null,null,null,"."]
[]
[]
[]
[null,null,null,null,null,null,null,null,null,null,null,null,null,null,null,null,null,null,null,null,null,null,null,null,null,"Submission Date",null,null,null,null,null,null,null,null,null,null,null,"dd/mm/yy",null,null,null,null,null,null,null,null,null,null,null,null,null,null,null,null,null,"Please enter date this file submitted to AER"]

{"sheet":"2.1 Expenditure summary","index":3,"n_rows":42,"n_cols":9,"rows_kept":42,"cut":false,"hidden":false,"merged":[]}
[null,{"$f":"(LOOKUP(dms_Model,dms_Model_List,dms_Worksheet_List))","v":"REGULATORY REPORTING STATEMENT"}]
[null,{"$f":"dms_TradingName","v":"Powerlink"}]
[null,{"$f":"CONCATENATE(\"REGULATORY PERIOD FROM \", FRCP_y1,\" TO \",dms_MultiYear_FinalYear_Result)","v":"REGULATORY PERIOD FROM 2027-28 TO 2031-32"}]
[null,"2.1 - EXPENDITURE SUMMARY AND RECONCILIATION"]
[]
[null,"2.1.1 - PRESCRIBED TRANSMISSION SERVICES CAPEX (as incurred)",null,null,null,null,null,"    "]
[null,null,"EXPENDITURE"]
[null,null,{"$f":"CONCATENATE(\"Forecast  ($0's, real \",dms_DollarReal,\")\")","v":"Forecast  ($0's, real June 2027)"}]
[null,null,{"$f":"dms_y4","v":"2025-26"},{"$f":"dms_y5","v":"2026-27"},{"$f":"dms_y6","v":"2027-28"},{"$f":"dms_y7","v":"2028-29"},{"$f":"dms_y8","v":"2029-30"},{"$f":"dms_y9","v":"2030-31"},{"$f":"dms_y10","v":"2031-32"}]
[null,"Replacement expenditure",259137824.55584061,275991307.82413191,360483098.13723892,313686342.07251751,271135739.10096234,371239485.52805513,351283685.07015193]
[null,"Connections",0,0,0,0,0,0,0]
[null,"Augmentation Expenditure",26671578.034547433,21501673.750229955,27800543.251631733,35184348.761368409,48439898.725364923,72067777.31269604,75289630.096756279]
[null,"ICT",14511339.460267004,13767973.167869024,4218699.200221519,5069988.6477512,5542391.8340783278,4523876.851965975,4175100.5560894185]
[null,"Property",6369952.0487698233,14127252.135220448,46215203.047115318,72258146.001741067,35442266.323365383,5373615.884014627,6257384.6829359997]
[null,"Fleet",7852784.4945289623,3773231.5705053438,4298556.2319043772,5259953.1441840315,6473062.3048548084,5942281.7096319366,5303252.1866752068]
[null,"Other Non-network",6514570.5077890325,3831836.1229743632,2024708.8642648244,2869087.2511378378,2814240.7728045881,2463466.538587701,2594712.4621981536]
[null,"Capitalised network overheads"]
[null,"Capitalised corporate overheads",52265263.807260469,54208207.488291107,72448503.747131094,70704536.305834904,60207748.684418894,75145895.971503735,72426194.311247647]
[null,"Total gross capex",{"$f":"SUM(C10:C18)","v":373323312.90900332},387201482.0592221,517489312.47950786,505032402.18453497,430055347.74584925,536756399.79645509,517329959.36605459]
[]
[null,"2.1.2 - PRESCRIBED TRANSMISSION SERVICES OPEX"]
[null,null,"EXPENDITURE"]
[null,null,{"$f":"CONCATENATE(\"Forecast  ($0's, real \",dms_DollarReal,\")\")","v":"Forecast  ($0's, real June 2027)"}]
[null,null,{"$f":"dms_y4","v":"2025-26"},{"$f":"dms_y5","v":"2026-27"},{"$f":"dms_y6","v":"2027-28"},{"$f":"dms_y7","v":"2028-29"},{"$f":"dms_y8","v":"2029-30"},{"$f":"dms_y9","v":"2030-31"},{"$f":"dms_y10","v":"2031-32"}]
[null,"Vegetation management",18570115.20489338,19801607.862534054]
[null,"Maintenance",114897959.00640593,126778242.89228345]
[null,"Non-network",36088349.062550642,38481577.990133911]
[null,"Network overheads",107799024.60484476,110966036.47182846]
[null,"Corporate overheads",78005126.332001597,82899141.443144605]
[null,"Other",-36088349,-38481578]
[null,"Total",{"$f":"SUM(C25:C30)","v":319272225.21069634},{"$f":"SUM(D25:D30)","v":340445028.65992451},{"$f":"'2.16 Opex Summary'!H22","v":356933938.38687903},{"$f":"'2.16 Opex Summary'!I22","v":365754923.08253896},{"$f":"'2.16 Opex Summary'!J22","v":363905790.56118947},{"$f":"'2.16 Opex Summary'!K22","v":368869536.5811792},{"$f":"'2.16 Opex Summary'!L22","v":376727398.11984968}]
[]
[]
[null,"2.1.8 - PRESCRIBED TRANSMISSION SERVICES CAPITALISED OVERHEADS"]
[null,null,"EXPENDITURE"]
[null,null,{"$f":"CONCATENATE(\"Forecast  ($0's, real \",dms_DollarReal,\")\")","v":"Forecast  ($0's, real June 2027)"}]
[null,null,{"$f":"dms_y4","v":"2025-26"},{"$f":"dms_y5","v":"2026-27"},{"$f":"dms_y6","v":"2027-28"},{"$f":"dms_y7","v":"2028-29"},{"$f":"dms_y8","v":"2029-30"},{"$f":"dms_y9","v":"2030-31"},{"$f":"dms_y10","v":"2031-32"}]
[null,"Replacement expenditure",42185227.253276378,44928817.552765667,58683295.045597039,51065218.476921462,44138376.132714801,60434334.853404328,57185716.174210779]
[null,"Connections",0,0,0,0,0,0,0]
[null,"Augmentation Expenditure",4341884.7963216752,3500272.4709676672,4525669.8316609804,5727684.6820832295,7885564.9087803373,11731963.748578427,12256451.411099862]
[null,"Non-network",5738151.7576624146,5779117.4645577734,9239538.8698730785,13911633.14683021,8183807.6429237602,2979597.3695209697,2984026.7259370107]
[null,"Total",{"$f":"SUM(C38:C41)","v":52265263.807260469},54208207.488291107,72448503.747131094,70704536.305834904,60207748.684418894,75145895.971503735,72426194.311247647]

{"sheet":"2.2 Repex","index":4,"n_rows":64,"n_cols":10,"rows_kept":64,"cut":false,"hidden":false,"merged":[]}
[null,{"$f":"(LOOKUP(dms_Model,dms_Model_List,dms_Worksheet_List))","v":"REGULATORY REPORTING STATEMENT"}]
[null,{"$f":"dms_TradingName","v":"Powerlink"}]
[null,{"$f":"CONCATENATE(\"REGULATORY PERIOD FROM \", FRCP_y1,\" TO \",dms_MultiYear_FinalYear_Result)","v":"REGULATORY PERIOD FROM 2027-28 TO 2031-32"}]
[null,"2.2 REPEX"]
[]
[null,"2.2.1 - REPLACEMENT EXPENDITURE, VOLUMES AND ASSET FAILURES BY ASSET CATEGORY"]
[null,"EXPENDITURE AS COMMISSIONED"]
[null,null,null,"EXPENDITURE"]
[null,null,null,{"$f":"CONCATENATE(\"Forecast  ($0's, real \",dms_DollarReal,\")\")","v":"Forecast  ($0's, real June 2027)"}]
[null,"ASSET GROUP",null,{"$f":"dms_y4","v":"2025-26"},{"$f":"dms_y5","v":"2026-27"},{"$f":"dms_y6","v":"2027-28"},{"$f":"dms_y7","v":"2028-29"},{"$f":"dms_y8","v":"2029-30"},{"$f":"dms_y9","v":"2030-31"},{"$f":"dms_y10","v":"2031-32"}]
[null,"TRANSMISSION TOWERS","Total",79695181.376809463,15254417.77474645,0,0,0,9585261.0570747443,186980366.66047791]
[null,"TRANSMISSION TOWER SUPPORT STRUCTURES","Total",0,0,0,0,0,0,0]
[null,"CONDUCTORS","Total",0,0,0,0,0,0,0]
[null,"TRANSMISSION CABLES","Total",0,14130095.508240614,0,0,0,133916812.05761966,0]
[null,"SUBSTATION SWITCHBAYS","Total",1319098.9235011747,57163326.633200034,119685275.17503592,13400782.197394488,13657880.214668544,145428045.45266557,50060403.805256583]
[null,"SUBSTATION POWER TRANSFORMERS","Total",190420.19943812603,25322078.602706864,29885653.349064745,30280743.059847292,8129864.8602969674,28898589.198489238,0]
[null,"SUBSTATION REACTIVE PLANT","Total",0,970670.81964466174,0,0,0,0,0]
[null,"SCADA, NETWORK CONTROL AND PROTECTION SYSTEMS","Total",11212210.056916285,37731711.913271546,104065276.9601686,169751844.14054263,91726673.764303461,86768272.006624728,68471888.380954668]
[null,"OTHER","Total",134369075.66825795,136737514.1498186,154747962.10929087,27465021.716513131,112152033.70565234,32193401.004936833,232169654.36756516]
[]
[]
[null,"ASSET REPLACEMENTS"]
[null,null,null,"VOLUMES "]
[null,null,null,"(0's)"]
[null,"ASSET GROUP",null,{"$f":"dms_y4","v":"2025-26"},{"$f":"dms_y5","v":"2026-27"},{"$f":"dms_y6","v":"2027-28"},{"$f":"dms_y7","v":"2028-29"},{"$f":"dms_y8","v":"2029-30"},{"$f":"dms_y9","v":"2030-31"},{"$f":"dms_y10","v":"2031-32"}]
[null,"TRANSMISSION TOWERS","Total",114,92,0,0,0,97,331]
[null,"TRANSMISSION TOWER SUPPORT STRUCTURES","Total",0,0,0,0,0,0,0]
[null,"CONDUCTORS","Total",0,0,0,0,0,0,0]
[null,"TRANSMISSION CABLES","Total",0,0.5,0,0,0,20.6,0]
[null,"SUBSTATION SWITCHBAYS","Total",2,19,26,9,2,22,16]
[null,"SUBSTATION POWER TRANSFORMERS","Total",1,2,8,3,1,5,0]
[null,"SUBSTATION REACTIVE PLANT","Total",0,1,0,0,0,0,0]
[null,"SCADA, NETWORK CONTROL AND PROTECTION SYSTEMS","Total",32,20,75,38,26,105,13]
[null,"OTHER","Total"]
[]
[]
[null,"ASSET FAILURES"]
[null,null,null,"VOLUMES "]
[null,null,null,"(0's)"]
[null,"ASSET GROUP",null,{"$f":"dms_y4","v":"2025-26"},{"$f":"dms_y5","v":"2026-27"},{"$f":"dms_y6","v":"2027-28"},{"$f":"dms_y7","v":"2028-29"},{"$f":"dms_y8","v":"2029-30"},{"$f":"dms_y9","v":"2030-31"},{"$f":"dms_y10","v":"2031-32"}]
[null,"TRANSMISSION TOWERS","Total"]
[null,"TRANSMISSION TOWER SUPPORT STRUCTURES","Total"]
[null,"CONDUCTORS","Total"]
[null,"TRANSMISSION CABLES","Total"]
[null,"SUBSTATION SWITCHBAYS","Total"]
[null,"SUBSTATION POWER TRANSFORMERS","Total"]
[null,"SUBSTATION REACTIVE PLANT","Total"]
[null,"SCADA, NETWORK CONTROL AND PROTECTION SYSTEMS","Total"]
[null,"OTHER","Total"]
[]
[]
[null,"EXPENDITURE AS INCURRED"]
[null,null,null,"EXPENDITURE"]
[null,null,null,{"$f":"CONCATENATE(\"Forecast  ($0's, real \",dms_DollarReal,\")\")","v":"Forecast  ($0's, real June 2027)"}]
[null,"ASSET GROUP",null,{"$f":"dms_y4","v":"2025-26"},{"$f":"dms_y5","v":"2026-27"},{"$f":"dms_y6","v":"2027-28"},{"$f":"dms_y7","v":"2028-29"},{"$f":"dms_y8","v":"2029-30"},{"$f":"dms_y9","v":"2030-31"},{"$f":"dms_y10","v":"2031-32"}]
[null,"TRANSMISSION TOWERS","Total",18123071.871016815,4463385.9391330881,22751973.778305352,25621766.675716572,45502747.858827993,88333227.190341786,63991421.56120234]
[null,"TRANSMISSION TOWER SUPPORT STRUCTURES","Total",0,0,0,0,0,0,0]
[null,"CONDUCTORS","Total",0,0,0,0,0,0,0]
[null,"TRANSMISSION CABLES","Total",9651883.8494826853,16766188.184940426,53124189.754146144,30055869.518960301,12500741.729431471,15241574.940797873,3482164.5839626812]
[null,"SUBSTATION SWITCHBAYS","Total",38521674.197671913,45911737.934829801,54175940.360819317,57982901.783054017,55989450.706931636,66405973.573403008,66704291.694051385]
[null,"SUBSTATION POWER TRANSFORMERS","Total",14970667.476877537,38488913.607345864,15927854.254802093,11849058.456583258,9616961.9066497926,12736901.477506245,7061368.9385187551]
[null,"SUBSTATION REACTIVE PLANT","Total",306695.3746564592,655238.73511873512,0,0,0,0,0]
[null,"SCADA, NETWORK CONTROL AND PROTECTION SYSTEMS","Total",35111541.187994875,61032952.880373538,140020700.09310782,112005751.52960247,72943237.758888811,103031750.24208122,121010109.08730882]
[null,"OTHER","Total",142452290.59814033,108672890.54239048,74482439.896058217,76170994.1086009,74582599.140232623,85490058.10392499,89034329.205107912]

{"sheet":"2.3 Augex (b)","index":5,"n_rows":13,"n_cols":9,"rows_kept":13,"cut":false,"hidden":false,"merged":[]}
[null,{"$f":"(LOOKUP(dms_Model,dms_Model_List,dms_Worksheet_List))","v":"REGULATORY REPORTING STATEMENT"}]
[null,{"$f":"dms_TradingName","v":"Powerlink"}]
[null,{"$f":"CONCATENATE(\"REGULATORY PERIOD FROM \", FRCP_y1,\" TO \",dms_MultiYear_FinalYear_Result)","v":"REGULATORY PERIOD FROM 2027-28 TO 2031-32"}]
[null,"2.3 AUGEX PROJECTS"]
[]
[null,"2.3.4 - AUGEX - TOTAL EXPENDITURE"]
[null,null,"EXPENDITURE"]
[null,null,{"$f":"CONCATENATE(\"Forecast  ($0's, real \",dms_DollarReal,\")\")","v":"Forecast  ($0's, real June 2027)"}]
[null,"As incurred",{"$f":"dms_y4","v":"2025-26"},{"$f":"dms_y5","v":"2026-27"},{"$f":"dms_y6","v":"2027-28"},{"$f":"dms_y7","v":"2028-29"},{"$f":"dms_y8","v":"2029-30"},{"$f":"dms_y9","v":"2030-31"},{"$f":"dms_y10","v":"2031-32"}]
[null,"Substations",0,0,0,0,0,0,0]
[null,"Lines",12884397.171463817,8987521.8282925002,4980430.4656746304,0,0,0,0]
[null,"Other assets",13787180.863083616,12514151.921937454,22820112.785957102,35184348.761368409,48439898.725364923,72067777.31269604,75289630.096756279]
[null,"Total ",{"$f":"SUM(C10:C12)","v":26671578.034547433},21501673.750229955,27800543.251631733,35184348.761368409,48439898.725364923,72067777.31269604,75289630.096756279]

{"sheet":"2.5 Connections","index":6,"n_rows":106,"n_cols":9,"rows_kept":106,"cut":false,"hidden":false,"merged":[]}
[null,{"$f":"(LOOKUP(dms_Model,dms_Model_List,dms_Worksheet_List))","v":"REGULATORY REPORTING STATEMENT"}]
[null,{"$f":"dms_TradingName","v":"Powerlink"}]
[null,{"$f":"CONCATENATE(\"REGULATORY PERIOD FROM \", FRCP_y1,\" TO \",dms_MultiYear_FinalYear_Result)","v":"REGULATORY PERIOD FROM 2027-28 TO 2031-32"}]
[null,"2.5 CONNECTIONS EXPENDITURE"]
[]
[null,"2.5.1 - EXPENDITURE ON CONNECTION PROJECTS"]
[null,null,"EXPENDITURE"]
[null,null,{"$f":"CONCATENATE(\"Forecast  ($0's, real \",dms_DollarReal,\")\")","v":"Forecast  ($0's, real June 2027)"}]
[null,null,{"$f":"dms_y4","v":"2025-26"},{"$f":"dms_y5","v":"2026-27"},{"$f":"dms_y6","v":"2027-28"},{"$f":"dms_y7","v":"2028-29"},{"$f":"dms_y8","v":"2029-30"},{"$f":"dms_y9","v":"2030-31"},{"$f":"dms_y10","v":"2031-32"}]
[null,"DIRECT EXPENDITURE"]
[]
[]
[]
[]
[]
[]
[]
[]
[]
[]
[]
[]
[]
[]
[]
[]
[]
[]
[]
[]
[]
[]
[]
[]
[]
[]
[]
[]
[]
[]
[null,"DIRECT LABOUR EXPENDITURE"]
[null,{"$f":"IF(ISBLANK(B11),\"\",B11)","v":""}]
[null,""]
[null,""]
[null,""]
[null,""]
[null,""]
[null,""]
[null,""]
[null,""]
[null,""]
[null,""]
[null,""]
[null,""]
[null,""]
[null,""]
[null,""]
[null,""]
[null,""]
[null,""]
[null,""]
[null,""]
[null,""]
[null,""]
[null,""]
[null,""]
[null,""]
[null,""]
[null,""]
[null,""]
[null,{"$f":"IF(ISBLANK(B40),\"\",B40)","v":""}]
[]
[]
[]
[null,"2.5.2 - DESCRIPTION OF CONNECTION PROJECTS"]
[null,null,"CONNECTION RATING \n(MVA)","CONNECTION \nVOLTAGE \n(KV)","UNDERGROUND / OVERHEAD\n(drop down)","YEAR CONNECTION PROJECT COMPLETED "]
[null,{"$f":"IF(ISBLANK(B11),\"\",B11)","v":""}]
[null,""]
[null,""]
[null,""]
[null,""]
[null,""]
[null,""]
[null,""]
[null,""]
[null,""]
[null,""]
[null,""]
[null,""]
[null,""]
[null,""]
[null,""]
[null,""]
[null,""]
[null,""]
[null,""]
[null,""]
[null,""]
[null,""]
[null,""]
[null,{"$f":"IF(ISBLANK(B35),\"\",B35)","v":""}]
[null,""]
[null,""]
[null,""]
[null,""]
[null,{"$f":"IF(ISBLANK(B40),\"\",B40)","v":""}]

{"sheet":"2.6 Non-network","index":7,"n_rows":127,"n_cols":10,"rows_kept":127,"cut":false,"hidden":false,"merged":[]}
[null,{"$f":"(LOOKUP(dms_Model,dms_Model_List,dms_Worksheet_List))","v":"REGULATORY REPORTING STATEMENT"}]
[null,{"$f":"dms_TradingName","v":"Powerlink"}]
[null,{"$f":"CONCATENATE(\"REGULATORY PERIOD FROM \", FRCP_y1,\" TO \",dms_MultiYear_FinalYear_Result)","v":"REGULATORY PERIOD FROM 2027-28 TO 2031-32"}]
[null,"2.6 NON NETWORK EXPENDITURE"]
[]
[null,"2.6.1 - NON-NETWORK EXPENDITURE"]
[null,null,null,"EXPENDITURE"]
[null,null,null,{"$f":"CONCATENATE(\"Forecast  ($0's, real \",dms_DollarReal,\")\")","v":"Forecast  ($0's, real June 2027)"}]
[null,null,null,{"$f":"dms_y4","v":"2025-26"},{"$f":"dms_y5","v":"2026-27"},{"$f":"dms_y6","v":"2027-28"},{"$f":"dms_y7","v":"2028-29"},{"$f":"dms_y8","v":"2029-30"},{"$f":"dms_y9","v":"2030-31"},{"$f":"dms_y10","v":"2031-32"}]
[null,"OPEX"]
[null,"INFORMATION & COMMUNICATIONS TECHNOLOGY"]
[null,"Device expenditure",null,0,0,0,0,0,0,0]
[null,"Recurrent",null,22061490.440157596,23524516.554637749,24663888.768095594,25273412.722955979,25145638.940903552,25488630.364507988,26031603.173060756]
[null,"Non-recurrent",null,0,0,0,0,0,0,0]
[null,null,"Total IT and communications",{"$f":"SUM(D12:D14)","v":22061490.440157596},{"$f":"SUM(E12:E14)","v":23524516.554637749},24663888.768095594,25273412.722955979,25145638.940903552,25488630.364507988,26031603.173060756]
[null,"MOTOR VEHICLES"]
[null,"Car",null,530123.37482382997,565278.94798727555,592657.32682424295,607303.7940184261,604233.47251229885,612475.33502426406,625522.62113071943]
[null,"Light commercial vehicle",null,3774712.4706100747,4025035.6722149877,4219981.8166956594,4324271.1293233801,4302409.0846968582,4361094.7844461054,4453997.2217136966]
[null,"Elevated work platform (LCV)  ",null,0,0,0,0,0,0,0]
[null,"Elevated work platform (HCV)",null,0,0,0,0,0,0,0]
[null,"Heavy commercial vehicle",null,379531.60318368633,404700.55757661018,424301.57972738339,434787.43535869359,432589.29790833674,438489.90037361224,447830.85315620713]
[]
[null,"BUILDINGS AND PROPERTY"]
[null,"Total buildings and property expenditure",null,8855706.307565961,9442979.8476415724,9900335.4249881394,10145004.530473612,10093714.83675448,10231395.077429693,10449349.87692887]
[]
[null,"OTHER"]
[null,"Other expenditure",null,486784.86620949203,519066.41007571534,544206.55878848408,557655.65179618541,554836.33441732626,562404.41032331192,574385.0580807107]
[null,"Other - TNSP nominated"]
[]
[]
[]
[]
[]
[]
[]
[]
[]
[]
[]
[null,"CAPEX"]
[null,"IT & COMMUNICATIONS"]
[null,"Recurrent"]
[null,"Non Network - IT and Communications - Recurrent",null,1587517.5003419837,1573556.297672472,1645252.3004334937,2531658.8535346026,2296099.105952553,1261556.6008407881,2007390.0136044545]
[]
[]
[]
[]
[]
[]
[]
[]
[]
[null,"Non-recurrent"]
[null,"Non Network - IT and Communications - Non-Recurrent",null,11034697.522010216,10369091.564896485,1875194.7867590573,2040840.0000580535,2225194.9270098261,2015808.1776606673,1522970.8881472154]
[null,"Non Network - IT and Communications - Device expenditure",null,1889124.4379148046,1825325.3053000674,698252.11302896775,497489.79415854311,1021097.8011159489,1246512.0734645189,644739.65433774854]
[]
[]
[]
[]
[]
[]
[]
[]
[null,null,"Total IT and communications",{"$f":"SUM(D42:D63)","v":14511339.460267004},{"$f":"SUM(E42:E63)","v":13767973.167869024},4218699.200221519,5069988.6477512,5542391.8340783278,4523876.851965975,4175100.5560894185]
[null,"MOTOR VEHICLES"]
[null,"Car",null,302185.14119571703,432772.0797712222,703005.18864329392,571753.58053342055,636480.40097116632,242725.57664154656,577147.48223656614]
[null,"Light commercial vehicle",null,7105373.4886580436,3340459.4907341218,3235957.5963847185,4688199.5636506109,5836581.9038836425,5169155.7988477508,4289529.9868959729]
[null,"Elevated work platform (LCV)  ",null,0,0,0,0,0,0,0]
[null,"Elevated work platform (HCV)",null,0,0,0,0,0,0,0]
[null,"Heavy commercial vehicle",null,445225.86467520101,0,359593.44687636517,0,0,530400.33414263884,436574.71754266799]
[]
[null,"BUILDINGS AND PROPERTY"]
[null,"Total buildings and property expenditure",null,6369952.0487698233,14127252.135220448,46215203.047115318,72258146.001741067,35442266.323365383,5373615.884014627,6257384.6829359997]
[]
[null,"OTHER"]
[null,"Other expenditure",null,3723642.6664172458,3606433.9980935184,1931214.5680769694,1988083.3062907434,2068084.3705361306,2436497.0300719738,2217139.3429779699]
[null,"Other - TNSP nominated"]
[null,"Vehicles - Material Handling",null,1943907.4008261799,198353.86989514352,0,845044.60015945812,692217.38523700298,0,323634.10218872875]
[null,"Vehicles - Trailer",null,734264.79084571241,27048.254985701387,93494.296187854954,35959.344687636512,53939.017031454772,26969.508515727393,53939.017031454779]
[null,"Vehicles - Plant",null,81184.067783923994,0,0,0,0,0,0]
[null,"Vehicles - ATV",null,31571.581915970433,0,0,0,0,0,0]
[]
[]
[]
[]
[]
[]
[]
[]
[]
[]
[null,"2.6.3 - ANNUAL DESCRIPTOR METRICS"]
[null,"IT & COMMUNICATIONS"]
[null,null,null,"VOLUMES "]
[null,null,null,"(0's)"]
[null,null,null,{"$f":"dms_y4","v":"2025-26"},{"$f":"dms_y5","v":"2026-27"},{"$f":"dms_y6","v":"2027-28"},{"$f":"dms_y7","v":"2028-29"},{"$f":"dms_y8","v":"2029-30"},{"$f":"dms_y9","v":"2030-31"},{"$f":"dms_y10","v":"2031-32"}]
[null,"Number of devices",null,458,497,355,288,589,715,352]
[]
[null,"MOTOR VEHICLES"]
[null,null,null,"VOLUMES"]
[null,null,null,"  (0's or %)"]
[null,null,"Units",{"$f":"dms_y4","v":"2025-26"},{"$f":"dms_y5","v":"2026-27"},{"$f":"dms_y6","v":"2027-28"},{"$f":"dms_y7","v":"2028-29"},{"$f":"dms_y8","v":"2029-30"},{"$f":"dms_y9","v":"2030-31"},{"$f":"dms_y10","v":"2031-32"}]
[null,"CAR"]
[null,"Number purchased","0's",5,7,10,9,9,5,8]
[null,"Number leased","0's",0,0,0,0,0,0,0]
[null,"Number in fleet","0's",65,65,65,65,65,65,65]
[null,"Proportion of total fleet expenditure allocated as regulatory expenditure","%",0.4662756598240469,0.44851904090267986,0.4061302681992337,0.4061302681992337,0.38733252131546891,0.37902264600715135,0.37106184364060679]
[null,"LIGHT COMMERCIAL VEHICLE"]
[null,"Number purchased","0's",108,38,37,50,70,52,51]
[null,"Number leased","0's",0,0,0,0,0,0,0]
[null,"Number in fleet","0's",337,337,337,337,337,337,337]
[null,"Proportion of total fleet expenditure allocated as regulatory expenditure","%",0.4662756598240469,0.44851904090267986,0.4061302681992337,0.4061302681992337,0.38733252131546891,0.37902264600715135,0.37106184364060679]
[null,"ELEVATED WORK PLATFORM (LCV) "]
[null,"Number purchased","0's",0,0,0,0,0,0,0]
[null,"Number leased","0's",0,0,0,0,0,0,0]
[null,"Number in fleet","0's",0,0,0,0,0,0,0]
[null,"Proportion of total fleet expenditure allocated as regulatory expenditure","%",0,0,0,0,0,0,0]
[null,"ELEVATED WORK PLATFORM (HCV)"]
[null,"Number purchased","0's",0,0,0,0,0,0,0]
[null,"Number leased","0's",0,0,0,0,0,0,0]
[null,"Number in fleet","0's",0,0,0,0,0,0,0]
[null,"Proportion of total fleet expenditure allocated as regulatory expenditure","%",0,0,0,0,0,0,0]
[null,"HEAVY COMMERCIAL VEHICLE "]
[null,"Number purchased","0's",2,0,2,0,0,2,2]
[null,"Number leased","0's",0,0,0,0,0,0,0]
[null,"Number in fleet","0's",11,11,11,11,11,11,11]
[null,"Proportion of total fleet expenditure allocated as regulatory expenditure","%",0.4662756598240469,0.44851904090267986,0.4061302681992337,0.4061302681992337,0.38733252131546891,0.37902264600715135,0.37106184364060679]

{"sheet":"2.10 Overheads","index":8,"n_rows":44,"n_cols":10,"rows_kept":44,"cut":false,"hidden":false,"merged":[]}
[null,{"$f":"(LOOKUP(dms_Model,dms_Model_List,dms_Worksheet_List))","v":"REGULATORY REPORTING STATEMENT"}]
[null,{"$f":"dms_TradingName","v":"Powerlink"}]
[null,{"$f":"CONCATENATE(\"REGULATORY PERIOD FROM \", FRCP_y1,\" TO \",dms_MultiYear_FinalYear_Result)","v":"REGULATORY PERIOD FROM 2027-28 TO 2031-32"}]
[null,"2.10 OVERHEADS"]
[]
[null,"2.10.1 - NETWORK OVERHEADS EXPENDITURE"]
[null,null,null,"EXPENDITURE"]
[null,null,null,{"$f":"CONCATENATE(\"Forecast  ($0's, real \",dms_DollarReal,\")\")","v":"Forecast  ($0's, real June 2027)"}]
[null,null,null,{"$f":"dms_y4","v":"2025-26"},{"$f":"dms_y5","v":"2026-27"},{"$f":"dms_y6","v":"2027-28"},{"$f":"dms_y7","v":"2028-29"},{"$f":"dms_y8","v":"2029-30"},{"$f":"dms_y9","v":"2030-31"},{"$f":"dms_y10","v":"2031-32"}]
[null,"OPEX"]
[null,"Prescribed transmission services","Total  ",107799024.60484476,110966036.47182846,113572342.3603166,114532034.40564199,115841632.51472656,117597570.38636565,119753801.90537077]
[null,"CAPEX"]
[null,"Prescribed transmission services","Total  ",0,0,0,0,0,0,0]
[null,"OTHER TRANSMISSION SERVICES"]
[null,"Negotiated transmission services","Total  "]
[null,"Non-regulated transmission services","Total  "]
[]
[]
[]
[null,"2.10.2 - CORPORATE OVERHEADS EXPENDITURE"]
[null,null,null,"EXPENDITURE"]
[null,null,null,{"$f":"CONCATENATE(\"Forecast  ($0's, real \",dms_DollarReal,\")\")","v":"Forecast  ($0's, real June 2027)"}]
[null,null,null,{"$f":"dms_y4","v":"2025-26"},{"$f":"dms_y5","v":"2026-27"},{"$f":"dms_y6","v":"2027-28"},{"$f":"dms_y7","v":"2028-29"},{"$f":"dms_y8","v":"2029-30"},{"$f":"dms_y9","v":"2030-31"},{"$f":"dms_y10","v":"2031-32"}]
[null,"OPEX"]
[null,"Prescribed transmission services","Total",78005126.332001597,82899141.443144605,108664190.97992852,115291281.98338267,110543302.456734,111609541.62119105,114607794.31155992]
[null,"CAPEX"]
[null,"Prescribed transmission services","Total",52265263.807260476,54208207.488291107,72448503.747131094,70704536.305834904,60207748.684418887,75145895.971503735,72426194.311247647]
[null,"OTHER TRANSMISSION SERVICES"]
[null,"Negotiated transmission services","Total"]
[null,"Non-regulated transmission services","Total"]
[]
[]
[]
[null,"2.10.3 - CORPORATE OVERHEADS EXPENDITURE - EASEMENT LEVY ONLY"]
[null,null,null,"EXPENDITURE"]
[null,null,null,{"$f":"CONCATENATE(\"Forecast  ($0's, real \",dms_DollarReal,\")\")","v":"Forecast  ($0's, real June 2027)"}]
[null,null,null,{"$f":"dms_y4","v":"2025-26"},{"$f":"dms_y5","v":"2026-27"},{"$f":"dms_y6","v":"2027-28"},{"$f":"dms_y7","v":"2028-29"},{"$f":"dms_y8","v":"2029-30"},{"$f":"dms_y9","v":"2030-31"},{"$f":"dms_y10","v":"2031-32"}]
[null,"OPEX"]
[null,"Prescribed transmission services","Total"]
[null,"CAPEX"]
[null,"Prescribed transmission services","Total"]
[null,"OTHER TRANSMISSION SERVICES"]
[null,"Negotiated transmission services","Total"]
[null,"Non-regulated transmission services","Total"]

{"sheet":"2.14 Forecast price changes","index":9,"n_rows":20,"n_cols":9,"rows_kept":20,"cut":false,"hidden":false,"merged":[[6,2,6,3],[6,4,6,8]]}
[null,{"$f":"(LOOKUP(dms_Model,dms_Model_List,dms_Worksheet_List))","v":"REGULATORY REPORTING STATEMENT"}]
[null,{"$f":"dms_TradingName","v":"Powerlink"}]
[null,{"$f":"CONCATENATE(\"REGULATORY PERIOD FROM \", FRCP_y1,\" TO \",dms_MultiYear_FinalYear_Result)","v":"REGULATORY PERIOD FROM 2027-28 TO 2031-32"}]
[null,"2.14 FORECAST PRICE CHANGES"]
[]
[null,"2.14.2 - FORECAST CAPEX AND OPEX PRICE CHANGES"]
[null,null,"Price changes\n(% YoY real)\nCurrent regulatory period",null,"Price changes\n(%YoY real)\nForthcoming regulatory period "]
[null,null,"FORECAST"]
[null,null,{"$f":"dms_y4","v":"2025-26"},{"$f":"dms_y5","v":"2026-27"},{"$f":"dms_y6","v":"2027-28"},{"$f":"dms_y7","v":"2028-29"},{"$f":"dms_y8","v":"2029-30"},{"$f":"dms_y9","v":"2030-31"},{"$f":"dms_y10","v":"2031-32"}]
[null,"OPEX"]
[null,"Internal labour",1.7000000000000001E-2,1.15E-2,0.01,0.01,1.2500000000000001E-2,1.2049233791642525E-2,1.0599096460750763E-2]
[null,"Non-labour",0,0,0,0,0,0,0]
[]
[]
[]
[]
[null,"CAPEX"]
[null,"Internal labour",1.7000000000000001E-2,1.15E-2,0.01,0.01,1.2500000000000001E-2,1.2E-2,1.06E-2]
[null,"External labour",4.0000000000000001E-3,7.0000000000000001E-3,8.9999999999999993E-3,1.0999999999999999E-2,1.2999999999999999E-2,1.0999999999999999E-2,0.01]
[null,"Materials",0,0,0,0,0,0,0]

{"sheet":"2.16 Opex Summary","index":10,"n_rows":60,"n_cols":13,"rows_kept":60,"cut":false,"hidden":false,"merged":[[8,10,8,11],[23,1,23,8],[5,10,5,12],[6,1,6,8],[6,10,6,11],[6,12,7,12],[7,1,7,8],[7,10,7,11]]}
[null,{"$f":"(LOOKUP(dms_Model,dms_Model_List,dms_Worksheet_List))","v":"REGULATORY REPORTING STATEMENT"}]
[null,{"$f":"dms_TradingName","v":"Powerlink"}]
[null,{"$f":"CONCATENATE(\"REGULATORY PERIOD FROM \", FRCP_y1,\" TO \",dms_MultiYear_FinalYear_Result)","v":"REGULATORY PERIOD FROM 2027-28 TO 2031-32"}]
[null,"2.16 OPEX SUMMARY"]
[]
[null,"Instructions",null,null,null,null,null,null,null,null,"IMPORTANT!"]
[null,{"$f":"CONCATENATE(\"Complete the tables below in accordance with the regulatory information notice.\n\n\",dms_TradingName, \"'s total forecast opex must reconcile to Table 2.16.1. If \",dms_TradingName,\" did not forecast its total opex using a Base Year approach, total forecast opex must reconcile to Table 2.16.2\")","v":"Complete the tables below in accordance with the regulatory information notice.\n\nPowerlink's total forecast opex must reconcile to Table 2.16.1. If Powerlink did not forecast its total opex using a Base Year approach, total forecast opex must reconcile to Table 2.16.2"},null,null,null,null,null,null,null,null,{"$f":"CONCATENATE(\"Has \",dms_TradingName,\" used a base-step-trend model to derive its opex forecast? \")","v":"Has Powerlink used a base-step-trend model to derive its opex forecast? "},null,"Yes"]
[null,"The total step changes and category specific forecasts in Table 2.16.1 must reconcile (in each year) to the total step changes and category specific forecasts for each year in Tables 2.17.1 and 2.17.5 of worksheet 2.17 Step Changes.\")",null,null,null,null,null,null,null,null,"Yes /  No"]
[null,null,null,null,null,null,null,null,null,null,"Please nominate the base year.",null,"2025-26"]
[]
[null,"2.16.1 - PRESCRIBED TRANSMISSION SERVICES - OPEX BY DRIVER"]
[null,null,"EXPENDITURE"]
[null,null,{"$f":"CONCATENATE(\"Forecast  ($0's, real \",dms_DollarReal,\")\")","v":"Forecast  ($0's, real June 2027)"}]
[null,null,{"$f":"CRCP_y1","v":"2022-23"},{"$f":"CRCP_y2","v":"2023-24"},{"$f":"CRCP_y3","v":"2024-25"},{"$f":"dms_y4","v":"2025-26"},{"$f":"dms_y5","v":"2026-27"},{"$f":"dms_y6","v":"2027-28"},{"$f":"dms_y7","v":"2028-29"},{"$f":"dms_y8","v":"2029-30"},{"$f":"dms_y9","v":"2030-31"},{"$f":"dms_y10","v":"2031-32"}]
[null,"Base year total opex, excluding category specific",null,null,null,318843432.88141847,318843432.88141847,318843432.88141847,318843432.88141847,318843432.88141847,318843432.88141847,318843432.88141847]
[null,"Increment from base year to final year",null,null,null,null,-25220.488176273648,-25220.488176273648,-25220.488176273648,-25220.488176273648,-25220.488176273648,-25220.488176273648]
[null,"Price growth",null,null,null,null,null,2238829.9647488147,4497458.3760391185,7349418.4898159951,10141049.582044045,12638668.445169391]
[null,"Output growth",null,null,null,null,null,1352114.9706442135,3270638.7476263014,5690977.8871782413,9393438.6291077323,14716059.474362615]
[null,"Productivity growth",null,null,null,null,null,-1341040.0679473777,-2690149.9450133815,-4049982.8675794988,-5424793.3195703197,-6815430.5745875211]
[null,"Step changes",null,null,null,null,null,16545508.126191201,22009452.510644749,15694172.65853258,15012449.296355519,15846875.381663]
[null,"Category specific",null,null,null,428792.25556795247,428792.25556795247,19320313,19849311,20402992,20929180,21523013]
[null,"Total opex",{"$f":"SUM(C15:C21)","v":0},0,0,319272225.13698643,319247004.64881015,356933938.38687903,365754923.08253896,363905790.56118947,368869536.5811792,376727398.11984968]
[]
[]
[]
[null,"2.16.2 - PRESCRIBED TRANSMISSION SERVICES - OPEX BY CATEGORY"]
[null,null,"EXPENDITURE"]
[null,null,{"$f":"CONCATENATE(\"Forecast  ($0's, real \",dms_DollarReal,\")\")","v":"Forecast  ($0's, real June 2027)"}]
[null,null,{"$f":"CRCP_y1","v":"2022-23"},{"$f":"CRCP_y2","v":"2023-24"},{"$f":"CRCP_y3","v":"2024-25"},{"$f":"CRCP_y4","v":"2025-26"},{"$f":"CRCP_y5","v":"2026-27"},{"$f":"FRCP_y1","v":"2027-28"},{"$f":"FRCP_y2","v":"2028-29"},{"$f":"FRCP_y3","v":"2029-30"},{"$f":"FRCP_y4","v":"2030-31"},{"$f":"FRCP_y5","v":"2031-32"}]
[]
[]
[]
[]
[]
[]
[]
[]
[]
[]
[]
[]
[]
[]
[]
[]
[]
[]
[]
[]
[]
[]
[]
[]
[]
[]
[]
[]
[]
[]
[null,"Total opex",{"$f":"SUM(C30:C59)","v":0},0,0,0,0,0,0,0,0,0]

{"sheet":"2.17 Step Changes","index":11,"n_rows":69,"n_cols":10,"rows_kept":69,"cut":false,"hidden":false,"merged":[[23,1,23,2],[24,1,24,2],[46,1,46,2],[67,1,67,2],[68,1,68,2]]}
[null,{"$f":"(LOOKUP(dms_Model,dms_Model_List,dms_Worksheet_List))","v":"REGULATORY REPORTING STATEMENT"}]
[null,{"$f":"dms_TradingName","v":"Powerlink"}]
[null,{"$f":"CONCATENATE(\"REGULATORY PERIOD FROM \", FRCP_y1,\" TO \",dms_MultiYear_FinalYear_Result)","v":"REGULATORY PERIOD FROM 2027-28 TO 2031-32"}]
[null,"2.17 STEP CHANGES"]
[]
[null,"2.17.1 - STEP CHANGES FOR PRESCRIBED TRANSMISSION SERVICES - FORECAST OPEX "]
[null,null,null,"EXPENDITURE"]
[null,null,null,{"$f":"CONCATENATE(\"Forecast  ($0's, real \",dms_DollarReal,\")\")","v":"Forecast  ($0's, real June 2027)"}]
[null,"Step change","Description",{"$f":"dms_y4","v":"2025-26"},{"$f":"dms_y5","v":"2026-27"},{"$f":"dms_y6","v":"2027-28"},{"$f":"dms_y7","v":"2028-29"},{"$f":"dms_y8","v":"2029-30"},{"$f":"dms_y9","v":"2030-31"},{"$f":"dms_y10","v":"2031-32"}]
[null,"Overnight Network Monitoring","Network Operations",0,0,1759212.7112199999,1756110.0531300001,1750314.49948,1744047.4234,1737499.83595]
[null,"Security Uplift","Routine",0,0,3261953.1287336997,3268603.9373581498,3261216.54377328,3292623.61061212,3281593.2562416]
[null,"Cloud Based Services (IT & OT)","IT Support",0,0,11524342.286237501,16984738.5201566,10682641.6152793,9975778.2623434011,10827782.289471401]
[]
[]
[]
[]
[]
[]
[]
[]
[]
[]
[]
[null,"Total",null,{"$f":"SUM(D10:D23)","v":0},{"$f":"SUM(E10:E23)","v":0},16545508.126191201,22009452.510644749,15694172.65853258,15012449.296355521,15846875.381663002]
[null,"Check",null,null,null,{"$f":"IF(ROUND(F$24,0)-ROUND('2.16 Opex Summary'!H20,0)=0,\"OK\",\"Error\")","v":"OK"},{"$f":"IF(ROUND(G$24,0)-ROUND('2.16 Opex Summary'!I20,0)=0,\"OK\",\"Error\")","v":"OK"},{"$f":"IF(ROUND(H$24,0)-ROUND('2.16 Opex Summary'!J20,0)=0,\"OK\",\"Error\")","v":"OK"},{"$f":"IF(ROUND(I$24,0)-ROUND('2.16 Opex Summary'!K20,0)=0,\"OK\",\"Error\")","v":"OK"},{"$f":"IF(ROUND(J$24,0)-ROUND('2.16 Opex Summary'!L20,0)=0,\"OK\",\"Error\")","v":"OK"}]
[]
[]
[null,"2.17.2 - STEP CHANGES FOR PRESCRIBED TRANSMISSION SERVICES - FORECAST CAPEX"]
[null,null,null,"EXPENDITURE"]
[null,null,null,{"$f":"CONCATENATE(\"Forecast  ($0's, real \",dms_DollarReal,\")\")","v":"Forecast  ($0's, real June 2027)"}]
[null,"Step change","Description",{"$f":"dms_y4","v":"2025-26"},{"$f":"dms_y5","v":"2026-27"},{"$f":"dms_y6","v":"2027-28"},{"$f":"dms_y7","v":"2028-29"},{"$f":"dms_y8","v":"2029-30"},{"$f":"dms_y9","v":"2030-31"},{"$f":"dms_y10","v":"2031-32"}]
[]
[]
[]
[]
[]
[]
[]
[]
[]
[]
[]
[]
[]
[]
[]
[null,"Total",null,{"$f":"SUM(D32:D46)","v":0},0,0,0,0,0,0]
[]
[]
[null,"2.17.5 - CATEGORY SPECIFIC OPEX FOR PRESCRIBED TRANSMISSION SERVICES"]
[null,null,null,"EXPENDITURE"]
[null,null,null,{"$f":"CONCATENATE(\"Forecast  ($0's, real \",dms_DollarReal,\")\")","v":"Forecast  ($0's, real June 2027)"}]
[null,"Category","Description",{"$f":"dms_y4","v":"2025-26"},{"$f":"dms_y5","v":"2026-27"},{"$f":"dms_y6","v":"2027-28"},{"$f":"dms_y7","v":"2028-29"},{"$f":"dms_y8","v":"2029-30"},{"$f":"dms_y9","v":"2030-31"},{"$f":"dms_y10","v":"2031-32"}]
[null,"Debt Raising","Zero Base",428792.25556795247,566501.15504154097,4299471,4348604,4406009,4418948,4481979]
[null,"AEMO Participant & Cyber Fees","AEMO Participant Fee",0,0,15020842,15500707,15996983,16510231.999999998,17041034]
[]
[]
[]
[]
[]
[]
[]
[]
[]
[]
[]
[]
[null,"Total",null,{"$f":"SUM(D54:D67)","v":428792.25556795247},{"$f":"SUM(E54:E67)","v":566501.15504154097},19320313,19849311,20402992,20929180,21523013]
[null,"Check",null,null,null,{"$f":"IF(ROUND(F$68,0)-ROUND('2.16 Opex Summary'!H21,0)=0,\"OK\",\"Error\")","v":"OK"},{"$f":"IF(ROUND(G$68,0)-ROUND('2.16 Opex Summary'!I21,0)=0,\"OK\",\"Error\")","v":"OK"},{"$f":"IF(ROUND(H$68,0)-ROUND('2.16 Opex Summary'!J21,0)=0,\"OK\",\"Error\")","v":"OK"},{"$f":"IF(ROUND(I$68,0)-ROUND('2.16 Opex Summary'!K21,0)=0,\"OK\",\"Error\")","v":"OK"},{"$f":"IF(ROUND(J$68,0)-ROUND('2.16 Opex Summary'!L21,0)=0,\"OK\",\"Error\")","v":"OK"}]

{"sheet":"3.1 Revenue","index":12,"n_rows":34,"n_cols":9,"rows_kept":34,"cut":false,"hidden":false,"merged":[]}
[null,{"$f":"(LOOKUP(dms_Model,dms_Model_List,dms_Worksheet_List))","v":"REGULATORY REPORTING STATEMENT"}]
[null,{"$f":"dms_TradingName","v":"Powerlink"}]
[null,{"$f":"CONCATENATE(\"REGULATORY PERIOD FROM \", FRCP_y1,\" TO \",dms_MultiYear_FinalYear_Result)","v":"REGULATORY PERIOD FROM 2027-28 TO 2031-32"}]
[null,"3.1 REVENUE"]
[]
[]
[null,"3.1.1 - REVENUE GROUPING BY CHARGEABLE QUANTITY"]
[null,null,"REVENUE"]
[null,null,{"$f":"CONCATENATE(\"Forecast  ($0's, real \",dms_DollarReal,\")\")","v":"Forecast  ($0's, real June 2027)"}]
["Disaggregation of this table now collected in 8.8.1 - Revenue from Prescribed Services","REVENUE FROM PRESCRIBED SERVICES",{"$f":"dms_y4","v":"2025-26"},{"$f":"dms_y5","v":"2026-27"},{"$f":"dms_y6","v":"2027-28"},{"$f":"dms_y7","v":"2028-29"},{"$f":"dms_y8","v":"2029-30"},{"$f":"dms_y9","v":"2030-31"},{"$f":"dms_y10","v":"2031-32"}]
["TREV01","Total",850623605.28999996,927116683.86999989,975407073.0999999,1004366920.8099999,1046586896.0399998,1108070660.51,1189031332.6299999]
[]
[]
[null,"3.1.2 - REVENUE GROUPING BY TYPE OF CONNECTED EQUIPMENT"]
[null,null,"REVENUE"]
[null,null,{"$f":"CONCATENATE(\"Forecast  ($0's, real \",dms_DollarReal,\")\")","v":"Forecast  ($0's, real June 2027)"}]
[null,null,{"$f":"dms_y4","v":"2025-26"},{"$f":"dms_y5","v":"2026-27"},{"$f":"dms_y6","v":"2027-28"},{"$f":"dms_y7","v":"2028-29"},{"$f":"dms_y8","v":"2029-30"},{"$f":"dms_y9","v":"2030-31"},{"$f":"dms_y10","v":"2031-32"}]
["TREV0201","From other connected transmission networks",11881017.060000001,12805975.880000001,13645315.99,14531145.689999999,15232629.27,16288945.92,17532764.18]
["TREV0202","From distribution networks",639857122.38,689671164.73000002,734874176.15999997,782580903.5,820359593.76999998,877247967.23000002,944234317.83000004]
["TREV0203","From directly connected end–users",114583862.23,123504424.59999999,131599256.17,140142446.33000001,146907750.78999999,157095165.00999999,169090897.34]
["TREV0204","From generators",7018570.3600000003,7564978.8399999999,8060809.0899999999,8584102.5099999998,8998495.6400000006,9622502.2200000007,10357273.15]
["TREV0205","Other revenue",77283033.25999999,93570139.819999814,87227515.689999998,58528322.770000003,55088426.570000008,47816080.130000003,47816080.130000003]
["TREV02","Total",{"$f":"SUM(C18:C22)","v":850623605.28999996},927116683.86999989,975407073.0999999,1004366920.8000001,1046586896.04,1108070660.51,1189031332.6300001]
[]
[]
[null,"3.1.3 - REVENUE (penalties) ALLOWED (deducted) THROUGH INCENTIVE SCHEMES"]
[null,null,"REVENUE"]
[null,null,{"$f":"CONCATENATE(\"Forecast  ($0's, real \",dms_DollarReal,\")\")","v":"Forecast  ($0's, real June 2027)"}]
[null,null,{"$f":"dms_y4","v":"2025-26"},{"$f":"dms_y5","v":"2026-27"},{"$f":"dms_y6","v":"2027-28"},{"$f":"dms_y7","v":"2028-29"},{"$f":"dms_y8","v":"2029-30"},{"$f":"dms_y9","v":"2030-31"},{"$f":"dms_y10","v":"2031-32"}]
["TREV0301","EBSS",2723545.7640130953,7013715.5501246033,-79757872.16100502,-74166350.495923981,-50274785.899798505,-20789741.318723883,0]
["TREV0302","STPIS",7294232,-7430000,0,0,0,0,0]
["TREV0312","CESS",-345467.92934229068,-345467.92934229068,-27275814.939708564,-27275814.939708564,-27275814.939708564,-27275814.939708564,-27275814.939708564]
["TREV0303","Other",null,null,-29067.035367046294,-29067.035367046294,-29067.035367046294,-29067.035367046294,-29067.035367046294]
["TREV03","Total",{"$f":"SUM(C30:C33)","v":9672309.8346708044},-761752.3792176873,-107062754.13608062,-101471232.47099958,-77579667.874874115,-48094623.293799497,-27304881.97507561]

{"sheet":"3.2 Operating expenditure","index":13,"n_rows":92,"n_cols":9,"rows_kept":92,"cut":false,"hidden":false,"merged":[]}
[null,{"$f":"(LOOKUP(dms_Model,dms_Model_List,dms_Worksheet_List))","v":"REGULATORY REPORTING STATEMENT"}]
[null,{"$f":"dms_TradingName","v":"Powerlink"}]
[null,{"$f":"CONCATENATE(\"REGULATORY PERIOD FROM \", FRCP_y1,\" TO \",dms_MultiYear_FinalYear_Result)","v":"REGULATORY PERIOD FROM 2027-28 TO 2031-32"}]
[null,"3.2 OPERATING EXPENDITURE"]
[]
[]
[null,"3.2.1 - OPEX CATEGORIES"]
[null,null,"EXPENDITURE"]
[null,null,{"$f":"CONCATENATE(\"Forecast  ($0's, real \",dms_DollarReal,\")\")","v":"Forecast  ($0's, real June 2027)"}]
[null,null,{"$f":"dms_y4","v":"2025-26"},{"$f":"dms_y5","v":"2026-27"},{"$f":"dms_y6","v":"2027-28"},{"$f":"dms_y7","v":"2028-29"},{"$f":"dms_y8","v":"2029-30"},{"$f":"dms_y9","v":"2030-31"},{"$f":"dms_y10","v":"2031-32"}]
[null,"OPEX CATEGORIES AND COST ALLOCATIONS - approved CAM"]
[null,"Field Maintenance- Routine",39565688.430998795,40412266.904787719,39841752.230752632,40192687.608648434,40678190.546440423,41313448.703394666,42111306.273541182]
[null,"Field Maintenance - Condition-Based",45434611.958017692,50660094.437765956,45751625.312640496,46154616.220907956,46712135.588263988,47441623.91511865,48357830.621861361]
[null,"Field Maintenance - Corrective",31071378.689953379,37592992.326503485,31288174.686810561,31563768.173356827,31945039.073306609,32443914.425748169,33070480.920247618]
[null,"Operational Refurbishment",42393419.618758298,45471091.816742219,42689213.498976596,43065229.974973209,43585431.457220882,44266091.056028746,45120970.930701263]
[null,"Maintenance Support",30018332.889538515,31213244.814337704,33489734.542192481,33762638.647906996,34123600.43219389,34636975.375302695,35231276.435318276]
[null,"Network Operations",36619713.072509967,41127445.730589524,38634434.471625604,38956137.304231137,39399695.192485958,39981386.328613132,40713289.56686908]
[null,"Asset Management Support",41160978.642796278,38625345.926901229,41448173.346498534,41813258.453503862,42318336.890046723,42979208.68244981,43809235.903183423]
[null,"Corporate Support",35533643.993407756,36470582.270575136,47305917.079510592,53081485.708435237,47215415.301096089,47079072.469558097,48647626.314957924]
[null,"Self Insurance",1963913.5013963184,2258172.9190460183,1977616.4203921256,1995035.7236849049,2019134.5277828067,2050666.6992371301,2090269.782523161]
[null,"Insurance Premiums",9120056.7379434295,9856848.5014624335,9183690.5989196636,9264582.6719425544,9376493.1305921767,9522922.7938790414,9706832.302270988]
[null,"AEMC Levy",5961695.3460979434,6190441.8784258794,6003292.2027554167,6056170.5903722821,6129325.4050496295,6225045.0992611861,6345265.0158459004]
[null,"Network Support",0,0,0,0,0,0,0]
[null,"Debt Raising Costs",428792.25556795247,566501.15504154097,4299471,4348604,4406009,4418948,4481979]
[null,"AEMO Participant & Cyber Fees",0,0,15020842,15500707,15996983,16510231.999999998,17041034]
[]
[]
[]
[]
[]
[]
[]
[]
[]
[]
[]
[]
[]
[]
[]
[]
[]
[]
[]
[]
[]
[null,"Total ",{"$f":"SUM(C12:C46)","v":319272225.13698632},340445028.68217885,356933937.39107466,365754922.07796335,363905789.54447913,368869535.54859132,376727397.06732017]
[]
[]
[]
[null,"3.2.3 - OPEX CATEGORIES - Revised CAM"]
[null,null,"EXPENDITURE"]
[null,null,{"$f":"CONCATENATE(\"Forecast  ($0's, real \",dms_DollarReal,\")\")","v":"Forecast  ($0's, real June 2027)"}]
[null,null,{"$f":"dms_y1","v":"2022-23"},{"$f":"dms_y2","v":"2023-24"},{"$f":"dms_y3","v":"2024-25"},{"$f":"dms_y4","v":"2025-26"},{"$f":"dms_y5","v":"2026-27"},{"$f":"dms_y6","v":"2027-28"},{"$f":"dms_y7","v":"2028-29"}]
[null,"OPEX CATEGORIES AND COST ALLOCATIONS - revised CAM"]
[]
[]
[]
[]
[]
[]
[]
[]
[]
[]
[]
[]
[]
[]
[]
[]
[]
[]
[]
[]
[]
[]
[]
[]
[]
[]
[]
[]
[]
[]
[]
[]
[]
[]
[]
[]
[null,"Total",{"$f":"SUM(C56:C91)","v":0},0,0,0,0,0,0]

{"sheet":"3.3 Assets (RAB)","index":14,"n_rows":91,"n_cols":9,"rows_kept":91,"cut":false,"hidden":false,"merged":[]}
[null,{"$f":"(LOOKUP(dms_Model,dms_Model_List,dms_Worksheet_List))","v":"REGULATORY REPORTING STATEMENT"}]
[null,{"$f":"dms_TradingName","v":"Powerlink"}]
[null,{"$f":"CONCATENATE(\"REGULATORY PERIOD FROM \", FRCP_y1,\" TO \",dms_MultiYear_FinalYear_Result)","v":"REGULATORY PERIOD FROM 2027-28 TO 2031-32"}]
[null,"3.3 ASSETS"]
[]
[null,"3.3.1 - Benchmarking ASSET BASE VALUES"]
[null,null,"VALUES"]
[null,null,{"$f":"CONCATENATE(\"Forecast  ($0's, real \",dms_DollarReal,\")\")","v":"Forecast  ($0's, real June 2027)"}]
[null,null,{"$f":"dms_y4","v":"2025-26"},{"$f":"dms_y5","v":"2026-27"},{"$f":"dms_y6","v":"2027-28"},{"$f":"dms_y7","v":"2028-29"},{"$f":"dms_y8","v":"2029-30"},{"$f":"dms_y9","v":"2030-31"},{"$f":"dms_y10","v":"2031-32"}]
[null,"For total asset base:"]
["TRAB0101","Opening value",{"$f":"C25+C33+C41+C49+C57+C65","v":7821152927.2476263},{"$f":"D25+D33+D41+D49+D57+D65","v":8046333252.5197115},8322630683.3483925,8417738604.1593924,8528859293.8570652,8553906092.3760672,8675917488.4851704]
["TRAB0102","Inflation addition",{"$f":"C26+C34+C42+C50+C58+C66","v":258098046.5991717},257482664.08063081,0,0,0,0,0]
["TRAB0103","Straight line depreciation",393664647.08277476,403593248.54716492,427294174.93173248,398505377.41365832,408161669.67272353,420583714.62864256,434739277.52366471]
["TRAB0104","Gross capex",363255825.93688858,389076043.14315683,523659909.60074699,511161385.22489864,434948071.77204484,544020439.93557608,524741624.90282559]
["TRAB0106","Disposals ",2508900.1812,3799205.5175999999,1257813.8580131645,1535318.1135684277,1739603.580317656,1425329.1978303858,1354497.6187174288]
["TRAB0108","Capex timing adjustment",0,37131177.669655867,0,0,0,0,0]
["TRAB0107","Closing value ",8046333252.5197115,8322630683.3483915,8417738604.1593924,8528859293.8570652,8553906092.3760672,8675917488.4851704,8764565338.245615]
[]
[]
[null,"3.3.2 - Benchmarking ASSET VALUE ROLL FORWARD"]
[null,null,"VALUES"]
[null,null,{"$f":"CONCATENATE(\"Forecast  ($0's, real \",dms_DollarReal,\")\")","v":"Forecast  ($0's, real June 2027)"}]
[null,null,{"$f":"dms_y4","v":"2025-26"},{"$f":"dms_y5","v":"2026-27"},{"$f":"dms_y6","v":"2027-28"},{"$f":"dms_y7","v":"2028-29"},{"$f":"dms_y8","v":"2029-30"},{"$f":"dms_y9","v":"2030-31"},{"$f":"dms_y10","v":"2031-32"}]
[null,"For overhead assets:"]
["TRAB0201","Opening value",3798695910.4219141,3807973961.1465364,3779247515.6606922,3665948342.3181577,3546118306.2504029,3445722464.2084942,3395044835.2228961]
["TRAB0202","Inflation addition",125356965.04392317,121855166.75668918,0,0,0,0,0]
["TRAB0203","Straight line depreciation",150501439.02297637,155894279.44843417,156856262.67148831,157194716.87038872,157214768.35724768,157214768.35724768,158092385.00558406]
["TRAB0204","Gross capex",34422524.703675315,20092206.806299806,43557089.328953579,37364680.802633874,56818926.315339267,106537139.37164988,75931002.350416392]
["TRAB0206","Disposals ",0,0,0,0,0,0,0]
["TRAB0208","Capex timing adjustment",0,-14779539.600399043,0,0,0,0,0]
["TRAB0207","Closing value ",{"$f":"(C25+C26+ C28+C30)- C27-C29","v":3807973961.1465364},{"$f":"(D25+D26+ D28+D30)- D27-D29","v":3779247515.6606917},3665948342.3181577,3546118306.2504029,3445722464.2084942,3395044835.2228961,3312883452.567728]
[null,"For underground assets:"]
["TRAB0301","Opening value",45254550.188909769,46503880.687210783,60144486.17523279,110371443.49996182,137381979.6004146,146706729.94150662,158821865.02684131]
["TRAB0302","Inflation addition",1493400.1562340227,1488124.181990745,0,0,0,0,0]
["TRAB0303","Straight line depreciation",3249340.2843240798,3380909.6369801611,3252873.5656367275,3252873.5656367275,3252873.5656367275,3252873.5656367275,6253126.3799848948]
["TRAB0305","Gross capex",3005270.6263910681,16507358.139089845,53479830.890365757,30263409.666089509,12577623.906728746,15368008.650971409,3513799.2403612328]
["TRAB0306","Disposals ",0,0,0,0,0,0,0]
["TRAB0308","Capex timing adjustment",0,-973967.19607842155,0,0,0,0,0]
["TRAB0307","Closing value ",{"$f":"(C33+C34+ C36+C38)- C35-C37","v":46503880.687210783},{"$f":"(D33+D34+ D36+D38)- D35-D37","v":60144486.17523279},110371443.49996182,137381979.6004146,146706729.94150662,158821865.02684131,156082537.88721767]
[null,"For switchyards, substations & transformers"]
["TRAB0401","Opening value",2687169561.3939576,2743091496.3865581,2814769393.1202531,2852560951.4694095,2930604081.5556169,2960266365.4850359,3019526210.1143246]
["TRAB0402","Inflation addition",88676595.526000619,87778927.884369865,0,0,0,0,0]
["TRAB0403","Straight line depreciation",188201209.49656045,196604363.09328496,195645342.80308133,164111660.57678398,174133653.13204792,182802242.72520465,195049774.09986743]
["TRAB0405","Gross capex",155446548.96316007,196429669.26640692,233436901.15223792,242154790.66299167,203795937.06146723,242062087.35449338,268936654.00770259]
["TRAB0406","Disposals ",0,2450000,0,0,0,0,0]
["TRAB0408","Capex timing adjustment",0,-13476337.323796565,0,0,0,0,0]
["TRAB0407","Closing value ",{"$f":"(C41+C42+ C44+C46)- C43-C45","v":2743091496.3865576},{"$f":"(D41+D42+ D44+D46)- D43-D45","v":2814769393.1202531},2852560951.4694095,2930604081.5556169,2960266365.4850359,3019526210.1143246,3093413090.0221601]
[null,"For easements:"]
["TRAB0501","Opening value",825199727.97842216,868033774.20741785,920759894.30051136,947611315.48278594,989019850.05772352,1045986126.4399345,1130919947.4729576]
["TRAB0502","Inflation addition",27231591.023287933,27777080.774637375,0,0,0,0,0]
["TRAB0503","Straight line depreciation",0,0,0,0,0,0,0]
["TRAB0505","Gross capex",15602455.205707807,14614923.920389097,26851421.182274573,41408534.574937627,56966276.382211007,84933821.033023059,88800333.776536375]
["TRAB0506","Disposals ",0,377943.69599999994,0,0,0,0,0]
["TRAB0508","Capex timing adjustment",0,10712059.094067011,0,0,0,0,0]
["TRAB0507","Closing value ",{"$f":"(C49+C50+ C52+C54)- C51-C53","v":868033774.20741785},{"$f":"(D49+D50+ D52+D54)- D51-D53","v":920759894.30051124},947611315.48278594,989019850.05772352,1045986126.4399345,1130919947.4729576,1219720281.2494941]
[null,"For “other” assets with long lives:"]
["TRAB0601","Opening value",350868677.61974466,463352041.82648784,598043675.94116366,721810481.64976215,826079408.82503426,866685299.6679374,892752517.97101688]
["TRAB0602","Inflation addition",11578666.361451572,14827265.338447612,0,0,0,0,0]
["TRAB0603","Straight line depreciation",20994704.339123867,23193798.348628856,30149308.539375406,40167077.107675932,46743403.530180171,53814253.006495602,56647034.566250786]
["TRAB0605","Gross capex",121899402.18441547,116480422.48072767,153916114.24797395,144436004.28294799,87349294.373083338,79881471.309575081,73320262.04964456]
["TRAB0606","Disposals ",0,0,0,0,0,0,0]
["TRAB0608","Capex timing adjustment",0,26577744.644129388,0,0,0,0,0]
["TRAB0607","Closing value ",{"$f":"(C57+C58+ C60+C62)- C59-C61","v":463352041.82648784},{"$f":"(D57+D58+ D60+D62)- D59-D61","v":598043675.94116366},721810481.64976215,826079408.82503426,866685299.6679374,892752517.97101688,909425745.45441067]
[null,"For “other” assets with short lives:"]
["TRAB0701","Opening value",113964499.64467846,117378098.26550168,149665718.150538,119436069.73931544,99655667.567872018,88539106.633158609,78852112.677133635]
["TRAB0702","Inflation addition",3760828.4882743885,3756099.144496053,0,0,0,0,0]
["TRAB0703","Straight line depreciation",30717953.939790033,24519898.019836713,41390387.352150656,33779049.293173,26816971.087610994,23499576.974057905,18696957.471977524]
["TRAB0705","Gross capex",32879624.253538862,24951462.530243482,12418552.798941253,15533965.235298,17440013.733215239,15237912.215863308,14239573.478164447]
["TRAB0706","Disposals ",2508900.1812,971261.82160000014,1257813.8580131645,1535318.1135684277,1739603.580317656,1425329.1978303858,1354497.6187174288]
["TRAB0708","Capex timing adjustment",0,29071218.051733498,0,0,0,0,0]
["TRAB0707","Closing value ",{"$f":"(C65+C66+ C68+C70)- C67-C69","v":117378098.26550168},{"$f":"(D65+D66+ D68+D70)- D67-D69","v":149665718.150538},119436069.73931544,99655667.567872003,88539106.633158609,78852112.67713362,73040231.06460312]
[]
[]
[]
[]
[null,"3.3.4 - ASSET LIVES"]
[null,null,"ASSET LIFE"]
[null,null,"(Years)"]
[null,null,{"$f":"dms_y4","v":"2025-26"},{"$f":"dms_y5","v":"2026-27"},{"$f":"dms_y6","v":"2027-28"},{"$f":"dms_y7","v":"2028-29"},{"$f":"dms_y8","v":"2029-30"},{"$f":"dms_y9","v":"2030-31"},{"$f":"dms_y10","v":"2031-32"}]
[null,"ESTIMATED SERVICE LIFE OF NEW ASSETS"]
["TRAB0901","Overhead transmission assets (wires and towers/poles etc)",49.035966073118914,48.549823684399804,48.436604330844141,48.419386690780826,48.391854111859246,48.360635248332244,48.305373775206768]
["TRAB0902","Underground transmission assets (cables, ducts etc)",45,45,45,45,45.000000000000007,45,45]
["TRAB0903","Substations, switchyards, transformers etc with transmission function",35.068467464962282,35.251560258057815,35.403864794051422,35.248612857174386,34.521235415938037,34.175232956816217,33.85125159442623]
["TRAB0904","Other assets with long lives",33.730844071590724,23.729021826368285,21.132751637543517,21.021343904761597,20.177992685831764,22.12387123106387,21.778333246967549]
["TRAB0905","Other assets with short lives",5.7818397621943651,5.9310614421996748,5.963971998088649,6.0853943359454554,6.1942413572908155,6.261568325280761,6.3052228015008565]
[null,"ESTIMATED RESIDUAL SERVICE LIFE"]
["TRAB1001","Overhead transmission assets (wires and towers/poles etc)",21.882724636593956,21.107015589725705,20.286489076581564,19.32132042004099,18.34886777711581,17.818357509554836,17.923980674122625]
["TRAB1002","Underground transmission assets (cables, ducts etc)",11.372267108802149,10.412435886109531,9.4615592000052686,8.52300691608467,7.6020823498092609,40.132070386613435,39.791685245915545]
["TRAB1003","Substations, switchyards, transformers etc with transmission function",18.838377052450916,19.153097845459143,19.706408080164127,19.519221450377962,19.833833873040778,20.416795088470916,20.977441488401102]
["TRAB1004","Other assets with long lives",14.971333157357853,14.975925986479373,17.090517460152451,16.318484894049426,18.796829694751796,18.18560019713339,16.845879292867171]
["TRAB1005","Other assets with short lives",4.4737156647493075,4.1956204540251267,3.8908456345431239,3.8549549510323415,4.1134529975056537,4.3587592739400156,4.4986766968675829]

{"sheet":"3.4 Operational data","index":15,"n_rows":91,"n_cols":10,"rows_kept":91,"cut":false,"hidden":false,"merged":[]}
[null,{"$f":"(LOOKUP(dms_Model,dms_Model_List,dms_Worksheet_List))","v":"REGULATORY REPORTING STATEMENT"}]
[null,{"$f":"dms_TradingName","v":"Powerlink"}]
[null,{"$f":"CONCATENATE(\"REGULATORY PERIOD FROM \", FRCP_y1,\" TO \",dms_MultiYear_FinalYear_Result)","v":"REGULATORY PERIOD FROM 2027-28 TO 2031-32"}]
[null,"3.4 OPERATIONAL DATA"]
[]
[null,"3.4.1 - ENERGY DELIVERY"]
[null,null,null,"VOLUMES "]
[null,null,null,"Forecast (0's)"]
[null,null,"Units",{"$f":"dms_y4","v":"2025-26"},{"$f":"dms_y5","v":"2026-27"},{"$f":"dms_y6","v":"2027-28"},{"$f":"dms_y7","v":"2028-29"},{"$f":"dms_y8","v":"2029-30"},{"$f":"dms_y9","v":"2030-31"},{"$f":"dms_y10","v":"2031-32"}]
[null,"Energy grouping by downstream connection type"]
["TOPED0101","To Other connected transmission networks","GWh",3895.3896795500991,3907.2932558971747,3918.4304531934276,3947.9843629388438,4026.6314298997177,4172.575754528877,4382.2583245772648]
["TOPED0102","To Distribution networks","GWh",30083.066863629541,30168.955983203883,30260.086963874077,30489.669286900455,31092.821926007695,32220.345364633118,33843.546270439059]
["TOPED0103","To Directly connected end–users (330 kV)","GWh",0,0,0,0,0,0,0]
["TOPED0104","To Directly connected end–users (275 kV)","GWh",8819.5029582412662,8844.225504678232,8871.25177078671,8938.7549056171993,9114.6416059371059,9445.1658789970315,9920.9600805414611]
["TOPED0105","To Directly connected end–users (220 kV)","GWh",0,0,0,0,0,0,0]
["TOPED0106","To Directly connected end–users (132 kV)","GWh",8503.8966735790927,8527.3314312207058,8553.4569871457898,8617.8976195435043,8788.3812131554878,9107.5788438409745,9566.3853544422072]
["TOPED0107","To Directly connected end–users (110 kV)","GWh",0,0,0,0,0,0,0]
["TOPED0108","To Directly connected end–users (44 kV) ","GWh",0,0,0,0,0,0,0]
["TOPED0109","To Directly connected end–users (33 kV)","GWh",0,0,0,0,0,0,0]
["TOPED0110","To Directly connected end–users (22 kV)","GWh",0,0,0,0,0,0,0]
["TOPED0111","To Directly connected end–users (11 kV)","GWh",0,0,0,0,0,0,0]
["TOPED0112","To Directly connected end–users (6.6 kV)","GWh",0,0,0,0,0,0,0]
["TOPED0113","Pumping and Power Station Auxillaries","GWh",1170,1201,1238,1260,1279,1318,1411]
["TOPED01","Total energy transported","GWh",{"$f":"SUM(D11:D23)","v":52471.856175000008},52648.806174999998,52841.226175000003,53254.306174999998,54301.476175000003,56263.665842000002,59124.15002999999]
[]
[]
[null,"3.4.2 -  CONNECTION POINTS"]
[null,null,null,"VOLUMES "]
[null,null,null,"Forecast (0's)"]
[null,null,"Units",{"$f":"dms_y4","v":"2025-26"},{"$f":"dms_y5","v":"2026-27"},{"$f":"dms_y6","v":"2027-28"},{"$f":"dms_y7","v":"2028-29"},{"$f":"dms_y8","v":"2029-30"},{"$f":"dms_y9","v":"2030-31"},{"$f":"dms_y10","v":"2031-32"}]
[null,"Average number of entry points by voltage"]
["TOPCP0101","500kV","number of connections"," -   "," -   "," -   "," -   "," -   "," -   "," -   "]
["TOPCP0102","330kV","number of connections",3,3.5,4,4,4,4,4]
["TOPCP0103","275kV","number of connections",32,34,34,33.5,33,33,33]
["TOPCP0104","220kV","number of connections"," -   "," -   "," -   "," -   "," -   "," -   "," -   "]
["TOPCP0105","132 kV","number of connections",20.5,21,21,20.5,20,20,20]
["TOPCP0106","110kV","number of connections",1,1,1,1,1,1,1]
["TOPCP0107","66 kV","number of connections"," -   "," -   "," -   "," -   "," -   "," -   "," -   "]
["TOPCP0108","33 kV","number of connections",5,5,5,5,5,5,5]
["TOPCP0109","22 kV","number of connections"," -   "," -   "," -   "," -   "," -   "," -   "," -   "]
["TOPCP0110","11 kV","number of connections"," -   "," -   "," -   "," -   "," -   "," -   "," -   "]
["TOPCP0111","6.6 kV","number of connections"," -   "," -   "," -   "," -   "," -   "," -   "," -   "]
[null,"Average number of entry points by voltage"]
["TOPCP0201","500kV","number of connections"," -   "," -   "," -   "," -   "," -   "," -   "," -   "]
["TOPCP0202","330kV","number of connections",1,1,1,1,1,1,1]
["TOPCP0203","275kV","number of connections",6,6,6,6,6,6,6]
["TOPCP0204","220kV","number of connections"," -   "," -   "," -   "," -   "," -   "," -   "," -   "]
["TOPCP0205","132 kV","number of connections",50,50,50,50,50,50,50]
["TOPCP0206","110kV","number of connections",17,17,17,17,17,17,17]
["TOPCP0207","66 kV","number of connections",22,22,22,22,22,22,22]
["TOPCP0208","44 kV","number of connections"," -   "," -   "," -   "," -   "," -   "," -   "," -   "]
["TOPCP0209","33kV","number of connections",14,14,14,14,14,14,14]
["TOPCP0210","22kV","number of connections",7,7,7,7,7,7,7]
["TOPCP0211","11kV","number of connections",3,3,3,3,3,3,3]
["TOPCP0212","6.6kV","number of connections"," -   "," -   "," -   "," -   "," -   "," -   "," -   "]
[]
[]
[]
[null,"3.4.3 - SYSTEM DEMAND"]
[null,null,null,"VOLUMES "]
[null,null,null,"Forecast (0's)"]
[null,null,"Units",{"$f":"dms_y4","v":"2025-26"},{"$f":"dms_y5","v":"2026-27"},{"$f":"dms_y6","v":"2027-28"},{"$f":"dms_y7","v":"2028-29"},{"$f":"dms_y8","v":"2029-30"},{"$f":"dms_y9","v":"2030-31"},{"$f":"dms_y10","v":"2031-32"}]
[null,"Annual system maximum demand characteristics – MW measure"]
["TOPSD0101","Transmission System coincident maximum demand","MW"]
["TOPSD0102","Transmission System coincident weather adjusted maximum demand 10% POE","MW",11120.41,11214.49,11331.89,11503.95,11694.31,11980.35,12414.26]
["TOPSD0103","Transmission System coincident weather adjusted maximum demand 50% POE","MW",10416.709999999999,10523.59,10644.47,10731.41,10920.22,11243.09,11666.4]
["TOPSD0104","Transmission System non-coincident summated maximum demand","MW"]
["TOPSD0105","Transmission System non-coincident weather adjusted summated maximum demand 10% POE","MW",14618,14856,15202,15507,15839,16055,16218]
["TOPSD0106","Transmission System non-coincident weather adjusted summated maximum demand 50% POE","MW",13659,13879,14210,14495,14814,15022,15170]
[null,"Annual system maximum demand characteristics – MVA measure"]
["TOPSD0201","Transmission System coincident maximum demand","MVA"]
["TOPSD0202","Transmission System coincident weather adjusted maximum demand 10% POE","MVA",12586.349533954726,12673.15793006993,12773.14134160703,12935.335790031815,13121.060185376789,13423.116413477042,13896.730501969329]
["TOPSD0203","Transmission System coincident weather adjusted maximum demand 50% POE","MVA",11875.910285123966,11977.030336168489,12079.632425314465,12144.303574166346,12328.852899308797,12672.751572951121,13136.741130568913]
["TOPSD0204","Transmission System non-coincident summated maximum demand","MVA"]
["TOPSD0205","Transmission System non-coincident weather adjusted summated maximum demand 10% POE","MVA",15062,15310,15667,15975,16315,16535,16704]
["TOPSD0206","Transmission System non-coincident weather adjusted summated maximum demand 50% POE","MVA",14070,14299,14639,14925,15251,15463,15617]
[null,"Power factor"]
[null,"Power factor conversion between MVA and MW"]
["TOPSD0301","Average overall network power factor conversion between MVA and MW","Factor",0.99,0.99,0.99,0.99,0.99,0.99,0.99]
["TOPSD0302","Average power factor conversion for 500 kV lines","Factor"]
["TOPSD0303","Average power factor conversion for 330 kV lines","Factor",0.97,0.97,0.97,0.97,0.97,0.97,0.97]
["TOPSD0304","Average power factor conversion for  275 kV lines","Factor",0.99,0.99,0.99,0.99,0.99,0.99,0.99]
["TOPSD0305","Average power factor conversion for  220 kV lines","Factor"]
["TOPSD0306","Average power factor conversion for  132 kV lines","Factor",0.98,0.98,0.98,0.98,0.98,0.97,0.97]
["TOPSD0307","Average power factor conversion for  110 kV lines","Factor",1,1,1,1,1,1,1]
["TOPSD0308","Average power factor conversion for  88 kV lines","Factor"]
["TOPSD0309","Average power factor conversion for  66 kV lines","Factor",0.99,0.99,0.99,0.99,0.99,0.99,0.99]
["TOPSD0310","Average power factor conversion for  33 kV lines","Factor",1,1,0.99,0.99,0.99,0.99,0.99]
["TOPSD0311","Average power factor conversion for  22 kV lines","Factor",1,1,1,1,1,1,1]
["TOPSD0311","Average power factor conversion for  11 kV lines","Factor",0.97,0.98,0.98,0.98,0.98,0.98,0.98]
["TOPSD0312","Average power factor conversion for  6.6 kV lines","Factor"]

{"sheet":"3.5 Physical assets","index":16,"n_rows":76,"n_cols":10,"rows_kept":76,"cut":false,"hidden":false,"merged":[[37,1,37,2],[22,1,22,2]]}
[null,{"$f":"(LOOKUP(dms_Model,dms_Model_List,dms_Worksheet_List))","v":"REGULATORY REPORTING STATEMENT"},null,null,null,null,null,null,"Fill colour #25C6FF","Protected (SOCI)"]
[null,{"$f":"dms_TradingName","v":"Powerlink"}]
[null,{"$f":"CONCATENATE(\"REGULATORY PERIOD FROM \", FRCP_y1,\" TO \",dms_MultiYear_FinalYear_Result)","v":"REGULATORY PERIOD FROM 2027-28 TO 2031-32"}]
[null,"3.5 PHYSICAL ASSETS"]
[]
[null,"3.5.1 - TRANSMISSION SYSTEM CAPACITIES "]
[null,null,null,"VOLUMES "]
[null,null,null,"Forecast (0's)"]
[null,null,"Units",{"$f":"dms_y4","v":"2025-26"},{"$f":"dms_y5","v":"2026-27"},{"$f":"dms_y6","v":"2027-28"},{"$f":"dms_y7","v":"2028-29"},{"$f":"dms_y8","v":"2029-30"},{"$f":"dms_y9","v":"2030-31"},{"$f":"dms_y10","v":"2031-32"}]
[null,"Overhead network length of circuit at each voltage"]
["TPA0101","500 kV","km",0,0,0,0,0,0,0]
["TPA0102","330 kV","km",604,604,604,604,604,604,604]
["TPA0103","275 kV","km",9400,9400,9400,9400,9400,9400,9407]
["TPA0104","220 kV","km",0,0,0,0,0,0,0]
["TPA0105","132 kV","km",4045,4045,4045,4045,4045,4038.6,4038.6]
["TPA0106","110 kV","km",408,408,408,408,408,408,408]
["TPA0107","88 kV","km",0,0,0,0,0,0,0]
["TPA0108","66 kV","km",2,2,2,2,2,2,2]
["TPA0109","33 kV","km",0,0,0,0,0,0,0]
["TPA0110","22 kV","km",0,0,0,0,0,0,0]
["TPA011","11 kV","km",0,0,0,0,0,0,0]
["TPA0112","Other voltages","km",0,0,0,0,0,0,0]
["TPA01","Total",null,{"$f":"SUM(D11:D21)","v":14459},14459,14459,14459,14459,14452.6,14459.6]
[]
[null,"Underground cable circuit length at each voltage"]
["TPA0201","500 kV","km",0,0,0,0,0,0,0]
["TPA0202","330 kV","km",0,0,0,0,0,0,0]
["TPA0203","275 kV","km",9.4,9.4,9.4,9.4,9.4,9.4,9.4]
["TPA0204","220 kV","km",0,0,0,0,0,0,0]
["TPA0205","132 kV","km",3.2,3.2,3.2,3.2,3.2,11.6,11.6]
["TPA0206","110 kV","km",7.6,7.6,7.6,7.6,7.6,7.6,7.6]
["TPA0207","88 kV","km",0,0,0,0,0,0,0]
["TPA0208","66 kV","km",0,0,0,0,0,0,0]
["TPA0209","33 kV","km",0,0,0,0,0,0,0]
["TPA0210","22 kV","km",0,0,0,0,0,0,0]
["TPA0211","11 kV","km",0,0,0,0,0,0,0]
["TPA0212","Other voltages","km",0,0,0,0,0,0,0]
["TPA02","Total",null,{"$f":"SUM(D26:D36)","v":20.200000000000003},20.200000000000003,20.200000000000003,20.200000000000003,20.200000000000003,28.6,28.6]
[]
[null,"Estimated overhead network weighted average MVA capacity by voltage class"]
["TPA0301","500 kV","MVA",0,0,0,0,0,0,0]
["TPA0302","330 kV","MVA",1246.45412807517,1246.45412807517,1246.45412807517,1246.45412807517,1246.45412807517,1246.45412807517,1246.45412807517]
["TPA0303","275 kV","MVA",782.24021850163103,782.24021850163103,782.24021850163103,782.24021850163103,782.24021850163103,782.24021850163103,782]
["TPA0304","220 kV","MVA",0,0,0,0,0,0,0]
["TPA0305","132 kV","MVA",141,141,141,141,142,141,141]
["TPA0306","110 kV","MVA",179.972350635704,179.972350635704,179.972350635704,179.972350635704,179.972350635704,179.972350635704,179.972350635704]
["TPA0307","88 kV","MVA",0,0,0,0,0,0,0]
["TPA0308","66 kV","MVA",37.178834879999997,37.178834879999997,37.178834879999997,37.178834879999997,37,37,37]
["TPA0309","33 kV","MVA",0,0,0,0,0,0,0]
["TPA0310","22 kV","MVA",0,0,0,0,0,0,0]
["TPA0311","11 kV","MVA",0,0,0,0,0,0,0]
["TPA0212","Other voltages","MVA",0,0,0,0,0,0,0]
[]
[null,"Estimated underground network weighted average MVA capacity by voltage class"]
["TPA0401","500 kV","MVA",0,0,0,0,0,0,0]
["TPA0402","330 kV","MVA",0,0,0,0,0,0,0]
["TPA0403","275 kV","MVA",572,572,572,572,572,572,572]
["TPA0404","220 kV","MVA",0,0,0,0,0,0,0]
["TPA0405","132 kV","MVA",161.30000000000001,161.30000000000001,161.30000000000001,161.30000000000001,161.30000000000001,165,165]
["TPA0406","110 kV","MVA",209.7,209.7,209.7,209.7,209.7,210,210]
["TPA0407","88 kV","MVA",0,0,0,0,0,0,0]
["TPA0408","66 kV","MVA",0,0,0,0,0,0,0]
["TPA0409","33 kV","MVA",0,0,0,0,0,0,0]
["TPA0410","22 kV","MVA",0,0,0,0,0,0,0]
["TPA0411","11 kV","MVA",0,0,0,0,0,0,0]
["TPA0212","Other voltages","MVA",0,0,0,0,0,0,0]
[]
[null,"Installed transmission system transformer capacity"]
["TPA0501","Transmission substations (eg 500 kV to 330 kV)","MVA",11470,11470,11470,11470,11470,11470,11470]
["TPA0502","Terminal points to DNSP systems","MVA",19849,19849,19765,19765,19765,19765,19765]
["TPA0503","Transformer capacity for directly connected end–users owned by the TNSP","MVA",2472,2472,2555,2555,2555,2555,2555]
["TPA0505","Interconnector capacity","MVA",3750,3750,3750,3750,3750,3750,3750]
["TPA0506","Other","MVA",3562,3562,3562,3562,3562,3562,3562]
[]
[null,"Cold spare capacity"]
["TPA06","Cold spare capacity included in 3.5.1.5","MVA",3110,3485,3485,3485,3485,3485,3485]

{"sheet":"3.7 Operating environment","index":17,"n_rows":27,"n_cols":10,"rows_kept":27,"cut":false,"hidden":false,"merged":[]}
[null,{"$f":"(LOOKUP(dms_Model,dms_Model_List,dms_Worksheet_List))","v":"REGULATORY REPORTING STATEMENT"}]
[null,{"$f":"dms_TradingName","v":"Powerlink"}]
[null,{"$f":"CONCATENATE(\"REGULATORY PERIOD FROM \", FRCP_y1,\" TO \",dms_MultiYear_FinalYear_Result)","v":"REGULATORY PERIOD FROM 2027-28 TO 2031-32"}]
[null,"3.7 OPERATING ENVIRONMENT FACTORS"]
[]
[]
["TEF01","3.7.1 - TERRAIN FACTORS"]
[null,null,null,"VOLUMES "]
[null,null,null,"Forecast (0's)"]
[null,null,"Units",{"$f":"dms_y4","v":"2025-26"},{"$f":"dms_y5","v":"2026-27"},{"$f":"dms_y6","v":"2027-28"},{"$f":"dms_y7","v":"2028-29"},{"$f":"dms_y8","v":"2029-30"},{"$f":"dms_y9","v":"2030-31"},{"$f":"dms_y10","v":"2031-32"}]
["TEF0101","Total number of vegetation maintenance spans","Number of spans",9362]
["TEF0102","Average vegetation maintenance span cycle","Years",2.52]
["TEF0103","Average number of trees per vegetation maintenance span","Trees",465]
["TEF0104","Average number of defects per vegetation maintenance span","Defects",2.8400000000000001E-3]
["TEF0105","Tropical proportion","Number of spans",5921]
["TEF0106","Standard vehicle access","km",5194.63]
["TEF0107","Altitude","km",429.5]
["TEF0108","Bushfire risk","Number of spans",814]
[]
["TEF02","3.7.2 - NETWORK CHARACTERISTICS"]
[null,null,null,"VOLUMES "]
[null,null,null,"Forecast (0's)"]
[null,null,"Units",{"$f":"dms_y4","v":"2025-26"},{"$f":"dms_y5","v":"2026-27"},{"$f":"dms_y6","v":"2027-28"},{"$f":"dms_y7","v":"2028-29"},{"$f":"dms_y8","v":"2029-30"},{"$f":"dms_y9","v":"2030-31"},{"$f":"dms_y10","v":"2031-32"}]
["TEF0201","Route line length","km",9636,9636,9636,9636,9636,9638,9645]
["TEF0202","Variability of dispatch","%",0.18,0.18,0.18,0.18,0.18,0.18,0.18]
["TEF0203","Concentrated load distance","km",565,565,565,565,565,565,565]
["TEF0204","Total number of spans","number",23741,23741,23741,23741,23741,23745,23759]

{"sheet":"5.4 MD & Utilisation - Spatial","index":18,"n_rows":4882,"n_cols":12,"rows_kept":4882,"cut":false,"hidden":false,"merged":[[28,2,29,2],[28,3,29,3],[30,2,31,2],[30,3,31,3],[32,2,33,2],[32,3,33,3],[18,3,19,3],[20,2,21,2],[20,3,21,3],[22,2,23,2],[22,3,23,3],[24,1,37,1],[24,2,25,2],[24,3,25,3],[26,2,27,2],[26,3,27,3],[10,1,23,1],[10,2,11,2],[10,3,11,3],[12,2,13,2],[12,3,13,3],[14,2,15,2],[14,3,15,3],[16,2,17,2],[16,3,17,3],[18,2,19,2],[42,3,43,3],[44,2,45,2],[44,3,45,3],[46,2,47,2],[46,3,47,3],[48,2,49,2],[48,3,49,3],[34,2,35,2],[34,3,35,3],[36,2,37,2],[36,3,37,3],[38,1,51,1],[38,2,39,2],[38,3,39,3],[40,2,41,2],[40,3,41,3],[42,2,43,2],[58,3,59,3],[60,2,61,2],[60,3,61,3],[62,2,63,2],[62,3,63,3],[64,2,65,2],[64,3,65,3],[50,2,51,2],[50,3,51,3],[52,1,65,1],[52,2,53,2],[52,3,53,3],[54,2,55,2],[54,3,55,3],[56,2,57,2],[56,3,57,3],[58,2,59,2],[84,2,85,2],[84,3,85,3],[86,2,87,2],[86,3,87,3],[88,2,89,2],[88,3,89,3],[74,3,75,3],[76,2,77,2],[76,3,77,3],[78,2,79,2],[78,3,79,3],[80,1,93,1],[80,2,81,2],[80,3,81,3],[82,2,83,2],[82,3,83,3],[66,1,79,1],[66,2,67,2],[66,3,67,3],[68,2,69,2],[68,3,69,3],[70,2,71,2],[70,3,71,3],[72,2,73,2],[72,3,73,3],[74,2,75,2],[98,3,99,3],[100,2,101,2],[100,3,101,3],[102,2,103,2],[102,3,103,3],[104,2,105,2],[104,3,105,3],[90,2,91,2],[90,3,91,3],[92,2,93,2],[92,3,93,3],[94,1,107,1],[94,2,95,2],[94,3,95,3],[96,2,97,2],[96,3,97,3],[98,2,99,2],[114,3,115,3],[116,2,117,2],[116,3,117,3],[118,2,119,2],[118,3,119,3],[120,2,121,2],[120,3,121,3],[106,2,107,2],[106,3,107,3],[108,1,121,1],[108,2,109,2],[108,3,109,3],[110,2,111,2],[110,3,111,3],[112,2,113,2],[112,3,113,3],[114,2,115,2],[140,2,141,2],[140,3,141,3],[142,2,143,2],[142,3,143,3],[144,2,145,2],[144,3,145,3],[130,3,131,3],[132,2,133,2],[132,3,133,3],[134,2,135,2],[134,3,135,3],[136,1,149,1],[136,2,137,2],[136,3,137,3],[138,2,139,2],[138,3,139,3],[122,1,135,1],[122,2,123,2],[122,3,123,3],[124,2,125,2],[124,3,125,3],[126,2,127,2],[126,3,127,3],[128,2,129,2],[128,3,129,3],[130,2,131,2],[154,3,155,3],[156,2,157,2],[156,3,157,3],[158,2,159,2],[158,3,159,3],[160,2,161,2],[160,3,161,3],[146,2,147,2],[146,3,147,3],[148,2,149,2],[148,3,149,3],[150,1,163,1],[150,2,151,2],[150,3,151,3],[152,2,153,2],[152,3,153,3],[154,2,155,2],[170,3,171,3],[172,2,173,2],[172,3,173,3],[174,2,175,2],[174,3,175,3],[176,2,177,2],[176,3,177,3],[162,2,163,2],[162,3,163,3],[164,1,177,1],[164,2,165,2],[164,3,165,3],[166,2,167,2],[166,3,167,3],[168,2,169,2],[168,3,169,3],[170,2,171,2],[196,2,197,2],[196,3,197,3],[198,2,199,2],[198,3,199,3],[200,2,201,2],[200,3,201,3],[186,3,187,3],[188,2,189,2],[188,3,189,3],[190,2,191,2],[190,3,191,3],[192,1,205,1],[192,2,193,2],[192,3,193,3],[194,2,195,2],[194,3,195,3],[178,1,191,1],[178,2,179,2],[178,3,179,3],[180,2,181,2],[180,3,181,3],[182,2,183,2],[182,3,183,3],[184,2,185,2],[184,3,185,3],[186,2,187,2],[210,3,211,3],[212,2,213,2],[212,3,213,3],[214,2,215,2],[214,3,215,3],[216,2,217,2],[216,3,217,3],[202,2,203,2],[202,3,203,3],[204,2,205,2],[204,3,205,3],[206,1,219,1],[206,2,207,2],[206,3,207,3],[208,2,209,2],[208,3,209,3],[210,2,211,2],[226,3,227,3],[228,2,229,2],[228,3,229,3],[230,2,231,2],[230,3,231,3],[232,2,233,2],[232,3,233,3],[218,2,219,2],[218,3,219,3],[220,1,233,1],[220,2,221,2],[220,3,221,3],[222,2,223,2],[222,3,223,3],[224,2,225,2],[224,3,225,3],[226,2,227,2],[252,2,253,2],[252,3,253,3],[254,2,255,2],[254,3,255,3],[256,2,257,2],[256,3,257,3],[242,3,243,3],[244,2,245,2],[244,3,245,3],[246,2,247,2],[246,3,247,3],[248,1,261,1],[248,2,249,2],[248,3,249,3],[250,2,251,2],[250,3,251,3],[234,1,247,1],[234,2,235,2],[234,3,235,3],[236,2,237,2],[236,3,237,3],[238,2,239,2],[238,3,239,3],[240,2,241,2],[240,3,241,3],[242,2,243,2],[266,3,267,3],[268,2,269,2],[268,3,269,3],[270,2,271,2],[270,3,271,3],[272,2,273,2],[272,3,273,3],[258,2,259,2],[258,3,259,3],[260,2,261,2],[260,3,261,3],[262,1,275,1],[262,2,263,2],[262,3,263,3],[264,2,265,2],[264,3,265,3],[266,2,267,2],[282,3,283,3],[284,2,285,2],[284,3,285,3],[286,2,287,2],[286,3,287,3],[288,2,289,2],[288,3,289,3],[274,2,275,2],[274,3,275,3],[276,1,289,1],[276,2,277,2],[276,3,277,3],[278,2,279,2],[278,3,279,3],[280,2,281,2],[280,3,281,3],[282,2,283,2],[308,2,309,2],[308,3,309,3],[310,2,311,2],[310,3,311,3],[312,2,313,2],[312,3,313,3],[298,3,299,3],[300,2,301,2],[300,3,301,3],[302,2,303,2],[302,3,303,3],[304,1,317,1],[304,2,305,2],[304,3,305,3],[306,2,307,2],[306,3,307,3],[290,1,303,1],[290,2,291,2],[290,3,291,3],[292,2,293,2],[292,3,293,3],[294,2,295,2],[294,3,295,3],[296,2,297,2],[296,3,297,3],[298,2,299,2],[322,3,323,3],[324,2,325,2],[324,3,325,3],[326,2,327,2],[326,3,327,3],[328,2,329,2],[328,3,329,3],[314,2,315,2],[314,3,315,3],[316,2,317,2],[316,3,317,3],[318,1,331,1],[318,2,319,2],[318,3,319,3],[320,2,321,2],[320,3,321,3],[322,2,323,2],[338,3,339,3],[340,2,341,2],[340,3,341,3],[342,2,343,2],[342,3,343,3],[344,2,345,2],[344,3,345,3],[330,2,331,2],[330,3,331,3],[332,1,345,1],[332,2,333,2],[332,3,333,3],[334,2,335,2],[334,3,335,3],[336,2,337,2],[336,3,337,3],[338,2,339,2],[364,2,365,2],[364,3,365,3],[366,2,367,2],[366,3,367,3],[368,2,369,2],[368,3,369,3],[354,3,355,3],[356,2,357,2],[356,3,357,3],[358,2,359,2],[358,3,359,3],[360,1,373,1],[360,2,361,2],[360,3,361,3],[362,2,363,2],[362,3,363,3],[346,1,359,1],[346,2,347,2],[346,3,347,3],[348,2,349,2],[348,3,349,3],[350,2,351,2],[350,3,351,3],[352,2,353,2],[352,3,353,3],[354,2,355,2],[378,3,379,3],[380,2,381,2],[380,3,381,3],[382,2,383,2],[382,3,383,3],[384,2,385,2],[384,3,385,3],[370,2,371,2],[370,3,371,3],[372,2,373,2],[372,3,373,3],[374,1,387,1],[374,2,375,2],[374,3,375,3],[376,2,377,2],[376,3,377,3],[378,2,379,2],[394,3,395,3],[396,2,397,2],[396,3,397,3],[398,2,399,2],[398,3,399,3],[400,2,401,2],[400,3,401,3],[386,2,387,2],[386,3,387,3],[388,1,401,1],[388,2,389,2],[388,3,389,3],[390,2,391,2],[390,3,391,3],[392,2,393,2],[392,3,393,3],[394,2,395,2],[420,2,421,2],[420,3,421,3],[422,2,423,2],[422,3,423,3],[424,2,425,2],[424,3,425,3],[410,3,411,3],[412,2,413,2],[412,3,413,3],[414,2,415,2],[414,3,415,3],[416,1,429,1],[416,2,417,2],[416,3,417,3],[418,2,419,2],[418,3,419,3],[402,1,415,1],[402,2,403,2],[402,3,403,3],[404,2,405,2],[404,3,405,3],[406,2,407,2],[406,3,407,3],[408,2,409,2],[408,3,409,3],[410,2,411,2],[434,3,435,3],[436,2,437,2],[436,3,437,3],[438,2,439,2],[438,3,439,3],[440,2,441,2],[440,3,441,3],[426,2,427,2],[426,3,427,3],[428,2,429,2],[428,3,429,3],[430,1,443,1],[430,2,431,2],[430,3,431,3],[432,2,433,2],[432,3,433,3],[434,2,435,2],[450,3,451,3],[452,2,453,2],[452,3,453,3],[454,2,455,2],[454,3,455,3],[456,2,457,2],[456,3,457,3],[442,2,443,2],[442,3,443,3],[444,1,457,1],[444,2,445,2],[444,3,445,3],[446,2,447,2],[446,3,447,3],[448,2,449,2],[448,3,449,3],[450,2,451,2],[476,2,477,2],[476,3,477,3],[478,2,479,2],[478,3,479,3],[480,2,481,2],[480,3,481,3],[466,3,467,3],[468,2,469,2],[468,3,469,3],[470,2,471,2],[470,3,471,3],[472,1,485,1],[472,2,473,2],[472,3,473,3],[474,2,475,2],[474,3,475,3],[458,1,471,1],[458,2,459,2],[458,3,459,3],[460,2,461,2],[460,3,461,3],[462,2,463,2],[462,3,463,3],[464,2,465,2],[464,3,465,3],[466,2,467,2],[490,3,491,3],[492,2,493,2],[492,3,493,3],[494,2,495,2],[494,3,495,3],[496,2,497,2],[496,3,497,3],[482,2,483,2],[482,3,483,3],[484,2,485,2],[484,3,485,3],[486,1,499,1],[486,2,487,2],[486,3,487,3],[488,2,489,2],[488,3,489,3],[490,2,491,2],[506,3,507,3],[508,2,509,2],[508,3,509,3],[510,2,511,2],[510,3,511,3],[512,2,513,2],[512,3,513,3],[498,2,499,2],[498,3,499,3],[500,1,513,1],[500,2,501,2],[500,3,501,3],[502,2,503,2],[502,3,503,3],[504,2,505,2],[504,3,505,3],[506,2,507,2],[532,2,533,2],[532,3,533,3],[534,2,535,2],[534,3,535,3],[536,2,537,2],[536,3,537,3],[522,3,523,3],[524,2,525,2],[524,3,525,3],[526,2,527,2],[526,3,527,3],[528,1,541,1],[528,2,529,2],[528,3,529,3],[530,2,531,2],[530,3,531,3],[514,1,527,1],[514,2,515,2],[514,3,515,3],[516,2,517,2],[516,3,517,3],[518,2,519,2],[518,3,519,3],[520,2,521,2],[520,3,521,3],[522,2,523,2],[546,3,547,3],[548,2,549,2],[548,3,549,3],[550,2,551,2],[550,3,551,3],[552,2,553,2],[552,3,553,3],[538,2,539,2],[538,3,539,3],[540,2,541,2],[540,3,541,3],[542,1,555,1],[542,2,543,2],[542,3,543,3],[544,2,545,2],[544,3,545,3],[546,2,547,2],[562,3,563,3],[564,2,565,2],[564,3,565,3],[566,2,567,2],[566,3,567,3],[568,2,569,2],[568,3,569,3],[554,2,555,2],[554,3,555,3],[556,1,569,1],[556,2,557,2],[556,3,557,3],[558,2,559,2],[558,3,559,3],[560,2,561,2],[560,3,561,3],[562,2,563,2],[588,2,589,2],[588,3,589,3],[590,2,591,2],[590,3,591,3],[592,2,593,2],[592,3,593,3],[578,3,579,3],[580,2,581,2],[580,3,581,3],[582,2,583,2],[582,3,583,3],[584,1,597,1],[584,2,585,2],[584,3,585,3],[586,2,587,2],[586,3,587,3],[570,1,583,1],[570,2,571,2],[570,3,571,3],[572,2,573,2],[572,3,573,3],[574,2,575,2],[574,3,575,3],[576,2,577,2],[576,3,577,3],[578,2,579,2],[602,3,603,3],[604,2,605,2],[604,3,605,3],[606,2,607,2],[606,3,607,3],[608,2,609,2],[608,3,609,3],[594,2,595,2],[594,3,595,3],[596,2,597,2],[596,3,597,3],[598,1,611,1],[598,2,599,2],[598,3,599,3],[600,2,601,2],[600,3,601,3],[602,2,603,2],[618,3,619,3],[620,2,621,2],[620,3,621,3],[622,2,623,2],[622,3,623,3],[624,2,625,2],[624,3,625,3],[610,2,611,2],[610,3,611,3],[612,1,625,1],[612,2,613,2],[612,3,613,3],[614,2,615,2],[614,3,615,3],[616,2,617,2],[616,3,617,3],[618,2,619,2],[644,2,645,2],[644,3,645,3],[646,2,647,2],[646,3,647,3],[648,2,649,2],[648,3,649,3],[634,3,635,3],[636,2,637,2],[636,3,637,3],[638,2,639,2],[638,3,639,3],[640,1,653,1],[640,2,641,2],[640,3,641,3],[642,2,643,2],[642,3,643,3],[626,1,639,1],[626,2,627,2],[626,3,627,3],[628,2,629,2],[628,3,629,3],[630,2,631,2],[630,3,631,3],[632,2,633,2],[632,3,633,3],[634,2,635,2],[658,3,659,3],[660,2,661,2],[660,3,661,3],[662,2,663,2],[662,3,663,3],[664,2,665,2],[664,3,665,3],[650,2,651,2],[650,3,651,3],[652,2,653,2],[652,3,653,3],[654,1,667,1],[654,2,655,2],[654,3,655,3],[656,2,657,2],[656,3,657,3],[658,2,659,2],[674,3,675,3],[676,2,677,2],[676,3,677,3],[678,2,679,2],[678,3,679,3],[680,2,681,2],[680,3,681,3],[666,2,667,2],[666,3,667,3],[668,1,681,1],[668,2,669,2],[668,3,669,3],[670,2,671,2],[670,3,671,3],[672,2,673,2],[672,3,673,3],[674,2,675,2],[700,2,701,2],[700,3,701,3],[702,2,703,2],[702,3,703,3],[704,2,705,2],[704,3,705,3],[690,3,691,3],[692,2,693,2],[692,3,693,3],[694,2,695,2],[694,3,695,3],[696,1,709,1],[696,2,697,2],[696,3,697,3],[698,2,699,2],[698,3,699,3],[682,1,695,1],[682,2,683,2],[682,3,683,3],[684,2,685,2],[684,3,685,3],[686,2,687,2],[686,3,687,3],[688,2,689,2],[688,3,689,3],[690,2,691,2],[714,3,715,3],[716,2,717,2],[716,3,717,3],[718,2,719,2],[718,3,719,3],[720,2,721,2],[720,3,721,3],[706,2,707,2],[706,3,707,3],[708,2,709,2],[708,3,709,3],[710,1,723,1],[710,2,711,2],[710,3,711,3],[712,2,713,2],[712,3,713,3],[714,2,715,2],[730,3,731,3],[732,2,733,2],[732,3,733,3],[734,2,735,2],[734,3,735,3],[736,2,737,2],[736,3,737,3],[722,2,723,2],[722,3,723,3],[724,1,737,1],[724,2,725,2],[724,3,725,3],[726,2,727,2],[726,3,727,3],[728,2,729,2],[728,3,729,3],[730,2,731,2],[756,2,757,2],[756,3,757,3],[758,2,759,2],[758,3,759,3],[760,2,761,2],[760,3,761,3],[746,3,747,3],[748,2,749,2],[748,3,749,3],[750,2,751,2],[750,3,751,3],[752,1,765,1],[752,2,753,2],[752,3,753,3],[754,2,755,2],[754,3,755,3],[738,1,751,1],[738,2,739,2],[738,3,739,3],[740,2,741,2],[740,3,741,3],[742,2,743,2],[742,3,743,3],[744,2,745,2],[744,3,745,3],[746,2,747,2],[770,3,771,3],[772,2,773,2],[772,3,773,3],[774,2,775,2],[774,3,775,3],[776,2,777,2],[776,3,777,3],[762,2,763,2],[762,3,763,3],[764,2,765,2],[764,3,765,3],[766,1,779,1],[766,2,767,2],[766,3,767,3],[768,2,769,2],[768,3,769,3],[770,2,771,2],[786,3,787,3],[788,2,789,2],[788,3,789,3],[790,2,791,2],[790,3,791,3],[792,2,793,2],[792,3,793,3],[778,2,779,2],[778,3,779,3],[780,1,793,1],[780,2,781,2],[780,3,781,3],[782,2,783,2],[782,3,783,3],[784,2,785,2],[784,3,785,3],[786,2,787,2],[812,2,813,2],[812,3,813,3],[814,2,815,2],[814,3,815,3],[816,2,817,2],[816,3,817,3],[802,3,803,3],[804,2,805,2],[804,3,805,3],[806,2,807,2],[806,3,807,3],[808,1,821,1],[808,2,809,2],[808,3,809,3],[810,2,811,2],[810,3,811,3],[794,1,807,1],[794,2,795,2],[794,3,795,3],[796,2,797,2],[796,3,797,3],[798,2,799,2],[798,3,799,3],[800,2,801,2],[800,3,801,3],[802,2,803,2],[826,3,827,3],[828,2,829,2],[828,3,829,3],[830,2,831,2],[830,3,831,3],[832,2,833,2],[832,3,833,3],[818,2,819,2],[818,3,819,3],[820,2,821,2],[820,3,821,3],[822,1,835,1],[822,2,823,2],[822,3,823,3],[824,2,825,2],[824,3,825,3],[826,2,827,2],[842,3,843,3],[844,2,845,2],[844,3,845,3],[846,2,847,2],[846,3,847,3],[848,2,849,2],[848,3,849,3],[834,2,835,2],[834,3,835,3],[836,1,849,1],[836,2,837,2],[836,3,837,3],[838,2,839,2],[838,3,839,3],[840,2,841,2],[840,3,841,3],[842,2,843,2],[868,2,869,2],[868,3,869,3],[870,2,871,2],[870,3,871,3],[872,2,873,2],[872,3,873,3],[858,3,859,3],[860,2,861,2],[860,3,861,3],[862,2,863,2],[862,3,863,3],[864,1,877,1],[864,2,865,2],[864,3,865,3],[866,2,867,2],[866,3,867,3],[850,1,863,1],[850,2,851,2],[850,3,851,3],[852,2,853,2],[852,3,853,3],[854,2,855,2],[854,3,855,3],[856,2,857,2],[856,3,857,3],[858,2,859,2],[882,3,883,3],[884,2,885,2],[884,3,885,3],[886,2,887,2],[886,3,887,3],[888,2,889,2],[888,3,889,3],[874,2,875,2],[874,3,875,3],[876,2,877,2],[876,3,877,3],[878,1,891,1],[878,2,879,2],[878,3,879,3],[880,2,881,2],[880,3,881,3],[882,2,883,2],[898,3,899,3],[900,2,901,2],[900,3,901,3],[902,2,903,2],[902,3,903,3],[904,2,905,2],[904,3,905,3],[890,2,891,2],[890,3,891,3],[892,1,905,1],[892,2,893,2],[892,3,893,3],[894,2,895,2],[894,3,895,3],[896,2,897,2],[896,3,897,3],[898,2,899,2],[924,2,925,2],[924,3,925,3],[926,2,927,2],[926,3,927,3],[928,2,929,2],[928,3,929,3],[914,3,915,3],[916,2,917,2],[916,3,917,3],[918,2,919,2],[918,3,919,3],[920,1,933,1],[920,2,921,2],[920,3,921,3],[922,2,923,2],[922,3,923,3],[906,1,919,1],[906,2,907,2],[906,3,907,3],[908,2,909,2],[908,3,909,3],[910,2,911,2],[910,3,911,3],[912,2,913,2],[912,3,913,3],[914,2,915,2],[938,3,939,3],[940,2,941,2],[940,3,941,3],[942,2,943,2],[942,3,943,3],[944,2,945,2],[944,3,945,3],[930,2,931,2],[930,3,931,3],[932,2,933,2],[932,3,933,3],[934,1,947,1],[934,2,935,2],[934,3,935,3]],"merged_total":5220,"flags":["merged_cut"]}
[null,"REGULATORY REPORTING STATEMENT"]
[null,"Powerlink"]
[null,"REGULATORY PERIOD FROM 2027-28 TO 2031-32"]
[null,"5.4 MAXIMUM DEMAND AND UTILISATION AT SPATIAL LEVEL"]
[]
[]
[null,"5.4.1 - NON-COINCIDENT & COINCIDENT MAXIMUM DEMAND"]
[null,null,null,null,null,"VOLUMES "]
[null,null,null,null,null,"Forecast (0's)"]
[null,"CONNECTION POINT","FORECASTING ELEMENTS","UNIT","MAX DEMAND","2025-26","2026-27","2027-28","2028-29","2029-30","2030-31","2031-32"]
[null,"Abermain (110)","CONNECTION POINT RATING","MVA","Non-coincident",151.01,151.01,151.01,151.01,151.01,151.01,151.01]
[null,null,null,null,"Coincident",151.01,151.01,151.01,151.01,151.01,151.01,151.01]
[null,null,"WINTER/SUMMER PEAKING",null,"Non-coincident","Winter","Winter","Winter","Winter","Summer","Summer","Summer"]
[null,null,null,null,"Coincident","Winter","Winter","Winter","Winter","Summer","Summer","Summer"]
[null,null,"ADJUSTMENTS - EMBEDDED GENERATION","MW","Non-coincident",0,0,0,0,0,0,0]
[null,null,null,null,"Coincident",0,0,0,0,0,0,0]
[null,null,"WEATHER CORRECTED MD 10% POE","MW","Non-coincident",74.874435419999998,76.751998900000004,78.100692749999993,79.75559998,81.081977839999993,82.310249330000005,83.466247559999999]
[null,null,null,null,"Coincident",73.399623335522108,75.240204188619543,76.562332629784279,78.184642923756613,79.484894936055198,80.688972993058883,81.822201366435905]
[null,null,"WEATHER CORRECTED MD 10% POE","MVA","Non-coincident",74.944401694149903,76.81182269807087,78.153868179917055,79.801301236640739,81.122203598524024,82.345792396931003,83.497709052633851]
[null,null,null,null,"Coincident",73.468211474317215,75.298849629086249,76.614460655921945,78.229443996440153,79.524328362263859,80.723815963296857,81.853043157708782]
[null,null,"WEATHER CORRECTED MD 50% POE","MW","Non-coincident",67.759880069999994,69.400894170000001,70.756881710000002,72.33892822,73.606582639999999,74.756408690000001,75.791740419999996]
[null,null,null,null,"Coincident",66.425204363806756,68.033895182677455,69.363173649024006,70.914058370650352,72.156743626648378,73.283921394306404,74.298860052381627]
[null,null,"WEATHER CORRECTED MD 50% POE","MVA","Non-coincident",67.879066399945231,69.507053889640773,70.85307833531327,72.424359397746585,73.684017208723546,74.827048549871407,75.856618560244485]
[null,null,null,null,"Coincident",66.542043064167572,68.137963859674187,69.457475476136764,70.997806798702399,72.232652955988556,73.353169851112142,74.362460278946841]
[null,"Abermain (33)","CONNECTION POINT RATING","MVA","Non-coincident",277,277,277,277,277,277,277]
[null,null,null,null,"Coincident",277,277,277,277,277,277,277]
[null,null,"WINTER/SUMMER PEAKING",null,"Non-coincident","Summer","Summer","Summer","Summer","Summer","Summer","Summer"]
[null,null,null,null,"Coincident","Summer","Summer","Summer","Summer","Summer","Summer","Summer"]
[null,null,"ADJUSTMENTS - EMBEDDED GENERATION","MW","Non-coincident",0,0,0,0,0,0,0]
[null,null,null,null,"Coincident",0,0,0,0,0,0,0]
[null,null,"WEATHER CORRECTED MD 10% POE","MW","Non-coincident",117.0377502,119.517746,122.7302475,127.3014526,131.18217469999999,134.57273860000001,137.62828060000001]
[null,null,null,null,"Coincident",117.0377502,119.517746,122.7302475,127.3014526,131.18217469999999,134.57273860000001,137.62828060000001]
[null,null,"WEATHER CORRECTED MD 10% POE","MVA","Non-coincident",117.94324270013951,120.4472043670136,123.69076782037411,128.30620320832759,132.22450035476999,135.64791099507539,138.7330674320358]
[null,null,null,null,"Coincident",117.94324270013951,120.4472043670136,123.69076782037411,128.30620320832759,132.22450035476999,135.64791099507539,138.7330674320358]
[null,null,"WEATHER CORRECTED MD 50% POE","MW","Non-coincident",107.6560745,109.8982773,112.8593369,117.01367949999999,120.62558749999999,123.7591171,126.6495972]
[null,null,null,null,"Coincident",107.6560745,109.8982773,112.8593369,117.01367949999999,120.62558749999999,123.7591171,126.6495972]
[null,null,"WEATHER CORRECTED MD 50% POE","MVA","Non-coincident",108.47102507905871,110.7348484769315,113.72447905605929,117.91893950462421,121.565755436571,124.729589333231,127.64803825882051]
[null,null,null,null,"Coincident",108.47102507905871,110.7348484769315,113.72447905605929,117.91893950462421,121.565755436571,124.729589333231,127.64803825882051]
[null,"Alan Sherriff","CONNECTION POINT RATING","MVA","Non-coincident",457.26,457.26,457.26,457.26,457.26,457.26,457.26]
[null,null,null,null,"Coincident",457.26,457.26,457.26,457.26,457.26,457.26,457.26]
[null,null,"WINTER/SUMMER PEAKING",null,"Non-coincident","Summer","Summer","Summer","Summer","Summer","Summer","Summer"]
[null,null,null,null,"Coincident","Summer","Summer","Summer","Summer","Summer","Summer","Summer"]
[null,null,"ADJUSTMENTS - EMBEDDED GENERATION","MW","Non-coincident",0,0,0,0,0,0,0]
[null,null,null,null,"Coincident",0,0,0,0,0,0,0]
[null,null,"WEATHER CORRECTED MD 10% POE","MW","Non-coincident",37.034568790000002,37.373851780000003,37.775794980000001,38.198688509999997,38.613513949999998,39.032299039999998,39.400596620000002]
[null,null,null,null,"Coincident",32.577784020538878,32.876237285453023,33.229810154962443,33.60181216643835,33.966717011616247,34.33510499772737,34.65908120181286]
[null,null,"WEATHER CORRECTED MD 10% POE","MVA","Non-coincident",37.682543093677062,38.032910273404397,38.448009466937719,38.884773189720327,39.313231531334438,39.745806049387603,40.126252003784508]
[null,null,null,null,"Coincident",33.147780313347077,33.455983883200027,33.821129538080179,34.205332586575253,34.582229733509813,34.962747711235792,35.297410339660317]
[null,null,"WEATHER CORRECTED MD 50% POE","MW","Non-coincident",31.98048782,32.28476715,32.629383089999997,33.000194550000003,33.38582993,33.70148468,34.05483246]
[null,null,null,null,"Coincident",28.131917263007349,28.399579250672531,28.702723691938079,29.02891125266601,29.368138804944419,29.645807280818079,29.956632761904419]
[null,null,"WEATHER CORRECTED MD 50% POE","MVA","Non-coincident",32.466051248652612,32.779942147015767,33.135473159050392,33.518063088122481,33.915983315912619,34.241719957097096,34.606380604867951]
[null,null,null,null,"Coincident",28.559047401787002,28.835164290061641,29.147910270400821,29.484458864996839,29.834492891634429,30.121029991722089,30.441806936398621]
[null,"Algester","CONNECTION POINT RATING","MVA","Non-coincident",202,202,202,202,202,202,202]
[null,null,null,null,"Coincident",202,202,202,202,202,202,202]
[null,null,"WINTER/SUMMER PEAKING",null,"Non-coincident","Summer","Summer","Summer","Summer","Summer","Summer","Summer"]
[null,null,null,null,"Coincident","Summer","Summer","Summer","Summer","Summer","Summer","Summer"]
[null,null,"ADJUSTMENTS - EMBEDDED GENERATION","MW","Non-coincident",0,0,0,0,0,0,0]
[null,null,null,null,"Coincident",0,0,0,0,0,0,0]
[null,null,"WEATHER CORRECTED MD 10% POE","MW","Non-coincident",80.079208370000003,81.483978269999994,83.411575319999997,84.913475039999994,86.525863650000005,88.232803340000004,90.026473999999993]
[null,null,null,null,"Coincident",79.78210939353913,81.181667507509403,83.102113049368398,84.598440625504324,86.204847170803163,87.905454005557687,89.692470032875349]
[null,null,"WEATHER CORRECTED MD 10% POE","MVA","Non-coincident",82.376070655642494,83.889418733795551,85.967475676331929,87.587715090937493,89.328163193585112,91.171751625363342,93.110139432919794]
[null,null,null,null,"Coincident",82.070450173437166,83.578183633586377,85.648530852172911,87.262759075090898,88.99675000414247,90.833498605117597,92.764694870133468]
[null,null,"WEATHER CORRECTED MD 50% POE","MW","Non-coincident",74.550384519999994,75.903785709999994,77.661796570000007,79.096420289999998,80.690597530000005,82.334136959999995,84.049758909999994]
[null,null,null,null,"Coincident",74.273797833062233,75.622177818226746,77.373666345679467,78.802967520071249,80.391230260715659,82.028672054483152,83.73792893749868]
[null,null,"WEATHER CORRECTED MD 50% POE","MVA","Non-coincident",76.429770283953886,77.883799001046967,79.774086978561115,81.317887087722909,83.034601041500252,84.805733935724149,86.655828579014383]
[null,null,null,null,"Coincident",76.146210955824841,77.594845133531408,79.478120021945813,81.016192534124215,82.726537369513352,84.491099247605078,86.334329921632062]
[null,"Alligator Creek (132)","CONNECTION POINT RATING","MVA","Non-coincident",280.08,280.08,280.08,280.08,280.08,280.08,280.08]
[null,null,null,null,"Coincident",280.08,280.08,280.08,280.08,280.08,280.08,280.08]
[null,null,"WINTER/SUMMER PEAKING",null,"Non-coincident","Summer","Summer","Summer","Summer","Summer","Summer","Summer"]
[null,null,null,null,"Coincident","Summer","Summer","Summer","Summer","Summer","Summer","Summer"]
[null,null,"ADJUSTMENTS - EMBEDDED GENERATION","MW","Non-coincident",0,0,0,0,0,0,0]
[null,null,null,null,"Coincident",0,0,0,0,0,0,0]
[null,null,"WEATHER CORRECTED MD 10% POE","MW","Non-coincident"]
[null,null,null,null,"Coincident"]
[null,null,"WEATHER CORRECTED MD 10% POE","MVA","Non-coincident"]
[null,null,null,null,"Coincident"]
[null,null,"WEATHER CORRECTED MD 50% POE","MW","Non-coincident"]
[null,null,null,null,"Coincident"]
[null,null,"WEATHER CORRECTED MD 50% POE","MVA","Non-coincident"]
[null,null,null,null,"Coincident"]
[null,"Alligator Creek (33)","CONNECTION POINT RATING","MVA","Non-coincident",250.8,250.8,250.8,250.8,250.8,250.8,250.8]
[null,null,null,null,"Coincident",250.8,250.8,250.8,250.8,250.8,250.8,250.8]
[null,null,"WINTER/SUMMER PEAKING",null,"Non-coincident","Summer","Summer","Summer","Summer","Summer","Summer","Summer"]
[null,null,null,null,"Coincident","Summer","Summer","Summer","Summer","Summer","Summer","Summer"]
[null,null,"ADJUSTMENTS - EMBEDDED GENERATION","MW","Non-coincident",0,0,0,0,0,0,0]
[null,null,null,null,"Coincident",0,0,0,0,0,0,0]
[null,null,"WEATHER CORRECTED MD 10% POE","MW","Non-coincident",30.541757579999999,30.936065670000001,31.4011116,31.82628441,32.223133089999997,32.540046689999997,32.814971919999998]
[null,null,null,null,"Coincident",27.85144893534731,28.211023907568979,28.635105689308599,29.022826624339778,29.384718395536261,29.673716267521769,29.924424367221889]
[null,null,"WEATHER CORRECTED MD 10% POE","MVA","Non-coincident",31.378525707474399,31.794401806050491,32.284966400690877,32.733544001307813,33.152299364144447,33.486747850171199,33.77691334139903]
[null,null,null,null,"Coincident",28.614509303174358,28.993752439152509,29.44110504226737,29.850169127868789,30.232037904539489,30.537026080340411,30.80163198393203]
[null,null,"WEATHER CORRECTED MD 50% POE","MW","Non-coincident",27.867834089999999,28.245616909999999,28.64812088,29.030961990000002,29.392026900000001,29.68892288,29.949192050000001]
[null,null,null,null,"Coincident",25.41306131657031,25.7575666677218,26.12461557567563,26.473733651070841,26.802993710085779,27.073737238987821,27.311080275933641]
[null,null,"WEATHER CORRECTED MD 50% POE","MVA","Non-coincident",28.560233933864669,28.958194238755169,29.382280917884671,29.785728208024029,30.166294179838641,30.47927223208665,30.753673057372541]
[null,null,null,null,"Coincident",26.044470260332851,26.407375737560891,26.794106214908101,27.16201534947535,27.509058695057611,27.794467686902209,28.044697574728701]
[null,"Ashgrove West (110)","CONNECTION POINT RATING","MVA","Non-coincident",457.26,457.26,457.26,457.26,457.26,457.26,457.26]
[null,null,null,null,"Coincident",457.26,457.26,457.26,457.26,457.26,457.26,457.26]
[null,null,"WINTER/SUMMER PEAKING",null,"Non-coincident","Summer","Summer","Summer","Summer","Summer","Summer","Summer"]
[null,null,null,null,"Coincident","Summer","Summer","Summer","Summer","Summer","Summer","Summer"]
[null,null,"ADJUSTMENTS - EMBEDDED GENERATION","MW","Non-coincident",0,0,0,0,0,0,0]
[null,null,null,null,"Coincident",0,0,0,0,0,0,0]
[null,null,"WEATHER CORRECTED MD 10% POE","MW","Non-coincident",125.4557037,131.13288879999999,132.50677490000001,134.50642400000001,141.20808410000001,144.76301570000001,146.20196530000001]
[null,null,null,null,"Coincident",88.796345313431914,92.814602544313544,93.787025965162172,95.202358443101105,99.945729265330598,102.4618757984055,103.4803505412978]
[null,null,"WEATHER CORRECTED MD 10% POE","MVA","Non-coincident",125.6659958873919,131.37364521291079,132.75503894285939,134.7657029679859,141.50498382795149,145.08027475727991,146.52753841721369]
[null,null,null,null,"Coincident",88.945188109236724,92.985007627117696,93.962744876526841,95.385873612956146,100.1558720487125,102.68642872005989,103.7107880749313]
[null,null,"WEATHER CORRECTED MD 50% POE","MW","Non-coincident",118.0022049,123.4753494,124.7189331,126.681427,133.1718903,136.56387330000001,137.8665924]
[null,null,null,null,"Coincident",83.520830261356593,87.394669510104208,88.274866140425729,89.663900523721793,94.257788274007936,96.6586013489203,97.580653448891923]
[null,null,"WEATHER CORRECTED MD 50% POE","MVA","Non-coincident",118.17403627240699,123.6752421604611,124.9253418787694,126.8982168163456,133.4238067184736,136.83458997698949,138.14460369102011]
[null,null,null,null,"Coincident",83.642450860739004,87.536151691145619,88.420960296807465,89.817342279057954,94.436092301845463,96.850212019643948,97.777427177549853]
[null,"Ashgrove West (33)","CONNECTION POINT RATING","MVA","Non-coincident",179.1,179.1,179.1,179.1,179.1,179.1,179.1]
[null,null,null,null,"Coincident",179.1,179.1,179.1,179.1,179.1,179.1,179.1]
[null,null,"WINTER/SUMMER PEAKING",null,"Non-coincident","Summer","Summer","Summer","Summer","Summer","Summer","Summer"]
[null,null,null,null,"Coincident","Summer","Summer","Summer","Summer","Summer","Summer","Summer"]
[null,null,"ADJUSTMENTS - EMBEDDED GENERATION","MW","Non-coincident",0,0,0,0,0,0,0]
[null,null,null,null,"Coincident",0,0,0,0,0,0,0]
[null,null,"WEATHER CORRECTED MD 10% POE","MW","Non-coincident",80.568878170000005,82.410575870000002,83.975990300000007,85.181877139999997,86.427383419999998,87.96016693,89.465560909999994]
[null,null,null,null,"Coincident",79.953377146140681,81.781005309047245,83.334460851120369,84.531135392258349,85.76712670310431,87.288200607097778,88.782094221732791]
[null,null,"WEATHER CORRECTED MD 10% POE","MVA","Non-coincident",81.44967645625637,83.382560862755867,85.027480394913681,86.295793863927003,87.606805099052949,89.22156729866397,90.808869318770931]
[null,null,null,null,"Coincident",80.827446627685873,82.74556488181706,84.377918151676013,85.636542417407824,86.937538262275893,88.539964584688121,90.115140507960419]
[null,null,"WEATHER CORRECTED MD 50% POE","MW","Non-coincident",75.866836550000002,77.729911799999996,79.206848140000005,80.395759580000004,81.518196110000005,82.826515200000003,84.259246829999995]
[null,null,null,null,"Coincident",75.287256485909197,77.136098886328213,78.601752261365903,79.781581085035384,80.895442829719713,82.193767095940117,83.61555346015993]
[null,null,"WEATHER CORRECTED MD 50% POE","MVA","Non-coincident",76.527629966090799,78.475538306299072,80.021945494607095,81.268122787043751,82.445669810585699,83.81945111009729,85.325310092731996]
[null,null,null,null,"Coincident",75.943001811057172,77.876029224473186,79.410622729516319,80.647279926640408,81.815831151617274,83.179117532797946,84.673472597708439]
[null,"Belmont (110)","CONNECTION POINT RATING","MVA","Non-coincident",1289.96,1289.96,1289.96,1289.96,1289.96,1289.96,1289.96]
[null,null,null,null,"Coincident",1289.96,1289.96,1289.96,1289.96,1289.96,1289.96,1289.96]
[null,null,"WINTER/SUMMER PEAKING",null,"Non-coincident","Summer","Summer","Summer","Summer","Summer","Summer","Summer"]
[null,null,null,null,"Coincident","Summer","Summer","Summer","Summer","Summer","Summer","Summer"]
[null,null,"ADJUSTMENTS - EMBEDDED GENERATION","MW","Non-coincident",0,0,0,0,0,0,0]
[null,null,null,null,"Coincident",0,0,0,0,0,0,0]
[null,null,"WEATHER CORRECTED MD 10% POE","MW","Non-coincident",396.02746580000002,407.34728999999999,425.39505000000003,436.38568120000002,444.39526369999999,450.82989500000002,456.84185789999998]
[null,null,null,null,"Coincident",383.95650209286129,394.93129672069921,412.42895887454341,423.08459434371508,430.85004382765891,437.08854680930051,442.91726437345488]
[null,null,"WEATHER CORRECTED MD 10% POE","MVA","Non-coincident",400.49762879159471,412.32761438623561,431.21758718423479,442.73681180298553,451.13846139986919,457.89200190464851,464.20495105826501]
[null,null,null,null,"Coincident",388.29041399104358,399.75982023424888,418.0740244410145,429.2421417394018,437.38770806903239,443.93539986540651,450.05592958678892]
[null,null,"WEATHER CORRECTED MD 50% POE","MW","Non-coincident",372.3407593,383.67126459999997,400.67742920000001,411.33911130000001,419.17346190000001,425.47393799999998,431.28741459999998]
[null,null,null,null,"Coincident",360.99176919114581,371.97691935780028,388.46473406186692,398.80144683827172,406.39700551112452,412.50544235903072,418.14172350893949]
[null,null,"WEATHER CORRECTED MD 50% POE","MVA","Non-coincident",375.79518728057701,387.60226911908939,405.35536210369008,416.5027804848034,424.70188750002859,431.30022843185179,437.39194947248012]
[null,null,null,null,"Coincident",364.34090580083722,375.78810639709269,393.00008302080249,403.80772677937819,411.75692404904629,418.1541467736904,424.06019144097189]
[null,"Belmont (Wecker Road 33)","CONNECTION POINT RATING","MVA","Non-coincident",307,307,307,307,307,307,307]
[null,null,null,null,"Coincident",307,307,307,307,307,307,307]
[null,null,"WINTER/SUMMER PEAKING",null,"Non-coincident","Summer","Summer","Summer","Summer","Summer","Summer","Summer"]
[null,null,null,null,"Coincident","Summer","Summer","Summer","Summer","Summer","Summer","Summer"]
[null,null,"ADJUSTMENTS - EMBEDDED GENERATION","MW","Non-coincident",0,0,0,0,0,0,0]
[null,null,null,null,"Coincident",0,0,0,0,0,0,0]
[null,null,"WEATHER CORRECTED MD 10% POE","MW","Non-coincident",144.8737793,147.53987119999999,149.9849701,152.50318909999999,155.00688170000001,157.4206848,159.8296814]
[null,null,null,null,"Coincident",144.8737793,147.53987119999999,149.9849701,152.50318909999999,155.00688170000001,157.4206848,159.8296814]
[null,null,"WEATHER CORRECTED MD 10% POE","MVA","Non-coincident",147.0149182223706,149.8081536187143,152.37129368086579,155.01244458798041,157.6396624754249,160.1737248818564,162.70383151957279]
[null,null,null,null,"Coincident",147.0149182223706,149.8081536187143,152.37129368086579,155.01244458798041,157.6396624754249,160.1737248818564,162.70383151957279]
[null,null,"WEATHER CORRECTED MD 50% POE","MW","Non-coincident",130.88961789999999,133.28875729999999,135.4925537,137.6164551,139.94381709999999,142.43824770000001,144.91593929999999]
[null,null,null,null,"Coincident",130.88961789999999,133.28875729999999,135.4925537,137.6164551,139.94381709999999,142.43824770000001,144.91593929999999]
[null,null,"WEATHER CORRECTED MD 50% POE","MVA","Non-coincident",132.3946508475216,134.89884006159721,137.20072906754979,139.420539771112,141.85447100351101,144.46474331227441,147.05907534695791]
[null,null,null,null,"Coincident",132.3946508475216,134.89884006159721,137.20072906754979,139.420539771112,141.85447100351101,144.46474331227441,147.05907534695791]
[null,"Biloela","CONNECTION POINT RATING","MVA","Non-coincident",232.1,232.1,232.1,232.1,232.1,232.1,232.1]
[null,null,null,null,"Coincident",232.1,232.1,232.1,232.1,232.1,232.1,232.1]
[null,null,"WINTER/SUMMER PEAKING",null,"Non-coincident","Summer","Summer","Summer","Summer","Summer","Summer","Summer"]
[null,null,null,null,"Coincident","Summer","Summer","Summer","Summer","Summer","Summer","Summer"]
[null,null,"ADJUSTMENTS - EMBEDDED GENERATION","MW","Non-coincident",0,0,0,0,0,0,0]
[null,null,null,null,"Coincident",0,0,0,0,0,0,0]
[null,null,"WEATHER CORRECTED MD 10% POE","MW","Non-coincident",39.268142699999999,39.5750618,39.871070860000003,40.165664669999998,40.448177340000001,40.692096710000001,40.857948299999997]
[null,null,null,null,"Coincident",24.243422957417781,24.432909117021911,24.615659620289481,24.79753637445711,24.971954456869732,25.122545751690939,25.224939447141431]
[null,null,"WEATHER CORRECTED MD 10% POE","MVA","Non-coincident",39.269427862432977,39.57724229063821,39.87432872494189,40.170198610402338,40.454121881771627,40.699403330038081,40.866256080238863]
[null,null,null,null,"Coincident",24.244216392866711,24.434255311498202,24.617670965677721,24.800335545165979,24.975624506700171,25.127056723379251,25.230068516568181]
[null,null,"WEATHER CORRECTED MD 50% POE","MW","Non-coincident",36.140796659999999,36.426719669999997,36.750370029999999,37.017574310000001,37.292312619999997,37.48739243,37.606563569999999]
[null,null,null,null,"Coincident",22.31265751834022,22.489181081413861,22.688996810610561,22.853963776977221,23.023582113724689,23.144020770078122,23.217594821527658]
[null,null,"WEATHER CORRECTED MD 50% POE","MVA","Non-coincident",36.14715986912168,36.431451684933741,36.753558325138862,37.019724654522037,37.293613689907737,37.488221969004492,37.607157962965182]
[null,null,null,null,"Coincident",22.31658604562714,22.492102539664529,22.690965204892791,22.855291359800539,23.024385370153482,23.144532912073199,23.21796178871956]
[null,"Blackstone","CONNECTION POINT RATING","MVA","Non-coincident",457.26,457.26,457.26,457.26,457.26,457.26,457.26]
[null,null,null,null,"Coincident",457.26,457.26,457.26,457.26,457.26,457.26,457.26]
[null,null,"WINTER/SUMMER PEAKING",null,"Non-coincident","Summer","Summer","Summer","Summer","Summer","Summer","Summer"]
[null,null,null,null,"Coincident","Summer","Summer","Summer","Summer","Summer","Summer","Summer"]
[null,null,"ADJUSTMENTS - EMBEDDED GENERATION","MW","Non-coincident",0,0,0,0,0,0,0]
[null,null,null,null,"Coincident",0,0,0,0,0,0,0]
[null,null,"WEATHER CORRECTED MD 10% POE","MW","Non-coincident",118.5389938,127.01191710000001,132.4056396,137.50735470000001,143.34216309999999,146.7942505,150.25579830000001]
[null,null,null,null,"Coincident",115.0103688906748,123.23107334476801,128.4642375090055,133.41408664148679,139.07520662384991,142.4245335633608,145.7830392891847]
[null,null,"WEATHER CORRECTED MD 10% POE","MVA","Non-coincident",119.47810445989511,128.03484981759851,133.48199500877311,138.63427969583159,144.52696571252909,148.01331423193579,151.50922995843251]
[null,null,null,null,"Coincident",115.92152445190661,124.22355577970281,129.50855236820979,134.50746575099211,140.2247404705731,143.6073086571644,146.9991592577648]
[null,null,"WEATHER CORRECTED MD 50% POE","MW","Non-coincident",110.0363617,118.1988525,123.16985320000001,127.0879211,133.52107240000001,136.9075775,139.9079437]
[null,null,null,null,"Coincident",106.760839997148,114.6803527910447,119.5033785814222,123.3048148858167,129.54646651811291,132.83216338726541,135.7432157963261]
[null,null,"WEATHER CORRECTED MD 50% POE","MVA","Non-coincident",110.8915038665241,119.1346012488511,124.15476029388699,128.1116061037267,134.6084813021593,138.02855561962889,141.0586759611557]
[null,null,null,null,"Coincident",107.5905266080522,115.58824651735659,120.458967325343,124.2980272131045,130.60150583440199,133.91977264497871,136.85969348528991]
[null,"Blackwater (66/11)","CONNECTION POINT RATING","MVA","Non-coincident",331.6,331.6,331.6,331.6,331.6,331.6,331.6]
[null,null,null,null,"Coincident",331.6,331.6,331.6,331.6,331.6,331.6,331.6]
[null,null,"WINTER/SUMMER PEAKING",null,"Non-coincident","Winter","Winter","Winter","Winter","Winter","Winter","Winter"]
[null,null,null,null,"Coincident","Winter","Winter","Winter","Winter","Winter","Winter","Winter"]
[null,null,"ADJUSTMENTS - EMBEDDED GENERATION","MW","Non-coincident",0,0,0,0,0,0,0]
[null,null,null,null,"Coincident",0,0,0,0,0,0,0]
[null,null,"WEATHER CORRECTED MD 10% POE","MW","Non-coincident",106.3926544,108.0469208,109.5528564,110.96751399999999,112.2344971,113.23356630000001,113.9811401]
[null,null,null,null,"Coincident",66.045735426508401,67.072660091519509,68.007504933655156,68.885686816564359,69.672196290215169,70.292391927104688,70.756465896167995]
[null,null,"WEATHER CORRECTED MD 10% POE","MVA","Non-coincident",106.9008600476254,108.5530732068277,110.0572209249105,111.4702668401938,112.73586000251289,113.7338677110309,114.4806667101453]
[null,null,null,null,"Coincident",66.361216001127147,67.386866068758764,68.320601041263473,69.197782433086203,69.98342907032368,70.60296576148076,71.066558754723033]
[null,null,"WEATHER CORRECTED MD 50% POE","MW","Non-coincident",103.7864151,105.0916443,106.6300201,108.0534439,109.3534775,110.4600143,111.30971529999999]
[null,null,null,null,"Coincident",64.427851257373817,65.238102894578503,66.193085751678296,67.076709458829612,67.883735805482829,68.570644475490553,69.098116299124641]
[null,null,"WEATHER CORRECTED MD 50% POE","MVA","Non-coincident",104.2980556191619,105.6015331249324,107.1379251454206,108.5595884290408,109.85807440945349,110.96333797150299,111.81208781453709]
[null,null,null,null,"Coincident",64.745464109056257,65.554628340985815,66.508379720428465,67.390910545747914,68.196976171246263,68.883094448935182,69.409975819575365]
[null,"Blackwater (Rolleston 132)","CONNECTION POINT RATING","MVA","Non-coincident",91.45,91.45,91.45,91.45,91.45,91.45,91.45]
[null,null,null,null,"Coincident",91.45,91.45,91.45,91.45,91.45,91.45,91.45]
[null,null,"WINTER/SUMMER PEAKING",null,"Non-coincident","Summer","Summer","Summer","Summer","Summer","Summer","Summer"]
[null,null,null,null,"Coincident","Summer","Summer","Summer","Summer","Summer","Summer","Summer"]
[null,null,"ADJUSTMENTS - EMBEDDED GENERATION","MW","Non-coincident",0,0,0,0,0,0,0]
[null,null,null,null,"Coincident",0,0,0,0,0,0,0]
[null,null,"WEATHER CORRECTED MD 10% POE","MW","Non-coincident",29.010932919999998,29.315742490000002,29.695440290000001,30.01619148,30.33142853,30.595890050000001,30.774877549999999]
[null,null,null,null,"Coincident",15.617377442137579,15.78146475762628,15.98586645242532,16.15853557730518,16.328236290038969,16.47060314835927,16.566957007527911]
[null,null,"WEATHER CORRECTED MD 10% POE","MVA","Non-coincident",30.005472308767029,30.28763692787297,30.639847672437291,30.937984241993529,31.23151879613339,31.478163278543882,31.645289378322101]
[null,null,null,null,"Coincident",16.15276515470368,16.304662074721598,16.494266736943452,16.65476179406221,16.812779460607199,16.94555492103267,17.035523464542329]
[null,null,"WEATHER CORRECTED MD 50% POE","MW","Non-coincident",24.576744080000001,24.85532761,25.17362022,25.44972229,25.71294022,25.926309589999999,26.08358192]
[null,null,null,null,"Coincident",13.23033249756589,13.38030161952314,13.551647223648351,13.700280507922111,13.841977907784569,13.9568404664989,14.04150445664315]
[null,null,"WEATHER CORRECTED MD 50% POE","MVA","Non-coincident",25.969635080679879,26.218805599354418,26.504306920237521,26.752646717502419,26.989971101657179,27.182751641968249,27.325072879260059]
[null,null,null,null,"Coincident",13.98016376129536,14.114299056024571,14.267992213730169,14.40168030843863,14.529438505453131,14.633217534891431,14.70983294353573]
[null,"Blackwater Rail (Rangal 132)","CONNECTION POINT RATING","MVA","Non-coincident"]
[null,null,null,null,"Coincident"]
[null,null,"WINTER/SUMMER PEAKING",null,"Non-coincident","Shoulder","Shoulder","Shoulder","Shoulder","Shoulder","Shoulder","Shoulder"]
[null,null,null,null,"Coincident","Shoulder","Shoulder","Shoulder","Shoulder","Shoulder","Shoulder","Shoulder"]
[null,null,"ADJUSTMENTS - EMBEDDED GENERATION","MW","Non-coincident",0,0,0,0,0,0,0]
[null,null,null,null,"Coincident",0,0,0,0,0,0,0]
[null,null,"WEATHER CORRECTED MD 10% POE","MW","Non-coincident",7.0859518049999997,7.0859518049999997,7.0859518049999997,7.0859518049999997,7.0859518049999997,7.0859518049999997,7.0859518049999997]
[null,null,null,null,"Coincident",0.83251484781926854,0.83251484781926854,0.83251484781926854,0.83251484781926854,0.83251484781926854,0.83251484781926854,0.83251484781926854]
[null,null,"WEATHER CORRECTED MD 10% POE","MVA","Non-coincident",7.0935955362335834,7.0935955362335834,7.0935955362335834,7.0935955362335834,7.0935955362335834,7.0935955362335834,7.0935955362335834]
[null,null,null,null,"Coincident",0.83341289509926941,0.83341289509926941,0.83341289509926941,0.83341289509926941,0.83341289509926941,0.83341289509926941,0.83341289509926941]
[null,null,"WEATHER CORRECTED MD 50% POE","MW","Non-coincident",7.0859518049999997,7.0859518049999997,7.0859518049999997,7.0859518049999997,7.0859518049999997,7.0859518049999997,7.0859518049999997]
[null,null,null,null,"Coincident",0.83251484781926854,0.83251484781926854,0.83251484781926854,0.83251484781926854,0.83251484781926854,0.83251484781926854,0.83251484781926854]
[null,null,"WEATHER CORRECTED MD 50% POE","MVA","Non-coincident",7.0935955362335834,7.0935955362335834,7.0935955362335834,7.0935955362335834,7.0935955362335834,7.0935955362335834,7.0935955362335834]
[null,null,null,null,"Coincident",0.83341289509926941,0.83341289509926941,0.83341289509926941,0.83341289509926941,0.83341289509926941,0.83341289509926941,0.83341289509926941]
[null,"Bluff (Rail)","CONNECTION POINT RATING","MVA","Non-coincident"]
[null,null,null,null,"Coincident"]
[null,null,"WINTER/SUMMER PEAKING",null,"Non-coincident","Shoulder","Shoulder","Shoulder","Shoulder","Shoulder","Shoulder","Shoulder"]
[null,null,null,null,"Coincident","Shoulder","Shoulder","Shoulder","Shoulder","Shoulder","Shoulder","Shoulder"]
[null,null,"ADJUSTMENTS - EMBEDDED GENERATION","MW","Non-coincident",0,0,0,0,0,0,0]
[null,null,null,null,"Coincident",0,0,0,0,0,0,0]
[null,null,"WEATHER CORRECTED MD 10% POE","MW","Non-coincident"]
[null,null,null,null,"Coincident"]
[null,null,"WEATHER CORRECTED MD 10% POE","MVA","Non-coincident"]
[null,null,null,null,"Coincident"]
[null,null,"WEATHER CORRECTED MD 50% POE","MW","Non-coincident"]
[null,null,null,null,"Coincident"]
[null,null,"WEATHER CORRECTED MD 50% POE","MVA","Non-coincident"]
[null,null,null,null,"Coincident"]
[null,"Bolingbroke (Rail)","CONNECTION POINT RATING","MVA","Non-coincident",91.45,91.45,91.45,91.45,91.45,91.45,91.45]
[null,null,null,null,"Coincident",91.45,91.45,91.45,91.45,91.45,91.45,91.45]
[null,null,"WINTER/SUMMER PEAKING",null,"Non-coincident","Shoulder","Shoulder","Shoulder","Shoulder","Shoulder","Shoulder","Shoulder"]
[null,null,null,null,"Coincident","Shoulder","Shoulder","Shoulder","Shoulder","Shoulder","Shoulder","Shoulder"]
[null,null,"ADJUSTMENTS - EMBEDDED GENERATION","MW","Non-coincident",0,0,0,0,0,0,0]
[null,null,null,null,"Coincident",0,0,0,0,0,0,0]
[null,null,"WEATHER CORRECTED MD 10% POE","MW","Non-coincident"]
[null,null,null,null,"Coincident"]
[null,null,"WEATHER CORRECTED MD 10% POE","MVA","Non-coincident"]
[null,null,null,null,"Coincident"]
[null,null,"WEATHER CORRECTED MD 50% POE","MW","Non-coincident"]
[null,null,null,null,"Coincident"]
[null,null,"WEATHER CORRECTED MD 50% POE","MVA","Non-coincident"]
[null,null,null,null,"Coincident"]
[null,"Bowen North","CONNECTION POINT RATING","MVA","Non-coincident",134.6,134.6,134.6,134.6,134.6,134.6,134.6]
[null,null,null,null,"Coincident",134.6,134.6,134.6,134.6,134.6,134.6,134.6]
[null,null,"WINTER/SUMMER PEAKING",null,"Non-coincident","Summer","Summer","Summer","Summer","Summer","Summer","Summer"]
[null,null,null,null,"Coincident","Summer","Summer","Summer","Summer","Summer","Summer","Summer"]
[null,null,"ADJUSTMENTS - EMBEDDED GENERATION","MW","Non-coincident",0,0,0,0,0,0,0]
[null,null,null,null,"Coincident",0,0,0,0,0,0,0]
[null,null,"WEATHER CORRECTED MD 10% POE","MW","Non-coincident",40.196685789999997,40.744750979999999,41.373992919999999,41.934123990000003,42.479293820000002,42.973411560000002,43.402297969999999]
[null,null,null,null,"Coincident",31.972226512315469,32.408154600758877,32.908650237186038,33.354175461334783,33.787800596090953,34.18081917452718,34.521953105822213]
[null,null,"WEATHER CORRECTED MD 10% POE","MVA","Non-coincident",41.186876105676689,41.76328145525855,42.425186798353451,43.014501887383318,43.588170101849812,44.108194292026333,44.559624374619318]
[null,null,null,null,"Coincident",32.759818534914309,33.218288233038678,33.744764163658992,34.213502198730417,34.66979479438519,35.083419223201737,35.442484269771498]
[null,null,"WEATHER CORRECTED MD 50% POE","MW","Non-coincident",32.379528049999998,32.862426759999998,33.342380519999999,33.785984040000002,34.211036679999999,34.588230129999999,34.915676120000001]
[null,null,null,null,"Coincident",25.754501517486229,26.138596540127779,26.520349165464239,26.873189006469961,27.211273577838249,27.511291208280849,27.771739978050672]
[null,null,"WEATHER CORRECTED MD 50% POE","MVA","Non-coincident",32.97977100527698,33.48579430888892,33.988884025371533,34.454000494935507,34.899778465637922,35.295451827802452,35.639005640043941]
[null,null,null,null,"Coincident",26.231931518277779,26.634419717631179,27.034574557645382,27.40452568240222,27.759095069738219,28.073811522385679,28.347072366862751]
[null,"Boyne Island (132)","CONNECTION POINT RATING","MVA","Non-coincident",816.55,816.55,816.55,816.55,816.55,816.55,816.55]
[null,null,null,null,"Coincident",816.55,816.55,816.55,816.55,816.55,816.55,816.55]
[null,null,"WINTER/SUMMER PEAKING",null,"Non-coincident","Shoulder","Shoulder","Shoulder","Shoulder","Summer","Shoulder","Shoulder"]
[null,null,null,null,"Coincident","Shoulder","Shoulder","Shoulder","Shoulder","Summer","Shoulder","Shoulder"]
[null,null,"ADJUSTMENTS - EMBEDDED GENERATION","MW","Non-coincident",0,0,0,0,0,0,0]
[null,null,null,null,"Coincident",0,0,0,0,0,0,0]
[null,null,"WEATHER CORRECTED MD 10% POE","MW","Non-coincident"]
[null,null,null,null,"Coincident"]
[null,null,"WEATHER CORRECTED MD 10% POE","MVA","Non-coincident"]
[null,null,null,null,"Coincident"]
[null,null,"WEATHER CORRECTED MD 50% POE","MW","Non-coincident"]
[null,null,null,null,"Coincident"]
[null,null,"WEATHER CORRECTED MD 50% POE","MVA","Non-coincident"]
[null,null,null,null,"Coincident"]
[null,"Boyne Island (275)","CONNECTION POINT RATING","MVA","Non-coincident",1769.88,1769.88,1769.88,1769.88,1769.88,1769.88,1769.88]
[null,null,null,null,"Coincident",1769.88,1769.88,1769.88,1769.88,1769.88,1769.88,1769.88]
[null,null,"WINTER/SUMMER PEAKING",null,"Non-coincident","Summer","Shoulder","Shoulder","Shoulder","Shoulder","Shoulder","Summer"]
[null,null,null,null,"Coincident","Summer","Shoulder","Shoulder","Shoulder","Shoulder","Shoulder","Summer"]
[null,null,"ADJUSTMENTS - EMBEDDED GENERATION","MW","Non-coincident",0,0,0,0,0,0,0]
[null,null,null,null,"Coincident",0,0,0,0,0,0,0]
[null,null,"WEATHER CORRECTED MD 10% POE","MW","Non-coincident"]
[null,null,null,null,"Coincident"]
[null,null,"WEATHER CORRECTED MD 10% POE","MVA","Non-coincident"]
[null,null,null,null,"Coincident"]
[null,null,"WEATHER CORRECTED MD 50% POE","MW","Non-coincident"]
[null,null,null,null,"Coincident"]
[null,null,"WEATHER CORRECTED MD 50% POE","MVA","Non-coincident"]
[null,null,null,null,"Coincident"]
[null,"Braemar (QGC Kumbarilla Park)","CONNECTION POINT RATING","MVA","Non-coincident"]
[null,null,null,null,"Coincident"]
[null,null,"WINTER/SUMMER PEAKING",null,"Non-coincident","Shoulder","Shoulder","Shoulder","Shoulder","Summer","Shoulder","Shoulder"]
[null,null,null,null,"Coincident","Shoulder","Shoulder","Shoulder","Shoulder","Summer","Shoulder","Shoulder"]
[null,null,"ADJUSTMENTS - EMBEDDED GENERATION","MW","Non-coincident",0,0,0,0,0,0,0]
[null,null,null,null,"Coincident",0,0,0,0,0,0,0]
[null,null,"WEATHER CORRECTED MD 10% POE","MW","Non-coincident"]
[null,null,null,null,"Coincident"]
[null,null,"WEATHER CORRECTED MD 10% POE","MVA","Non-coincident"]
[null,null,null,null,"Coincident"]
[null,null,"WEATHER CORRECTED MD 50% POE","MW","Non-coincident"]
[null,null,null,null,"Coincident"]
[null,null,"WEATHER CORRECTED MD 50% POE","MVA","Non-coincident"]
[null,null,null,null,"Coincident"]
[null,"Bulli Creek (Waggamba 132)","CONNECTION POINT RATING","MVA","Non-coincident",130,130,130,130,130,130,130]
[null,null,null,null,"Coincident",130,130,130,130,130,130,130]
[null,null,"WINTER/SUMMER PEAKING",null,"Non-coincident","Winter","Winter","Winter","Winter","Winter","Winter","Winter"]
[null,null,null,null,"Coincident","Winter","Winter","Winter","Winter","Winter","Winter","Winter"]
[null,null,"ADJUSTMENTS - EMBEDDED GENERATION","MW","Non-coincident",0,0,0,0,0,0,0]
[null,null,null,null,"Coincident",0,0,0,0,0,0,0]
[null,null,"WEATHER CORRECTED MD 10% POE","MW","Non-coincident",25.967668530000001,26.266016010000001,26.527845379999999,26.77527237,26.991800309999999,27.154047009999999,27.271265029999999]
[null,null,null,null,"Coincident",20.79903830360356,21.03800240841468,21.247717003675589,21.445895882784821,21.61932588912742,21.74927884674603,21.843165677018678]
[null,null,"WEATHER CORRECTED MD 10% POE","MVA","Non-coincident",26.267831316642109,26.549472536322089,26.797190164904858,27.031740307792202,27.23735605755342,27.39163937865359,27.503215980776101]
[null,null,null,null,"Coincident",21.03945639464138,21.265039469580511,21.463451138283791,21.651316190565758,21.816005979722888,21.939580597192389,22.028948882937829]
[null,null,"WEATHER CORRECTED MD 50% POE","MW","Non-coincident",24.628934860000001,24.913305279999999,25.160789489999999,25.39540482,25.603450779999999,25.757154459999999,25.86825752]
[null,null,null,null,"Coincident",19.726767496985481,19.954536549534762,20.152761259519039,20.340678524006801,20.507314811972009,20.630425160674719,20.71941415858641]
[null,null,"WEATHER CORRECTED MD 50% POE","MVA","Non-coincident",25.012859788115019,25.27817349964263,25.5096442701693,25.72955622671806,25.92494282846932,26.069517708239939,26.174138548052209]
[null,null,null,null,"Coincident",20.034275630661298,20.246781040692969,20.432179641910739,20.608320106827481,20.76481676763246,20.88061532146158,20.964412326652731]
[null,"Bundamba","CONNECTION POINT RATING","MVA","Non-coincident",685.89,685.89,685.89,685.89,685.89,685.89,685.89]
[null,null,null,null,"Coincident",685.89,685.89,685.89,685.89,685.89,685.89,685.89]
[null,null,"WINTER/SUMMER PEAKING",null,"Non-coincident","Summer","Summer","Summer","Summer","Summer","Summer","Summer"]
[null,null,null,null,"Coincident","Summer","Summer","Summer","Summer","Summer","Summer","Summer"]
[null,null,"ADJUSTMENTS - EMBEDDED GENERATION","MW","Non-coincident",0,0,0,0,0,0,0]
[null,null,null,null,"Coincident",0,0,0,0,0,0,0]
[null,null,"WEATHER CORRECTED MD 10% POE","MW","Non-coincident",41.543464659999998,42.343528749999997,45.643653870000001,46.383403780000002,47.097389219999997,47.707569120000002,48.384857179999997]
[null,null,null,null,"Coincident",40.54041046126197,41.321157249460057,44.541601861705892,45.263490737261257,45.960237218034059,46.555684511697798,47.216619659443168]
[null,null,"WEATHER CORRECTED MD 10% POE","MVA","Non-coincident",44.150644796955469,45.017208524385737,48.592069130194737,49.393489038811062,50.167023650434103,50.828114930127512,51.561934234957448]
[null,null,null,null,"Coincident",43.084641034317507,43.930281846618122,47.418828540722679,48.200898411712892,48.955756267643849,49.600885701370068,50.316987164396288]
[null,null,"WEATHER CORRECTED MD 50% POE","MW","Non-coincident",37.704601289999999,38.434448240000002,41.519332890000001,42.144592289999999,42.766853330000004,43.279094700000002,43.851791380000002]
[null,null,null,null,"Coincident",36.794235268648578,37.506460288132551,40.516861345439217,41.127024049205453,41.734260787453273,42.234134246852868,42.79300334135467]
[null,null,"WEATHER CORRECTED MD 50% POE","MVA","Non-coincident",39.993400771722449,40.783680083581338,44.12450793186558,44.801732453730608,45.475736301437699,46.030591872574668,46.650951472831167]
[null,null,null,null,"Coincident",39.027772389636297,39.798970650157202,43.059135235810167,43.720008379529332,44.37773861127922,44.919197365013567,45.524578573196678]
[null,"Cairns (22)","CONNECTION POINT RATING","MVA","Non-coincident",178.32,178.32,178.32,178.32,178.32,178.32,178.32]
[null,null,null,null,"Coincident",178.32,178.32,178.32,178.32,178.32,178.32,178.32]
[null,null,"WINTER/SUMMER PEAKING",null,"Non-coincident","Summer","Summer","Summer","Summer","Summer","Summer","Summer"]
[null,null,null,null,"Coincident","Summer","Summer","Summer","Summer","Summer","Summer","Summer"]
[null,null,"ADJUSTMENTS - EMBEDDED GENERATION","MW","Non-coincident",0,0,0,0,0,0,0]
[null,null,null,null,"Coincident",0,0,0,0,0,0,0]
[null,null,"WEATHER CORRECTED MD 10% POE","MW","Non-coincident",63.719680789999998,64.601409910000001,65.266799930000005,65.956077579999999,66.787338259999999,67.453979489999995,68.38859558]
[null,null,null,null,"Coincident",54.216614688532061,54.966843932715612,55.532998594582587,56.119478317960798,56.82676591630608,57.393985184423798,58.189213908187043]
[null,null,"WEATHER CORRECTED MD 10% POE","MVA","Non-coincident",63.930063855873343,64.821481885089639,65.494251760845188,66.190042289805689,67.027385690820822,67.698919506564749,68.64041585580587]
[null,null,null,null,"Coincident",54.395621511510953,55.154094674233001,55.726528570254878,56.318549850727173,57.031013001389198,57.60239518170016,58.403478052245177]
[null,null,"WEATHER CORRECTED MD 50% POE","MW","Non-coincident",59.936901089999999,60.74956512,61.362693790000002,61.836956020000002,62.633617399999999,63.357841489999998,64.04186249]
[null,null,null,null,"Coincident",50.997993582716873,51.689458010025398,52.211145508200993,52.614676917436633,53.292525308093857,53.908739607174986,54.490746650149447]
[null,null,"WEATHER CORRECTED MD 50% POE","MVA","Non-coincident",60.106990135851781,60.928125336592473,61.547714966306287,62.02701468120059,62.832213751709141,63.56427922141993,64.255773691583741]
[null,null,null,null,"Coincident",51.14271578074667,51.841387999969953,52.368572879158428,52.77639048967643,53.461503271349017,54.084389497488402,54.672755427501123]
[null,"Callemondah (Rail)","CONNECTION POINT RATING","MVA","Non-coincident",320.08,320.08,320.08,320.08,320.08,320.08,320.08]
[null,null,null,null,"Coincident",320.08,320.08,320.08,320.08,320.08,320.08,320.08]
[null,null,"WINTER/SUMMER PEAKING",null,"Non-coincident","Shoulder","Shoulder","Shoulder","Shoulder","Shoulder","Shoulder","Shoulder"]
[null,null,null,null,"Coincident","Shoulder","Shoulder","Shoulder","Shoulder","Shoulder","Shoulder","Shoulder"]
[null,null,"ADJUSTMENTS - EMBEDDED GENERATION","MW","Non-coincident",0,0,0,0,0,0,0]
[null,null,null,null,"Coincident",0,0,0,0,0,0,0]
[null,null,"WEATHER CORRECTED MD 10% POE","MW","Non-coincident"]
[null,null,null,null,"Coincident"]
[null,null,"WEATHER CORRECTED MD 10% POE","MVA","Non-coincident"]
[null,null,null,null,"Coincident"]
[null,null,"WEATHER CORRECTED MD 50% POE","MW","Non-coincident"]
[null,null,null,null,"Coincident"]
[null,null,"WEATHER CORRECTED MD 50% POE","MVA","Non-coincident"]
[null,null,null,null,"Coincident"]
[null,"Calliope River (Ergon)","CONNECTION POINT RATING","MVA","Non-coincident",362.42,362.42,362.42,362.42,362.42,362.42,362.42]
[null,null,null,null,"Coincident",362.42,362.42,362.42,362.42,362.42,362.42,362.42]
[null,null,"WINTER/SUMMER PEAKING",null,"Non-coincident","Summer","Summer","Summer","Summer","Summer","Summer","Summer"]
[null,null,null,null,"Coincident","Summer","Summer","Summer","Summer","Summer","Summer","Summer"]
[null,null,"ADJUSTMENTS - EMBEDDED GENERATION","MW","Non-coincident",0,0,0,0,0,0,0]
[null,null,null,null,"Coincident",0,0,0,0,0,0,0]
[null,null,"WEATHER CORRECTED MD 10% POE","MW","Non-coincident",63.567035679999996,64.481735229999998,65.46392822,66.442642210000002,67.399620060000004,68.259666440000004,69.031578060000001]
[null,null,null,null,"Coincident",44.855844651945453,45.50129902116521,46.194379887786958,46.885005810869572,47.560293706801119,48.167182267862117,48.71187886007155]
[null,null,"WEATHER CORRECTED MD 10% POE","MVA","Non-coincident",63.567304884648003,64.482664140084708,65.465986472231933,66.446240632265955,67.405107483586463,68.267161407737603,69.041115256279198]
[null,null,null,null,"Coincident",44.856034615214007,45.501954503145917,46.195832285895229,46.887545024290922,47.564165887048333,48.172471064247112,48.718608747506742]
[null,null,"WEATHER CORRECTED MD 50% POE","MW","Non-coincident",58.513065339999997,59.38941956,60.292011260000002,61.186851500000003,62.059024809999997,62.84809113,63.571891780000001]
[null,null,null,null,"Coincident",41.28952909197816,41.907925220284078,42.544835729736612,43.176276449983668,43.791722334543643,44.348524077638579,44.859271341028617]
[null,null,"WEATHER CORRECTED MD 50% POE","MVA","Non-coincident",58.517314875893227,59.391974132053953,60.293284711267773,61.187299896988307,62.059077179600393,62.848118229834391,63.572163459257752]
[null,null,null,null,"Coincident",41.292527761332963,41.909727844647151,42.545734335934434,43.176592859667309,43.791759288959312,44.34854320053693,44.859463050496437]
[null,"Cardwell","CONNECTION POINT RATING","MVA","Non-coincident",64.7,64.7,64.7,64.7,64.7,64.7,64.7]
[null,null,null,null,"Coincident",64.7,64.7,64.7,64.7,64.7,64.7,64.7]
[null,null,"WINTER/SUMMER PEAKING",null,"Non-coincident","Summer","Summer","Summer","Summer","Summer","Summer","Summer"]
[null,null,null,null,"Coincident","Summer","Summer","Summer","Summer","Summer","Summer","Summer"]
[null,null,"ADJUSTMENTS - EMBEDDED GENERATION","MW","Non-coincident",0,0,0,0,0,0,0]
[null,null,null,null,"Coincident",0,0,0,0,0,0,0]
[null,null,"WEATHER CORRECTED MD 10% POE","MW","Non-coincident",6.3880095480000003,6.4664793009999997,6.5497756000000003,6.6268234250000004,6.6996941569999997,6.756257057,6.8030824660000002]
[null,null,null,null,"Coincident",4.8925191293223129,4.9526184082512072,5.0164142954046387,5.0754245324515139,5.1312355714925149,5.1745565884979747,5.2104197486184178]
[null,null,"WEATHER CORRECTED MD 10% POE","MVA","Non-coincident",6.7082594465755152,6.7949966174360306,6.8870972701018491,6.9723142100603326,7.0529325277723807,7.115523022408099,7.1673473515127659]
[null,null,null,null,"Coincident",5.1377956498364048,5.2042268698384522,5.2747659323750238,5.3400328211854404,5.4017776665267352,5.4497151641178077,5.4894069522411142]
[null,null,"WEATHER CORRECTED MD 50% POE","MW","Non-coincident",5.000825882,5.0578160289999996,5.1246213909999998,5.1837277410000002,5.236638546,5.2826690669999996,5.3136115070000001]
[null,null,null,null,"Coincident",3.8300876206040271,3.873735862248826,3.924901488892047,3.970170511404695,4.0106944216564244,4.0459487841981474,4.0696473210382029]
[null,null,"WEATHER CORRECTED MD 50% POE","MVA","Non-coincident",5.1806410036294084,5.2431244707164764,5.3164072346807769,5.3812774786624136,5.4393732267782786,5.4899332564403274,5.523930127865194]
[null,null,null,null,"Coincident",3.967806406980722,4.0156619331337113,4.0717885437548871,4.1214720808910101,4.1659670924988346,4.2046905650362429,4.2307284634666464]
[null,"Chinchilla","CONNECTION POINT RATING","MVA","Non-coincident",165.94,165.94,165.94,165.94,165.94,165.94,165.94]
[null,null,null,null,"Coincident",165.94,165.94,165.94,165.94,165.94,165.94,165.94]
[null,null,"WINTER/SUMMER PEAKING",null,"Non-coincident","Summer","Summer","Summer","Summer","Summer","Summer","Summer"]
[null,null,null,null,"Coincident","Summer","Summer","Summer","Summer","Summer","Summer","Summer"]
[null,null,"ADJUSTMENTS - EMBEDDED GENERATION","MW","Non-coincident",0,0,0,0,0,0,0]
[null,null,null,null,"Coincident",0,0,0,0,0,0,0]
[null,null,"WEATHER CORRECTED MD 10% POE","MW","Non-coincident",25.520475390000001,25.76877975,26.017290119999998,26.288322449999999,26.549831390000001,26.755992890000002,26.901927950000001]
[null,null,null,null,"Coincident",20.849714671074139,21.052574334872261,21.25560230469344,21.47703026247164,21.69067780232395,21.859107597830231,21.978333604203861]
[null,null,"WEATHER CORRECTED MD 10% POE","MVA","Non-coincident",26.020257420678551,26.28138298093598,26.542784483548061,26.827941817422222,27.103142524875949,27.320140157915471,27.473767950715391]
[null,null,null,null,"Coincident",21.25802652961659,21.471360855936599,21.68492062160567,21.917888423215281,22.142721861464491,22.320004559534659,22.445515373752499]
[null,null,"WEATHER CORRECTED MD 50% POE","MW","Non-coincident",22.017475130000001,22.229646679999998,22.469367980000001,22.704082490000001,22.937351230000001,23.116151810000002,23.276298520000001]
[null,null,null,null,"Coincident",17.98783397341608,18.161173858791141,18.357021335344712,18.548778365254051,18.739354230176492,18.885430704813139,19.01626734315882]
[null,null,"WEATHER CORRECTED MD 50% POE","MVA","Non-coincident",22.343886324229501,22.566094196619201,22.817237268561371,23.063216741864881,23.307758662817921,23.495251160539521,23.66321951408753]
[null,null,null,null,"Coincident",18.254505348503251,18.43604470724134,18.641223541553462,18.842183819720098,19.041969646554069,19.195147243002541,19.33237400667867]
[null,"Clare South","CONNECTION POINT RATING","MVA","Non-coincident",416.4,416.4,416.4,416.4,416.4,416.4,416.4]
[null,null,null,null,"Coincident",416.4,416.4,416.4,416.4,416.4,416.4,416.4]
[null,null,"WINTER/SUMMER PEAKING",null,"Non-coincident","Summer","Summer","Summer","Summer","Summer","Summer","Summer"]
[null,null,null,null,"Coincident","Summer","Summer","Summer","Summer","Summer","Summer","Summer"]
[null,null,"ADJUSTMENTS - EMBEDDED GENERATION","MW","Non-coincident",0,0,0,0,0,0,0]
[null,null,null,null,"Coincident",0,0,0,0,0,0,0]
[null,null,"WEATHER CORRECTED MD 10% POE","MW","Non-coincident",75.437904360000005,76.097122189999993,75.53766632,91.76205444,91.578773499999997,91.631835940000002,91.419097899999997]
[null,null,null,null,"Coincident",64.861135606637518,65.427927823742294,64.946910444510323,78.896558793225921,78.738974751035116,78.784597573483026,78.601686462971756]
[null,null,"WEATHER CORRECTED MD 10% POE","MVA","Non-coincident",78.486549450013499,79.195021061309987,78.593759762551642,96.049144752272682,95.851779617425095,95.908919039579715,95.679836837990507]
[null,null,null,null,"Coincident",67.482345517987113,68.091485891697175,67.574524412389877,82.582577757581731,82.412884194591413,82.462012386052947,82.265048646558839]
[null,null,"WEATHER CORRECTED MD 50% POE","MW","Non-coincident",63.466178890000002,64.13859558,63.192153930000003,78.656455989999998,78.101501459999994,77.496139529999994,76.6284256]
[null,null,null,null,"Coincident",54.567905489194906,55.146046020593097,54.332300189167682,67.628430317452484,67.151283168002593,66.630795986314055,65.884739857648043]
[null,null,"WEATHER CORRECTED MD 50% POE","MVA","Non-coincident",65.636577265494097,66.357348406890978,65.342885806156389,81.946287850712437,81.349623053555661,80.698819442572784,79.766077194663652]
[null,null,null,null,"Coincident",56.434003236045797,57.053718684666912,56.181488777535527,70.457011416715488,69.944001986662812,69.38444427329091,68.58247711976334]
[null,"Collinsville North","CONNECTION POINT RATING","MVA","Non-coincident",163.85,163.85,163.85,163.85,163.85,163.85,163.85]
[null,null,null,null,"Coincident",163.85,163.85,163.85,163.85,163.85,163.85,163.85]
[null,null,"WINTER/SUMMER PEAKING",null,"Non-coincident","Summer","Summer","Summer","Summer","Summer","Summer","Summer"]
[null,null,null,null,"Coincident","Summer","Summer","Summer","Summer","Summer","Summer","Summer"]
[null,null,"ADJUSTMENTS - EMBEDDED GENERATION","MW","Non-coincident",0,0,0,0,0,0,0]
[null,null,null,null,"Coincident",0,0,0,0,0,0,0]
[null,null,"WEATHER CORRECTED MD 10% POE","MW","Non-coincident",16.896133420000002,17.092266080000002,17.386081699999998,17.65653992,17.908470149999999,18.12586975,18.299228670000002]
[null,null,null,null,"Coincident",3.5905005054434969,3.632179533263578,3.6946166072315449,3.7520901339534571,3.8056263836779509,3.851824727066933,3.8886642378834351]
[null,null,"WEATHER CORRECTED MD 10% POE","MVA","Non-coincident",17.949538406350872,18.19564940505979,18.565419551829962,18.906885907284799,19.225850321868609,19.501753763217689,19.722183858070899]
[null,null,null,null,"Coincident",3.8143535635314749,3.8666532017560171,3.9452309370208578,4.0177939957619362,4.0855752959750387,4.1442059554870463,4.191048291973841]
[null,null,"WEATHER CORRECTED MD 50% POE","MW","Non-coincident",15.85456085,16.091331480000001,16.361026760000001,16.61117935,16.839668270000001,17.022632600000001,17.166398999999998]
[null,null,null,null,"Coincident",3.3691618863595409,3.4194766563460801,3.4767880550599122,3.529946548693125,3.5785014199382319,3.6173821213989288,3.647933095342752]
[null,null,"WEATHER CORRECTED MD 50% POE","MVA","Non-coincident",16.653383017825782,16.94630669548712,17.281242946111441,17.593062169210761,17.878796418068841,18.108204091804179,18.288826291760451]
[null,null,null,null,"Coincident",3.5389150083337588,3.601162540745789,3.672337924324049,3.738600840833683,3.7993205889230919,3.8480706992604281,3.8864536880849392]
[null,"Columboola (APLNG)","CONNECTION POINT RATING","MVA","Non-coincident"]
[null,null,null,null,"Coincident"]
[null,null,"WINTER/SUMMER PEAKING",null,"Non-coincident","Shoulder","Summer","Summer","Summer","Summer","Summer","Summer"]
[null,null,null,null,"Coincident","Shoulder","Summer","Summer","Summer","Summer","Summer","Summer"]
[null,null,"ADJUSTMENTS - EMBEDDED GENERATION","MW","Non-coincident",0,0,0,0,0,0,0]
[null,null,null,null,"Coincident",0,0,0,0,0,0,0]
[null,null,"WEATHER CORRECTED MD 10% POE","MW","Non-coincident"]
[null,null,null,null,"Coincident"]
[null,null,"WEATHER CORRECTED MD 10% POE","MVA","Non-coincident"]
[null,null,null,null,"Coincident"]
[null,null,"WEATHER CORRECTED MD 50% POE","MW","Non-coincident"]
[null,null,null,null,"Coincident"]
[null,null,"WEATHER CORRECTED MD 50% POE","MVA","Non-coincident"]
[null,null,null,null,"Coincident"]
[null,"Columboola (Ergon)","CONNECTION POINT RATING","MVA","Non-coincident",791.07,791.07,791.07,791.07,791.07,791.07,791.07]
[null,null,null,null,"Coincident",791.07,791.07,791.07,791.07,791.07,791.07,791.07]
[null,null,"WINTER/SUMMER PEAKING",null,"Non-coincident","Summer","Summer","Summer","Summer","Summer","Summer","Summer"]
[null,null,null,null,"Coincident","Summer","Summer","Summer","Summer","Summer","Summer","Summer"]
[null,null,"ADJUSTMENTS - EMBEDDED GENERATION","MW","Non-coincident",0,0,0,0,0,0,0]
[null,null,null,null,"Coincident",0,0,0,0,0,0,0]
[null,null,"WEATHER CORRECTED MD 10% POE","MW","Non-coincident",70.849273679999996,71.227432250000007,70.586471560000007,69.949935909999994,69.344161990000003,68.608779909999996,67.799301150000005]
[null,null,null,null,"Coincident",3.3759918015333579,3.3940111850173129,3.3634691918231612,3.3331380532784012,3.3042727215498129,3.2692315172562059,3.230659581153962]
[null,null,"WEATHER CORRECTED MD 10% POE","MVA","Non-coincident",71.246089342227791,71.608758597181122,70.994284518242395,70.385190709959687,69.80661283088692,69.105700552929918,68.336064802342548]
[null,null,null,null,"Coincident",3.3949002017584862,3.4121815141530298,3.3829016169148249,3.3538780913891482,3.3263086601890421,3.2929099535958808,3.256236550338631]
[null,null,"WEATHER CORRECTED MD 50% POE","MW","Non-coincident",61.439727779999998,61.795867919999999,61.092773440000002,60.359191889999998,59.654525759999999,58.958160399999997,58.128387449999998]
[null,null,null,null,"Coincident",2.9276237638025888,2.944593961666119,2.911091272409144,2.8761358639776922,2.8425582850678071,2.8093762406498208,2.769837279545059]
[null,null,"WEATHER CORRECTED MD 50% POE","MVA","Non-coincident",62.367090631758998,62.697347605425449,62.045855747423609,61.368325421626103,60.719696830832113,60.080891502591307,59.322636593262452]
[null,null,null,null,"Coincident",2.971812916661452,2.9875497729139662,2.9565059660103978,2.9242214173287331,2.8933140460739342,2.862874756595013,2.8267436542646118]
[null,"Columboola (QGC)","CONNECTION POINT RATING","MVA","Non-coincident"]
[null,null,null,null,"Coincident"]
[null,null,"WINTER/SUMMER PEAKING",null,"Non-coincident","Summer","Shoulder","Summer","Shoulder","Shoulder","Summer","Shoulder"]
[null,null,null,null,"Coincident","Summer","Shoulder","Summer","Shoulder","Shoulder","Summer","Shoulder"]
[null,null,"ADJUSTMENTS - EMBEDDED GENERATION","MW","Non-coincident",0,0,0,0,0,0,0]
[null,null,null,null,"Coincident",0,0,0,0,0,0,0]
[null,null,"WEATHER CORRECTED MD 10% POE","MW","Non-coincident"]
[null,null,null,null,"Coincident"]
[null,null,"WEATHER CORRECTED MD 10% POE","MVA","Non-coincident"]
[null,null,null,null,"Coincident"]
[null,null,"WEATHER CORRECTED MD 50% POE","MW","Non-coincident"]
[null,null,null,null,"Coincident"]
[null,null,"WEATHER CORRECTED MD 50% POE","MVA","Non-coincident"]
[null,null,null,null,"Coincident"]
[null,"Coppabella (Rail)","CONNECTION POINT RATING","MVA","Non-coincident",63.67,63.67,63.67,63.67,63.67,63.67,63.67]
[null,null,null,null,"Coincident",63.67,63.67,63.67,63.67,63.67,63.67,63.67]
[null,null,"WINTER/SUMMER PEAKING",null,"Non-coincident","Shoulder","Shoulder","Shoulder","Shoulder","Shoulder","Shoulder","Shoulder"]
[null,null,null,null,"Coincident","Shoulder","Shoulder","Shoulder","Shoulder","Shoulder","Shoulder","Shoulder"]
[null,null,"ADJUSTMENTS - EMBEDDED GENERATION","MW","Non-coincident",0,0,0,0,0,0,0]
[null,null,null,null,"Coincident",0,0,0,0,0,0,0]
[null,null,"WEATHER CORRECTED MD 10% POE","MW","Non-coincident"]
[null,null,null,null,"Coincident"]
[null,null,"WEATHER CORRECTED MD 10% POE","MVA","Non-coincident"]
[null,null,null,null,"Coincident"]
[null,null,"WEATHER CORRECTED MD 50% POE","MW","Non-coincident"]
[null,null,null,null,"Coincident"]
[null,null,"WEATHER CORRECTED MD 50% POE","MVA","Non-coincident"]
[null,null,null,null,"Coincident"]
[null,"Dan Gleeson","CONNECTION POINT RATING","MVA","Non-coincident",204.65,204.65,204.65,204.65,204.65,204.65,204.65]
[null,null,null,null,"Coincident",204.65,204.65,204.65,204.65,204.65,204.65,204.65]
[null,null,"WINTER/SUMMER PEAKING",null,"Non-coincident","Summer","Summer","Summer","Summer","Summer","Summer","Summer"]
[null,null,null,null,"Coincident","Summer","Summer","Summer","Summer","Summer","Summer","Summer"]
[null,null,"ADJUSTMENTS - EMBEDDED GENERATION","MW","Non-coincident",0,0,0,0,0,0,0]
[null,null,null,null,"Coincident",0,0,0,0,0,0,0]
[null,null,"WEATHER CORRECTED MD 10% POE","MW","Non-coincident",101.5122681,103.344696,105.3562775,107.42494960000001,109.3364182,111.06865689999999,112.94763949999999]
[null,null,null,null,"Coincident",82.513059352529041,84.002526930211218,85.637617415416813,87.319113326827946,88.872828212667386,90.280858171421187,91.808167192272137]
[null,null,"WEATHER CORRECTED MD 10% POE","MVA","Non-coincident",101.61343251111229,103.44595443637689,105.45765544569269,107.5264672138152,109.43807917022311,111.1704590579658,113.0496062888862]
[null,null,null,null,"Coincident",82.595289660399303,84.084833665417662,85.720021292372252,87.401630731382554,88.955462142800769,90.363606864359198,91.891049703527486]
[null,null,"WEATHER CORRECTED MD 50% POE","MW","Non-coincident",90.157775880000003,91.826278689999995,93.542770390000001,95.296035770000003,97.158874510000004,98.837318420000003,100.5717392]
[null,null,null,null,"Coincident",73.283693207899589,74.639916194226402,76.035146388282371,77.460267637845647,78.97445431099132,80.338757804134531,81.748561441084291]
[null,null,"WEATHER CORRECTED MD 50% POE","MVA","Non-coincident",90.258725786089201,91.927215403718179,93.6437109614523,95.396997588501293,97.259876968614833,98.938372602925284,100.6728611014983]
[null,null,null,null,"Coincident",73.365749157871704,74.721961420934107,76.117194750704101,77.542333270682548,79.056552977668986,80.420898514312739,81.830757195512192]
[null,"Duaringa (Rail)","CONNECTION POINT RATING","MVA","Non-coincident"]
[null,null,null,null,"Coincident"]
[null,null,"WINTER/SUMMER PEAKING",null,"Non-coincident","Shoulder","Shoulder","Shoulder","Shoulder","Shoulder","Shoulder","Shoulder"]
[null,null,null,null,"Coincident","Shoulder","Shoulder","Shoulder","Shoulder","Shoulder","Shoulder","Shoulder"]
[null,null,"ADJUSTMENTS - EMBEDDED GENERATION","MW","Non-coincident",0,0,0,0,0,0,0]
[null,null,null,null,"Coincident",0,0,0,0,0,0,0]
[null,null,"WEATHER CORRECTED MD 10% POE","MW","Non-coincident"]
[null,null,null,null,"Coincident"]
[null,null,"WEATHER CORRECTED MD 10% POE","MVA","Non-coincident"]
[null,null,null,null,"Coincident"]
[null,null,"WEATHER CORRECTED MD 50% POE","MW","Non-coincident"]
[null,null,null,null,"Coincident"]
[null,null,"WEATHER CORRECTED MD 50% POE","MVA","Non-coincident"]
[null,null,null,null,"Coincident"]
[null,"Dysart (66/22)","CONNECTION POINT RATING","MVA","Non-coincident",284,284,284,284,284,284,284]
[null,null,null,null,"Coincident",284,284,284,284,284,284,284]
[null,null,"WINTER/SUMMER PEAKING",null,"Non-coincident","Winter","Winter","Winter","Winter","Winter","Winter","Winter"]
[null,null,null,null,"Coincident","Winter","Winter","Winter","Winter","Winter","Winter","Winter"]
[null,null,"ADJUSTMENTS - EMBEDDED GENERATION","MW","Non-coincident",0,0,0,0,0,0,0]
[null,null,null,null,"Coincident",0,0,0,0,0,0,0]
[null,null,"WEATHER CORRECTED MD 10% POE","MW","Non-coincident",48.60720062,49.485824579999999,50.29943085,51.066898350000002,51.7646637,52.330455780000001,52.777305599999998]
[null,null,null,null,"Coincident",37.245100447037977,37.918343037188492,38.541766045795598,39.129835380436027,39.664495682155177,40.098031919234181,40.440429058307288]
[null,null,"WEATHER CORRECTED MD 10% POE","MVA","Non-coincident",49.263459660418917,50.134842988243449,50.941978531603112,51.70353905624674,52.396092330468058,52.957764801656118,53.401426468231612]
[null,null,null,null,"Coincident",37.747956681668008,38.415651162294907,39.03411599884911,39.617659133920753,40.148325700484648,40.578705301467629,40.918659528934612]
[null,null,"WEATHER CORRECTED MD 50% POE","MW","Non-coincident",46.877502440000001,47.544418329999999,48.359920500000001,49.122222899999997,49.840267179999998,50.448650360000002,50.905242919999999]
[null,null,null,null,"Coincident",35.919725160343297,36.430747169344883,37.055622904812147,37.639734499326323,38.189933461473849,38.656104982572828,39.005967462692141]
[null,null,"WEATHER CORRECTED MD 50% POE","MVA","Non-coincident",47.548838042926157,48.209806518991499,49.018266615661972,49.774205048252,50.486439558291607,51.090034885400257,51.543112365464623]
[null,null,null,null,"Coincident",36.434133759187183,36.940598582698321,37.560078353675387,38.139313580030048,38.685060825909453,39.14756367118283,39.49473273338026]
[null,"Eagle Downs","CONNECTION POINT RATING","MVA","Non-coincident"]
[null,null,null,null,"Coincident"]
[null,null,"WINTER/SUMMER PEAKING",null,"Non-coincident","Shoulder","Shoulder","Shoulder","Shoulder","Shoulder","Shoulder","Shoulder"]
[null,null,null,null,"Coincident","Shoulder","Shoulder","Shoulder","Shoulder","Shoulder","Shoulder","Shoulder"]
[null,null,"ADJUSTMENTS - EMBEDDED GENERATION","MW","Non-coincident",0,0,0,0,0,0,0]
[null,null,null,null,"Coincident",0,0,0,0,0,0,0]
[null,null,"WEATHER CORRECTED MD 10% POE","MW","Non-coincident"]
[null,null,null,null,"Coincident"]
[null,null,"WEATHER CORRECTED MD 10% POE","MVA","Non-coincident"]
[null,null,null,null,"Coincident"]
[null,null,"WEATHER CORRECTED MD 50% POE","MW","Non-coincident"]
[null,null,null,null,"Coincident"]
[null,null,"WEATHER CORRECTED MD 50% POE","MVA","Non-coincident"]
[null,null,null,null,"Coincident"]
[null,"Edmonton","CONNECTION POINT RATING","MVA","Non-coincident",140,140,140,140,140,140,140]
[null,null,null,null,"Coincident",140,140,140,140,140,140,140]
[null,null,"WINTER/SUMMER PEAKING",null,"Non-coincident","Summer","Summer","Summer","Summer","Summer","Summer","Summer"]
[null,null,null,null,"Coincident","Summer","Summer","Summer","Summer","Summer","Summer","Summer"]
[null,null,"ADJUSTMENTS - EMBEDDED GENERATION","MW","Non-coincident",0,0,0,0,0,0,0]
[null,null,null,null,"Coincident",0,0,0,0,0,0,0]
[null,null,"WEATHER CORRECTED MD 10% POE","MW","Non-coincident",55.975135799999997,57.010940550000001,58.221687320000001,59.617286679999999,60.983711239999998,62.311851500000003,63.64484787]
[null,null,null,null,"Coincident",47.890212053028151,48.77640747558636,49.812276683032202,51.006298784743123,52.175360029483599,53.311666673112398,54.452128021045681]
[null,null,"WEATHER CORRECTED MD 10% POE","MVA","Non-coincident",56.189263014489747,57.221155142578532,58.427503978069353,59.818254437896641,61.180145454559558,62.504068803799107,63.833009055724979]
[null,null,null,null,"Coincident",48.073411210326817,48.956259141354479,49.988365642140828,51.178239208003177,52.343421724292867,53.476120538344482,54.613111624849971]
[null,null,"WEATHER CORRECTED MD 50% POE","MW","Non-coincident",52.390537260000002,53.370635989999997,54.497772220000002,55.731140140000001,57.038391109999999,58.278831480000001,59.55136108]
[null,null,null,null,"Coincident",44.823364929709967,45.661900385529322,46.626235572856388,47.681458581858926,48.799893137936003,49.861167068037602,50.949895331341892]
[null,null,"WEATHER CORRECTED MD 50% POE","MVA","Non-coincident",52.619391560006648,53.595268361085587,54.717735832563918,55.946210039180237,57.248503925553081,58.48444508093695,59.752552796649432]
[null,null,null,null,"Coincident",45.019164025146303,45.854087358039777,46.814428131911093,47.865464264574321,48.979657727125193,50.037082299133083,51.122027365252087]
[null,"Egans Hill","CONNECTION POINT RATING","MVA","Non-coincident",90,90,90,90,90,90,90]
[null,null,null,null,"Coincident",90,90,90,90,90,90,90]
[null,null,"WINTER/SUMMER PEAKING",null,"Non-coincident","Summer","Summer","Summer","Summer","Summer","Summer","Summer"]
[null,null,null,null,"Coincident","Summer","Summer","Summer","Summer","Summer","Summer","Summer"]
[null,null,"ADJUSTMENTS - EMBEDDED GENERATION","MW","Non-coincident",0,0,0,0,0,0,0]
[null,null,null,null,"Coincident",0,0,0,0,0,0,0]
[null,null,"WEATHER CORRECTED MD 10% POE","MW","Non-coincident",68.309600829999994,69.116355900000002,69.859077450000001,70.584823610000001,71.32189941,72.011154169999998,72.722358700000001]
[null,null,null,null,"Coincident",64.870262838961096,65.636398386551363,66.341724454618515,67.030929831044759,67.730894408457999,68.385445699944512,69.0608416067099]
[null,null,"WEATHER CORRECTED MD 10% POE","MVA","Non-coincident",68.491440230561508,69.295408680524403,70.035622505962536,70.758970062942169,71.493660557244851,72.180729691322853,72.889723177272515]
[null,null,null,null,"Coincident",65.042946759897191,65.806435991712775,66.509380597299113,67.196308138596947,67.894007508694429,68.546483218911192,69.219779406062486]
[null,null,"WEATHER CORRECTED MD 50% POE","MW","Non-coincident",61.148242949999997,61.829090119999996,62.455303190000002,63.071475980000002,63.699905399999999,64.378639219999997,65.007125849999994]
[null,null,null,null,"Coincident",58.069474043318749,58.716041060757178,59.310724764812043,59.895873709555417,60.492662172023373,61.137222245074703,61.734065037061377]
[null,null,"WEATHER CORRECTED MD 50% POE","MVA","Non-coincident",61.358087458427057,62.035989767281983,62.659551545076297,63.27316750940637,63.899040697377352,64.575070384470877,65.201103997239798]
[null,null,null,null,"Coincident",58.26875303560643,58.912523463485201,59.504689365940337,60.0874102192994,60.681771154134573,61.323763245375687,61.918276527738612]
[null,"El Arish","CONNECTION POINT RATING","MVA","Non-coincident",178.7,178.7,178.7,178.7,178.7,178.7,178.7]
[null,null,null,null,"Coincident",178.7,178.7,178.7,178.7,178.7,178.7,178.7]
[null,null,"WINTER/SUMMER PEAKING",null,"Non-coincident","Summer","Summer","Summer","Summer","Summer","Summer","Summer"]
[null,null,null,null,"Coincident","Summer","Summer","Summer","Summer","Summer","Summer","Summer"]
[null,null,"ADJUSTMENTS - EMBEDDED GENERATION","MW","Non-coincident",0,0,0,0,0,0,0]
[null,null,null,null,"Coincident",0,0,0,0,0,0,0]
[null,null,"WEATHER CORRECTED MD 10% POE","MW","Non-coincident",7.536428452,7.6373019219999998,7.7452292439999999,7.8380455969999998,7.9276704789999997,7.9876880650000004,8.0310583110000007]
[null,null,null,null,"Coincident",6.3195519722714346,6.4041378129449686,6.4946385487976492,6.5724682224150683,6.6476217388871026,6.6979485291423231,6.7343159577449869]
[null,null,"WEATHER CORRECTED MD 10% POE","MVA","Non-coincident",7.5594655236954296,7.6610474934094261,7.7697365021997538,7.8632107995547296,7.9534734432893428,8.0139194222643813,8.0575998674221836]
[null,null,null,null,"Coincident",6.3388693416056556,6.4240492834231802,6.5151887195950797,6.5935701019658719,6.6692584033766193,6.7199444157338659,6.7565719568967406]
[null,null,"WEATHER CORRECTED MD 50% POE","MW","Non-coincident",7.0231924059999997,7.1130685810000003,7.2053604130000002,7.2900772089999997,7.3729848860000002,7.4352822300000003,7.4904594419999997]
[null,null,null,null,"Coincident",5.8891860652111268,5.9645502994235189,6.0419401443155456,6.1129780634912052,6.1824989747608869,6.2347374197550796,6.281005391532414]
[null,null,"WEATHER CORRECTED MD 50% POE","MVA","Non-coincident",7.0426809700113546,7.1331712532922156,7.2260970697763254,7.3113987146363746,7.3948813408080234,7.4576123347871084,7.5131747770678601]
[null,null,null,null,"Coincident",5.9055278899785346,5.9814070749029549,6.0593285373804822,6.1308568722471488,6.2008598979818954,6.2534619732550798,6.3000529737450206]
[null,"Garbutt","CONNECTION POINT RATING","MVA","Non-coincident",182.9,182.9,182.9,182.9,182.9,182.9,182.9]
[null,null,null,null,"Coincident",182.9,182.9,182.9,182.9,182.9,182.9,182.9]
[null,null,"WINTER/SUMMER PEAKING",null,"Non-coincident","Summer","Summer","Summer","Summer","Summer","Summer","Summer"]
[null,null,null,null,"Coincident","Summer","Summer","Summer","Summer","Summer","Summer","Summer"]
[null,null,"ADJUSTMENTS - EMBEDDED GENERATION","MW","Non-coincident",0,0,0,0,0,0,0]
[null,null,null,null,"Coincident",0,0,0,0,0,0,0]
[null,null,"WEATHER CORRECTED MD 10% POE","MW","Non-coincident",85.883377080000002,88.217704769999997,90.658096310000005,93.163375849999994,95.610427860000001,97.996276859999995,100.5011063]
[null,null,null,null,"Coincident",72.646126056667185,74.620662566419767,76.684915248022222,78.804054707343866,80.873941277128964,82.892058089707533,85.010816823183873]
[null,null,"WEATHER CORRECTED MD 10% POE","MVA","Non-coincident",86.170418714939345,88.503677316118896,90.943087800440651,93.44749409454451,95.893814076011097,98.279055774895767,100.783352552922]
[null,null,null,null,"Coincident",72.888925810289948,74.862558010456013,76.925980847018678,79.044381654303038,81.11364902350563,83.131252138615864,85.249560309594415]
[null,null,"WEATHER CORRECTED MD 50% POE","MW","Non-coincident",77.287406919999995,79.728836060000006,80.492530819999999,82.335556030000006,84.441619869999997,86.682365419999996,88.995712280000006]
[null,null,null,null,"Coincident",65.37505739292537,67.440187748682689,68.08617382526765,69.645132570061293,71.426587659577763,73.321965894816302,75.278755361162183]
[null,null,"WEATHER CORRECTED MD 50% POE","MVA","Non-coincident",77.570970225948159,80.019392360174081,80.78259087425397,82.624491746681315,84.729390283479987,86.969026090290029,89.281357400314221]
[null,null,null,null,"Coincident",65.614914934272008,67.685960450300414,68.331526767615387,69.889534469590131,71.670003864713394,73.56444340207571,75.520373845708832]
[null,"Gin Gin","CONNECTION POINT RATING","MVA","Non-coincident",548.72,548.72,548.72,548.72,548.72,548.72,548.72]
[null,null,null,null,"Coincident",548.72,548.72,548.72,548.72,548.72,548.72,548.72]
[null,null,"WINTER/SUMMER PEAKING",null,"Non-coincident","Summer","Summer","Summer","Summer","Summer","Summer","Summer"]
[null,null,null,null,"Coincident","Summer","Summer","Summer","Summer","Summer","Summer","Summer"]
[null,null,"ADJUSTMENTS - EMBEDDED GENERATION","MW","Non-coincident",0,0,0,0,0,0,0]
[null,null,null,null,"Coincident",0,0,0,0,0,0,0]
[null,null,"WEATHER CORRECTED MD 10% POE","MW","Non-coincident",206.75382999999999,209.4056396,212.16342159999999,218.62689209999999,221.0959167,223.41424559999999,225.61857599999999]
[null,null,null,null,"Coincident",191.7458503521992,194.20516869577779,196.76276704680231,202.7570630037325,205.0468644621505,207.19690901671359,209.2412300675266]
[null,null,"WEATHER CORRECTED MD 10% POE","MVA","Non-coincident",207.1727582659658,209.86843118688461,212.6735503723373,219.2544635798935,221.77062628035719,224.13430258634071,226.38269595425439]
[null,null,null,null,"Coincident",192.1343691844462,194.63436687006569,197.23586626455759,203.33907992244681,205.67259779065219,207.86469804460219,209.94988359234691]
[null,null,"WEATHER CORRECTED MD 50% POE","MW","Non-coincident",183.57792660000001,185.94515989999999,188.37229919999999,194.57017519999999,196.8665771,198.79731749999999,200.60415649999999]
[null,null,null,null,"Coincident",170.25225429589679,172.44765334649981,174.69860990194431,180.44659050282351,182.57629970852921,184.3668902857743,186.04257329732729]
[null,null,"WEATHER CORRECTED MD 50% POE","MVA","Non-coincident",183.69347713628821,186.08427615257719,188.5375037130824,194.8103423005868,197.1373930365292,199.09504064335161,200.92797370587479]
[null,null,null,null,"Coincident",170.3594171757295,172.5766713392897,174.85182244384981,180.66932419984201,182.82745748412501,184.6430021106024,186.34288505212831]
[null,"Gladstone South (Ergon 66/11)","CONNECTION POINT RATING","MVA","Non-coincident",236,236,236,236,236,236,236]
[null,null,null,null,"Coincident",236,236,236,236,236,236,236]
[null,null,"WINTER/SUMMER PEAKING",null,"Non-coincident","Summer","Summer","Summer","Summer","Summer","Summer","Summer"]
[null,null,null,null,"Coincident","Summer","Summer","Summer","Summer","Summer","Summer","Summer"]
[null,null,"ADJUSTMENTS - EMBEDDED GENERATION","MW","Non-coincident",0,0,0,0,0,0,0]
[null,null,null,null,"Coincident",0,0,0,0,0,0,0]
[null,null,"WEATHER CORRECTED MD 10% POE","MW","Non-coincident",54.027973179999996,54.74262238,55.533744810000002,56.302246089999997,57.09254456,57.778804780000002,58.4799881]
[null,null,null,null,"Coincident",52.59714297321743,53.29286602066297,54.063037047094006,54.811186002535919,55.580554890012387,56.248640786699951,56.931254572888157]
[null,null,"WEATHER CORRECTED MD 10% POE","MVA","Non-coincident",56.162524499214577,56.89316480189536,57.702026285703518,58.48779561275888,59.295887351729426,59.997626393570989,60.714651381733823]
[null,null,null,null,"Coincident",54.675164677758438,55.386455333324278,56.173895627774108,56.938855318218287,57.725546253088368,58.408701043860567,59.106736961145927]
[null,null,"WEATHER CORRECTED MD 50% POE","MW","Non-coincident",48.242637629999997,48.883636469999999,49.55895615,50.20346069,50.886375430000001,51.509429930000003,52.14595413]
[null,null,null,null,"Coincident",46.965021256239353,47.589044436246901,48.24647953275236,48.873915570827101,49.538744586319289,50.145298648738517,50.7649656912495]
[null,null,"WEATHER CORRECTED MD 50% POE","MVA","Non-coincident",50.249086001115877,50.904146078302247,51.594318478183787,52.253034018694827,52.95104310720351,53.587900524580988,54.238556067716161]
[null,null,null,null,"Coincident",48.918332580585442,49.556044612110853,50.227939081884827,50.869209768599468,51.548733386903308,52.168724822150359,52.802148965502553]
[null,"Gladstone South (QAL)","CONNECTION POINT RATING","MVA","Non-coincident",379.12,379.12,379.12,379.12,379.12,379.12,379.12]
[null,null,null,null,"Coincident",379.12,379.12,379.12,379.12,379.12,379.12,379.12]
[null,null,"WINTER/SUMMER PEAKING",null,"Non-coincident","Shoulder","Shoulder","Shoulder","Shoulder","Shoulder","Shoulder","Shoulder"]
[null,null,null,null,"Coincident","Shoulder","Shoulder","Shoulder","Shoulder","Shoulder","Shoulder","Shoulder"]
[null,null,"ADJUSTMENTS - EMBEDDED GENERATION","MW","Non-coincident",0,0,0,0,0,0,0]
[null,null,null,null,"Coincident",0,0,0,0,0,0,0]
[null,null,"WEATHER CORRECTED MD 10% POE","MW","Non-coincident"]
[null,null,null,null,"Coincident"]
[null,null,"WEATHER CORRECTED MD 10% POE","MVA","Non-coincident"]
[null,null,null,null,"Coincident"]
[null,null,"WEATHER CORRECTED MD 50% POE","MW","Non-coincident"]
[null,null,null,null,"Coincident"]
[null,null,"WEATHER CORRECTED MD 50% POE","MVA","Non-coincident"]
[null,null,null,null,"Coincident"]
[null,"Goodna","CONNECTION POINT RATING","MVA","Non-coincident",220.5,220.5,220.5,220.5,220.5,220.5,220.5]
[null,null,null,null,"Coincident",220.5,220.5,220.5,220.5,220.5,220.5,220.5]
[null,null,"WINTER/SUMMER PEAKING",null,"Non-coincident","Summer","Summer","Summer","Summer","Summer","Summer","Summer"]
[null,null,null,null,"Coincident","Summer","Summer","Summer","Summer","Summer","Summer","Summer"]
[null,null,"ADJUSTMENTS - EMBEDDED GENERATION","MW","Non-coincident",0,0,0,0,0,0,0]
[null,null,null,null,"Coincident",0,0,0,0,0,0,0]
[null,null,"WEATHER CORRECTED MD 10% POE","MW","Non-coincident",154.33494569999999,166.31811519999999,178.25210569999999,182.5996246,188.197113,192.7278748,197.1009827]
[null,null,null,null,"Coincident",154.33494569999999,166.31811519999999,178.25210569999999,182.5996246,188.197113,192.7278748,197.1009827]
[null,null,"WEATHER CORRECTED MD 10% POE","MVA","Non-coincident",154.4521723611708,166.4421166455142,178.39013379387629,182.75171978363559,188.3678634159522,192.91413972324369,197.3025478875069]
[null,null,null,null,"Coincident",154.4521723611708,166.4421166455142,178.39013379387629,182.75171978363559,188.3678634159522,192.91413972324369,197.3025478875069]
[null,null,"WEATHER CORRECTED MD 50% POE","MW","Non-coincident",143.77925110000001,155.9133301,167.37364199999999,171.52095030000001,176.69354250000001,181.0705719,185.31233219999999]
[null,null,null,null,"Coincident",143.77925110000001,155.9133301,167.37364199999999,171.52095030000001,176.69354250000001,181.0705719,185.31233219999999]
[null,null,"WEATHER CORRECTED MD 50% POE","MVA","Non-coincident",143.89052923259709,156.03144788983701,167.49824114412871,171.647899256274,176.8266233392321,181.21767583487249,185.47339474948129]
[null,null,null,null,"Coincident",143.89052923259709,156.03144788983701,167.49824114412871,171.647899256274,176.8266233392321,181.21767583487249,185.47339474948129]
[null,"Goonyella Riverside","CONNECTION POINT RATING","MVA","Non-coincident"]
[null,null,null,null,"Coincident"]
[null,null,"WINTER/SUMMER PEAKING",null,"Non-coincident","Shoulder","Shoulder","Shoulder","Shoulder","Shoulder","Shoulder","Shoulder"]
[null,null,null,null,"Coincident","Shoulder","Shoulder","Shoulder","Shoulder","Shoulder","Shoulder","Shoulder"]
[null,null,"ADJUSTMENTS - EMBEDDED GENERATION","MW","Non-coincident",0,0,0,0,0,0,0]
[null,null,null,null,"Coincident",0,0,0,0,0,0,0]
[null,null,"WEATHER CORRECTED MD 10% POE","MW","Non-coincident"]
[null,null,null,null,"Coincident"]
[null,null,"WEATHER CORRECTED MD 10% POE","MVA","Non-coincident"]
[null,null,null,null,"Coincident"]
[null,null,"WEATHER CORRECTED MD 50% POE","MW","Non-coincident"]
[null,null,null,null,"Coincident"]
[null,null,"WEATHER CORRECTED MD 50% POE","MVA","Non-coincident"]
[null,null,null,null,"Coincident"]
[null,"Grantleigh (Rail)","CONNECTION POINT RATING","MVA","Non-coincident",63.67,63.67,63.67,63.67,63.67,63.67,63.67]
[null,null,null,null,"Coincident",63.67,63.67,63.67,63.67,63.67,63.67,63.67]
[null,null,"WINTER/SUMMER PEAKING",null,"Non-coincident","Shoulder","Shoulder","Shoulder","Shoulder","Shoulder","Shoulder","Shoulder"]
[null,null,null,null,"Coincident","Shoulder","Shoulder","Shoulder","Shoulder","Shoulder","Shoulder","Shoulder"]
[null,null,"ADJUSTMENTS - EMBEDDED GENERATION","MW","Non-coincident",0,0,0,0,0,0,0]
[null,null,null,null,"Coincident",0,0,0,0,0,0,0]
[null,null,"WEATHER CORRECTED MD 10% POE","MW","Non-coincident"]
[null,null,null,null,"Coincident"]
[null,null,"WEATHER CORRECTED MD 10% POE","MVA","Non-coincident"]
[null,null,null,null,"Coincident"]
[null,null,"WEATHER CORRECTED MD 50% POE","MW","Non-coincident"]
[null,null,null,null,"Coincident"]
[null,null,"WEATHER CORRECTED MD 50% POE","MVA","Non-coincident"]
[null,null,null,null,"Coincident"]
[null,"Greenland (Ironbark Mine)","CONNECTION POINT RATING","MVA","Non-coincident",0,0,0,0,0,0,0]
[null,null,null,null,"Coincident",0,0,0,0,0,0,0]
[null,null,"WINTER/SUMMER PEAKING",null,"Non-coincident","Summer","Summer","Summer","Shoulder","Shoulder","Shoulder","Shoulder"]
[null,null,null,null,"Coincident","Summer","Summer","Summer","Shoulder","Shoulder","Shoulder","Shoulder"]
[null,null,"ADJUSTMENTS - EMBEDDED GENERATION","MW","Non-coincident",0,0,0,0,0,0,0]
[null,null,null,null,"Coincident",0,0,0,0,0,0,0]
[null,null,"WEATHER CORRECTED MD 10% POE","MW","Non-coincident"]
[null,null,null,null,"Coincident"]
[null,null,"WEATHER CORRECTED MD 10% POE","MVA","Non-coincident"]
[null,null,null,null,"Coincident"]
[null,null,"WEATHER CORRECTED MD 50% POE","MW","Non-coincident"]
[null,null,null,null,"Coincident"]
[null,null,"WEATHER CORRECTED MD 50% POE","MVA","Non-coincident"]
[null,null,null,null,"Coincident"]
[null,"Gregory (Rail)","CONNECTION POINT RATING","MVA","Non-coincident",56.97,56.97,56.97,56.97,56.97,56.97,56.97]
[null,null,null,null,"Coincident",56.97,56.97,56.97,56.97,56.97,56.97,56.97]
[null,null,"WINTER/SUMMER PEAKING",null,"Non-coincident","Shoulder","Shoulder","Shoulder","Shoulder","Shoulder","Shoulder","Shoulder"]
[null,null,null,null,"Coincident","Shoulder","Shoulder","Shoulder","Shoulder","Shoulder","Shoulder","Shoulder"]
[null,null,"ADJUSTMENTS - EMBEDDED GENERATION","MW","Non-coincident",0,0,0,0,0,0,0]
[null,null,null,null,"Coincident",0,0,0,0,0,0,0]
[null,null,"WEATHER CORRECTED MD 10% POE","MW","Non-coincident"]
[null,null,null,null,"Coincident"]
[null,null,"WEATHER CORRECTED MD 10% POE","MVA","Non-coincident"]
[null,null,null,null,"Coincident"]
[null,null,"WEATHER CORRECTED MD 50% POE","MW","Non-coincident"]
[null,null,null,null,"Coincident"]
[null,null,"WEATHER CORRECTED MD 50% POE","MVA","Non-coincident"]
[null,null,null,null,"Coincident"]
[null,"Ingham","CONNECTION POINT RATING","MVA","Non-coincident",120,120,120,120,120,120,120]
[null,null,null,null,"Coincident",120,120,120,120,120,120,120]
[null,null,"WINTER/SUMMER PEAKING",null,"Non-coincident","Summer","Summer","Summer","Summer","Summer","Summer","Summer"]
[null,null,null,null,"Coincident","Summer","Summer","Summer","Summer","Summer","Summer","Summer"]
[null,null,"ADJUSTMENTS - EMBEDDED GENERATION","MW","Non-coincident",0,0,0,0,0,0,0]
[null,null,null,null,"Coincident",0,0,0,0,0,0,0]
[null,null,"WEATHER CORRECTED MD 10% POE","MW","Non-coincident",23.379432680000001,23.445423130000002,23.538085939999998,23.57638931,23.601894380000001,23.58441925,23.528751369999998]
[null,null,null,null,"Coincident",21.878068095386428,21.939820815330751,22.026533067712482,22.062376697821591,22.0862439004982,22.069890976569351,22.017797938811089]
[null,null,"WEATHER CORRECTED MD 10% POE","MVA","Non-coincident",23.38608578378096,23.451790255797139,23.54406342221516,23.582209769883811,23.607611592427538,23.590207089757989,23.53476747881005]
[null,null,null,null,"Coincident",21.884293954651611,21.94577906135272,22.03212669202032,22.067823383351879,22.09159396884748,22.075307136750979,22.023427709217291]
[null,null,"WEATHER CORRECTED MD 50% POE","MW","Non-coincident",21.581024169999999,21.66493607,21.721046449999999,21.75151443,21.773841860000001,21.764654159999999,21.73048782]
[null,null,null,null,"Coincident",20.195148565916369,20.273671868313851,20.326178989906591,20.354690397787721,20.37558401999922,20.366986329499571,20.335014060397871]
[null,null,"WEATHER CORRECTED MD 50% POE","MVA","Non-coincident",21.598439829937629,21.681711791306039,21.737402340932501,21.767645053608739,21.78980859603076,21.780688216168599,21.746773697280151]
[null,null,null,null,"Coincident",20.211445838791072,20.289370297702892,20.34148454930488,20.369785155926781,20.390525414981859,20.381990721501008,20.350254102233141]
[null,"Innisfail","CONNECTION POINT RATING","MVA","Non-coincident",100,100,100,100,100,100,100]
[null,null,null,null,"Coincident",100,100,100,100,100,100,100]
[null,null,"WINTER/SUMMER PEAKING",null,"Non-coincident","Summer","Summer","Summer","Summer","Summer","Summer","Summer"]
[null,null,null,null,"Coincident","Summer","Summer","Summer","Summer","Summer","Summer","Summer"]
[null,null,"ADJUSTMENTS - EMBEDDED GENERATION","MW","Non-coincident",0,0,0,0,0,0,0]
[null,null,null,null,"Coincident",0,0,0,0,0,0,0]
[null,null,"WEATHER CORRECTED MD 10% POE","MW","Non-coincident",33.201419829999999,33.594486240000002,34.019088750000002,34.400680540000003,34.757579800000002,35.061733250000003,35.32228851]
[null,null,null,null,"Coincident",30.82127805011876,31.186166334318749,31.580329960106319,31.934566216310209,32.265880099411127,32.548229411589723,32.79010599870557]
[null,null,"WEATHER CORRECTED MD 10% POE","MVA","Non-coincident",33.241729496666807,33.633819154078452,34.05739542548897,34.438089648849193,34.794169873149649,35.097640482705472,35.357621574669608]
[null,null,null,null,"Coincident",30.85869799935006,31.22267955235402,31.615890508494509,31.96929354277249,32.299847105165533,32.581562528332682,32.822906108343084]
[null,null,"WEATHER CORRECTED MD 50% POE","MW","Non-coincident",29.953245160000002,30.320621490000001,30.693920139999999,31.04385757,31.37807274,31.651136399999999,31.894701000000001]
[null,null,null,null,"Coincident",27.8059583688513,28.14699824226452,28.49353587668784,28.818387009121299,29.128642978169641,29.382131263710921,29.60823521643956]
[null,null,"WEATHER CORRECTED MD 50% POE","MVA","Non-coincident",30.002743501221399,30.36896986982455,30.741131292130959,31.090030288318001,31.423277799369771,31.695567817087291,31.938454885802891]
[null,null,null,null,"Coincident",27.85190827537987,28.191880625773269,28.537362558026931,28.86124969984041,29.170607379428439,29.4233774835178,29.64885247579199]
[null,"Invicta Mill","CONNECTION POINT RATING","MVA","Non-coincident"]
[null,null,null,null,"Coincident"]
[null,null,"WINTER/SUMMER PEAKING",null,"Non-coincident","Shoulder","Shoulder","Shoulder","Shoulder","Shoulder","Shoulder","Shoulder"]
[null,null,null,null,"Coincident","Shoulder","Shoulder","Shoulder","Shoulder","Shoulder","Shoulder","Shoulder"]
[null,null,"ADJUSTMENTS - EMBEDDED GENERATION","MW","Non-coincident",0,0,0,0,0,0,0]
[null,null,null,null,"Coincident",0,0,0,0,0,0,0]
[null,null,"WEATHER CORRECTED MD 10% POE","MW","Non-coincident"]
[null,null,null,null,"Coincident"]
[null,null,"WEATHER CORRECTED MD 10% POE","MVA","Non-coincident"]
[null,null,null,null,"Coincident"]
[null,null,"WEATHER CORRECTED MD 50% POE","MW","Non-coincident"]
[null,null,null,null,"Coincident"]
[null,null,"WEATHER CORRECTED MD 50% POE","MVA","Non-coincident"]
[null,null,null,null,"Coincident"]
[null,"Kamerunga","CONNECTION POINT RATING","MVA","Non-coincident",123.2,123.2,123.2,123.2,123.2,123.2,123.2]
[null,null,null,null,"Coincident",123.2,123.2,123.2,123.2,123.2,123.2,123.2]
[null,null,"WINTER/SUMMER PEAKING",null,"Non-coincident","Summer","Summer","Summer","Summer","Summer","Summer","Summer"]
[null,null,null,null,"Coincident","Summer","Summer","Summer","Summer","Summer","Summer","Summer"]
[null,null,"ADJUSTMENTS - EMBEDDED GENERATION","MW","Non-coincident",0,0,0,0,0,0,0]
[null,null,null,null,"Coincident",0,0,0,0,0,0,0]
[null,null,"WEATHER CORRECTED MD 10% POE","MW","Non-coincident",71.999351500000003,73.352104190000006,74.71855927,76.143074040000002,77.643981929999995,79.126640320000007,80.680503849999994]
[null,null,null,null,"Coincident",62.650623337268392,63.827728373411212,65.016756617983333,66.256305814390274,67.56232889544988,68.852472075832992,70.204574792140761]
[null,null,"WEATHER CORRECTED MD 10% POE","MVA","Non-coincident",72.005427835471423,73.361794025197312,74.732662769033155,76.1625511722048,77.66992660419848,79.159740262649279,80.721873943976959]
[null,null,null,null,"Coincident",62.655910693292583,63.836160035676208,65.029028853597339,66.273253945839116,67.584904793384425,68.881274169132467,70.240573202142798]
[null,null,"WEATHER CORRECTED MD 50% POE","MW","Non-coincident",65.296325679999995,66.540969849999996,67.816497799999993,69.151847840000002,70.466590879999998,71.882194519999999,73.349121089999997]
[null,null,null,null,"Coincident",56.817949332297601,57.900983157728611,59.010890670598471,60.172852697151541,61.316883431710799,62.548678560372572,63.82513261288581]
[null,null,"WEATHER CORRECTED MD 50% POE","MVA","Non-coincident",65.297198016081495,66.54104673930587,67.816644535474012,69.152974060907169,70.469536759470131,71.887994701058119,73.358802114198468]
[null,null,null,null,"Coincident",56.818708400235387,57.901050063372082,59.011018353261193,60.173832684337263,61.319446804591728,62.553725619147251,63.833556608212731]
[null,"Kemmis","CONNECTION POINT RATING","MVA","Non-coincident",93.8,93.8,93.8,93.8,93.8,93.8,93.8]
[null,null,null,null,"Coincident",93.8,93.8,93.8,93.8,93.8,93.8,93.8]
[null,null,"WINTER/SUMMER PEAKING",null,"Non-coincident","Shoulder","Shoulder","Shoulder","Shoulder","Shoulder","Shoulder","Shoulder"]
[null,null,null,null,"Coincident","Shoulder","Shoulder","Shoulder","Shoulder","Shoulder","Shoulder","Shoulder"]
[null,null,"ADJUSTMENTS - EMBEDDED GENERATION","MW","Non-coincident",0,0,0,0,0,0,0]
[null,null,null,null,"Coincident",0,0,0,0,0,0,0]
[null,null,"WEATHER CORRECTED MD 10% POE","MW","Non-coincident"]
[null,null,null,null,"Coincident"]
[null,null,"WEATHER CORRECTED MD 10% POE","MVA","Non-coincident"]
[null,null,null,null,"Coincident"]
[null,null,"WEATHER CORRECTED MD 50% POE","MW","Non-coincident"]
[null,null,null,null,"Coincident"]
[null,null,"WEATHER CORRECTED MD 50% POE","MVA","Non-coincident"]
[null,null,null,null,"Coincident"]
[null,"King Creek","CONNECTION POINT RATING","MVA","Non-coincident",114.32,114.32,114.32,114.32,114.32,114.32,114.32]
[null,null,null,null,"Coincident",114.32,114.32,114.32,114.32,114.32,114.32,114.32]
[null,null,"WINTER/SUMMER PEAKING",null,"Non-coincident","Winter","Winter","Winter","Winter","Winter","Summer","Summer"]
[null,null,null,null,"Coincident","Winter","Winter","Winter","Winter","Winter","Summer","Summer"]
[null,null,"ADJUSTMENTS - EMBEDDED GENERATION","MW","Non-coincident",0,0,0,0,0,0,0]
[null,null,null,null,"Coincident",0,0,0,0,0,0,0]
[null,null,"WEATHER CORRECTED MD 10% POE","MW","Non-coincident"]
[null,null,null,null,"Coincident"]
[null,null,"WEATHER CORRECTED MD 10% POE","MVA","Non-coincident"]
[null,null,null,null,"Coincident"]
[null,null,"WEATHER CORRECTED MD 50% POE","MW","Non-coincident"]
[null,null,null,null,"Coincident"]
[null,null,"WEATHER CORRECTED MD 50% POE","MVA","Non-coincident"]
[null,null,null,null,"Coincident"]
[null,"Larcom Creek (Aldoga GEM)","CONNECTION POINT RATING","MVA","Non-coincident",0,0,0,0,0,0,0]
[null,null,null,null,"Coincident",0,0,0,0,0,0,0]
[null,null,"WINTER/SUMMER PEAKING",null,"Non-coincident","Shoulder","Shoulder","Shoulder","Shoulder","Shoulder","Shoulder","Shoulder"]
[null,null,null,null,"Coincident","Shoulder","Shoulder","Shoulder","Shoulder","Shoulder","Shoulder","Shoulder"]
[null,null,"ADJUSTMENTS - EMBEDDED GENERATION","MW","Non-coincident",0,0,0,0,0,0,0]
[null,null,null,null,"Coincident",0,0,0,0,0,0,0]
[null,null,"WEATHER CORRECTED MD 10% POE","MW","Non-coincident"]
[null,null,null,null,"Coincident"]
[null,null,"WEATHER CORRECTED MD 10% POE","MVA","Non-coincident"]
[null,null,null,null,"Coincident"]
[null,null,"WEATHER CORRECTED MD 50% POE","MW","Non-coincident"]
[null,null,null,null,"Coincident"]
[null,null,"WEATHER CORRECTED MD 50% POE","MVA","Non-coincident"]
[null,null,null,null,"Coincident"]
[null,"Lilyvale (132)","CONNECTION POINT RATING","MVA","Non-coincident",182.9,182.9,182.9,182.9,182.9,182.9,182.9]
[null,null,null,null,"Coincident",182.9,182.9,182.9,182.9,182.9,182.9,182.9]
[null,null,"WINTER/SUMMER PEAKING",null,"Non-coincident","Summer","Summer","Summer","Summer","Summer","Summer","Summer"]
[null,null,null,null,"Coincident","Summer","Summer","Summer","Summer","Summer","Summer","Summer"]
[null,null,"ADJUSTMENTS - EMBEDDED GENERATION","MW","Non-coincident",0,0,0,0,0,0,0]
[null,null,null,null,"Coincident",0,0,0,0,0,0,0]
[null,null,"WEATHER CORRECTED MD 10% POE","MW","Non-coincident",38.033813479999999,38.410949709999997,38.80155182,39.132179260000001,39.43161774,39.654083249999999,39.797180179999998]
[null,null,null,null,"Coincident",-5.8748699585694251,-5.9331240778698788,-5.9934581961669968,-6.044528363394801,-6.0907809468102592,-6.1251439470443563,-6.1472473276496844]
[null,null,"WEATHER CORRECTED MD 10% POE","MVA","Non-coincident",39.300601881267312,39.646738476393793,40.005978262797193,40.310635662351629,40.58699975928733,40.792591265242521,40.924953797700432]
[null,null,null,null,"Coincident",-6.0705436615596078,-6.1240094410386847,-6.1794991970205313,-6.2265579176833814,-6.2692463304971131,-6.3010028979185817,-6.3214481963103939]
[null,null,"WEATHER CORRECTED MD 50% POE","MW","Non-coincident",35.230575559999998,35.603141780000001,35.965545650000003,36.270080569999998,36.545928959999998,36.756492610000002,36.89105988]
[null,null,null,null,"Coincident",-5.4418695114385933,-5.4994177269128777,-5.5553962211506933,-5.6024360230833627,-5.6450447775376844,-5.6775693641769447,-5.698355216017581]
[null,null,"WEATHER CORRECTED MD 50% POE","MVA","Non-coincident",36.7518671956798,37.087993542166039,37.415759125206563,37.691787217251047,37.942276964030647,38.133773843572371,38.256285742336829]
[null,null,null,null,"Coincident",-5.676854902356018,-5.7287744548430197,-5.7794025670692717,-5.8220390790910326,-5.8607308260824027,-5.8903102755733414,-5.9092340017991392]
[null,"Lilyvale (66)","CONNECTION POINT RATING","MVA","Non-coincident",488.1,488.1,488.1,488.1,488.1,488.1,488.1]
[null,null,null,null,"Coincident",488.1,488.1,488.1,488.1,488.1,488.1,488.1]
[null,null,"WINTER/SUMMER PEAKING",null,"Non-coincident","Winter","Winter","Winter","Winter","Winter","Winter","Winter"]
[null,null,null,null,"Coincident","Winter","Winter","Winter","Winter","Winter","Winter","Winter"]
[null,null,"ADJUSTMENTS - EMBEDDED GENERATION","MW","Non-coincident",0,0,0,0,0,0,0]
[null,null,null,null,"Coincident",0,0,0,0,0,0,0]
[null,null,"WEATHER CORRECTED MD 10% POE","MW","Non-coincident",137.76229860000001,139.69828799999999,141.2345886,142.69691470000001,144.00717159999999,145.02496339999999,145.8358154]
[null,null,null,null,"Coincident",91.860945714821668,93.151878132363862,94.176295026190644,95.15138516227718,96.025074402269055,96.703745695060562,97.244427959451542]
[null,null,"WEATHER CORRECTED MD 10% POE","MVA","Non-coincident",144.2115850355537,146.15058483658359,147.68965908502599,149.1549281987177,150.46806746256149,151.48825419379551,152.30111004896261]
[null,null,null,null,"Coincident",96.161378831692815,97.454318607477461,98.48058499112534,99.457637551066014,100.33324877313341,101.01351702423869,101.5555354744555]
[null,null,"WEATHER CORRECTED MD 50% POE","MW","Non-coincident",128.96594239999999,130.79048159999999,132.17517090000001,133.57766720000001,134.84718319999999,135.81819150000001,136.4984283]
[null,null,null,null,"Coincident",85.995468675108299,87.212085253874974,88.135406582800556,89.070601754402745,89.917124653230857,90.564600353341916,91.018187411579504]
[null,null,"WEATHER CORRECTED MD 50% POE","MVA","Non-coincident",135.40894995631089,137.2337295678667,138.61898807999569,140.02238773296,141.29299871105059,142.26501766671879,142.9460497945324]
[null,null,null,null,"Coincident",90.291714987671341,91.508491874687095,92.432192758578125,93.367990292789372,94.215243331314355,94.863392944291391,95.317510333148121]
[null,"Loganlea (110)","CONNECTION POINT RATING","MVA","Non-coincident",1538.86,1538.86,1538.86,1538.86,1538.86,1538.86,1538.86]
[null,null,null,null,"Coincident",1538.86,1538.86,1538.86,1538.86,1538.86,1538.86,1538.86]
[null,null,"WINTER/SUMMER PEAKING",null,"Non-coincident","Summer","Summer","Summer","Summer","Summer","Summer","Summer"]
[null,null,null,null,"Coincident","Summer","Summer","Summer","Summer","Summer","Summer","Summer"]
[null,null,"ADJUSTMENTS - EMBEDDED GENERATION","MW","Non-coincident",0,0,0,0,0,0,0]
[null,null,null,null,"Coincident",0,0,0,0,0,0,0]
[null,null,"WEATHER CORRECTED MD 10% POE","MW","Non-coincident",495.16345209999997,519.20996090000006,557.57226560000004,608.97918700000002,626.45623780000005,640.46020510000005,658.46997069999998]
[null,null,null,null,"Coincident",495.16347236236408,519.20998214636074,557.57228841616757,608.97921191976741,626.45626343493802,640.46023130798824,658.46999764495774]
[null,null,"WEATHER CORRECTED MD 10% POE","MVA","Non-coincident",516.96415683815121,543.65622026052142,586.33010441586919,643.65562823390724,663.17499352821903,678.82495244341362,698.96301466674004]
[null,null,null,null,"Coincident",516.96417799261235,543.65624250723658,586.3301284088235,643.65565457265393,663.17502066570898,678.82498022130858,698.96304326869574]
[null,null,"WEATHER CORRECTED MD 50% POE","MW","Non-coincident",448.27722169999998,471.04028319999998,508.74822999999998,557.36553960000003,574.50531009999997,587.12628170000005,603.09350589999997]
[null,null,null,null,"Coincident",448.27724004375352,471.04030247523059,508.74825081826077,557.36556240770824,574.50533360907707,587.12630572553439,603.09353057892201]
[null,null,"WEATHER CORRECTED MD 50% POE","MVA","Non-coincident",465.07900935037009,490.23983628395212,532.03755303329319,586.09988370410053,605.19668431942114,619.26943258031042,637.08534072388056]
[null,null,null,null,"Coincident",465.07902838166211,490.2398563448391,532.03757480456602,586.09990768763407,605.19670908440639,619.26945792116032,637.08536679376743]
[null,"Loganlea (33)","CONNECTION POINT RATING","MVA","Non-coincident",310.87,310.87,310.87,310.87,310.87,310.87,310.87]
[null,null,null,null,"Coincident",310.87,310.87,310.87,310.87,310.87,310.87,310.87]
[null,null,"WINTER/SUMMER PEAKING",null,"Non-coincident","Summer","Summer","Summer","Summer","Summer","Summer","Summer"]
[null,null,null,null,"Coincident","Summer","Summer","Summer","Summer","Summer","Summer","Summer"]
[null,null,"ADJUSTMENTS - EMBEDDED GENERATION","MW","Non-coincident",0,0,0,0,0,0,0]
[null,null,null,null,"Coincident",0,0,0,0,0,0,0]
[null,null,"WEATHER CORRECTED MD 10% POE","MW","Non-coincident",116.9982376,119.2407379,123.4055405,125.39096069999999,127.6791611,129.8242645,131.65022279999999]
[null,null,null,null,"Coincident",116.9982376,119.2407379,123.4055405,125.39096069999999,127.6791611,129.8242645,131.65022279999999]
[null,null,"WEATHER CORRECTED MD 10% POE","MVA","Non-coincident",117.003565745445,119.2492034547675,123.4215207846657,125.41124394130721,127.704942367526,129.85569805169811,131.68682932922101]
[null,null,null,null,"Coincident",117.003565745445,119.2492034547675,123.4215207846657,125.41124394130721,127.704942367526,129.85569805169811,131.68682932922101]
[null,null,"WEATHER CORRECTED MD 50% POE","MW","Non-coincident",107.17803960000001,109.2429657,113.226944,115.2384644,117.3287048,119.4458008,121.5410461]
[null,null,null,null,"Coincident",107.17803960000001,109.2429657,113.226944,115.2384644,117.3287048,119.4458008,121.5410461]
[null,null,"WEATHER CORRECTED MD 50% POE","MVA","Non-coincident",107.17825717479261,109.2429845894581,113.2285595246707,115.24180760528959,117.3344532493476,119.4545860542059,121.55340106684871]
[null,null,null,null,"Coincident",107.17825717479261,109.2429845894581,113.2285595246707,115.24180760528959,117.3344532493476,119.4545860542059,121.55340106684871]
[null,"Mackay","CONNECTION POINT RATING","MVA","Non-coincident",269.85000000000002,269.85000000000002,269.85000000000002,269.85000000000002,269.85000000000002,269.85000000000002,269.85000000000002]
[null,null,null,null,"Coincident",269.85000000000002,269.85000000000002,269.85000000000002,269.85000000000002,269.85000000000002,269.85000000000002,269.85000000000002]
[null,null,"WINTER/SUMMER PEAKING",null,"Non-coincident","Summer","Summer","Summer","Summer","Summer","Summer","Summer"]
[null,null,null,null,"Coincident","Summer","Summer","Summer","Summer","Summer","Summer","Summer"]
[null,null,"ADJUSTMENTS - EMBEDDED GENERATION","MW","Non-coincident",0,0,0,0,0,0,0]
[null,null,null,null,"Coincident",0,0,0,0,0,0,0]
[null,null,"WEATHER CORRECTED MD 10% POE","MW","Non-coincident",105.3871765,106.8186874,107.7161026,108.7065277,109.46125790000001,110.21961210000001,110.87707519999999]
[null,null,null,null,"Coincident",99.921553549688198,101.2788229803889,102.12969615055211,103.0687555119784,103.7843436565651,104.5033678521221,105.1267333936934]
[null,null,"WEATHER CORRECTED MD 10% POE","MVA","Non-coincident",105.4158223616831,106.85359966180491,107.75521318384089,108.7505058045317,109.50910610344501,110.27148598684779,110.9325481195508]
[null,null,null,null,"Coincident",99.948713770667666,101.3119246114729,102.1667783689719,103.1104528101974,103.8297103414083,104.55255143910701,105.1793293592134]
[null,null,"WEATHER CORRECTED MD 50% POE","MW","Non-coincident",98.181976320000004,99.499465939999993,100.42869570000001,101.3932648,102.33192440000001,103.1473465,103.9296646]
[null,null,null,null,"Coincident",93.090031731451688,94.339193289698642,95.220231043127839,96.134775356572121,97.024753896668301,97.797886318815969,98.5396315910412]
[null,null,"WEATHER CORRECTED MD 50% POE","MVA","Non-coincident",98.187902563916509,99.508365831407261,100.4400264325475,101.4074013611168,102.3490600419974,103.1672969225333,103.952494003198]
[null,null,null,null,"Coincident",93.095650626639113,94.34763161213381,95.230974137654187,96.148178762902475,97.041000844601811,97.816802066250403,98.561277008538013]
[null,"Mackay Ports (Rail 132)","CONNECTION POINT RATING","MVA","Non-coincident",0,0,0,0,0,0,0]
[null,null,null,null,"Coincident",0,0,0,0,0,0,0]
[null,null,"WINTER/SUMMER PEAKING",null,"Non-coincident","Shoulder","Shoulder","Shoulder","Shoulder","Shoulder","Shoulder","Shoulder"]
[null,null,null,null,"Coincident","Shoulder","Shoulder","Shoulder","Shoulder","Shoulder","Shoulder","Shoulder"]
[null,null,"ADJUSTMENTS - EMBEDDED GENERATION","MW","Non-coincident",0,0,0,0,0,0,0]
[null,null,null,null,"Coincident",0,0,0,0,0,0,0]
[null,null,"WEATHER CORRECTED MD 10% POE","MW","Non-coincident"]
[null,null,null,null,"Coincident"]
[null,null,"WEATHER CORRECTED MD 10% POE","MVA","Non-coincident"]
[null,null,null,null,"Coincident"]
[null,null,"WEATHER CORRECTED MD 50% POE","MW","Non-coincident"]
[null,null,null,null,"Coincident"]
[null,null,"WEATHER CORRECTED MD 50% POE","MVA","Non-coincident"]
[null,null,null,null,"Coincident"]
[null,"Middle Ridge (Energex)","CONNECTION POINT RATING","MVA","Non-coincident",304.83999999999997,304.83999999999997,304.83999999999997,304.83999999999997,304.83999999999997,304.83999999999997,304.83999999999997]
[null,null,null,null,"Coincident",304.83999999999997,304.83999999999997,304.83999999999997,304.83999999999997,304.83999999999997,304.83999999999997,304.83999999999997]
[null,null,"WINTER/SUMMER PEAKING",null,"Non-coincident","Summer","Summer","Summer","Summer","Summer","Summer","Summer"]
[null,null,null,null,"Coincident","Summer","Summer","Summer","Summer","Summer","Summer","Summer"]
[null,null,"ADJUSTMENTS - EMBEDDED GENERATION","MW","Non-coincident",0,0,0,0,0,0,0]
[null,null,null,null,"Coincident",0,0,0,0,0,0,0]
[null,null,"WEATHER CORRECTED MD 10% POE","MW","Non-coincident",116.405159,118.1689148,120.1684494,121.91804500000001,123.59066009999999,125.1411743,126.08634189999999]
[null,null,null,null,"Coincident",71.377753791930346,72.459260215898112,73.685342372422184,74.758165991624878,75.783786417919416,76.734536554504785,77.314097983091557]
[null,null,"WEATHER CORRECTED MD 10% POE","MVA","Non-coincident",116.5769292898438,118.3267984598632,120.3115476341554,122.0490031570627,123.7106777977984,125.25160824754521,126.1911885550103]
[null,null,null,null,"Coincident",71.483080545165066,72.556071913062553,73.773087886567353,74.838467407577284,75.85737932185701,76.802252858368547,77.378388249876295]
[null,null,"WEATHER CORRECTED MD 50% POE","MW","Non-coincident",105.7760925,107.3570404,109.2440491,110.73218540000001,112.1795959,113.2718735,114.3180923]
[null,null,null,null,"Coincident",64.860182765073588,65.829594352442058,66.986677453817578,67.899178474758031,68.786707096276032,69.456473988697354,70.097998372671512]
[null,null,"WEATHER CORRECTED MD 50% POE","MVA","Non-coincident",106.05056618293,107.61396742831,109.4811386986338,110.9544421172448,112.3880829381346,113.4703833601955,114.50736930471039]
[null,null,null,null,"Coincident",65.028485571674622,65.987137835280365,67.132056946816789,68.035462685684649,68.914547963507502,69.578197012384877,70.214059959260581]
[null,"Middle Ridge (Ergon)","CONNECTION POINT RATING","MVA","Non-coincident",1401.71,1401.71,1401.71,1401.71,1401.71,1401.71,1401.71]
[null,null,null,null,"Coincident",1401.71,1401.71,1401.71,1401.71,1401.71,1401.71,1401.71]
[null,null,"WINTER/SUMMER PEAKING",null,"Non-coincident","Summer","Summer","Summer","Summer","Summer","Summer","Summer"]
[null,null,null,null,"Coincident","Summer","Summer","Summer","Summer","Summer","Summer","Summer"]
[null,null,"ADJUSTMENTS - EMBEDDED GENERATION","MW","Non-coincident",0,0,0,0,0,0,0]
[null,null,null,null,"Coincident",0,0,0,0,0,0,0]
[null,null,"WEATHER CORRECTED MD 10% POE","MW","Non-coincident",359.11810300000002,363.83157349999999,369.41455079999997,374.71997069999998,380.05975339999998,384.83367920000001,389.40484620000001]
[null,null,null,null,"Coincident",215.66777609348819,218.49844291848319,221.85129059787579,225.03745164494271,228.2442492140741,231.1112223683663,233.85642906445409]
[null,null,"WEATHER CORRECTED MD 10% POE","MVA","Non-coincident",364.1635947685935,369.03595486952821,374.8081573578134,380.29438087678329,385.81706675246448,390.7552691298406,395.48437920217128]
[null,null,null,null,"Coincident",218.69783773599619,221.6239254450729,225.090411994791,228.38515435281701,231.70179411817881,234.6674232962441,237.50748244024351]
[null,null,"WEATHER CORRECTED MD 50% POE","MW","Non-coincident",284.8262939,288.56985470000001,293.0733032,297.2733154,301.57641599999999,305.41882320000002,309.3311157]
[null,null,null,null,"Coincident",171.0519543994229,173.30014357635989,176.00468204053911,178.52699234228271,181.11121221022,183.41876342734599,185.76828414449631]
[null,null,"WEATHER CORRECTED MD 50% POE","MVA","Non-coincident",287.50384112926122,291.35894835365599,295.99792965773202,300.32560987351928,304.76072538342191,308.72200787532933,312.75626372616631]
[null,null,null,null,"Coincident",172.65995090947371,174.97512910500771,177.76106156798181,180.36004268306809,183.02354388433849,185.40248545918789,187.8252510626867]
[null,"Mindi (Rail)","CONNECTION POINT RATING","MVA","Non-coincident",129.19,129.19,129.19,129.19,129.19,129.19,129.19]
[null,null,null,null,"Coincident",129.19,129.19,129.19,129.19,129.19,129.19,129.19]
[null,null,"WINTER/SUMMER PEAKING",null,"Non-coincident","Shoulder","Shoulder","Shoulder","Shoulder","Shoulder","Shoulder","Shoulder"]
[null,null,null,null,"Coincident","Shoulder","Shoulder","Shoulder","Shoulder","Shoulder","Shoulder","Shoulder"]
[null,null,"ADJUSTMENTS - EMBEDDED GENERATION","MW","Non-coincident",0,0,0,0,0,0,0]
[null,null,null,null,"Coincident",0,0,0,0,0,0,0]
[null,null,"WEATHER CORRECTED MD 10% POE","MW","Non-coincident"]
[null,null,null,null,"Coincident"]
[null,null,"WEATHER CORRECTED MD 10% POE","MVA","Non-coincident"]
[null,null,null,null,"Coincident"]
[null,null,"WEATHER CORRECTED MD 50% POE","MW","Non-coincident"]
[null,null,null,null,"Coincident"]
[null,null,"WEATHER CORRECTED MD 50% POE","MVA","Non-coincident"]
[null,null,null,null,"Coincident"]
[null,"Molendinar","CONNECTION POINT RATING","MVA","Non-coincident",850.9,850.9,850.9,850.9,850.9,850.9,850.9]
[null,null,null,null,"Coincident",850.9,850.9,850.9,850.9,850.9,850.9,850.9]
[null,null,"WINTER/SUMMER PEAKING",null,"Non-coincident","Summer","Summer","Summer","Summer","Summer","Summer","Summer"]
[null,null,null,null,"Coincident","Summer","Summer","Summer","Summer","Summer","Summer","Summer"]
[null,null,"ADJUSTMENTS - EMBEDDED GENERATION","MW","Non-coincident",0,0,0,0,0,0,0]
[null,null,null,null,"Coincident",0,0,0,0,0,0,0]
[null,null,"WEATHER CORRECTED MD 10% POE","MW","Non-coincident",632.47790529999997,652.16302489999998,669.03961179999999,685.74877930000002,703.34527590000005,715.31152340000006,727.76202390000003]
[null,null,null,null,"Coincident",598.03283686245425,616.64589483604584,632.60337422906196,648.40255196776127,665.04073441232765,676.35529398675089,688.12773389647487]
[null,null,"WEATHER CORRECTED MD 10% POE","MVA","Non-coincident",634.86143943036723,654.64243942382768,671.6012990605858,688.39198275733611,706.074384056947,718.09908241861103,730.61042606858098]
[null,null,null,null,"Coincident",600.28656251167808,618.99027918373201,635.02555069841378,650.90180522032449,667.62121395086467,678.99104112329428,690.82101063409254]
[null,null,"WEATHER CORRECTED MD 50% POE","MW","Non-coincident",585.34350589999997,603.85021970000003,619.87799070000005,635.81274410000003,652.91387940000004,665.11187740000003,677.10815430000002]
[null,null,null,null,"Coincident",553.46540082906472,570.96422958192989,586.11912002061695,601.18605864511403,617.35585741804789,628.8895462423593,640.23249980038383]
[null,null,"WEATHER CORRECTED MD 50% POE","MVA","Non-coincident",587.4978778695089,606.09449364280067,622.20020476094612,638.21251447919531,655.39695334481701,667.65441124772985,679.70919654701231]
[null,null,null,null,"Coincident",555.50244460527574,573.08627922423784,588.31486512259119,603.45513630879611,619.70370189279481,631.29361240346168,642.69188796358299]
[null,"Moranbah (11)","CONNECTION POINT RATING","MVA","Non-coincident"]
[null,null,null,null,"Coincident"]
[null,null,"WINTER/SUMMER PEAKING",null,"Non-coincident","Winter","Winter","Winter","Winter","Winter","Winter","Winter"]
[null,null,null,null,"Coincident","Winter","Winter","Winter","Winter","Winter","Winter","Winter"]
[null,null,"ADJUSTMENTS - EMBEDDED GENERATION","MW","Non-coincident",0,0,0,0,0,0,0]
[null,null,null,null,"Coincident",0,0,0,0,0,0,0]
[null,null,"WEATHER CORRECTED MD 10% POE","MW","Non-coincident",25.400270460000002,25.798042299999999,26.162261959999999,26.529582980000001,26.873874659999998,27.169506070000001,27.43347168]
[null,null,null,null,"Coincident",10.841299983411121,11.011076279658999,11.16653189183975,11.323311221189959,11.47026120703954,11.596442099694841,11.709107449767419]
[null,null,"WEATHER CORRECTED MD 10% POE","MVA","Non-coincident",25.561810260693139,25.962582776427251,26.329550599155372,26.699643670078391,27.046534097842329,27.344397306702501,27.610355918103568]
[null,null,null,null,"Coincident",10.91024812478358,11.0813051643148,11.237933742609661,11.395896233992451,11.543955412916739,11.67108887814342,11.78460487766441]
[null,null,"WEATHER CORRECTED MD 50% POE","MW","Non-coincident",24.152069090000001,24.503627779999999,24.859958649999999,25.211061480000001,25.54866028,25.847335820000001,26.113346100000001]
[null,null,null,null,"Coincident",10.308544810068179,10.45859648869369,10.61068502102265,10.76054213026284,10.90463547252088,11.032115655534939,11.14565370815893]
[null,null,"WEATHER CORRECTED MD 50% POE","MVA","Non-coincident",24.304197352267462,24.65840608459995,25.017423572964251,25.371174175627932,25.71131939616382,26.012248199778309,26.280265606507939]
[null,null,null,null,"Coincident",10.37347593471088,10.5246586998711,10.67789393005409,10.82888115709283,10.97406135820763,11.10250327534278,11.21689800636376]
[null,"Moranbah (66)","CONNECTION POINT RATING","MVA","Non-coincident",232.4,232.4,232.4,232.4,232.4,232.4,232.4]
[null,null,null,null,"Coincident",232.4,232.4,232.4,232.4,232.4,232.4,232.4]
[null,null,"WINTER/SUMMER PEAKING",null,"Non-coincident","Summer","Shoulder","Summer","Summer","Summer","Summer","Summer"]
[null,null,null,null,"Coincident","Summer","Shoulder","Summer","Summer","Summer","Summer","Summer"]
[null,null,"ADJUSTMENTS - EMBEDDED GENERATION","MW","Non-coincident",0,0,0,0,0,0,0]
[null,null,null,null,"Coincident",0,0,0,0,0,0,0]
[null,null,"WEATHER CORRECTED MD 10% POE","MW","Non-coincident",104.56475829999999,106.3615112,108.2551498,110.1087265,111.83308409999999,113.3044586,114.4688721]
[null,null,null,null,"Coincident",16.739712524693221,17.02735367179573,17.330505195358931,17.62724323219776,17.90329465700912,18.138846161613561,18.325256454782782]
[null,null,"WEATHER CORRECTED MD 10% POE","MVA","Non-coincident",114.7759518203559,116.68214488857571,118.6913153464638,120.65816066478121,122.4880443706747,124.04957375307821,125.2854037024444]
[null,null,null,null,"Coincident",18.374416672092071,18.679578033312961,19.001224986119549,19.31609613146961,19.60904117039366,19.85902551870824,20.05686883052887]
[null,null,"WEATHER CORRECTED MD 50% POE","MW","Non-coincident",101.2930145,102.9307709,104.8427887,106.61956790000001,108.2601318,109.6563644,110.80230709999999]
[null,null,null,null,"Coincident",16.215940925572639,16.478128413663232,16.784222252873079,17.068665821733259,17.331302760897771,17.55482484158339,17.738278154914209]
[null,null,"WEATHER CORRECTED MD 50% POE","MVA","Non-coincident",111.3054124257242,113.04260123706381,115.0709047773706,116.9559335191037,118.69660069081669,120.1781390052744,121.3941683674806]
[null,null,null,null,"Coincident",17.818819999596741,18.096925565714031,18.421635522773741,18.723408699037059,19.00207111388287,19.239249737747581,19.433923184861719]
[null,"Moranbah (Broadlea)","CONNECTION POINT RATING","MVA","Non-coincident",182.9,182.9,182.9,182.9,182.9,182.9,182.9]
[null,null,null,null,"Coincident",182.9,182.9,182.9,182.9,182.9,182.9,182.9]
[null,null,"WINTER/SUMMER PEAKING",null,"Non-coincident","Summer","Summer","Summer","Summer","Summer","Summer","Summer"]
[null,null,null,null,"Coincident","Summer","Summer","Summer","Summer","Summer","Summer","Summer"]
[null,null,"ADJUSTMENTS - EMBEDDED GENERATION","MW","Non-coincident",0,0,0,0,0,0,0]
[null,null,null,null,"Coincident",0,0,0,0,0,0,0]
[null,null,"WEATHER CORRECTED MD 10% POE","MW","Non-coincident",64.478652949999997,65.122993469999997,65.86486816,66.549095149999999,67.182830809999999,67.704925540000005,68.098724369999999]
[null,null,null,null,"Coincident",44.580855363017648,45.026355543502611,45.539291325179377,46.012369205703912,46.45053713422368,46.811515978834052,47.083790411985888]
[null,null,"WEATHER CORRECTED MD 10% POE","MVA","Non-coincident",71.070913688566293,71.852516863558151,72.752829593292901,73.583548044869644,74.353265926541255,74.987599021634523,75.466179477649078]
[null,null,null,null,"Coincident",49.138776613779832,49.679180863890437,50.301661479558888,50.876024271626697,51.408210971924852,51.846791969984118,52.177684833172449]
[null,null,"WEATHER CORRECTED MD 50% POE","MW","Non-coincident",55.412338259999999,56.082462309999997,56.677642820000003,57.2452507,57.745735170000003,58.124294280000001,58.417732239999999]
[null,null,null,null,"Coincident",38.312361134642309,38.775688173615897,39.187198883242132,39.579645741907292,39.925683147276303,40.187420763636688,40.390305201419899]
[null,null,"WEATHER CORRECTED MD 50% POE","MVA","Non-coincident",60.114395932262873,60.921126894434828,61.638115748029463,62.322294606950088,62.925882088090937,63.382618172584742,63.736767371596549]
[null,null,null,null,"Coincident",41.563386759483897,42.121164484296877,42.616894077217893,43.089938679679207,43.507262010185741,43.823051568284583,44.067912053045603]
[null,"Moura (66/11)","CONNECTION POINT RATING","MVA","Non-coincident",125.7,125.7,125.7,125.7,125.7,125.7,125.7]
[null,null,null,null,"Coincident",125.7,125.7,125.7,125.7,125.7,125.7,125.7]
[null,null,"WINTER/SUMMER PEAKING",null,"Non-coincident","Summer","Summer","Summer","Summer","Summer","Summer","Summer"]
[null,null,null,null,"Coincident","Summer","Summer","Summer","Summer","Summer","Summer","Summer"]
[null,null,"ADJUSTMENTS - EMBEDDED GENERATION","MW","Non-coincident",0,0,0,0,0,0,0]
[null,null,null,null,"Coincident",0,0,0,0,0,0,0]
[null,null,"WEATHER CORRECTED MD 10% POE","MW","Non-coincident",68.098411560000002,69.217117310000006,70.394668580000001,71.50563812,72.523124690000003,73.369041440000004,74.039192200000002]
[null,null,null,null,"Coincident",48.504447285174557,49.301267693102687,50.140001992374579,50.931312130950808,51.656037165901949,52.258558186115017,52.735886386096603]
[null,null,"WEATHER CORRECTED MD 10% POE","MVA","Non-coincident",72.035865722264731,73.27614386586086,74.582048614104451,75.814456393148603,76.943443320619366,77.882252685035809,78.626115056346222]
[null,null,null,null,"Coincident",51.308977280460709,52.192390042328263,53.122546657873258,54.00035359614256,54.804496977092171,55.473182608430939,56.003013368798399]
[null,null,"WEATHER CORRECTED MD 50% POE","MW","Non-coincident",65.952865599999996,66.875762940000001,68.042518619999996,69.13358307,70.146064760000002,71.011726379999999,71.701637270000006]
[null,null,null,null,"Coincident",46.976239526274817,47.633591501925792,48.464636427626807,49.241768770179689,49.962928979864458,50.579513676221048,51.070916421584492]
[null,null,"WEATHER CORRECTED MD 50% POE","MVA","Non-coincident",69.658223898631917,70.680778131208086,71.973907942821157,73.183519675342851,74.306315187529933,75.266516299016445,76.031913797482645]
[null,null,null,null,"Coincident",49.615454629116442,50.343789207471808,51.26484662046316,52.126416621459917,52.92615004380157,53.610072372213423,54.155241954970109]
[null,"Mt McLaren (Rail)","CONNECTION POINT RATING","MVA","Non-coincident",63.67,63.67,63.67,63.67,63.67,63.67,63.67]
[null,null,null,null,"Coincident",63.67,63.67,63.67,63.67,63.67,63.67,63.67]
[null,null,"WINTER/SUMMER PEAKING",null,"Non-coincident","Shoulder","Shoulder","Shoulder","Shoulder","Shoulder","Shoulder","Shoulder"]
[null,null,null,null,"Coincident","Shoulder","Shoulder","Shoulder","Shoulder","Shoulder","Shoulder","Shoulder"]
[null,null,"ADJUSTMENTS - EMBEDDED GENERATION","MW","Non-coincident",0,0,0,0,0,0,0]
[null,null,null,null,"Coincident",0,0,0,0,0,0,0]
[null,null,"WEATHER CORRECTED MD 10% POE","MW","Non-coincident"]
[null,null,null,null,"Coincident"]
[null,null,"WEATHER CORRECTED MD 10% POE","MVA","Non-coincident"]
[null,null,null,null,"Coincident"]
[null,null,"WEATHER CORRECTED MD 50% POE","MW","Non-coincident"]
[null,null,null,null,"Coincident"]
[null,null,"WEATHER CORRECTED MD 50% POE","MVA","Non-coincident"]
[null,null,null,null,"Coincident"]
[null,"Mudgeeraba (110)","CONNECTION POINT RATING","MVA","Non-coincident",1219.3599999999999,1219.3599999999999,1219.3599999999999,1219.3599999999999,1219.3599999999999,1219.3599999999999,1219.3599999999999]
[null,null,null,null,"Coincident",1219.3599999999999,1219.3599999999999,1219.3599999999999,1219.3599999999999,1219.3599999999999,1219.3599999999999,1219.3599999999999]
[null,null,"WINTER/SUMMER PEAKING",null,"Non-coincident","Summer","Summer","Summer","Summer","Summer","Summer","Summer"]
[null,null,null,null,"Coincident","Summer","Summer","Summer","Summer","Summer","Summer","Summer"]
[null,null,"ADJUSTMENTS - EMBEDDED GENERATION","MW","Non-coincident",0,0,0,0,0,0,0]
[null,null,null,null,"Coincident",0,0,0,0,0,0,0]
[null,null,"WEATHER CORRECTED MD 10% POE","MW","Non-coincident",447.32983400000001,457.03680420000001,468.65621950000002,479.84188840000002,488.26846310000002,496.21005250000002,504.7059021]
[null,null,null,null,"Coincident",384.70893345813022,393.05704232303509,403.04987653107071,412.66968371910372,419.91663735185028,426.74649790623579,434.05302877007409]
[null,null,"WEATHER CORRECTED MD 10% POE","MVA","Non-coincident",457.75563743504108,467.90719600999671,480.06147657022802,491.76461621160212,500.58257847515353,508.89418365746309,517.78705014250386]
[null,null,null,null,"Coincident",393.67524738374863,402.40570749499818,412.85853213552389,422.92337026466288,430.50692181844738,437.6550003099245,445.30297037767889]
[null,null,"WEATHER CORRECTED MD 50% POE","MW","Non-coincident",358.59082030000002,366.53558349999997,377.39364619999998,386.36102290000002,392.89511110000001,400.12915040000001,407.47009279999997]
[null,null,null,null,"Coincident",308.39233500685538,315.22492506667561,324.56298705862059,332.27503679008191,337.89442971110788,344.11578883399892,350.429085883803]
[null,null,"WEATHER CORRECTED MD 50% POE","MVA","Non-coincident",365.07666265598363,373.36271500030608,384.69154892127222,394.05122036267119,400.87300957607067,408.42728779973339,416.09495174342049]
[null,null,null,null,"Coincident",313.9702359329716,321.09633868238609,330.83926947706948,338.88869731321762,344.75551649917668,351.25228487360903,357.84656630463741]
[null,"Mudgeeraba (33)","CONNECTION POINT RATING","MVA","Non-coincident",68.59,68.59,68.59,68.59,68.59,68.59,68.59]
[null,null,null,null,"Coincident",68.59,68.59,68.59,68.59,68.59,68.59,68.59]
[null,null,"WINTER/SUMMER PEAKING",null,"Non-coincident","Summer","Summer","Summer","Summer","Summer","Summer","Summer"]
[null,null,null,null,"Coincident","Summer","Summer","Summer","Summer","Summer","Summer","Summer"]
[null,null,"ADJUSTMENTS - EMBEDDED GENERATION","MW","Non-coincident",0,0,0,0,0,0,0]
[null,null,null,null,"Coincident",0,0,0,0,0,0,0]
[null,null,"WEATHER CORRECTED MD 10% POE","MW","Non-coincident",26.458126069999999,26.955156330000001,27.52319336,28.10959244,28.760639189999999,29.454051969999998,30.16688156]
[null,null,null,null,"Coincident",25.919897851772468,26.406817202536601,26.96329885791425,27.537769030660439,28.175571768922481,28.854878700152689,29.553207452145099]
[null,null,"WEATHER CORRECTED MD 10% POE","MVA","Non-coincident",26.965159893806192,27.489802950709809,28.089753243042448,28.70947057409462,29.39792476858797,30.131627861213971,30.88632413133508]
[null,null,null,null,"Coincident",26.41661726741361,26.930587697806359,27.518333415407859,28.12544405791321,28.799893274372469,29.518670906774751,30.258014659952831]
[null,null,"WEATHER CORRECTED MD 50% POE","MW","Non-coincident",23.305261609999999,23.745376589999999,24.23678589,24.780027390000001,25.338142399999999,25.923263550000001,26.557655329999999]
[null,null,null,null,"Coincident",22.83117098852173,23.262332866519191,23.743745602467008,24.27593613446426,24.822697609954542,25.395915849174749,26.017402423548909]
[null,null,"WEATHER CORRECTED MD 50% POE","MVA","Non-coincident",23.645171314760471,24.107664973266889,24.624460225231619,25.196224917327619,25.784114414561859,26.400927992357651,27.070194512687191]
[null,null,null,null,"Coincident",23.16416603144004,23.6172513464719,24.12353361702149,24.68366710399517,25.2595973749496,25.86386333421499,26.519515204519681]
[null,"Murarrie","CONNECTION POINT RATING","MVA","Non-coincident",2422.1799999999998,2422.1799999999998,2422.1799999999998,2422.1799999999998,2422.1799999999998,2422.1799999999998,2422.1799999999998]
[null,null,null,null,"Coincident",2422.1799999999998,2422.1799999999998,2422.1799999999998,2422.1799999999998,2422.1799999999998,2422.1799999999998,2422.1799999999998]
[null,null,"WINTER/SUMMER PEAKING",null,"Non-coincident","Summer","Summer","Summer","Summer","Summer","Summer","Summer"]
[null,null,null,null,"Coincident","Summer","Summer","Summer","Summer","Summer","Summer","Summer"]
[null,null,"ADJUSTMENTS - EMBEDDED GENERATION","MW","Non-coincident",0,0,0,0,0,0,0]
[null,null,null,null,"Coincident",0,0,0,0,0,0,0]
[null,null,"WEATHER CORRECTED MD 10% POE","MW","Non-coincident",553.0411987,568.30615230000001,586.57897949999995,598.73687740000003,607.38659670000004,617.14135739999995,632.81823729999996]
[null,null,null,null,"Coincident",553.0411987,568.30615230000001,586.57897949999995,598.73687740000003,607.38659670000004,617.14135739999995,632.81823729999996]
[null,null,"WEATHER CORRECTED MD 10% POE","MVA","Non-coincident",557.16495617226906,572.60356431605646,591.08477773960578,603.38161263320285,612.13030805162782,621.99681407161427,637.85353972187431]
[null,null,null,null,"Coincident",557.16495617226906,572.60356431605646,591.08477773960578,603.38161263320285,612.13030805162782,621.99681407161427,637.85353972187431]
[null,null,"WEATHER CORRECTED MD 50% POE","MW","Non-coincident",524.6796875,539.21252440000001,557.06787110000005,568.88732909999999,577.31738280000002,586.55358890000002,600.44946289999996]
[null,null,null,null,"Coincident",524.6796875,539.21252440000001,557.06787110000005,568.88732909999999,577.31738280000002,586.55358890000002,600.44946289999996]
[null,null,"WEATHER CORRECTED MD 50% POE","MVA","Non-coincident",528.4819654047144,543.17933436076032,561.23739642312296,573.1913606399761,581.71749297319752,591.05909647041517,605.11378645149955]
[null,null,null,null,"Coincident",528.4819654047144,543.17933436076032,561.23739642312296,573.1913606399761,581.71749297319752,591.05909647041517,605.11378645149955]
[null,"Nebo","CONNECTION POINT RATING","MVA","Non-coincident",7.5,7.5,7.5,7.5,7.5,7.5,7.5]
[null,null,null,null,"Coincident",7.5,7.5,7.5,7.5,7.5,7.5,7.5]
[null,null,"WINTER/SUMMER PEAKING",null,"Non-coincident","Summer","Summer","Summer","Summer","Summer","Summer","Summer"]
[null,null,null,null,"Coincident","Summer","Summer","Summer","Summer","Summer","Summer","Summer"]
[null,null,"ADJUSTMENTS - EMBEDDED GENERATION","MW","Non-coincident",0,0,0,0,0,0,0]
[null,null,null,null,"Coincident",0,0,0,0,0,0,0]
[null,null,"WEATHER CORRECTED MD 10% POE","MW","Non-coincident",3.8354260920000001,3.8713686470000002,3.913635969,3.9494042399999998,3.9857184889999999,4.013880253,4.0355124470000003]
[null,null,null,null,"Coincident",2.4838514879483999,2.507128163492645,2.5345008068764598,2.557664614759501,2.5811820022019338,2.5994197775459971,2.6134289530497461]
[null,null,"WEATHER CORRECTED MD 10% POE","MVA","Non-coincident",3.8356624791111318,3.8715772350669968,3.9138143947972308,3.9495592148163601,3.985851543319566,4.0139975856067984,4.0356184448021599]
[null,null,null,null,"Coincident",2.4840045740628578,2.5072632467319389,2.534616356797462,2.557764977644609,2.581268169204427,2.5994957630461699,2.613497598043105]
[null,null,"WEATHER CORRECTED MD 50% POE","MW","Non-coincident",3.5036947729999999,3.5385785099999998,3.5769925119999999,3.6131782530000001,3.6461274619999999,3.671079159,3.6904320720000001]
[null,null,null,null,"Coincident",2.2690197298770109,2.2916107067265918,2.3164879103897711,2.3399220750612888,2.361260236673131,2.3774191478954232,2.3899522434624192]
[null,null,"WEATHER CORRECTED MD 50% POE","MVA","Non-coincident",3.504291930310794,3.5391280524908049,3.5774924423099348,3.613634071831775,3.646545263080728,3.6714694976736491,3.6908018816037398]
[null,null,null,null,"Coincident",2.2694064535523939,2.2919665946776919,2.3168116691102929,2.3402172668486889,2.3615308078720378,2.3776719342279171,2.3901917350110691]
[null,"Newlands","CONNECTION POINT RATING","MVA","Non-coincident",131.44999999999999,131.44999999999999,131.44999999999999,131.44999999999999,131.44999999999999,131.44999999999999,131.44999999999999]
[null,null,null,null,"Coincident",131.44999999999999,131.44999999999999,131.44999999999999,131.44999999999999,131.44999999999999,131.44999999999999,131.44999999999999]
[null,null,"WINTER/SUMMER PEAKING",null,"Non-coincident","Winter","Summer","Shoulder","Shoulder","Shoulder","Shoulder","Shoulder"]
[null,null,null,null,"Coincident","Winter","Summer","Shoulder","Shoulder","Shoulder","Shoulder","Shoulder"]
[null,null,"ADJUSTMENTS - EMBEDDED GENERATION","MW","Non-coincident",0,0,0,0,0,0,0]
[null,null,null,null,"Coincident",0,0,0,0,0,0,0]
[null,null,"WEATHER CORRECTED MD 10% POE","MW","Non-coincident",27.34312057,27.321849820000001,25.93073845,26.37979889,26.77639198,27.09512329,27.343671799999999]
[null,null,null,null,"Coincident",18.747093083070592,18.732509351518232,17.77873034609917,18.08661685258085,18.358530497378592,18.577060255961261,18.74747101945476]
[null,null,"WEATHER CORRECTED MD 10% POE","MVA","Non-coincident",27.604907390521589,27.583329849150729,26.172198780501351,26.6277114303169,27.030011215925139,27.35333425128951,27.605466626964532]
[null,null,null,null,"Coincident",18.926580346774639,18.91178627176965,17.944281285326799,18.256591580150189,18.532417871037119,18.754095825620219,18.92696377256631]
[null,null,"WEATHER CORRECTED MD 50% POE","MW","Non-coincident",27.008281709999999,26.204463959999998,24.96928978,25.402050020000001,25.790378570000001,26.112539290000001,26.37455559]
[null,null,null,null,"Coincident",18.517519605523319,17.966403058950071,17.119538295764581,17.41624899786466,17.68249627768872,17.903377321243621,18.083021921530069]
[null,null,"WEATHER CORRECTED MD 50% POE","MVA","Non-coincident",27.26524115678178,26.449856014825819,25.196971643401248,25.63592741251221,26.029824257491828,26.3566105256985,26.6223927627215]
[null,null,null,null,"Coincident",18.693697107102189,18.134649681784801,17.275642390598339,17.57660089465082,17.84666592980496,18.070718359104529,18.252944975285409]
[null,"North Goonyella","CONNECTION POINT RATING","MVA","Non-coincident",84.98,84.98,84.98,84.98,84.98,84.98,84.98]
[null,null,null,null,"Coincident",84.98,84.98,84.98,84.98,84.98,84.98,84.98]
[null,null,"WINTER/SUMMER PEAKING",null,"Non-coincident","Summer","Summer","Summer","Summer","Summer","Summer","Summer"]
[null,null,null,null,"Coincident","Summer","Summer","Summer","Summer","Summer","Summer","Summer"]
[null,null,"ADJUSTMENTS - EMBEDDED GENERATION","MW","Non-coincident",0,0,0,0,0,0,0]
[null,null,null,null,"Coincident",0,0,0,0,0,0,0]
[null,null,"WEATHER CORRECTED MD 10% POE","MW","Non-coincident"]
[null,null,null,null,"Coincident"]
[null,null,"WEATHER CORRECTED MD 10% POE","MVA","Non-coincident"]
[null,null,null,null,"Coincident"]
[null,null,"WEATHER CORRECTED MD 50% POE","MW","Non-coincident"]
[null,null,null,null,"Coincident"]
[null,null,"WEATHER CORRECTED MD 50% POE","MVA","Non-coincident"]
[null,null,null,null,"Coincident"]
[null,"Norwich Park (Rail)","CONNECTION POINT RATING","MVA","Non-coincident",63.67,63.67,63.67,63.67,63.67,63.67,63.67]
[null,null,null,null,"Coincident",63.67,63.67,63.67,63.67,63.67,63.67,63.67]
[null,null,"WINTER/SUMMER PEAKING",null,"Non-coincident","Shoulder","Shoulder","Shoulder","Shoulder","Shoulder","Shoulder","Shoulder"]
[null,null,null,null,"Coincident","Shoulder","Shoulder","Shoulder","Shoulder","Shoulder","Shoulder","Shoulder"]
[null,null,"ADJUSTMENTS - EMBEDDED GENERATION","MW","Non-coincident",0,0,0,0,0,0,0]
[null,null,null,null,"Coincident",0,0,0,0,0,0,0]
[null,null,"WEATHER CORRECTED MD 10% POE","MW","Non-coincident"]
[null,null,null,null,"Coincident"]
[null,null,"WEATHER CORRECTED MD 10% POE","MVA","Non-coincident"]
[null,null,null,null,"Coincident"]
[null,null,"WEATHER CORRECTED MD 50% POE","MW","Non-coincident"]
[null,null,null,null,"Coincident"]
[null,null,"WEATHER CORRECTED MD 50% POE","MVA","Non-coincident"]
[null,null,null,null,"Coincident"]
[null,"Oakey","CONNECTION POINT RATING","MVA","Non-coincident",609.67999999999995,609.67999999999995,609.67999999999995,609.67999999999995,609.67999999999995,609.67999999999995,609.67999999999995]
[null,null,null,null,"Coincident",609.67999999999995,609.67999999999995,609.67999999999995,609.67999999999995,609.67999999999995,609.67999999999995,609.67999999999995]
[null,null,"WINTER/SUMMER PEAKING",null,"Non-coincident","Summer","Summer","Summer","Summer","Summer","Summer","Summer"]
[null,null,null,null,"Coincident","Summer","Summer","Summer","Summer","Summer","Summer","Summer"]
[null,null,"ADJUSTMENTS - EMBEDDED GENERATION","MW","Non-coincident",0,0,0,0,0,0,0]
[null,null,null,null,"Coincident",0,0,0,0,0,0,0]
[null,null,"WEATHER CORRECTED MD 10% POE","MW","Non-coincident",26.476356509999999,26.799434659999999,27.17763519,27.526363369999999,27.848655699999998,28.11299515,28.327388760000002]
[null,null,null,null,"Coincident",0.64522597895877265,0.65309935895103877,0.66231606545368049,0.67081453393615564,0.67866876357899231,0.68511068772891281,0.69033543709510703]
[null,null,"WEATHER CORRECTED MD 10% POE","MVA","Non-coincident",27.770092758141971,28.123597280594431,28.53750904027746,28.91925127532836,29.272125639122191,29.561596709161311,29.796404823887631]
[null,null,null,null,"Coincident",0.67675419308092988,0.68536906051858482,0.69545604587259913,0.70475906334887461,0.71335857388735557,0.72041295293213448,0.72613520159707179]
[null,null,"WEATHER CORRECTED MD 50% POE","MW","Non-coincident",23.31339264,23.61417389,23.935409549999999,24.234626769999998,24.514213560000002,24.732673649999999,24.907127379999999]
[null,null,null,null,"Coincident",0.56814488743240776,0.57547489435425869,0.58330337306210811,0.59059526473998691,0.59740876493641915,0.60273261398568057,0.60698403274413948]
[null,null,"WEATHER CORRECTED MD 50% POE","MVA","Non-coincident",24.31382127527932,24.642087362057211,24.99278202407778,25.319532771824878,25.62492519256061,25.86360006658898,26.054227675074149]
[null,null,null,null,"Coincident",0.59252522637113925,0.60052503582831407,0.60907142726749763,0.61703430807441695,0.62447668873436069,0.63029316991029782,0.63493874435914466]
[null,"Oonooie (Rail)","CONNECTION POINT RATING","MVA","Non-coincident",69.66,69.66,69.66,69.66,69.66,69.66,69.66]
[null,null,null,null,"Coincident",69.66,69.66,69.66,69.66,69.66,69.66,69.66]
[null,null,"WINTER/SUMMER PEAKING",null,"Non-coincident","Shoulder","Shoulder","Shoulder","Shoulder","Shoulder","Shoulder","Shoulder"]
[null,null,null,null,"Coincident","Shoulder","Shoulder","Shoulder","Shoulder","Shoulder","Shoulder","Shoulder"]
[null,null,"ADJUSTMENTS - EMBEDDED GENERATION","MW","Non-coincident",0,0,0,0,0,0,0]
[null,null,null,null,"Coincident",0,0,0,0,0,0,0]
[null,null,"WEATHER CORRECTED MD 10% POE","MW","Non-coincident"]
[null,null,null,null,"Coincident"]
[null,null,"WEATHER CORRECTED MD 10% POE","MVA","Non-coincident"]
[null,null,null,null,"Coincident"]
[null,null,"WEATHER CORRECTED MD 50% POE","MW","Non-coincident"]
[null,null,null,null,"Coincident"]
[null,null,"WEATHER CORRECTED MD 50% POE","MVA","Non-coincident"]
[null,null,null,null,"Coincident"]
[null,"Orana (APLNG)","CONNECTION POINT RATING","MVA","Non-coincident"]
[null,null,null,null,"Coincident"]
[null,null,"WINTER/SUMMER PEAKING",null,"Non-coincident","Shoulder","Shoulder","Shoulder","Shoulder","Summer","Shoulder","Summer"]
[null,null,null,null,"Coincident","Shoulder","Shoulder","Shoulder","Shoulder","Summer","Shoulder","Summer"]
[null,null,"ADJUSTMENTS - EMBEDDED GENERATION","MW","Non-coincident",0,0,0,0,0,0,0]
[null,null,null,null,"Coincident",0,0,0,0,0,0,0]
[null,null,"WEATHER CORRECTED MD 10% POE","MW","Non-coincident"]
[null,null,null,null,"Coincident"]
[null,null,"WEATHER CORRECTED MD 10% POE","MVA","Non-coincident"]
[null,null,null,null,"Coincident"]
[null,null,"WEATHER CORRECTED MD 50% POE","MW","Non-coincident"]
[null,null,null,null,"Coincident"]
[null,null,"WEATHER CORRECTED MD 50% POE","MVA","Non-coincident"]
[null,null,null,null,"Coincident"]
[null,"Palmwoods (132)","CONNECTION POINT RATING","MVA","Non-coincident",825.3,825.3,825.3,825.3,825.3,825.3,825.3]
[null,null,null,null,"Coincident",825.3,825.3,825.3,825.3,825.3,825.3,825.3]
[null,null,"WINTER/SUMMER PEAKING",null,"Non-coincident","Summer","Summer","Summer","Summer","Summer","Summer","Summer"]
[null,null,null,null,"Coincident","Summer","Summer","Summer","Summer","Summer","Summer","Summer"]
[null,null,"ADJUSTMENTS - EMBEDDED GENERATION","MW","Non-coincident",0,0,0,0,0,0,0]
[null,null,null,null,"Coincident",0,0,0,0,0,0,0]
[null,null,"WEATHER CORRECTED MD 10% POE","MW","Non-coincident",529.41058350000003,547.07818599999996,566.29412839999998,580.02996829999995,594.25665279999998,607.68786620000003,620.95642090000001]
[null,null,null,null,"Coincident",524.95108673236768,542.46986595853036,561.52394262389907,575.14407850221176,589.25092434480825,602.56899974830901,615.72578660943316]
[null,null,"WEATHER CORRECTED MD 10% POE","MVA","Non-coincident",540.76650502857592,558.9419591457189,578.71098300150209,592.84259604262479,607.47953583954177,621.29836348375989,634.9500979278597]
[null,null,null,null,"Coincident",536.21135151185604,554.23370446062074,573.836203693112,587.84877891247129,602.36242426128558,616.0648488354999,629.60158772128739]
[null,null,"WEATHER CORRECTED MD 50% POE","MW","Non-coincident",482.490387,499.20779420000002,516.8712769,530.03631589999998,543.20214840000006,555.3632202,567.65936280000005]
[null,null,null,null,"Coincident",478.42612310294072,495.0027110112697,512.51740514061999,525.57154826755652,538.62647821043583,550.68511106782057,562.87767695460775]
[null,null,"WEATHER CORRECTED MD 50% POE","MVA","Non-coincident",492.50122983560351,509.69721659826689,527.8671822550275,541.4102133987268,554.95445038462935,567.46536976200593,580.11553890345851]
[null,null,null,null,"Coincident",488.35263947689413,505.40377562686791,523.42068634736586,536.8496375963831,550.27978453017647,562.68531801943072,575.2289283006063]
[null,"Pandoin (66)","CONNECTION POINT RATING","MVA","Non-coincident",116.1,116.1,116.1,116.1,116.1,116.1,116.1]
[null,null,null,null,"Coincident",116.1,116.1,116.1,116.1,116.1,116.1,116.1]
[null,null,"WINTER/SUMMER PEAKING",null,"Non-coincident","Summer","Summer","Summer","Summer","Summer","Summer","Summer"]
[null,null,null,null,"Coincident","Summer","Summer","Summer","Summer","Summer","Summer","Summer"]
[null,null,"ADJUSTMENTS - EMBEDDED GENERATION","MW","Non-coincident",0,0,0,0,0,0,0]
[null,null,null,null,"Coincident",0,0,0,0,0,0,0]
[null,null,"WEATHER CORRECTED MD 10% POE","MW","Non-coincident",51.006149290000003,51.784534450000002,52.617980959999997,53.429607390000001,54.210983280000001,54.876670840000003,55.463821410000001]
[null,null,null,null,"Coincident",45.9290227014178,46.629927791916288,47.380413453175812,48.111250994284781,48.814849119014937,49.414274472249467,49.942980368186753]
[null,null,"WEATHER CORRECTED MD 10% POE","MVA","Non-coincident",51.006239894136463,51.784696573264569,52.618240876912608,53.429982669587012,54.211487548201433,54.877298301148933,55.464567314969173]
[null,null,null,null,"Coincident",45.92910428686384,46.630073777512187,47.380647498088933,48.111588918729403,48.815303192611808,49.414839476229467,49.943652026148371]
[null,null,"WEATHER CORRECTED MD 50% POE","MW","Non-coincident",46.152538300000003,46.861835480000003,47.629280090000002,48.362300869999999,49.105392459999997,49.730464939999997,50.264888759999998]
[null,null,null,null,"Coincident",41.558537721731923,42.197231815203871,42.888285372577222,43.548341630770999,44.2174662555745,44.780319333557792,45.261546873817743]
[null,null,"WEATHER CORRECTED MD 50% POE","MVA","Non-coincident",46.152675123386167,46.861907062677908,47.629305230880199,48.362304016538602,49.105394594584077,49.730482116926119,50.264929878234163]
[null,null,null,null,"Coincident",41.558660925786661,42.197296272577823,42.888308010946773,43.548344464104723,44.217468177683152,44.780334800701283,45.261583899163433]
[null,"Peak Downs (Rail)","CONNECTION POINT RATING","MVA","Non-coincident",63.67,63.67,63.67,63.67,63.67,63.67,63.67]
[null,null,null,null,"Coincident",63.67,63.67,63.67,63.67,63.67,63.67,63.67]
[null,null,"WINTER/SUMMER PEAKING",null,"Non-coincident","Shoulder","Shoulder","Shoulder","Shoulder","Shoulder","Shoulder","Shoulder"]
[null,null,null,null,"Coincident","Shoulder","Shoulder","Shoulder","Shoulder","Shoulder","Shoulder","Shoulder"]
[null,null,"ADJUSTMENTS - EMBEDDED GENERATION","MW","Non-coincident",0,0,0,0,0,0,0]
[null,null,null,null,"Coincident",0,0,0,0,0,0,0]
[null,null,"WEATHER CORRECTED MD 10% POE","MW","Non-coincident"]
[null,null,null,null,"Coincident"]
[null,null,"WEATHER CORRECTED MD 10% POE","MVA","Non-coincident"]
[null,null,null,null,"Coincident"]
[null,null,"WEATHER CORRECTED MD 50% POE","MW","Non-coincident"]
[null,null,null,null,"Coincident"]
[null,null,"WEATHER CORRECTED MD 50% POE","MVA","Non-coincident"]
[null,null,null,null,"Coincident"]
[null,"Pioneer Valley","CONNECTION POINT RATING","MVA","Non-coincident",264.60000000000002,264.60000000000002,264.60000000000002,264.60000000000002,264.60000000000002,264.60000000000002,264.60000000000002]
[null,null,null,null,"Coincident",264.60000000000002,264.60000000000002,264.60000000000002,264.60000000000002,264.60000000000002,264.60000000000002,264.60000000000002]
[null,null,"WINTER/SUMMER PEAKING",null,"Non-coincident","Summer","Summer","Summer","Summer","Summer","Summer","Summer"]
[null,null,null,null,"Coincident","Summer","Summer","Summer","Summer","Summer","Summer","Summer"]
[null,null,"ADJUSTMENTS - EMBEDDED GENERATION","MW","Non-coincident",0,0,0,0,0,0,0]
[null,null,null,null,"Coincident",0,0,0,0,0,0,0]
[null,null,"WEATHER CORRECTED MD 10% POE","MW","Non-coincident",59.02223206,60.429588320000001,61.007312769999999,61.702568049999996,62.923339839999997,64.281967159999994,65.751525880000003]
[null,null,null,null,"Coincident",43.16960302641106,44.19896109947026,44.621516029954734,45.130034488035157,46.0229223325099,47.016639445844639,48.091493180652741]
[null,null,"WEATHER CORRECTED MD 10% POE","MVA","Non-coincident",59.276030415450172,60.719911938555242,61.313099740186168,62.027310781417057,63.282244577035328,64.680139063829472,66.193557848382156]
[null,null,null,null,"Coincident",43.35523433636223,44.411307446343081,44.845172466738873,45.367555407046417,46.285429772187257,47.307867385294912,48.414800923074978]
[null,null,"WEATHER CORRECTED MD 50% POE","MW","Non-coincident",50.393157960000003,51.709419250000003,52.570751190000003,53.83082581,55.165229799999999,56.588096620000002,57.943794250000003]
[null,null,null,null,"Coincident",36.858189676204297,37.820919742233798,38.450908758677123,39.372543187442147,40.348543052486207,41.389245744251738,42.380820045465093]
[null,null,"WEATHER CORRECTED MD 50% POE","MVA","Non-coincident",50.466117255783409,51.804347712633188,52.681286721629228,53.965833767537873,55.328143245945782,56.782856878782923,58.170760932102773]
[null,null,null,null,"Coincident",36.911553022965819,37.890351614000629,38.531755837044066,39.471289705980993,40.467699996296723,41.531695847603181,42.546826331988413]
[null,"Proserpine","CONNECTION POINT RATING","MVA","Non-coincident",190,190,190,190,190,190,190]
[null,null,null,null,"Coincident",190,190,190,190,190,190,190]
[null,null,"WINTER/SUMMER PEAKING",null,"Non-coincident","Summer","Summer","Summer","Summer","Summer","Summer","Summer"]
[null,null,null,null,"Coincident","Summer","Summer","Summer","Summer","Summer","Summer","Summer"]
[null,null,"ADJUSTMENTS - EMBEDDED GENERATION","MW","Non-coincident",0,0,0,0,0,0,0]
[null,null,null,null,"Coincident",0,0,0,0,0,0,0]
[null,null,"WEATHER CORRECTED MD 10% POE","MW","Non-coincident",59.608879090000002,69.949523929999998,71.050880430000007,72.083473209999994,73.09746552,73.974525450000002,74.680915830000004]
[null,null,null,null,"Coincident",50.400487619073168,59.143707592137297,60.074926321458257,60.948003963890628,61.805354540619803,62.546926078584953,63.144193132502679]
[null,null,"WEATHER CORRECTED MD 10% POE","MVA","Non-coincident",60.072253644195058,70.652744026983612,71.78064326179306,72.838265464809254,73.87696602239528,74.775496970369389,75.499244851442739]
[null,null,null,null,"Coincident",50.792279980181661,59.738294108988143,60.691955246177891,61.586195761391963,62.464437650716818,63.224163359538622,63.836106524319369]
[null,null,"WEATHER CORRECTED MD 50% POE","MW","Non-coincident",52.612525939999998,62.821552279999999,63.76190948,64.671173100000004,65.555038449999998,66.360351559999998,67.095550540000005]
[null,null,null,null,"Coincident",44.484932492078769,53.116866417141978,53.911957050276477,54.680757445819772,55.428083101152822,56.108991282109393,56.730616577782193]
[null,null,"WEATHER CORRECTED MD 50% POE","MVA","Non-coincident",52.926647711503293,63.357389226105298,64.319341057844795,65.249637760503049,66.154086454332486,66.978267007474685,67.730781800314617]
[null,null,null,null,"Coincident",44.750528669984227,53.569927165478603,54.383276487356127,55.169860770774697,55.934590050897746,56.631451028635752,57.267717186944729]
[null,"QNI","CONNECTION POINT RATING","MVA","Non-coincident",2492.98,2492.98,2492.98,2492.98,2492.98,2492.98,2492.98]
[null,null,null,null,"Coincident",2492.98,2492.98,2492.98,2492.98,2492.98,2492.98,2492.98]
[null,null,"WINTER/SUMMER PEAKING",null,"Non-coincident","Summer","Summer","Summer","Summer","Summer","Summer","Summer"]
[null,null,null,null,"Coincident","Summer","Summer","Summer","Summer","Summer","Summer","Summer"]
[null,null,"ADJUSTMENTS - EMBEDDED GENERATION","MW","Non-coincident",0,0,0,0,0,0,0]
[null,null,null,null,"Coincident",0,0,0,0,0,0,0]
[null,null,"WEATHER CORRECTED MD 10% POE","MW","Non-coincident",1342.6198910000001,1342.6198910000001,1342.6198910000001,1342.6198910000001,1342.6198910000001,1342.6198910000001,1342.6198910000001]
[null,null,null,null,"Coincident",-541.71619499999997,-541.71619499999997,-541.71619499999997,-541.71619499999997,-541.71619499999997,-541.71619499999997,-541.71619499999997]
[null,null,"WEATHER CORRECTED MD 10% POE","MVA","Non-coincident",1344.91,1344.91,1344.91,1344.91,1344.91,1344.91,1344.91]
[null,null,null,null,"Coincident",561.23911229999999,561.23911229999999,561.23911229999999,561.23911229999999,561.23911229999999,561.23911229999999,561.23911229999999]
[null,null,"WEATHER CORRECTED MD 50% POE","MW","Non-coincident",1342.6198910000001,1342.6198910000001,1342.6198910000001,1342.6198910000001,1342.6198910000001,1342.6198910000001,1342.6198910000001]
[null,null,null,null,"Coincident",-541.71619499999997,-541.71619499999997,-541.71619499999997,-541.71619499999997,-541.71619499999997,-541.71619499999997,-541.71619499999997]
[null,null,"WEATHER CORRECTED MD 50% POE","MVA","Non-coincident",1344.91,1344.91,1344.91,1344.91,1344.91,1344.91,1344.91]
[null,null,null,null,"Coincident",561.23911229999999,561.23911229999999,561.23911229999999,561.23911229999999,561.23911229999999,561.23911229999999,561.23911229999999]
[null,"Raglan (Rail)","CONNECTION POINT RATING","MVA","Non-coincident"]
[null,null,null,null,"Coincident"]
[null,null,"WINTER/SUMMER PEAKING",null,"Non-coincident","Shoulder","Shoulder","Shoulder","Shoulder","Shoulder","Shoulder","Shoulder"]
[null,null,null,null,"Coincident","Shoulder","Shoulder","Shoulder","Shoulder","Shoulder","Shoulder","Shoulder"]
[null,null,"ADJUSTMENTS - EMBEDDED GENERATION","MW","Non-coincident",0,0,0,0,0,0,0]
[null,null,null,null,"Coincident",0,0,0,0,0,0,0]
[null,null,"WEATHER CORRECTED MD 10% POE","MW","Non-coincident"]
[null,null,null,null,"Coincident"]
[null,null,"WEATHER CORRECTED MD 10% POE","MVA","Non-coincident"]
[null,null,null,null,"Coincident"]
[null,null,"WEATHER CORRECTED MD 50% POE","MW","Non-coincident"]
[null,null,null,null,"Coincident"]
[null,null,"WEATHER CORRECTED MD 50% POE","MVA","Non-coincident"]
[null,null,null,null,"Coincident"]
[null,"Redbank Plains","CONNECTION POINT RATING","MVA","Non-coincident",67.099999999999994,67.099999999999994,67.099999999999994,67.099999999999994,67.099999999999994,67.099999999999994,67.099999999999994]
[null,null,null,null,"Coincident",67.099999999999994,67.099999999999994,67.099999999999994,67.099999999999994,67.099999999999994,67.099999999999994,67.099999999999994]
[null,null,"WINTER/SUMMER PEAKING",null,"Non-coincident","Summer","Summer","Summer","Summer","Summer","Summer","Summer"]
[null,null,null,null,"Coincident","Summer","Summer","Summer","Summer","Summer","Summer","Summer"]
[null,null,"ADJUSTMENTS - EMBEDDED GENERATION","MW","Non-coincident",0,0,0,0,0,0,0]
[null,null,null,null,"Coincident",0,0,0,0,0,0,0]
[null,null,"WEATHER CORRECTED MD 10% POE","MW","Non-coincident",39.051212309999997,39.633209229999999,43.299690249999998,46.403381349999997,47.527812959999999,48.574523929999998,49.599910739999999]
[null,null,null,null,"Coincident",39.051212309999997,39.633209229999999,43.299690249999998,46.403381349999997,47.527812959999999,48.574523929999998,49.599910739999999]
[null,null,"WEATHER CORRECTED MD 10% POE","MVA","Non-coincident",39.119994076969093,39.705742136750551,43.396934139833988,46.522767573202707,47.655451905239339,48.70994347227046,49.743038302399967]
[null,null,null,null,"Coincident",39.119994076969093,39.705742136750551,43.396934139833988,46.522767573202707,47.655451905239339,48.70994347227046,49.743038302399967]
[null,null,"WEATHER CORRECTED MD 50% POE","MW","Non-coincident",34.706222529999998,35.288864140000001,38.346466059999997,41.741123199999997,42.729293820000002,43.656791689999999,44.582340240000001]
[null,null,null,null,"Coincident",34.706222529999998,35.288864140000001,38.346466059999997,41.741123199999997,42.729293820000002,43.656791689999999,44.582340240000001]
[null,null,"WEATHER CORRECTED MD 50% POE","MVA","Non-coincident",34.748852226856762,35.334787520304559,38.410776538351591,41.827649891167589,42.822581631408482,43.756531361034803,44.688613872379278]
[null,null,null,null,"Coincident",34.748852226856762,35.334787520304559,38.410776538351591,41.827649891167589,42.822581631408482,43.756531361034803,44.688613872379278]
[null,"Richlands","CONNECTION POINT RATING","MVA","Non-coincident",331.3,331.3,331.3,331.3,331.3,331.3,331.3]
[null,null,null,null,"Coincident",331.3,331.3,331.3,331.3,331.3,331.3,331.3]
[null,null,"WINTER/SUMMER PEAKING",null,"Non-coincident","Summer","Summer","Summer","Summer","Summer","Summer","Summer"]
[null,null,null,null,"Coincident","Summer","Summer","Summer","Summer","Summer","Summer","Summer"]
[null,null,"ADJUSTMENTS - EMBEDDED GENERATION","MW","Non-coincident",0,0,0,0,0,0,0]
[null,null,null,null,"Coincident",0,0,0,0,0,0,0]
[null,null,"WEATHER CORRECTED MD 10% POE","MW","Non-coincident",132.7260742,136.62159729999999,140.1662445,141.61991879999999,143.24757389999999,144.55291750000001,146.13433839999999]
[null,null,null,null,"Coincident",132.7260766899328,136.62159986301259,140.16624712950991,141.61992145678079,143.24757658731551,144.55292021180369,146.134341141471]
[null,null,"WEATHER CORRECTED MD 10% POE","MVA","Non-coincident",135.8067322467208,139.93560404292279,143.69507992782241,145.23750097944389,146.96494688741319,148.35063309107341,150.02975023470509]
[null,null,null,null,"Coincident",135.8067347944465,139.93560666810589,143.6950826235331,145.2375037040903,146.9649496444664,148.35063587412191,150.0297530492538]
[null,null,"WEATHER CORRECTED MD 50% POE","MW","Non-coincident",126.169838,129.9026337,133.6296692,134.9407501,136.48916629999999,137.74851989999999,139.23901369999999]
[null,null,null,null,"Coincident",126.1698403669382,129.90263613696521,133.62967170688421,134.94075263148,136.4891688605282,137.7485224841536,139.2390163121151]
[null,null,"WEATHER CORRECTED MD 50% POE","MVA","Non-coincident",128.86500713404689,132.81610780930069,136.764185064999,138.15370414003729,139.7951911659284,141.13057729463799,142.71143432246089]
[null,null,null,null,"Coincident",128.86500955154631,132.8161103009225,136.76418763068651,138.1537067317922,139.79519378847741,141.13057994223871,142.71143699971839]
[null,"Rockhampton","CONNECTION POINT RATING","MVA","Non-coincident",228.64,228.64,228.64,228.64,228.64,228.64,228.64]
[null,null,null,null,"Coincident",228.64,228.64,228.64,228.64,228.64,228.64,228.64]
[null,null,"WINTER/SUMMER PEAKING",null,"Non-coincident","Summer","Summer","Summer","Summer","Summer","Summer","Summer"]
[null,null,null,null,"Coincident","Summer","Summer","Summer","Summer","Summer","Summer","Summer"]
[null,null,"ADJUSTMENTS - EMBEDDED GENERATION","MW","Non-coincident",0,0,0,0,0,0,0]
[null,null,null,null,"Coincident",0,0,0,0,0,0,0]
[null,null,"WEATHER CORRECTED MD 10% POE","MW","Non-coincident",117.0499725,118.9932785,121.02306369999999,123.07514949999999,125.2558441,127.2152481,129.12960820000001]
[null,null,null,null,"Coincident",105.3775073884709,107.1270228988061,108.95439372463019,110.8018412885437,112.76507251718409,114.5290807016969,116.25253685698949]
[null,null,"WEATHER CORRECTED MD 10% POE","MVA","Non-coincident",117.2244702305042,119.17337972763561,121.2090388445672,123.26708399336449,125.45413326650331,127.4192653080792,129.33923763929971]
[null,null,null,null,"Coincident",105.53460384473421,107.2891640598888,109.1218230435111,110.9746356776464,112.9435878782899,114.71275289223711,116.4412616154565]
[null,null,"WEATHER CORRECTED MD 50% POE","MW","Non-coincident",108.17310329999999,110.054863,111.8922043,113.6238556,115.5053253,117.2554016,119.0582962]
[null,null,null,null,"Coincident",97.38585792687455,99.07996466141546,100.7340824905836,102.2930499449331,103.9868955988732,105.5624506741522,107.18555689941969]
[null,null,"WEATHER CORRECTED MD 50% POE","MVA","Non-coincident",108.3222861310467,110.2093705206903,112.0519334119456,113.7885255206011,115.67538385407219,117.4304907217835,119.2385852378205]
[null,null,null,null,"Coincident",97.520163937761097,99.219064372892262,100.8778830854467,102.44129864080359,104.13999556255089,105.7200795469345,107.3478671418675]
[null,"Rocklea","CONNECTION POINT RATING","MVA","Non-coincident",455.53,455.53,455.53,455.53,455.53,455.53,455.53]
[null,null,null,null,"Coincident",455.53,455.53,455.53,455.53,455.53,455.53,455.53]
[null,null,"WINTER/SUMMER PEAKING",null,"Non-coincident","Summer","Summer","Summer","Summer","Summer","Summer","Summer"]
[null,null,null,null,"Coincident","Summer","Summer","Summer","Summer","Summer","Summer","Summer"]
[null,null,"ADJUSTMENTS - EMBEDDED GENERATION","MW","Non-coincident",0,0,0,0,0,0,0]
[null,null,null,null,"Coincident",0,0,0,0,0,0,0]
[null,null,"WEATHER CORRECTED MD 10% POE","MW","Non-coincident",184.6778564,194.52301030000001,200.51565550000001,204.10342410000001,207.62979129999999,210.859848,213.6240387]
[null,null,null,null,"Coincident",178.92960289138071,188.4683181010486,194.2744371821716,197.75053346885221,201.16713952571769,204.29665799595509,206.97481093701899]
[null,null,"WEATHER CORRECTED MD 10% POE","MVA","Non-coincident",197.90292124893659,209.1537452328833,216.00894393237789,220.11538089416081,224.1530839313231,227.8527743628641,231.01978122693629]
[null,null,null,null,"Coincident",191.74302648076659,202.64365911150369,209.28548398944329,213.2641046491874,217.176130785488,220.7606652426287,223.82909635607709]
[null,null,"WEATHER CORRECTED MD 50% POE","MW","Non-coincident",153.20819090000001,162.52850340000001,167.4894104,170.5049286,173.55053710000001,176.26655579999999,179.0142975]
[null,null,null,null,"Coincident",148.43945718141791,157.4696671208082,162.27616172061809,165.19781938199509,168.14863075749261,170.7801110925468,173.4423270225617]
[null,null,"WEATHER CORRECTED MD 50% POE","MVA","Non-coincident",162.06687168461701,172.6559857642527,178.3015234671949,181.73600810365389,185.20677525833531,188.30355635649991,191.43797886197191]
[null,null,null,null,"Coincident",157.02240408058401,167.28192308397189,172.75173868063899,176.07932209598431,179.44205870567561,182.44244988920761,185.4793108596055]
[null,"Ross","CONNECTION POINT RATING","MVA","Non-coincident",274.35000000000002,274.35000000000002,274.35000000000002,274.35000000000002,274.35000000000002,274.35000000000002,274.35000000000002]
[null,null,null,null,"Coincident",274.35000000000002,274.35000000000002,274.35000000000002,274.35000000000002,274.35000000000002,274.35000000000002,274.35000000000002]
[null,null,"WINTER/SUMMER PEAKING",null,"Non-coincident","Summer","Summer","Summer","Summer","Summer","Summer","Summer"]
[null,null,null,null,"Coincident","Summer","Summer","Summer","Summer","Summer","Summer","Summer"]
[null,null,"ADJUSTMENTS - EMBEDDED GENERATION","MW","Non-coincident",0,0,0,0,0,0,0]
[null,null,null,null,"Coincident",0,0,0,0,0,0,0]
[null,null,"WEATHER CORRECTED MD 10% POE","MW","Non-coincident",56.744953160000001,57.105140689999999,54.865291599999999,55.208766939999997,55.407768249999997,55.611900329999997,55.69622803]
[null,null,null,null,"Coincident",31.05373876188434,31.250851788489019,30.025091881510459,30.213059143540519,30.321962831884189,30.43367433981982,30.479822767483629]
[null,null,"WEATHER CORRECTED MD 10% POE","MVA","Non-coincident",57.875925099591669,58.226268707176253,56.049721500313602,56.383158344480478,56.576400103881227,56.774666616823737,56.856583835754321]
[null,null,null,null,"Coincident",31.67266441435731,31.86439034346596,30.673272462475861,30.855746146490539,30.961497914359612,31.0699994841959,31.114828773412111]
[null,null,"WEATHER CORRECTED MD 50% POE","MW","Non-coincident",52.044013980000003,52.424827579999999,50.087657929999999,50.334251399999999,50.570671079999997,50.710266109999999,50.827362059999999]
[null,null,null,null,"Coincident",28.481144564482999,28.68954523084761,27.410526539111949,27.545475089975579,27.674856022940439,27.751249558447551,27.815330447387961]
[null,null,"WEATHER CORRECTED MD 50% POE","MVA","Non-coincident",53.315859723280482,53.6843318849795,51.450212871082257,51.67927084878152,51.899072297883258,52.028942966095393,52.139856758755293]
[null,null,null,null,"Coincident",29.177163562787278,29.37881036330829,28.15618624685332,28.281538480042091,28.40182506765532,28.472896935352871,28.533594631809478]
[null,"Runcorn","CONNECTION POINT RATING","MVA","Non-coincident",190,190,190,190,190,190,190]
[null,null,null,null,"Coincident",190,190,190,190,190,190,190]
[null,null,"WINTER/SUMMER PEAKING",null,"Non-coincident","Summer","Summer","Summer","Summer","Summer","Summer","Summer"]
[null,null,null,null,"Coincident","Summer","Summer","Summer","Summer","Summer","Summer","Summer"]
[null,null,"ADJUSTMENTS - EMBEDDED GENERATION","MW","Non-coincident",0,0,0,0,0,0,0]
[null,null,null,null,"Coincident",0,0,0,0,0,0,0]
[null,null,"WEATHER CORRECTED MD 10% POE","MW","Non-coincident",78.350463869999999,79.823242190000002,82.706748959999999,84.107818600000002,85.752204899999995,87.625892640000004,89.523544310000005]
[null,null,null,null,"Coincident",74.704305018621454,76.108545343537017,78.857863709114923,80.193732427295757,81.761594691997388,83.548087502950708,85.357429045714142]
[null,null,"WEATHER CORRECTED MD 10% POE","MVA","Non-coincident",78.727070395810756,80.226113557758396,83.162317516454223,84.58955857931268,86.265100918290187,88.174835190258378,90.109550240654158]
[null,null,null,null,"Coincident",75.063385582877601,76.492668475088962,79.292231684966566,80.653053898754436,82.250622308435766,84.071484170776984,85.916164292756761]
[null,null,"WEATHER CORRECTED MD 50% POE","MW","Non-coincident",70.109420779999994,71.528488159999995,74.318359380000004,75.665046689999997,77.056449889999996,78.67158508,80.414939880000006]
[null,null,null,null,"Coincident",66.846771492228527,68.199800398009998,70.859840687335648,72.143857840544442,73.470509961317475,75.010482361229052,76.672707475185845]
[null,null,"WEATHER CORRECTED MD 50% POE","MVA","Non-coincident",70.348656096564767,71.790081296680924,74.62556703202408,75.995001539290584,77.410369518368782,79.053878784845594,80.828490760245614]
[null,null,null,null,"Coincident",67.074873626882564,68.449219897373965,71.152751960700144,72.458457735507096,73.80795939765531,75.374985442932172,77.067013131752816]
[null,"South Pine","CONNECTION POINT RATING","MVA","Non-coincident",4685.7700000000004,4685.7700000000004,4685.7700000000004,4685.7700000000004,4685.7700000000004,4685.7700000000004,4685.7700000000004]
[null,null,null,null,"Coincident",4685.7700000000004,4685.7700000000004,4685.7700000000004,4685.7700000000004,4685.7700000000004,4685.7700000000004,4685.7700000000004]
[null,null,"WINTER/SUMMER PEAKING",null,"Non-coincident","Summer","Summer","Summer","Summer","Summer","Summer","Summer"]
[null,null,null,null,"Coincident","Summer","Summer","Summer","Summer","Summer","Summer","Summer"]
[null,null,"ADJUSTMENTS - EMBEDDED GENERATION","MW","Non-coincident",0,0,0,0,0,0,0]
[null,null,null,null,"Coincident",0,0,0,0,0,0,0]
[null,null,"WEATHER CORRECTED MD 10% POE","MW","Non-coincident",1198.0223390000001,1226.5139160000001,1260.853638,1289.0566409999999,1315.294922,1339.253784,1364.951904]
[null,null,null,null,"Coincident",1198.0223390000001,1226.5139160000001,1260.853638,1289.0566409999999,1315.294922,1339.253784,1364.951904]
[null,null,"WEATHER CORRECTED MD 10% POE","MVA","Non-coincident",1205.3101335774561,1234.3496137663981,1269.36117087196,1298.124656302112,1324.890940696569,1349.3371429949971,1375.5631909341921]
[null,null,null,null,"Coincident",1205.3101335774561,1234.3496137663981,1269.36117087196,1298.124656302112,1324.890940696569,1349.3371429949971,1375.5631909341921]
[null,null,"WEATHER CORRECTED MD 50% POE","MW","Non-coincident",1099.5708010000001,1125.450439,1159.9742429999999,1186.7679439999999,1211.8422849999999,1236.9852289999999,1260.9051509999999]
[null,null,null,null,"Coincident",1099.5708010000001,1125.450439,1159.9742429999999,1186.7679439999999,1211.8422849999999,1236.9852289999999,1260.9051509999999]
[null,null,"WEATHER CORRECTED MD 50% POE","MVA","Non-coincident",1105.041664770743,1131.386400989328,1166.545006571635,1193.841841929825,1219.3947199654181,1245.0245038231551,1269.4137001709839]
[null,null,null,null,"Coincident",1105.041664770743,1131.386400989328,1166.545006571635,1193.841841929825,1219.3947199654181,1245.0245038231551,1269.4137001709839]
[null,"Stony Creek","CONNECTION POINT RATING","MVA","Non-coincident",22.86,22.86,22.86,22.86,22.86,22.86,22.86]
[null,null,null,null,"Coincident",22.86,22.86,22.86,22.86,22.86,22.86,22.86]
[null,null,"WINTER/SUMMER PEAKING",null,"Non-coincident","Summer","Summer","Summer","Summer","Summer","Summer","Summer"]
[null,null,null,null,"Coincident","Summer","Summer","Summer","Summer","Summer","Summer","Summer"]
[null,null,"ADJUSTMENTS - EMBEDDED GENERATION","MW","Non-coincident",0,0,0,0,0,0,0]
[null,null,null,null,"Coincident",0,0,0,0,0,0,0]
[null,null,"WEATHER CORRECTED MD 10% POE","MW","Non-coincident",2.8394412990000002,2.8415367599999999,2.8390204909999999,2.8316349980000002,2.822897196,2.8106834890000001,2.7946689130000002]
[null,null,null,null,"Coincident",2.689884656036782,2.6918697466928929,2.6894860124787212,2.6824895218997602,2.6742119499930732,2.6626415530053991,2.6474704831648261]
[null,null,"WEATHER CORRECTED MD 10% POE","MVA","Non-coincident",3.156706417669787,3.158797990260779,3.156286391716713,3.1489152277158361,3.1401956546256198,3.1280096310912362,3.1120353670666812]
[null,null,null,null,"Coincident",2.9904390555611191,2.9924204626152031,2.9900411528586721,2.9830582365539491,2.974797933419377,2.963253761777306,2.94812088063401]
[null,null,"WEATHER CORRECTED MD 50% POE","MW","Non-coincident",2.786220074,2.7863869669999999,2.7857644559999999,2.7795860769999998,2.7716436390000001,2.759522676,2.7437226770000001]
[null,null,null,null,"Coincident",2.6394666542441758,2.6396247567976809,2.6390350341689,2.6331820775055128,2.6256579768610488,2.6141754389400949,2.599207644081837]
[null,null,"WEATHER CORRECTED MD 50% POE","MVA","Non-coincident",3.103609747685963,3.103776168642602,3.103155351396524,3.0969948192950238,3.0890762645023249,3.0769941108395198,3.0612487563167212]
[null,null,null,null,"Coincident",2.9401390483285561,2.940296703701768,2.9397085856149392,2.9338725358333568,2.9263710604401618,2.9149252877239231,2.9000092591553259]
[null,"Sumner","CONNECTION POINT RATING","MVA","Non-coincident",381.06,381.06,381.06,381.06,381.06,381.06,381.06]
[null,null,null,null,"Coincident",381.06,381.06,381.06,381.06,381.06,381.06,381.06]
[null,null,"WINTER/SUMMER PEAKING",null,"Non-coincident","Summer","Summer","Summer","Summer","Summer","Summer","Summer"]
[null,null,null,null,"Coincident","Summer","Summer","Summer","Summer","Summer","Summer","Summer"]
[null,null,"ADJUSTMENTS - EMBEDDED GENERATION","MW","Non-coincident",0,0,0,0,0,0,0]
[null,null,null,null,"Coincident",0,0,0,0,0,0,0]
[null,null,"WEATHER CORRECTED MD 10% POE","MW","Non-coincident",40.69236755,41.066707610000002,41.492801669999999,41.959159849999999,42.444110870000003,42.879924770000002,43.524841309999999]
[null,null,null,null,"Coincident",36.382342015804461,36.717032988906539,37.097996318277197,37.514959100936132,37.948545420259379,38.338199090460783,38.914807814470223]
[null,null,"WEATHER CORRECTED MD 10% POE","MVA","Non-coincident",42.522712202055381,42.932950732412323,43.400015915342671,43.911345228862267,44.443198712043028,44.921278879479367,45.62893462507548]
[null,null,null,null,"Coincident",38.01882151177022,38.385608686322499,38.80320358807321,39.26037428339631,39.735895283829699,40.163338492713279,40.796041255315913]
[null,null,"WEATHER CORRECTED MD 50% POE","MW","Non-coincident",35.22984314,35.524681090000001,35.907115939999997,36.3451004,36.817123410000001,37.326389310000003,37.867881769999997]
[null,null,null,null,"Coincident",31.4983934200364,31.7620029316471,32.103931316481592,32.495525646837223,32.917553256020881,33.372879089004677,33.857018131897483]
[null,null,"WEATHER CORRECTED MD 50% POE","MVA","Non-coincident",36.548463290416258,36.870246832465263,37.287763829599172,37.766101641653727,38.281816284822099,38.838446618877093,39.430547192905898]
[null,null,null,null,"Coincident",32.677348889816521,32.965049989230288,33.3383447150403,33.766018279520843,34.227109822234723,34.724783376497108,35.254170258830783]
[null,"Tangkam","CONNECTION POINT RATING","MVA","Non-coincident",152.41999999999999,152.41999999999999,152.41999999999999,152.41999999999999,152.41999999999999,152.41999999999999,152.41999999999999]
[null,null,null,null,"Coincident",152.41999999999999,152.41999999999999,152.41999999999999,152.41999999999999,152.41999999999999,152.41999999999999,152.41999999999999]
[null,null,"WINTER/SUMMER PEAKING",null,"Non-coincident","Summer","Summer","Summer","Summer","Summer","Summer","Summer"]
[null,null,null,null,"Coincident","Summer","Summer","Summer","Summer","Summer","Summer","Summer"]
[null,null,"ADJUSTMENTS - EMBEDDED GENERATION","MW","Non-coincident",0,0,0,0,0,0,0]
[null,null,null,null,"Coincident",0,0,0,0,0,0,0]
[null,null,"WEATHER CORRECTED MD 10% POE","MW","Non-coincident",38.703536990000003,39.217166900000002,39.389713290000003,39.517807009999999,39.63690948,39.592247010000001,39.618289949999998]
[null,null,null,null,"Coincident",32.51112411872905,32.942575274198788,33.087514924106713,33.195114155433437,33.295160701205667,33.25764404979487,33.279520222377627]
[null,null,"WEATHER CORRECTED MD 10% POE","MVA","Non-coincident",38.812550169419708,39.334412525016702,39.509768872076613,39.63996276322748,39.761028716626363,39.715628745417618,39.742101575841247]
[null,null,null,null,"Coincident",32.602695620517302,33.041062062842443,33.188362087792228,33.297725471190489,33.39942135078207,33.361285195439592,33.383522477678127]
[null,null,"WEATHER CORRECTED MD 50% POE","MW","Non-coincident",28.85443497,29.27177811,29.215108870000002,29.108440399999999,29.078834530000002,29.088033679999999,28.991985320000001]
[null,null,null,null,"Coincident",24.237839475183989,24.588409363102659,24.540806977412949,24.45120504080904,24.426335992937219,24.434063315313828,24.353382313105499]
[null,null,"WEATHER CORRECTED MD 50% POE","MVA","Non-coincident",28.858032313587731,29.277125033420258,29.220199503845659,29.113064430796602,29.083332742498229,29.092570818122041,28.996123765503139]
[null,null,null,null,"Coincident",24.240861258022829,24.592900799919249,24.54508312997342,24.45508924496319,24.430114509223209,24.43787452927775,24.356858623692979]
[null,"Tarong (66)","CONNECTION POINT RATING","MVA","Non-coincident",257.20999999999998,257.20999999999998,257.20999999999998,257.20999999999998,257.20999999999998,257.20999999999998,257.20999999999998]
[null,null,null,null,"Coincident",257.20999999999998,257.20999999999998,257.20999999999998,257.20999999999998,257.20999999999998,257.20999999999998,257.20999999999998]
[null,null,"WINTER/SUMMER PEAKING",null,"Non-coincident","Summer","Summer","Summer","Summer","Summer","Summer","Summer"]
[null,null,null,null,"Coincident","Summer","Summer","Summer","Summer","Summer","Summer","Summer"]
[null,null,"ADJUSTMENTS - EMBEDDED GENERATION","MW","Non-coincident",0,0,0,0,0,0,0]
[null,null,null,null,"Coincident",0,0,0,0,0,0,0]
[null,null,"WEATHER CORRECTED MD 10% POE","MW","Non-coincident",62.915637969999999,63.731452939999997,64.655342099999999,65.54455566,66.383666989999995,67.084304810000006,67.670097350000006]
[null,null,null,null,"Coincident",52.694134996858118,53.377409704843053,54.151200477534367,54.895949174098803,55.598735430855768,56.18554508680473,56.676167643912571]
[null,null,"WEATHER CORRECTED MD 10% POE","MVA","Non-coincident",64.769760874460061,65.638716936920162,66.623038104824545,67.570657041241844,68.465091601715429,69.212071983037688,69.836711989485622]
[null,null,null,null,"Coincident",54.247030362474092,54.974812668098068,55.799217445278437,56.592882768754343,57.342004243099467,57.967627479601788,58.490786202714482]
[null,null,"WEATHER CORRECTED MD 50% POE","MW","Non-coincident",56.281246189999997,56.807247160000003,57.602489470000002,58.384456630000003,59.125343319999999,59.701446529999998,60.21805191]
[null,null,null,null,"Coincident",47.137590593000013,47.578135535656003,48.244179892677927,48.899105828767112,49.519625377163813,50.002132768002618,50.434808562322679]
[null,null,"WEATHER CORRECTED MD 50% POE","MVA","Non-coincident",57.71213864985355,58.271041758310531,59.116261450883989,59.947636362828177,60.735567459238169,61.348401958527639,61.898053625852008]
[null,null,null,null,"Coincident",48.336015068667933,48.804116748909003,49.512018981478043,50.208325706745264,50.868246656481922,51.381517837991503,51.841871099815677]
[null,"Teebar Creek","CONNECTION POINT RATING","MVA","Non-coincident",905.3,905.3,905.3,905.3,905.3,905.3,905.3]
[null,null,null,null,"Coincident",905.3,905.3,905.3,905.3,905.3,905.3,905.3]
[null,null,"WINTER/SUMMER PEAKING",null,"Non-coincident","Summer","Summer","Summer","Summer","Summer","Summer","Summer"]
[null,null,null,null,"Coincident","Summer","Summer","Summer","Summer","Summer","Summer","Summer"]
[null,null,"ADJUSTMENTS - EMBEDDED GENERATION","MW","Non-coincident",0,0,0,0,0,0,0]
[null,null,null,null,"Coincident",0,0,0,0,0,0,0]
[null,null,"WEATHER CORRECTED MD 10% POE","MW","Non-coincident",162.0217743,164.59341430000001,167.18309020000001,169.5921783,172.01858519999999,174.26246639999999,176.34143069999999]
[null,null,null,null,"Coincident",108.5307552645707,110.2533757745263,111.9880776843884,113.6018123328423,115.22714802968861,116.73021835719319,118.12281862108919]
[null,null,"WEATHER CORRECTED MD 10% POE","MVA","Non-coincident",170.56104188649951,173.4210391425155,176.30230091135661,178.9836781225741,181.68529631503571,184.18450963517,186.50071935162231]
[null,null,null,null,"Coincident",114.25080841528511,116.1665858692172,118.0966074187174,119.8927357177682,121.70242249679001,123.3765277852509,124.9280475792031]
[null,null,"WEATHER CORRECTED MD 50% POE","MW","Non-coincident",148.986908,151.24078370000001,153.58580019999999,155.8480988,158.0912323,160.0772705,161.9338989]
[null,null,null,null,"Coincident",99.799312281528984,101.3090774538356,102.8798935552667,104.3953008315589,105.89787031005061,107.228223756441,108.4718916731035]
[null,null,"WEATHER CORRECTED MD 50% POE","MVA","Non-coincident",156.08533433301389,158.58563705271339,161.1883181961656,163.70036531981151,166.1922194849646,168.3993327381547,170.46333546302611]
[null,null,null,null,"Coincident",104.5542137411652,106.2290487670833,107.97246227697801,109.6551643259302,111.3243400630905,112.8027812748232,114.1853594842413]
[null,"Tennyson (110)","CONNECTION POINT RATING","MVA","Non-coincident",152.41999999999999,152.41999999999999,152.41999999999999,152.41999999999999,152.41999999999999,152.41999999999999,152.41999999999999]
[null,null,null,null,"Coincident",152.41999999999999,152.41999999999999,152.41999999999999,152.41999999999999,152.41999999999999,152.41999999999999,152.41999999999999]
[null,null,"WINTER/SUMMER PEAKING",null,"Non-coincident","Winter","Winter","Winter","Winter","Winter","Winter","Winter"]
[null,null,null,null,"Coincident","Winter","Winter","Winter","Winter","Winter","Winter","Winter"]
[null,null,"ADJUSTMENTS - EMBEDDED GENERATION","MW","Non-coincident",0,0,0,0,0,0,0]
[null,null,null,null,"Coincident",0,0,0,0,0,0,0]
[null,null,"WEATHER CORRECTED MD 10% POE","MW","Non-coincident"]
[null,null,null,null,"Coincident"]
[null,null,"WEATHER CORRECTED MD 10% POE","MVA","Non-coincident"]
[null,null,null,null,"Coincident"]
[null,null,"WEATHER CORRECTED MD 50% POE","MW","Non-coincident"]
[null,null,null,null,"Coincident"]
[null,null,"WEATHER CORRECTED MD 50% POE","MVA","Non-coincident"]
[null,null,null,null,"Coincident"]
[null,"Tennyson (33)","CONNECTION POINT RATING","MVA","Non-coincident",264.10000000000002,264.10000000000002,264.10000000000002,264.10000000000002,264.10000000000002,264.10000000000002,264.10000000000002]
[null,null,null,null,"Coincident",264.10000000000002,264.10000000000002,264.10000000000002,264.10000000000002,264.10000000000002,264.10000000000002,264.10000000000002]
[null,null,"WINTER/SUMMER PEAKING",null,"Non-coincident","Summer","Summer","Summer","Summer","Summer","Summer","Summer"]
[null,null,null,null,"Coincident","Summer","Summer","Summer","Summer","Summer","Summer","Summer"]
[null,null,"ADJUSTMENTS - EMBEDDED GENERATION","MW","Non-coincident",0,0,0,0,0,0,0]
[null,null,null,null,"Coincident",0,0,0,0,0,0,0]
[null,null,"WEATHER CORRECTED MD 10% POE","MW","Non-coincident",209.6363068,215.7770233,219.80752559999999,222.69894410000001,226.2981873,230.0103302,233.42597960000001]
[null,null,null,null,"Coincident",209.6363068,215.7770233,219.80752559999999,222.69894410000001,226.2981873,230.0103302,233.42597960000001]
[null,null,"WEATHER CORRECTED MD 10% POE","MVA","Non-coincident",209.82150864754911,215.9726463251414,220.01002217296701,222.90638698971051,226.51180448297069,230.23033437087591,233.6518768853127]
[null,null,null,null,"Coincident",209.82150864754911,215.9726463251414,220.01002217296701,222.90638698971051,226.51180448297069,230.23033437087591,233.6518768853127]
[null,null,"WEATHER CORRECTED MD 50% POE","MW","Non-coincident",193.58944700000001,199.09706120000001,202.7545776,204.77085880000001,208.2974548,211.76951600000001,215.09164430000001]
[null,null,null,null,"Coincident",193.58944700000001,199.09706120000001,202.7545776,204.77085880000001,208.2974548,211.76951600000001,215.09164430000001]
[null,null,"WEATHER CORRECTED MD 50% POE","MVA","Non-coincident",193.74774611309431,199.26453560338749,202.92817990072669,204.9478505007622,208.48039310342381,211.95833080986239,215.28610113773999]
[null,null,null,null,"Coincident",193.74774611309431,199.26453560338749,202.92817990072669,204.9478505007622,208.48039310342381,211.95833080986239,215.28610113773999]
[null,"Terranora Interconnector","CONNECTION POINT RATING","MVA","Non-coincident",267.33999999999997,267.33999999999997,267.33999999999997,267.33999999999997,267.33999999999997,267.33999999999997,267.33999999999997]
[null,null,null,null,"Coincident",267.33999999999997,267.33999999999997,267.33999999999997,267.33999999999997,267.33999999999997,267.33999999999997,267.33999999999997]
[null,null,"WINTER/SUMMER PEAKING",null,"Non-coincident","Summer","Summer","Summer","Summer","Summer","Summer","Summer"]
[null,null,null,null,"Coincident","Summer","Summer","Summer","Summer","Summer","Summer","Summer"]
[null,null,"ADJUSTMENTS - EMBEDDED GENERATION","MW","Non-coincident",0,0,0,0,0,0,0]
[null,null,null,null,"Coincident",0,0,0,0,0,0,0]
[null,null,"WEATHER CORRECTED MD 10% POE","MW","Non-coincident",205.48526699999999,205.48526699999999,205.48526699999999,205.48526699999999,205.48526699999999,205.48526699999999,205.48526699999999]
[null,null,null,null,"Coincident",92.049948999999998,92.049948999999998,92.049948999999998,92.049948999999998,92.049948999999998,92.049948999999998,92.049948999999998]
[null,null,"WEATHER CORRECTED MD 10% POE","MVA","Non-coincident",205.506,205.506,205.506,205.506,205.506,205.506,205.506]
[null,null,null,null,"Coincident",92.090942479999995,92.090942479999995,92.090942479999995,92.090942479999995,92.090942479999995,92.090942479999995,92.090942479999995]
[null,null,"WEATHER CORRECTED MD 50% POE","MW","Non-coincident",205.48526699999999,205.48526699999999,205.48526699999999,205.48526699999999,205.48526699999999,205.48526699999999,205.48526699999999]
[null,null,null,null,"Coincident",92.049948999999998,92.049948999999998,92.049948999999998,92.049948999999998,92.049948999999998,92.049948999999998,92.049948999999998]
[null,null,"WEATHER CORRECTED MD 50% POE","MVA","Non-coincident",205.506,205.506,205.506,205.506,205.506,205.506,205.506]
[null,null,null,null,"Coincident",92.090942479999995,92.090942479999995,92.090942479999995,92.090942479999995,92.090942479999995,92.090942479999995,92.090942479999995]
[null,"Townsville East","CONNECTION POINT RATING","MVA","Non-coincident",112.5,112.5,112.5,112.5,112.5,112.5,112.5]
[null,null,null,null,"Coincident",112.5,112.5,112.5,112.5,112.5,112.5,112.5]
[null,null,"WINTER/SUMMER PEAKING",null,"Non-coincident","Summer","Summer","Summer","Summer","Summer","Summer","Summer"]
[null,null,null,null,"Coincident","Summer","Summer","Summer","Summer","Summer","Summer","Summer"]
[null,null,"ADJUSTMENTS - EMBEDDED GENERATION","MW","Non-coincident",0,0,0,0,0,0,0]
[null,null,null,null,"Coincident",0,0,0,0,0,0,0]
[null,null,"WEATHER CORRECTED MD 10% POE","MW","Non-coincident",39.045944210000002,39.634719850000003,40.775421139999999,41.075683589999997,41.356899259999999,41.601844790000001,41.826045989999997]
[null,null,null,null,"Coincident",23.727357385344511,24.085143329895629,24.778322294455581,24.960785149553459,25.131673697377089,25.280521682688811,25.416763797106949]
[null,null,"WEATHER CORRECTED MD 10% POE","MVA","Non-coincident",40.713620640595231,41.314039331622631,42.477436464406793,42.783701753650817,43.070550242198181,43.320410080616,43.549116016262879]
[null,null,null,null,"Coincident",24.740767496751541,25.105628666101861,25.812599392746119,25.99871004059051,26.173021527760689,26.32485582969225,26.463835372408841]
[null,null,"WEATHER CORRECTED MD 50% POE","MW","Non-coincident",34.822280880000001,35.342388149999998,36.405872340000002,36.625438690000003,36.905601500000003,37.109436039999999,37.308120729999999]
[null,null,null,null,"Coincident",21.160730522198559,21.47678821586409,22.123044055243469,22.256469673746281,22.426718421815998,22.550584167053081,22.671320462256279]
[null,null,"WEATHER CORRECTED MD 50% POE","MVA","Non-coincident",36.408099228132343,36.938110207032508,38.022009883721942,38.24581742348272,38.531404542762559,38.739194268610191,38.941741113082053]
[null,null,null,null,"Coincident",22.124397285947509,22.446473244640799,23.105135124101331,23.241138019891942,23.414683000834369,23.54095222510189,23.664035466224451]
[null,"Townsville South (Ergon)","CONNECTION POINT RATING","MVA","Non-coincident",202,202,202,202,202,202,202]
[null,null,null,null,"Coincident",202,202,202,202,202,202,202]
[null,null,"WINTER/SUMMER PEAKING",null,"Non-coincident","Summer","Summer","Summer","Summer","Summer","Summer","Summer"]
[null,null,null,null,"Coincident","Summer","Summer","Summer","Summer","Summer","Summer","Summer"]
[null,null,"ADJUSTMENTS - EMBEDDED GENERATION","MW","Non-coincident",0,0,0,0,0,0,0]
[null,null,null,null,"Coincident",0,0,0,0,0,0,0]
[null,null,"WEATHER CORRECTED MD 10% POE","MW","Non-coincident",93.091674800000007,95.05310059,96.904922490000004,98.613365169999994,100.4623871,101.9031372,103.6422043]
[null,null,null,null,"Coincident",93.523048658830987,95.493563422830647,97.353966407665439,99.070325773159013,100.9279158133227,102.37534214867441,104.1224678434661]
[null,null,"WEATHER CORRECTED MD 10% POE","MVA","Non-coincident",94.834018823094794,96.889266426590723,98.830439787172793,100.6219425865642,102.5615011137774,104.0732348931616,105.8984696731269]
[null,null,null,null,"Coincident",95.273466461522801,97.338237796238289,99.288406283882068,101.0882106577949,103.0367568291569,104.5554957723792,106.389188436167]
[null,null,"WEATHER CORRECTED MD 50% POE","MW","Non-coincident",83.333007809999998,85.163314819999997,86.745475769999999,88.381423949999999,89.943412780000003,91.492156980000004,92.825622559999999]
[null,null,null,null,"Coincident",83.719161364807377,85.557949762637648,87.147442226178029,88.790971162252845,90.360198030997935,91.916118895971806,93.255763569796244]
[null,null,"WEATHER CORRECTED MD 50% POE","MVA","Non-coincident",84.623177436654672,86.536216508689407,88.1907240584097,89.902240476454153,91.537065014047357,93.158651439380705,94.555308059779307]
[null,null,null,null,"Coincident",85.015309457867261,86.937213286588033,88.599387593918195,90.318834940730341,91.96123502759589,93.590335658632668,94.99346419133812]
[null,"Townsville South (Townsville Zinc)","CONNECTION POINT RATING","MVA","Non-coincident"]
[null,null,null,null,"Coincident"]
[null,null,"WINTER/SUMMER PEAKING",null,"Non-coincident","Shoulder","Shoulder","Shoulder","Shoulder","Shoulder","Shoulder","Shoulder"]
[null,null,null,null,"Coincident","Shoulder","Shoulder","Shoulder","Shoulder","Shoulder","Shoulder","Shoulder"]
[null,null,"ADJUSTMENTS - EMBEDDED GENERATION","MW","Non-coincident",0,0,0,0,0,0,0]
[null,null,null,null,"Coincident",0,0,0,0,0,0,0]
[null,null,"WEATHER CORRECTED MD 10% POE","MW","Non-coincident"]
[null,null,null,null,"Coincident"]
[null,null,"WEATHER CORRECTED MD 10% POE","MVA","Non-coincident"]
[null,null,null,null,"Coincident"]
[null,null,"WEATHER CORRECTED MD 50% POE","MW","Non-coincident"]
[null,null,null,null,"Coincident"]
[null,null,"WEATHER CORRECTED MD 50% POE","MVA","Non-coincident"]
[null,null,null,null,"Coincident"]
[null,"Townsville Switchyard (QLD Nickel)","CONNECTION POINT RATING","MVA","Non-coincident",91.45,91.45,91.45,91.45,91.45,91.45,91.45]
[null,null,null,null,"Coincident",91.45,91.45,91.45,91.45,91.45,91.45,91.45]
[null,null,"WINTER/SUMMER PEAKING",null,"Non-coincident","Shoulder","Shoulder","Shoulder","Shoulder","Shoulder","Shoulder","Shoulder"]
[null,null,null,null,"Coincident","Shoulder","Shoulder","Shoulder","Shoulder","Shoulder","Shoulder","Shoulder"]
[null,null,"ADJUSTMENTS - EMBEDDED GENERATION","MW","Non-coincident",0,0,0,0,0,0,0]
[null,null,null,null,"Coincident",0,0,0,0,0,0,0]
[null,null,"WEATHER CORRECTED MD 10% POE","MW","Non-coincident"]
[null,null,null,null,"Coincident"]
[null,null,"WEATHER CORRECTED MD 10% POE","MVA","Non-coincident"]
[null,null,null,null,"Coincident"]
[null,null,"WEATHER CORRECTED MD 50% POE","MW","Non-coincident"]
[null,null,null,null,"Coincident"]
[null,null,"WEATHER CORRECTED MD 50% POE","MVA","Non-coincident"]
[null,null,null,null,"Coincident"]
[null,"Tully","CONNECTION POINT RATING","MVA","Non-coincident",50,50,50,50,50,50,50]
[null,null,null,null,"Coincident",50,50,50,50,50,50,50]
[null,null,"WINTER/SUMMER PEAKING",null,"Non-coincident","Summer","Summer","Summer","Summer","Summer","Summer","Summer"]
[null,null,null,null,"Coincident","Summer","Summer","Summer","Summer","Summer","Summer","Summer"]
[null,null,"ADJUSTMENTS - EMBEDDED GENERATION","MW","Non-coincident",0,0,0,0,0,0,0]
[null,null,null,null,"Coincident",0,0,0,0,0,0,0]
[null,null,"WEATHER CORRECTED MD 10% POE","MW","Non-coincident",16.532562259999999,16.71643448,16.940864560000001,17.141601560000002,17.33317375,17.484432219999999,17.613311769999999]
[null,null,null,null,"Coincident",15.15338850170262,15.32192179621026,15.52762954678299,15.711620733377581,15.8872116536196,16.0258518912329,16.1439800954617]
[null,null,"WEATHER CORRECTED MD 10% POE","MVA","Non-coincident",16.53864051876981,16.723295702627301,16.948733492866861,17.1504185551508,17.342935205063359,17.494965919001299,17.624521430264171]
[null,null,null,null,"Coincident",15.158959702046779,15.3282106442686,15.534842040221699,15.71970220017241,15.896158791914971,16.035506851596359,16.154254627278601]
[null,null,"WEATHER CORRECTED MD 50% POE","MW","Non-coincident",15.216938020000001,15.40120316,15.595083239999999,15.77497578,15.94188881,16.0616436,16.163299559999999]
[null,null,null,null,"Coincident",13.94751581739329,14.11640925386299,14.29411553609423,14.459001142106651,14.6119900103661,14.721754657204929,14.81493030845413]
[null,null,"WEATHER CORRECTED MD 50% POE","MVA","Non-coincident",15.2186617972269,15.40339367502205,15.59781822366012,15.77826316933367,15.94572801739865,16.06590132334027,16.167927015993111]
[null,null,null,null,"Coincident",13.94909579426553,14.11841703248956,14.29662236288223,14.462014291970901,14.61550894471732,14.725657194203929,14.819171734394979]
[null,"Turkinje (132)","CONNECTION POINT RATING","MVA","Non-coincident",219.48,219.48,219.48,219.48,219.48,219.48,219.48]
[null,null,null,null,"Coincident",219.48,219.48,219.48,219.48,219.48,219.48,219.48]
[null,null,"WINTER/SUMMER PEAKING",null,"Non-coincident","Summer","Summer","Summer","Summer","Summer","Summer","Summer"]
[null,null,null,null,"Coincident","Summer","Summer","Summer","Summer","Summer","Summer","Summer"]
[null,null,"ADJUSTMENTS - EMBEDDED GENERATION","MW","Non-coincident",0,0,0,0,0,0,0]
[null,null,null,null,"Coincident",0,0,0,0,0,0,0]
[null,null,"WEATHER CORRECTED MD 10% POE","MW","Non-coincident",34.357521060000003,34.80056381,35.292503359999998,35.780868529999999,36.259368899999998,36.661659239999999,37.041542049999997]
[null,null,null,null,"Coincident",27.913563499580409,28.273510944960901,28.67318430448238,29.069953680246481,29.45870845796291,29.785546850384979,30.09418037842142]
[null,null,"WEATHER CORRECTED MD 10% POE","MVA","Non-coincident",36.240967815244282,36.641197079867688,37.086868031999103,37.530576720774476,37.966512951219727,38.333900468500502,38.681541627062558]
[null,null,null,null,"Coincident",29.443758606170839,29.768922490170102,30.131005202729991,30.491493686105091,30.845667481969191,31.144149283804111,31.4265882740224]
[null,null,"WEATHER CORRECTED MD 50% POE","MW","Non-coincident",32.224468229999999,32.644222259999999,33.10552216,33.553318019999999,34.005588529999997,34.392459870000003,34.742355349999997]
[null,null,null,null,"Coincident",26.180577423134849,26.521604086558799,26.896384444795739,27.260193526106669,27.627638010178309,27.941949327819628,28.22621982807312]
[null,null,"WEATHER CORRECTED MD 50% POE","MVA","Non-coincident",34.330432656498473,34.704133861849691,35.116143023311388,35.517369899023308,35.923841591447562,36.272490043123277,36.588550901599866]
[null,null,null,null,"Coincident",27.8915556873776,28.195167007508189,28.52990139858332,28.85587578577395,29.186111293086949,29.46936865260032,29.726150415970611]
[null,"Turkinje (66)","CONNECTION POINT RATING","MVA","Non-coincident",190,190,190,190,190,190,190]
[null,null,null,null,"Coincident",190,190,190,190,190,190,190]
[null,null,"WINTER/SUMMER PEAKING",null,"Non-coincident","Summer","Summer","Summer","Summer","Summer","Summer","Summer"]
[null,null,null,null,"Coincident","Summer","Summer","Summer","Summer","Summer","Summer","Summer"]
[null,null,"ADJUSTMENTS - EMBEDDED GENERATION","MW","Non-coincident",0,0,0,0,0,0,0]
[null,null,null,null,"Coincident",0,0,0,0,0,0,0]
[null,null,"WEATHER CORRECTED MD 10% POE","MW","Non-coincident",72.565879820000006,73.495674129999998,74.46860504,75.396133419999998,76.307884220000005,77.057685849999999,77.714355470000001]
[null,null,null,null,"Coincident",60.277688757932722,61.050033173325993,61.858209505252567,62.628671699640243,63.386028064415541,64.008859474927476,64.554329702386099]
[null,null,"WEATHER CORRECTED MD 10% POE","MVA","Non-coincident",72.628051876987882,73.566450525508415,74.548860246294851,75.485860529440956,76.407320777236521,77.165393530699518,77.829512631297689]
[null,null,null,null,"Coincident",60.329332697341307,61.108824406209088,61.92487442212871,62.703204562597968,63.468626192669902,64.098328107708454,64.649986332529181]
[null,null,"WEATHER CORRECTED MD 50% POE","MW","Non-coincident",63.32487106,64.118026729999997,64.964859009999998,65.75313568,66.526733399999998,67.142959590000004,67.733154299999995]
[null,null,null,null,"Coincident",52.601537773112902,53.2603817192132,53.963812763260727,54.618603911487178,55.261201819838512,55.773077243625067,56.263329316971429]
[null,null,"WEATHER CORRECTED MD 50% POE","MVA","Non-coincident",63.329934147465067,64.125668191528376,64.975791492805072,65.767612565246253,66.545123152472215,67.164764104381248,67.758469780554805]
[null,null,null,null,"Coincident",52.605743485372301,53.266729187759097,53.972893956757048,54.630629303933631,55.276477480777302,55.791189416104068,56.284357914177519]
[null,"Wandoan South (APLNG 275)","CONNECTION POINT RATING","MVA","Non-coincident"]
[null,null,null,null,"Coincident"]
[null,null,"WINTER/SUMMER PEAKING",null,"Non-coincident","Shoulder","Summer","Shoulder","Summer","Summer","Shoulder","Summer"]
[null,null,null,null,"Coincident","Shoulder","Summer","Shoulder","Summer","Summer","Shoulder","Summer"]
[null,null,"ADJUSTMENTS - EMBEDDED GENERATION","MW","Non-coincident",0,0,0,0,0,0,0]
[null,null,null,null,"Coincident",0,0,0,0,0,0,0]
[null,null,"WEATHER CORRECTED MD 10% POE","MW","Non-coincident"]
[null,null,null,null,"Coincident"]
[null,null,"WEATHER CORRECTED MD 10% POE","MVA","Non-coincident"]
[null,null,null,null,"Coincident"]
[null,null,"WEATHER CORRECTED MD 50% POE","MW","Non-coincident"]
[null,null,null,null,"Coincident"]
[null,null,"WEATHER CORRECTED MD 50% POE","MVA","Non-coincident"]
[null,null,null,null,"Coincident"]
[null,"Wandoan South (QGC 132)","CONNECTION POINT RATING","MVA","Non-coincident"]
[null,null,null,null,"Coincident"]
[null,null,"WINTER/SUMMER PEAKING",null,"Non-coincident","Summer","Shoulder","Shoulder","Shoulder","Shoulder","Shoulder","Shoulder"]
[null,null,null,null,"Coincident","Summer","Shoulder","Shoulder","Shoulder","Shoulder","Shoulder","Shoulder"]
[null,null,"ADJUSTMENTS - EMBEDDED GENERATION","MW","Non-coincident",0,0,0,0,0,0,0]
[null,null,null,null,"Coincident",0,0,0,0,0,0,0]
[null,null,"WEATHER CORRECTED MD 10% POE","MW","Non-coincident"]
[null,null,null,null,"Coincident"]
[null,null,"WEATHER CORRECTED MD 10% POE","MVA","Non-coincident"]
[null,null,null,null,"Coincident"]
[null,null,"WEATHER CORRECTED MD 50% POE","MW","Non-coincident"]
[null,null,null,null,"Coincident"]
[null,null,"WEATHER CORRECTED MD 50% POE","MVA","Non-coincident"]
[null,null,null,null,"Coincident"]
[null,"Wandoo (Rail)","CONNECTION POINT RATING","MVA","Non-coincident",63.67,63.67,63.67,63.67,63.67,63.67,63.67]
[null,null,null,null,"Coincident",63.67,63.67,63.67,63.67,63.67,63.67,63.67]
[null,null,"WINTER/SUMMER PEAKING",null,"Non-coincident","Shoulder","Shoulder","Shoulder","Shoulder","Shoulder","Shoulder","Shoulder"]
[null,null,null,null,"Coincident","Shoulder","Shoulder","Shoulder","Shoulder","Shoulder","Shoulder","Shoulder"]
[null,null,"ADJUSTMENTS - EMBEDDED GENERATION","MW","Non-coincident",0,0,0,0,0,0,0]
[null,null,null,null,"Coincident",0,0,0,0,0,0,0]
[null,null,"WEATHER CORRECTED MD 10% POE","MW","Non-coincident"]
[null,null,null,null,"Coincident"]
[null,null,"WEATHER CORRECTED MD 10% POE","MVA","Non-coincident"]
[null,null,null,null,"Coincident"]
[null,null,"WEATHER CORRECTED MD 50% POE","MW","Non-coincident"]
[null,null,null,null,"Coincident"]
[null,null,"WEATHER CORRECTED MD 50% POE","MVA","Non-coincident"]
[null,null,null,null,"Coincident"]
[null,"Woolooga (Energex)","CONNECTION POINT RATING","MVA","Non-coincident",731.62,731.62,731.62,731.62,731.62,731.62,731.62]
[null,null,null,null,"Coincident",731.62,731.62,731.62,731.62,731.62,731.62,731.62]
[null,null,"WINTER/SUMMER PEAKING",null,"Non-coincident","Shoulder","Shoulder","Shoulder","Shoulder","Shoulder","Shoulder","Shoulder"]
[null,null,null,null,"Coincident","Shoulder","Shoulder","Shoulder","Shoulder","Shoulder","Shoulder","Shoulder"]
[null,null,"ADJUSTMENTS - EMBEDDED GENERATION","MW","Non-coincident",0,0,0,0,0,0,0]
[null,null,null,null,"Coincident",0,0,0,0,0,0,0]
[null,null,"WEATHER CORRECTED MD 10% POE","MW","Non-coincident",294.0938721,298.61410519999998,302.19415279999998,305.76083369999998,308.96069340000003,312.18792719999999,315.69775390000001]
[null,null,null,null,"Coincident",289.75610780402712,294.20966931508627,297.73691267762882,301.25098649352782,304.40364957205571,307.58328299380759,311.0413411858969]
[null,null,"WEATHER CORRECTED MD 10% POE","MVA","Non-coincident",299.109902980485,303.72742317891971,307.38454938325089,311.02804358974208,314.29683567553087,317.59360985607208,321.17908455088059]
[null,null,null,null,"Coincident",294.69815428114629,299.24756794573972,302.85075303473332,306.44050719227812,309.66108593210538,312.90923404223543,316.4418244521583]
[null,null,"WEATHER CORRECTED MD 50% POE","MW","Non-coincident",253.22996520000001,258.1895447,262.07797240000002,265.31729130000002,268.2844849,271.31466669999998,274.34130859999999]
[null,null,null,null,"Coincident",249.49492681286381,254.38135454426521,258.21242952649487,261.40396979796589,264.32739850628218,267.31288636441758,270.29488653462988]
[null,null,"WEATHER CORRECTED MD 50% POE","MVA","Non-coincident",257.36855171694839,262.43439724107049,266.40618877460389,269.71498752314272,272.74584846347199,275.84107187407909,278.93270258642139]
[null,null,null,null,"Coincident",253.57247087183509,258.56359724697751,262.47680648030109,265.73680180097011,268.72295878239288,271.77252891398842,274.8185593381487]
[null,"Woolooga (Ergon)","CONNECTION POINT RATING","MVA","Non-coincident",228.64,228.64,228.64,228.64,228.64,228.64,228.64]
[null,null,null,null,"Coincident",228.64,228.64,228.64,228.64,228.64,228.64,228.64]
[null,null,"WINTER/SUMMER PEAKING",null,"Non-coincident","Summer","Summer","Summer","Summer","Summer","Summer","Summer"]
[null,null,null,null,"Coincident","Summer","Summer","Summer","Summer","Summer","Summer","Summer"]
[null,null,"ADJUSTMENTS - EMBEDDED GENERATION","MW","Non-coincident",0,0,0,0,0,0,0]
[null,null,null,null,"Coincident",0,0,0,0,0,0,0]
[null,null,"WEATHER CORRECTED MD 10% POE","MW","Non-coincident",22.37104416,22.623329160000001,22.907859800000001,23.179000850000001,23.43928528,23.651489260000002,23.82527924]
[null,null,null,null,"Coincident",14.24394543943297,14.404578700423651,14.58574319516161,14.758382357418331,14.924108963344169,15.05922209849926,15.169876521928741]
[null,null,"WEATHER CORRECTED MD 10% POE","MVA","Non-coincident",22.45073868803874,22.712581266931782,23.008405370118432,23.290797601484869,23.562315462972862,23.783981338812161,23.965717775148399]
[null,null,null,null,"Coincident",14.29468801993508,14.46140672026922,14.64976191528484,14.829564856414221,15.002443939625801,15.143581591433961,15.25929563075265]
[null,null,"WEATHER CORRECTED MD 50% POE","MW","Non-coincident",19.065412519999999,19.32180786,19.560897829999998,19.793563840000001,20.015243529999999,20.196212769999999,20.344970700000001]
[null,null,null,null,"Coincident",12.139205205304201,12.302455575191489,12.45468738267614,12.60282896821627,12.743975415686799,12.8592009707543,12.95391715044839]
[null,null,"WEATHER CORRECTED MD 50% POE","MVA","Non-coincident",19.067728898653868,19.32638835507019,19.568238704700331,19.80416994833832,20.029473355748749,20.213759914955819,20.365479722242629]
[null,null,null,null,"Coincident",12.14068007482423,12.305372038160259,12.459361416572881,12.60958202039458,12.75303573759793,12.8703734745311,12.966975521427891]
[null,"Woree","CONNECTION POINT RATING","MVA","Non-coincident",377.41,377.41,377.41,377.41,377.41,377.41,377.41]
[null,null,null,null,"Coincident",377.41,377.41,377.41,377.41,377.41,377.41,377.41]
[null,null,"WINTER/SUMMER PEAKING",null,"Non-coincident","Summer","Summer","Summer","Summer","Summer","Summer","Summer"]
[null,null,null,null,"Coincident","Summer","Summer","Summer","Summer","Summer","Summer","Summer"]
[null,null,"ADJUSTMENTS - EMBEDDED GENERATION","MW","Non-coincident",0,0,0,0,0,0,0]
[null,null,null,null,"Coincident",0,0,0,0,0,0,0]
[null,null,"WEATHER CORRECTED MD 10% POE","MW","Non-coincident",103.2196045,104.9376755,106.6389923,108.25476070000001,109.87376399999999,111.42984010000001,112.9317932]
[null,null,null,null,"Coincident",91.310333899189857,92.830177318784763,94.335199604316784,95.764543892375556,97.196749844171165,98.57328900988314,99.90194977860294]
[null,null,"WEATHER CORRECTED MD 10% POE","MVA","Non-coincident",103.2253597275986,104.9459594471078,106.6501826782637,108.2690648127101,109.8915178739356,111.45120739461569,112.9569135390916]
[null,null,null,null,"Coincident",91.315425100190296,92.837505480717539,94.345098859217728,95.777197625297887,97.212455311799332,98.592190988972632,99.924171783436449]
[null,null,"WEATHER CORRECTED MD 50% POE","MW","Non-coincident",97.022003170000005,98.650077820000007,100.1070862,101.69376370000001,103.13853450000001,104.628479,106.0844116]
[null,null,null,null,"Coincident",85.82779935977139,87.26803002742821,88.556931707648431,89.960541545306086,91.238617592921628,92.556655289784345,93.844605311339748]
[null,null,"WEATHER CORRECTED MD 50% POE","MVA","Non-coincident",97.022366451957666,98.651255814874332,100.1093681759385,101.6976321515122,103.1441808391716,104.63627714781531,106.0946117782234]
[null,null,null,null,"Coincident",85.828120726986612,87.269072107620502,88.558950393787555,89.963963662654493,91.243612468823031,92.563553702971078,93.853628613491708]
[null,"Wotonga (Rail)","CONNECTION POINT RATING","MVA","Non-coincident"]
[null,null,null,null,"Coincident"]
[null,null,"WINTER/SUMMER PEAKING",null,"Non-coincident","Shoulder","Shoulder","Shoulder","Shoulder","Shoulder","Shoulder","Shoulder"]
[null,null,null,null,"Coincident","Shoulder","Shoulder","Shoulder","Shoulder","Shoulder","Shoulder","Shoulder"]
[null,null,"ADJUSTMENTS - EMBEDDED GENERATION","MW","Non-coincident",0,0,0,0,0,0,0]
[null,null,null,null,"Coincident",0,0,0,0,0,0,0]
[null,null,"WEATHER CORRECTED MD 10% POE","MW","Non-coincident"]
[null,null,null,null,"Coincident"]
[null,null,"WEATHER CORRECTED MD 10% POE","MVA","Non-coincident"]
[null,null,null,null,"Coincident"]
[null,null,"WEATHER CORRECTED MD 50% POE","MW","Non-coincident"]
[null,null,null,null,"Coincident"]
[null,null,"WEATHER CORRECTED MD 50% POE","MVA","Non-coincident"]
[null,null,null,null,"Coincident"]
[null,"Wycarbah (Rail)","CONNECTION POINT RATING","MVA","Non-coincident"]
[null,null,null,null,"Coincident"]
[null,null,"WINTER/SUMMER PEAKING",null,"Non-coincident","Shoulder","Shoulder","Shoulder","Shoulder","Shoulder","Shoulder","Shoulder"]
[null,null,null,null,"Coincident","Shoulder","Shoulder","Shoulder","Shoulder","Shoulder","Shoulder","Shoulder"]
[null,null,"ADJUSTMENTS - EMBEDDED GENERATION","MW","Non-coincident",0,0,0,0,0,0,0]
[null,null,null,null,"Coincident",0,0,0,0,0,0,0]
[null,null,"WEATHER CORRECTED MD 10% POE","MW","Non-coincident"]
[null,null,null,null,"Coincident"]
[null,null,"WEATHER CORRECTED MD 10% POE","MVA","Non-coincident"]
[null,null,null,null,"Coincident"]
[null,null,"WEATHER CORRECTED MD 50% POE","MW","Non-coincident"]
[null,null,null,null,"Coincident"]
[null,null,"WEATHER CORRECTED MD 50% POE","MVA","Non-coincident"]
[null,null,null,null,"Coincident"]
[null,"Yarwun (Ergon)","CONNECTION POINT RATING","MVA","Non-coincident",640.16999999999996,640.16999999999996,640.16999999999996,640.16999999999996,640.16999999999996,640.16999999999996,640.16999999999996]
[null,null,null,null,"Coincident",640.16999999999996,640.16999999999996,640.16999999999996,640.16999999999996,640.16999999999996,640.16999999999996,640.16999999999996]
[null,null,"WINTER/SUMMER PEAKING",null,"Non-coincident","Winter","Winter","Winter","Winter","Winter","Winter","Winter"]
[null,null,null,null,"Coincident","Winter","Winter","Winter","Winter","Winter","Winter","Winter"]
[null,null,"ADJUSTMENTS - EMBEDDED GENERATION","MW","Non-coincident",0,0,0,0,0,0,0]
[null,null,null,null,"Coincident",0,0,0,0,0,0,0]
[null,null,"WEATHER CORRECTED MD 10% POE","MW","Non-coincident",69.569007869999993,70.797698969999999,71.959434509999994,73.10517883,74.16893005,75.087318420000003,75.887672420000001]
[null,null,null,null,"Coincident",63.614954786711088,64.73848854357297,65.800797121974938,66.848483086537357,67.82119331824083,68.660981557615528,69.39283738080772]
[null,null,"WEATHER CORRECTED MD 10% POE","MVA","Non-coincident",77.359541259903963,78.789994923575335,80.142694292648144,81.476951232386895,82.715873049116084,83.785606242517673,84.717934968556321]
[null,null,null,null,"Coincident",70.738736547250141,72.046765049093722,73.283693845956535,74.503758606028214,75.636647485265541,76.614827724076051,77.467363236212861]
[null,null,"WEATHER CORRECTED MD 50% POE","MW","Non-coincident",53.41478729,54.22805786,55.149639129999997,56.046867370000001,56.890754700000002,57.667804719999999,58.319023129999998]
[null,null,null,null,"Coincident",48.843290747293217,49.586957677783147,50.429665553291187,51.250104649211863,52.021768008898469,52.7323143197167,53.32779829996602]
[null,null,"WEATHER CORRECTED MD 50% POE","MVA","Non-coincident",58.579688076262983,59.523552793199038,60.593381043876583,61.635190833523559,62.615280565114297,63.51792151058411,64.274520071100611]
[null,null,null,null,"Coincident",53.566154275977439,54.429238472964407,55.407505633588187,56.360152288957913,57.256361188164469,58.081749743970761,58.773594930391823]
[null,"Yarwun (Rio Tinto)","CONNECTION POINT RATING","MVA","Non-coincident"]
[null,null,null,null,"Coincident"]
[null,null,"WINTER/SUMMER PEAKING",null,"Non-coincident","Shoulder","Shoulder","Shoulder","Shoulder","Shoulder","Shoulder","Shoulder"]
[null,null,null,null,"Coincident","Shoulder","Shoulder","Shoulder","Shoulder","Shoulder","Shoulder","Shoulder"]
[null,null,"ADJUSTMENTS - EMBEDDED GENERATION","MW","Non-coincident",0,0,0,0,0,0,0]
[null,null,null,null,"Coincident",0,0,0,0,0,0,0]
[null,null,"WEATHER CORRECTED MD 10% POE","MW","Non-coincident"]
[null,null,null,null,"Coincident"]
[null,null,"WEATHER CORRECTED MD 10% POE","MVA","Non-coincident"]
[null,null,null,null,"Coincident"]
[null,null,"WEATHER CORRECTED MD 50% POE","MW","Non-coincident"]
[null,null,null,null,"Coincident"]
[null,null,"WEATHER CORRECTED MD 50% POE","MVA","Non-coincident"]
[null,null,null,null,"Coincident"]
[null,"NSP to enter name","CONNECTION POINT RATING","MVA","Non-coincident"]
[null,null,null,null,"Coincident"]
[null,null,"WINTER/SUMMER PEAKING",null,"Non-coincident"]
[null,null,null,null,"Coincident"]
[null,null,"ADJUSTMENTS - EMBEDDED GENERATION","MW","Non-coincident"]
[null,null,null,null,"Coincident"]
[null,null,"WEATHER CORRECTED MD 10% POE","MW","Non-coincident"]
[null,null,null,null,"Coincident"]
[null,null,"WEATHER CORRECTED MD 10% POE","MVA","Non-coincident"]
[null,null,null,null,"Coincident"]
[null,null,"WEATHER CORRECTED MD 50% POE","MW","Non-coincident"]
[null,null,null,null,"Coincident"]
[null,null,"WEATHER CORRECTED MD 50% POE","MVA","Non-coincident"]
[null,null,null,null,"Coincident"]
[null,"NSP to enter name","CONNECTION POINT RATING","MVA","Non-coincident"]
[null,null,null,null,"Coincident"]
[null,null,"WINTER/SUMMER PEAKING",null,"Non-coincident"]
[null,null,null,null,"Coincident"]
[null,null,"ADJUSTMENTS - EMBEDDED GENERATION","MW","Non-coincident"]
[null,null,null,null,"Coincident"]
[null,null,"WEATHER CORRECTED MD 10% POE","MW","Non-coincident"]
[null,null,null,null,"Coincident"]
[null,null,"WEATHER CORRECTED MD 10% POE","MVA","Non-coincident"]
[null,null,null,null,"Coincident"]
[null,null,"WEATHER CORRECTED MD 50% POE","MW","Non-coincident"]
[null,null,null,null,"Coincident"]
[null,null,"WEATHER CORRECTED MD 50% POE","MVA","Non-coincident"]
[null,null,null,null,"Coincident"]
[null,"NSP to enter name","CONNECTION POINT RATING","MVA","Non-coincident"]
[null,null,null,null,"Coincident"]
[null,null,"WINTER/SUMMER PEAKING",null,"Non-coincident"]
[null,null,null,null,"Coincident"]
[null,null,"ADJUSTMENTS - EMBEDDED GENERATION","MW","Non-coincident"]
[null,null,null,null,"Coincident"]
[null,null,"WEATHER CORRECTED MD 10% POE","MW","Non-coincident"]
[null,null,null,null,"Coincident"]
[null,null,"WEATHER CORRECTED MD 10% POE","MVA","Non-coincident"]
[null,null,null,null,"Coincident"]
[null,null,"WEATHER CORRECTED MD 50% POE","MW","Non-coincident"]
[null,null,null,null,"Coincident"]
[null,null,"WEATHER CORRECTED MD 50% POE","MVA","Non-coincident"]
[null,null,null,null,"Coincident"]
[null,"NSP to enter name","CONNECTION POINT RATING","MVA","Non-coincident"]
[null,null,null,null,"Coincident"]
[null,null,"WINTER/SUMMER PEAKING",null,"Non-coincident"]
[null,null,null,null,"Coincident"]
[null,null,"ADJUSTMENTS - EMBEDDED GENERATION","MW","Non-coincident"]
[null,null,null,null,"Coincident"]
[null,null,"WEATHER CORRECTED MD 10% POE","MW","Non-coincident"]
[null,null,null,null,"Coincident"]
[null,null,"WEATHER CORRECTED MD 10% POE","MVA","Non-coincident"]
[null,null,null,null,"Coincident"]
[null,null,"WEATHER CORRECTED MD 50% POE","MW","Non-coincident"]
[null,null,null,null,"Coincident"]
[null,null,"WEATHER CORRECTED MD 50% POE","MVA","Non-coincident"]
[null,null,null,null,"Coincident"]
[null,"NSP to enter name","CONNECTION POINT RATING","MVA","Non-coincident"]
[null,null,null,null,"Coincident"]
[null,null,"WINTER/SUMMER PEAKING",null,"Non-coincident"]
[null,null,null,null,"Coincident"]
[null,null,"ADJUSTMENTS - EMBEDDED GENERATION","MW","Non-coincident"]
[null,null,null,null,"Coincident"]
[null,null,"WEATHER CORRECTED MD 10% POE","MW","Non-coincident"]
[null,null,null,null,"Coincident"]
[null,null,"WEATHER CORRECTED MD 10% POE","MVA","Non-coincident"]
[null,null,null,null,"Coincident"]
[null,null,"WEATHER CORRECTED MD 50% POE","MW","Non-coincident"]
[null,null,null,null,"Coincident"]
[null,null,"WEATHER CORRECTED MD 50% POE","MVA","Non-coincident"]
[null,null,null,null,"Coincident"]
[null,"NSP to enter name","CONNECTION POINT RATING","MVA","Non-coincident"]
[null,null,null,null,"Coincident"]
[null,null,"WINTER/SUMMER PEAKING",null,"Non-coincident"]
[null,null,null,null,"Coincident"]
[null,null,"ADJUSTMENTS - EMBEDDED GENERATION","MW","Non-coincident"]
[null,null,null,null,"Coincident"]
[null,null,"WEATHER CORRECTED MD 10% POE","MW","Non-coincident"]
[null,null,null,null,"Coincident"]
[null,null,"WEATHER CORRECTED MD 10% POE","MVA","Non-coincident"]
[null,null,null,null,"Coincident"]
[null,null,"WEATHER CORRECTED MD 50% POE","MW","Non-coincident"]
[null,null,null,null,"Coincident"]
[null,null,"WEATHER CORRECTED MD 50% POE","MVA","Non-coincident"]
[null,null,null,null,"Coincident"]
[null,"NSP to enter name","CONNECTION POINT RATING","MVA","Non-coincident"]
[null,null,null,null,"Coincident"]
[null,null,"WINTER/SUMMER PEAKING",null,"Non-coincident"]
[null,null,null,null,"Coincident"]
[null,null,"ADJUSTMENTS - EMBEDDED GENERATION","MW","Non-coincident"]
[null,null,null,null,"Coincident"]
[null,null,"WEATHER CORRECTED MD 10% POE","MW","Non-coincident"]
[null,null,null,null,"Coincident"]
[null,null,"WEATHER CORRECTED MD 10% POE","MVA","Non-coincident"]
[null,null,null,null,"Coincident"]
[null,null,"WEATHER CORRECTED MD 50% POE","MW","Non-coincident"]
[null,null,null,null,"Coincident"]
[null,null,"WEATHER CORRECTED MD 50% POE","MVA","Non-coincident"]
[null,null,null,null,"Coincident"]
[null,"NSP to enter name","CONNECTION POINT RATING","MVA","Non-coincident"]
[null,null,null,null,"Coincident"]
[null,null,"WINTER/SUMMER PEAKING",null,"Non-coincident"]
[null,null,null,null,"Coincident"]
[null,null,"ADJUSTMENTS - EMBEDDED GENERATION","MW","Non-coincident"]
[null,null,null,null,"Coincident"]
[null,null,"WEATHER CORRECTED MD 10% POE","MW","Non-coincident"]
[null,null,null,null,"Coincident"]
[null,null,"WEATHER CORRECTED MD 10% POE","MVA","Non-coincident"]
[null,null,null,null,"Coincident"]
[null,null,"WEATHER CORRECTED MD 50% POE","MW","Non-coincident"]
[null,null,null,null,"Coincident"]
[null,null,"WEATHER CORRECTED MD 50% POE","MVA","Non-coincident"]
[null,null,null,null,"Coincident"]
[null,"NSP to enter name","CONNECTION POINT RATING","MVA","Non-coincident"]
[null,null,null,null,"Coincident"]
[null,null,"WINTER/SUMMER PEAKING",null,"Non-coincident"]
[null,null,null,null,"Coincident"]
[null,null,"ADJUSTMENTS - EMBEDDED GENERATION","MW","Non-coincident"]
[null,null,null,null,"Coincident"]
[null,null,"WEATHER CORRECTED MD 10% POE","MW","Non-coincident"]
[null,null,null,null,"Coincident"]
[null,null,"WEATHER CORRECTED MD 10% POE","MVA","Non-coincident"]
[null,null,null,null,"Coincident"]
[null,null,"WEATHER CORRECTED MD 50% POE","MW","Non-coincident"]
[null,null,null,null,"Coincident"]
[null,null,"WEATHER CORRECTED MD 50% POE","MVA","Non-coincident"]
[null,null,null,null,"Coincident"]
[null,"NSP to enter name","CONNECTION POINT RATING","MVA","Non-coincident"]
[null,null,null,null,"Coincident"]
[null,null,"WINTER/SUMMER PEAKING",null,"Non-coincident"]
[null,null,null,null,"Coincident"]
[null,null,"ADJUSTMENTS - EMBEDDED GENERATION","MW","Non-coincident"]
[null,null,null,null,"Coincident"]
[null,null,"WEATHER CORRECTED MD 10% POE","MW","Non-coincident"]
[null,null,null,null,"Coincident"]
[null,null,"WEATHER CORRECTED MD 10% POE","MVA","Non-coincident"]
[null,null,null,null,"Coincident"]
[null,null,"WEATHER CORRECTED MD 50% POE","MW","Non-coincident"]
[null,null,null,null,"Coincident"]
[null,null,"WEATHER CORRECTED MD 50% POE","MVA","Non-coincident"]
[null,null,null,null,"Coincident"]
[null,"NSP to enter name","CONNECTION POINT RATING","MVA","Non-coincident"]
[null,null,null,null,"Coincident"]
[null,null,"WINTER/SUMMER PEAKING",null,"Non-coincident"]
[null,null,null,null,"Coincident"]
[null,null,"ADJUSTMENTS - EMBEDDED GENERATION","MW","Non-coincident"]
[null,null,null,null,"Coincident"]
[null,null,"WEATHER CORRECTED MD 10% POE","MW","Non-coincident"]
[null,null,null,null,"Coincident"]
[null,null,"WEATHER CORRECTED MD 10% POE","MVA","Non-coincident"]
[null,null,null,null,"Coincident"]
[null,null,"WEATHER CORRECTED MD 50% POE","MW","Non-coincident"]
[null,null,null,null,"Coincident"]
[null,null,"WEATHER CORRECTED MD 50% POE","MVA","Non-coincident"]
[null,null,null,null,"Coincident"]
[null,"NSP to enter name","CONNECTION POINT RATING","MVA","Non-coincident"]
[null,null,null,null,"Coincident"]
[null,null,"WINTER/SUMMER PEAKING",null,"Non-coincident"]
[null,null,null,null,"Coincident"]
[null,null,"ADJUSTMENTS - EMBEDDED GENERATION","MW","Non-coincident"]
[null,null,null,null,"Coincident"]
[null,null,"WEATHER CORRECTED MD 10% POE","MW","Non-coincident"]
[null,null,null,null,"Coincident"]
[null,null,"WEATHER CORRECTED MD 10% POE","MVA","Non-coincident"]
[null,null,null,null,"Coincident"]
[null,null,"WEATHER CORRECTED MD 50% POE","MW","Non-coincident"]
[null,null,null,null,"Coincident"]
[null,null,"WEATHER CORRECTED MD 50% POE","MVA","Non-coincident"]
[null,null,null,null,"Coincident"]
[null,"NSP to enter name","CONNECTION POINT RATING","MVA","Non-coincident"]
[null,null,null,null,"Coincident"]
[null,null,"WINTER/SUMMER PEAKING",null,"Non-coincident"]
[null,null,null,null,"Coincident"]
[null,null,"ADJUSTMENTS - EMBEDDED GENERATION","MW","Non-coincident"]
[null,null,null,null,"Coincident"]
[null,null,"WEATHER CORRECTED MD 10% POE","MW","Non-coincident"]
[null,null,null,null,"Coincident"]
[null,null,"WEATHER CORRECTED MD 10% POE","MVA","Non-coincident"]
[null,null,null,null,"Coincident"]
[null,null,"WEATHER CORRECTED MD 50% POE","MW","Non-coincident"]
[null,null,null,null,"Coincident"]
[null,null,"WEATHER CORRECTED MD 50% POE","MVA","Non-coincident"]
[null,null,null,null,"Coincident"]
[null,"NSP to enter name","CONNECTION POINT RATING","MVA","Non-coincident"]
[null,null,null,null,"Coincident"]
[null,null,"WINTER/SUMMER PEAKING",null,"Non-coincident"]
[null,null,null,null,"Coincident"]
[null,null,"ADJUSTMENTS - EMBEDDED GENERATION","MW","Non-coincident"]
[null,null,null,null,"Coincident"]
[null,null,"WEATHER CORRECTED MD 10% POE","MW","Non-coincident"]
[null,null,null,null,"Coincident"]
[null,null,"WEATHER CORRECTED MD 10% POE","MVA","Non-coincident"]
[null,null,null,null,"Coincident"]
[null,null,"WEATHER CORRECTED MD 50% POE","MW","Non-coincident"]
[null,null,null,null,"Coincident"]
[null,null,"WEATHER CORRECTED MD 50% POE","MVA","Non-coincident"]
[null,null,null,null,"Coincident"]
[null,"NSP to enter name","CONNECTION POINT RATING","MVA","Non-coincident"]
[null,null,null,null,"Coincident"]
[null,null,"WINTER/SUMMER PEAKING",null,"Non-coincident"]
[null,null,null,null,"Coincident"]
[null,null,"ADJUSTMENTS - EMBEDDED GENERATION","MW","Non-coincident"]
[null,null,null,null,"Coincident"]
[null,null,"WEATHER CORRECTED MD 10% POE","MW","Non-coincident"]
[null,null,null,null,"Coincident"]
[null,null,"WEATHER CORRECTED MD 10% POE","MVA","Non-coincident"]
[null,null,null,null,"Coincident"]
[null,null,"WEATHER CORRECTED MD 50% POE","MW","Non-coincident"]
[null,null,null,null,"Coincident"]
[null,null,"WEATHER CORRECTED MD 50% POE","MVA","Non-coincident"]
[null,null,null,null,"Coincident"]
[null,"NSP to enter name","CONNECTION POINT RATING","MVA","Non-coincident"]
[null,null,null,null,"Coincident"]
[null,null,"WINTER/SUMMER PEAKING",null,"Non-coincident"]
[null,null,null,null,"Coincident"]
[null,null,"ADJUSTMENTS - EMBEDDED GENERATION","MW","Non-coincident"]
[null,null,null,null,"Coincident"]
[null,null,"WEATHER CORRECTED MD 10% POE","MW","Non-coincident"]
[null,null,null,null,"Coincident"]
[null,null,"WEATHER CORRECTED MD 10% POE","MVA","Non-coincident"]
[null,null,null,null,"Coincident"]
[null,null,"WEATHER CORRECTED MD 50% POE","MW","Non-coincident"]
[null,null,null,null,"Coincident"]
[null,null,"WEATHER CORRECTED MD 50% POE","MVA","Non-coincident"]
[null,null,null,null,"Coincident"]
[null,"NSP to enter name","CONNECTION POINT RATING","MVA","Non-coincident"]
[null,null,null,null,"Coincident"]
[null,null,"WINTER/SUMMER PEAKING",null,"Non-coincident"]
[null,null,null,null,"Coincident"]
[null,null,"ADJUSTMENTS - EMBEDDED GENERATION","MW","Non-coincident"]
[null,null,null,null,"Coincident"]
[null,null,"WEATHER CORRECTED MD 10% POE","MW","Non-coincident"]
[null,null,null,null,"Coincident"]
[null,null,"WEATHER CORRECTED MD 10% POE","MVA","Non-coincident"]
[null,null,null,null,"Coincident"]
[null,null,"WEATHER CORRECTED MD 50% POE","MW","Non-coincident"]
[null,null,null,null,"Coincident"]
[null,null,"WEATHER CORRECTED MD 50% POE","MVA","Non-coincident"]
[null,null,null,null,"Coincident"]
[null,"NSP to enter name","CONNECTION POINT RATING","MVA","Non-coincident"]
[null,null,null,null,"Coincident"]
[null,null,"WINTER/SUMMER PEAKING",null,"Non-coincident"]
[null,null,null,null,"Coincident"]
[null,null,"ADJUSTMENTS - EMBEDDED GENERATION","MW","Non-coincident"]
[null,null,null,null,"Coincident"]
[null,null,"WEATHER CORRECTED MD 10% POE","MW","Non-coincident"]
[null,null,null,null,"Coincident"]
[null,null,"WEATHER CORRECTED MD 10% POE","MVA","Non-coincident"]
[null,null,null,null,"Coincident"]
[null,null,"WEATHER CORRECTED MD 50% POE","MW","Non-coincident"]
[null,null,null,null,"Coincident"]
[null,null,"WEATHER CORRECTED MD 50% POE","MVA","Non-coincident"]
[null,null,null,null,"Coincident"]
[null,"NSP to enter name","CONNECTION POINT RATING","MVA","Non-coincident"]
[null,null,null,null,"Coincident"]
[null,null,"WINTER/SUMMER PEAKING",null,"Non-coincident"]
[null,null,null,null,"Coincident"]
[null,null,"ADJUSTMENTS - EMBEDDED GENERATION","MW","Non-coincident"]
[null,null,null,null,"Coincident"]
[null,null,"WEATHER CORRECTED MD 10% POE","MW","Non-coincident"]
[null,null,null,null,"Coincident"]
[null,null,"WEATHER CORRECTED MD 10% POE","MVA","Non-coincident"]
[null,null,null,null,"Coincident"]
[null,null,"WEATHER CORRECTED MD 50% POE","MW","Non-coincident"]
[null,null,null,null,"Coincident"]
[null,null,"WEATHER CORRECTED MD 50% POE","MVA","Non-coincident"]
[null,null,null,null,"Coincident"]
[null,"NSP to enter name","CONNECTION POINT RATING","MVA","Non-coincident"]
[null,null,null,null,"Coincident"]
[null,null,"WINTER/SUMMER PEAKING",null,"Non-coincident"]
[null,null,null,null,"Coincident"]
[null,null,"ADJUSTMENTS - EMBEDDED GENERATION","MW","Non-coincident"]
[null,null,null,null,"Coincident"]
[null,null,"WEATHER CORRECTED MD 10% POE","MW","Non-coincident"]
[null,null,null,null,"Coincident"]
[null,null,"WEATHER CORRECTED MD 10% POE","MVA","Non-coincident"]
[null,null,null,null,"Coincident"]
[null,null,"WEATHER CORRECTED MD 50% POE","MW","Non-coincident"]
[null,null,null,null,"Coincident"]
[null,null,"WEATHER CORRECTED MD 50% POE","MVA","Non-coincident"]
[null,null,null,null,"Coincident"]
[null,"NSP to enter name","CONNECTION POINT RATING","MVA","Non-coincident"]
[null,null,null,null,"Coincident"]
[null,null,"WINTER/SUMMER PEAKING",null,"Non-coincident"]
[null,null,null,null,"Coincident"]
[null,null,"ADJUSTMENTS - EMBEDDED GENERATION","MW","Non-coincident"]
[null,null,null,null,"Coincident"]
[null,null,"WEATHER CORRECTED MD 10% POE","MW","Non-coincident"]
[null,null,null,null,"Coincident"]
[null,null,"WEATHER CORRECTED MD 10% POE","MVA","Non-coincident"]
[null,null,null,null,"Coincident"]
[null,null,"WEATHER CORRECTED MD 50% POE","MW","Non-coincident"]
[null,null,null,null,"Coincident"]
[null,null,"WEATHER CORRECTED MD 50% POE","MVA","Non-coincident"]
[null,null,null,null,"Coincident"]
[null,"NSP to enter name","CONNECTION POINT RATING","MVA","Non-coincident"]
[null,null,null,null,"Coincident"]
[null,null,"WINTER/SUMMER PEAKING",null,"Non-coincident"]
[null,null,null,null,"Coincident"]
[null,null,"ADJUSTMENTS - EMBEDDED GENERATION","MW","Non-coincident"]
[null,null,null,null,"Coincident"]
[null,null,"WEATHER CORRECTED MD 10% POE","MW","Non-coincident"]
[null,null,null,null,"Coincident"]
[null,null,"WEATHER CORRECTED MD 10% POE","MVA","Non-coincident"]
[null,null,null,null,"Coincident"]
[null,null,"WEATHER CORRECTED MD 50% POE","MW","Non-coincident"]
[null,null,null,null,"Coincident"]
[null,null,"WEATHER CORRECTED MD 50% POE","MVA","Non-coincident"]
[null,null,null,null,"Coincident"]
[null,"NSP to enter name","CONNECTION POINT RATING","MVA","Non-coincident"]
[null,null,null,null,"Coincident"]
[null,null,"WINTER/SUMMER PEAKING",null,"Non-coincident"]
[null,null,null,null,"Coincident"]
[null,null,"ADJUSTMENTS - EMBEDDED GENERATION","MW","Non-coincident"]
[null,null,null,null,"Coincident"]
[null,null,"WEATHER CORRECTED MD 10% POE","MW","Non-coincident"]
[null,null,null,null,"Coincident"]
[null,null,"WEATHER CORRECTED MD 10% POE","MVA","Non-coincident"]
[null,null,null,null,"Coincident"]
[null,null,"WEATHER CORRECTED MD 50% POE","MW","Non-coincident"]
[null,null,null,null,"Coincident"]
[null,null,"WEATHER CORRECTED MD 50% POE","MVA","Non-coincident"]
[null,null,null,null,"Coincident"]
[null,"NSP to enter name","CONNECTION POINT RATING","MVA","Non-coincident"]
[null,null,null,null,"Coincident"]
[null,null,"WINTER/SUMMER PEAKING",null,"Non-coincident"]
[null,null,null,null,"Coincident"]
[null,null,"ADJUSTMENTS - EMBEDDED GENERATION","MW","Non-coincident"]
[null,null,null,null,"Coincident"]
[null,null,"WEATHER CORRECTED MD 10% POE","MW","Non-coincident"]
[null,null,null,null,"Coincident"]
[null,null,"WEATHER CORRECTED MD 10% POE","MVA","Non-coincident"]
[null,null,null,null,"Coincident"]
[null,null,"WEATHER CORRECTED MD 50% POE","MW","Non-coincident"]
[null,null,null,null,"Coincident"]
[null,null,"WEATHER CORRECTED MD 50% POE","MVA","Non-coincident"]
[null,null,null,null,"Coincident"]
[null,"NSP to enter name","CONNECTION POINT RATING","MVA","Non-coincident"]
[null,null,null,null,"Coincident"]
[null,null,"WINTER/SUMMER PEAKING",null,"Non-coincident"]
[null,null,null,null,"Coincident"]
[null,null,"ADJUSTMENTS - EMBEDDED GENERATION","MW","Non-coincident"]
[null,null,null,null,"Coincident"]
[null,null,"WEATHER CORRECTED MD 10% POE","MW","Non-coincident"]
[null,null,null,null,"Coincident"]
[null,null,"WEATHER CORRECTED MD 10% POE","MVA","Non-coincident"]
[null,null,null,null,"Coincident"]
[null,null,"WEATHER CORRECTED MD 50% POE","MW","Non-coincident"]
[null,null,null,null,"Coincident"]
[null,null,"WEATHER CORRECTED MD 50% POE","MVA","Non-coincident"]
[null,null,null,null,"Coincident"]
[null,"NSP to enter name","CONNECTION POINT RATING","MVA","Non-coincident"]
[null,null,null,null,"Coincident"]
[null,null,"WINTER/SUMMER PEAKING",null,"Non-coincident"]
[null,null,null,null,"Coincident"]
[null,null,"ADJUSTMENTS - EMBEDDED GENERATION","MW","Non-coincident"]
[null,null,null,null,"Coincident"]
[null,null,"WEATHER CORRECTED MD 10% POE","MW","Non-coincident"]
[null,null,null,null,"Coincident"]
[null,null,"WEATHER CORRECTED MD 10% POE","MVA","Non-coincident"]
[null,null,null,null,"Coincident"]
[null,null,"WEATHER CORRECTED MD 50% POE","MW","Non-coincident"]
[null,null,null,null,"Coincident"]
[null,null,"WEATHER CORRECTED MD 50% POE","MVA","Non-coincident"]
[null,null,null,null,"Coincident"]
[null,"NSP to enter name","CONNECTION POINT RATING","MVA","Non-coincident"]
[null,null,null,null,"Coincident"]
[null,null,"WINTER/SUMMER PEAKING",null,"Non-coincident"]
[null,null,null,null,"Coincident"]
[null,null,"ADJUSTMENTS - EMBEDDED GENERATION","MW","Non-coincident"]
[null,null,null,null,"Coincident"]
[null,null,"WEATHER CORRECTED MD 10% POE","MW","Non-coincident"]
[null,null,null,null,"Coincident"]
[null,null,"WEATHER CORRECTED MD 10% POE","MVA","Non-coincident"]
[null,null,null,null,"Coincident"]
[null,null,"WEATHER CORRECTED MD 50% POE","MW","Non-coincident"]
[null,null,null,null,"Coincident"]
[null,null,"WEATHER CORRECTED MD 50% POE","MVA","Non-coincident"]
[null,null,null,null,"Coincident"]
[null,"NSP to enter name","CONNECTION POINT RATING","MVA","Non-coincident"]
[null,null,null,null,"Coincident"]
[null,null,"WINTER/SUMMER PEAKING",null,"Non-coincident"]
[null,null,null,null,"Coincident"]
[null,null,"ADJUSTMENTS - EMBEDDED GENERATION","MW","Non-coincident"]
[null,null,null,null,"Coincident"]
[null,null,"WEATHER CORRECTED MD 10% POE","MW","Non-coincident"]
[null,null,null,null,"Coincident"]
[null,null,"WEATHER CORRECTED MD 10% POE","MVA","Non-coincident"]
[null,null,null,null,"Coincident"]
[null,null,"WEATHER CORRECTED MD 50% POE","MW","Non-coincident"]
[null,null,null,null,"Coincident"]
[null,null,"WEATHER CORRECTED MD 50% POE","MVA","Non-coincident"]
[null,null,null,null,"Coincident"]
[null,"NSP to enter name","CONNECTION POINT RATING","MVA","Non-coincident"]
[null,null,null,null,"Coincident"]
[null,null,"WINTER/SUMMER PEAKING",null,"Non-coincident"]
[null,null,null,null,"Coincident"]
[null,null,"ADJUSTMENTS - EMBEDDED GENERATION","MW","Non-coincident"]
[null,null,null,null,"Coincident"]
[null,null,"WEATHER CORRECTED MD 10% POE","MW","Non-coincident"]
[null,null,null,null,"Coincident"]
[null,null,"WEATHER CORRECTED MD 10% POE","MVA","Non-coincident"]
[null,null,null,null,"Coincident"]
[null,null,"WEATHER CORRECTED MD 50% POE","MW","Non-coincident"]
[null,null,null,null,"Coincident"]
[null,null,"WEATHER CORRECTED MD 50% POE","MVA","Non-coincident"]
[null,null,null,null,"Coincident"]
[null,"NSP to enter name","CONNECTION POINT RATING","MVA","Non-coincident"]
[null,null,null,null,"Coincident"]
[null,null,"WINTER/SUMMER PEAKING",null,"Non-coincident"]
[null,null,null,null,"Coincident"]
[null,null,"ADJUSTMENTS - EMBEDDED GENERATION","MW","Non-coincident"]
[null,null,null,null,"Coincident"]
[null,null,"WEATHER CORRECTED MD 10% POE","MW","Non-coincident"]
[null,null,null,null,"Coincident"]
[null,null,"WEATHER CORRECTED MD 10% POE","MVA","Non-coincident"]
[null,null,null,null,"Coincident"]
[null,null,"WEATHER CORRECTED MD 50% POE","MW","Non-coincident"]
[null,null,null,null,"Coincident"]
[null,null,"WEATHER CORRECTED MD 50% POE","MVA","Non-coincident"]
[null,null,null,null,"Coincident"]
[null,"NSP to enter name","CONNECTION POINT RATING","MVA","Non-coincident"]
[null,null,null,null,"Coincident"]
[null,null,"WINTER/SUMMER PEAKING",null,"Non-coincident"]
[null,null,null,null,"Coincident"]
[null,null,"ADJUSTMENTS - EMBEDDED GENERATION","MW","Non-coincident"]
[null,null,null,null,"Coincident"]
[null,null,"WEATHER CORRECTED MD 10% POE","MW","Non-coincident"]
[null,null,null,null,"Coincident"]
[null,null,"WEATHER CORRECTED MD 10% POE","MVA","Non-coincident"]
[null,null,null,null,"Coincident"]
[null,null,"WEATHER CORRECTED MD 50% POE","MW","Non-coincident"]
[null,null,null,null,"Coincident"]
[null,null,"WEATHER CORRECTED MD 50% POE","MVA","Non-coincident"]
[null,null,null,null,"Coincident"]
[null,"NSP to enter name","CONNECTION POINT RATING","MVA","Non-coincident"]
[null,null,null,null,"Coincident"]
[null,null,"WINTER/SUMMER PEAKING",null,"Non-coincident"]
[null,null,null,null,"Coincident"]
[null,null,"ADJUSTMENTS - EMBEDDED GENERATION","MW","Non-coincident"]
[null,null,null,null,"Coincident"]
[null,null,"WEATHER CORRECTED MD 10% POE","MW","Non-coincident"]
[null,null,null,null,"Coincident"]
[null,null,"WEATHER CORRECTED MD 10% POE","MVA","Non-coincident"]
[null,null,null,null,"Coincident"]
[null,null,"WEATHER CORRECTED MD 50% POE","MW","Non-coincident"]
[null,null,null,null,"Coincident"]
[null,null,"WEATHER CORRECTED MD 50% POE","MVA","Non-coincident"]
[null,null,null,null,"Coincident"]
[null,"NSP to enter name","CONNECTION POINT RATING","MVA","Non-coincident"]
[null,null,null,null,"Coincident"]
[null,null,"WINTER/SUMMER PEAKING",null,"Non-coincident"]
[null,null,null,null,"Coincident"]
[null,null,"ADJUSTMENTS - EMBEDDED GENERATION","MW","Non-coincident"]
[null,null,null,null,"Coincident"]
[null,null,"WEATHER CORRECTED MD 10% POE","MW","Non-coincident"]
[null,null,null,null,"Coincident"]
[null,null,"WEATHER CORRECTED MD 10% POE","MVA","Non-coincident"]
[null,null,null,null,"Coincident"]
[null,null,"WEATHER CORRECTED MD 50% POE","MW","Non-coincident"]
[null,null,null,null,"Coincident"]
[null,null,"WEATHER CORRECTED MD 50% POE","MVA","Non-coincident"]
[null,null,null,null,"Coincident"]
[null,"NSP to enter name","CONNECTION POINT RATING","MVA","Non-coincident"]
[null,null,null,null,"Coincident"]
[null,null,"WINTER/SUMMER PEAKING",null,"Non-coincident"]
[null,null,null,null,"Coincident"]
[null,null,"ADJUSTMENTS - EMBEDDED GENERATION","MW","Non-coincident"]
[null,null,null,null,"Coincident"]
[null,null,"WEATHER CORRECTED MD 10% POE","MW","Non-coincident"]
[null,null,null,null,"Coincident"]
[null,null,"WEATHER CORRECTED MD 10% POE","MVA","Non-coincident"]
[null,null,null,null,"Coincident"]
[null,null,"WEATHER CORRECTED MD 50% POE","MW","Non-coincident"]
[null,null,null,null,"Coincident"]
[null,null,"WEATHER CORRECTED MD 50% POE","MVA","Non-coincident"]
[null,null,null,null,"Coincident"]
[null,"NSP to enter name","CONNECTION POINT RATING","MVA","Non-coincident"]
[null,null,null,null,"Coincident"]
[null,null,"WINTER/SUMMER PEAKING",null,"Non-coincident"]
[null,null,null,null,"Coincident"]
[null,null,"ADJUSTMENTS - EMBEDDED GENERATION","MW","Non-coincident"]
[null,null,null,null,"Coincident"]
[null,null,"WEATHER CORRECTED MD 10% POE","MW","Non-coincident"]
[null,null,null,null,"Coincident"]
[null,null,"WEATHER CORRECTED MD 10% POE","MVA","Non-coincident"]
[null,null,null,null,"Coincident"]
[null,null,"WEATHER CORRECTED MD 50% POE","MW","Non-coincident"]
[null,null,null,null,"Coincident"]
[null,null,"WEATHER CORRECTED MD 50% POE","MVA","Non-coincident"]
[null,null,null,null,"Coincident"]
[null,"NSP to enter name","CONNECTION POINT RATING","MVA","Non-coincident"]
[null,null,null,null,"Coincident"]
[null,null,"WINTER/SUMMER PEAKING",null,"Non-coincident"]
[null,null,null,null,"Coincident"]
[null,null,"ADJUSTMENTS - EMBEDDED GENERATION","MW","Non-coincident"]
[null,null,null,null,"Coincident"]
[null,null,"WEATHER CORRECTED MD 10% POE","MW","Non-coincident"]
[null,null,null,null,"Coincident"]
[null,null,"WEATHER CORRECTED MD 10% POE","MVA","Non-coincident"]
[null,null,null,null,"Coincident"]
[null,null,"WEATHER CORRECTED MD 50% POE","MW","Non-coincident"]
[null,null,null,null,"Coincident"]
[null,null,"WEATHER CORRECTED MD 50% POE","MVA","Non-coincident"]
[null,null,null,null,"Coincident"]
[null,"NSP to enter name","CONNECTION POINT RATING","MVA","Non-coincident"]
[null,null,null,null,"Coincident"]
[null,null,"WINTER/SUMMER PEAKING",null,"Non-coincident"]
[null,null,null,null,"Coincident"]
[null,null,"ADJUSTMENTS - EMBEDDED GENERATION","MW","Non-coincident"]
[null,null,null,null,"Coincident"]
[null,null,"WEATHER CORRECTED MD 10% POE","MW","Non-coincident"]
[null,null,null,null,"Coincident"]
[null,null,"WEATHER CORRECTED MD 10% POE","MVA","Non-coincident"]
[null,null,null,null,"Coincident"]
[null,null,"WEATHER CORRECTED MD 50% POE","MW","Non-coincident"]
[null,null,null,null,"Coincident"]
[null,null,"WEATHER CORRECTED MD 50% POE","MVA","Non-coincident"]
[null,null,null,null,"Coincident"]
[null,"NSP to enter name","CONNECTION POINT RATING","MVA","Non-coincident"]
[null,null,null,null,"Coincident"]
[null,null,"WINTER/SUMMER PEAKING",null,"Non-coincident"]
[null,null,null,null,"Coincident"]
[null,null,"ADJUSTMENTS - EMBEDDED GENERATION","MW","Non-coincident"]
[null,null,null,null,"Coincident"]
[null,null,"WEATHER CORRECTED MD 10% POE","MW","Non-coincident"]
[null,null,null,null,"Coincident"]
[null,null,"WEATHER CORRECTED MD 10% POE","MVA","Non-coincident"]
[null,null,null,null,"Coincident"]
[null,null,"WEATHER CORRECTED MD 50% POE","MW","Non-coincident"]
[null,null,null,null,"Coincident"]
[null,null,"WEATHER CORRECTED MD 50% POE","MVA","Non-coincident"]
[null,null,null,null,"Coincident"]
[null,"NSP to enter name","CONNECTION POINT RATING","MVA","Non-coincident"]
[null,null,null,null,"Coincident"]
[null,null,"WINTER/SUMMER PEAKING",null,"Non-coincident"]
[null,null,null,null,"Coincident"]
[null,null,"ADJUSTMENTS - EMBEDDED GENERATION","MW","Non-coincident"]
[null,null,null,null,"Coincident"]
[null,null,"WEATHER CORRECTED MD 10% POE","MW","Non-coincident"]
[null,null,null,null,"Coincident"]
[null,null,"WEATHER CORRECTED MD 10% POE","MVA","Non-coincident"]
[null,null,null,null,"Coincident"]
[null,null,"WEATHER CORRECTED MD 50% POE","MW","Non-coincident"]
[null,null,null,null,"Coincident"]
[null,null,"WEATHER CORRECTED MD 50% POE","MVA","Non-coincident"]
[null,null,null,null,"Coincident"]
[null,"NSP to enter name","CONNECTION POINT RATING","MVA","Non-coincident"]
[null,null,null,null,"Coincident"]
[null,null,"WINTER/SUMMER PEAKING",null,"Non-coincident"]
[null,null,null,null,"Coincident"]
[null,null,"ADJUSTMENTS - EMBEDDED GENERATION","MW","Non-coincident"]
[null,null,null,null,"Coincident"]
[null,null,"WEATHER CORRECTED MD 10% POE","MW","Non-coincident"]
[null,null,null,null,"Coincident"]
[null,null,"WEATHER CORRECTED MD 10% POE","MVA","Non-coincident"]
[null,null,null,null,"Coincident"]
[null,null,"WEATHER CORRECTED MD 50% POE","MW","Non-coincident"]
[null,null,null,null,"Coincident"]
[null,null,"WEATHER CORRECTED MD 50% POE","MVA","Non-coincident"]
[null,null,null,null,"Coincident"]
[null,"NSP to enter name","CONNECTION POINT RATING","MVA","Non-coincident"]
[null,null,null,null,"Coincident"]
[null,null,"WINTER/SUMMER PEAKING",null,"Non-coincident"]
[null,null,null,null,"Coincident"]
[null,null,"ADJUSTMENTS - EMBEDDED GENERATION","MW","Non-coincident"]
[null,null,null,null,"Coincident"]
[null,null,"WEATHER CORRECTED MD 10% POE","MW","Non-coincident"]
[null,null,null,null,"Coincident"]
[null,null,"WEATHER CORRECTED MD 10% POE","MVA","Non-coincident"]
[null,null,null,null,"Coincident"]
[null,null,"WEATHER CORRECTED MD 50% POE","MW","Non-coincident"]
[null,null,null,null,"Coincident"]
[null,null,"WEATHER CORRECTED MD 50% POE","MVA","Non-coincident"]
[null,null,null,null,"Coincident"]
[null,"NSP to enter name","CONNECTION POINT RATING","MVA","Non-coincident"]
[null,null,null,null,"Coincident"]
[null,null,"WINTER/SUMMER PEAKING",null,"Non-coincident"]
[null,null,null,null,"Coincident"]
[null,null,"ADJUSTMENTS - EMBEDDED GENERATION","MW","Non-coincident"]
[null,null,null,null,"Coincident"]
[null,null,"WEATHER CORRECTED MD 10% POE","MW","Non-coincident"]
[null,null,null,null,"Coincident"]
[null,null,"WEATHER CORRECTED MD 10% POE","MVA","Non-coincident"]
[null,null,null,null,"Coincident"]
[null,null,"WEATHER CORRECTED MD 50% POE","MW","Non-coincident"]
[null,null,null,null,"Coincident"]
[null,null,"WEATHER CORRECTED MD 50% POE","MVA","Non-coincident"]
[null,null,null,null,"Coincident"]
[null,"NSP to enter name","CONNECTION POINT RATING","MVA","Non-coincident"]
[null,null,null,null,"Coincident"]
[null,null,"WINTER/SUMMER PEAKING",null,"Non-coincident"]
[null,null,null,null,"Coincident"]
[null,null,"ADJUSTMENTS - EMBEDDED GENERATION","MW","Non-coincident"]
[null,null,null,null,"Coincident"]
[null,null,"WEATHER CORRECTED MD 10% POE","MW","Non-coincident"]
[null,null,null,null,"Coincident"]
[null,null,"WEATHER CORRECTED MD 10% POE","MVA","Non-coincident"]
[null,null,null,null,"Coincident"]
[null,null,"WEATHER CORRECTED MD 50% POE","MW","Non-coincident"]
[null,null,null,null,"Coincident"]
[null,null,"WEATHER CORRECTED MD 50% POE","MVA","Non-coincident"]
[null,null,null,null,"Coincident"]
[null,"NSP to enter name","CONNECTION POINT RATING","MVA","Non-coincident"]
[null,null,null,null,"Coincident"]
[null,null,"WINTER/SUMMER PEAKING",null,"Non-coincident"]
[null,null,null,null,"Coincident"]
[null,null,"ADJUSTMENTS - EMBEDDED GENERATION","MW","Non-coincident"]
[null,null,null,null,"Coincident"]
[null,null,"WEATHER CORRECTED MD 10% POE","MW","Non-coincident"]
[null,null,null,null,"Coincident"]
[null,null,"WEATHER CORRECTED MD 10% POE","MVA","Non-coincident"]
[null,null,null,null,"Coincident"]
[null,null,"WEATHER CORRECTED MD 50% POE","MW","Non-coincident"]
[null,null,null,null,"Coincident"]
[null,null,"WEATHER CORRECTED MD 50% POE","MVA","Non-coincident"]
[null,null,null,null,"Coincident"]
[null,"NSP to enter name","CONNECTION POINT RATING","MVA","Non-coincident"]
[null,null,null,null,"Coincident"]
[null,null,"WINTER/SUMMER PEAKING",null,"Non-coincident"]
[null,null,null,null,"Coincident"]
[null,null,"ADJUSTMENTS - EMBEDDED GENERATION","MW","Non-coincident"]
[null,null,null,null,"Coincident"]
[null,null,"WEATHER CORRECTED MD 10% POE","MW","Non-coincident"]
[null,null,null,null,"Coincident"]
[null,null,"WEATHER CORRECTED MD 10% POE","MVA","Non-coincident"]
[null,null,null,null,"Coincident"]
[null,null,"WEATHER CORRECTED MD 50% POE","MW","Non-coincident"]
[null,null,null,null,"Coincident"]
[null,null,"WEATHER CORRECTED MD 50% POE","MVA","Non-coincident"]
[null,null,null,null,"Coincident"]
[null,"NSP to enter name","CONNECTION POINT RATING","MVA","Non-coincident"]
[null,null,null,null,"Coincident"]
[null,null,"WINTER/SUMMER PEAKING",null,"Non-coincident"]
[null,null,null,null,"Coincident"]
[null,null,"ADJUSTMENTS - EMBEDDED GENERATION","MW","Non-coincident"]
[null,null,null,null,"Coincident"]
[null,null,"WEATHER CORRECTED MD 10% POE","MW","Non-coincident"]
[null,null,null,null,"Coincident"]
[null,null,"WEATHER CORRECTED MD 10% POE","MVA","Non-coincident"]
[null,null,null,null,"Coincident"]
[null,null,"WEATHER CORRECTED MD 50% POE","MW","Non-coincident"]
[null,null,null,null,"Coincident"]
[null,null,"WEATHER CORRECTED MD 50% POE","MVA","Non-coincident"]
[null,null,null,null,"Coincident"]
[null,"NSP to enter name","CONNECTION POINT RATING","MVA","Non-coincident"]
[null,null,null,null,"Coincident"]
[null,null,"WINTER/SUMMER PEAKING",null,"Non-coincident"]
[null,null,null,null,"Coincident"]
[null,null,"ADJUSTMENTS - EMBEDDED GENERATION","MW","Non-coincident"]
[null,null,null,null,"Coincident"]
[null,null,"WEATHER CORRECTED MD 10% POE","MW","Non-coincident"]
[null,null,null,null,"Coincident"]
[null,null,"WEATHER CORRECTED MD 10% POE","MVA","Non-coincident"]
[null,null,null,null,"Coincident"]
[null,null,"WEATHER CORRECTED MD 50% POE","MW","Non-coincident"]
[null,null,null,null,"Coincident"]
[null,null,"WEATHER CORRECTED MD 50% POE","MVA","Non-coincident"]
[null,null,null,null,"Coincident"]
[null,"NSP to enter name","CONNECTION POINT RATING","MVA","Non-coincident"]
[null,null,null,null,"Coincident"]
[null,null,"WINTER/SUMMER PEAKING",null,"Non-coincident"]
[null,null,null,null,"Coincident"]
[null,null,"ADJUSTMENTS - EMBEDDED GENERATION","MW","Non-coincident"]
[null,null,null,null,"Coincident"]
[null,null,"WEATHER CORRECTED MD 10% POE","MW","Non-coincident"]
[null,null,null,null,"Coincident"]
[null,null,"WEATHER CORRECTED MD 10% POE","MVA","Non-coincident"]
[null,null,null,null,"Coincident"]
[null,null,"WEATHER CORRECTED MD 50% POE","MW","Non-coincident"]
[null,null,null,null,"Coincident"]
[null,null,"WEATHER CORRECTED MD 50% POE","MVA","Non-coincident"]
[null,null,null,null,"Coincident"]
[null,"NSP to enter name","CONNECTION POINT RATING","MVA","Non-coincident"]
[null,null,null,null,"Coincident"]
[null,null,"WINTER/SUMMER PEAKING",null,"Non-coincident"]
[null,null,null,null,"Coincident"]
[null,null,"ADJUSTMENTS - EMBEDDED GENERATION","MW","Non-coincident"]
[null,null,null,null,"Coincident"]
[null,null,"WEATHER CORRECTED MD 10% POE","MW","Non-coincident"]
[null,null,null,null,"Coincident"]
[null,null,"WEATHER CORRECTED MD 10% POE","MVA","Non-coincident"]
[null,null,null,null,"Coincident"]
[null,null,"WEATHER CORRECTED MD 50% POE","MW","Non-coincident"]
[null,null,null,null,"Coincident"]
[null,null,"WEATHER CORRECTED MD 50% POE","MVA","Non-coincident"]
[null,null,null,null,"Coincident"]
[null,"NSP to enter name","CONNECTION POINT RATING","MVA","Non-coincident"]
[null,null,null,null,"Coincident"]
[null,null,"WINTER/SUMMER PEAKING",null,"Non-coincident"]
[null,null,null,null,"Coincident"]
[null,null,"ADJUSTMENTS - EMBEDDED GENERATION","MW","Non-coincident"]
[null,null,null,null,"Coincident"]
[null,null,"WEATHER CORRECTED MD 10% POE","MW","Non-coincident"]
[null,null,null,null,"Coincident"]
[null,null,"WEATHER CORRECTED MD 10% POE","MVA","Non-coincident"]
[null,null,null,null,"Coincident"]
[null,null,"WEATHER CORRECTED MD 50% POE","MW","Non-coincident"]
[null,null,null,null,"Coincident"]
[null,null,"WEATHER CORRECTED MD 50% POE","MVA","Non-coincident"]
[null,null,null,null,"Coincident"]
[null,"NSP to enter name","CONNECTION POINT RATING","MVA","Non-coincident"]
[null,null,null,null,"Coincident"]
[null,null,"WINTER/SUMMER PEAKING",null,"Non-coincident"]
[null,null,null,null,"Coincident"]
[null,null,"ADJUSTMENTS - EMBEDDED GENERATION","MW","Non-coincident"]
[null,null,null,null,"Coincident"]
[null,null,"WEATHER CORRECTED MD 10% POE","MW","Non-coincident"]
[null,null,null,null,"Coincident"]
[null,null,"WEATHER CORRECTED MD 10% POE","MVA","Non-coincident"]
[null,null,null,null,"Coincident"]
[null,null,"WEATHER CORRECTED MD 50% POE","MW","Non-coincident"]
[null,null,null,null,"Coincident"]
[null,null,"WEATHER CORRECTED MD 50% POE","MVA","Non-coincident"]
[null,null,null,null,"Coincident"]
[null,"NSP to enter name","CONNECTION POINT RATING","MVA","Non-coincident"]
[null,null,null,null,"Coincident"]
[null,null,"WINTER/SUMMER PEAKING",null,"Non-coincident"]
[null,null,null,null,"Coincident"]
[null,null,"ADJUSTMENTS - EMBEDDED GENERATION","MW","Non-coincident"]
[null,null,null,null,"Coincident"]
[null,null,"WEATHER CORRECTED MD 10% POE","MW","Non-coincident"]
[null,null,null,null,"Coincident"]
[null,null,"WEATHER CORRECTED MD 10% POE","MVA","Non-coincident"]
[null,null,null,null,"Coincident"]
[null,null,"WEATHER CORRECTED MD 50% POE","MW","Non-coincident"]
[null,null,null,null,"Coincident"]
[null,null,"WEATHER CORRECTED MD 50% POE","MVA","Non-coincident"]
[null,null,null,null,"Coincident"]
[null,"NSP to enter name","CONNECTION POINT RATING","MVA","Non-coincident"]
[null,null,null,null,"Coincident"]
[null,null,"WINTER/SUMMER PEAKING",null,"Non-coincident"]
[null,null,null,null,"Coincident"]
[null,null,"ADJUSTMENTS - EMBEDDED GENERATION","MW","Non-coincident"]
[null,null,null,null,"Coincident"]
[null,null,"WEATHER CORRECTED MD 10% POE","MW","Non-coincident"]
[null,null,null,null,"Coincident"]
[null,null,"WEATHER CORRECTED MD 10% POE","MVA","Non-coincident"]
[null,null,null,null,"Coincident"]
[null,null,"WEATHER CORRECTED MD 50% POE","MW","Non-coincident"]
[null,null,null,null,"Coincident"]
[null,null,"WEATHER CORRECTED MD 50% POE","MVA","Non-coincident"]
[null,null,null,null,"Coincident"]
[null,"NSP to enter name","CONNECTION POINT RATING","MVA","Non-coincident"]
[null,null,null,null,"Coincident"]
[null,null,"WINTER/SUMMER PEAKING",null,"Non-coincident"]
[null,null,null,null,"Coincident"]
[null,null,"ADJUSTMENTS - EMBEDDED GENERATION","MW","Non-coincident"]
[null,null,null,null,"Coincident"]
[null,null,"WEATHER CORRECTED MD 10% POE","MW","Non-coincident"]
[null,null,null,null,"Coincident"]
[null,null,"WEATHER CORRECTED MD 10% POE","MVA","Non-coincident"]
[null,null,null,null,"Coincident"]
[null,null,"WEATHER CORRECTED MD 50% POE","MW","Non-coincident"]
[null,null,null,null,"Coincident"]
[null,null,"WEATHER CORRECTED MD 50% POE","MVA","Non-coincident"]
[null,null,null,null,"Coincident"]
[null,"NSP to enter name","CONNECTION POINT RATING","MVA","Non-coincident"]
[null,null,null,null,"Coincident"]
[null,null,"WINTER/SUMMER PEAKING",null,"Non-coincident"]
[null,null,null,null,"Coincident"]
[null,null,"ADJUSTMENTS - EMBEDDED GENERATION","MW","Non-coincident"]
[null,null,null,null,"Coincident"]
[null,null,"WEATHER CORRECTED MD 10% POE","MW","Non-coincident"]
[null,null,null,null,"Coincident"]
[null,null,"WEATHER CORRECTED MD 10% POE","MVA","Non-coincident"]
[null,null,null,null,"Coincident"]
[null,null,"WEATHER CORRECTED MD 50% POE","MW","Non-coincident"]
[null,null,null,null,"Coincident"]
[null,null,"WEATHER CORRECTED MD 50% POE","MVA","Non-coincident"]
[null,null,null,null,"Coincident"]
[null,"NSP to enter name","CONNECTION POINT RATING","MVA","Non-coincident"]
[null,null,null,null,"Coincident"]
[null,null,"WINTER/SUMMER PEAKING",null,"Non-coincident"]
[null,null,null,null,"Coincident"]
[null,null,"ADJUSTMENTS - EMBEDDED GENERATION","MW","Non-coincident"]
[null,null,null,null,"Coincident"]
[null,null,"WEATHER CORRECTED MD 10% POE","MW","Non-coincident"]
[null,null,null,null,"Coincident"]
[null,null,"WEATHER CORRECTED MD 10% POE","MVA","Non-coincident"]
[null,null,null,null,"Coincident"]
[null,null,"WEATHER CORRECTED MD 50% POE","MW","Non-coincident"]
[null,null,null,null,"Coincident"]
[null,null,"WEATHER CORRECTED MD 50% POE","MVA","Non-coincident"]
[null,null,null,null,"Coincident"]
[null,"NSP to enter name","CONNECTION POINT RATING","MVA","Non-coincident"]
[null,null,null,null,"Coincident"]
[null,null,"WINTER/SUMMER PEAKING",null,"Non-coincident"]
[null,null,null,null,"Coincident"]
[null,null,"ADJUSTMENTS - EMBEDDED GENERATION","MW","Non-coincident"]
[null,null,null,null,"Coincident"]
[null,null,"WEATHER CORRECTED MD 10% POE","MW","Non-coincident"]
[null,null,null,null,"Coincident"]
[null,null,"WEATHER CORRECTED MD 10% POE","MVA","Non-coincident"]
[null,null,null,null,"Coincident"]
[null,null,"WEATHER CORRECTED MD 50% POE","MW","Non-coincident"]
[null,null,null,null,"Coincident"]
[null,null,"WEATHER CORRECTED MD 50% POE","MVA","Non-coincident"]
[null,null,null,null,"Coincident"]
[null,"NSP to enter name","CONNECTION POINT RATING","MVA","Non-coincident"]
[null,null,null,null,"Coincident"]
[null,null,"WINTER/SUMMER PEAKING",null,"Non-coincident"]
[null,null,null,null,"Coincident"]
[null,null,"ADJUSTMENTS - EMBEDDED GENERATION","MW","Non-coincident"]
[null,null,null,null,"Coincident"]
[null,null,"WEATHER CORRECTED MD 10% POE","MW","Non-coincident"]
[null,null,null,null,"Coincident"]
[null,null,"WEATHER CORRECTED MD 10% POE","MVA","Non-coincident"]
[null,null,null,null,"Coincident"]
[null,null,"WEATHER CORRECTED MD 50% POE","MW","Non-coincident"]
[null,null,null,null,"Coincident"]
[null,null,"WEATHER CORRECTED MD 50% POE","MVA","Non-coincident"]
[null,null,null,null,"Coincident"]
[null,"NSP to enter name","CONNECTION POINT RATING","MVA","Non-coincident"]
[null,null,null,null,"Coincident"]
[null,null,"WINTER/SUMMER PEAKING",null,"Non-coincident"]
[null,null,null,null,"Coincident"]
[null,null,"ADJUSTMENTS - EMBEDDED GENERATION","MW","Non-coincident"]
[null,null,null,null,"Coincident"]
[null,null,"WEATHER CORRECTED MD 10% POE","MW","Non-coincident"]
[null,null,null,null,"Coincident"]
[null,null,"WEATHER CORRECTED MD 10% POE","MVA","Non-coincident"]
[null,null,null,null,"Coincident"]
[null,null,"WEATHER CORRECTED MD 50% POE","MW","Non-coincident"]
[null,null,null,null,"Coincident"]
[null,null,"WEATHER CORRECTED MD 50% POE","MVA","Non-coincident"]
[null,null,null,null,"Coincident"]
[null,"NSP to enter name","CONNECTION POINT RATING","MVA","Non-coincident"]
[null,null,null,null,"Coincident"]
[null,null,"WINTER/SUMMER PEAKING",null,"Non-coincident"]
[null,null,null,null,"Coincident"]
[null,null,"ADJUSTMENTS - EMBEDDED GENERATION","MW","Non-coincident"]
[null,null,null,null,"Coincident"]
[null,null,"WEATHER CORRECTED MD 10% POE","MW","Non-coincident"]
[null,null,null,null,"Coincident"]
[null,null,"WEATHER CORRECTED MD 10% POE","MVA","Non-coincident"]
[null,null,null,null,"Coincident"]
[null,null,"WEATHER CORRECTED MD 50% POE","MW","Non-coincident"]
[null,null,null,null,"Coincident"]
[null,null,"WEATHER CORRECTED MD 50% POE","MVA","Non-coincident"]
[null,null,null,null,"Coincident"]
[null,"NSP to enter name","CONNECTION POINT RATING","MVA","Non-coincident"]
[null,null,null,null,"Coincident"]
[null,null,"WINTER/SUMMER PEAKING",null,"Non-coincident"]
[null,null,null,null,"Coincident"]
[null,null,"ADJUSTMENTS - EMBEDDED GENERATION","MW","Non-coincident"]
[null,null,null,null,"Coincident"]
[null,null,"WEATHER CORRECTED MD 10% POE","MW","Non-coincident"]
[null,null,null,null,"Coincident"]
[null,null,"WEATHER CORRECTED MD 10% POE","MVA","Non-coincident"]
[null,null,null,null,"Coincident"]
[null,null,"WEATHER CORRECTED MD 50% POE","MW","Non-coincident"]
[null,null,null,null,"Coincident"]
[null,null,"WEATHER CORRECTED MD 50% POE","MVA","Non-coincident"]
[null,null,null,null,"Coincident"]
[null,"NSP to enter name","CONNECTION POINT RATING","MVA","Non-coincident"]
[null,null,null,null,"Coincident"]
[null,null,"WINTER/SUMMER PEAKING",null,"Non-coincident"]
[null,null,null,null,"Coincident"]
[null,null,"ADJUSTMENTS - EMBEDDED GENERATION","MW","Non-coincident"]
[null,null,null,null,"Coincident"]
[null,null,"WEATHER CORRECTED MD 10% POE","MW","Non-coincident"]
[null,null,null,null,"Coincident"]
[null,null,"WEATHER CORRECTED MD 10% POE","MVA","Non-coincident"]
[null,null,null,null,"Coincident"]
[null,null,"WEATHER CORRECTED MD 50% POE","MW","Non-coincident"]
[null,null,null,null,"Coincident"]
[null,null,"WEATHER CORRECTED MD 50% POE","MVA","Non-coincident"]
[null,null,null,null,"Coincident"]
[null,"NSP to enter name","CONNECTION POINT RATING","MVA","Non-coincident"]
[null,null,null,null,"Coincident"]
[null,null,"WINTER/SUMMER PEAKING",null,"Non-coincident"]
[null,null,null,null,"Coincident"]
[null,null,"ADJUSTMENTS - EMBEDDED GENERATION","MW","Non-coincident"]
[null,null,null,null,"Coincident"]
[null,null,"WEATHER CORRECTED MD 10% POE","MW","Non-coincident"]
[null,null,null,null,"Coincident"]
[null,null,"WEATHER CORRECTED MD 10% POE","MVA","Non-coincident"]
[null,null,null,null,"Coincident"]
[null,null,"WEATHER CORRECTED MD 50% POE","MW","Non-coincident"]
[null,null,null,null,"Coincident"]
[null,null,"WEATHER CORRECTED MD 50% POE","MVA","Non-coincident"]
[null,null,null,null,"Coincident"]
[null,"NSP to enter name","CONNECTION POINT RATING","MVA","Non-coincident"]
[null,null,null,null,"Coincident"]
[null,null,"WINTER/SUMMER PEAKING",null,"Non-coincident"]
[null,null,null,null,"Coincident"]
[null,null,"ADJUSTMENTS - EMBEDDED GENERATION","MW","Non-coincident"]
[null,null,null,null,"Coincident"]
[null,null,"WEATHER CORRECTED MD 10% POE","MW","Non-coincident"]
[null,null,null,null,"Coincident"]
[null,null,"WEATHER CORRECTED MD 10% POE","MVA","Non-coincident"]
[null,null,null,null,"Coincident"]
[null,null,"WEATHER CORRECTED MD 50% POE","MW","Non-coincident"]
[null,null,null,null,"Coincident"]
[null,null,"WEATHER CORRECTED MD 50% POE","MVA","Non-coincident"]
[null,null,null,null,"Coincident"]
[null,"NSP to enter name","CONNECTION POINT RATING","MVA","Non-coincident"]
[null,null,null,null,"Coincident"]
[null,null,"WINTER/SUMMER PEAKING",null,"Non-coincident"]
[null,null,null,null,"Coincident"]
[null,null,"ADJUSTMENTS - EMBEDDED GENERATION","MW","Non-coincident"]
[null,null,null,null,"Coincident"]
[null,null,"WEATHER CORRECTED MD 10% POE","MW","Non-coincident"]
[null,null,null,null,"Coincident"]
[null,null,"WEATHER CORRECTED MD 10% POE","MVA","Non-coincident"]
[null,null,null,null,"Coincident"]
[null,null,"WEATHER CORRECTED MD 50% POE","MW","Non-coincident"]
[null,null,null,null,"Coincident"]
[null,null,"WEATHER CORRECTED MD 50% POE","MVA","Non-coincident"]
[null,null,null,null,"Coincident"]
[null,"NSP to enter name","CONNECTION POINT RATING","MVA","Non-coincident"]
[null,null,null,null,"Coincident"]
[null,null,"WINTER/SUMMER PEAKING",null,"Non-coincident"]
[null,null,null,null,"Coincident"]
[null,null,"ADJUSTMENTS - EMBEDDED GENERATION","MW","Non-coincident"]
[null,null,null,null,"Coincident"]
[null,null,"WEATHER CORRECTED MD 10% POE","MW","Non-coincident"]
[null,null,null,null,"Coincident"]
[null,null,"WEATHER CORRECTED MD 10% POE","MVA","Non-coincident"]
[null,null,null,null,"Coincident"]
[null,null,"WEATHER CORRECTED MD 50% POE","MW","Non-coincident"]
[null,null,null,null,"Coincident"]
[null,null,"WEATHER CORRECTED MD 50% POE","MVA","Non-coincident"]
[null,null,null,null,"Coincident"]
[null,"NSP to enter name","CONNECTION POINT RATING","MVA","Non-coincident"]
[null,null,null,null,"Coincident"]
[null,null,"WINTER/SUMMER PEAKING",null,"Non-coincident"]
[null,null,null,null,"Coincident"]
[null,null,"ADJUSTMENTS - EMBEDDED GENERATION","MW","Non-coincident"]
[null,null,null,null,"Coincident"]
[null,null,"WEATHER CORRECTED MD 10% POE","MW","Non-coincident"]
[null,null,null,null,"Coincident"]
[null,null,"WEATHER CORRECTED MD 10% POE","MVA","Non-coincident"]
[null,null,null,null,"Coincident"]
[null,null,"WEATHER CORRECTED MD 50% POE","MW","Non-coincident"]
[null,null,null,null,"Coincident"]
[null,null,"WEATHER CORRECTED MD 50% POE","MVA","Non-coincident"]
[null,null,null,null,"Coincident"]
[null,"NSP to enter name","CONNECTION POINT RATING","MVA","Non-coincident"]
[null,null,null,null,"Coincident"]
[null,null,"WINTER/SUMMER PEAKING",null,"Non-coincident"]
[null,null,null,null,"Coincident"]
[null,null,"ADJUSTMENTS - EMBEDDED GENERATION","MW","Non-coincident"]
[null,null,null,null,"Coincident"]
[null,null,"WEATHER CORRECTED MD 10% POE","MW","Non-coincident"]
[null,null,null,null,"Coincident"]
[null,null,"WEATHER CORRECTED MD 10% POE","MVA","Non-coincident"]
[null,null,null,null,"Coincident"]
[null,null,"WEATHER CORRECTED MD 50% POE","MW","Non-coincident"]
[null,null,null,null,"Coincident"]
[null,null,"WEATHER CORRECTED MD 50% POE","MVA","Non-coincident"]
[null,null,null,null,"Coincident"]
[null,"NSP to enter name","CONNECTION POINT RATING","MVA","Non-coincident"]
[null,null,null,null,"Coincident"]
[null,null,"WINTER/SUMMER PEAKING",null,"Non-coincident"]
[null,null,null,null,"Coincident"]
[null,null,"ADJUSTMENTS - EMBEDDED GENERATION","MW","Non-coincident"]
[null,null,null,null,"Coincident"]
[null,null,"WEATHER CORRECTED MD 10% POE","MW","Non-coincident"]
[null,null,null,null,"Coincident"]
[null,null,"WEATHER CORRECTED MD 10% POE","MVA","Non-coincident"]
[null,null,null,null,"Coincident"]
[null,null,"WEATHER CORRECTED MD 50% POE","MW","Non-coincident"]
[null,null,null,null,"Coincident"]
[null,null,"WEATHER CORRECTED MD 50% POE","MVA","Non-coincident"]
[null,null,null,null,"Coincident"]
[null,"NSP to enter name","CONNECTION POINT RATING","MVA","Non-coincident"]
[null,null,null,null,"Coincident"]
[null,null,"WINTER/SUMMER PEAKING",null,"Non-coincident"]
[null,null,null,null,"Coincident"]
[null,null,"ADJUSTMENTS - EMBEDDED GENERATION","MW","Non-coincident"]
[null,null,null,null,"Coincident"]
[null,null,"WEATHER CORRECTED MD 10% POE","MW","Non-coincident"]
[null,null,null,null,"Coincident"]
[null,null,"WEATHER CORRECTED MD 10% POE","MVA","Non-coincident"]
[null,null,null,null,"Coincident"]
[null,null,"WEATHER CORRECTED MD 50% POE","MW","Non-coincident"]
[null,null,null,null,"Coincident"]
[null,null,"WEATHER CORRECTED MD 50% POE","MVA","Non-coincident"]
[null,null,null,null,"Coincident"]
[null,"NSP to enter name","CONNECTION POINT RATING","MVA","Non-coincident"]
[null,null,null,null,"Coincident"]
[null,null,"WINTER/SUMMER PEAKING",null,"Non-coincident"]
[null,null,null,null,"Coincident"]
[null,null,"ADJUSTMENTS - EMBEDDED GENERATION","MW","Non-coincident"]
[null,null,null,null,"Coincident"]
[null,null,"WEATHER CORRECTED MD 10% POE","MW","Non-coincident"]
[null,null,null,null,"Coincident"]
[null,null,"WEATHER CORRECTED MD 10% POE","MVA","Non-coincident"]
[null,null,null,null,"Coincident"]
[null,null,"WEATHER CORRECTED MD 50% POE","MW","Non-coincident"]
[null,null,null,null,"Coincident"]
[null,null,"WEATHER CORRECTED MD 50% POE","MVA","Non-coincident"]
[null,null,null,null,"Coincident"]
[null,"NSP to enter name","CONNECTION POINT RATING","MVA","Non-coincident"]
[null,null,null,null,"Coincident"]
[null,null,"WINTER/SUMMER PEAKING",null,"Non-coincident"]
[null,null,null,null,"Coincident"]
[null,null,"ADJUSTMENTS - EMBEDDED GENERATION","MW","Non-coincident"]
[null,null,null,null,"Coincident"]
[null,null,"WEATHER CORRECTED MD 10% POE","MW","Non-coincident"]
[null,null,null,null,"Coincident"]
[null,null,"WEATHER CORRECTED MD 10% POE","MVA","Non-coincident"]
[null,null,null,null,"Coincident"]
[null,null,"WEATHER CORRECTED MD 50% POE","MW","Non-coincident"]
[null,null,null,null,"Coincident"]
[null,null,"WEATHER CORRECTED MD 50% POE","MVA","Non-coincident"]
[null,null,null,null,"Coincident"]
[null,"NSP to enter name","CONNECTION POINT RATING","MVA","Non-coincident"]
[null,null,null,null,"Coincident"]
[null,null,"WINTER/SUMMER PEAKING",null,"Non-coincident"]
[null,null,null,null,"Coincident"]
[null,null,"ADJUSTMENTS - EMBEDDED GENERATION","MW","Non-coincident"]
[null,null,null,null,"Coincident"]
[null,null,"WEATHER CORRECTED MD 10% POE","MW","Non-coincident"]
[null,null,null,null,"Coincident"]
[null,null,"WEATHER CORRECTED MD 10% POE","MVA","Non-coincident"]
[null,null,null,null,"Coincident"]
[null,null,"WEATHER CORRECTED MD 50% POE","MW","Non-coincident"]
[null,null,null,null,"Coincident"]
[null,null,"WEATHER CORRECTED MD 50% POE","MVA","Non-coincident"]
[null,null,null,null,"Coincident"]
[null,"NSP to enter name","CONNECTION POINT RATING","MVA","Non-coincident"]
[null,null,null,null,"Coincident"]
[null,null,"WINTER/SUMMER PEAKING",null,"Non-coincident"]
[null,null,null,null,"Coincident"]
[null,null,"ADJUSTMENTS - EMBEDDED GENERATION","MW","Non-coincident"]
[null,null,null,null,"Coincident"]
[null,null,"WEATHER CORRECTED MD 10% POE","MW","Non-coincident"]
[null,null,null,null,"Coincident"]
[null,null,"WEATHER CORRECTED MD 10% POE","MVA","Non-coincident"]
[null,null,null,null,"Coincident"]
[null,null,"WEATHER CORRECTED MD 50% POE","MW","Non-coincident"]
[null,null,null,null,"Coincident"]
[null,null,"WEATHER CORRECTED MD 50% POE","MVA","Non-coincident"]
[null,null,null,null,"Coincident"]
[null,"NSP to enter name","CONNECTION POINT RATING","MVA","Non-coincident"]
[null,null,null,null,"Coincident"]
[null,null,"WINTER/SUMMER PEAKING",null,"Non-coincident"]
[null,null,null,null,"Coincident"]
[null,null,"ADJUSTMENTS - EMBEDDED GENERATION","MW","Non-coincident"]
[null,null,null,null,"Coincident"]
[null,null,"WEATHER CORRECTED MD 10% POE","MW","Non-coincident"]
[null,null,null,null,"Coincident"]
[null,null,"WEATHER CORRECTED MD 10% POE","MVA","Non-coincident"]
[null,null,null,null,"Coincident"]
[null,null,"WEATHER CORRECTED MD 50% POE","MW","Non-coincident"]
[null,null,null,null,"Coincident"]
[null,null,"WEATHER CORRECTED MD 50% POE","MVA","Non-coincident"]
[null,null,null,null,"Coincident"]
[null,"NSP to enter name","CONNECTION POINT RATING","MVA","Non-coincident"]
[null,null,null,null,"Coincident"]
[null,null,"WINTER/SUMMER PEAKING",null,"Non-coincident"]
[null,null,null,null,"Coincident"]
[null,null,"ADJUSTMENTS - EMBEDDED GENERATION","MW","Non-coincident"]
[null,null,null,null,"Coincident"]
[null,null,"WEATHER CORRECTED MD 10% POE","MW","Non-coincident"]
[null,null,null,null,"Coincident"]
[null,null,"WEATHER CORRECTED MD 10% POE","MVA","Non-coincident"]
[null,null,null,null,"Coincident"]
[null,null,"WEATHER CORRECTED MD 50% POE","MW","Non-coincident"]
[null,null,null,null,"Coincident"]
[null,null,"WEATHER CORRECTED MD 50% POE","MVA","Non-coincident"]
[null,null,null,null,"Coincident"]
[null,"NSP to enter name","CONNECTION POINT RATING","MVA","Non-coincident"]
[null,null,null,null,"Coincident"]
[null,null,"WINTER/SUMMER PEAKING",null,"Non-coincident"]
[null,null,null,null,"Coincident"]
[null,null,"ADJUSTMENTS - EMBEDDED GENERATION","MW","Non-coincident"]
[null,null,null,null,"Coincident"]
[null,null,"WEATHER CORRECTED MD 10% POE","MW","Non-coincident"]
[null,null,null,null,"Coincident"]
[null,null,"WEATHER CORRECTED MD 10% POE","MVA","Non-coincident"]
[null,null,null,null,"Coincident"]
[null,null,"WEATHER CORRECTED MD 50% POE","MW","Non-coincident"]
[null,null,null,null,"Coincident"]
[null,null,"WEATHER CORRECTED MD 50% POE","MVA","Non-coincident"]
[null,null,null,null,"Coincident"]
[null,"NSP to enter name","CONNECTION POINT RATING","MVA","Non-coincident"]
[null,null,null,null,"Coincident"]
[null,null,"WINTER/SUMMER PEAKING",null,"Non-coincident"]
[null,null,null,null,"Coincident"]
[null,null,"ADJUSTMENTS - EMBEDDED GENERATION","MW","Non-coincident"]
[null,null,null,null,"Coincident"]
[null,null,"WEATHER CORRECTED MD 10% POE","MW","Non-coincident"]
[null,null,null,null,"Coincident"]
[null,null,"WEATHER CORRECTED MD 10% POE","MVA","Non-coincident"]
[null,null,null,null,"Coincident"]
[null,null,"WEATHER CORRECTED MD 50% POE","MW","Non-coincident"]
[null,null,null,null,"Coincident"]
[null,null,"WEATHER CORRECTED MD 50% POE","MVA","Non-coincident"]
[null,null,null,null,"Coincident"]
[null,"NSP to enter name","CONNECTION POINT RATING","MVA","Non-coincident"]
[null,null,null,null,"Coincident"]
[null,null,"WINTER/SUMMER PEAKING",null,"Non-coincident"]
[null,null,null,null,"Coincident"]
[null,null,"ADJUSTMENTS - EMBEDDED GENERATION","MW","Non-coincident"]
[null,null,null,null,"Coincident"]
[null,null,"WEATHER CORRECTED MD 10% POE","MW","Non-coincident"]
[null,null,null,null,"Coincident"]
[null,null,"WEATHER CORRECTED MD 10% POE","MVA","Non-coincident"]
[null,null,null,null,"Coincident"]
[null,null,"WEATHER CORRECTED MD 50% POE","MW","Non-coincident"]
[null,null,null,null,"Coincident"]
[null,null,"WEATHER CORRECTED MD 50% POE","MVA","Non-coincident"]
[null,null,null,null,"Coincident"]
[null,"NSP to enter name","CONNECTION POINT RATING","MVA","Non-coincident"]
[null,null,null,null,"Coincident"]
[null,null,"WINTER/SUMMER PEAKING",null,"Non-coincident"]
[null,null,null,null,"Coincident"]
[null,null,"ADJUSTMENTS - EMBEDDED GENERATION","MW","Non-coincident"]
[null,null,null,null,"Coincident"]
[null,null,"WEATHER CORRECTED MD 10% POE","MW","Non-coincident"]
[null,null,null,null,"Coincident"]
[null,null,"WEATHER CORRECTED MD 10% POE","MVA","Non-coincident"]
[null,null,null,null,"Coincident"]
[null,null,"WEATHER CORRECTED MD 50% POE","MW","Non-coincident"]
[null,null,null,null,"Coincident"]
[null,null,"WEATHER CORRECTED MD 50% POE","MVA","Non-coincident"]
[null,null,null,null,"Coincident"]
[null,"NSP to enter name","CONNECTION POINT RATING","MVA","Non-coincident"]
[null,null,null,null,"Coincident"]
[null,null,"WINTER/SUMMER PEAKING",null,"Non-coincident"]
[null,null,null,null,"Coincident"]
[null,null,"ADJUSTMENTS - EMBEDDED GENERATION","MW","Non-coincident"]
[null,null,null,null,"Coincident"]
[null,null,"WEATHER CORRECTED MD 10% POE","MW","Non-coincident"]
[null,null,null,null,"Coincident"]
[null,null,"WEATHER CORRECTED MD 10% POE","MVA","Non-coincident"]
[null,null,null,null,"Coincident"]
[null,null,"WEATHER CORRECTED MD 50% POE","MW","Non-coincident"]
[null,null,null,null,"Coincident"]
[null,null,"WEATHER CORRECTED MD 50% POE","MVA","Non-coincident"]
[null,null,null,null,"Coincident"]
[null,"NSP to enter name","CONNECTION POINT RATING","MVA","Non-coincident"]
[null,null,null,null,"Coincident"]
[null,null,"WINTER/SUMMER PEAKING",null,"Non-coincident"]
[null,null,null,null,"Coincident"]
[null,null,"ADJUSTMENTS - EMBEDDED GENERATION","MW","Non-coincident"]
[null,null,null,null,"Coincident"]
[null,null,"WEATHER CORRECTED MD 10% POE","MW","Non-coincident"]
[null,null,null,null,"Coincident"]
[null,null,"WEATHER CORRECTED MD 10% POE","MVA","Non-coincident"]
[null,null,null,null,"Coincident"]
[null,null,"WEATHER CORRECTED MD 50% POE","MW","Non-coincident"]
[null,null,null,null,"Coincident"]
[null,null,"WEATHER CORRECTED MD 50% POE","MVA","Non-coincident"]
[null,null,null,null,"Coincident"]
[null,"NSP to enter name","CONNECTION POINT RATING","MVA","Non-coincident"]
[null,null,null,null,"Coincident"]
[null,null,"WINTER/SUMMER PEAKING",null,"Non-coincident"]
[null,null,null,null,"Coincident"]
[null,null,"ADJUSTMENTS - EMBEDDED GENERATION","MW","Non-coincident"]
[null,null,null,null,"Coincident"]
[null,null,"WEATHER CORRECTED MD 10% POE","MW","Non-coincident"]
[null,null,null,null,"Coincident"]
[null,null,"WEATHER CORRECTED MD 10% POE","MVA","Non-coincident"]
[null,null,null,null,"Coincident"]
[null,null,"WEATHER CORRECTED MD 50% POE","MW","Non-coincident"]
[null,null,null,null,"Coincident"]
[null,null,"WEATHER CORRECTED MD 50% POE","MVA","Non-coincident"]
[null,null,null,null,"Coincident"]
[null,"NSP to enter name","CONNECTION POINT RATING","MVA","Non-coincident"]
[null,null,null,null,"Coincident"]
[null,null,"WINTER/SUMMER PEAKING",null,"Non-coincident"]
[null,null,null,null,"Coincident"]
[null,null,"ADJUSTMENTS - EMBEDDED GENERATION","MW","Non-coincident"]
[null,null,null,null,"Coincident"]
[null,null,"WEATHER CORRECTED MD 10% POE","MW","Non-coincident"]
[null,null,null,null,"Coincident"]
[null,null,"WEATHER CORRECTED MD 10% POE","MVA","Non-coincident"]
[null,null,null,null,"Coincident"]
[null,null,"WEATHER CORRECTED MD 50% POE","MW","Non-coincident"]
[null,null,null,null,"Coincident"]
[null,null,"WEATHER CORRECTED MD 50% POE","MVA","Non-coincident"]
[null,null,null,null,"Coincident"]
[null,"NSP to enter name","CONNECTION POINT RATING","MVA","Non-coincident"]
[null,null,null,null,"Coincident"]
[null,null,"WINTER/SUMMER PEAKING",null,"Non-coincident"]
[null,null,null,null,"Coincident"]
[null,null,"ADJUSTMENTS - EMBEDDED GENERATION","MW","Non-coincident"]
[null,null,null,null,"Coincident"]
[null,null,"WEATHER CORRECTED MD 10% POE","MW","Non-coincident"]
[null,null,null,null,"Coincident"]
[null,null,"WEATHER CORRECTED MD 10% POE","MVA","Non-coincident"]
[null,null,null,null,"Coincident"]
[null,null,"WEATHER CORRECTED MD 50% POE","MW","Non-coincident"]
[null,null,null,null,"Coincident"]
[null,null,"WEATHER CORRECTED MD 50% POE","MVA","Non-coincident"]
[null,null,null,null,"Coincident"]
[null,"NSP to enter name","CONNECTION POINT RATING","MVA","Non-coincident"]
[null,null,null,null,"Coincident"]
[null,null,"WINTER/SUMMER PEAKING",null,"Non-coincident"]
[null,null,null,null,"Coincident"]
[null,null,"ADJUSTMENTS - EMBEDDED GENERATION","MW","Non-coincident"]
[null,null,null,null,"Coincident"]
[null,null,"WEATHER CORRECTED MD 10% POE","MW","Non-coincident"]
[null,null,null,null,"Coincident"]
[null,null,"WEATHER CORRECTED MD 10% POE","MVA","Non-coincident"]
[null,null,null,null,"Coincident"]
[null,null,"WEATHER CORRECTED MD 50% POE","MW","Non-coincident"]
[null,null,null,null,"Coincident"]
[null,null,"WEATHER CORRECTED MD 50% POE","MVA","Non-coincident"]
[null,null,null,null,"Coincident"]
[null,"NSP to enter name","CONNECTION POINT RATING","MVA","Non-coincident"]
[null,null,null,null,"Coincident"]
[null,null,"WINTER/SUMMER PEAKING",null,"Non-coincident"]
[null,null,null,null,"Coincident"]
[null,null,"ADJUSTMENTS - EMBEDDED GENERATION","MW","Non-coincident"]
[null,null,null,null,"Coincident"]
[null,null,"WEATHER CORRECTED MD 10% POE","MW","Non-coincident"]
[null,null,null,null,"Coincident"]
[null,null,"WEATHER CORRECTED MD 10% POE","MVA","Non-coincident"]
[null,null,null,null,"Coincident"]
[null,null,"WEATHER CORRECTED MD 50% POE","MW","Non-coincident"]
[null,null,null,null,"Coincident"]
[null,null,"WEATHER CORRECTED MD 50% POE","MVA","Non-coincident"]
[null,null,null,null,"Coincident"]
[null,"NSP to enter name","CONNECTION POINT RATING","MVA","Non-coincident"]
[null,null,null,null,"Coincident"]
[null,null,"WINTER/SUMMER PEAKING",null,"Non-coincident"]
[null,null,null,null,"Coincident"]
[null,null,"ADJUSTMENTS - EMBEDDED GENERATION","MW","Non-coincident"]
[null,null,null,null,"Coincident"]
[null,null,"WEATHER CORRECTED MD 10% POE","MW","Non-coincident"]
[null,null,null,null,"Coincident"]
[null,null,"WEATHER CORRECTED MD 10% POE","MVA","Non-coincident"]
[null,null,null,null,"Coincident"]
[null,null,"WEATHER CORRECTED MD 50% POE","MW","Non-coincident"]
[null,null,null,null,"Coincident"]
[null,null,"WEATHER CORRECTED MD 50% POE","MVA","Non-coincident"]
[null,null,null,null,"Coincident"]
[null,"NSP to enter name","CONNECTION POINT RATING","MVA","Non-coincident"]
[null,null,null,null,"Coincident"]
[null,null,"WINTER/SUMMER PEAKING",null,"Non-coincident"]
[null,null,null,null,"Coincident"]
[null,null,"ADJUSTMENTS - EMBEDDED GENERATION","MW","Non-coincident"]
[null,null,null,null,"Coincident"]
[null,null,"WEATHER CORRECTED MD 10% POE","MW","Non-coincident"]
[null,null,null,null,"Coincident"]
[null,null,"WEATHER CORRECTED MD 10% POE","MVA","Non-coincident"]
[null,null,null,null,"Coincident"]
[null,null,"WEATHER CORRECTED MD 50% POE","MW","Non-coincident"]
[null,null,null,null,"Coincident"]
[null,null,"WEATHER CORRECTED MD 50% POE","MVA","Non-coincident"]
[null,null,null,null,"Coincident"]
[null,"NSP to enter name","CONNECTION POINT RATING","MVA","Non-coincident"]
[null,null,null,null,"Coincident"]
[null,null,"WINTER/SUMMER PEAKING",null,"Non-coincident"]
[null,null,null,null,"Coincident"]
[null,null,"ADJUSTMENTS - EMBEDDED GENERATION","MW","Non-coincident"]
[null,null,null,null,"Coincident"]
[null,null,"WEATHER CORRECTED MD 10% POE","MW","Non-coincident"]
[null,null,null,null,"Coincident"]
[null,null,"WEATHER CORRECTED MD 10% POE","MVA","Non-coincident"]
[null,null,null,null,"Coincident"]
[null,null,"WEATHER CORRECTED MD 50% POE","MW","Non-coincident"]
[null,null,null,null,"Coincident"]
[null,null,"WEATHER CORRECTED MD 50% POE","MVA","Non-coincident"]
[null,null,null,null,"Coincident"]
[null,"NSP to enter name","CONNECTION POINT RATING","MVA","Non-coincident"]
[null,null,null,null,"Coincident"]
[null,null,"WINTER/SUMMER PEAKING",null,"Non-coincident"]
[null,null,null,null,"Coincident"]
[null,null,"ADJUSTMENTS - EMBEDDED GENERATION","MW","Non-coincident"]
[null,null,null,null,"Coincident"]
[null,null,"WEATHER CORRECTED MD 10% POE","MW","Non-coincident"]
[null,null,null,null,"Coincident"]
[null,null,"WEATHER CORRECTED MD 10% POE","MVA","Non-coincident"]
[null,null,null,null,"Coincident"]
[null,null,"WEATHER CORRECTED MD 50% POE","MW","Non-coincident"]
[null,null,null,null,"Coincident"]
[null,null,"WEATHER CORRECTED MD 50% POE","MVA","Non-coincident"]
[null,null,null,null,"Coincident"]
[null,"NSP to enter name","CONNECTION POINT RATING","MVA","Non-coincident"]
[null,null,null,null,"Coincident"]
[null,null,"WINTER/SUMMER PEAKING",null,"Non-coincident"]
[null,null,null,null,"Coincident"]
[null,null,"ADJUSTMENTS - EMBEDDED GENERATION","MW","Non-coincident"]
[null,null,null,null,"Coincident"]
[null,null,"WEATHER CORRECTED MD 10% POE","MW","Non-coincident"]
[null,null,null,null,"Coincident"]
[null,null,"WEATHER CORRECTED MD 10% POE","MVA","Non-coincident"]
[null,null,null,null,"Coincident"]
[null,null,"WEATHER CORRECTED MD 50% POE","MW","Non-coincident"]
[null,null,null,null,"Coincident"]
[null,null,"WEATHER CORRECTED MD 50% POE","MVA","Non-coincident"]
[null,null,null,null,"Coincident"]
[null,"NSP to enter name","CONNECTION POINT RATING","MVA","Non-coincident"]
[null,null,null,null,"Coincident"]
[null,null,"WINTER/SUMMER PEAKING",null,"Non-coincident"]
[null,null,null,null,"Coincident"]
[null,null,"ADJUSTMENTS - EMBEDDED GENERATION","MW","Non-coincident"]
[null,null,null,null,"Coincident"]
[null,null,"WEATHER CORRECTED MD 10% POE","MW","Non-coincident"]
[null,null,null,null,"Coincident"]
[null,null,"WEATHER CORRECTED MD 10% POE","MVA","Non-coincident"]
[null,null,null,null,"Coincident"]
[null,null,"WEATHER CORRECTED MD 50% POE","MW","Non-coincident"]
[null,null,null,null,"Coincident"]
[null,null,"WEATHER CORRECTED MD 50% POE","MVA","Non-coincident"]
[null,null,null,null,"Coincident"]
[null,"NSP to enter name","CONNECTION POINT RATING","MVA","Non-coincident"]
[null,null,null,null,"Coincident"]
[null,null,"WINTER/SUMMER PEAKING",null,"Non-coincident"]
[null,null,null,null,"Coincident"]
[null,null,"ADJUSTMENTS - EMBEDDED GENERATION","MW","Non-coincident"]
[null,null,null,null,"Coincident"]
[null,null,"WEATHER CORRECTED MD 10% POE","MW","Non-coincident"]
[null,null,null,null,"Coincident"]
[null,null,"WEATHER CORRECTED MD 10% POE","MVA","Non-coincident"]
[null,null,null,null,"Coincident"]
[null,null,"WEATHER CORRECTED MD 50% POE","MW","Non-coincident"]
[null,null,null,null,"Coincident"]
[null,null,"WEATHER CORRECTED MD 50% POE","MVA","Non-coincident"]
[null,null,null,null,"Coincident"]
[null,"NSP to enter name","CONNECTION POINT RATING","MVA","Non-coincident"]
[null,null,null,null,"Coincident"]
[null,null,"WINTER/SUMMER PEAKING",null,"Non-coincident"]
[null,null,null,null,"Coincident"]
[null,null,"ADJUSTMENTS - EMBEDDED GENERATION","MW","Non-coincident"]
[null,null,null,null,"Coincident"]
[null,null,"WEATHER CORRECTED MD 10% POE","MW","Non-coincident"]
[null,null,null,null,"Coincident"]
[null,null,"WEATHER CORRECTED MD 10% POE","MVA","Non-coincident"]
[null,null,null,null,"Coincident"]
[null,null,"WEATHER CORRECTED MD 50% POE","MW","Non-coincident"]
[null,null,null,null,"Coincident"]
[null,null,"WEATHER CORRECTED MD 50% POE","MVA","Non-coincident"]
[null,null,null,null,"Coincident"]
[null,"NSP to enter name","CONNECTION POINT RATING","MVA","Non-coincident"]
[null,null,null,null,"Coincident"]
[null,null,"WINTER/SUMMER PEAKING",null,"Non-coincident"]
[null,null,null,null,"Coincident"]
[null,null,"ADJUSTMENTS - EMBEDDED GENERATION","MW","Non-coincident"]
[null,null,null,null,"Coincident"]
[null,null,"WEATHER CORRECTED MD 10% POE","MW","Non-coincident"]
[null,null,null,null,"Coincident"]
[null,null,"WEATHER CORRECTED MD 10% POE","MVA","Non-coincident"]
[null,null,null,null,"Coincident"]
[null,null,"WEATHER CORRECTED MD 50% POE","MW","Non-coincident"]
[null,null,null,null,"Coincident"]
[null,null,"WEATHER CORRECTED MD 50% POE","MVA","Non-coincident"]
[null,null,null,null,"Coincident"]
[null,"NSP to enter name","CONNECTION POINT RATING","MVA","Non-coincident"]
[null,null,null,null,"Coincident"]
[null,null,"WINTER/SUMMER PEAKING",null,"Non-coincident"]
[null,null,null,null,"Coincident"]
[null,null,"ADJUSTMENTS - EMBEDDED GENERATION","MW","Non-coincident"]
[null,null,null,null,"Coincident"]
[null,null,"WEATHER CORRECTED MD 10% POE","MW","Non-coincident"]
[null,null,null,null,"Coincident"]
[null,null,"WEATHER CORRECTED MD 10% POE","MVA","Non-coincident"]
[null,null,null,null,"Coincident"]
[null,null,"WEATHER CORRECTED MD 50% POE","MW","Non-coincident"]
[null,null,null,null,"Coincident"]
[null,null,"WEATHER CORRECTED MD 50% POE","MVA","Non-coincident"]
[null,null,null,null,"Coincident"]
[null,"NSP to enter name","CONNECTION POINT RATING","MVA","Non-coincident"]
[null,null,null,null,"Coincident"]
[null,null,"WINTER/SUMMER PEAKING",null,"Non-coincident"]
[null,null,null,null,"Coincident"]
[null,null,"ADJUSTMENTS - EMBEDDED GENERATION","MW","Non-coincident"]
[null,null,null,null,"Coincident"]
[null,null,"WEATHER CORRECTED MD 10% POE","MW","Non-coincident"]
[null,null,null,null,"Coincident"]
[null,null,"WEATHER CORRECTED MD 10% POE","MVA","Non-coincident"]
[null,null,null,null,"Coincident"]
[null,null,"WEATHER CORRECTED MD 50% POE","MW","Non-coincident"]
[null,null,null,null,"Coincident"]
[null,null,"WEATHER CORRECTED MD 50% POE","MVA","Non-coincident"]
[null,null,null,null,"Coincident"]
[null,"NSP to enter name","CONNECTION POINT RATING","MVA","Non-coincident"]
[null,null,null,null,"Coincident"]
[null,null,"WINTER/SUMMER PEAKING",null,"Non-coincident"]
[null,null,null,null,"Coincident"]
[null,null,"ADJUSTMENTS - EMBEDDED GENERATION","MW","Non-coincident"]
[null,null,null,null,"Coincident"]
[null,null,"WEATHER CORRECTED MD 10% POE","MW","Non-coincident"]
[null,null,null,null,"Coincident"]
[null,null,"WEATHER CORRECTED MD 10% POE","MVA","Non-coincident"]
[null,null,null,null,"Coincident"]
[null,null,"WEATHER CORRECTED MD 50% POE","MW","Non-coincident"]
[null,null,null,null,"Coincident"]
[null,null,"WEATHER CORRECTED MD 50% POE","MVA","Non-coincident"]
[null,null,null,null,"Coincident"]
[null,"NSP to enter name","CONNECTION POINT RATING","MVA","Non-coincident"]
[null,null,null,null,"Coincident"]
[null,null,"WINTER/SUMMER PEAKING",null,"Non-coincident"]
[null,null,null,null,"Coincident"]
[null,null,"ADJUSTMENTS - EMBEDDED GENERATION","MW","Non-coincident"]
[null,null,null,null,"Coincident"]
[null,null,"WEATHER CORRECTED MD 10% POE","MW","Non-coincident"]
[null,null,null,null,"Coincident"]
[null,null,"WEATHER CORRECTED MD 10% POE","MVA","Non-coincident"]
[null,null,null,null,"Coincident"]
[null,null,"WEATHER CORRECTED MD 50% POE","MW","Non-coincident"]
[null,null,null,null,"Coincident"]
[null,null,"WEATHER CORRECTED MD 50% POE","MVA","Non-coincident"]
[null,null,null,null,"Coincident"]
[null,"NSP to enter name","CONNECTION POINT RATING","MVA","Non-coincident"]
[null,null,null,null,"Coincident"]
[null,null,"WINTER/SUMMER PEAKING",null,"Non-coincident"]
[null,null,null,null,"Coincident"]
[null,null,"ADJUSTMENTS - EMBEDDED GENERATION","MW","Non-coincident"]
[null,null,null,null,"Coincident"]
[null,null,"WEATHER CORRECTED MD 10% POE","MW","Non-coincident"]
[null,null,null,null,"Coincident"]
[null,null,"WEATHER CORRECTED MD 10% POE","MVA","Non-coincident"]
[null,null,null,null,"Coincident"]
[null,null,"WEATHER CORRECTED MD 50% POE","MW","Non-coincident"]
[null,null,null,null,"Coincident"]
[null,null,"WEATHER CORRECTED MD 50% POE","MVA","Non-coincident"]
[null,null,null,null,"Coincident"]
[null,"NSP to enter name","CONNECTION POINT RATING","MVA","Non-coincident"]
[null,null,null,null,"Coincident"]
[null,null,"WINTER/SUMMER PEAKING",null,"Non-coincident"]
[null,null,null,null,"Coincident"]
[null,null,"ADJUSTMENTS - EMBEDDED GENERATION","MW","Non-coincident"]
[null,null,null,null,"Coincident"]
[null,null,"WEATHER CORRECTED MD 10% POE","MW","Non-coincident"]
[null,null,null,null,"Coincident"]
[null,null,"WEATHER CORRECTED MD 10% POE","MVA","Non-coincident"]
[null,null,null,null,"Coincident"]
[null,null,"WEATHER CORRECTED MD 50% POE","MW","Non-coincident"]
[null,null,null,null,"Coincident"]
[null,null,"WEATHER CORRECTED MD 50% POE","MVA","Non-coincident"]
[null,null,null,null,"Coincident"]
[null,"NSP to enter name","CONNECTION POINT RATING","MVA","Non-coincident"]
[null,null,null,null,"Coincident"]
[null,null,"WINTER/SUMMER PEAKING",null,"Non-coincident"]
[null,null,null,null,"Coincident"]
[null,null,"ADJUSTMENTS - EMBEDDED GENERATION","MW","Non-coincident"]
[null,null,null,null,"Coincident"]
[null,null,"WEATHER CORRECTED MD 10% POE","MW","Non-coincident"]
[null,null,null,null,"Coincident"]
[null,null,"WEATHER CORRECTED MD 10% POE","MVA","Non-coincident"]
[null,null,null,null,"Coincident"]
[null,null,"WEATHER CORRECTED MD 50% POE","MW","Non-coincident"]
[null,null,null,null,"Coincident"]
[null,null,"WEATHER CORRECTED MD 50% POE","MVA","Non-coincident"]
[null,null,null,null,"Coincident"]
[null,"NSP to enter name","CONNECTION POINT RATING","MVA","Non-coincident"]
[null,null,null,null,"Coincident"]
[null,null,"WINTER/SUMMER PEAKING",null,"Non-coincident"]
[null,null,null,null,"Coincident"]
[null,null,"ADJUSTMENTS - EMBEDDED GENERATION","MW","Non-coincident"]
[null,null,null,null,"Coincident"]
[null,null,"WEATHER CORRECTED MD 10% POE","MW","Non-coincident"]
[null,null,null,null,"Coincident"]
[null,null,"WEATHER CORRECTED MD 10% POE","MVA","Non-coincident"]
[null,null,null,null,"Coincident"]
[null,null,"WEATHER CORRECTED MD 50% POE","MW","Non-coincident"]
[null,null,null,null,"Coincident"]
[null,null,"WEATHER CORRECTED MD 50% POE","MVA","Non-coincident"]
[null,null,null,null,"Coincident"]
[null,"NSP to enter name","CONNECTION POINT RATING","MVA","Non-coincident"]
[null,null,null,null,"Coincident"]
[null,null,"WINTER/SUMMER PEAKING",null,"Non-coincident"]
[null,null,null,null,"Coincident"]
[null,null,"ADJUSTMENTS - EMBEDDED GENERATION","MW","Non-coincident"]
[null,null,null,null,"Coincident"]
[null,null,"WEATHER CORRECTED MD 10% POE","MW","Non-coincident"]
[null,null,null,null,"Coincident"]
[null,null,"WEATHER CORRECTED MD 10% POE","MVA","Non-coincident"]
[null,null,null,null,"Coincident"]
[null,null,"WEATHER CORRECTED MD 50% POE","MW","Non-coincident"]
[null,null,null,null,"Coincident"]
[null,null,"WEATHER CORRECTED MD 50% POE","MVA","Non-coincident"]
[null,null,null,null,"Coincident"]
[null,"NSP to enter name","CONNECTION POINT RATING","MVA","Non-coincident"]
[null,null,null,null,"Coincident"]
[null,null,"WINTER/SUMMER PEAKING",null,"Non-coincident"]
[null,null,null,null,"Coincident"]
[null,null,"ADJUSTMENTS - EMBEDDED GENERATION","MW","Non-coincident"]
[null,null,null,null,"Coincident"]
[null,null,"WEATHER CORRECTED MD 10% POE","MW","Non-coincident"]
[null,null,null,null,"Coincident"]
[null,null,"WEATHER CORRECTED MD 10% POE","MVA","Non-coincident"]
[null,null,null,null,"Coincident"]
[null,null,"WEATHER CORRECTED MD 50% POE","MW","Non-coincident"]
[null,null,null,null,"Coincident"]
[null,null,"WEATHER CORRECTED MD 50% POE","MVA","Non-coincident"]
[null,null,null,null,"Coincident"]
[null,"NSP to enter name","CONNECTION POINT RATING","MVA","Non-coincident"]
[null,null,null,null,"Coincident"]
[null,null,"WINTER/SUMMER PEAKING",null,"Non-coincident"]
[null,null,null,null,"Coincident"]
[null,null,"ADJUSTMENTS - EMBEDDED GENERATION","MW","Non-coincident"]
[null,null,null,null,"Coincident"]
[null,null,"WEATHER CORRECTED MD 10% POE","MW","Non-coincident"]
[null,null,null,null,"Coincident"]
[null,null,"WEATHER CORRECTED MD 10% POE","MVA","Non-coincident"]
[null,null,null,null,"Coincident"]
[null,null,"WEATHER CORRECTED MD 50% POE","MW","Non-coincident"]
[null,null,null,null,"Coincident"]
[null,null,"WEATHER CORRECTED MD 50% POE","MVA","Non-coincident"]
[null,null,null,null,"Coincident"]
[null,"NSP to enter name","CONNECTION POINT RATING","MVA","Non-coincident"]
[null,null,null,null,"Coincident"]
[null,null,"WINTER/SUMMER PEAKING",null,"Non-coincident"]
[null,null,null,null,"Coincident"]
[null,null,"ADJUSTMENTS - EMBEDDED GENERATION","MW","Non-coincident"]
[null,null,null,null,"Coincident"]
[null,null,"WEATHER CORRECTED MD 10% POE","MW","Non-coincident"]
[null,null,null,null,"Coincident"]
[null,null,"WEATHER CORRECTED MD 10% POE","MVA","Non-coincident"]
[null,null,null,null,"Coincident"]
[null,null,"WEATHER CORRECTED MD 50% POE","MW","Non-coincident"]
[null,null,null,null,"Coincident"]
[null,null,"WEATHER CORRECTED MD 50% POE","MVA","Non-coincident"]
[null,null,null,null,"Coincident"]
[null,"NSP to enter name","CONNECTION POINT RATING","MVA","Non-coincident"]
[null,null,null,null,"Coincident"]
[null,null,"WINTER/SUMMER PEAKING",null,"Non-coincident"]
[null,null,null,null,"Coincident"]
[null,null,"ADJUSTMENTS - EMBEDDED GENERATION","MW","Non-coincident"]
[null,null,null,null,"Coincident"]
[null,null,"WEATHER CORRECTED MD 10% POE","MW","Non-coincident"]
[null,null,null,null,"Coincident"]
[null,null,"WEATHER CORRECTED MD 10% POE","MVA","Non-coincident"]
[null,null,null,null,"Coincident"]
[null,null,"WEATHER CORRECTED MD 50% POE","MW","Non-coincident"]
[null,null,null,null,"Coincident"]
[null,null,"WEATHER CORRECTED MD 50% POE","MVA","Non-coincident"]
[null,null,null,null,"Coincident"]
[null,"NSP to enter name","CONNECTION POINT RATING","MVA","Non-coincident"]
[null,null,null,null,"Coincident"]
[null,null,"WINTER/SUMMER PEAKING",null,"Non-coincident"]
[null,null,null,null,"Coincident"]
[null,null,"ADJUSTMENTS - EMBEDDED GENERATION","MW","Non-coincident"]
[null,null,null,null,"Coincident"]
[null,null,"WEATHER CORRECTED MD 10% POE","MW","Non-coincident"]
[null,null,null,null,"Coincident"]
[null,null,"WEATHER CORRECTED MD 10% POE","MVA","Non-coincident"]
[null,null,null,null,"Coincident"]
[null,null,"WEATHER CORRECTED MD 50% POE","MW","Non-coincident"]
[null,null,null,null,"Coincident"]
[null,null,"WEATHER CORRECTED MD 50% POE","MVA","Non-coincident"]
[null,null,null,null,"Coincident"]
[null,"NSP to enter name","CONNECTION POINT RATING","MVA","Non-coincident"]
[null,null,null,null,"Coincident"]
[null,null,"WINTER/SUMMER PEAKING",null,"Non-coincident"]
[null,null,null,null,"Coincident"]
[null,null,"ADJUSTMENTS - EMBEDDED GENERATION","MW","Non-coincident"]
[null,null,null,null,"Coincident"]
[null,null,"WEATHER CORRECTED MD 10% POE","MW","Non-coincident"]
[null,null,null,null,"Coincident"]
[null,null,"WEATHER CORRECTED MD 10% POE","MVA","Non-coincident"]
[null,null,null,null,"Coincident"]
[null,null,"WEATHER CORRECTED MD 50% POE","MW","Non-coincident"]
[null,null,null,null,"Coincident"]
[null,null,"WEATHER CORRECTED MD 50% POE","MVA","Non-coincident"]
[null,null,null,null,"Coincident"]
[null,"NSP to enter name","CONNECTION POINT RATING","MVA","Non-coincident"]
[null,null,null,null,"Coincident"]
[null,null,"WINTER/SUMMER PEAKING",null,"Non-coincident"]
[null,null,null,null,"Coincident"]
[null,null,"ADJUSTMENTS - EMBEDDED GENERATION","MW","Non-coincident"]
[null,null,null,null,"Coincident"]
[null,null,"WEATHER CORRECTED MD 10% POE","MW","Non-coincident"]
[null,null,null,null,"Coincident"]
[null,null,"WEATHER CORRECTED MD 10% POE","MVA","Non-coincident"]
[null,null,null,null,"Coincident"]
[null,null,"WEATHER CORRECTED MD 50% POE","MW","Non-coincident"]
[null,null,null,null,"Coincident"]
[null,null,"WEATHER CORRECTED MD 50% POE","MVA","Non-coincident"]
[null,null,null,null,"Coincident"]
[null,"NSP to enter name","CONNECTION POINT RATING","MVA","Non-coincident"]
[null,null,null,null,"Coincident"]
[null,null,"WINTER/SUMMER PEAKING",null,"Non-coincident"]
[null,null,null,null,"Coincident"]
[null,null,"ADJUSTMENTS - EMBEDDED GENERATION","MW","Non-coincident"]
[null,null,null,null,"Coincident"]
[null,null,"WEATHER CORRECTED MD 10% POE","MW","Non-coincident"]
[null,null,null,null,"Coincident"]
[null,null,"WEATHER CORRECTED MD 10% POE","MVA","Non-coincident"]
[null,null,null,null,"Coincident"]
[null,null,"WEATHER CORRECTED MD 50% POE","MW","Non-coincident"]
[null,null,null,null,"Coincident"]
[null,null,"WEATHER CORRECTED MD 50% POE","MVA","Non-coincident"]
[null,null,null,null,"Coincident"]
[null,"NSP to enter name","CONNECTION POINT RATING","MVA","Non-coincident"]
[null,null,null,null,"Coincident"]
[null,null,"WINTER/SUMMER PEAKING",null,"Non-coincident"]
[null,null,null,null,"Coincident"]
[null,null,"ADJUSTMENTS - EMBEDDED GENERATION","MW","Non-coincident"]
[null,null,null,null,"Coincident"]
[null,null,"WEATHER CORRECTED MD 10% POE","MW","Non-coincident"]
[null,null,null,null,"Coincident"]
[null,null,"WEATHER CORRECTED MD 10% POE","MVA","Non-coincident"]
[null,null,null,null,"Coincident"]
[null,null,"WEATHER CORRECTED MD 50% POE","MW","Non-coincident"]
[null,null,null,null,"Coincident"]
[null,null,"WEATHER CORRECTED MD 50% POE","MVA","Non-coincident"]
[null,null,null,null,"Coincident"]
[null,"NSP to enter name","CONNECTION POINT RATING","MVA","Non-coincident"]
[null,null,null,null,"Coincident"]
[null,null,"WINTER/SUMMER PEAKING",null,"Non-coincident"]
[null,null,null,null,"Coincident"]
[null,null,"ADJUSTMENTS - EMBEDDED GENERATION","MW","Non-coincident"]
[null,null,null,null,"Coincident"]
[null,null,"WEATHER CORRECTED MD 10% POE","MW","Non-coincident"]
[null,null,null,null,"Coincident"]
[null,null,"WEATHER CORRECTED MD 10% POE","MVA","Non-coincident"]
[null,null,null,null,"Coincident"]
[null,null,"WEATHER CORRECTED MD 50% POE","MW","Non-coincident"]
[null,null,null,null,"Coincident"]
[null,null,"WEATHER CORRECTED MD 50% POE","MVA","Non-coincident"]
[null,null,null,null,"Coincident"]
[null,"NSP to enter name","CONNECTION POINT RATING","MVA","Non-coincident"]
[null,null,null,null,"Coincident"]
[null,null,"WINTER/SUMMER PEAKING",null,"Non-coincident"]
[null,null,null,null,"Coincident"]
[null,null,"ADJUSTMENTS - EMBEDDED GENERATION","MW","Non-coincident"]
[null,null,null,null,"Coincident"]
[null,null,"WEATHER CORRECTED MD 10% POE","MW","Non-coincident"]
[null,null,null,null,"Coincident"]
[null,null,"WEATHER CORRECTED MD 10% POE","MVA","Non-coincident"]
[null,null,null,null,"Coincident"]
[null,null,"WEATHER CORRECTED MD 50% POE","MW","Non-coincident"]
[null,null,null,null,"Coincident"]
[null,null,"WEATHER CORRECTED MD 50% POE","MVA","Non-coincident"]
[null,null,null,null,"Coincident"]
[null,"NSP to enter name","CONNECTION POINT RATING","MVA","Non-coincident"]
[null,null,null,null,"Coincident"]
[null,null,"WINTER/SUMMER PEAKING",null,"Non-coincident"]
[null,null,null,null,"Coincident"]
[null,null,"ADJUSTMENTS - EMBEDDED GENERATION","MW","Non-coincident"]
[null,null,null,null,"Coincident"]
[null,null,"WEATHER CORRECTED MD 10% POE","MW","Non-coincident"]
[null,null,null,null,"Coincident"]
[null,null,"WEATHER CORRECTED MD 10% POE","MVA","Non-coincident"]
[null,null,null,null,"Coincident"]
[null,null,"WEATHER CORRECTED MD 50% POE","MW","Non-coincident"]
[null,null,null,null,"Coincident"]
[null,null,"WEATHER CORRECTED MD 50% POE","MVA","Non-coincident"]
[null,null,null,null,"Coincident"]
[null,"NSP to enter name","CONNECTION POINT RATING","MVA","Non-coincident"]
[null,null,null,null,"Coincident"]
[null,null,"WINTER/SUMMER PEAKING",null,"Non-coincident"]
[null,null,null,null,"Coincident"]
[null,null,"ADJUSTMENTS - EMBEDDED GENERATION","MW","Non-coincident"]
[null,null,null,null,"Coincident"]
[null,null,"WEATHER CORRECTED MD 10% POE","MW","Non-coincident"]
[null,null,null,null,"Coincident"]
[null,null,"WEATHER CORRECTED MD 10% POE","MVA","Non-coincident"]
[null,null,null,null,"Coincident"]
[null,null,"WEATHER CORRECTED MD 50% POE","MW","Non-coincident"]
[null,null,null,null,"Coincident"]
[null,null,"WEATHER CORRECTED MD 50% POE","MVA","Non-coincident"]
[null,null,null,null,"Coincident"]
[null,"NSP to enter name","CONNECTION POINT RATING","MVA","Non-coincident"]
[null,null,null,null,"Coincident"]
[null,null,"WINTER/SUMMER PEAKING",null,"Non-coincident"]
[null,null,null,null,"Coincident"]
[null,null,"ADJUSTMENTS - EMBEDDED GENERATION","MW","Non-coincident"]
[null,null,null,null,"Coincident"]
[null,null,"WEATHER CORRECTED MD 10% POE","MW","Non-coincident"]
[null,null,null,null,"Coincident"]
[null,null,"WEATHER CORRECTED MD 10% POE","MVA","Non-coincident"]
[null,null,null,null,"Coincident"]
[null,null,"WEATHER CORRECTED MD 50% POE","MW","Non-coincident"]
[null,null,null,null,"Coincident"]
[null,null,"WEATHER CORRECTED MD 50% POE","MVA","Non-coincident"]
[null,null,null,null,"Coincident"]
[null,"NSP to enter name","CONNECTION POINT RATING","MVA","Non-coincident"]
[null,null,null,null,"Coincident"]
[null,null,"WINTER/SUMMER PEAKING",null,"Non-coincident"]
[null,null,null,null,"Coincident"]
[null,null,"ADJUSTMENTS - EMBEDDED GENERATION","MW","Non-coincident"]
[null,null,null,null,"Coincident"]
[null,null,"WEATHER CORRECTED MD 10% POE","MW","Non-coincident"]
[null,null,null,null,"Coincident"]
[null,null,"WEATHER CORRECTED MD 10% POE","MVA","Non-coincident"]
[null,null,null,null,"Coincident"]
[null,null,"WEATHER CORRECTED MD 50% POE","MW","Non-coincident"]
[null,null,null,null,"Coincident"]
[null,null,"WEATHER CORRECTED MD 50% POE","MVA","Non-coincident"]
[null,null,null,null,"Coincident"]
[null,"NSP to enter name","CONNECTION POINT RATING","MVA","Non-coincident"]
[null,null,null,null,"Coincident"]
[null,null,"WINTER/SUMMER PEAKING",null,"Non-coincident"]
[null,null,null,null,"Coincident"]
[null,null,"ADJUSTMENTS - EMBEDDED GENERATION","MW","Non-coincident"]
[null,null,null,null,"Coincident"]
[null,null,"WEATHER CORRECTED MD 10% POE","MW","Non-coincident"]
[null,null,null,null,"Coincident"]
[null,null,"WEATHER CORRECTED MD 10% POE","MVA","Non-coincident"]
[null,null,null,null,"Coincident"]
[null,null,"WEATHER CORRECTED MD 50% POE","MW","Non-coincident"]
[null,null,null,null,"Coincident"]
[null,null,"WEATHER CORRECTED MD 50% POE","MVA","Non-coincident"]
[null,null,null,null,"Coincident"]
[null,"NSP to enter name","CONNECTION POINT RATING","MVA","Non-coincident"]
[null,null,null,null,"Coincident"]
[null,null,"WINTER/SUMMER PEAKING",null,"Non-coincident"]
[null,null,null,null,"Coincident"]
[null,null,"ADJUSTMENTS - EMBEDDED GENERATION","MW","Non-coincident"]
[null,null,null,null,"Coincident"]
[null,null,"WEATHER CORRECTED MD 10% POE","MW","Non-coincident"]
[null,null,null,null,"Coincident"]
[null,null,"WEATHER CORRECTED MD 10% POE","MVA","Non-coincident"]
[null,null,null,null,"Coincident"]
[null,null,"WEATHER CORRECTED MD 50% POE","MW","Non-coincident"]
[null,null,null,null,"Coincident"]
[null,null,"WEATHER CORRECTED MD 50% POE","MVA","Non-coincident"]
[null,null,null,null,"Coincident"]
[null,"NSP to enter name","CONNECTION POINT RATING","MVA","Non-coincident"]
[null,null,null,null,"Coincident"]
[null,null,"WINTER/SUMMER PEAKING",null,"Non-coincident"]
[null,null,null,null,"Coincident"]
[null,null,"ADJUSTMENTS - EMBEDDED GENERATION","MW","Non-coincident"]
[null,null,null,null,"Coincident"]
[null,null,"WEATHER CORRECTED MD 10% POE","MW","Non-coincident"]
[null,null,null,null,"Coincident"]
[null,null,"WEATHER CORRECTED MD 10% POE","MVA","Non-coincident"]
[null,null,null,null,"Coincident"]
[null,null,"WEATHER CORRECTED MD 50% POE","MW","Non-coincident"]
[null,null,null,null,"Coincident"]
[null,null,"WEATHER CORRECTED MD 50% POE","MVA","Non-coincident"]
[null,null,null,null,"Coincident"]
[null,"NSP to enter name","CONNECTION POINT RATING","MVA","Non-coincident"]
[null,null,null,null,"Coincident"]
[null,null,"WINTER/SUMMER PEAKING",null,"Non-coincident"]
[null,null,null,null,"Coincident"]
[null,null,"ADJUSTMENTS - EMBEDDED GENERATION","MW","Non-coincident"]
[null,null,null,null,"Coincident"]
[null,null,"WEATHER CORRECTED MD 10% POE","MW","Non-coincident"]
[null,null,null,null,"Coincident"]
[null,null,"WEATHER CORRECTED MD 10% POE","MVA","Non-coincident"]
[null,null,null,null,"Coincident"]
[null,null,"WEATHER CORRECTED MD 50% POE","MW","Non-coincident"]
[null,null,null,null,"Coincident"]
[null,null,"WEATHER CORRECTED MD 50% POE","MVA","Non-coincident"]
[null,null,null,null,"Coincident"]
[null,"NSP to enter name","CONNECTION POINT RATING","MVA","Non-coincident"]
[null,null,null,null,"Coincident"]
[null,null,"WINTER/SUMMER PEAKING",null,"Non-coincident"]
[null,null,null,null,"Coincident"]
[null,null,"ADJUSTMENTS - EMBEDDED GENERATION","MW","Non-coincident"]
[null,null,null,null,"Coincident"]
[null,null,"WEATHER CORRECTED MD 10% POE","MW","Non-coincident"]
[null,null,null,null,"Coincident"]
[null,null,"WEATHER CORRECTED MD 10% POE","MVA","Non-coincident"]
[null,null,null,null,"Coincident"]
[null,null,"WEATHER CORRECTED MD 50% POE","MW","Non-coincident"]
[null,null,null,null,"Coincident"]
[null,null,"WEATHER CORRECTED MD 50% POE","MVA","Non-coincident"]
[null,null,null,null,"Coincident"]
[null,"NSP to enter name","CONNECTION POINT RATING","MVA","Non-coincident"]
[null,null,null,null,"Coincident"]
[null,null,"WINTER/SUMMER PEAKING",null,"Non-coincident"]
[null,null,null,null,"Coincident"]
[null,null,"ADJUSTMENTS - EMBEDDED GENERATION","MW","Non-coincident"]
[null,null,null,null,"Coincident"]
[null,null,"WEATHER CORRECTED MD 10% POE","MW","Non-coincident"]
[null,null,null,null,"Coincident"]
[null,null,"WEATHER CORRECTED MD 10% POE","MVA","Non-coincident"]
[null,null,null,null,"Coincident"]
[null,null,"WEATHER CORRECTED MD 50% POE","MW","Non-coincident"]
[null,null,null,null,"Coincident"]
[null,null,"WEATHER CORRECTED MD 50% POE","MVA","Non-coincident"]
[null,null,null,null,"Coincident"]
[null,"NSP to enter name","CONNECTION POINT RATING","MVA","Non-coincident"]
[null,null,null,null,"Coincident"]
[null,null,"WINTER/SUMMER PEAKING",null,"Non-coincident"]
[null,null,null,null,"Coincident"]
[null,null,"ADJUSTMENTS - EMBEDDED GENERATION","MW","Non-coincident"]
[null,null,null,null,"Coincident"]
[null,null,"WEATHER CORRECTED MD 10% POE","MW","Non-coincident"]
[null,null,null,null,"Coincident"]
[null,null,"WEATHER CORRECTED MD 10% POE","MVA","Non-coincident"]
[null,null,null,null,"Coincident"]
[null,null,"WEATHER CORRECTED MD 50% POE","MW","Non-coincident"]
[null,null,null,null,"Coincident"]
[null,null,"WEATHER CORRECTED MD 50% POE","MVA","Non-coincident"]
[null,null,null,null,"Coincident"]
[null,"NSP to enter name","CONNECTION POINT RATING","MVA","Non-coincident"]
[null,null,null,null,"Coincident"]
[null,null,"WINTER/SUMMER PEAKING",null,"Non-coincident"]
[null,null,null,null,"Coincident"]
[null,null,"ADJUSTMENTS - EMBEDDED GENERATION","MW","Non-coincident"]
[null,null,null,null,"Coincident"]
[null,null,"WEATHER CORRECTED MD 10% POE","MW","Non-coincident"]
[null,null,null,null,"Coincident"]
[null,null,"WEATHER CORRECTED MD 10% POE","MVA","Non-coincident"]
[null,null,null,null,"Coincident"]
[null,null,"WEATHER CORRECTED MD 50% POE","MW","Non-coincident"]
[null,null,null,null,"Coincident"]
[null,null,"WEATHER CORRECTED MD 50% POE","MVA","Non-coincident"]
[null,null,null,null,"Coincident"]
[null,"NSP to enter name","CONNECTION POINT RATING","MVA","Non-coincident"]
[null,null,null,null,"Coincident"]
[null,null,"WINTER/SUMMER PEAKING",null,"Non-coincident"]
[null,null,null,null,"Coincident"]
[null,null,"ADJUSTMENTS - EMBEDDED GENERATION","MW","Non-coincident"]
[null,null,null,null,"Coincident"]
[null,null,"WEATHER CORRECTED MD 10% POE","MW","Non-coincident"]
[null,null,null,null,"Coincident"]
[null,null,"WEATHER CORRECTED MD 10% POE","MVA","Non-coincident"]
[null,null,null,null,"Coincident"]
[null,null,"WEATHER CORRECTED MD 50% POE","MW","Non-coincident"]
[null,null,null,null,"Coincident"]
[null,null,"WEATHER CORRECTED MD 50% POE","MVA","Non-coincident"]
[null,null,null,null,"Coincident"]
[null,"NSP to enter name","CONNECTION POINT RATING","MVA","Non-coincident"]
[null,null,null,null,"Coincident"]
[null,null,"WINTER/SUMMER PEAKING",null,"Non-coincident"]
[null,null,null,null,"Coincident"]
[null,null,"ADJUSTMENTS - EMBEDDED GENERATION","MW","Non-coincident"]
[null,null,null,null,"Coincident"]
[null,null,"WEATHER CORRECTED MD 10% POE","MW","Non-coincident"]
[null,null,null,null,"Coincident"]
[null,null,"WEATHER CORRECTED MD 10% POE","MVA","Non-coincident"]
[null,null,null,null,"Coincident"]
[null,null,"WEATHER CORRECTED MD 50% POE","MW","Non-coincident"]
[null,null,null,null,"Coincident"]
[null,null,"WEATHER CORRECTED MD 50% POE","MVA","Non-coincident"]
[null,null,null,null,"Coincident"]
[null,"NSP to enter name","CONNECTION POINT RATING","MVA","Non-coincident"]
[null,null,null,null,"Coincident"]
[null,null,"WINTER/SUMMER PEAKING",null,"Non-coincident"]
[null,null,null,null,"Coincident"]
[null,null,"ADJUSTMENTS - EMBEDDED GENERATION","MW","Non-coincident"]
[null,null,null,null,"Coincident"]
[null,null,"WEATHER CORRECTED MD 10% POE","MW","Non-coincident"]
[null,null,null,null,"Coincident"]
[null,null,"WEATHER CORRECTED MD 10% POE","MVA","Non-coincident"]
[null,null,null,null,"Coincident"]
[null,null,"WEATHER CORRECTED MD 50% POE","MW","Non-coincident"]
[null,null,null,null,"Coincident"]
[null,null,"WEATHER CORRECTED MD 50% POE","MVA","Non-coincident"]
[null,null,null,null,"Coincident"]
[null,"NSP to enter name","CONNECTION POINT RATING","MVA","Non-coincident"]
[null,null,null,null,"Coincident"]
[null,null,"WINTER/SUMMER PEAKING",null,"Non-coincident"]
[null,null,null,null,"Coincident"]
[null,null,"ADJUSTMENTS - EMBEDDED GENERATION","MW","Non-coincident"]
[null,null,null,null,"Coincident"]
[null,null,"WEATHER CORRECTED MD 10% POE","MW","Non-coincident"]
[null,null,null,null,"Coincident"]
[null,null,"WEATHER CORRECTED MD 10% POE","MVA","Non-coincident"]
[null,null,null,null,"Coincident"]
[null,null,"WEATHER CORRECTED MD 50% POE","MW","Non-coincident"]
[null,null,null,null,"Coincident"]
[null,null,"WEATHER CORRECTED MD 50% POE","MVA","Non-coincident"]
[null,null,null,null,"Coincident"]
[null,"NSP to enter name","CONNECTION POINT RATING","MVA","Non-coincident"]
[null,null,null,null,"Coincident"]
[null,null,"WINTER/SUMMER PEAKING",null,"Non-coincident"]
[null,null,null,null,"Coincident"]
[null,null,"ADJUSTMENTS - EMBEDDED GENERATION","MW","Non-coincident"]
[null,null,null,null,"Coincident"]
[null,null,"WEATHER CORRECTED MD 10% POE","MW","Non-coincident"]
[null,null,null,null,"Coincident"]
[null,null,"WEATHER CORRECTED MD 10% POE","MVA","Non-coincident"]
[null,null,null,null,"Coincident"]
[null,null,"WEATHER CORRECTED MD 50% POE","MW","Non-coincident"]
[null,null,null,null,"Coincident"]
[null,null,"WEATHER CORRECTED MD 50% POE","MVA","Non-coincident"]
[null,null,null,null,"Coincident"]
[null,"NSP to enter name","CONNECTION POINT RATING","MVA","Non-coincident"]
[null,null,null,null,"Coincident"]
[null,null,"WINTER/SUMMER PEAKING",null,"Non-coincident"]
[null,null,null,null,"Coincident"]
[null,null,"ADJUSTMENTS - EMBEDDED GENERATION","MW","Non-coincident"]
[null,null,null,null,"Coincident"]
[null,null,"WEATHER CORRECTED MD 10% POE","MW","Non-coincident"]
[null,null,null,null,"Coincident"]
[null,null,"WEATHER CORRECTED MD 10% POE","MVA","Non-coincident"]
[null,null,null,null,"Coincident"]
[null,null,"WEATHER CORRECTED MD 50% POE","MW","Non-coincident"]
[null,null,null,null,"Coincident"]
[null,null,"WEATHER CORRECTED MD 50% POE","MVA","Non-coincident"]
[null,null,null,null,"Coincident"]
[null,"NSP to enter name","CONNECTION POINT RATING","MVA","Non-coincident"]
[null,null,null,null,"Coincident"]
[null,null,"WINTER/SUMMER PEAKING",null,"Non-coincident"]
[null,null,null,null,"Coincident"]
[null,null,"ADJUSTMENTS - EMBEDDED GENERATION","MW","Non-coincident"]
[null,null,null,null,"Coincident"]
[null,null,"WEATHER CORRECTED MD 10% POE","MW","Non-coincident"]
[null,null,null,null,"Coincident"]
[null,null,"WEATHER CORRECTED MD 10% POE","MVA","Non-coincident"]
[null,null,null,null,"Coincident"]
[null,null,"WEATHER CORRECTED MD 50% POE","MW","Non-coincident"]
[null,null,null,null,"Coincident"]
[null,null,"WEATHER CORRECTED MD 50% POE","MVA","Non-coincident"]
[null,null,null,null,"Coincident"]
[null,"NSP to enter name","CONNECTION POINT RATING","MVA","Non-coincident"]
[null,null,null,null,"Coincident"]
[null,null,"WINTER/SUMMER PEAKING",null,"Non-coincident"]
[null,null,null,null,"Coincident"]
[null,null,"ADJUSTMENTS - EMBEDDED GENERATION","MW","Non-coincident"]
[null,null,null,null,"Coincident"]
[null,null,"WEATHER CORRECTED MD 10% POE","MW","Non-coincident"]
[null,null,null,null,"Coincident"]
[null,null,"WEATHER CORRECTED MD 10% POE","MVA","Non-coincident"]
[null,null,null,null,"Coincident"]
[null,null,"WEATHER CORRECTED MD 50% POE","MW","Non-coincident"]
[null,null,null,null,"Coincident"]
[null,null,"WEATHER CORRECTED MD 50% POE","MVA","Non-coincident"]
[null,null,null,null,"Coincident"]
[null,"NSP to enter name","CONNECTION POINT RATING","MVA","Non-coincident"]
[null,null,null,null,"Coincident"]
[null,null,"WINTER/SUMMER PEAKING",null,"Non-coincident"]
[null,null,null,null,"Coincident"]
[null,null,"ADJUSTMENTS - EMBEDDED GENERATION","MW","Non-coincident"]
[null,null,null,null,"Coincident"]
[null,null,"WEATHER CORRECTED MD 10% POE","MW","Non-coincident"]
[null,null,null,null,"Coincident"]
[null,null,"WEATHER CORRECTED MD 10% POE","MVA","Non-coincident"]
[null,null,null,null,"Coincident"]
[null,null,"WEATHER CORRECTED MD 50% POE","MW","Non-coincident"]
[null,null,null,null,"Coincident"]
[null,null,"WEATHER CORRECTED MD 50% POE","MVA","Non-coincident"]
[null,null,null,null,"Coincident"]
[null,"NSP to enter name","CONNECTION POINT RATING","MVA","Non-coincident"]
[null,null,null,null,"Coincident"]
[null,null,"WINTER/SUMMER PEAKING",null,"Non-coincident"]
[null,null,null,null,"Coincident"]
[null,null,"ADJUSTMENTS - EMBEDDED GENERATION","MW","Non-coincident"]
[null,null,null,null,"Coincident"]
[null,null,"WEATHER CORRECTED MD 10% POE","MW","Non-coincident"]
[null,null,null,null,"Coincident"]
[null,null,"WEATHER CORRECTED MD 10% POE","MVA","Non-coincident"]
[null,null,null,null,"Coincident"]
[null,null,"WEATHER CORRECTED MD 50% POE","MW","Non-coincident"]
[null,null,null,null,"Coincident"]
[null,null,"WEATHER CORRECTED MD 50% POE","MVA","Non-coincident"]
[null,null,null,null,"Coincident"]
[null,"NSP to enter name","CONNECTION POINT RATING","MVA","Non-coincident"]
[null,null,null,null,"Coincident"]
[null,null,"WINTER/SUMMER PEAKING",null,"Non-coincident"]
[null,null,null,null,"Coincident"]
[null,null,"ADJUSTMENTS - EMBEDDED GENERATION","MW","Non-coincident"]
[null,null,null,null,"Coincident"]
[null,null,"WEATHER CORRECTED MD 10% POE","MW","Non-coincident"]
[null,null,null,null,"Coincident"]
[null,null,"WEATHER CORRECTED MD 10% POE","MVA","Non-coincident"]
[null,null,null,null,"Coincident"]
[null,null,"WEATHER CORRECTED MD 50% POE","MW","Non-coincident"]
[null,null,null,null,"Coincident"]
[null,null,"WEATHER CORRECTED MD 50% POE","MVA","Non-coincident"]
[null,null,null,null,"Coincident"]
[null,"NSP to enter name","CONNECTION POINT RATING","MVA","Non-coincident"]
[null,null,null,null,"Coincident"]
[null,null,"WINTER/SUMMER PEAKING",null,"Non-coincident"]
[null,null,null,null,"Coincident"]
[null,null,"ADJUSTMENTS - EMBEDDED GENERATION","MW","Non-coincident"]
[null,null,null,null,"Coincident"]
[null,null,"WEATHER CORRECTED MD 10% POE","MW","Non-coincident"]
[null,null,null,null,"Coincident"]
[null,null,"WEATHER CORRECTED MD 10% POE","MVA","Non-coincident"]
[null,null,null,null,"Coincident"]
[null,null,"WEATHER CORRECTED MD 50% POE","MW","Non-coincident"]
[null,null,null,null,"Coincident"]
[null,null,"WEATHER CORRECTED MD 50% POE","MVA","Non-coincident"]
[null,null,null,null,"Coincident"]
[null,"NSP to enter name","CONNECTION POINT RATING","MVA","Non-coincident"]
[null,null,null,null,"Coincident"]
[null,null,"WINTER/SUMMER PEAKING",null,"Non-coincident"]
[null,null,null,null,"Coincident"]
[null,null,"ADJUSTMENTS - EMBEDDED GENERATION","MW","Non-coincident"]
[null,null,null,null,"Coincident"]
[null,null,"WEATHER CORRECTED MD 10% POE","MW","Non-coincident"]
[null,null,null,null,"Coincident"]
[null,null,"WEATHER CORRECTED MD 10% POE","MVA","Non-coincident"]
[null,null,null,null,"Coincident"]
[null,null,"WEATHER CORRECTED MD 50% POE","MW","Non-coincident"]
[null,null,null,null,"Coincident"]
[null,null,"WEATHER CORRECTED MD 50% POE","MVA","Non-coincident"]
[null,null,null,null,"Coincident"]
[null,"NSP to enter name","CONNECTION POINT RATING","MVA","Non-coincident"]
[null,null,null,null,"Coincident"]
[null,null,"WINTER/SUMMER PEAKING",null,"Non-coincident"]
[null,null,null,null,"Coincident"]
[null,null,"ADJUSTMENTS - EMBEDDED GENERATION","MW","Non-coincident"]
[null,null,null,null,"Coincident"]
[null,null,"WEATHER CORRECTED MD 10% POE","MW","Non-coincident"]
[null,null,null,null,"Coincident"]
[null,null,"WEATHER CORRECTED MD 10% POE","MVA","Non-coincident"]
[null,null,null,null,"Coincident"]
[null,null,"WEATHER CORRECTED MD 50% POE","MW","Non-coincident"]
[null,null,null,null,"Coincident"]
[null,null,"WEATHER CORRECTED MD 50% POE","MVA","Non-coincident"]
[null,null,null,null,"Coincident"]
[null,"NSP to enter name","CONNECTION POINT RATING","MVA","Non-coincident"]
[null,null,null,null,"Coincident"]
[null,null,"WINTER/SUMMER PEAKING",null,"Non-coincident"]
[null,null,null,null,"Coincident"]
[null,null,"ADJUSTMENTS - EMBEDDED GENERATION","MW","Non-coincident"]
[null,null,null,null,"Coincident"]
[null,null,"WEATHER CORRECTED MD 10% POE","MW","Non-coincident"]
[null,null,null,null,"Coincident"]
[null,null,"WEATHER CORRECTED MD 10% POE","MVA","Non-coincident"]
[null,null,null,null,"Coincident"]
[null,null,"WEATHER CORRECTED MD 50% POE","MW","Non-coincident"]
[null,null,null,null,"Coincident"]
[null,null,"WEATHER CORRECTED MD 50% POE","MVA","Non-coincident"]
[null,null,null,null,"Coincident"]
[null,"NSP to enter name","CONNECTION POINT RATING","MVA","Non-coincident"]
[null,null,null,null,"Coincident"]
[null,null,"WINTER/SUMMER PEAKING",null,"Non-coincident"]
[null,null,null,null,"Coincident"]
[null,null,"ADJUSTMENTS - EMBEDDED GENERATION","MW","Non-coincident"]
[null,null,null,null,"Coincident"]
[null,null,"WEATHER CORRECTED MD 10% POE","MW","Non-coincident"]
[null,null,null,null,"Coincident"]
[null,null,"WEATHER CORRECTED MD 10% POE","MVA","Non-coincident"]
[null,null,null,null,"Coincident"]
[null,null,"WEATHER CORRECTED MD 50% POE","MW","Non-coincident"]
[null,null,null,null,"Coincident"]
[null,null,"WEATHER CORRECTED MD 50% POE","MVA","Non-coincident"]
[null,null,null,null,"Coincident"]
[null,"NSP to enter name","CONNECTION POINT RATING","MVA","Non-coincident"]
[null,null,null,null,"Coincident"]
[null,null,"WINTER/SUMMER PEAKING",null,"Non-coincident"]
[null,null,null,null,"Coincident"]
[null,null,"ADJUSTMENTS - EMBEDDED GENERATION","MW","Non-coincident"]
[null,null,null,null,"Coincident"]
[null,null,"WEATHER CORRECTED MD 10% POE","MW","Non-coincident"]
[null,null,null,null,"Coincident"]
[null,null,"WEATHER CORRECTED MD 10% POE","MVA","Non-coincident"]
[null,null,null,null,"Coincident"]
[null,null,"WEATHER CORRECTED MD 50% POE","MW","Non-coincident"]
[null,null,null,null,"Coincident"]
[null,null,"WEATHER CORRECTED MD 50% POE","MVA","Non-coincident"]
[null,null,null,null,"Coincident"]
[null,"NSP to enter name","CONNECTION POINT RATING","MVA","Non-coincident"]
[null,null,null,null,"Coincident"]
[null,null,"WINTER/SUMMER PEAKING",null,"Non-coincident"]
[null,null,null,null,"Coincident"]
[null,null,"ADJUSTMENTS - EMBEDDED GENERATION","MW","Non-coincident"]
[null,null,null,null,"Coincident"]
[null,null,"WEATHER CORRECTED MD 10% POE","MW","Non-coincident"]
[null,null,null,null,"Coincident"]
[null,null,"WEATHER CORRECTED MD 10% POE","MVA","Non-coincident"]
[null,null,null,null,"Coincident"]
[null,null,"WEATHER CORRECTED MD 50% POE","MW","Non-coincident"]
[null,null,null,null,"Coincident"]
[null,null,"WEATHER CORRECTED MD 50% POE","MVA","Non-coincident"]
[null,null,null,null,"Coincident"]
[null,"NSP to enter name","CONNECTION POINT RATING","MVA","Non-coincident"]
[null,null,null,null,"Coincident"]
[null,null,"WINTER/SUMMER PEAKING",null,"Non-coincident"]
[null,null,null,null,"Coincident"]
[null,null,"ADJUSTMENTS - EMBEDDED GENERATION","MW","Non-coincident"]
[null,null,null,null,"Coincident"]
[null,null,"WEATHER CORRECTED MD 10% POE","MW","Non-coincident"]
[null,null,null,null,"Coincident"]
[null,null,"WEATHER CORRECTED MD 10% POE","MVA","Non-coincident"]
[null,null,null,null,"Coincident"]
[null,null,"WEATHER CORRECTED MD 50% POE","MW","Non-coincident"]
[null,null,null,null,"Coincident"]
[null,null,"WEATHER CORRECTED MD 50% POE","MVA","Non-coincident"]
[null,null,null,null,"Coincident"]
[null,"NSP to enter name","CONNECTION POINT RATING","MVA","Non-coincident"]
[null,null,null,null,"Coincident"]
[null,null,"WINTER/SUMMER PEAKING",null,"Non-coincident"]
[null,null,null,null,"Coincident"]
[null,null,"ADJUSTMENTS - EMBEDDED GENERATION","MW","Non-coincident"]
[null,null,null,null,"Coincident"]
[null,null,"WEATHER CORRECTED MD 10% POE","MW","Non-coincident"]
[null,null,null,null,"Coincident"]
[null,null,"WEATHER CORRECTED MD 10% POE","MVA","Non-coincident"]
[null,null,null,null,"Coincident"]
[null,null,"WEATHER CORRECTED MD 50% POE","MW","Non-coincident"]
[null,null,null,null,"Coincident"]
[null,null,"WEATHER CORRECTED MD 50% POE","MVA","Non-coincident"]
[null,null,null,null,"Coincident"]
[null,"NSP to enter name","CONNECTION POINT RATING","MVA","Non-coincident"]
[null,null,null,null,"Coincident"]
[null,null,"WINTER/SUMMER PEAKING",null,"Non-coincident"]
[null,null,null,null,"Coincident"]
[null,null,"ADJUSTMENTS - EMBEDDED GENERATION","MW","Non-coincident"]
[null,null,null,null,"Coincident"]
[null,null,"WEATHER CORRECTED MD 10% POE","MW","Non-coincident"]
[null,null,null,null,"Coincident"]
[null,null,"WEATHER CORRECTED MD 10% POE","MVA","Non-coincident"]
[null,null,null,null,"Coincident"]
[null,null,"WEATHER CORRECTED MD 50% POE","MW","Non-coincident"]
[null,null,null,null,"Coincident"]
[null,null,"WEATHER CORRECTED MD 50% POE","MVA","Non-coincident"]
[null,null,null,null,"Coincident"]
[null,"NSP to enter name","CONNECTION POINT RATING","MVA","Non-coincident"]
[null,null,null,null,"Coincident"]
[null,null,"WINTER/SUMMER PEAKING",null,"Non-coincident"]
[null,null,null,null,"Coincident"]
[null,null,"ADJUSTMENTS - EMBEDDED GENERATION","MW","Non-coincident"]
[null,null,null,null,"Coincident"]
[null,null,"WEATHER CORRECTED MD 10% POE","MW","Non-coincident"]
[null,null,null,null,"Coincident"]
[null,null,"WEATHER CORRECTED MD 10% POE","MVA","Non-coincident"]
[null,null,null,null,"Coincident"]
[null,null,"WEATHER CORRECTED MD 50% POE","MW","Non-coincident"]
[null,null,null,null,"Coincident"]
[null,null,"WEATHER CORRECTED MD 50% POE","MVA","Non-coincident"]
[null,null,null,null,"Coincident"]
[null,"NSP to enter name","CONNECTION POINT RATING","MVA","Non-coincident"]
[null,null,null,null,"Coincident"]
[null,null,"WINTER/SUMMER PEAKING",null,"Non-coincident"]
[null,null,null,null,"Coincident"]
[null,null,"ADJUSTMENTS - EMBEDDED GENERATION","MW","Non-coincident"]
[null,null,null,null,"Coincident"]
[null,null,"WEATHER CORRECTED MD 10% POE","MW","Non-coincident"]
[null,null,null,null,"Coincident"]
[null,null,"WEATHER CORRECTED MD 10% POE","MVA","Non-coincident"]
[null,null,null,null,"Coincident"]
[null,null,"WEATHER CORRECTED MD 50% POE","MW","Non-coincident"]
[null,null,null,null,"Coincident"]
[null,null,"WEATHER CORRECTED MD 50% POE","MVA","Non-coincident"]
[null,null,null,null,"Coincident"]
[null,"NSP to enter name","CONNECTION POINT RATING","MVA","Non-coincident"]
[null,null,null,null,"Coincident"]
[null,null,"WINTER/SUMMER PEAKING",null,"Non-coincident"]
[null,null,null,null,"Coincident"]
[null,null,"ADJUSTMENTS - EMBEDDED GENERATION","MW","Non-coincident"]
[null,null,null,null,"Coincident"]
[null,null,"WEATHER CORRECTED MD 10% POE","MW","Non-coincident"]
[null,null,null,null,"Coincident"]
[null,null,"WEATHER CORRECTED MD 10% POE","MVA","Non-coincident"]
[null,null,null,null,"Coincident"]
[null,null,"WEATHER CORRECTED MD 50% POE","MW","Non-coincident"]
[null,null,null,null,"Coincident"]
[null,null,"WEATHER CORRECTED MD 50% POE","MVA","Non-coincident"]
[null,null,null,null,"Coincident"]
[null,"NSP to enter name","CONNECTION POINT RATING","MVA","Non-coincident"]
[null,null,null,null,"Coincident"]
[null,null,"WINTER/SUMMER PEAKING",null,"Non-coincident"]
[null,null,null,null,"Coincident"]
[null,null,"ADJUSTMENTS - EMBEDDED GENERATION","MW","Non-coincident"]
[null,null,null,null,"Coincident"]
[null,null,"WEATHER CORRECTED MD 10% POE","MW","Non-coincident"]
[null,null,null,null,"Coincident"]
[null,null,"WEATHER CORRECTED MD 10% POE","MVA","Non-coincident"]
[null,null,null,null,"Coincident"]
[null,null,"WEATHER CORRECTED MD 50% POE","MW","Non-coincident"]
[null,null,null,null,"Coincident"]
[null,null,"WEATHER CORRECTED MD 50% POE","MVA","Non-coincident"]
[null,null,null,null,"Coincident"]
[null,"NSP to enter name","CONNECTION POINT RATING","MVA","Non-coincident"]
[null,null,null,null,"Coincident"]
[null,null,"WINTER/SUMMER PEAKING",null,"Non-coincident"]
[null,null,null,null,"Coincident"]
[null,null,"ADJUSTMENTS - EMBEDDED GENERATION","MW","Non-coincident"]
[null,null,null,null,"Coincident"]
[null,null,"WEATHER CORRECTED MD 10% POE","MW","Non-coincident"]
[null,null,null,null,"Coincident"]
[null,null,"WEATHER CORRECTED MD 10% POE","MVA","Non-coincident"]
[null,null,null,null,"Coincident"]
[null,null,"WEATHER CORRECTED MD 50% POE","MW","Non-coincident"]
[null,null,null,null,"Coincident"]
[null,null,"WEATHER CORRECTED MD 50% POE","MVA","Non-coincident"]
[null,null,null,null,"Coincident"]
[null,"NSP to enter name","CONNECTION POINT RATING","MVA","Non-coincident"]
[null,null,null,null,"Coincident"]
[null,null,"WINTER/SUMMER PEAKING",null,"Non-coincident"]
[null,null,null,null,"Coincident"]
[null,null,"ADJUSTMENTS - EMBEDDED GENERATION","MW","Non-coincident"]
[null,null,null,null,"Coincident"]
[null,null,"WEATHER CORRECTED MD 10% POE","MW","Non-coincident"]
[null,null,null,null,"Coincident"]
[null,null,"WEATHER CORRECTED MD 10% POE","MVA","Non-coincident"]
[null,null,null,null,"Coincident"]
[null,null,"WEATHER CORRECTED MD 50% POE","MW","Non-coincident"]
[null,null,null,null,"Coincident"]
[null,null,"WEATHER CORRECTED MD 50% POE","MVA","Non-coincident"]
[null,null,null,null,"Coincident"]
[null,"NSP to enter name","CONNECTION POINT RATING","MVA","Non-coincident"]
[null,null,null,null,"Coincident"]
[null,null,"WINTER/SUMMER PEAKING",null,"Non-coincident"]
[null,null,null,null,"Coincident"]
[null,null,"ADJUSTMENTS - EMBEDDED GENERATION","MW","Non-coincident"]
[null,null,null,null,"Coincident"]
[null,null,"WEATHER CORRECTED MD 10% POE","MW","Non-coincident"]
[null,null,null,null,"Coincident"]
[null,null,"WEATHER CORRECTED MD 10% POE","MVA","Non-coincident"]
[null,null,null,null,"Coincident"]
[null,null,"WEATHER CORRECTED MD 50% POE","MW","Non-coincident"]
[null,null,null,null,"Coincident"]
[null,null,"WEATHER CORRECTED MD 50% POE","MVA","Non-coincident"]
[null,null,null,null,"Coincident"]
[null,"NSP to enter name","CONNECTION POINT RATING","MVA","Non-coincident"]
[null,null,null,null,"Coincident"]
[null,null,"WINTER/SUMMER PEAKING",null,"Non-coincident"]
[null,null,null,null,"Coincident"]
[null,null,"ADJUSTMENTS - EMBEDDED GENERATION","MW","Non-coincident"]
[null,null,null,null,"Coincident"]
[null,null,"WEATHER CORRECTED MD 10% POE","MW","Non-coincident"]
[null,null,null,null,"Coincident"]
[null,null,"WEATHER CORRECTED MD 10% POE","MVA","Non-coincident"]
[null,null,null,null,"Coincident"]
[null,null,"WEATHER CORRECTED MD 50% POE","MW","Non-coincident"]
[null,null,null,null,"Coincident"]
[null,null,"WEATHER CORRECTED MD 50% POE","MVA","Non-coincident"]
[null,null,null,null,"Coincident"]
[null,"NSP to enter name","CONNECTION POINT RATING","MVA","Non-coincident"]
[null,null,null,null,"Coincident"]
[null,null,"WINTER/SUMMER PEAKING",null,"Non-coincident"]
[null,null,null,null,"Coincident"]
[null,null,"ADJUSTMENTS - EMBEDDED GENERATION","MW","Non-coincident"]
[null,null,null,null,"Coincident"]
[null,null,"WEATHER CORRECTED MD 10% POE","MW","Non-coincident"]
[null,null,null,null,"Coincident"]
[null,null,"WEATHER CORRECTED MD 10% POE","MVA","Non-coincident"]
[null,null,null,null,"Coincident"]
[null,null,"WEATHER CORRECTED MD 50% POE","MW","Non-coincident"]
[null,null,null,null,"Coincident"]
[null,null,"WEATHER CORRECTED MD 50% POE","MVA","Non-coincident"]
[null,null,null,null,"Coincident"]
[null,"NSP to enter name","CONNECTION POINT RATING","MVA","Non-coincident"]
[null,null,null,null,"Coincident"]
[null,null,"WINTER/SUMMER PEAKING",null,"Non-coincident"]
[null,null,null,null,"Coincident"]
[null,null,"ADJUSTMENTS - EMBEDDED GENERATION","MW","Non-coincident"]
[null,null,null,null,"Coincident"]
[null,null,"WEATHER CORRECTED MD 10% POE","MW","Non-coincident"]
[null,null,null,null,"Coincident"]
[null,null,"WEATHER CORRECTED MD 10% POE","MVA","Non-coincident"]
[null,null,null,null,"Coincident"]
[null,null,"WEATHER CORRECTED MD 50% POE","MW","Non-coincident"]
[null,null,null,null,"Coincident"]
[null,null,"WEATHER CORRECTED MD 50% POE","MVA","Non-coincident"]
[null,null,null,null,"Coincident"]
[null,"NSP to enter name","CONNECTION POINT RATING","MVA","Non-coincident"]
[null,null,null,null,"Coincident"]
[null,null,"WINTER/SUMMER PEAKING",null,"Non-coincident"]
[null,null,null,null,"Coincident"]
[null,null,"ADJUSTMENTS - EMBEDDED GENERATION","MW","Non-coincident"]
[null,null,null,null,"Coincident"]
[null,null,"WEATHER CORRECTED MD 10% POE","MW","Non-coincident"]
[null,null,null,null,"Coincident"]
[null,null,"WEATHER CORRECTED MD 10% POE","MVA","Non-coincident"]
[null,null,null,null,"Coincident"]
[null,null,"WEATHER CORRECTED MD 50% POE","MW","Non-coincident"]
[null,null,null,null,"Coincident"]
[null,null,"WEATHER CORRECTED MD 50% POE","MVA","Non-coincident"]
[null,null,null,null,"Coincident"]
[null,"NSP to enter name","CONNECTION POINT RATING","MVA","Non-coincident"]
[null,null,null,null,"Coincident"]
[null,null,"WINTER/SUMMER PEAKING",null,"Non-coincident"]
[null,null,null,null,"Coincident"]
[null,null,"ADJUSTMENTS - EMBEDDED GENERATION","MW","Non-coincident"]
[null,null,null,null,"Coincident"]
[null,null,"WEATHER CORRECTED MD 10% POE","MW","Non-coincident"]
[null,null,null,null,"Coincident"]
[null,null,"WEATHER CORRECTED MD 10% POE","MVA","Non-coincident"]
[null,null,null,null,"Coincident"]
[null,null,"WEATHER CORRECTED MD 50% POE","MW","Non-coincident"]
[null,null,null,null,"Coincident"]
[null,null,"WEATHER CORRECTED MD 50% POE","MVA","Non-coincident"]
[null,null,null,null,"Coincident"]
[null,"NSP to enter name","CONNECTION POINT RATING","MVA","Non-coincident"]
[null,null,null,null,"Coincident"]
[null,null,"WINTER/SUMMER PEAKING",null,"Non-coincident"]
[null,null,null,null,"Coincident"]
[null,null,"ADJUSTMENTS - EMBEDDED GENERATION","MW","Non-coincident"]
[null,null,null,null,"Coincident"]
[null,null,"WEATHER CORRECTED MD 10% POE","MW","Non-coincident"]
[null,null,null,null,"Coincident"]
[null,null,"WEATHER CORRECTED MD 10% POE","MVA","Non-coincident"]
[null,null,null,null,"Coincident"]
[null,null,"WEATHER CORRECTED MD 50% POE","MW","Non-coincident"]
[null,null,null,null,"Coincident"]
[null,null,"WEATHER CORRECTED MD 50% POE","MVA","Non-coincident"]
[null,null,null,null,"Coincident"]
[null,"NSP to enter name","CONNECTION POINT RATING","MVA","Non-coincident"]
[null,null,null,null,"Coincident"]
[null,null,"WINTER/SUMMER PEAKING",null,"Non-coincident"]
[null,null,null,null,"Coincident"]
[null,null,"ADJUSTMENTS - EMBEDDED GENERATION","MW","Non-coincident"]
[null,null,null,null,"Coincident"]
[null,null,"WEATHER CORRECTED MD 10% POE","MW","Non-coincident"]
[null,null,null,null,"Coincident"]
[null,null,"WEATHER CORRECTED MD 10% POE","MVA","Non-coincident"]
[null,null,null,null,"Coincident"]
[null,null,"WEATHER CORRECTED MD 50% POE","MW","Non-coincident"]
[null,null,null,null,"Coincident"]
[null,null,"WEATHER CORRECTED MD 50% POE","MVA","Non-coincident"]
[null,null,null,null,"Coincident"]
[null,"NSP to enter name","CONNECTION POINT RATING","MVA","Non-coincident"]
[null,null,null,null,"Coincident"]
[null,null,"WINTER/SUMMER PEAKING",null,"Non-coincident"]
[null,null,null,null,"Coincident"]
[null,null,"ADJUSTMENTS - EMBEDDED GENERATION","MW","Non-coincident"]
[null,null,null,null,"Coincident"]
[null,null,"WEATHER CORRECTED MD 10% POE","MW","Non-coincident"]
[null,null,null,null,"Coincident"]
[null,null,"WEATHER CORRECTED MD 10% POE","MVA","Non-coincident"]
[null,null,null,null,"Coincident"]
[null,null,"WEATHER CORRECTED MD 50% POE","MW","Non-coincident"]
[null,null,null,null,"Coincident"]
[null,null,"WEATHER CORRECTED MD 50% POE","MVA","Non-coincident"]
[null,null,null,null,"Coincident"]
[null,"NSP to enter name","CONNECTION POINT RATING","MVA","Non-coincident"]
[null,null,null,null,"Coincident"]
[null,null,"WINTER/SUMMER PEAKING",null,"Non-coincident"]
[null,null,null,null,"Coincident"]
[null,null,"ADJUSTMENTS - EMBEDDED GENERATION","MW","Non-coincident"]
[null,null,null,null,"Coincident"]
[null,null,"WEATHER CORRECTED MD 10% POE","MW","Non-coincident"]
[null,null,null,null,"Coincident"]
[null,null,"WEATHER CORRECTED MD 10% POE","MVA","Non-coincident"]
[null,null,null,null,"Coincident"]
[null,null,"WEATHER CORRECTED MD 50% POE","MW","Non-coincident"]
[null,null,null,null,"Coincident"]
[null,null,"WEATHER CORRECTED MD 50% POE","MVA","Non-coincident"]
[null,null,null,null,"Coincident"]
[null,"NSP to enter name","CONNECTION POINT RATING","MVA","Non-coincident"]
[null,null,null,null,"Coincident"]
[null,null,"WINTER/SUMMER PEAKING",null,"Non-coincident"]
[null,null,null,null,"Coincident"]
[null,null,"ADJUSTMENTS - EMBEDDED GENERATION","MW","Non-coincident"]
[null,null,null,null,"Coincident"]
[null,null,"WEATHER CORRECTED MD 10% POE","MW","Non-coincident"]
[null,null,null,null,"Coincident"]
[null,null,"WEATHER CORRECTED MD 10% POE","MVA","Non-coincident"]
[null,null,null,null,"Coincident"]
[null,null,"WEATHER CORRECTED MD 50% POE","MW","Non-coincident"]
[null,null,null,null,"Coincident"]
[null,null,"WEATHER CORRECTED MD 50% POE","MVA","Non-coincident"]
[null,null,null,null,"Coincident"]
[null,"NSP to enter name","CONNECTION POINT RATING","MVA","Non-coincident"]
[null,null,null,null,"Coincident"]
[null,null,"WINTER/SUMMER PEAKING",null,"Non-coincident"]
[null,null,null,null,"Coincident"]
[null,null,"ADJUSTMENTS - EMBEDDED GENERATION","MW","Non-coincident"]
[null,null,null,null,"Coincident"]
[null,null,"WEATHER CORRECTED MD 10% POE","MW","Non-coincident"]
[null,null,null,null,"Coincident"]
[null,null,"WEATHER CORRECTED MD 10% POE","MVA","Non-coincident"]
[null,null,null,null,"Coincident"]
[null,null,"WEATHER CORRECTED MD 50% POE","MW","Non-coincident"]
[null,null,null,null,"Coincident"]
[null,null,"WEATHER CORRECTED MD 50% POE","MVA","Non-coincident"]
[null,null,null,null,"Coincident"]
[null,"NSP to enter name","CONNECTION POINT RATING","MVA","Non-coincident"]
[null,null,null,null,"Coincident"]
[null,null,"WINTER/SUMMER PEAKING",null,"Non-coincident"]
[null,null,null,null,"Coincident"]
[null,null,"ADJUSTMENTS - EMBEDDED GENERATION","MW","Non-coincident"]
[null,null,null,null,"Coincident"]
[null,null,"WEATHER CORRECTED MD 10% POE","MW","Non-coincident"]
[null,null,null,null,"Coincident"]
[null,null,"WEATHER CORRECTED MD 10% POE","MVA","Non-coincident"]
[null,null,null,null,"Coincident"]
[null,null,"WEATHER CORRECTED MD 50% POE","MW","Non-coincident"]
[null,null,null,null,"Coincident"]
[null,null,"WEATHER CORRECTED MD 50% POE","MVA","Non-coincident"]
[null,null,null,null,"Coincident"]
[null,"NSP to enter name","CONNECTION POINT RATING","MVA","Non-coincident"]
[null,null,null,null,"Coincident"]
[null,null,"WINTER/SUMMER PEAKING",null,"Non-coincident"]
[null,null,null,null,"Coincident"]
[null,null,"ADJUSTMENTS - EMBEDDED GENERATION","MW","Non-coincident"]
[null,null,null,null,"Coincident"]
[null,null,"WEATHER CORRECTED MD 10% POE","MW","Non-coincident"]
[null,null,null,null,"Coincident"]
[null,null,"WEATHER CORRECTED MD 10% POE","MVA","Non-coincident"]
[null,null,null,null,"Coincident"]
[null,null,"WEATHER CORRECTED MD 50% POE","MW","Non-coincident"]
[null,null,null,null,"Coincident"]
[null,null,"WEATHER CORRECTED MD 50% POE","MVA","Non-coincident"]
[null,null,null,null,"Coincident"]
[null,"NSP to enter name","CONNECTION POINT RATING","MVA","Non-coincident"]
[null,null,null,null,"Coincident"]
[null,null,"WINTER/SUMMER PEAKING",null,"Non-coincident"]
[null,null,null,null,"Coincident"]
[null,null,"ADJUSTMENTS - EMBEDDED GENERATION","MW","Non-coincident"]
[null,null,null,null,"Coincident"]
[null,null,"WEATHER CORRECTED MD 10% POE","MW","Non-coincident"]
[null,null,null,null,"Coincident"]
[null,null,"WEATHER CORRECTED MD 10% POE","MVA","Non-coincident"]
[null,null,null,null,"Coincident"]
[null,null,"WEATHER CORRECTED MD 50% POE","MW","Non-coincident"]
[null,null,null,null,"Coincident"]
[null,null,"WEATHER CORRECTED MD 50% POE","MVA","Non-coincident"]
[null,null,null,null,"Coincident"]
[null,"NSP to enter name","CONNECTION POINT RATING","MVA","Non-coincident"]
[null,null,null,null,"Coincident"]
[null,null,"WINTER/SUMMER PEAKING",null,"Non-coincident"]
[null,null,null,null,"Coincident"]
[null,null,"ADJUSTMENTS - EMBEDDED GENERATION","MW","Non-coincident"]
[null,null,null,null,"Coincident"]
[null,null,"WEATHER CORRECTED MD 10% POE","MW","Non-coincident"]
[null,null,null,null,"Coincident"]
[null,null,"WEATHER CORRECTED MD 10% POE","MVA","Non-coincident"]
[null,null,null,null,"Coincident"]
[null,null,"WEATHER CORRECTED MD 50% POE","MW","Non-coincident"]
[null,null,null,null,"Coincident"]
[null,null,"WEATHER CORRECTED MD 50% POE","MVA","Non-coincident"]
[null,null,null,null,"Coincident"]
[null,"NSP to enter name","CONNECTION POINT RATING","MVA","Non-coincident"]
[null,null,null,null,"Coincident"]
[null,null,"WINTER/SUMMER PEAKING",null,"Non-coincident"]
[null,null,null,null,"Coincident"]
[null,null,"ADJUSTMENTS - EMBEDDED GENERATION","MW","Non-coincident"]
[null,null,null,null,"Coincident"]
[null,null,"WEATHER CORRECTED MD 10% POE","MW","Non-coincident"]
[null,null,null,null,"Coincident"]
[null,null,"WEATHER CORRECTED MD 10% POE","MVA","Non-coincident"]
[null,null,null,null,"Coincident"]
[null,null,"WEATHER CORRECTED MD 50% POE","MW","Non-coincident"]
[null,null,null,null,"Coincident"]
[null,null,"WEATHER CORRECTED MD 50% POE","MVA","Non-coincident"]
[null,null,null,null,"Coincident"]
[null,"NSP to enter name","CONNECTION POINT RATING","MVA","Non-coincident"]
[null,null,null,null,"Coincident"]
[null,null,"WINTER/SUMMER PEAKING",null,"Non-coincident"]
[null,null,null,null,"Coincident"]
[null,null,"ADJUSTMENTS - EMBEDDED GENERATION","MW","Non-coincident"]
[null,null,null,null,"Coincident"]
[null,null,"WEATHER CORRECTED MD 10% POE","MW","Non-coincident"]
[null,null,null,null,"Coincident"]
[null,null,"WEATHER CORRECTED MD 10% POE","MVA","Non-coincident"]
[null,null,null,null,"Coincident"]
[null,null,"WEATHER CORRECTED MD 50% POE","MW","Non-coincident"]
[null,null,null,null,"Coincident"]
[null,null,"WEATHER CORRECTED MD 50% POE","MVA","Non-coincident"]
[null,null,null,null,"Coincident"]
[null,"NSP to enter name","CONNECTION POINT RATING","MVA","Non-coincident"]
[null,null,null,null,"Coincident"]
[null,null,"WINTER/SUMMER PEAKING",null,"Non-coincident"]
[null,null,null,null,"Coincident"]
[null,null,"ADJUSTMENTS - EMBEDDED GENERATION","MW","Non-coincident"]
[null,null,null,null,"Coincident"]
[null,null,"WEATHER CORRECTED MD 10% POE","MW","Non-coincident"]
[null,null,null,null,"Coincident"]
[null,null,"WEATHER CORRECTED MD 10% POE","MVA","Non-coincident"]
[null,null,null,null,"Coincident"]
[null,null,"WEATHER CORRECTED MD 50% POE","MW","Non-coincident"]
[null,null,null,null,"Coincident"]
[null,null,"WEATHER CORRECTED MD 50% POE","MVA","Non-coincident"]
[null,null,null,null,"Coincident"]
[null,"NSP to enter name","CONNECTION POINT RATING","MVA","Non-coincident"]
[null,null,null,null,"Coincident"]
[null,null,"WINTER/SUMMER PEAKING",null,"Non-coincident"]
[null,null,null,null,"Coincident"]
[null,null,"ADJUSTMENTS - EMBEDDED GENERATION","MW","Non-coincident"]
[null,null,null,null,"Coincident"]
[null,null,"WEATHER CORRECTED MD 10% POE","MW","Non-coincident"]
[null,null,null,null,"Coincident"]
[null,null,"WEATHER CORRECTED MD 10% POE","MVA","Non-coincident"]
[null,null,null,null,"Coincident"]
[null,null,"WEATHER CORRECTED MD 50% POE","MW","Non-coincident"]
[null,null,null,null,"Coincident"]
[null,null,"WEATHER CORRECTED MD 50% POE","MVA","Non-coincident"]
[null,null,null,null,"Coincident"]
[null,"NSP to enter name","CONNECTION POINT RATING","MVA","Non-coincident"]
[null,null,null,null,"Coincident"]
[null,null,"WINTER/SUMMER PEAKING",null,"Non-coincident"]
[null,null,null,null,"Coincident"]
[null,null,"ADJUSTMENTS - EMBEDDED GENERATION","MW","Non-coincident"]
[null,null,null,null,"Coincident"]
[null,null,"WEATHER CORRECTED MD 10% POE","MW","Non-coincident"]
[null,null,null,null,"Coincident"]
[null,null,"WEATHER CORRECTED MD 10% POE","MVA","Non-coincident"]
[null,null,null,null,"Coincident"]
[null,null,"WEATHER CORRECTED MD 50% POE","MW","Non-coincident"]
[null,null,null,null,"Coincident"]
[null,null,"WEATHER CORRECTED MD 50% POE","MVA","Non-coincident"]
[null,null,null,null,"Coincident"]
[null,"NSP to enter name","CONNECTION POINT RATING","MVA","Non-coincident"]
[null,null,null,null,"Coincident"]
[null,null,"WINTER/SUMMER PEAKING",null,"Non-coincident"]
[null,null,null,null,"Coincident"]
[null,null,"ADJUSTMENTS - EMBEDDED GENERATION","MW","Non-coincident"]
[null,null,null,null,"Coincident"]
[null,null,"WEATHER CORRECTED MD 10% POE","MW","Non-coincident"]
[null,null,null,null,"Coincident"]
[null,null,"WEATHER CORRECTED MD 10% POE","MVA","Non-coincident"]
[null,null,null,null,"Coincident"]
[null,null,"WEATHER CORRECTED MD 50% POE","MW","Non-coincident"]
[null,null,null,null,"Coincident"]
[null,null,"WEATHER CORRECTED MD 50% POE","MVA","Non-coincident"]
[null,null,null,null,"Coincident"]
[null,"NSP to enter name","CONNECTION POINT RATING","MVA","Non-coincident"]
[null,null,null,null,"Coincident"]
[null,null,"WINTER/SUMMER PEAKING",null,"Non-coincident"]
[null,null,null,null,"Coincident"]
[null,null,"ADJUSTMENTS - EMBEDDED GENERATION","MW","Non-coincident"]
[null,null,null,null,"Coincident"]
[null,null,"WEATHER CORRECTED MD 10% POE","MW","Non-coincident"]
[null,null,null,null,"Coincident"]
[null,null,"WEATHER CORRECTED MD 10% POE","MVA","Non-coincident"]
[null,null,null,null,"Coincident"]
[null,null,"WEATHER CORRECTED MD 50% POE","MW","Non-coincident"]
[null,null,null,null,"Coincident"]
[null,null,"WEATHER CORRECTED MD 50% POE","MVA","Non-coincident"]
[null,null,null,null,"Coincident"]
[null,"NSP to enter name","CONNECTION POINT RATING","MVA","Non-coincident"]
[null,null,null,null,"Coincident"]
[null,null,"WINTER/SUMMER PEAKING",null,"Non-coincident"]
[null,null,null,null,"Coincident"]
[null,null,"ADJUSTMENTS - EMBEDDED GENERATION","MW","Non-coincident"]
[null,null,null,null,"Coincident"]
[null,null,"WEATHER CORRECTED MD 10% POE","MW","Non-coincident"]
[null,null,null,null,"Coincident"]
[null,null,"WEATHER CORRECTED MD 10% POE","MVA","Non-coincident"]
[null,null,null,null,"Coincident"]
[null,null,"WEATHER CORRECTED MD 50% POE","MW","Non-coincident"]
[null,null,null,null,"Coincident"]
[null,null,"WEATHER CORRECTED MD 50% POE","MVA","Non-coincident"]
[null,null,null,null,"Coincident"]
[null,"NSP to enter name","CONNECTION POINT RATING","MVA","Non-coincident"]
[null,null,null,null,"Coincident"]
[null,null,"WINTER/SUMMER PEAKING",null,"Non-coincident"]
[null,null,null,null,"Coincident"]
[null,null,"ADJUSTMENTS - EMBEDDED GENERATION","MW","Non-coincident"]
[null,null,null,null,"Coincident"]
[null,null,"WEATHER CORRECTED MD 10% POE","MW","Non-coincident"]
[null,null,null,null,"Coincident"]
[null,null,"WEATHER CORRECTED MD 10% POE","MVA","Non-coincident"]
[null,null,null,null,"Coincident"]
[null,null,"WEATHER CORRECTED MD 50% POE","MW","Non-coincident"]
[null,null,null,null,"Coincident"]
[null,null,"WEATHER CORRECTED MD 50% POE","MVA","Non-coincident"]
[null,null,null,null,"Coincident"]
[null,"NSP to enter name","CONNECTION POINT RATING","MVA","Non-coincident"]
[null,null,null,null,"Coincident"]
[null,null,"WINTER/SUMMER PEAKING",null,"Non-coincident"]
[null,null,null,null,"Coincident"]
[null,null,"ADJUSTMENTS - EMBEDDED GENERATION","MW","Non-coincident"]
[null,null,null,null,"Coincident"]
[null,null,"WEATHER CORRECTED MD 10% POE","MW","Non-coincident"]
[null,null,null,null,"Coincident"]
[null,null,"WEATHER CORRECTED MD 10% POE","MVA","Non-coincident"]
[null,null,null,null,"Coincident"]
[null,null,"WEATHER CORRECTED MD 50% POE","MW","Non-coincident"]
[null,null,null,null,"Coincident"]
[null,null,"WEATHER CORRECTED MD 50% POE","MVA","Non-coincident"]
[null,null,null,null,"Coincident"]
[null,"NSP to enter name","CONNECTION POINT RATING","MVA","Non-coincident"]
[null,null,null,null,"Coincident"]
[null,null,"WINTER/SUMMER PEAKING",null,"Non-coincident"]
[null,null,null,null,"Coincident"]
[null,null,"ADJUSTMENTS - EMBEDDED GENERATION","MW","Non-coincident"]
[null,null,null,null,"Coincident"]
[null,null,"WEATHER CORRECTED MD 10% POE","MW","Non-coincident"]
[null,null,null,null,"Coincident"]
[null,null,"WEATHER CORRECTED MD 10% POE","MVA","Non-coincident"]
[null,null,null,null,"Coincident"]
[null,null,"WEATHER CORRECTED MD 50% POE","MW","Non-coincident"]
[null,null,null,null,"Coincident"]
[null,null,"WEATHER CORRECTED MD 50% POE","MVA","Non-coincident"]
[null,null,null,null,"Coincident"]
[null,"NSP to enter name","CONNECTION POINT RATING","MVA","Non-coincident"]
[null,null,null,null,"Coincident"]
[null,null,"WINTER/SUMMER PEAKING",null,"Non-coincident"]
[null,null,null,null,"Coincident"]
[null,null,"ADJUSTMENTS - EMBEDDED GENERATION","MW","Non-coincident"]
[null,null,null,null,"Coincident"]
[null,null,"WEATHER CORRECTED MD 10% POE","MW","Non-coincident"]
[null,null,null,null,"Coincident"]
[null,null,"WEATHER CORRECTED MD 10% POE","MVA","Non-coincident"]
[null,null,null,null,"Coincident"]
[null,null,"WEATHER CORRECTED MD 50% POE","MW","Non-coincident"]
[null,null,null,null,"Coincident"]
[null,null,"WEATHER CORRECTED MD 50% POE","MVA","Non-coincident"]
[null,null,null,null,"Coincident"]
[null,"NSP to enter name","CONNECTION POINT RATING","MVA","Non-coincident"]
[null,null,null,null,"Coincident"]
[null,null,"WINTER/SUMMER PEAKING",null,"Non-coincident"]
[null,null,null,null,"Coincident"]
[null,null,"ADJUSTMENTS - EMBEDDED GENERATION","MW","Non-coincident"]
[null,null,null,null,"Coincident"]
[null,null,"WEATHER CORRECTED MD 10% POE","MW","Non-coincident"]
[null,null,null,null,"Coincident"]
[null,null,"WEATHER CORRECTED MD 10% POE","MVA","Non-coincident"]
[null,null,null,null,"Coincident"]
[null,null,"WEATHER CORRECTED MD 50% POE","MW","Non-coincident"]
[null,null,null,null,"Coincident"]
[null,null,"WEATHER CORRECTED MD 50% POE","MVA","Non-coincident"]
[null,null,null,null,"Coincident"]
[null,"NSP to enter name","CONNECTION POINT RATING","MVA","Non-coincident"]
[null,null,null,null,"Coincident"]
[null,null,"WINTER/SUMMER PEAKING",null,"Non-coincident"]
[null,null,null,null,"Coincident"]
[null,null,"ADJUSTMENTS - EMBEDDED GENERATION","MW","Non-coincident"]
[null,null,null,null,"Coincident"]
[null,null,"WEATHER CORRECTED MD 10% POE","MW","Non-coincident"]
[null,null,null,null,"Coincident"]
[null,null,"WEATHER CORRECTED MD 10% POE","MVA","Non-coincident"]
[null,null,null,null,"Coincident"]
[null,null,"WEATHER CORRECTED MD 50% POE","MW","Non-coincident"]
[null,null,null,null,"Coincident"]
[null,null,"WEATHER CORRECTED MD 50% POE","MVA","Non-coincident"]
[null,null,null,null,"Coincident"]
[null,"NSP to enter name","CONNECTION POINT RATING","MVA","Non-coincident"]
[null,null,null,null,"Coincident"]
[null,null,"WINTER/SUMMER PEAKING",null,"Non-coincident"]
[null,null,null,null,"Coincident"]
[null,null,"ADJUSTMENTS - EMBEDDED GENERATION","MW","Non-coincident"]
[null,null,null,null,"Coincident"]
[null,null,"WEATHER CORRECTED MD 10% POE","MW","Non-coincident"]
[null,null,null,null,"Coincident"]
[null,null,"WEATHER CORRECTED MD 10% POE","MVA","Non-coincident"]
[null,null,null,null,"Coincident"]
[null,null,"WEATHER CORRECTED MD 50% POE","MW","Non-coincident"]
[null,null,null,null,"Coincident"]
[null,null,"WEATHER CORRECTED MD 50% POE","MVA","Non-coincident"]
[null,null,null,null,"Coincident"]
[null,"NSP to enter name","CONNECTION POINT RATING","MVA","Non-coincident"]
[null,null,null,null,"Coincident"]
[null,null,"WINTER/SUMMER PEAKING",null,"Non-coincident"]
[null,null,null,null,"Coincident"]
[null,null,"ADJUSTMENTS - EMBEDDED GENERATION","MW","Non-coincident"]
[null,null,null,null,"Coincident"]
[null,null,"WEATHER CORRECTED MD 10% POE","MW","Non-coincident"]
[null,null,null,null,"Coincident"]
[null,null,"WEATHER CORRECTED MD 10% POE","MVA","Non-coincident"]
[null,null,null,null,"Coincident"]
[null,null,"WEATHER CORRECTED MD 50% POE","MW","Non-coincident"]
[null,null,null,null,"Coincident"]
[null,null,"WEATHER CORRECTED MD 50% POE","MVA","Non-coincident"]
[null,null,null,null,"Coincident"]
[null,"NSP to enter name","CONNECTION POINT RATING","MVA","Non-coincident"]
[null,null,null,null,"Coincident"]
[null,null,"WINTER/SUMMER PEAKING",null,"Non-coincident"]
[null,null,null,null,"Coincident"]
[null,null,"ADJUSTMENTS - EMBEDDED GENERATION","MW","Non-coincident"]
[null,null,null,null,"Coincident"]
[null,null,"WEATHER CORRECTED MD 10% POE","MW","Non-coincident"]
[null,null,null,null,"Coincident"]
[null,null,"WEATHER CORRECTED MD 10% POE","MVA","Non-coincident"]
[null,null,null,null,"Coincident"]
[null,null,"WEATHER CORRECTED MD 50% POE","MW","Non-coincident"]
[null,null,null,null,"Coincident"]
[null,null,"WEATHER CORRECTED MD 50% POE","MVA","Non-coincident"]
[null,null,null,null,"Coincident"]
[null,"NSP to enter name","CONNECTION POINT RATING","MVA","Non-coincident"]
[null,null,null,null,"Coincident"]
[null,null,"WINTER/SUMMER PEAKING",null,"Non-coincident"]
[null,null,null,null,"Coincident"]
[null,null,"ADJUSTMENTS - EMBEDDED GENERATION","MW","Non-coincident"]
[null,null,null,null,"Coincident"]
[null,null,"WEATHER CORRECTED MD 10% POE","MW","Non-coincident"]
[null,null,null,null,"Coincident"]
[null,null,"WEATHER CORRECTED MD 10% POE","MVA","Non-coincident"]
[null,null,null,null,"Coincident"]
[null,null,"WEATHER CORRECTED MD 50% POE","MW","Non-coincident"]
[null,null,null,null,"Coincident"]
[null,null,"WEATHER CORRECTED MD 50% POE","MVA","Non-coincident"]
[null,null,null,null,"Coincident"]
[null,"NSP to enter name","CONNECTION POINT RATING","MVA","Non-coincident"]
[null,null,null,null,"Coincident"]
[null,null,"WINTER/SUMMER PEAKING",null,"Non-coincident"]
[null,null,null,null,"Coincident"]
[null,null,"ADJUSTMENTS - EMBEDDED GENERATION","MW","Non-coincident"]
[null,null,null,null,"Coincident"]
[null,null,"WEATHER CORRECTED MD 10% POE","MW","Non-coincident"]
[null,null,null,null,"Coincident"]
[null,null,"WEATHER CORRECTED MD 10% POE","MVA","Non-coincident"]
[null,null,null,null,"Coincident"]
[null,null,"WEATHER CORRECTED MD 50% POE","MW","Non-coincident"]
[null,null,null,null,"Coincident"]
[null,null,"WEATHER CORRECTED MD 50% POE","MVA","Non-coincident"]
[null,null,null,null,"Coincident"]
[null,"NSP to enter name","CONNECTION POINT RATING","MVA","Non-coincident"]
[null,null,null,null,"Coincident"]
[null,null,"WINTER/SUMMER PEAKING",null,"Non-coincident"]
[null,null,null,null,"Coincident"]
[null,null,"ADJUSTMENTS - EMBEDDED GENERATION","MW","Non-coincident"]
[null,null,null,null,"Coincident"]
[null,null,"WEATHER CORRECTED MD 10% POE","MW","Non-coincident"]
[null,null,null,null,"Coincident"]
[null,null,"WEATHER CORRECTED MD 10% POE","MVA","Non-coincident"]
[null,null,null,null,"Coincident"]
[null,null,"WEATHER CORRECTED MD 50% POE","MW","Non-coincident"]
[null,null,null,null,"Coincident"]
[null,null,"WEATHER CORRECTED MD 50% POE","MVA","Non-coincident"]
[null,null,null,null,"Coincident"]
[null,"NSP to enter name","CONNECTION POINT RATING","MVA","Non-coincident"]
[null,null,null,null,"Coincident"]
[null,null,"WINTER/SUMMER PEAKING",null,"Non-coincident"]
[null,null,null,null,"Coincident"]
[null,null,"ADJUSTMENTS - EMBEDDED GENERATION","MW","Non-coincident"]
[null,null,null,null,"Coincident"]
[null,null,"WEATHER CORRECTED MD 10% POE","MW","Non-coincident"]
[null,null,null,null,"Coincident"]
[null,null,"WEATHER CORRECTED MD 10% POE","MVA","Non-coincident"]
[null,null,null,null,"Coincident"]
[null,null,"WEATHER CORRECTED MD 50% POE","MW","Non-coincident"]
[null,null,null,null,"Coincident"]
[null,null,"WEATHER CORRECTED MD 50% POE","MVA","Non-coincident"]
[null,null,null,null,"Coincident"]
[null,"NSP to enter name","CONNECTION POINT RATING","MVA","Non-coincident"]
[null,null,null,null,"Coincident"]
[null,null,"WINTER/SUMMER PEAKING",null,"Non-coincident"]
[null,null,null,null,"Coincident"]
[null,null,"ADJUSTMENTS - EMBEDDED GENERATION","MW","Non-coincident"]
[null,null,null,null,"Coincident"]
[null,null,"WEATHER CORRECTED MD 10% POE","MW","Non-coincident"]
[null,null,null,null,"Coincident"]
[null,null,"WEATHER CORRECTED MD 10% POE","MVA","Non-coincident"]
[null,null,null,null,"Coincident"]
[null,null,"WEATHER CORRECTED MD 50% POE","MW","Non-coincident"]
[null,null,null,null,"Coincident"]
[null,null,"WEATHER CORRECTED MD 50% POE","MVA","Non-coincident"]
[null,null,null,null,"Coincident"]
[null,"NSP to enter name","CONNECTION POINT RATING","MVA","Non-coincident"]
[null,null,null,null,"Coincident"]
[null,null,"WINTER/SUMMER PEAKING",null,"Non-coincident"]
[null,null,null,null,"Coincident"]
[null,null,"ADJUSTMENTS - EMBEDDED GENERATION","MW","Non-coincident"]
[null,null,null,null,"Coincident"]
[null,null,"WEATHER CORRECTED MD 10% POE","MW","Non-coincident"]
[null,null,null,null,"Coincident"]
[null,null,"WEATHER CORRECTED MD 10% POE","MVA","Non-coincident"]
[null,null,null,null,"Coincident"]
[null,null,"WEATHER CORRECTED MD 50% POE","MW","Non-coincident"]
[null,null,null,null,"Coincident"]
[null,null,"WEATHER CORRECTED MD 50% POE","MVA","Non-coincident"]
[null,null,null,null,"Coincident"]
[null,"NSP to enter name","CONNECTION POINT RATING","MVA","Non-coincident"]
[null,null,null,null,"Coincident"]
[null,null,"WINTER/SUMMER PEAKING",null,"Non-coincident"]
[null,null,null,null,"Coincident"]
[null,null,"ADJUSTMENTS - EMBEDDED GENERATION","MW","Non-coincident"]
[null,null,null,null,"Coincident"]
[null,null,"WEATHER CORRECTED MD 10% POE","MW","Non-coincident"]
[null,null,null,null,"Coincident"]
[null,null,"WEATHER CORRECTED MD 10% POE","MVA","Non-coincident"]
[null,null,null,null,"Coincident"]
[null,null,"WEATHER CORRECTED MD 50% POE","MW","Non-coincident"]
[null,null,null,null,"Coincident"]
[null,null,"WEATHER CORRECTED MD 50% POE","MVA","Non-coincident"]
[null,null,null,null,"Coincident"]
[null,"NSP to enter name","CONNECTION POINT RATING","MVA","Non-coincident"]
[null,null,null,null,"Coincident"]
[null,null,"WINTER/SUMMER PEAKING",null,"Non-coincident"]
[null,null,null,null,"Coincident"]
[null,null,"ADJUSTMENTS - EMBEDDED GENERATION","MW","Non-coincident"]
[null,null,null,null,"Coincident"]
[null,null,"WEATHER CORRECTED MD 10% POE","MW","Non-coincident"]
[null,null,null,null,"Coincident"]
[null,null,"WEATHER CORRECTED MD 10% POE","MVA","Non-coincident"]
[null,null,null,null,"Coincident"]
[null,null,"WEATHER CORRECTED MD 50% POE","MW","Non-coincident"]
[null,null,null,null,"Coincident"]
[null,null,"WEATHER CORRECTED MD 50% POE","MVA","Non-coincident"]
[null,null,null,null,"Coincident"]
[null,"NSP to enter name","CONNECTION POINT RATING","MVA","Non-coincident"]
[null,null,null,null,"Coincident"]
[null,null,"WINTER/SUMMER PEAKING",null,"Non-coincident"]
[null,null,null,null,"Coincident"]
[null,null,"ADJUSTMENTS - EMBEDDED GENERATION","MW","Non-coincident"]
[null,null,null,null,"Coincident"]
[null,null,"WEATHER CORRECTED MD 10% POE","MW","Non-coincident"]
[null,null,null,null,"Coincident"]
[null,null,"WEATHER CORRECTED MD 10% POE","MVA","Non-coincident"]
[null,null,null,null,"Coincident"]
[null,null,"WEATHER CORRECTED MD 50% POE","MW","Non-coincident"]
[null,null,null,null,"Coincident"]
[null,null,"WEATHER CORRECTED MD 50% POE","MVA","Non-coincident"]
[null,null,null,null,"Coincident"]
[null,"NSP to enter name","CONNECTION POINT RATING","MVA","Non-coincident"]
[null,null,null,null,"Coincident"]
[null,null,"WINTER/SUMMER PEAKING",null,"Non-coincident"]
[null,null,null,null,"Coincident"]
[null,null,"ADJUSTMENTS - EMBEDDED GENERATION","MW","Non-coincident"]
[null,null,null,null,"Coincident"]
[null,null,"WEATHER CORRECTED MD 10% POE","MW","Non-coincident"]
[null,null,null,null,"Coincident"]
[null,null,"WEATHER CORRECTED MD 10% POE","MVA","Non-coincident"]
[null,null,null,null,"Coincident"]
[null,null,"WEATHER CORRECTED MD 50% POE","MW","Non-coincident"]
[null,null,null,null,"Coincident"]
[null,null,"WEATHER CORRECTED MD 50% POE","MVA","Non-coincident"]
[null,null,null,null,"Coincident"]
[null,"NSP to enter name","CONNECTION POINT RATING","MVA","Non-coincident"]
[null,null,null,null,"Coincident"]
[null,null,"WINTER/SUMMER PEAKING",null,"Non-coincident"]
[null,null,null,null,"Coincident"]
[null,null,"ADJUSTMENTS - EMBEDDED GENERATION","MW","Non-coincident"]
[null,null,null,null,"Coincident"]
[null,null,"WEATHER CORRECTED MD 10% POE","MW","Non-coincident"]
[null,null,null,null,"Coincident"]
[null,null,"WEATHER CORRECTED MD 10% POE","MVA","Non-coincident"]
[null,null,null,null,"Coincident"]
[null,null,"WEATHER CORRECTED MD 50% POE","MW","Non-coincident"]
[null,null,null,null,"Coincident"]
[null,null,"WEATHER CORRECTED MD 50% POE","MVA","Non-coincident"]
[null,null,null,null,"Coincident"]
[null,"NSP to enter name","CONNECTION POINT RATING","MVA","Non-coincident"]
[null,null,null,null,"Coincident"]
[null,null,"WINTER/SUMMER PEAKING",null,"Non-coincident"]
[null,null,null,null,"Coincident"]
[null,null,"ADJUSTMENTS - EMBEDDED GENERATION","MW","Non-coincident"]
[null,null,null,null,"Coincident"]
[null,null,"WEATHER CORRECTED MD 10% POE","MW","Non-coincident"]
[null,null,null,null,"Coincident"]
[null,null,"WEATHER CORRECTED MD 10% POE","MVA","Non-coincident"]
[null,null,null,null,"Coincident"]
[null,null,"WEATHER CORRECTED MD 50% POE","MW","Non-coincident"]
[null,null,null,null,"Coincident"]
[null,null,"WEATHER CORRECTED MD 50% POE","MVA","Non-coincident"]
[null,null,null,null,"Coincident"]
[null,"NSP to enter name","CONNECTION POINT RATING","MVA","Non-coincident"]
[null,null,null,null,"Coincident"]
[null,null,"WINTER/SUMMER PEAKING",null,"Non-coincident"]
[null,null,null,null,"Coincident"]
[null,null,"ADJUSTMENTS - EMBEDDED GENERATION","MW","Non-coincident"]
[null,null,null,null,"Coincident"]
[null,null,"WEATHER CORRECTED MD 10% POE","MW","Non-coincident"]
[null,null,null,null,"Coincident"]
[null,null,"WEATHER CORRECTED MD 10% POE","MVA","Non-coincident"]
[null,null,null,null,"Coincident"]
[null,null,"WEATHER CORRECTED MD 50% POE","MW","Non-coincident"]
[null,null,null,null,"Coincident"]
[null,null,"WEATHER CORRECTED MD 50% POE","MVA","Non-coincident"]
[null,null,null,null,"Coincident"]
[null,"NSP to enter name","CONNECTION POINT RATING","MVA","Non-coincident"]
[null,null,null,null,"Coincident"]
[null,null,"WINTER/SUMMER PEAKING",null,"Non-coincident"]
[null,null,null,null,"Coincident"]
[null,null,"ADJUSTMENTS - EMBEDDED GENERATION","MW","Non-coincident"]
[null,null,null,null,"Coincident"]
[null,null,"WEATHER CORRECTED MD 10% POE","MW","Non-coincident"]
[null,null,null,null,"Coincident"]
[null,null,"WEATHER CORRECTED MD 10% POE","MVA","Non-coincident"]
[null,null,null,null,"Coincident"]
[null,null,"WEATHER CORRECTED MD 50% POE","MW","Non-coincident"]
[null,null,null,null,"Coincident"]
[null,null,"WEATHER CORRECTED MD 50% POE","MVA","Non-coincident"]
[null,null,null,null,"Coincident"]
[null,"NSP to enter name","CONNECTION POINT RATING","MVA","Non-coincident"]
[null,null,null,null,"Coincident"]
[null,null,"WINTER/SUMMER PEAKING",null,"Non-coincident"]
[null,null,null,null,"Coincident"]
[null,null,"ADJUSTMENTS - EMBEDDED GENERATION","MW","Non-coincident"]
[null,null,null,null,"Coincident"]
[null,null,"WEATHER CORRECTED MD 10% POE","MW","Non-coincident"]
[null,null,null,null,"Coincident"]
[null,null,"WEATHER CORRECTED MD 10% POE","MVA","Non-coincident"]
[null,null,null,null,"Coincident"]
[null,null,"WEATHER CORRECTED MD 50% POE","MW","Non-coincident"]
[null,null,null,null,"Coincident"]
[null,null,"WEATHER CORRECTED MD 50% POE","MVA","Non-coincident"]
[null,null,null,null,"Coincident"]
[null,"NSP to enter name","CONNECTION POINT RATING","MVA","Non-coincident"]
[null,null,null,null,"Coincident"]
[null,null,"WINTER/SUMMER PEAKING",null,"Non-coincident"]
[null,null,null,null,"Coincident"]
[null,null,"ADJUSTMENTS - EMBEDDED GENERATION","MW","Non-coincident"]
[null,null,null,null,"Coincident"]
[null,null,"WEATHER CORRECTED MD 10% POE","MW","Non-coincident"]
[null,null,null,null,"Coincident"]
[null,null,"WEATHER CORRECTED MD 10% POE","MVA","Non-coincident"]
[null,null,null,null,"Coincident"]
[null,null,"WEATHER CORRECTED MD 50% POE","MW","Non-coincident"]
[null,null,null,null,"Coincident"]
[null,null,"WEATHER CORRECTED MD 50% POE","MVA","Non-coincident"]
[null,null,null,null,"Coincident"]
[null,"NSP to enter name","CONNECTION POINT RATING","MVA","Non-coincident"]
[null,null,null,null,"Coincident"]
[null,null,"WINTER/SUMMER PEAKING",null,"Non-coincident"]
[null,null,null,null,"Coincident"]
[null,null,"ADJUSTMENTS - EMBEDDED GENERATION","MW","Non-coincident"]
[null,null,null,null,"Coincident"]
[null,null,"WEATHER CORRECTED MD 10% POE","MW","Non-coincident"]
[null,null,null,null,"Coincident"]
[null,null,"WEATHER CORRECTED MD 10% POE","MVA","Non-coincident"]
[null,null,null,null,"Coincident"]
[null,null,"WEATHER CORRECTED MD 50% POE","MW","Non-coincident"]
[null,null,null,null,"Coincident"]
[null,null,"WEATHER CORRECTED MD 50% POE","MVA","Non-coincident"]
[null,null,null,null,"Coincident"]
[null,"NSP to enter name","CONNECTION POINT RATING","MVA","Non-coincident"]
[null,null,null,null,"Coincident"]
[null,null,"WINTER/SUMMER PEAKING",null,"Non-coincident"]
[null,null,null,null,"Coincident"]
[null,null,"ADJUSTMENTS - EMBEDDED GENERATION","MW","Non-coincident"]
[null,null,null,null,"Coincident"]
[null,null,"WEATHER CORRECTED MD 10% POE","MW","Non-coincident"]
[null,null,null,null,"Coincident"]
[null,null,"WEATHER CORRECTED MD 10% POE","MVA","Non-coincident"]
[null,null,null,null,"Coincident"]
[null,null,"WEATHER CORRECTED MD 50% POE","MW","Non-coincident"]
[null,null,null,null,"Coincident"]
[null,null,"WEATHER CORRECTED MD 50% POE","MVA","Non-coincident"]
[null,null,null,null,"Coincident"]
[null,"NSP to enter name","CONNECTION POINT RATING","MVA","Non-coincident"]
[null,null,null,null,"Coincident"]
[null,null,"WINTER/SUMMER PEAKING",null,"Non-coincident"]
[null,null,null,null,"Coincident"]
[null,null,"ADJUSTMENTS - EMBEDDED GENERATION","MW","Non-coincident"]
[null,null,null,null,"Coincident"]
[null,null,"WEATHER CORRECTED MD 10% POE","MW","Non-coincident"]
[null,null,null,null,"Coincident"]
[null,null,"WEATHER CORRECTED MD 10% POE","MVA","Non-coincident"]
[null,null,null,null,"Coincident"]
[null,null,"WEATHER CORRECTED MD 50% POE","MW","Non-coincident"]
[null,null,null,null,"Coincident"]
[null,null,"WEATHER CORRECTED MD 50% POE","MVA","Non-coincident"]
[null,null,null,null,"Coincident"]
[null,"NSP to enter name","CONNECTION POINT RATING","MVA","Non-coincident"]
[null,null,null,null,"Coincident"]
[null,null,"WINTER/SUMMER PEAKING",null,"Non-coincident"]
[null,null,null,null,"Coincident"]
[null,null,"ADJUSTMENTS - EMBEDDED GENERATION","MW","Non-coincident"]
[null,null,null,null,"Coincident"]
[null,null,"WEATHER CORRECTED MD 10% POE","MW","Non-coincident"]
[null,null,null,null,"Coincident"]
[null,null,"WEATHER CORRECTED MD 10% POE","MVA","Non-coincident"]
[null,null,null,null,"Coincident"]
[null,null,"WEATHER CORRECTED MD 50% POE","MW","Non-coincident"]
[null,null,null,null,"Coincident"]
[null,null,"WEATHER CORRECTED MD 50% POE","MVA","Non-coincident"]
[null,null,null,null,"Coincident"]
[null,"NSP to enter name","CONNECTION POINT RATING","MVA","Non-coincident"]
[null,null,null,null,"Coincident"]
[null,null,"WINTER/SUMMER PEAKING",null,"Non-coincident"]
[null,null,null,null,"Coincident"]
[null,null,"ADJUSTMENTS - EMBEDDED GENERATION","MW","Non-coincident"]
[null,null,null,null,"Coincident"]
[null,null,"WEATHER CORRECTED MD 10% POE","MW","Non-coincident"]
[null,null,null,null,"Coincident"]
[null,null,"WEATHER CORRECTED MD 10% POE","MVA","Non-coincident"]
[null,null,null,null,"Coincident"]
[null,null,"WEATHER CORRECTED MD 50% POE","MW","Non-coincident"]
[null,null,null,null,"Coincident"]
[null,null,"WEATHER CORRECTED MD 50% POE","MVA","Non-coincident"]
[null,null,null,null,"Coincident"]
[null,"NSP to enter name","CONNECTION POINT RATING","MVA","Non-coincident"]
[null,null,null,null,"Coincident"]
[null,null,"WINTER/SUMMER PEAKING",null,"Non-coincident"]
[null,null,null,null,"Coincident"]
[null,null,"ADJUSTMENTS - EMBEDDED GENERATION","MW","Non-coincident"]
[null,null,null,null,"Coincident"]
[null,null,"WEATHER CORRECTED MD 10% POE","MW","Non-coincident"]
[null,null,null,null,"Coincident"]
[null,null,"WEATHER CORRECTED MD 10% POE","MVA","Non-coincident"]
[null,null,null,null,"Coincident"]
[null,null,"WEATHER CORRECTED MD 50% POE","MW","Non-coincident"]
[null,null,null,null,"Coincident"]
[null,null,"WEATHER CORRECTED MD 50% POE","MVA","Non-coincident"]
[null,null,null,null,"Coincident"]
[null,"NSP to enter name","CONNECTION POINT RATING","MVA","Non-coincident"]
[null,null,null,null,"Coincident"]
[null,null,"WINTER/SUMMER PEAKING",null,"Non-coincident"]
[null,null,null,null,"Coincident"]
[null,null,"ADJUSTMENTS - EMBEDDED GENERATION","MW","Non-coincident"]
[null,null,null,null,"Coincident"]
[null,null,"WEATHER CORRECTED MD 10% POE","MW","Non-coincident"]
[null,null,null,null,"Coincident"]
[null,null,"WEATHER CORRECTED MD 10% POE","MVA","Non-coincident"]
[null,null,null,null,"Coincident"]
[null,null,"WEATHER CORRECTED MD 50% POE","MW","Non-coincident"]
[null,null,null,null,"Coincident"]
[null,null,"WEATHER CORRECTED MD 50% POE","MVA","Non-coincident"]
[null,null,null,null,"Coincident"]
[null,"NSP to enter name","CONNECTION POINT RATING","MVA","Non-coincident"]
[null,null,null,null,"Coincident"]
[null,null,"WINTER/SUMMER PEAKING",null,"Non-coincident"]
[null,null,null,null,"Coincident"]
[null,null,"ADJUSTMENTS - EMBEDDED GENERATION","MW","Non-coincident"]
[null,null,null,null,"Coincident"]
[null,null,"WEATHER CORRECTED MD 10% POE","MW","Non-coincident"]
[null,null,null,null,"Coincident"]
[null,null,"WEATHER CORRECTED MD 10% POE","MVA","Non-coincident"]
[null,null,null,null,"Coincident"]
[null,null,"WEATHER CORRECTED MD 50% POE","MW","Non-coincident"]
[null,null,null,null,"Coincident"]
[null,null,"WEATHER CORRECTED MD 50% POE","MVA","Non-coincident"]
[null,null,null,null,"Coincident"]
[null,"NSP to enter name","CONNECTION POINT RATING","MVA","Non-coincident"]
[null,null,null,null,"Coincident"]
[null,null,"WINTER/SUMMER PEAKING",null,"Non-coincident"]
[null,null,null,null,"Coincident"]
[null,null,"ADJUSTMENTS - EMBEDDED GENERATION","MW","Non-coincident"]
[null,null,null,null,"Coincident"]
[null,null,"WEATHER CORRECTED MD 10% POE","MW","Non-coincident"]
[null,null,null,null,"Coincident"]
[null,null,"WEATHER CORRECTED MD 10% POE","MVA","Non-coincident"]
[null,null,null,null,"Coincident"]
[null,null,"WEATHER CORRECTED MD 50% POE","MW","Non-coincident"]
[null,null,null,null,"Coincident"]
[null,null,"WEATHER CORRECTED MD 50% POE","MVA","Non-coincident"]
[null,null,null,null,"Coincident"]
[null,"NSP to enter name","CONNECTION POINT RATING","MVA","Non-coincident"]
[null,null,null,null,"Coincident"]
[null,null,"WINTER/SUMMER PEAKING",null,"Non-coincident"]
[null,null,null,null,"Coincident"]
[null,null,"ADJUSTMENTS - EMBEDDED GENERATION","MW","Non-coincident"]
[null,null,null,null,"Coincident"]
[null,null,"WEATHER CORRECTED MD 10% POE","MW","Non-coincident"]
[null,null,null,null,"Coincident"]
[null,null,"WEATHER CORRECTED MD 10% POE","MVA","Non-coincident"]
[null,null,null,null,"Coincident"]
[null,null,"WEATHER CORRECTED MD 50% POE","MW","Non-coincident"]
[null,null,null,null,"Coincident"]
[null,null,"WEATHER CORRECTED MD 50% POE","MVA","Non-coincident"]
[null,null,null,null,"Coincident"]
[null,"NSP to enter name","CONNECTION POINT RATING","MVA","Non-coincident"]
[null,null,null,null,"Coincident"]
[null,null,"WINTER/SUMMER PEAKING",null,"Non-coincident"]
[null,null,null,null,"Coincident"]
[null,null,"ADJUSTMENTS - EMBEDDED GENERATION","MW","Non-coincident"]
[null,null,null,null,"Coincident"]
[null,null,"WEATHER CORRECTED MD 10% POE","MW","Non-coincident"]
[null,null,null,null,"Coincident"]
[null,null,"WEATHER CORRECTED MD 10% POE","MVA","Non-coincident"]
[null,null,null,null,"Coincident"]
[null,null,"WEATHER CORRECTED MD 50% POE","MW","Non-coincident"]
[null,null,null,null,"Coincident"]
[null,null,"WEATHER CORRECTED MD 50% POE","MVA","Non-coincident"]
[null,null,null,null,"Coincident"]
[null,"NSP to enter name","CONNECTION POINT RATING","MVA","Non-coincident"]
[null,null,null,null,"Coincident"]
[null,null,"WINTER/SUMMER PEAKING",null,"Non-coincident"]
[null,null,null,null,"Coincident"]
[null,null,"ADJUSTMENTS - EMBEDDED GENERATION","MW","Non-coincident"]
[null,null,null,null,"Coincident"]
[null,null,"WEATHER CORRECTED MD 10% POE","MW","Non-coincident"]
[null,null,null,null,"Coincident"]
[null,null,"WEATHER CORRECTED MD 10% POE","MVA","Non-coincident"]
[null,null,null,null,"Coincident"]
[null,null,"WEATHER CORRECTED MD 50% POE","MW","Non-coincident"]
[null,null,null,null,"Coincident"]
[null,null,"WEATHER CORRECTED MD 50% POE","MVA","Non-coincident"]
[null,null,null,null,"Coincident"]
[null,"NSP to enter name","CONNECTION POINT RATING","MVA","Non-coincident"]
[null,null,null,null,"Coincident"]
[null,null,"WINTER/SUMMER PEAKING",null,"Non-coincident"]
[null,null,null,null,"Coincident"]
[null,null,"ADJUSTMENTS - EMBEDDED GENERATION","MW","Non-coincident"]
[null,null,null,null,"Coincident"]
[null,null,"WEATHER CORRECTED MD 10% POE","MW","Non-coincident"]
[null,null,null,null,"Coincident"]
[null,null,"WEATHER CORRECTED MD 10% POE","MVA","Non-coincident"]
[null,null,null,null,"Coincident"]
[null,null,"WEATHER CORRECTED MD 50% POE","MW","Non-coincident"]
[null,null,null,null,"Coincident"]
[null,null,"WEATHER CORRECTED MD 50% POE","MVA","Non-coincident"]
[null,null,null,null,"Coincident"]
[null,"NSP to enter name","CONNECTION POINT RATING","MVA","Non-coincident"]
[null,null,null,null,"Coincident"]
[null,null,"WINTER/SUMMER PEAKING",null,"Non-coincident"]
[null,null,null,null,"Coincident"]
[null,null,"ADJUSTMENTS - EMBEDDED GENERATION","MW","Non-coincident"]
[null,null,null,null,"Coincident"]
[null,null,"WEATHER CORRECTED MD 10% POE","MW","Non-coincident"]
[null,null,null,null,"Coincident"]
[null,null,"WEATHER CORRECTED MD 10% POE","MVA","Non-coincident"]
[null,null,null,null,"Coincident"]
[null,null,"WEATHER CORRECTED MD 50% POE","MW","Non-coincident"]
[null,null,null,null,"Coincident"]
[null,null,"WEATHER CORRECTED MD 50% POE","MVA","Non-coincident"]
[null,null,null,null,"Coincident"]
[null,"NSP to enter name","CONNECTION POINT RATING","MVA","Non-coincident"]
[null,null,null,null,"Coincident"]
[null,null,"WINTER/SUMMER PEAKING",null,"Non-coincident"]
[null,null,null,null,"Coincident"]
[null,null,"ADJUSTMENTS - EMBEDDED GENERATION","MW","Non-coincident"]
[null,null,null,null,"Coincident"]
[null,null,"WEATHER CORRECTED MD 10% POE","MW","Non-coincident"]
[null,null,null,null,"Coincident"]
[null,null,"WEATHER CORRECTED MD 10% POE","MVA","Non-coincident"]
[null,null,null,null,"Coincident"]
[null,null,"WEATHER CORRECTED MD 50% POE","MW","Non-coincident"]
[null,null,null,null,"Coincident"]
[null,null,"WEATHER CORRECTED MD 50% POE","MVA","Non-coincident"]
[null,null,null,null,"Coincident"]
[null,"NSP to enter name","CONNECTION POINT RATING","MVA","Non-coincident"]
[null,null,null,null,"Coincident"]
[null,null,"WINTER/SUMMER PEAKING",null,"Non-coincident"]
[null,null,null,null,"Coincident"]
[null,null,"ADJUSTMENTS - EMBEDDED GENERATION","MW","Non-coincident"]
[null,null,null,null,"Coincident"]
[null,null,"WEATHER CORRECTED MD 10% POE","MW","Non-coincident"]
[null,null,null,null,"Coincident"]
[null,null,"WEATHER CORRECTED MD 10% POE","MVA","Non-coincident"]
[null,null,null,null,"Coincident"]
[null,null,"WEATHER CORRECTED MD 50% POE","MW","Non-coincident"]
[null,null,null,null,"Coincident"]
[null,null,"WEATHER CORRECTED MD 50% POE","MVA","Non-coincident"]
[null,null,null,null,"Coincident"]
[null,"NSP to enter name","CONNECTION POINT RATING","MVA","Non-coincident"]
[null,null,null,null,"Coincident"]
[null,null,"WINTER/SUMMER PEAKING",null,"Non-coincident"]
[null,null,null,null,"Coincident"]
[null,null,"ADJUSTMENTS - EMBEDDED GENERATION","MW","Non-coincident"]
[null,null,null,null,"Coincident"]
[null,null,"WEATHER CORRECTED MD 10% POE","MW","Non-coincident"]
[null,null,null,null,"Coincident"]
[null,null,"WEATHER CORRECTED MD 10% POE","MVA","Non-coincident"]
[null,null,null,null,"Coincident"]
[null,null,"WEATHER CORRECTED MD 50% POE","MW","Non-coincident"]
[null,null,null,null,"Coincident"]
[null,null,"WEATHER CORRECTED MD 50% POE","MVA","Non-coincident"]
[null,null,null,null,"Coincident"]
[null,"NSP to enter name","CONNECTION POINT RATING","MVA","Non-coincident"]
[null,null,null,null,"Coincident"]
[null,null,"WINTER/SUMMER PEAKING",null,"Non-coincident"]
[null,null,null,null,"Coincident"]
[null,null,"ADJUSTMENTS - EMBEDDED GENERATION","MW","Non-coincident"]
[null,null,null,null,"Coincident"]
[null,null,"WEATHER CORRECTED MD 10% POE","MW","Non-coincident"]
[null,null,null,null,"Coincident"]
[null,null,"WEATHER CORRECTED MD 10% POE","MVA","Non-coincident"]
[null,null,null,null,"Coincident"]
[null,null,"WEATHER CORRECTED MD 50% POE","MW","Non-coincident"]
[null,null,null,null,"Coincident"]
[null,null,"WEATHER CORRECTED MD 50% POE","MVA","Non-coincident"]
[null,null,null,null,"Coincident"]
[null,"NSP to enter name","CONNECTION POINT RATING","MVA","Non-coincident"]
[null,null,null,null,"Coincident"]
[null,null,"WINTER/SUMMER PEAKING",null,"Non-coincident"]
[null,null,null,null,"Coincident"]
[null,null,"ADJUSTMENTS - EMBEDDED GENERATION","MW","Non-coincident"]
[null,null,null,null,"Coincident"]
[null,null,"WEATHER CORRECTED MD 10% POE","MW","Non-coincident"]
[null,null,null,null,"Coincident"]
[null,null,"WEATHER CORRECTED MD 10% POE","MVA","Non-coincident"]
[null,null,null,null,"Coincident"]
[null,null,"WEATHER CORRECTED MD 50% POE","MW","Non-coincident"]
[null,null,null,null,"Coincident"]
[null,null,"WEATHER CORRECTED MD 50% POE","MVA","Non-coincident"]
[null,null,null,null,"Coincident"]
[null,"NSP to enter name","CONNECTION POINT RATING","MVA","Non-coincident"]
[null,null,null,null,"Coincident"]
[null,null,"WINTER/SUMMER PEAKING",null,"Non-coincident"]
[null,null,null,null,"Coincident"]
[null,null,"ADJUSTMENTS - EMBEDDED GENERATION","MW","Non-coincident"]
[null,null,null,null,"Coincident"]
[null,null,"WEATHER CORRECTED MD 10% POE","MW","Non-coincident"]
[null,null,null,null,"Coincident"]
[null,null,"WEATHER CORRECTED MD 10% POE","MVA","Non-coincident"]
[null,null,null,null,"Coincident"]
[null,null,"WEATHER CORRECTED MD 50% POE","MW","Non-coincident"]
[null,null,null,null,"Coincident"]
[null,null,"WEATHER CORRECTED MD 50% POE","MVA","Non-coincident"]
[null,null,null,null,"Coincident"]
[null,"NSP to enter name","CONNECTION POINT RATING","MVA","Non-coincident"]
[null,null,null,null,"Coincident"]
[null,null,"WINTER/SUMMER PEAKING",null,"Non-coincident"]
[null,null,null,null,"Coincident"]
[null,null,"ADJUSTMENTS - EMBEDDED GENERATION","MW","Non-coincident"]
[null,null,null,null,"Coincident"]
[null,null,"WEATHER CORRECTED MD 10% POE","MW","Non-coincident"]
[null,null,null,null,"Coincident"]
[null,null,"WEATHER CORRECTED MD 10% POE","MVA","Non-coincident"]
[null,null,null,null,"Coincident"]
[null,null,"WEATHER CORRECTED MD 50% POE","MW","Non-coincident"]
[null,null,null,null,"Coincident"]
[null,null,"WEATHER CORRECTED MD 50% POE","MVA","Non-coincident"]
[null,null,null,null,"Coincident"]
[null,"NSP to enter name","CONNECTION POINT RATING","MVA","Non-coincident"]
[null,null,null,null,"Coincident"]
[null,null,"WINTER/SUMMER PEAKING",null,"Non-coincident"]
[null,null,null,null,"Coincident"]
[null,null,"ADJUSTMENTS - EMBEDDED GENERATION","MW","Non-coincident"]
[null,null,null,null,"Coincident"]
[null,null,"WEATHER CORRECTED MD 10% POE","MW","Non-coincident"]
[null,null,null,null,"Coincident"]
[null,null,"WEATHER CORRECTED MD 10% POE","MVA","Non-coincident"]
[null,null,null,null,"Coincident"]
[null,null,"WEATHER CORRECTED MD 50% POE","MW","Non-coincident"]
[null,null,null,null,"Coincident"]
[null,null,"WEATHER CORRECTED MD 50% POE","MVA","Non-coincident"]
[null,null,null,null,"Coincident"]
[null,"NSP to enter name","CONNECTION POINT RATING","MVA","Non-coincident"]
[null,null,null,null,"Coincident"]
[null,null,"WINTER/SUMMER PEAKING",null,"Non-coincident"]
[null,null,null,null,"Coincident"]
[null,null,"ADJUSTMENTS - EMBEDDED GENERATION","MW","Non-coincident"]
[null,null,null,null,"Coincident"]
[null,null,"WEATHER CORRECTED MD 10% POE","MW","Non-coincident"]
[null,null,null,null,"Coincident"]
[null,null,"WEATHER CORRECTED MD 10% POE","MVA","Non-coincident"]
[null,null,null,null,"Coincident"]
[null,null,"WEATHER CORRECTED MD 50% POE","MW","Non-coincident"]
[null,null,null,null,"Coincident"]
[null,null,"WEATHER CORRECTED MD 50% POE","MVA","Non-coincident"]
[null,null,null,null,"Coincident"]

{"sheet":"7.1  Policies and Procedures","index":19,"n_rows":225,"n_cols":5,"rows_kept":225,"cut":false,"hidden":false,"merged":[[211,1,211,4],[222,1,222,4],[75,1,75,4],[155,1,155,4],[160,1,160,4],[197,1,197,4],[201,1,201,4],[38,1,38,4],[41,1,41,4],[46,1,46,4],[70,1,70,4],[206,1,206,4],[6,1,6,3],[11,1,11,4],[15,1,15,4],[33,1,33,4],[37,1,37,4]]}
[null,{"$f":"(LOOKUP(dms_Model,dms_Model_List,dms_Worksheet_List))","v":"REGULATORY REPORTING STATEMENT"}]
[null,{"$f":"dms_TradingName","v":"Powerlink"}]
[null,{"$f":"CONCATENATE(\"REGULATORY PERIOD FROM \", FRCP_y1,\" TO \",dms_MultiYear_FinalYear_Result)","v":"REGULATORY PERIOD FROM 2027-28 TO 2031-32"}]
[null,"7.1  PLANS, POLICIES, PROCEDURES AND STRATEGIES"]
[]
[null,"Instructions"]
[null,{"$f":"CONCATENATE(dms_TradingName, \" must list and provide a brief description of key internal plans, \"&\"policies, procedures or strategies that are used by it to plan and conduct its day to day operations and that have been relied upon in the development of its regulatory proposal. \"&dms_TradingName,\" must identify any internal plans, policies, procedures and strategies that have changed in the current regulatory control period \"&\"or that are expected to change before the next regulatory control period where the change has been identified as a step change.\")","v":"Powerlink must list and provide a brief description of key internal plans, policies, procedures or strategies that are used by it to plan and conduct its day to day operations and that have been relied upon in the development of its regulatory proposal. Powerlink must identify any internal plans, policies, procedures and strategies that have changed in the current regulatory control period or that are expected to change before the next regulatory control period where the change has been identified as a step change."}]
[]
[null,"7.1.1 - PLANS, POLICIES, PROCEDURES AND STRATEGIES"]
[null,null,"Brief description","Relevance to regulatory proposal","Expenditure impact"]
[null,null,"Description of the plan, policy, procedure or strategy.","Identify the element of the proposal/supporting documents that the policy, plan, procedure or strategy is relevant to e.g. replacement capex, capacity utilisation thresholds, opex ","Is this policy, plan or procedure identified in the response to section 4 'Step Changes' of the notice (yes or no)?"]
[null,"Corporate"]
[null,"Statement of Corporate Intent FY25","Statement of the strategic intent and performance objectives for Powerlink in the most recent full financial year.","Forecast capital expenditure\nForecast operating expenditure","No"]
[]
[]
[null,"Governance framework"]
[null,"Strategic Asset Management Plan","Defines the asset management framework for network assets.","Forecast capital expenditure\nForecast operating expenditure","No"]
[null,"Asset Management Policy ","Sets out the direction and framework for the sustainable management of all network and non-network assets.","Forecast capital expenditure\nForecast operating expenditure","No"]
[]
[]
[]
[]
[]
[]
[]
[]
[]
[]
[]
[]
[]
[]
[]
[null,"Accounting policies, procedures and methodologies (including a capitalisation policy, depreciation policy and an approved expenditure allocation methodology)"]
[null,"Depreciation of Fixed Assets","Sets out the approach to depreciation (methodology and assignment of useful life) for fixed assets.","Forecast depreciation","No"]
[null,"Powerlink Cost Allocation Methodology","Sets out Powerlink’s methodology for attributing costs to, or allocating costs between or within prescribed, negotiated and other non-regulated transmission services.","Revenue Proposal","No"]
[null,"Property, Plant and Equipment - Recognition","Sets out the policies and procedures for capitalisation of asset expenditure","Forecast capital expenditure\nForecast operating expenditure","No"]
[null,"Asset management plan or equivalent documentation"]
[null,"Asset Management Policies"]
[null,"Strategic Asset Management Plan","Defines the asset management framework for network assets.","Forecast capital expenditure\nForecast operating expenditure","No"]
[null,"Asset Management Policy","Sets out the direction and framework for the sustainable management of all network and non-network assets.","Forecast capital expenditure\nForecast operating expenditure","No"]
[null,"Asset Management Strategies"]
[null,"Strategic Asset Management Plan","Outlines the asset management strategy applied over the life cycle of network assets.","Forecast capital expenditure\nForecast operating expenditure","No"]
[null,"Asset Risk Management Framework","Provides a high level overview of the quantitative risk techniques ","Forecast capital expenditure","No"]
[]
[]
[null,"Asset Management Plans"]
[null,"Network Investment Outlook","Overview of Powerlink's long term investment outook.","Forecast capital expenditure\nForecast operating expenditure","No"]
[null,"Facilities Asset Management Plan","Sets out Powerlink's approach to management of commercial buildings and facilities.","Forecast capital expenditure\nForecast operating expenditure","No"]
[null,"Fleet Asset Management Plan","Sets out Powerlink's approach to the management of motor vehicle assets.","Forecast capital expenditure\nForecast operating expenditure","No"]
[null,"OT Plan 27-32","Includes the approach to asset management for Operational Technology systems.","Forecast capital expenditure","No"]
[null,"IT Plan 27-32","Includes the appproach to asset management for non-network information technology systems.","Forecast capital expenditure \nForecast operating expenditure","No"]
[null,"Transmission Annual Planning Report 2025","Provides information to interested stakeholders on the planning and development of the Queensland transmission network.","Forecast capital expenditure\nForecast operating expenditure","No"]
[null,"Secondary Systems Asset Strategy 2020-2027","Outlines the approach to asset management for Secondary systems","Forecast capital expenditure","No"]
[null,"Telecommunications Asset Strategy 2020-2027","Outlines the approach to asset management for Telecommunications systems.","Forecast capital expenditure","No"]
[]
[]
[]
[]
[]
[]
[]
[]
[]
[]
[]
[]
[]
[]
[]
[null,"Capital expenditure policies and procedures (including capex approval policies and procedures and replacement policy) "]
[null,"Regulated Network Project Approval Process - Specification","Provides a high level overview of regulated network capital project approval process.","Forecast capital expenditure","No"]
[]
[]
[]
[null,"Internal standards for network planning, design, maintenance and operation"]
[null,"Asset Maintenance Standard","Establishes the overarching approach to maintenance needs, plans and work.","Forecast operating expenditure","No"]
[null,"Asset Planning Criteria ","Outlines the criteria Powerlink applies in planning of the transmission network.","Forecast capital expenditure","No"]
[null,"Asset Refurbishment Standard","Establishes the overarching approach to operational refurbishment needs, plans & projects. ","Forecast operating expenditure","No"]
[null,"Digital Asset Management Framework","Sets out the whole of life asset management philosophy for Powerlink’s Digital assets.","Forecast capital expenditure\nForecast operating expenditure","No"]
[null,"HV Underground Cable Asset Methodology","Sets out the whole of life asset management philosophy for Powerlink’s HV underground cable assets.","Forecast capital expenditure\nForecast operating expenditure","No"]
[null,"Joint Planning Framework","Outlines Powerlink's approach to jointly plan the network with other TNSPs, DNSPs and EAMO","Forecast capital expenditure","No"]
[null,"Land Asset Methodology ","Sets out the whole of life asset management philosophy for Powerlink’s Land assets.","Forecast capital expenditure\nForecast operating expenditure","No"]
[null,"Substation Asset Methodology ","Sets out the whole of life asset management philosophy for Powerlink’s Substation assets.","Forecast capital expenditure\nForecast operating expenditure","No"]
[null,"Transmission Line Asset Methodology ","Sets out the whole of life asset management philosophy for Powerlink’s Transmission Line assets.","Forecast capital expenditure\nForecast operating expenditure","No"]
[]
[]
[]
[]
[]
[]
[]
[]
[]
[]
[]
[]
[]
[]
[]
[]
[]
[]
[]
[]
[]
[]
[]
[]
[]
[]
[]
[]
[]
[]
[]
[]
[]
[]
[]
[]
[]
[]
[]
[]
[]
[]
[]
[]
[]
[]
[]
[]
[]
[]
[]
[]
[]
[]
[]
[]
[]
[]
[]
[]
[]
[]
[]
[]
[]
[]
[]
[]
[]
[]
[null,"Procurement and contracting out policies"]
[null,"Procurement – Framework","Describes approach to procurement practices.","Forecast capital expenditure\nForecast operating expenditure","No"]
[]
[]
[]
[null,"Information technology policies or strategies"]
[null,"IT Plan 2027-32","Sets out Powerlink's proposed IT investments in the 2072-32 regulatory period.","Forecast capital expenditure\nForecast operating expenditure","No"]
[]
[]
[]
[]
[]
[]
[]
[]
[]
[]
[]
[]
[]
[]
[]
[]
[]
[]
[]
[]
[]
[]
[]
[]
[]
[]
[]
[]
[]
[]
[]
[]
[]
[]
[]
[null,"Demand management policies or strategies"]
[null,"Transmission Annual Planning Report 2025","Provides information to interested parties on network developments and potential opportunities for provision of demand management solutions.","Forecast capital expenditure\nForecast operating expenditure","No"]
[]
[]
[null,"Self insurance guidelines or policy"]
[null,"Marsh - Insurance Report","Sets out Powerlink's independent advice on self insurance requirements for the 2023-27 regulatory period.","Forecast operating expenditure","No"]
[]
[]
[]
[null,"Land and easement acquisition polices"]
[null,"Powerlink - Strategic Network Land Acquisition – Strategy","Develops a practical framework for establishing Powerlink’s land acquisition requirements ","Forecast capital expenditure","No"]
[null,"Supergrid Landholder Payment Framework","Outlines Powerlink’s process for determining landholder easement compensation payments","Forecast capital expenditure","No"]
[null,"Transmission Easement Engagement Process","Defines the end to end process for Powerlink’s  land acquisition projects","Forecast capital expenditure","No"]
[]
[null,"Asset security plans and policies"]
[null,"Powerlink Protective Security – Strategy","Describes how Powerlink applies security to its business operations and transmission services. ","Forecast capital expenditure\nForecast operating expenditure","Yes"]
[null,"Enterprise Information Security Strategy","Outlines Powerlink’s security drivers and strategy in regard to information security. ","Forecast capital expenditure\nForecast operating expenditure","No"]
[]
[]
[]
[]
[]
[]
[]
[]
[null,"Disaster recovery policy"]
[null,"Enterprise Resilience Policy","Sets out Powerlink's approach to proactively plan for and management the impact of emergencies and natural disasters to the transmission network and its business operations.","Forecast capital expenditure\nForecast operating expenditure","No"]
[null,"Business Continuity Management – Standard","Defines Powerlink’s approach to and definition of Business Continuity \nManagement","Forecast capital expenditure\nForecast operating expenditure","No"]

{"sheet":"7.2 Contingent projects","index":20,"n_rows":28,"n_cols":6,"rows_kept":28,"cut":false,"hidden":false,"merged":[]}
[null,{"$f":"(LOOKUP(dms_Model,dms_Model_List,dms_Worksheet_List))","v":"REGULATORY REPORTING STATEMENT"}]
[null,{"$f":"dms_TradingName","v":"Powerlink"}]
[null,{"$f":"CONCATENATE(\"REGULATORY PERIOD FROM \", FRCP_y1,\" TO \",dms_MultiYear_FinalYear_Result)","v":"REGULATORY PERIOD FROM 2027-28 TO 2031-32"}]
[null,"7.2 CONTINGENT PROJECTS"]
[]
[]
[null,"7.2.1 - PROPOSED CONTINGENT PROJECTS FOR THE FORTHCOMING REGULATORY CONTROL PERIOD"]
[null,"Proposed contingent project name","Proposed contingent capital expenditure \n($0's, nominal)","Proposed trigger events",{"$f":"CONCATENATE(\"Proposed MAR for \", FRCP_y1,\" \n($0's, nominal)\")","v":"Proposed MAR for 2027-28 \n($0's, nominal)"},{"$f":"CONCATENATE(\"5 per cent of the \", FRCP_y1,\" ($0's, nominal) MAR\")","v":"5 per cent of the 2027-28 ($0's, nominal) MAR"}]
[null,"Northern Bowen Basis Reinforcement",502866617.32050335,"Additional customer demand",989766712,{"$f":"+E9*0.05","v":49488335.600000001}]
[null,"Central Queensland System Strength",511621021.465581,"Generation closure/minimum demand",{"$f":"+$E$9","v":989766712},49488335.600000001]
[null,"Southern Queensland System Strength",255810510.7327905,"Generation closure/minimum demand",989766712,49488335.600000001]
[null,"North Brisbane Area Network Development",281846336.04737228,"Additional customer demand",989766712,49488335.600000001]
[null,"Gladstone Area Augmentation",425782383.41968912,"Market benefit/Energy Roadmap",989766712,49488335.600000001]
[null,"Central Queensland to North Queensland Reinforcement",2032840858.6232419,"Market benefit/Energy Roadmap",989766712,49488335.600000001]
[null,"South-West Queensland network augmentation",89817912.657290891,"Market benefit/Energy Roadmap",989766712,49488335.600000001]
[null,"Surat Basin Area Network Development",731845447.81643224,"Market benefit/Energy Roadmap",989766712,49488335.600000001]
[null,"Brisbane Area Transfer Capacity",73446039.970392287,"Market benefit/Energy Roadmap",989766712,49488335.600000001]
[null,null,null,null,989766712,49488335.600000001]
[null,null,null,null,989766712,49488335.600000001]
[null,null,null,null,989766712,49488335.600000001]
[null,null,null,null,989766712,49488335.600000001]
[null,null,null,null,989766712,49488335.600000001]
[null,null,null,null,989766712,49488335.600000001]
[null,null,null,null,989766712,49488335.600000001]
[null,null,null,null,989766712,49488335.600000001]
[null,null,null,null,989766712,49488335.600000001]
[null,null,null,null,989766712,49488335.600000001]
[null,null,null,null,989766712,49488335.600000001]

{"sheet":"7.3 Obligations","index":21,"n_rows":298,"n_cols":5,"rows_kept":298,"cut":false,"hidden":false,"merged":[[6,1,6,2]]}
[null,{"$f":"(LOOKUP(dms_Model,dms_Model_List,dms_Worksheet_List))","v":"REGULATORY REPORTING STATEMENT"}]
[null,{"$f":"dms_TradingName","v":"Powerlink"}]
[null,{"$f":"CONCATENATE(\"REGULATORY PERIOD FROM \", FRCP_y1,\" TO \",dms_MultiYear_FinalYear_Result)","v":"REGULATORY PERIOD FROM 2027-28 TO 2031-32"}]
[null,"7.3  OBLIGATIONS, REQUIREMENTS & STANDARDS"]
[]
[null,"Instructions"]
[null,{"$f":"CONCATENATE(\"Outline those obligations and requirements that \",dms_TradingName, \" identifies as having a material impact on expenditure requirements.\")","v":"Outline those obligations and requirements that Powerlink identifies as having a material impact on expenditure requirements."}]
[]
[null,"7.3.1 - OBLIGATIONS OR REQUIREMENTS"]
[null,null,"Brief description","Relevance to regulatory proposal","Expenditure impact"]
[null,null,"Description of relevant obligations or requirements within the instrument (e.g. safety obligations, reliability targets) ","Identify what element of the proposal/supporting documents the obligation or requirement is relevant to e.g. replacement capex, capacity utilisation thresholds, opex ","Is the obligation or requirement identified in the response to section 4 'Step Changes' of the notice (yes or no)?"]
[null,"Legislation"]
[null,"Aboriginal Cultural Heritage Act 2003(Qld)","This Act provides a framework for the recognition, protection and conservation of Aboriginal cultural heritage which includes an obligation to avoid harm to cultural heritage which applies to Powerlink's activities related to the construction, operation and maintenance of transmission network infrastructure. \n","Forecast capital expenditure\nForecast operating expenditure","No"]
[null,"Acquisition of Land Act 1967 (Qld) and associated regulation","This Act relates to the acquisition of land or an interest in land which includes an easement for electricity works and the payment of compensation to the interest holders of the land over which an easement or other interest is taken.","Forecast capital expenditure","No"]
[null,"Anti-Discrimination Act 1991 (Qld) \nAge Discrimination Act 2004 (Cth)\nDisability Discrimination Act 1992 (Cth)\nRacial Discrimination Act 1975 (Cth)\nSex Discrimination Act 1984 (Cth) \n","These laws provide the framework to protect people from unfair discrimination and other objectionable conduct and applies to Powerlink as an employer.","Forecast operating expenditure","No"]
[null,"Biosecurity Act 2014 (Qld) and associated regulation\n\n\n\n\n\n","This Acts provides a framework for managing biosecurity risks that Powerlink must apply when constructing, operating and maintaining transmission infrastructure and for reporting and notifying of incidents. ","Forecast capital expenditure\nForecast operating expenditure","No"]
[null,"Civil Aviation Act 1998 (Cth) and associated regulations","This Act regulates the safe operation of aircraft (including drones) and aerial work (including helicopter flight operations). It provides a system of licensing and operational requirements and applies to Powerlink inspection of its transmission infrastructure network. ","Forecast operating expenditure","No"]
[null,"Coastal Protection and Management Act 1995 (Qld) ","This Act provdies a framework for the protection, conservation and management of the Queensland coast and its resources and applies to certain Powerlink activities carried out in those areas or impacting on tidal waters and associated resources. ","Forecast capital expenditure\nForecast operating expenditure","No"]
[null,"Corporations Act 2001 (Cth)","This Act includes a corporate sector whistleblower protection regime for whistleblowers who report misconduct about companies and company officers. Companies are required to have a whistleblower policy and apply particular processes including protections of whistleblowers. The regime applies to Powerlink.","Forecast operating expenditure","No"]
[null,"Crime and Corruption Act\n2001 (Qld)","This Act provides a framework for the management and notification of complaints of suspected corrupt conduct. ","Forecast operating expenditure","No"]
[null,"Economic Development Act 2012 (Qld) ","This Act facilitates economic development and development for community purposes which regulates development in declared priority development areas (PDAs). Development of Powerlink's network infrastructure in PDAs is subject to requirements and approval.","Forecast capital expenditure\nForecast operating expenditure","No"]
[null,"Electrical Safety Act 2002 (Qld)","This Act sets out compliance obligations for electricity entities to ensure electricity works are operated in a way that is electrically safe.  This includes requirements that Powerlink inspects, tests and maintains its works.","Forecast capital expenditure\nForecast operating expenditure","No"]
[null,"Electrical Safety Regulation 2013 (Qld)","This Regulation sets out the more detailed requirements for how an electricity entity complies with the Electrical Safety Act. ","Forecast capital expenditure\nForecast operating expenditure","No"]
[null,"Electricity Act 1994 (Qld)","This Act includes the following key obligations: (a) comply with technical conditions for operating the transmission grid in the transmission authority area, regulations and National Electricity Law and Rules; (b) must properly take into account the environmental impacts of its activities; (c) pay the amounts required under the authority or the regulations for administering the authority and its conditions; (d) must also pay an annual fee that is a proportion of the cost of the State’s funding commitments to national energy market regulation (AEMC Levy).\n","Forecast capital expenditure\nForecast operating expenditure","No"]
[null,"Electricity Regulation 2006 (Qld)","This Regulation is focused on ensuring a secure, efficient and economic supply of electricity to customers on fair and reasonable terms, ensuring customers' interests are adequately protected, provide for proper measurement and information provision regarding the energy efficiency and performance of electrical equipment and prescribes particular conditions of employees in the government owned electricity industry.","Forecast capital expenditure\nForecast operating expenditure","No"]
[null,"Energy (Infrastructure Facilitation) Act 2024 (Qld)","This Act provides a framework to that includes strategic infrastructure path objectives and ways to help achieve those objectives.","Forecast capital expenditure\nForecast operating expenditure","No"]
[null,"Electricity—National Scheme (Queensland) Act 1997 and the National Electricity Law (NEL)","Electricity transmission entities have a large number of obligations under the NEL. The most significant obligations are to: register with AEMO as a \"Registered Participant\"; comply with the transmission determination that applies to the electricity transmission network services provided; provide the AER with the necessary information or prepare, maintain or keep the information as is requested by the AER in either a \"relevant notice\" or a \"regulatory information instrument\"; provide information to the AER for the purpose of the preparation of a NSP's performance or financial report; comply with the guidelines established by AEMO in relation to the shedding and restoration of loads in order to ensure the safety and security of the National Electricity System; comply with a wide range of obligations relating to the determination and resolution of access disputes, as well as to the restrictions on, variation of and compliance with access determinations; and comply with the general obligation not to prevent or hinder the access of another person to a regulated network service.","Revenue Proposal","No"]
[null,"Environment Protection and Biodiversity Conservation Act 1999 (Cth) and associated regulation","This Act provides a framework to protect and manage matters of national environmental significance (MNES) which includes assessment and approval processes for activities that may impact on MNES as part of developing and constructing transmission network infrastructure.","Forecast capital expenditure\nForecast operating expenditure","No"]
[null,"Environmental Offsets Act 2014 (Qld) and associated subordinate legislation","This Act provides a framework for coordinating the assessment and implementation of environmental offsets for activities that impact on prescribed environmental matters under a range of legislation.","Forecast capital expenditure\nForecast operating expenditure","No"]
[null,"Environmental Protection Act 1994 (Qld) and subordinate legislation ","This Act sets out the obligations for the management of impacts to the environment to avoid harm that apply when constructing, operating and maintaining network infrastructure or related operations. The Act is supported by subordinate legislation which prescribes processes for environmental authorities and environment protection policies for specific environmental aspects.\n","Forecast capital expenditure\nForecast operating expenditure","No"]
[null,"Fair Work Act 2009 (Cth) and associated regulation","This Act provides a framework for cooperative workplace relations and establishes minimum terms and conditions of employment and rights and obligations for employers and employees. ","Forecast capital expenditure\nForecast operating expenditure","No"]
[null,"Fisheries Act 1994 (Qld) and associated regulation","This Act provides a framework to ensure fisheries resources are used in an ecologically sustainble way. Development of Powerlink's network in fish habitat areas or impacting marine plants is subject to requirements and approval. ","Forecast capital expenditure\nForecast operating expenditure","No"]
[null,"Forestry Act 1959 (Qld) ","This Act regulates Timber Reserves and State Forests to preserve them for timber production. Powerlink must obtain a permit to occupy these areas and approval to interfere with forest products as part of construction, operation and maintainenance of the network infrastructure. ","Forecast capital expenditure\nForecast operating expenditure","No"]
[null,"Great Barrier Reef Marine Park Act 1975 (Cth) ","This Act regulates activities in the marine park in the Great Barrier Reef region and applies to Powerlink activities related to the construction of transmission network infrastructure in marine park zones.","Forecast capital expenditure\nForecast operating expenditure","No"]
[null,"Heavy Vehicle National Law Act 2012 (Qld) and associated regulations","This Law is a national scheme for regulating the use of heavy vehicles on roads to ensure public safety, impact minimisation, promote productivity and safe business practices, including chain of resonsiblity obligations that applies to parties with a level of control or influence of heavy vehicles and associted processes.","Forecast capital expenditure\nForecast operating expenditure","No"]
[null,"Human Rights Act 2019 (Qld)","This Act establishes a framework for the protection of human rights in public sector decision making which requires all Powerlink decisions give appropriate consideration to potentially impacted human rights.","Forecast capital expenditure\nForecast operating expenditure","No"]
[null,"Income Tax Assessment Act 1997","This Act establishes obligations for corporations to pay income tax as assessed.","Maximum Allowed Revenue","No"]
[null,"Land Act 1994 (Qld)","This Act sets out a range of legal obligations and processes related to the registration and administration of easements.","Forecast capital expenditure\nForecast operating expenditure","No"]
[null,"Land Regulation 2020 (Qld)","This Regulation sets out the obligations under the Land Act relating to the issuing and managing of Trustee issued leases and permits to third parties.","Forecast capital expenditure\nForecast operating expenditure","No"]
[null,"Land Title Act 1994 (Qld)","This Act relates to the registration and administration of easements and are broadly similar to its obligations under the Land Act 1994. ","Forecast capital expenditure\nForecast operating expenditure","No"]
[null,"Marine Parks Act 2004 (Qld) ","This Act provides a regulatory framework for multi-use management to allow certain activties to occur in marine parks and applies to Powerlink activities related to the construction and maintenance of the transmission network infrastructure in marine parks.","Forecast capital expenditure\nForecast operating expenditure","No"]
[null,"Modern Slavery Act 2018 (Cth) ","This Act requires entities based, or operating, in Australia, which have an annual consolidated revenue of more than $100 million, to report annually on the risks of modern slavery in their operations and supply chains, and actions to address those risks.","Forecast capital expenditure\nForecast operating expenditure","No"]
[null,"National Greenhouse and Energy Reporting Act 2007 (Cth) and associated regulation","This Act establishes a single national reporting framework for the reporting and dissemination of information related to greenhouse gas emissions, projects, energy consumption and energy production of businesses.","Forecast operating expenditure","No"]
[null,"Nature Conservation Act 1992 (Qld) and subordinate legislation","This Act and related subordinate legislation sets out the protected area, protected plants and protected animals framework under which Powerlink may obtain permission to construct, operate and maintain network infrastructure within protected areas and the requirements for taking a protected plant and impacts to protected animals.\n","Forecast capital expenditure\nForecast operating expenditure","No"]
[null,"Ozone Protection and Synthetic Greenhouse Gas Management Act 1989 (Cth) and associated subordinate legislation","This Act provides a framework to control the manufacture, import, export, use and disposal of ozone depleting substances and synthetic greenhouse gases and products containing these gases. Approval processes apply to Powerlink’s SF6 reprocessing plant processes for recovery, storage, conditioning and dispensing of SF6 gas recovered from insulated HV Gas Insulated Switchgear (GIS), bus ducts, circuit breakers and other devices or instruments containing SF6 gas.","Forecast operating expenditure","No"]
[null,"Planning Act 2016 (Qld) and associated regulation","This Act provides a framework for the integration of planning, environment and development assessment requirements at the local, regional and State levels. The Act provides for the Infrastructure Designation process for the development of Powerlink's network infrastructure.","Forecast capital expenditure","No"]
[null,"Radiocommunications Act 1992 (Cth) and associated regulations","This Act provides for the regulation of the radiofrequency spectrum. It provides a system of licensing for commercial use of spectrum (including microwaves in communication systems). ","Forecast operating expenditure","No"]
[null,"Security of Critical Infrastructure Act 2018 (Cth)  and the Security of Critical Infrastructure Rules 2018 (Cth) ","This Act establishes a regime to manage national security risks from foreign involvement in Australia’s critical infrastructure. The related rules prescribe critical infrastructure assets which includes Powerlink's transmission infrastructure network and provides further information requirements for reporting.","Forecast capital expenditure\nForecast operating expenditure","Yes"]
[null,"Vegetation Management Act 1999 (Qld) and associated regulation","This Act sets out requirements for the clearing, conservation and management of native vegetation related to Powerlink constructing, operating and maintaining its transmission network infrastructure.","Forecast capital expenditure\nForecast operating expenditure","No"]
[null,"Waste Reduction and Recycling Act 2011 (Qld) and associated regulation ","This Act provides a framework for waste management and applies to Powerlink potential waste types that may be generated at a Powerlink facility or operation, or a result of construction of transmission network infrastructure.","Forecast capital expenditure\nForecast operating expenditure","No"]
[null,"Water Act 2000 (Qld) and associated regulation","This Act provides a framework for managing water use and activities that may impact on water resources that apply to Powerlink activities related to the construction of transmission network infrastructure. ","Forecast capital expenditure\nForecast operating expenditure","No"]
[null,"Wet Tropics World Heritage Protection and Management Act 1993 (Qld) and associated subordinate legislation","This Act regulates activities in the wet tropics area and applies to Powerlink as part of construction and maintenance of the network infrastructure in the wet tropics area. ","Forecast capital expenditure\nForecast operating expenditure","No"]
[null,"Work  Health and Safety Regulation 2011 (Qld)","The Regulation sets out the legal requirements to eliminate, minimise or control workplace risks.","Forecast capital expenditure\nForecast operating expenditure","No"]
[null,"Work Health and Safety Act 2011(Qld)","This Act sets out the requirements for Powerlink to maintain appropriate health and safety standards to ensure the safety of its employees and other persons.  \n","Forecast capital expenditure\nForecast operating expenditure","No"]
[]
[]
[]
[]
[]
[]
[]
[]
[]
[]
[]
[]
[]
[]
[]
[]
[]
[]
[]
[]
[]
[]
[]
[]
[]
[]
[]
[]
[]
[]
[]
[]
[]
[]
[]
[]
[]
[]
[]
[]
[]
[]
[]
[]
[]
[]
[]
[]
[]
[]
[]
[]
[]
[]
[]
[]
[]
[]
[]
[]
[]
[]
[]
[]
[]
[]
[]
[]
[]
[]
[]
[]
[]
[]
[]
[]
[]
[]
[]
[]
[]
[]
[]
[]
[]
[]
[]
[]
[]
[]
[]
[]
[]
[]
[]
[]
[]
[]
[]
[]
[]
[]
[]
[]
[]
[]
[]
[]
[]
[]
[]
[]
[]
[]
[]
[]
[]
[]
[]
[]
[]
[]
[]
[]
[]
[]
[]
[]
[]
[]
[]
[]
[]
[]
[]
[]
[]
[]
[]
[]
[]
[]
[]
[]
[]
[]
[]
[]
[]
[]
[]
[]
[]
[]
[]
[]
[]
[]
[]
[]
[]
[]
[]
[]
[]
[]
[]
[]
[]
[null,"Licences"]
[null,"Electricity Act 1994 (Qld)","Powerlink's Transmission Authority sets out the licence obligations and reliability standard to which Powerlink must comply.","Forecast capital expenditure\nForecast operating expenditure","No"]
[]
[]
[]
[null,"Rules"]
[null,"National Electricity Rules\n","The Rules contain provisions that impose specific obligations on the different entities that operate within the electricity industry.  TNSPs, such as Powerlink, have a number of obligations under the Rules which apply to different parts of their operations, including registration as a NSP, technical standards of operation, network connections, economic regulation and metering.","Revenue Proposal","No"]
[]
[]
[]
[null,"Orders"]
[]
[]
[]
[null,"Codes"]
[null,"Accepted Development Vegetation Clearing Code \nClearing for Infrastructure (Qld)","This Code regulates the clearing of certain categories of remnant vegetation and allows certain infrastrucuture development, including transmission infrastructure, to occur without assessment provided it meets the requirements of the Code.","Forecast capital expenditure\nForecast operating expenditure","No"]
[null,"Code of Practice - Maintenance of Electricity Corridors in Queensland's Parks and Forest (Qld) ","This Code sets out the processes and requirements for maintaining transmission infrasturcutre in Parks and Forests and in the Wet Tropics of Queensland World Heritage Area.","Forecast capital expenditure\nForecast operating expenditure","No"]
[null,"Code of Practice 2011 How to Manage and Control Asbestos in the Workplace (Qld)","This Code sets out practices to control the risks of asbestos-containing materials in workplaces.  ","Forecast capital expenditure\nForecast operating expenditure","No"]
[null,"Code of Practice 2011 How to Safely Remove Asbestos (Qld)","This Code sets out practices for the safe removal of asbestos and asbestos-containing material from buildings and structures, plant and equipment and vehicles.  ","Forecast capital expenditure\nForecast operating expenditure","No"]
[null,"Construction and Operation of Solar Farms Code of Practice 2019 (Qld)","This Code sets out how duty holders can comply with work health and safety and electrical safety duties during the design, construction, commissioning, operation, maintenance and end of life management of solar farms. This includes installers of electrical equipment or an electrical installation which can include Powerlink. ","Forecast capital expenditure\nForecast operating expenditure","No"]
[null,"Electrical Code of Practice 2013 Managing Electrical Risks in the Workplace (Qld)                                            ","This Code sets out practices to manage electrical risk when working near exposed live parts.  ","Forecast capital expenditure\nForecast operating expenditure","No"]
[null,"Electrical Code of Practice 2020 - Working Near Overhead and Underground Electric Lines (Qld)","This Code sets out compliance requirements to ensure that no person, plant or thing comes within an unsafe distance (exclusion zone) of an overhead electric line.","Forecast capital expenditure\nForecast operating expenditure","No"]
[null,"Electrical Safety Code of Practice 2020 - Works (Qld)","This Code sets out how to manage risks associated with associated with earthing systems, underground cable systems, and supporting structures for overhead lines forming parts of the works of an electricity entity. ","Forecast capital expenditure\nForecast operating expenditure","No"]
[null,"How to Manage Work Health and Safety Risks Code of Practice 2011 (Qld)","This Code applies to all types of work and all workplaces covered by the WHS Act. ","Forecast capital expenditure\nForecast operating expenditure","No"]
[null,"Queensland Electricity Supply Industry Code of Practice for Maintenance of Electricity Corridors (Qld)","This Code sets out the processes and requirements for maintaining Powerlink's transmission infrastructure in protected areas. ","Forecast capital expenditure\nForecast operating expenditure","No"]
[null,"State Government Supported  Infrastructure Koala Conservation Policy (Qld)","This policy establishes critiera to reduce adverse impacts on koalas and koala habitat and applies to the planning and delivery of all Queensland Government supported infrastructure projects within the South East Queensland Koala Protection Area (SEQKPA) that are not otherwise regulated or where no development approval is required.","Forecast capital expenditure\nForecast operating expenditure","No"]
[null,"Work Health and Safety Consultation, Co-operation and Co-ordination Code of Practice 2011 (Qld)","This Code sets out how to effectively consult with workers, includes mechanisms to facilitate worker participation and representation and consultation, co-opereration and co-ordination of activities of share duty holders.","Forecast capital expenditure\nForecast operating expenditure","No"]
[]
[]
[]
[null,"Guidelines"]
[null,"AER's Better Regulation Guidelines and Schemes","Guidelines relate to confidentiality, expenditure forecast assessment, cost allocation, capital expenditure incentives, rate of return and consumer engagement. Schemes include STPIS and EBSS.","Revenue Proposal","No"]
[null,"Corporate Goverannce Guidelines for Government Owned Corporations","This guideline sets the Government Owned Corporation Shareholder expectations for governance and reporting arrangements.","Revenue Proposal","No"]
[]
[]
[]
[]
[]
[]
[]
[]
[]
[]
[]
[]
[]
[]
[]
[]
[]
[]
[]
[]
[]
[]
[]
[]
[]
[]
[]
[]
[]
[]
[]
[]
[]
[]
[]
[]
[null,"Default agreements "]
[]
[]
[]
[]
[null,"Other"]

{"sheet":"7.4 Shared Assets","index":22,"n_rows":29,"n_cols":11,"rows_kept":29,"cut":false,"hidden":false,"merged":[[7,1,8,1],[7,2,8,2]]}
[null,{"$f":"(LOOKUP(dms_Model,dms_Model_List,dms_Worksheet_List))","v":"REGULATORY REPORTING STATEMENT"}]
[null,{"$f":"dms_TradingName","v":"Powerlink"}]
[null,{"$f":"CONCATENATE(\"REGULATORY PERIOD FROM \", FRCP_y1,\" TO \",dms_MultiYear_FinalYear_Result)","v":"REGULATORY PERIOD FROM 2027-28 TO 2031-32"}]
[null,"7.4 SHARED ASSETS"]
[]
[]
[null,"7.4.1 - TOTAL UNREGULATED REVENUE EARNED WITH SHARED ASSETS "]
[null,"Name of shared asset unregulated service","Description of shared assets used to provide the service",{"$f":"CONCATENATE(\"REVENUE  ($0's, real \", dms_DollarReal,\")\")","v":"REVENUE  ($0's, real June 2027)"}]
[null,null,null,{"$f":"dms_y4","v":"2025-26"},{"$f":"dms_y5","v":"2026-27"},{"$f":"dms_y6","v":"2027-28"},{"$f":"dms_y7","v":"2028-29"},{"$f":"dms_y8","v":"2029-30"},{"$f":"dms_y9","v":"2030-31"},{"$f":"dms_y10","v":"2031-32"},{"$f":"CONCATENATE(\"Total \n\",FRCP_y1, \" to \", dms_MultiYear_FinalYear_Result)","v":"Total \n2027-28 to 2031-32"}]
[null,"Property Rentals ","Property Rentals ",543225.89169600001,543225.89169599989,543225.89169599989,543225.89169599989,543225.89169599989,543225.89169599989,543225.89169600001,{"$f":"SUM(F10:J10)","v":2716129.4584799996}]
[null,"Tower Access","Tower Access",1810449.1961092798,1810449.1961092798,1810449.1961092798,1810449.1961092798,1810449.1961092798,1810449.1961092795,1810449.19610928,9052245.9805463981]
[null,"QDATA","QDATA",0,0,53302.799999999988,53302.799999999996,53302.799999999996,53302.799999999988,53302.799999999996,266513.99999999994]
[null,"Property Searches","Property Searches",0,0,207108.22129007996,207108.22129007996,207108.22129007999,207108.22129007996,207108.22129007999,1035541.1064503998]
[null,"Easement compensation","Easement compensation",0,0,999999.99999999988,999999.99999999988,1000000.0000000001,999999.99999999988,1000000,5000000]
[null,null,null,null,null,null,null,null,null,null,0]
[null,null,null,null,null,null,null,null,null,null,0]
[null,null,null,null,null,null,null,null,null,null,0]
[null,null,null,null,null,null,null,null,null,null,0]
[null,null,null,null,null,null,null,null,null,null,0]
[null,null,null,null,null,null,null,null,null,null,0]
[null,null,null,null,null,null,null,null,null,null,0]
[null,null,null,null,null,null,null,null,null,null,0]
[null,null,null,null,null,null,null,null,null,null,0]
[null,null,null,null,null,null,null,null,null,null,0]
[]
[]
[]
[null,"7.4.2 - SHARED ASSET UNREGULATED SERVICES - APPORTIONMENT METHODOLOGY"]
[null,"Name of shared asset unregulated service for which revenues were apportioned","Apportionment methodology"]

{"sheet":"7.5 Large Projects","index":23,"n_rows":93,"n_cols":9,"rows_kept":93,"cut":false,"hidden":false,"merged":[]}
[null,{"$f":"(LOOKUP(dms_Model,dms_Model_List,dms_Worksheet_List))","v":"REGULATORY REPORTING STATEMENT"}]
[null,{"$f":"dms_TradingName","v":"Powerlink"}]
[null,{"$f":"CONCATENATE(\"REGULATORY PERIOD FROM \", FRCP_y1,\" TO \",dms_MultiYear_FinalYear_Result)","v":"REGULATORY PERIOD FROM 2027-28 TO 2031-32"}]
[null,"7.5 LARGE PROJECTS"]
[]
[]
[null,"\n7.5.1 - OPERATING EXPENDITURE"]
[null,null,"EXPENDITURE"]
[null,null,{"$f":"CONCATENATE(\"Forecast  ($0's, real \",dms_DollarReal,\")\")","v":"Forecast  ($0's, real June 2027)"}]
[null,null,{"$f":"dms_y4","v":"2025-26"},{"$f":"dms_y5","v":"2026-27"},{"$f":"dms_y6","v":"2027-28"},{"$f":"dms_y7","v":"2028-29"},{"$f":"dms_y8","v":"2029-30"},{"$f":"dms_y9","v":"2030-31"},{"$f":"dms_y10","v":"2031-32"}]
[null,"PROJECT NAME/ID"]
[]
[]
[]
[]
[]
[]
[]
[]
[]
[]
[]
[]
[]
[]
[]
[]
[]
[]
[]
[]
[]
[]
[]
[]
[]
[]
[]
[]
[]
[]
[]
[]
[]
[]
[]
[null,"Total ",{"$f":"SUM(C12:C46)","v":0},0,0,0,0,0,0]
[]
[]
[]
[]
[null,"7.5.2 - CAPITAL EXPENDITURE\t\t"]
[null,null,"EXPENDITURE"]
[null,null,{"$f":"CONCATENATE(\"Forecast  ($0's, real \",dms_DollarReal,\")\")","v":"Forecast  ($0's, real June 2027)"}]
[null,null,{"$f":"dms_y4","v":"2025-26"},{"$f":"dms_y5","v":"2026-27"},{"$f":"dms_y6","v":"2027-28"},{"$f":"dms_y7","v":"2028-29"},{"$f":"dms_y8","v":"2029-30"},{"$f":"dms_y9","v":"2030-31"},{"$f":"dms_y10","v":"2031-32"}]
[null,"PROJECT NAME/ID"]
[null,"Buildings - Virginia Uplift",2813646.8622296578,6517120.7925822837,19287239.38691362,63373308.28624928,15184108.938053558,3720262.3826452796,4765994.2349140458]
[null,"Coppabella Substation Reinvestment",0,0,5306549.6968836971,10404551.487210827,21494314.489731465,21129244.816343505,0]
[null,"Woree-Kamerunga 132kV Line Reinvestment",3880892.2237650449,21328760.916184828,68635904.075124219,38831872.763514608,16150829.107792599,19691957.287852552,4498920.6511145746]
[null,"Oonooie Substation Reinvestment",0,0,0,196288.04796944454,297008.29367966152,20538153.506053131,36041097.943160757]
[null,"T053 Kamerunga Substation Rebuild",3985781.202785721,18616570.750740208,31555486.63537747,25865396.269065857,14978377.037636446,3930456.4000234487,0]
[null,"BS1220 & BS1671 Ross to Chalumbin Life Extension",1289180.1620231953,1802939.0176912271,23342591.464055516,24785429.372582048,22434315.852263849,22650070.531614959,21954733.767326355]
[null,"H031 Molendinar Secondary Systems Replacement",3527.4163644653631,0,14698445.842446527,14863252.483095393,15688338.000831766,11116883.875817094,407252.91371488041]
[null,"Woolooga-South Pine 275kV Modified Refit BS1020",0,2486579.6701549869,782367.61312758364,1184481.1694501287,20191718.385423105,20549659.146015014,8382155.2678164626]
[null,"Substation Physical Security",0,0,8407805.1849433593,18985367.342040725,29661090.851560287,43618697.154147729,45910702.691340089]
[null,"Nebo to Bouldercombe Strategic Easement",0,0,7491890.5207810774,18511347.122487113,21251740.907346692,61514349.013538174,42302520.169412017]
[null,"Calliope River to Wurdong Strategic Easement",0,0,4797048.3819859922,7610540.8083474366,21512221.508408614,17237678.866796523,0]
[null,"Buildings - Gladstone",0,0,14981848.599169707,18105655.74336556,23482362.640290439,0,0]
[null,"Grantleigh Substation Reinvestment",0,0,0,0,0,352338.57387554628,28793959.044181172]
[null,"H021 Murarrie Secondary Systems Replacement",0,0,0,0,815026.02400918002,15804627.012950173,18876358.439814933]
[null,"H014 Middle Ridge Secondary Systems Replacement",0,0,0,334364.03688092757,9116028.0251419097,11620014.321820837,16008877.694021996]
[null,"Replace 275kV ABB IMB300 CT's - Surat",7454126.9787135646,7857070.4346694015,8200512.17056036,12258426.517177248,3469058.6019745478,106638.71826411507,0]
[null,"South Pine 110 kV Secondary System Replacement",0,0,0,0,0,779058.26792331447,19896286.666732781]
[null,"Telecommunication Network Consolidation RAN 2",5674928.8445035974,11250147.799918588,16746600.135514425,9319906.5336684138,0,0,0]
[null,"Telecommunication Network Consolidation RAN 4",0,0,0,0,0,17555590.474031858,12189930.678201154]
[null,"NGNO Advanced Energy Management System",47502498.419208623,50210852.843487963,17799789.715858407,0,0,0,0]
[null,"Davies Creek – Bayview Heights 275kV Refit",12063281.47716805,0,0,0,0,0,0]
[null,"Nebo Secondary Systems Replacement",1369850.06601004,0,0,0,0,0,0]
[null,"Lilyvale Selected Primary Plant  Replacement",9819706.2159157712,6516831.7609095909,430440.23561757908,0,0,0,0]
[]
[]
[]
[]
[]
[]
[]
[]
[]
[]
[]
[]
[]
[null,"Total",{"$f":"SUM(C57:C92)","v":95857419.868687734},126586873.98633908,242464519.65835953,264630187.983105,235726538.6641441,291915680.34971327,260028790.16175121]

{"sheet":"7.9 STPIS","index":24,"n_rows":24,"n_cols":13,"rows_kept":24,"cut":false,"hidden":false,"merged":[[7,11,8,11],[7,12,8,12],[7,1,8,1],[7,8,8,8],[7,9,8,9],[7,10,8,10],[7,2,7,7]]}
[null,{"$f":"(LOOKUP(dms_Model,dms_Model_List,dms_Worksheet_List))","v":"REGULATORY REPORTING STATEMENT"}]
[null,{"$f":"dms_TradingName","v":"Powerlink"}]
[null,{"$f":"CONCATENATE(\"REGULATORY PERIOD FROM \", FRCP_y1,\" TO \",dms_MultiYear_FinalYear_Result)","v":"REGULATORY PERIOD FROM 2027-28 TO 2031-32"}]
[null,"7.9 SERVICE TARGET PERFORMANCE INCENTIVE SCHEME (STPIS)"]
[]
[]
[null,"7.9.1 - Historical performance and proposed floor, caps and targets for the service component of the STPIS"]
[null,"Parameter","Performance actuals",null,null,null,null,null,"Average of actual performance","Floor","Target","Cap","Weighting \n(% of MAR)"]
[null,null,{"$f":"(LEFT(PRCP_y3,2)&RIGHT(PRCP_y3,2))","v":"2020"},{"$f":"LEFT(PRCP_y4,2)&RIGHT(PRCP_y4,2)","v":"2021"},{"$f":"LEFT(PRCP_y5,2)&RIGHT(PRCP_y5,2)","v":"2022"},{"$f":"(LEFT(CRCP_y1,2)&RIGHT(CRCP_y1,2))","v":"2023"},{"$f":"(LEFT(CRCP_y2,2)&RIGHT(CRCP_y2,2))","v":"2024"},{"$f":"(LEFT(CRCP_y3,2)&RIGHT(CRCP_y3,2))","v":"2025"}]
[null,"Unplanned outage circuit event rate:"]
[null,"Transmission line outage - fault",9.0604026845637584,11.447811447811448,7.9734219269102988,7.5409836065573774,10.749185667752444,null,{"$f":"+AVERAGE(C11:H11)","v":9.3543610667190649},11.74,9.35,6.52,2E-3]
[null,"Transformer outage – fault ",11.627906976744185,11.695906432748536,14.035087719298245,10.588235294117647,14.285714285714285,null,12.44657014172458,15.03,12.45,10.25,2E-3]
[null,"Reactive plant – fault ",22.556390977443609,23.308270676691727,16.541353383458645,22.556390977443609,18.656716417910449,null,20.723824486589606,24.27,20.72,16.45,1E-3]
[null,"Transmission line outage – forced outage",18.120805369127517,13.468013468013467,10.963455149501661,11.803278688524591,10.423452768729643,null,12.955801088779376,17.61,12.96,9.34,1E-3]
[null,"Transformer outage – forced outage",18.604651162790699,14.619883040935672,11.111111111111111,12.941176470588237,8.3333333333333321,null,13.122031023751811,19.309999999999999,13.12,7.98,1E-3]
[null,"Reactive plant – forced outage",20.300751879699249,25.563909774436087,21.804511278195488,27.06766917293233,19.402985074626866,null,22.827965435978005,27.91,22.83,18.18,5.0000000000000001E-4]
[null,"Loss of supply event frequency (number of events):"]
[null,">  (x) system minutes - 0.05",0,3,2,2,0,null,{"$f":"+AVERAGE(C18:H18)","v":1.4},4,1.4,0,1.5E-3]
[null,">  (y) system minutes - 0.40",0,1,1,1,0,null,{"$f":"+AVERAGE(C19:H19)","v":0.6},2,0.6,0,1.5E-3]
[null,"Average outage duration (minutes): ",57.407499999999999,44.730000000000004,611.11500000000001,34.248000000000005,58.306666666666665,null,{"$f":"+AVERAGE(C20:H20)","v":161.16143333333335},297.24,161.16,13.2,2E-3]
[null,"Proper operation of equipment (number of events):"]
[null,"Failure of protection system",21,29,22,20,21,null,{"$f":"+AVERAGE(C22:H22)","v":22.6},"N/A","N/A","N/A",0]
[null,"Material failure of SCADA",0,0,0,0,0,null,{"$f":"+AVERAGE(C23:H23)","v":0},"N/A","N/A","N/A",0]
[null,"Incorrect operational isolation of primary or secondary equipment",9,11,2,2,5,null,{"$f":"+AVERAGE(C24:H24)","v":5.8},"N/A","N/A","N/A",0]

{"sheet":"8.2 Capex","index":25,"n_rows":61,"n_cols":4,"rows_kept":61,"cut":false,"hidden":false,"merged":[[8,2,8,3]]}
[null,{"$f":"(LOOKUP(dms_Model,dms_Model_List,dms_Worksheet_List))","v":"REGULATORY REPORTING STATEMENT"}]
[null,{"$f":"dms_TradingName","v":"Powerlink"}]
[null,{"$f":"CONCATENATE(\"REGULATORY PERIOD FROM \", FRCP_y1,\" TO \",dms_MultiYear_FinalYear_Result)","v":"REGULATORY PERIOD FROM 2027-28 TO 2031-32"}]
[null,"8.2 - CAPEX"]
[]
[null,"8.2.7 - IMMEDIATE EXPENSING OF CAPEX"]
[null,"ESTIMATED - AS COMMISSIONED"]
[null,null,"EXPENDITURE"]
[null,null,{"$f":"CONCATENATE(\"$0's, real \", dms_DollarReal)","v":"$0's, real June 2027"}]
[null,"Asset class",{"$f":"dms_y4","v":"2025-26"},{"$f":"dms_y5","v":"2026-27"}]
[null,"Transmission Lines - Overhead",2679388.6842848426,2657458.774685605]
[null,"Transmission Lines - Underground",21600.865966901125,0]
[null,"Transmission Lines - Refit",11869918.828980679,2607257.7518567415]
[null,"Substations Primary Plant",1575510.2351877168,19537444.141452949]
[null,"Substations Secondary Systems",4573670.5349301146,10059875.698554391]
[null,"Communications Other Assets",1584278.6171929538,8953425.2107628193]
[null,"Comms - Civil Works",0,0]
[null,"Network Switching Centres",15606980.304558139,8300911.7793956958]
[null,"Land",0,0]
[null,"Easements",0,0]
[null,"Commercial Buildings",0,0]
[null,"Computer Equipment",1425944.5987190315,1458982.3279784173]
[null,"Office Furniture & Miscellaneous",0,0]
[null,"Office Machines",0,0]
[null,"Vehicles",1686928.1674795526,683439.30611304485]
[null,"Moveable Plant",590162.2950124885,616405.23662957805]
[null,"Insurance Spares",0,0]
[null,"Buildings - capital works",442621.72125936643,2001887.6940015655]
[null,"In-house software",873966.04437618086,894214.97521257843]
[null,"Equity raising costs",0,0]
[]
[]
[]
[]
[]
[]
[]
[]
[]
[]
[]
[]
[]
[]
[]
[]
[]
[]
[]
[]
[]
[]
[]
[]
[]
[]
[]
[]
[]
[]
[null,"Total",{"$f":"SUM(C11:C60)","v":42930970.89794796},{"$f":"SUM(D11:D60)","v":57771302.896643378}]

{"sheet":"8.8 Revenue","index":26,"n_rows":20,"n_cols":9,"rows_kept":20,"cut":false,"hidden":false,"merged":[]}
[null,{"$f":"(LOOKUP(dms_Model,dms_Model_List,dms_Worksheet_List))","v":"REGULATORY REPORTING STATEMENT"}]
[null,{"$f":"dms_TradingName","v":"Powerlink"}]
[null,{"$f":"CONCATENATE(\"REGULATORY PERIOD FROM \", FRCP_y1,\" TO \",dms_MultiYear_FinalYear_Result)","v":"REGULATORY PERIOD FROM 2027-28 TO 2031-32"}]
[null,"8.8 REVENUE"]
[]
[]
[null,"8.8.1 - REVENUE FROM PRESCRIBED SERVICES"]
[null,null,"REVENUE"]
[null,null,{"$f":"CONCATENATE(\"Forecast  ($0's. real \",dms_DollarReal,\")\")","v":"Forecast  ($0's. real June 2027)"}]
[null,null,{"$f":"dms_y4","v":"2025-26"},{"$f":"dms_y5","v":"2026-27"},{"$f":"dms_y6","v":"2027-28"},{"$f":"dms_y7","v":"2028-29"},{"$f":"dms_y8","v":"2029-30"},{"$f":"dms_y9","v":"2030-31"},{"$f":"dms_y10","v":"2031-32"}]
[null,"Prescribed entry services",7016851.4900000002,7241284.3600000003,7474122.7000000002,7707416.29,8116801.2699999996,8676919.1400000006,9408247.5]
[null,"Prescribed exit services",88201145.120000005,91022244.650000006,93949000.060000002,96881477.959999993,102027407.59999999,109068035.15000001,118260761.94]
[null,"Prescribed common transmission services",290165307.88,307025478.87,321555993.08999997,358447054.69,367663153.18000001,386557130.38999999,402414376.86000001]
[null,"Locational TUOS services",237688404.69999999,248547283.47999999,257331212.59,266132316.36000001,281576545.51999998,302707239.66000003,330296924.91000003]
[null,"Non-locational TUOS services",150268862.84,179710252.69,207869228.97,216670332.74000001,232114561.90000001,253245256.03999999,280834941.29000002]
[null,"Net revenue from modified load export charges",5964209.1799999997,5964209.1799999997,5964209.1799999997,5964209.1799999997,5964209.1799999997,5964209.1799999997,5964209.1799999997]
[null,"System strength services",-15659095.960000001,-15880517.189999999,-22223141.32,-50922334.240000002,-54362230.439999998,-61634576.880000003,-61634576.880000003]
[null,"Inter-regional settlements residues; proceeds from auctions",20532173.640000001,18669157.600000001,18669157.600000001,18669157.600000001,18669157.600000001,18669157.600000001,18669157.600000001]
[null,"Intra-regional settlements residues",66445746.399999999,84817290.230000004,84817290.230000004,84817290.230000004,84817290.230000004,84817290.230000004,84817290.230000004]
[null,"Total",{"$f":"SUM(C11:C19)","v":850623605.28999996},927116683.86999989,975407073.0999999,1004366920.8099999,1046586896.0399998,1108070660.51,1189031332.6299999]

{"sheet":"Formatting Styles","index":27,"n_rows":48,"n_cols":11,"rows_kept":48,"cut":false,"hidden":true,"merged":[]}
[null,"THIS WORKSHEET CONTAINS STYLES AND FORMATTING USED IN RIN TEMPLATES"]
[]
[]
[]
[]
[null,null,null,null,null,null,null,null,null,null,"My named range"]
[]
[]
[]
[]
[]
[]
[]
[]
[]
[]
[]
[]
[]
[]
[]
[]
[]
[]
[]
[]
[]
[null,"STYLES IN USE","dms_H2"]
[null,"TOP HEADER","dms_H1"]
[null,"HEADING ONE","dms_1"]
[null,"HEADING TWO","dms_2"]
[null,"HEADING THREE","dms_3"]
[null,"HEADING FOUR","dms_4"]
[null,"HEADING FIVE","dms_5"]
[null,5.1109999999999998,"dms_NUM"]
[null,5.45E-2,"dms_NUM%"]
[null,5.5555000000000003,"dms_NUM3d"]
[null,"Text description","dms_Row_Locked"]
[null,"Text description - not locked","dms_Row1"]
[null,"Text description","dms_Row2"]
[null,"Total","dms_T1"]
[null,"Total","dms_T2"]
[null,"EXPENSES","dms_BH"]
[null,2019,"dms_BY1"]
[null,2019,"dms_BY2"]
[null,"VOLUMES","dms_GH"]
[null,2019,"dms_GY1"]
[null,2019,"dms_GY2"]

{"sheet":"AER Sheet Heading","index":28,"n_rows":44,"n_cols":9,"rows_kept":44,"cut":false,"hidden":true,"merged":[]}
[null,{"$f":"INDEX(dms_Worksheet_List,MATCH(dms_Model,dms_Model_List))","v":"REGULATORY REPORTING STATEMENT"}]
[null,{"$f":"INDEX(dms_TradingNameFull_List,MATCH(dms_TradingName,dms_TradingName_List))","v":"Queensland Electricity Transmission Corporation Limited trading as Powerlink Queensland"}]
[null,{"$f":"CONCATENATE(\"REGULATORY PERIOD FROM \", FRCP_y1,\" TO \",dms_MultiYear_FinalYear_Result)","v":"REGULATORY PERIOD FROM 2027-28 TO 2031-32"}]
[null,"XX"]
[]
[]
[]
[]
[]
[]
[null,null,"EXPENDITURE"]
[null,null,{"$f":"CONCATENATE(\"Forecast ($0's, real \",dms_DollarReal,\")\")","v":"Forecast ($0's, real June 2027)"}]
[null,null,{"$f":"dms_y1","v":"2022-23"},{"$f":"dms_y2","v":"2023-24"},{"$f":"dms_y3","v":"2024-25"},{"$f":"dms_y4","v":"2025-26"},{"$f":"dms_y5","v":"2026-27"},{"$f":"dms_y6","v":"2027-28"},{"$f":"dms_y7","v":"2028-29"}]
[]
[]
[]
[]
[]
[]
[]
[]
[]
[]
[]
[]
[]
[]
[]
[]
[]
[]
[]
[]
[]
[]
[]
[]
[]
[]
[]
[]
[null,null,"VOLUMES"]
[null,null,"0's"]
[null,null,{"$f":"dms_y1","v":"2022-23"},{"$f":"dms_y2","v":"2023-24"},{"$f":"dms_y3","v":"2024-25"},{"$f":"dms_y4","v":"2025-26"},{"$f":"dms_y5","v":"2026-27"},{"$f":"dms_y6","v":"2027-28"},{"$f":"dms_y7","v":"2028-29"}]

{"sheet":"AER CF","index":29,"n_rows":76,"n_cols":25,"rows_kept":76,"cut":false,"hidden":true,"merged":[[41,38,41,59],[41,69,41,90],[3,1,3,22],[39,38,39,59],[39,69,39,90],[40,38,40,59],[40,69,40,90]]}
[null,"AER CONDITIONAL FORMATTING"]
[]
[null,"CELLS FLAGED \"Y\" and greyed out will be greyed out in the worksheets."]
[null,"CONDITIONAL FORMATTING MAP"]
[null,null,null,null,null,"=INDEX(dms_CF_3.6.1, MATCH(dms_TradingName,dms_CF_TradingName))=\"Y\"","=INDEX(dms_CF_3.6.5, MATCH(dms_TradingName,dms_CF_TradingName))=\"Y\"","=INDEX(dms_CF_3.6.6.1, MATCH(dms_TradingName,dms_CF_TradingName))=\"Y\"","=INDEX(dms_CF_3.6.6.2, MATCH(dms_TradingName,dms_CF_TradingName))=\"Y\"","=INDEX(dms_CF_3.6.6.3, MATCH(dms_TradingName,dms_CF_TradingName))=\"Y\"","=INDEX(dms_CF_3.6.7.1, MATCH(dms_TradingName,dms_CF_TradingName))=\"Y\"","=INDEX(dms_CF_3.6.7.2, MATCH(dms_TradingName,dms_CF_TradingName))=\"Y\"","=INDEX(dms_CF_3.6.7.3, MATCH(dms_TradingName,dms_CF_TradingName))=\"Y\"","=INDEX(dms_CF_3.6.7.4, MATCH(dms_TradingName,dms_CF_TradingName))=\"Y\"","=INDEX(dms_CF_3.6.8, MATCH(dms_TradingName,dms_CF_TradingName))=\"Y\"","=INDEX(dms_CF_4.1, MATCH(dms_TradingName,dms_CF_TradingName))=\"Y\"","=INDEX(dms_CF_6.8, MATCH(dms_TradingName,dms_CF_TradingName))=\"Y\"","=INDEX(dms_CF_7.12, MATCH(dms_TradingName,dms_CF_TradingName))=\"Y\"","=INDEX(dms_CF_8.1_A, MATCH(dms_TradingName,dms_CF_TradingName))=\"Y\"","=INDEX(dms_CF_8.1_B, MATCH(dms_TradingName,dms_CF_TradingName))=\"Y\"",{"$f":"INDEX(dms_CF_8.1_Neg, MATCH(dms_TradingName,dms_CF_TradingName))=\"Y\"","v":true},"=INDEX(dms_CF_4.4.1_Neg, MATCH(dms_TradingName,dms_CF_TradingName))=\"Y\"",null,null,"=INDEX(dms_CF_F10, MATCH(dms_TradingName,dms_CF_TradingName))=\"Y\""]
[null,"dms_CF_TradingName","JurisdictionList","Sector","Segment","dms_CF_3.6.1","dms_CF_3.6.5","dms_CF_3.6.6.1","dms_CF_3.6.6.2","dms_CF_3.6.6.3","dms_CF_3.6.7.1","dms_CF_3.6.7.2","dms_CF_3.6.7.3","dms_CF_3.6.7.4","dms_CF_3.6.8","dms_CF_4.1","dms_CF_6.8 (set from dms_MAIFI_flag)","dms_CF_7.12","dms_CF_8.1_A  (and 8.4)","dms_CF_8.1_B  (and 8.4)","dms_CF_8.1_Neg  (and 8.4)","dms_CF_4.4.1","dms_CF_MAIFI_flag (set from dms_MAIFI_flag)","9.5 TUOS (set from Jurisdiction)","dms_CF_F10"]
[null,"Amadeus","NT","Gas","Transmission","-","-","-","-","-","-","-","-","-","-","-","-","-","-","-","-","-","-","-","-"]
[null,"APA GasNet","Vic","Gas","Transmission","-","-","-","-","-","-","-","-","-","-","-","-","-","-","-","-","-","-","-","-"]
[null,"Ausgrid","NSW","Electricity","Distribution",null,"Y","N","N","N","N","N","N","Y","N","N",{"$f":"IFERROR(IF(dms_MAIFI_flag=\"Yes\",\"N\",\"Y\"),\"Y\")","v":"Y"},"Y","N","Y","Y","N",{"$f":"IFERROR(LEFT(dms_MAIFI_flag),\"N\")","v":"N"},{"$f":"IF('AER CF'!$C7=\"Vic\",\"Y\",\"N\")","v":"N"}]
[null,"Ausgrid (Tx Assets)","NSW","Electricity","Distribution",null,"Y","N","N","N","N","N","N","Y","N","N",{"$f":"IFERROR(IF(dms_MAIFI_flag=\"Yes\",\"N\",\"Y\"),\"Y\")","v":"Y"},"Y","N","Y","Y","N",{"$f":"IFERROR(LEFT(dms_MAIFI_flag),\"N\")","v":"N"},{"$f":"IF('AER CF'!$C8=\"Vic\",\"Y\",\"N\")","v":"Y"}]
[null,"AusNet (D)","Vic","Electricity","Distribution",null,"N","N",null,null,"N","N","N","N","N","N",{"$f":"IFERROR(IF(dms_MAIFI_flag=\"Yes\",\"N\",\"Y\"),\"Y\")","v":"Y"},"N","N","N","Y","N",{"$f":"IFERROR(LEFT(dms_MAIFI_flag),\"N\")","v":"N"},{"$f":"IF('AER CF'!$C9=\"Vic\",\"Y\",\"N\")","v":"N"}]
[null,"AusNet Services Tx","Vic","Electricity","Transmission",null,"N",null,null,null,"N","N","N","N","N","Y",{"$f":"IFERROR(IF(dms_MAIFI_flag=\"Yes\",\"N\",\"Y\"),\"Y\")","v":"Y"},"N","N","N","Y","N",{"$f":"IFERROR(LEFT(dms_MAIFI_flag),\"N\")","v":"N"},{"$f":"IF('AER CF'!$C10=\"Vic\",\"Y\",\"N\")","v":"N"}]
[null,"Australian Distribution Co.","NSW","Electricity","Distribution","N","N","N","N",null,"N","N","N","N","N","N",{"$f":"IFERROR(IF(dms_MAIFI_flag=\"Yes\",\"N\",\"Y\"),\"Y\")","v":"Y"},"N","N","N","N","N",{"$f":"IFERROR(LEFT(dms_MAIFI_flag),\"N\")","v":"N"},{"$f":"IF('AER CF'!$C13=\"Vic\",\"Y\",\"N\")","v":"N"}]
[null,"Australian Distribution Co. (Vic)","Vic","Electricity","Distribution","N","N","N","N",null,"N","N","N","N","N","N",{"$f":"IFERROR(IF(dms_MAIFI_flag=\"Yes\",\"N\",\"Y\"),\"Y\")","v":"Y"},"N","N","N","N","N",{"$f":"IFERROR(LEFT(dms_MAIFI_flag),\"N\")","v":"N"},{"$f":"IF('AER CF'!$C14=\"Vic\",\"Y\",\"N\")","v":"Y"}]
[null,"CitiPower","Vic","Electricity","Distribution",null,"N","N",null,null,"N","N","N","N","N","N",{"$f":"IFERROR(IF(dms_MAIFI_flag=\"Yes\",\"N\",\"Y\"),\"Y\")","v":"Y"},"N","N","N","Y","N",{"$f":"IFERROR(LEFT(dms_MAIFI_flag),\"N\")","v":"N"},{"$f":"IF('AER CF'!$C15=\"Vic\",\"Y\",\"N\")","v":"Y"}]
[null,"Directlink","Qld","Electricity","Transmission",null,"N",null,null,null,"N","N","N","N","N","-",{"$f":"IFERROR(IF(dms_MAIFI_flag=\"Yes\",\"N\",\"Y\"),\"Y\")","v":"Y"},"N","N","Y","Y","N",{"$f":"IFERROR(LEFT(dms_MAIFI_flag),\"N\")","v":"N"},{"$f":"IF('AER CF'!$C16=\"Vic\",\"Y\",\"N\")","v":"N"}]
[null,"ElectraNet","SA","Electricity","Transmission",null,"N",null,null,null,"N","N","N","N","N","-",{"$f":"IFERROR(IF(dms_MAIFI_flag=\"Yes\",\"N\",\"Y\"),\"Y\")","v":"Y"},"N","N","Y","Y","N",{"$f":"IFERROR(LEFT(dms_MAIFI_flag),\"N\")","v":"N"},{"$f":"IF('AER CF'!$C17=\"Vic\",\"Y\",\"N\")","v":"N"}]
[null,"Endeavour Energy","NSW","Electricity","Distribution",null,"Y","N","Y","Y","N","N","N","Y","N","N",{"$f":"IFERROR(IF(dms_MAIFI_flag=\"Yes\",\"N\",\"Y\"),\"Y\")","v":"Y"},"Y","N","Y","Y","Y",{"$f":"IFERROR(LEFT(dms_MAIFI_flag),\"N\")","v":"N"},{"$f":"IF('AER CF'!$C18=\"Vic\",\"Y\",\"N\")","v":"N"}]
[null,"Energex","Qld","Electricity","Distribution",null,"Y","N",null,null,"N","N","N","N","N","N",{"$f":"IFERROR(IF(dms_MAIFI_flag=\"Yes\",\"N\",\"Y\"),\"Y\")","v":"Y"},"Y","N","Y","Y","Y",{"$f":"IFERROR(LEFT(dms_MAIFI_flag),\"N\")","v":"N"},{"$f":"IF('AER CF'!$C19=\"Vic\",\"Y\",\"N\")","v":"N"}]
[null,"Ergon Energy","Qld","Electricity","Distribution",null,"Y","N","Y","Y","N","N","N","N","N","N",{"$f":"IFERROR(IF(dms_MAIFI_flag=\"Yes\",\"N\",\"Y\"),\"Y\")","v":"Y"},"Y","N","Y","Y","N",{"$f":"IFERROR(LEFT(dms_MAIFI_flag),\"N\")","v":"N"},{"$f":"IF('AER CF'!$C20=\"Vic\",\"Y\",\"N\")","v":"N"}]
[null,"Essential Energy","NSW","Electricity","Distribution",null,"Y","N","Y","Y","N","N","N","Y","N","N",{"$f":"IFERROR(IF(dms_MAIFI_flag=\"Yes\",\"N\",\"Y\"),\"Y\")","v":"Y"},"Y","N","Y","Y","N",{"$f":"IFERROR(LEFT(dms_MAIFI_flag),\"N\")","v":"N"},{"$f":"IF('AER CF'!$C21=\"Vic\",\"Y\",\"N\")","v":"N"}]
[null,"Evoenergy Distribution","ACT","Electricity","Distribution",null,"Y","N","Y","Y","Y","Y","N","Y","N","Y",{"$f":"IFERROR(IF(dms_MAIFI_flag=\"Yes\",\"N\",\"Y\"),\"Y\")","v":"Y"},"Y","N","Y","Y","N",{"$f":"IFERROR(LEFT(dms_MAIFI_flag),\"N\")","v":"N"},{"$f":"IF('AER CF'!$C22=\"Vic\",\"Y\",\"N\")","v":"N"}]
[null,"Evoenergy Distribution (Tx Assets)","ACT","Electricity","Distribution",null,"Y","N","Y","Y","Y","Y","N","Y","N","Y",{"$f":"IFERROR(IF(dms_MAIFI_flag=\"Yes\",\"N\",\"Y\"),\"Y\")","v":"Y"},"Y","N","Y","Y","N",{"$f":"IFERROR(LEFT(dms_MAIFI_flag),\"N\")","v":"N"},{"$f":"IF('AER CF'!$C23=\"Vic\",\"Y\",\"N\")","v":"N"}]
[null,"Jemena Electricity","Vic","Electricity","Distribution",null,"N","N",null,null,"N","N","N","N","N","N",{"$f":"IFERROR(IF(dms_MAIFI_flag=\"Yes\",\"N\",\"Y\"),\"Y\")","v":"Y"},"N","N","N","Y","N",{"$f":"IFERROR(LEFT(dms_MAIFI_flag),\"N\")","v":"N"},{"$f":"IF('AER CF'!$C25=\"Vic\",\"Y\",\"N\")","v":"Y"}]
[null,"JGN","Vic","Gas","Distribution","-","-","-","-","-","-","-","-","-","-","-","-","-","-","-","-","-","-","-","-"]
[null,"Murraylink","SA","Electricity","Transmission",null,"N",null,null,null,"N","N","N","N","N","-",{"$f":"IFERROR(IF(dms_MAIFI_flag=\"Yes\",\"N\",\"Y\"),\"Y\")","v":"Y"},"N","N","Y","Y","N",{"$f":"IFERROR(LEFT(dms_MAIFI_flag),\"N\")","v":"N"},{"$f":"IF('AER CF'!$C26=\"Vic\",\"Y\",\"N\")","v":"N"}]
[null,"Power and Water","NT","Electricity","Distribution",null,"N","N",null,null,"N","Y","N","N","N","Y",{"$f":"IFERROR(IF(dms_MAIFI_flag=\"Yes\",\"N\",\"Y\"),\"Y\")","v":"Y"},"Y","Y","Y","Y","N",{"$f":"IFERROR(LEFT(dms_MAIFI_flag),\"N\")","v":"N"},{"$f":"IF('AER CF'!$C27=\"Vic\",\"Y\",\"N\")","v":"N"}]
[null,"Powercor Australia","Vic","Electricity","Distribution",null,"N","N",null,null,"N","N","N","N","N","N",{"$f":"IFERROR(IF(dms_MAIFI_flag=\"Yes\",\"N\",\"Y\"),\"Y\")","v":"Y"},"N","N","N","Y","N",{"$f":"IFERROR(LEFT(dms_MAIFI_flag),\"N\")","v":"N"},{"$f":"IF('AER CF'!$C28=\"Vic\",\"Y\",\"N\")","v":"Y"}]
[null,"Powerlink","Qld","Electricity","Transmission",null,"N",null,null,null,"N","N","N","N","N","-",{"$f":"IFERROR(IF(dms_MAIFI_flag=\"Yes\",\"N\",\"Y\"),\"Y\")","v":"Y"},"N","N","Y","Y","N",{"$f":"IFERROR(LEFT(dms_MAIFI_flag),\"N\")","v":"N"},{"$f":"IF('AER CF'!$C29=\"Vic\",\"Y\",\"N\")","v":"N"}]
[null,"Roma to Brisbane Pipeline","Qld","Gas","Transmission","-","-","-","-","-","-","-","-","-","-","-","-","-","-","-","-","-","-","-","-"]
[null,"SA Power Networks","SA","Electricity","Distribution",null,"Y","N",null,null,"N","N","N","N","N","N",{"$f":"IFERROR(IF(dms_MAIFI_flag=\"Yes\",\"N\",\"Y\"),\"Y\")","v":"Y"},"Y","N","Y","N","N",{"$f":"IFERROR(LEFT(dms_MAIFI_flag),\"N\")","v":"N"},{"$f":"IF('AER CF'!$C31=\"Vic\",\"Y\",\"N\")","v":"N"}]
[null,"TasNetworks (D)","Tas","Electricity","Distribution",null,"Y","N",null,null,"N","N","N","N","N","N",{"$f":"IFERROR(IF(dms_MAIFI_flag=\"Yes\",\"N\",\"Y\"),\"Y\")","v":"Y"},"Y","N","Y","Y","N",{"$f":"IFERROR(LEFT(dms_MAIFI_flag),\"N\")","v":"N"},{"$f":"IF('AER CF'!$C32=\"Vic\",\"Y\",\"N\")","v":"N"}]
[null,"TasNetworks (T)","Tas","Electricity","Transmission",null,"N",null,null,null,"N","N","N","N","N","-",{"$f":"IFERROR(IF(dms_MAIFI_flag=\"Yes\",\"N\",\"Y\"),\"Y\")","v":"Y"},"N","N","Y","Y","N",{"$f":"IFERROR(LEFT(dms_MAIFI_flag),\"N\")","v":"N"},{"$f":"IF('AER CF'!$C33=\"Vic\",\"Y\",\"N\")","v":"N"}]
[null,"TransGrid","NSW","Electricity","Transmission",null,"N",null,null,null,"N","N","N","N","N","-",{"$f":"IFERROR(IF(dms_MAIFI_flag=\"Yes\",\"N\",\"Y\"),\"Y\")","v":"Y"},"N","N","Y","Y","N",{"$f":"IFERROR(LEFT(dms_MAIFI_flag),\"N\")","v":"N"},{"$f":"IF('AER CF'!$C34=\"Vic\",\"Y\",\"N\")","v":"N"}]
[null,"United Energy","Vic","Electricity","Distribution",null,"N","N",null,null,"N","N","N","N","N","N",{"$f":"IFERROR(IF(dms_MAIFI_flag=\"Yes\",\"N\",\"Y\"),\"Y\")","v":"Y"},"N","N","N","Y","N",{"$f":"IFERROR(LEFT(dms_MAIFI_flag),\"N\")","v":"N"},{"$f":"IF('AER CF'!$C35=\"Vic\",\"Y\",\"N\")","v":"Y"}]
[]
[]
[null,"Confidential"]
[null,"Amended"]
[]
[null,"Worksheet 6.2 STPIS reliability"]
[null,"Formula",null,null,null,"Applied to:"]
[]
[null,"=INDEX(dms_CBD_flag,MATCH(dms_TradingName,dms_TradingName_List))=\"NO\"",null,null,null,"$D$11,$D$17,$D$23,$D$33,$D$39,$D$45,$D$55,$D$61,$D$67,$D$77,$D$83,$D$89"]
[null,"=INDEX(dms_Urban_flag,MATCH(dms_TradingName,dms_TradingName_List))=\"NO\"",null,null,null,"$D$12,$D$18,$D$24,$D$56,$D$62,$D$78,$D$68,$D$84"]
[null,"=INDEX(dms_ShortRural_flag,MATCH(dms_TradingName,dms_TradingName_List))=\"NO\"",null,null,null,"$D$13,$D$19,$D$25,$D$57,$D$63,$D$69,$D$79,$D$85"]
[null,"=INDEX(dms_LongRural_flag,MATCH(dms_TradingName,dms_TradingName_List))=\"NO\"",null,null,null,"$D$14,$D$20,$D$26,$D$58,$D$64,$D$65,$D$70,$D$71,$D$80,$D$86"]
[null,"=INDEX(dms_FeederType_5_flag,MATCH(dms_TradingName,dms_TradingName_List))=\"NO\"",null,null,null,"$D$87,$D$81,$D$71,$D$65,$D$59,$D$49,$D$43,$D$37,$D$21,$D$15"]
[null,"=dms_MAIFI_Flag=\"No\"",null,null,null,"$D$55:$D$72"]
[]
[]
[null,"Business & other details"]
[null,"=(INDEX(dms_Model_Span,MATCH(dms_Model,dms_Model_List))>1)"]
[null,"=(INDEX(dms_Model_Span,MATCH(dms_Model,dms_Model_List))=1)"]
[]
[]
[null,"STYLES IN USE"]
[null,"HEADING ONE","dms_1"]
[null,"HEADING TWO","dms_2"]
[null,"HEADING THREE","dms_3"]
[null,"HEADING FOUR","dms_4"]
[null,"HEADING FIVE","dms_5"]
[null,5.1109999999999998,"dms_NUM"]
[null,5.45E-2,"dms_NUM%"]
[null,5.5555000000000003,"dms_NUM3d"]
[null,"Text description","dms_Row_Locked"]
[null,"Text description","dms_Row1"]
[null,"Text description","dms_Row2"]
[null,"Total","dms_T1"]
[null,"Total","dms_T2"]
[null,"EXPENSES","dms_BH"]
[null,2019,"dms_BY1"]
[null,2019,"dms_BY2"]
[null,"VOLUMES","dms_GH"]
[null,2019,"dms_GY1"]
[null,2019,"dms_GY2"]

{"sheet":"AER NRs","index":30,"n_rows":232,"n_cols":16,"rows_kept":232,"cut":false,"hidden":true,"merged":[[4,1,28,1],[32,1,55,1],[33,10,35,10],[33,36,33,57],[33,67,33,88],[34,36,34,57],[34,67,34,88],[35,36,35,57],[35,67,35,88],[36,10,40,10],[44,10,45,10],[65,1,78,1],[84,1,97,1],[100,1,107,1],[110,1,115,1],[118,1,132,1],[195,1,196,1],[199,1,200,1],[208,1,213,1],[135,1,150,1],[152,1,158,1],[160,1,174,1],[176,1,177,1],[179,1,184,1],[191,1,192,1]]}
[null,"AER NAMED RANGES"]
[]
[null,"DROP DOWN SELECTORS USED IN WORKBOOKS"]
[]
[null,"COVER SHEET","dms_DataQuality_List","dms_Confid_status_List"]
[null,null,"-- select --","-- select --"]
[null,null,"Actual","Public"]
[null,null,"Estimate","Confidential"]
[null,null,"Consolidated"]
[]
[]
[null,null,"For all files either AER or business needs to be able to specify the type of submission","For PTRM & RFM templates we must provide a choice in case they change their form of control - otherwise it is drawn from the business specific lookup table above."]
[null,null,"dms_SourceList","dms_FormControl_Choices"]
[null,null,"-- select --","Revenue cap"]
[null,null,"After appeal","Revenue yield"]
[null,null,"Draft decision","Tariff cap"]
[null,null,"Final decision","Weighted average price cap"]
[null,null,"PTRM update 1"]
[null,null,"PTRM update 2"]
[null,null,"PTRM update 3"]
[null,null,"PTRM update 4"]
[null,null,"PTRM update 5"]
[null,null,"PTRM update 6"]
[null,null,"PTRM update 7"]
[null,null,"Reallocated"]
[null,null,"Recast"]
[null,null,"Regulatory proposal"]
[null,null,"Reporting"]
[null,null,"Revised regulatory proposal"]
[]
[]
[null,null,null,null,null,null,null,null,null,null,"This is used to create an image to insert on 6.3 STPIS sheet - not for dropdown lists.",null,null,"GAS"]
[null,"CA & RESET RINS \nDNSP","dms_DNSP_020301_SubstationType","dms_DNSP_020301_ProjectType","dms_DNSP_020301_ProjectTrigger","dms_DNSP_020302_ProjectType","dms_DNSP_020302_ProjectTrigger","dms_STPIS_Exclusion_List","dms_Reason_Interruption","dms_Reason_Interruption_Detailed","Reason for interruption",null,null,"dms_N0205_AssetType"]
[null,null,"Subtransmission substation","New substation establishment","Demand growth","New line on new route - single circuit","Demand growth","Weather","Animal","Animal impact","Animal","Animal impact",null,"Cast Iron"]
[null,null,"Zone substation","Substation upgrade - capacity"," Voltage issues","New line on new route - dual circuit"," Voltage issues","Equipment failure","Asset failure","Animal nesting/burrowing, etc and other",null,"Animal nesting/burrowing, etc and other",null,"PVC"]
[null,null,"Switching station","Substation upgrade - voltage"," Reactive power issue","New line on new route - other"," Reactive power issue","Operational error","Other","Other",null,"Other",null,"Polyamide"]
[null,null,"Other","Other"," Fault level issues","Line rebuild over existing route - single circuit"," Fault level issues","Vegetation","Overloads","LV","Asset failure","LV",null,"High density polyethylene (80)"]
[null,null,null,null," Safety","Line rebuild over existing route - dual circuit"," Net market benefit","Animals","Planned","Distribution substation",null,"Distribution substation",null,"High density polyethylene (100)"]
[null,null,null,null," Environment","Reconductor - Single circuit"," Safety","Third party impacts","Network business","HV",null,"HV",null,"High density polyethylene (250)"]
[null,null,null,null," Other","Reconductor - Dual circuit"," Environment","Transmission failure","Third party","Zone substation",null,"Zone substation",null,"High density polyethylene (575)"]
[null,null,null,null,null,"Reconductor - Other"," Other","Load shedding","Unknown","Subtransmission",null,"Subtransmission",null,"Medium density polyethylene"]
[null,null,null,null,null,"Line upgrade - raising/retensoring",null,"Inter-distributor connection failure","Vegetation","insert description of 'other'","Other","insert description of 'other'",null,"Unprotected steel"]
[null,null,null,null,null,"Line upgrade - voltage upgrade",null,"Other","Weather","Network error","Overloads",null,null,"Protected steel"]
[null,null,null,null,null,"Line upgrade - capacity",null,null,"2 - STPIS Exclusion (3.3)(a)","Switching and protection error","Planned",null,null,"Other"]
[null,null,null,null,null,"String spare circuit",null,null,"3 - STPIS Exclusion (3.3)(a)","Fire","Network business","Network error"]
[null,null,null,null,null,"Other",null,null,"4 - STPIS Exclusion (3.3)(a)","Other",null,"Switching and protection error"]
[null,null,null,null,null,null,null,null,"5 - STPIS Exclusion (3.3)(a)","Dig-in","Third party","Fire"]
[null,null,null,null,null,null,null,null,"6 - STPIS Exclusion (3.3)(a)","Unauthorised access",null,"Other"]
[null,null,null,null,null,null,null,null,"7 - STPIS Exclusion (3.3)(a)","Vehicle impact",null,"Dig-in"]
[null,null,null,null,null,null,null,null,null,"Unknown",null,"Unauthorised access"]
[null,null,null,null,null,null,null,null,null,"Blow-in/Fall-in - NSP responsibility",null,"Vehicle impact"]
[null,null,null,null,null,null,null,null,null,"Grow-in - NSP responsibility","Unknown","Unknown"]
[null,null,null,null,null,null,null,null,null,"Blow-in/Fall-in - Other responsible party","Vegetation","Blow-in/Fall-in - NSP responsibility"]
[null,null,null,null,null,null,null,null,null,"Grow-in - Other responsible party",null,"Grow-in - NSP responsibility"]
[null,null,null,null,null,null,null,null,null,null,null,"Blow-in/Fall-in - Other responsible party"]
[null,null,null,null,null,null,null,null,null,null,null,"Grow-in - Other responsible party"]
[null,null,null,null,null,null,null,null,null,null,"Weather"]
[null,null,null,null,null,null,null,null,null,null,"2 - STPIS Exclusion (3.3)(a)"]
[null,null,null,null,null,null,null,null,null,null,"3 - STPIS Exclusion (3.3)(a)"]
[null,null,null,null,null,null,null,null,null,null,"4 - STPIS Exclusion (3.3)(a)"]
[null,null,null,null,null,null,null,null,null,null,"5 - STPIS Exclusion (3.3)(a)"]
[null,null,null,null,null,null,null,null,null,null,"6 - STPIS Exclusion (3.3)(a)"]
[null,null,null,null,null,null,null,null,null,null,"7 - STPIS Exclusion (3.3)(a)"]
[]
[]
[null,"CA & RESET RINS \nTNSP ","dms_TNSP_0203_SubstationType","dms_TNSP_020301_ProjectType","dms_TNSP_020301_ProjectTrigger","dms_TNSP_020302_ProjectType","dms_TNSP_0203_ProjectTrigger"]
[null,null,"Terminal station","New substation establishment","Demand growth","New line on new route - single circuit","Demand growth"]
[null,null,"Switching station","Capacity upgrade"," Voltage issues","New line on new route - dual circuit"," Voltage issues"]
[null,null,"Transmission substation","Voltage upgrade"," Reactive power issue","New line on new route - other"," Reactive power issue"]
[null,null,"Other","Other"," Fault level issues","Line rebuild over existing route - single circuit"," Fault level issues"]
[null,null,null,null,"Net market benefit","Line rebuild over existing route - dual circuit"," Net market benefit"]
[null,null,null,null," Safety","Reconductor - Single circuit"," Safety"]
[null,null,null,null," Environment","Reconductor - Dual circuit"," Environment"]
[null,null,null,null," Other","Reconductor - Other"," Other"]
[null,null,null,null,null,"Line upgrade - raising/retensoring"]
[null,null,null,null,null,"Line upgrade - voltage upgrade"]
[null,null,null,null,null,"Line upgrade - capacity"]
[null,null,null,null,null,"String spare circuit"]
[null,null,null,null,null,"Other"]
[]
[]
[]
[null,"NAMED RANGES USED IN ETL PROCESS"]
[null,null,null,null,null,null,null,null,null,null,null,null,"GAS ARR & RESET"]
[null,"CA & RESET RINS \nDNSP ONLY","dms_020303_01_UOM","dms_020501_01_UOM","dms_020501_02_UOM","dms_020501_03_UOM","dms_020501_04_UOM","dms_020701_01_UOM","dms_020701_02_UOM","dms_020701_01_Rows","dms_040102_01_UOM","dms_040102_04_UOM","dms_S140101_UOM","dms_S140201_UOM","dms_E050201_UOM","dms_E050202_UOM"]
[null,null,"Circuit line length in km","0's","0's","0's","0's","km","km","Route line length within zone","0's","days","number","number per km","per metre per connection","metres per connection"]
[null,null,"Circuit line length in km","0's","0's","0's","0's","0's","0's","Number of maintenance spans","0's","0's","number","number","per service per connection","number per connection"]
[null,null,"Circuit line length in km","MVA added","MVA added","MVA added","MVA added","km","km","Total length of maintenance spans","0's","$0s","number","number","number per connection","number per connection"]
[null,null,"Circuit line length in km","0's","0's","0's","0's","km","km","Length of vegetation corridors","$0s","0's","km"]
[null,null,"Number","total spend $0s","total spend $0s","total spend $0s","total spend $0s","0's","0's","Average number of trees per maintenance span"]
[null,null,"Number","net circuit km added","net circuit km added","net circuit km added","net circuit km added","years","years","Average frequency of cutting cycle"]
[null,null,"Number","total spend $0s","total spend $0s","total spend $0s","total spend $0s"]
[null,null,null,"net circuit km added","net circuit km added","net circuit km added","net circuit km added"]
[null,null,null,"total spend $0s","total spend $0s","total spend $0s","total spend $0s"]
[null,null,null,"0's",null,"$0s"]
[null,null,null,"0's"]
[null,null,null,"0's"]
[null,null,null,"$0s"]
[]
[]
[null,"CA & RESET RINS \nTNSP ONLY","dms_020701_01_UOM"]
[null,null,"km"]
[null,null,"0's"]
[null,null,"km"]
[null,null,"0's"]
[null,null,"km"]
[null,null,"metres"]
[null,null,"years"]
[]
[]
[null,"CA & RESET RINS \nDNSP & TNSP","dms_020603_01_UOM"]
[null,null,"0's"]
[null,null,"0's"]
[null,null,"0's"]
[null,null,"0's"]
[null,null,"(per cent)"]
[]
[]
[null,"EB & RESET RINS \nDNSP ONLY","dms_030601_01_UOM","dms_030601_02_UOM","dms_030701_01_UOM","dms_030702_01_UOM","dms_030703_01_UOM"]
[null,null,"minutes/customer","minutes/customer","Customer / km","%","km"]
[null,null,"minutes/customer","minutes/customer","MWh/customer","Number of spans"]
[null,null,"interruptions/customer","interruptions/customer","kVA / customer","Number of spans"]
[null,null,"interruptions/customer","interruptions/customer",null,"Number of spans"]
[null,null,null,null,null,"Number of spans"]
[null,null,null,null,null,"Years"]
[null,null,null,null,null,"Years"]
[null,null,null,null,null,"Trees"]
[null,null,null,null,null,"Trees"]
[null,null,null,null,null,"Defects"]
[null,null,null,null,null,"Defects"]
[null,null,null,null,null,"Spans"]
[null,null,null,null,null,"km"]
[null,null,null,null,null,"Spans"]
[]
[null,null,"WHEN INSERTING COVER SHEET INTO A TNSP FILE - APPLY THESE NAMED RANGES"]
[null,"EB & RESET RINS \nTNSP ONLY","dms_030601_01_UOM",null,"dms_030701_01_UOM","dms_030702_01_UOM"]
[null,null,"%",null,"Number of spans","km"]
[null,null,"number",null,"Years","%"]
[null,null,"number",null,"Trees","km"]
[null,null,"%",null,"Defects","number"]
[null,null,"number",null,"Number of spans"]
[null,null,"number",null,"km"]
[null,null,"%",null,"km"]
[null,null,"number",null,"Number of spans"]
[null,null,"number"]
[null,null,"%"]
[null,null,"number"]
[null,null,"%"]
[null,null,"number"]
[null,null,"%"]
[null,null,"number"]
[]
[null,"EB & RESET RINS \nDNSP & TNSP","dms_EB_RAB_PIT"]
[null,null,"Beginning of year"]
[null,null,"End of year"]
[null,null,"End of year"]
[null,null,"End of year"]
[null,null,"End of year"]
[null,null,"End of year"]
[]
[null,"ARR \nDNSP ONLY","dms_030605_UOM","dms_03060703_UOM","dms_E020202_UOM","Spare"]
[null,null,"number","number","Length of mains replaced"]
[null,null,"number","number","Number of services replaced"]
[null,null,"number","number"]
[null,null,"number","number"]
[null,null,"number","(per cent)"]
[null,null,"number"]
[null,null,"number"]
[null,null,"number"]
[null,null,"number"]
[null,null,"number"]
[null,null,"number"]
[null,null,"number"]
[null,null,"(per cent)"]
[null,null,"(per cent)",""]
[]
[null,"RFM","dms_Beg","dms_Mid","dms_End"]
[null,null,"Beginning of year","Mid year","End of Year"]
[]
[null,"PTRM","dms_PTRM_RAB_PIT","dms_PTRM_TAB_PIT","DMS_Xfactor"]
[null,null,"Beginning of year","Beginning of year","x factors"]
[null,null,"End of year","End of year"]
[null,null,"End of year","End of year"]
[null,null,"End of year","End of year"]
[null,null,"End of year"]
[]
[]
[null,"STPIS & MIC NAMED RANGES "]
[]
[null,"These \"row descriptions\" are the column headings in the various templates but become row descriptions in the ETL process"]
[]
[null,"Table 6.3 sustained interruptions - row descriptions","dms_060301_CustNo_Affected_Row","dms_060301_Avg_Duration_Sustained_Int_Row","dms_060301_Effect_unplanned_SAIDI_Row","dms_060301_Effect_unplanned_SAIFI_Row"]
[null,null,"Number of customers affected by the interruption","Average duration of sustained customer interruption","Effect on unplanned SAIDI","Effect on unplanned SAIFI"]
[]
[]
[null,"Table 6.1 telephone answering - row descriptions and start date","dms_060101_Rows","dms_060102_Rows","dms_060101_StartDateTxt"]
[null,null,"Total number of calls \n(after removing excluded events)","Number of calls answered within 30 seconds \n(after excluding excluded events) ",{"$f":"dms_060701_StartDateTxt","v":"1-Jul-2020"}]
[]
[]
[null,"Table 6.8.1 - row descriptions","dms_060801_01_Rows","dms_060801_02_Rows","dms_060801_03_Rows","dms_060801_04_Rows"]
[null,null,"Number of interruptions","Duration of interruptions","Total unplanned minutes off supply","Effect on unplanned MAIFI"]
[]
[]
[null,"Table 7.9.4 - market impact component - row descriptions","dms_070904_01_Rows","without exclusions","with exclusions"]
[]
[]
[null,"These headings (Lists) are determined from the INDEX/MATCH function on the NSP selected on the Business & other details sheet\ndo not change the formatting here"]
[]
[null,"Table 6.7.1 - daily performance data - unplanned - MAIFI  -- row descriptions and header named range values","dms_060701_Feeder_Header_Lvl4",{"$f":"INDEX(dms_FeederName_1,MATCH(dms_TradingName,dms_TradingName_List))","v":"CBD"},{"$f":"INDEX(dms_FeederName_1,MATCH(dms_TradingName,dms_TradingName_List))","v":"CBD"},{"$f":"INDEX(dms_FeederName_2,MATCH(dms_TradingName,dms_TradingName_List))","v":"Urban"},{"$f":"INDEX(dms_FeederName_2,MATCH(dms_TradingName,dms_TradingName_List))","v":"Urban"},{"$f":"INDEX(dms_FeederName_3,MATCH(dms_TradingName,dms_TradingName_List))","v":"Short rural"},{"$f":"INDEX(dms_FeederName_3,MATCH(dms_TradingName,dms_TradingName_List))","v":"Short rural"},{"$f":"INDEX(dms_FeederName_4,MATCH(dms_TradingName,dms_TradingName_List))","v":"Long rural"},{"$f":"INDEX(dms_FeederName_4,MATCH(dms_TradingName,dms_TradingName_List))","v":"Long rural"},{"$f":"IF((INDEX(dms_FeederName_5,MATCH(dms_TradingName,dms_TradingName_List))=0),\"Network\",(INDEX(dms_FeederName_5,MATCH(dms_TradingName,dms_TradingName_List))))","v":"Network"},{"$f":"IF((INDEX(dms_FeederName_5,MATCH(dms_TradingName,dms_TradingName_List))=0),\"Network\",(INDEX(dms_FeederName_5,MATCH(dms_TradingName,dms_TradingName_List))))","v":"Network"},"Network","Network"]
[]
[null,null,"dms_060701_Rows","All events","After removing excluded events","All events","After removing excluded events","All events","After removing excluded events","All events","After removing excluded events","All events","After removing excluded events","All events","After removing excluded events"]
[null,null,null,"the number of column headings changes from 10 to 12 depending on the number of feeder categories for the NSP"]
[]
[null,null,"dms_0603_FeederList",{"$f":"INDEX(dms_FeederName_1,MATCH(dms_TradingName,dms_TradingName_List))","v":"CBD"},{"$f":"INDEX(dms_FeederName_2,MATCH(dms_TradingName,dms_TradingName_List))","v":"Urban"},{"$f":"INDEX(dms_FeederName_3,MATCH(dms_TradingName,dms_TradingName_List))","v":"Short rural"},{"$f":"INDEX(dms_FeederName_4,MATCH(dms_TradingName,dms_TradingName_List))","v":"Long rural"}]
[]
[]
[null,"Use these to add named ranges to specific worksheets added into already existing files"]
[]
[]
[null,"ARRs 6.7 STPIS daily performance","dms_060101_Values","dms_060102_Values","dms_060701_Values"]
[null,null,"dms_LeapYear"]
[]
[]
[null,"ARR's  6.8 STPIS exclusions","dms_060801_Event_Date","dms_060801_OutageID","dms_060801_FeederID","dms_060801_FeederClass","dms_060801_CauseID","dms_060801_01_Values","dms_060801_02_Values","dms_060801_03_Values","dms_060801_Excl_Cat","dms_060801_04_Values"]
[null,null,"dms_060801_StartCell"]
[]
[]
[null,"CA 6.3 sustained interruptions","dms_060301_Event_Date","dms_060301_Event_Time","dms_060301_AssetID","dms_060301_FeederClass","dms_060301_Reason","dms_060301_DetailedReason","dms_060301_CustNo_Affected_Values","dms_060301_Avg_Duration_Sustained_Int_Values","dms_060301_Effect_unplanned_SAIDI_Values","dms_060301_Effect_unplanned_SAIFI_Values","dms_060301_MED"]
[]
[]
[]
[null,"PTRM input sheet","DMS_50_01_01a","DMS_50_01_01aa","DMS_50_01_01b","DMS_50_01_01bb","DMS_50_01_01c","DMS_50_01_01d","DMS_50_01_01dd"]

{"sheet":"AER lookups","index":31,"n_rows":94,"n_cols":36,"rows_kept":94,"cut":false,"hidden":true,"merged":[[15,1,15,4],[4,24,4,34],[5,24,5,27],[5,29,5,33],[5,34,7,34]]}
[null,"AER LOOKUP TABLES"]
[]
[null,"Template number",5]
[]
[null,null,null,null,null,null,null,null,null,null,null,null,null,null,null,null,null,null,null,null,null,null,null,null,"FOR ELECTRICITY BUSINESSES ONLY"]
[null,null,null,null,null,null,null,null,null,null,null,null,null,null,null,null,null,null,null,null,null,null,null,null,"Feeder Types",null,null,null,"TasNetworks (D)","Feeder Names"]
[]
[null,null,null,null,null,null,null,null,null,null,null,null,null,null,null,null,null,null,null,null,null,null,null,null,"CBD","Urban","Short rural","long rural","EXTRA"]
[null,"dms_TradingName_List","dms_TradingNameFull_List","dms_ABN_List","dms_JurisdictionList","dms_Sector_List","dms_Segment_List","dms_FormControl_List","dms_RPT_List","dms_RPTMonth_List","dms_CRCPlength_List","dms_FRCPlength_List","dms_PRCPlength_List","dms_663_List","dms_Addr1_List","dms_Addr2_List","dms_Suburb_List","dms_State_List","dms_PostCode_List","dms_PAddr1_List","dms_PAddr2_List","dms_PSuburb_List","dms_PState_List","dms_PPostCode_List","dms_CBD_flag","dms_Urban_flag","dms_ShortRural_flag","dms_LongRural_flag","dms_FeederType_5_flag","dms_FeederName_1","dms_FeederName_2","dms_FeederName_3","dms_FeederName_4","dms_FeederName_5","dms_Public_Lighting_List","Name"]
[null,"Australian Transmission Co.","Australian Transmission Co.",11222333444,"NSW","Electricity","Transmission","Revenue cap","Financial","June",5,5,5,5,"123 Straight Street",null,"SYDNEY","NSW",2000,"PO Box 123",null,"SYDNEY","NSW",2000,"NO","NO","NO","NO","NO","CBD","Urban","Short rural","Long rural",null,"NO",{"$f":"B10","v":"Australian Transmission Co."}]
[null,"Powerlink","Queensland Electricity Transmission Corporation Limited trading as Powerlink Queensland",82078849233,"Qld","Electricity","Transmission","Revenue cap","Financial","June",5,5,5,5,"33 Harold St",null,"VIRGINIA","Qld",4014,"PO Box 1193",null,"VIRGINIA","QLD",4014,"NO","NO","NO","NO","NO","CBD","Urban","Short rural","Long rural",null,"NO",{"$f":"B11","v":"Powerlink"}]
[]
[]
[]
[]
[null,"The Reg Year Ending (dms_RYE) must be set to the last year of the regulatory period. For forecast data is is usually (FRCP_y5) for actual it is a single year (CRY). For historical actual data the RYE will need to be set manually in the business details sheet by setting the dms_Multiyear_flag to 1 and putting the correct value in 'dms_Specified_FinalYear. See cells C67:C68"]
[null,"dms_Model_List ","dms_Model_Name_Format1","dms_Worksheet_List","dms_Model_Span_List"]
[null,"ARR","Annual Reporting",{"$f":"IF(dms_MultiYear_ResponseFlag=\"yes\",\"NEW HISTORICAL ANNUAL REPORTING\",\"ANNUAL REPORTING\")","v":"ANNUAL REPORTING"},1]
[null,"CA","Category Analysis",{"$f":"IF(dms_MultiYear_ResponseFlag=\"yes\",\"NEW HISTORICAL CATEGORY ANALYSIS\",\"CATEGORY ANALYSIS\")","v":"CATEGORY ANALYSIS"},1]
[null,"CESS","Capitlal Expenditure","CAPITLAL EXPENDITURE SHARING SCHEMING",5]
[null,"CPI","CPI","CPI",5]
[null,"EB","Economic Benchmarking",{"$f":"IF(dms_MultiYear_ResponseFlag=\"yes\",\"NEW HISTORICAL ECONOMIC BENCHMARKING\",\"ECONOMIC BENCHMARKING\")","v":"ECONOMIC BENCHMARKING"},1]
[null,"EBSS","Efficiency Benefit Sharing Scheme","EFFICIENCY BENEFIT SHARING SCHEME",5]
[null,"Pricing","Pricing Proposal","PRICING PROPOSAL",5]
[null,"Profitability","Profitability","PROFITABILITY",5]
[null,"PTRM","Post Tax Revenue Model","POST TAX REVENUE MODEL",5]
[null,"Reset","Regulatory Reporting (Reset)","REGULATORY REPORTING STATEMENT",5]
[null,"RFM","Roll Forward Model","ROLL FORWARD MODEL",5]
[null,"WACC","Weighted Average Cost of Capital","WEIGHTED AVERAGE COST OF CAPITAL",1]
[]
[]
[]
[null,"Financial","Calendar",null,"PREVIOUS",null,"CURRENT",null,"FORTHCOMING"]
[null,"1987-88",1988,"PRCP_y1",{"$f":"INDEX(INDIRECT(dms_RPT),dms_PRCP_start_row)","v":"2017-18"},"CRCP_y1",{"$f":"INDEX(INDIRECT(dms_RPT),dms_CRCP_start_row)","v":"2022-23"},{"$f":"FRCP_y1","v":"2027-28"},{"$f":"INDEX(INDIRECT(dms_RPT),dms_FRCP_start_row)","v":"2027-28"}]
[null,"1988-89",1989,"PRCP_y2",{"$f":"INDEX(INDIRECT(dms_RPT),dms_PRCP_start_row+1)","v":"2018-19"},"CRCP_y2",{"$f":"INDEX(INDIRECT(dms_RPT),dms_CRCP_start_row+1)","v":"2023-24"},"FRCP_y2",{"$f":"INDEX(INDIRECT(dms_RPT),dms_FRCP_start_row+1)","v":"2028-29"}]
[null,"1989-90",1990,"PRCP_y3",{"$f":"INDEX(INDIRECT(dms_RPT),dms_PRCP_start_row+2)","v":"2019-20"},"CRCP_y3",{"$f":"INDEX(INDIRECT(dms_RPT),dms_CRCP_start_row+2)","v":"2024-25"},"FRCP_y3",{"$f":"INDEX(INDIRECT(dms_RPT),dms_FRCP_start_row+2)","v":"2029-30"}]
[null,"1990-91",1991,"PRCP_y4",{"$f":"INDEX(INDIRECT(dms_RPT),dms_PRCP_start_row+3)","v":"2020-21"},"CRCP_y4",{"$f":"INDEX(INDIRECT(dms_RPT),dms_CRCP_start_row+3)","v":"2025-26"},"FRCP_y4",{"$f":"INDEX(INDIRECT(dms_RPT),dms_FRCP_start_row+3)","v":"2030-31"}]
[null,"1991-92",1992,"PRCP_y5",{"$f":"INDEX(INDIRECT(dms_RPT),dms_PRCP_start_row+4)","v":"2021-22"},"CRCP_y5",{"$f":"INDEX(INDIRECT(dms_RPT),dms_CRCP_start_row+4)","v":"2026-27"},"FRCP_y5",{"$f":"INDEX(INDIRECT(dms_RPT),dms_FRCP_start_row+4)","v":"2031-32"}]
[null,"1992-93",1993,"PRCP_y6",{"$f":"INDEX(INDIRECT(dms_RPT),dms_PRCP_start_row+5)","v":"2022-23"},"CRCP_y6",{"$f":"INDEX(INDIRECT(dms_RPT),dms_CRCP_start_row+5)","v":"2027-28"},"FRCP_y6",{"$f":"INDEX(INDIRECT(dms_RPT),dms_FRCP_start_row+5)","v":"2032-33"}]
[null,"1993-94",1994,"PRCP_y7",{"$f":"INDEX(INDIRECT(dms_RPT),dms_PRCP_start_row+6)","v":"2023-24"},"CRCP_y7",{"$f":"INDEX(INDIRECT(dms_RPT),dms_CRCP_start_row+6)","v":"2028-29"},"FRCP_y7",{"$f":"INDEX(INDIRECT(dms_RPT),dms_FRCP_start_row+6)","v":"2033-34"}]
[null,"1994-95",1995,"PRCP_y8",{"$f":"INDEX(INDIRECT(dms_RPT),dms_PRCP_start_row+7)","v":"2024-25"},"CRCP_y8",{"$f":"INDEX(INDIRECT(dms_RPT),dms_CRCP_start_row+7)","v":"2029-30"},"FRCP_y8",{"$f":"INDEX(INDIRECT(dms_RPT),dms_FRCP_start_row+7)","v":"2034-35"}]
[null,"1995-96",1996,"PRCP_y9",{"$f":"INDEX(INDIRECT(dms_RPT),dms_PRCP_start_row+8)","v":"2025-26"},"CRCP_y9",{"$f":"INDEX(INDIRECT(dms_RPT),dms_CRCP_start_row+8)","v":"2030-31"},"FRCP_y9",{"$f":"INDEX(INDIRECT(dms_RPT),dms_FRCP_start_row+8)","v":"2035-36"}]
[null,"1996-97",1997,"PRCP_y10",{"$f":"INDEX(INDIRECT(dms_RPT),dms_PRCP_start_row+9)","v":"2026-27"},"CRCP_y10",{"$f":"INDEX(INDIRECT(dms_RPT),dms_CRCP_start_row+9)","v":"2031-32"},"FRCP_y10",{"$f":"INDEX(INDIRECT(dms_RPT),dms_FRCP_start_row+9)","v":"2036-37"}]
[null,"1997-98",1998,"PRCP_y11",{"$f":"INDEX(INDIRECT(dms_RPT),dms_PRCP_start_row+10)","v":"2027-28"},"CRCP_y11",{"$f":"INDEX(INDIRECT(dms_RPT),dms_CRCP_start_row+10)","v":"2032-33"},"FRCP_y11",{"$f":"INDEX(INDIRECT(dms_RPT),dms_FRCP_start_row+10)","v":"2037-38"}]
[null,"1998-99",1999,"PRCP_y12",{"$f":"INDEX(INDIRECT(dms_RPT),dms_PRCP_start_row+11)","v":"2028-29"},"CRCP_y12",{"$f":"INDEX(INDIRECT(dms_RPT),dms_CRCP_start_row+11)","v":"2033-34"},"FRCP_y12",{"$f":"INDEX(INDIRECT(dms_RPT),dms_FRCP_start_row+11)","v":"2038-39"}]
[null,"1999-00",2000,"PRCP_y13",{"$f":"INDEX(INDIRECT(dms_RPT),dms_PRCP_start_row+12)","v":"2029-30"},"CRCP_y13",{"$f":"INDEX(INDIRECT(dms_RPT),dms_CRCP_start_row+12)","v":"2034-35"},"FRCP_y13",{"$f":"INDEX(INDIRECT(dms_RPT),dms_FRCP_start_row+12)","v":"2039-40"}]
[null,"2000-01",2001,"PRCP_y14",{"$f":"INDEX(INDIRECT(dms_RPT),dms_PRCP_start_row+13)","v":"2030-31"},"CRCP_y14",{"$f":"INDEX(INDIRECT(dms_RPT),dms_CRCP_start_row+13)","v":"2035-36"},"FRCP_y14",{"$f":"INDEX(INDIRECT(dms_RPT),dms_FRCP_start_row+13)","v":"2040-41"}]
[null,"2001-02",2002,"PRCP_y15",{"$f":"INDEX(INDIRECT(dms_RPT),dms_PRCP_start_row+14)","v":"2031-32"},"CRCP_y15",{"$f":"INDEX(INDIRECT(dms_RPT),dms_CRCP_start_row+14)","v":"2036-37"},"FRCP_y15",{"$f":"INDEX(INDIRECT(dms_RPT),dms_FRCP_start_row+14)","v":"2041-42"}]
[null,"2002-03",2003,"PRCP_y16",{"$f":"INDEX(INDIRECT(dms_RPT),dms_PRCP_start_row+15)","v":"2032-33"},"CRCP_y16",{"$f":"INDEX(INDIRECT(dms_RPT),dms_CRCP_start_row+15)","v":"2037-38"},"FRCP_y16",{"$f":"INDEX(INDIRECT(dms_RPT),dms_FRCP_start_row+15)","v":"2042-43"}]
[null,"2003-04",2004]
[null,"2004-05",2005]
[null,"2005-06",2006,null,"CRY - FRY"]
[null,"2006-07",2007,"dms_y1",{"$f":"IFERROR(INDEX(INDIRECT(dms_RPT),dms_CRY_start_row),0)","v":"2022-23"}]
[null,"2007-08",2008,"dms_y2",{"$f":"IFERROR(INDEX(INDIRECT(dms_RPT),dms_CRY_start_row+1),0)","v":"2023-24"}]
[null,"2008-09",2009,"dms_y3",{"$f":"IFERROR(INDEX(INDIRECT(dms_RPT),dms_CRY_start_row+2),0)","v":"2024-25"}]
[null,"2009-10",2010,"dms_y4",{"$f":"IFERROR(INDEX(INDIRECT(dms_RPT),dms_CRY_start_row+3),0)","v":"2025-26"}]
[null,"2010-11",2011,"dms_y5",{"$f":"IFERROR(INDEX(INDIRECT(dms_RPT),dms_CRY_start_row+4),0)","v":"2026-27"}]
[null,"2011-12",2012,"dms_y6",{"$f":"IFERROR(INDEX(INDIRECT(dms_RPT),dms_CRY_start_row+5),0)","v":"2027-28"}]
[null,"2012-13",2013,"dms_y7",{"$f":"IFERROR(INDEX(INDIRECT(dms_RPT),dms_CRY_start_row+6),0)","v":"2028-29"}]
[null,"2013-14",2014,"dms_y8",{"$f":"IFERROR(INDEX(INDIRECT(dms_RPT),dms_CRY_start_row+7),0)","v":"2029-30"}]
[null,"2014-15",2015,"dms_y9",{"$f":"IFERROR(INDEX(INDIRECT(dms_RPT),dms_CRY_start_row+8),0)","v":"2030-31"}]
[null,"2015-16",2016,"dms_y10",{"$f":"IFERROR(INDEX(INDIRECT(dms_RPT),dms_CRY_start_row+9),0)","v":"2031-32"}]
[null,"2016-17",2017,"dms_y11",{"$f":"IFERROR(INDEX(INDIRECT(dms_RPT),dms_CRY_start_row+10),0)","v":"2032-33"}]
[null,"2017-18",2018,"dms_y12",{"$f":"IFERROR(INDEX(INDIRECT(dms_RPT),dms_CRY_start_row+11),0)","v":"2033-34"}]
[null,"2018-19",2019,"dms_y13",{"$f":"IFERROR(INDEX(INDIRECT(dms_RPT),dms_CRY_start_row+12),0)","v":"2034-35"}]
[null,"2019-20",2020,"dms_y14",{"$f":"IFERROR(INDEX(INDIRECT(dms_RPT),dms_CRY_start_row+13),0)","v":"2035-36"}]
[null,"2020-21",2021,"dms_y15",{"$f":"IFERROR(INDEX(INDIRECT(dms_RPT),dms_CRY_start_row+14),0)","v":"2036-37"}]
[null,"2021-22",2022,"dms_y16",{"$f":"IFERROR(INDEX(INDIRECT(dms_RPT),dms_CRY_start_row+15),0)","v":"2037-38"}]
[null,"2022-23",2023]
[null,"2023-24",2024]
[null,"2024-25",2025]
[null,"2025-26",2026]
[null,"2026-27",2027]
[null,"2027-28",2028]
[null,"2028-29",2029]
[null,"2029-30",2030]
[null,"2030-31",2031]
[null,"2031-32",2032]
[null,"2032-33",2033]
[null,"2033-34",2034]
[null,"2034-35",2035]
[null,"2035-36",2036]
[null,"2036-37",2037]
[null,"2037-38",2038]
[null,"2038-39",2039]
[null,"2039-40",2040]
[null,"2040-41",2041]
[null,"2041-42",2042]
[null,"2042-43",2043]
[null,"2043-44",2044]
[null,"2044-45",2045]
[null,"2045-46",2046]
[null,"2046-47",2047]
[null,"2047-28",2048]

{"sheet":"AER ETL","index":32,"n_rows":146,"n_cols":10,"rows_kept":146,"cut":false,"hidden":true,"merged":[[12,0,16,0],[13,4,13,8],[15,2,15,4],[19,0,26,0],[27,0,32,0],[35,0,60,0],[35,37,35,58],[35,68,35,89],[33,37,33,58],[72,1,74,1],[33,68,33,89],[34,37,34,58],[34,68,34,89]]}
[null,"AER ETL INFORMATION"]
[]
[null,"USES NAMED RANGES FLAG","yes","dms_Defined_Names_Used"]
[]
[null,"IF THIS IS AN ABC RIN - make sure the the named range CRY is applied and the named range dms_dollar_nom_UOM is applied"]
[null,"IF THIS IS A RESET RIN - make sure the named ranges CRY and dms_dollar_nom_UOM are NOT present in the workbook"]
[null,"FOR ABC RINS THAT SPAN MULTIPLE YEARS - make sure MultiYear Flag is set and final year entered as required"]
[]
[null,"Full trading name",{"$f":"INDEX(dms_TradingNameFull_List,MATCH(dms_TradingName,dms_TradingName_List))","v":"Queensland Electricity Transmission Corporation Limited trading as Powerlink Queensland"},null,"dms_TradingNameFull"]
[null,"Trading name",{"$f":"dms_TradingName","v":"Powerlink"}]
[null,"Unique ID","ETTQLD100"]
["Selected here","Model / RIN","Reset","dms_Model"]
["Read from Business & other details","Source","Regulatory proposal","dms_Source",{"$f":"IF(dms_Model=\"Reset\", \"You have chosen Reset - make sure you have set Reg Proposal as source\",\"\")","v":"You have chosen Reset - make sure you have set Reg Proposal as source"}]
[null,"Data quality","Consolidated","For DB purposes this is always Consoldiated"]
[null,"Data status","Public","\"See \"& \" - For DB purposes this is always Public\""]
[null,"Amendment reason",{"$f":"dms_Amendment_Text","v":"."},null,null,"dms_AmendmentReason"]
[null,"Submission date",{"$f":"dms_Typed_Submission_Date","v":"dd/mm/yy"},"dms_SubmissionDate"]
[]
["Redundant","EBSS - First application of scheme in forthcoming period?","No"]
["Pre-populated from lookup table","Data ingestion data quality","Consolidated","dms_DataQuality","Always Consolidated"]
[null,"Sector",{"$f":"INDEX(dms_Sector_List,MATCH(dms_TradingName,dms_TradingName_List))","v":"Electricity"},"dms_Sector","=INDEX(dms_Sector_List,MATCH(dms_TradingName,dms_TradingName_List))"]
[null,"Segment",{"$f":"INDEX(dms_Segment_List,MATCH(dms_TradingName,dms_TradingName_List))","v":"Transmission"},"dms_Segment","=INDEX(dms_Segment_List,MATCH(dms_TradingName,dms_TradingName_List))"]
[null,"Regulatory Year Ending",{"$f":"IF(dms_MultiYear_Flag=1,LEFT(dms_Specified_FinalYear,2)&RIGHT(dms_Specified_FinalYear,2),dms_RYE_result)","v":"2032"},"dms_RYE","=IF(dms_MultiYear_Flag=1,LEFT(dms_Specified_FinalYear,2)&RIGHT(dms_Specified_FinalYear,2),dms_RYE_result)"]
[null,"Reporting Period Type","Financial","dms_RPT","=INDEX(dms_RPT_List,MATCH(dms_TradingName,dms_TradingName_List))"]
[null,"EB/CA Unit of Measure for Monetary Values","$0s","dms_dollar_nom_UOM",{"$f":"IF(dms_SingleYearModel=\"yes\",\"This is set to an historical template (EB, CA or ARR), apply UOM Named Range to cell !\",\"This is not an historical template, make sure UOM Named Range is not applied\")","v":"This is not an historical template, make sure UOM Named Range is not applied"},null,null,null,null,{"$f":"IFERROR(dms_dollar_nom_UOM, \"NR not applied\")","v":"NR not applied"}]
[null,"Security Classification","Public","dms_Classification","Always Public"]
[null,"Jurisdiction",{"$f":"INDEX(dms_JurisdictionList,MATCH(dms_TradingName,dms_TradingName_List))","v":"Qld"},"dms_Jurisdiction","=INDEX(dms_JurisdictionList,MATCH(dms_TradingName,dms_TradingName_List))"]
["Relevant for PTRM, RFMs and Reset RINS","$ REAL REFERENCES"]
[null,"Does the named range CRY exist in this file? ",{"$f":"IFERROR(CRY,\"NO\")","v":"2022-23"}]
[null,"CRY-1  (last full calendar year before CRY)",{"$f":"IFERROR(IF(dms_RPT=\"calendar\",CRY-1,LEFT(CRY,4)),\"CRY not present\")","v":"2022"},"dms_Cal_Year_B4_CRY","'=IF(dms_RPT=\"financial\",VALUE(LEFT(dms_SingleYear_FinalYear_Result,4)),VALUE(LEFT(dms_SingleYear_FinalYear_Result,4)-1))"]
[null,"Dollar $ real month",{"$f":"INDEX(dms_RPTMonth_List,MATCH(dms_TradingName,dms_TradingName_List))","v":"June"},"dms_RPTMonth","=INDEX(dms_RPTMonth_List,MATCH(dms_TradingName,dms_TradingName_List))"]
[null,"Dollar $ real  (the last month before the FRCP_y1)",{"$f":"IF(dms_Model=\"RFM\",dms_DollarReal_Prev, IF(dms_SingleYearModel=\"yes\",CONCATENATE(dms_RPTMonth)&\" \"&VALUE((LEFT(dms_CRY_start_year,2)&RIGHT(dms_CRY_start_year,2))),CONCATENATE(dms_RPTMonth)&\" \"&dms_DollarReal_year))","v":"June 2027"},"dms_DollarReal","=IF(dms_Model=\"RFM\",dms_DollarReal_Prev, IF(dms_SingleYearModel=\"yes\",CONCATENATE(dms_RPTMonth)&\" \"&VALUE((LEFT(dms_CRY_start_year,2)&RIGHT(dms_CRY_start_year,2))),CONCATENATE(dms_RPTMonth)&\" \"&dms_DollarReal_year))"]
[null,"Dollar $ real previous year (PRCP_y5)",{"$f":"CONCATENATE(dms_RPTMonth)&\" \"&dms_Previous_DollarReal_year","v":"June 2022"},"dms_DollarReal_Prev","=IF(SUM(dms_SingleYear_Model)>0,CONCATENATE(dms_RPTMonth)&\" \"&VALUE(((LEFT(CRY,2))&RIGHT(CRY,2))-1),CONCATENATE(dms_RPTMonth)&\" \"&VALUE(((LEFT(dms_CRCP_FirstYear_Result,2)&RIGHT(dms_CRCP_FirstYear_Result,2))))-1)"]
[null,"PTRM/ RFMs"]
[null,"Form of control",{"$f":"INDEX(dms_FormControl_List,MATCH(dms_TradingName,dms_TradingName_List))","v":"Revenue cap"},"dms_FormControl","=INDEX(dms_FormControl_List,MATCH(dms_TradingName,dms_TradingName_List))"]
["All potential values for Regulatory Years or RYEs as calculated","This block works out the various RYE's for ALL RIN types and MODELS"]
[null,"dms_start_year",{"$f":"FRCP_y1","v":"2027-28"},"=FRCP_y1","FRCP_y1 from cover sheet"]
[null,"dms_CRY_start_year",{"$f":"IFERROR(CRY,CRCP_y4)","v":"2022-23"},"=IFERROR(CRY,CRCP_y4)"]
[null,"dms_CRY_start_row",{"$f":"IFERROR(MATCH(dms_CRY_start_year,INDIRECT(dms_RPT),0),0)","v":36},"=IFERROR(MATCH(dms_CRY_start_year,INDIRECT(dms_RPT),0),0)"]
[null,"dms_FRCP_start_row",{"$f":"MATCH(dms_start_year,INDIRECT(dms_RPT),0)","v":41},"=MATCH(dms_start_year,INDIRECT(dms_RPT),0)","Uses FRCP_y1 as a start reference"]
[null,"dms_CRCP_start_row",{"$f":"dms_FRCP_start_row-dms_CRCPlength_Num","v":36},"=dms_FRCP_start_row-dms_CRCPlength_Num","Uses the value in dms_CRCPlength_Num"]
[null,"dms_PRCP_start_row",{"$f":"dms_FRCP_start_row-dms_CRCPlength_Num-dms_PRCPlength_Num","v":31},"=dms_FRCP_start_row-dms_CRCPlength_Num-dms_PRCPlength_Num","Uses the value in dms_CRCPlength_Num and dms_PRCPlength_Num"]
[null,"dms_RYE_start_row",{"$f":"dms_FRCP_start_row+(dms_FRCPlength_Num-1)","v":45},"=dms_FRCP_start_row+(dms_FRCPlength_Num-1)","Uses the value in dms_FRCPlength_Num-1"]
[null,"FRCP_start_year",{"$f":"INDEX(INDIRECT(dms_RPT),dms_FRCP_start_row)","v":"2027-28"},"=INDEX(INDIRECT(dms_RPT),dms_FRCP_start_row)","Converts the FRCP start row to display the year"]
[null,"CRCP_start_year",{"$f":"INDEX(INDIRECT(dms_RPT),dms_CRCP_start_row)","v":"2022-23"},"=INDEX(INDIRECT(dms_RPT),dms_CRCP_start_row)","Converts the CRCP start row to display the year"]
[null,"PRCP_start_year",{"$f":"INDEX(INDIRECT(dms_RPT),dms_PRCP_start_row)","v":"2017-18"},"=INDEX(INDIRECT(dms_RPT),dms_PRCP_start_row)","Converts the PRCP start row to display the year"]
[null,"FRCP_final_year",{"$f":"INDEX(INDIRECT(dms_RPT),dms_FRCP_start_row+dms_FRCPlength_Num-1)","v":"2031-32"},"=INDEX(INDIRECT(dms_RPT),dms_FRCP_start_row+dms_FRCPlength_Num-1)","Finds the FRCP final year"]
[null,"CRCP_final_year",{"$f":"INDEX(INDIRECT(dms_RPT),dms_CRCP_start_row+dms_CRCPlength_Num-1)","v":"2026-27"},"=INDEX(INDIRECT(dms_RPT),dms_CRCP_start_row+dms_CRCPlength_Num-1)","Finds the CRCP final year"]
[null,"PRCP_final_year",{"$f":"INDEX(INDIRECT(dms_RPT),dms_PRCP_start_row+dms_FRCPlength_Num-1)","v":"2021-22"},"=INDEX(INDIRECT(dms_RPT),dms_PRCP_start_row+dms_FRCPlength_Num-1)","Finds the PRCP final year"]
[null,"dms_Reset_final_year",{"$f":"INDEX(INDIRECT(dms_RPT),dms_RYE_start_row)","v":"2031-32"},"=INDEX(INDIRECT(dms_RPT),dms_RYE_start_row)","For Resets and PTRM/RFMs (same as FRCP_final_year)"]
[null,"dms_SpecifiedYear_final_year",{"$f":"FRY","v":"2026-27"},"=FRY","FRY from cover sheet"]
[null,"dms_DollarReal_year",{"$f":"LEFT(CRCP_final_year,2)&RIGHT(CRCP_final_year,2)","v":"2027"},"=LEFT(CRCP_final_year,2)&RIGHT(CRCP_final_year,2)","Uses the value in CRCP_final_year"]
[null,"dms_Previous_DollarReal_year",{"$f":"LEFT(PRCP_final_year,2)&RIGHT(PRCP_final_year,2)","v":"2022"},"=LEFT(PRCP_final_year,2)&RIGHT(PRCP_final_year,2)","Uses the value in PRCP_final_year"]
[null,"dms_CRY_RYE",{"$f":"IFERROR(LEFT(CRY,2)&RIGHT(CRY,2),0)","v":"2023"},"=IFERROR(LEFT(CRY,2)&RIGHT(CRY,2),0)","For ABC single year RINS"]
[null,"dms_Reset_RYE",{"$f":"IF(dms_Model_Span>1,IF(dms_Model=\"RFM\",(LEFT(dms_DollarReal_year,2)&RIGHT(dms_DollarReal_year,2)),(LEFT(dms_Reset_final_year,2)&RIGHT(dms_Reset_final_year,2))),0)","v":"2032"},"=IF(dms_Model_Span>1,IF(dms_Model=\"RFM\",(LEFT(dms_DollarReal_year,2)&RIGHT(dms_DollarReal_year,2)),(LEFT(dms_Reset_final_year,2)&RIGHT(dms_Reset_final_year,2))),0)","If model span > 1 then uses dms_Reset_RYE otherwise it's a multi year ABC and uses dms_Specified_RYE"]
[null,"dms_Specified_RYE",{"$f":"IF(dms_MultiYear_ResponseFlag=\"Yes\",(LEFT(dms_Specified_FinalYear,2)&RIGHT(dms_Specified_FinalYear,2)),0)","v":0},"=IF(dms_MultiYear_ResponseFlag=\"Yes\",(LEFT(dms_Specified_FinalYear,2)&RIGHT(dms_Specified_FinalYear,2)),0)","If multi year ABC - uses dms_Specified_FinalYear"]
[null,"dms_Model_Span",{"$f":"INDEX(dms_Model_Span_List,MATCH(dms_Model,dms_Model_List))","v":5},"=INDEX(dms_Model_Span_List,MATCH(dms_Model,dms_Model_List))","A result of 5 is used to signify that it is more than 1 year span"]
[null,"dms_RYE_result",{"$f":"IF(dms_MultiYear_ResponseFlag=\"yes\",dms_Specified_RYE,(IF(dms_Model_Span>1,dms_Reset_RYE,dms_CRY_RYE)))","v":"2032"},"=IF(dms_MultiYear_ResponseFlag=\"yes\",dms_Specified_RYE,(IF(dms_Model_Span>1,dms_Reset_RYE,dms_CRY_RYE)))","Nested IF - feeds into dms_RYE"]
[null,"dms_Reset_Span",{"$f":"IF(dms_Reset_RYE>0,CONCATENATE(FRCP_y1,\" to \",FRCP_final_year),0)","v":"2027-28 to 2031-32"},"=IF(dms_Reset_RYE>0,CONCATENATE(FRCP_y1,\" to \",FRCP_final_year),0)","Reset span of years as text"]
[null,"dms_SpecifiedYear_Span",{"$f":"IF(dms_Specified_RYE>0,CONCATENATE(CRY,\" to \",dms_Specified_FinalYear),0)","v":0},"=IF(dms_Specified_RYE>0,CONCATENATE(CRY,\" to \",dms_Specified_FinalYear),0)","Multi year ABC span of years as text"]
[null,"dms_Header_Span",{"$f":"IF(dms_MultiYear_Flag=1,dms_SpecifiedYear_Span,IF(dms_Model_Span>1,dms_y1&\" to \"&FRCP_final_year,CRY))","v":"2022-23 to 2031-32"},"=IF(dms_MultiYear_Flag=1,dms_SpecifiedYear_Span,IF(dms_Model_Span>1,dms_Reset_Span,CRY))","NESTED IF - for Sheet Headers"]
[null,"ABC RINS THAT SPAN MULTIPLE YEARS"]
[null,"This is a multi year ABC RIN?","No"]
[null,null,{"$f":"IF(dms_MultiYear_ResponseFlag=\"No\",0,1)","v":0},"dms_MultiYear_Flag","This is set from the answer provided above"]
[null,null,{"$f":"IF(dms_MultiYear_Flag=1,FRY,\"not a Multiple year submission\")","v":"not a Multiple year submission"},"dms_Specified_FinalYear","The result here is returned to dms_CRCP_FinalYear_Result if response to Q in C73 is \"yes\" and dms_MultiYear_Flag is set to 1"]
[null," Start year for 5.2 in Multi year ABC RINS",{"$f":"IFERROR(IF(dms_MultiYear_Flag=1,FRY,CRY),\"not an ABC\")","v":"2022-23"},"dms_0502_Inst_Year","=IF(dms_MultiYear_Flag=1,FRY,CRY)",null,"For single year RINS this is CRY - multi year RINS need to start a the end of the span of years (ie. FRY)"]
[null,"WHAT IS THE RYE?"]
[null,"Reg Period Lengths"]
[null,"PRCP length in years",{"$f":"INDEX(dms_PRCPlength_List,MATCH(dms_TradingName,dms_TradingName_List))","v":5},"dms_PRCPlength_Num","=INDEX(dms_PRCPlength_List,MATCH(dms_TradingName,dms_TradingName_List))"]
[null,"CRCP length in years",{"$f":"INDEX(dms_CRCPlength_List,MATCH(dms_TradingName,dms_TradingName_List))","v":5},"dms_CRCPlength_Num","=INDEX(dms_CRCPlength_List,MATCH(dms_TradingName,dms_TradingName_List))"]
[null,"FRCP length in years",{"$f":"INDEX(dms_FRCPlength_List,MATCH(dms_TradingName,dms_TradingName_List))","v":5},"dms_FRCPlength_Num","=INDEX(dms_FRCPlength_List,MATCH(dms_TradingName,dms_TradingName_List))"]
[null,"Single year RIN?"]
[null,"Single Year ABC RIN ?",{"$f":"IF(dms_Model=\"EB\",1,0)","v":0},"dms_EB"]
[null,null,{"$f":"IF(dms_Model=\"CA\",1,0)","v":0},"dms_CA","=dms_SingleYear_Model"]
[null,null,{"$f":"IF(dms_Model=\"ARR\",1,0)","v":0},"dms_ARR"]
[null,"Is this a single Year ABC RIN?",{"$f":"IF(SUM(dms_SingleYear_Model)=1,\"yes\",\"no\")","v":"no"},"dms_SingleYearModel","=IF(SUM(dms_SingleYear_Model)=1,\"yes\",\"no\")"]
[null,"Single Year Final Year Result",{"$f":"IF(AND(dms_SingleYearModel=\"yes\",dms_MultiYear_Flag=0),CRY,0)","v":0},"dms_SingleYear_FinalYear_Result","=IFERROR(IF(SUM(dms_SingleYear_Model)<>0,(INDIRECT(dms_SingleYear_FinalYear_Ref)),\"not a single year RIN\"),\"CRY not present\")"]
[null,"Multi year RIN?"]
[]
[null,"Multi Year Reset/Model?",{"$f":"IF(dms_Model_Span>1,\"yes\",\"no\")","v":"yes"}]
[null,"Final year result for Reset/Model",{"$f":"IF(dms_Model_Span>1,dms_Reset_final_year,0)","v":"2031-32"},"dms_MultiYear_FinalYear_Result","dms_CRCP_FinalYear_Result"]
[]
[null,"Multi Year ABC RIN?",{"$f":"IF(dms_MultiYear_Flag=1,\"yes\",\"no\")","v":"no"},"dms_MultiYear_ABC_RIN"]
[null,"Final year result for ABC multi year",{"$f":"IF(dms_MultiYear_Flag=1,C51,0)","v":0}]
[]
[null,"EB RINS"]
[null,"Calendar Year for table 3.6 data",{"$f":"IFERROR(IF(dms_Segment=\"Transmission\",dms_Cal_Year_B4_CRY,CRY),\"CRY not present\")","v":"2022"},"dms_0306_Year","=IF(dms_Segment=\"Transmission\",dms_Cal_Year_B4_CRY,CRY)"]
[null,"CA RINS"]
[null,"Find how many rows in tables 6.3 sustained interruptions?",null,null,"dms_060301_MaxRows only returns a valid value when cover sheet is attached to a CA file"]
[null,null,{"$f":"IF(dms_Model<>\"CA\",\"not a CA\",\"Is a CA\")","v":"not a CA"},null,"=IF(dms_Model<>\"CA\",\"not a CA\",\"Is a CA\")"]
[null,"dms_060301_Avg_Duration_Sustained_Int_Values present?",{"$f":"IFERROR(IF(INDEX(dms_060301_Avg_Duration_Sustained_Int_Values,1,1)<>\"\",\"yes\",\"no\"),\"no\")","v":"no"},"dms_060301_checkvalue","=IFERROR(IF(INDEX(dms_060301_Avg_Duration_Sustained_Int_Values,1,1)<>\"\",\"yes\",\"no\"),\"no\")"]
[null,null,{"$f":"IF(AND(dms_Model=\"CA\",(dms_060301_checkvalue=\"no\")),\"error - NR not present\",\"no errors\")","v":"no errors"},null,"=IF(AND(dms_Model=\"CA\",(dms_060301_checkvalue=\"no\")),\"error - NR not present\",\"no errors\")"]
[null,"Table 6.3.1 - last row reference",{"$f":"IFERROR(IF(dms_Model=\"CA\",LOOKUP(2,1/(dms_060301_Avg_Duration_Sustained_Int_Values<>\"\"),(ROW(dms_060301_Avg_Duration_Sustained_Int_Values))),\"not a CA\"),\"6.3 not present\")","v":"not a CA"},"dms_060301_LastRow","=IFERROR(IF(dms_Model=\"CA\",LOOKUP(2,1/(dms_060301_Avg_Duration_Sustained_Int_Values<>\"\"),(ROW(dms_060301_Avg_Duration_Sustained_Int_Values))),\"not a CA\"),\"6.3 not present\")"]
[null,"Table 6.3.1 - max number rows",{"$f":"IFERROR(IF(dms_Model=\"CA\",(dms_060301_LastRow-15),\"not a CA\"),\"error\")","v":"not a CA"},"dms_060301_MaxRows","=IFERROR(IF(dms_Model=\"CA\",(dms_060301_LastRow-15),\"not a CA\"),\"error\")"]
[null,"Table 6.6.3 - Public lighting repair - no. business days",{"$f":"INDEX(dms_663_List,MATCH(dms_TradingName,dms_TradingName_List))","v":5},"dms_663","=INDEX(dms_663_List,MATCH(dms_TradingName,dms_TradingName_List))"]
[null,"ARR or RESET RINS"]
[null,"How many rows in tables 6.1 or 6.7?  (leap year?)","insert dms_LeapYear NR if required",null,"'dms_LeapYear is used to determine dms_060701_Max_Rows BUT it is only found on worksheet 6.1 or 6.7 and the date value in the cell is used to determine whether it is a leap year"]
[null,"Is dms_LeapYear named range present?",{"$f":"IFERROR(IF(dms_LeapYear,\"yes\"),\"no\")","v":"no"}]
[null,"Table 6.7.1 - includes a leap year?",{"$f":"\nIFERROR(IF(MONTH(DATE(YEAR(dms_LeapYear),2,29))=2,\"is a leap year\",\"not a leap year\"),\n\"dms_LeapYear not present\")","v":"dms_LeapYear not present"},"dms_LeapYear_Result","=IFERROR(IF(MONTH(DATE(YEAR(dms_LeapYear),2,29))=2,\"is a leap year\",\"not a leap year\"),\"dms_LeapYear not present\")"]
[null,"MaxRows if Reset and leap year",{"$f":"IF(dms_LeapYear_Result=\"is a leap year\",1827,1826)","v":1826},"dms_060701_Reset_MaxRows","=IF(dms_LeapYear_Result=\"is a leap year\",1827,1826)",null,null,"number of days present in Reset RIN table"]
[null,"MaxRows if ARR and leap year",{"$f":"IF(dms_LeapYear_Result=\"is a leap year\",366,365)","v":365},"dms_060701_ARR_MaxRows","=IF(dms_LeapYear_Result=\"is a leap year\",366,365)",null,null,"number of days present in ARR RIN table"]
[null,"Table 6.7.1 - Max Rows (leap year/ non leap year)",{"$f":"IF(dms_Model=\"ARR\",dms_060701_ARR_MaxRows,IF(dms_Model=\"Reset\",dms_060701_Reset_MaxRows,\"not a relevant RIN type\"))","v":1826},"dms_060701_MaxRows","=IF(dms_Model=\"ARR\",dms_060701_ARR_MaxRows,IF(dms_Model=\"Reset\",dms_060701_Reset_MaxRows,\"not a relevant RIN type\"))"]
[null,"How many columns in 6.7?   (4 or 5 feeder categories)",{"$f":"IF(dms_FifthFeeder_flag_NSP=\"NO\",\"This NSP has only 4 feeder categories\",\"This NSP has 5 feeder categories\")","v":"This NSP has only 4 feeder categories"}]
[null,"Table 6.7.1 - Last column (# of feeder categories > 4)",{"$f":"IF(dms_FifthFeeder_flag_NSP=\"NO\",10,12)","v":10},"dms_060701_MaxCols","=IF(dms_FifthFeeder_flag_NSP=\"NO\",8,10)"]
[null,"Table 6.7.1 - Number of offset rows",{"$f":"IF(dms_Model=\"ARR\",15,9)","v":9},"dms_060701_OffsetRows","=IF(dms_Model=\"ARR\",15,9)"]
[null,"Start date for telephone answering in 6.1 or 6.7?",null,null,"Using 060101 as naming standard not 060701 for start dates"]
[null,"Table 6.1.1 and 6.7.1 - Start Date as Text",{"$f":"IF(dms_SingleYearModel=\"yes\",(CONCATENATE(IF(LEN(CRY)=4,\"1-Jan-\",\"1-Jul-\"),LEFT(CRY,4))),(CONCATENATE(IF(LEN(PRCP_y4)=4,\"1-Jan-\",\"1-Jul-\"),LEFT(PRCP_y4,4))))","v":"1-Jul-2020"},"dms_060101_StartDateTxt","=IF(SUM(dms_SingleYear_Model)>1,(CONCATENATE(IF(LEN(CRY)=4,\"1-Jan-\",\"1-Jul-\"),LEFT(CRY,4))),(CONCATENATE(IF(LEN(CRCP_y4)=4,\"1-Jan-\",\"1-Jul-\"),LEFT(CRCP_y4,4))))"]
[null,"Table 6.1.1 and 6.7.1 - Start Date as Date Value",{"$f":"DATEVALUE(dms_060701_StartDateTxt)","v":44013},"dms_060101_StartDateVal","=DATEVALUE(dms_060701_StartDateTxt)"]
[null,"ARRs"]
[null,"How many rows in table 6.8?","insert dms_060801_StartCell NR if required",null,"dms_060801_StartCell is only found on worksheet 6.8 and is used to determine the starting date for the date range"]
[null,"Is dms_060801_StartCell named range present?",{"$f":"IFERROR(IF((ROW(dms_060801_StartCell)-1)=1,\"yes\",\"yes\"),\"no\")","v":"no"},"Must be present for ARRs","=IFERROR(IF((ROW(dms_060801_StartCell)-1)=1,\"yes\",\"yes\"),\"no\")"]
[null,"Table 6.8 - Number of offset rows",12,"dms_0608_OffsetRows","=IFERROR(IF(dms_Model=\"ARR\",(ROW(dms_060801_StartCell)-1),\"not an ARR\"),\"6.8 error\")"]
[null,"Table 6.8 - Last row",{"$f":"IFERROR(IF(dms_060801_StartCell<>\"\",IF(dms_Model=\"ARR\",(LOOKUP(2,1/(dms_060801_01_Values<>\"\"),(ROW(dms_060801_01_Values)))),\"not an ARR\"),0),\"0\")","v":"0"},"dms_0608_LastRow","=IFERROR(IF(dms_060801_StartCell<>\"\",IF(dms_Model=\"ARR\",(LOOKUP(2,1/(dms_060801_01_Values<>\"\"),(ROW(dms_060801_01_Values)))),\"not an ARR\"),0),\"0\")"]
[null,"Table 6.8 - MaxRows",{"$f":"IFERROR(IF(dms_Model=\"ARR\",(MAX(0,dms_0608_LastRow-dms_0608_OffsetRows)),\"not an ARR\"),\"0\")","v":"not an ARR"},"dms_060801_MaxRows","=IFERROR(IF(dms_Model=\"ARR\",(MAX(0,dms_0608_LastRow-dms_0608_OffsetRows)),\"not an ARR\"),\"0\")"]
[null,"TNSP RESET RINS"]
[null,"Table 7.9.4 only appears in TNSPs Reset RIN"]
[null,"Table 7.9.4 - first year",{"$f":"LEFT(PRCP_y3,4)","v":"2019"},"dms_070904_Start_Year","=LEFT(PRCP_y3,4)"]
[]
[null,"MISC"]
[null,"Distribution Determination Reference","-","dms_DeterminationRef"]
[null,"Public lighting NSP?",{"$f":"INDEX(dms_Public_Lighting_List,MATCH(dms_TradingName,dms_TradingName_List))","v":"NO"},"dms_Public_Lighting","=INDEX(dms_Public_Lighting_List,MATCH(dms_TradingName,dms_TradingName_List))"]
[null,"CBD Feeder for this business",{"$f":"INDEX(dms_CBD_flag,MATCH(dms_TradingName,dms_TradingName_List))","v":"NO"},"dms_CBD_flag_NSP"]
[null,"Urban Feeder for this business",{"$f":"INDEX(dms_Urban_flag,MATCH(dms_TradingName,dms_TradingName_List))","v":"NO"},"dms_Urban_flag_NSP"]
[null,"Short rural Feeder for this business",{"$f":"INDEX(dms_ShortRural_flag,MATCH(dms_TradingName,dms_TradingName_List))","v":"NO"},"dms_ShortRural_flag_NSP"]
[null,"Long rural Feeder for this business",{"$f":"INDEX(dms_LongRural_flag,MATCH(dms_TradingName,dms_TradingName_List))","v":"NO"},"dms_LongRural_flag_NSP"]
[null,"Fifth Feeder Category (eg. TasNetworks (D))",{"$f":"INDEX(dms_FeederType_5_flag,MATCH(dms_TradingName,dms_TradingName_List))","v":"NO"},"dms_FifthFeeder_flag_NSP","=INDEX(dms_FeederType_5_flag,MATCH(dms_TradingName,dms_TradingName_List))"]
[]
[null,"DISCARD FILES"]
[null,"discard this record?","NO","dms_DISCARD","If record is to be discarded from DB set this flag to YES"]
[]
[null,"SUBSET FILES"]
[null,"Is this Submission File a Subset File","NO","dms_Partial"]
[]
[]
[null,"REGULATORY YEARS FOR MULTI RYE SUBMISSIONS"]
[null,"Multiple RYE flag","NO","dms_Multi_RYE_flag"]
[null,null,"Manually specify RYE","Named ranges to apply"]
[null,null,2013,"dms_RYE_01"]
[null,null,2014,"dms_RYE_02"]
[null,null,2015,"dms_RYE_03"]
[null,null,2016,"dms_RYE_04"]
[null,null,2017,"dms_RYE_05"]
[null,null,2018,"dms_RYE_06"]
[null,null,2019,"dms_RYE_07"]
[null,null,2020,"dms_RYE_08"]
[null,null,2021,"dms_RYE_09"]