{"text_format":"1","workbook":"xlsx","n_sheets":21,"sheets":["Title Page","AER Change Log","CitiPower Change Log","Input|General","Input| Historical Inflation","Input| Prices","Opex Specific >","Input | Meter-Opex BST","Calc | Opex","Capex Specific >","Input | Meters Vols & Costs","NMI input","Input | Comms, IT, Other","Calculations >","Calc | Capex Meters","Calc | Meters Detail","Calc | Capex Comm, IT, Other","Outputs","Output | PTRM","Output | RFM","Lookup|Tables"],"not_rendered":{"charts":0,"images":2,"macros":1,"external_links":0,"defined_names":167,"comments":0,"pivot_tables":0},"unopened":[],"bounds":{"document_bytes":16777216,"sheet_cells":100000,"rows_first":2000,"rows_last":500,"rows_between":2000,"halvings":0,"cell_chars":16384,"cell_head_chars":4096},"cells_cut":0,"cells_raw":0,"read":"whole","date_system":"1900"}

{"sheet":"Title Page","index":0,"n_rows":30,"n_cols":8,"rows_kept":30,"cut":false,"hidden":false,"merged":[[9,1,9,2],[35,4,35,7],[5,1,6,8],[36,4,36,7],[34,4,34,7],[33,4,33,7],[32,4,32,7],[31,4,31,7]]}
[]
[]
[]
[]
[]
[null,"Final Standardised Metering Capex and Opex Model"]
[]
[]
[null,"Version ",null,1.08]
[null,"Date",null,44589]
{"$rows_left_out":21}
{"sheet":"AER Change Log","index":1,"n_rows":61,"n_cols":4,"rows_kept":61,"cut":false,"hidden":false,"merged":[]}
[null,"AER Draft Decision Change Log"]
[]
[null,"changes in the spreadsheet are also highlighted in green"]
[]
[null,"Tab","Cells","Description of change"]
[null,"Input| General","J9","Updated to draft decision"]
[null,"Input| Historical Inflation","I45:54","Updated historical CPI"]
[null,"Input| Prices","J21:K21","Removed forecast inflation as replaced by historical CPI"]
[null,null,"L21","Updated forecast inflation for August 2025 RBA Statement on Monetary Policy"]
[null,null,"M21","Updated forecast inflation for draft decision position"]
{"$rows_left_out":52}
{"sheet":"CitiPower Change Log","index":2,"n_rows":5,"n_cols":4,"rows_kept":5,"cut":false,"hidden":false,"merged":[]}
[null,"changes in the spreadsheet are also highlighted in yellow"]
[]
[null,"Tab","Cells","Description of change"]
[null,"Input| General","J9","Updated to revised proposal"]
[null,"Input | Meter-Opex BST","P9","Updated 2024-25 actual Opex "]

{"sheet":"Input|General","index":3,"n_rows":47,"n_cols":22,"rows_kept":47,"cut":false,"hidden":false,"merged":[[1,1,1,2],[1,11,1,12],[1,13,1,14],[1,15,1,16],[1,9,1,10]]}
[null,"AER Metering Opex & Capex Forecasting Model "]
[null,"Ver:",null,1.08,null,null,null,"Key:","Input","External Link",null,"Internal Link",null,"NSP New Data",null,"AER Addition"]
[null,{"$f":"MID(CELL(\"filename\",A1),FIND(\"]\",CELL(\"filename\",A1))+1,255)","v":"Input|General"}]
[]
[null,"Input | General inputs"]
[]
[null,null,null,null,"Inputs",null,"Source",null,null,"Value",null,null,null,"Note"]
[null,null,null,null,"NSP name",null,"NSP",null,null,"CitiPower",null,null,null,null,null,null,null,null,null,null,null,{"$f":"IF(COUNTBLANK($J8),0,1)","v":1}]
[null,null,null,null,"Decision stage",null,"NSP",null,null,"final",null,null,null,null,null,null,null,null,null,null,null,{"$f":"IF(COUNTBLANK($J9),0,1)","v":1}]
[]
{"$rows_left_out":38}
{"sheet":"Input| Historical Inflation","index":4,"n_rows":80,"n_cols":11,"rows_kept":80,"cut":false,"hidden":false,"merged":[[6,3,7,4]]}
[null,{"$f":"'Input|General'!B1&\" v\"&'Input|General'!$D$2","v":"AER Metering Opex & Capex Forecasting Model  v1.08"}]
[null,{"$f":"MID(CELL(\"filename\",B2),FIND(\"]\",CELL(\"filename\",B2))+1,255)","v":"Input| Historical Inflation"}]
[]
[]
[null,"Input | General inputs"]
[]
[null,null,null,"Added Calc",null,null,"Index value, new base","Percentage Change from Corresponding Quarter of Previous Year","Index value, new base","Percentage Change from Corresponding Quarter of Previous Year"]
[null,null,null,null,null,"Source","ABS","Calculated","ABS","Calculated"]
[null,null,null,"Year","Month","Unit","index","Percent","index2","Percent3","Percent4"]
[null,null,null,{"$f":"YEAR(F10)","v":2014},{"$f":"MONTH(F10)","v":6},"2014-06-30",null,null,105.9]
{"$rows_left_out":71}
{"sheet":"Input| Prices","index":5,"n_rows":59,"n_cols":17,"rows_kept":59,"cut":false,"hidden":false,"merged":[[5,3,5,11],[11,3,11,18],[13,12,13,16],[18,12,18,16]]}
[null,{"$f":"'Input|General'!B1&\" v\"&'Input|General'!$D$2","v":"AER Metering Opex & Capex Forecasting Model  v1.08"}]
[null,{"$f":"MID(CELL(\"filename\",A1),FIND(\"]\",CELL(\"filename\",A1))+1,255)","v":"Input| Prices"}]
[]
[{"$f":"PRODUCT(A5:A61)","v":0}]
[]
[null,null,null,"6. Inflation table setup"]
[]
[null,null,null,"First year of forecast regulatory control period",null,null,null,null,null,{"$f":"FPFirstYear","v":"2026-27"}]
[null,null,null,"Year End",null,null,null,null,null,{"$f":"'Input|General'!J14","v":"2000-06-01"}]
[null,null,null,"Notation Adjustment",null,null,null,null,null,{"$f":"IF(MID(PPFirstYear,5,1)=\"\",0,1)","v":1}]
{"$rows_left_out":50}
{"sheet":"Opex Specific >","index":6,"n_rows":0,"n_cols":0,"rows_kept":0,"cut":false,"hidden":false,"merged":[]}

{"sheet":"Input | Meter-Opex BST","index":7,"n_rows":46,"n_cols":22,"rows_kept":46,"cut":false,"hidden":false,"merged":[[3,17,3,21]]}
[null,{"$f":"'Input|General'!B1&\" v\"&'Input|General'!$D$2","v":"AER Metering Opex & Capex Forecasting Model  v1.08"}]
[null,{"$f":"MID(CELL(\"filename\",A1),FIND(\"]\",CELL(\"filename\",A1))+1,255)","v":"Input | Meter-Opex BST"}]
[]
[null,null,null,null,null,null,null,null,null,null,null,null,null,{"$f":"IF(N5=Opex_BaseYear,\"Base Year\",\"\")","v":""},{"$f":"IF(O5=Opex_BaseYear,\"Base Year\",\"\")","v":""},{"$f":"IF(P5=Opex_BaseYear,\"Base Year\",\"\")","v":"Base Year"},{"$f":"IF(Q5=Opex_BaseYear,\"Base Year\",\"\")","v":""},"Forecast RP"]
[{"$f":"PRODUCT($A$6:$A$52)","v":1},null,null,null,null,null,null,null,null,"Value",null,{"$f":"IF(MONTH('Input|General'!$J$14)=6,LEFT(M5,4)-1&\"-\"&TEXT(MOD(MID(M5,6,2)-1,100),\"00\"),M5-1)","v":"2020-21"},{"$f":"IF(MONTH('Input|General'!$J$14)=6,LEFT(N5,4)-1&\"-\"&TEXT(MOD(MID(N5,6,2)-1,100),\"00\"),N5-1)","v":"2021-22"},{"$f":"IF(MONTH('Input|General'!$J$14)=6,LEFT(O5,4)-1&\"-\"&TEXT(MOD(MID(O5,6,2)-1,100),\"00\"),O5-1)","v":"2022-23"},{"$f":"IF(MONTH('Input|General'!$J$14)=6,LEFT(P5,4)-1&\"-\"&TEXT(MOD(MID(P5,6,2)-1,100),\"00\"),P5-1)","v":"2023-24"},{"$f":"IF(MONTH('Input|General'!$J$14)=6,LEFT(Q5,4)-1&\"-\"&TEXT(MOD(MID(Q5,6,2)-1,100),\"00\"),Q5-1)","v":"2024-25"},{"$f":"IF(MONTH('Input|General'!$J$14)=6,LEFT(R5,4)-1&\"-\"&TEXT(MOD(MID(R5,6,2)-1,100),\"00\"),R5-1)","v":"2025-26"},{"$f":"FPFirstYear","v":"2026-27"},{"$f":"IF(MONTH('Input|General'!$J$14)=6,LEFT(R5,4)+1&\"-\"&TEXT(MOD(MID(R5,6,2)+1,100),\"00\"),R5+1)","v":"2027-28"},{"$f":"IF(MONTH('Input|General'!$J$14)=6,LEFT(S5,4)+1&\"-\"&TEXT(MOD(MID(S5,6,2)+1,100),\"00\"),S5+1)","v":"2028-29"},{"$f":"IF(MONTH('Input|General'!$J$14)=6,LEFT(T5,4)+1&\"-\"&TEXT(MOD(MID(T5,6,2)+1,100),\"00\"),T5+1)","v":"2029-30"},{"$f":"IF(MONTH('Input|General'!$J$14)=6,LEFT(U5,4)+1&\"-\"&TEXT(MOD(MID(U5,6,2)+1,100),\"00\"),U5+1)","v":"2030-31"}]
[]
[null,null,"Base"]
[null,null,null,"Historical Opex"]
[null,null,null,null,null,"Total opex","$millions",{"$f":"Basis_OpexHist","v":"nominal"},null,null,null,4.5420881094306766,4.6194002557567204,4.2552323230000004,3.7881939563088856,3.3609461400000002,4.4549160926192499]
[]
{"$rows_left_out":37}
{"sheet":"Calc | Opex","index":8,"n_rows":53,"n_cols":22,"rows_kept":53,"cut":false,"hidden":false,"merged":[[46,1,54,1]]}
[null,{"$f":"'Input|General'!B1&\" v\"&'Input|General'!$D$2","v":"AER Metering Opex & Capex Forecasting Model  v1.08"}]
[null,{"$f":"MID(CELL(\"filename\",A1),FIND(\"]\",CELL(\"filename\",A1))+1,255)","v":"Calc | Opex"}]
[]
[null,null,null,null,null,null,null,null,null,"Value",null,{"$f":"IF(MONTH('Input|General'!$J$14)=6,LEFT(M4,4)-1&\"-\"&TEXT(MOD(MID(M4,6,2)-1,100),\"00\"),M4-1)","v":"2020-21"},{"$f":"IF(MONTH('Input|General'!$J$14)=6,LEFT(N4,4)-1&\"-\"&TEXT(MOD(MID(N4,6,2)-1,100),\"00\"),N4-1)","v":"2021-22"},{"$f":"IF(MONTH('Input|General'!$J$14)=6,LEFT(O4,4)-1&\"-\"&TEXT(MOD(MID(O4,6,2)-1,100),\"00\"),O4-1)","v":"2022-23"},{"$f":"IF(MONTH('Input|General'!$J$14)=6,LEFT(P4,4)-1&\"-\"&TEXT(MOD(MID(P4,6,2)-1,100),\"00\"),P4-1)","v":"2023-24"},{"$f":"IF(MONTH('Input|General'!$J$14)=6,LEFT(Q4,4)-1&\"-\"&TEXT(MOD(MID(Q4,6,2)-1,100),\"00\"),Q4-1)","v":"2024-25"},{"$f":"IF(MONTH('Input|General'!$J$14)=6,LEFT(R4,4)-1&\"-\"&TEXT(MOD(MID(R4,6,2)-1,100),\"00\"),R4-1)","v":"2025-26"},{"$f":"FPFirstYear","v":"2026-27"},{"$f":"IF(MONTH('Input|General'!$J$14)=6,LEFT(R4,4)+1&\"-\"&TEXT(MOD(MID(R4,6,2)+1,100),\"00\"),R4+1)","v":"2027-28"},{"$f":"IF(MONTH('Input|General'!$J$14)=6,LEFT(S4,4)+1&\"-\"&TEXT(MOD(MID(S4,6,2)+1,100),\"00\"),S4+1)","v":"2028-29"},{"$f":"IF(MONTH('Input|General'!$J$14)=6,LEFT(T4,4)+1&\"-\"&TEXT(MOD(MID(T4,6,2)+1,100),\"00\"),T4+1)","v":"2029-30"},{"$f":"IF(MONTH('Input|General'!$J$14)=6,LEFT(U4,4)+1&\"-\"&TEXT(MOD(MID(U4,6,2)+1,100),\"00\"),U4+1)","v":"2030-31"}]
[]
[null,"Calcs"]
[]
[null,null,null,null,null,null,null,null,null,"Value",null,{"$f":"L4","v":"2020-21"},{"$f":"M4","v":"2021-22"},"2022-23","2023-24","2024-25","2025-26","2026-27","2027-28","2028-29","2029-30","2030-31"]
[]
[null,null,"Base"]
{"$rows_left_out":44}
{"sheet":"Capex Specific >","index":9,"n_rows":0,"n_cols":0,"rows_kept":0,"cut":false,"hidden":false,"merged":[]}

{"sheet":"Input | Meters Vols & Costs","index":10,"n_rows":448,"n_cols":31,"rows_kept":448,"cut":false,"hidden":false,"merged":[[24,1,24,11],[368,0,427,0],[143,1,143,11],[4,1,4,11],[40,1,40,11],[169,16,169,20],[52,6,53,8],[70,1,70,11],[119,1,119,11],[120,0,139,0]]}
[null,{"$f":"'Input|General'!B1&\" v\"&'Input|General'!$D$2","v":"AER Metering Opex & Capex Forecasting Model  v1.08"}]
[null,{"$f":"MID(CELL(\"filename\",A1),FIND(\"]\",CELL(\"filename\",A1))+1,255)","v":"Input | Meters Vols & Costs"}]
[]
[{"$f":"PRODUCT($A$5:$A$452)","v":1}]
[null,"1. Meter Types"]
[]
[]
[null,null,null,null,null,"Meter Type","RIN Subcategory 1","RIN Subcategory 2","AER Type","RIN Subcategory 3","Meter Code"]
[null,null,null,null,null,"AMI - Single Phase, single element","Single Phase Meter Population","Direct Connect Meter Population","Meter Type 4","Single phase single element - AMI","AMI 1ph 1e"]
[null,null,null,null,null,"AMI - Single Phase, single element + C","Single Phase Meter Population","Direct Connect Meter Population","Meter Type 4","Single phase two element with contactor - AMI","AMI 1ph 1e + C"]
{"$rows_left_out":439}
{"sheet":"NMI input","index":11,"n_rows":23,"n_cols":16,"rows_kept":23,"cut":false,"hidden":false,"merged":[[2,2,2,7],[11,2,11,7]]}
[]
[]
["Meter Quantities",null,"Customer Numbers"]
["Year","2024-25","2025-26","2026-27","2027-28","2028-29","2029-30","2030-31",null,"2024-25","2025-26","2026-27","2027-28","2028-29","2029-30","2030-31"]
["single phase single element meter",{"$f":"'Input | Meters Vols & Costs'!O412+'Input | Meters Vols & Costs'!O418+'Input | Meters Vols & Costs'!O421","v":232606.27124346036},{"$f":"'Input | Meters Vols & Costs'!P412+'Input | Meters Vols & Costs'!P418+'Input | Meters Vols & Costs'!P421","v":232496.67655110129},{"$f":"'Input | Meters Vols & Costs'!Q412+'Input | Meters Vols & Costs'!Q418+'Input | Meters Vols & Costs'!Q421","v":232397.3120877498},{"$f":"'Input | Meters Vols & Costs'!R412+'Input | Meters Vols & Costs'!R418+'Input | Meters Vols & Costs'!R421","v":232303.94762439834},{"$f":"'Input | Meters Vols & Costs'!S412+'Input | Meters Vols & Costs'!S418+'Input | Meters Vols & Costs'!S421","v":232615.76162439835},{"$f":"'Input | Meters Vols & Costs'!T412+'Input | Meters Vols & Costs'!T418+'Input | Meters Vols & Costs'!T421","v":232933.50009039836},{"$f":"'Input | Meters Vols & Costs'!U412+'Input | Meters Vols & Costs'!U418+'Input | Meters Vols & Costs'!U421","v":233256.95784878635},null,{"$f":"B5/$B$9*$J$10","v":224416.17719366556},{"$f":"C5-B5","v":-109.59469235906727},{"$f":"D5-C5","v":-99.364463351492304},-93.364463351463201,311.81400000001304,317.73846600000979,323.45775838798727]
["single phase single element meter with contactor",{"$f":"'Input | Meters Vols & Costs'!O413+'Input | Meters Vols & Costs'!O414","v":39856.964463351476},{"$f":"'Input | Meters Vols & Costs'!P413+'Input | Meters Vols & Costs'!P414","v":41222.228163344182},{"$f":"'Input | Meters Vols & Costs'!Q413+'Input | Meters Vols & Costs'!Q414","v":42621.592626695659},{"$f":"'Input | Meters Vols & Costs'!R413+'Input | Meters Vols & Costs'!R414","v":44040.957090047137},{"$f":"'Input | Meters Vols & Costs'!S413+'Input | Meters Vols & Costs'!S414","v":45080.337090047135},{"$f":"'Input | Meters Vols & Costs'!T413+'Input | Meters Vols & Costs'!T414","v":46139.465310047141},{"$f":"'Input | Meters Vols & Costs'!U413+'Input | Meters Vols & Costs'!U414","v":47217.657838007137},null,{"$f":"B6/$B$9*$J$10","v":38453.596077154732},{"$f":"C6-B6","v":1365.2636999927054},1399.3644633514778,1419.3644633514778,1039.3799999999974,1059.128220000006,1078.1925279599964]
["three phase direct connected meter",{"$f":"'Input | Meters Vols & Costs'!O415+'Input | Meters Vols & Costs'!O419+'Input | Meters Vols & Costs'!O422+'Input | Meters Vols & Costs'!O416","v":72301.218038337756},{"$f":"'Input | Meters Vols & Costs'!P415+'Input | Meters Vols & Costs'!P419+'Input | Meters Vols & Costs'!P422+'Input | Meters Vols & Costs'!P416","v":73904.610771162188},{"$f":"'Input | Meters Vols & Costs'!Q415+'Input | Meters Vols & Costs'!Q419+'Input | Meters Vols & Costs'!Q422+'Input | Meters Vols & Costs'!Q416","v":75564.610771162173},{"$f":"'Input | Meters Vols & Costs'!R415+'Input | Meters Vols & Costs'!R419+'Input | Meters Vols & Costs'!R422+'Input | Meters Vols & Costs'!R416","v":77257.810771162171},{"$f":"'Input | Meters Vols & Costs'!S415+'Input | Meters Vols & Costs'!S419+'Input | Meters Vols & Costs'!S422+'Input | Meters Vols & Costs'!S416","v":78983.18157116216},{"$f":"'Input | Meters Vols & Costs'!T415+'Input | Meters Vols & Costs'!T419+'Input | Meters Vols & Costs'!T422+'Input | Meters Vols & Costs'!T416","v":80741.334416362151},{"$f":"'Input | Meters Vols & Costs'!U415+'Input | Meters Vols & Costs'!U419+'Input | Meters Vols & Costs'!U422+'Input | Meters Vols & Costs'!U416","v":82531.134012775758},null,69755.483684387684,1603.3927328244317,1659.9999999999854,1693.1999999999971,1725.3707999999897,1758.1528451999911,1789.7995964136062]
["three phase Current transformer connected meter",{"$f":"'Input | Meters Vols & Costs'!O417+'Input | Meters Vols & Costs'!O420+'Input | Meters Vols & Costs'!O423","v":4012.0062548504175},{"$f":"'Input | Meters Vols & Costs'!P417+'Input | Meters Vols & Costs'!P420+'Input | Meters Vols & Costs'!P423","v":4316.2645143924019},{"$f":"'Input | Meters Vols & Costs'!Q417+'Input | Meters Vols & Costs'!Q420+'Input | Meters Vols & Costs'!Q423","v":4631.2645143924019},{"$f":"'Input | Meters Vols & Costs'!R417+'Input | Meters Vols & Costs'!R420+'Input | Meters Vols & Costs'!R423","v":4952.5645143924021},{"$f":"'Input | Meters Vols & Costs'!S417+'Input | Meters Vols & Costs'!S420+'Input | Meters Vols & Costs'!S423","v":5279.9692143924021},{"$f":"'Input | Meters Vols & Costs'!T417+'Input | Meters Vols & Costs'!T420+'Input | Meters Vols & Costs'!T423","v":5613.5946036924024},{"$f":"'Input | Meters Vols & Costs'!U417+'Input | Meters Vols & Costs'!U420+'Input | Meters Vols & Costs'!U423","v":5953.2252499998021},null,3870.7430447919151,304.25825954198444,315,321.30000000000018,327.40470000000005,333.62538930000028,339.63064630739973]
[null,{"$f":"'Input | Meters Vols & Costs'!O427","v":348776.46000000014},{"$f":"SUM(C5:C8)","v":351939.78000000009},{"$f":"SUM(D5:D8)","v":355214.78000000009},358555.28,361959.24950000009,365427.89442050009,368958.97494956898,null,null,{"$f":"C9/$C$9","v":1},{"$f":"D9/$D$9","v":1},{"$f":"E9/$E$9","v":1},{"$f":"F9/$F$9","v":1},{"$f":"G9/$G$9","v":1},{"$f":"H9/$H$9","v":1}]
[null,{"$f":"B9-SUM(B5:B8)","v":0},{"$f":"C9/B9-1","v":9.0697634811705008E-3},{"$f":"D9/C9-1","v":9.3055692652874722E-3},9.4041694999289493E-3,9.4935695829108102E-3,9.5829708048391637E-3,9.6628653230441675E-3,null,{"$f":"B22-B23","v":336496},{"$f":"J10*(1+C10)","v":339547.93913235993},{"$f":"K10*(1+D10)","v":342707.62599884172},345930.50660265307,349214.62193793693,352561.13546459115,355967.88623472501]
{"$rows_left_out":14}
{"sheet":"Input | Comms, IT, Other","index":12,"n_rows":262,"n_cols":18,"rows_kept":262,"cut":false,"hidden":false,"merged":[[199,12,199,16],[222,12,222,16],[245,12,245,16],[174,12,174,16],[5,0,5,11],[38,0,38,11],[152,0,152,11],[172,0,172,11],[80,12,80,16],[107,12,107,16],[121,12,121,16],[41,6,41,11],[42,6,42,8],[95,4,95,5],[81,4,81,5],[42,9,42,11],[68,4,68,5]]}
[null,{"$f":"'Input|General'!B1&\" v\"&'Input|General'!$D$2","v":"AER Metering Opex & Capex Forecasting Model  v1.08"}]
[null,{"$f":"MID(CELL(\"filename\",A1),FIND(\"]\",CELL(\"filename\",A1))+1,255)","v":"Input | Comms, IT, Other"}]
[]
[]
[]
[{"$f":"LEFT('Input | Meters Vols & Costs'!B144,1)+1&\". Comms Setup\"","v":"7. Comms Setup"}]
[]
[null,"a","Define equipment types and actions / drivers of volumes and unit costs"]
[]
[null,null,null,null,"Equipment Type"]
{"$rows_left_out":253}
{"sheet":"Calculations >","index":13,"n_rows":1,"n_cols":1,"rows_kept":1,"cut":false,"hidden":false,"merged":[]}
["w"]

{"sheet":"Calc | Capex Meters","index":14,"n_rows":164,"n_cols":24,"rows_kept":164,"cut":false,"hidden":false,"merged":[[30,4,30,21],[10,4,10,21],[71,4,71,21],[51,4,51,21]]}
[null,{"$f":"'Input|General'!B1&\" v\"&'Input|General'!$D$2","v":"AER Metering Opex & Capex Forecasting Model  v1.08"}]
[null,{"$f":"MID(CELL(\"filename\",A1),FIND(\"]\",CELL(\"filename\",A1))+1,255)","v":"Calc | Capex Meters"}]
[]
[{"$f":"PRODUCT(X48:X49,X89:X90,X110,X151,X163)","v":1},null,"Sheet Check"]
[null,"Summary: Yearly Meter Costs"]
[]
[]
[null,null,"a","Meter Costs by Labour/Non-Labour"]
[]
[null,null,null,"i","Meters - Labour Component"]
{"$rows_left_out":155}
{"sheet":"Calc | Meters Detail","index":15,"n_rows":662,"n_cols":22,"rows_kept":662,"cut":false,"hidden":false,"merged":[[5,0,5,10]]}
[null,{"$f":"'Input|General'!B1&\" v\"&'Input|General'!$D$2","v":"AER Metering Opex & Capex Forecasting Model  v1.08"}]
[null,{"$f":"MID(CELL(\"filename\",A1),FIND(\"]\",CELL(\"filename\",A1))+1,255)","v":"Calc | Meters Detail"}]
[]
[]
[]
["Extra: Detailed Cost Tables - including real price escalation"]
[]
[null,null,null,null,null,null,null,null,null,null,null,null,null,null,1,2,3,4,5,6,7]
[null,"a","Labour Costs"]
[null,null,null,1,{"$f":"'Input | Meters Vols & Costs'!$G$29","v":"New Meter Installations - Growth"}]
{"$rows_left_out":653}
{"sheet":"Calc | Capex Comm, IT, Other","index":16,"n_rows":191,"n_cols":17,"rows_kept":191,"cut":false,"hidden":false,"merged":[[6,0,6,9]]}
[null,{"$f":"'Input|General'!B1&\" v\"&'Input|General'!$D$2","v":"AER Metering Opex & Capex Forecasting Model  v1.08"}]
[null,{"$f":"MID(CELL(\"filename\",A1),FIND(\"]\",CELL(\"filename\",A1))+1,255)","v":"Calc | Capex Comm, IT, Other"}]
[]
[]
[]
[]
["CALC | Comms"]
[]
[]
[null,"a","Equipment cost"]
{"$rows_left_out":182}
{"sheet":"Outputs","index":17,"n_rows":0,"n_cols":0,"rows_kept":0,"cut":false,"hidden":false,"merged":[]}

{"sheet":"Output | PTRM","index":18,"n_rows":59,"n_cols":14,"rows_kept":59,"cut":false,"hidden":false,"merged":[]}
[null,{"$f":"'Input|General'!B1&\" v\"&'Input|General'!$D$2","v":"AER Metering Opex & Capex Forecasting Model  v1.08"}]
[null,{"$f":"MID(CELL(\"filename\",A1),FIND(\"]\",CELL(\"filename\",A1))+1,255)","v":"Output | PTRM"}]
[]
[]
[]
[]
[null,"Forecast Capex"]
[]
[null,"Gross capital expenditure"]
[null,null,null,"Units","Output Basis",null,{"$f":"(LEFT(H10,4)-1&IF(MID(H10,5,1)=\"\",\"\",\"-\"&TEXT(MOD(MID(H10,6,2)-1,100),\"00\")))","v":"2024-25"},{"$f":"(LEFT(I10,4)-1&IF(MID(I10,5,1)=\"\",\"\",\"-\"&TEXT(MOD(MID(I10,6,2)-1,100),\"00\")))","v":"2025-26"},{"$f":"FPFirstYear","v":"2026-27"},{"$f":"(LEFT(I10,4)+1&IF(MID(I10,5,1)=\"\",\"\",\"-\"&TEXT(MOD(MID(I10,6,2)+1,100),\"00\")))","v":"2027-28"},{"$f":"(LEFT(J10,4)+1&IF(MID(J10,5,1)=\"\",\"\",\"-\"&TEXT(MOD(MID(J10,6,2)+1,100),\"00\")))","v":"2028-29"},"2029-30","2030-31","Total"]
{"$rows_left_out":50}
{"sheet":"Output | RFM","index":19,"n_rows":51,"n_cols":14,"rows_kept":51,"cut":false,"hidden":false,"merged":[]}
[null,{"$f":"'Input|General'!B1&\" v\"&'Input|General'!$D$2","v":"AER Metering Opex & Capex Forecasting Model  v1.08"}]
[null,{"$f":"MID(CELL(\"filename\",A1),FIND(\"]\",CELL(\"filename\",A1))+1,255)","v":"Output | RFM"}]
[]
[]
[]
[]
[null,"Forecast Capex"]
[]
[null,"Gross capital expenditure"]
[null,null,null,"Units","Output Basis",null,{"$f":"(LEFT(H10,4)-1&IF(MID(H10,5,1)=\"\",\"\",\"-\"&TEXT(MOD(MID(H10,6,2)-1,100),\"00\")))","v":"2024-25"},{"$f":"(LEFT(I10,4)-1&IF(MID(I10,5,1)=\"\",\"\",\"-\"&TEXT(MOD(MID(I10,6,2)-1,100),\"00\")))","v":"2025-26"},{"$f":"FPFirstYear","v":"2026-27"},{"$f":"(LEFT(I10,4)+1&IF(MID(I10,5,1)=\"\",\"\",\"-\"&TEXT(MOD(MID(I10,6,2)+1,100),\"00\")))","v":"2027-28"},{"$f":"(LEFT(J10,4)+1&IF(MID(J10,5,1)=\"\",\"\",\"-\"&TEXT(MOD(MID(J10,6,2)+1,100),\"00\")))","v":"2028-29"},"2029-30","2030-31","Total"]
{"$rows_left_out":42}
{"sheet":"Lookup|Tables","index":20,"n_rows":142,"n_cols":9,"rows_kept":142,"cut":false,"hidden":false,"merged":[]}
[]
[]
[]
[]
[]
[]
[null,"Unit Denominations"]
[]
[null,null,{"$f":"B7","v":"Unit Denominations"},"Source",null,null,"Ref"]
[null,null,"Dollars","AER",null,null,"$dollars"]
{"$rows_left_out":132}