{"text_format":"1","workbook":"xlsx","n_sheets":21,"sheets":["AER Change Log","Title Page","Change Log","Input|General","Input| Historical Inflation","Input| Prices","Input| Historical Capex","Opex Specific >","Input | Meter-Opex BST","Calc | Opex","Capex Specific >","Input | Meters Vols & Costs","Input | Comms, IT, Other","Calculations >","Calc | Capex Meters","Calc | Meters Detail","Calc | Capex Comm, IT, Other","Outputs","Output | PTRM","Output | RFM","Lookup|Tables"],"not_rendered":{"charts":0,"images":1,"macros":1,"external_links":0,"defined_names":3632,"comments":0,"pivot_tables":0},"unopened":[],"bounds":{"document_bytes":16777216,"sheet_cells":100000,"rows_first":2000,"rows_last":500,"rows_between":2000,"halvings":0,"cell_chars":16384,"cell_head_chars":4096},"cells_cut":0,"cells_raw":0,"read":"whole","date_system":"1900"}

{"sheet":"AER Change Log","index":0,"n_rows":43,"n_cols":4,"rows_kept":43,"cut":false,"hidden":false,"merged":[]}
[null,"AER Draft Decision Change Log"]
[]
[null,"changes in the spreadsheet are also highlighted in green"]
[]
[null,"Tab","Cells","Description of change"]
[null,"Input|General","J9","Changed state to draft decision"]
[null,"Input| Historiacal Inflation","I52:I54","Updated historical CPI"]
[null,"Input| Prices","K21","Removed forecast inflation as replaced by historical CPI"]
[null,null,"L21","Updated forecast inflation for August 2025 RBA Statement on Monetary Policy"]
[null,null,"M21","Updated forecast inflation for draft decision position"]
{"$rows_left_out":34}
{"sheet":"Title Page","index":1,"n_rows":30,"n_cols":8,"rows_kept":30,"cut":false,"hidden":false,"merged":[[9,1,9,2],[35,4,35,7],[5,1,6,8],[36,4,36,7],[34,4,34,7],[33,4,33,7],[32,4,32,7],[31,4,31,7]]}
[]
[]
[]
[]
[]
[null,"Final Standardised Metering Capex and Opex Model"]
[]
[]
[null,"Version ",null,1.08]
[null,"Date",null,44589]
{"$rows_left_out":21}
{"sheet":"Change Log","index":2,"n_rows":61,"n_cols":8,"rows_kept":61,"cut":false,"hidden":false,"merged":[]}
[null,"AMI Expenditure Model"]
[null,"Change Log"]
[]
[null,"Model change log"]
[]
[null,null,"Starting model name ---->","AER – Metering expenditure model – Draft decision – Jemena distribution determination 2026–31 – September 2025"]
[]
[null,null,"Model changes to above model"]
[]
[null,null,"Model sheet","Reference","Cell reference","Type","Legend","Comments"]
{"$rows_left_out":52}
{"sheet":"Input|General","index":3,"n_rows":47,"n_cols":22,"rows_kept":47,"cut":false,"hidden":false,"merged":[[1,1,1,2],[1,11,1,12],[1,13,1,14],[1,15,1,16],[1,9,1,10]]}
[null,"AER Metering Opex & Capex Forecasting Model "]
[null,"Ver:",null,1.08,null,null,null,"Key:","Input","External Link",null,"Internal Link",null,"JEN - RP",null,"AER Addition"]
[null,{"$f":"MID(CELL(\"filename\",A1),FIND(\"]\",CELL(\"filename\",A1))+1,255)","v":"Input|General"}]
[]
[null,"Input | General inputs"]
[]
[null,null,null,null,"Inputs",null,"Source",null,null,"Value",null,null,null,"Note"]
[null,null,null,null,"NSP name",null,"NSP",null,null,"JEN",null,null,null,null,null,null,null,null,null,null,null,{"$f":"IF(ISBLANK($J8),1,0)","v":0}]
[null,null,null,null,"Decision stage",null,"NSP",null,null,"final",null,null,null,null,null,null,null,null,null,null,null,{"$f":"IF(ISBLANK($J9),1,0)","v":0}]
[]
{"$rows_left_out":38}
{"sheet":"Input| Historical Inflation","index":4,"n_rows":75,"n_cols":16,"rows_kept":75,"cut":false,"hidden":false,"merged":[[6,3,7,4],[1,9,1,10],[1,11,1,12],[1,13,1,14],[1,15,1,16]]}
[null,{"$f":"'Input|General'!B1&\" v\"&'Input|General'!$D$2","v":"AER Metering Opex & Capex Forecasting Model  v1.08"}]
[null,{"$f":"MID(CELL(\"filename\",B2),FIND(\"]\",CELL(\"filename\",B2))+1,255)","v":"Input| Historical Inflation"},null,null,null,null,null,"Key:","Input","External Link",null,"Internal Link",null,"JEN - RP",null,"AER Addition"]
[]
[]
[null,"Input | General inputs"]
[]
[null,null,null,"Added Calc",null,null,"Index value, new base","Percentage Change from Corresponding Quarter of Previous Year","Index value, new base","Percentage Change from Corresponding Quarter of Previous Year"]
[null,null,null,null,null,"Source","ABS","Calculated","ABS","Calculated"]
[null,null,null,"Year","Month","Unit","index","Percent","index2","Percent3"]
[null,null,null,{"$f":"YEAR(F10)","v":2014},{"$f":"MONTH(F10)","v":6},"2014-06-30",null,null,105.9]
{"$rows_left_out":66}
{"sheet":"Input| Prices","index":5,"n_rows":59,"n_cols":17,"rows_kept":59,"cut":false,"hidden":false,"merged":[[5,3,5,11],[11,3,11,18],[13,12,13,16],[18,12,18,16],[1,9,1,10],[1,11,1,12],[1,13,1,14],[1,15,1,16]]}
[null,{"$f":"'Input|General'!B1&\" v\"&'Input|General'!$D$2","v":"AER Metering Opex & Capex Forecasting Model  v1.08"}]
[null,{"$f":"MID(CELL(\"filename\",A1),FIND(\"]\",CELL(\"filename\",A1))+1,255)","v":"Input| Prices"},null,null,null,null,null,"Key:","Input","External Link",null,"Internal Link",null,"JEN - RP",null,"AER Addition"]
[]
[{"$f":"IF(SUM(A6:A68)<>0,1,0)","v":0}]
[]
[null,null,null,"6. Inflation table setup"]
[]
[null,null,null,"First year of forecast regulatory control period",null,null,null,null,null,{"$f":"FPFirstYear","v":"2026-27"}]
[null,null,null,"Year End",null,null,null,null,null,{"$f":"'Input|General'!J14","v":"2000-06-01"}]
[null,null,null,"Notation Adjustment",null,null,null,null,null,{"$f":"IF(MID(PPFirstYear,5,1)=\"\",0,1)","v":1}]
{"$rows_left_out":50}
{"sheet":"Input| Historical Capex","index":6,"n_rows":67,"n_cols":16,"rows_kept":67,"cut":false,"hidden":false,"merged":[[1,9,1,10],[1,11,1,12],[1,13,1,14],[1,15,1,16],[56,1,56,10],[4,1,4,10],[10,1,10,10],[32,1,32,10],[38,1,38,10],[50,1,50,10],[22,1,22,10]]}
[null,{"$f":"'Input|General'!B1&\" v\"&'Input|General'!$D$2","v":"AER Metering Opex & Capex Forecasting Model  v1.08"}]
[null,{"$f":"MID(CELL(\"filename\",A1),FIND(\"]\",CELL(\"filename\",A1))+1,255)","v":"Input| Historical Capex"},null,null,null,"Jemena added sheet",null,"Key:","Input","External Link",null,"Internal Link",null,"JEN - RP",null,"AER Addition"]
[]
[]
[null,"Historical Gross Capex (including Type 1 Contributions, excluding Type 2 Contributions) - by service"]
[]
[null,"Summary - by service","Source","Unit","Basis","Timing",null,"CY20","HY21","2021-22","2022-23","2023-24","2024-25","2025-26"]
[]
[null,"ACS Metering","JEN","$dollars","Nominal","mid-year",null,2514853.64,1655410.2400000005,4789956.7,3375277.47,3711051.5700000003,1611132.3199999996]
[]
{"$rows_left_out":58}
{"sheet":"Opex Specific >","index":7,"n_rows":0,"n_cols":0,"rows_kept":0,"cut":false,"hidden":false,"merged":[]}

{"sheet":"Input | Meter-Opex BST","index":8,"n_rows":46,"n_cols":23,"rows_kept":46,"cut":false,"hidden":false,"merged":[[3,17,3,21],[1,9,1,10],[1,11,1,12],[1,13,1,14],[1,15,1,16]]}
[null,{"$f":"'Input|General'!B1&\" v\"&'Input|General'!$D$2","v":"AER Metering Opex & Capex Forecasting Model  v1.08"}]
[null,{"$f":"MID(CELL(\"filename\",A1),FIND(\"]\",CELL(\"filename\",A1))+1,255)","v":"Input | Meter-Opex BST"},null,null,null,null,null,"Key:","Input","External Link",null,"Internal Link",null,"JEN - RP",null,"AER Addition"]
[]
[null,null,null,null,null,null,null,null,null,null,null,null,null,{"$f":"IF(N5=Opex_BaseYear,\"Base Year\",\"\")","v":""},{"$f":"IF(O5=Opex_BaseYear,\"Base Year\",\"\")","v":""},{"$f":"IF(P5=Opex_BaseYear,\"Base Year\",\"\")","v":"Base Year"},{"$f":"IF(Q5=Opex_BaseYear,\"Base Year\",\"\")","v":""},"Forecast RP"]
[{"$f":"IF(SUM(A7:A47)<>0,1,0)","v":0},null,null,null,null,null,null,null,null,"Value",null,{"$f":"IF(MONTH('Input|General'!$J$14)=6,LEFT(M5,4)-1&\"-\"&TEXT(MOD(MID(M5,6,2)-1,100),\"00\"),M5-1)","v":"2020-21"},{"$f":"IF(MONTH('Input|General'!$J$14)=6,LEFT(N5,4)-1&\"-\"&TEXT(MOD(MID(N5,6,2)-1,100),\"00\"),N5-1)","v":"2021-22"},{"$f":"IF(MONTH('Input|General'!$J$14)=6,LEFT(O5,4)-1&\"-\"&TEXT(MOD(MID(O5,6,2)-1,100),\"00\"),O5-1)","v":"2022-23"},{"$f":"IF(MONTH('Input|General'!$J$14)=6,LEFT(P5,4)-1&\"-\"&TEXT(MOD(MID(P5,6,2)-1,100),\"00\"),P5-1)","v":"2023-24"},{"$f":"IF(MONTH('Input|General'!$J$14)=6,LEFT(Q5,4)-1&\"-\"&TEXT(MOD(MID(Q5,6,2)-1,100),\"00\"),Q5-1)","v":"2024-25"},{"$f":"IF(MONTH('Input|General'!$J$14)=6,LEFT(R5,4)-1&\"-\"&TEXT(MOD(MID(R5,6,2)-1,100),\"00\"),R5-1)","v":"2025-26"},{"$f":"FPFirstYear","v":"2026-27"},{"$f":"IF(MONTH('Input|General'!$J$14)=6,LEFT(R5,4)+1&\"-\"&TEXT(MOD(MID(R5,6,2)+1,100),\"00\"),R5+1)","v":"2027-28"},{"$f":"IF(MONTH('Input|General'!$J$14)=6,LEFT(S5,4)+1&\"-\"&TEXT(MOD(MID(S5,6,2)+1,100),\"00\"),S5+1)","v":"2028-29"},{"$f":"IF(MONTH('Input|General'!$J$14)=6,LEFT(T5,4)+1&\"-\"&TEXT(MOD(MID(T5,6,2)+1,100),\"00\"),T5+1)","v":"2029-30"},{"$f":"IF(MONTH('Input|General'!$J$14)=6,LEFT(U5,4)+1&\"-\"&TEXT(MOD(MID(U5,6,2)+1,100),\"00\"),U5+1)","v":"2030-31"}]
[]
[null,null,"Base"]
[null,null,null,"Historical Opex"]
[null,null,null,null,null,"Total opex","$millions",{"$f":"Basis_OpexHist","v":"nominal"},null,null,null,7.7774729300000001,7.9086454200000018,7.9845081399999991,10.331451369999998,10.36148060326531,null,null,null,null,null,null,"Actuals - Annual RIN for each year and/or reset RIN."]
[]
{"$rows_left_out":37}
{"sheet":"Calc | Opex","index":9,"n_rows":53,"n_cols":22,"rows_kept":53,"cut":false,"hidden":false,"merged":[[46,1,54,1],[1,9,1,10],[1,11,1,12],[1,13,1,14],[1,15,1,16]]}
[null,{"$f":"'Input|General'!B1&\" v\"&'Input|General'!$D$2","v":"AER Metering Opex & Capex Forecasting Model  v1.08"}]
[null,{"$f":"MID(CELL(\"filename\",A1),FIND(\"]\",CELL(\"filename\",A1))+1,255)","v":"Calc | Opex"},null,null,null,null,null,"Key:","Input","External Link",null,"Internal Link",null,"JEN - RP",null,"AER Addition"]
[]
[null,null,null,null,null,null,null,null,null,"Value",null,{"$f":"IF(MONTH('Input|General'!$J$14)=6,LEFT(M4,4)-1&\"-\"&TEXT(MOD(MID(M4,6,2)-1,100),\"00\"),M4-1)","v":"2020-21"},{"$f":"IF(MONTH('Input|General'!$J$14)=6,LEFT(N4,4)-1&\"-\"&TEXT(MOD(MID(N4,6,2)-1,100),\"00\"),N4-1)","v":"2021-22"},{"$f":"IF(MONTH('Input|General'!$J$14)=6,LEFT(O4,4)-1&\"-\"&TEXT(MOD(MID(O4,6,2)-1,100),\"00\"),O4-1)","v":"2022-23"},{"$f":"IF(MONTH('Input|General'!$J$14)=6,LEFT(P4,4)-1&\"-\"&TEXT(MOD(MID(P4,6,2)-1,100),\"00\"),P4-1)","v":"2023-24"},{"$f":"IF(MONTH('Input|General'!$J$14)=6,LEFT(Q4,4)-1&\"-\"&TEXT(MOD(MID(Q4,6,2)-1,100),\"00\"),Q4-1)","v":"2024-25"},{"$f":"IF(MONTH('Input|General'!$J$14)=6,LEFT(R4,4)-1&\"-\"&TEXT(MOD(MID(R4,6,2)-1,100),\"00\"),R4-1)","v":"2025-26"},{"$f":"FPFirstYear","v":"2026-27"},{"$f":"IF(MONTH('Input|General'!$J$14)=6,LEFT(R4,4)+1&\"-\"&TEXT(MOD(MID(R4,6,2)+1,100),\"00\"),R4+1)","v":"2027-28"},{"$f":"IF(MONTH('Input|General'!$J$14)=6,LEFT(S4,4)+1&\"-\"&TEXT(MOD(MID(S4,6,2)+1,100),\"00\"),S4+1)","v":"2028-29"},{"$f":"IF(MONTH('Input|General'!$J$14)=6,LEFT(T4,4)+1&\"-\"&TEXT(MOD(MID(T4,6,2)+1,100),\"00\"),T4+1)","v":"2029-30"},{"$f":"IF(MONTH('Input|General'!$J$14)=6,LEFT(U4,4)+1&\"-\"&TEXT(MOD(MID(U4,6,2)+1,100),\"00\"),U4+1)","v":"2030-31"}]
[]
[null,"Calcs"]
[]
[null,null,null,null,null,null,null,null,null,"Value",null,{"$f":"L4","v":"2020-21"},{"$f":"M4","v":"2021-22"},"2022-23","2023-24","2024-25","2025-26","2026-27","2027-28","2028-29","2029-30","2030-31"]
[]
[null,null,"Base"]
{"$rows_left_out":44}
{"sheet":"Capex Specific >","index":10,"n_rows":0,"n_cols":0,"rows_kept":0,"cut":false,"hidden":false,"merged":[]}

{"sheet":"Input | Meters Vols & Costs","index":11,"n_rows":448,"n_cols":31,"rows_kept":448,"cut":false,"hidden":false,"merged":[[1,9,1,10],[1,11,1,12],[1,13,1,14],[1,15,1,16],[24,1,24,11],[368,0,427,0],[143,1,143,11],[4,1,4,11],[40,1,40,11],[169,16,169,20],[52,6,53,8],[70,1,70,11],[119,1,119,11],[120,0,139,0]]}
[null,{"$f":"'Input|General'!B1&\" v\"&'Input|General'!$D$2","v":"AER Metering Opex & Capex Forecasting Model  v1.08"}]
[null,{"$f":"MID(CELL(\"filename\",A1),FIND(\"]\",CELL(\"filename\",A1))+1,255)","v":"Input | Meters Vols & Costs"},null,null,null,null,null,"Key:","Input","External Link",null,"Internal Link",null,"JEN - RP",null,"AER Addition"]
[]
[{"$f":"PRODUCT($A$5:$A$452)","v":1}]
[null,"1. Meter Types"]
[]
[]
[null,null,null,null,null,"Meter Type","RIN Subcategory 1","RIN Subcategory 2","AER Type","RIN Subcategory 3","Meter Code"]
[null,null,null,null,null,"AMI - Single Phase, single element","Single Phase Meter Population","Direct Connect Meter Population","Meter Type 4","Single phase single element - AMI","AMI 1ph 1e"]
[null,null,null,null,null,"AMI - Single Phase, two elements with 31.5A load control","Single Phase Meter Population","Direct Connect Meter Population","Meter Type 4","Single phase two element with contactor - AMI","AMI 1ph 2e"]
{"$rows_left_out":439}
{"sheet":"Input | Comms, IT, Other","index":12,"n_rows":262,"n_cols":18,"rows_kept":262,"cut":false,"hidden":false,"merged":[[68,4,68,5],[1,9,1,10],[1,11,1,12],[1,13,1,14],[1,15,1,16],[199,12,199,16],[222,12,222,16],[245,12,245,16],[174,12,174,16],[5,0,5,11],[38,0,38,11],[152,0,152,11],[172,0,172,11],[80,12,80,16],[107,12,107,16],[121,12,121,16],[41,6,41,11],[42,6,42,8],[95,4,95,5],[81,4,81,5],[42,9,42,11]]}
[null,{"$f":"'Input|General'!B1&\" v\"&'Input|General'!$D$2","v":"AER Metering Opex & Capex Forecasting Model  v1.08"}]
[null,{"$f":"MID(CELL(\"filename\",A1),FIND(\"]\",CELL(\"filename\",A1))+1,255)","v":"Input | Comms, IT, Other"},null,null,null,null,null,"Key:","Input","External Link",null,"Internal Link",null,"JEN - RP",null,"AER Addition"]
[]
[]
[]
[{"$f":"LEFT('Input | Meters Vols & Costs'!B144,1)+1&\". Comms Setup\"","v":"7. Comms Setup"}]
[]
[null,"a","Define equipment types and actions / drivers of volumes and unit costs"]
[]
[null,null,null,null,"Equipment Type"]
{"$rows_left_out":253}
{"sheet":"Calculations >","index":13,"n_rows":0,"n_cols":0,"rows_kept":0,"cut":false,"hidden":false,"merged":[]}

{"sheet":"Calc | Capex Meters","index":14,"n_rows":164,"n_cols":24,"rows_kept":164,"cut":false,"hidden":false,"merged":[[30,4,30,21],[10,4,10,21],[71,4,71,21],[51,4,51,21],[1,9,1,10],[1,11,1,12],[1,13,1,14],[1,15,1,16]]}
[null,{"$f":"'Input|General'!B1&\" v\"&'Input|General'!$D$2","v":"AER Metering Opex & Capex Forecasting Model  v1.08"}]
[null,{"$f":"MID(CELL(\"filename\",A1),FIND(\"]\",CELL(\"filename\",A1))+1,255)","v":"Calc | Capex Meters"},null,null,null,"Jemena modification",null,"Key:","Input","External Link",null,"Internal Link",null,"JEN - RP",null,"AER Addition"]
[]
[{"$f":"IF(SUM(X11:X164)<>0,1,0)","v":0},null,"Sheet Check"]
[null,"Summary: Yearly Meter Costs"]
[]
[]
[null,null,"a","Meter Costs by Labour/Non-Labour"]
[]
[null,null,null,"i","Meters - Labour Component"]
{"$rows_left_out":155}
{"sheet":"Calc | Meters Detail","index":15,"n_rows":662,"n_cols":22,"rows_kept":662,"cut":false,"hidden":false,"merged":[[5,0,5,10],[1,9,1,10],[1,11,1,12],[1,13,1,14],[1,15,1,16]]}
[null,{"$f":"'Input|General'!B1&\" v\"&'Input|General'!$D$2","v":"AER Metering Opex & Capex Forecasting Model  v1.08"}]
[null,{"$f":"MID(CELL(\"filename\",A1),FIND(\"]\",CELL(\"filename\",A1))+1,255)","v":"Calc | Meters Detail"},null,null,null,null,null,"Key:","Input","External Link",null,"Internal Link",null,"JEN - RP",null,"AER Addition"]
[]
[]
[]
["Extra: Detailed Cost Tables - including real price escalation"]
[]
[null,null,null,null,null,null,null,null,null,null,null,null,null,null,1,2,3,4,5,6,7]
[null,"a","Labour Costs"]
[null,null,null,1,{"$f":"'Input | Meters Vols & Costs'!$G$29","v":"New Connections (Permanent + Temporary) - Growth"}]
{"$rows_left_out":653}
{"sheet":"Calc | Capex Comm, IT, Other","index":16,"n_rows":183,"n_cols":17,"rows_kept":183,"cut":false,"hidden":false,"merged":[[6,0,6,9],[1,9,1,10],[1,11,1,12],[1,13,1,14],[1,15,1,16]]}
[null,{"$f":"'Input|General'!B1&\" v\"&'Input|General'!$D$2","v":"AER Metering Opex & Capex Forecasting Model  v1.08"}]
[null,{"$f":"MID(CELL(\"filename\",A1),FIND(\"]\",CELL(\"filename\",A1))+1,255)","v":"Calc | Capex Comm, IT, Other"},null,null,null,null,null,"Key:","Input","External Link",null,"Internal Link",null,"JEN - RP",null,"AER Addition"]
[]
[]
[]
[]
["CALC | Comms"]
[]
[]
[null,"a","Equipment cost"]
{"$rows_left_out":174}
{"sheet":"Outputs","index":17,"n_rows":0,"n_cols":0,"rows_kept":0,"cut":false,"hidden":false,"merged":[]}

{"sheet":"Output | PTRM","index":18,"n_rows":59,"n_cols":12,"rows_kept":59,"cut":false,"hidden":false,"merged":[[1,5,1,6],[1,7,1,8],[1,9,1,10],[1,11,1,12]]}
[null,{"$f":"'Input|General'!B1&\" v\"&'Input|General'!$D$2","v":"AER Metering Opex & Capex Forecasting Model  v1.08"}]
[null,{"$f":"MID(CELL(\"filename\",A1),FIND(\"]\",CELL(\"filename\",A1))+1,255)","v":"Output | PTRM"},null,"Key:","Input","External Link",null,"Internal Link",null,"JEN - RP",null,"AER Addition"]
[]
[]
[]
[]
[null,"Forecast Capex"]
[]
[null,"Gross capital expenditure"]
[null,null,null,"Units","Output Basis",null,{"$f":"FPFirstYear","v":"2026-27"},{"$f":"(LEFT(G10,4)+1&IF(MID(G10,5,1)=\"\",\"\",\"-\"&TEXT(MOD(MID(G10,6,2)+1,100),\"00\")))","v":"2027-28"},{"$f":"(LEFT(H10,4)+1&IF(MID(H10,5,1)=\"\",\"\",\"-\"&TEXT(MOD(MID(H10,6,2)+1,100),\"00\")))","v":"2028-29"},{"$f":"(LEFT(I10,4)+1&IF(MID(I10,5,1)=\"\",\"\",\"-\"&TEXT(MOD(MID(I10,6,2)+1,100),\"00\")))","v":"2029-30"},{"$f":"(LEFT(J10,4)+1&IF(MID(J10,5,1)=\"\",\"\",\"-\"&TEXT(MOD(MID(J10,6,2)+1,100),\"00\")))","v":"2030-31"},"Total"]
{"$rows_left_out":50}
{"sheet":"Output | RFM","index":19,"n_rows":51,"n_cols":12,"rows_kept":51,"cut":false,"hidden":false,"merged":[[1,5,1,6],[1,7,1,8],[1,9,1,10],[1,11,1,12]]}
[null,{"$f":"'Input|General'!B1&\" v\"&'Input|General'!$D$2","v":"AER Metering Opex & Capex Forecasting Model  v1.08"},null,null,null,null,null,null,null,"Jemena modification"]
[null,{"$f":"MID(CELL(\"filename\",A1),FIND(\"]\",CELL(\"filename\",A1))+1,255)","v":"Output | RFM"},null,"Key:","Input","External Link",null,"Internal Link",null,"JEN - RP",null,"AER Addition"]
[]
[]
[]
[]
[null,"Forecast Capex"]
[]
[null,"Gross capital expenditure"]
[null,null,null,"Units","Output Basis",null,{"$f":"PPFirstYear","v":"2021-22"},{"$f":"(LEFT(G10,4)+1&IF(MID(G10,5,1)=\"\",\"\",\"-\"&TEXT(MOD(MID(G10,6,2)+1,100),\"00\")))","v":"2022-23"},{"$f":"(LEFT(H10,4)+1&IF(MID(H10,5,1)=\"\",\"\",\"-\"&TEXT(MOD(MID(H10,6,2)+1,100),\"00\")))","v":"2023-24"},{"$f":"(LEFT(I10,4)+1&IF(MID(I10,5,1)=\"\",\"\",\"-\"&TEXT(MOD(MID(I10,6,2)+1,100),\"00\")))","v":"2024-25"},{"$f":"(LEFT(J10,4)+1&IF(MID(J10,5,1)=\"\",\"\",\"-\"&TEXT(MOD(MID(J10,6,2)+1,100),\"00\")))","v":"2025-26"},"Total"]
{"$rows_left_out":42}
{"sheet":"Lookup|Tables","index":20,"n_rows":142,"n_cols":9,"rows_kept":142,"cut":false,"hidden":false,"merged":[]}
[]
[]
[]
[]
[]
[]
[null,"Unit Denominations"]
[]
[null,null,{"$f":"B7","v":"Unit Denominations"},"Source",null,null,"Ref"]
[null,null,"Dollars","AER",null,null,"$dollars"]
{"$rows_left_out":132}